##TITLE=Analysis number 308190
Compound Code spb 04178
Book Reference 423/26/1
Project Code adrs
Chemist Name bruced
##JCAMPDX= 6.0         $$ Bruker NMR JCAMP-DX V2.0
##DATA TYPE= NMR SPECTRUM
##DATA CLASS= NTUPLES
##ORIGIN= Bruker BioSpin GmbH
##OWNER= NMR
$$ XWIN-NMR		Version 3.5
$$ Fri May 20 12:29:40 2005 GMT Daylight Time (UT+1h)  MAYBRIDGE\NMR@NMR_250MHZ
##.OBSERVE FREQUENCY= 250.131544655141
##.OBSERVE NUCLEUS= ^1H
##.ACQUISITION MODE= SIMULTANEOUS (DQD)
##.ACQUISITION SCHEME= undefined
##.AVERAGES= 16
##.DIGITISER RES= 18
##SPECTROMETER/DATA SYSTEM= dpx250
##.PULSE SEQUENCE= zg30
##.SOLVENT NAME= DMSO
##.SHIFT REFERENCE= (INTERNAL, DMSO, 0, 16.522)
##AUDIT TRAIL= $$ (NUMBER, WHEN, WHO, WHERE, WHAT)
$$ ##TITLE= Audit trail, XWIN-NMR		Version 3.5
$$ ##JCAMPDX= 5.01
$$ ##ORIGIN= Bruker BioSpin GmbH
$$ ##OWNER= NMR
$$ C:\u/data/dgb/nmr/ADRS/3250/pdata/1/auditp.txt
$$ ##AUDIT TRAIL=  $$ (NUMBER, WHEN, WHO, WHERE, WHAT)
(   1,<2005-05-20 12:29:22.85 +100>,<MAYBRIDGE\NMR>,<NMR_250MHZ>,
      <created by zg, POWCHK disabled, PULCHK disabled
       configuration hash MD5:
       62 19 C7 07 E1 42 D1 B7 37 6C 3D D0 77 39 F9 E6
       data hash MD5: 64K
       17 EA 4B FB 56 9D 9F 0A A7 10 AE 71 6D 8E B1 46>)
(   2,<2005-05-20 12:29:34.01 +100>,<MAYBRIDGE\NMR>,<NMR_250MHZ>,
      <Start of raw data processing
       ef LB = 0.3 FT_mod = 6 PKNL = 1 SI = 32K 
       data hash MD5: 32K
       72 8E B9 96 B8 58 16 DA B2 E0 8A 9B CF 7A B7 6B>)
(   3,<2005-05-20 12:29:35.73 +100>,<MAYBRIDGE\NMR>,<NMR_250MHZ>,
      <apk 
       data hash MD5: 32K
       16 E8 22 39 AF E7 AA 27 0D 5E FB C9 3C B7 CE B6>)
(   4,<2005-05-20 12:29:36.38 +100>,<MAYBRIDGE\NMR>,<NMR_250MHZ>,
      <abs ABSG = 5 
       data hash MD5: 32K
       1A 5E A8 CD E7 15 CB 87 03 CD 25 30 44 47 BA 5F>)
$$ ##END=
$$ 
$$ hash MD5
$$ 0B E6 83 83 BD 45 7C E0 78 66 77 82 26 27 2C B0
##$RELAX= 
##$RELAX= 
##$RELAX= 
##$RELAX= 
##$RELAX= 
##$RELAX= 
##$RELAX= 
$$ Bruker specific parameters
$$ --------------------------
##$DU= <C:\u>
##$EXPNO= 3250
##$NAME= <ADRS>
##$PROCNO= 1
##$TYPE= <nmr>
##$USER= <dgb>
##$AMP= (0..31)
100 100 100 100 100 100 100 100 100 100 100 100 100 100 100 100 100 100 
100 100 100 100 100 100 100 100 100 100 100 100 100 100 
##$AQSEQ= 0
##$AQ_mod= 3
##$AUNM= <au_zg>
##$AUTOPOS= <34 >
##$BF1= 250.13
##$BF2= 250.13
##$BF3= 250.13
##$BF4= 250.13
##$BF5= 500.13
##$BF6= 500.13
##$BF7= 500.13
##$BF8= 500.13
##$BYTORDA= 1
##$CFDGTYP= 0
##$CFRGTYP= 5
##$CHEMSTR= <none>
##$CNST= (0..31)
1 1 145 1 1 1 1 1 1 1 1 1 1 1 1 1 1 1 1 1 1 1 1 1 1 1 1 1 1 1 1 1 
##$CPDPRG= <>
##$CPDPRG1= <>
##$CPDPRG2= <>
##$CPDPRG3= <>
##$CPDPRG4= <mlev>
##$CPDPRG5= <mlev>
##$CPDPRG6= <mlev>
##$CPDPRG7= <mlev>
##$CPDPRG8= <mlev>
##$CPDPRGB= <>
##$CPDPRGT= <>
##$D= (0..31)
0 1 0 0 0 0 0 0 0 0.06 0 0 0 0 0 0 0.0002 0 0 0 0 0 0 0 0 0 0 0 0 0 0 
0 
##$DATE= 1116588562
##$DBL= (0..7)
120 120 120 120 120 120 120 120 
##$DBP= (0..7)
150 150 150 150 150 150 150 150 
##$DBP07= 0
##$DBPNAM0= <>
##$DBPNAM1= <>
$$ [...]
##$SUBNAM7= <"">
##$SUBNAM8= <"">
##$SUBNAM9= <"">
##$SW= 20.6930455092707
##$SWIBOX= (0..15)
0 0 3 0 0 0 0 0 0 0 0 0 0 0 0 0 
##$SW_h= 5175.983436853
##$TD= 65536
##$TD0= 1
##$TE= 295.16
##$TE2= 300
##$TE3= 300
##$TEG= 300
##$TL= (0..7)
0 120 120 120 120 120 120 120 
##$TP= (0..7)
150 150 150 150 150 150 150 150 
##$TP07= 0
##$TPNAME0= <>
##$TPNAME1= <>
##$TPNAME2= <>
##$TPNAME3= <>
##$TPNAME4= <>
##$TPNAME5= <>
##$TPNAME6= <>
##$TPNAME7= <>
##$TPOAL= (0..7)
0.5 0.5 0.5 0.5 0.5 0.5 0.5 0.5 
##$TPOFFS= (0..7)
0 0 0 0 0 0 0 0 
##$TUNHIN= 0
##$TUNHOUT= 0
##$TUNXOUT= 0
##$USERA1= <user>
##$USERA2= <user>
##$USERA3= <user>
##$USERA4= <user>
##$USERA5= <user>
##$V9= 5
##$VALIST= <valist>
##$VCLIST= <CCCCCCCCCCCCCCC>
##$VD= 0
##$VDLIST= <DDDDDDDDDDDDDDD>
##$VPLIST= <PPPPPPPPPPPPPPP>
##$VTLIST= <TTTTTTTTTTTTTTT>
##$WBST= 1024
##$WBSW= 4
##$XGAIN= (0..3)
0 0 0 0 
##$XL= 0
##$YL= 0
##$YMAX_a= 374377
##$YMIN_a= -328801
##$ZGOPTNS= <>
##$ZL1= 120
##$ZL2= 120
##$ZL3= 120
##$ZL4= 120
##$ABSF1= 16.522
##$ABSF2= -4.171173
##$ABSG= 5
##$ABSL= 3
##$ALPHA= 0
##$AQORDER= 0
##$ASSFAC= 0
##$ASSFACI= 0
##$ASSFACX= 0
##$ASSWID= 0
##$AUNMP= <proc_1d>
##$AZFE= 0.1
##$AZFW= 0.1
##$BCFW= 0
##$BC_mod= 0
##$BYTORDP= 0
##$COROFFS= 0
##$CY= 12.5
##$DATMOD= 1
##$DC= 0
##$DFILT= <>
##$DTYPP= 0
##$F1P= 14.0000005364418
##$F2P= -0.99999901652339
##$FCOR= 0.5
##$FTSIZE= 32768
##$FT_mod= 6
##$GAMMA= 0
##$GB= 0
##$INTBC= 1
##$INTSCL= 1
##$ISEN= 128
##$LB= 0.3
##$LEV0= 0
##$LPBIN= 0
##$MAXI= 10000
##$MC2= 0
##$MEAN= 0
##$ME_mod= 0
##$MI= 0
##$NCOEF= 0
##$NC_proc= -3
##$NLEV= 6
##$NOISF1= 0
##$NOISF2= 0
##$NSP= 0
##$NTH_PI= 0
##$NZP= 0
##$OFFSET= 16.522
##$PC= 1
##$PHC0= -81.12374
##$PHC1= 10.92701
##$PH_mod= 1
##$PKNL= yes
##$PPARMOD= 0
##$PSCAL= 4
##$PSIGN= 0
##$REVERSE= no
##$SF= 250.13
##$SI= 32768
##$SIGF1= 0
##$SIGF2= 0
##$SINO= 400
##$SIOLD= 32768
##$SREGLST= <1H.DMSO>
##$SSB= 0
##$STSI= 32768
##$STSR= 0
##$SW_p= 5175.98343685301
##$SYMM= 0
##$S_DEV= 0
##$TDeff= 65536
##$TDoff= 0
##$TI= <Analysis number 999999
Compound Code 99
Book Reference 9
Project Code 9>
##$TILT= no
##$TM1= 0
##$TM2= 0
##$TOPLEV= 0
##$USERP1= <user>
##$USERP2= <user>
##$USERP3= <user>
##$USERP4= <user>
##$USERP5= <user>
##$WDW= 1
##$XDIM= 32768
##$YMAX_p= 331533748
##$YMIN_p= -279303
$$ End of Bruker specific parameters
$$ ---------------------------------
##NTUPLES= NMR SPECTRUM
##VAR_NAME=  FREQUENCY,     SPECTRUM/REAL,   SPECTRUM/IMAG
##SYMBOL=    X,             R,               I
##VAR_TYPE=  INDEPENDENT,   DEPENDENT,       DEPENDENT
##VAR_FORM=  AFFN,          ASDF,            ASDF
##VAR_DIM=   32768,         32768,           32768
##UNITS=     HZ,            ARBITRARY UNITS, ARBITRARY UNITS
##FACTOR=    0.157963299565203, 1,           1
##FIRST=     4132.6476996994, 0,             0
##LAST=      -1043.33573715361, 0,           0
##MIN=       -1043.33573715361, -279303,     0
##MAX=       4132.6476996994, 331533748,     0
$$ Real data points
##PAGE= N=1
##DATA TABLE= (X++(R..R)), XYDATA
$$ [...]
28268 250440 217327 235550 265684 238423 223471 254292 288019 288528 269609 272701 273806 315934
28256 315934 328384 300253 242114 196163 216905 218703 211537 194706 173229 182339 222764 241940
28244 241940 252270 285719 307163 322488 301930 276837 245131 235581 219630 244813 246909 217721
28232 217721 237126 270119 243517 252602 246458 225462 233064 229282 220682 226823 245805 249132 282221
28219 282221 259884 224847 243250 287765 289169 274300 245577 239678 265800 254440 244964 250520
28207 250520 274049 292378 275194 247080 247200 246672 227652 238781 254301 231472 210546 199224
28195 199224 199734 238017 256743 235856 232323 266369 273053 233972 251317 258308 229334 203227
28183 203227 155895 168003 162841 204022 249204 259369 285706 276529 278479 286138 248593 223249
28171 223249 242033 236779 213358 236819 244117 242901 196457 154574 188698 215122 206683 183330
28159 183330 184168 172884 162105 129724 151063 179006 159501 161795 177848 190560 180570 173936
28147 173936 173693 152624 164037 155755 142396 179531 238554 271918 242002 217368 200259 199331
28135 199331 211684 212910 256394 234073 201075 203857 205870 217658 196999 197886 185684 178088 184973
28122 184973 187166 184227 184366 178035 206041 210901 219679 226108 237991 226497 207847 157147 105394
28109 105394 94467 125274 151483 155476 172360 179551 194538 229557 210016 175192 181030 213401
28097 213401 203862 188629 204811 200556 227871 209332 170335 163541 165894 152337 113583 83812
28085 83812 94568 122933 137810 112189 85911 105325 111974 116316 137037 134125 117361 106513
28073 106513 112495 127035 140138 193386 172251 171813 165338 153920 163854 120977 120261 152645 160009
28060 160009 158294 142572 104221 66331 82843 154388 210577 196049 149914 187513 216597 216245
28048 216245 204608 175979 162804 141499 141478 130835 144844 114948 125845 119039 108538 136286
28036 136286 165302 163946 143650 184306 199900 233623 245307 220264 219055 195542 173006 137205
28024 137205 145678 130812 147405 149938 116291 145513 148909 129799 83347 86400 107577 111745
28012 111745 140614 131341 135874 152280 141658 135189 117591 142944 113359 98304 115390 101663
28000 101663 89270 64810 80005 105073 110910 126450 142821 157129 164088 166902 169648 145864
27988 145864 113426 131638 158886 175874 163096 158167 153711 145961 172158 189163 173006 134410
27976 134410 107615 138186 195254 204132 155854 95050 56641 38847 76838 112674 170916 171334
27964 171334 123934 99458 73401 73965 77519 64384 26413 53017 75979 94515 113107 122841
27952 122841 110437 105326 120717 113956 78401 109975 146533 159310 174665 164230 156641 160065
27940 160065 190799 215032 192315 139975 75281 87317 108536 131270 166448 176472 156827
27929 156827 111505 107200 146426 157934 153651 107667 100678 96053 83672 75390 124962 127867 123611
27916 123611 121628 86127 82159 110192 110067 125075 116444 132511 155704 118658 159697 201992
27904 201992 152203 85230 59250 42945 69422 79441 80319 102884 117649 103986 118749 141020
27892 141020 118752 119448 140072 112210 110684 85943 76605 38918 -2236 7155 7633 32048 89532
27879 89532 64849 58840 43937 67750 89808 76271 88083 118537 114186 100135 91627 108230
27867 108230 139474 141778 120119 98274 38126 6596 10363 55878 59941 65204 75334 69567
27855 69567 76617 71146 60870 36521 51131 76708 63828 111577 129507 101109 101802 110027 106023
27842 106023 121306 149874 165374 112717 99857 116500 135528 146979 91712 41442 70136
27831 70136 126999 93951 58163 90988 90383 79661 62841 69314 77278 73426 120726 154583 151663
27818 151663 105174 100933 85532 53902 32803 37454 101729 103971 101645 101145 94996 107960 88580
27805 88580 84468 96779 138521 135208 93341 64973 61250 79271 77279 77693 91931 50776 60022
27792 60022 41801 40676 53494 97549 97600 108438 135650 86200 104700 113431 90796 88715 108191
27779 108191 116472 96411 69783 36851 35755 21352 40333 94941 103231 99110 102566 124431
27767 124431 140600 145019 123622 140237 169303 137872 138417 145154 123232 71690 69892 41237
27755 41237 17551 6739 35037 76550 97467 107950 74219 65268 84104 95789 144153 107658
27743 107658 76346 60008 73570 80322 65118 45347 83318 103668 102215 92419 101788 117536
27731 117536 133710 134594 132825 119484 111491 127713 90873 61602 39435 11439 13119 16379 57350
27718 57350 55546 47732 11390 19047 29662 53647 86867 74403 77022 53970 26216 23323 49375
27705 49375 80079 74706 59415 72302 49260 39202 33149 56479 69657 58533 65313 70224
27693 70224 85978 65702 52895 53464 86125 106350 120428 133447 145452 144022 130515 144388
27681 144388 177113 186640 149423 122057 65593 38371 29231 72477 110669 85258 80943 90692
27669 90692 56990 39784 92550 132350 147037 126981 133643 112111 66544 24687 25919 10196
27657 10196 4389 7049 26782 40056 39658 52922 43833 55868 86906 106125 104530 79061 54292
27644 54292 52366 82142 91482 62249 72499 82125 72099 67768 98544 95172 66678 6322 10261
27631 10261 67119 91716 91237 96292 81668 89898 108060 96989 100339 119487 111585 71659 12776
27618 12776 22456 27829 27385 35478 48888 49277 17105 -22631 -30003 -11927 -12685 -10401 -41308 -26854
27604 -26854 -4827 777 31327 36903 57009 52236 39599 31060 37211 6545 33820 77100 100223
27591 100223 85460 44491 2103 -19159 3976 40727 36377 40692 34757 34647 20229 22919 46516
27578 46516 62058 54263 54849 50112 49356 75510 75246 59899 31922 45723 10736 26639 90651
27565 90651 84788 61660 66906 55248 83352 107717 130382 110489 59479 45127 42683 21679
27553 21679 39865 90872 95114 94443 119135 152132 105016 88825 83984 91733 81947 62732 70926
27540 70926 52905 27274 73126 106045 110891 63130 13353 13925 37238 55136 49524 37172
27528 37172 55786 52343 63102 67244 69944 58859 35250 34801 34473 22973 45686 55982 55364
27515 55364 54099 40681 36747 19059 36832 69131 67576 53016 30252 40904 52611 71390
27503 71390 88242 71079 75432 87973 69186 33519 7122 -17796 5655 21605 73367 80080
27491 80080 51884 42585 25625 11186 19375 64412 43165 36911 35229 23735 68651 80083
27479 80083 46319 47062 70010 121511 146725 116836 105215 88387 43407 20185 -3014 -8794
27467 -8794 -22363 -1710 35353 99000 93873 47069 17891 17694 35523 40908 38789 77566 72352
27454 72352 48110 62268 59256 -4223 -52557 -74739 -94892 -39726 28009 51419 94473 101723
27442 101723 59938 57862 90810 110453 84658 55477 20186 5576 8481 16152 45283 50559
27430 50559 77712 56976 27101 32682 34897 16407 23913 28952 36917 -3573 -30222 -6918 48096
27417 48096 73953 109051 138603 114987 79972 77764 98873 99996 83926 52976 31879 39493
27405 39493 8155 -12893 -332 14362 70009 99392 84149 74344 76357 48596 15455 16745
27393 16745 17211 19266 43209 23220 46331 78364 66569 49334 36582 25192 68236 86880
27381 86880 50938 70208 66073 65081 69032 43911 47767 47038 45274 34002 27684 31109 -6761 -14341
27367 -14341 27729 28552 49380 27360 39050 48762 40773 53442 88110 82412 72989 76403 62973
27354 62973 37544 12747 40794 29230 509 609 3225 21903 58518 88454 98692 110459
27342 110459 63198 73978 69213 95017 94685 78701 74183 48425 79445 31882 15897 43665
27330 43665 69450 70601 61511 76515 99732 101013 98951 79871 43958 31099 39140 33487 44335
27317 44335 36327 50477 54308 52775 24311 -14204 -36258 -57510 -10425 32867 39608 51868
27305 51868 65782 45545 29558 20578 -1853 -9211 -11085 -39113 -50743 -22533 -19993 -9935
27293 -9935 -1394 30752 7773 26610 57203 68048 59472 43678 74258 55230 20542 15617
27281 15617 -3417 -26247 -64107 -49297 -5410 19788 33225 29352 28205 15159 17853 11296
27269 11296 -9357 7112 -2721 -22951 12569 39179 91086 71002 62684 81205 67555 51528
27257 51528 39090 65391 79077 59721 9701 4749 -12676 -11549 -18276 -12024 38654 45900 41167
27244 41167 28761 18171 17841 19525 51617 23657 -8459 -12619 -30311 -37350 -17042 -33747 -34158
27231 -34158 -15717 143 18606 15979 6654 -29220 -49156 -35034 -2756 33546 45073 73367
27219 73367 83087 61781 38972 1684 5278 53156 56861 68029 55984 49789 58449 73266 55422
27206 55422 31522 25680 42285 89102 97040 61664 20991 21670 20333 45535 230 -21905 -10182
27193 -10182 -10478 -20721 -11220 22900 14794 -14203 -34305 -38910 -50290 7203 21824 32786 21449
27180 21449 15742 -14593 8766 38506 34450 -4832 -20736 -57479 -55903 -36706 -43803 -34307 7115
27167 7115 18986 -8947 9459 51933 28717 14789 31645 -2331 -11145 25351 33414 38962
27155 38962 55701 45856 28424 28806 29292 -5543 -26851 -5519 21394 35185 44349 50482 32952
27142 32952 4853 846 31088 17158 2199 -3272 -20101 39197 71240 44343 39037 35165
27130 35165 28028 75820 71463 42264 23221 44117 59352 70536 59736 7410 11657 18463
27118 18463 32385 43613 2247 -36602 -36449 -11088 -20056 21430 38555 56996 76487 93087
27106 93087 86211 41038 12232 15543 56132 47093 45978 67502 70561 46533 14954 6370 25018
27093 25018 26074 43127 42187 13456 14592 29899 42323 5658 -17067 12693 33787 3767
27081 3767 9435 10961 8438 22405 36108 34179 82317 82405 50471 13974 2979 19525 22599
27068 22599 58278 40385 -4230 -22870 -15662 -17005 -16766 -9460 21993 29845 14512 11547 -5828
27055 -5828 -3130 -10817 -14968 7085 16081 51465 40303 18704 -10503 -27048 -29376 -12632 17824
27042 17824 33109 57839 28914 1832 12376 -2856 6264 28445 66196 66173 55198 42903
27030 42903 35181 34439 52859 17185 3636 11906 13920 23307 21666 7621 1390 -1011 -802 -50095
27016 -50095 -43429 1924 2131 15242 9500 -9752 -4345 40133 24650 17899 310 -7616 26952
27003 26952 41108 58109 32203 9231 20315 7695 20243 22238 8057 -2034 18804 91224
26991 91224 77978 37022 2331 44068 45692 48083 64137 77360 69187 76650 62881 31941
26979 31941 10825 43856 50662 46651 53817 31624 5309 12497 4847 -7985 17025 49611 70710
26966 70710 25772 4096 -2850 -16619 -1290 21548 15567 -17888 -7805 -16103 -9742 23601
26954 23601 22352 12202 5540 32592 15348 3532 42798 42314 -20468 -2667 30319 46640
26942 46640 53888 58784 48130 79974 67931 38546 35587 22521 27063 17596 19397 15828 49034
26929 49034 92296 138164 122128 75437 61522 45095 24910 44170 59467 42655 26905 32203
26917 32203 10042 6256 13049 -8957 -11397 -11251 7978 63010 41882 36628 60607 91078 111997
26904 111997 110123 79293 80951 69942 43921 38369 2544 -22448 7120 43331 22874 11507
26892 11507 18819 22441 19185 10002 -47552 -65664 -29895 37318 69537 55000 9669 5422 58280
26879 58280 96066 103713 70725 70552 81506 103089 97596 51305 11682 31205 63220 114765
26867 114765 111051 75101 40376 14773 13140 6186 -3317 -18594 -19564 -12526 -26563 -7417 21398
26854 21398 58131 84437 77596 36745 20498 13065 19841 15779 -6781 -5898 -22148 -25791 -46790
26841 -46790 -39805 -14672 31877 19696 -4911 31223 44085 33541 35031 2596 6778 19757
26829 19757 52418 61268 73077 59600 39811 36512 18880 43628 65480 17422 -1432 -318
26817 -318 23464 33834 33007 -5127 2014 6910 -8875 32417 97859 85910 49294 52290 11388
26804 11388 -23097 -26002 -1410 17837 3351 -6272 -37252 -17013 -5473 -7178 -2487 -17245
26792 -17245 -48336 -39924 -23410 -44145 -59248 -40923 -2239 21703 12381 34124 16069 -7828
26780 -7828 -12434 -42834 -30947 -4529 19403 1023 -12232 -17712 -16887 39115 95895 95875 58117
26767 58117 29791 11773 49328 45975 5908 -7057 -14810 -13495 -13087 3026 -15752 7593 28245
26754 28245 42797 72408 73574 7235 -9488 23479 -23272 -26346 5712 69089 134169 124261
26742 124261 93047 51348 46160 28988 63995 94210 104052 82327 35534 -1612 1184 29146
26730 29146 8997 15017 31484 11016 -20601 1313 8291 -29480 -17828 7609 22644 35163
26718 35163 11448 -35125 -29868 -35337 2243 17302 -14549 -14471 857 -7930 8681 43067 46582
26705 46582 32970 33075 41985 35038 -8929 3942 21391 -20256 -26993 -3063 23148 22896 -12017
26692 -12017 -14740 -1790 6321 2367 -15696 -11781 7008 -1965 -9725 12947 4044 713 30617
26679 30617 6422 -35539 -34912 -25123 -30037 13879 26093 32481 49040 53758 31497 30235 25952
26666 25952 16360 -13143 -36361 -25812 9382 7081 -931 34325 67412 86850 75246 23731
26654 23731 -14836 12640 35700 57561 29903 11426 -356 28969 46501 41646 38530 39117
26642 39117 25577 41296 47639 44358 43959 53017 57823 15975 -41774 -45088 -8036 16995 16567
26629 16567 16273 -2343 -35798 -25233 -6710 8265 14862 13421 -582 -19505 -1640 37544
26617 37544 41706 50636 24009 30955 24849 1220 -6663 3073 20403 -11310 -26799 4278 49741
26604 49741 65727 52124 35335 37896 31706 48527 40651 39623 66598 52926 53270 59676 7538
26591 7538 -6801 6050 36570 24639 -860 21355 17351 15480 40017 51710 26871 -1909
26579 -1909 -48232 -48228 -48606 -57023 -44619 -11897 -11703 -7816 -39360 -1412 25373 5036 -32338 -22654
26565 -22654 53925 113991 90194 78744 51248 8442 -41862 -30448 -21870 -19881 -32057 -60710
26553 -60710 -70651 -45715 -36104 -37737 -15519 -818 -30777 -38842 -18273 22048 -8412 -18396 -8793
26540 -8793 -381 -8192 20839 36783 44962 8356 -14076 2621 12461 15814 7165 30749 26444
26527 26444 2584 -19245 -43428 -26872 25638 57673 21181 -10867 -38671 -41360 -57638 -83114
26515 -83114 -32244 41712 49408 16118 -22191 -27932 -46190 -43854 3729 25539 8459 21830
26503 21830 44923 33999 -21026 -12999 -37171 -40884 -32341 -9130 -7525 27182 11451 31676
26491 31676 42555 7050 -19916 -69602 -55747 -31254 -29994 -8408 13725 42815 46497 49485
26479 49485 64013 61379 34590 26958 30849 11191 -50788 -56537 -10014 9806 35641 31495 10292
26466 10292 16427 14528 40182 14438 29477 -19618 -60802 -49084 -55049 -48669 -19567 -28950 1358
26453 1358 -50736 -68693 -37181 7950 -21828 -44727 -33763 -31096 -3827 35880 39750 55063
26441 55063 54285 -11472 5182 2837 -10042 3794 19815 6107 15573 -18537 -11291 15048 17698
26428 17698 -3510 -6920 42512 45875 -3060 18049 22581 24072 343 -27887 -15987 -16260 -22811
26415 -22811 -2743 -11464 -21781 3113 29544 59012 45411 34447 27258 21654 1872 10488
26403 10488 41095 6992 -33487 -18910 -13145 -50021 -43138 -74632 -67075 -41737 -11533 -5845
26391 -5845 -14436 -59461 -98130 -77238 -19130 -18317 -9940 -10632 9017 28324 25553 27132 30121 43903
26377 43903 75250 15467 -23782 7061 -14568 -27236 -26575 11839 -7876 28097 62359 28704
26365 28704 39467 29536 38134 27075 6844 5532 16146 75319 82642 58326 32344 13567
26353 13567 14619 -11826 4397 29514 22641 2698 3353 2008 -3389 -11147 -68785 -49714 21604
26340 21604 24626 23224 -17134 -23358 -14145 -35096 -37410 -22325 -20461 -21282 -4797 424 -40870
26327 -40870 -31901 -16475 4044 5593 17036 25123 2965 -42824 8492 7843 -3029 24738 22857
26314 22857 13866 33731 -8729 -31715 -1972 29979 35478 32573 25196 26738 6503 -21169 -16204
26301 -16204 -10074 -12975 -5456 -19118 -78117 -92500 -44974 -26156 -31745 -22466 -1279 -25986 -23471
26288 -23471 -1008 9025 37666 15860 -5570 16011 1348 -16442 -14343 -17183 -21066 3859
26276 3859 17395 8483 -15634 -7085 19754 29381 51697 38969 18111 -6464 -21921 -38816
26264 -38816 -35096 -34715 -23205 -33472 -67411 -82570 -58905 -20068 43 -6751 18641 16353 -10994
26251 -10994 3562 46507 67066 46851 26960 2093 19894 41752 51731 -11398 -46418 -28792
26239 -28792 -7030 26979 6271 -7445 7242 -17214 -44902 -78557 -61025 -39764 -15895 -26712
26227 -26712 -57894 -43663 -39815 -58886 -74314 -45883 -24475 1489 8124 25138 21017 47313
26215 47313 34971 51647 54089 35634 10653 -4283 1326 33996 40348 53337 43206 36942
26203 36942 18683 39683 40459 -4919 -6637 -4142 22697 807 7741 64215 44934 -11611 -9119
26190 -9119 1643 16161 -14498 -14108 -5304 29837 28449 9769 -35142 -18662 21794 17465 -12350
26177 -12350 -10730 -17889 -27326 -31960 10256 38492 7826 27065 35279 26453 34489 37527 17567
26164 17567 1574 44356 31956 3046 -9715 24774 32313 -1178 -35449 -34538 3402 56345
26152 56345 71769 90156 72274 72464 50236 52384 66542 1548 -33635 -17270 -3369 -11443
26140 -11443 -65691 -83339 -48841 -53258 -35308 -742 7915 -5887 14392 55730 59115 5182
26128 5182 11509 18686 -7237 2095 -513 -29107 -22538 -18876 -57210 -96319 -84012 -38992 8412
26115 8412 44394 37012 11291 3212 -17344 -25194 -12378 -24983 -34498 -61632 -117478 -104985 -39501
26102 -39501 -4080 32193 81289 101248 52184 -4923 -16365 -28934 -28506 -7810 65786 50282
26090 50282 18352 23536 12259 -6824 -6069 -11039 7041 -6838 -27260 -22481 -22631 -9747 -25047
26077 -25047 15821 13165 -23879 -9699 8840 -9960 13193 9886 10483 -14184 -25509 -34131 -44856
26064 -44856 -35916 -39483 -56004 -10881 -246 -18588 13246 32950 17840 11854 46656 2623
26052 2623 -7974 43370 85745 77286 72782 88608 72060 69465 81545 62862 24627 16102 13744
26039 13744 39508 15699 3679 15133 14533 14541 -15094 12864 7976 -24749 -12549 -4824 -14370
26026 -14370 -32942 -37256 -7816 19889 -22432 -40152 -28522 -22675 6310 47653 52190 14256
26014 14256 -25902 -40009 -27997 -1714 -53388 -92280 -53911 -58838 -88381 -94495 -62234 -19907
26002 -19907 -298 42593 58136 74395 54364 20974 68326 60107 51344 35878 -10282 -18195
25990 -18195 -61 -6640 7942 33604 54247 43636 27280 -22206 -51172 -28587 6554 21826
25978 21826 29685 37937 47214 42708 22747 13025 34976 31348 -14786 19497 32668 -37317 -40932
25965 -40932 -18226 217 18962 29759 24107 47279 29003 -29320 -29418 -54881 -49144 -56462 -56642
25952 -56642 -11799 -4014 -21049 -34622 -29334 15380 2991 1324 27323 -11239 -21406 -38588
25940 -38588 -35873 -10498 -22349 -49987 -43979 -56592 -42512 -25650 -5390 6274 36337 37780
25928 37780 6877 3 8696 31212 19755 -31519 -26336 -933 -10147 -17144 -6535 43427 61637
25915 61637 92979 70205 11368 -49067 -37572 -39125 -20115 -16113 -13895 16076 37074 17748
25903 17748 -24538 -16641 -31377 -23337 7808 25575 23411 30241 21530 7543 7452 31549 7795
25890 7795 -29998 -41620 -46179 -15050 57127 73874 55512 12588 -13191 -23445 -36072 -61402
25878 -61402 -67011 -44488 -19575 26048 30018 13807 -24131 -49931 -38041 -25288 19236 794
25866 794 12587 19049 22303 27216 41877 27428 -10521 -25452 -21984 -45349 3961 33786 34096
25853 34096 2416 -9023 -20852 -48193 -45583 -49877 -53828 -47082 -43189 -61974 -57767 -19385 24373
25840 24373 19433 6660 14740 15098 -50754 -66426 -31720 -22972 -35358 -14660 -7390 -2187 -38837
25827 -38837 -26507 -17753 1227 -13717 -20627 -25813 -10836 -12803 -341 -3891 -13688 -41657 -50081
25814 -50081 -31078 -37398 15519 6713 -25444 -43796 -101983 -95729 -27469 41887 48141 37677
25802 37677 52665 37798 23678 -30443 -58184 -75129 -107042 -96413 -55785 -30062 26618 21359
25790 21359 10126 14573 -6850 -30926 -34094 -6975 -27765 -49992 -42656 -47786 -51667 -16385 -18773
25777 -18773 -51252 -70875 -51247 -30214 -14024 26734 14495 -21082 -42951 -66799 -25423 -178
25765 -178 23032 -6321 -37767 -77653 -77949 -60776 -54398 -41656 -13241 8293 21669 -39638 -71439
25752 -71439 -50952 -58189 -63611 -73459 -77307 -58582 -62750 -40143 -66515 -73078 -68129 -54750 -38984
25739 -38984 -23214 -29613 -27450 -9665 -1578 -4096 3986 32372 27769 618 -11097 -17447 -1539
25726 -1539 20042 -25463 -28045 -6573 841 -11657 -13672 9517 22186 20517 9906 -4763 -48987
25713 -48987 -75411 -65633 -63222 -41469 -26170 -27990 -19975 -13592 -73536 -140586 -140549 -105993 -33495
25700 -33495 -16534 -23619 14305 26004 19231 14992 35154 32412 37564 15916 -40917 1196 21579
25687 21579 8510 5663 -3655 12175 29240 36729 64161 28625 49650 124946 145903 108868
25675 108868 91953 38130 -9816 -41345 -47960 -31700 -35800 -71953 -65554 -9773 24516 -5714
25663 -5714 -8503 7081 -9508 21088 19207 27904 66294 44664 -5035 -29419 -50457 -79054
25651 -79054 -72105 -67587 -28868 7574 5976 -13639 -16684 -38928 -33865 -48330 -55165 -43792 -30313
25638 -30313 -13825 12714 -26185 -69719 -26857 -29267 -70336 -97166 -88360 -7013 42291 41159
25626 41159 8622 -42728 -74200 -71523 -79655 -55350 -20849 8254 16757 5288 -357 34278
25614 34278 -24861 -26996 -21288 -24782 -14477 -22830 -11125 4337 -17668 1805 -23433 -11124
25602 -11124 42770 28580 -22997 -40888 -46393 -30111 -44167 5590 43470 39212 40928 -17520
25590 -17520 -1375 -11120 -5640 -9521 -37848 -103054 -89594 -70795 -57918 -63311 -50055 -57311 -28613
25577 -28613 -58498 -61065 -38786 -28131 -58266 -47605 3288 51920 63516 46439 14894 -12060
25565 -12060 -23958 -13288 -29356 -42744 -57871 -59909 -73756 -19719 28081 22644 18515 19498 -4167
25552 -4167 13672 32341 51582 29703 7625 -12488 -51565 -39673 -22468 2075 12369 36357
25540 36357 60900 41613 13186 -9828 15219 32980 7194 16750 19740 4553 -35407 -47287
25528 -47287 -10556 65224 60019 10835 -35412 -54706 -50354 -21168 -22838 -49028 -41484 19662
25516 19662 19124 1299 -6950 -17131 5803 35742 39580 56775 29199 -15792 -33328 -51127
25504 -51127 -53175 -30822 -35714 -55672 -70522 -79658 -76880 -42602 -22192 -13474 -6633 -38914 -52698
25491 -52698 -81768 -84999 -27850 -56822 -53465 -36836 -29039 -34463 -30174 -59554 -14534 -23552 -16526
25478 -16526 -15278 2546 2599 -4665 -1686 -4919 -28337 -36880 -80617 -74139 -32330 -10609 -6489 15669
25464 15669 8088 -23263 -41479 -19886 -11179 -27404 -57229 -76594 -58368 -43887 -10216 -34202
25452 -34202 -28217 -25722 -2546 -6845 -47471 -70353 -70452 -47087 -31158 -17277 -60174 -59554 -17169
25439 -17169 32220 70990 71867 58168 60017 66146 50586 61037 26134 1667 8247 30 -27726
25426 -27726 -35336 -20816 19763 21074 1634 26982 20976 48885 63961 68193 12945 -20362
25414 -20362 -8725 -8240 -8075 29627 11451 15391 22710 5687 -53843 -5150 29811 46276 27907
25401 27907 -33174 -57838 -72671 -89163 -60837 -78287 -63790 -33207 24956 57532 14451 -9613
25389 -9613 -9705 -9903 -12760 -30022 -71199 -127978 -141456 -70702 -16210 -26026 -22512 1905 23146
25376 23146 -3567 -8932 8268 34149 20168 -22578 -57902 -50596 -58302 -21279 37593 76611
25364 76611 84072 82187 76700 57243 22218 -29992 -26613 -32968 -13910 22822 37422 -22646 -30977
25351 -30977 -595 10096 20157 38554 52426 16416 14895 1826 21403 45429 36199 6966
25339 6966 2497 20679 738 -11972 6585 25112 32646 44315 5820 -731 3045 14089 35858
25326 35858 59072 52111 22562 18843 46680 72919 52386 6977 -8172 27599 34426 5344
25314 5344 1043 10563 -14748 -55845 -62217 -45672 -49258 -4514 8828 -31811 -36381 5107 46813
25301 46813 6573 -73152 -77214 -33267 -10721 30921 11352 -51076 -8662 19727 -18051 -33409
25289 -33409 -4456 -3073 -15926 6062 40920 3701 9498 24644 59834 68504 49125 28073
25277 28073 31001 19857 34302 33388 3107 -16156 -31920 -23777 14647 54809 85447 89061 40203
25264 40203 6464 -22975 -37032 -33227 -16584 13022 21481 -13296 -40934 -13498 47495 48486
25252 48486 8540 -42920 -54727 -33917 -41582 -35804 1292 38856 11035 20322 32424 7462
25240 7462 4977 -28844 -22588 2030 6908 16694 42489 36938 42381 42319 54394 33006 7605 -6412
25226 -6412 2450 12423 23607 -4708 -24941 4065 -9370 -33722 -40899 -27735 -26188 -9371 -589
25213 -589 19210 20843 11917 20265 15500 10095 15542 21222 5912 1391 8527 9400 15768 18571 9567
25198 9567 33438 34657 31549 14361 28137 51136 43500 11993 6595 -21809 -54046 -72669 -62478
25185 -62478 -42735 -50279 -34784 -47695 -15955 -17011 -23741 -1574 -19911 -13914 -6311 2956 35210
25172 35210 37932 45036 51185 2387 -44477 -29846 15036 43321 -4361 -1282 -25754 -39880
25160 -39880 -42691 -16107 12361 -5639 -10977 23065 29770 31509 14406 29629 8999 -6307
25148 -6307 -8507 -25685 5460 746 -8331 -26568 -34389 -5276 26219 43476 26475 27197 44483
25135 44483 33864 15834 25193 18190 -8237 4483 19085 1316 -12213 -19010 3270 26569
25123 26569 20467 22494 42949 37523 63005 39502 38574 36959 21067 -5683 -17001 -6278 -21558
25110 -21558 -83059 -107530 -78566 -75360 -46047 -22392 7437 45683 27755 37030 46212 17924
25098 17924 -49715 -41679 33610 56029 20498 3728 20758 9345 6327 40428 43597 4142
25086 4142 -11142 13617 -833 1964 -6584 6459 46614 39704 60355 48594 49632 70824 68430
25073 68430 76779 46862 27844 -37456 -27421 -315 -10282 -12965 6535 -2039 19671 20383 24498
25060 24498 34821 35988 33070 59730 35592 17772 29346 57910 48539 80819 61355 -19039
25048 -19039 -40882 -8497 -29 -12825 -1374 18338 68193 57170 32182 64486 -1079 -45490
25036 -45490 -67904 -69007 -47126 -32559 -35906 -47901 -17099 -9872 -21447 -29017 41633 45013 14911
25023 14911 17099 -540 9658 -9709 -37788 -17377 -14253 -36554 -16027 -1442 14643 -7033
25011 -7033 -4547 -2330 -26152 -85863 -88834 -73315 -47240 -40456 -30752 -5341 -16313 -32408 -642
24998 -642 28846 10091 -19112 -10993 -47383 -68131 -41983 -25978 -11203 -12889 -27638 -10910
24986 -10910 24981 29628 34979 -26866 -15114 23052 -5299 -51888 -50318 -48231 -43219 -44385 -41983
24973 -41983 -12492 -20242 -5228 -14005 1297 -404 14834 1980 -19313 -49586 -61509 -29345
24961 -29345 -13038 -26702 -40421 -59314 -77096 -52399 -33228 -7126 -20503 -43428 -70972 -37396
24949 -37396 -23133 -22104 16800 34242 33356 14334 10763 -16074 -37132 -2682 35699 25008
24937 25008 29073 36764 24949 7657 -13209 1385 6651 21397 -3542 10873 -15691 -12332
24925 -12332 -7499 25344 37993 59498 61605 44637 34318 -9777 -52478 -43670 -4121 -8299
24913 -8299 -24317 -17397 -17373 -1533 25703 -28062 -48129 -4405 -2550 -25602 9312 37657 27291
24900 27291 -24330 -4594 4584 -36322 -70168 -38678 11558 -17073 -44959 -41917 -12401 -21981
24888 -21981 -12621 11195 27310 33756 711 -16815 -13434 -21404 -40590 -49613 -19740 -7891 -20321
24875 -20321 -63240 -48645 -48935 -26422 -40677 -74746 -67050 -24536 12193 30434 26497 787
24863 787 -43929 -26995 -33521 -43308 -19921 -20825 -77545 -66936 -36376 -18589 -16179 -43596 -47603
24850 -47603 -7821 3965 -11794 9428 43208 20821 -12087 11108 -42467 -46640 4805 25840
24838 25840 2181 5821 23987 20636 23753 43052 37748 31164 50595 25170 -9755 -24786 -42817
24825 -42817 -30639 -8549 15908 32214 36305 74415 94191 72522 42365 61415 42040 33920
24813 33920 12938 -25437 4963 19503 26437 28369 34050 17020 -12212 -36914 -51669 -12365
24801 -12365 -37338 -53569 -52916 -40655 -8568 -22574 -30666 -25178 -45037 -48850 -65191 -46944 -50152
24788 -50152 -45326 -35887 -31726 -41825 -34072 -50517 -35800 -34382 -42287 14039 30779 -3806 -27304
24775 -27304 -56371 -68352 -55946 -53265 -39505 10520 -4889 -29033 -29493 -35640 -26806 -3157 3173
24762 3173 -11775 -16484 703 10995 10631 17876 39920 43566 32173 14117 31371 52446 28336
24749 28336 -9385 -11567 -14591 -20644 -22082 -39630 -41596 -26667 -29708 -52002 -29015 12454 21033
24736 21033 35502 49779 12899 -19403 -17652 -8694 -2498 -4280 -6194 11808 -6884 -17608 -48626
24723 -48626 -40159 -39644 -45871 -25326 26352 19210 16555 25024 12247 -4896 -8838 -18937 -15638
24710 -15638 -20476 6929 27446 8540 10121 -15488 -25069 12642 8079 23664 16044 19313 14647
24697 14647 -5249 -32826 -26862 -16389 -8515 30580 79778 92806 94947 102744 120179 150318
24685 150318 114750 93829 74076 36195 -10684 -1034 10875 9782 32659 49561 -5319 -25471
24673 -25471 -22691 29783 36273 14484 2141 29904 21266 -23541 -3516 1633 -24285 -59579
24661 -59579 -63631 -43031 -1323 33320 27265 18719 13608 2258 5627 -6480 -25645 -25337 -24288
24648 -24288 -37861 -42518 -55456 -56206 -47671 -84905 -108257 -94176 -42280 -14590 5042 7414 -37083
24635 -37083 -53890 -31133 12888 15394 40393 49513 35482 -384 -26860 -54628 -44355 -3963
24623 -3963 24443 -3974 -5057 -5900 2711 -2574 -7858 -2191 21643 14496 -44274 -24315 -27974 -18683
24609 -18683 -13217 -40478 -56561 -30550 -4664 13958 -18433 -7491 -24864 -38931 -36064 -10051
24597 -10051 30779 14126 21355 28675 23927 3104 -27101 -15054 41167 52148 61392 -5844
24585 -5844 -3400 9774 532 -32999 -36007 -38961 14942 24581 16630 1761 -6330 11704 37903
24572 37903 20580 -3048 15212 24029 36862 8452 5916 -4232 -12000 -2392 -7385 12543 4193
24559 4193 615 19486 28852 53151 19020 33488 56222 25972 50003 39018 30274 40749
24547 40749 31844 -29547 -78148 -81181 -35269 -29326 -56297 -65655 -53348 -24724 14116 -18027
24535 -18027 -32929 -33742 -14673 -10189 -69689 -70348 -40839 18885 49415 53279 46156 61533 61461 52337
24521 52337 28322 8898 4233 19574 35373 25398 55031 67664 49439 20460 11453 659
24509 659 39130 36874 58091 28838 -2150 16803 -1241 -34665 -57885 -24644 4459 -12338
24497 -12338 -19868 7965 59393 38801 24981 14854 29610 22592 5628 50497 88652 44341
24485 44341 43746 11937 -11043 -40367 -29702 5241 50588 56373 30964 16688 13561 18731 25297
24472 25297 28879 26568 19166 50905 84228 76552 90499 17506 -42764 -3699 -30808 -44703
24460 -44703 -3298 23977 74942 69420 60993 35547 28338 4292 -17584 7475 -7194 -22169
24448 -22169 -11630 2571 -20131 -30405 -45696 -29315 5274 8719 -30792 -53741 -50149 -24412
24436 -24412 6130 35437 26236 4178 -11336 -36595 -62540 -90040 -90893 -66994 -67453 -79829 -52964
24423 -52964 -55931 -32710 1027 35689 -325 -45373 -25605 -19789 -37244 -62785 -65056 -35272
24411 -35272 303 21088 20268 35633 61155 53070 1798 -4079 -8282 -28360 -41553 -2529 5890
24398 5890 -18259 -68639 -109674 -68719 -16767 -11940 -3835 5222 -26639 -15884 -54582 -89983
24386 -89983 -89094 -53041 -11539 -17400 -43152 -55652 -18539 -11684 -36435 -48053 -17477 -31249
24374 -31249 -45071 -30894 -10438 36927 76741 40238 12243 -32740 -34004 -21430 -2441 28333
24362 28333 43031 48592 67265 75640 49691 36342 -33424 -70343 -48731 -25719 -11984 -2393
24350 -2393 27041 -9542 -38271 -38930 -41338 -530 28957 52547 28797 -831 -17631 688
24338 688 20567 13959 -37797 -80946 -92597 -97440 -30728 18668 28979 -32688 -61411 -13783
24326 -13783 9600 9596 21840 21613 24695 6092 -20213 -27006 -37952 -65900 -69241 -35378 -12906
24313 -12906 -12514 -44629 -76029 -77033 -56031 -17296 4102 -19066 -475 18512 -12681 -38327
24301 -38327 -53015 -60608 -57882 -27003 -51427 -43401 4876 -16084 -11319 17000 25769 38769 40335
24288 40335 11273 4349 671 -8874 -67093 -63116 -19626 12029 -8865 -16225 3803 -12356 -49316
24275 -49316 -57020 -55334 7804 40415 563 -24447 -36814 -24310 -1554 5103 -554 2249 -22222
24262 -22222 -16753 3075 10732 -17953 -96744 -136287 -131944 -72725 -47548 -8758 16907 -16896
24250 -16896 -15349 -8181 -33067 -35320 -9599 4914 5080 -1200 -27482 -68179 -64821 12743 13006
24237 13006 -25869 -30058 -17720 -7930 -4113 949 -23767 -37974 6259 35650 47034 69956
24225 69956 102974 39493 7948 -15718 -17640 -30924 -44839 -25908 -24721 -11004 764 -9200
24213 -9200 -24279 15275 -584 -16216 -28988 38940 52291 12358 7833 -8093 -42290 -46475
24201 -46475 -11566 -27298 -65033 -34714 -11307 -18655 -13163 -6166 467 15193 13156 10368 13641
24188 13641 3776 14112 -1893 8063 -19401 -52602 -74626 -64811 -14101 6474 -2435 -14517
24176 -14517 -8611 -23846 -35040 -19122 -42282 -56486 -47993 -49371 -20134 5425 22569 9748
24164 9748 -7568 7536 -4945 -11208 -24221 -54161 -99293 -110622 -113023 -70314 -19356 -361
24152 -361 28412 33500 -10412 -61856 -74276 -35773 -10741 -26768 -47659 -74204 -90416 -58621
24140 -58621 -83789 -60621 -20506 -5612 -13987 -8625 -20299 -1800 2645 -179 5284 12313 51031
24127 51031 67526 33172 35369 34702 26920 33613 61136 47767 -7753 -7621 905 -16456 9496
24114 9496 55716 61658 79984 50282 21163 6511 31396 28761 9939 -11694 6577 37256
24102 37256 40709 41996 44167 9317 34785 68248 46558 3135 -9976 -3966 -18137 -52625
24090 -52625 -29265 -27866 -23909 -13648 2280 -46187 -59108 -67722 -16664 41351 50932 46410 -11467
24077 -11467 -48645 -9243 -1367 15369 19663 33982 23916 25521 12898 -10955 -19019 -2090
24065 -2090 45571 20439 14959 -4587 -9965 772 575 -5762 15837 51875 25753 -5290 -16395
24052 -16395 -39321 -68995 -70815 -50826 -61639 -41158 -34038 -18563 -12861 -11928 16526 3903 -12491
24039 -12491 -12929 -20134 -29817 -5559 -8357 -4398 -14741 -29360 -40735 -41643 -47396 -49370 -15436 10934
24025 10934 -34879 -22915 12491 58435 46236 13698 78611 80644 46482 24688 -9259 -2610
24013 -2610 -22109 -26376 -9077 -1568 -19550 -34853 -38542 -22503 24777 43483 47323 35023 40213
24000 40213 23450 1135 16554 29639 -8393 19667 41022 -11011 -14031 26766 44390 14552
23988 14552 11662 -2913 -5551 14880 -5112 17896 5001 -18971 14013 -6257 4042 -24648
23976 -24648 -71124 -56500 -27111 -15753 -26034 -40130 -24298 -72000 -43978 19752 17980 -34708
23964 -34708 -60012 -48725 -37442 -80376 -93287 -89100 -87586 -83308 -73786 -88018 -108061 -80828
23952 -80828 -39584 -37829 -898 19911 39306 45760 -6511 -32084 -44879 -25036 -37430 -67637
23940 -67637 -74725 -74126 -62777 -58449 -21961 9768 -6802 -11275 19588 19828 -30245 -50513 -58772
23927 -58772 -51554 -25219 -54319 -67972 -68688 -69887 -61815 -52388 -23341 10454 23487 38642 10885
23914 10885 -18096 -22343 -19464 -51620 -66651 -79426 -104535 -80202 -44324 -38526 -49244 -68046
23902 -68046 -73251 -68955 -77650 -31620 -46047 -39709 -21239 -39825 -36025 2186 -12512 -36888 -82158
23889 -82158 -69298 -42777 -61422 -53157 -28207 -24663 -30319 -10397 16997 6520 14382 62102
23877 62102 55750 11674 -3747 -1038 -10526 -10013 -24556 -3367 -11743 -37092 -28480 -30451 -20495
23864 -20495 -27911 -20692 -28624 -50273 -48676 -30829 -35944 -38593 -14184 19459 31272 71283 22267
23851 22267 -23656 -30973 -21834 -50970 -70997 -51531 -2243 7959 5864 7289 29702 52052
23839 52052 56069 51820 32234 -7964 -51516 -75578 -46832 -9887 -4350 -21411 -15359 -54438
23827 -54438 -80605 -56597 -36545 -6083 7422 10953 35973 26792 25943 28313 22997 26060 22569
23814 22569 20677 -20139 -54266 -51478 -38128 -5639 48070 66060 52765 14616 4707 -18005
23802 -18005 -13555 1881 34033 32143 -35359 -47402 -3692 30752 14022 -25903 -10128 -6026
23790 -6026 12624 2780 -7462 -34936 -43620 -38553 -49772 -39988 -41011 -25500 10661 29472 72970
23777 72970 61147 2559 -51184 -55124 -29723 -31894 -59839 -24931 23960 -7258 -42776 -81058
23765 -81058 -85418 -50408 -18279 -38225 -36620 -46193 -48139 15170 85616 81928 61781 39098 5950
23752 5950 -23318 -51095 -43161 -14133 -8303 4940 25466 33551 34724 29492 13874 7645 2083
23739 2083 7552 37745 50508 43372 43113 35859 10805 -24711 -31453 -58717 -53904 -36947 -16808
23726 -16808 -37139 -21673 -18239 12710 94647 108193 88094 61870 36616 37909 -4559 -60636
23714 -60636 -88647 -85899 -51568 -29334 -43405 -28815 -4395 -10319 20888 29284 -6079 -29904
23702 -29904 -28589 -39616 -33000 -14321 13891 11179 25115 38953 16979 45453 83744 94122
23690 94122 74896 40189 18209 14160 10180 29574 5739 32710 33639 47888 9730 -3719
23678 -3719 -32856 -49832 -26353 -18148 29 3309 -62397 -57524 -58305 -84061 -75847 -60589 -87266
23665 -87266 -88340 -39458 -44760 -57849 -32194 29410 36340 21188 -13994 -34349 -74570 -68644
23653 -68644 -34060 34548 56609 31221 88 -2682 22331 38134 46335 41686 20756 -29867
23641 -29867 -39372 -11403 -24925 -17206 2850 110 10773 62125 61242 51953 45550 49013 32332
23628 32332 -19963 -58193 -58388 -56326 -51840 -26163 58225 76495 4052 -29569 -9859 -10877 13970
23615 13970 14531 -8943 13152 41431 25766 38471 35250 -16589 -56671 -81606 -79540 -68369
23603 -68369 -41434 -46688 -24840 -20712 -2264 -6899 7349 24510 30039 40866 31829 31311 24074
23590 24074 20382 25171 30858 48732 49323 26397 22390 47370 67047 58887 28330 60935 60350
23577 60350 74027 111643 55554 -19503 -714 23243 8639 -1057 22990 26928 24787 22030
23565 22030 9439 15666 1935 -13291 -38407 -20996 -6056 -15120 -29740 -62865 -69822 -82819
23553 -82819 -65173 -33011 -14207 -53819 -55602 -19507 -24580 -75949 -87177 -38287 -11188 -26669
23541 -26669 -28558 -24427 -29060 -27237 -17472 13633 51447 55773 15668 20755 633 -21767 -792
23528 -792 -9384 -851 7921 63054 82346 67599 22012 19747 14875 22462 -1184 -14628 -34001
23515 -34001 4296 49548 19929 -20173 23284 75244 95546 73991 60151 30470 24288 20202
23503 20202 24780 4162 -39183 -8020 -4396 21389 26301 49416 69201 52400 54971 17542
23491 17542 -43683 -57201 -29364 -21913 -12255 -47201 -46784 -25298 -18340 7068 -12038 1534 -6791
23478 -6791 -19843 -16838 -34326 -36827 -41669 -50430 -41972 -54292 -75476 -57064 -43419 -25422 -46207
23465 -46207 -35963 -18690 -2386 -28522 -87388 -90467 -61726 -34099 -24807 10442 25614 20054
23453 20054 29818 35835 -7402 -13718 33751 48450 45688 68174 58198 24506 17874 76149 86988
23440 86988 61251 89489 52603 33711 -15214 -7671 25412 30294 29690 10746 7655 -12010 -27658
23427 -27658 -9772 8284 -58 -15370 -23487 -21237 15694 6195 394 -17404 -16305 -2276 19389
23414 19389 18971 -29143 -36123 -72094 -51080 9452 -21892 -30665 -10851 11211 13790 13697 17038
23401 17038 12851 22698 9368 -11990 -38448 -71205 -103905 -64256 -45328 -59572 -57607 -52573
23389 -52573 -30577 -2296 -14246 -6205 10446 37180 53150 29738 4595 -41169 -61056 -89139
23377 -89139 -115948 -143585 -126226 -109747 -88940 -34670 -7958 -23541 -455 312 -27237 -1759
23365 -1759 -3669 -18164 -20184 2235 10465 34556 49501 57440 36096 5450 44513 74289 37809
23352 37809 -6389 20726 56138 28903 -6585 -22124 -30877 -46930 -92113 -106700 -102431 -105433
23340 -105433 -100455 -69154 -23604 -27764 -41985 -7319 17965 -8851 -74674 -77174 -41192 -50310
23328 -50310 -82468 -103632 -97966 -47971 -14630 2279 21943 -6941 -25042 -28189 -23787 -8350
23316 -8350 -25265 -15484 -11580 -29507 5567 12940 -22872 -33577 7086 25727 37549 65549
23304 65549 53177 26927 12804 45355 96120 85259 25917 1785 11648 -2071 13313 8822
23292 8822 17624 53557 38374 25329 41172 96325 117455 105307 73225 32252 22582 41049
23280 41049 47213 30796 5989 49780 35087 12031 10603 2603 17107 34069 46278 47007 51227
23267 51227 41544 22832 43278 47451 48706 39688 18263 -59651 -54814 -13697 24998 18391 28713
23254 28713 55867 58080 23862 -30994 -38695 -30790 -7884 -8326 -3539 -9154 -60233 -58187 -21292
23241 -21292 39855 51183 42285 48196 16700 -47091 -34816 -2606 3991 -25817 -29848 -3845
23229 -3845 -20748 -35205 -8834 -23993 -24674 -46486 -62304 -35430 -29941 -49425 -25135 47828
23217 47828 103623 86344 84294 98731 72921 42578 53085 53370 84242 79850 52308 30653
23205 30653 21207 26397 -13207 -39777 -25295 -12062 -7733 -14646 -28238 -15912 16138 15328 9834
23192 9834 30992 11341 6591 17957 37160 66554 69918 15454 -46763 -17051 5101 -12497
23180 -12497 -33348 -22392 21423 20706 -5583 -2028 -26811 -17648 2182 19241 5164 13596 -18802
23167 -18802 -39967 3868 7078 32664 57047 41415 -2445 -10407 6286 -26510 3761 15578
23155 15578 20966 7746 -19947 -46284 -53228 -64632 -53626 -42929 -26595 -11892 -9518 -88010
23143 -88010 -121745 -115461 -86748 -83788 -94530 -47430 -20752 -26173 -6539 10600 35804 -2572
23131 -2572 -38256 -81287 -81112 -57150 -41928 -16760 24086 34023 26594 37411 32984 45135 33315
23118 33315 12695 -2596 -18270 -44672 -47920 -32614 -21347 -24791 -12547 19401 5050 21144
23106 21144 23103 -9735 -22955 8263 24055 16301 -47811 -53611 -30278 3948 -41496 -57606
23094 -57606 -63352 -67467 -64920 -44680 -40976 6153 20570 20041 -3841 -46329 -34613 -4604 -9634
23081 -9634 -60615 -60659 -23040 -40109 -17071 -13570 -16592 16271 51719 43126 25641 -264 -13199
23068 -13199 -10379 10073 11189 -1360 5317 -4798 20376 43341 42058 26963 24138 38286 42611
23055 42611 47818 33926 15037 3364 -35671 -54654 -60741 -25784 -8513 -25652 -48080 2434
23043 2434 -1417 -2950 17168 8573 4741 -4157 5666 20824 -25172 7624 17842 37688 20470
23030 20470 13582 7856 14659 -12919 -8105 10944 46525 56564 50350 17899 -5458 21772 52204
23017 52204 30735 -19568 -14570 -7094 -44070 -20742 19286 37092 54174 26869 61826 80002
23005 80002 40150 -11613 -47745 -16707 17105 1113 -16469 -10634 12130 24242 27206 40555
22993 40555 33781 54396 25362 18470 -28513 -6521 -2389 -17212 4014 -4909 -41762 -19020
22981 -19020 12395 -5974 10145 -15071 -25092 -49291 -36332 -49357 -53777 -77084 -74090 -31899
22969 -31899 -7051 -32996 -56433 -53201 -69374 -45436 -24301 -54998 -90658 -61693 -52522 -51860
22957 -51860 -51003 -28981 -28730 -35023 -74770 -77320 -79898 -99555 -86758 -70403 -44879 -6262 -2725
22944 -2725 -59121 -78396 -43475 -6932 3658 -43146 -68808 -60498 16850 11907 -2342 16144
22932 16144 -4703 18 -6956 -7925 -27135 -48193 -22361 507 14580 392 -11712 -34399
22920 -34399 -27764 -27187 25509 61837 46776 28200 77205 64886 20470 -27368 -19184 -18232 -13394
22907 -13394 10377 -8253 -1232 -3263 -42095 -42250 -41996 -22576 -29203 -24260 -31192 -51354 -48937 -47210
22893 -47210 -30777 -28638 -31494 -10519 16172 26544 43284 36856 46707 42893 47780 52217 3484
22880 3484 -30808 -17047 3561 21409 4638 -19856 27576 41468 49410 -25264 -40864 20123
22868 20123 42976 16018 -23571 -50453 -64743 -62755 -33560 -17488 -9564 -5822 -22132 -23341
22856 -23341 -27203 2450 -22335 -62750 -83343 -79513 -71145 -12446 15471 -24873 -60685 -93285
22844 -93285 -128449 -165366 -152393 -88210 -26578 -14983 -12983 -18545 -4940 -64135 -101895 -97459
22832 -97459 -58079 -38606 -37685 -54726 -37361 -3165 -19487 -51052 -20359 17448 -12803 -28195
22820 -28195 -19736 -23307 -41445 -47773 -34215 -27726 -39503 -26041 -39404 -23126 -8572 -29152
22808 -29152 -37290 -56896 -64484 -37564 17063 8306 -21241 -80467 -109240 -118499 -120835 -68892 -29624
22795 -29624 -18613 -10504 30199 27479 10778 10257 -19858 -24436 -30680 -50601 -10343 9699 12731
22782 12731 13009 -11341 -16068 9543 6394 21293 38365 41983 -10596 -54370 -58676 -35707 -28067
22769 -28067 15915 27600 15332 24749 46016 59929 44515 37209 73496 68491 46484 39696
22757 39696 21886 14526 -23763 -36516 -33749 -36139 -40684 -17334 -58010 -44003 -52220 -91658 -69167
22744 -69167 -24430 -21397 29631 69739 84271 88346 48221 25576 16517 44867 45309 34048 17823
22731 17823 7913 -12129 -51667 -70188 -36842 -28211 -31329 -3463 45825 43601 -36021 -66084
22719 -66084 -69392 -51194 -30407 3136 56909 50761 49280 3997 -61328 -53110 -43716 -24650 3826
22706 3826 38811 67612 58502 63095 65754 65220 37154 15321 10877 6872 21198 9354 18713
22693 18713 -14127 -49483 -19179 3644 -117 -47197 -35916 16402 61660 121081 103452 42252
22681 42252 -10278 20257 19383 -4104 -24239 3853 -7356 17076 69704 109727 106118 69791
22669 69791 23574 15980 10022 706 29653 26250 41958 22516 -19147 -34517 -18851 -10250 -11118
22656 -11118 4382 18604 23763 52625 54437 -704 -25478 -28940 -11451 9162 -21689 -23269
22644 -23269 -53979 -73508 -70454 -82766 -59765 -19726 -27917 -35456 -40763 -61551 -5088 12424
22632 12424 20765 -5864 -35312 -53672 -5858 -16203 -27920 -11927 -7449 7668 18874 22485
22620 22485 37533 50306 78982 87537 34195 4784 -14356 -14407 21560 36173 1165 12066
22608 12066 14088 22976 15201 20069 71386 65087 41307 24837 36085 54607 17882 26984 26041
22595 26041 36153 29137 9634 8929 22827 22657 19756 -619 -7153 -2837 -1565 3167 -11193 -12691
22581 -12691 -21472 -6742 13618 23365 -4413 -39409 -35699 -15089 -18175 -8149 -1604 8955 30332
22568 30332 -61 -20888 -8735 -30827 -32975 -69109 -30965 -11277 -34002 -53446 -58141 -16524
22556 -16524 145 13756 -18904 -67251 -71749 -96149 -108995 -98649 -77147 -55014 -48620 -59005
22544 -59005 -40282 -40535 -29368 -2472 -1817 -39127 -30981 15273 42976 23797 60682 70267 52064
22531 52064 52882 21726 29436 7791 14014 -1981 -13909 -26716 -8945 -3289 -47659 -65989 -102629
22518 -102629 -61529 -10423 -22415 -25142 1143 12123 6498 50935 26746 848 26471 47220
22506 47220 50208 20359 -13578 -1041 -12320 -2486 -12410 -43823 -8244 24495 15852 -22972
22494 -22972 -19084 -9155 29822 18165 1042 -16396 11695 3510 -29399 -32324 -28462 -52886 -49567
22481 -49567 -34290 -54585 -60152 -53834 -33192 -10675 3471 -40790 -69834 -70183 -57951 8349
22469 8349 25354 33251 40775 -16342 -83686 -99798 -74305 -79098 -79969 -79813 -83290 -109859 -132839
22456 -132839 -124240 -101412 -63395 -51107 -87557 -103342 -58630 -60946 -39880 -2952 10545 17771
22444 17771 10205 31370 22738 14784 -19566 -31551 -27232 -39878 -54876 -74301 -67441 -58073 -76175
22431 -76175 -77667 -15704 5298 -52210 -66620 -59594 -64547 -53786 -52613 -16971 20291 38872
22419 38872 30193 11141 33458 68484 25693 -27309 -4491 134 -18394 3088 12277 18181
22407 18181 24080 26493 50261 55118 69603 83589 53587 33084 35722 32007 31163 -117 15828
22394 15828 -6727 -13927 25096 80605 45432 28114 -7083 -42225 -44782 -26084 12323 3824
22382 3824 -36351 -66017 -29092 -28565 -29335 -14968 -15640 -35561 -18869 -29558 -31609 -22922 -30604 3055
22368 3055 6720 3663 -7913 -34813 -11220 17563 -1786 1653 24220 -5163 2250 8917 25674
22355 25674 -1211 -4535 -28973 -30769 -43716 -50558 -52594 -62596 -85120 -42754 -51944 -51239 -54636
22342 -54636 -73971 -57771 -37425 -47132 -30593 -26549 4466 13154 473 -32873 -45749 -17761
22330 -17761 -11769 -9230 16466 25917 22441 26819 7166 -4346 1264 -3398 13283 13436 9372 12455
22316 12455 7684 -7437 -19686 -16115 -56699 -33192 4943 -40420 -14973 23491 29072 22511
22304 22511 39915 29032 -5 16256 27412 -18233 -44183 -6936 1424 1308 -18928 -9216
22292 -9216 -13377 -15959 -1095 5585 19107 -7907 -28642 -14402 -32730 -20279 2192 -97 -36271
22279 -36271 -11940 25079 -3025 -45435 -54683 15812 49394 49865 23956 20674 1273 -37582
22267 -37582 -3635 16721 -6600 -5924 5362 29916 26895 17535 -4484 16644 -6007 -26144
22255 -26144 2692 7181 -20481 -12046 -19511 -8559 -20963 -12653 -365 -10972 851 19203
22243 19203 23091 -27743 -42603 -36248 -18702 -22352 -17808 10341 7839 -17518 -6650 18123 -26285
22230 -26285 -27950 5536 19262 48268 26196 -38469 -67673 -66724 -40906 -6984 -20848 -10491
22218 -10491 -5575 -6332 29005 28936 59221 75069 61301 67204 87050 58988 -17212 -35594 -19683
22205 -19683 8915 19933 -6166 -19407 13302 4003 -60065 -76793 -37237 -14720 -19161 -20782
22193 -20782 -5051 -9040 24043 54473 50432 3854 -18972 -15086 -10104 25102 26490 20023 29840
22180 29840 -19257 -43578 -48595 -69090 -97085 -102829 -139046 -118359 -85299 -76790 -80323 -90146 -54140
22167 -54140 -24859 -28896 -35016 -76003 -41825 -21772 -34595 7065 24936 3615 -11705 22151
22155 22151 47288 14286 -41270 -22605 -21108 9909 30044 31056 -5891 37690 22389 -2324
22143 -2324 -1566 -7600 17403 10708 -1666 15683 1133 -13709 -18668 -43268 -33076 -42789 -27818
22130 -27818 -21739 -44914 -55432 -30273 -63820 -63725 -53861 -47460 -29319 32991 28755 20720 -14666
22117 -14666 -43521 -45038 -27954 -41708 -17163 36736 733 -54525 -52798 -32418 -65481 -59096
22105 -59096 -35947 -20624 -33417 -77255 -109419 -89779 -73007 -71931 -73042 -57675 -92570 -95791
22093 -95791 -76966 -19425 27795 69739 81731 57143 -10105 -14289 -2259 32252 51708 17251
22081 17251 15011 42245 61929 39282 59909 54428 30586 34184 3306 1315 -32089 -43173
22069 -43173 -21694 -20179 -39934 -32774 -40328 -57445 -49703 29570 89946 88894 44099 9053 -1121
22056 -1121 5903 -3564 30548 22397 -23646 -40626 -40841 -26274 -17778 -32341 -47249 -55897 -21627
22043 -21627 -1108 -6216 -9285 161 -5867 -35514 -2952 18417 4172 28708 6244 -16229
22031 -16229 -13539 6120 4040 15544 33246 24334 48357 12111 -2875 -29211 -56287 -60140
22019 -60140 -70907 -81404 -76860 -68645 -45379 -51081 -31595 -43887 -59433 -34582 -16011 -26295
22007 -26295 -47051 -20933 -8131 10730 -874 -21772 -45243 -59933 -31142 -38337 -23617 -22176
21995 -22176 -21939 -39110 -27482 -20363 -2752 23047 -10600 -55655 -101378 -102996 -71253 -18152
21983 -18152 -29264 -39974 -25386 -20561 -21284 7425 37042 46524 33712 24799 10529 -3774 25471
21970 25471 28904 -4939 -10436 -3512 722 -8371 39401 65813 54340 64042 49639 46880 36257
21957 36257 3974 -56027 -65296 -48705 22230 64595 65649 96868 76883 39517 -14327 -16979
21945 -16979 -29239 -30379 -7176 -22273 -67466 -67411 -70853 -21333 -8746 -24389 -50087 -52501 -68294
21932 -68294 -62993 -50752 -60268 -49510 -11620 37637 27146 -19583 -32713 -22366 -62346 -88706
21920 -88706 -68257 -74701 -36198 -19005 -32479 -26220 11052 2546 -9018 15227 18709 29886
21908 29886 24050 4821 -30980 12814 41597 60284 30045 -813 -24969 -28944 -24508 -28121
21896 -28121 -41204 -39305 -36219 -35086 -4947 3153 21934 38746 -31160 -56715 -1938 21567
21884 21567 23703 26859 -5954 19645 39835 38899 32698 19371 -3912 2742 16962 6971 -8938
21871 -8938 -11632 -34182 -98438 -141561 -126192 -87465 -34985 34361 46887 -6101 -51466 -73543
21859 -73543 -60272 -79369 -74544 -35250 -52168 -78278 -53921 -51677 -14632 21805 28266 22017
21847 22017 1186 1714 -15818 -31951 -40679 -47173 -13270 25226 -16653 -58544 -65299 -59280 -43089
21834 -43089 -9526 -14448 -56066 -89085 -50162 -54995 -39355 -57137 -39338 -27444 -11631 28486
21822 28486 33135 -11923 -21764 -8235 -21028 8181 51428 22755 -1671 -719 -24430 -29350 -25168
21809 -25168 -9649 -33919 -36539 -16727 -7938 -23264 -41059 -14426 -23134 -44893 -55927 -79230
21797 -79230 6130 28817 10797 6967 -18150 -36162 -14466 38491 35832 -15576 -62117 -50687
21785 -50687 5685 38644 46083 19190 -29439 -92221 -78798 -77924 -104353 -124151 -141803 -113939
21773 -113939 -77122 -36586 -40876 -51751 -34614 -36848 -35392 -44929 -66860 -83337 -42008 -45582
21761 -45582 -41156 -13236 -3510 6129 13914 18920 42500 60932 54891 65077 53535 47925 42334
21748 42334 3720 -4849 11382 -9694 -2725 12067 23266 785 -4710 15112 38403 36341
21736 36341 -16128 -43042 -6839 29774 39250 44012 30797 35988 15304 -13200 -52915 -32376
21724 -32376 10542 24914 15896 41395 9962 -41183 -67684 -71665 -35461 -36973 -48848 -66732
21712 -66732 -30198 27615 69268 59051 14523 -51894 -71100 -10810 31798 65162 40234 -1222
21700 -1222 -25000 -48698 -45932 -50599 -52769 -58598 -65671 -78588 -108225 -116691 -92364 -31444 -24825
21687 -24825 -41602 -35564 -19412 1227 5296 29711 14342 -43586 -94740 -60621 -34801 -30914
21675 -30914 -37930 -52023 4872 -2054 16796 31545 -7578 -5776 -33966 -73512 -56807 -24302
21663 -24302 -23255 -40092 -45291 -46915 -36782 3482 14776 -32943 -40818 -10931 -27277 -53439
21651 -53439 -88240 -89525 -59891 -17726 4004 -8610 -29134 -11015 -14152 -4386 -8389 -15235 -45168
21638 -45168 -56933 -38414 10298 21090 7000 35624 17539 7154 -5512 -40497 -60836 -58302
21626 -58302 -63586 -22248 -31778 -56807 -43036 -51613 -62356 -27376 20767 47082 55710 90373
21614 90373 85319 64552 22345 -17288 -18904 -40248 -26470 -21390 -14246 -5098 -17681 -3113 25215
21601 25215 -8748 -32934 -44323 -54946 -56183 -45418 -3140 39446 28481 8900 -9708 -27911
21589 -27911 -27374 5145 3920 9727 25901 -5253 34793 62666 25441 2309 -10042 -41624
21577 -41624 10723 62968 54954 29353 46151 92956 124408 82058 2506 -6733 -25460 -20984
21565 -20984 -26850 -3376 5242 -10512 5000 4583 -17935 -15572 -16865 -36302 -66680 -74518 -85046
21552 -85046 -65804 -55216 -47444 -47377 -44680 -39170 -64589 -13823 8951 -17079 1949 51755 35275
21539 35275 60218 102182 82860 16761 -36759 -36263 -7484 -3183 -16670 7706 27517 22521
21527 22521 7249 -1734 -28181 -38397 -2098 37403 11822 -6455 -10372 -4095 28229 25078
21515 25078 36808 23798 10900 -5348 -17768 -77712 -99612 -67923 -53308 -38254 -20459 -513
21503 -513 -55348 -96911 -34425 -32641 -56043 -86040 -81866 -41252 -404 -16186 -15409 -23294 -37642
21490 -37642 -22399 -36772 -34453 -2306 703 -23974 -54685 -32390 -37052 -39075 -18263 16468
21478 16468 27748 25727 6051 -18383 -55311 -35710 -3130 16652 -16338 -56231 -69595 -62449
21466 -62449 -46147 -29174 -1537 29926 22418 -36252 -51584 -30633 -30166 -34650 -67186 -66301 -61011
21453 -61011 -41275 -16495 -32843 -68678 -67813 -62765 -50190 -5600 -4635 31323 26928 8150 -13777
21440 -13777 -12506 -1978 -34051 -52225 -49383 -38939 -35274 -28180 -48857 -42333 -17646 -40766 -33889
21427 -33889 -48322 -19507 2427 20058 24371 -2827 -4910 -16269 -19413 -46432 -57207 -30876
21415 -30876 -20818 -39267 -11087 20528 -15109 -37827 -19697 -17481 -5712 5657 2674 22736
21403 22736 47389 35330 15749 -24942 -20298 -28149 -28151 -37471 -43080 -39677 -58764 -33757 -21504
21390 -21504 -49157 -38110 -18225 -50349 -40791 -24313 -37395 -55329 -52865 -39963 -23678 -38918
21378 -38918 -71994 -42472 -37454 -52447 -13921 -17847 -46477 -63036 -31618 -13266 -17869 -21830
21366 -21830 11280 30374 -16045 -42996 -41451 -17458 -18722 -28467 -26945 -45196 -32116 -25443 -17303
21353 -17303 -6973 614 37327 27970 -8743 -24591 -17277 49114 60315 25856 41830 40905 47017
21340 47017 11941 -24435 13632 73438 55056 35012 -15387 -21942 -304 2421 41140 44895
21328 44895 24077 17328 -11312 -47586 -57489 -45193 -90344 -108911 -68449 -50847 -29430 -7526
21316 -7526 -32166 -12087 2664 -19226 -18315 -21184 -38157 -33934 -10857 5005 -20464 -50416 -89629
21303 -89629 -53175 -23840 -38023 -56973 -53026 -78000 -40455 -9487 -23707 -16909 -13928 5581
21291 5581 20679 1675 -34933 -54394 -25526 -5453 6766 12176 -24542 -59370 -45275 -35655
21279 -35655 -7022 -36587 -45642 -31320 -3210 4999 4221 8993 7739 16292 13456 50860 65412
21266 65412 44031 14735 16568 21838 47682 14841 15451 53163 83105 57648 54732 43190 25677
21253 25677 45791 18877 -33211 -20932 22178 7916 -39490 -84554 -78077 -87832 -35368 -40980
21241 -40980 -81903 -79446 -60971 -27606 -23109 -78419 -116187 -51266 -8084 -7022 -24312 -50656
21229 -50656 -38395 -22499 -49889 -72644 -65599 -42091 -40241 -12511 -21535 6565 29957 33238
21217 33238 4741 -68609 -63558 -26344 -7347 9971 3633 -2040 25486 28808 -67769 -120619
21205 -120619 -109099 -82565 -44526 -2616 -15792 -48050 -62344 -32819 -18761 -2000 -25204
21194 -25204 -67313 -105745 -83335 -70082 -64065 -40448 -23968 -54497 -44661 -28691 -17455 34987
21182 34987 48606 44783 12224 -50951 -55716 -18388 -36144 -20283 11246 13198 -1133 -19215
21170 -19215 -30738 -57401 -60690 -29749 -27883 5109 15039 19478 42924 19436 20551 26852 -6366
21157 -6366 13733 11937 -44482 -95438 -68967 -43110 -6530 -30251 -27628 32309 25384 18899 3733
21144 3733 -27134 -45627 -53481 -50519 -45358 -27475 -23190 -2754 -46105 -106131 -91037 -60266 -12266
21131 -12266 25535 -3525 14049 40539 40690 -39257 -26526 -21831 -37792 -18195 -16484 -41958
21119 -41958 -69006 -72361 -79555 -26670 -3263 -28028 -32487 -17027 29183 9931 -10280 -1753
21107 -1753 -25086 2159 26263 46336 183 -2639 1755 7309 13373 -2076 437 -3255 4217
21094 4217 4172 28349 3607 -25784 -66448 -76611 -75526 -87907 -54574 -2661 -1850 -2581 -11399 -38401
21080 -38401 -26082 -32451 -28945 -48043 -61063 -58365 -85435 -96117 -83167 -75012 -40687 -44757 -44643
21067 -44643 -3844 -8067 48227 60247 17902 -41057 -104135 -100081 -54368 -27839 -44248 -77008
21055 -77008 -74675 -58609 -6964 -11992 -5533 13486 -25855 -44539 -54021 -64697 -69214 -50989 -5233
21042 -5233 26251 17490 11386 33041 8314 -13273 22503 34780 31949 28891 -2307 1649 -18517
21029 -18517 -44880 -50860 -47292 -75728 -64609 -22451 -53882 -68589 -2553 1210 21183 14212
21017 14212 1294 6462 50355 12018 -54111 -74585 -46272 -9583 -18126 21215 15209 -11657
21005 -11657 -37316 -45830 -13670 3986 -46502 -42407 11176 -5200 4478 39078 33886 15461
20993 15461 -22457 -32810 17312 60529 73098 38490 -28513 -53884 -4765 8872 -11635 -24417
20981 -24417 -38126 -59378 -37245 -63883 -56355 -44128 -24349 -5728 -27216 -67093 -56955 -6607
20969 -6607 -7790 -11794 -6583 13047 -6213 -9994 16790 -296 -5720 -43922 -83258 -78851 -55466
20956 -55466 -28613 -33186 -53411 -107830 -116977 -43026 -21840 -43598 -32543 -30490 -57444 -62379
20944 -62379 -54745 -29084 -44530 10927 9701 -13034 -28558 -25459 -7632 -11596 -37534 -52561
20932 -52561 -25616 -9434 -34540 -53841 -81083 -88780 -95874 -77387 -33829 -32660 -40222 -38651 -23043
20919 -23043 -15484 -22033 -43260 -30753 -18727 -19952 -35634 -61860 -80062 -58440 -12271 7061
20907 7061 -20057 -5162 22627 29226 29752 1803 -19953 8875 13006 -13013 -53667 -21187 -2168
20894 -2168 -41157 -35474 -19124 1283 -6199 122 -22298 -29574 -43747 -21600 -14430 22755 23754
20881 23754 25581 32692 -37440 -83759 -48647 -2687 -7267 5716 -233 17339 2526 -55650
20869 -55650 -42076 16083 55875 19583 -3709 -19643 -83645 -99627 -68626 -28030 -1408 -19602
20857 -19602 -26924 -30823 -37603 -91959 -91957 -88949 -86151 -51908 -1879 9656 -18947 -30028 -37702 -67512
20843 -67512 -79187 -51585 -33324 -42784 1336 14456 15897 15839 22566 -17660 -23739 735 26664
20830 26664 7236 -32389 -11672 23767 14864 21646 41321 12548 -18043 -7186 -13546 -26065
20818 -26065 21809 16821 3760 -13985 -24105 -34073 -47784 -35228 14029 29871 25871 19656
20806 19656 -17692 -23967 -19353 -21664 -15530 9460 65031 69726 8950 -17621 -52160 -61049 -46287
20793 -46287 -48999 -32068 -863 15744 27210 6084 2311 -6466 -9823 -33956 -793 14215
20781 14215 -35477 -30136 -10034 -9036 5342 38522 -7841 -40846 -64216 -93697 -94549 -36955 -35350
20768 -35350 -43436 -28467 13803 26707 30448 43463 -15643 -86669 -90209 -52388 -48583 -56030 -32408
20755 -32408 -32367 -61544 -75883 -64128 -54809 -45235 -29223 -33500 -57196 -38102 -27119 -47796 -66207
20742 -66207 -38781 -15978 -35864 -37652 -59422 -72011 -72345 -42028 -52415 -39000 -16575 6567
20730 6567 -2757 -375 10 -42896 -60026 -70698 -49346 -20154 16143 4137 29492 31396 -2439
20717 -2439 -31647 -37417 -37135 -55336 -66122 -35918 -14169 -41137 -46247 -37205 -21254 23119 7293
20704 7293 -1040 -18449 -21133 -3263 -20581 -51565 -53113 -43804 -88420 -70303 -49725 -38454 -60757
20691 -60757 -56315 11621 9148 -31409 -48610 -76575 -65195 -65875 -65245 -63898 -56609 -72471 -73529
20678 -73529 -63967 -78393 -110578 -111772 -81523 -73396 -83993 -108664 -44082 30723 31166 18676 1908
20665 1908 6208 7039 -2430 -9396 34248 29695 19481 -23297 -51615 -60434 -87786 -103078 -68040
20652 -68040 -49200 -29658 -20697 -16771 -1019 37071 -3538 -66901 -107627 -109281 -106128 -80048
20640 -80048 -74915 -107139 -100252 -68110 -61262 -75557 -58863 -11197 949 -7998 -6592 -29053 -78404
20627 -78404 -85839 -118537 -74701 -49650 -33011 -34681 -36686 -43712 -50140 -40844 -27728 -35911 -19988
20614 -19988 -2613 -44707 -63721 -79474 -67005 -66045 -68954 -41686 -29048 -33487 -52001 -36786
20602 -36786 -6680 3816 -31639 -8569 -5800 -22564 -19781 -10958 -1357 -16938 -21234 -52250 -74204
20589 -74204 -74589 -66404 -46925 -60685 -64499 -61256 -36445 -30994 -34394 -41187 -51637 -38542 -817
20576 -817 2507 21356 1943 -64073 -61343 -76180 -54600 -23690 -20346 -54969 -61381 -53212 -50094
20563 -50094 -67365 -52725 -5584 34297 8070 -31677 -62192 -66820 -39047 -25695 -23041 -16156
20551 -16156 -31672 -50572 -57324 -57801 -66140 -37344 -10439 40369 14152 -17398 -26535 8846 24300
20538 24300 8474 -9368 -12563 23461 23601 -43625 -68755 -24690 13478 41442 31423 38373
20526 38373 16975 27531 -4341 -46098 -50425 -18718 -4213 -23986 -1241 5711 -16660 -15144
20514 -15144 -64622 -62348 -40057 -23006 -10421 -18372 -41517 -25071 -27462 -61365 -29903 -22134
20502 -22134 -8016 5514 3227 2673 6418 -889 -3696 -16109 19274 -280 -17229 -41598 -68645
20489 -68645 -70131 -45830 -61138 -56776 -44903 -19917 -4396 -15991 -36269 -31184 -29789 -16986
20477 -16986 7308 -4061 21791 -3981 -25718 -40028 -34408 -67776 -59977 -54672 -47994 -65681
20465 -65681 -67464 -41010 -37762 -5552 11056 48198 39424 -7006 -27336 5102 -49508 -59721
20453 -59721 -30918 10958 26589 14270 -13061 -22018 -42906 -30226 -17396 -13689 10371 10029
20441 10029 -29287 -21701 5942 39250 -3745 -54801 -32284 -35631 -29086 -12186 -14093 -28368
20429 -28368 -38055 -40970 -22795 -21050 -35815 -12860 -21731 -33822 -12719 13970 4980 -12404 7572
20416 7572 -23621 -38129 -23659 -1745 469 -59818 -54401 -12797 -30830 -35634 -14935 14596
20404 14596 36350 1976 -29598 -30294 69 2385 -20657 -3511 4255 -20551 -46170 -48968 -2431
20391 -2431 30163 17798 -9211 15986 -14722 -68465 -35363 -29654 -19660 -23928 -50797 -52542 -31731
20378 -31731 -17916 -50963 -63866 -66008 -54479 -26450 -18647 -49600 -63814 -20918 36939 24821
20366 24821 -17068 13634 -2572 -65503 -65465 -56469 -28453 -47106 -34938 -36405 -50306 -66542 -87968
20353 -87968 -74454 -36597 -25006 -16520 -14136 -15602 -42789 -8979 27324 17441 -1839 -20528
20341 -20528 -24116 -22624 -53904 -70904 -61026 -50308 -19869 8207 -13846 -55127 -91961 -99399
20329 -99399 -77472 -50526 -19609 -28287 -13021 -4623 18083 18015 -12601 4758 -30686 -36120 -53965
20316 -53965 -23170 -452 -7446 -18968 1647 12423 -29657 -56840 -39148 -42160 3019 35817
20304 35817 9602 -2643 -26048 -89091 -39044 -18020 -39436 -38386 -5438 31377 45611 35975
20292 35975 28358 29007 4813 -944 -18382 -35774 4114 50075 56642 33063 1915 4030 181
20279 181 -56078 -79095 -61830 -11627 30799 36266 40231 -20981 -52904 9331 33116 16986
20267 16986 15028 -12722 -36437 -32294 -23864 18484 7505 3012 14623 1679 1960 -21725 -30805
20254 -30805 -37421 -33262 -15181 17290 27413 31984 23178 36860 35879 21581 -33161 -43505 -19229
20241 -19229 3896 14069 -14628 1548 -4295 -28737 -36885 -13256 -21905 -16399 6413 -16798
20229 -16798 -18244 8235 43304 32778 26568 60197 25122 5669 32686 35338 26539 25393 13771
20216 13771 -6251 16504 17265 -43186 -61104 -35576 -10415 33579 41653 6867 -31292 -41807
20204 -41807 -57928 -45373 -8962 6529 -36509 -71369 -73443 -50362 -36318 -59628 -67223 -83766
20192 -83766 -43720 -16015 22499 49908 36814 7596 -2234 5632 53607 55704 48125 39232 23659
20179 23659 38419 36245 -24227 -70029 -11507 35896 9869 14233 39129 47548 22216 -6080
20167 -6080 -45715 -61009 -63265 -65656 -89628 -41377 -25711 -559 33631 14491 -25483 -47995
20155 -47995 -25383 25085 37804 36188 36781 -341 -18027 -31628 -25151 -320 -32028 -18886
20143 -18886 -25166 -68141 -94828 -72530 -49546 -23260 21346 28988 -15451 -83346 -102241 -92670
20131 -92670 -101080 -82584 -73976 -58007 -29358 -17236 5518 42982 46285 15737 4103 26995
20119 26995 28729 7606 -55957 -73181 2784 8733 -26167 -19664 -35743 -88657 -105096 -46584
20107 -46584 9214 8862 -17120 -16429 -23610 -1474 7650 -12724 -27192 8950 11005 -2709 -24692
20094 -24692 -51782 -57592 -33863 -37333 -58052 -78401 -100821 -118250 -86836 -55933 -86131 -115622
20082 -115622 -80371 -63186 -14 6015 -13571 -27028 11082 34090 56995 49083 39531 41939
20070 41939 20657 -17893 -19985 -18254 -10113 -9903 -16501 27761 55673 34903 20587 41512 26772
20057 26772 32084 9835 16799 18184 22741 10850 -13300 -42869 -65291 -30579 28239 21978 37006
20044 37006 23364 -14185 -40029 -48379 -49183 -5009 -4210 -7481 -25745 -30493 19188 60996 18334
20031 18334 -11807 -10489 -26080 -27604 -2741 -69593 -41348 3800 -50471 -72103 -29591 25975
20019 25975 17632 -24740 -39518 -16379 -41114 -52085 -23283 -18263 -8566 21142 10243 -41310
20007 -41310 -71435 -69063 -30882 -14948 -9803 -1113 -1951 -8815 -9301 -5776 7481 31316 -40513
19994 -40513 -55026 12377 32674 13962 -29418 -36664 18430 27641 -10221 -4145 -24534 -37401
19982 -37401 -19169 -46743 -44805 -52912 -37344 -21583 -39762 -47709 -18919 -22365 -46190 -51774 -49335
19969 -49335 -105833 -87905 -3752 1994 2900 42486 16192 -16769 4767 22163 -17515 -22981
19957 -22981 18224 5121 3389 2220 -37880 -31439 -8437 2927 15911 47831 25117 -2707
19945 -2707 14844 8108 -30796 -58405 -93430 -84077 -44174 -17733 -43277 -12727 29847 94016
19933 94016 120433 111187 58831 48296 83638 81741 16513 -13247 -19007 13954 12851 -29550
19921 -29550 -16429 52113 88459 87876 47303 64928 83275 71995 39392 56606 71644 62156
19909 62156 55278 71086 68471 36154 32310 34896 28113 35808 58060 72148 45205 -6067 -8513
19896 -8513 -10040 -13304 -3792 -27797 -24909 1193 18222 -5400 -3903 25357 10146 -21013 -75855
19883 -75855 -31418 -34510 -47054 -49516 14677 30268 -19837 -55360 -73630 -102547 -107341 -67540
19871 -67540 -38750 -44025 -58161 -47567 -15622 -34257 -64335 -31551 -15505 -18340 -36210 -63746
19859 -63746 -81302 -95371 -80174 -51946 -32341 8178 71283 76900 43901 -23352 -62743 -63507
19847 -63507 -19456 18026 35253 10093 7325 42831 60271 33210 34568 47805 42157 1829
19835 1829 -29233 -27567 -21023 -15802 -21586 -30508 -41285 -20048 18291 -4832 -39506 -34800 -42009
19822 -42009 -40309 -37629 -9389 -17528 -62505 -56970 -35039 3153 2173 -9184 -9401 -7635 -33631
19809 -33631 -34135 -17805 -1695 11755 15450 -3496 9064 47681 31995 -12575 -51293 -40046
19797 -40046 -19223 -20315 -52351 -12236 30830 1270 3899 7457 -12927 26995 44067 72102
19785 72102 38595 46889 53037 64000 28913 25993 43579 47498 -8279 -78521 -70222 -34928 -31532
19772 -31532 4960 -203 -13957 -34999 -30611 20303 58536 42582 36789 27476 44454 20352
19760 20352 27033 41931 60344 86437 87390 80028 77409 25899 19543 73549 111942 101392 108068
19747 108068 111124 125983 182919 301483 463977 667464 863174 868679 733714 606546 535986
19736 535986 555352 660573 796132 876163 888543 812155 673535 536284 417584 372909
19726 372909 432730 555902 774462 1019368 1155178 1093704 989205 910529 894249 940414
19716 940414 1049480 1170437 1222187 1162884 1017971 849088 675314 520575 410308 295641
19706 295641 266043 229076 129085 118499 182227 173669 146311 123092 120599 120458 121452 125209 129487
19693 129487 167746 192070 223960 277424 334823 320469 306610 305453 273568 282333 292602 299285
19681 299285 330567 346012 371374 335576 276903 215478 162624 173549 182302 160014 121554 97418
19669 97418 70469 63339 82046 59791 61379 60383 97944 103154 52833 24603 10299 33563 46130
19656 46130 64376 -4546 -10749 9535 46458 55508 -4438 -31128 -41668 -42528 -36208 -77366 -33472
19643 -33472 -2963 -16309 23378 44449 7965 -32901 -40392 -55266 -51969 -66143 -73479 -29406
19631 -29406 -27613 -17899 -3184 -33773 -25009 -27820 -27877 -30036 -64087 -73146 -72048 -32098 -10629 -17443
19617 -17443 1675 43994 2704 -1447 51230 27348 25969 17552 19208 7301 2044 -45272 -81688
19604 -81688 -61051 -47484 -23931 -31401 -59849 -60494 -48780 -4976 2638 33688 22403 16342 20091
19591 20091 5691 -36208 -24035 -1809 -20535 -11684 -10891 -10029 -14324 -6448 -29014 -18842 -28517
19578 -28517 -56999 -27396 30866 40876 6489 18420 41778 59036 8505 11581 28197 58951
19566 58951 66970 86808 63227 55229 64584 93933 144327 172829 244624 324920 371072 396614
19554 396614 421684 389269 356133 372401 381733 394369 448075 485693 442228 342398 268714 233309
19542 233309 201203 159215 144100 169068 217135 184947 172217 237864 355162 426470 452543
19531 452543 471073 457485 429969 472064 519629 557393 652380 763114 836731 889776 1013219
19520 1013219 1100580 1157885 1131197 1010285 967279 999392 1024044 1079283 1073492 1036451 940120
19509 940120 780173 630629 534772 423228 314254 267602 234539 215893 208429 185829 183765
19498 183765 173766 157439 158485 207003 283101 365187 468951 605041 736804 844829 916007
19487 916007 898336 859952 838845 862014 931430 1009365 1106979 1043572 855242 670474 515631
19476 515631 420991 359491 286084 200241 134405 76154 68836 59199 50286 76949 80263 86083
19464 86083 62161 38986 12949 -14060 -15540 -24735 -29889 -63011 -47671 -67092 -51184 -39328
19452 -39328 -8367 -20658 -39219 -47476 -18036 -21799 11702 33337 38578 35021 56542 62332 7369
19439 7369 17222 48460 30888 4819 -254 -23822 -62700 -30521 13684 33376 22794 -17908
19427 -17908 -33435 -70610 -123776 -100083 -61296 -34055 -1389 19412 32432 45158 33644 60513
19415 60513 69358 121207 147001 127331 105266 140131 167191 145917 145541 108377 103439 89708
19403 89708 63233 76279 52087 71748 78888 60665 28674 69038 100103 90558 56987 57171
19391 57171 103762 137391 166299 155155 69047 12485 -3779 -26675 -13625 -5791 7031 13953
19379 13953 57540 55094 29007 52307 50025 70397 46006 40291 85021 74482 38633 51361
19367 51361 62908 75958 63531 28022 2241 31243 57336 28694 19820 38981 43995 -21636
19355 -21636 -14884 9753 5288 34825 52128 83813 41817 35021 -9018 -34068 -17364 10903
19343 10903 48415 94911 63266 58382 98304 119246 74829 75750 129966 138386 92332 104782
19331 104782 98826 35789 45835 40265 28609 50345 98176 105512 85425 93567 84557 129352
19319 129352 140204 134333 115177 110190 110915 102440 104966 138396 169184 195474 206998 180382 134467
19306 134467 108218 122261 126464 125175 131477 138506 122936 124584 128272 156055 190843 180635 173341
19293 173341 207409 246327 320186 376220 463320 584099 704405 902903 1060502 1106823 1089007
19282 1089007 1006036 952239 997931 1119683 1238416 1221536 1102584 923188 733666 641748
19272 641748 649386 642756 604881 567404 558479 548294 558621 604390 705720 831736 990707
19261 990707 1156730 1230416 1255106 1204900 1098148 1039098 1102425 1170696 1197730 1176257 1081003
19250 1081003 1001419 911362 764712 573465 463070 414978 392921 386091 401365 406633 348872
19239 348872 271278 253247 223498 188856 182910 174516 191323 179729 138894 107735 115269 144365
19227 144365 181442 179449 145631 106768 85721 98922 144231 167756 142950 154041 199720 187834
19215 187834 157579 124343 100491 98338 124969 206589 270165 157554 24396 18668 66271
19204 66271 71120 66068 83093 116706 128980 85627 41033 57001 113273 165829 168925 156918
19192 156918 123506 116100 83601 51295 51465 90698 114961 110153 120965 167637 194813 195671 207382
19179 207382 196445 203197 210500 191050 179535 181708 204779 204868 245062 253903 263754 284564 288489
19166 288489 309663 338368 372884 397048 421407 471548 498648 535707 535815 538379 536754 576914
19154 576914 614244 727800 863415 939542 968720 995071 1041547 1101553 1234160 1364504 1417961
19143 1417961 1443014 1536197 1689334 1801089 1849863 1865778 1953997 2097006 2306942 2607121
19133 2607121 3005071 3363648 3751428 4311102 5154774 6447786 8353019 11407479 16692461
19124 16692461 26613224 44236992 66569489 79258368 74206386 61920784 51754674
19117 51754674 48212571 55472123 74981154 94649128 95071401 77937083 57917041 41129566
19109 41129566 29327670 21882351 17145861 13992042 11785777 10257511 9304826 8747763
19101 8747763 8405766 8175637 8134699 8366448 9034821 10370713 12550576 16174924 22818280
19092 22818280 35888482 58145389 80558934 86293458 75926100 62609510 53506104
19085 53506104 53111060 65125468 87259764 101349696 93977242 74359115 54255217
19078 54255217 38212005 27268980 20221747 15643847 12450807 10080145 8413977 7177285
19070 7177285 6302789 5620805 5113558 4804954 4510035 4137985 3774922 3531787 3358321
19061 3358321 3207932 3254378 3330896 3241218 2935701 2616176 2365195 2303354 2292993 2246754
19051 2246754 2221770 2146508 2005979 1968542 2000316 2142980 2332799 2546997 2715829 2727094
19041 2727094 2594261 2505212 2564609 2746615 3074644 3458229 3674271 3711428 3768140 3869683
19031 3869683 4147476 4605957 5124021 5705839 6406313 7298494 8636197 10651822 14034416
19022 14034416 19975209 30518375 47666687 68058677 83181817 86292825 75585112
19015 75585112 62787079 54882241 55496974 65537687 78084779 84592242 78424774 62552278
19007 62552278 47223812 35124757 26957137 21985529 19159622 17813876 17696861 18975078
18999 18975078 22432756 29995042 45094374 68837728 89461591 96160024 88708787 73633873
18991 73633873 61313459 56574272 62506492 76134447 84682320 82220557 69530649 53278316
18983 53278316 39147213 28500022 21257706 16531545 13365033 11153985 9516111 8223882
18975 8223882 7268403 6683262 6448258 6297535 5873005 5171099 4457651 3923724 3649499
18966 3649499 3590215 3573899 3400382 3046080 2711767 2435282 2221815 2078866 2001262 1952660
18956 1952660 1875328 1857862 1970135 2099627 1991052 1747741 1464925 1258723 1142182 1116843
18946 1116843 1081101 1085579 1126344 1241218 1481442 1905723 2384640 2470286 2171589 1821616
18936 1821616 1478173 1285610 1298127 1393198 1418494 1283007 1119421 949255 814960 744951
18926 744951 688808 697753 773508 932599 1190888 1495515 1491496 1234386 1032502 862977 702664
18915 702664 593149 605661 597855 623355 627004 600428 592719 666441 859226 1188168 1797644
18904 1797644 2763178 3375735 3060311 2433430 1842252 1373672 1016534 811814 707158
18895 707158 639883 601135 522829 461586 426071 347753 294959 340847 366967 356145 331511
18884 331511 328501 282116 257737 254718 256698 240054 203459 181711 165723 142112 99760 148621
18872 148621 219463 253994 309341 264292 194751 154157 160850 167450 181147 218213 219669 160302
18860 160302 96376 28990 8434 49311 85413 80045 56413 75475 83235 100747 128688 98278
18848 98278 95242 65582 57110 82996 96103 117348 147751 147819 104121 100911 112989 127331 167230
18835 167230 180066 138085 112851 101960 76300 67746 85511 55105 8200 37702 44828 45877
18823 45877 42832 72306 55234 49010 56115 54972 26883 10454 15704 42813 32444 -4025 -6052
18810 -6052 1491 9320 16496 29213 37535 49895 57453 17199 -24450 -50674 -33474 -35934 -14385
18797 -14385 -9448 8171 33505 -4022 -27834 -37654 -35466 -36685 -12034 -21403 -4897 60480 80337
18784 80337 93265 91383 90515 109360 137604 142772 145298 120336 88907 89010 80084 71290 45134
18771 45134 57143 102404 72373 65370 61461 12678 33844 95183 128721 236376 361723 532968
18759 532968 806366 1012121 1010841 900888 761850 644509 605820 702040 905143 1074731
18749 1074731 1027057 862290 733338 586225 483058 383449 291808 221827 212786 204200 179725
18738 179725 207924 184619 155950 140274 160315 199658 244260 243932 243311 296419 456255 710315
18726 710315 862378 812198 675159 565763 506996 474659 544017 734484 902990 857774
18716 857774 718416 565242 420174 325190 256646 269734 283389 239921 231380 299261 358087
18705 358087 409218 461163 479556 482794 473798 422245 339531 301578 315969 351214 359975 428766
18693 428766 602054 864383 1126966 1268520 1334504 1261074 1074724 880120 726348 626522
18683 626522 528601 498789 491101 505513 471852 424821 406111 380606 366796 392750 439938 451707
18671 451707 433107 393218 366527 312937 246429 216888 165309 114966 79891 79419 85610 79156
18659 79156 76076 72091 79307 105530 119614 162042 217347 237619 281132 355449 395856 407499
18647 407499 388504 351172 320005 295423 222013 161874 145488 130864 100003 59279 51530 46849
18635 46849 27063 41032 42712 52139 60380 53795 72217 90254 84915 58929 57570 56776 87030
18622 87030 124512 88872 68267 89207 66191 58876 34570 15599 -28675 -29781 -31868 -7958
18610 -7958 -14166 25782 36838 52005 32801 33324 34921 -5273 -49234 -28499 -1078 -17563 -11333
18597 -11333 -7746 16791 44604 13840 19661 30280 -10574 -25637 -20837 13158 18472 40781
18585 40781 12069 11751 5928 -10173 28952 685 -24923 -19142 4267 12016 19379 30065 33868
18572 33868 64876 33845 8393 44769 84722 9088 -64995 -63710 -7412 -304 -28998 -13623
18560 -13623 2209 5258 11569 44240 101329 124844 116151 66709 -15708 -13321 -14074 -28613 -13499
18547 -13499 9137 49611 -3483 -47220 -37634 -42232 -64410 -62997 -33576 -41192 -59656 -51730 -75702
18534 -75702 -105282 -75567 -20790 3887 8867 6470 36745 44446 28324 10804 -12040 -5036
18522 -5036 64182 113264 155300 198548 240486 250898 274094 317217 317721 242205 212665 229429
18510 229429 280962 337266 345242 286224 221196 176247 107440 112178 95591 52407 43948 77509
18498 77509 121806 111808 89487 114662 110332 108280 144580 186451 212098 252704 258503 260120 330208
18485 330208 394520 425097 456624 457177 421221 364029 406295 458145 553819 667661 744960 738252
18473 738252 665264 587065 469844 395245 401523 464270 521290 513481 486201 435387 354636 297313
18461 297313 245670 207911 204795 224004 225605 210443 272074 294611 311536 366976 415037 395923
18449 395923 347560 303213 300360 328479 363435 470977 497035 476010 381435 246136 142096
18438 142096 125134 164133 144005 81549 54642 -17552 -96862 -25128 81057 194601 295392
18427 295392 318004 314994 305705 288660 256904 239550 201628 206966 195454 179334 180469 159219
18415 159219 171993 166879 111639 88235 115063 70435 47879 93070 107478 151440 165863 173821
18403 173821 154551 137592 135027 123546 105313 141539 129857 130390 140973 142631 132005 109802
18391 109802 116500 150653 184340 181163 181158 167784 163803 123276 73000 28130 29097 78624 101382
18378 101382 62319 20107 8174 11334 34890 50583 46741 34955 45202 61138 65430 93623
18366 93623 135643 155768 97334 57965 62847 68818 118367 107066 89108 74326 84452 111973
18354 111973 107904 106039 124319 146285 165435 212792 215493 238566 216611 176237 145279 96559
18342 96559 86986 71738 57368 52701 68700 86460 95690 83306 83508 105538 74973 54403 52850
18329 52850 40396 20462 -20200 -8693 -14846 -11218 49367 71731 39620 31147 75685 66766
18317 66766 29323 12860 5574 46425 58716 24018 1394 26973 20273 23216 44847 31960
18305 31960 66708 94925 107620 118684 111727 109701 120517 143434 153575 121460 141901 175810
18293 175810 174425 111411 91118 55038 -10272 11058 75574 76576 72651 64518 68609 112104
18281 112104 99316 87725 55571 40635 7970 -3222 51067 108661 123542 156705 209762
18270 209762 219832 149121 90116 123315 135819 176059 216197 279799 273035 162980 100763
18259 100763 92631 70679 52846 70137 62653 39218 81307 134189 145988 183904 191704 182016
18247 182016 173264 223740 225085 193350 185763 210937 219998 236304 233708 192242 169320 115167
18235 115167 128556 126185 146926 158241 178284 226106 248951 239310 269451 393237 567608
18224 567608 663204 551604 318649 137871 85970 123759 139357 174673 255304 286011 311356
18213 311356 381107 434206 543822 639939 804543 1041044 1157079 1216297 1176264 1088440 1029769
18202 1029769 1007603 1060704 1188986 1237351 1139497 1016651 980258 950603 980180 1076333 1153613
18191 1153613 1179427 1296255 1450218 1570379 1733879 1984501 2238623 2543050 2793012 2967100
18181 2967100 3023656 3109616 3356334 3792027 4417335 5151884 5891628 6799824 8235044 10652358
18171 10652358 14949300 23147926 39175812 67102959 94218232 92836669 74369465
18164 74369465 55027497 38591573 27322076 20322295 15931010 13053648 11059243 9640652
18156 9640652 8695907 8196443 8098307 8281059 8753231 9518932 10660682 12596142 15903018
18147 15903018 21826488 32849994 52599994 79336950 92721197 83155698 67558318
18140 67558318 53866905 46095601 47074026 59196081 81685616 95942508 86707016 68645864
18132 68645864 50950833 36864530 27403912 21527857 17891770 15486767 13687360 12137819
18124 12137819 10845443 9903800 9298657 9045611 9232213 9887637 11180247 13420441 17297476
18115 17297476 23990317 36334951 58884931 85946705 91476938 76791653 59899325
18108 59899325 44939790 34729393 29301314 27607448 29175454 33872277 42621207 59043263
18100 59043263 91746654 154228446 242059990 314980636 331533748 288184513 217939232
18093 217939232 153883078 105733720 73782959 53756759 40755250 31852433 25463895
18086 25463895 20828098 17583169 15448528 13894468 12390566 10875428 9411312 8115612
18078 8115612 6972131 6001636 5256276 4720521 4263692 3865406 3503626 3225964 2940301
18069 2940301 2737215 2633240 2707245 2928290 3323592 3661334 3754607 3606083 3391399 3149539
18059 3149539 2739960 2362170 2070151 1813588 1567577 1379734 1248395 1192661 1124200 1057712
18049 1057712 1007122 980497 978559 952965 890634 846334 861420 918809 885999 841879 789855
18038 789855 745796 718853 671993 619958 621749 617533 658637 676688 661982 607931 589559 556075
18026 556075 551081 562694 530092 521237 532648 591951 581864 537235 534100 477573 426104 409484
18014 409484 389888 382979 395229 373547 374246 393525 357825 356945 352290 365537 368360 356272 362571
18001 362571 339241 313484 304095 315504 319216 324801 287343 273133 314675 288145 278078 308071
17989 308071 332593 317862 303868 301584 273808 241224 203644 218866 208077 234993 262091 241102
17977 241102 288594 336376 382071 411185 470022 492875 458685 344997 224804 137664 135688
17966 135688 166743 190243 184095 143965 173930 179072 175652 157356 125740 114547 96671 100871
17954 100871 101392 146308 168222 151862 167281 122507 83907 58685 63854 92324 98288 100322
17942 100322 100198 142919 130177 134372 178492 187677 171210 139619 138980 116702 155574 130317 87304
17929 87304 103141 101922 61083 76168 87761 85737 115096 144245 116194 75853 108663 135471
17917 135471 134012 102416 67665 82652 111952 73968 63120 92966 106300 144341 93249 43956
17905 43956 37757 23412 23949 32016 58674 91168 70442 68055 93117 107927 121944 101690 54404
17892 54404 40881 23298 12952 20698 52037 66709 86585 100575 99275 72296 47722 4900
17880 4900 -815 38527 60105 29953 -507 -34474 -18612 3240 20998 8388 -13368 334
17868 334 8602 54708 9206 4963 37060 67532 43973 12532 23718 39982 35065 47439 12027
17855 12027 -4961 16127 55224 50989 32667 25351 14365 33877 6701 -24927 20027 60504
17843 60504 66960 45141 25353 30972 4772 -45631 -47675 -60339 -79934 -15320 30665 52858
17831 52858 17329 66167 110372 91709 78806 25812 -6844 -34793 -43449 6688 37111 8802
17819 8802 -12454 -6808 -36706 -46636 -45274 -91426 -125103 -103554 -89476 -53067 15411 54817
17807 54817 41718 23542 8105 -3967 -21034 24562 54771 62045 95338 111677 105013 60741
17795 60741 35911 42254 65287 82944 52735 -10664 -38243 -62112 -30841 -7111 21823 2711
17783 2711 -19005 -30532 -61638 -91451 -39363 -18453 1830 -15813 4096 -17164 -29920 -35661
17771 -35661 -52854 -74333 -97843 -133030 -224411 -279303 -215367 -53514 79438 115857 157645
17760 157645 184442 163517 187438 191500 220502 170487 130603 114357 126157 83990 30726 33705
17748 33705 34623 59388 66684 56644 68317 105179 94504 59708 24852 27715 64095 79921
17736 79921 53956 28521 8827 10895 23014 71025 61341 28547 66341 95057 133127 138165
17724 138165 110352 69507 58365 37226 39159 40689 70159 83779 61109 73497 94087 81887
17712 81887 64542 10178 -11196 54 46770 53888 42663 29309 44494 89085 60486 49394
17700 49394 3709 38410 29439 10500 39307 70840 92070 43612 32771 64690 30204 30547
17688 30547 38536 60483 78029 61255 27046 9145 36966 34817 5397 4576 5586 24200 46380
17675 46380 36558 64887 69059 48037 19460 25790 62029 55817 7797 28395 48386 65405
17663 65405 94926 72739 60312 68448 53731 32588 16842 31239 12910 17707 49198 82321
17651 82321 91906 99490 79091 48470 29551 61257 71079 59008 62372 64073 40231 50417 50838
17638 50838 40024 54057 95645 130741 137394 112174 99507 115308 103464 109867 149345 184683
17626 184683 236420 260129 334168 375441 362498 337490 281148 209727 136893 109157 114365 76699
17614 76699 23099 65777 83705 79089 92892 88557 46291 71062 105537 123647 92797 129833
17602 129833 208110 300977 355610 374569 365548 345423 321746 253039 222136 280235 363425 398064
17590 398064 386031 342665 298536 224732 188403 159844 154284 150437 146043 130946 71410 51110
17578 51110 69991 74129 76305 102753 94156 76856 74533 83731 171389 231547 299653 315593 264482
17565 264482 223035 212215 142535 80239 64648 44898 42273 28277 -15592 -18063 -3080 5988
17553 5988 36753 85754 70471 18403 8761 -12253 -37674 -11088 13281 16255 28133 35161
17541 35161 39791 46430 66036 74332 63988 41840 28135 5079 7515 16578 23805 41018 79373
17528 79373 71615 20396 22534 21256 -15812 -19447 -31845 -2648 45859 44299 34619 16115 17531
17515 17531 1796 20668 34156 48144 78528 95034 78013 106241 123970 132081 162051 164154
17503 164154 255239 428781 619961 822932 1052053 1279751 1334324 1232493 1039393 839193
17493 839193 640935 483800 358755 265373 209203 183014 129775 107137 76331 66050 70636
17482 70636 64580 41466 9290 -2321 -22900 5540 16757 -1815 4573 10721 277 -5236
17470 -5236 29860 45290 11226 -16154 -19375 -50220 -40211 16906 69405 37647 30998 46575
17458 46575 43109 37619 28147 83438 86555 46462 -7444 19318 42542 20591 3121 -9787
17446 -9787 -46056 -50927 -29774 1123 19841 52519 54205 26326 -2518 10233 -34050 -16922
17434 -16922 11227 1816 -3707 -12588 38154 49920 43880 76449 59101 47026 25707 4582
17422 4582 7558 29913 16096 14153 48486 63061 45110 30455 15677 24142 24559 17976 22110
17409 22110 13290 13080 26144 46982 85057 99685 65050 67536 37202 2327 9050 -7890 -14806
17396 -14806 32739 12360 -2820 32222 35468 -2904 -45857 -67296 -27592 -56234 -68186 -30239
17384 -30239 52232 47806 23902 13792 14510 15369 52701 18940 1827 -14850 25711 10885 53
17371 53 34348 35499 11670 -7690 -46185 -21612 -267 2837 -8950 -20438 -29267 -34867 -16346
17358 -16346 14109 41033 53536 48080 29513 49565 59696 28983 32475 42005 6768 -25475
17346 -25475 -20608 -1289 -30501 -47638 -59311 -71610 -74925 -117354 -103638 -47354 -58521 -31917
17334 -31917 -37553 -34791 -20641 -1487 11827 7795 -16266 -4916 37469 13764 -38566 -84837
17322 -84837 -96487 -104744 -99218 -111001 -114431 -78665 -30333 -32745 -44424 -13638 -8634 17993 -1639
17309 -1639 -19940 -363 -7749 -24825 -13040 1220 34870 17284 -3716 -17848 -10793 -17841
17297 -17841 -19195 -45392 -54182 -20449 -7644 -21565 -7988 3571 13990 18621 38369 37859 24996
17284 24996 1049 18795 26251 -19242 -21514 -362 677 -15532 -16390 12377 20534 7066 -3128
17271 -3128 1286 19991 31076 33124 -2282 -23511 -9263 37734 61772 63557 37075 -19126
17259 -19126 -19608 -30898 -51373 -50759 -53015 -22175 -2146 14757 2903 -23198 -22825 28919 38488
17246 38488 23969 32182 -25177 -55835 -26287 10206 -10738 -20706 -3605 -9057 -22893 -34539
17234 -34539 14497 58429 24935 298 -1502 -1091 7681 7238 -19554 -17874 28504 25577 15869
17221 15869 25154 38694 17927 -15880 -49437 -43171 -40912 -42634 -12237 10852 -3698 -5558 45380
17208 45380 56644 68889 97791 52034 24767 -8164 -5223 -30586 -43246 -37308 -17036 -6715
17196 -6715 -34435 -11835 -9899 -10376 24392 12272 -21491 -46789 -16796 2692 -4798 -13570 -21210
17183 -21210 -23692 -7855 5478 14943 3972 3238 17717 15145 19560 2224 -15006 14387 -27782
17170 -27782 -36848 -5299 -4470 28381 2494 -26769 -37777 -3371 37936 30998 -6633 -11093 -1724
17157 -1724 28083 20083 22265 25922 -139 14714 7250 39686 15154 -17740 -16204 -21406 -13268
17144 -13268 -13370 -19799 -32588 -8688 -24730 -67925 -22049 -40164 -50736 -24523 -32633 -23621 -23183
17131 -23183 -20721 -4664 30827 59283 43170 -1390 -48243 -68883 -45171 -21136 -19594 39623
17119 39623 60730 -2097 -55778 -66155 -57303 -35374 -12599 22411 27554 -14322 -19222 -37935
17107 -37935 -9695 -8842 -13365 11222 10506 -30441 -27137 -5674 62629 39141 -50339 -60396 -48812
17094 -48812 -4221 3943 -32310 -39227 -62057 -53831 -16345 -15875 -3477 26354 47022 64534 61379
17081 61379 47280 53527 27903 -2972 -16733 8407 -15343 -61317 -49030 -68765 -70845 -61800
17069 -61800 -41372 -27471 -44543 -79027 -57719 -49294 -29022 -65326 -74202 -56250 -12859 41902
17057 41902 41789 20128 36896 53794 42571 3131 -21335 -37025 -19982 -37128 -57007 -72118
17045 -72118 -42407 -57646 -82953 -83228 -75586 -65635 -47408 -35788 -26655 -28884 -54266 -68584 -74545
17032 -74545 -57187 -40083 -63045 -35962 -34812 -55347 -38097 -16679 -6608 -2146 -9137 -33133
17020 -33133 -45469 -59161 -16216 -5780 18467 19374 6763 -16601 -13418 19194 25949 4922
17008 4922 -18510 -8786 -1156 -7514 -26267 -22509 2891 28799 30546 50823 41827 41613 42334 44360
16994 44360 62880 59180 43809 49763 51272 52360 44053 -21080 -66917 -83479 -90912 -113518 -57697
16981 -57697 -46808 -35086 8835 20784 -53428 -81837 -52580 -37074 6253 8763 -16388 -36168
16969 -36168 -59330 -48962 -53959 -76202 -32068 21976 28509 19146 40837 42285 39126 5527 -17138
16956 -17138 -1135 16714 4880 16701 25652 33234 7074 -7603 -66370 -121843 -99941 -40142
16944 -40142 -28896 -33863 -36583 3610 7622 -11650 2929 -6666 4819 31409 33698 -18289 -41539
16931 -41539 -61139 -7807 9295 23229 2904 -31266 -73423 -30968 12021 9728 -28424 -4617
16919 -4617 -212 3134 23220 29191 27412 47589 24432 -6209 2742 140 5276 -19540 -36373
16906 -36373 -27702 -19320 -2631 -32748 -34632 -13659 -13164 -10781 -18888 -26402 -28923 -41749 -46963 -46136
16892 -46136 -45103 -22266 11081 -15234 -31651 -31535 -41826 -34657 -18967 -151 10071 39304
16880 39304 45481 9161 -29871 -22286 -27583 -48751 -29649 -4400 13197 18250 50886 40622
16868 40622 28731 3317 -1657 -30925 -28074 981 3694 -9690 18568 21831 7026 15173 11551
16855 11551 35230 51154 54613 16206 -25842 -30716 -28577 652 3453 1509 -9687 2661 18399
16842 18399 34924 20880 13163 -10852 -24387 -28728 -56909 -55512 -13833 11658 -70168 -73831
16830 -73831 -66291 -80357 -43914 -46663 -27714 927 432 9099 12790 55944 80525 73825 63159
16817 63159 59857 44280 -8538 -16715 16728 60907 62538 -348 -16161 -17032 -1803 -2746 -47585
16804 -47585 -56336 -24963 -11914 6282 29674 50537 61693 57303 37054 -1056 11600 10131
16792 10131 -21686 -41321 -54257 -32836 -79496 -84973 -64537 -44096 -37761 -60631 -38772 -22447
16780 -22447 -36748 -20878 -19616 -12166 -39789 -12566 -21637 -37069 -24740 -43075 -48918 -8392
16768 -8392 -10888 -9575 -22957 -15885 31106 13200 -35685 -72919 -99956 -99037 -134346 -126332 -110692
16755 -110692 -104122 -83364 -52635 -42866 -11414 2420 -38481 -16775 -47188 -30856 -54834 -61966
16743 -61966 -23081 6390 31380 43750 31150 -8247 -6849 740 -458 -7185 12484 53051
16731 53051 12380 -47008 -54003 -51571 -30269 -32553 -67263 -43133 -12001 -25767 -387 19058
16719 19058 18573 15389 10183 -5965 3326 8183 -8039 -17683 -8972 5629 -5300 7003 59308
16706 59308 76395 45966 5184 -18088 -21830 -21990 -13595 -9861 14714 15135 -17206 -33282 -43984
16693 -43984 -89791 -58840 -3773 -12115 -52011 -35492 -9462 -7213 -9616 2936 18476 -14156
16681 -14156 -63406 -28908 -840 -7916 -53108 -77362 -65997 -83605 -28664 -8391 -8056 -16328
16669 -16328 3006 30942 1768 -32354 -40095 -40741 -6785 15500 29375 11001 -14291 16995
16657 16995 4612 -34723 -57709 -47411 -61332 -48864 -83405 -73956 -37687 -22446 -51608 -48375
16645 -48375 -55747 -32071 -19195 -16315 -12451 5896 -14854 -27925 -20972 8204 1829 798 -4123
16632 -4123 -43052 -60881 -62787 -52952 -39023 -42475 -50159 -67450 -71407 -28701 -32001 -64886 -54684
16619 -54684 -69134 -39069 26810 30235 46072 66355 47066 5286 12412 15940 14544 25851
16607 25851 44523 34204 52473 62138 48819 18356 21171 -15215 -3865 40333 32426 17529
16595 17529 3768 -20242 -3426 11221 21956 -25097 -60636 -47768 -97275 -119859 -84704 -40697
16583 -40697 -57684 -53701 -52948 -50935 -40116 -13739 31870 39259 -8898 -25257 -58324 -75273 -34317
16570 -34317 -284 -5333 -6907 -1797 32812 8387 -7050 34458 86796 80286 53989 19754
16558 19754 21249 23933 3617 -17741 -31861 -27332 -34124 -69157 -80935 -44817 -11781 -13167 7339
16545 7339 9091 -19358 -11813 -10576 -40899 -63867 -35271 -17362 -60949 -58004 -33802 -49911 -4734
16532 -4734 54625 66062 45983 44424 22902 27233 449 -14317 2348 -30577 -44299 -46745
16520 -46745 -36388 -8787 8917 6085 13823 19636 2580 22476 67815 29885 -30444 -73170
16508 -73170 -86067 -58837 -39525 -56706 -16062 44 5480 -6774 -1792 -7211 -1723 -10650 27026
16495 27026 8548 -43137 -37676 -24816 100 40613 17918 3994 52864 72813 46915 18694
16483 18694 11992 -32499 -42712 -53666 -59816 -52963 -52354 3980 38025 33429 16381 -12006 15495
16470 15495 -29683 -80997 -55527 -22039 -697 22934 10632 -13661 -42932 -25154 -10458 -48231
16458 -48231 -95556 -26701 -24549 -49958 -84024 -69414 -27812 -21715 -37304 -28268 20926 40501
16446 40501 25031 35364 46828 85738 78031 64517 73645 60416 48374 47789 66461 66764 61611
16433 61611 82272 67790 -9596 -48245 -50080 -59241 -73534 -41682 -14842 6614 51575 54331
16421 54331 17076 13766 38258 36465 9595 -9360 5147 27000 2801 48191 74827 56774
16409 56774 2056 -5887 -7074 39182 119649 99819 51137 26852 55516 69387 46637 58021
16397 58021 50115 53238 51221 -3808 -19023 437 -7386 9561 12026 -7480 -7083 13670 31464
16384 31464 47586 29474 82267 88644 46335 20126 11187 -37187 -15224 -32468 -59911 -77760
16372 -77760 -31127 -40664 -22198 -1916 -8906 2441 -32524 -78123 -89271 -108513 -129701 -128696
16360 -128696 -88021 -81792 -85277 -45403 -22106 -38615 -32931 19597 19228 -42551 -84324 -67017
16348 -67017 -59142 -48639 -41222 1804 -32374 -27224 -27634 -20697 -25811 -41015 -47274 -20537 -18943
16335 -18943 -22564 -9345 -21037 25461 39355 -10474 -62304 -28006 -27074 -21977 13212 52166
16323 52166 50715 51258 33124 -36728 -33634 -23785 -18824 -8582 4987 -14702 -25501 -62458 -101501
16310 -101501 -37370 11073 -7547 -52865 -17912 43922 49992 25992 5987 -7933 -20866 -48553
16298 -48553 -3616 26945 64387 95218 76682 44468 10828 12201 13632 -27402 -38894 12356
16286 12356 45610 37138 19715 5167 -14067 28575 8834 -37430 -22187 -30118 -38534 7659
16274 7659 43867 37386 44169 15323 14933 7484 32389 77727 68347 37499 -4818 -33422 -24911
16261 -24911 -22524 -16307 -39516 -19061 21704 -13681 -24024 -38248 -57455 -52399 -67521 -70835
16249 -70835 -5257 -7217 1759 11684 12657 -20191 -65872 -42874 -4748 -14903 -10620 457 21354
16236 21354 23447 31301 10015 -30022 -42454 -38787 -2300 -2955 -18133 605 21138 23468 14773
16223 14773 33491 -19044 -31681 -12316 -22033 -46619 -39741 -2370 -3115 -21676 -32104 -24783 -22395
16210 -22395 -6887 -4991 -42820 -81665 -88495 -64914 -54687 -31330 21322 23352 567 -11996
16198 -11996 -7363 -13213 -38978 -50287 -69628 -69146 -52463 -47359 -32592 -23730 1996 -12539 -10222
16185 -10222 18484 17000 17064 12861 -2920 -32068 -14774 9197 3699 -34576 -38341 -30878 19442
16172 19442 10314 8807 37974 -8551 -27274 -13922 -30936 -10991 23732 30928 13574 9453
16160 9453 33561 47016 60548 27966 -20072 -10724 25076 6124 8020 23737 35933 75445
16148 75445 126069 117509 89814 54798 35560 17084 4114 -53014 -94823 -57710 -20791 -39124
16136 -39124 -22309 -10844 12656 29301 7431 -36036 -34759 -14519 11987 633 -54942 -52171
16124 -52171 -30613 -32327 -58525 -77461 -50384 -71736 -69394 -38892 -17630 -41244 -32992 -28044
16112 -28044 -22068 19593 1123 26105 49061 26395 -15487 -38363 -50685 -25198 -31756 -43604
16100 -43604 -20036 -6072 -16804 3622 -24839 -47844 -36584 -27126 10424 31776 6987 -12216
16088 -12216 4627 -4134 -27645 -26080 -28511 -18106 -4637 10016 29086 60452 68690 46984
16076 46984 -10427 9144 12343 29360 19184 4510 -5969 12616 -14030 -8257 30012 25688
16064 25688 17367 -850 -17945 3677 -17125 -11799 4720 15840 29821 6174 38596 60299
16052 60299 11390 -26550 -39685 -65287 -69902 -29314 -2669 -9993 -8686 8860 4260 31304
16040 31304 57961 51580 34733 15721 -15134 -24386 -25418 -30487 -20358 -42260 -57907 -50259 -51435
16027 -51435 -51430 -65092 -84208 -46766 -2631 -7926 19455 -9022 -16440 -37999 -834 42405 57581
16014 57581 12718 -47246 -34441 11589 20217 21730 -27867 -78229 -86486 -78240 -40738 -37072 -45470
16001 -45470 -36329 -18365 -36759 -20979 -24083 -55575 -64864 -66138 -31252 785 -17666 -40675
15989 -40675 -43708 -37626 -54281 -62413 -38208 -27189 3818 37158 32527 6150 24965 35767
15977 35767 42188 12339 -2410 18054 -1078 -27447 -31725 -46630 -26272 3034 14365 9661
15965 9661 30785 45429 41960 45782 15479 -10949 -11488 38442 25746 -12528 -15013 10867 -1306
15952 -1306 -26927 -46145 -47071 -19441 -351 -28435 -40187 18652 44328 19968 8607 -36171
15940 -36171 -74588 -40318 -33381 -47596 -14240 -12717 -56303 -51379 -19617 9932 -2203 8484
15928 8484 1622 -3500 -18352 -85996 -89165 -46612 -54678 -25842 -11699 -43776 -27518 -16985 -29462
15915 -29462 -1952 36459 61417 92092 57335 14552 -47947 -47553 -28642 -12863 -43066 -52934
15903 -52934 -27745 -18346 -10532 -40110 -67594 -44514 -25860 -57082 -42088 -1083 -23756 -13416
15891 -13416 -5153 -23160 -36241 -48976 -41585 -54987 -35009 16553 17191 11265 29648 32004 -2155
15878 -2155 -23640 -21253 -37951 4840 65959 47364 45341 106308 135290 100992 24026 18337
15866 18337 33105 44421 22081 5706 17581 15467 -7024 -53553 -84869 -82738 -82093 -53143
15854 -53143 -43855 -18944 -27306 -39882 -13988 -2562 -32017 -17986 -3152 47914 52107 24613
15842 24613 17813 41979 68039 30338 -6682 11417 -5044 -34761 -49725 -60935 -68907 -37615
15830 -37615 -11363 -42273 -544 16440 29572 32613 23809 14841 13941 27085 -10256 -10581 26668
15817 26668 -4654 -10114 23630 31798 -3184 -33844 -17616 -8949 -14966 40558 61336 56743 -3640
15804 -3640 -7162 -29283 -53628 -35329 -17491 -28333 -17813 8825 -7136 -20504 1102 26927
15792 26927 1017 -3797 -36056 -52871 -35152 -28870 -51730 -56028 -45099 -33691 4281 -5246
15780 -5246 -16043 20356 25823 28568 27960 -12725 -33718 -78467 -108335 -88706 -22907 -2687 -55454
15767 -55454 -45440 -31146 -8523 21803 15645 -21251 -31749 -60472 -82521 -118825 -117743 -106552
15755 -106552 -61514 -18072 -8586 -7295 14795 59136 34609 -23375 -62648 -71507 -29311 -22325
15743 -22325 -36974 -11416 3971 29641 56361 55071 22270 -11676 -33276 1314 21890 -4393
15731 -4393 18083 22505 902 -27141 -43080 -34265 -56979 -52109 -88409 -87339 -59853 -29106 -31392
15718 -31392 6267 28358 28023 30742 27033 11829 -9132 -46608 -40898 -17451 5997 28133 54522
15705 54522 39530 33520 55854 21771 -21304 -35934 -32409 -41559 -26089 -39431 -83334 -60916
15693 -60916 -42952 -36338 -5361 -32904 -36615 -37402 -51816 -25689 -9959 3602 -30623 -40165 -50055
15680 -50055 -32928 -28347 -35649 -7912 -7931 20758 7507 -10919 -9060 -10310 35034 62204 23974
15667 23974 21812 -7182 -28601 -32826 -41273 -48719 -30192 -9840 13140 21019 -7193 -9205 -1035
15654 -1035 -23168 -43556 -38770 -30858 -37684 -28673 27480 58150 26889 23207 4806 -6741 -26053
15641 -26053 -32574 -6250 26100 53021 69442 27053 14948 33513 14693 -8270 7819 43773
15629 43773 55280 8750 2147 -5074 -13073 -10834 -21214 -36040 -53507 -38571 -58651 -49773 653
15616 653 49079 46997 -6737 -56412 -89683 -104655 -103075 -36765 33807 36111 33753 18108 5327
15603 5327 -24860 -27547 -17063 -14992 -10125 8411 12898 -18380 -36746 -59301 -76623 -70126 -43756
15590 -43756 -4191 -35685 -73762 -85782 -66603 -71555 -71274 -56219 -19105 -23531 -48754 -20673
15578 -20673 -19380 -23302 -27736 -11665 -40128 -60858 -78233 -70002 -23146 -22576 -23426 -27679 -53471
15565 -53471 -32273 -20903 -10926 8950 -2490 -2274 16720 29679 31995 -7792 -11617 -36892 -25914
15552 -25914 -26101 -54378 -28076 -54630 -32613 17513 15558 -17482 -31235 -17182 15708 24696
15540 24696 33428 -14206 -9891 -7592 -27508 -39642 -37402 -15201 -15130 -11734 7481 -19663 -8283
15527 -8283 20133 5166 -747 -11457 -30966 -69232 -87952 -99305 -107191 -100384 -93319 -97996 -72572
15514 -72572 -64318 -53083 -16260 -18007 -35948 -14084 -14424 -14442 45208 34168 -55650 -83198 -86859
15501 -86859 -67439 -32464 -44583 -61551 -98805 -40072 12263 -32429 -32898 23160 70807 60373
15489 60373 18540 -18757 -39883 -21764 8444 4244 2866 13903 -7641 11486 20452 5941
15477 5941 -6433 -17251 8639 11191 14480 76765 82114 40705 -23353 -46615 -41574 -14110 25791
15464 25791 34806 10207 -44575 -49860 -42266 -19874 -24930 -23870 -62731 -40096 -3723 -13825 3922
15451 3922 35555 30087 28878 11916 8983 -18339 -29278 -50627 -62774 -63552 -61332 -49566 -28963
15438 -28963 -25901 -14567 1089 2094 -35714 -49181 -11084 11489 6399 -24851 -24488 -9753 -49312
15425 -49312 -73312 -76236 -72546 -53268 -58865 -111622 -94375 -55519 -31166 -20924 -50519 -66980
15413 -66980 -63698 -67976 -108844 -95384 -70929 -85673 -79804 -95504 -95574 -66550 -22997 -3868 -4955
15400 -4955 -2752 -18692 -25292 1034 16150 739 7060 -13315 16463 15698 -37434 -92494 -86960
15387 -86960 -68464 -25007 2452 -13853 -14830 -5916 -35103 18322 32058 29920 17230 -17054
15375 -17054 -20259 -50928 -44559 29408 51342 40341 7924 -23129 -50298 -47440 -35532 -55222
15363 -55222 -26074 -8442 -10450 21947 -1525 -5975 23962 42291 42272 42292 66614 61495 35559
15350 35559 23415 36629 64427 55976 54462 38059 13005 -23524 -23058 -25386 -7585 43082 33233
15337 33233 15422 2033 24440 27844 -481 18152 -19108 -8241 12701 344 -386 -56122
15325 -56122 -107838 -110853 -113010 -80317 -47399 -20980 -30398 -44289 -55096 -85005 -82515 -55961
15313 -55961 -17577 -8795 -15275 -49195 -57924 -74580 -34430 -13839 -14412 -17115 21490 7484 -18107
15300 -18107 -49689 -48218 -67272 -73659 -31062 -3128 -6012 -947 -5003 4242 6963 9249 23235
15287 23235 -20720 -44168 -37770 -21181 -32760 -34633 -19473 -3433 31732 45174 483 -46826
15275 -46826 -33102 -12166 -5587 -45569 -27833 -21151 -13758 -28228 -50123 -32598 -33915 -75140
15263 -75140 -58926 2743 -11427 -38112 -43918 -18267 -26669 -42069 -52733 -30604 -14507 1554
15251 1554 -1414 -19417 -11725 -25270 -28896 -12445 -19626 -38115 -14900 -1921 -28703 -38518 2911
15238 2911 21419 1420 -9843 7272 50521 68315 63995 12789 -14689 14877 26109 37675
15226 37675 52774 12249 -3625 24106 -31055 -73701 -22094 9668 34214 23912 36211 32451
15214 32451 30355 6013 16210 3649 11024 26961 29552 12855 -13027 3911 18145 11403
15202 11403 -24582 -35544 -62504 -55977 -27662 11187 13396 530 -51947 -67827 -44073 14610
15190 14610 20441 2851 17963 -15452 -28764 21433 7088 4299 49956 17494 14346 36462
15178 36462 27572 6278 10579 10120 -4052 -20186 -49893 -49886 -55564 -38516 -33299 -37436 -41268 -52586
15164 -52586 -84102 -114274 -76695 -36092 -46229 -16840 -29389 -41800 -23924 17469 6988 10414
15152 10414 -33421 -34922 -18960 -7181 14196 891 34305 47581 32989 58993 75047 77318
15140 77318 21020 1041 -28372 -31356 -27734 25243 20771 3441 37698 46974 21336 -3700
15128 -3700 6208 4843 231 -14498 -860 3415 26023 42606 50891 53348 25051 -42101 -61218
15115 -61218 -42580 5481 5483 -23020 -61590 -81556 -66002 -49497 -34633 -21537 -9723 -12696 -11
15102 -11 -2468 -20640 -32270 20644 -13651 -14404 10397 -30505 -54598 -22418 -4621 28456 49697
15089 49697 27721 10473 33317 44499 49266 43217 20212 -5040 1643 -4505 31345 83851
15077 83851 60731 39007 8023 -43744 -82597 -77756 -42246 -15210 15559 32612 8226 25038
15065 25038 31016 57281 40390 54869 13016 -61067 -38877 -18187 -67480 -61736 -45147 -32856
15053 -32856 -44575 -72487 -76522 -56346 -44095 -14383 19373 -251 12990 17619 13928 -12102
15041 -12102 -13587 11897 11517 39625 7273 16213 5842 7135 14854 26879 36724 53557 29185
15028 29185 3429 9403 47748 64220 69505 33681 11924 7522 7703 5697 3293 -8791 -26980
15015 -26980 -23791 12576 17361 54741 62187 35738 24502 -10649 -71031 -74261 -20262 -5185
15003 -5185 -12837 14796 29521 1370 -45885 -27757 24004 16712 30440 17309 -37062 -59592
14991 -59592 -17869 10359 34136 5932 -2934 12877 -21105 -36430 -2700 26804 17710 19407
14979 19407 17849 -8840 14369 24142 -2977 6270 27934 -30190 -44841 -55112 -46190 -45875 -6932
14966 -6932 488 7671 23534 40520 76394 49513 17383 39086 29289 22606 44544 24841 6239
14953 6239 5482 19370 50395 41041 14718 33064 34225 29276 46760 43285 59194 39053 43490
14940 43490 40835 45490 58905 71815 78076 64528 57201 77492 71672 26431 33572 26896 47013
14927 47013 17346 -21327 -20032 -19787 -19381 6423 -7716 -15088 -15692 7755 13405 12967 19486 52827
14913 52827 46314 5341 -7230 -37026 -36441 -8287 32400 26675 13009 20873 -2228 13243 23050
14900 23050 7214 13947 16825 38539 60778 1884 -22395 -343 -8178 5058 338 4766 9700
14887 9700 -9883 -40914 -43058 -17579 -49083 -51289 -32122 -60790 -59740 -54653 -60922 -57551 -53584
14874 -53584 -53038 -32771 -1665 23015 12009 -6108 -21401 -36257 -22498 -1898 51427 32466
14862 32466 -2787 -517 -7996 12287 26054 3428 33308 45492 38818 13574 27600 13531
14850 13531 -10647 -45524 -48870 -39950 -47630 -37083 -10223 -17364 15026 44541 45968 46537 13434
14837 13434 -29650 -16970 -10823 -30150 -2720 -2206 -20571 -19538 3046 30130 54065 76215
14825 76215 43681 -24297 -41110 -44213 -3439 24289 31943 30622 16323 27771 8250 -30021
14813 -30021 -7155 16180 35573 66044 83248 65962 58583 9839 1863 4034 -2630 19732
14801 19732 8378 -40665 -34801 -22459 -41008 -58862 -29433 -11317 4119 6207 11187 24578
14789 24578 3199 -7731 6494 36613 34794 14454 15532 5294 9937 44686 58826 73743
14777 73743 86996 68245 51607 -6290 -66054 -64246 -27080 -19130 -17014 13849 1052 -21689
14765 -21689 14688 -30056 -37000 -78495 -80570 -64287 -81125 -102385 -45718 -24345 -21634 -19793
14753 -19793 -11945 14889 39057 35084 31606 28019 35744 15757 8594 53331 69059 47638 33255
14740 33255 20447 27878 15056 13781 -36003 -79104 -88385 -118214 -125152 -78587 -49896 -10792
14728 -10792 -15877 -12133 34218 72687 43442 35979 59897 24021 18537 15340 14382 -29563 -50994
14715 -50994 -21327 -16986 17820 54965 67454 45868 8321 -43719 -47788 -70784 -55952 -23649
14703 -23649 -16699 -40484 -36699 -29308 -33238 -11223 -11671 33310 31237 -16053 -26497 -59430 -21416
14690 -21416 -9302 14489 9029 5554 16935 2231 -28344 -38324 -43469 -37202 -19895 -53639 -61529
14677 -61529 -54916 -72909 -50847 8827 -5640 -24114 -20026 151 -2821 14019 9894 -45028
14665 -45028 -49478 -46647 -28439 -20864 -33499 -24465 14855 15007 38548 46988 21531 -7630 -25759
14652 -25759 -28750 -34836 -18166 7115 45516 107930 95765 93781 116621 134468 100998 42101
14640 42101 5900 3694 -5322 -20916 -3456 20068 60173 77987 62317 66366 65498 27069 -26794
14627 -26794 -23509 -4190 11556 36687 5422 -17426 42796 18382 18479 31391 -27718 -28922 17818
14614 17818 14141 32034 18547 19251 36970 34160 -5051 10687 -5471 -5132 1656 34055 65783
14601 65783 51627 22558 -8043 -8759 15956 19631 -17310 -4116 -8297 -8455 13498 -15335 -24228
14588 -24228 -44522 -5475 -9751 -19581 8538 57861 107766 73353 5877 -13389 -30691 -11772
14576 -11772 37316 62018 31764 10835 11487 5308 36050 30683 31905 46799 35068 19956 11706
14563 11706 -33439 -47058 -39275 211 -2271 -9635 -11126 1879 33500 31185 13326 -20119 10263
14550 10263 -17834 -17598 20183 17403 -3763 -23909 -47728 -20663 46392 67787 50904 20950
14538 20950 14485 -8796 -36998 -20976 -913 -12335 -1944 -28996 -50769 -57852 -14243 29861
14526 29861 49956 60969 37255 9148 1454 -22994 -41199 -59393 -51667 -53704 -22364 2432
14514 2432 -15815 -18791 -51803 -69047 -43875 -40085 -63355 -71256 -36777 -40729 -69857 -33679 -12636
14501 -12636 -26891 -20458 -21765 -5163 11178 24725 -23932 -32471 12677 -9214 -42364 -32348
14489 -32348 -4783 13614 23667 241 -11375 -11028 -13357 -11470 -3303 -947 11636 15915 1017
14476 1017 -3235 32270 36684 25686 14879 -2578 -17382 -3894 -4142 -28588 -52411 -27656 -4979
14463 -4979 10750 21062 49096 22083 6317 274 8352 18045 21367 70367 32228 25234 14926
14450 14926 769 8036 -4457 -14749 -13492 -795 32312 53729 48874 36338 26746 24226 11541
14437 11541 -10718 2359 29200 42286 44088 70197 77390 53634 16802 -20694 -7537 35802
14425 35802 22517 -3371 -1122 13553 45621 46116 7342 11196 -24698 -74728 -96875 -53857
14413 -53857 -52222 -26923 34375 51357 34863 56176 79198 78595 13650 78 47713 66368
14401 66368 56055 46160 48952 21215 68865 76031 35906 -2083 6083 31981 34218 13116 27075
14388 27075 29787 13067 8162 19056 -21673 -68843 -73743 -48454 -35441 -69809 -85098 -49175
14376 -49175 -30996 -30538 9568 33215 1115 5741 37731 43166 20863 15939 19404 45014 78457
14363 78457 69589 9218 -33060 -21404 19524 61952 20506 -2013 9693 -21334 -7439 30185
14351 30185 57731 82144 51429 28488 44190 57582 57306 58455 9520 19165 -18076 -56491
14339 -56491 -42346 23169 46923 69831 88279 95508 73975 61694 27788 23063 20965 45771
14327 45771 43027 -2132 21469 8224 38112 42305 24844 44802 71763 44053 26107 -11056
14315 -11056 -28239 13454 47352 58059 40960 1129 -32882 -38775 -36699 -54413 -86788 -60637
14303 -60637 -42848 -27170 -11083 13908 14724 -340 -24738 -44003 -5746 -11885 2029 45475
14291 45475 46850 42963 50529 46603 23246 12152 -1126 -10335 -11385 -920 -14467 -35150 18905
14278 18905 63782 75404 70245 78575 72196 56653 41075 43158 51888 36156 -23003 -4454 5186
14265 5186 18253 28259 5896 -35122 -43025 -16008 27740 18878 -3884 34671 67920 60489
14253 60489 53498 44609 65892 30247 -14476 -18646 -11513 -20189 -37038 -72380 -53770 -18903 7243
14240 7243 7619 5873 -122 -12698 9465 48998 53081 66251 83415 53352 13608 -8435 20572
14227 20572 57171 44009 35520 40120 49574 51227 15167 -38401 -8145 39962 52905 39680
14215 39680 17885 10870 28997 22227 13772 6823 20347 12027 2408 -21149 -6567 -5594 2127
14202 2127 2111 -34722 -37288 -25804 -8663 -31504 -24764 22573 -13425 -42965 -78119 -73793 -68346
14189 -68346 -62066 -56627 -43296 -28285 372 16597 -12842 -13685 27295 34798 1013 -3807 33309
14176 33309 66210 53409 67034 77020 87420 83528 69748 24193 43036 61404 35360 46067
14164 46067 82574 73522 52286 31381 27364 6726 37445 38905 8405 -19909 -23198 47749
14152 47749 92921 119599 58711 -5864 -20146 -5697 19436 31525 16336 28509 15310 13021
14140 13021 38732 27008 -4112 -7163 -2808 10153 -18420 10712 55851 100709 109190 83158
14128 83158 77493 49074 50682 67678 78773 71852 60900 60830 50641 76307 87399 89621 143141
14115 143141 171691 182759 202429 141574 99535 127541 146629 186452 193041 219972 218290 196027
14103 196027 239647 350611 391593 398029 453300 555552 636816 732062 916381 1190632 1480996
14092 1480996 1879060 2465204 3314271 4355804 5428825 6137567 6332644 5948706 5194927
14083 5194927 4332272 3493040 2805854 2274570 1840094 1503615 1222624 1008608 914077 786957
14073 786957 631366 530942 421632 368047 385530 353067 338024 299270 234307 223033 197142
14062 197142 119581 113212 145695 152717 154893 162705 161277 170354 146011 133323 88572 97228 105234
14049 105234 107307 120190 102916 78714 84290 88095 91264 90683 48874 57942 72436 107235 124530
14036 124530 87378 43953 32447 51044 35316 10254 8483 38608 33904 21299 45379 61160
14024 61160 72307 91264 49643 21685 39972 40842 8788 -1081 62243 68362 30145 43077
14012 43077 50005 29180 29501 20651 -1284 9660 -23853 -23820 -1422 16394 18315 -4524 -26941
13999 -26941 -21416 -12879 6530 67201 89864 91593 90694 59281 58461 60286 40678 17610 48083
13986 48083 45809 45095 38191 49049 27724 -23866 -9049 10244 -23112 -18954 48915 88070 81152
13973 81152 60392 20825 -17077 -33430 2865 -37285 -47429 -4118 66673 53333 34751 28057
13961 28057 -16980 -54381 -44466 -6246 20333 52791 11105 -30699 -69737 -42084 8205 30478
13949 30478 6352 15502 31226 32934 45610 59480 86356 80108 68515 20040 -11727 14440
13937 14440 51768 62763 46195 21959 20746 26638 40947 24997 28432 64165 85330 64230
13925 64230 49414 1974 -3412 9592 -31011 -34682 -98863 -81778 -643 62447 63434 35862
13913 35862 22699 9021 27810 31322 10631 25471 67524 42805 43195 56320 68324 54462
13901 54462 33301 18803 -12017 20960 74454 82258 43374 21808 69201 85791 79526 45665
13889 45665 49125 41275 -1632 -39152 -22551 -14329 6024 30185 -1500 2782 15754 26345
13877 26345 39607 59116 71839 67606 66307 22001 -43538 -14273 19483 26929 20114 13781 56701
13864 56701 59087 32181 43181 32856 25294 14633 15945 28336 44026 42087 35907 36579 15790
13851 15790 33059 -12075 -12129 5934 24423 45321 71069 42238 16408 13889 1566 6281 19775
13838 19775 -17926 15249 33061 36434 62864 63947 25839 6370 -34390 -63021 -48107 -47826
13826 -47826 -14533 2118 -35988 -46087 -25301 29557 63532 44480 18520 5656 -19220 -21278
13814 -21278 12989 -8763 -26562 -41296 -57387 -54149 -24479 -28013 -16034 17684 13334 -3131
13802 -3131 11690 40526 55226 62456 44745 30446 28090 -14084 -51060 -64235 -36407 -17288
13790 -17288 -32284 -23947 11248 19610 514 -24217 -13086 16867 58648 73387 27618 15228
13778 15228 31666 40942 15163 20380 28052 12126 35614 24816 33863 33434 42899 22853 15544
13765 15544 -10184 -4015 54519 79692 79476 68938 39031 23244 18745 16415 32856 38346 29833
13752 29833 29592 -8362 -6665 -32883 -50217 -47295 -47864 1598 27297 19151 -7408 2933 2979 36771
13738 36771 24479 -13660 -3295 20710 -4646 -32674 -3126 31902 16242 10204 49864 65532
13726 65532 54471 70497 62717 48703 16969 1916 11203 21165 28184 18981 44140 86513 90009
13713 90009 55495 49703 51523 71208 92331 99688 70175 52562 82925 58568 52789 42146
13701 42146 11888 -20876 5216 46979 43928 28839 43667 86764 77274 35084 28232 34324
13689 34324 15044 26140 27327 12812 9091 51272 49655 90189 90429 73735 66805 33945 19356
13676 19356 50316 58798 44152 -2232 -18253 -7293 -9090 -9093 3019 16704 -13561 -67849 -22859
13663 -22859 1885 -2158 21258 53355 68491 87353 90280 93014 74035 65567 82829 64797
13651 64797 42171 77636 57474 44981 27038 -30822 -32868 19472 52325 37904 64438 104033
13639 104033 70996 638 -14588 7995 40516 23040 45281 23688 6349 24070 60722
13628 60722 74386 87199 80317 51632 69972 84331 66472 51468 21417 7505 10447 -18742
13616 -18742 -33758 -18514 -2627 57253 86911 57385 13003 6942 8156 43170 14513 -2782
13604 -2782 18723 68884 89516 104355 86805 58923 32553 47464 63152 8617 -5436 -774
13592 -774 -13910 -16405 -19619 -2671 -20106 4931 33209 27908 33348 11732 3424 30058 32151
13579 32151 -3340 -48302 -38081 40132 80143 69421 62976 54373 22619 -4199 773 -44490
13567 -44490 -40488 7827 5812 -11190 -15955 32268 39210 24950 23399 49064 62703 79853 42123
13554 42123 16617 34751 32223 56865 48546 6706 9477 -4965 9882 61972 79796 51943
13542 51943 16912 -9626 2683 -24451 -44429 -21436 -7507 -11371 24571 52037 84044 69779
13530 69779 81191 63734 37955 52646 50584 55563 96291 128938 117220 105931 94609 42519
13518 42519 29455 58066 65796 57042 26963 41502 73509 91853 49639 71292 108992 93019
13506 93019 26591 13729 1084 31962 7072 18426 51543 52603 15185 52027 100490 133875
13494 133875 132367 111394 73936 65898 58886 27488 275 277 54418 76492 87103 69468 65903
13481 65903 66947 83039 109255 127839 145527 151514 100340 57760 58035 64814 36426 8170 4878
13468 4878 35491 106153 139298 124855 73570 86151 68003 65153 82348 56643 10251 -1074
13456 -1074 -14877 15861 35226 31744 50567 67228 91826 71009 70389 51619 51347 67153 92368
13443 92368 74982 47548 39413 36748 64416 48551 46503 54006 87872 49153 18955 -28751
13431 -28751 -41056 9791 34420 57813 33258 73745 55717 -16731 -16636 -14631 -4212 29589
13419 29589 39077 64898 107207 71484 53847 62681 53745 32647 26930 51137 61851 64188 50989
13406 50989 54443 71897 84397 51487 30939 78947 111668 117964 107740 87910 84842 84917 64422
13393 64422 45340 3228 28870 66338 68372 29072 -29573 -34026 -13712 -26783 -41943 -39070
13381 -39070 -38185 -19563 -4441 21136 14229 24218 36582 12575 -8451 -318 35731 76247 100928
13368 100928 77211 82945 81783 62181 50763 76130 85865 65040 26005 38307 54418 41260
13356 41260 58609 95926 109299 80947 62405 48046 28107 5193 22084 11610 315 30231
13344 30231 74320 64149 56962 46294 52345 57254 29564 81683 119124 99262 61215 60693 37247
13331 37247 28252 22990 14156 26796 40632 38719 39318 32373 -10210 7145 16784 60306 115213
13318 115213 114471 107427 74414 28487 30401 39990 50384 64185 72324 80804 68383 54811 74488
13305 74488 81712 95571 84221 38065 41585 58003 53660 69154 67418 54466 41492 25408
13293 25408 27844 18276 715 32362 84704 133193 128266 109866 102490 78301 34573 26365 32902
13280 32902 53600 48079 51764 112152 110780 67751 74914 125974 122131 124792 108179 60122 41694
13267 41694 69597 111829 86450 79900 103242 75799 26413 33388 52179 50224 88308 122628
13255 122628 120599 90716 70857 39661 21038 40659 25276 61940 80034 120300 114507 79410
13243 79410 67804 104743 107262 76026 60377 62829 40793 37598 58777 49348 65015 88919
13231 88919 62553 100430 132317 127680 110066 54721 36980 57038 95998 96060 56872 39959
13219 39959 47051 92425 93469 89159 34255 14505 15476 67131 95854 92092 80537 69946 115689
13206 115689 115339 132582 94513 70275 52308 16058 7946 10287 26855 11022 1211 10704 53106
13193 53106 70986 85939 101003 86816 64492 65901 78320 98841 121574 91926 55754 3986
13181 3986 5982 29107 80759 60915 50072 46668 88245 106013 74088 65370 87966 146970
13169 146970 123268 75129 55977 79480 97161 127154 148296 145984 169660 131409 98982 90698
13157 90698 90810 66824 77773 124361 97516 109490 130715 84210 74803 88902 101999 113970
13145 113970 96665 100428 61823 53646 45164 82861 161940 191326 169312 166574 147935 125552
13133 125552 93602 58099 119878 155449 141729 142734 124058 122446 101335 79521 110158 92350
13121 92350 111254 110706 73015 78249 98387 119938 121694 132552 123766 135038 124486 90003 48351
13108 48351 56240 103008 132094 152380 163389 155099 87592 80781 75353 98454 128745 116592
13096 116592 68687 59242 71082 60469 61471 41852 13891 37290 99721 69774 53028 104806
13084 104806 117309 103707 103233 85937 67850 37676 51427 77682 89344 79442 112449 122174
13072 122174 91779 75820 91029 118519 121130 123166 132342 143082 206713 225743 241024 259450
13060 259450 246897 223159 193560 189006 155965 125792 101480 120526 103702 114126 137503 157201
13048 157201 177571 154009 138412 130993 127347 98607 128859 129078 141182 140342 163253 160943 136085
13035 136085 112016 120929 114833 102782 73658 66417 66121 99689 81491 49552 58525 84157 125207
13022 125207 172563 227272 336056 415846 475659 497051 451198 368595 273387 205080 193527
13011 193527 187020 174921 177676 143345 151987 132069 126298 121514 124287 138450 129965 106638 96457
12998 96457 84379 76733 90672 123055 144017 129308 168280 183301 121548 122649 154272 188349
12986 188349 191534 200918 173869 159738 181500 184581 188968 164317 126792 198107 307306 393937
12974 393937 491763 549883 578883 562811 436879 324870 268673 257798 241422 249863 227540
12963 227540 191972 152324 131774 144913 156919 152146 143052 113365 93671 91334 68211 48282
12951 48282 51305 69673 74410 93216 111162 121433 133525 147971 147003 124952 119941 115590 69612
12938 69612 100082 133124 148508 181124 188033 149703 143731 158621 195290 273740 297688 305287
12926 305287 272893 248477 213355 198729 188965 193011 208844 214740 201819 194442 177680 163545
12914 163545 174850 182039 113673 102764 144555 181852 194957 196206 199593 179260 166080 160767
12902 160767 163438 153981 119011 89079 68781 93009 108834 124481 138621 160844 178572 151911
12890 151911 138399 95542 115238 117940 156281 178114 178529 169497 191108 153775 117953 110760
12878 110760 170357 168114 131746 114935 118683 113061 84746 90625 129503 122902 107767 99476 92012
12865 92012 122110 136087 129533 157695 170349 155288 155240 141783 106209 89712 106335 87510
12853 87510 125215 156675 181060 186800 147356 111335 148554 182851 176006 167867 173126 203629
12841 203629 213844 149019 129237 142273 163660 196231 195136 178002 187884 176733 149537 150752
12829 150752 102516 119124 120777 116649 147432 163747 130574 114578 131423 112551 109267 137446
12817 137446 195994 205033 221601 238453 223183 220228 210150 220480 208829 216178 214013 224219
12805 224219 224887 194016 189405 199768 201371 180380 194803 251024 254759 207181 200790 224363 264751
12792 264751 238459 168454 156530 159825 125675 90988 80926 103923 111086 129884 204487 202073
12780 202073 168463 130727 124335 158339 146627 177335 219176 256081 250169 229479 210444 228640
12768 228640 249570 241587 195436 159590 158645 129265 114971 147194 126885 121106 141593 185385
12756 185385 231176 247588 242682 250168 257610 242527 212106 178032 169916 173817 172805 209924 187070
12743 187070 167697 191638 171895 191860 223174 204733 190674 206637 202741 208623 189814 181853
12731 181853 181641 186226 194222 206918 204971 184639 189419 221372 212864 225670 244771 277707 298871
12718 298871 240330 239626 258336 289642 281412 269785 305256 292468 255097 212628 215693 244920
12706 244920 234498 182207 148179 145482 150690 150102 206444 199291 166210 176199 247387 256454 235221
12693 235221 183409 181237 192456 226639 210301 180051 175721 187768 224724 278014 328615 319893
12681 319893 272412 256664 246048 240607 235725 222421 213632 220822 244588 264640 251905 232940
12669 232940 185906 199126 269155 276004 232052 256906 279867 216069 216068 216677 227017 223053 241814
12656 241814 231285 192470 186182 220879 216962 250538 273173 264832 278483 247726 283378 279278
12644 279278 267366 341492 361427 328056 323596 298073 268815 272305 292489 310386 300250 294418
12632 294418 298354 264541 261175 288013 309942 298066 295455 307413 314723 316793 312392 274499 274839
12619 274839 299339 305383 299674 283729 297060 337764 304853 296389 322154 301608 300107 317324
12607 317324 325670 284450 262861 274783 267454 237811 233801 250588 285010 297351 303368 294127
12595 294127 285484 307947 280394 255494 258674 262352 211077 170692 186307 215664 245941 308547
12583 308547 332148 342387 354033 350709 362948 376461 376168 348713 311428 290918 313442 315434
12571 315434 335677 350388 350327 312728 316075 311075 358675 384807 386655 349218 320507 330789 318957
12558 318957 321265 303375 276774 259686 297684 326752 297620 302061 348536 368574 379143 347173
12546 347173 309669 262794 282660 319550 345240 373480 366083 370894 378404 349438 350636 362521
12534 362521 366927 385086 425959 446205 442147 436921 490993 528982 574941 563754 502581 421486
12522 421486 386473 376753 346387 345721 347298 361950 361474 340449 318275 338488 386632 417273 397182
12509 397182 369394 361624 323152 317264 332521 347186 353943 366778 367668 401354 394350 382445 378970
12496 378970 389370 385857 392768 368729 358671 334392 282992 268167 283170 279890 289719 306788
12484 306788 332184 373852 399788 398130 371636 323655 313396 364819 404060 392877 402106 409636
12472 409636 357188 334140 339042 374678 397519 407091 424069 393646 370381 389197 383991 363270
12460 363270 354718 334251 393524 430969 413044 396268 423498 420577 450635 448143 433945 402534
12448 402534 402019 440243 468416 415785 377141 393351 409262 451395 473541 455592 466950 494844
12436 494844 485546 443599 408843 385880 402896 423440 447601 474305 469160 476423 433365 431186
12424 431186 443807 419643 384798 371656 429894 496119 474627 486659 479040 428321 387136 401249
12412 401249 415984 421406 428172 498184 507751 460757 485079 472964 454731 457250 466394 459820 456036
12399 456036 483816 501827 508115 495872 474112 466356 460855 501077 510686 492820 497299 507540
12387 507540 488976 496100 465051 393801 378970 424283 444508 449290 457839 479202 462447 403702
12375 403702 446097 470173 475446 481565 472286 514104 509048 511086 502340 511615 511259 512504 531613
12362 531613 531587 516839 486288 498390 476745 472129 508814 518939 524440 527959 537087 536817 535684
12349 535684 514355 486963 481272 515019 546523 598788 610232 580153 552944 561328 561169 588729
12337 588729 593130 569394 581122 598889 573427 586924 590167 544731 485347 494552 565964 597158
12325 597158 573248 554015 542207 532048 548746 565022 557586 531843 555855 549097 547264 568604
12313 568604 584785 628465 629001 629337 619927 598642 588567 577572 625015 669711 652256 608768
12301 608768 576258 548516 570281 588123 619612 594514 560929 562406 597033 619425 582825 583401
12289 583401 605517 631489 662604 648704 633059 628904 679628 688894 676484 641877 591551 562467
12277 562467 566184 591772 615101 604449 604691 635502 676923 695176 652725 625371 637044 676684
12265 676684 687355 680995 644621 608697 637160 670092 646102 652465 679560 647421 630715 663652
12253 663652 664506 679540 657981 670888 721539 773030 743769 706693 705412 724250 731149 726016
12241 726016 713106 706116 661827 652569 650928 674150 695519 681458 672028 707173 739746 726973
12229 726973 747804 742045 718095 707722 662928 680806 728548 775963 805255 716320 696247 702152
12217 702152 712385 714421 718316 736287 736351 724498 720628 685396 670920 719911 776748 784102 759651
12204 759651 732813 722608 747433 757323 750169 740667 717530 709662 719220 734921 748032 757282 767237
12191 767237 772433 773118 775243 761561 772721 772945 796065 817965 785950 818126 872937 881898 836604
12178 836604 783878 769095 756293 774127 818445 858203 888410 872547 817396 764744 780433
12167 780433 868555 919718 916473 911114 888715 900575 871002 832585 848332 842433 838118 839723
12155 839723 882047 848497 820860 830447 853490 843440 814975 875606 894414 876656 886956 878665
12143 878665 865350 876870 881365 863958 805398 844657 930480 951477 932571 878530 855299 856640
12131 856640 831739 827577 861284 888959 884931 874184 890483 925824 925392 911294 911289 945815 946164
12118 946164 920728 901865 886866 888298 895025 876995 858194 840632 825583 850200 905290 934835
12106 934835 915597 899021 923247 955001 958161 941283 941386 978242 978644 981520 966841 979930 1000228
12093 1000228 971220 965781 944843 910259 923358 958125 971088 931535 916976 933023 914324
12082 914324 905692 921995 933282 926412 926664 939908 972759 937515 922941 924091 936827 925733
12070 925733 913243 878732 870498 896466 903234 910562 922742 973681 959549 940113 948909 973988
12058 973988 954993 922267 880241 901334 941040 936289 941439 963084 928807 930166 973458 955964
12046 955964 957292 985619 949843 966801 974787 993777 1017027 968663 981148 973574 929239 918919
12034 918919 957360 997851 984051 966183 948175 961427 958810 922940 937613 955601 967391 986729
12022 986729 1011975 1017013 1010639 1001255 1002881 998982 1016811 1070359 1061595 1021440 939823 954906 969288
12009 969288 940178 943325 923275 929312 945267 969253 985036 996096 985949 1024503 1041997 1048753
11997 1048753 1058882 1066551 1045163 1025883 1008054 1010180 988621 966459 982008 985982 1016826 1053130
11985 1053130 1059312 1030376 1010794 975109 929339 950743 987656 1025288 1040084 1033349 1014216 1017940
11973 1017940 1064447 1039048 1037932 1019113 981596 1002006 1028678 1040105 1036880 1035236 1045945 1030906
11961 1030906 992192 1000385 1060238 1092247 1101976 1091878 1062779 1007836 990676 958015 958107 987308
11949 987308 992239 992388 1015083 1021144 1091588 1141835 1117771 1065387 1045909 1050547 1027994 970381
11937 970381 967031 1003286 1010411 1024966 996332 963823 986431 1003975 999764 1018804 1036939 1037222
11925 1037222 1057842 1067667 1052263 1033707 1003783 921188 889438 936091 956916 943534 950687 969656
11913 969656 958137 973459 966209 1000862 975100 973556 1017008 989938 968233 964318 954774 948319
11901 948319 1016073 1067326 1062588 1034720 989576 960169 976794 978872 962131 982737 983654 1028121
11889 1028121 1067260 1073416 1003042 970338 983051 986703 966717 929859 941819 973635 995754 1007616
11877 1007616 996272 961130 966316 982632 992927 1004620 1010840 1023250 1001911 956123 1021536 1038807
11865 1038807 1017442 998417 959570 949601 981411 972191 953991 960029 970594 981227 1006014 1005415
11853 1005415 1002112 1007582 973959 925851 877146 852758 844290 876657 908986 924743 981571 1028362
11841 1028362 957181 908643 909919 932037 962295 1000133 988307 957017 909461 919733 930311
11830 930311 945086 942893 931049 944607 921127 918112 886496 886215 894995 892360 901860 892296 909368
11817 909368 945982 964400 941328 909040 888786 921530 922526 891039 833817 832299 833802 853379
11805 853379 842998 805209 819225 832556 825551 818624 841425 844363 850131 856078 864750 860868 847677
11792 847677 882454 887507 883367 854318 842100 850519 833582 853984 848881 800516 758405 771175
11780 771175 784915 829767 818543 798647 752858 743205 775053 767563 793915 852715 870574 857420
11768 857420 837237 858401 842085 855066 849266 796374 778069 800010 826427 821431 807525 784129
11756 784129 774533 788478 821408 836401 866591 813319 771708 814766 834274 832002 787840 774232
11744 774232 776303 808796 800585 771656 731550 699092 707028 709090 709566 761579 769926 741681 731966
11731 731966 708813 717948 757017 755609 722501 747252 769218 736121 736244 723028 767821 792031
11719 792031 812594 784867 730572 728772 731612 742584 724100 733433 762060 742964 713883 695927
11707 695927 752041 759873 777975 758850 737819 730868 733363 733921 762904 749811 754312 758524 763439
11694 763439 726716 731629 757433 769324 747735 741830 740291 740272 718990 659402 622221 626329 636509
11681 636509 643254 648159 666573 657984 600204 610379 650144 682113 689555 665409 650761 621022
11669 621022 635832 681539 668437 663916 647976 618179 583178 575780 625449 669830 645798 586867
11657 586867 589593 609926 594188 608676 638563 626381 647595 674774 657226 644543 650678 649756
11645 649756 620425 592520 540613 517093 537352 577837 565684 558275 551096 541608 554970 547749
11633 547749 556544 578336 539951 511238 528720 570703 581356 575208 574728 590200 608160 589022
11621 589022 559143 522004 536024 538444 531116 546707 585307 617073 623495 579863 534762 533063
11609 533063 575352 594228 606440 610015 588963 569196 558313 545758 539902 572228 582185 561669
11597 561669 563041 546982 500887 516569 525115 508519 531205 562454 546107 539759 573109 558345
11585 558345 546269 525593 533355 545150 534657 475393 472854 474401 498087 558189 565524 534718
11573 534718 516173 552553 544954 573200 586670 552393 570169 575171 529228 532465 531823 534256 562205
11560 562205 531989 535599 569956 566330 524911 541642 588060 573456 550748 534583 487104 462458
11548 462458 437554 429690 410283 420376 482042 476081 467832 464805 441989 473196 476693 476836 472505
11535 472505 455798 456881 492488 483000 452757 430849 426766 455361 457690 453957 488431 472230
11523 472230 471709 488831 463309 465172 461148 457449 453760 442138 454175 469205 468745 450162 432192
11510 432192 438543 427212 344442 342699 365871 379710 386459 408609 400624 399402 395111 381558 414379
11497 414379 422083 402072 436375 460816 450231 451679 387361 344988 377611 438850 497206 475839
11485 475839 438295 418433 406221 385853 353441 314045 342067 411562 391890 379567 428817
11474 428817 414102 430306 467574 478214 455726 425531 404750 388938 404265 436013 415783
11463 415783 377190 345690 344824 370360 386491 377759 350973 352373 384351 405604 371103 364327
11451 364327 363867 351764 331403 363529 413726 400265 404267 374981 385416 338316 320383 352853
11439 352853 344496 325006 344152 330396 328735 312998 305583 366556 377938 328223 314353 302779
11427 302779 252854 285237 274218 252441 268617 309156 352296 369147 395864 395921 360544 317837
11415 317837 317123 306095 311991 316427 315951 318932 315441 334048 385796 375791 311852 315320 317073
11402 317073 296894 292606 301813 293757 268122 269875 272855 299455 280348 249703 245460 267980 248901
11389 248901 247465 287286 347087 305225 272180 271338 311225 344721 334623 287298 290668 310000
11377 310000 302886 269072 301574 328901 321703 303125 268077 245220 266504 282925 328138 359299
11365 359299 343041 329649 322686 306878 293842 265992 255381 270841 293855 285457 305422 345284
11353 345284 367134 376992 331651 317190 306322 337289 304680 248309 235522 240778 215039 197278
11341 197278 260646 294660 263246 245696 253303 267216 294336 273534 278955 287506 297723 326747
11329 326747 304918 290238 291702 296334 265118 253048 259858 293480 294176 271120 287658 304539
11317 304539 305653 314394 275635 267587 261816 249017 257492 287843 262266 211257 217277 243018 225970
11304 225970 219880 210787 205383 202144 213076 212750 211948 222177 204587 193788 197963 199424 236952
11291 236952 235769 250464 239366 200175 170503 159258 147874 161736 210398 211689 239091 234647
11279 234647 250221 236063 231309 218307 250233 227497 213361 243529 254144 263242 263614 218271
11267 218271 221065 203524 202819 222915 261210 251668 254707 248306 226687 248564 259208 243877 234197
11254 234197 252374 283833 276180 205891 162181 135950 145864 161470 175763 201287 205760 216156
11242 216156 208056 163312 148652 161851 186667 207315 194826 165188 153081 173623 183000 176167
11230 176167 207081 201151 195695 162591 161617 166169 122430 149977 162890 201830 210260 214999 204884
11217 204884 205746 204131 231770 225036 228039 224344 178804 77636 63923 120975 153677 146828 110989
11204 110989 119223 147564 192981 201220 205050 228480 241977 189416 159935 177195 153857 156901
11192 156901 124862 113309 138247 161987 127432 142258 156600 135556 165360 190185 185611 180325
11180 180325 153780 153765 152692 155093 153320 167701 159268 158501 181693 160689 190346 227975 220156
11167 220156 205271 190727 199179 199368 246699 242332 174957 178272 229188 233288 196119 176465 140363
11154 140363 117756 156452 147688 132201 116505 145482 171695 154553 146870 143566 177788 207923
11142 207923 187870 169129 198998 225274 213530 190615 182251 164056 138045 187499 227852 227936
11130 227936 202682 173230 158310 185459 183958 153120 135797 123803 131109 135162 125650 126414 144595
11117 144595 158858 204488 228369 231642 243441 192818 133780 133027 183594 214567 219057 224337
11105 224337 180723 131995 126494 115556 111209 99582 93784 60412 59181 91303 71749 50208
11093 50208 56424 67844 68128 82808 81484 107765 114945 105937 90248 108040 84402 124896 139456
11080 139456 116790 106533 116312 155287 222662 185393 123466 102382 94615 93753 57370 105623
11068 105623 162962 160257 129985 96668 90126 54145 61859 84736 118189 142617 116174 105816
11056 105816 116916 128888 123057 123298 158860 137309 120372 116057 160286 216342 191597 215669
11044 215669 219090 216732 233096 261955 230687 165393 141994 176434 203481 191431 222550 277989
11032 277989 344869 358688 375885 370144 330611 310154 305740 307254 292217 298804 350316 399214
11020 399214 439631 487746 463310 425658 389185 339548 319811 310840 272185 278446 320584 362251
11008 362251 369540 390448 323528 272390 232640 206044 185245 139534 148943 150573 132595 163231
10996 163231 192845 157726 160101 166390 90970 17253 42313 110861 160517 143451 142923 154403
10984 154403 121996 110789 86067 64632 50191 86894 132772 115417 19397 8074 13633 18552
10972 18552 -4034 3780 4682 80253 60683 54313 72787 114746 121397 112021 95054 54322 47539
10959 47539 44004 37639 38424 42675 25238 27800 51860 65949 59036 13139 -22918 -3897 -13729
10946 -13729 -38583 -15947 13239 23124 37039 79938 117570 106210 78245 58467 65368 83825
10934 83825 89631 118343 98062 70204 75959 86918 48305 29076 37268 44689 50343 25258 59964
10921 59964 80485 104846 100440 99864 75607 100533 99979 105074 111349 85221 52900 81777 104929
10908 104929 152702 161876 145051 126818 88467 72241 85127 93403 110427 112994 95116 73882
10896 73882 49260 31367 39992 38542 34780 71996 94758 119042 134769 135754 130979 123350 96806
10883 96806 104169 97753 83693 90765 134049 136548 85008 73701 62643 43283 37485 39111 51266
10870 51266 59745 53864 58905 73282 100810 114491 59566 47153 41735 61448 80714 98795
10858 98795 102109 139168 115902 140201 139452 107350 93890 85188 99475 77862 64215 42199
10846 42199 93207 133789 82713 52567 57874 42910 74450 88624 59028 37299 53537 47181
10834 47181 27950 12868 50081 106748 114241 84081 90395 119990 75362 25646 -10036 -44766
10822 -44766 -4071 15267 44596 42395 10867 10637 55115 38934 11497 22365 18589 -11189
10810 -11189 -23805 10130 -18892 -52566 -53417 766 44126 39301 33292 12218 20373 12900 47313
10797 47313 46899 60347 56458 -20041 -9961 6409 1030 -8720 108 15229 13571 -5906 -47972
10784 -47972 10642 45328 58553 81683 90211 62022 48419 25089 69863 54388 26904 -18972
10772 -18972 -54687 -68406 -32922 19933 53104 37044 0 4306 29992 79378 75330 38957
10760 38957 16184 19980 76202 82159 89598 52862 42549 44889 63420 55733 21083 -5121 -35418
10747 -35418 -30237 -15614 24464 46056 42938 21957 3559 4609 86147 114189 123842 80442
10735 80442 63903 85708 94611 115225 109660 108193 97464 101910 61110 4957 -33996 -5672
10723 -5672 -12711 16819 51718 57367 45806 30130 47862 54811 9089 -12279 -56798 -66415 -66149
10710 -66149 -54011 -26965 -17728 -21222 -37053 -26752 -42233 -64999 -61017 -31375 -70360 -100918
10698 -100918 -99984 -56714 -47434 -88460 -85388 -60199 -87765 -93984 -89234 -79095 -101848 -108206 -110344
10685 -110344 -90072 -67115 -27635 -5763 -70112 -65959 -25518 -1053 31498 27758 -38431 -90955
10673 -90955 -110289 -106898 -112348 -95646 -65053 -48791 -55070 -52312 -43103 -63857 -93138 -92673 -83195
10660 -83195 -63727 -65016 -53873 -47719 -20520 19731 2318 -21251 -15050 8131 -5953 21242
10648 21242 58942 67485 91855 75845 94975 113743 134607 155733 185618 201274 199274 220144
10636 220144 242525 283772 309461 346046 409973 532216 676473 801087 877989 962355 1033607
10625 1033607 1204721 1418346 1713074 2120942 2634069 3356167 4429713 5936300 8078090
10616 8078090 10969094 14460366 17957340 20510354 21501865 21140516 20162951 19203140 18774245
10607 18774245 19338133 21208496 24726977 30283923 37505796 44656751 48945832 49079819
10599 49079819 46076926 41913091 38149484 35779961 35316932 37191702 41738940 49108889
10591 49108889 58558341 67095488 70769549 68207238 61589530 53682090 46525660 41191352
10583 41191352 38095160 37326683 38835790 42490551 47393068 51393283 51921639 48376052
10575 48376052 42380880 35879467 30226924 26027026 23423203 22108447 22007130 22889815
10567 22889815 24080100 24675008 23877262 21581772 18440539 15120261 12114834 9706460
10559 9706460 7862445 6424630 5333853 4525632 3921498 3441534 3029451 2669750 2402534
10550 2402534 2188960 1986924 1789381 1634835 1508285 1376091 1285913 1192984 1165220 1120648
10540 1120648 1033239 967944 927148 875323 832501 798342 818426 793586 778830 778139 726447 694549
10528 694549 685186 691400 664477 601350 555573 563174 584619 598725 584713 523216 502782 482012
10516 482012 461816 453642 458325 467186 498866 466036 402096 405508 431414 440352 474203 461346
10504 461346 413135 352618 353354 328145 316690 346095 347496 377642 369341 365473 360402 355978 401449
10491 401449 409530 409938 393116 383031 368168 330033 294055 270040 270981 269540 286771 289441 264482
10478 264482 247301 247256 271582 312156 313258 281427 283291 294203 325946 355975 359685 331759 340091
10465 340091 324170 290475 321672 310856 319696 296066 281956 272348 281904 268659 259344 211106
10453 211106 201507 224985 190223 182258 180217 160226 138515 146243 137826 115587 115768 116587 115757 126020
10439 126020 104390 117335 128812 109628 95468 114555 126253 140251 162805 194490 166100
10428 166100 167887 203735 197968 180870 184851 147163 101847 89557 116902 147397 145420 130715
10416 130715 143155 128669 116543 120325 128563 140736 139825 118328 106478 112052 146478 172538
10404 172538 185503 173629 122712 95797 75399 55660 90588 116558 152063 90851 58929
10393 58929 82309 79069 89091 105018 125990 151788 174798 185348 144140 131858 123511 125115
10381 125115 114352 102700 109202 56637 39607 43338 75061 119182 144572 122089 85540 122740
10369 122740 150969 144591 151041 138736 122207 140389 152487 125475 123857 123256 86466 62620
10357 62620 66858 94311 139980 192944 186790 83995 38446 13932 -19081 -16115 53013 66841
10345 66841 69715 108003 95629 52481 60692 71627 99266 120792 117011 125526 136616 118502
10333 118502 97196 84206 74151 85517 37508 19444 80350 114427 87041 88092 51875 31792
10321 31792 31327 58169 66284 25752 17858 61992 82043 107351 144583 120330 121807 117689 87714
10308 87714 73714 78078 110498 111981 62002 45381 67298 56009 13486 4236 23443 33187
10296 33187 53418 46096 46549 32804 63865 63472 40005 -16030 -27818 -14657 19819 40019 81756
10283 81756 93416 40438 12483 64992 56604 47203 22289 26624 82336 136133 60032 9072
10271 9072 -10407 -3317 27955 113189 146152 101216 97688 108468 85300 41455 26811 35245
10259 35245 31059 29579 60812 57389 51470 58776 35831 41536 85627 80714 41546 17971 19835
10246 19835 100294 144556 151485 171516 148942 108190 94636 64718 53947 59755 83761 110451
10234 110451 84913 75568 72064 81977 63502 30110 33010 58185 101989 138221 129109 122229 127730
10221 127730 136401 119384 140184 147944 91173 49603 23858 38517 57947 54190 31365 63449
10209 63449 89023 74477 69559 79752 127659 140084 151350 167246 162720 134889 127804 114832
10197 114832 165876 221812 264870 281357 241843 203642 125253 91117 107841 92107 54828
10186 54828 31284 67631 96001 78405 58976 50959 96863 190853 267333 266227 244728 245131
10174 245131 223017 186356 162356 182614 194881 199575 208294 228210 221486 301352 346747 358576
10162 358576 289184 276711 272601 280481 312718 301070 297402 365413 481608 552297 533215 467602
10150 467602 399359 336887 281153 197960 213925 265868 315462 334058 326345 365269 383789 354503
10138 354503 287522 245425 244010 201616 167248 172625 152406 163495 150390 148089 145205 144344 134526
10125 134526 140279 116227 122141 138748 142968 91807 78569 68361 35692 37794 24859 48212
10113 48212 57452 58647 -3568 -382 51403 67631 55370 -8512 -14058 -10611 2269 21455 19430
10100 19430 22304 -4517 -46269 -45691 -34248 -36651 -37307 -31995 -21362 14369 73752 88419 90176
10087 90176 90503 61697 24062 -8163 11006 69432 54707 51622 33609 16504 5349 -6051
10075 -6051 4010 51708 75959 102134 86818 117195 111137 93949 125547 126601 89835 62080
10063 62080 32630 78009 130160 143317 121874 101579 106415 64762 40851 21448 -6 375
10051 375 38824 45971 60499 74977 86153 118107 105686 95924 115575 107852 59684 17719 -3986
10038 -3986 34502 61098 58369 60321 84042 127721 89128 87289 97026 82953 99124 99408 49494
10025 49494 69909 70312 43730 27980 21715 12155 1031 19717 48009 47941 41811 49035 28554
10012 28554 14570 8616 24645 20890 29079 12711 6367 7196 -9788 60580 63395 8211 3487
9999 3487 28844 55665 63376 38070 20172 5329 24915 63096 67241 71458 84166 77849 39605
9986 39605 30708 41810 46567 56768 24319 14509 29038 84080 102969 73505 47819 49481 37339
9973 37339 79969 69620 52598 26620 -3977 -24896 -5347 -22845 13860 46760 32571 22012
9961 22012 22898 -11642 -23372 -11785 17095 14001 24329 94637 103331 74759 56083 46486 38980
9948 38980 10570 20626 43378 47650 46972 32568 30244 -7146 -21767 -45661 -54233 -44005 9677
9935 9677 -8914 -20299 15400 951 -18258 310 -3505 -46403 -40721 -46653 -55511 -429 35113
9922 35113 18107 -14474 -22550 -41446 -18742 21126 48562 -8782 -799 24653 15468 -5940
9910 -5940 -5983 -37159 -45379 -22976 -16497 4580 36651 76841 77322 36644 41275 43396 36787 77577
9896 77577 68931 50321 37946 7518 13208 7865 -11201 22941 37690 -7161 2911 46749
9884 46749 30203 -13071 -35443 4375 77632 104290 91635 85747 53664 10552 17030 37342
9872 37342 67197 68370 59913 -3141 18937 74806 46821 60940 54570 -3057 -43758 -35092 25097
9859 25097 39640 44569 49916 56400 84769 93377 91157 82754 55169 45277 35329 43319 82081 65466
9845 65466 44571 59291 54369 46445 51865 46521 53379 31379 24921 59565 56773 16060 5683
9832 5683 21690 13405 12607 -6744 19105 57860 61284 49003 58107 43422 53742 49171 17885
9819 17885 37065 50097 57281 68697 68706 41124 1420 -56941 -22367 17535 34731 38256 -4764
9806 -4764 -13831 4680 17010 7782 -3825 2308 28563 35053 6055 -1967 2069 1189 27558 47270
9792 47270 38929 17775 20524 59735 108697 100875 63963 34263 45896 54562 73141 69067 74077
9779 74077 61500 66161 104864 136105 176643 215974 324196 553794 1005934 1598180 1965440
9768 1965440 1902464 1482548 1007465 665036 471004 330181 250655 229247 197401 160385
9758 160385 113111 51146 43267 25511 20122 69245 69458 29575 18157 8714 38927 32293 36756
9745 36756 95032 98292 67519 51970 55287 74346 23682 671 -8652 -2577 6396 24236 34266
9732 34266 62522 57095 52486 65186 39212 44467 83780 93789 83648 94802 83865 93982
9720 93982 80059 59394 44662 35771 29781 24564 57291 71058 29014 23705 3634 13053 26247
9707 26247 37218 10353 32208 47566 20971 75249 85566 69771 74889 81103 68197 99903
9695 99903 98700 53444 23864 63274 26042 -16025 4863 15070 8765 8191 -35030 -55960 -66643
9682 -66643 -34981 -30477 22432 -3302 2033 16868 11870 40826 36818 -11427 -48376 -66341 -62077
9669 -62077 -64817 -24737 -11614 14692 45518 80576 95687 76796 49741 49966 37269 28039 43879
9656 43879 56515 71478 72815 136691 187414 263847 473857 765703 790961 624717 436662
9645 436662 341904 265575 188420 108520 94616 49918 -2599 -11673 -12076 -25397 -13021 27499
9633 27499 29424 34372 39667 50402 57080 69708 22720 15396 21147 -32736 -49040 -22646 21086
9620 21086 13783 48324 50127 18697 2714 25031 37094 38417 55227 52140 33159 -18248 -806
9607 -806 -3114 124 5022 -13647 18588 29348 39254 78994 78130 35848 14141 11913 12396 15576
9593 15576 42883 10562 -12536 -5181 9364 28987 887 -12853 -19844 -4622 3955 -2827 -11842
9580 -11842 12279 44698 56194 37327 -16340 26252 64738 60787 56447 44490 57662 27486
9568 27486 -8981 -34460 -43825 -29026 -6885 27489 18280 -8182 -2527 29907 82272 74628 47591
9555 47591 30448 13069 32979 57629 468 -34540 -187 -4029 4368 42061 21606 17772
9543 17772 -31584 -58387 -57478 -51955 -16707 14238 4810 -2029 -46742 -75500 -14124 -22650 -13487
9530 -13487 -23725 -31973 -8882 -31421 -76754 -105061 -93417 -93847 -79943 -12862 9926 33319
9518 33319 11149 1420 10688 -7645 -35262 -51564 -83797 -46895 -7454 5296 15041 -15855
9506 -15855 -54330 -33471 25114 46894 38064 34641 32326 -7011 -25672 -32597 12782 41191 25275
9493 25275 66818 29766 9945 -6190 -12485 -7329 -47667 -51578 -58465 -12138 8983 -17470 -6304
9480 -6304 30574 39809 19451 41060 38303 -30549 -79220 -106368 -84526 -7253 26477 14546
9468 14546 -46294 -98207 -129427 -94964 -70343 -95065 -72378 -19366 21986 6426 -55367 -56050
9456 -56050 -2989 36802 45593 10080 -21610 -63176 -40516 -33669 -65410 -33002 -8899 -29256
9444 -29256 -55406 -65498 -72095 -72184 -46514 -49376 -80458 -59348 -10030 9109 -8755 -24974 5334
9431 5334 39110 25689 15024 -14854 -49762 -22238 25860 2930 -6575 -14956 -9052 -24771 -42428
9418 -42428 8032 13068 8323 -1090 24087 24308 -19919 -42018 -20947 -7269 -8354 50009 71968
9405 71968 46800 29044 21652 20653 3863 -15758 -9994 4349 20910 3683 -6793 -1450 -28862
9392 -28862 -11490 13054 32890 29797 65519 44583 37791 36067 8465 -14840 -22011 -3346 41789
9379 41789 22911 -2311 21907 37786 56762 58439 32533 30324 5774 -10077 -15811 -23341 -11897
9366 -11897 -8799 -18425 -9317 -24253 -10723 23187 57528 35617 4350 2360 4799 -15101 -14095
9353 -14095 1626 25524 -20407 -30268 -26409 -31555 -36988 -60537 -50160 -61965 -47250 13736 82449
9340 82449 110557 86093 42928 15549 1193 -11183 10057 15261 12992 35593 39036 60
9328 60 -17691 -18985 -6583 -32797 -34030 -25031 -23694 -16705 3017 25989 -8459 -30440 -31283 -40298
9314 -40298 -2428 7885 17481 5466 -43180 -39384 2350 7314 23576 49497 45711 36621 47485
9301 47485 -3875 -27939 18004 10028 14787 49611 68762 40583 33499 28685 24261 20378 -14847
9288 -14847 -15080 28349 64694 48425 21778 4229 33602 52332 53771 4350 -42190 -44339 24223
9275 24223 41247 43912 12399 32255 61418 50604 41471 45408 1937 49883 110099 102722 75466
9262 75466 12158 14350 -12858 -14987 -9120 -4280 17045 16491 -18825 -19481 -7153 -12662 -26834 -55158
9248 -55158 -12896 8981 14515 57168 47552 2133 -16260 5350 -43776 -44780 -47692 -72585 -92166
9235 -92166 -69555 -41757 -21971 4619 3572 5703 -29334 -41373 -327 48651 35786 -12714
9223 -12714 8349 51905 24992 -12601 9990 6203 15671 45904 64988 50979 17767 -7022
9211 -7022 42033 80441 39991 17586 6412 3218 -8373 6677 34188 21681 -28099 -54709
9199 -54709 -14249 -18211 -22576 15664 29963 -7441 -8674 -14410 -23458 -40212 -92010 381 10494
9186 10494 -17458 5916 -16067 -59910 -33625 20584 -4671 -14726 18827 36854 7825 -7997
9174 -7997 -3314 -13800 -69304 -89899 -86094 -63485 -24192 -7270 -38379 -47394 -28241 -15168 12443
9161 12443 13778 36832 61253 30789 -23961 -22270 -17023 -14834 -38794 -56253 -21409 14615 10846
9148 10846 -10166 -10948 -13315 -21178 3537 -13712 4728 22050 22509 15826 13904 32895 30118 20696
9134 20696 -13400 -11655 12758 22608 21923 42325 21068 37139 49158 34965 18204 7792 31772
9121 31772 -14440 -68869 -80682 -58272 -10400 -3368 11757 -13665 3979 38320 38346 25963 26248
9108 26248 33393 8792 26331 14571 -13074 -39416 -44302 -30828 -32018 17576 26608 16725 31729
9095 31729 -5208 -33794 -16561 8456 10342 11303 9430 34170 33883 -14346 -22837 -34479 -28985
9082 -28985 7406 8047 -31464 -54068 -66306 -41617 -9438 -14411 -52116 -46639 -38949 -16595 -14312
9069 -14312 -12651 9876 5103 -29256 -53120 -18288 14199 -8546 -57404 -88569 -50111 -49112 -57815
9056 -57815 -47756 -19639 11669 -6956 -48206 -55749 -31973 14264 24230 21660 34136 58185
9044 58185 35693 36232 42677 25219 28642 44462 26580 -18389 -7091 -234 7630 20491 22090
9031 22090 18260 12831 -42926 -36624 -22729 -37780 882 12856 16934 8238 -46253 -9841 14754
9018 14754 18851 1432 -39641 -46022 -21582 3495 -12859 -1132 25122 1905 22782 20358
9006 20358 -6389 -12099 -12989 -13407 -9127 -5379 -11895 20579 5926 11963 36830 24930 30420 59035
8992 59035 18076 22584 53132 63267 61375 22541 -12922 -34126 -20763 19884 62739 55661
8980 55661 9668 -23627 -10099 -233 41199 45808 37190 8744 -13051 -50604 -58576 -17542 -4009
8967 -4009 -30168 -32764 -45312 -51232 -41174 -34552 -64139 -59587 -10446 -22960 -43430 -33675 -45886
8954 -45886 -20987 49963 76311 75376 40431 24345 -13383 -46569 -55901 -41542 -19650 -11473 -28927
8941 -28927 14749 44755 -18933 -86305 -126494 -65910 -35998 -63499 -57202 -29213 7649 21222
8929 21222 -42203 -32833 -16790 -31684 -19434 12475 -12819 -11886 -24807 -17834 37782 36499 20974
8916 20974 31651 27928 23482 16717 37472 68087 89824 104699 83825 95863 67106 42966
8904 42966 -7830 -26043 -19087 40133 45793 28238 25879 712 -15025 -27794 -809 41802
8892 41802 13188 -18064 -8752 -8005 -19032 1874 19238 4879 -1394 -28136 -52637 -15648 6172
8879 6172 2484 13553 8610 44535 56409 35265 57492 76932 47171 1896 -39459 -43432 -18826
8866 -18826 -10884 -19012 -65784 -60360 -28638 -28535 -45413 -51997 -42682 -33198 -19707 611 -11882
8853 -11882 -73368 -84389 -68138 -117363 -153916 -131600 -78658 18927 47686 16855 -23333 -13270
8841 -13270 -29585 -31537 -18657 33540 -5977 -34004 -21152 8724 37665 59881 84645 21100
8829 21100 35677 23326 -13741 2839 -16270 -16991 -1633 2046 31667 24370 -16756 -42548 -39857
8816 -39857 -55635 -38722 22362 44006 9654 -38070 -18157 -1063 -6316 -28040 -73494 -79788
8804 -79788 -75725 -58113 -47210 -48002 -40842 -8912 -23590 -30018 -14510 4547 -13582 -32821 -46349
8791 -46349 -46810 -48764 -36919 -27379 18422 23503 3106 -2232 -5422 -13650 -2330 -4636 6088 42402
8777 42402 23194 19493 15899 44662 62214 51357 43026 25798 -12411 -18507 -26768 -42376 -59199
8764 -59199 -85466 -56886 -19295 3173 1003 -23658 -60560 -90582 -85823 -71360 -6940 35045
8752 35045 3371 -25623 -3194 -6700 5215 -29673 -69691 -75006 -23263 9068 -7807 -8235 -9044
8739 -9044 -24771 -25309 -21849 -1598 -18520 -48017 -16822 20070 -931 -25185 -8449 -5720 -37667
8726 -37667 -27477 -46460 -54899 -46062 -67126 -87469 -79152 -27561 -6603 -23998 -68568 -109178
8714 -109178 -88549 -86578 -71810 -28994 10654 29229 37950 19494 -35394 -50839 -2485 37453
8702 37453 44521 56914 6071 -14303 2469 24955 41394 48986 34615 22966 7630 -38844
8690 -38844 -71626 -42956 -14089 775 -19554 632 -15080 -14023 -4837 21266 14915 -4245
8678 -4245 -25973 -2569 14371 -8900 -12430 -12177 -37223 -47173 -55055 -53691 -63227 -54580 -47166 -34988
8664 -34988 -59609 -37288 -53143 -100230 -90088 -83168 -89682 -31938 -2350 -36548 -41352 -20738
8652 -20738 -545 9215 28284 32984 -2602 -18466 -31516 -17340 12081 18664 15097 1372 10486
8639 10486 -20981 -56088 10828 15061 28092 26907 2706 10062 -16285 -36656 -85090 -109747
8627 -109747 -69642 -54709 -44263 -65443 -53231 -48980 -27728 -28051 -24816 -32499 -13681 5341 6644
8614 6644 -40407 -72829 -34606 1551 16065 53464 59664 58736 48661 63982 54491 10168 29603
8601 29603 54437 53941 71734 82599 54883 15858 9139 -8875 -32898 -12814 -7815 -11709 14715
8588 14715 -17444 -75290 -41299 -3158 -13291 -55283 -36305 63238 112918 59076 34528 35760
8576 35760 32455 37523 76639 132173 143306 160950 120505 84196 76788 51470 32374 35255 35116
8563 35116 44182 22925 25101 48408 37189 29646 68118 84534 102704 114538 84449 79562 93909
8550 93909 48264 48429 64392 51026 51110 35440 -1062 15750 16519 -3628 -9377 36989 81343
8537 81343 74514 54900 -6063 4547 37911 21039 -8449 -10871 33581 40016 45041 55548 70691
8524 70691 122948 158741 256330 395614 457678 357895 251120 156919 114747 48636 -9736
8513 -9736 -17912 17186 29563 2598 -16887 -16837 25015 48005 47471 43672 80114 88293 85900 64540
8499 64540 63515 40814 34627 20589 32232 51454 10169 -22607 11994 13079 22322 -13503 -40399
8486 -40399 -53757 -40062 10097 58610 108561 133396 174549 215531 322332 596696 909912
8475 909912 993768 833517 646096 439343 284948 220044 187621 145660 120677 90959 38027
8464 38027 45220 37610 53946 65959 62758 27040 -4588 -14403 18336 13379 14461 34795 13062
8451 13062 -49184 -78143 -57218 -10680 14264 23104 14074 17088 45101 52951 77192 89255 68647
8438 68647 65685 57692 83256 120411 138550 165798 299809 462102 516845 401287 311079 220960
8426 220960 149925 129208 70579 66313 68114 60610 73147 66080 83272 63235 31757 11547
8414 11547 2656 -2683 7447 15801 17285 33759 42078 20941 -5274 20272 53896 -17734 -27828
8401 -27828 -51689 -55212 -25733 -747 38938 33517 11388 -3615 3659 -16221 -19825 -32560 -37170
8388 -37170 -2946 15071 21438 -15648 -32909 -38203 -54283 -94547 -63862 2587 -3077 4155 55653
8375 55653 76449 6937 -38838 -20000 9479 18895 9596 -17283 -8198 -9001 10171 52337 7937
8362 7937 32350 59647 49855 36905 18252 13675 14425 24607 39030 36209 -2335 5687 8440
8349 8440 -3675 35347 31492 24329 27507 -16798 -36415 -31430 -28653 -58137 -101014 -73724 -1384
8336 -1384 5458 -23697 -9901 12933 44466 1321 -36673 -53578 1036 39229 24732 -17804
8324 -17804 -25055 -26035 177 18583 -1542 -14772 -27947 29650 66399 48602 -13534 -35250
8312 -35250 -43636 -61243 -92643 -83231 -39653 -28153 394 7604 7359 -9283 -39841 -39106 9962
8299 9962 29427 23134 33039 44365 21947 38762 48222 70021 62091 14079 30236 31351 19603
8286 19603 12203 -16499 -12890 -30319 -50332 -24071 -23377 -41883 -53295 -37594 -5905 57589 69885
8273 69885 49338 35519 24409 32401 62012 38993 3543 6030 10672 -33434 -28381 11657 42701
8260 42701 11546 -12328 -7524 -22346 -19608 -10987 -42645 -68304 -48254 -39153 -29168 -15627 -15463
8247 -15463 10842 19126 54372 50425 17065 22741 46041 -2446 -88020 -107262 -68150 -65254 -29713
8234 -29713 -1393 28322 17848 -30124 -2078 -8122 -14795 -33301 -30511 -31969 -7605 -19275 -8930
8221 -8930 27696 22145 -21814 -40387 -37493 -5489 -563 -404 -19907 -20657 -32001 -37510 -14105 -3738
8207 -3738 -13136 -12849 22646 31568 127 22601 -9427 -50610 -34207 -23017 -54621 -38191 689
8194 689 -10038 7105 -5218 442 -17401 -25529 -50153 -43047 -7338 11043 40611 76541 64052
8181 64052 47868 19937 -18207 -48424 -48216 -48959 -15933 -6889 -25373 13240 35503 11512 1278
8168 1278 23422 -1949 2617 10855 -22583 -70463 -74665 -52949 -26216 -35774 -51960 -10025 -14780
8155 -14780 -10318 -16799 -40842 -68104 -31901 -16941 1482 8417 -1630 -5467 33733 36559 47347
8142 47347 17376 -31174 -71810 -68047 -20030 -12520 -24430 -15192 6646 18159 -27349 -41517
8130 -41517 -17929 -37458 -32771 1698 36658 40610 1364 -61316 -53107 -11596 -28886 -13772
8118 -13772 45998 22076 18657 43526 -1670 -6607 26510 53949 29048 -14044 -33968 -22062
8106 -22062 -30428 8334 18955 35007 70588 79233 69749 20053 -11444 -23583 6965 26597
8094 26597 10945 7414 47118 77426 48142 18453 -1789 -12800 -10683 -9901 -15907 21994 -3139
8081 -3139 -51366 -69715 -68528 -50368 -40195 -30763 -20993 5587 6521 9572 -7477 -18776 -2488
8068 -2488 -25294 -34241 -23130 5536 50794 69254 64509 34097 -21883 -20022 -15270 -20181 -29167
8055 -29167 -42654 -9452 -25572 -31917 -38043 -25629 22492 59011 50672 17923 -2206 -22656
8043 -22656 -2072 -2439 -27247 -22696 -7592 53919 34426 -14595 -58915 -60568 -56170 -70060 -36290
8030 -36290 8073 36438 35046 54113 32504 -20240 -19693 615 -654 -24738 -41120 -21325 18416
8017 18416 6838 13783 32048 53896 46553 -2543 -15723 -42689 -41672 -62560 -90017 -89069 -24293
8004 -24293 26672 28329 11188 -6006 10038 46788 97561 107954 64817 17196 -19143 -15671
7992 -15671 -2089 -13710 -16998 -45545 -28853 -43834 -24898 -13764 -26597 -16866 12770 55995
7980 55995 74150 61091 39634 -829 -27764 -16619 10925 5294 -3653 -7479 1360 48420 110344
7967 110344 145599 154658 173604 151369 128962 84869 74033 97140 108449 132488 91494 40899
7955 40899 31591 59463 62310 33156 43868 40853 27494 23163 12244 -25260 -19018 -21652 -27178
7942 -27178 -11968 14641 46495 36478 15514 5695 34477 3482 -4474 20457 23642 10046
7930 10046 10200 28003 43224 59491 61158 93482 91388 102039 111404 87207 93242 73869 34596
7917 34596 14862 29613 20039 523 25414 31274 37764 21216 -16911 -26407 -4923 46461 47725
7904 47725 13673 -25439 -60185 -49174 -28647 -20708 -20329 -26287 -29488 -23539 460 8843 4995
7891 4995 24052 -14151 8230 47975 39173 15116 27589 14897 16562 -967 -8863 -438 -4902
7878 -4902 7753 48578 57991 10031 -7034 -6407 -9425 15830 57590 70882 5565 -27119 -645
7865 -645 -19580 -67537 -73441 -77314 -70382 -47669 -11553 -10800 -14258 -18498 37938 48664 41988 78282
7851 78282 73204 60684 25802 39957 41610 -471 -4501 10965 31421 56223 56557 2473 -33359
7838 -33359 -22737 -12008 -6489 -23381 -19915 -13068 2009 -10752 -9877 -2536 -14653 -45543 -62862
7825 -62862 -18965 -166 -4195 1477 -6702 -7015 -8596 -14007 -16550 17073 30470 38957 34322 -12374
7811 -12374 -51030 -57146 -23992 -12428 -22937 -45685 -42043 -18867 -33858 -43430 -41210 -18838 4648
7798 4648 -13443 -9285 17507 6749 10622 10949 43447 45652 42023 41260 29952 7917 -8128 6388
7784 6388 -25101 -69636 -65780 -61479 -34109 -31125 -36551 -21639 -9316 -1471 12806 -20842 -41840
$$ [...]
##END NTUPLES=NMR SPECTRUM
##END=
