##TITLE=Analysis number 309878
Compound Code spb 04179
Book Reference 423/30
Project Code adrs
Chemist Name bruced
##JCAMPDX= 6.0         $$ Bruker NMR JCAMP-DX V2.0
##DATA TYPE= NMR SPECTRUM
##DATA CLASS= NTUPLES
##ORIGIN= Bruker BioSpin GmbH
##OWNER= NMR
$$ XWIN-NMR		Version 3.5
$$ Tue Jun  7 08:24:13 2005 GMT Daylight Time (UT+1h)  MAYBRIDGE\NMR@NMR_250MHZ
##.OBSERVE FREQUENCY= 250.131544655141
##.OBSERVE NUCLEUS= ^1H
##.ACQUISITION MODE= SIMULTANEOUS (DQD)
##.ACQUISITION SCHEME= undefined
##.AVERAGES= 16
##.DIGITISER RES= 18
##SPECTROMETER/DATA SYSTEM= dpx250
##.PULSE SEQUENCE= zg30
##.SOLVENT NAME= CDCl3
##.SHIFT REFERENCE= (INTERNAL, CDCl3, 0, 16.522)
##AUDIT TRAIL= $$ (NUMBER, WHEN, WHO, WHERE, WHAT)
$$ ##TITLE= Audit trail, XWIN-NMR		Version 3.5
$$ ##JCAMPDX= 5.01
$$ ##ORIGIN= Bruker BioSpin GmbH
$$ ##OWNER= NMR
$$ C:\u/data/dgb/nmr/ADRS/3900/pdata/1/auditp.txt
$$ ##AUDIT TRAIL=  $$ (NUMBER, WHEN, WHO, WHERE, WHAT)
(   1,<2005-06-07 08:23:49.73 +100>,<MAYBRIDGE\NMR>,<NMR_250MHZ>,
      <created by zg, POWCHK disabled, PULCHK disabled
       configuration hash MD5:
       62 19 C7 07 E1 42 D1 B7 37 6C 3D D0 77 39 F9 E6
       data hash MD5: 64K
       4A 35 63 46 9A FD 9F DC 62 75 DC DC BC 15 55 A0>)
(   2,<2005-06-07 08:24:01.57 +100>,<MAYBRIDGE\NMR>,<NMR_250MHZ>,
      <Start of raw data processing
       ef LB = 0.3 FT_mod = 6 PKNL = 1 SI = 32K 
       data hash MD5: 32K
       1F B0 C2 5A 59 D5 33 C2 F9 E7 9E A4 9F CD 04 46>)
(   3,<2005-06-07 08:24:03.87 +100>,<MAYBRIDGE\NMR>,<NMR_250MHZ>,
      <apk 
       data hash MD5: 32K
       43 D6 2E AE 15 75 7E 2F EA 1A 15 CE 55 75 1C 78>)
(   4,<2005-06-07 08:24:04.71 +100>,<MAYBRIDGE\NMR>,<NMR_250MHZ>,
      <abs ABSG = 5 
       data hash MD5: 32K
       64 9C E3 B5 14 FF 4A 78 13 05 D7 CF E1 94 6B BA>)
$$ ##END=
$$ 
$$ hash MD5
$$ 2B A1 38 83 48 A2 51 2E E7 38 F7 2A 7F EA D4 5B
##$RELAX= 
##$RELAX= 
##$RELAX= 
##$RELAX= 
##$RELAX= 
##$RELAX= 
##$RELAX= 
$$ Bruker specific parameters
$$ --------------------------
##$DU= <C:\u>
##$EXPNO= 3900
##$NAME= <ADRS>
##$PROCNO= 1
##$TYPE= <nmr>
##$USER= <dgb>
##$AMP= (0..31)
100 100 100 100 100 100 100 100 100 100 100 100 100 100 100 100 100 100 
100 100 100 100 100 100 100 100 100 100 100 100 100 100 
##$AQSEQ= 0
##$AQ_mod= 3
##$AUNM= <au_zg>
##$AUTOPOS= <1 >
##$BF1= 250.13
##$BF2= 250.13
##$BF3= 250.13
##$BF4= 250.13
##$BF5= 500.13
##$BF6= 500.13
##$BF7= 500.13
##$BF8= 500.13
##$BYTORDA= 1
##$CFDGTYP= 0
##$CFRGTYP= 5
##$CHEMSTR= <none>
##$CNST= (0..31)
1 1 145 1 1 1 1 1 1 1 1 1 1 1 1 1 1 1 1 1 1 1 1 1 1 1 1 1 1 1 1 1 
##$CPDPRG= <>
##$CPDPRG1= <>
##$CPDPRG2= <>
##$CPDPRG3= <>
##$CPDPRG4= <mlev>
##$CPDPRG5= <mlev>
##$CPDPRG6= <mlev>
##$CPDPRG7= <mlev>
##$CPDPRG8= <mlev>
##$CPDPRGB= <>
##$CPDPRGT= <>
##$D= (0..31)
0 1 0 0 0 0 0 0 0 0.06 0 0 0 0 0 0 0.0002 0 0 0 0 0 0 0 0 0 0 0 0 0 0 
0 
##$DATE= 1118129028
##$DBL= (0..7)
120 120 120 120 120 120 120 120 
##$DBP= (0..7)
150 150 150 150 150 150 150 150 
##$DBP07= 0
##$DBPNAM0= <>
##$DBPNAM1= <>
$$ [...]
##$SUBNAM7= <"">
##$SUBNAM8= <"">
##$SUBNAM9= <"">
##$SW= 20.6930455092707
##$SWIBOX= (0..15)
0 0 3 0 0 0 0 0 0 0 0 0 0 0 0 0 
##$SW_h= 5175.983436853
##$TD= 65536
##$TD0= 1
##$TE= 294.16
##$TE2= 300
##$TE3= 300
##$TEG= 300
##$TL= (0..7)
0 120 120 120 120 120 120 120 
##$TP= (0..7)
150 150 150 150 150 150 150 150 
##$TP07= 0
##$TPNAME0= <>
##$TPNAME1= <>
##$TPNAME2= <>
##$TPNAME3= <>
##$TPNAME4= <>
##$TPNAME5= <>
##$TPNAME6= <>
##$TPNAME7= <>
##$TPOAL= (0..7)
0.5 0.5 0.5 0.5 0.5 0.5 0.5 0.5 
##$TPOFFS= (0..7)
0 0 0 0 0 0 0 0 
##$TUNHIN= 0
##$TUNHOUT= 0
##$TUNXOUT= 0
##$USERA1= <user>
##$USERA2= <user>
##$USERA3= <user>
##$USERA4= <user>
##$USERA5= <user>
##$V9= 5
##$VALIST= <valist>
##$VCLIST= <CCCCCCCCCCCCCCC>
##$VD= 0
##$VDLIST= <DDDDDDDDDDDDDDD>
##$VPLIST= <PPPPPPPPPPPPPPP>
##$VTLIST= <TTTTTTTTTTTTTTT>
##$WBST= 1024
##$WBSW= 4
##$XGAIN= (0..3)
0 0 0 0 
##$XL= 0
##$YL= 0
##$YMAX_a= 233843
##$YMIN_a= -165842
##$ZGOPTNS= <>
##$ZL1= 120
##$ZL2= 120
##$ZL3= 120
##$ZL4= 120
##$ABSF1= 16.522
##$ABSF2= -4.171173
##$ABSG= 5
##$ABSL= 3
##$ALPHA= 0
##$AQORDER= 0
##$ASSFAC= 0
##$ASSFACI= 0
##$ASSFACX= 0
##$ASSWID= 0
##$AUNMP= <proc_1d>
##$AZFE= 0.1
##$AZFW= 0.1
##$BCFW= 0
##$BC_mod= 0
##$BYTORDP= 0
##$COROFFS= 0
##$CY= 12.5
##$DATMOD= 1
##$DC= 0
##$DFILT= <>
##$DTYPP= 0
##$F1P= 14.0000005364418
##$F2P= -0.99999901652339
##$FCOR= 0.5
##$FTSIZE= 32768
##$FT_mod= 6
##$GAMMA= 0
##$GB= 0
##$INTBC= 1
##$INTSCL= 1
##$ISEN= 128
##$LB= 0.3
##$LEV0= 0
##$LPBIN= 0
##$MAXI= 10000
##$MC2= 0
##$MEAN= 0
##$ME_mod= 0
##$MI= 0
##$NCOEF= 0
##$NC_proc= -5
##$NLEV= 6
##$NOISF1= 0
##$NOISF2= 0
##$NSP= 0
##$NTH_PI= 0
##$NZP= 0
##$OFFSET= 16.522
##$PC= 1
##$PHC0= -77.55081
##$PHC1= 24.09562
##$PH_mod= 1
##$PKNL= yes
##$PPARMOD= 0
##$PSCAL= 4
##$PSIGN= 0
##$REVERSE= no
##$SF= 250.13
##$SI= 32768
##$SIGF1= 0
##$SIGF2= 0
##$SINO= 400
##$SIOLD= 32768
##$SREGLST= <1H.CDCl3>
##$SSB= 0
##$STSI= 32768
##$STSR= 0
##$SW_p= 5175.98343685301
##$SYMM= 0
##$S_DEV= 0
##$TDeff= 65536
##$TDoff= 0
##$TI= <Analysis number 999999
Compound Code 99
Book Reference 9
Project Code 9>
##$TILT= no
##$TM1= 0
##$TM2= 0
##$TOPLEV= 0
##$USERP1= <user>
##$USERP2= <user>
##$USERP3= <user>
##$USERP4= <user>
##$USERP5= <user>
##$WDW= 1
##$XDIM= 32768
##$YMAX_p= 477037597
##$YMIN_p= -1363505
$$ End of Bruker specific parameters
$$ ---------------------------------
##NTUPLES= NMR SPECTRUM
##VAR_NAME=  FREQUENCY,     SPECTRUM/REAL,   SPECTRUM/IMAG
##SYMBOL=    X,             R,               I
##VAR_TYPE=  INDEPENDENT,   DEPENDENT,       DEPENDENT
##VAR_FORM=  AFFN,          ASDF,            ASDF
##VAR_DIM=   32768,         32768,           32768
##UNITS=     HZ,            ARBITRARY UNITS, ARBITRARY UNITS
##FACTOR=    0.157963299565203, 1,           1
##FIRST=     4132.6476996994, 0,             0
##LAST=      -1043.33573715361, 0,           0
##MIN=       -1043.33573715361, -1363505,    0
##MAX=       4132.6476996994, 477037597,     0
$$ Real data points
##PAGE= N=1
##DATA TABLE= (X++(R..R)), XYDATA
$$ [...]
23063d18005k9600J53277j312L5335J16430l6118j60830j45894j27648K22023
$$ -418005 -447605 -294328 -295640 -260305 -143875 -179993 -340823 -486717 -614365 -392342
23053c92342J65807L54912O35691k7605m11303m18897J07078P8633k63146j28971
$$ -392342 -226535 128377 764068 736463 325160 -93737 13341 91974 -171172 -300143
23043c00143K68097m6141j35483J56262J86272j26902L11857K12098R6520m15241
$$ -300143 -32046 -78187 -213670 -57408 128864 1962 313819 525917 622437 207196
23033B07196k40447J5597k17903N5296j6478R765J33813J61303Q9474k25100K5687
$$ 207196 -33251 -17654 -235557 -180261 -196739 -186974 -53161 108142 197616 -27484 -1797
23022a797J53927k00033j17560K61683l68635o3406J84844j95210j50159L31495
$$ -1797 152130 -47903 -165463 96220 -272415 -335821 -150977 -346187 -496346 -164851
23012a64851L52986o0339j76395N4619M0524p5492J51221L80730L0464k46013
$$ -164851 188135 127796 -48599 6020 46544 -28948 122273 503003 533467 287454
23002B87454j10050M8373M15063j65257J0987K3395l34634n0003k45663k71835
$$ 287454 177404 225777 640840 475583 486570 509965 175331 125328 -120335 -392170
22992c92170L21141J10966J06630K22386J26734n28097n56213J11407L70408J72836
$$ -392170 -71029 39937 146567 368953 495687 -32410 -588623 -477216 -106808 66028
22982F6028m61770m6030J69077J27592K00451J49341J10442k99714j86793J39285
$$ 66028 -395742 -441772 -272695 -145103 55348 204689 315131 15417 -171376 -32091
22972c2091J54880j6523l71071j74652L05209J76323O4548k7446o6326k66812
$$ -32091 122789 106266 -264805 -439457 -134248 42075 106623 79177 12851 -253961
22962b53961m8044L19264P2718l25229l25480J11039J82801j68180P3646n0728
$$ -253961 -302005 17259 89977 -235252 -560732 -449693 -266892 -435072 -361426 -412154
22952d12154J09479k6518j61955P1096K06540J38291j71954j80478J8872P4035
$$ -412154 -302675 -329193 -491148 -420052 -213512 -75221 -247175 -427653 -408781 -334746
22942c34746O17l07957L23614J73296q3503J3872J39347k7601k56775K53252K7346
$$ -334746 -334129 -642086 -318472 -145176 -228679 -214807 -75460 -103061 -359836 -106584 -79238
22931g9238M3252k37241j22899J25339P9536K03589J85158J43144l31750j76380
$$ -79238 -35986 -273227 -396126 -270787 -191251 12338 197496 340640 8890 -167490
22921a67490K20155m9336j18204O1281k06178J27080J58568L36407Q7497l90046
$$ -167490 52665 3329 -114875 -53594 -259772 -132692 25876 362283 449780 59734
22911E9734j14270M2581j6374k71817K98875J56712k80273r0624P5084K37935
$$ 59734 -54536 -11955 -28329 -300146 -1271 155441 -124832 -215456 -140372 97563
22901I7563K43924j66058L5372L80030j50428m43305l89474j21045l6499J979
$$ 97563 341487 175429 210801 590831 440403 -2902 -392376 -513421 -549920 -547941
22891e47941j24649J43702K13083K0066l46148m3311M12698K97440K53178P9086
$$ -547941 -672590 -528888 -315805 -295739 -641887 -685198 -272500 24940 278118 357204
22881C57204K79640r1124k03912k30347K09751J69886K01528j194j88615j63874
$$ 357204 636844 545720 341808 111461 321212 491098 692626 691432 502817 338943
22871C38943j08627k7637l11866P2790L3246l24707l12105L49134R0028J95955
$$ 338943 230316 202679 -109187 -36397 -3151 -327858 -639963 -290829 -200801 -4846
22861d846r9879j19350M2258J33331l01963L7331K07663L01084J5620k68406j70014
$$ -4846 -104725 -224075 -181817 -48486 -350449 -313118 -105455 195629 211249 -57157 -227171
22850b27171M17390N7148j66305j67187k49334J08095K94083j19603l43682k02016
$$ -227171 190219 247367 81062 -86125 -335459 -227364 66719 -52884 -396566 -598582
22840e98582o7508M48562N894j11852K12746J83439K9486J65411J00873j32901
$$ -598582 -666090 -217528 -211634 -323486 -110740 72699 102185 267596 368469 235568
22830B35568k38968j57228K6124J71941J6951L54763J73878o6683j7309M15035
$$ 235568 -3400 -160628 -134504 37437 54388 409151 583029 516346 499037 914072
22820I14072m4705l86464j54279Q4128j07256k20057j13412R8240L2472K81150
$$ 914072 869367 482903 328624 412752 305496 85439 -27973 70267 102739 383889
22810C83889k10900k01733K4950J4394k03661j76383M6331L48848L1079m37087
$$ 383889 172989 -28744 -3794 10600 -193061 -369444 -323113 25735 56814 -380273
22800c80273j51609J88630M31386K69527M9830L1383J9714K6205m0053k05739
$$ -380273 -531882 -343252 88134 357661 407491 438874 458588 484793 444740 239001
22790B39001R1090j65952q0640L30q9812j92224j71123L74299L49417K94991k9987
$$ 239001 330091 164139 83499 83829 -5983 -198207 -369330 4969 354386 649377 619390
22779F19390l34701l45177k38738M9766J58052K79920L02454n7304L28176p809
$$ 619390 284689 -60488 -299226 -249460 -91408 188512 490966 433662 761838 754029
22769G54029m67130k01649J83837J17537m13432R8262K8258k25197k00674j63585
$$ 754029 286899 85250 269087 386624 -26808 71454 99712 -125485 -326159 -489744
22759d89744j75163l7644N33760L14447J03984K8053K5850l86108l22756k00286
$$ -489744 -664907 -702551 -168791 145656 249640 277693 303543 -82565 -405321 -605607
22749f05607l6254K64355M1437o8345p0602R5181L31673K68097m714k30506k54490
$$ -605607 -641861 -377506 -336069 -404414 -475016 -379835 -48162 219935 215221 -15285 -269775
22738b69775j1493M4268k15752Q6152N29327k49729p7340j46255L92947j14788
$$ -269775 -281268 -237000 -452752 -366600 162727 -87002 -164342 -310597 82350 -32438
22728c2438J89047J64799r6782j03337j68554l1730j65656L0137J85022R4272
$$ -32438 156609 321408 224626 121289 -47265 -78995 -244651 -214514 -29492 64780
22718F4780k3842m609K9041Q6920N7316j33525O9601M9005k18424l59920r3546
$$ 64780 40938 36329 65370 152290 209606 76081 145682 194687 -23737 -383657 -477203
22707d77203J45553J29303L19285J76783M3304Q3963j27794k04502k77068m4530
$$ -477203 -331650 -202347 116938 293721 337025 420988 293194 88692 -188376 -232906
22697b32906O0717J66355j95421L2955n1615P2186o5194j32397j77143R3871K10602
$$ -232906 -172189 -5834 -201255 -168300 -219915 -147729 -212923 -345320 -522463 -428592 -217990
22686b17990J48499l0731l0609k6683J19887M2201j01261l3792J59681L4714j97548
$$ -217990 -69491 -100222 -130831 -157514 -37627 4574 -96687 -130479 29202 63916 -133632
22675a33632J9098Q8918k50003j34723k05803Q9709J68900J96519J70425o4141
$$ -133632 -114534 -25616 -275619 -410342 -616145 -526436 -357536 -161017 9408 -54733
22665e4733k16442m91217j28774N022r442J22133k83629j15794M22767K42251
$$ -54733 -271175 -762392 -891166 -886144 -895586 -773453 -1057082 -1172876 -750109 -507858
22655e07858K54286l1409J07441K96654J78063r5927j02966l00862j01529K51666
$$ -507858 -253572 -284981 -177540 119114 297177 201250 98284 -202578 -304107 -52441
22645e2441K60094K59793l25472m16546L25855L72458O0248k62535k46332P9386
$$ -52441 207653 467446 141974 -274572 51283 423741 483989 221454 -24878 54508
22635E4508M1632n7737q0912m4543r174K0512j93243j53878J44113P4984q7145
$$ 54508 96140 38403 -42509 -87052 -96226 -75714 -268957 -422835 -278722 -203738 -290883
22624b90883n2612L93236j6312o8858j70013J7162J87815K20622j11387K18616
$$ -290883 -343495 49741 33429 -35429 -205442 -188280 -465 220157 108770 327386
22614C27386M15777L2336o91224m01433m952K16509j01091J41413J62408k16486
$$ 327386 743163 775499 84275 -317158 -322110 -105601 -206692 -65279 97129 -119357
22604a19357k28843Q236n1777R151k1128K84959R7282k58210k15124M1583q7935
$$ -119357 -348200 -339964 -391741 -382590 -403718 -118759 -21477 -279687 -494811 -453228 -541163
22593e41163J60375L7021J51510N13717p0612M873n51462k31704N18627j5301
$$ -541163 -380788 -343767 -192257 321460 250848 255721 -295741 -527445 -8818 -24119
22583b4119O642K9963j8734J27394j73873n31923O6370L10466K9216L6207L995
$$ -24119 -17477 12486 -6248 121146 -52727 -584650 -518280 -207814 -178598 -142391 -138396
22572a38396k71979j48596Q5581M32765L05389j07911J7062j44372R3846M1621
$$ -138396 -410375 -558971 -473390 -40625 264764 156853 173915 29543 123389 165010
22562A65010j54073M27999m0455k63811j27227n1873J60031r6411J72013J89975
$$ 165010 10937 438936 398481 134670 7443 -44430 115601 19190 191203 381178
22552C81178l79290k70785j97931J86965K88100j08740k16257o7940K02801J40668
$$ 381178 1888 -268897 -466828 -279863 8237 -100503 -316760 -384700 -181899 -41231
22542d1231n2315M4131J43119O6890j19104k12792j14934K42202K68942j7383
$$ -41231 -93546 -49415 93704 160594 41490 -171302 -286236 -44034 224908 207525
22532B07525l2407k24645K07393n3994m1963L57697J13125j46826J9821L05689
$$ 207525 175118 -49527 157866 103872 61909 419606 532731 385905 405726 711415
22522G11415J05645l72390l21120r8820k07960K75498K96340L71543j39643l21636
$$ 711415 817060 444670 123550 24730 -183230 92268 388608 760151 620508 298872
22512B98872j32900L79799k16842l77956k1408J61631n7275j89459j55749K72331
$$ 298872 165972 545771 328929 -49027 -70435 91196 33921 -155538 -311287 -38956
22502c8956L45650k62496p1296j03978J63470L3020O7873L76643K08003l37218
$$ -38956 306694 44198 -27098 -131076 32394 65414 133287 509930 717933 380715
22492C80715k37061k00681J6874K75734k83405j04136N1001L2339K2969m62859
$$ 380715 143654 -57027 -40153 235581 -47824 -151960 -100959 -68620 -45651 -508510
22482e08510j57896L33100J20623j9067L65527J3149j3049l20049K13145j9450
$$ -508510 -666406 -333306 -212683 -231750 133777 146926 133877 -186172 26973 7523
22472G523j14503m914K53727Q524r0788J04689K15775J27426n7980n7345l3308
$$ 7523 -106980 -111894 141833 150357 59569 164258 380033 507459 449479 392134 358826
22461C58826o9938l1442J54639M4703j88283m85030l02437L67809J80649K49689
$$ 358826 288888 257446 412085 456788 268505 -216525 -518962 -151153 29496 279185
22451B79185P6517k3220L05025L38630l41743l55394j92275l33233M86068P5320
$$ 279185 355702 332482 637507 976137 634394 279000 86725 -246508 239560 314880
22441C14880k23839J23946Q8221k20585r0655J42945J54597p5794j36933M0883
$$ 314880 91041 214987 303208 82623 -8032 134913 289510 213716 76783 117666
22431A17666j20864m44929q215L70850P6567P3787J61789n6948j51338k8078K5721
$$ 117666 -3198 -448127 -456342 -85492 -8925 64862 226651 169703 18365 -9713 16008
22420A6008K50708j18964L8174l5044N9409o8269j83737R9571J86775q0259J03375
$$ 16008 266716 147752 185926 150882 210291 142022 -41715 57856 244631 164372 267747
22409B67747m6m5108j78999J17152l0838J66525L679k14516N7507L8094j50563
$$ 267747 267701 222593 43594 160746 129908 296433 300112 85596 143103 181197 30634
22398C0634m03891J54718K11727L5508K33978L2966n9946K889J8685l1222q9786
$$ 30634 -373257 -218539 -6812 28696 262674 295640 235694 238583 257268 226046 136260
22387A36260K57617N4523O1165J93389k82023j26779j43976O6181j04327j26003
$$ 136260 393877 448400 509565 702954 420931 294152 150176 216357 112030 -13973
22377a3973n999P6429j03951J43382J35896j57557j95392O8246K50815j39909
$$ -13973 -19972 56457 -47494 95888 231784 74227 -121165 -52919 197896 57987
22367E7987k04227J2668p8923r5394N9281j29466k10513J13047L41062L47851
$$ 57987 -146240 -133572 -212495 -307889 -248608 -378074 -588587 -475540 -134478 213373
22357B13373q8058n9654J03253j10776j36727J30548K32017r3800k8246k69550
$$ 213373 125315 65661 168914 58138 -78589 51959 283976 190176 161930 -107620
22347a07620j49046Q003J76606l9350R9852k3988j29368m4058N9472K58125K9329
$$ -107620 -256666 -248663 -72057 -111407 -11555 -35543 -164911 -208969 -149497 108628 137957
22336A37957n7723r2162O8047o5691L3909K04811k69268o8427K75204L43636K910
$$ 137957 80234 -11928 56119 -9572 24337 229148 -40120 -108547 166657 510293 513203
22325E13203k79394m7769O8685j9775K16998j29870l78200k23493k41016j23984
$$ 513203 233809 186040 254725 234950 451948 322078 -56122 -279615 -520631 -644615
22315f44615r3666j07829o8113L59216K00225j42885J60601K59016j88161k08129
$$ -644615 -738281 -846110 -914223 -555007 -354782 -497667 -337066 -78050 -266211 -474340
22305d74340K87261J82566O7850j47702j8963L4318O5877p805K00499l19472l18908
$$ -474340 -187079 -4513 63337 -84365 -103328 -69010 -3133 -10938 189561 -129911 -448819
22294d48819j11958K38151K15068N22020P2307l75787n08730J58866j96917J43810
$$ -448819 -560777 -322626 -107558 414462 486769 110982 -397748 -238882 -435799 -291989
22284b91989j96434l36430K527K82554O2232K0526j02899m632L04660J87616M9556
$$ -291989 -488423 -824853 -822326 -539772 -477540 -457014 -559913 -564545 -259885 -72269 -22713
22273b2713j85015J14543K1023j16174l31712L19330K50026O4065J98669K28951
$$ -22713 -207728 -93185 -72162 -188336 -520048 -200718 49308 113373 312042 540993
22263E40993m5772k63122m01305l33567K80251L73558K02700j3429O3467K51085
$$ 540993 495221 232099 -169206 -502773 -222522 151036 353736 340307 403774 654859
22253F54859k28851m2261K75284m63360p90493k5846q7143k699M09418L59187
$$ 654859 426008 383747 659031 195671 -594822 -620668 -707811 -710510 -301092 58095
22243E8095J4786r086l82163J19505j40549k60845k93487j88796L41059M35460
$$ 58095 72881 63795 -318368 -198863 -339412 -600257 -893744 -1082540 -741481 -306021
22233c06021L35891N753j77362K75538k06729n14370l9442M27583j0994j70296
$$ -306021 29870 35623 -141739 133799 -72930 -587300 -626742 -199159 -210153 -380449
22223c80449J0071J2327K52822k16716q6211L20386K58408J07123N8707R1277
$$ -380449 -370378 -358051 -105229 -321945 -408156 -87770 170638 277761 336468 427745
22213D27745k41357k81211J81773L7883j52870J33486j90085k01499P61J10425
$$ 427745 186388 -94823 86950 124833 -28037 105449 -84636 -286135 -285374 -174949
22203a74949K67159j10477J18138K15145o8607l37390K87165K04724k92164k36038
$$ -174949 92210 -18267 99871 315016 246409 -90981 196184 400908 108744 -127294
22193a27294k23413J76060K5365Q390j63652j67386j1646j92997j93640L75411
$$ -127294 -350707 -174647 -149282 -140892 -304544 -471930 -483576 -676573 -870213 -494802
22183d94802L61084P0182k53703j68727J87068K16987N2479l7678r5909O5487
$$ -494802 -133718 -63536 -317239 -485966 -298898 -81911 -29432 -67110 -163019 -97532
22173i7532J52204j93756o1985J29848J56967l10503K8513L43181j3049j46751
$$ -97532 54672 -139084 -201069 -71221 85746 -224757 -196244 146937 133888 -12863
22163a2863Q4226o6804J2467K63205n3538j7725J80433k07411m63936R5769M06837
$$ -12863 71363 4559 17026 280231 226693 208968 389401 181990 -281946 -186177 220660
22152B20660m4736j45523Q2989k00979j01511M66363L50766k00382k80601k4689
$$ 220660 175924 30401 113390 -87589 -189100 277263 628029 427647 147046 122357
22142A22357k87643l44747L86730J39377k811K37601K18825k12299k75622O3032
$$ 122357 -165286 -510033 -123303 16074 13263 250864 469689 257390 -18232 44800
22132D4800R2762M7034J49902l9510n09204j92160L17335J71312k62962k66627
$$ 44800 137562 184596 334498 294988 -214216 -406376 -89041 82271 -180691 -447318
22122d47318j30366K14643L2117L15557J806L4184N2175j16270j01116J22797
$$ -447318 -577684 -363041 -330924 -15367 -13561 20623 72798 -43472 -144588 -21791
22112b1791K5766K76254K72423n1563Q5047j4047p4670l88493k13561L879K77957
$$ -21791 3975 280229 552652 501089 586136 572089 497419 108926 -104635 -100756 177201
22101A77201n5601j85474k62105K51076O52382J45656k41552l713J96064q8059
$$ 177201 121600 -63874 -325979 -74903 577479 723135 481583 477870 673934 585875
22091E85875l86692k80019J85647L58901J68470q7694m32937j08462J00604j43002
$$ 585875 199183 -80836 104811 463712 632182 544488 111551 3089 103693 -39309
22081c9309p8112k2663k8011J02646J88777j21277M14919K08054j6741m03615
$$ -39309 -117421 -140084 -168095 -65449 123328 2051 416970 625024 608283 204668
22071B04668l42063k93841j9883K62558J55720l7621N9710J09658J24292n9266
$$ 204668 -137395 -431236 -451119 -188561 -32841 -70462 -10752 98906 223198 163932
22061A63932k59161K12950L09112N7778j74622M97616N05164l00350o22752n01865
$$ 163932 -95229 117721 426833 484611 309989 807605 1312769 1012419 389667 -112198
22051a12198j07640J76792q8374L9577o4913j17802M44730n8792r2541L5964K14908
$$ -112198 -219838 -43046 -131420 -91843 -156756 -274558 170172 111380 18839 54803 269711
22040B69711J13644L21653q683j80579k19983k05534Q2790J44203j20382Q5300
$$ 269711 383355 705008 696325 515746 295763 90229 173019 317222 196840 282140
22030B82140J75074k98494k13875K54586M33457j25527o99017l63508K18507j47432
$$ 282140 457214 158720 -55155 199431 632888 507361 -191656 -555164 -336657 -484089
22020d84089l57776K75563M06319N00226J81612k34593m43780k5712M58734J04140
$$ -484089 -841865 -566302 -159983 340243 521855 287262 -156518 -182230 276504 380644
22010C80644K972k99855n3974N699J67938L79138P6928l45360l20874l90291L6405
$$ 380644 383616 83761 29787 35486 203424 582562 659490 314130 -6744 -397035 -360630
21999c60630l8367K60219K09042l2786j91037j83159J36421L04823L03397n905
$$ -360630 -398997 -138778 70264 37478 -153559 -336718 -200297 104526 407923 402018
21989D02018j93270j91755R0079M854n9717k48297n2282J16670O3487L43942k90544
$$ 402018 208748 16993 107072 111926 52209 -196088 -248370 -131700 -68213 275729 -14815
21978a4815l81734K04072M30918K25981k45407k01449j26311l60650k87186K28781
$$ -14815 -396549 -192477 238441 464422 219015 17566 -108745 -469395 -756581 -527800
21968e27800L02897j34879l0117k2303J32962L23946O2340j40677q7489j20380
$$ -527800 -224903 -359782 -389899 -412202 -279240 44706 107046 -33631 -121120 -241500
21958b41500j21093J80982J29722L4023n3055J79019K26830l040j54686k0128
$$ -241500 -362593 -181611 -51889 -17866 -70921 108098 334928 331888 177202 157074
21948A57074N7172q0571n4738M2613o6728l65649J48450K64388r0636k73149n6327
$$ 157074 214246 133675 78937 121550 54822 -310827 -162377 102011 11375 -261774 -318101
21937c18101K9342l408J0098o3061J06966N5290R7394L08131k17121j03200K09131
$$ -318101 -288759 -292167 -282069 -345130 -238164 -182874 -85480 222651 5530 -97670 111461
21926A11461K31191l4260j53531R6109k29777Q212o7444O2616K83752Q0532k09312
$$ 111461 342652 308392 154861 250970 21193 29405 -38039 24577 308329 388861 179549
21915A79549l93015k44336m1862m1161j81074J40898M22873P5984P9179j19337
$$ 179549 -213466 -457802 -499664 -540825 -721899 -581001 -158128 -82144 -2965 -122302
21905a22302k25110K62719L22059k01364J20872l61399Q1008j15912r5269r4696
$$ -122302 -347412 -84693 237366 36002 156874 -204525 -123517 -239429 -334698 -429394
21895d29394o5583r8204K08378L00394J40490J18543J50254j01945J25425j35413
$$ -429394 -494977 -593181 -384803 -84409 56081 174624 324878 222933 348358 212945
21885B12945p2625O1995J35327k8277j03417j91529k64374J47064P5805L973m6048
$$ 212945 140320 202315 337642 309365 205948 14419 -249955 -102891 -27086 -23113 -69161
21874f9161L10340m4980O8559l17464l08778O8722O0963l30154R7185N63700L63964
$$ -69161 241179 196199 264758 -52706 -361484 -292762 -231799 -561953 -464768 98932 462896
21863D62896K30162n24152k36906M1886L0702J89073j62446j36811K59965L63309
$$ 462896 693058 168906 -68000 -26114 4588 193661 31215 -105596 154369 517678
21853E17678q7197n9329m16134l97540r0968n2043K96032L82107K52282K68534
$$ 517678 430481 371152 -44982 -442522 -533490 -585533 -289501 92606 344888 613422
21843F13422q4771j87924j44200k842L9263l01760q8357J94887k7819o79534J45414
$$ 613422 528651 340727 196527 193685 232948 -68812 -157169 37718 9899 -669635 -524221
21832e24221K39535L05703o2466k66379m37124N4953K79274L71010n655J06852
$$ -524221 -284686 21017 -41449 -307828 -744952 -689999 -410725 -39715 -45370 61482
21822F1482M7255k63288l04375R525J71537r6771j43241L32818n3811l21881j23187
$$ 61482 108737 -154551 -458926 -449401 -277864 -374635 -517876 -185058 -238869 -560750 -683937
21811f83937J20129M30793K09698O2915j12384N1095k1193L4653l40474j51902
$$ -683937 -563808 -133015 76683 139598 27214 78309 57116 91769 -248705 -400607
21801d00607j61417n45J78102K83373N9651l4017p3802k15343J96778K75646j53614
$$ -400607 -562024 -562569 -384467 -101094 -41443 -75460 -149262 -364605 -167827 107819 -45795
21790d5795j5429l81048j52466O0486j25551q7084N0448j6947K27947M66212J57236
$$ -45795 -61224 -442272 -594738 -534252 -659803 -746887 -696439 -713386 -485439 -19227 138009
21779A38009n4537R7503k1268k41801k15929j45740L03767k2223j92517J37027
$$ 138009 83472 180975 159707 -82094 -298023 -443763 -139996 -162219 -354736 -217709
21769b17709J19251K68753o7388j00641j1715L00054J39169k39190j88736j73454
$$ -217709 -98458 170295 102907 2266 -9449 290605 429774 190584 1848 -171606
21759a71606J28087N9485J23332j75598Q5966j53606l59052J06431L58211j1000
$$ -171606 -43519 15966 139298 -36300 49666 -103940 -462992 -356561 1650 -9350
21749i350k43023j94843l87788K70794L45153l85400J6241K86062J02339j56757
$$ -9350 -252373 -447216 -835004 -564210 -219057 -604457 -588216 -302154 -199815 -356572
21739c56572o1142r1211J63594N1274P6410R9789o6826j10575K86362J39994K02969
$$ -356572 -417714 -508925 -345331 -294057 -217647 -117858 -184684 -295259 -8897 131097 334066
21728C34066o9817k79632J70257L1758m5326r018J2293J67434J2176k08861k19704
$$ 334066 264249 -15383 154874 186632 141306 132288 144581 312015 324191 115330 -104374
21717a04374n4688K38096K19891l4729O6582j8708j91886o6143K6925m69584l45215
$$ -104374 -159062 79034 298925 264196 330778 312070 120184 54041 80966 -388618 -733833
21706g33833J57994L05093q0157K57548J16689J36789K49767J3778j69456m7171
$$ -733833 -575839 -270746 -350903 -93355 23334 160123 409890 423668 254212 207041
21696B07041n1170J57781o7792j79386P1912K98989K04537j56884j22089l83275
$$ 207041 155871 313652 245860 66474 138386 437375 641912 485028 362939 -20336
21686b0336m2305Q2827K04538j02440l11591o5878k9232L73202L35353L09676
$$ -20336 -62641 20186 224724 122284 -189307 -255185 -284417 88785 424138 733814
21676G33814k90228m71944j84170J70334K88885K55598l11786l89761K01250R8682
$$ 733814 443586 -28358 -212528 -42194 246691 502289 190503 -199258 1992 100674
21666A00674r4736j5745J83121N0502k86893J58323R4026J73440J98277m477j35998
$$ 100674 5938 -9807 173314 223816 -63077 95246 189272 362712 560989 556512 420514
21655D20514k76976L7210k53256j0306J42337N8337r5224k69505O5464K69950
$$ 420514 143538 180748 -72508 -82814 59523 117860 22636 -246869 -181405 88545
21645H8545k0028j52385j14535j52739n581J00289R5646j53759k83301R1120K32219
$$ 88545 68517 -83868 -198403 -351142 -356723 -256434 -160788 -314547 -597848 -506728 -274509
21634b74509l5571M5293L6223j71390Q0817K86307n6400j25998m2410J47380J42912
$$ -274509 -310080 -264787 -228564 -399954 -319137 -32830 -89230 -215228 -257638 -110258 32654
21623C2654j18097p8846L52872q2146l66932j69493o4201J02459o1445o2768J57067
$$ 32654 -85443 -164289 188583 106437 -260495 -429988 -494189 -391730 -453175 -515943 -358876
21612c58876L60397J8700p0455K47727n3813q5186p2270j23697l66243k02273
$$ -358876 1521 20221 -50234 197493 143680 58494 -13776 -137473 -503716 -705989
21602g05989K5820J462J47991L08968P0454q6523q6448m5217k85316p506K23189
$$ -705989 -680169 -678707 -530716 -221748 -151294 -237817 -324265 -369482 -654798 -662304 -439115
21591d39115K48054L34117K52724q9660n3184L82287n8614j81835m04567J93289
$$ -439115 -191061 143056 395780 306120 252936 635223 576609 394774 -9793 183496
21581A83496K06352m0912j5948m72503k59691r1576J23656J16799R0992M56351
$$ 183496 389848 348936 332988 -139515 -399206 -490782 -367126 -250327 -159335 297016
21571B97016J11800j9860J69991n28101q6639L57044L77758j2194n75129l24229
$$ 297016 408816 388956 558947 30846 -55793 301251 679009 666815 91686 -232543
21561b32543J86240j35869l56100J27908L42151j4182l49246n5563r2158K84480
$$ -232543 -46303 -182172 -538272 -410364 -68213 -82395 -431641 -487204 -579362 -294882
21551b94882N9939j11776J07661N5151Q3767k19166N0988J21325j2427j16243
$$ -294882 -234943 -346719 -239058 -183907 -100140 -319306 -268318 -146993 -159420 -275663
21541b75663L73205K73643l16452j02139L33761j83101L2264K57495k2942q5952
$$ -275663 97542 371185 54733 -47406 286355 103254 135518 393013 370071 284119
21531B84119k55626J98070J322k55188j20965L83133O1618l69711j26491J33302
$$ 284119 28493 226563 227885 -27303 -148268 234865 296483 -73228 -199719 -66417
21521f6417k71332J39966K00854r71k05923r1744N4361k86941K93699O60915K86248
$$ -66417 -337749 -197783 3071 2100 -203823 -295567 -241206 -528147 -234448 426467 712715
21510G12715k19373N2855J14730j39997l94863k99225J40952k621j04909k78585
$$ 712715 493342 546197 660927 520930 126067 -173158 -32206 -34827 -139736 -418321
21500d18321K94296J90038O3426m2768k66867J41890R7508l23549o1186k13339
$$ -418321 -124025 66013 129439 86671 -180196 -38306 59202 -264347 -325533 -538872
21490e38872N8452N6935K0881j13834K89657J18634P7455L9700j43165N7281j09324
$$ -538872 -480420 -423485 -402604 -516438 -226781 -108147 -30692 9008 -134157 -76876 -186200
21479a86200o3598J41585Q919j096j40774k14149k02584j68746J521K38639L45799
$$ -186200 -249798 -108213 -99294 -100390 -241164 -455313 -657897 -826643 -825122 -586483 -240684
21468b40684J79764k84879J5311L91814q1305O8667j56189j64712K07265K17275
$$ -240684 -60920 -345799 -330488 61326 -19979 48688 -107501 -272213 -64948 152327
21458A52327M50021n5272j45715k54034l06078k62404K19781M3258P0337K57080
$$ 152327 602348 547076 401361 147327 -158751 -421155 -201374 -158116 -87779 169301
21448A69301M944m5044j06475k41785j07809r2034N6045J68147J65928k65296
$$ 169301 174245 129201 22726 -219059 -326868 -418902 -362857 -194710 -28782 -294078
21438b94078p9265J06931J78657l8037m5707P5903K31679j60840k9084r9833M7859
$$ -294078 -373343 -266412 -87755 -125792 -171499 -95596 136083 -24757 -53841 -153674 -105815
21427a05815O6598j02219K83428P6838p2690m33175o0674j98448K39940K03220
$$ -105815 -39217 -141436 141992 218830 146140 -287035 -347709 -546157 -306217 -102997
21417a02997j25167K90086J83003J54225n4085j55496n1265J00833K8607j35363
$$ -102997 -228164 61922 244925 399150 345065 189569 138304 239137 267744 132381
21407A32381k55991J88954J68310j64970j88623o9266p2335R6277N911K77465
$$ 132381 -123610 65344 233654 68684 -119939 -189205 -261540 -165263 -159352 118113
21397A18113J6838k25990n42144K67253J68071J73151J46747l10080J27458J72128
$$ 118113 134951 -91039 -633183 -365930 -197859 -24708 122039 -188041 -60583 111545
21387A11545k16911j16628L1671K38273J12711j79439k69991k06738J35708p9906
$$ 111545 -105366 -221994 -190323 47950 160661 -18778 -288769 -495507 -359799 -439705
21377d39705J72721r0049j26580j02393O23134L08093l45886J04208K35909R1272
$$ -439705 -266984 -357033 -483613 -586006 37128 345221 -665 103543 339452 430724
21367D30724j70397j07896L4106N2648J52180k04571k37693N9928K15059j69154
$$ 430724 260327 152431 186537 239185 391365 186794 -50899 9029 224088 54934
21357E4934J02628p0265l2627n637K37963J50882m80567l69934k99455K56438
$$ 54934 157562 87297 54670 49033 286996 437878 -42689 -412623 -712078 -455640
21347d55640M54474J68754L16410j97215k30949N2967K54851K52253k9254o8310
$$ -455640 -1166 167588 483998 286783 55834 108801 363652 615905 586651 518341
21337E18341j46916n9302q0138K5508p5024J38261M05949K29156l61411l81898
$$ 518341 371425 312123 231985 257493 182469 320730 726679 955835 594424 212526
21327B12526j74652J97669j74458l2832O6388j43713l3662P5587K7205L9677K4739
$$ 212526 37874 235543 61085 28253 94641 -49072 -82734 -7147 20058 59735 84474
21316H4474j35351k77146k16530N36907R3399j65614r693K0466Q9628J9255j5119
$$ 84474 -50877 -328023 -544553 -7646 85753 -79861 -89554 -69088 20540 39795 24676
21305B4676k00660j38509L4616J85852j01190k7773J7285J33244J66995N8187
$$ 24676 -175984 -314493 -279877 -94025 -195215 -222988 -205703 -72459 94536 152723
21295A52723j45067K10674J93714J46738m20307n48758l88971p3517L47842J19717
$$ 152723 7656 218330 412044 558782 138475 -410283 -799254 -872771 -524929 -405212
21285d05212J38384Q6203J41032j72082k77356n0125L42477j95014k80371K09761
$$ -405212 -266828 -180625 -39593 -211675 -489031 -539156 -196679 -391693 -672064 -462303
21275d62303K64327K72974L47045J34056j19067l51331q1770J31361j73608j11956
$$ -462303 -197976 74998 422043 556099 437032 85701 3931 135292 -38316 -150272
21265a50272j25702o0595J29382L8153Q2881r5914L03411J97685J10106j22919
$$ -150272 -275974 -336569 -207187 -169034 -86153 -182067 121344 319029 429135 306216
21255C06216j8923O4826k99686j20650j65765J99253K65946k10035m34821j44023
$$ 306216 287293 352119 52433 -68217 -233982 -34729 231217 21182 -413639 -557662
21245e57662J20976J10852M85982q7312k99168J05528r6941J54466O2892J2881
$$ -557662 -436686 -325834 160148 72836 -226332 -120804 -217745 -63279 -387 12494
21235A2494Q5033j32242k81209Q0654J85911o786L46997Q2998N0266q02k50628
$$ 12494 97527 -34715 -315924 -235270 -49359 -56145 290852 373850 424116 423314 172686
21224A72686k75012k46565n8652M81851J58293j10688m70436M2971M81915K20967
$$ 172686 -102326 -348891 -407543 74308 232601 121913 -348523 -305552 176363 397330
21214C97330K087k55882j27018k819K27757L545k03074K4190M1409j11161p4985
$$ 397330 399417 143535 16517 13698 241455 245000 41926 66116 107525 -3636 -78621
21203g8621j53441K12998j40437K8353J12559L8470M92430j37718l60398K0335
$$ -78621 -232062 -19064 -159501 -131148 -18589 19881 512311 374593 14195 34530
21193C4530K51242J29632k55443l6215L1827L1969R7557j4928J88106J4093j97181
$$ 34530 285772 415404 159961 123746 155573 187542 285099 270171 458277 472370 275189
21182B75189l18806k34402J7449j24231K38018K95391J53593J50517J7605j77568
$$ 275189 -43617 -278019 -260570 -384801 -146783 148608 302201 452718 470323 292755
21172B92755j52J13702J58036l12646m60373q857J55792K78474J1402j27332l15470
$$ 292755 292603 406305 564341 251695 -208678 -217535 -61743 216731 228133 100801 -214669
21161b14669J18450J96548J23497j34339j51232k45784K800J59624Q0987l9858
$$ -214669 -96219 100329 223826 89487 -61745 -307529 -304729 -145105 -64118 -103976
21151a03976J3995O2325n2432r9013K4566n3004N7473o7921J87777J32861j3781
$$ -103976 -89981 -27656 -80088 -179101 -154535 -207539 -150066 -217987 -30210 102651 88870
21140H8870Q8368K11799J460o9883j46867n4413K05845J11085n7128K21135j37287
$$ 88870 177238 389037 390497 320614 173747 119334 325179 436264 379136 600271 462984
21129D62984j65661J29248J54686n54238j21731k5859p8122l9790k14913l9705
$$ 462984 297323 426571 581257 27019 -94712 -120571 -198693 -238483 -453396 -493101
21119d93101J32875K31845P710k38529K74381J47861k26967l66967J59899L01667
$$ -493101 -360226 -128381 -120671 -359200 -84819 63042 -163925 -530892 -370993 -69326
21109f9326J90546o0218j9929j69564J35862j33454j18529m29546J0110J49258
$$ -69326 121220 61002 41073 -128491 7371 -126083 -244612 -674158 -664048 -514790
21099e14790J42818L77314K37044Q8458k87718j30482Q0448j49915j37018K19349
$$ -514790 -371972 5342 242386 330844 43126 -87356 -6908 -156823 -293841 -74492
21089g4492L78735J67519k9032J84936o801l90395r6995r64m8069j68182m1447
$$ -74492 304243 471762 442730 627666 620865 230470 133475 132511 84442 -83740 -125187
21078a25187l8060j90076m1863R3172J84534K0216N8308j95880n6499k27744L35740
$$ -125187 -163247 -353323 -395186 -302014 -117480 -97264 -38956 -234836 -291335 -519079 -183339
21067a83339L41397l22457l86871j47377J6953J54779O71387J61009N4715m02985
$$ -183339 158058 -164399 -551270 -698647 -681694 -526915 144472 305481 360196 -42789
21057d2789k38575k93116M55131L65666q6580O1394J40913r0063j70425m01965
$$ -42789 -281364 -574480 -119349 246317 159737 221131 362044 271981 101556 -300409
21047c00409k68300l7821l1058J75323M90478J14620k06189j45725q8259N9242
$$ -300409 -568709 -606530 -637588 -462265 28213 142833 -63356 -209081 -297340 -238098
21037b38098L84656J01434J2734J24319J57900j59347k68243k22063k0497q455
$$ -238098 146558 247992 260726 385045 542945 383598 115355 -106708 -127205 -135660
21027a35660J07213N4865J08247j29074j3583p874m67277k55934J99051J16620
$$ -135660 -28447 26418 134665 5591 -7992 -15866 -483143 -739077 -540026 -423406
21017d23406L25746J7991r6820j12355J43823J34940m46916j54453J24612J97495
$$ -423406 -97660 -79669 -176489 -288844 -145021 -10081 -456997 -611450 -486838 -289343
21007b89343o1739J11416r1875K93660J10915j49141o15399m4045j20494R8074
$$ -289343 -351082 -239666 -331541 -37881 73034 -76107 -691506 -735551 -856045 -757971
20997g57971l9414L75076O3170o8170J44174Q5406J45970j45835k65352j98592
$$ -757971 -797385 -422309 -359139 -427309 -283135 -197729 -51759 -197594 -462946 -661538
20987f61538Q0161L51437L51309j06240n7934j09939K48308K18807l21295j99482
$$ -661538 -581377 -229940 121369 15129 -42805 -152744 95564 314371 -6924 -206406
20977b06406O1102L66009l1746l56745L5664J53842j61775j77733j4484o7249
$$ -206406 -145304 220705 188959 -167786 -132122 21720 -140055 -317788 -332272 -399521
20967c99521l9582j3312P2557k54775k08008o791j23813K07994M90836o785J1109
$$ -399521 -439103 -452415 -379858 -634633 -842641 -849432 -973245 -765251 -274415 -281200 -270091
20956b70091O78549M10569o6634n89067R8781K95028N550K2157j74412l12498
$$ -270091 408458 819027 752393 163326 262107 557135 562685 584842 410430 97932
20946I7932n6363K09675J01148j00959k30414J24191J3369j1929k57971r4968
$$ 97932 41569 251244 352392 251433 21019 145210 158579 146650 -111321 -206289
20936b06289K48071M4330J62567m3682k25716o0980q4627K50335K89589k79261
$$ -206289 41782 86112 248679 204997 -20719 -81699 -166326 84009 373598 94337
20926I4337j3529j54540k43131J57258J25838n2242k11530j31085j75827m4054
$$ 94337 80808 -73732 -316863 -159605 -33767 -86009 -297539 -428624 -604451 -648505
20916f48505l3433q5915L9102K12599J13282j23923l15085K83195K4440k2266
$$ -648505 -681938 -767853 -728751 -516152 -402870 -526793 -841878 -558683 -534243 -556509
20906e56509M72740J61670M9570j61840j17506p1714q3613j7520K09493K05026
$$ -556509 -83769 77901 127471 -34369 -151875 -223589 -307202 -324722 -115229 89797
20896H9797j12584K37066O0591l08701j94476p6466J66847M55787J72050l14696
$$ 89797 -22787 214279 274870 -33831 -228307 -304773 -137926 317861 489911 175215
20886A75215l42109J39794L15517j54038J49366l6258k01643k17530O8068k74145
$$ 175215 -166894 -27100 288417 134379 283745 247487 45844 -171686 -103618 -377763
20876c77763k0497K76826P9708L5054J4393j92782l3586J02009j8475r3918L64660
$$ -377763 -398260 -121434 -41726 -6672 7721 -185061 -218647 -116638 -135113 -229031 135629
20865A35629m5561p0204J72225l96326n64171l86081K00565M27201J11765Q2553
$$ 135629 90068 19864 192089 -204237 -768408 -1154489 -953924 -526723 -414958 -332405
20855c32405J66103J64891J80114l54549k69584m417J63085p2329l72529o1321
$$ -332405 -166302 -1411 178703 -175846 -445430 -449847 -286762 -359091 -731620 -792941
20845g92941L38980N66994K76516j38863j74812l17930j74924p5343j9130K85110
$$ -792941 -453961 113033 389549 250686 75874 -242056 -416980 -492323 -511453 -226343
20835b26343K30923r857j06874k05300q2639k66923J03245j8527j61379J38452
$$ -226343 4580 -5277 -112151 -317451 -400090 -667013 -563768 -582295 -743674 -605222
20825f05222L36859J95829j40548L11966K57965m30780l49013J46016J41493J23476
$$ -605222 -268363 -72534 -213082 98884 356849 -73931 -422944 -276928 -135435 -11959
20815a1959N2433N2219L64543k80042j71694o556k42142K68421n5403r9794j00595
$$ -11959 40474 92693 457236 177194 5500 -1056 -243198 25223 -30180 -129974 -230569
20804b30569j01337J57826L0297O3030k7191J42658Q9287m09761l05495j9797
$$ -230569 -331906 -174080 -143783 -80753 -107944 34714 124001 -285760 -591255 -611052
20794f11052j7316J71923M83213M06038L1705J69470l69097j26276l2619N1819
$$ -611052 -628368 -456445 26768 432806 464511 633981 264884 138608 105989 157808
20784A57808j47605J85540k96415l74797K21487M46074L23258J83505k15617k50155
$$ 157808 10203 195743 -100672 -475469 -253982 192092 515350 698855 483238 233083
20774B33083l56703K73033M34818J21845J6205l42006m15224m7284J35447R2239
$$ 233083 -123620 149413 584231 706076 722281 380275 -34949 -82233 53214 145453
20764A45453n9174n2818J48098K45051n8406k58571j20569m15996m4856J51240
$$ 145453 86279 33461 181559 426610 368204 109633 -10936 -426932 -471788 -320548
20754c20548K13904J12317k41523j76632M5706M21308J01838N3653j17377K8680
$$ -320548 -106644 5673 -235850 -412482 -366776 54532 156370 210023 92646 121326
20744A21326j94655m44924o9549J38141R107J4945J18288R511l00432k1630O42780
$$ 121326 -73329 -518253 -587802 -449661 -440554 -425609 -307321 -297810 -598242 -619872 22908
20733B2908K44780J15183k65728n49006j48326J94702p8573o2200L70708L31429
$$ 22908 267688 382871 117143 -431863 -580189 -385487 -464060 -526260 -155552 175877
20723A75877K79661k61739l68368K7901j09313K5085J75980J60606j62279j34739
$$ 175877 455538 193799 -174569 -146668 -255981 -230896 -54916 105690 -56589 -191328
20713a91328n6701k8551j00191J71381j47871q5953K22459M48961J40165j97664
$$ -191328 -248029 -276580 -376771 -205390 -353261 -439214 -216755 232206 372371 174707
20703A74707K22103k43684k47411N8311j13918n3691j43382K51715J41807m46576
$$ 174707 396810 153126 -94285 -35974 -149892 -203583 -346965 -95250 46557 -400019
20693d00019j4046O5253K54150K22254k41986J79242K21200L3674J18030j45292
$$ -400019 -414065 -348812 -94662 127592 -114394 64848 286048 319722 437752 292460
20683B92460J21794k25063j34234j1374k79033l7839k72795N098k45066K00314
$$ 292460 414254 189191 54957 43583 -235450 -273289 -546084 -540986 -786052 -585738
20673e85738M85065O6293k25842p0443j86295P0582J62464k75736k06994j01945
$$ -585738 -100673 -34380 -260222 -330665 -516960 -446378 -283914 -559650 -766644 -868589
20663h68589J45910P2587K3654J80371K23914J7976j49048J0819K87490K64177
$$ -868589 -722679 -650092 -626438 -446067 -222153 -204177 -353225 -342406 -54916 209261
20653B09261j62284j45907L38008l0886R5958j26329j40256Q0241O7214N4765
$$ 209261 46977 -98930 239078 208192 304150 177821 37565 117806 185020 239785
20643B39785N982O1698j81394l27118K96R2957K4845P235K45491K03182l18766
$$ 239785 245767 307465 126071 -201047 -200751 -107794 -82949 -75714 169777 372959 54193
20632E4193k73819l17588M2814K41652M4276L0725J13262r1351j37799O5005n6175
$$ 54193 -219626 -537214 -494400 -252748 -208472 -177747 -64485 -155836 -293635 -228630 -284805
20621b84805K28214K22547K01630J00573N5402l77712o24529k44497L4664K68933
$$ -284805 -56591 165956 367586 468159 523561 145849 -478680 -723177 -688513 -419580
20611d19580K94387J7381j39681k10643j49592N2655J00227J75854J28265K8368
$$ -419580 -125193 -107812 -247493 -458136 -607728 -555073 -454846 -278992 -150727 -122359
20601a22359j14287q2324P9131L6318j9228J20797K01861r137k09247o2822K13231
$$ -122359 -236646 -318970 -239839 -203521 -222749 -101952 99909 90772 -118475 -181297 31934
20590C1934j35363q7768M30164K33239J05601k18160k46102j29204q1174M328
$$ 31934 -103429 -191197 238967 472206 577807 359647 113545 -15659 -96833 -92505
20580i2505L02569o3880j81323L01987L80314j40356k61716j94871r8383k6781
$$ -92505 210064 146184 -35139 266848 647162 506806 245090 50219 -48164 -74945
20570g4945Q548M9908l66080k04330Q3550L20275N6812l0711j49497J55618L84619
$$ -74945 -66397 -16489 -382569 -586899 -503349 -183074 -126262 -156973 -306470 -150852 233767
20559B33767j02273q5143O3070J85172J26797j93950l55323J1449J15008P8384
$$ 233767 131494 46351 109421 294593 421390 227440 -127883 -116434 -1426 76958
20549G6958k01583M9563K76739K36988L07843k36521m87234k65047j2014k73601
$$ 76958 -124625 -75062 201677 438665 746508 509987 22753 -242294 -254308 -527909
20539e27909l72026L90116P09804R1181l7642l48131l31732J17455J91041J75472
$$ -527909 -899935 -509819 199985 291166 253524 -94607 -426339 -308884 -117843 57629
20529E7629J16078l20014j95961q6621K99781K46302j14533J88352J04475r899
$$ 57629 173707 -146307 -342268 -428889 -129108 117194 2661 191013 295488 285589
20519B85589n5337J94310J8028l4039M9909j69342K8655n3672l47961j76400J91573
$$ 285589 230252 424562 442590 408551 458460 289118 317773 264101 -83860 -260260 -68687
20508f8687R9731k55687j27044p9460j36043l45644n4431Q1125K69762K57861
$$ -68687 31044 -224643 -351687 -431147 -567190 -912834 -967265 -886140 -616378 -358517
20498c58517L10102M00610Q3805Q4001l7342j02333l25230l84530J40002o569
$$ -358517 -48415 352195 436000 520001 482659 380326 55096 -329434 -189432 -196001
20488a96001L2817j7713j87274K55126n107j04187j85536n8495J55777M4359Q5562
$$ -196001 -163184 -180897 -368171 -113045 -118152 -222339 -407875 -466370 -310593 -266234 -180672
20477a80672J78723N3969j7865J85925J29529k31309o7907q5493l20596K030J3208
$$ -180672 -1949 52020 34155 220080 349609 118300 50393 -35100 -355696 -353666 -340458
20466c40458k1548J76761N5590j66175j63549m1698K79433J6192L24081q8878
$$ -340458 -362006 -185245 -129655 -295830 -459379 -501077 -221644 -205452 118629 29751
20456B9751o1427Q699O6033J52461n50621l7501L52063j03147j74342j73774N6222
$$ 29751 -31676 -22977 43056 195517 -355104 -392605 -40542 -143689 -318031 -491805 -435583
20445d35583k6487J6532L6575n2503J28354l80262o1007L36212N6875j42113J11677
$$ -435583 -462070 -445538 -408963 -461466 -333112 -713374 -774381 -438169 -381294 -523407 -411730
20434d11730L305j31582M02451N30061j5746j69678p7635k03458L066l9492J8133
$$ -411730 -408425 -540007 -137556 392505 376759 207081 129446 -74012 -70946 -110438 -92305
20423i2305j37758J52537j37110N8758R1592k18186L118M7165p1557L42271k2402
$$ -92305 -230063 -77526 -214636 -155878 -64286 -282472 -279354 -232189 -303746 38525 16123
20412A6123j64894J11077j47205J8572j17349m45206l72726K71144M59867J6050
$$ 16123 -148771 -37694 -184899 -166327 -283676 -728882 -1101608 -830464 -370597 -354547
20402c54547R0626K39834Q5740k2612k86796k3076J92469n5842k91782j75395
$$ -354547 -263921 -24087 61653 39041 -247755 -270831 -78362 -134204 -425986 -601381
20392f01381n4134Q7858P1983J34226k42447J81198K10469L41862l25320j1640
$$ -601381 -655515 -567657 -495674 -361448 -603895 -422697 -212228 129634 -195686 -207326
20382b07326K74992L23577l85601k17687p0161K6958m3722K96289j30755j30878
$$ -207326 67666 391243 5642 -212045 -282206 -255248 -298970 -2681 -133436 -264314
20372b64314k0597K96857N430Q3246J83307k4018j79522k8812J55396r808j77037
$$ -264314 -284911 11946 17376 100622 283929 259911 80389 51577 206973 197165 20128
20361B0128k84416j01368K32011J49109j2525K57385O8816L321M7092o7378k75157
$$ 20128 -264288 -365656 -133645 15464 2939 260324 329140 332461 379553 312175 37018
20350C7018k16690m7964l790O4448p1113r1295o8085p7341L8904J10450K02949
$$ 37018 -179672 -227636 -231426 -166978 -238091 -329386 -397471 -474812 -435908 -325458 -122509
20339a22509K00950J59368L08134J0645l73647O0152j62815k80459K9992Q8722
$$ -122509 78441 237809 545943 556588 182941 243093 80278 -200181 -170189 -81467
20329h1467J59758L96549Q1231l3976j12784n55089l69924J11017M25090j40458
$$ -81467 78291 474840 556071 522095 409311 -145778 -515702 -404685 20405 -120053
20319a20053k75419J20807p0213q2264J99653J1269K64975o2540k11070l61208
$$ -120053 -395472 -274665 -344878 -427142 -227489 -216220 48755 -13785 -224855 -586063
20309e86063n8311L23411L00909m7474k53431j93805K22962J60266M1443j6334
$$ -586063 -644374 -320963 -20054 -67528 -320959 -514764 -291802 -131536 -90093 -106427
20299a06427J01275k0741N3434n0718L36384J52004l43876K1013p599L05408j76251
$$ -106427 -5152 -25893 27541 -23177 313207 465211 121335 142348 134749 440157 263906
20288B63906k85689K07129q8169k75695K34674j8196m63084O1640K80847k95757
$$ 263906 -21783 185346 97177 -178518 56156 37960 -425124 -363484 -82637 -378394
20278c78394l93964L30396K58680K50440K23746l32951k32064R508K7578k65285
$$ -378394 -772358 -441962 -183282 67158 290904 -42047 -274111 -264603 -237025 -502310
20268e02310J02088K95045J23364J8264j63287P0434K77974P0436k07779l81883
$$ -502310 -400222 -105177 18187 36451 -126836 -56402 221572 292008 84229 -297654
20258b97654Q738J35029J77034J60093J02875K14984j93211n3726j38532l17648
$$ -297654 -288916 -153887 23147 183240 286115 501099 307888 254162 115630 -202018
20248b02018q3219O8395j7604K86957K32486l96961j87789k26729q1877J84026
$$ -202018 -285237 -216842 -234446 52511 284997 -111964 -299753 -526482 -608359 -424333
20238d24333J72761k6207M0398K56059K5291J77022R7535l32849j85437r7096
$$ -424333 -251572 -277779 -237381 18678 43969 220991 318526 -14323 -199760 -296856
20228b96856K4599j5912K27687L25247j72603k74737o8988K86021J61809j33240
$$ -296856 -272257 -288169 -60482 264765 92162 -182575 -251563 34458 196267 63027
20218F3027j20322Q8699k81079j95818M92071K08603M11917N06530l66633n59308
$$ 63027 -57295 31404 -249675 -445493 46578 255181 667098 1173628 806995 247687
20208B47687n85284l7407N2433J72151o0175L02693L10762J28341k52241k52116
$$ 247687 -337597 -375004 -322571 -150420 -210595 92098 402860 531201 278960 26844
20198B6844R3050q1311j06624Q9271J76390j65279k89704K47231L0599J34443
$$ 26844 119894 38583 -68041 21230 197620 32341 -257363 -10132 20467 154910
20188A54910l15032k9950M12300j69870l22179k11096K7545M20730L23523q5942
$$ 154910 -160122 -190072 222228 52358 -269821 -480917 -453372 -32642 290881 204939
20178B04939j06839J71931o6218l15261j08285p5272K43034O2561l49686l48530
$$ 204939 98100 270031 203813 -111448 -219733 -295005 -51971 10590 -339096 -687626
20168f87626j52557j11370K81006N90307L7625p3997K061R7429J64441J51708
$$ -687626 -840183 -951553 -670547 -80240 -42615 -116612 -114551 -17122 147319 299027
20158B99027J0163j47378L4544N4191p8198j61991q1407l98385M9939p480J32161
$$ 299027 309190 161812 196356 250547 172349 10358 -71049 -469434 -419495 -426975 -294814
20147b94814J03843J68489J0940k14626p3609K77284J57111J49123k2288k36624
$$ -294814 -190971 -22482 -11542 -226168 -299777 -22493 134618 283741 261453 24829
20137B4829L3157l3965l13303j69477J25486L59349J14343k93032J38185L56110
$$ 24829 57986 24021 -289282 -458759 -333273 26076 140419 -152613 -14428 341682
20127C41682k15035k84743p4061l60745j01263N74K01850P1983n11379P9423N4491
$$ 341682 126647 -158096 -232157 -592902 -694165 -693591 -491741 -419758 -931137 -851714 -797223
20116g97223J44992J04858M9756J66023L48769K65463j23257r2912N3721j32729
$$ -797223 -652231 -547373 -497617 -331594 17175 282638 159381 66469 120190 -12539
20106a2539l594r9659l72574m61928j18232L61064Q5365J88219J36710m30581
$$ -12539 -16133 -115792 -488366 -950294 -1068526 -707462 -622097 -433878 -297168 -727749
20096g27749J77784J22656J23042p3373o0389J8938K19201n1348j62445k3909
$$ -727749 -549965 -427309 -304267 -377640 -438029 -419091 -199890 -251238 -413683 -437592
20086d37592M09860N7347M698j06762l30711j3660J86156l36506j29986K71754
$$ -437592 -27732 29615 34313 -72449 -403160 -416820 -230664 -567170 -697156 -425402
20076d25402J31158J10898J58122J36595k46297k57763L1430J85574L46489o2894
$$ -425402 -294244 -183346 -25224 111371 -134926 -392689 -361259 -175685 170804 107910
20066A07910k19755k61279K47333K7545L6610K6236j3565O1516k87752j35497
$$ 107910 -111845 -373124 -125791 -98246 -61636 -35400 -48965 12551 -275201 -410698
20056d10698J77845J54865j6445l17334j10305j32474K49586L34762n195p8809
$$ -410698 -232853 -77988 -94433 -411767 -522072 -654546 -404960 -70198 -75393 -154202
20046a54202k92478R6810R4311k44944N1489J79894K74444K94812m3370j08212
$$ -154202 -446680 -349870 -255559 -500503 -449014 -269120 5324 300136 256766 148554
20036A48554o5358l2156o4157o1220n0176m4153j1790N10088j43342m73517k9187
$$ 148554 83196 51040 -13117 -74337 -124513 -168666 -180456 329632 186290 -287227 -316414
20025c16414j599K54784p2753k18446J74334K24964J28057j27170j46442k44846
$$ -316414 -318013 -63229 -135982 -354428 -180094 44870 172927 45757 -100685 -345531
20015c45531l66214O3338M01722K20721P2682M5145j52489k25477r6889J77178
$$ -345531 -711745 -648407 -246685 -25964 46718 91863 -60626 -286103 -382992 -205814
20005b05814J59704K42123L93818j62095O0385k44453L985J5659n7015J73165
$$ -205814 -46110 196013 589831 427736 488121 243668 247653 263312 206297 379462
19995C79462j08434o2137Q1924k26902P0268L9551N4427r0844p7546k64261r5369
$$ 379462 271028 208891 290815 63913 134181 173732 228159 137315 59769 -204492 -299861
19984b99861R5158J82667J05631q1655j7531j65336P1872M75595j43856j93782
$$ -299861 -204703 -22036 83595 1940 -15591 -180927 -109055 366540 222684 28902
19974B8902L11504J37393Q4514m3672k52120j03999m8881L31640J3600n34138
$$ 28902 340406 477799 562313 518641 266521 162522 113641 445281 458881 -75257
19964g5257M9658L91750j26242O6731K63200m55119m59055Q6088K00754P5289
$$ -75257 -25599 366151 239909 306640 569840 114721 -344334 -258246 -57492 17797
19954A7797K99147N2046m76418p0450k57739q2674K51495k73664K10243L58497
$$ 17797 316944 368990 -107428 -177878 -435617 -518291 -266796 -540460 -330217 28280
19944B8280K7161K96321J15292K10295r5750l62007o3900L5870J6406J20452l47289
$$ 28280 55441 351762 467054 677349 581599 219592 155692 191562 207968 328420 -18869
19933a8869j3242j31272l77002K86106O39650Q042k54760k07316J17922M6007
$$ -18869 -32111 -163383 -540385 -254279 385371 393413 138653 -68663 49259 95266
19923I5266J74313K90132L041l69857l03488K0097r9603l29317L8769J61100J35220
$$ 95266 269579 559711 562752 192895 -110593 -90496 -190099 -519416 -480647 -319547 -184327
19912a84327j38466J92032j12992N5083J70434L49376q755P3690o6846r3948J60728
$$ -184327 -322793 -130761 -243753 -188670 -18236 331140 322385 396075 329229 235281 396009
19901C96009j13236j17851k67783m10136n36426J47119L92443K46919N187l32256
$$ 396009 282773 164922 -102861 -512997 -1049423 -902304 -509861 -262942 -257755 -590011
19891e90011k5157J87842K2795P229J76506J7475L6772K26811K0339J68781j58179
$$ -590011 -615168 -427326 -404531 -397302 -220796 -203321 -166549 60262 80601 249382 91203
19880I1203r6470K47537o4189J7835N3863M8639j45013o07697j75524J28517n3425
$$ 91203 -5267 242270 178081 195916 249779 298418 153405 -454292 -629816 -501299 -554724
19869e54724J13247K97861j38891k36988j10972k1450J25137M97911M10839l17597
$$ -554724 -441477 -143616 -282507 -519495 -630467 -651917 -526780 -28869 381970 64373
19859F4373l40281l08317K74925L44770K76716k29875M9863m3473Q2447l7647
$$ 64373 -275908 -584225 -309300 35470 312186 82311 132174 88701 171148 133501
19849A33501J64653k79865N8750k7953l7821N9747k68095q2138K8937K33404M07942
$$ 133501 298154 18289 77039 49086 11265 71012 -197083 -279221 -250284 -16880 391062
19838C91062M47699J54910q9085j65284n29689p8562K98994j65327j97405k65914
$$ 391062 838761 993671 904586 739302 209613 131051 430045 264718 67313 -198601
19828a98601r8696N61O0613J6388j31102L13804Q0780R6078k4559k46937r7429
$$ -198601 -297297 -296736 -236123 -219735 -350837 -37033 43747 139825 115266 -131671 -229100
19817b29100J03205j9760l84396j45654O0698K38931L48639K42469l5900j03924
$$ -229100 -125895 -145655 -530051 -675705 -615007 -376076 -27437 215032 179132 75208
19807G5208q8823n04391k83385M1208Q5591J98684K95468q7482n8180J61937Q6428
$$ 75208 -13615 -518006 -801391 -760183 -674592 -475908 -180440 -267922 -326102 -164165 -77737
19796g7737j75821m27130M69547K19323l7774p0625L2460L22764P7905m4362J05292
$$ -77737 -253558 -680688 -211141 8182 -29592 -100217 -67757 255007 332912 288550 393842
19785C93842J38060o6062o1808q6638j0101K13207o4661l79524N5074J53898o7483
$$ 393842 531902 465840 404032 317394 307293 520500 455839 76315 131389 285287 217804
19774B17804M538L91811O1127o36116l18694J06061N02390j94175k56893n2672
$$ 217804 222342 614153 675280 39164 -279530 -173469 328921 134746 -122147 -174819
19764a74819K95174m3417J27203P5990j69592l51284k56729K45500J19282j24903
$$ -174819 120355 76938 204141 280131 110539 -240745 -497474 -251974 -132692 -257595
19754b57595L71415q573p3446p952q2047J43208M4964m77302j5552j17163R8778
$$ -257595 113820 105247 31801 23849 -58198 85010 129974 -347328 -362880 -480043 -381265
19743c81265n6552J76062Q6288J56343l85395J962k1279j0475j38206Q0024k5023
$$ -381265 -437817 -261755 -175467 -19124 -404519 -402557 -423836 -434311 -572517 -492493 -517516
19732e17516J30950L15936L54459K70535j52998j94027n30473L851K37086o9809
$$ -517516 -386566 -70630 283829 554364 401366 207339 -323134 -319283 -82197 -152006
19722a52006k65858q1966L76026J32528j81745J46182J97853m4243j29757j28724
$$ -152006 -417864 -499830 -123804 8724 -173021 -26839 171014 126771 -2986 -131710
19712a31710p5449J52250K19385P8913k57621j65146k33486L8144p2452q019L11799
$$ -131710 -207159 -54909 164476 243389 -14232 -179378 -412864 -374720 -447172 -455191 -143392
19701a43392R3475j38086j72758J39194J73683k0618p4853L8217J94807K58831
$$ -143392 -49917 -188003 -360761 -221567 -47884 -68502 -143355 -105138 89669 348500
19691C48500k25645m35878j21199N748R3497J15380L67999J93646L7105k65401
$$ 348500 122855 -313023 -434222 -428474 -334977 -219597 148402 342048 379153 113752
19681A13752J29994m1168m85114j83138O1891N8478K26518j98804p8416N9502
$$ 113752 243746 202578 -282536 -465674 -403783 -345305 -118787 -317591 -396007 -336505
19671c36505j91154R5353Q2753j43065p5077Q2142j81579k35954K82936M79102
$$ -336505 -527659 -432306 -349553 -492618 -567695 -485553 -667132 -903086 -620150 -141048
19661a41048j43788o3535M5866J09568m1002r5001k2984K3600K57886j05346J75598
$$ -141048 -284836 -348371 -302505 -192937 -233939 -328940 -351924 -328324 -70438 -175784 -186
19650a86J12256m27517j61933K46687M43757K51864K8213k11452k85676o5137
$$ -186 112070 -315447 -477380 -230693 213064 464928 493141 281689 -3987 -69124
19640f9124J74665P6322O2391J33627L8519J5675J35571l81822l4317k66915k21433
$$ -69124 105541 181863 244254 377881 416400 432075 567646 185824 151507 -115408 -336841
19629c36841p6528k06343K4066L57319L49867J16588L46664M7234m79206q2263
$$ -336841 -413369 -619712 -595646 -238327 111540 228128 574792 622026 142820 60557
19619F0557M3141r7126J70495M70870R0701k91396j25749m4583l40082k04299
$$ 60557 103698 6572 177067 647937 738638 447242 321493 276910 -63172 -267471
19609b67471M3189k3991J75607K86486q1952J3385j38761N1780K34589J78509
$$ -267471 -224282 -248273 -72666 213820 131868 145253 6492 58272 292861 471370
19599D71370J03367m20600k43485J85616j32572k742l33787j08001L63657O0002
$$ 471370 574737 154137 -89348 96268 -36304 -39046 -372833 -480834 -117177 -57175
19589e7175L44378K87574K16174j93995l7437m50791n3310m8448L47593j0003
$$ -57175 287203 574777 790951 596956 559519 108728 55418 6970 354563 344560
19579C44560M28J78024j76569l3654K1237J94117p6004l33061r3796k33528p2458
$$ 344560 344988 523012 346443 312789 334026 528143 452139 119078 25282 -208246 -280704
19568b80704K48562L04064J37388m3962K7908l52198l97942K0478K96004L70139
$$ -280704 -32142 271922 409310 365348 393256 41058 -356884 -336406 -40402 329737
19558C29737j18441k07744L1198K70277M7730k9871L02406K81464r5006j86598
$$ 329737 211296 3552 34750 305027 352757 322886 625292 906756 811750 625152
19548F25152l15505k88878k72961J45578L68286O3783j79568j09016k4355J5437
$$ 625152 309647 20769 -252192 -106614 261672 325455 145887 36871 12516 27953
19538B7953j77195o7458J34712K9477J61416p1620l40340j44700n04093J89275
$$ 27953 -149242 -216700 -81988 -52511 108905 37285 -303055 -447755 -951848 -762573
19528g62573L14620K31321J74694j1403k77228r8087P4088J74428L64346q9420
$$ -762573 -447953 -216632 -41938 -53341 -330569 -428656 -354568 -180140 184206 94786
19518I4786R4888J83076m0673k08643l2129M30255L23022k81332l82593j22816
$$ 94786 189674 372750 332077 123434 91305 521560 844582 563250 180657 57841
19508E7841J3182m955n0588L6200P0900j31988k08458K84417J61944k10319l53671
$$ 57841 71023 66068 15480 51680 122580 -9408 -217866 66551 228495 18176 -335495
19497c35495o2947n6039L5105J53080q867Q8058j13958O0572l5415j63877K01686
$$ -335495 -398442 -454481 -419376 -266296 -275163 -187105 -301063 -240491 -275906 -439783 -238097
19486b38097M11321j86276k57211j3652J97185o3851j08217k69151J49172J59366
$$ -238097 173224 -13052 -270263 -283915 -86730 -150581 -258798 -527949 -378777 -219411
19476b19411K82196J19314r093k9279J24789J30687k45773l17407j6463K24367
$$ -219411 62785 182099 173006 143727 268516 399203 153430 -163977 -180440 43927
19466D3927J66072k53043q9964k4530j41931Q4844j02182l26577p3110m6286P12987
$$ 43927 209999 -43044 -133008 -157538 -299469 -214625 -316807 -643384 -716494 -762780 -49793
19455d9793J49601l17289j94230J21294k75134K56273K19047O1435N2943O6584
$$ -49793 99808 -217481 -411711 -290417 -565551 -309278 -90231 -28796 24147 90731
19445I0731L37508l3307j03704Q6462j19201m6144j12740j00062J44167k59019
$$ 90731 428239 394932 291228 377690 258489 212345 99605 -457 143710 -115309
19435a15309J75654q0315j990l79968k58100L8554J25257K51275L37414r5241
$$ -115309 60345 -19970 -21960 -401928 -660028 -621474 -496217 -244942 92472 -2769
19425b769k49706r6041L2030J49194R5384q4853k58646j03997j68194L80371k8345
$$ -2769 -252475 -348516 -316486 -167292 -71908 -156761 -415407 -519404 -687598 -307227 -335572
19414c35572L87577R6577l07265k90285K58728j2814p794K4900K1910L39847J19871
$$ -335572 52005 148582 -158683 -448968 -190240 -203054 -210848 -185948 -164038 175809 295680
19403B95680k12860k8690L9295j17338k01327L5157j43769p6580k11274k14023
$$ 295680 82820 54130 93425 -23913 -225240 -190083 -333852 -410432 -621706 -835729
19393h35729O72935M28233k78523k73189k22706p8367O2265N0341M67541J75559
$$ -835729 -162794 265439 -13084 -286273 -508979 -587346 -525081 -474740 -7199 168360
19383A68360K77778J03184k63401k52941k77950O7408L59751j31347l71485r1235
$$ 168360 446138 549322 285921 32980 -244970 -177562 182189 50842 -320643 -411878
19373d11878j54074K47493J89374j34493J52768j28220J77155K13854k76394m7149
$$ -411878 -565952 -318459 -129085 -263578 -110810 -239030 -61875 151979 -124415 -171564
19363a71564N82366R3143j25906k1096k34130L2777J7809j18762K07500o6073
$$ -171564 410802 503945 378039 356943 122813 155590 173399 54637 262137 196064
19353A96064Q6273J76853J71154j91197j29073j20356J21640Q8817j78140J86861
$$ 196064 282337 459190 630344 439147 310074 189718 311358 400175 222035 408896
19343D08896k44185j89137k74835k05276q0010N13500L79506K8500m3203k42049
$$ 408896 164711 -24426 -299261 -504537 -584547 -71047 308459 336959 293756 51707
19333E1707k48476l56402j3894j55104J25839K66686N2513n5415k0576k48525
$$ 51707 -196769 -553171 -567065 -722169 -596330 -329644 -277131 -332546 -353122 -601647
19323f01647j16656K77857M29909J76795k37016L2184J54617o6004k77707o7550
$$ -601647 -718303 -440446 -10537 166258 -70758 -38574 116043 50039 -227668 -295218
19313b95218J86035K31263k0618n7970k45309j23960r6383k7403O5293L95393
$$ -295218 -109183 122080 101462 43492 -201817 -325777 -422160 -449563 -384270 11123
19303A1123K59006r1841j86509o2724l3262L8165K12044L07266r3008j19291M4310
$$ 11123 270129 178288 -8221 -70945 -104207 -66042 146002 453268 360260 240969 285279
19292B85279n1655Q9371r1764l08079M4373J27571j82675M5078J58209j0845L1352
$$ 285279 233624 322995 231231 -76848 -32475 95096 -87579 -42501 115708 104863 136215
19281A36215Q7119k00946l63767R6548K01169K4320J03187J31530K39623P668
$$ 136215 223334 22388 -341379 -244831 -43662 -19342 83845 215375 454998 462666
19271D62666j35247j22759k71615r3585J0827M78436q2730j42533P4741K33347
$$ 462666 327419 204660 -66955 -160540 -149713 328723 245993 103460 178201 411548
19261D11548j51947k29192J72968M8562n25033K43552P10132J05600k69041j66097
$$ 411548 259601 30409 203377 251939 -273094 -29542 680590 786190 517149 351052
19251C51052j56542l64596j56090r7120O0622J66210N2172o6643m1894L39005
$$ 351052 194510 -170086 -326176 -423296 -362674 -196464 -144292 -210935 -252829 86176
19241H6176M93099j34699l07173J31118n0776m19089j8905K02981j57373K04005
$$ 86176 579275 444576 137403 268521 217745 -201344 -220249 -17268 -174641 29364
19231B9364J05004r8649j96535r2566M085L8772j73281J89128K35642j60515j20869
$$ 29364 134368 35719 -160816 -253382 -249297 -210525 -383806 -194678 40964 -119551 -240420
19220b40420K04368R4520J2553k17465L17013J43862l09987L16518M95380K52769
$$ -240420 -36052 58468 71021 -146444 170569 314431 4444 320962 816342 1069111
19210A069111k94795j88659q6167k3121k76598J28727k10582l23867P3651J44532
$$ 1069111 774316 585657 499490 476369 199771 328498 117916 -205951 -132300 12232
19200A2232K60974O41391L35385Q4070j87657j72308N6682L65514K32453j31248
$$ 12232 273206 914597 1249982 1334052 1146395 974087 1030769 1396283 1628736 1497488
19190A497488q3543J14587K33555N1028m52595k41561J45025R5864k14707k41913
$$ 1497488 1413945 1528532 1762087 1813115 1360520 1118959 1263984 1359848 1145141 903228
19180I03228K37765j46629j9967k18580m67697J15509M85003L51221n72865j42943
$$ 903228 1140993 994364 974397 755817 288120 403629 888632 1239853 666988 524045
19170E24045O3785N5935k17595o6548j64060q5550j51951J36149L05098J78249
$$ 524045 587830 643765 426170 359622 195562 110012 -41939 94210 399308 577557
19160E77557R8095j78279l0843J85199K35926J3580p669K83355l49023n42674
$$ 577557 675652 497373 466530 651729 887655 901235 893566 1176921 827898 285224
19150B85224J1501J66933J02181J70469j75682j90428K51327J18189j71640K21930
$$ 285224 296725 463658 565839 736308 560626 370198 621525 739714 568074 790004
19140G90004o1708k80012K16313K60595O55788K24957m31635k19592K17095J37399
$$ 790004 728296 448284 664597 925192 1580980 1805937 1374302 1154710 1371805 1509204
19130A509204j49637k9130l8105O9725K2987k99824R6293K10526k11971l24857
$$ 1509204 1359567 1330437 1292332 1362057 1385044 1085220 1181513 1392039 1180068 855211
19120H55211J76801J048j16113M9463K38042L34211j5064m49534k24434j22245
$$ 855211 1032012 1033060 916947 966410 1204452 1538663 1523599 1074065 849631 727386
19110G27386K0501M75857R0805n3971n6877q3731J84815M0481k19451k14255L0604
$$ 727386 747887 1223744 1314549 1260578 1203701 1119970 1304785 1345266 1125815 911560 942164
19099I42164o24970k95041P4003o488o7546J77549K38745M24911J37657k68944
$$ 942164 317194 22153 96156 89668 22122 199671 438416 863327 1000984 732040
19089G32040j34733Q7562R7401l14754j94071Q5794J36552m1848k65028k37110
$$ 732040 597307 684869 782270 467516 273445 359239 495791 453943 188915 -48195
19079d8195o2713K32917L6292K21374j82739j13349k81353j65922Q0128K83859
$$ -48195 -110908 122009 158301 379675 196936 83587 -197766 -363688 -283560 299
19069B99J40888p6790R8761k46546M6864O6201p0456j38037J59566N3183M51765
$$ 299 141187 64397 163158 -83388 -36524 29677 -40779 -178816 -19250 33933 485698
19058D85698o3051j11438K27995j49214j73677j67777M8116Q4897k96657j16911
$$ 485698 422647 311209 539204 389990 216313 48536 96652 181549 -115108 -232019
19048b32019L87682L79001N9512J80804j00866j58161K51696K12538l81730k12296
$$ -232019 155663 534664 594176 774980 674114 515953 767649 980187 598457 386161
19038C86161n9829K82120j3133k61409l06854K10498J03792N7608j09969q5328
$$ 386161 326332 608452 595319 333910 27056 237554 341346 398954 288985 203657
19028B03657l76947l7403J12826k10520J83124K3606K67113J82937k05945j94292
$$ 203657 -173290 -210693 -97867 -308387 -125263 -101657 165456 348393 142448 -51844
19018e1844R2260J84448K74808J89509P0085K5787m05306k32001O7923J52995
$$ -51844 40416 224864 499672 689181 759266 785053 379747 147746 215669 368664
19008C68664r5386l9796j1280L47397j66167L1420N61l4779m2344r1817j9219
$$ 368664 273278 233482 222202 569599 403432 434852 435413 400634 358290 266473 247254
18997B47254L671Q1912j7911n7834j38481l34563o5701M57711J25594q1319j58916
$$ 247254 250925 332837 314926 257092 118611 -215952 -281653 176058 301652 220333 61417
18986F1417j11049K26116j13216j88183O3358J13332n6318P6761L90995j0097
$$ 61417 -49632 176484 63268 -124915 -61557 51775 -4543 72218 463213 453116
18976D53116M7199M4686k343j07961k32561M8524k15317j25835r7732J18731K71161
$$ 453116 500315 545001 542658 434697 202136 250660 35343 -90492 -188224 -69493 201668
18965B01668Q5718l21066j51510J07139K39025j48970p6556M6270J33883M0328
$$ 201668 287386 -33680 -185190 -78051 160974 12004 -64552 -18282 115601 155929
18955A55929J60223J82011M2756j68270q8159j00371K3887j60962R3448L09542
$$ 155929 316152 498163 540919 372649 284490 184119 208006 47044 140492 450034
18945D50034L66890J53654P8712j10270k23297k14125j39074q6933l626k734n0784
$$ 450034 816924 970578 1049290 939020 715723 501598 362524 275591 271965 269231 218447
18934B18447l4553j04791j83103Q7771m4501K37647L44859L84119J16262k51258
$$ 218447 183894 79103 -104000 -16229 -60730 176917 521776 905895 1022157 770899
18924G70899j10995j10049j81747j34886K12673Q1187j47419k56044o2630l31134
$$ 770899 659904 549855 368108 233222 445895 527082 379663 123619 60989 -270145
18914b70145K17399J23230Q7819K69020K80514K10827j42927l37017p8848Q7113
$$ -270145 -52746 70484 158303 427323 707837 918664 775737 438720 359872 446985
18904D46985J7894k84909k07759R6888R4604L12566K58064k934k42672o5489k4597
$$ 446985 464879 179970 -27789 69099 163703 476269 734333 731399 488727 423238 398641
18893C98641J68892k13917l16676k27641K41356q8104j2807p7469J6507L81316
$$ 398641 567533 353616 36940 -190701 50655 -37449 -50256 -127725 -111218 270098
18883B70098o8291J6222J21234j00964K74J01095J34252k81314J37871K19899
$$ 270098 201807 218029 339263 238299 238573 339668 473920 192606 330477 550376
18873E50376O9566k09402j52045J81479j37106k04296J70710L85224Q1280J47388
$$ 550376 619942 410540 258495 439974 302868 98572 269282 654506 735786 883174
18863H83174k57198n6347J65000j67591l27887l80539K08090L40013q6926j75200
$$ 883174 625976 569629 734629 567038 239151 -141388 66702 406715 319789 144589
18853A44589J91214K54201K2238k84361m3841k3560M54404J43484m91146p6200
$$ 144589 335803 590004 612242 327881 284040 260480 714884 858368 367222 291022
18843B91022J46349M3277j98281l4429K44278r5540m24861j30507L29949M47376
$$ 291022 437371 480648 282367 247938 492216 396676 -28185 -158692 171257 618633
18833F18633k30015j52724p0299k74209l07698J70554N2767P327K80002R5235
$$ 618633 388618 235894 165595 -108614 -416312 -245758 -192991 -185664 94338 189573
18823A89573J50163J4822J11628J90920L87602O8825m15757o7879n1116K54799
$$ 189573 339736 354558 466186 657106 1044708 1113533 697776 629897 578781 833580
18813H33580M49275k7949j71534l99180j73493k38784J20700K32876j82046J3572
$$ 833580 1282855 1254906 1083372 684192 510699 271915 392615 625491 443445 457017
18803D57017m0867L8691j3046K31951K05492j11620R8042J2278j90239k94064
$$ 457017 416150 454841 441795 673746 879238 767618 865660 877938 687699 393635
18793C93635J74993j05464q4537O1780r1208J6026J91158J3276J11257j8367P5781
$$ 393635 568628 463164 378627 440407 349199 365225 556383 569659 680916 662549 738330
18782G38330J41918j51848J39209L37876r510Q6873K83380k04878l72548j86910
$$ 738330 880248 728400 867609 1205485 1195975 1282848 1566228 1361350 988802 801892
18772H01892J41976k8129K24781L37260N49303Q19275K58486K86065l24957q30056
$$ 801892 943868 915739 1140520 1477780 2027083 2846358 3104844 3390909 3065952 2235896
18762B235896m61782k01411l04992l49257k9740k36433K32066M81357M39498k53555
$$ 2235896 1774114 1572703 1267711 918454 888714 652281 884347 1365704 1805202 1551647
18752A551647l23862j65298l83533O2664N43000Q0868j03939m1648J8384J62852
$$ 1551647 1227785 1062487 678954 741618 1284618 1365486 1261547 1219899 1238283 1401135
18742A401135k24865l29554l52879K01913K05849L81147j52088r6635o5446n5682
$$ 1401135 1176270 846716 493837 695750 901599 1282746 1130658 1034023 968577 912895
18732I12895L2922J15300L68078n2100J98282l4889N687M18002J07907n9570Q043
$$ 912895 945817 1061117 1429195 1377095 1575377 1540488 1546175 1964177 2072084 2012514 2020557
18721B020557J12732M16041L75202k37858j19657M39828q81O9774N42859r605
$$ 2020557 2133289 2549330 2924532 2686674 2567017 3006845 3005964 3075738 3618597 3608992
18711C608992l55396N2790L25554N62916J10860m7359J35801N91892M05740M11447
$$ 3608992 3253596 3306386 3631940 4194856 4305716 4258357 4394158 4986050 5391790 5803237
18701E803237O33155J13641J31593O79977P02365O33502Q33505J248933J681823
$$ 5803237 6436392 6550033 6681626 7361603 8063968 8697470 9530975 10779908 12461731
18692A2461731J910399J792911K384600L295489M462292N754961Q344289J1874419
$$ 12461731 14372130 16165041 18549641 21845130 26307422 32062383 40406672 52281091
18684E2281091J4935135J7726108J6843835J0738154J398465n462820n794394
$$ 52281091 67216226 84942334 101786169 112524323 113922788 108459968 102665574
18677A02665574q7867O998235J1129991Q312504k350791j3808940k0194645j8845909
$$ 102665574 102577707 109575942 120705933 129018437 126667646 112858706 92664061 73818152
18669G3818152j3476414q325995m587394j449021O46272K825248N573425Q739230
$$ 73818152 60341738 52015743 47428349 45979328 46625600 49450848 55024273 63763503
18661F3763503J2265579J5864418J8330472J6207148P723676k213949p173532
$$ 63763503 76029082 91893500 110223972 126431120 134154796 131940847 124767315
18654A24767315m821075K188990Q666974J0467557L698862q705646j9114390k2869575
$$ 124767315 119946240 122135230 130802204 141269761 144968623 136262977 117148587 94279012
18646I4279012k0021434j4496127j0314299o784162m948493l112210k243075k256131
$$ 94279012 74257578 59761451 49447152 42662990 37714497 34602287 32359212 30103081
18638C0103081k017723j421924j047528r59966m89732m35389J75955K78494m12348
$$ 30103081 28085358 26663434 25615906 24655940 24166208 23730819 23906774 24185268 23772920
18629B3772920l50261n65565o63432p12148m99660J10296P3639r1251n53782n13505
$$ 23772920 23422659 22857094 22193662 21481514 20981854 21092150 21165789 21074538 20520756 20007251
18619B0007251o77487o35331n04994n95383j1552j03994j69945j7499K40794P75894
$$ 20007251 19329764 18694433 18189439 17594056 17582504 17478510 17308565 17291066 17531860 18307754
18609A8307754R36143R57438J830979K596079L632235M909244O462341R314802
$$ 18307754 19243897 20201335 22032314 24628393 28260628 33169872 39632213 48947015
18601D8947015J2906505J6104639J9647324J9598574J1447188k839084j2094410
$$ 48947015 61853520 77958159 97605483 117204057 128651245 125812161 113717751
18594A13717751j1470019l868035M115758Q264392O143121m807455j6075283j9432652
$$ 113717751 102247732 98379697 102495455 110759847 116902968 112095513 96020230 76587578
18586G6587578j6421193j1643232p314603m536526l356900k121151j499648o67660
$$ 76587578 60166385 48523153 41208550 36672024 33315124 31193973 29694325 29026665
18578B9026665J48946K76209N57159J400916K768418L778212N519730P952431
$$ 29026665 29175611 29451820 30008979 31409895 34178313 37956525 43476255 51428686
18570E1428686J0244047J3969514J8342084K1993125K1722944J1243051m837417
$$ 51428686 61672733 75642247 93984331 115977456 137700400 148943451 144106034
18563A44106034j4320816j2430664l926718M787064Q803581N539504o394817j8696028
$$ 144106034 129785218 117354554 113427836 118214900 127018481 132557985 126163168 107467140
18555A07467140k1686697j8287912j3540012q725351n823305l979536k969772
$$ 107467140 85780443 67492531 53952519 45227168 39403863 35424327 32454555
18548C2454555k442764k113826j965342j696850j232777j248695j146496j168423
$$ 32454555 30011791 27897965 25932623 24235773 23002996 21754301 20607805 19439382
18540A9439382p46035p10568p95155l34676m03180n38348k87340l25933m41184
$$ 19439382 18693347 17982779 17187624 16852948 16449768 15911420 15624080 15298147 14856963
18531A4856963o6099J19596k77465K96874M13896K47231l1964j20963l8609o54964
$$ 14856963 14790864 14910460 14632995 14929869 15343765 15590996 15559032 15438069 15399460 14744496
18521A4744496p16665o86877o09910o01051l37379j77302q85844q27570r49825
$$ 14744496 14027831 13340954 12731044 12129993 11792614 11615312 10729468 9901898 8952073
18512H952073p54715m03645m08003o50360j92516l8185k23113o03753k45539L5498
$$ 8952073 8197358 7793713 7385710 6735350 6542834 6504649 6281536 5677783 5432244 5467742
18502E467742l40306l24541j77518l85492p153J63415l10369m95777l94506k0599
$$ 5467742 5127436 4802895 4625377 4239885 4232732 4396147 4085778 3590001 3195495 3174896
18492C174896j10350M23980L52987p4349j07753j53865l29943m19734K0635O2041
$$ 3174896 3064546 3488526 3841513 3767164 3659411 3505546 3175603 2755869 2776504 2838545
18482B838545k56022k31442j13790J97765j08886j4603l29317K1492j12841L0129
$$ 2838545 2582523 2351081 2237291 2435056 2326170 2311567 1982250 2003742 1890901 1921030
18472A921030K35546j35152j90671j80727j78346K03816j36475j03507j54507
$$ 1921030 2156576 2021424 1830753 1650026 1471680 1675496 1539021 1435514 1281007
18463A281007L03159j3925n35860R3531N04352M73940M26728L54649L4899l76442
$$ 1281007 1584166 1570241 1034381 1127912 1632264 2106204 2532932 2887581 2922480 2546038
18453B546038k98482k71493j69206j66051n53453j30287K84759J3535j07485O2010
$$ 2546038 2247556 1976063 1806857 1640806 1087353 957066 1241825 1255360 1147875 1209885
18443A209885L2883J19500o7077L14075L11221J06480L80818R2088m05350l27628
$$ 1209885 1242768 1362268 1295191 1609266 1920487 2026967 2407785 2499873 2094523 1766895
18433A766895n22320l48739j4365M9559j85986j46336j01121j70468J87351L6981
$$ 1766895 1244575 895836 881471 931030 745044 598708 497587 327119 514470 551451
18423E51451m6293O2251J81758L30363O4303k38442m11928J60283p8451L57090
$$ 551451 505158 567409 749167 1079530 1143833 905391 493463 653746 575295 932385
18413I32385L02011J90465M77281m362k41772J82203M76695J36470m74657l33599
$$ 932385 1234396 1424861 1902142 1897780 1656008 1838211 2314906 2451376 1976719 1643120
18403A643120j44075L9292L95232L99302J19765p8500L3165o85345n20885l56483
$$ 1643120 1499045 1538337 1933569 2332871 2452636 2374136 2407301 1721956 1201071 844588
18393H44588K69731k25835j85942m1214j42922J23900N4622q2764L53657k00897
$$ 844588 1114319 888484 702542 661328 518406 642306 696928 614164 967821 766924
18383G66924q7909J06036J48744K16882L4738k03807L75723L94462N7328m30193
$$ 766924 679015 785051 933795 1150677 1185415 981608 1357331 1751793 1809121 1378928
18373A378928n15127J49495j74387J01745L560K23148J01127k45781l15014m6095
$$ 1378928 863801 1013296 838909 940654 944214 1167362 1268489 1022708 707694 661599
18363F61599K35712K59733j9638j54465k08183N9909J00655j25818j06434J6993
$$ 661599 897311 1157044 1137406 982941 774758 834667 935322 809504 703070 720063
18353G20063J34598P5065m5223J18360n6635j68584R4098j07968n25102n08965
$$ 720063 854661 929726 884503 1002863 946228 777644 871742 763774 238672 -270293
18343b70293J14042N24197M90439L40662k76659K4137k77189j50189l56963l48530
$$ -270293 -156251 367946 858385 1199047 922388 946525 669336 519147 162184 -186346
18333a86346R5838p99K51170K03218k13606K30438m3276l53949j51032M3722K13098
$$ -186346 -90508 -91307 159863 363081 149475 379913 336637 -17312 -168344 -124622 88476
18322H8476J72321j43135j1984N8046J55160j84390j68974J66143N3516J09132
$$ 88476 260797 117662 105678 163724 318884 134494 -34480 131663 185179 294311
18312B94311L62732J85391l16558j68738k13497n0030N8184O2612J07635R4712
$$ 294311 657043 842434 525876 357138 143641 93611 151795 214407 322042 416754
18302D16754L5285M3093l03342j48783O0169j4936M68181L8877K12339J20226
$$ 416754 452039 495132 191790 43007 103176 88240 556421 595298 807637 927863
18292I27863J88423L30400M24711P03344J74548k10499l00605m13129m74936o16564
$$ 927863 1116286 1446686 1871397 2574741 2749289 2538790 2238185 1825056 1350120 733556
18282G33556n06028N8967J92120j7888o35280l14617N42194n5580j99212j19673
$$ 733556 227528 286495 478615 460727 -174553 -489170 53024 -2556 -201768 -321441
18272c21441l6077M37964K18874M17048p5130k25461j22052K01447J21705k1759
$$ -321441 -357518 80446 299320 716368 641238 415777 293725 495172 616877 595118
18262E95118l36922k8607r9904L18294J57129q3250j88137j24640J12438k38686
$$ 595118 258196 229589 129685 447979 605108 521858 333721 209081 321519 82833
18252H2833p1826J56007k6555p3342n5851R1373L33515K54613k19883m54853k62447
$$ 82833 11007 167014 140459 67117 11266 102639 436154 690767 470884 16031 -246416
18241b46416J45764J32965j35462k19461M43686M42821O2581J07970K53665L15737
$$ -246416 -100652 32313 -103149 -322610 121076 563897 626478 734448 988113 1303850
18231A303850k78201k30260j47051k3797M2031J79062j08864m04597k60667R7413
$$ 1303850 1025649 795389 648338 624541 666572 845634 736770 332173 71506 168919
18221A68919j3640m5989K85214K56013j06215r2573k9991l15955k94537K034J70448
$$ 168919 155279 109290 394504 650517 544302 451729 421738 105783 -188754 -186720 -16272
18210a6272J99531j07537J69745L48520J87429P279K24090m16436k42172o6745
$$ -16272 183259 75722 245467 593987 781416 788695 1012785 596349 354177 287432
18200B87432O3572M01635K5468q2008j64514r287k37047j21266L00029O7095J6563
$$ 287432 351004 752639 778107 696099 531585 522298 285251 163985 464014 531109 547672
18189E47672j8391L06833K32584J26862m8419r3805L82303N02884k24150j99176
$$ 547672 529281 836114 1068698 1195560 1147141 1053336 1435639 1938523 1714373 1515197
18179A515197Q3597m8798k41662j79703j59089l3565N1480K30563R0514J37554
$$ 1515197 1598794 1549996 1308334 1128631 969542 935977 987457 1218020 1308534 1446088
18169A446088K32410K36004l37665J05293L61726K43172j97550j15785p9927k78188
$$ 1446088 1678498 1914502 1576837 1682130 2043856 2287028 2089478 1973693 1893766 1615578
18159A615578k0764K89143j41074j83227J12835J95792J51412L96014n5226J49491
$$ 1615578 1594814 1883957 1742883 1559656 1672491 1868283 2019695 2415709 2360483 2509974
18149B509974J80233J53917r3823M63834N25597J23417J12933k20904J21238M61555
$$ 2509974 2690207 2844124 2750301 3214135 3739732 3863149 3976082 3755178 3876416 4337971
18139D337971J62126L80873K03313j3789N58127N25786M21336L54736O10394K59327
$$ 4337971 4500097 4880970 5084283 5070494 5628621 6154407 6575743 6930479 7540873 7800200
18129G800200M31503L53589P11907O53329Q55511J660546J993868J967390L203837
$$ 7800200 8231703 8585292 9297199 9950528 10806039 12466585 14460453 16427843 19631680
18120A9631680M102390N117762N831809P151210R998382J3823155J9078608K6565039
$$ 19631680 23734070 28851832 34683641 41834851 51833233 65656388 84734996 111300035
18112A11300035L6758966N0008257O6773109Q2700006Q6442927M3054297m1981070
$$ 111300035 148059001 198067258 264840367 347540373 433983300 477037597 435056527
18105D35056527r7723032r6076565o9603959m4259976k8332224j8942665j3187747
$$ 435056527 337333495 241256930 171652971 127392995 99060771 80118106 66930359
18098F6930359r843052p641054n938154m148264l173430k765778k163140j509046
$$ 66930359 57087307 49446253 43508099 39359835 36186405 33420627 31257487 29748441
18090B9748441j043337j017282j361314j221879o87747o08962r13398p40560o02006
$$ 29748441 28705104 27687822 26326508 25104629 24416882 23807920 22894522 22153962 21551956
18081B1551956p46320q71206q04980j78933R5921N2097J88050J82790L90452k75391
$$ 21551956 20805636 19934430 19129450 18950517 19046438 19098535 19286585 19469375 19859827 19584436
18071A9584436k88582m67109n97331q51079j048515j410481p77346k92714o36344
$$ 19584436 19295854 18828745 18231414 17380335 16331820 14921339 14143993 13851279 13214935
18062A3214935n94184r12183q68984o86819m22830l71926j59325k24777l93161
$$ 13214935 12620751 11708568 10839584 10152765 9729935 9358009 9198684 8973907 8580746
18053H580746k05071Q3211j08213n90434m88414l94695l06538J01769J19123O917
$$ 8580746 8375675 8458886 8350673 7760239 7271825 6877130 6570592 6672361 6791484 6798401
18043F798401K78105L04436j85307j77504q8480k61051p9913k43243J5870K61493
$$ 6798401 7076506 7380942 7195635 7018131 6929651 6668600 6588687 6345444 6361314 6622807
18033F622807K55116J06911J33772J94520K04134J38358J78548O59957R10941
$$ 6622807 6877923 6984834 7118606 7313126 7517260 7655618 7834166 8494123 9405064
18024I405064J155716J227111J394058K064665K360089L423392M658347O455054
$$ 9405064 10560780 11787891 13181949 15246614 17606703 21030095 25688442 32143496
18016C2143496Q904271J2503381J6183228J9906088K1362856J3294570n907057
$$ 32143496 41047767 53551148 69734376 89640464 111003320 124297890 118390833
18009A18390833k0898665k3059781j8247826j2274003p735444n163737l146477
$$ 118390833 97492168 74432387 56184561 43910558 36175114 31011377 27864900
18002B7864900k011361j118491K27508R70811R56223J918322K987815M063901
$$ 27864900 25853539 24735048 24962556 25933367 26889590 28807912 31795727 35859628
17994C5859628N255651P339174R777384J2800765J6286504J9958244J9328143
$$ 35859628 41115279 48454453 58231837 71032602 87319106 107277350 126605493
17987A26605493P890860q939783j5938937j2311242l854489M671098J1606825
$$ 126605493 134496353 125556570 109617633 97306391 93451902 98123000 109729825
17980A09729825J4450149P408900q505861k0563258k1667708j6640800j1259180
$$ 109729825 124179974 131588874 123083013 102519755 80852047 64211247 52952067
17973E2952067p447978m992185l013280j954551j552923r01654r92468k10298
$$ 52952067 45504089 40511904 37498624 35544073 33991150 33089496 32097028 31886730
17965C1886730P53102J622005K799416M007070O015934Q186917J0645042J3753811
$$ 31886730 32639832 34261837 37061253 41068323 47084257 55271174 65916216 79670027
17957G9670027J6191752J4820953K811234j3353123k1222016j8680409j3371237
$$ 79670027 95861779 110682732 113493966 100140843 78918827 60238418 46867181
17950D6867181q483044n621268l927712k792614k047375j605829j408451j114452
$$ 46867181 38384137 32762869 28835157 26042543 23995168 22389339 20980888 19866436
17942A9866436p80992m98018k52522j46771m08279m60328j212538j633192j299098
$$ 19866436 19085444 18587426 18334904 18188133 17779854 17319526 16106988 14473796 13174698
17933A3174698r68841q11750o55053m29902o49954l38823q2454k9869j51232k49097
$$ 13174698 12205857 11394107 10739054 10309152 9659198 9320375 9237921 9208052 9056820 8807723
17923H807723J65601m6528p02877m22613j51424k11368l58272l31926k75609l09513
$$ 8807723 8973324 8926796 8223919 7801306 7649882 7438514 7080242 6748316 6472707 6163194
17913F163194l73066l02498m49480l32215r9428n8636r2103k31458L4903Q0710
$$ 6163194 5790128 5487630 5038150 4705935 4606507 4547871 4455768 4224310 4259213 4339923
17903D339923j68773j61908j47399k23806N5891l16294m37922l32754N6399j94879
$$ 4339923 4171150 4009242 3861843 3638037 3693928 3377634 2939712 2606958 2663357 2468478
17893B468478m3740j16097N1277j86913m2714R4990m774k4313n4959P1094K31484
$$ 2468478 2424738 2308641 2359918 2173005 2130291 2225281 2220507 2196194 2141235 2212329 2443813
17882B443813o0903n1499J36960j3283o72542j97523K40082n9133r6198p6382
$$ 2443813 2382910 2331411 2468371 2455088 1782546 1585023 1825105 1765972 1669774 1593392
17872A593392k47915n07016J69808N46053k33194k49096k59896k50252K36824
$$ 1593392 1345477 838461 1008269 1554322 1321128 1072032 812136 561884 798708
17863G98708J8546k15281O7444l76820l1807K21699J3370O8247j2582R9554J22667
$$ 798708 817254 601973 669417 292597 260790 482489 495859 564106 551524 651078 773745
17852G73745q4504M432M56289J58415n9071j31052l32184j20688j08930j51703
$$ 773745 689241 693673 1149962 1308377 1249306 1118254 786070 665382 556452 404749
17842D04749j6306J67829L8501k52717L3721L33506k5470k53877J94023k53250
$$ 404749 388443 556272 594773 342056 375777 709283 683813 429936 623959 370709
17832C70709o5315K2311J07428J90344k00567k61549j85987J4850J88620J60077
$$ 370709 305394 327705 435133 625477 424910 163361 -22626 -7776 180844 340921
17822C40921L26253m8646l21534J0106k56821P9035J70776P5395J66731J94513
$$ 340921 667174 618528 296994 307100 50279 129314 300090 375485 542216 736729
17812G36729J83814J01896j64099k75939m03901M5945J30389M3529K78686J17920
$$ 736729 920543 1022439 858340 582401 178500 224445 354834 398363 677049 794969
17802G94969k26009J9905L0087j30567J02841m2961Q8496l4421j47938j83062
$$ 794969 568960 588865 618952 488385 591226 548265 636761 602340 454402 271340
17792B71340k6602R6056l9588j29178J24280J54143m784J07277m3797k78398j13352
$$ 271340 244738 340794 301206 172028 296308 450451 445667 552944 509147 230749 117397
17781A17397J15603l8513j05187M9692m9323k77800O3522n3875j3764J12666K08627
$$ 117397 233000 194487 89300 138992 89669 -188131 -124609 -178484 -192248 -79582 129045
17770A29045m4499K7960R068p3104K97597P1267K45324j48079J35587K34150o8068
$$ 129045 84546 112506 121574 48470 346067 417334 662658 514579 650166 884316 816248
17759H16248k46715j86653q5180J47038q3467n121j40590j26987L92947K14303
$$ 816248 569533 382880 297700 444738 361271 356150 215560 88573 481520 695823
17749F95823J05603o395J03025l43835k51510J39050k396J41418K66415m19356
$$ 695823 801426 795031 898056 554221 302711 441761 439365 580783 847198 427842
17739D27842Q5907J08157k44385j32750l2599M4515K10992j42727L6120k58435
$$ 427842 513749 621906 377521 244771 212172 256687 467679 324952 361072 102637
17729A02637j69324n0442J32176J22412M0986P2556J13369M4430k75708p353N06140
$$ 102637 -66687 -117129 15047 137459 178445 251001 364370 408800 133092 125739 631879
17718F31879P5280j30485p8078l11596J17843K28414M79397J8124m51976n54929
$$ 631879 707159 576674 498596 187000 304843 533257 1012654 1030778 578802 23873
17708B3873r6148J22778j08475J98473L46221J13625m39940n58319j08801N1547
$$ 23873 -72275 50503 -57972 140501 486722 600347 160407 -397912 -506713 -455166
17698d55166k44611M08551N6321j69105L7722J43084L0636J91786K05795J00256
$$ -455166 -699777 -291226 -234905 -404010 -366288 -223204 -192568 -782 205013 305269
17688C05269K3249m05550k16054O0625k09425k06038L18081N68663l8047n30334
$$ 305269 328518 -77032 -293086 -232461 -441886 -647924 -329843 238820 200773 -329561
17678c29561K4472N86470N67676J00825j83887p2481K75438j6494R8663j58339
$$ -329561 -305089 281381 849057 949882 765995 693514 968952 952458 1051121 892782
17668H92782j84970p3606k75659k29165J18369J04722M8297l8483j9906M9779
$$ 892782 707812 634206 358547 129382 247751 352473 400770 362287 342381 392160
17658C92160j56156J33496n586K13964J09022m57387q2046j7215k40199Q1599
$$ 392160 236004 369500 363914 577878 686900 229513 147467 130252 -109947 -28348
17648b8348J41741O5290q8641o978K44870K827k0949l7073m08923j68578L75861
$$ -28348 113393 178683 90042 83064 327934 330761 309812 272739 -136184 -304762 71099
17637G1099J75112L92885J83237k49320l6431O8778k7394j70019j32003j45349
$$ 71099 246211 639096 822333 573013 536582 605360 577966 407947 275944 130595
17627A30595J63431k93911O9985J23150M8499L06668J48919n37884k71288J01537
$$ 130595 294026 115 70100 193250 241749 548417 697336 159452 -111836 -10299
17617a0299P842R0750L80517K58881j35891o1996o6795j45374K74508M8638R3862
$$ -10299 -2457 88293 468810 727691 591800 529804 463009 317635 592143 640781 734643
17606G34643j01811j6758r6264m50146l0342O4704k5734J95522P6873j77584j37270
$$ 734643 632832 616074 519810 69664 39322 104026 78292 273814 350687 173103 35833
17595C5833J99872M18407k3120l6180m77081J68586J22302n4244Q0397K26535
$$ 35833 235705 654112 630992 594812 117731 286317 408619 354375 434772 661307
17585F61307K6982m60247m25290M7332J64447J71064J07704J01613L76844n5729
$$ 661307 688289 228042 -197248 -149916 14531 185595 293299 394912 771756 716027
17575G16027j42262R3137n20224j77442J4659K723k32493j6881J20150J40081
$$ 716027 573765 666902 146678 -30764 -16105 -13382 -245875 -262756 -142606 -2525
17565b525J40450l63545j30816J64037l9445K84900J87750n9928k18082L86343
$$ -2525 137925 -225620 -356436 -192399 -231844 53056 240806 180878 -37204 349139
17555C49139L85937m1080k56708j24l7296o4512N2201n4267m34207J12324K82878
$$ 349139 735076 693996 437288 437164 399868 335356 387557 333290 -100917 11407 294285
17544B94285P0163M30983k22114j27462J13644K81877l5812r9956O6493p7223
$$ 294285 364448 795431 573317 445855 559499 841376 805564 705608 772101 694878
17534F94878l73466o7403K10350J17816L3085k08633j45617o252J68158P0216
$$ 694878 321412 254009 464359 582175 615260 406627 261010 254758 422916 493132
17524D93132m37457j15515P9948K29227l0491l9012j27923L91988j85934n1313
$$ 493132 55675 -59840 20108 249335 218844 179832 51909 443897 257963 206650
17514B06650L92983j33330k70987k0506R8132j08379J01339k07140J4467M03284
$$ 206650 599633 466303 195316 174810 272942 164563 265902 58762 73229 476513
17504D76513L78250k17432l8836J00913l5073j82853K85796J51647k78283l50
$$ 476513 854763 637331 598495 699408 664335 481482 767278 918925 640642 640292
17494F40292n1718j01838Q249R6453p4862l625R3892k8800J85353J68269p5313
$$ 640292 588574 486736 494985 591438 516576 512951 606843 578043 763396 931665 856352
17483H56352L18174j30594l9555k50032k00157K97429K97753J82953Q4847q1282
$$ 856352 1174526 1043932 1004377 754345 554188 851617 1149370 1332323 1417170 1335888
17473A335888k09629O59412O6164K8885K52553K20969L55014k68829P9300N7887
$$ 1335888 1126259 1785671 1851835 1880720 2133273 2354242 2709256 2440427 2519727 2577614
17463B577614J08553p0759j20402m76296J14528M31560J39347J18929K72660M10288
$$ 2577614 2686167 2615408 2495006 2018710 2133238 2564798 2704145 2823074 3095734 3506022
17453C506022L92070M08470Q31862N33457P06451R30745L99158L55402J52218
$$ 3506022 3898092 4306562 5138424 5671881 6378332 7309077 7708235 8063637 8215855
17444H215855K87628N85117Q93736P53599L54297K34878R10206J501208J837483
$$ 8215855 8503483 9088600 9982336 10735935 11090232 11325110 12235316 13736524 15574007
17435A5574007K326288L474957M192651N102498N295347N132339M998101N427387
$$ 15574007 17900295 21375252 25567903 30670401 35965748 41098087 46096188 51523575
17427E1523575P111304J1075840J7831582K5848134L6203227M8968421O3081111
$$ 51523575 58634879 69710719 87542301 113390435 149593662 198562083 261643194
17420B61643194P2156471O1400928K1606981l2025803p1126827p9139349o3813153
$$ 261643194 333799665 395200593 416807574 384781771 313654944 234515595 170702442
17413A70702442m4521697k9045030j9007550j2887668r089354p036678n078113
$$ 170702442 126180745 97135715 78128165 65240497 56151143 49114465 44036352
17406D4036352l976027k830201k455235k288034k249734j671814j449779j411282
$$ 44036352 40060325 37230124 34774889 32486855 30237121 28565307 27115528 25704246
17398B5704246j000062j134544q88807o12288l85313l77310o62670k96179j10543
$$ 25704246 24704184 23569640 22680833 22068545 21683232 21305922 20643252 20347073 20236530
17389B0236530j55466N7124P23054K20006j96662m33648q69904j191656r74956
$$ 20236530 20081064 20138188 20861242 21081248 20884586 20450938 19581034 18389378 17414422
17380A7414422r69875j030226r47651o41456p91702j143501p55380m36252n61573
$$ 17414422 16444547 15414321 14466670 13825214 13033512 11890011 11134631 10698379 10136806
17371A0136806o27244p38530l70311k73293m86478l03859o09194k43351m5918
$$ 10136806 9509562 8771032 8400721 8127428 7640950 7337091 6727897 6484546 6438628
17362F438628l58373l18072k31691l96201n21912j19090J37272J48717m41365
$$ 6438628 6080255 5762183 5530492 5134291 4612379 4493289 4630561 4779278 4337913
17353D337913m63656j54501k69428j21899j06826l96488J40J3068K19819Q1875
$$ 4337913 3874257 3719756 3450328 3328429 3221603 2825115 2825255 2838323 3058142 3140017
17343C140017m19256n00864j36239J23744N9022M00337m58767k6833p5841n9516
$$ 3140017 2720761 2219897 2083658 2207402 2266424 2666761 2207994 2181161 2105320 2045804
17333B045804o7674L1653k9083J55881n00569k75748K77875K0106k04647J37650
$$ 2045804 1978130 2009783 1980700 2136581 1636012 1360264 1638139 1658245 1453598 1591248
17323A591248q3096p7937k54781N4629k02730j61457j86903k0541K50987N333
$$ 1591248 1508152 1430215 1175434 1230063 1027333 865876 678973 658432 909419 914752
17313I14752k58157m80532J82160N64240K07665k8037k24124J3316Q862L4379
$$ 914752 656595 176063 358223 922463 1130128 1102091 877967 891283 900145 934524
17303I34524l54934k19084K9868k37832L62040L78609r8286q8965r3252q8672
$$ 934524 579590 360506 390374 152542 514582 893191 794905 705940 612688 524016
17293E24016J71884m840J4505N7419P5046R5205k56065n24395J75125J96369r0681
$$ 524016 695900 691060 705565 762984 838030 933235 677170 152775 327900 524269 433588
17282D33588k15292K4948n6863k96786K24358L23732q5277N0827j31448l41309
$$ 433588 218296 243244 186381 -110405 113953 437685 352408 403235 271787 -69522
17272f9522J40609L41331K53588J08634J43908K9524J04198L9089j62176l11539
$$ -69522 71087 412418 666006 774640 918548 948072 1052270 1091359 929183 617644
17262F17644j16796p0748J79407R1631l11553j24843J19885M26856N64318l66618
$$ 617644 500848 430100 609507 701138 389585 264742 384627 811483 1375801 1009183
17252A009183n78185j68812O0575N8271k5633q1329j61796j0070M18803M82275
$$ 1009183 430998 262186 322761 381032 355399 274070 112274 102204 521007 1003282
17242A003282K7742L8211m8159K01589R7504k36548J60970k22580k94178J97364
$$ 1003282 1031024 1069235 1021076 1222665 1320169 1083621 1244591 1022011 727833 925197
17232I25197N7965j78285l48843m01622K6758J53651m3664k6156J00572O14460
$$ 925197 983162 804877 456034 54412 81170 234821 191157 165001 265573 880033
17222H80033M28849l55504j99258l27263j023K08200K09187j44541m27223j40730
$$ 880033 1308882 953378 754120 426857 425834 634034 843221 698680 271457 130727
17212A30727J91450J96306K28921j62205n5488j69881K27539r5960j61620j4847
$$ 130727 322177 518483 747404 585199 529711 359830 587369 491409 329789 314942
17202C14942J99050p5387k84760j26324J38497J95249k01325n70918k83974L97818
$$ 314942 513992 438605 153845 27521 166018 361267 159942 -410976 -694950 -297132
17192b97132M08434k23907o026J46463R3088J47584l23637j45576n2906R3536
$$ -297132 111302 -112605 -118631 27832 120920 268504 -55133 -200709 -253615 -160079
17182a60079L36120R7822N4796l04130M0907l38719J06763M62193L3352Q0799
$$ -160079 176041 273863 328659 24529 65436 -273283 -166520 295673 329025 409824
17172D09824J02863l71226q2063k6433L12505L8709J75648q4571Q4968j6113l48389
$$ 409824 512687 141461 59398 32965 345470 384179 559827 475256 560224 544111 195722
17161A95722k15121J99472K9047J13581j85794K24055m6857r5096q6023k82955
$$ 195722 -19399 180073 209120 322701 136907 360962 314105 219009 132986 -149969
17151a49969J18390k30225m23545k44027M55082M13343L53788L08824q4444M0721
$$ -149969 -31579 -261804 -685349 -929376 -474294 -60951 292837 601661 517217 557938
17141E57938O6722k99346J652K0605m21995j18029K7146l55780j15591M55895
$$ 557938 624660 325314 326966 347571 -74424 -192453 -165307 -521087 -636678 -180783
17131a80783K97060M191L4329L1864J06614m4916j41950J92888j63964K04266
$$ -180783 116277 120468 154797 186661 293275 248359 106409 299297 135333 339599
17121C39599J76690k83381O2964K59610l2774m14576m97585p7904J62624J10241
$$ 339599 516289 232908 295872 555482 522708 108132 -389453 -467357 -304733 -194492
17111a94492K34388J52348R5516L45928M5314l06424j10892L5027O9633k18469
$$ -194492 39896 192244 287760 633688 679002 372578 261686 296713 366346 147877
17101A47877l22765n3001P6942J6661K25699k24195k60765j8838L45643M53838
$$ 147877 -174888 -227889 -150947 -134286 91413 -132782 -393547 -412385 -66742 387096
17091C87096R5210m2236l7609J35289N7543k68681j14457J31461j10806j02286
$$ 387096 482306 440070 402461 537750 595293 326612 212155 343616 232810 130524
17081A30524k35449m1320Q6717r7690k4330k5942L211P8003o7506j30228j44388
$$ 130524 -104925 -146245 -59528 -157218 -181548 -207490 -204279 -126276 -193782 -324010 -468398
17070d68398Q2405J8610K22964L71388P07j14328q3884r1147k29045j31524Q4311
$$ -468398 -385993 -367383 -144419 226969 227676 113348 29464 -61683 -290728 -422252 -337941
17059c37941L38686K3816J38375M4994l13513J24620J61375m04785P9875N28998
$$ -337941 745 24561 162936 207930 -105583 19037 180412 -224373 -144498 384500
17049C84500l8761l53880Q6743J22827K04036n3034N5743k30325o3755J75379
$$ 384500 345739 -8141 78602 201429 405465 352431 408174 177849 114094 289473
17039B89473k0063J32601j00742p3837j55425k50108q6207K7105J59359M2654
$$ 289473 269410 402011 301269 227432 72007 -178101 -264308 -237203 -77844 -35190
17029c5190J217j8678j28665m2974J85464J35513j3291L07219k15715l08609K7442
$$ -35190 -33973 -52651 -181316 -224290 -38826 96687 83396 390615 174900 -133709 -106267
17018a06267j19155M2593K21760K11291j42439R767J0447k253r7274K6727m5303
$$ -106267 -225422 -182829 38931 250222 107783 117550 127997 125744 28470 55197 9894
17007I894L3515r1295L8541K92270Q6885J19620N8076k98R4903p4304m22668J65088
$$ 9894 43409 -47886 -9345 282925 369810 489430 547506 547208 642111 567807 145139 310227
16995C10227m2506j77438p1857P1120l8747p7157j53929J42498L77193j06795
$$ 310227 267721 90283 18426 89546 50799 -26358 -180287 -37789 339404 232609
16985B32609l36320Q5385J19956M6663j87869m2704j3070J69478N9864R5223K44474
$$ 232609 -103711 -18326 101630 148293 -39576 -82280 -95350 74128 133992 229215 473689
16974D73689l107k19261j1977K01306l80043l65084J07633J60786m7185q5581
$$ 473689 470582 251321 239344 440650 60607 -304477 -196844 -36058 -83243 -168824
16964a68824J9071j27397K09445J14722j18331K7037L8422J96639O6231L45519
$$ -168824 -149753 -277150 -67705 47017 -71314 -44277 -5855 190784 257015 602534
16954F02534j72823k22339n4899j48499L7469l0149J11134J21379N0260j01686
$$ 602534 429711 207372 152473 3974 41443 11294 122428 243807 294067 192381
16944A92381l24147p2315Q8359j24487L4683J95646M6208r1718k74773J60434
$$ 192381 -131766 -204081 -115722 -240209 -205526 -9880 36328 -55390 -330163 -169729
16934a69729j38077j41283L49938j71443m2779J1871K8938j8237M2416m3304k9062
$$ -169729 -307806 -449089 -99151 -270594 -313373 -301502 -272564 -290801 -248385 -291689 -320751
16923c20751M4984R6548Q5931L70389J32676j54841J25993q4771k26958n15466
$$ -320751 -275767 -179219 -93288 277101 409777 254936 380929 296158 69200 -446266
16913d46266o9590J70263J59035J9446R3916j33088q3257l14772j10022J3177
$$ -446266 -515856 -345593 -186558 -167112 -73196 -206284 -289541 -604313 -714335 -701158
16903g01158n1874N18344J75170q6973Q5849r7786k0944j21085R9160K56237l3187
$$ -701158 -753032 -234688 -59518 -146491 -60642 -158428 -179372 -300457 -201297 54940 21753
16892B1753j81248j12216l42002P995K02918L64446K13238P895r8690j18357o5717
$$ 21753 -159495 -271711 -613713 -605718 -402800 -38354 174884 182779 84089 -34268 -99985
16881i9985L03525K07694k1637K12158k47120k76361M6605l9392j38561j59328
$$ -99985 203540 411234 389597 601755 354635 78274 124879 85487 -53074 -212402
16871b12402r8994M9159k6328J34768J35468o2226j13354M2323l04603j16217
$$ -212402 -311396 -262237 -288565 -153797 -18329 -80555 -193909 -151586 -456189 -572406
16861e72406L98521K20261N6625K62893J72112k76002j92471l5169K70339P1537
$$ -572406 -173885 46376 103001 365894 538006 262004 69533 34364 304703 376240
16851C76240j71748o5039Q2040l98015k19141N5995K42406o4145N2901J683K07808
$$ 376240 204492 139453 221493 -176522 -395663 -339668 -97262 -161407 -108506 -106823 100985
16840A00985M18912n169J30332J55025m78519L10199J79942l33409l95472m28041
$$ 100985 519897 514728 645060 800085 321566 631765 811707 478298 82826 -345215
16830c45215N4015L16044J85631J96797K55349J88257K66261N00513L47088K50163
$$ -345215 -291200 24844 210475 407272 662621 850878 1117139 1617652 1964740 2214903
16820B214903j47456m86366m96730j15578j90811k72954l6597o05618l25450J92793
$$ 2214903 2067447 1581081 1084351 968773 777962 505008 468411 -137207 -462657 -269864
16810b69864j46185n1407j96001K33726M57534k3473k30147K38887K10981M19031
$$ -269864 -416049 -467456 -663457 -429731 27803 4330 -225817 13070 224051 643082
16800F43082R2854k18379k66250L6630k06594j65049L4994j62807J0464J68765
$$ 643082 735936 517557 251307 287937 81343 -83706 -48712 -211519 -201055 -32290
16790c2290l84514j99256R5000R7696M49811Q783q037J645R2381M5626l66237
$$ -32290 -416804 -616060 -521060 -423364 26447 35230 27193 28838 121219 166845 -199392
16779a99392j20578j04658L4386J91635K33035P091j35668j93977J60850J77796
$$ -199392 -319970 -424628 -390242 -198607 34428 41519 -94149 -288126 -127276 50520
16769E0520L13422N3872K2402j62839k51899r0743j04815q8027L90892K9786l38979
$$ 50520 363942 417814 440216 277377 25478 -65265 -170080 -258107 132785 162571 -176408
16758a76408J02491l5446m829o0003L33404J17527k41977j81673l32251k92294
$$ -176408 -73917 -109363 -114192 -174195 159209 276736 34759 -146914 -479165 -771459
16748g71459Q6006M55826J08495j4289K1312j00017k1368k68404J16191q600L655
$$ -771459 -685453 -229627 -121132 -135421 -114109 -214126 -235494 -503898 -387707 -396307 -392652
16737c92652K00595j19542K72019q6831K72058j16152r3730j39054R3369L57849
$$ -392652 -192057 -311599 -39580 -126411 145647 29495 -64235 -203289 -109920 247929
16727B47929k31194r5337J62837J72742n46809j23528L94700q8850l75794j78108
$$ 247929 16735 -78602 84235 256977 -289832 -413360 -18660 -107510 -483304 -661412
16717f61412p068K28708M25089K7712k16688Q5710K5824j25991l76051j38149
$$ -661412 -668480 -439772 -14683 13029 -203659 -117949 -92125 -218116 -594167 -732316
16707g32316L45286K75621K7479l944L1870P6042k14505J54146J69949R3916K56922
$$ -732316 -387030 -111409 -83930 -87874 -56004 20038 -194467 -40321 129628 223544 480466
16696D80466r7595k58356J3835O5008J41381L50075J9867j10446n82332k74086
$$ 480466 382871 124515 138350 203358 344739 694814 714681 604235 21903 -252183
16686b52183P7468j933L9706J27335l2669L747l4270J50597l96032j231K05375
$$ -252183 -174715 -176648 -136942 -9607 -42276 -38529 -72799 77798 -318234 -319465 -114090
16675a14090l7255J60099n6768j8010P4607J6993m8998K91370M37391j78615l65336
$$ -114090 -151345 8754 -48014 -66024 8583 25576 -23422 267948 705339 526724 161388
16664A61388j71978R200J65301R4515l19172k82480N8295K77373K3928m9823K04702
$$ 161388 -10590 -1390 163911 258426 -60746 -343226 -284931 -7558 16370 -33453 171249
16653A71249p3423P2640k80721n31489K91195K89848l25798l27858K63675r4382
$$ 171249 97826 170466 -110255 -641744 -350549 -60701 -386499 -714357 -450682 -545064
16643e45064J5086k4481L052R5007J11738K67928J10743l31130j56257K51603
$$ -545064 -529978 -554459 -551407 -456400 -344662 -76734 34009 -297121 -453378 -201775
16633b01775j96577k67590J32328K69632K4842J65890J67858K06291J24381J97364
$$ -201775 -398352 -665942 -533614 -263982 -239140 -73250 94608 300899 425280 622644
16623F22644O6412K77084J57189k15700o91839n30406j12736j00111P5545k56175
$$ 622644 689056 966140 1123329 907629 215790 -314616 -427352 -527463 -451918 -708093
16613g08093J52576K11077J50390J95692K32706m6587J37119Q1121l2433Q1518
$$ -708093 -555517 -344440 -194050 1642 234348 187761 324880 406001 373568 455086
16603D55086j18415M2409k14036k88201Q0089L72221k59698k09326l59036m25374
$$ 455086 336671 379080 165044 -123157 -43068 329153 69455 -139871 -498907 -924281
16593i24281K26253M52991L25842l8944n35344j05791M52651l3800j81749p005
$$ -924281 -698028 -245037 80805 41861 -493483 -599274 -146623 -180423 -362172 -369177
16583c69177K43380o7781k33171K27710J27075O8041K68036L7752j47506k11984
$$ -369177 -125797 -193578 -426749 -199039 -71964 -3923 264113 301865 154359 -57625
16573e7625k27013q615J68510J96750j69670J18342k87826J5183k8799k62905
$$ -57625 -284638 -293253 -124743 72007 -97663 20679 -267147 -251964 -280763 -543668
16563e43668N0695K70125J64434K22334j23975m93458k34942J51226J71530J08217
$$ -543668 -492973 -222848 -58414 163920 39945 -453513 -688455 -537229 -365699 -257482
16553b57482K08262Q5246J25223J64565k79727r0120l6117M9241j99121k74322
$$ -257482 -49220 36026 161249 325814 46087 -44033 -80150 -30909 -230030 -504352
16543e04352L10446R5708J94409L43057j29665l67956j45973J39040K77298m193
$$ -504352 -193906 -98198 96211 439268 309603 -58353 -204326 -65286 212012 207819
16533B07819k07740j71749r583N4185l19303J44056K84010M22144j29789k89730
$$ 207819 79 -171670 -181253 -127068 -446371 -302315 -18305 403839 274050 -15680
16523a5680j69168j98868n8350k3670J86064Q0949M75677J09351k05344o8857
$$ -15680 -184848 -383716 -442066 -465736 -279672 -198723 276954 386305 180961 112104
16513A12104m3760j30304k04452J18442k9197P6791M7108L56084R6670P0673J37612
$$ 112104 68344 -61960 -266412 -147970 -177167 -100376 -53268 302816 399486 470159 607771
16502F07771j39619o9166J34159m02479l19387J14773J29912j06933j24726m952
$$ 607771 468152 398986 533145 130666 -188721 -73948 55964 -50969 -175695 -180647
16492a80647L09768k13522k24659j57945p2118L73360K09648j13116M2493p0466
$$ -180647 129121 -84401 -309060 -467005 -539123 -165763 43885 -69231 -26738 -97204
16482i7204k6803K23291j42529r0470j35340j33801K50904J6559O8275o727n8398
$$ -97204 -124007 99284 -43245 -133715 -269055 -402856 -151952 -135393 -67118 -73845 -132243
16471a32243M1767P083n5199k0485r8142L98600M5492j98753J44391m257k46594
$$ -132243 -90476 -83393 -138592 -159077 -257219 141381 186873 -11880 132511 128254 -118340
16460a18340k70058j41271L58851N40180j53065k73005J66308J54985K2664J19515
$$ -118340 -388398 -529669 -170818 369362 216297 -56708 109600 264585 287249 406764
16450D06764m6l71116l23244p2503m9014j19516J39591Q3264N797K86187N9495
$$ 406764 406718 35602 -287642 -360145 -409159 -528675 -389084 -305820 -300023 -13836 45659
16439D5659k91554j30000L1096J56165K5363j78475k3068K8160M27662J29374
$$ 45659 -245895 -375895 -344799 -188634 -163271 -341746 -364814 -336654 91008 220382
16429B20382l2997j04195l7237k45167l52369L94637K25416m6221r8505k44462
$$ 220382 187385 83190 45953 -199214 -551583 -156946 68470 22249 -76256 -320718
16419c20718J74014N71436M7078l72180m2116j26467m7962K38630j61421J89451
$$ -320718 -146704 424732 471810 99630 57514 -68953 -116915 121715 -39706 149745
16409A49745Q3267m052l55668k30692j3831P6699L54429r7904l18055Q8892j81344
$$ 149745 233012 228960 -126708 -357400 -371231 -294532 59897 -38007 -356062 -267170 -448514
16398d48514j48035N2337K27786J98600Q7691Q9175k36903K775J63525m504r4806
$$ -448514 -596549 -544212 -316426 -117826 -30135 59040 -177863 -175088 -11563 -16067 -110873
16387a10873J86580j7798k9946K70212R0485l2905O1631k81244k18810k28295
$$ -110873 75707 57909 27963 298175 388660 355755 417386 136142 -82668 -310963
16377c10963q6352J29433j0562m2892R4733J3444J3877J63492L62060R1067r8222
$$ -310963 -397315 -267882 -278444 -321336 -226603 -213159 -199282 -35790 326270 417337 319115
16366C19115K86276M7296l88925N9983j00634l14914m4821J03674J01049r1049
$$ 319115 605391 652687 263762 323745 223111 -91803 -136624 -32950 68099 -22950
16356b2950K09650K37406J07814j68340o8796M22922p3838j21835l17041m11092
$$ -22950 186700 424106 531920 363580 294784 717706 643868 522033 204992 -206100
16346b06100p7509K46382K66068q7669N5468L0001K1547J84758O2235J01868j75849
$$ -206100 -283609 -37227 228841 141172 196640 226641 248188 432946 495181 597049 421200
16335D21200n54842j37186q4228J04789J57692K21393o6167j16168J22251k31158
$$ 421200 -133642 -270828 -355056 -250267 -92575 128818 62651 -53517 68734 -162424
16325a62424N9879J77155N637r4990J11894q0836j26411K11466M38810K46503
$$ -162424 -102545 74610 80247 -14743 97151 16315 -110096 101370 540180 786683
16315G86683k97224k01669j77098l1674m04676m29656n8877O3367j3514O6276
$$ 786683 489459 287790 110692 79018 -325658 -755314 -814191 -750824 -764338 -698062
16305f98062j6360l3812J55619J51866j15346J36065J65347Q8400J01752j950
$$ -698062 -714422 -748234 -592615 -440749 -556095 -420030 -254683 -166283 -64531 -66481
16295f6481k9404m32764L72859J88652j29257J0763q4499j46060M4382J18508
$$ -66481 -95885 -528649 -155790 32862 -96395 -85632 -170131 -316191 -271809 -153301
16285a53301O9868J49078N9571J60232j61155k5517o1078m81858J72998K39787
$$ -153301 -83433 65645 125216 285448 124293 98776 37698 -444160 -271162 -31375
16275c1375k19910j12047p1690k57389N8582L74079L88654q0333k76362r1167
$$ -31375 -251285 -363332 -435022 -692411 -633829 -259750 128904 48571 -227791 -318958
16265c18958k34342M6755J57528j9035J04950j3349l624K25058l20214j2653K33789
$$ -318958 -553300 -506545 -349017 -368052 -263102 -276451 -280075 -55017 -375231 -387884 -154095
16254a54095P6086p2719L7457J39273j5332r2479P191p427K22199J42963k65622
$$ -154095 -78009 -150728 -113271 26002 10670 -81809 -74618 -82045 140154 283117 17495
16243A7495k30710K69556o3598l13021j01980K054L36887J77180p081L9978N5101
$$ 17495 -213215 56341 -7257 -320278 -422258 -420204 -83317 93863 86782 126760 181861
16232A81861k62260M4496J28161l1968J39377j79629k81634k582R4752j88437
$$ 181861 -80399 -35903 92258 60290 199667 20038 -261596 -264178 -169426 -357863
16222c57863k43388J7576K86708L52623J94518J19308m6067p0109q4096k63179
$$ -357863 -601251 -583675 -296967 55656 250174 369482 323415 253306 169210 -93969
16212i3969j00068q8182p818k12258Q0818L45439J34999r6263j01622j50781R7729
$$ -93969 -194037 -282219 -290037 -502295 -421477 -76038 58961 -37302 -138924 -289705 -191976
16201a91976J41664l64398j80568K24229R6729K77041K7311K10144m80446j57651
$$ -191976 -50312 -414710 -595278 -371049 -274320 2721 30032 240176 -240270 -397921
16191c97921J05903k6326J53366N41028J16093k66166P2805J53583l2263N5115
$$ -397921 -292018 -318344 -164978 376050 492143 225977 298782 452365 420102 475217
16181D75217q3078j25537R926j91639k90085j8700K46781P0226l8651n2978P0653
$$ 475217 392139 266602 276528 84889 -205196 -223896 22885 93111 54460 1482 72135
16170G2135j38858L32469j46947J02375J10359l31164l35146j05539J6374J03601
$$ 72135 -66723 265746 118799 221174 331533 369 -334777 -440316 -423942 -320341
16160c20341L67244L71091k6048k43332k68040k239r9445k05674r4864K39658
$$ -320341 46903 417994 391946 148614 -119426 -121665 -221110 -426784 -521648 -281990
16150b81990K93105k4387k78173n2070r9733k31805J47020N83005N19580J43682
$$ -281990 11115 -13272 -291445 -343515 -443248 -675053 -528033 54972 574552 718234
16140G18234k58231j9706n0578k21974j02696j4197O7190M4347K78752N0672k45199
$$ 718234 460003 440297 389719 167745 65049 50852 118042 162389 441141 491813 246614
16129B46614k24422j80394o3946j73007Q0864L8863M0003j02479K04519N2324
$$ 246614 22192 -158202 -222148 -395155 -314291 -275428 -235425 -337904 -133385 -81061
16119h1061K5652L19969l8225m07325k11026J43986L57630J52420j5145j25673
$$ -81061 -55409 264560 226335 -180990 -392016 -248030 109600 262020 246875 121202
16109A21202J11480j7686Q7800J32243l71169o1041j74234P9284j9088M3844J30693
$$ 121202 232682 214996 302796 435039 63870 2829 -171405 -92121 -111209 -67365 63328
16098F3328j34569p4540K14612M2211j81812N8355k1597k78193j31867J34949
$$ 63328 -71241 -145781 68831 111042 -70770 -12415 -34012 -312205 -444072 -309123
16088c09123p5636j32927K19392l126K7073J84305L05368o708R887j43164J20007
$$ -309123 -384759 -517686 -298294 -301420 -274347 -90042 215326 208618 218505 75341 195348
16077A95348J20064l58447J96269J13104l47709n0762L09977J37891L4154p7741
$$ 195348 315412 -43035 153234 266338 -81371 -132133 177844 315735 349889 272148
16067B72148J95891k34222k50131J25564Q1506p0771L965r871L214K84541l47370
$$ 272148 468039 233817 -16314 109250 190756 119985 123950 114079 117293 401834 54464
16056E4464n2112k30491J48120L29194r7840j71094J04518J36550k94217J66891
$$ 54464 2352 -228139 -80019 249175 151335 -19759 84759 221309 -72908 93983
16046I3983J60621K5655j04735m96779k75493P3077k78054N17894K42395m06560
$$ 93983 254604 280259 175524 -321255 -596748 -523671 -801725 -283831 -41436 -447996
16036d47996j35011K81486O7473l9013J60486J29152k05275k31654l82280M51840
$$ -447996 -583007 -301521 -234048 -273061 -112575 16577 -188698 -420352 -802632 -350792
16026c50792K44389J107J25203p3726J41663j12118o8522O1710J54635J28723
$$ -350792 -106403 -105296 19907 -53819 87844 -24274 -92796 -31086 123549 252272
16016B52272J59139j26150k47806m3742K10924P580l93088l51950J15827M09008
$$ 252272 411411 285261 37455 -6287 204637 212217 -180871 -532821 -416994 -7986
16006g986L1102k62669k79969o5883J81748j49668q7795K45127K30113K3243O25596
$$ -7986 23116 -239553 -519522 -585405 -403657 -553325 -641120 -395993 -165880 -142637 482959
15995D82959l022j42854K71084j89161k95168j15772k24612N1240L69467l2754
$$ 482959 479937 337083 608167 419006 123838 8066 -216546 -165306 204161 171407
15985A71407j25511K40824O2114o03198l79597q8287L708K60961K0351L44615
$$ 171407 45896 286720 348834 -254364 -633961 -722248 -718540 -457579 -437228 -92613
15975i2613K26586J22867K1915j99715M2707J30020p9207J75030J95131k24408
$$ -92613 133973 256840 278755 79040 121747 251767 172560 347590 542721 318313
15965C18313k09050k71868p1809M58755J40076O1995P9985j97278l43214J36295
$$ 318313 109263 -162605 -234414 224341 364417 426412 506397 309119 -34095 102200
15955A02200j7889j40503J14126N4264n6743N92l6394N6053j57930r1486j09005
$$ 102200 84311 -56192 57934 112198 55455 56047 19653 75706 -82224 -173710 -282715
15944b82715M60017J86940m01051k10766j03395L29371L55420j00491J4770j04114
$$ -282715 177302 364242 -36809 -247575 -350970 -21599 333821 233330 248100 143986
15934A43986j29161M4285K06882J02708J23381k37418j12828p5971m73318r9113
$$ 143986 14825 59110 265992 368700 492081 254663 141835 65864 -407454 -506567
15924e06567K35179l5096N16050M4689Q6101M6107P4869q2219j01930J22354k24403
$$ -506567 -271388 -306484 209566 254255 340356 386463 461332 379113 277183 399537 175134
15913A75134m34624o3165K01138J96642K15866L60277p4185l31670j29374J46705
$$ 175134 -259490 -322655 -121517 75125 290991 651268 577083 245413 116039 262744
15903B62744J04579M1685R2867l46313k41150R9579k10987M4419j77302J07486
$$ 262744 367323 409008 501875 155562 -85588 13991 -196996 -152577 -329879 -222393
15893b22393j11271k8129M9244j38287K2069Q7844K07265j18659p0456j1416Q4615
$$ -222393 -333664 -361793 -312549 -450836 -428767 -340923 -133658 -252317 -322773 -334189 -249574
15882b49574L77660K26525j10452J45940k4345j33307m6314k03520k77530R1430
$$ -249574 128086 354611 244159 390099 365754 232447 186133 -17387 -294917 -203487
15872b03487K57892j17910J21286P8797O8241J13926Q8612K67455K68286m09653
$$ -203487 54405 -63505 57781 136578 204819 318745 407357 674812 943098 533445
15862E33445l95219J40444l32070j67134L25634J32521j36050n6343k74481l45510
$$ 533445 138226 278670 -53400 -220534 105100 237621 101571 45228 -229253 -574763
15852e74763k61265L93834J75681K0759L65432K74832J59471m37543n16763q0857
$$ -574763 -836028 -442194 -266513 -245754 119678 394510 553981 116438 -400325 -481182
15842d81182L53201j72810r2608j02265L93081J33914J45935J04318J15316k36162
$$ -481182 -127981 -300791 -393399 -495664 -102583 31331 177266 281584 396900 160738
15832A60738K16094o6701J24605k04208k23396L2108K69310l59167J55383J77510
$$ 160738 376832 310131 434736 230528 7132 39240 308550 -50617 104766 282276
15822B82276r4502K12167L20985k3146j68584k26489k18226j83939J41580J61832
$$ 282276 187774 399941 720926 697780 529196 302707 84481 -99458 42122 203954
15812B03954k9292k40394P6431J86459P3292M6798j56713J67921L65940j79066
$$ 203954 174662 -65732 10699 197158 270450 317248 160535 328456 694396 515330
15802E15330j71424k4518j79744k62740J24736K35766k49917J96845K69089j27104
$$ 515330 343906 319388 139644 -123096 1640 237406 -12511 184334 453423 326319
15792C26319k8990M7215M3002J83413Q0605q4437k19119j65513j95086J57563
$$ 326319 297329 344544 387546 570959 651564 567127 348008 182495 -12591 144972
15782A44972J11630K32235j07985m05094m9679J8976m44963l17242j35464k6710
$$ 144972 256602 488837 380852 -24242 -73921 -54945 -499908 -817150 -952614 -979324
15772i79324J10275j37885K08987L74287K33947J08616k1000p307j33021J19163
$$ -979324 -869049 -1006934 -797947 -423660 -189713 -81097 -102097 -109404 -242425 -123262
15762a23262J15606L0606k35649p5750J64834K6833p5576J91267J94901J07846
$$ -123262 -7656 22950 -212699 -288449 -123615 -96782 -172358 18909 213810 321656
15752C21656n3402Q928j66037j38115J11139m0175K82264m0021j11980k810j34183
$$ 321656 268254 277182 111145 -26970 84169 43994 326258 286237 174257 171447 37264
15741C7264P4750J15562k77064k28964R3037L05384M048k50070j77443j52562
$$ 37264 112014 227576 -49488 -278452 -185415 119969 124017 -126053 -303496 -456058
15731d56058K97590L30439R3799k59468k25068j17634k02036m0301K42274J35745
$$ -456058 -158468 171971 265770 6302 -218766 -336400 -538436 -578737 -336463 -200718
15721b00718k99829J81632J88070j05573j81412K01399K82154L25131j21831l94440
$$ -200718 -500547 -318915 -130845 -236418 -417830 -216431 65723 390854 269023 -125417
15711a25417J70972L36959j93849l11048J25656J30624l12493m47972K7481N91900
$$ -125417 45555 382514 188665 -122383 3273 133897 -178596 -626568 -599087 -7187
15701g187K32202j21058j86778l69474j67972M40815M65036k35590K8913j19319
$$ -7187 225015 103957 -82821 -452295 -620267 -179452 285584 49994 78907 -40412
15691d0412j25306m02499J98173K5844J11898q6015l38459k43264K68457M3532
$$ -40412 -165718 -568217 -370044 -344200 -232302 -318317 -656776 -900040 -631583 -588051
15681e88051K12390J22456k59075l51264J18929K04261l8674J59029R3509K42927
$$ -588051 -375661 -253205 -512280 -863544 -744615 -540354 -579028 -419999 -326490 -83563
15671h3563j25012k35790J34667J82604K80877o8433j1883j14023k47470j24107
$$ -83563 -208575 -444365 -309698 -127094 153783 85350 73467 -40556 -288026 -412133
15661d12133L819M7330k2623P3963L9152j11613M6757L37720N7090n1094J58401
$$ -412133 -408314 -360984 -383607 -309644 -270492 -382105 -335348 2372 59462 8368 166769
15650A66769J66156J02316l07615r3223j57680j58060l0401m30775q0063K39109
$$ 166769 332925 435241 127626 34403 -123277 -281337 -311738 -742513 -822576 -583467
15640e83467K47966L58877P1387O6675k4850n0684J67836J98361j36892l31214
$$ -583467 -335501 23376 94763 161438 136588 85904 253740 452101 315209 -16005
15630a6005o3728k26453j86214k12889K1212J32301J96880N25223K855j10423
$$ -16005 -79733 -306186 -492400 -705289 -684077 -551776 -354896 170327 173182 62759
15620F2759J73229J55027k34502o6768J22365k26865n1032L22149P2614J48146
$$ 62759 235988 391015 156513 89745 212110 -14755 -65787 256362 328976 477122
15610D77122L5854J51922j50066l29912N1575l4846l440j88772l31794L6450K90163
$$ 477122 512976 664898 514832 184920 236495 201649 198209 9437 -322357 -285907 4256
15599D256l2331k0041j08290j13287M387k5520J23736M10452L44013q6110l75239
$$ 4256 -28075 -48116 -156406 -269693 -265306 -290826 -167090 243362 587375 501265 126026
15588A26026k28516K63767K05119l4640l96218J15619j41451M8753j52992j27983
$$ 126026 -102490 161277 366396 331756 -64462 51157 -90294 -41541 -194533 -322516
15578c22516J53083J74673K21569k11708K7991M8440K30086N8835j09379l52317
$$ -322516 -169433 5240 226809 15101 43092 91532 321618 380453 271074 -81243
15568h1243K22914J85940Q2240l01662p5957j35951j37583j35714q5151l54832
$$ -81243 141671 327611 409851 108189 32232 -103719 -241302 -377016 -462167 -816999
15558h16999J90270K21011q3619P3294K26106J73367k81305j03616L43337K373
$$ -816999 -626729 -405718 -489337 -416043 -189937 -16570 -297875 -401491 -58154 -55781
15548e5781k4762k46032j69710j61006k9302L09363p0661m9088N59239K27961
$$ -55781 -80543 -326575 -496285 -657291 -686593 -377230 -447891 -496979 62260 290221
15538B90221j02932n6818l18698j49914R9148j8110r3167j63904K31729O8348
$$ 290221 187289 130471 -188227 -338141 -238993 -257103 -350270 -514174 -282445 -214097
15528b14097J21118K06303l2837k64597l29690O8209K66371M16992l10590l39246
$$ -214097 -92979 113324 80487 -184110 -513800 -445591 -179220 237772 -72818 -412064
15518d12064j70510j6800L15721J42104K167j33280R0555K12538l342q3731L12855
$$ -412064 -582574 -599374 -283653 -141549 -139382 -272662 -182107 30431 27089 -56642 256213
15507B56213J83779Q0051l13651M8238j37816j28588K7178n0769k29649M90400
$$ 256213 439992 520043 206392 254630 116814 -11774 15404 -35365 -265014 225386
15497B25386M2327k66009j82659J94227j07306J18205J88531j66048Q6982K98529
$$ 225386 267713 1704 -180955 13272 -94034 24171 212702 46654 133636 432165
15487D32165j3515m60754m7620J03945K00054L24585K84284j32237j78559l1361
$$ 432165 418650 -42104 -89724 14221 214275 538860 823144 690907 512348 480987
15477D80987j93770o7299J8748o2852J24229k55752j33104J34464J66820l240
$$ 480987 287217 219918 238666 175814 300043 44291 -88813 45651 212471 209231
15467B09231m3790k26791j03812K46509j13807J23447K86052j63104p5501P4588
$$ 209231 165441 -61350 -165162 81347 -32460 90987 377039 213935 138434 213022
15457B13022L1038J09286k48218j80245P5853K36850L19420l8978o51011p9491
$$ 213022 244060 353346 105128 -75117 736 237586 557006 518028 -132983 -212474
15447b12474J41006j6625k8564j5006J12273J50687K35515O2660k39759j55661
$$ -212474 -71468 -88093 -116657 -131663 -19390 131297 366812 429472 189713 34052
15437C4052k87890j46012L72603K27090j75672j51259j59662l724J41847K0250
$$ 34052 -253838 -399850 -27247 199843 24171 -127088 -286750 -290474 -148627 -128377
15427a28377Q6360j17595k77584J03530L42129K5708L0720K44644K70056q2380
$$ -128377 -42017 -159612 -437196 -333666 8463 34171 64891 309535 579591 497211
15417D97211k92201l74273M1061J36260k63492q7658J84460K30392j08198o1512
$$ 497211 205010 -169263 -128202 8058 -255434 -343092 -158632 71760 -36438 -97950
15407i7950L33149j09489k03369n4531j58164J33392j2134P2255M02984l75476
$$ -97950 235199 125710 -77659 -132190 -290354 -156962 -169096 -96841 306143 -69333
15397f9333j07518L02408J55287J07126k65735m17570L5773L81009n1165k59810
$$ -69333 -176851 125557 280844 387970 122235 -295335 -259562 121447 70282 -189528
15387a89528n2248j36683j56448K91380K30812P7865J87750j98621l28684k89696
$$ -189528 -241776 -378459 -534907 -243527 -12715 65150 252900 54279 -274405 -564101
15377e64101K57322K79996L306k6728O158m72224k78288L43804L78944q9765P9228
$$ -564101 -306779 -26783 -23477 -50205 -44047 -516271 -794559 -450755 -71811 -161576 -82348
15366h2348r8980j11314J93265o6433K96829O9785J31552k44731l56346j55392
$$ -82348 -181328 -292642 -99377 -165810 131019 200804 332356 87625 -268721 -424113
15356d24113J61812N4128K8889J6830M31600J64903m05990L7253R0891l84482
$$ -424113 -262301 -208173 -179284 -162454 269146 434049 28059 65312 156203 -228279
15346b28279J17396K81498r4198n36385q2605J13868Q9489J85764K36796j34370
$$ -228279 -110883 170615 76417 -459968 -542573 -428705 -339216 -153452 83344 -51026
15336e1026L0739O7821k70141j46211l09113p9656K44216M63662L7045l4263k05820
$$ -51026 -20287 47534 -222607 -368818 -677931 -757587 -513371 -49709 -12664 -46927 -252747
15325b52747l12434J45369K27717k1680j04977K70477m2131l7625K2429J75566
$$ -252747 -565181 -419812 -192095 -213775 -318752 -48275 -90406 -128031 -105602 69964
15315F9964l11854o0224O3475j5761K08330J52894N7543q8188l42677k85389J60539
$$ 69964 -241890 -302114 -238639 -254400 -46070 106824 164367 76179 -266498 -551887 -391348
15304c91348O1212n9093j79813m7052R3128J17902K05687O6708j9145J74371j13976
$$ -391348 -330136 -389229 -569042 -616094 -522966 -405064 -199377 -132669 -151814 22557 -91419
15293i1419J98784P9629l30157j89392J46551J91157j43170j84718K13203K4761
$$ -91419 107365 186994 -143163 -332555 -186004 5153 -138017 -322735 -109532 -84771
15283h4771R7505J87450k60994l072Q0714J64435O9456J9778m48927r0654K84957
$$ -84771 12734 200184 -60810 -63882 16832 181267 250723 270501 -178426 -269080 15877
15272A5877j48980j62390K29179J40004M79846p5909n0928L9039k76810j58868
$$ 15877 -133103 -295493 -66314 73690 553536 477627 426699 465738 188928 30060
15262C0060r284M33334K1433M0173J45542j63193m67512J06521J58146J49110
$$ 30060 20776 454110 475543 515716 661258 498065 30553 137074 295220 444330
15252D44330J23610j21449l07372m7014J52626j41662p6200j68289k36644P3959
$$ 444330 567940 446491 139119 92105 244731 103069 26869 -141420 -378064 -304105
15242c04105l9458L4527Q2204J28724J77615J17242j70534n9407J04324J05473
$$ -304105 -343563 -309036 -226832 -98108 79507 196749 26215 -33192 71132 176605
15232A76605J20167M2537j73650o9244k5687J18057J33817j9436R2265j91004
$$ 176605 296772 339309 165659 96415 70728 188785 322602 303166 395431 204427
15222B04427K85785l23293J27135p3813m7112L8935K05698J23763k67064l15592
$$ 204427 490212 166919 294054 220241 173129 212064 417762 541525 274461 -41131
15212d1131j76990o0651L91502j07454j30420j99947k31260j7538j4801L5095
$$ -41131 -218121 -278772 112730 5276 -125144 -325091 -556351 -573889 -588690 -553595
15202e53595L21446j13907J75035L59920r0117k68694P6416j16163l14422J5537
$$ -553595 -232149 -346056 -171021 188899 98782 -169912 -93496 -209659 -524081 -508544
15192e08544L33149L62971k3864o1314J9389j04488k4555p2518O431l2277j60530
$$ -508544 -175395 187576 163712 102398 121787 17299 -7256 -79774 -73343 -105620 -266150
15181b66150N1311O7774O6903R1314J79391q6402j08578o7649O6754l21366L04707
$$ -266150 -214839 -147065 -80162 11152 190543 104141 -4437 -72086 -5332 -326698 -21991
15170b1991L69328j79801R370K01248j42319K79545j88206m35725m02377l1141
$$ -21991 347337 167536 176906 378154 235835 515380 327174 -108551 -510928 -542069
15160e42069j65481O4931L04651M34077N7828l95743K96538j30622k80732J07074
$$ -542069 -707550 -642619 -337968 96109 153937 -241806 54732 -75890 -356622 -249548
15150b49548L9275k68531K87982J24984k73792J45451M53367J308q2563j94169
$$ -249548 -210273 -478804 -190822 -65838 -339630 -194179 259188 260496 177933 -16236
15140a6236J25576K41643J63460m85661k27423j3456j61714L82302N9303l0466
$$ -16236 109340 350983 514443 28782 -198641 -212097 -373811 8491 67794 37328
15130C7328p4301k431R0522j14135j9447o9373k81925J31663J57970K93297l98612
$$ 37328 -36973 -39404 51118 -63017 -82464 -151837 -433762 -302099 -144129 149168 -249444
15119b49444j10364K383P8415M86120J77820k23211j27265K90020j92061j44370
$$ -249444 -359808 -357425 -279010 207110 384930 161719 34454 324474 132413 -11957
15109a1957l66643l57657o8593N62624L32367J42577j26258k74214j01242l69113
$$ -11957 -378600 -736257 -804850 -242226 90141 232718 106460 -167754 -268996 -638109
15099f38109k00219L77147L8501M0944J98830K65225J87337m33044l04593L69659
$$ -638109 -838328 -461181 -422680 -381736 -182906 82319 269656 -163388 -467981 -98322
15089i8322J51169j1224m5980k12847J76958j31484J02091J13004L4195K30248
$$ -98322 52847 41623 -4357 -217204 -40246 -171730 -69639 43365 77560 307808
15079C07808P3029r9201m86529j54079k51205J83244M16848k16418m3035M09363
$$ 307808 380837 281636 -204893 -358972 -610177 -426933 -10085 -226503 -269538 139825
15069A39825L27724j44417m4808j5661n6309j06229J6023l20501j09715J14612
$$ 139825 467549 323132 278324 262663 206354 100125 116148 -204353 -314068 -199456
15059a99456O5974o2440o6265O757j19888J33128O50214j35788j7147j68906j58889
$$ -199456 -133482 -195922 -262187 -255430 -375318 -242190 408024 272236 255089 86183 -72706
15048g2706l9711J86892M2354M608k27755K6715L83101N2145K52115j05733p8660
$$ -72706 -112417 74475 116829 121437 -106318 -79603 303498 355643 607758 502025 423365
15037D23365k39495N7245m09139m28957l7668m1953P77J60628K75687N58528r5591
$$ 423365 183870 241115 -168024 -596981 -634649 -676602 -675825 -515197 -239510 319018 223427
15026B23427j97765r8781j38876M65391Q3387j46128j23781n2333L60852l14183
$$ 223427 25662 -73119 -211995 253396 336783 190655 66874 14541 375393 61210
15016F1210j74990J61980J30821K22941l1035n2068l29184j63334L24982L88146
$$ 61210 -113780 48200 179021 401962 370927 318859 -10325 -173659 151323 539469
15006E39469N6331n76319m32291K69066J01584j10753J20184j8165K8125L70289
$$ 539469 595800 19481 -412810 -143744 -42160 -152913 -32729 -50894 -22769 347520
14996C47520k77336j39596l30640l2654J70748K83312K68637J18939Q3215J57002
$$ 347520 70184 -69412 -400052 -432706 -261958 21354 289991 408930 492145 649147
14986F49147k89942m3555L00719K19988j53570l71234k49153r1194J49460J8118
$$ 649147 359205 315650 616369 836357 682787 311553 62400 -28794 120666 138784
14976A38784j07516k85445P7659P5878k3051j25828o5506N9147K15132J84898
$$ 138784 31268 -254177 -176518 -100640 -123691 -249519 -315025 -255878 -40746 144152
14966A44152j49158k79932j66703K9859M0854K15314J917M3245q7486J89434Q2814
$$ 144152 -5006 -284938 -451641 -421782 -380928 -165614 -163697 -120452 -207938 -18504 64310
14955F4310l69327k46166J164j125J78832K91559J7718k16419L81283P8320j60265
$$ 64310 -305017 -551183 -550019 -551144 -372312 -80753 -63035 -279454 101829 180149 19884
14944A9884m0711j01098k23787J43954M74169K65594q3773r7172k12422m07412
$$ 19884 -20827 -121925 -345712 -201758 272411 538005 454232 357060 144638 -262774
14934b62774J49382J16336K3873J59371J06031j31902J63607l32751n8L29357
$$ -262774 -113392 2944 26817 186188 292219 160317 323924 -8827 -8885 320472
14924C20472J43984Q6049k20354n25409R4134R1160j95959J43648L18184J555
$$ 320472 464456 550505 330151 -195258 -101124 -9964 -205923 -62275 255909 257464
14914B57464k162j23178L8675n0978N4468m77548l44033L39021J87907J76863
$$ 257464 255302 132124 170799 119821 174289 -303259 -647292 -308271 -120364 56499
14904E6499j24974J76377J66117p8622m23071l2971L26708K57675J96937l57919
$$ 56499 -68475 107902 274019 195397 -227674 -260645 66063 323738 520675 162756
14894A62756n36815n5034M39310L0994J49146q8721J77008J10555k19635j84846
$$ 162756 -374059 -429093 10217 41211 190357 101636 278644 389199 169564 -15282
14884a5282j10332J29841L338J11992o4039k62630J09198J60406J07378N7197
$$ -15282 -125614 4227 7565 119557 55518 -207112 -97914 62492 169870 227067
14874B27067O6777L21880r1923j42677l20644j35530K15098K40577j12416k63426
$$ 227067 293844 615724 523801 381124 60480 -75050 140048 380625 268209 4783
14864D783k46361q1517Q589Q8209p3959M751K97467m2308j53123k45078J03586
$$ 4783 -241578 -323095 -314506 -226297 -300256 -295505 1962 -40346 -193469 -438547 -334961
14853c34961j04432J01210K05078L6754J242K32151N8457o1167k67565m11131
$$ -334961 -439393 -338183 -133105 -96351 -95109 137042 195499 134332 -133233 -544364
14843e44364J77972J70285l948j03893P7844k653j56136L83217K64995J52927
$$ -544364 -366392 -196107 -200055 -303948 -226104 -228757 -384893 -1676 263319 416246
14833D16246p8962k23409j26028l12875j41815M56647L93512l07917M4913K60782
$$ 416246 337284 113875 -12153 -325028 -466843 -10196 383316 75399 120312 381094
14823C81094n4616k4926o5093j36132m00845j049J64325K09654r3296K66359q3920
$$ 381094 326478 301552 236459 100327 -300518 -301567 -137242 72412 -20884 245475 161555
14812A61555j92087J36342j999l6917L57239J05406m91708q3281j89234l8652
$$ 161555 -30532 105810 103811 66894 424133 529539 37831 -45450 -234684 -273336
14802b73336j65812j90679p8751J10444M36993N27992M14799k09571m40488k44616
$$ -273336 -439148 -629827 -708578 -598134 -161141 366851 781650 572079 131591 -113025
14792a13025J16216Q7324k8233L9076O1921j51256n9101j25816k61634M28563
$$ -113025 3191 90515 62282 101358 163279 12023 -47078 -172894 -434528 -5965
14782e965P5260k1343J35945K12109m00347n14832p7018j46611j0592K00246K95148
$$ -5965 69295 47952 183897 396006 -4341 -519173 -596191 -742802 -753394 -553148 -258000
14771b58000R0738l207J01687Q5092R3647M11299K24307k07622n16250l50520
$$ -258000 -167262 -170469 -68782 16310 109957 521256 745563 537941 21691 -328829
14761c28829n4352j1082J2419L21692L25554J52355n8047r7772k19775j99169
$$ -328829 -383181 -394263 -381844 -60152 265402 417757 359710 261938 42163 -157006
14751a57006M61948N1687J49921j06342l46936N7750J48348L26973k9342j26417
$$ -157006 304942 356629 506550 400208 53272 111022 259370 586343 557001 430584
14741D30584R8743l71684n98758m422N36317K53799j61258M2451J05264k20884
$$ 430584 529327 157643 -441115 -445537 90780 344579 183321 225772 331036 110152
14731A10152j31379j07480L52441k06821j18989L38908K26807K6978o5128l90655
$$ 110152 -21227 -128707 223734 16913 -102076 236832 463639 490617 425489 34834
14721C4834P1631J97973O488j05396P2974j89155l37298j41135J17616L73633
$$ 34834 106465 304438 310926 205530 278504 89349 -247949 -389084 -271468 102165
14711A02165j41194M6773M2400J02054l00450j88603J06755K88580o3997j44354
$$ 102165 -39029 7744 50144 152198 -148252 -336855 -230100 58480 -5517 -149871
14701a49871m15971K1109N55904K32338L64408j70354k65307L8146l68393m47543
$$ -149871 -565842 -544733 11171 243509 607917 437563 172256 210402 -157991 -605534
14691f05534l564K54733K5321j40614o7296J57912N32485O9350m64654J57538
$$ -605534 -609098 -354365 -329044 -469658 -536954 -379042 153443 222793 -241861 -84323
14681h4323R1832M8494M04600J21347n52649J00545O51552j2894M903J293m90987
$$ -84323 7509 56003 460603 581950 29301 129846 781398 768504 773407 774700 283713
14670B83713p92900n64289L01197L7698N8842L73184K16770j94359R2174R0515
$$ 283713 -509187 -1073476 -772279 -734581 -675739 -302555 -85785 -280144 -187970 -97455
14660i7455q6698J85143j20059m0370j20016K76240K43884k64513O9447k65542
$$ -97455 -184153 990 -119069 -159439 -279455 -3215 240669 -23844 45603 -219939
14650b19939N7871K22898K22972k65876o1324k4474m4241p2853J5181k8242J85685
$$ -219939 -162068 60830 283802 17926 -43398 -67872 -112113 -184966 -169785 -198027 -12342
14639a2342K80603J32605k80430k06457J32509L8900j16558j31296J1267k00048
$$ -12342 268261 400866 120436 -86021 46488 85388 -31170 -162466 -151199 -351247
14629c51247k06510L23153N15030K68442j32419l24572m31183k68290K60799J54822
$$ -351247 -557757 -234604 280426 548868 416449 91877 -339306 -607596 -346797 -191975
14619a91975Q5788J58876J89262p8868N598m12359j17733R4097m8817r1708j28892
$$ -191975 -106187 52689 241951 163083 168681 -243678 -361411 -267314 -316131 -407839 -536731
14608e36731P7618J43765O3589J37127j64325r3528k00535K88118p1036K07116
$$ -536731 -459113 -315348 -251759 -114632 -278957 -372485 -573020 -284902 -355938 -148822
14598a48822N24852r839l21864r7662j82613j05119n4809J79207R2018k09726
$$ -148822 376030 366191 44327 -53335 -235948 -341067 -395876 -216669 -124651 -334377
14588c34377J1265J19687J90759M9666K07070R5514j14636Q3421k52156J1328
$$ -334377 -323112 -203425 -12666 37000 244070 339584 224948 308369 56213 67541
14578F7541L26793j05859m84541o5142L70230q1246J39921Q4232m96993j51680
$$ 67541 394334 288475 -196066 -261208 109022 27776 167697 251929 -245064 -396744
14568c96744K02953M43093J85989k10841k27229K90018k1439j88440l10877q4710
$$ -396744 -193791 249302 435291 224450 -2779 287239 265800 77360 -233517 -318227
14558c18227L15766J30420l21778J39808L09660m1315l71903k47426k53835M64509
$$ -318227 -2461 127959 -193819 -54011 255649 214334 -157569 -404995 -658830 -194321
14548a94321K17013J79531K69276r321r5271k48327l04303K0982n2562p8690K0981
$$ -194321 22692 202223 471499 462178 366907 118580 -185723 -164741 -217303 -295993 -275012
14537b75012J10693J0433J52584K15619K01522M758j88555k8468J20958k50624
$$ -275012 -164319 -153886 -1302 214317 415839 420597 232042 203574 324532 73908
14527G3908L2626R5098K81029J70759J70670k94139n41490J10971K8231l32574
$$ 73908 106534 201632 482661 653420 824090 529951 -11539 99432 127663 -204911
14517b04911L731j38029M7030K5936N82738r646n67351N6991J43237K9540j66
$$ -204911 -201180 -339209 -292179 -266243 316495 306849 -260502 -203511 -60274 -30734 -30900
14506c0900k7892j69448l78953r7557L1490L20639J1765j77636O577N35415L85909
$$ -30900 -58792 -228240 -607193 -704750 -673260 -352621 -340856 -518492 -511915 23500 409409
14495D09409J14088n41323k63197N7827j15223J16496K14458o0332j03262R555
$$ 409409 523497 -17826 -281023 -223196 -338419 -221923 -7465 -67797 -171059 -161504
14485a61504j10549J75209L11473k2614j07032R329K00001N8151j19201k43386
$$ -161504 -272053 -96844 214629 192015 84983 94312 294313 352464 233263 -10123
14475a0123p7212j81923r5259j14460J77471K75854J52346m1371J58075K03393
$$ -10123 -87335 -269258 -364517 -478977 -301506 -25652 126694 85323 243398 446791
14465D46791J85408O0641J07381k6262k21301K51733j1977m13945j3201k56731
$$ 446791 632199 692840 800221 773959 552658 804391 792414 378469 365268 108537
14455A08537m37923L56541O31362N5710m53938n07581p8373k20421P9900J41495
$$ 108537 -329386 27155 658517 714227 260289 -247292 -325665 -546086 -466186 -324691
14445c24691K08834j83637n3600j07851J02903J73346K49415J49824n5764N4885
$$ -324691 -115857 -299494 -353094 -460945 -358042 -184696 64719 214543 158779 213664
14435B13664j68412m21587J92820K62294J56797k32094k31355J22269L44488p0924
$$ 213664 45252 -376335 -183515 78779 235576 3482 -227873 -105604 238884 167960
14425A67960K76358L19811K4043m09638j84O3408m93237m9399K47522j9841K06620
$$ 167960 444318 764129 788172 378534 378350 441758 -51479 -100878 146644 126803 333423
14414C33423J90814l8872K6784j28514m7859m1982J15269l19260R5867K4435k9066
$$ 333423 524237 485365 512149 383635 335776 293794 409063 89803 185670 210105 181039
14403A81039k23891j37216R6705n1055j32984k04448n0801j42567K38276K57310
$$ 181039 -42852 -180068 -83363 -134418 -267402 -471850 -522651 -665218 -426942 -169632
14393a69632J06934J05472K31061K30058P9773j16658J71403O303k47085k46008
$$ -169632 -62698 42774 273835 503893 583666 467008 638411 644714 397629 151621
14383A51621J5909Q3878j92520o905k21867J05449Q0116O9081r0914j24859p9533
$$ 151621 167530 251408 58888 51983 -169884 -64435 15681 84762 -6152 -131011 -210544
14372b10544n2407p8210J83242J84267L09695J27822j91538j72209l59453k02027
$$ -210544 -262951 -341161 -157919 26348 336043 463865 272327 100118 -259335 -461362
14362d61362K68022K71332K2814m9723q5770M1363P4607j27314k40464O5448M17987
$$ -461362 -193340 77992 100806 51083 -34687 6676 81283 -46031 -286495 -221047 196940
14351A96940J96380j8811m67977j69886J31114J69832J48604N8235j99470j77419
$$ 196940 393320 374509 -93468 -263354 -132240 37592 186196 244431 44961 -132458
14341a32458q5425N0756J14571r6550l35349k25306L41686K40241R2424K17346
$$ -132458 -217883 -167127 -52556 -149106 -484455 -709761 -368075 -127834 -35410 181936
14331A81936o1083j25457L1452K61913j00090o7170O1483j49133o6719K19835
$$ 181936 120853 -4604 26848 288761 188671 121501 182984 33851 -32868 186967
14321A86967K5053P0333K21619J14038p4962j89191k81843n6913M4088p0582K1989
$$ 186967 212020 282353 503972 618010 543048 353857 72014 15101 59189 -11393 10596
14310A0596r4559k30154p8442N30912J05189l36565l42801K72646o5663m1233
$$ 10596 -83963 -314117 -392559 138353 243542 -93023 -435824 -163178 -228841 -270074
14300b70074j2119M21898K19078N0246J21393j96001j35239k41195L1337M5790
$$ -270074 -282193 139705 358783 409029 530422 334421 199182 -42013 -10676 35114
14290C5114M63662J19769m23892l46139k92363J60644P4271m8759j27429K41536
$$ 35114 498776 618545 194653 -151486 -443849 -283205 -208934 -257693 -385122 -143586
14280a43586k13172q2559K88573L41805Q9385l40601o1532k4849J977L73290K10044
$$ -143586 -356758 -439317 -150744 191061 280446 -60155 -121687 -146536 -144559 228731 438775
14269D38775j2608r3047J33464j49092m4093Q51n1506k43215M0018K02223j12858
$$ 438775 426167 333120 466584 317492 273399 274250 222744 -20471 19547 221770 108912
14258A08912P2814j0826j93693j73037L64579J67560k70721k87918j06824J17052
$$ 108912 181726 170900 -22793 -195830 168749 336309 65588 -222330 -329154 -212102
14248b12102L52138L26203r6905k79165J5633j43629k84283L03658J25496q4213
$$ -212102 140036 466239 369334 90169 105802 -37827 -322110 -18452 107044 22831
14238B2831j63720M8642K4566K55746l5393J24327J12023l5912o91370L38099
$$ 22831 -140889 -92247 -67681 188065 152672 276999 389022 353110 -338260 -161
14228a61P6526m49508j64181J36481Q0813J2745M1448j50294k20236j95888K4811
$$ -161 76365 -373143 -537324 -400843 -320030 -307285 -265837 -416131 -636367 -832255 -807444
14217h07444M26107N5265r4388K90741m0231P7844k2780o8530J49770k13076o4599
$$ -807444 -381337 -326072 -420460 -129719 -169950 -92106 -114886 -183416 -33646 -246722 -311321
14206c11321K59159L380J2302O9880n3246k11922Q7320j1166N4156K20697n4962
$$ -311321 -52162 -48782 -36480 33400 -19846 -231768 -144448 -155614 -101458 119239 64277
14195F4277l97696J1940M60025K16258K6301r8822k40832k09691k16938j01888
$$ 64277 -333419 -321479 138546 354804 381105 282283 41451 -168240 -385178 -487066
14185d87066Q5622K26251n1204L7033M673Q9065N3394K51942K22319K97557K8865
$$ -487066 -401444 -175193 -226397 -189364 -184691 -95626 -42232 209710 432029 729586 758451
14174G58451L3225k33301O202n4311m24165l59844J42125O18426J30203j52282
$$ 758451 791676 558375 564577 510266 86101 -273743 -131618 486808 617011 464729
14164D64729j00803l1753j83112J97254J65773L5890k39000j47775k64521k53297
$$ 464729 363926 332173 149061 346315 512088 547978 308978 161203 -103318 -356615
14154c56615l4185p4702j41552J48166K28897O4486m73554J75857Q5722r3226
$$ -356615 -390800 -465502 -607054 -458888 -229991 -165505 -639059 -463202 -377480 -470706
14144d70706L664l4077L3482k9798K77709M36736K07094l13066n29177j21777
$$ -470706 -467042 -501119 -467637 -497435 -219726 217010 424104 111038 -418139 -539916
14134e39916L25996J04987J53994l27798M5914J88097q4471K69820K29321L6897
$$ -539916 -213920 -108933 45061 -282737 -236823 -48726 -133197 136623 365944 402841
14124D02841j29466k66259j18723L2698J71354J14029p4811j77873j10227j73628
$$ 402841 273375 7116 -111607 -78909 92445 206474 131663 -46210 -156437 -330065
14114c30065J48758J23530k24241j45863l8447j22808L98328J27865J78225K63271
$$ -330065 -181307 -57777 -282018 -427881 -466328 -589136 -190808 -62943 115282 378553
14104C78553P7966m57641k88855J4704M09432m17N1552K2307j37655j94622j37246
$$ 378553 456519 -1122 -289977 -275273 134159 133742 185294 207601 69946 -124676 -261922
14093b61922j20017L6370P2612K77499J23419M53195J5897J9309n4493n0398k28697
$$ -261922 -381939 -345569 -272957 4542 127961 581156 597053 616362 561869 511471 282774
14082B82774k51976l29385k26598L0421K4363j2252K49565l6051M1667O9302J17674
$$ 282774 30798 -298587 -525185 -494764 -470401 -482653 -233088 -269139 -227472 -158170 -40496
14071d0496j2125j75879k58992M12853J04726P5349k11656r1728k17766j82582
$$ -40496 -52621 -228500 -487492 -74639 30087 105436 -106220 -197948 -415714 -598296
14061e98296j08648K63527K49169L17013O0234L1429j05063L2139j16664m18953
$$ -598296 -706944 -443417 -194248 122765 182999 214428 109365 141504 24840 -394113
14051c94113j28936L56156r8342Q3069q1094j05239J47306K45976P7278m8572
$$ -394113 -523049 -166893 -265235 -182166 -263260 -368499 -221193 24783 102061 53489
14041E3489r5894Q0432J40636j55879k09925p9012j0195j37534J10925O6647L6394
$$ 53489 -42405 38027 178663 22784 -187141 -266153 -276348 -413882 -302957 -236310 -199916
14030a99916n4070l6771M0655J94072L19069q2157K5657l2942k26089j13870J906
$$ -199916 -253986 -290757 -250102 -56030 263039 180882 206539 173597 -52492 -166362 -164456
14019a64456K00620j47912p3858R7324J16039J33073n2722O691m8744m01420k08803
$$ -164456 36164 -111748 -185606 -88282 27757 160830 108108 114799 66055 -335365 -544168
14008e44168K31174K48281P52j15106J7139J45432J70794k435P2127R3099N3237
$$ -544168 -312994 -64713 -63961 -179067 -161928 -16496 154298 151863 223990 317089 370326
13997C70326J02446r2694m32803m83630L48051K84980O0836K09263N6876j5395
$$ 370326 472772 380078 -52725 -536355 -188304 96676 157512 366775 423651 408256
13987D08256j8785J8856k77137N1427M1569j22904l30570j26942k34982r4695
$$ 408256 389471 408327 131190 182617 224186 101282 -229288 -356230 -591212 -685907
13977f85907L40881Q5264P104J58528J51085M3447k34903R9312q4358l6220j72210
$$ -685907 -345026 -259762 -252658 -94130 56955 100402 -134501 -35189 -119547 -155767 -327977
13966c27977R085K927L9729R6348K33233L928l42238J01106K47746p4703J18853
$$ -327977 -318892 -315965 -276236 -179888 53345 57273 -284965 -183859 63887 -10816 108037
13955A08037j68686M0815j45556L10768r001j00320j21894n0750K17637O1624
$$ 108037 -60649 -19834 -165390 145378 136377 36057 -85837 -136587 81050 142674
13945A42674l33541r7344N1175L3101J25865L7591k5991L5694K08722M6347J25918
$$ 142674 -190867 -288211 -237036 -203935 -78070 -40479 -66470 -30776 177946 224293 350211
13934C50211j03793k80951J3138L44423k57937R266j99341N8386M7947J219J96617
$$ 350211 246418 -34533 -21395 323028 65091 74357 -124984 -66598 -18651 -17432 179185
13923A79185j33439J84381k21646m76082j26808j78934O306L61258K53612M77592
$$ 179185 45746 230127 8481 -467601 -594409 -773343 -767037 -405779 -152167 325425
13913C25425J20487j99822j69789r1387J10026j3412J43179j6494K4750m429J08719
$$ 325425 445912 246090 76301 -15086 94940 81528 224707 208213 232963 228534 337253
13902C37253n4629j17947l87487l0176P739R2165J49375j6047l06677J84641K46115
$$ 337253 282624 164677 -222810 -252986 -245247 -153082 -3707 -19754 -326431 -141790 104325
13891A04325m46484r5968K39430j96178P0874J40938J67330J22750J57374P8682
$$ 104325 -342159 -438127 -198697 -394875 -324001 -183063 -15733 107017 264391 343073
13881C43073N9287J61734n2772j75368k41055j46602K31290K27439j38506o5653
$$ 343073 402360 564094 511322 335954 94899 -51703 179587 407026 268520 202867
13871B02867Q3339J66077L57158m6740o09622j73653J0587R6836N2969l09623
$$ 202867 286206 452283 809441 762701 153079 -20574 -9987 86849 139818 -169805
13861a69805M3880M09326j14554P1228K65491k20177j64731L07778j30682k18614
$$ -169805 -125925 283401 168847 240075 505566 285389 120658 428436 297754 79140
13851G9140j84584P1940J31077J58478J05192j18713J16345k8948O4636M4905
$$ 79140 -105444 -33504 97573 256051 361243 242530 358875 329927 394563 439468
13841D39468J06428k37045l83218k34916o4070K05307o2784K90684K34999k72194
$$ 439468 545896 308851 -74367 -309283 -373353 -168046 -230830 59854 294853 22659
13831B2659m04913j46919j40691J78320J85192O4587K70595K68319r3446j41638
$$ 22659 -382254 -529173 -669864 -491544 -306352 -241765 28830 297149 203703 62065
13821F2065l05069n6829J15844r6809j34188L20843J53947J91895J8867l93642
$$ 62065 -243004 -299833 -183989 -280798 -414986 -94143 59804 251699 270566 -123076
13811a23076n09708M0735M92664M02445j50085M2556J26479j98096p7812j19781
$$ -123076 -632784 -592049 -99385 303060 152975 195531 322010 123914 46102 -73679
13801g3679R8003L25302J94213j4892k15542l40234j22919J46526K08566L3811
$$ -73679 24324 349626 543839 528947 313405 -26829 -149748 -3222 205344 239155
13791B39155l27722r6577p4904m9002n2774j22035K4824J67593O5754K4214L12939
$$ 239155 -88567 -185144 -260048 -309050 -361824 -483859 -459035 -291442 -225688 -201474 111465
13780A11465m7746j17238K1141J89190K7958J70861m9744M0031J70089m23530
$$ 111465 63719 -53519 -32378 156812 184770 355631 305887 345918 516007 92477
13770I2477j47264j8471j87260N2700K74283J29722J44098K02288R4779L2127
$$ 92477 -54787 -73258 -260518 -207818 66465 196187 340285 542573 637352 669479
13760F69479k15973j14064j12625k12713R1523J82326k14406j14829n7370K01957
$$ 669479 453506 339442 226817 14104 105627 287953 73547 -41282 -98652 103305
13750A03305m1823J27399Q3443j98073o2786K53160K58427P6071l54939K37979
$$ 103305 61482 188881 272324 74251 11465 264625 523052 599123 244184 482163
13740D82163M15909m6627p2755l38901j44368n6453l50229p5654L00552r426j47884
$$ 482163 898072 851445 778690 439789 295421 238968 -111261 -186915 113637 104211 -43673
13729d3673k72133r534L4834O9617m2646p9768K3826K25879l0992J59597R1899
$$ -43673 -315806 -325340 -290506 -220889 -263535 -343303 -319477 -93598 -124590 35007 126906
13718A26906N9099j53045O7121O6185M2218N520J85738l6343l58245m08704o8322
$$ 126906 186005 32960 100081 166266 208484 214004 399742 363399 5154 -403550 -471872
13707d71872K34045M97249n3427n39379l1738J56820K05131O3837m7701l91216
$$ -471872 -237827 259422 205995 -333384 -365122 -208302 -3171 60666 12965 -378251
13697c78251P9264J52579j29775J96382K75253K4999k14688N720L73676P9563
$$ -378251 -298987 -146408 -276183 -79801 195452 220451 5763 11483 385159 464722
13687D64722k01562l34259J48906J30229L16839l8181k97487m0632o6696L9722
$$ 464722 263160 -71099 77807 208036 524875 486694 189207 148575 81879 121601
13677A21601K37977r9076j65428J64123j08036k05963L04117J71164j08945K03465
$$ 121601 359578 260502 95074 259197 151161 -54802 249315 420479 311534 514999
13667E14999j24843k69324L35346K12106J73023J55971o27578m94282K28503K45680
$$ 514999 390156 120832 456178 668284 841307 997278 369700 -124582 103921 349601
13657C49601O4834L29483m19935n88360J44983K89372k7156j08211k35133j22763
$$ 349601 414435 743918 323983 -264377 -119394 169978 142822 34611 -200522 -323285
13647c23285K64643K17667k08247o16025L20452L67237k28771o9869M1198J74196
$$ -323285 -58642 159025 -49222 -665247 -344795 22442 -206329 -276198 -235000 -60804
13637f0804N8198Q9953O1914Q0659j00591K2732l01393j3065K03951L40132K97385
$$ -60804 -2606 87347 149261 229920 129329 152061 -149332 -162397 41554 381686 679071
13626F79071l09863k91502J97736j13567J15062n4486k74246R1136J46490Q6408
$$ 679071 369208 77706 275442 161875 276937 222451 -51795 39341 185831 272239
13616B72239J28257j73149m56107M1768J29316P1450L49236k41013m69442o9173
$$ 272239 400496 227347 -228760 -186992 -57676 13774 363010 121997 -347445 -416618
13606d16618L58090L08517r2303J83769J32379O0472k06699k88589M2196j37460
$$ -416618 -58528 249989 157686 341455 473834 534306 327607 39018 81214 -56246
13596e6246Q9358J1926J8773l0460J06209l13737k17762j96394K08371L66258
$$ -56246 33112 45038 63811 33351 139560 -174177 -391939 -588333 -379962 -13704
13586a3704K52742L4940j77828j70603O2368K52603J53240J9864m1402j2376m00929
$$ -13704 239038 273978 96150 -74453 -12085 240518 393758 413622 372220 359844 -41085
13575d1085k15854P0856K18731k64034j86720J36888m2450j81777K16451K55316
$$ -41085 -256939 -186083 32648 -231386 -418106 -281218 -323668 -505445 -288994 -33678
13565c3678K7929j27366m1095k23192p4641L23803K79630L7175q2156j84054Q3978
$$ -33678 -5749 -133115 -174210 -397402 -472043 -148240 131390 168565 86409 -97645 -13667
13554a3667N8594L12239J10794L3979N8357k2645l62229j53480k91561k27369
$$ -13667 44927 357166 467960 501939 560296 537651 175422 21942 -269619 -496988
13544d96988K97852J51307O7700j82879K16927L17161j46422l2026R7516J59850
$$ -496988 -199136 -47829 19871 -163008 53919 371080 224658 192632 290148 449998
13534D49998k39800k31849p323l1704K60480J14376P4746J8154q3054n0717l58344
$$ 449998 210198 -21651 -28974 -60678 199802 314178 388924 407078 324024 273307 -85037
13523h5037m89620N6134L53739N4129j45424R8979q0454L21324K6435l85925r1959
$$ -85037 -574657 -518523 -164784 -110655 -256079 -157100 -237554 83770 110205 -275720 -367679
13512c67679L92295L7572L3131J88522j60561j32067j37410j77430J4556L64559
$$ -367679 24616 62188 95319 283841 123280 -8787 -146197 -323627 -309071 55488
13502E5488J38k27364n0975Q1267j7515m64569n3507K24146k46679L9190k34728
$$ 55488 55626 -171738 -222713 -141446 -158961 -623530 -677037 -452891 -699570 -660380 -895108
13491h95108q5995j986K21214J95684K14492K3152p9923J46991K47148k01106
$$ -895108 -981103 -983089 -761875 -566191 -351699 -328547 -408470 -261479 -14331 -215437
13481b15437k00206k03672K47009q776R6148J40424j27384j39656P0699J54866
$$ -215437 -415643 -619315 -372306 -381082 -284934 -144510 -271894 -411550 -340851 -185985
13471a85985n8198K48082M5782m79487l44232J53874J77793Q8879j67263K64851
$$ -185985 -244183 3899 49681 -429806 -774038 -620164 -442371 -353492 -520755 -255904
13461b55904l4709k62344l45231N00444J63805R7292j97013M66437J17484K45128
$$ -255904 -290613 -552957 -898188 -397744 -233939 -136647 -333660 132777 250261 495389
13451D95389j04468k28490l33688L8733J20020J7705o5421k5998L85992l8449
$$ 495389 390921 162431 -171257 -132524 -12504 5201 -60220 -86218 299774 261325
13441B61325J23141j09371l68274k23898J26100J8968k59449j70130R4352L40013
$$ 261325 384466 275095 -93179 -317077 -190977 -172009 -431458 -601588 -507236 -167223
13431a67223K55310k27963J27775L19546k26516j17594J43445Q9293Q0517L15268
$$ -167223 88087 -139876 -12101 307445 80929 -36665 106780 196073 276590 591858
13421E91858J83288m26147l41350j09027J37353L68922K29914M5551l26077j94243
$$ 591858 775146 348999 7649 -101378 35975 404897 634811 680362 354285 160042
13411A60042r6379o2044L6894k06090P1363K33118N25746J71339m89861k73957
$$ 160042 63663 1619 38513 -167577 -96214 136904 662650 833989 344128 70171
13401G0171K27039L9997N2968l6480l15824O2599l4264J4405K58218J2771j5065
$$ 70171 297210 337207 390175 353695 37871 100470 66206 80611 338829 351600 336535
13390C36535l5012k28691k82318L6364K91196j52809q1850m33969k45226j57039
$$ 336535 301523 72832 -209486 -173122 118074 -34735 -116585 -550554 -795780 -952819
13380i52819O66785J52883n2560K42905j71935k2823O0921m4067r6840O3644K62708
$$ -952819 -286034 -133151 -185711 57194 -114741 -137564 -76643 -120710 -217550 -153906 108802
13369A08802L429j97870k3668q6080J3501m5053j65406j66908J18476q8107K25987
$$ 108802 112231 -85639 -109307 -195387 -181886 -226939 -392345 -559253 -440777 -528884 -302897
13358c02897r4932J63054K18008J92827K76626j16239k72180k31765J13618r5920
$$ -302897 -397829 -234775 -16767 176060 452686 336447 64267 -167498 -53880 -149800
13348a49800k88872m2747M5912J24156K07878q8736j52085J06009K80345j09071
$$ -149800 -438672 -481419 -435507 -311351 -103473 -192209 -344294 -238285 42060 -67011
13338f7011k76587J08463m1942N65602K02967L1771J26759j70005j06893o19773
$$ -67011 -343598 -235135 -277077 288525 491492 523263 650022 480017 373124 -246649
13328b46649j71606J64731k0779m94411j20230L04053N19796K70474n7668l6455
$$ -246649 -418255 -253524 -274303 -768714 -888944 -584891 -65095 205379 147711 111256
13318A11256j44506M03621k9350n2928r6751j23162j34379r8963L43178j6739
$$ 111256 -33250 370371 341021 288093 191342 68180 -66199 -165162 178016 161277
13308A61277K17804L16328k21171P0092K79570j09644l03769j22307K06873J67060
$$ 161277 379081 695409 474238 544330 823900 714256 410487 288180 495053 662113
13298F62113p151O6169j13947j68508k24742m11011k614N10183k18329K44170
$$ 662113 654962 721131 607184 438676 213934 -197077 -199691 310492 92163 336333
13288C36333L23943j36336o05750J0313L26243K89952N06j13129J74359l09033
$$ 336333 660276 523940 -81810 -71497 254746 544698 545204 432075 606434 297401
13278B97401k98137n8908J43391K18335K08026l06689K13020j9797j1491J31916
$$ 297401 -736 -59644 83747 302082 510108 203419 416439 396642 385151 517067
13268E17067M5808k49474l38642l00141O0724L75704J06991j20260J4377k82899
$$ 517067 562875 313401 -25241 -325382 -264658 111046 218037 97777 112154 -170745
13258a70745j71174j43265K01594k5164N44215J95702r0672k38913k21117k10877
$$ -170745 -341919 -485184 -283590 -308754 235461 431163 340491 101578 -119539 -330416
13248c30416j77437K9727J05282K26312M26486Q5551m3810l25922k36626k65249
$$ -330416 -507853 -478126 -372844 -146532 279954 365505 321695 -4227 -240853 -506102
13238e06102l5772K70190l016n1262J27198k05321k51333K02962L30742J50949
$$ -506102 -541874 -271684 -274700 -325962 -198764 -404085 -655418 -452456 -121714 29235
13228B9235J40030q9215k16783R7818J12035L80527K48658l16854l8687j53436
$$ 29235 169265 80050 -136733 -38915 73120 453647 702305 385451 346764 193328
13218A93328r6943J52698K30693j4995j22614o3450P8234l08231K17037k687P3929
$$ 193328 96385 249083 479776 464781 342167 278717 356951 48720 265757 263070 336999
13207C36999j22301m70079j96526L56560N96511J85576l26352p5136P7331J3877
$$ 336999 214698 -255381 -451907 -95347 501164 686740 360388 285252 362583 376460
13197C76460n4393k01689J8972k91043J62940j81508J24502K64700n02342m43183
$$ 376460 322067 120378 139350 -151693 11247 -170261 -45759 218941 -283401 -726584
13187g26584j22929J99724J29716M0679j7768P4411K85518L5193L164j63604k46972
$$ -726584 -849513 -649789 -520073 -479394 -497162 -422751 -137233 -102040 -98876 -262480 -509452
13176e09452R7979K7869L62400J0813o7854N7604j20585K1009k11881J1497J2329
$$ -509452 -411473 -383604 -21204 -10391 -78245 -20641 -141226 -120217 -332098 -320601 -308272
13165c08272K51000l57736l58260K12027j63015K17841K12916K71972l12054N9732
$$ -308272 -57272 -415008 -773268 -561241 -724256 -506415 -293499 -21527 -333581 -273849
13155b73849J80184j7864k1584J85209j29099k38858j60301J97910K91370Q6084
$$ -273849 -93665 -111529 -133113 52096 -77003 -315861 -476162 -278252 13118 99202
13145I9202o7709j18405n2285L7259K44921m718N5905j99689o31085q3455j11521
$$ 99202 31493 -86912 -139197 -101938 142983 138265 194170 -5519 -636604 -720059 -831580
$$ [...]
##END NTUPLES=NMR SPECTRUM
##END=
