##TITLE=Analysis number 308053
Compound Code spb 05853
Book Reference 407/67
Project Code adrs
Chemist Name andyw
##JCAMPDX= 6.0         $$ Bruker NMR JCAMP-DX V2.0
##DATA TYPE= NMR SPECTRUM
##DATA CLASS= NTUPLES
##ORIGIN= Bruker BioSpin GmbH
##OWNER= NMR
$$ XWIN-NMR		Version 3.5
$$ Thu May 19 14:42:42 2005 GMT Daylight Time (UT+1h)  MAYBRIDGE\NMR@NMR_250MHZ
##.OBSERVE FREQUENCY= 250.131544655141
##.OBSERVE NUCLEUS= ^1H
##.ACQUISITION MODE= SIMULTANEOUS (DQD)
##.ACQUISITION SCHEME= undefined
##.AVERAGES= 16
##.DIGITISER RES= 18
##SPECTROMETER/DATA SYSTEM= dpx250
##.PULSE SEQUENCE= zg30
##.SOLVENT NAME= CDCl3
##.SHIFT REFERENCE= (INTERNAL, CDCl3, 0, 16.454)
##AUDIT TRAIL= $$ (NUMBER, WHEN, WHO, WHERE, WHAT)
$$ ##TITLE= Audit trail, XWIN-NMR		Version 3.5
$$ ##JCAMPDX= 5.01
$$ ##ORIGIN= Bruker BioSpin GmbH
$$ ##OWNER= NMR
$$ C:\u/data/dgb/nmr/ADRS/3190/pdata/1/auditp.txt
$$ ##AUDIT TRAIL=  $$ (NUMBER, WHEN, WHO, WHERE, WHAT)
(   1,<2005-05-19 14:42:11.73 +100>,<MAYBRIDGE\NMR>,<NMR_250MHZ>,
      <created by zg, POWCHK disabled, PULCHK disabled
       configuration hash MD5:
       62 19 C7 07 E1 42 D1 B7 37 6C 3D D0 77 39 F9 E6
       data hash MD5: 64K
       3A 41 8B 49 75 1C AB 07 65 44 D7 56 AE 30 CA 07>)
(   2,<2005-05-19 14:42:27.29 +100>,<MAYBRIDGE\NMR>,<NMR_250MHZ>,
      <Start of raw data processing
       ef LB = 0.3 FT_mod = 6 PKNL = 1 SI = 32K 
       data hash MD5: 32K
       0B A8 88 A3 AB B4 66 47 78 6F 01 BC A3 B5 5F 7A>)
(   3,<2005-05-19 14:42:29.34 +100>,<MAYBRIDGE\NMR>,<NMR_250MHZ>,
      <apk 
       data hash MD5: 32K
       66 CA 76 3C BE 5D F7 E2 F7 57 18 13 FD 9B 3E 45>)
(   4,<2005-05-19 14:42:30.79 +100>,<MAYBRIDGE\NMR>,<NMR_250MHZ>,
      <abs ABSG = 5 
       data hash MD5: 32K
       3E 69 8D A5 1F B4 A6 0B 2D 74 3D 3A 29 B0 FC 8F>)
$$ ##END=
$$ 
$$ hash MD5
$$ BB CC BE 89 73 92 04 26 73 B8 0A 32 96 18 EF 46
##$RELAX= 
##$RELAX= 
##$RELAX= 
##$RELAX= 
##$RELAX= 
##$RELAX= 
##$RELAX= 
$$ Bruker specific parameters
$$ --------------------------
##$DU= <C:\u>
##$EXPNO= 3190
##$NAME= <ADRS>
##$PROCNO= 1
##$TYPE= <nmr>
##$USER= <dgb>
##$AMP= (0..31)
100 100 100 100 100 100 100 100 100 100 100 100 100 100 100 100 100 100 
100 100 100 100 100 100 100 100 100 100 100 100 100 100 
##$AQSEQ= 0
##$AQ_mod= 3
##$AUNM= <au_zg>
##$AUTOPOS= <52 >
##$BF1= 250.13
##$BF2= 250.13
##$BF3= 250.13
##$BF4= 250.13
##$BF5= 500.13
##$BF6= 500.13
##$BF7= 500.13
##$BF8= 500.13
##$BYTORDA= 1
##$CFDGTYP= 0
##$CFRGTYP= 5
##$CHEMSTR= <none>
##$CNST= (0..31)
1 1 145 1 1 1 1 1 1 1 1 1 1 1 1 1 1 1 1 1 1 1 1 1 1 1 1 1 1 1 1 1 
##$CPDPRG= <>
##$CPDPRG1= <>
##$CPDPRG2= <>
##$CPDPRG3= <>
##$CPDPRG4= <mlev>
##$CPDPRG5= <mlev>
##$CPDPRG6= <mlev>
##$CPDPRG7= <mlev>
##$CPDPRG8= <mlev>
##$CPDPRGB= <>
##$CPDPRGT= <>
##$D= (0..31)
0 1 0 0 0 0 0 0 0 0.06 0 0 0 0 0 0 0.0002 0 0 0 0 0 0 0 0 0 0 0 0 0 0 
0 
##$DATE= 1116510130
##$DBL= (0..7)
120 120 120 120 120 120 120 120 
##$DBP= (0..7)
150 150 150 150 150 150 150 150 
##$DBP07= 0
##$DBPNAM0= <>
##$DBPNAM1= <>
$$ [...]
##$SUBNAM7= <"">
##$SUBNAM8= <"">
##$SUBNAM9= <"">
##$SW= 20.6930455092707
##$SWIBOX= (0..15)
0 0 3 0 0 0 0 0 0 0 0 0 0 0 0 0 
##$SW_h= 5175.983436853
##$TD= 65536
##$TD0= 1
##$TE= 295.16
##$TE2= 300
##$TE3= 300
##$TEG= 300
##$TL= (0..7)
0 120 120 120 120 120 120 120 
##$TP= (0..7)
150 150 150 150 150 150 150 150 
##$TP07= 0
##$TPNAME0= <>
##$TPNAME1= <>
##$TPNAME2= <>
##$TPNAME3= <>
##$TPNAME4= <>
##$TPNAME5= <>
##$TPNAME6= <>
##$TPNAME7= <>
##$TPOAL= (0..7)
0.5 0.5 0.5 0.5 0.5 0.5 0.5 0.5 
##$TPOFFS= (0..7)
0 0 0 0 0 0 0 0 
##$TUNHIN= 0
##$TUNHOUT= 0
##$TUNXOUT= 0
##$USERA1= <user>
##$USERA2= <user>
##$USERA3= <user>
##$USERA4= <user>
##$USERA5= <user>
##$V9= 5
##$VALIST= <valist>
##$VCLIST= <CCCCCCCCCCCCCCC>
##$VD= 0
##$VDLIST= <DDDDDDDDDDDDDDD>
##$VPLIST= <PPPPPPPPPPPPPPP>
##$VTLIST= <TTTTTTTTTTTTTTT>
##$WBST= 1024
##$WBSW= 4
##$XGAIN= (0..3)
0 0 0 0 
##$XL= 0
##$YL= 0
##$YMAX_a= 271759
##$YMIN_a= -239929
##$ZGOPTNS= <>
##$ZL1= 120
##$ZL2= 120
##$ZL3= 120
##$ZL4= 120
##$ABSF1= 16.45402
##$ABSF2= -4.239153
##$ABSG= 5
##$ABSL= 3
##$ALPHA= 0
##$AQORDER= 0
##$ASSFAC= 0
##$ASSFACI= 0
##$ASSFACX= 0
##$ASSWID= 0
##$AUNMP= <proc_1d>
##$AZFE= 0.1
##$AZFW= 0.1
##$BCFW= 0
##$BC_mod= 0
##$BYTORDP= 0
##$COROFFS= 0
##$CY= 12.5
##$DATMOD= 1
##$DC= 0
##$DFILT= <>
##$DTYPP= 0
##$F1P= 14.0000005364418
##$F2P= -0.99999901652339
##$FCOR= 0.5
##$FTSIZE= 32768
##$FT_mod= 6
##$GAMMA= 0
##$GB= 0
##$INTBC= 1
##$INTSCL= 1
##$ISEN= 128
##$LB= 0.3
##$LEV0= 0
##$LPBIN= 0
##$MAXI= 10000
##$MC2= 0
##$MEAN= 0
##$ME_mod= 0
##$MI= 0
##$NCOEF= 0
##$NC_proc= -4
##$NLEV= 6
##$NOISF1= 0
##$NOISF2= 0
##$NSP= 0
##$NTH_PI= 0
##$NZP= 0
##$OFFSET= 16.45402
##$PC= 1
##$PHC0= -72.63507
##$PHC1= 11.67414
##$PH_mod= 1
##$PKNL= yes
##$PPARMOD= 0
##$PSCAL= 4
##$PSIGN= 0
##$REVERSE= no
##$SF= 250.130017003716
##$SI= 32768
##$SIGF1= 0
##$SIGF2= 0
##$SINO= 400
##$SIOLD= 32768
##$SREGLST= <1H.CDCl3>
##$SSB= 0
##$STSI= 32768
##$STSR= 0
##$SW_p= 5175.98343685301
##$SYMM= 0
##$S_DEV= 0
##$TDeff= 65536
##$TDoff= 0
##$TI= <Analysis number 999999
Compound Code 99
Book Reference 9
Project Code 9>
##$TILT= no
##$TM1= 0
##$TM2= 0
##$TOPLEV= 0
##$USERP1= <user>
##$USERP2= <user>
##$USERP3= <user>
##$USERP4= <user>
##$USERP5= <user>
##$WDW= 1
##$XDIM= 32768
##$YMAX_p= 460718383
##$YMIN_p= -434012
$$ End of Bruker specific parameters
$$ ---------------------------------
##NTUPLES= NMR SPECTRUM
##VAR_NAME=  FREQUENCY,     SPECTRUM/REAL,   SPECTRUM/IMAG
##SYMBOL=    X,             R,               I
##VAR_TYPE=  INDEPENDENT,   DEPENDENT,       DEPENDENT
##VAR_FORM=  AFFN,          ASDF,            ASDF
##VAR_DIM=   32768,         32768,           32768
##UNITS=     HZ,            ARBITRARY UNITS, ARBITRARY UNITS
##FACTOR=    0.157963299565203, 1,           1
##FIRST=     4115.64418894772, 0,            0
##LAST=      -1060.33924790529, 0,           0
##MIN=       -1060.33924790529, -434012,     0
##MAX=       4115.64418894772, 460718383,    0
$$ Real data points
##PAGE= N=1
##DATA TABLE= (X++(R..R)), XYDATA
$$ [...]
28866 -220809 -231879 -134205 -48138 -8644 -71320 -50713 -120117 -16980 -6669 50712 67196
28855 67196 4077 -158022 -234374 -190557 -66771 -66622 15249 85521 16877 -15439 -15167 20459
28843 20459 -7196 -37235 -12889 45049 114409 173347 176278 162706 156655 87946 5742 31022
28831 31022 -13241 49329 133350 113880 177336 104028 47485 -70737 -187004 -137009 24363
28820 24363 -2499 -92789 -185096 -251922 -200828 -101163 74532 106073 73104 67114 31118 -47298
28808 -47298 13110 27289 -43924 -153302 -185754 -167558 -176036 -122587 -33833 55260 64397 -55023
28796 -55023 -58165 -14810 -41984 -124556 -45658 -93180 -135576 -70024 -59638 -14698 -5653 30545
28784 30545 49093 -37031 6347 141533 58407 -62526 -70448 -42381 -96455 -30695 -76434
28773 -76434 -54900 -70440 -48018 -40549 -66347 -66509 -116560 -135471 57172 224481 195356 175186
28761 175186 162686 114833 39186 -989 12390 12771 -91343 -159909 -184312 -120684 -19788
28750 -19788 116336 58740 -88422 -87589 -170657 -162561 -47624 60065 113078 179049 136652
28739 136652 28907 -73223 -113554 -93269 -77373 -38019 -69875 -55046 -106777 -76568 -58140
28728 -58140 -8034 26909 -12624 36047 64636 77635 28249 -32051 25281 162382 189641
28717 189641 169637 100608 16979 -61890 7776 -8413 61366 81884 -24773 -72106 -97108
28706 -97108 -178857 -220028 -146322 -74160 7590 36725 77337 92394 -7957 -52382 -69636
28695 -69636 -62876 -31877 50954 47286 -22585 -32425 3929 -4630 -92328 -36495 -83 -20777
28683 -20777 13276 -26703 24700 62725 -55879 -205438 -226678 -135300 120015 122921 121241
28672 121241 180958 73144 -35868 -73983 -19020 3483 52098 83283 45066 -32393 -94779
28661 -94779 -125353 -145818 -146794 -159679 -58429 -40210 -48582 34431 117560 195162 203847 183260
28649 183260 79088 -15329 80397 81719 139701 154702 95366 58526 -13055 74646 90848
28638 90848 87932 31805 77174 41373 26849 81814 21965 -95107 -74388 -82098 -19696 89496
28626 89496 274439 260087 327421 295659 238208 246982 226228 262639 260064 213134 186753 138177
28614 138177 36381 24913 7219 -105036 -188892 -168310 -180240 -56091 -100518 -268527 -237990
28603 -237990 -175709 19491 87852 24787 -109464 -207052 -164643 -190538 -187808 -114019 12725
28592 12725 -56608 -2417 123362 110943 6604 -102060 -65442 -170299 -120910 -104322 -38384
28581 -38384 -107707 -32559 48194 11085 14966 -96524 -158778 -100276 -102803 -75187 -861 42579
28569 42579 6427 -34077 8555 -6753 79375 105186 -35283 72158 46867 42024 122924
28558 122924 142798 47117 85757 120885 60445 -23349 -54175 -33145 -69279 -48425 1850
28547 1850 17947 40740 -59983 -65841 -116552 -82991 -20643 47820 -36233 -102157 -74169 25120
28535 25120 75537 170446 205028 160096 142699 88967 119684 11946 -114829 -176626 -271545
28524 -271545 -159931 -149115 -88459 99779 178155 196095 167520 116770 -61060 -78757 1602
28513 1602 -21143 -112870 -188711 -185396 -91874 14312 43680 21382 -11451 -59358 -166742 -194409
28501 -194409 -138177 -26675 31132 94697 136580 85780 117691 244097 235603 104108 -27560
28490 -27560 -64239 -44661 -94539 -104939 -25447 52740 -11318 -10918 96045 155446 144723 117039
28478 117039 73359 56854 -75937 -198979 -119386 -48356 -26909 -57898 -37416 926 41028
28467 41028 -38739 -125128 -123119 -37467 43508 8558 54118 30829 62280 2206 65597 99059
28455 99059 109479 72930 170551 174025 54019 32266 40433 31715 72959 40995 -52187 -44485
28443 -44485 -46920 -75085 -10013 193060 167898 15104 -52383 -68577 -96725 -142280 -270769
28432 -270769 -327223 -192023 -79227 -60304 -109561 -83886 -74123 -72073 -85191 -45590 54526
28421 54526 87952 70894 -68561 -81257 -20090 -20178 -47698 -47362 -39824 -101322 -103787 -45441 -86994
28408 -86994 -141005 -114941 -24386 -89932 -159911 -178160 -98717 -4665 -62688 -37427 34252 127217
28396 127217 137226 56008 3868 -11710 -56166 -83367 -26526 1106 51347 181046 138165
28385 138165 61844 41101 -29936 -39661 -20450 -38289 -72756 -174917 -337248 -247897 9986
28374 9986 57029 -24495 -46607 68954 222573 221927 223145 229138 43266 -2000 -26992 -28973
28362 -28973 -24844 -56580 -115039 -58348 -343 138663 142406 131297 -65482 -175728 -119016
28351 -119016 -164197 -139088 -118544 5513 33789 32248 10286 49728 -4421 -61628 19655
28340 19655 -328 -17647 161255 128369 -53231 -87879 -47712 -67927 -16843 63357 153758
28329 153758 91722 -17307 -92213 -136728 -87153 -41677 -41258 7320 26987 -10986 -120657
28318 -120657 -124386 16885 -3418 -40322 5066 60707 3730 -22104 3500 -8806 -119887
28307 -119887 -51394 -30017 43618 133849 139319 96367 36934 167248 130895 96789 111292
28296 111292 124496 165776 205215 168921 87187 123241 121784 4753 -50716 -45330 -18553 35971
28284 35971 64579 -42123 -50497 -30958 -107964 -122029 -57883 1440 3586 -51752 -31791 -63917
28272 -63917 -92011 -1636 121852 89686 12484 16174 64980 132177 75897 63663 41834 -79465
28260 -79465 59485 33240 -36993 118411 20548 -161337 -120044 -38809 -11996 -43912 -44943
28249 -44943 13666 121819 227145 264088 280352 135754 74088 97710 33021 -41486 -60400
28238 -60400 -3726 24460 -91233 -68899 -58289 -137523 6824 49021 46312 74879 98946
28227 98946 52354 10565 1588 7137 137670 133925 23482 22934 -75560 -162697 -115894 62108
28215 62108 64181 2034 42731 -1911 -54297 -42611 -44615 -80694 -48482 -9100 -56343 -65986
28203 -65986 -63145 -49896 -46883 -151763 -157038 -98961 -116942 -211583 -181043 -161161 -159303 -163921
28191 -163921 24683 122005 8352 16769 -14824 -33396 22502 -53310 -73216 95948 140729
28180 140729 146228 130225 124988 38851 32128 49019 40186 60624 42475 -2327 108771 205076
28168 205076 90307 -53194 -80345 -70377 -85634 -68883 68651 89694 7155 21771 56999
28157 56999 135098 111826 187462 101642 -30518 7528 -26043 -59665 -191332 -126910 -10782
28146 -10782 13752 62201 75309 60366 83762 -9099 -109795 27929 129225 66161 9950
28135 9950 34760 37158 127539 142785 39581 -72104 62119 -48622 -183659 -142716 -22293
28124 -22293 -104987 -121280 -123118 -96443 -135771 -102885 21601 62011 3029 -58404 -100859 -117252
28112 -117252 -168341 -198521 -228412 -125891 -100438 -151451 -192768 -262497 -242059 -107706 -34378
28101 -34378 7373 131365 254771 165572 163551 76967 90137 255845 289764 244227 219285
28090 219285 127375 9838 12118 50278 129050 189712 146105 87024 15012 -56167 33574
28079 33574 151586 148745 6652 -9386 -57908 -68020 67756 116589 148720 64818 54913
28068 54913 98778 123686 86132 15942 -31302 -78407 258 39404 99089 155312 111768 154955
28056 154955 152834 72388 -35675 131485 110948 7738 69671 41764 56417 91455 38595
28045 38595 54972 48331 11636 22157 55374 158263 269688 226076 95697 70602 53144
28034 53144 87112 49737 55429 100308 128692 210969 142339 71592 61547 110122 130090 33091
28022 33091 -114551 -54790 86299 117816 27802 16596 -74202 -157003 -89020 -54643 -95807
28011 -95807 -119854 -224595 -64194 13397 134713 -25287 -204799 -252512 -192047 -158320 -189444
28000 -189444 -231565 -191811 -145144 -163293 -170508 -60873 41077 290721 251299 136910 84590
27989 84590 -79990 -184894 -195851 -102572 34712 -70311 -136304 -94717 -36081 -31718 -10511
27978 -10511 54751 128831 47198 -18743 -16584 -17014 25005 9533 -86134 152909 231195 143347
27966 143347 68888 1050 -41538 -23937 -119489 -9785 36240 69240 24391 16621 72779
27955 72779 40915 -21277 865 -33592 -47770 1440 -42497 9673 57479 90618 -8235 29507
27943 29507 82721 76968 67812 28944 1307 -77191 -25733 -1761 -39614 -110503 -114298 -104327
27931 -104327 -181712 -340691 -215831 -109896 -113362 -172059 -138576 -98176 -50990 -73830 -147046
27920 -147046 -120295 -137559 -132115 -127943 -172282 -134028 -119410 -221101 -120757 -91005 -178914
27909 -178914 -126042 -158627 -236585 -273097 -23512 190638 168714 -56581 -203330 -131784 31208
27898 31208 126799 150863 64887 153531 337165 382209 292892 64440 -19008 -38774 -16577
27887 -16577 188521 143999 108509 31527 58308 18837 45670 65197 44352 65705 6687
27876 6687 -19265 82976 105418 77965 4936 -19427 50515 62476 49656 -81042 -124020
27865 -124020 -78960 -24630 93938 129623 22011 -101332 -164994 -147680 -134874 -210062 -200130
27854 -200130 -13444 47577 139008 125462 -1579 -79453 -18677 5153 -22254 -30242 4587
27843 4587 -35532 -18354 117219 67324 -88899 -41118 -46316 -67520 -44777 -26276 -37709 -119025
27831 -119025 -136859 606 96026 129284 75739 102713 11790 -11526 24782 132757 69554
27820 69554 22458 -23303 86308 198161 115930 83132 17202 38162 -19703 -29913 -65613
27809 -65613 23452 53018 16380 75316 170568 93420 109353 95133 74095 34404 -84567
27798 -84567 -7796 22245 -74240 -126608 -21408 68733 69789 -1403 -67993 -29254 -47748 75169
27786 75169 190048 166760 63733 -75901 -57161 37949 73291 -14101 11009 -40823 -84210
27775 -84210 -98460 -60764 1109 18292 74056 53857 85763 116999 110441 44296 -129223 -19072
27763 -19072 58765 32711 58400 36873 -14436 -95230 -28583 42567 47817 62229 52775 -92990
27751 -92990 -102267 -16043 -40085 59381 97981 31708 106651 88773 17583 11511 -78701 -12020
27739 -12020 134371 204804 206802 154900 174365 178259 80272 25872 29585 -52466 105490 219538
27727 219538 96216 121226 200037 170723 173985 218171 262768 151958 73006 -18790 -64112
27716 -64112 12022 -28714 -80064 -108937 -115284 -137093 6245 96175 151727 -10709 -65599
27705 -65599 -77963 -102203 -175763 -247427 -332056 -215951 -212254 -117022 -101782 -47254 5390 78325
27693 78325 122890 213514 226461 28396 35260 7540 -36295 -6253 33987 156017 226634
27682 226634 150195 168581 84663 -12681 6631 106900 217905 291061 178605 2515 -28076
27671 -28076 -153754 -130539 -52409 -66464 -184658 -145830 16354 156105 183173 130086 136512
27660 136512 11055 75870 154255 140473 138456 83586 40794 58511 59488 111875 6691 -71999
27648 -71999 -98226 -98962 -100936 -61587 -55927 -21868 90894 165895 161025 66366 -51674 -73483
27636 -73483 -118259 -149786 -141487 -291657 -332379 -266348 -145786 7258 115219 -18926 -79799
27625 -79799 -121195 -151924 -132786 -92057 28895 70057 21232 18013 8723 -6405 1117 -14901
27613 -14901 11701 -26554 37968 8978 -57879 -129814 -120235 -82622 -50056 18576 -21178 30602
27601 30602 43797 3518 62520 103174 136032 68387 -25748 -46259 -66844 -32127 5780 92606
27589 92606 26887 -172579 -159662 -103587 -106223 -61399 -58426 -108440 -72651 6070 20962 37401
27577 37401 30141 110192 111538 127845 102694 111922 155969 117157 168525 165082 127221 76044
27565 76044 102401 32114 50621 126342 58160 -23797 41793 28401 63019 112151 190257 272585
27553 272585 238764 122372 99156 53566 -94930 -99837 32996 138884 87414 -63308 -65865
27542 -65865 -36213 69643 85868 102077 -1589 43865 130686 44649 -65436 -55588 -101628
27531 -101628 -45047 1116 -29373 -42050 -77214 7966 103186 113880 42883 35393 43190 29056
27519 29056 26319 27707 9730 -47660 -83122 -70831 5225 59307 39389 -40367 -28734 20106
27507 20106 115716 123013 143882 90282 -59784 6600 41556 -31962 -101084 83784 123671
27496 123671 29332 -850 51812 47571 98789 202559 102805 -81844 -140401 -61549 -38080
27485 -38080 -45188 4199 17612 -74029 -25888 31651 25799 -40645 -78846 38217 110052 20053
27473 20053 -8892 65257 100667 59348 9017 -52371 -79503 -85307 -115250 -5321 98952
27462 98952 127177 61662 35634 -9503 -91737 -44892 10420 -78438 -50889 -58389 -55804 -62364
27450 -62364 -67946 -71382 -154599 -152701 -110615 -102786 5992 77250 133051 164854 138903 26187
27438 26187 -84325 -125675 -196989 -216600 -129377 -4090 66952 -15368 55875 125757 151323
27427 151323 26437 -75432 17486 -19938 9212 126262 114648 17639 -57040 -68092 -60864
27416 -60864 31824 58888 63529 80859 85671 145142 42758 -8656 -36542 53733 161881 -14421
27404 -14421 -131676 -175413 -145273 -72052 -103581 -144474 -149944 -115023 47919 154610 94714
27393 94714 66756 72228 109495 152098 124165 229963 221049 41530 -53835 -125174 -139023 -116485
27381 -116485 -31029 -53342 -65107 118226 180909 171122 124470 160557 82020 30385 -10830
27370 -10830 34876 108851 45263 70531 50067 31609 35948 9015 -4445 43123 20467 36790
27358 36790 -30751 -187936 -146190 -103515 -170122 -201396 -212618 -103767 -36818 -16631 -44305
27347 -44305 -116555 -181067 -118604 -29657 2393 -123577 -204679 -147732 -128299 -134543 -133963 -36335
27335 -36335 16507 -24166 -134614 -127439 -46029 19304 -28011 -96857 53186 78653 25889
27324 25889 61621 50384 -91392 -164435 -129089 -76779 107526 150894 126545 9358 -149045
27313 -149045 -246526 -154909 -66508 82505 126820 92612 100902 39740 103831 150891 128654
27302 128654 96864 125059 28550 -66232 -115374 -111393 4954 122681 134381 85915 110917
27291 110917 167210 133086 144756 168193 88295 -7591 53077 39762 36729 74818 56084 92663
27279 92663 -39726 -17120 -45595 17017 3667 -28162 -83863 -212341 -205648 -126010 -64898
27268 -64898 -97837 -161445 -168429 -172488 -249401 -272227 -196673 -103570 -50898 -19328 16412 103808
27256 103808 26273 -100329 -79933 -85058 -133969 -29157 131937 129742 -2955 -89261 -85361
27245 -85361 46804 66164 5343 -41106 -65747 804 48827 67029 -26987 3190 124156
27234 124156 31105 -58485 -63872 79211 182406 160405 136072 -6053 23581 96071 81086
27223 81086 147802 170498 204141 130153 9641 22039 61705 23809 -27131 -176339 -231138
27212 -231138 -50046 -1114 102698 138552 86914 59369 21868 -76701 43766 198353 269403
27201 269403 113489 -55895 37484 128239 181836 99318 -69996 -180853 -159793 36893
27191 36893 151011 73512 95131 25391 11423 94048 154036 120927 28089 23030 -9255 -92182
27179 -92182 4880 117149 100677 102363 134546 58356 152679 8941 -76993 -80572 -134130 -197999
27167 -197999 -74241 -59949 -98024 -175357 -69144 51997 57898 121064 169788 130305 174801
27156 174801 250575 251857 96062 -45997 -63054 -6019 80676 115348 41341 34238 -69674
27145 -69674 -139018 -97436 48255 123905 154425 131267 36820 160102 87002 79798 71627 -4465
27133 -4465 20297 21758 102950 90355 69657 53720 -44106 -105105 -108712 -82927 42290 -28601
27121 -28601 -16044 -111214 -235280 -325971 -175998 -91316 -61551 -154507 -137290 -207897 -179824
27110 -179824 -83511 -33742 -9977 -46261 -111222 -16886 -61670 -59174 -55777 -126900 2584 -37470
27098 -37470 14820 39082 -55080 608 -32046 -31225 24403 7271 5524 59145 115039 169895
27086 169895 177055 99476 84023 88749 33633 -22344 -119475 -99827 -31445 -29622 24645 57600
27074 57600 34110 -53895 -79690 -99138 -109668 -90320 -71205 -90958 -194749 -134241 -108477
27063 -108477 -64580 -7470 71650 43778 26587 -80291 -94374 6677 139111 173018 87611
27052 87611 -40575 -23056 86037 -42742 -107489 -182214 -143484 -141780 -57476 62099 45481
27041 45481 -39668 -30448 -57792 -84642 -27399 54613 48172 94775 82719 42615 -7738 -83865
27029 -83865 -148333 -210925 -137310 67945 21741 -2106 9778 59538 119503 94086 47386
27018 47386 -40606 -103534 -162276 -158427 -36339 -12122 36856 33498 16670 -9396 -51349 -120796
27006 -120796 -146715 -97041 -83456 -83165 -107363 -180480 -121547 -57170 -205400 -293267 -267689 -207717
26994 -207717 -213484 -185156 -150826 -163009 -86144 57287 65793 39036 -76328 -99879 -61837
26983 -61837 -17858 -15490 -83859 -87214 -64932 -12047 90246 73664 -58237 -76477 5130 43823
26971 43823 18526 -39021 -60571 -68673 -105799 -160521 -220291 -165141 -43278 -42584 -51324 9062
26959 9062 8156 -12948 54556 139107 147268 -1602 -63164 -77938 -119234 -14305 614 -145895
26947 -145895 -251864 -307570 -287444 -249826 -87717 51700 132454 168691 166006 119436 52269
26936 52269 27928 86888 97774 146439 186644 101066 34876 589 -15921 -66233 -175050
26925 -175050 -91294 -97732 -131806 -85827 -36532 42396 53185 1146 113938 170721 64825
26914 64825 60220 68413 -17651 -10898 50604 123969 165603 107338 -47191 -146518 -113060 -197494
26902 -197494 -145799 -15036 60238 112241 51245 -2778 126953 135062 23591 -18495 2268
26891 2268 56786 38754 -53375 -148978 -206298 -135509 -94722 -119157 -9135 124350 99292
26880 99292 140549 73548 102750 127914 177441 181992 220619 210828 161072 169226 263916 119574
26868 119574 151167 137166 152726 123319 93767 80276 99150 145396 85721 72842 -45351
26857 -45351 -37314 -11315 -14709 -12663 35404 8308 103171 200102 234934 245420 216860 150654
26845 150654 114353 164835 151124 36695 -44365 -58888 -31585 -14653 38129 -60676 -170942
26834 -170942 -178033 -65034 -84424 -74474 32554 47825 -29764 8871 99611 287092 146151
26823 146151 44996 6999 41416 143650 142666 96956 -34926 -179037 -267419 -104222 84748
26812 84748 99981 42523 -25233 3335 51284 57976 83112 74106 56481 -30722 -25617 -41806
26800 -41806 -136709 -148211 -180469 -114256 -45058 -65616 -53677 -73586 -145083 -96740 11720
26789 11720 72176 36062 -43379 74122 224300 191965 163827 161402 172200 160666 162011 141211
26777 141211 161323 85633 -31342 -116618 -95703 -140520 -147829 -70463 30652 65959 -5785
26766 -5785 -53949 -78900 -80293 -177197 -140944 -43657 131879 101551 135114 125749 145064 197266
26754 197266 203430 171503 144143 158266 177748 89146 -70082 -169850 -175103 -154039 -81149 -60984
26742 -60984 -101655 -128929 -40381 97669 73531 -430 24708 12292 19080 47703 64608 -28861
26730 -28861 -56991 -82512 -122759 -23132 -41050 -125608 5431 44277 25718 11525 -14438
26719 -14438 -87723 -243396 -219473 -141832 -62747 -42128 95553 216060 269795 319633 230910
26708 230910 30845 -169315 -173685 -140243 -149889 -7229 -37770 -57994 67466 20826 -71555
26697 -71555 -76368 -117431 -54238 -11097 -23762 -19371 -150233 -148336 -75138 -96493 -35644 -3947
26685 -3947 -175307 -197311 -217268 -192173 -101185 -8570 11885 25649 -18433 265 -151039
26674 -151039 -281178 -228235 -221872 -240397 -277536 -177124 -117998 -176316 -145532 -111639 -42764
26663 -42764 91997 167247 -12938 -81939 -97890 -104386 -57254 37098 65701 122349 175335
26652 175335 135616 80138 133424 105120 142531 46021 -23397 -90451 -120450 -129047 -141722 -125847
26640 -125847 -170411 -132596 -68869 68918 115905 -5715 49206 172130 162834 154086 94472
26629 94472 -15156 -34303 20978 -5493 73521 87781 -5579 -101297 -109441 -33318 -39402 -71910
26617 -71910 -102514 -115412 751 117190 197817 155235 -9071 -50705 -143835 -201216 -160058
26606 -160058 -80534 -76336 -10112 57169 137551 130420 140531 153738 92895 -79760 -112538 14534
26594 14534 5773 34441 99978 168049 140172 42567 -85430 -57967 15377 84802 29915 -24942
26582 -24942 -135738 -117274 -155483 -204172 -237327 -145477 -129142 -51950 28835 42975 -51624
26571 -51624 -77767 -126971 -209427 -189007 48167 142988 60775 40235 -14654 -40586 8064
26560 8064 -9208 -43832 -169229 -101073 -103253 -180254 -223902 -144415 -76376 38677 -32896 -108747
26548 -108747 -76558 -91378 -10250 -52568 -122586 -196564 -189395 -231041 -199632 -76572 -15467
26537 -15467 30250 -25466 -66951 -106411 -142933 -189260 -103413 -20283 -100044 -104358 -128548 -51814
26525 -51814 114209 163430 209144 233192 131336 22336 47317 7460 25482 29139 47984
26514 47984 43541 132193 163402 71722 -49605 -51637 2722 39447 39071 55024 41720 -63238
26502 -63238 -43741 1675 49763 62426 120899 189178 143542 92429 133447 107135 56382 -59817
26490 -59817 -117249 -127799 -93553 -10695 -26176 17064 -42992 18032 58343 -24401 3696 88980
26478 88980 12730 -21068 85918 119940 44536 77854 77839 209573 239749 166085 51607 20400
26466 20400 289 -20864 -137648 -86119 -16437 -40920 48578 166616 126097 28282 -13036
26455 -13036 -9391 -150267 -130383 -84219 -92243 -163072 -137757 -128210 -115754 -150535 -119912 -25309
26443 -25309 -18342 -3675 -21230 28486 -4546 62834 58947 -14779 74688 156257 114560 60944
26431 60944 1169 30425 50954 58422 122410 56085 93965 31919 -37944 -116693 -73678 -84824
26419 -84824 -111542 -109273 -7719 -14282 -51252 -144532 -162332 -11850 167883 111522 -758
26408 -758 87963 112936 150835 250701 170465 129730 5305 -85249 -187039 -215492 -223050 -218615
26396 -218615 -126863 -86009 -73546 -87794 -113687 -20133 30764 4414 -91389 -142402 -125069
26385 -125069 -172785 -222995 -195222 -155317 -106249 -73638 12698 91742 1399 -45669 -28849
26374 -28849 -583 29278 127200 212417 209864 225521 176706 71482 11670 87536 179977 135280
26362 135280 -14479 -23147 53019 112942 130455 99652 -37809 -108946 -96880 -71644 -42981
26351 -42981 29269 49988 123105 53348 7546 -5399 163064 289023 214021 94783 90879
26340 90879 5097 -52829 -90722 -69889 -22619 23328 -32579 -90229 -19701 4301 -77977 -59504
26328 -59504 7524 -25217 -77475 -41826 47402 21074 -50194 -12863 31104 103489 185460 130453
26316 130453 25092 17228 143518 198506 125590 5440 1554 87382 62265 158878 146167
26305 146167 94975 15836 17987 40879 35775 17732 84914 190643 121536 89866 153595 86020
26293 86020 146234 193396 190383 64716 -56132 -95179 -71681 -94016 -102865 -192472 -73878
26282 -73878 56651 108395 67629 -35217 82790 109745 18923 -98994 -149823 -207517 -168514
26271 -168514 -52516 20958 55874 182112 176563 44617 -16150 -26642 -96093 -148914 -150064
26260 -150064 29378 187992 305001 170917 97813 -38570 -46060 -99861 -26862 59690 -42376
26249 -42376 -77221 -113959 9429 81190 140689 73528 42123 -33885 11033 -43028 -140580
26238 -140580 -125844 6578 10987 -68747 -75633 -32764 60049 -5818 -4053 36382 73153 63850
26226 63850 150460 190461 215586 93058 35444 6909 -12726 -122693 -138929 -104725 -84570
26215 -84570 -122845 -184177 -188049 -79928 -50317 -141835 -67730 -36273 1293 -15932 -102983 -84098
26203 -84098 -72918 -39896 7276 94301 91335 97996 21244 -53866 -32321 -69217 -151735 -92510
26191 -92510 -6922 9794 47847 -85587 -166667 -146530 -60193 35219 120428 161685 46914
26180 46914 -69641 -68120 30823 133380 34963 -127471 -116824 -110877 -40834 -77471 -3258
26169 -3258 77109 77084 168304 260117 160155 44811 -48755 -156333 -134845 17258 86566 36357
26157 36357 114416 25758 13363 54493 12877 -47085 63289 11256 16755 54343 -28558 12826
26145 12826 119306 140029 119014 69297 -12012 -36774 61654 197359 339287 352938 251019
26134 251019 59705 -44630 597 -17172 18663 3441 -14403 -16625 68845 95078 21580
26123 21580 -25512 -32989 42337 -31285 -112158 -87062 -76764 674 110462 60322 -6843 6679
26111 6679 -63894 -153699 -39067 20776 16174 151360 179361 63440 -14545 -13045 110171
26100 110171 136842 46854 -62434 -147375 -90019 3401 679 -111614 -164733 -125125 -46437
26089 -46437 -26058 18354 70366 89489 52473 54172 -14752 -88271 -106699 -57709 -73536 -99995
26077 -99995 30926 -10754 -80534 -197892 -170168 -90514 -75657 -177593 -173796 -124492 -66846
26066 -66846 -30885 -70881 -124415 -99146 -100630 -137984 1821 89471 170947 170470 95170 196208
26054 196208 241559 128723 -1998 -25115 11492 -45648 -74489 -64643 23192 48744 116859
26043 116859 59201 7910 89027 40752 -60449 4178 81574 105296 186980 172263 32360
26032 32360 -36281 -13218 -67654 -44920 -10927 -59663 -95845 -60283 7065 -25368 55313 71491
26020 71491 76702 106618 88627 113189 57034 37870 38926 86706 99098 50641 -13026 44487
26008 44487 99607 48910 -70180 -132497 -152157 -70020 -76361 -223090 -192028 -162332 -156067 -132606
25996 -132606 -203293 -181641 37608 108614 76968 48826 -10801 -119097 -99297 -58817 -98952
25985 -98952 -117252 -53981 -75850 -144035 -294135 -394602 -320192 -126132 34307 46876 -12251
25974 -12251 -56839 12254 -224 -7234 -72982 -139516 -62657 46023 -14275 -22087 -90567 -95287
25962 -95287 -32153 -4494 13684 67057 70492 71141 -54808 -17945 -12326 44040 12699 -6919
25950 -6919 -36576 5798 29675 -21243 46536 222047 233355 204331 169781 58275 -81829
25939 -81829 -149193 33160 59206 28332 64961 152966 142952 103622 51491 64671 17921
25928 17921 -144763 -184811 32000 70889 -26995 -84430 -114774 -62417 -79616 -96784 18437
25917 18437 78015 -47464 -71693 -34015 -42685 75518 -33805 -189976 -46682 11096 30438
25906 30438 -942 -7854 44085 49767 69819 148015 281102 156383 89445 83392 98782 115976
25894 115976 76450 -14682 -104261 -107853 -102358 -107077 -123263 -109313 -105723 -102709 -93829 29935
25882 29935 -18634 -62520 14904 59903 166233 102113 -63932 -21674 -56083 -177920 -216645
25871 -216645 -202560 -210459 -122845 1825 -8857 -152579 -64616 11692 90003 91344 42147
25860 42147 66558 87528 13098 -198914 -225861 -132716 -31579 122061 65808 -49360 -83280
25849 -83280 29573 16471 -72340 32831 76404 82721 120437 49121 53258 95108 36027 53634
25837 53634 -79019 -77105 -32532 3188 -27420 -7628 -20800 -27552 -53904 -102367 -80912 72241
25825 72241 180010 231279 181405 111031 94208 720 -64426 -30872 -22988 -22410 -10662 85711
25813 85711 52412 59418 164105 268186 198200 104226 82026 110436 140420 83514 39832
25802 39832 -77541 -126189 -41293 122746 116029 95006 200716 143829 158694 71721 -93124
25791 -93124 -143929 -122089 -83623 -53533 -9510 98449 -36956 -57668 121549 145060 -7531
25780 -7531 -23905 -56777 -51196 44703 18294 69795 118881 181988 60041 21093 28055 -12935
25768 -12935 64629 14854 -67990 -16841 84317 99649 53929 -32162 -45479 -78263 -70159 -8233
25756 -8233 92257 8867 -45843 -96988 -169214 -168302 -194579 -231187 -169600 -115396 9103 6455
25744 6455 -22159 27242 43646 -45816 -133764 -39057 14923 -50281 -155859 -224433 -224258 -230970
25732 -230970 -231433 -122874 -34994 -67500 -171241 -188350 -273538 -176885 -102430 -11362 -25870
25721 -25870 7000 50829 -136 -78859 -30110 10866 1795 134909 167265 42077 -80636
25710 -80636 -89675 -29165 36175 -31578 -50176 -30224 -70330 -78831 -59786 -25155 12755 16295
25698 16295 743 20995 67689 25253 -5966 -30768 9304 117239 127543 130878 93025 32884
25686 32884 20163 81012 54870 60988 66967 97937 -71406 -172897 -239107 -259291 -220163 -150531
25674 -150531 -91920 9193 47316 680 49698 78927 69714 65650 64855 25072 23813 17914
25662 17914 809 -24653 63233 180201 219401 102381 17989 46280 107987 146967 23754
25651 23754 51301 115567 139454 223318 182895 70311 26822 35175 -16307 -57930 -22843 90230
25639 90230 140978 45674 67716 118266 81504 22329 -112990 -67496 -68632 -16551 -76368 -153036
25627 -153036 -125065 -57546 -82717 -110002 -84893 -37546 -40095 -70829 42109 92933 86682 20235
25615 20235 13031 19884 -29869 -20201 25144 46639 23696 62268 92222 60056 17416 67945
25603 67945 214599 249538 147268 83876 101986 -22947 -120607 -106195 -141200 -124508 -145278
25592 -145278 -94091 -33206 1895 51330 -31266 -24776 53655 12182 -11792 -2668 71152 140202
25580 140202 141865 44828 34565 19195 -91264 -16285 97800 129454 95530 -9148 13561
25569 13561 -11567 -60836 -52020 -48118 26692 45131 -36889 -92192 -45416 -24913 -40357 -41799
25557 -41799 -86340 -119500 -13237 45189 -33878 -3942 -44395 -89776 18149 -72627 -77822
25546 -77822 50164 110687 -4417 -105341 -85280 -110718 -162909 -179703 -66866 -14042 475
25535 475 44998 146398 259212 162500 155428 121501 -4343 -58468 65916 140593 67381
25524 67381 -76816 -39802 -3872 48199 4098 -108670 -124357 -106834 1808 15553 37986
25513 37986 -29326 -135930 -159349 -132575 -51335 45290 -2770 -15096 37038 73229 74019 77458
25501 77458 43886 109550 98888 44138 -23052 15139 30728 22886 -29852 -121340 -110122 31372
25489 31372 109480 97299 -20444 -3410 59263 132700 125822 196500 50091 -116964 -146717
25478 -146717 -103765 -25643 16504 39776 -26702 7829 38719 -69543 -98492 36097 51914
25467 51914 60008 95919 190210 217576 183373 67397 -107868 -201605 -213331 -216630 -254667 -199059
25455 -199059 -63583 -49474 -131448 -245075 -296898 -348335 -357233 -259182 -266814 -209317 -203057 -113313
25443 -113313 15473 62060 -49437 -60131 -10343 29596 33809 -73958 -191247 -158023 -155983
25432 -155983 -76455 -111010 -95560 -49647 -154183 -115452 -172465 -247651 -223167 -127486 -74600
25421 -74600 16150 -42872 -154719 -221851 -130931 -80678 80329 39730 33180 67922 65975 31667
25409 31667 -42007 8773 8661 113913 147086 114534 -55016 -64175 -35097 48761 8123 -56985
25397 -56985 -30475 26135 -62656 52716 1049 37170 158411 128432 187264 215885 114246
25386 114246 53825 -12274 -18282 60436 178790 164133 94344 73617 125387 11605 -91840
25375 -91840 -161430 -52757 241 74388 80997 147043 256706 248356 163561 124430 155379 144720
25363 144720 158505 97041 101219 141992 167033 159509 3318 -44526 8954 -21203 59580 14943
25351 14943 -37567 -31774 27633 50374 121443 136453 111926 -106841 -265991 -192026 -77151
25340 -77151 31428 10056 -123797 -285972 -339445 -341199 -144199 32170 833 -82639 -117187
25329 -117187 -203638 -325180 -258671 -225806 -191425 -253592 -332489 -356808 -164787 -63052 20628
25318 20628 74040 -55560 -71818 -22202 -17220 -57951 -120509 -80093 -84263 47099 24274 -71395
25306 -71395 -80974 34724 83993 -32554 -25280 39521 27104 -35993 -134767 -142548 -16545 32133
25294 32133 31641 -25675 -152421 -129550 -121035 -130869 -68536 4057 83308 62504 1478 -70424
25282 -70424 -95071 17973 63186 75572 17826 17966 -14528 -26291 -16473 -67408 -162306 -189181
25270 -189181 -140285 11885 -72000 -50018 -42668 -66472 -82069 -79863 -107977 -97549 -101598 11611
25258 11611 63125 54761 3446 14503 143183 199030 169006 49400 15366 -39964 -64076
25247 -64076 107396 142529 142619 124647 76605 -23848 -53018 -36378 -85365 -33686 38935 114416
25235 114416 88034 -34795 -30742 -55915 50855 63287 51873 56981 142678 192283 169919
25224 169919 110461 99370 53255 29067 -48358 -71597 -126029 -28326 110054 68772 -62979
25213 -62979 -1526 201002 173673 89080 110292 57808 37914 83603 86654 68439 -66410
25202 -66410 -64149 -45559 -138739 -146442 -75748 16348 -10683 -54868 4374 6191 -63221 -108360
25190 -108360 -79759 -41458 53740 122135 96315 49060 51383 121198 -6819 -169123 -160980
25179 -160980 -68419 44509 209812 138855 -455 -12848 -29758 -104436 -107619 13140 149538
25168 149538 118735 -52203 -125716 -77073 32454 89496 53813 98784 76504 -55827 -30049
25157 -30049 -20863 -156432 -245287 -115975 -127766 -161548 -117642 -85795 -158022 -80934 -96759
25146 -96759 -80233 11076 94528 47941 -74402 -105322 -48350 -205578 -253072 -91278 -114540
25135 -114540 -156952 -109402 1516 -1445 -96179 10348 75386 -72594 -114116 -206760 -152230
25124 -152230 -88397 -37406 1825 98709 108547 18885 13614 -39775 -86148 -61118 -2500 -23941
25112 -23941 -26853 48248 102654 57877 -9373 -87953 -138242 -101731 -14210 115086 171193 133549
25100 133549 63049 123313 172487 273197 148625 65138 -10287 28379 79172 105629 77204
25089 77204 22949 129071 141956 35515 -17834 112 -53163 -96060 -97918 -156844 -277376
25078 -277376 -170277 -23626 69993 106963 223248 215992 251511 195786 87882 127267 76005
25067 76005 26424 17205 -8229 114773 69958 19932 -43636 14868 176093 55213 -37030
25056 -37030 -118284 -73305 -40529 -41493 -36441 -80610 -59321 133431 200226 131048 105669 96274
25044 96274 154302 157377 11080 -6315 5377 15393 -57702 -123927 -108168 -24480 -21232 -61213
25032 -61213 -26682 1908 99838 127509 94073 -19201 -107135 -163639 -192665 -71343 71273
25021 71273 104251 58556 71578 80171 44468 16707 1109 20685 76067 114203 83791 148176
25009 148176 140151 129323 92750 58419 -99304 -158623 -76372 90102 248317 252526 173592
24998 173592 -6786 -131075 -145718 -145181 -90489 -19975 98797 135704 177601 98977 -62998
24987 -62998 -84038 -80997 -106072 -132031 -181139 -164827 -97637 -148764 -136059 -20858 -89359 -147593
24975 -147593 -153548 -160307 -120182 -110611 -173781 -172755 -78632 -59903 -175571 -271977 -187184 -139823
24963 -139823 -9540 -26294 31856 -91692 -197664 -259512 -301934 -236738 -124656 -147960 -226635
24952 -226635 -250369 -124549 -8539 -105922 -150052 -142412 -146602 -43456 8723 37201 98710
24941 98710 105055 69545 26571 33404 82673 9463 -76094 -167773 -6570 159470 118704 74929
24929 74929 25890 23455 52767 -101414 -143107 -81242 -73574 -62135 -88780 -181057 -269798 -180716
24917 -180716 -108041 -49359 116825 97751 -70166 -61552 49562 149267 213998 172353 135861
24906 135861 -4662 -21711 83875 156383 126735 73237 62047 11470 62586 87398 -64469
24895 -64469 -236228 -238002 -95979 29353 -38059 -46670 -47568 -26931 119749 161616 104649 40051
24883 40051 -11254 55442 48662 -34908 -154287 -246512 -211410 -144806 38024 68526 143484
24872 143484 191029 122542 64955 -15292 -210011 -200075 -111431 -112504 -223820 -253852 -205302
24861 -205302 -81795 11971 129330 140005 143783 -11721 -68985 -88749 -87269 -137090 -135366
24850 -135366 30282 -87721 -49943 -20556 -17472 28808 116104 134717 6880 -64394 206
24839 206 68869 3904 45673 85957 -30040 -165589 -78116 -66556 -25842 -97571 -98257 19324
24827 19324 -57346 -100851 -95635 -81624 -55142 -105406 54829 112333 37250 59090 86068 78890
24815 78890 79552 41456 -28420 -56541 -93431 -91216 -129201 -96143 -45240 -52191 -42322 356 26052
24802 26052 94711 148815 83949 41810 29572 104855 193659 110138 126920 143116 4099
24791 4099 -65939 -121303 -125675 -230605 -187771 -149195 -60373 108576 252038 197162 49412
24780 49412 -57600 -114575 -152546 -107238 -197677 -146794 1903 -56524 -182201 -233264 -193585
24769 -193585 -124564 -134702 -144909 -188553 -185455 -114627 -70680 27269 58785 64206 205506 312116
24757 312116 161923 87695 -12519 2806 72467 124757 251241 272050 300265 210508 207253
24746 207253 170060 3164 -68335 -41447 21860 -83539 -155299 -117608 -48509 -109313 -8696
24735 -8696 -23411 -19037 -77677 -42810 98706 170982 255836 143350 -36094 -81253 -105033
24724 -105033 -62699 -78120 -135726 -140080 -20552 6163 -37909 -34803 68720 43880 -22723
24713 -22723 -104069 -54036 110095 140021 129090 105607 68149 -19813 -118017 -241025 -170792
24702 -170792 -36817 -63761 -154722 -182203 -228735 -223335 -210458 -102399 -53023 -86739 -110106
24691 -110106 -193877 -80360 -99050 -63310 -2636 26481 27840 84043 60293 34994 121489
24680 121489 85500 148190 125177 32940 -17663 -81371 -101167 8284 94314 122411 102206
24669 102206 -52350 -157783 -32506 91407 97042 9274 -13056 -10531 -46770 -52063 72852
24658 72852 77589 26733 54352 87291 91353 61427 -66932 -45752 116723 192246 92079
24647 92079 131597 293030 178402 -23574 -79919 -114221 -35581 93855 -877 -141627 -263202
24636 -263202 -217988 -168426 -135020 -50552 107380 140990 103682 50314 99560 100570 67582
24625 67582 75064 9206 -31208 -25552 24214 -41401 -79343 -18430 44079 28288 -23315 -57633
24613 -57633 -69507 -22413 22372 100355 18048 -54134 -12856 179926 142387 137217 115810 113327
24601 113327 167446 168940 88668 119524 16709 -136303 -65214 -46355 -81263 -150405 -82807
24590 -82807 -33051 -12645 8455 7011 62798 20014 -42607 -150085 -102082 -66594 -13191 63455
24578 63455 29392 -29427 -78452 -11761 106196 212898 175011 176218 192653 130491 86374
24567 86374 72034 88814 153277 213457 348745 320401 204646 142919 -27025 -42351 -47517
24556 -47517 -5794 -59656 -29586 -70957 -113289 -70058 -173361 -161527 -76607 -134593 -107078
24545 -107078 -28393 -33312 -85217 -214022 -247022 -103560 -80034 28949 65030 -41396 -83505
24534 -83505 -158903 -212313 -209971 -195517 -192419 -56721 26447 -47219 -173713 -191805 -184242 -171831
24522 -171831 -90431 8325 -42684 -170467 -190062 -222053 -227282 -70976 -29408 -76748 -23478
24511 -23478 -29506 -110072 -143225 -65949 -43317 -89755 -60435 -21570 83529 40393 -43289 -88609
24499 -88609 -136158 -23220 -85507 -175811 -59714 -9304 44459 70072 120960 130704 29912
24488 29912 -55733 -21890 28058 78062 25534 30283 168655 267890 301067 131245 29271
24477 29271 -39989 -177089 -161646 -44898 12679 -85615 10816 143876 171790 56170 2079
24466 2079 96156 130877 138795 223819 33021 -38847 -51978 -206903 -211554 -108906 -49635 -23970
24454 -23970 -76748 -175999 -198721 -53470 12449 674 81495 242482 375138 353708 221409
24443 221409 89871 36702 36592 -12606 -125446 -148556 -203495 -142247 -130524 -32357 54757
24432 54757 87540 86130 31644 31209 -95013 -66625 -62050 -113456 -189244 -166014 -35285 -49113
24420 -49113 -98693 -90007 -102749 -83135 -135965 -53825 97774 193246 208837 249246 106294
24409 106294 26837 58001 63434 80070 -38632 -138485 -139529 -77664 -69465 -50931 -177806 -206942
24397 -206942 -109853 56984 108309 24041 86142 -3693 38556 147794 48594 -77185 -63470
24386 -63470 -27485 44444 138611 57488 38100 -2600 9645 44419 -58413 27241 -8824
24375 -8824 -35475 -46285 -110316 -236360 -205506 -116288 99714 144034 28806 -44939 -90055
24364 -90055 -85370 -68980 -100525 -23010 126632 255209 154280 -82802 -250859 -188017 -68327
24353 -68327 -29407 -76277 -14623 52586 49765 87324 6948 55177 70731 133653 121057 122811
24341 122811 142981 132087 186524 47891 -45308 -142580 -104394 131265 165758 57882 52773
24330 52773 116620 76669 65539 90529 158275 136765 144306 196667 193127 184541 189742 222066
24318 222066 119088 -15848 -115925 -106986 -41042 -71393 -85851 -115650 -231410 -107525 31919
24307 31919 86313 114975 33340 -34229 -32035 22760 -28007 -142325 -170846 -71305 -10890 -2250
24295 -2250 -4151 3100 -27653 -115720 -23986 27211 -43662 32337 93048 27478 27318 68959 -56369
24282 -56369 -1953 -23867 -29171 25915 -10909 -12838 -39298 -73134 -73790 6257 36869 77758
24270 77758 51396 21817 42906 -39371 -27500 68923 39357 11570 -35912 -62668 27667 -2146
24258 -2146 -111544 -163022 -202709 -96463 -47506 -87160 1196 -15199 -35210 -32621 77224
24247 77224 134867 51046 75213 -44310 -91357 -43555 -129813 -59133 72251 166385 160763
24236 160763 110938 90561 53636 16118 164321 42025 -30197 -125372 -157734 -53143 -16572
24225 -16572 -35863 -353 55121 68917 37983 62721 78605 140266 94513 -18 95119 136112
24213 136112 117522 128318 116315 39879 79928 46936 51008 41771 49434 96187 159078 123538
24201 123538 91394 170304 118661 -102024 -50319 43559 57095 74374 -3776 -60073 -54637
24190 -54637 -30752 15746 77539 26819 35109 182429 151970 -75669 -129470 -103250 -92119
24179 -92119 -99983 -98482 56538 110528 31353 8170 92329 54780 34456 62358 120336 183861
24167 183861 57555 -67673 -54770 -55703 -74081 -39680 -51024 -103861 -59947 -126866 -149186
24156 -149186 -85202 50717 81344 71912 83217 133775 -7846 -1732 115063 158310 61790
24145 61790 5410 72952 174829 356492 334162 170581 27956 20543 136592 237212 24717
24134 24717 -94893 8221 -108873 -157892 14411 100483 8050 -39356 47642 112092 36992
24123 36992 3454 -73246 3173 112383 154285 41822 -41886 -122095 -4197 61374 56137
24112 56137 77967 6447 2459 46991 71184 -48163 -36686 -37393 -99268 -139087 -101441 -87140
24100 -87140 -16653 93769 -23667 -135152 -268323 -305137 -193896 22263 115870 7737
24090 7737 -146045 -163559 -82933 -187884 -255021 -127313 20269 140336 196387 199473 165348
24079 165348 130435 83346 -18172 -93052 -135888 -124808 -90253 -137359 -173146 -139952 -116715
24068 -116715 -110262 -95693 -66524 -91657 -162316 -122279 47984 92327 75076 76620 31735 60121
24056 60121 24879 11366 53655 57436 59294 20835 1112 157933 230239 107655 -24852
24045 -24852 35286 81042 13866 -147390 -191724 -180987 -146083 -60027 36685 115248 161295
24034 161295 135534 27854 -20396 -15827 30418 125263 165411 125831 213278 189229 58938
24023 58938 -5770 -56496 -88186 -167584 -122260 -78239 -82360 -67469 -75326 -138358 -182601 -125457
24011 -125457 -106765 -128837 -128750 -5184 66922 39553 -156954 -121191 57863 109344 112725 122705
23999 122705 -55885 -106019 -71108 -39802 -32090 -27961 30237 -41507 -109090 13073 48682
23988 48682 -38531 -76682 25848 103760 189238 194860 68427 -46595 -11294 119524 157678
23977 157678 88810 45404 85632 171180 102995 37181 -15639 20968 -13221 -24810 3822
23966 3822 -21807 -31286 -7581 -13247 -14505 55460 23639 41091 52511 -26660 -29226 20396 -24863
23953 -24863 -12419 31245 -22411 -6555 53562 1337 -84279 -118974 77889 66853 4179
23942 4179 122546 85527 19678 -8667 -56317 -76719 -87243 -90914 -139080 -279469 -230718 -182186
23930 -182186 -224524 -151222 -157260 -72200 -8751 53210 27413 -8362 -46938 -109814 -124737 -54372
23918 -54372 -58207 -66139 18155 111778 56267 64786 62602 26958 -9115 -3198 57485 -7152 -118365
23905 -118365 -133372 -14995 79577 10154 -2754 -57910 66601 120122 67053 96206 88748
23894 88748 39350 -29711 -64014 5651 81412 129381 118308 141979 211388 245314 126977
23883 126977 26469 -29816 -47512 2260 40513 77780 81271 1623 -79027 -124109 -59188
23872 -59188 29473 84620 133725 51252 -42722 -153920 -317924 -309129 -140777 -69046 -165193
23861 -165193 -150204 -34912 -75645 -160881 6305 -53563 -15917 -72805 -121526 -59483 -59801
23850 -59801 -65352 -108328 -147956 98752 103309 -6039 -35061 -23675 25831 139618 82734
23839 82734 -51269 -109540 -89655 -88961 -107825 -61675 -37969 -143718 -129058 -39420 -43943 -4130
23827 -4130 120648 110891 91508 71339 116506 196740 163419 9811 -145868 -150979 -120396 -155993
23815 -155993 -68035 -104441 -161414 -47738 36685 87962 148206 172904 34257 -20065 -86864
23804 -86864 -60310 31822 46524 -126492 -136664 -103352 40755 81741 -85363 -84603 -30978
23793 -30978 -69141 -145356 -154882 -140185 -181790 -230468 -211522 -199063 -143932 -32838 53217 42370
23781 42370 100742 173927 40216 -57692 -111825 -91204 -46377 127080 147203 50552 828
23770 828 -38445 32835 1666 -70326 -63945 -70876 -57168 -54156 80096 -7449 -98954 -148858
23758 -148858 -142798 -105114 -126124 -81254 -55080 -93393 -191478 -203614 -85999 -34164 -61920
23747 -61920 -149816 -223706 -235274 -256014 -173459 -193518 -123862 -73672 30794 153350 171904
23736 171904 82901 104498 176594 48139 -10636 27017 -89072 -85268 418 -25308 -136074
23725 -136074 -142184 -25071 -27318 -96684 -146119 -100047 -88987 -120172 -62084 6339 98012 168529
23713 168529 185580 134706 49424 112067 24103 16003 31056 -55162 -33407 -7588 -1297 25897
23701 25897 120415 106297 172016 88238 132253 113861 -5856 -8807 -24870 46487 96676 133129
23689 133129 30034 125676 208471 37203 -98923 25606 120132 97461 68187 -17499 -23265
23678 -23265 -66449 -225590 -221947 -191126 930 53745 -26090 -31576 -83527 -45117 95281
23667 95281 106883 139938 36845 46543 30139 -65693 -50828 28107 60069 159370 59446 -5270
23655 -5270 22892 -80701 -56742 17090 -90373 -87664 -92579 -141530 -160327 -213137 -167350 -122485
23643 -122485 -91834 -104326 -297788 -338462 -284427 -257812 -263970 -160494 -94710 -121701 -53558
23632 -53558 -52857 -55233 -128083 -40429 74738 121856 55681 15953 2406 -21673 -111193 -20498
23620 -20498 59151 -18992 -9493 -98857 -140999 -140043 -56267 13185 -57278 -180234 -148479 -194951
23608 -194951 -141519 -121839 -241288 -202302 -79240 -13388 89998 152901 99267 124976 152323
23597 152323 146122 50143 51704 175196 149326 38639 113339 199883 265089 280812 226248
23586 226248 162198 157177 95124 1190 -102193 -95584 -29975 -100573 -105333 -17989 -67931 -142240
23574 -142240 -176625 -35796 126986 149534 117677 73975 50855 85915 38233 18332 -26291
23563 -26291 -28313 13331 10800 -25638 -71308 -67031 62442 18155 3223 -92416 -154276 -52440
23551 -52440 -24828 -94058 -80155 -80096 60661 210258 140840 11425 -31709 -4199 42826 50333
23539 50333 25527 28457 -61663 -54049 12256 64895 64860 -66579 -140612 -8219 36041 58776
23527 58776 8313 27933 56335 91607 77158 24648 25145 -68029 -75194 -70452 -76795 -126886 -135319
23514 -135319 -110021 -92728 -173944 -221519 -157908 -111265 -74066 -34752 29212 90477 125477
23503 125477 80512 49612 -1624 -52064 -50646 20413 -19323 -54931 -21539 -39029 -50379 -5464
23491 -5464 29424 31029 30456 50201 85594 241816 265994 234888 217322 171354 166589 125749
23479 125749 87956 125999 50770 -85518 17887 94837 33478 -26601 -33954 36523 94899
23468 94899 42703 34965 -59027 -137440 -119860 -195730 -168175 -96641 -18211 -59039 909 -125589
23456 -125589 -118939 31392 74489 46618 54042 41466 34861 37092 -43678 -14623 -24205 8338
23444 8338 90360 73902 19813 -51388 -58999 -13866 90810 69479 -91198 -73869 -30310 34667
23432 34667 9454 -74022 -50896 -27982 43064 5273 -51144 -119797 -113511 -84778 -43824 -19888
23420 -19888 99065 112135 48968 30865 -17999 143455 228377 162098 101808 39942 -52958
23409 -52958 -107864 -91039 -105357 -107640 -124317 -147860 -173512 -109066 -118939 -191980 -212801 -195622
23397 -195622 -169590 -81988 -45505 -25110 -101402 -144794 -94306 49167 180991 99207 45516
23386 45516 -11129 -37481 -102807 -173361 -103287 -68829 45343 82559 18884 23294 99145 23091
23374 23091 74911 -5065 29040 43844 -1280 -59856 -66808 -68388 -45856 -38245 -25977 70810
23362 70810 184331 103977 23664 -128170 -151116 -57287 24962 52231 30711 50929 98038
23351 98038 44247 -58453 -137385 -62746 24432 55459 -55293 -36503 -132910 -168635 -163802
23340 -163802 -135224 -74750 -92314 3064 21046 86509 81170 -82763 -128423 -100242 -112473
23329 -112473 56385 122189 77623 5480 16209 -65631 -4498 -88588 0 -53161 -59293
23318 -59293 77969 129665 21390 -7339 -40065 -89673 -210205 -171742 -72830 -77716 -138736
23307 -138736 -70441 -101867 -124549 -85251 -157241 -222726 -112787 -72777 -29323 87812 100591
23296 100591 -30357 -97306 -94686 -104696 -72624 35932 73462 57377 -32983 -65312 67422
23285 67422 169374 104928 36154 74762 42902 39755 -89858 -91094 -94085 42821 176668
23274 176668 54478 -96934 -71371 3788 -38217 -105470 -52057 -104977 -57770 -26059 180
23263 180 10481 -31319 -105357 -126959 -112877 -121040 -86924 -62650 -4297 -65465 -92806 -89487
23251 -89487 -84207 -26587 -24076 -88368 -53194 -102839 -158652 -172904 -181564 -236745 -257647 -108885
23239 -108885 76817 111646 63378 68345 44809 55943 -47358 -96368 -113886 -92674 -42544
23228 -42544 36889 48411 52460 -6666 -117211 -211232 -107933 38107 78643 126520 193709
23217 193709 148012 103197 140510 142629 188230 138861 105087 96134 128149 41848 -74858 -102427
23205 -102427 -70857 73922 163277 209948 268387 147612 103133 -26466 -204928 -140774 13775
23194 13775 -22120 -97605 -58758 -8927 -85492 23132 38025 -33624 -84314 -96879 -91170 -27946
23182 -27946 -345 -37875 72499 33749 -99931 -96707 -35766 -7355 21978 27157 109869 52505
23170 52505 -12993 1901 -32933 -27548 1383 -88761 -102075 -120401 -123488 -130617 -152310 -187052
23158 -187052 -219416 -168703 -74294 356 32750 -16129 4949 -29897 -81095 -85098 -66094 -31604
23146 -31604 -5770 -36642 -116279 -111120 -63940 22563 1645 -16054 128740 89041 -118536
23135 -118536 -166611 -137781 -198221 -250537 -77378 75 -126390 -184090 -165703 -185071 -161751
23124 -161751 -31162 -9991 -58490 42776 -22138 -51419 -110676 -76516 -36092 28119 95777
23113 95777 170135 150915 35154 22533 -39582 -95928 25485 95725 5434 -93137 -39183
23102 -39183 695 82078 61129 32497 -31460 -69066 -12785 -22342 -99731 -61760 85125 107056
23090 107056 107633 89990 86655 42825 -8228 -67143 -151146 -134345 -50139 -137440 -103569 -36817
23078 -36817 656 95368 97227 90560 -14732 -20775 -45398 -93056 -64997 -140840 -176951 -76621
23066 -76621 -50130 38957 157888 244343 159114 59551 -24966 51262 51545 -28965 50386 130442
23054 130442 131183 -38912 -84900 -42251 -77672 -47728 -75352 -21411 -94179 -53189 -58503 2109
23042 2109 77724 91183 -54356 26525 37885 -76831 -118958 -103939 -191828 -150314 -77829
23031 -77829 30072 -11875 -95072 -228988 -180068 -183052 -70148 80437 81822 17132 19847
23020 19847 34841 -45268 -54727 22973 -102834 -97332 -36751 51892 151673 80414 16162 -65983
23008 -65983 -114673 -1770 -23396 -99111 -28852 104568 41063 41843 6294 -111524 -162379
22997 -162379 -111517 -107464 2255 -48783 1855 96367 -76600 -50720 134713 216584 98981
22986 98981 33180 74233 84751 -56860 -64004 -6607 2161 -19329 -61947 -111046 -124903 -97385
22974 -97385 -92321 -33195 -78307 -96309 -210028 -157096 -26805 -24699 -5425 -18930 -88388 -31957
22962 -31957 -21008 -161589 -258879 -197200 -78446 60078 139233 192099 215774 196445 77452
22951 77452 -5679 -47189 -50576 -140807 -64633 -75651 -40481 -6348 -24275 -125854 -94383 -8185
22939 -8185 21767 21087 -33242 -55623 -10777 2706 50389 52954 26658 49739 205411 211912
22927 211912 116322 124259 5866 7665 -39540 -54601 3254 11853 -42776 -6164 43252 -43131
22915 -43131 -31791 27403 111891 179684 92272 -18853 -58595 17576 75960 128504 126212 6750
22903 6750 19520 144159 148297 191319 202189 88602 52002 79515 51317 57460 88383 106317
22891 106317 15400 -41115 81460 143988 100659 65161 21104 19933 80175 72136 45360 216556
22879 216556 242470 182346 121177 53295 29557 40824 9236 -135073 -206126 -303663 -292626
22868 -292626 -193759 -114245 -14597 -123664 -135020 -178406 -48706 58066 86927 134143 79023
22857 79023 -50546 -77746 -39625 19910 -46538 -159751 -63458 -35341 -112633 -85930 -80383
22846 -80383 -119074 -102366 -25810 19197 42123 -1694 -174718 -134182 -97264 -89407 -52646 24431
22834 24431 19610 -110373 -155145 -105498 -112715 -104611 -53323 -45727 63170 4004 -89568 -129477
22822 -129477 -252348 -202343 -199721 -148583 -124756 -117682 -102431 -88400 -52530 22621 16445 -3588
22810 -3588 -42748 -165101 -183257 -87508 -20503 48524 168012 190283 140127 54275 -15695
22799 -15695 -22705 -17121 -117839 -106578 -59583 21098 106381 122692 29942 -68786 -45924 -54593
22787 -54593 -109864 -117228 -78211 -5043 35334 37537 -84077 -107007 -226100 -291899 -273389 -142518
22775 -142518 -77344 -55716 8263 -19542 -47859 -68159 66545 30822 -17900 -56769 -107989
22764 -107989 -154889 -238498 -243859 -172727 -168415 -61609 -1340 14137 -26606 -38306 105181
22753 105181 110336 73800 46096 34791 -9965 38690 144582 142075 56209 30794 32473 -35154
22741 -35154 -19953 60707 88296 77727 -56360 -130779 -148744 -214658 -164814 -87261 -54942
22730 -54942 -29983 -54684 -114087 -121014 -154930 -61097 -61163 -121552 -122706 -155818 -51663 -128702
22718 -128702 -54728 19277 14517 13728 -101597 -201310 -169604 -115041 -108118 -55673 -11740 37444
22706 37444 79020 65262 108591 115424 35011 -14496 67668 126925 87385 41135 33606 32598
22694 32598 90280 113105 173220 151478 38961 72558 55205 -40497 -20194 85783 124924
22683 124924 73511 93812 55384 78437 47709 117805 158707 123507 63419 -79747 -184484
22672 -184484 -251599 -160666 49214 56850 -92305 -138152 -54317 -64823 -147746 -76861 75692
22661 75692 166532 82504 75476 99073 89649 128264 102564 102000 42671 -71826 -37101 96213
22649 96213 198774 215934 120942 117629 130857 144230 194061 117803 -10849 -24134 -38589
22638 -38589 -42158 34261 111575 53321 1552 -54945 -113132 -68032 101278 69982 40545 -49708
22626 -49708 -88905 -83362 -12664 -36828 -151762 -51189 129134 170738 97317 10230 -56095
22615 -56095 -105564 -110993 -46271 4101 -16995 41779 -36692 -125848 -68159 -89275 -72238 67354
22603 67354 146581 90609 64318 -83844 -193396 -109897 50796 -6985 22181 147479 202413
22592 202413 211915 86671 85119 110563 55891 136164 189293 218735 104723 -104 -9678
22581 -9678 17657 44164 36571 -35840 -65070 -42360 -49025 94929 117337 72441 88681 101618
22569 101618 1370 -88866 -193236 -116354 53414 191473 147320 119238 206812 252268 167715
22558 167715 24756 -62333 -82179 -54264 -49243 -68110 -38440 -67433 -201079 -205689 -114969
22547 -114969 -152811 -241718 -231249 -178574 -140613 -115087 -49292 -8501 -5952 2141 -873 -74261
22535 -74261 -8609 86413 113052 154152 190288 153923 88967 15246 -7681 35292 73057 34039
22523 34039 -55694 -153064 -151313 -90685 -51236 -32412 8664 -3884 -40483 48892 117608 159185
22511 159185 92782 85724 110748 70684 88978 107548 132065 156872 178773 84575 -1347 47928
22499 47928 29343 34521 57094 78703 50283 -77330 3901 213970 147846 52571 -13908
22488 -13908 -64325 -92559 -8738 1730 -25647 -118770 -106229 9705 118069 76988 -54246
22477 -54246 -44740 -150807 -196973 -49975 68580 122636 141642 -15203 -145112 -180278 -189415
22466 -189415 -192503 -179673 -19151 84567 -38808 -134300 -102149 -40490 -4263 -1008 -768 -57424
22454 -57424 -104347 -102897 -130293 -108741 -57661 -71886 -87566 -49828 93759 108830 13292 -33392
22442 -33392 -27636 -16187 -68171 -2138 5008 -101029 -54888 21046 -62570 -91118 -133923 -116072
22430 -116072 -143132 -134430 -17033 42131 86915 84681 25046 -45494 -10197 -83222 -71362 12846
22418 12846 57670 188794 324422 232026 69427 73233 59 17374 17729 -22710 28365 19274
22406 19274 -103578 -142026 -195072 -113579 -107832 -47729 84913 130940 137105 108426 70325 53706
22394 53706 -48795 -80441 -103 -13254 -65432 -60270 -15046 13260 64532 70120 116999 104775
22382 104775 23580 -23234 -113368 -139979 -52541 -13473 -96652 -80547 -19884 -40815 -25861
22371 -25861 62903 70332 -19313 19753 -13081 -120543 -94261 -15144 -64519 -138014 -21993
22360 -21993 -24282 -10886 65811 165110 133200 47143 26854 48723 73569 25574 -98421 -92374
22348 -92374 -29544 4767 51843 131147 145516 68718 -38237 -6518 103271 126800 -52039
22337 -52039 -112265 -38437 108984 222389 208340 57072 -38183 -4206 55517 34826 -106738
22326 -106738 -233682 -176477 -181070 -110065 -33254 -117533 -191944 -168153 -150460 -91563 -69556
22315 -69556 -40508 -141440 -113466 -127959 -139657 -102582 -73513 -121552 -23525 50958 147655
22304 147655 250476 162457 4547 -12593 48447 16382 6451 -7713 -8064 -87725 -24166 -20015
22292 -20015 -49135 -20075 655 35205 50940 -100148 -141185 -36413 -71833 -28998 97017
22281 97017 21703 10295 -14525 58035 138637 56765 -28368 -48833 -33519 -6477 41445 -49774
22269 -49774 -93640 -105562 -202176 -100383 26752 108057 87406 57779 31716 -86804 -87933
22258 -87933 -117877 -13721 75989 114014 68888 50158 130770 53407 18734 -36290 -59341
22247 -59341 20615 79594 187094 256439 290188 230453 128143 57436 29633 96110 65516
22236 65516 -26434 -102869 -137697 -60132 -24701 12084 20420 -9010 -117766 -56261 -10816 86984
22224 86984 63230 38549 11440 17407 66774 -20502 -50002 -93910 -24597 -20538 56337 75628
22212 75628 93988 150766 202195 156568 104239 99763 60896 93739 132539 7307 -77671 -48364
22200 -48364 -9408 -51049 -74128 4876 -86130 -67967 10553 52148 23599 177866 251251
22189 251251 257454 184312 -35580 -129035 -134425 -181183 -255974 -229971 -200670 -106096 28365
22178 28365 28172 -15439 -40846 -91080 -70871 -38422 64357 7615 25372 -14908 -220608 -285814
22166 -285814 -189780 -81304 -25759 1388 75732 11723 15980 23825 -36814 -8106 124687
22155 124687 38918 -9059 59778 54884 10184 -75894 -207659 -161088 -116729 62507 23178
22144 23178 -90102 -20091 80726 -70002 -172265 -222194 -182746 -138869 -33162 15400 -10150
22133 -10150 -65648 -58954 -29467 -24516 5530 -43776 5427 39482 -176267 -109600 63640 49005
22121 49005 -40357 -171054 -258537 -145729 2800 -11226 -28221 -50201 -22120 -9969 -45840
22110 -45840 12900 19611 -35562 -3669 78015 10827 -72848 -170084 -51424 26089 -58911 -148787
22098 -148787 -134937 -121489 -144352 -157500 -120619 -120420 -170110 -104753 -109521 -37150 44959 35476
22086 35476 57061 -15787 -12226 54695 23940 22707 -74510 -119404 -131074 -117040 -44644 -35697
22074 -35697 -14945 -4706 -52325 25773 180429 172392 118657 8778 670 57075 103901 21993
22062 21993 -22434 -22666 57596 167208 124721 -8382 -68432 4152 101899 -253 -165546
22051 -165546 -161262 22716 32484 23268 82776 29801 -87857 -113537 -73744 -120551 -165157 -214776
22039 -214776 -104321 -9384 -127048 -89059 -102288 -35948 100667 89581 -54106 -107353 -65175
22028 -65175 34556 58129 15334 -19336 -127588 -185555 -89771 38397 133349 169477 3856
22017 3856 -47647 54834 32870 -26124 -26285 -49115 -74328 -70054 -83499 -58167 -181958 -198914
22005 -198914 -90246 12078 74861 96818 37094 19716 36280 10884 28789 72963 128883
21994 128883 92012 -6074 -79376 -187772 -179405 -12797 -11330 -145904 -173430 -118209 -167222
21983 -167222 -149514 -135060 -168830 -186894 16330 30020 -60816 -63271 -67472 -9736 34573 -160855
21971 -160855 -253548 -129066 32321 19157 83920 139568 37874 60068 65521 32695 -25891
21960 -25891 -97471 -119336 -38803 52066 7222 18276 47431 3098 -208904 -274446 -113837
21949 -113837 -61778 -59107 -80624 -122047 -170280 -146774 -152994 -82662 -55915 14882 79432 9531
21937 9531 -71772 -75846 2682 61684 336 -58564 -2938 53330 88931 108105 20339 -74714
21925 -74714 -64756 -25616 70324 116368 133587 97794 132285 172948 146180 111579 22336 -21711
21913 -21711 -18840 16460 30932 91135 160203 210609 234601 97873 34489 10729 71280 102656
21901 102656 60434 159258 37873 -55904 -43789 -92310 -17673 -121423 -267780 -283755 -252286
21890 -252286 -198228 -15025 54408 79616 99759 -2538 -27774 -135525 -232211 -205602 -137010
21879 -137010 -64155 7446 67163 56413 -36089 -111584 -186447 -194393 -194492 -192181 -119096 -122140 -88995
21866 -88995 14101 68833 -8597 -13966 -116159 -118914 -2839 -37964 -50859 31487 117127
21855 117127 47574 173 66617 120525 -93291 -134185 30235 133121 124976 113158 23189
21844 23189 3211 121424 177124 94496 8914 58063 112214 23063 14441 -19182 -24043 45642
21832 45642 5757 -199717 -313999 -231556 -121257 -87638 -33854 -49202 -41166 11107 14110
21821 14110 -8620 50664 -31166 -44217 -64415 -97591 -148494 -102488 -43398 30505 94140 -58516
21809 -58516 -141305 -31114 -38946 -197972 -262550 -230599 -185073 -67296 99841 180010 12720
21798 12720 -122822 -172895 -70554 54908 54712 -84748 -56078 -90210 -108551 -20247 36608
21787 36608 70147 118534 119514 84076 137471 224835 71585 -12909 18002 76725 170361 175994
21775 175994 191880 208901 38869 25360 104834 162544 154566 109279 159701 188788 179428 185270
21763 185270 147539 121660 54987 -20155 -16241 62053 95049 10216 117549 201335 163342
21752 163342 88172 -43794 -21164 26237 -72627 -72115 19490 101784 132493 193079 59974
21741 59974 -148677 -138631 -4003 -10858 -41448 -28061 -93855 -220002 -226252 -100852 -70780
21730 -70780 -65758 -47192 -32760 -59187 -104135 -66724 6507 26652 41631 45529 -26636 -139114
21718 -139114 -124474 -39373 -81301 -10732 -10203 21487 18092 -4052 -52417 -88291 -170666 -169375
21706 -169375 -101687 -833 -20023 24466 38871 -112647 -178540 -291138 -246839 -89710 -59009
21695 -59009 -77947 -132369 -131096 -113991 -11284 -17783 -64699 -55713 -1627 -39417 -58281 -112270
21683 -112270 -122285 -149333 -81426 -44574 -61967 -99259 -73559 -96962 -58000 93863 105594
21672 105594 24823 32830 22413 -850 -77687 25483 -10650 -51043 32689 8664 54773
21661 54773 117489 47367 14512 34379 -24792 21793 106821 97410 126341 83684 122269 88488
21649 88488 -1913 -40111 -97209 -189954 -185376 -203103 -188404 -166046 -70628 -27148 -33659 2569
21637 2569 52421 7611 -170536 -217299 -46085 48121 -68399 -84964 -166011 -180155 -161347
21626 -161347 -150324 -74914 -47863 -62559 -60892 -21042 10745 115197 -15769 -111911 -164024
21615 -164024 -143734 -104782 -129163 -106224 -60955 -77817 -45617 -115544 -149860 -115629 -130673
21604 -130673 -148122 -27561 106214 101190 -54739 -24018 34886 82207 91030 124610 87155
21593 87155 56878 -191880 -292707 -320136 -283883 -290634 -231852 -195102 -244707 -204074 -161495
21582 -161495 -106001 19492 131536 127384 77640 60774 112455 192004 47776 58796 41129
21571 41129 44543 80060 122716 82257 51443 -9962 -69019 38227 80084 30980 61019 63290
21559 63290 34014 -5920 2072 -7432 65135 91647 206546 230393 45673 -17001 16164 -165272
21547 -165272 -201959 -93672 10503 46363 -19140 -144814 -247554 -215584 -66148 -90614
21537 -90614 -100342 -93087 -60937 -71731 -180691 -113622 -22390 -82943 -88589 -100946 -32687 13640
21525 13640 15909 -148831 -212868 -190900 -182640 -256966 -227794 -105295 -3629 -67245 -133816
21514 -133816 -108966 -172666 -148432 -2094 136696 144519 89668 41510 -54038 -47395 -103577
21503 -103577 -138845 -146595 -169132 -185986 -138592 5200 30894 -75211 -157533 38299 180092
21492 180092 109951 3241 -48469 -49299 -27710 46804 45312 57203 42150 4929 -13535 74769
21480 74769 84051 111461 73690 112504 199340 234944 194965 223945 258538 319385 319313 201621
21468 201621 56223 93141 143697 102968 134982 2829 51212 43644 48468 151378 189438
21457 189438 98747 -8808 -69579 -108962 -62443 41431 75991 69514 -17359 8586 128600
21446 128600 130060 35714 -2530 -15523 73776 -12323 -147847 -127784 -65328 -110897 -55682
21435 -55682 -80176 -136963 -147325 -113671 -104237 -144215 -157747 -155421 -116471 -45478 28421 30523
21423 30523 -3578 49564 46109 164621 307854 331520 302716 104827 37348 -64028 -168000
21412 -168000 -219311 -177048 -197068 -158771 47472 157268 23046 18534 91424 33010 -115749
21401 -115749 -146364 -41974 49064 85876 37513 -12592 -44621 -58171 129740 153113 4828
21390 4828 -46119 23049 50460 53211 399 -81055 -39245 -111486 -120801 -126806 -20460 -116955
21378 -116955 -74595 280 103806 121290 87018 156611 154983 115134 73865 9758 36170
21367 36170 -133478 -244378 -200151 -126190 -83612 -82154 -58558 -21699 48396 223493 176611
21356 176611 -32343 -186106 -119250 11510 -107623 -230165 -239763 -143131 -77084 -73311 -95440
21345 -95440 -220252 -199052 -117079 -84559 -2211 75663 124786 53962 -10704 -159502 -128092
21334 -128092 -41867 -19913 -58666 -25862 12133 -38740 -39275 17539 87880 70686 -56886 -52574
21322 -52574 32836 68880 73576 9312 -9186 -27398 -81004 -52435 -50787 12132 -485 -23415
21310 -23415 -147765 -206722 -228899 -250846 -222299 -211489 -164819 -30303 -7644 -21640 -189
21299 -189 28387 60381 97118 146361 200121 121374 -86663 -234899 -245185 -258335 -122784
21288 -122784 -22434 86615 55461 67316 41957 15617 50903 -64415 -34617 102775 203967
21277 203967 230277 48523 115131 108335 -13392 -126272 -66399 1427 45415 25828 62542
21266 62542 81300 73490 75104 27321 82325 113698 39969 130361 286658 308558 98271 -39294
21254 -39294 -29215 41056 123241 159628 158148 131824 63517 45128 -26443 -97987 -35347 -22289
21242 -22289 -46520 61055 152578 241720 154008 52602 25560 -48650 -73843 -21401 75447
21231 75447 38250 -9081 -9530 37702 1432 -33496 -122993 -144118 -198834 -64646 -91299 -130121
21219 -130121 -139622 -112429 -100150 -146197 -38361 61720 80874 30884 -66901 -27201 23751
21208 23751 -63537 -111233 -74218 -44628 88591 151461 98153 51006 68088 23662 20757 24426
21196 24426 91948 91527 175750 228111 102159 138372 73903 36045 11898 21151 -99033 -88515
21184 -88515 -76139 -119463 -64320 -126463 -82055 -89470 -223196 -132494 12635 -16688 -128174
21173 -128174 -56430 1608 -29301 8182 765 1346 24264 19081 19389 39057 -12571 -23044 14607
21160 14607 -151478 -191052 -142282 -46206 -51076 -13708 96218 107283 11527 47411 109376
21149 109376 195882 62008 -59890 2767 122108 96521 204058 199911 120905 35363 18348
21138 18348 -25650 -87388 -83168 -27256 -67613 -43666 -70818 -79547 -85834 -25865 48545 155947
21126 155947 118372 13554 -108334 -144984 -90086 -84293 -76155 -141872 -59995 -66657 -145377 -104945
21114 -104945 -31454 6616 16567 49958 -29252 -119290 -82319 -33826 70237 132340 -59888
21103 -59888 -62064 -1084 -72219 -53078 8212 12755 -24129 -15802 -64241 -2067 115262 137584
21091 137584 124468 31501 25372 -6581 -156299 -111966 19367 68793 113444 86618 44410
21080 44410 88433 115762 72219 -5757 6293 52038 -10273 -105677 -117378 22077 -10026
21069 -10026 23951 85627 27609 57487 73213 31425 -50412 -33822 -115281 -164644 -117547 -65556
21057 -65556 -29841 -33374 34240 186017 200583 65171 39734 -9008 -62883 29156 34360 29871
21045 29871 -56680 -86528 -116283 -178761 -127020 -122877 -117474 -103508 -2768 166408 210428 123956
21033 123956 -62462 -83013 -46375 -23519 -181674 -230485 -162700 -116974 -161081 -168200 38820
21022 38820 105684 81418 70419 68874 70670 99369 67292 87966 -6443 -47413 -113778 -153759
21010 -153759 -98890 -61157 -4145 -1058 251 -75927 -48139 46993 -61542 -71037 91889 44190
20998 44190 -7428 -6905 -48802 -10365 2737 -41933 50980 184851 112294 55680 107632 66601
20986 66601 66431 114020 33667 54626 127627 148997 105970 11615 -108312 35520 153678
20975 153678 195073 102463 -7660 -25625 -122641 -196251 -74826 1114 129903 91931 151390
20964 151390 109661 109398 52226 78450 211876 298850 275155 120500 -35101 -64648 3711
20953 3711 -1078 28795 136605 105715 9650 -23117 -104922 -151432 -13796 71638 647 -44641
20941 -44641 9563 33348 -51639 -48896 -16071 2408 -30749 -103709 -98538 -117947 -71004 11709
20929 11709 31253 82831 100169 47275 89888 31666 -124688 -235697 -223339 -194582 -236422
20918 -236422 -212385 -108103 -77395 -106366 21048 188885 295529 208317 88538 -74665
20908 -74665 -106462 -55850 28681 -3139 77302 84212 90943 115164 -10103 -54876 -93456 -70207
20896 -70207 -146289 -172726 -87844 4383 -5081 21142 48464 70347 68513 67002 154621 256284
20884 256284 206659 193964 265196 220293 171993 104342 65754 123970 68378 137656 168638
20873 168638 105661 -812 33514 35886 -12855 -131787 -202027 -261623 -231489 -204955 -175964
20862 -175964 -40342 -28345 24862 148555 156402 62204 42640 65872 -54783 -56560 -14516
20851 -14516 -88085 -76305 -32960 56645 3583 -36728 -128354 -201445 -198670 -37212 -71059 -96976
20839 -96976 -26726 12153 763 -8395 36372 60160 -42777 -62383 -90264 5732 72044 53217
20827 53217 -24830 -54024 -54006 -5877 -105494 -7452 64584 31183 45459 53759 40960 96138
20815 96138 103846 9844 -31394 -43855 -61618 -123519 -52566 8719 14884 -6563 -11276 -24902
20803 -24902 40051 -16248 9923 -41336 -75155 -47320 9631 57700 -59317 -156594 -59744
20792 -59744 -110567 -101938 18840 126704 195649 164804 123887 163784 -41584 -93099 132518
20781 132518 194250 193593 151216 116168 43185 -118373 -90950 -49998 -41747 -82724 -184615 -108299
20769 -108299 -3862 59187 65727 183281 143401 171181 219554 275504 190815 76793 18734
20758 18734 99274 85098 117030 124871 19526 63391 62163 45419 -7333 -151070 -59376 39714
20746 39714 72943 56147 163553 217119 75613 115539 23387 -18467 39461 138157 -31621
20735 -31621 -67559 -63216 -29183 4947 -47105 -124610 -48880 -37812 -5371 58809 50177 59908
20723 59908 -47551 -76687 -5781 22701 -6965 -105081 -144182 -108912 -93809 -10470 11461
20712 11461 -69062 -52711 -135310 -89417 -29859 -51161 -102475 -14041 71316 -49049 -189727
20701 -189727 -101542 -65625 -31730 2803 51461 20394 12294 -13678 10123 54262 75311 21871
20689 21871 34387 102991 132923 98469 -51 -103757 -57888 -93248 3512 74534 147318
20678 147318 173860 87605 35842 -31645 17397 58732 118095 99803 -32986 -97314 7171
20667 7171 39097 79381 16131 -2562 82464 186598 173354 105009 73409 34662 34623 -10538
20655 -10538 -38580 -4052 42400 141491 147650 81791 203242 275376 203586 78262 -62419
20644 -62419 -221078 -162000 -60266 -67750 -98497 -83674 26766 7199 -4596 41959 78009
20633 78009 124078 88915 14901 -73485 -77828 -15639 -30506 6622 30173 -67008 -129694 -100561
20621 -100561 -93458 -21241 131407 232112 233838 90747 23572 38257 34878 59774 170611
20610 170611 64141 73273 178456 142848 126457 137802 174273 146543 112280 111526 60972 20360
20598 20360 38529 -73582 -137867 -134774 -57587 9616 60209 20614 66914 136930 39362 -38991
20586 -38991 67016 85161 25566 -44319 -67325 80069 226554 301902 200569 106772 45360
20575 45360 -112621 -104271 -7429 -93401 -87894 -102371 -11336 1259 -59624 -1678 -51638 -109554
20563 -109554 -75453 -91993 -90394 -38125 107777 142644 76500 62237 10856 85212 152536
20552 152536 115883 60535 51251 68133 102710 29330 -14114 -36043 10032 -68774 -63718 64670
20540 64670 214434 215947 142451 36381 -28282 -10161 32855 86505 77349 82751 102226 142735
20528 142735 94124 93745 92288 110982 24048 19676 22764 -27923 -42353 10922 2222 51798 -19958
20515 -19958 -8308 -92230 -262812 -270117 -385248 -434012 -374014 -327793 -272672 -214243 -96382
20504 -96382 -29216 -57083 -16740 -39369 -20353 48652 2124 55018 13523 -3396 -108840
20493 -108840 -101437 -64575 -124466 -104956 -21285 62959 126752 134059 67807 45508 110181 73025
20481 73025 -65697 -163876 -130490 -30856 89546 73873 -5075 4072 155452 264898 153020
20470 153020 91664 -62974 -149954 -131026 -109362 -3939 44172 -43477 -76888 -123730 -72062
20459 -72062 91364 155871 125857 1268 -84903 -171919 -216462 -136161 -73411 116229 96505
20448 96505 26242 48922 104786 149566 -875 -159543 -151420 -146799 -95465 -143243 -151812 -90062
20436 -90062 -69145 -57447 -67637 -115765 -51542 -51547 -49983 -83385 29329 63418 4607 13258 92684
20423 92684 129746 162111 115421 113546 148783 -42659 -51921 -32064 -37227 85023 87599 -8608
20411 -8608 -52066 12575 78245 -36177 -21496 -100454 17874 47348 114238 30068 32177 -19612
20399 -19612 -147642 -115782 -198388 -117754 -142572 -111249 -129652 -24464 159398 189791 100155
20388 100155 104832 270747 232312 194767 162501 48313 27593 -7159 -60073 -59582 8623 -45613
20376 -45613 -219185 -279496 -230988 -167678 -77065 -26705 -41170 -70311 -39265 -81957 -40432
20365 -40432 -36750 -15769 64712 -19512 -91105 -54514 175716 215436 77998 61914 71098 -5804
20353 -5804 -13297 25593 61423 -27774 -82530 11581 -12775 -82260 -59830 -9315 -17977 32005
20341 32005 -11472 35803 127592 196756 54574 34041 69795 -74530 -128836 -66849 -28752
20330 -28752 36423 105449 104915 23682 22654 47228 13601 -27103 -28883 -7352 71651 45872
20318 45872 -96959 -141155 -238249 -111818 -84528 -3105 -3269 -65542 -85739 -147914 -106807 55978
20306 55978 208885 198180 107414 161569 108437 28543 31655 -79386 17182 122419 115889
20295 115889 75548 132489 29985 -108284 83340 200864 62264 -56275 -193900 -129909
20285 -129909 -17406 24439 -13443 2178 4552 97783 133256 61564 12227 39168 110313
20274 110313 136527 151510 114840 77902 82983 129063 7243 9629 141049 92691 59291
20263 59291 87766 -81759 -115168 -110842 -24309 91241 79074 54779 -31470 -141213 -157489
20252 -157489 -66104 35374 18018 105324 43556 28356 113117 -10570 -56845 -40124 -8704
20241 -8704 -32957 -149003 -97475 -34047 -35229 -27735 -71058 -58362 -72104 -163553 -204311 -91981
20229 -91981 -8188 -100287 -94689 -67755 -101643 -158912 -89687 -65644 -78087 -83633 -103046 -74347
20217 -74347 -14997 20535 -11145 51102 75948 122087 202728 284160 177681 21241 91822
20206 91822 144473 269918 263069 202786 136610 95492 242443 265289 190487 110903 -62123
20195 -62123 -172012 -60285 -13578 -36191 64980 43051 8566 18420 -20705 -11362 61480
20184 61480 126981 74575 15101 -8358 -11506 -15700 81177 74210 -64673 -24555 11344 21362
20172 21362 16421 -104309 -54554 48051 136201 62579 -17962 -71291 -46376 -85085 -122161
20161 -122161 -120552 -106628 -243496 -289971 -269966 -191919 -34455 30575 19164 -106558 -181227
20150 -181227 -215167 -271483 -201634 -69768 85310 188606 263392 252156 278401 200917 144946
20139 144946 124718 160509 156887 86210 6591 -98002 -106190 -94566 15634 44700 -10181
20128 -10181 -20304 -61441 -82789 -75033 -106581 -141309 -107778 -40512 115668 79718 131164 91085
20116 91085 21399 41006 105179 72448 -86335 -192843 -153100 -89688 -26824 -46287 -110358
20105 -110358 -41711 -11769 -13745 60334 47382 14242 -20336 81631 119223 212073 202925 46404
20093 46404 -82589 -1916 114789 198758 79681 -28514 -22293 -75334 -29203 16483 -1779
20082 -1779 -71206 -86270 -66264 4168 20570 70977 193099 48054 -169718 -194388 -114137
20071 -114137 -78574 -2067 83449 51244 59044 140060 42654 -68609 -91033 -195061 -196152
20060 -196152 -79553 26609 145451 185882 150458 25890 -88867 -34768 140976 181912
20050 181912 60550 -51043 -14686 52181 37821 176553 269271 181769 101589 27278 36595
20039 36595 101558 175860 148779 71515 74595 118038 90725 91794 121761 227710 201595 109265
20027 109265 69256 105157 120168 165178 161352 64767 33393 96095 143784 132230 116550 129026
20015 129026 92029 58280 37499 69188 77450 46030 18073 9540 14197 69944 -13158 -54180
20003 -54180 -1128 106558 57764 -77118 -82217 -45336 66449 -13968 -104958 -164287 -193915
19992 -193915 -118957 -48014 -63011 -40379 -127730 -144665 -112158 -21923 -75278 8738 70859
19981 70859 109511 29291 -41618 -32958 -40009 -39114 -121329 -124918 -21260 71598 181135 91539
19969 91539 68470 94439 66583 -62421 -8329 119997 132699 111240 192150 304545 267729
19958 267729 77703 2076 137716 363273 255957 207022 122347 32222 -22521 2722 191154
19947 191154 230721 118272 173174 274418 279916 257458 100404 79816 153268 205146 109574
19936 109574 89381 43370 111711 114401 -6711 -121056 58167 136496 96082 125546 119516
19925 119516 147741 56177 -13184 68730 53564 -33631 -19615 -83163 -41345 32680 85009
19914 85009 53278 18361 32069 48227 48660 -10489 -70145 -92905 -107602 -37091 144505 205140
19902 205140 181708 265764 100403 -36240 39976 159514 171464 213711 195925 213278 264111
19891 264111 286592 360890 317276 286345 220501 204743 261060 154277 47159 38904 25841
19880 25841 75848 63907 150918 146338 84081 63681 68360 57513 141501 158308 74492 110090
19868 110090 192703 374411 439230 401184 405799 695846 1083855 1559324 1993392 2244674
19858 2244674 2198181 1880582 1406042 961655 640365 525987 376701 336312 351527 255020
19848 255020 201677 161382 163878 262259 255526 294980 340239 289911 231391 210460 330462 387125
19836 387125 481140 702118 936198 1283265 1882126 2372557 2503447 2164456 1605378 1107715
19826 1107715 780733 529873 346731 358686 366349 235714 96802 22569 -16834 4826
19816 4826 59157 191339 341769 371351 161882 176490 166030 229718 301420 245532 143300
19805 143300 132688 231120 233616 49280 -62282 12001 133363 182992 185265 140443 -4092
19794 -4092 -57 86331 110915 721 -136528 -169551 -129058 -97779 38209 20496 -8365
19783 -8365 65727 -51453 21159 74862 135690 149774 92681 43662 71666 44308 135455 150998
19771 150998 80831 88600 55534 42468 33605 -93972 -102150 22852 106459 143897 152462 151122
19759 151122 141581 54375 87012 144318 166329 177495 124357 112417 -34107 19581 110366
19748 110366 128069 148590 223971 346000 376685 346900 361263 261567 142255 88320 194808
19737 194808 199517 50423 -31619 31305 -115643 -126161 -52727 -44960 -23489 87264 184495
19726 184495 224094 216300 233941 209606 177724 139847 157780 89164 95987 101749 126415 29818
19714 29818 -102317 -21591 48770 51765 -3339 -64515 -34309 -30995 -49900 40426 105218 92863
19702 92863 85305 -20617 -22484 187644 329055 281067 188403 64549 191708 195477 72880
19691 72880 103452 118472 -31033 28738 133260 105111 105510 30993 -26268 8277 35818 -21566
19679 -21566 78898 61575 -92869 59639 166194 198031 147197 69021 24066 80796 170864
19668 170864 190551 177627 19390 -51040 -27314 36374 76405 -8786 71611 175384 243825
19657 243825 148959 11118 -104299 -76730 -38832 -128124 -159919 -12441 129903 133247 46031
19646 46031 -84171 -134878 -43518 -16849 -57182 -1448 9765 43241 41126 130262 130966 -83940
19634 -83940 -60276 44649 63772 97041 44297 -80697 -164044 -62149 -26185 -33989 60859
19623 60859 139646 263516 360868 395138 351595 255019 188156 129860 119053 219263 172516
19612 172516 29718 -3873 18778 96366 66645 110232 196315 153423 113834 48436 30030
19601 30030 16875 -3470 -25569 -69685 -67790 91383 200367 84599 -18914 9886 -32489
19590 -32489 -60072 -48483 -109172 -88787 37962 110406 126990 189665 159372 131391 152640
19579 152640 135081 115796 81508 178683 139168 135927 151080 254395 317105 337537 192918
19568 192918 38146 29109 -24682 49647 215013 256312 194669 133038 65954 47898 22395
19557 22395 -9910 -69884 -111909 -19866 181301 219617 162538 40627 47260 129457 116464
19546 116464 83627 137570 96745 -28771 38436 -25256 -37520 128565 208783 207434 267854
19535 267854 237122 220064 239983 214714 117089 174894 208672 160602 130934 137651 97939 110010
19523 110010 90564 127452 166099 192343 152565 112484 158351 160196 94925 136552 147816 73169
19511 73169 11111 164652 181407 173321 225714 257834 376689 360409 348890 287354 270361
19500 270361 182613 175388 163764 95446 24339 28431 73660 227729 323739 319469 276881 235612
19488 235612 273153 296660 305756 379538 317277 190482 178037 235109 226382 224277 293327 321888
19476 321888 267503 260880 316142 267837 211148 154485 121829 186426 101734 -14689 -72094
19465 -72094 -40422 98478 164720 85785 140737 113572 94015 83710 158357 129824 96923
19454 96923 170122 256272 229825 258374 375018 374294 273250 285288 375494 543559 590672
19443 590672 410419 384633 465581 353723 197575 164016 65154 136344 280391 205593 99585
19432 99585 193472 240704 106177 75934 84401 104181 131012 165657 133539 93165 99278 92270
19420 92270 39624 73406 206148 307470 387023 382212 349883 321107 230084 144994 71206
19409 71206 77019 182575 298076 274105 215933 300157 328112 352706 302376 154695 -11223
19398 -11223 66761 85821 56375 88813 160478 257262 286764 249767 233704 171458 246709 331252
19386 331252 335128 220103 50400 99850 197227 204878 223833 268931 299214 261047 309678
19375 309678 278039 327200 367525 379542 349559 392587 482672 544779 338682 385227 395609
19364 395609 323955 337004 368981 473349 615218 682900 660800 655324 602299 616395 452038
19353 452038 438164 539846 560432 566255 736790 751456 761562 919250 824852 722434 715750
19342 715750 680246 540129 539064 590589 583463 414724 429050 548415 623104 651316 553407
19331 553407 499320 504224 486950 608041 722363 519973 438576 434159 454975 471825 611570
19320 611570 861073 1017359 1109065 1131638 1062204 1012894 967056 975725 874055 795393 820710
19309 820710 806698 805344 883279 955447 984972 915477 878332 942422 808407 830483 942239
19298 942239 977811 1067678 1019633 970389 931684 1009226 1065711 1126670 1287005 1352241 1274294
19287 1274294 1219213 1346817 1427828 1331458 1327593 1438697 1482452 1587958 1545459 1505207 1575214
19276 1575214 1545216 1484645 1498771 1681036 1783065 1776538 1699386 1681843 1763976 1843771 2041871
19265 2041871 2078785 2171171 2356499 2648578 2846764 2924288 3235946 3541691 3913264 4407231
19255 4407231 4985950 5733717 6595072 7473365 8421906 9786640 11250909 12120277 12094591
19246 12094591 11439924 10655349 9786921 8989839 8483938 8319615 8533631 9031987 9728202
19237 9728202 10685082 12050161 13723481 15800665 18130694 20941286 24275429 28538433
19229 28538433 34576932 43312197 56139530 76216311 109572442 167351409 263825500
19222 263825500 374756140 442152626 423370179 335267171 233440032 153814767 103172779
19215 103172779 72718705 54115071 42283570 34516612 29553275 26381334 24393732
19208 24393732 23501980 23199324 23547896 24418824 25970778 28484168 31722565 36248151 42918397
19199 42918397 53087616 69095576 95058387 139400865 216724168 330977282 430380183
19192 430380183 460718383 397863391 291508802 193003036 125318810 84493621 59942202
19185 59942202 44314709 33794735 26444716 21400036 17806504 15224053 13234831 11377087
19177 11377087 9830140 8691425 7871277 7323970 6855785 6393074 6010304 5877573 6033546
19168 6033546 6156700 6140485 5663235 4879112 4182742 3670450 3421935 3469399 3685783 4025244
19158 4025244 4185202 3878377 3277129 2868469 2482600 2106204 1747890 1534859 1504506 1643814
19148 1643814 1668439 1606428 1484201 1337903 1234927 1156799 1138344 1041611 1133714 1294142
19138 1294142 1164003 1060650 956808 915699 801360 735646 598888 536530 467595 410736
19128 410736 427397 434919 409264 280436 244287 320218 466362 559074 576741 573570 503518
19117 503518 421308 394413 478273 366876 293595 245419 197287 169086 134435 121487 312694
19106 312694 381161 308793 219764 205154 251914 342404 335796 320637 296431 127226 67888
19095 67888 54837 -18121 -61020 94795 265289 287934 276429 255997 205999 225913 192586
19084 192586 125751 136581 166333 229300 329482 242100 154723 108655 15513 72530 80045
19073 80045 104566 161081 22476 -87815 -63349 -35655 -13378 -68136 -37522 52644 48482
19062 48482 112536 237744 136644 99632 127943 185621 111959 92209 71628 -12206 -840
19051 -840 36115 184016 141109 127699 86383 63419 80672 70842 54471 49263 -30877 -30821 23066
19038 23066 8975 -8898 55942 93859 69351 -25472 69710 78397 7331 -4241 82164 93011
19026 93011 81263 51075 -38326 -37091 117524 176968 204391 153407 119360 135680 127225 209706
19014 209706 153047 67143 97603 32788 95886 92025 36170 -116284 -202015 -223260 -251012
19003 -251012 -161333 -46011 -7060 -28678 -46866 6909 13467 -207 -88268 7828 226079
18992 226079 332262 210305 110097 137658 169129 180914 67099 158396 224946 132295 158740
18981 158740 186787 173713 98504 60739 -39129 -18357 37288 17722 14008 -21474 -31194 -5899
18969 -5899 71877 9591 -17723 82542 151772 151976 71018 122584 192079 177263 48394 -133599
18957 -133599 -115852 79626 132651 180250 232707 142913 17336 35024 7736 -73396 -27874
18946 -27874 2345 -83018 -115895 -50777 120007 122775 126069 77782 66625 -78488 -188356
18935 -188356 -74869 -61701 -61740 -181495 -189666 -259368 -179683 -100470 -53444 -7269 75595 81931
18923 81931 118276 205248 98175 98048 109778 45984 4403 107268 177979 205859 200024 116176
18911 116176 34232 -112920 -148931 -63029 -58503 -37230 -73437 23030 82117 27676 7968
18900 7968 -105011 -220583 -173571 26266 10999 -18779 60352 31794 41306 107712 191821
18889 191821 209389 231711 116147 165496 77484 187592 119706 78741 152519 45202 -99128
18878 -99128 -135622 -51812 7524 23613 70405 72551 23060 43551 96769 102185 21301 -12845
18866 -12845 34415 19084 -10316 -39294 -43060 -63333 -43137 42369 189028 241680 128799
18855 128799 85466 62004 169523 103557 -34473 -35183 -3546 34959 87817 807 -41929
18844 -41929 47284 72995 87849 134675 142998 102584 -22939 -188393 -267951 -125781 -77682
18833 -77682 -95685 -89062 22309 75620 -8964 3358 -16049 -103653 -87100 -113095 -18602 -6392
18821 -6392 125528 218664 130153 28360 -27019 1006 -35559 -135644 -94778 -69330 -76290
18810 -76290 -111877 -63545 -49852 -12399 -37105 -181895 -213843 -118978 -94019 -42913 12829
18799 12829 43005 66003 25359 18192 -98165 -194074 -88632 134739 249302 203193 120761
18788 120761 83059 142201 211770 179026 175276 334 -40664 -65204 -122382 -211790 -223622
18777 -223622 -89827 -24841 179391 202342 179113 124162 199341 281917 419659 675217 975605
18766 975605 1341564 1344601 969314 697910 465292 321940 277886 225846 141848 137589 149458
18755 149458 161951 158521 57777 3818 29719 213685 264472 159842 99638 213196 269627
18744 269627 319613 318222 365527 416204 609408 780405 991760 1257268 1648234 2087101
18734 2087101 2345079 2077965 1622124 1178651 911840 688765 546871 344781 373398 269651
18724 269651 155052 155893 96601 172745 214186 225161 222365 154085 157486 194443 211285 313995
18712 313995 393898 501358 578280 854999 1361047 1883398 2264236 2132978 1689913 1114663
18702 1114663 752610 571734 434581 253989 105688 27555 -21425 2852 86359 224788
18692 224788 126585 100026 176538 172634 181626 206929 205294 114205 191 -172788 -164850 -18922
18680 -18922 35053 170234 186688 229758 251740 88238 109356 165916 243720 167418 -65870
18669 -65870 -115648 68085 192431 261372 163014 203278 275217 206076 265233 250429 107125
18658 107125 162587 101256 18087 -20916 60252 154704 125647 80933 109184 118792 198101 82378
18646 82378 45287 71083 89310 44281 87182 72690 45004 102987 119780 78797 128489 5353
18634 5353 -71667 -40608 42664 68315 94861 106800 111764 41078 -9020 24358 15280 41181
18622 41181 73876 34402 40372 104387 198136 143732 113302 47150 -114620 -37268 99084
18611 99084 48574 25485 -14454 28636 15957 -7736 -73391 -8625 43120 88864 84330 188845
18599 188845 319426 206481 148151 127321 79866 85681 126761 181033 124032 79123 135297
18588 135297 197748 231440 181656 168270 65554 83240 159439 284549 394712 706219 1325149
18577 1325149 1891373 2098439 1989154 1711911 1322702 942849 625374 500556 383979
18568 383979 225114 222988 159937 98450 -21793 -124846 -129967 -30338 86321 200122 182864
18557 182864 115381 126043 323973 457361 508323 637854 967491 1385230 1933599 2388082
18547 2388082 2450566 2091901 1599518 1064634 749221 647209 482173 426042 335669 272622
18537 272622 172610 814 -41760 -8606 22073 -50075 -84805 95836 148261 147049 284606
18526 284606 309009 206931 212341 221981 176534 158523 131217 52346 52618 -28081 -43498 -107981
18514 -107981 -60647 -24158 35663 77819 35916 75236 167611 170671 138072 25130 -65508
18503 -65508 -44825 -124252 -168840 -117323 -83893 -21318 56180 123025 85811 90203 124347 192172
18491 192172 236918 197683 213436 276453 282237 165449 72475 46541 7987 -7949 -12190 118957
18479 118957 176733 169504 197211 67368 39290 85539 168156 226819 231964 221583 64775
18468 64775 -60441 -175904 -205989 34434 168893 68700 -8160 -57613 3626 148444
18458 148444 152150 201753 244630 279017 243254 247726 212018 235632 156704 127665 57761 111469
18446 111469 31490 22466 65941 78095 81039 158452 152339 157996 199201 247025 198692 217913
18434 217913 240908 215206 192121 108414 79173 307267 290740 156225 28314 16763 23717
18423 23717 28837 71479 22111 100484 78362 36416 86809 97207 33918 5291 -8817 79300
18411 79300 65410 19140 97821 181915 93374 24154 92926 127503 92825 23950 140406
18400 140406 273882 269273 238527 135733 72679 62363 147248 70727 57259 -53528 -37459
18389 -37459 50858 95872 57922 90635 133478 128259 182926 216988 229382 119548 37517 32375
18377 32375 71130 164560 244028 368885 472181 510172 536249 531769 492030 469582 487151
18366 487151 512436 358092 267596 305302 352703 339428 306793 322490 286331 242865 156286
18355 156286 27788 94608 199213 191367 96888 118340 237014 451107 600795 507253 399282
18344 399282 351751 328417 489843 454931 480163 481605 334949 325672 376424 435316 264648
18333 264648 174557 202056 211167 243305 231432 300241 288786 287934 312818 190279 133778 140943
18321 140943 199004 216639 234614 373239 376946 332779 414267 412214 444218 430418 430971 391446
18309 391446 400063 400127 404903 426455 528446 586872 558799 453285 424349 442232 444231 490299
18297 490299 410307 318923 439403 540421 714088 859477 919358 1084421 1446994 1839984
18287 1839984 2185764 2655668 3501137 5102631 7543467 9384566 9325346 7564829 5387332
18278 5387332 3837260 2926657 2251662 1678961 1480217 1287355 1166009 982756 811751
18269 811751 866318 806293 859216 844953 780141 858643 974082 1094056 1322168 1560832 1916211
18258 1916211 2303115 2910582 4060916 6228158 9031243 10646603 10016050 7892941 5464140
18249 5464140 3828005 2939866 2347297 1897421 1722980 1591560 1603320 1526344 1324753 1213756
18239 1213756 1088507 1065318 979843 928589 954664 947906 924337 885512 881238 960382 977217
18228 977217 951129 837379 809449 834099 802961 817088 943634 956217 1045463 1047421 1039888
18217 1039888 1143575 1221549 1377332 1381815 1145595 1074628 1100278 1155883 1215087 1124683 1078312
18206 1078312 1036264 960093 907432 966793 1009512 961191 893445 951776 1023226 1039289 897620
18195 897620 857750 927700 1130783 1251074 1139984 934088 971943 1084812 1155159 1196804
18185 1196804 1353537 1484591 1502456 1421303 1363954 1423390 1508320 1699379 1813678 1831907
18175 1831907 1718652 1714344 1838215 1814629 1903854 2052038 2163692 2147374 2175893 2248149 2434287
18164 2434287 2500397 2525381 2520820 2531456 2662282 2939759 3119857 3306678 3462618 3765358
18154 3765358 3982217 4007273 4051201 4294010 4486932 4796032 5249511 5692524 6181499 6854516
18144 6854516 7644532 8604791 9893675 11205568 12042141 12374270 12455784 12666211 13186674
18135 13186674 13762040 14429607 15513633 16970161 18776121 20994607 23834473 27233247
18127 27233247 31495921 37181742 44607442 54686042 68603671 88143946 116454677
18120 116454677 160451860 230851794 330941692 419738945 428328242 360269864 274144198
18113 274144198 210039074 173156492 157840619 166849011 210777338 272243388 295533480
18106 295533480 257503927 191245613 131849342 92585281 69640201 57002392 50584820
18099 50584820 48157686 48512614 51155462 56572560 65413914 79259258 99944924 131122689
18091 131122689 181190573 259689714 355155652 406284114 370936217 285876393 204252119
18084 204252119 146339901 106986391 78610168 58281169 44288864 34652789 27766112
18077 27766112 22721912 19161272 16517647 14475222 12951828 11737561 10802593 10208082
18069 10208082 9504375 8891365 8464577 8251466 8341430 8616787 8490528 8074064 7394600
18060 7394600 6523337 5622744 5012670 4485879 4131674 3769001 3405219 3153614 2935102
18051 2935102 2630103 2350028 2158588 2105402 2121957 2150859 2186649 2114294 2069432 1935786
18041 1935786 1855628 1759343 1607332 1482193 1480566 1542219 1559878 1470672 1380907 1226506 1047624
18030 1047624 981058 1002365 1026446 995677 966255 1001090 996651 1052843 990814 936541 886130
18019 886130 993721 878930 778915 822410 795579 796074 891666 857179 848511 787787 627557
18008 627557 655201 658371 565849 626807 626415 604380 517264 501866 509160 525048 502431 565675
17996 565675 648717 536148 393666 260614 46907 138081 228298 301435 210162 178233 297676
17985 297676 204463 120956 112554 155125 159134 242696 375504 369407 296318 216872 193227 156668
17973 156668 94486 113356 212010 227009 196983 218697 62085 114402 136747 53570 93150
17962 93150 176166 100284 105827 110374 207928 144937 167038 231442 209981 294061 286518 223156
17950 223156 237600 289438 281723 326108 253329 240719 249684 307863 223445 88825 123182 134630
17938 134630 93757 159304 215066 201751 137070 140038 341635 344032 350729 329875 274783 100430
17926 100430 -8922 114898 152523 144570 229062 161788 79461 145139 193668 228868 278452
17915 278452 290404 212130 187177 211758 189985 301080 311283 144109 81471 119081 186014
17904 186014 134608 24097 33621 25905 41429 143786 155709 88862 -14077 527 22438
17893 22438 180008 160945 36313 -28715 -45754 29247 27942 69039 47612 55753 117734 58402
17881 58402 35532 74269 194619 150297 47495 -77763 -53139 42268 78828 149944 182418
17870 182418 82416 -58240 -48461 -36247 -58633 29438 39626 -27602 -22614 5882 23849
17859 23849 187594 167238 83300 8189 59702 84533 26728 65107 103909 46630 70269
17848 70269 91777 120495 56010 91105 152640 157328 -4794 -98432 -118437 -167072 -65748
17837 -65748 46946 75585 44577 21465 30146 -14939 21701 22491 7021 24013 60255 47372
17825 47372 -7684 -18976 -95883 -2329 -12810 -99314 -122554 -37959 112097 86750 154089
17814 154089 115910 149444 245474 232117 147704 209447 202696 41332 -67827 -72605 -141744
17803 -141744 -150717 -162005 -39682 -74122 -142639 -171289 -150235 -87505 -150419 -168767 -107114
17792 -107114 37834 -94098 -151032 -98652 -78245 -101329 -183679 -78463 -10767 -125616 -240324
17781 -240324 -235468 -123427 -45250 -100559 -135164 -79530 -138219 -229754 -162014 -119134 -140845
17770 -140845 -182604 -212534 -146649 -147165 -159048 -146817 -121239 -59334 48041 89436 82869 3360
17758 3360 44089 95247 39340 -47236 -63939 -31603 -125029 -121852 -103852 3181 -14143 -158421
17746 -158421 -113415 -64298 -87679 -37859 -50091 -55286 33265 71436 -33959 -98598 -109919
17735 -109919 -118907 -96296 42898 128615 95417 62145 142772 131814 128611 99398 51764 33110
17723 33110 40453 35247 140190 174960 108006 52437 35493 -22453 -11834 58987 82879 45478
17711 45478 104662 141889 86940 87408 122876 112891 237083 272512 198393 111840 79524 8179
17699 8179 91645 146603 138846 209290 293354 407815 310612 139525 210084 292114 216526 109833
17687 109833 108010 249235 313710 180513 147990 263711 498039 785659 969621 1252594
17677 1252594 1609857 2080274 2891023 4155386 6124518 8267211 9120018 8212243 6490898
17668 6490898 4753044 3495596 2591591 2037777 1521957 1187389 1125864 928341 791285
17659 791285 645361 519272 484786 519562 560835 633214 832925 975129 1059729 1112404 1326098
17648 1326098 1801937 2301859 3069694 4422170 6349307 8010504 8292251 7053823 5179036
17639 5179036 3642437 2534201 1758955 1397742 1175246 968828 816502 625276 529435
17630 529435 371209 326885 310221 318736 358819 297030 267354 135703 -4522 -40280 -11453
17619 -11453 18440 39830 91671 142278 104636 87481 -28018 -100895 -72967 1387 62706
17608 62706 129812 117849 99061 -15135 -51984 -156164 -168080 -74986 -1144 -80 -74167
17597 -74167 -93422 -80942 -107469 -194929 -280847 -237707 -151820 -85622 -34760 -25422 -132665 -135995
17585 -135995 -111206 -133292 -57344 -133315 -220046 -110633 -78394 -113089 -56699 39601 2579
17574 2579 -18464 -91 45413 12902 66151 -4643 -82488 -15638 -66051 -51357 -1361 -22396
17562 -22396 13289 86555 40520 -49559 78915 2134 -61197 -58121 -22943 71930 58284 -28526
17550 -28526 -141999 -119782 -167400 -99011 -2458 -113425 -199172 -165601 -92640 -146999 -134249
17539 -134249 -159311 -158812 -149741 -142734 -38147 -25487 -7272 -57865 -40704 7622 193622 216933
17527 216933 153111 16664 30392 98725 36822 93130 46826 18051 102795 168100 72930
17516 72930 -54378 -90262 -118259 -113465 -105123 -69532 -9586 -44943 -26364 -55465 1031 127733
17504 127733 111044 94326 190982 198180 205785 187754 257754 272363 436824 744733 1082476
17493 1082476 1423308 1921195 2203332 2009899 1599136 1175891 893106 722960 631787 463045
17483 463045 313994 171404 86425 91069 149323 234268 165650 128820 171780 112014 55524
17472 55524 75903 325085 374716 419278 580376 794759 922634 1272559 1770445 2144219
17462 2144219 2092281 1609093 1095265 837131 588757 470322 420380 220059 71962 143312
17452 143312 202972 259705 167117 106101 125824 73986 156596 214598 390814 714312 1081985
17441 1081985 1372833 1277460 1028511 726258 541144 430040 235376 47764 -12614 -69788
17431 -69788 -101750 -133687 -26832 -56031 -144672 -158919 -145757 -88722 11083 109363 154056
17420 154056 81856 -43557 -45901 106696 51780 -36318 19644 57680 9611 -50584 -46405
17409 -46405 -122674 -150155 -122086 -200648 -147226 -96020 -155527 -119611 -111653 -21896 15 -22842
17397 -22842 -92124 -184999 -210953 -97343 -23713 -50147 -43965 -113581 -203907 -116824 -79892 -101783
17385 -101783 -84595 -97424 -97902 -62909 -15458 -35950 -82757 21654 -36871 -84419 -30466 -109325
17373 -109325 -123415 -25061 29718 -68144 -95412 -79018 -7568 -18522 -30717 -69944 -130496
17362 -130496 -136975 -90090 10650 37123 -14730 -51939 -95302 -157311 -180043 -85753 -36920
17351 -36920 -72540 -85180 -134742 -90087 -4937 49172 129825 141065 58588 66485 10069 7073
17339 7073 61332 80042 49668 83928 151302 63411 -26613 -45542 29829 -80906 -47810 -68094
17327 -68094 -113159 -160400 -63313 -25722 52277 43136 19066 102389 73311 25444 -2950 5685
17315 5685 135889 249268 252853 189582 93411 -7958 38044 61792 -3860 -124713 -143715
17304 -143715 -208186 -264264 -106095 141279 -9802 -171073 -172479 -139446 -190964 -167761 -121511
17293 -121511 -88910 -94112 -113144 -117098 -132515 -134412 -86980 -110341 -160115 -210917 -237362 -198998
17281 -198998 -186327 -258537 -228226 -134710 -199308 -326165 -311306 -161022 -38949 31151 94972
17270 94972 30845 5055 83295 128952 122589 59351 -1949 78204 206605 250514 234528 26079
17258 26079 26781 10100 25055 46894 6882 -26606 -90056 -73734 -43277 -62980 -20164 -90822
17246 -90822 49250 134550 40845 -55103 -23353 -51050 -91662 -98449 -10701 74049 169328 198823
17234 198823 188906 141944 57981 28681 -44573 -163714 -184262 -102045 -93581 -89221 -77093 -114424
17222 -114424 52147 90404 111425 49715 56662 7575 -104947 -87232 -6315 77056 57906
17211 57906 -6709 -86927 -184619 -228449 -203805 -190945 -209613 -215448 -171834 -115691 -130266 -168235
17199 -168235 -116746 -25283 53376 73374 -51279 -108116 -24982 -17346 -23323 31145 -64893 26567
17187 26567 145274 145534 155237 113770 172616 177064 71222 44035 121455 138930 60474 -49558
17175 -49558 19794 -5527 -28652 16247 -60144 -71324 -58489 -22716 -17992 -108377 -155027 -197474
17163 -197474 -87506 -42875 -69438 -59664 -152959 -59121 32648 -10941 8810 14923 -108699
17152 -108699 -159349 -89132 49027 100597 112543 122106 79199 70467 64560 204050 171481 91584
17140 91584 127264 88294 76640 97593 124253 150689 135850 32892 -50810 -78470 12317
17129 12317 3683 -58982 -81704 -170316 -191263 -80074 -58955 -168750 -59081 5201 11086
17118 11086 36499 41711 102840 -67553 -236490 -308253 -307863 -220159 -164308 -179940 -121438 -128269
17106 -128269 -148798 -153651 -88223 -25137 -114167 -127233 -99481 -29991 74775 167358 207985
17095 207985 218771 154994 143283 132516 67261 48095 91284 263807 267366 88952 -29694
17084 -29694 -90466 -3928 76071 -2702 52976 151105 189839 168732 54321 74558 188812
17073 188812 95344 45684 84685 59140 67216 3414 -62162 -47898 -45831 -156388 -142323 -36778
17061 -36778 6144 149822 247489 229123 201070 132661 2870 -113946 -110949 -36171 -41797
17050 -41797 -82891 -31257 -121239 -313949 -294513 -132722 -18703 -32867 30981 132184 21064
17039 21064 -17182 -38764 -78588 -51166 21588 47998 48967 135468 103751 110174 114386 103705
17027 103705 88261 80441 77819 -8055 -94221 -114625 -40084 -88575 -4831 21838 13464 16663
17015 16663 26205 7314 54832 147870 -5496 -89849 -3966 -32787 -105023 135991 174806
17004 174806 67622 123733 154467 93953 -1196 73989 93174 112877 71435 107354 82756
16993 82756 50808 45813 -175068 -216049 -207625 -173626 -70867 -19961 121921 173936 149611
16982 149611 196105 152572 93647 48897 163221 123236 194081 171300 136307 61840 -31129
16971 -31129 -142665 -237635 -284754 -216651 -73203 -102450 -113724 -94323 -94047 -66247 -108005 -165889
16959 -165889 -56112 -44743 -47908 6872 19170 30523 -50955 -11195 -77086 -145511 -94835
16948 -94835 -73697 -48032 61133 6877 -53373 -115533 -111283 -145637 -135177 -61719 -118620 -199964
16936 -199964 -160028 -122904 -195163 -270652 -337309 -213279 9725 83869 69682 5031 42609
16925 42609 -25465 -64122 12512 -57856 -8368 4069 -32365 -12393 -49283 -144507 -224671 -174538
16913 -174538 -162884 -163598 -83596 -75521 -12841 19465 15050 -88926 -82426 -60614 -219967 -214230
16901 -214230 -110249 -130405 -207907 -220541 -317673 -192993 123232 -14248 -56273 -35945 22336
16890 22336 44886 102613 85077 -13854 -50549 -20921 88082 -2577 -82612 -36091 44828
16879 44828 55481 -155037 -255426 -163580 -140522 -170249 42121 9412 -83375 -52198 -53111
16868 -53111 -16961 46872 -8972 -77385 -111239 -170226 -165886 -102276 -65045 -60005 -106148 -175836
16856 -175836 -103217 -119964 -75825 36014 -10795 -77608 -129789 -142426 -121041 -50605 -2099
16845 -2099 -29594 -125996 -225006 -286356 -202948 -69804 -65683 -44064 -77176 39451 119641 49954
16833 49954 -57750 -193411 -162516 -162748 -172767 -53550 -63631 -174590 -266974 -107767 54991
16822 54991 95175 14845 86555 59410 60694 35282 -60175 -191321 -88268 33205 86623
16811 86623 103394 131891 32407 -4026 23033 47766 4818 29799 42753 -60703 -22893
16800 -22893 -17569 7251 -4546 50096 91809 22305 -90536 -73343 -25006 56329 -37851 -164986
16788 -164986 -215152 -233490 -204590 -56791 71855 142447 153499 52557 -70215 -140341 -112527
16777 -112527 -71111 -35941 -112422 -178767 -185102 -154245 -109788 -25039 -29361 -17436 -94683 -219355
16765 -219355 -240670 -231954 -123990 -54874 -9471 79590 159380 80515 -52286 -1751 -59740
16754 -59740 -130744 87507 38497 -44788 -55107 -52441 -35799 -77170 -29749 -68102 -38093 -71425
16742 -71425 -243220 -233215 -149460 -127437 -70105 -76510 -90925 -656 -9218 -117145 -235700
16731 -235700 -322244 -313474 -231595 -124452 -10689 -29568 -32884 -27941 -22333 -10453 14934 22519
16719 22519 51537 -20366 -13218 -25709 -68173 -61231 -144815 -69800 42395 38810 20121 117553
16707 117553 123766 38211 -52531 -110848 -68935 -4054 58593 25646 1509 -74571 -29289 -1094
16695 -1094 29834 28155 -2304 -29786 -95036 -26952 104155 70626 -103664 -155164 -50451
16684 -50451 24095 64049 54741 110112 73454 61444 12108 103304 178051 135093 60669 -37218
16672 -37218 -213375 -271341 -259027 -143029 -22338 -63644 -74504 -42204 -73988 -43390 23746
16661 23746 110918 67036 28494 -41016 -18475 -6031 -14497 -33432 49489 111568 11251 2945
16649 2945 -1512 -31464 -21033 -21219 -8233 53243 38932 41771 79500 74646 71310 67615 -40352
16636 -40352 -56159 -56189 -76186 -45497 12395 -22482 -132461 -140346 -83430 -133105 -143421 -52750
16624 -52750 -11697 60621 -19692 -142755 -184110 -146091 -136359 -86464 18428 -59993 16699
16613 16699 -66109 -64773 62563 54870 -46165 -126173 -99081 -42037 -5601 61161 78446 51651
16601 51651 174692 114089 129899 178950 35223 -21326 -55023 -61299 -65191 -137827 -90631 76047
16589 76047 47391 -26162 -175356 -120204 -66884 -179578 -167936 -191054 -227501 -246942 -245355
16578 -245355 -197863 -90114 -110640 -119473 -169697 -222606 -119355 -143786 -79385 -87094 -5719
16567 -5719 73690 74228 99098 15368 21204 -34565 -80697 8276 46104 -9799 -116714 -177864
16555 -177864 -176385 -101667 101649 264447 302962 185221 162070 129251 95951 21988 4520
16544 4520 18467 66399 -29059 -82371 -117495 -148337 -150841 -33500 -65651 -141624 -145434 -71418
16532 -71418 59661 77972 57009 99451 209218 172655 164232 177185 188645 230739 243618
16521 243618 177377 34455 -22985 -21059 -6032 -17829 63620 109504 39705 -58846 -72056
16510 -72056 -92742 -172553 -279366 -242161 -60270 29668 38585 18728 45463 17965 -78
16499 -78 -69730 -45782 -121535 -64314 -33062 -69112 -36822 85732 31407 -30828 -12590 31013
16487 31013 94523 124034 16069 27915 50191 61407 95689 187697 146934 62180 66535 131672
16475 131672 122945 41950 53686 17871 -8753 -49264 -32941 -7421 -16860 35588 40617 -55113
16463 -55113 -147853 2755 32298 -2210 31893 102430 169723 134574 110523 41327 -147925
16452 -147925 -145023 -108891 -211184 -216395 -154099 -81010 -31293 3973 9626 -30542 -16052 -20961
16440 -20961 -56951 -88383 -6319 280 40002 58576 94555 97131 56203 -81760 -199122 -221255
16428 -221255 -144362 -124449 -74769 -51851 -4712 34090 60397 49548 64552 12802 -24217
16417 -24217 -69616 -672 15552 -30714 -73561 -144942 -145146 -40867 77269 43589 24607 136560
16405 136560 56143 50688 226925 266770 172449 108965 73988 79823 111188 117410 156799 92215
16393 92215 -11404 -69562 -4359 -19020 -107140 -16263 46750 63480 21343 136757 160243
16382 160243 145067 144481 69302 -95357 -60871 -129576 -132862 -62843 -29517 -51862 -5133 88728
16370 88728 5337 -102060 -137352 -116135 -111930 -119010 -34098 26698 47878 45486 34872 36599
16358 36599 33486 154778 205235 69908 6383 7793 18838 -159314 -188301 -139602 -208735
16347 -208735 -274095 -230087 -145050 -211178 -324490 -232276 -170950 -123408 -107341 -199702 -175666
16336 -175666 -77717 2859 -34307 -258077 -273727 -134188 -133466 -49990 -24882 -103934 -4017
16325 -4017 34466 -27959 -63498 -66553 74179 64582 131400 147686 84245 19355 -90185 -206088
16313 -206088 -265618 -243535 -200312 -51296 -52119 -158780 -100233 -20027 -6839 -100656 -96781 -68056
16301 -68056 -17874 19707 23459 -20417 -33170 -33719 -125642 -241866 -173147 -283567 -283053 -238085
16289 -238085 -219047 -174483 -91644 -19836 -37269 -44777 -67237 -151745 -101066 -19501 -17160 -82922
16277 -82922 -31666 -47419 84202 92279 4664 -37559 -85032 -43752 25708 15883 -66382 -183327
16265 -183327 -214529 -104664 -135657 -96076 -194429 -189729 -176713 -73286 44938 109205 100647
16254 100647 52097 151677 246226 228981 194942 175954 93926 71158 -5466 -7288 -49535 -90369
16242 -90369 26275 103157 45329 -95335 -169360 -143236 -28119 84412 59143 -128105 -99682
16231 -99682 -47307 -17142 -14119 -47306 -166668 -280869 -141101 -11700 -31869 -46834 4933
16220 4933 12236 -110740 -195675 -115191 -134761 -115763 -138518 -210844 -182634 -57643 4568 -46777
16208 -46777 -156256 -130983 -98928 -107674 -41141 37626 86929 39458 -69350 9606 -9317
16197 -9317 19694 -26998 15101 109122 165048 155088 105281 74954 110252 123572 119418 -19177
16185 -19177 -26853 -9028 -6197 40652 -26884 74380 101136 83403 -12799 -44466 -121231 -162139
16173 -162139 -150115 -133414 -194821 -181363 -99341 103186 8047 -144067 -169354 -103136 -35176
16162 -35176 83812 116459 90809 68168 166574 130100 47189 44806 -44123 -157673 -113405
16151 -113405 -47076 -90885 -125313 -211356 -148301 14244 165392 57741 37800 70694 146204
16140 146204 152118 168855 133256 78463 115456 86745 88451 58061 61999 74824 34923 25152
16128 25152 31701 72848 -265 -148020 -176421 -16341 18868 35647 148680 30593 -52787
16117 -52787 -78612 -3449 -65592 -91273 -54104 69532 65008 -13178 29155 -34190 -68211 82372
16105 82372 130077 -15319 -7531 48989 -98059 -98157 -14769 40519 -29595 -78951 -59885 -70542
16093 -70542 -86432 -66352 -76839 29965 86191 -4324 -35609 -49547 -3298 -41908 -92495
16082 -92495 -196312 -187221 -166882 -201319 -144768 -80967 -21204 53657 54942 9821 -25161 -78562
16070 -78562 6912 38027 -23205 -108395 -101844 -64977 -64534 -253 75161 164531 247169 149091
16058 149091 117773 99335 30571 62717 38338 104988 20491 -75736 -51270 79672 131008
16047 131008 98126 59620 -49004 -2004 61698 37124 -141857 -193601 -134912 1847 83812
16036 83812 50962 38065 1766 -86287 -202709 -170617 46637 116969 -51313 -90562 -110969
16025 -110969 -173594 -247118 -171468 -244871 -204561 -52168 39265 73012 70924 17641 21793 68529
16013 68529 51915 -58026 31646 139003 151492 98703 64328 -2813 -82774 -186603 -226147
16002 -226147 -228099 -104947 -89228 -71958 -98136 -46281 20409 -16234 -23869 11409 -56 -95200
15990 -95200 -102733 -74761 -110221 -149364 -209711 -177317 -36482 39860 93638 -6571 -151390
15979 -151390 -119569 7238 -17765 28700 6796 88801 119405 55301 -79573 -64280 82265
15968 82265 77441 -2956 -32475 4940 56363 44355 -61170 -84283 -134343 -110282 -129240 -73503
15956 -73503 -137430 -238107 -117015 -50929 -74158 -101578 -121091 -101719 -150578 -157586 -181280
15945 -181280 -114631 -21989 -92632 -146116 -103585 38029 134217 32101 -91700 -30229 103724
15934 103724 103420 -30041 -15005 -54089 -107886 15112 117733 8268 -13619 68265 72005
15923 72005 -73180 -158515 -111422 -107664 -88901 -84362 -135537 -127241 -58967 -29599 -114718 -150195
15911 -150195 -194705 -221708 -184556 -201115 -176975 -165251 -98486 50811 113361 159086 66864
15900 66864 -12583 -44097 -66797 -43041 19209 104103 197502 155318 49307 50977 22469 -80884
15888 -80884 -92880 -10732 17950 124791 49853 58324 104032 71448 -2883 -14881 36888 35360
15876 35360 57920 65822 146074 173544 159289 51875 -54294 -79334 -17626 -21053 -78358 7571
15864 7571 34050 -41702 -109681 -209576 -207662 -94158 -95331 -36989 -32514 24642 -5893 28533
15852 28533 12441 3736 -7120 10479 -1869 -81693 -90949 -152348 -90856 -80742 -133516 -151491
15840 -151491 -93344 -93042 -80291 -69936 -96835 -43214 30644 -71138 -156082 -81604 -74363 -130120
15828 -130120 -201714 -278191 -312932 -262639 -146097 -55121 -5935 -58244 -52155 23937 58239
15817 58239 45306 22018 -13950 -87585 -98079 22784 31073 -53208 -111045 -86550 -53504 -146677
15805 -146677 -184012 -125129 31942 102576 63274 25717 -118560 -156749 -191299 -103899 37081
15794 37081 45913 -10419 -44294 -123806 -201918 -208311 -218318 -221564 -126035 -17375 45824 14455
15782 14455 31767 29513 -54604 -56965 -9056 -75756 -3889 153048 83042 92364 120521 75621
15770 75621 35141 968 122184 71615 67284 104208 -3814 89058 166455 113790 60920
15759 60920 -16716 -102609 -142457 -71153 -46701 68571 61641 65379 -70409 -112603 -106047 -67709
15747 -67709 12443 10407 34578 -55088 10341 -13414 -18561 23300 98038 222127 239673 75285
15735 75285 -50875 28106 -16227 -44952 -46341 -19731 -91914 -113658 -113496 -171638 -157107 -110530
15723 -110530 -18048 -78989 -3815 99840 6064 -69247 -22774 -30850 -146324 -61379 -11715
15712 -11715 -69109 -623 38507 15774 -20305 -108775 -164901 -25457 103707 14805 -56613
15701 -56613 -120782 -61640 -77301 -137414 -61841 48380 113236 -13330 -53651 -89316 -138269
15690 -138269 -154041 -107023 -9844 80198 -4820 -117504 -226758 -253617 -169216 -4044 9884
15679 9884 15103 -89711 -70661 -17204 -72582 -48081 -185908 -242232 -247925 -336564 -376109 -286088
15667 -286088 -170606 -134816 -104927 -105466 -40361 64358 156610 261017 284929 177496 172562
15656 172562 199807 89752 4408 6423 136410 62297 18261 9820 -17706 28872 34365 -41274
15644 -41274 -13866 60089 -25073 -107190 -7687 -6429 48702 86202 137982 117747 -65646 -65645
15632 -65645 -77820 -6880 51251 21769 -108614 -169535 -155817 -130701 -200179 -113315 -113793 -98204
15620 -98204 -186660 -181179 -199153 -129659 -134745 -82614 85812 118237 27993 -51859 -90924 -100709
15608 -100709 42709 161086 113526 128840 124185 218785 216632 236773 194903 163047 190062
15597 190062 164260 161848 187711 125034 219831 214577 216186 218040 182193 118068 36374 132360
15585 132360 133386 7490 -31674 -37367 7142 -36008 -106031 -159647 -108281 -61178 -53395 -90554
15573 -90554 -58514 40790 134058 107834 176656 149811 30633 69298 141241 -48379 -163393
15562 -163393 -198701 -84361 -2058 123797 108003 135487 112029 137809 71141 -100198 -97537
15551 -97537 -165397 -297883 -263031 -186936 22221 29920 72356 119369 56930 -55787 -21621
15540 -21621 -74556 -47080 95759 184256 162330 38831 30981 42894 -58547 -144453 -100734
15529 -100734 -9171 -21275 -88300 16847 38237 6235 -141159 -202260 -226740 -100754 99941
15518 99941 62819 -79866 -166356 -189212 -74815 33480 37240 12602 -28744 -90183 6902
15507 6902 -27898 35365 -36237 -13190 121916 105509 159545 239448 239123 145453 119549 245213
15495 245213 252714 155309 109083 4357 -53844 -133469 -24353 27331 94706 100556 120178
15484 120178 147768 167584 174573 240642 166195 112388 148245 101854 27371 -30124 -10111 -45623
15472 -45623 -78402 -2551 46357 -14106 -8911 -29432 -14973 -18037 80396 54100 -30830 -173893
15460 -173893 -201602 -120110 -12518 -25273 -2405 -42327 -95951 -158766 -151801 -98320 -113738
15449 -113738 -8282 189123 279536 312440 202214 161103 57027 -69446 -121487 -117322 -87020
15438 -87020 -105796 -28283 -28122 53605 -17338 -77489 -102027 -168036 -217034 -223412 -94873 616
15426 616 -69281 -60629 -43182 -66969 -113258 -88491 18485 66495 -24723 -96582 -161700 -191054
15414 -191054 -131463 -83648 -69604 -172351 -171033 -215818 -322686 -379309 -334611 -168965 -10788
15403 -10788 49285 18759 16151 72480 14135 5916 22172 99888 34894 19991 89014 113734
15391 113734 159177 122250 157617 119081 88059 -37522 -121632 51223 220164 295789 263170
15380 263170 261941 176010 55918 -91543 -29463 -119142 -176504 -141448 -86079 24450 24958
15369 24958 -60440 -79568 -14654 17078 24465 -52292 -17744 119215 113181 106349 92362 1808
15357 1808 142477 160976 80820 -11336 -94365 -123853 -140873 5636 91755 -23127 -125726
15346 -125726 -207059 -262252 -182424 -69417 -116456 -169339 -87274 -176836 -242570 -259053 -222946
15335 -222946 -56643 -12360 -104099 -60363 59411 45885 -11038 102894 131964 143503 190912
15324 190912 139735 -6500 8761 64717 69839 149430 210569 133721 50343 25464 107924
15313 107924 59177 -7568 -48261 -51461 39538 110692 129990 66320 57586 -27248 18504 112625
15301 112625 14769 -11122 -67685 28267 78793 33221 -20109 49427 76874 172558 89430
15290 89430 -126973 -203979 -146982 -81735 -57591 -92386 37933 68245 59284 27833 -77408
15279 -77408 -83875 -63608 -111445 -57992 -223823 -225666 -146297 -36659 -6714 -132095 -172395
15268 -172395 -184492 -105867 305 38208 29027 30949 -11958 -104710 -97462 -125535 -8310 1282
15256 1282 -982 43799 99130 37654 68636 130173 240635 144101 192166 216589 287460 309697
15244 309697 296037 231048 2945 -74449 -15786 -97344 -55741 131724 192324 207779 138655
15233 138655 70262 59203 56304 78929 89891 128701 102443 -6865 -114560 -174284 -185424
15222 -185424 -180404 -157511 -8949 16189 -13029 31009 6640 -56090 -98217 35026 123566
15211 123566 144113 142903 91566 13534 -28825 -52601 34971 34629 -49736 1907 61953 114447
15199 114447 174505 133689 -4424 31951 53158 29515 124564 121696 95239 -102899 -241338
15188 -241338 -207969 -36510 -122090 -118105 -68381 84892 304598 132977 -105102 -84936 -53948
15177 -53948 16500 23512 -87639 -128319 31067 54154 127720 -38249 -88451 -172749 -91578
15166 -91578 -59667 -50747 71174 29155 27478 -53251 -64702 75112 128778 -21055 21775
15155 21775 47860 22188 19099 -23591 -159775 -186963 7649 -901 2895 45383 33413 -59693
15143 -59693 -101925 -122091 -93823 -42969 118105 113635 198525 159199 177449 147874 160990 115265
15131 115265 22387 12272 10053 -84689 -147355 26624 60157 86799 116794 94289 120110
15120 120110 113826 123692 150994 60344 -120587 -238567 -37199 -30760 -15634 -52045 -34437
15109 -34437 36072 -49842 -86114 -61470 67709 41696 70597 23283 -8789 108136 108694 45746
15097 45746 152034 173480 138899 142497 22076 -85534 -148593 -92768 21075 40527 85730
15086 85730 -9825 -161409 -130815 -15857 92232 93822 96375 -46138 -114628 -81899 -146215
15075 -146215 -183430 -19097 55447 41028 51914 99762 74859 35964 38124 54090 68499
15064 68499 66714 53797 -39123 -153694 -147353 -160472 -118740 51929 137671 104620 -31357
15053 -31357 -86344 21620 127376 38393 -56769 -87482 -72633 30436 108251 164846 216632
15042 216632 45980 -16951 30033 -19569 -116648 -125319 -57151 68005 123974 149326 194047
15031 194047 230219 177551 128513 99877 10444 39581 95613 145718 54556 36178 90663
15020 90663 143914 182577 131202 165841 114685 -5930 -24614 80294 140799 196386 306317
15009 306317 387286 518878 693091 703388 957694 1541912 2485106 4041886 6334144 8023031
14999 8023031 8118661 6416089 4240068 2572445 1532662 984814 709469 581812 422706
14990 422706 285901 251504 228158 161921 95496 74351 77353 76782 73896 50730 125136 99816
14978 99816 72438 -77193 -156737 -36535 23992 13346 106471 270018 192575 35445 -54263
14967 -54263 -40956 29087 141442 77783 60271 82999 180099 134465 61266 28586 10254
14956 10254 15167 -7432 170993 241459 252430 264420 111934 196438 217148 77568 74849
14945 74849 171837 199113 156530 106642 55456 45119 92162 142600 74540 -81825 -104489
14934 -104489 -63071 -106368 -67558 -18565 -91618 -53443 -23672 -131972 -111267 -135325 -153099
14923 -153099 -91035 -12435 112733 183419 100077 13016 -123687 -183597 -234841 -223153 -163666
14912 -163666 -146418 -120199 -110620 54084 135471 212001 232848 143136 -23204 -63584 -109017
14901 -109017 -172248 -138123 -59636 -47166 -15815 33475 67034 57916 119299 133153 83335 31593
14889 31593 80415 96194 29130 34299 59205 -15204 -145641 -38150 -15554 -51195 -119944
14878 -119944 -148886 15003 94112 -2501 -48409 -59600 -77328 -112449 -84141 -94467 -84009
14867 -84009 -52213 -120864 -64778 -11165 54053 50901 35888 21796 -66407 -68741 -130185 -145138
14855 -145138 -141183 -121907 -116425 -194687 -218343 -164723 -140594 -261008 -218041 -133618 -56960 72773
14843 72773 5443 47734 93654 113973 67323 -43915 -34397 -51381 1474 14803 -111063
14832 -111063 -125114 -89028 39515 29412 -32256 -50645 -151267 -142655 -31482 -27118 -34739
14821 -34739 -45187 -18625 -27153 55211 116547 174701 105296 -18478 -34475 -5207 -56645 -49758
14809 -49758 -5660 108421 127771 -3603 -82808 -122215 -166844 -31804 21428 -2654 -6332
14798 -6332 -57393 -30783 25460 93000 114890 57033 1873 -84344 -177269 -130504 -74925 -33990
14786 -33990 76358 221387 191221 120874 160532 161479 200272 235951 207913 92939 112187
14775 112187 170850 236241 251222 193911 137517 82202 140174 89802 105714 116482 124703 121301
14763 121301 80067 -42594 -4325 42727 64878 26123 -78383 -167605 -216527 -147508 -84198
14752 -84198 -59923 -69659 26584 14194 49711 122684 90910 89882 128611 125215 66072 -24832
14740 -24832 -21602 16728 -122367 -206396 -207016 -221343 -182572 -85250 18015 125846 163762 148052
14728 148052 12203 -22781 -101390 -96799 28267 102480 85680 54889 -86714 -154898 -176556
14717 -176556 -205400 -139779 -159864 -155712 -105172 -89267 -123217 -97677 -32352 29110 -60890 -149461
14705 -149461 -105632 63712 193274 198325 111309 -102493 -172913 -91448 -50752 -134864 -125796
14694 -125796 -41052 38058 90855 88705 82940 5032 -59818 -106409 -155413 -125332 -112975 12973
14682 12973 69920 42009 14100 -71014 -178936 -212302 -193467 -209802 -155710 -38553 -19984
14671 -19984 -86263 -74068 -52807 -137153 -181433 -102334 -75040 -30553 -21289 7718 126497 120313
14659 120313 23665 37016 147000 198428 213451 178490 83195 -89510 -92087 -6071 -107600
14648 -107600 -138826 -60313 62755 129698 302099 307695 235791 200902 18744 -139314 -35933
14637 -35933 136512 119457 105411 57647 11857 -92354 -58050 -64668 -173436 -174764 -144294
14626 -144294 -85079 -198467 -307717 -157479 -86504 -79130 -177998 -125618 -35437 -79749 -40222
14615 -40222 120550 210207 209072 117021 24309 1181 -51112 -26262 116999 100222 23431
14604 23431 -35389 -56616 -97958 4034 27675 46309 3309 -1432 -4720 -45406 -64455 -104305
14592 -104305 -159205 -147162 -68051 9687 158292 159987 189274 187077 88644 -26182 -11196
14581 -11196 40049 -34659 -92641 -103325 -212172 -304254 -284751 -167484 -58787 -43596 -71053
14570 -71053 -165184 -129992 -39775 -12995 89668 61895 80140 4598 -35436 -74254 -177351
14559 -177351 -176403 -129502 -57563 104693 193888 75046 10036 31859 111781 67420 75891 -1779
14547 -1779 -69002 -48074 -8110 -55205 38421 85253 -40950 -72275 -57554 -45238 -89550 -46634
14535 -46634 -52627 -17273 89152 226549 151954 46306 -3705 37540 -23890 -199320 -148778
14524 -148778 -114069 -59308 -50771 -21877 -13864 -85929 -97775 -53780 48777 46684 -29637 -132058
14512 -132058 -2361 89832 109995 120464 -15762 -137676 -187976 -170103 9886 85546 2939
14501 2939 -81094 -93565 -39258 -43720 -21602 82413 126719 206691 383621 273220 146815
14490 146815 72909 160446 274495 228722 114342 97999 14244 -106438 -82397 7830 20508
14479 20508 13363 20274 -98167 -111040 -89973 -26397 -49797 -65399 -35029 -3466 134235 167234
14467 167234 49841 45472 -47069 -170970 -150112 -53700 107927 80174 96416 57804 47253
14456 47253 -45137 -94626 10924 54579 85006 63345 16042 30516 68416 -121859 -184768
14445 -184768 -240311 -128942 -9246 -68620 -110856 -124383 -177465 -146457 -177155 -69689 79936
14434 79936 297330 259829 153689 49164 21073 113828 42739 -138661 -121506 -38924 -112491
14423 -112491 -46322 19435 -28239 -90167 -18203 69540 143426 207861 170935 37065 1362
14412 1362 -24601 -103581 -79103 -24510 46100 37802 23503 -36942 -68033 19351 51687 -71997
14400 -71997 -93780 10424 34578 68073 42305 73925 86389 97113 85031 139862 166703
14389 166703 201119 107959 68217 58969 -33170 14188 227632 139873 18537 -80346 -86525
14378 -86525 -63039 -57206 125154 199318 144036 148807 25368 51060 100538 75984 43350 -63142
14366 -63142 37820 182218 191353 112608 -53627 -249101 -275605 -239743 -153251 -87972 -62472
14355 -62472 -8978 4947 83243 147752 161053 91235 105550 96676 20011 -57927 -65471 -187708
14343 -187708 -192266 -69929 -55091 -19292 -62674 -15192 60219 -42862 -44589 -102363 -87991
14332 -87991 -181614 -220282 -146891 -121529 -46413 -1256 60290 -4875 -93303 -76783 -44516 -23212
14320 -23212 1862 190478 262161 229683 159183 42334 43339 -15545 -25604 -838 -91958
14309 -91958 -72047 9662 17659 15466 -38877 -50055 -48185 -33375 -79762 -65901 10116 39236
14297 39236 117524 159984 81284 111492 178292 241420 245381 266809 325901 254135 152206 207831
14285 207831 121436 3096 35917 69331 155662 126242 11108 -77513 -106581 -154462 -207988
14274 -207988 -121710 -21133 -35246 9153 49356 -1032 -95413 -87008 -28641 -30617 -22387 -45156
14262 -45156 5401 87723 123012 110276 93642 -78714 -126597 -91483 -68912 -157168 -119818
14251 -119818 -52969 -11324 -14569 38356 48761 1623 2917 -46619 23794 -75993 -100688 -68477
14239 -68477 -1166 -6472 -51124 -51842 -138754 -165642 -95365 -131680 -153108 -212922 -208833 -238490
14227 -238490 -189540 -8625 55532 60820 4260 -7570 -59791 -97282 -172319 -170048 -143529 -182898
14215 -182898 -203221 -116829 -71173 -101324 -123265 -70860 -57193 3697 62984 61800 108375 76596
14203 76596 166217 105467 -54659 -147285 -64866 36035 109616 63890 19573 -8126 -18864
14192 -18864 86215 27831 55092 44865 72723 96574 70128 34673 62683 168916 193590
14181 193590 218727 191520 35116 -49775 -99325 15983 -41556 -58816 97577 60362 -66250
14170 -66250 -133786 -196467 -115855 -75554 7059 21670 71947 55240 42925 -3125 -82859 -138694
14158 -138694 -61980 -67729 -137292 -270320 -154537 -36289 -74808 -160082 -168191 -124772 -111267
14147 -111267 -98896 -148098 -61159 52631 86118 31901 -68831 -49670 92701 12526 -101182
14136 -101182 12005 23814 72924 96356 86392 92770 4918 -61876 -9027 -1795 -38790 -36135
14124 -36135 -29192 -35029 62131 38884 35660 185123 122337 22219 -36151 -129213 -65685 -32608
14112 -32608 18822 -28678 -66080 45933 113441 54858 91132 36986 37502 48040 -29393 -19603
14100 -19603 -13309 -12939 -155212 -64887 1227 29247 13815 -51502 -139689 -77172 -91493 -135955
14088 -135955 -40636 96214 114780 82294 178041 152748 59494 19148 65734 193969 273713
14077 273713 340777 245107 250039 290512 303243 196909 64343 -13372 21098 -47601 -35847
14066 -35847 -28173 -70351 -107261 -101350 -109843 -149794 -59834 12452 31444 67383 80784 41369
14054 41369 28350 -96027 -60387 -61142 87862 251771 206951 99479 151592 77560 18676
14043 18676 -137330 -243935 -171375 53901 129624 65912 -59266 -189343 -125762 -11662
14033 -11662 -127839 -233287 -231934 -146752 -149526 -231626 -256727 -192932 -65046 -58919 -173441
14022 -173441 -138314 -55206 -62293 -31112 -46390 66623 -2012 -3081 25794 28941 113154 34662
14010 34662 23366 43045 -12345 -74452 -86531 -66574 -55376 -1062 51635 164148 225636
13999 225636 112953 9656 -19787 -36624 -30450 -11991 33025 94440 181297 243773 269391
13988 269391 199154 108732 78475 93280 143471 -12846 24857 55619 13778 -142572 -201210
13977 -201210 -78097 -63957 -76123 -49816 78609 84460 -57195 -183028 -221891 -226828 -147934
13966 -147934 -127657 -147492 -216321 -223891 -133999 -53773 -4596 -46212 -97820 -181192 -146555 -175624
13954 -175624 -165090 -161655 -179613 -103966 -91782 -48309 118072 153516 140511 175891 252422
13943 252422 296176 101723 45417 91588 93861 125621 -6047 -5960 -21260 -78670 -27470 -91814
13931 -91814 -165246 -138370 -135754 -140078 -59175 39518 50405 -40902 -98371 -81173 -78613 -47407
13919 -47407 10890 122426 169361 243024 194410 126196 8605 6858 50770 83404 -4247
13908 -4247 12021 62046 27350 -117515 -94482 10137 143537 233673 165117 90480 2345
13897 2345 35523 -43074 -105696 -87717 -61256 -168249 -155389 -215026 -204004 -108743 -171761 -150690
13885 -150690 -127521 -16064 120909 81577 77847 52090 3609 32578 -30381 -157745 -135709
13874 -135709 -128151 10133 82034 41917 55810 6058 101964 42462 -34899 20388 84832
13863 84832 62195 120801 146459 151533 120043 -73293 59225 119574 75652 61871 162456
13852 162456 252424 62460 -46362 -45559 64486 117380 206444 175403 17592 39874 83805
13841 83805 154624 217022 226680 237733 84462 -105845 -85730 -98018 -50734 3044 -36524
13830 -36524 -26036 40205 60687 -18979 -82105 -153602 -289287 -344806 -361693 -367216 -216199
13819 -216199 77415 70073 11843 -84478 -45663 -104932 -114919 -89067 84761 258681 238298
13808 238298 148172 21916 -42467 -44039 -11170 9457 41023 -3541 -33494 25667 -4631
13797 -4631 26352 4332 14416 -11770 -126560 -125719 -60069 133481 166959 149296 66609 5516
13785 5516 -88471 -37382 1984 90505 51505 165102 290104 208373 -6926 -28595 63998
13774 63998 125364 141759 185945 117465 98956 180364 137644 22552 62342 70648 10887 15084
13762 15084 -75059 -116776 -34444 58919 28820 57979 67 -69314 -127672 -77854 -61373 -64828
13750 -64828 -42568 -60425 -100895 -5035 -7687 -59675 -57730 -26313 74901 15025 -83733 -154091
13738 -154091 -105550 -26819 -34819 -81113 -89616 -58681 -96566 -45514 -48857 -121804 -176776 -68390
13726 -68390 32371 85398 54233 17969 63789 119717 129692 93881 89968 42999 149330 144055
13714 144055 43336 -94012 -88396 3742 49807 55656 112394 138721 104627 10262 -71903
13703 -71903 -63886 -33631 48858 88518 171034 218750 193415 -18376 -161315 -83254 -159621
13692 -159621 -153520 19793 52695 15650 -6353 -1781 -17682 80670 100477 122109 87367 10418
13680 10418 -34544 -81964 -94662 -94798 -125768 -89057 -68224 34792 166679 96001 6600 43351
13668 43351 118129 108296 107875 44060 -21554 -138948 -97595 21436 -26299 -122954 -23585 23862
13656 23862 30255 36718 -59349 10588 67589 140181 258916 199123 77920 74931 163143 110836
13644 110836 87423 114487 114116 69622 8715 28257 99643 -13405 -64326 -70556 -77839 -41985
13632 -41985 49712 24459 39614 -171645 -214161 -88496 -89273 -89034 -80914 -34349 39679 31517
13620 31517 -46362 -39629 34076 77153 110901 42591 71089 144993 151440 154990 29325 65897
13608 65897 52757 37529 121530 211923 100987 -6454 -40292 -50439 -115940 -154338 -236143
13597 -236143 -192931 -44641 21188 -119390 -221633 -231282 -177892 -159393 -92366 -37626 -61498
13586 -61498 -93097 -58822 57633 15641 -86575 -190965 -122137 -16717 75999 95595 25273
13575 25273 -83743 -113854 20225 53910 -58232 -140713 -175819 -103893 78854 29439 -106992
13564 -106992 -205153 -113286 30792 -26811 -75870 -53225 40005 65492 163220 162957 77110 74291
13552 74291 115779 50455 -95491 -109682 31197 24248 30110 28652 89993 206178 145199 -24749
13540 -24749 -165993 -164211 -21858 34472 -22085 18149 -3830 187731 290582 270825 181356
13529 181356 34523 -157448 -249883 -174383 -71718 71335 159205 155803 88890 57190 191103
13518 191103 281788 345679 279803 122192 37371 -17069 -64385 -26807 1048 130178 113717
13507 113717 20962 71184 57920 -46916 4974 56162 165205 108844 79692 139183 84284
13496 84284 63316 104786 108860 28937 19229 -7763 -150991 -175281 -7189 89324 -5915 -37331
13484 -37331 -27095 84714 131868 96448 105966 211513 149852 21499 57654 93905 82201
13473 82201 70854 107425 47528 -18993 51506 55376 -3331 1650 138685 220218 211256 244071
13461 244071 261345 359024 302979 153226 99324 93981 -105241 -205023 -193218 -177362 -20719
13450 -20719 130687 135581 73380 32492 -29741 -11389 35827 48948 27438 72966 37781 -92690
13438 -92690 7468 73648 134064 84889 47599 49388 69622 162171 67891 35203 24021 69922
13426 69922 161553 120258 71023 173999 289166 317915 330100 247690 226094 261688 299436
13415 299436 170167 124425 168902 116466 43303 -36479 -9921 39489 25446 -26826 -3649
13404 -3649 51533 120206 175998 136440 53344 132859 30721 17396 -8949 -37615 -158035
13393 -158035 -228279 -104754 -21197 25460 -8016 1219 -56334 -56386 -83351 -17843 73708 88603
13381 88603 18175 -76376 -26945 41646 9539 -63433 -17009 71578 25847 -35965 -28980 -41772
13369 -41772 -18265 39832 51157 -2981 -62398 -57114 35568 151022 132615 18073 -27270
13358 -27270 -24011 -23952 4493 72442 -52472 -136031 -182463 -151371 19314 40024 -75319 -118915
13346 -118915 -153932 -33625 62686 78633 178549 222670 69475 15682 -22223 21065 116964
13335 116964 33130 -70839 17359 15078 -94446 -17133 -95441 -239363 -177663 -146815 -85498
13324 -85498 -115390 -69674 42679 -58869 -207461 -268518 -180335 -174284 -119853 -33731 -41985
13313 -41985 -7801 87037 126489 123209 145394 150993 81991 -2214 19807 -6222 23350 73774
13301 73774 14049 -56648 -38169 38233 28276 77053 -61060 -172159 -120389 -133978 -35804
13290 -35804 85409 15547 -56134 -21181 -132731 -42255 12724 -58014 -49079 -25730 -168334
13279 -168334 -148098 6956 90446 21700 -36358 -60218 40640 218340 199659 104226 1787
13268 1787 -21118 17102 4796 -34772 59130 89805 41940 -68661 -94054 -89180 10696 187843
13256 187843 192397 36378 33302 101622 113547 30258 -1652 -21723 15334 99351 104105 183528
13244 183528 56641 20950 75836 104401 91123 -102348 -146640 -95598 -53315 -69186 -83106
13233 -83106 2637 -20166 -140264 -157796 123470 269498 335576 278404 244365 127509 19087
13222 19087 -43913 -71136 -33814 -13845 -78939 -54122 -51308 -117497 -103200 -21006 83909 31534
13210 31534 23413 -74349 -84279 -111085 -191381 -121391 44183 56838 67086 1692 37916 33695
13198 33695 110826 168184 121413 72434 -100279 -119479 -70729 -129393 -112287 -130402 -90241
13187 -90241 -135998 -16620 14076 32137 94048 78704 -59553 -126346 -15746 83655 -12889
13176 -12889 37933 109637 42323 -25650 -26322 99783 100252 92519 14181 72238 -2294 7159 25333
13163 25333 -12761 -151325 -230697 -161111 -83034 -84680 -64259 24857 160595 193730 163975
13152 163975 85385 96600 121723 127571 68402 33263 61941 128365 103417 85016 119836 168994
13140 168994 96703 29462 21720 -76917 -112888 -162610 -253130 -169202 -55654 -40637 14667
13129 14667 57326 -13048 -4659 37627 -94044 -225389 -60954 96663 -16618 -21808 27199
13118 27199 106025 118498 116297 108910 136458 39778 81590 64009 55833 50061 18833 130140
13106 130140 239457 252007 181206 -34227 -113763 -209668 -103877 185921 218345 11574
13096 11574 -56395 -118929 -70501 -116391 -84525 -31257 -24837 106952 169994 61611 -11393
13085 -11393 -14846 107834 90242 88115 131439 124202 35168 80021 198207 98726 -1996 -96458
13073 -96458 -28422 9133 -59451 20427 45953 21717 101803 158761 163873 78500 -3154 -58444
13061 -58444 -41579 6547 -17374 -8580 182113 185801 106128 107950 70122 116672 187933 100615
13049 100615 129604 169029 71049 -78567 -38120 -29707 44981 39362 15436 69313 58425 93786
13037 93786 99204 165548 204943 112559 73354 -8209 -8707 96141 157624 167211 187255 208959
13025 208959 150862 156017 140109 87527 15380 -56812 -78624 32510 58469 38029 16123
13014 16123 -32464 -104444 -130222 -39669 21786 -12015 55405 58386 17599 -32110 46225 59067
13002 59067 123968 77765 -37704 7076 -5123 56406 7539 -51351 -113197 -157768 -153348 30183
12990 30183 146230 222769 149336 53853 -16866 35231 35406 -143688 -185267 -165541 55141
12979 55141 139460 116859 144901 131294 128959 71995 -57234 -161647 -69171 77364 116363
12968 116363 -39852 -115237 -46618 655 3693 -24264 3055 -7879 -22292 78590 114938
12957 114938 110318 110085 122982 188929 185706 -204 -128532 -173674 -97485 -3632 -21793 36112
12945 36112 43261 29796 -28812 -86047 -93942 -78311 -8863 -17277 59502 105873 -39820 -3305
12933 -3305 62220 75528 -22190 -10219 71316 50281 -19193 -33882 -133591 19387 100327 105119
12921 105119 147499 85116 48646 148297 86889 30248 -19842 19261 105924 38486 -6621
12910 -6621 26139 27181 47381 144255 157977 200021 78293 -5145 -49676 -65787 -88596 -84047
12898 -84047 -12770 -29752 -800 -91058 -91561 1026 46443 42357 -43126 -10295 -92033 -81915
12886 -81915 -27651 -140179 -110806 -6051 3766 -118765 -74929 8638 3966 -78445 -30981
12875 -30981 45516 46189 97406 79232 72983 56081 -29969 -200165 -150497 -72804 -102492 11998
12863 11998 51453 111160 100065 51435 -821 -21785 -83473 -33489 27405 118770 163208 153045
12851 153045 29547 -60114 -69417 7242 106915 70362 76816 28811 -20923 -26854 109972 88134
12839 88134 52962 1197 -88751 -99068 -80384 -28937 -7207 -43862 -163567 -276505 -245764
12828 -245764 -79455 -159902 -101309 -830 151155 308549 351491 322463 212456 72248
12818 72248 -45046 -86296 -3203 59736 13406 109207 51178 17626 55097 -15957 -68364
12807 -68364 -41156 11430 52459 -72170 -18003 58644 60114 129446 88808 17557 -15736 -108798
12795 -108798 -90301 -53238 -76400 -80478 440 70829 10595 -89358 -138982 -41445 -16050 36993
12783 36993 -18275 97566 161728 24255 -86797 -47750 15688 89625 53049 955 -66734
12772 -66734 -74926 31785 103200 43677 -14910 -4861 -76439 -109932 40047 115449 94699
12761 94699 85885 151430 134543 20426 -17560 -1752 21041 78516 23209 -36725 -25486 -60336
12749 -60336 -49765 111917 100755 83349 95695 82981 -62380 -77565 -67473 -25330 -38134
12738 -38134 -144553 -207190 -94366 -34534 -120445 -101738 -61085 9667 -5140 -32750 -4660
12727 -4660 -38178 -96329 -78536 96733 191323 202480 115454 158186 68474 -48869 113695
12716 113695 241403 145744 68494 -91882 -67581 58380 64681 -28329 71261 129522 104924
12705 104924 40732 12817 48175 55361 30844 -78152 -166203 -170042 -173398 -63766 -14147 30819
12693 30819 49073 89581 35409 -11975 -36787 -83167 -163781 -117718 -120898 -208643 -78438 66697
12681 66697 43531 -38805 -121857 -104900 -145095 -45905 -6503 -5544 27448 100274 42221 53720
12669 53720 99487 160677 94506 85480 43907 65173 159747 109226 13903 124897 137678 113599
12657 113599 62303 810 -79928 -56311 -14357 -14593 -20565 -7766 -22969 14955 92453 78994
12645 78994 -9255 -101712 -146707 -75012 62150 93738 -62702 -154626 -181208 -189255 -161784
12634 -161784 -140240 -75966 84152 127133 158321 225978 196070 101204 115201 148212 39152
12623 39152 2439 81333 151717 158829 132500 62362 -116310 -98468 -111715 -35106 66643
12612 66643 81394 155118 15373 -75861 -2762 83964 111475 96659 203233 304979 317084
12601 317084 216493 175677 169161 262223 120524 47093 195822 161208 102750 159671 160311
12590 160311 118284 114518 -13725 -58625 -84455 -61467 -106113 18624 -13890 -81489 -45552
12579 -45552 39557 110417 173091 154427 87981 80895 161071 256244 263712 178083 48519 -9628
12567 -9628 -12248 -117852 -163569 -199222 -76580 -6455 -44945 -11328 23815 88794 72902 70999
12555 70999 62659 7840 91594 142846 49552 -37344 10969 106811 -1412 -114493 -121904 46662
12543 46662 55072 153787 205219 44170 -9735 -20151 45085 7624 -42992 16348 147491
12532 147491 43566 -109728 -4177 137302 269426 193499 4884 -97053 -81210 -36334
12522 -36334 -32292 -12115 51445 95515 69629 53749 34825 82271 15171 -72101 -76455 90013
12510 90013 205534 163811 68712 -5501 -35595 2843 12852 23291 81250 116178 179148
12499 179148 57566 -17503 -62011 -155817 -95421 -6098 19522 11806 4449 35874 -11829 -34374
12487 -34374 -14975 56427 30678 114449 181485 143505 70626 82790 57819 -13556 17179 -40279
12475 -40279 -100020 -135284 -149970 -138877 -79633 -52019 -189372 -120338 29728 93940 87819
12464 87819 -43780 -193762 -133528 -91518 -97069 -185311 -240485 -50965 133749 74035 49033
12453 49033 79198 -36316 -207257 -322458 -362988 -199608 -27394 32823 7554 -108452
12443 -108452 9636 40406 118496 121399 53035 47470 -8825 71392 64458 71285 111059 -26190
12431 -26190 -79375 -76283 35338 69535 112855 52862 -89477 -60207 -79219 -122946 -114817 -116389
12419 -116389 -150851 -66239 -30574 -68260 -38408 -41323 24982 33371 162824 166163 111712 -25985
12407 -25985 -157172 -155430 -119492 -150952 -256561 -210484 -101802 -87896 -128013 -25741 7805
12396 7805 -49091 -151862 -26190 16534 -30853 26582 76229 -23197 -24958 -55937 -73229 96641
12384 96641 174685 131521 60912 -16391 -106364 5169 69130 84550 83336 88028 98403 88733
12372 88733 137256 103878 86345 111830 145670 133951 94628 97718 28467 -4526 -37059 -11724
12360 -11724 -97592 -71739 -19511 -60310 -14000 -15350 -32436 -114029 -135175 37112 42622 42728
12348 42728 77485 67019 34040 165880 187645 18556 -151073 -115088 59234 195933 78829
12337 78829 -108096 783 123426 157162 118805 113724 72105 4522 -79685 -78828 -86822 -66127
12325 -66127 -76759 -114446 -139425 -123466 -159835 -222648 -116563 -29785 -54063 -21834 73179
12314 73179 -38415 -48870 97707 91894 64420 34657 3758 57931 -19703 -82932 -129018
12303 -129018 -157385 -46171 13213 33290 123834 119770 102335 46580 -23375 -44183 -35387 -136244
12291 -136244 -220386 -168313 -4926 -87115 -123863 9847 49736 35537 12967 13598 104164
12280 104164 142829 127798 94709 73450 -121607 -140674 -98260 -105286 -67089 -42342 -36439 90694
12268 90694 77386 51813 106283 45214 -24407 -59900 -38917 -50353 -15032 -93636 -147302 -185165
12256 -185165 -111525 -18613 -42643 -57822 82253 20966 -33037 14728 -44470 4553 11889
12245 11889 -15678 6295 55395 124158 203522 90379 104553 99915 73939 136891 118597 84319
12233 84319 -16975 -40971 94099 20930 -22703 -55819 -123407 -186167 -259538 -194906 23328
12222 23328 136992 228292 185645 5433 -31906 -46467 -46312 -103709 -96939 -66818 402 3224
12210 3224 -51268 -15320 -81185 -178677 -134889 -53631 79650 65341 63494 -13110 -40267 -142930
12198 -142930 -96454 -32848 21293 70661 75670 158621 165744 85399 102485 18502 -70087 -82507
12186 -82507 -73113 -81551 40510 85859 10347 16336 29275 52047 62377 8710 -54498 -77840
12174 -77840 -79538 -50965 -62019 -149159 -43265 9535 72884 -31411 -53179 -3211 -19852
12163 -19852 -72064 55543 125409 123040 85404 94460 77330 73154 -17564 -49988 -105020 -92640
12151 -92640 36525 70534 114242 114020 -19749 -45410 5815 -73930 -162521 -144857 -70300 38502
12139 38502 47839 61418 132801 211032 173143 165669 53942 -90713 -19581 -19096 -10918 -63187
12127 -63187 -123200 -221543 -243019 -237591 -260924 -338384 -215772 -124129 -162044 -74598 -113738 -177838
12115 -177838 -153061 -83649 -62139 89897 104577 40164 -24257 -81117 17061 60229 73424
12104 73424 74120 107241 42293 97215 98939 45168 -59718 -48736 -53933 -139205 -196370 -139412
12092 -139412 -123885 -177664 -87176 -52565 44834 53211 13950 -47546 -87202 -122907 -90698 -64958
12080 -64958 -11690 7727 -60447 -118330 -152067 -125568 -113855 -155678 -174266 -122680 70719
12069 70719 100619 21346 51809 17305 -29245 -20942 -106634 -78280 -150046 -191091 -67791 67084
12057 67084 51826 13308 -87261 -131475 -101152 -98775 -64679 13500 55731 -18122 -107080 -88683
12045 -88683 -23868 -53676 -115087 -129870 -96927 -95344 -77425 -17381 31463 37227 7528 91650
12033 91650 49730 11179 -155979 -273625 -288702 -244058 -141448 22667 -4982 37614 32032
12022 32032 -97461 -171437 -134587 -88431 -75642 -62396 -75063 57638 192839 230757 198289
12011 198289 100079 127861 147119 58470 11939 39603 53820 -33240 -119694 -110562 -99296 -85963
11999 -85963 -93457 -82707 -23406 26022 93048 89360 55148 58396 85966 189541 202161 158766
11987 158766 37979 -61476 -112933 -109893 -57828 19180 125261 78156 48088 -80702 -176642
11976 -176642 -144055 -93564 -106196 -139602 -79923 -11722 -43632 76930 71156 -52583 -32558
11965 -32558 -178514 -200179 -83118 -52840 -89200 28363 93012 100650 132676 2598 -136395
11954 -136395 -125008 -67094 -50122 -84720 14724 14630 -48936 -64987 -66250 67673 107937 -662
11942 -662 -93789 -122689 -156542 -199750 -42210 32420 61430 -15913 -20202 -106801 -179437 -122121
11930 -122121 -47736 -32128 -9723 53424 28458 26889 149184 260792 249427 139826 74005
11919 74005 25374 -13346 24950 83772 106057 135540 127091 145843 204875 263984 188817 -20975
11907 -20975 123 155369 106120 -13963 -84285 -76348 -8686 -27210 -28836 -75395 -91430 -53104
11895 -53104 -19579 -174453 -232169 -210204 -238519 -203258 -181394 -36935 -79557 20477 143554
11884 143554 58204 90297 28614 -65839 -123507 -47016 29031 115516 97536 -11286 4799
11873 4799 -77436 -84808 -106784 -82710 -48322 21180 163215 130865 128872 105588 88734 -9782
11861 -9782 -89886 -47974 19237 47215 5863 -28100 -123305 -186047 -141998 -62886 -25554 -30773
11849 -30773 -79385 -42856 -126329 -181588 -231978 -118577 -165501 -275814 -151670 -2887 75715
11838 75715 127514 49805 -76886 -142946 -86093 32388 -13694 -150836 -36476 145272 144342
11827 144342 119595 80688 129742 42522 -136571 -128681 -94221 -122690 -209352 -243297 -159412
11816 -159412 -111332 -156016 -79985 74602 79989 73035 105873 88005 152017 114854 -70414
11805 -70414 -73800 -13965 -11806 -21400 -76709 -151897 -114121 -127743 -96312 -12935 14301 -50
11793 -50 75663 67132 18235 -4602 36915 124052 142192 123014 110463 92645 140637 35767
11781 35767 81184 188297 47804 -134136 -164677 -145870 -68360 -24596 -134052 -88616 -64294
11770 -64294 -129373 -188425 -69719 42221 -16325 -63223 -121263 -92213 -44615 69163 110406
11759 110406 28573 -47888 -123263 -132427 -107983 -57628 -49636 -281482 -364467 -256377 -112159
11748 -112159 -30323 -45857 -19116 -62862 -132301 -105047 -87591 -116753 -114364 -134299 -152564 -211477
11736 -211477 -210779 -29216 19776 35339 -39035 -78399 11285 75186 107484 75354 -109981
11725 -109981 -131067 -96121 -182063 -197303 -29893 48625 132839 151474 17810 -79033 -16008
11714 -16008 49551 -88545 -112812 -81360 -135993 -82075 -10664 -60347 -72528 -46332 -161526
11703 -161526 -202917 -102674 90438 64862 64761 -26359 -127973 -38304 58169 -11379 -109362
11692 -109362 -165243 -239081 -315512 -223500 -250675 -284326 -226197 -102780 13976 -182313 -262339
11681 -262339 -140962 -39937 -49473 -55530 -122043 -153444 -154182 -139441 -36337 -48011 -17500 -91603
11669 -91603 -48301 96839 64096 73880 159981 208214 189401 126227 38231 116364 43488 -171722
11657 -171722 -157771 -137620 -189089 -310528 -283200 -197709 -171203 -192864 -168500 -147878 -70116
11646 -70116 -17542 -34746 25125 112374 146203 28037 -6227 -66863 -69859 -40236 -30363 -89660
11634 -89660 -56308 9191 183637 115758 58231 -36064 -38 -56842 -100779 -65059 -46645
11623 -46645 -45600 -148312 -53472 -5021 -70898 -5052 -19309 -4593 5234 8122 75994 112012
11611 112012 16746 50916 67634 55597 84175 123651 141823 28286 -230096 -156009 68941
11600 68941 118132 155735 180108 227128 96562 -54023 -29309 -15425 13982 -5848 -34023
11589 -34023 -32920 -107102 -81413 -92891 -124099 -147801 -103648 -69558 -22455 -42160 -76601 -35335
11577 -35335 -71195 -61091 35131 44106 16440 37637 -56905 -28595 -43637 -12974 -71428 -50558
11565 -50558 -46977 14713 91907 105552 -47935 -91080 -43375 16417 -25685 7158 -143166
11554 -143166 -248755 -198464 -22374 22298 2460 -79949 -41435 47341 78250 88791 31639
11543 31639 -18348 -16220 51304 8782 -1806 66174 98772 -29088 -38090 -55371 68146 105852
11531 105852 55463 -46528 -46008 -97914 -68195 -31842 -52102 -92727 -76774 -58491 -40603 24858
11519 24858 20350 -9236 -164514 -221866 -214510 -114491 -9052 -56138 -108003 -95477 -40034
11508 -40034 -107516 -107519 -78414 -49240 -45724 -77533 -97836 -99833 -91706 -61109 15822 -33114 -2130
11495 -2130 -5252 -73602 15526 51674 77416 6866 -50696 1114 -5282 -3605 9751 110614
11483 110614 107044 99128 6227 -35702 -12235 -60187 -98605 -168188 -86122 -23901 -54776 -159269
11471 -159269 -124933 -8625 125141 124945 -489 19651 -5443 688 -12585 -160412 -71582
11460 -71582 -67097 -103204 -66905 -62388 12097 -59820 -68605 15233 30224 -3690 -24417 -136181
11448 -136181 -181574 -153206 -155003 -279076 -206400 -58835 -28612 8755 12675 -66654 -72721 -34891
11436 -34891 -47949 -62207 -15459 -19531 78485 153474 56346 -59640 -47063 -59278 -49021 6097
11424 6097 -6221 49951 -68355 -53674 76566 189163 126189 7828 -3115 -70795 -41536
11413 -41536 38735 -8972 -10455 -7835 46047 39862 -10915 -63896 -113245 -141470 -131313 -59642
11401 -59642 2277 16905 25794 11548 -14552 -62024 6589 30953 -46934 -60453 -184427 -159574
11389 -159574 -130362 -160479 -119102 -72272 -71206 -100150 -56053 -86767 -73404 23768 79114 55932
11377 55932 143957 74755 10748 -112050 -123747 -76809 37977 118961 126111 98157 5312
11366 5312 49514 219525 135031 30755 3312 68085 128228 5750 -51823 -116432 -69051
11355 -69051 74660 157335 150868 195696 -4578 -151982 -109860 -88738 20010 126259 268272
11344 268272 224122 81901 50780 3230 56252 -26518 -72641 -10917 -21857 -78606 -92549
11333 -92549 -32711 -81484 -65217 -55505 -167200 -224090 -162253 -74221 -24435 39093 118741 167154
11321 167154 94503 -73545 -188728 -155908 -175409 -181011 -180944 -178284 -155280 -114292 -112250 -58140
11309 -58140 -119350 -44888 168071 119126 3003 14878 -6067 -79904 -43188 81132 58244
11298 58244 -17666 -20139 -25335 -76409 58713 50032 -22537 26940 93515 85631 100354 -61047
11286 -61047 -237448 -293045 -290385 -219856 -147111 -141692 -127544 -48809 -9149 42978 158877 205237
11274 205237 211810 61591 1174 -211394 -175847 -53551 -22355 -137951 -111368 35313 -9273
11263 -9273 -36025 -86621 2153 -31611 -50142 9241 91285 92785 -50018 -69894 -60085 105444
11251 105444 161452 60965 17193 -65598 -164804 -125268 -165360 -141081 -104195 -18580 73773
11240 73773 58670 -23891 -102862 -70351 -64733 55138 -10397 -39387 -96509 -41534 -27336 -39649
11228 -39649 47891 208061 210481 96282 77622 48947 68408 119304 -7340 58303 119032
11217 119032 109039 79774 66430 59858 -9034 10407 -72510 -129410 -143761 -83133 16 64119
11205 64119 75157 62122 42487 11811 -102698 -272290 -247183 -77302 -143 -107832 -32710
11194 -32710 -8083 -68791 -71634 -101044 -58530 52147 -8667 -118098 -100185 -71605 -109768
11183 -109768 -100503 -207039 -292266 -163944 66527 100298 13180 -41358 -73729 11751 122331
11172 122331 98098 18443 -101008 -192757 -170167 -222521 -137958 -175051 -144961 -74930 -77791
11161 -77791 10223 -68311 -128955 -154150 -54798 -54436 -132054 -44165 28683 135878 65582 -34488
11149 -34488 -78318 -92165 -117630 -84063 8868 86521 -908 -24765 -133033 -118072 -88054
11138 -88054 -134055 -206899 -174840 -38626 -41149 -190141 -188705 -159576 -142592 -155885 -72539 -69147
11126 -69147 -80117 -20213 50140 132285 171058 123656 59431 46885 73707 -3779 -83367 -131412
11114 -131412 -99712 -96497 -144121 3235 102538 -79970 -97171 36449 79365 -1776 -127830
11103 -127830 -160396 -141091 -92757 -90676 -144672 -103668 -39798 85750 135049 67891 -57465
11092 -57465 -79334 -149433 -62236 50530 47460 60673 107230 92891 48889 -24647 -41252 12290
11080 12290 68738 54224 43670 101011 100589 263021 269006 155087 93962 107275 85494 2179
11068 2179 -26361 40593 1801 17592 40610 -13679 -170092 -174684 -101401 -75792 2318 16451
11056 16451 -17671 30500 40067 -12606 -113198 -88114 -29206 -64369 -75413 22910 7950 -196219
11044 -196219 -258064 -102188 -39565 -151686 -266656 -196139 -90138 -62096 -22615 76145 63492
11033 63492 25637 -3091 -50506 -67048 -33538 27965 87187 17605 -66533 36414 116658
11022 116658 170802 110135 67504 47019 69440 139203 97642 216415 193188 16186 -80610
11011 -80610 -111062 -140058 -46597 36065 -35652 -10454 92713 69393 -31770 -148290 -110674
11000 -110674 -176886 -167907 -173225 39427 110501 136143 85711 25592 46867 20393 93963 68191
10988 68191 96603 179102 91323 126469 98596 57164 134277 162096 93494 -85870 -81863 -127024
10976 -127024 -208018 -119364 -37745 -15380 -82697 -55966 113308 213557 137286 12367 -35437
10965 -35437 53141 92846 82408 174286 229175 187936 177125 74920 34835 226672 296685
10954 296685 226945 157706 46483 -50758 -77174 -66265 5069 114549 44138 -43537 -121443
10943 -121443 35268 105794 74751 -43084 -70200 -12792 -64622 -4364 65845 99338 37287
10932 37287 -23029 -26151 -106692 -139864 -83392 -59987 -29788 -37685 -87967 -41708 -4116 61289
10920 61289 200439 185065 148929 57260 -20766 -26167 35060 8567 -108138 -173939 -223394
10909 -223394 -192339 -105771 -218187 -186517 -216568 -307359 -246788 -227761 -299324 -222494 -133701
10898 -133701 -145505 -209674 -183911 13458 43937 61788 -3159 -3197 -14223 -10785 62015 182008
10886 182008 61077 -32343 28232 2938 -89771 -142854 -122690 -135179 -193481 -225564 -181664
10875 -181664 -188468 47144 185267 181274 38920 -141371 -79773 20129 25885 -96830 -43696
10864 -43696 -39890 -22204 3949 21568 -38868 20435 40124 87276 130247 79764 -10902 -84465
10852 -84465 -82135 -74396 -160329 -186732 -101141 -101718 -116979 -240552 -239030 -174259 -204051 -152862
10840 -152862 -6728 15144 -5152 95898 -48413 -185568 -187139 -94534 -81397 -47334 -40290
10829 -40290 -327 -34282 -47411 -81588 -58017 -78544 -148540 -205964 -183452 -131761 -198431 -194653
10817 -194653 -105625 -33816 -124864 -116529 -24366 -26501 -66505 -73790 37578 12452 -199961 -251621
10805 -251621 -160638 -84183 -25401 33074 42584 -47632 -16934 12721 -59274 -20712 -42630 -102491
10793 -102491 -124387 -58539 -144931 -213632 -352294 -339017 -194020 -142925 -197255 -152227 50672
10782 50672 -30713 -104980 -81088 -138033 -223801 -76802 98734 75859 -192 77851 101737
10771 101737 31169 21962 -2503 -55109 -104899 -33052 6053 10087 82870 63520 35170 3805
10759 3805 61704 -4029 -22991 -43305 -83842 -74394 -195641 -182457 -186173 -168497 -150389 -85795
10747 -85795 -78091 -64903 -114866 -128729 -140958 -144375 -132685 -115421 -51347 11650 -117884 -42675
10735 -42675 -34240 -64789 -104203 -76691 84502 163989 220900 185305 123175 185082 169043 62528
10723 62528 -56774 -40731 16737 -80751 -162012 -163678 -141829 -68320 119254 145065 21650
10712 21650 -78409 -97180 -113792 -182146 -210365 -201150 -147067 -81252 -31493 -20099 -1936 -53067
10700 -53067 -144559 -108351 -102741 -90128 -70556 26910 538 -57782 -21577 -20317 -8880 85858
10688 85858 118984 18396 -67050 -57148 82604 162959 163354 231692 226284 75864 9422 -54048
10676 -54048 -133537 -214621 -198911 -76144 -287 -25287 -6520 -21400 87038 148792 41781
10665 41781 -59054 -66874 -74016 -101189 -111744 -262204 -215616 -74187 18428 70842 40731
10654 40731 -31084 -63322 -192367 -316108 -314714 -332275 -92186 35699 47309 125130 261728
10643 261728 247046 110117 76666 80781 98095 -28647 -10953 33416 52548 -16011 -132389
10632 -132389 -73133 -70629 1740 50365 74092 36343 148179 210847 197397 154209 50477
10621 50477 28144 -88897 -112042 -68731 63224 83694 93630 54088 81554 130286 68251
10610 68251 -24269 -51688 -43055 -57795 -96398 -53671 49588 65106 -41667 -76096 -164814
10599 -164814 -86047 -56660 -45007 -170324 -169747 -26053 -52861 -88719 -198698 -200222 -155182
10588 -155182 31108 171202 220023 186956 83916 12725 -78041 -150176 -136658 -153966 -34176
10577 -34176 44383 71971 93000 -75718 -145835 -47289 59467 144644 159961 176663 235954
10566 235954 149470 158481 136740 134404 172456 147712 71421 24906 4670 33373 155418 173417
10554 173417 218750 199757 129669 77180 -22258 -170458 -204271 -92675 117296 190761 107028
10543 107028 32055 22321 49741 6630 47829 -7273 -61764 -19462 113854 129587 -9367
10532 -9367 -37590 13522 75944 77902 67315 82662 104905 21908 30610 -17761 -64621 -72919
10520 -72919 -66673 -77532 -44110 11433 112315 143799 199405 100226 67691 49320 51563 -18577
10508 -18577 -98329 -34733 9506 129604 102956 59954 50446 12352 -26494 -155696 -170699
10497 -170699 -152982 -51932 1063 67492 -31954 -113317 -97066 -178793 -162756 -88009 -21988
10486 -21988 -57251 -45544 43543 5191 -109516 -210295 -314872 -250347 -115377 -18813 -80775
10475 -80775 -122866 -91061 33713 35850 -77210 -113624 -76744 -72966 879 90574 34645 -89459
10463 -89459 -66300 -54318 -9511 25827 13047 -60479 -6755 22760 -157422 -107229 -35973
10452 -35973 68694 100521 161282 160160 57983 55488 9811 -76377 33170 128630 78704
10441 78704 109335 157709 69113 28468 22294 81592 262174 346276 439883 419524 279997
10430 279997 179922 83616 34045 -15184 27240 46216 -52408 -180658 -158632 -101532 -47499
10419 -47499 43355 54579 62723 -69151 -154571 -179444 -282668 -242065 -179111 -55211 -13634
10408 -13634 22643 65697 -2013 -23664 48450 13450 52366 111234 98949 168188 109234 9349
10396 9349 57380 81524 62930 32160 -34203 -57652 -71542 -27563 4779 147413 100407 32995
10384 32995 -14068 16206 7012 22265 10038 16800 35858 -47205 60828 92941 -68309 -199849
10372 -199849 -215943 -199418 -156819 -39091 4163 27985 152773 127931 116714 100794 81236
10361 81236 -10051 -43261 -112286 -158799 -56695 -3896 -390 -35184 -66007 -41028 31953 -10983
10349 -10983 24090 26628 20426 33300 23269 -111964 -58431 -53405 -113599 -251479 -294932 -277860
10337 -277860 -146408 -74204 -65642 1457 -13357 -26319 22215 78388 27236 -4088 -3932 -8467
10325 -8467 -47787 -45266 -103074 -133491 -29254 -53100 -96404 -51266 113676 121774 123451 99063
10313 99063 16727 -21781 -38547 -79039 -93409 34820 92750 154388 122657 79641 33022
10302 33022 82093 213994 159217 50522 39748 70170 -10754 -121285 -95690 -16020 -125255
10291 -125255 -207541 -162818 -11081 65994 114375 -28836 -179117 -70186 -97614 -16032 -45972
10280 -45972 19209 103988 -5994 -72711 -146179 -172139 -115441 -64607 -108735 -130174 -116369
10269 -116369 -124885 -142122 -31781 25794 -30779 6401 133225 204406 67468 19580 71165
10258 71165 75517 11066 19801 33744 -2488 -35295 -136281 -161761 -125699 -12669 9920 -85798
10246 -85798 -55524 -53653 -48849 81458 133491 12065 -19333 -17903 22360 -27073 -102353 -95744
10234 -95744 2334 13633 -42100 -19452 -24778 -93193 -103439 -46663 -61050 21886 111367 158216
10222 158216 46121 40280 17358 46831 14627 10901 18727 30539 148948 204994 177565 150083
10210 150083 27539 12485 -38044 -23744 26048 -51170 -75820 -65948 32352 48962 5926
10199 5926 -66190 -49975 9672 3 -102438 7452 131666 125652 158838 88162 92346 36166
10187 36166 24717 -33177 -89738 -31961 -32424 -28902 -2280 37136 135073 266071 265868 158857
10175 158857 103377 39218 50071 -27361 -129957 -58634 78438 18804 -10129 -20000 -152
10164 -152 -45022 -99644 -122127 18371 67369 56476 56602 45937 45292 27498 56442 163282
10152 163282 188247 62692 -24244 -15336 82741 84573 90639 175046 154203 1148 -29528 -29902
10140 -29902 -51199 -110332 -101595 -123456 -42573 -17639 43219 -32207 -13698 93566 179026 118741
10128 118741 63345 112294 186657 114626 -37833 -127282 -101151 -59970 -92392 -122597 -115610
10117 -115610 -83474 -54240 45931 127698 103825 133171 77287 -8953 -155516 -153146 -56480
10106 -56480 -44917 -61250 -206634 -349563 -273317 -122938 -93844 -55197 32142 41546 69184
10095 69184 76626 -1871 6969 -69763 -126466 -108554 36305 77146 32323 2253 -42939 -103606
10083 -103606 -64793 -89263 -88838 -82641 19684 -75278 -66705 -15744 -108216 -167373 -201866 -128636
10071 -128636 14341 113061 97911 66180 -31219 -141047 -152211 -77367 -44978 254 -96401
10060 -96401 -3638 78093 153545 157182 139030 71125 -22992 -113876 -144507 6335 11194 59917
10048 59917 157222 97038 96015 202613 251404 305182 163321 25260 -137918 -197517 -91878
10037 -91878 -76950 -73544 -25499 -83883 -155001 -198680 -202127 -277571 -205531 -88190 22352 65840
10025 65840 76866 162543 76619 -42559 -71183 -57769 -54455 -9384 -46805 -124493 -6958
10014 -6958 77958 68816 -49274 -75625 -75120 10659 93874 138331 112660 15037 34382 -20919
10002 -20919 -144505 -3416 -107575 -191208 -141539 -102605 -124491 -89920 -79222 -119670 -94115
9991 -94115 -146571 -38416 20182 11698 -100167 -133241 -63957 -15838 144 20632 -164751
9980 -164751 -198405 -152911 43460 102141 58524 -21278 -153533 -90806 -92209 -83176 -129039 -38104
9968 -38104 54369 150072 122651 52932 62041 68032 85899 106730 -4403 9899 -22745 5051
9956 5051 75893 129316 167159 132710 73925 96500 171109 259689 289776 272204 192308 180696
9944 180696 90052 73069 -45796 -40963 -106334 -104890 30906 82361 98096 -9332 -24897
9933 -24897 -63238 -107976 -220431 -311243 -254321 -211201 -167991 -256807 -259299 -245834 -174340 -113722
9921 -113722 -116850 89744 122722 106331 97386 131339 168596 218924 114155 -81853 -40317
9910 -40317 163175 211493 182966 215871 211189 220660 267880 131193 77401 96164 85781 29870
9898 29870 6078 5844 82282 59252 44649 -75979 -138761 -27310 87805 84007 83156 89290
9886 89290 90938 39531 50083 37066 111434 82650 -42410 -47397 26296 -44988 -77514 -9805
9874 -9805 -34452 -112208 1654 28556 131450 -24243 -96468 -74581 -86317 -18055 16687
9863 16687 -16970 -57084 -74804 -115405 -57403 64122 85877 150620 128914 146395 194489 193233
9851 193233 55444 -49035 61892 -42455 -182082 -178140 -83662 -51283 -30618 35881 -587
9840 -587 -9587 -6414 -972 63180 261294 346747 174626 -30992 -79393 -140142 -105430 -29626
9828 -29626 100207 111341 -72742 -142743 -14801 78450 114905 130197 173160 137350 41051
9817 41051 29736 104414 184146 90952 78963 61338 94210 66316 102136 25561 66604 130014
9805 130014 170937 122007 67900 162482 97968 -8251 -106403 2559 85561 60936 74430
9794 74430 179026 255291 188759 194859 182846 104374 54147 4775 -28324 -168784 -102009 13525
9782 13525 65709 110391 73917 17702 -8235 31247 11947 -27714 -26411 -68595 -65255 -219
9770 -219 -37899 23752 17214 63610 -7503 18751 -27514 -132397 -205339 -295255 -286136 -343520
9758 -343520 -156665 25091 -3033 18639 74096 112435 68178 -23493 40123 41497 -56120
9747 -56120 -137269 -145434 45564 110979 -15250 -154576 -234944 -276363 -208740 -107945 63883
9736 63883 153119 233986 301186 267831 242154 171800 127858 47906 6732 -31018 -82027 -61880
9724 -61880 -85002 -130180 -61387 -61682 -239954 -235264 -63740 32372 -39397 -88567 5651 142864
9712 142864 231568 285902 195517 147781 17550 -63529 -83692 -153648 -27026 6945 105797
9701 105797 135508 156870 261834 236841 135177 19879 -79084 -124503 -140358 -1724 123326
9690 123326 55438 -6562 21691 -20157 -143468 -34462 84546 26085 -78588 -227655 -99998
9679 -99998 2264 -17389 594 -55213 30240 134393 115139 54150 -28092 -91680 -69091
9668 -69091 -34876 -60107 -74633 -21626 -31112 -70583 -18277 88119 -17019 -91003 29637
9657 29637 -90260 -217540 -232109 -221583 -107197 -88578 -164669 -164237 -23025 105924 78328
9646 78328 49822 89266 98421 16662 21562 177421 57502 -43851 33205 -12538 -22085 155110
9634 155110 219990 185904 78456 -18904 -65678 -141195 -85978 9701 132934 92269 37471
9623 37471 133257 239209 129278 71435 157327 163084 146490 13948 -32306 -60806 -60363 -122722
9611 -122722 -213492 -153907 -133622 37565 35919 -15887 -39726 -124577 -213510 -277299 -74718
9600 -74718 18810 -59564 -34900 46312 153850 114464 108905 157989 117393 41435 -4927 8449
9588 8449 82096 -3342 -57647 -125889 -125801 -61436 -18893 -97377 -184876 -147613 -122322 -114718 -151588
9575 -151588 -133519 20418 165137 86600 -32774 -137104 -35336 -28114 16581 43926 -11014
$$ [...]
##END NTUPLES=NMR SPECTRUM
##END=
