##TITLE=Analysis number 308060
Compound Code spb 06360
Book Reference 407/65/1
Project Code adrs
Chemist Name andyw
##JCAMPDX= 6.0         $$ Bruker NMR JCAMP-DX V2.0
##DATA TYPE= NMR SPECTRUM
##DATA CLASS= NTUPLES
##ORIGIN= Bruker BioSpin GmbH
##OWNER= NMR
$$ XWIN-NMR		Version 3.5
$$ Thu May 19 15:05:30 2005 GMT Daylight Time (UT+1h)  MAYBRIDGE\NMR@NMR_250MHZ
##.OBSERVE FREQUENCY= 250.131544655141
##.OBSERVE NUCLEUS= ^1H
##.ACQUISITION MODE= SIMULTANEOUS (DQD)
##.ACQUISITION SCHEME= undefined
##.AVERAGES= 16
##.DIGITISER RES= 18
##SPECTROMETER/DATA SYSTEM= dpx250
##.PULSE SEQUENCE= zg30
##.SOLVENT NAME= CDCl3
##.SHIFT REFERENCE= (INTERNAL, CDCl3, 0, 16.4527)
##AUDIT TRAIL= $$ (NUMBER, WHEN, WHO, WHERE, WHAT)
$$ ##TITLE= Audit trail, XWIN-NMR		Version 3.5
$$ ##JCAMPDX= 5.01
$$ ##ORIGIN= Bruker BioSpin GmbH
$$ ##OWNER= NMR
$$ C:\u/data/dgb/nmr/ADRS/3210/pdata/1/auditp.txt
$$ ##AUDIT TRAIL=  $$ (NUMBER, WHEN, WHO, WHERE, WHAT)
(   1,<2005-05-19 15:05:12.26 +100>,<MAYBRIDGE\NMR>,<NMR_250MHZ>,
      <created by zg, POWCHK disabled, PULCHK disabled
       configuration hash MD5:
       62 19 C7 07 E1 42 D1 B7 37 6C 3D D0 77 39 F9 E6
       data hash MD5: 64K
       E6 DB B0 01 F5 67 BC AB B6 0B 90 DC CE 27 F7 34>)
(   2,<2005-05-19 15:05:23.77 +100>,<MAYBRIDGE\NMR>,<NMR_250MHZ>,
      <Start of raw data processing
       ef LB = 0.3 FT_mod = 6 PKNL = 1 SI = 32K 
       data hash MD5: 32K
       EE E8 4A A0 F0 41 68 4B 99 C2 FF C0 55 40 D2 BB>)
(   3,<2005-05-19 15:05:25.46 +100>,<MAYBRIDGE\NMR>,<NMR_250MHZ>,
      <apk 
       data hash MD5: 32K
       B8 D4 68 AE 2F AC FA F2 DF 85 92 0A 6E F1 C6 67>)
(   4,<2005-05-19 15:05:26.10 +100>,<MAYBRIDGE\NMR>,<NMR_250MHZ>,
      <abs ABSG = 5 
       data hash MD5: 32K
       19 ED 1B 24 A7 AC FF DF 06 21 21 F9 1E 21 2B 21>)
$$ ##END=
$$ 
$$ hash MD5
$$ 92 21 D8 F9 15 65 B2 A5 93 EC 97 3F 11 84 2E 97
##$RELAX= 
##$RELAX= 
##$RELAX= 
##$RELAX= 
##$RELAX= 
##$RELAX= 
##$RELAX= 
$$ Bruker specific parameters
$$ --------------------------
##$DU= <C:\u>
##$EXPNO= 3210
##$NAME= <ADRS>
##$PROCNO= 1
##$TYPE= <nmr>
##$USER= <dgb>
##$AMP= (0..31)
100 100 100 100 100 100 100 100 100 100 100 100 100 100 100 100 100 100 
100 100 100 100 100 100 100 100 100 100 100 100 100 100 
##$AQSEQ= 0
##$AQ_mod= 3
##$AUNM= <au_zg>
##$AUTOPOS= <55 >
##$BF1= 250.13
##$BF2= 250.13
##$BF3= 250.13
##$BF4= 250.13
##$BF5= 500.13
##$BF6= 500.13
##$BF7= 500.13
##$BF8= 500.13
##$BYTORDA= 1
##$CFDGTYP= 0
##$CFRGTYP= 5
##$CHEMSTR= <none>
##$CNST= (0..31)
1 1 145 1 1 1 1 1 1 1 1 1 1 1 1 1 1 1 1 1 1 1 1 1 1 1 1 1 1 1 1 1 
##$CPDPRG= <>
##$CPDPRG1= <>
##$CPDPRG2= <>
##$CPDPRG3= <>
##$CPDPRG4= <mlev>
##$CPDPRG5= <mlev>
##$CPDPRG6= <mlev>
##$CPDPRG7= <mlev>
##$CPDPRG8= <mlev>
##$CPDPRGB= <>
##$CPDPRGT= <>
##$D= (0..31)
0 1 0 0 0 0 0 0 0 0.06 0 0 0 0 0 0 0.0002 0 0 0 0 0 0 0 0 0 0 0 0 0 0 
0 
##$DATE= 1116511511
##$DBL= (0..7)
120 120 120 120 120 120 120 120 
##$DBP= (0..7)
150 150 150 150 150 150 150 150 
##$DBP07= 0
##$DBPNAM0= <>
##$DBPNAM1= <>
$$ [...]
##$SUBNAM7= <"">
##$SUBNAM8= <"">
##$SUBNAM9= <"">
##$SW= 20.6930455092707
##$SWIBOX= (0..15)
0 0 3 0 0 0 0 0 0 0 0 0 0 0 0 0 
##$SW_h= 5175.983436853
##$TD= 65536
##$TD0= 1
##$TE= 295.16
##$TE2= 300
##$TE3= 300
##$TEG= 300
##$TL= (0..7)
0 120 120 120 120 120 120 120 
##$TP= (0..7)
150 150 150 150 150 150 150 150 
##$TP07= 0
##$TPNAME0= <>
##$TPNAME1= <>
##$TPNAME2= <>
##$TPNAME3= <>
##$TPNAME4= <>
##$TPNAME5= <>
##$TPNAME6= <>
##$TPNAME7= <>
##$TPOAL= (0..7)
0.5 0.5 0.5 0.5 0.5 0.5 0.5 0.5 
##$TPOFFS= (0..7)
0 0 0 0 0 0 0 0 
##$TUNHIN= 0
##$TUNHOUT= 0
##$TUNXOUT= 0
##$USERA1= <user>
##$USERA2= <user>
##$USERA3= <user>
##$USERA4= <user>
##$USERA5= <user>
##$V9= 5
##$VALIST= <valist>
##$VCLIST= <CCCCCCCCCCCCCCC>
##$VD= 0
##$VDLIST= <DDDDDDDDDDDDDDD>
##$VPLIST= <PPPPPPPPPPPPPPP>
##$VTLIST= <TTTTTTTTTTTTTTT>
##$WBST= 1024
##$WBSW= 4
##$XGAIN= (0..3)
0 0 0 0 
##$XL= 0
##$YL= 0
##$YMAX_a= 357692
##$YMIN_a= -376316
##$ZGOPTNS= <>
##$ZL1= 120
##$ZL2= 120
##$ZL3= 120
##$ZL4= 120
##$ABSF1= 16.4527
##$ABSF2= -4.240473
##$ABSG= 5
##$ABSL= 3
##$ALPHA= 0
##$AQORDER= 0
##$ASSFAC= 0
##$ASSFACI= 0
##$ASSFACX= 0
##$ASSWID= 0
##$AUNMP= <proc_1d>
##$AZFE= 0.1
##$AZFW= 0.1
##$BCFW= 0
##$BC_mod= 0
##$BYTORDP= 0
##$COROFFS= 0
##$CY= 12.5
##$DATMOD= 1
##$DC= 0
##$DFILT= <>
##$DTYPP= 0
##$F1P= 14.0000005364418
##$F2P= -0.99999901652339
##$FCOR= 0.5
##$FTSIZE= 32768
##$FT_mod= 6
##$GAMMA= 0
##$GB= 0
##$INTBC= 1
##$INTSCL= 1
##$ISEN= 128
##$LB= 0.3
##$LEV0= 0
##$LPBIN= 0
##$MAXI= 10000
##$MC2= 0
##$MEAN= 0
##$ME_mod= 0
##$MI= 0
##$NCOEF= 0
##$NC_proc= -3
##$NLEV= 6
##$NOISF1= 0
##$NOISF2= 0
##$NSP= 0
##$NTH_PI= 0
##$NZP= 0
##$OFFSET= 16.4527
##$PC= 1
##$PHC0= -71.74715
##$PHC1= 10.47157
##$PH_mod= 1
##$PKNL= yes
##$PPARMOD= 0
##$PSCAL= 4
##$PSIGN= 0
##$REVERSE= no
##$SF= 250.13001733259
##$SI= 32768
##$SIGF1= 0
##$SIGF2= 0
##$SINO= 400
##$SIOLD= 32768
##$SREGLST= <1H.CDCl3>
##$SSB= 0
##$STSI= 32768
##$STSR= 0
##$SW_p= 5175.98343685301
##$SYMM= 0
##$S_DEV= 0
##$TDeff= 65536
##$TDoff= 0
##$TI= <Analysis number 999999
Compound Code 99
Book Reference 9
Project Code 9>
##$TILT= no
##$TM1= 0
##$TM2= 0
##$TOPLEV= 0
##$USERP1= <user>
##$USERP2= <user>
##$USERP3= <user>
##$USERP4= <user>
##$USERP5= <user>
##$WDW= 1
##$XDIM= 32768
##$YMAX_p= 328017707
##$YMIN_p= -201284
$$ End of Bruker specific parameters
$$ ---------------------------------
##NTUPLES= NMR SPECTRUM
##VAR_NAME=  FREQUENCY,     SPECTRUM/REAL,   SPECTRUM/IMAG
##SYMBOL=    X,             R,               I
##VAR_TYPE=  INDEPENDENT,   DEPENDENT,       DEPENDENT
##VAR_FORM=  AFFN,          ASDF,            ASDF
##VAR_DIM=   32768,         32768,           32768
##UNITS=     HZ,            ARBITRARY UNITS, ARBITRARY UNITS
##FACTOR=    0.157963299565203, 1,           1
##FIRST=     4115.31405143758, 0,            0
##LAST=      -1060.66938541543, 0,           0
##MIN=       -1060.66938541543, -201284,     0
##MAX=       4115.31405143758, 328017707,    0
$$ Real data points
##PAGE= N=1
##DATA TABLE= (X++(R..R)), XYDATA
$$ [...]
24022c1194P990L8687M8225L780o0717l5365R354O151L7919J4003O6318P073n5565
24009E6659k4051j7740K6007K6068l0001j3900J425l6792m6860j1333O1440K8121
23997A9043o385j7913j1723J2822L2622j2448J5179p60q99k0390O344k4166j0896
23984a9570o72j4645M156K377J2747K6673J1727l0032l1792m6889k6205K8449
23972h3676O5766L6559o348n03p97n0579J2560K9384J0190k2912O32j2348k1108
23959d3180k0141L8412J7702J3558o19K853M4372J3038j3862L5338K5937m2653
23947G0755K735l3330l6942k1804J5576K1229L9301l3784N404J5347L662K4050
23935G2199m8249o9211p2467J6086J9029N8957j0682R027j6456M4030L8014m4139
$$ y = [-31194, -23204, 15483, 63708, 67488, 6771, -28594, -19240, -13089, 24830, 38833, 105151, 112224, 56659, 32608, 14868, 40875, 66943, 36942, 23042, 24467, -12325, -59185, -70518, -9078, 19043, 12658, -5255, -16978, -4156, 28466, 16018, 31197, 30437, 29538, 9148, 15492, -8674, -19570, -20242, -34887, -30731, -28354, -15607, 11066, 22793, -7239, -39031, -85920, -112125, -83676, -17910, 18649, 12301, 11798, 11001, -39578, -27018, 2366, 12556, -10356, -9724, -22072, -43180, -63321, -24909, -7207, 6351, 5732, 8585, 52957, 65995, 52133, 87471, 113408, 70755, 73490, 40160, 3218, -18586, -3010, 18219, 57520, 23736, 29140, 44487, 48149, 72199, 23950, -45261, -117728, -101642, -82613, -23656, -34338, -25311, -41767, 2263, 40277, -3862]
23923c862m7740K6778J7640j9589m9853J4056m212n69Q312j7976K4090L8685J4385
23910A45r890k3044k4650L5255J9054k6514j6712Q444L1704L6153L0728l3173
23898B7500p414p091J821N257m8585k6609M0151M0684J5471j1594m2166Q373k0762
23885b4964l9365j496L2891r086J2049P000o409J213J8945O55M3114R631m0878
23872C300O68m4489n46L1602N0467o679j7935p5337R544K5624L6368Q359n698
23859A5248p950m873K8894J547j9584l7217l5920k5522R463N7828K6181n03K9442
23846C7034n766l1752l1085j7179l0542j8095Q8P618J89M073o051M6213r98p0942
23832a17195k2479O5718O6609j6811K0381p084K3186M5214n9741k3225o85L2574
$$ y = [-3862, -51602, -24824, -7184, -26773, -76626, -62570, -66782, -67351, -59039, -77015, -52925, -14240, 145, -9745, -32789, -57439, -22184, -3130, -29644, -46356, -37912, -6208, 29945, 60673, 27500, 20086, 12995, 14816, 20073, -28512, -55121, -14970, 25714, 41185, 29591, -12575, -4202, -24964, -64329, -65825, -32934, -42020, -29971, -22971, -29380, -28167, -9222, -8567, 34547, 44178, 3300, 3968, -40521, -41067, -9465, 41002, 34323, 16388, -58949, -49405, -23781, 12587, 20946, 15248, 7298, 2425, 31319, 32866, 13282, -23935, -59855, -85377, -75914, -18086, 8095, 7592, 37034, 31268, -484, -31569, -48748, -79290, -97385, -97297, -89679, -89490, -85417, -91468, -45255, -46253, -117195, -139674, -73956, -7347, -24158, -3777, -10861, 12325, 57539, -2202, -25427, -26112, 6462]
23820F462P288k3560o385R762L4852J3844l1228L7300k2732m9026K1199R551K0035
23807B7362N3385o7605o6425L21P550K2513r26J536J7669J9955j1554j8147m822
23794a9188R269j1266k0253K8487J0793k57j2903k4321j2861Q514J2098k5482
23782e7370n2140J8900K6831K9260K5085P200j2220L2892K2926j7367l7760l4731
23770d8494L7182K3872k3552K5631l4690o718Q556j792J6874k7172n5962J1332
23758g4933P727K4383M8482k5898j1585j3843J7464L303P6990M2039k2291l2216
23746C9622O502j2877n1335j7307J3047j9644J5360N978K5797l0405K7540m689
23734b411m6697J7388M1734M3216j6015l3699l6960m827M2179j8150K4509m679
$$ y = [6462, 13750, -9810, -16195, -6433, 28419, 42263, 11035, 48335, 25603, -23423, -2224, 7327, 27362, 80747, 13142, -53283, -52962, -45412, -22899, -23825, -22289, -4620, 15335, 3781, -14366, -19188, -9919, -21185, -41438, -12951, -2158, -2415, -15318, -39639, -52500, -43986, -31888, -57370, -109510, -90610, -63779, -34519, -9434, -2234, -14454, 18438, 41364, 23997, -13763, -48494, -11312, 12560, -10992, 14639, -20051, -26769, -18213, -20005, -3131, -30303, -86265, -74933, -67206, -42823, 5659, -20239, -31824, -45667, -28203, -24900, 52090, 94129, 71838, 39622, 46124, 33247, -18088, -35395, -22348, -41992, -26632, -20654, 5143, -25262, 2278, -2411, -49108, -31720, 10014, 53230, 37215, 3516, -33444, -38271, 3908, -14242, 10267, 5588]
23722E588q869Q754M4719l0900J7529p667q85l0577q491l2068k6977J3910N9131
23709C197L7619J3774m855l0670O876l3915k0432J0492N068N2429k3500l2173
23697a6090p297M0633o509k5320M244K6424J4975K1702r254l455p191j3356j6407
23684C099L1879O53r072k8089J1970j2068J162M5457k564o5818J4216j5916j5966
23671d1057K8642J2345J4057K4952M5402q64K5910j1692j543M009k4352o78m486
23658G0645N665j421l3743J8857O459l5499J4809k9813p670m5208k3945M9154
23646a1710M5371N4228J2241k7435l5979n358L5956k8175j723k2767o290K6258
23634C4617R225J3858L788o2676k5242k1160k2699J8391O2739O9214j9678l4434
$$ y = [5588, -3281, 5473, 50192, 19292, 36821, 29154, 28269, -2308, -10799, -42867, -69844, -55934, 3197, 40816, 54590, 49735, 19065, 25941, -7974, -28406, -17914, -12846, 39583, 16083, -16090, -23387, 17246, 10737, -14583, -10339, 16085, 31060, 52762, 43508, 40053, 32862, 19506, 3099, 34978, 35631, 26559, -1530, 10440, -1628, -466, 44991, 42427, -23391, -9175, -25091, -41057, -12415, -70, 13987, 38939, 84341, 83477, 109387, 97695, 96152, 100161, 75809, 75131, 70645, 76310, 74889, 41146, 60003, 66462, 30963, 45772, 15959, 8289, -36919, -60864, -11710, 33661, 87889, 100130, 72695, 36716, 31358, 67314, 39139, 37416, 14649, 8359, 34617, 43842, 57700, 61488, -1188, -26430, -47590, -70289, -51898, 10841, 80055, 60377, 25943]
23622B5943R062n6875l4165m983L4212K4637k7832N9911K1738j2313n2055j5591
23610b8311k1789J5742l0310n130K9560K9865L8483J7729L495m2807m0997q947
23598d3417L2270L9031L1n922J4385L4832m2665n7874J213L130N690J9360K8359
23585B8423J6394m0456n9561k0755O2411N8745L4446p369o8467l6355M0856K1230
23573B9542m3016m7798J9376r673q048J1749K8950L745m1434k8016J3431N2070
23561a9122P7348m1739o3275L3452j286K7257k053O590o1634J4790M1172l2533
23549b1033K0975J8256j1530L995r54j3801L675J054n675J1313l1300L2508J3851
23536B1334o487M0501k3581r697J3882Q100j570k1041k0501J2705J1645j4784
$$ y = [25943, 35005, -21870, -56035, -61018, -26806, -2169, -30001, 29910, 51648, 39335, -12720, -28311, -50100, -34358, -64668, -69798, -40238, -10373, 28110, 45839, 49334, 6527, -34470, -43417, -11147, 27884, 27915, 21993, 36378, 71210, 28545, -29329, -28116, -24986, -19296, 64, 28423, 44817, 4361, -55200, -75955, -13544, 45201, 79647, 72278, 3811, -32544, 8312, 29542, -13474, -61272, -41896, -51569, -59617, -47868, -18918, -15173, -56607, -84623, -71192, -19122, 58226, 16487, -46788, -13336, -14622, 12635, 10582, 17172, -44462, -29672, 11500, -21033, -58, 18198, 6668, 10663, 9709, -4092, -417, 637, -5038, 6275, -25025, 7483, 21334, 14847, 55348, 31767, 22070, 35952, 44052, 42482, 21441, 940, 13645, 25290, 10506]
23524A0506l2513k2194n618J8099j5144L0417k0692j8225K2296j6368j4862M3581
23512b0717P307N13m471L0596K5041l0074k2308l3822l3642P834J9190N0211M630
23499B88k5541J2247P307M4949p76k4927j2169l5793j4207l607K0603L1677k5385
23486b5334j1107L302k2426M1751M4864K1300l154k2839k9010M841J7117m0561
23474b1256n5791K4029J2292K8104K587J124L0357j6059L4263M746l3651M9663
23462F0408Q843J0459l9770m4719l223K8675o769j0119J3983J79m4537J6635o964
23449a6919L1221L0870m1036j2380J0586k1355N1935O1899k8520Q650q5l9506
23437C5360j4905l0842k2263k8073n213N5302L5312J6528n3315J118L4563j28
$$ y = [10506, -22007, -44201, -49819, -31720, -46864, -16447, -37139, -55364, -33068, -49436, -64298, -20717, -13410, -12897, -17368, 13228, 38269, 8195, -14113, -47935, -81577, -73743, -54553, -4342, 288, -25253, -13006, -5699, 39250, 38474, 13547, 1378, -34415, -48622, -52229, -31626, 51, -25334, -36441, -33139, -55565, -13814, 31050, 52350, 49196, 26357, -2653, 2188, 19305, -21256, -77047, -53018, -40726, -12622, -10035, -8911, 21446, 5387, 39650, 44396, 10745, 60408, 69251, 79710, 39940, -4779, -8002, 20673, 13904, 3785, 17768, 17947, -26590, -9955, -16919, 14302, 45172, 4136, -8244, 2342, -19013, 32922, 94821, 66301, 74951, 74866, 35360, 20455, -10387, -32650, -60723, -65936, -10634, 24678, 41206, -12109, -10991, 23572, 23444]
23425B3444l1046k8290K4645N555K4331J8748M195J7668p593l7703P101n6865
23413c5810n5049L3927N9397O01k4170Q327m2817p311j8410L8874N9456L5577
23401E2592M426n380R526k6182j2052r008R97J0520l7218m3659R330L3140R351
23388c617l0474m3918q614L6565L0263j4595l4614j4105L5129K4064O7214P2251
23376A15549P0424p1865l9252n2502l4297K302j2609l8859k1830J3502L9172M7548
23364A7283j8383l3770j0645K337K941R994n85K5911L4468N253p959k785M7356
23351G1416l9441o0689J001R786N5344Q3826M38k7606m3533k2042j1950j6147
23339D03j9091J9232J7563L4309l5531p1460j3827M6660J0695Q435J6015K2554
$$ y = [23444, -7602, -35892, -11247, -5692, 18639, 37387, 41582, 59250, 51657, 13954, 21055, -35810, -90859, -56932, 2465, 3066, -21104, -12777, -55594, -62905, -81315, -42441, 17015, 52592, 57018, 51638, 61164, 34982, 22930, 13922, 14919, 25439, -11779, -55438, -46108, -12968, -3617, -34091, -78009, -86623, -50058, -19795, -34390, -69004, -83109, -47980, -23916, 43298, 115549, 185973, 114108, 74856, 22354, -11943, -9641, -22250, -61109, -82939, -69437, -30265, 17283, -1100, -34870, -45515, -43178, -40237, -30243, -30828, -4917, 29551, 34804, 26845, 24060, 71416, 31975, -28714, -27713, -17927, 37417, 121243, 121681, 94075, 50542, 28500, 16550, 403, -18688, 544, 18107, 52416, 16885, -54575, -68402, -21742, -11047, -2612, 13403, 35957]
23327C5957k5451R886j0887l7006L9328J8958m4835n6079L2540Q63R356K8315
23315I45L856l4378k0822Q0524L8209k588K215j1661m1985j2861k5064o6516J0059
23302h0067J4204K1732P2026J599n1945l9756P572K1521K4716j7618j0969q612
23290d5597L559N1566K5649o256k4965L948L4838L3658P356k3354J016j8034O791
23277E0175k2565k2408k2022j7819M3562K5595M1180m2343k7489N1989J8891q153
23265F8593r272J6099o7272l2770l3645j3886N8402q900l0400N0413N1250J713
23253E0325k9893k2558K65J6205m0358j8695J8831q956m2289L1607L515J4869
23241b7132J2814J2518J5220n4659n8944k3121l133J4421O6361K4305K2393m3780
$$ y = [35957, 10506, 20392, 9505, -27501, 11827, 30785, -14050, -70129, -37589, -36726, -27370, 945, 4801, -29577, -50399, 30125, 68334, 65746, 67961, 56300, 14315, 1454, -23610, -90126, -80067, -65863, -44131, 27895, 29494, -22451, -62207, -54635, -33114, -8398, -26016, -36985, -45597, -42038, 9528, 35177, 28921, 3956, 7904, 42742, 76400, 83756, 60402, 61418, 43384, 50175, 27610, 5202, -16820, -34639, 8923, 34518, 75698, 33355, 5866, 57855, 76746, 68593, 59321, 75420, 8148, -24622, -58267, -72153, -13751, -22651, -53051, -2638, 48612, 50325, 20432, -2126, -1861, 14344, -26014, -44709, -25878, -34834, -77123, -45516, -42001, -27132, -14318, -1800, 13420, -41239, -100183, -123304, -126437, -112016, -45655, -21350, 1043, -42737]
23229d2737k1641l0044N0314L4235k6404k4479l2K6455O3855o227j7468J2005
23217A7832k0440n0436K5797J3n1976K258L9052J9399N7280k5608k9809l747K2805
23204B420q773r918O9361J9601J987j424m6791m9124m8165K713L3606L773k6479
23191e7213K1832O9524K9526l9046o4824q061L5716L3210l2037p522k9664j7652
23179f6211K1480k8543M1739N1237J348J0742N1373n9491o5321k6494N530J6047
23167d6564k4405L956J03573L6494k5183l1616l3161q60K5793L6395l1293j1900
23155A229j7522n3754j0782j0386J7457K3915J6939M2757j0515O980j0470J6437
23143A2285M6237q26k5741r482J7436K3154J2650n3752l373L8007n119l4582K9653
$$ y = [-42737, -64378, -94422, -44108, -9873, -36277, -60756, -60788, -34333, 29522, 23295, 5827, 17832, -2608, -53044, -27247, -27234, -79210, -76952, -37900, -18501, 38779, 13171, -16638, -20385, 2420, -6353, -16271, 53090, 72691, 74678, 73254, 26463, -22661, -70826, -68113, -34507, -30734, -57213, -35381, 34143, 63669, 24623, -40201, -48262, -12546, 20664, -11373, -18895, -48559, -66211, -44731, -73274, -31535, 19702, 21050, 31792, 83165, 23674, -41647, -68141, -62611, -46564, -70969, -67013, 36560, 73054, 47871, 16255, -16906, -17766, 8027, 44422, 13129, 1229, -16293, -70047, -80829, -91215, -73758, -49843, -32904, 9853, -662, 6318, -4152, 12285, 58522, 57696, 31955, 22473, 39909, 63063, 75713, 21961, 18588, 56595, 51476, 16894, 46547]
23130D6547p509p9199L9872J5739l5545j6521j8796K6487K0048R377J9261m0249
23118b0488l8511k7837j1109k7882M2747J06608l862n1720l2231L135R353L8036
23106a3761K3182r995k4329j1292N126M9842J8526l0828J111l6014L1233N9942
23094F2743L478j8485k8729M1481M1197J2321n4360o2981q008k4254J0777L4314
23082I494O263m1116K1416m962L0794J0292m6381l4341O706L4440j221J3620L2978
23069C7982K531l9851M9981l2604q2962n5230N3642L4419p817q746r0226m574
23057a43455K7637N2267O5340M2260J7936k4309k2978o4762J4358J1274j4468
23046c8900l9880L2413M0808k2942L0347L5586m524J0798J2799j9939j4805p384
$$ y = [46547, 39038, -40161, -289, 15450, -20095, -36616, -55412, -28925, -8877, 500, 19761, -20488, -58999, -86836, -97945, -125827, -83080, 23528, 19666, -32054, -64285, -61150, -51797, -13761, 9421, -574, -24903, -36195, -31069, 18773, 37299, 6471, 7582, -28432, 2801, 62743, 66221, 47736, 19007, 60488, 101685, 114006, 59646, -3335, -11343, -35597, -24820, 9494, 15757, -25359, -3943, -8905, 21889, 32181, -14200, -48541, -41835, -7395, -8616, 5004, 37982, 40513, 662, 50643, 18039, -64923, -120153, -66511, -32092, -39909, -48655, -138881, -143455, -115818, -63551, 1789, 44049, 61985, 37676, 14698, -50064, -35706, -24432, -38900, -78780, -46367, -5559, -28501, 1846, 37432, 32908, 43706, 56505, 36566, 21761, 14377]
23034A4377j7009o229m5654p328q070J9089L5071J8881L8515k4451m1636l2078
23022e6522j9710m977k9648O3901m34l1606r452J9728k3330J3139M3583j7897
23010e3225J1678j661j1346k2984J5864N6607L591K0617J6444o4768l6537K6852
22998c8868K3223j3039o4322j5937L1194M1574K4757L1000K260j1766m5382P094
22986b8212J7236K7714k1358k8570J0822r297n3706K9289J7356Q459L2306L2303
22974C4342o1057j3023n230K3722J0006L551L6257L9789K7973j7121K5322M3357
22962A47888n3035r7035n5712J445J9070J3748J393q5517L3398O5702n0159k4120
22950h2934J6575M0735l2446j5315N8636J8772k9555N1321K2118k0346j9360l0812
$$ y = [14377, -2632, -8861, -54515, -61843, -69913, -50824, -15753, 3128, 41643, 17192, -24444, -56522, -76232, -81209, -110857, -46956, -47390, -78996, -88448, -68720, -92050, -78911, -35328, -53225, -41547, -43208, -54554, -77538, -61674, -5067, -1476, 19141, 35585, -29183, -65720, -38868, -15645, -28684, -93006, -108943, -77749, -36175, -11418, 19582, 21842, 10076, -35306, -28212, -10976, 16738, -4620, -33190, -22368, -31665, -85371, -56082, -38726, -30267, 2039, 34342, -26715, -39738, -44968, -21246, -11240, -7689, 28568, 68357, 96330, 79209, 104531, 147888, 94853, -2182, -57894, -56449, -37379, -23631, -22238, -107755, -74357, -8655, -58814, -82934, -66359, -25624, -58070, -73385, -14749, 4023, -25532, 25789, 47907, 27561, 8201, -22611]
22938b2611N4597k2871q148L7732K222l4833L0218M0044l0064k8093n7454J0395
22926b8866J2405l4678m656J0052J0539L7142J3847J1207J6511P3594j9631m7164
22914E0302q486l6092m3472m7308J0585M0506N2605J5002k4545J2595L3061m819
22902D9934r714o2279j7261K1191K2393J5738l842n362J3801j2400m8037P894
22890b7944L6137R753q73K0779J0917l6620o06M8K360P473k6520K029k92j7863
22876b1222L3022j0782l7346l2665l5978J3566M3242M8642k6290l0489j498K6613
22864c1185J781q102K0389q134K4754O7501J36m8330J7779K9701l274o4592k3114
22851b4690L2135j746l9207J7619J244L5305L7800k5359j9044K1887l4227l3959
$$ y = [-22611, 31986, 9115, 967, 38699, 40921, 6088, 36306, 76350, 46286, 18193, -39261, -28866, -16461, -51139, -55795, -45743, -35204, 1938, 15785, 26992, 43503, 117097, 97466, 50302, 41816, 5724, -37748, -85056, -74471, -33965, 18640, 33642, 9097, 21692, 54753, 49934, 40220, -22059, -39320, -18129, 4264, 20002, 16160, 10798, 24599, 12199, -35838, -27944, 8193, 17946, 17073, 37852, 48769, 12149, 11543, 11591, 13951, 21424, -5096, -3067, -3359, -21222, 11800, 1018, -36328, -68993, -104971, -91405, -48163, 479, -25811, -56300, -57798, -31185, -29404, -37506, -17117, -25251, -497, 67004, 67140, 18810, 36589, 66290, 63016, -1576, -24690, 7445, 5699, -33508, -15889, -14645, 20660, 58460, 33101, 14057, 35944, 1717, -32242]
22839c2242L2653j7289K1235J3124k1333o111L062J0103O397K5622k836k1536
22827A0849k6846K501j1619k3381l420M3047O938n3575N730N9696L702n717q317
22814d12o501L7975P28j0393J1841m759k417K2523L5324q811N471j5099r0878
22801b5408l6003j1293Q625J0431L2996J7840j6560m990J8247P8963k2850L182
22789E3180j1567k8193J7829n650j7607k0155o030J2914j5591r738N3050j382
22777B1060J9710J033k1929j8304m3346J4888K1384L6080m8434m9796j2418M7267
22765c2805N180L4328L1520L533m5232k0851K4396l5496k5153K2671O0607L927
22753B6625n417k8077k1599Q129m277R49q594J2812L433K7621M1705L9916j9469
$$ y = [-32242, 411, -16878, 4357, 17481, -3852, -9963, -6901, 3202, 9599, 35221, 32385, 10849, -15997, -13496, -25115, -48496, -51916, -8869, -1931, -55506, -49776, 9920, 13622, 7905, -412, -6913, 31062, 31790, 21397, 33238, 28479, 26062, 48585, 83909, 75098, 80569, 65470, -25408, -61411, -72704, -64079, -53648, -20652, -2812, -19372, -24362, -6115, 72848, 49998, 53180, 41613, 13420, 31249, 25599, 7992, -12163, -18193, -5279, -20870, -30608, 22442, 21060, 40770, 41803, 19874, 1570, -41776, -26888, -5504, 30576, -17858, -67654, -80072, -32805, -27625, 6703, 38223, 41756, -3476, -24327, 69, -35427, -60580, -37909, 22698, 26625, 21208, -6869, -28468, -20339, -24616, -23667, -32261, -19449, -16016, 11605, 53310, 93226, 73757]
22740G3757m8513j1773M4k8824K0625J0153k6502R634R6561j1932p7626m5136
22728c9532M1757R545j0574J6874o077m5793k8311N996M5565Q092K2496l0925
22716a0887K7534K3218l5495P749K4278m285j5474K104k8784l2606j0058K7470
22704b5236m987K579K1308o791K1184L6072n4527l2539K445l2081J4218M9274
22692i081P364P439K0419L3124k0354l6033k2969L4202J9234k639o1187J2951
22680a7530L6599l8398Q534j0532J6410j1929J7296P790N9529L3899j2677m3340
22668D5651J4354Q448P767K7852m4055l9491K0650l219j5129M37P777L649K4610
22655E9301M4819k204m3155m6210k1633K6549o751j8415J2668p482M1890j0143
$$ y = [73757, 25244, 13471, 13515, -15309, 5316, 15469, -11033, -1399, 95162, 83230, 5604, -39532, 2225, 11770, 1196, 18070, 11993, -33800, -62111, -56115, -10550, -2458, 20038, -10887, 16647, 39865, 4370, 12119, 36397, 32112, 16638, 18742, -10042, -42648, -52706, -25236, -30223, -27644, -6336, -13127, 8057, 44129, -10398, -42937, -40492, -72573, -58355, -9081, -1717, 5722, 26141, 59265, 38911, 2878, -20091, 14111, 33345, 30706, -30481, -17530, 19069, -19329, -10795, -21327, -4917, -16846, 450, 8240, 67769, 101668, 88991, 45651, 60005, 68453, 76220, 104072, 60017, 20526, 41176, 37957, 22828, 23265, 31042, 34691, 59301, 104120, 101916, 58761, 12551, -9082, 17467, 10716, -7699, 4969, -2513, 39377, 29234]
22643B9234n1382J0937r430k4127j3730J1676K6560L9736L1062j3692j16j6149
22631B0579m6286R86M4410j3887m2535R178n714J2019J2506r2215l8718L5934
22619a03743n329j2968O2564O0832j8579k5604L7118j3982k7229k1834N089L6957
22607b6708n014N304J5526k0099J6881j9125q664K882r208K7610J2508k0547J3852
22594a4802K8835j7354n4268q294j0943L6258L2324j205k4614j7996R536K5777
22582a6746q52l5027M602J1687K5243O4538K1407j0418j2178o1482k6904n3233
22570h9363q386J7413N8218K8837M030j6221J5149K0706n688k4473n0197o046
22558e6021L2868R97l3819J9897N7377K0676l9938K2143K6994J4878o4759o2327
$$ y = [29234, -22148, -11211, -20641, -44768, -58498, -46822, -20262, 19474, 50536, 36844, 36728, 20579, -25707, -24721, 19689, 5802, -36733, -27555, -33269, -21250, -8744, -100959, -139677, -103743, -109072, -122040, -59476, 1356, -17223, -42827, -5709, -19691, -46920, -68754, -63665, -26708, -31722, -26418, -10892, -30991, -14110, -33235, -41899, -39017, -48225, -20615, -8107, -28654, -14802, 14033, -3321, -57589, -65883, -76826, -40568, -8244, -9449, -34063, -52059, -42523, -16746, -17598, -52625, -48023, -36336, -11093, 53445, 74852, 64434, 52256, -9226, -36130, -89363, -97749, -80336, -22118, 6719, 10749, -5472, 9677, 30383, 24695, 222, -49975, -56021, -23153, -22156, -55975, -36078, 21299, 41975, 2037, 24180, 51174, 66052, 1293, -61034]
22546f1034K0095J6641P130j7165N1414M0776k0816n6262m398L6812k3549l3380
22534d3736m771l367L5400M3766J7212l325j3490n495k6297j7047k2374q3j2474
22521e6081J3492l194j0506M756M5834J430k5234K530P9898J3593r126q005O706
22508E6093O56L306N429K6302k6555o5201j1278k4690n062K3641K2093R585J3489
22495B7808J403l4622k3836M0773l7776k7939N0843P732j5052J252p259j3330
22483c0003o312J8509k9704l4100N5480K8729j9280j2150J0328p435k3200M3255
22471e883R694m3204m0825l4844N0678O2740M2635j0132O75J9470j8912j8190
22459A3902j2827j6875l6261j8719J5351L9722j51o99J9027J7350K8080n2412
$$ y = [-61034, -40939, -24298, -17168, -34333, 17081, 57857, 37041, -19221, -23619, 13193, -10356, -43736, -48507, -51874, -16474, 27292, 44504, 41179, 27689, 22194, -4103, -21150, -43524, -43607, -56081, -42589, -45783, -56289, -51533, -5699, -4269, -29503, -26973, 52925, 66518, 57392, 49387, 56093, 56749, 60055, 65484, 91786, 65231, 30, -11248, -35938, -41000, -17359, 4734, 14319, 27808, 29211, -5411, -29247, 11526, -26250, -54189, -3346, 4386, -10666, -9414, -16673, -30003, -36315, -17806, -47510, -81610, -26130, 2599, -16681, -28831, -18503, -25938, -49138, -5883, 3811, -39393, -80218, -115062, -64384, -1644, 40991, 30859, 31534, 51004, 32092, 13902, 1075, -15800, -52061, -70780, -55429, -15707, -15858, -16557, 2470, 19820, 47900, -4512]
22447d512L921P2571K7172l3204m1951k0654n9373j7724J0207K9605K8393K6799
22435B1250j3267k413k563M0719N608m0379L6970J20564Q719k4029k2480k9477
22423I9222l9936l1474k2509m212J1615Q25r275j0295n507l1408k7167M1040L1047
22410A966K1629J7270l1841m6716l5855R777K9925N4694n7924n8108j2109K8773
22398g8519J6727q316J6970J4336L037j4366m327o806k170k4428J4295M2775N8519
22385B7727L8424k6776k8952l2342J2580l441M490M2780p051j2203m138L9718
22373E0816J9486p432j3688k3913k750J900q5790l694J4426L1931p850%q225J4212
22359b0571k119K96l1426J8225j3716L1241O0570k4237J0019l3558r677j5181
$$ y = [-4512, -591, 71980, 99152, 65948, 23997, 3343, -56030, -73754, -63547, -33942, -5549, 21250, 7983, 5570, 3007, 43726, 49334, 8955, 45925, 166489, 175208, 151179, 128699, 99222, 59286, 27812, 5303, 1091, 12706, 13531, 4256, -6039, -11546, -42954, -70121, -29081, 1966, 23595, 40865, 9024, -37692, -73547, -63770, -33845, 20849, -37075, -95183, -107292, -78519, -61792, -70108, -53138, -38802, -35765, -50131, -54458, -61264, -63434, -87862, -73567, -30792, 27727, 66151, 39375, 10423, -21919, -9339, -12780, -8290, 34490, 27439, 15236, 11098, 50816, 70302, 62870, 49182, 25269, 22519, 24419, -61371, -65065, -50639, -18708, -26558, -26558, -34783, -20571, -22690, -22394, -53820, -35595, -49311, -18070, 42500, 18263, 28282, -5276, -14953, -30134]
22347c0134K3254n699N093K0666m2267Q223L4307L3705N2218m3324m5732j9251
22335h941k0951J0903R032p5326M2691M7361K4245K593m2074j0357p349k8418
22323e6591L1672o546K4619K4233L6187j1686j6673M0266J043K4780K0610l2672
22311G9242n1648J4281j885o9512k6404K844K2084K2198k4204m699j2845L340
22299d7208K5644k7563K5510N067L3216N0107l837r409P806k0361O393m5140n0611
22286e0386p965L6408j1521k5577O389K0826K8462J6611n914l2034P524K2995
22274E818O3679l8599j8985l252N027l3459k530L5785l1076J4809L7299J2810
22262D7326q739M6433K8726n9991m4279k0247J8219j860j821L2370J3594l9367
$$ y = [-30134, -6880, -12579, -7486, 13180, -29087, -20864, 13443, 47148, 99366, 56042, 10310, -8941, -29892, -18989, -9957, -85283, -42592, 4769, 29014, 31607, -10467, -20824, -28173, -56591, -24919, -31465, -6846, 17387, 53574, 41888, 25215, 65481, 66524, 91304, 111914, 79242, 27594, 41875, 39990, -29522, -55926, -53082, -30998, -8800, -33004, -37703, -50548, -47208, -21564, -49127, -23617, -18550, 14666, 64773, 60936, 51527, 59333, 38972, 45365, 225, -50386, -58351, -21943, -33464, -59041, -52652, -31826, -3364, 13247, 7333, -24701, -17177, 5818, 69497, 30898, 11913, 8661, 13688, -19771, -22301, 13484, -17592, -2783, 34516, 47326, 38587, 85020, 113746, 53755, 9476, -10771, 7448, 5588, 3767, 36137, 49731, 10364]
22250A0364J362L2090N648k4635L4897M4404j3471m1225j4846k2825m9384L3775
22238c846M5796l6989k9892J388l4430r045l835j4205q703K5644K7555k5691K148
22225f4105K7922J5070L4640j3150l0351k555J8341R998K1306L0499k2537j3960
22213A1118k7938m6315k407L0038p177m0949l777j8888K0846J3200r637P302O983
22200f7601J3228M5451J7674L6398R938l5958l2069Q695l1672J4588j2080j9262
22188e2670R685J9128j9326j2188M3650k1857n2597K7539P9073l539o542O7480
22176G7836j1495k6399o676j1199O062p099K7000j1829k3961J5850j2018o510
22164I562l523m050O5671o2891o9966p3369J2025O6060K8550J7758K86o7324k7497
$$ y = [10364, 11726, 43816, 49464, 24829, 59726, 104130, 90659, 49434, 34588, 11763, -37621, -3846, 41950, 4961, -24931, -23543, -57973, -67018, -70853, -85058, -93761, -68117, -40562, -66253, -64105, -36183, -21113, 13527, 377, -29974, -32529, -14188, -4190, 17116, 47615, 25078, 11118, -16820, -63135, -65542, -35504, -42681, -83630, -87407, -106295, -85449, -72249, -81886, -74584, -67601, -54373, -8922, 8752, 45150, 55088, 19130, -12939, -4244, -35916, -21328, -33408, -52670, -42985, -23857, -43183, -55371, -11721, -33578, -86175, -58636, 20437, 16898, 10356, 77836, 66341, 39942, 33266, 22067, 28129, 21030, 48030, 36201, 12240, 28090, 16072, 9562, 6039, 1989, 67660, 4769, -65197, -138566, -126541, -60481, -31931, -14173, -13887, -81211, -108708]
22151a08708M7274O9743L9379L0133L2922n7122o0794l0798k275P256l38m196
22139c7524J878M8736j228K1264N1885O401n3501J9204J8601k0853k5844n985
22127B3034j8864l6761K8680K0094L3205j3031m7333l0581K190M6952P94J08K1805
22114C0292J3063J9330l0141k1037J9516K3318L61j3016j8667q430k0535k5576
22102c1522m6316M8432N9080M873j0955j7762k2540K9540K0469k5948k7887J4121
22090f415j4008n605N630N5527N303j8259R989k8408J5387J5648k5078M1955P162
22077E8828m1921j3955J7603J7424j4482n9721l4917J6854K6524m50J764K6391
22065e8j1496m0656j610K550j7597K657N043O8321L4607o6943j7772o128L2757
$$ y = [-108708, -61434, 8309, 47688, 77821, 110743, 53621, -7173, -37971, -40246, -32990, -33328, -37524, -35646, 13090, 11862, 33126, 85011, 91412, 37911, 57115, 75716, 54863, 29019, 23034, 4170, -32591, -3911, 16183, 49388, 36357, -10976, -41557, -39367, 7585, 8379, 8487, 30292, 43355, 62685, 32544, 11507, 31023, 54341, 54702, 41686, 23019, 14589, -5946, -31522, -77838, -29406, 29674, 34547, 23592, 5830, -16710, 12830, 33299, 7351, -20536, -6415, -20423, -26028, -20398, 35129, 40432, 22173, 32162, 3754, 19141, 34789, 9711, 51666, 58828, 16907, 2952, 20555, 37979, 23497, -36224, -71141, -54287, -27763, -28213, -26449, -58, -11554, -52210, -53820, -51270, -68867, -66210, -61167, 7154, 41761, -25182, -42954, -49082, -16325]
22052a6325l0568m959M3283M8603L3688m271j1818J0321O753p867o3094j1938
22040h192K0615n973n2583N4206N9436j9751j9988l4724r190M7288K7296L988
22028F2428j2379j9620k553n5720k7859M9014M921j4968l4284j8132n172P317
22016f7007O265J6571j0334p239M9490M3308n5394j3868J5479O4312o636p8452
22004d3505m500J1376o127L5085L1177n7039k5619J4751O404J8352K3573l559
21992C69K3952K0881m086n0194j6043J0382n3541k9091l3942J8764M3248J5553
21980e3748K386N1196J5208o3355o3452K989N1413M018K5090N3186K5568m1504
21968H995l4924L2378K1492K0872k1929K0536P920j8788l7734O0645j2712j0311
$$ y = [-16325, -46893, -51852, -8569, 40034, 73722, 69451, 57633, 67954, 74707, 66840, 3746, -8192, 12423, 6450, -46133, 8073, 67509, 47758, 27770, -6954, -16144, 31144, 58440, 62428, 50049, 30429, 27876, -27844, -55703, -6689, -1768, -16736, -51020, -69152, -74324, -67007, -60742, -44171, -54505, -61744, -12254, 31054, -24340, -38208, -22729, 41583, 34947, -43505, -48005, -36629, -42756, -7671, 23506, -33533, -59152, -44401, -37997, -19645, 3928, 369, 24321, 45202, 41116, -9078, -25121, -14739, -68280, -97371, -131313, -112549, -69301, -53748, -51362, -166, 15042, -48313, -111765, -108776, -57363, -53345, -28255, 24931, 50499, 8995, -25929, 6449, 27941, 48813, 26884, 47420, 55340, 36552, -1182, 59463, 46751, 36440]
21956C6440K8457k8611m592n145N618j2002k1856j364L8335m2618j3309j968p5064
21943i7679J871L8542M2398O8316k4277o169K2159J0724l0747l4075k4102K5756
21931g283j7185R396k325L9318M8073R593l0440n0552J798p1183j768L6536l5156
21918g1178l6510N2238K4653M659n808k1265P573M913K4000K8623l0616j8156
21906c6874J1800k5693j1558N5355O8894n176j4239k2479j1212l5528p5324M6686
21894e5348J8036j3288p032J5902j4936p064r087j7379L1063O0797k4895k5647
21882d8878O2720M4902p0255L024j4950o5609L895N1879p983n6332L6152J6583
21870d4852J9365j7046n2474k550J5213K9914J3153L9819k7652O747L0051O753
$$ y = [36440, 64897, 36286, 31694, 26549, 32167, 20165, -1691, -3055, 35280, -7338, -20647, -22615, -97679, -95808, -57266, -14868, 53448, 29171, 23002, 45161, 55885, 25138, -8937, -33039, -7283, -24468, -15072, -17397, 21921, 69994, 79587, 49147, -1405, 393, -70790, -72558, -36022, -71178, -107688, -55450, -30797, -26138, -31946, -53211, -45638, -40725, -16725, 11898, -18718, -36874, -25074, -50767, -62325, -6970, 61924, 56748, 42509, 20030, 8818, -26710, -102034, -55348, -37312, -50600, -57632, -41730, -56666, -63730, -72817, -90196, -59133, 1664, -23231, -48878, 13842, 58744, -11511, -8487, -23437, -89046, -85151, -33272, -41255, -97587, -61435, -44852, -25487, -42533, -95007, -97557, -82344, -52430, -39277, 542, -27110, -20363, 9688, 16441]
21858A6441P540n439L653K979k6897J4901O97m6163m2445J9097k760L7496j05
21845b1005K2639L9418k9355k7093J0177J0721o245k646M880j0662K7725k8592
21833a0038j4678l0612j3436R268K8473J9639N245K8502K4685j4064l4829P516
21821E671P520J2346N539J7342l3928k9051L2137K453l2632k356N8415o31k0490
21808B2335L3713k2332k2196l2631m1926l8690M6069P0278K8384l4697j0368K227
21796A66q653J6647O2621J9882m4506n7613m9940l2543J0201N516J1277r0J7751
21783d9284K0156J9646K5233k3352k6898j6425k9976K1742O1982M8575m0544o5415
21771e4560K1484O5624P798l0400k6387j9400j1182P509K3437R279M1000K6621
$$ y = [16441, 23981, 18542, 22195, 25174, -1723, 13178, 13875, -32288, -74733, -55636, -58396, -20900, -21005, 1634, 41052, 11697, -15396, -5219, 5502, -743, -3389, 1491, -9171, 18554, -10038, -24716, -55328, -68764, -59496, -31023, -11384, -6139, 22363, 47048, 32984, -1845, 5671, 13191, 25537, 31076, 48418, 14490, -14561, 17576, 20029, -12603, -14959, 43456, 42825, 22335, 56048, 33716, 11520, -21111, -63037, -101727, -55658, 14620, 43004, 8307, -2061, 166, -8487, 8160, 70781, 90663, 46157, -11456, -61396, -93939, -83738, -78222, -66945, -67035, -49284, -29128, -9482, 15751, -7601, -34499, -50924, -80900, -59158, 2824, 51399, 10855, -54560, -33076, 32548, 40346, 9946, -16441, -35841, -47023, -39514, -16077, -6798, 34202, 60823]
21759F0823j0987j4412k5135N964q026k0244j4359L9825q909n7133l981o095k2346
21746h5015J1926L0314O536l1982l3412J5695n366p674L3144K2994M585j4009
21734e2264L0083K0317L4116k7202q450j8412m9653K6038L8640N1778j434l1107
21722A2450J9016P056P79j7768j4496l2589R418L5346R6k6929j5215J1999q949
21709a9786k5160J3500N4336q9l3257k3086J7473Q746l3139Q562O0494J2936l9778
21696A752j4150M1366K5957L077l3034r313m0596K0819K7070J0956k8294q433
21684b823M6086L1901N390n737l2641m8925m8230K1607L4748M2449j9915j6055
21672G855O3162j3034n9162j5419L8486L697k8038R086p850L526l1310j1250J2245
$$ y = [60823, 49836, 35424, 10289, 16253, 8227, -12017, -26376, 13449, 4540, -52593, -56574, -62669, -85015, -73089, -42775, -36239, -68221, -101633, -85938, -91304, -98978, -65834, -42840, -38255, -52264, -22181, -1864, 32252, 5050, -3400, -21812, -71465, -45427, -6787, 44991, 43557, 12450, 31466, 38522, 39301, 21533, 7037, -25552, -16134, 19212, 19308, -7621, -22836, -10837, -19786, -44946, -31446, 22890, 22801, -10456, -33542, -16069, -7323, -40462, -31900, 28594, 41530, 1752, -12398, 28968, 54925, 58002, 24968, 15655, -24941, -4122, 22948, 33904, 5610, -2823, 43263, 75164, 80554, 74817, 42176, -6749, -54979, -33372, 1376, 43825, 23910, 7855, 71017, 57983, -1179, -16598, 21888, 25585, -2453, 6633, -1217, 2309, -29001, -40251, -28006]
21659b8006j3308n079l9549J215J9706K9675M7173N1291l6249m839N077m2573
21647a5466J1134M755L038j2135k3241K4863J1161q524J377l6861r484J2289n7467
21634i4561l8138K7383N8343L8159J7693N622J47P9k0061j1504k0859k9145M202
21621f2640Q6499k9608m3722L4275k2512K1744J032q566Q658k0897j7631k5967
21609g9335K7537j3721J9289P0577K3068J4386l0377j2612k1866m4568m051j6024
21597f7697j2623O583Q2480L0699k4937k3785k0390o3078m3469L9708K4563K9244
21585d2702K4876O144K9996k8030j052K6639L6479n917k5392k0204k425k710k4993
21572b9291M4387Rn4934L1560L4732J66j3759k9530l5179K1637j0877K6477K6770
$$ y = [-28006, -41314, -46393, -85942, -84727, -65021, -35346, 11827, 63118, 26869, 22030, 27107, -15466, -4332, 423, 3461, -8674, -31915, -7052, 4109, -4415, -3038, -39899, -49383, -37094, -94561, -132699, -105316, -46973, -8814, 8879, 14501, 14648, 14727, -5334, -16838, -37697, -66842, -62640, 23859, -5749, -49471, -15196, -37708, -15964, -14932, -23498, -14840, -35737, -53368, -79335, -51798, -65519, -46230, 24347, 47415, 61801, 31424, 18812, -3054, -47622, -51673, -67697, -80320, -73737, 8743, 39442, 14505, -9280, -29670, -92748, -136217, -96509, -71946, -42702, -17826, -11682, 18314, -9716, -10768, 15871, 52350, 46433, 21041, 837, -1588, -4298, -29291, 15096, 15105, -39829, -8269, 26463, 26629, 12870, -16660, -51839, -30202, -41079, -14602, 12168]
21559A2168l3657L2660j9620l1465j8328m86O0589K5792K0271l8065k2162K4691
21547A2388K1942J3072k7612L487j115o1166l5584j0121L5996R173J4438J2501
21535a2601j0950J488J5380p935J2918J7653L2207j7928l053j4851J611J6689
21523C0628O12r013J947j1389n3407n7952k895P8321K6819O2857k7674n7791O310
21510a2627K1417J9741N7639J9125q8962n8809k5530N552J0617k7750J7182L0747
21498c1658L9879K1816j367l0509j2872n4389k161K3258j9975j6550Q221J595
21486g4712L5596L6841j595k3914M36m3812k2908M7956L6032n5776o0446n064
21474a31366L730K5639M0905Q618K7997O900m6127K4207M4937j0076O285k7769
$$ y = [12168, -21489, 11171, -8449, -39914, -58242, -58728, 1861, 27653, 47924, 9859, -12303, 12388, 34330, 47402, 19790, 23277, 22162, -39004, -74588, -84709, -48713, -39540, -25102, -12601, -23551, -22063, -6683, -14618, -1700, 15953, 48160, 30232, 27179, 12328, 13939, 30628, 31240, 22227, 24174, 12785, -40622, -98574, -101469, -23148, 3671, 66528, 38854, -18937, -12627, 8790, 28531, 86170, 105295, 16333, -42476, -68006, -62454, -51837, -79587, -62405, -31658, 8221, 30037, 28670, -1839, -14711, -69100, -71261, -48003, -67978, -84528, -76307, -74712, -39116, -2275, -3870, -27784, -27348, -71160, -94068, -46112, -10080, -65856, -126302, -131366, -127636, -101997, -61092, -52474, -24477, -17577, -63704, -39497, 5440, -4636, 1649, -26120]
21462b6120J0212J6144j5501k9793l1649q611j7224j9828K8767K9281L4556L9578
21450I812O952K7128K3109K5382m5236l6100j4550m5543P147L6433K7900o265
21438A6169J4641K1255r013q3623L6497Q3965N3834J3132p601n0989j371l5658
21426E1238m6538o1584j8683q579j3578j4985M1723J9379K6308m6070l8442K5039
21414h4772L8611N3410L6679l123j8909j5551k1517k0658J4772J6426M8215k5237
21402A8346k3856n712j5657L3096m9836k6239k6043o160p794J0040J9846M5786
21390c4183M0550k9863l5055j4149l8337q850N0751M3528R28m7520L0952N0288
21378I040j2168J3908k156J8100l3913N0341j996m6846l0268m8539P738M0478
$$ y = [-26120, -15908, 236, -15265, -45058, -76707, -85318, -102542, -122370, -93603, -64322, -29766, 9812, 16764, 43892, 67001, 92383, 47147, 11047, -3503, -49046, -41899, -5466, 22434, 16169, 30810, 52065, 43052, -40571, -4074, 79891, 133725, 146857, 139256, 88267, 86896, 51238, 4700, -56884, -75567, -84146, -97724, -112709, -70986, -51607, -25299, -71369, -109811, -84772, -46161, 7249, 43928, 40805, 21896, 6345, -15172, -35830, -21058, -4632, 43583, 18346, -5510, -11222, -26879, 6217, -43619, -69858, -95901, -102061, -109855, -99815, -79969, -34183, 6367, -23496, -58551, -72700, -111037, -119887, -69136, -25608, -24680, -72200, -41248, 9040, -3128, 10780, 8624, 26724, -7189, 43152, 41156, -5690, -35958, -84497, -76759, -36281]
21366c6281N101m91O711J3107M0533K5963J0724n8480m0061J1684k9120J4019
21354c6591K8409l641j2715k0925l9653J8901j3773K1551N4676l781J4732j7035
21342i845m1669n3K2415L905R513K7521J2322q1104m4082j7388J0532L1333j9534
21329i6134n344L0540N4500K8520R148j3339j3029m2162O114J6408j304P928k9022
21316d7176K5316K0621j2831K0263J8047j9966L4551M5740n8213j5145k4263k5863
21304c8919k511J9695r642k1049k2728J6161M7139J9864p2950m906J7898q333
21292f0281j4675j910j7492k0152N3007K8149k0260K4584l2300q7720L7575J17958
21280F483J2242J8429J2703k9054n3567L6858J3851m5770j5045L7040K3586k1784
$$ y = [-36281, -31180, -31671, -24960, -11853, 28680, 54643, 65367, 6887, -33174, -21490, -50610, -36591, -8182, -11823, -24538, -45463, -85116, -66215, -79988, -58437, -3761, -7542, 7190, -9845, -51514, -51567, -29152, -25247, -15734, 11787, 24109, -56995, -101077, -118465, -107933, -76600, -96134, -101478, -70938, -16438, 12082, 21230, 7891, -5138, -47300, -41186, -24778, -26082, -18154, -47176, -21860, -1239, -14070, 6193, 24240, 4274, 38825, 84565, 26352, 11207, -13056, -38919, -41430, -21735, -31377, -52426, -75154, -58993, -11854, 8010, -64940, -69846, -51948, -60281, -74956, -76866, -94358, -114510, -61503, -33354, -53614, -29030, -61330, -149050, -111475, 6483, 18725, 37154, 49857, 20803, -32764, 4094, 17945, -27825, -42870, -5830, 17756, -4028]
21268d028k5621j3887j1915q68K2219Q788L4915m6888K7378J1025j8994k9098
21256d6974K3606K9750P896K0578L232J2486q302m3297o6196l1329O1524M8863
21244A1837j655l3223j5324q742L1143J6320l4591k1745m5264j2334M4416J552
21232f7610p070N4384K0955k5932K1117J7498m4162j7683P8064L3559J0426l8354
21220C5192k4497l1209n6455l6192K759K4973L6920J640k156L9770M8340j7348
21208B1737k8495l6987l3803R788L2485j3103l4389M4996k7695K130J3441M8467
21196a428N0306P208l1700p2016o1159k5896Q8548Q8268o1236l2661j1333r860
21184g2959k9875K2776L0696J8176M8636L4215j308j293J4798n109j8065j3592
$$ y = [-4028, -29649, -43536, -55451, -56319, -34100, -25312, 9603, -37285, -9907, 1118, -17876, -46974, -23368, 6382, 14278, 34856, 38088, 50574, 42272, -1025, -67221, -98550, -37026, 11837, 10182, -23041, -38365, -47107, -15964, 356, -34235, -55980, -101244, -113578, -69162, -67610, -74680, -20296, 659, -25273, -4156, 13342, -30820, -48503, 29561, 63120, 73546, 35192, 10695, -20514, -76969, -113161, -110402, -85429, -48509, -46869, -49025, -9255, 39085, 21737, -6758, -43745, -77548, -67760, -35275, -48378, -82767, -37771, -65466, -63336, -49895, -1428, 48878, 56086, 24386, -47630, -108789, -134685, -46137, 42131, -19105, -51766, -63099, -72959, -102834, -80058, -49362, -31186, 17450, 51665, 50357, 49064, 63862, 58753, 40688, 27096]
21172B7096J6232j7917j3120M4027p5020o0448M1503N730M6918J4320J3840k7008
21160A6153O644L2921m3157j0310M1825m4412m3656J6026J2394M3106n9581q661
21148d0708K8878l330M779n875p815r726L0517k3110j4049K999K434K7996l0545
21135c7555L4295L4138j102m4886k0869j5689K9834N889Q1686O3217m9287l5984
21123D3687m313n6057jN2917L8394Q920l4700l9702P271J5137M2671l2735M436
21110D5925j0338l1313k7239P435o445J8776K2476M574n135K173q338m0101L7283
21097I733K2873j9260j8978J4982j9232j5531J8604m1040l8704O860k0848K1292
21085g9249J3397K3991P7230K6813l6445n5243l9147l4494j0145K4930M7860J9870
$$ y = [27096, 43328, 25411, 12291, 56318, -18702, -79150, -37647, -31917, 15001, 29321, 43161, 16153, 22797, 55718, 12561, 2251, 44076, -336, -43992, -27966, -15572, 27534, -32047, -40708, -11830, -15160, -10381, -16256, -24071, -33797, -3280, -26390, -40439, -37440, -35006, -7010, -37555, -3260, 30878, 29776, -15110, -35979, -51668, -21834, -15945, 65741, 128958, 79671, 43687, 39374, -16683, -16684, 36233, 74627, 83547, 48847, 9145, 16416, 31553, 74224, 41489, 45925, 35587, 4274, -22965, -15530, -21975, -3199, 19277, 23851, 18716, 20889, 12551, -27550, 9733, 32606, 13346, -5632, 9350, -9882, -25413, -6809, -47849, -86553, -79693, -100541, -79249, -65852, -41861, 35369, 62182, 25737, -29506, -68653, -103147, -113292, -88362, -40502, -20632]
21073b0632J6058K9283l9105l1292j8914k3896r469M5010J9851k0672K344K9201
21061b2233k7395n8712J2233L4608n703M15J6082K6348J9293k1176j3126j8088
21049e7454l9104p980L7134n7074K5660R0405M1293n373k2403R027J56J6416k5987
21036D716r816J4671J0702J2075K874J3619R369J273J3546l8631n9297M3694L0660
21023D9455k4545j3076j6304k2117K921L4971M5490n207k1122K0153P2335k5164
21011I7790k7563n3007j11J1922L017k9247j305J727r730l8888k6106J6748J7463
20998c7290l2227m259L1741J1381K4959j8609m885P665J5493K2004K9754n711
20986D0016o0824m3882l697J4171M7045N2534j8801K674Q487p203l138k9171j2313
$$ y = [-20632, -4574, 24709, -14396, -45688, -64602, -88498, -97967, -52957, -33106, -53778, -51434, -22233, -49628, -108340, -96107, -61499, -67202, -66787, -50705, -24357, -5064, -26240, -39366, -57454, -96558, -104538, -67404, -124478, -98818, -8413, 32880, 27507, 5104, 14131, 14287, 30703, 4716, -5100, 9571, 20273, 32348, 35222, 48841, 58210, 59483, 73029, 34398, -24899, 18795, 49455, 24910, 11834, -4470, -26587, -23666, 11305, 56795, 51588, 30466, 50619, 122954, 97790, 70227, 17220, 17109, 29031, 32048, 2801, 1496, 3223, -6507, -45395, -71501, -54753, -37290, -69517, -73776, -42035, -30654, -5695, -24304, -29189, -21524, -6031, 15973, 45727, 40016, -20808, -64690, -68387, -54216, -7171, 45363, 26562, 29236, 37723, 30520, 27382, -1789, -14102]
20973a4102k4441M7799M3050j2597j1227P105j4483j352J7448K0108q0003k0217
20961d2912J558j3920K1676N0243M8606j9449m6902m6321m523O847j4707O83j1725
20948g0846o501L2606L6954J1068l7802J7846L3913J1025l7150k2156O8381K6068
20936F3406k0716K403m3579m7205R815K7821k400N6495O8535j0805n3681m2296
20924G793m4180j8887K401J3120N4330M5542n058k9854k6212k564k3454J0339
20912a6684M6927Q478l2740j7238J489L7029j692K9106L6802j2820k4352l7657
20900A6648J1831j2851k3331p829j9289j6291l5397K9388j0266M6L5531K0567
20888a1243L1699R300K4245m6921m7083J4295K8689j8152o922N7977M2995j7530
$$ y = [-14102, -38543, 9256, 52306, 39709, 28482, 35587, 21104, 19752, 37200, 57308, -22695, -42912, -41354, -55274, -33598, 16645, 65251, 45802, -1100, -47421, -51944, -45097, -59804, -59121, -70846, -77347, -44741, -7787, 3281, -34521, -16675, 17238, 28263, -8887, -31043, 37338, 63406, 42690, 45093, 1514, -45691, -35876, -8055, -10455, 46040, 114575, 103770, 50089, 7793, -36387, -55274, -52873, -39753, 14577, 60119, 55061, 25207, -1005, -3569, -27023, -16684, 30243, 38721, 5981, -11257, -9768, 27261, 25569, 54675, 91477, 78657, 54305, 16648, 28479, 15628, -7703, -15532, -34821, -51112, -86509, -57121, -67387, -67341, -31810, -11243, 20456, 29756, 54001, 7080, -40003, -25708, 2981, -15171, -22093, 35884, 78879, 61349]
20876F1349l8427K39p738q312Q528m23k161K8891j0540j1690j6154k3611o703
20863b6752K9468K3608K527o2933J8516L3441L95K6119L9523k7253k6922o77N534
20850C4594l7419j6810L7309m458k8173k109k1091K2110M5300j2760M3982K6058
20838H6533l7981l2025K7230k3578J1326J3601k2015n7068J771L8302J671L1449
20826C9216m4537j1216l1633q483r155L0803N782j1725L2033J1850j4204J6103
20814D834K8216k9275m6547j4408J7799p925L1045M495k856Q612K2747r55k7537
20801a1755j6619j4128j2760j8583P316m0701q369J2378P067L5728k3041K473
20789h0994K4469J2810j3516M6681J2670p6460l3588L9080Q7697L4584P909q412
$$ y = [61349, 22922, 23161, 15423, 7111, 15639, 15216, 13055, 41946, 31406, 19716, 3562, -20049, -26752, 2716, 26324, 28851, -34082, -15566, 17875, 18270, 44389, 83912, 56659, 29737, 29060, 34594, -2825, -19635, 17674, 13216, -14957, -17066, -38157, -16047, 29253, 16493, 60475, 86533, 48552, 16527, 43757, 20179, 31505, 45106, 23091, -33977, -32206, 6096, 7767, 39216, -5321, -16537, -48170, -56653, -65808, -35005, -29223, -40948, -8915, 2935, -11269, 4834, 33050, 3775, -42772, -57180, -39381, -47306, -16261, -11766, -14622, -6010, 16737, 15782, -11755, -28374, -42502, -55262, -73845, -66529, -107230, -115599, -103221, -96154, -60426, -83467, -80994, -56525, -43715, -57231, -10550, 2120, -74340, -107928, -68848, 18849, 53433, 61342, 52930]
20777E2930m986J1894l01N95j5524l9569m639K3978l6900m8598M629j9199j7523
20764i3213L2182P2149L0078j8944R608j9177l3013O03m3355Q936Q425q009l1231
20751h4961J9529N4052Q200k340k0906Q621J5863J3937l7233n6306l4668k005
20739a18217K8876P5863N4847m8896J7181N8176L432R468l0659m2976K5802J5097
20727D7994j3343P445K0163L4312m9186q5479l5952j1378J7427K4284M5542N7264
20715E9093l1608l9116J7506l016j334M6356m940l8676j5573m9952M2538M0478
20703B1756n2231l5711K7830J0435J660L5494j7553l5395k250J3304p830j3706
20691e4197J5092K5204K5511J6168N981J0523K2527j5400l4457K0698L7336N2867
$$ y = [52930, 47944, 59838, 59537, 60132, 44608, 5039, 400, 24378, -12522, -61120, -56491, -75690, -93213, -61031, 11118, 41196, 22252, 31860, 12683, -20330, -19727, -63082, -54146, -45721, -53730, -84961, -65432, -11380, -3180, -5520, -26426, -17805, -1942, 11995, -25238, -81544, -116212, -118217, -89341, -13478, 41369, -7527, 9654, 67830, 71262, 80730, 50071, 7095, 32897, 47994, 34651, 42096, 62259, 96571, 47385, -38094, -74046, -85424, -67997, -43713, 1829, 59093, 27485, -11631, 5875, 2859, 1525, 47881, 42941, 4265, -11308, -61260, -18722, 21756, -30475, -66186, -38356, -27921, -26261, 9233, -8320, -43715, -45965, -32661, -40491, -54197, -39105, -13901, 11610, 27778, 33759, 44282, 66809, 51409, 16952, 37650, 74986, 127853]
20679A27853k5620R185n4287m3386j0454q315m3215R535m547l505K8472J8718
20667D34n1087J0672O418j508L6858P8348K6068m1793m3026k7565q471n1486J669
20654f4469L9117M9319O452K0871n7131m4330l8686L983L573K2931O387k434L7900
20641a6517L1542j5976j3371j6654N3872L6730l660j0145K3931j6260q605k1316
20629B3571r762K1762j2054J3761j2786j1235j600k011K5485O6326J9207l9302
20617H1362l8324k1132l2833j2987k8347j2036O3654k017m298r950k2110O760
20605c2258J0630r160l0514m720l9494L2524M8560j0053j9442L6368N4750m1953
20593d762l1535l242M5809L2290j9459n0248j3953r645k8256j1783R0383k566
$$ y = [127853, 102233, 111418, 57131, 13745, 3291, -5024, -48239, -38704, -43251, -46756, -18284, 434, -50653, -39981, -33563, -35071, 1787, 80135, 106203, 64410, 21384, -6181, -14652, -66138, -64469, -25352, 23967, 30419, 51290, -5841, -50171, -88857, -84874, -81301, -58370, -51983, -54417, -16517, 15025, -951, -14322, -30976, 22896, 59626, 55966, 45821, 69752, 53492, 44887, 23571, 13809, 35571, 23517, 37278, 24492, 13257, 11657, 9646, 35131, 101457, 120664, 81362, 43038, 21906, -10927, -23914, -52261, -64297, -643, -2660, -6958, -16908, -39018, -32258, -21628, -30788, -61302, -66022, -105516, -72992, -24432, -34485, -53927, -17559, 37191, -4762, -36297, -39539, 6270, 38560, 19101, -31147, -45100, -54745, -83001, -94784, -4401, -6967]
20581f967m6360l3541k5033J0087j9518M4356J9463L2685j2266n5352L1088L4362
20569b6996l1366k7338K0511O5186l338m5691k7k5097o434J6016K9364P168J7947
20556a0095K1011J7570l0681k4627j5684j9944q109J3976k2651N693J6037M3713
20544a3791K3304r776K7295m111j5565p2199j0121N1156K0028K1568j4912O422
20532I298M2199p224m9207l0494J947r934J2850M1234k4715J8054k0765j2910
20520b9667K2653M1588o757O1605k5534n1951J6704j9677o2309l7488J7037O4120
20508i676N1340K5867k5115m2512L718J0842k1651Q875M6959L414L5230J0414
20496I7705j7347m0885m3312k0532L2166J1069K4243K0561o0099k0965P966K61
$$ y = [-6967, -53327, -86868, -111901, -101814, -121332, -76976, -57513, -24828, -37094, -92446, -61358, -26996, -58362, -85700, -65189, -3, -3341, -49032, -49059, -74156, -80590, -64574, -35210, -28042, -10095, 10916, 28486, -2195, -26822, -42506, -62450, -70559, -56583, -79234, -73541, -57504, -13791, 9513, -263, 27032, 22921, 7356, -64843, -74964, -23808, -3780, 17788, 2876, 9298, 51497, 44273, -4934, -35428, -33481, -43415, -30565, 10669, -14046, 4008, -16757, -29667, -7014, 34574, 27817, 89422, 63888, 11937, 28641, 8964, -53345, -90833, -73796, -9676, 41664, 67531, 42416, -96, 3622, 14464, -7187, 1688, 48647, 52061, 87291, 97705, 80358, 39473, -3839, -24371, 7795, 18864, 43107, 63668, 3569, -17396, -9430, -9169]
20484i169J5225J7937n788n961k5372q721k9052J1290M0743j5849k9168r111k2923
20471g5919L0454J7148K3641K3301L733J9422L9952J0418O990n5850k8653k716
20459A1921K975J8981n277K9095m258o2012m3318M3756k640J9866O0904j2742
20447E7251m1508J810j8464M899l382k7764k7218j5753J5361N9352J0216O453
20435B1253j2596k0252j5827J5595L5095j7241N843r777K1257K3856p5782l9587
20423f8163M0334J7439K4910m3432m4936l34l8528M0231k13J7224j854j6071j836
20410g5229l7390l1748N2671N550L148K2401J9605N1116j2825j6261J9137r432
20398i257L5186m848k1074J70l9139L091m7J8898L9817l770J048m1673n210j9240
$$ y = [-9169, 6056, 23993, 18205, 12244, -13128, -21849, -50901, -39611, 1132, -14717, -43885, -52996, -75919, -45465, -28317, -4676, 18625, 22358, 41780, 81732, 92150, 99140, 43290, 14637, 11921, 14896, 33877, 28600, 57695, 53437, -8575, -51893, -8137, -10777, 9089, 69993, 57251, 15743, 17553, -911, 3988, 606, -27158, -54376, -70129, -54768, 4584, 14800, 21253, 8657, -11595, -27422, -11827, 23268, 6027, 11870, 2093, 23350, 47206, -28576, -68163, -27829, -10390, 14520, -28912, -73848, -74182, -112710, -72479, -72692, -55468, -57322, -73393, -75229, -112619, -144367, -91696, -86146, -82998, -60597, -40992, 10124, -2701, -18962, 175, -9257, 25929, 21081, 7, 177, -38962, -35871, -35918, -17020, 22797, 19027, 20075, -21598, -26808, -46048]
20384d6048J6269J0283j7637L3025O9226P998N921j3634l5702k3129K3854n216
20372B5210q624m663j1129j4786k1953J1447K6504m428m2172j4316M933N3813
20360a64o858J099k7820q545J3653p716j902m0502L1663J7201l3116J5321k9391
20347g7077l5145L1063N444L7195M5225J911k5050m8052k5871j3657l1187M1656
20335i3545M8671N1745K2293m469J929J5629k5818m7545L714p9513J5608N3148
20323c8153k0711l0380L4927N5985k2397q756M3343o464j8571m1756P544O4004
20311A8615j2195m1553K0058K8393k6018n3984K5528J957K6882J7201J5702J9207
20299C9793l0957J4582P038k5211J7820K1423N8800k7464p0784N5708M344l2301
$$ y = [-46048, -29779, -19496, -37133, -4108, 65118, 73116, 79037, 65403, 29701, 6572, 30426, 25210, 16586, 11923, 794, -13992, -35945, -24498, 2006, -2422, -44594, -58910, -53977, -164, -7022, -5923, -33743, -42288, -28635, -36351, -38253, -78755, -47092, -29891, -63007, -47686, -77077, -112222, -81159, -75715, -38520, 6705, 8616, -16434, -64486, -90357, -104014, -135201, -93545, -44874, 6871, 29164, 24695, 26624, 42253, 16435, -31110, -27396, -106909, -91301, -38153, -58864, -89244, -54317, 1668, -20729, -29485, 13858, 7394, -11177, -52933, -45389, 18615, 6420, -35133, -15075, 13318, -12700, -66684, -41156, -39199, -12317, 4884, 20586, 39793, 8836, 23418, 30456, 5245, 23065, 44488, 103288, 75824, 5040, 60748, 65092, 32791]
20287C2791n954k6423K124K8021j6739l3114l2853j8513k9207K3656P3570k755
20275e396m1529m8486J4845Q5778K2097k2753k9246m5735j0954M4413n171l0765
20263g2902J270m8737J6222Q7976K4091M2709N3911n2251n0082m1534m4759L0403
20251e3683P955j7781L1906J7316l0814K518L7131J0924M939K2689j2151j5046
20239E903n0486j0892k2529J8350L0901M540p896j2886K6060j0760j7244R761
20227c7178j5633J7831K79N385N676n540K9335j3537K8761K9461k7020L820M3514
20214F5154m4876q95L9097l3990l2276k41L1156M0405j8563n43R579l6420m5103
20201b7516m6976l727k0196k0607L8984O8307L2831j673J4439L131m5483m943
$$ y = [32791, 26837, 414, 2538, 30559, 13820, -19294, -52147, -70660, -99867, -76211, -2641, -5396, -46925, -95411, -80566, 5212, 27309, 4556, -24690, -70425, -81379, -36966, -42137, -72902, -71632, -120369, -104147, -16171, 7920, 50629, 104540, 52289, 2207, -39327, -84086, -53683, -45728, -63509, -31603, -14287, -45101, -42583, -5452, 5472, 10411, 33100, 20949, 5903, -44583, -55475, -78004, -59654, -28753, -24213, -32109, -44995, -18935, -29695, -46939, -37178, -52811, -34980, -34701, -29316, -23640, -29180, 155, -13382, 15379, 44840, 17820, 21640, 65154, 20278, 19383, 58480, 24490, -7786, -8027, 23129, 63534, 44971, 44428, 54007, 17587, -27516, -74492, -78219, -98415, -119022, -80038, -11731, 21100, 19427, 33866, 36997, -8486, -13429]
20189a3429j0573n9550j2096K2936l022O607N0389j4999R324N3426m745L153k730
20176B4691n0811m0761J0358j0440q13K7392n708J482K3574K1594l3622J0807
20164b2257K301Q719n1480K0446k8228j2144o056q240P820P1752l1274j8746J5686
20151e1701M4678m801o755j8613m3482J2495L703O790m8192j9765Q77M3113L0885
20138e0768M335N1246n865m0566P883K0813j0236L0831J7223N936k3442k9788
20126b2398l27J6626j8831k538m838P3450j0682j9576J988k6709n6423L287M113
20113f2858j3751L1260O3686j55R34R992m5176o9506j3750M7457L0900l6490l438
20100f0895J0274l7700k0407N4376J0223M1432K0514l2034k1925J9469n96j8784
$$ y = [-13429, -24002, -83552, -95648, -72712, -75734, -69127, -18738, -33737, -24413, 29013, 24268, 27421, 24691, -26120, -66881, -56523, -66963, -67776, -40384, -46092, -44610, -21036, 558, -33064, -22257, -19956, -11237, -62717, -42271, -70499, -82643, -88699, -96939, -89119, -17367, -48641, -67387, -51701, -7023, -11824, -18579, -37192, -80674, -68179, -64476, -57686, -105878, -125643, -124766, -81653, -50768, -46433, 4813, -1052, -41618, -33735, -12922, -23158, 7673, 24896, 30832, 7390, -22398, -22725, -6099, -24930, -27468, -32306, 41144, 30462, 10886, 12874, -13835, -70258, -66971, -62858, -76609, -45349, 18337, 18182, 19116, 29108, -16068, -85574, -99324, -51867, -20967, -57457, -60895, -50621, -88321, -108728, -54352, -44129, -2697, 17817, -14217, -36142, -16673, -17269, -36053]
20088c6053r293L4602J9256o354J8318l2988Q254m698k009K2384m1167l46J9668
20075a0426O5791Q641q3276n2407M5818O0835j5158n9879K0782Q0985K7502q2615
20063F593m0594n310k7303Q285L2343K5885K2247j503J6554J8766m0124l7296
20051b1457K4411l4809m0484L4142j7892k9166Q218M2870M239J2842J4520M7698
20039D5132k0838j08999r0436M9100M8357l431M1389K4869K5923L2851k3891k8051
20027h025M4962m0303m3392K5149N2796j8535K0027O547l8007L883Q689k1310
20015g519k8893l0414k753J8363N6275K9538n0027M584M470K0620Q805K1752M1160
20002H5961J5941K2718R100J3551n142k5656j3391l6072j7076J7709n6799m6293
$$ y = [-36053, -45346, -10744, 8512, 2158, 20476, -12512, -4258, -8956, -10965, 11419, -29748, -30094, -10426, 55365, 64006, -19270, -71677, -25859, 34976, 19818, -40061, -19279, 61706, 89208, 6593, -34001, -39311, -66614, -58329, -25986, -101, 22146, 20643, 37197, 55963, 15839, -21457, 2954, -31855, -72339, -38197, -56089, -85255, -77037, -34167, -29928, -17086, -2566, 45132, 24294, -84705, -175141, -126041, -77684, -81115, -39726, -14857, 11066, 43917, 20026, -8025, 36937, -3366, -46758, -21609, 31187, 12652, 32679, 39226, 1219, 5102, 13791, -7519, -36412, -66826, -69579, -51216, 5059, 34597, -15430, -10846, -6376, 14244, 23049, 44801, 85961, 101902, 124620, 133720, 147271, 142129, 116473, 103082, 67010, 49934, 67643, 10844, -35449]
19990c5449l7222k388N7094J1486l5753K1009K3092P0144L8694k9542m769l1005
19978D5391l6071r839j4495Q30j3807l417N1410K3073k1040J6921L2746j7435
19966E4267o9956l2273J8893J4289q696j9939m166L5008Q1296M3856K3936K8239
19954A64754l5009J5035j8682q449l8941n300p053l0167l246N5916J6579L7474
19942A42911l4440O957l5003k2350J9675q277l2621j0567q919j6314j0437K5984
19930A6599P552M3948M0844l0553j4182r51Q087J8912R524o6254n8589j2990L3930
19917d123J8693N3461L1690k7516L5779K7047j0113k3348n903J2652l0983p1715
19905E621j0155N056J335k0021o7644M74L960L7109M9496j1439J9505M6311j1836
$$ y = [-35449, -72671, -75059, -17965, -6479, -42232, -21223, 1869, 72013, 110707, 81165, 76396, 45391, 9320, -519, -15014, -14184, -27991, -31408, 20002, 43075, 22035, 38956, 71702, 54267, -15689, -47962, -29069, -14780, -23476, -43415, -47581, -12573, 68723, 112579, 136515, 164754, 129745, 144780, 126098, 117649, 78708, 73408, 66355, 36188, 32942, 88858, 105437, 142911, 108471, 115428, 80425, 58075, 77750, 69473, 36852, 26285, 17366, 1052, -9385, 16599, 24151, 68099, 108943, 78390, 64208, 63257, 71344, 90256, 99780, 33526, -25063, -38053, -4123, 14570, 68031, 99721, 72205, 107984, 135031, 124918, 101570, 95667, 108319, 77336, 5621, -4534, 522, 1857, -18164, -85808, -85334, -81374, -44265, 5231, -6208, 13297, 59608, 47772]
19892D7772L5081J3285n0978l7184n4444J6803N7339j1019J8009l2074k893Q923
19880H620K6592o746n9391N1751N6162k5307j6229K3220K4400M1297m1903n2632
19868B9834r095j2940q2833o339P4135N9896L5714P46R335p8698o8361p68k5944
19855g5318j2004j1839M0387R574K7076J304l6327J3842j6431J9527J8755K3522
19843B068l552l5960j2985J2616N3459M6307k5178k2338J911J8566r970Q258k3359
19830I843m1730p034q967N8189J7203J7207j9963q392j8404J3669k34m0233L5645
19817F799L3708M4161m1943o076k3157K8569L5201J0084N169k2496n4391j3533
19805B095J1529j2068l2137K7323L4159m081P257k4766m5796q098K6624L1015
$$ y = [47772, 82853, 96138, 45160, 7976, -46468, -29665, 27674, 16655, 34664, 2590, -303, 8620, 35212, 28466, -30925, 20826, 76988, 51681, 35452, 58672, 83072, 124369, 82466, 29834, 20739, 7799, -75034, -81373, -7238, 52658, 88372, 89118, 98453, 19755, -48606, -49374, -75318, -87322, -99161, -58774, -49200, -22124, -20820, -57147, -43305, -59736, -40209, -21454, 2068, -1484, -37444, -50429, -37813, 15646, 61953, 36775, 14437, 16348, 34914, 24944, 33202, 9843, -31887, -38921, -47888, 10301, 27504, 44711, 24748, 16356, -2048, 11621, 11387, -28846, 6799, 40507, 84668, 42725, 36649, 13492, 42061, 77262, 87346, 92515, 70019, 15628, 2095, 13624, 1556, -30581, -3258, 30901, 26820, 34077, 9311, -36485, -44583, -17959, 13056]
19793A3056J9014K9287l9899m7144q385j5609j1622m7362J2616K0917J2963K5839
19781c6329J4694k3103O150P54j9560n133n183K3632j5330o402N7120L7592k4445
19768D457p538l5576q26L5378j3463k0983K9975L2735K1709K5655p362m2266n5217
19755c3322k9384K2302O7553K5790R160p2449j0321j0199J1203J9689O517l683
19743B856m3199n4641p783m377K6342J2308L0321n28m4743j4083K7664L72K3363
19730d6128j7852J2617K8606l214J6859L1520k7079m2601O2408L9304n7771J4156
19718A0825N5609l997L4431K1975m3262l2408L6803r131j7997k5450o705j0455
19706A0238j976m651l0787N052P255l3208J1022K6632j4202k2673o409J7974J2022
$$ y = [13056, 32070, 61357, 21458, -25686, -34071, -49680, -61302, -108664, -96048, -75131, -62168, -36329, -21635, -44738, -38588, -37834, -57394, -62527, -67710, -44078, -59408, -65810, -8690, 28902, 4457, -3081, -38657, -39483, -4105, -17568, -38551, -8576, 24159, 45868, 71523, 64161, 21895, -33322, -62706, -40404, 27149, 52939, 62099, -10350, -20671, -30870, -19667, 22, 6539, 2856, -40343, -94984, -102767, -107144, -80802, -68494, -38173, -38701, -83444, -97527, -69863, -69491, -46128, -63980, -51363, -22757, -25971, -9112, 22408, -4671, -47272, 15136, 54440, -3331, 10825, 66434, 62437, 96868, 118843, 75581, 43173, 79976, 70845, 52848, 27398, 20693, 10238, 8262, 3611, -27176, -22124, -14869, -48077, -37055, -10423, -24625, -47298, -53707, -35733, -23711]
19693b3711J6643r678R768k1253P119J6578r84j4257M834O0485K2412L7507k6703
19680G8760n4256k7226J6276M4239J3334j9771J2698j505J9309m5149M156m3980
19668c115m2605n181J4161L3115l456L818O506K2416P758m0412o4622k1439J2913
19655h0143O8303K8788J2176J6787L296k3148l0825R920j0152n6200p53K8661
19643c3290l84K2930P684m2891n2380j5739L3733J3276j1294K906M5147K6853
19631c449m1264k966j3323J5121K3989J2049k8219k776p106N2490K3053K199k9373
19618D25m130m1312j463L1684J8736j5708j0530J0969J9593L0026p568k3848k4418
19605a7544k8948N2050j9838l4289l3058K542K6239J6818o262P5142O7108j0358
$$ y = [-23711, -7068, -16746, -6978, -28231, -21112, -4534, -5518, -19775, -14941, 45544, 67956, 105463, 78760, 24504, -2722, 13554, 57793, 71127, 51356, 64054, 62549, 81858, 36709, 40865, -3115, -45720, -50901, -36740, -3625, -7081, -3263, 3243, 25659, 33417, -6995, -71617, -93056, -80143, -11840, 16948, 29124, 45911, 49207, 26059, -4766, 5154, -4998, -61198, -61951, -33290, -33674, -10744, -3060, -45951, -98331, -114070, -80337, -67061, -78355, -75449, -30302, -3449, -44713, -47679, -61002, -45881, -21892, -9843, -38062, -40838, -47944, 4546, 27599, 29798, 425, -3705, -45017, -46480, -14796, 3940, -11768, -22298, -11329, 8264, 38290, 30722, 6874, -17544, -46492, 5558, -14280, -48569, -81627, -79085, -52846, -36028, -42290, 32852, 99960, 89602]
19593H9602n7154m4391r438r029M2194L2225n7386q594J9560m311Q165L153K3260
19580B7856n7457n1432K3603M7393M3155R719m0324j4358k2749k6934J7340L9730
19568d458L411O056k1408P559R325K9626L6150L3391l7594n8794l6151r988n718
19555d8593k3149J3515M069j3869P477j4604m2819N1413j837k5625p3454K9400
19543a38076N6534L1421M8113p757l1525K4455L0201J5906L468j9690L5684l4805
19531A3929l3602j5526k1428L3526N5889L3648j0237N069k4103l7145l7322K2044
19519a5258O4761J8032m3814m9095O3765l266K8760O94k5594m7692k6910P8614
19507D2997K0733n4859k2979j2616j4250k6779p340K2985j6799l3312L2066O3798
$$ y = [89602, 32448, -11943, -21381, -30410, 11784, 44009, -13377, -21971, -2411, -6722, 1443, 4596, 27856, -29601, -81033, -57430, -10037, 33118, 42837, 2513, -11845, -34594, -61528, -44188, -4458, -1047, 5009, -16399, -8840, 485, 30111, 66261, 99652, 62058, 3264, -32887, -42875, -48593, -71742, -58227, -54158, -68027, -60550, -75154, -117973, -66560, -68397, -94022, -167476, -138076, -81542, -50121, -2008, -9765, -41290, -16835, 13366, 29272, 32740, 13050, 48734, 13929, -19673, -35199, -56627, -23101, 32788, 66436, 56199, 61268, 37165, 20, -37302, -15258, 49503, 67535, 23721, -25374, 38391, 35125, 63885, 64579, 38985, -8707, -35617, 42997, 63730, 8871, -14108, -26724, -40974, -67753, -75093, -52108, -68907, -102219, -70153, -6355]
19495f355L2133M018k4441l8108m5906m6149J4044N9400O1628J2983n049M466
19483B2664K4943m4728l4617J0378J565Q242K9996K7430K4918q4293p2045J252
19471h4295j2468M9957L0086l6212j0922K0816l117N130k8857M829M2903K8379
19459F229J2119J1841j2160J5829r758m0383o148L5884J1973n6484k1471R2747
19447D0218O3303K141n1811p9132k8370K2845o178j5139k0757n1756K5573L7261
19435f1802J9288M863k2674K4275K0798M5780M2504n6918l897j3915m4649n7674
19423a04021K6535M1665L9304m5962m0140N731K1625K0852M2952l385N11j2805
19411g138Q430Q756k5243n611P3321j835l5028K9076J6128j4812o2440p0108M9206
$$ y = [-6355, 25778, 29796, 5355, -32753, -78659, -124808, -110764, -51364, 10264, 23247, 18198, 22664, 47607, 2879, -31738, -21360, -19795, -11553, 18443, 45873, 70791, -13502, -85547, -84295, -96763, -46806, -16720, -52932, -63854, -43038, -46155, -41025, -69882, -65053, -22150, 6229, 18348, 30189, 18029, 33858, 24100, -16283, -22431, 13453, 25426, -31058, -52529, 40218, 103521, 105662, 53851, -25281, -53651, -30806, -36984, -52123, -72880, -124636, -99063, -61802, -42514, -37651, -60325, -36050, -15252, 30528, 73032, 16114, 12217, -1698, -46347, -104021, -77486, -35821, 3483, -42479, -82619, -76888, -55263, -34411, 8541, 5156, 5667, -7138, 1292, 10048, -15195, -20806, 52515, 50680, 15652, 44728, 60856, 46044, -16396, -86504, -37298]
19398c7298M98n731k8532n0075M4591K7981O476j80L2463P9625l1558n7429J7663
19385a506K3385j2024q7798o464P5087M5772m0645l7525o221M7079L0721L797
19373C3658N507O137k9975j7727K3017o87j3351m116n744n077J0261k5253R050
19360a4300q458m4745j5665J1666L7654J5284R207l4659j5015K726m02K6740j970
19347c1937p1805k7976R285P8107K0917L7889R499j899M742M1945n27p3518k9058
19334c4336k7676O407K320P7459l3049l472l8904K6682j7241k4015K7648L7218
19322i59O594r898Q957O6433j206m5420r804j8764m4894M8710M5012o5559N94
19309b0204k883M0092j1124J3401j9575j1757k4322r340n466j7972J539K4727
$$ y = [-37298, -36800, -42531, -71063, -121138, -76547, -48566, -42090, -42270, -9807, 69818, 38260, -19169, -1506, 21879, 9855, -77943, -84407, -9320, 36452, -4193, -41718, -47939, -860, 29861, 33658, 39165, 45302, 15327, -2400, 20617, 19930, 6579, 2463, -3281, -8358, 1903, -23350, -14300, -22758, -67503, -83168, -71502, -33848, -18564, -9357, -44016, -59031, -56305, -56707, -29967, -31937, -103742, -131718, -122433, -44326, -23409, 14480, 23979, 22080, 26822, 68767, 68240, -5278, -34336, -62012, -55605, -53285, 24174, -8875, -12347, -51251, -24569, -41810, -65825, -38177, -959, 5635, -4263, 4694, 71127, 69921, 24501, 14697, -4067, -48961, -251, 44761, -20798, -20204, -23087, 17005, 5881, 19282, -293, -12050, -36372, -45712, -51178, -69150, -67611, -42884]
19297d2884j0722p297r397j1549O6520L202J6066k0131K3728q342l5808j1229
19285d7843J2959N7903J5290o9530k7362k5912K04L8679M3433j6156R001k8020
19273c7354l0753K5754M078J996j934K4884M009q446k8733k0894k2002l0002K4233
19260i5164O3729J8628k1995q430O6496M3160m9939l2526M6747l7199k6485l7001
19248f9979j8584m603P5121N4595l4461p1317k0133J6267l0627j5595k825O0569
19236f1572R3862N1919l3341j6120K4458k1713l3750J2020n114n3928M115N2749
19224A3585J9267p43n5496K8192j816J4389K2616J2611k6497m8900l2743J816
19212e3719n2798l3124M5069k3747L3675J6298k6006L5646J6207l2621n992Q870
$$ y = [-42884, -53606, -60903, -70300, -81849, -15329, -12127, 3939, -16192, 7536, -806, -36614, -47843, -34884, 23019, 38309, -31221, -58583, -84495, -84291, -45612, -2179, -18335, -9334, -37354, -68107, -42353, -38275, -36279, -38213, -13329, -9320, -17766, -46499, -67393, -89395, -119397, -95164, -31435, -12807, -34802, -43232, 23264, 66424, 16485, -16041, 30706, -6493, -32978, -69979, -88563, -93166, -18045, 36550, 2089, -69228, -89361, -73094, -103721, -119316, -122141, -61572, 32290, 84209, 50868, 34748, 59206, 37493, 3743, 15763, 10649, -43279, -39164, 13585, 32852, 32109, -23387, 4805, 2989, 17378, 39994, 52605, 26108, -22792, -55535, -53719, -106517, -139641, -94572, -118319, -84644, -68346, -94352, -58706, -42499, -75120, -81112, -72242]
19200g2242J1453j5730J9452N1794J0153j4384l0936k7959K2782J8050K1972M1249
19188C5654j1484o5521L0998K9512m5729j5741L3365M4180l2249k9719N19K8223
19176B008q143k7342J0629O6824k447p3055o4183l604N6521O1149j9199n4260
19164e5102l2477M912M0538Q762K3607N6444N048n9425l4487K7364L6656k2198
19152c58n1340p4298K545R3379K4828j9543J8219r756m0830K1245L0102L449J9137
19139A6779n7035J1072j1104J6154M7412M3300k1106l3783k3072k9064n6836M5969
19127e1314J62k8611m0016L1770M1168M9497M5379N982o761o3449n8818k2825
19115i7836K6540J1486K5457K5700q253L152L3365L0086J8756k5644p817n7578
$$ y = [-72242, -60789, -76519, -57067, -5273, 4880, -9504, -40440, -68399, -45617, -27567, -5595, 35654, 24170, -41351, -10353, 19159, -26570, -42311, -8946, 35234, 2985, -26734, -26215, 2008, -6135, -33477, -22848, 43976, 41529, -31526, -95709, -99313, -42792, 18357, -842, -55102, -87579, -82667, -42129, -33367, -9760, 46684, 51732, -7693, -42180, -14816, 21840, -358, -51698, -125996, -123451, -30072, -5244, -24787, -6568, -16324, -57154, -35909, -5807, -2358, 16779, -40256, -29184, -40288, -24134, 23278, 66578, 45472, 11689, -11383, -40447, -97283, -51314, -51152, -79763, -119779, -88009, -46841, 2656, 48035, 54017, 47256, -16193, -75011, -97836, -71296, -59810, -34353, -8653, -16906, -13754, 19611, 49697, 68453, 42809, 34992, -22586]
19103b2586j5289L0522K0648l5684q558l7505J8229M3084l8315q7744L5530L7513
19091f0155L278J5684M3584R663j0770j3654q325k101Q694L9745q196J8709k0503
19078A5653P732m698M278m9484o5955l3514P3712O5374j8192L709j2040K5726
19066A2301j4421l2829R130J3697k6538M1776r581j4694m5583J7458K9476L2616
19054A2808K5637j706k7310J0085M7844K1017o2403j6981M166L0414O079K7369
19042G7019j9606n4154j2075k9390j724L7309L0035j3963j0471p799l6492j2355
19030e3666K5561M612j1998J4414J451M635K1097J1088J6399l9301q655K9819
19018A5456j1743m3022j729N5702n1262Q631O4394R206M507N436n5804l1819J511
$$ y = [-22586, -37875, -7353, 13295, -22389, -30947, -68452, -50223, -7139, -45454, -133198, -97668, -60155, -56877, -41193, 2391, 12054, 1284, -12370, -20695, -22796, -14102, 25643, 17447, 36156, 15653, 23385, 18687, 22965, -26519, -92474, -125988, -52276, 13098, -5094, -1385, -13425, 12301, -2120, -34949, -25819, -12122, -38660, 3116, -6465, -21159, -66742, -49284, -19808, 12808, 38445, 36739, 9429, 19514, 67358, 88375, 25972, 8991, 13157, 43571, 49650, 77019, 57413, 3259, -8816, -38206, -39930, -2621, 27414, 13451, 2980, -4819, -41311, -53666, -28105, -23493, -35491, -21077, -19626, -14991, 6106, 17194, 33593, -5708, -14363, 15456, 3713, -39309, -41038, 14664, -36598, -27967, 36427, 45633, 50140, 55576, -228, -32047, -30536]
19005c0536L4554L8298n58L3377Q429m4904l3405O11j4030j2213L6758j8004p556
18992i179J1481m0871J5249j2349J6941N1456m224l6749n2153l3667K2091O8105
18980c869J7840j4876k5356L2358L9257M36l170j0252j6836o53o36k1242l8944
18967d5943j3433K8734K6847P3667l561J4259k5321q4363M284N3167m562M509
18955B8284M6367J2679o5533n7808l2025M892j4999j7608q080M2957j5077o8742
18943a44693K8891M6880M5437k5763J5832L2534M5901k6207l788l7292J5667o348
18931a2949J2183J0307L1027l0j8637j9575N510j1207K9157N190k741R660J7239
18918E5134p773k9664j2217j5407L6089J7404M3392l6263k4982k2342J6015q023
$$ y = [-30536, 4018, 42316, 41758, 75135, 83564, 38660, 5255, 5866, -8164, -20377, 16381, -1623, -9179, 2302, -38569, -23320, -35669, -18728, 32728, 28504, -8245, -60398, -94065, -71974, -3869, 13971, -905, -26261, 6097, 45354, 45790, 42620, 32368, 15532, 14879, 14243, -6999, -45943, -59376, -30642, -3795, 69872, 66311, 80570, 55249, -29114, -24830, 28337, 23775, 28284, 74651, 87330, 21797, -36011, -68036, -63144, -78143, -95751, -103831, -60874, -75951, -144693, -115802, -68922, -23485, -49248, -33416, -882, 45019, 18812, 15024, -22268, -6601, -12949, -766, 9541, 40568, 40538, 21901, 2326, 7836, -3371, 25786, 30976, 28235, 37895, 55134, 47361, 17697, 5480, -9927, 26162, 43566, 86958, 50695, 25713, 3371, 19386, 11363]
18906A1363k6611J0599L8923M7410m1032p2805r72P8903M1328J8604N9853Q1736
18894B47299O8159M7925J23852L2311N8836k659m7340j0287l3665j45152j29700
18883B09579o4327k2144n7582K290k7059m8852q156J4869L4626K4733M146L0754
18871I2877O417J6411O874M746N3749P5913O2926K1435l275k0132r897k9844n5051
18858B23149o8750o6770J3488m721o4685m6115L8277J5017j5172J7504K6633l5205
18846C2650n4249L3915o136K1334J0605L9391n472l4719K1381k8498n535J8837
18834D3504M6786K2948K3180K855k9078l0055k5231J424j981n841k7684j3230
18822G597j1655n5175m5404K9922O2223K0056m999K8502k1441L8191O9156p5418
$$ y = [11363, -15248, -4649, 34274, 81684, 40652, -32153, -33125, 45778, 87106, 105710, 165563, 247299, 315458, 363383, 487235, 519546, 578382, 575723, 528383, 518096, 484431, 339279, 209579, 145252, 123108, 65526, 67816, 40757, -8095, -16251, -1382, 33244, 57977, 62123, 92877, 99294, 115705, 122579, 127325, 181074, 256987, 319913, 341348, 338073, 317941, 308044, 278200, 223149, 154399, 87629, 101117, 96396, 31711, -14404, 23873, 38890, 23718, 41222, 67855, 32650, -21599, 12316, 6180, 27514, 38119, 77510, 72038, 37319, 58700, 30202, 24667, 43504, 90290, 113238, 136418, 139273, 110195, 80140, 54909, 56333, 54352, 48511, 20827, 7597, -4058, -59233, -104637, -74715, -12492, 7564, 2565, 31067, 9626, 47817, 116973, 41555]
18810D1555k9582L7315K2710j970J6652q810o608j2927j8480M0921J5711J210
18798I7697l6500K5151L4553O820k7877o1429M885P265L615N873m0598j5583J7190
18785B1062Q118P695K957l7973l4941J0196L0382L2381L860N5643N4210J04733
18773B58323j7611n8403n1546M4436P7114N0428J48425J57475K0820j01707k05408
18762C22346r1209l0309k6249l5529m4140l2608L3306M4742L3982L306M224L9287
18750B21149K0946k4461N7029P918L2180P7841Q9863J36595K08725K24123K44757
18739A296665J84338J88094J16265L6542o2149j33197k30828k47772k72921j51009
18729G24028j35757j45928j19212o9155o3465n6985N310o426K2512j9994j9204
$$ y = [41555, 11973, 49288, 71998, 70028, 86680, 77870, 71262, 58335, 39855, 80776, 96487, 97697, 61197, 86348, 120901, 127721, 99844, 38415, 43300, 50565, 54180, 60053, 19455, 3872, 21062, 29180, 36875, 39832, 1859, -33082, -22886, 7496, 39877, 43737, 99380, 153590, 258323, 240712, 182309, 130763, 175199, 252313, 302741, 451166, 608641, 629461, 527754, 322346, 231137, 200828, 174579, 139050, 94910, 62302, 95608, 140350, 174332, 177638, 181862, 221149, 242095, 217634, 274663, 282581, 314761, 392602, 482465, 619060, 827785, 1051908, 1296665, 1481003, 1669097, 1785362, 1821904, 1759755, 1626558, 1395730, 1147958, 875037, 724028, 588271, 442343, 323131, 253976, 190511, 133526, 138836, 132410, 154922, 134928, 115724]
18718A15724n897m112k4059l7394K639K4287m8092l8983K6178M3858N6457k4127
18706H6479l5248K6686n838m4125k7635K9283k700J3746q222j8329K2676K5367
18694F2140P743o960J5488J8179L025k6773k7017k919N0128o097n8497k1055J0583
18681A7968j1428R113M0978L7169J6660K561K4726N0159M6795J16061R6976P5610
18669E23348M3247l0912p1085l4469p621j7999o0192j14998q1030k8385J4819
18658A34723L3783m1597o1436J4316J0146k3914o732P520j4018j8706L5571j7478
18646E2178K1132m7298r065M1175K6910k2696k0192L46K2231N0213N7520M36j019
18633A71871l4721r2607m2432J0558J7690O5151M8765M7212O6759J50295J98873
$$ y = [115724, 109827, 105715, 81656, 44262, 46901, 71188, 23096, -15887, 10291, 54149, 110606, 86479, 51231, 77917, 72079, 27954, 319, 29602, 26902, 40648, 32426, 14097, 36773, 62140, 69883, 62923, 78411, 96590, 99615, 72842, 45825, 42906, 93034, 86937, 28440, 7385, 17968, 6540, 15653, 56631, 93800, 110460, 113021, 137747, 187906, 234701, 350762, 447738, 523348, 566595, 535683, 464598, 430129, 422508, 404509, 344317, 229319, 148289, 119904, 134723, 168506, 126909, 65473, 79789, 89935, 66021, 59289, 66809, 52791, 34085, 69656, 52178, 73310, 26012, 16947, 58122, 85032, 62336, 42144, 42490, 64721, 114934, 172454, 172890, 171871, 137150, 44543, 2111, 12669, 30359, 95510, 144275, 191487, 258246, 408541, 607414]
18622F07414J97819K79673K31693K21023J08225M9532r1166k26308k28195k04387
18612I45323j88760k22924j79438r6007r8241l9934n9458j3192j0844L2727L6370
18601A05622J6646N668R317k3424k3182n748l7696o0016J8044L9601J5563j5898
18589D4497k6957o297M4870L9570k4933p3653o133k019p743j1528K3686L9599
18577C2959K1677K9380K9008M295K7010k5552k6162n6841l5809L3226M1776K2284
18565I7251R0239j343o1150l4503j0805N452k2115r538L6992k1057k9830l3689
18553E904k8638k0079L1729l893l878k7022R316J0416K1904J4610L8948L071k165
18540E0223l2434J0639L5467Q050J747L4232p561m9409j7449m304j7316k9465
$$ y = [607414, 805233, 1084906, 1316599, 1537622, 1645847, 1695379, 1604213, 1377905, 1149710, 945323, 756563, 533639, 354201, 258194, 159953, 120019, 60561, 47369, 36525, 69252, 105622, 122268, 127936, 137253, 113829, 90647, 84899, 47203, -12813, 5231, 44832, 60395, 44497, 17540, 11243, 56113, 95683, 70750, -2903, -9036, -11055, -18798, -30326, -6640, 32959, 54636, 84016, 113024, 117319, 144329, 118777, 92615, 35774, -35, 33191, 74967, 97251, 187490, 186147, 124997, 90494, 79689, 85141, 63026, 53488, 90480, 69423, 39593, 5904, -22734, -42813, -11084, -14977, -18855, -45877, -36561, -26145, -4241, 10369, 49317, 52388, 50223, 17789, 28428, 63895, 71945, 73692, 107924, 100363, 50954, 33505, 29201, 11885, -17580]
18528a7580l6125j0654j0628K7967K1232L1957K7740N1524J8648J7261m62j4014
18516A06866j2663l6045J4935N1142K2918o1443m5451n8863m6725n822M3623M3511
18504A5983K8581j1908K4039J674K9213K7269o662R749J4651m1162l029L6828
18492A25226L4792l3502L209j3373k3978k9065M0760K2598o389j9433n4221J3302
18480E9926k6131m7289j7237l6304j0617N7423P4862K4669K3251n2558j1671M1690
18468H0014K1699M000m4499K5459R144P8118J0794l3177R311j4852p3261n4455
18456A8295j892k1889O840N404L4958O205J4704N9634Q0957O478M6143M1947r015
18443B88769o717K683J1039l3864m2961k1190j7328j8901m083q004l5051K1154
$$ y = [-17580, -53705, -64359, -74987, -47020, -25788, 6169, 33909, 85433, 104081, 121342, 120880, 106866, 94203, 58158, 73093, 124235, 147153, 85710, 40259, -18604, -65329, -71151, -27528, 15983, 44564, 32656, 56695, 58369, 87582, 114851, 108189, 117938, 132589, 91427, 88398, 125226, 160018, 126516, 129725, 116352, 92374, 63309, 104069, 126667, 120278, 100845, 46624, 59926, 33795, -13494, -30731, -67035, -77652, -20229, 54633, 79302, 102553, 49995, 38324, 80014, 101713, 105713, 61214, 86673, 95817, 173935, 184729, 151552, 160863, 146011, 72750, 18295, 16403, -5486, 1354, 6758, 41716, 47921, 62625, 122259, 203216, 209694, 255837, 297784, 288769, 282052, 284735, 295774, 261910, 218949, 197759, 180431, 161530, 157447, 149443, 114392, 135546]
18431A35546m2043q497J656m0350l2317K5566J8349n3385L102N1029K1069m0081
18419C9644k2976k406K6970l2846J541L8306J5663k3422q614N811N5134L9731
18407A32536r196O2091j5126n5536k245K9381L34m0461k5168M484n017k1055j7154
18394C7868J920L742k9445K618L6214j8288J944Q105M8854K9958L9428k6643n4617
18381H1658K0R091j9367o572k4720k8907k5545N863M2577K8863j9434o753K6246
18368F3020J9851l2389n8373O040R7813J4220l3570m56J9699p024p178J7093L6565
18355A35311K1765j5250n1871o2170J4591N2068K7634J7523j8701k227K119K0079
18343A40871n605j9077m9148k34O4941K6550k1060j4576m354M6692L0400r334
$$ y = [135546, 93503, 85006, 86662, 46312, 13995, 39561, 57910, 4525, 7627, 58656, 79725, 39644, 16668, 14262, 41232, 8386, 9927, 48233, 63896, 40474, 31860, 37671, 92805, 132536, 123340, 185431, 170305, 114769, 112524, 141905, 142239, 101778, 76610, 81094, 76077, 55022, 37868, 39788, 43530, 14085, 16703, 52917, 34629, 36573, 44678, 93532, 123490, 162918, 136275, 81658, 81678, 90769, 71402, 64830, 40110, 11203, -14342, -8479, 34098, 62961, 43527, 36774, 63020, 82871, 50482, -7891, -1851, 95962, 110182, 76612, 76156, 95855, 88831, 81653, 98746, 135311, 157076, 141826, 89955, 27785, 42376, 94444, 122078, 139601, 120900, 118673, 120792, 140871, 135266, 116189, 67041, 66807, 131748, 158298, 137238, 122662, 118308, 165000, 195400, 186066]
18331A86066m6589L399N8477l8402j9014J6477k8273J253k5984l2702J9232K5192
18319A19132j9859J0806K3797K0564M9271N2199k0462k9713Q761R601L0274P3081
18307C27452J5958n089j8078o3171o6765j0163N36Q088K6314r922L3231L2597
18295B70988N6990l007l8442K0050J5474J5052J0857l4058j6257k707j8368k0147
18283B56425J5431P3366Q470m3371j1654j0631N064N4628L3968k394m41L78O0787
18270D40026j9738p7695M5144L7023p027p534k0825j3975P844J04236O6864L418
18258E57761m3203P880J6610K3086m6479J0832M634K5672M0102j4556k6273O5313
18246F21379P5461M8821L4051M4198L3941L71J9374Q6581Q5036L6434O8608J2559
$$ y = [186066, 139477, 142876, 201353, 162951, 143937, 160414, 132141, 133394, 107410, 74708, 93940, 119132, 99273, 110079, 133876, 154440, 203711, 255910, 235448, 205735, 214496, 224097, 254371, 327452, 343410, 338321, 320243, 257072, 190307, 180144, 180680, 188768, 215082, 205160, 238391, 270988, 327978, 324971, 286529, 306579, 322053, 337105, 347962, 313904, 297647, 294940, 276572, 256425, 271856, 345222, 353692, 310321, 298667, 288036, 293100, 347728, 381696, 379302, 378861, 379239, 440026, 420288, 342593, 387737, 424760, 417733, 410199, 389374, 375399, 383243, 487479, 554343, 557761, 514558, 522438, 539048, 562134, 515655, 526487, 531121, 556793, 596895, 582339, 556066, 621379, 696840, 745661, 779712, 823910, 857851, 858222, 877596, 964177, 1049213, 1085647, 1154255, 1166814]
18234A166814R700K5065O6450J08875R8339L3381L6037J19749J21649J21526J50980
18223B058565J66576J82212K46661L19116L14252M48449N48932O19218P52474
18214E656455P79050P81055Q68563R13763R72085J099102J253219J614128K160186
18205A6097606K948039M344896O527062J0062530J5031280K1033126K8236601
18198A04281140L6375471M1412129M2748838M2802994L4675676J9503286O218173
18191C28017707r840847k7145070l6958845m1886847m3273328l9517954l2952607
18184I6442209k5730174j8907434j3249618r029106o156338m215529k942611k147222
18176A4064177j659814j316423j142719r60404p88273q02960p86465o90457o66888
$$ y = [1166814, 1176514, 1201579, 1268029, 1376904, 1475243, 1508624, 1544661, 1664410, 1786059, 1907585, 2058565, 2225141, 2407353, 2654014, 2973130, 3287382, 3735831, 4284763, 4903981, 5656455, 6435505, 7216560, 8085123, 8998886, 9970971, 11070073, 12323292, 13937420, 16097606, 19045645, 23390541, 29917603, 39980133, 55011413, 76044539, 104281140, 140656611, 182068740, 224817578, 267620572, 302296248, 321799534, 328017707, 318176860, 291031790, 254072945, 212186098, 168912770, 129394816, 96442209, 70712035, 51804601, 38554983, 29525877, 23369539, 19154010, 16211399, 14064177, 12404363, 11087940, 9945221, 8984817, 8196544, 7393584, 6607119, 5916662, 5249774]
18167E249774n43536n36348m83699l75188l38138l51500k16988j56479j69903
18158B077995n1878o9561o6969j39169j02194j15016n8428m6846p4968n2428j07907
18147A192631m2224l3517l3728k5052K952L78j69j7863k4719r983K5104J1843
18135A045653N382J3392n762K0738J1227N898Q5270R8107M0979Q9532P3890J77457
18123A661763J45051R5520K07358K98596L88140N25242P04064J001953J435501
18114F463188K121553L256979N475331R725393J7132613K8270951L1256076P695483
18106A11397567j8935022k6702461k2740267j5255358r525003n809109l631224
18099H799123k263281j484225j051521o94349n91621m78928l53052l08996k02825
$$ y = [5249774, 4706238, 4169890, 3686191, 3311003, 2972865, 2621365, 2404377, 2247898, 2077995, 2026117, 1956556, 1889587, 1750418, 1648224, 1533208, 1474780, 1427934, 1352966, 1300538, 1192631, 1150407, 1116890, 1083162, 1058110, 1061062, 1061440, 1061271, 1043408, 1018689, 1008706, 1033810, 1045653, 1051035, 1064427, 1058665, 1079403, 1090630, 1096528, 1181798, 1279905, 1320884, 1410416, 1484306, 1661763, 1806814, 1902334, 2109692, 2408288, 2796428, 3321670, 4025734, 5027687, 6463188, 8584741, 11841720, 17317051, 27042444, 44175057, 72446008, 103702084, 111397567, 92462545, 65760084, 43019817, 27764459, 18239456, 12430347, 8799123, 6535842, 5051617, 4000096, 3305747, 2714126, 2235198, 1882146, 1573150, 1370325]
18090A370325j44413q2423j33264j42708o4752j5128k1485p634k0058k7792p5593
18079F35075o7711j2553o4130j7890k2821n2830l2621k4006n4693N3617Q5331
18068D24768M1097J9167j6990q067n7164k2629L925k2335l3058O5j2246p3771
18056B42762p2091Q635r929K9192J1853L603l9637l2059k0613L2251Q0890J3454
18044B48311k6576l6918j2437k0013l0362j7686M5732O4651J4275j7065q6114
18033A25798l4828l0920l8227o102k0042J0174l618M1889N1534K8648j7984k5442
18021H0880K945J3140K5585j5221n6784J8784p330j8665K282J1940P050l0387
18009C4219n3752L2890m376k2912k4401N6385J3022n9335k8280N5718M5567M2304
$$ y = [1370325, 1225912, 1143489, 1010225, 867517, 802765, 787637, 766152, 758518, 738460, 710668, 635075, 567364, 554811, 490681, 472791, 449970, 397140, 364519, 340513, 285820, 339437, 424768, 465865, 485032, 468042, 459975, 402811, 380182, 384107, 361772, 328714, 328779, 316533, 242762, 170671, 179306, 169377, 198569, 210422, 214025, 174388, 142329, 121716, 153967, 234857, 248311, 221735, 184817, 172380, 152367, 122005, 104319, 150051, 214702, 228977, 211912, 125798, 90970, 60050, 21823, 15721, -4321, 5853, 2235, 44124, 95658, 124306, 106322, 80880, 83825, 96965, 122550, 107329, 50545, 69329, 61999, 43334, 45616, 57556, 64606, 34219, -19533, 13357, 8981, -13931, -38332, 18053, 31075, -28260, -56540, -822, 44745, 87049]
17997H7049K2666N7656L1533j721l3894P423m3051n5209m8103j7949k1966J526
17985a4040K6754L4173P039K7001l904j9605m1719n4933l2559j492J8992N4693
17973D00J6862K6083J7769j2991j8299k774l5742j4349K8653O7655O1019l4609
17961I9677m7717k9825m1510K0182L5581K0065r972j0763l5884K0044L3032j1853
17949D1057m907m382O923m8734j9385M7434M3665J5735l4095j5778l8700k0270
17937c1437p737j7540K8168K2989K1362m026p716R747J8021k1754l9499k9700
17925e9122J5687j304J3761k4402k9550L8789J5092m790M671K1308J8301J2988
17913B1429J9778q042k4669l1351j5203l7854M3284P6380J8289m6067j5071O11
$$ y = [87049, 109715, 167371, 198904, 197183, 163289, 170712, 127661, 72452, 24349, 6400, -15566, -14040, 12714, 46887, 53926, 80927, 77023, 57418, 15699, -39234, -71793, -73285, -54293, 400, 17262, 43345, 61114, 48123, 29824, 27050, -8692, -23041, 5612, 73267, 134286, 99677, 51960, 22135, -19375, 807, 36388, 56453, 46481, 35718, -166, 19878, 52910, 41057, 36150, 31768, 38691, -10043, -29428, 18006, 61671, 77406, 43311, 27533, -11167, -31437, -39174, -56714, -28546, -5557, 15805, 11779, 4063, 13810, 31831, 10077, -29422, -59122, -43435, -44739, -30978, -55380, -84930, -46141, -31049, -35839, -31168, -9860, 8441, 21429, 41207, 33165, 8496, -22855, -38058, -75912, -32628, 43752, 62041, 15974, 903, 1514]
17901A514O3324J3942l4509p137n0841k6065J071K4548q716J1382M729l2815K9649
17888i924J26776L1546o2039l2222j8518r176L7941J2126J6028L2530k5995j6139
17876H2934n01k5077n78k3364n2277R949L2024K1575n326K5666l1776p9525o5492
17863a11768J8004j6659M5827P6424K9971L463n3203K5754J9037R605Q5762J9175
17851A51392l5462p816j9281k0857k3742k2332P75M3629K1570k8472l5328p0287
17839d6211L6768M0608L3252j0051k9278j9512O948l3430m1998K0104L9563L920
17827F83R423K1565k49P173j171K2973K7310k1394n4106k7747k9129K017J3005
17814b9647K265q266n558L2494k9732k841N2829K0540k8805m3406k6937J6522
$$ y = [1514, 64838, 78780, 44271, 37134, -13707, -39772, -38701, -14153, -22869, -11487, -6758, -39573, -9924, 116852, 148398, 86359, 54137, 35619, 26443, 64384, 76510, 92538, 125068, 99073, 82934, 82433, 57356, 56778, 33414, -18863, -8914, 23110, 44685, 39359, 65025, 33249, -46276, -111768, -93764, -110423, -64596, 11828, 41799, 45262, -7941, 17813, 36850, 46455, 132217, 151392, 115930, 108114, 88833, 67976, 44234, 21902, 22677, 66306, 87876, 59404, 24076, -46211, -9443, 31165, 64417, 54366, 25088, 5576, 12524, -20906, -62904, -42800, -3237, 683, 10106, 31671, 31422, 38595, 37424, 60397, 87707, 66313, 12207, -15540, -44669, -42652, -29647, -27382, -35648, -41206, -8712, -38444, -41285, 11544, 32084, 3279, -40127, -67064, -50542]
17802e0542Q4510K4019n039L836O1937j408l1582j0336m3858k84K137L7601j3547
17789E7444m3877j4607K2430K7835J4227m430k6060j3669J3760L217p1041j6073
17777e0844O1135K1377k3339m7679k127L5696P2236o3717l7464j2755r115L4883
17765b1713Q84l2116M942N546J0965K4162L7028O318J4651j1893m6423m2995L2269
17752a8375L6949J0502l6485l9960l4667j5243L2991L5014j065J1459L8873r68
17740A9025n534N8874L337n4265k2210r1846j6055K6454N5064l1112k8037J9497
17728f6808l4725j4698N5540M5327r543m5330l3050j632r793K9974N8276j9091
17716d5553n2089L4889j6850K7436K2855m4197m8968n202L1006L0236N8835K7262
$$ y = [-50542, 33968, 57987, 52948, 56784, 118721, 117313, 85731, 75395, 31537, 31253, 33390, 70991, 57444, 13567, -1040, 21390, 49225, 63452, 59022, 32962, 19293, 33053, 36270, -34771, -50844, 10291, 31668, 8329, -39350, -41477, -5781, 66455, 2738, -34726, -47481, -56596, -21713, -20829, -52945, -48003, -42457, -31492, -7330, 29698, 36016, 50667, 38774, -7649, -50644, -18375, 18574, 29076, -7409, -47369, -82036, -97279, -64288, -29274, -30339, -18880, 19993, 19025, 13491, 72365, 75702, 21437, -773, -92619, -108674, -82220, -27156, -58268, -86305, -66808, -101533, -116231, -60691, -15364, -24907, -70237, -103287, -104919, -114712, -84738, -26462, -45553, -97642, -62753, -79603, -52167, -29312, -73509, -122477, -127679, -96673, -66437, -7602, 19660]
17704A9660N72k4582j7671L0124K3985k6638j9295J394j8790M206L0004k564l554
17691c149M2739j929J8192m1994p4773n922L957l836M8634L2548j0558j8053n7540
17678g1684j4892J1229J1199J9015O899L2540N888L1478o037j1338k6213K8495
17666A6579n0412j5243k1654J7784K5673M8298M1339K4715N093J009k8838J3025
17654G7368P3760N5401K9031O0165J08570J40774J83599K19906K11339K57099
17644A417012J82471J19227M0695q0061j45233j87383j71089k24656k11241j65191
17634E74551j76130j42411q7881n9453m3791j6706Q983q811j394m1089k0328J6012
17622A552k2384m7858K4597j3831l9131k7064L3351N0659J508R207L3170j8035
$$ y = [19660, 20232, -4350, -22021, 8103, 32088, 5450, -13845, -12451, -31241, -27035, 2969, 405, -3149, 39590, 37661, 55853, 13859, -60914, -66836, -62879, -66715, -18081, 14467, 3909, -14144, -71684, -86576, -75347, -64148, -45133, -38234, -5694, 194, 31672, 25635, 14297, -11916, 16579, -33833, -49076, -70730, -52946, -27273, 21025, 62364, 87079, 92172, 93181, 64343, 77368, 151128, 206529, 235560, 295725, 404295, 545069, 728668, 948574, 1159913, 1417012, 1599483, 1718710, 1759405, 1679344, 1534111, 1346728, 1175639, 950983, 739742, 574551, 398421, 256010, 168129, 108676, 64885, 48179, 57162, 48351, 46957, 5868, -14460, 1552, -20832, -68690, -44093, -57924, -97055, -124119, -90768, -40109, -38601, -29394, 3776, -14259]
17610a4259p1977m2076J4658P9616K0311k8200Q556M2469N2586j7827k1841r223
17598A2793l8641r572K6841l408M6261k5050n2625Q314K9351M079k6837J4967
17586a3527o024M9036r419k3958m1121p829J0286j7255k069L924n164N924R230
17573d7966J6908J0703O003J3024j4590J3613L36k9355J499j3383L2976L2077
17561B1845q541l0828k8055j9061j6874J885L2665M0263L2418J954k9148k7414
17549b8891m6567J5336j0041M15L2706L4768k5520J2194P313J7035m664k4681
17537b0597Q228j4062o933M6590R26n2930J5771l580m858L262K5728L4013J3559
17524D5117j0214J567k580l622L1928k0762k1319n7823j2365N845K4178R308k2525
$$ y = [-14259, -86236, -128312, -113654, -34038, -13727, -41927, -33371, 9098, 61684, 43857, 22016, 12793, -25848, -35420, -8579, -11987, 34274, 9224, -43401, -35087, -5736, -1657, -28494, -13527, -19551, 29485, 20066, -3892, -45013, -52842, -42556, -59811, -61880, -57956, -63120, -57196, -47966, -31058, -20355, -14352, -1328, -15918, -2305, -1969, -31324, -29825, -43208, -10232, 21845, 13304, -17524, -45579, -64640, -81514, -79629, -46964, -6701, 25717, 27671, -1477, -28891, -75458, -60122, -70163, -69748, -37042, -2274, -27794, -15600, -8287, 8748, 4084, -20597, -12369, -26431, -33364, 13226, 14152, -38778, -23007, -26587, -31445, -28183, -2455, 31558, 45117, 34903, 36470, 33890, 30268, 62196, 41434, 20115, -37708, -50073, -44228, -20050, -10742, -33267]
17511c3267J2582K7021n234k9687n6112j8743K8213k8281m372M2521M4986k0955
17499d1328k2174M6811J9818m3831r972o772O72P260J2244o528K5192k9033m547
17486e2188K1611J3755m1614m3389M665K0761J7899J0949k8635l699N0783j6451
17474d5553j5004K4753L5818l0322k5252J756m081k8026J2115K3105K9375L4453
17462A3137k5248m3294L4132j939k1191k5004m6463M1490J006K9741L2411j0858
17450b2080j2064O7461J6381m805K5324k205N1580K01699J76886N1498n8763j17713
17438C73199j90086r9790n0340n9425n331j5999l827P2167N4159k7293j3751l539
17426C0144k5618k3607J7349J6042j5862J5280K254m0206p800j7619L4567M6899
$$ y = [-33267, -20685, 6336, 1102, -28585, -84697, -103440, -75227, -103508, -107880, -65359, -20373, -41328, -63502, -16691, 3127, -40704, -50676, -57448, -56776, -49516, -37272, -43800, -18608, -47641, -52188, -30577, -16822, -58436, -101825, -97160, -76399, -58500, -47551, -76186, -79885, -29102, -45553, -60557, -35804, 14, -30308, -55560, -53804, -57885, -85911, -73796, -50691, -21316, 13137, -12111, -55405, -21273, -23212, -44403, -69407, -115870, -74380, -73374, -43633, -11222, -22080, -34144, 33317, 49698, 44893, 70217, 68012, 119592, 321291, 498177, 549675, 490912, 373199, 183113, 83323, 32983, -26442, -31773, -47772, -51599, 20568, 74727, 47434, 33683, 30144, 4526, -19081, -1732, 14310, -1552, 13728, 15982, -24224, -32024, -49643, -15076, 31823]
17414C1823J5801J5497K1040n087m2207n7320L026J5461Q653J6216J4412L1228
17402F8543n0570p1047M5046N758k8080K1141l7339R53k8772j8287M5110k43j8620
17389f6407j0552K3898J1988K9190O623K8210k6545k2667l0898m3733k8931L1008
17377i8816P5635L8216j9828o6833L0948J7006l1528j4733L4235K9083n575K0024
17365G834L6505m8191j2740K3163J9597k0328k3551R092n3805j9332J0884k656
17353g3528J4014r204j630L3114K7634k4683L0535J6705P169l28r190m181n0247
17340d3820n8518M004J3896N3401P5687j3873j5208l7209m6050J3914J9576N4606
17328B0406K6475n6646k9321K5447K4637k6477l6254K8494M5216J631o9832k3549
$$ y = [31823, 47624, 63121, 84161, 79074, 36867, -20453, -17427, -1966, 6687, 22903, 37315, 68543, 17973, -53074, -8028, -2270, -30350, -9209, -46548, -45595, -74367, -92654, -47544, -47787, -66407, -76959, -53061, -41073, -11883, -5260, 22950, -3595, -26262, -57160, -100893, -129824, -98816, -23181, 15035, -4793, -71626, -40678, -23672, -55200, -69933, -35698, -6615, -12190, 7834, 44339, -3852, -16592, 6571, 26168, 5840, -17711, -8619, -62424, -81756, -70872, -73528, -59514, -68718, -70348, -37234, -9600, -34283, -3748, 12957, 20126, 19798, 10608, 6427, -43820, -102338, -98334, -84438, -31037, 44650, 30777, 15569, -21640, -67690, -53776, -34200, 20406, 46881, -9765, -39086, -13639, 10998, -15479, -51733, -23239, 21977, 23608, -46224, -69773]
17316f9773N3091K080j2485j5807j9872k638l3719K1877P9210K653J872N3633
17304F0122k4121k7037K4572n810J5401o618j4731j9032o6449j0795M7447J8557
17292h494K3476k872R503n914l687J1585L0204n6632k1505K6027j2420o1299L215
17279f8813J9160O0921J8303l3547n004K2029K7988m151k1373l0642L349p41J8616
17266F095k2548K0957O261o3720n8050L8177Q818M101P2344l5677r585m170M9061
17253A2064K9628o7246P549N5100M3871j0764j3103j4383o7112l5596K1396K4852
17241a3744J0708J0682k5276k5632l4748M3660L4395j4673j5123k6572J613L1332
17229b3378K3019j375j9095l4519k9499J7274M6112k6931j6409j7747n429J03492
$$ y = [-69773, -16682, -14602, -27087, -42894, -62766, -65404, -99123, -77246, 1964, 4617, 6489, 60122, 36001, 8964, 33536, 27726, 43127, 36509, 21778, 2746, -63703, -74498, -27051, -8494, 14982, 12110, 21613, 15699, 12012, 23597, 53801, -2831, -24336, 1691, -10729, -72028, -68813, -49653, 11268, 29571, -3976, -8980, 13049, 41037, 36886, 15513, -15129, -11780, -12521, 6095, -16453, 4504, 10765, -52955, -111005, -72828, -64010, -59909, 12435, -23242, -32827, -36997, 12064, 41692, -25554, -18005, 37095, 80966, 70202, 57099, 42716, -24396, -59992, -38596, -13744, -3036, 7646, -17630, -43262, -78010, -34350, 45, -14628, -29751, -56323, -54710, -23378, -359, -1734, -20829, -55348, -84847, -67573, -21461, -48392, -64801, -82548, -87977, 15515]
17217A5515K9301o0196k2632M1988K8140J1057Q460l2321j8778k6946O5863J4251
17205E3702k3075p885l07P006k5484J7586q053k7508k4235p5036k5276O8301L1955
17192c8309j4914m107j728J5382J7955J6410k6587o559N0405K4304l193L9687
17180F8746m9388k5016j3574K5558j1652j304N4925q883K650m920q27o4532l5514
17167f3731J3859l2424K8580P6679p659k4722j5395N071M6240K5004l1578L0549
17155E0473K8880J0764m4578l5945j1064P034k4532k2300J3745l2655L0182L6598
17143F602J5643j7930q702N9665Q076j3413R256r820L0826j3124K5968l1161m5391
17130A6495l2196J4539k631J7677K2349J7773M596o5402n6811J9201K5694K332
$$ y = [15515, 44816, -15380, -38012, 3976, 32116, 43173, 51633, 19312, 534, -26412, 39451, 53702, 30627, 22742, 22435, 29441, 3957, 21543, 13490, -14018, -38253, -113289, -138565, -70264, -38309, -53223, -57330, -59058, -43676, -25721, -9311, -35898, -42457, 7948, 32252, 29059, 68746, 19358, -5658, -19232, 6326, -5326, -6630, 48295, 39412, 42062, 37142, 36315, -28217, -63731, -49872, -82296, -53716, 22963, 15304, -9418, -24813, -19742, 26498, 51502, 19924, 50473, 79353, 90117, 45539, 9594, -1470, 5564, -18968, -41268, -27523, -60178, -29996, 6602, 22245, 4315, -4387, 55278, 63354, 49941, 59197, 49377, 80203, 67079, 93047, 61886, 16495, -15701, -1162, -3793, 13884, 36233, 54006, 58602, -6800, -63611, -44410, -18716, -16384]
17118a6384K512j1364J0597k7996m1010k9908L0474O2605L2124o758L0873K5360
17106F1125k5728K9042J2274m6160n7730r922j0174L1396J6598q366n6773j3324
17094g7742J8292K3711L6280l401p2858K0115R5633N050k2471L5396J6240m149
17082G0096K9689n2482k9899j787m2839K7487R589J6015j2732n0061j0886P7492
17070B9682R256k1600l0265J0115M4676J2034l9523r3323O76N049k4120j740K5959
17057g3124O1184L4662J8222l339l2419m0330m8375K2353R075L3222P173k4520
17045c6216m0715l0045M9348M3162k5640K881m1155K1810K0993k0892l2507J3564
17033g5412K5159K4356n2634m0094K7093J8795J7807q957J3756J3733O1503O5302
$$ y = [-16384, -13872, -25236, -14639, -42635, -83645, -113553, -83079, -20474, 11650, 4892, 35765, 61125, 35397, 64439, 76713, 30553, -27177, -37099, -47273, -15877, 721, -7645, -64418, -77742, -59450, -35739, 541, -2860, -75718, -55603, 40030, 45080, 22609, 58005, 74245, 70096, 99785, 47303, 17404, 15617, -27222, 265, 9854, 25869, 13137, -36924, -47810, 29682, 38938, 17338, -12927, -2812, 41864, 53898, 14375, -78948, -78272, -73223, -97343, -99083, -73124, -11940, 22722, 40944, 37605, 5186, -35144, -83519, -61166, -52091, -18869, -11696, -36216, -76931, -106976, -57628, -14466, -40106, -37225, -78380, -56570, -35577, -56469, -88976, -75412, -50253, -25897, -78531, -118625, -91532, -72737, -54930, -63887, -50131, -36398, 25105, 90407]
17021I0407j1396l6704J8851l0673o0057J3818j1258p4716K399L9372K1539L1820
17009f598R363j8957M6647k9o0078k2865j7962j2103k4326L0902L5177p709j9599
16996f8137o9232j4213M2770K5511L5776J9103O283k8161K0184m147J4628L4662
16984A5027k7608o026K731K2148j5540k748k6907q5453p494J7228N7817Q4128
16972B7303L446j0753l1845k0723j3837J5996J1692m0107J509P5638L7330l9698
16960A5951k5785l5884N3371Q731k1768K8661J1539J6811n7958m3453l923J3177
16948d0530O456j3684j3297L091J5252j2381l7684l8751L2686J1526P5552N1497
16936C9733j6696n0435l4400J6279L84j0099j6509M5622L649m3362J3060M5791
$$ y = [90407, 79011, 42307, 61158, 30485, -29572, -15754, -27012, -101728, -99329, -59957, -38418, -6598, 2765, -16192, 30455, 30426, -29652, -52517, -70479, -82582, -106908, -76006, -40829, -48538, -68137, -137369, -151582, -108812, -83301, -47525, -28422, -22139, -50300, -30116, -34263, -19635, 15027, -12581, -18607, -15876, 6272, -9268, -12016, -38923, -124376, -131870, -114642, -56825, 27303, 30749, 19996, -11849, -32572, -46409, -30413, -18721, -58828, -57319, 18319, 55649, 15951, -9834, -45718, 7653, 16384, -5384, 23277, 34816, 51627, -6331, -49784, -53707, -40530, -34074, -47758, -61055, -57964, -42712, -55093, -92777, -131528, -98842, -87316, -11764, 39733, 23037, -27398, -61798, -45519, -45135, -55234, -71743, -26121, -22472, -65834, -52774, -6983]
16924f983j3061m4187j7157j1884L1931J0589o885o0754m0203P8222M3212n2J0039
16911b7173l8614L6213J5442n340j890j7201k4490M3482k147j1519k9041j6289
16899g8567M5939K0486k0627r647J4591j9547k764N6417L6326k5233j2828j9278
16887a4732j2683L2654p325r211J2546k5723j5688J2406R216J2126K2139k9864
16875a4139l7982l9696k4170J4629O8673N0098N604J7481R114k7503L6057L6808
16863I4974L1509k6298l5658l1959j7953k9767j5627J1620m4884k9738L9102L5122
16851a9557r871L456l574J0873j8334m1451j5098J2877O012j1399O595L0684M9291
16838E04m7539l5799K9046J9664j685K6717P1257k7697n0307L042m1106K179J6875
$$ y = [-6983, -20044, -64231, -81388, -93272, -61341, -50752, -57637, -118391, -158594, -80372, -37160, -37212, -27173, -65787, -29574, -14132, -19472, -21362, -38563, -63053, -19571, -21718, -33237, -62278, -78567, -32628, -12142, -32769, -42416, -27825, -47372, -50136, 6281, 42607, 17374, 4546, -14732, -27415, 5239, -2086, -11297, 1249, -24474, -40162, -27756, -18540, -6414, 15725, -14139, -52121, -91817, -115987, -101358, -32685, 17413, 23017, 40498, 49612, 22109, 58166, 94974, 126483, 100185, 64527, 32568, 14615, -15152, -30779, -19159, -64043, -93781, -54679, -19557, -29428, -25972, -29546, -18673, -37007, -78458, -93556, -80679, -74667, -86066, -79471, -48787, 504, -47035, -82834, -53788, -34124, -35809, -9092, 62165, 34468, -15839, -12797, -53903, -51724, -34849]
16825c4849R326k0443l7053J5930K8400r959j1742J9324L2101J9725j0277m2090
16813d1607k3918K8658j8368j981K8532O355j8742m1223k7066N8130P1606K2412
16801D2788n758m1916m6273l5582j8456j5055O534K9143j4678j559j271K0634
16789h1449L382j5167N594N5804O869N01l8364m610R329j8303J1111L3751P5025
16776D3473j3762l0769j3811K4459l6698m9501k4570k8725L0355j54N2896L7586
16764i221K0605l9020n177R709n965K5824K8251k5212j9185J4613L9906R399p2183
16751b7656m5161J7874k7797L8228M1456p49m1309M569M0031k7427l8644k8944
16739i5529M6920J0665o6099J0674L6821K9700k9506j0765J0935L3864Q000k1807
$$ y = [-34849, -25523, -45966, -83019, -67089, -38689, -48648, -60390, -41066, -8965, 10760, 483, -41607, -65525, -36867, -55235, -57216, -28684, -22329, -41071, -82294, -109360, -51230, 20376, 42788, 37030, -4886, -51159, -86741, -105197, -120252, -113718, -84575, -99253, -100812, -102083, -81449, -78067, -93234, -87640, -31836, -24967, -24466, -62830, -67440, -58111, -76414, -65303, -31552, 43473, 29711, -1058, -14869, 9590, -27108, -76609, -101179, -129904, -99549, -99703, -46807, -9221, 11384, -27636, -32813, -23104, -29069, -3245, 25006, -206, -19391, -4778, 35128, 44527, -27656, -72817, -54943, -82740, -44512, -3056, -3805, -45114, -40545, -514, -27941, -66585, -95529, -48609, -37944, -104043, -93369, -56548, -26848, -56354, -67119, -56184, -22320, -14320, -36127]
16727c6127J1925O090o5717J2581k201l2087K2631O4995L9719J8645j5172n7567
16715c2285J3569k7697k9554k4878M8127J7089j1536K9012M0199J0868n2616l4633
16703e4335L4949J5049k3837q935j1513j4349N3574K6578J464m2049k3241J8341
16691b8304J5672j5220l1863o990J28K7376L830J2426P067O051J1827k2740l708
16678b4448n5785J8947L6981k7821l4344k25M731m294j0934K9351L8621L2153
16666B933M5592j012l0138k1789l1966k4761J4740L3190j1671j4416Q996j8796
16654d9098j7468L2889K2806m3422L153M4733k962o776k0713j2435j286j0594
16642f1173J5028M3039j1917o5953L9694K9076l1433n8164l4664K751N9820N902
$$ y = [-36127, -24202, -18112, -83829, -71248, -73449, -105536, -82905, -17910, 21809, 40454, 25282, -32285, -18716, -46413, -75967, -100845, -52718, -35629, -47165, -18153, 22046, 32914, -19702, -54335, -19386, -4337, -28174, -37109, -48622, -62971, -9397, 17181, 18645, -23404, -46645, -28304, -12632, -27852, -59715, -66705, -66577, -39201, -35371, -22945, -15878, -9827, 2000, -20740, -24448, -80233, -61286, -24305, -52126, -86470, -86695, -81964, -86258, -97192, -67841, -29220, 2933, 48525, 47513, 17375, -4414, -36380, -61141, -46401, -13211, -24882, -39298, -30302, -49098, -66566, -33677, -10871, -54293, -51140, -6407, -9369, -16145, -36858, -49293, -50579, -61173, -46145, -3106, -15023, -80976, -41282, -12206, -43639, -101803, -136467, -133716, -73896, -67994]
16630f7994m2169J9414M8221K9176L9688k0878n9790J5049J0700K5486L9783J2964
16618D9650o7394k2437L9313L0537m5777j3528M7414L2839l4755o3301J3496k2901
16606e6844l0965M8452N2599K6077N419j6506m2599n4503k7128J6109L7865K3905
16594a8119O486l232q837J8751K8449p997k7074m1360M4199m684n2868j294r172
16581g6752M4897N0744o28o1574l4726j2693J1721L8820j1869r359K4810K0742
16569a5867L5945q692J332j9125k4248m908L6008k7844J1314K6655j2963j9790
16557b2183J4619n2823j8360J3945J1937j0828k185J9072n421P0N4905K533J1605
16544A6886j6561n524m5867N542J0891j7673M5143k205q525l6199o1244m110M8798
$$ y = [-67994, -110163, -90749, -42528, -13352, 26336, 5458, -54332, -39283, -28583, -3097, 36686, 49650, -17744, -40181, -868, 29669, -16108, -29636, 17778, 50617, 15862, -47439, -33943, -56844, -87809, -39357, 13242, 39319, 44738, 28232, -14367, -68870, -95998, -79889, -42024, -18119, -11633, -14865, -23702, -4951, 23498, 15501, -11573, -52933, -8734, -13418, -66286, -67580, -76752, -31855, 18889, 18261, -43313, -78039, -90732, -79011, -40191, -52060, -61419, -36609, -15867, 20078, 11386, 12718, -6407, -30655, -35563, 445, -27399, -16085, 10570, -2393, -22183, -7564, -60387, -78747, -64802, -52865, -63693, -65878, -46806, -52227, -52157, 2748, 5281, 16886, 325, -5199, -51066, -45524, -34633, -52306, -7163, -9368, -17893, -54092, -115336, -119446, -70648]
16531g0648L6512K0907k0637K7447L9091n327n4032K2222j3820j3316P196o249
16519c0654m9595N199O7006M8598K068O330l7889k1619j4782P124M4164l8127
16507a2177k2367m1777K887L1163O0561j4104J1660K9375m170k7991j4176j296
16495b412J1679l8958R417K7024n5554l9607K5725K2872J0137p988k3707K6885
16483c4487O852K3858p849N048K1612J0082m2024j3820K0952J2779J1707p90j375
16470A2545l0332n0909n3055M3167N6007j4794L0656K1120k9650P882M7741m4112
16458c734R035K1210K2097P819l3689p929j2573J8970j5789o796L3671J0665p502
16445C5455l0848j2193j4822m013j2547j3408M2238Q940n9853J4983K7735J4259
$$ y = [-70648, -34136, -13229, -33866, -6419, 32672, 27345, -26687, -4465, -18285, -31601, -24405, -30654, -80249, -75050, -8044, 40554, 42622, 48952, 11063, -10556, -25338, -18214, 25950, -12177, -34544, -76321, -73434, -42271, 18290, 4186, 15846, 45221, 41051, 13060, -1116, -2412, 9267, -29691, -20274, 6750, -48804, -88411, -62686, -39814, -29677, -37665, -61372, -34487, -27635, -3777, -11626, -6578, 15034, 25116, -16908, -30728, -9776, 3003, 14710, 13920, 12545, -17787, -68696, -121751, -78584, -22577, -37371, -6715, 14405, -15245, -7363, 40378, -3734, 5301, 26511, 48608, 56427, 22738, 14809, 2236, 21206, 5417, -1379, 32292, 42957, 35455, 4607, -7586, -22408, -26421, -38968, -52376, -10138, -1198, -61051, -46068, -18333, -4074]
16433d074J1684K1921j5151J0841n4409n3692j5308K5584M8427Q451J3400J7054
16421A4728K5258k7020m2500J0987N04l1624k998L7124J6565j3932j0117N4400
16409C1375n304l7760K073N367l3877o522L8167K3741K2752n4692j5350Q599L815
16396a7616m9724K8807q440j400n0564Q421N8159L6633j3674N539M679O874q401
16383g07Q530j3520j3738K3053K7508p595P49m6117N8970J677J4765K1655n14
16370G4716k4592O82p7446l0727m9190K5949L2817O6172Q602k8633m6002J8135
16358b9517J1115O0775R063m0287l5482r068l581M1175L4795k4583k9308j1580
16346b6483k0898K7487j2544M193L4753L4610l6016m4045l9170m4003L9324M5092
$$ y = [-4074, 7610, 29531, 14380, 25221, -29188, -82880, -98188, -72604, -24177, -15726, -2326, 14728, 39986, 12966, -29534, -18547, -18043, -49667, -52665, -15541, 1024, -12908, -23025, 31375, 26071, -11689, -9616, -4249, -38126, -44648, -6481, 17260, 40012, -14680, -30030, -21431, -17616, -67340, -38533, -46973, -48373, -98937, -90516, -32357, 4276, -9398, -3859, 820, 7694, -707, 7823, -5697, -19435, 3618, 31126, 23531, 24280, -21837, 37133, 38810, 53575, 75230, 74716, 50124, 50806, -26640, -57367, -106557, -80608, -47791, 18381, 26983, -1650, -47652, -29517, -18402, 42373, 51436, 11149, -24333, -33401, -36982, 4193, 38988, 14405, -14903, -26483, -47381, -19894, -32438, -28245, 6508, 41118, 5102, -38943, -78113, -122116, -82792, -37700]
16334c7700m6961j4452k1514k0009k4364m245K7279O0267L845r4K4450M9948K1519
16321A7969k3853j7257o695k5639K3382Q2142j3247n3572l8904J5524k5990m8240
16309a14380k3763M8221N2723J7768O165J7501l3574k2173k9471K886J3053J1028
16297e4016k5538J3353L1261K9520K2817M6576j9865n403n7547n5352J5414R8193
16285C9413m5037J0322K3900m4046k4203K3698M4084j316P2738K0178k4973J2303
16273A07061L708l0958m8966l8625o851J35K2273K3683N932J9870M8737m176q2025
16260A9798k4758J7998J9174K4290l6069j4689M608j5352J3824j8543n4387K6667
16248c7439K3756l2185J2234M818o0695o883M7906L6586L9097j3236K2100J4337
$$ y = [-37700, -84661, -99113, -120627, -140636, -165000, -169245, -141966, -81699, -77854, -77948, -53498, -3550, 17969, -5884, -23141, -29836, -55475, -32093, 50049, 36802, -16770, -55674, -40150, -66140, -114380, -138143, -89922, -37199, -19431, -13266, 4235, -29339, -51512, -80983, -78097, -65044, -54016, -79554, -66201, -34940, -5420, 17397, 63973, 44108, 38705, -18842, -74194, -58780, 39413, -5624, 4698, 28598, -15448, -39651, -15953, 28131, 26815, 99553, 119731, 94758, 107061, 110769, 79811, 30845, -7780, -14631, -14496, 7777, 31460, 37392, 57262, 105999, 101823, 19798, -4960, 13038, 32212, 56502, 20433, 5744, 10352, -5000, 8824, -9719, -64106, -37439, -13683, -45868, -33634, -28816, -89511, -96394, -48488, -11902, 27195, 13959, 36059, 50396]
16236E0396M1514k5026j0399k6092J1903j0438n51K8579J7404K2474j9632k85
16224G9847k5486r051j0588k5256k2382J8850K7005J1515J727L4855k2063m3128
16212A5845k1529J7913k8913o3437K641L8447N6221L2005l5830j3547J9277j8359
16200G34J970K5947n4988j8709L4950K3100K7407m6617k6378o574L5853L3166
16188B9861O359l8819k0249n6867j141O8585j835M431L6396K8024n175m3980n248
16175C42q234K2476L7626j8004k2810l5244k7387J8946L6742l849l679k42L0301
16162B6984K7351K3820M2659M973r1826j3913M7812L7150j3818j1924k470K8716
16150A05514q061n1989k1036k2403J0781L5972K2341k9279m3397K1072J9893O7953
$$ y = [50396, 91910, 66884, 56485, 30393, 42296, 31858, 31307, 59886, 77290, 99764, 80132, 79847, 54361, 45310, 34722, 9466, -12916, 5934, 32939, 44454, 46181, 81036, 58973, 15845, -5684, 12229, -16684, -80121, -77480, -39033, 17188, 49193, 13363, -184, 19093, 734, 2704, 28651, -26337, -45046, -10096, 13004, 40411, -6206, -32584, -39158, -3305, 29861, 36220, -2599, -22848, -79715, -80856, -12271, -14106, -9675, 26721, 54745, 49570, 5590, 342, -7892, 14584, 52210, 34206, 11396, -23848, -51235, -32289, 4453, 604, -3075, -3317, 26984, 54335, 78155, 120814, 125787, 33961, 20048, 67860, 105010, 91192, 79268, 76798, 105514, 97453, 45464, 24428, 2025, 12806, 48778, 71119, 41840, -1557, 19515, 39408, 107361]
16138A07361r665l6632J4206K0969J0404j6459m6775k0171J8143K9411m3202l027
16126B4563O4201J5879o231l4610l068N3276k0945K1527o965n2262m8399M8807
16114E5773M0406k5505j5424r49K7239L3675L489l224L5615N6144L5791k4974
16102B18056m5873o9882m4430K9945m243M9435l5118l2755K7507L1540j4334M883
16090A14731j3232k76N941j0520K1084M5589l7701J1147K2581O246n2940n8652
16078E3998Q156J3856L3503L9429Q476j903l2563k8617m3248k4948K0620M092
16066E0851j2797L6823K0833k0682k431L1406j9420j05405m743J5188N4368K0301
16054F4292L2380N333K9993P688k2835k4360j8571j7660m472l9636K623J6031
$$ y = [107361, 97696, 61064, 75270, 96239, 106643, 90184, 43409, 23238, 41381, 70792, 27590, 24563, 88764, 104643, 98412, 63802, 60734, 114010, 93065, 114592, 107627, 55365, 6966, 55773, 96179, 70674, 55250, 54301, 81540, 115215, 118704, 115480, 151095, 207239, 243030, 218056, 172183, 102301, 57871, 87816, 83573, 133008, 97890, 65135, 92642, 124182, 109848, 114731, 101499, 101223, 107164, 96644, 117728, 163317, 125616, 136763, 159344, 165590, 112650, 53998, 62154, 76010, 109513, 148942, 157418, 155515, 122952, 94335, 51087, 26139, 46759, 50851, 38054, 74877, 95710, 75028, 72597, 104003, 84583, -20822, -25565, -10377, 43991, 64292, 96672, 102005, 131998, 139686, 116851, 92491, 73920, 56260, 51788, 12152, 14775, 30806]
16042C0806L3938j0542O217k2780j0560Q521k8985l9808J4998K2706J5237J4834
16030C4582O1943k8084j7907j9928j5199K4307M1286L6673k0734k2205M612R09
16018H0255l7962j0116j9096k1331P9855J123j3566k8780l7721j9138K0432K4924
16006A8879L3728J5407j0220M3662n094K0466j2692J6748k5333l1860K34J9838
15994H3763P335J2604M5601n6666r1440K3166L7078Q110j6965Q16k6162J2239
15982C9479r788K4708O2052k1756n020O814m1325k5495L3154j3250k7337l6622
15970a4386j2859N801O12M6011Q0244L09j8817j5457j0001r08K1848N4596k8473
15957A08520j3784J9550m347k9920J2049L8648K7033n0048j5781K0178k2651j7117
$$ y = [30806, 64744, 54202, 60419, 37639, 27079, 35600, 6615, -33193, -18195, 4511, 19748, 34582, 96525, 68441, 50534, 30606, 15407, 39714, 81000, 117673, 96939, 74734, 79346, 80255, 42293, 32177, 13081, -8250, 71605, 72728, 59162, 30382, -7339, -26477, -6045, 18879, 52607, 68014, 57794, 101456, 96362, 116828, 104136, 120884, 95551, 63691, 63925, 83763, 91098, 103702, 149303, 92637, 1197, 24363, 61441, 69551, 52586, 53402, 27240, 39479, 29691, 54399, 116451, 94695, 89675, 96489, 55164, 29669, 62823, 49573, 22236, -14386, -27245, -21444, -20832, 25179, 105423, 105732, 86915, 71458, 61457, 60549, 82397, 136993, 108520, 94736, 114286, 109939, 80019, 92068, 130716, 157749, 107701, 91920, 112098, 89447, 72330]
15945G2330k7286J4216j3535k8058M2080J9072n1699K8783o351M0206M0820J4341
15933A44919m4695r850k9303L5638m9547j8159K2340q672K0001K361m2762N2266
15921G4537Q1517Q877l946l4989K255K8021J7350l0601k1663O019K2385J0111
15909A59873j3939K8626P646k7180l0077M9452o662k4244M2441J7119J3747K593
15897B19395l5328j0419l3063l4914N9451J0502o4468j1845L6899N6819j7100
15886A75929m2008o85J9212k4807K65Q719q757K1106j8392k7817j9624J4951K2424
15873A20516k0190N446Q935O2047M6123l5867j2019r891l4531j9414k9203k0193
15861F1759M53J3000K8806l4263k2944j090N3386K5753L7931k1124j9012n0513
$$ y = [72330, 45044, 59260, 45725, 17667, 59747, 78819, 27120, 55903, 49552, 89758, 130578, 144919, 100224, 90374, 61071, 96709, 47162, 29003, 51343, 42671, 62672, 65033, 22271, 74537, 156054, 164931, 160985, 125996, 128251, 156272, 173622, 143021, 121358, 127377, 149762, 159873, 145934, 174560, 182206, 155026, 124949, 174401, 167739, 143495, 185936, 203055, 216802, 219395, 184067, 173648, 140585, 105671, 165122, 175624, 111156, 99311, 136210, 193029, 175929, 133921, 133236, 152448, 127641, 127906, 136625, 127868, 148974, 130582, 102765, 83141, 98092, 120516, 100326, 105772, 114707, 176754, 222877, 187010, 174991, 165100, 130569, 111155, 81952, 61759, 62212, 75212, 104018, 69755, 46811, 45721, 99107, 124860, 162791, 141667, 122655, 72142]
15849G2142l458l9307l1205M0116N2955J5355l3677l5298L2465j5919J6221K0044
15837I0434j3092R640N7876q0K7616K8073l3105k2069Q18m1199j0411k678M839
15824I6662k2351O856J1473m2626l3653j6698J3672k076J6686L2913K2000K2253
15812A05111k2161n8039k9507q156L7696m575j2945l4640l2531j8863K4118N4231
15800b61Q4140K0743M230n2223l7554n004k2695J6998j4636n0998k8474M4244
15788d1490L4752j413l716L390n850j7918M4906O1515l222m3748j7762m1626m5176
15775g7358J9135J9934Q159O2175L5704j5023k8449j9791o6492l4462N9840L1867
15763d761K7237M7978Q9082m149p5705j0999j5398n0156l5942J4301P5630P373
$$ y = [72142, 68684, 29377, -1828, 38288, 91243, 106598, 72921, 37623, 70088, 54169, 70390, 90434, 77342, 86982, 144858, 144778, 172394, 200467, 167362, 145293, 146111, 104912, 94501, 91823, 96662, 74311, 81167, 92640, 50014, 16361, -337, 13335, 11259, 27945, 60858, 82858, 105111, 82950, 24911, -4596, -12752, 24944, 20369, 7424, -27216, -59747, -78610, -54492, -261, 83879, 104622, 108852, 56629, 19075, 14071, -8624, 8374, -6262, -57260, -85734, -41490, -6738, -8151, -11867, -8477, -14327, -32245, 12661, 74176, 70954, 27206, 9444, -32182, -77358, -58223, -38289, -30130, 32045, 67749, 52726, 24277, 4486, -62006, -96468, -36628, -4761, 22476, 70454, 159536, 155387, 79682, 68683, 53285, 3129, -32813, -18512, 57118, 64491]
15751F4491l2016L5747K3000m1084l3536M165M291J1373m616k0518l3655J4456
15739g902O5785L3907l8910L0014k3995K462M9382j6203l1492j7013p545K5423
15727F3913K129L8995K03o4915k2323J6994N0806M2601j0356l1500l6726q821
15715D1000k3148k9104j3261j0847l5750K2406P4327N9502L2036j2204j9501j2064
15703G3392l5538j6632o4435J9084J01499m9365j6734L1864j0912n2330j8442
15692c8549n455k864m972N9305k4599k8435J6134J6728L4923k7867k9953p283
15680d2887j3709J8508M6411L5983k2261m4337O377K694k7112k6951P5194O6872
15668G4782k81k4838r413J3405K9004p155j969k9786m1354M130j242Q139j0985
$$ y = [64491, 32475, 68222, 91222, 50138, 16602, 20767, 25058, 36431, 31815, 11297, -22358, -7902, 57883, 91790, 52880, 82894, 58899, 61361, 110743, 94540, 63048, 46035, 38490, 63913, 66042, 105037, 105240, 40325, 18002, 34996, 85802, 128403, 118047, 86547, 49821, 41000, 17852, -11252, -24513, -35360, -71110, -48704, 25623, 85125, 117161, 104957, 85456, 73392, 37854, 21222, -43213, -24129, 77370, 28005, 11271, 43135, 32223, -20107, -38549, -44004, -46868, -51840, 7465, -17134, -45569, -29435, -12707, 22216, -5651, -35604, -42887, -56596, -38088, 8323, 44306, 22045, -22292, -15915, -13221, -40333, -67284, 7910, 74782, 74501, 49663, 40250, 53655, 82659, 75504, 73535, 43749, 2395, 6525, 5283, 13422, 2437]
15655B437o168L8903N0860k5711o7267k0428L0256J2276M4936J9888K0903o3096
15643C7789q4466r966P2983M1864J6939j2705n2196N598M2945j3492k7119M562
15631B2736j109K0759j511j6506Q555N1905M2631j0862j7092l6563l9690j7834
15619E419J6555L0239m1778o4064k8748k8116J1039P8459O0112k241J673j4356
15607B4193n4501L1950K5445n4790l1970O015P3058K4785R226L0639j377r700
15595G2973k2685p2212n1907J8915Q816j4113M8180P328j4930L9564J2776K2943
15583E5648n4m6929p5912L2691n19K4961O1548J013L7658Q356j0740n621j5684
15570F6416K056K7852N7254L1131m7845m8328j3096K5030p3256k9608M8200N1262
$$ y = [2437, -3731, 35172, 86032, 60321, -6946, -27374, 2882, 15158, 60094, 79982, 100885, 37789, -46677, -56643, 16340, 58204, 75143, 62438, 10242, 15840, 58785, 45293, 18174, 22736, 21627, 42386, 40875, 24369, 32924, 84829, 127460, 116598, 99506, 62943, 23253, 5419, 21974, 52213, 10435, -53629, -82377, -110493, -99454, -20995, 39117, 36876, 38549, 24193, -30308, 1642, 27087, -27703, -59673, -53658, 19400, 44185, 53411, 84050, 82673, 72973, 50288, -21924, -73831, -54916, -46100, -60213, -12033, -4705, -19635, 19929, 32705, 55648, 55594, 8665, -67247, -34556, -35075, -10114, 51434, 52447, 90105, 98461, 87721, 82100, 66416, 68472, 96324, 153578, 184709, 136864, 88536, 75440, 100470, 27214, -2394, 45806, 97068]
15558I7068l3929n4661Q071j2795K005r115N748K7957L086K7095M727p2888m5385
15545e3016J743J6348k681J4787M3313L7379J5624n1492Q969L2216n9163J8046
15533B2073n866M022j2065M1638N3634k7874J1648k0895J5804j9647l0179J7173
15521D9466j3864m7986l346R804l2949M2009l340j6327j1523J5349L6114O9144
15509I2551K8361j8512l8667J2780k8597J8972J0097l5703n9292J4233P848k9682
15497b5611K7914Q41L8819k7407k6287J5818N0559J8916l6405N4047r370n3502
15485B8332o501L8502m924K4098l2794j808p331m4058J1055K9732P654j0183n0361
15472a8587N353N3722m578m0809m5249j4315n925K9772P1529L0191J2131k2277
$$ y = [97068, 63139, 8478, 16549, 3754, 5759, -3356, 2392, 30349, 33435, 60530, 65257, -7631, -53016, -51273, -34925, -37606, -22819, 20494, 57873, 73497, 22005, 30974, 63190, 4027, 22073, 16207, 20229, 8164, 49802, 103436, 75562, 87210, 66315, 82119, 62472, 32293, 49466, 35602, -12384, -15730, -5926, -38875, 3134, -206, -16533, -28056, -12707, 23407, 92551, 120912, 102400, 63733, 76513, 47916, 66888, 76985, 41282, -18010, -3777, 4071, -25611, 2303, 3144, 41963, 14556, -11731, 4087, 54646, 73562, 37157, 91204, 81834, 28332, 21831, 60333, 55409, 79507, 46713, 44905, 37574, -6484, 4571, 34303, 41957, 31774, -18587, -13234, 40488, 35910, -4899, -50148, -64463, -70388, -40616, 30913, 61104, 73235, 50958]
15460E0958j53J0583l770k0323n3010J7904P259N9105q774j9497k3070j9983k7868
15447c0639L9288K285j6687L0565k0135J1660L6289j5036K5831J2437k0050K3925
15435G9733K1586j6773n3058j2310L4230p438M2532r392n4679k0740k7430M6748
15423B3009r12l4437K2577K2218J434o280L507m4694k0256L6887K3302J6147Q201
15410E0703j1386l9915m200K3888l19n576o960J5591J0080K1648j6890k7864l1124
15397b2324K0698M101j7539k991J8939N605J3325L5830M0113J1112j2484j0246
15385H4139m786k9584L6502J6474J0597k9848o9719K9455N6443r664p0380j8594
15373A035N9021j6472q549k1279j6964k6456k2555K8464J3771M2874K8349k0224
$$ y = [50958, 50805, 61388, 57618, 37295, -15715, 2189, 9448, 68553, 59779, 40282, 17212, -2771, -30639, 8649, 10934, -5753, 24812, 4677, 16337, 52626, 37590, 63421, 75858, 55808, 79733, 101319, 84546, 31488, 19178, 53408, 45970, 88502, 79110, 24431, 3691, -23739, 23009, 22097, -12340, 10237, 32455, 33889, 27609, 31116, -13578, -33834, 3053, 26355, 42502, 50703, 39317, -598, -4798, 19090, 18771, 13195, 6235, 21826, 31906, 53554, 36664, 8800, -22324, -1626, 2475, -15064, -18055, 884, 6489, 19814, 55644, 95757, 106869, 94385, 84139, 79353, 49769, 86271, 102745, 113342, 83494, 13775, 43230, 99673, 90009, 19629, 1035, 60056, 43584, 35035, 13756, -3208, -29664, -52219, -23755, -9984, 32890, 61239, 41015]
15361D1015k1602M509j1430k1921L1890J0751R396J8625k8847l9763m744k348
15349a4469J3795O268R228L1425M1567J1534n2838J6004j5578k9339k3169j1337
15337a6909P060M0359L7700m1604n877M5305l698N294R322J0488o8947m5176L5045
15324H362K6637J5697j165k1936L943K9172R915k9676j9097R791l5462Q316J4762
15311A9259O1551j7153r720p373k5780n068k2028j6642N3645L9415k5639r974
15299C4493M596m9471L2600O6926J8413l9558n809J7927k4108o8033M2390M9411
15287G9777j7311o2983l8252K9428L8624J8655l7877O770O2699p404k4949L328
15275E0505K6578n7578k2109L2830M9775K0271l2808j6911K3038j4469k5228L6603
$$ y = [41015, 19413, 23922, 12492, -9429, 22461, 33212, 42608, 61233, 32386, -7377, -12121, -14469, -674, 5594, 14822, 46247, 87814, 99348, 46510, 62514, 46936, 17597, -5572, -16909, -9849, 30510, 68210, 26606, 20729, 66034, 62336, 67630, 76952, 87440, 18493, -26683, 8362, 34999, 50696, 49531, 27595, 31538, 60710, 70625, 40949, 21852, 31643, -3819, 4497, 19259, 80810, 63657, 53937, 46564, 20784, 15716, -6312, -22954, 30691, 70106, 44467, 34493, 39089, -10382, 22218, 89144, 107557, 67999, 62190, 80117, 56009, -12024, 30366, 79777, 62466, -517, -38769, -9341, 29283, 47938, 10061, 16831, 79530, 72126, 47177, 50505, 77083, 19505, -2604, 30226, 80001, 100272, 67464, 50553, 73591, 59122, 33894, 70497]
15263G0497M6695K3351m3162j0497j216M5856m676m0870l858L5731j1184m294
15251A02373j3674k0715p437J944j7609M0633j0114l2727k9213O329M8085l1638
15239C6237m0510q546l4295N9274K9101J9740L1776M4908k9782l2899J5447K0321
15227A10772J2410J6075l5371M678l969K946K2132R307k7655R760K6740q3923
15215F3902k0613k1963K6051O5474j188j4941k3711K990P939j9988L1863J0084
15203A05899n8264j3856L2344n0571n3895P6840M698L3660O296n4731n505K8606
15191E1521N3002Q812J9969M271P656n6664k0063K2346K9077j244k21J6802J482
15178A36746o1199p1780n0418k3801q25j0752N6587M0566Q97Q702J2041k0918
$$ y = [70497, 117192, 140543, 97381, 86884, 85668, 131524, 126848, 85978, 82120, 117851, 106667, 102373, 88699, 67984, 60547, 62491, 44882, 85515, 75401, 42674, 13461, 19790, 67875, 36237, -4273, -12819, -47114, 12160, 41261, 61001, 92777, 137685, 107903, 75004, 90451, 110772, 123182, 139257, 103886, 108564, 104595, 107541, 129673, 138980, 111325, 121085, 147825, 63902, 43289, 21326, 47377, 112851, 111663, 96722, 73011, 76001, 83940, 63952, 95815, 105899, 47635, 33779, 66123, 15552, -38343, 38497, 43195, 76855, 83151, 28420, 22915, 51521, 104523, 113335, 133304, 137575, 145231, 88567, 68504, 90850, 119927, 118683, 118462, 135264, 136746, 75547, 3767, -46651, -70452, -71277, -82029, -25442, 15124, 16021, 24723, 36764, 15846]
15166A5846l662l5438R962K4280J7120O798K1472l6878m801K3659J1748L8983
15154H9089J4309j759k0347j6340o236j5981o85L5648M722k6545J4016k5958n2675
15141h742R384M2422K4047M0286m4448m2442j4120N175M9714j8596l2129J554
15129A2105Q773M179L1001k071K4463j331j55J985l8871l133K1406K259r975J3289
15115F3924L4565l5854j2881q178O84n165j6249L5011M485J1571J5799J2340l3113
15102F6939k5396J7732K4994L2709K712m3659l3048p674M7545M151n3804L0905
15090F4106J882j4433K445j2839J1709o29M3322K7029k8292m547o720p126m955
15077G0952L067P814M238m1781k5180P566N3954K4086m5388l3159J2848L8429
$$ y = [15846, 12184, -23254, -13292, 10988, 28108, 34906, 56378, 19500, 14699, 38358, 50106, 89089, 103398, 101639, 81292, 64952, 58716, 42735, 42050, 77698, 82420, 55875, 69891, 43933, -8742, 642, 43064, 67111, 107397, 62949, 20507, 6387, 11562, 61276, 42680, 10551, 12105, 20878, 25057, 56058, 53987, 78450, 77119, 76964, 78949, 40078, 36945, 58351, 60610, 50635, 63924, 98489, 62635, 49754, 41576, 42260, 37095, 20846, 55857, 60342, 71913, 87712, 100052, 66939, 41543, 59275, 84269, 116978, 119690, 76031, 42983, 35309, 82854, 87005, 33201, 64106, 65988, 51555, 54000, 41161, 52870, 52241, 95563, 122592, 94300, 89753, 83033, 75907, 70952, 74019, 81833, 86071, 44290, 19110, 26676, 80630, 104716, 59328, 26169, 39017, 77446]
15065G7446J3184n3882o38L7097J133j5915K7357n398n9129l2190L6200P8710
15053A03975J7540n2710l4634l997K703L257N9789k1647k1903N8285K4140K7198
15041A61996l8140n613l7255k0192j5725K5750j4369m990o722p6868J5602N6325
15029C9799M7897L1205k684j4674j7803l2180J1280L5347m5483k8686J6515L4565
15017G5098J071J0705j9778K6890l1074n497j595k2952J6030K8871N3263Q782
15005A39814l0930n3971k7486K8373J1957O1416J3604n6601R468N1603k338k4094
14993A20815o833q380j5279L000M6372K8323o4605m4066J3873P795j9673k5957
14981C5385N02J9803M4322l917m1560O238l8862J3314O6243M1418p9512k1948
$$ y = [77446, 90630, 36748, 36110, 73207, 74340, 58425, 85782, 80384, 21255, -10935, 25265, 103975, 121515, 68805, 34171, 30174, 32877, 36134, 95923, 74276, 52373, 110658, 134798, 161996, 123856, 118243, 80988, 60796, 45071, 70821, 56452, 51462, 44740, -32128, -16526, 39799, 87696, 118901, 116217, 101543, 83740, 51560, 62840, 98187, 52704, 24018, 40533, 75098, 76169, 86874, 67096, 93986, 62912, 57415, 55820, 32868, 48898, 77769, 131032, 139814, 108884, 54913, 27427, 55800, 67757, 129173, 142777, 86176, 95644, 147247, 144909, 120815, 113982, 105602, 90323, 93323, 139695, 168018, 103413, 59347, 73220, 81015, 61342, 35385, 35887, 55690, 100012, 96095, 54535, 60773, 21911, 35225, 101468, 142886, 63374, 41426]
14969D1426J5640Q3994N3574k5116k6859r581M211J7757m1498k7616N6442O886
14957A49260l3190j0426j3017k5893L886N3806o5470J1893j305L7509j482j7171
14945H8400m0641o102k2816N8749J1831k858k2536j4670K7751j5359L1324k058
14933I1015J0008K8487m54j1682k4343K2995r232K5150p61k9679r4J6178m6182
14920G1406L610N8822L4355K39j8482l452r882j633L2751O432m0685k0886L098
14907A15693J3927M4477m6063o5037k2605m3865L7399Q6941O5074j1945m2475
14896A31521L1223j9139k4317l060k0234K4582K4986j5051M695L2112L8913O5282
14884B71513m1290r4538l4322J0815L2161K1413J195j6826m012j6614k0158J2629
$$ y = [41426, 57066, 141060, 194634, 169518, 142659, 133078, 137289, 155046, 113548, 85932, 142374, 149260, 116070, 105644, 92627, 66734, 70620, 124426, 58956, 70849, 69544, 107053, 105571, 88400, 47759, 41657, 18841, 77590, 89421, 86563, 64027, 49357, 77108, 61749, 93073, 91015, 101023, 129510, 129056, 117374, 93031, 116026, 106794, 131944, 131183, 101504, 101410, 117588, 71406, 75016, 133838, 168193, 168432, 149950, 146498, 136616, 134983, 167734, 174166, 133481, 112595, 115693, 129620, 174097, 128034, 62997, 40392, -3473, 33926, 120867, 185941, 173996, 131521, 162744, 143605, 119288, 116228, 95994, 120576, 145562, 130511, 135206, 167318, 206231, 271513, 230223, 135685, 101363, 112178, 144339, 165752, 166947, 150121, 146109, 129495, 109337, 121966]
14872A21966N2982J8268k7173Q105m0739l4071p86J6060k1255j1826K3386J3469
14860A18386K1203j3503j7192J068N438J857p658j240K6460N5554k8431l9256
14848A22686j8519m272k5748K3627L8490p344m3240K8852N8555L3601j0697m0013
14836A55978k3644K294n54M334k7647k0877J0847j556m3535J4985p995J3807j0645
14823F5792M1308J2163j2998n666m490k708P884K6145J7376l9535O147J0632J4121
14810A36171L4686J6991K3462J297J8061K832l3787j8969J2507k0832r767N487
14798A68139J0485M0489j9436l0229L4159j6763n4450j5123j0245R904J9557k3337
14786A13150M6956J1666O178L045J1261J3889k7224J2748L561P688M0406N3024
$$ y = [121966, 174948, 193216, 166043, 174148, 133409, 99338, 98552, 114612, 93357, 81531, 104917, 118386, 139589, 126086, 108894, 109962, 115400, 117257, 109599, 108359, 134819, 190373, 161942, 122686, 104167, 99895, 74147, 97774, 136264, 128920, 85680, 114532, 173087, 206688, 195991, 155978, 132334, 134628, 134074, 138408, 110761, 89884, 100731, 99175, 55640, 70625, 62630, 76437, 65792, 107100, 119263, 106265, 100599, 96109, 93401, 101285, 127430, 144806, 105271, 111418, 122050, 136171, 170857, 187848, 211310, 212607, 230668, 233500, 199713, 180744, 193251, 172419, 162652, 168139, 178624, 219113, 199677, 169448, 203607, 186844, 132394, 117271, 107026, 116930, 136487, 113150, 160106, 171772, 177950, 180995, 192256, 206145, 178921, 191669, 195230, 202918, 243324, 296348]
14774B96348l2528k2735l2199J1692r373L1436O692l3571l0987K426L6541J6117
14762B39859J0034j3138j0610j5851J7094j2888j0610L3893k8l4815n9663l4009
14750A09268k130M8252P0442L8480l592l3833j8638k9428L274J8086l5678j5980
14738A48523Q524L4195K9843J2348l7729l4218J0423K9581L6203M7898k699j4618
14726B68274l4039j4803k8119J5418K6020J5910J5350J2308p248j1092K0722J7051
14714B95752j0320l194K1808k1045p2868n1953M706O0960M7192L2403p515j4050
14702B81876j6745K7748m1434m3388o046M6446O9297N136j4574o1506L3006k272
14690B77544k5808k752j5877M4678R974j6245N313K2563l504K9L1405J065n527
$$ y = [296348, 263820, 241085, 208886, 220578, 211205, 242641, 249333, 215762, 184775, 187201, 223742, 239859, 249893, 236755, 226145, 210294, 227388, 214500, 203890, 237783, 237755, 202940, 143277, 109268, 107138, 155390, 225832, 264312, 260720, 226887, 208249, 178821, 182095, 200181, 164503, 148523, 157047, 191242, 221085, 233433, 195704, 161486, 171909, 201490, 237693, 285591, 282892, 268274, 234235, 219432, 191313, 206731, 232751, 248661, 264011, 276319, 269071, 257979, 278701, 295752, 285432, 282238, 304046, 283001, 210133, 158180, 162886, 223846, 271038, 303441, 295926, 281876, 265131, 292879, 251445, 208057, 202011, 248457, 317754, 322890, 308316, 246810, 279816, 277544, 251736, 248984, 233107, 277785, 287759, 271514, 276827, 299390, 295886, 295915, 327320, 328385, 322858]
14677C22858n0484p291N4359j968R652j1316l158o7142k8936K0228L6568O838
14665B80208N335k0000K794L9755M6044k3175l9407j1352J8925M5972K0924M7828
14653D13851q2449n0304p290k0501j38Q2426L4322J8035l3586m3463l1740J6066
14641B95229K4085l0597P546K4119l545n0014k9121K8253J0057L9413K9958l2606
14629C12777j9899j8706K6327J587K8785k3725k0497J6545N616J9131O2504n881
14617C84564k1815K8865K996L1175L1929K0959m2071j17776n5752j7778J7369
14606B62665K9806j7397P790K5337J3300j4592J9057K5663O0963J3087o53P816
14594D32842L8592K196l5742j9415k0805n795K3832Q531o461L2036L0020k459
$$ y = [322858, 272374, 265083, 319442, 317474, 327126, 315810, 312652, 245510, 216574, 236802, 273370, 280208, 285543, 265543, 268337, 308092, 354136, 330961, 291554, 280202, 299127, 345099, 366023, 413851, 331402, 281098, 273808, 253307, 253169, 335595, 369917, 387952, 354366, 310903, 279163, 295229, 319314, 288717, 296263, 320382, 316837, 266823, 237702, 265955, 276012, 315425, 345383, 312777, 292878, 274172, 300499, 302086, 330871, 307146, 286649, 303194, 308810, 327941, 390445, 384564, 362749, 391614, 394610, 425785, 457714, 478673, 436602, 318826, 263074, 245296, 262665, 292471, 275074, 282864, 308201, 321501, 306909, 325966, 351629, 412592, 425679, 425026, 432842, 471434, 473630, 437888, 418473, 397668, 391873, 415705, 424236, 417775, 449811, 479831, 477372]
14582D77372j6086N506R755l2401p8220k4708P582Q797q326K8850N1087o605k3617
14569C98986l2169j2812K2784L6855q837P591n7087J997O8360O0786M7302O0475
14557E94231J1384n3194q4745j1949J1981N505j7494j0262j6763m472j3611K5497
14545D36108L767L101L777J0695J465Q996K0646L2401L0461Q852p0334j9884M4005
14532E14056J5887l2861L1923J7966K2780M872k971k0780l4208K1273L3278p968
14520E63247r009L1341J0388m293N716j3402L891m758j5483n2928K2039L3180
14508E69929L7210J9213J3708p1940k5771Q0204L1861o0580q0760J2874L408L7862
14496E67218L8179J3243M8233p089m3086l1227L1755k2771K3251L2377j3714k7659
$$ y = [477372, 461286, 466792, 476547, 444146, 365926, 341218, 348800, 357597, 349271, 378121, 429208, 422603, 398986, 366817, 354005, 376789, 413644, 404807, 412398, 355311, 357308, 425668, 486454, 533756, 594231, 605615, 552421, 467676, 455727, 467708, 473213, 455719, 445457, 428694, 424222, 410611, 436108, 439875, 442976, 446753, 457448, 458913, 467909, 488555, 520956, 551417, 560269, 489935, 470051, 514056, 529943, 497082, 529005, 546971, 569751, 574623, 571652, 550872, 516664, 537937, 571215, 563247, 554238, 585579, 595967, 591674, 597390, 583988, 587879, 583121, 567638, 514710, 536749, 569929, 607139, 626352, 640060, 568120, 542349, 622553, 654414, 593834, 513074, 525948, 529356, 567218, 605397, 618640, 666873, 659784, 616698, 585471, 617226, 594455, 617706, 650083, 636369, 608710]
14484F08710J7655J6689j2185m3829J2137J8910M4236J0980l5250p846K5987J4767
14472F70961K9409k5593m6931n483L2615L3347j506o336M6599O308m044r86j1121
14459G17239k3690P1994K2975P376p203K8916m5963j5331L3108l1635k823M6058
14447H01021p709J3658K8474m1313k6095l1912k0351l397L2607L0751J1161r657
14435G77238L2069l3708j5691j5216Q363O8448J0869k1190L2624O7206L7548L7146
14423I85706k9871k6485L904l5806Q391q244k5908l3464K1034L5989M1709L1149
14411I68104k2820l1903o530j3470J3926J0078j9337j4325O5017J7401K1066J5097
14399A002304m8134m1999K0451P2714N7185k9159j6684P062M8349N372K0027K8361
$$ y = [608710, 626365, 643054, 630869, 587040, 599177, 618087, 662323, 673303, 638053, 630207, 656194, 670961, 700370, 674777, 627846, 622363, 654978, 688325, 686819, 680483, 727082, 733390, 729346, 728360, 717239, 693549, 765543, 788518, 795894, 788691, 817607, 771644, 756313, 789421, 757786, 754963, 801021, 793312, 806970, 835444, 794131, 768036, 736124, 715773, 712376, 744983, 775734, 786895, 777238, 809307, 775599, 759908, 744692, 753055, 821503, 832372, 811182, 843806, 911012, 948560, 985706, 955835, 929350, 933254, 897448, 905839, 897595, 871687, 838223, 859257, 895246, 936955, 968104, 945284, 913381, 906851, 893381, 907307, 917385, 898048, 883723, 948740, 966141, 987207, 1002304, 954170, 912171, 932622, 1005336, 1062521, 1033362, 1016678, 1023740, 1072089, 1077461, 1097488, 1125849]
14387A125849L4484j1462o2129l6301K0086o135K6802P0735J6176J4903Q796L8731
14375A240535j3965O748o2134m8590O207K8355M1155M6731L8486j6295J2656k432
14363A277457n1379Q2406M1688L7827L2901l048l2035k8073L6640N1723O826K5246
14351A478179K5614K3420o260Q785K8535J6508M3882R3212Q4506R5199K31195
14340B122775K88040L60624K70721J03301j20389k30413k60041k46738k04946
14331B082934j07155p7218q3549n8350r66M455l5169K5404O0096J0468o6683l5204
14319A719063K797M3959K9246j1622J3292M7461j5001l0487K2925M2925N0309
14308A914867Q6427J5354J4021K8068J7143m199K6576K1437K7302L7477J0134
$$ y = [1125849, 1160333, 1148871, 1086742, 1050441, 1070527, 1064392, 1091194, 1161929, 1178105, 1193008, 1201804, 1240535, 1226570, 1233318, 1171184, 1122594, 1128801, 1157156, 1198311, 1245042, 1283528, 1267233, 1279889, 1277457, 1226078, 1308484, 1350172, 1387999, 1420900, 1417852, 1385817, 1357744, 1394384, 1446107, 1452933, 1478179, 1503793, 1527213, 1520953, 1529738, 1558273, 1574781, 1618663, 1711875, 1796381, 1891580, 2122775, 2410815, 2771439, 3042160, 3145461, 3025072, 2794659, 2534618, 2287880, 2082934, 1975779, 1898561, 1815012, 1756662, 1755696, 1760151, 1724982, 1750386, 1810482, 1820950, 1754267, 1719063, 1721860, 1765819, 1795065, 1783443, 1796735, 1844196, 1829195, 1798708, 1821633, 1864558, 1914867, 2001294, 2016648, 2030669, 2058737, 2075880, 2071681, 2098257, 2119694, 2146996, 2184473, 2194607]
14297B194607l1048r824Q161M8428L5261K0842K6729j4970J7424M1965J606m7042
14285B292139k1936L0491M9556J8652N7956L8393M8892N8742L1000l3596K810
14274B573099P026L7978M4323l0308J4898k107J7864K7259N8458j619o3420O1093
14262B744544R3409M2294R1j156L9647M9224j533L8088J9498M0908M9853J0929
14250C125796K6111L5224J4627L9623Q7258R8701P770L3845j4573M5P0064L6075
14238C560566r035M2000Q0427Q315K6558J6947N5674Q0205R8017M7027j4635K5608
14226D017674N5214L9141O4215M7652R324J544M6630R6762J4559p955L5017O7858
14214D487635J5122J02745J35047R0295N1206N6854L9631O0476P8842R2274P1102
$$ y = [2194607, 2163559, 2153735, 2161896, 2210324, 2245585, 2266427, 2293156, 2278186, 2295610, 2337575, 2339181, 2292139, 2270203, 2300694, 2350250, 2368902, 2426858, 2465251, 2514143, 2572885, 2603885, 2570289, 2573099, 2580125, 2618103, 2662426, 2632118, 2647016, 2644909, 2662773, 2690032, 2748490, 2746871, 2683451, 2744544, 2837953, 2880247, 2880338, 2879182, 2918829, 2968053, 2966520, 3004608, 3024106, 3065014, 3114867, 3125796, 3151907, 3187131, 3201758, 3241381, 3328639, 3427340, 3435110, 3468955, 3454382, 3454427, 3524491, 3560566, 3551531, 3593531, 3673958, 3682273, 3708831, 3725778, 3781452, 3861657, 3959674, 4006701, 3992066, 4017674, 4072888, 4112029, 4176244, 4223896, 4233220, 4234764, 4281394, 4378156, 4392715, 4384760, 4419777, 4487635, 4502757, 4605502, 4740549, 4830844, 4882050, 4938904, 4978535, 5039011, 5117853, 5210127, 5281229]
14203E281229O0482Q6721P1506J19677J08666O6966J3072O8182J29504P0871N1672
14192F128548J35881Q8862N7063L1807R6752J45410R6774P6597N8173Q9329J52767
14181G157963J16485Q1613J11455J33714R9199J13307Q8882P6149J93610J43030
14171H315407J58279R2222J32252R2431R5226J30230J62305J87633J69443K13390
14161I748818K28475J33419J01929J77128J76236J98645J94998J46859J56542
14152A1263049J80566J86199K54143K65478J94672J75358J90793L34740K80150
14143A3325148K39007K38553K29983K76209K63934L23332L01334K64152K60424
14134A5722076L16985L38813L44915L24367L05396L59967L59910L49658M29421
$$ y = [5281229, 5341711, 5428432, 5499938, 5619615, 5728281, 5795247, 5808319, 5876501, 6006005, 6076876, 6128548, 6264429, 6353291, 6410354, 6442161, 6538913, 6684323, 6781097, 6857694, 6915867, 7005196, 7157963, 7274448, 7356061, 7467516, 7601230, 7700429, 7813736, 7902618, 7978767, 8172377, 8315407, 8473686, 8565908, 8698160, 8790591, 8885817, 9016047, 9178352, 9365985, 9535428, 9748818, 9977293, 10110712, 10212641, 10389769, 10566005, 10764650, 10959648, 11106507, 11263049, 11443615, 11629814, 11883957, 12149435, 12344107, 12519465, 12710258, 13044998, 13325148, 13564155, 13802708, 14032691, 14308900, 14572834, 14896166, 15197500, 15461652, 15722076, 16039061, 16377874, 16722789, 17047156, 17352552, 17712519, 18072429, 18422087, 18851508]
14125A8851508L85682L40293M22022M63370M30270M29038M67896M76635M53249
14116B2719963N56810N85654M99401M84878N39571N69376N94196N79424O01930
14107B7731203O22175N86884O56357P01589P15656P68583P49796P26577P49524
14098C4008344P20337P38208P74399Q42517Q07944Q58845Q16875Q87303Q57412
14089D1312184Q94131R16245Q90485R31252Q97174Q72488R29567R04835Q95407
14080D9443768R00638R00457R26777Q97808Q15176Q11902P58183P70599P78096
14071E7003404P47946O97157O65008N74724O01102N12000M29457L80797L69327
14062F1980922L53553K67807K13873J18387O4323Q088r6861j41591j23955k09164
$$ y = [18851508, 19237190, 19577483, 19999505, 20462875, 20893145, 21322183, 21790079, 22266714, 22719963, 23276773, 23862427, 24361828, 24846706, 25386277, 25955653, 26549849, 27129273, 27731203, 28353378, 28940262, 29596619, 30298208, 31013864, 31782447, 32532243, 33258820, 34008344, 34728681, 35466889, 36241288, 37083805, 37891749, 38750594, 39567469, 40454772, 41312184, 42206315, 43122560, 44013045, 44944297, 45841471, 46713959, 47643526, 48548361, 49443768, 50344406, 51244863, 52171640, 53069448, 53884624, 54696526, 55454709, 56225308, 57003404, 57751350, 58448507, 59113515, 59688239, 60289341, 60801341, 61230798, 61611595, 61980922, 62334475, 62602282, 62816155, 62934542, 62998865, 63006953, 62910092, 62768501, 62644546, 62435382]
14052F2435382l55544m13540l97444m10069m44524n04119n83510o19662o81637
14043E8025333o84198q25596p48221p27028q26731q34597q36391q57331q97662
14034E0787578r58216r23747q88923q80181r04130r35071r04605q30509q42193
14025D2720003q59178q27138q81835q56633q49946q50013q24160q14023p65217
14016C5191860p34662p54633o91377p24782p21242o94203p16058o77835o40321
14007B8836747n79212n65814n57572n77649o00387o18139n19377n13389n02212
13998B3802996m57775n15565n35973m46435m16612m41505m48751l82973l60469
13989A9796938l89499l75558m05938l92978l66385l76671l38587l02669l76441
$$ y = [62435382, 62079838, 61666298, 61268854, 60858785, 60414261, 59910142, 59326632, 58706970, 58025333, 57341135, 56515539, 55767318, 55040290, 54213559, 53378962, 52542571, 51685240, 50787578, 49829362, 48905615, 48016692, 47136511, 46232381, 45297310, 44392705, 43562196, 42720003, 41860825, 41033687, 40151852, 39295219, 38445273, 37595260, 36771100, 35957077, 35191860, 34457198, 33702565, 33011188, 32286406, 31565164, 30870961, 30154903, 29477068, 28836747, 28257535, 27691721, 27134149, 26556500, 25956113, 25337974, 24818597, 24305208, 23802996, 23345221, 22829656, 22293683, 21847248, 21430636, 20989131, 20540380, 20157407, 19796938, 19407439, 19031881, 18625943, 18232965, 17866580, 17489909, 17151322, 16848653, 16472212]
13980A6472212l54659l26078l16850k86234k54825k48851k38430k44398k65537
13971A3936350k73972k45348k84017k17466k66560k44287j77503j90763k03093
13962A1833341j71867k05558j37017j41225k10627k08310j99737j92031j92579
13953A0174390j96175j51654j35228j19499j36834j32780j29783j56534j13613
13944H902290j41767j38560j21738j49936j19417j16597r1534j10058r5902j19297
13934G697484o8338j13551j35636j22118q5162p9906r0055j25101q4233p0458
13924F722926j25667j09543o4266j10319j14958q7751n6676q2567n2389j19724
13914E799066j01917m3712k029n7040o6913n7028j27176j05520r7576m1496K482
$$ y = [16472212, 16117553, 15791475, 15474625, 15188391, 14933566, 14684715, 14446285, 14201887, 13936350, 13662378, 13417030, 13133013, 12915547, 12648987, 12404700, 12227197, 12036434, 11833341, 11661474, 11455916, 11318899, 11177674, 10967047, 10758737, 10559000, 10366969, 10174390, 9978215, 9826561, 9691333, 9571834, 9435000, 9302220, 9172437, 9015903, 8902290, 8760523, 8621963, 8500225, 8350289, 8230872, 8114275, 8022741, 7912683, 7816781, 7697484, 7629146, 7515595, 7379959, 7257841, 7172679, 7092773, 7002718, 6877617, 6793384, 6722926, 6597259, 6487716, 6423450, 6313131, 6198173, 6110422, 6053746, 5971179, 5918790, 5799066, 5697149, 5653437, 5651408, 5594368, 5527455, 5470427, 5343251, 5237731, 5140155, 5098659, 5101141]
13903E101141l6728m0033p0192j02989m6023Q77k7428n7328l4359j22776j08319
13892D455843m5983k1583j3137q1138l3572l6783p8715m6903k4508j9806p5352
13881C978363j03577m0367O1479m1191l8298l6302p1859n3708j7044l1982k5194
13870C580320J4800l7385J8370n5907j39366o8340k230j1502q0785n6474j5377
13859C146124j2594n618m3541k1406j9035k2055n057q5215o2969L959k877m8616
13847B821100j9455K9486l2062q5560n4705J700Q072m3925r597l3127j9582k8408
13835B533937J9467L1961J2792n4982m8630r1989p7405j3404K029k0489J1603
13824B304890j7915j4800j6009L5790K4567J7075j8212l7094n2107k7176j4334
$$ y = [5101141, 5064413, 5024380, 4954188, 4851199, 4805176, 4806053, 4778625, 4721297, 4686938, 4564162, 4455843, 4409860, 4388277, 4375140, 4294002, 4260430, 4223647, 4144932, 4098029, 4073521, 4053715, 3978363, 3874786, 3834419, 3895898, 3854707, 3816409, 3780107, 3708248, 3654540, 3637496, 3605514, 3580320, 3595120, 3557735, 3576105, 3520198, 3380832, 3312492, 3310262, 3298760, 3217975, 3161501, 3146124, 3133530, 3127912, 3084371, 3062965, 3043930, 3021875, 3016818, 2931603, 2868634, 2872593, 2869716, 2821100, 2801645, 2831131, 2799069, 2713509, 2658804, 2660504, 2668576, 2624651, 2615054, 2581927, 2562345, 2533937, 2553404, 2585365, 2598157, 2543175, 2494545, 2402556, 2325151, 2311747, 2313776, 2293287, 2304890, 2286975, 2272175, 2256166, 2291956, 2316523, 2333598, 2315386, 2278292, 2226185, 2199009, 2184675]
13813B184675r705P213P555k4595l0934n2654m4197L9154L61o5332j6101l41P219
13800B002318l6540j1861l8370m0205M448k889l0268l7999n670J2937J6293p7274
13788A754920J0778O945k3044l8721L2402Q4491J10988J32345J81772K47852L29656
13777B830384K18810J24445l8424k77917l25507k85078k22895j91784q2763p189
13767A742082o4837p5853m6911Q094m9927o7195P701J3123K8787J5990K038l7273
13755A475819o809k2561l6454k0667q067j5428j2153l4879j5090M0082j770K2846
13743A364869N855m0756l3299L174M678n8344l9965J5404n4699K6782K7587l6486
13731A184800q81n170J0514M4030J2598k4683m2594q566o6351l359J403J8820
$$ y = [2184675, 2174970, 2182183, 2189738, 2165143, 2134209, 2081555, 2037358, 2076512, 2076873, 2011541, 1995440, 1995099, 2002318, 1965778, 1953917, 1915547, 1875342, 1879790, 1876901, 1846633, 1808634, 1802964, 1815901, 1832194, 1754920, 1765698, 1772643, 1749599, 1710878, 1743280, 1827771, 1938759, 2071104, 2252876, 2500728, 2830384, 3049194, 3173639, 3135215, 2857298, 2531791, 2246713, 2023818, 1832034, 1749271, 1742082, 1677245, 1601392, 1554481, 1562575, 1512648, 1445453, 1453154, 1466277, 1495064, 1511054, 1513092, 1475819, 1469010, 1446449, 1409995, 1389328, 1381261, 1365833, 1353680, 1318801, 1303711, 1343793, 1342023, 1364869, 1370724, 1329968, 1296669, 1299843, 1304521, 1246177, 1206212, 1221616, 1166917, 1193699, 1221286, 1184800, 1183919, 1178749, 1189263, 1233293, 1245891, 1221208, 1178614, 1170048, 1103697, 1100338, 1101741, 1120561]
13719A120561K2278m729O967m1726l3713p878O014M6726p273l1605j7409j2758
13707A045455L0772N753J9169O1162l0452p5449j5164K76r993k0040l7747r82
13695I72760m560L795L5071m542j0524J6536j2906K5441n652j2246m7277m0582
13683I15314J4524J9095j361K9498o0409o6921J8570L7681M9112k8910m756j6246
13671I05191j8698l5659l2707k7905L1009P0535J1726l5405K4607p999q7187k3721
13659G73787N9025L9246j2180l8184l3954J4322J4681l6782k4234K1817M5585
13648H23129k4580l4264M0j7900K0648j3909k5589J3113L377r792K0843J3421
13636G68537J7255j4424l4837J1967M201j5923n9348l9736j6140N4006M7623Q055
$$ y = [1120561, 1142839, 1138110, 1145077, 1103351, 1069638, 1061760, 1067774, 1114500, 1107227, 1075622, 1058213, 1045455, 1076227, 1081980, 1101149, 1162311, 1131859, 1056410, 1041246, 1041522, 1031529, 1011489, 973742, 972760, 968200, 971995, 1007066, 1002524, 992000, 1008536, 995630, 1021071, 1015419, 1003173, 955896, 915314, 929838, 948933, 947572, 977070, 916661, 849740, 868310, 905991, 955103, 926193, 921437, 905191, 886493, 850834, 818127, 790222, 821231, 891766, 903492, 868087, 892694, 884695, 797508, 773787, 832812, 872058, 859878, 821694, 787740, 802062, 816743, 779961, 755727, 777544, 823129, 798549, 764285, 764325, 746425, 767073, 753164, 727575, 740688, 744065, 734273, 755116, 768537, 785792, 771368, 736531, 748498, 752699, 736776, 677428, 637692, 621552, 675558, 723181, 731236]
13624G31236o946K1004k389o991k8276J1866J9699j9926L1735j7760M565n1228
13612F86589o3262k9633N201J843N0188J6648l7987k8435M885k42M995j5859K3319
13599F18250L0112M264L684R421j2425j5178K3352n7870j4400j4750p601K4285
13587E91144l11k736P503m0092k7679k5383J7603K1319o585k472K2844Q557K4100
13574E87812J851m233K381J7392j9808l4995p873m8321j6054j6843L33K9115l590
13561D87167Q384m855M360r863J0695L2787K9286N7435L0956o127l5849n7620
13549E46756o5984M416L7805j1174J4513n0759p267L3951l0M3097j113l143l2646
13536E08422l6595J6832J3417R730j2942q051k7993m6259r512K8147j627K1517
$$ y = [731236, 724290, 745294, 742905, 735914, 707638, 719504, 739203, 719277, 751012, 733252, 737817, 686589, 623327, 593694, 598895, 600738, 650926, 667574, 629587, 601152, 606037, 605795, 610790, 594931, 618250, 648362, 652626, 656310, 665731, 653306, 638128, 661480, 603610, 589210, 574460, 566859, 591144, 590833, 588097, 595600, 555508, 527829, 502446, 520049, 541368, 534783, 532311, 555155, 563712, 587812, 589663, 585430, 587811, 605203, 585395, 550400, 542527, 494206, 478152, 461309, 461642, 490757, 487167, 495551, 490696, 495056, 485193, 495888, 528675, 557961, 615396, 646352, 640225, 604376, 546756, 480772, 485188, 522993, 511819, 526332, 475573, 468306, 502257, 502227, 545324, 544211, 541068, 508422, 471827, 488659, 502076, 511806, 498864, 490813, 462820, 416561, 407049, 435196, 433569, 455086]
13524D55086o587j2834O668K3536q0165l5333M2385L6095j0227P857k5546l6073
13512C64862j2039K6907P90N785L7705J9801K0875L0475k035l9848k5436p244
13500D20598L1906L416J8038K4852L5241m0909j3296j3363k8208o3139J2716N7716
13488D45568m4918k6662k4872l620Q0161K0592j8013o1198m9223K2534J0969O107
13476C57425J1763J082K1986J4883p2255P753K9663O4476l9563p4224q871J2790
13464C26908R761L7223M2484j3214l3890n0194n0731j6889O9370O0346m363k3246
13452C53565k3528L9571J9158j9581k8825j8531L574K5294l0381n397J7281p274
13440C24926j0933l9358q056l374M5760Q4526k7651l0638k846M2054O1050J9457
$$ y = [455086, 448499, 435665, 442333, 465869, 385704, 350371, 392756, 428851, 418624, 426481, 400935, 364862, 352823, 379730, 380520, 386305, 424010, 443811, 464686, 495161, 493126, 453278, 427842, 420598, 452504, 455920, 473958, 498810, 534051, 493142, 479846, 466483, 438275, 375136, 387852, 445568, 400650, 373988, 349116, 345496, 425657, 446249, 428236, 367038, 317815, 340349, 351318, 357425, 369188, 370270, 392256, 407139, 334884, 342637, 372300, 436776, 397213, 322989, 314118, 326908, 336669, 373892, 416376, 403162, 369272, 319078, 268347, 251458, 320828, 381174, 376811, 353565, 330037, 369608, 388766, 369185, 340360, 321829, 325403, 350697, 320316, 314919, 332200, 324926, 313993, 274635, 266579, 263205, 308965, 393491, 365840, 335202, 332356, 374410, 435460, 454917]
13428D54917m7479o0761N463l0348L6522K1104j2699j2987k8597j1555l0672K1734
13416C04642N8150k1746J1942j2609L06m6431N0297P1825m017m5274n2894j8588
13404B95603o7216O93K6598O8206k9910o5829L2175P0481K020k7738k751k3184
13392B79148m0646M658K1478K5497J373q88j6182k0633P972k9411j7119j529N0710
13379B64428N3028K7902o543r515n6480l1854J0743P0782L0196l0372n9788J0454
13367B72981j9672j3452N2350j5199k0436N0997k6830P619J0598Q617p444l496
13355B96633k7587L0407N509m1000j1224l381k4892L5084m72k7139k1103M1472
13343B52307L0301m5060r919k1411j5404o059M0178J7044n738l0808l5936K9247
$$ y = [454917, 407438, 346677, 352140, 321792, 358314, 379418, 366719, 353732, 325135, 313580, 282908, 304642, 362792, 341046, 352988, 340379, 340685, 294254, 344551, 416376, 412359, 367085, 314191, 295603, 228387, 229080, 255678, 323884, 293974, 228145, 260320, 330801, 332821, 305083, 302332, 279148, 238502, 243160, 264638, 290135, 291508, 290620, 274438, 253805, 261777, 232366, 215247, 213718, 264428, 317456, 345358, 338815, 329300, 272820, 240966, 251709, 322491, 352687, 322315, 262527, 272981, 253309, 239857, 292207, 277008, 256572, 307569, 280739, 288358, 298956, 307573, 300129, 296633, 269046, 299453, 304962, 263962, 252738, 249357, 224465, 259549, 259077, 231938, 210835, 252307, 282608, 237548, 227629, 206218, 190814, 184755, 224933, 241977, 236239, 205431, 169495, 198742]
13331A98742O2783M7551k3484n2756j3687L9604K6235m6044n3111K4220N053O9594
13319B84700j9812k4564L0967m1905K2899J7526k5514l8720N5392J3841Q980j7770
13307B66020r189k1718L9387j3290n7458l2296j6036l3718K6659J4262k3930j325
13295A37368N3090J16364P4484n5828n8354l5713j3918j6297k682j0088k5852
13284A62574K7968O7736n165n8384n0462j0599J626k2154L4613K2589k155K380
13272A70567l792L941j3768j916P199L6354P2473N0635L0313n6916k9070o279
13260B59741k2555k2830K5058R660k3071k1709j6358q881J8733J8235j5663j0722
13248A89638L7220l9510l3696o353J2409K5297L519J6153J4541K5000M705o878
$$ y = [198742, 261525, 309076, 285592, 232836, 219149, 258753, 284988, 238944, 185833, 210053, 215106, 284700, 264888, 240324, 271291, 229386, 252285, 269811, 244297, 205577, 260969, 274810, 283790, 266020, 256831, 235113, 274500, 261210, 203752, 171456, 155420, 121702, 148361, 162623, 138693, 137368, 190458, 306822, 381306, 325478, 267124, 231411, 217493, 201196, 198514, 188426, 162574, 190542, 258278, 253113, 194729, 144267, 133668, 135294, 113140, 147753, 170342, 168187, 170567, 166775, 170716, 156948, 155032, 162231, 198585, 271058, 321693, 352006, 295090, 266020, 259741, 237186, 214356, 239414, 249074, 226003, 204294, 187936, 179055, 197788, 216023, 200360, 189638, 226858, 187348, 153652, 147299, 159708, 185005, 188524, 204677, 219218, 244218, 248923, 242045]
13236B42045J1969l4040l3913n2700O2N584L850N0365n9q780k1835J6344j8535
13223A60357j6712K5193R643k0684L2628K7197K8511J0005l8907j9711m0170J7730
13211A75080L905j8834k7592q312l454N179j3281M3201L0926R608Q553l4507J4970
13198A85442N2781N653R041l737J6807k2945l0155K7655m8167o0204J1080N5263
13186A98514k6664k2564o0765m3178J4786K9025M051k1350k236L1520M4367R16
13174A46422J5298k0976m411J2579k295O940k0682p8164j0931M2834K1842j7488
13162I0968k0864J0009M3970L9654L5213j7266l4728n4608n267l1143j7404r442
13150B9092k4050N7089Q3263L4355q2093J0995J3624k6077Q476j0457k5501K6265
$$ y = [242045, 254014, 219974, 186061, 133361, 133423, 139007, 142857, 193222, 193163, 184383, 162548, 178892, 160357, 143645, 168838, 178481, 157797, 190425, 217622, 246133, 256138, 217231, 197520, 157350, 175080, 178985, 160151, 132559, 124247, 120793, 125972, 112691, 155892, 186818, 196426, 204979, 170472, 185442, 238223, 243876, 252917, 249180, 265987, 243042, 212887, 240542, 192375, 132171, 143251, 198514, 171850, 149286, 88521, 45343, 60129, 89154, 93205, 71855, 69619, 101139, 145506, 146422, 161720, 140744, 136333, 148912, 146617, 153557, 132875, 54711, 43780, 86614, 108456, 90968, 70104, 80113, 124083, 163737, 198950, 181684, 146956, 92348, 87081, 55938, 38534, 29092, 5042, 62131, 145394, 179749, 97656, 108651, 122275, 96198, 104674, 94217, 68716, 94981]
13138I4981N0122J8499j9665K2367o296p4024k6917M4984R129N750K0086J0601
13126A49617N8033M6507p4932n6639j4589N771p897L8266K282l6939J7144L5200
13114A61824r062m7399p9229L572J7613l8388J9490O8187K2625Q737n94q87j7337
13101A09152J7209K9341O390j8101N5078N7249n0020n0448l0618K3998J5824j8783
13089A46271p408K9088k5938m5849K7178P762l0567l8770j2181O0130O6278J0364
13077A86358m6277j2032q397m076K0691l403j688L321P979J9075J5164J8216p64
13064A94167l4482p438K0831k2489q159m8059j5742j5375J4869L5062K9302m4681
13052I7806m591K1046k4189L3251J4070J1038k1639N316P9618K2880l9046k5728
$$ y = [94981, 145103, 163602, 143937, 166304, 160008, 85984, 59067, 104051, 113180, 118930, 139016, 149617, 207650, 254157, 179225, 122586, 107997, 113768, 105871, 144137, 146419, 109480, 126624, 161824, 152762, 105363, 26134, 29706, 47319, 8931, 28421, 96608, 119233, 127970, 127376, 126489, 109152, 126361, 155702, 162092, 143991, 199069, 256318, 206298, 155850, 125232, 149230, 165054, 146271, 138863, 167951, 142013, 96164, 123342, 131104, 100537, 61767, 49586, 109716, 175994, 186358, 140081, 128049, 119652, 115576, 136267, 132864, 131176, 134497, 142476, 161551, 176715, 194931, 194167, 159685, 152247, 173078, 150589, 142430, 94371, 78629, 63254, 78123, 113185, 142487, 97806, 93215, 114261, 90072, 123323, 137393, 148431, 126792, 132108, 211726, 234606, 195560, 169832]
13040A69832q7920P003K3295J283j2762l7244Q237j0737j8726N6461o343J2766
13028A05145M0186J0491K8978j6563p909k8524l2852J0158J8210K0580q610m9728
13016H9562Q105K4228k5584l3596k7778P013K9913N2131L9650O3052m8136K5769
13004B04329N2866k063k5465j820j9560m2531l3117l0851K4657k114j7446K1003
12992A27888K4615m135J1135K2663L9797k7799r736l1539L98L2545K184o6312
12980A21704q7061j0471M169l2854L6856O453k6153j2844M2334M4915Q1970L8847
12968B07865n5583j4345m1568j9681K3177N636M4825J8221k0984l5954M0221O1260
12956B13090N9999J9469J19n4276m2887M2320q4728j6252k5029l6248J0906J0157
$$ y = [169832, 81912, 88915, 112210, 113493, 100731, 63487, 71724, 60987, 42261, 98722, 92379, 105145, 145331, 155822, 184800, 168237, 160328, 131804, 98952, 109110, 127320, 147900, 139290, 89562, 97667, 121895, 96311, 62715, 34937, 41950, 71863, 123994, 163644, 226696, 178560, 204329, 257195, 255132, 229667, 227847, 208287, 165756, 132639, 101788, 126445, 124331, 106885, 127888, 152503, 148368, 159503, 182166, 221963, 194164, 184428, 152889, 153287, 185832, 188016, 121704, 34643, 24172, 28341, -4513, 32343, 38796, 12643, -201, 42133, 87048, 169018, 207865, 152282, 137937, 96369, 76688, 99865, 105501, 150326, 168547, 147563, 111609, 151830, 213090, 273089, 292558, 292677, 238401, 195514, 237834, 153106, 136854, 111825, 75577, 86483, 96640]
12944I6640k821L2895L2158l4959j7383K349l3367O012Q637N020K6434k0339m6733
12931E4543L1149K0002K4511k041m0101L5195m0729k1023M012j1378k8474P105
12919C2771L0322k352J1617Q9N5054q238J0781j789R887j7090j6182j8184j3855
12906G2831J4202K1223M0152K7939J9613m4989K2711J294o7797k6433k307j5935
12894F2504K4019J4602j242M588j6863l6066L4562K6412j9449k6316R209k3559
12882E2401R21j1261J8113L9377K7105L8079n9915K6031j5545k1679N163K4675
12870A23465q420j9110q011l9863l6032k9204P3081Q5232k2050o1506k1087j1238
12858B5257L0497o82j0994J9944J6772O463p41l7820L1125J4743k1481l8752j7930
$$ y = [96640, 93819, 126714, 158872, 123913, 106530, 108879, 75512, 81524, 90161, 95181, 121615, 101276, 54543, 85692, 105694, 130205, 128164, 88063, 123258, 82529, 61506, 65518, 54140, 25666, 32771, 63093, 60741, 72358, 72447, 127501, 119263, 130044, 128255, 138142, 121052, 104870, 86686, 72831, 87033, 108256, 148408, 176347, 195960, 150971, 173682, 174976, 107179, 80746, 78439, 62504, 86523, 101125, 99883, 104471, 87608, 51542, 86104, 112516, 93067, 66751, 75960, 52401, 53322, 42061, 60174, 99551, 126656, 164735, 104820, 130851, 115306, 93627, 98790, 123465, 115045, 95935, 87924, 48061, 12029, -17175, 55906, 141138, 119088, 57582, 36495, 25257, 55754, 55072, 44078, 64022, 80794, 87257, 86516, 48696, 79821, 94564, 73083, 34331, 16401]
12845A6401J1371L5846R2387l2654J408p241j4840m1632K1315L6268l8513n8290
12833B1826k9527J7769J5537J0036K56l3840o7255K5438L5013N7809R368l6892
12821B5538p760q106j7493m940k9157M5556k051J348p668p157j7391K4956K6019
12808B1694L1635J4346p442k6094q612N5522p023n366K4323L4621M8558l7115
12796A39047k9644k2015l8512R201k2561n2834l1718O7703L7791M551J5494L3381
12784A09884j4404j1167M4324Q398l4123m0330p07J5895j9964l7886J9416N7289
12772I6625K824m1427m0090k2346q480J7962N3025L151J5965k165K592P84J4803
12759I3223j69L4403L4650P1313L3768n0780k8992n2063o5418l2150n669J4045
$$ y = [16401, 27772, 63618, 156005, 123351, 124759, 117518, 102678, 61046, 82361, 118629, 80116, 21826, -7701, 10068, 25605, 35641, 35897, 2057, -65198, -39760, -4747, 53062, 62430, 25538, 17778, 9672, -7821, -12761, -41918, 3638, 1587, 2935, -4733, -11890, -29281, -4325, 21694, 53329, 67675, 60233, 34139, 25527, 81049, 74026, 68660, 92983, 127604, 176162, 139047, 109403, 87388, 48876, 58077, 35516, -17318, -49036, 18667, 56458, 61009, 76503, 109884, 95480, 84313, 128637, 137035, 102912, 62582, 61875, 77770, 57806, 19920, 39336, 96625, 99449, 58022, 17932, -4414, -12894, 5068, 58093, 61244, 77209, 75044, 77636, 78420, 93223, 93054, 127457, 162107, 233420, 267188, 216408, 187416, 135353, 69935, 37785, 32116, 46161]
12747D6161M886J3541L7125J9841j5662P541m198k3282k4816J1004L6998k8170
12735H0969o450L3011M87m65j2639k7323M757O1478L0509N4652j4293p2530k5859
12722A06304K1841K9128l6282O853n2634M411P5117k0363k1170P561n490l2221
12710H3055l6l6360L1177Q520N790Q040l4846o462o654j4529J2442l1699k4238
12697e800N6242M973M937o166o947q19N044R528M3289k0081m5426k5265k6062
12684a2553M7525j1480K299L3268O663j4527l399J2970l5771n517N9690N1868
12672A31036P265l4360m2184j7622q859k6633J5442k0788J2234K9145L8087O294
12660H9057M354o61k3674Q537r584K3656k1261N1888K104q8569k7933j4080K4597
$$ y = [46161, 51047, 64588, 101713, 121554, 105892, 113433, 109235, 85953, 61137, 72141, 109139, 80969, 74519, 107530, 108017, 107552, 94913, 67590, 72347, 133825, 164334, 218986, 204693, 132163, 106304, 128145, 157273, 120991, 127844, 75210, 79621, 154738, 134375, 113205, 120766, 115276, 83055, 83019, 46659, 77836, 86356, 92146, 100186, 65340, 58878, 52224, 37695, 50137, 18438, -5800, 50442, 55415, 60352, 54186, 47239, 46420, 51464, 60992, 104281, 84200, 38774, 13509, -12553, 34972, 23492, 25791, 59059, 65722, 51195, 47796, 60766, 24995, 19478, 79168, 131036, 138301, 103941, 61757, 44135, 35276, 8643, 24085, 3297, 15531, 44676, 82763, 89057, 93411, 92750, 69076, 77613, 68029, 91685, 70424, 122312, 124416, 35847, 7914, -6166, 18431]
12647A8431k5892m729j8191R051j7929L6650J8935M3669J7395J0362j6837n0832
12635B0083l969N0794K1593n9735q352M0846j8367k0842J0070N822J192K4361
12623F3496J5224M566N867L4288j7605l1407n3517l1317R103K7513K3504L1487
12611H1202K8540n8589J4652N43k576l3721L344K7650j8649L867Q239o43k4824
12598B9035j369k9569k2678L9107j2416p617M2043K7245o1127q7901k5878N9482
12586e1643L3424K3283N6624M8466l2602J8683K3231k3605r56j74J7568R839J8681
12573A40819R97m3138j5488j1552j1340K2954J9455p9215m6810k6770N4493N9109
12561F3514l449o731L0567M7488j6545q4993m3416M0907M9407q215k8500k5858
$$ y = [18431, -7461, -12190, -30381, -21330, -39259, -2609, 16326, 59995, 77390, 87752, 70915, 20083, 16114, 66908, 88501, 28766, 20414, 61260, 42893, 22051, 32121, 37943, 39135, 63496, 78720, 83286, 89153, 123441, 105836, 74429, 20912, -10405, -1302, 26211, 49715, 81202, 109742, 51153, 65805, 66348, 63772, 30051, 33395, 61045, 42396, 46263, 54502, 53859, 29035, 27666, -1903, -24581, 14526, 2110, -5507, 36536, 63781, 2654, -85247, -111125, -51643, -18219, 5064, 61688, 110154, 77552, 96235, 119466, 95861, 94905, 94731, 112299, 122138, 140819, 141816, 98678, 83190, 71638, 60298, 83252, 102707, 23492, -23318, -50088, 4405, 63514, 60065, 53334, 83901, 131389, 114844, 29851, -13565, 27342, 76749, 68534, 40034, 14176]
12549A4176J753Q920L5219j6980m9466M289J7777k0428m2267J1116J2082N9604
12537C5795M5919K3026n97m1725m8010k0759K1169J9155l9885k2585N193j5080
12525c8384K1958R4465L5465r030l6982m0613K2939K6771j3324k8702K0387k6156
$$ y = [14176, 15929, 24849, 60068, 43088, -6378, -2089, 15688, -4740, -47007, -35891, -23809, 35795, 81714, 104740, 104143, 62418, 14408, -6351, 14818, 33973, -5912, -28497, -23304, -38384, -16426, 78039, 113504, 104474, 67492, 26879, 49818, 76589, 63265, 34563, 54950, 28794]
$$ [...]
##END NTUPLES=NMR SPECTRUM
##END=
