##TITLE=Analysis number 313307
Compound Code spb 06834
Project Code adrs
Chemist Name fudan
##JCAMPDX= 6.0         $$ Bruker NMR JCAMP-DX V2.0
##DATA TYPE= NMR SPECTRUM
##DATA CLASS= NTUPLES
##ORIGIN= Bruker BioSpin GmbH
##OWNER= NMR
$$ XWIN-NMR		Version 3.5
$$ Fri Sep  2 12:08:31 2005 GMT Daylight Time (UT+1h)  MAYBRIDGE\NMR@NMR_250MHZ
##.OBSERVE FREQUENCY= 250.131544655141
##.OBSERVE NUCLEUS= ^1H
##.ACQUISITION MODE= SIMULTANEOUS (DQD)
##.ACQUISITION SCHEME= undefined
##.AVERAGES= 16
##.DIGITISER RES= 18
##SPECTROMETER/DATA SYSTEM= dpx250
##.PULSE SEQUENCE= zg30
##.SOLVENT NAME= CDCl3
##.SHIFT REFERENCE= (INTERNAL, CDCl3, 0, 16.522)
##AUDIT TRAIL= $$ (NUMBER, WHEN, WHO, WHERE, WHAT)
$$ ##TITLE= Audit trail, XWIN-NMR		Version 3.5
$$ ##JCAMPDX= 5.01
$$ ##ORIGIN= Bruker BioSpin GmbH
$$ ##OWNER= NMR
$$ C:\u/data/dgb/nmr/ADRS/8910/pdata/1/auditp.txt
$$ ##AUDIT TRAIL=  $$ (NUMBER, WHEN, WHO, WHERE, WHAT)
(   1,<2005-09-02 12:08:09.53 +100>,<MAYBRIDGE\NMR>,<NMR_250MHZ>,
      <created by zg, POWCHK disabled, PULCHK disabled
       configuration hash MD5:
       62 19 C7 07 E1 42 D1 B7 37 6C 3D D0 77 39 F9 E6
       data hash MD5: 64K
       48 D2 D6 75 98 B6 1D A0 31 8D 54 33 5F A1 67 5F>)
(   2,<2005-09-02 12:08:22.35 +100>,<MAYBRIDGE\NMR>,<NMR_250MHZ>,
      <Start of raw data processing
       ef LB = 0.3 FT_mod = 6 PKNL = 1 SI = 32K 
       data hash MD5: 32K
       13 6B CB 0C 75 5E 0D 75 5D FA DA 35 8E AA 20 55>)
(   3,<2005-09-02 12:08:24.02 +100>,<MAYBRIDGE\NMR>,<NMR_250MHZ>,
      <apk 
       data hash MD5: 32K
       59 35 C3 CC 82 47 CE 6B 9C DA A9 0A 51 7C EA BC>)
(   4,<2005-09-02 12:08:24.72 +100>,<MAYBRIDGE\NMR>,<NMR_250MHZ>,
      <abs ABSG = 5 
       data hash MD5: 32K
       28 F3 A6 89 66 E3 8F A7 21 8F E9 67 D2 82 52 88>)
$$ ##END=
$$ 
$$ hash MD5
$$ 4F 9D 27 87 D3 2F 6E D8 5E 0E 56 EF CC 90 9B B3
##$RELAX= 
##$RELAX= 
##$RELAX= 
##$RELAX= 
##$RELAX= 
##$RELAX= 
##$RELAX= 
$$ Bruker specific parameters
$$ --------------------------
##$DU= <C:\u>
##$EXPNO= 8910
##$NAME= <ADRS>
##$PROCNO= 1
##$TYPE= <nmr>
##$USER= <dgb>
##$AMP= (0..31)
100 100 100 100 100 100 100 100 100 100 100 100 100 100 100 100 100 100 
100 100 100 100 100 100 100 100 100 100 100 100 100 100 
##$AQSEQ= 0
##$AQ_mod= 3
##$AUNM= <au_zg>
##$AUTOPOS= <18 >
##$BF1= 250.13
##$BF2= 250.13
##$BF3= 250.13
##$BF4= 250.13
##$BF5= 500.13
##$BF6= 500.13
##$BF7= 500.13
##$BF8= 500.13
##$BYTORDA= 1
##$CFDGTYP= 0
##$CFRGTYP= 5
##$CHEMSTR= <none>
##$CNST= (0..31)
1 1 145 1 1 1 1 1 1 1 1 1 1 1 1 1 1 1 1 1 1 1 1 1 1 1 1 1 1 1 1 1 
##$CPDPRG= <>
##$CPDPRG1= <>
##$CPDPRG2= <>
##$CPDPRG3= <>
##$CPDPRG4= <mlev>
##$CPDPRG5= <mlev>
##$CPDPRG6= <mlev>
##$CPDPRG7= <mlev>
##$CPDPRG8= <mlev>
##$CPDPRGB= <>
##$CPDPRGT= <>
##$D= (0..31)
0 1 0 0 0 0 0 0 0 0.06 0 0 0 0 0 0 0.0002 0 0 0 0 0 0 0 0 0 0 0 0 0 0 
0 
##$DATE= 1125659288
##$DBL= (0..7)
120 120 120 120 120 120 120 120 
##$DBP= (0..7)
150 150 150 150 150 150 150 150 
##$DBP07= 0
##$DBPNAM0= <>
##$DBPNAM1= <>
##$DBPNAM2= <>
$$ [...]
##$SUBNAM7= <"">
##$SUBNAM8= <"">
##$SUBNAM9= <"">
##$SW= 20.6930455092707
##$SWIBOX= (0..15)
0 0 3 0 0 0 0 0 0 0 0 0 0 0 0 0 
##$SW_h= 5175.983436853
##$TD= 65536
##$TD0= 1
##$TE= 295.16
##$TE2= 300
##$TE3= 300
##$TEG= 300
##$TL= (0..7)
0 120 120 120 120 120 120 120 
##$TP= (0..7)
150 150 150 150 150 150 150 150 
##$TP07= 0
##$TPNAME0= <>
##$TPNAME1= <>
##$TPNAME2= <>
##$TPNAME3= <>
##$TPNAME4= <>
##$TPNAME5= <>
##$TPNAME6= <>
##$TPNAME7= <>
##$TPOAL= (0..7)
0.5 0.5 0.5 0.5 0.5 0.5 0.5 0.5 
##$TPOFFS= (0..7)
0 0 0 0 0 0 0 0 
##$TUNHIN= 0
##$TUNHOUT= 0
##$TUNXOUT= 0
##$USERA1= <user>
##$USERA2= <user>
##$USERA3= <user>
##$USERA4= <user>
##$USERA5= <user>
##$V9= 5
##$VALIST= <valist>
##$VCLIST= <CCCCCCCCCCCCCCC>
##$VD= 0
##$VDLIST= <DDDDDDDDDDDDDDD>
##$VPLIST= <PPPPPPPPPPPPPPP>
##$VTLIST= <TTTTTTTTTTTTTTT>
##$WBST= 1024
##$WBSW= 4
##$XGAIN= (0..3)
0 0 0 0 
##$XL= 0
##$YL= 0
##$YMAX_a= 497076
##$YMIN_a= -521715
##$ZGOPTNS= <>
##$ZL1= 120
##$ZL2= 120
##$ZL3= 120
##$ZL4= 120
##$ABSF1= 16.522
##$ABSF2= -4.171173
##$ABSG= 5
##$ABSL= 3
##$ALPHA= 0
##$AQORDER= 0
##$ASSFAC= 0
##$ASSFACI= 0
##$ASSFACX= 0
##$ASSWID= 0
##$AUNMP= <proc_1d>
##$AZFE= 0.1
##$AZFW= 0.1
##$BCFW= 0
##$BC_mod= 0
##$BYTORDP= 0
##$COROFFS= 0
##$CY= 12.5
##$DATMOD= 1
##$DC= 0
##$DFILT= <>
##$DTYPP= 0
##$F1P= 14.0000005364418
##$F2P= -0.99999901652339
##$FCOR= 0.5
##$FTSIZE= 32768
##$FT_mod= 6
##$GAMMA= 0
##$GB= 0
##$INTBC= 1
##$INTSCL= 1
##$ISEN= 128
##$LB= 0.3
##$LEV0= 0
##$LPBIN= 0
##$MAXI= 10000
##$MC2= 0
##$MEAN= 0
##$ME_mod= 0
##$MI= 0
##$NCOEF= 0
##$NC_proc= -3
##$NLEV= 6
##$NOISF1= 0
##$NOISF2= 0
##$NSP= 0
##$NTH_PI= 0
##$NZP= 0
##$OFFSET= 16.522
##$PC= 1
##$PHC0= -76.5432
##$PHC1= 4.229646
##$PH_mod= 1
##$PKNL= yes
##$PPARMOD= 0
##$PSCAL= 4
##$PSIGN= 0
##$REVERSE= no
##$SF= 250.13
##$SI= 32768
##$SIGF1= 0
##$SIGF2= 0
##$SINO= 400
##$SIOLD= 32768
##$SREGLST= <1H.CDCl3>
##$SSB= 0
##$STSI= 32768
##$STSR= 0
##$SW_p= 5175.98343685301
##$SYMM= 0
##$S_DEV= 0
##$TDeff= 65536
##$TDoff= 0
##$TI= <Analysis number 999999
Compound Code 99
Book Reference 9
Project Code 9>
##$TILT= no
##$TM1= 0
##$TM2= 0
##$TOPLEV= 0
##$USERP1= <user>
##$USERP2= <user>
##$USERP3= <user>
##$USERP4= <user>
##$USERP5= <user>
##$WDW= 1
##$XDIM= 32768
##$YMAX_p= 376815297
##$YMIN_p= -154920
$$ End of Bruker specific parameters
$$ ---------------------------------
##NTUPLES= NMR SPECTRUM
##VAR_NAME=  FREQUENCY,     SPECTRUM/REAL,   SPECTRUM/IMAG
##SYMBOL=    X,             R,               I
##VAR_TYPE=  INDEPENDENT,   DEPENDENT,       DEPENDENT
##VAR_FORM=  AFFN,          ASDF,            ASDF
##VAR_DIM=   32768,         32768,           32768
##UNITS=     HZ,            ARBITRARY UNITS, ARBITRARY UNITS
##FACTOR=    0.157963299565203, 1,           1
##FIRST=     4132.6476996994, 0,             0
##LAST=      -1043.33573715361, 0,           0
##MIN=       -1043.33573715361, -154920,     0
##MAX=       4132.6476996994, 376815297,     0
$$ Real data points
##PAGE= N=1
##DATA TABLE= (X++(R..R)), XYDATA
$$ [...]
##PAGE= N=2
##DATA TABLE= (X++(I..I)), XYDATA
25419E76920o490J109J514m617l298N653N851p965l230j593K690r173k476j103
$$ 576920 570430 571539 573053 568436 565138 570791 576642 568677 565447 563854 566544 557371 554895 553792
25405E53792K608P064P461L12j303j0004o89K6864R714n275n196r734N194K717
$$ 553792 556400 563464 570925 571237 569934 559930 559241 586105 595819 590544 585348 575614 580808 583525
25391E83525o033p239j0154J2417J646j1728Q05R363k88j6279o43p50j76Q838
$$ 583525 577492 570253 560099 572516 574162 562434 563239 572602 572314 556035 555392 554642 554466 563304
25377E63304L010P813j253p061p299n556M436q843p618J2492K4362l195j4401
$$ 563304 566314 574127 572874 565813 558514 552958 557394 548551 540933 553425 577787 574592 560191
25364E60191m08J1410q332N242J1972r664n378Q741q785l924p320M584j867r045
$$ 560191 559783 571193 562861 568103 580075 570411 565033 573774 564989 561065 553745 558329 556462 547417
25350E47417O75j871M42K312J9586J7844p562j6976m161J0268O633p77k35K644
$$ 547417 548092 546221 546663 548975 568561 586405 578843 561867 557706 567974 574607 573830 573595 576239
25336E76239K908o358l233M976J750j076n985k287Q68J2622J1266N017K70l560
$$ 576239 579147 572789 569556 574532 576282 575206 569221 566934 567802 580424 591690 596707 596977 593417
25322E93417q352l755J611m244o900J3215o291p433p943J6440o604j4592j1415
$$ 593417 585065 581310 582921 578677 571777 584992 578701 571268 563325 579765 573161 558569 547154
25309E47154p485Q086N579J1046l545Q960M836q481k061P556k365m520O030J0034
$$ 547154 539669 547755 553334 564380 560835 569795 574631 566150 564089 571645 569280 564760 570790 580824
25295E80824M204j514O054j0145j2141P697P99l513j141r3J2238O118r609o075
$$ 580824 585028 583514 589568 579423 567282 574979 575778 572265 571124 571031 583269 589387 579778 573703
25281E73703O449m594q878l533K073M134j2370L17n41J6632R457j270r435P477
$$ 573703 580152 575558 566680 563147 565220 569354 556984 557301 556760 573392 582849 581579 572144 579621
25267E79621J5881p884k34Q79o650M833j1412l07o161j1700O73j438J3100J3707
$$ 579621 595502 587618 587384 588263 581613 586446 575034 574727 568566 556866 557539 556101 569201 582908
25253E82908j274J3550k072M148n855m204r43K758j217r457N238r92p267k925
$$ 582908 581634 595184 593112 597260 591405 587201 586258 589016 587799 578342 583580 582588 575321 572396
25239E72396k940P470K056K055j945R804N929l278j2511j583J803k1709j0931
$$ 572396 569456 576926 578982 581037 579092 588896 594825 591547 579036 577453 579256 557547 546616
25226E46616L216J865K595J5676K4709P105j0501p188r067K028O799N092q343
$$ 546616 549832 551697 554292 569968 594677 601782 591281 584093 575026 577054 583853 588945 580602
25213E80602r886l413j768L259j714K093l631J3j2639P028J6966J0384j330o939
$$ 580602 570716 567303 565535 568794 567080 569173 565542 565555 552916 559944 576910 587294 585964 579025
25199E79025j4618r673J60N410J6321R866j6755m249J2023j2690j8297J1700Q157
$$ 579025 564407 554734 554894 560304 576625 586491 569736 565487 577510 564820 546523 558223 566380
25186E66380J3382p58j6656o30Q461P476Q772J88j275M481L543k410n702o422
$$ 566380 579762 579004 562348 561718 570179 577655 586427 586615 585340 589821 593364 590954 585252 578830
25172E78830r532o05K705k291J6413J9872M478j2302r074q742k6513o084L944
$$ 578830 569298 568693 571398 569107 585520 605392 609870 597568 588494 579752 553239 547155 551099
25159E51099M127l634J349N057L548J4926J1251Q82Q995J241k3562j8465l704
$$ 551099 555226 551592 552941 557998 561546 576472 587723 588605 597600 598841 575279 556814 553110
25146E53110M127J7173Q635Q600o24j034j0946q904Q53J0951j318l352o468m653
$$ 553110 557237 574410 583045 591645 591021 589987 579041 570137 570990 581941 580623 577271 570803 566150
25132E66150o087l570J1120P218J75K54J523N886J725o64q265K674J94N56J556
$$ 566150 560063 556493 567613 574831 575006 575260 576783 582669 584394 583730 575465 578139 578333 578889 580445
25117E80445Q037R455n503J42j1067j9534K123K377K1403J4902q867l843m712
$$ 580445 588482 597937 592434 592576 581509 561975 564098 566475 587878 602780 593913 590070 585358
25104E85358P561J3419o422j6828L152L72r384j1801p372J2641N758k169L954
$$ 585358 592919 606338 599916 583088 586240 586612 577228 565427 558055 570696 576454 574285 578239
25091E78239p256Q70J1884O296l221J776q98J287Q394L603n456q469J761k926
$$ 578239 570983 571853 583737 590033 586812 588588 587690 588977 597371 600974 595518 587049 588810 585884
25077E85884L30Q908q527j1608N030K391M046K741O177N762j0616j0217O214K22
$$ 585884 586214 595122 586595 574987 580017 582408 586454 589195 595372 601134 590518 580301 586515 586737
25063E86737p856j369k012N705P744O050J2362n201j6864j3849k372m311j985
$$ 586737 578881 577512 575500 581205 588949 594999 607361 602160 585296 571447 569075 564764 562779
25050E62779K2952O036j6226K152J0329Q746J92N575n90j8178m236K580R673q661
$$ 562779 585731 591767 575541 577693 588022 596768 596960 602535 601945 583767 579531 582111 591784 583123
25036E83123n525N384O869J451R167Q838j1109k275P497K521k294m712n610P861
$$ 583123 577598 582982 589851 591302 600469 609307 598198 595923 603420 605941 603647 598935 593325 601186
25022F01186P281q10q756j6939J683J24N613J298J929J2325p108n277j2427j0269
$$ 601186 608467 607657 598901 581962 583645 583769 589382 590680 592609 604934 597826 592549 580122 569853
25008E69853j185j0452N619k389O426J6213O274R222Q747K474n05j3820j6087
$$ 569853 568668 558216 563835 561446 567872 584085 590359 599581 608328 610802 610297 596477 580390
24995E80390Q008M04n994J454N850n358L160j542O994J073j419m245j0491j627
$$ 580390 588398 588802 582808 584262 590112 584754 587914 586372 593366 594439 593020 588775 578284 576657
24981E76657l10L782q448J062J2429K1233M251p002n174j6992R797J0363J4305
$$ 576657 576347 580129 571681 572743 585172 606405 610656 603654 598480 581488 591285 601648 615953
24968F15953j44L73q101j0225K095o903n36N163J3922m794L33P073j0017n459
$$ 615953 615809 616182 608081 597856 599951 593048 592512 597675 611597 606803 607136 614209 604192 598733
24954E98733P174M789p178j3257Q070O946k812j7555l847J4094Q667p825m943
$$ 598733 605907 610696 603518 590261 598331 605277 602465 584910 581063 595157 603824 595999 591056
24941E91056k573J3862P229k543p398o873L002P111O77J351L73M419l380m888
$$ 591056 588483 602345 609574 607031 599633 592760 595762 602873 603550 604901 605274 609693 606313 601425
24927F01425l943J307Q902m36m209j1109l471o896k247k313n483N929R673j36
$$ 601425 597482 598789 607691 607255 603046 591937 588466 581570 579323 577010 571527 577456 587129 586993
24913E86993q533K810Q374L527J378j550N432J4357M404j1208p065n349J239q01
$$ 586993 578460 581270 589644 593171 594549 592999 598431 612788 617192 605984 598919 593570 594809 594008
24899E94008m255O913K914j530K254o152m594m84M70o199J659P131M680r789J5144
$$ 594008 589753 596666 599580 598050 600304 594152 589558 589074 589544 583345 585004 592135 596815 587026 602170
24884F02170M811l378q8j098R95L454j514j1939O259j1973j5677M925J0191M295
$$ 602170 606981 603603 603515 602417 603412 606866 605352 593413 599672 587699 572022 576947 587138 591433
24870E91433j932p252P325O6L006J784J3704J2756q47j0275r329J577j088k812
$$ 591433 589501 582249 589574 589640 592646 594430 608134 620890 620043 609768 600439 602016 600928 598116
24856E98116J7165K842j1063p302l115O704J0466n163k3496n210N606O892M200
$$ 598116 615281 618123 607060 599758 596643 603347 613813 608650 585154 579944 585550 592442 596642
24843E96642M159P481j796J189j700J758L175m13k174K536J0262L254p26p851
$$ 596642 600801 608282 606486 607675 605975 607733 610908 610495 608321 610857 621119 624373 623647 615796
24829F15796l330P695P950l813K195l044k1632l816J341j7194j2876N762R158
$$ 615796 612466 620161 628111 624298 626493 623449 601817 598001 599342 582148 569272 575034 584192
24816E84192N870L674R952O785j1015j4100n895j690Q53J2044o441J327K490Q102
$$ 584192 590062 593736 603688 610473 599458 585358 579463 577773 578626 590670 584229 585556 588046 596148
24802E96148Q385J604k47Q611M616j8085j6009j824J723n64K530M066Q886J319
$$ 596148 604533 606137 605890 614501 619117 601032 585023 583199 584922 584358 586888 590954 599840 601159
24788F01159J0042J1098p238p072K603K701m671m243o861l362J528O792L25N989
$$ 601159 611201 622299 615061 607989 610592 613293 608622 604379 597518 594156 595684 602476 602801 608790
24774F08790K904n731l368M614J722J596o596j733l869J356J2097J044j1616k108
$$ 608790 611694 605963 602595 607209 608931 610527 603931 602198 598329 599685 611782 612826 601210 599102
24760E99102m892k688K6443p214p28l53O783K526N487J255m940K65l746p357K134
$$ 599102 594210 591522 617965 610751 610023 609670 616453 618979 624466 625721 620781 621046 617300 609943 612077
24745F12077n239p132J518L919J1116J1690k727j5122j727j430K017m263r91O143
$$ 612077 606838 599706 601224 605143 616259 627949 625222 610100 608373 606943 608960 604697 603706 609849
24731F09849j610j262O728N106R99q209q260m518J6467J0153l875j0537j3342
$$ 609849 608239 606977 613705 618811 619810 611601 603341 598823 615290 625443 621568 611031 597689
24718E97689n740j746K1186M747j534J077m540j0331j2476k580L594j393O217
$$ 597689 591949 590203 611389 616136 614602 615679 611139 600808 588332 585752 589346 587953 594170
24705E94170J2258J2282k168r841L709J0698K647m120J34l835m177J024L785k536
$$ 594170 606428 618710 616542 606701 610410 621108 623755 619635 619769 615934 611757 612781 616566 614030
24691F14030q319m180Q810q229k84l710M957N419o055l609M205K577j9162l555
$$ 614030 605711 601531 610341 602112 601828 598118 603075 608494 602439 598830 603035 605612 586450 582895
24677E82895O578N472K0730J9485O089j2171r387J307M30m424r696j2687R208
$$ 582895 589473 594945 615675 635160 641249 629078 619691 620998 621428 617004 607308 594621 603829
24664F03829J0228J0266J1309L388R708K467o102L688n970q623K666K212n658
$$ 603829 614057 624323 635632 639020 648728 651195 645093 648781 642811 634188 636854 639066 633408
24651F33408j039r349r935p9M710P872k190k5653j6992N10J4000K888K3146J7612
$$ 633408 632369 623020 613085 613006 617716 625588 623398 597745 580753 581263 595263 598151 621297 638909
24637F38909r485r020j0417j7353j254N957O038J1952l381o945L937m25Q316L302
$$ 638909 629424 620404 609987 592634 591380 597337 603375 615327 611946 605001 608938 608513 616829 620131
24623F20131K210o201j1109J3498K2656J0564j2225j3532m370J1780P136j291
$$ 620131 622341 616140 605031 618529 641185 651749 639524 625992 621622 633402 640538 639247
24611F39247Q431q028j8089M928j5906M797o57K011O198o713m058O811p987k995
$$ 639247 647678 639650 621561 626489 610583 615380 614723 616734 622932 616219 612161 618972 610985 607990
24597F07990o785J2446J865n660m077M235j2474m027J975J7454P215m987k18P104
$$ 607990 601205 613651 615516 609856 605779 610014 597540 593513 595488 612942 620157 615170 614952 622056
24583F22056K18r666n517l220J5653O450n704J4532J3667j2843k4204r830J4175
$$ 622056 622274 612608 607091 603871 619524 625974 620270 634802 648469 635626 611422 601592 615767
24570F15767J3187r684r326L170k462j4750J372k225K774O930K1538R593n337
$$ 615767 628954 619270 609944 613114 610652 595902 597274 595049 597823 604753 626291 635884 630547
24557F30547q708L301L872r39j026J87j3766q424M04k637O896n403P156p823r932
$$ 630547 621839 625140 629012 628073 627047 627234 613468 605044 605448 602811 609707 604304 611460 603637 593705
24542E93705j487L875Q510J9526p699k032P044K561n382P17Q52L111j10j091j1960
$$ 593705 592218 596093 604603 624129 616430 614398 621442 624003 618621 619338 620190 623301 623191 622100 610140
24527F10140j3865J945K190j818M241J1751P700m086J0317J0827K846n766m785
$$ 610140 596275 598220 600410 598592 602833 614584 622284 618198 628515 639342 642188 636422 631637
24514F31637n10r834j475N865O078K48k803j5405m936J5368P858M37L180o717
$$ 631637 631127 621293 619818 625683 631761 632009 629206 613801 608865 624233 632091 632528 635708 628991
24500F28991j069J2671p12q261M496j1277p775J080L181J276J1385j305j2242
$$ 628991 627922 640593 639881 631620 636116 624839 617064 618144 621325 622601 633986 632681 620439
24487F20439L328J2293K946j4045J20k085l434J2240K462L890K946O423j3811
$$ 620439 623767 636060 639006 624961 625081 622996 619562 631802 634264 638154 641100 647523 633712
24474F33712q683M187m170j43P338J1963l603j5979J1065O350M705N909m767l264
$$ 633712 625029 629216 625046 624903 632241 644204 640601 624622 635687 642037 646742 652651 647884 644620
24460F44620J3373K425n472l220k496m331n530N453N999M08j4229q038j4561J669
$$ 644620 657993 660418 654946 651726 649230 644899 639369 644822 650821 651229 637000 628962 614401 616070
24446F16070J1697O687n435O163p31m861K185p726J1682N048k145r791j5812n337
$$ 616070 627767 634454 629019 635182 634451 629590 631775 624049 635731 640779 638634 628843 613031 607694
24432F07694P04O330J1626j259K51J5133j129L771j272j0339o776l460K626R226
$$ 607694 608398 614728 626354 625095 625346 640479 639350 643121 641849 631510 624734 621274 623900 633126
24418F33126J1858M394l492o578j0234O790J0722K959j0765m632j93K025q943
$$ 633126 644984 649378 645886 639308 629074 635864 646586 649545 638780 634148 633955 635980 627037
24405F27037j0359J7063L194j5585j166O048m321J06P986N982l62J005M330J840
$$ 627037 616678 633741 636935 621350 620184 626232 621911 622017 630003 635985 635623 636628 640958 642798
24391F42798M902m330j4703N321J3734q225o201l80n09P968R58K714j69n231M8
$$ 642798 647700 643370 628667 633988 647722 639497 633296 632916 632407 640375 641333 644047 643878 638647 638695
24376F38695K063o686j5171J0546p682n51J0117o23k965R95m736r477M674J7233
$$ 638695 640758 634072 618901 629447 621765 621214 631331 630708 627743 628738 624002 614525 619199 636432
24362F36432l253M532K999M535j383n14o260J5541M724n127j3318m621O867j2683
$$ 636432 633179 637711 640710 645245 643862 643348 637088 652629 657353 652226 638908 634287 641154 628471
24348F28471j6069O319J4580m723L536M999Q367K285N835J0841p012j0619q369
$$ 628471 612402 618721 633301 628578 632114 637113 645480 647765 653600 664441 657429 646810 638441
24335F38441l686j527J4049k687j1610l906J0363l100J130K28j2314K61N03n767
$$ 638441 634755 633228 647277 644590 632980 629074 639437 636337 637467 637695 625381 625642 626145 620378
24321F20378O765Q080K229L563R473R769j1433j5766J1757J749q753P147K0485
$$ 620378 627143 635223 637452 641015 650488 660257 648824 633058 644815 646564 637811 644958 665443
24308F65443m911o997J283L318L976q487q384m608J0675p252m300j077o038l075
$$ 665443 660532 653535 654818 658136 662112 653625 645241 640633 651308 644056 639756 638679 632641 629566
24294F29566j930j974n457J233J2190r61k02K335j40J5774J4557K171p769j5940
$$ 629566 627636 625662 620205 621438 633628 632667 632465 634800 634660 650434 664991 667162 659393 643453
24280F43453K501R37o457l667N860J2749J3141j5329L458j1033r756o177L330
$$ 643453 645954 646891 640434 636767 642627 655376 668517 653188 656646 645613 635857 629680 633010
24267F33010k037m579M202J8692J3389R6l735n38l580Q947p010j023L750j990
$$ 633010 630973 626394 630596 649288 662677 662773 659038 658500 654920 663867 656857 655834 659584 657594
24253F57594Q378J4099p476j8918j2913j95J0788j134L218n711l8l857L830J4561
$$ 657594 665972 680071 672595 653677 640764 640569 651357 650223 653441 647730 647692 643835 647665 662226
24239F62226M056N444o464j1421j2527p922q286J1146J2794L786R283q586n177
$$ 662226 666282 671726 665262 653841 641314 633392 625106 636252 649046 652832 662115 653529 648352
24226F48352r744N565p442K712o333J1235K2104l959o329j0222j1036R003M438
$$ 648352 638608 644173 636731 639443 633110 644345 666449 662490 656161 645939 634903 643906 648344
24213F48344o03J1572p298l585J32P960k020J2040J3598j4355o582O524j1724
$$ 648344 647741 659313 652015 648430 648562 656522 654502 666542 680140 665785 659203 665727 654003
24200F54003r850J600M754N075j598N450p84P385j44j1670m738o500o044P902
$$ 654003 644153 645753 650507 655582 653984 659434 658650 666035 665891 654221 649483 642983 636939 644841
24186F44841Q550l29p924q452j0140J223J3160K296J1037k777o85n519J28O244
$$ 644841 653391 653062 645138 636686 626546 627769 640929 643225 654262 651485 650800 645281 645409 651653
24172F51653K4q320j539J2734N84n97j636J7072P365p308r642l70j198p104j1980
$$ 651653 651677 643357 641818 654552 655136 654539 652903 669975 677340 670032 660390 660020 658822 651718 639738
24157F39738K585O48N74R217N312p87O467P017j0607m51n129o133o657P593M778
$$ 639738 642323 642971 643545 652762 658074 657287 663754 670771 660164 659713 654584 648451 641794 649387 654165
24142F54165k0562j1788N895P968r679K433L517J234k5J2769j1032j703J7437
$$ 654165 633603 621815 627710 635678 625999 628432 631949 633183 633158 645927 634895 633192 650629
24129F50629K484J311J412j1661J070R035P792J7385n921r57j5165k388K059J1052
$$ 650629 653113 654424 655836 644175 645245 654280 662072 679457 673536 672579 657414 655026 657085 668137
24115F68137Q878n747o935k6244j0375R439R117N559p4J419R49L675J3285n20
$$ 668137 677015 671268 664333 638089 627714 637153 646270 651829 651755 653174 654123 657798 671083 670563
24101F70563j1647p386N041K995q034r550o703J320N434K751n69N819J1890J79
$$ 670563 658916 651530 656571 659566 651532 641982 635279 636599 642033 644784 644215 650034 661924 662103
24087F62103p189j403N048J555P94K65j4609k102J7036J2786J350j2705j7902
$$ 662103 654914 653511 658559 660114 660908 661173 646564 644462 661498 674284 675634 662929 645027
24074F45027Q417J2170K917j822k1401o507p25N73M053M267M680j1517O001R275
$$ 645027 653444 665614 668531 666709 645308 638801 638076 638649 642702 646969 651649 640132 646133 655408
24060F55408p303J5209N868o446j511R094l99m104o823L121n722P78O490J4501
$$ 655408 648105 663314 669182 662736 661225 670319 669920 665816 658993 662114 656392 657170 663660 678161
24046F78161M453j0192r268q861q38k350K418J1872O885O704O95J27m454p387
$$ 678161 682614 672422 663154 654293 653455 651105 653523 665395 672280 678984 679679 679806 675352 667965
24032F67965M149l404j044k24l868m142R227q90q209p775j1921L86J0079k257
$$ 667965 672114 668710 667666 667442 663574 659432 668659 667769 659560 651785 639864 640250 650329 648072
24018F48072J3350K425J0050l741J2339r572k7415J167J8225Q153j3143m445L127
$$ 648072 661422 663847 673897 670156 682495 672923 645508 646675 664900 673053 659910 655465 658592
24005F58592O776P574O617L873O648j0761j3939M370j0845n372J0948Q081N064
$$ 658592 665368 672942 679559 683432 690080 679319 665380 669750 658905 653533 664481 672562 677626
23992F77626K8n322L564N549J119r729q329N692J2697P50j644j0051q558R14R808
$$ 677626 677654 672332 675896 681445 682564 672835 664506 670198 682895 683645 682001 671950 663392 664306 674114
23977F74114r66J5238K013n955p099O686p061j5776m304R256J2628K089J881j1383
$$ 674114 673148 688386 690399 684444 677345 684031 676970 661194 656890 666146 678774 680863 682744 671361
23963F71361r185K923j819j3796m973R409N598M20J963M794J564%l299J1132N504
$$ 671361 662176 665099 663280 649484 644511 653920 659518 659938 661901 666695 668259 668259 664960 676092 681596
23948F81596r282j0824Q448R476M149r980q56Q219l214m454R887q66n48R77j901
$$ 681596 672314 661490 669938 679414 683563 673583 672727 680946 677732 673278 683165 682299 681751 682728 680827
23933F80827m023O0J503K004R65j2118p798o052n450K16R290K3298L239q623o651
$$ 680827 676804 676864 678367 680371 681336 669218 661420 655368 649918 650134 659424 682722 685961 677338 670687
23918F70687R006J0205j0532j862K461o966P624l210p93r515R208l159o765J4485
$$ 670687 679693 689898 679366 677504 679965 672999 680623 677413 676620 667105 676313 673154 666389 680874
23904F80874r496J0984J3496l378k434l591q654R783l745q60K163R20q705k227
$$ 680874 671378 682362 695858 692480 690046 686455 677801 687584 683839 682979 685142 686062 677357 675130
23890F75130J375P765j049P875l860n968P170P881J3631L188k4150j5442l712
$$ 675130 676505 684270 683221 691096 687236 681268 688438 696319 709950 713138 688988 673546 669834
23877F69834n516j711J0669K1472N091j2461j7962p279o589R400J2098j1313o489
$$ 669834 664318 662607 673276 694748 699839 687378 669416 662137 655548 664948 677046 665733 659244
23864F59244o64j223M824J0999Q004m480m502kj555j7564j0249M421K1690K142
$$ 659244 658580 657357 662181 673180 681184 676704 672202 672200 670645 653081 642832 647253 668943 671085
23850F71085P834L882J1143n304m565Q066k452k870M196Q88m477p932P78J3555
$$ 671085 678919 682801 693944 688640 684075 692141 689689 686819 691015 691903 687426 679494 680272 693827
23836F93827Q100Q20L75p697p608R117J7875m711j7078n923L614J6736M152j2761
$$ 693827 701927 702747 703122 695425 687817 696934 714809 710098 693020 687097 690711 707447 711599 698838
23822F98838j6694q26M366P625j736j3200r637N814J4088J7332L046n978p272
$$ 698838 682144 681318 685684 693309 691573 678373 668736 674550 688638 705970 709016 703038 695766
23809F95766m343P339p563r664Q665K427nm892n736l945O387N426l432j1690l645
$$ 695766 691423 698762 691199 681535 690200 692627 692622 687730 681994 678049 684436 689862 686430 674740 671095
23794F71095J1076J6845J0697j382j7680j2217r517k084R564j1681L442N783k57
$$ 671095 682171 699016 709713 708331 690651 678434 668917 666833 676397 664716 668158 673941 673684
23781F73684l004J0514O779o358M266k521J355O609J752j6337J0403K3651q520
$$ 673684 670680 681194 687973 681615 685881 683360 684715 691324 693076 676739 687142 710793 702273
23768G02273j5550K56p04q863l337j1464O952J2058K769M124j567j877r260J5391
$$ 702273 686723 686979 686275 677412 674075 662611 669563 681621 684390 688514 686947 685070 675810 691201
23754F91201O577Q46M281j4154p78K490m291n309J0631N485l483q932k528l508
$$ 691201 697778 698624 702905 688751 687973 690463 686172 680863 691494 696979 693496 684564 682036 678528
23740F78528P19M560k408Q37j55q406j120M347Q066M633j2308O56R378p86R267
$$ 678528 679247 683807 681399 682236 682081 673675 672555 676902 684968 689601 677293 677949 687327 686541 695808
23725F95808N766l040O828j3364n723M974K473n47P684K409l255j863O506J0161
$$ 695808 701574 698534 705362 691998 686275 691249 693722 693175 700859 703268 700013 698150 704656 714817
23711G14817j8542J3138K440j573J141j2767q048o325J0230r696j24J686l273
$$ 714817 696275 709413 711853 710280 711421 698654 690606 684281 694511 684815 684691 686377 683104
23698F83104J703L474N084L459k953L972P364R046M246p236n417J31L550n655
$$ 683104 684807 688281 693365 696824 693871 697843 705207 714253 718499 711263 705846 705977 709527 703872
23684G03872r943p068R652K963q959r846M319J0461J4066Q240J3000r198j6439
$$ 703872 693929 686861 696513 699476 690517 680671 684990 695451 709517 717757 730757 721559 705120
23671G05120p636K802R084L357N012m612p427j610L688n790J03l89K680J988J2324
$$ 705120 697484 700286 709370 712727 717739 713127 705700 704090 707778 701988 702091 701702 704382 706370 718694
23656G18694K407o435J0144K776o93m908q636q035n780l090N478M782l550r128
$$ 718694 721101 714666 724810 727586 726893 721985 713349 705314 699534 696444 701922 706704 703154 694026
23642F94026M216p3n77K002J921K850Q904J4713N85j7950Q910R101O73p416k747
$$ 694026 698242 698169 697592 699594 701515 704365 713269 727982 728567 710617 719527 728628 729301 721885 719138
23627G19138j4949q607J71M181Q175j43K954J0464j5045j4466k358J3945P678
$$ 719138 704189 695582 695753 699934 708109 707966 710920 721384 706339 691873 689515 703460 711138
23614G11138n812j343J126K056K943N80J84o588K677J540o263m131k878M052o527
$$ 711138 705326 703983 705109 707165 710108 710688 710872 704284 706961 708501 702238 698107 695229 699281 692754
23599F92754M500J2198p162Q650Q586m353N70l983q913r607P189J6019J3866l966
$$ 692754 697254 709452 702290 710940 719526 715173 715743 711760 702847 693240 700429 716448 730314 726348
23585G26348j4761j2568O90J0859N418n058o524k764O469M784k666j3129q25J1709
$$ 726348 711587 699019 699709 710568 715986 710928 704404 701640 708109 712893 710227 697098 696273 707982
23571G07982o718j5088q396R198J3436J1380L398o488j6914j3774L331K1385J4479
$$ 707982 701264 686176 677780 686978 700414 711794 715192 708704 691790 678016 681347 702732 717211
23558G17211J4361j006j0907j0824j237j0235m96J1711j4223L655k243P966Q127
$$ 717211 731572 730566 719659 708835 707598 697363 696867 708578 694355 698010 695767 703733 711860
23545G11860j777m430q19J471k359L042n912J924k532J1604m541q988L02k918
$$ 711860 710083 705653 704834 706305 703946 706988 701076 703000 700468 712072 707531 698543 698845 695927
23531F95927O452J7536j153j1866l384O706L233M590j1905P022J1677K595j4193
$$ 695927 702379 719915 718762 706896 703512 710218 713451 718041 706136 713158 724835 727430 713237
23518G13237j2736J6626J7219k897j3232r056J960j268n781L943l175L431L277
$$ 713237 700501 717127 734346 731449 718217 709161 711121 709853 704072 708015 704840 708271 711548
23505G11548P785L74l057N591N421P998J031r367n591k5121J0J1842J5329m04
$$ 711548 719333 719707 716650 722241 727662 735660 736691 727324 721733 696612 696622 708464 723793 723389
23491G23389K692J2937j1284j1048q72k967m911n643L780J832m397l860M355q24
$$ 723389 726081 739018 727734 716686 715814 712847 707936 702293 706073 707905 703508 699648 704003 703179
23477G03179n904l200m156p488Q262J4352J7083j389L541L648O325p164K216n190
$$ 703179 697275 694075 689919 682431 690693 705045 722128 720739 724280 727928 734253 727089 729305 724115
23463G24115r90k747m339J5382l880O623J4521K620l596m193q293M232l50r329
$$ 724115 723125 720378 716039 731421 727541 734164 748685 751305 747709 743516 735223 739455 739105 729776
23449G29776J940M713L322j134q608o593n391R03R756P117j557q644j2378J168
$$ 729776 731716 736429 739751 738617 730009 723416 718025 718928 728684 735801 734244 725600 713222 714390
23435G14390P968R89M749L518J2496j580j9791r073K2522O670N194K1792K552
$$ 714390 722358 723347 728096 731614 744110 742530 722739 713666 736188 742858 748052 769844 772396
23422G72396j4160j9486m464o31j1985Q76j151L298Q890J365m900O02N309L989
$$ 772396 758236 738750 734286 733655 721670 722546 721395 724693 733583 734948 730048 730650 735959 739948
23408G39948p647j9625P295J819n70J7476r27j6513l517L509L110J700j4232O284
$$ 739948 732301 712676 719971 721790 721220 738696 737769 721256 717739 721248 724358 726058 711826 718110
23394G18110J8176Q79n557j771j7006o031L857P197O850J1651k846k204n061K566
$$ 718110 736286 737165 731608 729837 712831 706800 710657 717854 724704 736355 733509 731305 726244 728810
23380G28810r49o462j6860m132R164J7546Q595l227J1718j1513r451L016q661
$$ 728810 727861 721399 704539 700407 709571 727117 735712 732485 744203 732690 723239 726255 717594
23367G17594Q055j834J800r800o003Q42O971M951Q15K79K151J5435L217L431L55
$$ 717594 725649 723815 725615 715815 709812 710654 717625 722576 723391 723670 725821 741256 744473 747904 748259
23352G48259M719q485n888m114l371J272j206J848P08Q975J1052M728m316l634
$$ 748259 752978 744493 738605 734491 731120 732392 731186 733034 733742 742717 753769 758497 754181 750547
23338G50547k1187J628P914Q198r48P13m636p288l912L464J2369p999j738J0889
$$ 750547 729360 730988 738902 747100 746152 746865 742229 734941 731029 734493 746862 738863 737125 748014
23324G48014Q084o104m227o562r83n061r089L345L66j1576J1160Q710L803R838
$$ 748014 756098 749994 745767 739205 738222 733161 724072 727417 727783 716207 727367 736077 739880 749718
23310G49718l263j1256j490j4368m539K1584M941r631L461K769M64l840J1479
$$ 749718 746455 735199 733709 719341 714802 736386 741327 731696 735157 737926 738390 734550 746029
23297G46029J4187p313j1786r838O66K318n097m571R301J8939j1190j2024K39
$$ 746029 760216 752903 741117 731279 731945 734263 729166 724595 733896 752835 741645 729621 729860
23284G29860L144L058n728M557L245J083r909N398M929J980R369L813o586R015
$$ 729860 733004 736062 730334 734891 738136 739219 729310 734708 739637 741617 750986 754799 748213 757228
23270G57228N380m060j4704m11k983J1068J4175j1225M453j165K743N486j2493
$$ 757228 762608 758548 743844 743433 740450 751518 765693 754468 758921 757756 760499 765985 753492
23257G53492r704J1255L16j5178k5981N404l122L874P921R529J0169k119K684
$$ 753492 743788 755043 755359 740181 714200 719604 716482 720356 728277 737806 747975 745856 748540
23244G48540R707N473j3639j3594l46L647N718n91R145J0371j019j5781l346p104
$$ 748540 758247 763720 750081 736487 736141 739788 745506 744915 754060 764431 763412 747631 744285 737181
23230G37181j271R674J0863K346P145N44p075k665j4529j207K84P817J6748j732
$$ 737181 735910 745584 756447 758793 765938 766482 759407 756742 742213 741006 741290 749107 765855 764123
23216G64123j623j1680k399M741k765l60L845O163j0437j3053J737Q587K3061
$$ 764123 762500 750820 748421 753162 750397 750037 753882 760045 749608 736555 738292 746879 769940
23203G69940K197p678r668j8416oJ6846J6823L068o097q330q722j440l768K006
$$ 769940 772137 764459 754791 736375 736369 753215 770038 773106 767009 758679 749957 748517 744749 746755
23189G46755k964O472J0563k134J951j0620n350m285J9978P832q756J084K902
$$ 746755 743791 750263 760826 758692 760643 750023 744673 740388 760366 768198 759442 760526 763428
23176G63428R685R014n434o338K565n085r68q33L590q80j1983L74N309O225O355
$$ 763428 773113 782127 776693 770355 772920 767835 766867 766034 769624 768744 756761 757135 762444 768669 775024
23161G75024k31j5732k877L356l644p59J446N71k403Q569L321J368j180r751j8931
$$ 775024 774793 759061 756184 759540 755896 755137 756583 757154 754751 763320 766641 768009 766829 757078 738147
23146G38147k715N527l311J634J7073o565k98J6607J2965l316Q143q236j1649
$$ 738147 735432 740959 737648 739282 756355 749790 749492 766099 779064 775748 783891 775655 764006
23133G64006N101p63j87k25j7922J581O415J6389Q419K233j224m773l895j2266
$$ 764006 769107 768344 768157 767932 750010 751591 758006 774395 782814 785047 783823 779050 775155 762889
23119G62889M59p064j1359P070P941Q164N950j0436j195O068q024L00J6800J4558
$$ 762889 763348 756284 744925 751995 759936 768100 774050 763614 762419 768487 760463 760763 777563 792121
23105G92121Q832j2038j5102j1664m173M569o66O834m008j5511k104J807j463
$$ 792121 800953 788915 773813 762149 757976 762545 761879 768713 764705 749194 747090 748897 747434
23092G47434J1515J4425K694j7679M71J4634m484j6586o077Q445O762L246k126
$$ 747434 758949 773374 776068 758389 758860 773494 769010 752424 746347 754792 761554 764800 762674
23079G62674N708j0356M70J1297R198j4612m295n975o057O643J5117q97n060o035
$$ 762674 768382 758026 758496 769793 778991 764379 760084 754109 748052 754695 769812 768915 763855 757820
23065G57820J0768l707r656m759n147m931N340R901J9647J8630j4611r209m887
$$ 757820 768588 764881 755225 750466 745319 740388 745728 755629 775276 793906 779295 770086 765199
23052G65199l453p009P574O846N933o68p776M656n180n318O192N420j5148M579
$$ 765199 761746 754737 762311 769157 775090 774422 766646 771302 766122 760804 766996 772416 757268 761847
23038G61847P802j054M025L883Q544j711n776P953j0821j3640J749Q007m338p731
$$ 761847 769649 768595 772620 776503 785047 783336 777560 785513 774692 761052 762801 770808 766470 758739
23024G58739R436M714j3725j1332O695J6797J3966Q356m083n458o777j78O873
$$ 758739 768175 772889 759164 747832 754527 771324 785290 793646 789563 784105 777328 777150 784023
23011G84023J2171l890j1581K34R131j2904K4Q786l174P07O605Q88o896J2133
$$ 784023 796194 792304 780723 780957 790088 777184 777208 785994 782820 783527 790132 791020 784124 796257
22997G96257R894j5660j1475j2227j983m511m22Q722J3666J0035o311l678M169
$$ 796257 806151 790491 779016 766789 764806 760295 759873 768595 782261 792296 785985 782307 786476
22984G86476J762j797q633N221J1689N845L49L536r35K80o577j0981j8005L085
$$ 786476 788238 786441 777808 783029 794718 800563 800912 804448 803513 803793 797216 786235 768230 771315
22970G71315M893J4032R094o852r694K22N564K428m389K61r573o32N08l656l854
$$ 771315 776208 790240 799334 792482 782788 783010 788574 791002 786613 786874 777301 776669 777177 773521 769667
22955G69667P147k923J0791Q125j704O743m862n382m161q37L040Q963M545J496
$$ 769667 776814 773891 784682 792807 791103 797846 792984 787602 783441 782604 785644 794607 799152 800648
22941H00648k0387p600P376j222N682K071k4090n111Q889P600Q596P655N253l685
$$ 800648 780261 772661 780037 778815 784497 786568 762478 757367 766256 773856 782452 790107 795360 791675
22927G91675l628j8393K595N126J795Q007j291r069Q22M496O935J1865k598l198
$$ 791675 788047 769654 772249 777375 779170 787177 785886 776817 777639 782135 789070 800935 798337 795139
22913G95139k733M693l4J099l30j2998L961O766K937k982L40P029M808j551K88
$$ 795139 792406 797099 797065 798164 797834 784836 788797 795563 798500 795518 795858 802887 807695 806144 806432
22898H06432l42k759J523M943j4147j8411J0416O782m969J2739J132j1775J1092
$$ 806432 806090 803331 804854 809797 795650 777239 787655 794437 789468 802207 803339 791564 802656
22885H02656O903n913k083M738k022R70n869o499r133N559J2170m011n3r191K150
$$ 802656 809559 803646 801563 806301 804279 805249 799380 792881 783748 789307 801477 797466 797413 788222 790372
22870G90372k800M663j2819J434P311q001M839M538R252M038q506n319k798n284
$$ 790372 787572 792235 779416 780850 788161 780160 784999 789537 798789 802827 794321 789002 786204 780920
22856G80920P371O380J5770J270j2313o232J0492R448O246m607l346r123q68O026
$$ 780920 788291 794671 810441 811711 799398 793166 803658 813106 819352 814745 811399 802276 801408 807434
22842H07434q411q329j645L869O979L026n274l540J1785O273k250J659K106O848
$$ 807434 799023 790694 789049 792918 799897 802923 797649 794109 805894 812167 809917 811576 813682 820530
22828H20530J3608J274q422n086j4793p141P863Q769j0885j045n34l411l180Q930
$$ 820530 834138 835412 826990 821904 807111 799970 807833 816602 805717 804672 804138 800727 797547 806477
22814H06477L507L757J2131p290q283l407M31r143J2322J7448L023j1565M578
$$ 806477 809984 813741 825872 818582 810299 806892 807323 798180 810502 827950 830973 819408 823986
22801H23986M300k313J697R612P45j4300j1520L432j097n876J634m858n651j833
$$ 823986 828286 825973 827670 837282 838027 823727 812207 815639 814542 808666 810300 805442 799791 797958
22787G97958Q97n737M180J3782Q970R481j165j2628l929J0724P82p120n57m676
$$ 797958 798855 793118 797298 811080 820050 829531 828366 815738 811809 822533 823315 816195 815638 810962
22773H10962j5428j228J9572J1191k803q542l800J7271p769l225N62K117o812
$$ 810962 795534 794306 813878 825069 822266 813724 809924 827195 819426 816201 816763 818880 812068
22760H12068k339p66J0627n165o285R228Q14p225k491P866r284Q452M484j87p774
$$ 812068 809729 808963 819590 814425 808140 817368 818182 810957 808466 816332 807048 815500 819984 819797 812023
22745H12023j2862n037j403J836l426j1971R953K0040J3676K393L891J4410K407
$$ 812023 799161 794124 792721 794557 791131 779160 789113 809153 822829 825222 829113 843523 845930
22732H45930k745J4416K26L142J7732k429k3483l5466o686J1630p046o117m748
$$ 845930 843185 857601 857827 860969 878701 876272 852789 817323 810637 822267 815221 809104 804356
22719H04356o746J157J8312K3987J0925L24l247j6496J887n701m330j3395j1003
$$ 804356 797610 798767 817079 841066 851991 852315 849068 832572 834459 828758 824428 811033 800030
22706H00030Q314N814Q695J0049O119p139j0541P34N772N371l454Q179n768k421
$$ 800030 808344 814158 822853 832902 839021 831882 821341 822075 827847 833218 829764 837943 832175 829754
22692H29754K47M257P202J891k297L490n282p321M60J0737K645L1N670J393N344
$$ 829754 830001 834258 841460 843351 841054 844544 839262 831941 832401 843138 845783 845814 851484 852877 858221
22677H58221o859m387j4460q879N550M962O622q762r424j314O572j0682p279J466
$$ 858221 851362 846975 832515 823636 829186 834148 840770 832008 822584 821270 827842 817160 809881 811347
22663H11347J5718J5612j77j4558n229p035k036l818P349P128J787J657Q311n
$$ 811347 827065 842677 842500 827942 822713 815678 813642 809824 817173 824301 826088 827745 836056 836051
22649H36051m498L838J0192J842o656L153K970n758l556j556j3661m104O413J277
$$ 836051 831553 835391 845583 847425 840769 843922 846892 841134 837578 836022 822361 818257 824670 825947
22635H25947J484J2560r018p94M924N627p72l967m617M99J353J2374J2542O487
$$ 825947 827431 839991 830973 830179 835103 840730 839958 835991 831374 831873 833226 845600 858142 864629
22621H64629j4497j7022j818Q770Q871m987j2216j6014m368k406J4485M851r296
$$ 864629 850132 833110 831292 840062 848933 843946 831730 815716 811348 808942 823427 828278 818982
22608H18982P213O800q460r15J3091N796P647k848n440j823R995j415r249K843
$$ 818982 826195 832995 824535 823620 836711 842507 850154 847306 841866 840043 850038 848623 839374 842217
22594H42217N786k178Q90L702j820N75M391J800j1205j7880N877J4343m568m986
$$ 842217 848003 845825 846715 850417 848597 849172 853563 855363 844158 826278 832155 846498 841930 836944
22580H36944L857n63K094P083L00m639j3131J481J7342j647q033l950K346o638
$$ 836944 840801 840238 842332 849415 849715 845076 831945 833426 850768 849121 841088 837138 839484 832846
22566H32846j0573K877P44l168J1354M256J3950Q691P395J222j2993q384k174
$$ 832846 822273 825150 825894 822726 834080 838336 852286 860977 868372 869594 856601 848217 846043
22553H46043r414N04R028n440K565j849r748M936R552J2506p688n559Q343R711
$$ 846043 836629 837133 846161 840721 843286 841437 831689 836625 846177 858683 850995 845436 853779 863490
22539H63490k153p041M229O501j1524O002K101r188j6916p410p339P741P315k551
$$ 863490 861337 854296 858525 865026 853502 859504 861605 852417 835501 828091 820752 828493 835808 833257
22525H33257M009K647O977N908Q834l777o545q066n33P014o67q916k988J0064
$$ 833257 837266 839913 846890 852798 861632 857855 851310 843244 842711 849725 849058 840142 837154 847218
22511H47218K0841o658p93Q658M785m008K387r351M725J0404J0632J414p874k3857
$$ 847218 868059 861401 860608 869266 874051 870043 872430 863079 867804 878208 888840 890254 882380 858523
22497H58523j5587Q093K831k492j079p91J1533L005o389j1092j549N870k24P59
$$ 858523 842936 851029 853860 851368 850289 849498 861031 864036 857647 846555 845006 850876 850652 851411
22483H51411N262l720n574N875J9390P494k766j8178r855M687Q390R244J2587
$$ 851411 856673 852953 847379 853254 872644 880138 877372 859194 849339 854026 862416 871660 884247
22470H84247K683r940n72j822L465n179o164j0896M42J2936O737J4998M58j4389
$$ 884247 886930 876990 876418 874596 878061 872882 866718 855822 856264 869200 875937 890935 891393 877004
22456H77004p907j02j319J169R367O844k466l807q715r547K135l99M107q394l273
$$ 877004 869097 868995 867676 868845 878212 885056 882590 878783 870068 860521 862656 862257 866364 857970 854697
22441H54697j345O695k631n603J4459Q48j748K342j144O605P338m812K712J34
$$ 854697 853352 860047 857416 851813 866272 867120 865372 867714 866570 873175 880513 875701 878413 878547
22427H78547p341M959K294M452o224J282K766j347Q040M248j557q240j1916q844
$$ 878547 871206 876165 878459 882911 876687 877969 880735 879388 887428 891676 890119 881879 869963 861119
22413H61119N718Q73J1508P476l450k678j1384j8473J119J3907O244j203P103
$$ 861119 866837 867710 879218 886694 883244 880566 869182 850709 851828 865735 871979 870776 877879
22400H77879k631K351N153r34P343j0862N630p79k459j7574K418L00K135k724
$$ 877879 875248 877599 882752 881818 889161 878299 883929 883150 880691 863117 865535 865835 867970 865246
22386H65246j923m979k37J2286k263J1219R353k1305l474J1739m71J251L130l930
$$ 865246 863323 858344 858107 870393 868130 879349 888702 867397 863923 875662 875191 876442 879572 875642
22372H75642J0170R622K994l97o883l700m149M596J0351m595n418l757k315J159
$$ 875642 885812 895434 898428 898031 891148 887448 883299 887895 898246 893651 888233 884476 882161 883320
22358H83320j578j3519j1368L691J2598L963j342N215J1029J4249n898p024j077
$$ 883320 881742 868223 856855 860546 873144 877107 875765 880980 892009 906258 900360 893336 892259
22345H92259l087k679N257K077j3063r779J2437O289Q110m15j1794o060Q972l940
$$ 892259 889172 886493 891750 893827 880764 870985 883422 889711 897821 897406 885612 879552 888524 884584
22331H84584j4885J8248q924k1534l499J2587K0435j633P210N162P224o56M275
$$ 884584 869699 887947 879023 857489 853990 866577 887012 885379 892589 897751 904975 904319 908594
22318I08594k227J1989n008k4715O928n148j585K0499J7109M02j4788j5022p13
$$ 908594 906367 918356 913348 888633 895561 890413 888828 909327 926436 926838 912050 897028 896315
22305H96315L014r150N805P078P561j7667K734R175m37q493K329P813o026Q999
$$ 896315 899329 890179 895984 903062 910623 892956 895690 904865 904428 895935 898264 906077 900051 909050
22291I09050Q940L9j274k852J4065O52r702j6628p340j061J808L316j0458m532
$$ 909050 917990 918029 916755 913903 927968 928620 918918 902290 894950 893889 895697 899013 888555 884023
22277H84023R880K0331k831l476j574j156j844K907j0178o295k646M967K459J3030
$$ 884023 893903 914234 911403 907927 906353 905197 903353 906260 896082 889787 887141 892108 894567 907597
22263I07597M126L292j3619j14N840L836J5318O100j81o673J371l031l194J1646
$$ 907597 911723 915015 901396 901282 907122 910958 926276 932376 932195 925522 926893 923862 920668 932314
22249I32314N17p701r484J938O549P032j2809j0220j246n687M849O228k050j5472
$$ 932314 932831 925130 915646 917584 924133 931165 918356 908136 906890 901203 906052 912280 910230 894758
22235H94758m343n24M149J5358M121o960J79J149l3m067m152R217j006J88K837
$$ 894758 890415 889891 894040 909398 913519 906559 906738 907887 907854 903787 899635 908852 907846 908034 910871
22220I10871L62p669n990m02P895P758l179K068J823K062K905J4292L204J955
$$ 910871 911233 903564 897574 897172 905067 912825 909646 911714 913537 915599 918504 932796 936000 937955
22206I37955L500m038n629p602Q778l806n999o113K007j4069k964P694P573q279
$$ 937955 941455 937417 931788 924186 932964 929158 923159 917046 919053 904984 902020 909714 917287 909008
22192I09008J2548L584p677m398r85K230N008m828n309K397N035J564M395o057
$$ 909008 921556 925140 917463 913065 912080 914310 919318 914490 909181 911578 916613 918177 922572 916515
22178I16515L235P122J448o348L615O0k6p844M37R291J2782R937n867q135j3219
$$ 916515 919750 926872 928320 921972 925587 925647 925621 917777 918214 927505 940287 950224 944357 936222 923003
22163I23003q036J3118l956M50J3078M817n057j1605M237q61k63k680J2690M091
$$ 923003 914967 928085 924129 924579 937657 942474 937417 925812 930049 929188 928925 926245 938935 943026
22149I43026o429m802q443j050N049l791m200m426P518j028J2286m560k651J404
$$ 943026 936597 931795 923352 922302 927351 923560 919360 914934 922452 921424 933710 929150 926499 927903
22135I27903R217m08o300r918j408J2577m433N01K829K667q191K350K138m751
$$ 927903 937120 936712 930412 920494 919086 931663 927230 927731 930560 933227 925036 927386 929524 924773
22121I24773R45n477m644M266J4956J0150J058n007L333p433l814O560r526P159
$$ 924773 925718 920241 915597 919863 934819 944969 946027 941020 944353 936920 933106 939666 930140 937299
22107I37299J0657J4885J764q800j6713k4914N701J2739J1384l687N661J4056
$$ 937299 947956 962841 964605 955805 939092 914178 919879 932618 944002 940315 945976 960032
22095I60032j24j6117q543R139l019n652m096J561N509R574P863l532p578j423
$$ 960032 959908 943791 935248 944387 941368 935716 931620 933181 938690 948264 956127 952595 945017 943594
22081I43594P041N556J2464j725n252L359l285j453j3673P199p927l984J4632
$$ 943594 950635 956191 968655 966930 961678 965037 961752 960299 946626 953825 945898 941914 956546
22068I56546J9835m666p489k122p303k983o357j0092P527N397p496K611o721M093
$$ 956546 976381 971715 964226 962104 954801 951818 945461 935369 942896 948293 940797 943408 936687 940780
22054I40780J5579R990m380l8K721n476n262P40P685L363N126j776K419j868j9533
$$ 940780 956359 966349 961969 961931 964652 959176 953914 954654 962339 965702 970828 969052 971471 969603 950070
22039I50070m767P820N525L972q546m33O738M458K38P350R613J305q968r172R274
$$ 950070 945303 953123 958648 962620 954074 953641 960379 964837 965075 972425 982038 983343 974375 965203 974477
22024I74477R467o208k1293J1097K110p497K621P505m33m937j705M216O794q663
$$ 974477 983944 977736 956443 967540 969650 962153 964774 972279 971846 966909 965204 969420 976214 967551
22010I67551k609J1085j0087m142K753M451O005l177l787P041l873N776K687J163
$$ 967551 964942 976027 965940 961798 964551 969002 975007 971830 968043 975084 971211 976987 979674 980837
21996I80837R279J688j4622o589J602P952O471L823r064n290R704l013l917j053
$$ 980837 990116 991804 977182 970593 972195 980147 986618 990441 981377 976087 985791 982778 978861 977808
21982I77808j4683j423L430J4501j232j8816M130P080J466J7357L401n313k3180
$$ 977808 963125 961702 965132 979633 978401 959585 963715 970795 972261 989618 993019 987706 964526
21969I64526m985O785J2134L800K986j014m631q161J266m62k031L962N430j610
$$ 964526 959541 966326 978460 982260 985246 984232 979601 971440 972706 972244 970213 974175 979605 977995
21955I77995l765Q140K081J01n931j2142J2104J1476j0499j7740M691N352K0069
$$ 977995 974230 982370 984451 984552 978621 966479 978583 990059 979560 961820 966511 971863 991932
21942I91932M323j0866j0751M540O176K578m580j0170J1360R781o988M979j4432
$$ 991932 996255 985389 974638 979178 985354 987932 983352 973182 984542 994323 987335 992314 977882
21929I77882p589k330N013n62n48O187o4K641p219m430Q304o390j3212K2584J2317
$$ 977882 970293 967963 972976 972414 971866 978053 977989 980630 973411 968981 977285 970895 957683 980267 992584
21914I92584J0749K5925j0553j3299q790M314J0658l744j1355l209l729K921J2615
$$ 992584 1003333 1029258 1018705 1005406 996616 1000930 1011588 1007844 996489 993280 989551 992472 1005087
21901A005087M561k2015n294K190k226M51M582O823J1465K911j0348m139J112
$$ 1005087 1009648 987633 982339 984529 982303 982754 987336 994159 1005624 1008535 998187 994048 995160
21888I95160M118K0146J0152K308k2479j7130k783Q272K556M679m361m381M737
$$ 995160 999278 1019424 1029576 1031884 1009405 992275 989492 997764 1000320 1004999 1000638 996257 1000994
21875A000994J202j3580N083K113l56m167J818M705l199j25J0449q066r715K666
$$ 1000994 1002196 988616 993699 995812 995456 991289 993107 997812 994613 994488 1004937 996871 987156 989822
21861I89822p15J3346P949j1639j4076J215M033l739L339M834J4338J701J338
$$ 989822 989107 1002453 1010402 998763 984687 985902 989935 986196 989535 994369 1008707 1010408 1011746
21848A011746M995r681p615o500o783k380M483Q223Q620Q184j857l259O751R365
$$ 1011746 1016741 1007060 999445 992945 986162 983782 988265 996488 1005108 1013292 1011435 1008176 1014927 1024292
21834A024292j5622L868r77j8649k015J0655J6462J750k836J559J1604M700j6353
$$ 1024292 1008670 1012538 1011561 992912 990897 1001552 1018014 1019764 1016928 1018487 1030091 1034791 1018438
21821A018438k823Q210o338k0874m105J2900J0961J162k924R065p323p756k470
$$ 1018438 1015615 1023825 1017487 996613 992508 1005408 1016369 1017531 1014607 1023672 1016349 1008593 1006123
21808A006123J0703J6782Q724j5251o466n603m314N149L027J5806l778k467L97
$$ 1006123 1016826 1033608 1042332 1027081 1020615 1015012 1010698 1015847 1018874 1034680 1030902 1028435 1028832
21795A028832q923J4510l513j046k321k271N517N111L985r174k610N22O149L731
$$ 1028832 1019909 1034419 1030906 1029860 1027539 1025268 1030785 1035896 1039881 1030707 1028097 1028619 1034768 1038499
21781A038499j0177m63k657K121Q962J261j235R703j052j7850P748J1383n526
$$ 1038499 1028322 1027859 1025202 1027323 1036285 1037546 1036311 1046014 1044962 1027112 1034860 1046243 1040717
21768A040717q311j2086N535K0794j0447p978O498Q990p250o498K828o762j673
$$ 1040717 1032406 1020320 1025855 1046649 1036202 1028224 1034722 1043712 1036462 1029964 1032792 1026030 1024357
21755A024357L171M484j468p73j495K677K853Q505J0120R069J1128o181m257j0215
$$ 1024357 1027528 1032012 1030544 1029771 1028276 1030953 1033806 1042311 1052431 1061500 1072628 1066447 1062190 1051975
21741A051975j36o629j4936K0026J2188j9222o1j305L794L420j277q594O01P273
$$ 1051975 1051839 1045210 1030274 1050300 1062488 1043266 1043205 1041900 1045694 1049114 1047837 1039243 1039844 1047117
21727A047117J442j084Q858l206o373o161n184Q662l417K201J8429k539k504M396
$$ 1047117 1048559 1047475 1056333 1053127 1046754 1040593 1035409 1044071 1040654 1042855 1061284 1058745 1056241 1060637
21713A060637j145k260l862L132M05l471l368J477O525l166j5466Q029O748o141
$$ 1060637 1059492 1057232 1053370 1056502 1056907 1053436 1050068 1051545 1058070 1054904 1039438 1047467 1054215 1048074
21699A048074j1261j2070J1403P876Q649j730K11P693P478m949q500k202P942
$$ 1048074 1036813 1024743 1036146 1044022 1052671 1050941 1051152 1058845 1066323 1061374 1052874 1050672 1058614
21686A058614k799j0971m822P492M203l383J3574P454P897p07m840p559k066N404
$$ 1058614 1055815 1044844 1040022 1047514 1051717 1048334 1061908 1069362 1077259 1076552 1071712 1064153 1062087 1067491
21672A067491J2869m544o537L5R08J380Q641k044j2403j7664k293Q433n00p238
$$ 1067491 1080360 1075816 1069279 1069314 1070222 1071602 1080243 1078199 1065796 1048132 1045839 1054272 1053772 1046534
21658A046534L070J1316j064L821Q729o028J627J197k199J788J1353J6732p075
$$ 1046534 1049604 1060920 1059856 1063677 1072406 1066378 1068005 1069202 1067003 1068791 1080144 1096876 1089801
21645A089801j0705j0317j1359J2168L957p1j0835K830J0710K841J856k399L23
$$ 1089801 1079096 1068779 1057420 1069588 1073545 1073474 1062639 1065469 1076179 1079020 1080876 1078477 1078800
21632A078800l344Q751J978o766j0507m905q540K808K343K418J33J1233L743j0227
$$ 1078800 1075456 1084207 1086185 1079419 1068912 1064007 1055467 1058275 1060618 1063036 1063169 1074402 1078145 1067918
21618A067918o541Q030J0691n856l039J1524N301n902l027K813L3K643m875n100
$$ 1067918 1061377 1069407 1080098 1074242 1071203 1082727 1088028 1082126 1079099 1081912 1081945 1084588 1079713 1074613
21604A074613K1987J6781k828o676m044r185o734j030M873L627n112L319m123
$$ 1074613 1096600 1113381 1110553 1103877 1099833 1090648 1083914 1082884 1087757 1091384 1086272 1089591 1085468
21591A085468o420J851j826r728l211Q88O724J2829J4855O440L734k233m393M534
$$ 1085468 1079048 1080899 1079073 1069345 1066134 1067022 1073746 1086575 1101430 1107870 1111604 1109371 1104978 1109512
21577A109512L423q267q708n997J4849R276L550p525o537M234J7944M963j4238
$$ 1109512 1112935 1104668 1095960 1089963 1104812 1114088 1117638 1110113 1103576 1107810 1125754 1130717 1116479
21564A116479j3752q045J2930K360n454j875m707R616M812n240j1344N990Q134
$$ 1116479 1102727 1094682 1107612 1109972 1104518 1102643 1097936 1107552 1112364 1107124 1095780 1101770 1109904
21551A109904J0446j0612L787k896K219J4082r517l694J9173J2470j0300K248
$$ 1109904 1120350 1109738 1113525 1110629 1112848 1126930 1117413 1113719 1132892 1145362 1135062 1137310
21539A137310k082j7516j3296R60o033l857p371L984J4431J4152P794q014j2510
$$ 1137310 1135228 1117712 1104416 1105376 1099343 1095486 1088115 1092099 1106530 1120682 1128476 1120462 1107952
21526A107952j0123o153m107J2234K03J6019n883n15m972m798L828L938J1800
$$ 1107952 1097829 1091676 1087569 1099803 1100006 1116025 1110142 1109627 1104655 1099857 1103685 1107623 1119423
21513A119423Q339m210j123O985m857q955M281J0741n642N291K553J718p07o425
$$ 1119423 1127762 1123552 1122429 1129414 1124557 1115602 1119883 1130624 1124982 1130273 1132826 1134544 1133837 1127412
21499A127412o383M961p535j3982P010N549Q454l15o689J1133P333k371O817n678
$$ 1127412 1121029 1125990 1118455 1104473 1111483 1117032 1125486 1125171 1118482 1129615 1136948 1134577 1141394 1135716
21485A135716P21J471n966m582j706J874L326j273o167J4496j238l898O783J1800
$$ 1135716 1136437 1137908 1131942 1127360 1125654 1127528 1130854 1129581 1123414 1137910 1136672 1132774 1139557 1151357
21471A151357j1776p004q371Q063L411J8305M526j645q761N93l3j6978n616N845
$$ 1151357 1139581 1132577 1124206 1132269 1135680 1153985 1158511 1156866 1148105 1148698 1148665 1131687 1126071 1131916
21457A131916J0843k714q284Q678L232k323m192J380J2186J1687J0477O314o846
$$ 1131916 1142759 1140045 1131761 1140439 1143671 1141348 1137156 1138536 1150722 1162409 1172886 1179200 1172354
21444A172354j0952J828J617j423L971L398m311j4431n191J1191J3651J0689l112
$$ 1172354 1161402 1163230 1164847 1163424 1167395 1170793 1166482 1152051 1146860 1158051 1171702 1182391 1179279
21431A179279p340N57m596j52N333L980j0350m585J1494M727j1736p512n98J0770
$$ 1179279 1171939 1172496 1167900 1167748 1173081 1177061 1166711 1162126 1173620 1178347 1166611 1159099 1158501 1169271
21417A169271J1443O137j294P050o080j0084j0921k779P099l590O46j688p372
$$ 1169271 1180714 1186851 1185557 1192607 1186527 1176443 1165522 1162743 1169842 1166252 1166898 1165210 1157838
21404A157838r599n387p897J4026J6610N356j050N678l321J6720M332j1617J0248
$$ 1157838 1148239 1142852 1134955 1148981 1165591 1170947 1169897 1175575 1172254 1188974 1193306 1181689 1191937
21391A191937L102k635o681r741o628m364K465K466n16m72P940k811l446K938
$$ 1191937 1195039 1192404 1185723 1175982 1169354 1164990 1167455 1169921 1169405 1168933 1176873 1174062 1170616 1173554
21377A173554n032l806p991j405Q954J960J7052O809j4116K59R065J426R56P071
$$ 1173554 1168522 1164716 1156725 1155320 1164274 1166234 1183286 1190095 1175979 1176238 1185303 1186729 1187685 1194756
21363A194756J662l30P033j3594r951J1307N246K213l86M257l549p8j405j391
$$ 1194756 1196418 1196088 1203121 1189527 1179576 1190883 1196129 1198342 1197956 1202213 1198664 1198586 1197181 1195790
21349A195790M887J1422l822k357K874M902j658j0904j1956J2293J411k299L921
$$ 1195790 1200677 1212099 1208277 1205920 1208794 1213696 1212038 1201134 1189178 1201471 1202882 1200583 1204504
21336A204504K368J098J0339J1102j6133o447p95j2024K760J0108Q768P256M496
$$ 1204504 1206872 1207970 1218309 1229411 1213278 1206831 1206036 1194012 1196772 1206880 1215648 1222904 1227400
21323A227400o783n156l551m796N690Q55k576k649K672J3789p44l755K083n302
$$ 1227400 1220617 1215461 1211910 1207114 1212804 1213659 1211083 1208434 1211106 1224895 1224151 1220396 1222479 1217177
21309A217177q89J03L773k36L620R773r115N52m583K76O848M97N59P220N221k758
$$ 1217177 1216288 1216391 1220164 1219928 1223548 1233321 1224206 1224758 1220175 1220451 1227299 1227796 1228355 1235575 1240796 1238038
21293A238038N399m761r413L466Q898M40P436k100j1405l996m541J3353M221p069
$$ 1238038 1243437 1238676 1229263 1232729 1241627 1242067 1249503 1247403 1235998 1232002 1227461 1240814 1245035 1237966
21279A237966M692j5111k0419j0450L781J0777Q112J4764J3797M611J0271j1202
$$ 1237966 1242658 1227547 1207128 1196678 1200459 1211236 1219348 1234112 1247909 1252520 1262791 1251589
21267A251589L36J9545N92n908j7162K623K2496M553l821l021N411J266j6618
$$ 1251589 1251925 1271470 1272062 1266154 1248992 1251615 1274111 1278664 1274843 1271822 1277233 1278499 1261881
21254A261881k2387k640R546J0663L273j2401j1423R66p039L931p59P522R241
$$ 1261881 1239494 1236854 1246400 1257063 1260336 1247935 1236512 1237478 1230439 1234370 1233611 1241133 1250374
21241A250374o611j515L410j211M019m015k402R046j3614K286J7673N668o297
$$ 1250374 1243763 1242248 1245658 1244447 1248466 1244451 1242049 1251095 1237481 1239767 1257440 1263108 1256811
21228A256811J51L813J125J407q792j827p361L053L534n193J1262L418J0806l598
$$ 1256811 1256962 1260775 1261900 1263307 1254515 1252688 1245327 1248380 1251914 1246721 1257983 1261401 1272207 1268609
21214A268609M695j0145j473Q24J7451J5638k056j4073J5277j5596j6174N937
$$ 1268609 1273304 1263159 1261686 1262510 1279961 1295599 1293543 1279470 1294747 1279151 1262977 1268914
21202A268914K144p265J0539O659M368k502q273J0628L042k0066o206J8284K514
$$ 1268914 1271058 1263793 1274332 1280991 1285359 1282857 1274584 1285212 1288254 1268188 1261982 1280266 1282780
21189A282780p555l660L840l665q548J0407Q941N979j029N344m80j3683l697k271
$$ 1282780 1275225 1271565 1275405 1271740 1263192 1273599 1282540 1288519 1287490 1292834 1292354 1278671 1274974 1272703
21175A272703L654P226m45j815K933R13Q5j914O790J2459M346k003m804O121O654
$$ 1272703 1276357 1283583 1283138 1281323 1284256 1285169 1285254 1283340 1290130 1302589 1306935 1304932 1300128 1306249 1312903
21160A312903k229L325k857q950m266J0944J0906p076Q501j192j3044K684n55
$$ 1312903 1310674 1313999 1311142 1302192 1297926 1308870 1319776 1312700 1321201 1320009 1306965 1309649 1309094
21147A309094Q578j4099j7916p037K660J7746P870K539o867K837n000p512k912
$$ 1309094 1317672 1303573 1285657 1278620 1281280 1299026 1306896 1309435 1302568 1305405 1300405 1292893 1289981
21134A289981j172L387o102j867j897k065O165K34n410O281J6055N552L966J1316
$$ 1289981 1288809 1292196 1286094 1284227 1282330 1280265 1286430 1286664 1281254 1287535 1303590 1309142 1313108 1324424
21120A324424m893j2713K368L234l626Q445Q678P479j086J2880m279j3959j2629
$$ 1324424 1319531 1306818 1309186 1312420 1308794 1317239 1325917 1333396 1332310 1345190 1340911 1326952 1314323
21107A314323o797j805k49K280R849P408J1816J05j82k132r55J0397n999j0427
$$ 1314323 1307526 1305721 1305472 1307752 1317601 1325009 1336825 1336930 1336748 1334616 1333661 1344058 1338059 1327632
21093A327632J2725j3066j3249K306M67N119O484M898Q55m771M599J2890R144
$$ 1327632 1340357 1327291 1314042 1316348 1316815 1321934 1328418 1333316 1334171 1329400 1333999 1346889 1356033
21080A356033K627N61q965k431K357K300O367j0942j1532O799J2074k01Q973M265
$$ 1356033 1358660 1359221 1350256 1347825 1350182 1352482 1358849 1347907 1336375 1343174 1355248 1355047 1364020 1368285
21066A368285q485j2772o240L996J5905m188o665J374J991J0907R250N436J475
$$ 1368285 1359800 1347028 1340788 1344784 1360689 1356501 1349836 1351210 1353201 1364108 1373358 1378794 1380269
21053A380269j3654K356K858N537k228J238p597q220J2243o434r180O297N835
$$ 1380269 1366615 1368971 1371829 1377366 1375138 1376376 1368779 1360559 1372802 1366368 1357188 1363485 1369320
21040A369320j7413n303N879P63J3645M887M11Q064L595M929q215j0616K94J661
$$ 1369320 1351907 1346604 1352483 1353246 1366891 1371778 1372189 1380253 1383848 1388777 1380562 1369946 1370240 1371901
21026A371901n065O305J0433L073j2948p453n9J0624o152n387q32O258R358N036
$$ 1371901 1366836 1373141 1383574 1386647 1373699 1366246 1366187 1376811 1370659 1365272 1364440 1370698 1380056 1385092
21012A385092J032O288l35j90N908J083K771J033j0621o585M296j4267N899P374
$$ 1385092 1386124 1392412 1392077 1391887 1397795 1398878 1401649 1402682 1392061 1385476 1389772 1375505 1381404 1388778
20998A388778M309J180L158R861j159j501k805M951k043Q367j083m211R124K0659
$$ 1388778 1393087 1394267 1397425 1407286 1406127 1404626 1401821 1406772 1404729 1413096 1412013 1407802 1416926 1437585
20984A437585M580j9501n837N889p882K672N078J1823R765o406j1884j771J83
$$ 1437585 1442165 1422664 1416827 1422716 1414834 1417506 1422584 1434407 1444172 1437766 1425882 1424111 1424294
20971A424294L631l377n919N141P856R103o254j0834n59J944J0657j75r376j1808
$$ 1424294 1427925 1424548 1418629 1423770 1431626 1440729 1434475 1423641 1423082 1425026 1435683 1435508 1426132 1414324
20957A414324L651L229m857k198j751M00J370R9J0724J903M919r41m254J1268
$$ 1414324 1417975 1421204 1416347 1414149 1412398 1412798 1414168 1414267 1424991 1426894 1431813 1430872 1426618 1437886
20943A437886j036j2886m432k428J8734J7655p362o930R260N395r48J50n396p157
$$ 1437886 1436850 1423964 1419532 1417104 1435838 1453493 1446131 1439201 1448461 1453856 1452908 1453058 1447662 1440505
20929A440505J1274R526K482Q449R905K05J78j4515j3367p679R471J6663J0658
$$ 1440505 1451779 1461305 1463787 1472236 1482141 1482346 1482524 1468009 1454642 1446963 1456434 1473097 1483755
20916A483755k240p535o051Q634M271N444j188j5211p164J4696N744M864q78N778
$$ 1483755 1481515 1473980 1467929 1476563 1480834 1486278 1485090 1469879 1462715 1477411 1483155 1488019 1487141 1492919
20902A492919k682N418O557m944k987j894N342j0357n278k839l833l309P561n64
$$ 1492919 1490237 1495655 1502212 1497268 1494281 1492387 1497729 1487372 1482094 1479255 1475422 1472113 1479674 1479110
20888A479110k928J2828K834O505R256k437K068J0026p468j1967P771M007j389
$$ 1479110 1476182 1489010 1491844 1498349 1507605 1505168 1507236 1517262 1509794 1497827 1505598 1509605 1508216
20875A508216p993M069K223O784K672q282o76O811P63L710n143J8505l375j50
$$ 1508216 1500223 1504292 1506515 1513299 1515971 1507689 1507013 1513824 1514587 1518297 1513154 1531659 1528284 1528134
20861A528134n746O031Q543J160j0853r812P011l629J8791J37M487M896j3311
$$ 1528134 1522388 1528419 1536962 1538122 1527269 1517457 1524468 1520839 1539630 1539767 1544254 1549150 1535839
20848A535839j793q090j33j097M778j8790r256N038P069J2045J0679N583l940
$$ 1535839 1534046 1525956 1525823 1524726 1529504 1510714 1501458 1506496 1513565 1525610 1536289 1541872 1537932
20835A537932j959k70l934m196M341L257m750Q070L349M515O482O113M702j3238
$$ 1537932 1535973 1535703 1531769 1527573 1531914 1535171 1530421 1538491 1541840 1546355 1552837 1558950 1563652 1550414
20821A550414q587q557N809L121j073N352P756J825P981J6053M731O9l591j011
$$ 1550414 1541827 1533270 1539079 1542200 1541127 1546479 1554235 1556060 1564041 1580094 1584825 1584894 1581303 1580292
20807A580292k073J336N264L419J268P77P425l539j0172p487R119O133j0968p065
$$ 1580292 1578219 1579555 1584819 1588238 1589506 1590283 1597708 1594169 1583997 1576510 1585629 1591762 1580794 1573729
20793A573729N141K362J3611J7766r22j2144m993m662m642P990j0388l408J6169
$$ 1573729 1578870 1581232 1594843 1612609 1611687 1599543 1594550 1589888 1585246 1593236 1582848 1579440 1595609
20780A595609J4176j3063n87L26r759Q136J9790q230o568q605L248J2038J0260
$$ 1595609 1609785 1596722 1596135 1596461 1586702 1594838 1614628 1606398 1599830 1591225 1594473 1606511 1616771
20767A616771r374m053J9215M780n687J0333k324k265R645L965l817K093j08j1842
$$ 1616771 1607397 1603344 1622559 1627339 1621652 1631985 1629661 1627396 1637041 1641006 1637189 1639282 1639174 1627332
20753A627332O989J8449K626j778j1269j3002P228K4655L222j4905j0517o521
$$ 1627332 1634321 1652770 1655396 1653618 1642349 1629347 1636575 1661230 1664452 1649547 1639030 1632509
20741A632509l557j643K965J483j627J4027R351J0785j2207J554P613q347J1786
$$ 1632509 1628952 1627309 1630274 1631757 1630130 1644157 1653508 1664293 1652086 1653640 1661253 1652906 1664692
20728A664692O078j704Q929O439k466j5176j4370P382K346p707L735J6503J3930
$$ 1664692 1670770 1669066 1677995 1684434 1681968 1666792 1652422 1659804 1662150 1654443 1658178 1674681 1688611
20715A688611P593q758o214r74L043P904M280k5585k0796j629J9550J1813j866
$$ 1688611 1696204 1687446 1681232 1680258 1683301 1691205 1695485 1669900 1649104 1647475 1667025 1678838 1676972
20702A676972p494q033R261J3214J380q6K895R60P244J3668P644L965k441j599
$$ 1676972 1669478 1661445 1670706 1683920 1685300 1685214 1688109 1689069 1696313 1709981 1717625 1721590 1719149 1717550
20688A717550o634j1261R294R874K366l973K150O380N326p736j616J837J2211
$$ 1717550 1710916 1699655 1708949 1718823 1721189 1717216 1719366 1725746 1731072 1723336 1721720 1723557 1735768
20675A735768n940p611J4660R887N771L613l081l239J401N419J1865r0j3776n832
$$ 1735768 1729828 1722217 1736877 1746764 1752535 1756148 1753067 1749828 1751229 1756648 1768513 1768423 1754647 1748815
20661A748815l950k331K453j57j390o970N16P091R633L433L783N87j748L07P474
$$ 1748815 1744865 1742534 1744987 1744830 1743440 1736470 1736986 1744077 1753710 1757143 1760926 1761513 1759765 1760072 1767546
20646A767546k687J0734l185p94k035q514J871K127J109k46K446J1920p780l015
$$ 1767546 1764859 1775593 1772408 1771614 1769579 1761065 1762936 1765063 1766172 1765926 1768372 1780292 1772512 1769497
20632A769497K926M756R375J3673M187P850J3379n044r436o16o764j519N08j0109
$$ 1769497 1772423 1777179 1786554 1800227 1804414 1812264 1825643 1820599 1811163 1810547 1803783 1802264 1802772 1792663
20618A792663R942q583O488P412j0017O254J2296n07p206P850o65J1048M282O573
$$ 1792663 1802605 1794022 1800510 1807922 1797905 1804159 1816455 1815948 1808742 1816592 1815927 1826975 1831257 1837830
20604A837830O613l134p433k631K411J3241R300K470K503m412M771j1400j1714
$$ 1837830 1844443 1841309 1833876 1831245 1833656 1846897 1856197 1858667 1861170 1856758 1861529 1850129 1838415
20591A838415m006Q639Q06L190J934n65r42O876K49l559R405O286J1223R180L515
$$ 1838415 1834409 1843048 1843854 1847044 1848978 1848413 1847471 1854347 1854596 1851037 1860442 1866728 1877951 1887131 1890646
20576A890646p362p09k414l917O287J485j2866r961J2421O461J7321J1751n036
$$ 1890646 1883284 1882575 1880161 1876244 1882531 1884016 1871150 1861189 1873610 1880071 1897392 1909143 1904107
20563A904107m335p794N510N203J9053l855j2940l884J933N576J2153K570r639
$$ 1904107 1899772 1891978 1897488 1902691 1921744 1917889 1904949 1901065 1902998 1908574 1920727 1923297 1913658
20550A913658K902J1374N525q649K745O575j772o331J2674N787q748k263N417
$$ 1913658 1916560 1927934 1933459 1924810 1927555 1934130 1932358 1926027 1938701 1944488 1935740 1933477 1938894
20537A938894J5892M16L188O661p103l470P729J5811m561n258n090O280M854J3157
$$ 1938894 1954786 1955202 1958390 1965051 1957948 1954478 1962207 1978018 1973457 1968199 1963109 1969389 1974243 1987400
20523A987400L097j7727j240N094L994k715J4673m58p085M742P672R379P125N253
$$ 1987400 1990497 1972770 1971530 1976624 1980618 1977903 1992576 1992118 1985033 1989775 1997447 2006826 2013951 2019204
20509B019204O693r52j4116q090J2709O808n256O89J3555J4956K193p173o202
$$ 2019204 2025897 2024945 2010829 2002739 2015448 2022256 2017000 2017689 2031244 2046200 2048393 2041220 2035018
20496B035018P649n886p807J0111J7251J1198O952N019L1r680K157o126R197j4116
$$ 2035018 2042667 2036781 2028974 2039085 2056336 2067534 2074486 2079505 2079536 2069856 2072013 2065887 2075084 2060968
20482B060968l114j775L012J8441J3042j1073j0707m384R7R721R339J5191O215
$$ 2060968 2057854 2056079 2059091 2077532 2090574 2079501 2068794 2064410 2064507 2074228 2083567 2098758 2104973
20469B104973j3011j3029J442J2102J016j382N042j405P331J2771J0597J30L853
$$ 2104973 2091962 2078933 2080375 2092477 2093493 2092111 2097153 2095748 2103079 2115850 2126447 2126577 2130430
20456B130430N55q653O998J360j914R95L86R7J6276L488m458O365P223J1120Q968
$$ 2130430 2130985 2122332 2129330 2130690 2128776 2129771 2130157 2130254 2146530 2150018 2145560 2151925 2159148 2170268 2179236
20441B179236R884q82n609o046p639k642J3044J2526j568R234R7Q59J601K35r70
$$ 2179236 2189120 2188238 2182629 2176583 2168944 2166302 2179346 2191872 2190304 2199538 2199635 2200494 2202095 2202330 2201360
20426B201360N126K2675O812m618K985k698M887K46J1528j5094j59J6946O469
$$ 2201360 2206486 2229161 2235973 2231355 2234340 2231642 2236529 2236775 2248303 2233209 2233050 2249996 2256465
20413B256465K614l440l999j715O659J42N026J2644R335J0977l300n285L157K1382
$$ 2256465 2259079 2255639 2251640 2249925 2256584 2256726 2261752 2274396 2283731 2294708 2291408 2286123 2289280 2310662
20399B310662J3787l970Q107M623r643r772K923R806J0067J58K1396P288Q137
$$ 2310662 2324449 2320479 2328586 2333209 2323566 2313794 2316717 2326523 2336590 2336748 2358144 2365432 2373569
20386B373569K506Q529j252P336K001M978J0415J1369L721K947O226J0093J4275
$$ 2373569 2376075 2384604 2383352 2390688 2392689 2397667 2408082 2419451 2423172 2426119 2432345 2442438 2456713
20373B456713J3860j563N351K6370J2096L469K4367L885J962J111J8146L3911
$$ 2456713 2470573 2469010 2474361 2500731 2512827 2516296 2540663 2544548 2546510 2547621 2565767 2599678
20361B599678J1655J4616J7033J5113K1273K2691K8735M3615M3922M5297P2696
$$ 2599678 2611333 2625949 2642982 2658095 2679368 2702059 2730794 2774409 2818331 2863628 2936324
20350B936324P8377P3317R8425J10096Q5411L233k06760m91973o02124m70274
$$ 2936324 3014701 3088018 3186443 3296539 3381950 3385183 3178423 2686450 2084326 1614052
20340A614052k20512j5486N5028Q2883Q4446P8605R0585P1001O0361L8720K6040
$$ 1614052 1393540 1378054 1433082 1515965 1600411 1679016 1769601 1840602 1900963 1939683 1965723
20329A965723M0773K6573M1981L7547J6441K3656J3735K3423Q684Q602J2634R571
$$ 1965723 2006496 2033069 2075050 2112597 2129038 2152694 2166429 2189852 2198536 2207138 2219772 2229343
20317B229343K2911J4017K46K1195J9621L519J110J1882J8621P574p872m438L238
$$ 2229343 2252254 2266271 2266517 2287712 2307333 2310852 2311962 2323844 2342465 2350039 2342167 2337729 2340967
20304B340967k446O852K5779K4802J4681q569m56O726M332J0022R052K451P447
$$ 2340967 2338521 2345373 2371152 2395954 2410635 2402066 2401610 2408336 2412668 2422690 2431742 2434193 2441640
20291B441640R836J1870Q286L134M398J089o056L363J5200K1704M747J0210P427
$$ 2441640 2451476 2463346 2471632 2474766 2479164 2480253 2474197 2477560 2492760 2514464 2519211 2529421 2536848
20278B536848m265r442p78k109O49J8061J828j096P138R410K2907J8079M308j4599
$$ 2536848 2532583 2523141 2522363 2520254 2520903 2538964 2540792 2539696 2546834 2556244 2579151 2597230 2601538 2586939
20264B586939o022j3190K89J8096K4662L2714N062k0074n239j732K821R863J4132
$$ 2586939 2580917 2567727 2568016 2586112 2610774 2643488 2648550 2628476 2623237 2621505 2624326 2634189 2648321
20251B648321J3502M834K0767J0267K475q139j5615l730m645M974J8396L1975
$$ 2648321 2661823 2666657 2687424 2697691 2700166 2692027 2676412 2672682 2668037 2673011 2691407 2723382
20239B723382R003q357j57m350L129J4214N454J923J2547L671N561R112J1277
$$ 2723382 2732385 2724028 2723871 2719521 2722650 2736864 2742318 2744241 2756788 2760459 2766020 2775132 2786409
20226B786409J3003J578J2279J501j0822K1455J83j3831j4050O151J511O205J4470
$$ 2786409 2799412 2800990 2813269 2814770 2803948 2825403 2825586 2811755 2797705 2803856 2805367 2811572 2826042
20213B826042J3464P074J2037O830Q776R417N5k253J892J4998Q372K0277r71O418
$$ 2826042 2839506 2846580 2858617 2865447 2874223 2883640 2883695 2881442 2883334 2898332 2906704 2926981 2926010 2932428
20199B932428L886J273p66M522M696P749J1762N979O782J8891J8252P181p734
$$ 2932428 2936314 2937587 2936821 2941343 2946039 2953788 2965550 2971529 2978311 2997202 3015454 3022635 3014901
20186C014901k94M179J3252N585j2913P43M649J0581J5358J2024j684o810J0411
$$ 3014901 3014607 3018786 3032038 3037623 3024710 3025453 3030102 3040683 3056041 3068065 3066381 3059571 3069982
20173C069982J9114J116M478L466O628M522J5598R64l126J7962J3237P014N024
$$ 3069982 3089096 3090212 3094690 3098156 3104784 3109306 3124904 3125868 3122742 3140704 3153941 3160955 3165979
20160C165979J9725R749M377n547n973J2987J9094Q797J4999J5575M110j0477
$$ 3165979 3185704 3195453 3199830 3194283 3188310 3201297 3220391 3229188 3244187 3259762 3263872 3253395
20148C253395m832R281N163k909J2561K3988J1482M979M179J7992M409j4389J7767
$$ 3253395 3248563 3257844 3263007 3260098 3272659 3296647 3308129 3313108 3317287 3335279 3339688 3325299 3343066
20135C343066J8505J3721J789P798P339p156J8746J0629K265m463J7892J3064
$$ 3343066 3361571 3375292 3377081 3384879 3392218 3385062 3403808 3414437 3416702 3412239 3430131 3443195
20123C443195P779J965K1192J3769J8574J4553l738m883K4816J7488q119k331
$$ 3443195 3450974 3452939 3474131 3487900 3506474 3521027 3517289 3512406 3537222 3554710 3546591 3544260
20111C544260M613R689J1938K8528J3462J0197M649J4914P381O111R486J6491
$$ 3544260 3548873 3558562 3570500 3599028 3612490 3622687 3627336 3642250 3649631 3655742 3665228 3681719
20099C681719L977J1176J2216Q068J5890J9780J6269R717L571J1177L3592Q768
$$ 3681719 3685696 3696872 3709088 3717156 3733046 3752826 3769095 3778812 3782383 3793560 3827152 3835920
20087C835920R159K2093J2645K0904K1575J6126K5969L4418K4889K0451K7061
$$ 3835920 3845079 3867172 3879817 3900721 3922296 3938422 3964391 3998809 4023698 4044149 4071210
20076D071210L3320L4773M5481M8894N4708O9618P0939J9177o4265j70163k57953
$$ 4071210 4104530 4139303 4184784 4233678 4288386 4358004 4428943 4448120 4383855 4213692 3955739
20065C955739k43060j32279q546L5216L6822L7267L4854J6095K7174L8118L2408
$$ 3955739 3712679 3580400 3571854 3607070 3643892 3681159 3716013 3732108 3759282 3797400 3829808
20054C829808M3528M6961K8599J5115L3697K0898L809J8368J6437K4007K9145
$$ 3829808 3873336 3920297 3948896 3964011 3997708 4018606 4022415 4040783 4057220 4081227 4110372
20043D110372K1256J3654J9408J2084O106J2010K8083J3503J7309L2288K4965
$$ 4110372 4131628 4145282 4164690 4176774 4182880 4194890 4222973 4236476 4253785 4286073 4311038
20032D311038J9399K1704j478J83J4993K0500J8124K7319M0265L7379K5294K7005
$$ 4311038 4330437 4352141 4350663 4350846 4365839 4386339 4404463 4431782 4472047 4509426 4534720 4561725
20020D561725K6626J6279L0050M1043J1204P150J3578j0402o6408r5055q1747
$$ 4561725 4588351 4604630 4634680 4675723 4686927 4694077 4707655 4697253 4630845 4535790 4454043
20009D454043L3744J07461O0071n652n547R111L9294M2377K6499K3512J6784J5146
$$ 4454043 4487787 4595248 4655319 4649667 4644120 4653231 4692525 4734902 4761401 4784913 4801697 4816843
19997D816843Q045P896J5758M878K5628L6197K6600J1012J8246J4849J6522K7308
$$ 4816843 4824888 4832784 4848542 4853420 4879048 4915245 4941845 4952857 4971103 4985952 5002474 5029782
19985E029782K8062K8422L3605M2827L9864K9700K5264K557J3100J1163J1920
$$ 5029782 5057844 5086266 5119871 5162698 5202562 5232262 5257526 5260083 5273183 5284346 5296266
19974E296266J0419L9616M0235L3012J4985K6957L8904L1765K7229K5908K9139
$$ 5296266 5306685 5346301 5386536 5419548 5434533 5461490 5500394 5532159 5559388 5585296 5614435
19963E614435K2518k205P327J2865K0460K0656L5298M5036M7605N8541N4021N7739
$$ 5614435 5636953 5634748 5642075 5654940 5675400 5696056 5731354 5776390 5823995 5882536 5936557 5994296
19951E994296Q3747R6308R3321L8850N435j2530l7766k4785q186j0909j0404K287
$$ 5994296 6078043 6174351 6267672 6306522 6311957 6299427 6261661 6236876 6228690 6217781 6207377 6209664
19939F209664K7409M1947L8108M8368M5212L5249L3792L5480K9970M0793L9562
$$ 6209664 6237073 6279020 6317128 6365496 6410708 6445957 6479749 6515229 6545199 6585992 6625554
19928F625554K0946J8076M2151M7509M2073M4202L4282M1494L9426M5130L2700
$$ 6625554 6646500 6664576 6706727 6754236 6796309 6840511 6874793 6916287 6955713 7000843 7033543
19917G033543L9875N5247M9696L0631L7663N1812O0391N8966M9296M0384L5522
$$ 7033543 7073418 7128665 7178361 7208992 7246655 7298467 7358858 7417824 7467120 7507504 7543026
19906G543026M6247N5476N8804N6318M9991N7974N6398O2108N5250M8475M8536
$$ 7543026 7589273 7644749 7703553 7759871 7809862 7867836 7924234 7986342 8041592 8090067 8138603
19895H138603O2745P7505O5957P4152R2810P4020M6519N3390J31947K20169J54552
$$ 8138603 8201348 8278853 8344810 8418962 8511772 8585792 8632311 8685701 8817648 9037817 9192369
19884I192369n4590k18122j49776o6287m6842P0037J25788J29804J04892J06756
$$ 9192369 9137779 8919657 8769881 8703594 8656752 8726789 8852577 8982381 9087273 9194029
19874I194029R7547R3209Q7848R8890J24869J09633R7525R0704R4005J05785J12029
$$ 9194029 9291576 9384785 9472633 9571523 9696392 9806025 9903550 9994254 10088259 10194044 10306073
19863A0306073J23635J03194Q2384R0367J05456J24358J15793J14111J07616J15596
$$ 10306073 10429708 10532902 10615286 10705653 10811109 10935467 11051260 11165371 11272987 11388583
19853A1388583J26360J40688J47036J37874J42680J40313J47283J72461J93706
$$ 11388583 11514943 11655631 11802667 11940541 12083221 12223534 12370817 12543278 12736984
19844A2736984K19960K23821K39591K44298K57708K92795L74945M00229K73496
$$ 12736984 12956944 13180765 13420356 13664654 13922362 14215157 14590102 14990331 15263827
19835A5263827j29194p18753r64379o91577j79235K38121L44095L61796L52681
$$ 15263827 15134633 14415880 13451501 12759924 12580689 12818810 13162905 13524701 13877382
19826A3877382L44865L31542L22976L21436L31288L48306L31244L12059L10317
$$ 13877382 14222247 14553789 14876765 15198201 15529489 15877795 16209039 16521098 16831415
19817A6831415L01122L07942K91543L17543L40134L65264L95709L95688M16473
$$ 16831415 17132537 17440479 17732022 18049565 18389699 18754963 19150672 19546360 19962833
19808A9962833M43359M58634M82725N21161N59728N71018O19609O30569O37998
$$ 19962833 20406192 20864826 21347551 21868712 22428440 22999458 23619067 24249636 24887634
19799B4887634N95919M15119J72475Q2704K38441N53905Q21987R22066R18377
$$ 24887634 25483553 25898672 26071147 26153851 26392292 26946197 27768184 28690250 29608627
19790B9608627Q33555P70264Q54292J011507J167572J268312J383483J534074
$$ 29608627 30442182 31212446 32066738 33078245 34245817 35514129 36897612 38431686
19782C8431686J713483J871089K006496K057928J964862J808717J903828K380430
$$ 38431686 40145169 42016258 44022754 46080682 48045544 49854261 51758089 54138519
19774E4138519L032700L604870L925405M150404M546797N369466O557644Q020273
$$ 54138519 57171219 60776089 64701494 68851898 73398695 78768161 85325805 93346078
19766I3346078R512961J1221751J3498187J6721395K0569895K3341148J8096422
$$ 93346078 102859039 114080790 127578977 144300372 164870267 188211415 206307837
19759B06307837r442624o3576208j15136866j15519402p6883729k1608368J0677509
$$ 206307837 196865213 133289005 18152139 -97367263 -174250992 -195859360 -185181851
19752a85181851J7392617J6357048J4939481J3810285J2453778J0887933R349009
$$ -185181851 -167789234 -151432186 -136492705 -122682420 -110228642 -99340709 -89991700
19745h9991700P962444O687835N398584M370568L787107L450859L048380K509760
$$ -89991700 -82029256 -75341421 -69942837 -65572269 -61785162 -58334303 -55285923 -52776163
19737e2776163K192619K128621K204346K131840J979531J818009J696302J620608
$$ -52776163 -50583544 -48454923 -46250577 -44118737 -42139206 -40321197 -38624895 -37004287
19729c7004287J548714J481141J370648J266618J174635J009516P99856O88239
$$ -37004287 -35455573 -33974432 -32603784 -31337166 -30162531 -29153015 -28353159 -27664920
19721b7664920P28199P98003P79918N46692J89720K4312J11982L43959N52755
$$ -27664920 -26936721 -26138718 -25358800 -24812108 -24622388 -24598076 -24486094 -24142135 -23589380
19712b3589380O05549N92906N46484M97310M95383M80058M57122M34593M13291
$$ -23589380 -22983831 -22390925 -21844441 -21347131 -20851748 -20371690 -19914568 -19479975 -19066684
19703a9066684L86127L81348L64881L60145L49988L29710K90367K86133K87440
$$ -19066684 -18680557 -18299209 -17934328 -17574183 -17224195 -16894485 -16604118 -16317985 -16030545
19694a6030545K79564K52301K42992K22057K30403K16195K36164K38585K20764
$$ -16030545 -15750981 -15498680 -15255688 -15033631 -14803228 -14587033 -14350869 -14112284 -13891520
19685a3891520K05318K14665J94666J79265J86749J84711J84251J80393J82080
$$ -13891520 -13686202 -13471537 -13276871 -13097606 -12910857 -12726146 -12541895 -12361502 -12179422
19676a2179422J50250J57301J41589J25713J59082J51096J46953J39651J38273
$$ -12179422 -12029172 -11871871 -11730282 -11604569 -11445487 -11294391 -11147438 -11007787 -10869514
19667a0869514J33748J39135J29843J25839J20892J20786J08761J01159J03581
$$ -10869514 -10735766 -10596631 -10466788 -10340949 -10220057 -10099271 -9990510 -9889351 -9785770
19658i785770J01988J04656J05132J16567J15516J04706J00304R2413Q9707R0436
$$ -9785770 -9683782 -9579126 -9473994 -9357427 -9241911 -9137205 -9036901 -8944488 -8854781 -8764345
19648h764345Q3657R5557R0298R6399R4197P4123P8224P8755J02094Q4614N6154
$$ -8764345 -8680688 -8585131 -8494833 -8398434 -8304237 -8230114 -8151890 -8073135 -7971041 -7886427 -7830273
19637g830273N0315K5641M546K5410J22827J55165O5515R9967R0406r3957j23951
$$ -7830273 -7779958 -7754317 -7749771 -7724361 -7601534 -7446369 -7380854 -7280887 -7190481 -7284438 -7408389
19626g408389j4018O7703J00718R4035O0239N0280P1695P8613O6779O8371O5390
$$ -7408389 -7422407 -7354704 -7253986 -7159951 -7099712 -7049432 -6977737 -6899124 -6832345 -6763974 -6698584
19615f698584N2342M1138N2581N2546N0176N4672N2995M5116M4861O0025M2649
$$ -6698584 -6646242 -6605104 -6552523 -6499977 -6449801 -6395129 -6342134 -6297018 -6252157 -6192132 -6149483
19604f149483M9793N2197M2415N0705O0925M5017L3958M5338M8093L3543L8228
$$ -6149483 -6099690 -6047493 -6005078 -5954373 -5893448 -5848431 -5814473 -5769135 -5721042 -5687499 -5649271
19593e649271M5426M5966M7260L2379L7173L1709K7389M4720L8577M2665L3391
$$ -5649271 -5603845 -5557879 -5510619 -5478240 -5441067 -5409358 -5381969 -5337249 -5298672 -5256007 -5222616
19582e222616L5512L3104L1465L4293K7509K3239R675K1011L7874N6649O5913
$$ -5222616 -5187104 -5154000 -5122535 -5088242 -5060733 -5037494 -5027819 -5006808 -4968934 -4912285 -4846372
19571d846372P4083O5531P6477R3863R0093N6873K9775j9703m9965m9850n232
$$ -4846372 -4772289 -4706758 -4630281 -4536418 -4446325 -4389452 -4359677 -4379380 -4429345 -4479195 -4484427
19560d484427J0481k458j236K769K1888K2695K4617M3271M0859L3247K6126J9405
$$ -4484427 -4473946 -4476404 -4477640 -4474871 -4452983 -4430288 -4405671 -4362400 -4321541 -4288294 -4262168 -4242763
19548d242763Q377K4465J9144K5347K5347J8545K2565K7276L6281K7815L8164
$$ -4242763 -4234386 -4209921 -4190777 -4165430 -4140083 -4121538 -4098973 -4071697 -4035416 -4007601 -3969437
19537c969437L2542K5390K7652K7904L0501K2040J0967K360P817m511o108p903
$$ -3969437 -3936895 -3911505 -3883853 -3855949 -3825448 -3803408 -3792441 -3790081 -3782264 -3786775 -3792883 -3800786
19525c800786j023J0038J7455J3448K0763K6464J8890L7140L5338K8634K1376
$$ -3800786 -3801809 -3791771 -3774316 -3760868 -3740105 -3713641 -3694751 -3657611 -3622273 -3593639 -3572263
19514c572263J7521K1944J8329J1262K2110L3476J6752l638J3901J5772Q349J4983
$$ -3572263 -3554742 -3532798 -3514469 -3503207 -3481097 -3447621 -3430869 -3434507 -3420606 -3404834 -3396485 -3381502
19502c381502J4023J7292K4590J7049J4149J6302K9988K5027Q601J5009J8891
$$ -3381502 -3367479 -3350187 -3325597 -3308548 -3294399 -3278097 -3248109 -3223082 -3214481 -3199472 -3180581
19491c180581K4864l912n017P366j849R850J7914K3700K3016J9754N378R460K4495
$$ -3180581 -3155717 -3159629 -3164646 -3157280 -3159129 -3149279 -3131365 -3107665 -3084649 -3064895 -3059517 -3050057 -3025562
19478c025562K2038J2752J3008K1213J6761N121N217J8322J1364J6090J8101J2763
$$ -3025562 -3003524 -2990772 -2977764 -2956551 -2939790 -2934669 -2929452 -2911130 -2899766 -2883676 -2865575 -2852812
19466b852812K1840J4027K368K09q89J7139J1423J1793J0895J0108J4634J9215
$$ -2852812 -2830972 -2816945 -2814577 -2814368 -2815257 -2798118 -2786695 -2774902 -2764007 -2753899 -2739265 -2720050
19454b720050L1656L8076L1954K0545m93o60K239j2915K529J1003L516l113Q205
$$ -2720050 -2688394 -2650318 -2618364 -2597819 -2598312 -2598972 -2596733 -2609648 -2607119 -2596116 -2592600 -2595713 -2587508
19441b587508J1560N954N255J1846J4760R308N695J8964J4434M870M654Q760J0889
$$ -2587508 -2575948 -2569994 -2564739 -2552893 -2538133 -2528825 -2523130 -2504166 -2489732 -2484862 -2480208 -2471448 -2460559
19428b460559J9390J2890J4961J7000J0413N859J0514J2397R28q61K527R604K6267
$$ -2460559 -2441169 -2428279 -2413318 -2396318 -2385905 -2380046 -2369532 -2357135 -2356207 -2357068 -2354541 -2344937 -2318670
19415b318670K0321K355O481K29O818J37J223k005R719J0493Q735R720J2982l18
$$ -2318670 -2298349 -2295994 -2289513 -2289284 -2282466 -2282329 -2281106 -2283111 -2273392 -2262899 -2254164 -2244444 -2231462 -2231780
19401b231780J9660J5194R268l80j0042N288O906J0826K0276K7500K4629O514
$$ -2231780 -2212120 -2196926 -2187658 -2188038 -2198080 -2192792 -2185886 -2175060 -2154784 -2127284 -2102655 -2096141
19389b096141k809q54J4715J2076Q553J2485J1936q850M428J6258K725O890J5356
$$ -2096141 -2098950 -2099804 -2085089 -2073013 -2064460 -2051975 -2040039 -2048889 -2044461 -2028203 -2025478 -2018588 -2003232
19376b003232m3p88J2773J1309Q135J1518N189J530J1500p113k223J5217J1881
$$ -2003232 -2003275 -2004063 -1991290 -1979981 -1971846 -1960328 -1955139 -1953609 -1942109 -1949222 -1951445 -1936228 -1924347
19363a924347J2025J0074P283J1805J2938M235p284L862k615J706Q619Q033Q730
$$ -1924347 -1912322 -1902248 -1894965 -1883160 -1870222 -1865987 -1873271 -1869409 -1872024 -1870318 -1861699 -1853666 -1844936
19350a844936l865J3498K824L329J2643P209J2407J2802J0932P023N808J258J6555
$$ -1844936 -1848801 -1835303 -1832479 -1829150 -1816507 -1809298 -1796891 -1784089 -1773157 -1766134 -1760326 -1759068 -1742513
19337a742513K5382N863K344q005r543Q871J3450Q066k319J45J2928J5860P774
$$ -1742513 -1717131 -1711268 -1708924 -1716929 -1726472 -1717601 -1704151 -1696085 -1698404 -1698259 -1685331 -1669471 -1661697
19324a661697J8474N961q700O934J0074L67P786N050J5972J4247P391J4285J0655
$$ -1661697 -1643223 -1637262 -1645962 -1639028 -1628954 -1628587 -1620801 -1615751 -1599779 -1585532 -1578141 -1563856 -1553201
19311a553201m781n051L007J2885k164P980M339k779Q188J0374L200o334m19J774
$$ -1553201 -1557982 -1563033 -1560026 -1547141 -1549305 -1541325 -1536986 -1539765 -1531577 -1521203 -1518003 -1524337 -1524756 -1522982
19297a522982J0529N602n938q57J3461K1116L3968O245n401m917M225P743o656
$$ -1522982 -1512453 -1506851 -1512789 -1513646 -1500185 -1479069 -1445101 -1438856 -1444257 -1449174 -1444949 -1437206 -1443862
19284a443862l442L24J7779P31J6847J138k639J5035J8644Q069l17j71J4394J3710
$$ -1443862 -1447304 -1446980 -1429201 -1428470 -1411623 -1410485 -1413124 -1398089 -1379445 -1371376 -1371693 -1371864 -1357470 -1343760
19270a343760M369n996j3993o581R48O257N915N535P323J1118M546J397Q226J7702
$$ -1343760 -1339391 -1345387 -1359380 -1365961 -1365013 -1358756 -1352841 -1347306 -1339983 -1328865 -1324319 -1322922 -1314696 -1296994
19256a296994R054K147p880l937k268k001Q016K5863Q864m22J5691J4541J1132
$$ -1296994 -1287940 -1285793 -1293673 -1297610 -1299878 -1301879 -1293863 -1268000 -1259136 -1259558 -1243867 -1229326 -1218194
19243a218194J336N67J342J88K501m354R966Q77o390KP846J1491L269j909J0514
$$ -1218194 -1216858 -1216291 -1214949 -1214761 -1212260 -1216614 -1206648 -1205771 -1212161 -1212159 -1204313 -1192822 -1189553 -1191462 -1180948
19228a180948J0585K2559N096K82j5664j1113p852Q071K6250J5900P51J0645K436
$$ -1180948 -1170363 -1147804 -1142708 -1142426 -1158090 -1169203 -1177055 -1168984 -1142734 -1126834 -1126083 -1115438 -1113002
19215a113002K4950K571j383O343J792O676J5491Q799M322J2481J686J3153K2133
$$ -1113002 -1088052 -1085481 -1086864 -1080521 -1078729 -1072053 -1056562 -1047763 -1043441 -1030960 -1029274 -1016121 -993988
19202i93988L677J5707K522l922O038J0563O851K270J4165J3923j2654J1979J6624
$$ -993988 -990311 -974604 -972082 -976004 -969966 -959403 -952552 -950282 -936117 -922194 -934848 -922869 -906245
19189i06245J8289J2578O468J7552K0384J4503J8693J9314K1212J7001J9106L1309
$$ -906245 -887956 -875378 -868910 -851358 -830974 -816471 -797778 -778464 -757252 -740251 -721145 -689836
19177f89836M1187L4707M5312N3163N9988O8234Q1192J11200J20702P8516l2859
$$ -689836 -648649 -613942 -568630 -515467 -455479 -387245 -306053 -194853 -74151 4365 -28494
19166b8494k74023n18050n85929m37754j82421J0207Q2797R2236P3614P3856P1416
$$ -28494 -302517 -820567 -1406496 -1844250 -2026671 -2016464 -1933667 -1841431 -1767817 -1693961 -1622545
19155a622545O6812O0699M8079M7846L1985K9624J3892K2362K4974J3563Q400
$$ -1622545 -1555733 -1495034 -1446955 -1399109 -1367124 -1337500 -1323608 -1301246 -1276272 -1262709 -1254309
19144a254309K3582R197K3830J5382P187k350m45Q712J4711K0113J535J09K0430
$$ -1254309 -1230727 -1221530 -1197700 -1182318 -1175131 -1177481 -1177926 -1169214 -1154503 -1134390 -1132855 -1132746 -1112316
19131a112316K0582N157m59J2728M466R139K897J8079P872j1120r10Q473N812
$$ -1112316 -1091734 -1086577 -1087036 -1074308 -1069842 -1060703 -1057806 -1039727 -1031855 -1042975 -1043885 -1035412 -1029600
19118a029600j5676o342K3750J7357O551r482J0631O603L119J1087N142J426P4
$$ -1029600 -1045276 -1051618 -1027868 -1010511 -1003960 -1013442 -1002811 -996208 -993089 -982002 -976860 -975434 -975360
19105i75360Q639J3493Q789Q76j1240k259k729K022K911K0750J6318L394M414
$$ -975360 -966721 -953228 -944439 -943563 -954803 -957062 -959791 -957769 -954858 -934108 -917790 -914396 -909982
19092i09982N922J0654k642J1519j737N28Q552p531M570J580J4908o565O630N043
$$ -909982 -904060 -893406 -896048 -884529 -886266 -885738 -877186 -884717 -880147 -878567 -863659 -870224 -863594 -858551
19078h58551M317J0554p126j4808P745l306L962J4262j1542j121Q294M656J3919
$$ -858551 -854234 -843680 -850806 -865614 -857869 -861175 -857213 -842951 -854493 -855614 -847320 -842664 -828745
19065h28745P204J0698L619j453J1803Q524L195o096j0602J014L050r386j279
$$ -828745 -821541 -810843 -807224 -808677 -796874 -788350 -785155 -791251 -801853 -800839 -797789 -807175 -808454
19052h08454N452R864P757N174M225J129p693O958j2702l55Q907N407J0787M682
$$ -808454 -803002 -793138 -785381 -780207 -775982 -774853 -782546 -775588 -788290 -788645 -779738 -774331 -763544 -758862
19038g58862j33r608J2394J3247j0181O5k328J0616L621J984O902L804r690j2985
$$ -758862 -758995 -768603 -756209 -742962 -753143 -753078 -755406 -744790 -741169 -739185 -732283 -728479 -738169 -751154
19024g51154k58J2094K8569J659J5044J713R88L264L389k643o232J743L760n640
$$ -751154 -751412 -739318 -710749 -709090 -694046 -692333 -691345 -688081 -684692 -687335 -693567 -691824 -688064 -693704
19010f93704m903K263J745k729J0124K3070n125k511K0016O510q099j539k172
$$ -693704 -698607 -696344 -694599 -697328 -687204 -664134 -669259 -671770 -651754 -645244 -653343 -654882 -657054
18997f57054n597O761J2813r458j4146O634K6289R652p525r553m467k282J1940
$$ -657054 -662651 -655890 -643077 -652535 -666681 -660047 -633758 -624106 -631631 -641184 -645651 -647933 -635993
18984f35993P31l247K289M817J271P12J3598K1355l45j6883J2270J5778R191p857
$$ -635993 -635262 -638509 -636220 -631403 -630132 -629420 -615822 -594467 -594812 -611695 -599425 -583647 -574456 -582313
18970e82313j5820k432J7459L510j903l08K78J2083j299k661J5296l853J163K344
$$ -582313 -598133 -600565 -583106 -579596 -581499 -581807 -581529 -569446 -570745 -573406 -558110 -561963 -560800 -558456
18956e58456Q604l333L545J1162r67j4169R47J0350q617R138J3652P92j4620k599
$$ -558456 -549852 -553185 -549640 -538478 -539445 -553614 -552667 -542317 -550934 -541796 -528144 -527352 -541972 -544571
18942e44571N601J1164j580Q55l295l052P750M83O936P380J0549p555j4516m68
$$ -544571 -538970 -527806 -529386 -528531 -531826 -534878 -527128 -526645 -519709 -512329 -501780 -509335 -523851 -524319
18928e24319K972K2644O739o822r459k163P36l290J2527n401j0298j731J1741
$$ -524319 -521347 -498703 -491964 -498786 -508245 -510408 -509672 -512962 -500435 -505836 -516134 -517865 -506124
18915e06124J0555k83M751M366N812O791p537J0860j734n934q891p25R840K605
$$ -506124 -495569 -495852 -491101 -486735 -480923 -474132 -481669 -470809 -472543 -478477 -487368 -488093 -478253 -475648
18901d75648k932J568j484J7964J0578J91l462n532j349r480K413O052O574J0475
$$ -475648 -478580 -477012 -478496 -460532 -449954 -449763 -453225 -458757 -460106 -469586 -467173 -461121 -454547 -444072
18887d44072r076j9005J4885R475K704J404J4311K553j772N337P611k409k5981
$$ -444072 -453148 -472153 -457268 -447793 -445089 -443685 -429374 -426821 -428593 -423256 -415645 -418054 -444035
18874d44035n572K0744Q045J0582J4310M300p055J605j9974r584J1525L010n994
$$ -444035 -449607 -428863 -420818 -410236 -395926 -391626 -398681 -397076 -417050 -426634 -415109 -412099 -418093
18861d18093L568N763j075R460J2406k668j2539N445R497n771N391L248j0560
$$ -418093 -414525 -408762 -409837 -400377 -387971 -390639 -403178 -397733 -388236 -394007 -388616 -385368 -395928
18848c95928P11Q756N759j1892N684l698J87l973o422J1843P251Q141J6323J3340
$$ -395928 -395217 -386461 -380702 -392594 -386910 -390608 -390421 -394394 -400816 -388973 -381722 -373581 -357258 -343918
18834c43918K583j270l185r204m244J539O898K164p29o427R6L115J650j6387k439
$$ -343918 -341335 -342605 -345790 -354994 -359238 -357699 -350801 -348637 -349366 -355793 -355697 -352582 -350932 -367319 -369758
18819c69758P061R03K650l156J5193J3260m395k690j200n111J2723M455m199l184
$$ -369758 -362697 -361794 -359144 -362300 -347107 -333847 -338242 -340932 -342132 -347243 -334520 -330065 -334264 -337448
18805c37448J3164J454Q617M001j2848J4397K1790N97j0655j7173l189o043K5364
$$ -337448 -324284 -322830 -314213 -310212 -323060 -308663 -286873 -286276 -296931 -314104 -317293 -323336 -297972
18792b97972M361Q174N155j719k251P731O432N106J7050j0j3189r165j3846j8434
$$ -297972 -293611 -285437 -280282 -282001 -284252 -276521 -270089 -264983 -247933 -247943 -261132 -270297 -284143 -302577
18778c02577P671J5537K780K5005J4843Q922L306J1107R325m784j2864k8366m5683
$$ -302577 -294906 -279369 -276589 -251584 -236741 -227819 -224513 -213406 -204081 -208865 -221729 -250095 -295778
18765b95778m3331k3707j442R567J7778J0351J3283J9044M579O600M38j015J4688
$$ -295778 -339109 -362816 -364258 -354691 -336913 -326562 -313279 -294235 -289656 -283056 -282618 -283633 -268945
18752b68945q522n218J2267J0224M769l400L82r174p675k340O211J8976J4965
$$ -268945 -277467 -282685 -270418 -260194 -255425 -258825 -258443 -267617 -275292 -277632 -271421 -252445 -237480
18739b37480k490n896L593j4482k007j261L679J3939P220m521p870K184J064J9376
$$ -237480 -239970 -245866 -242273 -256755 -258762 -260023 -256344 -242405 -235185 -239706 -247576 -245392 -244328 -224952
18725b24952p916m082P019O408j64Q37p225K254N30j86O306j645Q909J0875N580
$$ -224952 -232868 -236950 -229931 -223523 -223687 -222850 -230075 -227821 -227291 -227477 -221171 -222816 -213907 -203032 -197452
18710a97452o820j314P629j0606P592l019m560j813j181n290o066M773Q639L089
$$ -197452 -204272 -205586 -197957 -208563 -200971 -203990 -208550 -210363 -211544 -216834 -222900 -218127 -209488 -206399
18696b06399k27Q166M764K206J3232l079o28m212l24O680j1800j3863K329P141
$$ -206399 -206626 -198460 -193696 -191490 -178258 -181337 -181965 -186177 -186501 -179821 -191621 -205484 -203155 -196014
18682a96014J6601Q097r299m983M555P895O859q94k127j712O026J6558r418l010
$$ -196014 -179413 -171316 -180615 -185598 -181043 -173148 -166289 -167183 -169310 -171022 -164996 -148438 -157856 -160866
18668a60866q73o139L659J2959J0328P427j4052m659P452j78M143L801j4237Q965
$$ -160866 -161739 -167878 -164219 -151260 -140932 -133505 -147557 -152216 -144764 -144942 -140799 -136998 -151235 -142270
18654a42270J1748p503m7O361J8551o484o229j704P537P47j1814J5915M26n631
$$ -142270 -130522 -138025 -138072 -131711 -113160 -119644 -125873 -127577 -120040 -119293 -131107 -115192 -114766 -120397
18640a20397p198l160n821n912J958n62J1016l649o31N084P469n32J1652P449
$$ -120397 -127595 -130755 -136576 -142488 -140530 -141092 -130076 -133725 -134356 -129272 -121803 -122335 -110683 -103234
18626a03234o134M56J298j0063P27O373J1410N180n218J271K308J1361J386q55
$$ -103234 -109368 -108912 -107614 -117677 -116950 -110577 -99167 -93987 -99205 -97934 -95626 -84265 -82879 -83734
18612h3734j405j1364K880J3916m105K15o69n037J0634J261l616j747J4556l256
$$ -83734 -85139 -96503 -93623 -79707 -83812 -83597 -84266 -89303 -78669 -77408 -81024 -82771 -68215 -71471
18598g1471j441K777K533l1k554l826m741J1L870J5089J2846O567o492l477k419
$$ -71471 -72912 -70135 -67602 -67633 -70187 -74013 -78754 -78743 -74873 -59784 -46938 -40371 -46863 -50340 -52759
18583e2759k074Q230r023q424P956N49P451l814P728J3150N225J723M481J6084
$$ -52759 -54833 -46603 -55626 -64050 -56094 -55545 -48094 -51908 -44180 -31030 -25805 -24082 -19601 -3517
18569c517j041o768m528K121L47K183J78j505q872l977o16O517J8691N562N394
$$ -3517 -4558 -11326 -15854 -13733 -13386 -11203 -11025 -12530 -21402 -25379 -25995 -19478 -787 4775 10169
18554A0169j6697j6064k99j2759J524P718m397R706J4106o232p029O546K357j1415
$$ 10169 -6528 -22592 -22891 -35650 -34126 -26408 -30805 -21099 -6993 -13225 -20254 -13708 -11351 -22766
18540b2766Q779J2421O71j2311p026Q143J0313o284j027J529L678N343j096L283
$$ -22766 -13987 -1566 -895 -13206 -20232 -12089 -1776 -8060 -9087 -7558 -3880 1463 367 3650
18526C650J3218R66k112p230k465l351o517Q851J802J1586j066R565k386m411
$$ 3650 16868 17834 15722 8492 6027 2676 -3841 5010 6812 18398 17332 26897 24511 20100
18512B0100k21p169M10n194K313j921L554Q037J1235k084o605n126J607M765O644
$$ 20100 19879 12710 13120 7926 10239 8318 11872 19909 31144 29060 22455 17329 18936 23701 30345
18497C0345K700r557m183M317J1652Q399N203N467p583J402R000O946O813j356
$$ 30345 33045 23488 19305 23622 35274 43673 48876 54343 46760 48162 57162 64108 70921 69565
18483F9565L422n189o443j4446J721l802N651L875N699J1853J0253p070r774J2426
$$ 69565 72987 67798 61355 46909 48630 44828 50479 54354 60053 71906 82159 75089 65315 77741
18469G7741K256n825P126n979P5J9076P467k128P773o159k5742r628R933N570
$$ 77741 79997 74172 81298 75319 75394 94470 101937 99809 107582 101423 75681 66053 75986 81556
18455H1556O203l192P994n624r841K661J8818J1407O73l168J1581j0373o304L682
$$ 81556 87759 84567 92561 86937 77096 79757 98575 109982 110655 107487 119068 108695 102391 106073
18441A06073r379k531l302J7921K5404j1397j5061j1108O544N200R498l394l64
$$ 106073 96694 94163 90861 108782 134186 122789 107728 96620 103164 108364 117862 114468 114104
18428A14104L517r385J8939J5512n234l901r022J912n99L100J3165J0472M461
$$ 114104 117621 108236 127175 142687 137453 133552 124530 126442 125843 128943 142108 152580 157041
18415A57041p622L796O67M546k760j1680j2845J9507O740K334L896j78n239j0904
$$ 157041 149419 153215 153882 158428 155668 143988 131143 150650 157390 159724 163620 163442 158203 147299
18401A47299K137M670P649J5873P132n858j5002J7431L533j7226J2806R327l763
$$ 147299 149436 154106 161755 177628 184760 178902 163900 181331 184864 167638 180444 189771 186008
18388A86008j8021o856j0230O381K753J4393P557O29j1588J3250J4349J006l805
$$ 186008 167987 161131 150901 157282 160035 174428 181985 182614 171026 184276 198625 199631 195826
18375A95826K963Q077N584K935N089o851R108L956j9772l120J6379N533n024k649
$$ 195826 198789 206866 212450 215385 220474 213623 222731 226687 206915 203795 220174 225707 220683 218034
18361B18034l507j0431o101J8114J2027j288r974Q483Q314M854J2478J4520M445
$$ 218034 214527 204096 197995 216109 228136 226848 216874 225357 233671 238525 251003 265523 269968
18348B69968k1337j1446o78R090J6072l083j2191J792J3756J1216J6368k1584
$$ 269968 248631 237185 236507 245597 261669 258586 246395 248187 261943 273159 289527 267943
18336B67943j7254N183j179j5820j051N870Q616J6646K0615q909q673J0633M063
$$ 267943 250689 255872 254693 238873 237822 243692 252308 268954 289569 280660 271987 282620 286683
18323B86683j398k276J1713j261l402k412O724R678R552j154l953M200p469j8175
$$ 286683 285285 283009 294722 293461 290059 287647 294371 304049 313601 312447 308494 312694 305225 287050
18309B87050m70P121J3569j856R01R452J0002k1Q109J1974Q804N275Q424q914
$$ 287050 286580 293701 307270 305414 306315 315767 325769 325748 333857 345831 354635 359910 368334 359420
18295C59420k951L563k820j1227p395J4244l197k48J0418K076N675N734J840q328
$$ 359420 356469 360032 357212 345985 338590 352834 349637 349389 359807 361883 367558 373292 375132 366804
18281C66804Q27R173J687J9553j1709j0054P54M858J0800J0958P875J061K702
$$ 366804 367631 376804 378491 398044 386335 376281 377035 381893 392693 403651 411526 412587 415289
18268D15289k259l812O571m63q5j2787j362J7867J0688J628N718M750Q614J491
$$ 415289 413030 409218 415789 415326 415241 402454 401092 418959 429647 431275 436993 441743 450357 451848
18254D51848O752J4253K268J017J725J660j254J298J0133O522j340M588J2428
$$ 451848 458600 472853 475121 476138 477863 479523 478269 479567 489700 496222 494882 499470 511898
18241E11898L576p263J1481J2442M230J8608L910j6413j0850P125k068O197J1493
$$ 511898 515474 508211 519692 532134 536364 554972 558882 542469 531619 538744 536676 542873 554366
18228E54366k386Q421m14q205j599J8340J8381j5882k223o298R696J5805R781
$$ 554366 551980 560401 559987 551782 550183 568523 586904 571022 568799 562501 572197 588002 597783
18215E97783Q744N751O588O880Q792p23l013J5428J4818R645J3213J9430J2374
$$ 597783 606527 612278 618866 625746 634538 633815 630802 646230 661048 670693 683906 703336 715710
18202G15710j1071J993J4708R964R942P491j106m711J942K1586J9434J5749J3767
$$ 715710 704639 706632 721340 731304 741246 748737 747631 742920 744862 766448 785882 801631 815398
18189H15398P161L481L335L158k001K3314J0415j0711K2904J8002J7420K2100
$$ 815398 822559 826040 829375 832533 830532 853846 864261 853550 876454 894456 911876 933976
18177I33976J1574J0402J5724J1120N822O919J7073K4625Q758K559K3436K6815
$$ 933976 945550 955952 971676 982796 988618 995537 1012610 1037235 1045993 1048552 1071988 1098803
18165A098803J6672J6345J3098K9763J9342J7882K5071L3497K4815J9923J8080
$$ 1098803 1115475 1131820 1144918 1174681 1194023 1211905 1236976 1270473 1295288 1315211 1333291
18154A333291K5898L0984L2589L2833M0332L3970L3708L4352M6796L8694M2858
$$ 1333291 1359189 1390173 1422762 1455595 1495927 1529897 1563605 1597957 1644753 1683447 1726305
18143A726305M8433N2503M2636M5299M5924O9216O4133O5984P9493P4095Q8160
$$ 1726305 1774738 1827241 1869877 1915176 1961100 2030316 2094449 2160433 2239926 2314021 2402181
18132B402181R8303J08826J17399J04707J17092J40990J73761J69889J91516K22036
$$ 2402181 2500484 2609310 2726709 2831416 2948508 3089498 3263259 3433148 3624664 3846700
18122C846700K60456K99075L34071L83937M49361N27420O43504Q07105J001855
$$ 3846700 4107156 4406231 4740302 5124239 5573600 6101020 6744524 7551629 8553484
18113H553484J268591J562912J656137P62996k141149o477131q501629o669575
$$ 8553484 9822075 11384987 13041124 13804120 11662971 5185840 -3315789 -9985364
18105i985364k845043M35552J317501J246455J066189R76675Q51904P18707O03590
$$ -9985364 -12830407 -12394855 -11077354 -9830899 -8764710 -7788035 -6936131 -6217424 -5613834
18096e613834N25664M27477L71004L19787K75848K44796K15629J65704J61643
$$ -5613834 -5088170 -4660693 -4289689 -3969902 -3694054 -3449258 -3233629 -3067925 -2906282
18087b906282J57894J31246J29312J18940J10862R5376J00301J00182P5837P6509
$$ -2906282 -2748388 -2617142 -2487830 -2368890 -2258028 -2162652 -2062351 -1962169 -1886332 -1809823
18077a809823O3662N6817O5708N7383M8977M9900L8313M6522L9150M8129L4062
$$ -1809823 -1746161 -1689344 -1623636 -1566253 -1517276 -1467376 -1429063 -1382541 -1343391 -1295262 -1261200
18066a261200L9747L3692L1746L0432L9579K8751P928K3470J5904L1169J9328
$$ -1261200 -1221453 -1187761 -1156015 -1125583 -1086004 -1057253 -1049325 -1025855 -1009951 -978782 -959454
18055i59454J3002R260K2123J3441J5226L0922J7952j2817J51K3256J7868J5682
$$ -959454 -946452 -937192 -915069 -901628 -886402 -855480 -837528 -850345 -850194 -826938 -809070 -793388
18043g93388K2089J6390K5195K8049P885M067J594J1694L4738L4570J8544R782
$$ -793388 -771299 -754909 -729714 -701665 -693780 -689713 -688119 -676425 -641687 -607117 -588573 -578791
18031e78791n598l22J9084J6236Q990J993J0223N032N15K7433L0101K0084K819
$$ -578791 -584389 -584711 -565627 -549391 -540401 -538408 -528185 -523153 -522638 -495205 -465104 -445020 -442201
18018d42201L390J9103J0912J5766L759p874j2945j7322q797K204O630M418J032
$$ -442201 -438811 -419708 -408796 -393030 -389271 -397145 -410090 -427412 -436209 -434005 -427375 -422957 -421925
18005d21925j840J2748P940o115k697l997J4422L477J5641J8119L242j466K162
$$ -421925 -423765 -411017 -403077 -409192 -411889 -415886 -401464 -397987 -382346 -364227 -360985 -362451 -360289
17992c60289n382J6105Q316N221J3203J3801N189m14J493P513J3836J5987J1880
$$ -360289 -365671 -349566 -341250 -336029 -322826 -309025 -303836 -304250 -302757 -295244 -281408 -265421 -253541
17979b53541n031j4096K531N568o4j52J1030J9782J2873P448J2126R817l365p417
$$ -253541 -258572 -272668 -270137 -264569 -264633 -264785 -253755 -233973 -221100 -213652 -201526 -191709 -195074 -202491
17965b02491J507J6788J7568P069j772O045N223J2529Q550N284r956q198l380
$$ -202491 -200984 -184196 -166628 -159559 -161331 -155286 -150063 -137534 -128984 -123700 -133656 -141854 -145234
17952a45234K161M918L377m068l71L360J541j1552j2356o529p192p437q196j2424
$$ -145234 -143073 -138155 -134778 -138846 -139217 -135857 -134316 -145868 -158224 -164753 -171945 -179382 -187578 -200002
17938b00002M611L849j1880j1550J3490O443P40l008M891M766J1795K803N613
$$ -200002 -195391 -191542 -203422 -214972 -201482 -195039 -194299 -197307 -192416 -187650 -175855 -173052 -167439
17925a67439P302M618M004R012J0914K3461J2871j840K537q102J117P74m629N538
$$ -167439 -160137 -155519 -151515 -142503 -131589 -108128 -95257 -97097 -94560 -102662 -101545 -100771 -105400 -99862
17911i9862Q972J9859K9m901J977m848O132Q984Q533j2016o158j0893m208J206
$$ -99862 -90890 -71031 -71002 -75903 -73926 -78774 -72642 -63658 -55125 -67141 -73299 -84192 -88400 -87194
17897h7194P371m349j123l260m356q971L166Q811L099j925k465J133O113j3088
$$ -87194 -79823 -84172 -85295 -88555 -92911 -101882 -98716 -89905 -86806 -88731 -91196 -90063 -83950 -97038
17883i7038j5132l28M456M766O542N508l41m36P255J4379R298m911P150L967n624
$$ -97038 -112170 -112498 -108042 -103276 -96734 -91226 -91567 -92003 -84748 -70369 -61071 -65982 -58832 -54865 -60489
17868f0489r514k994J6684J1483J6547R417j0643R607J7724J916j4312O993p498
$$ -60489 -70003 -72997 -56313 -44830 -28283 -18866 -29509 -19902 -2178 -262 -14574 -7581 -15079
17855a5079o873J430M749O551o111O67J5739J506q619j2091q835P736J3110Q496
$$ -15079 -21952 -20522 -15773 -9222 -15333 -14666 1073 2579 -6040 -18131 -26966 -19230 -6120 2376
17841B376J2926J8318L829j8021j5101J945J373p458J346J0782P278R014o388
$$ 2376 15302 33620 37449 19428 4327 6272 7645 187 1533 12315 19593 28607 22219
17828B2219j3484k46m275J0324J0661N190N414M126q068Q231j0505L504J2406
$$ 22219 8735 8489 4214 14538 25199 30389 35803 39929 31861 40092 29587 33091 45497
17815D5497m825j6413J826L638M88p110m801N748P261R291J49R405J0408n851
$$ 45497 40672 24259 26085 29723 30211 23101 18300 24048 31309 40600 40749 50154 60562 54711
17801E4711R426m891j7621j1J2813k126m364m687k31R55k641k1R044R813R18L383
$$ 54711 64137 59246 41625 41614 54427 52301 47937 43250 43019 43974 41333 41312 50356 60169 61087 64470
17785F4470Q7k035o109Q801R800n486M891m324j3540N857O401P218k487l639M696
$$ 64470 64557 62522 56413 65214 75014 69528 74419 70095 56555 62412 68813 76031 73544 69905 74601
17770G4601n86L644K398R406J2060q692J121j5031j4303O51J2662R568k039p726
$$ 74601 74015 77659 80057 89463 101523 92831 93952 78921 64618 65269 77931 87499 85460 77734
17756G7734N118j4999j0752o797K1433P910M429o697m367M936J3890q276N665
$$ 77734 82852 67853 57101 50304 71737 79647 84076 77379 73012 77948 91838 83562 89227
17743H9227P962k915J4194J054K674J596j052j1923o212k282J1788N008r909j111
$$ 89227 97189 94274 108468 109522 112196 113792 112740 100817 94605 92323 104111 109119 99210 98099
17729I8099L562O16j515J2259Q415l977p071k566J5204L2Q737L537j963o103p118
$$ 98099 101661 102277 100762 113021 121436 117459 110388 107822 123026 123058 131795 135332 133369 127266 120148
17714A20148j081k34k181l073M154R918M827k856j0625J0975J0219r243r798q948
$$ 120148 119067 118833 116652 113579 117733 127651 132478 129622 118997 129972 140191 130948 121150 112202
17700A12202J15K1006l623P22J6788J8085o360p633l359Q250Q037r046l150M248
$$ 112202 112317 133323 129700 130422 147210 165295 158935 151302 147943 156193 164230 155184 152034 156282
17686A56282l364j663J2307j0471l270j0934P208J1535p687l878J2937P952n392
$$ 156282 152918 151255 163562 153091 149821 138887 146095 157630 149943 146065 159002 166954 161562
17673A61562j437Q102M707o192J595k458n940l308p932K260j626p38R100J5422
$$ 161562 160125 168227 172934 166742 168337 165879 159939 156631 148699 150959 149333 148595 157695 173117
17659A73117P318L270Q947r224j0522k689K556p102j2842M175O376Q187R565J6510
$$ 173117 180435 183705 192652 183428 172906 170217 172773 165671 152829 157004 163380 171567 181132 197642
17645A97642k639j3654M494n311j5671Q396m828o218j0070N678J3050R185O632
$$ 197642 195003 181349 185843 180532 164861 173257 168429 162211 152141 157819 170869 180054 186686
17632A86686N209J4969L952o523O429R299L269r852j6960j3918j0611J2329J0071
$$ 186686 191895 206864 210816 204293 210722 220021 223290 213438 196478 182560 171949 184278 194349
17619A94349k446J1464J5197l107n016q519j1628o789P568J1090q23l827J5318
$$ 194349 191903 203367 218564 215457 210441 201922 190294 183505 191073 202163 201340 197513 212831
17606B12831M736p168j2291l0J1907J1143R16p19N053J32m117n772j0433m347
$$ 212831 217567 210399 198108 198078 209985 221128 222044 221325 226378 226510 222393 216621 206188 201841
17592B01841J891j592J0860j500j6588L466j893O588J0613P941m210R999K1126
$$ 201841 203732 202140 213000 211500 194912 198378 196485 203073 213686 221627 217417 227416 248542
17579B48542L485k4070l868l923L251O889L204q93j5543j511p194j0499j0454
$$ 248542 252027 227957 224089 220166 223417 230306 233510 232617 217074 215563 208369 197870 187416
17566A87416J0601J4452R60J0895J0318j922p079K400Q20N84N500P981R184L135
$$ 187416 198017 212469 213429 224324 234642 232720 225641 228041 228861 229445 234945 242926 252110 255245
17552B55245J014m721j0528n177L647K797j979J973J0390L405j1239j0000j4693
$$ 255245 256259 251538 241010 235833 239480 242277 240298 242271 252661 256066 244827 234827 220134
17539B20134n707R751J7196Q857M98j0553N42o063J0380J1082J542j3935L231
$$ 220134 214427 224178 241374 250231 250729 240176 240718 234655 245035 256117 257659 243724 246955
17526B46955M479P73K511j3760n251L302J9046Q117j367N50M678p246j5940n493
$$ 246955 251434 252207 254718 240958 235707 239009 258055 266172 264805 265355 270033 262787 246847 241354
17512B41354m417Q133K128N609Q448p93P43L711Q418l676n423j342N810M499k122
$$ 241354 236937 245070 247198 252807 261255 260462 261205 264916 273334 269658 264235 262893 268703 273202 271080
17497B71080n173l377j2p449l880k247n016L755J0928J0968M880O686K770R44
$$ 271080 265907 262530 262518 255069 251189 248942 243926 247681 258609 269577 274457 281143 283913 284857
17483B84857o676r715n250J1250R374J1839m639j306K960r76N715r34l797j249
$$ 284857 278181 268466 263216 274466 283840 295679 291040 289734 292694 291718 297433 296499 292702 291453
17469B91453j0769P933K6220k692j3289l987j875M016J4654P743P306n184L053
$$ 291453 280684 288617 314837 312145 298856 294869 292994 297010 311664 319407 326713 321529 324582
17456C24582j1524q653j009P485L201K107R091J794K080j343K0326R016J1301
$$ 324582 313058 304405 303396 310881 314082 316189 325280 327074 329154 327811 348137 357153 368454
17443C68454L381l8704l2920l6211k2318j4366J6049L546J3519J2466m884N745
$$ 368454 371835 333131 300211 264000 241682 227316 243365 246911 260430 272896 268012 273757
17431B73757j212k198J1054l24L195j0781L978J881Q795O80j050j001l229K164
$$ 273757 272545 270347 281401 281077 284272 273491 277469 279350 288145 288825 287775 286774 283545 285709
17417B85709J431R924M326j0845p72k04Q458M718l212k897k150P089M567J7490
$$ 285709 287140 297064 301390 290545 289773 289569 298027 302745 299533 296636 294486 301575 306142 323632
17403C23632p380q258P12p39p001j1317M050O208k260L315k0074p385J3761K3696
$$ 323632 316252 307994 308706 307967 300966 289649 293699 299907 297647 300962 280888 273503 287264 310960
17389C10960J2379l771O28L418l750J1218J8361n168n736k524j4741m904N215
$$ 310960 323339 319568 320196 323614 319864 331082 349443 344275 338539 336015 321274 316370 321585
17376C21585k476q717m112J0754K2787q058j6303L189L660J257n221m507J0721
$$ 321585 319109 310392 306280 317034 339821 331763 315460 318649 322309 323566 318345 313838 324559
17363C24559J0947L910j0667j3605L757j0988J420J566k737J5192K998o60j3814
$$ 324559 335506 339416 328749 315144 318901 307913 309333 310899 308162 323354 326352 325692 311878
17350C11878k041R893J1702K1759J3597m304j5423j7957Q80n785q22P89N599N014
$$ 311878 309837 319730 331432 353191 366788 362484 347061 329104 329984 324199 323377 324166 329765 334779
17336C34779Q849L329r962q189k099J3736K793j5290l352j41M724p744J1850K524
$$ 334779 343628 346957 336995 328806 326707 340443 343236 327946 324594 324453 329177 321433 333283 335807
17322C35807P297O689m074J674O318K539M402k967K003Q0R832L937q700J791M517
$$ 335807 343104 349793 345719 347393 353711 356250 360652 357685 359688 359768 369600 373537 364837 366628 371145
17307C71145j1353j969R663p009J0301q32J297j6490r930J2671J751r63q110j3871
$$ 371145 359792 357823 367486 360477 370778 369946 371243 354753 344823 357494 359245 358282 350172 336301
17293C36301P980j210M394J5331l72m042r575p049J4234J6902N872N303j8881
$$ 336301 344281 343071 347465 362796 362424 358382 348807 341758 355992 372894 378766 384069 365188
17280C65188j9330j109Q300k190M205K340J453J908R764N1j1543K892J4811l480
$$ 365188 345858 344749 353049 350859 355064 357404 358857 360765 370529 370580 359037 361929 376740 373260
17266C73260k976M521m418j9140j1538P412J4416J4311q691q714M895j16O599
$$ 373260 370284 374805 370387 351247 339709 347121 361537 375848 367157 358443 363338 363222 369821
17253C69821j810l153j1964l460R529J0974J3905l391j1096j0567M714k946n77
$$ 369821 368011 364858 352894 349434 358963 369937 383842 380451 369355 358788 363502 360556 359979
17240C59979N550Q649r327j225O752J2699J603o221j149J0460R17o24L541p815
$$ 359979 365529 374178 364851 363626 370378 383077 384680 378459 377310 387770 388687 388063 391604 383789
17226C83789j3277n104O30l675n66R425L243J1016L923J1569N194r80j1901L211
$$ 383789 370512 365408 366038 362363 361797 371222 374465 385481 389404 400973 406167 405187 393286 396497
17212C96497j1961p335L999p791m49K397M112J1229Q383m856J039m776J406O382
$$ 396497 384536 377201 381200 373409 372960 375357 379469 390698 399081 394225 395264 390488 391894 398276
17198C98276l886q329K488R098O502j730j9643j741J91R634J5178l767q22J5309
$$ 398276 394390 386061 388549 397647 404149 402419 382776 381035 381226 390860 406038 402271 401449 416758
17184D16758N787j1923J1094m780j5618j1215M11J1035R424m109R04J0862j921
$$ 416758 422545 410622 421716 416936 401318 390103 390514 401549 410973 406864 407768 418630 416709
17171D16709j6728K203L141Q362M913j3302K593l223K62o156p712Q130K116J0803
$$ 416709 399981 402184 405325 413687 418600 405298 407891 404668 404930 398774 391062 399192 401308 412111
17157D12111P820k58n972j1661q435O012J974N104K129O862O381K585k078p887
$$ 412111 419931 419673 413701 402040 393605 399617 401591 406695 408824 415686 422067 424652 422574 414687
17143D14687j6006Q492j660j079Q405K650r103R845r622n091J0570K1579q194
$$ 414687 398681 407173 405513 404434 412839 415489 406386 416231 406609 401518 412088 433667 425473
17130D25473q919K93Q920J2785M411j0491k796n619M826j474l869K303p658j409
$$ 425473 416554 416847 425767 438552 442963 432472 429676 424057 428883 427409 423540 425843 418185 416776
17116D16776k914p408k754J6362P651o370l07P966J1343o124r621P685L119q122
$$ 416776 413862 406454 403700 420062 427713 421343 421036 429002 440345 434221 424600 432285 435404 427282
17102D27282m873K11K490K947j125l398k085j1058O391j706J6009K517k1487m065
$$ 427282 422409 422620 425110 428057 426932 423534 421449 410391 416782 415076 431085 433602 412115 408050
17088D08050J441j1547R768J0567Q523k161M064j967j643O695n56M294k0822j1758
$$ 408050 409491 397944 407712 418279 426802 424641 428705 426738 425095 431790 431234 435528 414706 402948
17074D02948k74J3609J7271J4041O227j1995j6585j814R160J7923L431K964R710
$$ 402948 402674 416283 433554 447595 453822 441827 425242 423428 432588 450511 453942 456906 466616
17061D66616m240k0456j4823j409j296P242P41m649J080L854q758J3886J9237
$$ 466616 462376 441920 427097 425688 424392 431634 432375 427726 428806 432660 423902 437788 457025
17048D57025L15j0132q415m636m507N73P390Q395P201O930m083o148N234j435
$$ 457025 457340 447208 438793 434157 429650 430223 437613 446008 453209 460139 456056 449908 455142 453707
17034D53707k861P97Q036Q922N085k0503j638k736J1269n12l040q761L125J1319
$$ 453707 450846 451643 459679 468601 473686 453183 451545 448809 460078 459566 456526 447765 450890 462209
17020D62209J9537j100o825o670o001k270K529m23K844j3605m862K660R296O706
$$ 462209 481746 480646 473821 467151 461150 458880 461409 460986 463830 450225 445363 448023 457319 464025
17006D64025l667N372k001n903J642O71k643p393P62O727j245L745N285n095k350
$$ 464025 460358 465730 463729 457826 459468 460139 457496 450103 450865 457592 456347 460092 465377 460282 457932
16991D57932j8475J0016J0210L503L491O901k85o07j4423k557p586r74K318J2781
$$ 457932 439457 449473 459683 463186 466677 473578 473293 472686 458263 455706 448120 447146 449464 462245
16977D62245j380J4317n80n017m000k81J753M413q087J642P446m296o517J7p143
$$ 462245 460865 475182 474602 469585 465585 465304 467057 471470 463383 465025 472471 468175 461658 461675 454532
16962D54532L771L004R259N968L862J0770P711j1105L6P91j1064J149J3398K29
$$ 454532 458303 461307 470566 476534 480396 491166 498877 487772 487808 488599 477535 478684 492082 492311
16948D92311L272o692k649J570K56m086q836Q817J2669o043r514k798J418j2694
$$ 492311 495583 488891 486242 487812 488068 483982 475146 483963 496632 490589 481075 478277 479695 467001
16934D67001j13J0656Q793Q304l038J0677Q744n97p678q258r153K285J199j744
$$ 467001 466888 477544 486337 494641 491603 502280 511024 510427 502749 494491 485338 487623 488822 487078
16920D87078N928p3l819j31O33M328N496q519M487K448j2101N999m589K515N217
$$ 487078 493006 492933 489114 488983 489616 493944 499440 490921 495408 497856 485755 491754 487165 489680 494897
16905D94897N766Q063l35L513N663m287K454R469l137j5746j4049m028j952J0717
$$ 494897 500663 508726 508391 511904 517567 513280 515734 525203 522066 506320 492271 488243 486291 497008
16891D97008r2j2628k2587K3992J4761P44k199P503N320j1331k1895nP960O666
$$ 497008 496916 484288 461701 485693 500454 501198 498999 506502 511822 500491 478596 478591 486551 493217
16877D93217N024K497m27K041Q225M783K931J3615L433n934O562M408k521K751
$$ 493217 498241 500738 500311 502352 510577 515360 518291 531906 535339 529405 535967 540375 537854 540605
16863E40605K016o38j9947q513N949q569K560m948m665O605J3293M968q561J2909
$$ 540605 542621 541983 522036 513523 519472 510903 513463 508515 503850 510455 523748 528716 520155 533064
16849E33064M271N039L2j2530p328k736L66j202P427j138q238O189J283j5174
$$ 533064 537335 542374 542406 529876 522548 519812 520178 518976 526403 525265 517027 523216 524499 509325
16835E09325O053j742j596M668n895N890J2757L055K466Q503j5765k0845r104
$$ 509325 515378 513636 512040 516708 510813 516703 529460 532515 534981 543484 527719 506874 497770
16822D97770L794J3703P066K904q902o434M219l785R012J5235p024m172Q164o976
$$ 497770 501564 515267 522333 525237 516335 509901 514120 510335 519347 534582 527558 523386 531550 524574
16808E24574p132p954j45L552J1620M888n406p399N80J4439J05Q825m316p121
$$ 524574 517442 509488 509343 512895 524515 529403 523997 516598 517178 531617 531722 540547 536231 529110
16794E29110N964J2124J417j3089m266J805J1874K082j2553M557o807m56L864
$$ 529110 535074 547198 548615 535526 531260 533065 544939 547021 534468 539025 532218 531762 535626
16781E35626m264P944K3774r895j3058l334o84Q49m725J1310L482p453N795m437
$$ 535626 531362 539306 563080 553185 540127 536793 536109 536958 532233 543543 547025 539572 545367 540930
16767E40930L864R052P306M16j2832n820k553o109n049M261J0706J200L382P714
$$ 540930 544794 553846 561152 561568 548736 542916 540363 534254 529205 533466 544172 545372 548754 556468
16753E56468j0740Q306K0107L320L9J16p330j0537N092q458p167j5018q951J2081
$$ 556468 545728 554034 574141 577461 577500 577616 570286 559749 564841 556383 549216 534198 525247 537328
16739E37328N671M174k234N723K593n463j376J624n326j0055o581J2634K0667
$$ 537328 542999 547173 544939 550662 553255 547792 546416 548040 542714 532659 526078 538712 559379
16726E59379J2155j821m70O235l536N677l411M139K117o467j5027k67J1006l502
$$ 559379 571534 569713 569243 575478 571942 577619 574208 578347 580464 573997 558970 558703 569709 566207
16712E66207k029q422N895J0784j993M911P909j1904j0985j201p468l699m942
$$ 566207 564178 555756 561651 572435 570442 575353 583262 571358 560373 559172 551704 548005 543063
16699E43063J1725L364n198J0284P200q395p121q104L442p020o270J0515P817
$$ 543063 554788 558152 552954 563238 570438 562043 554922 546818 550260 543240 536970 547485 555302
16686E55302n68M502J0279J801n103N085p177j1708j1185l474O391J0587N667
$$ 555302 554734 559236 569515 571316 566213 571298 564121 552413 541228 537754 544145 554732 560399
16673E60399J058o322J009j0803n891J6746J9176P269L938o49l564J845M223M359
$$ 560399 561457 555135 556144 545341 539450 556196 575372 582641 586579 585930 582366 584211 588434 592793
16659E92793l330M264M663L424k3178p470R830r207q192q11J0633O284J277M78
$$ 592793 589463 593727 598390 601814 578636 571166 580996 571789 563597 562786 573419 579703 580980 581458
16645E81458l660J3882R769l838q583r318o03K287J1172m796j04n920j1522L918
$$ 581458 577798 591680 601449 597611 589028 579710 579107 581394 592566 587770 587666 581746 570224 574142
16631E74142n805r758j283K0702J3234j1844j6002L72L292J5187N885n133O091
$$ 574142 568337 558579 557296 577998 591232 579388 563386 563758 567050 582237 588122 582989 589080
16618E89080J779Q745M375j2184k858O984k771p514Q275p661J0774L9m801j680
$$ 589080 590859 599604 603979 591795 588937 595921 593150 585636 593911 586250 597024 597063 592262 590582
16604E90582Q067N180k828k228k740j3434k654J4571J0018l912J738R88R008m544
$$ 590582 598649 603829 601001 598773 596033 582599 579945 594516 604534 600622 602360 603348 612356 607812
16590F07812R880M972l340k950J567O457k461m745j4033K406J328P427p43m050
$$ 607812 617692 622664 619324 616374 617941 624398 621937 617192 603159 605565 606893 614320 613577 609527
16576F09527P23R87K278O597L767j4740m528k672k705p625N010P085J5903O089
$$ 609527 610250 611237 613515 620112 623879 609139 604611 601939 599234 591609 596619 603704 619607 625696
16562F25696k4318r54J4780J203l002M599J052m214L41j3356r28N199j832O932
$$ 625696 601378 600424 615204 616407 613405 618004 619056 614842 615183 601827 600899 606098 604266 611198
16548F11198r795l496P131K808N783q554L488L667L015L222P039j1801m100j172
$$ 611198 601403 597907 605038 607846 613629 605075 608563 612230 615245 618467 625506 613705 609605 608433
16534F08433k354J7246k383j701J6058Q874p825J893J0140j1292j8056J626P066
$$ 608433 606079 623325 620942 619241 635299 644173 636348 638241 648381 637089 619033 620659 627725
16521F27725j1396j679O780O874J321r562n815K799j077j652l351j1432k48K4163
$$ 627725 616329 614650 621430 628304 629625 620063 614248 617047 615970 614318 610967 599535 599287 623450
16507F23450J1223Q200j4068k411R420Q138o78j1027r221j7764l090Q177J1082
$$ 623450 634673 642873 628805 626394 635814 643952 643274 632247 623026 605262 602172 610349 621431
16494F21431O942l952J2821j187j9148r259m367J3362Q04q113J2837l736r642
$$ 621431 628373 624421 637242 636055 616907 607648 603281 616643 617447 609334 622171 618435 608793
16481F08793K5269L2238O234k1602r062q954n658m137m550p27Q502N288O513J0160
$$ 608793 634062 666300 672534 650932 641870 632916 627258 623121 618571 617844 626346 631634 638147 648307
16467F48307N526r694l925j6770K302J7801o498N609O887q62j64j0882r09J4614
$$ 648307 653833 644139 640214 623444 625746 643547 637049 642658 649545 648683 648519 637637 636728 651342
16453F51342p755m846J9606l556k850J7162j522j0291K423M859L959Q080K220
$$ 651342 643587 638741 658347 654791 651941 669103 667581 657290 659713 664572 668531 676611 678831
16440F78831j5095j4967p845J410l685J1841j892j2186Q055O059K0754M724j834
$$ 678831 663736 648769 640924 642334 638649 650490 648598 636412 644467 650526 671280 676004 674170
16427F74170r413j6046j0309k270J911o697K39N891n430j748J1956J0212q254
$$ 674170 664757 648711 638402 636132 638043 631346 631585 637476 632046 630298 642254 652466 644212
16414F44212p672o521Q761M579P656L725J984j0353p91Q853m902O885O84p956
$$ 644212 636540 630019 638780 643359 651015 654740 656724 646371 645580 654433 649531 656416 657100 649144
16400F49144n808k422n249M482R857N861Q296l064r95M395M120J63K666n003l735
$$ 649144 643336 640914 635665 640147 650004 655865 664161 661097 660102 664497 668617 668780 671446 666443 662708
16385F62708J0310m334p124O03J456J2200J7021m809o680n128l032q906j1098
$$ 662708 673018 668684 661560 662163 663619 675819 692840 688031 681351 676223 673191 664285 653187
16372F53187R080P938O91m800p86k337M662P402O030N027R544o257o879j3885
$$ 653187 662267 670205 670896 666096 665310 662973 667635 675037 681067 686094 695638 689381 682502 668617
16358F68617J3516K8r660Q376M457m082q407o237J2173M211J492J2974N046q642
$$ 668617 682133 682161 672501 680877 685334 681252 672845 666608 678781 682992 684484 697458 702504 693862
16344F93862p720k0018K547K14o100M839J441R227L196n495J036M904K680M666
$$ 693862 686142 666124 668671 668885 662785 667624 669065 678292 681488 675993 677029 681933 684613 689279
16330F89279j125r016J0664j26r164j4364j8194J1445O551J6647J5715K415L638
$$ 689279 688154 679138 689802 689676 680512 666148 647954 659399 665950 682597 698312 700727 704365
16317G04365j1982m173J5260q846k3190R958N839n989k91p359o733R192Q903l990
$$ 704365 692383 688210 703470 694624 671434 681392 687231 681242 680951 673592 666859 676051 684954 680964
16303F80964j1202J1137J9721l641r724k746q768j0843J6881J5664K718l194r81
$$ 680964 669762 680899 700620 696979 687255 684509 675741 664898 681779 697443 700161 696967 695986
16290F95986j1773q197J0280j1790K671M078j252L640J0103J98o263j1642j477
$$ 695986 684213 676016 686296 674506 677177 681255 680003 683643 693746 693944 687681 676039 674562
16277F74562R235R236L535n155l328K022O213O12J96r06O633k021L13J2272k75
$$ 674562 683797 693033 696568 691413 688085 690107 696320 696932 697128 696222 702855 700834 701147 713419 713144
16262G13144p201J353L864p867N984J6735j0637j1006r256j886J703P839N089
$$ 713144 705943 707296 711160 703293 709277 726012 715375 704369 695113 693227 694930 702769 707858
16249G07858j024O557P266k128O651J907O87p129k501q955k829N349J7248N725
$$ 707858 706834 713391 720657 718529 725180 727087 727774 720645 718144 709189 706360 711709 728957 734682
16235G34682m778n388j1249k811K416K999L449p800L092J362p393J41R261N069
$$ 734682 729904 724516 713267 710456 712872 715871 719320 711520 714612 715974 708581 708722 717983 723052
16221G23052R91j009P748R316q209m764j0651L360p95o276m530J0011J0035P408
$$ 723052 724043 723034 730782 740098 731889 727125 716474 719834 719039 712763 708233 718244 728279 735687
16207G35687N107p866q615M161J3664L131o580o373l999q341j6646K45N888n1
$$ 735687 740794 732928 724313 728474 742138 745269 738689 732316 728317 719976 703330 703575 709463 709412
16193G09412Q604J2679Q927R46J240J0851j1583j835J69o75j739j495n063r987
$$ 709412 718016 730695 739622 740568 741808 752659 741076 739241 739410 738735 736996 735501 730438 720451
16179G20451P257J592R798r648k511R889k915j2067l235O948J1061M244N255j7101
$$ 720451 727708 729300 739098 729450 726939 736828 733913 721846 718611 725559 736620 740864 746119 729018
16165G29018q749J2605N532j3797j0917J500O143J2961M196q316l216j071J4345
$$ 729018 720269 732874 738406 724609 713692 715192 721335 734296 738492 730176 726960 725889 740234
16152G40234L844q74N029l042L023O393k022L415O051j032l294Q726R842k8260
$$ 740234 744078 743204 748233 745191 748214 754607 752585 756000 762051 761019 757725 766451 776293 748033
16138G48033q588j874L206J204J3515o611j8379p176K039O934k268N833L503K54
$$ 748033 739445 737571 740777 741981 755496 748885 730506 723330 725369 732303 730035 735868 739371 739625
16124G39625p062M349m628K265P130O547m166K154p107Q150L501J968k617J0998
$$ 739625 732563 736912 732284 734549 741679 748226 744060 746214 739107 747257 750758 752726 750109 761107
16110G61107o260o221Q99l135m657N046j454M259J1482N584r158p848K500p767
$$ 761107 754847 748626 749525 746390 741733 746779 745325 749584 761066 766650 757492 749644 752144 744377
16096G44377n498J089J4316O505J291m790j561m794j911M762q282l067L550J4438
$$ 744377 738879 739968 754284 760789 762080 757290 755729 750935 749024 753786 745504 742437 745987 760425
16082G60425L916J3895Q514q178m033Q369q676k979j044k86K052j877l882q564
$$ 760425 764341 778236 786750 778572 774539 782908 774232 771253 770209 769923 771975 770098 766216 757652
16068G57652l590j6190L403O303N74J1720J4461N690q208P527j17m519j4405M39
$$ 757652 754062 737872 741275 747578 748152 759872 774333 780023 771815 779342 779225 774706 760301 760740
16054G60740J050Q711r33l82r84J0411J0708r611j4842j1808P452J4761O146J1482
$$ 760740 761790 770501 769568 769186 768202 778613 789321 779710 764868 753060 760512 775273 781419 792901
16040G92901j304M603l262j6944j1872O730Q269m75J3078m712j714K2800o003
$$ 792901 791597 796200 792938 775994 764122 770852 779121 778646 791724 787012 785298 808098 802095
16027H02095j7084O375j191j4038l319M555j564j493O282K743k045K663Q566N139
$$ 802095 785011 791386 790195 776157 772838 777393 775829 774336 780618 783361 781316 783979 792545 797684
16013G97684r057q384J60O231K054j4187j3554J5464P860j0056n640q103N578
$$ 797684 788627 780243 780403 786634 788688 774501 760947 776411 784271 774215 768575 760472 766050
16000G66050J4465Q970o021j2177J2593P177K246j0002r55P44j67J2978O722P005
$$ 766050 780515 789485 783464 771287 783880 791057 793303 783301 782346 783090 782923 795901 802623 809628
15986H09628j0066j7883J071P508J7927J388j5205l689j2337j488N203J7983P115
$$ 809628 799562 781679 782750 790258 808185 809573 794368 790679 778342 776854 782057 800040 807155
15973H07155O590J719q295j3583M658J4748j3926L968k259j1333l969K1009R659
$$ 807155 813745 815464 807169 793586 798244 812992 799066 803034 800775 789442 785473 806482 816141
15960H16141j4837m386P197k417K715J884J3249J456n875m061o001l126O332n371
$$ 816141 801304 796918 804115 801698 804413 806297 819546 821002 815127 811066 805065 801939 808271 802900
15946H02900p158P845j69N787J3279k777k452J2111j863j5895r051J1930K487
$$ 802900 795742 803587 803418 809205 822484 819707 817255 829366 827503 811608 802557 814487 816974
15933H16974q629k146k700M574K327l923P266n257j4410n595R941J4243o0m541
$$ 816974 808345 806199 803499 808073 810400 806477 813743 808486 794076 788481 798422 812665 812605 808064
15919H08064m55l622J5475O056j062j3739K542J0510J1906J38o793j3214l039
$$ 808064 807609 803987 819462 825518 824456 810717 813259 823769 835675 835813 829020 815806 812767
15906H12767Q574j773j1742k840L260J7683O191l976j709Q671j22m728j2876L279
$$ 812767 821341 819568 807826 804986 808246 825929 832120 828144 826435 835106 834984 830256 817380 820659
15892H20659L068N119P44r121M844j6K460m585J362L513J00k942N230K244j4826
$$ 820659 823727 828846 829590 820469 825313 825297 827757 823172 824534 828047 828147 825205 830435 832679 817853
15877H17853K848K663j222P71J015q426M805Q729J2824N437j5087p607O245J4787
$$ 817853 820701 823364 822142 822913 823928 815502 820307 829036 841860 847297 832210 824603 830848 845635
15863H45635L687j66q254o226p744j174J4551r147j1782J0068J0524P618L234
$$ 845635 849322 849156 840902 834676 826932 825758 840309 831162 819380 829448 839972 847590 850824
15850H50824m09O993J4954K363J499k0413j8106P105L552j97p53k494L86j2505
$$ 850824 850415 857408 872362 874725 876224 855811 837705 844810 848362 848165 847412 844918 845304 832799
15836H32799M152L211K477n041J975M682M656o461j1902K457K818L69K006N203
$$ 832799 836951 840162 842639 837598 839573 844255 848911 842450 830548 833005 835823 836192 838198 843401
15822H43401L939L861M99k985J1256Q366k649j1169N834K395k706m605n473l417
$$ 843401 847340 851201 851700 848715 859971 868337 865688 854519 860353 862748 860042 855437 849964 846547
15808H46547M708j863M070J0987l066n857j0321P874N536J804Q666o394J34P39
$$ 846547 851255 849392 853462 864449 861383 855526 845205 853079 858615 860419 869085 862691 862825 863564
15794H63564m223k430O777r07N932q078o409J5455O193o954m275K113j793O330
$$ 863564 859341 856911 863688 862781 868713 860635 854226 869681 875874 868920 864645 866758 864965 871295
15780H71295P142k023l005j0419j5154m347L066N22m046j712q660J622J3082m609
$$ 871295 878437 876414 873409 862990 847836 843489 846555 847077 843031 841319 832659 834281 847363 842754
15766H42754J14J5822J0124j982l548K225R25J223R790O861k3191M10J1159o048
$$ 842754 842868 858690 868814 866832 863284 865509 866434 867657 877447 884308 861117 861527 872686 866638
15752H66638L172R772m379j2601L824P991o131L326P862k324J322J479j5328J518
$$ 866638 869810 879582 875203 862602 866426 874417 868286 871612 879474 877150 878472 879951 864623 866141
15738H66141O590J71m482j1683J921m635Q851J0621L592P454J3224j00j7028m026
$$ 866141 872731 872902 868420 856737 858658 854023 862874 873495 877087 884541 897765 897665 880637 876611
15724H76611L067O749l04o079l991j80O517J5117N122j4308r476K571m571J85
$$ 876611 879678 886427 886123 880044 876053 875873 882390 897507 902629 888321 878845 881416 876845 877030
15710H77030J5342J0177j6186q120R560m821p158k962L699L291Q419L773p92m161
$$ 877030 892372 902549 886363 878243 887803 882982 875824 872862 876561 879852 888271 892044 891252 887091
15696H87091l502J2893q480n077m061J3625R556K3J1003j948r911j1164l335k766
$$ 887091 883589 896482 888002 882925 878864 892489 902045 902068 913071 911123 901212 890048 886713 883947
15682H83947n524k376m505j307l00j796q18L703J3928M248K723K601L312j943
$$ 883947 878423 876047 871542 870235 869935 868139 867321 871024 884952 889200 891923 894524 897836 895893
15668H95893j0368l807J4904J5342k849n325r994L211J1486M785n438j753R218
$$ 895893 885525 881718 896622 911964 909115 903790 893796 897007 908493 913278 907840 906087 915305
15655I15305Q406N206j4499j0937N102l112K905P469l431N903l700j073k099j0962
$$ 915305 923711 928917 914418 903481 908583 905471 908376 915845 912414 918317 914617 913544 911445 900483
15641I00483K421J620K1221O873k334O249j3166m729L103j1833p646M273j225
$$ 900483 902904 904524 925745 932618 930284 936533 923367 918638 921741 909908 902262 906535 905310
15628I05310P822J0873P23l028k477K291j0707j6536l186R280J0962l555o616
$$ 905310 913132 924005 924728 921700 919223 921514 910807 894271 891085 900365 911327 907772 901156
15615I01156L973N135J1519L941j0639N382N32r869K674p499K808J3240n371j2827
$$ 901156 905129 910264 921783 925724 915085 920467 920999 911130 913804 906305 909113 922353 916982 904155
15601I04155M293Q762N246j3762R019J2119l62m395J1099M029n807m724R011L183
$$ 904155 908448 917210 922456 908694 917713 929832 929470 925075 936174 940203 934396 929672 938683 941866
15587I41866o320l034l774M609Q77l832m410j2695k346J1335J1577j7173r157
$$ 941866 935546 932512 928738 933347 934224 930392 925982 913287 910941 922276 933853 916680 907523
15574I07523J1002Q529k462P153r569k278j352O825P562K278O084K128r131J112
$$ 907523 918525 927054 924592 931745 922176 919898 918546 925371 932933 935211 941295 943423 934292 935404
15560I35404l674q686K45r599J5636P450Q656O618O186K373n763n571j4503r756
$$ 935404 931730 923044 923289 913690 929326 936776 945432 952050 958236 960609 954846 949275 934772 925016
15546I25016k436L41l012K352J7921n921j1738m940j0473J8618J5677N54R975
$$ 925016 922580 922921 919909 922261 940182 934261 922523 917583 907110 925728 941405 941959 951934
15533I51934P042j3357K679J311N170k197p815J8248J3460n237n218M138K776
$$ 951934 958976 945619 948298 949609 954779 952582 944767 963015 976475 971238 966020 970158 972934
15520I72934o590j6910J579J3502J189j0924j2616N902K49p722O324J0789N282
$$ 972934 966344 949434 951013 964515 965704 954780 942164 948066 948315 940593 946917 957706 962988
15507I62988L051r90j6908R410J2470N471j189q727r50J66j4697l526L503N377
$$ 962988 966039 965049 948141 957551 970021 975492 974303 965576 964626 964792 950095 946569 950072 955449
15493I55449R556l350q773J0152P92j0034L451l788L891K3355L43q986J10j979
$$ 955449 965005 961655 952882 963034 963826 953792 957243 953455 957346 980701 981044 972058 972168 970189
15479I70189J917O038O951j3837j1034J1452L229Q658J1709k649p393j217k261
$$ 970189 972106 978144 985095 971258 960224 971676 974905 983563 995272 992623 985230 984013 981752
15466I81752Q209P036J913o310P433j0550j4264l944J1418J402J0356J833L999
$$ 981752 989961 996997 998910 992600 1000033 989483 975219 971275 982693 984095 994451 996284 1000283
15453A000283q483r578o174N479J7554Q280k2860q360n756j7913L359J4019j3947
$$ 1000283 991800 982222 976048 981527 999081 1007361 984501 976141 970385 952472 955831 969850 955903
15440I55903N358N440L442N153P810n620O016P059M273j2623m874j0472J4103
$$ 955903 961261 966701 970143 975296 983106 977486 983502 990561 994834 982211 977337 966865 980968
15427I80968J2422J1566K533j7556o775l501l088M144J945J198J858Q236K230
$$ 980968 993390 1004956 1007489 989933 983158 979657 976569 980713 982658 983856 985714 993950 996180
15414I96180R013K324j759j408j0295O751j840m911q028n292L512M094L268p220
$$ 996180 1005193 1007517 1005758 1004350 994055 1000806 998966 994055 986027 980735 984247 988341 991609 984389
15400I84389P337J4746q315p281j915N745K2591q223o034k863K81m280Q233m404
$$ 984389 991726 1006472 998157 990876 988961 994706 1017297 1009074 1003040 1000177 1000458 996178 1004411 1000007
15386A000007j446M592M00j1938n385j0529O624J5189O537m225P318J0509p773
$$ 1000007 998561 1003153 1003553 991615 986230 975701 982325 997514 1004051 999826 1007144 1017653 1009880
15373A009880p531R55O076K055l597n822N656R184J8148P096n804R37j0202k0106
$$ 1009880 1002349 1003304 1009380 1011435 1007838 1002016 1007672 1016856 1035004 1042100 1036296 1037233 1027031 1006925
15359A006925O305P228m435j2208k727J5695o049O073P46P332R335K845N502r12
$$ 1006925 1013230 1020458 1016023 1003815 1001088 1016783 1010734 1016807 1017553 1024885 1034220 1037065 1042567 1041655
15345A041655J0362M828j2564j9198j0310K366m278l371l157J698j3201q47K1494
$$ 1041655 1052017 1056845 1044281 1025083 1014773 1017139 1012861 1009490 1006333 1008031 994830 993983 1015477
15332A015477J7006N643J5856j455j1457j3239j0485J2753Q547J85O77q614j425
$$ 1015477 1032483 1038126 1053982 1052527 1041070 1027831 1017346 1030099 1038646 1038831 1039508 1030894 1029469
15319A029469N950m461q723O203J966n955J287l145j0583j0312o990J7808K4007
$$ 1029469 1035419 1030958 1022235 1028438 1030404 1024449 1025736 1022591 1012008 1001696 994706 1012514 1036521
15306A036521M937J1513K747j706p422M37L043j068m934q597N410r271J59N0j4489
$$ 1036521 1041458 1052971 1055718 1054012 1046590 1047027 1050070 1049002 1044068 1035471 1040881 1031610 1031769 1031819 1017330
15291A017330M142N365J0544o09j3210j0352q759J8730J776N527J1508O810j061
$$ 1017330 1021472 1026837 1037381 1036772 1023562 1013210 1004451 1023181 1024957 1030484 1041992 1048802 1047741
15278A047741J2627j1849j2385L195R123l591M196p96j2662O38P368q47J78N500
$$ 1047741 1060368 1048519 1036134 1039329 1048452 1044861 1049057 1048261 1035599 1036237 1043605 1042758 1042936 1048436
15264A048436j0275N615J9579K479r015N214o336r690n137O741M284j0045j0307
$$ 1048436 1038161 1043776 1063355 1065834 1056819 1062033 1055697 1046007 1040870 1047611 1051895 1041850 1031543
15251A031543l47Q919L322K0850R685m790j6787q209O03L740J0207M365L178M346
$$ 1031543 1031196 1040115 1043437 1064287 1073972 1069182 1052395 1044186 1044789 1048529 1058736 1063101 1066279 1070625
15237A070625N441p514j1952J702J135P26J56P226j554p88O987O632J7131k514
$$ 1070625 1076066 1068552 1056600 1058302 1059437 1060163 1060319 1067545 1065991 1065203 1072190 1078822 1095953 1093439
15223A093439o140p760j0533J32n928r285M588M021r187k210J0662J2559l899
$$ 1093439 1087299 1079539 1069006 1069138 1063210 1053925 1058513 1062534 1053347 1051137 1061799 1074358 1070459
15210A070459o402N385M442O430O335J5489Q335M810k9261j0378J0199L346k46
$$ 1070459 1064057 1069442 1073884 1080314 1086649 1102138 1110473 1115283 1086022 1075644 1085843 1089189 1088943
15197A088943R119m198j1173j2231Q222p564l976R62j717O619J0526m60j8335
$$ 1088943 1098062 1093864 1082691 1070460 1078682 1071118 1067142 1068104 1066387 1073006 1083532 1083072 1064737
15184A064737l980J1921J6204P72l617o983q6K162R047k929o400M365J020j699
$$ 1064737 1060757 1072678 1088882 1089654 1086037 1079054 1078968 1081130 1090177 1087248 1080848 1085213 1086233 1084534
15170A084534q258O088l702L848J3494m522K254q200O250J7802m460o127j00j4861
$$ 1084534 1076276 1082364 1078662 1082510 1096004 1091482 1093736 1085536 1091786 1109588 1105128 1099001 1098901 1084040
15156A084040j615J2363J308O819M048j7164l309K51N469q817M655N751j890j0691
$$ 1084040 1082425 1094788 1096096 1102915 1106963 1089799 1086490 1086741 1092210 1083393 1088048 1093799 1091909 1081218
15142A081218q187Q445N477K655R096M383q040j2139P684o891J673K870J2523
$$ 1081218 1073031 1081476 1086953 1089608 1098704 1103087 1095047 1082908 1090592 1083701 1085374 1088244 1100767
15129A100767R937N157j6814J629N460j1273n939J6500l340O114j0329j588m290
$$ 1100767 1110704 1115861 1099047 1100676 1106136 1094863 1088924 1105424 1102084 1108198 1097869 1096281 1091991
15116A091991r04J1867J4475O602l871l894k049r681m985J1208L856R857n880
$$ 1091991 1091087 1102954 1117429 1124031 1120160 1116266 1114217 1104536 1099551 1110759 1114615 1124472 1118592
15103A118592K480j0945j729K825m850J1264J6459J917j2976n197p786r128J7955
$$ 1118592 1121072 1110127 1108398 1111223 1106373 1117637 1134096 1136013 1123037 1117840 1110054 1100926 1118881
15090A118881O933Q823K461l589o552j1164J843N682N735K073o901P087N602o191
$$ 1118881 1125814 1134637 1137098 1133509 1126957 1115793 1117636 1123318 1129053 1131126 1124225 1131312 1136914 1130723
15076A130723j5850j986Q950N501Q868K061M72p514j967m225j04J057N83j290
$$ 1130723 1114873 1112887 1121837 1127338 1136206 1138267 1138739 1131225 1129258 1125033 1124929 1125986 1126569 1125279
15062A125279j096K338L086K319L581j4662M722J603J0951N896j2968k347j931
$$ 1125279 1124183 1126521 1129607 1131926 1135507 1120845 1125567 1127170 1138121 1144017 1131049 1128702 1126771
15049A126771O243P823J3494k6L157j1030m775p524l529M263Q793J047j0605p923
$$ 1126771 1133014 1140837 1154331 1154305 1157462 1146432 1141657 1134133 1130604 1134867 1143660 1144707 1134102 1126179
15035A126179m096L008J2587J4831L677K091n583l750n841j584j3783m434l526
$$ 1126179 1122083 1125091 1137678 1152509 1156186 1158277 1152694 1148944 1143103 1141519 1127736 1123302 1119776
15022A119776J1614n978Q672O096l47P284J0058N443j1846n044j830k667m214
$$ 1119776 1131390 1125412 1134084 1140180 1139833 1147117 1157175 1162618 1150772 1145728 1143898 1141231 1137017
15009A137017k1851N733K0971O187m635k656o674l624N138K1141j848N51K818
$$ 1137017 1115166 1120899 1141870 1148057 1143422 1140766 1134092 1130468 1135606 1156747 1154899 1155450 1158268
14996A158268N337p132l53j204n783M272M640O879J6388m858j0394p2p921O191
$$ 1158268 1163605 1156473 1156120 1154916 1149133 1153405 1158045 1164924 1181312 1176454 1166060 1165988 1158067 1164258
14982A164258R816R169j1796j2134n197o915l804J4795Q827M771J0298P778j0376
$$ 1164258 1174074 1183243 1171447 1159313 1154116 1147201 1143397 1158192 1167019 1171790 1182088 1189866 1179490
14969A179490j842k97l226K03q380n695J3536J28p99k559P48j2806q914l606J5186
$$ 1179490 1177648 1177351 1174125 1174328 1165948 1160253 1173789 1173917 1173118 1170559 1171307 1158501 1149587 1145981 1161167
14954A161167Q663o461j28O903j928Q496J6820l919j8224M439O304m807l514P711
$$ 1161167 1169830 1163369 1163241 1170144 1168216 1176712 1193532 1189613 1171389 1175828 1182132 1177325 1173811 1181522
14940A181522O575m58P009n905m952j5041K046J1268K1665l988j2429j2951q048
$$ 1181522 1188097 1187639 1194648 1188743 1183791 1168750 1170796 1182064 1203729 1199741 1187312 1174361 1166313
14927A166313J2826J1914p014O561P228R381M353j1457m255J245m66L523N805
$$ 1166313 1179139 1191053 1184039 1190600 1197828 1207209 1211562 1200105 1195850 1197095 1196629 1200152 1205957
14914A205957L70P719K429o939K013m590j4058j767K223O847J6959R479o310p580
$$ 1205957 1206327 1214046 1216475 1209536 1211549 1206959 1192901 1191134 1193357 1200204 1217163 1226642 1220332 1212752
14900A212752k229Q669K121n825j338j025p308J0757J3460n10o204k472j866k791
$$ 1212752 1210523 1219192 1221313 1215488 1214150 1213125 1205817 1216574 1230034 1229524 1223320 1220848 1218982 1216191
14886A216191Q02q224K251J912L622M256K651N106L817o983j2751K044J2332k958
$$ 1216191 1216993 1208769 1211020 1212932 1216554 1220810 1223461 1228567 1232384 1225401 1212650 1214694 1227026 1224068
14872A224068j785P49p838j0682M526J6074J5865R611p490m427l087r553k345
$$ 1224068 1222283 1223032 1215194 1204512 1209038 1225112 1240977 1250588 1243098 1238671 1235584 1226031 1223686
14859A223686J165O558r379o941J762m89M614J531J1790L971j7821Q44N522M226
$$ 1223686 1224851 1231409 1222030 1215089 1216851 1216362 1220976 1222507 1234297 1238268 1220447 1221291 1226813 1231039
14845A231039K531M941J3617L929j135k487L560j3793k0880j2187R825R378q659
$$ 1231039 1233570 1238511 1252128 1256057 1254922 1252435 1255995 1242202 1221322 1209135 1218960 1228338 1219679
14832A219679k804j966j591J0684J9975J4400l51l61p614j2031j4926j0262P660
$$ 1219679 1216875 1214909 1213318 1224002 1243977 1258377 1258026 1257665 1250051 1238020 1223094 1212832 1220492
14819A220492J3968j450q496Q978K4915N141j4873k2294l295J202Q733P057n441
$$ 1220492 1234460 1233010 1224514 1233492 1258407 1263548 1248675 1226381 1223086 1224288 1233021 1240078 1234637
14806A234637P787M44P572Q215j917l887J6537J5165m273o289k172N8p788M422
$$ 1234637 1242424 1242868 1250440 1258655 1256738 1252851 1269388 1284553 1280280 1273991 1271819 1271877 1264089 1268511
14792A268511j3192j0817Q221K063O562q887o883j282J6122J840L258j627n549
$$ 1268511 1255319 1244502 1252723 1254786 1261348 1252461 1245578 1244296 1260418 1262258 1265516 1263889 1258340
14779A258340k066q732O216J7023J4697J150j326j09K869Q61N612m42m754n108
$$ 1258340 1256274 1247542 1253758 1270781 1285478 1286628 1285302 1285193 1288062 1288923 1294535 1294093 1289339 1284231
14765A284231l725j1897k961M612Q901Q106o912J428j4488j1171j1397p85J0363
$$ 1284231 1280506 1268609 1265648 1270260 1279161 1287267 1280355 1281783 1267295 1256124 1244727 1243942 1254305
14752A254305K5299N339k0127M040L178J229r636l962K045J5597O813m595j774
$$ 1254305 1279604 1284943 1264816 1268856 1272034 1273263 1263627 1259665 1261710 1277307 1284120 1279525 1277751
14739A277751p228L940M062N009n175P082P915L108j483j1423q514n271r579j333
$$ 1277751 1270523 1274463 1278525 1283534 1278359 1285441 1293356 1296464 1294981 1283558 1275044 1269773 1260194 1258861
14725A258861J0148J3093N445P210J1255j414j261n445K559j325m869K0002M088
$$ 1258861 1269009 1282102 1287547 1294757 1306012 1304598 1303337 1297892 1300451 1299126 1294257 1314259 1318347
14712A318347p258q260n846r503P602N911J914o409r508M344O019l66M87J4159
$$ 1318347 1311089 1302829 1296983 1287480 1295082 1300993 1302907 1296498 1286990 1291334 1297353 1296987 1297474 1311633
14698A311633R378k931r096Q76k156O737K679N633k707l299j0462j5890J95M970
$$ 1311633 1321011 1318080 1308984 1309860 1307704 1314441 1317120 1322753 1320046 1316747 1306285 1290395 1290590 1295560
14684A295560N217Q084L482Q095j968j8903n358O304M221m629p64M199N963P197
$$ 1295560 1300777 1308861 1312343 1320438 1318470 1299567 1294209 1300513 1304734 1300105 1299341 1303540 1309503 1316700
14670A316700M226K750n33o175J750M628l027P222L614j1113r542M59J1707J6942
$$ 1316700 1320926 1323676 1323143 1316968 1318718 1323346 1320319 1327541 1331155 1320042 1310500 1310959 1322666 1339608
14656A339608J7210q549k593r210j005Q369N468l256j0169r90J8472J1838l115
$$ 1339608 1356818 1348269 1345676 1336466 1335461 1343830 1349298 1346042 1335873 1334883 1353355 1365193 1362078
14643A362078k061j0411n15J293j611j0298j1999J525J0248J6384r088k5904n880
$$ 1362078 1360017 1349606 1349091 1350384 1348773 1338475 1326476 1328001 1338249 1354633 1345545 1319641 1313761
14630A313761O789n45J0164J277J96l303L909J4977l308l444n415R215J2355K879
$$ 1313761 1320550 1320005 1330169 1331446 1331642 1328339 1332248 1347225 1343917 1340473 1335058 1344273 1356628 1359507
14616A359507r937n92m97N605L90p306j226J1142N918n940L459K922m574o280
$$ 1359507 1349570 1348978 1348481 1354086 1354476 1347170 1345944 1357086 1363004 1357064 1360523 1363445 1358871 1352591
14602A352591J035L199j867M691Q919J814o161p00k767j263Q153l194j1546j9985
$$ 1352591 1353626 1356825 1354958 1359649 1368568 1370382 1364221 1363521 1360754 1359491 1367644 1364450 1352904 1332919
14588A332919P671J6932L796r064j419j359K876j5254k242M449J676O410J5282
$$ 1332919 1340590 1357522 1361318 1352254 1350835 1349476 1352352 1337098 1334856 1339305 1340981 1347391 1362673
14575A362673k248l884j554Q798J5201j0485r614L947L036P11m339R634R274Q694
$$ 1362673 1360425 1356541 1354987 1363785 1378986 1368501 1358887 1362834 1365870 1366581 1362242 1371876 1381150 1389844
14561A389844K543o810P114q627j293N127o186j473r584j1512k619M864J2049
$$ 1389844 1392387 1385577 1392691 1384064 1382771 1387898 1381712 1380239 1370655 1359143 1356524 1361388 1373437
14548A373437J8368K147q921Q61L38p397j659J1043J5004J2781P457l719j0061
$$ 1373437 1391805 1393952 1385031 1385892 1386230 1378833 1377174 1388217 1403221 1416002 1423459 1419740 1409679
14535A409679q106j4201l224k287P360P569K999N027l625p29L813n558L298J143
$$ 1409679 1401573 1387372 1384148 1381861 1389221 1396790 1399789 1404816 1401191 1400462 1404275 1398717 1402015 1403158
14521A403158M719o101j804k79m972j278J4801O269L412R378p520q853m528J5546
$$ 1403158 1407877 1401776 1399972 1399693 1394721 1393443 1408244 1414513 1417925 1427303 1419783 1410930 1406402 1421948
14507A421948J7477p792j7211r869O579J0007j772k733r354m678l106j86P766
$$ 1421948 1439425 1431633 1414422 1404553 1411132 1421139 1419367 1416634 1407280 1402602 1399496 1399310 1407076
14494A407076L353J2062P416j6340L829J122k1849j1813K222J1764R583M268M939
$$ 1407076 1410429 1422491 1429907 1413567 1417396 1418518 1396669 1384856 1387078 1398842 1408425 1412693 1417632
14481A417632N222j086K710P484Q825k555J604p111j662j2454J1630R666J2387
$$ 1417632 1422854 1421768 1424478 1431962 1440787 1438232 1439836 1432725 1431063 1418609 1430239 1439905 1452292
14468A452292m530r718K679r105k489N09N294k373o783R345J3536M720j2024j316
$$ 1452292 1447762 1438044 1440723 1431618 1429129 1429638 1434932 1432559 1425776 1435121 1448657 1453377 1441353 1440037
14454A440037J1017p465j0592R532P515R46o611k329K399O482r775M520M872r559
$$ 1440037 1451054 1443589 1432997 1442529 1450044 1450990 1444379 1442050 1444449 1450931 1441156 1445676 1450548 1440989
14440A440989j6256m226P732J0303J7319K153K15N745O659k040m290n195N2q881
$$ 1440989 1424733 1420507 1428239 1438542 1455861 1458014 1458229 1463974 1470633 1468593 1464303 1459108 1459160 1450279
14426A450279j2011R46K320K197P280N464N07P920l951l422J3405K294J457j015
$$ 1450279 1438268 1439214 1441534 1443731 1451011 1456475 1456982 1464902 1460951 1457529 1470934 1473228 1474685 1473670
14412A473670l049p98n76m816N722O55O61P273J5707M789l461j3370o400l161
$$ 1473670 1470621 1469823 1469247 1464431 1470153 1470808 1471469 1478742 1494449 1499238 1495777 1482407 1476007 1472846
14398A472846k941r557M075M310O656k788P12R437P902N044j8240j3227L656O99
$$ 1472846 1469905 1460348 1464423 1468733 1475389 1472601 1473313 1482750 1490652 1495696 1477456 1464229 1467885 1468584
14384A468584P673Q567J4312L825r5j6291j0471J470J1091k272N990M766n050
$$ 1468584 1476257 1484824 1499136 1502961 1502866 1486575 1476104 1477574 1488665 1486393 1492383 1497149 1492099
14371A492099r808m200J0743P411N172N730n742j0602j4102J370J3236O137p683
$$ 1492099 1482291 1478091 1488834 1496245 1501417 1507147 1501405 1490803 1476701 1478071 1491307 1497444 1489761
14358A489761p56J5148N388o753j2081j3580M849J5926R466K052o086l464N241
$$ 1489761 1489005 1504153 1509541 1502788 1490707 1477127 1481976 1497902 1507368 1509420 1503334 1499870 1505111
14345A505111n460p348N942K365N077o231j057J5344l808q833o869j154p044P559
$$ 1505111 1499651 1492303 1498245 1500610 1505687 1499456 1498399 1513743 1509935 1501102 1494233 1493079 1486035 1493594
14331A493594O12j865O674J7251M531J139p40J447j199O673J488P939k11j0268
$$ 1493594 1494206 1492341 1499015 1516266 1520797 1521936 1521196 1522643 1521444 1528117 1529605 1537544 1537333 1527065
14317A527065j8580k324P927o472N412O790k023P821O325N23n543J129K812J077
$$ 1527065 1508485 1506161 1514088 1507616 1513028 1519818 1517795 1525616 1531941 1532464 1526921 1528050 1530862 1531939
14303A531939l077o64R263K003k0971l757Q970O695K41o758J5008R204j1507l763
$$ 1531939 1528862 1528198 1537461 1539464 1518493 1514736 1523706 1530401 1530642 1523884 1538892 1548096 1536589 1532826
14289A532826n519k374M858L343N346M502k301j2471j46R176J1264L470J85Q472
$$ 1532826 1527307 1524933 1529791 1533134 1538480 1542982 1540681 1528210 1528064 1537240 1548504 1551974 1552159 1560631
14275A560631J1025R337p777j9037n222J3840J0463K819K760j6374L35l138O223
$$ 1560631 1571656 1580993 1573216 1554179 1548957 1562797 1573260 1576079 1578839 1562465 1562800 1559662 1565885
14262A565885J4787m332j1482m137Q324K742L316J582m126q044j834J266k420
$$ 1565885 1580672 1576340 1564858 1560721 1569045 1571787 1575103 1576685 1572559 1564515 1562681 1563947 1561527
14249A561527k199P285r938O363J3572J0012l507M521p091n351k1500m655M967
$$ 1561527 1559328 1566613 1556675 1563038 1576610 1586622 1583115 1587636 1580545 1575194 1553694 1549039 1554006
14236A554006O079J0828N957M812r124J0050J0364P573o621j237j1961p983Q728
$$ 1554006 1560085 1570913 1576870 1581682 1572558 1582608 1592972 1600545 1593924 1592687 1580726 1572743 1581471
14223A581471j547R010j203q419J2450L965n786j5913j351J7203J3944O9L03j145
$$ 1581471 1579924 1588934 1587731 1579312 1591762 1595727 1589941 1574028 1572677 1589880 1603824 1603893 1604196 1603051
14209A603051J0044j760n278l777r977K016J6721N846L034l680p578L615J5572
$$ 1603051 1613095 1611335 1606057 1602280 1592303 1594319 1611040 1616886 1619920 1616240 1608662 1612277 1627849
14196A627849J1228j8823n777J317J0500m472j5287o1K616r050q69K5617J4202
$$ 1627849 1639077 1620254 1614477 1615794 1626294 1621822 1606535 1606474 1609090 1600040 1599171 1624788 1638990
14183A638990q891j3705j220L432J704J692p467J324n408j5860L233R926J0421
$$ 1638990 1630099 1616394 1615174 1618606 1620310 1622002 1614535 1615859 1610451 1594591 1597824 1607750 1618171
14170A618171m081J5547P277j263P509l040j3527J2250J6953J2257J183j2670
$$ 1618171 1614090 1629637 1636914 1635651 1643160 1640120 1626593 1638843 1655796 1668053 1669236 1656566
14158A656566k220K345l792M9l32j1284j5894j070J6246n435n690Q520p265j3385
$$ 1656566 1654346 1656691 1652899 1652948 1652616 1641332 1625438 1624368 1640614 1635179 1629489 1638009 1630744 1617359
14144A617359P073P692J0279N859L50J0841k96l41l841N59k036J1547J917p779
$$ 1617359 1624432 1632124 1642403 1648262 1648612 1659453 1659157 1658816 1654975 1655534 1653498 1665045 1666962 1659183
$$ [...]
##END NTUPLES=NMR SPECTRUM
##END=
