##TITLE=Analysis number 312048
Compound Code spb 06842
Project Code adrs
Chemist Name ugmt
##JCAMPDX= 6.0         $$ Bruker NMR JCAMP-DX V2.0
##DATA TYPE= NMR SPECTRUM
##DATA CLASS= NTUPLES
##ORIGIN= Bruker BioSpin GmbH
##OWNER= NMR
$$ XWIN-NMR		Version 3.5
$$ Fri Jul 22 10:04:30 2005 GMT Daylight Time (UT+1h)  MAYBRIDGE\NMR@NMR_250MHZ
##.OBSERVE FREQUENCY= 250.131544655141
##.OBSERVE NUCLEUS= ^1H
##.ACQUISITION MODE= SIMULTANEOUS (DQD)
##.ACQUISITION SCHEME= undefined
##.AVERAGES= 16
##.DIGITISER RES= 18
##SPECTROMETER/DATA SYSTEM= dpx250
##.PULSE SEQUENCE= zg30
##.SOLVENT NAME= CDCl3
##.SHIFT REFERENCE= (INTERNAL, CDCl3, 0, 16.4662)
##AUDIT TRAIL= $$ (NUMBER, WHEN, WHO, WHERE, WHAT)
$$ ##TITLE= Audit trail, XWIN-NMR		Version 3.5
$$ ##JCAMPDX= 5.01
$$ ##ORIGIN= Bruker BioSpin GmbH
$$ ##OWNER= NMR
$$ C:\u/data/dgb/nmr/ADRS/6360/pdata/1/auditp.txt
$$ ##AUDIT TRAIL=  $$ (NUMBER, WHEN, WHO, WHERE, WHAT)
(   1,<2005-07-22 10:04:07.00 +100>,<MAYBRIDGE\NMR>,<NMR_250MHZ>,
      <created by zg, POWCHK disabled, PULCHK disabled
       configuration hash MD5:
       62 19 C7 07 E1 42 D1 B7 37 6C 3D D0 77 39 F9 E6
       data hash MD5: 64K
       B9 DC C7 38 A5 59 F9 95 49 3F A2 84 59 9E 5F 77>)
(   2,<2005-07-22 10:04:20.58 +100>,<MAYBRIDGE\NMR>,<NMR_250MHZ>,
      <Start of raw data processing
       ef LB = 0.3 FT_mod = 6 PKNL = 1 SI = 32K 
       data hash MD5: 32K
       5F BE 77 3B 71 AB C2 50 8A 42 02 4B 9B 02 4F FE>)
(   3,<2005-07-22 10:04:22.85 +100>,<MAYBRIDGE\NMR>,<NMR_250MHZ>,
      <apk 
       data hash MD5: 32K
       83 B4 94 83 26 13 A5 2A 73 1B AA B1 85 DA 4D 74>)
(   4,<2005-07-22 10:04:23.52 +100>,<MAYBRIDGE\NMR>,<NMR_250MHZ>,
      <abs ABSG = 5 
       data hash MD5: 32K
       D7 8C 82 D1 C6 DD BE A0 60 51 32 AE EF 4B C4 B5>)
$$ ##END=
$$ 
$$ hash MD5
$$ B1 CF BB D4 D7 D9 7D EF 4B C7 77 AB DD 13 E1 37
##$RELAX= 
##$RELAX= 
##$RELAX= 
##$RELAX= 
##$RELAX= 
##$RELAX= 
##$RELAX= 
$$ Bruker specific parameters
$$ --------------------------
##$DU= <C:\u>
##$EXPNO= 6360
##$NAME= <ADRS>
##$PROCNO= 1
##$TYPE= <nmr>
##$USER= <dgb>
##$AMP= (0..31)
100 100 100 100 100 100 100 100 100 100 100 100 100 100 100 100 100 100 
100 100 100 100 100 100 100 100 100 100 100 100 100 100 
##$AQSEQ= 0
##$AQ_mod= 3
##$AUNM= <au_zg>
##$AUTOPOS= <6 >
##$BF1= 250.13
##$BF2= 250.13
##$BF3= 250.13
##$BF4= 250.13
##$BF5= 500.13
##$BF6= 500.13
##$BF7= 500.13
##$BF8= 500.13
##$BYTORDA= 1
##$CFDGTYP= 0
##$CFRGTYP= 5
##$CHEMSTR= <none>
##$CNST= (0..31)
1 1 145 1 1 1 1 1 1 1 1 1 1 1 1 1 1 1 1 1 1 1 1 1 1 1 1 1 1 1 1 1 
##$CPDPRG= <>
##$CPDPRG1= <>
##$CPDPRG2= <>
##$CPDPRG3= <>
##$CPDPRG4= <mlev>
##$CPDPRG5= <mlev>
##$CPDPRG6= <mlev>
##$CPDPRG7= <mlev>
##$CPDPRG8= <mlev>
##$CPDPRGB= <>
##$CPDPRGT= <>
##$D= (0..31)
0 1 0 0 0 0 0 0 0 0.06 0 0 0 0 0 0 0.0002 0 0 0 0 0 0 0 0 0 0 0 0 0 0 
0 
##$DATE= 1122023046
##$DBL= (0..7)
120 120 120 120 120 120 120 120 
##$DBP= (0..7)
150 150 150 150 150 150 150 150 
##$DBP07= 0
##$DBPNAM0= <>
##$DBPNAM1= <>
##$DBPNAM2= <>
$$ [...]
##$SUBNAM7= <"">
##$SUBNAM8= <"">
##$SUBNAM9= <"">
##$SW= 20.6930455092707
##$SWIBOX= (0..15)
0 0 3 0 0 0 0 0 0 0 0 0 0 0 0 0 
##$SW_h= 5175.983436853
##$TD= 65536
##$TD0= 1
##$TE= 295.16
##$TE2= 300
##$TE3= 300
##$TEG= 300
##$TL= (0..7)
0 120 120 120 120 120 120 120 
##$TP= (0..7)
150 150 150 150 150 150 150 150 
##$TP07= 0
##$TPNAME0= <>
##$TPNAME1= <>
##$TPNAME2= <>
##$TPNAME3= <>
##$TPNAME4= <>
##$TPNAME5= <>
##$TPNAME6= <>
##$TPNAME7= <>
##$TPOAL= (0..7)
0.5 0.5 0.5 0.5 0.5 0.5 0.5 0.5 
##$TPOFFS= (0..7)
0 0 0 0 0 0 0 0 
##$TUNHIN= 0
##$TUNHOUT= 0
##$TUNXOUT= 0
##$USERA1= <user>
##$USERA2= <user>
##$USERA3= <user>
##$USERA4= <user>
##$USERA5= <user>
##$V9= 5
##$VALIST= <valist>
##$VCLIST= <CCCCCCCCCCCCCCC>
##$VD= 0
##$VDLIST= <DDDDDDDDDDDDDDD>
##$VPLIST= <PPPPPPPPPPPPPPP>
##$VTLIST= <TTTTTTTTTTTTTTT>
##$WBST= 1024
##$WBSW= 4
##$XGAIN= (0..3)
0 0 0 0 
##$XL= 0
##$YL= 0
##$YMAX_a= 496155
##$YMIN_a= -460936
##$ZGOPTNS= <>
##$ZL1= 120
##$ZL2= 120
##$ZL3= 120
##$ZL4= 120
##$ABSF1= 16.46624
##$ABSF2= -4.226933
##$ABSG= 5
##$ABSL= 3
##$ALPHA= 0
##$AQORDER= 0
##$ASSFAC= 0
##$ASSFACI= 0
##$ASSFACX= 0
##$ASSWID= 0
##$AUNMP= <proc_1d>
##$AZFE= 0.1
##$AZFW= 0.1
##$BCFW= 0
##$BC_mod= 0
##$BYTORDP= 0
##$COROFFS= 0
##$CY= 12.5
##$DATMOD= 1
##$DC= 0
##$DFILT= <>
##$DTYPP= 0
##$F1P= 14.0000005364418
##$F2P= -0.99999901652339
##$FCOR= 0.5
##$FTSIZE= 32768
##$FT_mod= 6
##$GAMMA= 0
##$GB= 0
##$INTBC= 1
##$INTSCL= 1
##$ISEN= 128
##$LB= 0.3
##$LEV0= 0
##$LPBIN= 0
##$MAXI= 10000
##$MC2= 0
##$MEAN= 0
##$ME_mod= 0
##$MI= 0
##$NCOEF= 0
##$NC_proc= -3
##$NLEV= 6
##$NOISF1= 0
##$NOISF2= 0
##$NSP= 0
##$NTH_PI= 0
##$NZP= 0
##$OFFSET= 16.46624
##$PC= 1
##$PHC0= -89.97661
##$PHC1= 29.08931
##$PH_mod= 1
##$PKNL= yes
##$PPARMOD= 0
##$PSCAL= 4
##$PSIGN= 0
##$REVERSE= no
##$SF= 250.130013946972
##$SI= 32768
##$SIGF1= 0
##$SIGF2= 0
##$SINO= 400
##$SIOLD= 32768
##$SREGLST= <1H.CDCl3>
##$SSB= 0
##$STSI= 32768
##$STSR= 0
##$SW_p= 5175.98343685301
##$SYMM= 0
##$S_DEV= 0
##$TDeff= 65536
##$TDoff= 0
##$TI= <Analysis number 999999
Compound Code 99
Book Reference 9
Project Code 9>
##$TILT= no
##$TM1= 0
##$TM2= 0
##$TOPLEV= 0
##$USERP1= <user>
##$USERP2= <user>
##$USERP3= <user>
##$USERP4= <user>
##$USERP5= <user>
##$WDW= 1
##$XDIM= 32768
##$YMAX_p= 463574422
##$YMIN_p= -70390
$$ End of Bruker specific parameters
$$ ---------------------------------
##NTUPLES= NMR SPECTRUM
##VAR_NAME=  FREQUENCY,     SPECTRUM/REAL,   SPECTRUM/IMAG
##SYMBOL=    X,             R,               I
##VAR_TYPE=  INDEPENDENT,   DEPENDENT,       DEPENDENT
##VAR_FORM=  AFFN,          ASDF,            ASDF
##VAR_DIM=   32768,         32768,           32768
##UNITS=     HZ,            ARBITRARY UNITS, ARBITRARY UNITS
##FACTOR=    0.157963299565203, 1,           1
##FIRST=     4118.70082314479, 0,            0
##LAST=      -1057.28261370822, 0,           0
##MIN=       -1057.28261370822, -70390,      0
##MAX=       4118.70082314479, 463574422,    0
$$ Real data points
##PAGE= N=1
##DATA TABLE= (X++(R..R)), XYDATA
$$ [...]
26418a1800J0410K454M506Q362L545j0113j7618j8664o338N271M673j058J771
26405b4599J0850J2139j3833N437J5571m587j2370j8711P25n13K942J1181Q493
26392g275j555n027l98R737P343K6352k560j3759j6546O152N885j3614o483J2164
26378D16k703n746P304j1957J4358J8356K16k7691p388J0406p034o786J5076J827
26364a346K014M111J4148m79K017J0246n665j1931k3449j7209M523R869M553K527
26350f071L970q894j2644J4008L1476N915j0974j0730q492N321J6229k1259j8079
26337b0224N61L672M927j698P236J0236j724o761j1038k732k446k0080J105J8350
26323b0616j6721k043K1751R935Q968R030J4790N454p414o046J20p177q161j0505
$$ y = [-11800, -1390, 1064, 5570, 13932, 17477, 7364, -10254, -28918, -35256, -29985, -25312, -26370, -24599, -13749, -1610, -15443, -10006, 5565, 978, -11392, -30103, -29378, -29891, -26949, -15768, -7275, -8830, -13857, -14255, -4518, 2825, 29177, 26617, 12858, -3688, 2464, 8349, -5265, -11748, 416, -2287, -8033, -729, -12686, 1672, 20028, 20244, -7447, -14835, -4429, -11463, -18249, -3173, -1346, 668, 4779, 18927, 18448, 20465, 30711, 25046, 13115, -10334, -27543, -23020, -13151, -8598, -6071, -2101, -10995, -23639, -9631, 21845, 27760, 16786, 6056, -2436, 2885, 19114, -2145, -20224, -19663, -15991, -11064, -12762, -5526, 4710, 2986, -3775, -14813, -17545, -19991, -40071, -38966, -20616, -37337, -39380, -17629, -7694, 1274, 10304, 25094, 30548, 23134, 17088, 17208, 10031, 1870, -8635]
26309h635j5000L672J9053L011P316J1031j4730J877R323n393j44k751j2505j0192
26295a4067p720J567j0480n31J6491P14N847J2428R099j0246N920J010J511P853
26281A9396o26L175O622j933R254n303r764o227L366j6409j1500M706k965O123
26267b085l1770j9114J6476J1122J1177J745K211j0463j3464j2135N056J3472
26255b7772M596M843K0983n052q728m635R410K2444O218q590k6619K362J3188
26242B648Q75q272N874r45n073M394k424q354n846r566R996J422l242q611K674
26227b4450m545J4662J2721r614k1618J1458J1545m09K5138N783j8266j216l77
26214H12o099K266N93j4904n417J3790J4461N303L913o398M254l107M610J406
$$ y = [-8635, -23635, -19963, -910, 2101, 9417, 20448, 5718, 7595, 16918, 11525, 11381, 8630, -3875, -14067, -21787, -20220, -30700, -31231, -14740, -14026, -8179, 4249, 13348, 3102, 9022, 10032, 11543, 19396, 18770, 21945, 28567, 26634, 35888, 30585, 20821, 14594, 17960, 1551, -9949, -5243, -8208, -2085, -33855, -52969, -36493, -25371, -14194, -12449, -10238, -20701, -34165, -46300, -41244, -27772, -23176, -18333, 2650, -2402, -11130, -15765, -6355, 16089, 22307, 13717, -12902, -10540, 2648, 3523, -4749, 1125, 180, -4893, -499, -2923, -11277, -17123, -26689, -16693, -15271, -18513, -27124, -24450, -28995, -14333, -1612, -11226, -32844, -21386, -9841, -10250, 14888, 20671, 2405, 1189, 812, -5287, -3021, -2428, -17332, -22749, -8959, 5502, 10805, 14718, 8320, 12574, 9467, 14077, 15483]
26200A5483n8P739J381k2458m128M036J3306J8973o171n963j604J60l1045j5333
26186b5682O641J551j2300o460o368K4246L0672k855o345J8545j5996o330l783
26173d464o107o258m716L649Q814J729J774K0024J9o545J3287j06j2430j782N53
26158G441p241n20k552n179o105r999P430M930K8362k879j6417p089o83o55J3763
26143B607K9295p997k9235J1452j3949L930K0162L934j100j1893r996J05o218
26130h903j2424k778P962J787Q696j43R756j5341K38J040J470N493o212j4421
26116b3780m83P751p399r348r835O508J8582O770O297J6600J3783p178j3508o005
26102a245J689j2113p9J6196J4124n10Q320k023o308P885j0274J078n398k5080
$$ y = [15483, 15425, 23164, 24545, 2087, -2041, 1995, 15301, 34274, 28103, 22140, 20536, 20696, -10349, -25682, -19041, -17490, -29790, -36250, -42618, -18372, 12300, 9445, 3100, 21645, 5649, -681, -4464, -10571, -16829, -21545, -17896, -9082, -7353, -5579, 14445, 14464, 7919, 21206, 21100, 8670, 6888, 7441, 200, -320, -2872, -8051, -14156, -24155, -16725, -11795, 16567, 13688, -2729, -9818, -10501, -11156, 2607, 31902, 23905, -5330, 6122, -7827, -3897, 16265, 20199, 19099, 7206, -2790, -2685, -8903, -21327, -24105, -16143, -14356, -5660, -5803, 3953, -11388, -11150, -10110, -8640, -3147, -9359, -23780, -24263, -16512, -23911, -33259, -43094, -36586, -18004, -11234, -4937, 11663, 25446, 18268, 4760, -1245, 444, -11669, -11748, 4448, 18572, 18062, 26382, 24359, 18051, 25936, 15662, 16740, 11342, -13738]
26088a3738O257K923j4119m502o82K1093j92j8536L945R580N298O321J3074Q448
26074B5170j1322j1808K024N55r469j4285k96Q95L307n260K483R119L644N470
26060B27R681j100j739n149j178l044M180J1127j1778j7502q548P070O846J065
26046i842Q144J7249q905r970K9O124j5653j5355k374Q742j675J5284O151j3984
26032a6035M084J0740n739j2452J7446K2609O338k3096R761P425Q047J6491M459
26019E0078q124l2404m138L709J4585m217r562j0516K893P279N694J685o078k1658
26005a0774j7928j615P961m914J9313K129O467J5364k038j6675L439J7214m421
25992A3522K374k227n940K881P036J5112r514k698j539j0157j103j8762m036l44
$$ y = [-13738, -7481, -4558, -18677, -23179, -23861, -2768, -2960, -21496, -17551, -7971, -2673, 3648, 16722, 25170, 13848, 2040, 4064, 4619, -4850, -19135, -19431, -18536, -15229, -20489, -18006, -8887, -5243, 227, 9908, 8808, 7069, 1920, 742, -2302, 1878, 13005, 1227, -16275, -24823, -17753, -10907, -9842, -1698, 15551, 6646, -3324, -3295, 2829, -12824, -28179, -30553, -21811, -23486, -8202, -2051, -16035, -11951, -1211, -6950, -19402, -1956, 20653, 26991, 3895, 13656, 21081, 29128, 45619, 50078, 41954, 9550, 5412, 9121, 23706, 19489, 9927, -589, 2304, 9583, 15277, 16962, 10884, -10774, -28702, -30317, -22356, -27270, -7957, -5828, 639, 16003, 13965, -2710, 729, 17943, 13522, 15896, 13669, 7729, 10610, 17646, 32758, 23244, 20546, 19007, 8850, 7747, -11015, -15051, -15395]
25978a5395J0692r782K277q990k911J6898K5269M557k2556j6746P746j326j2041
25965b2308p935J0390Q51J1209O189O965L214R635o250J1889j0324q882l946l824
25951c127j1851o041K2699J4713J1398K9089r855o600j6502j1280o086P71j5091
25938g763j2891J3001p97r605M979J913N873K0803O450j683o328o641k711j114
25924C486l464k1m767k7936N606K1880J9679K14J176k252r28m616J3052j4111
25910F998j6260J296Q314J9906j527j1427J1184L145k2703p096K1553K0522o442
25897B7463r910j1004K824j803r297p814O200j4701O818Q866J3655K0753J3740
25884D5790j6623k0753j0878l955J31j1327J9819K110r95K3115J8458r908m65
$$ y = [-15395, -4703, -14485, -12208, -21198, -24109, -7211, 18058, 22615, 59, -16687, -8941, -10267, -22308, -30243, -19853, -19002, -7793, -1604, 5361, 8575, 18210, 11960, 23849, 13525, 4643, 697, -3127, -14978, -21019, 1680, 16393, 27791, 56880, 47025, 40425, 23923, 12643, 6557, 7328, -7763, -20654, -7653, -8450, -18055, -13076, -11163, -5290, 15513, 21963, 20280, 13952, 7311, 4600, 3486, 22, 1, -4766, -32702, -27096, -5216, 14463, 14677, 15853, 13601, 12673, 8057, 21109, 6998, -9262, -7966, 348, 20254, 18727, 7300, 18484, 21629, -1074, -8170, 13383, 33905, 27463, 17553, 6549, 9373, 7570, -1727, -9541, -3341, -18042, -11224, -2358, 11297, 32050, 45790, 29167, 8414, -2464, -6419, -6288, -17615, 2204, 4314, 3319, 26434, 44892, 34984, 34519]
25871C4519K418k9796j1086p740K847J0023r872o5J2557O680o649J693j4955J0102
25857F76J4901j2129j3941R657K170q015j1817j4770J7215K1992K581j4640j9633
25844b5753K814J232J6439J9950J641j5833L519K675m295n20k725j3857l013M865
25830a2861m060o84K4545n117n037M387j3694o52k2794j1365J2732J1773M55L878
25816a8494j127J1131j563j8739J1272M212O47n865N951K920k887J0838m938q159
25802a4801J256J5803p786Q343p393n41o689J4198J431m31J2874Q49J911k049
25788A6975j2155Q03J1738J6250p094j9808j2733j0993j0335K2685p529j9113
25776c1309k842J0166l232r42J4450O436J0627Q139l179O440J7245j664n779J3133
$$ y = [34519, 36937, 7141, -3945, -11685, -8838, 1185, -8687, -8752, 3805, 10485, 3836, 5529, -9426, 676, 15577, 3448, -10493, -836, 1334, -6681, -18498, -33268, -16053, 5939, 8520, -6120, -25753, -22939, -21707, -5268, 14682, 16323, 490, 4009, 6684, 2389, 1869, -856, -14713, -17726, -12861, -16921, -17605, 6940, 1823, -3214, 1173, -12521, -13173, -35967, -47332, -34600, -22827, -22372, -18494, -19621, -8490, -10053, -28792, -17520, -13308, -12661, -18526, -12575, -9655, -12542, -1704, -6642, -14801, -13545, 2258, -5528, 2815, -4578, -5119, -11808, 2390, 3821, 3390, 16264, 17113, 19024, 16975, 4820, 5623, 17361, 33611, 26517, 6709, -6024, -17017, -27352, -4667, -12196, -31309, -34151, -23985, -27217, -28159, -13709, -7273, 3354, 11493, 8314, 14754, 31999, 30335, 24556, 37689]
25762C7689j0746k9647j9242L975Q625L614j3054J1040M288O07L500J3679r493
25749D835j509Q07k721K893j1662q285J0238R211O430j9169k2239l901K3325L963
25735g784J629O388J258O636J5105k682Q834P86j9271j1426J6650J0273M9n666
25721B0779p581j4667m417j6130k407k517k001J9356L157J1162R881M432j0961
25708H086p746K404j8515p870N42K5599K2306J551j7414M110N718r516n102K1459
25694B5612L211k661m303k0246L564R886p094J5817m757k9636j7173M383P898
25681a5499k568L081L04L161J9444m190m307r832J5406j1772o633O378l243R718
25667e52J38L724m007N648K622M86j768j3543j0886j755J4063j024O651J1478
$$ y = [37689, 26943, -2704, -21946, -17971, -9346, -5732, -18786, -7746, -3458, -2851, 649, 14328, 4835, 3326, 4133, 1412, 4305, -7357, -15642, -5404, 3807, 10237, -8932, -31171, -35072, -11747, -7784, -6155, 233, 1491, 8127, 23232, 20550, 29384, 30170, 10899, -527, 16123, 26396, 26445, 20779, 13198, -1469, -5886, -22016, -24423, -26940, -28941, -9585, -6428, 4734, 14615, 19047, 8086, 340, 2744, -15771, -23641, -23099, 2500, 24806, 26357, 8943, 13053, 18771, 9255, 4153, 25612, 28823, 26162, 21859, 1613, 5177, 15063, 7969, 23786, 19029, -10607, -27780, -23397, -15499, -18067, -14986, -14682, -11521, 7923, 3733, -574, -10406, 5000, -6772, -13405, -7027, -10270, -552, -414, 3310, -697, 4951, 7573, 8059, 6291, -7252, -18138, -19893, -5830, -6854, -203, 11275]
25653A1275j769k3086n226L50O84p090P916j3895j0860K6906N169n353K025J9894
25639F940M997o745J1130j3388k0679q929L608O206k4K625R911K969p107J1535
25625C049K5778l524n493M966n241r792Q811q385j2494l455K0116N08K914J6771
25611C4529j7898k1428k594j805J7400o917k0634n869O986N068P316R94K3492
25598A8640M006k834n766j0378L911l618j6375J6018j5039m48J3292J3206J177
25585A5792M452J528J5695J746p063J0504O174j5932j0716r412n658r906l496
25572f292p193n910J0124j9573N105K2496J033k18j966j3362M115Q841p701m773
25558a5274K1L104j356j1687L805M352J470K4598N124j0279j1600o103q172j8375
$$ y = [11275, 9506, -13580, -18806, -18456, -17772, -24862, -16946, -30841, -41701, -14795, -9626, -14979, -12954, 6940, 11937, 5192, 16322, 2934, -17745, -26674, -23066, -16860, -16884, -14259, -4348, -1379, -8486, 3049, 28827, 25303, 19810, 24776, 19535, 9743, 18554, 10169, -2325, -5780, 14336, 14844, 17758, 34529, 16631, -4797, -7391, -9196, 8204, 1287, -19347, -25216, -18230, -13162, -5846, -4852, 18640, 22646, 19812, 14046, 3668, 7579, 3961, -12414, 3604, -11435, -11883, 1409, 14615, 15792, 20244, 21772, 37467, 39213, 32150, 42654, 48828, 32896, 22180, 12768, 7110, -2796, -6292, -13485, -19395, -9271, -28844, -23739, -1243, -210, -428, -2394, -15756, -11641, -2800, -10501, -15274, -15253, -12149, -13505, -25192, -21387, -17035, -15565, 9033, 14157, 3878, -7722, -13825, -21997, -40372]
25544d0372K435K6112K1397J599J4096K907k5039j6346q795m302M920J6053K807
25531b528j6502O80J2378N439m285R636R596O920j8945j5683N469K6383J853j6807
25517C604k9181J1802J5674O504l837k468l096p498J1711j583j5178k828q823
25504b5197K548K2076Q130N023j9030j62R359n613p114K2812j5243k3861j8561
25491d4833J9154R851L961o56l792j6435R537J1373p595K050j0295K5845l52k1640
25477b3827k417J2932N619j453j936K504k414j3526J197q634J5922K0000J1758
25464A5725L686k8248j5653J899J355P569k46m944Q469K098o210j4868J2045J4028
25450c295P415l741r026j999K1488Q311R795r085o55j1827j145O769M146K815
$$ y = [-40372, -37937, -11825, 9572, 11171, 25267, 28174, 3135, -13211, -22006, -26308, -21388, -5335, -2528, -19030, -18350, -5972, -533, -4818, 4818, 14414, 21334, 2389, -13294, -7825, 18558, 20411, 3604, -25577, -13775, 1899, 8403, 4566, 2098, -998, -8496, 3215, 1632, -13546, -16374, -25197, -22649, -573, 7557, 12580, -6450, -6612, 2747, -2866, -9980, 12832, -2411, -26272, -44833, -25679, -15828, -11867, -12523, -16315, -32750, -23213, -11840, -19435, -17385, -27680, -1835, -2187, -23827, -26244, -13312, -7693, -9146, -11082, -8578, -10992, -24518, -23321, -31955, -16033, 3967, 15725, 19411, -8837, -24490, -22591, -21236, -13667, -13913, -18857, -10388, -8290, -14500, -29368, -17323, -3295, 4120, 379, -8647, -10646, 10842, 19153, 28948, 19863, 19208, 7381, 6236, 13005, 17151, 19966]
25436A9966o963j4517j3894j482N79j12R279j1059n636J9241M445p214N869q347
25422i845p39P909p65L517l811k8638O639L915J3750L624o45N125J3680R147O29
25407B3492q083j7659j3070j6208L831J82J1061J3798l091j3678r988q701k1386
25394e9500J3331K8807N206j032Q265N868o05j3184P828k686j3573k055j5456
25381c8786J4330K5560K3929R709l316j2965n63j1215l134r08K2441p422q095
25368I565o509n359K769O133M27J474P002n193p834j911n558k095l394J1501J3898
25353A4916O534j7177m459N199r073j2787j3246M734J3049p617M044N754K243
25340g886J4226L806l126O510p355j5787J2485n96l2041J3510J9252L723j6558
$$ y = [19966, 13003, -1514, -15408, -16890, -16311, -16423, -7144, -18203, -23839, -4598, -153, -7367, -1498, -9845, -10584, -2675, -3440, 77, -3734, -32372, -25733, -21818, -8068, -4444, -5089, 36, 13716, 22863, 23492, 15409, -2250, -15320, -31528, -27697, -27515, -16454, -2656, -5747, -19425, -29413, -38114, -59500, -46169, -17362, -12156, -13188, -4923, 945, 340, -12844, -5016, -7702, -21275, -23330, -38786, -24456, 1104, 25033, 34742, 31426, 18461, 17898, 6683, 3549, 2641, 25082, 17660, 9565, 3056, -2303, 466, 6599, 7026, 8500, 15502, 10309, 2475, 564, -4994, -7089, -10483, 1018, 14916, 21450, 4273, -186, 5013, -4060, -16847, -30093, -25359, -12310, -19927, -15883, -10129, -7886, 6340, 10146, 7020, 13530, 6175, -9612, 2873, 2277, -29764, -16254, 2998, 6721, -9837]
25327i837L339J1877j1540n446q723R033j448r258j6203o162K1279n122j8467
25314d6678K748J5080J6710j0332j729M417N874J2802M969P692Q892j2821j4422
25301f798r045P300J3294J5643o273r524M202k121N761Q783k838Q317k599j6887
25287G215r536L972J2928k0156j3390R796J1118M469j4166J1531J4033n805k9199
25274a7190j5738J9763M152k429N615o387Q489L909J2779J2737o700j4617J4795
25261A9178n09j9398q593k0722O962R873k07n847k366j0182J5077K0623R979k880
25247A0988q190J487j0712j3088J4224K0115L38j036j205Q176j4120l412L583
25234G148M80j1958J8162J1450j8768j7711J8449o610k655J7090N205J2430j1684
$$ y = [-9837, -6498, 5379, -6161, -11607, -20330, -11297, -12745, -22003, -38206, -44368, -23089, -28211, -46678, -43930, -28850, -12140, -22472, -24201, -19784, -13910, -1108, 3861, 11553, 20445, 7624, -6798, -15843, -8543, 4751, 20394, 14121, 4597, 8799, 6678, 12439, 21222, 18384, 26701, 24102, 7215, -2321, 1651, 14579, -5577, -18967, -9171, 1947, 6416, -7750, 3781, 17814, 12009, -17190, -32928, -13165, -9013, -11442, -5827, -12214, -3725, 184, 12963, 25700, 19000, 4383, 19178, 18669, -729, -9322, -30044, -23082, -13209, -13416, -19263, -21629, -31811, -16734, 3889, 13868, 10988, 2798, 4285, -6427, -19515, -5291, 14824, 15162, 14126, 12921, 21097, 6977, 3565, 7148, 7628, -4330, 13832, 25282, 6514, -11197, 7252, 642, -2013, 15077, 20282, 32712, 21028]
25221B1028j331N868Q891l5403j7486q327j4277Q918J7992p959J433K133O42o016
25207b3894J1637J399R471j0463o122J5991j2962j1825r189L607J1724O471K5934
25194A1779k551N055J0263J393o5l270M049n244l241J829o086r891o656q364J861
25179i139j3415N447J0369l555l016J2925r067m869J5684J0503k208j2211J888
25166f64l082j9439j2700L0763L1011j2595j8886p896J5898J2225k4674J3530
25154C491O537q433O562j9402o651k507q253k165J0632J6484N12n174j523k943
25140a2833M09k1965j7851l675K9512J9947L619R786J4644j2502j3429n239M553
25127e024J4389j0004k2155k845R946J2312l966l25R223o909j5936k5056O195
$$ y = [21028, 19697, 25565, 34456, -947, -18433, -26760, -41037, -32119, -14127, -22086, -20653, -18520, -17878, -23894, -12257, -10858, -1387, -11850, -17972, -1981, -14943, -26768, -35957, -32350, -20626, -14155, 11779, 9228, 14283, 24546, 25939, 25874, 22604, 26653, 21409, 18168, 19997, 13911, 4020, -2636, -11000, -9139, -22554, -17107, -6738, -10293, -13309, -384, -9451, -14320, 1364, 11867, 9659, -2552, -664, -3746, -23185, -35885, -5122, 25889, 13294, -5592, -13488, 2410, 14635, -10039, 3491, 10028, 1595, 8157, -11245, -17896, -20403, -28656, -30821, -20189, -3705, -3193, -8367, -9890, -12833, -12424, -34389, -52240, -55915, -26403, -6456, -2837, 6949, 21593, 9091, -4338, -9577, -5024, 9365, -639, -22794, -25639, -15693, -3381, -7347, -7672, 1551, -5358, -21294, -46350, -40155]
25114d0155K8207J5966M436Q443m328o377l5J683m931l569j8914R166K3690L573
25100A6855L575L345j3179j6269O042K38J030N538m762P110k2602m120J1445J9477
25086A3723K884j3115m432J1324N31q029J2833P246j7731L627K0736m034j6601
25073H962k0171N512J0366J285M663J5324j911n072m513O895j3061k6643k0114
25060c8478J8002L2437J707o880P550j6855l997K252j1873j2121J9245K9156O153
25047B6298j2004j2795J103m044L82k0193K047L7899j6408k5500l257K8158j099
25034E87K637j764M368K931m592L927O790R824o974j1122j9696k1347O00J4811
25020a9020M53J1923j2143P641R556Q763l396k872j0244K540k716j1746m620n917
$$ y = [-40155, -11948, 4018, 8454, 16897, 12569, 6192, 6157, 7840, 2909, -660, -19574, -10408, 13282, 16855, 20430, 23775, 10596, -5673, 369, 607, 1637, 7175, 2413, 9523, -13079, -17199, -5754, 13723, 16607, 3492, -940, 10384, 10915, 2886, 15719, 22965, 5234, 8861, 29597, 25563, 8962, -11209, -5697, 4669, 5954, 10617, 25941, 24030, 18958, 14445, 21340, 8279, -18364, -38478, -20476, 11961, 13668, 6788, 14338, -2517, -6514, -4262, -16135, -28256, -9011, 20145, 26298, 14294, 1499, 2602, -1442, -1060, -21253, -19206, 18693, 2285, -23215, -26472, 1686, 587, 3224, 1460, 5828, 8759, 4167, 8094, 14884, 24708, 17734, 6612, -13084, -34431, -33831, -19020, -18567, -6644, -18787, -11146, -1590, 7173, 3777, 905, -9339, -6799, -9515, -21261, -25881, -31798]
25006c1798J0669J8894L746p850q702j3484N165k473p799K6754M011o075J5385
24993F443J326j1252K585j6161K089J3629J975J1556L962q081J081k435R771j2250
24979D238j5259J0091K408J6612J177j871o357R50n212m061j4814J334M091R25
24965e748l125n914J7820K9876j4527k0589j407o24J7661J739l261J117J5958
24952B8976q880n472M547l796j1843J514j6239j705K387j2740j0332r105k724
24939d5412N789J5132O755J0214L462K5309P754j7073j0860J254P813J0193P469
24926B7799q276q337K094L165j0022P387J0520J901P303k105k5926M113k285J722
24912I053m639r869P55J7513j0233n959J9898j0027k3882m367J0629Q49J522J969
$$ y = [-31798, -21129, -2235, 1511, -6339, -15041, -28525, -23360, -25833, -33632, -6878, -2867, -8942, 6443, 7769, -3483, -898, -17059, -14970, -1341, 634, 12190, 16152, 8071, 9152, 6717, 16488, 4238, -11021, -930, 1478, 18090, 19267, 17396, 11039, 11989, 6777, 2716, -12098, -10764, -6673, -5748, -8873, -14787, 3033, 32909, 18382, -2207, -3614, -4238, 13423, 15162, 11901, 13018, 28976, 20096, 14624, 19171, 15375, 3532, 5046, -11193, -12898, -10511, -23251, -33583, -42688, -45412, -39623, -24491, -17736, -7522, -4060, 21249, 29003, 11930, 1070, 2324, 10137, 20330, 27799, 19523, 11186, 13280, 16445, 6423, 13810, 24330, 26231, 33534, 31429, 5503, 9616, 7331, 9053, 4414, -5455, -4700, 12813, 2580, -3379, 16519, 6492, -17390, -21757, -11128, -10279, -8757, -6788]
24898f788L971N481Q414j1705O572N715o167k760j8450L572M522K0921j188j635
24884A0475q96l76J2002L006L010j2487k1891j5197J0491L163n608j2864r763
24871c6935J2177N100M120J2499J2925j6881p154L758K280J7645N780j9039j0709
24858a4434N339N139P574j8514j7808k325J1431n566j0952J3244R293o590P619
24845a6550K0599k243k0955J4069J5256j6906o711J393P415J482j0225o840r479
24832b9695p209J5712J2095M304N224k795n625L784O812J4129R442O447o900j4349
24818A1376q437P872n919j3989o051N143p228j8226M336P58L049K4110J2264r218
24804a60O255L030j5193L693m225p797j3948o857K2234R129n998O160r444j1605
$$ y = [-6788, -2817, 2664, 11078, -627, 5945, 11660, 5493, 2733, -15717, -12145, -7623, 13298, 12110, 10475, 9579, 9203, 21205, 24211, 27221, 14734, -7157, -22354, -11863, -8700, -14308, -27172, -36935, -24758, -19658, -15538, -3039, 9886, -6995, -14149, -10391, -8111, 9534, 15314, -3725, -14434, -9095, -3956, 3618, -14896, -32704, -35029, -23598, -29164, -40116, -26872, -17579, -24169, -16550, 4049, 1806, -19149, -5080, 10176, -6730, -13441, -12048, -4633, -3151, -13376, -20216, -29695, -36904, -21192, -9097, -4793, 431, -2364, -7989, -4205, 2607, 16736, 26178, 32625, 25725, 11376, 2939, 10811, 4892, -9097, -15148, -10005, -17233, -35459, -31123, -30365, -27316, -3206, 9058, -160, 6095, 9125, -6068, -2375, -6600, -14397, -28345, -35202, -12968, -3839, -9837, -3677, -13121, -24726]
24790b4726j4404m095P457J1863N775p413o777O637K2498J0557m144N077o04m834
24776B867L79M756j7162j69n920n386J408r333r044K189J5980J8086J927k181
24762a603L342o167L768R708P81q495r65r228l574R454n928n152P014J0895j0702
24747f852j5046K440J4251J7341K4219J7020k7868j8165p345M77J3557q673r921
24734d565J0308M543m460N645Q384k6869q949J4455Q947J2952j6165j8906K0389
24721E709j0498k3799j2759J0532K2991J7344k292j400o9K876l542o523p259J087
24707g602l84J6659J3261n350r521r447n864L462J8096Q983j6830j1624J2613
24694F452O843M178J5010q191j6751K656k1644j0452l281q001J2271Q050k5502
$$ y = [-24726, -39130, -43225, -35768, -23905, -18130, -25543, -32320, -25683, -3185, 7372, 3228, 8305, 7701, 2867, 3246, 8002, -9160, -9329, -15249, -20635, -19227, -28560, -37604, -35415, -19435, -1349, 578, -1603, 1739, -4428, -660, 9048, 9829, 1334, 369, -8859, -12433, -2979, -8907, -14059, -7045, 3850, -6852, -21898, -19458, -5207, 12134, 36353, 53373, 25505, 7340, -5, 472, 14029, 5356, -4565, 5743, 10286, 5826, 11471, 19855, -7014, -15963, -1508, 7439, 20391, 4226, -14680, 5709, -4789, -28588, -41347, -30815, -7824, 9520, 7228, 5828, 5759, 8635, 5093, -1430, -8689, -7602, -7986, 8673, 21934, 16584, 7063, -2384, -8248, -4786, 13310, 22293, 5463, -6161, 6452, 13295, 17473, 32483, 24292, 7541, 10197, -11447, -21899, -25180, -33181, -20910, -12860, -38362]
24681c8362j1770M007J2204l162N355L0671J3813k393Q10n801p450m168J5358
24668I112J0099P146o571k2609M23M194m670J3485R017J1232m110j9465R807q066
24654I024k4048m972J2439J7253P542R114n164p12m052j0566m877o81j0557M127
24640f130J6226Q092N42N913j8340l251K5015O458q516k8080j5310J7489K2090
24627B2198J3326p329k4971m445K2478N423j2689k2077j5004n726r061J6181L446
24614a8250N125J9823L284m852P248P246j8693j6701l316p865L854r70L738L2392
24600A2063J3407n40M978j0236j5100o432k473M100J349j2525j7817l605K4556
24587h275K6023O991J6387n315r881j3383j697q873j1002J1612O08m714q804K50
$$ y = [-38362, -50132, -46125, -33921, -37083, -31728, -1057, 12756, 10363, 11173, 5372, -2078, -6246, 9112, 19211, 26357, 19786, -2823, -2400, 1794, -2876, 10609, 19626, 30858, 26748, 7283, 17090, 9024, -15024, -19996, -7557, 9696, 17238, 26352, 21188, 20476, 16424, 5858, 981, 300, -10257, -6130, 10096, 18188, 18730, 24643, 6303, 3052, 28067, 34525, 26009, -2071, -17381, 108, 22198, 35524, 28195, 3224, -1221, 21257, 26680, 13991, -8086, -23090, -28816, -37877, -21696, -18250, -13125, 6698, 9982, 5130, 12378, 19624, 931, -15770, -19086, -26951, -23097, -24067, -20329, 12063, 25470, 24930, 29908, 19672, 4572, -1860, -4333, -233, 1116, -11409, -29226, -32831, -8275, 17748, 24739, 41126, 35811, 25930, 12547, 10850, 1977, -9025, 2587, 3195, -1519, -10323, -10073]
24573a0073r282m718k613O054J3515m104N965K258p269J2338L79K791o48j3944
24559i351n933j864N604J0736m280r651p150P938l241j097j0125L714J2249j0606
24545b3057O415l522j1920K0227K550J1263N36j7229K323J0896j728M095O002
24532F851J0091j1321j3885j5088j250K4506K8875j23N941l782j2792j979k2220
24519f176r02p60j8122o166K3063N400j2397m820j10J4335J3994j0837k263j1241
24505a7002N224J6331K863Q200k740o351j4077j067j5679n591j7704K2111J4835
24492a0647m914J3804L849q500J401J0522O21p408k587o240l688Q438R426q253
24478d176L048j1684J4390J987j4569j854J0693J5553k427n760o024J4130J5273
$$ y = [-10073, -19355, -24073, -26686, -20632, -7117, -11221, -5256, -2998, -10267, 2071, 2450, 5241, 4593, -9351, -15284, -17148, -11544, -808, -5088, -14739, -21889, -13951, -17192, -18289, -28414, -24700, -12451, -23057, -16642, -20164, -32084, -11857, -9307, 1956, 2492, -14737, -12414, -1518, -3246, 849, 6851, 16942, 5621, -8264, -23352, -24602, -96, 28779, 28656, 34597, 30815, 18023, 16044, -6176, -7078, -7838, -25960, -32126, -9063, -3663, -16060, -20880, -20990, -6655, 7339, -3498, -5761, -17002, -11778, 4553, 7416, 15616, 12876, 6525, -7552, -8619, -24298, -29889, -47593, -25482, -10647, -15561, -1757, 2092, -6408, -5007, 5515, 6136, -1272, -3859, -10099, -13787, -5349, 4077, -4176, -1128, -12812, 1578, 3565, -11004, -12858, -2165, 13388, 10961, 5201, -823, 13307, 28580]
24465B8580Q948k5387j6355K650M469K364J0456K452J442j48j8467j6637O274
24452i359p1n668P150L568J3382R086Q524L025j2991k2951n867K4651J0719O142
24438B9340j8216k3926M964J3784J3930j6531o079k854m005j1859q252Q77O032
24425b2795J3011P121K925k85j0715m960L640l273j5388J1905K2094J5928m400
24412A4808K992j1253j1927p48j587M088o306J6078J6909J0322R135j9650j7586
24399E275r417J3531p130k4209Q139M088P194K1816J3194j2267j6398j7895j0586
24386b4665R98J4639J2450l172j6909j2899P829O116K1063J7710K431j5215j8692
24373h316p367R440j51j3057M970R84Q560J3282O236J670j4099j7242k952O136
$$ y = [28580, 37528, 12141, -4214, -1564, 2905, 5269, 15725, 18177, 19619, 19471, 1004, -15633, -9359, -9430, -15098, -7948, -4380, 9002, 18088, 26612, 29637, 16646, -6305, -12172, 12479, 23198, 29340, 11124, -12802, -7838, 5946, 19876, 3345, -2734, -5588, -9593, -21452, -29704, -28827, -22795, -9784, -2663, 262, -23, -10738, -15698, -12058, -15331, -30719, -18814, 3280, 19208, 14808, 17800, 6547, -5380, -6128, -7715, -3627, -9933, 6145, 23054, 33376, 42511, 22861, 5275, -4142, 9389, 2259, -21950, -13811, -9723, -2529, 19287, 32481, 20214, 3816, -14079, -24665, -23667, -9028, 3422, 250, -16659, -29558, -21729, -15613, 5450, 23160, 25591, 10376, -8316, -15683, -6243, -6394, -19451, -14481, -13497, -4937, 8345, 14581, 16251, 2152, -15090, -18042, -11906]
24359a1906J4938Mn940j568k574k763l661j2219J0238J5736J5711k81n287r711
24345G17J4142J4285Q125j0413k2366L226j793j8457j5687O739j6852O24M706
24332c3004l145N532K000N198Q940J6240k459k5491R296J1763K44L543J5437J3507
24318B7601r675k5156j2396j307J9931M607k586m156L045P549j7111j330J6447
24305E463J4011j0964j7329m374N764J0317k740q935J3193m062k6179j6464J2785
24292b9514J1000O474j62m826k977K0349K7983M453k637p670o293j331Q151o858
24278A6142j2300o235Q363j8268J452J3934L92j2902p992j9103j452J786K3292
24265a2891J2819j418K011K989k669j8563q565J632J6903J1164N033k280L745
$$ y = [-11906, 3032, 3036, -2904, -4472, -7046, -9809, -13470, -25689, -15451, 285, 15996, 15715, 10428, 717, 14859, 29144, 37269, 26856, 4490, 7716, 5923, -12534, -28221, -21482, -38334, -37710, -33004, -36149, -30617, -28617, -23419, -14479, 1761, -698, -26189, -16893, -5130, -4886, -1343, 14094, 27601, 17926, -7230, -19626, -20933, -1002, 3605, 1019, -3137, -92, 7457, -9654, -10984, 5463, 19474, 8510, -8819, -13193, -7429, 2888, 148, -8787, 4406, 344, -25835, -42299, -29514, -18514, -12040, -12202, -17028, -20005, 344, 28327, 32780, 30143, 22473, 16180, 14849, 23000, 16142, 3842, -2393, 5970, -12298, -10846, 3088, 3480, -9422, -17414, -36517, -37969, -36183, -12891, -72, -1490, 521, 3510, 841, -17722, -26287, -24655, -7752, 3412, 8445, 6165, 9910]
24252I910m592j5382p831R735J4006p88q446o510j0687K3138J6847j882p240p733
24238B545j4635j3484P469P060p363K865o067m968K1499J7166N174j753J6724
24225C2232O85m761N611r404q38k32O965o182j786J1729P732j7253k0701n178
24211a381R768K0157r303n330M511l883r375l61O112k0171k3561n806K4699J5990
24197B066P387J1230j6117j922k88L009J3821o179q333j9579j2942J2415P334
24184h098K0526J4342N388o688j6858n307P133j3854q530l57Q560p186N49O63
24170i717q088q655J647J769k122j5278K1007K3032q818j3252q68J3138P50J287
24156d168N350Q982K823j4529L103n491K88K2773J4187K287j4379j1619J1607
$$ y = [9910, 5318, -10064, -17895, -8160, 5846, 5058, -3388, -9898, -20585, 2553, 19400, 17518, 10278, 2545, -12090, -25574, -18105, -11045, -18408, -15543, -21610, -26578, -5079, 12087, 17261, 15508, 32232, 32917, 28156, 33767, 24363, 23525, 23293, 30258, 24076, 22290, 34019, 41751, 24498, 3797, -1381, 8387, 28544, 19241, 13911, 18422, 14539, 5164, 4803, 10915, -9256, -32817, -38623, -13924, 2066, 9453, 20683, 4566, 2644, 2356, 5365, 19186, 13007, 4674, -14905, -27847, -15432, -8098, 12428, 26770, 32158, 25470, 8612, 3305, 10438, -3416, -11946, -12303, -3743, -10929, -10380, -9717, -17805, -26460, -24813, -23044, -25166, -40444, -19437, 3595, -5223, -18475, -19343, -6205, -5455, -4168, 1182, 10164, 12987, -1542, 1561, -3930, -3642, 19131, 33318, 35605, 21226, 9607, 21214]
24143B1214J1399j4919n278n699j2441k130m831Q631L343q016Q923J2884l0978
24130a7898j1740j3361R021K5958R478n313j4339k510l949p63K160Q866J7147
24117B757J0349p770q031p96l117O380J2667K980j6905j743j8680q078j6165K183
24103d3969L1068J6437j0838m892l472L536N540J2454J7691n08k2853r345J2984
24090C833K52R00R972L98j2921j4987j0369N382K599Q637l696M533j2708n541
24076b3716J699L962J4881M744k076m343j383J4043J4139k0565l811R666J40n425
24062A955M779k0783l1851j3556K0367O608Q316K9965R319k1598N873K0738n18
24049A9614P04j6370j8468p481N655O681j3620k757J9091J858k481O995N434k0647
$$ y = [21214, 32613, 17694, 12416, 6717, -5724, -7854, -12685, -4054, -711, -8727, 196, 13080, -17898, -29638, -42999, -33978, -8020, 1458, -3855, -18194, -20704, -24653, -25416, -23256, -14390, 2757, 13106, 5336, -2695, -3491, -6608, -228, 12439, 15419, -1486, -3229, -21909, -29987, -46152, -43969, -12901, 3536, -7302, -12194, -15666, -12130, -6590, 5864, 23555, 23047, 194, -9151, 3833, 4085, 4985, 14957, 15355, 2434, -12553, -22922, -17540, -14941, -6304, -10000, -5467, -18175, -23716, -22017, -18055, -3174, 1570, -506, -4849, -6232, 7811, 21950, 1385, -2426, 7240, 7380, 1955, 6734, -14049, -45900, -59456, -39089, -32481, -24165, 5800, 15119, -6479, -606, 20132, 19614, 20318, 3948, -14520, -22001, -16346, -9665, -23285, -26042, -6951, -5093, -7574, -579, 4855, -15792]
24035a5792N360J4203J4772j9257p292P270j587P890P271L109L817J0186l18n757
24021B3875j3709p699j6336j4402p084K9443J1201k051O443R780l319O548J3719
24008C6409m985j1158k785j3122J025O23p707j1685L288J5893p844k8860k578
23995c3486Q565Q296M971k35J1202l368O220n523o379J0492k185n544O540N840
23981E406J2166J3290l452N977m426j2901j9626L413j0174K644M780k120j1218
23968a6241j2356n566K33K4396R819J3O140l782m612r021l862j1865K747N973
23954a7984j739p935J4145r897J6318J1244o352J4657K623K629p625p177j95j1895
23940i183L660m991N207M690k082k197l942j4957j4508p839r75R082J2714N153
$$ y = [-15792, -10432, 3771, 18543, -714, -8006, -736, -2323, 5567, 12838, 15947, 19764, 29950, 29632, 23875, 10166, 2467, -13869, -28271, -35355, -5912, 5289, 3238, 9681, 19461, 16142, 22690, 36409, 31424, 20266, 17481, 4359, 5384, 6007, -1700, -13385, -10097, 5796, -2048, -30908, -33486, -24921, -16625, -11654, -11889, -687, -4055, 2165, -3358, -9737, 755, -1430, -6974, -434, 5406, 17572, 30862, 27410, 33387, 28961, 16060, -3566, -153, -10327, -7683, -2903, -5023, -16241, -28597, -34163, -33930, -9534, 285, 298, 6438, 2656, -1956, -10977, -14839, -26704, -23957, -17984, -19723, -27658, -13513, -23410, -7092, 4152, -2200, 12457, 15080, 17709, 10084, 2907, 2712, -9183, -5523, -10514, -5307, -617, -2699, -4896, -8838, -23795, -38303, -46142, -47117, -38035, -25321, -20168]
23926b0168L036o529L385k445N339n107l9m137q697j5784l999J4563K8275O146
23912f161l4438K3175m019K2912K4176L375k2275J270m440j0134L186M958J2223
23899A3808J3918J1632j7566j3519o115m116j5265j3357J9075R089K767o268K13
23886e704n755J6745J5770L558j2349l442O456j9765j1951q804J9495J0067j516
23873B805j8346j1117L508J7340j463k501L533k2225j0113j058J1404j1189l8
23860c9460j21M835P646J5386k46P638Q005l419j3211k1844k871J4219J814J3986
23846g643L512q0j8091r207N225J6537p52k3728q209O158L0853P63M85O568R386
23831A1777L713N201p205j8778o420K437J9674j3629o423j2023K1478M996n865
$$ y = [-20168, -17132, -23661, -20276, -22721, -17382, -22489, -22528, -26665, -35362, -51146, -55145, -40582, -12307, -6161, -40599, -17424, -21443, 1469, 25645, 29020, 6745, 8015, 3575, -6559, -3373, 1585, 13808, 27726, 39358, 21792, 8273, 2158, -1958, -17223, -30580, -11505, -2416, 351, -5917, -5704, -11459, 5286, 21056, 24614, 12265, 8823, 15279, -4486, -16437, -25241, -5746, 4321, 2805, -15541, -26658, -23150, -5810, -7273, -9774, -6241, -28466, -38579, -39637, -28233, -39422, -39460, -39581, -34746, -27100, -11714, -11960, -4322, 3683, 264, -12947, -34791, -37662, -23443, -21629, -7643, -4131, -4211, -22302, -31509, -26284, -9747, -10499, -34227, -42436, -36278, -5425, -4662, -4177, 2391, 11777, 15490, 20691, 13486, -5292, -11712, -9275, 10399, -3230, -9653, -21676, -198, 4798, -1067]
23818a067j5613l260J2243J9119J7097M59k7279l570K2884J960j4786J067N540
23805A4794J0923M748J0373J378j1300l1841j0441Q157n587l802K1866N813o089
23792H992m552j3605O099Q28j3661L681J6060J4806L989j1056q964J4507O868
23779B3992m764j2299q582J2519K1957K23J4413q43k7773q842L085j6209k2015
23766b5138J1815L2120r766p445K212l580j5304J9165J7418q564k7507k4909N332
23753c4151L842j39k203P469J2933R853K2412K274j3527J4234r64k4897j5640
23740a8504J6057j814j447M045k0799j7415J4960K3233l931M66J0875Q675n488
23727H913J6913K665j9651K126m430l994N415K82J2854n915J77m021n089m292
$$ y = [-1067, -16680, -19940, -7697, 11422, 28519, 28978, 1699, -1871, 21013, 22973, 8187, 9254, 14794, 25717, 30465, 40838, 42216, 30916, -925, -11366, -3209, -8796, -12598, 9268, 15081, 8992, 4440, -9165, -3066, -2238, -15899, -12218, 3842, 18648, 22637, 11581, 2617, 17124, 23992, 19228, 6929, -1653, 10866, 32823, 33046, 47459, 46616, 18843, 10001, 13086, -3123, -25138, -13323, 18797, 9031, 1586, 3798, 218, -15086, 4079, 21497, 12933, -14574, -39483, -34151, -30309, -30448, -32651, -25182, -12249, -2396, 20016, 22290, 8763, 22997, 22033, -2864, -18504, -2447, -4261, -5708, -1663, -22462, -39877, -24917, -1684, -5615, -5149, 5726, 14401, 8913, 25826, 28491, 8840, 10966, 6536, 2542, 7957, 8239, 21093, 15178, 15355, 11334, 6245, 1953]
23713A953l555q862J279K240L211M680K417J0571j065N154o504J1188j1771j0220
23699G16n448R148J6796p752k4193j8849M813Q031l846R490J2908k452K052j2094
23685a0680L450j859L312j477N143O418K080o271J844p708m9K990M491J549k6720
23670b3487N4k416J3159J206J7235P890j2274J403N093O476j2551r724J647J1511
23656E222Q258k490j5369j1018J0577J7474J672k1338j7786O400o787J208M220
23643a9757J4036O981m752K6631K1014j1320J827L218k3669j2318j609n465J429
23630c754k19L351Q91p211K447k783n699K262K541m210J2899K4441K1562r482
23616C7036j3742j4832j1245K082J1685K199o182P686J5642j7482n65P120j4761
$$ y = [1953, -1602, -10464, -9185, -6945, -3734, 946, 3363, 13934, 12869, 18023, 11519, 22707, 10936, 716, -4732, 4416, 21212, 13460, -10733, -29582, -24769, -16738, -20584, -11094, 1814, -638, 1414, -10680, -7230, -9089, -5777, -7254, -2111, 4307, 6387, 116, 1960, -5748, -5797, -2807, 1684, 3233, -23487, -23433, -25849, -12690, -11484, 5751, 13641, 1367, 2770, 7863, 14339, 1788, -7936, -6289, 5222, 13480, 10990, -4379, -15397, -4820, 12654, 14326, -7012, -24798, -18398, -25185, -23977, -19757, -5721, 1260, -3492, 23139, 44153, 32833, 34660, 37878, 14209, 1891, 282, -5183, -3754, -3973, -622, 269, -6942, -4495, -7278, -12977, -10715, -8174, -12384, 515, 24956, 46518, 37036, 23294, 8462, -2783, -701, 10984, 13183, 7001, 14687, 30329, 12847, 12282, 19402, 4641]
23603D641j546m601j6794n683J7919L0293o72j0125k877k046k79P597j4039l057
23589a269n930m579J355o400K9072K1112j2883j8004k3917l623O489Q753J4407
23576D583r162j543k977o262j1102N32J3671M679j594j4176j762L35j7948j422
23562d4148o446J554J9389K0614r248L059K2566L0020l082j7467j7829j2233m474
23549a7725j0337J3333J7979m270n454O599K589j1929J329J4388L324j2479j7710
23536b0363j1627j7047k605J9127J0180L850J988o062J6716q195p315K0396J6867
23523A5910o329m973L656O62j2767j1702p303J6825J2054q220j1511p261K759
23510a8200O656J360N855J2070q524j419l760m6m23J5924J1004P278M660P25m298
$$ y = [4641, 3095, -1506, -18300, -23983, -6064, 24229, 23557, 13432, 10555, 8509, 8230, 15827, 1788, -1269, -7199, -11778, -10423, -16823, 12249, 33361, 20478, 2474, -21443, -25066, -18577, -9824, 4583, -4579, -6122, -9099, -15361, -26463, -25931, -12260, -7581, -9175, -23351, -25113, -24778, -42726, -44148, -50594, -49040, -29651, -9037, -18285, -15226, 7340, 37360, 34278, 16811, -1018, -13251, -17725, -28062, -14729, 3250, -1020, -6474, 125, 2714, -9215, -7886, 6502, 9826, -2653, -20363, -31990, -49037, -51642, -32515, -22335, -18485, -16497, -22559, -5843, -14038, -21353, -957, 15910, 9581, 4608, 8264, 8926, -3841, -15543, -22846, -6021, 6033, -2187, -13698, -20959, -18200, -11544, -10184, -4329, 7741, -783, -2202, -5962, -6008, -6431, 9493, 20497, 27775, 32435, 33160, 28862]
23495B8862j8552R106Q763o999j4564j1177K383j2447j4605j0659J5071K1264
23483c554K887K623N934Q687k2465j6331J4152R182K435Q894n709m175P761K458
23469A2779j2634j6435J607J0106m64K866J7095L407m061j7847M864q038K0971
23456A4216K8194O180j3339j9066J69K020K962l803j4268j1680j749N753L699
23443g12n953R602J1373P406j2473Q72k78j3492r937r765K5627J2325j3144k7055
23429b5604L421K0733K0871J5882K632j0126P196K300k420k1127n383M485n094
23416G766L303m904r457j441R880R838N235p982k1481Q907J0498k4386J1353j421
23402d292M72j389r308m944j2089J8041N017m270K2474p15J697n372N522k728
$$ y = [28862, 10310, 19416, 28179, 21180, 6616, -4561, -2178, -14625, -29230, -39889, -24818, -3554, -667, 1956, 7890, 16577, -5888, -22219, -8067, 1115, 3550, 12444, 6735, 2560, 10321, 12779, 145, -16290, -14683, -4577, -5041, -2175, 14920, 18327, 14266, -3581, 1283, -6755, 14216, 42410, 48590, 35251, 16185, 16354, 18374, 21336, 17533, 3265, -8415, -10164, -4411, -712, -6665, 2937, 14310, 21716, 9243, 10115, 9837, -3655, -13592, -23357, 2270, 14595, 1451, -25604, -22183, -1450, 19421, 35303, 37935, 27809, 35005, 37305, 34885, 13758, 8375, 12860, 7766, 11069, 6165, -3292, -4733, 5147, 14985, 20220, 12238, -9243, -336, 10162, -14224, -2871, -4292, -3820, -5209, -14517, -19461, -31550, -13509, -8492, -12762, 9712, 8997, 10694, 5322, 10844, 8116]
23388H116N143M29P243R866J0457j1615l0307k1649J255J0079J477P048P738J597
23374F877k0808k1158k301L0372J9560m07P406p659j657J42n492j202Q287j4183
23360b223k947J9951L606r157L489m332q987r069p253J3576J3147J1005m106m094
23346A2606j5160j1775k341J1012N09J817r254q213J7552k500J1562J3377M5m912
23332A4325j0221Q032k908j7056j6820O851K0237J2610k5675k651J1310J0288
23320H322N017P357j4304j5486r373R217L692O793l273l606k852n33j4897q384
23306c2310J5873J5327k335j1279M094j257p560m276l180p540L428L07J0483J7524
23292b701P403P563q839k0116O104M22R997l133O249J015m789N091J236p861R285
$$ y = [8116, 13259, 13688, 20931, 30797, 41254, 29639, -668, -22317, -21062, -10983, -9506, -2458, 5280, 6877, -13931, -35089, -37390, -7018, 12542, 12135, 19541, 11882, 10225, 10367, 4875, 3673, 11960, -2223, -5170, 14781, 18387, 9230, 12719, 8387, -600, -9669, -16922, -3346, 9801, 20806, 16700, 12606, -2554, -14329, -16670, -5658, -5149, -3332, -12586, -20799, -3247, -5747, 5815, 19192, 19237, 14325, 4104, 12136, 9228, -7828, -24648, -17797, 2440, 15050, -10625, -13276, -1966, 8322, 13339, 20696, 6392, -9094, -18467, -9250, -5558, 1235, -2038, -5644, -8496, -9029, -23926, -32310, -16437, -1110, -3445, -14724, -10630, -11887, -19447, -23723, -26903, -34443, -31015, -30708, -20225, -2701, 4702, 12265, 3426, -16690, -10586, -10164, -167, -3300, 2949, 3964, -825, 4266, 5502, -2359, 6926]
23277F926K093O008K122O417k1175j0551L984J1359k056M762R03j3210j3411j859
23263a7688J640n464J0998J3909m171J473k509K23O472J2086K761j0308O637o086
23249I973n082N762L752J3403N4k9653q449m479j3978l700L205K3057K0169J2592
23235B6626k0527p577j919J1614J4715l393l5675k742J7867L437j408J1888Q837
23222B1743R662J3035m189j1066N430j9910p642N385J4482k3229l1488k0449J3277
23209c4959P858l080J8407O086l502q232R402K0854m872k5019j5882O841J1170
23196a4928q106O172l42P142K691J3790P775p170k5332m653J5179J8201j319l722
23182E378q283J6125j3012p176k911n370j2384R891J77k234P276k436k774K568
$$ y = [6926, 9019, 15027, 17149, 23566, 2391, -8160, -4176, 7183, 5127, 9889, 10792, -2418, -15829, -17688, -16048, -21512, -10514, 3395, -776, 697, -1812, -1589, 4883, 16969, 19730, 9422, 16059, 9973, 4891, 10653, 14405, 27808, 27862, -1791, -10240, -14719, -28697, -32397, -29192, -6135, 14034, 26626, 6099, -1478, -3397, 8217, 22932, 19539, -16136, -18878, -1011, 2426, 1018, 12906, 21743, 31405, 44440, 40251, 29185, 34615, 14705, 7063, 12448, 26930, 3701, -27787, -48236, -34959, -27101, -30181, -11774, -5688, -9190, -17422, -8020, 12834, 7962, -17057, -32939, -26098, -14928, -23034, -16862, -17204, -10062, -7371, 6419, 14194, 7024, -18308, -22961, -7782, 10419, 9100, 5378, -2905, 13220, 208, -6968, -9879, -15249, -27633, -17742, -17565, -19799, -12523, -14959, -17733, -15165]
23168a5165J153N380L00R743J9132J0788k3397k5220j7665J8679P393k652N812
23155e719M261j657m195K6241M299j0226P526J808r9L51j2456j1745L84l276M243
23140b60L553J2728Q253j4363j2911q599J4284O216M278j1887q470k6951j3462
23127d7591J3368K5867O04j6777M24p476N750J2972n156J8364J5111k0658j374
23114f572J311r696J7158J1713o419O100p708q149j8898J4905K3588N881r615
23101A3599j9032J6477l443j5307K920N68m434N942K141j1779j1241j8028q02
23088d2419J6018L966k439J1029J6714j3453J805J2438J742M583O567r063n325
23075B163n333o643j2596P111J4476L5381m216K819o695r886n599q086j6241N245
$$ y = [-15165, -14012, -8632, -8332, 1411, 20543, 31331, 7934, -17286, -34951, -16272, -8879, -11531, -5719, -1458, -3115, -7310, 18931, 23230, 13004, 20530, 22338, 22239, 22590, 10134, -1611, -1227, -4503, -260, 3293, 16021, 24274, 9911, -3000, -11599, 2685, 8901, 13179, 1292, -7178, -34129, -47591, -34223, -8356, -7752, -24529, -24105, -31581, -25831, -12859, -18015, 349, 15460, -5198, -6572, -5261, -14957, 2201, 13914, 7495, 13595, 5887, -2262, -21160, -6255, 17333, 23214, 13599, -5433, 11044, 7601, -7706, -4786, -4218, -8652, -2710, -569, -12348, -23589, -41617, -42419, -26401, -22435, -24874, -13845, 2869, -10584, -8779, 3659, 5401, 9984, 16551, 7488, 2163, -3170, -9813, -22409, -15298, -822, 34559, 30343, 33162, 26467, 16581, 10982, 2896, -13345, -8100]
23061h100P758r547J4160m765J812Q70O141m574j9935p223L3853J7979J383j3065
23047A6747K749J996q796l639L475j3552k646j792J1507J3580J585q780R907K589
23033B4930K584j2071j2259j975Q991N601p007l019J0648L323k8916R86l658J170
23019a0672q820o68J6603K2411J2987j2882j3249j92m913N271k185l078L961k465
23005B109j0756n8O54N513l049p970l833j0010J3747K4579r756R783J7317k0417
22991G853j1132Q891j1646l023R301Q805n780J0510o611m720M058j3366k5509
22978c2369j236J6280N947P905j4834N944J2009L761j5234J832O122J0517L316
22965I960r799K638J0188j0655j1550J6938J1436P80l276m085M498j068j638R267
$$ y = [-8100, -342, -9889, 4271, -494, 1318, 2188, 8329, 3755, -16180, -23403, 10450, 28429, 29812, 16747, 19496, 21492, 12696, 9057, 12532, -1020, -3666, -5458, 6049, 19629, 21214, 12434, 22341, 24930, 27514, 15443, 3184, 1209, 10200, 15801, 8794, 5775, 16423, 19746, -9170, -8184, -11842, -10672, -19492, -20160, -3557, 18854, 31841, 18959, 5710, 5518, 605, 5876, 3691, 613, 4574, 2109, -8647, -8705, -8051, -2538, -5587, -13557, -17390, -27400, -13653, 10926, 1170, 10953, 28270, 7853, -3279, 5612, -6034, -9057, 244, 9049, 3269, 13779, 7168, 2448, 6506, -6860, -32369, -33605, -17325, -11378, -3473, -18307, -12363, -354, 3407, -11827, -9995, -3873, 6644, 9960, 161, 2799, 12987, 2332, -9218, 7720, 19156, 19936, 16660, 12575, 17073, 16005, 14367, 23634]
22951B3634j284J433j9083k8238j4378J880K1001L805J0567K313m914q403J5779
22938D112M978M608p837N120j355j2807q765K403N415M761J848k01n057j1859
22924a4636J2690l59L251J4600O718q052j1204J94r545Q47N795r31j6447j4013
22910c1092J8N18Q902J5092J2940k4478k097J9508K4461k117O697M09n172M163
22896B7752j7399o829J7649P804o542j3867p665p907m901K91J5796J4433J587
22883B0202L159K8202o933j4042P383j1293j3398L593q023l323j3409k099K925
22870g056O795J4717K2962J4588J061j0129j2995j8685m553q703j607j9404J818
22857b1191n103J910J2632J6481R607R283L500j9200j8893n764P669P270j0434
$$ y = [23634, 22350, 23783, 4700, -23538, -37916, -36036, -15035, -11230, -663, 1650, -3264, -11667, 4112, 9090, 13698, 5861, 10981, 9626, -3181, -11946, -9543, -4128, 633, 2481, 2280, -2777, -14636, -1946, -2305, 946, 15546, 22264, 14212, 3008, 3202, -6343, -5496, 299, -632, -17079, -31092, -31074, -30556, -21654, -6562, 6378, -18100, -20197, -689, 23772, 21655, 28352, 28761, 23589, 27752, 10353, 3524, 21173, 28977, 22435, 8568, 903, -7004, -11905, -11614, 4182, 18615, 20202, 23361, 51563, 44630, 30588, 37971, 26678, 13280, 16873, 8850, 5527, -7882, -9981, -7056, -261, 14456, 37418, 52006, 53067, 42938, 29943, 11258, 6705, -1998, -3605, -23009, -21191, -26294, -24384, -11752, 4729, 14336, 23619, 27119, 7919, -10974, -16738, -9069, -1799, -12233]
22844a2233Q809R057r64N751R465J297j594r199Q307M425J1681j1217l324Q479
22830B8740j8329m199j2040L175M264P869K491k917J0782l514j6321j5867J0873
22817d993P410j0526m366p477M189q275m311r226j5926K8136L0619R23q270r862
22803a1955N210K167j43r568J7168J2510m526m435J673K7178j361j4707k959n706
22789A0546k892m9j94p777j3567P25j36q87J5827K0208l719j5885m298Q552J019
22774G473J484L457J0743n205p367K280q030j9309N489Q594l897J3742R417o754
22760A2117j3972p805o843q04J9470K520m665o106q331J3496J8119K495j0341
22747I350O054P628j2915o166N474J299L130j5628j859J8752J2604j1810n292
$$ y = [-12233, -3424, 5633, 4669, 10420, 19885, 21182, 19588, 10389, 18696, 23121, 34802, 23585, 20261, 28740, 10411, 6212, -5828, -2653, 1611, 9480, 11971, 9054, 19836, 16322, 1, -15866, -4993, 2417, -8109, -12475, -19952, -15763, -24038, -28349, -37575, -53501, -25365, 5254, 6177, -2093, -11955, -6745, -4578, -4721, -14289, 2879, 15389, 10863, 6428, 8101, 35279, 33918, 19211, 16252, 10546, 7654, 7605, 7411, -366, -13933, -13208, -13344, -14231, 1596, 21804, 18085, 2200, -2098, 6454, 7473, 8957, 12414, 23157, 17952, 10585, 12865, 4835, -14474, -8985, -391, -4288, 9454, 18871, 12117, -1855, -9660, -16503, -17307, 2163, 4683, 18, -6088, -14419, -923, 17196, 19691, 9350, 15404, 23032, 10117, 3951, 9425, 10724, 13854, -1774, -3633, 15119, 27723, 15913, 10621]
22734A0621j010O115N757P386O747p555p685m516r864m896Q349j7692j3434q311
22720b9988q527J1116K1276n607J0649J8252L912j3729L852J640J213K94p903
22707F450l743j8018p902J5528J1646M455p836J281o78R784P926J462j9364r64
22693B7m280j2836M019R128n387o70L330k216j8570m643M887J9019j918j1301
22679b1411J601j435J1035j293j7175k315J1195J9228P091L297p973J0715J4643
22666B7203N297q640j4340j1620J208M125J39j7034k3049j469R408o463M231j102
22652c2106L812N895Q476j7602j1055R108L3260R079r506n639k268l366k1362
22639c3274r134J4101J3091n870J754J8198J3111K315j7470M583J305K118q050
$$ y = [10621, 9611, 15726, 21483, 28869, 35616, 28061, 20376, 15860, 5996, 1100, 9449, -8243, -21677, -29988, -38515, -27399, -6123, -11730, -1081, 17171, 21083, 7354, 11206, 12846, 14059, 14353, 6450, 2707, -15311, -23213, -7685, 3961, 8416, 580, 1861, 1183, 10967, 18893, 20355, 991, 27, -4253, -17089, -13070, -3942, -9329, -9999, -6669, -8885, -27455, -32098, -27211, -8192, -10110, -21411, -19810, -21245, -10210, -11503, -28678, -30993, -19798, -570, 6521, 9818, 1845, 12560, 27203, 32500, 23860, 9520, -2100, -892, 3233, 3372, -13662, -36711, -38180, -28772, -35235, -31004, -32106, -28294, -22399, -13923, -31525, -42580, -33472, -212, 8867, -639, -6278, -8546, -11912, -33274, -42408, -28307, -15216, -21086, -19332, -1134, 11977, 14292, -3178, 1405, 2710, 4828, -3222]
22626c222p078J0050J5367n181p481L220J2725O483k7706k2413M171N820J9671
22613D426J9237k477j0770r809Q000L214m103l300K871R545P066P254k4632j7198
22599a0676j0613J1152l541O151n488O647K5826R79N143R510j9809J4444P920
22586C7645q773j8769p60P273q527j0783o305J0171j5008r579N561l449R277Q509
22572c517m658m764l101L596r850l868j721J0761J7523r838j2696L326K773k142
22558a8176n472Q596J7167J573k4321j817K2411K1505L745J272N294n483k9648
22545c354j8660N588p827J0773J2453N469k870j4421p01P926j2800Q677L615N816
22531c16p770m782J2501j8464j3819N27J7707K630j1092j0101q401j1529J3802
$$ y = [-3222, -10300, -250, 15117, 9936, 2455, 5675, 18400, 24883, -2823, -25236, -21065, -15245, 4426, 23663, 21186, 10416, 607, 8607, 11821, 7718, 4418, 7289, 16834, 23900, 31154, 6522, -10676, -21289, -10137, -13678, -7527, -13015, -6368, 19458, 20437, 25580, 35090, 15281, 29725, 37645, 28872, 10103, 9343, 16616, 8089, -2694, -8999, 1172, -13836, -23415, -17854, -21303, -12026, -3517, -8175, -12939, -16040, -12444, -22294, -26162, -27883, -17122, 401, -9437, -22133, -18807, -16034, -18176, -23648, -15052, 2115, 3688, -20633, -22450, -39, 21466, 25211, 26483, 31777, 26294, -3354, -22014, -16426, -24253, -13480, -1027, 4442, 1572, -12849, -13550, -5624, -18424, -9747, -6132, -316, -8086, -12868, -367, -18831, -32650, -32123, -14416, -11786, -22878, -32979, -41380, -52909, -39107]
22518c9107L548o628Q083J7350J6457O882R991j2762k2393j3097R74P523J4477
22505h702J3753j5195r99k180P956J731p773K417J2826k062j510J1593J3045j3528
22491A1372J165Q225Q476o976j5768j1707N132L890J6354Q866j3824j2029j4246
22478a1070N759M686J0574R356J2291P686k3156j0902Q092j2861j8695n156K386
22465b1010J5275O709Q49O924J764j5535k211J3161K1381j1629R515k2892j0686
22452h385J0552J1340j805n767J1238r185j2942Q657M874j2171J7568R779l976
22439A9777M813J4406l173k5307n038o231n078j031L253l336j5435N279K2973
22426E872N898o752j795K234l680R689K329N529j820J049j451j618N838o386n812
$$ y = [-39107, -35559, -42187, -34104, -16754, -297, 6585, 16576, 3814, -18579, -31676, -30702, -23179, -8702, 5051, -10144, -11143, -13323, -5367, -3636, -11409, -8992, 3834, 1772, 262, 11855, 24900, 11372, 12537, 20762, 29238, 22262, 6494, -5213, -81, 3809, 20163, 29029, 15205, 3176, -11070, -5311, -625, 9949, 19305, 31596, 39282, 16126, 5224, 13316, 455, -18240, -23396, -21010, -5735, 974, 1823, 8747, 10511, -5024, -7235, 5926, 27307, 15678, 25193, 2301, -8385, 2167, 13507, 11702, 5935, 17173, 7988, -4954, 3703, 8577, -3594, 13974, 23753, 19777, 24590, 38996, 35823, 10516, 5478, -753, -5831, -6862, -3609, -6945, -22380, -17101, 5872, 11770, 5018, 3223, 5457, 1777, 11466, 13795, 19324, 17504, 18553, 17102, 15484, 21322, 14936, 9124]
22411I124Q48L358m873J0676l762j3400r231O000N194J0942m290j2423P352P701
22397A3216J2694M050Q581o042n575p06j0722k1964P71j717k641k890k069R652
22383e362J1583k4739P376M126P164R702Q874J2734n980j4610n095k670j2015
22370h912j9554O233p81J4087J2692K047j013q471J50P929k2858j6257J6260n360
22356b3808N164N685n642j7134Q885r404M2J2857J4100M657n174k99J468J7781
22342I178m806m378K1256n237L256q922L668J2379q084j5639q04L535M479L213
22328A3094n245k930j4531n832J4346j1307p904j0115m15J2617N399q523P361
22315a3985J800m787K1303R127L417N302M613j7373n320n610p628j1412o015N546
$$ y = [9124, 9972, 13330, 8457, 19133, 15371, 1971, -7260, -1260, 3934, 14876, 10586, -1837, 5515, 13216, 25910, 29960, 38541, 32499, 26924, 26218, 15496, -6468, -5697, -7414, -10055, -12945, -15014, -5362, 6221, -18518, -11142, -7016, 148, 9850, 18724, 31458, 25478, 10868, 5773, 3103, -8912, -28466, -22233, -23014, -8927, 3765, 5812, 4799, -3672, -3522, 4407, -18451, -34708, -18448, -23808, -18644, -12959, -18601, -35735, -26850, -36254, -36212, -23355, -9255, -4598, -9772, -10071, -8603, 9178, 4372, -6, 21250, 16013, 19269, 10347, 14015, 26394, 18310, 2671, 1867, 5402, 9881, 13094, 7849, 4919, -9612, -15444, -1098, -12405, -20309, -30424, -30839, -18222, -12823, -21346, -13985, -12185, -16972, 4331, 13458, 16875, 22177, 26790, 9417, 4097, -1513, -9141, -20553, -26568, -21022]
22301b1022J151K469j1141Q823P133J4085k635q615N818q432j357q066L213R669
22287h907J7936J6692j2332p940M671j2787l488j9239p278p672j897J4001J3748
22274a4492M893J4033k438k133L962j3261l770J0749L948j142r780j5500m741
22261b9672J547R565K1153K2201l970O024K3022k5279l2479L410K0180J5964k3
22248C1643j1107k1916R544J175N998J29O363J460j1835J0020j1465r709P206
22235G506J6462j1637p961J0417K2900R408k0042k3194J1953O785j5746k0175
22223a3324J0636J9517J1021o142m921j0346L788N730J81J4998N73j842J475L715
22209C5059J014q445o788j0206P332N854j6510j0161J68j1268L470J4263R132
$$ y = [-21022, -19871, -17402, -28543, -19720, -12587, 1498, -1137, -9752, -3934, -12366, -13723, -21789, -18576, -8907, 9029, 25721, 13389, 5449, 10120, -2667, -6155, -25394, -32672, -40344, -42241, -28240, -14492, -9599, 4434, 1996, -137, 3825, -9436, -13206, -2457, 1491, 349, -9431, -24931, -29672, -28125, -18560, 2593, 24794, 20824, 26848, 49870, 24591, -7888, -4478, 15702, 31666, 31643, 20536, -1380, 8164, 9339, 15337, 15466, 21829, 23289, 11454, 21474, 10009, 300, 7506, 23968, 12331, 4370, 14787, 37687, 47095, 27053, 3859, 15812, 22597, 6851, -13324, -2688, 16829, 27850, 21708, 16787, 6441, 10229, 15959, 16140, 31138, 31711, 29869, 31344, 35059, 36073, 27628, 20840, 10634, 17966, 23820, 7310, -2851, -2683, -13951, -10481, 3782, 12914]
22196A2914l082K248k218R048J946m513j90J1556j244r600J0760j0724p317j905
22182G679Q254N576R704k469p325j2982N721J215N881n292m844n632j3790l969
22168a2273J7780k1162j4503J2156J403J1777P61J2473j486j1419j1754Q205K225
22155e817p16k86L026m251m386l410J0660J2637n703L569P322j0782r9N501N577
22140A2842r277j5057J0377Q62J3785Q048J1651j4514j3693o464m282m87J8434
22127A2225P76L685k713K3133q028j8292l624P87l62p040r487k5358o674K5055
22113a5917K0703J8885J8151r253k9788j0983Q551l557M336P757K524L04J2348
22100B4061J912o435j0800r558j5174P141M881K776J6403p17j0484p2K329j007
$$ y = [12914, 9832, 12080, 9862, 18910, 20856, 16343, 16153, 27709, 26465, 16865, 27625, 16901, 9584, 7679, 15933, 21509, 31213, 28744, 21419, 8437, 14158, 15373, 21254, 15962, 11118, 5486, -8304, -12273, 5507, -15655, -30158, -18002, -16599, -4822, -4061, 8412, 6926, -4493, -16247, -8042, -5817, -6533, -6819, -3793, -8044, -12430, -15840, -5180, 7457, 1754, 5323, 12645, 1863, 1764, 7265, 12842, 3565, -11492, -1115, -253, 13532, 21580, 33231, 18717, 5024, -1440, -5722, -6209, 12225, 13001, 16686, 13973, 37106, 29078, 10786, 7162, 7949, 7587, 547, -8940, -34298, -40972, -15917, 4786, 23671, 41822, 32569, 2781, -8202, 349, -3208, 1128, 8885, 11409, 11713, 24061, 25973, 19538, 8738, -820, -15994, -8853, -3972, -1196, 15207, 14490, 4006, 3934, 6263, 5256]
22086E256l2415Q633K0329j1829j1052P39R411M814J821l572j8318p72m049o855
22072c7859J290L2273K438p499j5326R733J2119J7293r223j8924o366P645Q82
22059a1524j1459R03J4696N495o662J709k1178r845J9901j898r420J6789Q984
22046c509L201o059o835l933L279K675K6272o374j5677j4259p07j863R575J2563
22032a651M028J2433P921n573J758M153J3110M192k2242j5967m913l453Q263p36
22018A323j0421j8616M593J4355R617J3793l601j346P318j0670J1209O272p968
22005A5858J040J3774q223j2447q619P773J8429p634p681p292j791J1398k785
21992A1800N816j3910j0596M292k621m532n767R408J1413J1342O867N41j4079
$$ y = [5256, -27159, -18526, 1803, -10026, -21078, -20339, -10928, -6114, -4293, -7865, -26183, -26955, -31004, -37859, -36569, -4296, -1858, -9357, -24683, -14950, -2831, 14462, 5239, -13685, -20051, -12406, -11524, -22983, -22080, -7384, -1889, -8551, -6842, -28020, -37865, -17964, -19862, -29282, -12493, -3509, -308, -6367, -13202, -17135, -13856, -11181, 15091, 8717, -6960, -21219, -21926, -23789, -14214, -1651, 2377, 14810, 22731, 17158, 18916, 23069, 36179, 40371, 18129, 2162, -2751, -6204, 2059, 1323, -9098, -27714, -23121, -8766, 851, 14644, 11043, 9697, 17015, 6345, 17554, 23826, 15858, 16898, 30672, 22449, 10002, 1383, 9156, 27585, 19951, 12270, 4978, 3187, 14585, 11800, 17616, 3706, -6890, -2598, -5219, -9751, -15518, -6110, 5303, 16645, 23512, 24053, 9974]
21979I974K294J4751J3241J0411O044J7351l1171p950m198j2904J5163Q207o655
21966C4558j8517R67n489K945J6105j5144j3040M940J2255n518k158k567M050
21953A3387j133l940M625N453N54N37K071K104k2652L876J3980j1370R80P584
21939A6056L944K886k852L177N650J354P73J619k4913j0465r408j3452J9412K068
21925d151R072j1059k0974J1537J6361j2795J261R333n478N189J467M017K078
21912E858n203N41J9077K689L892j1515j4551J1795j2864K904J571K537R255j607
21898A4379j0217r301m458L0762J8393o590r001m476j4484r603O721M366k0190
21885a3699j1836J0017J2462J2772J0663j0737l397q713q06J4289K4929l669M700
$$ y = [9974, 12268, 27019, 40260, 50671, 56715, 74066, 42895, 34945, 30747, 17843, 33006, 41213, 34558, 16041, 17008, 11519, 14464, 30569, 15425, 2385, 7325, 19580, 14062, 11904, 9337, 13387, 12254, 8314, 12939, 18392, 18946, 19483, 21554, 23658, 1006, 4882, 18862, 7492, 8472, 16056, 20000, 22886, 20034, 23211, 28861, 30215, 30988, 32607, 7694, -2771, -12179, -25631, -6219, -4151, 4921, -6138, -27112, -15575, 786, -12009, -10748, -1415, -6893, -1704, -237, 3780, 5858, 655, 1196, 20273, 22962, 26854, 15339, 788, 12583, -281, 2623, 4194, 6731, 15986, 14379, 4162, -5139, -9597, 21165, 39558, 32968, 23967, 19491, 5007, -4596, 2125, 6491, -13699, -25535, -15518, -3056, 9716, 20379, 9642, 6245, -2468, -3274, 11015, 35944, 32275, 36975]
21872C6975N902p503O584j4092k1855l624n30j544O861j3587J5480J6614M167
21859B9848k3370j2605p695N834J1364P06q630N722J2055N199j7791k627j0410
21846a2400J5483O946j550J2022J5268q753j5120k7495J7787P293N275m050n35
21833A0171J8987J761k2141k2630j103m239n838m315J5972K4776j289k1033L271
21820g650J8403p726k084K1503J6359j754j4015J468k4244n501Q214q136p221
21807a2384N600O908p593m062O130J5782P615n247j2894R631J0236N728L550j3674
21793A5326L550J3843k066k3223m066K497P996k652j760K8160J9726J3618n964
21780F4985m2769o52J5589q484n133R600K042k6047q607K0600M805O849R717k1416
$$ y = [36975, 42877, 35374, 41958, 27866, 6011, 2387, 1857, 313, 7174, -6413, 9067, 25681, 29848, 6478, -6127, -13822, -7988, 3376, 4082, -4548, 1174, 13229, 18428, 637, -1990, -12400, 3083, 10029, 8479, 20501, 35769, 27016, 11896, -15599, 2188, 9481, 14756, 10706, 10171, 29158, 30919, 8778, -13852, -14955, -19194, -25032, -29347, -13375, 11401, 10112, -10921, -7650, 10753, 3027, 943, 22446, 38805, 37051, 23036, 24504, 260, -5241, 2973, -5163, -12384, -6784, 124, -7469, -11531, -5401, 10381, 17996, 12749, -145, 9486, 19722, 25450, 29000, 15326, 18876, 32719, 30653, 7430, 3364, 5861, 13857, 11205, 9445, 37605, 57331, 70949, 64985, 22216, 21564, 37153, 28669, 23536, 33136, 35178, 9131, 524, 21124, 25929, 32778, 42495, 21079]
21766B1079m635K0159k5632P146J3716j6306K032r680L128O511k551j2466j748
21753G53M317m516J842R838J7332j5558k1418j4818Q887n764Q252O708K228N623
21739C706J4794J830k6451j4704J2854j921Q307K6110K3250L500j1033j541j6101
21726B2600o563J7677O424j5981k893l017J1471p30j11j2080j0722J142k82k2923
21712a5988K0113J415n405K5600k697j1625k110J1396Q506p703R992N708o478
21699C0724p703K1154p313j8885K218m548P573O227j754r664j5722O244Q019N857
21685B2427n652k79j726n689R463O836k1065j7216O134K863R194L011o454k968
21671a121K456m92j8079n704K1074K6087j13q922R78j0433q142P299P955k297
$$ y = [21079, 16444, 36603, 10971, 18117, 31833, 15527, 17559, 7879, 11007, 17518, 14967, 2501, 753, 5070, 554, 2396, 12234, 29566, 14008, -7410, -22228, -13341, -19105, -10853, -4145, -1917, 3706, 18500, 20330, -6121, -20825, -7971, -9892, -1585, 24525, 47775, 51275, 40242, 38701, 22600, 16037, 33714, 40138, 24157, 21264, 18247, 29718, 28988, 28877, 16797, 6075, 7217, 6935, -15988, 4125, 5540, 135, 25735, 23038, 11413, 9303, 20699, 29205, 21502, 31494, 37202, 30724, 23021, 44175, 36862, 17977, 20195, 15647, 23220, 29447, 27693, 18029, 2307, 8551, 16570, 22427, 16775, 16496, 14770, 9081, 18544, 25380, 4315, -12901, -6767, -3904, 5290, 8301, 1847, -1121, 1335, 843, -17236, -22940, -1866, 24221, 24108, 15186, 16164, 5731, -2411, 4888, 12843, 10546]
21657A0546k68j2568k3373k416J6814K0741K0733O414k1638q330j3841P240J788
21644A842q137j2080M702M1J5380j042K3710K814R909j5291j3048K4242Q055r621
21630C1476j6716j1204k57J6557J4094J2275k373P34j4054k0076m314M505k67
21617A0380J4643J7243Q365j7938p731k2308l0916p854N809Q323K5244K3408R895
21604C6563r831j6778J1732J418j9557j454j6028n47Q47N29Q234R248Q692j426
21590A1642j2224M545R404M903l36j1342o273J4747J3900J3400J7613o159p727
21577D6093l8156j8787J5242K9485J1240j0365j1544l446J0343k842l581O010
21565B9692J3996k785j5389j7170p204q669J0481K0749R138j1417j1296k869K1662
$$ y = [10546, 10278, -2290, -25663, -28079, -11265, 9476, 30209, 36623, 14985, 6655, -7186, 54, 1842, -6295, -18375, -13673, -13632, 1748, 706, 24416, 27230, 37139, 21848, 8800, 33042, 41097, 31476, 14760, 3556, 3299, 19856, 33950, 46225, 43852, 44586, 30532, 10456, 6142, 10647, 10380, 25023, 42266, 50631, 32693, 24962, 2654, -28262, -36116, -30307, -21984, 3260, 26668, 36563, 26732, 9954, 21686, 23104, 3547, 2093, -13935, -14482, -13635, -13106, -4872, 4376, 13068, 11642, -582, 3963, 13367, 18270, 17934, 6592, 319, 15066, 28966, 42366, 59979, 53820, 46093, 7937, -10850, 4392, 33877, 45117, 34752, 23208, 19762, 30105, 27263, 23682, 29692, 43688, 40903, 25514, 8344, 1140, -7529, 2952, 23701, 32839, 21422, 10126, 7257, 28919]
21552B8919J306o383k006k568K2023R212j2566o727o444N998l800o317m658o635
21538I354J3089m756j9215j4374J5267P027k51O053J3039Q926o551O007J5530
21525D9145q517j8343p762J933J0873j415j1198J496J3521k2741J0721J8634J4101
21512E0448r281n448j5731j9328k363J2488P494J454K941Q761R603l858J4430
21499E1610j1144l2134j6363o367L604n62j252Q559M152L316n656N80p45k834
21485e236K5186J8541M977l725j4322k115R792J0242k1943k2780m965K506M124
21472B82J4321j7694j9368J2046N206k38M056J4053K953K855Q757J1541m090n303
21458B9377j9346r164L199J5187q460k1846p715N472J4948l904o213R912K5577
$$ y = [28919, 30225, 23842, 21836, 19268, 41291, 50503, 37937, 31210, 24766, 30764, 26964, 20647, 15989, 9354, 22443, 17687, -1528, -15902, -635, 6392, 6141, 12194, 25233, 34159, 27608, 33615, 49145, 40628, 22285, 14523, 16456, 27329, 25914, 14716, 16212, 29733, 6992, 17713, 36347, 50448, 41167, 35719, 19988, 660, -1703, 10785, 18279, 19733, 22674, 31435, 41038, 37180, 51610, 40466, 8332, -8031, -14398, -10794, -11356, -12608, -4049, 103, 3419, -2237, -1657, -2402, -5236, 19950, 38491, 43468, 39743, 25421, 23306, 33098, 43340, 21397, -1383, -6348, -3842, 282, 14603, -3091, -22459, -10413, -5207, -5445, -1389, 12664, 15617, 18472, 27229, 38770, 34680, 29377, 10031, 867, 4066, 19253, 10793, -11053, -18768, -13296, 1652, -2252, -8465, 1447, 27024]
21445B7024N469R835p924j8976j6596R253j391k1830J181K9682N590R1J5200K263
21431C8871J1673k4453k6541M273Q252Q937K368j7411L432R364M646J261K636
21418B7308K323r634P754L946J2738l087k2177J1874P022k795Q360K3492r665
21405E7459j9705j7362r86J1610P394k6221n307J3182q031p971J7146O510O992
21392C4710P084K902j7035j5922j989J0344M600J1633K657J3055m309r8j3346
21379C4286M974J1562r852J801j4569j2284k2897K613J5655J786k1132q49R88
21366g918j739m083K1176K3041k262j8851l317J8244R582J3547k8229k2965J0034
21353F260K5299P410p837n601j8037r172P77J2400J2346J670k8533l596J1391
$$ y = [27024, 32493, 42328, 34404, 15428, -1168, 8085, 6694, -15136, -13955, 15727, 21317, 21408, 36608, 38871, 50544, 26091, -450, 3823, 12075, 21012, 23380, 5969, 9401, 18765, 23411, 24672, 27308, 29631, 19997, 27751, 31697, 44435, 41348, 19171, 31045, 38067, 35272, 43632, 67124, 57459, 37754, 20392, 19406, 31016, 38410, 12189, 6882, 20064, 12033, 4062, 21208, 27718, 34710, 41794, 44696, 27661, 11739, 9750, 20094, 24694, 36327, 38984, 52039, 47730, 47632, 34286, 39260, 50822, 40970, 42771, 28202, 15918, -6979, -4366, 11289, 13075, -8057, -8906, -7918, -9657, -13740, 7436, 30477, 28215, 9364, 6047, 24291, 33873, 47420, 19191, -3774, 6260, 31559, 38969, 31132, 25531, 7494, -1678, -901, 11499, 23845, 25515, -3018, -6614, 4777]
21340D777P887j313k783J0024p297j2233n835R383q681P80J6011N158j1694j5464
21326a1280n86J4223J8254J929R527k7822o143O399J0906L1478q548q534j0980
21313A8823n023J3074J7249o170o322n756o064J2218q088j9454N725J6575J9285
21300D6072M855j2438j5373j1249O089J436R686N846j3165J0135J5340J0758J34
21287E8126j0627M5L9j2143j1618O140o908p936j1534R427l939O489K44k1474
21273e669j4548J1634J1215J7222J1814L897J1753j1375j236L433p856J9162J3920
21260F3366j5993j0405J5502O200j1841m560M687p62n754P883n699Q122j5339
21247C5407n106O0l559m260q742Q783K7556L269o949o379J450L887o378j0778
$$ y = [4777, 12664, 11351, 8568, 18592, 11295, -938, -6773, 2610, -6071, -5291, 10720, 15878, 4184, -11280, -11866, 2357, 20611, 22540, 32067, 4245, -1898, 4501, 15407, 46885, 38337, 29803, 18823, 13800, 26874, 44123, 37953, 31631, 25875, 19811, 32029, 23941, 4487, 10212, 26787, 46072, 50927, 38489, 23116, 11867, 17956, 19392, 29078, 34924, 21759, 31894, 47234, 57992, 58126, 47499, 47544, 47583, 35440, 23822, 29962, 23054, 15118, 3584, 13011, 9072, 15561, 15805, -5669, -20217, -8583, 2632, 19854, 31668, 35565, 47318, 35943, 34707, 38140, 30284, 49446, 63366, 47373, 36968, 52470, 58670, 46829, 42269, 46956, 46194, 40440, 48323, 42624, 50746, 35407, 30301, 30361, 26802, 22542, 13800, 22583, 50139, 53408, 46459, 40080, 41530, 45417, 39039, 28261]
21233B8261J8566K2340O26O74Q465l5929j1988M04K025k685n025J4609j825l191
21219C5327n920m277P730J5614k0993q387J087O492m445J3973j5419J752o18j1009
21205A0907L206N542k5626j0036P933L931L924K891P735J3824M889J0585N633
21192D5338j7632j0331K669j1951M462M751J0421o960J451J4227L224Q378P343
21179E5390p328k718j6572k7097Q221L3867k262p277K919n825j6057l502R235
21166B0994J1843j4701L692O929j1883j1466k045m185j2464L067K5570J916P229
21153B4496K5374q931j3202O747P720k0166J1840Q354o289k2378P56N055P768
21140B7144Q561k1424O142J0785j3861r412N494J914K763J7547J2474M163j5989
$$ y = [28261, 46827, 69167, 69793, 70467, 78932, 43003, 31015, 31419, 33444, 30759, 25734, 40343, 38518, 35327, 29407, 25130, 32860, 48474, 27481, 19094, 20181, 26673, 22228, 36201, 20782, 22534, 21916, 10907, 14113, 19655, -5971, -16007, -8074, -4143, -219, 2672, 10407, 24231, 29120, 39705, 45338, 27706, 17375, 20044, 8093, 12555, 17306, 27727, 20767, 22218, 36445, 39669, 48047, 55390, 48062, 45344, 28772, 1675, 9896, 43763, 41501, 34224, 37143, 31318, 15261, 11759, 20994, 32837, 18136, 21828, 28757, 16874, 5408, 3363, -822, -13286, -10219, 15351, 17267, 24496, 49870, 40939, 27737, 34484, 42204, 22038, 33878, 42232, 35943, 13565, 14321, 19376, 27144, 35705, 14281, 20423, 31208, 17347, 7935, 13429, 15343, 18106, 35653, 48127, 52290, 36301]
21127C6301p882j0778j7826J2200Q303j2136Q832Q958j238p301o154j1894p709
21114h324J6511O781k833P041M218k330k1690k9714K316K5380J5728l91P483j1810
21100H366j680J0556K492J8771R134j1567j2889O684j240n557k10o271L368K845
21086B2802M463q91k0008J1237N662j3114L115k599O039P392P035j2260P719k863
21072B3729j8870K7183O248r85J0589r926K81M888L134r028P35j1770l942j0362
21058A1904k858k129R007Q885r143j7860N657J9443K5169m730j636k5977L446
21045A9178L340R727J1240J2213J1035o728M438j5402j6577M56J1384l495j074
21032C9735M823J0995M332k0667O71J7427K6812k4564k21P847J7507K678O57l612
$$ y = [36301, 28419, 17641, -185, 12015, 20318, 8182, 17014, 25972, 24734, 17433, 11279, -615, -8324, 8187, 14968, 12135, 19176, 23394, 21064, -626, -30340, -28024, -2644, 13084, 12693, 20176, 8366, 6686, 17242, 19734, 38505, 47639, 36072, 23183, 29867, 28627, 23070, 22860, 16589, 19957, 22802, 27265, 26374, 6366, 17603, 23265, 10151, 13266, 10667, 16706, 24098, 31133, 18873, 26592, 23729, 4859, 32042, 38290, 37305, 47894, 37968, 38249, 43137, 46271, 37243, 37978, 26208, 22266, 11904, 9046, 6917, 15924, 24809, 15666, -2194, 3463, 22906, 48075, 43345, 41709, 15732, 19178, 22518, 32245, 43485, 55698, 66733, 60005, 64443, 49041, 32464, 32920, 44304, 40809, 39735, 44558, 55553, 59885, 39218, 39889, 57316, 84128, 59564, 59343, 67190, 84697, 87375, 88032, 84420]
21018H4420k0578j4835j3758j1913J574J5704j5403P228Q244r541P870j2751j7465
21005H796L4314K2040j7560k792r268M740J9938M337m12l429Q446n369j3714j2281
20991C7786o38n89q260k250J6761q633n134L650l211l822O118J0554q366n60Q340
20976D1746K043J306k1558j246m257J063Q711J4297K414P095j287N442J557r158
20962D8168M201j4286l14R326M425k23j5618p536P251J3658J9449J792k8066K382
20948D4609J4673q54o815k436n130O102J8228j6994j2322J833M436N833q931M042
20934D6274K634l392J9335K602p732q536o944k420j06j3283N015j625j6463m732
20920A0627J5247J1683j2131J1728K534p412q192j546K1536J1869j2770p993L059
$$ y = [84420, 63842, 49007, 35249, 23336, 24910, 40614, 25211, 32439, 40683, 31142, 39012, 26261, 8796, 43110, 65150, 47590, 44798, 35530, 40270, 60208, 64545, 64133, 60704, 69150, 63781, 50067, 37786, 37148, 36559, 28299, 26049, 42810, 34177, 29043, 32693, 29482, 25660, 31778, 42332, 33966, 33406, 41746, 43789, 45095, 23537, 22291, 18034, 19097, 27808, 42105, 44519, 51614, 50327, 55769, 57326, 48168, 52369, 38083, 37769, 47095, 51520, 51297, 35679, 28143, 35394, 49052, 68501, 70293, 42227, 44609, 59282, 58428, 51613, 49177, 44047, 50149, 68377, 51383, 39061, 40894, 45330, 51163, 42232, 46274, 48908, 45516, 64851, 67453, 59721, 51185, 44241, 41821, 41715, 28432, 33447, 31822, 15359, 10627, 25874, 37557, 25426, 37154, 39688, 32276, 24084, 22538, 44074, 55943, 43173, 35180, 38239]
20907C8239K2730K0574j8262J902P248j5886j1708j8403O97J8384j0332j714P778
20894D1247N687P334L173K1679J8771r333Qo449r680k792j450q647j2879Q155
20880E4824M625J754r156j716n323n939J7822j7094k5503J6422M740P289l13P415
20866D9847m316o275M068j1705k3751K802K2989O505J1228K4988m897j6010q013
20853D7460K6575K9842k068r971j3741O783j0093k048j009R076J5491M391P90
20840A01478k142j5999j9434M846M801N319q136j1250J470n895j6458O448m049
20827D0999J1994p84J672J5237K3309m983j9129p907N115p302k0067J4366J9998
20814G2518J408l981j665q339q06k092J056L869K166n758j4435J5386J5113j92
$$ y = [38239, 60969, 81543, 63281, 65183, 72431, 56545, 44837, 26434, 27131, 45515, 35183, 33469, 41247, 46934, 54268, 57441, 79120, 97891, 88558, 88566, 82117, 72437, 69645, 68195, 59548, 46669, 54824, 59449, 61203, 52047, 50331, 45008, 39069, 56891, 39797, 14294, 30716, 35456, 42745, 42432, 49847, 45531, 39256, 43324, 31619, 7868, 10670, 33659, 40164, 51392, 76380, 71483, 55473, 47460, 74035, 103877, 101809, 91838, 78097, 84880, 74787, 72739, 71730, 80806, 96297, 100688, 101478, 99336, 83337, 63903, 68749, 73550, 78869, 70733, 59483, 60953, 55058, 38600, 45048, 40999, 52993, 52209, 53881, 69118, 92427, 87444, 68315, 60408, 65523, 58221, 38154, 52520, 72518, 73926, 69945, 68280, 59941, 59135, 57043, 58099, 61968, 64134, 58376, 43941, 59327, 74440, 74248]
20800G4248J1731p540O692K0189k985R12p996r506K1334J4343l022l0521l825
20787H4054J2731j4026k9153J5027N099J7681k338J3882r52p344K1877J5575o586
20774A25527j2580j1093J6719n742o326j2718Q895J0880j0312J1732M722R130
20762A28834J7842J7362P092j4233k0809j2158j268P701p82J2068J49J9032P695
20749A68525N582J1573J8380K5484K2323L7611N9723P5656R8284R9184J60338
20738G82663K48903L54276L84181K67842L217j89461k49257k73244k56245k18149
20728H54726j35986p4043k3515K7909Q4849J46119K18159L21928L85111K61961
20718B067218p152k12635k91196l27568k98708k29770j84750j23649q0926n8732
$$ y = [74248, 85979, 78439, 85131, 105320, 102335, 103247, 95251, 85745, 107079, 121422, 118400, 87879, 84054, 96785, 82759, 53606, 68633, 73732, 91413, 89075, 102957, 102005, 94661, 116538, 132113, 125527, 112947, 101854, 118573, 112831, 106505, 93787, 102682, 113562, 103250, 114982, 119704, 128834, 146676, 164038, 171130, 156897, 136088, 123930, 122662, 130363, 129581, 141649, 141798, 160830, 168525, 174107, 185680, 204060, 229544, 251867, 289478, 349201, 424857, 523141, 622325, 782663, 1031566, 1385842, 1770023, 2037865, 2041082, 1851621, 1602364, 1329120, 1072875, 854726, 718740, 644697, 621182, 649091, 733940, 880059, 1098218, 1420146, 1805257, 2067218, 2060066, 1847431, 1556235, 1228667, 929959, 700189, 515439, 391790, 310864, 252132]
20708B52132J300k5841j9629r833k4545j8906o399j3361j6943l310j0055j3941
20696I0669P578m861K1230O474j1269l650j324j4390j7656L669J6636j5465p678
20683F9963j7736J334J5104J6031K0498J0572j0823l150q345o943O918J3338n639
20670A01122p249O60k495O219k3084k0595N799J7992R198R294k805P051K0330
20657A21437q052L134k603k547l612j1483j744J1268L39m952p132p942k379j25
20643H3607j4661J4524J6891O742l00j4926l580k858j7505o519L944j0702j0638
20630D4019j842K5419J4548L894J7845P564j1840r33N716q046j381J4462J436
20617A10861r130J1163m483N007q165m599J3250l309K950L169R543P290k498j1071
$$ y = [252132, 253432, 227591, 207962, 198129, 173584, 154678, 148279, 134918, 117975, 114665, 104610, 90669, 98247, 93386, 114616, 121090, 109821, 106171, 104847, 90457, 72801, 76470, 93106, 77641, 69963, 52227, 53561, 68665, 84696, 105194, 115766, 104943, 101793, 93448, 86505, 93423, 106761, 101122, 93873, 94533, 92038, 98257, 75173, 54578, 60377, 78369, 87567, 96861, 94056, 101107, 121437, 113385, 116519, 113916, 111369, 107757, 96274, 94530, 105798, 106137, 101185, 94053, 86111, 83732, 83607, 68946, 83470, 100361, 107103, 106803, 91877, 88297, 85439, 67934, 61415, 65359, 54657, 44019, 42177, 67596, 82144, 86038, 103883, 111447, 99607, 98674, 104390, 96344, 94963, 109425, 110861, 101731, 112894, 108411, 113418, 105253, 100654, 113904, 110595, 113545, 116714, 126257, 133547, 131049, 119978]
20603A19978l206N988J3775M325k0273j2749K427j8504r43N822j2126l130j8628
20590F2756J229J9294O82r914Q378K5746J7306k1010k5030j8581k227P528O951
20577G3108k3685M032L386n258m980m844N948Q019J1754R033Q309J2662k723M107
20563I8868m838j2552J347q216Q055M190j3722J2942L9520J5922J1772N31j2894
20550A40925j700k432O321P903M596J404n011n85j1987j4389j0894K2M593J5934
20536A34700J3048j7353q198N193q445j3207l788j869k521P271P837M230r21k374
20522A13603j989R777J1502M019j2580j0252K854J088N982N534j8579j3766J1430
20509A08623q08r300m018j1484M715l239N493N728K1994J1501n928m823r339l376
$$ y = [119978, 116772, 122760, 136535, 140860, 120587, 107838, 110265, 91761, 90818, 96640, 84514, 81384, 62756, 63985, 83279, 83961, 74047, 82425, 108171, 125477, 104467, 79437, 60856, 58629, 66157, 73108, 49423, 53455, 56841, 51583, 46603, 41759, 47707, 55726, 67480, 76513, 84822, 97484, 94761, 98868, 94030, 81478, 82825, 74609, 82664, 86854, 73132, 86074, 125594, 141516, 153288, 153819, 140925, 139225, 136793, 143114, 151017, 155613, 157017, 152006, 151421, 139434, 125045, 114151, 114173, 118766, 134700, 147748, 130395, 122197, 127390, 118945, 105738, 101950, 100081, 97560, 104831, 112668, 116898, 115977, 113603, 111614, 121391, 132893, 136912, 124332, 114080, 116934, 118022, 124004, 129538, 110959, 97193, 108623, 107815, 98515, 94497, 83013, 87728, 84489, 89982, 95710, 117704, 129205, 123277, 118454, 109115, 105739]
20495A05739J5317R696L607q93j5181j6471k3848L995L9972J9172J5198L167j4091
20482A45379m389n020j1980K69J6841J6156K535j0148k8770O977K819j235R793
20469A39227K87J888n784j069K1030k634K164qj312j1635j5335Q221q879n660
20455A20501J7895M549N069J1093O605l342M09J2507p291r410j2470k4703N59
20442A21971n128J8596K480K693q407p807J252k744K4609j356j7350m464p220
20429A17125k3157l5140k8782p688K5863M1246L3491K4037K6926K8225K4430M358
20417B30934n100k1616k0413m8240k6190k9900m9097j4105L8084M8339J9183J4416
20405A36295K7857K9643J5896p293K4767L278p085N981J6963J8477J8581J8245
$$ y = [105739, 121056, 130752, 134359, 133466, 118285, 101814, 77966, 81961, 121933, 141105, 156303, 159470, 145379, 140990, 135970, 123990, 124259, 141100, 157256, 159791, 149643, 120873, 127850, 130669, 129434, 139227, 139514, 141402, 135618, 134549, 155579, 152945, 155109, 155101, 153789, 142154, 126819, 135040, 126161, 120501, 138396, 142945, 148014, 159107, 165712, 162370, 162779, 175286, 167995, 158585, 146115, 121412, 121971, 116843, 135439, 137919, 140612, 132205, 124398, 125650, 122906, 147515, 146159, 128809, 124345, 117125, 93968, 58828, 30046, 22358, 48221, 89467, 122958, 146995, 173921, 202146, 226576, 230934, 225834, 204218, 183805, 135565, 109375, 79475, 30378, 16273, 54357, 102696, 121879, 136295, 164152, 193795, 209691, 202398, 227165, 230443, 223358, 229339, 246302, 264779, 283360, 301605]
20393C01605J0522J5201L4408K7250L9702L7657L8482M4386J2981r312j6601Q649
20381E44930M8008M9231M0837R2179J63639K82350M68027N78150L28808j06373
20371B489786k64167k94384l27259l39036k60609j17090n9423j1236L3643Q3423
20361I33648J47775K69057M57507O05621L81010j52293l84118m22463m12379l45670
20351A077695k57022j63998r9892p3037n1338j7547j3658j9826j4774p46J0150
20340C76007r071j5900j5193M602J6508l115J380k0004m630K0209N976m343n259
20327C47167k9230m4676q664j5805k0217J9390K5891M3081J0675J1158J6540J7847
20315C73157J4314j7311k3825k8809k5750k3141j6612p216K8377M2769M3155L2756
$$ y = [301605, 312127, 327328, 361736, 388986, 428688, 466345, 504827, 549213, 562194, 552882, 536281, 544930, 592938, 642169, 683006, 775185, 938824, 1221174, 1689201, 2267351, 2596159, 2489786, 2225619, 1931235, 1603976, 1264940, 1004331, 887241, 827818, 816582, 850225, 933648, 1081423, 1350480, 1807987, 2413608, 2794618, 2642325, 2258207, 1835744, 1423365, 1077695, 820673, 656675, 556783, 483746, 432408, 414861, 401203, 381377, 366603, 365857, 376007, 366936, 351036, 335843, 340445, 356953, 353838, 355218, 335214, 330584, 350793, 356769, 352426, 347167, 317937, 273261, 264597, 248792, 228575, 247965, 273856, 316937, 327612, 338770, 355310, 373157, 387471, 370160, 346335, 317526, 291776, 268635, 252023, 244807, 273184, 315953, 359108, 391864]
20303C91864K5097K7102J4100K578K4474K3397m767p811l324m703j2227N765K5865
20290E07410K6889k580l5298j5265j2181J2233N421Q933o065j1749k1260n447
20278D51041J4782O812j3673M399R05J3729j0180k7365j7248k5138k6924p583
20266C63557N476n340m056j0582m1749o4970o1491J4860J97949K72933K60986
20255I27573J87901N2417o0445j05063q4645n2544l9189j7603j0061m6787o6570
20244F84984o3340K5154K15441L20767L11365K38723J02543j550n4385p0405k9121
20233A680176J3799Q4234J50879J98447K89204M23988O31348P52136N66532J30332
20223D921075k11820l98086m45979l94816k46813q2524O7901K73026N42413O94613
$$ y = [391864, 416961, 444063, 458163, 460741, 485215, 508612, 503845, 496034, 492710, 488007, 475780, 481545, 507410, 534299, 531719, 496421, 481156, 468975, 481208, 486629, 495562, 489497, 477748, 456488, 451041, 465823, 472635, 458962, 463361, 464266, 477995, 467815, 440450, 423202, 398064, 371140, 363557, 369033, 363693, 359637, 349055, 307306, 242336, 180845, 195705, 393654, 666587, 927573, 1115474, 1167891, 1107446, 1002383, 917738, 865194, 826005, 808402, 798341, 751554, 684984, 621644, 646798, 862239, 1183006, 1494371, 1733094, 1835637, 1834087, 1779702, 1709297, 1680176, 1693975, 1778209, 1929088, 2127535, 2416739, 2840727, 3472075, 4224211, 4790743, 4921075, 4709255, 4311169, 3865190, 3470374, 3223561, 3141037, 3208938, 3481964, 4024377, 4718990]
20213D718990N70762Q1979l16742n21771n81836n47090m07243k70204j65217r3008
20203B468620p588N4160J00973J81784K68181M02653N63884P44825O91997K87171
20193E756660j48680l66186m07596m02037k94485q0203J17129L04854N47743P96981
20183E824180P68402M11185m2334l11906l87365l01410j15184M1050k8598k13079
20173E644941k44989k02313r6908L3935J85022K24949J43596J24469J60053K33485
20163F206240L80749N34978P23300P89962O22686L33069K28633K64129L94933
20154A0478679O08046Q74534J003684J075565J311191J644236K002985K256198
20146B1255118K474364K723607K948319L314048M086646N461560P428838J0099924
$$ y = [4718990, 5289752, 5371731, 5054989, 4533218, 3951382, 3404292, 2997049, 2726845, 2561628, 2468620, 2461032, 2515192, 2616165, 2797949, 3066130, 3468783, 4032667, 4777492, 5469489, 5756660, 5607980, 5241794, 4834198, 4432161, 4137676, 4057473, 4174602, 4479456, 5027199, 5824180, 6592582, 7003767, 6961433, 6649527, 6262162, 5960752, 5845568, 5886618, 5858020, 5644941, 5399952, 5197639, 5100731, 5134666, 5319688, 5544637, 5688233, 5812702, 5972755, 6206240, 6586989, 7121967, 7845267, 8635229, 9257915, 9590984, 9819617, 10083746, 10478679, 11086725, 11961259, 12964943, 14040508, 15351699, 16995935, 18998920, 21255118, 23729482, 26453089, 29401408, 32715456, 36802102, 42263662, 49692500, 59792424]
20138E9792424J3900707J9897534L0250759M7133761O8404082P5800045M1883970
20131C57063282j0455772l9034576n0462032n1515909m4432857l3003672k0420780
20124A07737684r597783j099503O423793J5086575K7630190M6552713P0161573
20117B62895242Q0341777M6307079j2123112m5837193n9570539o1644014n4530585
20110A55838655m2844935l0253314k0172370j3559182r396621o609775m625663
20103B8376795l257898k604811k395509k295771k168323j925554j577421j198266
20095A0953242q71623p48514o90450n53340l79575k10998j81835l55015n11065
20086F450827n76727m77653l41066m06529l44576j56555Q4672J74454P7972o7016
$$ y = [59792424, 73693131, 93590665, 123841424, 170975185, 239379267, 315179312, 357063282, 346607510, 307572934, 257110902, 205594993, 161162136, 128158464, 107737684, 98139901, 97040398, 103464191, 118550766, 146180956, 192733669, 262895242, 343237019, 389544098, 377420986, 331583793, 272013254, 210369240, 155838655, 112993720, 82740406, 62568036, 49008854, 39612233, 33002458, 28376795, 25118897, 22514086, 20118577, 17822806, 15654483, 13728929, 12151508, 10953242, 10081619, 9333105, 8642655, 8089315, 7709740, 7498742, 7316907, 6961892, 6450827, 5874100, 5396447, 5055381, 4648852, 4304276, 4147721, 4232393, 4406847, 4484819, 4417803]
20076D417803p976J03485J94372J29246j39339l64209m68729m40254l18303l51180
20066B754916l48807k49770j48276j01616r0717o3041l1509m5708l4038m9608
20056A591826o3904n2950l6860n6026p5975p9227p3418l5421m4408l2469k9480
20045A011688r967J7003M0693K6702M6276J04167J77937K37494J28854o1555j54585
20034A564707j84210j78397j71807j12417n9552m0614m5184l0109j1234J6710
20024G47893M8223J05075K02524K67426J49454m3234j23644j57149j64804r8314
20014I33450q2451p6915q4481o1829l3198m3209n9613j2260Q0141Q5662N1222
20003F96519L2012K3529K9796L8933O1538L0468l3943m2651J143Q323P871j3951
$$ y = [4417803, 4409827, 4513312, 4707684, 4836930, 4697591, 4333382, 3864653, 3424399, 3106096, 2754916, 2406109, 2156339, 2008063, 1906447, 1815730, 1752689, 1721180, 1675472, 1641434, 1591826, 1527922, 1474972, 1438112, 1382086, 1306111, 1226884, 1153466, 1118045, 1073637, 1041168, 1011688, 1001721, 1018724, 1059417, 1086119, 1132395, 1236562, 1414499, 1651993, 1780847, 1719292, 1564707, 1380497, 1202100, 1030293, 917876, 858324, 817710, 772526, 742417, 731183, 747893, 796116, 901191, 1103715, 1371141, 1520595, 1477361, 1353717, 1196568, 1031764, 933450, 850999, 774084, 689603, 627774, 594576, 551367, 491754, 479494, 559635, 645297, 696519, 728531, 752060, 781856, 820789, 882327, 912795, 878852, 836201, 837344, 845667, 853538, 839587]
19991H39587k9853L2211O8553M018m2840q1571m7405M5029M2431J9442k8265j0889
19979H10448j3626l1741l4736m2628l3927j5702J6072Q250k4854o6742n3123M48
19967E18139J9941M770M765J8980M4561O4364M4603N043r54P2196M67825J150936
19955B415169J545660J580174N74184m91590q48820r44755q34655n81277l31347
19946B082743r9769J69895M71470Q83357J008630M03161p1737l55374n03438n48506
19936C440432o34679n66575l94790l02881j99320j28218p3885m8661k0618k504
19926A068301K0356M2400Q372o709Q022K3310K1914Q817r421M318J0475K1058
19914A221213L4505M4377O9965R3053R8654J35048K62602M85676Q74345J353382
$$ y = [839587, 809734, 841945, 910498, 914516, 871676, 790105, 742700, 787729, 830160, 849602, 821337, 810448, 796822, 765081, 730345, 687717, 653790, 638088, 654160, 662410, 637556, 570814, 517691, 518139, 538080, 542850, 547615, 566595, 611156, 675520, 720123, 725166, 724212, 796408, 1264233, 2415169, 3960829, 5541003, 6115187, 5623597, 4774777, 3830022, 2995367, 2414090, 2082743, 1982974, 2152869, 2624339, 3507696, 4516326, 4919487, 4847750, 4492376, 3988938, 3440432, 2805753, 2239178, 1844388, 1541507, 1342187, 1213969, 1140084, 1091423, 1070805, 1068301, 1088657, 1131057, 1139429, 1132720, 1140742, 1164052, 1185966, 1194783, 1185362, 1189680, 1200155, 1221213, 1255718, 1300095, 1370060, 1463113, 1561767, 1696815, 1959417, 2445093, 3319438, 4672820]
19904D672820J342086K81886n08726p35405q07452p06464n14263k79434l5696
19895B709352K29387N79888J032892J132881K62266n23860p46375q25919p19797
19886C130715n09616l14453j49521n0836m888J7331j913J7518O1727N1057K7564
19875B274685l371K84P361O2431J04616J28568J42171J76877K26776K43843K64168
19864C628409K65487L07813M03067N36695P35771R80564J044750N55576K09280
19855H667412K36288L81992P34040J201262J291225J116011J223876J042512R09876
19846A6804494J206376J669988K443114L059766L092920L118141L660992N151408
19838D0207199P326628J0308693J5017207K3121092L8628071O8355641J11489639
$$ y = [4672820, 6014906, 6296792, 5788066, 5052661, 4245209, 3538745, 3024482, 2745048, 2709352, 2938739, 3518627, 4551519, 5684400, 5946666, 5422806, 4676431, 3850512, 3130715, 2621099, 2306646, 2157125, 2106289, 2101401, 2118732, 2116819, 2134337, 2196064, 2247121, 2274685, 2271314, 2271598, 2278959, 2341390, 2446006, 2574574, 2716745, 2893622, 3120398, 3364241, 3628409, 3893896, 4201709, 4604776, 5141471, 5877242, 6857806, 7902556, 8458132, 8667412, 8903700, 9285692, 10019732, 11220994, 12512219, 13628230, 14852106, 15894618, 16804494, 18010870, 19680858, 22123972, 25183738, 28276658, 31394799, 35055791, 40207199, 47533827, 57842520, 72859727, 95980819, 134608890, 202964531, 314454170]
19831C14454170J20461368K8658884m9876635o8533004p6028155o9744006n4812751
19824A44579871l6957124k0089117q711012j206690N511587J4395599K9339693
19817A26862807N5883635R4985485J09234742L2202044m4812170o3707063p1164983
19810B39484497o5911531n2803616l7845636k3429540j4157883r017547o233360
19803C0085384m805791l430730k263620j843446j591473j400899j586779j498857
19795A1663789j027606o00203m74398p34207p27579m86377k56166k55956o39489
19786F461808p55679p35208o82168n49708l94445l10005k13958j34970r3214r9597
19776B492856n9639o3397o7775o7299j05352j17961j23919j23002r1714q2384
$$ y = [314454170, 434915538, 463574422, 413697787, 345164783, 269136628, 199392622, 144579871, 107622747, 87533630, 78822618, 77615928, 83127515, 97523114, 126862807, 182746442, 277731927, 386966669, 419168713, 374356543, 310649480, 239484497, 173572966, 120769350, 82923714, 59494174, 45336291, 36318744, 30085384, 25279593, 21848863, 19585243, 17741797, 16150324, 14749425, 13162646, 11663789, 10636183, 10035980, 9561582, 8827375, 8099796, 7613419, 7357253, 7101297, 6461808, 5706129, 4970921, 4288753, 3739045, 3344600, 3034595, 2820637, 2685667, 2592453, 2492856, 2433217, 2369820, 2302045, 2234746, 2129394, 2011433, 1887514, 1764512, 1672798, 1590414]
19766A590414p4622p2695r3606o9943k6863k2590j8168L7202K4519J4207J569
19755A289424j0967J1415M4281k214o4280j02716j03714o2302n0353o5978m9632
19744H32964o178o394q771k3835k4861J0958L1230N2876M5547o817m373J5207
19732I07553N4722P9218J77145K97179K40976l4041j86508k02653k04489j86623
19722I42479j39413r4117m1930j2591q166J7459N6908P9576J17622K04627K62752
19711A385206J72851p7863j24565j42521j44498j71179q0375J26850M4140o1612
19701I26434k3110J4633J07436R3128L5116J602K4784R2956J31593J98283K35176
19690A838031K81372M59581Q40270J074773J177658R15841J22750m19544p02699
$$ y = [1590414, 1515792, 1443097, 1349491, 1279548, 1252685, 1230095, 1211927, 1249129, 1273648, 1287855, 1289424, 1278457, 1289872, 1334153, 1331939, 1267659, 1164943, 1061229, 998927, 948574, 882596, 832964, 826786, 820392, 811621, 787786, 762925, 773883, 805113, 857989, 903536, 896719, 892346, 907553, 962275, 1041493, 1218638, 1515817, 1756793, 1722752, 1536244, 1333591, 1129102, 942479, 803066, 708949, 667019, 654428, 646262, 663721, 720629, 800205, 917827, 1122454, 1385206, 1558057, 1480194, 1355629, 1213108, 1068610, 897431, 817056, 943906, 988046, 926434, 903324, 917957, 1025393, 1118521, 1153637, 1155239, 1180023, 1272979, 1404572, 1602855, 1838031, 2119403, 2578984, 3419254, 4494027, 5671685, 6587526, 6710276, 6290732, 5588033]
19681E588033q50007q16957o62783m38339k03412m6341J50001L69832O77717J040789
19671D808533J179810P09129j35805p26041r73396j000881r08836p13207n17921
19662A721385l47252k41197k05278j58343j21898p2637m8777n9864l2580k7659
19652D05900m0993m8343l5658l1601l0899j5157j6586j2631j8166m630L2142M9427
19640B32805O5622L7821J2850o015k0848k5559n2481o9510k7074P535R519j0666
19628A53999J1713R564l447K5523L7946K1506j5885k2373j5712K002j9721k3179
19616A61936r347k8666n704J1847K0896K0372j3722j1968q578j8678L576q773
19604A13191j6146J5231L120k562j0585m364K0795K718j205O58L754j5673m148
$$ y = [5588033, 4738026, 3921069, 3258286, 2819947, 2616535, 2570194, 2720195, 3090027, 3767744, 4808533, 5988343, 6697472, 6561667, 5835626, 4862230, 3861349, 2952513, 2239306, 1721385, 1374133, 1132936, 927658, 769315, 647417, 574780, 526003, 466139, 433559, 405900, 364907, 316564, 280906, 249305, 218406, 203249, 186663, 174032, 155866, 151236, 183378, 232805, 298427, 336248, 349098, 343083, 322235, 296676, 244195, 174685, 147611, 155146, 164665, 153999, 165712, 175276, 171829, 197352, 235298, 256804, 240919, 218546, 202834, 204836, 185115, 161936, 152589, 123923, 118219, 130066, 150962, 171334, 157612, 145644, 137066, 118388, 121964, 113191, 97045, 112276, 115396, 112834, 102249, 97885, 118680, 121398, 120193, 120851, 124605, 108932, 104784]
19591A04784J3265m497j7747j9145j9141j9947j553R665J1929j4512r975J3916
19579D7042K8384K6985O437J1134k979m2585k1498p943r980J3710J3278j5608
19567D6377l1355j0744K889L5873K2438o364k039K5032J5530N81r31j669R115
19554A04733l972R699J8078K0633L3081K7881N552n166j0681j9603k5959k871
19542A51405K1204J5168J1594K5075N1285N1284O2553O9334L3110j0411k9587
19531D52014L6894O6072L9821M8504P3744J16329K15653L29254M39829L56966
19521B175080J02910j24874k77408l50456l32161k60421j58909m6377o541R632
19511G30475K0531P2562J76457K95898L70736K79977O265j95819k58677k95227
$$ y = [104784, 118049, 113552, 95805, 76660, 57519, 37572, 36019, 45684, 57613, 43101, 33126, 47042, 75426, 102411, 108848, 119982, 117003, 74418, 52920, 44977, 34997, 48707, 61985, 46377, 15022, 4278, 7167, 43040, 65478, 59114, 57075, 82107, 97637, 98218, 97287, 95618, 104733, 100761, 110460, 128538, 149171, 182252, 210133, 215685, 210519, 199838, 180235, 154276, 151405, 172609, 187777, 199371, 224446, 275731, 327015, 389568, 458902, 492012, 481601, 452014, 488908, 554980, 594801, 643305, 717049, 833378, 1049031, 1378285, 1818114, 2175080, 2277990, 2153116, 1875708, 1525252, 1193091, 932670, 773761, 727384, 720843, 730475, 751006, 823568, 1000025, 1295923, 1666659, 1946636, 1952901, 1757082, 1498405, 1203178]
19501A203178k70010k38219k03417j21977o9974n2895k3448n033J597j7755p072
19490A94975l2395l8804M492P967k1853K697J0985k0380j4804Q061J1369K0954
19478A33264J1324j5805l4588j8991r422j060J0537Q060j831j7289j3903o254
19466D4042j2013J7189P657j9985m193J0334P609k4573r941Q420K056o495o862
19453A3245n576j2753O57K4524P128K133J2200M128Q82m234r491p833N466Q317
19439C8793j5208r624M780l547J2016Q160o937P535J3942j257O027M138k3407
19426C5411N629L776n733p262k722O157R912l30k985r868L055N176p221j994p745
19411B3256k123q09J6011j4091o19J3206N5J4239J0253o635q270o411q19Q086
$$ y = [1203178, 933168, 694949, 491532, 369555, 299581, 246686, 223238, 218205, 219802, 202047, 194975, 162580, 123776, 128268, 136235, 114382, 117079, 128064, 107684, 92880, 100941, 112310, 133264, 144588, 128783, 94195, 75204, 65782, 64722, 75259, 83319, 81488, 64199, 50296, 44042, 32029, 49218, 56875, 36890, 32697, 43031, 50640, 26067, 16126, 24546, 26602, 20107, 13245, 7669, -5084, -4427, 20097, 27225, 29358, 41558, 45686, 46568, 42334, 32843, 25010, 30476, 38793, 23585, 13961, 18741, 15194, 27210, 35370, 28433, 35968, 49910, 48653, 54680, 58818, 35411, 41040, 44816, 39083, 31821, 29099, 35256, 45168, 44838, 41853, 31985, 35040, 40216, 32995, 31001, 23256, 21133, 20324, 36335, 22244, 21625, 34831, 34886, 49125, 59378, 52743, 44473, 38062, 37243, 45329]
19397D5329k80j3431l900j395j510m576n9p88J5431J4203j889j2284k332p306
19383B5213k95j3285O421R345p236o844K9481Q897O441k747M737J9583j2197k0584
19369D6930j0425q893J1333j1816j9180j7685j3688j5656K1646K3486J3761J3597
19357C3410n056m677N857j0350k1859J3654N194n527k1672q304j7449k3858P858
19344e2779J9952L3362Q409j3530j0872J4238j963K203J0269J3200P646j501K661
19331C1295N996l369J896J1022r418j8524j0992j3346n599L229j6980J5518K7791
19318A8519K5064j599k5805j0605Q049L86J0398L513L678P010J1846k3091j1388
19305A5975R605J4824J5439q190P365K1531M807J2575M423J0950J5000J1791N019
$$ y = [45329, 45049, 31618, 27718, 26323, 24813, 20237, 20178, 19390, 34821, 49024, 47135, 34851, 32519, 25213, 24918, 11633, 18054, 27399, 20163, 13319, 42800, 51697, 58138, 55391, 60128, 79711, 67514, 46930, 36505, 27612, 38945, 27129, 7949, -9736, -23424, -39080, -17434, 6052, 19813, 33410, 28354, 23677, 29534, 19184, -2675, 10979, 16173, 10646, -11026, -19330, -36779, -60637, -52779, -32827, 535, 8944, -4586, -15458, -1220, -3183, -980, 9289, 22489, 30135, 28634, 31295, 37291, 33922, 35818, 46840, 37422, 18898, 7906, -5440, -11039, -7810, -24790, -9272, 18519, 43583, 41984, 16179, 5574, 13623, 14009, 24407, 27920, 31598, 38608, 50454, 27363, 15975, 25580, 40404, 55843, 47653, 55018, 76549, 81356, 93931, 98354, 109304, 124304, 136095, 141114]
19292A41114K6090O7867O3748O0329O8098J55171K76501M41684O04289M57286
19282B362177m1400k85512l51134m09247l43573k51161j39494m6151k1359M898
19272D78044N0953J14795K24944M10431N61854M29519m0223k93960l64695l61672
19262A209990l41103k70469j83742j05108p4733l6329j7794k6498k5010j1399
19252A17805Q32j7058j7057o061M704j0809j1304k908n563J295K037M10J8580
19239G4903j9153l5847J2389Q265q507j4108r30j1155r139k4615k1562J0309m984
19226d4134q844O408N455J8008K228n350J9007K8738L243r156K500j6679l2025
19213c0601J2538J1534k4960j2923J9797L148j5395K453O825o132k097J7396L890
$$ y = [141114, 167204, 235071, 298819, 359148, 427246, 582417, 858918, 1300602, 1904891, 2362177, 2320777, 2035265, 1684131, 1274884, 931311, 680150, 540656, 494505, 473146, 478044, 528997, 643792, 868736, 1279167, 1841021, 2270540, 2230317, 1936357, 1571662, 1209990, 868887, 598418, 414676, 309568, 234835, 198506, 180712, 154214, 129204, 117805, 118637, 101579, 84522, 78461, 83165, 72356, 61052, 58144, 52581, 53876, 55913, 56323, 74903, 55750, 19903, 32292, 40557, 32050, 17942, 17012, 5857, -3282, -27897, -49459, -39150, -44134, -52978, -46570, -41115, -23107, -20879, -26229, -7222, 21516, 24759, 15603, 18103, 1424, -30601, -18063, -6529, -31489, -44412, -24615, -21467, -36862, -34409, -27584, -33716, -35813, -18417, -14527]
19200a4527M398J4728p254n915o240J752J4725p294k069kN399K988K708J3351
19186A6748k0594p057l46J1323j797J9371J068p752k1345l0570m625P474n593
19173d3695m016J6949K1348N316j424o710Q2Q203n2l638J5488p545k6912R214
19159a7392J8958Q224r491q645j8314Q955N327M020j774j1959Q199l204l462J331
19145a9227M607k567j3780q57K983L34J3513O597P742J444M666k857q383j604
19131g389N459J2633n638o202M450J1345O017k3168k1707J7750N282P193K952
19118H977q51j1212K978N24R118P692r526j7953J1039P875l001k872J5971P532
19104B6291J3208K1679R315j7303J5466M2131O031k9835N84j3637j7470j5383
$$ y = [-14527, -10129, 4599, -2655, -8570, -14810, -13058, 1667, -5627, -7696, -7698, -2299, 689, 3397, 16748, -3846, -10903, -11249, 74, -1723, 17648, 18716, 10964, -10381, -40951, -45576, -38102, -43695, -47711, -30762, -9414, -4098, -5522, -12232, -12150, -3947, -3999, -7637, 7851, 306, -26606, -17392, 1566, 9790, 299, -8346, -26660, -17705, -12378, -8358, -10132, -22091, -13892, -17096, -20558, -19227, -14620, -17187, -30967, -31824, -28841, -28507, -14994, -8397, -655, 789, 5455, 2598, -5785, -7389, -1930, 10703, 5065, -1137, 3313, 14658, 20675, -2493, -24200, -6450, -1168, 6025, 8977, 8126, -3086, -108, 416, 9534, 17226, 7700, -10253, 786, 8661, 5660, 2788, 18759, 26291, 39499, 61178, 70493, 53190, 68656, 110787, 116818, 86983, 87567, 73930, 56460, 41077]
19092D1077j6943J6379J5038L862J6674M0434L6237P654q588j3645p437j3280
19080A17462j0456j2224k1816q632K8174K5362J6245K0602j8210k0857l7003k2028
19068E6619j6493N3Q200n952j2801j0716J6839P52R62o416q453J7676J1909q326
19054D3853j0478j2481j4493j475N285j1270r617R828J4012J0107j2257k4252
19042a3238p685m002Q79J0193J8219j1513J6413K1625k669p25m384j8354j0200
19029e441j7536q727J3065k137q939m427J7133r9O979M20j1923N764k816K912
19015a5772O384M438J3247J1784R906R21J2771j3609j5962j4491k642n22J644
19002a903q965J2198M933K145P971J3367O770Q735q177n927r338N781k651N746
$$ y = [41077, 24134, 40513, 55551, 59413, 76087, 116521, 152758, 160412, 151824, 138179, 130742, 117462, 107006, 94782, 72966, 64334, 92508, 117870, 134115, 154717, 136507, 115650, 78647, 56619, 40126, 40179, 48379, 42427, 29626, 18910, 35749, 36501, 37463, 31047, 22594, 40270, 52179, 43853, 33375, 20894, 6401, 4926, 10211, -1059, -10676, -848, 13164, 23271, 11014, -13238, -20923, -24925, -24046, -13853, 4366, -7147, 9266, 30891, 28222, 27497, 23113, 4759, -5441, -22977, -31704, -18639, -20776, -29715, -34142, -17009, -17108, -10129, -9709, -21632, -15868, -18684, -15772, -9388, -4950, 8297, 20081, 29987, 30908, 43679, 30070, 14108, -383, -3025, -3547, -1903, -10868, 1330, 6263, 8408, 16379, 29746, 36516, 45251, 37074, 31147, 21809, 27590, 24939, 30685]
18988C0685J8340p699j5616O47L545j2500J1885J8992N394L115M406R750M585
18975G5529K5380J3489K1177K2917J0733p219J1623J0820J7678Q087J4946J0158
18963B35318K6166L7219N7476O7558M4784P4950Q2246Q9949J26423J67060K42962
18952A252111M36507P69584J371051K178150K081409J93756r65323j288128j404747
18943D624370j215779q83325n55191k47560j9365J48650L66510P31045J427257
18934D376612K126489J540365l47596j121276j341420j363049j165841q48680
18926A855604n32813l30830k27139j57141q5485n5449n6988m2503l9526l0172
18916B97558j1935k8295l3674j3404k5079k5734n404L39l37k8689j3989l679k4860
$$ y = [30685, 49025, 41326, 25710, 26357, 29902, 17402, 29287, 48279, 53673, 56788, 61194, 70944, 75529, 100909, 114398, 135575, 158492, 169225, 162006, 173629, 184449, 202127, 210214, 225160, 235318, 261484, 298703, 356179, 423737, 468521, 543471, 625717, 715666, 842089, 1009149, 1252111, 1688618, 2458202, 3829253, 6007403, 8088812, 8282568, 7317245, 6029117, 4624370, 3408591, 2525266, 1970075, 1722515, 1703150, 1851800, 2218310, 2949355, 4376612, 6503101, 8043466, 7695870, 6574594, 5233174, 3870125, 2704284, 1855604, 1322791, 991961, 764822, 607681, 522196, 466747, 409759, 367256, 327730, 297558, 285623, 257328, 223654, 210250, 185171, 159437, 154033, 154372, 154035, 125346, 111357, 107678, 82818]
18903H2818j0528K3070L4280J2520J1520P06j1498j9252m280k3171j4304j6558
18891F5323K1874q558J4874L8763n616j6019j3521j9236j2168j0883p409n627
18879D1797p85J5556N528j1428l097l422j1159j1161j7224J501J5445k175n590
18866A3786j9428q734R178M138L026P11r498N368J888l966n680j2903K0327L253
18852A466O894J0345j333J6093K847q40j473j8237n456j2661Q386n986o673n984
18838a2612j6126r993K5127J6137J2051K413l570M790P681J0353l421j7316n193
18825A0321l276J0272K5022n6N10P476m663j2508j9514K3718l291K849j667j6668
18811A8525j1372J1322O080p161j6426j3430N702K4660L0900Q583m081p162L0952
$$ y = [82818, 72290, 95360, 129640, 142160, 153680, 154386, 142888, 123636, 119356, 96185, 81881, 65323, 87197, 78639, 93513, 132276, 126660, 110641, 97120, 77884, 65716, 54833, 47424, 41797, 41012, 56568, 62096, 50668, 47571, 44149, 32990, 21829, 4605, 6106, 21551, 19376, 13786, -5642, -14376, -5198, -1060, 1966, 2677, -6821, -1453, 435, -3531, -9211, -22114, -1787, 1466, 8360, 18705, 17372, 33465, 36312, 35472, 33999, 15762, 10306, -2355, 6031, 45, -6628, -12612, -28738, -38731, -13604, 2533, 14584, 16997, 13427, 18217, 25898, 36251, 32830, 15514, 10321, 7045, 17317, 42339, 42283, 42793, 50269, 45606, 33098, 13584, 37302, 34011, 36860, 35193, 18525, 7153, 18475, 24555, 17394, 968, -12462, -6760, 17900, 48800, 57383, 53302, 46140, 77092]
18798G7092J9733m728n307j6513P25M923q66O078l348J1151j9331k9620j1837
18785B8152n631j3967J657q340r482j0532l636J6166J1985j7066j9454J2652K5205
18772G709K9449j2910p845J9542K5969M7523K7216r196j0332k3696j3941l6366
18760D3122j1803P816K530K278j7537j7310j0538J3114J7968P373r778m667J2646
18747C5214p87Q223J6428j963j0357j3030J005k987L771j1279k0324O519K940
18734A3373M099J2696j3386k8259k0369P109M058R419J2827Q238j0235k1156k882
18721b4468M423j0638O873J1369J9267n748J2718m207k3895j0000q9M745p110
18708b6760l678j3322O028O940J9648J7589m101o344n5q723m417j565J2582J8770
$$ y = [77092, 96825, 92097, 86790, 70277, 71002, 75925, 75059, 81137, 77789, 88940, 69609, 39989, 28152, 22521, 8554, 10211, 1871, -7611, -18143, -21779, -5613, 6372, -10694, -30148, -17496, 7709, 37158, 24248, 16403, 35945, 61914, 109437, 136653, 127457, 117125, 93429, 79488, 43122, 31319, 39135, 41665, 43943, 26406, 9096, -1442, 11672, 29640, 37013, 27235, 22568, 35214, 34427, 42650, 59078, 57115, 46758, 33728, 34733, 31746, 35517, 24238, 3914, 10433, 13373, 17472, 30168, 16782, -11477, -31846, -24737, -20679, -11260, 1567, 9805, -430, -21586, -24468, -20045, -30683, -23810, -12441, 6826, 1078, 13796, 9589, -14306, -24306, -24395, -19650, -26760, -30438, -43760, -37732, -30792, -11144, 6445, 2344, -4000, -4055, -12778, -17195, -18760, -6178, 12592]
18694A2592J572j731l547n647j4230j600K2573m909J7986m142j3092j0650J6393
18681A1568O574j1456K108k3740j6249j5654L861J9508J0631m957j1340m872Q016
18668b6002j1503J1016P301k474R364N679P086J3689j0627j3701o675l018J65
18655a9700J8037O459J343K973r702p297j3219J101K865K985K3964J9371p594
18642B1586j758K6314O372j6344k5469r013j0815K2927o880k2803L652Q943j2763
18629a6051O250j4103j5977j6606J5811K0189J2746j0905p670P238K2847J5212
18617A8981q481J4882j2482k7684J5256J6853J63p227j0449j265R164J0277K526
18604B0514N2447M5916K1289k232p826k959k3876l5026j4055j5289K664j4460
$$ y = [12592, 14164, 12433, 8886, 3239, -10991, -12591, 9982, 5073, 23059, 18917, 5825, -4825, 11568, 18142, 6686, 8794, -14946, -31195, -46849, -42988, -23480, -12849, -17806, -29146, -34018, -26002, -37505, -26489, -19188, -21662, -12298, -6619, 467, 14156, 3529, -10172, -16847, -19865, -19700, -1663, 4796, 6139, 9112, -590, -7887, -21106, -20005, -17140, -14155, 9809, 29180, 21586, 19828, 46142, 52514, 36170, 10701, 1688, -9127, 13800, 6920, -15883, -12231, -3288, -16051, -9801, -23904, -39881, -56487, -40676, -20487, -7741, -18646, -26316, -19078, 3769, 18981, 10500, 25382, 12900, -14784, 472, 17325, 17488, 10261, -188, -1453, 7711, 17988, 20514, 72961, 118877, 140166, 137934, 130108, 127149, 103273, 68247, 54192, 38903, 41567, 27107]
18592B7107r099J5421j0519j3831k589J7079J3182M63m033k2069j2312k236J096
18579b340J4254J0190P95j001p113n986j8452k311o659N089n276O150K5752K276
18565A5368k515J4657p886m430q84K3624k053K165P493l380k436N185J4492K1098
18551H0498M2593J8424J6561K172k2267k3481j5760j6367j3362j3721j7360j2311
18539B5619P398m489k9876r888N833L8091J101k536J891K1355O336j1725k0709
18526B8401k7139k2054J9747K0878q640k5815M22R388J7992O077J4238J1613k170
18513D2938k6675k7467j997L219J9668Q225q339M293o612q832m713R746J0076
18500A3530j049o509o194o165n390P025o512N090J3497K0121k3705n7J1928O506
$$ y = [27107, 18008, 33429, 22910, 9079, 6490, 23569, 36751, 37214, 33181, 11112, -1200, -3436, -2340, 11914, 22104, 22899, 21898, 14785, 8799, -9653, -11964, -18623, -13534, -18810, -12660, 13092, 15368, 12853, 27510, 19624, 15194, 14310, 37934, 35881, 38046, 45539, 42159, 39723, 44908, 59400, 80498, 123091, 141515, 158076, 160248, 137981, 114500, 98740, 82373, 69011, 55290, 37930, 25619, 33017, 28528, -1348, -11236, -5403, 32688, 33789, 31253, 33144, 54499, 60835, 49110, 28401, 1262, -20792, -1045, 19833, 11193, -14622, -14200, -4812, 13180, 19257, 33495, 45108, 42938, 16263, -11204, -13201, -9982, 9686, 17911, 9572, 13865, 7253, -1579, -6292, 3454, 13530, 12481, 5972, -222, -6387, -11777, -4752, -11264, -6174, 7323, 27444, 3739, 3682, 15610, 22116]
18486B2116L040k330O527J3181K0304K436N997m934P764J1001j8075j1241J6224
18473G2010J3834j0320J0196J556J7506J9759N125J3014J2191K4706M0580K4615
18461B44772J6375J2568o661L743J2543K4679M8317N4882Q5683J12130J50581
18450G59612J90417L15572N55684R44274J313626R08418j54952o46640q12452
18441C373559q19217o98177n18395l51171k48746j48351r0429o5521l7533O527
18431D02546j0786k3959q375o865J1242J7574M4325M8261P5248J14677J33039
18420G96927J79839K60837M39240P59499J185059J165701K43278m89473p25295
18411C815612p97184p03887n76215m03711k47706j60746j14253l9625J6430M9142
$$ y = [22116, 25156, 22826, 29353, 42534, 62838, 65274, 71271, 66337, 74101, 85102, 67027, 55786, 72010, 85844, 75524, 85720, 87276, 104782, 124541, 129666, 142680, 154871, 179577, 220157, 244772, 261147, 273715, 267054, 270797, 283340, 308019, 356336, 411218, 496901, 609031, 759612, 950029, 1265601, 1821285, 2765559, 4079185, 4987603, 4832651, 4186011, 3373559, 2554342, 1856165, 1337770, 986599, 737853, 589502, 499073, 433552, 396019, 402546, 391760, 367801, 359426, 352561, 363803, 381377, 425702, 473963, 549211, 663888, 796927, 976766, 1237603, 1676843, 2436342, 3621401, 4787102, 5030380, 4540907, 3815612, 3018428, 2314541, 1738326, 1334615, 1086909, 926163, 811910, 772285, 788715, 837857]
18401H37857J12474J77955K97618N38369R11980J227600P57777k29682o48405
18392C983543p96139p92955o37635m77981l34427j87566j30593r5271n4362m1154
18382D35460l3152k4542k866r527J786j042K3027L2869N1645O0439P9727R9282
18370G13106J40308K13355M11385P57577J134121J042925J01737n30731p20574
18361C263209p62944o59584n38457l85822k28724j38055q8550p7285o4154m4287
18351B75347k4260m1458m9012k3585l5616j5785j3120O005J2944Q695M668l1320
18339G3503j0646n123k06O779j325r543q178J2141N866n240k0113j303M511J4461
18325E5584J3350M030P39L61p000K43j1832j6060r207k376J4537J6197n111l0587
$$ y = [837857, 950331, 1128286, 1425904, 1964273, 2876253, 4103853, 4861630, 4631948, 3983543, 3187404, 2394449, 1756814, 1278833, 944406, 756840, 626247, 530976, 476614, 435460, 402308, 377766, 374900, 365373, 367159, 366117, 389144, 422013, 473658, 534097, 613824, 713106, 853414, 1066769, 1478154, 2235731, 3369852, 4412777, 4514514, 3983783, 3263209, 2500265, 1840681, 1302224, 916402, 687678, 549623, 461073, 383788, 319634, 275347, 251087, 209629, 160617, 137032, 101416, 85631, 72511, 78516, 91460, 100155, 104823, 73503, 62857, 57734, 57528, 64307, 62982, 53439, 45261, 57402, 63268, 58028, 37915, 36612, 41123, 55584, 68934, 72964, 73703, 74064, 67064, 67307, 55475, 39415, 30208, 27832, 42369, 58566, 53455, 22868]
18311B2868j3976J1635J3921J2508R009j6127j7433j2121L710J3105n138q653
18299A3308P17P083P180M710r750K351P875n091Q65R65j85m925J006K549j0806
18284A7852P755R518J0474q453j3899j4832j9983J7917L1524J5512j780q763j5282
18271B7560o065J5607J8972K0642k912j4694J438p125N294n217p26j5665m591
18258C2518N492J3317N811j9286l484K2785J2489K556K572N548j2471j8419l0664
18245A8764J215L801J2760M806j3133J6692J0882R832k1135k8648k9594Q44L0439
18232A7525N3156M8051J9461n720j9646k5622j3842Q907R745N882j5208o324J4809
18219I1174j3091j6991m119n253r751J1945K470R513k306n583N471K5931K3769
$$ y = [22868, 8892, 20527, 34448, 46956, 55965, 39838, 22405, 10284, 13994, 27099, 21961, 13308, 14025, 21108, 28288, 32998, 23248, 25599, 33474, 28383, 29248, 30213, 30028, 25103, 26109, 28658, 17852, 25607, 35125, 45599, 37146, 23247, 8415, -11568, 6349, 37873, 53385, 51605, 42842, 27560, 21495, 37102, 56074, 76716, 73804, 59110, 60548, 53423, 58717, 53500, 52774, 37109, 32518, 38010, 51327, 57138, 37852, 34368, 57153, 69642, 72198, 74770, 80318, 67847, 49428, 18764, 19979, 23780, 36540, 41346, 28213, 44905, 55787, 65619, 44484, 15836, -13758, -12914, 17525, 70681, 118732, 138193, 132473, 112827, 87205, 73363, 82270, 92015, 97897, 82689, 76365, 91174, 78083, 61092, 56973, 51720, 41969, 53914, 56384, 65897, 63591, 58008, 63479, 89410, 113179]
18206A13179l494J8322K3159j2825j8086j5237M937r309K0909J7272L996o864
18194A35959j7862j9196j0157J121J6847J160l0055o617j150l658J0988J3402
18182I0782m644k1532k1381N348j6694r84k2322R06K7027O163Q261R365k633J0146
18168F7808K0342J0918Q072M542J6713L763l979rK823J4389J8656P992M796P173
18154A83999R396r352k1124j5454k29K746N953P023K547L242k713L901J4935k498
18140A82372J0623j892M966N955L8158M1721L9076J9410J3651J0087L29L5227
18128C99683L9921N1603P1847O1682P5340R3165Q1580P7935J10203J15314J70423
18117A348696K34602L06870M17037N64125Q03999J212344K050793L762480O738938
$$ y = [113179, 109685, 128007, 151166, 138341, 120255, 105018, 109955, 100646, 121555, 138827, 142823, 135959, 118097, 98901, 88744, 89865, 106712, 107872, 77817, 71200, 70050, 66392, 77380, 90782, 86138, 64606, 43225, 48573, 31879, 30895, 8573, 9479, 36506, 42669, 50930, 60295, 57662, 67808, 88150, 99068, 107140, 111682, 128395, 132158, 128179, 128170, 130993, 145382, 164038, 172030, 176826, 183999, 193395, 184043, 162919, 147465, 147236, 149982, 155935, 162958, 165505, 168747, 166034, 169935, 184870, 182372, 192995, 191103, 196069, 202024, 240182, 281903, 320979, 340389, 354040, 364127, 364456, 399683, 439604, 491207, 563054, 624736, 700076, 793241, 874821, 952756, 1062959, 1178273, 1348696, 1583298, 1890168, 2307205, 2871330, 3675329, 4887673, 6938466, 10700946, 17439884]
18108A7439884R017450M756150k316398m572605n412384n261912m295994l106735
18100F247456j959248j154181p40668m94390l53328k32311j76622j33785j31642
18091H71281j00722o1303n5236n6136l7878n0488n8920m9615l3541l8767l0731
18080B97944j1100j682j6359k2462n605P334K7178K3631p871k6057j8137k3812
18068B23002j5063k4666j8129k072J613n49R405j7621j4814o198J5581J4574N513
18055A70576j5112k9618k411Q900j565L3860L0458J8461J0723r221K6102K7996
18043B69149K2376j7682j6737j0221J8088M251j0085J0537q016j8125k3958j4754
18031B04823P625P497m435m30j2904Q602J9459K357q886Q829j0636j1644M405
$$ y = [17439884, 26457334, 31213484, 28897086, 24324481, 18912097, 13650185, 9354191, 6247456, 4288208, 3134027, 2393359, 1898969, 1545641, 1313330, 1136708, 1002923, 871281, 770559, 709256, 654020, 597884, 560006, 509518, 450598, 400983, 367442, 328675, 297944, 286844, 285162, 268803, 246341, 240736, 248070, 275248, 298879, 291008, 264951, 246814, 223002, 207939, 183273, 165144, 163072, 164685, 164136, 173541, 155920, 141106, 134908, 150489, 165063, 170576, 155464, 125846, 123435, 132335, 130770, 164630, 195088, 213549, 224272, 215051, 241153, 269149, 291525, 273843, 257106, 246885, 264973, 269224, 259139, 269676, 261660, 243535, 219577, 204823, 212448, 219945, 215510, 215080, 202176, 210778, 230237, 232594, 223708, 232537, 221901, 210257, 214662]
18018B14662K0818M1831Q022k5502r722L296l631k0158j9213j2117k651P737o077
18005A97295j0328k2199j4020r160J2035k38j4359K768N243N401k731J643K2979
17992A74329L974q735n829j6427o41K867l506m814K931R16N360K0254M428N668
17978A80775j6940k1002N12J175K762o223k0671M74J1549J0062K816J1919J1892
17965A69100j666j604J2395J0484k0154k0735J0293j1703k4342r790j3332j6649
17953H2297J6645j2672k5202k0840n211P419N311p053J389J5523q406j4339j4212
17940B0649j2076J2362Q74p933j6094m132P334M753L390j2133k170N691K2792
17927B3307l135j0404j1384K76j3101J0601K0487J3427j5093k489J3258K052j7352
$$ y = [214662, 235480, 277311, 285333, 259831, 250109, 253405, 249774, 229616, 210403, 198286, 195635, 203372, 197295, 186967, 164768, 150748, 141588, 153623, 153385, 139026, 141794, 147037, 152438, 149707, 151350, 174329, 178303, 169568, 163739, 147312, 146671, 149538, 146032, 141218, 144149, 145065, 150425, 170679, 175107, 180775, 163835, 142833, 143345, 144520, 147282, 141059, 120388, 120862, 132411, 142473, 145289, 157208, 169100, 167434, 165830, 178225, 188709, 168555, 147820, 158113, 146410, 122068, 112278, 98946, 82297, 98942, 86270, 61068, 40228, 35017, 42436, 47747, 40694, 42083, 57606, 49200, 34861, 20649, 8573, 20935, 21809, 13876, -2218, -6350, 984, 5737, 9127, -3006, -5176, 515, 23307, 20172, 9768, -1616, -1340, -14441, -3840, 16647, 30074, 14981, 12492, 25750, 27802, 10450]
17914A0450J399j546O626Q641R194J6980Q91k6932J9369J6335q599j6010M400
17901D1198j018J1045j0864m009J8967q960j4562J2089m057K41p796m535M031
17888C1770j0171j0377j7143n371l869j4342J5371J1119J0945K7381L566n789
17876C3090l728o7J0637k202j3686k140k652n076k040j3096J3133n298j6621J8480
17862H734L4639L564j6340j5286j6214j617R291J4752J3296J590j5014K03r181
17849A2417o969m816J8950j0137j2319M911L635j3531p076J0562J0921L725m830
17836E443r171L837P51m514J3257J5660j2017J4084Q212J004Q850j017j2161j5658
17822A6560p727j1088O200J9794O563J6272p055M739n87l198J1922k1020k5363
$$ y = [10450, 11849, 10303, 16929, 25570, 34764, 51744, 52635, 25703, 45072, 61407, 52808, 36798, 41198, 40180, 51225, 40361, 36352, 55319, 46359, 31797, 43886, 39829, 40070, 32274, 27739, 31770, 21599, 11222, -5921, -11292, -15161, -29503, -14132, -3013, 7932, 35313, 38879, 33090, 29362, 29295, 39932, 37730, 24044, 21904, 19252, 14176, 12136, -960, 12173, 6875, -9746, 8734, 43373, 46937, 30597, 15311, -903, -2520, 6771, 21523, 34819, 36409, 21395, 21598, 12417, 5448, 632, 19582, 9445, -2874, 2037, 5672, -7859, -14935, -4373, 6548, 10273, 5443, -3728, 109, 860, -3654, 9603, 25263, 13246, 27330, 35542, 36546, 45396, 44379, 32218, 16560, 8833, -2255, 3945, 23739, 30302, 46574, 39519, 44258, 43671, 40473, 52395, 31375, 6012]
17809F012M927Q885n077O662J2220r332n959N963M673O757p125l21j1797r514
17795F974R593J3145P0l195j5211n52j25m128R04N399j1286l1j513n07j819N902
17779C620R475l006o162J0371j137R380m860k193J504j1911M584j0852j2792J4028
17765D9O114P781l976j3728N459R526M120j3847o591P055j7173J6834L916N499
17751A1038Q095p6k736q534n638r528J2526R12j5408N939P145J1724P647J8914
17737D2020r62J0019q790k7209j1147j3454J3293J2942K805N472J6034M69m422
17724C7070M743J679j243j8385k3395L921Q222M67J4084j2139n049j2087J686
17711d26l570j6299O23Q21p561J5200P504R852J4755j5554j7036l79Q380j1990
$$ y = [6012, 10939, 19824, 14747, 21409, 33629, 24297, 18338, 24301, 28974, 35731, 28606, 28285, 16488, 6974, 16567, 29712, 29782, 26587, 11376, 10824, 10699, 6571, 7475, 12874, 1588, 1557, 44, -463, -2282, 3620, 13095, 10089, 3927, 14298, 13161, 22541, 17681, 15488, 16992, 5081, 9665, -1187, -13979, 49, 6163, 13944, 9968, -3760, 1699, 11225, 15345, 1498, -5093, 1962, -15211, 1623, 5539, 11038, 19133, 19057, 16321, 7787, 2149, -7379, 5147, 6059, -9349, -3410, 3735, 15459, 23106, 42020, 41058, 51077, 42287, 15078, 3931, -9523, 3770, 16712, 19517, 24989, 41023, 41492, 37070, 41813, 43492, 42249, 23864, 469, 4390, 12612, 13079, 27163, 15024, 9975, -2112, -426, -3996, -20295, -19672, -18851, -26412, -11212, -3708, 6144, 20899, 5345, -11691, -12070, -3690, -15680]
17697a5680P842r292p009R154K2593J0619j8898j5449j1250n880L39J6864K6659
17684A0612m82j433n593l483N254K095k538m19K041l115j2551j5375p687M603
17670b8071J5627K6303r313j3144r570R520J3412J2556l40k349p834J3353j1748
17657H402k6518k2126l000J9593O781N976J1936R151l237j5697O462k314N617
17644A026r182L867O04R274J2424k2109k769J9062P683q14k621j4892M378L02
17630F233j1775q866J4557J5095k5895j9764J2932J4451K013j6797m700J1706
17618a0810J2782q764l8531o975q46K4496K7232j0779N743O486J3900p75k4216
17605a1057R88J6487J6030k3140j6419o196J3613L113j2642P75k0170j1468J8542
$$ y = [-15680, -7838, -17130, -24139, -14985, 7608, 18227, -671, -16120, -27370, -33250, -32911, -16047, 10612, 10130, 8697, 3104, -379, 4875, 6970, 4432, 4013, 6054, 2939, -9612, -24987, -32674, -28071, -12444, 13859, 4546, -8598, -18168, -8648, 4764, 17320, 16980, 14631, 6797, 20150, 8402, -18116, -40242, -43242, -23649, -16868, -10892, 1044, 10195, 6958, -8739, -2277, -4591, 1026, -8156, -4289, -3685, 5589, 18013, -4096, -6865, 12197, 19880, 19066, 16445, 1553, 5931, 6233, -5542, -14408, 149, 15244, -10651, -30415, -17483, -3032, -1019, -17816, -22516, -10810, 1972, -6792, -45323, -52298, -53144, -28648, -1416, -12195, -6452, 34, 13934, 13159, -11057, -10069, 6418, 22448, -692, -17111, -23307, -9694, -6581, -19223, -18448, -38618, -50086, -31544]
17592c1544j6684Q344K9320J7283o832o538r156J020J785O79P446p350n052L038
17578a4241K0561Q651j1436o101R755j5464k2710O149O847J2836L604k48K4181
17565B2384P337k368k1959n660Q981J391k595j6431j3945j2526J2253K231M569
17552a6338j177j0935j2789J7645L3866J4194P728r42j1123K106l013k5208j6010
17539b1996N076j327l289Q110J9452j5524l544j2192j9245J573K4870K1508j3036
17526i564l3052K390R520J1796J2900Q423k305O64R546M57n863j3033J13j2951
17512b0959k0768R755J678k326N679J7884M445l996n591P242l506J0814j925j6102
17498a7676M268L790j476l508J0702J4000J1912j4986k0631r681J5699J2969J8687
$$ y = [-31544, -48228, -39884, -10564, 6719, -113, -6651, -15807, -14787, -13002, -12323, -4877, -12227, -17279, -14241, 6320, 14971, 3535, -2566, 7189, -8275, -30985, -24836, -17989, -5153, -1549, -1797, 22384, 29721, 27353, 5394, -266, 8715, 10106, 7511, -8920, -22865, -35391, -23138, -20907, -16338, -17515, -28450, -41239, -23594, 10272, 24466, 32194, 31252, 20129, 22235, 19222, -5986, -21996, -16920, -18247, -21536, -13426, 6026, -9498, -13042, -25234, -44479, -42906, -18036, 3472, -9564, -42616, -40226, -30706, -18910, -6010, 2413, 108, 772, 10318, 10775, 4912, -8121, -8008, -20959, -41727, -31972, -30294, -32620, -26941, -9057, -4612, -8608, -14199, -6957, -10463, 351, -1574, -17676, -13408, -9618, -11094, -14602, -3900, 10100, 22012, 7026, -13605, -23286, -7587, 5382, 24069]
17485B4069N437J1462p959l4918j8977K1276K495O42R815P542j8573j3037j013
17472a1739n301L355Q264j1568j0986Q324L37Q501r38j6988j3124J4551J8172
17459i140m96O642M370r349K0352J9114k0843j010j0787l709l206k2609Q803J8283
17445c585J5225J5533L1752J6047M0353M2555J0919j4027m7504l6598l1403j9932
17433A9335j093j1656p706j7577m827J3809j235m728j5352p829K86r15O485K3867
17419i136j28Q558J383j7415p963K779J2412Q040M686k1484K522K746K4351L640
17405A4991j3923j224q871j911J131P209k3247j3723p053N565K0402K4297k469
17392A174N776m864M195j6255j8310j0003L179M479J5250J9268j101p379J696
$$ y = [24069, 29506, 40968, 33009, -1909, -20886, 390, 2885, 3527, 13342, 20884, 2311, -10726, -11739, -17040, -13685, -5421, -16989, -27975, -19651, -19314, -10813, -11751, -28739, -41863, -27312, -9140, -9636, -2994, 1376, -7973, 12379, 31493, 10650, 9640, -1147, -4856, -8062, -30671, -21868, -3585, 11640, 27173, 58925, 74972, 115325, 157880, 168799, 154772, 107268, 70670, 39267, 19335, 18242, 6586, -1120, -18697, -23524, -9715, -10950, -15678, -31030, -38859, -38573, -39488, -33003, -9136, -9264, -706, 677, -16738, -24701, -21922, -9510, -1470, 3216, -18268, -15746, -13000, 11351, 14991, 1068, -156, -9027, -10938, -9807, -2598, -25845, -39568, -46621, -41056, -20654, 3643, 1174, 6950, 2086, 6281, -9974, -28284, -38287, -35108, -30629, -15379, 3889, 2788, -4591, -2895]
17379b895Q057J7560k028k545J688m942p720q564j3563L666Q11j439J732J9533
17365I351J1512l0475j1958J0794j214K97J5666j659r649j1366j8463o15J5796
17352b1983R511J0648R096j0331k1058j3201J8386K0034p695k1321P44J7701J6241
17339F772o460r033r377K55J488j3223J4776K6235p300j7376L428J0456n720n919
17325a0998K597M613J0325j513j3408q823Q393M628j2083k135J75L467k3933J6535
17311b2160J6786j1602R538J0634j199L101j088r067J4219Q90p267K3831J653
17298B8269j7509k3131Q4l842k475p251q97n591J0625K7395N310l651O61R526
17284A7523j5050j9134P79O504j229j8146j9915n7P420Q78J2889J5342q629R164
$$ y = [-2895, 5162, 22722, 20694, 18149, 19837, 14895, 7175, -1389, -14952, -11286, -10475, -11914, -10182, 9351, 20863, -9612, -21570, -10776, -11990, -11693, 3973, 2314, -7335, -18701, -37164, -37779, -21983, -12472, -1824, 7272, -3059, -24117, -37318, -18932, 1102, -6593, -27914, -27170, -9469, 6772, 312, -8721, -18098, -17843, -16355, -29578, -14802, 11433, 4133, -13243, -9815, 641, -5079, -10998, -8401, -3788, 6537, 5024, -8384, -17207, -8814, -4186, -16269, -18404, -18229, -14762, -38695, -22160, -5374, -16976, -7438, 3196, 1997, 5098, 4010, -5057, 9162, 10052, 2785, 26616, 28269, 10760, -12371, -12287, -16129, -18604, -25855, -26752, -32343, -21718, 5677, 10987, 7336, 7997, 17523, 2473, -16661, -15882, -9378, -10607, -28753, -48668, -48725, -41305, -40427, -27538, -12196, -20825, -11661]
17270a1661J9233j5851k3581K219L2443J0603l920J170O404k451n633l0707K45
17257b1487Q887P111M217j4766j500Q569K3881P409m831o308R360N145r110P30
17243A7307k6774j9273p314K342J5006o715q279q451J254J3203K1683J8046p156
17230D879J844L082o113J7587q235m105q480n409J7715J0263j0072r894J519J1879
17216A6460j3682j3648j0838k756O274J3635Q328K4147M229q416N316J56l985
17203B5220j1419k4123k3998j0785J6530K080k7708J1918K6814J0635J1361k8631
17191b2106k8688j596K2305K0627R333q471J466o482k250R132K0028J755O204
17178B1257j0093j1768l04J6370n655l1682p264O704K2759O668p173L546L275
$$ y = [-11661, 7572, -8279, -31860, -29641, 2802, 13405, 9485, 10655, 17059, 14608, 8975, -21732, -21487, -12600, -5489, -1272, -16038, -17538, -8969, 14912, 22321, 17490, 11182, 20542, 25687, 16577, 17307, -9467, -28740, -36054, -33712, -18706, -25421, -33700, -42151, -40897, -27694, -6011, 12035, 4879, 6723, 9805, 3692, 21279, 13044, 8939, 459, -4950, 12765, 23028, 12956, 3062, 4581, 16460, 2778, -10870, -21708, -24464, -18190, -4555, 3773, 27920, 32149, 23733, 29049, 29205, 25220, 13801, -10322, -34320, -45105, -28575, -26495, -54203, -42285, -15471, -4836, 6525, -22106, -50794, -52390, -30085, -9458, -125, -8596, -7130, -13612, -15862, -6730, 13298, 15053, 21257, 11164, -604, -908, 15462, 9807, -21875, -29139, -22435, 324, 6992, -181, 3365, 6640]
17165F640M223M91m967J171K068J2597l255k2119j9103p877j1791P161J4151j331
17151b1941j0932J1286L482N157K3575J0702l846n327o000J899j9983o293j3533
17138c1754k69j8307M692J8942J2114K719J2385M642J2556J84J838j7959o473
17125d690J0283J162p639J2576j4083k1557j3825J9226P220P980K807n650n316
17112a1506j6968K211K4051j707K28p12j2167j369J32J4698J3936P517k437p022
17098H885o139j7500k88J1572K4543L1501n127k5453j0948j3186L716k79j9897
17085a8600l197j1228J1325J2324k561P152o50k1610j3749l02J2185J6646O756
17072e509j452J9547J493M35p866j739o630p115Q925P300j754q846j5830j3702
$$ y = [6640, 10863, 11354, 6387, 7558, 9626, 22223, 18968, -3151, -22254, -30131, -41922, -34761, -20610, -21941, -32873, -21587, -18105, -12948, 10627, 21329, 17483, 12156, 6156, 8055, -11928, -18221, -31754, -32023, -50330, -45638, -26696, -14582, -11863, 522, 5164, 17720, 17904, 19742, 1783, -4690, 5593, 6755, -884, 11692, -2391, -23948, -37773, -18547, -11327, -3347, -540, -6190, -11506, -28474, -26263, -2212, -3919, -3691, -4403, -16570, -17939, -17807, -3109, 10827, 18344, 15907, 8885, 2746, -14754, -15042, -3470, 21073, 52574, 47447, 21994, 11046, -2140, 1576, 1297, -18600, -21797, -33025, -21700, -9376, -11937, -4785, -5435, -27045, -40794, -41096, -28911, -12265, -5509, -6961, 12586, 14079, 14514, 6648, 4909, -1721, -8836, 89, 7389, 5635, -3211, -19041, -32743]
17058c2743J1055O467K429j031k08J2877J8613j2247q918K597J5326M193l585
17045A4825o657j2727M49J1339p86j2132m19O652J751r339J940q593J200p005
17031a9502k605R026j358J0042J1756L08r798k229n353J1428Q515M376j4438j7605
17017a7437q905M714J3688k0331k1958J5687J0967J4035q545K1347J892k1584
17005a6430j7297p423M727J576L782R069K4221j5403j7252O236J7124O459J4554
16992A3943j1021N521N383j4283m884j9613J1968K1087J7559r61m756j5634l986
16979C23q644m670J0142O588O382n165k1587j0700n423o837N132K985j659M823
16965b8310K6283k239J5234n460L567O262l2215J2069J0335p471Q649l970j6044
$$ y = [-32743, -21688, -15221, -12792, -13823, -14031, -1154, 17459, 5212, -3706, -1109, 14217, 18410, 14825, 8168, -4559, -4110, 7229, 6443, -5689, -6108, 544, 2295, -7044, -5104, -13697, -12497, -19502, -22107, -13081, -14439, -4397, 7359, 7667, -2131, -4360, -9713, 1715, 10230, 14606, 168, -17437, -26342, -21628, -7940, -28271, -50229, -34542, -23575, -9540, -18085, 3262, 5154, -16430, -33727, -41150, -36423, -34847, -31065, -21996, 2225, -13178, -30430, -24194, -7070, -611, 13943, 2922, 8443, 13826, -457, -5341, -24954, -12986, 8101, 25660, 24699, 19943, 4309, 323, -8321, -12991, -2849, 3739, 10121, 4956, -16631, -27331, -32754, -39591, -34459, -31474, -33133, -28310, -2027, -4266, 10968, 5508, 9075, 15337, -16878, -4809, 5526, -1945, 6704, 2734, -13310]
16952a3310L425N567N903K811M427p276m824r105J699j921j4395k981K207P541
16938b0232l917j038K954M726j3336J6884L052J3077N661J957q413j2339P400
16925c564j471M283K1600J3079l7251k1918O956K4290m222q692Q935l625j6656
16912a8256J512J1457l442r683Q553J3530k8219J207L01j8J2026J2216j1503L488
16898f831P987k0543K230R985M931L170r348o428J4992N188l776k4217mJ0717
16884a1947K0389J752k505O425L436R15o791l214J0418o235m307R478p043k5528
16870a4757j2488Q972J3729P155k211R572J0693N325j389j9550j0542P791K467
16857D767j2326K824J0483N059Q373p263k8733j1697p901J9894n900M650Q324
$$ y = [-13310, -9885, -4318, 1585, 4396, 8823, 1547, -3277, -12382, -10683, -12604, -26999, -29980, -27773, -20232, -24149, -25187, -22233, -17507, -30843, -13959, -10907, 2170, 7831, 9788, 1375, -10964, -3564, -5035, -752, 20848, 33927, -3324, -25242, -18286, 6004, 1782, -6910, 2025, -1600, -18256, -16744, -5287, -8729, -18412, -9859, 3671, -24548, -23341, -23040, -23058, -11032, 1184, -10319, -6831, 1156, -19387, -17157, -7172, -2241, 929, -8419, -14847, 145, 5333, 1557, -22660, -22664, -11947, 8442, 10194, 7689, 14114, 17550, 18465, 11674, 8460, 18878, 12643, 8336, 17814, 10771, -14757, -27245, -18273, -4544, 2611, 400, 9972, 20665, 25990, 24601, 5051, -5491, 2300, 4767, -7559, -4735, 5748, 10807, 19180, 11917, -16816, -28513, -36414, -16520, -22420, -17770, -9446]
16844i446l84R861o300N910o638k176K098M620l32k4092j6975O873K1690M143
16830a1148p0l582n416K36N548J494n653P312J2849l686n67p327J1200L413q90
16815C713r630j730N438J825j3369p552K3399K7186L189o002J383j9932L649M804
16801A6371n928R37N399j957N114J5678J428J0734j4136j6117j0779q129M42m92
16787a435k250j2389p408O499J0352J2508j2055p211J1317J5962O171m703M283
16774A9641j0978j1351J7670o52K341K333O569m452L569K011N894p893m81N021
16760B9242j7741j8227l658k545M885L179J0820N226j6824r582N527p937n06K2767
16746D626J5987P711j3968j0165k7402j7776J835K1105R698j4630j1155N520J6292
$$ y = [-9446, -9830, 31, -6269, -359, -6997, -9173, -7075, -2455, -2787, -26879, -43854, -36981, -15291, -11148, -11218, -14800, -20216, -19980, -14432, -12938, -18591, -11279, 1570, -2116, -2683, -10010, 1190, 4603, 3713, -5917, -7647, -2209, -384, -13753, -21305, 2094, 29280, 32469, 26467, 27850, 7918, 11567, 16371, 10443, 11380, 16779, 14822, 19936, 35614, 37042, 47776, 33640, 17523, 6744, -1385, -943, -1435, -3685, -16074, -23482, -16983, -6631, 5877, -6178, -13389, -2072, 13890, 20061, 15358, 19641, 8663, -2688, 14982, 14330, 16671, 19004, 25573, 21121, 24690, 26701, 32595, 24702, 24221, 29242, 11501, -6726, -10384, -12929, -8044, -4865, 5955, 11181, -5643, -15225, -9698, -17635, -18141, 4626, 20613, 28324, 14356, 4191, -23211, -40987, -39152, -18047, -8349, -22979, -34134, -28614, -12322]
16733a2322J0503r674j4450o049J9898J0398l752n690Q266j2305J963j3185Q892
16720a7507R583M78m889J2454J8958k4199j2246p596K0651R449q537j5642k0853
16707c9896r637L054J1749K1061M816Q269R915j947K010M151O675L815P250m276
16693B7009p853l402k1661k0032J2737K7288Q430J6515p482j6937r781l454j1394
16680a0017j7934k3205j1822J8664K9745J2463j4704j213J7430j0150N010J3960
16668H227N519j3813J387R202k8340K0695J3175K806j04r409l999j0379l0543
16655c5576p652J1171J0768J0383J8399R833m653j6599P220M481j2267r452M43
16642a3501K479N369J8118r815j6818j2427j485M001m107R182L730q966P771J272
$$ y = [-12322, -1819, -11493, -25943, -31992, -12094, -1696, -5448, -11138, -2872, -15177, -13214, -26399, -17507, -7924, -7446, -12335, 119, 19077, -5122, -17368, -24964, -4313, 5136, -3401, -19043, -39896, -49533, -46479, -34730, -13669, -8853, -584, 9331, 7384, 9394, 13545, 20220, 24035, 31285, 27009, 19156, 15754, -5907, -25939, -13202, 14086, 22516, 39031, 31549, 14612, 4831, 1377, -10017, -27951, -51156, -62978, -44314, -14569, -2106, -16810, -18023, -593, -10743, -5733, 8227, 13746, -67, 1320, 10522, -17818, 2877, 16052, 18858, 18754, 9345, 5346, -5033, -35576, -43228, -32057, -21289, -10906, 7493, 17326, 12673, -3926, 3294, 7775, -4492, -13944, -13501, -11022, -5653, 12465, 2650, -14168, -26595, -28080, -24079, -28186, -19004, -15274, -24240, -16469, -15197]
16628a5197J734r33J029j779j856L599p705l271K274N22j0897k731n271J3324
16614b7158R789J0635j511j5731o173j189K1008J9017k2552j8551O656J6103O742
16601b915R267L089q06J0068j97m847J300Q976j5109j5614j4087J7136J6066j5386
16587c059j0764l241N929K7024M557J959k766r237J1855j3557j6250N584q74j4894
16573a7734m978N069m609k53p806J0797J4638k797M127j312R310J5840j4818j7884
16559a2410j1190j0144J8263J2232n876M162j0222j655L086J5737l508O383q435
16546c577L445q48j0306L70O0o664n687O204J4479J1625L654m484J7048j696k1533
16531B090j5577J0602K2981q289L140j775j0675M777l859j0778Q390O127k267
$$ y = [-15197, -13463, -14396, -13367, -15146, -17002, -13403, -21108, -24379, -22105, -21583, -32480, -35211, -40482, -27158, -17369, -6734, -8245, -23976, -30149, -31338, -10330, 8687, -13865, -32416, -25760, -9657, -2915, 6352, 9441, 8635, 18703, 18506, 13659, 14959, 23935, 8826, -6788, -20875, -3739, 12327, -3059, -13823, -17064, -11135, 15889, 20446, 22405, 19639, 10402, 22257, 8700, -7550, -1966, -2840, -17734, -22712, -17643, -22252, -22505, -30311, -19514, -4876, -7673, -3546, -4858, 4452, 20292, 5474, -12410, -23600, -33744, -15481, -3249, -9125, -4963, -15185, -16840, -13754, 1983, -1525, 4858, -3577, -132, -980, -11286, -10916, -10856, -17520, -23207, -17003, -2524, 9101, 12755, 8271, 25319, 23623, 2090, -13487, -2885, 20096, 11807, 14947, 13172, 2497, 7274, 3415, -7363, 1027, 7154, 4887]
16518D887K2046o812o433K410K326J2391j5208o873k694L482k2108k1912q112
16505d2610L1817K78j380l025M440J1114l337r525K138K9451l186k0407r699j5995
16491b9926R094Q917M692q206O381J1148P729R314n766j2083j9299J050J2208
16478d747o104j3206o580K0135J545K268r607k2807J023N477j493K1540J4152
16465A596J3424P649p165k5055L779J0861J9475J025r245l964L24n305l071N008
16451I336J5419M707r841m247L618K676j4065k305k4315p787k891k918n001n676
16437d3290Q984J0662j3519p921O34q140K7898J9387J1077M563j4347o269o763
16424a7044J2322k555q29j5169m675q123J2586l164p692J9528k04j419J7313N520
$$ y = [4887, 26933, 20121, 13688, 16098, 18424, 30815, 15607, 8734, 6040, 9522, -12586, -34498, -42610, -10793, -10515, -11895, -14920, -10480, 634, -2703, -12228, -10090, 19361, 16175, -4232, -13931, -29926, -20832, -11915, -7223, -15429, -9048, 2100, 9829, 19143, 13377, 1294, -18005, -16955, -4747, -10851, -24057, -30637, -10502, -8957, -6689, -16296, -39103, -38080, -32603, -34096, -12556, 1596, 15020, 22669, 15504, -9551, -5772, 5089, 24564, 25589, 16344, 12380, 12704, 7399, 4328, 9336, 24755, 29462, 19621, 15374, 18992, 21668, 7603, 5298, -19017, -26804, -29695, -32613, -37614, -43290, -34306, -23644, -37163, -45084, -44450, -52590, -24692, -5305, 5772, 10335, -4012, -10281, -17044, -4722, -7277, -8106, -23275, -27950, -36073, -23487, -26651, -34343, -14815, -15019, -16438, 875, 6395]
16410F395j97Qj2442j1406p438J1459O121o361m770l744N949m269n302N936J3289
16395f772l109q39Q642j0399M967J8799m002n401J896R64J3661K1920r689j3943
16381A6695k0109L414j8829L414J2321K2599j6820j3296N11Q843m666n739l135
16368a4797L546q047o510R997L0233N544O204o317k8674j2564K9162p228k5945
16355b5396o048J1801k132o574M480p100M919l188O90N044P911J4008j288k1140
16341b4013k2199j394J2664J2448J3639K6488k636r893j2466j7070m704J8291
16329a0845K2434Q174j53j7338kR374n928L030k19j2588r051J2544K98R497j30
16314I097j9675r556J0985J1249N508j3889l779j3025j0473N176J3269k53j8097
$$ y = [6395, 6198, 6206, -6236, -17642, -25080, -13621, -7500, -13861, -18631, -22375, -16426, -20695, -25997, -20061, -6772, -9881, -10720, -2078, -12477, -7510, 11289, 7287, 1886, 3782, 4746, 18407, 40327, 30638, 16695, -3414, 0, -18829, -15415, -3094, 19505, 2685, -10611, -10100, -1257, -5923, -11662, -14797, -11251, -19298, -25808, -15811, 14422, 19966, 26170, 19853, -8821, -21385, 7777, 549, -25396, -31444, -19643, -21775, -28349, -23869, -30969, -26050, -29238, -28548, -23504, -15593, -1585, -2873, -24013, -46212, -47606, -34942, -22494, -8855, 17633, 14997, 5104, -7362, -24432, -29136, -10845, 11589, 19763, 19610, 2272, 2270, 11644, 5716, 8746, 8527, -4061, -13112, -568, -270, 9227, 9097, -10578, -20134, -9149, 2100, 7608, -6281, -10060, -23085, -33558, -28382, -15113, -15366, -33463]
16301c3463m476l221K385J5753K623P567J700Q491J423K59j4376j9188J2165Q750
16287a3608J8937l634q696O388j837J864m51P167j2916j0320n656J8934J1229
16274G401O950Q104j8518j0806J034O813M714q71r787l093J3541p516j6973k319
16260b1326k312N637K578j0174M928J7644M412p394k375k3163M138j0262K501
16247c5168J0077K3495k297n403P779m057k0707Q531m526J277J4247O566j4461
16234a4647K632J2138j8048k972J9063J5731J264j0699P060J47j2124m742J0616
16221E419m550k875n682o809J6245j8619k0780M549J4862j519l217Q126P449M481
16207b920j1611m270J0091o454J602J5810l646J4840q367p44l389M934J18j0305
$$ y = [-33463, -37939, -41160, -38775, -23022, -20399, -12832, -11132, -2641, -1218, -959, -15335, -34523, -22358, -13608, 5329, 1695, -7001, -613, -2450, -586, -1037, 6130, -6786, -17106, -22762, -3828, 7401, 14351, 22455, 3937, -6869, -5835, 978, 5692, 4821, -4966, -8059, 5482, -2034, -19007, -21326, -23638, -18001, -15423, -25597, -20669, -3025, 1387, -6007, -8382, -31545, -27407, -37669, -35168, -25091, -1596, -3893, -9296, -1517, -5574, -26281, -17750, -22276, -20999, -6752, -186, -14647, -12015, 123, -17925, -20897, -1834, 13897, 15161, 4462, 11522, 11669, -455, -5197, 5419, 869, -2006, -7688, -14497, 1748, -16871, -37651, -33102, -18240, -19759, -22976, -14850, -7401, -2920, -14531, -18801, -8710, -15164, -13562, 2248, -1398, 13442, 5075, 4331, 942, 5876, 5994, -4311]
16193d311N328L872j4647o739J8041Q048j3377k1394j0235J1061O011M434J5154
16180A246L915k3777j0795J4360R275k165P22K320M633q405p528R873R958p096
16166c464J971k798N74p685k1345J501K789Q094J1192q144j4738j3857J6482M64
16152b8964p193J8566j581j638Q990K241J1373J1143j9095L711J7916o844l3409
16139b4784R151J1183p216M444Q270j54p734j3248L380M673k7101j3119Q612J1758
16125c1885K2807k72j5752K428p274j8350Q825J4680K844j9219k070K5004J8841
16112F07l990j1006M348j2049k112k777K3323K7020p047j9512L043r520R512J5141
16098A4981l706q882j6856j8466K0005J4291N304k944q338N235l717j5585j5610
$$ y = [-4311, 1017, 4889, -9758, -16497, 1544, 9592, -3785, -25179, -35414, -24353, -18342, -13908, 1246, 5161, -18616, -29411, -15051, -5776, -7941, -7219, -4899, -266, -8671, -16199, -6326, 3632, -3464, -1493, -4291, -3717, -11402, -32747, -31246, -28457, -20363, -9171, -17315, -32053, -45910, -29428, -28964, -36157, -17591, -19172, -20810, -11820, -9579, 1794, 12937, -6158, -2447, 15469, 8625, -24784, -15633, -4450, -11666, -7222, 1048, 894, -6840, -20088, -16708, -12035, -39136, -52255, -43643, -31885, -9078, -9350, -25102, -22674, -29948, -48298, -39473, -24793, -21949, -41168, -43238, -18234, 607, -3383, -14389, -10041, -22090, -24202, -26979, -3656, 23364, 16317, -3195, -152, -9672, -160, 14981, 11275, 2393, -14463, -32929, -12924, 1367, 6671, 3727, -4611, 624, -3093, -18678, -34288]
16085c4288o83n555N592K2483L1427m660l448q698j4611P918q914K697J014M194
16071e532J8812o75k2625j4458j900Q446J4443l422o547O578J2827P108k0819
16058g764j6466n310K2857j755j2806p115R947J6683P362J353l17K000j3672k656
16044g659l196k231q522n038j343L279O30j4239L523J1335j7271j6838L436J3278
16030d0856J3411L4047P133n105j7240k4061j0627J0972R691J2037j1095j3276
16018c4969L248J2242P381J408m26n382M407o40J1867k0020o633N173L694J8592
16004e8J2968O631k526j8117K360O421m894k2226j0848O744Q970J4855n80k3955
15990b4255l946q283J9508Q561k0064J8983k859j3761L827l45R407l112j2908
$$ y = [-34288, -34971, -40526, -34934, -12451, 18976, 14316, 10868, 2170, -12441, -4523, -13437, -10740, -9726, -5532, 13280, 12605, -10020, -24478, -26378, -17932, -3489, -6911, -13458, -6880, 5947, 13055, -7764, -24230, -29540, -6683, -8438, -21244, -28359, -18412, -1729, 5633, 6986, 6669, 8669, -5003, -7659, -10855, -13086, -21608, -26646, -27989, -24710, -24080, -38319, -34796, -23461, -40732, -57570, -54134, -40856, -27445, 6602, 13735, 8630, -8610, -32671, -43298, -32326, -22635, -10598, -21693, -34969, -31721, -19479, -12098, -10690, -11116, -16498, -12091, -12731, -864, -20884, -27517, -22344, -18650, -58, 12910, 19541, 17015, -1102, 1258, 7679, 2785, -19441, -30289, -23545, -14575, 280, -300, -24255, -28201, -36484, -16976, -8415, -28479, -9496, -12355, -26116, -22289, -22634, -13227, -16339, -29247]
15977b9247N868m814N39J049K988q04M426Q347J556Q257r116k527m10O355m932
15962a2465j7845O810R551j3826k6518P647J6796J4487K1943L867j0279O33l423
15949b622l425P317j2558O991J529j8488q49l688j3526p214J5550R301Q510L052
15935a0120j2940j4596J7570J1297l603m493k622Q375P691N001p701q232j1634
15922b6007J2626J3524j1541j2521L570J191r689J7539J5181R269k022k460n644
15909C016n932J0127m238R209M498r412n897O664J2471j8204j5371j668Q191m307
15895a0853j6650k865q646j067K1360J8647J3465K809j1455j3483m532l921N589
15882a1602k689O843q543j4499O496K0472O187Q972r975p875J7658R51n329l589
$$ y = [-29247, -23379, -28193, -27654, -26605, -23617, -24421, -19995, -11648, -10092, -1835, -10951, -13478, -13888, -7533, -12465, -30310, -23500, -13949, -27775, -54293, -46646, -29850, -15363, 6580, 10447, 168, 801, -2622, -6047, 1270, -11288, -4297, -2768, -21256, -22105, -25793, -39319, -46533, -30983, -21682, -13172, -10120, -23060, -37656, -20086, -8789, -12392, -16885, -19507, -11132, -3441, 1560, -6141, -14373, -26007, -13381, 143, -11398, -23919, -20349, -19158, -28847, -11308, 3873, 13142, 11120, 8660, 3016, -2916, 7211, 2973, 12182, 16680, 7268, 1371, 8035, 20506, 2302, -13069, -14737, -6546, -10853, -27503, -30368, -39014, -40081, -18721, -74, 13391, 16200, 4745, -8738, -13270, -17191, -11602, -14291, -7448, -15991, -30490, -23994, -3522, 2665, 11637, 1662, -6213, 11445, 12396, 7067, 3478]
15868C478N45j1324K849N616L149j877j1520j878P549N494O729j3693M146J6277
15854A5540K306j9756o923r436r061n953J3782L82J1007Q714K521m880j1075K026
15840a0806J2456K4126N795j0506O508L567n909j8013p741Q279k603j4827P3J4484
15826D883Q840o98n918q072o970j171j3972L058P352Q84n994j4349q225L111J0269
15811b6972J2737j7132k9353j69K6606K9264J0034J361q330O039J297m94j179
15798C709k0066q753K980p519K08P931J0147j2649m872L17Q220M587j351K857
15784a4254j684q966q326J5175j0965q577J2269J9900L3971l656k952j4442j2329
15771d836o662l79J0758J4401k551j1617j8329m549J813m280m998n545J8176J677
$$ y = [3478, 4023, -7301, -4452, 1164, 4313, 2436, -9084, -10962, -3413, 2081, 8810, -4883, -737, 15540, 17846, -1910, -8833, -18269, -27330, -33283, -19501, -19119, -8112, 602, 3123, -1757, -12832, -10806, 1650, 25776, 31571, 21065, 27573, 31140, 25231, 7218, -523, 7756, 5153, -9674, -9601, 4883, 13723, 13025, 7107, -965, -7935, -9106, -23078, -20020, -12668, -11784, -17778, -32127, -40352, -37241, -26972, -14235, -31367, -60720, -60889, -34283, -5019, 5015, 6376, -1954, 4085, 5382, 4888, 3709, -16357, -25110, -22130, -29649, -29441, -21510, -11363, -24012, -28884, -28567, -20347, -15760, -17111, -14254, -15938, -24904, -33230, -18055, -29020, -37597, -25328, -5428, 28543, 24887, 21935, 7493, -4836, -11498, -11877, -1119, 13282, 10731, -886, -19215, -23764, -21951, -26231, -31229, -36774, -18598, -16921]
15757a6921M183J7569O522o965o723K125p12J2447o125j7680L784j2061P212O164
15743g181k880j5852m406J9335O411k3145o955j826J0633J4913J0191J2531r588
15730B181j4339o608l854N008k245K111l830n067j04P430K19J2589J4008o588
15716I11j3723j6973J244J2049j6033J6349L834j4028j578L582O854j5469k159
15703c5140L701J6801J6471q802J2288O42n035l757n650j4723N381J2088R337
15690C602J0275K745J520r449n231j1160O612j4307Q011J1507k45J0335o352P73
15676H636M786k6555r738R31K878k57L5r090k12N332P566N769j4435j4334n076
15661d3764K532J0723J8253K1538P989j648j0656o601J0356O549r875o967Q081
$$ y = [-16921, -12738, 4831, 11353, 4388, -2335, -210, -922, 11525, 5400, -12280, -8496, -20557, -13345, -7181, -10061, -25913, -30319, -10984, -4573, -27718, -34673, -36499, -25866, -10953, -762, 11769, 2181, -12158, -18766, -22620, -17612, -19857, -17746, -21576, -26643, -26747, -19317, -19098, -6509, 7499, 911, -12812, -29785, -28541, -16492, -32525, -16176, -12342, -26370, -27948, -24366, -17512, -32981, -35140, -31439, -14638, 1833, -6969, 5319, 5961, 926, -2831, -8481, -23204, -17823, -5735, 3602, 13877, 16622, 18142, 8693, 3462, -7698, -1086, -15393, -7382, 4125, 3880, 14215, 7863, 8636, 13422, -13133, -22871, -21940, -19062, -19319, -19284, -28374, -28586, -23254, -15688, -9919, -24354, -38688, -43764, -41232, -30509, -12256, 9282, 17271, 15623, 4967, -1634, 8722, 15271, 5396, -1571, 6510]
15648F510j5665J300j7173P364J5259j4321o875R961J2541j8599r983O609k483
15635b5555J550R92R162j4296M383l007J3586N046j8788L592L685M258K97Q348
15621f747K088j0157N222n798J3013L941K035K0974j187m803j1048o355j3133
15608a1955M979J6115J7796j0202j0676L991j5370J6785M708k069k0083R169J4428
15595A7616p531p417j2509r98O75L899J6992J2105j7848P887N816k096k364p745
15581F482R26k377j668q096j3137P411J3990R83p251j1081o932k167J4752J8175
15567A0010j276K711l687j1874J0925m841j9401j1069j7156J3233J2884J2194
15555g347J2165m30q164j5449l54J3737J7598L889j5166n538L796q441j5939p815
$$ y = [6510, -9155, -7855, -25028, -17664, -2405, -16726, -23601, -13640, -1099, -19698, -29681, -23072, -25555, -24005, -23013, -13851, -28147, -23764, -26771, -13185, -8139, -26927, -23335, -19650, -15392, -15095, -6747, -4659, -14816, -9594, -15392, -2379, 1562, 3597, 24571, 23384, 18581, 7533, 1178, -11955, -6976, 9139, 26935, 16733, 6057, 10048, -5322, 11463, 16171, 14102, -5981, 3188, 17616, 10085, 2668, -9841, -10839, -10164, -6265, 10727, 22832, 4984, 12871, 18687, 16591, 14227, 6482, 7408, 5031, 3363, -4733, -17870, -10459, 3531, 4514, -2737, -13818, -20750, -22917, -8165, 10010, 8734, 11445, 7758, -4116, 6809, 1968, -17433, -28502, -45658, -32425, -19541, -7347, 4818, 4388, -3776, -19225, -19579, -5842, 11756, 15645, 479, -5059, -1263, -9704, -25643, -33458]
15541c3458k679J2876J3083M598Q100k018j0122R963j103j0076p115j684R862
15528i773N333J1154P417K846J1368q174k5405q988P828J1227J2573M060M747
15515B6213o011p060m982L482j8006K562q04M702J0149M745p016p029o584j9358
15501b4997O48J4988p852J3317J3504O549J942L524k1717J0898J855n192q379
15488i12j1893o179J7565k288R39R464O483n991j971k245R198Q018N652l7205
15474a1365j8427J1339J2153J1598J755M582J0975O336k7969r743L513j9672o423
15461c1348R941j580o611Q801m182M658J0005K1438J1656k0871p774l524P364
15448b027N766m538N905n635N468J1442J1414k4706k1808j6872J9346K0963l443
$$ y = [-33458, -36137, -23261, -10178, -5580, 2520, 502, -9620, 343, -760, -10836, -17951, -19635, -9773, -4440, 6714, 14131, 16977, 28345, 20171, -5234, -14222, -6394, 4833, 17406, 21466, 26213, 20202, 13142, 8160, 11642, -6364, -3802, -4606, 96, 10245, 14990, 7974, 945, -5639, -24997, -24349, -9361, -17213, -3896, 9608, 16157, 18099, 21623, -94, 10804, 12659, 7467, -912, -12805, -18984, -1419, -3707, -2768, 6696, 13179, 7188, 5217, 2972, 12170, 20188, 25840, -11365, -29792, -18453, -6300, 5298, 7053, 11635, 22610, 28946, 977, -8766, -5253, -24925, -31348, -21407, -22987, -29598, -20797, -24979, -20321, -10316, 11122, 22778, 1907, -5867, -9391, -2027, 3739, -799, 5106, -529, 4939, 16381, 27795, 3089, -18719, -35591, -16245, 4718, 1275]
15435A275j9073j4926Q192J457j2058l607J3974n943N111r17j62J4170J4955K775
15421E223q736k877p703r729R847j4538N511N838N419J6895q333j5793J1523K2671
15407A5218l031j6842J0981P142p284n308j1896k6666N686j7363P48J7999N414
15394b5202J492K7460M972l472j2501J6760K31j1077R88J5492J653j9515j073
15381c792n310L568l736j3595L010K7557J4976r9j88n025j0508j5097M932J6849
15367A3542J227l219k9376r744J0730n249J3606p06Q822M70j5735k224L827J5354
15353A325J8393K450j5078j0558j6133J1251K2488j9737p332j0758M819J5193
15341c677L026P86o336j3910N476J3577k313m524l778L906r354K006J9261M220
$$ y = [1275, -17798, -32724, -24532, -23075, -35133, -38740, -24766, -30709, -25598, -26515, -26677, -12507, 2448, 5223, -3513, -6390, -14093, -23822, -13975, -28513, -23002, -17164, -11745, 5150, -3183, -18976, -7453, 15218, 12187, -4655, 6326, 13468, 6184, 876, -11020, -37686, -32000, -49363, -48615, -30616, -25202, -23710, 3750, 8722, 5250, -7251, 9509, 9740, -1337, -349, 15143, 16796, -2719, -3792, -9102, -5534, -9270, -22865, -19855, 7702, 22678, 22579, 22391, 17366, 6858, -8239, -3307, 13542, 14769, 11550, -17826, -27570, -16840, -22089, -8483, -9189, -367, 103, -15632, -17856, -14029, 1325, 19718, 22168, 7090, -3468, -19601, -8350, 14138, -5599, -12931, -23689, -18870, -3677, -651, 135, -6201, -20111, -14635, -1058, -3371, -7895, -11673, -7767, -17121, -15115, 4146, 8366]
15327H366q483j0880j320k576P479R125J4181Q394j3757j9036l303J3930O962
15314I082J5302J6672j1668j9395J6386q08j5114j5371l380j216L270L238M042
15301A040K495O605m418o646k0661q390R994K1298K888j9322l350J7332p759n067
15287a3961L687N937j212j049p923j307m382n448k913R455K2132N778j2371K32
15273c345m224J5326k29j9902j4036O055J948J5612k437J188J3792O002m807o666
15259D277K0013o977j8175l831J438N929r013j646J3954j6821j6475J2851J409
15246a3067j420N339k898K0143M005o548k3121o026N63N605J6914r784L730k632
15232i197J2261P112j9078O51J5539K619q895j1265j0044J260M269j6447R384
$$ y = [8366, -117, -10997, -12317, -14893, -7414, 1711, 15892, 24286, 10529, -8507, -11810, 2120, 9082, 24384, 41056, 29388, 9993, 26379, 25571, 10457, -4914, -8294, -9510, -6240, -3002, 1040, 3535, 10140, 5722, -924, -21585, -29975, -19981, 1317, 4205, -15117, -18467, -1135, -8894, -13961, -10274, -4337, -5549, -6598, -14521, -15828, -20210, -25658, -28571, -19116, 3016, 8794, -3577, -3345, -7569, 7757, 7528, -12374, -26410, -20355, -18407, -2795, -5232, -4044, 9748, 15750, 10943, 4277, 24290, 17313, -862, -4693, -3255, 2674, -6339, -7985, 5969, -10852, -27327, -14476, -13067, -14487, -9148, -12046, 8097, 12102, 5554, -17567, -23593, -23030, -17425, -511, -10295, -6565, -9197, 3064, 10176, -8902, -8251, 7288, 9907, 1012, -10253, -20297, -19037, -14768, -31215, -21831]
15219b1831L7121J5252k3847j8251n569J7477J8610J1022j9636j3557J2223J012
15207A0026N820J0552j6077J51p357q759j2890L678j4960j5251o598J4297J0395
15194b6973N651P197L366j784r537J7772P034K000j6q610K486K5860Q56p815k1074
15179c587m064L540J3747l650j514n477k0960N527M016q093k596o711q571J2236
15165b6157Q281K1350J6677j3442j3347N101l074J1538N962l957O447J5344r907
15152B0816n247p171j4837R186L973L080M984j0779J0829N289J988j005J057j1919
15138A0244j1043M25J8000R982j279m09K236p60Q098P424j3J5669J5691J3707
15124H7972J6920p29n555j014o829l812l8084k3261j03J8452M469j3738j9044
$$ y = [-21831, 15290, 30542, 6695, -11556, -17125, 352, 18962, 29984, 10348, -3209, 9014, 10026, 15846, 26398, 10321, 10472, 3115, -5644, -18534, -14856, -29816, -45067, -51665, -37368, -26973, -21322, -14125, -10759, -12543, -22080, -4308, 2726, 4726, 4710, -3900, -1414, 24446, 25302, 17487, -3587, -7651, -4111, 9636, 5986, 4472, -1005, -21965, -16438, -12422, -20515, -23111, -29822, -38393, -26157, -17876, 3474, 20151, 6709, -6638, -1537, -4611, 6927, 12889, 8932, 15379, 30723, 20816, 15569, 8398, -6439, 2747, 6720, 9800, 14784, 4005, 14834, 20123, 22111, 21106, 22163, 10244, -799, -374, 17626, 27608, 26329, 25920, 28156, 27396, 35494, 42918, 42905, 58574, 74265, 87972, 104892, 104163, 98608, 97594, 90765, 86953, 48869, 25608, 25505, 43957, 48426, 34688, 15644]
15111A5644N040m326j4515k2978K168K1406M391l92J9932J8561j5309r113O402
15098B6911j4700j4906Q308P263R64n390j0199k350K786J5753K433j9804j1490
15085a4421O316J3345R083M453r111j4568j1382j240P515N790K536L164L933n592
15071a79O750K944j1067J520J346J0801j0821o654J870q775R675J4110r385j877
15057B58m353q153j1434M253K690j4081o722N190p44K098r76M590K833k202N998
15042b0755J1066N057j705p658n11L698L73J7094n078j751n886j7907j5420j0921
15028e0304K591M665L5527K1215j387K721Q066n959K655o74J2695J047j4051j9207
15014d00M258j4350J3931J5136J0603p911o227n547n883m197o428j0013r354P535
$$ y = [15644, 20684, 16358, 1843, -21135, -18967, 2439, 6830, 6438, 26370, 44931, 29622, 20509, 26911, 12211, -2695, 5613, 12876, 13840, 8450, -1749, -4099, -1313, 14440, 16873, -2931, -14421, -8105, 5240, 14323, 18776, 9665, -4903, -16285, -17525, -10010, -4220, -1684, 1480, 5413, -179, 6571, 9515, -1552, -32, 1314, 12115, 1294, -5360, -3490, -12265, -2590, 11520, 2135, 258, -4095, -12248, -23682, -19429, -16739, -30820, -37542, -32352, -33096, -30998, -31974, -27384, -24551, -26753, -20755, -9689, -4632, -6337, -13995, -14506, -10808, -10435, 6659, 1581, -170, -6056, -23963, -39383, -50304, -47713, -43048, -7521, 13694, 12307, 15028, 23094, 17135, 19790, 19116, 31811, 32858, 18807, -400, 3858, -10492, 3439, 18575, 29178, 21267, 15040, 9493, 3610, -587, -7015, -17028, -26382, -18847]
15000a8847J2735m83J3920M582n495m818j5074q351m645J698K1979J8946Q091
14987B4238K728j893j0971q258k3566M406j04j0006n299q585K8989o084K1206
14974F801p310j1717P371n348o579J7368P8j4925J52p609p348q197J9889L774
14960a3600M73J546J364k3925p871K1501J8970K856M150J4124j2143l928p491
14947c974r069Q950r049J3321J4363j8850N584J1847O0j5513k4879j1756L607
14934c5358J8989J934K3849r303l141R000K4857P702j5785j2798r953q147q582
14921a6736O627M034O135J947J078n775K3127r410p57k0251k1167L1221J4316
14908A4389k922j3451q65K138q435N54K2185J830n409j7356j3161J4463N33r492
$$ y = [-18847, -6112, -6595, 7325, 11907, 6412, 1594, -13480, -21831, -26476, -24778, -2799, 16147, 24238, 26966, 25073, 14102, 5844, -17722, -13316, -13420, -23426, -28725, -37310, -8321, -14405, 6801, -509, -12226, -4855, -10203, -16782, 586, 664, -14261, -14109, -21718, -29066, -37263, -17374, -13600, -13127, -11581, -10217, -34142, -42013, -20512, -1542, 1314, 5464, 19588, 7445, 3517, -3974, -13043, -4093, -13142, 179, 14542, -4308, 1276, 13123, 13183, -2330, -27209, -38965, -35358, -16369, -14435, 9414, 111, -3030, 5970, 30827, 38529, 22744, 9946, -7, -8154, -16736, -10109, -6075, 60, 2007, 3085, -2690, 20437, 11027, 10270, -9981, -31148, 73, 14389, 11467, -1984, -2849, -711, -9146, -8592, 13593, 15423, 10014, -7342, -20503, -6040, -5507, -14999]
14894a4999o311M448R916N017O221P713M935K1239J1404r060j4056n595R783K0103
14880E0758L1940K0121p635J2356k0289j3564n977j7053j9169j5400J0015M117
14868C0220q755Q137k1437j3496j896K3323J688j306L803j0147j228j4339p481
14855a2914J376J7825r23K943j5093n174R689p585j008M894j2585J1133M716J4131
14841A1425L909o430j1313j6007O354K12N379p362O847k685K359k3475r279J3780
14827b6286R626R639K4084J7455m739k5474l4775j2968K586K233K3770K715j2135
14814b4269J7324K029r434J7189Q817M333q428N089O522K186m047J7224O072j6191
14800B4416o536l281j8003j1340K4813J2731p130q250j1387J1992q05j3633k7169
$$ y = [-14999, -21310, -16862, -6946, -1929, 4292, 12005, 16940, 38179, 49583, 40523, 26467, 20872, 30655, 50758, 82698, 102819, 95184, 107540, 87251, 73687, 67710, 50657, 31488, 16088, 26103, 30220, 21465, 29602, 8165, -5331, -7227, 16096, 17784, 16478, 20281, 10134, 8906, -5433, -12914, -11538, 6287, 5364, 8307, -6786, -11960, -2271, -9856, -10864, -5970, -18555, -7422, -2706, 11425, 15334, 8904, -2409, -18416, -12062, -11850, -6471, -13833, -6986, -9671, -7312, -30787, -40066, -26286, -16660, -7021, 17063, 34518, 29779, 4305, -30470, -43438, -40852, -38619, -14849, -12134, -24269, -6945, -4916, -14350, 2839, 11656, 15989, 7561, 12650, 19172, 21358, 17311, 34535, 40607, 24416, 17880, 14599, -3404, -14744, 10069, 22800, 15670, 7420, -3967, 8025, 7220, -6413, -33582]
14787c3582N419K0678L970l654j3803j2632N009J2185o994j7511j7638K5085K5270
14774h198J2161M587q020j6281o985J4737o93J0654r784k9317m499K5101J3270
14761c267j5765p463J6895K0811K0342p519k521o799k4832k4610M581J0690k6214
14748d5671N69p771M173K4299J3592k26m54o204r772Q370J5868L747j0410j6069
14734b5959J6478j2509o237J0628K2998J0888j8698p805J059K0614K358j193O810
14721A9432k3278k508n962l012J4432N896R193Q344j8261o260K0727K838k5889
14708d308j0784R449K6317j399k831k592p936n311m254M589o978k909J6089J636
14694H778J572o272p850j0456k452J8796K3075m774j1797j4347l71K0484J9457
$$ y = [-33582, -28163, -7485, -3515, -7169, -20972, -33604, -28595, -16410, -23404, -40915, -58553, -33468, -8198, 3963, 8550, 530, -15751, -22736, -7999, -8692, 1962, -7822, -37139, -41638, -16537, -3267, -19032, -26495, -9600, 11211, 31553, 24034, 21513, 14714, -10118, -34728, -30147, -19457, -45671, -45102, -52873, -48700, -24401, -10809, -11035, -11489, -17693, -27465, -19095, -3227, 520, -9890, -25959, -9481, -21990, -28227, -17599, 5399, 16287, -2411, -10216, -9157, 11457, 13815, 12622, 19432, -3846, -6354, -12316, -15328, -896, 5000, 14193, 22537, 4276, -1984, 18743, 21581, -4308, -15092, -5643, 20674, 19275, 16444, 13852, 5916, 605, -3649, 940, -6038, -8947, 7142, 8778, 10350, 4078, -3772, -14228, -16680, 2116, 25191, 20417, 8620, -5727, -6098, 14386, 33843]
14681C3843J22j4872j9562m611J1772j2641j8723M301k392M286J4352J8864k568
14668A2171k723J1392k3176M85Q73Q458J2236n044p539j3273r036r869Q672J7316
14654I43J0182r75P040j9424k375J5627n031j0914Q350j0079J840l316j3518P444
14640a4206M305Q650J9426j2106n483K557O449J1841J0914j0281k6247N50J0868
14627G237K413Q60P79m721m114k2411r12O866L556p44R461P869o973k5435j3450
14612c9719J5779n277p69J1068Q534l423Q930R740r479M011j937j4187Q216Q947
14598D34o290m689m153N778r282J537J129M446L260l121l05J1201J5517M911j6947
14583C426j4312l787m713p080m209J5867N411l25P506J687J0638k9436n153j300
$$ y = [33843, 33965, 19093, -469, -5080, 6692, -5949, -24672, -20371, -22763, -18477, -4125, 14739, 12171, 9448, 20840, -2336, -1851, -978, 7480, 19716, 14672, 7133, -6140, -15176, -25045, -16373, 943, 11125, 10150, 17190, -2234, -4609, 11018, 5987, -4927, 3423, -6656, -4816, -8132, -21650, -14206, -9901, -1251, 18175, 6069, 586, 3143, 9592, 21433, 32347, 22066, -4181, -3631, 7237, 9650, 10510, 11289, 6568, 2454, -19957, -20869, -14003, -10447, -11191, -1730, 6139, -834, -26269, -39719, -23940, -29217, -29986, -18918, -10384, -13807, -4877, 4863, -4616, -605, -2542, -16729, -8513, 434, -5856, -10545, -14698, -8920, -18202, -16665, -15536, -11090, -7830, -10951, -11256, -55, 15462, 20373, 3426, -10886, -14673, -19386, -26466, -30675, -14808, -9397, -9722, -2216, -529, 10109, -19327, -24480, -25780]
14569b5780R929K8090J6195l693k0058j9353k904Q756l820J3354Q615p65R939
14556A8505o260r939K098k623j1019q392J5123J3300k4457j8580j0090k578K1384
14543b3528P591K648L921N877j2616J4933R644K0265j7628l2199L133K22O631
14530a1106M435r239n26P603J6145J4230j479q377q215p31k6036n668j211n397
14516c5572M551J1934o22j2792K5045P701j2162O188L483J3726j1056j5260K500
14503a2336J1807j6184p245J3798J0132Q324J2874M059K874K934J0576O977k7640
14490B0950q220j36j8660r013M902K905J215j448j6166r506J1262J5459p290j5677
14476b9423j4310m684K0117K5639Q497k0035n484L422k361J1122j112J1394J630
$$ y = [-25780, -15851, 12239, 28434, 24741, 4683, -14670, -17574, -8818, -12638, 716, 9331, 8566, 18505, 12245, 2306, 4404, 1781, -9238, -17630, -2507, 10793, -13664, -32244, -42334, -44912, -23528, -15937, -13289, -9368, -3491, -16107, -1174, 8470, 28735, 11107, -21092, -17959, -17737, -11106, -6671, -15910, -16436, -8833, 7312, 21542, 20063, 11686, 3471, 2740, -23296, -28964, -30175, -35572, -31021, -19087, -19709, -32501, -7456, 245, -11917, -5729, -2246, 11480, 424, -14836, -12336, -529, -16713, -23958, -10160, -28, 8296, 21170, 25229, 28103, 31037, 41613, 48590, 20950, 12730, 12594, -6066, -15079, -10177, -7272, -6057, -7505, -23671, -33177, -21915, -6456, -13746, -29423, -43733, -48417, -28300, -2661, 5836, -14199, -19683, -16261, -18622, -7500, -8612, 2782, 4412]
14463D412k0608o400O290l167j237M192R496n603J302J2828J7374n680j5723o78
14449c202L775q778K60R669p108n889Q050J793j6197R725J9229J4629k543j6149
14435G264r941r564J656J3992K993o847k231q739M784k674k278K4683M229M913
14421B2240j3823j4301K762O46j1259n00R38J180q632n348J5805J36K473O410
14407a273j3916j678J077J4294m304k7047o559N921J061J7037Q992J9154n141
14394G618l325m036o845p644M217j0731k8205k194L3275J2238m982k793K444Q452
14380b511J6736P043p822j9522j00p962j056J0635M268j1500l2548P442J4146
14367b2751j0229R284J0192m371K038O542r94j2789o797J026L478O825l120J6925
$$ y = [4412, -16196, -22596, -16306, -19473, -20710, -16518, -7022, -12625, -11323, 1505, 18879, 13199, -2524, -3202, 573, -8205, -7945, 1724, -5384, -11273, -3223, -1430, -17627, -7902, 11327, 25956, 23413, 7264, -2677, -12241, -10585, 3407, 6400, -447, -2678, -11417, -6633, -9307, -11585, 13098, 17327, 22240, 8417, -5884, -3122, -2476, -13735, -14235, -13297, -12117, -20749, -26097, -10292, -10156, -7683, -1273, -15189, -16867, -15790, -1496, -5800, -32847, -39406, -33485, -32424, -15387, -6395, 12759, 7618, 4293, 257, -6588, -14232, -10015, -20746, -48951, -51145, -17870, -5632, -10614, -13407, -10963, -2511, 14225, 21268, 13446, -6076, -6176, -14138, -15194, -4559, -291, -11791, -44339, -36897, -22751, -32980, -23696, -13504, -17875, -15837, -9295, -10289, -23078, -29875, -28849, -25371, -18546, -21666, -4741]
14353d741Q378j2355k678N576j0013j7385J1070Q649l85M123J0569j1374L296
14340g270O196j5183L701N22L646R46n023m245M432J0314j0922j6921R37J4766
14326a4104J4362L623Q388j1540j872k624L793Q650J2970j8592q345J14r11j3409
14312a9497M198M292J1796O611P173p804j6792L924k031N155J2908P261M885J13
14298B2192j0562q830l073p03j957j4641J2202N79j5728k861J1625R415k747M408
14284f81m732N235j566J52J7967M643r212q893k611M014K198m505O468J7870n775
14269B0572m654q825j8243j2269P419N597k1084q137K7385K1494q880n752l275
14256h652J0196k1573j0606l995J6481L2142J082k0801q895m666K2518J2803K956
$$ y = [-4741, 3637, -8718, -11396, -5820, -15833, -33218, -22148, -13499, -13884, -9761, 808, -10566, -7270, -1074, -16257, -12556, -12034, -8388, -7442, -12465, -16710, -12278, -1964, -12886, -29807, -28870, -14104, 258, 3881, 12269, 729, -1143, -3767, 26, 8676, 21646, 3054, -5291, -5177, -6088, -19497, -15299, -11007, 789, 7400, 14573, 6769, -10023, -6099, -8130, -2975, 9933, 17194, 22079, 22192, 11630, 2800, -273, -976, -2933, -17574, -5372, -4793, -20521, -23382, -11757, -2342, -5089, -681, -5413, -178, -1744, -1592, 16375, 21018, 11806, 2913, 302, 4316, 6514, 2009, 8477, 26347, 20572, 15918, 7093, -11150, -23419, -16000, -10403, -31487, -39624, -12239, 9255, 375, -5377, -8652, 1544, -20029, -30635, -34630, -18149, 13993, 15075, -5726, -14621, -19287, 3231, 16034, 18990]
14243A8990o070k1487q380k1647J1479J6393n588m761p461J5383J2404J3297j5345
14230b793j21R62r662j5715j5592P468J2404J9930j382j1581J7132K2356l426
14217A9980j9657J3343P28r558l373l774N622n085k0789J398k730N774J1414P07
14203f000O957q789r019R081o28m024L888m937q846j7277m675O572J9593J2081
14189f023P097l408J8366J6395O634j0881j0869j1215k6219r351L254R963p024
14176b3281p415J2007J3004j0375p671K5487j204K728l326n787q028O853N13n949
14162a2444j678j8253k794J0131K0941J0145J4478j1211O838Q367K145p288l992
14149A5385J5675j5800j2660j0174l71R962k257j3112j8052k281J1064J3581r28
$$ y = [18990, 12920, -8567, -16947, -38594, -27115, -10722, -16310, -21071, -28532, -13149, -745, 12552, -2793, -2914, -1952, -11614, -27329, -42921, -35453, -23049, -3119, -4501, -16082, 1050, 23406, 19980, 323, 13666, 14394, 4836, 1463, -2311, 3311, -1774, -22563, -21165, -23895, -18121, -6707, -6000, 957, -7832, -16851, -7770, -8398, -12422, -8534, -13471, -22317, -39594, -44269, -37697, -18104, -6023, 1074, -2334, 16032, 32427, 39061, 28180, 17311, 6096, -20123, -29474, -26220, -16257, -23281, -30696, -18689, -5685, -16060, -23731, 1756, 552, 3280, -46, -5833, -13861, -7008, -6495, -12444, -14122, -32375, -35169, -25038, -4097, 6048, 20526, 9315, 16153, 24520, 26665, 19377, 15385, 31060, 15260, 2600, -7574, -7945, 2017, -240, -13352, -31404, -33685, -22621, -9040, -9968]
14136i968N650M934J984j7334Q637P936r294j2067K803P072K620l463J8167J270
14122H947m439k601J5122K573k4467j3522k72J3684P99l793k666j0196q351K0345
14108h837K3111M72r278j3627L521K339J8992O891j5351j8455j1523J0073j1138
14095b2810J0173J4545k114p506r984o205N813Q260P237m80K1077N114l415j2934
$$ y = [-9968, -4318, 616, 2600, -14734, -6097, 1839, -7455, -19522, -16719, -9647, -7027, -10490, 7677, 8947, 4508, 1907, 17029, 19602, -4865, -18387, -18659, -4975, -4176, -7969, -10635, -20831, -29182, -8837, 14274, 14746, 5468, -8159, -4638, -2299, 16693, 23584, 8233, -10222, -21745, -11672, -22810, -12637, 1908, -206, -7712, -17696, -23901, -18088, -9828, -2591, -3071, 18006, 23120, 19705, 6771]
$$ [...]
##END NTUPLES=NMR SPECTRUM
##END=
