##TITLE=Analysis number 311494
Compound Code spb 08035
Project Code adrs
Chemist Name stores
##JCAMPDX= 6.0         $$ Bruker NMR JCAMP-DX V2.0
##DATA TYPE= NMR SPECTRUM
##DATA CLASS= NTUPLES
##ORIGIN= Bruker BioSpin GmbH
##OWNER= NMR
$$ XWIN-NMR		Version 3.5
$$ Fri Jul  8 12:08:48 2005 GMT Daylight Time (UT+1h)  MAYBRIDGE\NMR@NMR_250MHZ
##.OBSERVE FREQUENCY= 250.131544655141
##.OBSERVE NUCLEUS= ^1H
##.ACQUISITION MODE= SIMULTANEOUS (DQD)
##.ACQUISITION SCHEME= undefined
##.AVERAGES= 16
##.DIGITISER RES= 18
##SPECTROMETER/DATA SYSTEM= dpx250
##.PULSE SEQUENCE= zg30
##.SOLVENT NAME= CDCl3
##.SHIFT REFERENCE= (INTERNAL, CDCl3, 0, 16.522)
##AUDIT TRAIL= $$ (NUMBER, WHEN, WHO, WHERE, WHAT)
$$ ##TITLE= Audit trail, XWIN-NMR		Version 3.5
$$ ##JCAMPDX= 5.01
$$ ##ORIGIN= Bruker BioSpin GmbH
$$ ##OWNER= NMR
$$ C:\u/data/dgb/nmr/ADRS/5540/pdata/1/auditp.txt
$$ ##AUDIT TRAIL=  $$ (NUMBER, WHEN, WHO, WHERE, WHAT)
(   1,<2005-07-08 12:08:28.83 +100>,<MAYBRIDGE\NMR>,<NMR_250MHZ>,
      <created by zg, POWCHK disabled, PULCHK disabled
       configuration hash MD5:
       62 19 C7 07 E1 42 D1 B7 37 6C 3D D0 77 39 F9 E6
       data hash MD5: 64K
       49 DC 2F B7 86 AC 00 AA 39 06 C9 D4 75 72 D5 2D>)
(   2,<2005-07-08 12:08:39.97 +100>,<MAYBRIDGE\NMR>,<NMR_250MHZ>,
      <Start of raw data processing
       ef LB = 0.3 FT_mod = 6 PKNL = 1 SI = 32K 
       data hash MD5: 32K
       6C BE 4B 94 B9 A6 27 B3 C7 13 0B AB 82 41 4D FF>)
(   3,<2005-07-08 12:08:41.96 +100>,<MAYBRIDGE\NMR>,<NMR_250MHZ>,
      <apk 
       data hash MD5: 32K
       8F 92 69 B3 A7 06 8B 16 2E 35 8B 6B 3B AA EE C6>)
(   4,<2005-07-08 12:08:42.71 +100>,<MAYBRIDGE\NMR>,<NMR_250MHZ>,
      <abs ABSG = 5 
       data hash MD5: 32K
       46 17 CB DE 6F 83 DE 3A BF 78 50 2E 66 6A 14 80>)
$$ ##END=
$$ 
$$ hash MD5
$$ 10 4F 6D 0B A1 F7 D1 5E 91 8E 53 3F CD 14 AC 3D
##$RELAX= 
##$RELAX= 
##$RELAX= 
##$RELAX= 
##$RELAX= 
##$RELAX= 
##$RELAX= 
$$ Bruker specific parameters
$$ --------------------------
##$DU= <C:\u>
##$EXPNO= 5540
##$NAME= <ADRS>
##$PROCNO= 1
##$TYPE= <nmr>
##$USER= <dgb>
##$AMP= (0..31)
100 100 100 100 100 100 100 100 100 100 100 100 100 100 100 100 100 100 
100 100 100 100 100 100 100 100 100 100 100 100 100 100 
##$AQSEQ= 0
##$AQ_mod= 3
##$AUNM= <au_zg>
##$AUTOPOS= <24 >
##$BF1= 250.13
##$BF2= 250.13
##$BF3= 250.13
##$BF4= 250.13
##$BF5= 500.13
##$BF6= 500.13
##$BF7= 500.13
##$BF8= 500.13
##$BYTORDA= 1
##$CFDGTYP= 0
##$CFRGTYP= 5
##$CHEMSTR= <none>
##$CNST= (0..31)
1 1 145 1 1 1 1 1 1 1 1 1 1 1 1 1 1 1 1 1 1 1 1 1 1 1 1 1 1 1 1 1 
##$CPDPRG= <>
##$CPDPRG1= <>
##$CPDPRG2= <>
##$CPDPRG3= <>
##$CPDPRG4= <mlev>
##$CPDPRG5= <mlev>
##$CPDPRG6= <mlev>
##$CPDPRG7= <mlev>
##$CPDPRG8= <mlev>
##$CPDPRGB= <>
##$CPDPRGT= <>
##$D= (0..31)
0 1 0 0 0 0 0 0 0 0.06 0 0 0 0 0 0 0.0002 0 0 0 0 0 0 0 0 0 0 0 0 0 0 
0 
##$DATE= 1120820908
##$DBL= (0..7)
120 120 120 120 120 120 120 120 
##$DBP= (0..7)
150 150 150 150 150 150 150 150 
##$DBP07= 0
##$DBPNAM0= <>
##$DBPNAM1= <>
##$DBPNAM2= <>
$$ [...]
##$SUBNAM7= <"">
##$SUBNAM8= <"">
##$SUBNAM9= <"">
##$SW= 20.6930455092707
##$SWIBOX= (0..15)
0 0 3 0 0 0 0 0 0 0 0 0 0 0 0 0 
##$SW_h= 5175.983436853
##$TD= 65536
##$TD0= 1
##$TE= 295.16
##$TE2= 300
##$TE3= 300
##$TEG= 300
##$TL= (0..7)
0 120 120 120 120 120 120 120 
##$TP= (0..7)
150 150 150 150 150 150 150 150 
##$TP07= 0
##$TPNAME0= <>
##$TPNAME1= <>
##$TPNAME2= <>
##$TPNAME3= <>
##$TPNAME4= <>
##$TPNAME5= <>
##$TPNAME6= <>
##$TPNAME7= <>
##$TPOAL= (0..7)
0.5 0.5 0.5 0.5 0.5 0.5 0.5 0.5 
##$TPOFFS= (0..7)
0 0 0 0 0 0 0 0 
##$TUNHIN= 0
##$TUNHOUT= 0
##$TUNXOUT= 0
##$USERA1= <user>
##$USERA2= <user>
##$USERA3= <user>
##$USERA4= <user>
##$USERA5= <user>
##$V9= 5
##$VALIST= <valist>
##$VCLIST= <CCCCCCCCCCCCCCC>
##$VD= 0
##$VDLIST= <DDDDDDDDDDDDDDD>
##$VPLIST= <PPPPPPPPPPPPPPP>
##$VTLIST= <TTTTTTTTTTTTTTT>
##$WBST= 1024
##$WBSW= 4
##$XGAIN= (0..3)
0 0 0 0 
##$XL= 0
##$YL= 0
##$YMAX_a= 649583
##$YMIN_a= -612227
##$ZGOPTNS= <>
##$ZL1= 120
##$ZL2= 120
##$ZL3= 120
##$ZL4= 120
##$ABSF1= 16.522
##$ABSF2= -4.171173
##$ABSG= 5
##$ABSL= 3
##$ALPHA= 0
##$AQORDER= 0
##$ASSFAC= 0
##$ASSFACI= 0
##$ASSFACX= 0
##$ASSWID= 0
##$AUNMP= <proc_1d>
##$AZFE= 0.1
##$AZFW= 0.1
##$BCFW= 0
##$BC_mod= 0
##$BYTORDP= 0
##$COROFFS= 0
##$CY= 12.5
##$DATMOD= 1
##$DC= 0
##$DFILT= <>
##$DTYPP= 0
##$F1P= 14.0000005364418
##$F2P= -0.99999901652339
##$FCOR= 0.5
##$FTSIZE= 32768
##$FT_mod= 6
##$GAMMA= 0
##$GB= 0
##$INTBC= 1
##$INTSCL= 1
##$ISEN= 128
##$LB= 0.3
##$LEV0= 0
##$LPBIN= 0
##$MAXI= 10000
##$MC2= 0
##$MEAN= 0
##$ME_mod= 0
##$MI= 0
##$NCOEF= 0
##$NC_proc= -2
##$NLEV= 6
##$NOISF1= 0
##$NOISF2= 0
##$NSP= 0
##$NTH_PI= 0
##$NZP= 0
##$OFFSET= 16.522
##$PC= 1
##$PHC0= 126.3316
##$PHC1= 4.496627
##$PH_mod= 1
##$PKNL= yes
##$PPARMOD= 0
##$PSCAL= 4
##$PSIGN= 0
##$REVERSE= no
##$SF= 250.13
##$SI= 32768
##$SIGF1= 0
##$SIGF2= 0
##$SINO= 400
##$SIOLD= 32768
##$SREGLST= <1H.CDCl3>
##$SSB= 0
##$STSI= 32768
##$STSR= 0
##$SW_p= 5175.98343685301
##$SYMM= 0
##$S_DEV= 0
##$TDeff= 65536
##$TDoff= 0
##$TI= <Analysis number 999999
Compound Code 99
Book Reference 9
Project Code 9>
##$TILT= no
##$TM1= 0
##$TM2= 0
##$TOPLEV= 0
##$USERP1= <user>
##$USERP2= <user>
##$USERP3= <user>
##$USERP4= <user>
##$USERP5= <user>
##$WDW= 1
##$XDIM= 32768
##$YMAX_p= 406913640
##$YMIN_p= -20187
$$ End of Bruker specific parameters
$$ ---------------------------------
##NTUPLES= NMR SPECTRUM
##VAR_NAME=  FREQUENCY,     SPECTRUM/REAL,   SPECTRUM/IMAG
##SYMBOL=    X,             R,               I
##VAR_TYPE=  INDEPENDENT,   DEPENDENT,       DEPENDENT
##VAR_FORM=  AFFN,          ASDF,            ASDF
##VAR_DIM=   32768,         32768,           32768
##UNITS=     HZ,            ARBITRARY UNITS, ARBITRARY UNITS
##FACTOR=    0.157963299565203, 1,           1
##FIRST=     4132.6476996994, 0,             0
##LAST=      -1043.33573715361, 0,           0
##MIN=       -1043.33573715361, -20187,      0
##MAX=       4132.6476996994, 406913640,     0
$$ Real data points
##PAGE= N=1
##DATA TABLE= (X++(R..R)), XYDATA
$$ [...]
16519A4912j553j417o4j32j250O80Q99o99o75Kj289J131L87j473k279r49M37j421
16501E247J65r52O13j775j611n07Q04K506J32R10m64j369k387n11L89O3N06k231
16483d72r72R13l12j328M54m11P46L40N10J387k01j716M90l57q31j042j23M92
16465b433N14q26M62P80k001j626J673K117Q13p69j064o76j845M0N79J447r5N49
16447b361P19r18o48m5k1m14J113N82M71J245r78o5o78Q52K97J68j639M83j76
16428b013M72N93J12r54k082n03J216L62J370J427L12j378j08J029j7j028j24
16411a314m57J080P32Q18l54J61n76q91j0J520j77m18Q10K2m90m25M85K71k451
16392a664j885N90N65J233n99L84J611L62L47J621j051j484q65p28k41p06k171
$$ y = [14912, 13359, 11942, 11878, 11746, 10496, 11176, 12075, 11376, 10701, 10703, 9414, 10545, 10932, 9459, 7180, 6231, 6668, 5247, 5412, 4460, 5073, 3298, 1687, 1180, 1984, 4490, 4622, 5532, 5068, 3699, 1312, 801, 1190, 1253, 1759, -472, -1444, -531, -843, -2171, -1717, -2128, -1382, -1042, -532, 855, 654, -1062, -572, -929, -1760, -2802, -2925, -2433, -1919, -2745, -2283, -1503, -3504, -5130, -3457, -1340, -527, -1296, -2360, -3036, -4881, -4841, -4262, -2815, -2910, -2361, -1642, -2560, -3208, -3253, -3274, -3688, -2575, -1993, -1522, -277, -1255, -1320, -1998, -1146, -849, -681, -2320, -1837, -2013, -1541, -948, -836, -1790, -3872, -4375, -3159, -2797, -1427, 0, 312, -1066, -1174, -145, -162, -1190, -1314, -1771, -691, 41, 859, 505, 666, 90, -801, -811, 709, 532, 114, 924, 946, 456, 31, 516, 787, -1664, -3549, -2959, -2394, -1161, -1760, -1376, 235, 597, 944, 2565, 1514, 30, -835, -1563, -1804, -2510, -4681]
16375d681k84M85K316J663K38J53p22l20P28n63j886R29j63j40l6L52J22K53P13
16356h43p03m95j306k6O23Q75p18K238Q69j366N13M92J06l97q93n66m7J090J090
16337E36K76j337Q26J05k66j808j074J156J390K8J300j261o34l9J474p63k640
16320b731j909J291N18J534p23k35K10L72Q36j110J51j48m03r19R8L10o69j346
16302d873K20R7J567K862R41j069j110n76q71o94J137R98Q77Q28j356r42K76r69
16284b657J98n82m01J299J391o18o93M12k11J49M67P94R4n29J680j272K31r83
16266a231j631p45J498J42p55J558J23r68j252j33R88O77J59r20J261J495o88
16249d22k613j345P38J747q60q75P05L01K9R25O24m75l19p66p14O30l35J314J767
$$ y = [-4681, -4965, -4480, -2164, -501, -263, -110, -832, -1152, -424, -987, -2873, -1944, -2107, -2247, -2283, -1931, -1809, -1556, -843, -1546, -2041, -3347, -3373, -2750, -1875, -2593, -355, 514, -852, -339, 153, 259, -138, -1031, -1597, -1644, -554, 536, 812, -525, 301, 406, 140, -1668, -2742, -1586, -196, -168, 1132, -129, -763, -802, 672, -91, -2731, -4640, -3349, -2831, -1297, -2020, -2255, -2045, -1673, -837, -1947, -1796, -1944, -2347, -3266, -3168, -2858, -3527, -4873, -4653, -4556, -2989, -127, 814, -255, -1365, -1941, -2812, -3506, -2369, -1371, -494, 334, -1022, -1964, -1688, -2657, -2459, -3041, -3442, -2143, -752, -1370, -2063, -1651, -1862, -1713, -1246, -452, -358, -887, 793, -479, -248, -1231, -2862, -3607, -2109, -1967, -2722, -1164, -1041, -2009, -3261, -3394, -2406, -1729, -1570, -2490, -1229, 266, -422, -3035, -4380, -3642, -1895, -2755, -3630, -2925, -2624, -2595, -1670, -1046, -1521, -1840, -2606, -3320, -2690, -3025, -1711, 56]
16230E6j164j690q18O29J591M77m23J26m11k67m55N43J240j30j460L1M23J524
16212a78O70j114l48p9m17q36M03J3O01j95j33J187R69j8k74N76l25l003k589
16193e090l88K455J769P56m92r43J366N94N0j764j936m31O54R7J352q56m63M62
16175b808K44j739K55J600J083q56n32o7P69p1l77Q62M24j494j312Q73K428P52
16157C4J12L90n79j506N56j94j028L16K77o14j73m91n4L14J052J89K014O01J127
16138B343j047n56q0k317k124n92M14M11p97p88Q47J437o45j636J496M19j270
16121d485K41J147J41J045J963L19k54n80q97o88q24m5o74p2K042J299N84j263
16103a001k000r80L19N27j999M82J088j235M19K161L58n69K006L69J604m52j012
$$ y = [56, -1108, -2798, -3616, -2987, -1396, -919, -1342, -1216, -1627, -1894, -2349, -1806, -566, -696, -2156, -2125, -1702, -178, 492, -622, -970, -1049, -1466, -2302, -1899, -1886, -1285, -1480, -1613, -426, 543, 525, 251, 827, 502, -2501, -5090, -5478, -3023, -1254, -498, -990, -1933, -567, 27, 77, -1687, -3623, -4054, -3400, -3303, -1951, -2807, -3270, -2808, -2564, -4303, -4048, -2448, -1365, -2221, -2753, -2820, -2051, -2122, -2499, -1637, -1213, -2707, -4019, -3146, -718, 34, 146, 536, -43, -1549, -993, -1187, -2215, -1899, -1622, -2236, -2409, -2900, -2954, -2640, -1588, -1399, 615, 1216, 2343, 1296, 740, 660, -1657, -3781, -4373, -3959, -3548, -4345, -5133, -4286, -2849, -3494, -5130, -3634, -3215, -4485, -4244, -3097, -2956, -1911, 52, 371, 117, -463, -1360, -2048, -2872, -2917, -3591, -3663, -1621, -322, 262, -1001, -3001, -3981, -3662, -3135, -5134, -4652, -3564, -4799, -4380, -2219, -1861, -2430, -424, -55, 1549, 1097, 85]
16086H5q77j209J975O10n3j857j334P77p57j85N73k40l26n78j154J17J319N06
16068b608l25N18L38P53k229k624P28K683j134j94J102n38k061p04O65O88m08
16051e350NK17N26R89R55n04j469p23j030r67K71P09R0P46J148R76J280J093M67
16032e71J77k852j867r8J331J248j045m82N45q55l91M47m05O95k48m87P49J903
16014b206J01j620n80M78Q0Q63o6o40K0J550L81l63l97r22j153P71n57K98Q30
15995c132M97J977R59p63K08j206K04l71j318l04o44k68O96k96J192n87q94N36
15977c514Q65P44n00j7j56n58M24N45P39j836j192m46K32J645J559m53r55K885
15959A1J269j767j615P61M66n62j569q41J354M97k14o90k51O2K13J94j04N33J377
$$ y = [85, -792, -2001, -26, 584, 531, -1326, -2660, -1883, -2640, -2825, -2252, -2492, -2818, -3396, -4550, -4433, -3114, -2608, -2933, -2415, -2077, -1324, -3553, -6177, -5449, -2766, -3900, -4094, -2992, -3530, -5591, -6295, -5630, -4942, -5350, -5345, -5128, -4602, -3613, -2658, -3162, -4631, -5354, -6384, -7351, -7080, -6371, -6281, -5535, -4387, -3411, -2131, -1038, -571, -394, -3246, -5113, -5211, -3880, -2632, -3677, -4159, -3614, -4469, -4860, -4413, -4818, -4123, -4371, -4858, -4109, -2206, -2105, -3725, -4305, -3827, -3747, -2884, -2950, -3590, -3570, -2020, -1639, -2002, -2399, -3321, -4474, -3703, -4260, -3962, -3132, -2635, -658, 301, -462, -254, -1460, -1256, -1627, -2945, -3249, -3893, -4161, -3465, -3761, -2569, -3156, -4050, -3514, -2649, -1905, -2405, -2422, -2578, -3136, -2712, -2167, -1428, -3264, -4456, -4902, -4670, -3025, -1466, -1919, -2874, 11, 1280, -487, -2102, -1341, -875, -1437, -3006, -3847, -2493, -1996, -2210, -2900, -3151, -3089, -2876, -2682, -2786, -2253, -876]
15940h76K12n78N1q15q58o95P96J555K85M94j316j167l28J255l74O56K47n56j714
15921c726K34J284M20k33P24j466q03K01R37J020o72J189O1j186o22p72r37m60
15903d807N61J010J607M28k013p08M44P15j3L10p39k490p30J199K099J269P35
15886a123J551k832j648n2J881R0N05L71R12K340K78p11k113n93p47k74R62l68
15868a571m72p65j7K901K057k499k238p74k75J155J104q94O25o82L35P42J987
15851G19J48k643o7N58o11p97j471m58K347J151k8n39j600M58O70J236k860k900
15833f687J209J544J431o64j884j107Q13J160J167l6n80j123p9K342Q85K55k40
15816a594k857o13K506o99O93J120n01j335R03n59J056Q90K80k95J071m57o86
$$ y = [-876, -664, -1242, -1191, -2006, -2864, -3559, -2763, -1208, -923, -429, -1745, -2912, -3240, -1985, -2359, -1703, -1456, -2012, -3726, -3492, -2208, -1788, -2021, -1297, -2763, -3566, -3365, -2428, -1408, -2080, -891, -830, -2016, -2638, -3410, -4347, -4807, -4246, -3236, -1629, -1201, -3214, -3922, -3478, -2763, -2776, -2466, -3205, -5695, -6425, -5226, -3127, -1858, -1123, 428, -2404, -4052, -4104, -2223, -2133, -1628, -1257, -345, 1995, 2273, 1562, -551, -1144, -1891, -2165, -1203, -1571, -2043, -2808, -2825, 76, 2133, -366, -2604, -3378, -3653, -2498, -1394, -2288, -1663, -2345, -2010, -1268, 719, 867, -1776, -1843, -1285, -1896, -2693, -4164, -4622, -2275, -1124, -1152, -1691, -3291, -2833, -2163, -927, -3787, -6687, -5478, -3934, -2503, -3167, -5051, -6158, -5345, -4185, -3018, -3054, -3634, -4757, -4836, -2494, -1609, -1354, -1594, -4451, -5064, -2558, -3257, -2564, -1444, -1945, -3280, -2377, -2936, -1880, -990, -710, -1005, 66, -391, -1077]
15799a077n08Q61j065j774L34M65n86o06J117j48Q82J606o20m70R69r77l96P83
15781a210J73j939j092L07j737K21K352k29m30j20J037O04M70m18j303j734j286
15764f334J928K627J467p74j340j559J09J003J92Q0R6k279l45J094N22L26J143
15747b044p09p92n0k1J467o2j680o64N11R14O3J026r21j187l11O46Q31Q97j098
15728c184j709J198K138J23j300r10J98J105n78O9r75N02n44n60j83m13K28R05
15710c890J486m00j448j304p22j23N40Q19M81J715J355L68o97l80j683j230o23
15693e736O75o66J426K078o78o61R60J422R9m33j571K371J512j377j614r09k66
15676c368M35j01n32p7Q97M44J071N31k47k67r86M00R11k17j17Q96m84n17j421
$$ y = [-1077, -1585, -724, -1789, -3563, -3229, -2764, -3350, -3956, -2839, -2987, -2105, -499, -1119, -1589, -620, -1597, -1993, -1210, -1037, -2976, -4068, -3761, -5498, -5277, -2925, -3154, -3584, -3704, -2667, -2063, -1593, -2011, -3314, -5048, -6334, -4406, -1779, -312, -1086, -2426, -3985, -3876, -2873, -2681, -2601, -2505, -4784, -5129, -4035, -3513, -3187, -2044, -2753, -3545, -3595, -3616, -2149, -2211, -3891, -4555, -4044, -3130, -3067, -2041, -2962, -4149, -4460, -3814, -2983, -2086, -3184, -4893, -3695, -1557, -1434, -2734, -3644, -3446, -2341, -2919, -2850, -3825, -3323, -3867, -4427, -4610, -5023, -4795, -3890, -2404, -2804, -4252, -5556, -6278, -6401, -5861, -5042, -4561, -2846, -1491, -1123, -1820, -2200, -3883, -5113, -5736, -5061, -5727, -4301, -2223, -2901, -3562, -2602, -1180, -1081, -1514, -3085, -714, 798, -579, -2193, -3102, -3368, -2933, -3034, -3566, -3643, -2746, -2302, -1231, -700, -947, -1214, -2200, -1800, -889, -1106, -1223, -327, -811, -1328, -2749]
15657b749j626m24J817K473M59r78l70N32K8j210j828L99m68j078R13J821K98
15640a991j413m10M3K82M01P69j795j323oK403O19q58M64m08m66J648J193p37
15622a585m1J742J275j279r14L27J24j460r85O07R88J27J035j142l334q23J242
15605d096K07o61J296P85J038o1p03j61O96P1n21q97N3j420l69n84J202J947J528
15586f50q95j090N9r1j26O75P87j060r3j51N14M46q60J61R6j198j055l01J325
15567c507K365n90k175k99J005n42M25M07q64l75P4j411J32j52R87J380j397n29
15549e066q32j577J062J397L37J474J870p43j391J40P21J020J96m57l31k663k336
15532g179m83L61J569K087l5M29P69k8P69r60j856j865j229J85N17o26N5Q71J500
$$ y = [-2749, -4375, -4799, -2982, -509, -50, -1028, -1398, -866, -838, -2048, -3876, -3477, -3945, -5023, -4110, -2289, -1991, -3404, -3814, -3771, -3489, -3088, -2319, -4114, -5437, -5443, -3040, -2421, -3279, -2815, -3223, -3689, -2041, -848, -1585, -1626, 116, 1391, 112, -802, -475, -351, -1811, -2796, -2189, -1201, -1074, -39, -1181, -4515, -5338, -4096, -3889, -4550, -3254, -2469, -1431, -1492, -2195, -2356, -1660, -1589, -2110, -3007, -2954, -4374, -4743, -5327, -4125, -2178, -650, -1545, -2635, -2576, -2667, -2793, -2118, -1331, -2391, -2484, -2635, -2121, -1675, -2535, -2374, -2278, -3476, -4531, -4832, -3507, -1142, -1732, -3907, -4206, -3201, -3743, -3318, -2911, -3775, -4150, -4076, -5487, -5355, -5507, -4520, -3140, -4537, -5066, -5898, -7475, -6413, -5016, -4679, -3205, -1335, -2078, -3469, -3329, -2608, -1588, -1392, -1849, -2180, -4843, -7179, -7662, -7301, -5732, -3645, -3680, -3251, -2482, -2510, -1741, -2701, -4557, -6422, -7651, -7466, -6949, -7575, -7520, -6649, -5149]
15513e149K432O11r04q76N20n8j946q37O61M01R60J589O98J81J84p01j221l64
15495c819n0M42N61k79n8j88m09M13K30m84m33L7J349r5p80j197P38N30L64J230
15475a898P3j997Q08J652j175m35j660N6P12j252j300K074J540o19j40K02j693
15458e052j44J562J282Q25j24L20K342j8p20p51o06j647r61j047N58K431%j752
15440c502p45L95N82R64j134N96J118J074L46o56J70j967n34K97k93q5J196R76
15422a202o74O84J208j897j985N8J760j99j026q9Q84J135j9j555M13N73k177m70
15404d578Q32Q34k23m49j446j616p71j11P44K317R57M76J163J26r46N93R58q4
15386a224N02o12j177k108Q60m41kL33J289J033k10l51J25k029l013j60N87p4
$$ y = [-5149, -2717, -2106, -3010, -3886, -3366, -3424, -5370, -6207, -5546, -5145, -4185, -2596, -1898, -1717, -1533, -2234, -3455, -3819, -3869, -3427, -2866, -3145, -3203, -3391, -3800, -3387, -3157, -3641, -4074, -4037, -2688, -2783, -3563, -4760, -4022, -3492, -3128, -1898, -1825, -3822, -3014, -1362, -2537, -2972, -4632, -4576, -3864, -5116, -6416, -4342, -2802, -3421, -3561, -3359, -5052, -5196, -3634, -2352, -1527, -1651, -1331, 1011, 993, 273, -478, -1084, -2731, -3692, -4739, -4181, -1750, -1750, -3502, -4247, -3852, -3270, -2306, -3440, -2844, -1726, -652, -306, -962, -792, -2759, -3293, -2996, -3289, -3374, -2178, -1202, -1876, -1192, 16, -1881, -3866, -3808, -2048, -2247, -3273, -3362, -2478, -1343, -1362, -2917, -2504, -1931, -4108, -4578, -3746, -2912, -3135, -3584, -5030, -6646, -7417, -7528, -6784, -4467, -3510, -3034, -1871, -1745, -2691, -2098, -1140, -1224, -722, -1334, -2511, -4619, -3759, -4200, -4202, -3869, -2580, -1547, -1757, -2108, -1983, -4012, -7025, -7185, -6598, -6672]
15368f672K148J310J091J54k02J03j641j32K87j014n88j25j54J474l6J254R30
15351a813p91q42J49Q47p27p44q03n94n11oM69J890K628N00k146j350m24K95J389
15332b584J487K48j2m02m10j320q02J064r1j350N9K288r37j732J247o56r43r6
15314d942J7J544K794J219N13L40j175o93l29n6l28J92j010j478r00N85n64N54
15296c717J264j96J11J738J466J91n72p8n10j406N73O76j414j362Q54J306J113
15279C7l12O27N86j878K00N70q99j300l13J39Q34J699r06k425r13P31K60r05j1
15260d179K399N20N4k80oj460j874n48j075R69L09o0K088p00m34L17n11N19j93
15241d145j96J033K139m45r30o77J027o02p60J17J15l21R0j105l40j4k68J198
$$ y = [-6672, -4524, -3214, -2123, -1969, -2171, -2068, -3709, -3841, -3554, -4568, -5156, -5281, -5435, -3961, -3997, -2743, -1813, -2604, -3446, -3297, -2450, -3177, -3921, -4724, -5318, -5829, -5835, -5366, -3476, -848, -348, -2494, -3844, -4268, -3973, -2584, -1097, -849, -861, -1263, -1673, -2993, -3795, -2731, -2822, -4172, -4113, -1825, -2762, -4494, -3247, -3903, -4846, -4942, -4925, -3381, -587, 632, 1145, 1485, 310, -383, -712, -768, -1096, -904, -1914, -3392, -4292, -3707, -4271, -3717, -2453, -2649, -2538, -800, 666, 857, 285, 207, -303, -1709, -1136, -460, -1874, -3236, -2382, -1076, 37, -275, 352, 938, -940, -740, -170, -1069, -2369, -2682, -2543, -1709, -10, -916, -3341, -4254, -3523, -3263, -4168, -4179, -1780, -1260, -1206, -1486, -1492, -2952, -4826, -5374, -6449, -5480, -5171, -5231, -3143, -3843, -4277, -3960, -4471, -3952, -4145, -4341, -3308, -1169, -1614, -2544, -3221, -2194, -2796, -3556, -3439, -3324, -3645, -3555, -4660, -5000, -5014, -5282, -4084]
15223d084J626p73j523Q9J89j22J643O63p74K05q51l99Q64P94k298j202R84n5
15205e024j028n02K806L96N97J223P21O24k38M48j646j765o10O79j83m05J03O16
15187c188M98Q01Q22p4j062k13O47j439j79J129J455p72l00N17n09L99N11k29
15169a186O26l19Q2l51k42r28J6J182K157N53o33Q82k419j835J058J77j218P8
15151b320O46k86O17J732J13L57p59p98j41j037J374Q46J562j455J36k00j22L76
15133F41O28n64q84J297j015j923j876J515J581P69p74Q20J942k79r4m71j659
15116c46L84j150P54q4j035L10J031K31k024j750l49k44q60J480r98J47J316R09
15098b278q21L59k59j5L21l73L26m69K07O80j849q91J739j510J39R2r60P27K05
$$ y = [-4084, -2458, -3231, -4754, -4665, -4476, -4598, -2955, -2292, -3066, -2861, -3712, -4111, -3247, -2453, -4751, -5953, -4969, -5024, -6052, -6554, -3748, -3352, -2755, -1532, -811, -187, -425, 23, -1623, -3388, -3998, -3319, -3502, -3907, -3804, -3188, -2690, -1889, -1067, -1141, -2203, -2416, -1769, -3208, -3387, -2258, -803, -1575, -1875, -1358, -1867, -1468, -957, -1186, -560, -879, -797, -1148, -1390, -2318, -2302, -1120, 1037, 1590, 957, 1839, -580, -2415, -1357, -1180, -2398, -2320, -1674, -1960, -1343, 389, 502, 859, 100, -698, -839, -1876, -502, 344, 1906, 451, 587, 387, 265, 641, 1269, 705, -179, 1118, 103, -1820, -3696, -2181, -600, 169, -605, 215, 2157, 1878, 1784, 1313, -346, 38, -1112, -358, -442, -1477, -1167, -136, 95, -1929, -3679, -4028, -4272, -5132, -3652, -4650, -4503, -3187, -2278, -3099, -2740, -2999, -3014, -2693, -3066, -2740, -3209, -3002, -2322, -4171, -5062, -3323, -4833, -4694, -4602, -5562, -4835, -4630]
15079d630r21q90r15Q88Q29K94L43M54j32K8m42P47P43p74J588J096k48n26J994
15060d74O18j190j869L47O55L2J953m0K31j312K81j552j748J339j103K71J595
15043a966L90j95R00j782j676j66O71r64n71J828Q74j018n77M13N53j8j44K210
15025a238K95j889n08N60l75N60O80k27K523o1j575O79k14J85j48J154M91ML98
15006A294P23l30l48r6J350J934m48k310j157J337m81j102l11P89j52r27J274
14989A039J850L08j647j317j178J69Q42j034j139Q7o68j298O07o42j300J337J034
14972b950J43q72L5J015J031K21K00k03j203L16J294O04o75O43R32M08p8j116
14954b55K12N87j89p40N40k01k222n20J838J729J20k681j180M21K958J418j831
$$ y = [-4630, -5551, -6441, -7356, -6468, -5639, -5345, -5002, -4548, -4680, -4652, -5094, -4347, -3604, -4378, -2790, -1694, -1942, -2468, -474, 144, -1046, -2915, -2568, -1913, -1881, 72, 32, 263, -1049, -768, -2320, -4068, -2729, -3832, -3561, -1966, -1576, -1771, -871, -2653, -4329, -4495, -3824, -4788, -5359, -3531, -2657, -3675, -4252, -3839, -3286, -3304, -3448, -1238, -943, -2832, -3340, -2780, -3155, -2595, -1915, -2142, 381, 320, -1255, -576, -790, -605, -753, 401, 892, 896, 1294, 2017, 1687, 1339, 1243, 2593, 4527, 4079, 1769, 612, 1949, 1468, 366, 55, 844, 692, -235, 1039, 2889, 3197, 1550, 233, -945, -776, 66, -968, -2107, -2020, -2688, -3986, -3379, -4021, -5321, -3984, -2950, -2807, -3679, -3644, -2629, -1598, -1377, -1177, -1380, -2583, -2267, -973, -369, -1044, -401, 531, 939, 861, -255, -43, 544, 355, -385, 155, -46, -2268, -2788, -950, 779, 899, -1782, -2962, -2541, 417, 1835, 4]
14937Dk157l53l95P43Q71J464M23P97n64k259r39K73R60q81j760j514j11K296
14919c102J721O07J265k86M67k598k55m12l595l57K094J267n31o17K040J8j054
14902c328r18j120N92K352J628O23p94k248P57M04Q74k74j897j154n46l14R67
14885d396K298M60j486P5J192r18n72P89N39p53K50j209k84K04J18R70r21J413
14867b231J00M45J346M4j584j146n42j376j384K718J951N55L9M39O90L31r71j536
14849b112k463J007j057L08r38p12P11P23l31K3J31P95l69M14N37K33Q17P66J882
14830C65K93j549n43j947k609L83k67L33K091J064J66Q50n98j271j084J017M27
14813b879j583n65K299L50J39O7P71n41J974J096R78J55m25p80p54j05J41o90
$$ y = [4, -2153, -2506, -2901, -2158, -1287, 177, 600, 1397, 833, -1426, -2365, -2092, -1132, -2013, -3773, -5287, -5398, -3102, -1381, -774, 491, 205, 672, -1926, -2181, -2593, -6188, -6545, -4451, -3184, -3715, -4332, -2292, -2274, -3328, -4246, -5366, -4774, -2422, -794, -171, -965, -3213, -2456, -2052, -1178, -1452, -3349, -4503, -5049, -5363, -4396, -2098, -1638, -3124, -3049, -1857, -2775, -3347, -2558, -2019, -2772, -2522, -3731, -4015, -3811, -3693, -2723, -3644, -2231, -2131, -1686, -340, -296, -1880, -3026, -3568, -4944, -6328, -3610, -1659, -1104, -1065, -626, 64, 395, -576, -2112, -4575, -3568, -4625, -4317, -5255, -5967, -5256, -4533, -4864, -4841, -4710, -3915, -4284, -3870, -3333, -3100, -2283, -1517, 365, 658, -891, -1434, -3381, -5990, -5607, -5874, -5541, -3450, -2386, -2220, -1370, -1968, -3239, -4323, -3306, -2879, -4462, -5027, -2728, -2378, -2239, -2172, -1401, -1942, 32, 1128, 2106, 2261, 1836, 1056, 302, 197, 338, -352]
14795c52l254P92Q83J741J136K93q28r30r8j651J498J425L01j407o22J682j67
14778D42k469n63m80J382K120J570k17L17l64j909j201n3j185L00o10J22J455
14761a343M28j127j808L11M31j347Q99Q16l41l23n43M59K4r36p0J066L04J00K121
14742h79J724r45n27o01j640j807P21j30o81j91J014M68J70o15R92N67j160K1
14724c499J643J071P23j063l60Q19m86L53K60J291Q92j389j909j210JJ269l34
14707a928O3j641K87J030k63K51J279P05m27j637j138R13j169R78J785j030N64
14690a378j91j03l44j084n57R7J15K908J232j29j865j270J99q36N70Q55k55J598
14672d38r55l82J158l80m43q58j770J329Q44r8J39P47O49j81j374m21Q14R42n49
$$ y = [-352, -3606, -2814, -1931, -190, 946, 1239, 411, -519, -617, -2268, -770, 655, 956, -451, -1073, 609, 442, -2027, -2590, -3070, -1688, 432, 2002, 1785, 2102, 1738, -171, -1372, -1425, -2610, -2310, -2920, -2798, -1343, -915, -2042, -3850, -3539, -3108, -4455, -3556, -2740, -3081, -3404, -3947, -3488, -3464, -4400, -4470, -3404, -3100, -3000, -879, 845, -100, -627, -1228, -2868, -4675, -3954, -4084, -4765, -4956, -3942, -3474, -3304, -3919, -2927, -2360, -3520, -3499, -1856, -785, -62, -1125, -1485, -666, -1152, -799, -539, 752, 1644, 255, -1654, -2864, -2863, -1594, -1928, -1865, -3506, -3219, -2189, -2452, -2201, -922, -217, -644, -2281, -3419, -2506, -3675, -2697, -912, -1942, -1378, -1569, -1672, -2016, -3100, -3657, -3560, -3445, -537, 695, 566, -1299, -2569, -2370, -3206, -2636, -1781, -2036, -438, -1393, -1775, -617, -997, -1440, -2298, -4068, -2739, -1895, -1993, -1854, -1107, -458, -639, -2013, -2434, -1620, -678, -1227]
14653a227q51L26j204j405J427M91J88l01J413j262j502o63J108J69q6J758K81
14636a340O88N15J257k213j612K43j28n94n37k04o42L59J708Q19j89J056j277
14619b091o31j42j664K52R28J468J366L24p96j048J590o21j057o11K21L67p7o24
14601b846q05O28L75n98J05L5Q20m64L51n10j69k97J557N9M65M33n32M15p8o97
14581a753k506J447K130N64j244l16j012P45j18Q68q41r89K31o94K07o44K34O87
14563c004Q10l00K78J35k50M64j193J024R96j39O04N76l6l00j231M42N86J063
14545E25j441k043j79r95N85R34O50R71j179l02j103j627P46J938J076m08M91
14528a361k05O79p25j668p48J92o40K15L84J410J393r1q87N08q63p56J220j66
$$ y = [-1227, -2078, -1752, -2956, -4361, -2934, -2443, -2255, -2556, -1143, -2405, -3907, -4570, -3462, -3293, -3379, -1621, -1340, -652, -137, 1120, -1093, -2705, -2462, -2590, -3184, -3721, -3925, -4567, -4208, -2500, -1681, -1870, -814, -2091, -2722, -2864, -4528, -4276, -3348, -1880, -514, -190, -986, -2034, -444, -1065, -2122, -2733, -2512, -2145, -2222, -2846, -3651, -3023, -2648, -3246, -3141, -3106, -2286, -2750, -2399, -2909, -3078, -3375, -1818, -1759, -1294, -861, -1393, -978, -1056, -1753, -4259, -2812, -682, -118, -1362, -1678, -2690, -1945, -2063, -1195, -2036, -3025, -2794, -3488, -3281, -3925, -3691, -3004, -2194, -2494, -2216, -2081, -2331, -1867, -3060, -2036, -1040, -1179, -575, 1, -35, -335, -1566, -1124, -538, 525, -916, -2959, -3138, -4133, -3548, -2614, -1964, -993, -2172, -2474, -3577, -5204, -4458, -2520, -1444, -1852, -1361, -1566, -887, -1612, -3280, -4028, -3836, -4476, -4261, -3877, -2467, -1074, -1165, -2052, -1544, -2407, -3163, -1943, -2109]
14510b109j618J135J228m82p62j90o8J33K43m24k34j159l86l25nO53j555J12K90
14491e523J328K369Q59q02o18o31J376r36n6Q22K954R79r89p04K23j60Q94J014
14473B399k756J575Q32j685n38j82m66M85j724r90j43R00K86J555o7R1K32j042
14455a238j395k00J385M69R82l50p94j02n14J72K184j003p05j082o92k6J721J221
14437C3o94j328j200R74R37k800k125J758K555O13m55K354q00k068j6L93l10J66
14419b013L73k85q69j458L46K097Q05j228j774k04J420J007j026K38J832J88m69
14402a020j243n17K15n95j202L43L09l78K04J425K94m94N02j90J39K281R05K67
14384A245K99j13J557r19j613m12j460L58J326p3j365k599Q16J117k61r3K83J015
$$ y = [-2109, -3727, -2592, -1364, -1846, -2608, -2798, -2866, -2733, -2490, -2914, -3148, -4307, -4693, -5018, -5023, -4370, -5925, -5813, -5523, -4195, -1826, -967, -1769, -2387, -3018, -1642, -2578, -2634, -1812, 1142, 2121, 1132, 428, 651, 491, 1385, 2399, -357, 1218, 2050, 365, -173, -355, -821, -336, -2060, -3050, -3193, -2293, -2007, -452, -519, -428, -196, -1238, -2633, -2833, -1448, -979, 3, -347, -1141, -1243, -1757, -1585, 599, -404, -1109, -2191, -2883, -2909, -1188, 33, -661, -1989, -3189, -2215, -1278, -4078, -6203, -4445, -1890, -1277, -1732, 622, -178, -2246, -2262, -1869, -2179, -2013, -1640, -1925, -2794, -4252, -3906, -1809, -1004, -2232, -4006, -4210, -2790, -1783, -2809, -2571, -739, -551, -1020, -2263, -2780, -2565, -3160, -4362, -4019, -3710, -4088, -3884, -2459, -2165, -2659, -2157, -2347, -2208, 73, 978, 1245, 1544, 1431, 2988, 2069, 456, 44, -1416, -1058, 268, 195, -1170, -3769, -2953, -1836, -2097, -2190, -1907, -892]
14366h92L05N70J59n86j72O25r08r54p92Q32O85p91Q37j227J44K008K72j506P10
14347f81L98q3r77R83R00m33n46l25J71J599N49K24j785j438N5N20o34k64j028
14328b795Q7K10j526Rj329N29k27L36K034l02L69j38j873r82J061N60J790Q71
14310a316j017r00J330J774Q68n75K01Q19R74k45Q89j472j383J13o13k45o72o03
14292b073Q46K541J358p75mo92m18j663j6K61k94n21j375Q85J49k80k00q81J188
14273a964P56j31p52o91L57M80K1p48l9o10P52oN54R70J632K22RK060O88O70k596
14252A634j463j738p50Q81J793N65r25j10j897J370J126j265K121J364j502j432
14236b28n60M32k82J018o60J82l47N07O24q74M8M75K59k678j197J034P61r78J487
$$ y = [-892, -587, -17, 142, -444, -616, 9, -899, -1853, -2645, -1813, -1128, -1919, -1082, -2309, -2165, -157, 115, -1391, -681, -283, -366, -1343, -360, 540, 107, -439, -764, -593, 1006, 1555, 1779, -6, -1444, -1389, -869, -1503, -1767, -2795, -2708, -2498, -4024, -4015, -5344, -4815, -5042, -4706, -2672, -2974, -2605, -2743, -4616, -5598, -4537, -3977, -2187, -1316, -2333, -3233, -1903, -129, 739, 164, 365, 1184, 2158, 1913, 2802, 1330, -53, 60, -553, -798, -1470, -2073, -1227, 1314, 2672, 1897, 1893, 1201, 783, -880, -896, -635, -929, -1450, -2825, -1940, -1791, -2071, -2271, -3152, -1964, -1208, -1339, -2091, -2782, -2425, -1945, -1924, -2672, -2711, -3321, -2569, -2575, -2021, -1051, 581, 803, 812, 2872, 3560, 4230, 1634, 171, -1567, -2317, -1436, 357, 922, -3, -113, -2010, -640, 486, -779, 1342, 2706, 1204, -228, -788, -356, -638, 380, -280, -98, -445, 62, 686, -188, -140, 335, 594, -2084, -3281, -2247, -1486, -2464, -977]
14217i77P88j858j35j55J041j550j095J794J724M61j751k089P16J720j88M8q30
14200b336k57q76N50K566K250J654m94j344j278n51K10j144P80R40n86r12k102
14183b930p92J947k83O98N45L16Q60k7O15j159M65M11K75n53m68J13N75q11j699
14164a902j85J252k66qm43N31J851J297O81n66Rn00j368n78l59J882J6o01O32
14145A375j11Q66n84p64Q71j206k05K129K360P84k273j957J11J060L78j003j419
14128D12R81R8p82j197q04Q49K59J000r79M30O64o63j402k60j179K92J103O04
14110e74N42Q89J449L21m43r25j582l94j33l58j567m50K235J443R4j433k32J649
14092E31M86R32M69j174q10J356J199p95j246J580k90K37k088n8O09L2K342J179
$$ y = [-977, -189, -2047, -2182, -2337, -1296, -2846, -3941, -2147, -423, 38, -1713, -3802, -3086, -1366, -1554, -1506, -2336, -2593, -3469, -2919, -353, 1897, 3551, 3057, 1713, 435, -116, 94, -1050, -270, 670, 84, -828, -2930, -3722, -1775, -2058, -1360, -815, -499, 361, 334, 949, -210, 255, 666, 941, 388, -80, 33, 608, -203, -1902, -2087, -835, -1101, -1109, -1552, -1021, 830, 2127, 2808, 2242, 2251, 1751, 383, -195, -554, 1328, 1344, 743, 1375, 1264, 2130, 1546, 782, 1653, 447, 242, 2371, 4731, 5515, 3242, 1285, 1396, 2456, 2834, 1831, 412, 1393, 1491, 709, -488, -1292, -443, -184, 816, -163, 267, 931, 268, -1134, -1394, -2573, -2281, -1178, -574, -32, 857, 2306, 2627, 2184, 1259, -323, -717, -850, -1208, -2775, -3225, -990, 453, 547, -886, -1118, 531, 1017, 1949, 2418, 1244, 434, 1790, 2989, 2194, 948, 2528, 2238, 2475, 387, 329, 938, 970, 3312, 4491]
14074D491j884k432l0j28R13r60j668p22p66M77J142K067o37j183J639Q98k37
14057I80P84L36k17m55Q4J049K73N31L51J06j416o00l25j634j91O8P22J235o3
14038A618l63m93J5N66Q22R91K46r62J79j246r67l37l3J270J613K51J234L57o86
14019D075j559m14q44j749p3L15k16J85Q91N43n17J25j73P98J484M44l96M96j593
14000A822Q70K20J312O18j303j258k384K47O33Q62J667K51L18j43j424j216j677
13983e85R09Q70J94J952N9r76l9J255O5j438k38M82N13R99N67j0j150P82j680
13964B531j564R5J77O11J530j2j875j22K229P06j074k653R46M03q7Q04J29Q10
13946C584J763J27n83j784J345J94q60m92q39O3L43q91J209P64q69L15L92j191
$$ y = [4491, 2607, 175, 145, 17, 930, -30, -1698, -2420, -3186, -2709, -1567, 500, -137, -1320, 319, 1217, 980, 1764, 2100, 1883, 1428, 1512, 2561, 2834, 3365, 3716, 3822, 2406, 1806, 1481, -153, -344, -276, 446, 1681, 1618, 1255, 762, 777, 1343, 2165, 3156, 3402, 2440, 2619, 1373, 406, 69, 36, 1306, 2919, 3170, 4404, 4761, 4075, 2516, 2102, 1258, -491, -564, -249, -465, -280, 611, 1154, 637, 762, 589, 1387, 2871, 3315, 2919, 3415, 1822, 2692, 2912, 4224, 4842, 3539, 2281, -103, 144, 777, 1639, 3306, 3557, 3875, 3732, 2308, 1092, -585, 324, 1194, 1388, 3340, 3399, 2423, 2384, 3639, 3704, 2266, 2028, 2510, 3023, 4022, 4589, 4579, 3429, 4211, 2531, 967, 1062, 1239, 1850, 3380, 3368, 1493, 1371, 3600, 4306, 3232, 579, 1525, 1928, 1841, 2645, 2774, 3584, 5347, 5474, 4891, 3107, 4452, 4646, 3786, 3294, 2455, 2518, 2861, 1970, 3179, 3943, 3074, 3389, 3781, 2590]
13928B590p04l6q5m1Q93N50J123j320l42j163j902p94L137J223N56K134m55j416
13910C948j559J658J497Q83j66k087Ll28L09P04K00K7n38R37J82J86Q4O15o08
13891E947jP7o95K69k251N4J048K41%m81J140R15q35l49NQ45O98R02j138j136
13871E255J42j085J341Q57j925j336K509N86q79j519J111K06Q00J397m21j265
13855E774R43m86J16R75Q63P30J278j701k664o90M47N81K129K162L70j661k429
13838F737J812k35k068O55Q00n33P4J49j413j224R26L310N66r48J343J402l69
13821A0984n96o18MP25k45j621M75K064j4J358m11o29o91K66O32K00J09j90k141
13802I661Q28K048k22P82j928p12J405o46j297n23J312J226k020m78n46o82O59
$$ y = [2590, 1886, 1850, 1765, 1724, 2617, 3167, 4290, 2970, 2628, 1465, -437, -1231, 1906, 3129, 3685, 5819, 5364, 3948, 2389, 4047, 5544, 6427, 6261, 4174, 4177, 3849, 4158, 4862, 5062, 5089, 4551, 5488, 5670, 5856, 5940, 6555, 5947, 5946, 6023, 5328, 5597, 3346, 3400, 4448, 4689, 4689, 4208, 5348, 6263, 5428, 5079, 5084, 5929, 6627, 7529, 6391, 5255, 5397, 4312, 5653, 6510, 4585, 3249, 5758, 6344, 5465, 3946, 5057, 5263, 6063, 7460, 7039, 5774, 6717, 6231, 6347, 7322, 8185, 8915, 10193, 8492, 5828, 5138, 5585, 6166, 8295, 10457, 10827, 9166, 6737, 8549, 8314, 6246, 6901, 7701, 7168, 7242, 7391, 5978, 4754, 5680, 8990, 9556, 8608, 9951, 11353, 10984, 10388, 9770, 9774, 10499, 10254, 8633, 9108, 11172, 11158, 12516, 12105, 11476, 10785, 11051, 11683, 11883, 11992, 11802, 9661, 10489, 12537, 12315, 13097, 11169, 10457, 11862, 11216, 9919, 9396, 10708, 11934, 9914, 9436, 8890, 8208, 8867]
13785H867K372L19n79R03p2k164r78n5J797M06J21l47J004K128J798j168n83m94
13767A3275L09K274K229K62o93p14r50p22J29l81P0j568K01k16J917J324p03l26
13749A5717O78K33O50M43M63r62P01J254J440M71J05R00j51j356q02Q63P88R53
13731B2388q57r13l4l43K13M12N23J200l74j282J175n33j129k69m62J888J444
13714B3047j892k58J121l64j887N75J634j20r6k32J86O64K274J709j633j195J33
13697B3666J279Q43L45k90N84k011j99R45J182Q48K236J587l11M4M40n16k74P73
13679C1171J85l73O99n86m55K081R61P82M77J753K175P43k08k35j733l130J907
13662C6214K237J509o60k131J272Q99J564o4M19P3P97J383O04j300k92J463J584
$$ y = [8867, 11239, 11558, 10979, 11882, 11810, 9646, 8668, 8613, 10410, 10816, 10937, 10590, 11594, 13722, 15520, 14352, 13769, 13275, 13584, 15858, 18087, 18349, 17656, 16942, 15992, 15270, 15399, 15018, 15088, 13520, 13721, 13505, 15422, 16746, 16043, 15717, 16395, 16628, 17278, 17721, 18184, 17222, 17923, 19177, 20617, 21088, 21193, 22093, 21942, 20586, 19784, 20647, 21435, 22388, 21531, 20618, 20584, 20241, 20454, 20866, 21389, 22589, 22215, 20933, 22108, 21575, 20446, 20177, 19715, 21603, 23047, 21155, 20897, 22018, 21654, 19767, 20342, 21976, 21856, 21760, 21528, 21714, 22378, 24652, 26361, 24728, 23533, 23666, 24945, 25788, 26133, 25843, 26427, 24416, 24217, 25162, 26344, 27192, 29428, 31015, 30704, 30748, 31188, 30672, 30398, 31171, 31356, 30983, 31682, 31096, 30641, 32722, 33683, 34465, 34942, 36695, 38870, 39613, 39405, 39170, 37437, 34307, 36214, 38451, 39960, 39300, 37169, 38441, 39340, 40904, 40840, 41259, 41332, 42129, 43512, 44116, 42816, 42524, 43987, 45571]
13645D5571Q60j44q5J012q43L90k42J224J05J45J915J941q11j930j214J517J386
13628E0797m6K20L381J632O55j090K364q58k09L37J080K331J252O48J90J81r62
13611F1903K08J440J97L09l11j684o41K45J528J598K487K802j761r86K077J028
13595G0439K271O74k3K21J182R28J305l73j753r91K266J127J805m57J106R2J787
13578H1606K22n25l17P0J634l02M08L27Q45R83RQ98J126k57k75p03n1R82n97Q02
13558H6885j59J641L18m35n30J350K590M063K50j982j526J149K177l53K97l14
13542I5421k160P30M61j9n60L07O80n73O28J214n3N03J4j217j618N26J524q17
13524I4991l87K8m00q29K88M14p96J02j407k288j376L24J554K50L78m03j561P72
$$ y = [45571, 46431, 46287, 46202, 47214, 46371, 46761, 46519, 47743, 47848, 47993, 49908, 51849, 51038, 49108, 47894, 49411, 50797, 50751, 50971, 54352, 55984, 56639, 55549, 57913, 57055, 56846, 57183, 58263, 60594, 61846, 62494, 62684, 62865, 61903, 62111, 63551, 63748, 64057, 63746, 62062, 61421, 61666, 63194, 64792, 67279, 70081, 68320, 67334, 69411, 70439, 72710, 73384, 73361, 73582, 74764, 75692, 76997, 76624, 74871, 73880, 76146, 77273, 79078, 78621, 79727, 79819, 81606, 81828, 81303, 80986, 81056, 82690, 82388, 82796, 83123, 83968, 84951, 84960, 85858, 86984, 86727, 86452, 85749, 85698, 86680, 86083, 86885, 86726, 88367, 88685, 88250, 87720, 89070, 91660, 95723, 95973, 93991, 92465, 93614, 95791, 95438, 95735, 95421, 93261, 93991, 94452, 94433, 93873, 94180, 94860, 94287, 94915, 96129, 96076, 96579, 96593, 95376, 93758, 94284, 95808, 94991, 94604, 94632, 94232, 93403, 93691, 94105, 93309, 93411, 92004, 89716, 88340, 88664, 90218, 90468, 90846, 90443, 88882, 89654]
13506H9654J006j221k240l595R4J085j074L25P29J03o07k37k156j857j081q36
13490G8092k9J05L65j66p39j107j10J390p4L27m05j636j118p84L95p36j579O50
13472G2841J188q04j978q89J48N59Q17J315J361J277j826L01J488K941K67K41
13456G9247J130r86k500j024J99o75m143m881l845j266j088r46J15k96L81k290
13440E7132l054l248j799K65l30l11N61O42j520j435J43l96J007J88n69J505O03
13423D9384j105O45p18j032j370r37j288q57L95R8j184k415j632n32P36J261Q26
13406D0275m53j441m32N4M80k15J11n07J49k139j484O95K55j073J30j636O08p8
13388C3299n87K61j914o73N45Q81P67j81j48k8O03N91j314j356r03p35o67N15
$$ y = [89654, 90660, 89439, 87199, 83604, 83698, 84783, 83709, 84034, 84763, 84866, 84259, 84022, 81866, 80009, 78928, 78092, 78063, 78168, 78533, 78367, 77628, 76521, 76411, 77801, 77727, 78054, 77649, 76013, 74895, 74111, 74506, 73770, 72191, 72841, 74029, 73225, 71247, 70358, 70506, 71065, 71882, 73197, 74558, 75835, 74009, 74310, 75798, 78739, 79006, 79247, 80377, 79391, 76891, 75867, 76066, 75391, 71248, 66367, 62522, 61256, 60168, 59222, 59337, 59041, 59422, 57132, 54078, 50830, 49031, 49296, 48966, 48655, 49216, 49858, 48338, 46903, 47046, 46650, 47657, 47845, 47276, 48781, 49384, 48279, 48924, 48206, 47174, 45804, 44867, 43579, 42722, 43117, 43215, 42031, 39616, 37984, 37452, 38188, 39449, 40275, 39822, 38381, 37949, 38003, 38483, 38268, 38379, 37872, 38021, 35882, 34398, 35093, 35348, 34275, 34405, 32769, 33377, 33299, 32712, 32973, 31059, 30386, 30931, 31812, 32579, 32398, 32250, 32222, 32825, 33416, 32102, 30746, 29843, 29108, 28441, 28956]
13370B8956M12J339n10j06Q34n48o11j999j699K309r4j950k01O8r33j202K053
13353B6118K31r56j101j658o59J369R81p32r72n56k705k138N36J342J86O0J122
13336B0468j086n96n80j95J576J025J458k0l65j528j30K140l85j132k93r76o86
13319A8695R29L51m15j894o74K10j565m89J267N97j155o77J089q49j026j573j81
13302A2640J92J072N08J49k97r03j427k19K261J025p31M62J10j44p17n48j730
13285A1703K8J047j8N99J88P81P20J187j002n90j604L26N00j046j107J270p52
13268A2230n22q22p02J72J363J008N59j621k345j391n20q6L82m31N01J971J727
13251A1473k08l94p09N15Q83r01J293L53qj665J555K137r54k400L67J093j177
$$ y = [28956, 29368, 30707, 30197, 30091, 30925, 30377, 29766, 27767, 26068, 28377, 28283, 26333, 26132, 26200, 25267, 24065, 26118, 26349, 25393, 24292, 22634, 21975, 23344, 24325, 23593, 22621, 22065, 19360, 17222, 17758, 19100, 19286, 19346, 20468, 19382, 18786, 18206, 18011, 19587, 20612, 22070, 22050, 21685, 20157, 20027, 22167, 21782, 20650, 20357, 19381, 18695, 19624, 19975, 19560, 17666, 16992, 17202, 15637, 15148, 16415, 17012, 15857, 15180, 16269, 15420, 14394, 12821, 12640, 12832, 13904, 14412, 14561, 14264, 13361, 11934, 11715, 13976, 15001, 14270, 14732, 14842, 14698, 13981, 13433, 11703, 11731, 12778, 12760, 13359, 13547, 14328, 15048, 16235, 15233, 14643, 13039, 13365, 13865, 12819, 11712, 12982, 12230, 11708, 10886, 10184, 10356, 11719, 12727, 13286, 11665, 9320, 7929, 7409, 7323, 7705, 7274, 7775, 9746, 11473, 11265, 10871, 10162, 10677, 11560, 10659, 11952, 12305, 12297, 10632, 12187, 14324, 13370, 10970, 11337, 12430, 11253]
13234A1253N21J300J226m38j588j914q81Q80J793l77j76k341r78L08j23J726j4
13217A0177n00l59r29j145r97K59K48Q26N75o47j234J724N14k96j124j792o11
13200D689m1J501J924j81n90P56o68m71K01m70o82R85l91L49L70j519K59L35K3
13181F379J078J677m63k514l020k19J099J53P07n8K42o92K98k70n81j322n92J928
13163C830l33k07j79L96J46R95P29n2j638J27j114q19J326J115j11j081R24j027
13145C027k4L421Q32pk299j543O37J450L37j373j643K603K336K702j062m019k083
13128C292J198K786l33l730j555K025O97j184k044K138K694j611l720J022L519
13113E194K089k357l839M55M328M741j713l696j901J160J736m91o62k59j376N40
$$ y = [11253, 11774, 13074, 14300, 13862, 12274, 10360, 9479, 10359, 12152, 11775, 11599, 9258, 8280, 8588, 8465, 10191, 10177, 9677, 9318, 8389, 7244, 6247, 6506, 6754, 7580, 8155, 7508, 6274, 7998, 8512, 8216, 7092, 5300, 4689, 4648, 6149, 8073, 7892, 7302, 8058, 7390, 6919, 7120, 6650, 5968, 6953, 6562, 6911, 7281, 5762, 6021, 6356, 6379, 7457, 9134, 8671, 6157, 3137, 2918, 4017, 4170, 4877, 4819, 5061, 4369, 4667, 4397, 3816, 2494, 1902, 3830, 3497, 3290, 3111, 3507, 3653, 4648, 5377, 5325, 3687, 3814, 2700, 1881, 3207, 4322, 4211, 3130, 4054, 3027, 3003, 6424, 7256, 7249, 4950, 3407, 4044, 5494, 5831, 4458, 2815, 5418, 7754, 10456, 9394, 5375, 3292, 4490, 7276, 6943, 3213, 1658, 3683, 4380, 3196, 1152, 3290, 5984, 4373, 653, 1675, 5194, 7283, 4926, 1087, 1542, 5870, 10611, 8898, 5202, 3301, 4461, 6197, 5706, 5044, 4785, 3409, 3949]
13097C949K218P0j150k041J06J710L99j571L53K39q75q06l42P39j140O2k54M0
13079A706r04M90J054l95K38J078M53J24m99J178J130l22k88r76j679n45q7Q36
13061B592m6J945R64l75q95K48Q70j5n84m21J91j295j008P59j355n72J200j86
13043B017j04O87N88k64l76J037o98j48K31j044p29o51M23R29j011k83K042N2
13025B698m64J194L73O91K8K311j21k613j133q31m0j634L77Q72M45l02J59m72
13007A538o78Q07K877o16k565k133J395K481O47r26n83J572M35P26j016N12J139
12990E612j507j41m1p70L9P77J088J295p46m15m45n0j159L03P05k43j268j842
12972A192P69J214j094l51Q24n67M22J039j100p91q81R58J272J345O90N02j157
$$ y = [3949, 6167, 6237, 5087, 3046, 3152, 4862, 5261, 3690, 4043, 4282, 3407, 2601, 2259, 2998, 1858, 1920, 1666, 1706, 802, 1292, 2346, 1951, 2189, 3267, 3720, 3844, 3345, 4523, 5653, 5331, 5043, 4067, 2388, 1843, 1756, 2592, 2546, 4491, 5455, 5080, 4185, 4433, 5303, 5288, 4704, 4283, 4474, 3179, 2171, 2930, 1575, 1003, 2203, 2017, 1913, 2600, 3188, 2924, 2548, 3585, 2887, 2739, 2970, 1926, 1197, 546, 969, 1898, 887, 604, 2646, 2698, 2234, 3428, 3801, 4492, 4520, 6831, 6710, 4097, 2964, 2133, 2093, 459, 836, 1708, 2153, 1851, 2010, 1538, 860, 1667, 4544, 3928, 1363, -770, 625, 3106, 3753, 2827, 2244, 3816, 4251, 4977, 3961, 4473, 5612, 4105, 3964, 3923, 3153, 3192, 3969, 5057, 6352, 5606, 5191, 4746, 4696, 3537, 3840, 4545, 4302, 3034, 1192, 1961, 3175, 2081, 1730, 2554, 1987, 2409, 3448, 2348, 1557, 676, 1634, 2906, 4251, 4941, 5443, 4286]
12955D286k525n38j630o48l21P08j46P8L32J389N37R97L71j00j339l13M17m74
12937A081j316p28o4J485M41j056R41P26J427R19P14J93p99k141q38N0k131Q97
12919a99K740J748j890j869O24O55O29K45k34J900L55k173J285k06j1k77l30O30
12901C622O66j389j974o73J135J336k36J633k81j276J330K487q21j070K35q08
12885C916O83p92j514J426J146J680o93K79K743P32j282pK94k216l13m92r97P84
12867E377j938o14J76J927K249j624j957j556O86N97J561J138j592j014j80o66
12851B570O01rN47j791n12l11L73J379P22m53J724n81P47q97m42N12p70q93j006
12832A510p2j0J416o25n05R85n41j055q01J179R35j104n66m99L49M82J202M45
$$ y = [4286, 1761, 1223, -407, -1055, -1376, -668, -814, -736, -404, 985, 1522, 2519, 2890, 2790, 1451, 1138, 1555, 1081, -235, -963, -1027, 458, 899, -157, 784, 1510, 2937, 3856, 4570, 4763, 3964, 1823, 985, 1035, -1096, -199, 2541, 4289, 2399, 530, 1154, 1809, 2438, 2683, 2449, 4349, 4704, 2531, 3816, 3610, 3599, 3322, 2992, 3622, 4288, 2899, 925, 252, 1387, 2723, 2487, 4120, 3839, 2563, 3893, 6380, 5559, 4489, 4724, 3916, 4599, 3807, 2293, 3719, 4865, 6545, 5852, 6131, 8874, 9606, 8324, 8317, 8611, 6395, 6082, 5590, 4593, 5377, 3439, 2825, 3001, 4928, 7177, 5553, 3596, 2040, 2726, 3323, 4884, 6022, 4430, 3416, 3236, 2570, 3171, 3162, 3709, 1918, 1406, 1095, 1468, 2847, 3569, 3116, 4840, 4259, 5006, 4109, 3667, 4179, 3409, 2516, 1510, 1438, 1428, 2844, 2219, 1714, 2699, 2158, 1103, 302, 1481, 2416, 1312, 746, 247, 596, 1078, 2280, 2725]
12814B725j10m28P39M43Q16J580K125k66l68R08K360P46j933k205j004j266q65
12797C997p03N54n11Q49j091j17k72n30J801J245L52j426j223J074K52J87n46
12780C892k102O28O7P19J950Qo50Q59j022l03J205P49k035o21j525K44o85P98
12762B176J316J798L24j607m53j238j534o10K97J590J957r65p92j84J84L01k188
12745C72j421K357J491l38j218K03R76o83j264R99K16L97J32q74L33n42j520l63
12727g47O92J272p7J87n18m97j554P84J46p10k509M66K776P63J119J571J194p34
12709C624m49k2M26J781p84N36J943J693K154L726J983K693J997L141L32o333
12693A8441m832l601k611n07o72j169j218P42O07N3J21j09j359k707q82R82N95
$$ y = [2725, 2615, 2187, 2926, 3369, 4185, 5765, 7890, 7624, 7256, 8164, 10524, 11270, 9337, 7132, 6128, 4862, 3997, 3294, 3848, 3337, 4186, 3095, 2978, 2706, 2176, 3977, 5222, 5574, 4148, 2925, 3999, 4251, 4438, 3892, 1790, 2418, 2485, 3204, 5154, 5162, 4512, 5371, 4349, 4046, 5251, 6000, 3965, 3344, 1819, 2063, 1378, 2176, 3492, 5290, 5614, 4007, 3554, 2316, 782, 172, 469, 2059, 4016, 3051, 2259, 2075, 2259, 2560, 372, -1049, 1308, 2799, 2461, 1243, 1446, 2422, 1739, 475, 1474, 1690, 2087, 2219, 1345, 1678, 1136, -384, -747, -55, 1217, 1140, 1327, 809, 312, -1242, -458, -312, -1022, -3531, -3065, -289, 474, 1593, 3164, 4358, 3624, 3175, 3153, 3579, 5360, 4576, 5112, 7055, 8748, 10902, 14628, 16611, 19304, 21301, 24442, 24774, 18441, 13609, 10008, 7397, 6890, 6218, 5049, 3831, 4573, 5180, 5233, 5354, 5245, 3886, 1179, 297, 1279, 1874]
12676A874L83P53J93N37P75L6n5j105on42n02L12M18n94r4M43N45N14o32r31K93
12655B615p2j9J005p71L8J772k02j529k403l42N80n4O15j154q33j645O10J022
12637g67J584pj587r15Q64J182J516K216J54q40j355n66p44J068K34J148J090
12620D275j437j361j785K23J109j8o79J657J614j521o28R7l22N51q61m72M1Q48
12602A331L78k54j485m90N42P34N05l06O9Q34N48p43J286J71j564q42L28k38j42
12583F62q63p36k2k22N30O06R43K81k55J380J639n36K65L67o65q24o3k96q93k60
12563A038q15q61J74J716J980L39p44P00P82j124k123R5o36p52j648Q36J891J263
12545B111J75L35j286K09P72r37n62J808M25J18j17j194L35p66k150j68N17p43
$$ y = [1874, 2257, 3010, 3203, 3740, 4515, 4551, 4496, 3391, 3385, 2843, 2341, 2653, 3071, 2477, 2383, 2826, 3371, 3885, 3253, 2322, 2615, 2543, 2524, 3529, 2758, 2796, 4568, 4366, 2837, 434, 92, 672, 618, 1233, 79, -754, -2399, -1789, -767, 817, 810, -777, -1692, -828, 354, 1870, 4086, 4240, 3400, 2045, 1479, 735, 1803, 2037, 3185, 4275, 2838, 1477, -308, -85, 1024, 1006, 327, 1984, 3598, 2077, 1449, 1546, 1224, 1775, 914, 442, 483, 1331, 1709, 1455, -30, -520, 22, 756, 1261, 955, 1024, 1858, 2406, 1663, 2949, 3120, 1556, 714, 1042, 804, 662, -201, -937, -959, -1181, -651, -45, 898, 1179, 924, 2304, 3943, 3407, 3672, 4039, 3374, 2550, 2487, 2191, 1298, 1038, 223, -638, -464, 1252, 3232, 3571, 2827, 3527, 4309, 3185, 1062, 1157, 521, -231, -1879, -1043, 848, 2111, 2286, 2621, 1335, 1544, 2316, 1379, 817, 2625, 3050, 3168, 3051, 1857, 2192, 1426, -724, -892, -375, -1118]
12527a118N76J183q9j50N18R09J524O38j210j56k95J64j74n45K32J000J057o96
12509C368p61O33J140k085k391j421N46o40R0J110O89j007J592O50O98n56j400
12492B55J090J563J576P07m38K91P22k78j978m57J946Q77M94J40k54J45j765K98
12474D934q34k341q05L92J074r44L69J177N00J21k132k609J103K290n56j083J823
12457B479r89j599M10J323m81N19P39J980R04m85o44M65j448Q52K054M59j792
12440D746p72J382k333k182R34J411n95JO93k60Q07p82j611p52J354L96O44L76
12422C457n27j115j336P16J492L02p86P5O90J162N89j492j242j254qK75K99Q61
12404B158l8m23j548R70R67K13o76O55K112m5M20L60k24N33l03j505l14J789l80
$$ y = [-1118, -542, 641, 552, 402, 920, 1829, 3353, 3991, 2781, 2625, 2330, 2494, 2320, 1775, 2007, 3007, 4064, 3368, 2607, 3240, 4380, 2295, -96, -1517, -971, -1611, -1521, -411, 278, -729, 863, 1513, 2211, 1655, 255, 1345, 2908, 4484, 5191, 4753, 5044, 5766, 5488, 3510, 3053, 4999, 5876, 6370, 6510, 6256, 6401, 4636, 4934, 4100, 1759, 954, 1346, 2420, 1476, 1845, 3022, 3522, 3643, 1511, -1098, 5, 2295, 1739, 656, 2479, 1490, -109, 301, 1624, 1143, 1662, 2401, 4381, 5285, 4800, 4156, 4621, 3173, 4025, 6079, 6538, 4746, 3974, 5356, 3023, 841, 1775, 3186, 2591, 2592, 3285, 3025, 3832, 3050, 1439, 687, 2041, 2437, 3081, 3457, 2930, 1815, 479, 1195, 2687, 2989, 2203, 2278, 2968, 4130, 4719, 3227, 1985, 731, 723, 998, 1297, 2158, 2120, 1697, 149, 1119, 2086, 2299, 1623, 2278, 4390, 4345, 4765, 5125, 4901, 5434, 5131, 3626, 3312, 5101, 4721]
12385D721m8J007J54K41j024k057l72j33p10J285O84n24j221j59l84p9O67J660
12367C708J213p16J464r28o95r80J27M26q68j699r32m85R82J639J333Q81q63O68
12349D275R56l80O77J127M31j505r14r07q28L37N78J227j114l34N88o01r05j205
12331A503j834N22J191p9M12n72Q27J648R34M43j531k929r42O93N81K599J158
12314D624qn53m70k194k971k52Q52J156R6P22J8J436J99o27J489m02p03l1m12
12295A969M73O15M88L8M81r87L43O24M98O73R79j524m10k01n27j21P69J15m07
12276C888m12r48p91k48P70J584m76j819J90Q30R86K82j593j449j357M9J791j773
12258d96O41Q54l51P49K366J13n60j63k5n53Q61j203j63J132l73k26l62o08Q57
$$ y = [4721, 4673, 5680, 5834, 6075, 5051, 2994, 2622, 2489, 1779, 3064, 3748, 3224, 2003, 1844, 1460, 1381, 2048, 3708, 4921, 4205, 5669, 4741, 4046, 3066, 3193, 3619, 2751, 1052, 120, -365, 617, 2256, 3589, 4470, 3607, 4275, 5231, 4851, 5528, 6655, 7086, 5581, 4667, 3760, 2932, 3269, 3847, 5074, 3960, 3626, 4214, 3613, 2708, 1503, -331, 191, 1382, 1303, 1715, 1143, 1970, 3618, 4552, 4995, 3464, 535, -407, 286, 867, 3466, 4624, 4616, 4063, 3593, 1399, -1572, -1824, -972, 184, 280, 1002, 1020, 2456, 2655, 2028, 3517, 3115, 2412, 2381, 1969, 2442, 3057, 3545, 3583, 4064, 3077, 3420, 4044, 4542, 5215, 6194, 4670, 4260, 4059, 3532, 3411, 4180, 4295, 3888, 3476, 2528, 1737, 1489, 2259, 3843, 3367, 1548, 1738, 2568, 3554, 3836, 2243, 794, -563, -514, 1277, -496, 145, 999, 648, 1397, 3763, 3876, 3316, 3153, 3128, 2575, 3436, 2233, 2070, 3202, 2829, 2603, 2241, 1633, 2490]
12239B490J387K18r70r59j29K60J863o07k43J421M56q53m29j276n47J051j406
12222A727j204K195J095r22l12l08J549K084k197j822P38Q52o41J29r49m93L18
12205A839O70K024Q85l80j154m99n58N30J69P23O63Q18R40K52m72l00p28P3l88
12186E107L45J027m12j21r58l12J374k05k198R9O7J219k06q39j665j48j843m84
12168a53R49J507P29n75j77O90J388J489j234l486N7P46O83P40p83j018p24L64
12150A192K33p91J681K787l11M72R83Lk101j096P0L4n3j024J650R21j531r34R58
12131C143O80P04j72l2J463N16o71k16J168q6n87J491J036k149j277L41J205n28
12113F029k218j01n53r45oM82J691m09j392j594q24Q12k88O61J310Q76j163o33
$$ y = [2490, 3877, 4095, 3125, 2166, 2037, 2297, 4160, 3553, 3310, 4731, 5187, 4334, 3905, 2629, 2082, 3133, 1727, 523, 2718, 3813, 2891, 2579, 2271, 3820, 5904, 3707, 1885, 2623, 3475, 2834, 2963, 2014, 1521, 1839, 2509, 4533, 5418, 5038, 3884, 3385, 2827, 3357, 3526, 4249, 4912, 5730, 6670, 6922, 6450, 6150, 5422, 5495, 5107, 5452, 6479, 6067, 5946, 4988, 4676, 6050, 5845, 3647, 3746, 3813, 5032, 4826, 3987, 2322, 2174, 331, -153, 796, 2303, 3032, 2457, 2280, 2970, 4358, 5847, 4613, 1127, 1184, 1930, 2613, 3353, 2570, 1552, 828, 1192, 1425, 634, 2315, 5102, 4791, 5263, 6246, 6249, 4148, 3052, 3122, 3156, 3103, 2079, 3729, 4650, 3119, 2185, 3143, 3823, 4527, 4355, 4323, 5786, 6302, 5631, 5415, 6583, 6497, 5910, 7401, 8437, 6288, 5011, 5352, 6557, 6029, 3811, 3710, 3157, 2212, 2206, 2688, 4379, 3970, 2578, 984, 160, 972, 684, 1345, 2655, 3531, 2368, 1735]
12095A735J004J11l6j866o60L583K025o35j550L5j269J246J275j561n40K41J686
12078D824P83p14K13J78J93j052j926j511J415J096J462R46M24R54j644k576k066
12061I99j03K197P91K93j160n53J813l01p48N06p32l23L52K94J289R16p47l57
12043D426Q1q46j542P89n92J865n58j046j480l82K30K338K21k5N3j892o10R30
12025A960P37M1j304J569N49q38p61P20M13K4q09Q47Q62R54L91J02r30k545J492
12006C474J375j151N37j50K60l60k552k79J411R6j60J129N43j191k123j013J113
11989I59J220J223j019j846Qn11j33J296J558J173qM01l58J49L90o05N30O54k94
11970D787r97k25J00L68J076j4K30q4J83M85L40l71K76m21j698J4n10K141R34
$$ y = [1735, 2739, 2850, 2814, 948, 288, 3871, 5896, 5261, 3711, 3746, 2477, 3723, 4998, 3437, 2897, 3138, 4824, 5607, 4893, 5106, 5284, 5477, 4425, 2499, 988, 2403, 3499, 4961, 5907, 6331, 7285, 5641, 3065, 999, 896, 3093, 3884, 4177, 3017, 2464, 4277, 3976, 3228, 3734, 3002, 2679, 3031, 3325, 4614, 5530, 4783, 4426, 4507, 3661, 2119, 2908, 2316, 4181, 3623, 2577, 1097, 715, 945, 3283, 3504, 3479, 3532, 1640, 1030, 1960, 2697, 2738, 1434, 3003, 3552, 2714, 1953, 2673, 3086, 3110, 2301, 3148, 4010, 4964, 5355, 5457, 4527, 1982, 3474, 4849, 3698, 4235, 4085, 4345, 3985, 1433, 1154, 2565, 2661, 2501, 3630, 4173, 2982, 859, -154, 959, 2179, 3402, 2383, 537, 545, 34, -99, 1197, 2755, 3928, 3920, 4321, 3963, 4112, 4502, 3897, 4427, 5081, 4787, 3790, 3565, 3665, 4033, 5109, 5095, 5325, 5241, 5424, 5909, 6249, 5878, 6154, 5733, 4035, 4049, 3539, 5680, 6614]
11951F614j975j483m55Q19m65k09J632K169qj384n03j86j41R49K9J794l1k040
11933E126n05O10J824j403q09P50N73J125k0J60n61l04j056j604j151J061P77
11916D593M20o39k05l76J69N03J921Q98j761k047M2J360j035J97J259j088j284
11899B927p17O78k371j526R05K833k71j37K570P72qp43j97R7p45J869r3j157p21
11880C965q10K124q52p96n5P8J47k542k191L304J804l69m99L67M02N68O49J084
11862F378N96n60j854p73J454K241N2j268j000j115j814Q5J753M39J300M60L23
11845F697K12O08L53o81J119l28N60L61K27l66j142m77m57O3K009R15l783m101
11827A789L043Q505J641o455n547K700N647J82n68k547j561k069m79K602N349
$$ y = [6614, 4639, 3156, 2701, 3520, 3055, 2846, 4478, 6647, 6639, 5255, 4752, 4566, 4425, 5374, 5403, 7197, 7166, 5126, 4621, 5231, 7055, 5652, 4843, 5593, 6166, 7291, 7271, 7431, 6870, 6566, 5510, 3906, 2755, 3816, 4593, 5013, 4374, 4169, 3793, 3962, 4465, 6386, 7284, 5523, 3476, 3518, 4878, 3843, 4040, 5299, 4211, 2927, 2210, 2888, 517, -1009, -104, 2729, 2458, 2321, 4891, 5663, 5655, 4912, 4715, 4812, 4067, 5936, 5843, 4686, 3965, 3155, 5279, 4427, 3631, 3576, 3654, 3801, 1259, -932, 2372, 4176, 3807, 3308, 3675, 4077, 4645, 5294, 6378, 6974, 6414, 4560, 3787, 5241, 7482, 7534, 6266, 5266, 4151, 2337, 2422, 4175, 4614, 5914, 6374, 6697, 6909, 7517, 7870, 7189, 8308, 7980, 8540, 8901, 9128, 8762, 7620, 7143, 6686, 6749, 8758, 9673, 5890, 1789, 4832, 13337, 14978, 8523, 2976, 5676, 11323, 11505, 10937, 8390, 6829, 4760, 4281, 6883, 12232]
11812A2232k729q647j589N797L780r48l234j08K110K6J058l44P3K34N96J24K035
11795A0466N92j972lJ792j265j326L54J161n56j048j279J69n79n03j435k449k089
11778C0j673N31K688J876M89K46o15J65Q46R88J499Q31J255L73j836j321j083
11761E289L37J948l03o14p95p1m29l46N65J166J755O22Q1r28j52J813M55j31j096
11742I166J671J151k132j384l26r13j407j196L34L43M04P23j123p74j42p45J355
11725E005J347k32n39K85J015R65l84j256Q92J600m04n78N22j07O47M16n07j275
11707G412l033j705p41K015J070N62P08m05K59m52J003q07k96Q03O63J109j67
11690G998O79J564J7j543j461p3p29M05o63J286J194O8j246L49J696O47Q52J207
$$ y = [12232, 9503, 856, -733, 5064, 8844, 7896, 4662, 4554, 6664, 6690, 7748, 7404, 7477, 7711, 8307, 8431, 10466, 11058, 9086, 9083, 10875, 9610, 8284, 8638, 9799, 9243, 8195, 6916, 7085, 6506, 6003, 4568, 2119, 30, -1643, -1112, 1576, 3452, 3941, 4187, 3572, 3737, 4583, 5571, 7070, 7901, 9156, 9529, 7693, 6372, 5289, 5626, 7574, 7271, 6657, 5862, 5791, 5362, 5016, 5581, 6747, 8502, 9124, 9205, 8277, 8125, 9938, 10393, 10262, 9166, 10837, 11988, 9856, 8472, 8146, 7233, 5826, 4630, 4964, 5307, 5711, 6434, 5311, 4537, 4395, 3650, 5005, 6352, 6120, 5581, 5866, 6881, 7846, 7462, 6206, 7098, 8698, 8294, 7716, 8238, 8131, 8778, 9194, 8687, 7412, 4379, 2674, 1933, 3948, 5018, 5580, 6288, 5883, 6142, 5690, 6693, 5886, 5590, 6393, 7056, 8165, 7998, 8677, 10241, 10258, 8715, 7254, 7181, 6452, 6857, 6194, 7480, 8674, 8742, 7496, 7845, 9541, 10188, 11040, 12247]
11672A2247p16l27l89k35o90l74j151j157l14n10K88n46j352R46J311L30K84M68
11654H113K51m12n00o14Q42J678K77J547o8M18r16k284l38J608j43j937o18J38
11636G042J319K157K77q05r11O38j022p59M71j527K89Q2M17L37q5j195L97J20
11618G242M15J997M18r05n32J41r47q69N18k69O36J202q2j3K45J031j064j124
11600H040O68J488q54p76j824K61J486j093j34k57P69J616P51q86l15J34m27j248
11582G399j253n2J165Q95M81J412J837P29J408k15j214n04l0l115q68q36K10J176
11564H625J367N00o19k61R14k44L25k7R56r63j640J03p3O39j79J045J046O90r89
11545A1215n47J759p12k326n89J535p38j075J630J507l68n16j562m20m21R62K024
$$ y = [12247, 11531, 11204, 10815, 10580, 9890, 9516, 8365, 7208, 6894, 6384, 6672, 6126, 4774, 5720, 7031, 7361, 7645, 8113, 8364, 7952, 7452, 6838, 7680, 9358, 9635, 11182, 11114, 11532, 10616, 8332, 7994, 9602, 9459, 7522, 6904, 7042, 8361, 10518, 10795, 9990, 9079, 9717, 8695, 7936, 8407, 6880, 7169, 7251, 7668, 8005, 7920, 6725, 7122, 7242, 7657, 9654, 10072, 9167, 8635, 8776, 7829, 6960, 7478, 7209, 7845, 9047, 8965, 8952, 9197, 10228, 9164, 8040, 8708, 10196, 9342, 8566, 6742, 7003, 8489, 7396, 7262, 7005, 7774, 9390, 10141, 9255, 8940, 9074, 8647, 7399, 6146, 6094, 7259, 8154, 8635, 10047, 11884, 12613, 14021, 13806, 12592, 12088, 12058, 8943, 8075, 7239, 7449, 8625, 9992, 10492, 9873, 9612, 10526, 10282, 10607, 10580, 11536, 10573, 8933, 9036, 8963, 9602, 9423, 10468, 11514, 12204, 11215, 10668, 12427, 11715, 9389, 8800, 10335, 9597, 8522, 10152, 11659, 11291, 10775, 9213, 8793, 8372, 9334, 11358]
11528A1358l27L1m83j6J431N16j94K3M52j216j028K94J210j315k1Q40j39j166
11510A0250j045j847J613J82o85J554J71J372j36o22j462n19l9N67Q63K73j737
11493H753l06L25J675K78J037J539j244J182j049n96j66p04L12k455l39J574J088
11476A0904P04N77R04J144L32J109k05j361j788q24l76L98L156J198l57j761N26
11459A4280Q44o10j089j987k399Q39J389L62n90r24n02j186Q35J188j283m06K62
11442I023m69l93r87r30K52K132J216J769N92M34L12P10M14j123k305j093J218
11425A0772O38k87o18P13K652K398j390k961j029J671l46M37J656j84j021k623
11409A0478p8L151R86r92p75O73j044R89J086q84J151J2j096j019L90M82J351
$$ y = [11358, 11031, 11062, 10579, 10563, 11994, 12510, 12316, 12339, 12791, 11575, 10547, 10841, 12051, 10736, 10715, 11555, 11416, 10250, 9205, 7358, 8971, 9153, 8468, 10022, 10193, 11565, 11429, 10807, 9345, 8826, 8787, 9354, 10217, 10490, 8753, 8447, 8772, 10447, 10725, 11762, 13301, 12057, 13239, 12190, 11594, 11428, 10724, 11036, 8581, 8242, 9816, 10904, 11608, 12185, 13089, 14233, 14565, 15674, 15469, 14108, 12320, 11496, 11120, 11518, 14674, 15872, 15515, 13754, 14280, 15124, 14514, 13425, 11438, 9039, 9878, 11267, 11629, 11039, 10115, 9613, 8427, 9262, 10450, 9167, 8761, 9023, 8554, 8161, 7174, 6244, 6496, 8628, 9844, 11613, 12205, 12639, 12951, 13661, 14075, 12952, 10647, 9554, 10772, 11410, 11123, 10505, 11218, 13870, 16268, 14878, 11917, 10888, 12559, 12213, 12650, 14306, 14122, 13101, 10478, 10400, 13551, 14537, 13545, 12770, 13443, 12399, 13388, 14474, 13590, 14741, 14753, 13657, 12638, 13028, 13510, 14861]
11392A4861K425J79n02q05j276k39R16N51m71j092p74K94P23l03j71L04j515j118
11374A1987L3l53k67J763L34j548O41K53J122J082j79k264J03K83n14N80K062
11357A5118R83P90L97j103q03jr0q33j64k55K89J231j094j517RJ48Q30k43l59
11338A3333P31K01J472L20O63k1j136n51j1P30R39k31N96m56j469J350J078k83
11320A7255o06N52J129p62j835j280m4J231k96j34p11j133k77J326j025j144K82
11303A2528R32O71k594J01R17N8N36n8J465J395M40J132M1o55N09j859j62J680
11285A7077m07j535l61J601l47j20r87j026J290K324j14l177LP93j64L90M36p07
11267A4969J16J196R79k067j057O2N44r4J667P78r39n06j161l69Q70M6J08M93
$$ y = [14861, 17286, 17465, 16963, 16158, 14882, 14643, 15559, 16110, 15639, 14547, 13773, 14067, 14790, 14487, 14316, 14620, 13105, 11987, 12020, 11667, 11400, 13163, 13497, 11949, 12590, 12843, 13965, 15047, 14868, 12604, 12707, 12990, 12476, 13056, 15118, 16101, 16891, 17288, 16185, 15382, 15381, 15291, 14458, 14294, 14039, 14328, 15559, 14465, 12948, 12957, 13105, 13935, 13692, 13333, 14064, 14265, 15737, 16057, 16720, 16699, 15563, 15012, 15001, 15731, 16670, 16439, 17035, 16579, 15110, 16460, 17538, 17255, 16649, 17201, 18330, 17568, 15733, 14453, 14409, 15640, 15344, 15210, 14499, 13366, 13089, 14415, 13390, 12246, 12528, 13460, 14131, 11537, 11638, 12555, 12613, 13149, 13091, 14556, 15951, 16391, 17523, 17564, 16909, 17418, 15559, 15397, 17077, 16670, 15135, 14774, 16375, 16028, 15908, 14921, 13895, 15185, 17509, 17395, 14218, 14221, 15014, 14850, 15240, 15676, 14969, 15085, 16281, 17260, 15193, 14136, 14198, 14742, 14648, 16315, 17093, 16154, 15648, 14487, 14118, 14988, 15034, 15142, 15635]
11249A5635k487m31L61R66J183Q99j406N67J327R71J312Q30j74n69K70j377P94
11232A8671N69j170j580P04M2j347J118q82K17M99l98p01J144K112O03j213m90
11215A7898N62r4m23P10J261q71q12Q46J451N37N22P23P96L30j137j604J44j705
11197A9134N09K228L88k19J147L07r32p72K7l00M90j008j181o72N2O99Q99J367
11179B2163K923P7q28K46j89p66p3q19J40l25k73J34R76J403N20J052m20m89j294
11160B4158l89p45P46J329J163P76J388J118K69K315M368J652J163K520L504J114
11144D6449n37m507o402m510k537j855k756N43J188o56M28K67M7j226K74J011
11128B5221P69m26M4J6K04n03Q29J074K22j161l29R11n4P51j018j051J43J017
$$ y = [15635, 13148, 12717, 13078, 14044, 15227, 16126, 14720, 15287, 16614, 17585, 18897, 19727, 19553, 18984, 19254, 17877, 18671, 19240, 18070, 16490, 17194, 17236, 15889, 17007, 16125, 16342, 16841, 16443, 15742, 16886, 18998, 19601, 18388, 17898, 18460, 18366, 17943, 18653, 19914, 19043, 18231, 19077, 20528, 21065, 21587, 22310, 23106, 23436, 22299, 20695, 20839, 19134, 19643, 21871, 22259, 22040, 23187, 23494, 22562, 21790, 21817, 21517, 22007, 20999, 19818, 19146, 19198, 19897, 20796, 22163, 25086, 25163, 24335, 24581, 24392, 23626, 23553, 22734, 22874, 22549, 22276, 22410, 23386, 24789, 25309, 26361, 25941, 25452, 24158, 23769, 23024, 23770, 25099, 26262, 27038, 28426, 29544, 29813, 32128, 36496, 38148, 39311, 41831, 45335, 46449, 45912, 41405, 35003, 30493, 27956, 26101, 23345, 23888, 25076, 24420, 24848, 25115, 25162, 23936, 24210, 25221, 25990, 25564, 25608, 25624, 25828, 25325, 26154, 27228, 27450, 26289, 25960, 26871, 26817, 27568, 26550, 25499, 25642, 26659]
11110B6659k40k572j942j569p90P7J94J302O51n62q32J4m47o11P11J877K140k19
11092B3841n99P8J301r62n93p4K55J72J65J486R75n16l93J528L80M83R4R25k04
11073B8342J653L02j670p92J62J495K224J414J761O84j570p11O58p89P09K132
11057C6004M74j10q02j628M74Q15N96p21k223k288o21R67K427J898o59r68o27
11040C3008J226K492J114%O59Q64o94m51j879q48Q41J338L77L34N05j156j056
11023C6674n29l45J33j027j739J625p28j160k212m59J854J99o68j34o75m04q7
11006C0318K185R02R80K84q67m60O53J905L44n92j224k820j253K386L764K088
10990C8593J200k76l08N59J73R50M35N35O00j900j004j374J64l41k21L14P67m88
$$ y = [26659, 26419, 23847, 21905, 20336, 19546, 19623, 19817, 21119, 21770, 21208, 20376, 20390, 19943, 19332, 20043, 21920, 24060, 23841, 23242, 23320, 24621, 23659, 23066, 22992, 23247, 23419, 23584, 25070, 26045, 25529, 25136, 26664, 27044, 27527, 27621, 28546, 28342, 29995, 30297, 28627, 27835, 27997, 29492, 31716, 33130, 34891, 35575, 34005, 33294, 33952, 33163, 33872, 36004, 36478, 36368, 35566, 33938, 34412, 35227, 35823, 35102, 32879, 30591, 29970, 30937, 33364, 35262, 34603, 33635, 33008, 34234, 36726, 37840, 37840, 38499, 39363, 38669, 38218, 36339, 35491, 36332, 37670, 38047, 38381, 38886, 37730, 36674, 36145, 35800, 35933, 34906, 33167, 34792, 34064, 32904, 30692, 30233, 32087, 32286, 31618, 31484, 30809, 30405, 30318, 32503, 33405, 34385, 34669, 33802, 33342, 33995, 35900, 36244, 35652, 34428, 31608, 30355, 32741, 36505, 38593, 39793, 39517, 39209, 39768, 39941, 40891, 41326, 41861, 42461, 40561, 39557, 38183, 38347, 38006, 37785, 38099, 38866, 38378]
10972C8378L54r82j048R56J224J529j188r5J118j117k48k60q16l89K016K204p03
10955D0933L79K34J280K215M233M278J802N540M965N478M541N520O031Q719J0294
10940A06442J2459J4687J7296K1141K7773L5831M5845N7283O9406P7851Q5125
10929E71139Q9574Q8253N5583j1677n2608m1594k1379m1364r8032j25218j01354
10918C11323o5916m0972k5996j7133j3667r911o783l986m237k401k171l289l270
10905A11591j498j04k90l006m35k05o74j149l379r73k576m256j225r32k089l285
10889H5515l176k895j834n3j175k815j652k251j300M72J31j327k916k806j934
10874E9984k14J71m51j338n73j318l076j999j430j327q87M87J29m97l35j022L93
$$ y = [38378, 38732, 37750, 36702, 37658, 38882, 40411, 39223, 39128, 40246, 39129, 38881, 38621, 37805, 37416, 39432, 41636, 40933, 41312, 41546, 42826, 45041, 49274, 53552, 55354, 60894, 65859, 71337, 75878, 81398, 87429, 96148, 106442, 118901, 133588, 150884, 172025, 199798, 235629, 281474, 338757, 408163, 486014, 571139, 660713, 748966, 804549, 792872, 740264, 698670, 677291, 635927, 537895, 412677, 311323, 245407, 204435, 178439, 161306, 147639, 137728, 130945, 126959, 122722, 120321, 118150, 114861, 111591, 110093, 109989, 109699, 106693, 106258, 106053, 105379, 104230, 100851, 99878, 97302, 93046, 91821, 90889, 88800, 85515, 82339, 79444, 77610, 77557, 76382, 73567, 71915, 69664, 68364, 68836, 68967, 67640, 64724, 61918, 59984, 59770, 59941, 59490, 58152, 57579, 56261, 53185, 51186, 49756, 48429, 47542, 48029, 48158, 47661, 47326, 46304, 46697]
10857D6697J849Q51r76j11j400j920N83K255R66k096j796k180k720l950j090J578
10841C6540K27o36j603j981J937J54k165l923k839j180o29J25r37p29j2K355L613
10824B8317L473L373L746K843K763J587K220L168J201J037K281J038O86R43O92
10809E9368J506k66P01N33o22j387j587j104L05l94m12n74O85J266Q01M205M028
10792F7052N242O704N456O576P226Q582Q848Q692P622N401Q601J0975R796P077
10778A73850K854K911N914O188L695j111q439j1034j1608p906p055r568j1364
10765A27327j0230r740r592p059l061j733n156o538m639l017j670m065n165k415
10751E3247o18n59J283L02j395n44P34R8N95L502M069K130m55j991n17J53q8K51
$$ y = [46697, 48546, 49397, 48421, 48310, 46910, 44990, 45573, 47828, 48794, 46698, 44902, 42722, 40002, 36052, 34962, 36540, 36767, 36131, 34528, 32547, 34484, 34638, 32473, 28550, 25711, 24531, 23902, 24027, 23090, 22361, 22349, 24704, 28317, 31790, 35163, 38909, 41752, 44515, 46102, 48322, 51490, 52691, 53728, 56009, 57047, 57733, 58676, 59368, 60874, 60608, 61309, 61842, 61220, 59833, 58246, 57142, 57447, 57053, 56641, 56067, 56752, 58018, 58819, 63024, 67052, 72294, 78998, 84454, 91030, 98256, 106838, 115686, 124378, 132000, 137401, 146002, 156977, 166773, 173850, 176704, 179615, 185529, 191717, 195412, 194301, 185862, 174828, 163220, 155314, 148259, 138691, 127327, 117097, 107357, 97765, 90706, 87645, 85912, 80756, 74218, 69579, 66562, 64892, 60827, 55662, 53247, 52629, 52070, 53353, 53655, 52260, 51716, 52450, 52548, 53143, 56645, 60714, 62844, 62389, 60398, 59881, 60034, 59946, 60197]
10733F0197P48K071j96j707J823J792K496L045J104K521M501Q284J1621J1812
10719A10112J5858J1644N113K979J884M935L614n00k523l428o616o360l552l391
10705A29769k672j734l433j605m727l447j941q28j473K89J966Q22l27Q88J720
10690A13267K398K459M58J01J660M85L78j664j601q04K769K480j916k250M035
10675A22255K936J008J972L957O412P363P989P483P466Q638P473N886L979L528
10661A98345M521M603N027N048K578Q788J5093J7833J6818J9622K1333J4159R243
10648C43011Q292j11j0157q445q932j0572j9778k5658j1467m545n036l878k38
10635B42486J320J934L792O112O216O140N684N874N522M403M612M617N899P064
$$ y = [60197, 60945, 63016, 62820, 61113, 62936, 64728, 67224, 70269, 71373, 73894, 78395, 86679, 98300, 110112, 125970, 137614, 142727, 145706, 147590, 152525, 156139, 155639, 153116, 149688, 143072, 136712, 133160, 129769, 127097, 125363, 121930, 120325, 115598, 112151, 110210, 109382, 107909, 108198, 110164, 110986, 110659, 111547, 113267, 115665, 118124, 118582, 118683, 120343, 120828, 121206, 119542, 117941, 117137, 119906, 122386, 120470, 118220, 122255, 125191, 126199, 128171, 132128, 138540, 145903, 153892, 161375, 168841, 177479, 184952, 190838, 194817, 198345, 202866, 207469, 212496, 217544, 220122, 228910, 244003, 261836, 278654, 298276, 319609, 333768, 343011, 351303, 351192, 341035, 332590, 323658, 313086, 293308, 267650, 256183, 251638, 246602, 242724, 242486, 243806, 245740, 249532, 255644, 261860, 268000, 273684, 279558, 285080, 289483, 294095, 298712, 304611, 311675]
10621C11675P359P838P222N577O054P198Q788Q852Q271P780J0598J3353J3369
10608D23934J2416J3128J4644J6936J7864J8073J9602J7745J7230J6038J2395
10597F00005J4088J4393J1078J1048J1890R678Q027J0992J2857J4110J4793J8300
10585G51259J8471J6880J8444J9671J8278J6026J9822K3996K6318K7516K7723
10574I84404K9854L6016M2848M8281N3508O2272O8007P0552P3120Q2054R7300
10563A648216J15202J35545J56423J80145K07619K36172K57927K76311K58170
10554C471730J78162R5625R7627J49094J53249R1837O8651J42033K47692L46357
10544E042057M32927N15197O10536P13531P86711Q68872J032120J255622J481744
$$ y = [311675, 319034, 326872, 334094, 339671, 345725, 352923, 361711, 370563, 378834, 386614, 397212, 410565, 423934, 436350, 449478, 464122, 481058, 498922, 516995, 536597, 554342, 571572, 587610, 600005, 614093, 628486, 639564, 650612, 662502, 672180, 680207, 691199, 704056, 718166, 732959, 751259, 769730, 786610, 805054, 824725, 843003, 859029, 878851, 902847, 929165, 956681, 984404, 1014258, 1050274, 1093122, 1141403, 1194911, 1257183, 1325190, 1395742, 1468862, 1550916, 1648216, 1763418, 1898963, 2055386, 2235531, 2443150, 2679322, 2937249, 3213560, 3471730, 3649892, 3745517, 3843144, 3992238, 4145487, 4237324, 4305975, 4448008, 4695700, 5042057, 5474984, 5990181, 6600717, 7314248, 8100959, 8969831, 10001951, 11257573, 12739317]
10535A2739317J687288J930422K300218K836250L604867M654365O016894P701660
10527D3471281R610679J1559368J3269503J4242019J4348666J4275444J1190293
10520A31967253J462033q152748q840232m241843l351915j1054410k0183018k0214589
10512E7390531j4229104r008034n741691l816239k684983k004415j573971j234570
10504A7097524r51675p56870o69985o40723n69171m84011m49912m12530l25332
10495A1837315k21656j60428j73876k43300l01943l00512k62080k42543l08395
10486I622582m12785m71985m85980m73161m47515m21354l97126l67515l35189
10477E809972l00525k72451k48009k23800k00299j80143j85253k29959k58585
$$ y = [12739317, 14426605, 16357027, 18657245, 21493495, 25098362, 29752727, 35769621, 43471281, 53081960, 64641328, 77910831, 92152850, 106501516, 120776960, 131967253, 133429286, 125276538, 116436306, 112194463, 108842548, 97788138, 77605120, 57390531, 43161427, 34153393, 28411702, 24595463, 21910480, 19906065, 18332094, 17097524, 16145849, 15388979, 14718994, 14078271, 13509100, 13025089, 12575177, 12162647, 11837315, 11615659, 11455231, 11281355, 11038055, 10736112, 10435600, 10173520, 9930977, 9622582, 9209797, 8737812, 8251832, 7778671, 7331156, 6909802, 6512676, 6145161, 5809972, 5509447, 5236996, 4988987, 4765187, 4564888, 4384745, 4199492, 3969533, 3710948]
10468C710948k39431k03296j76672j62621j52427j45642j38953j32197j20761
10459B238948j08977j02725j00393r5666r0094q2818p4521p0730o8077o6184o7902
10448A310861o3385o1913n8974n5626n1044m5286m2095l9265l5764l3666l2553
10437G91290k9095k4693k2554k3699k6069k7753k6071k3189k1850k4131k7191
10426E14995k5776k4959k4171k2724k2469k1729j7782j4724j4201j4777j0273
10415C01410n939o210o493l710n645n514p161p781n943l253m88K740K359M929
10401B53301P166M398l22j884p20n193q660j1201j7955l874r62m375r536k1234
10387A78949j1720j364j644o126j0874j1403j0042o632l969k436j471n35k108
$$ y = [3710948, 3471517, 3268221, 3091549, 2928928, 2776501, 2630859, 2491906, 2359709, 2238948, 2129971, 2027246, 1926853, 1831187, 1741093, 1658275, 1583754, 1513024, 1444947, 1378763, 1310861, 1247476, 1185563, 1126589, 1070963, 1019919, 974633, 932538, 893273, 857509, 823843, 791290, 762195, 737502, 714948, 691249, 665180, 637427, 611356, 588167, 566317, 542186, 514995, 489219, 464260, 440089, 417365, 394896, 373167, 355385, 340661, 326460, 311683, 301410, 295471, 289261, 282768, 279058, 273413, 267899, 260738, 252957, 247014, 243761, 243273, 246013, 248372, 253301, 260467, 264865, 264543, 262659, 261939, 256746, 248086, 236885, 218930, 215056, 214094, 209719, 200183, 178949, 167229, 165865, 164221, 158095, 147221, 135818, 125776, 119144, 115175, 112739, 111268, 110733, 108625]
10374A08625r35J523L835N579M747P313P938O361M820K917O301M520N599K469
10360A71612k4J168K408K984M395K258L69K34K203M088J335P99k02J273J145j981
10344A94064j523o33J04k285k525l549n314o116n008o366n618m828p299o444n868
10329A30792n412n310m818l196k122l858M613J0969J0675M670r69M707J0918J1850
10315A63509M456k26l402m014m362k598j489l437l106l526j452j817l886j917
10301A32733k052l409l493k324p64k019j259J634J91j900q81l041k292k008j524
10286A07592k134k724k744m670m125l059m147m076l296j843P20M729M067Q32p40
10271H4382J144K050L745L163j005n711n351k920j464j709l521l801k692j970
$$ y = [108625, 107690, 109213, 113048, 118627, 123374, 130687, 138625, 144986, 149806, 152723, 159024, 163544, 169143, 171612, 171588, 172756, 175164, 178148, 182543, 184801, 185170, 185404, 187607, 191695, 193030, 193829, 193627, 194900, 196045, 194064, 192541, 191908, 192012, 189727, 187202, 183653, 178339, 172223, 167215, 160849, 155231, 150403, 143104, 136660, 130792, 125380, 120070, 115252, 112056, 109934, 106076, 110689, 121658, 132333, 137003, 136034, 140741, 151659, 163509, 167965, 167739, 164337, 160323, 155961, 153363, 151874, 148437, 145331, 141805, 140353, 138536, 134650, 132733, 130681, 127272, 123779, 121455, 120691, 118672, 117413, 119047, 119238, 117338, 116457, 113416, 111124, 109116, 107592, 105458, 102734, 99990, 95320, 91195, 88136, 83989, 79913, 76617, 74774, 75494, 80223, 84290, 85122, 84382, 85526, 87576, 91321, 94484, 93479, 87768, 82417, 79497, 78033, 76324, 72803, 69002, 66310, 64340]
10257F4340j551k428l158k451l093m287j570j928j970j310J373K198n68m14m24
10242D2759p20L72J179Q51j364j828k27J773J623k9l05m20J642J876l6n29P07
10225D7324K024K510J237K221K807N632L147K017L269K185M155L866N047K241
10211H9682J88j11p32k280m174k583p7M76k377m665j320R37K99R80l02K051J063
10194G7055j826j308l027p39j209j32o98n60J494M21P31J511n55j086l73j21J343
10177G0921l06o86J167N4j147p16L13L11k188k011j177j486l034r49k371j421
10161E5274r36j706j821j184MJ722r05n34o94j23P47J056J005J690P09P8P26R40
10143E6048j866n00m29r93J74J499P39J076K379J210J012J823K885L477N911M805
$$ y = [64340, 62789, 60361, 57203, 54752, 51659, 47372, 45802, 43874, 41904, 40594, 41967, 44165, 43597, 43183, 42759, 42039, 42411, 43590, 44441, 43077, 41249, 41022, 42795, 44418, 44389, 44084, 43664, 45306, 47182, 47146, 46617, 47324, 49348, 51858, 53095, 55316, 58123, 63755, 66902, 68919, 72188, 74373, 78528, 82394, 87441, 89682, 89870, 89759, 89027, 86747, 82573, 79990, 79913, 80389, 78012, 73347, 72027, 72964, 73263, 74243, 73941, 75992, 77055, 75229, 73921, 70894, 70155, 68946, 68814, 68116, 67556, 69050, 69471, 70202, 71713, 71158, 70072, 69699, 69578, 70921, 70615, 69929, 71096, 71150, 70003, 69287, 69600, 69911, 67723, 65712, 64535, 63049, 60015, 59066, 56695, 55274, 54338, 52632, 50811, 49627, 49631, 51353, 50448, 49914, 49220, 49097, 49844, 50900, 51905, 53595, 54304, 54382, 55108, 56048, 54182, 53682, 53253, 52260, 52434, 53933, 54672, 55748, 58127, 59337, 60349, 62172, 65057, 68534, 74445, 79250]
10127G9250L755J165K277O592O117Q893J0366J4372J8204K3261K9073L9303M9301
10114B91929N9250P0915Q0886Q6305R1499Q1571K9611l3537n2508l2021j9913
10103F53987o2785j16341j17277q2852n3414l1283k0232j2906q507q612o322n146
10091A28310m020j843j617N53j583l483k156j283r31r7j511j418j525j279j482
10076A04635j646l934m304l564l272j379k687k500l00j79l041l370k681l736k624
10061F5418j634k238k860l455j295J72J131j980l972k086k424j472O47J696k799
10046D2849k612M66NJ345K086K82N67k77j186j65J76O9K266J527O21j472m74J29
10028D6202j676k18j497n70J482J030P37n25j856K22l5j851J983L7k938j741o54
$$ y = [79250, 83005, 84170, 86447, 93039, 99156, 108049, 118415, 132787, 150991, 174252, 203325, 242628, 291929, 351179, 422094, 502980, 589285, 680784, 762355, 791966, 758429, 705921, 673900, 653987, 591202, 474861, 357584, 274732, 221318, 190035, 169803, 156897, 148390, 139778, 133456, 128310, 124290, 122447, 120830, 121383, 119800, 116317, 114161, 112878, 111947, 111850, 110339, 108921, 107396, 106117, 104635, 102989, 99055, 94751, 91187, 87915, 86536, 83849, 81349, 81049, 80870, 77829, 74459, 71778, 68042, 65418, 63784, 61546, 58686, 55231, 53936, 54108, 55239, 53259, 49287, 47201, 44777, 43305, 43952, 45648, 42849, 40237, 40703, 40708, 42053, 44139, 44421, 44988, 44711, 43525, 43360, 43536, 43605, 45871, 47398, 48019, 46547, 46073, 46202, 44526, 44308, 42811, 42241, 43723, 44753, 45490, 44965, 43109, 43331, 43296, 41445, 43428, 43465, 40527, 38786, 38132]
10011C8132k437j580k59k509k286J594R66J357K321q27o56p96j22j138p4j90J060
9994C2556l59j407j55k350k626J606R74l87J046R42j539j357j900m23J514O36
9978B6771N54j349k48R24J747J305j323o0J456J567K55O31n05Q57M69k363l426
9961B7262j119J440N06m15P90K196O96n94n95M69R25K089j285L54N10l92J120
9944C3957K139J844K967K563K456N21r3p51j116O19j397o70l73o78L90j172j20
9927D1086r74k019o06J334J207K34j54o53j281R04J093P48J004p01J52j21l72
9910D0881K255J155K55O19L12J320m08O59J751j29P8J920J414k02m99j74J268
9893E2475J855P19K05k037j55m4J610P30K44n96L11j642k118J327J222L41J190
$$ y = [38132, 35695, 34115, 33856, 31347, 29061, 30655, 31621, 32978, 35299, 34472, 33816, 33020, 32898, 31760, 31686, 31496, 32556, 32197, 30790, 30635, 28285, 25659, 27265, 28239, 27852, 28898, 29840, 28301, 26944, 25044, 24621, 26135, 26771, 27325, 25976, 25728, 26652, 28399, 29704, 28381, 28321, 29777, 31344, 31599, 32230, 31725, 32582, 33051, 30688, 27262, 26143, 27583, 28089, 27674, 28464, 30660, 31356, 30762, 30167, 30636, 31561, 33650, 32365, 32719, 33229, 32837, 33957, 36096, 37940, 40907, 43470, 45926, 46447, 46354, 45603, 44487, 45106, 43709, 43039, 42666, 41988, 42378, 41206, 41086, 40112, 38093, 37487, 38821, 40028, 40262, 40108, 39455, 38174, 39078, 40171, 40919, 41923, 41222, 41374, 41253, 40881, 43136, 44291, 44546, 45165, 45477, 46797, 46389, 47048, 48799, 48670, 48748, 50668, 52082, 51880, 51381, 51207, 52475, 54330, 55049, 55254, 53217, 53062, 53018, 54628, 55358, 55602, 55006, 55317, 53675, 51557, 52884, 54106, 54447, 55637]
9876E5637k60j518J199J096j727k578l486l421k226k73J057rj39K68P3j005k542
9859D0146j220n11j556l73j98J34R67P29m26j697k77n01j430j869j143J116K477
9842C4368J506Q88Q87L274Q93m09J246J824J261K64R15K332J526j099n09N31p3
9825D9625J04Q66M82r24P0m98J030J264p2O80N50Q70J613k72j967j796N7l31o45
9806E0706n64j295k400J082j032k092k126j068j58J017n39J156Q59J487K508L230
9790E0771L221R12L72K569K148J502P1j026L52J389N58P19P21P61q73j694R07
9773F3380O04R01J598J393J496K831N512M616K136P38j464P37J489K014K368r37
9757H9412l15k3n27k75J498J098R21j764j7J085K545K355k49l581k739k214j056
$$ y = [55637, 55377, 53859, 55058, 56154, 54427, 51849, 48363, 44942, 42716, 42443, 43500, 43491, 43352, 43620, 43693, 42688, 40146, 38926, 38415, 36859, 36486, 36288, 36422, 37389, 38118, 37692, 35995, 35718, 35217, 33787, 31918, 30775, 31891, 34368, 35874, 36762, 37649, 40923, 41816, 41407, 42653, 44477, 45738, 46002, 46917, 49249, 50775, 49676, 49167, 49698, 49625, 49729, 50595, 51077, 50153, 50223, 49725, 50755, 52019, 51947, 52627, 53177, 54047, 55660, 55388, 53421, 51625, 51682, 51351, 50706, 50142, 48847, 46447, 47529, 46497, 44405, 42279, 41211, 41053, 42070, 41531, 42687, 43546, 45033, 47541, 50771, 53992, 54904, 55276, 57845, 59993, 61495, 61566, 60540, 60892, 62281, 62839, 63558, 64279, 65040, 64167, 62473, 63380, 63984, 64885, 66483, 67876, 69372, 72203, 77715, 82331, 84467, 85205, 83741, 84478, 85967, 87981, 90349, 89412, 89097, 89074, 88547, 88272, 89770, 90868, 91789, 90025, 90008, 91093, 93638, 95993, 95744, 92163, 89424, 87210, 86154]
9740H6154L96j299j602%k64J579K180n04n6j265k329j952j953k28L846K381j58
9723H4926l0k001k558o016m320O21J868Q42r45j544p17p13o62K44J786J102J079
9706G2962l55J45J028K055Q54N77J194L90j292J286J667L410L292L230K697J872
9690I5012J951M44O28j926M1L721J850j672k947k797j300p38k639l262j895k882
9674H1589j559Q10J182J690P51J62j298k096j619L76K636J634L26j153j221J492
9658H3702O15o5K004M094R190N241N482N487M079M267M822N083L660P594R507
9643A54762J2323J4561J6195K0550K5171K8974L2567L9749M3455N2575O0493P2381
9631E73756Q6806J02081J23671J43246J61465J78002J83120J74419J54598J14126
$$ y = [86154, 86550, 85251, 83649, 83649, 83385, 84964, 87144, 86640, 86584, 85319, 82990, 81038, 79085, 78857, 82703, 85084, 84926, 84896, 82895, 80337, 74321, 70001, 70622, 72490, 73332, 72387, 70843, 70126, 69413, 68751, 68995, 70781, 71883, 72962, 72607, 72752, 73780, 75835, 76689, 77266, 78460, 78850, 77558, 78844, 80511, 83921, 87213, 90443, 93140, 95012, 96963, 97407, 98035, 96109, 96150, 99871, 101721, 100049, 97102, 94305, 93005, 92267, 89628, 86366, 84471, 81589, 80030, 80840, 82022, 83712, 84463, 84625, 83327, 81231, 79612, 79988, 82624, 84258, 84584, 83431, 82210, 83702, 84317, 84252, 86256, 90350, 99540, 104781, 110263, 115750, 119829, 124096, 128918, 134001, 137661, 145255, 154762, 167085, 181646, 197841, 218391, 243562, 272536, 305103, 344852, 388307, 440882, 501375, 573756, 660562, 762643, 886314, 1029560, 1191025, 1369027, 1552147, 1726566, 1881164, 1995290]
9621A995290N5897k516o2413j22562j66801j89265k01113j92557j72216j47718
9611G94026j20895r4153o8915m7900l3419k4103j4781j3398j4224j2852q221j0628
9599C30537j1817r347j0768p132l909l417l874l835m647n359n212k707o275q564
9585B43674o026o742o506n291o346o511n810j649l969n778m440m761o282l829
9571A69734l024k666k584l041l484m750l769k183k643l414l651k045N0j928k632
9556A27970j059j528L16K12O2J26k599j863k807l768l867m182m022n427q864q692
9540H0008k912O073R855O131L269k097p285j3016j4052j3365j3008r333J74J1129
9526D1571J5789J3131R852O455O315P893O801M576O475Q202O628O942O718L089
$$ y = [1995290, 2051187, 2048671, 1986258, 1863696, 1696895, 1507630, 1306517, 1113960, 941744, 794026, 673131, 578978, 510063, 462163, 428744, 404641, 389860, 376462, 362238, 349386, 341165, 330537, 318720, 309373, 298605, 291473, 287564, 284147, 280273, 276438, 271791, 266432, 261220, 258513, 252238, 243674, 237648, 230906, 224400, 219109, 212763, 206252, 200442, 198793, 194824, 189046, 184606, 179845, 173563, 169734, 166710, 164044, 161460, 158419, 154935, 150185, 146416, 144233, 141590, 138176, 134525, 132480, 132530, 130602, 127970, 126911, 125383, 125699, 125911, 125973, 126099, 123500, 121637, 118830, 115062, 111195, 107013, 102991, 97564, 88700, 80008, 77096, 83169, 93024, 99155, 102424, 100327, 93042, 80026, 65974, 52609, 39601, 30268, 30442, 41571, 57360, 70491, 80343, 86798, 93113, 101006, 107807, 112383, 118858, 127060, 133688, 140630, 147348, 150437]
9512A50437R73M27j806j14K217J609K19J339L100K518J732j148j885j365L92K04
9496A58849k77L558O956J1229J3355J5281J8897K1222K2209K3956K5225K4221
9484C44681K6670K8144K5272K0528K2190K7655L1445K9898K2086P020k384n863
9472E77342j0694m375r442l4786n4181n8410m5388l1360k2434j5175r408j1507
9460B70182j5902j5454j4673j3847j2426j2552j1487q464m271l773l080j00J35
9447A54288j253J501L550K870N388L044K337L227L068L337m1q95l336j894J42
9432A75333K498M759Q698Q368P039N238K871J696L932R466J9063K4203K6530L2062
9418C31756L3507L3612L5198L1820J6779m764j6306k0475j6733r879l619p11k394
$$ y = [150437, 151410, 151837, 150031, 149917, 152134, 153743, 153962, 155301, 158401, 160919, 162651, 161503, 159618, 158253, 158645, 158849, 158572, 162130, 169086, 180315, 193670, 208951, 227848, 249070, 271279, 295235, 320460, 344681, 371351, 399495, 424767, 445295, 467485, 495140, 526585, 556483, 578569, 585589, 583205, 577342, 566648, 562273, 552831, 518045, 463864, 405454, 360066, 328706, 306272, 291097, 281689, 270182, 254280, 238826, 224153, 210306, 197880, 185328, 173841, 165377, 161106, 157333, 154253, 154153, 154288, 153035, 154536, 158086, 160956, 166344, 169388, 171725, 174952, 178020, 181357, 181316, 180421, 177085, 175191, 175333, 177831, 182590, 191288, 199656, 206695, 211933, 214804, 216500, 220432, 229898, 248961, 273164, 299694, 331756, 365263, 398875, 434073, 465893, 482672, 477908, 461602, 441127, 424394, 414515, 410896, 410185, 407791]
9405D07791l730o340j0865j3477r133n638m103p352n184p02M30M655R263J0737
9391C66352O058N494K821%j450j31K947J313J801N671N266J887K4l8n99k509k437
9374C92470K509J1967J7270J8209K1368K5724K7539K6053K2902K2027J9738K2330
9362F30106K2202J7594J3049P918O557R744J8543K5027L8629N8708P4680P1696
9350I94453O1227P0620O6419L4973K003j4230n2930r4334n6139k4239k4178l9293
9338I24352m5333k9591r687K636O901J0034J5365J8804K3105K2020J7654J5241
9326I71501J5232J4742J7395K0731K4241K5652K6549K8239K7053K6970K8142K8826
9314A255273K9083L4492M0271M1577L7115L3023L6894M3290N0890N4752N8810
$$ y = [407791, 404061, 397721, 386856, 373379, 364246, 358608, 354505, 347153, 341969, 341267, 341697, 346352, 355615, 366352, 372410, 377904, 380725, 380725, 379275, 379144, 382091, 383404, 385205, 390876, 396142, 398029, 398053, 398015, 397416, 394907, 392470, 394979, 406946, 424216, 442425, 463793, 489517, 517056, 543109, 566011, 588038, 607776, 630106, 652308, 669902, 682951, 690869, 697426, 707170, 725713, 750740, 789369, 848077, 922757, 994453, 1055680, 1126300, 1192719, 1227692, 1229695, 1215465, 1162535, 1068201, 1012062, 987823, 963645, 924352, 879019, 849428, 839741, 842377, 849278, 859312, 874677, 893481, 916586, 938606, 956260, 971501, 986733, 1001475, 1018870, 1039601, 1063842, 1089494, 1116043, 1144282, 1171335, 1198305, 1226447, 1255273, 1284356, 1318848, 1359119, 1400696, 1437811, 1470834, 1507728, 1551018, 1601908, 1656660, 1715470]
9303A715470O0649O2894O3176O0039N6975N3343N1671N0762M6458L9857L6286
9292B297580L5605L7635M1897M6772N3528N7641O0867O3991O9149P3405P5838
9281B913908P6477P8194Q3354Q3313P9276Q1876R2523J13817J34493J54198J67912
9270D059341J81751J95006K06655K27820K56474K80251L00634L16113L34584L74531
9260F733160M43428N43948O64473P92078R20914J028912J077348J077217J051905
9251A4333383P58570P4331l89285j69908L00972O78287R63158J214340J472711
9242A9236559J764793K110627K522039L004676L579213M221486M897124N604137
9234D6940654O375626P203769Q077156R162956J0701763J2716367J5523840J9849000
$$ y = [1715470, 1776119, 1839013, 1902189, 1962228, 2019203, 2072546, 2124217, 2174979, 2221437, 2261294, 2297580, 2333185, 2370820, 2412717, 2459489, 2513017, 2570658, 2631525, 2695516, 2764665, 2838070, 2913908, 2990385, 3068579, 3151933, 3235246, 3314522, 3396398, 3488921, 3602738, 3737231, 3891429, 4059341, 4241092, 4436098, 4642753, 4870573, 5127047, 5407298, 5707932, 6024045, 6358629, 6733160, 7176588, 7720536, 8385009, 9177087, 10098001, 11126913, 12204261, 13281478, 14333383, 15091953, 15166284, 14776999, 14607091, 14908063, 15586350, 16549508, 17763848, 19236559, 21001352, 23111979, 25634018, 28638694, 32217907, 36439393, 41336517, 46940654, 53316280, 60520049, 68597205, 77760161, 88461924, 101178291, 116702131, 136551131]
9226A36551131K5603859L1764791L7058931M0223564M0223446L6015468K8325443
9219C75766633K1500337R646670j9016308n4343578p1607346o2338797m4316529
9212A55291082k9965343k0417999j4246122j0256068p636905n806971m460407
9205F2501267l551884l150858l202771l278200l052587k685607k328945j987925
9197C9262490j662631j362996j084384q14390n52713k86440m648J52051j17869
9188C3528470p28320j199783j394255j426043j393448j347018j295232j257607
9180B3486764j281163j341334j329868j220210j083555r61483q63168p90234p40356
9171A3875393o93008o43712n95173n56503n31464n14428m97485m83026m61449
$$ y = [136551131, 162154990, 193919781, 230978712, 271202276, 311425722, 347441190, 375766633, 397266970, 406913640, 387897332, 333553754, 261946408, 199607611, 155291082, 125325739, 104907740, 90661618, 80405550, 72768645, 66961674, 62501267, 58949383, 55798525, 52595754, 49317554, 46264967, 43579360, 41250415, 39262490, 37599859, 36236863, 35152479, 34338089, 33785376, 33498936, 33494288, 33646339, 33528470, 32800150, 31600367, 30206112, 28780069, 27386621, 26039603, 24744371, 23486764, 22205601, 20864267, 19534399, 18314189, 17230634, 16269151, 15405983, 14615749, 13875393, 13182385, 12538673, 11943500, 11386997, 10855533, 10341105, 9843620, 9360594, 8899145]
9162H899145m32870m04923l84958l68986l53206l32660l02361k75841k53989k42120
9152E547231k36014k37138k31925k23002k10475j99921j93351j83901j74013j64717
9142C492774j55013j42568j29954j16915j03682r4466r1090r1316r1502q6591
9132B389677p7871p5464q0448q8529q7259q5772q2507p9865p8727p4487p0804
9121A507944o9205o6625o0110n5071n3297m8489m3373l8857l6012l0745k6692
9110I79468k6693k7059k1984j0667R22M117j118K34O992J5869J8069K2504K4366
9097I85020P078j7605l3166k9621l6347n2711n1433n8848k2156J4583R18k3049
9085F82663m4032m8898m0792l1947k3731j8781j6267j1422q584n655m284r32M03
$$ y = [8899145, 8466275, 8061352, 7676394, 7307408, 6954202, 6621542, 6319181, 6043340, 5789351, 5547231, 5311217, 5074079, 4842154, 4619152, 4408677, 4208756, 4015405, 3831504, 3657491, 3492774, 3337761, 3195193, 3065239, 2948324, 2844642, 2750176, 2659086, 2567770, 2476268, 2389677, 2311806, 2236342, 2155894, 2067365, 1980106, 1894334, 1811827, 1731962, 1653235, 1578748, 1507944, 1438739, 1372114, 1312004, 1256933, 1203636, 1155147, 1111774, 1072917, 1036905, 1006160, 979468, 952775, 925716, 903732, 893065, 893987, 898104, 896986, 897220, 904212, 920081, 938150, 960654, 985020, 992098, 974493, 941327, 911706, 875359, 822648, 771215, 712367, 690211, 704794, 705712, 682663, 638631, 589733, 548941, 516994, 493263, 474482, 458215, 446793, 438209, 432554, 428270, 427338, 427741]
9072D27741K700L375Q587J4601J8109K0821K1620K0179J7726J1243M964P166P032
9059E85864N797O856P243O516P681R585R788N148m18k341j331j138k262j563K1
9044F35446L3j215l272m652p020j1608j5412j8020j8660j9749k1493j9169j7949
9031D77260j6952j6438j5342j2557j2288j0937p269n074m424k325j210J5055M0309
9018D27808M8071L4166J2150k074r006j0811j0020r043n889p076q752o583l777
9005D49164l835o946p069j1067j3963j3065j0106n730l416j475k694k120l448
8992C64230m777n465m923n191n508p643j1890j3754j2903j1975j0925j1270j3634
8979B44372j3086r868p648n484L07P010R992J3931J4784N541n778j2433p003K285
$$ y = [427741, 430441, 433816, 442403, 457004, 475113, 495934, 517554, 537733, 555459, 566702, 571666, 578832, 585864, 591661, 598517, 605760, 612276, 619957, 629542, 639330, 644478, 644060, 641719, 640388, 639250, 636988, 635425, 635446, 635479, 634264, 630992, 626340, 619320, 607712, 592300, 574280, 555620, 535871, 514378, 495209, 477260, 460308, 443870, 428528, 415971, 403683, 392746, 385477, 380403, 375979, 373654, 372444, 387499, 427808, 475879, 510045, 522195, 520121, 511115, 500304, 490284, 481241, 475352, 468276, 459524, 452941, 449164, 445329, 438383, 431314, 420247, 406284, 393219, 383113, 377383, 373967, 372492, 369798, 367678, 364230, 359453, 353988, 349065, 343874, 338366, 330723, 318833, 305079, 292176, 280201, 269276, 258006, 244372, 231286, 221418, 213770, 208286, 208593, 215603, 225595, 239526, 254310, 259851, 254073, 241640, 234637, 236922]
8965B36922L691l607j4223j4419q333n563o542p203q494r469p914p515p026p439
8951A32866p328m061N26K806J187J755J142n8n73k015l618m906m519l050j973
8936A08181k751k329j637N94L572M294K628K305j147Q84L561L824M791N723O698
8921A39191Q653J0631R204P152J0272J0186Q866O409Q731J0612R567N891K090
8908B47455j317m060p475j3154j7153j3309n800k28L592Q738Q893K487o174p900
8894A94595n170k708k843l287m541l418r94J46j263j601r80J09l47j7q49J37L29
8877A67298j925j858j999j822l503n584n379l066l685o387o071n235k676j554
8863A16554j104k193k386j448K47L28p68J485K64r02p59O20K478J320n92O11L139
$$ y = [236922, 240613, 237006, 222783, 208364, 200031, 194468, 187926, 180723, 172229, 162760, 154846, 147331, 140305, 132866, 125538, 121477, 122003, 124809, 125996, 127751, 128893, 128835, 128262, 126247, 122629, 117723, 113204, 110154, 108181, 105430, 103101, 101464, 102058, 105630, 109924, 112552, 114857, 113710, 114594, 118155, 121979, 126770, 132493, 139191, 147844, 158475, 167679, 174831, 185103, 195289, 204155, 210564, 219295, 229907, 239474, 245365, 247455, 246138, 242078, 234603, 221449, 204296, 190987, 185187, 184959, 188551, 197289, 206182, 208669, 202495, 194595, 189425, 186717, 183874, 180587, 176046, 172628, 171634, 171780, 170517, 168916, 167936, 168045, 167698, 167681, 166832, 166969, 167298, 165373, 163515, 161516, 159694, 156191, 150607, 145228, 142162, 138477, 132090, 126019, 120784, 118108, 116554, 115450, 113257, 110871, 109423, 109670, 109998, 109230, 110715, 110979, 110077, 109318, 109938, 112416, 113736, 113144, 113755, 116894]
8846A16894L122L047J633M14J019l36j164J025J616L653M710P336J0599J4164
8832A67732J7337J6334J9502K1752K6123L0838L4837M0524N0416O6277Q0944R7757
8820F70373J19424J41319J61781J76388J82520J75331J55378J20183O7343P453
8810A977493n3015j13217j61155j86913j99597j93159j72004j46149j16165q7715
8800E48404o5688m8901l5506k8450k3299k1635j6231j3612j2035q840p055p307
8788B59845m742j998j729p40j51k293j466j476m647n076o315j0259j1641r750
8774A97562j0382r691p722n421n093n247o551p315o612m678m789m038n637p114
8760A07272o549o759p724l787l070l020l4K46m21j818k899k948j918qj348j036
$$ y = [116894, 120016, 123063, 124696, 125110, 126129, 125793, 124629, 125654, 127270, 130923, 135633, 142969, 153568, 167732, 185069, 201403, 220905, 242657, 268780, 299618, 334455, 374979, 425395, 491672, 572616, 670373, 789797, 931116, 1092897, 1269285, 1451805, 1627136, 1782514, 1902697, 1970040, 1977493, 1924478, 1811261, 1650106, 1463193, 1263596, 1070437, 898433, 752284, 636119, 548404, 482716, 433815, 398309, 369859, 346560, 324925, 308694, 295082, 283047, 274207, 267152, 259845, 255103, 253105, 251376, 250636, 250485, 248192, 246726, 245250, 240603, 235527, 229212, 218953, 207312, 197562, 187180, 177489, 169767, 164346, 159253, 154006, 147455, 140140, 133528, 128850, 124061, 120023, 114386, 107272, 100723, 93964, 86240, 82453, 79383, 76363, 76329, 76575, 76154, 74336, 71437, 68489, 66571, 66563, 65215, 64179]
8744F4179N49J9j48J483P73l09j390p68j097k505k492j149K221J048k517k608
8728E5289k264o80m15L54r57r33k74k50P81j233j53p02J433J960J052K728K911
8711E8647M290P672R501Q983Q189M752l92l146q177j3963j7682j2305q321m299
8697C3749m495n539k532q20j317k354j47J735o54j525j076k049k568j425m53k097
8681F433k506k582j951j251o41m78k41k38N63J328J127J397R08L497L046p11r00
8664F800K009o4j045M44J23J734Q47R03J449K418J789j466J990J386Q06M45K775
8647B3343Q00J428J442K525J323J903J990j13j459l054p50l6j651k235J87r95
8631B4648j099n0j365r85j056l61N23l31Q58o40J265R93LK31l4K19l72N01o56
$$ y = [64179, 64728, 64747, 64599, 66082, 66855, 66546, 65156, 64388, 63291, 60786, 58294, 57145, 59366, 60414, 57897, 55289, 53025, 52345, 51930, 52284, 51327, 50394, 50120, 49870, 50651, 49418, 49265, 48563, 49996, 51956, 53008, 55736, 58647, 62937, 70609, 80110, 89093, 97282, 102034, 101642, 98496, 90319, 76356, 58674, 46369, 38048, 33749, 29254, 23715, 21183, 20363, 19046, 16692, 16545, 18280, 17626, 16101, 15025, 12976, 10408, 8983, 8530, 6433, 3927, 1345, -606, -1857, -2498, -2976, -3217, -3455, -2892, -1564, -437, 960, 1868, 5365, 8411, 7700, 6800, 8809, 8745, 7700, 8144, 8267, 10001, 10848, 11751, 13200, 15618, 17407, 15941, 17931, 19317, 20123, 20568, 23343, 24143, 25571, 27013, 29538, 30861, 32764, 34754, 34641, 33182, 30128, 29378, 29342, 27691, 25456, 25643, 24648, 23549, 23499, 22134, 21149, 20093, 19732, 20255, 19924, 20782, 20142, 21407, 22400, 22403, 22634, 22600, 22819, 22447, 22948, 22292]
8612B2292L73j022j895j121J15r59q58o87j49J919J953K101K924Q83N86R72K686
8595C0113J027R88j874k531k061r70k471p76j412r19j908k889p69Q23O4m00l16
8578A3719j318j799o19n32j349j009k041q30k28l41J225M60J161N58j895k069
8562C093k77o90P69J309P52J71N6O69J425P7j342j082O36K41J3J027K892r8r07
8543H734O02j003j934j259j996o03j95L93O60r11J85K42O25j82o21q66qK232L93
8524D488k78J173j301P43O5m64J880J355P85j698j732m82J39k20j79O16m56j83
8506D251P30J388N33P0j050P43J446k91J339r69N60Q38J370J062J262J603n33
8489A4352p39N99o49p77P63M42k096j176P40k208k387Q71J734M50j410m24J784
$$ y = [22292, 22665, 21643, 19748, 18627, 18742, 17783, 16925, 16238, 16089, 18008, 19961, 22062, 24986, 25869, 26455, 27427, 30113, 31140, 32128, 30254, 27723, 25662, 24692, 22221, 21445, 20033, 19114, 17206, 14317, 13548, 14371, 14435, 14035, 13719, 12401, 10602, 9983, 9451, 8102, 7093, 5052, 4222, 3994, 3653, 4878, 5338, 6499, 7057, 5162, 3093, 2816, 2126, 2895, 4204, 4956, 5127, 5183, 5852, 7277, 7354, 6012, 4930, 5566, 5807, 5820, 6847, 9739, 9641, 8734, 9336, 8333, 6399, 5140, 3144, 2541, 2346, 2739, 3399, 2488, 2673, 2915, 3540, 3358, 2737, 1871, 1863, 4095, 4488, 4210, 5383, 4082, 4825, 4890, 4426, 6306, 7661, 8446, 6748, 5016, 4534, 4673, 4453, 4274, 4890, 4434, 4251, 4981, 6369, 6902, 6972, 5922, 6665, 8111, 7820, 9159, 8190, 8750, 9588, 10958, 12020, 13282, 14885, 14352, 13613, 14212, 13563, 12786, 13549, 13991, 11895, 10719, 11459, 9251, 6864, 7735, 9469, 9919, 8509, 8085, 9869]
8472I869j223k352j231o38r0N91O73l16K08P4N24J06k195o58O42k48K19k222n39
8453A194K696K123q31j292p17j66J216j406j425q93k4P58J150j152l82o98N26
8436F77J336n52P98j86o26m82J038j969j889m94j6j013j440n67R15R31o72j032
8418e243j94q6j536o75j036Q51K773J414j449r22m49M43j32O37l65J318J854M18
8400b379N76l31p91j84J143N16N39J512N61j03L17n70n46q41j2J54j896q83p95
8381d013J264K098r1o31j570r47k42n13L98P93K6j804n8J113L69J289M55p67l04
8362c135j732M9J775J192P72j2k10q45M69n15j023K06j211O16K95L56k11K261
8344i03K11m23R58J640K93P07P93j20m14K3n05q29k528l16N78p50Q70P07q3l35
$$ y = [9869, 8646, 6294, 5063, 4425, 4335, 4926, 5599, 5283, 5491, 5565, 6089, 6195, 4000, 3342, 3984, 3736, 3955, 1733, 1194, 3890, 6013, 5182, 3890, 3173, 3007, 4223, 2817, 1392, 499, 475, 1233, 2383, 1231, 849, 151, 677, 2013, 1461, 2259, 2073, 1447, 965, 2003, 34, -1855, -2349, -2365, -3378, -4818, -5385, -4470, -3539, -4211, -5243, -5437, -5523, -7059, -7734, -8770, -7919, -5146, -3732, -5181, -6103, -6552, -6109, -6241, -5604, -5969, -4651, -2797, -2379, -1803, -2134, -2925, -3109, -1966, -1450, -911, 601, 1162, 1059, 1376, 806, 260, -581, -593, -439, -2335, -3218, -4013, -2749, -651, -742, -1373, -2943, -3890, -4132, -4645, -4247, -3454, -3428, -5232, -5290, -4177, -3808, -2519, -2064, -2831, -3135, -4867, -4818, -3043, -1851, -1079, -1091, -1301, -2146, -1677, -2192, -3215, -3009, -4220, -3604, -3309, -2953, -3164, -903, -692, -1115, -157, 1483, 1776, 2483, 3276, 3156, 2742, 2765, 2260, 1431, -1097, -1413, -835, -1585, -715, -8, -91, -426]
8324d26L20j44j242q09j355j322r2l04O19j49m65l32J437L10J45j01l96K24M20
8305c662q14o77K089K166j22L50j439j433J16p71J78k551Q76K680l76k65J154
8288b501K44J517p69m68R8j203j812l02j98j573j757j09n11P38Q43O45N32k512
8270i098p50N83M08q13L6J90J094J706L51p28q7R42Q00O36L84J147J356Q82J55
8251h06r26J71L98J778m00j982j522J389L18j125l32r60k40K212K562N51k690
8234a604k721k69J870J010O12q71o40R95O88j290M93K668po54j338p89JJ26J671
8215d9J188P5n66k89m70j740k87o23J285k7j210j14O25J818p54j704K10j23j591
8196d346n23n63o27j07J388J24N61m8J665j304j831j3L135J981j618j291l269
$$ y = [-426, -106, -250, -1492, -2301, -3656, -4978, -5070, -5374, -4755, -4904, -5369, -5701, -4264, -3954, -3809, -3910, -4306, -4082, -3662, -4476, -5153, -3064, -898, -1020, -670, -2109, -3542, -3426, -4197, -4019, -6570, -5694, -3014, -3390, -3655, -2501, -2257, -740, -1509, -1977, -1879, -3082, -4894, -5196, -5394, -6967, -8724, -8833, -9344, -8606, -7763, -7118, -6586, -9098, -9848, -9265, -8857, -9670, -9634, -9444, -8350, -6644, -6293, -7021, -7108, -6166, -5366, -4730, -4346, -3199, -1843, -961, -806, -1732, -1561, -1163, 615, 215, -1767, -3289, -1900, -1582, -2707, -3039, -3999, -4239, -2027, 535, 1086, -1604, -4325, -4594, -2724, -1714, -1102, -1973, -2613, -1618, -930, -2220, -1727, 941, 934, 280, -1058, -1847, -1846, -1720, -49, 1139, 1214, 648, 359, -111, -1851, -2138, -2761, -1476, -1503, -2713, -2827, -2202, -384, -1138, -2842, -2632, -2755, -4346, -4869, -5432, -6059, -6166, -4778, -4654, -4093, -4141, -2476, -3780, -5611, -5624, -2489, -508, -2126, -3417, -6686]
8179f686m80J382n0o2p58j320j120O8j72J001J209R43r5o92J012j005j052R07
8161f970J515j27j365r70j0k4M40j40L55L41l15m40J264l58j03p64j51K29o55
8142h248J34J956k25M58r69j591n94K616K429j78R92r98j368m46J141J797m44
8125c538j578N3r46j116Q42L21K53O99M39q41n38L45P26l26o4l64N36J826L060
8106b11J011k167j870q76j721L37J436J059K75L74j077Q16j150n33j80J095q36
8089d218m42N29o22J238J878p08L89N19p47p57r58r06k70J00R06k392j335P74
8071g022J219N46P63O82J936O96p26N47K06Q36j36j343j100Q29P30j936p88m75
8053d536p5q91O18j81O27Q35q6mJ62j071J014L13j11L00j758oP13j104J91p79
$$ y = [-6686, -7166, -5784, -5834, -5896, -6654, -7974, -9094, -9026, -9198, -8197, -6988, -6045, -6140, -6832, -5820, -6825, -7877, -6970, -5455, -5582, -6947, -7917, -7927, -7951, -7511, -7651, -7296, -6955, -7270, -7710, -6446, -6804, -6907, -7671, -7822, -7593, -8248, -8114, -6158, -6383, -5925, -6894, -8485, -9079, -6463, -4034, -4212, -3220, -4218, -5586, -6032, -4891, -3094, -3538, -5116, -5063, -6009, -7125, -6283, -5962, -5709, -5010, -4571, -5412, -5950, -5605, -4879, -5205, -5269, -5633, -5097, -3271, -211, 800, -1367, -3237, -4113, -5834, -5497, -4061, -3002, -2727, -2353, -3430, -2614, -3764, -4297, -4477, -3382, -4218, -4660, -4131, -4753, -3515, -1637, -2345, -1956, -1437, -2184, -2941, -3899, -4805, -5075, -4975, -4069, -6461, -7796, -7022, -5803, -5257, -4494, -3812, -1876, -1180, -1906, -1359, -1153, -317, -453, -1796, -2896, -2067, -1337, -3273, -4061, -4536, -4611, -5502, -4884, -5065, -4438, -3603, -3689, -3693, -3531, -4602, -3588, -3275, -3386, -3086, -4844, -4850, -4137, -5241, -5050, -5829]
8033e829j107R9R20M66l05m06j207o66l20n8J144J451K4M3J527J198O17j896m82
8014d787O91J603O85j233p03m1N24J446r40j422o25j308M25J410K8j187l44n80
7996f358l0p86M17J537J718L43L41j070j022m29j41N66K3j29Q9o65R82r1m93m01
7976e599Q83Q04M49p93P19J56M16k16K165K642j154j476L2M83N0r66j144Q75J501
7957a73L41P77K02K100L4n93pj525J215q8J05q5k719l48j039j04O14P79J807K091
7937C384k002m339m8K266o32l033n5K273Kj926K81L757J565n654l60J3082J4381
7920B2942J178r085n377L356l038q043k800N546o43j2141j0369j713Q545P134
7906d508L225J442M51o90j979p41k92J614J860j59Q43J403M07j000L57m52k46
$$ y = [-5829, -6936, -6837, -5917, -5451, -5756, -6162, -7369, -8035, -8355, -8413, -7269, -5818, -5794, -5751, -4224, -3026, -2409, -4305, -4787, -4096, -2493, -1808, -3041, -3744, -3785, -3261, -1815, -2755, -4177, -4802, -6110, -5685, -4275, -4247, -5434, -5778, -6358, -6388, -7174, -6757, -5220, -3502, -3159, -2818, -3888, -4910, -5339, -5480, -4914, -4891, -5020, -4931, -5596, -4614, -4705, -5198, -5599, -4716, -3912, -3463, -4256, -3537, -3381, -2965, -3181, -1016, 1626, 472, -1004, -972, -489, -439, -1405, -2549, -1674, -173, 168, 945, 1147, 3247, 3281, 2688, 2681, 1156, 2371, 2283, 2388, 2303, -416, -764, -1803, -1907, -1293, -514, 1293, 3384, 1382, -2957, -3005, -739, -1371, -4404, -4459, -2186, -2184, -4110, -3829, -72, 1493, -4161, -4521, 8561, 22942, 24120, 15035, 9658, 13014, 9976, 1933, -867, 4679, 4036, -8105, -18474, -20187, -11642, -4508, -1283, 159, 610, -80, -2059, -2800, -3092, -1478, 382, 223, 1066, 2469, 2876, 1876, 2233, 1781, 1535]
7889A535j178j647k63R15O64M42l16n66P01J463lN43p81n10k011l46K655J080
7871B377m94J122j53k380p68n15N98k05M04j061j324p5j212K74K083k06j61q8
7853a784M24j1n07n72J779J56m34j28j070L3j824m61J624J72l93j01j13j383l43
7834d936J221L305J09k304m15P49m02r38L82N86j049k68j320n72J607J924J072
7817a249j291l16L68N58l87r04J98Q54n05J59o7k721l099O63M87J810O93k62K821
7798b190J775k004j316o98j390j379J494J119J280j357j702k46J946J63o63j346
7782f514N17L60R4J397l89J92O67j311j437j868J52J790K299O73n34j359j812
7765g083N32J064n47l89J54n15L86O70K58j075R73N21n65J604J459n77N16j102
$$ y = [1535, 357, -1290, -1553, -638, 26, 468, 152, -414, 287, 1750, 1747, 2290, 1509, 999, -1012, -1358, 1297, 2377, 1883, 3005, 2852, 472, -296, -811, -213, -418, -14, -1075, -2399, -2474, -3686, -3412, -1329, -1535, -1696, -1784, -1360, -1371, -1878, -2450, -671, -515, -949, -1077, -2147, -2114, -3938, -4399, -2775, -2603, -2996, -3097, -3210, -4593, -4936, -3715, -410, -301, -2605, -3020, -2271, -2673, -3611, -3229, -2643, -3692, -3960, -5280, -5852, -4245, -2321, -1249, -2540, -2856, -2488, -1930, -2317, -3221, -3023, -2169, -2674, -2515, -2582, -5303, -8402, -7739, -7252, -5442, -4749, -5011, -2190, -415, -2419, -3735, -4433, -5823, -7202, -5708, -4589, -3309, -4666, -6368, -6614, -4668, -4505, -5168, -6514, -5997, -5637, -5543, -4146, -4535, -4343, -3676, -4987, -6424, -8292, -8140, -6350, -4051, -3378, -3912, -5271, -7083, -6551, -5487, -6034, -6423, -6269, -6784, -6398, -5728, -5470, -6545, -5572, -5051, -5616, -4012, -2553, -3130, -2614, -3716]
7747c716j397Q91k85M22Q81m58l11j106M38L13m5P75m1NO87j702j02O71j058J742
7727c396J278J276n27j023j232m72l66J971J168k149j908p81Q29N00p25K23P39
7710d595J74R79J677q01j167L92m26o20K146k83J57l12K64Q32j154J182L42m46
7692a659p9o99j780j397q04n71r50R46R48j673J163m67M46J329J191j100M96m58
7674e118q8Q61J83j234j586O5P80J154l65L76Q78j21j160J93j025L45J018k16
7656e060J223P90K89r61j87m06o21L17M84o66m92k41m1l93J039k25o85p72r92
7637g600J736J260j147p17k90J043k44Q60k57l63k362k68J32P19j411J618K425
7620d866Q48O28m29L76o40p99j72M01LJ32J310P74N95M87N34p28r15j012Ql66
$$ y = [-3716, -5113, -4222, -4507, -4085, -3204, -3662, -3973, -5079, -4641, -4328, -4373, -3598, -3639, -3634, -2947, -4649, -4751, -4080, -5138, -3396, -2118, -842, -1369, -2392, -3624, -4096, -4462, -2491, -1323, -3472, -5380, -6161, -5332, -4832, -5557, -5334, -4595, -4421, -3442, -1765, -2566, -3733, -3341, -3767, -4387, -2241, -2524, -2367, -2679, -2415, -1583, -2737, -1555, -1213, -1659, -1738, -2437, -4217, -5614, -6418, -6989, -7939, -6993, -6045, -7718, -6555, -7022, -6576, -5247, -4056, -5156, -4660, -5118, -5206, -4345, -4162, -5396, -6982, -6917, -6137, -4983, -5348, -4972, -4094, -4215, -5375, -5182, -6207, -5862, -4844, -5060, -3837, -3047, -2758, -3719, -3906, -4312, -4933, -4616, -4132, -4798, -5290, -5531, -5572, -5965, -4926, -5151, -5836, -6608, -7600, -5864, -4604, -5751, -6468, -6758, -5715, -5959, -5099, -5356, -5719, -8081, -8349, -8217, -7498, -8909, -7291, -4866, -4018, -3390, -3819, -3443, -4083, -4882, -5054, -4653, -4650, -4518, -3208, -2434, -1839, -1352, -818, -1546, -2461, -3473, -3465, -3831]
7600c831q33M64J058o86K11j285j61J008m97k403o05r06R42J529K521r26k479
7583f879R06J989J116M28L85O79L68p42k906j239L23J119r4p83P65K94K55M16
7565c600q9j13k8q96n14r24j019n11N43L90J06N14R48o73Q89J535k57j29N61N4
7545c213j767j409J460J671j50j28m75k98J479K96n64j310m52N2j29j61Q02J569
7527b727j335l455O60K218R08J88k458j424J90KK938K364J152J44j431r89j473
7510d528o86J322O0n4o25L18j7l61l8j540r37m60J440K734L55j187L47L57K44
7491c256l26J226n75j276m24L08J158r79j728q50j030J303J535O74p29K07n69
7474e331j201J137J880N90j40q41n38R11N25m17r3q82q8j474l13L25J071N12l66
$$ y = [-3831, -4664, -4200, -3142, -3828, -3617, -4902, -5063, -4055, -4552, -6955, -7560, -8466, -7524, -5995, -3474, -4400, -6879, -5973, -3984, -2868, -2440, -2055, -1376, -1008, -1750, -4656, -5895, -5572, -4453, -4547, -5330, -4565, -4271, -4016, -3600, -3689, -3802, -3830, -4726, -5240, -6164, -7183, -7694, -7151, -6761, -6655, -6141, -5193, -5866, -4977, -3442, -3699, -3828, -3267, -3213, -4980, -6389, -4929, -3258, -3408, -3536, -4011, -4309, -2830, -2534, -3098, -4408, -4860, -4808, -4937, -5098, -4296, -2727, -4062, -7517, -6857, -4639, -3731, -3543, -6001, -7425, -7235, -7233, -4295, -1931, -779, -635, -2066, -3055, -4528, -5214, -3892, -3832, -3886, -4511, -4193, -4210, -4571, -4609, -6149, -7086, -7546, -6106, -3372, -3017, -4204, -3857, -3500, -3256, -3582, -2356, -2931, -4207, -4631, -4323, -3165, -4144, -5872, -6722, -7752, -6449, -4914, -4240, -4969, -4762, -5331, -6532, -5395, -3515, -2925, -3065, -3906, -4444, -3533, -3008, -3425, -3518, -4400, -4488, -5962, -6275, -5950, -4879, -4367, -4733]
7455d733j414l85J217j89m09n91L52M02R34j140l71j275O65R14O51k96O01J48
7437d919j532o35L06o5l63l32R14J679q8q21j89J820Q06pq27j169j899q15Q90
7418g246j82J503J258p39j593j815k56o17K465J189R88j122P82R37N91K48Q31
7401b778m32q07j033k64N0J728L47j504J51j573k53J198o86p27P61L88j159o91
7383g284J242M477M55j755r36M31j797r58Q91j320j61J771O18R8J118O29N38J343
7365f00j40j678j049j071n0M99K175L92R94j352r71p46K91j585L53j769k05J023
7347e489R85Q20J035J006q1p54O13J097m38k41Q2j006q8P10q22r19N04k072M59
7328d599K60M17R03J114m49n20J67R14j022N43j92k351l124M34L238K638P00j771
$$ y = [-4733, -6147, -6532, -5315, -5504, -5913, -6504, -6152, -5750, -4816, -5956, -6327, -7602, -6937, -6023, -5372, -5668, -5067, -4919, -6451, -7086, -6780, -6845, -7208, -7540, -6626, -4947, -5035, -5856, -6045, -4225, -3419, -3426, -4253, -5422, -7321, -8136, -7246, -7428, -5925, -4667, -5406, -6999, -8814, -9070, -9687, -7222, -6033, -5045, -6167, -5385, -4448, -3857, -3609, -2778, -3210, -4017, -5050, -5314, -5264, -3536, -3189, -4693, -4542, -6115, -6368, -5170, -5856, -6583, -5822, -5434, -6593, -7284, -6042, -1565, -1110, -2865, -3801, -3370, -5167, -6125, -5234, -6554, -6715, -4944, -4326, -4228, -3110, -2481, -1943, -600, -740, -2418, -3467, -4538, -4588, -4089, -1914, -1522, -528, -1880, -2851, -3597, -3306, -4891, -4538, -6307, -6512, -5489, -4504, -3684, -2649, -1643, -1724, -2478, -1865, -768, -1206, -1447, -1365, -2371, -2459, -1749, -2571, -3490, -2986, -5058, -4599, -4339, -3922, -3019, -1905, -2354, -2874, -2707, -1793, -2815, -2272, -2464, -4815, -7939, -7505, -4267, -1629, -929, -2700]
7310b700k081J346j40j646M27J763J463j184k042l86O19j60l89q2O43M88N44j793
7292e310j074m48K39K342J141K15N70m85J59q0q02q50l11m4q71R24P63j749Q9
7273e582M80K061J14j522J21Q2L25M61r96q43j40o85J34P45q30L80O46M42j70
7254d777m15J324O65j441J22O39L53q57m05r59p54k79J117J918J196j206k22l21
7236d302p58J958J329k58J376J594j876k617j009O65R61R04l97N78o14j128j204
7219d798N90J328N10J297l54r24L71j086j295l17K014j270j391Q69J95J629O66
7202a966j112k447n53L65l42K47R35o98q14p14J404M66j772J32J137n00Q87Q21
7184d524j24k19j60J63q1l93J207J285r66l09M27j132m26J554J803j318m62n15
$$ y = [-2700, -4781, -3435, -3575, -5221, -4794, -3031, -1568, -2752, -4794, -5180, -4561, -4721, -5110, -5192, -4549, -4061, -3517, -5310, -6384, -6832, -6593, -4251, -3110, -2895, -2325, -2810, -2651, -2731, -3533, -4383, -4694, -4738, -5609, -4685, -3922, -5671, -5582, -5102, -3041, -2927, -4449, -4328, -4246, -3921, -3460, -4456, -5299, -5439, -6124, -5990, -5245, -6075, -5695, -5049, -4607, -4777, -5192, -3868, -3203, -4644, -4522, -3883, -3530, -4387, -4792, -5751, -6505, -6784, -5667, -3749, -2553, -3759, -3981, -4302, -5060, -3102, -1773, -2031, -655, 939, -937, -3554, -4563, -3898, -2937, -2033, -2430, -1852, -2466, -3594, -4798, -4208, -2880, -2370, -1073, -1427, -2351, -1980, -3066, -4361, -4678, -2664, -3934, -5325, -4456, -4261, -2632, -1966, -3078, -5525, -6078, -5713, -6055, -5808, -4873, -5571, -6385, -7099, -5695, -5229, -7001, -6869, -5732, -6232, -5345, -4524, -4648, -4867, -5027, -4864, -4945, -5338, -4131, -2846, -3812, -4121, -3694, -4826, -5252, -3698, -1895, -3213, -3675, -4190]
7166d190L54k6N8l60M28L71Q38J169Q84K47j710j03j895k01N52P9m71Q58J080
7147b038l20k59k191j277L47q1J454N23j900q56R86J132N36n26j311J479k86j869
7129f457O49J119J624M61k71J023m38j413p77o0J29J455o14N27L8R6l32j50N15
7110b876o12k001j372k14J651J41L9J68J426J530O89j38k029j418M13M00j71M78
7092c896l58k32r13j31J088J128j071k51Q18P7j601Q67J564K73l3m62p35J392
7074b476j358l34J202j040L19r80m8r86l20p39J08J104N20l52kj423J783L53j587
7055f256k92J016Q22j004J090N90J213J028J86m40m95J823J833j193k816j754
7039d649M51n96j355J959J357M94p68j880M8K64N79j095K78J506M3M55J337R1
$$ y = [-4190, -3836, -3862, -3804, -4164, -3736, -3365, -2527, -1358, -474, -227, -1937, -2040, -3935, -4136, -3584, -3505, -3976, -3118, -2038, -2358, -2617, -4808, -6085, -5738, -5819, -4365, -3842, -5742, -6598, -5612, -4480, -3944, -4470, -5781, -4302, -4588, -6457, -5808, -4689, -3065, -2604, -2875, -1852, -2290, -3703, -4480, -4540, -4411, -2956, -3570, -3043, -3005, -2909, -3241, -3391, -2876, -3488, -5489, -6861, -7075, -5424, -5283, -5244, -5076, -3650, -2120, -1431, -1569, -3598, -5016, -4603, -4203, -4374, -3896, -4254, -4486, -5399, -5530, -4442, -3314, -4385, -4636, -3818, -3741, -5342, -4475, -2911, -2638, -2671, -3133, -3868, -2476, -3834, -4168, -2966, -4006, -3687, -4667, -4715, -5701, -6021, -6760, -6652, -5548, -5028, -5380, -5382, -6805, -5022, -4669, -6256, -6548, -5532, -4710, -5714, -4624, -4034, -2821, -1793, -1607, -2047, -2542, -719, 1114, -79, -2895, -4649, -4198, -4794, -6149, -4190, -2833, -2339, -3107, -4987, -4939, -4675, -4096, -5191, -4913, -3407, -3364, -2909, -1572, -1481]
7021a481k22R02j486p39O11l4P56l72J06j68o0L22k21j427q73k84r77J761K047
7002a839r61M34l5j042K50j012q94M82n11o29r9N13K95O00J407R11l56p17m10
6983c613M1m18P39J455J738j474q75R28o78l123j474O19J212J118J243R70J42
6966a450j503j954L41Q39O97P64N92l60j491j123j619k01L439l1N71k36j797j146
6948e668J270M91J371N93k375k675J976K844k2K36O0j524l29ln5Q77Q72R40J174
6929E3j715o87m15o69n82Q84j88k50Q14Q37q16k068o30j26L24J157K871m0r97
6910b243L23R11j24j057k65J124k75j91r16p71Q79l77k286j260J571N94j181l88
6892e932J294N23K993K76j042k736O37K104j191l56J685K1j33J337J94m53O2J75
$$ y = [-1481, -1703, -801, -2287, -3026, -2415, -2449, -1693, -2065, -1959, -2127, -2187, -1865, -2086, -3513, -4386, -4670, -5647, -3886, -1839, -2800, -2366, -2401, -3443, -3193, -4205, -5099, -4617, -5128, -5757, -5856, -5343, -5048, -4448, -3041, -2130, -2486, -3203, -3613, -3572, -3990, -3251, -1796, -58, -1532, -2407, -1479, -2157, -5280, -6754, -6135, -4923, -3805, -2562, -1592, -1450, -2953, -4907, -4566, -3727, -3030, -2266, -1674, -2034, -3525, -4648, -6267, -6468, -3029, -3060, -2489, -2725, -4522, -5668, -4398, -3907, -2536, -1943, -4318, -6993, -5017, -2173, -2195, -1959, -1899, -3423, -3752, -3755, -3810, -2933, -2061, -1121, 53, -1662, -2349, -2764, -3433, -4015, -3131, -3319, -3569, -2755, -1918, -2734, -4802, -5432, -5558, -5234, -4077, -1206, -1246, -2243, -1920, -1009, -1133, -2190, -2455, -1331, -1606, -1797, -2713, -3484, -2605, -2982, -5268, -6528, -4957, -4363, -5544, -5932, -4638, -4115, -1122, -846, -1888, -4624, -3987, -1883, -3074, -3430, -1745, -1724, -1857, -520, -326, -779, -717, -542]
6874e42N59k54L31j380j378k95n91j370P10J511M27q97L07m81M42J134O07o30
6856a790M75j075q03O54O21M57k35r6j397r20J486J105o11k22P13M89J505q3o62
6837c89J523M29j021k105m19n13j480o04K158O75j917k70R84O93R97J72q11p23
6819b621K05n49j854L06J414K97k96P3K082K678m11n07J01j437j377j205l63L65
6801c099l61L40J195N98l35q08L20L84j23l64n89k505j33J481J915J30j387j286
6783d627j121L10J130J241J233K70K41M35R8k633n1K57O87m94m72r4L37j4J307
6764a960n13p23j882O09o69m07J841J604o51j99j45j9k24n2M48M03k75M66J146
6745a202L73n26o61L16J507M81j07j465M38Q9M38R77j082j741l20O70L58j039
$$ y = [-542, 17, -237, 94, -1286, -2664, -2959, -3550, -4920, -4210, -2699, -2272, -3169, -2862, -3343, -2901, -1767, -1160, -1790, -1315, -2390, -3193, -2539, -1918, -1461, -1696, -1792, -3189, -4109, -2623, -1518, -2129, -2351, -1638, -1149, 356, 273, -389, 1134, 1563, 542, -1563, -1982, -2495, -3975, -4579, -2421, -1746, -3663, -3933, -2949, -2256, -1259, -1087, -1898, -2621, -2416, -2965, -4819, -4513, -3099, -2802, -3098, -3025, -943, 1735, 1324, 817, 918, -519, -1896, -3101, -3464, -3099, -3460, -3120, -1925, -1327, -1662, -2470, -2150, -1766, -1889, -2253, -2842, -5347, -5480, -3999, -2084, -1954, -3341, -4627, -5748, -5438, -4308, -3067, -1834, -1564, -1323, -888, -790, -3423, -3474, -3217, -2530, -3024, -3496, -3590, -3253, -3267, -1960, -2473, -3196, -5078, -4469, -5138, -5545, -3704, -2100, -2751, -2950, -3095, -3114, -3338, -3390, -2942, -2539, -2814, -2348, -1202, -829, -1355, -2016, -1700, -193, 288, 181, -1284, -846, -757, -319, 658, -424, -2165, -2485, -1815, -1457, -2496]
6727b496j645J582J449k0j229O49J922lk95Q61J040J518J459k31o37M86k72n79
6709C559j902j782q27q52j739l39J143N32p98P71J383J509J700l40k61J333p00
6692B390l1K7M65j710l72n13l30M57o73j768n0Q05L21m28R8j305q22P05p2j078
6672c884J013J295O09j398j686M71J75p5k12L64R13j162j464J21Q61q26p2K87
6654d670R52k0K081N11k478J75k0K80p88K90Q47K22l51j129N21K96J641J924J344
6635A628K28q02k824j553N00K85p28j278K136L159j410o741l940M833P398j512
6619f21r542m437N364N954J040m486j125M867N433J961l319m328J240M274j464
6604H11l424k79K62q96m30J388N32J222L54j093j054j91J141m45m47o88k82M02
$$ y = [-2496, -4141, -2559, -1110, -1130, -2359, -1710, 212, 209, -86, 775, 1815, 3333, 4792, 4561, 3924, 4410, 4138, 3559, 1657, -125, -952, -1804, -3543, -3882, -2739, -2207, -3005, -2234, -851, 658, 2358, 2018, 1757, 3090, 2390, 2359, 2386, 2851, 1141, 769, 256, -74, 383, -290, -2058, -2108, -1303, -982, -1410, -1312, -2617, -3439, -2734, -2806, -3884, -2871, -1576, -967, -2365, -4051, -3580, -3405, -3480, -3692, -3328, -2415, -3577, -5041, -4920, -4059, -4885, -4957, -4670, -3718, -3738, -1657, -1146, -3624, -3449, -3469, -3189, -3977, -3687, -2840, -2618, -2969, -4098, -3577, -3281, -1640, 284, 1628, 1856, 1054, -1770, -3323, -2823, -2538, -3266, -4544, -2408, 751, -659, -7400, -11340, -6507, 891, -621, -10163, -14600, -9236, -3282, -2242, -6728, -7853, -2986, 2447, 4408, 1089, -3239, -1999, 2275, 811, -2613, -2892, -2630, -3526, -3956, -2568, -2036, -814, -460, -1553, -2607, -2798, -1657, -2102, -2549, -3237, -3519, -3117]
6586c117P88L41k797O6r4j871o66J051Q12r95k039L77K964K667L7k804p98P88
6568e290J968J127j630M43P48m9L91L57M28m43n62J42J543q68j131j942j482J473
6550d777N61j83O34R75O98Q62j336j047o49q04k89J43J516J143J277K1R57k49
6532e47j008l84J481J275M77l69j263l3K067p24p49q77r80n86n58q84M88l73J55
6513c392L946J109j677m94p78J10o76J112J785j488M2p03j778j625L49R84r33
6496d107j055m94L32P91K12o29Q8Q87P92l16L63J09J485N50k99Q77L5k276K64
6477b391J52n41j79m57J178K109O4j106j217n96k48J179j340J65R17k58n55L36
6459b788j205J57J490K265Q8j017j986Q86J710j708k58J243R75o61q81P32O45
$$ y = [-3117, -2329, -1988, -4785, -4719, -4813, -6684, -7350, -6299, -5487, -6482, -8521, -8144, -5180, -2513, -2476, -5280, -6078, -5290, -3322, -2195, -3825, -3382, -2634, -2683, -2292, -1935, -1507, -1950, -2512, -2370, -827, -1695, -2826, -4768, -6250, -4777, -4216, -4399, -3765, -2790, -2092, -1230, -2566, -3613, -4262, -5066, -5355, -5212, -3696, -2553, -1276, -1255, -298, -547, -1555, -1939, -458, 817, 1294, 925, -338, -371, 1696, 972, 223, -654, -1634, -2220, -2778, -3662, -3174, -3547, -3392, 554, 1663, -14, -508, -1286, -1176, -1852, -740, 1045, -443, -401, -1104, -2882, -4507, -4158, -3174, -4107, -5162, -5656, -5324, -4533, -4321, -4950, -4862, -3975, -3183, -3499, -3136, -3027, -1542, -992, -1291, -414, -379, -2655, -2391, -2239, -2780, -2959, -3416, -2238, -129, -65, -1171, -2388, -2984, -3232, -2053, -3393, -3228, -2311, -2569, -3124, -2788, -3993, -3836, -2346, -81, 7, -1010, -2996, -2110, -400, -2108, -2366, -1123, -148, -809, -1690, -958, -313]
6442c13N78p70j293r8J83l99J19L79O82m36j106l35M47M72J404o18J62Q42n42
6423f42r93k68n86l77n13J376M31J246K126N69P09j210j722j500j228L91l70J49
6405b412J99m6L02j64P59J344J660j979M69L16n19o70M75m4j816n17K908Q59M99
6386A623o36j69j80j308j048k3O01R68J400j042K99k52k91r47j784k29O25J088
6368a305p2j333r51K45M00R2m5Q34l62q76O83n28Q00O32m35J95J391Pm25N50k22
6347g25R1J321j135k443j704J271N48n18j748P30J485q69K126J110j512k095j678
6330e745j758K16R17J170K287Q93J64j86j144M01J197J080K20m18M45j21nk415
6312b802r6J567N18m70o0j6J522j64k289o23J695n55k463j473J46J451L785N17
$$ y = [-313, 265, -505, -1798, -1896, -1713, -2112, -1993, -1614, -932, -1368, -2474, -2809, -2362, -1890, -486, -1104, -942, -100, -642, -1635, -1903, -2489, -2866, -3379, -2003, -1572, -326, 1800, 2369, 3078, 1868, 146, -1354, -2582, -2191, -2561, -2412, -2213, -2259, -1957, -2121, -1362, -18, 1642, -337, 132, 448, -71, -741, -266, -310, -2126, -2643, 265, 1124, 1623, 987, 818, 638, -670, -1718, -1741, -1140, -172, 1228, 186, 485, 233, -58, -1005, -2789, -3018, -2393, -1305, -1377, -2710, -3661, -3416, -3016, -2924, -2969, -2135, -2497, -3373, -2690, -3218, -2418, -1786, -2221, -2026, -635, -628, -1053, -503, -725, -634, 687, -448, -2891, -4595, -3324, -2776, -3294, -5042, -4312, -2827, -3696, -1570, -460, -1972, -4067, -5745, -7503, -7287, -6370, -5200, -2913, -2020, -1856, -2042, -3186, -2785, -1588, -508, -288, -706, -261, -382, -387, -2802, -2898, -1331, -813, -1283, -1343, -1359, 163, -1, -2290, -2913, -1218, -1773, -4236, -5709, -5563, -4112, -327, 190]
6294A90j558o06Q16l8K82r16l48j45j075O63J897O75m85L35j022p56P71J19r10
6275b111k507J121q81o54K531J067J034j206p79J008k07m94J96k78J97J19R27
6258i17P11N00l52j58j901K59O29j904o36K550j411k701J31J362J033J047J42
6241a616J218J86j758o13J104l47N0Q22N11q5j751j972N71R01O5j02N82Q89J296
6222d9l43J38Nj037j341m67N07q39L42q88J171J195n42K37n78j691m73o02j88
6203e443R48j57J186O25k579M62K688q3r07m15J144J902j065M43J90l28J16J607
6185C34o21j637P7R35j09j430N20J728n8R98r19o26P63K3j216K5O16J627N58q94
6165F94j59O19q04p62m00o03J402l76j424M80M56n23j21j086K062J028J15l26
$$ y = [190, -1368, -1974, -1158, -1196, -914, -1830, -2178, -2323, -3398, -2735, -838, -163, -648, -313, -1335, -2091, -1320, -1201, -2111, -4618, -3497, -4378, -5032, -2501, -1434, -400, -1606, -2385, -1377, -1584, -2078, -1882, -2160, -1963, -1844, -917, -206, 294, -58, -216, -2117, -1858, -1229, -3133, -3769, -1219, -2630, -5331, -5200, -3838, -2805, -1758, -1616, -398, -212, -1970, -2583, -1479, -1826, -1776, -954, -443, -528, -2279, -4251, -3680, -2779, -2714, -2816, -2234, -1345, -49, -392, -254, -249, -1286, -2627, -3094, -2587, -3426, -3084, -3972, -2801, -1606, -2148, -1911, -2489, -4180, -4653, -5255, -5443, -4495, -4652, -3466, -2841, -5420, -4958, -2270, -2353, -3260, -3675, -2531, -629, -1694, -1251, -1061, -1389, -1273, 334, -287, -1924, -1847, -912, -1021, -2451, -1931, -203, -261, 737, -182, -808, -45, -22, -1238, -1213, -597, 1030, 1588, 694, 535, 1154, 350, -412, -812, -1415, -13, -389, -1813, -1333, -877, -1400, -1521, -2607, -545, 483, 598, 272]
6147B72K40L79j312j426J68K456J233j100j993M45J947RJ215n99j674l70j876
6130a986R2K27r48n21l16N64k8k62n72k32J037J306J502K09k292n28O86J283n39
6111a318q10o80j693K115K567qj629j556J63l83J61K480Q18j00j468j413J198
6094a556r29J034k4K4j1O41J006l03p28K99K17q08J91k95N88P27k34L48M8l59
6074a24q02K6P55k46j23n18n6K67J531Q00j517j846j331p4Q33k059k73M41J508
6055b808P10J2Q10p32K15P23K31l34j11k99P15j98J47j97n64l20m78q5j10J35
6035b538j611p02p0J834P52q4J58M41n28J576o3q9p38k927o66P55J704l13q69
6016c978l88k56J584M41N4M66N20q50K16j219p45j01j56J190P52q33k14J269K282
$$ y = [272, 512, 891, -421, -1847, -1679, 777, 2010, 910, -1083, -638, 1309, 1318, 2533, 1934, 260, -110, -1986, -1894, -1667, -2615, -3136, -3452, -2888, -2916, -3178, -3750, -3982, -2945, -1639, -137, 72, -2220, -2748, -2062, -779, -1318, -2128, -2808, -4501, -2386, 181, 173, -1456, -3012, -2849, -3232, -3071, -591, 227, 127, -1341, -2754, -1556, -2485, -1451, -1475, -1451, -1462, -821, 185, -118, -846, -547, -330, -1138, -947, -1242, -654, 73, -161, 187, 235, -124, -926, -900, -145, -391, -514, -1032, -1088, -821, 710, 1510, -7, -1853, -3184, -3258, -2425, -4484, -4757, -4316, -2808, -2098, -2086, -1276, -2008, -1793, -1070, -839, -1173, -1284, -1583, -868, -1066, -919, -1116, -1680, -2000, -2478, -2563, -2673, -2538, -4149, -4851, -4921, -3087, -2335, -2419, -2261, -1820, -2348, -772, -835, -924, -1662, -4589, -5255, -4500, -2796, -3109, -3978, -4366, -4622, -3038, -2597, -2543, -2077, -1557, -2407, -2191, -3410, -4155, -4256, -4412, -3222, -2470, -3303, -3517, -2248, 34]
5997C4n77m2m14p81q72Q9k2j264M27J324M75j23J8K88m26Q30J33J289J15p59k30
5976d88k9n06K91p80r51N97q63q47j477J184j093m79J353R76Q88J611m45J040
5958a8K34q51Q6n29q7O37J024M42j224j81M22q49q54J0K201K76j504j593R27K180
5938G49O23j586k43J153n73j421q36J140j5J93j41q59J114J126Q3j77j004j78
5920h52Q62j106j359p83P37K43M6N01N04r52R93r3j314K59Q19K87n12m15N56L84
5900a195K90P15r57q84J803Q61N39J4m82q95j376N99J67L9K84n56Q74JJ03l06
5880c62M59J08j431m84O82j083m02J454k46q33j40k73j224j203P52K264m01q11
5862c174R68N87j64k40o3l62J981l9J58N20k62J297n05j510Q84L67M76j207j043
$$ y = [34, -543, -585, -999, -1780, -2652, -2563, -2585, -3849, -3422, -2098, -1623, -1746, -1728, -1440, -1866, -1036, -903, 386, 501, -258, -488, -517, -1023, -732, -1512, -2463, -1866, -2729, -3576, -5053, -3869, -4962, -5441, -4088, -3112, -2224, -613, -1058, -18, 216, -635, -549, -1078, -1165, -528, 496, 938, -286, -467, -45, -894, -1748, -1738, 463, 739, -765, -2358, -1431, 749, 1372, -214, -457, 696, 123, -1298, -2134, -994, -1009, -816, -957, -1816, -702, 424, 507, 330, -674, -852, 10, -1096, -2455, -3238, -2501, -2258, -2212, -1711, -1207, -2159, -1166, -1259, -2573, -2314, -1495, -1208, -1720, -2135, -1579, -1195, -905, -190, -1147, -2031, -228, 633, 1172, 1186, 704, -191, -1567, -968, -801, -762, -478, -1034, -160, -159, -56, -362, 97, 205, -1226, -1710, -1028, -2111, -2513, -1059, -1305, -2138, -2278, -2551, -3775, -4978, -4226, -1962, -2363, -3174, -2206, -1619, -1783, -2023, -2086, -2448, -467, -506, -348, 172, -90, 1207, 702, -808, 76, 443, 919, -288, -1331]
5843a331n31j217k5Q36J498n77O69J213m04K33J355n11j098M21K84J342l71q51
5825I35P35j25K42n54n39j050n23J09K45K75J326n90r63j296J475K866p94n33
5807A241j088J207L8l15O66n32k00n91L2K00o99KJ001k11M21j390Q9q95R66j238
5787a296P14L40J095j77o06Q68Q09j420j522J18K34O44N52J11l59j025J402K66
5769G48p95N91O52j565k831p95K194J056j009N50Q0j21R06j47j531N02J668p28
5751e75r55J046k5n29L5l65J366M5Q96n07p75n72j004m35k85K148J500J01p76
5732C34J155J419j835k86K14K09Q05J773Q6j296r73q35J27l48r91k12J332j039
5714c61J075J480l11r49j88P23K222K22j523j130J235P62pn33l7n85l72L42j128
$$ y = [-1331, -1862, -3079, -3104, -2268, -770, -1347, -678, 535, 131, 364, 1719, 1208, 110, 531, 815, 2157, 1786, 935, 1670, 1545, 1787, 1233, 694, -356, -879, -770, -525, -250, 1076, 486, -477, -1773, -298, 2568, 1774, 1241, 153, 1360, 1398, 1083, 1749, 1217, 1017, 426, 458, 658, -41, -39, 962, 751, 1172, -218, -129, -1024, -58, -1296, -582, -242, 853, 676, 70, 938, 1747, 327, -1195, -1077, -843, -199, 353, 464, 105, -920, 482, 748, -47, 544, 1196, -369, -3200, -3995, -1801, -745, -1754, -1204, -1124, -1245, -339, -486, -2017, -1515, 153, -575, -1530, -484, -509, -1038, -1003, -1368, -2, 43, 939, 432, -343, -915, -1919, -2354, -2639, -491, 1009, 1110, 334, 1489, 2908, 1073, 787, 1001, 1210, 2015, 3788, 3874, 2578, 1605, 770, 897, 549, -442, -654, 678, -361, 714, 2194, 1883, 934, 746, 1469, 3691, 3913, 2390, 1260, 2495, 3257, 3250, 2717, 2680, 2095, 1723, 2065, 937]
5695I37k534k78J10l77k62L44L83O4m67r7O93J529J0r97k3P42r82k99J348o04
5675g60o71j115m59L21K98p3j256J295J335J520L79j341k45J77R32K03j748J83
5657a025k06j283k327J552J573R92P62j13L23M83p77r95J051j516j381o27J956
5640a558M53R27R8K05J847J228j909j459j042Q30Q39J547Jp8j673j240L75L38
5622b71l89m85K77q25K384M40j861R51M38j283j033Q22J13l47J562O87J90j879
5604e09j189J27J05J475R62l36J269j6j460j024j7J298R69L28J007r3k164j516
5586g84j67L09J152r71j31j95J256J969p80Q07J23k038k191O55J962L93j451n07
5568e89l18n35p04P8K19N45N46J037k077o32J764R54o52l68R84n94k9M40j011
$$ y = [937, -1597, -1875, -1765, -2142, -2404, -2060, -1677, -1613, -2080, -2177, -1484, 45, 55, -942, -965, -223, -1205, -1504, -156, -760, -1431, -2546, -3005, -2684, -2386, -2459, -3715, -2420, -1085, 435, 814, -527, -772, -595, 337, 540, -1208, -1025, -1231, -2514, -4841, -3289, -1716, -724, 38, -75, 248, 731, -46, -1041, 10, -1506, -2887, -3514, -1558, -1105, -178, -80, 125, 1972, 3200, 1291, -168, -1210, -380, 459, 2006, 2007, 1929, 256, -984, -609, -271, -660, -1145, -868, -1693, 691, 1131, -730, 221, 659, -624, -1657, -835, -722, -1069, 493, 1180, 1370, -509, -1698, -1571, -1466, 9, 971, 635, 1904, 1888, 428, -596, -613, 685, 1654, 1982, 2989, 2896, 732, -784, -951, -642, 510, -461, -592, -787, 469, 2438, 1658, 2465, 2588, 550, -1641, -986, 976, 1369, -82, -589, -907, -1442, -2146, -2068, -1849, -1304, -758, 279, -1798, -2430, -666, 288, -364, -732, 252, -342, -371, 69, -942]
5549i42j48M60J80Q27n79j172N43P52o53r57Q41P24P82O49P2j802k809J028J644
5530e60l09P10N15J364j197k859m21N5J569P49p19r32j210J694N50P15P02K44
5512F60n26j16J82L94J04o8o44L34j041j516q92P1K793R99j276o1J076j494n56
5493a577J574L69j345J63o29q16J627J485l63q19L97j242n72j016p35k55J488
5476b266P33Q06R43k60J477L20j99j043n45O20L59r49r98M77J322J753O45j958
5458A237k371p76K75J810L89J78M0q54j778L41P61J468o87p1J136M9j091J621
5440A677J303j70p24r66K56m45k62k32j124j66R63j134j196J429J697O75R90o77
5422A894k225p27J67J221J407J199Q64k53r6j756j559P45J047K91r22n69j72J131
$$ y = [-942, -1090, -630, -450, 377, -202, -1374, -831, -79, -732, -1689, -848, -124, 658, 1307, 1379, -423, -3232, -2204, -560, -869, -159, 356, 1720, 523, -2336, -2757, -2702, -1133, -384, -1103, -2035, -3245, -1551, -1001, -286, 416, 660, 134, 18, 200, 594, 698, 630, -14, 320, -721, -2237, -3129, -3058, -265, 734, -542, -603, 473, -1021, -1577, -3, 366, -979, -816, -1445, -2261, -634, 851, 488, -331, 66, -1176, -1748, -2764, -3499, -3754, -2266, -1533, -727, 216, -44, 1433, 1753, 1554, 511, -34, 586, 945, -4, -1002, -525, 797, 2550, 3195, 1237, -1134, -1910, -1635, 175, 564, 742, 782, -72, -1850, -1509, -748, 720, 33, -38, 1098, 1147, 56, 1677, 2980, 2810, 2086, 1120, 1376, 931, 669, 437, -687, -853, 110, -1024, -2220, -791, 906, 1581, 2571, 1894, -331, -1058, -891, 330, 1737, 2936, 3800, 3547, 3451, 1695, 136, 881, 1928, 2219, 1297, 728, 556, 1687]
5404A687K992n34k246k966l31L50q33J244rL14j091L82J066J629K58j046O8O57
5386A591j601J01J803M95o73o9p66k56P76m27m50K025P6N74O9l8j919N71O24m65
5366B041L19j765j4O14J8r71O7o02j120J53K25J824r56n50L53j371m42L38Q63
5347i76J321L71n43J080p00r85o71n26n57J072J43j434Q94K412o52R17J25j045
5329B46k134MK955J830P29j585m054K441L916J089m265l865K149L269k03k383
5313A39k526J86J355O87J402J154j494k633l57J506J585j768j484M95k55n33J07
5296b434J549J843j162L55k96k05K5k05o28m07j114o52K437J268j353Q27j266
5279a418m75J134J780k80P3P89j483m45K18N9R92P65p20q88J60P4J153k030m23
$$ y = [1687, 4679, 4145, 1899, -1067, -1398, -1048, -1881, -637, -646, -332, -1423, -1041, 25, 1654, 1912, 866, 934, 1591, -10, 91, 1894, 2389, 1716, 1647, 881, 625, 1401, 974, 524, 2549, 2625, 3199, 3268, 3230, 1311, 1882, 2506, 2041, 2360, 595, 581, 1195, 1213, 242, 309, -293, -1413, -1260, -1035, 789, -167, -717, -364, -1735, -2177, -1839, -976, 345, 716, 173, 1253, 553, -432, -1103, -1629, -2186, -1114, -971, -2405, -1511, 901, 249, 1166, 1291, 246, -1888, -1884, 1071, 2901, 3630, 2045, -2009, 432, 4348, 5437, 1172, -2693, -544, 2725, 2522, 139, -2387, -2201, -846, -159, 1243, 2397, 903, -1730, -2087, -581, 1004, -764, -2248, -1753, -2008, -2541, -2434, -885, 958, -204, 151, -145, -350, -325, -530, -1158, -1565, -2679, -3331, -894, 374, -979, -152, -1418, -1893, -759, 1021, 741, 814, 1603, 120, -325, -107, -48, 944, 1709, 989, 101, 261, 335, 1488, -542, -965]
5260i65M63O61l9j585M07J24P90K24P01J80J565P55m92m8n5q88j056o04J123Q00
5240B061K83j553k788n70J482J092j043J35J352N63p85m75R20l70l64J137j90
5223H87N1K704j41k178r85j186M49P79j266j428l53L67J592N40J003j816p19J067
5205f33J195O46N93K88k107r75N17J589J139N61j484j826j181J122k48N99J172
5188I67L06M00L74j28k601r67J778J611k768j071Q33q4J1J805m05k096o1M01o48
5169b343K234M79P86m87j181M07R87N78l81l47j069j88J308R62m54P2J025j082
5151A306j345j414l38J897J421P26p50j357m62M08Q78J284R7P68j410j584j223
5134a098M18p84J195M69M41J987K46k958N82R3j374j10J684J13j986K47j115K95
$$ y = [-965, -502, 159, 120, -1465, -1058, -934, -144, 80, 781, 961, 2526, 3281, 2789, 2741, 2686, 1798, 742, 138, 1261, 2061, 2344, 791, -1997, -2567, -1085, 7, -1036, -901, 451, 1014, 229, -246, 674, 304, -60, 1077, 887, 938, 3642, 3501, 1323, 338, -848, -399, 380, -886, -2314, -2667, -2300, -708, -168, 835, -981, -1700, -633, 562, 1208, 1801, 2089, -18, -993, -476, 1113, 2252, 2813, 1329, -497, -1678, -556, -804, -205, 967, 1273, 1673, 2047, 1919, -682, -1649, 129, 1740, -1028, -2099, -1266, -1350, -1339, 466, 61, -2035, -2096, -1695, -2343, -109, 370, 1156, 669, -512, -105, 882, 1460, 1079, 732, -337, -525, 783, 1745, 1291, 1363, 2388, 1306, -39, -1453, -1791, 106, 1527, 2253, 1503, 146, -316, 92, 970, 2254, 2351, 3119, 1709, 125, -1098, -680, -1464, -269, 200, 641, 2628, 2874, -84, 498, 591, -783, -893, 791, 904, -1082, -835, -1950, -1655]
5116a655o30N01q25J495K248n09K74j502P46J67j8q69j216o05M04r69N53J433
5098i77R18j31q81J168J989j162j302K60p79j01L45q51j242P05J470M44Q1n09
5080e55M9M47q80N50J169m63N30J181R96k240m26P31j124M85M37j353j36J024
5062D22o2K94N15n03m8O13j66m28q2L07k65J046P50l044j312R48M70k12N79K003
5042A825J247k82q94j573Q67P07m25k97n44p31j522m79m73J178R28J708o71k517
5024a948M34K54J193O85M04n40l68m05j726j31J707N25q86q34J264J319P77j161
5006E63j73m52M95r69j78l21N52Q55J127j494k275L92p60j00Q28N23J635P94J270
4987B312qj261j153K12j321k223Q23K489J860O4k202j278J565j60p47O58o73k06
$$ y = [-1655, -2285, -1784, -2609, -1114, 1134, 625, 899, -603, 143, 310, 292, -577, -1793, -2398, -1994, -2963, -2410, -977, -59, -190, -1071, 97, 2086, 924, -378, -118, -897, -998, -653, -1504, -2746, -2041, -571, -127, -46, -555, -506, -59, -939, -389, 780, 317, 847, 2028, 3024, 784, 358, 1089, -35, 450, 887, -466, -602, 422, 360, 654, 1169, 666, 618, 1231, 1065, 637, 555, 862, 597, 1643, 2393, -651, -1963, -1015, -545, -757, -178, 1825, 3072, 2790, 1896, 323, 1190, 1897, 1472, 1175, 631, -100, -1622, -2101, -2574, -1396, -468, 1240, 569, -1948, -1514, -1260, -67, 618, 1022, 482, 114, -291, -2017, -2148, -441, 84, -802, -1636, -372, 947, 1724, 563, 390, -62, 433, -536, -714, -1035, -483, 372, 1499, 5, -2270, -1878, -2638, -2738, -1910, -1387, 248, 1042, 2312, 2304, 1043, -110, 102, -1219, -3442, -2619, -130, 1730, 1794, -408, -1686, -121, -281, -1028, -370, -1043, -1249]
4969a249M66N85J24j745l6Q86M03L0N70J569L8j000o59P49j764l34J393K3K39
4950B88k033mq6J098J323M11l82j373j32K566p89j891L33n89O45J555M61Q23j754
4931D70j101j03j051j143j032P56Q01m37m06j309J89K161p41O59J268j036j766
4914c821J533J257r15j815j90l50J449J776P13R3L99k89n23L83J712l72j779j850
4896b589p22J578J918j52P58j233q17l56k51j113Q17J733Q07K32r48n36K29J106
4878D61p5K7p54Q96p60J118K372l67r85N05j025o53m27J345J464N8j315l28N09
4859B066j992k102N82L64J243J62j29O16k38k50N65q91j86k07j609r14J555J526
4841A61J772N39j916k597j578R56J453J316k090j281L22K105L51r66o52L18j88
$$ y = [-1249, -783, -198, -74, -1819, -1855, -969, -566, -536, 34, 1603, 1641, 641, -18, 731, -1033, -1367, 26, 49, 288, -1745, -1749, -1835, -737, 586, 997, 615, -758, -890, 1676, 887, -1004, -671, -1260, -615, 940, 1401, 2224, 470, -631, -734, -1785, -2928, -3960, -3204, -2403, -2840, -3246, -4555, -4366, -2205, -2946, -2287, -1019, -2055, -3821, -2288, -1031, -1946, -3761, -3951, -4301, -2852, -1076, -363, -270, 129, -160, -683, -300, 1412, 1040, -739, -2589, -3311, -1733, 185, 33, 791, -442, -1259, -1615, -1866, -2979, -2162, -429, 378, 610, -338, -874, -645, 461, 386, 413, -341, 555, -205, 913, 3285, 2918, 1933, 2438, 1413, 760, 333, 1678, 3142, 3200, 1885, 1557, 2066, 74, -2028, -1446, -1082, 161, 323, 194, 810, 572, 322, 887, -4, -190, -397, -2006, -2920, -1365, 161, 1933, 2472, 556, -2041, -3619, -2663, -1210, 106, -1984, -3265, -2943, -838, -487, -1453, -2105, -1787, -1975]
4824a975M94O46O38Q84L87J164j445j808N60N30J048J053j075j49m71j041j253
4807a813L37m49J079O34M87j58K26J22j718o13N57r08N29j457m5m7J19J528J57
4788a433N16R0J125J147q96j261j58J06n73K66K30m75J75R66p58j265l67l61R20
4769b006Q80l20l50K386J184l7j001n47K327R59j080q72K23P56Q02o61k806p37
4751i00J302K13L30K415m51k189k14N38o21K89j016N77N33J486l09M3m05N65j137
4732A049j776l8R51O62p53N61l79P57n20r73j417r55L59K040J250J078l34l02
4714A260j85P40p33j66k27K48n05N60R97p70l06N2r1J202Q26J46j124l204j339
4695b619J932J836n58j12k33j59p14L44N26j74n17%O45K213J806o14j103j01j437
$$ y = [-1975, -1481, -835, -197, 687, 1074, 2238, 793, -1015, -455, 75, 1123, 2176, 1101, 952, 481, -560, -1813, -1476, -1925, -846, -212, 275, 117, 343, 465, -1253, -1866, -1309, -2217, -1688, -3145, -3190, -3237, -3118, -1590, -1433, -917, -827, 298, 1445, 549, -712, -870, -764, -1337, -1071, -841, -1316, -1141, -175, -933, -2198, -2565, -2926, -2006, -1126, -1446, -1796, 590, 1774, 1737, 736, 189, 2516, 3475, 2395, 1523, 1746, 2502, 3304, 2643, -163, -900, 402, 615, 945, 3360, 2909, 720, 506, 1044, 423, 712, -304, 273, 806, 2292, 1983, 2026, 1621, 2186, 1049, -727, -765, 186, 848, 95, 656, 277, 1034, 514, -459, -1876, -2831, -2472, -432, 818, 1896, 1562, 1260, 1075, 1815, 1082, 916, 689, 937, 432, 992, 1989, 1219, 913, 965, 874, 2076, 2902, 3048, 1924, -1280, -2619, -687, 1149, 591, 479, 246, 87, -627, -283, 243, 69, -448, -448, 197, 2410, 4216, 3602, 2499, 2398, 961]
4676I61N92j57N15J03O23j608p15J120j92P40J115j588k303J665Q59k057J584
4659A257K984r33j357k65M39n59o21j349k83j83j460o25l55R80K538K89k93J889
4641B093P19l98j073j397j338K90J308R16o40o38p89P13J5Q64P95l12j055o08
4623e35J267J183r77k34k06M02o8q61j667O49J674j71l0l45l47n19Q32k60N66
4604C53q12L51M10n7q6q52O46J163Q90j129n23r1o57Q74J011R01m07N75k00r06
4584A454p84m56J048j316j717pP14q23J28J215j589p07j17N19J663J163R87j27
4566A248R18P41L0j006j737N65J64j512k2j092j45P04J99m35J527K057j401j156
4548c53l79k18J196Q77j89p06O68n68r49O40M11M23L29p36k96q86J51K432N78
$$ y = [961, 1553, 1396, 1911, 2014, 2637, 1029, 314, 1434, 1242, 1982, 3097, 1509, -794, 871, 1730, -327, 1257, 4241, 3308, 1951, 1686, 2125, 1566, 945, -404, -687, -870, -2330, -2955, -3310, -2330, 208, 497, 204, 2093, 2812, 2414, 1341, -56, -1394, -1104, 204, 1120, 480, -158, -947, -234, -219, 645, 1440, 1128, 73, -535, 732, 1915, 938, 704, 498, 900, 832, -29, -1696, -1047, 627, 456, 426, 81, -266, -785, 47, -213, 353, -459, -108, 302, 245, 159, -693, -47, 1116, 2006, 877, 354, 263, -394, 480, 1491, 2392, 1985, 2560, 2360, 1454, 670, 214, 1262, -54, -1771, -1778, -1064, -1887, -1759, -544, -2133, -2840, -2957, -2438, -775, 388, 1375, 1248, 2166, 2907, 2937, 1931, 194, 759, 923, -589, -611, -1703, -1848, -1144, -945, -1380, 147, 2204, 803, -353, -732, -950, 246, 1123, 934, 228, 896, 328, -621, 19, 430, 853, 1182, 446, 150, -736, -585, 1847, 2425]
4529B425j831R80P53M08r8l62l54j166j191o4J284J227R4L8m28o25k64J23m43
4510E06R58P29j002n35M94j124o76n67o35J223Q66N02J204q41j603k88j089R1
4492a787J943k56p75J021Q90j187M74p16n61P19J98N56Q92L73J918N6j313j208
4474A237j921o24q4j485N41J156L66L77Q51M73N14Q65k031k40l36j200k16o14
4456b371J002L210L11m81K190R11j097j2K27j081p48Ml54k69l27j375q56l46Q41
4437f21j035o84K40J220K48j072K01J128K085j13K04P96K99l21N1R16R20j152
4419C310Q92p79j455j195o90j552N32J611Jn77M75P77L42j077o15Q63N79j417
4401B5L99l18o35p57k12R75J421P87O28Q74j59o48J76J17p95q32j29J626M96j72
$$ y = [2425, 594, 1574, 2327, 2735, 2637, 2275, 1921, 755, -436, -500, 784, 2011, 2105, 2143, 1715, 1090, 826, 949, 506, 1464, 2193, 1191, 656, 1150, 26, -650, -1217, -1852, -629, 237, 739, 1943, 1102, -501, -789, -1878, -1787, 156, -100, -875, 146, 1036, -151, 323, -393, -954, -235, -37, 519, 1411, 1784, 3702, 3758, 2445, 1237, -684, -1308, -1392, -2877, -2336, -1180, -814, -437, 414, 887, 1401, 2266, 235, -5, -341, -1541, -1757, -2371, -1369, 1841, 2152, 1671, 3861, 4772, 3675, 3663, 3890, 2809, 2061, 2065, 1711, 1442, 1115, -260, -1116, -1462, -621, -1656, -2340, -2100, -880, -632, -1704, -1503, -375, 1710, 1597, 1801, 2597, 2896, 2575, 2626, 3542, 4462, 3310, 4202, 3423, 1968, 773, 83, -1469, -937, 674, 675, 98, 573, 1350, 1692, 615, 0, 863, 1442, 25, 424, 106, -529, -1286, -1498, -523, 898, 1685, 2313, 3187, 3028, 2380, 2556, 2673, 1878, 1046, 917, 2543, 3039, 2867]
4381B867l83q71j45j381j55l09L1n47K248p7k96J32P19n51n93J42K34P38K033
4362C836L93l075j436J317N39O03K16k829r89J191J372k39%P29j002j802n94J32
4344a638J120R80N75j718l31O32L73M65k79j197l87O32J93o51j268R21J720J260
4326A402j126N52J329l32k185l26O23k48L50J331J064P04q35k56j453k313J064
4309f55J205O55O36R02n18j35Q2n87L33K29M84n79j583l33k49m99n59K69J380
4290D78M59N79J739J558p73j142j133j213k388J47K024L342l1l50o76j637j831
4273h48n30J116P9j280j640R84O04n88N27Q57QJ040o27p64o90J48J940P68K78
4254A382n02Q14p89r78P34q84j145l49j049M60O77q89q19J748J922J097q5j791
$$ y = [2867, 2484, 1613, 1468, 87, -68, -377, -346, -893, 1355, 1278, 982, 1114, 1833, 1282, 689, 831, 1065, 1803, 3836, 4229, 1154, -282, 1035, 1574, 2177, 2393, -436, -1425, -234, 1138, 899, 899, 1628, 626, -1176, -1770, -1638, -518, 462, 1037, -681, -1012, -380, -7, 458, 179, -1018, -1405, -773, -580, -1231, -2499, -1578, 142, 1402, 276, 828, 2157, 1825, -360, -686, -63, -311, 39, 1370, 2434, 3138, 2303, 2047, 594, -1719, -655, 550, 1205, 1841, 2743, 2225, 2090, 2172, 1585, 1918, 2147, 2631, 2052, 469, 136, -113, -612, -1171, -902, 478, 937, 1516, 3255, 4813, 4040, 2898, 1765, 552, -1836, -1689, 335, 3677, 3646, 3296, 2620, 983, -848, -1378, -262, -183, -1463, -3103, -2119, -1515, -2103, -1576, -719, -711, 329, -298, -1062, -1752, -1604, 336, 1104, 1382, 880, 1694, 905, -73, 661, -223, -1368, -1717, -2766, -2306, -1629, -2518, -3337, -1589, 333, 1430, 1345, -446]
4236d46n86J329J953p2J315J059j780k931q85J68Q14R04O43J77o67J138k36o92
4218A205K80k34P27J128P30j299M14m69j750j628k121k64O36J57n74J575J719
4201B32M55q4j27R56j788q32j16J208J084k47O65J481p89L94R07l39R03m19n81
4182B963j832K1M31q44o25l86O96P67ok009J310R48j062J54j822j071q76K001
4164a242J664l26J057R93L53n8K2q37k5J35n92o77n43q19j29J929J607j326n73
4145F13M59m65L13Q65L20R54K38j793q51J409N1j204P09J217q86Q84L3k5K19q16
4125B244M47m82K39j19j208M65R82O95M90M13M72J507o57j707j433j647O97J313
4107B711k65j503p11j53l1qK619J373j086r01j706m39P86N47j393j645j07J265
$$ y = [-446, -1032, 297, 2250, 2178, 3493, 4552, 2772, -159, -1044, -876, -62, 842, 1485, 1662, 995, 2133, 1897, 1205, 1485, 1251, 1978, 3106, 3836, 2537, 2951, 2482, 732, -896, -3017, -3281, -2645, -2488, -3062, -1487, 232, 687, 603, 476, 1432, -356, -1188, -1304, -96, 988, 741, 1406, 2887, 2098, 2492, 3399, 3060, 3963, 3544, 2963, 1131, 1152, 1583, 739, 114, -272, 424, 1191, 1185, -824, 486, 1434, 372, 526, -1296, -2367, -3243, -1242, 422, 96, 1153, 2146, 2499, 2441, 2463, 1626, 1601, 1736, 1144, 467, -76, -895, -1024, 905, 2512, 1186, 613, 1072, 607, 920, 1785, 2105, 3059, 3297, 1504, 653, 2062, 2113, 909, 1618, 2835, 1949, 2833, 2866, 2841, 3060, 2244, 2691, 2209, 2448, 2329, 1121, 1586, 2568, 3263, 3753, 4166, 4638, 6145, 5488, 3781, 2348, 701, 1398, 2711, 2446, 943, 232, 79, 48, 40, 2659, 4032, 2946, 2045, 339, -100, 686, 1233, -160, -1805, -1912, -647]
4089f47J655L42K87j642j845J270K611j412M18P9M70n3J355n83j519p76Q96j165
4071b59n53O18J778J667j013m05J004q02q02o38k159J376K074K32j891j619M17
4054i75J866j07P3r96l87l2P47J697L5j207j003J506j00j551R82J281j094m66
4036B69K3R82o87k30R63R68J03k571j949J454K083K25j506j294M15R40l17R53
4018H24r56j609O58J743l27n58r51o50J316J453K291n3k578L02p32r80j70j644
4000b621n24L47K755J981P55m25J065j184j505J053k82j107j103l42N17P05N75
3983F60K000R82j002j254j351Q67J827r2r03k33p82j326l14P7K016M47r81m53
3965A85m85M8J794J405N1k591j848n90N35J078Q08L77j887j809n68Q55J223m52
$$ y = [-647, 1008, 1350, 1637, -5, -1850, -580, 2031, 619, 1037, 1116, 1586, 1533, 2888, 2305, 786, 10, 906, -259, -812, -194, 1584, 3251, 2238, 1833, 2837, 2035, 1233, 595, -1564, -188, 1886, 2118, 227, -1392, -975, 891, 784, 857, -139, -526, -558, 189, 1886, 1921, 714, -289, 1217, 1117, -434, 548, 1829, 735, 269, 292, 1274, 587, 357, 1320, 2288, 2391, -180, -2129, -675, 1408, 1633, 127, -1167, -752, 188, -129, 824, -132, -1741, -1083, 660, 333, -225, -1176, -1826, -510, 943, 3234, 3181, 603, 905, 173, -807, -977, -2621, -3145, -2798, -43, 1938, 2693, 2268, 3333, 2149, 644, 1697, 1415, 308, -795, -1137, -620, 85, 660, 2660, 3642, 2640, 1386, 35, 902, 2729, 2637, 1734, 1501, 719, -607, -921, -844, 1172, 1619, 638, 185, -300, -252, 1542, 2947, 2998, 407, -1441, -2031, -1496, -418, 390, 767, -1120, -2929, -3497, -2642, -1419, -1871]
3947a871j243O30P39J451M2j699j33L419J318k166J50P32R0K214P12j653q91j247
3929E94m75J295j063K72j707q86K143j028q31J068k80M99j60j778N77J696J586
3912A522L92m11O46O63r2j530j629p7M87J810J818J88j142N22J064K83j480o42
3894B392k93J109j86J188K18j608K6J039q14j195n60o29k014M89Q51J058Q13J644
3876C528j211j478J22Q29Q1l75j626j472L42J023J00j136L41K47j21K09m89O89
3858c97K40p85o20R05M66r39k02R70R58J83J072q15j102n75L37N26R23m92p55
3839a02J237k22j610k54M15P24O56R75P85o64k688r2J147R88m08o74r53P47j63
3820a56Q45Q10j137j909q61P61J524J155R13O84n79j342q31j016N99J837P87j668
$$ y = [-1871, -3114, -2484, -1745, -294, -252, -1951, -2084, 1335, 2653, 487, 637, 1369, 1459, 3673, 4385, 2732, 1841, 594, 119, 1414, 351, 623, -1084, -1970, 173, -855, -1686, -618, -898, -399, -559, -2337, -1760, -64, 1522, 1914, 1503, 2149, 2812, 2720, 1190, -439, -516, -29, 1781, 3599, 3787, 2645, 3167, 4231, 4514, 3034, 2392, 2099, 3208, 3022, 4210, 4428, 2820, 2846, 3885, 3071, 1876, 1316, 687, -1327, -838, 13, 1071, 1884, 3528, 2317, 839, 961, 1790, 1871, 1496, -130, -1602, -1260, -237, -137, -1273, -932, -685, -806, -597, -1086, -397, -157, -942, -1562, -657, -191, -1130, -1332, -362, 596, 779, 1851, 1036, -66, -641, -304, 222, 1145, 653, -102, 1135, 913, -697, -951, -536, 188, 844, 1819, 2604, 1940, -748, -840, 307, 1295, 887, 213, -740, 7, -156, 689, 1499, 362, -1547, -2408, -1647, -123, 1032, 1945, 2629, 2050, 708, -123, -1139, -540, 1297, 2084, 416]
3802D16j107n99n2K85P28P7J092Q00J102R40K0p68j489p55N32m76L49J677M80
3783C252j33m37R35l64n78j407k65O88r30R4K080K388j272o05j559j459K25N52
3765A205O28J03m31j094P76J786j311o08J827J475r45j233r11P0L20N28m78o19
3747A088k024K6K658Q11K85P88Q12k5p57j605n73m59p52M36r40j992M2J549Q5
3728e47J726J158O16m18m54m40l68O19M93n97o3k513n89J167R85N63R78j683o49
3709a6o65m86m76J189K079m34q27q4k86p13Q50J506N52m12o62k05o91j436J254
3690C7J905J146j803j711M19Q9j498P83K64j460j46R40M30k87L64j348O19J075
3672a82r00o50m73J486Q8R93P97m82p96J291N29j105j245P58K039O25j143j79
$$ y = [416, -691, -1290, -1342, -1057, -329, -252, 840, 1640, 2742, 3682, 3702, 2934, 1445, 690, 1222, 746, 1095, 2772, 3252, 3119, 2682, 3617, 3253, 2675, 1268, 1003, 1691, 761, 855, 2935, 5323, 4051, 3446, 1887, 428, 653, 1205, 1833, 1936, 1505, 411, 1187, 2973, 1662, 1054, 2881, 4356, 3411, 2178, 1267, 1337, 1657, 2185, 1707, 1088, -936, -910, 1748, 2559, 2844, 3632, 4444, 4419, 3662, 2057, 1484, 1025, 273, 709, -231, -2223, -2181, -632, -547, 1179, 2337, 2953, 2535, 2081, 1641, 1273, 1892, 2385, 1788, 1725, -788, -1377, -210, 775, 1338, 2316, 633, -16, -681, -1167, -1643, -454, 1625, 1191, 364, 280, -6, -719, 131, 1637, 2189, 1777, 1115, 910, 219, -1217, 37, 1942, 3088, 1285, -426, -7, 82, -1416, -633, -369, -1829, -1975, -1035, -605, -892, -528, -1876, -1257, -182, -1082, -1732, -2205, -719, -631, 362, 1159, 677, -119, 1172, 1701, 596, -649, 109, 2148, 2773, 1630, 1451]
3654A451k25L72j109j303O7J896J272q53R29k57J381j59Q76N53j446o06J591n08
3636C922j556o25j70%N5N27K87j217j027K153Q0j714Q02R42M08P65J134l32q54
3617C580j799k016j80Q05j58l21r77m83M39P71J422l54M02J360J89j192Q10J978
3599D276K33k864j430P00R9J63r82m50Q41K34o93l2M67p96N18j259l55J107N34
3580C11J707k212r24O5Q8o22R00J74J157l76P31p7m90p73m01J222J035O75J449
3561C639M2j101q75n09r51R01J481N18M6k83r07j152L10J130n1l0j87k74Q40M61
3541C048m94l87R98r87r47rJ171k3k58P82N92o58k187M4J128j556j759r45K18
3522b229J145O22J99J411j081p06J746P10j244k078p39P18K729J174k01q11P9
$$ y = [1451, 1226, 1598, 489, -814, -747, 1149, 2421, 1568, 2497, 2240, 3621, 3462, 4338, 4891, 3445, 2839, 4430, 3922, 2366, 1741, 1571, 1571, 1626, 2153, 2440, 1223, 196, 2349, 2429, 715, 1517, 2459, 2867, 3632, 4766, 4434, 3580, 1781, -235, -415, 390, 232, -89, -1066, -1549, -1110, -339, 1083, 729, 1131, 2491, 2680, 1488, 2298, 4276, 4509, 1645, 215, 915, 1014, 1177, 195, -255, 586, 820, 127, 95, 562, -234, 284, -975, -1330, -223, 311, 2018, -194, -1118, -1053, -965, -1587, -687, -513, 644, 268, 999, 922, 432, -341, -742, 480, 1515, 2190, 3639, 3681, 2580, 1705, 1196, 245, 1146, 2627, 3145, 3191, 2908, 2001, 849, 1159, 2289, 2238, 2208, 2021, 1747, 2587, 3048, 2554, 2167, 3165, 2178, 1231, 1222, 2393, 2370, 2112, 2894, 3486, 2828, 641, 685, 1813, 257, -1502, -2447, -2229, -1084, -462, -263, 1148, 67, -639, 1107, 1817, 573, -1505, -2244, -1526, 1203, 2377, 2176, 1365, 1444]
3505A444J149M51o60r06j450k25n68n26L45j56N5N30J019K80j478j416n9J359
3487h12L6n39J956J96Q88m32j903N95m92o52n17Q40O92q39k72n11k24J597J146
3468G53j972j058r31o43K357K217J60l60N08O85Q10o20n68J176l47j340J71O55
3450A653Q39j206j227N37K97q48J620L21o03L50R54J84j610n24j208j193O38J603
3432E77K278M77j621K73K33o70j366J135M15K23m28J791R54j729j365r80m72K815
3414B540K330j147j352o9M09l56q88j040R04L76M23R63l43m52J068q89j682j557
3396g62K32J210M96N55j608j568J903M55L94m36j575l0K34K61J682n97j055P20
3378E11J709j65l92J11J005J269m09j690j769j083P7J509K306R98k214j277M64
$$ y = [1444, 2593, 3044, 2384, 1478, 28, -197, -765, -1291, -946, -1102, -1047, -517, 502, 782, -696, -2112, -2171, -812, -776, -1315, 641, 837, 1725, 1293, -610, -15, -507, -1159, -1676, -836, -144, -983, -1255, -1766, -1990, -393, 753, -1219, -2277, -3208, -3851, -1494, 723, 883, 523, 1031, 1716, 2526, 1906, 1338, 2514, 2167, 827, 998, 1653, 2492, 1286, 59, 596, 893, 45, 1665, 1986, 1383, 1733, 2687, 2871, 1261, 737, -471, -1664, -1026, 577, 2855, 3332, 1711, 1984, 2217, 1547, 181, 1316, 1731, 1954, 1526, 3317, 4271, 2542, 1177, 197, -275, 2540, 4870, 3723, 2371, 2302, 2711, 2355, 1467, 427, 1331, 1707, 2130, 3093, 2750, 2298, 3366, 2477, 795, -762, -530, 680, 1176, 1731, 123, -1445, 458, 913, 1307, 871, -704, -734, -500, -239, 1443, 846, -209, 511, 2220, 2055, 1663, 1774, 2779, 4048, 3639, 1949, 180, -903, -826, 683, 2989, 3987, 1773, 496, 960]
3361I60j082N41J540J415Q43j750q74o88N3J94j047q35J133M29p48o14l17n35
3343a382N27Q04q9J886L47J067J724N04j436k247r33n18J231Q34j806K6K128K279
3325D946KJ24j890o51M86k41m7j0j351j143J725%j133p68M41K51j139k222N70
3306b050K174R11R43j34j369j026N8R80J972K33q52L41o3j899j99J648J424j065
3288B027j337o40R36J62k61j627L53K049j67j328J51J228n80p61J393k97k41J143
3270B203J106o46J43n72k257k150r98j229J791J336J360O26O40J018l26O40j154
3253A531j190k86n78n82R33l86L01L537Q92j820n04j099j229J356Mj56j259R23
3235C88J827j015p58R31o18n08m24J16j359K19j08J152J728J507K06o3k422j051
$$ y = [960, -122, 419, 1959, 3374, 4217, 2467, 1593, 905, 958, 1152, 105, -730, 403, 832, 84, -530, -847, -1382, -855, -51, -140, 1746, 2093, 3160, 4884, 5388, 3952, 1705, 772, 254, 1485, 2319, 513, 539, 2667, 4946, 4948, 5072, 3182, 2531, 3017, 2776, 2729, 2719, 1368, 225, 1950, 1950, 817, 49, 490, 741, -398, -2620, -2050, 124, 1035, 1978, 1844, 475, -551, -493, 487, 2459, 2692, 1840, 2181, 2118, 219, 20, 1668, 3092, 2027, 690, 50, 986, 1148, 887, -740, -387, 1662, 1495, 167, 318, 1546, 966, 205, 1598, 1301, 1060, 2203, 3309, 2663, 2806, 2234, -23, -2173, -3171, -4400, -2609, -1273, 87, 713, 1353, 2371, 2045, 2685, 1531, 341, 55, -523, -1105, -172, -558, -257, 3280, 4172, 2352, 1848, 749, -480, 876, 880, 724, -535, 388, 2215, 1200, 442, 1373, 755, 247, -177, -61, -1420, -1201, -1309, -157, 1571, 3078, 3284, 3221, 799, -252]
3217b52N64R76J636l82j636j352J374q3k27J050k80j094j098j75NR0p87P69J022
3198A20J171Q78q0qJ079K74j943O29L70q12j068p9k47L27J15j372P88J852l27
3179A667l7Q36K80K018Q94o28j961L55P89Qm96J329j330j594j358J95J757L22
3161C046m03L15J51M00j419j283k16j007L92J080j25j079n42J555j83j087m0P17
3143B72J213m77p06N00J31l34K30j132J73n12M28L350J765Pp97p15k492j067Q8
3124g5Q23P0p81l20J602n75M42R57j388K1J999O76j417J63J020k84K60M26o67
3105B952j437R82Q87j259o13j098Q2J918r30J98M78n11l69j347j027J259J285
3088A450o87Q92k76k17m13o10j24l44j154r3O16Q67Q88N64K265j32o21j13r90
$$ y = [-252, 312, 1288, 2924, 2542, 906, -446, 928, 845, 618, 1668, 1388, 294, -804, -979, -974, -884, -1671, -902, 120, 1291, 2169, 2089, 2081, 3160, 3434, 1491, 2120, 2490, 1678, 610, 531, 284, 611, 726, -646, 142, 1994, 1667, 1630, 2466, 2746, 4764, 5658, 5030, 3069, 3424, 4213, 4221, 3725, 5054, 3724, 2130, 772, 967, 2724, 3046, 2643, 2958, 3109, 3509, 2090, 807, 591, -416, -24, 1056, 931, -148, -690, 865, 682, -405, -445, 272, 1485, 1008, 302, 802, 933, 599, 829, -303, -130, -642, -214, 3136, 4901, 4908, 4111, 3396, 904, -163, -75, 748, 818, 37, -283, 1319, 744, 1186, 2143, 755, 776, 2775, 3451, 2034, 2197, 3217, 2933, 3193, 3619, 2952, 1515, 2497, 3384, 2125, 1512, 414, 496, 2414, 1484, 1682, 2160, 1649, 1280, -67, -1094, 165, 1450, 763, 1655, 1379, 1162, 749, 139, 15, -329, -1483, -1576, -960, -93, 795, 1359, 3624, 3492, 2871, 2758, 1768]
3069A768k39p85K66P9J376M65j052J337J047r67r21P51P15k358M49n48j68L73
3051A588Q7k80P27J042m21J45j140n68N18Q39j001J152n57j577m72L02N29j194
3033b81K16J465m41J95O7Q45K145j304j782j106j40K93L17J04o2K54n59N63m52
3014C37M80J472J359j311j492o68P35P9p20l73J608J399o27j827L97O59m67j50
2996H90J025Q31j88r80j56j47l04m48o53m2o0J34O72J717L33j086p8J019j332
2977A147m88J081N44k95O96n43q46R40o67k297O08J937p59j419J654R07p83m43
2959I74Q58p68k13j95m31N71J310K30j624q22L93l17q0p99n42J435K245J986k95
2940C916r93l99q41k07N10N02j059o30j06L04J1o01K009J243n59l429M4J977M00
$$ y = [1768, 1529, 744, 1010, 1089, 2465, 2930, 1878, 3215, 4262, 3295, 2374, 3125, 3840, 1482, 1931, 1383, 1215, 1588, 1675, 1395, 2122, 3164, 2743, 2888, 1748, 1180, 1698, 2537, 1536, 2688, 2131, 554, 82, 384, 913, -281, -65, 1400, 959, 1154, 1221, 2066, 4211, 2907, 1125, 19, -121, 172, 489, 593, 531, 785, 226, 789, 337, 817, 2289, 3648, 2337, 845, 177, 912, 991, 271, -102, 1506, 2905, 2278, 451, 848, 1507, 1040, 890, 1915, 2746, 2558, 1578, 1422, 1275, 971, 523, -130, -172, -232, -98, 574, 2291, 2624, 1538, 1460, 2479, 1147, 659, 1740, 2284, 1989, 2685, 2142, 1296, 2236, 1569, -728, -120, 1817, 1058, -361, 1293, 2200, 1417, 974, 1832, 1064, 851, 656, 225, 796, 2106, 2336, 712, -110, 283, -34, -114, -913, -1455, -20, 2225, 4211, 3916, 2923, 2524, 1683, 1476, 1986, 2488, 1429, 799, 693, 997, 1008, 407, 2416, 3659, 3100, -329, -285, 1692, 2092]
2921B092j215j07J87J304J93l31O63K6k127L92K21M64L95n86L57J1K91j331n99
2902C00k72p52j445J459J501R23K59L06r1j490p53P84l4O15j983k55J157J204
2884A433Q39j633q77l78N85J194j400r49r54Q77J556M86l83o98L37K53P04j547
2866e55J94J067Q59j39j260n8l22l73P99O49J492j299j951L1J421O67N0J73Q53
2847B298Q67K29j15N3j577k783l50J466J035P75n7J32o53j607q39K374N86l47
2829A487N23O34j087L22p51j205J649q74J189j308j108J047N80Q8m24J131Q08
2812B701p0M62p58j7j194J514J988j210j592r52k84J425l32j263j528o58M30J728
2794C90K11N86Q23l11o7J132p11k27k66j277q12r60Q62L154j43n10n6n9J00J21
$$ y = [2092, 877, 770, 957, 2261, 2454, 2123, 2786, 2812, 685, 1077, 1298, 1762, 2157, 1571, 1928, 1939, 2230, 899, 300, 28, -724, -2169, -710, 791, 1714, 1973, 2279, 2188, 698, -55, 729, 695, 1310, -673, -928, 229, 1433, 2272, 639, -238, -616, -31, 1163, -237, -1186, -2140, -1263, 293, 779, 396, -302, 35, 288, 992, -555, -361, 706, 1565, 1426, 166, 108, -214, -587, 212, 861, 2353, 1054, -897, -866, 555, 1222, 1272, 1445, 2298, 3165, 3394, 3279, 3332, 1755, -1028, -1378, 88, 1123, 1898, 1841, 1973, 1320, -287, -1126, 1248, 1834, 1487, 2010, 2644, 1557, 1879, 1128, -77, 1572, 698, 1887, 579, -529, 518, 1098, 1186, 762, 1893, 2701, 2631, 3093, 2335, 2318, 1124, 2638, 4626, 3416, 1824, 872, 588, 2013, 1681, 418, -1110, -1768, -1338, 390, 601, 1187, 2010, 1699, 1632, 2764, 2053, 1826, 1560, 283, -529, -1489, -627, 2527, 2384, 1874, 1818, 1759, 1859, 1980]
2774A980k10k039j348J068O8J328N27O97j212j113j583N60k20K10K012K224K1
2757B970m67M77r75J29l52k90o43O93K19j372M53N98n9R56j12l45L45k19j364
2738F42q42m20J444o64o67J265K806k03r62j29n51O94N38o30q28k537K84J960
2720A200J329p15j052k141j035p8R60K535N09k537j976P73k72L9J628O1L50n60
2702i82M77R57Q92J436m36j669O76M10l64q69m2p39M08p65l6r2n96K371M51O7
2682A555q37j361N49l63k06o84J94J504N4o95O59K22q0J473q71k3m03r90M40J148
2662A285L07L95j90p87n06n37J021P15r29n50K07q3o47j881O04K29P7L14K86L67
2642c03q90J283L313k27r22j021o76o9M98K192p4q25M22j321n08L06l50Q5q4r83
$$ y = [1980, 1770, -269, -1617, -549, -481, 847, 1374, 2071, 859, -254, -1837, -1277, -1497, -1287, 725, 2949, 2970, 2503, 2980, 2005, 2134, 1782, 1492, 849, 1542, 1761, 389, 842, 1440, 1381, 2337, 2225, 1880, 2225, 2006, 642, -200, -620, 824, 160, -507, 758, 3564, 3361, 2399, 2270, 1719, 2413, 2951, 2321, 1493, -1044, -760, 1200, 2529, 1814, 762, -1379, -2414, -2492, -1532, 1003, 1512, -1025, -3001, -2228, -2500, -2461, -833, -772, -422, -982, -505, 452, 1344, 2780, 2344, 675, 1351, 1761, 1397, 528, 486, -253, 155, -610, -646, -738, -1334, 1037, 1488, 1555, 718, -643, -94, -457, -663, -1347, -1153, 351, 405, -290, 369, 591, 511, 1984, 1113, 1090, 687, -303, 137, 1285, 1592, 1987, 1797, 1010, 504, -33, 988, 1703, 774, 224, 431, 348, -299, -2180, -1576, -1347, -1270, -956, -670, -303, -1193, 90, 3403, 3176, 2254, 1233, 557, 488, 986, 3178, 3104, 2279, 2701, 1380, 872, 1178, 828, 913, 829, -154]
2622a54M36q13n60m40N55K076J908J4j391M20J243L46j102j419j547l74p14n36
2604b052K482J107j604l88p95K06j29J98J232j140m55J107L26N90j093J10K682
2587B384J880J080Nj583p92j819j050K7N55O24J626l44l8K278j190k063r57N3
2569F76k18K162J392R47j651j348J39j614j417K22Q51O40j46O19j095K64k91Q5
2551B17o3M97P89j281j000R35P42q40j376M00O64J083J551Q55j186l581L7R00
2533f57K14O14k32L84p9j32M31m01l30m30m9RJ277K249K59k004m2J23Q15r43n14
2512E62O6M3K064p91l42m08j161M97J487J260j76L43j06j658j258j881l47J051
2494g55P05j547j59M04J099l2Q3J163l37j516P72K042K13j203L38K248j81k238
$$ y = [-154, 282, -531, -1091, -1531, -976, 1100, 3008, 3022, 1631, 2051, 3294, 3640, 2538, 1119, -428, -802, -1516, -2052, 430, 1537, -67, -455, -1250, -1044, -1173, -975, 257, -883, -1338, -231, 95, 685, -408, -298, 2384, 4264, 5344, 5349, 3766, 2974, 1155, 105, 132, 687, 1311, 2937, 2593, 2555, 4833, 3643, 1580, 623, 676, 458, 2620, 4012, 4959, 3308, 1960, 2099, 485, -932, -710, 141, 781, 635, 1254, 159, 423, 132, 217, 154, 651, 1440, 159, -841, 94, 836, -4, -1380, -980, -316, 767, 2318, 3173, 1987, -1594, -1557, -657, -443, 171, -61, 323, 244, 112, 543, 142, -188, -618, -667, -658, 619, 2868, 3127, 1123, 1081, 1204, 2019, 1076, 562, 628, 671, 2735, 1944, 1602, 1194, 33, 530, 2017, 3277, 3101, 3444, 3338, 1680, 422, -1459, -1806, -755, -50, -1597, -1756, -1352, -253, -285, -202, 961, 624, -892, -120, 1922, 2135, 932, 1270, 3518, 3337, 1099]
2476A099o64Q06m2Q57j852m64Q64L33q14K256J063j884j84R8Q83j245k709l51
2458a950J974J748l49j269L41L15K30J412L09j919k118j315J98J077K242J951
2442B877r57j410P2P34j528q12P87O69j757M65O47P08n41R58P14r93j713J42J766
2423H28j365k08P90K057J052k515K85Q73n92O40K17M02L71j47J3k25P7N91n75
2404B569n00o69K78k21J425J356o62r22o41j239j194q10j16J999J185l63J036
2387B511K21l0R26j106l5k6r75l21l63q06K53J458P2J428j008k356j213J502K260
2368B392r1m90k39J71Q44j087l21J382q60j747o57J18l63J29K41Q62K86o3j13
2349C94q26j375M20R68j482J142P64K96j87o14r33o05R33k166J77K726K778m29
$$ y = [1099, 435, 1241, 1199, 2056, 204, -260, 604, 937, 123, 2379, 3442, 1558, 1374, 1472, 2355, 1110, -1599, -1950, 24, 1772, 1423, 154, 495, 810, 1040, 2452, 2761, 842, -1276, -2591, -2393, -1316, 926, 2877, 1920, 510, 582, 1316, -212, -1024, -237, 432, -1325, -860, -213, 495, -46, 912, 1626, 633, -1080, -938, 828, -537, -745, 45, 2102, 3154, 639, 924, 1797, 1205, 1845, 2062, 2464, 2835, 2688, 2701, 2476, 2553, 3144, 2569, 2069, 1400, 1678, 1457, 2882, 4238, 3576, 2654, 2013, 774, -420, -1230, -1346, 653, 1838, 1475, 2511, 2732, 2702, 3628, 2522, 2487, 2461, 1486, 1165, 802, -4, 249, 1707, 1779, 3207, 2199, -157, -1370, 132, 2392, 2301, 1811, 1572, 1743, 2587, 1500, 1179, 2561, 1701, -46, -703, -585, -948, -819, -578, 284, 570, 507, 394, -432, -1807, -1387, -419, -1901, -759, 5, 301, 114, -500, -1433, -2038, -1105, -3271, -3094, -368, 2410, 1981]
2331A981k012np70Q5K678O69K33j93J73j625Q76j049j383N53n02N88n4p51M68
2312d0M83J620j028r74j469K050P82J764o58j372j440m28p80o6lp58n51K809Q95
2293H36j042n95j154m59J452P83K73J738n60L9J203n13R8J7o47j397j029N67r60
2274a350R04J28n68Q88K819Q00k989n37J131K67p23j878K94q6k15n38r97J211
2256a439J29j57J481m6M42K99m88Q78Q24k69O54k25j92Q35J331Q01j618r37l38
2237A965Q4K24K13M84j205j016O80m83P42J565J831K63p97j422j603o88j656l56
2219a175q7n7P18J219Q12N09J042O9j05N2L99j093r94j278r55J783M84m17r20
2200FK27o51q28M95R70P03N98j86k83J039J475L09j954k838N00J954j51l51l26
$$ y = [1981, -31, -36, -806, -721, 1957, 2626, 2859, 2666, 2839, 1214, 2090, 1041, -342, 211, -291, 297, 243, -508, -40, 443, 2063, 1035, 61, -1408, 642, 1424, 3188, 2530, 1158, -282, -710, -1490, -1556, -1559, -2317, -2868, -59, 836, -206, -801, -1955, -2414, -962, -179, 94, 1832, 1272, 1311, 2514, 2001, 2099, 2116, 1469, 72, -957, -390, -1350, -446, -318, -886, 2, 2821, 3621, 632, 95, 1226, 1493, 770, -1108, -814, -900, -1115, -1653, -2650, -1439, -1310, -1467, 14, -32, 410, 709, 221, 1099, 1923, 1654, 2308, 2083, 1891, 2726, 4057, 4858, 3240, 2303, 1965, 2049, 2273, 2486, 2970, 1765, 749, 1429, 946, 1688, 3253, 5084, 5347, 4550, 3128, 1525, 837, -819, -1175, -1262, -1319, -601, 618, 1430, 1939, 2981, 3050, 2945, 2997, 3396, 2303, 1309, 31, -924, 859, 1343, 926, 6, 233, -418, -1246, -751, 219, 922, 1520, 1334, 1051, 2090, 3565, 3874, 1920, -918, -418, 1536, 1385, 1034, 708]
2181G08O41r27k701J57J439o71P75K01j50J126Q79m55j152k505j37k55J423Q45
2163g59K16j608RJ238J240J217O15j581j626j645j870L46J612R89Q42J208K17
2146F60J056N97n61q75L94k49j186J023%J58m73N31J308m96J006p35j216M44p16
2127F70Q0N3J645o94j039j406J25R85M32M12M10j333o10J295q7m71r90J184J248
2108A909O96k64R9j210j25M2k20j411k207O34M19R98L011R70j711r20J633O28
2090B971n73K38o60J356J136R18J516q46k170j707j043k14L97Q83J95m71j742
2073A84J638l95P7K79j389j467n98O24j243q77Q38q17o75J502J50o08m99K029
2055a247J057k67k56j88n32p91J20n86J425K715J137p17K96j369j193O12O2j85
$$ y = [708, 1349, 422, -2279, -2122, -683, -1354, -579, -378, -528, 598, 1477, 1022, -130, -2635, -2772, -3027, -1604, -759, -543, -2151, -2142, -904, 336, 1553, 2168, 587, -1039, -2684, -4554, -4208, -2596, -1607, -765, 443, 660, 1716, 2313, 1752, 877, 1271, 1022, -164, 859, 859, 1017, 544, 1075, 2383, 1887, 2893, 2158, 942, 1386, 670, 750, 803, 2448, 1754, 715, -691, -566, 419, 851, 1263, 1673, 340, -270, 1025, 938, 467, -523, 661, 1909, 2605, 2341, 2440, 1230, 1105, 1147, 927, -484, -2691, -2057, -1638, -640, 2371, 3341, 1630, 710, 2343, 2971, 2398, 2636, 1976, 3332, 4468, 5386, 6902, 6056, 3886, 2179, 1136, 922, 1319, 2202, 2397, 1926, 184, 1822, 1427, 1504, 1783, 394, -1073, -1671, -1047, -2290, -3167, -2329, -3146, -3821, -2319, -2169, -2777, -3276, -1247, -190, -457, -713, -901, -1433, -2224, -2104, -2690, -1265, 1450, 2587, 1870, 2166, 797, -396, 216, 278, 93]
2037I3R72J218M58k50m70j435j347J58O05m99j48J389K008m5p63N94k79j356O15
2018A518J753j532m69J572J43j99k850r93K093P45j29k64q33j289m25L42K046
2001A229j88r59q78J1N05p6j061j86J937K372M99j588j584j400M14J761K69N14
1983A591j71J466l34M06j17K07m40j811o84q86J014J716L17o31j643j328R48J479
1965A099J549p25o8R70j122q08r90j014q85L68O46N73m10j300O10K46R00N40p32
1946e53M00j2j113L51P07K476R98p69m14O47j177r50N19k17K41l04M08k469l32
1927a563J487K313L35j582j498j78P25j288k29J274P43j029n70J016O65M50j279
1910b08r72L94L56l18J88K058K034j935k024P44r50r95q81K153M43q28P85j88
$$ y = [93, 1065, 2283, 2741, 2491, 2021, 586, -761, -603, 2, -497, -645, 744, 2752, 2707, 1944, 2538, 2259, 903, 1518, 3271, 1739, 1270, 2842, 2985, 2786, -64, -1057, 1036, 1781, 1652, 1388, 555, -734, -1159, -817, 1229, 1041, 82, -796, -785, -280, -356, -1417, -1603, 334, 2706, 3205, 1617, 33, -1367, -953, 808, 1077, 1591, 1420, 2886, 2552, 2958, 2841, 3048, 2608, 797, 113, -773, 241, 1957, 2274, 1643, 0, -1328, -380, 1099, 2648, 1923, 1855, 2825, 1703, 895, -95, -1109, -1994, -1626, -980, -407, -817, -2117, -1507, -1261, -361, 179, -553, -153, -165, -1278, -927, -220, 2256, 3254, 2485, 2071, 2718, 1541, 591, 1110, 893, 1134, 830, 1238, -1231, -1563, -76, 2237, 2572, 990, -508, -686, 39, -1249, -1478, -204, 539, -490, -1060, -44, 621, 1071, -208, -1180, -786, -430, -748, -560, 1498, 3532, 1597, -427, 317, -633, -1628, -2509, -356, 87, -741, 44, -144]
1892a44l60J154j476l187j06N20L91R89Q60P22J38j02M03K3j533J243J051J841
1874B427o46k175r44J544N75j165J274M3p97q02L34J783R12o8j154R82OR79L2
1855C140m14q63n40Q96j74J996l2j578M08r25o73l44j706r72J297K73m01L75J364
1836A127j291q92J593J290j404k67p79n47J459J318k81k70q69J452j78K94j205
1819E50j259J82R90N49j506j969k90L77J627K479j59j046m30L82L94n81l34J098
1801A054M9j548L66J572j530p19P90J374R34j577J4M45Q96N80kj572m83J56o46
1782A53m21m94j657k88J559k17L73J837m82m19J07j01l83M94q70j566J194K348
1764A167j465j918j081L65q7j045J642K420m11j049J399J640o47j626N15K55j408
$$ y = [-144, -504, 650, -826, -4013, -4119, -3599, -3208, -2219, -1359, -637, -499, -601, -198, -175, -1708, -465, 586, 2427, 1781, -394, -1338, 206, 781, -384, 890, 933, 136, -666, -332, 1451, 2363, 2295, 1141, 2123, 2129, 3108, 3140, 2726, 1863, 1323, 2219, 2045, 4041, 4009, 2431, 2839, 1914, 1241, 897, -809, -1781, -484, -211, -612, -237, 1127, -164, -1056, 537, 1827, 423, 156, -623, -1170, 289, 1607, 1326, 1056, 187, 1639, 1461, 1755, 550, -709, -527, 463, 1012, -494, -2463, -2753, -2376, -749, 1730, 1571, 525, 95, 477, 871, 290, -44, 1054, 1103, -445, -79, 1493, -37, -756, 34, 1408, 2342, 765, 779, 1224, 2120, 2700, 2698, 1126, 643, 799, 153, -268, -762, -2419, -2707, -1148, -1365, -992, 845, 363, -56, 51, -50, -433, 61, -809, -2375, -1181, 1167, -298, -2216, -3297, -2932, -3019, -4064, -2422, -2, -413, -1462, -63, 1577, 930, -696, -181, 74, -1334]
1747a334k06o08r37J787J049k81l79n67k3P23r9Q21q64q06p13O84J733m29o3J411
1727H99Q89j74J91j519j581j207J104j175l42J362J407R67o91Q6M64j14p9r71
1709d84j307J270J276N99j628r36M45L20P29J104p65K77N53k045P72m17j971M34
1691a774J750j374O68J788N32q65N91n62j891r05Q32J011k28r5m85O81J017J357
1673B048K22N08j477j401n69Q66M7k0M34J255n46q4q50k89n58j481j26O4K13N80
1653a164R85J957j47p68j06j65K48r70m45M9J293n27m63Q82Q45K24R50n45O42
1634B775k53M14j69j200j436k685j86K456L89K11M55M28j005j415K14k38j091
1617b336R28j65j071j616N14J853R90m75k380n16O01J849N58R89l22N95O03k263
$$ y = [-1334, -1540, -2148, -3085, -1298, -249, -530, -909, -1476, -1499, -776, -875, -54, -918, -1724, -2437, -1753, -20, -449, -512, 899, 1788, 1614, 1805, 286, -1295, -2502, -1398, -2573, -2915, -1553, -146, 821, 130, 216, 680, 566, 487, -484, -1791, -521, 755, 1354, -274, -1210, -765, -445, 284, 1388, 623, 900, 1453, -592, 180, -237, -2208, -1774, -24, -1398, -730, 1058, 1590, 725, 1316, 754, -1137, -2042, -1210, -199, -427, -522, -1007, -326, 691, 2048, 2270, 2778, 1301, -100, -669, 197, 244, 224, 658, 1913, 1367, 1283, 433, 144, -414, -1895, -2021, -1957, -1744, -1164, -179, 1778, 1631, 863, 757, 592, 840, -130, -575, -526, 767, 240, -223, 659, 1504, 1728, 2678, 2133, 2775, 2522, 2936, 2767, 1567, 131, -2554, -2740, -284, 105, 316, 771, 1199, 194, -1221, -1007, -1245, -2336, -1408, -1573, -2644, -4260, -3746, -1893, -903, -1378, -3758, -4274, -3673, -1824, -1266, -277, -599, -4, 599, -1664]
1599a664j691R61J514J11M60R9j070N68p84r60J56J956J045J01M9J02p16p24q21
1580a308K77L31j395R87J062j749L30J174q39q69Q00J504O05M59q30P90J5j278
1562F6l74K82K308N0j469j47P52j055j656nM21l87p65P7J78j298q85K50K07k34
1542c684j38J66K493K128q5j685k9J072k6p46l75p5j13N01N8P77l1m81m45p11
1522a429L92j049N20L40J273o27J88R65k356r11J028J259N39N71O28P11Q65J552
1504D459r35r93j375j81k67r93j333k48J088L03j217J48K709L7j215j821j323
1487c157n1J524M40N0P79J53p38m41P80J324R04q2p42n77k29K49J374J413r68
1468B005j173j614O5J117K75l55o11R48lj250l12J02j131j38Q9J733J283q27j880
$$ y = [-1664, -3355, -2394, -880, -769, -309, -210, -1280, -712, -1496, -2456, -2300, -344, 701, 802, 851, 953, 237, -487, -1308, -1031, -700, -2095, -1108, -46, -1795, -1465, -291, -1130, -1999, -1199, 305, 910, 1369, 539, 1329, 1344, 66, -308, -26, 2282, 2332, 863, 716, 1468, 413, -1243, -1248, -827, -1214, -1979, -1902, -1724, -3022, -3907, -3657, -3450, -3684, -3822, -3656, -1163, 965, 880, -805, -834, 238, 212, -534, -909, -984, -1097, -596, -538, 239, 208, -273, -718, -1429, -1037, -2086, -1566, -1226, 47, -580, -392, 573, -1783, -2694, -1666, -407, 132, 703, 1331, 2042, 2907, 4459, 3524, 2531, 1156, 975, 708, -285, -1618, -1866, -778, -475, -1692, -1544, 1165, 1202, -13, -1834, -3157, -3208, -1684, -1244, -1194, -415, -262, -1000, -1441, -661, 663, 1567, 1485, 743, 166, -63, 186, 1560, 2973, 2005, 832, -782, -717, 400, 675, 320, -291, 657, 654, -596, -908, -806, -1937, -2075, -1986, -253, 1030, 203, -1677]
1449a677M09K41L3P68R94L4M74K44j590r13J130m9P93L29M28%j628o72q70j678
1429c200J182n50m66L228J600j015j142P26J688J559M59j253j697l05l26J246
1413A734Q77j056n29j848Q1m02N17R06j75q95k199L66K587N96R7j169k656j661
1395d829j664K040J852J535K243n58j87o69n34N89j284O27J350n49k744K9R95
$$ y = [-1677, -1268, -1027, -994, -226, 768, 802, 1276, 1520, -70, -983, 147, 98, 891, 1220, 1648, 1648, 20, -652, -1522, -3200, -2018, -2568, -3034, 194, 1794, 779, -363, 363, 2051, 3610, 4069, 2816, 1119, 814, 488, 1734, 2611, 1555, 1026, -822, -741, -1143, -626, 280, 105, -790, -2989, -2623, -36, 560, 657, -512, -3168, -4829, -6493, -4453, -2601, -1066, 1177, 619, 432, -237, -771, -182, -1466, -839, 511, -38, -2782, -2753, -1758]
$$ [...]
##END NTUPLES=NMR SPECTRUM
##END=
