##TITLE=Analysis number 311887
Compound Code spb 08456
Project Code adrs
Chemist Name stores
##JCAMPDX= 6.0         $$ Bruker NMR JCAMP-DX V2.0
##DATA TYPE= NMR SPECTRUM
##DATA CLASS= NTUPLES
##ORIGIN= Bruker BioSpin GmbH
##OWNER= NMR
$$ XWIN-NMR		Version 3.5
$$ Tue Jul 19 10:03:38 2005 GMT Daylight Time (UT+1h)  MAYBRIDGE\NMR@NMR_250MHZ
##.OBSERVE FREQUENCY= 250.131544655141
##.OBSERVE NUCLEUS= ^1H
##.ACQUISITION MODE= SIMULTANEOUS (DQD)
##.ACQUISITION SCHEME= undefined
##.AVERAGES= 16
##.DIGITISER RES= 18
##SPECTROMETER/DATA SYSTEM= dpx250
##.PULSE SEQUENCE= zg30
##.SOLVENT NAME= CDCl3
##.SHIFT REFERENCE= (INTERNAL, CDCl3, 0, 16.522)
##AUDIT TRAIL= $$ (NUMBER, WHEN, WHO, WHERE, WHAT)
$$ ##TITLE= Audit trail, XWIN-NMR		Version 3.5
$$ ##JCAMPDX= 5.01
$$ ##ORIGIN= Bruker BioSpin GmbH
$$ ##OWNER= NMR
$$ C:\u/data/dgb/nmr/ADRS/6010/pdata/1/auditp.txt
$$ ##AUDIT TRAIL=  $$ (NUMBER, WHEN, WHO, WHERE, WHAT)
(   1,<2005-07-19 10:03:17.16 +100>,<MAYBRIDGE\NMR>,<NMR_250MHZ>,
      <created by zg, POWCHK disabled, PULCHK disabled
       configuration hash MD5:
       62 19 C7 07 E1 42 D1 B7 37 6C 3D D0 77 39 F9 E6
       data hash MD5: 64K
       3E E0 BE 14 A5 DC 15 F3 12 BB E1 27 E7 28 EA 4D>)
(   2,<2005-07-19 10:03:29.35 +100>,<MAYBRIDGE\NMR>,<NMR_250MHZ>,
      <Start of raw data processing
       ef LB = 0.3 FT_mod = 6 PKNL = 1 SI = 32K 
       data hash MD5: 32K
       96 1F 30 21 10 D2 EB CC FF 1C D3 15 AD B0 9D 2A>)
(   3,<2005-07-19 10:03:31.25 +100>,<MAYBRIDGE\NMR>,<NMR_250MHZ>,
      <apk 
       data hash MD5: 32K
       F6 D1 2C FB 25 C6 D8 8F 05 1B 65 02 F4 8E FC F8>)
(   4,<2005-07-19 10:03:32.04 +100>,<MAYBRIDGE\NMR>,<NMR_250MHZ>,
      <abs ABSG = 5 
       data hash MD5: 32K
       E2 2A F7 EF B9 34 CC 30 5E AD A2 48 B1 30 5E 77>)
$$ ##END=
$$ 
$$ hash MD5
$$ 25 9E C3 DE 3A 13 85 F7 6E F9 5F A2 7C 7D 91 07
##$RELAX= 
##$RELAX= 
##$RELAX= 
##$RELAX= 
##$RELAX= 
##$RELAX= 
##$RELAX= 
$$ Bruker specific parameters
$$ --------------------------
##$DU= <C:\u>
##$EXPNO= 6010
##$NAME= <ADRS>
##$PROCNO= 1
##$TYPE= <nmr>
##$USER= <dgb>
##$AMP= (0..31)
100 100 100 100 100 100 100 100 100 100 100 100 100 100 100 100 100 100 
100 100 100 100 100 100 100 100 100 100 100 100 100 100 
##$AQSEQ= 0
##$AQ_mod= 3
##$AUNM= <au_zg>
##$AUTOPOS= <5 >
##$BF1= 250.13
##$BF2= 250.13
##$BF3= 250.13
##$BF4= 250.13
##$BF5= 500.13
##$BF6= 500.13
##$BF7= 500.13
##$BF8= 500.13
##$BYTORDA= 1
##$CFDGTYP= 0
##$CFRGTYP= 5
##$CHEMSTR= <none>
##$CNST= (0..31)
1 1 145 1 1 1 1 1 1 1 1 1 1 1 1 1 1 1 1 1 1 1 1 1 1 1 1 1 1 1 1 1 
##$CPDPRG= <>
##$CPDPRG1= <>
##$CPDPRG2= <>
##$CPDPRG3= <>
##$CPDPRG4= <mlev>
##$CPDPRG5= <mlev>
##$CPDPRG6= <mlev>
##$CPDPRG7= <mlev>
##$CPDPRG8= <mlev>
##$CPDPRGB= <>
##$CPDPRGT= <>
##$D= (0..31)
0 1 0 0 0 0 0 0 0 0.06 0 0 0 0 0 0 0.0002 0 0 0 0 0 0 0 0 0 0 0 0 0 0 
0 
##$DATE= 1121763795
##$DBL= (0..7)
120 120 120 120 120 120 120 120 
##$DBP= (0..7)
150 150 150 150 150 150 150 150 
##$DBP07= 0
##$DBPNAM0= <>
##$DBPNAM1= <>
##$DBPNAM2= <>
$$ [...]
##$SUBNAM7= <"">
##$SUBNAM8= <"">
##$SUBNAM9= <"">
##$SW= 20.6930455092707
##$SWIBOX= (0..15)
0 0 3 0 0 0 0 0 0 0 0 0 0 0 0 0 
##$SW_h= 5175.983436853
##$TD= 65536
##$TD0= 1
##$TE= 295.16
##$TE2= 300
##$TE3= 300
##$TEG= 300
##$TL= (0..7)
0 120 120 120 120 120 120 120 
##$TP= (0..7)
150 150 150 150 150 150 150 150 
##$TP07= 0
##$TPNAME0= <>
##$TPNAME1= <>
##$TPNAME2= <>
##$TPNAME3= <>
##$TPNAME4= <>
##$TPNAME5= <>
##$TPNAME6= <>
##$TPNAME7= <>
##$TPOAL= (0..7)
0.5 0.5 0.5 0.5 0.5 0.5 0.5 0.5 
##$TPOFFS= (0..7)
0 0 0 0 0 0 0 0 
##$TUNHIN= 0
##$TUNHOUT= 0
##$TUNXOUT= 0
##$USERA1= <user>
##$USERA2= <user>
##$USERA3= <user>
##$USERA4= <user>
##$USERA5= <user>
##$V9= 5
##$VALIST= <valist>
##$VCLIST= <CCCCCCCCCCCCCCC>
##$VD= 0
##$VDLIST= <DDDDDDDDDDDDDDD>
##$VPLIST= <PPPPPPPPPPPPPPP>
##$VTLIST= <TTTTTTTTTTTTTTT>
##$WBST= 1024
##$WBSW= 4
##$XGAIN= (0..3)
0 0 0 0 
##$XL= 0
##$YL= 0
##$YMAX_a= 437683
##$YMIN_a= -471352
##$ZGOPTNS= <>
##$ZL1= 120
##$ZL2= 120
##$ZL3= 120
##$ZL4= 120
##$ABSF1= 16.522
##$ABSF2= -4.171173
##$ABSG= 5
##$ABSL= 3
##$ALPHA= 0
##$AQORDER= 0
##$ASSFAC= 0
##$ASSFACI= 0
##$ASSFACX= 0
##$ASSWID= 0
##$AUNMP= <proc_1d>
##$AZFE= 0.1
##$AZFW= 0.1
##$BCFW= 0
##$BC_mod= 0
##$BYTORDP= 0
##$COROFFS= 0
##$CY= 12.5
##$DATMOD= 1
##$DC= 0
##$DFILT= <>
##$DTYPP= 0
##$F1P= 14.0000005364418
##$F2P= -0.99999901652339
##$FCOR= 0.5
##$FTSIZE= 32768
##$FT_mod= 6
##$GAMMA= 0
##$GB= 0
##$INTBC= 1
##$INTSCL= 1
##$ISEN= 128
##$LB= 0.3
##$LEV0= 0
##$LPBIN= 0
##$MAXI= 10000
##$MC2= 0
##$MEAN= 0
##$ME_mod= 0
##$MI= 0
##$NCOEF= 0
##$NC_proc= -3
##$NLEV= 6
##$NOISF1= 0
##$NOISF2= 0
##$NSP= 0
##$NTH_PI= 0
##$NZP= 0
##$OFFSET= 16.522
##$PC= 1
##$PHC0= -78.16853
##$PHC1= 6.144615
##$PH_mod= 1
##$PKNL= yes
##$PPARMOD= 0
##$PSCAL= 4
##$PSIGN= 0
##$REVERSE= no
##$SF= 250.13
##$SI= 32768
##$SIGF1= 0
##$SIGF2= 0
##$SINO= 400
##$SIOLD= 32768
##$SREGLST= <1H.CDCl3>
##$SSB= 0
##$STSI= 32768
##$STSR= 0
##$SW_p= 5175.98343685301
##$SYMM= 0
##$S_DEV= 0
##$TDeff= 65536
##$TDoff= 0
##$TI= <Analysis number 999999
Compound Code 99
Book Reference 9
Project Code 9>
##$TILT= no
##$TM1= 0
##$TM2= 0
##$TOPLEV= 0
##$USERP1= <user>
##$USERP2= <user>
##$USERP3= <user>
##$USERP4= <user>
##$USERP5= <user>
##$WDW= 1
##$XDIM= 32768
##$YMAX_p= 431805132
##$YMIN_p= -84041
$$ End of Bruker specific parameters
$$ ---------------------------------
##NTUPLES= NMR SPECTRUM
##VAR_NAME=  FREQUENCY,     SPECTRUM/REAL,   SPECTRUM/IMAG
##SYMBOL=    X,             R,               I
##VAR_TYPE=  INDEPENDENT,   DEPENDENT,       DEPENDENT
##VAR_FORM=  AFFN,          ASDF,            ASDF
##VAR_DIM=   32768,         32768,           32768
##UNITS=     HZ,            ARBITRARY UNITS, ARBITRARY UNITS
##FACTOR=    0.157963299565203, 1,           1
##FIRST=     4132.6476996994, 0,             0
##LAST=      -1043.33573715361, 0,           0
##MIN=       -1043.33573715361, -84041,      0
##MAX=       4132.6476996994, 431805132,     0
$$ Real data points
##PAGE= N=1
##DATA TABLE= (X++(R..R)), XYDATA
$$ [...]
$$ plain form
17646 -3677 1839 -1793 1498 -19931 -32665 -34541 -36798 -15899 -2063 -24900 -36768 -25089 -13467
17633 -13467 -34313 -38897 -43376 -28611 -8697 -19002 -24374 -11332 -8518 2755 -14759 -23627 -41650
17620 -41650 -60163 -54526 -46735 -37950 -19599 7837 7889 6293 -11200 -8272 7261 -4927 -19769
17607 -19769 -24677 -14707 -7441 -11050 -21937 -24195 -6363 -5002 -12884 -13787 -5580 -14190 -10299 -893
17593 -893 5786 -9600 -34204 -40327 -28859 -29088 -30707 -12299 -13975 -34320 -68155 -84041 -73468
17580 -73468 -55920 -44527 -47591 -41850 -30235 -29066 -40966 -37386 -30186 -23371 -24157 -26492 -21693 -11170
17566 -11170 -4830 -7152 -1473 452 13807 8995 -3824 -18047 -32307 -47681 -46805 -41146 -41591 -38590
17552 -38590 -38650 -36752 -50334 -43138 -31968 -14286 -4661 -488 -28760 -29286 -7294 -9504 -17288 -12609
$$ packed form
17646c677N516l632L291k1429j2734j876k257K0899J3836k2837j1868J1679J1622
17633a3467k0846m584m479J4765J9914j0305n372J3042K814J1273j7514q868j8023
17620d1650j8513N637P791Q785J8351K7436N2j596j7493K928J5533j2188j4842
17607a9769m908R970P266l609j0887k258J7832J361p882r03Q207q610L891R406
17593h93O679j5386k4604o123J1468k29j619J8408j676k0345l3835j5886J0573
17580g3468J7548J1393l064N741J1615J169j1900L580P200O815p86k335M799J0523
17566a1170O340k322N679J925J3355m812j2819j4223j4260j5374Q76N659m45L001
17552c8590o0J898j3582P196J1170J7682R625M173k8272n26K1992k210p784M679
$$ plain form
17538 -12609 -7837 -5857 -23032 -25953 -36528 -47285 -46470 -31772 -26109 -19961 -4271 -4005 5563 17752
17524 17752 31501 21526 -1097 1435 -1012 -4122 -5145 2005 11780 -2529 -13013 -10902 -5410
17511 -5410 -6136 24299 15949 -9822 -11245 -3084 9037 133 -15471 -13636 -5749 696 -13954 -22518
17497 -22518 -24250 -16988 -20783 -20155 -4546 -8203 -22626 -12545 -3851 -19173 -31378 -19237 -8704
17484 -8704 -9977 -3291 2708 -11553 -26960 -52816 -50835 -40901 -28882 -18307 -9661 -7314 10378
17471 10378 24815 24371 7649 11162 7364 1998 -6017 -1159 -16781 -55017 -61664 -32633 -5596
17458 -5596 -1947 -18441 -17110 420 -5006 -21147 -15897 -4501 10848 13899 16828 45980 53395
17445 53395 46685 50404 74290 99868 103267 104461 95790 82540 63444 39960 26489 12720 15804
$$ packed form
17538a2609M772J980j7175k921j0575j0757Q15J4698N663O148J5690K66R568J2189
17524A7752J3749r975k2623K532k447l110j023P150R775j4309j0484K111N492
17511e410p26L0435q350k5771j423Q161J2121q904j5604J835P887O445j4650q564
17497b2518j732P262l795O28J5609l657j4423J0081Q694j5322j2205J2141J0533
17484h704j273O686N999j4261j5407k5856J981R934J2019J0575Q646K347J7692
17471A0378J4437m44j6722L513l798n366q015M858j5622l8236o647K9031K7037
17458e596L649j6494J331J7530n426j6141N250J1396J5349L051K929K9152P415
17445E3395o710L719K3886K5578L399J194q671j3250j9096k3484j3471j3769L084
$$ plain form
17432 15804 7672 3319 13087 20698 6383 11240 16709 18184 7253 -13721 -21886 -18173 -18783 -8170
17418 -8170 -23481 -23660 -8875 6073 12687 13502 -2680 -6938 2965 10602 16916 6980 1122 2760
17404 2760 -3418 474 -3728 -12246 -5165 -19248 -15389 -16260 -24123 -11650 -15032 -4880 -6424 -2843
17390 -2843 1197 7729 -874 4736 13906 -557 -26956 -30371 -34593 -24461 -25772 -27122 -17822 -35409
17376 -35409 -34539 -15700 -8326 -16471 -20860 -10354 -26816 -35486 -19758 -17394 -27150 -32118 -18265
17363 -18265 -12396 -16839 -15780 -9135 -16975 -6910 6401 10735 12567 1265 -21037 -25427 -18144
17350 -18144 -24096 -29662 -16139 -12454 -14063 -8891 -2122 -17788 -36557 -36490 -35451 -23443 -15330 1650
17336 1650 11691 40936 44984 40321 44418 27323 -10804 -38693 -29568 -21244 -16784 -19048 -20138
$$ packed form
17432A5804q132m353R768P611j4315M857N469J475j0931k0974q165L713o10J0613
17418h170j5311j79J4785J4948O614Q15j6182m258R903P637O314r936n858J638
17404B760o178L892m202q518P081j4083L859q71p863J2473l382J0152j544L581
17390b843M040O532q603N610R170j4463k6399l415m222J0132j311j350R300j7587
17376c5409Q70J8839P374q145m389J0506j6462q670J5728K364r756m968J3853
17363a8265N869m443J059O645p840J0065J3311M334J832j1302k2302m390P283
17350a8144n952n566J3523L685j609N172O769j5666j8769O7J039J2008Q113J6980
17336A650J0041K9245M048m663M097j7095l8127k7889R125Q324M460k264j090
$$ plain form
17323 -20138 -19284 -16326 -6713 10707 3757 4675 28571 32070 16052 23624 17962 8623 -11824 -11659
17309 -11659 -22498 -29249 -23434 -10781 -15454 -28854 -29366 -29993 -34382 -23068 -20782 -19858 -14275 -31224
17295 -31224 -19413 -12165 -14345 -14986 -40379 -62403 -49585 -47522 -29656 -6442 559 -11540 -10385
17282 -10385 -14951 -13787 -5131 -8843 -8139 2910 7963 10788 4455 7086 9141 1603 -9014 -7377
17268 -7377 -9246 -16892 -12652 -12046 -3334 1512 7740 25807 27573 22261 -14804 -30229 -33830 -31431
17254 -31431 -19392 -21156 -24670 -13652 -17568 -18376 -9408 -4869 -9249 -17872 -14732 -13342 -6399 -6351 -15665
17239 -15665 -10548 -5675 -11954 -10401 9357 15166 3456 3904 15197 13595 8047 12343 -2860 -29678
17225 -29678 -40965 -40124 -35833 -19790 -16857 -12595 6685 4796 -8470 -6867 -8938 -3264 -16437
$$ packed form
17323b0138Q54K958R613J7420o950R18K3896L499j6018P572n662r339k0447J65
17309a1659j0839o751N815J2653m673j3400n12o27m389J1314K286R24N583j6949
17295c1224J1811P248k180o41k5393k2024J2818K063J7866K3214P001j2099J155
17282a0385m566J164Q656l712P04J1049N053K825o333K631K055p538j0617J637
17268g377j869p646M240O06Q712M846O228J8067J766n312l7065j5425l601K399
17254c1431J2039j764l514J1018l916q08Q968M539m380q623L140J390O943M8r314
17239a5665N117M873o279J553J9758N809j1710M48J1293j602n548M296j5203k6818
17225b9678j1287Q41M291J6043K933M262J9280j889j3266J603k071N674j3173
$$ plain form
17212 -16437 -24262 -31587 -43362 -27393 -42241 -56293 -37988 -23273 -14082 -20966 -9461 -12473 -26446
17199 -26446 -30188 -25866 -23947 -37894 -37074 -31613 -11686 -3195 -12219 -2832 17388 18767 10255 -975
17185 -975 10441 5978 7844 13245 1151 -9445 -9359 -8345 -13314 -24716 -23401 1050 2986 1916
17171 1916 -1634 -7084 -3671 -3571 -3772 5255 -685 -12249 -32645 -40541 -31955 -29899 -23824 -25416 -8505
17156 -8505 -2202 4527 2476 -9136 -4800 -11637 -7722 8466 12509 13809 6337 8396 14296 10009
17142 10009 -532 13446 53109 54776 43727 41622 64024 92444 109491 135177 173686 213607
17130 213607 245223 309220 389793 399979 324359 219085 150223 109500 81691 58923 46673
17119 46673 40791 40868 36553 35691 30135 9352 14207 27997 36014 41870 54710 34724 20925 21831
$$ packed form
17212a6437p825p325j1775J5969j4848j4052J8305J4715R191o884J1505l012j3973
17199b6446l742M322J919j3947Q20N461J9927Q491r024R387K0220J379q512j1230
17185i75J1416m463J866N401j2094j0596Q6J014m969j1402J315K4451J936j070
17171A916l550n450L413J00k01R027n940j1564k0396p896Q586K056O075j592J6911
17156h505O303O729k051j1612M336o837L915J6188M043J300p472K059N900m287
17142A0009j0541J3978L9663J667j1049k105K2402K8420J7047K5686L8509L9921
17130B13607L1616O3997Q0573J0186p5620j05274o8862m0723k7809k2768j2250
17119D6673n882P7m315q62n556k0783M855J3790Q017N856J2840j9986j3799R06
$$ plain form
17105 21831 30515 42276 33970 27541 20312 20119 19705 7510 8305 4181 17147 7053 -6085 4373
17091 4373 2380 -23549 -13189 4348 519 3244 2946 -2803 -12689 -5578 -16200 -25015 -13162 -1982
17077 -1982 -1180 -14599 -31363 -38416 -49543 -54780 -20918 3601 12448 23493 -38 -10155 -3904
17064 -3904 3260 -10596 -21929 -19778 -2392 644 -12432 -17397 -5435 2422 530 7648 13945
17051 13945 -697 -12771 -20841 -26641 -24748 -30103 -10578 -2109 -8821 -402 -6877 -9299 -9116 -5981
17037 -5981 -8032 10251 -5224 -12644 -8930 -28737 -34195 -12150 1854 2079 -958 12519 7402
17024 7402 -12830 -21587 -24683 -40755 -57966 -33463 -28712 -21152 -18516 -21194 -10904 2042 6000
17011 6000 -7210 22815 26671 22961 5859 -5580 16532 20619 21306 25865 34184 1701 -17264
$$ packed form
17105B1831Q684J1761q306o429p229j93m14j2195P95m124J2966j0094j3138J0458
17091D373j993k5929J0360J7537l829K725k98n749r886P111j0622q815J1853J1180
17077a982Q02j3419j6764p053j1127n237L3862K4519Q847J1045k3531j0117O251
17064c904P164j3856j1333K151J7386L036j3076m965J1962P857j892P118O297
17051A3945j4642j2074q070n800J893n355J9525Q469o712Q419o475k422J83L135
17037e981k051J8283j5475p420L714j9807n458K2045J4004K25l037J3477n117
17024G402k0232q757l096j6072j7211K4503M751P560K636k678J0290J2946L958
17011F000j3210L0025L856l710j7102j1439K2112M087O87M559Q319l2483j8965
$$ plain form
16998 -17264 -29995 -31688 -30224 -21570 -21360 -9958 -4273 -7172 -8620 -30907 -37031 -31243 -26055 -15630
16984 -15630 -13129 -14490 -15622 -7238 -21862 -22023 -11038 -8126 -28190 -20013 -24511 -17555 -22925 -27381
16970 -27381 -13126 -17789 -29123 -42231 -43108 -37174 -29888 -22428 -23008 -33694 -53729 -46894 -29329
16957 -29329 -51882 -40880 -9036 1123 10403 1847 -3325 4184 -2398 15462 8531 8793 9559 -9145
16943 -9145 -7743 -9363 -21342 -3315 267 -12411 -10875 -28417 -27055 -31120 -18809 -21095 -18734
16930 -18734 -3937 2447 -16624 -20263 -10920 -20576 -21909 -22291 -10855 -14097 -34135 -33209 -27214 -4669
16916 -4669 -9047 -2174 10645 27 -7866 2994 12348 -9021 -29438 -27078 -6971 -68 -11721
16903 -11721 -17911 -6415 -7442 3141 5754 -4476 -20180 -24945 -29942 -28251 -36076 -32665 -26779
$$ packed form
16998a7264j2731j693J464Q654K10J1402N685k899j448k2287o124N788N188J0425
16984a5630K501j361j132Q384j4624j61J0985K912k0064Q177m498O956n370m456
16970b7381J4255m663j1334j3108q77N934P286P460n80j0686k0035O835J7565
16957b9329k2553J1002L1844J0159R280q556n172P509o582J7860o931K62P66j8704
16943i145J402j620j1979J8027L582j2678J536j7542J362m065J2311k286K361
16930a8734J4797O384j9071l639R343r656j333l82J1436l242k0038R26N995K2545
16916d669m378O873J2819j0618p893J0860R354k1369k0417K360K0107O903j1653
16903a1721o190J1496j027J0583K613j0230j5704m765m997J691p825L411N886
$$ plain form
16890 -26779 -21541 -26732 -25799 -9592 -9132 -17523 -10467 -11861 -3315 -2438 -23377 -27130 -26338 -27145 -15876
16875 -15876 15669 4119 -13742 -27037 -26346 -26547 -31377 -23332 -28490 -18408 -3465 -9805 -29
16862 -29 171 -10155 -11328 -1714 -3522 -14246 -15634 -16309 4130 1655 -3862 4337 10965 -12615 1660
16847 1660 18073 14188 7492 4494 16039 -8109 -36182 -32927 -23697 -18458 -9613 -407 -14061
16834 -14061 -28827 -35410 -35373 -28729 -12437 -17629 -9505 1623 -15520 -31821 -36061 -23270 -18924
16821 -18924 -5926 -3965 -17846 -18943 -9967 -20012 -19104 -16283 -28776 -42311 -33310 -12890 -20161
16808 -20161 -9404 -2190 -681 -12098 -7293 -2250 1833 -5856 -11435 -492 -16010 -21093 1348
16795 1348 -105 -18375 -12245 -14307 -13341 -16376 -13391 -24572 -22087 -13391 -9881 -7592 -19629 -24647
$$ packed form
16890b6779N238n191R33J6207M60q391P056j394Q546Q77k0939l753P92q07J1269
16875a5876L1545j1550j7861j3295O91k01m830Q045n158J0082J4943o340R776
16862b9K00j0326j173R614j808j0724j388o75K0439k475n517Q199O628k3580J4275
16847A660J6413l885o696k998J1545k4148k8073L255R230N239Q845R206j3654
16834a4061j4766o583L7O644J6292n192Q124J1128j7143j6301m240J2791M346
16821a8924J2998J961j3881j097Q976j0045R08K821j2493j3535R001K0420p271
16808b0161J0757P214J509j1417M805N043M083p689n579J0943j5518n083K2441
16795A348j453j8270O130k062R66l035K985j1181K485Q696L510K289j2037n018
$$ plain form
16781 -24647 -41522 -48853 -42159 -21242 -9236 22766 21745 19224 -7321 -35996 -37258 -2057 11754
16768 11754 8632 8169 1096 -8792 -6077 1901 8176 10281 3040 -2831 1021 5282 6186 -1522 5067
16753 5067 -1183 -3634 -14024 -33284 -13399 6681 -1505 -8449 8096 32671 18541 -2240 -8091
16740 -8091 -11959 -6251 -8718 17736 9507 -5390 -16148 -15016 -21252 -30469 -42282 -55001 -56222
16727 -56222 -30941 -12880 10427 9118 16886 3561 -8672 -26401 -26122 -8992 -9788 -21223 -23937
16714 -23937 -25508 -13067 -14125 -7372 4260 18599 21549 5859 -19232 -40823 -57804 -60549 -31239
16701 -31239 -2636 -3080 -11465 -22773 -29140 -17461 -9787 -20704 -7736 2319 1517 11323 14270
16688 14270 10697 -21042 -34889 -32237 -23395 -15850 -13981 -4127 -23804 -17023 7206 9981 -4755
$$ packed form
16781b4647j6875p331O694K0917J2006L2002j021k521k6545k8675j262L5201J3811
16768A1754l122m63p073r888K715P978O275K105p241n871L852M261R04p708O589
16753E067o250k451j0390j9260J9885K0080q186o944J6545K4575j4130k0781n851
16740h091l868N708k467K6454q229j4897j0758J132o236r217j1813j2719j221
16727e6222K5281J8061K3307j309P768j3325j2233j7729K79J7130p96j1435k714
16714b3937j571J2441j058O753J1632J4339K950j5690k5091k1591j6981k745K9310
16701c1239K8603m44q385j1308o367J1679P674j0917J2968J0055q02R806K947
16688A4270l573l1739j3847K652Q842P545J869R854j9677O781K4229K775j4736
$$ plain form
16675 -4755 -118 12787 6141 -1201 -6543 -6141 12652 20233 14218 20015 21660 17222 8266 -2822
16661 -2822 -25652 -19582 -7080 -18475 -14488 -11340 -7629 -9625 -24946 -41092 -15043 2714 10152
16648 10152 -1564 -18940 -4752 -9840 -22681 -17929 -11177 -17630 -13045 -20391 3203 17427 13583
16635 13583 12501 2645 466 -7488 -19455 -18146 -4837 -8901 -24031 -23766 -29521 -30609 -31888 -20324
16621 -20324 3751 4327 3741 9104 7188 3563 9858 -7345 -10738 -16040 -22785 -24736 -20536 -30905
16607 -30905 -26963 -22049 -5621 -8980 -1558 -2098 -21463 -14970 12961 15528 14151 12911 -12191 -37772
16593 -37772 -31273 -16037 -6607 -7130 -7621 -19669 -16690 -5277 -24594 -30426 -21198 5210 11403 12737
16579 12737 -766 2611 14556 16893 32782 41154 11238 -12494 -18811 5596 23382 24166 27254
$$ packed form
16675d755M637J2905o646p342n342M02J8793P581o015N797J645m438q956j1088
16661b822k2830O070J2502j1395L987L148L711j996j5321j6146K6049J7757P438
16648A0152j1716j7376J4188n088j2841M752O752o453M585p346K3594J4224l844
16635A3583j082r856k179p954j1967J309J3309m064j5130K65n755j088j279J1564
16621b0324K4075N76n86N363j916l625O295j7203l393n302o745j951M200j0369
16607c0905L942M914J6428l359P422n40j9365O493K7931K567j377j240k5102k5581
16593c7772O499J5236R430n23m91j2048K979J1413j9317n832R228K6408O193J334
16579A2737j3503L377J1945K337J5889Q372k9916k3732o317K4407J7786P84L088
$$ plain form
16566 27254 37708 35599 29171 22702 9051 -8517 -13643 -16178 -20179 -36953 -27304 -23241 -27253
16553 -27253 -25750 -13799 -8455 -17782 -27211 -40131 -38742 -21572 -31873 -25176 -11380 -9225 -15950
16540 -15950 -5265 -3717 -5468 -14821 -13552 4574 -615 -6247 12359 19860 23223 20712 24406 25620
16526 25620 14885 -6680 -31346 -33627 -18980 15816 21500 17555 -4159 -152 -2767 -16095 -17719
16513 -17719 -1536 13955 4918 -5899 -25791 -48609 -45374 -24656 -15479 -23830 -16044 -17258 1265
16500 1265 2532 10581 15615 8128 -10722 -11797 -14971 -24975 -15444 -11042 -13088 -9696 -16309 -27412
16486 -27412 -18775 -10213 -20357 -19860 -7724 -1839 -9533 -10062 -24437 -3555 4028 -20632 -21871 -33132
16472 -33132 -38574 -31752 -13813 -7356 9824 -1066 -9139 3713 4532 -2000 -11765 -24887 -33704
$$ packed form
16566B7254J0454k109o428o469j3651j7568n126k535m001j6774R649M063m012
16553b7253J503J1951N344r327r429j2920J389J7170j0301O697J3796K155o725
16540a5950J0685J548j751r353J269J8126n189n632J8606P501L363k511L694J214
16526B5620j0735k1565k4666k281J4647L4796N684l945k1714M007k615j3328j624
16513a7719J6183J5491r037j0817j9892k2818L235K0718R177q351P786j214J8523
16500A265J267Q049N034p487j8850j075l174j0004R531M402k046L392o613j1103
16486b7412Q637Q562j0144M97J2136N885p694n29j4375K0882P583k4660j239j1261
16472c3132n442O822J7939O457J7180j0890q073J2852Q19o532r765j3122q817
$$ plain form
16459 -33704 -42188 -57566 -46242 -24714 -15775 -9107 -18628 -11716 -25795 -26850 -26702 -25823 -20233 -3738
16445 -3738 15237 11518 7935 3289 -1605 1059 2763 -8514 3741 13607 4430 7841 9909 -6426
16431 -6426 -10071 -10169 -2906 -5434 -5219 -3559 -15790 4005 2705 -11702 -5937 -21544 -24705 -10053
16417 -10053 -4553 -15172 -23439 -21658 -37084 -44017 -36625 -29188 -13819 -6590 -1700 -3400 -4743 -3735
16403 -3735 -15465 -20965 -30225 -23017 -15855 -10662 -9651 -5804 7634 3291 -24115 -22486 -23483 -18756
16389 -18756 1989 13852 -9867 -11449 -9331 -13852 -1941 9300 13878 -8529 -17446 -8356 -4168
16376 -4168 -5714 3055 2027 -4794 8081 8189 -1940 4357 14253 5403 -3853 6381 5227 1026
16362 1026 -7482 -25342 -33259 -36232 -37595 -31389 -9786 2825 3945 10776 6184 -5638 10827
$$ packed form
16459c3704q484j5378J1324K1528Q939O668r521O912j4079j055J48Q79N590J6495
16445c738J8975l719l583m646m894K664J704j1277J2255R866r177L411K068j6335
16431f426l645r8P263k528K15J660j2231J9795j300j4407N765j5607l161J4652
16417a0053N500j0619q267J781j5426o933P392P437J5369P229M890j700j343J008
16403c735j1730n500r260P208P162N193J011L847J3438m343k7406J629r97M727
16389a8756K0745J1863k3719j582K118m521J1911J1241M578k2407q917R090M188
16376d168j546Q769j028o821J2875J08j0129O297R896q850r256J0234j154m201
16362A026q508j7860p917k973j363O206K1603J2611J120O831m592j1822J6465
$$ plain form
16349 10827 7207 -7291 11693 12620 5734 9460 -577 -8155 -3873 6569 12003 2175 7750 20508
16335 20508 11306 9850 20835 16188 15275 24888 17531 -453 -13596 -7861 -22417 -28483 -14122
16322 -14122 -2849 6181 -8973 -26446 -20117 -15053 -17451 -12758 1719 -7078 -3937 -16104 -27387
16309 -27387 -24668 -22693 -19458 -11270 -7523 -21699 -36968 -19339 -4629 -7556 -20107 -20248 -14751
16296 -14751 -12439 12033 12522 13013 22102 14012 -4022 -39641 -35977 -17855 -13183 6965 6234 -11195
16282 -11195 -10528 -22168 -20742 -15246 -31195 -10659 -4830 -4810 -12777 -17924 -21339 -7182 -9946 -5815
16268 -5815 -12048 -12392 -14687 -13283 -2354 17777 13731 1755 4818 1245 -7686 -36862 -46502 -26322
16254 -26322 -3704 -15307 -30156 -26157 -27358 -32483 -20245 -10929 -11846 -14130 17763 2817 -15323
$$ packed form
16349A0827l620j4498J8984R27o886L726j0037p578M282J0442N434r828N575J2758
16335B0508r202j456J0985m647r13R613p357j7984j3143N735j4556o066J4361
16322a4122J1273R030j5154j7473O329N064k398M693J4477q797L141j2167j1283
16309b7387K719J975L235Q188L747j4176j5269J7629J4710k927j2551j41N497
16296a4751K312K4472M89M91R089q090j8034l5619L664J8122M672K0148p31j7429
16282a1195O67j1640J426N496j5949K0536N829K0p967n147l415J4157k764M131
16268e815o233l44k295J404J0929K0131m046j1976L063l573q931k9176r640K0180
16254b6322K2618j1603j4849L999j201n125J2238R316r17k284L1893j4946j8140
$$ plain form
16241 -15323 -5309 -660 7261 10448 9999 7599 2173 -4630 3721 12448 16660 11294 2984 3077 1580
16226 1580 1027 -2858 12349 14686 6699 -11280 -35957 -45079 -36953 -35362 -25382 -11396 7543 26938
16212 26938 13320 6299 709 -4984 -19360 -23561 -15794 2009 19111 18841 18078 -6579 -20052
16199 -20052 -21205 -42070 -31027 -14583 -5455 8076 14334 -10552 -27471 -15768 -1953 -494
16187 -494 -2694 10254 8634 -15542 -17048 -12178 -5781 3104 -11567 -26014 -23325 2363 11890 10393
16173 10393 -9541 -24924 -8023 4924 7375 -7416 -879 8286 20000 9504 -22112 -22753 -14317
16160 -14317 -22728 -5052 -7782 -15860 -23232 -10346 4289 -5001 -15351 -13524 -22242 -21150 -8389
16147 -8389 -24048 -23755 -24737 -25981 -22702 -20394 485 -9013 -24952 -23170 -13242 -11669 -4053 989
$$ packed form
16241a5323J0014M649P921L187m49k400n426o803Q351Q727M212n366q310R3j497
16226A580n53l885J5207K337p987j7979k4677r122Q126J591R980J3986J8939J9395
16212B6938j3618p021n590n693j4376m201P767J7803J7102k70p63k4657j3473
16199b0052j153k0865J1043J6444R128J3531O258k4886j6919J1703J3815J459
16187d94k200J2948j620k4176j506M870O397Q885j4671j4447K689K5688R527j497
16173A0393j9934j5383J6901J2947K451j4791O537R165J1714j0496l1616o41Q436
16160a4317q411J7676k730q078p372J2886J4635r290j0350J827q718J092J2761
16147h389j5659K93r82j244L279K308K0879r498j5939J782R928J573P616N042
$$ plain form
16133 989 -7331 -9280 -1708 -512 -10184 -9411 -23858 -26121 -11614 9121 23253 7603 -7630 551
16119 551 9168 15142 16037 -2128 -50 2403 6464 12969 8823 -965 -17676 -33324 -24128 -21550
16105 -21550 -37338 -32450 -31586 -23664 -1929 8317 16435 16899 12351 12049 11139 298 -1674 -395
16091 -395 -2168 -22157 -20882 -18429 -20456 -18348 -16688 -18660 -14345 -10671 8120 19220 1456 -7474
16077 -7474 -18297 -19352 -7946 -1304 -7576 462 -4894 -12475 -5627 14034 23648 20932 9736 20487
16063 20487 14601 19967 848 5891 -5758 -24762 -25032 -19691 -21128 -14964 -15931 8077 19142 -1505
16049 -1505 -6582 -23436 -33500 2668 17720 4210 -12332 -20250 2779 -10995 -24219 -23880 -25380
16036 -25380 -31603 -17376 2132 13211 12975 3024 -1155 -15659 -1797 6157 -9489 -1727 -1869
$$ packed form
16133I89q320j949P572J196r672P73j4447k263J4507K0735J4132j5650j5233Q181
16119E51Q617N974Q95j8165K078K453M061O505m146r788j6711j5648R196K578
16105b1550j5788M888Q64P922K1735J0246Q118M64m548l02r10j0841j972J279
16091c95j773j9989J275K453k027K108J660j972M315L674J8791J1100j7764q930
16077g474j0823j055J1406O642o272Q038n356p581O848J9661R614k716j1196J0751
16063B0487n886N366j9119N043j1649j9004k70N341j437O164r67K4008J1065k0647
16049a505n077j6854j0064L6168J5052j3510j6542p918K3029j3774j3224L39j500
16036b5380o223J4227J9508J1079k36r951m179j4504J3862P954j5646P762j42
$$ plain form
16023 -1869 -21348 -7377 -10924 -28225 -42475 -53516 -47747 -36225 -31549 -16996 -1804 3223 -16150
16010 -16150 -20687 -8088 -12245 -21253 -22545 -10482 -11869 -17911 -23439 -20691 -30605 -25235 -17611 -1613
15996 -1613 2976 9772 16783 11880 17027 21835 22438 23132 30809 11891 8830 16764 26268 22663 5668
15981 5668 6227 -6984 -21741 -27981 -23263 -24962 -37494 -51306 -53011 -50271 -39373 -23314 -16234
15968 -16234 -25250 -37351 -18528 -2389 260 -14278 -12441 -12360 -12925 -21977 -16614 -15954 -13059 -5377
15954 -5377 -6223 -3074 -12690 -16563 -7226 -10248 -23595 -29500 -36748 -22360 -24315 -34371 -30179 -28779
15940 -28779 -26640 -26723 -31331 -47373 -45950 -38563 -31507 -44295 -51140 -57542 -40387 -15584 -2249 16712
15926 16712 24710 3093 12027 34153 29292 17573 3908 -22871 -30197 -16184 356 -2546 -2115
$$ packed form
16023a869j9479J3971l547j7301j4250j1041N769J1522M676J4553J5192N027j9373
16010a6150m537J2599m157r008j292J2063j387o042n528K748r914N370P624J5998
15996a613M589O796P011m903N147M808O03O94P677j8918l061P934R504l605j6995
15981E668N59j3211j4757o240M718j699j2532j3812j705K740J0898J6059P080
15968a6234r016j2101J8823J6139K649j4538J837Q1n65r052N363O60K895P682
15954e377q46L149r616l873R337l022j3347n905p248J4388j955j0056M192J400
15940b8779K139q3m608j6042J423P387P056j2788o845o402J7155K4803J3335J8961
15926A6712P998k1617Q934K2126m861j1719j3665k6779p326J4013J6540k902M31
$$ plain form
15913 -2115 -3239 -4926 -2362 1008 4493 -23567 -24661 -1259 -6704 -19348 -22800 -38335 -42425 -12556
15899 -12556 -5277 -6619 1236 10451 6132 -22540 -19174 6454 21151 1746 -4102 11120 12777
15886 12777 -687 -12851 -2264 -6497 -20650 -22349 -25186 -18517 -11232 -38369 -48327 -26001 -776
15873 -776 3953 9951 -978 -6667 -15076 -10169 -6434 -4920 -6782 -21121 -40642 -28701 -16410 -9088
15859 -9088 -11293 -15131 -14492 -4660 4790 5632 -13395 -23659 -36768 -48701 -48360 -20865 979 19361
15845 19361 15834 -3689 5436 5442 -15368 -24734 -11521 -12622 -1583 8042 12220 19035 17138 11163
15831 11163 -2948 -15994 -33824 -30662 -24196 -31918 -23447 -5453 5123 -453 -864 -4838 -7089
15818 -7089 -13368 -16670 -5188 -1234 3253 8644 -2603 -5501 -14681 -9792 9929 2208 5495 1722
$$ packed form
15913b115j124j687K564L370L485k8060j094K3402n445j2644l452j5535m090K9869
15899a2556P279j342P855R215m319k8672L366K5628J4697j9405n848J5222J657
15886A2777j3464j2164J0587m233j4153j699k837O669P285k7137r958K2326K5225
15873g76M729N998j0929n689q409M907L735J514j862j4339j9521J1941J2291P322
15859i088k205l838O39R832R450Q42j9027j0264j3109j1933L41K7495K1844J8382
15845A9361l527j9523R125Ok0810r366J3213j101J1039R625M178O815j897n975
15831A1163j4111j3046j7830L162O466p722Q471J7994J0576n576m11l974k251
15818g089o279l302J1482L954M487N391j1247k898r180M889J9721p721L287l773
$$ plain form
15804 1722 7184 10267 6838 1444 -5658 20649 3405 -3228 -10958 -6289 1992 -9273 -9219 4749
15790 4749 18882 11074 1074 10608 3671 -20426 -33644 -17759 -4302 11934 15047 16990 -570
15777 -570 -11382 -29523 -29109 -16803 -11480 3582 16878 20209 25256 27859 25720 15914 7182 -8610
15763 -8610 -23291 -23496 -37279 -45292 -46217 -29585 -21798 -20222 -21269 -10334 -7641 -8006 -4589 14936
15749 14936 24866 15303 4479 4149 288 -8663 -9671 -3125 -5842 2414 -3418 -16853 -19170 -7392
15735 -7392 -2637 9249 -413 -17737 -11925 2402 15327 22631 7834 5777 -624 -15489 -22890
15722 -22890 -4547 31791 20541 -196 9703 16145 -4626 -11632 -18382 -14520 -5950 -16061 -20992
15709 -20992 -472 6874 12083 2356 -3073 -4242 1086 10156 2956 -1662 -7916 -12192 -12908 -22275
$$ packed form
15804A722N462L083l429n394p102K6307j7244o633p730M669Q281j1265N4J3968
15790D749J4133p808j0000R534o937k4097j3218J5885J3457J6236L113J943j7560
15777e70j0812j8141M14J2306N323J5062J3296L331N047K603k139r806q732j5792
15763h610j4681k05j3783q013r25J6632P787J576j047J0935K693l65L417J9525
15749A4936R930r563j0824l30l861q951j008O546k717Q256n832j3435k317J1778
15735g392M755J1886r662j7324N812J4327J2925P304j4797k057o401j4865p401
15722b2890J8343L6338j1250k0737R899O442k0771p006o750L862Q570j0111m931
15709b0992K0520P346N209r727n429j169N328R070p200m618o254m276p16r367
$$ plain form
15695 -22275 -28218 -30352 -10678 5029 26240 28953 16181 19673 19225 3570 -14387 -23577 -15823
15682 -15823 4886 10846 -3276 14354 -15979 -40527 -43335 -35473 -14999 14923 22583 14677 5721
15669 5721 12876 3319 -5869 -8752 4436 4523 -4374 544 4314 1886 -185 -10428 -19623 -15487 -4007
15654 -4007 743 7140 11663 3075 -9199 -17263 -11253 -15912 -22808 -24711 -10950 -6178 1584 4959
15640 4959 -24 -20608 -15255 -25843 -17119 -3046 29403 39692 34051 17310 2989 19026 24035
15627 24035 15693 -2444 15429 23592 12410 -13258 -20459 5423 8444 12889 15215 -188 -2607
15614 -2607 8756 -599 -13555 -24850 -9563 -4358 -590 9263 13861 7753 8695 -3256 -9301 -11969
15600 -11969 -9039 -10531 -22517 -38739 -24510 -13875 -13550 -33192 -63288 -60098 -24983 -14044 528
$$ packed form
15695b2275n943k134J9674J5707K1211K713j2772L492m48j5655j7957r190P754
15682a5823K0709N960j4122J7630l0333k4548k808P862K0474K9922P660p906q956
15669E721P155r557r188k883J3188Q7q897M918L770k428k071j0243r195M136J1480
15654d007M750O397M523q588j2274q064O010m659o896j903J3761M772P762L375
15640D959m983k0584N353j0588Q724J4073L2449J0289n641j6741j4321J6037N009
15627B4035q342j8137J7873Q163j1182k5668p201K5882L021M445K326j5403k419
15614b607J1363r355j2956j1295J5287N205L768R853M598o108R42j1951o045k668
15600a1969K930j492j1986j6222J4229J0635L25j9642l0096L190L5115J0939J4572
$$ plain form
15587 528 9586 -6066 -13348 -9234 -12728 -23290 -15464 -13166 -7243 -20468 -32197 -33036 -16995 -1907
15573 -1907 9176 19404 18774 19433 28589 5595 -17770 -18452 -15696 -20888 -16335 -21702 -30597 -11362
15559 -11362 -634 -13801 -34032 -30921 -11025 -2387 -4739 2632 -9630 -3742 -15599 -20033 -12681
15546 -12681 -32750 -33838 -15624 -25805 -15996 -6167 -303 -5329 1914 10316 20078 9212 -9208
15533 -9208 -8401 -15417 -25187 -17693 -31853 -36562 -24616 1226 23296 25534 -1673 -14194 -17554
15520 -17554 -10777 -3929 1863 -1872 -6903 -8675 -8414 -2401 -7751 1681 12606 1740 -4589 6043
15506 6043 19070 5099 -9916 -15913 -14030 -37960 -37572 -41326 -48547 -23542 -11465 -20902 -30788
15493 -30788 -44791 -29116 -14116 3010 -13979 -32673 -31495 -16693 -11594 -3494 7527 31663
$$ packed form
15587E28R058j5652p282M114l494j0562P826K298N923j3225j1729q39J6041J5088
15573a907J1083J0228o30O59R156k2994k3365o82K756n192M553n367q895J9235
15559a1362J0728j3167k0231L111J9896Q638k352P371j2262N888j1857m434P352
15546a2681k0069j088J8214j0181R809R829N864n026P243Q402R762j0866j8420
15533i208Q07p016r770P494j4160m709J1946K5842K2070K238k7207j2521l360
15520a7554O777O848N792l735n031j772K61O013n350R432J0925j0866o329J0632
15506F043J3027j3971j5015n997J883k3930L88l754p221K5005J2077r437r886
15493c0788j4003J5675J5000J7126j6989j8694J178J4802N099Q100J1021K4136
$$ plain form
15481 31663 26639 5547 -7049 -19944 -14341 -6451 -11310 -6713 -2190 -755 1202 -9762 -14541
15468 -14541 35 16706 2277 -4669 2688 21112 20791 -6498 -28346 -21843 -40497 -33948 -39010
15455 -39010 -27089 -18169 -21165 -11835 -21801 -30236 -16556 6357 9018 -12355 -8252 -8373 -14943 -21120
15441 -21120 -15712 -23917 -23324 -15746 -5386 1415 2929 -749 -2134 3588 3880 161 9608 20053
15427 20053 20628 -2002 -16517 -8650 -14600 -19320 -6550 21694 27120 15081 112 7627 9315
15414 9315 8039 -4842 -13684 -13372 -7442 -4471 5855 17515 22059 6389 -7360 -1028 -8666 -4434
15400 -4434 15779 -5606 -15344 -4557 14245 8649 -4910 -14428 -2491 11807 11806 10144 1316 -8361
15386 -8361 -13104 -18861 -7913 -1669 -1020 7311 -2755 -14100 -15837 -10007 -3328 15332 16971 2355
$$ packed form
15481C1663n024k1092j2596j2895N603P890m859M597M523J435J957j0964m779
15468a4541J4576J6671j4429o946P357J8424l21k7289k1848O503j8654O549n062
15455c9010J1921Q920k996R330r966q435J3680K2913K661k1373M103j21o570o177
15441b1120N408q205N93P578J0360O801J514l678j385N722K92l719R447J0445
15427B0053N75k2630j4515P867n950m720J2770K8244N426j2039j4969P515J688
15414I315j276j2881q842L12N930K971J0326J1660M544j5670j3749O332p638M232
15400d434K0213k1385r738J0787J8802n596j3559r518J1937J4298jj662q828r677
15386h361m743n757J0948O244O49Q331j0066j1345j737N830O679J8660J639j4616
$$ plain form
15372 2355 11345 11942 8803 -13586 -22270 -18180 -7743 -10300 -8045 1978 17239 20465 7378 15678
15358 15678 16524 5900 5495 4679 32985 34506 16719 20331 5546 8153 10428 -9317 -12567 -10928
15344 -10928 -12235 -7445 6767 3589 2221 1190 9831 25433 20471 7455 -9054 -6182 -20613
15331 -20613 -6628 -5052 -4178 5307 6744 -1229 3597 5021 512 -1755 -277 -8293 -20941 -13765
15317 -13765 14034 14643 12842 3117 -18156 -9268 4817 12166 10895 8584 11286 9821 6894 13838
15303 13838 21381 4412 -6755 -11902 -18129 -8400 5473 9266 18608 30225 8431 5989 21802
15290 21802 28518 24261 29275 24841 25878 21775 7901 5280 14942 8348 2488 2923 -3456 -4308 -12601
15275 -12601 -13769 -19178 -25648 -98 10825 10712 -2511 -17772 -15466 -11596 -6 14868 20050
$$ packed form
15372B355Q990N97l139k2389q684M090J0437k557K255J0023J5261L226j3087Q300
15358A5678Q46j0624m05q16K8306J521j7787L612j4785K607K275j9745l250J639
15344a0928j307M790J4212l178j368j031Q641J5602m962j3016j6509K872j4431
15331b0613J3985J576Q74R485J437p973M826J424m509k267J478q016j2648P176
15317a3765K7799O09j801r725k1273Q888J4085P349j271k311K702j465k927O944
15303A3838P543j6969j1167n147o227R729J3873L793R342J1617k1794k442J5813
15290B1802O716m257N014m434J037m103j3874k621R662o594n860M35o379q52q293
15275a2601j168n409o470K5550J0923j13j3223j5261K306L870J1590J4874N182
$$ plain form
15262 20050 19100 6548 -3317 -15657 -18375 -12410 -2027 -20175 -35381 -10402 16190 25449 31214
15249 31214 30843 29448 19542 18346 12290 15690 20020 22356 12754 15205 17304 -869 -10780 -8990
15235 -8990 -19625 -22801 -11228 -6674 2570 -3307 -5850 -9342 -21076 -24886 -7248 4938 4467 -21073
15221 -21073 -27480 -6043 30426 26672 10133 9376 321 -10225 -23153 -10961 20044 22324 19674
15208 19674 532 6795 12910 13120 13155 1349 -16332 -26490 -1680 22192 45797 57819 45142
15195 45142 38581 34787 24657 25584 29461 3837 -990 1656 12479 1221 -20862 -17231 6216
15182 6216 4184 3730 -4065 -6130 902 13280 32562 49910 46038 30780 2071 21684 20453
15169 20453 21168 22400 18317 19153 6780 -11209 -6800 -7910 -22123 -28451 -4189 6793 10529 10836
$$ packed form
15262B0050r50j2552r865j2340k718N965J0383j8148j5206K4979K6592R259N765
15249C1214l71j395r906j196o056L400M330K336r602K451K099j8173r911J790
15235h990j0635l176J1573M554R244n877k543l492j1734l810J7638J2186m71k5540
15221b1073o407K1437L6469l754j6539p57r055j0546j2928J2192L1005K280k650
15208A9674j9142O263O115K10L5j1806j7681j0158K4810K3872K3605J2022j2677
15195D5142o561l794j0130R27L877k5624m827K646J0823j1258k2083L631K3447
15182F216k032m54p795k065P032J2378J9282J7348l872j5258k8709J9613j231
15169B0453P15J232m083Q36j2373j7989M409j110j4213o328K4262J0982L736L07
$$ plain form
15155 10836 6732 -1815 14174 18500 33734 40689 34948 33490 30891 18973 15948 29860 20917
15142 20917 2181 -218 6003 15305 25644 32497 38040 21110 10486 8129 -12802 -6166 7542
15129 7542 22208 34776 13062 -9027 -7550 789 -6730 -12284 -18098 6541 4721 -14165 -6426
15116 -6426 -9266 -18920 -25829 -15741 -15050 -36251 -30463 -7911 -9676 -19310 -28579 -30136 -19884 1254
15102 1254 9510 4775 -2461 12158 15257 5905 9729 10603 -3129 -1044 8289 -2241 -17959 -20477
15088 -20477 -10161 6725 16975 -7055 -16598 -11899 8507 19347 21853 17841 13530 13743 18381
15075 18381 26793 38284 7988 -20912 -34044 -32959 -2328 19535 10833 -3391 -20159 -28775
15063 -28775 -9653 12968 17538 23005 4060 3477 15499 25885 41847 22369 29326 56732 59378
$$ packed form
15155A0836m104q547J5989M326J5234O955n741j458k599j1918l025J3912q943
15142B0917j8736k399O221R302J0339O853N543j6930j0624k357k0931O636J3708
15129G542J4666J2568k1714k2089J477Q339p519n554n814K4639j820j8886P739
15116f426k840r654o909J0088O91k1201N788K2552j765r634r269j557J0252K1138
15102A254Q256m735p236J4619L099r352L824Q74j3732K085R333j0530j5718k518
15088b0477J0316J6886J0250k4030r543M699K0406J0840K506m012m311K13M638
15075A8381Q412J1491l0296k8900j3132J085L0631K1863q702j4224j6768q616
15063b8775J9122K2621M570N467j8945n83J2022J0386J5962j9478O957K7406K646
$$ plain form
15050 59378 71986 109090 110335 108704 113976 88435 63271 39062 42977 36288 26651 10243 -16864
15037 -16864 -25060 -33678 -29401 -28638 -29269 -26761 -27246 -28631 -6626 17142 3006 6163 8445 -72
15023 -72 10457 14668 -107 13130 21330 7980 1784 7507 6921 13816 18108 6261 -11409 -7936
15009 -7936 -13437 -9160 -4657 -3431 -9947 -8621 16211 8182 3511 5795 -7939 -8173 -15064 -23908
14995 -23908 -16606 -14104 -8810 -2148 3101 8517 3121 -16524 -17887 -1559 -2015 -3355 -7064 10138
14981 10138 -2359 -13386 1660 9998 -6513 -11958 12566 15147 -10520 5078 21905 17880
14969 17880 -5500 -1225 4284 11070 13996 22615 10511 20785 53325 43467 15756 10975 8330
14956 8330 -10368 -1709 1082 7392 28190 32769 10086 18646 37778 22092 14001 11528 -1428
$$ packed form
15050E9378J2608L7104J245j631N272k5541k5164k4209L915o689r637j6408k7107
15037a6864q196q618M277P63o31K508m85j385K2005K3768j4136L157K282q517
15023g2J0529M211j4775J3237Q200j3350o196N723n86O895M292j1847j7670L473
15009g936n501M277M503J226o516J326K4832q029m671K284j3734k34o891q844
14995b3908P302K502N294O662N249N416n396j9645j363J6328m56j340l709J7202
14981A0138j2497j1027J5046Q338j6511n445K4524K581k5667J5598J6827m025
14969A7880k3380M275N509O786K926Q619j2104J0274L2540r858k7711m781k645
14956H330j8698Q659K791O310K0798M579k2683Q560J9132j5686q091k473j2956
$$ plain form
14943 -1428 -8783 -6452 -14800 -31445 -12619 4424 -5549 -12379 -1941 4779 -649 5981 12747 6825
14929 6825 -3606 356 -8938 6402 25970 27223 24913 28663 -58 831 4470 6632 -2459 -8268
14915 -8268 -8152 -26641 -14240 -14927 -6949 11560 -2845 -24227 -20560 -7415 1684 9857 30740
14902 30740 12496 -3391 -15727 4806 26881 27391 13703 13385 12960 10181 -5051 -7732 4185
14889 4185 11410 1231 -3716 -14841 -14785 -9440 666 11855 11661 14591 11064 555 -8604 -773
14875 -773 -12028 -7447 4263 19050 13756 13547 6043 -18353 -14836 6960 9271 4456 -131 606
14861 606 -18887 -17843 -6571 4392 3694 19262 27885 21523 24181 12736 253 2951 7248 6973
14847 6973 5395 9412 6279 -718 8553 4776 13361 16076 45040 38647 25492 15882 4714 7831
$$ packed form
14943a428p355K331q348j6645J8826J7043r973o830J0438O720n428O630O766n922
14929F825j0431L962r294J5340J9568J253k310L750k8721Q89L639K162r091n809
14915h268J16j8489J2401o87P978J8509j4405k1382L667J3145R099Q173K0883
14902C0740j8244j5887j2336K0533K2075N10j3688l18m25k779j5232k681J1917
14889D185P225j0179m947j1125N6N345J0106J1189j94K930l527j0509r159P831
14875g73j1255M581J1710J4787n294k09p504k4396L517K1796K311m815m587P37
14861F06j9493J044J1272J0963o98J5568Q623o362K658j1445j2483K698M297k75
14847F973j578M017l133o997R271l777Q585K715K8964o393j3155r610j1168L117
$$ plain form
14833 7831 8586 -12127 -8714 2093 10506 20735 4818 -31497 -28961 -43455 -20927 -981 6493
14820 6493 3846 17667 23672 8615 6552 1882 7598 373 -3048 -7092 -22754 -17043 -9105 -10915
14806 -10915 -17432 -38338 -37215 -42863 -46036 -36872 -38762 -47731 -25199 -10987 1502 6635 19825
14793 19825 6689 -36913 -24524 -16071 -3126 810 13009 19729 16017 19186 12113 7301 699
14780 699 202 5198 8989 21791 32894 33814 16698 16441 28969 32588 48164 45847 31433 29750
14766 29750 22786 6628 4910 19674 20373 16448 13626 12652 18153 9293 -3851 717 -11290 -5534
14752 -5534 -10006 -8820 -9156 -654 -539 -3917 -7796 -5696 3114 -4350 10661 7191 -3252 3257 2058
14737 2058 8556 2546 1236 -1310 -498 -6398 -17119 2835 15029 10736 14109 19510 7626 -5325
$$ packed form
14833G831P55k0713L413J0807Q413J0229j5917l6315K536j4494K2528J9946P474
14820F493k647J3821O005j5057k063m670N716p225l421m044j5662N711P938j810
14806a0915o517k0906J123n648l173R164j890q969K2532J4212J2489N133J3190
14793A9825j3136m3602J2389Q453J2945L936J2199O720l712L169p073m812o602
14780F99m97M996L791J2802J1103R20j7116k57J2528L619J5576k317j4414j683
14766B9750o964j6158j718J4764O99l925k822r74N501q860j3144M568j2007N756
14752e534m472J186l36Q502J15l378l879K100Q810p464J5011l470j0443O509j199
14737B058O498o010j310k546Q12n900j0721J9954J2194m293L373N401j1884j2951
$$ plain form
14723 -5325 -6155 5633 11752 -1479 -14904 -16117 -7453 -6140 2697 9512 30374 32728 21477 12750
14709 12750 3075 11148 5506 -9255 -10710 37 5202 12298 8841 8531 17337 31589 28391 8569
14695 8569 -10700 7138 18577 6630 17527 15805 8764 458 4519 11775 1500 -6029 -12763
14682 -12763 -7536 7588 21651 16666 8169 -22242 -33378 -11587 5250 6219 3653 -2987 955
14669 955 3702 12681 -6286 1435 17389 21328 9764 3969 14509 26560 39635 38795 24855
14656 24855 8123 -801 -8458 -20289 -17590 -9417 1238 9376 14998 20310 25592 32833 16465
14643 16465 4021 -666 -26321 -37409 -33592 -23650 -14757 1827 2627 -3482 -2274 -13316 -21118
14630 -21118 -22231 -1017 -8686 -21402 -5762 -11547 -23373 -12785 -8324 -14126 -21141 -14691 -10203
$$ packed form
14723e325q30J1788O119j3231j3425j213Q664J313Q837O815K0862K354j1251q727
14709A2750r675Q073n642j4761j455J0747N165P096l457l10Q806J4252l198j9822
14695H569j9269J7838J1439j1947J0897j722p041q306M061P256j0275p529o734
14682a2763N227J5124J4063m985q497l0411j1136K1791J6837R69k566o640L942
14669I55K747Q979j8967P721J5954L939j1564n795J0540J2051J3075q40j3940
14656B4855j6732q924p657j1831K699Q173J0655Q138N622N312N282P241j6368
14643A6465j2444m687k5655j1088L817R942Q893J6584Q00o109J208j1042p802
14630b1118j113K1214p669j2716J5640n785j1826J0588M461n802p015O450M488
$$ plain form
14617 -10203 18433 30873 19348 -4178 -1554 -7959 5853 27888 26998 24752 21009 10443 11177
14604 11177 14204 -624 -4204 -9215 -12926 -17220 -16460 -16528 16272 39586 52594 32979 19832 20683
14590 20683 27751 39812 32540 39585 36843 30158 25578 6287 -1036 -12768 -3683 -2658 15301
14577 15301 12538 5605 16710 17625 3384 19004 37777 45330 34979 31927 39417 39515 30797 19322
14563 19322 23098 5171 -6212 -8886 -21934 -14016 -18539 -7561 -2210 -1493 205 1663 2938 10964
14549 10964 15465 11932 14543 16545 12287 25084 17665 22287 24480 19717 6251 -2604 3549 -3509
14535 -3509 5734 5961 20518 20348 26308 33363 23207 21077 16276 4361 -7973 -12051 -2065 12556
14521 12556 9712 14073 20526 12864 6938 12044 7074 7147 17167 26401 40500 38996 26717 15213
$$ packed form
14617a0203K8636J2440j1525k3526K624o405J3812K2035q90k246l743j0566P34
14604A1177L027j4828l580n011l711m294P60o8L2800K3314J3008j9615j3147Q51
14590B0683P068J2061p272P045k742o685m580j9291p323j1732R085J025J7959
14577A5301k763o933J1105R15j4241J5620J8773P553j0351l052P490R8q718j1475
14563A9322L776j7927j1383k674j3048P918m523J0978N351P17J698J458J275Q026
14549A0964M501l533K611K002m258J2797p419M622K193m763j3466q855O153p058
14535c509R243K27J4557j70N960P055j0156k130m801j1915j2334m078R986J4621
14521A2556k844M361O453p662n926N106m970P3J0020R234J4099j504j2279j1504
$$ plain form
14507 15213 8560 14041 15017 -359 5087 17659 31765 34483 25028 18313 17957 21290 16029 9140
14493 9140 6447 -3409 7111 23061 7890 -2337 5980 9592 14428 -81 11400 10032 4699
14480 4699 15180 11118 20480 13573 -2225 -10939 -9290 -15306 -21520 -14317 -1063 -8889 -20614 -8596
14466 -8596 2455 10081 14662 5936 -6466 -1439 23870 26390 6146 -12727 -22095 -23846 -24962
14453 -24962 -12714 642 14486 18924 32245 41116 37834 11788 -5168 -11049 -17250 -11805 -12897
14440 -12897 12549 -906 -14232 -4790 -12368 -17154 -2288 23438 39805 32524 11864 -3179
14428 -3179 12649 34415 33339 33730 36598 33224 27960 11671 -936 8156 14844 12552 9535 26819
14414 26819 11670 4489 7003 23740 37190 25902 23009 23219 20707 15763 25609 22659 9391
$$ packed form
14507A5213o653N481R76j5376N446J2572J4106K718r455o715l56L333n261o889
14493I140k693r856J0520J5950j5171j0227Q317L612M836j4509J1481j368n333
14480D699J0481m062R362o907j5798q714J649o016o214P203J3254p826j1725J2018
14466h596J1051P626M581q726j2402N027K5309K520k0244j8873r368j751j116
14453b4962J2248J3356J3844M438J3321Q871l282k6046j6956n881o201N445j092
14440a2897K5446j3455j3326R442p578m786J4866K5726J6367p281k0660j5043
14428c179J5828K1766j076L91K868l374n264j6289j2607R092O688k292l017J7284
14414B6819j5149p181K514J6737J3450j1288k893K10k512m944R846k950j3268
$$ plain form
14401 9391 7329 13076 23891 1741 -2485 5938 25775 33844 20440 18070 9005 12906 22529 22169
14387 22169 12600 15852 26454 24639 10442 16135 5683 9100 11890 27035 22045 20581 8808
14374 8808 841 -2862 21154 27577 21868 22190 9812 -421 268 -12605 -9698 -2735 11614 32932
14360 32932 40773 26400 24587 18871 1052 -16326 -15156 -5073 3716 12675 16213 3648 9019
14347 9019 26493 34930 24065 28030 6241 3323 10453 -11388 -6060 1232 18128 16853 15859 22120
14333 22120 22595 31956 20678 30293 33273 35645 39644 31271 27759 46112 51489 28540 9053 10992
14319 10992 21039 19061 26026 40142 46106 56209 44808 32873 25944 3105 12931 8042 -4795
14306 -4795 575 11883 6677 -11471 5517 19015 9935 -1072 9772 20769 27506 29957 32657
$$ packed form
14401I391k062N747J0815k2150m226Q423J9837Q069j3404k370r065L901R623l60
14387B2169r569L252J0602j815j4197N693j0452L417K790J5145m990j464j1773
14374H808p967l703K4016O423n709L22j2378j0233O89j2873K907O963J4349K1318
14360C2932P841j4373j813n716j7819j7378J170J0083Q789Q959L538j2565N371
14347I019J7474Q437j0865L965k1789k918P130k1841N328P292J6896j275r94O261
14333B2120M75R361j1278R615K980K372L999q373l512J8353N377k2949j9487J939
14319A0992J0047j978O965J4116N964J0103j1401j1935o929k2839R826m889j2837
14306d795N370J1308n206j8148J6988J3498r080j1007J0844J0997O737K451K700
$$ plain form
14293 32657 32325 27800 23673 21024 17796 18283 26858 31514 17277 20005 27304 27374 29080 30305 27813
14278 27813 25806 20816 18282 16716 28776 36556 42902 49911 55032 61488 52193 24818 4477 6167
14264 6167 -495 1467 16926 20572 35090 42204 39306 16516 6978 1716 28768 58962 78931
14251 78931 61199 38057 32259 32819 46694 37274 23983 31219 31472 42384 53964 55258 43712
14238 43712 28811 43043 37336 30045 32135 28131 36308 38725 34530 32644 51350 39818 33429
14225 33429 27846 19899 7913 4362 4555 25919 16080 16099 24545 29847 25718 33915 24713 41274
14211 41274 55123 43348 33507 43136 51715 49029 53105 57123 53743 55502 53946 59113 47803 36498
14197 36498 13795 18133 18488 13706 16345 13978 24125 31853 40076 58347 68500 72362 58802
$$ packed form
14293C2657l32m525m127k649l228M87Q575M656j4237K728P299P0J706J225k492
14278B7813k007m990k534j566J2060P780O346P009N121O456r295k7375k0341J690
14264F167o662J962J5459L646J4518P114k898k2790r538n262K7052L0194J9969
14251G8931j7732k3142n798N60J3875r420j3291P236K53J0912J1580J294j1546
14238D3712j4901J4232n707p291K090m004Q177K417m195j886J8706j1532o389
14225C3429n583p947j1986l551J93K1364r839J9Q446N302m129Q197r202J6561
14211D1274J3849j1775r841R629Q579k686M076M018l380J759j556N167j1310j1305
14197C6498k2703M338L55m782K639k367J0147P728Q223J8271J0153L862j3560
$$ plain form
14184 58802 66989 65435 61644 72623 72467 67853 49951 51698 66205 64491 64181 77076 84324 110925
14170 110925 106365 128485 140182 150497 152531 173305 198348 224444 252168 282649 333430 394244
14158 394244 484397 565534 697479 863837 1048654 1254035 1459526 1546446 1471660 1227905
14148 1227905 902109 628634 475146 393791 330189 273796 248484 238581 219056 195490 177876
14137 177876 190956 189238 175081 175189 176395 162042 140757 138815 152333 143217 127362 129804 146690
14124 146690 150964 162106 161453 142731 118665 90088 87165 111520 104321 79803 77310 80050 71761
14111 71761 57413 24991 15606 37141 40049 39184 58195 64620 65624 63169 35493 51658 69722
14098 69722 81119 86635 89343 95855 80114 67484 71411 86647 94136 100506 97885 107542 101655
$$ packed form
14184E8802Q187j554l791J0979j56m614j7902J747J4507j714l10J2895P248K6601
14170A10925m560K2120J1697J0315K034K0774K5043K6096K7724L0481N0781O0814
14158C94244R0153Q1137J31945J66358J84817K05381K05491Q6920p4786k43755
14148A227905l25796k73475j53488q1355o3602n6393k5312r903j9525k3566j7614
14137A77876J3080j718j4157J08J206j4353k1285j942J3518r116j5855K442J6886
14124A46690M274J1142o53j8722k4066k8577k923K4355p199k4518k493K740q289
14111G1761j4348l2422r385K1535K908q65J9011O425J004k455k7676J6165J8064
14098F9722J1397N516K708O512j5741j2630L927J5236P489O370k621R657n887
$$ plain form
14085 101655 84886 81055 101115 115585 107825 117288 143171 166661 163540 135097 119902 97078
14073 97078 74956 73572 68052 56184 59517 56912 67640 62343 54311 59760 62083 72139 65625
14060 65625 58943 70572 77571 68311 48541 48964 51743 48083 51630 56715 64196 61563 62125 63904
14046 63904 52550 40603 39965 43129 41664 61915 63291 48336 55090 38121 46242 52086 82024
14033 82024 83849 63533 82416 91275 84386 77758 79879 113644 127307 119779 106576 91192 63554
14020 63554 64598 79679 72712 44674 40998 42269 48412 62010 68821 80785 67774 55032 63879
14007 63879 62291 58184 49833 49638 41914 35795 41595 60511 45244 45136 58675 73034 70677 71052
13993 71052 83354 81420 75430 66177 90116 134467 140069 130841 119094 121949 141523 127845 103047
$$ packed form
14085A01655j6769l831K0060J4470p760R463K5883K3490l121k8443j5195k2824
14073I7078k2122j384n520j1868L333k605J0728n297q032N449K323J0056o514
14060F5625o682J1629O999r260j9770M23K779l660L547N085P481k633N62J779
14046F3904j1354j1947o38L164j465K0251J376j4955O754j6969Q121N844K9938
14033H2024J825k0316J8883Q859o889o628K121L3765J3663p528j3203j5384k7638
14020F3554J044J5081o967k8038l676J271O143J3598O811J1964j3011j2742Q847
14007F3879j588m107q351j95p724o119N800J8916j5267j08J3539J4359k357L75
13993G1052J2302j934n990r253K3939M4351N602r228j1747K855J9574j3678k4798
$$ plain form
13980 103047 75976 72574 66993 59704 70235 72221 55284 46742 48300 54944 58138 60418 53235
13967 53235 38989 21752 27594 43646 55207 59966 62498 49588 65338 95722 87102 94696 112026
13954 112026 112949 106537 90925 94310 106494 115944 99744 83968 91912 104663 90950 69721 51158
13941 51158 66382 76079 88145 95311 103585 104130 109516 129048 157228 199764 208140 201848 210216
13928 210216 242905 270336 269000 224670 174545 116471 91734 80761 82961 69687 58218 65335
13916 65335 63799 59261 60783 65865 67674 73005 70693 71126 90813 98047 86588 96755 100948 90167
13902 90167 79065 72556 98487 108115 100249 104625 130695 128507 113222 104402 94868 102684 96753
13889 96753 89369 84592 90240 110169 120360 114285 106352 108262 94081 89469 68474 33351 5797
$$ packed form
13980A03047k7071l402n581p289J0531J986j6937q542J558O644L194K280p183
13967E3235j4246j7237N842J6052J1561M759K532j2910J5750L0384q620P594J7330
13954A12026R23o412j5612L385J2184R450j6200j5776P944J2751j3713k1229j8563
13941E1158J5224R697J2066P166Q274N45N386J9532K8180M2536Q376o292Q368
13928B10216L2689K7431j336m4330n0125n8074k4737j0973K200j3274j1469P117
13916F5335j536m538J522N082J809N331k312M33J9687P234j1459J0167M193j0781
13902I0167j1102o509K5931R628p866M376K6070k188j5285q820r534P816n931
13889I6753p384m777N648J9929J0191o075p933J910j4181m612k0995l5123k7554
$$ plain form
13876 5797 -5179 -14240 -847 -11733 -9798 7397 47137 92776 119028 138207 137938 117572 98296
13863 98296 106711 109927 120059 120900 112807 104223 94852 87047 66079 52352 40917 60356 97539
13850 97539 120772 138983 134403 121045 135661 159784 149537 136432 138529 163868 181812 167899
13838 167899 172140 153670 154470 183972 187867 174080 156732 120993 97853 78382 37593 16317
13826 16317 47196 69686 103203 138119 161555 159280 169130 198485 218537 239954 246450 271311
13814 271311 311685 360569 405959 419285 438883 473185 517813 568229 584150 558554 515999
13803 515999 453453 415754 408420 419605 439695 444348 404393 378857 381639 346874 316423 293903
13791 293903 271953 266484 268241 282928 293158 285417 290222 299720 289475 289349 326210 350114 371121
$$ packed form
13876E797j0976r061J3393j0886J935J7195L9740M5639K6252J9179k69k0366j9276
13863I8296Q415L216J0132Q41q093q584r371p805k0968j3727j1435J9439L7183
13850I7539K3233J8211m580j3358J4616K4123j0247j3105K097K5339J7944j3913
13838A67899M241j8470Q00K9502L895j3787j7348l5739k3140j9471m0789k1276
13826A6317L0879K2490L3517L4916K3436k275R850K9355K0052K1417O496K4861
13814B71311M0374M8884M5390J3326J9598L4302M4628N0416J5921k5596m2555
13803E15999o2546l7699p334J1185K0090M653l9955k5536K782l4765l0451k2520
13791B93903k1950n469J757J4687J0230p741M805R498j0245j26L6861K3904K1007
$$ plain form
13778 371121 378604 401397 409719 410734 428113 429206 459081 491546 505305 545288 580016 596352
13766 596352 630539 657842 657267 671097 683144 672981 690323 716606 722838 718406 743707 775053
13754 775053 796428 802302 795995 800873 812109 839217 856311 861223 849583 864883 892780 911628
13742 911628 932423 951216 976674 989294 1039765 1066285 1071313 1100148 1116506 1133749 1153674 1145108
13730 1145108 1155423 1174557 1203026 1266834 1323505 1361483 1413287 1438213 1460814 1504121 1568422
13719 1568422 1647662 1713891 1804656 1898066 1995441 2110704 2228014 2373013 2527231 2664555
13709 2664555 2853626 3103643 3389525 3708758 4022610 4344966 4700266 5102835 5546482
13700 5546482 6038700 6605294 7218107 7938436 8803132 9833410 11039542 12445679 14107132
$$ packed form
13778C71121P483K2793Q322J015J7379J093K9875L2465J3759L9983L4728J6336
13766E96352L4187K7303n75J3830J2047j0163J7342K6283O232m432K5301L1346
13754G75053K1375N874o307M878J1236K7108J7094M912j1640J5300K7897J8848
13742I11628K0795J8793K5458J2620N0471K6520N028K8835J6358J7243J9925q566
13730A145108J0315J9134K8469O3808N6671L7978N1804K4926K2601M3307O4301
13719A568422P9240O6229R0765R3410R7375J15263J17310J44999J54218J37324
13709B664555J89071K50017K85882L19233L13852L22356L55300M02569M43647
13700E546482M92218N66594O12813P20329Q64696J030278J206132J406137J661453
$$ plain form
13691 14107132 16061056 18285751 20850384 23835701 27325833 31504368 36611259 42820385
13683 42820385 50540568 60576128 74092871 92113209 115363434 144239581 178836212
13676 178836212 218182376 259608702 291949722 295829341 257577655 190672429 132556910
13669 132556910 94749282 71735344 57410195 48076362 41701923 37187112 33908247
13662 33908247 31436589 29432828 27609020 25891657 24397136 23172896 22207703 21497795
13654 21497795 21017835 20739929 20620673 20500691 20041699 19091531 17866727 16560575 15328098
13645 15328098 14193571 13155760 12205751 11357798 10575646 9887030 9273817 8722817 8187292
13636 8187292 7653435 7142983 6690193 6287239 5935773 5610314 5294277 4999152 4716523
$$ packed form
13691A4107132J953924K224695K564633K985317L490132M178535N106891O209126
13683D2820385P720183J0035560J3516743J8020338K3250225K8876147L4596631
13676A78836212L9346164M1426326L2341020L879619l8251686o6905226n8115519
13669A32556910l7807628k3013938j4325149r333833o374439m514811l278865
13662C3908247k471658k003761j823808j717363j494521j224240r65193p09908
13654B1497795m79960k77906j19256j19982m58992r50168j224804j306152j232477
13645A5328098j134527j037811r50009q47953p82152o88616o13213n51000n35525
13636H187292n33857n10452m52790m02954l51466l25459l16037k95125k82629
$$ plain form
13627 4716523 4443978 4189848 3956705 3738880 3528197 3340272 3172673 3016167 2878978
13618 2878978 2733663 2584111 2416376 2266248 2130252 2000399 1907519 1830054 1761448 1696583
13608 1696583 1600967 1529813 1475906 1405409 1356573 1296749 1220730 1144940 1101318 1050997 996889
13597 996889 934216 883275 841032 781834 734113 707475 679232 661852 622993 580306 545879
13586 545879 526650 502825 473984 448997 417785 395352 390282 385282 378563 385823 392927 389537 368552
13573 368552 349426 350227 321559 293704 280236 290873 297385 303246 315891 316639 314991 317651 332536
13560 332536 334181 321649 289467 270236 266956 290470 335849 401761 470744 564323 639534 666525
13548 666525 674596 675835 668796 627259 545556 448180 384304 334762 284168 239861 202585 176596
$$ packed form
13627D716523k72545k54130k33143k17825k10683j87925j67599j56506j37189
13618B878978j45315j49552j67735j50128j35996j29853r2880p7465o8606o4865
13608A696583r5616p1154n3907p0497m8836n9824p6019p5790m3622n0321n4108
13597I96889o2673n0941m2243n9198m7721k6638k8243j7380l8859m2687l4427
13586E45879j9229k3825k8841k4987l1212k2433n070n000o719P260P104l390k0985
13573C68552j9126Q01k8668k7855j3468J0637O512N861J2645P48j648K660J4885
13560C32536J645j2532l2182j9231l280K3514M5379O5912O8983R3579P5211K6991
13548F66525Q071J239p039m1537q1703r7376o3876m9542n0594m4307l7276k5989
$$ plain form
13536 176596 157249 153476 159510 172658 191694 195630 183530 188024 201160 211065 225999 237397
13524 237397 251773 263721 294851 320050 343075 349851 342580 292175 231608 180293 179316 196189
13512 196189 207928 218045 225002 227471 243131 244246 233352 225983 225691 221680 244699 257109 263736
13499 263736 265733 291710 316530 327848 320554 300224 277026 260676 241553 238879 234302 250603
13487 250603 252502 239168 226769 197756 177127 195548 213274 218688 220828 235464 253108 271551
13475 271551 290480 292811 261758 241480 246810 243233 226121 189592 151044 114725 101750 108830
13463 108830 105481 106708 115759 121272 127998 123592 113137 109706 111065 87480 80897 95094 83082
13450 83082 91496 109153 102666 99764 100213 99606 93531 78000 77140 94598 88355 77264 71464 78464
$$ packed form
13536A76596j9347l773O034J3148J9036L936j2100M494J3136R905J4934J1398
13524B37397J4376J1948L1130K5199K3025O776p271n0405o0567n1315r77J6873
13512A96189J1739J0117O957K469J5660J115j0894p369k92m011K3019J2410O627
13499B63736J997K5977K4820J1318p294k0330k3198j6350j9123k674m577J6301
13487B50603J899j3334j2399k9013k0629J8421J7726N414K140J4636J7644J8443
13475B71551J8929K331l1053k0278N330l577j7112l6529l8548l6319j2975P080
13463A08830l349J227R051N513O726m406j0455l431J359k3585o583J4197j2012
13450H3082Q414J7657o487k902M49o07o075j5531q60J7458o243j1091n800P000
$$ plain form
13436 78464 96411 95767 60480 38162 45742 33478 7911 13049 19802 23283 28337 32039 33886
13423 33886 15927 20751 24833 23212 34966 19366 31708 56770 43419 39741 67430 76723 61350
13410 61350 62601 64859 59040 43422 34363 26493 25003 14536 173 8164 22442 13673 -2841
13397 -2841 3122 11031 7641 5170 -5437 -5810 -18845 -368 12068 8050 5858 4266 15815 33430
13383 33430 48932 58266 74648 62342 65440 50203 54312 62564 38983 35264 26248 18128 20265
13370 20265 21153 13363 20269 14060 -5846 -29494 -29488 -29106 -29865 -28927 -8781 7453 31214 27138 35877
13355 35877 56728 41351 29015 39923 74593 76532 59044 64156 73275 65989 64117 67668 59993
13342 59993 57597 54329 51467 55194 59219 64983 60437 56579 18901 -753 -1136 -5199 -15054 -17293
$$ packed form
13436G8464J7947o44l5287k2318P580j2264k5567N138O753L481N054L702J847
13423C3886j7959M824M082j621J1754j5600J2342K5062j3351l678K7689R293j5373
13410F1350J251K258n819j5618r059p870j490j0467j4363P991J4278q769j6514
13397b841N963P909l390k471j0607l73j3035J8477J2436m018k192j592J1549J7615
13383C3430J5502R334J6382j2306L098j5237M109Q252k3581l719r016q120K137
13370B0265Q88p790O906o209j9906k3648OL82p59R38K0146J6234K3761m076Q739
13355C5877K0851j5377j2336J0908L4670J939j7488N112R119p286j872L551p675
13342E9993k396l268k862L727M025N764m546l858l7678j9654l83m063r855k239
$$ plain form
13328 -17293 1210 -1200 -26267 -23095 -18624 -13676 1400 -8618 -5349 17620 24411 19124 11141
13315 11141 176 -8045 -1463 9282 20707 18890 29211 35939 42302 47359 42913 34932 32840
13302 32840 24002 19867 33372 29411 28850 26864 17395 12314 -2985 -15401 4771 40637 50282
13289 50282 37221 9572 -12160 799 -3705 -6582 -7635 -11481 2261 16828 -2874 -24872
13277 -24872 -5940 -621 9869 16801 37934 46877 36330 26432 44527 37630 47354 64345 43672
13264 43672 25422 4989 -11883 -18784 -15613 7351 34845 30930 18839 5961 12723 27256
13252 27256 24109 29840 19935 8130 -3091 5179 -4328 -15212 -12201 -2255 15066 20881 32033
13239 32033 47597 29434 8290 4823 1655 26284 35600 26929 31576 41852 39294 38353 26657
$$ packed form
13328a7293J8503k410k5067L172M471M948J5076j0018L269K2969O791n287p983
13315A1141j0965q221O582J0745J1425j817J0321O728O363N057m446p981k092
13302C2840q838m135J3505l961n61j986r469n081j5299j2416K0172L5866R645
13289E0282j3061k7649k1732J2959m504k877j053l846J3742J4567j9702k1998
13277b4872J8932N319J0490O932K1133Q943j0547r898J8095o897R724J6991k0673
13264D3672j8250k0433j6872o901L171K2964K7494l915j2091j2878O762J4533
13252B7256l147N731r905j1805j1221Q270r507j0884L011R946J7321N815J1152
13239C2033J5564j8163k1144l467l168K4629R316q671M647J0276k558r41j1696
$$ plain form
13226 26657 15645 16419 26324 11214 13282 28761 49488 48962 61263 65273 68594 56084 42970
13213 42970 30248 31253 42966 49436 55641 92900 95028 103835 129459 149528 184169 202331 226474
13200 226474 249122 294800 347318 408051 498459 611167 739930 921275 1129830 1325046
13190 1325046 1483008 1512271 1330459 1013026 743697 552577 411542 320308 275639 230220
13180 230220 201767 202880 196062 181515 169486 153704 144485 133183 111577 107876 100867 97304 88522
13167 88522 92831 115107 119204 108713 106012 99644 108119 107859 102917 91859 78928 77106 76675 54800
13153 54800 43666 45600 40395 22666 13008 11853 -1087 -3108 -4435 -1732 12361 8288 -5673
13140 -5673 4324 2820 -5694 -18328 -19691 -9761 -4973 2328 9965 -4430 315 7441 -1006 8795
$$ packed form
13226B6657j1012P74R905j5110K068J5479K0727n26J2301M010L321j2510j3114
13213D2970j2722J005J1713O470O205L7259K128Q807K5624K0069L4641J8162K4143
13200B26474K2648M5678N2518O0733R0408J12708J28763J81345K08555J95216
13190A325046J57962K9263j81812l17433k69329j91120j41035r1234m4669m5419
13180B30220k8453J113o818j4547j2029j5782r219j1302k1606l701p009l563q782
13167H8522M309K2276M097j0491k701o368Q475k60m942j1058j2931j822m31k1875
13153E4800j1134J934n205j7729r658j155j2940k021j327K703J4093m073j3961
13140e673R997j504q514j2634j363R930M788P301P637j4395M745P126q447R801
$$ plain form
13126 8795 15171 12801 8993 -3559 -4744 6239 29601 40599 41730 24227 7338 -3584 -13958
13113 -13958 -9461 5181 23176 35459 25607 19686 36 -1402 -4209 -6991 -4994 -12694 -778
13100 -778 12166 -2119 -6500 -15422 -18158 -12278 -17544 -26556 -32896 -23706 -4804 -109 -11763 -3722
13086 -3722 -7324 -7714 9124 24468 26716 42186 37561 15491 -6302 -4115 14297 28653 16712
13073 16712 362 8720 12245 25494 457 2119 -482 2657 10085 19868 16342 -5754 -7012
13060 -7012 -7787 -10442 -13779 -9542 -9233 -4816 -25303 -19273 1860 12319 19204 29465 12032 -6606
13046 -6606 -20375 -483 12053 25092 17959 -2505 874 -3810 -4499 -6657 1186 -4552 -22587
13033 -22587 -103 5727 -13203 -21904 -8539 2301 -6942 -18891 -27949 -34213 -22757 -14866 -11966
$$ packed form
13126H795O376k370l808j2552j185J0983K3362J0998J131j7503j6889j0922j0374
13113a3958M497J4642J7995J2283r852n921j9650j438k807k782J997p700J1916
13100g78J2944j4285m381q922k736N880n266r012o340R190J8902M695j1654Q041
13086c722l602l90J6838J5344K248J5470m625k2070k1793K187J8412J4356j1941
13073A6712j6350Q358L525J3249k5037J662k601L139P428R783l526k2096j258
13060g012p75k655l337M237L09M417k0487O030K1133J0459O885J0261j7433j8638
13046f606j3769J9892J2536J3039p133k0464L379m684o89k158P843n738j8035
13033b2587K2484N830j8930q701J3365J0840r243j1949r058o264J1456P891K900
$$ plain form
13020 -11966 -4539 -10402 -17007 -7179 3423 1025 -5872 -5677 -8981 1756 19933 16233 8016 -3049
13006 -3049 3457 979 9893 15895 24253 24861 7501 5288 10515 14685 15300 -8204 -11702 -8458 -21195
12991 -21195 -17335 15708 34423 14759 5018 3306 -3898 -15757 -15366 -13060 -5430 14999 -9791
12978 -9791 -5849 2904 -18543 -36587 -46215 -34133 -14475 -2990 -4340 6332 14197 24243 17151
12965 17151 9384 19018 22256 11775 22234 26975 22832 12251 10472 -2953 -13776 -12667 -9411
12952 -9411 -4741 2004 4244 2602 10560 9347 7927 13538 8027 -1708 -11255 -25525 -33342 -28397
12938 -28397 -10749 2109 -13372 11756 22907 1106 2896 7950 1596 10881 1674 -9246 -3755
12925 -3755 -10313 -18389 1781 -5676 -26791 -36069 -32183 -21903 -19848 -35140 -26057 -15045 -8394
$$ packed form
13020a1966P427n863o605R828J0602k398o897J95l304J0737J8177l700q217j1065
13006c049O506k478Q914O002Q358O08j7360k213N227M170O15k3504l498L244j2737
12991b1195L860L3043J8715j9664r741j712p204j1859L91K306P630K0429k4790
12978i791L942Q753k1447j8044r628J2082J9658J1485j350J0672P865J0046p092
12965A7151p767R634L238j0481J0459M741m143j0581j779j3425j0823J109L256
12952i411M670O745K240j642P958j213j420N611n511r735r547j4270p817M945
12938b8397J7648J2858j5481K5128J1151k1801J790N054o354R285r207j0920N491
12925c755o558q076K0170p457k1115r278L886J0280K055j5292R083J1012O651
$$ plain form
12912 -8394 10975 10110 3488 2673 4108 7123 6146 -5081 -17773 -14366 -15526 683 -1911 16547
12898 16547 24025 2119 -24322 -38740 -29211 -6990 1062 4112 11551 2080 -12276 -21032 -10286
12885 -10286 905 -2376 6592 14790 12588 16209 9100 14125 -2769 -8092 3115 268 -17517
12872 -17517 -27494 -33713 -36692 -29904 -11179 -3873 -14462 -22319 -4932 11161 5458 6763 7453 -7076
12858 -7076 -12468 -849 -11046 -13492 -16982 -24086 -8890 8417 8728 9547 4518 -8822 3010 120
12844 120 -6049 -19307 -33221 -20288 -1564 17255 12195 17475 13401 3493 3016 17679 30071
12831 30071 32721 18419 17716 -4850 -2300 14817 18129 11494 15611 18408 430 -12717 -23053
12818 -23053 -25164 -22529 -22784 -14182 -11970 6197 -2757 -26171 -35364 -26705 -45335 -38858 -8477 6785
$$ packed form
12912h394J9369q65o622q15J435L015r77j1227j2692L407j160J6209k594J8458
12898A6547P478k1906k6441j4418R529K2221Q052L050P439r471j4356q756J0746
12885a0286J1191l281Q968Q198k202L621p109N025j6894n323J1207k847j7785
12872a7517r977o219k979O788J8725P306j0589p857J7387J6093n703J305O90j4529
12858g076n392J1619j0197k446l490p104J5196J7307L11Q19n029j3340J1832k890
12844A20o169j3258j3914J2933J8724J8819n060N280m074r908m77J4663J2392
12831C0071K650j4302p03k2566K550J7117L312o635M117K797j7978j3147j0336
12818b3053k111K635k55Q602K212J8167q954k3414r193Q659j8630O477L0381J5262
$$ plain form
12804 6785 9303 23348 47173 43714 2925 -8586 18760 33382 40194 27672 41105 40377 33511
12791 33511 22438 19836 28702 27614 12328 -6494 12235 20385 28756 31811 14653 1285 -7277
12778 -7277 9452 33815 32650 23815 23117 21390 34386 42368 23105 25896 27328 18693 -6301 -13315
12764 -13315 -4475 7737 9976 -9087 -11508 365 7453 -3754 4163 7879 6092 14551 14412 13389
12750 13389 2931 20634 42923 29777 8999 5146 -5129 -17189 -26120 -25172 -22148 -30700 -46237
12737 -46237 -26011 -9468 -562 -317 -9199 -2392 2520 -13993 8666 22278 33745 4919 -4671
12724 -4671 16939 15655 11006 16984 12243 9374 -669 -181 3895 7956 2432 -3769 -7843 -2990
12710 -2990 -11292 -29755 -29970 -30853 -17594 4571 5491 1411 1028 -7122 -8062 -14506 -16829 -17008 -1218
$$ packed form
12804F785K518J4045K3825l459m0789j1511K7346J4622O812j2522J3433p28o866
12791C3511j1073k602Q866j088j5286j8822J8729Q150Q371L055j7158j3368q562
12778g277J6729K4363j165q835o98j727J2996P982j9263K791J432q635k4994p014
12764a3315Q840J2212K239j9063k421J1873P088j1207P917L716j787Q459j39j023
12750A3389j0458J7703K2289j3146k0778l853j0275j2060q931R48L024q552j5537
12737d6237K0226J6543Q906K45q882O807M912j6513K2659J3612J1467k8826r590
12724d671K1610j284m649N978m741k869j0043M88M076M061n524o201m074M853
12710b990q302j8463k15q83J3259K2165R20m080l83q150r40o444k323j79J5790
$$ plain form
12695 -1218 -13706 -21865 -13933 -1838 -18355 -33243 -48050 -55068 -33875 -22941 -18614 -24026 -16614
12682 -16614 -3671 -1163 -5163 1720 3068 -14372 -27290 -30225 -4616 22813 11710 6413 3739
12669 3739 -18232 -15543 2660 10985 -10805 -26179 -18234 -4162 -1224 -3943 -6882 -2003 7092
12656 7092 17476 31188 42699 30214 1386 -4374 4205 22183 33430 43542 38212 22579
12644 22579 28722 23818 16913 19533 25561 20092 387 2115 3237 14920 27692 24578 15350 14627
12630 14627 13823 -4995 -3184 11802 16051 7928 12493 28130 23655 20442 42678 31672 17866
12617 17866 24611 18568 5275 152 14649 7209 2897 -702 4963 12794 -3250 -3317 12846 16188
12603 16188 15217 2342 3363 5091 21532 24701 1314 -11842 2907 -4643 -14093 -12142 -3987
$$ packed form
12695a218j2488q159P932J2095j6517j4888j4807p018K1193J0934M327n412P412
12682a6614J2943K508m000O883J348j7440j2918k935K5609K7429j1103n297k674
12669C739k1971K689J8203Q325k1790j5374P945J4072K938k719k939M879R095
12656G092J0384J3712J1511j2485k8828n760Q579J7978J1247J0112n330j5633
12644B2579O143m904o905K620O028n469j9705J728J122J1683J2772l114r228p23
12630A4627q04j8818J811J4986M249q123M565J5637m475l213K2236j1006j3806
12617A7866O745o043j3293n123J4497p440m312l599N665P831j6044o7J6163L342
12603A6188r71j2875J021J728J6441L169k3387j3156J4749p550r450J951Q155
$$ plain form
12590 -3987 10208 31889 42327 41778 31019 19497 -419 -15924 -7449 -3003 4175 5868 -5046
12577 -5046 8217 -144 -11518 -13434 -15188 -43553 -40672 -8927 16503 25391 26003 27269 19735 2298
12563 2298 2077 -5617 -1840 1325 -7004 -16120 -7914 -8633 -7126 -3944 16423 16674 -6150 -2165 -12060
12548 -12060 -14943 -8894 -12581 -9045 2505 2268 9993 12549 4970 -3193 -13284 -11260 -12918 -11417
12534 -11417 -15242 -16283 -32114 -60543 -53143 -27006 -19399 -14709 -13383 -14101 -12903 2862 13652
12521 13652 15898 -7615 -12487 -4992 7429 6336 11044 34154 32730 19736 15480 2604 -789
12508 -789 5593 1363 14270 5953 -9888 479 -22189 -29340 -18229 -3959 -16410 -26679 -1837
12495 -1837 12332 -1005 -28518 -35189 -18456 -9779 -6445 -13185 -12488 -12300 -15791 -7693 -2663 -191
$$ packed form
12590c987J4195K1681J0438n49j0759j1522j9916j5505Q475M446P178J693j0914
12577e046J3263q361j1374j916j754k8365K881L1745K5430Q888O12J266p534j7437
12563B298k21p694L777L165q329r116Q206p19J507L182K0367K51k2824L985r895
12548a2060k883O049l687L536J1550k37P725K556p579q163j0091K024j658J501
12534a1417l825j041j5831k8429P400K6137P607M690J326p18J198J5765J0790
12521A3652K246k3513m872P495J2421j093M708K3110j424j2994m256j2876l393
12508g89O382m230J2907q317j5841J0367k2668p151J1111J4270j2451j0269K4842
12495a837J4169j3337k7513o671J6733Q677L334o740O97J88l491Q098N030K472
$$ plain form
12481 -191 6458 -2670 -7912 8466 21613 33538 34575 21843 9502 4279 11032 449 6296
12468 6296 25776 24160 -9987 -12904 3955 26965 38369 9123 -7540 -19600 -4614 11991
12456 11991 29478 32790 21471 7725 12592 35563 51995 40307 32480 46173 52827 28361
12444 28361 10599 13384 29927 23161 21186 8152 13019 9708 -499 6762 5485 -2809 -3995
12431 -3995 -10712 -5233 -868 -6756 1555 -1647 -22849 -18392 6953 22474 9508 11077 20204 18669
12417 18669 6269 -5350 -2728 7909 18612 3922 -1631 -11825 -24282 -22685 -17061 5191
12405 5191 6385 8268 -3586 -20827 -29316 -16529 -29022 -42777 -10519 1736 -6537 1284 20658
12392 20658 27100 11574 -4756 -11824 -12716 2559 518 -7257 5974 33793 28373 11252 -5275
$$ packed form
12481a91O649r128n242J6378J3147J1925J037j2732j2341n223O753j0583N847
12468F296J9480j616l4147k917J6859K3010J1404k9246j6663j2060J4986J6605
12456A1991J7487L312j1319j3746M867K2971J6432j1688p827J3693O654k4466
12444B8361j7762K785J6543o766j975j3034M867l311j0207P261j277q294j186
12431c995o717N479M365n888Q311l202k1202M457K5345J5521j2966J569R127j535
12417A8669j2400j1619K622J0637J0703j4690n553j0194j2457J597N624K2252
12405E191J194J883j1854j7241q489J2787j2493j3755L2258J2255q273P821J9374
12392B0658O442j5526j6330p068q92J5275k041p775J3231K7819n420j7121j6527
$$ plain form
12379 -5275 -3843 2688 11090 -4218 -21471 -1255 11240 7822 13576 24686 12216 22228 -1945
12366 -1945 -19123 -15805 -13304 -18475 -23453 -12799 -19036 -35803 -30728 -14568 -27280 -5642 1990
12353 1990 -11760 -10301 13185 25743 9954 18740 24650 8777 -424 16941 37409 24589 25296
12340 25296 28053 25809 23461 33373 18265 26334 54276 51415 21742 23627 35261 21779 38878
12327 38878 67314 52940 39704 13736 1084 10897 27296 40297 37380 37635 31099 31675 25738
12314 25738 30890 22445 -1925 -9806 -162 1324 18137 39240 46484 46153 30467 32036 37497 47803
12300 47803 32726 21197 14144 13482 11356 10725 24138 29319 25659 15944 8686 -1176 -21598 -29841
12286 -29841 -20341 -439 7739 14579 15467 6714 6718 8095 10177 23856 23745 9878 -9279 -8970 -11704
$$ packed form
12379e275J432O531Q402j5308j7253K0216J2495l418N754J1110j2470J0012k4173
12366a945j7178L318K501n171m978J0654o237j6767N075J6160j2712K1638P632
12353A990j3750J459K3486J2558j5789Q786N910j5873r201J7365K0468j2820P07
12340B5296K757k244k348R912j5108Q069K7942k861k9673J885J1634j3482J7099
12327C8878K8436j4374j3236k5968j2652R813J6399J3001k917K55o536N76n937
12314B5738N152q445k4370p881R644J486J6813K1103P244l31j5686J569N461J0306
12300D7803j5077j1529p053o62k126o31J3413N181l660r715p258r862k0422q243
12286b9841R500J9902Q178O840Q88q753MJ377K082J3679j11j3867j9157L09k734
$$ plain form
12271 -11704 -544 -8661 -37815 -42057 -15181 19092 21103 6655 14422 26573 36847 38930 34262
12258 34262 19539 18719 34582 25743 20044 7962 -8154 -6300 8715 4280 5753 3731 13357
12245 13357 29792 36671 43842 59219 50286 55309 57462 33862 37272 27515 32663 49191 38753
12232 38753 36322 33208 42018 62270 58916 24557 8158 10198 22220 27364 35687 14175 7505
12219 7505 22051 34160 31789 23685 44017 44710 33553 27120 24173 36583 40744 22397 6829
12206 6829 7018 8502 22307 17919 12640 18114 27903 26984 14923 23553 45695 56782 51504 46814
12192 46814 44904 44973 46661 43260 35357 35571 28889 11250 -6906 -11977 -11407 -17395 -15855 -10968 4742
12177 4742 20640 19666 22118 24929 32521 31588 21434 43090 44416 27066 17832 29968 33789 51488
$$ packed form
12271a1704J1160q117k9154m242K6876L4273K011j4448P767J2151J0274K083m668
12258C4262j4723q20J5863q839n699j2082j6116J854J5015m435J473k022R626
12245A3357J6435O879P171J5377q933N023K153k3600L410r757N148J6528j0438
12232C8753k431l114Q810K0252l354l4359j6399K040J2022N144Q323k1512o670
12219G505J4546J2109k371q104K0332O93j1157o433k947J2410M161j8347j5568
12206F829J89J484J3805m388n279N474R789r19j2061Q630K2142J1087n278m690
12192D6814j910O9J688l401p903K14o682j7639j8156n071N70n988J540M887J5710
12177D742J5898r74K452K811P592r33j0154K1656J326j7350r234J2136L821J7699
$$ plain form
12163 51488 38895 25044 31958 38125 37800 31502 33396 38611 36853 22997 27418 33707 27599 26787
12149 26787 36238 27553 24554 22374 26638 22925 28415 37603 43663 40600 27436 35580 31803 25016
12135 25016 41787 48183 52304 36970 27958 32303 50204 46757 60157 65402 64524 45904 30005
12122 30005 23567 14893 27943 36390 47684 44368 42766 51409 30415 11424 3740 1189 9798
12109 9798 16365 14880 26370 33240 9607 4906 16218 26054 38817 36013 38643 25945 5723
12096 5723 1263 11545 35440 21654 25703 22761 38125 43211 29430 21195 27900 44189 54329
12083 54329 46804 32742 28402 32669 26861 36096 41704 24773 32409 52626 63007 49726 50112
12070 50112 46765 50336 43653 27072 8212 19569 40239 51315 47902 26369 19784 25194 47048
$$ packed form
12163E1488j2593j3851O914O167l25o298J894N215j758j3856M421O289o108q12
12149B6787R451q685k999k180M264l713N490R188O060l063j3164Q144l777o787
12135B5016J6771O396M121j5334r012M345J7901l447J3400N245q78j8620j5899
12122C0005o438q674J3050Q447J1294l316j602Q643k0994j8991p684k551Q609
12109I798O567j485J1490O870k3633m701J1312R836J2763k804K630j2698k0222
12096E723m460J0282K3895j3786M049k942J5364N086j3781q235O705J6289J0140
12083E4329p525j4062m340M267n808R235N608j6931P636K0217J0381j3281L86
12070E0112l347L571o683j6581j8860J1357K0670J1076l413k1533o585N410K1854
$$ plain form
12057 47048 52558 52441 54364 50773 48180 51067 65146 78483 70739 54784 52238 42837 39780 45730
12043 45730 41279 37819 43535 32371 18573 28313 29843 33551 53402 58535 61215 56082 53294 53915
12029 53915 56892 42695 9028 6481 32262 60317 69989 65627 57841 51805 61344 64948 50519
12016 50519 52712 84924 100722 75448 59920 81382 74689 69397 80327 78624 79076 61568 68767
12003 68767 71492 69055 63743 59475 61979 63408 74627 76935 71096 67462 68179 74491 60165 49230
11989 49230 58012 70181 71319 68698 65683 66174 71444 71452 48120 57239 76074 81010 74276 67040 68858
11974 68858 76653 89389 102485 92511 105014 133453 131416 112654 112300 129049 127574 132888 130305
11961 130305 112237 110411 119854 103840 106575 148712 180334 211295 230348 257239 287013 334964
$$ packed form
12057D7048N510j17J923l591k593K887J4079J3337p744j5955k546r401l057N950
12043D5730m451l460N716j1164j3798R740J530L708J9851N133K680n133k788O21
12029E3915K977j4197l3667k547K5781K8055R672m362p786o036R539L604j4429
12016E0519K193L2212J5798k5274j5528K1462o693n292J0930j703M52j7508P199
12003F8767K725k437n312m268K504J429J1219K308n839l634P17O312j4326j0935
11989D9230Q782J2169J138k621l015M91N270Qk3332R119J8835M936o734p236J818
11974F8858P795J2736J3096r974J2503K8439k037j8762l54J6749j475N314k583
11961A30305j8068j826R443j6014K735M2137L1622L0961J9053K6891K9774M7951
$$ plain form
11949 334964 394943 472718 551249 618830 718072 856993 1058353 1324425 1613865 1890029
11939 1890029 2121552 2224540 2102214 1767368 1364652 1044872 799180 640054 540318 471157
11929 471157 416962 367175 325502 311111 295951 265350 249174 256957 260588 249677 232908 210243
11917 210243 203848 194875 206238 222121 232679 223583 198723 175240 158901 156594 163961 159122 143131
11904 143131 135260 107939 102832 111978 101485 103151 110137 111596 92371 96347 115335 111216 117631
11891 117631 118982 108186 95964 99733 118575 117526 106133 98619 101964 100053 85591 69274 60220
11878 60220 61133 55273 49798 46891 39269 44518 60830 52241 50661 61898 77808 104873 110613 94014
11864 94014 91613 96899 100427 88402 75568 76381 66908 72440 78142 90545 104746 96404 94164 92045
$$ packed form
11949C34964N9979P7775P8531O7581R9242J38921K01360K66072K89440K76164
11939A890029K31523J02988j22326l34846m02716l19780k45692j59126r9736o9161
11929D71157n4195m9787m1673j4391j5160l0601j6176P783L631j0911j6769k2665
11917B10243o395q973J1363J5883J0558r096k4860k3483j6339k307P367m839j5991
11904A43131p871k7321n107R146j0493J666O986J459j9225L976J8988m119O415
11891A17631J351j0796j2222L769J8842j049j1393p514L345j911j4462j6317r054
11878F0220R13n860n475k907p622N249J6312q589j580J1237J5910K7065N740j6599
11864I4014k401N286L528j2025j2834Q13r473N532N702J2403J4201q342k240k119
$$ plain form
11850 92045 89314 65417 59073 80579 106240 103504 83982 72125 82172 81997 80919 73625 71475
11837 71475 63277 47621 30318 38557 46838 42628 42589 50847 64613 75166 73118 58964 58227 71810
11823 71810 71997 80467 86901 98047 115167 154381 165802 162383 180107 182929 175970 185563 174898
11810 174898 148035 131650 104584 86649 74912 87422 85249 58087 49498 53105 75843 90701
11798 90701 66108 56776 65707 74683 72527 79305 86290 105360 117892 149879 165963 153370 150821
11785 150821 153026 153860 137503 132431 146063 158769 166684 156443 131683 116865 117444 110484 131516
11772 131516 150441 153319 139067 132180 144579 146955 140129 125183 145971 184388 214792 247824
11760 247824 274682 287332 325197 342994 352398 358783 333322 289454 247383 205010 192206 181238
$$ packed form
11850I2045k731k3897o344K1506K5661k736j9522j1857J0047j75j078p294k150
11837G1475q198j5656j7303Q239Q281m210l9Q258J3766J0553k048j4154p37J3583
11823G1810J87Q470O434J1146J7120L9214J1421l419J7724K822o959R593j0665
11810A74898k6863j6385k7066j7935j1737J2510k173k7162q589L607K2738J4858
11798I0701k4593r332Q931Q976k156O778O985J9070J2532L1987J6084j2593k549
11785A50821K205Q34j6357n072J3632J2706P915j0241k4760j4818N79o960K1032
11772A31516J8925K878j4252o887J2399K376o826j4946K0788L8417L0404L3032
11760B47824K6858J2650L7865J7797R404O385k5461m3868m2071m2373j2804j0968
$$ plain form
11748 181238 175019 160428 157404 155661 138943 127596 136917 147449 145916 144132 158770 176654 181424
11735 181424 162595 147813 135031 132987 123148 120753 142233 140192 143854 159379 152304 134821 118582
11722 118582 106610 104074 103472 96498 96306 105499 116269 141269 171609 162125 146163 119401 99079
11709 99079 88018 58458 32427 24628 16259 12583 8825 16277 39999 45263 78596 121065 157833
11696 157833 176319 166601 170889 176044 173491 166539 148445 126611 120055 131796 119228 106968 100399
11683 100399 98032 91999 79964 101610 146895 163796 173223 174693 173898 194048 214816 242351 259577
11670 259577 242542 239141 253056 274054 284397 293155 295365 299656 293726 268522 246909 214226
11658 214226 154564 121097 102788 119233 148986 194184 214907 245564 258952 288356 321521
$$ packed form
11748A81238o219j4591l024j743j6718j1347R321J0532j533j784J4638J7884M770
11735A81424j8829j4782j2782k044r839k395K1480k041L662J5525p075j7483j6239
11722A18582j1972k536o02o974j92R193J0770K5000L0340r484j5962k6762k0322
11709I9079j1061k9560k6031p799q369l676l758P452K3722N264L3333M2469L6768
11696A57833J8486r718M288N155k553o952j8094k1834o556J1741j2568j2260o569
11683A00399k367o033j2035K1646M5285J6901R427J470p95K0150K0768K7535J7226
11670B59577j7035l401J3915K0998J0343Q758K210M291n930k5204k1613l2683
11658B14226n9662l3467j8309J6445K9753M5198K0723L0657J3388K9404L3165
$$ plain form
11647 321521 356784 362363 385744 418179 455415 503964 542448 591830 671457 739520 786791 825319
11635 825319 828303 821867 793654 735073 697756 697858 729277 734082 700712 660945 609937 571984
11623 571984 558281 529111 501887 488865 468166 457528 446507 443117 431406 441656 453884 472420
11611 472420 491170 512941 552134 579087 602229 637858 649359 667146 696095 712926 754350
11600 754350 805879 856364 903165 936891 963732 993328 1013913 1032148 1035746 1050587 1087955 1107554
11588 1107554 1147967 1173508 1203254 1249940 1261633 1263768 1255446 1263662 1278833 1290512 1293150 1310616
11576 1310616 1323843 1318414 1338996 1345554 1375743 1418736 1487248 1550943 1581661 1601232 1643894 1697405
11564 1697405 1741048 1775285 1795868 1814933 1805397 1840337 1873805 1910426 1965512 2028497 2099272
$$ packed form
11647C21521L5263N579K3381L2435L7236M8549L8484M9382P9627O8063M7271L8528
11635H25319K984o436k8213n8581l7317J02L1419M805l3370l9767n1008l7953
11623E71984j3703k9170k7224j3022k0699j0638j1021l390j1711J0250J2228J8536
11611D72420J8750K1771L9193K6953K3142L5629J1501J7787K8949J6831M1424
11600G54350N1529N0485M6801L3726K6841K9596K0585J8235L598J4841L7368J9599
11588A107554M0413K5541K9746M6686J1693K135q322Q216J5171J1679K638J7466
11576A310616J3227n429K0582O558L0189M2993O8512O3695L0718J9571M2662N3511
11564A697405M3643L4237K0583J9065r536L4940L3468L6621N5086O2985P0775
$$ plain form
11553 2099272 2147908 2228164 2289940 2353619 2434792 2531426 2621280 2727066 2874714 3045494 3204937
11542 3204937 3365066 3549035 3757371 4007718 4305890 4651930 5052486 5474786 5918927
11533 5918927 6371676 6835119 7370469 7956601 8607362 9343158 10179034 11150851 12298009
11524 12298009 13645132 15210117 17104487 19431147 22248700 25638392 29648429 34395238
11516 34395238 40030801 46732963 54793415 64722278 77305382 93694530 115377208 143891193
11508 143891193 180649535 226570023 281409890 342081257 398832268 431805132 422029982
11501 422029982 363126177 277167268 200263077 146287369 111646734 89398853 74555183
11494 74555183 64182110 56697335 51148772 46958625 43702571 41081886 38914087 37094562
$$ packed form
11553B099272M8636Q0256O1776O3679Q1173R6634Q9854J05786J47648J70780J59443
11542C204937J60129J83969K08336K50347K98172L46040M00556M22300M44141
11533E918927M52749M63443N35350N86132O50761P35796Q35876R71817J147158
11524A2298009J347123J564985J894370K326660K817553L389692M010037M746809
11516C4395238N635563O702162Q060452R928863J2583104J6389148K1682678K8513985
11508A43891193L6758342M5920488N4839867O0671367N6751011L2972864r775150
11501D22029982n8903805q5958909p6904191n3975708l4640635k2247881j4843670
11494G4555183j0373073p484775n548563m190147l256054k620685k167799j819525
$$ plain form
11486 37094562 35529647 34269451 33322269 32680130 32351941 32178379 31798343 30776039 29105153
11477 29105153 27119611 25089702 23186658 21466931 19911555 18481389 17177439 16013487
11469 16013487 15003458 14085728 13216284 12401148 11627584 10899224 10237408 9636568 9101143
11460 9101143 8627483 8163889 7688119 7240114 6841959 6458294 6104685 5795810 5496170
11451 5496170 5206027 4922094 4683033 4475463 4245521 4026319 3800334 3561594 3346487
11442 3346487 3168342 3007881 2866057 2740710 2614952 2522880 2427480 2320932 2214625 2129218
11432 2129218 2046290 1943488 1820717 1709339 1618194 1523609 1452378 1410223 1326527 1229763 1173335
11421 1173335 1110575 1047156 1005977 979536 946583 893678 843283 819195 788803 750673 702844
$$ packed form
11486C7094562j564915j260196r47182o42139l28189j73562l80036j022304j670886
11477B9105153j985542k029909j903044j719727j555376j430166j303950j163952
11469A6013487j010029r17730q69444q15136p73564p28360o61816o00840n35425
11460I101143m73660m63594m75770m48005l98155l83665l53609l08875k99640
11451E496170k90143k83933k39061k07570k29942k19202k25985k38740k15107
11442C346487j78145j60461j41824j25347j25758r2072r5400j06548j06307q5407
11432B129218q2928j02802j22771j11378r1145r4585p1231m2155q3696r6764n6428
11421A173335o2760o3419m1179k6441l2953n2905n0395k4088l0392l8130m7829
$$ plain form
11410 702844 644644 620337 608618 604073 587580 595798 610334 591522 556009 528613 517821 501346
11398 501346 507709 494844 465393 450858 463677 484612 486855 472984 482073 480579 480304 491329 490083
11385 490083 506364 535832 586682 667443 762732 866799 969307 1038541 1067834 1064231 1033527
11374 1033527 956868 847575 702185 583190 499787 433422 375730 320051 309156 307520 318151
11363 318151 311337 301052 298845 305937 312383 313936 309371 359419 405444 431663 460333 488832 508849
11350 508849 523686 522778 515704 484273 411679 362580 341488 330732 313585 310219 323068 339667
11338 339667 335706 341819 358538 357949 383409 403923 410265 402612 407911 417900 432681 434012 443030
11325 443030 444708 438092 422773 410769 381431 378245 371718 368079 353536 346953 345213 327909 310443
$$ packed form
11410G02844n8200k4307j1719m545j6493Q218J4536j8812l5513k7396j0792j6475
11398E01346O363j2865k9451j4535J2819K0935K243j3871R089j494k75J1025j246
11385D90083J6281K9468N0850Q0761R5289J04067J02508O9234K9293l603l0704
11374A033527p6659j09293j45390j18995q3403o6365n7692n5679j0895j636J0631
11363C18151o814j0285k207P092O446J553m565N0048M6025K6219K8670K8499K0017
11350E08849J4837r08p074l1431p2594m9099k1092j0756j7147l366J2849J6599
11338C39667l961O113J6719n89K5460K0514O342p653N299R989J4781J331R018
11325D43030J678o616j5319j2004k9338l186o527l639j4543o583j740j7304j7466
$$ plain form
11312 310443 299286 280392 295135 312108 325949 334243 373593 397328 412879 397096 403267 394004
11300 394004 373306 339448 293990 270081 258181 240850 229482 230146 205105 201501 200838 190859 193305
11287 193305 184082 161605 151352 157011 150272 150308 145575 136565 132090 143841 140297 148226 151944 127258
11273 127258 105954 86494 95773 110770 109909 102314 109469 114705 108289 125203 135756 112260 94609
11260 94609 78164 83549 109145 100848 96789 80220 66716 48792 32222 32424 29330 21464 13713
11247 13713 22469 49156 80400 94979 85837 77215 65117 57425 48129 36578 4946 -17026 -13029
11234 -13029 -14505 -11453 -12387 -7696 6965 9881 2795 -1094 -16305 -4503 21371 26208 29031 39829
11220 39829 36580 32207 39808 40741 37510 15065 21044 29773 49089 76352 88473 94606 90261 98502
$$ packed form
11312C10443j1157j8894J4743J6973J3841Q294L9350K3735J5551j5783O171r263
11300C94004k0698l3858m5458k3909j1900j7331j1368O64k5041l604o63r979K446
11287A93305r223k2477j0253N659o739L6m733r010m475J1751l544P929L718k4686
11273A27258k1304j9460R279J4997q61p595P155N236o416J6914J0553k3496j7651
11260I4609j6445N385K5596q297m059j6569j3504j7924j6570K02l094p866p751
11247A3713Q756K6687L1244J4579r142q622j2098p692r296j1551l1632k1972L997
11234a3029j476L052r34M691J4661K916p086l889j5211J1802K5874M837K823J0798
11220C9829l249m373P601R33l231k2445N979Q729J9316K7263J2121O133m345Q241
$$ plain form
11206 98502 113809 100682 88694 96853 79909 71343 68339 57852 43104 45745 30627 -1915
11194 -1915 8429 21861 413 -36362 -47805 -48398 -31002 4035 22453 44973 48798 47503 51635
11181 51635 61427 82005 84186 84674 75707 74885 76793 69764 71600 69126 64338 64796 60931 57298 53474
11166 53474 60653 64011 64339 76302 62446 41597 28361 27071 33207 38833 53096 52304 52950 35544
11152 35544 19588 32722 33017 -4580 -23332 -26144 -20103 1185 8488 16625 34581 44593 39496
11139 39496 17994 15099 20482 22110 8998 11786 17293 24589 27038 28978 27888 39883 46268 44636
11125 44636 56021 40402 27429 23147 26682 35026 27809 32796 31581 25529 21877 20381 30429
11112 30429 25908 -4405 -4832 1545 19734 20451 33938 35327 38918 30710 44696 58187 42675
$$ packed form
11206I8502J5307j3127j1988Q159j6944q566l004j0487j4748K641j5118l2542
11194a915J0344J3432k1448l6775j1443n93J7396L5037J8418K2520L825j295M132
11181E1635R792K0578K181M88q967q22J908p029J836k474m788M58l865l633l824
11166E3474P179L358L28J1963j3856k0849j3236j290O136N626J4263p92O46j7406
11152C5544j5956J3134K95l7597j8752k812O041K1288P303Q137J7956J0012n097
11139C9496k1502k895N383J628j3112K788N507P296K449J940j090J1995O385j632
11125D4636J1385j5619j2973m282L535Q344p217M987j215o052l652j496J0048
11112C0429m521l0313m27O377J8189P17J3487J389L591q208J3986J3491j5512
$$ plain form
11099 42675 37343 35522 16593 22763 31181 34492 34991 27152 16278 29975 26613 13673 14764 21437
11085 21437 23289 41165 52641 55931 83708 109071 129440 141604 143683 160486 192223 226007
11073 226007 249747 306135 390765 473611 559223 703984 888826 1108351 1366869 1661711
11063 1661711 1953393 2178920 2226290 2031445 1648827 1250256 939447 706113 536023 431312
11053 431312 379018 359334 345435 314910 278685 255080 235732 216791 213864 200171 179065 168108
11041 168108 160833 158241 163846 172765 169223 153471 137304 141602 144688 113044 119191 124848 115112
11028 115112 123681 116311 92863 91542 89514 72675 66806 76290 70802 67079 73989 80989 62342
11015 62342 63330 55023 43490 33213 30071 45182 43614 40488 46839 27938 18929 15368 13034 31188
$$ packed form
11099D2675n332j821j8929O170Q418L311M99p839j0874J3697l362j2940J091O673
11085B1437J852J7876J1476L290K7777K5363K0369J2164K079J6803L1737L3784
11073B26007K3740N6388Q4630Q2846Q5612J44761J84842K19525K58518K94842
11063A661711K91682K25527M7370j94845l82618l98571l10809k33334j70090j04711
11053D31312n2294j9684j3899l0525l6225k3605j9348j8941k927j3693k1106j0957
11041A68108p275k592N605Q919l542j5752j6167M298L086l1644O147N657r736
11028A15112Q569p370k3448j321k028j6839n869R484n488l723O910P000j8647
11015F2342R88q307j1533j0277l142J5111j568l126O351j8901r009l561k334J8154
$$ plain form
11001 31188 59853 36303 21258 16376 11696 11158 12208 14023 22016 11462 3904 14428 26297
10988 26297 24501 20482 5983 8296 7392 17529 32883 27220 8381 2896 -546 -12216 -5465
10975 -5465 -397 -10010 -32529 -35602 -24935 -13893 -23635 -17899 -10798 -1342 -2615 -14903 10110
10962 10110 15780 8654 17079 29717 19153 -646 -3993 9111 -3137 -11340 -5235 -11202 -3942
10949 -3942 4870 147 -12985 -17467 -2976 -8883 -12098 -27015 -13254 4275 20728 37019 35035
10936 35035 11286 5886 15414 4401 -17370 -5276 3736 -500 14531 12909 18245 26638 19892
10923 19892 -19686 -32756 -7087 9210 6900 2581 8925 -10496 -10159 9029 24492 28353 15429
10910 15429 20276 17770 34764 45705 49182 29763 -5224 -20439 255 438 -10423 -12733 -19226
$$ packed form
11001C1188K8665k3550j5045m882m680n38J050J815P993j0554p558J0524J1869
10988B6297j796m019j4499K313r04J0137J5354n663j8839n485l442j1670O751
10975e465N068r613k2519l073J0667J1042r742N736P101R456j273j2288K5013
10962A0110N670p126Q425J2638j0564j9799l347J3104j2248q203O105n967P260
10949c942Q812m723j3132m482J4491n907l215j4917J3761J7529J6453J6291j984
10936C5035k3749n400R528j1013k1771J2094R012m236J5031j622N336Q393o746
10923A9892l9578j3070K5669J6297k310m319O344j9421L37J9188J5463L861j2924
10910A5429M847k506J6994J0941L477j9419l4987j5215K0694J83j0861k310o493
$$ plain form
10897 -19226 -18165 -23811 -50046 -28240 -7162 -9652 -12933 -22702 -21959 -35103 -20895 720 2663
10884 2663 -8131 -5549 16000 26678 11780 -3594 -20296 -22646 -1385 8120 3837 -9103 -7001
10871 -7001 990 20917 26481 22370 6211 -1835 9190 -4884 -3719 -3442 -21645 -28813 -33690 -30360
10857 -30360 -26015 -20810 -12717 -18831 -18409 -4548 -22047 -25426 -10995 6430 5102 7615 4251 14196
10843 14196 38625 39916 32720 36345 18819 20295 28304 30275 36542 62014 85962 97387 140150
10830 140150 169443 185463 226550 302594 397250 495275 608336 698685 702042 633153 467538
10819 467538 311439 220866 159123 117615 104030 93539 93574 86582 82363 54965 44874 42900
10807 42900 58865 52372 52643 44693 33483 35803 38786 30471 29406 51719 50540 44454 43079 44486
$$ packed form
10897a9226J061n646k6235K1806K1078k490l281r769P43j3144J4208K1615J943
10884B663j0794K582K1549J0678j4898j5374j6702k350K1261R505m283j2940K102
10871g001P991J9927N564m111j6159q046J1025j4074J165K77j8203p168m877L330
10857c0360M345N205Q093o114M22J3861j7499l379J4431J7425j328K513l364R945
10843A4196K4429J291p196L625j7526J476Q009J971O267K5472K3948J1425M2763
10830A40150K9293J6020M1087P6044R4656R8025J13061R0349L357o8889j65615
10819D67538j56099r0573o1743m1508j3585j0491L5o992m219k7398j0091j974
10807D2900J5965o493K71p950j1210K320K983q315j065K2313j179o086j375J407
$$ plain form
10793 44486 38248 41917 28301 30148 28644 20253 18561 18076 18646 9111 -4161 4125 -299 -8611
10779 -8611 -16836 -22536 -33135 -29369 -25581 -29117 -22437 -15291 -41272 -52690 -50186 -47107 -26949 -2334
10765 -2334 12257 10615 -10490 -27695 -21520 -8347 -10132 -8558 -2656 -1870 -5989 -7945 -3416 9358
10751 9358 3357 -7573 -26051 -19870 -19351 -3496 14346 29753 40716 42505 23786 3302 -15739
10738 -15739 -20048 -13843 -8368 -11051 -25564 -29608 -33247 -39099 -28314 -20350 -14663 9361 -8765
10725 -8765 -29233 -43393 -53297 -37743 -23430 -21634 -24193 -12663 -1447 -1309 -7876 -3672 -1757
10712 -1757 4218 -530 7497 35521 35151 7586 203 17723 2359 -4145 -778 -21394 -30857 -20701
10698 -20701 -13483 -47327 -58870 -40142 -22300 -17961 -15769 3925 3320 -14061 -22816 -8516 -14058
$$ packed form
10793D4486o238L669j3616J847j504q391j692m85N70r535j3272Q286m424q312
10779h611q225n700j0599L766L788l536O680P146k5981j1418K504L079K0158K4615
10765b334J4591j642k1105j7205O175J3173j785J574N902P86m119j956M529J2774
10751I358o001j0930j8478O181N19J5855J7842J5407J0963J789j8719k0484j9041
10738a5739m309O205N475k683j4513m044l639n852J0785P964N687K4024j8126
10725h765k0468j4160r904J5554J4313J796k559J1530J1216J38o567M204J915
10712a757N975m748Q027K8024l70k7565p383J7520j5364o504L367k0616r463J0156
10698b0701P218l3844j1543J8728J7842M339K192J9694o05j7381q755J4300n542
$$ plain form
10685 -14058 -36288 -42886 -19253 -5426 -14598 -31994 -35311 -15542 8945 8907 8108 6465 9335 39835
10671 39835 57690 36630 8005 15112 15813 4229 29782 34533 26175 29838 26441 10881 7577
10658 7577 21293 24798 2592 -13127 -13463 -8673 3144 -6899 -10876 -3774 -11154 -18394 -16574 -811
10644 -811 -2163 -3656 -3696 -963 3562 13206 23781 28245 18350 12161 1994 -341 15037 4982
10630 4982 -21012 -20621 -6904 11931 8777 6592 1101 -21473 -21587 -17094 -2891 -1121 2062 -2494
10616 -2494 -11276 -12220 -12001 -3259 10867 -5898 -21914 -25597 -29032 -34630 -27746 -33390 -28516 -7451
10602 -7451 -6791 -1134 -7211 -7274 -8592 -16810 -20977 -12416 -16257 -26846 -8901 -7708 -11876 -2259 7805
10587 7805 3089 -2821 10503 11784 -15706 -34793 -26232 -11921 -16550 -24490 -9384 -3452 6004
$$ packed form
10685a4058k2230o598K3633J3827r172j7396l317J9769K4487l8p99j643K870L0500
10671C9835J7855k1060k8625P107P01j1584K5553M751q358L663l397j5560l304
10658G577J3716L505k2206j5719l36M790J1817j0043l977P102p380p240J820J5763
10644h11j352j493m0K733M525R644J0575M464r895o189j0167k335J5378j0055
10630D982k5994L91J3717J8835l154k185n491k2574j14M493J4203J770L183m556
10616b494q782r44K19Q742J4126j6765j6016l683l435n598O884n644M874K1065
10602g451O60N657o077o3j318q218m167Q561l841j0589J7945J193m168R617J0064
10587G805m716n910J3324J281k7490j9087Q561J4311m629p940J5106N932R456
$$ plain form
10574 6004 -11460 -14632 11046 3084 5381 4563 8519 17434 -1926 -6944 8713 29670 23323 16928
10560 16928 24858 19743 1120 1608 15841 33998 27977 25234 29239 31379 23346 5189 -2344 13686
10546 13686 16629 20716 23211 28160 26705 12517 2586 -607 2088 4499 19140 17369 11372 18754
10532 18754 18436 7790 23926 26351 27752 5481 -1529 10743 8152 7030 -1037 3354 3090 -14590
10518 -14590 -21327 -26694 -23458 4458 5492 -7320 -535 19993 18678 6673 10385 8412 11422
10505 11422 -2847 -13998 -22974 -12219 -3462 -9333 -13078 -25744 -24594 -28608 -11792 -9634 -19627
10492 -19627 -22738 -32208 -29504 -31776 -37736 -38883 -25498 -19204 -22208 -8861 6421 22460 13149
10479 13149 15294 26353 11688 9337 -4801 -16583 -2258 10157 -2012 -2391 -16111 -18549 -17657
$$ packed form
10574F004j7464l172K5678p962K297q18L956Q915j9360n018J5657K0957o347o395
10560A6928P930n115j8623M88J4233J8157o021k743M005K140q033j8157p533J6030
10546A3686K943M087K495M949j455j4188r931l193K695K411J4641j771n997P382
10532A8754l18j0646J6136K425J401k2271p010J2272k591j122q067M391k64j7680
10518a4590o737n367L236K7916J034j2812O785K0528j315j2005L712j973L010
10505A1422j4269j1151q976J0755Q757n871l745j2666J150m014J6816K158r993
10492a9627l111r470K704k272n960j147J3385O294l004J3347J5282J6039r311
10479A3149K145J1059j4665k351j4138j1782J4325J2415j2169l79j3720k438Q92
$$ plain form
10466 -17657 -22605 -10174 -1852 9401 5898 927 2044 -3827 -11770 -11907 -9207 -8867 -11566 -17241
10452 -17241 -15380 126 20488 16786 17819 29527 21780 18673 13125 -6042 -10300 -16893 -9615
10439 -9615 -5908 -6238 -22263 -26300 -19156 -20118 -11574 8523 7722 -1344 -10103 -10168 3983 -2583 -11215
10424 -11215 1101 19718 9053 -6036 3611 11775 4278 -5263 -11968 -2524 2934 -5324 -5348 2981
10410 2981 -5587 -448 17271 21629 -8019 -24550 -19844 6095 18439 11432 9609 4850 6943
10397 6943 10918 -7873 -10041 3850 7862 1157 -15528 -31235 -24078 -806 15708 5853 11112
10384 11112 27625 31260 23181 5310 -26305 -33626 -33141 -14559 5457 2480 -6780 -10222 -18488
10371 -18488 -15577 -9040 222 -3612 -528 -13819 -12795 -12122 -3988 -2239 -1824 6393 12795 19207 18592
$$ packed form
10466a7657m948J2431Q322J1253l503m971J117n871p943j37K700L40k699n675
10452a7241J861J5506K0362l702J033J1708p747l107n548j9167m258o593P278
10439i615L707l30j6025m037P144r62Q544K0097q01r066q759o5J4151o566q632
10424a1215J2316J8617j0665j5089R647Q164p497r541o705R444N458q258k4Q329
10410B981q568N139J7719M358k9648j6531M706K5939J2344p007j823m759K093
10397F943L975j8791k168J3891M012o705j6685j5707P157K3272J6514r855N259
10384A1112J6513L635q079j7871l1615p321M85J8582K0016k977r260l442q266
10371a8488K911O537R262l834L084j3291J024O73Q134J749M15Q217O402O412o15
$$ plain form
10356 18592 -5413 -19191 -7598 -6756 9123 11762 1415 -996 -228 121 8490 7404 8688 11818
10342 11818 13485 4658 732 5351 10704 15573 9914 7820 908 6345 7608 7487 -24441 -16600
10328 -16600 4515 4188 4256 -27672 -42700 -47845 -16121 18674 25505 11815 4560 14696 -4086
10315 -4086 2100 16528 17164 14236 29608 34312 42611 39015 39319 46901 45987 28494 21770 27371 35182
10300 35182 32379 16139 -7656 -12557 -16027 -17655 -4556 7123 8396 4542 -8071 -34441 -47787
10287 -47787 -21622 -3223 -1490 -3442 -4530 -14642 -16177 -14816 -7624 4488 2086 -2867 -3324 -10470
10273 -10470 -8271 -4519 -15602 -25779 -25239 -19837 1270 3769 25950 18134 6839 6189 12937 11631
10259 11631 2151 -10868 -3602 -13008 -23385 -8006 9659 54 2513 -930 99 13860 -2094
$$ packed form
10356A8592k4005j3778J1593Q42J5879K639j0347k411P68L49Q369j086J284L130
10342A1818J667q827l926M619N353M869n659k094o912N437J263j21l1928P841
10328a6600K1115l27O8l1928j5028n145L1724L4795O831j3690p255J0136j8782
10315d086O186J4428O36k928J5372M704Q299l596L04P582r14j7493o724N601P811
10300C5182k803j6240k3795m901l470j628J3099J1679J273l854j2613k6370j3346
10287d7787K6165J8399J733j952j088j0112j535J361P192J2112k402m953m57p146
10273a0470K199L752j1083j0177N40N402K1107K499K2181p816j1295o50O748j306
10259A1631r480j3019P266r406j0377J5379J7665r605K459l443J029J3761j5954
$$ plain form
10246 -2094 -16266 4150 21988 39661 26351 25877 28942 28748 16280 18308 1725 -9339 -12646
10233 -12646 -18706 -16804 2909 6369 -3859 -6034 -3977 -15998 -27598 -1895 -210 -5153 -10976
10220 -10976 -18920 -23140 -7294 -8869 -20813 -3741 19849 19065 13944 1637 13558 18259 6134
10207 6134 -5010 -2238 -9594 7123 24924 49169 30562 26118 33551 34920 38995 19830 -9958
10194 -9958 -16901 -10027 8649 7771 -1822 -8824 3796 12559 5876 -18427 -21928 -14678 -10573 3715
10180 3715 23333 17972 5092 -2679 7199 10340 12873 2197 -15792 -17678 -627 13171 15034
10167 15034 7305 15185 13619 -1160 3583 -1576 -11906 -4496 -1958 5643 8541 -2007 -5547 2839
10153 2839 -5854 -2564 2071 17132 10427 -602 749 -113 -9608 -2776 -11265 -19504 -22583 -5462
$$ packed form
10246b094j4172K0416J7838J7673j3310m74L065j94j2468K028j6583j1064l307
10233a2646o060J902J9713L460j0228k175K057j2021j1600K5703J685m943n823
10220a0976p944m220J5846j575j1944J7072K3590p84n121j2307J1921M701j2125
10207F134j1144K772p356J6717J7801K4245j8607m444P433J369M075j9165k9788
10194i958o943O874J8676q78r593p002J2620Q763o683k4303l501P250M105J4288
10180C715J9618n361j2880p771R878L141K533j0676j7989j886J7051J3798J863
10167A5034p729P880j566j4779M743n159j0330P410K538P601K898j0548l540Q386
10153B839q693L290M635J5061o705j1029J351q62r495O832q489q239l079J7121
$$ plain form
10139 -5462 21947 33267 19211 30282 60386 78129 91510 98160 107902 140361 153479 174150
10127 174150 182904 174566 132256 88939 67927 50544 43288 31469 13573 27858 48929 59867
10115 59867 71429 63294 34686 17031 14813 10067 8873 17435 16042 -6636 7744 19720 14572
10102 14572 21099 11166 18015 3470 -10927 -15868 -5728 -2621 5167 24635 13989 7615 7049
10089 7049 5379 10335 7060 4853 -46 1503 -8421 1062 6967 20576 22623 15395 1955 -9654
10075 -9654 -4904 -5084 -1905 360 16591 29986 27860 22937 11914 13470 6276 8610 3945 -806
10061 -806 2729 -5697 -11813 500 7745 -6476 -2519 3284 -11442 -9848 -4990 23142 48473 35779
10047 35779 15352 33704 21711 14563 -8062 -1448 -8427 -13718 -8044 -22579 -515 5758 5680
$$ packed form
10139e462K7409J1320j4056J1071L0104J7743J3381O650R742L2459J3118K0671
10127A74150Q754q338m2310m3317k1012j7383p256j1819j7896J4285K1071J0938
10115E9867J1562q135k8608j7655k218m746j194Q562j393k2678J4380J1976n148
10102A4572O527r933O849j4545j4397m941J0140L107P788J9468j0646o374n66
10089G049j670M956l275k207m899J549r924R483N905J3609K047p228j3440j1609
10075i654M750j80L179K265J6231J3395k126m923j1023J556p194K334m665m751
10061h06L535q426o116J2313P245j4221L957N803j4726J594M858K8132K5331j2694
10047C5779k0427J8352j1993p148k2625O614o979n291N674j4535K2064O273p8
$$ plain form
10034 5680 12348 35107 23530 8730 17094 15224 -2916 -8393 -1975 10694 4717 -7943 5170
10021 5170 14636 31333 40651 31238 36032 45441 37981 28403 30205 20388 11165 8108 -2000 -9035
10007 -9035 8813 13078 28409 19543 5178 22064 18498 35700 38644 23364 11093 15126 7768
9994 7768 1258 2648 5210 2725 9169 5191 20800 29907 17130 19227 38080 42802 19561 38870
9980 38870 63030 45208 20695 34941 46134 34884 27946 29332 35934 41193 31038 18743 9186
9967 9186 4689 5735 8578 9162 4228 4350 11678 30011 41268 49469 56949 42112 40021 20216
9953 20216 19233 22794 34952 51627 47218 54988 54711 39744 26079 30785 42264 47924 52444 47649
9939 47649 43168 51507 66883 59268 52869 56256 61714 62224 79623 80772 75253 76884 79742 88108
$$ packed form
10034E680O668K2759j1577j4800Q364j870j8140n477O418J2669n977j2660J3113
10021E170R466J6697R318r413M794R409p460r578J802r817r223l057j0108p035
10007i035J7848M265J5331q866j4365J6886l566J7202K944j5280j2271M033p358
9994G768o510J390K562k485O444l978J5609R107j2777K097J8853M722k3241J9309
9980C8870K4160j7822k4513J4246J1193j1250o938J386O602N259j0155j2295r557
9967I186m497J046K843N84m934J22P328J8333J1257Q201P480j4837k091j9805
9953B0216r83L561J2158J6675m409P770k77j4967j3665M706J1479N660M520m795
9939D7649m481Q339J5376p615o399L387N458N10J7399J149n519J631K858Q366
$$ plain form
9925 88108 97600 115717 139013 159844 174952 182563 183839 189705 206561 229201 259269 311025 367858
9912 367858 427578 514035 611282 745262 915662 1155401 1449014 1857262 2423648 3096280
9902 3096280 3911368 4863321 5605842 5716198 5063653 3728781 2531944 1729228 1262461
9893 1262461 981275 809255 700091 623113 558797 520753 493090 459452 441455 426674 425537
9882 425537 415577 386523 390596 408259 409233 391148 392932 376000 338948 300154 270258 247284 220675
9869 220675 207634 206425 209556 189295 155600 134777 133870 117592 108692 94862 112183 129757 124674
9856 124674 124141 111812 105231 91468 79775 88495 98811 76111 84714 81723 79732 87368 97439
9843 97439 91479 91650 89335 80438 52208 41796 37178 42089 50255 58912 60958 50854 41867 53179
$$ packed form
9925H8108R492J8117K3296K0831J5108P611J276N866J6856K2640L0068N1756N6833
9912C67858N9720Q6457R7247J33980J70400K39739K93613M08248N66386O72632
9902C096280Q15088R51953P42521J10356o52545j334872j196837q02716m66767
9893A262461k81186j72020j09164p6978o4316l8044k7663l3638j7997j4781j137
9882D25537r960k9054M073J7663R74j8085J784j6932l7052l8794k9896k2974k6609
9869B20675j3041j209L131k0261l3695k0823r07j6278q900j3830J7321J7574n083
9856A24674n33j2329o581j3763j1693Q720J0316k2700Q603k991j991P636J0071
9843I7439n960J71k315q897k8230j0412m618M911Q166Q657K046j0104q987J1312
$$ plain form
9829 53179 59636 64435 76788 82877 89483 71979 64912 55111 51626 48045 42055 29351 34652 37215
9815 37215 35299 26089 17466 23209 32303 37556 41510 33672 30464 44277 46015 38161 29815 21144
9801 21144 26799 19783 20763 23284 7601 -743 19244 25856 21338 25230 45081 44293 32450 37270
9787 37270 55002 46870 40815 29689 27644 30935 36593 30623 19021 2643 -3210 25530 39462
9774 39462 35212 30419 35985 57253 55982 37284 39649 27681 23509 17905 18760 31308 20432 13955
9760 13955 45017 64614 56462 57976 70910 68733 51631 43531 30389 36391 45193 28688 15038
9747 15038 26712 50075 66156 70114 57985 60106 39908 30788 40302 45567 48858 47725 58102
9734 58102 59258 44077 24956 22946 16164 16758 23779 42655 22762 19737 5233 -1155 3025 28363
$$ packed form
9829E3179O457M799J2353O089O606j7504p067r801l485l581n990j2704N301K563
9815C7215j916r210q623N743R094N253L954p838l208J3813J738p854q346q671
9801B1144N655p016R80K521j5683q344J9987O612m518L892J9851p88j1843M820
9787C7270J7732q132o055j1126k045L291N658n970j1602j6378n853K8740J3932
9774C9462m250m793N566K1268j271j8698K365j1968m172n604Q55J2548j0876o477
9760A3955L1062J9597q152J514J2934k177j7102q100j3142O002Q802j6505j3650
9747A5038J1674K3363J6081L958j2129K121k0198r120R514N265L291j133J0377
9734E8102J156j5181j9121k010o782N94P021J8876j9893l025j4504o388M180K5338
$$ plain form
9720 28363 41072 56171 66122 57179 54715 33040 24774 41282 63142 54507 58688 50143 47007
9707 47007 51911 37268 29316 35197 32933 30102 29771 28084 20351 26561 33754 34162 42653 35026 43704
9692 43704 48701 60032 50631 41510 39954 62432 76055 64863 43410 46419 55220 47116 46220 52532
9678 52532 51421 45992 43601 48068 29862 20055 21848 27064 32399 53299 62455 62631 66908 76229
9664 76229 68240 45339 47495 62509 70712 72539 78088 71357 51134 65334 72817 75119 77243 71239
9650 71239 66661 64660 60189 56076 63128 73122 64915 63667 70582 67691 65560 64117 61336 68817 82471
9635 82471 96128 102277 87689 61393 66336 78403 77039 57919 63644 72308 75703 64033 42767
9622 42767 31216 45710 68285 75161 76078 84064 86951 81553 71335 71415 69166 75928 89253 99682
$$ packed form
9720B8363J2709J5099R951q943k464k1675q266J6508K1860q635M181q545l136
9707D7007M904j4643p952N881k264k831l31j687p733O210P193M08Q491p627Q678
9692D3704M997J1331r401r121j556K2478J3623j1192k1453L009Q801q104q96O312
9678E2532j111n429k391M467j8206r807J793N216N335K0900R156J76M277R321
9664G6229p989k2901K156J5014Q203J827N549o731k0223J4200P483K302K124o004
9650G1239m578k001m471m113P052R994q207j248O915k891k131j443k781P481J3654
9635H2471J3657O149j4588k6296M943J2067j364j9120N725Q664L395j1670k1266
9622D2767j1551J4494K2575O876R17P986K887n398j0218Q0k249O762J3325J0429
$$ plain form
9608 99682 88744 78473 89943 86070 77116 86720 85476 75965 77925 86492 71514 68162 83303
9595 83303 75073 80023 97118 109307 96839 82533 75792 67711 73266 106148 114981 99667 81627
9582 81627 90089 93446 118464 136736 118801 84869 70272 74568 86415 91780 108426 119900 126913
9569 126913 130903 133794 135784 147581 141636 146070 143712 139221 137679 123704 100806 87837 104933
9556 104933 132188 141233 122068 111707 121926 139214 145105 139921 148141 149407 125945 104660 96147
9543 96147 117241 119497 124811 115315 96696 92676 87318 101785 110060 132632 139965 127574 129161
9530 129161 124777 133963 133588 142576 140272 156135 163437 167359 165503 164718 146561 137364 141979 147165
9516 147165 159048 167974 173637 182575 193360 171834 150965 153137 134638 140386 145611 143275 145285
$$ packed form
9608I9682j0938j0271J1470l873q954R604j244r511J960Q567j4978l352J5141
9595H3303q230M950J7095J2189j2468j4306o741q081N555L2882Q833j5314j8040
9582H1627Q462L357K5018J8272j7935l3932j4597M296J1847N365J6646J1474P013
9569A26913L990K891J990J1797n945M434k358m491j542j3975k2898j2969J7096
9556A04933K7255R045j9165j0361J0219J7288N891n184Q220J266k3462k1285q513
9543I6147K1094K256N314r496j8619m020n358J4467Q275K2572P333j2391J587
9530A29161m384R186l75Q988k304J5863P302L922j856p85j8157r197M615N186
9516A47165J1883Q926N663Q938J0785k1526k0869K172j8499N748N225k336K010
$$ plain form
9503 145285 145653 147432 149534 148302 155520 178342 190277 188521 170835 147268 153357 168067 155344
9490 155344 165762 197042 203138 217708 228018 211518 202930 195503 201710 200256 202839 209247 208862
9477 208862 194920 181354 202829 218583 208279 190966 195232 197340 198728 216263 213745 207707 223256
9464 223256 242989 245114 249192 259040 272402 285536 290348 280571 261946 258197 256614 254980 261786
9451 261786 276823 277438 273193 283810 276522 296180 313246 325409 321851 303073 286356 285919 287908
9438 287908 291226 292299 315889 320261 314994 315047 325771 331592 346756 353028 344837 344051 345691 338730
9424 338730 358858 376558 397554 405341 391827 400210 400067 407302 400034 405283 426351 424073 424825 439704
9410 439704 451242 448073 459019 467132 456624 470203 499490 518938 516880 516687 530583 525734 515737
$$ packed form
9503A45285L68J779K102j232P218K2822J1935j756j7686k3567O089J4710j2723
9490A55344J0418L1280O096J4570J0310j6500q588p427O207j454K583O408l85
9477B08862j3942j3566K1475J5754j0304j7313M266K108J388J7535k518o038J5549
9464B23256J9733K125M078R848J3362J3134M812r777j8625l749j583j634O806
9451B61786J5037O15m245J0617p288J9658J7066J2163l558j8778j6717m37J989
9438B87908L318J073K3590M372n267N3J0724N821J5164O272q191p86J640o961
9424C38730K0128J7700K0996P787j3514Q383j43P235p268N249K1068k278P52J4879
9410D39704J1538l169J0946Q113j0508J3579K9287J9448k058j93J3896m849r997
$$ plain form
9397 515737 509484 520838 536278 522153 527386 526644 533057 556558 573663 573137 583603 594232 603619
9384 603619 601788 611240 625911 650559 651744 659228 677540 691150 691769 698576 727857 744575 774705
9371 774705 785312 784890 776194 787162 802742 820249 841287 842491 835527 860858 883277 907685 926177
9358 926177 946850 971476 976317 970709 1003061 1027220 1039827 1034511 1056302 1079244 1112124 1120237
9346 1120237 1138807 1160584 1175951 1195370 1229154 1241329 1273787 1301518 1334064 1335785 1379829 1426259
9334 1426259 1470050 1504517 1540731 1568149 1575795 1574738 1594484 1623932 1657549 1700187 1736533 1778141
9322 1778141 1822164 1844254 1864448 1907567 1962423 1985481 2023212 2063895 2090705 2118592 2163379
9311 2163379 2201487 2263398 2329749 2360617 2392735 2453474 2513909 2545479 2581944 2633411 2686009
$$ packed form
9397E15737o253J1354J5440j4125N233p42O413K3501J7105n26J0466J0629R387
9384F03619j831R452J4671K4648J185P484J8312J3610O19O807K9281J6718L0130
9371G74705J0607m22q696J0968J5580J7507K1038J204o964K5331K2419K4408J8492
9358I26177K0673K4626M841n608L2352K4159J2607n316K1791K2942L2880Q113
9346A120237J8570K1777J5367J9419L3784J2175L2458K7731L2546J721M4044M6430
9334A426259M3791L4467L6214K7418P646j057J9746K9448L3617M2638L6346M1608
9322A778141M4023K2090K0194M3119N4856K3058L7731M0683K6810K7887M4787
9311B163379L8108O1911O6351L0868L2118O0739O0435L1570L6465N1467N2598
$$ plain form
9300 2686009 2732727 2786169 2841181 2911421 2952195 2968386 2999140 3047395 3094725 3159618 3231678
9289 3231678 3312561 3368525 3424117 3499265 3535314 3561852 3604994 3651321 3700756 3740459 3768160
9278 3768160 3813444 3881987 3936489 3983444 4036241 4083100 4105681 4133151 4151932 4180694 4208109
9267 4208109 4218370 4229430 4245873 4255498 4262616 4266449 4254733 4243229 4248035 4223799 4195508 4161906
9255 4161906 4143131 4128425 4102781 4076924 4047631 3997390 3976286 3954027 3921433 3895643 3861179
9244 3861179 3812753 3757929 3691516 3630757 3567918 3508162 3461049 3437344 3390002 3315891 3290016
9233 3290016 3244779 3169482 3113688 3069925 3001249 2929783 2877793 2805621 2743374 2703385 2671506
9222 2671506 2630539 2580040 2527236 2473638 2412968 2368796 2346896 2323513 2269872 2205344 2153354
$$ packed form
9300B686009M6718N3442N5012P0240M0774J6191L0754M8255M7330O4893P2060
9289C231678Q0883N5964N5592P5148L6049K6538M3142M6327M9435L9703K7701
9278C768160M5284O8543N4502M6955N2797M6859K2581K7470J8781K8762K7415
9267D208109J0261J1060J6443R625P118L833j1716j1504M806k4236k8291l3602
9255D161906j8775j4706k5644k5857k9293n0241k1104k2259l2594k5790l4464
9244C861179m8426n4824o6413o0759o2839n9756m7113k3705m7342p4111k5875
9233C290016m5237p5297n5794m3763o8676p1466n1990p2172o2247l9989l1879
9222B671506m0967n0499n2804n3598o0670m4172k1900k3383n3641o4528n1990
$$ plain form
9211 2153354 2117356 2080811 2046309 1996320 1956184 1919318 1883829 1842985 1814594 1777440 1735449
9200 1735449 1703435 1684380 1658957 1627980 1583620 1550340 1517056 1479569 1451513 1434590 1413983
9189 1413983 1369747 1329538 1302766 1293910 1277522 1257516 1235779 1200373 1174569 1147903 1118089 1097708
9177 1097708 1061228 1047022 1038671 1013483 1000764 987145 982830 961275 949909 923466 905695 890839
9165 890839 874456 853507 824511 817577 822920 824471 805423 782210 764454 758243 744236 732446
9153 732446 706068 691176 691099 687198 673740 662199 652405 642675 646648 635164 604199 601957 589110
9140 589110 582602 598730 592873 575776 563569 570151 551709 529833 535133 543800 540286 527953 497510
9127 497510 475285 476480 478765 487101 476750 479712 477425 460628 449247 453259 452285 440419 430377
$$ packed form
9211B153354l5998l6545l4502m9989m0136l6866l5489m0844k8391l7154m1991
9200A735449l2014j9055k5423l0977m4360l3280l3284l7487k8056j6923k0607
9189A413983m4236m0209k6772q856j6388k0006k1737l5406k5804k6666k9814k0381
9177A097708l6480j4206q351k5188j2719j3619m315k1555j1366k6443j7771j4856
9165H90839j6383k0949k8996o934N343J551j9048k3213j7756o211j4007j1790
9153G32446k6378j4892p7l901j3458j1541r794r730L973j1484l0965k242j2847
9140E89110o508J6128n857j7097j2207O582j8442k1876N300Q667l514j2333l0443
9127D97510k2225J195K285Q336j0351K962k287j6797j1381M012r74j1866j0042
$$ plain form
9114 430377 426816 425944 420692 402867 393971 395865 394034 385351 367202 373544 383304 390949 373160 364035
9100 364035 354702 343933 343805 341247 329020 331675 323686 322158 315792 315816 331827 320900 307054 309575
9086 309575 300409 319267 322240 309625 322199 322620 309165 291335 268034 261012 266284 255804 285951
9073 285951 293282 287026 286913 266252 239080 244967 249528 254555 246591 244611 252567 262131 239447 221720
9059 221720 235550 254669 262260 226509 185181 185395 196245 201277 210856 220246 209403 192914 209171
9046 209171 212369 189819 185504 177755 183817 188509 192001 175786 146544 154664 159211 169960 184200
9033 184200 189599 186909 191395 176855 166749 169573 189604 181365 146028 157329 171372 164754 164120
9020 164120 157855 150804 166176 153077 139036 140934 159226 154700 162663 182422 174037 170035 162938
$$ packed form
9114D30377l561q72n252j7825q896J894j831q683j8149O342R760P645j7789r125
9100C64035r333j0769j28k558j2227K655p989j528o366K4J6011j0927j3846K521
9086C09575r166J8858K973j2615J2574M21j3455j7830k3301p022N272j0480L0147
9073B85951P331o256j13k0661k7172N887M561N027p964j980P956R564k2684j7727
9059B21720J3830J9119P591l5751m1328K14J0850N032R579R390j0843j6489J6257
9046B09171L198k2550m315p749O062M692L492j6215k9242Q120M547J0749J4240
9033A84200N399k690M486j4540j0106K824K0031q239l5337J1301J4043o618o34
9020A64120o265p051J5372j3099j4041J898J8292m526P963J9759q385m002p097
$$ plain form
9007 162938 148208 131610 123507 112098 105465 128088 128410 123039 109066 89550 90403 96836 97081 103216
8993 103216 118408 136979 132654 123351 132486 120349 129093 125504 109173 94280 104012 116994 139281
8980 139281 136372 111310 94779 110646 86918 95434 103752 99203 115357 109484 101393 95024 82811
8967 82811 84117 94644 101850 90121 102342 110172 88100 82535 91296 105964 111769 123482 126226
8954 126226 125042 119465 124055 109938 71617 43000 49723 81062 83782 68889 62836 67518 91103
8941 91103 81869 62157 47460 61654 58143 70649 80180 82952 77526 81764 85552 83164 72054
8928 72054 70223 69036 65694 72661 68989 65391 66121 72949 72281 76163 75423 87708 86670 65112 76135
8913 76135 100279 82088 69496 64713 50304 39300 50251 52806 66236 59079 49297 33755 52575
$$ packed form
9007A62938j4730j6598q103j1409o633K2623L22n371j3973j9516Q53O433K45O135
8993A03216J5192J8571m325r303R135j2137Q744l589j6331j4893R732J2982K2287
8980A39281k909k5062j6531J5867k3728Q516Q318m549J6154n873q091o369j2213
8967H2811J306J0527P206j1729J2221P830k2072n565Q761J4668N805J1713K744
8954A26226j184n577M590j4117l8321k8617O723L1339K720j4893o053M682K3585
8941I1103r234j9712j4697J4194l511J2506R531K772n426M238L788k388j1110
8928G2054j831j187l342O967l672l598P30O828o68L882p40J2285j038k1558J1023
8913G6135K4144j8191j2592m783j4409j1004J0951K555J3430p157r782j5542J8820
$$ plain form
8900 52575 44256 38612 46851 56872 69917 67156 45350 47717 45269 18477 -525 24365 51692
8887 51692 64620 69589 53511 46411 46688 60221 68255 56377 43399 37598 15674 -2103 3966
8874 3966 14557 -1096 10172 12440 13377 39590 69223 54088 47967 66419 60748 36893 61552
8861 61552 84584 73558 41367 27229 12646 26522 44914 34668 15651 -3468 -7874 6254
8849 6254 25783 43221 48728 21098 28878 25239 35575 57475 54121 51824 56976 57174 45436 42062
8835 42062 37994 23902 26502 17315 22383 26521 29808 23199 16969 20771 47246 38473 46631 62644
8821 62644 79359 67542 51484 53973 41381 29890 24829 8211 27593 49030 40052 41202 38211
8808 38211 27705 26077 5458 8087 18314 30632 35603 44754 42746 36249 44031 42231 66271
$$ packed form
8900E2575q319n644Q239J0021J3045k761k1806K367k448k6792j9002K4890K7327
8887E1692J2928M969j6078p100K77J3533Q034j1878j2978n801k1924j7777O069
8874C966J0591j5653J1268K268R37K6213K9633j5135o121J8452n671k3855K4659
8861F1552K3032j1026l2191j4138j4583J3876J8392j0246j9017j9119m406J4128
8849F254J9529J7438N507k7630P780l639J0336K1900l354k297N152J98j1738l374
8835D2062m068j4092K600r187N068M138L287o609o230L802K6475q773Q158J6013
8821F2644J6715j1817j6058K489j2592j1491n061j6618J9382K1437q978J150k991
8808C8211j0506j628k0619K629J0227J2318M971R151k008o497P782j800K4040
$$ plain form
8795 66271 76661 57095 29076 14226 21448 18846 12860 29086 44296 62936 67474 53404 50771
8782 50771 51486 33838 33089 37052 50976 51953 48650 30438 17127 -5509 -21504 -20138 1855 20519
8768 20519 9176 -12459 6998 9935 19705 28854 34284 26244 30977 37143 36912 23043 23135 28652
8754 28652 27794 40047 45633 54899 77343 64948 39896 25212 32155 34710 22423 16143 29158
8741 29158 21708 15650 7527 3119 13651 21283 23844 32375 33382 35079 47981 44409 29882 47815
8727 47815 43073 31910 37775 33834 15318 6185 5107 6161 24559 31926 39966 45980 31167 25072
8713 25072 35123 34334 21828 31525 23817 527 -2221 2327 10950 12750 17824 21266 13167 14705
8699 14705 21047 19941 20982 14570 13745 19207 47484 65333 70247 71218 53654 45897 53860 61986
$$ packed form
8795F6271J0390j9566k8019j4850P222k602n986J6226J5210J8640M538j4070k633
8782E0771P15j7648p49L963J3924R77l303j8212j3311k2636j5995J366K1993J8664
8768B0519j1343k1635J9457K937R770R149N430q040M733O166k31j3869R2N517
8754B8652q58J2253N586R266K2444j2395k5052j4684O943K555j2287o280J3015
8741B9158p450o058q123m408J0532P632K561Q531J007J697J2902l572j4527J7933
8727D7815m742j1163N865l941j8516r133j078J054J8398P367Q040O014j4813o095
8713B5072J0051p89j2506R697p708k3290k748M548Q623J800N074L442q099J538
8699A4705O342j106J041o412q25N462K8277J7849M914R71j7564p757P963Q126
$$ plain form
8685 61986 51067 30475 18491 22736 34342 50147 53167 52075 38609 43837 35486 22686 41895
8672 41895 38189 37344 14299 5749 1488 557 -473 2752 -5261 -12303 -9842 -4064 18775 22352 8927
8657 8927 20772 27455 16985 11990 33564 42718 24962 20072 16695 11094 25558 47105 50904
8644 50904 25636 10966 17625 18361 25712 38157 20510 1569 -90 -10674 -26513 2649 25075
8631 25075 19794 29468 9509 -5980 6725 -6470 -2036 13439 17214 32568 48164 43715 37552
8618 37552 43810 47365 50624 32626 25638 40131 28836 44397 31339 7995 6031 15146 16463
8605 16463 -4637 -11860 -6366 -7057 -26729 -30568 -11067 -13 2797 5824 26426 23492 16763 9092
8591 9092 5295 22306 37677 32424 33440 22243 20115 33288 37550 28888 29655 35136 38583 44495
$$ packed form
8685F1986j0919k0592j1984M245J1606J5805L020j092j3466N228q351j2800J9209
8672D1895l706q45k3045q550m261r31j030L225q013p042K461N778K2839L577j3425
8657H927J1845O683j0470m995K1574R154j7756m890l377n601J4464K1547L799
8644E0904k5268j4670O659P36P351J2445j7647j8941j659j0584j5839K9162K2426
8631B5075n281R674j9959j5489J2705j3195M434J5475L775J5354J5596m449o163
8618C7552O258L555L259j7998o988J4493j1295J5561j3058k3344j964R115J317
8605A6463k1100p223N494o91j9672l839J9501J1054K810L027K0602k934o729p671
8591I092l797J7011J5371n253J016j1197k128J3173M262q662P67N481L447N912
$$ plain form
8577 44495 48729 34900 35267 22417 21499 4792 15423 15985 27389 54001 71770 74209 67606 55283
8563 55283 67176 71957 55007 37574 19042 4561 14987 8093 -8493 -1054 -267 -1211 959
8550 959 6569 14396 12150 16773 32065 38361 30280 32950 35536 28399 8614 17099 13996 -1834
8536 -1834 15556 49811 51526 49316 45016 28292 18185 20930 13071 16545 10428 -6917 7261
8523 7261 20566 -2731 -8680 -9736 -6104 12521 27330 33250 14296 14443 8956 7754 16549 14491
8509 14491 11403 8425 -7267 2275 11389 21177 27555 24463 16318 23174 19430 11099 10148 10658 2696
8494 2696 -4061 -8511 -8153 4054 24666 30499 8430 -5468 -359 980 -2069 961 -6387 -6195
8480 -6195 -7786 10437 13411 938 -3194 7569 3209 -13285 -19297 -15725 2074 28953 36729
$$ packed form
8577D4495M234j3829L67j2850r18j6707J0631N62J1404K6612J7769K439o603j2323
8563E5283J1893M781j6950j7433j8532j4481J0426o894j6586P439P87r44K170
8550I59N610P827k246M623J5292O296q081K670K586p137j9785Q485l103j5830
8536a834J7390L4255J715k210m300j6724j0107K745p859L474o117j7345J4178
8523G261J3305k3297n949j056L632J8625J4809N920j8954J47n487j202Q795k058
8509A4491l088k978j5692R542R114R788O378l092q145O856l744q331r51N10p962
8494B696o757m450L58J2207K0612N833k2069j3898N109J339l049L030p348J92
8480f195j591J8223K974j2473m132J0763m360j6494o012L572J7799K6879P776
$$ plain form
8467 36729 36672 30598 4243 -10319 -13839 -9490 977 5473 619 -9795 -462 19642 23203 31825
8453 31825 21859 25089 20329 -4693 -20135 -18431 6187 5695 5406 6513 4198 7826 -173 -9829
8439 -9829 -16094 -8583 -780 6341 1340 -1497 4006 4973 11585 9370 5816 11285 19897 16900 656
8424 656 -7922 13127 13626 31719 49459 45957 28148 24872 5953 4279 7874 6755 6233 -3744
8410 -3744 -8364 -13854 455 -772 -12859 -10979 -9376 -21360 -19642 -5433 -6555 12259 19181 4558
8396 4558 -6283 -1042 11926 19756 17878 8476 7707 -193 3675 17984 21328 -9032 -22545 -26487
8382 -26487 -6375 -2055 -6359 -17209 -22219 -10515 1044 -12322 -37419 -47776 -10060 11927
8370 11927 13076 1928 -14405 -12625 4326 5868 18099 35483 41242 42859 24336 2301 -3824
$$ packed form
8467C6729n7o074k6355j4562l520M349J0467M496m854j0414R333K0104L561Q622
8453C1825r966L230m760k5022j5442J704K4618m92k89J107k315L628p999r656
8439i829o265P511P803P121n001k837N503R67O612k215l554N469Q612k997j6244
8424F56q578K1049M99J8093J7740l502j7809l276j8919j674L595j119n22r977
8410c744m620n490J4309j227j2087J880J603j1984J718J4209j122J8814O922j4623
8396D558j0841N241J2968P830j878r402p69p900L868J4309L344l0360j3513l942
8382b6487K0112M320m304j0850n010J1704J1559j3366k5097j0357L7716K1987
8370A1927J149j1148j6333J780J6951J542J2231J7384N759J617j8523k2035o125
$$ plain form
8357 -3824 -12042 -15547 -15045 -5176 2682 19274 23933 13911 19168 27504 26254 31901 26359 29377 28410
8342 28410 12696 -845 6618 2770 906 6102 15460 23066 -6994 3790 24302 17612 10943
8329 10943 13890 9160 -14909 -22351 -6524 5979 -253 5316 -5812 -3812 -4410 -3925 13104 8432
8315 8432 -510 9590 -9758 -39960 -34572 -15076 -5683 -7269 5761 8334 -2596 7999 19388
8302 19388 5312 -13116 -38138 -41778 -25426 -27707 -18778 -631 8613 -8781 -9051 14301 14496
8289 14496 -203 6891 -2890 -7712 -6495 -10081 -22077 -29835 -24099 -17387 803 347 8690 23018
8275 23018 15287 -10595 -25277 -27594 -2822 12625 15377 15042 1439 8585 4648 12314 14026 -12775
8261 -12775 -25621 -12883 4763 16947 18257 17965 25711 20318 18174 15376 21003 22669 23440 41458
$$ packed form
8357c824q218l505N02R869P858J6592M659j0022N257Q336j250N647n542L018r67
8342B8410j5714j3541P463l848j864N196R358P606l0060J0784K0512o690o669
8329A0943K947m730k4069p442J5827J2503o232N569j1128K000n98M85J7029m672
8315H432q942J0100j9348l0202N388J9496R393j586J3030K573j0930J0595J1389
8302A9388j4076j8428k5022l640J6352k281Q929J8147R244j7394k70K3352J95
8289A4496j4699P094r781m822J217l586j1996p758N736O712J8190m56Q343J4328
8275B3018p731k5882j4682k317K4772J5447K752l35j3603P146l937P666J712k6801
8261a2775j2846J2738J7646J2184J310k92P746n393k144k798N627J666P71J8018
$$ plain form
8247 41458 39616 45571 47231 30405 36492 33029 16279 3191 12143 12373 14785 29165 19842 3614
8233 3614 12822 24254 17069 21520 14364 2013 7353 13175 19669 20348 26298 14690 14433 13387 -3296
8218 -3296 11276 5481 -11801 177 32524 54320 54026 39922 19176 743 7932 7276 2418
8205 2418 -875 7117 10027 -19447 -15248 -14165 -18516 -31242 -44157 -27742 10242 25694 31400
8192 31400 27163 15895 -2870 -13710 -11388 2388 17248 7315 4633 -6333 -4901 -2217 -735
8179 -735 -3324 -12000 -16532 -2012 8872 16072 2804 -1442 11892 43114 43859 29967 25736 24237
8165 24237 9537 4070 1957 -2170 -8380 -3907 -312 3363 11981 17097 18896 28141 22141 24211
8151 24211 13787 22194 15132 -21115 -44506 -34979 -34360 -32993 -26897 -6304 19435 30547 30849 2814
$$ packed form
8247D1458j842N955J660j6826O087l463j6750j3088Q952K30K412J4380r323j6228
8233C614R208J1432p185M451p156j2351N340N822O494O79N950j1608k57j046j6683
8218c296J4572n795j7282J1978L2347K1796k94j4104k0746j8433P189o56m858
8205B418l293P992K910k9474M199J083m351j2726j2915J6415L7984J5452N706
8192C1400m237j1268j8765j0840K322J3776J4860r933k682j0966J432K684J482
8179g35k589q676m532J4520J0884P200j3268m246J3334L1222P45j3892m231j499
8165B4237j4700n467k113m127o210M473L595L675Q618N116J799R245o000K070
8151B4211j0424Q407p062l6247k3391R527O19J367O096K0593K5739J1112L02k8035
$$ plain form
8137 2814 3627 18218 23522 10937 14016 10377 16076 11357 -1516 -13913 -6776 -3006 -5015 8
8123 8 1483 2360 15178 33576 28316 12093 162 -7290 -17196 -25698 -16354 -17087 -9125 12591 15048
8108 15048 -641 4519 9524 11593 -12601 30 13443 17598 29952 14083 234 16248 21018
8095 21018 19843 7507 -2812 -18734 -26159 -21623 -16108 -12313 -10402 -852 3557 -3661 5764 1684
8081 1684 4629 7123 -3677 -2677 2250 8846 2644 21531 8886 -3727 -4385 -5819 -25156 -10362
8067 -10362 -2732 -7725 -22899 -47712 -34681 7221 15559 -3939 -10157 -3499 8257 -6233 -11406
8054 -11406 -8226 -14127 -19335 -23357 -30109 -25421 -21725 -12702 -10866 -9756 -7996 -9229 -4949 -11412 -17644
8039 -17644 -4962 1660 627 15352 29748 44728 27969 7139 3519 10344 4492 12960 1698
$$ packed form
8137B814Q13J4591N304j2585L079l639N699m719j2873j2397P137L770k009N023
8123HJ475Q77J2818J8398n260j6223j1931p452r906q502R344p33P962K1716K457
8108A5048j5689N160N005K069k4194J2631J3413M155J2354j5869j3849J6014M770
8095B1018j175j2336j0319j5922p425M536N515L795J911R550M409p218R425m080
8081A684K945K494j0800J000M927O596o202J8887j2645j2613o58j434j9337J4794
8067a0362P630m993j5174k4813J3031M1902Q338j9498o218O658J1756j4490n173
8054a1406L180n901n208m022o752M688L696R023J836J110J760j233M280o463o232
8039a7644J2682O622j033J4725J4396J4980j6759k0830l620O825n852Q468j1262
$$ plain form
8026 1698 -5052 10092 15847 4350 2064 4613 1770 5693 -627 -15051 9492 36855 48610
8013 48610 29175 23346 9425 9084 13895 17919 6457 19533 18277 18423 13210 15898 11452 14426
7999 14426 4278 3704 -9341 6525 -29 -12692 -17504 -10956 6493 4347 733 -7440 5291
7986 5291 28512 25453 12720 3101 6889 7078 -1539 11686 21893 27843 29744 30013 33367 23722
7972 23722 21279 32459 23120 32525 19147 17467 11364 542 21441 52844 41181 21153 20145
7959 20145 4799 -12864 -4030 12776 13046 9454 14292 28981 33557 37372 33508 36337 58301 57570
7945 57570 29358 37151 60265 59784 49834 54020 45003 61410 55359 52743 40933 55654 66225
7932 66225 46291 20567 23124 48364 44382 13319 18075 37989 44895 44433 46081 42259 54791
$$ packed form
8026A698o750J5144N755j1497k286K549k843L923o320j4424K4543K7363J1755
8013D8610j9435n829j3921l41M811M024j1462J3076j256J46n213K688m446K974
7999A4426j0148n74j3045J5866o554j2663m812O548J7449k146l614q173J2731
7986E291K3221l059j2733r619L788J89q617J3225J0207N950J901K69L354r645
7972B3722k443J1180r339R405j3378j680o103j0822K0899L1403j1663k0028j008
7959B0145j5346j7663Q834J6806K70l592M838J4689M576L815l864K829K1964p31
7945E7570k8212P793K3114m81r950M186r017J6407o051k616j1810J4721J0571
7932F6225j9934k5724K557K5240l982l1063M756J9914O906m62J648l822J2532
$$ plain form
7919 54791 50862 44830 50843 49722 42225 33697 28524 24461 32125 44299 39335 57811 60116 41224
7905 41224 27890 33978 53280 65407 67076 64703 65093 67840 77218 67888 74545 63643 61078 72184
7891 72184 80223 68915 68635 77511 70220 57102 32278 15034 9930 18278 23004 28587 43057 40426
7877 40426 32536 25643 30714 37184 20678 20586 32836 35076 40787 31485 23549 19100 24201 37933
7863 37933 42004 43022 49995 40477 20589 23156 16695 25605 22925 14858 36612 42590 14189 11750
7849 11750 22048 31037 49954 44439 49380 52874 30811 22969 30414 21190 12788 9076 9726 11010
7835 11010 8514 6038 8277 7326 15311 34330 43086 48091 44304 42996 58756 50100 27263 8542
7821 8542 -11774 -6502 -6470 7814 27852 31475 26033 16853 17165 20191 5516 -207 -991 3724 -4628
$$ packed form
7919E4791l929o032O013j121p497q528n173m063P664J2174m964J8476K305j8892
7905D1224j3334O088J9302J2127J669k373L90K747R378r330O657j0902k565J1106
7891G2184Q039j1308k80Q876p291j3118k4824j7244n104Q348M726N583J4470k631
7877D0426p890o893N071O470j6506r2J2250K240N711r302p936m449N101J3732
7863C7933M071J018O973r518j9888K567o461Q910k680q067K1754N978k8401k439
7849A1750J0298Q989J8917n515M941L494k2063p842P445r224q402l712O50J284
7835A1010k496k476K239r51P985J9019Q756N005l787j308J5760q656k2837j8721
7821H542k0316N272L2J4284K0038L623n442r180L12L026j4675n723p84M715q352
$$ plain form
7806 -4628 -19619 -17093 -12035 -3181 12654 3127 -11201 -19162 -25662 -27325 -18326 -10476 13209 35862
7792 35862 36157 13714 -1109 -2326 3291 5531 -16864 -18082 -16901 -19763 -15423 -9304 357 -2639
7778 -2639 -3316 -12791 -26377 -15248 -3190 -6099 11782 8343 -24 -3740 -4118 -8360 -14909 -13041
7764 -13041 1158 517 4245 17301 12479 2747 -9898 -21422 -37996 -24941 -8112 -13536 -20201
7751 -20201 -11447 3923 -1900 -447 11299 14950 9143 13538 10922 6719 -18677 -25970 -23248 -17519
7737 -17519 -13310 -12809 2575 9443 -5312 -18690 11818 7972 9699 14184 13101 -7 -12486
7724 -12486 -13032 -12078 -9317 -11691 -18361 -3767 11104 4226 -7025 -9438 -894 -1895 -5657 -793
7710 -793 -2737 8406 7127 12630 -2893 -24966 -40021 -23014 -7487 10298 20097 5737 -846
$$ packed form
7806d628j4991K526N058Q854J5835r527j4328p961o500j663Q999P850K3685K2653
7792C5862K95k2443j4823j217N617K240k2395j218J181k862M340O119R661k996
7778b639o77r475j3586J1129J2058k909J7881l439q367l716l78m242o549J868
7764a3041J4199o41L728J3056m822r732j2645j1524j6574J3055J6829n424o665
7751b0201Q754J5370n823J453J1746L651n807M395k616m203k5396p293K722N729
7737a7519M209N01J5384O868j4755j3378L0508l846J727M485j083j3108j2479
7724a2486n46R54K761k374o670J4594J4871o878j1251k413Q544j001l762M864
7710g93j944J1143j279N503j5523k2073j5055J7007J5527J7785R799j4360o583
$$ plain form
7697 -846 -1673 1246 25101 18934 13716 22525 37048 28081 30990 39159 25862 18081 12775 -10284
7683 -10284 -9536 9919 6282 4217 -6373 -9258 -7108 -10953 -335 -7793 -26981 -33105 -34960 -22671
7669 -22671 -24116 -46252 -35873 -10116 -4877 5920 15758 4761 4564 6882 -4603 3187 6041
7656 6041 6433 13256 8171 -1937 -20419 -19803 -34174 -28598 -12159 11832 17551 -2384 -727 12710
7642 12710 3375 -1490 -15655 -34193 -36706 -14382 8558 -11519 -13530 3329 3689 -18746 -19804
7629 -19804 -7109 6003 6350 -12918 -12708 -5495 14653 -9595 -12844 12302 18589 13375 -5021
7616 -5021 -14794 -25565 -17168 -17416 -26909 -30471 -38436 -19605 -16513 -7163 -878 2318 2648 -8360 -17504
7601 -17504 -31378 -22661 -88 17442 10957 25456 21624 16934 11665 -4000 11280 23462 12154
$$ packed form
7697h46q27K919K3855o167n218Q809J4523q967K909Q169j3297p781n306k3059
7683a0284P48J9455l637k065j0590k885K150l845J0618p458j9188o124j855J2289
7669b2671j445k2136J0379K5757N239J0797R838j0997j97K318j1485P790K854
7656F041L92O823n085j0108j8482O16j4371N576J6439K3991N719j9935J657J3437
7642A2710r335m865j4165j8538k513K2324K2940k0077k011J6859L60k2435j058
7629a9804J2695J3112L47j9268K10P213K0148k4248l249K5146O287n214j8396
7616e021r773j0771Q397k48r493l562p965J8831L092R350O285L196L30j1008r144
7601a7504j3874Q717K2573J7530o485J4499l832m690n269j5665J5280J2182j1308
$$ plain form
7588 12154 3620 10277 1156 -3844 3593 -1724 -20460 -17238 12537 9534 -1034 8386 28990 11734
7574 11734 -2072 -16691 -7280 -11383 -25665 -15370 -4337 -4005 -8719 -8025 -10023 -3587 12462 -13546
7560 -13546 -9341 -1957 -5713 -15091 -6537 -10900 9223 19205 28978 29566 33281 16722 7195 -8789
7546 -8789 -18848 -14175 -12622 -21828 -2759 9295 -11262 -19172 -20809 -18979 -23045 -18463 -13810 1743
7532 1743 -10700 -25053 -23826 -22098 -31669 -34037 -19410 -19016 -5539 1230 12165 8989 -2612 -5440
7518 -5440 4761 15785 25840 27672 12435 16196 -10010 -27703 -25129 -12900 1451 17260 8979
7505 8979 2427 12369 14404 15976 7358 -8453 -19855 -14259 -2710 -4596 -455 1554 -5020 -2883
7491 -2883 -4014 -4745 -5344 -8363 3941 582 1731 -4375 -2721 -9110 -25014 -25662 -9531 -11384 -19075
$$ packed form
7588A2154q534O657r121n000P437n317j8736L222K9775l003j0568R420K0604j7256
7574A1734j3806j4619R411m103j4282J0295J1033L32m714O94j998O436J6049k6008
7560a3546M205P384l756r378Q554m363K0123R982R773N88L715j6559r527j5984
7546h789j0059M673J553r206J9069J2054k0557p910j637J830m066M582M653J5553
7532A743j2443j4353J227J728r571k368J4627L94J3477O769J0935l176j1601k828
7518e440J0201J1024J0055J832j5237L761k6206j7693K574J2229J4351J5809q281
7505H979o552R942K035J572q618j5811j1402N596J1549j886M141K009o574K137
7491b883j131p31n99l019J2304l359J149o106J654o389j5904o48J6131j853p691
$$ plain form
7476 -19075 -6533 -5635 -17310 -2323 -949 -6306 -10649 -5132 -15236 9215 2665 -8427 -11949
7463 -11949 -14141 3824 22980 15181 7568 14041 21573 9821 -8291 -24362 -20430 645 -6920
7450 -6920 5860 16606 16485 -5906 -33235 -41385 -41474 -24124 5155 18272 1662 -15722 -11406
7437 -11406 -17562 -15196 -13280 -20026 -22799 -23092 -39013 -35222 -25126 -25278 -29397 -6607 -1116 -9612
7423 -9612 -10238 -7745 -17253 -10989 -17188 -22851 -10520 -7650 -16627 -9905 -14515 -19313 -9049 -6288 -578
7408 -578 17764 17639 19632 13583 -7806 2759 11061 8294 16984 13835 1902 -8224 -13617 -24784
7394 -24784 -21954 -19207 -20165 -16811 -3582 -16789 -14590 -8624 -9254 -18233 -29519 -44470 -29407 -6576
7380 -6576 -4694 -5390 5753 16258 21278 18862 17830 16033 12761 10070 -10271 -20626 -26081 -31642
$$ packed form
7476a9075J2542Q98j1675J4987J374n357m343N517j0104K4451o550j1092l522
7463a1949k192J7965J9156p799p613O473P532j1752j8112j6071L932K1075p565
7450f920J2780J0746j21k2391k7329q150q9J7350K9279J3117j6610j7384M316
7437a1406o156K366J916o746k773k93j5921L791J0096j52m119K2790N491q496
7423i612o26K493r508O264o199n663J2331K870q977O722m610m798J0264K761N710
7408e78J8342j25J993o049k1389J0565Q302k767Q690l149j1933j0126n393j1167
7394b4784K830K747r58L354J3229j3207K199N966o30q979j1286j4951J5063K2831
7380f576J882o96J1143J0505N020k416j032j797l272k691k0341j0355n455n561
$$ plain form
7366 -31642 -40795 -32896 -2326 14133 -465 -7029 -5883 8137 1363 -11274 -5167 7716 28143
7353 28143 31230 15219 9323 2029 -13186 -11308 -8057 -15924 -24196 -21947 -11823 -4265 -2364 -1412
7339 -1412 1431 12060 12469 6889 -14743 -25409 -23933 -27783 -29195 -38915 -42324 -28905 -13755 -8207
7325 -8207 4400 33298 43510 37015 24357 9221 -12248 -10864 13783 15458 -319 1403 6450
7312 6450 -12357 -10138 -9426 -3720 -5029 -2708 6738 19541 29921 25050 14303 29964 41167 35817
7298 35817 34790 14044 7205 20827 3634 6379 6625 9895 8884 -5266 -17348 -20444 -20192 -1062
7284 -1062 18645 19495 13784 -792 5372 -7554 -7760 11802 -6225 -1320 -9522 -23735 -30347 -24664
7270 -24664 -11486 3571 -5088 -2167 25847 36849 15842 4464 16491 33312 30672 30148 38775
$$ packed form
7366c1642r153P899L0570J6459j4598o564J146J4020o774j2637O107J2883K0427
7353B8143L087j6011n896p294j5215J878L251p867q272K249J0124P558J901R52
7339a412K843J0629M09n580k1632j0666J476l850j412r720l409J3419J5150N548
7325h207J2607K8898J0212o495j2658j5136k1469J384K4647J675j5777J722N047
7312F450j8807K219P12N706j309K321R446J2803J0380m871j0747J5661J1203n350
7298C5817j027k0746o839J3622j7193K745K46L270j011j4150j2082l096K52J9130
7284a062J9707Q50n711j4576O164j2926k06J9562j8027M905q202j4213o612N683
7270b4664J3178J5057q659K921K8014J1002k1007j1378J2027J6821k640n24Q627
$$ plain form
7257 38775 28875 -1841 -5251 -975 4370 -6691 -4228 3242 -863 8263 14600 23218 20103 15717
7243 15717 11411 88 -6362 -396 12633 26759 23499 13168 -7008 -17218 -17614 1523 -4513
7230 -4513 -13145 -10121 4595 15915 6843 -7669 7334 186 -14262 -20032 -475 -329 -15630
7217 -15630 -19711 -562 9763 18182 11331 13767 159 -10515 -311 12857 18585 18370 11023
7204 11023 -4011 -11497 4686 4773 4463 14752 20541 10990 77 -9753 -1867 -1370 -1509 -10531 -16440
7189 -16440 -14014 -24258 -21826 -10393 -1033 3747 -6171 -18021 -17151 -6972 -7602 1479 14270 -7026
7175 -7026 -20574 -9070 -9279 -5131 17254 -3390 -28917 -27242 -22279 -38753 -21644 -21505 -29643 -51128
7161 -51128 -54334 -44442 -36750 -24257 -9483 4036 17635 19893 13494 -1655 -18828 -23262 -26267
$$ packed form
7257C8775r900l0716l410M276N345j1061K463P470m105R126O337Q618l115m386
7243A5717m306j1323o450N966J3029J4126l260j0331k0176j0210l96J9137o036
7230d513q632L024J4716J1320r072j4512J5003p148j4448n770J9557J46j5301
7217a5630m081J9149J0325Q419o851K436j3608j0674J0204J3168N728k15p347
7204A1023j5034p486J6183Q7l10J0289N789r551j0913r830P886M97j39r022n909
7189a6440K426j0244K432J1433R360M780r918j1850Q70J0179o30R081J2791k1296
7175g026j3548J1504k09M148K2385k0644k5527J675M963j6474J7109J39q138k1485
7161e1128l206R892P692J2493J4774J3519J3599K258o399j5149j7173m434l005
$$ plain form
7148 -26267 -22158 -15384 -29660 -36236 -32434 -33432 -30344 -28938 -16723 -5787 -763 11946 11937 -1026
7134 -1026 -7659 -28992 -18385 -3466 -25098 -29404 -26399 -23438 -12198 -6488 8531 -841 -4314
7121 -4314 -115 6837 20047 18527 -10039 -27768 -23396 -27047 -7848 9552 18774 2635 5648
7108 5648 25610 17712 813 -31607 -18135 -2916 -3690 -1070 -6904 -24684 -12888 -1807 -10166
7095 -10166 -16760 -2807 -10726 3124 3409 -732 -822 12500 -708 -9136 -8926 -9398 -11955 2678 13674
7080 13674 31539 42363 30274 5969 -22678 -38290 -12197 -6578 7742 10770 -2426 7983
7068 7983 4757 -7041 -332 6334 -2500 -748 -8861 9649 15868 18388 13771 18513 9536 -1634
7054 -1634 4889 -4797 2147 31475 36245 31275 11685 11516 1875 9596 5424 1080 -1424 -5315 -24032
$$ packed form
7148b6267M109O774j4276o576L802r98L088J406J2215J0936N024J2709rj2963
7134a026o633k1333J0607J4919k1632m306L005K961J1240N710J5019r372l473
7121d314M199O952J3210j520k8566j7729M372l651J9199J7400R222j6139L013
7108E648J9962p898j6899l2420J3472J5219p74K620n834j7780J1796J1081q359
7095a0166o594J3953p919J3850K85m141r0J3322j3208q428K10m72k557J4633J0996
7080A3674J7865J0824j2089k4305k8647j5612K6093N619J4320L028j3196J0409
7068G983l226j1798O709O666q834J752q113J8510O219K520m617M742q977j1170
7054a634O523r686O944K9328M770m970j9590j69r641P721m172m344k504l891j8717
$$ plain form
7039 -24032 -34595 -24141 -18562 -8699 2977 10657 23093 27402 15105 -5463 -18942 -14948 -7598
7026 -7598 -7546 -21558 -2317 -14382 -7090 19344 5506 -6059 -9967 -10494 7852 21491 21430 22987
7012 22987 16462 -10717 -17493 -24925 -23925 7030 37288 31813 25887 17052 25009 11197 9347 12935
6998 12935 -4043 -27079 -41164 -41100 -31232 -22668 -15150 -8269 -3191 -14882 -22754 -15098 -14314 -6341
6984 -6341 -12371 -18046 -19832 -36900 -28839 -10986 -3664 -19809 -25124 -16791 -13620 -6873 -5481 -16404
6970 -16404 -13786 -24978 -24912 -33850 -36632 -33694 -37363 -35409 -26584 -22687 -10659 559 14734 488
6956 488 11286 19000 326 -10433 -13502 -12649 -1298 -9471 -10208 6024 -11109 -22419 -32348 -30222
6942 -30222 1821 12220 1548 16891 19111 11819 6941 26882 27131 -3017 -10542 -20699 -33466
$$ packed form
7039b4032j0563J0454N579R863J1676P680J2436M309j2297k0568j3479L994P350
7026g598N2j4012J9241j2065P292K6434j3838j1565l908n27J8346J3639o1J557
7012B2987o525k7179o776p432J000L0955L0258n475n926q835P957j3812j850L588
6998A2935j6978k3036j4085O4R868Q564P518O881N078j1691p872P656P84P973
6984f341o030n675j786j7068Q061J7853P322j6145n315Q333L171O747J392j0923
6970a6404K618j1192O6q938k782K938l669J954Q825L897J2028J1218J4175j4246
6956D88J0798P714j8674j0759l069Q53J1351q173p37J6232j7133j1310r929K126
6942c0222L2043J0399j0672J5343K220p292m878J9941K49l0148p525j0157j2767
$$ plain form
6929 -33466 -29888 -7334 4278 4115 955 4665 1032 2316 23637 18178 -24266 -27410 -6843 9007
6915 9007 2672 4832 -1661 -3698 1261 6585 4200 9592 5816 21658 28988 29649 14969 2391
6901 2391 -4601 -7157 -13262 -7673 5290 6825 13327 25115 36620 10629 -12445 -28525 -11419
6888 -11419 -14090 -22705 1076 22202 5306 -6725 3083 -2282 -15594 -24563 -18586 4506 1825
6875 1825 -16545 -33789 -36705 -17557 5302 4672 11552 20401 14403 -6099 -10865 -11058 -9892 -29177
6861 -29177 -22141 3893 18565 16708 12793 11986 5659 12982 14162 -7151 -30982 -23008 -12080 -17491
6847 -17491 -7476 -7996 -19435 -5465 9121 11555 -10927 -20492 -22442 -23901 -15210 -17875 -7805
6834 -7805 14601 14567 3960 -3466 -12098 -28773 -18940 -11768 -23628 -31937 -26817 -14931 -10703 -7539
$$ packed form
6929c3466L578K2554J1612j63l160L710l633J284K1321n459m2444l144K0567J5850
6915I007o335K160o493k037M959N324k385N392l776J5842P330O61j4680j2578
6901B391o992k556o105N589J2963J535O502J1788J1505k5991k3074j6080J7106
6888a1419k671q615K3781K1126j6896j2031R808n365j3312q969N977K3092k681
6875A825j8370j7244k916J9148K2859o30O880Q849n998k0502m766j93J166j9285
6861b9177P036K6034J4672j857l915q07o327P323J180k1313k3831P974J0928n411
6847a7491J0015n20j1439J3970J4586K434k2482r565j950j459Q691k665J0070
6834g805K2406l4j0607p426q632j6675R833P172j1860q309N120J1886M228L164
$$ plain form
6820 -7539 -16678 -13198 540 9458 4694 9332 3243 14375 12198 -3834 -8646 -5113 -2665 -6569
6806 -6569 -25499 -19118 -6566 3715 -6602 -22332 -1035 2401 -7176 -17227 1827 28727 38516
6793 38516 17378 21497 21632 3021 -10358 -5527 5941 14597 23648 23100 22363 24478 21861 19470
6779 19470 22562 13582 11202 15989 26337 14817 -7572 2968 6268 -1663 -2328 -9487 -5133 -25
6765 -25 19896 14597 9487 -102 10119 19738 16314 3216 1548 -16042 -27263 -32630 526 4869
6751 4869 -11315 -23193 -19245 -8116 -22370 -37738 -34333 -26652 -10330 -20072 -24834 -10228 -7887
6738 -7887 -20197 -26651 -19623 1292 9578 9895 9522 13282 17479 13382 12873 23006 -837 -10959
6724 -10959 -2980 -6355 8729 22733 -798 -6409 7012 3419 -12245 -23146 -38373 -49540 -19956
$$ packed form
6820g539r139L480J3738Q918m764M638o089J1132k177j6032m812L533K448l904
6806f569j8930O381J2552J0281j0317j5730K1297L436r577j0051J9054K6900R789
6793C8516k1138M119J35j8611j3379M831J1468Q656R051n48p37K115k617k391
6779A9470L092q980k380M787J0348j1520k2389J0540L300p931o65p159M354N108
6765b5J9921n299n110r589J0221R619l424j3098j668j7590j1221n367L3156M343
6751D869j6184j1878L948J1129j4254j5368L405P681J6322r742m762J4606K341
6738g887j2310o454P028K0915Q286L17l73L760M197m097n09J0133k3843j0122
6724a0959P979l375J5084J4004k3531n611J3421l593j5664j0901j5227j1167K9584
$$ plain form
6711 -19956 1766 -4957 -17347 -14050 -9632 -5396 3596 7694 11550 4838 5286 9345 -2135 5514
6697 5514 12516 -2011 -13253 -15407 -12843 -15002 -15529 -17068 -10827 -15909 -36976 -9273 -8593 -11772
6683 -11772 1895 260 -9797 -13496 -16497 -22071 -12285 5419 2849 -5750 -14671 -41354 -42566 -35207
6669 -35207 -18946 -1255 -2422 2420 2817 -3186 -11605 -16854 -21058 -7626 -12684 -8824 -17231 -6324
6655 -6324 1802 -7608 6170 18824 15762 -5870 -16051 -15315 -9318 -4118 8109 29624 29476 34848
6641 34848 27039 24916 15042 -9015 -14239 -6122 7020 9115 8493 8721 25291 34359 31603 26334
6627 26334 23451 15917 -7202 -24848 -21523 -22584 -5133 7743 26663 25711 20881 10016 -4140
6614 -4140 -7283 -9910 -13313 -4459 -8003 -7713 -8690 -21251 -40253 -56420 -37892 -18871 -3549 -5903
$$ packed form
6711a9956K1722o723j2390L297M418M236Q992M098L856o712M48M059j1480P649
6697E514P002j4527j1242k154K564k159n27j539O241n082k1067K7703O80l179
6683a1772J3667j635j0057l699l001n574R786J7704k570q599q921k6683j212P359
6669c5207J6261J7691j167M842L97o003q419n249m204J3432n058L860q407J0907
6655f324Q126r410J3778J2654l062k1632j0181P36N997N200J2227K1515j48N372
6641C4848p809k123r874k4057n224Q117J3142K095o22K28J6570R068k756n269
6627B6334k883p534k3119j7646L325j061J7451J2876J8920r52m830j0865j4156
6614d140l143k627l403Q854l544K90r77j2561j9002j6167J8528J9021J5322k354
$$ plain form
6600 -5903 -7027 -13631 -4401 -2011 9193 19137 9792 7242 7945 12421 10874 21507 21785 5253 -6429
6585 -6429 -9532 724 13245 10968 7442 12521 22204 21955 19467 -3571 -14246 331 -7983 -22632
6571 -22632 -23124 -16743 -19461 -18266 -28501 -20615 -2791 4983 5662 3851 2893 3980 -2111 -10585 -23384
6556 -23384 -42046 -31007 -5797 6279 10826 2119 -7891 -13171 -15765 -105 7433 6018 -3729
6543 -3729 -3368 4629 -1421 -27179 -24063 -20760 -23988 -14719 4433 3947 -1588 -15390 -20439 -26538 -24109
6528 -24109 1947 6033 1003 -10362 -15674 -19470 -20226 -11476 -20874 -11770 9674 27329 18653 3076
6514 3076 6449 20996 23788 12656 9747 6515 8510 3554 5918 9106 11901 -10347 9756 22990
6500 22990 18099 24115 11273 789 6281 8558 -3458 -14848 -7872 -5264 3580 19284 19279 15004
$$ packed form
6600e903j124o604R230K390J1204R944r345k550P03M476j547J0633K78j6532j1682
6585f429l103J0256J2521k277l526N079R683k49k488k3038j0675J4577q314j4649
6571b2632m92O381k718J195j0235P886J7824P774O79j811r58J087o091q474j2799
6556b3384j8662J1039K5210J2076M547q707j0010n280k594J5660P538j415r747
6543c729L61P997o050k5758L116L303l228R269J9152m86n535j3802n049o099K429
6528b4109K6056M086n030j1365n312l796p56Q750r398R104K1444J7655q676j5577
6514C076L373J4547K792j1132k909l232J995m956K364L188K795k2248K0103J3234
6500B2990m891O016j2842j0484N492K277j2016j1390O976K608Q844J5704nm275
$$ plain form
6486 15004 -184 -4635 2315 -5590 -9662 -23895 -21576 -24850 -28059 -29996 -33456 -12870 1205 1768
6472 1768 10173 5507 385 -1539 -16754 -26405 -30913 -34424 -26756 -24938 -24952 -21661 -5538 7793 -10333
6457 -10333 -7100 10028 14424 -6064 -21923 -31949 -32242 -20506 -28910 -27547 -24010 -28339 -24417 -18546
6443 -18546 -598 -21908 -47026 -37355 -35812 -15812 -4595 1783 12679 16855 18203 9263 -23179
6430 -23179 -28875 -19347 10193 15094 14551 25437 18087 8488 156 2611 1145 -9886 -4026 8653
6416 8653 20575 17078 13556 3242 -10168 -16653 -7702 10154 10446 12896 9316 15918 28976 28561
6402 28561 16743 18953 21916 3305 8031 -3173 -14156 -1322 19058 12069 6797 4285 -2236
6389 -2236 6738 9641 18460 19265 11074 14018 11986 -17835 -31185 -17950 -12207 -4331 517 206 9111
$$ packed form
6486A5004j5188m451O950p905m072j4233K319l274l209j937l460K0586J4075N63
6472A768Q405m666n122j924j5215r651m508l511P668J818j4L291J6123J3331j8126
6457a0333L233J7128M396k0488j5859j0026k93J1736q404J363L537m329L922N871
6443a8546J7948k1310k5118R671J543K0000J1217O378J0896M176J348q940l2442
6430b3179n696R528K9540M901n43J0886p350r599q332K455j466j1031N860J2679
6416H653J1922l497l522j0314j3410o485Q951J7856K92K450l580O602J3058m15
6402B8561j1818K210K963j8611M726j1204j0983J2834K0380o989n272k512o521
6389b236Q974K903Q819Q05q191K944k032k9821j3350J3235N743P876M848l11Q905
$$ plain form
6374 9111 3171 -3158 -16480 -10966 8263 15329 8911 9790 -4726 -2367 -10546 -6717 -1128 3176
6360 3176 -18051 -22358 -31747 -35966 -41224 -19440 4867 2481 -3845 9380 13728 12464 -20020 -27698
6346 -27698 -28522 -3542 5582 -11354 -28529 -45581 -45467 -26648 -9571 -4813 549 -12280 -15920
6333 -15920 -15698 31 20102 20693 -3676 -18567 -3410 4494 -5221 -10050 -22582 -16615 -31304
6320 -31304 -14276 -13540 -32896 -25808 -32302 -37717 -36512 -23724 -35107 -38916 -12116 -3575 -5500 11408
6306 11408 20283 5494 -6517 -12584 2033 13098 5107 -11719 -2924 7372 9203 -1857 -12569
6293 -12569 -3835 5930 14660 5069 -20532 -30722 -30198 -19311 -2091 14058 8476 -5444 -19749
6280 -19749 -15935 -20704 -14546 -8223 -2398 6467 7646 -4422 7050 8282 15766 4816 -13036 -14628
$$ packed form
6374I111n940o329j3322N514J9229P066o418Q79j4516K359q179L829N589M304
6360C176k1227m307r389m219n258K1784K4307k386o326J3225M348j264l2484p678
6346b7698q24K4980R124j6936j7175j7052J14J8819J7077M758N362j2829l640
6333a5920K22J5729K0071N91k4369j4891J5157P904r715m829j2532N967j4689
6320c1304J7028P36j9356P088o494n415J205J2788j1383l809K6800Q541j925J6908
6306A1408Q875j4789j2011o067J4617J1065p991j6826Q795J0296J831j1060j0712
6293a2569Q734R765Q730r591k5601j0190N24J0887J7220J6149n582j3920j4305
6280a9749L814m769O158O323N825Q865J179j2068J1472J232P484j0950j7852j592
$$ plain form
6266 -14628 -11689 -475 -6706 -30818 -30779 -23341 -24505 -13730 -14076 -13752 -15519 -13875 -4621 -13109 7071
6251 7071 11106 20113 1455 -12668 -6944 8033 8518 -10602 662 5661 5421 6990 1428 4389
6237 4389 -1255 -17498 -26398 -32461 -43072 -46037 -11703 -1371 -6920 -24136 -21988 -8057 -5368
6224 -5368 17371 19424 -4827 -13118 -12462 -10246 3408 -6994 -3771 12199 3215 -1214 -8732 -12755
6210 -12755 -24858 -42879 -47765 -37737 -19186 -11042 -12324 -15894 8080 8917 -7726 682 2777
6197 2777 -185 -1352 3001 24482 7922 -3132 2443 8631 8619 12676 29390 33199 37953 23810
6183 23810 11160 4264 -1052 -16940 -18020 1359 -11613 -25657 -29772 -20062 8605 25526 7207
6170 7207 325 -10580 1153 11643 6080 2652 679 -1699 -842 113 -3565 192 -20693 -31899
$$ packed form
6266a4628K939J1214o231k4112L9P438j164J0775l46L24j767J644R254q488K0180
6251G071M035R007j8658j4123N724J4977M85j9120J1264M999k40J569n562K961
6237D389n644j6243q900o063j0611k965L4334J0332n549j7216K148J3931K689
6224e368K2739K053k4251q291O56K216J3654j0402L223J5970q984m429p518m023
6210a2755j2103j8021m886J0028J8551Q144j282l570K3974Q37j6643Q408K095
6197B777k962j167M353K1481j6560j1054N575O188j2M057J6714L809M754j4143
6183B3810j2650o896n316j5888j080J9379j2972j4044m115R710K8667J6921j8319
6170G207o882j0905J1733J0490n563l428j973k378Q57R55l678L757k0885j1206
$$ plain form
6156 -31899 -30485 -12499 -16818 -30993 -17834 3631 15361 6488 -1524 -17544 -33439 -16062 -9690
6143 -9690 -12690 -21604 -35708 -35100 -21742 -26416 -36164 -18545 1581 -7633 -15182 79 16649 36199
6129 36199 26925 29578 31694 40845 11093 -12301 -23101 -22816 -13569 -26823 -45579 -33598 -50381
6116 -50381 -56992 -47592 -46692 -48826 -33452 -30225 -16494 -6804 -3957 -3162 -8142 -9250 -969 -3491 -1359
6101 -1359 -7701 -8909 -9532 -410 -4084 794 13827 26012 26578 17297 24744 16945 -3419 -23003
6087 -23003 -12478 6745 15544 10634 18561 34278 22753 16760 -1143 -5463 -8070 -13122 -6794
6074 -6794 7657 3090 14245 14034 10686 -2180 3500 17974 21706 5420 -26998 -42946 -49756
6061 -49756 -45946 -27764 -6264 3964 1631 -13774 -27722 -26555 -32259 -30264 -21392 -20189 -7352
$$ packed form
6156c1899J414J7986m319j4175J3159K1465J1730q873q012j6020j5895J7377O372
6143i690l000q914j4104O08J3358m674r748J7619K0126r214p549J5261J6570J9550
6129C6199r274K653K116R151k9752k3394j0800K85R247j3254j8756J1981j6783
6116e0381o611R400R00k134J5374L227J3731R690K847P95m980j108Q281k522K132
6101a359o342j208o23R122l674M878J3033J2185N66r281P447p799k0364j9584
6087b3003J0525J9223Q799m910P927J5717j1525n993j7903m320k607n052O328
6074f794J4451m567J1155k11l348j2866N680J4474L732j6286l2418j5948o810
6061d9756L810J8182K1500J0228k333j5405j3948J167n704J995Q872J203J2837
$$ plain form
6048 -7352 5008 16064 19709 -7225 -23768 -7769 1996 6564 -24192 -50128 -34730 -13062 -20645
6035 -20645 -16280 -5484 -17579 -10439 -10664 -3818 11204 -3743 -20251 -13027 -5795 -25164 -36396
6022 -36396 -37759 -28318 -17599 -3011 6212 17027 9540 7042 -7298 -17470 -30661 -19730 -28845
6009 -28845 -17916 6413 29415 20919 9791 9985 2369 706 10814 -4637 -27910 -30882 -32872
5996 -32872 -32014 -42849 -38586 -27606 -22239 -6827 1752 -4251 -19541 -26773 -8483 -5681 -15243 -23115
5982 -23115 -30542 -34622 -17733 -10977 -1849 10509 10914 7110 7385 1893 -5955 -11244 -9476 -16767 -16604
5967 -16604 -15621 -15100 -14177 -34925 -49257 -38808 -20582 -7499 -18978 -6978 3408 -9753 -14446
5954 -14446 -13780 -14294 -15489 3062 11255 -12628 -13470 -19067 -9090 -2949 1938 6717 5915 -24368 -49289
$$ packed form
6048g352J2360J1056L645k6934j6543J5999R765M568l0756k5936J5398K1668p583
6035b0645M365J0796j2095P140k25O846J5022j4947j6508P224P232j9369j1232
6022c6396j363R441J0719J4588R223J0815p487k498j4340j0172j3191J0931r115
6009b8845J0929K4329K3002q496j1128J94p616j663J0108j5451k3273k972j990
5996c2872Q58j0835M263J0980N367J5412Q579o003j5290p232J8290K802r562p872
5982b3115p427m080J6889O756R128J2358M05l804K75n492p848n289J768p291J63
5967a6604R83N21R23k0748j4332J0449J8226J3083j1479J2000J0386j3161m693
5954a4446O66n14j195J8551Q193k3883q42n597R977O141M887M779q02l0283k4921
$$ plain form
5939 -49289 -41604 -15873 -10700 -10316 8605 6110 -11521 -15285 -7026 3682 5990 2291 -29788 -38082
5925 -38082 -26669 -22131 -11925 663 -13455 -22999 1047 18322 24578 8811 4311 482 14098
5912 14098 2924 -7325 -5769 -15638 -26022 -26928 -23263 -3858 815 -10928 -17750 -11154 -8067 -30133
5898 -30133 -31765 -19805 -23326 -17546 -12360 -17805 -17051 -7354 853 -11096 -12878 -23229 -19874 2861
5884 2861 8795 7965 -2429 221 -17768 -41627 -33651 -8335 9774 6677 7173 3821 19423 12538
5870 12538 -1145 5660 -12215 -17679 -15664 -24989 -25633 -6012 4843 -3692 -14015 -10165 -6198 -15020
5856 -15020 -32382 -35149 -19317 -10151 318 -4317 -12402 8138 7885 -7110 -5947 -8023 -4865 -2369
5842 -2369 -25570 -35080 -48974 -49930 -37359 -38944 -32705 -24008 -12442 -19069 -8320 6095 -3690 -10876
$$ packed form
5939d9289P685K5731N173L84J8921k495j7631l764Q259J0708K308l699l2079q294
5925c8082J1413M538J0206J2588j4118r544K4046J7275O256j5767m500l829J3616
5912A4098j1174j0249J556r869j0384r06L665J9405M673j1743o822O596L087k2066
5898c0133j632J1960l521N780N186n445P54R697Q207j1949j782j0351L355K2735
5884B861N934q30j0394K650j7989k3859P976K5316J8109l097M96l352J5602o885
5870A2538j3683O805j7875n464K015r325o44J9621J0855q535j0323L850L967q822
5856a5020j7362k767J5832R166J0469m635q085K0540k53j4995J163k076L158K496
5842b369k3201r510j3894r56J2571j585O239Q697J1566o627J0749J4415r785p186
$$ plain form
5828 -10876 -9929 -3302 11577 10727 3739 11788 19201 27781 36714 52100 45204 32684 39594 39821 30666
5813 30666 -10808 -26858 -5898 14832 26869 21900 12017 2084 -1772 -6214 23585 30092 13796
5800 13796 3470 12274 14110 10923 6012 15332 11935 -14510 -31197 -25260 -20650 -30398 -11485 3537
5786 3537 16449 16765 -2605 -14098 -13391 -10346 -13386 3470 32673 37606 18859 21138 12815 10078
5772 10078 -13586 -22186 -30768 -29658 -14315 11934 27389 27146 18103 8874 -10741 -10594 -15145 -12418
5758 -12418 -6552 -17512 -7944 -4479 -3127 -2365 4352 -4717 -13675 -25492 -10350 -18310 -27144 -35387
5744 -35387 -40755 -43803 -31287 -23307 -12704 -7687 -16971 -19470 -10784 -14925 -20 11454 -3994
5731 -3994 -27114 -22388 -8420 6061 14062 12962 8228 10949 7826 -55 -5919 -8489 10288 13648
$$ packed form
5828a0876R47O627J4879q50o988Q049P413Q580Q933J5386o896j2520O910K27r155
5813C0666m1474j6050K0960K0730J2037m969r883r933l856m442K9799O507j6296
5800A3796j0326Q804J836l187m911R320l397k6445j6687N937M610r748J8913J5022
5786C537J2912L16j9370j1493P07L045l040J6856K9203M933j8747K279q323k737
5772A0078k3664q600q582J110J5343K6249J5455k43r043r229j9615J47m551K727
5758a2418N866j0960R568L465J352P62O717r069q958j1817J5142p960q834q243
5744c5387n368l048J2516P980J0603N017r284k499Q686m141J4905J1474j5448
5731c994k3120M726J3968J4481Q001j100m734K721l123p881n864k570J8777L360
$$ plain form
5717 13648 119 -5887 7592 1662 2578 9148 797 -18085 -22382 -18821 -20827 -30165 -23893 -7968
5703 -7968 2724 4969 5680 -5095 -8281 -10378 -29990 -33602 -34452 -50864 -30976 -3431 -11988 -13376
5689 -13376 -1056 -2152 -1503 -6503 -5153 25173 37584 16807 -6618 -13548 -4344 -7909 -8177 2731
5675 2731 22353 21428 27603 54604 51817 19763 -8072 -32758 -38533 -34213 -13180 -9427 -10897 -32725
5661 -32725 -35109 -17084 197 -6361 -1712 14124 20277 40527 39953 17125 -5791 -14739 -1878
5648 -1878 10308 24159 10565 13588 -968 -1022 3069 2649 -1813 -6887 -19847 -19934 -16505 -4305 -6130
5633 -6130 -5461 -396 8297 12496 19218 18142 20528 12105 -8032 -5914 9708 14092 -6768 -29533
5619 -29533 -24897 -10011 -20095 -31746 -24684 -29316 -19019 -5231 -23826 -25796 -14528 -10781 -3252
$$ packed form
5717A3648j3529o006J3479n930R16O570q351j8882m297L561k006r338O272J5925
5703g968J0692K245P11j0775l186k097j9612l612q50j6412J9888K7545q557j388
5689a3376J2320j096O49n000J350L0326J2411k0777k3425o930R204l565k68J0908
5675B731J9622r25O175K7001k787l2054k7835k4686n775M320K1033L753j470k1828
5661c2725k384J8025J7281o558M649J5836O153K0250n74k2828k2916q948J2861
5648a878J2186J3851j3594L023j4556n4M091m20m462n074j2960q7L429J2200j825
5633f130O69N065Q693M199O722j076K386q423k0137K118J5622M384k0860k2765
5619b9533M636J4886j0084j1651P062m632J0297J3788j8595j970J1268L747P529
$$ plain form
5606 -3252 -5189 -4870 4862 2712 -976 -9931 -15567 -4883 -859 -7653 -24408 -15280 -15462 -17160 -22313
5591 -22313 -10815 1481 10649 8737 6317 6727 -3347 -16583 -25497 -26760 -17151 2508 20027
5578 20027 836 1664 299 -23228 -14747 2486 24515 31812 18024 2470 -12042 -39223 -40159
5565 -40159 -27610 -3663 -13484 -31240 -26294 -34953 -47341 -58579 -50631 -44658 -57025 -45575 -39093
5552 -39093 -12585 1236 -157 -6924 -33610 -16828 8469 19744 13069 -21263 -30964 -21626 -15892
5539 -15892 -7733 1749 19267 29691 20073 3799 2113 6165 -12403 -19307 -13881 -30214 -49237
5526 -49237 -44206 -42791 -21490 -1548 8958 6354 18117 32026 14705 -1658 -1057 -1429 10325
5513 10325 31515 25147 3433 537 810 852 -3341 13980 32451 5518 -4279 -9275 -15089 -26072
$$ packed form
5606c252j937L19R732k150l688q955n636J0684M024o794j6755R128j82j698n153
5591b2313J1498J2296R168j912k420M10j0074j3236q914j263R609J9659J7519
5578B0027j9191Q28j365k3527Q481J7233K2029P297j3788j5554j4512k7181r36
5565d0159J2549K3947r821j7756M946q659j2388j1238P948N973j2367J1450O482
5552c9093K6508J3821j393o767k6686J6782K5297J1275o675l4332r701R338N734
5539a5892Q159R482J7518J0424r618j6274j686M052j8568o904N426j6333j9023
5526d9237N031J415K1301J9942J0506k604J1763J3909j7321j6363O01l72J1754
5513A0325K1190o368k1714k896K73M2m193J7321J8471k6933r797m996n814j0983
$$ plain form
5499 -26072 -24745 -32557 -31414 -24737 -16959 -14735 3312 23550 10978 12082 23644 20155 13494 7003
5485 7003 -9866 -11432 -24551 -32074 -22184 -30073 -36465 -17432 2612 7073 -423 9106 8366 3115
5471 3115 -19795 -18304 493 -5692 -18750 -2615 -2541 -16445 -14947 -19472 -15909 -7716 -21117 -10772
5457 -10772 -2458 -7468 -19933 -4304 -13502 -9006 -3825 -8749 -14047 -25021 -11916 -2832 1203 -19455
5443 -19455 -38892 -36026 -26341 -13596 -3293 -7011 -10988 -5794 -15448 -31189 -28575 -26030 -33117 -35546
5429 -35546 -28297 -21658 -29983 -31570 -30170 -19928 -5342 -6680 -18683 -35936 -18300 -4847 10385
5416 10385 6957 901 11446 19192 11319 16757 16271 18394 10933 8207 -6912 -16494 -7063 -6656 -2981
5401 -2981 16977 4185 -19379 -16626 -14904 -10335 -1800 5495 -12283 -9666 16958 10502 816 -204
$$ packed form
5499b6072J327p812J143O677P778K224J8047K0238j2572J104J1562l489o661o491
5485G003j6869j566j3119p523R890p889o392J9033K0044M461p496R529p40n251
5471C115k2910J491J8797o185j3058J6135P4j3904J498m525L563Q193j3401J0345
5457a0772Q314n010j2465J5629r198M496N181m924n298j0974J3105R084M035k0658
5443a9455j9437K866R685J2745J0303l718l977N194r654j5741K614K545p087k429
5429c5546P249O639q325j587J400J0242J4586j338j2003j7253J7636J3453J5232
5416A0385l428o056J0545P746p873N438m86K123p461k726j5119r582R431M07L675
5401b981J9958j2792k3564K753J722M569Q535P295j7778K617K6624o456r686j020
$$ plain form
5387 -204 -3569 -19198 -24337 -18523 -3598 12152 -5168 -12481 -21533 -17098 -8227 -12072 -7086 -1427
5373 -1427 22474 16995 3284 -884 -18392 -25961 -23976 -9308 2066 -6088 -1804 1302 -15825
5360 -15825 -19877 -27592 -16275 -5162 -6318 -9895 -7011 -11865 -26846 -26409 -12099 -814 -1725 -9926
5346 -9926 -22187 -5297 8004 1166 -20400 -29038 -28604 -13302 -13952 -22672 -17436 -3584 11107 2810
5332 2810 -6848 -3317 20939 22838 18335 27066 28010 36044 29340 22141 14392 8595 20873 5397
5318 5397 1683 -4213 -11883 -16992 -31167 -30325 -13988 8590 17066 7480 -9440 -21133 -13141 -8556
5304 -8556 -29344 -19889 -7848 -4092 -13048 -17297 -3754 -613 -8413 -8986 -4195 651 2118 2412 2031
5289 2031 -15281 -16153 -24304 -29548 -37582 -37920 -30414 -28337 -24677 -8893 -8416 -2866 9538 14250 31053
$$ packed form
5387b04l365j5629n139N814J4925J5750j7320p313r052M435Q871l845M986N659
5373a427K3901n479j3711m168j7508p569J985J4668J1374q154M284L106j7127
5360a5825m052p715J1317J1113j156l577K884m854j4981M37J4310J1285r11q201
5346i926j2261J6890J3301o838k1566q638M34J5302o50q720N236J3852J4691q297
5332B810r658L531K4256J899m503Q731R44Q034o704p199p749n797J2278j5476
5318E397l714n896p670n109j4175Q42J6337K2578Q476r586j6920j1693P992M585
5304h556k0788R455J2041L756q956m249J3543L141p800n73M791M846J467K94l81
5289B031j7312q72q151n244q034l38P506K077L660J5784M77N550J2404M712J6803
$$ plain form
5274 31053 33768 3228 10481 19473 -1087 -7573 -4545 -7574 -8442 -11679 -8788 -15669 -31895 -21333
5260 -21333 -29366 -31533 -24180 -40097 -27169 -28563 -28037 -26096 -9311 -3573 -5545 -10237 -8558 -956
5246 -956 -15552 -21179 -12144 -2142 3602 2220 11127 7989 4894 450 -5329 14335 16846 3453
5232 3453 -13763 -11215 -20357 -26040 -27118 -20657 -20507 -4996 13725 9297 -3160 -14361 -11376 -27885
5218 -27885 -20318 5607 17520 35180 38425 34796 32624 17081 7690 -4210 -13166 -14392 -18232
5205 -18232 -18932 1867 -3348 -15264 -21826 -16770 3724 3074 -8619 319 11706 4989 -3392 -14876
$$ packed form
5274C1053K715l0540P253Q992k0560o486L028l029q68l237K891o881j6226J0562
5260b1333q033k167P353j5917J2928j394N26J941J6785N738j972m692J679P602
5246i56j4596n627R035J0002N744j382Q907l138l095m444n779J9664K511j3393
5232C453j7216K548r142n683j078O461J50J5511J8721m428j2457j1201K985j6509
5218b7885P567K5925J1913J7660L245l629k172j5543r391j1900q956j226l840
5205a8232p00K0799n215j1916o562N056K0494o50j1693Q938J1387o717q381j1484
$$ [...]
##END NTUPLES=NMR SPECTRUM
##END=
