##TITLE=Analysis number 311350
Compound Code tl 00400
Project Code adrs
Chemist Name fudan
##JCAMPDX= 6.0         $$ Bruker NMR JCAMP-DX V2.0
##DATA TYPE= NMR SPECTRUM
##DATA CLASS= NTUPLES
##ORIGIN= Bruker BioSpin GmbH
##OWNER= NMR
$$ XWIN-NMR		Version 3.5
$$ Wed Jul  6 14:05:43 2005 GMT Daylight Time (UT+1h)  MAYBRIDGE\NMR@NMR_250MHZ
##.OBSERVE FREQUENCY= 250.131544655141
##.OBSERVE NUCLEUS= ^1H
##.ACQUISITION MODE= SIMULTANEOUS (DQD)
##.ACQUISITION SCHEME= undefined
##.AVERAGES= 16
##.DIGITISER RES= 18
##SPECTROMETER/DATA SYSTEM= dpx250
##.PULSE SEQUENCE= zg30
##.SOLVENT NAME= DMSO
##.SHIFT REFERENCE= (INTERNAL, DMSO, 0, 16.522)
##AUDIT TRAIL= $$ (NUMBER, WHEN, WHO, WHERE, WHAT)
$$ ##TITLE= Audit trail, XWIN-NMR		Version 3.5
$$ ##JCAMPDX= 5.01
$$ ##ORIGIN= Bruker BioSpin GmbH
$$ ##OWNER= NMR
$$ C:\u/data/dgb/nmr/ADRS/5430/pdata/1/auditp.txt
$$ ##AUDIT TRAIL=  $$ (NUMBER, WHEN, WHO, WHERE, WHAT)
(   1,<2005-07-06 14:05:22.80 +100>,<MAYBRIDGE\NMR>,<NMR_250MHZ>,
      <created by zg, POWCHK disabled, PULCHK disabled
       configuration hash MD5:
       62 19 C7 07 E1 42 D1 B7 37 6C 3D D0 77 39 F9 E6
       data hash MD5: 64K
       8C 2A 29 C8 FC 73 22 28 10 89 48 F7 38 11 2C D8>)
(   2,<2005-07-06 14:05:33.99 +100>,<MAYBRIDGE\NMR>,<NMR_250MHZ>,
      <Start of raw data processing
       ef LB = 0.3 FT_mod = 6 PKNL = 1 SI = 32K 
       data hash MD5: 32K
       A7 CE 56 35 3F 88 52 E0 51 03 1D 23 52 8A AF EE>)
(   3,<2005-07-06 14:05:35.88 +100>,<MAYBRIDGE\NMR>,<NMR_250MHZ>,
      <apk 
       data hash MD5: 32K
       5F FE D1 F9 7D F0 A6 DA A2 A9 73 78 E9 A9 51 25>)
(   4,<2005-07-06 14:05:36.55 +100>,<MAYBRIDGE\NMR>,<NMR_250MHZ>,
      <abs ABSG = 5 
       data hash MD5: 32K
       2D 91 CE B0 F0 AF E1 83 BE 92 D4 9D F9 40 84 DD>)
$$ ##END=
$$ 
$$ hash MD5
$$ AB A3 1F C9 67 3F F0 36 E9 12 B4 90 4D 59 41 75
##$RELAX= 
##$RELAX= 
##$RELAX= 
##$RELAX= 
##$RELAX= 
##$RELAX= 
##$RELAX= 
$$ Bruker specific parameters
$$ --------------------------
##$DU= <C:\u>
##$EXPNO= 5430
##$NAME= <ADRS>
##$PROCNO= 1
##$TYPE= <nmr>
##$USER= <dgb>
##$AMP= (0..31)
100 100 100 100 100 100 100 100 100 100 100 100 100 100 100 100 100 100 
100 100 100 100 100 100 100 100 100 100 100 100 100 100 
##$AQSEQ= 0
##$AQ_mod= 3
##$AUNM= <au_zg>
##$AUTOPOS= <43 >
##$BF1= 250.13
##$BF2= 250.13
##$BF3= 250.13
##$BF4= 250.13
##$BF5= 500.13
##$BF6= 500.13
##$BF7= 500.13
##$BF8= 500.13
##$BYTORDA= 1
##$CFDGTYP= 0
##$CFRGTYP= 5
##$CHEMSTR= <none>
##$CNST= (0..31)
1 1 145 1 1 1 1 1 1 1 1 1 1 1 1 1 1 1 1 1 1 1 1 1 1 1 1 1 1 1 1 1 
##$CPDPRG= <>
##$CPDPRG1= <>
##$CPDPRG2= <>
##$CPDPRG3= <>
##$CPDPRG4= <mlev>
##$CPDPRG5= <mlev>
##$CPDPRG6= <mlev>
##$CPDPRG7= <mlev>
##$CPDPRG8= <mlev>
##$CPDPRGB= <>
##$CPDPRGT= <>
##$D= (0..31)
0 1 0 0 0 0 0 0 0 0.06 0 0 0 0 0 0 0.0002 0 0 0 0 0 0 0 0 0 0 0 0 0 0 
0 
##$DATE= 1120655121
##$DBL= (0..7)
120 120 120 120 120 120 120 120 
##$DBP= (0..7)
150 150 150 150 150 150 150 150 
##$DBP07= 0
##$DBPNAM0= <>
##$DBPNAM1= <>
##$DBPNAM2= <>
##$DBPNAM3= <>
$$ [...]
##$SUBNAM7= <"">
##$SUBNAM8= <"">
##$SUBNAM9= <"">
##$SW= 20.6930455092707
##$SWIBOX= (0..15)
0 0 3 0 0 0 0 0 0 0 0 0 0 0 0 0 
##$SW_h= 5175.983436853
##$TD= 65536
##$TD0= 1
##$TE= 295.16
##$TE2= 300
##$TE3= 300
##$TEG= 300
##$TL= (0..7)
0 120 120 120 120 120 120 120 
##$TP= (0..7)
150 150 150 150 150 150 150 150 
##$TP07= 0
##$TPNAME0= <>
##$TPNAME1= <>
##$TPNAME2= <>
##$TPNAME3= <>
##$TPNAME4= <>
##$TPNAME5= <>
##$TPNAME6= <>
##$TPNAME7= <>
##$TPOAL= (0..7)
0.5 0.5 0.5 0.5 0.5 0.5 0.5 0.5 
##$TPOFFS= (0..7)
0 0 0 0 0 0 0 0 
##$TUNHIN= 0
##$TUNHOUT= 0
##$TUNXOUT= 0
##$USERA1= <user>
##$USERA2= <user>
##$USERA3= <user>
##$USERA4= <user>
##$USERA5= <user>
##$V9= 5
##$VALIST= <valist>
##$VCLIST= <CCCCCCCCCCCCCCC>
##$VD= 0
##$VDLIST= <DDDDDDDDDDDDDDD>
##$VPLIST= <PPPPPPPPPPPPPPP>
##$VTLIST= <TTTTTTTTTTTTTTT>
##$WBST= 1024
##$WBSW= 4
##$XGAIN= (0..3)
0 0 0 0 
##$XL= 0
##$YL= 0
##$YMAX_a= 223766
##$YMIN_a= -244205
##$ZGOPTNS= <>
##$ZL1= 120
##$ZL2= 120
##$ZL3= 120
##$ZL4= 120
##$ABSF1= 16.522
##$ABSF2= -4.171173
##$ABSG= 5
##$ABSL= 3
##$ALPHA= 0
##$AQORDER= 0
##$ASSFAC= 0
##$ASSFACI= 0
##$ASSFACX= 0
##$ASSWID= 0
##$AUNMP= <proc_1d>
##$AZFE= 0.1
##$AZFW= 0.1
##$BCFW= 0
##$BC_mod= 0
##$BYTORDP= 0
##$COROFFS= 0
##$CY= 12.5
##$DATMOD= 1
##$DC= 0
##$DFILT= <>
##$DTYPP= 0
##$F1P= 14.0000005364418
##$F2P= -0.99999901652339
##$FCOR= 0.5
##$FTSIZE= 32768
##$FT_mod= 6
##$GAMMA= 0
##$GB= 0
##$INTBC= 1
##$INTSCL= 1
##$ISEN= 128
##$LB= 0.3
##$LEV0= 0
##$LPBIN= 0
##$MAXI= 10000
##$MC2= 0
##$MEAN= 0
##$ME_mod= 0
##$MI= 0
##$NCOEF= 0
##$NC_proc= -5
##$NLEV= 6
##$NOISF1= 0
##$NOISF2= 0
##$NSP= 0
##$NTH_PI= 0
##$NZP= 0
##$OFFSET= 16.522
##$PC= 1
##$PHC0= -82.76958
##$PHC1= 10.2802
##$PH_mod= 1
##$PKNL= yes
##$PPARMOD= 0
##$PSCAL= 4
##$PSIGN= 0
##$REVERSE= no
##$SF= 250.13
##$SI= 32768
##$SIGF1= 0
##$SIGF2= 0
##$SINO= 400
##$SIOLD= 32768
##$SREGLST= <1H.DMSO>
##$SSB= 0
##$STSI= 32768
##$STSR= 0
##$SW_p= 5175.98343685301
##$SYMM= 0
##$S_DEV= 0
##$TDeff= 65536
##$TDoff= 0
##$TI= <Analysis number 999999
Compound Code 99
Book Reference 9
Project Code 9>
##$TILT= no
##$TM1= 0
##$TM2= 0
##$TOPLEV= 0
##$USERP1= <user>
##$USERP2= <user>
##$USERP3= <user>
##$USERP4= <user>
##$USERP5= <user>
##$WDW= 1
##$XDIM= 32768
##$YMAX_p= 323450639
##$YMIN_p= -1089825
$$ End of Bruker specific parameters
$$ ---------------------------------
##NTUPLES= NMR SPECTRUM
##VAR_NAME=  FREQUENCY,     SPECTRUM/REAL,   SPECTRUM/IMAG
##SYMBOL=    X,             R,               I
##VAR_TYPE=  INDEPENDENT,   DEPENDENT,       DEPENDENT
##VAR_FORM=  AFFN,          ASDF,            ASDF
##VAR_DIM=   32768,         32768,           32768
##UNITS=     HZ,            ARBITRARY UNITS, ARBITRARY UNITS
##FACTOR=    0.157963299565203, 1,           1
##FIRST=     4132.6476996994, 0,             0
##LAST=      -1043.33573715361, 0,           0
##MIN=       -1043.33573715361, -1089825,    0
##MAX=       4132.6476996994, 323450639,     0
$$ Real data points
##PAGE= N=1
##DATA TABLE= (X++(R..R)), XYDATA
$$ [...]
25193G82035k41939j49030M4315r7938m1045p0964O8832K57654O5k461j62018
25182C87506O559Q7827j02169j15015M7209J31807k5567k10982k27925K20201
25172A99451J12363R6300K35864J98855J02932m22164j60920k4140Q6058j7466
25162D07133J25131J6293l24093j16631R1502O5381J61812M453J39646l2788k1511
25151E16328n9221j31489N772N261m7247J5310j23819j20548M16044K06230l79363
25140C03258j1645L18893j39152r7421M3897J7110j58941L03669J51595R9834
25130H31097J19375l03788j38743J18647p861J74377j60775k59949r5817l5679
25120B40884m8254J32461R6753k89954K96091M78686J60213n25744m01169k09746
$$ plain form
25193 782035 540096 391066 435381 337443 296398 225434 294266 551920 551985 549524 387506
25182 387506 394065 481892 379723 264708 311917 443724 418157 207175 -20750 199451
25172 199451 311814 408114 643978 842833 945765 523601 362681 338541 424599 407133
25162 407133 532264 548557 224464 107833 199335 264716 426528 430981 570627 537839 516328
25151 516328 457107 325618 331390 336651 289404 304714 180895 60347 476391 682621 303258
25140 303258 291613 610506 471354 373933 417830 434940 275999 579668 731263 831097
25130 831097 950472 646684 507941 626588 618727 793104 632329 372380 276563 240884
25120 240884 192630 325091 421844 131890 427981 906667 1066880 541136 139967 -69779
25110f9779p3784J87581L81409r3l53763k3951L37462J8865J13782k2396j91874
25099C03459j16542j5502N1617n0633m3208k10372r0064J97480J39515k3486Q8504
25088B30768J08552q2025K2477K8277l9848P5156j03297o52J5037m8683K40583
25077D46345r3218K31984J00575n6340J65498l00220K49818L02020j21309l88353
25067E36800j86318J21469o0586j25379J38255p4615j44618m0611n4001L41219
25057D51615L20492m4247j1378p977j80156j61809J36478J90525j34442j1533
25047E47568l9897J78702M9270j23109k92992J78023K22493L9653m4605l5727
25037F79379P5123j90986j58137j17508M02740j855k84801k89957N3240K6246
$$ plain form
25110 -69779 -143563 44018 425427 425334 71571 47620 385082 403947 517729 495333 303459
25099 303459 186917 171415 223032 172399 129191 -81181 -171245 26235 165750 142264 230768
25088 230768 339320 257295 279772 308049 268201 343357 240060 239408 254445 205762 446345
25077 446345 353127 585111 685686 629346 794844 494624 744442 1046462 925153 536800
25067 536800 350482 471951 411365 285986 424241 349626 205008 164397 110396 451615
25057 451615 772107 727860 716482 708505 528349 366540 503018 693543 559101 547568
25047 547568 507671 686373 735643 612534 319542 497565 720058 759711 715106 679379
25037 679379 754502 563516 405379 287871 690611 688756 403955 113998 167238 193484
25027A93484J16608K8964j17293j83721O456j44133K9349K09990l1380q347j56171
25016e6194M5781k9762k8356k1686L87801J18719j30808j67575q7883j49946k7882
25005a47791J624j18524k93575K24051K38675n0784N4281J51422M4443j75210
24995g1388j04673L70043L22865J23372j0108k51832k90136j70376j89658j33605
24985d05496J24833k2743L9436j09655q7669R2019L09745K47473J48659J62747
24975D99349j03455r621o9142J09177r5775l5197j5705j7285o8327p4576O3984
24964A83427J23705j40941j84693J60174j33j97599L1724n0914n7856J83442M869
24953E5205J83130M8239j45889j5778j13525J2597J69634j91905j43750J03898
$$ plain form
25027 193484 310092 339056 221763 38042 44498 -99635 -70286 139704 108324 99977 -56194
25016 -56194 -10413 -40175 -68531 -90217 297584 416303 285495 117920 30037 -119909 -147791
25005 -147791 -146167 -264691 -558266 -334215 -95540 -146324 -92043 59379 103822 -71388
24995 -71388 -176061 193982 516847 640219 630111 378279 88143 -82233 -271891 -405496
24985 -405496 -280663 -303406 -263970 -373625 -461294 -369275 -59530 187943 336602 499349
24975 499349 395894 386273 317131 426308 330533 295336 279631 262346 194019 119443 183427
24964 183427 307132 166191 -18502 141672 141539 -56060 -24336 -75250 -133106 50336 55205
24953 55205 238335 286574 140685 124907 11382 23979 193613 1708 -142042 -38144
24943c8144Q8913r2062o3170j2542q7589o8648J37553Q2427Q6977j41732J44827
24932C6810J01303j53676l84913J73729J64896N5563L11732J56122m86707j47619
24922a72760l2579L9228J50919J4579n5665P6288J14042j8245J22348J12543J52871
24911E03569l15221m54965k44312O5866K06390j8431J01646j31603r474J08988
24901a87547J22472R5565j38710J10837J76606M2235J349K14361j73019J14684
24891C78833K6940k86514K5996J26140L32516r5959n7604n4480j95522m3662K04176
24880C60860K28397J04689J10195r1876k37670j25476j26758l34334k57078L46071
24870b2980j8672K17348o0683l74225j20709K69930M0639k85017k13830R16J36148
$$ plain form
24943 -38144 50769 -41293 -104463 -117005 -204594 -273242 -135689 -53262 33715 -108017 36810
24932 36810 138113 -15563 -400476 -226747 -61851 -6288 305444 461566 -25141 -172760
24922 -172760 -205339 -166111 -15192 -613 -56278 20010 134052 115807 238155 350698 503569
24911 503569 188348 -266617 -510929 -445063 -238673 -257104 -155458 -287061 -296535 -187547
24901 -187547 -65075 30490 -108220 2617 179223 221458 222807 437168 264149 378833
24891 378833 405773 119259 145255 271395 603911 507952 450348 395868 200346 156684 360860
24880 360860 589257 693946 804141 712265 474595 349119 222361 -111973 -369051 -22980
24870 -22980 -41652 175696 115013 -259212 -379921 -109991 -69352 -354369 -568199 -567283 -431135
24859d31135l7713K50149L96819l6570k45015r4185J99571K20852p3914j60606
24849a1747R3304N2252j30846J48462K88456k19255k01108k32862j17550K26578
24839a04316J34994P281l6308o3753Q1354J64297J05308K11347o13k53286r6762
24828A49543K9350K68086O0034k38673j12326j29193M8220k0538m0207K07852
24818B22148p895j17623l6028r257j03466K6067n4377k7587K7537J2781K73397
24807B05697K25909p8874l26371M0435K33453j52001l00102j13558J70537J5992
24797g8883k2915j63329l7212K18690m192J08940L741m02146M730J56555M5051
24786a70970M0085Q5625J88133j03505j41633K66965n457J6037n7206p8811l12129
$$ plain form
24859 -431135 -468848 -218699 178120 141550 -103465 -197650 1921 222773 148859 -11747
24849 -11747 81557 133809 2963 151425 439881 220626 19518 -213344 -330894 -104316
24839 -104316 30678 37959 1651 -62102 19252 183549 288857 500204 499591 246305 149543
24828 149543 178893 446979 507013 268340 156014 26821 75041 54503 14296 222148
24818 222148 214253 96630 60602 51345 -52121 -26054 -80431 -108018 -80481 -67700 205697
24807 205697 431606 352732 26361 66796 300249 148248 -151854 -265412 -94875 -78883
24797 -78883 -101798 -265127 -302339 -83649 -87841 21099 24840 -377306 -372576 -216021 -170970
24786 -170970 -130885 -45260 142873 39368 -102265 164700 159243 175280 118074 39263 -272866
24775b72866j63687K25591K13525r8942L21698o3351o8674l8557o1416j85832
24765a92511J52636R9059R2584K11800k78332j25172J72727m387j94088K544j1454
24754g4594J96498K11506j65170l14743k21450j08831J86494J09811J30185J97142
24744A46848K71500J45552n09034l82954j49505l1545J20667L27713k1091j01103
24734a82952j5326J47798J53318j48512l1054K9922M8019L67559O8306j97745
24724B39333P8542m8159j47395j1480R0305J07267N541q9935l129j40186k6629
24713E4075J63981J5490j51715k2729Q3062o3734N975q1882Q4911L0681N0774
24702A68889l4615j99555n3354j63158k65312P1857L67953K26073J55311p3949
$$ plain form
24775 -272866 -436553 -210962 2563 -96379 225319 161968 93294 54737 -6679 -192511
24765 -192511 -39875 59184 151768 363568 85236 -39936 132791 128404 -65684 -63140 -74594
24754 -74594 121904 333410 168240 -146503 -367953 -476784 -290290 -180479 -50294 146848
24744 146848 418348 563900 54866 -328088 -477593 -509138 -388471 -60758 -81849 -182952
24734 -182952 -198278 -50480 102838 -45674 -76728 -46806 1213 368772 437078 239333
24724 239333 317875 269716 122321 110841 201146 308413 313954 224019 220890 80704 54075
24713 54075 218056 233546 81831 59102 142164 78430 84405 2523 87434 118115 168889
24702 168889 134274 -65281 -118635 -281793 -547105 -475248 -107295 118778 274089 200140
24692B00140m9814n7968q3697J44457k26901k18648l0802J60669K04108J99416
24682B40960J1668P8627Q9804k86706k69133k02895R973q964l3463N6959J10855
24671b02315m3488K41874Q0682K6693K5555M6425r861L4768J5859j18236J13449
24660B11405N2032j64387k27780r2351q3718J6903l2456J20383k04258j27875
24650e32102j27148L16423J96941q3488N404j14942J55863J88152k1605k19996
24640b36498o2097j8090L29281J53707n0713j21534j672r6587K12581j7054l3711
24629E7613J53859p3407J29556J8776j5753j2251J73449K11686j61513j17169
24619C64846j89813j32091R5837L87023J04402j09048m45045J66024m8740l7416
$$ plain form
24692 200140 150326 92358 8661 153118 -73783 -292431 -323233 -162564 41544 240960
24682 240960 252628 331255 421059 134353 -134780 -337675 -327702 -336666 -370129 -313170 -202315
24671 -202315 -245803 -3929 76753 103446 129001 175426 165565 200333 216192 97956 211405
24660 211405 263437 99050 -128730 -221081 -304799 -287896 -320352 -199969 -404227 -532102
24650 -532102 -659250 -342827 -145886 -229374 -223970 -338912 -183049 5103 -16502 -236498
24640 -236498 -298595 -316685 12596 166303 115590 -5944 -7616 -104203 108378 91324 57613
24629 57613 211472 138065 267621 286397 270644 258393 431842 643528 482015 364846
24619 364846 175033 42942 138779 525802 630204 521156 76111 242135 193395 155979
24609A55979j52914j85587J30460Q4964j23990r0195j19212k10891K3280K10035
24599b78071K00020j987n2127j65689q8682n3049o5982K10837K59864L08434m498
24588B69070P6218j80185l62745J13185J5319n2939j27644J27237k3308j70248
24578c16040j13194l9869N3370j01901l11631N9793K69322j72484j06866R7447
24568f82053L20104K03519j95545j6921p9634j66312j2619K30053J91653n9325
24558b67080N9147J11617L0386J46950n9164l6837J28784P6254k32967k05720
24548b48630k2354J36267J84438j98120k86084K0657j11138j27777K9337M11709
24538b11695M18780K00011o9488o3384P6321k02155j21789N7430O4244j94196
$$ plain form
24609 155979 3065 -182522 -52062 32902 -91088 -181283 -300495 -511386 -488106 -278071
24599 -278071 -78051 -80038 -132165 -297854 -386536 -439585 -505567 -294730 -34866 273568 269070
24588 269070 345288 165103 -197642 -84457 -69138 -122077 -249721 -122484 -145792 -316040
24578 -316040 -429234 -469103 -415733 -517634 -829265 -769472 -500150 -672634 -779500 -682053
24568 -682053 -361949 -158430 -353975 -370896 -450530 -616842 -629461 -399408 -207755 -267080
24558 -267080 -207933 -96316 -65930 81020 21856 -14981 113803 190057 -42910 -248630
24548 -248630 -270984 -134717 49721 -148399 -434483 -413826 -524964 -652741 -623404 -211695
24538 -211695 207085 407096 337608 274224 350545 148390 26601 84031 148275 -45921
24528d5921j51354J54555O8778q2966n6494J43782p165j97421k0440J20375J38181
24517F3910K23533L3257j45372N8452k6761k1929j4252l73682L11018J96021k16392
24506H7803j20256J12608k48112p950K29522k41838J91874J46533j75538j60011
24496a85365M5834m1026J25505j55339m5102Q1530J55066K40187j90139k82980
24486b51829j578K44855J70213k16888m4824K13386J03700k49341l46983j39287
24476e18576K28775J22637p1285q1953L4813q4309l0620J00619J47904N1710Q1948
24465a8337J30837k71479o9322L1143M7509K37845J13077k85854J98911L92153
24455E06483j10826k81499O6540n3284j64760R681P0356K19961q3164n9306j64460
$$ plain form
24528 -45921 -197275 -42720 26058 -56908 -113402 30380 23215 -174206 -194646 -74271 63910
24517 63910 287443 320700 175328 233780 207019 185090 170838 -202844 108174 304195 87803
24506 87803 -32453 80155 -167957 -175907 53615 -188223 3651 150184 -25354 -185365
24496 -185365 -139531 -180557 -55052 -210391 -255493 -173963 -18897 221290 31151 -251829
24486 -251829 -253407 -8552 161661 -55227 -100051 113335 217035 -32306 -379289 -518576
24476 -518576 -289801 -167164 -238449 -320402 -285589 -369898 -400518 -299899 -151995 -100285 -18337
24465 -18337 112500 -158979 -228301 -197158 -149649 88196 201273 -84581 114330 506483
24455 506483 395657 114158 180698 127414 -37346 -27665 42691 262652 179488 120182 -44278
24444d4278K27738K01924j19256k22684m1746Q426J748j85256k47553O1913k4064
24433c83088L7508J9651M7344j79827P1156P8466J94797J14461m1827o0642J67577
24422F5576J65065j20876j26137k73502K13720K19417k38609k27509J41446K68880
24412H7471N7845j5969j25505R0282n6492j06900p9380o1830j49264K12132L46620
24401A99010K43297q7590k2205l00755k93013q8740P8018L0794J07213j3322J36157
24390a1136K18625j8193M0873n5906J4694r2906M1353J03973j24497k10508n6680
24379a50308M0107J63077J65936J79644K57201P7811j50190l29884k57492j16775
24369a20873O1758J20063P5079J19117o5952k24621R0138J03621J20681M8507
$$ plain form
24444 -44278 183460 385384 266128 43444 1698 10124 11872 -173384 -420937 -359024 -383088
24433 -383088 -345580 -325929 -278585 -458412 -387256 -308790 -113993 468 -41359 -102001 65576
24422 65576 230641 109765 -16372 -289874 -76154 143263 -95346 -322855 -181409 87471
24412 87471 145316 129347 3842 94124 37632 -69268 -148648 -210478 -359742 -147610 199010
24401 199010 442307 354717 332512 31757 -261256 -349996 -271978 -241184 -133971 -147293 -11136
24390 -11136 207489 189296 230169 174263 188957 96051 137404 241377 116880 -93628 -150308
24379 -150308 -110201 52876 218812 398456 655657 733468 583278 253394 -4098 -120873
24369 -120873 -59115 60948 136027 255144 189192 -35429 54709 158330 279011 327518
24359C27518J47918o9827k28797j90115k26251K5171J67982p8031l7752K34954
24349G2770K28702o8411m4730M1009j353q9925k16430l5610r5190j23575N450
24338c27293Q5606K57800o8237N8190O5925q0216l23608j91179l4308J81056M88203
24327A11939Q4015k56132k19565J62170K72609N5207l4201N0502j23490J99230
24317C02284k3588J64162p2433l6207l62590l55706K42080J99370K67578M5113
24307C70063p0469j64210m69923l33318J85654K33146K20265q7860n7755k3017
24297a97424K49622N6785j82483r0330K6040K34907N4992N1298O627l6131J9463
24286A93366j48735N0807m5299j33751J13448K7694m5156j98631J43038j04149
$$ plain form
24359 327518 475436 405609 176812 -13303 -239554 -214383 -46401 -124432 -162184 72770
24349 72770 301472 233061 188331 229340 227987 138062 -78368 -113978 -209168 -332743 -327293
24338 -327293 -241687 16113 -52124 6066 71991 -8225 -331833 -523012 -557320 -376264 111939
24327 111939 195954 -60178 -279743 -117573 155036 210243 176042 226544 103054 302284
24317 302284 278696 442858 370425 334218 -28372 -384078 -141998 57372 324950 370063
24307 370063 299594 135384 -334539 -667857 -482203 -249057 -28792 -116652 -174407 -197424
24297 -197424 52198 108983 -73500 -163830 -137790 97117 152109 203407 210034 173903 193366
24286 193366 44631 95438 50139 -83612 29836 57530 12374 -186257 -43219 -147368
24276a47368j35267l2690K66886L50964O1098k83030J22309J68107j41913p1903
24266A57193o3258p6430n9764j29255q9507M41221J68413l21885k660O645k18244
24255a87531j02616J29649K63021O3852M1693j30025j7614K15230M1855l6901
24245B80613M7672o5275l57896k54440J34885o3158J57472J62395m7491J23290
24235A18067k5688j38804j23921L8348J16559o8747R4469R6842O4727j9200n8281
24224I4371j63346j79394J1327l1449J22424J84145j05379L7365P8729K85555
24214C34348q157n552Q0259p3789m21235M303J27145j16283M7715j37299N5387
24203a13158j3998k08410J92983j2037K57450J05018k32878Q2864o2678j86299
$$ plain form
24276 -147368 -282635 -315325 -48439 302525 363623 80593 202902 371009 229096 157193
24266 157193 93935 17505 -42259 -171514 -261021 180200 348613 26728 24068 30713 -187531
24255 -187531 -290147 -160498 102523 166375 208068 78043 60429 275659 317514 280613
24245 280613 328285 263010 -94886 -349326 -214441 -277599 -120127 42268 -5223 118067
24235 118067 92379 -46425 -170346 -131998 -15439 -84186 10283 107125 171852 152652 94371
24224 94371 -68975 -248369 -237042 -268491 -146067 38078 -67301 -29936 48793 334348
24214 334348 326191 320639 400898 327109 -94126 -89823 37322 -78961 -31246 -168545 -113158
24203 -113158 -127156 -335566 -142583 -154620 102830 207848 -25030 57834 -4844 -191143
24193a91143K9428L34515r8925r1889k5896j87571j47565K61266q5119K53711
24183E0812K16124j35557j77666k80257r034J12788J00147J18829J5202J05547
24173A16935j328j6590j88005p1805k30741J23156M0535O7302K81713j01086j03736
24162h3650P074j69817o2697P1329K25155K25510K39335k7436j62450n1794Q8646
24151B99205K86607l0221r8618l43159j52984m9307J41950m54606k42070J84066
24141d59137J69936K3085j60889M2767Q025j8514O6294o5187M7677Q8947j45599
24130d02595O9836Q1957l95460p9747K98879M3059N7765N0368L11855k42933J6024
24119a90992J42872M43M5007J04390J02728n2087l089k23077o2102q521k2031
$$ plain form
24193 -191143 -161715 172800 73875 -18014 -43910 -231481 -379046 -117780 -202899 50812
24183 50812 266936 131379 -46287 -326544 -335578 -222790 -122643 -3814 11388 116935
24173 116935 115607 99017 -88988 -160793 -391534 -268378 -227843 -160541 121172 20086 -83650
24162 -83650 -76576 -246393 -309090 -237761 -12606 212904 452239 424803 262353 210559 299205
24151 299205 585812 555591 456973 113814 -39170 -88477 53473 -401133 -643203 -459137
24141 -459137 -289201 -266116 -427005 -384238 -376213 -394727 -328433 -393620 -345943 -256996 -402595
24130 -402595 -332759 -250802 -646262 -726009 -427130 -384071 -326306 -275938 35917 -207016 -190992
24119 -190992 -48120 -47677 -2670 101720 204448 152361 149272 -73805 -135907 -144428 -166459
24108a66459l9071j31652J46599K5290N1529K50321K40060j66763k932j35610
24098G1312k87929j21076L99826M93853m8260l61014m60520j31651K14767m7565
24088b78257L36483R2982l2635j00818k88832j59336R8952m6119K62965K16817
24078A02202j45576j93980N9538j42366J10927K37415j48201k78601l50610O4701
24068f84551J96238L7934K57672O2976Q5571L6313J13318k43483j03492P7955
24058a63549p834N6658K9318k44530j33638O3680J72259M87933J17455l6781K3857
24047C64828N7446J71036j87873l37930p7482L4667K38191N9673p5949K51782
24037D98389j45337k39118J03317K11800m5930M8266k10366l60532J81647J54477
$$ plain form
24108 -166459 -205530 -337182 -190583 -165293 -113764 136557 376617 209854 206922 71312
24098 71312 -216617 -337693 62133 555986 507726 146712 -313808 -445459 -230692 -278257
24088 -278257 58226 151208 118573 17755 -271077 -430413 -331461 -377580 -114615 102202
24078 102202 -43374 -237354 -177816 -320182 -209255 28160 -120041 -398642 -749252 -684551
24068 -684551 -488313 -450379 -192707 -129731 -44160 -7847 105471 -138012 -241504 -163549
24058 -163549 -171383 -114725 -85407 -329937 -463575 -399895 -227636 260297 377752 340971 364828
24047 364828 422274 593310 405437 67507 -9975 24692 262883 322556 246607 498389
24037 498389 353052 113934 217251 429051 383121 431387 221021 -139511 42136 196613
24027A96613Q9031n01991k74601L76239R3844j142K60074j49295r0296o3791P2542
24016G227q099K68163J34394q6083l33295R8056J20879j02717j17335m6024o120
24005g0954R4517J58974l76252l22100J21804J39357K01406j29283k15734k9351
23995d27616l8924l9762k09046J1340K15718L52308Q8257j88315M330r9249J03085
23984b27874J19197J9126J49261r5791J01083p3936j16838l38655j86933j2165
23974f63525K79710P9111J38285L30985P1829M1907l02214q9297j17748j1748
23964b42705K17642M5167Q7694J93539q7631k20517n769J4652J89743J11351j51301
23953A51865k30581r4283J62023J63823O2380j65462o9547J52730n47530l61172
$$ plain form
24027 196613 285644 -216347 -490948 -114709 -20865 -22007 238067 88772 -1524 -65315 7227
24016 7227 -872 267291 401685 315602 -17693 80363 201242 98525 -18810 -64834 -70954
24005 -70954 23563 182537 -193715 -515815 -394011 -254654 -53248 -182531 -398265 -427616
23995 -427616 -466540 -506302 -715348 -704008 -488290 -135982 -47725 -236040 -231710 -330959 -227874
23984 -227874 -108677 -89551 59710 -36081 65002 -8934 -125772 -464427 -651360 -663525
23974 -663525 -383815 -304704 -166419 164566 236395 278302 -23912 -113209 -230957 -242705
23964 -242705 -25063 20104 107798 301337 213706 -6811 -12580 2072 191815 303166 151865
23953 151865 -78716 -172999 -10976 152847 215227 49765 -19782 132948 -414582 -775754
23943g75754J7388N380j58311K34821K41055Q6316L486Q7195j05765n5722K44921
23932a74990L73435K5768j52420k08275j41048q9743J56452K1148N8364M029k6302
23921a53582j08083J25453r4990p7975J15248k3391o7693j89597J33263J8265
23911c23082K04754J69985j38906j99892j23166L9610J03871J24081j72351j24908
23901d40004J70548P3645o9717N2891M2422N1947O9968J08512j71351j90576J96080
23890a05635O2002j45153o6700J03574j14541J04804J64190J17930J82052l18390
23880a5867n3677J75961J74276j3682K2989j59567j52247l86480K7460J54782
23870b26052O0894M8573R4038K50311o4828k88266J33949J5637k44294K09583
$$ plain form
23943 -775754 -758366 -752986 -911297 -676476 -435421 -349105 -345619 -258424 -364189 -419911 -174990
23932 -174990 198445 224213 71793 -136482 -277530 -367273 -210821 -189673 -131309 -127280 -153582
23921 -153582 -261665 -136212 -231202 -309177 -193929 -217320 -285013 -474610 -341347 -323082
23911 -323082 -118328 51657 -87249 -287141 -410307 -370697 -266826 -142745 -315096 -440004
23901 -440004 -269456 -195811 -265528 -212637 -170215 -118268 -48300 60212 -111139 -301715 -105635
23890 -105635 -43633 -188786 -255486 -151912 -266453 -161649 2541 120471 302523 -15867
23880 -15867 -69544 106417 280693 267011 290000 130433 -21814 -408294 -380834 -226052
23870 -226052 -165158 -116585 -22547 227764 162936 -125330 8619 24256 -220038 -10455
23860a0455K50807Q4550k52858N3362k2421J69396J57173j29193j10351j54851
23850C5159k54728j03321L59638J12844n5601J13426l3282J08084l3871j21269
23840A27079M0030j69144j10183Q4753k7524j78311P1154L02610J94460j11434
23830B23490j66818J19505M162l52538j48306J56597K60603j95329Q6133K0381
23820G880j81688j09998j41057O7425K07817J16408O5443J10721j39261o3315
23810e9625j10988l28167Q7314J47981L23447L43332J83741l19006j50068R1614
23800B09575N0202j97869R943K67306J30742l01855J0140j65388j65317o2207
23790b14728N7803J07220J76827p4477k06419j74693j38243m0135J60523O0644
$$ plain form
23860 -10455 240352 324902 72044 125406 102985 272381 429554 300361 190010 35159
23850 35159 -219569 -322890 36748 149592 93991 207417 174135 282219 248348 127079
23840 127079 167109 -2035 -112218 -27465 -54989 -233300 -162146 140464 334924 223490
23830 223490 56672 176177 180339 -172199 -320505 -163908 96695 -98634 -12501 7880
23820 7880 -173808 -283806 -424863 -357438 -149621 -33213 32230 142951 3690 -59625
23810 -59625 -170613 -498780 -411466 -263485 59962 403294 587035 268029 117961 209575
23800 209575 259777 61908 71851 339157 469899 168044 178184 12796 -152521 -214728
23790 -214728 -156925 -49705 127122 52645 -153774 -328467 -466710 -506845 -346322 -285678
23780b85678P9111J88653M3599j02922K70973K51606k20462k81592k50693L7134
23770b70271L36807K28699m3310j38323j69982l753M9030Q4950j68204l95482
23760d89839r4262M59199J4731l8545R3328k00555o2261J29791K26789K50874
23750B89250o3491L8758p4758k96709J00140n5561m5502J76117k08863k85174
23740d25793J6024K80470m9678j44802K03903R1308J20232n679j17314j22250
23730a53579J54599Q7128J48466J59881p2497p1909j1823P9826J2468j09599k29781
23719f820j65638j31105k26591l3750k03552j0508L00241R1620J47543J4331r7170
23708c21399P0795L6173K96237Q0629l29231Q3954J47892K18114L4343j33075
$$ plain form
23780 -285678 -206567 -17914 25685 -77237 193736 445342 224880 -56712 -307405 -270271
23770 -270271 66536 295235 251925 113602 -56380 -60133 -11103 73847 -94357 -489839
23760 -489839 -584101 -124902 -110171 -148716 -55388 -255943 -318204 -188413 38376 289250
23750 289250 225759 264517 189759 -106950 -6810 -62371 -107873 68244 -140619 -425793
23740 -425793 -409769 -129299 -178977 -323779 -119876 -28568 91664 85985 -31329 -153579
23730 -153579 1020 88148 236614 396495 323998 252089 240266 320092 332560 222961 -6820
23719 -6820 -172458 -303563 -530154 -563904 -767456 -777964 -477723 -386103 -238560 -224229 -321399
23708 -321399 -250604 -214431 81806 162435 -166796 -82842 65050 283164 317507 184432
23698A84432m9544k52058m5313L7639m5721r3994K52775l2176l30495p8272J14558
23687c38169J37197J49571J72527j45534n8816J0340K62635m6706l5116J71803
23677B79732J6759r4605j18626r5136J65385l74214O8423J03165P0171r2156Q5667
23666A4565J18169j0146k4771j89470m7105K00265J66569J0963j40774l44390
23656b46125j97056m9189R3249l8219K71811K74137k9972k5860K10265J52966
23646D16007k14685m07769m2357l3186Q8151J07285N515j02100j12302J05464
23636a89977J22695J5416J64158j09693k92377j56578j9179K74519J07537r2531
23626a76010J30862L5090j75838J71677J82571O9788J50688k1722l25090k1180
$$ plain form
23698 184432 134888 -117170 -162483 -124844 -170565 -264559 -11784 -43960 -374455 -452727 -338169
23687 -338169 -200972 -51401 121126 -24408 -83224 -72884 189751 143045 107929 279732
23677 279732 296491 201886 83260 -11876 153509 -220705 -152282 -49117 21054 -71102 14565
23666 14565 132734 122588 97817 -91653 -138758 61507 228076 239039 98265 -246125
23656 -246125 -443181 -492370 -399121 -437340 -165529 108608 78636 52776 263041 416007
23646 416007 201322 -206447 -248804 -281990 -193839 -86554 -81039 -183139 -295441 -189977
23636 -189977 -67282 -51866 112292 2599 -289778 -446356 -465535 -191016 -83479 -176010
23626 -176010 -45148 -10058 -185896 -14219 168352 238140 388828 367106 42016 20836
23616B0836J65621J30985k33066j66652j34499O7721M879J68567L9082K2373k58582
23605a72735k26742J6604K10893J66754J89812O0977p9485J67049o337n1452j68758
23594A06580j8241j21128k1302J35214O1077n4866q5737J36624R2899N5951q9417
23583A97654j09655j46857M1244J17004j93604J50745N3403M0665j65533k27174
23573b42108J23991N0648o8110J75350m697l4259k5007j5016K23439J1946m28057
23562b31880O8408J0058J54568p3580j88531j85800m6499j66921R6002J16685
23552d47490j1739M0308p0404O2891K6728n942J06728k8451k83016j18636j28705
23541h57728o754J99135K55413K88031K62280J69943j97720l4259o968k48235
$$ plain form
23616 20836 186457 317442 84376 -82276 -216775 -149054 -144175 24392 63474 85847 -172735
23605 -172735 -399477 -382873 -171980 -5226 184586 245563 166078 333127 326790 275338 106580
23594 106580 88339 -32789 -54091 81123 142200 87334 1597 138221 231120 287071 197654
23583 197654 87999 -58858 -17614 99390 -94214 56531 109934 150599 -14934 -242108
23573 -242108 -118117 -67469 -135579 39771 35074 815 -24192 -39208 184231 196177 -231880
23562 -231880 -163472 -153414 1154 -72426 -260957 -446757 -493256 -660177 -564175 -447490
23552 -447490 -459229 -418921 -489325 -426434 -399706 -405648 -298920 -327371 -610387 -729023 -857728
23541 -857728 -864482 -665347 -409934 -121903 140377 310320 112600 78341 71373 -176862
23531a76862J7706J30419j35364J07336K05140M8562k8720M3694r4503j38617
23521b1209k1619M99065K10858k08923m13676k38862j95898k2049L56627J5517
23511d0169K100R8750R970K21930q8292k8320r6000k42271L5112k8292j19104
23500b74586j7907J30591M08391J72985n4130k11412k26499l7371j19841J72314
23490e7465K68932j06729j83561j48088J13507J80160k54156o4778K54437k4243
23480b1984k3896R0404J29557L6423J00663j10203O1257k36915k10257n197J15303
23469g4845o8744j17112n4002k0087J09050J79870K35219J05181Q2599j39534
23459B37595j82882n4033k29189j35655L60218M97088j23132k46846J946O1645
$$ plain form
23531 -176862 -159156 -28737 -164101 -56765 148375 196937 168217 211911 117408 -21209
23521 -21209 -42828 456237 667095 458172 44496 -194366 -390264 -412313 -55686 -40169
23511 -40169 -38069 60681 70651 292581 204289 175969 79969 -162302 -127190 -155482 -274586
23500 -274586 -292493 -161902 246489 419474 365344 153932 -72567 -109938 -229779 -57465
23490 -57465 211467 104738 -78823 -226911 -113404 66756 -187400 -252178 2259 -21984
23480 -21984 -45880 44524 174081 210504 311167 200964 262221 25306 -184951 -190148 -74845
23469 -74845 -143589 -260701 -314703 -334790 -225740 -45870 189349 294530 377129 237595
23459 237595 54713 680 -228509 -364164 -3946 493142 370010 123164 125110 186755
23449A86755k58505l52218m2268J21918K34244K80630j602j15590j79295j93536
23439c19467j32621r4609J53007k0491J47652J69356J53242M48155j2362j79554
23429C12308m5430k33976j75970P0331j9839k9960j69045m5662J05406L44071
23419A12234M9969J32363j96860m09352O0983J86298k16116p832L3654j7343k20939
23408d92941n2979m6761J46446R0503k3698n2271J91M14700R1660o3234P136J91254
23396B10006L6840q922j061j30481N1676q4311j29811K57513o4753j25100j19571
23385a07975k9649j4401J37522j2471m13924J04507L02323l504K03495J50313
23375C16236L5825k13899J24158L7323l0621j9186j99352q561P6208J5593j67639
$$ plain form
23449 186755 -71750 -423968 -466236 -344318 -110074 170556 168954 53364 -125931 -319467
23439 -319467 -452088 -546697 -393690 -414181 -266529 -97173 56069 504224 491862 312308
23429 312308 266878 32902 -143068 -72737 -92576 -122536 -291581 -337243 -231837 112234
23419 112234 162203 294566 97706 -311646 -250663 -64365 -280481 -288313 -254659 -272002 -492941
23408 -492941 -545920 -592681 -446235 -355732 -379430 -431701 -431510 -16810 74850 11616 18752 210006
23396 210006 246846 237924 236863 106382 158058 73747 -56064 201449 136696 11596 -107975
23385 -107975 -137624 -152025 -14503 -26974 -440898 -336391 -34068 -37572 165923 316236
23375 316236 352061 138162 262320 299643 269022 249836 50484 41923 118131 133724 -33915
23364c3915J21778j69516l3655J77477k31627n2508p1262k9124J21492N5774j58320
23353c03406n4376R0142O7445J13856M3515K47949J3692O8988j72515m0661L46644
23342D21273M1885k73265l63738R6217K58558L1367j05638k78285l35608m4439
23332e51673o1527J47447J44761l18755j25L44986J5788R457J97269j79261J47934
23321a03699K00143O4695Q6275J11484j63623p1126R5668q2436j12477j8120j08568
23310a01784q3913j48345j00093K00794L35180K18051p6313j92020J16955j616
23300A66896n7844Q7801r3854q1998m7419j18253j72393K0369K36643l7972J99734
23289A01710j24383l47580L46724p4972r3436J76364o9341p4813J56859J75654
$$ plain form
23364 -33915 87863 -81653 -115308 62169 -169458 -221966 -293228 -322352 -200860 -145086 -303406
23353 -303406 -357782 -267640 -200195 -86339 -42824 205125 218817 287805 115290 74629 421273
23342 421273 463158 189893 -173845 -77628 180930 212297 106659 -171626 -507234 -551673
23332 -551673 -613200 -465753 -320992 -639747 -639872 -294886 -279098 -269641 -72372 -251633 -103699
23321 -103699 96444 161139 247414 358898 195275 124149 219817 137381 24904 6784 -101784
23310 -101784 -185697 -334042 -434135 -233341 101839 319890 243577 51557 168512 166896
23300 166896 109052 196853 102999 21001 -26418 -144671 -317064 -296695 -60052 -98024 101710
23289 101710 -22673 -370253 -23529 -98501 -191937 -15573 -84914 -159727 -2868 172786
23279A72786j85839k13394l1007j1572L5393J56813J17441j13653P0968J6536
23269A4472p7668J41820J35738j72033j92699J40000K03901j15980j43383R9119
23259C3287R8111K06691j42598l06482k4711O1858O8284k01078J3118P4385J5245
23248a03890J26708p1983l2093j24201P2383K53783k89584k12019N5011J85656
23238a40229J25304J75098P8311m4470l0885K12917k5215k9701j96095k08450
23228h3415L59950J44473j11370j14242J1425j47630j97259n1159m964j14377
23218c08568J18095m56r6668N0126M18008J89738J94118r5594j35365j33042r5906
23207A04486J0019J60429M6798J33979j21902j47227N297j10234k46010k1224
$$ plain form
23279 172786 -13053 -226447 -257454 -269026 -233633 -76820 40621 -73032 -2064 14472
23269 14472 -63196 78624 214362 42329 -150370 -10370 193531 77551 -65832 33287
23259 33287 131398 338089 195491 -110991 -135702 -73844 -5560 -206638 -193520 -119135 -103890
23248 -103890 22818 -49165 -81258 -205459 -133076 120707 -168877 -380896 -325885 -140229
23238 -140229 -14925 160173 238484 194014 163129 376046 350831 321130 125035 -83415
23228 -83415 276535 421008 309638 195396 206821 59191 -138068 -189227 -194191 -308568
23218 -308568 -190473 -190929 -287597 -237471 180537 370275 564393 468799 333434 200392 104486
23207 104486 114505 274934 321732 455711 333809 186582 191879 81645 -164365 -185589
23197a85589j64289l9185O8362M1158M3460j52446j48618O6725J31599Q2652j04263
23186c60434K48681J67519o673J8861j1890j24051j62893p2610k3924J14021O5171
23175a48222k55973j29012j16505J39866M21286J03895J5394j83721p2323O9893
23165a55422L03724J7543k24453k54005L2419L05681K4383k9094r5751J12413
23155C7438L082m4738l9324m7416K16026r7173j5J58803K4753j85781M0289Q5542
23143A51486O8047J07074j3666j30897L3092p9564p5084p159n6323Q4004p6566
23132D444j03124j46533m1712P6970K8064K09276M5110k38265l0122R1221J92718
23121H8047J98713k45921k07026K11883j57625j61242n1993q1232J99029Q0661
$$ plain form
23197 -185589 -349878 -389063 -320701 -279543 -236083 -388529 -537147 -470422 -338823 -256171 -360434
23186 -360434 -111753 55766 49093 67954 56064 -67987 -230880 -303490 -327414 -213393 -148222
23175 -148222 -404195 -533207 -649712 -509846 -88560 15335 30729 -152992 -225315 -155422
23165 -155422 148302 165845 -58608 -312613 -280194 25487 49870 20776 -74975 37438
23155 37438 40520 -4218 -43542 -90958 125068 27895 27880 186683 211436 25655 65944 151486
23143 151486 219533 326607 312941 182044 215136 135572 60488 53329 -2994 81010 4444
23132 4444 -98680 -245213 -286925 -209955 -181891 27385 72495 -165770 -195892 -104671 88047
23121 88047 286760 40839 -166187 45696 -111929 -273171 -325164 -406396 -207367 -126706
23111a26706J3201q6201J00289p6002K5954k16682r7624L25545J74987j01385
23101f4624k13054p1715j6571J54100r2321k13283L7961N2972K38834J94910J35313
23090A42522J7061m5605k93870q0738K63368J46970j54356q8017J54627r7547
23080c5585N4224r1548j38599k27005J9161J54019j4964J55159j5330j3440M4271
23069a09637k74886O5061K93588j0328j2447K47545J23223j18604K9951j02974
23059A30492L5674m8173k51184o2321k48718J06660K01593r545J64643M6203n8445
23048F879N6766o2402L1197k50725k89997J19414K28974J29585j92469j29889
23038c52667r8520K65697K32645J50681J63380m6783k32145k87762l46054j10118
$$ plain form
23111 -126706 -113505 -199706 -99417 -175419 -149465 -366147 -463771 -138226 36761 -64624
23101 -64624 -277678 -349393 -365964 -211864 -304185 -517468 -479507 -426535 -187701 7209 142522
23090 142522 159583 113978 -179892 -260630 2738 149708 -4648 -92665 61962 -35585
23080 -35585 18639 -72909 -211508 -438513 -419352 -265333 -280297 -125138 -140468 -153908 -109637
23069 -109637 -384523 -319462 -25874 -36202 -48649 198896 322119 203515 233466 130492
23059 130492 166166 117993 -133191 -195512 -444230 -337570 -135977 -145522 19121 65324 6879
23048 6879 63645 1243 32440 -218285 -508282 -388868 -159894 -30309 -222778 -352667
23038 -352667 -451187 -185490 47155 197836 361216 314433 82288 -205474 -551528 -661646
23028f61646m8082M2880L13843L0424J44955J39607K48480L5912l76457J00919
23018b9165J55296q4411j35973r0718M6504p8551k03206J25604N6336K41996N7542
23007F1254j81172k56046J092O796P309M4697K35642J63259q911J72621K94085
22996E40626j01846m12524k52912l0757K28410L49588r1468j58956k76245k0095
22986b26179m6064O481J13574R8232O7506K09025K9419o1732p2145r0457j47033
22975a19373O2349K37019l3963l33282j15706J69840J17284J88208N0737k01409
22965B1704k08948k25517J80440K58826J16441k51183J22074O3778q4284P5153
22955F8484m466R6171p294j05866q2715k4012j07891J44248J35881j40755P5278
$$ plain form
23028 -661646 -709728 -666848 -353005 -322581 -177626 -38019 210461 246373 -130084 -29165
23018 -29165 126131 41720 -94253 -184971 -138467 -217018 -420224 -294620 -238284 3712 61254
23007 61254 -119918 -375964 -374872 -368076 -360767 -316070 -80428 82831 73920 246541 540626
22996 540626 438780 26256 -226656 -257413 -29003 320585 229117 70161 -206084 -226179
22986 -226179 -272243 -265762 -152188 -53956 13550 222575 251994 190262 118117 27660 -119373
22975 -119373 -57024 179995 146032 -187250 -302956 -133116 -15832 172376 223113 21704
22965 21704 -187244 -412761 -232321 26505 142946 -108237 13837 77615 -6669 68484
22955 68484 64018 160189 152895 47029 -35686 -59698 -167589 -23341 112540 -28215 47063
22944D7063j08527J8805m6610q0081K50916O061P4598k3037j52368k44726K11947
22933d5959J23300J39501K3016k67743k81421J24705j23029L257L2543o8412K06495
22922a33747k1537O3096o7375J79448J0422P888k74596k25779J14790j44697j38331
22911f30418j3379J75525J15213j65185K78345K02827j00426J06433n7863J03820
22901A4892K28535j67666j40073J90317j27951j84672J4384j86289Q9403r167
22891b78287J55396L9122r8106J15494J26277j9699J47817p4431m01518K0379
22881b67556L97253J26888Q4648N4353o6454k3371m9209k22578n18876j25684
22871f10586L62525J03937Q804J82239K34168M1179k25049j61522j74777J18543
$$ plain form
22944 47063 -61464 -42659 -89269 -169350 81566 87627 162225 139188 -13180 -257906 -45959
22933 -45959 77341 216842 239858 -27885 -309306 -184601 -307630 -304373 -271830 -340242 -133747
22922 -133747 -155284 -92188 -159563 19885 30307 38195 -236401 -462180 -347390 -492087 -630418
22911 -630418 -643797 -468272 -353059 -518244 -239899 -37072 -137498 -31065 -88928 14892
22901 14892 243427 75761 -64312 126005 -1946 -186618 -172234 -358523 -269120 -278287
22891 -278287 -122891 -83769 -181875 -66381 59896 40197 188014 113583 -287935 -267556
22881 -267556 129697 256585 341233 395586 329132 305761 256552 33974 -484902 -610586
22871 -610586 -248061 -144124 -135320 46919 281087 322266 97217 -64305 -239082 -120539
22861a20539M5346n1238p5382k83503K29565J37716K107J14834m9118k85484J28420
22850b07276K5348k08315L8517J96035J88928l41981J8647J1020J71307k42164
22840c49934j56338J16240O8673J60898K67112o7508l8685j54693p6316K41146
22830A0595K10880K9359l27462j96174O0345K7084J49522J70819P3837j14429
22820I4376j10354k3784O9091J90483o6072l30296k13155L8051Q8965M4580J45901
22809g2214L8736j92959R2574M9895q5030q3345P2707q9738p0135j10899n0570
22798e00978K25427J95895J74092m8698k46233j4488J58979Q4252K13229k53371
22788a1894k24165K8690o7992L606j6355J56931J19603l6426J30334o2291q4242
$$ plain form
22861 -120539 -75193 -126431 -201813 -485316 -255751 -118035 -115928 -1094 -50212 -335696 -207276
22850 -207276 -181928 -390243 -351726 -155691 33237 -308744 -290097 -279077 -107770 -349934
22840 -349934 -506272 -390032 -321359 -160461 106651 39143 458 -154235 -230551 10595
22830 10595 221475 250834 -76628 -272802 -212457 -185373 -35851 134968 208805 94376
22820 94376 -15978 -39762 29329 219812 153740 -176556 -389711 -351660 -262695 -218115 -72214
22809 -72214 -33478 -226437 -133863 -83968 -168998 -252343 -179636 -269374 -339509 -450408 -500978
22798 -500978 -275551 -79656 94436 45738 -200495 -214983 -56004 28248 241477 -11894
22788 -11894 -236059 -207369 -275361 -271755 -288110 -131179 -11576 -48002 82332 20041 -64201
22777f4201k28782r720j2664j08245R4105Q1955J37746J90485J9153R3214O1787
22766B54833k8860k59299r7335L10524R9521j26836j60528k83725r601L6088K73167
22755G949J26625J00048k52351K39356J39744j68857j95923J3100j10199N4876
22745d5632L90078R606k19525l5153K47375m1343j07573K6222k51730l10321L3989
22734c04007l9833J82096L47141N545l28259m8296J1794J52066q3932K9792q5744
22723a61637j44510K72576Q3675k9226q110j08479k32103R2180q7095J2322q7093
22712c97500J52853k45224k27468J49733J62914k13050J28233K59508q0032j15380
22702d25413l732J72259L15016k3874J4709K52612j77102k69734O9396M2288L1942
$$ plain form
22777 -64201 -292983 -302703 -315367 -423612 -329507 -247552 -109806 80679 99832 193046 254833
22766 254833 225973 -33326 -130661 179863 279384 152548 -7980 -291705 -301306 -265218 7949
22755 7949 134574 234622 -17729 221627 361371 192514 -3409 9691 -100508 -45632
22745 -45632 344446 354052 134527 99374 346749 305406 197833 224055 -27675 -337996 -304007
22734 -304007 -343840 -161744 185397 190942 -137317 -185613 -173819 -21753 -105685 -75893 -161637
22723 -161637 -306147 -33571 50104 20878 12768 -95711 -327814 -235634 -322729 -310407 -397500
22712 -397500 -244647 -489871 -717339 -567606 -404692 -617742 -489509 -230001 -310033 -425413
22702 -425413 -429145 -256886 58130 34256 48965 301577 124475 -145259 -75863 -33575 -1633
22691a633P4194l7236K549j98919O0567J65382p2561l59132k61702j48350J15887
22680f60954O89128L29857q6434j50816k70526j85964l5884q4264P055l4738J08409
22669c75131L34092J11480k0104K30042J83235J5616K9901O1175k6338l48850
22659A95118l68122k10957O7255N0388k0420j54179k36614j16390K03935K3294
22649e66692L4939J79379J08635j32925L365l0261n52r9149J08268O8823K22481
22638a03689J53134q2146O0602L92713L24830j28907k51850k20670k54147q1277
22628a91407J9847L6029O3994m9160J50074Q4322R5309L9992n32103j78429J65474
22617b96058L15250M1111k29719k59880J35034K64455j36989R3033K47486Q1775
$$ plain form
22691 -1633 72561 35325 37874 -161045 -100478 64904 -7657 -366789 -628491 -776841 -660954
22680 -660954 28174 358031 271597 120781 -149745 -335709 -371593 -455857 -448802 -483540 -375131
22669 -375131 -41039 70441 50337 280379 463614 479230 509131 570306 543968 195118
22659 195118 -173004 -383961 -316706 -266318 -286738 -440917 -677531 -793921 -589986 -566692
22649 -566692 -531753 -352374 -243739 -376664 -373299 -403560 -404112 -503261 -394993 -326170 -103689
22638 -103689 49445 -32701 27901 420614 745444 616537 364687 144017 -110130 -191407
22628 -191407 -171560 -135531 -71537 -120697 29377 113699 209008 249000 -283103 -461532 -296058
22617 -296058 19192 60303 -169416 -429296 -294262 -29807 -166796 -73763 173723 255498
22607B55498o9973l07116k18018J10007m3078L1466k3554J85945K53019j09107
22597F5089l8768j13661j01289l6339O2995K76209J34340r9169J45688l1789l71457
22586a08151n0712m4602J84231P0214m6042r2698k45564k15155J75517p5434J57091
22575b91305J21731K30694J24577k24287j81160J1755p8445M1611N8222j8968
22565b05575J29688O1773L32352O4630j56280k33675j36711K99654K10189J0968
22555C77013n0231K9482J60543j00323k99535L6881P6922k20211l36203o4077
22545c89739N2576n9248j06210K4193J18319M8420J1805K97854K60769j85658
22535G3081l60195k73056J86618J15380k68828q0211R8399j7882O3693K64921
$$ plain form
22607 255498 185525 -121591 -339609 -229602 -272680 -241214 -264768 -78823 174196 65089
22597 65089 26321 -87340 -188629 -224968 -161973 114236 248576 149407 295095 263306 -108151
22586 -108151 -158863 -203465 -19234 50980 4938 -87760 -333324 -548479 -372962 -448396 -291305
22575 -291305 -169574 61120 185697 -38590 -219750 -207995 -286440 -244829 -186607 -205575
22565 -205575 -75887 -14114 318238 382868 226588 -7087 -143798 155856 366045 377013
22555 377013 326782 356264 516807 416484 116949 153830 230752 10541 -325662 -389739
22545 -389739 -337163 -396411 -502621 -478428 -360109 -311689 -299884 -2030 258739 73081
22535 73081 -287114 -560170 -373552 -258172 -527000 -607211 -508812 -526694 -463001 -198080
22525a98080K08513M0505k95258j6102K8246j16084J41860Q5058o5735j42054
22515c29131J1015J48900j3062l37891P2059Q8289K4478j67608k41247j9284J14981
22504f48501J75889J57663k0284J19927M1104k12043n9703L29048J93557J68023
22494B44680J8514m51010o1497J90986r1333j41598P3456m0675J8273L9070R8525
22483a02609J80896J8194J87461j32303k10361n242Q795L89448N0230j81195m43385
22472b40071j77242K38454K37209K2478K20227J54230m66321j09667K06743O939
22462I2979N5068l6264k92108k31649K66214L59016L6071j09307j51907m1526
22452e3413k5660j1388L50948L6724l0982m48128r3823K82131N2562k62882n7937
$$ plain form
22525 -198080 10433 50938 -244320 -260422 -232176 -348260 -206400 -121342 -187077 -329131
22515 -329131 -318116 -169216 -182278 -520169 -448110 -359821 -335343 -502951 -744198 -763482 -648501
22504 -648501 -472612 -314949 -335233 -215306 -174202 -386245 -445948 -116900 76657 244680
22494 244680 263194 -187816 -249313 -58327 -149660 -291258 -217802 -258477 -240204 -201134 -102609
22483 -102609 78287 96481 283942 151639 -58722 -63964 -55169 334279 384509 203314 -240071
22472 -240071 -417313 -178859 58350 80828 301055 455285 -11036 -120703 86040 92979
22462 92979 148047 111783 -180325 -411974 -145760 213256 249327 140020 -11887 -53413
22452 -53413 -79073 -90461 260487 297211 266229 -181899 -275722 6409 58971 -203911 -261848
22441b61848P1803K20610K2157j37789K30400j25016q7882J95341M9628j67370
22431A0034j77116K0396P7417J95784k0307n1092K7642m0344m9480p2963J41084
22420F1055p0881j72616K26697K12405O8219j00565j42810m0280o7468q2073j02947
22409b11264Q5297J43818q9882j39116j16453J96778K17999P1140O2009Q8744
22399C09070K11654p0537r5454J8886J4383q5848k10973j9891k31568k4509M0913
22388a43874j57830o8018J75725R3884j94248Q7649J70311k07620l90667r4537
22378g29225M61536L92889j18912P4970N5815R2492l57797J46241J22492j82323
22368d1822l36102K55603M46747p9306q8313J04576K16727l9723l16175j68446
$$ plain form
22441 -261848 -190045 30565 52722 -85067 145333 20317 -67565 127776 177404 10034
22431 10034 -167082 -146686 -69269 126515 106208 55116 82758 42414 -7066 -80029 61055
22420 61055 -9826 -182442 44255 256660 324879 224314 81504 41224 -26244 -108317 -211264
22409 -211264 -125967 17851 -72031 -211147 -327600 -130822 87177 158317 220326 309070
22399 309070 520724 450187 354733 373619 388002 302154 91181 71290 -160278 -184787 -143874
22388 -143874 -301704 -369722 -193997 -100113 -294361 -206712 -36401 -244021 -634688 -729225
22378 -729225 -267689 125200 6288 81258 137073 229565 -128232 18009 140501 -41822
22368 -41822 -377924 -122321 324426 245120 156807 261383 478110 438387 122212 -46234
22358d6234k82330j63825J88339N5702O4233K7000n0731n2033Q5674K68263L5898
22347A29956p1624J20178j7977K0544K5260l49981l60492L60490J19883J24552
22337A00789J57450j48929J78364O0724j9345K6461k44159n1704P1939q2044m4184
22326E362r8807j27844j4594K0231L21707J58822J9403K4032j57410m48703j04706
22315d02507J16271P6186j68442L0880L40486K0196j20900o1917n8841J5831P6790
22304a35967J03808J24383j64383j6672j64368j13856J34263K54057j62504m856
22294a46095j3078k95169O2854j5256k2168O1794K39296J51107j98689N379k1422
22283a91447J62694R5534j15101k02785J492R8468p8205K12866P1241j8018p9147
$$ plain form
22358 -46234 -328564 -492389 -304050 -248348 -184115 -157115 -207846 -259879 -174205 94058 129956
22347 129956 58332 178510 160533 181077 206337 -143644 -504136 -143646 -23763 100789
22337 100789 258239 109310 287674 348398 329053 355514 111355 59651 131590 49546 5362
22326 5362 -93445 -221289 -235883 -215652 106055 264877 284280 308312 150902 -297801 -402507
22315 -402507 -286236 -210050 -378492 -347612 -7126 13070 -107830 -169747 -228588 -212757 -135967
22304 -135967 -32159 92224 -72159 -88831 -253199 -367055 -232792 21265 -141239 -146095
22294 -146095 -159173 -454342 -391488 -406744 -428912 -367118 -127822 23285 -175404 -170025 -191447
22283 -191447 -28753 66781 -48320 -251105 -249613 -151145 -229350 -16484 54757 36739 -42408
22272d2408N0656k24770j50427J40334j4910K2396J9511J37871N6786l6775j94649
22261b36385k9472N1562k0464J48573J14116M4455M973O8288Q2913o8469q3041
22250G7049j27208q4913r825J41726j30548j97767k55792J41137N633J0433J10959
22239c19116o5520L42865J24562j01831M3474P6988k76941m7318J11943j22581
22229b33475k6378p1444J06776J37636J77589n7825J0727M200M0454m910j63443
22218h0093j3605K01126P39p0402R2221k07763k67275o7476M6780J53620L98372
22207A86244J94402j38828k29672K27565J26279j54317j96365l54471j9200K44921
22197a13442K62865k76739j80627J88977N177j4129j51804l2907N5551j97073
$$ plain form
22272 -42408 8248 -216522 -366949 -226615 -241525 -219129 -199618 -61747 -4961 -41736 -236385
22261 -236385 -265857 -214295 -234759 -86186 27930 72385 77358 145646 228559 160090 77049
22250 77049 -50159 -135072 -144897 -3171 -133719 -331486 -587278 -446141 -440508 -430075 -319116
22239 -319116 -384636 -41771 82791 -19040 24434 101422 -175519 -222837 -110894 -233475
22229 -233475 -259853 -331297 -224521 -86885 90704 32879 43606 47806 88260 83350 -80093
22218 -80093 -93698 107428 108167 37765 129986 -77777 -345052 -412528 -365748 -212128 186244
22207 186244 380646 241818 12146 239711 365990 211673 15308 -339163 -358363 -113442
22197 -113442 149423 -127316 -307943 -118966 -113789 -127918 -279722 -312629 -257078 -454151
22187d54151j3804K24566K17997k1099M0629N8216k17836R0457J07077l3152M11733
22176D10633L87349l15133j62015j75904n7192P214J55814j33162j74206k1341
22166g7943K13729Q4080j08267J33926l017r9315q3857j6225L1343l823k83256
22155b12625j69161o5059J58738K52062J17414K47394J47065k05986o8438j71572
22145B9832k06713k09455k07371J83110P9584m3076J991J56485J1620j09100Q5103
22134b27990P7633p311M5901m7141J09321R9813k91552M8177J76702m0523p1388
22123a28358K04666j76596l19168J48324J49771K34429J32642K06442M6703j32146
22113C66709J9608q7153j14233J95757j08048k80741J29969m5396j27781K5590
$$ plain form
22187 -454151 -467955 -243389 -25392 -46491 -5862 52354 -165482 -75025 32052 -1100 410633
22176 410633 797982 482849 320834 144930 87738 94952 250766 117604 -56602 -77943
22166 -77943 135786 219866 111599 245525 242508 143193 59336 43111 74454 70631 -212625
22155 -212625 -381786 -446845 -288107 -36045 81369 328763 475828 269842 201404 29832
22145 29832 -176881 -386336 -593707 -410597 -331013 -374089 -372098 -215613 -203993 -313093 -227990
22134 -227990 -150357 -157668 -111767 -158908 -49587 50226 -241326 -193149 -16447 -56970 -128358
22123 -128358 76308 -100288 -419456 -271132 -121361 113068 245710 452152 498855 366709
22113 366709 386317 299164 184931 380688 272640 -8101 121868 76472 -51309 -25719
22103b5719r0417J90938M7888j13152Q0598j57617l41993j68224J82121M5254
22093c50323m8513j12845K90848K42257r1787p1829J74193j29619l7301O6312
22083f8607J77041M2743J21911r1679j93733j91146k32102o3637P3834o1551M9350
22072d37576J46266j1225P5496K72205J5889j80788j08881j183K2482o9219L16111
22061C9577J06868J16556l36316l01782J15642K6424n268J47488J26810p5892
22051c9893K30315K97725j27447k19888p0145j85821R2999J70202j17028j11321
22041h0302r5530o6543K4647J53372L213l32059m1176L11485J2656J4967J38218
22030D2948o8471Q151J00151m3313L8053p5716M4533K3030J24299J90681l74915
$$ plain form
22103 -25719 -116136 74802 122690 9538 90136 -67481 -409474 -577698 -395577 -350323
22093 -350323 -398836 -511681 -220833 21424 -70363 -142192 32001 -97618 -134919 -68607
22083 -68607 108434 151177 273088 181409 -12324 -203470 -435572 -499209 -425375 -486926 -437576
22072 -437576 -291310 -302535 -227039 45166 61055 -119733 -228614 -229797 -207315 -276534 39577
22061 39577 146445 263001 -73315 -375097 -259455 -233031 -238299 -90811 35999 -39893
22051 -39893 190422 488147 360700 140812 70667 -115154 -22155 148047 31019 -80302
22041 -80302 -175832 -242375 -217728 -64356 -61143 -393202 -434378 -122893 -110237 -95270 42948
22030 42948 -25523 -17372 82779 39466 77519 1803 46336 69366 193665 384346 9431
22019I431q7122K23905J54725j91810k15002J05596j6502J01092j0309O593r2668
22008a2071j52181K3589O942J33047O2703P5498M4172j64505M7868J51117J64230
21997C80409j12665q4049j25483m1475j61398l6387L4154j84109k0787J07343
21987b44447j30978r3073J66274K21949K40312j59000m0380j45941P161p0129
21977b48252l7504p7098K05180j14730R7365R6391K86282j1907j05206M0714j2316
21966A18919R422J95853o6176n14888j35142K39087J58479k00146j99907J833
21956c92666J35413K7741Q6583J50005R4488M8525l2507j24765j31805J29097
21946i891R7217O6515P1725m9171k74276j09863K59929K03979Q3390k01713N1157
$$ plain form
22019 9431 -77691 146214 300939 109129 -105873 -277 -16779 84313 74004 80597 -12071
22008 -12071 -164252 -140663 -133721 -674 62029 137527 181699 17194 65062 216179 380409
21997 380409 267744 183695 58212 16737 -144661 -181048 -146894 -331003 -351790 -244447
21987 -244447 -375425 -468498 -302224 -80275 160037 1037 -39343 -185284 -178123 -248252
21977 -248252 -285756 -362854 -157674 -272404 -175039 -78648 207634 195727 90521 131235 118919
21966 118919 128341 324194 258018 -256870 -392012 -152925 5554 -194592 -394499 -392666
21956 -392666 -257253 -229512 -142929 7076 101564 150089 117582 -7183 -138988 -9891
21946 -9891 87326 153841 225566 176395 -97881 -207744 52185 256164 339554 137841 188998
21935A88998j62310l40999N1169K73556J66500R2910j80336M4470O8820l30318
21925a27540k6339J62806N3879q2631j10798l1326M6060q2279k0102K16424j60570
21914a62416O6276R3189o159j47785n8636J92046K80076J87721l10290l44581
21904b10559l5180K82481m7483n2108n1626K58118J60722l14419l50039K67473
21894i2620K49274k00913l55442l9313K93358J34987p9791j22706k1009J17701
21884a16474j81211m4002K89730q5617k60803l85088l9311L78403J84962o7375
21874c26786n0192K28122j06977j9323N6708J58654K8281j07437l730Q9507J514
21863e1659K9806j81515n6536O2633K6602o8679N0861K03316j2759o7922k93854
$$ plain form
21935 188998 26688 -314311 -263142 10414 176914 269824 89488 133958 202778 -127540
21925 -127540 -153879 8927 62806 -19825 -130623 -161949 -115889 -198168 -218270 -1846 -162416
21914 -162416 -96140 -2951 -9110 -156895 -215531 -23485 256591 444312 134022 -210559
21904 -210559 -245739 36742 -10741 -62849 -114475 143643 304365 -10054 -360093 -92620
21894 -92620 156654 -44259 -399701 -439014 -145656 -10669 -90460 -213166 -234175 -116474
21884 -116474 -297685 -341687 -51957 -137574 -398377 -783465 -822776 -444373 -259411 -326786
21874 -326786 -376978 -148856 -255833 -275156 -218448 -59794 -31513 -138950 -142680 -53173 -51659
21863 -51659 -21853 -203368 -259904 -197271 -170669 -239348 -188487 14829 2070 -65852 -359706
21852c59706P7384J79324K86161K45261N1346j28467j47771J12258q6358j28309
21842A01123l001J40847K3240j2507l5266L911l81060J07133N15604Q0611k07415
21831C33220q1346J67086m0282j48216j12691j71657J32402j27900j07806j65394
21821c22584j76787j0682K478J13865O4944J59066j13492n298R9642l1675j74445
21810c94968J40896K24163j79533k66462J34810K95805K08168j89090j32070L6159
21800a22122M414J73982J38560k57635L030K58210l529l08456j56593K5243K81944
21789C7048L05648j9960k28488l35496j45492j42892j5192J11723j6239k1543
21779d70883J45468j02325O4045K10853L18554m8437m1077q7885o513o7058j23314
$$ plain form
21852 -359706 -282322 -102998 183163 428424 479770 351303 203532 315790 229432 101123
21842 101123 98122 238969 262209 249702 214436 218347 -162713 -55580 460024 540635 333220
21831 333220 251874 418960 378678 230462 117771 -53886 78516 -49384 -157190 -322584
21821 -322584 -499371 -510053 -507575 -393710 -328766 -169700 -283192 -288490 -188848 -220523 -394968
21810 -394968 -254072 -29909 -209442 -475904 -341094 -45289 162879 -26211 -158281 -122122
21800 -122122 -117708 56274 194834 -62801 -59771 198439 194910 -113546 -270139 -244896 37048
21789 37048 342696 322736 94248 -241248 -386740 -529632 -544824 -433101 -449340 -470883
21779 -470883 -325415 -427740 -363695 -152842 165712 117275 76198 -11687 -18200 -85258 -208572
21768b08572q3596L43297P8100j44379N6976K5224O7641n4000p7664J72073q588
21757A66512l51719m7545J6126j4806K75523K45445J22364j0646k80103N7522
21747A78673L58238n3522l29761j39898j25383q6787j71631q5749J13717L36918
21737e185O7116l1356k80910M4879J07026J14128k522J70382J76037j68097O4538
21726B56036N6058m04569j89216j67622O6500j08373n3498J40387P8150n175o4562
21715c95884L16509K49049J16994m5555J957j64829k35893q85J4891N6579j11996
21704a99063O3329J66470J03379n7360k70774j6127R9424k47049j62330O0393
21694d59708l400J57760K52523k5064n1912J2549j49628Q1598L10436K43377p6038
$$ plain form
21768 -208572 -292168 51129 129229 -15150 41826 67050 134691 80691 3027 175100 166512
21757 166512 -185207 -232752 -216626 -231432 44091 289536 411900 401254 121151 178673
21747 178673 536911 483389 153628 13730 -111653 -198440 -370071 -455820 -342103 -5185
21737 -5185 61931 30575 -250335 -205456 -98430 15698 13176 183558 359595 191498 256036
21726 256036 312094 -92475 -281691 -449313 -382813 -491186 -544684 -404297 -326147 -331322 -395884
21715 -395884 -79375 169674 286668 241113 243070 78241 -157652 -158537 -143646 -87067 -199063
21704 -199063 -135734 30736 134115 76755 -194019 -210146 -110722 -357771 -520101 -459708
21694 -459708 -463108 -305348 -52825 -77889 -129801 -117252 -266880 -185282 125154 368531 292493
21683B92493k19554j41962n3195L01377k6489k63912k11341O5730J80358K93005
21673B16510k30214J07666O1960L3703l91881l8248K07509L1705j93519k6565
21663b21374q4978K12617j24575J237r9489K1113O7661o0089R0739L97609k79212
21652g8741o0302J16499K85477M1541k45273R4484j36776k8222o9607j82264r6306
21641c59490K6254r6843J76890L64386N6133o1226J30942r8950j34566J5574N4904
21630G4008j05582N5766J89201m9399k65748K31098J11121j00196P3813M2415
21620B56497n6543q1496j64570j60669J65776J37932j68881j63656k88035j22691
21610f46336K03999o5512k0433K37211N071Q3269J04044j89358J554J26143J88333
$$ plain form
21683 292493 72939 -69023 -122218 179159 152670 -111242 -322583 -256853 -76495 216510
21673 216510 -13704 93962 155922 189625 -202256 -240504 -32995 -1290 -194809 -221374
21663 -221374 -306352 -93735 -218310 -217073 -316562 -295449 -227788 -287877 -197138 200471 -78741
21652 -78741 -139043 -22544 262933 304474 59201 153685 16909 -11313 -80920 -263184 -359490
21641 -359490 -333236 -430079 -253189 111197 167330 106104 237046 138096 3530 19104 74008
21630 74008 -31574 24192 213393 163994 -101754 129344 240465 140269 214082 256497
21620 256497 199954 118458 -46112 -206781 -41005 96927 -71954 -235610 -523645 -646336
21610 -646336 -442337 -507849 -528282 -291071 -286000 -202731 -98687 -288045 -286491 -160348 27985
21599B7985J5616M5425M5657k8359j5711J37647j36933l00941j38993m1209J29542
21588b60274J16332O7147J60153j6019J91444P0751k04771j84521l0005n6767
21578a46530L2503L2339R2622l318M0068Q9985k1000P5257J96984r7390n4674
21567B36846J36970j8189k4073j12979m12949n6189K52129J12q205J15032L35747
21556D44252j13680j90749j5670K3608J54159O7849K13502j79315j03413k03064
21546I7479k14042j6950r556j78939P3291O9247k29802j83166O8158M20804K74602
21535A71126J5586l07011n2860P9539J06399o755j72898p9286Q6138K18308J16875
21524A75161r1213k99375Q6743J59734O3671k54588k10799Q454J04090j05326
$$ plain form
21599 27985 43601 89026 134683 106324 90613 228260 91327 -209614 -348607 -389816 -260274
21588 -260274 -143942 -76795 83358 67339 258783 329534 124763 -59758 -89763 -146530
21578 -146530 -114027 -81688 10934 7616 47684 137669 116669 191926 388910 291520 236846
21567 236846 373816 355627 331554 218575 -194374 -250563 1566 1678 -6527 108505 444252
21556 444252 330572 139823 124153 147761 301920 369769 583271 403956 300543 97479
21546 97479 -116563 -133513 -143069 -322008 -248717 -179470 -409272 -592438 -524280 -103476 171126
21535 171126 186712 -120299 -173159 -93620 12779 6024 -166874 -246160 -160022 58286 175161
21524 175161 83948 -215427 -128684 31050 94721 -159867 -370666 -362212 -258122 -363448
21514c63448K65286J67469J21221J71357r9341j64705o4883j24453J24485K76294
21504C09282k33829j39369Q0797J73912R937J04694J37260j16169K7985k81508
21494G2992n5188J08671K57836j36153l52027j88506K59795l6474o7901J08136
21484b8819J50087P7113k9054O672r7302m56629j68577P4715K7715J16086J03841
21473b24152J80057j30667j85738Q161K28314N8510J5224m8862Q4174j74707k97170
21462d86856J12431L81046K25793n7811l1958q9253k605n7459K9744o6979J78477
21451A34570j76771k13912J1940J97533r0707N4134J4561K3136R3407J24728j41239
21440C1380M4556M36549k77797j94645M5149j17673n3079J64566l6000p057K30590
$$ plain form
21514 -363448 -98162 69307 190528 361885 262544 97839 32956 -91497 32988 309282
21504 309282 75453 -63916 16881 190793 200730 305424 442684 326515 354500 72992
21494 72992 17804 126475 384311 248158 -103869 -292375 -32580 -69054 -136955 -28819
21484 -28819 121268 198381 169327 175999 78697 -377932 -546509 -471794 -444079 -327993 -224152
21473 -224152 -44095 -174762 -360500 -352339 -124025 -65515 -50291 -99153 -14979 -189686 -486856
21462 -486856 -374425 6621 232414 174603 142645 53392 50787 -6672 23072 -43907 134570
21451 134570 -42201 -256113 -244173 -46640 -137347 -83213 -68652 -45516 47891 172619 31380
21440 31380 75936 512485 234688 40043 85192 -32481 -85560 79006 43006 35949 266539
21429B66539j43831l14976k62778l39694Q2371J93415M42675m8804j57315n3435
21419c35833P2347k3541j74676j7662j34912J11897K61314k72302J27285J18349
21409b67734R0730O9838N3794J02795N6237k98256n8328J08360R3154j93992j13906
21398c57308J0656k3239J56851M27725K57327k69067k51584K31059K75126P6796
21388E34342k28800k22753j66312j8274k52219j09708L96727L1709j81988J27128
21378i0148r8595O3917M38299P2540m1368j44861R7318j40683j32415Q3573J51626
21367B59203o6005O0858J19354R048j71775J13221r7560M4896j04494j67594J54037
21356A53189p6333n357P6905n9291N9061M0281M5718r4861j09833K6802j76547
$$ plain form
21429 266539 122708 -192268 -455046 -794740 -712369 -518954 -76279 -125083 -282398 -335833
21419 -335833 -263486 -287027 -461703 -479365 -614277 -502380 -241066 -513368 -386083 -267734
21409 -267734 -177004 -107166 -53372 49423 105660 -192596 -250924 -142564 -49410 -243402 -357308
21398 -357308 -346652 -369891 -213040 214685 472012 202945 -48639 182420 457546 534342
21388 534342 305542 82789 -83523 -101797 -354016 -463724 -66997 -35288 -217276 -90148
21378 -90148 -188743 -124826 313473 386013 344645 199784 297102 156419 24004 107577 259203
21367 259203 193198 254056 373410 382458 210683 323904 226344 271240 166746 -848 153189
21356 153189 76856 71499 148404 89113 148174 188455 234173 139312 29479 56281 -120266
21345a20266r3780J01642k3798P2033J42178j4852j865o3453k449j11061j64853
21334b80524j07736o3311J18139K063L1962L04016J93939j04979j74471N8457
21324b2445l1121J31475j48508j01565Q3426J16105k55241j59090J55711Q6909
21314a44344p5294k24363J79631K82577K85417r0365j77259L9758R5546j0391
21304A60913j85765m8507J2111j15665J89396J03068m4979J58865j21929j6103
21294I1405K3025n3599k71807k70547o6929K85006J21739R8094k6843k8645N2045
21283d7056J05876J30277j41552Q8406K36219j69258k66118j84385k9470o5007
21273c42068J00115K2473m8709K11671L62805P1376O2661K22115k55744l29970
$$ plain form
21345 -120266 -214046 -112404 -136202 -64169 78009 63157 61292 -2161 -4610 -115671 -280524
21334 -280524 -388260 -451571 -333432 -331369 -299407 4609 198548 93569 -80902 -22445
21324 -22445 -53566 77909 -70599 -172164 -88738 27367 -227874 -386964 -231253 -144344
21314 -144344 -219638 -444001 -264370 18207 303624 213259 36000 75758 171304 160913
21304 160913 -24852 -73359 -61248 -176913 12483 115551 70572 229437 107508 91405
21294 91405 114430 60831 -210976 -481523 -548452 -263446 -141707 -43613 -70456 -99101 -47056
21283 -47056 58820 189097 47545 135951 372170 202912 -63206 -247591 -277061 -342068
21273 -342068 -241953 -219480 -268189 -56518 306287 377663 440324 662439 406695 76725
21263G6725l3003M7997P7389L4010j91218j83220O250R5351J08422j62271p6883
21252b00451m7072J34015M86671K1924j94142j42974N5799Q5410j46557m9507
21242C116O0941K53345J17866j00812r8280k63780J93515K42987j14430l38716
21232d4248k3151q9101r3447N5204N5825J7703J46141k01493j55701K41713K38509
21221A47954j40692J32204J66531j16575j71905j33215L23866j37410j9996r521
21211D1241M4765o6063r4775J3802k17596J25686J32476J04482j23404M2573r9200
21200i6013q6341j7030J96638p2235J53030J51855l3489m2056O2056Q579l3762
21189A91232k35394j94989P8758j18594R6644R7317P2181j73367k70528Q6944
$$ plain form
21263 76725 43722 91719 169108 203118 11900 -171320 -165070 -69719 38703 -123568 -200451
21252 -200451 -247523 -113508 373163 395087 200945 57971 113770 199180 52623 3116
21242 3116 64057 317402 435268 334456 236176 -27604 165911 408898 294468 -44248
21232 -44248 -67399 -156500 -249947 -194743 -138918 -121215 24926 -176567 -332268 -90555 147954
21221 147954 7262 139466 305997 189422 17517 -115698 208168 70758 50762 41241
21211 41241 86006 19943 -74832 -61030 -278626 -152940 -20464 84018 -39386 3187 -96013
21200 -96013 -182354 -199384 -2746 -74981 78049 229904 196415 154359 216415 224994 191232
21189 191232 -44162 -239151 -160393 -278987 -182343 -85026 -12845 -186212 -456740 -369796
21179c69796L67394j12812k0914q905L6816M0797m5756j7803J30081J39341l4677
21168A03766j84652M6050m3043k38803J75792J64592r673q7683k37804R9685L81195
21157A69422Q9065N5922k04418j11587l15079k07296L64496M44576p9915j44437
21147F0749J31843R2768r7742j04370K6022J02018J89769O0708k03602P5423J22224
21136D55810j05582q2951m6518L0478P7578k3224K4226j38483k25693j56845j23689
21125c14893L26720K26910k10422k06090p4901q5723J29640K7205l4759j64056
21115c80369k39070K84120L67875j61230j0103j01846j45145k6681J95697q4445
21105c01197J14823M1153j54981M2533K12274J09459J21p0938l3045r4534k55399
$$ plain form
21179 -369796 -2402 -115214 -136128 -145033 -108217 -67420 -113176 -130979 -898 138443 103766
21168 103766 -80886 -34836 -77879 -316682 -140890 23702 14029 -73654 -311458 -211773 169422
21157 169422 258487 314409 109991 -1596 -316675 -523971 -159475 285101 205186 60749
21147 60749 192592 285360 187618 83248 109270 211288 401057 461765 258163 333586 455810
21136 455810 350228 267277 220759 251237 328815 305591 329817 191334 -34359 -191204 -314893
21125 -314893 11827 238737 28315 -177775 -252676 -338399 -208759 -181554 -216313 -380369
21115 -380369 -619439 -335319 32556 -128674 -138777 -240623 -385768 -412449 -216752 -301197
21105 -301197 -186374 -145221 -300202 -257669 -45395 64064 64185 -6753 -39798 -134332 -389731
21094c89731m1752Q5421K9158K24374J57167J3236j61001j14140J53752l24l4010
21083g7850K5110R2869O0261j91539o3055K14124l4851o1719K84595p0500l00701
21072a23256J50938j99144M1284J22380p4634j03929K83269K30271j47851l11892
21062a32564J21619K53381J74071j83284j13269l27849j30091J00968K01059l919
21052c9878J50982J98264l1993k66474j85487j47654J98674N7528J32702j29277
21042f2613n3329L8522M6712J97407M5760k00882J46638K47759k4185j63314p7176
21031A41299j21120j34239j06011N8835J73967P0426R2428O0949l35096j70758
21021b69320J82932J37553L9565j14747j29026J85006J39020L1668P7691k03156
$$ plain form
21094 -389731 -431483 -346062 -316904 -92530 64637 77873 -83128 -197268 -43516 -43840 -77850
21083 -77850 -52740 40129 100390 -91149 -154204 59920 25069 -36650 247945 177445 -123256
21072 -123256 27682 -171462 -130178 -7798 -82432 -186361 96908 327179 179328 -132564
21062 -132564 -10945 242436 416507 233223 119954 -207895 -337986 -237018 -35959 -39878
21052 -39878 111104 309368 277375 10901 -174586 -322240 -123566 -66038 66664 -62613
21042 -62613 -115942 -77420 -30708 166699 212459 11577 158215 405974 381789 218475 141299
21031 141299 20179 -114060 -220071 -161236 12731 83157 175585 236534 -98562 -269320
21021 -269320 -86388 51165 90730 -24017 -153043 31963 170983 202651 280342 77186
21011G7186n0097j36339j55671j90045n2048K2321N13651J49451k25449l7900
21001h4940J6864J75988O6910K13905q9133k45313j37310q5969K52125j5334m5139
20990B2654q9935j1833K06721J38369J45853K4761j33971O1836j1311j49037r0889
20979A13218J67348j22870k41803P175J65843M8752R452N6957J53690J3916l57822
20968A3856k25174K9879o6165k32561K0086J08276J32219K42369q4819j70086
20958b32120K08318J09313k35342m06461k5235J70091J08451J3402J6072K41907
20948c1604J49963J06104j63354l0737K58621j55664j60671O0550M4241N1628
20938A29077J08839o4367J18472L21118J2822k54367k72182k34234J96862K34432
$$ plain form
21011 77186 27089 -109250 -264921 -454966 -507014 -484693 28958 178409 -47040 -84940
21001 -84940 -68076 107912 174822 388727 299594 54281 -83029 -168998 83127 67793 22654
20990 22654 -67281 -79114 127607 265976 411829 436590 302619 364455 353144 204107 113218
20979 113218 280566 157696 -84107 -76932 88911 137663 147115 204072 357762 371678 13856
20968 13856 -211318 -181439 -247604 -480165 -460079 -351803 -219584 22785 -62034 -232120
20958 -232120 -23802 85511 -149831 -556292 -581527 -411436 -302985 -289583 -273511 -31604
20948 -31604 118359 224463 61109 30372 288993 133329 -27342 33208 77449 129077
20938 129077 237916 173549 292021 613139 625961 371594 99412 -134822 62040 296472
20928B96472n2057q9358k52760l53380k2662K43014L31669J50042L0538j24446
20918A57072j02130p2942L0395L6329n6969J56659r876Q0752m1277L0642J06178
20907C14833m5542l53784q8353K60695K50479o8642k84586j57608n2901k91744
20897e17153L03114M60648L2727j47847r2546o0847j67129l7774J81589J29900
20887H4682J86287R7421r4734m8083K74717j72984j92643r3843j58753j5721Q9286
20876d4368J83043L0382j84953j50906n2019o8078l0865M10204K9582j37814j50860
20865a66652J78783Q0096M9935k1988M5256J50300n2809q5517k16383j46244p2548
20854b57771L74286M8785J737j20208j54367Q0093J65540o624J85134K04335q1675
$$ plain form
20928 296472 244415 155057 -97703 -451083 -473745 -230731 100938 250980 281518 157072
20918 157072 54942 -18000 12395 48724 -8245 148414 138538 219290 178013 208655 314833
20907 314833 269291 -84493 -172846 87849 338328 269686 -14900 -172508 -225409 -517153
20897 -517153 -214039 246609 279336 131489 38943 -21904 -189033 -226807 -45218 84682
20887 84682 270969 368390 273656 225573 500290 327306 134663 40820 -117933 -133654 -44368
20876 -44368 138675 169057 -15896 -166802 -218821 -286899 -317764 92440 122022 -15792 -166652
20865 -166652 12131 92227 142162 120174 165430 315730 262921 177404 -38979 -185223 -257771
20854 -257771 116515 165300 167037 46829 -107538 -27445 138095 131471 316605 520940 439265
20843D39265k17725L9425O519J37725k33660j9457R9754k47750k00373K22506
20833B6229K5301Q3938N7011q75q4041l38827j81536J17984J66831L1325J40810
20822D4150J19260J44456j31793l85729K898j78092j0863J94131P2249j58751
20812b88084q3934K70830J08938K02496J26254r2892j4603k3349l33809j33424
20802b61577j2423J46337K82183j22088j38507q0222J612j49080l456K8911K04954
20791a03356M8449Q2333J28490P8244K03083M924j64744q9432r8301p1956o9153
20780e1419J26931K09345J22250J27490l9431j89460Q0279J75690J23468j22777
20770E62366Q511N756K03410l173r1532l12156l87838j4358K69863L29798j40239
$$ plain form
20843 439265 221540 260965 267484 405209 171549 152092 251846 4096 -196277 26229
20833 26229 51530 135468 192479 191604 107563 -231264 -412800 -294816 -127985 -96660 44150
20822 44150 163410 307866 176073 -209656 -206758 -384850 -395713 -201582 -129333 -288084
20812 -288084 -372018 -101188 7750 210246 336500 243608 229005 205656 -128153 -261577
20802 -261577 -274000 -127663 154520 32432 -106075 -186297 -184685 -333765 -337221 -308310 -103356
20791 -103356 -54907 27426 155916 234160 437243 442167 277423 187991 89690 17734 -51419
20780 -51419 75512 284857 407107 534597 495166 305706 385985 561675 685143 562366
20770 562366 570877 576633 780043 776870 685338 373182 -14656 -29014 240849 570647 430408
20759D30408r9300L8820m0858j51594L0061m1193k38964p8833k08208K03032L88829
20748B32200J3260k793l8902K1963J00441P0413j69427j9235N4000j07228j88485
20737c3793j58079q742J3548Q1647K5802p8518k78942q568K70743K03387m974
20726B3511Q763j04238K39207R5025l67822q0329L17081L7881J64010n8943l64903
20715i0757N9830J59715l923l2771l68554k72942j14796J12363M6929p8131J34825
20704d48212K01721N5500k69756M4460K81275J51945J01016O6175m0702q9698
20694E3724j58777n0954L7679J65620J05922K3861q1517p7636J7576o2170O7446
20683D0774j73349j25567m0140K11762J69913l7171m7909J70993L28526j56035
$$ plain form
20759 430408 331108 369928 329070 177476 207537 166344 -72620 -151453 -359661 -156629 232200
20748 232200 245460 242667 203765 225728 326169 396582 227155 207920 261920 154692 -33793
20737 -33793 -191872 -200614 -187066 -105419 -79617 -158135 -437077 -445645 -174902 28485 23511
20726 23511 32274 -71964 167243 262268 -105554 -185883 131198 169079 333089 274146 -90757
20715 -90757 -30927 128788 124865 92094 -276460 -549402 -664198 -551835 -504906 -583037 -448212
20704 -448212 -246491 -190991 -460747 -416287 -135012 16933 117949 184124 143422 53724
20694 53724 -105053 -156007 -118328 47292 153214 177075 95558 17922 35498 -26672 40774
20683 40774 -132575 -258142 -298282 -86520 83393 46222 -1687 169306 497832 341797
20673C41797j75330M17473K06394J51997J72200K21360J53707M92990K10828k02934
20663A990482m44116j77467j86414m88095m47988L5691K84993p8327j66108j61584
20653A61067j1509R4340L4882P6926L0619o9679l7552r7690M6823J26378M871
20642C59476k36037N453J0943o6275j78894k60151L79768K73547j01523j14552
20632G1755j75100M58634J06608m2171p0805K88151M8464j94760j79826j02362
20622B08588j55500Q030R1983K26973k09109O8988k11865M9578K36444J35345
20612D49455r451R050j69044K4558n5790J25717J07607R5908Q129j21716k87500
20601A76923Q5149K09068j38642k45556N0346m2677O4797j77995l02896j37715
$$ plain form
20673 341797 166467 583940 790334 942331 1114531 1335891 1489598 1982588 2193416 1990482
20663 1990482 1546366 1368899 1182485 694390 246402 282093 567086 488759 322651 161067
20653 161067 149558 243898 278780 355706 386325 316646 279094 181404 228227 354605 359476
20642 359476 123439 128892 139835 73560 -105334 -365485 14283 287830 186307 71755
20632 71755 -103345 355289 461897 419726 348921 637072 685536 490776 310950 208588
20622 208588 53088 61118 153101 380074 170965 239953 28088 77666 314110 449455
20612 449455 440004 449054 280010 304568 248778 374495 482102 578010 586139 464423 176923
20601 176923 262072 471140 332498 86942 137288 94611 159408 -18587 -321483 -459198
20591d59198L58457J13527K55833l9182k82796N4801o2003k00837K0391K71546
20581C0539O0382J22433J59401j16799p6093j78176j85330k08423N53M38508J99540
20570B46535N2587k13310r9574K85703J01005m9630k03527J4707l84296l9585
20560b89385K15866L93762p4519k9656O5962K3235j67523m4911j50239P6910J200
20549B0702k79496J19974Q9176J38771J74631r338k73658m01961N5693K79670
20539h5836L8418l28269J6496L23655l7074q4928L5445M4762k9878j24777K71627
20528C9641J85779M9276l3477n4064J87503J00704k1006J10655N87053O18663
20518A770727O42283N02862K03438k30872p81637n81612l42493l14784k24866
$$ plain form
20591 -459198 -100741 12786 268619 229437 -53359 1442 -60561 -261398 -241007 30539
20581 30539 90921 213354 372755 255956 179863 1687 -183643 -392066 -391513 46995 246535
20570 246535 299122 85812 -13762 271941 372946 323316 119789 134496 -249800 -289385
20560 -289385 -73519 320243 245724 216068 282030 305265 137742 92831 -57408 19502 20702
20549 20702 -258794 -138820 -49644 89127 263758 254420 -19238 -421199 -365506 -85836
20539 -85836 -47418 -375687 -359191 -35536 -72610 -157538 -122093 -77331 -107209 -231986 39641
20528 39641 225420 274696 241219 187155 374658 475362 454356 565011 1152064 1770727
20518 1770727 2413010 2915872 3119310 2888438 2106801 1525189 1182696 867912 643046
20509F43046K6168M0715q8849j42461r4280q8122n2764k9249q5273r7094J07937
20498A39774r0495j29698K84536J66739l0017j147j02474K80270M596q3098J58742
20487E97728J46490j59848j28634Q1062p9389j85891m4728j68920l0498J04002
20477A31374o8192j65182j02414K25673q8098L0291K21523K7954J89842R2235
20467D95006l36486k85640k17655L772m8363j4749J11301K71140J90543q0725
20457H8144p1380M5674J23801J02046k98437K4350J48346r3204j49191O5512J15098
20446A00759M2099K21626J51056r9082R3314j41157m56374l3106K2060R9653L1867
20435C2715K45829o0072M6947j2901O5663M3152j67221m74068J41660M14490N5262
$$ plain form
20509 643046 669214 709929 621080 478619 384339 296217 243453 214204 128931 31837 139774
20498 139774 49279 -80419 204117 370856 340839 339692 237218 517488 522084 438986 597728
20487 597728 744218 584370 455736 536798 457409 271518 226790 57870 27372 131374
20477 131374 63182 -102000 -204414 21259 -66839 -36548 184975 212929 402771 495006
20467 495006 158520 -127120 -344775 -341003 -389366 -404115 -292814 -21674 168869 88144
20457 88144 16764 62438 186239 288285 -10152 14198 162544 69340 -79851 -14339 100759
20446 100759 142858 364484 515540 416458 509772 368615 -87759 -120865 -98805 848 32715
20435 32715 278544 218472 265419 252518 318181 361333 194112 -279956 -138296 276194 331456
20424C31456k58956r6399J8837K4879j80284J59078K57792r5107j37713l53659
20414c30076R921K66798j14737J4474K66382M2689m7013l3719k8684n1004q9300
20403i4269J55596L0131K7729L6258m0694K28623J51881k24139R8799K53390l03739
20392C19566k13343j25486k35706K57038L02710j23395J5777K2651j322j26400
20382I2090j13593L482J34074k31770M5653l9631j08672L38611J62951j35779
20372A47416k08658q1472K32449J70973Q0492K53414J91069N416K4637J25999
20362I41735O841j6945j07315O4741j40246M5044j67918Q1918l22118k47357M5556
20351A83936K3303q2343m0163N10012J65342J29426P2401k5823O4740j93293j88538
$$ plain form
20424 331456 72500 -23899 -5062 19817 -160467 -1389 256403 161296 23583 -330076
20414 -330076 -320155 -53357 -168094 -153620 112762 155451 108438 74719 46035 -4969 -94269
20403 -94269 61327 91458 119187 155445 114751 343374 495255 271116 369915 623305 319566
20392 319566 106223 -19263 -254969 2069 304779 181384 197161 219812 218490 92090
20382 92090 -21503 -18021 116053 -115717 -70064 -109695 -218367 120244 283195 147416
20372 147416 -61242 -142714 89735 260708 341200 594614 785683 791099 815736 941735
20362 941735 948576 931631 824316 889057 748811 793855 625937 707855 385737 138380 183936
20351 183936 207239 124896 84733 594745 760087 889513 961914 936091 1000831 807538 619000
20340F19000K30140j16568o6768j28828l97491k54994L79386K11988j07014l67440
20330A411r2405J54667R9676m4951P0614L3578J55473l8903l76455R7688K79302
20319C39695J04399m71509Q8147M62664L37202p4888o407j5354k08549l16846
20309B38554r2331J13593j17938j77720P0406J62000P0992l7903J12006K51699
20299E93358L30531J40323J33662j16149L6585J19938M85681K34373l16928l18878
20289A322496k68292l09473j34720J15264q1370O6151M0279k27516l07378k05817
20279I624J44204J75534J83155J50033J80373n8788k25340M8619J27829q5463
20269F49780J6720p6503l6286m9559p4490j56447J18560J61848k28308l10307
$$ plain form
20340 619000 849140 732572 665804 536976 139485 -115509 263877 475865 368851 1411
20330 1411 -90994 63673 163349 118398 189012 222590 378063 339160 -37295 60393 339695
20319 339695 444094 -27415 60732 523396 860598 785710 779303 763949 555400 238554
20309 238554 146223 259816 141878 -35842 34564 196564 267556 229653 341659 593358
20299 593358 923889 1064212 1197874 1081725 1118310 1238248 1723929 1958302 1641374 1322496
20289 1322496 1054204 744731 610011 725275 643905 710056 750335 522819 215441 9624
20279 9624 153828 329362 512517 662550 842923 784135 558795 607414 735243 649780
20269 649780 666500 589997 553711 504152 429662 273215 391775 553623 325315 15008
20259A5008n1010M45256J21850j14225l2208j26117j34294N276J43508N1312O4070
20248C88426o4299N26K77995O8443p135j35149j45678Q5979j41637P5052J67780
20237E70303K01816J68759l30891j29467o3667J10906m1912j74880P5609j7099
20227C69477j04278o7189j72305J74004j13907l7054J7194J18099M3782p4569
20217A53254J72565K9939J00508P5503J33311j04263K32598Q3601m38111m18204
20207B0701Q200L33983o416K22694J01672J7901K32063m25455k67421M689k6437
20196B16174l1446j47431J04646K87223J21137M41579L44072q9621j98381N5763
20186A103715L38289K22864j47157L0650L1313J66679m738k54434P3275l47378
$$ plain form
20259 15008 -36002 409254 531104 416879 384671 258554 124260 129536 273044 324356 388426
20248 388426 324127 324653 602648 671091 663956 528807 383129 469108 327471 402523 570303
20237 570303 772119 940878 609987 480520 416853 527759 485847 310967 386576 369477
20227 369477 265199 198010 25705 199709 85802 48748 65942 184041 227823 153254
20217 153254 325819 355758 456266 531769 665080 560817 793415 877016 438905 20701
20207 20701 28901 362884 356468 579162 680834 698735 930798 505343 237922 242611 216174
20196 216174 184728 37297 141943 429166 550303 991882 1335954 1246333 1047952 1103715
20186 1103715 1442004 1664868 1517711 1548361 1579674 1746353 1741615 1487181 1560456 1213078
20176A213078l11012j60438k6854O4922J69198Q2934m9304K02030L74635l75899
20166A183290j49524J72374J24995r1841J60402p637K5395M8466M5865O6552k17297
20155A361040J55649J69165n4345K23840K64068k71223n5646J09641o6600R6044
20145A931633R132O6737J25397j56108L14196N54113N06033K99836M90302O51638
20135D792909O50612O82769P62202L92669M02916J96413L48425L10378M48078
20126H987371R45774J612694K515840L184087L861420N012918N926208P534611
20118C9580923R829828J4177899K0797844K9113377L7890272M6992866N0946369
20111B49329378M1026643K5507654j756843l3360161m4705769n4298920n3288430
$$ plain form
20176 1213078 902066 741628 714774 779696 948894 1031828 982524 1184554 1559189 1183290
20166 1183290 1033766 1206140 1331135 1239294 1399696 1392059 1417454 1465920 1511785 1578337 1361040
20155 1361040 1516689 1685854 1631509 1855349 2119417 1848194 1792548 1902189 1835589 1931633
20145 1931633 1940765 2007502 2132899 1976791 2290987 2845100 3351133 3650969 4141271 4792909
20135 4792909 5443521 6126290 6888492 7281161 7684077 7880490 8228915 8539293 8987371
20126 8987371 9933145 11545839 14061679 17245766 21107186 26120104 32046312 39580923
20118 39580923 49410751 63588650 84386494 113499871 151390143 198383009 249329378
20111 249329378 290356021 315863675 314106832 280746671 236040902 181741982 128453552
20104A28453552l7109684k3092207j3956456q591388n937517m402358l414554
20097C1949388k812631k283716j707065j390158j131432j048677m01397k8927
20089B1145385j55414m36378l10993l54388n03224n36731m98017l47837n50386
20080A7452017n43789o94930q99032o45501p51788n32121o25516r28400q42615
20071A0988325q27741p35097q57303n48854l72513n44530n09436k76627l48884
20062E967340l37787l70479l7712j29684j61227M1701k95221o15234l10833J6401
20052C767265K8223k13833m27235k44857J0054m6148j54675j79464j33087l01561
20042B104682l33597k33853J60390n0067Q2803L00021j27219j45586l80578l15114
$$ plain form
20104 128453552 91343868 68251661 54295205 45703817 39766300 35363942 31949388
20097 31949388 29136757 26853041 25145976 23755818 22624386 21575709 21174312 21145385
20089 21145385 20989971 20553593 20242600 19888212 19384988 18848257 18350240 18002403 17452017
20080 17452017 16908228 16213298 15314266 14668765 13916977 13384856 12759340 11830940 10988325
20071 10988325 10160584 9425487 8568184 8019330 7646817 7102287 6592851 6316224 5967340
20062 5967340 5629553 5259074 5221362 5091678 4930451 4972152 4676931 4061697 3750864 3767265
20052 3767265 3795488 3581655 3154420 2909563 2919617 2873469 2718794 2539330 2406243 2104682
20042 2104682 1771085 1537232 1697622 1647555 1730358 2030379 1903160 1757574 1376996 1061882
20032A061882j20451J37018J4922k46487p2987j88363k15904j93128L22451M2599
20022E41552k05070K65630L9316j74024K22974K78920l03807J31462k96083o449
20012D94421m2516j40088l3755J16801K85503K1388j88448j17205J55196P6206
20002F27503k10214j07474K10959J65282J16379M7267P7882j9308K59521J17021
19992A284818K7175P6721K22825J91305k22576m41213J21270j45979p8648k07960
19982H27738j55578j60074n4567j5927Q9555l5534l06833J43556p8580J82076
19972D35832p5050j5801k19545K48519P3063l19372Q99K87193m6854j01878O5420
19961C32426J48398J24087j52096k29420J45186k240j41713N8083K46228J0686
$$ plain form
20032 1061882 941431 1078449 1093371 846884 773897 585534 369630 176502 498953 541552
20022 541552 336482 602112 641428 467404 690378 969298 665491 796953 500870 494421
20012 494421 451905 311817 278062 394863 680366 701754 513306 396101 551297 627503
20002 627503 417289 309815 520774 686056 802435 849702 927584 908276 1167797 1284818
19992 1284818 1311993 1388714 1611539 1802844 1580268 1139055 1260325 1114346 1035698 827738
19982 827738 672160 512086 457519 441592 531147 495613 188780 332336 253756 435832
19972 435832 360782 344981 125436 373955 447018 127646 128545 415738 368884 267006 332426
19961 332426 480824 604911 452815 223395 368581 366341 224628 282711 528939 539625
19951E39625k04945j5603J86125Q4229j58122m4563J62919P3109k67030j64631
19941A91113L3070j51034j6016J78940K18285r9898j32175L03529K90013P2474
19931H88301J32363j43443j69114J35598J60364J7213k16877l73056r1161M6137
19921C86325j08813K37606r8078k68808O7057M39872j39643k04521k7109P550
19911B91438J10295J36374r9692o9468J83108r8901K06323Q74j50149q1108J50395
19900E79489q063k81110j42485J04464J6176j02099M7906k3824m5354j19798k4360
19889I42L09488n3103Q2025q8643K3867Q0470L06216K6812j41536m35180J3004
19878A24362j06256l3614J86568J03795n5107p5616j545l1390k9286K2242L853
$$ plain form
19951 539625 334680 319077 505202 589431 431309 386746 549665 622774 355744 191113
19941 191113 224183 73149 57133 236073 454358 354460 222285 525814 815827 888301
19931 888301 1020664 877221 708107 843705 1004069 1021282 804405 431349 340188 386325
19921 386325 277512 515118 417040 148232 215289 655161 515518 310997 283888 291438
19911 291438 401733 538107 438415 368947 552055 453154 659477 660351 510202 429094 579489
19900 579489 571426 290316 147831 252295 268471 166372 214278 190454 145100 25302 942
19889 942 310430 257327 339352 250709 274576 355046 661262 688074 546538 111358 124362
19878 124362 18106 -15508 171060 274855 219748 144132 142587 111197 81911 104153 108006
19867A08006j48512J00813K8173K22209M02626o1115k07337j28428O312R0383
19857D13130K21676p3080k06790l9896m9180K04820K5724j5859n973J03132j36564
19846D41140O7523j12881k24601j35688J43047J33740k71350J17965J23412n2758
19836B29549J28636L09325p4239l1011j3854J5030k00498j75602q3473K81747
19826C85610J73174k4645l2804j03894N6741j51812m749k2963n2861K5372K17038
19815D64207r4156N3747N7854J47305L20313J23856J72017o4094J22505j59479
19805A144075j74991r3414k61007L15423K63945k25112k09793M0425j14706j15
19795F84730j31195k9080k0474l7241N4553J39633J79117J25742j9165J74959
$$ plain form
19867 108006 -40506 60307 88480 310689 713315 652200 444863 316435 322747 413130
19857 413130 634806 561726 354936 315040 265860 470680 496404 480545 474572 577704 441140
19846 441140 508663 395782 171181 35493 178540 312280 40930 158895 282307 229549
19836 229549 358185 667510 593271 562260 548406 563436 362938 187336 103863 385610
19826 385610 558784 534139 501335 397441 454182 302370 297621 274658 221797 247169 464207
19815 464207 370051 423798 481652 628957 949270 1073126 1245143 1181049 1303554 1144075
19805 1144075 969084 875670 614663 930086 1194031 968919 759126 799551 684845 684730
19795 684730 553535 524455 503981 466740 521293 660926 840043 965785 946620 1121579
19785A121579j0790l6955M4876K90283m1651q66K24777J55955o6390p893J66049
19774A838974J12554l1322o7331j33694K77182L23645K04264J0933k00337J72227
19764B507095K7447L99553P70615O49474O12408O91724P12008Q16037R40072K71045
19754H397478n5466Q7859L96027J088816J590719K098411L091200M161339N019712
19745B5876095O170828P994389J0669678J4877010K1589661L0457820L9722678
19738A57358159M9372068N2427456M0500418K3792538o411613l7054099m7050670
19731B32934257n6406243n3063549l5684101k1705407j3323795q233316n709597
19724C8808249m000903k830697k562777k403578k143421j598339q68962p12973
$$ plain form
19785 1121579 1110789 1073834 1118710 1408993 1367342 1366476 1591253 1747208 1680818 1672925 1838974
19774 1838974 1951528 1920206 1852875 1719181 1996363 2320008 2524272 2535205 2334868 2507095
19764 2507095 2534542 2934095 3704710 4354184 4966592 5658316 6370324 7186361 8126433 8397478
19754 8397478 8342012 8429871 8825898 9914714 11505433 13603844 16695044 20856383 25876095
19745 25876095 32046923 40041312 50710990 65588000 87177661 117635481 157358159
19738 157358159 206730227 259157683 299658101 323450639 317039026 279984927 232934257
19731 232934257 176528014 123464465 87780364 66074957 52751162 44517846 38808249
19724 38808249 34807346 31976649 29413872 27010294 24866873 23268534 22399572 21686599
19716B1686599m44372P5755j90792j94461l98188n59182o72797m53966n15888
19707A8332708o32789j90262l66987p09722r78837r26930r89799q26381j052356
19698A1658645j051357p88695l36484l26276m68297p67458m53856l88135k03141
19689F874946m99347j72075k47114k37131n15816n11897K2738j13000q282k58582
19679D334440j62132k75288l69232j24265j54861l25338l01130j53448l8816J08033
19669B537963l6831Q0567j25663j2475j10905j47281J63653J46831J63120J50735
19659B809714P097j97844n95904m02027k52273j57399J06451P3839k18693N6643
19649A229604N433j78476j40037J32732R8429l33742m5168j2788J49211j81642
$$ plain form
19716 21686599 21242227 21317982 21127190 20932729 20534541 19975359 19302562 18848596 18332708
19707 18332708 17699919 17509657 17142670 16432948 15454111 14527181 13537382 12711001 11658645
19698 11658645 10607288 9818593 9482109 9155833 8687536 7920078 7466222 7078087 6874946
19689 6874946 6375599 6203524 5956410 5719279 5203463 4691566 4714304 4601304 4593022 4334440
19679 4334440 4172308 3897020 3527788 3403523 3248662 2923324 2622194 2468746 2429930 2537963
19669 2537963 2501132 2581699 2456036 2443561 2332656 2185375 2349028 2495859 2658979 2809714
19659 2809714 2816811 2618967 2023063 1621036 1368763 1211364 1317815 1391654 1172961 1229604
19649 1229604 1235037 1056561 916524 1049256 1147685 813943 768775 755987 905198 723556
19639G23556j77445K02472j18881j54900j70807K3566j42758p7922J54448K100
19629B63429j94384l8871J63871q4892r2001L29402J40346j6617j28665J49689
19619D91307J04262J29265k0842j15153K73007n4015n2599N93247P13460K60618
19609B322557J85589k6897m26502l91925k33882j04405k00027p8325j86599r5154
19599G64430n7187p6606P763q517J8102K02939K48016L9189j43095k87404k92687
19588D14943K3957k2104O0862J68032J50614q1698k62993P1814K05674j9419o7566
19577F42116j7013k42127j99881P0818r5221k3143K43592J14566Q553l2594J14181
19566E83847l272j66889j94683J34288K03515K1992J7852p991M6523j489Q5714
$$ plain form
19639 723556 546111 748583 629702 474802 303995 327561 184803 106881 261329 263429
19629 263429 69045 30174 194045 109153 17152 346554 486900 470283 341618 491307
19619 491307 595569 724834 703992 588839 861846 807831 755232 1348479 2061939 2322557
19609 2322557 2508146 2481249 2054747 1662822 1428940 1324535 1124508 1046183 859584 764430
19599 764430 707243 630637 638400 629883 647985 850924 1098940 1138129 995034 707630 414943
19588 414943 438900 416796 477658 645690 796304 714606 451613 523427 729101 709682 642116
19577 642116 625103 382976 183095 253913 158692 135549 379141 493707 502260 469666 583847
19566 583847 580575 413686 219003 353291 556806 578798 596650 588659 635182 633693 719407
19555G19407K25185n8247K7019K49336L44533L15656J01906J94844J18842J04497
19545B342978j78835n04266k61349j29198k66797l06369j22400J61058r2893Q1826
19535G23755J78927p7275j35404n1409j41622k83592j95660K26353j49965m1375
19525E2733n2731L1082K80797R3646p9998j16967J09194O0618r0902k38774L9403
19514H8101J87883o853j99307j54529J38375J64105J79705l7905M5161k84250
19504A20486L29Q1219J88270p5582J24856L06313J70045J26707l78986l23181
19494C40476J42035N00970O78786P58235O27550l4150k71833l25235m01100n59277
19484A456457j70867k45631o6144l72455j68940k3262j11919j46532J51972n1646
$$ plain form
19555 719407 944592 886345 913364 1162700 1507233 1822889 1924795 2119639 2238481 2342978
19545 2342978 2164143 1659877 1398528 1269330 1002533 696164 573764 734822 641929 723755
19535 723755 902682 825407 690003 638594 496972 213380 17720 244073 94108 52733
19525 52733 2 31084 311881 405527 325529 208562 317756 378374 287472 48698 88101
19514 88101 275984 269131 69824 -84705 53670 217775 397480 359575 404736 120486
19504 120486 120815 202034 390304 314722 439578 745891 915936 1042643 663657 340476
19494 340476 482511 983481 1662267 2420502 3048052 3013902 2742069 2416834 2015734 1456457
19484 1456457 1285590 1039959 973815 601360 432420 409158 297239 150707 302679 251033
19474B51033k7996n6293K9952L3061j5152J71688j0277O1247M0110l9564M4455
19463D82264j19137j02565K9022J48428o3043L06193R9568L39066j1040l38247
19453G70509n7810Q3213j17188j81526J581r7303n7324J29597J77639M2565j19711
19442E74242m5035K05296J83221R7961K14184o3564k66924l91549k66545o6692
19432A74595M3760o4938l19045p0602K3093J72388J49799J83238J51686K77536
19422G21510P6379P1447K23110J77319J10046q4892j22733o6807k39444j20487
19412G45448k2252J49963k01437N5166L66820p1801k26859k73322O8264L09202
19402H99192m8347j43883Q0682P9249L5318j18734j07614k51034l52830j42781
$$ plain form
19474 251033 223037 166744 196696 229757 214605 386293 376016 437263 477373 437809 482264
19463 482264 363127 260562 289584 438012 374969 681162 780730 1119796 1108756 770509
19453 770509 712699 795912 678724 497198 498779 401476 344152 473749 651388 693953 574242
19442 574242 529207 734503 917724 1015685 1229869 1166305 899381 507832 241287 174595
19432 174595 218355 153417 -165628 -236230 -213137 -40749 109050 292288 443974 721510
19422 721510 797889 869336 1092446 1269765 1379811 1294919 1172186 1105379 865935 745448
19412 745448 723196 873159 671722 726888 1093708 1021907 795048 521726 589990 899192
19402 899192 850845 706962 787644 866893 902211 783477 675863 424829 71999 -70782
19392g0782J12613j63728J46870L5750L9572Q5149j37223j22292L25073L06749
19382E57751L2994J18659j26658o0456N7000K23964J45956k30640l24482q3494
19372C10594K10565J01944K34253K53151J44000J66905O9821j38167P6809j66493
19362A263382n82214l31118r0234l48925n5260K13965R5858K66509L6862j16813
19352C52012l44442k05696Q5346j14324J06440J15483J11912L05870q2034j40380
19342A90187L6585k3287L199q282L0298J0238J54811k88371l26108N4408j10739
19331b77061J00412n427j23110J95389K32599l2819L2657j142l6548k23308K39998
19320A01640K96616j54147j10461j27060j99316k8252l2727J39475K27106J11716
$$ plain form
19392 -70782 41831 -121897 24973 60723 100295 185444 48221 -74071 251002 557751
19382 557751 590745 709404 582746 522290 579290 803254 949210 718570 394088 310594
19372 310594 521159 623103 857356 1110507 1254507 1421412 1491233 1353066 1429875 1263382
19362 1263382 681168 350050 259816 -89109 -144369 69596 165454 431963 468825 352012
19352 352012 7570 -198126 -112780 -227104 -120664 -5181 106731 412601 330567 190187
19342 190187 226772 203485 206684 198402 228700 238938 393749 105378 -220730 -166322 -277061
19331 -277061 -176649 -182076 -305186 -109797 122802 89983 122640 121498 84950 -138358 101640
19320 101640 398256 244109 133648 6588 -192728 -220980 -253707 -114232 112874 224590
19310B24590p7978K13785P8215m7711j92494k0108j1856n6742j4801J34096r1086
19299A37910K9471L2019j71760j06594j80554J15542o7421j6675L39357P4195
19289A85490k82276J48828Q9928O6763J40305L0265m37950l34246R5219k4312
19279c21986j48116j30827J70357L17182J00841M9175k04592q1093M69970P6438
19269B97349P664k80884k55711j02112Q8246l6225j68021M4366L92133m5259j67845
19258b26299O9630J56632M3328j64393m4344J76463n1145l05424J76292L25803
19248A56543J09437j7320n2761j91357k70332M7466M89366L38272l05536k75893
19238B7885o1371o4046K7557O4015r257J68198J79529j53310n0854J74927P8264
$$ plain form
19310 224590 146612 360397 438612 390901 198407 178299 166443 109701 94900 228996 137910
19299 137910 167381 199400 27640 -78954 -259508 -143966 -211387 -228062 111295 185490
19289 185490 -96786 52042 141970 208733 349038 379303 -58647 -392893 -297674 -321986
19279 -321986 -470102 -600929 -430572 -113390 -12549 36626 -167966 -249059 220911 297349
19269 297349 305013 24129 -231582 -333694 -245448 -281673 -449694 -405328 -13195 -58454 -226299
19258 -226299 -156669 -37 43291 -121102 -165446 11017 -40128 -345552 -169260 156543
19248 156543 265980 248660 195899 4542 -265790 -218324 271042 609314 303778 27885
19238 27885 -33486 -97532 -69975 -5960 -15217 152981 332510 179200 128346 303273 381537
19227C81537j97028q5548J23579J97750j2097k70740j176L5052q5772j12285n4959
19216h1687K83847J78349o0039k90804k92772P4285j16822j90248m8355Q5038
19206d59208N0093L9271J16618L7616K06821L5716j50687K49388J44795k5882
19196B44541J82633O0769o2387p6089L1580L9226J05762l00916r3411m3025j10576
19185b1893j43668J72747P5385K60876K93087R2314J25870J03659p9790l8748
19175H39839o6066L84902J10142j15586n3454k12747N7183j34827k66267q9807
19165D53312j9816l7714q7244k66446p4215N6670l0918j39946L02334J75822k9944
19154C01895j66769K7747P012l3936k80611j88832J52310J80330j00267j80882
$$ plain form
19227 381537 184509 98961 222540 420290 408193 137453 136277 171329 85557 -26728 -81687
19216 -81687 202160 380509 320470 29666 -263106 -188821 -305643 -495891 -544246 -459208
19206 -459208 -409115 -369844 -253226 -215610 -8789 26927 -123760 125628 270423 244541
19196 244541 427174 487943 425556 349467 381047 420273 526035 225119 131708 88683 -21893
19185 -21893 -165561 7186 82571 343447 636534 728848 854718 958377 878587 839839
19175 839839 773773 1158675 1268817 1153231 1099777 887030 944213 809386 543119 453312
19165 453312 433496 395782 308538 42092 -32123 24547 -6371 -146317 156017 331839 301895
19154 301895 135126 162873 169885 135949 -144662 -333494 -181184 -854 -101121 -282003
19144b82003n439K2140K63650L11065Q9708j38693J30085n3896j32042q7968N5527
19133A72134O1324J7796j57832Q489K11922r1085m43437o8820K19378k1809o1846
19122a53786J35052J22708O9666j75707M3689K93257O9558j09924J3021j30215
19112A77319j06896J1148j79546J05925j16635k66200l8192Q3392J01284j48645
19102c77046J54954k09633j32929J53402L42709L34682j09006k689n8693r5975
19092b24k62826j06516j69162K46772J4941J17919R496k22639J06238O1908K01059
19081c034k25948L849O057m8801K30228J74927j1193j21667j42277R4774n0146
19070i3231n16357P6191K15927J30054n4284k3991l1031j73935J83549L05464
$$ plain form
19144 -282003 -287442 -265302 -1652 309413 399121 260428 390513 336617 204575 116607 172134
19133 172134 233458 251254 93422 101911 313833 222748 -220689 -289509 -70131 -91940 -153786
19122 -153786 -18734 103974 173640 -2067 41622 334879 404437 294513 307534 177319
19112 177319 70423 81571 -97975 7950 -108685 -374885 -413077 -329685 -228401 -377046
19102 -377046 -222092 -431725 -564654 -411252 -68543 266139 157133 154444 95751 -224
19092 -224 -263050 -369566 -538728 -291956 -277015 -159096 -149600 -372239 -266001 -204093 -3034
19081 -3034 -228982 -225133 -219076 -267877 -37649 137278 126085 4418 -137859 -43085 -93231
19070 -93231 -609588 -533397 -317470 -187416 -241700 -265691 -296722 -470657 -287108 18356
19060A8356j43402o15278J14369L59372J51679m7833n8855l24074j05101M68123
19050a82644N45173j93189N490J27635j86181j49866o8010K0310R801J30611Q5885
19039A45015L0974j66210r3440Q7647q1638o0037J54316J40710l0578l26808j14787
19028c14836J10650J71471j87667q4875j30122M6679j44377J58823r629R4609
19018b89274J36000J11241K18476L6109o5744r3870o863k07573M0913n7323J53731
19007b4177R1704O1271L75356J80899k56190l06079l2743O3723J4993p3669L22358
18996D17446j00507m00197K39678j21807j78251J13895p1101o4040J16786J04462
18986E6364K00084r3068k60697j32860Q9153J88053l0144o5040j10711J54274
$$ plain form
19060 18356 -125046 -740324 -625955 -266583 -114904 -162737 -221592 -545666 -650767 -182644
19050 -182644 362529 169340 174830 302465 116284 -33582 -101592 -81282 -71481 59130 145015
19039 145015 175989 9779 -83661 3986 -77652 -137689 16627 157337 126759 -200049 -314836
19028 -314836 -204186 -32715 -220382 -305257 -435379 -388700 -533077 -374254 -383883 -289274
19018 -289274 -153274 -42033 176443 212552 146808 52938 46075 -161498 -120585 -177908 -24177
19007 -24177 67527 128798 504154 685053 428863 122784 90041 153764 168757 95088 417446
18996 417446 316939 -83258 156420 34613 -143638 -29743 -100844 -164884 -48098 56364
18986 56364 256448 163380 -97317 -230177 -141024 47029 16885 -48155 -158866 -4592
18976d592J18397J68606R1871j50809j13963m52160l19014K41651K14480K73164
18966F7631m9639j3491p2362j96231l63644q0040K2134K63749j28774k08574o8620
18955h27861J70066L58498K74426l75479q434r4457J76361J91104n6201j9666
18945b11643O0173K5613q5919J6372n707J62467o6686J30781j06835j92658J8643
18934b55399j46278R6668K87302j51139l1361j0441L18339K9690j40986q8948
18924i2553M3484K666p3334j41334O5770J72533J56570N5498P2769K31926j2652
18913D81343l01943j43532p0177j66245l0445L6224L50256J42160m01254j74872
18903b78485K14100j56941m03N2110K37953J5436k1006P308R4700M3408J33383
$$ plain form
18976 -4592 113805 282411 374282 223473 109510 -342650 -661664 -420013 -205533 67631
18966 67631 17992 4501 -67861 -264092 -627736 -707776 -685642 -421893 -550667 -759241 -827861
18955 -827861 -657795 -299297 -24871 -400350 -408784 -503241 -326880 -135776 -191977 -211643
18945 -211643 -151470 -125857 -211776 -195404 -201111 -38644 -105330 25451 -81384 -274042 -255399
18934 -255399 -401677 -305009 -17707 -168846 -200207 -210648 107691 137381 -3605 -92553
18924 -92553 -49069 -46403 -119737 -261071 -195301 -22768 133802 189300 262069 493995 481343
18913 481343 179400 35868 -34309 -200554 -230999 -194775 155481 297641 -103613 -278485
18903 -278485 -64385 -221326 -221729 -169619 68334 83770 62764 70072 164772 208180 341563
18892C41563m4423j94188k94519k06929j08008j61936L33399J11047R4133J06316
18882b3545K21272k7656J2617r0221k03084N7837L25420J14431m6458j75340K2888
18871A88161j38058j75640k36738K01646R3006l7299J12125n3455J312k5070q2299
18860a52309K49307K03267P4552l61613l12912K18887K38083J57837O399K8345
18850C49843j56759j78156J42090J02507j87382L0611j10344J1810j22204J74395
18840E6411N157m3246J06094k9874l4192j93454l6962N4788j81200j05160M5859
18829c55779K19171n3893k23910l0086J96102N036k31726j8639K01942q7006m9254
18818d28042O0632J16571j61238K04082R2945j02737k92155J3565L79412L20977
$$ plain form
18892 341563 297140 102952 -191567 -398496 -506504 -668440 -335041 -223994 -129861 -23545
18882 -23545 197727 170071 182688 92467 -110617 -52780 272640 387071 340613 165273 188161
18871 188161 50103 -125537 -362275 -160629 -67623 -104922 7203 -46252 -44940 -70010 -152309
18860 -152309 96998 300265 374817 13204 -299708 -80821 157262 315099 321498 349843
18850 349843 193084 14928 157018 259525 72143 102754 -7590 4220 -117984 56411
18840 56411 61568 18322 124416 94542 60350 -133104 -170066 -115278 -296478 -401638 -355779
18829 -355779 -136608 -190501 -414411 -444497 -248395 -243359 -475085 -493724 -291782 -378788 -428042
18818 -428042 -367410 -250839 -412077 -207995 -115050 -217787 -509942 -496377 -116965 204012
18808B04012j37767L3296L38318q1733k00949J39097k89733k50982J78832K07843
18798A40234j12183p1245j86031J3124M5827q336j50137k07231K46301Q6724J20203
18787h2750j62769J02902L82127j61712k1849N728j70007N9735k8380J06441K96972
18776C26438m6572k09421K47224p680o975L6400M3960K176k52863k03017k1114
18765i1444j98192j03132j79560k57712R3771J73298J90737J20963j15551K7505
18755c39317J10569p980J96910J08788k36405k38818j03911O6612n0591p0509
18745e64652J1734K13587J25143p3719j00545J63981K28829q575n2309r1233n9159
18734b06918j5731q5327q0262J90711J11366m0883K49678P8695Q6935j11452J17417
$$ plain form
18808 204012 66245 99541 437859 356126 155177 294274 4541 -246441 -67609 140234
18798 140234 28051 -43194 -229225 -216101 -170274 -178610 -328747 -535978 -289677 -202953 -82750
18787 -82750 -245519 -142617 239510 77798 55949 61677 -108330 -48595 -76975 29466 326438
18776 326438 279866 70445 317669 309989 303014 339414 383374 385550 132687 -70330 -91444
18765 -91444 -289636 -392768 -572328 -830040 -736269 -562971 -372234 -251271 -366822 -339317
18755 -339317 -228748 -236728 -39818 68970 -167435 -406253 -510164 -443552 -494143 -564652
18745 -564652 -552918 -339331 -214188 -287907 -388452 -224471 4358 -4217 -56526 -147759 -206918
18734 -206918 -222649 -307976 -388238 -197527 -86161 -127044 122634 201329 288264 176812 294229
18723B94229M9399j42349J73935m2891k79608m29488l44952J34105M33169L28217
18713A73766J89904k34200j20823K3274j15931j14816p6480O0486J45614n1662
18703a20868j09727K04593J05875r416j00101k3124n119k04482j09307K07540
18693a64136L3850m2915K8323J15863J88248j72238k44967J00314P7475O2213
18683a7970L8371J92Q4350K6846k1535P3830k70087m4453N4280j14523p002O9843
18671a27858O5247l14428j77264K83000M26765M6989N8589r2942k82609q9532
18661b04043q7159j39431Q6186M5094J14711m7993J75187J27556o5345j8220J73884
18650A60427J71166k1242k16372j19460j32968K44253N5422j33006j01195N2994
$$ plain form
18723 294229 343628 201279 375214 332323 52715 -376773 -721725 -587620 -154451 173766
18713 173766 363670 129470 8647 31921 -84010 -198826 -275306 -214820 -69206 -120868
18703 -120868 -230595 -26002 79873 70457 -29644 -52768 -57887 -262369 -371676 -164136
18693 -164136 -130286 -173201 -144878 -29015 159233 -13005 -257972 -157658 -80183 -17970
18683 -17970 20401 20593 104943 131789 110254 184084 -86003 -130456 -76176 -190699 -197701 -127858
18671 -127858 -62611 -377039 -554303 -271303 155462 202451 261040 168098 -114511 -204043
18661 -204043 -291202 -430633 -344447 -299353 -184642 -232635 -57448 70108 4763 -13457 160427
18650 160427 331593 310351 93979 -25481 -158449 85804 141226 8220 -92975 -39981
18640c9981r4032n207J54758j34508k32573J3886J65119o8976N6311J18014J13425
18629D6236J25575J82962p2345l23088m8851J11477K77358R5514j1826k0646k63765
18618I8601M1692j8985J63351O0927j61808k32071j95320p4120j15492j38289
18608e71514L17051L09074K01534J20583j69776j00222j54215J63042o0592k07381
18598a52416j39320j03008L99905J78596q3471j3003k32784N7459j41766o8889
18588b98697J19344p3441K35954K14013J9882j67058k62785M8681M8074j2727
18578a28760p8830r2682l9227Q8691K22883N7708j36175j78222J76693j82652
18568b90573k49014J33487K51227Q4579n0180L40193R717k65798l92789L3754
$$ plain form
18640 -39981 -134013 -139220 15538 -118970 -351543 -337657 -172538 -241514 -185203 -67189 46236
18629 46236 171811 354773 282428 -40660 -89511 21966 299324 394838 383012 362366 98601
18618 98601 140293 121308 284659 345586 183778 -48293 -243613 -317733 -433225 -571514
18608 -571514 -254463 54611 256145 376728 206952 106730 -47485 115557 54965 -152416
18598 -152416 -291736 -394744 5161 183757 100286 87283 -145501 -88042 -229808 -298697
18588 -298697 -179353 -252794 -16840 197173 217055 49997 -212788 -164107 -116033 -128760
18578 -128760 -207590 -300272 -339499 -250808 -27925 29783 -106392 -284614 -107921 -290573
18568 -290573 -539587 -406100 -154873 -70294 -120474 219719 229436 -36362 -429151 -395397
18558c95397J42511M5815j75599J22395J49295l2634K8287K6274O8485K59293
18548B38725j31640M4248K92676k32953N2116j28200j63007k0499L54958p2681
18538B33743j91047l8465J6153r1761k33231k29655J48660L98883K40807l264
18528B50823j31869J84876r284k12782j89966n3208J63198J4859M6419M7868l452
18517A07482j42056M0504O6623P6171J14652k56499j83244J85363K45672j0820
18507B43848l03664k93976J6807J79722j20170j94319L9576J84101K33788j9520
18497c3807k23395j41755N1704O9786J79130J05285J35303k89898j5229j71542
18487c34418n4965Q0749j08977Q4531J87992O7825j52026k79079j10229j03875
$$ plain form
18558 -395397 -252886 -207071 -382670 -260275 -110980 -143614 -115327 -89053 -20568 238725
18548 238725 107085 151333 444009 211056 263172 134972 -28035 -48534 306424 233743
18538 233743 42696 4231 20384 -71377 -304608 -534263 -385603 13280 254087 250823
18528 250823 118954 303830 294546 81764 -108202 -161410 1788 16647 63066 110934 107482
18517 107482 -34574 5930 72553 148724 263376 6877 -176367 8996 254668 243848
18507 243848 -59816 -353792 -336985 -157263 -277433 -471752 -432176 -248075 -14287 -33807
18497 -33807 -257202 -398957 -347253 -277467 -98337 6948 142251 -147647 -162876 -334418
18487 -334418 -389383 -308634 -417611 -333080 -145088 -77263 -229289 -508368 -618597 -722472
18477g22472R601R318J70417K00340L012j1887O1032J87898j1549r2464q1789
18466b78543K28905l9247j64256j09002n0267K03906K54015k07088L8788M82O7696
18455e4611n6106o0390q0878j02971j6502m3602L1550Q2874Q4534j42652j80561
18444e39315K352K74735N5661n5042j48263J4239L7788K95030K70974m4639k21386
18433e7866k11574k4212M5465J1029j00827j2194L34570m149j1802J71026r8272
18422D1194r4055J78374J30356q4779j76031j2357J8287J53650N5531N0027J7811
18411B78008n0572J65371Q9612k56961j69178K13827J78745q7191m5545L3467
18401C49583M4664j5220l10391k21297q8251J01735J70727J52067K96408J14148
$$ plain form
18477 -722472 -712871 -703553 -533136 -332796 -329784 -341671 -280639 -92741 -104290 -196754 -278543
18466 -278543 -49638 -88885 -253141 -362143 -412410 -208504 45511 -161577 -122789 -122307 -54611
18455 -54611 -110717 -171107 -251985 -354956 -371458 -415060 -383510 -300636 -216102 -358754 -539315
18444 -539315 -536963 -262228 -206567 -261609 -409872 -395633 -357845 -62815 208159 163520 -57866
18433 -57866 -269440 -293652 -248187 -237158 -337985 -350179 -15609 -19758 -31560 139466 41194
18422 41194 -52861 125513 255869 171090 -4941 -17298 989 154639 210170 260197 278008
18411 278008 227436 392807 482419 225458 56280 270107 448852 361661 316116 349583
18401 349583 394247 379027 68636 -152661 -240912 -139177 31550 183617 480025 594173
18391E94173k18353l64880l5155L30377M9719m1185j64616j817Q9275r7864M3805
18380A83479r5094l8305j38551p9477q9269O0015J60568P0019k22554j9663M6502
18369a62330J18121n3537j07669K02318K13673j89772j70496o9535l354J40352
18359h2229J53375n7456k43655o1689J11543o4681J45939J78725j32684r6284
18349a49096q9588M7700Q1928n9978J812J73429J06870j9698j52903n7096k72540
18338c89160j63436K4463J79448J26873o2455n16974m4090N48095J85784R8935
18328a2517k76174r4471J77030J0670J91829N6815J7303l4423j53157j23466k6762
18317b67323K0950k50604j10385K06354L43504o916j75400j49423q888R8593l454
$$ plain form
18391 594173 375820 10940 -24215 306162 355881 314696 150080 148263 237538 139674 183479
18380 183479 88385 50080 -88471 -167948 -257217 -197202 -36634 33385 -189169 -208832 -162330
18369 -162330 -44209 -97746 -205415 -3097 210576 20804 -149692 -219227 -222581 -82229
18359 -82229 71146 13690 -229965 -291654 -180111 -244792 -98853 79872 -52812 -149096
18349 -149096 -238684 -190984 -109056 -169034 -167222 6207 113077 93379 -59524 -116620 -389160
18338 -389160 -552596 -528133 -348685 -221812 -284267 -801241 -845331 -297236 -111452 -12517
18328 -12517 -288691 -383162 -206132 -195462 -3633 53182 70485 36062 -117095 -240561 -267323
18317 -267323 -246373 -496977 -607362 -401008 -57504 -64420 -239820 -389243 -398131 -299538 -302992
18306c02992J48751j68586K3500K97209k6562J17945M0893L2159j69871k13450
18296b21004p7551k7282l9200K70375O4383O0533k8231k87962j00768N4184l3075
18285c65598q9037K54421K64772j85103o9881m20320k07122j4260J14627K85089
18275d32412K10054j7108j32919Q7441J57759J41376J85165J56976j57100M7010
18265B46242j77174K6143l8903n8486J07200O8390P048j81808n4217k75545K6063
18254c05047L32823j31854q0920K67975K19687J19108k19356k52076k29692O1725
18244b17627p9534P8668k0963j41683N6113l8066J5617Q7443L7090L4968K102
18233a85872R2972J82574j75478j47918R2446J06484r8576m9319Q1836M6696K01261
$$ plain form
18306 -302992 -154241 -322827 -299327 -2118 -28680 89265 130158 162317 -7554 -221004
18296 -221004 -298555 -325837 -365037 -94662 -30279 30254 2023 -285939 -386707 -332523 -365598
18285 -365598 -454635 -200214 64558 -120545 -190426 -610746 -817868 -832128 -717501 -432412
18275 -432412 -222358 -239466 -372385 -284944 -127185 14191 199356 356332 199232 246242
18265 246242 69068 95211 56308 -2178 105022 173412 180460 -1348 -55565 -331110 -305047
18254 -305047 27776 -104078 -184998 82977 302664 421772 202416 -49660 -279352 -217627
18244 -217627 -297161 -218493 -239456 -381139 -325026 -363092 -347475 -260032 -222942 -187974 -185872
18233 -185872 -92900 89674 -85804 -233722 -141276 -34792 -133368 -182687 -100851 -54155 147106
18222A47106K22968p5357j27012M2083K37118m03663j51961p1674j83487J27351
18212b36528J32621J44915j17997J25077j09208l00163L9371J55035J44435K55259
18202B32817r6649o568j80245j81870J33606L24171K66877K15622M2582k21992
18192E28351k29528j89737l56703Q859K52503R9080j36727j8257J04006J05568
18182A67415P4763k4383k918J1878j20098K1936k4288j32782j84199o3455K04266
18171g1865j53460J14596K75030N5906K13500K13133L32211N44446L10137J04761
18161A938395P25485J020451M78254J92744m5613j6359r6498l28981o99872o24332
18151B543674n36295k73034k44168k53684k62051k27467r752L18643N3349l84042
$$ plain form
18222 147106 370074 294717 167705 209788 446906 43243 -108718 -180392 -363879 -236528
18212 -236528 -103907 41008 -76989 48088 -61120 -361283 -321912 -166877 -22442 232817
18202 232817 136168 129600 -50645 -232515 -98909 225262 492139 707761 750343 528351
18192 528351 298823 109086 -247617 -238758 13745 112825 -23902 -42159 61847 167415
18182 167415 242178 217795 214877 226755 106657 128593 104305 -28477 -212676 -276131 -71865
18171 -71865 -225325 -110729 164301 220207 433707 646840 979051 1523497 1833634 1938395
18161 1938395 2663880 3684331 4162585 4355329 4309716 4293357 4196859 3867878 3168006 2543674
18151 2543674 2007379 1734345 1490177 1236493 974442 746975 737223 1055866 1109215 725173
18141G25173j85860j65631q6286J03266k1971J11283K30317l6988k24566n26868
18131g8131p9269O421L030J24915J78852L0883P2077J58931l2657j89509P5938
18120B71481J63141L12595Q8108k82172j95890m4642J14103j75490j9632K54643
18110D86245j00357J6009L15425m7332j20248k12954m42427k06954J29575p7551
18100b60569J75292Q8058J00725l10950k54285p8571K72354J57967J67459m9689
18090G791k03424j01816M26027K63260l20620j4196J67535l75038r6699R4872
18080a52308J90920J49366M3335k82940k97229j17952P4066k4488K34701K96643
18070A14114L78772J42621j15052p8521K79970J59208j51468l46360j06379L9735
$$ plain form
18141 725173 539313 373682 287396 390662 368691 479974 710291 673303 448737 -78131
18131 -78131 -157400 -150979 -147949 -23034 155818 186701 258778 417709 385052 195543 271481
18120 271481 434622 747217 835325 553153 357263 312621 426724 251234 231602 486245
18110 486245 385888 401897 717322 669990 549742 336788 -105639 -312593 -183018 -260569
18100 -260569 -85277 2781 103506 -207444 -461729 -540300 -267946 -109979 57480 7791
18090 7791 -195633 -297449 128578 391838 71218 57022 224557 -150481 -247180 -152308
18080 -152308 38612 187978 231313 -51627 -348856 -466808 -392742 -417230 -182529 114114
18070 114114 492886 635507 520455 441934 721904 881112 729644 383284 276905 316640
18060C16640n7606q6445l9352J21534n8891l2509Q5428L3485m5239j42847j01701
18049g503R5274l63691k59758L06665K86751M6208l35175m16896m2659J49225
18039e41559J92551K16017P0414J0248k3349L1859J1458J1460o2960k9284J27123
18028A3978N0534J29350J63714k96663M7811k30600j20468L38544J72786Q6475
18018C55461n968k63068m48548R6960K50483J69140p160J62527L5394l6534q0649
18007B28038M103R3733P676n4705K06444P2326j30505Q2937n1170k08129o4551
17996A86197j186j76266R6468J93072P5411L25493L3840q6050L3738k24211j21569
17985C34937Q5800p061k4125K0532J8191j73742k8460K2341J37022j29474N6693
$$ plain form
18060 316640 259034 172589 133237 254771 195880 163371 248799 282284 237045 94198 -7503
18049 -7503 87771 -275920 -535678 -229013 57738 103946 -231229 -648125 -690784 -541559
18039 -541559 -349008 -132991 -62577 -52329 -75678 -43819 -32361 -20901 -83861 -113145 13978
18028 13978 64512 193862 357576 60913 108724 -121876 -242344 96200 268986 355461
18018 355461 349493 86425 -362123 -265163 -14680 154460 147300 309827 345221 308687 228038
18007 228038 232141 325874 333550 278845 485289 557615 427110 510047 458877 250748 186197
17996 186197 185011 8745 105213 298285 373696 699189 733029 646979 680717 456506 334937
17985 334937 420737 413676 389551 410083 428274 254532 226072 248413 385435 255961 312654
17974C12654k7775j16659L8636P0534M5733j93981R5781M57290N2686o0526M1131
17963G15504r8454j53786m7904J51896P7589o92895l25402j62391O5135K41176
17953b29532L25808j96725p3220J37313K46242R1985J08096J87426k18929k34342
17943A44122J51547m6218k79913k25432j16548K97234K98043L8987j89869k1112
17933E0841M4350J1906k17412K0719J19570p009n3133j0870k88431k92395J55851
17922d66013O0816J24561K40965K40639j87685N3146k63580j19430k11274l4507
17912e62362J10958k9634P6629P6912J12062k33585n4927J11399k10616k0578
17902f23742J14514K03683m4523K59454K33850q2333K04658l7477j81989k01004
$$ plain form
17974 312654 284879 168220 206856 277390 323123 129142 224923 682213 734899 674373 715504
17963 715504 617050 463264 415360 567256 644845 -48050 -373452 -535843 -470708 -229532
17953 -229532 96276 -100449 -173669 -36356 209886 301871 409967 597393 378464 144122
17943 144122 295669 249451 -30462 -255894 -372442 -75208 222835 261822 71953 50841
17933 50841 95191 107097 -110315 -89596 29974 22965 -30168 -41038 -329469 -621864 -466013
17922 -466013 -405197 -280636 -39671 200968 13283 66429 -197151 -316581 -527855 -562362
17912 -562362 -451404 -481038 -404409 -327497 -215435 -449020 -503947 -392548 -603164 -623742
17902 -623742 -509228 -305545 -350068 -90614 143236 60903 265561 228084 46095 -154909
17892a54909k2004N7945L0263J13035J32737j38830K3046K82456N7876m7618m9313
17881B84684q3503R6830j45757k43561O3483K33972P9807j23906k46344Q7957
17871C662j33473P3217L8339j40281j63528o09k28758j17608O0603Q3324j03831
17860f28943J69604K57405R0223J34825J19546l55715J12826J27004m7020j8600
17850c8845K59119J03097N7896k6444J34289K91173l2023Q6313J9699k1867K07242
17839A039649M98937M48487N74827O11755O22305N40377N43945j9431n13248r00236
17829C447367p35680k60115k27312m76057q96697m98520K93670J09382K03893
17820I59931j90484l6310K21543j31662l2864p9654k53832k00904j46097j05944
$$ plain form
17892 -154909 -176913 -118968 -88705 24330 157067 18237 41283 323739 381615 333997 284684
17881 284684 201181 298011 152254 -91307 -27824 206148 285955 162049 -84295 3662
17871 3662 -129811 -56594 -18255 -158536 -322064 -322673 -551431 -669039 -608436 -525112 -628943
17860 -628943 -459339 -201934 -111711 23114 142660 -213055 -100229 26775 -20245 -38845
17850 -38845 220274 323371 381267 354823 489112 780285 748262 834575 854274 832407 1039649
17839 1039649 1538586 1987073 2561900 3173655 3795960 4336337 4880282 4860851 4347603 3447367
17829 3447367 2711687 2451572 2224260 1748203 851506 352986 646656 756038 959931
17820 959931 769447 733137 954680 823018 790154 710500 456668 255764 109667 3723
17810C723J66775R5278j34111O896P4195k57970o8885J60891K78313O0494q5855
17799B99744j15057j60240k09457j5880p301J2459J9312O1990J51746M8686J05650
17788A91652J72459l7947j18761J25633j23032k25051j49926k78698J13452J73804
17778a56415K60350r9758J63048J77975J6846M5457J6575m03678j53343J86022
17768E3079o3094M6537K00828J5003k18373r3197P7596r2822j95155O2615p2307
17757b79290J21162N7206J54916k5657q6654k43747K31346M5102J64170m7011
17747I1543j96491n6134k849K3557O7857J74045P4357n0567k87960k0195j20436
17736c03273o8864m6195j29819L8442J38807K3573l7492J04872L89342J36108
$$ plain form
17810 3723 170498 265776 131665 138561 212756 -45214 -114099 46792 325105 385599 299744
17799 299744 184687 24447 -185010 -200890 -208191 -195732 -176420 -114430 37316 86002 191652
17788 191652 364111 326164 207403 333036 210004 -15047 -164973 -443671 -330219 -156415
17778 -156415 103935 4177 167225 345200 362046 407503 424078 20400 -132943 53079
17768 53079 -10015 36522 237350 252353 33980 -59217 18379 -74443 -269598 -206983 -279290
17757 -279290 -158128 -100922 53994 28337 -58317 -302064 -70718 -25616 138554 91543
17747 91543 -104948 -161082 -163931 -140374 -72517 101528 175885 125318 -162642 -182837 -303273
17736 -303273 -372137 -418332 -548151 -509709 -370902 -347329 -384821 -279949 109393 245501
17726B45501l55282M6564j07489o8940o8334K346L20678n7377k13538k25355P7602
17715d03624J63826R0502K12705r2232m0406k9607r2098O1225K18914P2067q1434
17704G9838k19408p7262j87633p8575k748o5658K68706K56837M7382m7101K7410
17693A788j27057l7087k0654K8311p099l950M194m6607R5585J3678l3765j99254
17681c31917L05937K45034L5397J04223q937k05254j60649r1631j25952L5701
17671a98048J48118K88757j56535m5405J5510m6149j11723R7309K98578j88527
17661A01885k9778K90018L4535P4583Q971k00526l18946l67073j25079O8991m7554
17650e09973N8306p9097P2002J46975L84858j44210j14379J37215J6297K12938
$$ plain form
17726 245501 -109781 -63217 -170706 -239646 -307980 -305634 15044 -42333 -255871 -481226 -403624
17715 -403624 -239798 -149296 63409 -28823 -69229 -98836 -190934 -129709 89205 161272 79838
17704 79838 -139570 -216832 -404465 -483040 -485788 -551446 -282740 -25903 21479 -25622 1788
17693 1788 -125269 -162356 -183010 -154699 -161798 -165748 -161554 -208161 -112576 -98898 -132663 -331917
17681 -331917 -25980 219054 254451 358674 349737 144483 -16166 -107797 -233749 -198048
17671 -198048 -49930 238827 82292 36887 52397 6248 -105475 -8166 290412 101885
17661 101885 72107 362125 396660 471243 480214 279688 -39258 -406331 -531410 -462419 -509973
17650 -509973 -451667 -530764 -458762 -311787 73071 -71139 -185518 -48303 -32006 180932
17640A80932K81728k65385k75349k9676k04094j76156K42940q8204J3867J43572
17630a75825K8116N723K17888j91136P0806M1623j79190J58963l35983o5846J44203
17619b80658K35038R9384j08016q5460j87561j26211J6292K46702J62968L10731
17609B83209K64403o211q2331k47618K34927m774l73405j60643K8707r4806K8243
17598a30299J52337m3504k18933J62723K75733J28815k61997K3017n3891J40595
17588A74596M48621k57063l51086j45229J03906n7472k62772j59864L03093P817
17578a95453j88164m4725q1154K87653Q2560J31904J03598j2279L52546k46177
17568A90309l00759j47135K49960M4196j61530J06037J81076J27413J24770Q365
$$ plain form
17640 180932 462660 197275 -78074 -107750 -311844 -488000 -245060 -333264 -319397 -175825
17630 -175825 -147709 -141986 75902 -115234 -44428 -2805 -181995 -23032 -359015 -424861 -280658
17619 -280658 -45620 53764 -54252 -139712 -327273 -453484 -437192 -190490 -27522 283209
17609 283209 547612 541401 459070 211452 446379 441605 68200 -92443 -63736 -158542 -130299
17598 -130299 22038 -21466 -240399 -77676 198057 326872 64875 87892 34001 174596
17588 174596 623217 366154 15068 -130161 -26255 -83727 -346499 -506363 -203270 -195453
17578 -195453 -383617 -428342 -509496 -221843 -139283 -7379 96219 83940 436486 190309
17568 190309 -110450 -257585 -7625 36571 -124959 -18922 162154 289567 414337 422702
17558D22702r8116l02733L4616p1605K4548n1076N2985P0092Q7091j1763k07855
17547e1114R5835o2170N6289J62846K15191j18606j42640J13557J03727l791j14810
17536B54314r2021Q7488K27926L62179l8327k83220j96932P411O6170K8491Q3754
17525E07233m5413k9269m3107Q7559N561J21507M7613O5654K42714K81837M24218
17514A666107K89409N31981Q34718M84755M79758L81753l50815o96283o09677
17505C011706m77601k46761k22781m30000m72841k27232k19616l00317k78052
17496A36505k35671n3829N24942K3941k5389j26002L5415j27335r5482j7796J81993
17485B21292L2966J52940K36310l62665k30512K41652J54683k37277o9346J24084
$$ plain form
17558 422702 324586 21853 56469 -15136 9412 -41664 11321 81413 168504 156741 -51114
17547 -51114 44721 -17449 38840 201686 416877 298271 155631 269188 372915 369124 254314
17536 254314 162293 249781 477707 839886 801559 518339 321407 328818 394988 423479 507233
17525 507233 461820 432551 389444 477003 482564 604071 651684 717338 960052 1241889 1666107
17514 1666107 1955516 2487497 3322215 3806970 4286728 4668481 4317666 3621383 3011706
17505 3011706 2534105 2287344 2064563 1634563 1161722 934490 714874 414557 136505
17496 136505 -99166 -152995 371947 395888 370499 244497 279912 152577 57095 39299 221292
17485 221292 254258 407198 643508 280843 50331 291983 446666 209389 140043 264127
17475B64127O9625Q6075j12732k15277j53669J57848K52439K75957j61924j94110
17465B68359j52452K43610J52461j18104k48458l24297Q542K772J48054L03561
17455B84048j40701k06248j3857L491R4853r2062j45268l7309l3081o7006K10792
17444a42348J42467l1002K06223j2344M2463J63420q2004j44801k719M4377l64922
17433a81190J8590o5606J21592K58193j6810l76253o9775R1506q6777M8687J80245
17422g7598J18292J40946j10193j69616k0393p6517p3643J64821R8528j9314J63688
17411A39001j7665p9723j03675j94762l09896J33774K13787K61043m4448l67458
17401c70022k50188L62284L57153J61075l4697o509q3229j83085k85064l11441
$$ plain form
17475 264127 333752 419827 307095 91818 -61851 95997 348436 624393 462469 268359
17465 268359 115907 359517 511978 393874 145416 -178881 -170339 -167567 -19513 284048
17455 284048 143347 -62901 -76758 -73267 21586 -70476 -215744 -253053 -286134 -353140 -142348
17444 -142348 119 -30883 175340 162996 205459 368879 286875 142074 139355 183732 -181190
17433 -181190 -162600 -228206 -106614 151579 134769 -241484 -311259 -219753 -306530 -257843 -77598
17422 -77598 40694 181640 71447 -98169 -118562 -195079 -268722 -103901 -5373 -24687 139001
17411 139001 121336 41613 -62062 -256824 -566720 -432946 -219159 41884 -2564 -370022
17401 -370022 -620210 -257926 99227 260302 225605 219096 135867 -47218 -332282 -643723
17391f43723k27871J16374M45466K63127J59578J38939M3913R5119j56951L6279
17381B70250r5829k0816J4513L3998j19897k57618K5274M18727K01556J01079
17371E71237l93086l37382r7315J06862m2825j1336k36366L1574K50119K16652
17361E8134K06909k33280l73853k69528K69118K38753O5674J919L01412p4288
17351A90970J19441o6822j00563j25764J2858M4560O3578j08417j12785j11067
17341a94011j61027J11415J28454J19649J08288o1764q7099J21933M295J04912
17331A95045j17201k54957o3395K28662K26981j50184j55252N1076k72888J02928
17321b09185K12516J28060L2052J99883k04060j23554j6043p2245j09493M4435
$$ plain form
17391 -643723 -871594 -755220 -309754 -46627 112951 251890 295803 390922 233971 270250
17381 270250 174421 153605 168118 202116 82219 -175399 -150125 268602 470158 571237
17371 571237 178151 -159231 -256546 -149684 -192509 -203845 -440211 -408637 -158518 58134
17361 58134 265043 31763 -342090 -611618 -342500 -103747 -38073 -36154 265258 190970
17351 190970 310411 243589 143026 17262 30120 74680 138258 29841 -82944 -194011
17341 -194011 -355038 -243623 -115169 4480 112768 51004 -36095 85838 90133 195045
17331 195045 77844 -177113 -240508 -11846 215135 64951 -90301 -39225 -312113 -209185
17321 -209185 3331 131391 163443 363326 159266 35712 19669 -52576 -162069 -117634
17311a17634j11343J5404K77888J10940j48526p6494p0458J1493q7025m3379Q5893
17300a53241l0730q5465J7592M7501L20318L52037k39903j94986j81721K3415
17290a25183K0198j63047L7210R5257k2015K1181p2614k13169P2054q9194Q0131
17279c59191K83793r5985m765j66437J81276j32749q8027L24528J77914l346j16667
17268C44o1581J30025j9115n8959K6303o6443J36554P4102q4059j35027p9207
17257a37063J41122J34838P1287k89434j33818J51956K90655p0740j31232j58195
17247a30624K7496q0927j09640J06574J70689j613j38131J37819j07883j66398
17237b92638j26141K7312J31406J04542R6461o5822o9603J60355K30150Q5985
$$ plain form
17311 -117634 -228977 -213573 64315 175255 26729 -49765 -120223 -108730 -195755 -239134 -153241
17300 -153241 -183971 -269436 -251844 -204343 115975 468012 228109 33123 -148598 -125183
17290 -125183 -104985 -268032 -230822 -135565 -157580 -136399 -209013 -422182 -350128 -439322 -359191
17279 -359191 -75398 -171383 -176148 -342585 -161309 -294058 -382085 -57557 120357 117011 344
17268 344 -61237 68788 49673 -9286 17017 -49426 87128 161230 77171 -57856 -137063
17257 -137063 4059 138897 210184 -79250 -213068 -61112 229543 158803 27571 -130624
17247 -130624 -103128 -184055 -293695 -187121 -16432 -18045 -156176 -18357 -126240 -292638
17237 -292638 -418779 -391467 -260061 -155519 -59058 -124880 -194483 -34128 196022 282007
17227B82007o0403k43289j93184l5029l3778J05730J89307n9178j04965j54223
17217c07005P4790j08949o2334R6212l137J82177k3269j41639K0767K93772q4508
17206f3123j04348r4859L41407o3648j25603l5305q1808r978R58j02074N5324
17195b83057n359q579j75145L3302K93590J40409M9335j25496j32086J34823K00254
17184A21991j24693j44996m1538J25222J32227j37130j70415m0456J30367K605
17174a46816k37972J55994N4709K91538J48698k95117M6944J27022j83320j77443
17164b15763M76412K28197k3971j33485K5912O3544k19556r2896P1448q7400n8423
17153C4019j3200J81631j54160j67252k5991k01403j75466r427J25821K4596k14563
$$ plain form
17227 282007 221604 -21685 -214869 -249898 -283676 -177946 11361 -47817 -152782 -307005
17217 -307005 -232215 -341164 -403498 -307286 -310423 -128246 -151515 -293154 -272387 21385 -63123
17206 -63123 -167471 -262330 79077 15429 -110174 -145479 -227287 -237265 -236307 -338381 -283057
17195 -283057 -288416 -296995 -472140 -438838 -145248 -4839 44496 -81000 -213086 -78263 121991
17184 121991 -2702 -147698 -189236 -64014 68213 -68917 -239332 -279788 -149421 -146816
17174 -146816 -384788 -228794 -174085 117453 266151 -28966 17978 145000 -38320 -215763
17164 -215763 260649 488846 464875 331390 357302 420846 201290 108394 179842 92442 34019
17153 34019 20819 202450 48290 -118962 -144953 -346356 -521822 -531249 -405428 -380832 -595395
17142e95395j0132O30824L86085J25479k48739j17083k19800K02525L04872K2150
17132D80786j70212k18506j25487L7739q1886k17254k6468o2345o44J30965K63301
17121I989J00263O7274k15326J40986J36973k4349J51028j69016j76828j6227
17111D767J30224n321j58762P5395r8177j66157m9241J03436J2577k79267m9283
17100d79809L53741k6442k23008o5211Q0827K78234j55339J14725N7945J8596
17090d5741j94707l3467M8275j19525J4409o4742J17221j14631r1262J23134R6972
17079b64064J38878j98394J9805L43661j61832q8971J41768K11845j06852K1644
17069E7488J76101M8578j37051j06390j74742L7084j38132j14800k0928Q3498
$$ plain form
17142 -595395 -605527 25297 411382 536861 288122 171039 -48761 153764 458636 480786
17132 480786 310574 92068 -33419 4320 -77566 -294820 -321288 -383633 -384277 -253312 9989
17121 9989 110252 177526 -37800 103186 240159 215810 366838 197822 20994 4767
17111 4767 134991 129670 -29092 46303 -51874 -218031 -267272 -163836 -151259 -430526 -479809
17100 -479809 -126068 -152510 -375518 -440729 -359902 -81668 -237007 -122282 -64337 -45741
17090 -45741 -240448 -273915 -225640 -345165 -330756 -395498 -278277 -392908 -484170 -361036 -264064
17079 -264064 -125186 -323580 -303775 39886 -121946 -210917 -69149 142696 35844 57488
17069 57488 233589 282167 145116 38726 -136016 -98932 -237064 -351864 -372792 -289294
17059b89294K75536m2106k06308j2415l524j64265J14998J21375j13066j4115
17049c33184Q3289o3876j37060L64606J91859k25613j5266P2976q5315K8620j3657
17038a32621K94696J25440j36785P6653R014l6126j10344j39112j9933Q3467L7040
17027E1389K04381m9415o2225j69350j04825p370L0270m7547l63303Q8835M8327
17016c80833O7878K54162j55003k7108L92469J96258J14635o7910m06894k05425
17006b17771K9505j63605P3370M81467J71453l03504l14364M4554J25757K38872
16996A65734K18124j00213j54098K80911K33584l53153j64515M7390l105m5205
16986A25454o5253q9609o845j8229j32470q1894m1483N0943j72709l8817Q2358
$$ plain form
17059 -289294 -13758 -55864 -262172 -274587 -278111 -442376 -327378 -206003 -319069 -333184
17049 -333184 -249895 -313771 -450831 -86225 105634 -119979 -135245 -62269 -147584 -118964 -132621
17038 -132621 162075 287515 150730 227383 236397 200271 89927 -49185 -69118 14349 51389
17027 51389 255770 206355 144130 -25220 -130045 -137415 -107145 -154692 -517995 -429160 -380833
17016 -380833 -312955 -58793 -213796 -240904 151565 347823 462458 394548 -12346 -217771
17006 -217771 -188266 -351871 -278501 202966 374419 70915 -243449 -198895 -73138 165734
16996 165734 383858 283645 129547 410458 644042 290889 126374 173764 170659 125454
16986 125454 60201 -29408 -36253 -54482 -186952 -268846 -310329 -259386 -432095 -470912 -388554
16975c88554m4099L3562L09110L88064l39257Q3404M225j61115l1925R4475Q1013
16964B8903j01974p2055k70491n7258J80423R0254O2278R8651j68575K02405O8659
16953F1220K04655j61721k7207J22359n0201r187k44581k26197J63132J32700
16943c5028k0747K04939J76320O01m94584j22643j11904m9272m9823q177j74116
16932f84434J59081L07902J08737J39347j30386l16605K40371J41955J37884J7398
16922A21250k96734m9886Q8740k16330q9614K9348o7551M9405K56204L3682R9563
16911d1923K05117r5864j02649J92362l1433m1091J21994k42738k36862J96940
16901g6147j16269J56317R4150R9520L52385j79979o2015l87650O8178K66101
$$ plain form
16975 -388554 -432653 -399091 -89981 298083 -41174 42230 46455 -114660 -146585 -52110 28903
16964 28903 -73071 -145126 -415617 -472875 -292452 -202198 -139920 -41269 -209844 -7439 61220
16953 61220 265875 104154 76947 199306 149105 139918 -104663 -330860 -167728 -35028
16943 -35028 -55775 149164 325484 326085 -168499 -291142 -403046 -452318 -502141 -510318 -684434
16932 -684434 -525353 -217451 -108714 30633 -99753 -416358 -175987 -34032 103852 121250
16922 121250 -175484 -225370 -136630 -352960 -442574 -413226 -480777 -431372 -175168 -141486 -41923
16911 -41923 163194 67330 -35319 157043 125610 84519 206513 -36225 -273087 -76147
16901 -76147 -192416 -36099 58051 157571 509956 329977 267962 -119688 -51510 214591
16891B14591r1276j58862j48596j85366J306K78897L518k981l33K0948n7235p6448
16879b01837J72287K80042k04717k40173K0070J90673J28471N6462J09927J21286
16869D32491k74239j50748J12624J07994O4587j93971k02388k17367m847p7517
16859d03381K22386J12796n1699j96049k01972j80664K64685L897K11860P8297
16849a39844Q2120j0167j76681N1405R3093N2005J88518j1937l87188L6723L1278
16838a90675r1570J30240p7556k8836m8150J32696M0865j2681n7256k14560J72959
16827b44524P6469R6527k41944o913K94397J98116J28743l45916o9576J57136
16817D2515r0356M4047j74150P711P1098j75226k64767q7065J36608J39923K28546
$$ plain form
16891 214591 123315 -35547 -184143 -369509 -368203 -89306 -85788 -88769 -89102 -68154 -125389 -201837
16879 -201837 -29550 250492 45775 -194398 -174328 16345 144816 201278 311205 432491
16869 432491 158252 7504 120128 228122 292709 98738 -103650 -321017 -325864 -403381
16859 -403381 -180995 -68199 -119898 -315947 -517919 -698583 -433898 -430001 -218141 -139844
16849 -139844 -57724 -67891 -244572 -193167 -100074 -48069 140449 128512 -258676 -221953 -190675
16838 -190675 -282245 -152005 -229561 -258397 -306547 -173851 -132986 -145667 -202923 -417483 -244524
16827 -244524 -168055 -71528 -313472 -320385 -25988 172128 300871 -45045 -114621 42515
16817 42515 -47841 -3794 -177944 -170233 -99135 -274361 -539128 -626193 -489585 -349662 -121116
16806a21116j75302R7423N8506j4032o004K54333K91020k657k21413j23422P613
16795D4949L7530j63579p3466J85146J91864J21511j48253j93091j9414L4732
16785A7929r3355P8716M1707p9717n8701p5662L2603K12254M20801j63498p8194
16774B54883k29099j6528j50369k11738k6002J98040Q3369k09033R9284L59608
16764A52415j25459l06019K8540O6848o0060J89627P6354j36175k35966K52573
16754i7322o502j57328P3799o484j1103k7370O4029j10178k37756l79382r7423
16743i93020L62624L46467L23225M08164l5490m81472j59996L99100J45449j95266
16733A19785J7149j87546j68421K2481J57486j0904j47931j28726L80236O159
$$ plain form
16806 -121116 -296418 -198995 -140489 -154521 -160525 93808 384828 382171 160758 37336 44949
16795 44949 82479 -81100 -154566 30580 222444 343955 195702 2611 -16803 17929
16785 17929 -75426 3290 44997 -34720 -93421 -169083 -136480 75774 496575 333077 254883
16774 254883 25784 9256 -141113 -352851 -378853 -180813 -97444 -306477 -207193 152415
16764 152415 26956 -279063 -250523 -183675 -243735 -54108 22246 -113929 -349895 -97322
16754 -97322 -103824 -261152 -187353 -193837 -204940 -232310 -168281 -278459 -516215 -895597 -993020
16743 -993020 -630396 -283929 39296 447460 411970 -69502 -229498 169602 315051 119785
16733 119785 136934 -50612 -219033 -196552 -39066 -49970 -197901 -326627 53609 59768
16723E9768P3943j19986j44990j06908k861L7167O6429m3179j96824P1176J88239
16712a18026O7056j11662m1962K18093k8086J84789j36246j70223J13516k593
16702b5344q306R5534O9383q1467j86109k35208j24711J48330J63466n8250J45181
16691i7501l00588m5162J24913K99628K76251R4635l56551k86420J38903R6096
16681e5796Q339M9726j79742k45852K7550L12669M49140j90121r0571m1075L4013
16670G8280Q8045q9971n310J75918R2165O9812j3823j15069L4315N8589l01866
16659G1085m41849l165J09593p2169O5724K8124o6171p6265K08716k22165j73666
16648e72208L90971J55044n5384L6636J58241M0867j13640j08420k9949J15121
$$ plain form
16723 59768 133711 13725 -131265 -238173 -241034 -203867 -137438 -180617 -377441 -306265 -118026
16712 -118026 -50970 -162632 -204594 13499 -14587 170202 33956 -136267 -22751 -25344
16702 -25344 -33650 61884 131267 49800 -136309 -371517 -496228 -347898 -184432 -242682 -97501
16691 -97501 -398089 -443251 -318338 -18710 257541 352176 -4375 -290795 -151892 -55796
16681 -55796 -47457 2269 -177473 -423325 -395775 -83106 366034 175913 85342 44267 78280
16670 78280 166325 76354 71044 246962 339127 408939 395116 280047 314362 372951 71085
16659 71085 -370764 -373929 -264336 -336505 -270781 -242657 -308828 -385093 -176377 -398542 -572208
16648 -572208 -181237 -26193 -81577 -44941 113300 154167 40527 -67893 -97842 17279
16638A7279K1515j2724R1938J70618J01504m3337m82360l44741J03464L29530
16628d7314J84414L5418k6085O4316j14270l69361j63464M97315O7498j81596
16618e3129j59479R9924J13155J82046L92050l27445m38428J73621k7870k88323
16608c33878j59542J99875J54318K18088m4944o0006Q62j28913l7178j34762M5288
16597b80792K40521r5541O2403n0365J8921j19259j04937j08495k3483j56573
16587f17600K7482n7260J20234K38011K34850K61572q6935j56141k01516r8918
16577c36221j60924J76045J79710R4172K974p5593j3781J24672j92862k19203
16567d21011J59223K81466J57679K9488l07595J00519p8635q460J89114J31519
$$ plain form
16638 17279 38794 26070 118008 288626 390130 346793 -135567 -480308 -376844 -47314
16628 -47314 137100 172518 146433 210749 96479 -272882 -436346 60969 128467 -53129
16618 -53129 -212608 -112684 471 182517 574567 247122 -191306 -17685 -45555 -333878
16608 -333878 -493420 -293545 -139227 78861 33917 -26089 -25227 -154140 -191318 -326080 -280792
16597 -280792 -40271 -135812 -73409 -123774 -104853 -224112 -329049 -437544 -461027 -617600
16587 -617600 -590118 -647378 -527144 -289133 -54283 207289 120354 -35787 -237303 -336221
16577 -336221 -497145 -321100 -141390 -47218 -44244 -119837 -133618 -8946 -201808 -421011
16567 -421011 -261788 19678 177357 206845 -100750 -231 -78866 -87326 101788 233307
16557B33307j77745N4366j27395k60866J54234J29622k31385J590l2480Q3062
16547a73690J75410k6429Q4615J81053J6032o2780r3432J8052O592r0296k64061
16536b28934l18474o1882L66500K26551M5936j84713O9940J77125R8615j23797
16526F6867j99310L9859j85183j72237N4887J17465J21471J4924J21809J6821
16516b627k41708J03971M5709P3849N5315J11690R726k7783K1287K46661j37576
16505B58514p058J38192q0127O7752K06006q5976j35640l35171k84884J52288
16495a06104L40287P0500j55596l94224p6490k51504l16250P1987K61296L91623
16485a64475J37535j43085k65180J45590M77483J184q5066k27527n3367L77J11016
$$ plain form
16557 233307 55562 109928 -17467 -278333 -124099 5523 -225862 -224272 -256752 -173690
16547 -173690 1720 -24709 59906 240959 256991 194211 100779 118831 125423 35127 -228934
16536 -228934 -547408 -609290 -242790 -16239 29697 -155016 -85076 92049 190664 66867
16526 66867 -132443 -92584 -277767 -450004 -395117 -277652 -156181 -141257 -19448 -2627
16516 -2627 -244335 -140364 -94655 -20806 34509 146199 155925 128142 149429 396090 258514
16505 258514 251456 389648 309521 377273 583279 497303 361663 26492 -258392 -106104
16495 -106104 234183 304683 149087 -245137 -321627 -573131 -889381 -817394 -556098 -164475
16485 -164475 -26940 -170025 -435205 -289615 187868 189052 103986 -123541 -176908 -176531 -65515
16474f5515l20604l45142m848K84707L81431Q5331l4784O4069J13548j76579k10382
16463b28768J17625K57962l7085j46937k9307p6732J91320J46629J2465J57208
16453C64380r3222m85635j09361N2337K2703J28565j2994r931m5547l9883L8262
16442a90326R3984q7957Q81n6123j21400K7436J66800R3392J10665o9464j25379
16431a57491N9184k4243j14997l2960N2482K9914J16750j06363n4271P8067J14765
16420c9163j7990j01341J24334M2884L3444K7357j9563k27630k40447k612J38210
16409b82517P4477j97212Q6884K4209J56209j46177J42584J81946J55643J49069
16399C45115j12717l00041J0875J18388l6097l17537k11941J47352J91194M098
$$ plain form
16474 -65515 -386119 -731261 -736109 -451402 -69971 15360 -19424 44645 158193 -18386 -228768
16463 -228768 -111143 146819 109734 -37203 -66510 -143242 48078 194707 207172 364380
16453 364380 271158 -214477 -323838 -271501 -248798 -120233 -133227 -143158 -188705 -228588 -190326
16442 -190326 -96342 -184299 -183418 -239541 -360941 -333505 -166705 -73313 37352 -32112 -157491
16431 -157491 -98307 -122550 -237547 -270507 -218025 -188111 -71361 -177724 -231995 -153928 -39163
16420 -39163 -57153 -158494 -34160 8724 42168 69525 49962 -177668 -418115 -420727 -282517
16409 -282517 -208040 -405252 -318368 -294159 -137950 -284127 -141543 40403 196046 345115
16399 345115 232398 -67643 -56768 61620 25523 -292014 -503955 -356603 -165409 -161311
16389a61311k38507j1970P4157R0689R4288J27056K33646M2786p9392j66803k27156
16378b22517J19929j01811q8842K81289J56067m2239r3450N4747j25848k31202
16368b93877k20665m5640J44423K94268J94381k14942r9350Q3992K8947j53377
16358b81840J10837J00046j24594q5407N8090L39345j04966k55378K56753J29779
16348A42665R397k39545m4001j19989J84813L13765P4251k52822k77381k8928
16338b37775Q8642M8378L9396J63665n4601m1218k0261j59851k07339k1739K39303
16327a63400J72293j76257l7058n2500k8405K05157K84725j06673k72132M595
16317a69655J26689o6560j16118m488J55442k6594l15287j42797M0278j4827N94048
$$ plain form
16389 -161311 -399818 -411788 -337631 -246942 -152654 -25598 208048 250834 171442 4639 -222517
16378 -222517 -102588 -204399 -293241 -11952 144115 101876 8426 63173 -62675 -293877
16368 -293877 -514542 -560182 -415759 -121491 72890 -142052 -241402 -157410 -128463 -281840
16358 -281840 -171003 -70957 -195551 -280958 -222868 116477 11511 -243867 12886 142665
16348 142665 152062 -87483 -131484 -251473 -66660 247105 321356 68534 -208847 -237775
16338 -237775 -149133 -100755 -61359 102306 47705 6487 -13774 -173625 -380964 -402703 -163400
16327 -163400 8893 -167364 -204422 -256922 -285327 -80170 204555 97882 -174250 -169655
16317 -169655 -42966 -109526 -225644 -230132 -74690 -101284 -416571 -559368 -519090 -533917 60131
16306F0131L31484J34781l70592k70520K4752P3986K37856j22560j03418J09750
16296A05650k42059q1063J73959j86006n1827k04549P5600K72297J26001j87151
16286a99148n057n9325j4805Q5436L51958K15415k3856j18946j65638J71895j23928
16275A14001k10924j19062P0541L7663j74228J22420l5714j78550j13218k6951
16265e14022M49921J38959j43634p9150N4881L27707l6796k44819M6289J92020
16255A91356r5784l16331m28916j13073J78732K98595K86632J49281j06655K2862
16245F6699m2095j49118k81597j2932L33289j43938Q6621R3781K29520P0704R8852
16234C49786q6169j07781j54001J54097K7638k10966Q4243O5567k86094j60120
$$ plain form
16306 60131 391615 526396 155804 -114716 -89964 -15978 221878 99318 -4100 105650
16296 105650 -136409 -217472 -43513 -229519 -281346 -485895 -410295 -137998 -11997 -199148
16286 -199148 -204205 -263530 -278335 -192899 159059 374474 350618 231672 66034 237929 114001
16275 114001 -96923 -215985 -145444 -107781 -282009 -159589 -195303 -373853 -487071 -514022
16265 -514022 -64101 74858 -68776 -147926 -93045 234662 197866 -46953 -664 191356
16255 191356 95572 -220759 -649675 -762748 -584016 -285421 1211 150492 43837 66699
16245 66699 24604 -124514 -406111 -419043 -85754 -229692 -143071 -49290 180230 250934 349786
16234 349786 263617 155836 1835 155932 183570 -27396 56847 122414 -163680 -323800
16224c23800l07976j35568J34421M33665L29303P4040K37328l2599k31982R2319
16214B69151L6248K86428p2639k13942n8565L7081j78300j52570J19517J35527
16204B07936K77892J37745k37975p7891k53961k30101r0592L92203Q4381j23447
16194H6190J40094r0688r4939M5746J17475j14566k50702o7118M20794m7787N5742
16183B00241Q2068n4351k16708j27773K6988j45968j27006K5498K821R4973j82469
16172d21686R7693J50953J59922L6897k91258j10469J84204l2892k45628J29996
16162c42268k4701q5638J59823j40734r6410N6078J14416m5155r0769J38577N4058
16151c02723J66195Q4794P6386J1633j3908j06467J26675P8411J95403p9324m79360
$$ plain form
16224 -323800 -631776 -767344 -632923 -199258 130045 204085 441413 408814 176832 269151
16214 269151 305399 591827 519188 305246 246681 283762 105462 -47108 72409 207936
16204 207936 485828 623573 385598 307707 53746 -176355 -266947 125256 209637 86190
16194 86190 226284 135596 40657 86403 203878 89312 -161390 -228508 192286 144499 200241
16183 200241 282309 227958 11250 -116523 -89535 -235503 -362509 -337011 -334190 -239217 -421686
16172 -421686 -323993 -173040 -13118 23779 -267479 -377948 -193744 -226636 -472264 -342268
16162 -342268 -366969 -452607 -292784 -433518 -529928 -473850 -359434 -404589 -495358 -356781 -302723
16151 -302723 -136528 -51734 24652 36285 22377 -84090 42585 120996 316399 237075 -242285
16140b42285K6636J82096j04713j04149n2877n9993j9776k0825k09809J81949
16130d23746K75209j22839J38767J37205J32841M7366k9072q5142j38391o013
16120g3815J00218j94988J46484J54587q8281j01768l54663L160K49860K93383
16110A34177l9439j76281j66150K57156K37303M5738n1656o8871j75436J25103
16100A21644M1994j07799k32050K11093L38252J5310l26255l37430K31525J74712
16090A30996J49090q1170j07169m503J41854q2692K7090l78368l27291P7930P1326
16079c82907p4774K24501K90269K92351k6315l56174j94748n7892K44956J29722
16069H8989N1357j72922j12484J7205l4816k42578J53044O9879J22301j00419
$$ plain form
16140 -242285 -215649 -33553 -138266 -242415 -295292 -355285 -375061 -395886 -605695 -423746
16130 -423746 -148537 -271376 -132609 4596 137437 184803 155731 70589 -67802 -73815
16120 -73815 26403 -168585 -22101 132486 44205 -57563 -412226 -409066 -159206 134177
16110 134177 94738 -81543 -247693 9463 246766 292504 240848 171977 -3459 121644
16100 121644 163638 55839 -176211 34882 373134 388444 62189 -275241 -43716 130996
16090 130996 280086 198916 91747 87244 229098 146406 173496 -204872 -532163 -454233 -382907
16079 -382907 -457681 -233180 57089 349440 323125 -33049 -227797 -285689 -40733 88989
16069 88989 140346 -32576 -145060 -127855 -162671 -405249 -252205 -182326 -60025 -160444
16059a60444o4927O828R2585j8481j0339j09742r1052k20913k01966O5288J80097
16048e33066K94230N5559L47139K72178k836p3791j72217j71861K8602j04853
16038f0916o6920R4346j20389j7364N1866J54371q2530j29102j07200j48522P7169
16027c55191L02067K37422j78432j35283N5558K60577K47054m04670l42432j35792
16017d49122Q4024J70991J62311M4415l8399N3109R5470l1167l5688Q9242J5018
16006A60204k16729o7876M8613q3793m6746O1622n5235J70941K99795R703L9523
15995C20022O5086N115K9173k31405k50032k46035K3087j18822j60286O3144j4081
15984e15034J82913J39605J62926K67455o8542l03398M9537L6096J00853M8441
$$ plain form
16059 -160444 -225371 -218543 -125958 -144439 -154778 -264520 -355572 -576485 -778451 -713163 -533066
16048 -533066 -238836 -183277 163862 436040 433204 359413 187196 15335 43937 -60916
16038 -60916 -127836 -33490 -153879 -171243 -119377 34994 -47536 -176638 -283838 -432360 -355191
16027 -355191 -53124 184298 5866 -129417 -73859 186718 433772 29102 -313330 -449122
16017 -449122 -365098 -194107 -31796 12619 -25780 27329 122799 91632 55944 145186 160204
16006 160204 -56525 -124401 -75788 -159581 -206327 -144705 -199940 -28999 270796 280499 320022
15995 320022 385108 390223 419396 187991 -62041 -308076 -284989 -403811 -564097 -500953 -515034
15984 -515034 -332121 -192516 -29590 237865 169323 -134075 -84538 -48442 52411 100852
15974A00852j8978k09795q1143K65635K76701j01083j80357p4545j48535Q5814
15964h5434j0739J04625m1222k14001o6870J26516J28490p5879j0388o3651J37864
15953g0689j32217j83237P7480K84555J94467k84299j06723K2917J04796P4423
15943a8527N3739j5184k3572l3602l4964J35789r0865j50782k89107j55587K64099
15932c58563J35187L3821M7204O6932M1418K8856j36577J29932M8919j31986j4030
15921a08887Q6016k65865N6532K8068j91762l2385R3814P6246j61634K73914J16468
15910b9475m578j24713K82039L56968j55462j73304k02754k33248p3407k6977
15900c84911J16887o528L69472K69180j2582j7414k58016j53821k9879j4303J02699
$$ plain form
15974 100852 81874 -127921 -209064 56571 333272 232189 51832 -22713 -171248 -85434
15964 -85434 -96173 8452 -32770 -246771 -313641 -187125 -58635 -134514 -144902 -208553 -70689
15953 -70689 -202906 -386143 -308663 -24108 170359 -113940 -220663 -197746 -92950 -18527
15943 -18527 35212 20028 -3544 -37146 -72110 63679 -27186 -177968 -467075 -622662 -358563
15932 -358563 -223376 -189555 -142351 -75419 -34001 -5145 -141722 -11790 37129 -94857 -108887
15921 -108887 -22871 -288736 -232204 -204136 -395898 -428283 -334469 -258223 -419857 -145943 -29475
15910 -29475 -34053 -158766 123273 480241 324779 151475 -51279 -284527 -357934 -384911
15900 -384911 -268024 -274552 94920 364100 351518 334104 76088 -77733 -107612 -121915 -19216
15889a9216n8974n5596M7842K5388R9067j68098N7828P0315K12197k0375o9648
15878A20730l69712k47593K02937j32202j27069R2170P6282K15899j06353J53945
15868a20966J32901j40681J3335n409m5618R7782J7171r7553J8402M1689K34913
15857A45966l8057J44856J17207k0251M0632k63287k9524O380R2572K07395J79028
15846E82917o4799j95041n3262k71377K1413J64751q891n269M0073j21601j31690
15835d2776j12649j31985j45789M27302Q5261N3790N5651j38795p0857K84003
15825B63156M1159j8644k5298N4059k91590k64000j3093m6373j67956R6045M03770
15814C1235k8134k10345J22799o701J14688K09125j10578j31775r8239J72127
$$ plain form
15889 -19216 -78190 -133786 -85944 -60556 38511 -129587 -71759 -1444 210753 190378 120730
15878 120730 -248982 -496575 -293638 -425840 -552909 -460739 -384457 -168558 -274911 -120966
15868 -120966 11935 -128746 -115411 -120820 -166438 -68656 -51485 -149038 -130636 -88947 145966
15857 145966 107909 252765 369972 349721 390353 127066 97542 103922 196494 403889 582917
15846 582917 518118 323077 269815 -1562 19851 184602 175711 170442 210515 88914 -42776
15835 -42776 -155425 -287410 -433199 -5897 79364 133154 188805 50010 -20847 263156
15825 263156 304315 285671 260373 314432 22842 -241158 -254251 -300624 -468580 -372535 31235
15814 31235 3101 -207244 -84445 -91146 23542 232667 122089 -9686 -107925 64202
15804F4202J64048k03005q2764j04586k52864N8963n627j94676P6760L00500J35731
15793d3318j32566q5642J98943J40721r9366L2492J60000k26515p3133J75277
15783D6893K8427l5447J90331J6239p2872n7063r2695n5403j24255J88106K56999
15772B89260Q2102k22447n5273j42464R41l5307J68584K50428k945k39301l19141
15761b25563j30189j09179Q2551K20278J89098j21156M9405L32829j79126J28268
15751B37216l3883k67604N2951L59538J06460l6324j96196l32967l03624K7172
15741c87261J24832J13409J16233L6982L5621j34049j50689l9819J12890P3606
15731i8245J79837k6246p4073K17691j67926m7714l1508N1990J62670K04583Q5
$$ plain form
15804 64202 228250 25245 -57519 -162105 -414969 -356006 -361633 -556309 -479549 -179049 -43318
15793 -43318 -175884 -261526 -62583 78138 -21228 11264 171264 -55251 -128384 46893
15783 46893 75320 39873 230204 246443 173571 116508 23813 -31590 -155845 32261 289260
15772 289260 371362 148915 93642 -48822 -47881 -83188 85396 335824 332879 93578 -225563
15761 -225563 -355752 -464931 -382380 -162102 26996 -94160 -44755 288074 108948 237216
15751 237216 203333 -64271 -11320 348218 454678 418354 222158 -110809 -414433 -387261
15741 -387261 -262429 -149020 -32787 4195 39816 -94233 -244922 -284741 -171851 -98245
15731 -98245 81592 55346 -18727 198964 31038 -16676 -48184 3806 166476 371059 371144
15720C71144o4854k14658P4715N4203K6816j18070j49517k26833r4589J79503
15710a62140J47275l47978m7936K28299J58124o9660P6438J58643j08668o6369
15700c3972j8369k0694j17828m7084k0674L8827K8707L7821P4789Q4803O5675
15689G2001O3907l9585q2271j41929k2921L1690j4175j86390J67840J46859r1698
15678i6672J79352P2515l12946l29047J75192R3690J68065L6832l8123K50984
15668A99842j54362k43438j970K8859J57929J62542L4902k25954r7948O0843J4996
15657f3759J48327j30390k49756N9666K90214L0969n3365Q4314L0550N95j25438
15646B1927l9516L4104j63876n3170q3417P5635K0288P8694K31066J80924N9493
$$ plain form
15720 371144 306290 91632 166347 220550 247366 129296 -20221 -247054 -341643 -162140
15710 -162140 -14865 -362843 -410779 -182480 -24356 -94016 -17578 141065 32397 -33972
15700 -33972 -52341 -73035 -190863 -237947 -258621 -219794 -191087 -153266 -78477 6326 72001
15689 72001 135908 96323 14052 -127877 -150798 -119108 -133283 -319673 -151833 -4974 -96672
15678 -96672 82680 155195 -157751 -486798 -311606 -217916 -49851 -13019 -51142 199842
15668 199842 45480 -197958 -199928 -171069 -13140 149402 184304 -41650 -139598 -78755 -63759
15657 -63759 84568 -45822 -295578 -235912 54302 85271 31906 116220 146770 147365 21927
15646 21927 -17589 16515 -147361 -200531 -283948 -208313 -188025 -109331 121735 302659 362152
15635C62152m44873j62892j60881j6587L68711L72824K91033J818L0866j23253
15625E18918j95370q8520J4351K4135Q2860k46770J24811L64163p9828l37694
15615A81056l38472k04291P1048M45161J30105o3524j31494j34242k7057K34705
15605A62995J74418k73454j88982j69561j39494n1455J23412M00126M4739j02457
15595a9713J89634M4817J06192o2805P4692j33948J84131n9188j09301j54818
15585E9693J53771L65761J34303l04375k13018k69083l90259K12874R4738J62607
15575G012O8764J12346j86090k3817K36916J37174k32095j35276j46201j03531
15565b64798j6419L16211K30640k00091k63958K6118j25119q7721M10520K46822
$$ plain form
15635 362152 -82721 -245613 -406494 -423081 -54370 318454 609487 611305 642171 518918
15625 518918 323548 235028 249379 273514 356374 109604 234415 598578 518750 181056
15615 181056 -157416 -361707 -290659 154502 284607 221083 89589 -44653 -71710 162995
15605 162995 337413 63959 -125023 -294584 -434078 -485533 -362121 38005 82744 -19713
15595 -19713 169921 214738 320930 258125 332817 198869 383000 323812 214511 59693
15585 59693 213464 579225 713528 409153 196135 -72948 -463207 -250333 -155595 7012
15575 7012 75776 188122 2032 -21785 215131 352305 120210 -15066 -161267 -264798
15565 -264798 -281217 34994 265634 65543 -198415 -172297 -297416 -385137 25383 272205
15555B72205j18034j17076J63334J3732l64002J3313J36155K17964K6449r9399
15545A44641n2237k97989k9661R560j71746r5807j32720j8875O6157O4323j94985
15534g09339O3925K03557R8648o460J58625k8836q5695J88188q6337P9809M9510
15523g4405N2079K00177J74126q4179j0425J27022m16226j42994k7508J51395
15513e0938J43281k56709j33901J36870O2616R8538j45232j18122O4857j98134
15503c96874o1857q3049p6993o2581J14118K59118J15154J68640j61206j04909
15493b90439K19614K59949R2566j19083j65277K3659M2592R3214j20994k52540
15483b16739N6508J0402j10717r7712J37799O3358L9000Q9508k51170j75692M7661
$$ plain form
15555 272205 154171 37095 200429 214161 -149841 -136528 -373 217591 244040 144641
15545 144641 92404 -205585 -235246 -225686 -397432 -493239 -625959 -644834 -578677 -514354 -709339
15534 -709339 -645414 -441857 -343209 -349669 -191044 -219880 -305575 -117387 -203724 -123915 -74405
15523 -74405 -22326 177851 351977 267798 257373 384395 -31831 -174825 -202333 -50938
15513 -50938 92343 -164366 -298267 -161397 -98781 -243 -145475 -263597 -198740 -396874
15503 -396874 -458731 -541780 -618773 -681354 -567236 -308118 -192964 -24324 -185530 -290439
15493 -290439 -70825 189124 281690 162607 -2670 20989 63581 156795 35801 -216739
15483 -216739 -160231 -149829 -260546 -358258 -220459 -157101 -118101 -28593 -279763 -455455 -407794
15472d07794J14103r0378j16200P8798K30699J76549r2958k00650n9183j519O4229
15461c04304J39296j38397r4072j6702q0287o4433J69941J47129K46012K56372
15451B60555P0724L6114n8885j69799n4228j39522j11198K34927K86034l7995
15441C16727J8568p6549k04007l94593m9419J88500k3406K33653K5723m11455
15431c76258l31997Q35J82752J94423o8730O3235J98960N3644N4910J90262J1773
15420A73809k7582l621l0145j4867J90987l2156k15159k34752J48119K04455L17509
15409D76597j80795j51063l78272j06952p787J8613k18928K24896J62244j5983
15399a77430n8635k28952K14248L54671J82999K485m02247j74910L2951K71604
$$ plain form
15472 -407794 -293691 -384069 -500269 -421471 -190772 -14223 -107181 -307831 -367014 -368533 -304304
15461 -304304 -165008 -303405 -397477 -414179 -494466 -558899 -388958 -241829 4183 260555
15451 260555 331279 367393 308508 138709 84481 -55041 -166239 68688 354722 316727
15441 316727 335295 258746 54739 -339854 -389273 -200773 -224179 9474 35197 -376258
15431 -376258 -708255 -707420 -524668 -330245 -398975 -335740 -136780 -83136 -28226 162036 173809
15420 173809 146227 142606 112461 97594 288581 256425 41266 -193486 -45367 159088 476597
15409 476597 295802 144739 -233533 -340485 -348272 -329659 -548587 -323691 -161447 -177430
15399 -177430 -236065 -465017 -250769 103902 286901 289386 -112861 -287771 -254820 16784
15389A6784P4391q9040j93730m52946r2380J70584m5427j7635J54501L8195J19915
15378c16788J44249q8824j01533k6241K91451o8211k98095K76730P6741k73791
15368c84312j34309P676P3225P2296j10379L42009J11498K0342J9801j62742j80617
15357c25512q0115M0020O6828n8457j26988J15744L34809K1110l6790j72279j21595
15346c43225r1202J7761K27462K4436M5717J47547J4063j18750J09960O3045p5642
15335B1172k7707k12515p5868j13906J6002M7101R5848O5696m4641K26585M1589
15324C9356j71703k43271n9824K79778K75346J58088k45459k7792o2831j0890
15314f9202j65823k33225K38611O8486k04648O1437K74279J946k4629q6127L1272
$$ plain form
15389 16784 91175 2135 -191595 -644541 -736921 -566337 -611764 -629399 -474898 -436703 -316788
15378 -316788 -172539 -261363 -362896 -389137 -97686 -165897 -463992 -187262 -110521 -384312
15368 -384312 -518621 -510945 -437720 -365424 -475803 -133794 -22296 -1954 17847 -144895 -325512
15357 -325512 -405627 -365607 -298779 -357236 -484224 -368480 -33671 -12561 -49351 -221630 -343225
15346 -343225 -434427 -416666 -189204 -164768 -119051 28496 42559 -76191 33769 96814 21172
15335 21172 -6535 -219050 -294918 -408824 -392822 -345721 -249873 -184177 -228818 -2233 39356
15324 39356 -132347 -375618 -435442 -155664 119682 277770 32311 4519 -58312 -69202
15314 -69202 -235025 -468250 -229639 -161153 -365801 -304364 -30085 -28139 -52768 -138895 -107623
15303a07623q4470j72062M7917K76081K35105k45990j42163j17557j37580K72793
15293a75549K31251J11950K7533R4245J32358l1962k32818j07039n789j64887
15283a20707k182J48988j89544j48115K4781q1881J03358J15190K17217J44848
15273B11953q2833k24103J6528J29795r3206O6372K3845n4496L0869j59271K73709
15262A39162K81438R9859j09117j20610l01505r4095K45452k9821P0245m2670
15252A38338j79817o514J08250J03797j43726J23688m2256n2478j23537j47675
15242b21930j85539r0616K89814L97601J83463k8599l9602R9979j03128l8736
15232B62707k39947q3309p229K47230j46925k89176j29270k2758K41538R2092
$$ plain form
15303 -107623 -192093 -364155 -316238 -40157 194948 -51042 -193205 -310762 -448342 -175549
15293 -175549 55702 167652 195185 289430 421788 389826 157008 49969 44180 -120707
15283 -120707 -122889 26099 -163445 -311560 -286779 -368660 -265302 -150112 67105 211953
15273 211953 129120 -94983 -78455 51340 -41866 24506 48351 -6145 24724 -134547 139162
15262 139162 420600 520459 411342 290732 -10773 -104868 140584 110763 181008 138338
15252 138338 -41479 -47993 60257 164054 20328 144016 101760 49282 -74255 -221930
15242 -221930 -407469 -498085 -208271 189330 372793 344194 304592 404571 301443 262707
15232 262707 22760 -60549 -67778 179452 32527 -256649 -385919 -408677 -167139 -75047
15222g5047O7118L5173Q1861L6148m1791O8595j42719r7312J50454j01514L2941
15211A3907M6859j273j2132L4019R6005k46319k04705N289J5965r7040J71882
15200a77543K29702j92596j97280J31479L1992K59176K03267j07085j7266L7556
15190B01402k77900r545K13547J78810k6058j95800k78842m382K40812L0325j48579
15179g6210j19811J2026K1967K5192N7368J93604l3354j82903p4977N8104P5067
15168d3927K58279k23367j08590Q5077O4708J02561P1464m9231k3601J34413k60455
15157G331q5086k01427j43315q5026L13287j09548M9237J36146K73826o8196p1600
15146A5629Q4111J10341k38375L238j60233j01723Q8531J6913j63924k49187K27951
$$ plain form
15222 -75047 -7929 27244 109105 145253 103462 172057 29338 -67974 82480 -19034 13907
15211 13907 60766 59493 47361 81380 177385 -68934 -273639 -268350 -252385 -349425 -177543
15200 -177543 52159 -140437 -337717 -206238 -174246 84930 288197 181112 163846 201402
15190 201402 -76498 -86043 127504 306314 280256 84456 -194386 -198768 42044 72369 -76210
15179 -76210 -196021 -183995 -162028 -136836 -79468 114136 80782 -102121 -177098 -118994 -43927
15168 -43927 214352 -9015 -117605 -32528 32180 134741 206205 156974 133373 267786 7331
15157 7331 -77755 -279182 -422497 -507523 -194236 -303784 -254547 -118401 155425 87229 15629
15146 15629 99740 210081 -28294 -25056 -185289 -287012 -198481 -181568 -345492 -594679 -366728
15135c66728N5296k76731j78580J02853L35332J78741l7728Q492J33393j04377
15125a50037j20143j22318J24349R7909J29732o9452j0084j44805M1564K1095
15115b02190k72229j12615P9368P5343j8678J33506P8089J02760J7072K93758
15105A74184j30800j07067M6206N4139k1916j99231j03671j95110K80077K78482
15095G5293M9111m14785j07950J14429P1642K64532j36655J93833J80250j36190
15085A53510N4299k4069j38936j28536m631L3708r5333J66429o820j23820j86277
15074c00476k8366j55907P8651o6264j51720R0178J08183l4687L07372J2362k31686
15063c72360l5515p225N8712O3073N7238P9970K41948J0045j78232Q7145J83820
$$ plain form
15135 -366728 -311432 -588163 -766743 -663890 -328558 -149817 -187545 -179053 -45660 -150037
15125 -150037 -270180 -392498 -268149 -170240 -40508 -109960 -120044 -264849 -223285 -202190
15115 -202190 -474419 -587034 -507666 -432323 -451001 -317495 -239406 -136646 -119574 174184
15105 174184 43384 -63683 -17477 36662 14746 -184485 -288156 -483266 -203189 75293
15095 75293 124404 -290381 -398331 -283902 -212260 52272 -84383 109450 289700 153510
15085 153510 207809 183740 44804 -83732 -88363 -54655 -149988 16441 9621 -114199 -300476
15074 -300476 -328842 -484749 -406098 -472362 -624082 -533904 -425721 -460408 -153036 -140674 -372360
15063 -372360 -407875 -415100 -356388 -293315 -236077 -156107 85841 95886 -82346 4799 188619
$$ [...]
##END NTUPLES=NMR SPECTRUM
##END=
