##TITLE=Analysis number 308689
Compound Code tl 00552
Book Reference 438/8
Project Code adrs
Chemist Name antons
##JCAMPDX= 6.0         $$ Bruker NMR JCAMP-DX V2.0
##DATA TYPE= NMR SPECTRUM
##DATA CLASS= NTUPLES
##ORIGIN= Bruker BioSpin GmbH
##OWNER= NMR
$$ XWIN-NMR		Version 3.5
$$ Wed May 25 09:30:31 2005 GMT Daylight Time (UT+1h)  MAYBRIDGE\NMR@NMR_250MHZ
##.OBSERVE FREQUENCY= 250.131544655141
##.OBSERVE NUCLEUS= ^1H
##.ACQUISITION MODE= SIMULTANEOUS (DQD)
##.ACQUISITION SCHEME= undefined
##.AVERAGES= 16
##.DIGITISER RES= 18
##SPECTROMETER/DATA SYSTEM= dpx250
##.PULSE SEQUENCE= zg30
##.SOLVENT NAME= CDCl3
##.SHIFT REFERENCE= (INTERNAL, CDCl3, 0, 16.4502)
##AUDIT TRAIL= $$ (NUMBER, WHEN, WHO, WHERE, WHAT)
$$ ##TITLE= Audit trail, XWIN-NMR		Version 3.5
$$ ##JCAMPDX= 5.01
$$ ##ORIGIN= Bruker BioSpin GmbH
$$ ##OWNER= NMR
$$ C:\u/data/dgb/nmr/ADRS/3490/pdata/1/auditp.txt
$$ ##AUDIT TRAIL=  $$ (NUMBER, WHEN, WHO, WHERE, WHAT)
(   1,<2005-05-25 09:30:12.99 +100>,<MAYBRIDGE\NMR>,<NMR_250MHZ>,
      <created by zg, POWCHK disabled, PULCHK disabled
       configuration hash MD5:
       62 19 C7 07 E1 42 D1 B7 37 6C 3D D0 77 39 F9 E6
       data hash MD5: 64K
       AF AA 9F 87 D6 00 FB A7 D5 41 50 CD 35 67 4E A4>)
(   2,<2005-05-25 09:30:24.02 +100>,<MAYBRIDGE\NMR>,<NMR_250MHZ>,
      <Start of raw data processing
       ef LB = 0.3 FT_mod = 6 PKNL = 1 SI = 32K 
       data hash MD5: 32K
       C0 55 8E 60 26 9C 26 19 74 C4 F1 41 49 DD 9F A3>)
(   3,<2005-05-25 09:30:25.62 +100>,<MAYBRIDGE\NMR>,<NMR_250MHZ>,
      <apk 
       data hash MD5: 32K
       19 79 31 73 1A 5C FB 79 F9 93 B3 D1 5C 57 67 75>)
(   4,<2005-05-25 09:30:26.29 +100>,<MAYBRIDGE\NMR>,<NMR_250MHZ>,
      <abs ABSG = 5 
       data hash MD5: 32K
       E5 6D 7D B9 1C 6E 9F FE 29 60 2F 79 4D 38 20 5C>)
$$ ##END=
$$ 
$$ hash MD5
$$ 51 86 BC 7F C8 AE 54 AE B7 C5 FB 47 AC D3 64 EA
##$RELAX= 
##$RELAX= 
##$RELAX= 
##$RELAX= 
##$RELAX= 
##$RELAX= 
##$RELAX= 
$$ Bruker specific parameters
$$ --------------------------
##$DU= <C:\u>
##$EXPNO= 3490
##$NAME= <ADRS>
##$PROCNO= 1
##$TYPE= <nmr>
##$USER= <dgb>
##$AMP= (0..31)
100 100 100 100 100 100 100 100 100 100 100 100 100 100 100 100 100 100 
100 100 100 100 100 100 100 100 100 100 100 100 100 100 
##$AQSEQ= 0
##$AQ_mod= 3
##$AUNM= <au_zg>
##$AUTOPOS= <4 >
##$BF1= 250.13
##$BF2= 250.13
##$BF3= 250.13
##$BF4= 250.13
##$BF5= 500.13
##$BF6= 500.13
##$BF7= 500.13
##$BF8= 500.13
##$BYTORDA= 1
##$CFDGTYP= 0
##$CFRGTYP= 5
##$CHEMSTR= <none>
##$CNST= (0..31)
1 1 145 1 1 1 1 1 1 1 1 1 1 1 1 1 1 1 1 1 1 1 1 1 1 1 1 1 1 1 1 1 
##$CPDPRG= <>
##$CPDPRG1= <>
##$CPDPRG2= <>
##$CPDPRG3= <>
##$CPDPRG4= <mlev>
##$CPDPRG5= <mlev>
##$CPDPRG6= <mlev>
##$CPDPRG7= <mlev>
##$CPDPRG8= <mlev>
##$CPDPRGB= <>
##$CPDPRGT= <>
##$D= (0..31)
0 1 0 0 0 0 0 0 0 0.06 0 0 0 0 0 0 0.0002 0 0 0 0 0 0 0 0 0 0 0 0 0 0 
0 
##$DATE= 1117009812
##$DBL= (0..7)
120 120 120 120 120 120 120 120 
##$DBP= (0..7)
150 150 150 150 150 150 150 150 
##$DBP07= 0
##$DBPNAM0= <>
##$DBPNAM1= <>
$$ [...]
##$SUBNAM7= <"">
##$SUBNAM8= <"">
##$SUBNAM9= <"">
##$SW= 20.6930455092707
##$SWIBOX= (0..15)
0 0 3 0 0 0 0 0 0 0 0 0 0 0 0 0 
##$SW_h= 5175.983436853
##$TD= 65536
##$TD0= 1
##$TE= 295.16
##$TE2= 300
##$TE3= 300
##$TEG= 300
##$TL= (0..7)
0 120 120 120 120 120 120 120 
##$TP= (0..7)
150 150 150 150 150 150 150 150 
##$TP07= 0
##$TPNAME0= <>
##$TPNAME1= <>
##$TPNAME2= <>
##$TPNAME3= <>
##$TPNAME4= <>
##$TPNAME5= <>
##$TPNAME6= <>
##$TPNAME7= <>
##$TPOAL= (0..7)
0.5 0.5 0.5 0.5 0.5 0.5 0.5 0.5 
##$TPOFFS= (0..7)
0 0 0 0 0 0 0 0 
##$TUNHIN= 0
##$TUNHOUT= 0
##$TUNXOUT= 0
##$USERA1= <user>
##$USERA2= <user>
##$USERA3= <user>
##$USERA4= <user>
##$USERA5= <user>
##$V9= 5
##$VALIST= <valist>
##$VCLIST= <CCCCCCCCCCCCCCC>
##$VD= 0
##$VDLIST= <DDDDDDDDDDDDDDD>
##$VPLIST= <PPPPPPPPPPPPPPP>
##$VTLIST= <TTTTTTTTTTTTTTT>
##$WBST= 1024
##$WBSW= 4
##$XGAIN= (0..3)
0 0 0 0 
##$XL= 0
##$YL= 0
##$YMAX_a= 324455
##$YMIN_a= -412439
##$ZGOPTNS= <>
##$ZL1= 120
##$ZL2= 120
##$ZL3= 120
##$ZL4= 120
##$ABSF1= 16.45016
##$ABSF2= -4.243013
##$ABSG= 5
##$ABSL= 3
##$ALPHA= 0
##$AQORDER= 0
##$ASSFAC= 0
##$ASSFACI= 0
##$ASSFACX= 0
##$ASSWID= 0
##$AUNMP= <proc_1d>
##$AZFE= 0.1
##$AZFW= 0.1
##$BCFW= 0
##$BC_mod= 0
##$BYTORDP= 0
##$COROFFS= 0
##$CY= 12.5
##$DATMOD= 1
##$DC= 0
##$DFILT= <>
##$DTYPP= 0
##$F1P= 14.0000005364418
##$F2P= -0.99999901652339
##$FCOR= 0.5
##$FTSIZE= 32768
##$FT_mod= 6
##$GAMMA= 0
##$GB= 0
##$INTBC= 1
##$INTSCL= 1
##$ISEN= 128
##$LB= 0.3
##$LEV0= 0
##$LPBIN= 0
##$MAXI= 10000
##$MC2= 0
##$MEAN= 0
##$ME_mod= 0
##$MI= 0
##$NCOEF= 0
##$NC_proc= -3
##$NLEV= 6
##$NOISF1= 0
##$NOISF2= 0
##$NSP= 0
##$NTH_PI= 0
##$NZP= 0
##$OFFSET= 16.45016
##$PC= 1
##$PHC0= -73.03048
##$PHC1= 6.799873
##$PH_mod= 1
##$PKNL= yes
##$PPARMOD= 0
##$PSCAL= 4
##$PSIGN= 0
##$REVERSE= no
##$SF= 250.130017968743
##$SI= 32768
##$SIGF1= 0
##$SIGF2= 0
##$SINO= 400
##$SIOLD= 32768
##$SREGLST= <1H.CDCl3>
##$SSB= 0
##$STSI= 32768
##$STSR= 0
##$SW_p= 5175.98343685301
##$SYMM= 0
##$S_DEV= 0
##$TDeff= 65536
##$TDoff= 0
##$TI= <Analysis number 999999
Compound Code 99
Book Reference 9
Project Code 9>
##$TILT= no
##$TM1= 0
##$TM2= 0
##$TOPLEV= 0
##$USERP1= <user>
##$USERP2= <user>
##$USERP3= <user>
##$USERP4= <user>
##$USERP5= <user>
##$WDW= 1
##$XDIM= 32768
##$YMAX_p= 416445380
##$YMIN_p= -133668
$$ End of Bruker specific parameters
$$ ---------------------------------
##NTUPLES= NMR SPECTRUM
##VAR_NAME=  FREQUENCY,     SPECTRUM/REAL,   SPECTRUM/IMAG
##SYMBOL=    X,             R,               I
##VAR_TYPE=  INDEPENDENT,   DEPENDENT,       DEPENDENT
##VAR_FORM=  AFFN,          ASDF,            ASDF
##VAR_DIM=   32768,         32768,           32768
##UNITS=     HZ,            ARBITRARY UNITS, ARBITRARY UNITS
##FACTOR=    0.157963299565203, 1,           1
##FIRST=     4114.67858448715, 0,            0
##LAST=      -1061.30485236586, 0,           0
##MIN=       -1061.30485236586, -133668,     0
##MAX=       4114.67858448715, 416445380,    0
$$ Real data points
##PAGE= N=1
##DATA TABLE= (X++(R..R)), XYDATA
$$ [...]
20470 11812 23534 24490 38212 32553 25181 23841 16843 17182 32602 25900 19964 11128 -15635 -60245
20456 -60245 -45942 10290 23947 11248 18290 23998 22502 24812 1791 -12125 -35298 -63697
20444 -63697 -59303 -25974 -1451 19913 40899 42645 -14020 -39795 -47005 -8182 -10639 -10778 15869
20431 15869 39396 7597 -5472 -15715 -10009 -5195 1511 -39095 -74556 -49712 -40113 1906
20419 1906 3061 -19727 -5929 30551 26785 1486 -11167 -16999 -28103 -55504 -82924 -76140 -85390
20406 -85390 -29769 25088 48799 49496 42474 58605 65396 70460 47582 18590 -781 11156 2814
20393 2814 8438 5269 -7912 12230 6741 21724 5194 -8807 -5504 9404 -13578 -36974 -2501
20380 -2501 22930 -3317 -3562 25125 -3396 2846 41959 28711 14922 53961 37430 2316
20368 2316 -15533 -8244 17721 25362 15230 19419 12301 -6866 7093 -11768 -51279 -52904 -17456
20355 -17456 -16684 -41707 -56489 -29400 31121 1693 -23873 -11335 -15272 1576 -4508 -6921 -3758
20342 -3758 1680 26120 55953 61024 64053 60358 32733 28829 31441 38107 41430 27861 1885
20329 1885 10024 7199 -12778 -25541 -4946 16815 16553 947 1519 10965 14422 5493 -43115 -72914
20315 -72914 -40076 -11618 -17316 -9902 19340 -915 -26960 -24735 -25685 -35819 -11975 6073 24519
20302 24519 12943 6284 -7438 -29560 -50603 -58382 -59073 -60638 -73314 -76588 -53469 -27233 -32277
20289 -32277 -17095 -13280 -5895 -4270 -25253 -47228 -37745 -40643 -37301 -15875 -13824 -14067 -11941 607
20275 607 1001 -3065 4075 -1602 2658 15228 46319 27832 27866 40127 48236 38576 13704 -21838
20261 -21838 -10864 14468 34947 33453 6150 -658 3710 -16323 -30036 -36986 -18229 -2734
20249 -2734 -7114 -38934 -58196 -44624 -29799 -36764 -33011 -17815 -25888 -45778 -53037 -46735 -59695
20236 -59695 -45325 -43932 -40723 15895 33754 23069 -4715 -6059 -8551 2247 2392 -23039 -35146
20223 -35146 -38316 -53636 -26186 -15021 -57545 -44052 -12395 -28477 -36940 -47607 -57615 -43288
20211 -43288 -39142 -27661 -12231 -9687 -16979 -39827 -38851 -13457 7186 4667 21252 32572 26948
20198 26948 -14840 -41689 -21445 -34479 -40193 -14527 33212 37243 37157 27713 -1567 -16146 -3209
20185 -3209 -20338 -64642 -60731 -20961 -17628 -36216 -33930 -26869 -27050 -19486 -7975 -21137 -47998
20172 -47998 -40887 -26708 -30899 -39987 -47327 -47578 -49384 -59007 -53955 -84521 -99109 -94692 -93394 -68889
20158 -68889 -66364 -73314 -78565 -33362 -5959 6126 -346 5520 22831 17946 4909 -27838 -49742
20145 -49742 -58626 -45568 -10138 -31894 -52767 -53500 -70892 -61444 -55888 -40902 -51465 -61005 -67996
20132 -67996 -101456 -99176 -26324 -17658 -33225 -28289 -24026 10582 6489 8872 -8864 -24406 -41841
20119 -41841 -35387 12002 80519 102070 64616 16883 12898 -21661 -65360 -40620 -21645 -49609
20107 -49609 -74384 -65599 -58636 -62751 -35613 -37615 -51587 -40158 -34446 -47728 -69707 -74282 -54783
20094 -54783 -26452 -24429 -47057 -25794 -32687 -38550 -43385 -39348 -38738 -42836 -15742 -2871 14028
20081 14028 44993 32003 18404 11764 22241 50718 45494 32906 19434 -1653 -19993 -17474
20069 -17474 -1678 10712 -1333 20303 42613 18958 9685 -8003 -2106 8719 36733 19317
20057 19317 -12640 -51420 -65676 -61127 -51385 -43645 -14303 -11671 -12703 -28621 -16555 -18232 -32678
20044 -32678 -25015 -5796 24550 30393 38514 24375 13230 12034 -35305 -46356 -16777 2207
20032 2207 22070 31458 24154 11278 -13158 -37089 -49906 -70208 -42983 -12806 -24252 -36588
20020 -36588 -3498 8807 3898 -1180 24050 39063 14365 15684 17095 -8847 -14853 -3934 -36596
20007 -36596 -25698 348 -21281 -20585 -24381 9494 1500 -36750 -36635 -18825 -3053 21064 -4147
19994 -4147 -9469 -17000 6389 18674 -1224 -21952 -33220 -20856 15703 35468 28918 31601 13663
19981 13663 -27560 -18348 -30988 3097 -15491 -30424 -47098 -60382 -18328 4972 -8766 -15315
19969 -15315 -21322 1107 -33002 -28142 -28364 -41829 -20193 27458 38708 48989 34237 35794 39103
19956 39103 1121 -54232 -55382 -43717 -28455 -46400 -81784 -91545 -69149 -40027 -63708 -37205
19944 -37205 -9235 -8083 -29463 -51145 -53382 -14223 -6998 -34648 -17064 -1545 -5662 -28034
19932 -28034 -61401 -40340 -11040 -34091 -51849 -51769 -46312 -53616 -14805 5714 23835 20549 -5713
19919 -5713 -16352 -77210 -56349 1372 10897 32965 40688 18133 -15163 -15880 -13709 -1702 2581
19906 2581 534 -11207 -58965 -58271 -67408 -34649 -9394 -33564 -5855 18992 -18244 -8862 25914
19893 25914 36653 36847 35732 13452 25574 -3403 -16161 14995 1443 -19707 11189 37901
19881 37901 53291 50207 53382 30426 33915 21394 11766 -16782 -31345 -31572 2154 6656 -16546
19868 -16546 -1096 -13783 -10731 8315 -5191 -8063 16988 20462 20662 40647 29862 35111 28157
19855 28157 -13505 2314 25058 21295 -35673 -42505 -49086 -41941 -56358 -65682 -63332 -23019 10748
19842 10748 10809 9775 -9179 7582 7383 -37310 -68586 -27422 -5467 14619 -14142 -31246 -14870
19829 -14870 -6516 -33623 -36742 -2257 19636 23698 1886 -6446 -7653 -18549 -52230 -40960 -36647
19816 -36647 -29530 -33371 -4269 6684 -22936 -58104 -77093 -74689 -42146 -43045 -57018 -64774 -72497
19803 -72497 -84307 -76588 -58017 -29626 -17441 -49383 -72567 -91659 -73884 -52402 -58740 -49239
19791 -49239 -53227 -11775 11625 -2905 26413 56698 37957 13008 -733 -28973 -14994 -23500
19779 -23500 -35795 -44633 -58230 -38968 -42039 -55436 -97647 -81139 -31861 -46327 -86102 -77883
19767 -77883 -28145 17836 22709 24455 442 -7055 -5413 8385 4290 -27759 -19523 -25989 -18515
19754 -18515 -2899 -27951 -61684 -51417 -35261 -36428 -40944 -32608 -4065 3223 6309 23934 -9208
19741 -9208 -13173 -19185 -28220 -3569 -16295 -15312 -27424 19927 42851 34798 20132 -27638 -48725
19728 -48725 -50586 -16658 25549 14455 13767 14535 -11395 661 21360 5926 22680 27451 -4022
19715 -4022 -21881 -28878 -11159 -42177 -31336 -27064 -21107 -2828 17831 10535 -16176 -31319 -30118
19702 -30118 -26106 -62868 -91724 -72321 -14871 28346 29339 7303 32178 1448 -21119 -15413
19690 -15413 -12253 26982 61742 51375 38911 51704 37817 21434 10816 -292 1379 -4244
19678 -4244 -10709 -25343 -57554 -47601 -1308 -47819 -58004 -26832 11982 -924 -26937 -7705
19666 -7705 1905 -3454 -38285 -57694 -18622 -31435 -31743 -7553 -8665 1392 -9451 -48714 -72280
19653 -72280 -45135 -34772 -14857 -29820 -57322 -58940 -10153 -6706 -11257 -32310 -33428 -34687 -26852
19640 -26852 -9587 5586 29234 34440 40070 48647 17696 12132 11022 5105 -40 -22921 726
19627 726 -12771 -34474 2852 19911 20949 31044 3267 -20614 -10676 -3056 7387 6759 -7077
19614 -7077 -18121 -32254 -50011 -31934 6563 -26478 -60409 -44997 -28832 -15094 -17682 -25889
19602 -25889 -24463 -18167 -15192 -9880 13579 13562 7867 8196 -9064 -7460 -8945 12113 8790 8862 25579
19587 25579 37448 39604 52332 20238 18003 27065 6647 -12361 -54890 -32473 -10002 -8208
19575 -8208 -7289 -1477 28146 21842 -15692 -35937 -53143 -30084 -24435 -22891 -33526 -24584 16188
19562 16188 53037 61724 41122 -17383 -36218 -29166 -38657 -27085 -2128 26625 5636 -4089
19550 -4089 -15171 -21092 -43427 -43204 -7177 36551 16895 -21860 -20192 11297 1904 13059 31666
19537 31666 52952 39462 37926 25679 272 -9272 -13331 -18309 -28729 -12044 1473 -5521 5225
19524 5225 -18026 -25775 -31009 -23376 -12193 1298 -33944 -59925 -50149 -34017 -50467 -75496 -98685
19511 -98685 -112603 -129652 -133051 -102751 -79631 -74585 -81560 -49004 -35196 -32668 -47450 -50525 -67529
19498 -67529 -17266 22372 15267 -8880 2493 -6428 8851 4785 -3092 -50762 -71822 -49851
19486 -49851 -56896 -53266 -46206 12281 30067 4249 911 534 -7848 -36413 -20062 -14126 -3275
19473 -3275 15513 5960 -14651 13443 10825 -4405 -42800 -45340 -34214 -38813 -31521 -20591 -36817
19460 -36817 -37810 -71669 -90552 -57377 15340 41749 46098 45576 30636 -3696 -8539 11992 -10058
19447 -10058 -17580 -7409 24172 21595 -16708 -4293 -26342 -62523 -57115 -63767 -46861 -14697
19435 -14697 14445 31675 -1466 -12349 -19627 -31913 -35384 -58417 -56318 -55774 -41527 1 42027
19422 42027 43294 14446 -417 -7223 6119 -2756 -26364 -36483 -6866 -2910 -17694 -9380 -21865
19409 -21865 -33343 -54692 -45382 -51450 -63822 -42384 -6240 418 14653 14577 -22520 -24092 -22156
19396 -22156 -11403 -24332 -37575 -34600 -16090 -19685 -36195 -23687 -20972 -29181 -11862 4638
19384 4638 -1979 18351 6311 -7327 -52385 -83747 -77584 -84428 -70345 -49960 -52029 -44966 -16948
19371 -16948 -31911 -38251 -36636 -44433 -20542 -15607 -23249 -54492 -77915 -77959 -72204 -55744 -11264
19358 -11264 -6563 -22148 -15616 3919 10803 561 9087 6584 6444 -1385 -5826 -47593 -59532
19345 -59532 -33929 -34075 -47251 -37146 -25411 -33234 -51928 -47886 -41764 -36275 -38198 -29339 -42539
19332 -42539 -56393 -66473 -24886 -5588 -570 -7654 -27546 -22093 -16057 10177 3502 -3485 -18037
19319 -18037 -24641 -2656 33935 37678 23101 10739 -17303 -1951 45008 44227 52294 51911 49647
19306 49647 47944 37798 -4241 -3170 29940 29026 19264 11493 -13320 -36555 -33192 -27085 -15708
19293 -15708 -8099 -882 22 -9791 -8310 -24147 -59651 -63695 -16861 -14130 -30268 -18647 -30171
19280 -30171 -21754 -5813 12705 -29972 -53035 -9465 39821 16311 -5253 19088 18257 12197
19268 12197 -6725 24543 47198 13155 -22149 -32219 -14656 -3133 -16789 -346 10216 32989
19256 32989 41409 54630 67844 66535 81569 56389 24063 15523 -5026 -15443 -31325 -36118
19244 -36118 10071 -3327 -9200 10448 47524 51829 27166 19327 52072 72309 94681 56434
19232 56434 20329 34320 20507 -1316 18586 26419 4269 -3256 4349 2138 -5997 -10377 -12586
19219 -12586 -20852 -15930 -43711 -63008 -57304 -32569 -34594 -22344 -7050 -8445 -9666 -25017 -46618
19206 -46618 -24614 -23322 -35962 -9331 -18898 -54627 -44468 -22644 32156 20154 24372 21402
19194 21402 -5748 -32324 9863 54542 48863 41160 10574 10568 55737 60550 32564 4868 -37635
19181 -37635 -35591 -32630 -26486 -16747 1575 10661 36069 32714 18587 -6834 -14540 -13827 -7546 10178
19167 10178 14374 43232 35893 19363 17942 -3822 -22515 -26965 -5799 15894 25538 -3255 4709
19154 4709 18240 11159 -1017 463 23359 51047 30274 6185 -26981 -32280 -17581 5131
19142 5131 -2266 -20952 -24295 -25067 -17848 -27297 -45388 -35322 -19019 -12724 -28975 676 19985
19129 19985 16449 -22259 -21494 -19952 -39385 -38318 -15756 3072 -6419 -27290 -31816 -17747 -8902
19116 -8902 23296 37406 51265 22232 9378 -6383 -32189 -46008 -48239 -20928 -15187 20876
19104 20876 31980 14350 -25757 -11614 -19947 -21122 2250 -8781 -21006 -29762 -23068 -5043
19092 -5043 25935 20326 -362 -2521 23146 19932 9975 -7927 -2053 5108 5471 12429 14007 2825
19078 2825 -4780 3871 43314 43578 40147 21203 14458 35575 29694 -19688 -23943 -29813 -43612 -42890
19064 -42890 -51951 -65104 -43336 -15780 -4134 -12848 -28114 -50298 -39429 -29934 -23924 -4942
19052 -4942 9235 -12692 -10362 -6293 8318 -10634 -18680 -21518 -9633 -309 -1846 -14943 8753
19039 8753 -11466 -14201 -4676 -23292 -36847 -56987 -37942 -35529 -57564 -27947 -31699 -35271 -22158
19026 -22158 -3221 1511 -9920 -25152 -31885 -22001 -12216 -901 56026 85833 70210 16888
19014 16888 12862 -14529 -33564 -42165 -49614 -16216 28941 31018 27084 4319 -26728 -45361 -43005
19001 -43005 -19251 -17056 -16513 -19499 -9828 17555 -4650 5862 39171 27392 26943 51101 32444
18988 32444 18904 4411 -7627 9419 -11634 5383 19947 24559 16444 -5054 -9630 -4416
18976 -4416 -22965 -4162 6874 -9930 -37336 -44181 -44586 -47984 -21314 -18765 -5603 -45724 -38889
18963 -38889 -1701 -1009 41186 73928 46691 11109 18573 58635 84576 104372 105210 104927 116643
18950 116643 111706 99385 91036 76608 48380 -19424 -41854 -26638 -7223 6294 61 -22298
18938 -22298 -26474 -51866 -36017 -55569 -52504 -26590 -37192 -2203 -10527 -23916 -8839 -47414
18926 -47414 -39224 -33207 -30355 -39300 -53463 -17743 -7418 -5074 -8285 -25815 -16669 4912 23448
18913 23448 47833 52574 43661 56069 49835 51296 66565 61049 79259 131722 164896 154047 145864
18900 145864 118369 98391 78220 72370 61726 36067 -8451 -14430 198 5568 -23404 2134
18888 2134 12206 2736 -2830 9663 13565 24275 22555 -20073 -12238 -9564 -13353 -7327 -14759 -56413
18874 -56413 -85832 -66926 -22967 -15310 -4700 -30584 -20984 15413 4837 -10121 -30073 -33807
18862 -33807 -31898 -8886 40042 48315 23249 -33697 -57547 -41653 -26495 -10848 8124 2644
18850 2644 9194 -6732 -14552 -1939 33789 25444 -12988 -10739 3484 13021 -3013 -18380 -6191
18837 -6191 -28891 -34215 -38898 -17271 18322 18989 2818 31966 -13575 -50610 -41881 -18030 10816
18824 10816 50362 63832 28785 3769 9303 30222 59957 88711 86415 46074 -2010 4033
18812 4033 7362 19686 16702 -18279 -44896 -55803 -25461 -14839 -23819 -47563 -46066 6044 37898
18799 37898 20645 17502 32074 26619 29546 36395 6957 -33089 -1535 19373 -8674 -20344
18787 -20344 -18978 -3601 -7197 -2522 4981 14183 26486 31950 33279 13324 42782 58146 30855
18774 30855 2614 15517 14071 73404 130332 138139 195903 281966 372307 401154 317317 225018
18762 225018 149705 110400 72363 69588 41688 42005 56315 28240 35374 5658 -9683 6902
18750 6902 628 8981 6937 -23629 -11631 10772 -27400 -43194 -21549 29608 43900 -2303
18738 -2303 -14446 -14632 -15256 -30659 -21798 -11933 -13314 -20172 -7897 -23384 -29488 3816 15477 31765
18724 31765 -8418 -41599 -21206 -21829 -28949 -23610 -1657 29024 26353 30823 39276 7258 -22217
18711 -22217 -43607 -47548 -37803 -17001 -6578 -5733 -5203 -24212 -27915 -9943 18703 -778 -24154
18698 -24154 -29521 -38308 -49821 -32574 6640 40301 50550 59195 61318 76234 79321 56834 12055
18685 12055 -29577 -26004 -15524 7192 -2587 -4468 2469 15635 32047 48352 8635 -16643
18673 -16643 -42 -15109 -37634 -55613 -73282 -55620 -6548 50076 55578 85555 98697 94340
18661 94340 86564 115065 158194 200395 250919 323550 354284 370152 343607 295044 269718 245518
18649 245518 200653 171939 164344 167711 134723 97640 71584 100700 125246 85931 63167 53251
18637 53251 39373 40392 21578 -17351 -28921 -5523 12095 38587 39739 48259 22911 13093
18625 13093 23368 26243 20860 -9711 6336 32371 35034 46998 34957 36255 64023 74434
18613 74434 130248 135553 107984 116929 110012 116283 150218 184701 246188 320303 359328 411019
18601 411019 438218 419375 372864 298957 256863 222998 153051 133198 133049 76137 44856 37761
18589 37761 50700 61560 20056 16178 4226 -4604 -11282 27204 54930 35536 28678 -3211
18577 -3211 -2125 1961 -10977 -25538 -26503 17196 14893 -4608 2377 9421 -4698 8754 28316
18564 28316 56506 59457 40184 52388 27171 11150 34475 51812 29161 1188 11677 18291
18552 18291 19642 26519 48399 40315 12375 575 10763 -8930 -2675 -4263 -38648 -60844 -67069
18539 -67069 -70328 -66078 -36199 5391 39651 42283 12235 8095 8090 -14448 -15221 -14323 -15766 -27069
18525 -27069 -32308 1706 46695 45383 55249 61524 22597 18523 18063 47202 22822 28097 31729
18512 31729 36522 14921 -12951 -18620 44761 59766 23920 6978 1579 8200 4511 -16325 -22485
18499 -22485 15195 32525 39831 23274 14594 8963 15572 29907 25668 21904 6461 35029 40255
18486 40255 5146 -30224 -29352 -7229 9685 34292 41648 67470 67957 31709 11730 16568 53914
18473 53914 46152 39407 79520 98999 82066 28087 2757 10423 4546 20527 35873 24720
18461 24720 31748 31499 4782 -2109 -3221 -2766 12206 18169 33178 32807 -4087 -16988 -6286 -31354
18447 -31354 -19663 20324 57639 90682 118440 81059 77133 105894 84693 61703 19059 19208
18435 19208 31189 63535 81635 105280 80717 70623 56970 53603 84611 118191 103997 50729
18423 50729 5410 -13939 5941 -5991 12136 37918 53242 45050 21545 27816 28728 15843
18411 15843 20743 13134 6765 23190 23784 -14516 -22709 26197 32101 39766 43769 18559 36002
18398 36002 52028 47894 38183 36810 56407 85094 65455 34799 51242 55676 39896 25728
18386 25728 32104 31845 42660 28089 16659 10107 -4354 -2949 126 15056 23847 35407 29529
18373 29529 35505 51169 76341 32764 -3995 887 20767 53493 32055 20531 19314 71030
18361 71030 107603 81109 80575 88431 63721 42471 7143 4190 22907 23225 52192 55482 52009
18348 52009 23744 31341 43219 37846 52769 65237 49393 53885 67937 56722 37586 23159
18336 23159 29931 47812 59207 65215 37258 33148 58856 49734 20744 1248 -484 22587 20534
18323 20534 -4441 -25753 -30259 -30205 -39125 -62960 -41361 -8033 13955 20137 35860 47548 60922
18310 60922 34104 -5300 11685 30151 3755 11029 49321 63528 66037 78535 77530 82393
18298 82393 74201 93348 118648 104649 115653 122413 118562 100305 76899 77776 74758 70456 52063
18285 52063 63207 62107 59178 70419 72493 76421 94660 77997 85025 47963 37189 6433 10857
18272 10857 44584 23766 1874 -658 -8951 -41294 -38564 -17173 1258 7266 22680 15778 14148
18259 14148 19553 31395 60531 51261 -2986 -1924 20019 18985 -525 -13365 26820 35328 46822
18246 46822 47558 88668 124599 114182 121180 139903 122808 121740 111347 61238 25432 23374 43553
18233 43553 65102 46937 83230 71076 80020 93067 86916 40657 20840 45149 52521 80906
18221 80906 108165 116318 108413 82002 80991 116910 118719 130144 124407 91552 76073 70018 82851
18208 82851 103913 140305 174015 183704 201249 251554 260163 214153 174629 166962 174258 211069
18196 211069 251944 264322 273710 273329 257654 236679 248044 252016 237214 242716 256563 250586 254089
18183 254089 239426 262659 313842 376182 402178 422519 503387 594403 631967 708737 841244
18172 841244 983335 1144837 1310777 1422983 1488939 1550946 1580653 1643548 1677860 1725192 1859607
18161 1859607 1991906 2140957 2326899 2493631 2675647 2905285 3242354 3730048 4449482
18152 4449482 5564074 7254158 9879191 13976724 20120128 28711976 39574708 51596860
18144 51596860 62721429 70489882 72966882 69587333 61346449 50362421 39090875 29207868
18136 29207868 21486727 16023413 12372835 10026570 8683744 8074502 7973841 8166202
18128 8166202 8572966 8984707 9301600 9443838 9291855 8909029 8380492 7784060 7283422
18119 7283422 7026601 6978080 7174748 7694718 8584917 10007880 12375531 16403220 23593867
18110 23593867 36308674 56391436 78024517 86717930 76270602 53955028 36017260
18103 36017260 25149299 18747890 15041237 13118087 12542554 13270040 15490737 19745685
18095 19745685 26554505 36300250 48566028 61799622 73363322 80422366 81064681 75180142
18087 75180142 64392491 51351152 38740538 28164031 20151454 14513906 10704698
18080 10704698 8165964 6422286 5223711 4337057 3709187 3232971 2875892 2640431 2441975
18071 2441975 2253656 2123102 1996883 1915000 1902016 1897468 1933084 1912873 1837178 1750035 1628027
18060 1628027 1511894 1366387 1198726 1045535 883316 706306 602515 543656 500388 444274
18050 444274 408886 375723 354532 326624 316019 270256 260729 270813 259193 246318 262671 234370
18038 234370 222268 262769 291625 286326 289559 297224 301677 268653 228795 203129 205738 191584
18026 191584 192596 225863 259186 236221 189893 192740 199387 214270 221878 210927 224776 210575
18014 210575 175086 167156 163469 173447 192069 201525 176365 151972 151173 120290 101700 106408 98628
18001 98628 98598 120521 115563 143273 148798 142910 125536 124008 141282 137153 114666 107656 157210
17988 157210 168979 131170 129418 112120 138745 142719 140098 125193 93498 106195 93944 93757
17976 93757 67739 28481 15431 37775 54022 57050 53305 71701 79592 77429 80436 98324 97421
17963 97421 108521 100001 77790 98469 80178 79755 66711 70734 60836 47451 45962 44682 55446
17950 55446 85760 88863 68830 60460 36517 53587 64850 69244 66234 31292 7943 13159 44817
17937 44817 61928 69740 59728 33470 45435 57812 89577 84615 69827 42063 48146 85253
17925 85253 101966 75659 53854 25779 9597 -123 21375 6259 7222 27705 49824 26274
17913 26274 21151 24959 6867 8090 7538 16861 18486 -3598 -5389 -7473 -27279 -38315 -16414
17900 -16414 -6589 -10860 17101 27727 23808 46520 63850 70671 20781 18938 31358 41706 47507
17887 47507 51613 56098 61391 79866 79290 87171 77545 65905 40722 20595 19928 7786 27655
17874 27655 26059 22305 41124 18148 -5624 8674 38353 41558 47638 69354 40643 24740
17862 24740 42687 36843 32879 46381 41200 60869 46207 31849 44941 23918 15001 5689 13618
17849 13618 41428 78928 39053 24060 17636 39512 24614 1070 -32894 -7961 30121 14694
17837 14694 -13069 -7795 18004 -13138 -20579 -15195 -8322 25362 38655 57006 35822 9737
17825 9737 4303 5852 13389 3529 -42746 -53583 -41393 -33194 -55620 -27306 -24150 338 5854
17812 5854 17938 23617 10385 -29092 -22166 -26016 -36196 -21131 13288 -3964 -34887 -35876 -18168
17799 -18168 26453 16288 -13103 -22846 -17533 -27710 8963 23934 37144 16810 -25596 -58795
17787 -58795 -75305 -59995 -54571 -57077 -15211 4816 8779 22710 5348 -29741 -72561 -44285
17775 -44285 -20213 -28858 -32124 11797 16839 -8589 -34583 -32965 -21050 -22379 -18356 10033 8203
17762 8203 -23620 -36753 -36796 -35662 -31576 -51162 -63184 -53091 -51318 -42893 -21365 -31395 -16419
17749 -16419 -12218 -31948 -28734 -4633 92 7089 -7690 3733 8382 8104 18058 15774 19248 -10355
17735 -10355 -32469 -48402 -25511 1555 -9809 -8253 -6653 20615 13934 -20374 -35134 -31448
17723 -31448 -18217 -311 27768 74902 92485 67341 38282 14834 19041 3014 -17482 -43713
17711 -43713 -56988 -65044 -51015 -20285 -31583 -8681 11899 12794 20499 51170 45289 50566 37227
17698 37227 -4082 -5279 6991 3138 1981 7664 -3430 27874 57471 49665 46583 61138 29623
17685 29623 -19973 -38881 -20652 -9441 -5496 1116 -18618 -63607 -61736 -43146 -41389 -52262
17673 -52262 -43460 -20351 -12510 -37262 -20162 15582 49212 50346 52945 57962 50582 57499 34678
17660 34678 6922 -6707 -153 -15982 -23896 -332 9403 36711 52367 31359 32443 31544 34420
17647 34420 33128 30669 5595 -4912 -23336 -21695 -22972 -32394 -5806 -14912 -16654 22622 21351
17634 21351 8072 -6886 22933 42697 92400 162782 214606 262387 308801 347155 384541 364561
17622 364561 343123 294894 234483 176266 143121 123547 93454 50753 45879 11974 -20235 -47061
17610 -47061 -51267 -25016 -3113 -21681 -29426 -21271 7155 29691 44818 38407 47394 51177 43180
17597 43180 38189 44439 59524 69481 60935 30057 34596 42746 51636 43091 15808 581 12542
17584 12542 23522 5307 -1303 -1890 67630 105683 116895 139514 214996 331190 463377 528752
17572 528752 566797 532627 456249 385085 300275 254950 204256 170039 144793 99887 66006
17561 66006 51784 74020 73440 76506 65889 23574 9715 25875 43856 20652 -234 24340
17549 24340 16935 37651 66601 54513 39910 38623 40044 52258 54297 74013 136513 212347
17537 212347 239150 248544 252210 274202 298645 300381 286229 264253 219680 197751 199835 229560
17525 229560 217959 192181 191839 162181 164713 152126 116424 112853 106501 73457 66232 79666 56898
17512 56898 34866 -16993 4208 30341 35077 26142 20316 30450 39741 28270 41416 31118
17500 31118 -1104 33097 91637 86497 106029 107261 115713 133540 168444 225607 264433 314880
17488 314880 373513 420652 465415 532548 577359 612498 638597 641777 628942 593329 593169 613272
17476 613272 643410 612111 578953 543641 517640 471445 416776 332382 247408 212710 174710
17465 174710 127882 104038 97636 60940 54733 74674 114230 105105 71208 64757 69282 46337
17453 46337 49102 55047 15152 1580 4758 30403 33581 24011 53438 108520 199428 322846
17441 322846 392040 368895 268830 223962 156940 108193 39720 4699 1395 -15459 19958
17430 19958 41869 39169 13859 -7527 -14965 -24184 -44878 -37804 -32263 -24633 13650 18779 1340
17417 1340 -2693 -6862 -28102 4480 7984 11454 13796 3186 -9488 -35109 -18221 13254 52279
17404 52279 34044 3034 9128 -20449 -66915 -46561 -43201 -25775 -5572 22233 32838 29580
17392 29580 11486 15696 24868 32464 61922 33546 22934 45050 50140 35092 16747 28594
17380 28594 16391 13422 15672 9064 16763 45348 84668 112217 110905 108822 58482 49831 37408
17367 37408 34740 24371 40794 70647 62343 85528 93313 66382 74707 77830 55521 40095 43819
17354 43819 73222 85494 91355 99525 108162 82410 65320 71811 60752 52779 61862 60186 43041
17341 43041 19013 35578 51299 24206 -3435 -26881 -20560 -11413 33620 51637 39567 22808
17329 22808 55941 80883 100789 74476 57915 57085 29811 19111 46691 31532 47609 48578
17317 48578 46998 93911 76232 34048 16584 -5661 -5495 16886 47776 35742 25248 22078
17305 22078 22734 15880 31744 28710 5814 -3627 -16331 -18032 -23977 -12271 -10901 3989 818
17292 818 8476 14292 24944 37760 39044 53036 65486 64804 38012 52221 71608 60876 86811
17279 86811 82894 52768 29095 42750 72968 70271 54927 49236 101292 131343 112964 72941
17267 72941 49337 42958 54839 45443 37654 27701 58528 69535 83646 119231 120661 63717 64821
17254 64821 106157 150950 152216 133777 128041 97856 109209 139835 137044 139723 124137 142621
17242 142621 184353 181200 182327 173496 185974 206895 194365 164415 148777 138554 113667 133019
17230 133019 148468 155001 138362 138249 144329 133888 121439 133696 160555 144802 117346 140438
17218 140438 148479 152995 132337 109376 106222 146858 153560 136120 142871 136771 127112 100205 75705
17205 75705 60931 36300 41878 42605 37894 58779 83394 71273 92854 97406 84441 67576 79579
17192 79579 110132 128573 156334 127882 89641 71673 85361 139022 174386 198097 200912 150143
17180 150143 128829 124726 140006 152256 135134 149743 156793 127384 115955 141763 124839 88407
17168 88407 81134 86865 102424 116240 136159 149365 142003 100634 95857 96337 62551 53889 47043
17155 47043 32786 21254 35725 83629 92372 76037 61351 31251 10685 19600 19862 -11868
17143 -11868 -19693 6450 65049 98332 99311 106248 73576 69294 55021 40299 68876 65323 68326
17130 68326 43819 5084 11202 23215 77499 96806 104920 113615 111093 127825 162689 148088
17118 148088 81063 57160 83749 132645 150098 111453 57024 66602 54727 53699 70984 88186
17106 88186 104566 76994 46890 23418 52790 51375 66041 127792 149852 124518 156428 201450
17094 201450 224372 235853 232648 232742 234382 215746 209282 223492 243011 248596 264919 264356 252479
17081 252479 250977 243335 276233 315252 316608 345985 337145 353619 370261 363996 382827 380278 379562
17068 379562 380552 386961 372285 383472 417590 451969 487891 495268 518536 572593 639562 696641
17056 696641 733850 771990 815715 871159 916798 984989 1057228 1132729 1261634 1437729 1565517
17045 1565517 1640777 1739562 1897617 2014841 2156918 2295025 2494190 2749596 3062947 3503710
17035 3503710 4124131 5072096 6507814 8575452 11258059 14282569 17657267 21718796
17027 21718796 26040075 29246372 31140496 33116518 36009511 38531806 39951934 41359707
17019 41359707 44103694 47929946 50797638 51133612 49800466 48913088 47224531 42707326
17011 42707326 36091219 30132583 25278634 20802659 16785112 13886226 12144248 11272588
17003 11272588 11006903 11304025 12220031 14002347 16976248 21021459 25443182 29689282
16995 29689282 34316540 40725788 48923543 56010889 59553650 60938824 64560541 71413089
16987 71413089 77287134 78688697 77664625 79542659 85370616 90263168 90236979 87609166
16979 87609166 88287352 93186232 97093489 96614545 93769992 91192702 88056363 83203666
16971 83203666 78087101 72378546 64727052 55702846 48155373 42710743 38101900 33367879
16963 33367879 28943785 25451360 23011126 20606065 17698353 14723589 12286299 10295077
16955 10295077 8416455 6753762 5515903 4637906 4008140 3507683 3098864 2787459 2559235
16946 2559235 2375753 2229414 2094551 1933005 1831690 1716005 1620236 1494905 1331050 1176917
16936 1176917 1056327 976693 931858 888717 816519 749896 690912 637942 612289 590775 524162
16925 524162 522622 517317 497598 475045 436858 434071 405382 397220 352150 346722 384898 380440 372078
16912 372078 375368 399998 427290 436670 458040 480700 493255 529889 538355 551839 570505 612720
16900 612720 622542 604482 598771 589625 604868 633751 640140 602439 560442 497959 441829 403662
16888 403662 401238 399958 353888 316411 337799 340918 336765 365055 392211 402107 411299 437997 442634
16875 442634 478788 490078 481435 480693 484564 461602 445132 426233 405328 370630 347474 326867
16863 326867 328692 337321 331957 294520 255039 252256 240636 218079 226337 197776 200727 197758 184419
16850 184419 193630 235286 227807 209904 218824 231805 237729 238393 184415 185191 179991 158834 139745
16837 139745 155776 204976 183778 170875 186878 220746 206373 197895 172957 180077 192486 188640
16825 188640 179623 166414 173086 164303 188832 212423 211455 210309 221533 205554 162698 153427 160945
16812 160945 146597 114594 92306 109676 94875 89640 69616 71261 60095 26853 11677 13618
16800 13618 38935 55233 33703 36716 36067 -4301 -5650 23583 5654 9938 17388 27281 26863
16787 26863 37600 63263 49795 21821 -5048 -13672 8998 20129 27987 25606 11275 2664
16775 2664 912 -2283 27392 28559 301 2692 -9129 -57082 -71319 -72648 -53967 -23154 19745
16762 19745 35428 12047 -6152 11418 80582 86655 55736 3795 -238 29698 767 2438
16750 2438 9972 2149 5756 -9830 -5854 -19568 10080 28686 30197 49516 46102 3598 -20753
16737 -20753 -23023 -16444 20639 78367 85423 27831 -4309 -7936 -15487 -13463 -9839 2347 53566
16724 53566 35103 14181 4980 22982 13648 -2279 7676 2371 1813 -1935 39332 67585 23307
16711 23307 -9571 5869 37979 39990 47205 38812 42199 28058 11142 13368 18221 3654 -20542
16698 -20542 -8932 4397 -6224 -23175 -12219 -27770 -27042 -33409 -14958 4434 9189 21041
16686 21041 -427 -2771 17175 9536 -6979 -12543 -19689 -33675 -48075 -53683 -49025 -38790 -44417
16673 -44417 -57496 -49196 -13403 -1072 -17445 -27431 -47639 -44377 -11105 -23252 -31337 -55947
16661 -55947 -61982 -64118 -50794 -19112 24278 35624 12950 -29394 -29684 -10136 -6349 -23417 -69400
16648 -69400 -59675 -26815 4940 14736 -1367 -22589 -71652 -97428 -64073 -21093 11480 -8655
16636 -8655 -19423 -31268 -47546 -32236 -3132 -2266 -20716 -8795 28571 -6496 -51670 -89756
16624 -89756 -83521 -52557 -7336 58 -14699 -80310 -94134 -60753 -64855 -57259 -39966 -59779
16612 -59779 -83962 -94396 -61459 -50189 -66966 -43278 -28740 11438 22894 -4833 -18846 -23386
16600 -23386 -47493 -58790 -70611 -62778 -10135 -26592 -30659 -23683 2418 8440 820 -25493 -28877
16587 -28877 -47635 -66879 -22988 -3673 -3917 -5315 -26737 23021 41892 6589 -7849 -58510
16575 -58510 -59128 -27298 -18225 -2628 -1077 -13225 -31736 -13874 -34728 -37683 -31846 -20397 -21685
16562 -21685 -11933 -14100 -38506 -31744 -48397 -64644 -56265 -31433 -15947 9163 18783 51368 31056
16549 31056 -3009 -8521 -21001 -40873 -94969 -100313 -101199 -64625 -28707 -57950 -53790 -45173 -29740
16536 -29740 -14840 -4027 12599 8768 2042 6054 16360 36059 33810 37716 16142 -4232 -1135
16523 -1135 -4271 2720 20501 40299 50059 55269 46418 36096 38527 38856 22864 54443 87783
16510 87783 103223 110030 166299 208290 242857 261426 291935 248933 212915 232250 282284 297730
16498 297730 293659 269751 305737 314256 306191 324698 380198 417970 435281 443279 462012 470288
16486 470288 435011 404468 425278 396281 394410 416488 397699 375528 342028 312272 275430 260651
16474 260651 242133 220976 188973 203404 172142 102167 81267 99539 105839 106913 68873 39225
16462 39225 40032 69967 103759 138108 172758 185086 202799 209360 178811 171494 182623 188298 226608
16449 226608 234778 224479 248983 264914 209037 202059 188868 134660 99667 53740 23506 16652
16437 16652 -10564 34124 58470 23169 32824 11402 -22315 -29149 -35282 -27103 2172 33340
16425 33340 43445 31588 4178 -41281 -31733 -37471 -31254 -33073 -47991 -32824 -25253 1649 -14449
16412 -14449 -34253 -28638 -30814 -49181 -59182 -29461 -32983 14790 33185 4180 5544 14915 -269
16399 -269 -31983 -22058 -35634 -36779 -16684 -31943 -51232 -35440 -24121 -24607 -40522 -24212 -9922
16386 -9922 5886 542 27887 5153 -5322 -25617 -15874 -37934 -59772 -50331 -55437 -57610 -57774
16373 -57774 -26592 -18075 -37214 -34443 -4244 5281 16289 16949 -19081 -55983 -67530 -44955 -48079
16360 -48079 -12167 -19738 -35233 -33837 -22010 -136 16160 12694 -7470 -27595 -46878 -40684
16348 -40684 -15958 -15425 -30069 -16606 -33186 -21758 -14875 -38529 -39589 -17815 -38518 -34770 -40791
16335 -40791 -56913 -26689 -29021 -47981 -10554 -36860 -53961 -22856 -12958 -15783 6151 11924
16323 11924 -503 -5281 -28652 -11045 12457 8445 26414 -19469 -52547 -46219 -16213 10369
16311 10369 6819 -7058 -19454 -13783 23276 22135 -14105 -43946 -39968 -37043 -35349 -55701 -33323
16298 -33323 4592 -7693 -32502 -58419 -39737 -12142 -19299 -23239 -11383 25955 49529 48915
16286 48915 -4537 -29940 -20139 -41136 -54853 -56707 -73077 -65051 -31759 -12723 -14004 -33289
16274 -33289 -21302 -36202 -23182 -40916 -49928 -4389 -4178 -27553 -63596 -30052 -14433 -4930
16262 -4930 1792 -31446 -54930 -51414 -54184 -75750 -33953 -433 7331 30508 36415 27213 13673
16249 13673 -842 -11460 -22308 -50663 -59076 -56173 -62948 -43293 -36511 -36721 -41642 -35174 -36948
16236 -36948 -43069 -20690 -17458 -23261 -18195 -40748 -38821 -44144 -83797 -106223 -91689 -59076 -19348
16223 -19348 -14366 -20643 -26082 -15800 -24799 -55554 -84929 -70643 -71760 -76911 -47417 -16397 -24339
16210 -24339 -34491 -29432 -26690 -47052 -59935 -46479 -76642 -113947 -72825 -58854 -42509 -24313
16198 -24313 -26132 -34220 -41341 -36859 -13983 517 3061 -12219 -6322 -11154 -13442 -11431 22159
16185 22159 34637 13368 8303 4776 -6864 245 -26843 -19146 -19491 -56998 -28725 -19362 -41244
16172 -41244 -43476 -28358 -41480 -46014 -37529 -31160 -61226 -38325 -11129 -22337 -45542 -28930
16160 -28930 23718 38442 23818 2353 -12567 -28932 -37381 -41412 -68476 -53915 -49946 -35083
16148 -35083 -11988 -6380 -14283 -15893 -25206 -10924 9327 4261 -33799 -54535 -20922 -13897 6297
16135 6297 -16378 -13703 38 27404 19101 4581 11177 8031 7217 -7348 -36458 -4183 7891
16122 7891 -275 -43 -11499 -6683 -38521 -34882 -8669 -6067 13631 8513 11495 37480 68780
16109 68780 39997 -26511 -36474 -29139 -38783 -30143 8601 -4857 -80408 -88020 -41986 -31385 -40936
16096 -40936 -1044 16849 -31749 -59793 -43413 -45069 -39769 -24693 -17682 -3099 -11741 -38996
16084 -38996 -50619 -30584 -11870 21108 -3159 -19114 -20008 -29573 -41167 -66094 -45165 -23048
16072 -23048 -9201 -4987 -14065 -35866 -29144 -25240 -37453 -72068 -60081 -31517 -11491 15785
16060 15785 -93 -9324 16298 6028 -14650 16185 29899 25362 6192 -30944 -47464 -12215
16048 -12215 6137 17187 4405 22054 36412 17185 -9826 -9403 15634 26257 17972 -1272
16036 -1272 -31247 -34475 -38906 -22628 2074 10511 -30635 -47602 -49430 -26889 -43304 -15832 14259
16023 14259 1625 2762 -93 -5998 -24936 -41691 -25730 -26893 -44782 -21116 -11433 -17152 26468
16010 26468 18334 -25437 -43315 -57174 -30823 -16425 -3048 2479 -3463 -29816 -56004 -45046
15998 -45046 -26209 -8225 -21805 -47316 -64362 -70343 -60886 -70016 -62353 -47978 -44695 -81233 -107777
15985 -107777 -92780 -54970 -47317 -47599 4606 47338 39871 41887 32376 39155 11430 11898 9547
15972 9547 -7977 13240 15834 3849 -1032 172 14104 20893 19546 -3400 -19477 -38319 -24505
15959 -24505 487 775 10607 27748 19131 3219 -1780 -24442 -26366 -13152 481 457 -11753
15946 -11753 -46908 -55076 -20221 5405 25725 24548 -16002 -28956 6389 -71 -16657 -15756 6655
15933 6655 27696 13822 -8291 -18757 19550 45959 30560 6748 -14208 -5820 -15455 924
15921 924 20225 7788 26363 10312 22515 34246 6499 -34007 -42067 -23892 -9645 20761
15909 20761 2766 -19981 -22795 -4676 7946 -1579 -39386 -62360 -61782 -64965 -48923 -1036 22490
15896 22490 -10849 -44641 -35667 -9958 -4694 8269 3079 -12235 -21733 -16645 -3022 -38475 -65342
15883 -65342 -70327 -83843 -46990 -6000 6040 6491 11521 14879 -8034 -16073 -22940 -34513 -38982
15870 -38982 -30526 -39026 -16677 -9105 -4888 -31439 -71398 -80156 -63415 -33902 -46202 -43724 -7183
15857 -7183 -4349 -30430 -45680 -38311 -37186 -43369 -8225 -31483 -60522 -53775 -19187 17477 -18007
15844 -18007 -4564 4987 -12432 -39575 -31338 -40445 -22368 -2823 17382 5090 -9089 12737
15832 12737 28148 18201 -12105 -48478 -62317 -43138 -30175 -44210 -36973 -28248 -23846 1398
15820 1398 23906 46251 36013 19495 3045 8660 -3434 17089 5502 21327 21286 -13092 -22339
15807 -22339 4039 10722 23699 26578 15198 753 20878 -12418 -29491 -18726 12140 24425
15795 24425 20630 -13050 -1426 28491 48827 50011 14076 -33878 -40000 -29188 -2546 4642
15783 4642 1639 16615 26839 -11533 -50815 -80251 -102388 -79045 -31018 -38203 -30565 -9998
15771 -9998 -11821 -32435 -61896 -75528 -44608 8510 1825 -12261 -3741 19039 -15522 -39378
15759 -39378 -21955 521 49783 55098 42725 28746 4892 -27442 -31081 -27828 -18091 -34580
15747 -34580 -19690 10230 -3396 -49659 -46550 -30254 -39646 -54292 -36500 -17164 -33459 -19804
15735 -19804 -2522 26166 30666 11699 42692 55428 57614 56397 67615 66739 45494 28239 37254
15722 37254 30311 33326 43119 27204 30287 40838 63694 94443 97923 61826 51633 55442 43413
15709 43413 32327 -11527 500 34629 23366 22187 46763 39691 5449 -19149 2993 29782
15697 29782 51235 57874 84561 72063 76071 85879 87312 54165 42255 66140 64750 51070 61966
15684 61966 41436 49802 36397 17241 -10078 4870 40234 19926 2057 15902 37362 28025
15672 28025 -17580 -30385 2712 49588 49630 74613 79714 72036 41986 9031 13007 21005 19087
15659 19087 -18569 -11062 28745 32469 58812 50078 49366 63552 51660 48300 55630 59512 52333
15646 52333 33419 11937 13263 11905 30043 47055 49119 52278 29344 44700 33930 46576
15634 46576 59252 74206 78730 81851 44457 14109 7440 27910 41831 42544 69485 64714 82166
15621 82166 70496 56053 44492 71086 89639 57688 11774 -13030 24217 25780 24277 46699
15609 46699 36852 45582 74207 37836 37496 79605 89628 43723 50320 94912 111374 119979 92913
15596 92913 76952 86187 97899 98915 103250 102578 103772 88515 78409 69347 64364 43452 32186
15583 32186 41682 86180 79440 46744 40143 69025 100724 119955 125927 117538 76545 37749 86053
15570 86053 114956 114963 113596 106827 90521 90143 92391 88376 88157 73729 42453 37885 46697 61625
15556 61625 92322 93184 85411 84787 58615 85894 96445 93011 118523 123925 117531 110016 101098 90379
15542 90379 83566 86006 80039 107334 127588 123951 134553 130107 84301 48106 74218 86181 84023
15529 84023 66396 64018 49745 56466 87382 104371 113409 82038 48744 40800 36544 17382 30782
15516 30782 55466 82333 98590 117857 135583 113387 80777 60103 39289 44805 28871 33518
15504 33518 31129 40191 46598 34395 -7575 9230 24860 23962 12689 38139 64740 72400 29083
15491 29083 2070 46646 66838 57360 61004 77504 103999 105305 71987 42294 47267 51886 32007
15478 32007 20807 6654 52290 88053 96673 96862 62839 32351 44077 52374 51418 47471 55071
15465 55071 63894 66160 40224 20016 26145 47564 42338 51111 54914 46132 62804 83797 52952
15452 52952 21149 7679 -228 11999 51847 26599 -3480 2490 23318 3938 8253 17999
15440 17999 23724 7188 8777 6856 4178 8010 2525 -13157 38872 33974 38807 35086 -4370
15427 -4370 -9048 3284 26430 40531 26116 37779 36286 42773 25190 28814 46242 24153 29198
15414 29198 10542 -33280 -6373 -9356 10721 8947 -15358 9932 41502 49700 45971 14309
15402 14309 15034 39163 60239 35141 46097 45235 51867 61222 72448 66829 37700 6870 18697
15389 18697 4511 -27417 -15825 -29363 -20894 2350 6029 6303 -14053 -19939 -26092 -23238 -2130
15376 -2130 14300 -4510 -20890 -9176 -6467 -3749 5580 7067 13017 40550 62403 78501 71449
15363 71449 60734 73214 64160 66400 47111 3996 9011 34637 25848 34591 40531 43339 49911
15350 49911 73405 79786 76305 52273 39804 34415 7447 -14123 -35717 3139 8593 -16772
15338 -16772 2216 32553 12930 7456 18975 16274 2699 14230 19038 36964 23305 32741
15326 32741 24524 3628 -6035 -13226 -8820 10459 23429 46861 53260 52373 33583 2778 11161
15313 11161 22513 45579 54236 58317 23668 6941 17483 22642 -12815 -32574 -36969 -30669 -31604
15300 -31604 -32336 -19230 -8326 6383 -748 -28586 -72916 -57224 -61343 -40398 -36714 -66937 -50764
15287 -50764 -20382 -49769 -66913 -85789 -75446 -32813 -2747 5512 1951 -4973 -3439 32947
15275 32947 51072 52711 48761 8307 -18448 -477 33106 22228 5778 -16135 -8739 2862
15263 2862 13224 22067 31957 25799 1984 -26289 -39442 1416 23821 25455 8903 -21547 -27086
15250 -27086 -11052 15634 42818 78668 70534 59478 25232 17589 51972 53713 30044 18471
15238 18471 7452 -23923 -34633 -36857 -24906 -34581 -31962 -7690 -999 -8177 -69478 -66234 -31274
15225 -31274 -6451 -7268 -2984 1499 -6232 -29850 -24385 11335 -6640 -29079 710 -6812 -17187
15212 -17187 -20398 -40198 -44165 -13832 22944 23566 13575 26750 44412 29976 38768 26107 39650
15199 39650 56351 51305 33677 21740 14043 39295 15357 -14365 -5638 -7671 19786 27530 17235
15186 17235 26432 26910 24408 14329 19305 -633 -1643 26223 10648 26759 31116 20426 4813
15173 4813 21043 25719 27536 8671 8759 9446 18491 19350 7172 16321 28990 18603 -2932 -8227
15159 -8227 36348 37973 38452 20855 -43150 -48447 711 -2260 -50545 -70161 -40801 -18816 -29387
15146 -29387 -13599 24008 38843 47395 36125 22579 14233 -9776 -583 -5388 -38518 -57905
15134 -57905 -31148 888 32709 60453 9356 -57463 -33320 26555 50738 20721 28264 22142
15122 22142 5678 40300 59764 40832 7493 -18035 -4280 35760 55985 58223 45360 55555
15110 55555 41221 26125 9809 21986 27072 51224 70612 50272 56300 59601 52908 21786
15098 21786 15583 22481 18675 40905 22604 -3993 8452 -13451 12238 18162 12349 -28000 -24121
15085 -24121 -17678 16283 35161 22985 21797 18315 13487 35059 26069 17736 44906 31344 14474
15072 14474 21722 7531 -21980 -25790 -22287 -21342 -37162 -11672 -5733 -6782 -13862 357 4349
15059 4349 -8151 9872 15042 27552 11713 -25463 -4821 -16450 -26954 29916 41918 19461
15047 19461 -1692 16681 411 11149 27719 14027 -5527 -37935 -24764 11563 12003 -936
15035 -936 -4162 -3330 11986 17568 24034 8947 -11829 -13566 -9141 -41171 -43738 -8613 -12380 -62918
15021 -62918 -55553 -28946 -4959 -34315 -61008 -47474 -40587 -29945 -18045 -9634 25791 15157
15009 15157 -3917 24060 37769 1812 -5650 66055 173095 266180 309431 270491 206893 137700
14997 137700 86841 49898 33941 9966 -11799 -40210 -213 -14462 -21250 -11816 -30553 -19139
14985 -19139 -3159 68 29179 27587 38040 53148 19634 7862 9299 4253 -38439 -48685
14973 -48685 -84345 -56115 -9659 18336 21771 26890 39043 51433 14814 12227 17133 8332 2318
14960 2318 6304 39938 23220 -8053 -16082 14856 36778 35028 57546 38252 56800 46476
14948 46476 49548 27058 1189 5307 -6951 -37621 -19912 -11661 -10246 8365 40014 14947
14936 14947 -946 41857 68184 52800 4646 -8216 7907 -637 32308 46131 52393 16159
14924 16159 712 -3756 -12009 -39747 -45232 -44073 -27010 -632 35739 37665 9881 -10329 -15168
14911 -15168 -14403 -24630 -3587 3863 -2542 -19931 -57753 -36064 -14213 -2279 12794 -12598
14899 -12598 -9952 -15798 -31564 -15622 10700 -808 -23359 -3939 -36784 -45041 -47184 -54373 -39625
14886 -39625 -41848 -16770 -25003 -26219 152 7058 -18142 -23484 -67406 -101279 -80473 -37115 -14104
14873 -14104 9840 8492 8773 2137 18614 35937 36649 2422 -12861 -21136 -49613 -43474 -18876
14860 -18876 -31046 -43877 -34896 -19897 -10788 2520 1997 -23092 -15731 -20844 -23086 -44280 -25556
14847 -25556 -49514 -37421 -26408 -8568 -20776 -25154 -6117 -4977 -5324 -5040 4133 28461 26141
14834 26141 34240 -151 -16096 -7124 16627 -11542 -27128 -1338 8361 10054 -6268 -2417 13594
14821 13594 26883 43409 50956 26628 -21096 -50131 -64360 -41233 7107 31299 19665 30243
14809 30243 -26348 -5926 15900 -22307 -26243 -31124 -25419 -49371 -36046 -8827 16131 39117
14797 39117 25677 18021 5186 -17356 -36129 -12024 -10383 -23380 -11603 6177 -5871 5010
14785 5010 -6125 -3883 -22216 -40984 -26403 -5745 23086 13923 8884 -2546 -33801 -34875 -39685
14772 -39685 -51882 -67718 -76898 -66157 -57703 -52997 -11065 -19066 -29616 -43498 -29223 8582
14760 8582 34954 51365 71764 28979 -1454 8346 3393 -19901 -26901 -27844 10250 -23273 -27179
14747 -27179 11161 6305 6316 -15224 -42257 -31467 -10490 22327 10019 -11746 -9375 5312 24223
14734 24223 57269 59140 27171 36895 48531 65276 50845 41748 13203 32575 19483 1251
14722 1251 10159 29507 25170 -3366 -38094 -21376 -1096 -14603 -35938 -41791 -35824 -29864 -30677
14709 -30677 -5886 1625 -16306 -12348 -5720 -624 25135 48140 50605 27041 21146 2454 33856
14696 33856 45985 37328 50302 11095 1496 3218 14639 36479 45272 31753 30113 37705 10999
14683 10999 10124 14588 8037 30221 36481 26150 9076 30188 28020 -4574 -10797 -53967 -50147
14670 -50147 -44782 -54643 -23926 -3260 11329 41492 9019 -27355 -27145 -30403 -17988 10131 29886
14657 29886 27388 44623 60476 38034 13732 -15544 -3103 16220 13686 48013 32056 -28607
14645 -28607 -46424 -12007 11137 630 -17578 -50238 -21516 17797 34168 54043 59936 59429
14633 59429 41740 44522 56207 72432 72370 36487 14603 33327 30873 10148 18677 1210 -8844
14620 -8844 4105 -44179 -44671 -25121 -11673 -4807 38642 45024 48587 68808 79731 68226 45194
14607 45194 72029 66865 73522 73746 69487 50801 3488 -1718 -14515 5004 26976 54582 46461
14594 46461 48665 64230 69928 35417 19686 21702 26030 4094 16355 41144 63025 84248
14582 84248 58661 71685 50219 25439 32736 48987 32198 17693 27780 42222 35764 28902
14570 28902 49708 40895 59536 51843 28937 7719 19132 16869 -4256 22927 43094 32899
14558 32899 -217 -22356 22867 56144 46580 29567 33044 49132 40868 29698 30101 47279 57816
14545 57816 70987 81355 116267 116667 99303 91994 75990 59283 65131 59394 36582 22267 35183
14532 35183 43389 37667 29340 19899 3412 16641 24268 18602 -6711 -1191 42042 29495 17163
14519 17163 25696 22680 46311 42341 10067 -922 -19487 -25609 16653 46951 54277 56996 61905
14506 61905 26177 33299 31992 26327 -11388 -32704 -19304 -21753 7608 43190 48406 57455 58473
14493 58473 36228 39801 23680 20842 37864 32672 60858 42075 13983 -28802 -53965 -53572 -41149
14480 -41149 -34787 -28981 70 -8517 -3388 7715 1196 -34840 -20327 -3858 -3165 -4093 -32894
14467 -32894 -52929 -57138 -67796 -48206 805 15239 17150 26874 47268 45719 29391 18188
14455 18188 32820 22496 46499 52386 32708 32105 32978 49565 46568 74589 77700 66326 89693
14442 89693 93797 78120 58954 22608 2376 6182 54811 81018 114117 126553 130982 112594
14430 112594 86891 72312 64636 71222 60732 70328 74606 55116 46863 61591 73443 28435
14418 28435 19289 34667 46236 46928 43138 82631 70971 31592 54646 62542 54136 83408 56256
14405 56256 17265 22920 13968 48527 95154 83063 73711 55412 45703 86583 57540 47007
14393 47007 45094 25679 15425 27494 53270 68943 49704 68169 104364 86367 60408 92529
14381 92529 74515 65003 51867 17988 12605 7353 16509 13104 24788 53502 58131 36722 29991
14368 29991 39650 72205 51648 62264 67555 83016 91238 110389 94154 74630 43496 18369
14356 18369 49990 65610 60492 17658 -12558 33029 67641 73770 95200 99744 66298 46679
14344 46679 48242 49338 16945 11893 29867 91596 105840 74766 75134 43386 20012 14169 8765
14331 8765 584 -27778 -19168 9438 49001 70754 68685 45618 46018 80213 86437 74748 43192
14318 43192 54466 40397 43330 71354 90025 108308 81838 46539 57961 60431 69446 56694
14306 56694 27068 48457 52050 56067 64696 65703 86660 86799 49326 17784 32388 51874 29734
14293 29734 23114 39354 27119 28726 34479 51063 48788 62809 69588 34144 49445 78545 77232
14280 77232 74220 55597 12314 13329 18697 48479 75446 92992 115794 88118 92257 81244
14268 81244 59024 66580 49404 43463 -1093 -32060 -23455 27526 75784 100083 109787 80331
14256 80331 58578 41479 23306 23775 43024 38318 43781 31804 37210 34092 64321 91719 106963
14243 106963 92883 73580 68092 62861 88699 91301 48890 45952 46817 46287 34860 46890 70193
14230 70193 66072 63786 82001 103145 113732 118079 98953 108056 122022 107023 105778 141611 111554
14217 111554 70236 54425 78248 105986 91073 98452 102079 85485 91309 98177 83909 80959
14205 80959 88709 77318 64863 60118 91873 106166 110915 126126 121438 99377 59561 81192
14193 81192 91753 97279 109349 73563 40634 49429 66200 63762 66041 112710 103479 100886 85865
14180 85865 81823 75481 45244 -18416 9538 45388 28161 19204 36674 65800 60100 38694
14168 38694 49315 77618 68733 77348 60496 77016 83787 107895 106559 86556 57538 71102
14156 71102 90265 72023 72903 59878 55209 49247 99581 145194 144763 104692 123057 152177 169719
14143 169719 173723 115897 104502 128354 134094 119172 104606 133614 134396 122930 90823 50469
14131 50469 45020 49778 49332 90292 132235 148164 153867 160128 160772 154047 130751 119699 136921
14118 136921 125618 104832 111243 127383 145390 131025 113951 120497 132725 117322 129142 136900
14106 136900 151511 147656 102116 113003 142506 138378 105719 83847 82293 127453 121145 78884
14094 78884 71841 87046 117136 140084 155887 177723 168154 151524 149882 141535 115149 102021
14082 102021 99619 115066 108293 99367 82599 126545 145194 164232 165898 166027 144278 166317 191389
14069 191389 154890 149686 191490 164092 149041 138616 116329 137941 144288 143289 127629 158478
14057 158478 176337 211609 191226 155978 119458 136564 173938 151254 154131 162048 153621 141211
14045 141211 144066 175806 175314 143161 135337 177785 191009 164449 190307 168097 134858 155435
14033 155435 170729 147721 153647 175691 178069 180111 212408 197800 194659 197609 195678 165873 148327
14020 148327 170145 188186 168740 178394 204768 204671 168465 146408 162845 178187 147530 128844
14008 128844 146068 171665 186439 194227 166551 179631 195158 228443 258974 255666 242165 218130
13996 218130 228200 246918 254633 267344 269072 297980 310689 328623 361062 359435 359008 361107 331668
13983 331668 289109 294607 282121 299615 289492 268277 280675 317053 346619 331096 289431 271461
13971 271461 246701 215588 199647 193628 208342 239367 232311 232278 234700 217355 220997 227564 228992
13958 228992 221168 195631 220408 248910 254908 300059 285512 268889 277149 279898 270665 239364
13946 239364 239930 247919 276840 249175 217065 198195 203919 221563 254690 259513 243991 241249 221589
13933 221589 256233 267567 280988 294004 289937 279980 265382 285806 295436 283895 289434 273773
13921 273773 264785 246319 237694 255162 239651 248077 244244 244699 240137 213934 213983 245109 256441
13908 256441 267649 298780 269579 277349 285916 248131 221318 245067 276729 297248 296700 264180
13896 264180 270781 293220 293169 266684 230904 271159 324358 337001 323184 307806 305771 331452
13884 331452 333019 327088 354502 361621 346724 320513 328626 323695 322533 296767 302343 284249 276518
13871 276518 279416 305248 332585 329319 328278 339690 335990 307203 329411 363427 351514 320978
13859 320978 305236 327250 363003 373350 363090 370399 364980 377461 378385 375015 388715 384091 349595
13846 349595 335151 332015 348131 388842 425713 433487 409190 393552 396733 392487 394785 382354
13834 382354 369552 372978 388952 433313 437577 428249 445936 462838 459825 441303 428900 418918
13822 418918 427358 434233 435479 444831 441006 450647 412852 390526 435848 437928 432946 438676 457461
13809 457461 444938 457195 469479 476357 491224 483338 491446 481435 479843 455212 495854 495727 516473
13796 516473 520332 494235 497035 504018 473346 448030 467792 496119 508999 516893 530628 545103
13784 545103 568667 563138 570567 599039 637048 642064 652095 589529 572886 574279 581092 572585 589806
13771 589806 583570 602171 625542 638654 622941 635630 655816 661474 625068 572829 600697 625996
13759 625996 620775 612381 624179 610711 602338 631147 659827 665128 698799 693817 707703 724252
13747 724252 719019 704881 718953 739361 767008 779552 777391 770389 740003 737893 723075 701952
13735 701952 726302 698095 720007 742377 764777 767571 797864 825062 800129 789057 807461 815107
13723 815107 804917 798503 844844 920943 1002418 1053620 1135688 1269700 1433997 1585941 1618279
13712 1618279 1547134 1407419 1263509 1125908 1041643 1017387 992297 958880 948064 954269 979648
13701 979648 984435 992253 1001861 1005261 982745 992079 993771 988269 991837 987750 1010716 1000826 1030526
13688 1030526 1024068 1019058 1011428 1037839 1032935 1032315 1032572 1036271 1050238 1055264 1066030 1078385 1105754
13675 1105754 1116783 1138028 1175523 1198744 1230646 1214643 1219635 1241808 1231248 1236134 1265757 1256123
13663 1256123 1239441 1247282 1251564 1241361 1248497 1274278 1339294 1363736 1358002 1334668 1351772 1350626
13651 1350626 1366056 1390149 1431424 1478399 1461869 1453113 1458887 1478908 1492768 1475205 1485554 1530774
13639 1530774 1579010 1589288 1613230 1625307 1652830 1684249 1693887 1697882 1707227 1717316 1719277 1706090
13627 1706090 1708966 1744593 1787817 1833792 1834090 1850241 1876313 1887199 1930408 1971821 1990548 1977801
13615 1977801 1980092 2010922 2063638 2087083 2076198 2092420 2103873 2133829 2191893 2226439 2232030 2270620
13603 2270620 2297353 2314190 2341492 2369594 2384999 2381530 2416140 2474887 2538312 2548058 2536595 2526182
13591 2526182 2558989 2623392 2679695 2700530 2739528 2798267 2811583 2807471 2849384 2878504 2937170
13580 2937170 2996480 3039632 3083379 3150260 3197906 3255693 3260709 3317175 3378217 3408922 3441323
13569 3441323 3486787 3521700 3556085 3603860 3682906 3736385 3804010 3885710 3958692 3962642 4006675
13558 4006675 4104759 4194403 4264014 4305755 4370290 4446713 4533631 4599815 4617269 4711693 4807492
13547 4807492 4899715 4985792 5056856 5113379 5204002 5297203 5367158 5477205 5608605 5666874 5718805
13536 5718805 5810527 5942197 6068665 6179237 6286749 6360249 6468778 6613458 6711836 6798134
13526 6798134 6904132 7068376 7196437 7326662 7487552 7620189 7738862 7885404 8044205
13517 8044205 8199791 8347440 8500881 8647899 8840351 9027148 9201614 9362796 9562043
13508 9562043 9770729 9930318 10082109 10268211 10454642 10646287 10861218 11096685 11314871
13499 11314871 11523081 11749291 11996430 12230672 12504702 12775531 13006180 13229315 13470632
13490 13470632 13708749 13977766 14268928 14566143 14839794 15078462 15342448 15670916 15974577
13481 15974577 16291350 16578925 16874110 17164273 17465677 17782740 18058088 18307510 18633619
13472 18633619 18977094 19281517 19563645 19847127 20123856 20405402 20704342 20989362 21242345
13463 21242345 21480151 21711873 21922037 22147849 22381319 22584339 22765332 22902194 23035196
13454 23035196 23186681 23365795 23478556 23550052 23624687 23693645 23779059 23832132 23836019 23811199 23758583
13443 23758583 23710341 23633741 23557482 23482271 23347969 23185173 23042189 22906637 22751637 22604504
13433 22604504 22395776 22154440 21922172 21717429 21511353 21285552 21029975 20763266 20492593
13424 20492593 20194634 19906736 19619729 19337800 19060039 18768352 18472675 18192144 17873830
13415 17873830 17531545 17200887 16879883 16618230 16334901 16027443 15751983 15474819 15194382
13406 15194382 14902420 14611422 14377534 14075448 13788214 13539869 13291041 13029916 12782906
13397 12782906 12561899 12323088 12076505 11829742 11628026 11406969 11173731 10950821 10745099
13388 10745099 10553344 10357368 10144652 9948580 9737660 9538902 9362304 9182121 9010358
13379 9010358 8849368 8682812 8542836 8402863 8260750 8077145 7910966 7771499 7636203
13370 7636203 7507302 7367272 7256351 7150649 6994616 6835778 6707591 6613753 6525381 6454221
13360 6454221 6368154 6234727 6148921 6073960 5965348 5839341 5734689 5638790 5533287 5433724
13350 5433724 5368395 5289849 5176447 5099687 5013372 4925728 4855207 4793883 4726641 4680195 4601072
13339 4601072 4512718 4411984 4343942 4283891 4231650 4164853 4099964 4039991 4007457 3976136 3882664
13328 3882664 3768784 3693192 3638750 3578720 3547485 3549132 3543321 3527730 3486528 3388030 3332842
13317 3332842 3310547 3273469 3214013 3177865 3149254 3092136 3029012 2972267 2926577 2899800 2857749
13306 2857749 2827720 2799961 2741258 2706634 2678406 2672188 2662305 2600061 2572267 2544996 2480813 2442792
13294 2442792 2423653 2407019 2384093 2340995 2314976 2319788 2299823 2289759 2284443 2251267 2217513 2179837
13282 2179837 2168772 2136503 2107436 2080755 2045967 2005827 2018023 1996992 1952189 1911800 1894123
13271 1894123 1873032 1865792 1883267 1835221 1789994 1757399 1730483 1750544 1743183 1720976 1717957 1686079
13259 1686079 1648985 1623797 1651025 1662326 1617880 1588522 1587468 1564165 1561738 1544577 1536510 1511660
13247 1511660 1493653 1509639 1526566 1514383 1501638 1487414 1440725 1426722 1397118 1354849 1354228 1344718
13235 1344718 1323466 1316406 1315696 1285570 1282227 1265221 1215456 1175203 1153235 1165914 1186327 1204654
13223 1204654 1213632 1201009 1172823 1177916 1174475 1172931 1163238 1127016 1108447 1096585 1086974 1107366
13211 1107366 1110275 1100400 1045252 1040444 1082683 1095886 1075769 1046913 1053768 1025931 1006675 1020614
13199 1020614 1026147 1062328 1040406 993196 956956 956899 968502 979746 978840 981503 960370 917274 874050
13186 874050 882068 889956 879070 904906 957738 1016811 1104301 1257894 1418337 1513820 1576186
13175 1576186 1517571 1399728 1268603 1111227 994912 898213 878239 858185 855760 840849 823153
13164 823153 819000 818141 820424 803813 781880 767230 793421 804439 796947 771248 734437 706804
13152 706804 680093 670007 668264 658396 640471 646898 676155 668712 661195 645265 633477 634076 636744
13139 636744 661472 650031 621276 601082 588925 599674 634423 651308 644548 646155 629716 590518
13127 590518 611645 629835 617546 619586 605717 593231 590752 591228 564726 544606 554750 584100
13115 584100 598446 581080 564732 582590 591033 566970 555609 575474 581020 530109 501493 503187
13103 503187 490781 490260 525387 554219 529625 499103 480359 462873 466475 482171 479365 492880
13091 492880 512544 493165 473781 434859 403129 420266 447859 457433 468356 443527 463067 451658
13079 451658 433668 418235 408332 392241 395121 383666 357753 359989 369665 365600 384423 404225
13067 404225 386723 382981 397825 421755 402482 385772 406583 400291 399356 371348 357278 378166
13055 378166 392478 366120 344709 336806 362635 392270 371841 343518 349958 358822 385997 378998
13043 378998 343033 322758 328004 338845 347281 338969 352859 345211 335146 339559 354604 320209
13031 320209 306789 297603 302802 281091 272987 300282 317395 325123 320528 328014 320671 300662 307110
13018 307110 344343 390364 395082 360274 317401 312529 334738 317514 300994 330953 338299 341556
13006 341556 288538 262801 278857 265217 268005 256847 244113 229913 228321 233324 240405 232071
12994 232071 253398 300270 292411 268101 285790 270400 263545 296122 288297 265794 283150 297641
12982 297641 263786 258561 246519 257455 280142 269326 265097 262017 244300 251346 285226 298704
12970 298704 291439 279668 287657 272650 253499 234279 242698 251918 263176 249603 249550 238961 256446
12957 256446 290690 284344 280808 258859 249726 239306 223704 193937 193719 222695 241724 216034
12945 216034 225649 234946 234473 235349 243699 218875 191277 191693 180455 208929 208947 233105 217081 198759
12931 198759 179766 205192 213438 221214 198675 201532 240961 244542 237167 219416 217917 213362 190348
12918 190348 175507 192476 191380 164135 137739 151421 169222 168731 176718 179327 156059 146226 138119
12905 138119 157369 189020 167097 133823 134568 179871 173996 193348 186109 151102 139486 110994
12893 110994 137756 128143 117682 138372 154389 123041 118203 134780 128093 102665 77344 108129
12881 108129 128086 122749 139855 117564 132316 119784 86582 89526 114697 116514 117348 132140
12869 132140 142246 168362 189206 195491 162523 142572 146055 157454 164775 147637 147502 147205 106657
12856 106657 74539 64221 58938 74996 89624 103909 82035 79234 69837 88791 88108 92793 113702
12843 113702 123090 130512 148779 180432 171241 140739 120111 118995 137381 167357 169721 152909
12831 152909 146685 132145 110558 116076 162834 140065 179997 173674 114253 85364 87732 98899
12819 98899 112145 85153 77250 84559 126560 151512 138012 138759 145806 133916 124664 140478 161115
12806 161115 162140 161952 163216 152753 153175 152119 163707 161611 133226 129883 148819 185155 166231
12793 166231 131605 92364 72321 83544 92011 84139 78663 75261 101461 131271 119426 135553
12781 135553 147718 144386 136311 111497 92669 126600 166376 146149 140956 155241 134803 107955
12769 107955 104244 120762 113712 84091 79957 60113 26304 49894 80860 112316 130601 112937
12757 112937 103382 110377 129083 111541 79398 94027 95874 91263 102257 99902 77724 72027 99764
12744 99764 127025 137099 143954 130797 118815 147131 126442 103908 112259 75908 31847 18258
12732 18258 58308 80499 64626 51575 52884 50563 49397 82650 104309 117892 118359 110099 120229
12719 120229 119368 95668 98447 96238 80670 99038 140721 119971 124137 107867 96631 82307
12707 82307 123081 110247 110412 132942 159104 143442 119558 87215 72917 56143 80467 96075
12695 96075 111611 111003 123391 134764 92200 68013 84133 86401 81251 85005 66541 95136 112512
12682 112512 103223 94608 66502 87795 75783 54163 57132 81730 75321 61012 63267 53350 57972
12669 57972 46479 59823 67947 81207 70346 32104 13088 25949 43132 26656 6347 13508
12657 13508 24144 35963 1655 22738 28079 48017 35612 71475 68102 79473 95185 100388
12645 100388 71545 78565 106512 83747 81349 90425 86793 86538 81058 55907 45811 22705 38485
12632 38485 34250 25979 20071 47165 22149 18237 28854 21357 29465 42145 60737 85778 105460
12619 105460 81058 51906 31299 33618 61213 89818 81099 65996 51656 64358 84586 58640
12607 58640 63078 31286 4963 -36797 -18877 13712 40823 57732 74013 52403 23064 53300
12595 53300 84439 107572 67103 64286 34337 28658 22320 59330 49624 65127 83415 48749
12583 48749 4857 -10620 -15715 29254 18541 6208 8861 50174 63184 37137 34629 35968
12571 35968 44509 34825 24564 24747 36861 44758 67770 74941 52887 41043 29504 26205 22076
12558 22076 38476 31418 21504 58193 83547 81989 59967 59459 24147 3794 30560 61934 60543
12545 60543 51878 43409 30132 29519 31581 8796 7590 21088 21233 26438 22790 30560 88955 127842
12531 127842 93101 36327 -582 -5647 -6060 -9910 -4417 -3307 5996 4734 -17614 -9287 -7298
12518 -7298 -20932 6338 36511 51717 32863 34096 43977 62937 39175 61017 60120 31234 12048
12505 12048 -9801 -5184 -7161 13303 46505 45634 44235 75129 87187 79760 68226 52986 85001
12492 85001 88763 51281 36452 20576 32496 52976 57957 50743 52402 63883 56848 63080 24374
12479 24374 -785 -30344 -4605 -5620 -5119 15348 27778 11021 -1552 6785 21177 11971 2409
12466 2409 16425 -12762 -7146 10042 28458 24656 25554 52833 42274 21322 -25660 644 40684
12453 40684 38922 40245 20992 -5269 -15477 13073 17669 23374 61453 51756 38608 87081 88313
12440 88313 51501 32259 10346 16453 43527 23883 19439 64771 75679 58865 43668 41350
12428 41350 58022 51034 51275 51519 35226 -14491 -16570 25516 64172 72603 30431 603 39907
12415 39907 69247 78813 103655 107079 93986 49887 37077 19520 2178 10310 45528 39400
12403 39400 -2169 -6027 16780 48613 48429 45902 39295 48850 52077 54875 44521 57387 47895
12390 47895 49596 23006 -15241 -7324 -3362 -22927 -34166 -33982 -22479 -25390 -5187 -4017 -9080
12377 -9080 19874 5453 27462 40222 27189 27897 24231 42091 46957 56833 67632 51639 45194
12364 45194 61451 62783 62132 43470 14890 21401 -7829 -39943 -45597 -40348 -26119 26153 60651
12351 60651 30619 2748 -17061 -40944 -19200 28335 46932 39937 32606 45971 30742 11538
12339 11538 10273 20356 37226 22351 35013 56304 88595 69834 51010 44678 26584 7565
12327 7565 -1119 -136 7128 20492 26621 942 -12745 29520 64633 43198 33019 44009 33634
12314 33634 21908 -9954 -14149 -12666 18526 48880 28120 9713 2751 -6693 -25589 -29342 -16267
12301 -16267 4369 17379 11962 18320 -2782 -24761 -39823 -32914 8172 15118 24230 -14299 -23905
12288 -23905 4652 10209 6600 27144 64555 52784 37629 11348 31357 36708 32437 -891
12276 -891 42253 64288 63709 55475 25415 20167 34638 36047 21441 -27032 -64039 -85066 -56424
12263 -56424 -43333 -50516 -40551 -19525 -8192 -19268 -605 14922 -16207 -15486 -26885 -24944 770
12250 770 14181 13810 14423 -21858 -26550 -6268 -23184 -36745 -20530 -13616 -30668 -6130 17277
12237 17277 27533 -9728 -35305 -51900 -26247 -10855 9583 12362 3436 3920 -988 25450 49358
12224 49358 17902 -12452 -26164 -40484 -38268 -25371 -21410 3757 35319 32900 23424 2791
12212 2791 -19497 -21483 -9608 21008 17915 -20248 -20402 10855 -19001 -6269 25658 45961 20795
12199 20795 19658 35577 58785 42751 48324 26730 -13839 -14053 6619 -1269 -5936 -12908 7779
12186 7779 46578 42968 20062 -7599 1839 5711 -12969 -59433 -78503 -72577 -65368 -56047 -37823
12173 -37823 -28511 -28230 -12762 -26330 -2613 18553 -4965 21288 43324 60695 50346 46877
12161 46877 33060 -7907 -44752 -30292 15690 45666 23845 4377 -27369 -31283 -12839 -22980
12149 -22980 -13056 1576 37636 17488 65 21980 32347 22434 9165 6433 -29061 -24955
12137 -24955 -31111 -38165 -36281 -35869 -22715 25873 35126 24726 2956 -477 -15928 -6127 2224
12124 2224 17553 9697 3524 -22655 -22575 15040 31068 40781 46253 15689 -14315 -6379 6691
12111 6691 46063 57796 57419 69663 43942 48722 41062 24638 8589 -41374 -49997 -11258 -13533
12098 -13533 -24746 -14338 10430 20310 2775 -1617 -29045 -25712 -35022 -46849 -75124 -66025 -34646
12085 -34646 -13887 -13153 3005 29396 45695 40583 46320 30575 -4490 -24578 26511 56434
12073 56434 77388 72819 73763 34033 22598 2752 -36745 -35975 -14905 -26014 -20006 26598 31050
12060 31050 40584 30870 17476 9995 26896 54057 44254 4276 -5131 -29869 -33852 -7663 13298
12047 13298 19583 52530 77883 34830 6554 -2390 729 8633 -4890 -27026 -25377 -43150 -48711
12034 -48711 -17249 -27396 -53221 -46177 -24831 -32582 -20286 -8761 6043 8736 25363 22708
12022 22708 3769 -6410 -4430 -8582 -8967 13803 6916 10365 43801 44390 35369 33429 18554 16200
12008 16200 -25972 -51267 -31983 -9937 -8856 -11135 7023 -29925 -43064 -36036 -24687 -20554
11996 -20554 -15871 -27754 5335 17449 54640 60519 28872 21310 37475 58993 13303 -44006
11984 -44006 -32032 -9466 -12092 -19663 9031 2484 -7349 -176 22628 -983 -44346 -58540 -53242
11971 -53242 -51214 -27278 -23521 -7068 -19220 -21373 -16246 -16200 4905 35250 8478 16297 64857
11958 64857 82706 39930 49221 31804 3572 6593 29528 -12192 -29969 -13042 -35565 -5688
11946 -5688 -909 40756 63987 95107 88366 22399 -20671 -40510 -77100 -67495 -51945 -36040
11934 -36040 -21270 -10895 -3011 -11514 -8785 -16654 4142 25064 45663 46505 30913 -12587 -48447
11921 -48447 -58441 -8480 -2904 -2204 17354 -2977 -11432 -16145 -17673 -917 6833 12838 26066
11908 26066 8565 -35465 -22409 -8119 -31778 -10404 -357 -15252 -13935 9190 16107 -13738
11896 -13738 -4364 18575 2733 -16873 5754 46258 62384 25948 38069 18891 -16581 -940
11884 -940 24874 34141 44216 10952 -18315 19103 44503 73826 83343 46511 14844 12738 6211
11871 6211 3891 7853 11947 -28063 -30846 -14881 -32146 -16189 3736 -5333 -25517 -4597 17314
11858 17314 -9108 -44888 -83352 -63970 -38964 -43009 -45202 -27759 -38287 -12249 -5699 -6747
11846 -6747 -12149 -40132 -63201 -50531 -19171 -7467 -11872 -32769 -11360 25009 46578 57657
11834 57657 42945 38798 43553 15751 -924 -5762 9954 27844 16837 -10889 -9753 11596
11822 11596 24076 10629 12110 48219 32111 15296 -1695 12695 6393 5530 -135 -39183 -40780
11809 -40780 -45571 -23035 -8970 -11444 8824 12355 -1332 -18932 -47088 -54279 -40679 -12111
11797 -12111 -11662 -16854 -35947 -21553 13032 3352 -24222 -21735 -38718 -32415 -13209 11570 18426
11784 18426 41242 39263 32869 4502 7378 12555 8022 -1699 -52233 -28156 34319 49701 47005
11771 47005 40839 22935 20145 -19667 -22769 -4279 15556 5832 -10416 -29094 -28610 -12413 -9994
11758 -9994 -33644 -41303 -23976 -30657 -45419 -9791 21763 22808 19441 -21926 -53371 -58734 -54150
11745 -54150 -43137 -31490 -30590 4729 36640 15473 6812 9891 -5794 -14357 -41453 -60600 -54788
11732 -54788 -24616 9582 -607 -35027 -46334 -35374 -42984 -42559 -34703 -30879 -26861 -29371 -31793
11719 -31793 -17734 -15183 -17499 -51581 -50935 -16939 9477 -10106 -9196 15762 9883 -18347 -53369
11706 -53369 -73022 -45811 -21450 -1492 12602 14791 -1413 -1564 265 21437 14504 -29422 -25974
11693 -25974 -1159 29698 16132 -21484 -35694 -9732 20929 15278 4397 27122 28515 36899
11681 36899 -6795 -22505 -9396 25363 70318 62356 21324 1180 21996 60230 48618 33685
11669 33685 11804 -37410 -33379 -25881 -34324 -41761 -50415 -58362 -8290 20759 -3294 8929 -2965
11656 -2965 21519 30988 -1606 -27299 -38218 -51044 -35160 -18151 -18520 -24804 -24434 -21926 -2436
11643 -2436 -14113 6930 -13059 -9632 -26329 -21028 17638 17432 19551 34252 11763 -9053 -33286
11630 -33286 -51060 -39464 -21973 -17590 -3794 -2938 -8321 -334 3773 -3413 -28903 -13577 -12922
11617 -12922 -44173 -44290 -54042 -21850 4312 17573 9021 -4487 16283 22733 31333 52472 57566
11604 57566 42436 11886 -9209 -14001 -10209 -4732 -5644 -16998 -9697 -7595 -19068 3811 -13289
11591 -13289 -15033 -12227 13743 17100 5728 25506 7191 13206 -25107 -54979 -34488 -19879
11579 -19879 -20994 -15506 -1243 -10824 -10061 -12974 384 13079 -4192 -15464 -3702 26206 38412
11566 38412 -12918 -32206 -4387 -8148 -7881 -17271 -21540 -40415 -68584 -67428 -28011 22915 27085
11553 27085 22869 -1730 -20195 -20347 -21699 -31041 -13428 40457 68642 21078 -6525 -45187 -54234
11540 -54234 -33512 -14159 21856 17529 2631 5890 18650 -10541 -1446 -13729 3688 8112
11528 8112 -4307 -12997 -3529 6172 1555 13883 22399 27003 35994 8980 -4273 -32459 -14580
11515 -14580 -12758 15375 -5472 -38262 -13741 -698 35 -11592 -40201 -25286 -8220 495
11503 495 4681 -12034 -37847 -45706 -66361 -44523 -14674 -2234 -2107 -25387 -58888 -60777 -29064
11490 -29064 -36783 -37826 -3417 -14495 -40598 -60610 -75920 -57924 16015 35947 22430 44101
11478 44101 83148 77606 24501 4189 12224 -8948 5365 26771 -8352 -30254 -32417 -3406
11466 -3406 -8339 -18741 -14622 -22479 -26190 -20468 -25250 -5851 -1874 -10331 43769 25950 -33537
11453 -33537 -42238 -43182 -55759 -46051 -24097 -25478 -48819 -49677 -55126 -36151 -7936 -9756 -32025
11440 -32025 -27792 -33192 -37256 -39924 -20774 9328 3902 15727 43696 60615 78487 76127 36713
11427 36713 30371 22043 12673 -6296 -9524 -908 23934 9259 2841 -6275 11395 -17432 -42921
11414 -42921 -46597 -49293 -23628 35350 41018 41042 40717 61849 37815 -2806 11053 25052 16221
11401 16221 9957 -18948 -20076 -57170 -76172 -63882 -88818 -82487 -76688 -57525 8594 21661
11389 21661 7076 14512 44664 42611 21762 3741 -1694 2543 1052 7790 -3644 -1918 -60748
11376 -60748 -84810 -81083 -59010 -16977 9480 20433 24057 26485 12769 26885 41001 13522
11364 13522 -3212 14950 21861 -524 -27107 -80028 -68668 -56407 -39277 -30679 -34193 -43380
11352 -43380 -29696 -17832 -11876 -22393 -9722 5873 5764 -16190 -21417 -12637 30843 74007 51287
11339 51287 -6912 1761 35922 19283 14368 2086 7167 20874 39406 2891 -25269 -24121
11327 -24121 -52757 -88018 -88999 -78451 -92020 -60022 -8457 11973 -16854 -33661 -19679 28136
11315 28136 35567 -8817 -22191 -43171 -71568 -89227 -32700 -6081 -770 -10516 -1082 -1192 2045
11302 2045 21847 37719 25653 3476 -8752 5872 44636 106350 161326 195208 201925 197706
11290 197706 156540 113396 118358 77678 27277 45678 49144 25545 -34637 -74433 -52883 -25853
11278 -25853 -12356 -10590 -16690 -33242 -45402 -62076 -78282 -82456 -66150 -20476 3649 -332
11266 -332 27880 29687 -23146 -47570 -48369 -42549 -42815 -19869 9413 29426 2066 -38137 -42887
11253 -42887 -20576 5509 7707 10926 -52 -2016 -12165 -21216 -21203 4409 39664 7325 -38808
11240 -38808 -32769 -18464 16371 2185 -14777 -18092 -2289 -21654 -27019 -29970 -26833 -19467 -891
11227 -891 -21409 -6231 2920 -14923 -33496 -42377 -34026 -9354 -17880 465 8485 -23055 -38728
11214 -38728 -16997 -1166 8441 4664 31760 38315 7222 23052 6214 11058 29598 2475
11202 2475 -17934 -40963 -42665 -7081 8 -2725 -3614 -1651 -32516 -66570 -23638 -12783 -28881
11189 -28881 -29827 -42134 -30570 -22091 22191 41758 39108 46071 57943 96832 122172 150344 172325
11176 172325 191232 216709 218591 184422 125043 68804 28321 5450 -2688 19803 38467 30347
11164 30347 34725 37139 12033 -42398 -75621 -80768 -65184 -24708 -3495 -2795 -2240 22847 14010
11151 14010 -15926 -5196 15609 32624 31489 11459 892 -7802 15251 30896 35426 46013
11139 46013 37720 13423 8152 37135 31885 -1501 -22432 -18296 -32621 -27097 -45543 -20113 199
11126 199 -15773 -36818 -31997 -55292 -65017 -34158 -18033 -16116 -39766 -48168 -44346 -62888 -72894
11113 -72894 -43896 1412 5678 -11848 -64528 -50737 -46499 3360 32642 200 -69166 -75972
11101 -75972 -76832 -47346 -37330 -53968 -50003 -36645 -12548 10440 21483 23012 30699 -3249 -22114
11088 -22114 -2541 -6104 -31064 -35141 -32756 -19623 -13419 -39113 -34172 1703 9951 -11864 -43898
11075 -43898 -25303 -18182 -15311 -12087 5540 5395 17450 31508 28557 12084 -19849 -2132 -12922
11062 -12922 -36146 -26773 -3765 18563 -6102 -10535 30774 26938 10381 14330 2258 -10796
11050 -10796 -29086 -33839 -42535 -58562 -44611 -48973 -9700 7834 1189 26504 -11163 -56337
11038 -56337 -36604 -1770 132 -507 -5993 -16179 -57896 -68789 -37765 -21153 -19292 -2805 5218
11025 5218 -3890 -17077 -32094 -53439 -41790 -30278 -20082 -29642 -52068 -48166 -25538 -22028 -20145
11012 -20145 -5249 10523 -15843 -13311 4859 -291 -15914 12200 19013 21554 39932 49807 58477
10999 58477 38717 2684 -2394 30020 18041 -1711 -55096 -55282 -72373 -78488 -90637 -73625
10987 -73625 -10096 -7392 -20162 -1808 -19233 -27068 -20843 4341 21747 1329 -10565 -3078
10975 -3078 21033 24999 8877 -5624 -1216 11008 13363 2041 -8985 -41188 -28441 -32242 -69150
10962 -69150 -30074 20856 13072 26756 24031 8133 36422 17695 -7891 -13141 -17737 29910
10950 29910 27092 18057 -20862 -24046 -11819 -7528 2405 995 -28768 -33015 -5853 25877 32382
10937 32382 -6215 -43629 -65028 -46231 -5992 20224 36816 46509 27554 4732 -3823 -19729
10925 -19729 -66156 -40575 3729 -14602 -67280 -89672 -90012 -72334 -45756 -12135 -4230 -928
10913 -928 365 31790 14171 -40941 -37216 -2644 14055 24191 55250 32564 9642 -25364
10901 -25364 -43381 -34437 -13577 -6631 -16576 -49946 -70143 -46260 -21769 14052 63415 60381
10889 60381 48940 4166 -16155 -11816 -2223 -3777 1356 8017 4626 -15153 -28019 -22586 4897
10876 4897 10216 -17736 -43120 -6952 12999 21459 43900 40057 43456 23243 15248 24328 25600
10863 25600 23862 -1964 41812 76816 73158 44063 49034 49282 76007 60112 27564 32830 45610
10850 45610 32164 33046 28838 42581 8653 -13982 -13867 -64164 -50371 -19713 -9664 -19009 -22892
10837 -22892 -32082 -14870 8330 46483 75775 66326 38390 15206 10863 6510 6865 5711 38667
10824 38667 35336 22678 10941 -4126 3943 20141 43734 36216 3727 -765 -21120 -9238
10812 -9238 -37644 -27659 -16404 -19701 -21819 -29190 16060 44552 43885 37191 23996 7274 -12885
10799 -12885 -9282 -7562 -16190 -27965 12111 -5156 -5266 -13622 -6024 5429 19357 -18723 -42662
10786 -42662 -21710 4806 9643 9794 2584 -359 -20368 -39284 -66028 -78385 -39738 -24998 -32353
10773 -32353 -11519 -31864 -46203 -42141 -36037 -43961 -45397 -37464 -29618 -13915 -27755 -45660 -15849
10760 -15849 6291 15966 41096 33940 39603 42231 42156 41521 46249 27956 40602 57975 34049 2214
10746 2214 -36084 -37458 -46432 -27300 43625 38283 -15006 -34444 -2749 26352 21284 12503 28295
10733 28295 51457 66509 61823 40824 513 2486 -23194 -32440 -20043 -14026 -217 29177
10721 29177 55042 22127 -3805 -9710 14783 57732 77281 59819 55529 13065 -13400 -10995
10709 -10995 3884 22397 56693 57439 35583 24271 23795 78915 53902 22297 21968 14967 9071
10696 9071 778 14644 31955 47518 56919 57866 50975 17043 -11180 -22727 -16095 -6963 11788
10683 11788 10068 17095 33805 5514 6297 42878 34712 29978 69895 85061 52478 26707 20770
10670 20770 23646 58064 50209 61044 80048 78996 47487 33131 33690 54033 46527 58373 66320
10657 66320 64210 78864 94850 121866 126501 144036 154152 186920 171283 149570 115692 153165
10645 153165 202067 238207 299334 346641 446181 620746 832781 1112414 1385812 1624101
10635 1624101 1888647 2095867 2235469 2261724 2132574 1929008 1721101 1458848 1208718 959530
10625 959530 701307 531055 396970 302151 257566 259236 248143 170148 158309 140039 117586
10614 117586 125874 135110 134452 125112 112696 92151 81797 98214 108100 63772 56326 48329 33411
10601 33411 3615 -14650 7040 21570 8481 42458 50437 36124 19931 16810 18902 75378
10589 75378 99088 96520 60338 37900 29939 65437 67607 84173 90087 83224 57009 49530 68462
10576 68462 54957 85644 85966 106043 123664 150875 154372 184417 198776 197693 204000 190370 197582
10563 197582 209934 220890 201160 145943 125240 133245 129883 103573 65250 80388 73943 58453
10551 58453 82543 80097 49285 24881 2629 -1420 1330 28331 2629 -6534 -10098 26511 29122
10538 29122 48635 74536 95957 127895 148067 184022 210263 205553 197210 164477 102510 82622
10526 82622 75249 74531 88064 98715 102737 110829 123242 124737 143096 140129 134446 139870 132352 136631
10512 136631 116923 95928 98046 117543 104074 70251 70640 60374 65743 71893 49288 51444 57003
10499 57003 36237 32151 25170 27201 53471 113644 168294 185709 209476 243759 236322 254205
10487 254205 269806 250039 243658 239662 264326 272457 226411 200673 202586 186233 169460 150595
10475 150595 119099 73398 62239 39291 21585 28531 8661 39085 60781 40564 19909 15553
10463 15553 21281 41561 47495 75363 77649 82030 114819 136836 128707 82023 60572 49410 59643
10450 59643 96599 114702 122930 132934 104075 105936 95744 99067 160457 146200 141271 153501
10438 153501 161533 172795 158204 166323 179345 180570 232717 270671 267388 255504 262673 245902
10426 245902 215068 182304 173796 180868 153803 102887 84396 69714 32384 14060 26832 8714
10414 8714 -4790 -11810 -25427 -19595 9777 49301 39318 68479 53502 31060 28809 61334 74950
10401 74950 44543 53380 42065 29941 59225 69872 54565 56498 50767 44995 38825 49179 62849
10388 62849 49998 42580 60271 81310 83050 111094 100104 96669 90332 75906 85683 93515 111595
10375 111595 82380 57771 56763 52109 36818 48520 50758 41516 49813 57520 57537 35685 23269
10362 23269 15647 20595 -10572 -33788 -23421 -13521 4133 26492 85901 129927 155172 208451
10350 208451 229600 203734 203775 217657 259064 255219 227592 211377 224768 222451 238701 232730 211266
10337 211266 219875 251093 277034 289714 285645 291876 308005 292888 270973 250025 224457 222709
10325 222709 244457 261746 271282 269628 277639 289708 304276 297455 299492 294027 304132 328197 355655
10312 355655 350083 388565 434556 443945 427489 417408 443361 491827 541048 565126 618026 677553
10300 677553 700257 723754 745223 789625 845349 905245 939467 957704 971146 988953 1039835
10289 1039835 1118087 1123271 1149717 1232795 1285455 1306392 1343608 1380232 1409348 1446670 1495549
10278 1495549 1514164 1525730 1554667 1614273 1672050 1765913 1871340 1962667 2065260 2199261 2380077
10267 2380077 2582651 2836492 3048733 3309008 3573239 3888836 4277871 4753183 5373916
10258 5373916 6185582 7262516 8553992 9985132 11588866 13202680 14834510 16454530
10250 16454530 18017463 19568382 21251509 23320556 26146292 30310850 36675278 46817339
10242 46817339 63460673 90504962 131071267 181878698 234832041 283338352 327527566
10235 327527566 369042021 401866987 416445380 405683893 375056745 334488658 291849382
10228 291849382 244559887 192838382 141856631 100703183 72817467 54795619 42993211
10221 42993211 35047155 29579612 25719458 22952564 20765788 18890405 17184796 15602400
10213 15602400 14099500 12602016 11113935 9681173 8393914 7280197 6383131 5655881
10205 5655881 5056182 4566091 4167262 3860252 3627806 3429138 3284163 3174005 3115323 3148132
10195 3148132 3202335 3264496 3314194 3351943 3414398 3423243 3420646 3328415 3163666 2930792 2697402
10184 2697402 2466099 2168849 1879228 1629383 1420695 1245372 1118013 1022425 947783 902686
10174 902686 883414 840377 813457 791968 800567 805139 827242 830354 817016 797316 766715 726645
10162 726645 760892 763451 744490 723853 696682 693261 683936 653401 618310 644823 645913 603738
10150 603738 569670 535776 529699 569904 558412 534586 512134 532822 528948 499183 493336 490446
10138 490446 496049 476689 430931 427426 396189 366458 329378 325482 310898 325069 351835 342331
10126 342331 300833 276940 320524 330843 330390 324825 302687 296020 313451 339637 367968 409352
10114 409352 450849 464926 466274 493575 526032 562482 613150 594918 581299 552198 531545 505041
10102 505041 481237 463778 438284 424047 431141 423881 373395 340438 357002 335556 311641 275392
10090 275392 259488 277192 238943 246946 239999 229476 216705 230128 268515 270358 263685 270813
10078 270813 286712 298261 284794 270630 259588 227395 232362 215052 187346 185402 184409 190378
10066 190378 229591 252270 280040 271214 239785 235347 232923 262522 306323 358272 378841 432892
10054 432892 580331 781064 1131266 1533309 1670965 1449642 1015425 707652 520512 361104
10044 361104 261750 194018 122648 79691 73055 66041 54944 15924 -4719 16155 43566 91733
10032 91733 84222 63167 96257 137002 155723 124977 122269 128187 131784 92292 63646 53677 79041
10019 79041 100141 91997 83626 47168 23170 38508 34608 50364 77123 96284 73073 60788
10007 60788 27076 37831 69489 62624 61258 102899 119146 116897 124077 106217 116478 132799
9995 132799 138304 159145 131506 90122 92021 96431 90350 84731 120833 111769 84414 101063 86872
9982 86872 69018 75815 83631 87455 135367 158686 154727 145365 111085 118378 123804 67972 69337
9969 69337 73805 73480 108044 101374 70805 32613 40230 66943 52970 69162 103391 120100 129411
9956 129411 125844 119303 122224 129824 140030 163959 165505 158021 158287 142992 144519 175405 209674
9943 209674 251583 277308 316852 307269 352464 410649 453914 462773 474631 433906 382202 356917
9931 356917 332557 274262 246279 215819 199036 198137 216622 185488 175312 159407 112830 108094
9919 108094 80836 76302 75913 85150 104030 97490 69784 32962 35831 34102 22547 30654 9915
9906 9915 -16135 -40457 -60459 -52330 -50499 -50246 -57435 -28333 2525 -3834 20023 26109 29615 54657
9892 54657 50056 41696 17798 -482 -11794 -4644 31548 43178 28231 42538 63734 35263
9880 35263 34907 17305 8931 33267 32253 53029 46509 42191 48850 63541 43334 20539 2354
9867 2354 13064 7182 -4795 -5935 5460 2082 23253 37553 29929 28093 45454 75487 123164
9854 123164 159004 137234 115821 162967 241370 218242 201231 221478 216282 197356 191177 156568
9842 156568 169516 172289 166168 230530 297925 381480 529088 732343 969218 1249538 1529303
9831 1529303 1797151 2047868 2218869 2305410 2231807 2035352 1839415 1626977 1353452 1080607
9821 1080607 815982 588436 441611 330988 268556 213295 172357 173909 165602 157292 166333
9810 166333 188382 151698 117011 65188 41559 18149 24971 35387 52772 43201 16005 -3757
9798 -3757 -1432 -12399 15670 -1676 247 17419 9024 -2405 -10577 -5426 -10645 1724 -2765
9785 -2765 -10839 -5539 20909 59016 52279 37029 53171 72055 47163 41304 52015 45312 20932
9772 20932 2735 -15080 -31766 -10076 21874 22150 12397 11232 3531 -14464 -9638 17489 32182
9759 32182 49396 83056 89712 113120 93862 70640 49422 59972 60999 76050 93554 82368
9747 82368 55023 37157 16336 3064 1733 -27726 -23953 15453 38251 39668 38487 22646 6675
9734 6675 -15030 -9011 3558 8984 17735 -3646 -19260 -5219 7062 17937 12956 14834 37673
9721 37673 85920 78053 67645 46275 34636 25914 33914 54201 47358 62662 64174 22825 25414
9708 25414 32902 30687 -6573 -33384 -11777 -19711 -21912 -19251 1131 13776 4072 -15058 -32581
9695 -32581 -12981 17919 17726 31828 14823 17621 -11734 -32533 -37917 -9246 7315 37031 47732
9682 47732 30468 4382 -2293 4698 7291 21426 46716 47785 74030 88647 63879 28154 28348
9669 28348 36528 30632 -15647 -33661 7271 24610 14496 -4002 7810 29524 -3528 -19180
9657 -19180 13757 29050 34146 19031 -3298 -25119 -3453 15056 28279 40482 20445 -5868
9645 -5868 -26008 -18545 -5650 -15779 -12989 3538 26581 45892 45024 58105 31474 15955 45110
9632 45110 53615 26619 34090 32538 26784 8621 10464 1052 23883 68692 58490 8715 -31761
9619 -31761 -48649 -69657 -73611 -84782 -31289 28078 42982 47587 34006 9123 -9288 -3906
9607 -3906 -33429 -48907 -1281 48909 53227 23797 409 3063 14970 14137 -19963 -46691 -22719
9594 -22719 4752 -2874 -19362 -35776 -31287 -9580 60429 64441 50018 40035 27144 49559 55728
9581 55728 48289 39226 28077 61271 126841 126902 126515 111115 92279 105971 94538 50528 40120
9568 40120 52306 45388 36443 56802 92675 71078 60013 28326 31831 52389 68297 70638 85139
9555 85139 82668 53072 47084 68043 50151 3451 -17915 -25403 -46564 -65772 -69038 -17208 20216
9542 20216 5171 15312 -3140 -6581 43353 32230 32913 -12293 -25366 -32006 -5866 6684 -21499
9529 -21499 -44411 -37351 -21633 -3876 -17244 -19548 7525 12679 3928 -8503 17731 35506 45875
9516 45875 57582 38149 2633 -40043 -39294 -11434 24717 19323 30893 36546 9985 20273 36544
9503 36544 36842 68750 61940 46177 22890 22242 5450 -4593 4576 14908 -12007 -10348 23958
9490 23958 20067 23525 40896 40814 70604 43295 -1606 1419 -12605 21560 63735 74298 51880
9477 51880 31752 12692 1983 24489 7411 875 -1521 3497 -4840 -8714 -10715 -18550 4583
9464 4583 9667 9642 51236 50090 28536 15055 -2487 -5375 -4493 14574 17332 -9939 -23267 549
9450 549 25976 2091 13751 47567 52191 58200 55676 31869 1087 -10321 -10392 -4808 22541 21646
9436 21646 3154 -6979 -485 36421 29306 3101 -28781 -36484 -23190 -616 52130 76350
9424 76350 54920 57438 63090 90638 76037 35757 13203 15248 34019 33239 33651 65559 48275
9411 48275 18908 2586 14550 23131 18485 -2606 3229 12972 17893 35709 48131 68256 79759
9398 79759 81964 57690 54457 84756 106918 101737 52824 18737 -5760 -18601 -55627 -28805
9386 -28805 -6873 1349 17177 25888 15645 -8748 15959 41598 35700 19131 37537 34604 15738
9373 15738 20602 56448 30505 36428 38555 22802 35785 43079 52493 46130 52605 66882 41225
9360 41225 49949 63420 59717 66741 55810 69886 66268 37727 4933 10491 34548 59878 85516
9347 85516 95471 110282 153524 166816 127519 127188 106461 70129 85723 85847 61931 67510 75877
9334 75877 80074 58033 32160 29738 65586 81434 107940 99713 62035 47272 32208 44953
9322 44953 101249 136170 156483 150686 131630 120539 104633 97782 110076 115105 125602 148634
9310 148634 144199 114707 72946 67769 102784 96298 76203 81856 80773 88782 109521 118179 114375
9297 114375 129959 128799 131770 109389 111586 115174 166449 183294 181596 203021 176763 143516 133408
9284 133408 126788 113192 102153 98295 150044 182846 208140 192707 164612 128878 101811 125323
9272 125323 124260 111100 110481 121730 150441 153294 171779 176422 132003 130027 158685 194600 233987
9259 233987 220825 199342 196919 213072 221548 189011 193007 186791 183566 175718 177709 213160 215941
9246 215941 239255 279392 276183 291163 302796 325284 306037 298518 257534 248865 269516 273817
9234 273817 293159 311043 289040 282740 294288 310960 295338 276234 258626 268134 270759 319075
9222 319075 363179 375835 370494 351832 333284 364219 363611 391125 389250 411027 412270 410742 449981
9209 449981 479729 511969 509928 541665 515193 496732 526944 536651 553560 566069 553105 547015
9197 547015 591104 635098 641471 675047 681664 671219 664128 681101 715369 743080 715039 702462
9185 702462 741522 794773 800451 821800 832998 850687 849249 846769 895035 932606 955877 975997
9173 975997 966392 983994 1024702 1080967 1101367 1099176 1144223 1158541 1171016 1175577 1208773 1230841
9161 1230841 1246169 1243076 1273627 1299942 1313025 1309357 1321196 1347670 1346975 1341646 1362109 1407075
9149 1407075 1414437 1409346 1425627 1429317 1438274 1428585 1427609 1424992 1434382 1430211 1402664 1414105 1448941
9136 1448941 1400740 1387231 1401138 1386016 1358629 1340770 1327722 1298289 1254257 1266806 1265913 1230054
9124 1230054 1204362 1180132 1159765 1171947 1184636 1157643 1149264 1116676 1062690 1014482 991940 966082
9112 966082 908856 892552 897363 912994 922226 859914 825065 847384 835869 806487 799443 774756
9100 774756 756875 717267 702886 711101 737825 741087 717664 667370 670316 657530 622283 623517
9088 623517 607689 605573 595698 572318 534106 527942 491797 457260 442838 437179 461729 493674
9076 493674 479711 430477 428382 418669 387906 391368 379326 389710 384172 388079 379099 357668 370901
9063 370901 354712 362238 355717 340423 335232 297684 256456 230906 274596 320111 324304 309700
9051 309700 319369 311856 295698 302948 339867 362749 389568 443921 483858 472073 436523 390831
9039 390831 352079 329977 284742 269568 271806 269721 270524 250455 236403 217114 194503 167076
9027 167076 164048 205886 233610 196856 158567 176836 196538 180214 159993 129944 103765 116616
9015 116616 158197 171689 172931 146847 106612 90495 87112 90885 109826 108191 96126 87277 117663
9002 117663 146157 145760 116758 105178 111241 81722 99181 121804 113462 82722 66634 95902
8990 95902 115012 119077 117427 101168 100651 121755 112457 113888 116664 82380 83313 80376 99496 123416
8976 123416 133241 148085 185337 224227 280596 353732 433328 492049 497098 460340 385365 282217
8964 282217 206839 188171 156991 123544 84038 91831 121696 131980 81731 70520 102236 106755
8952 106755 107476 100427 78581 56196 37866 61495 107212 154474 162460 122947 124492 123857 148484
8939 148484 150636 180903 195717 245819 299372 371798 456196 469827 449546 389701 315475 243832
8927 243832 156764 148179 125351 94751 67354 45477 41232 46454 54266 59086 32685 47421 44310
8914 44310 40004 53263 86514 101036 91940 101836 92032 84771 79751 53752 28565 28752 20320 11261
8900 11261 23744 31416 5866 12965 55530 60309 33538 22093 50202 74611 60003 40042
8888 40042 60521 65963 61855 50690 51168 66872 67546 69722 43845 46450 35183 44229 39898 21263
8874 21263 -12993 -16888 1280 13790 -1719 -33171 -47713 -63612 -33884 -6292 -5212 -21293
8862 -21293 15629 43691 17470 -7118 -8264 -2780 -1100 30533 35256 41174 19098 19941 26701
8849 26701 35934 6240 16141 39373 57120 26622 -12253 -23023 -35709 -16156 22266 12580
8837 12580 -148 11187 -14145 -38982 -23921 -49698 -42110 -18337 3276 2277 -14980 -35198
8825 -35198 -43730 -38865 -21248 -38237 -20551 3093 11310 22116 20650 4160 7464 23582 15028
8812 15028 30278 35652 53564 49247 8086 -19039 -26083 -15266 10733 36882 32844 34710 49181
8799 49181 11992 -17306 -21728 -13133 5689 39331 32462 33116 21444 33021 26482 9843 1422
8786 1422 48055 37876 31964 21158 20470 24336 25835 4883 8751 59408 83926 102854 63439
8773 63439 6786 4116 -7631 472 1151 18062 -5894 -48346 -55974 -34835 -38949 -22927 14917
8760 14917 24815 21881 22296 15415 20254 54163 42340 72663 62805 57830 77434 64676 10778
8747 10778 13720 42107 42153 46730 17059 10590 35082 47601 69701 95326 111243 72121 63039
8734 63039 52704 35327 69601 94016 72647 63911 83405 66453 54240 67559 99623 108198
8722 108198 99070 104680 107107 90867 92955 76974 60858 52845 28912 54927 61415 79019 71746
8709 71746 72613 75093 38018 9843 6726 -38358 -38331 2707 50991 54782 42802 36865 19216 9768
8695 9768 7219 -7789 -42156 -54764 -35248 -48069 -50159 -36099 -45307 -32159 7574 -4584 16508
8682 16508 34064 13082 -26480 -43912 9206 39187 72840 33253 21913 -6612 -17383 -31437
8670 -31437 -9797 -20796 4588 26787 45200 34003 30626 30702 21660 24485 -14203 -26309 -42981
8657 -42981 -25020 -21290 4724 35816 51330 33274 32694 52329 51264 11855 12387 49012 32721
8644 32721 19789 21487 15831 4900 40465 68194 62647 34764 12804 -1267 -33889 -12245
8632 -12245 16676 25679 37349 48032 17288 -3022 31036 55324 34492 9957 -7387 -22055
8620 -22055 -14563 13730 19266 43427 83593 86799 57030 42801 44885 42554 33273 48676 6432
8607 6432 -26916 -33089 32559 96816 114634 115613 52481 18425 8638 -10255 26583 28250 31437
8594 31437 6853 926 270 46076 58261 70741 98677 72411 43744 5679 21628 28864 3975
8581 3975 -37000 -39472 -11882 37565 4365 -36241 -2039 -3452 26937 34017 5507 -459 -8371
8568 -8371 -17721 8056 14543 6467 -11385 -13474 -22465 -31838 -22087 -2674 36117 35366 43971 33308
8554 33308 23013 17036 22773 24846 29518 22224 -1077 -33163 -67120 -55122 -17824 6752 11174
8541 11174 15500 3935 -37654 -13530 35206 42238 8433 10839 -8642 9964 8047 11693 39458
8528 39458 48082 46413 50062 38635 60605 33401 -21473 -30005 -22664 -32872 -31563 -15972 -10878
8515 -10878 7394 3481 8950 2429 13064 39850 38408 17687 9074 21213 39042 32341 28207
8502 28207 17423 32555 3618 5250 13720 5429 845 -9117 -38905 -24636 -6281 22094 18090
8489 18090 -3039 -6464 9731 -22007 -32341 -7148 10063 28928 15251 3552 4150 12837 47430
8476 47430 40414 294 -24123 -45198 -72265 -75481 -57627 -52208 -78448 -83299 -43941 -5715 -932
8463 -932 13112 16392 -13396 -21716 -32963 -13173 -19345 3069 16158 33771 57974 63998 50029
8450 50029 32372 4877 10206 37139 56606 54964 34575 -680 -1495 -1075 28364 40412 2446
8437 2446 -19111 -7223 13991 12428 18564 44453 68530 50805 87937 81161 -8684 -33763 -22641
8424 -22641 5999 -21847 -17445 -9262 -12565 -5581 -39597 -19606 -25880 -14088 -22049 -42800 -22370
8411 -22370 -8421 -34991 -27103 -25095 -13793 -17287 -21657 -9829 -28532 -28195 -27389 -26697 -35694 -37815
8397 -37815 -937 19052 9897 -5837 -22459 -15066 2096 23617 58495 64048 9333 -11348
8385 -11348 -12903 12825 9202 14777 14864 10576 9730 2614 -5825 18488 -2991 -33348 -12617 -421
8371 -421 -7131 -50039 -63424 -63155 -68381 -45221 -27047 -39639 -41488 -55743 -36307 776 10614
8358 10614 7035 -28067 -67443 -54817 -25930 -1058 -25355 -38691 -71021 -55735 -40179 -75688
8346 -75688 -81542 -43919 -22912 -7083 1313 20207 39908 3178 4732 -40781 -78656 -35475
8334 -35475 -26643 -59635 -35975 4641 12201 -7606 -41605 -19232 8254 7848 7060 3547 -26410
8321 -26410 -15022 10637 12200 13178 13659 22194 6782 9781 -4751 -7141 -21234 -43485 -36993 -39432
8307 -39432 -20907 -20980 -27907 -27618 -35630 -70562 -43814 -33264 -55274 -45516 -31847 9471 16018 -1662
8293 -1662 0 10790 -12734 -47013 -62232 -36616 -6664 9652 4497 -2712 3538 1874 5285
8280 5285 40425 15381 -32691 -51337 -35405 -6454 4750 -8457 4189 22816 -13085 -31216
8268 -31216 -44975 -58423 -42099 -49411 -29746 -5375 11267 26039 28425 31691 23807 7350 14397
8255 14397 1655 16773 17955 25912 22213 27384 2615 -52566 -84497 -53475 -59176 -39416 -17609
8242 -17609 -3574 -22573 -39008 -90375 -107345 -87036 -62186 -49239 -55472 -71796 -50684 -33515
8230 -33515 -48942 -55261 -34892 4063 -18617 -41624 -21333 2242 12090 -5842 -36241 -38440
8218 -38440 -26494 -26319 8115 23878 12856 18195 32927 43623 64442 78624 77206 54505 21980
8205 21980 -6972 -19948 -48677 -15694 13193 3743 1881 -20151 -10098 -15657 -19647 14380 28206
8192 28206 4820 5805 -20004 -34798 -19203 5223 -3850 1989 4083 -3788 -6435 15653 -25375
8179 -25375 -15006 -20715 7606 31882 34685 -2813 -19870 -38535 2285 48862 38508 23160
8167 23160 15364 23671 -6595 -4783 -16608 -47594 -59744 -57937 -17356 -48750 -56858 -31037 -31694
8154 -31694 -23016 7907 10121 27234 45502 32015 30510 40443 34913 27769 17959 16277 -7707
8141 -7707 -10907 11447 30930 6395 3638 -15733 -43957 -45418 -37003 -45712 -42289 -21852 -29295
8128 -29295 -14124 13024 11360 -24403 -4154 35705 22805 3955 -2041 5470 29531 27091 32612
8115 32612 -17619 -48916 -41986 -19407 4598 -1200 -9940 -17012 14543 39712 48671 15746 9343
8102 9343 5874 -10241 -1575 -21662 -24991 -18364 -6067 1141 -12242 -7629 -10331 -14371 -29093 -38234
8088 -38234 -57782 -66958 -53564 -44709 -41222 -42558 -29957 -27738 9988 23043 9021 6195 -20641
8075 -20641 -28777 2261 25550 36021 29366 18090 6912 28499 11102 -4345 11756 31969
8063 31969 6909 -19464 -26442 -7280 14220 3621 -16729 -7144 24808 21669 -14519 -22347 -31860
8050 -31860 -32881 -8914 2485 -11864 -10129 -6090 -7522 -3578 -21203 -32514 11902 25228 -9702
8037 -9702 -7809 20832 26347 9126 -20209 -50650 -49358 -33326 6777 16061 25559 5971 -47007
8024 -47007 -54321 -38600 -19201 267 3460 16920 11836 -15960 -39691 -53791 -44978 -32049 -41074
8011 -41074 -18581 2534 4879 44936 75199 89430 86060 78145 50558 14071 6481 -4253 1637
7998 1637 2125 -29106 -36736 -30543 14295 45381 10678 -6837 -23830 -22487 2349 6363 16227
7985 16227 17408 -10383 -1147 -17948 -6273 4706 -6232 30767 38317 7839 2880 21591 19883
7972 19883 -7013 -47312 -63490 -31722 9518 13626 5379 42483 40273 5233 -18366 -13263 -46566
7959 -46566 -62749 -17960 6180 3320 24487 17818 -162 24365 39675 42461 38348 16841 3943
7946 3943 -3695 9371 10857 35429 29733 25453 4590 -26783 -26994 -94 17882 34728 4359
7933 4359 -14691 -11106 -20830 -20430 -6278 -23211 -23923 -12470 -26008 -32259 -8429 -2437 26141 39318
7919 39318 13967 20133 20525 -18069 -21346 -37741 -53332 -53270 -40815 -37008 -44138 -27784 -30254 -27842
7905 -27842 1516 36747 85311 81184 52504 49557 46334 33574 -5827 12802 27233 10335
7893 10335 17491 3435 -20814 13521 24015 16455 17198 30815 31807 33901 34249 26178 23600 8592
7879 8592 -45118 -54932 -67935 -40267 -34793 -24611 9602 16055 18632 -20444 -12102 -34656 -41168
7866 -41168 -80947 -41620 2353 -15806 -34930 -3012 -1986 -48167 -41037 10926 26424 20001
7854 20001 20702 19087 24876 37579 30847 14789 17555 -1223 -26031 -23377 -18762 4705 -709 -16171
7840 -16171 -10538 -2031 1779 -15455 -43269 -41833 -8457 -9084 -19932 8183 -2079 -17330 -16537
7827 -16537 -60326 -57100 -65340 -43409 -9185 15820 37572 42711 56407 57053 22101 26423 43392
7814 43392 48700 32948 6252 -30686 -23022 -28808 -61404 -59742 -57341 -43189 -64778 -36169 -31814
7801 -31814 -57922 -45903 -14792 -20577 -14272 -19685 -23543 -27003 -29596 9222 16211 442 -12452
7788 -12452 -33853 -26188 15059 54225 52958 39515 50740 22101 -17789 8803 2342 -31290
7776 -31290 -11851 1719 -15403 -2054 -14701 -30980 -32545 -23611 -26370 -31916 -50421 -38808 -873
7763 -873 -23138 -49335 -84056 -81744 -45165 -6239 19748 12818 34225 32864 34365 300 -14328
7750 -14328 -2544 -10366 -29855 -56513 -40257 -11280 -5089 -29164 -46757 -18415 -26860 -19990 836
7737 836 -22310 -19312 -36632 -28878 -10059 -18257 -21020 5818 -7384 -11977 -18836 -57457 -69526
7724 -69526 -42521 -35872 -27588 -9308 7670 18121 -14704 -35978 -61204 -60419 -71957 -65465 -45664
7711 -45664 -9728 6360 -2167 21212 6894 23497 9656 -9484 -8521 -11258 -15996 -22027 -40605
7698 -40605 -53544 -34439 -23689 8146 -23598 -54086 -60443 -44826 -22403 -14661 16570 27098
7686 27098 10515 2355 -14436 5534 5499 -13775 9073 33617 15236 -23445 -24254 1254 3096
7673 3096 3824 18428 27377 4144 -22432 -10659 20862 11017 21819 46306 24006 -23501 -34046
7660 -34046 -44632 -20072 38009 41761 18184 -5873 14625 15766 -17076 -18758 -15278 -44907 -44293
7647 -44293 -23760 746 30545 47224 58389 29487 8624 8303 3690 -15720 -3844 14928
7635 14928 17518 2175 -27748 -38896 -50941 -55704 -69013 -50427 -7409 -17368 -17438 -18949 20354
7622 20354 59988 8101 -16941 -5003 -13504 -39990 -53475 -48126 -24553 13005 11521 20823 42780
7609 42780 7235 868 -27024 -8487 -13391 -31432 -31032 10380 22024 33391 22295 19827 47340
7596 47340 43726 -963 -32755 -7352 9478 -9590 -13139 -3939 13458 39955 32914 29424 1165
7583 1165 -20622 -54696 -40130 11102 30582 -11855 -46849 -37481 -36329 -41764 -72849 -67817 -34168
7570 -34168 -19369 -17591 -18235 -16973 -19295 -4237 -1776 -17120 -4472 -29604 -45923 -12146 -4098
7557 -4098 -13786 -11682 -9681 10158 30880 24019 24361 27606 22788 30928 34309 12735 14028 23284
7543 23284 38626 41324 -2855 -19144 -49134 -39198 -14926 -2466 1161 32312 16147 -13276
7531 -13276 -23007 -19501 -11965 -14910 -9462 -28014 -55426 -83403 -50060 -14969 -8674 -15584 390
7518 390 2859 20250 22459 7617 5764 1522 -3870 29639 33332 -2673 -2461 -11865 -11768 -30487 -7308
7503 -7308 8772 -23788 -56140 -59192 -76247 -64148 -59287 -24577 -39949 -32349 -2027 -15079 -39372
7490 -39372 -32547 -2190 -11266 -40163 -61430 -30455 -40850 -56922 -16876 25308 53233 29567
7478 29567 20154 -23206 -38351 -33873 -31648 -38535 -44994 -41999 -15115 -8387 -21707 -25490 -3358
7465 -3358 12629 2029 -12085 -14016 -17046 18241 36514 8229 -14870 -23078 -48442 -58400 -41725
7452 -41725 -3745 -29626 -46714 -22551 -1225 6229 23305 24036 -10567 -25634 -32691 -32134 -35643
7439 -35643 -57908 -37487 -43853 -45539 -34950 -10109 -3917 12981 30167 2322 -17893 -12161 5286
7426 5286 9411 36317 18111 -1998 -15310 -17951 6740 27967 10677 -17238 -63929 -38867
7414 -38867 -6502 -15743 -11767 -17723 -16365 -3731 -21870 -29420 15383 36213 34547 38736 24710
7401 24710 2857 5008 -2611 -15440 -11717 -5273 6728 -2149 -11656 -15977 -6315 1921 -36280 -32185
7387 -32185 -12966 1757 -20183 -28973 -42949 -33596 2587 -6973 15911 8951 25425 10097 2006
7374 2006 6262 30083 -2534 -38600 5941 33193 6073 -22793 4805 11376 -10389 -38208
7362 -38208 -31296 -12757 -7752 -38551 -51424 -68727 -47783 -25016 -21424 4266 -23335 -55159
7350 -55159 -50783 -40595 -8992 -9967 -15465 -7401 8332 450 -36922 -40953 -34356 -38373 -25235 -58720
7336 -58720 -60459 -27403 -19867 -45758 -65821 -31100 -4929 11690 -4269 -25763 -55058 -36919
7324 -36919 -11102 -10472 -10700 -13243 -9968 6377 21202 -2781 -29115 -23454 -21749 -20778 -45748 -32522
7310 -32522 -42076 -45474 -28502 -32072 -20573 -6382 14693 30588 16728 2661 2274 15535 25895
7297 25895 32989 6603 5644 683 -9341 -17118 -44509 -70059 -64154 -31402 -13461 -25789 -36436
7284 -36436 -4964 -6348 -20258 -10364 -34270 -78634 -80045 -63431 -43999 -50049 -32918 -20216 -10057
7271 -10057 -3377 -27014 -30755 -23601 3736 22487 21645 -1377 -34032 -23977 -38387 -57262 -35616
7258 -35616 -13054 18039 42965 16535 -41303 -40918 -25031 -54625 -63347 -59537 -18438 9573 19250
7245 19250 16551 -19818 -49593 -65260 -75589 -81613 -74138 -68560 -72755 -28023 4723 11995 11774
7232 11774 28797 19480 16822 -4959 -17048 11049 39373 9524 -45955 -28411 -11202 -44269
7220 -44269 -23296 28755 5730 -2205 -27163 -46819 -21196 12494 13959 4514 23894 -14773
7208 -14773 -21453 -1779 -7933 -28954 -29185 -26537 -48979 -21317 -25742 -3096 12046 -2342 -5892
7195 -5892 -17168 -31994 -48063 -34925 -17857 -12516 -4253 4018 -5994 28063 36498 20083 16762
7182 16762 6261 -23374 -28253 -27765 -24523 -10147 -1628 -44984 -64723 -47049 -20374 19093 7885
7169 7885 11969 13848 -19506 -46977 -26815 -15971 -15589 -30499 -27766 -14808 -32840 -67067 -19036
7156 -19036 -7272 -49321 -60370 -32059 -28162 3279 11619 -10196 -33671 -40358 -31891 -22176 -35730
7143 -35730 -4724 18350 9492 -2716 -25423 -23066 -20144 -6434 6528 7473 -13070 -10493 -23254
7130 -23254 -53159 -47162 -37380 -21933 17656 27193 -3048 -22721 -42735 6181 15872 -28711 -37315
7117 -37315 -15693 15515 22965 31509 30099 46520 23506 1519 5714 16350 14707 26256 39499
7104 39499 19636 -5469 -16639 33621 32417 8440 19773 26794 16780 18756 8344 14146 10177
7091 10177 -15452 -21473 -35300 -41338 -5110 30930 24649 29677 26868 25357 8383 -17858 -22796
7078 -22796 -11847 -20333 -34184 -41598 -42678 -33804 -6542 -24875 -32373 -37735 -27555 -45530 -36194
7065 -36194 -27792 -11587 -1362 -25810 -37043 -26610 -52823 -54781 -39476 -58365 -55376 -41596
7053 -41596 -20265 13697 -12004 -38299 -51006 -53314 -35045 -26759 -29423 -26463 -45698 -86730 -90091
7040 -90091 -35560 -18677 5217 16034 16787 19361 3401 -30276 -41349 -32075 -25438 -24797 -22400
7027 -22400 -42790 -53414 -47535 -62149 -39424 -70643 -81539 -68599 -47523 -42553 -47260 -62623
7015 -62623 -49953 -26689 -7063 -7303 -21403 -27616 -39883 -17256 -188 8126 23750 31457 16150
7002 16150 10144 35279 -4302 -59070 -53135 -46886 -43380 -29570 -16140 4964 -3427 -17245 -31437
6989 -31437 -53417 -45973 -32675 -25582 -44784 -56333 -64736 -59788 -50952 1502 27596 33755 7811
6976 7811 -1404 17756 -17480 -45251 -18847 -5694 12049 9075 9356 13945 9421 9170 -4778 20732
6962 20732 -4711 -41031 -6088 25510 32030 19123 -11135 -33024 -55329 -50231 -34425 -15694
6950 -15694 -38522 -29589 -12538 -8005 -14160 -14598 -95 -5645 -4602 3060 17522 53765 70287
6937 70287 66454 50824 33037 23366 34213 24305 -15328 -60500 -38926 -17673 -15088 9438 34613
6924 34613 37236 18424 15061 2233 -6962 -25765 -48676 -41080 -39571 -34205 -43301 -1817 16158
6911 16158 -7752 -37331 -51576 -52544 -48961 -19577 -12343 -23859 -58358 -34495 -34794 -4677 -36173
6898 -36173 -42112 -61299 -73705 -57041 -66606 -68572 -64793 -66125 -47352 -29890 -18829 -12733 -26631
6885 -26631 -33954 -39055 -11001 16233 35841 13877 -1063 5309 36112 28670 4304 34759 34066
6872 34066 5485 5920 13561 -17652 -11153 -8791 4237 -21360 684 13189 12700 -1198 13342
6859 13342 -27 -8162 -30847 -34883 -7380 -8727 -10173 32573 48089 60943 87013 76717 54369
6846 54369 35531 36726 29379 -2017 4344 26916 1261 20750 30772 23878 6844 4609 16926
6833 16926 29684 45135 59236 48369 24226 -4779 -7713 -7348 -37040 -29799 -46492 -53310 -6242
6820 -6242 -12422 -9652 -31036 -13165 5383 4357 -31442 -5599 18661 20232 17453 -4843 -4491
6807 -4491 5820 9884 11421 -6225 -22679 -18740 -31947 -34766 -53846 -27659 -1725 -1556 -6724
6794 -6724 -14645 -3530 -4430 -2610 -4370 -30696 -42220 -25099 -9433 -1435 -31316 -55465 -26682
6781 -26682 -11932 -27375 -48498 -29458 4365 18100 20835 -9742 -40632 -43309 -40638 -18771
6769 -18771 -29671 -46661 -49877 -56217 -18543 9496 12957 17840 17226 23322 14253 10496 -6419 -33938
6755 -33938 -30969 -48354 -22098 12945 35369 44171 49464 46327 64736 47407 26583 22275 15281
6742 15281 16066 27479 7972 7932 -30629 -33615 145 6577 15036 20319 2845 -9591 -37570 -27424
6728 -27424 10662 39729 81752 95160 115213 129773 172356 273900 339444 367686 349809 284483
6716 284483 206773 168576 74909 30517 47837 33247 21784 11550 4294 5274 3555 3193 20726
6703 20726 6529 3415 -21665 4691 35067 57002 32887 9333 -9595 -26446 -1627 22539
6691 22539 5017 -34919 -29285 -22767 -7137 16521 21859 9748 -3687 -20683 -14446 -4810 7414
6678 7414 30005 13507 -15049 -18552 8061 5419 -20423 -37281 -19614 -11471 -16814 -22265 -43395
6665 -43395 -58334 -32324 -5097 -13069 -41527 -42479 -31203 -8921 4215 -12243 1992 -3014 -31370
6652 -31370 -21265 -17330 9024 32403 33515 29741 26201 36441 17578 6123 -4269 8840 44273
6639 44273 20423 -1012 -20181 -38262 -45280 -55682 -71871 -75210 -63821 -36446 -25987 -36550
6627 -36550 -17458 -12225 3789 -14192 -28209 -15181 -6999 -25742 -43646 -61418 -56882 -63956 -42575
6614 -42575 -25759 -18970 -473 -7539 -3203 37422 61535 16433 -10723 -18613 -25379 -30008 -11509
6601 -11509 151 6215 27683 31339 23986 17550 27578 56640 88227 45848 37039 36030 11104
6588 11104 -15116 -20820 -29973 -50755 -52697 -21797 262 -96 -22966 -7923 -10916 -17878 5725
6575 5725 16116 -12444 -16626 3370 35437 32805 28606 3391 -5979 -16868 4904 40806 15450
6562 15450 11611 -3801 -15934 -22366 -4934 -11928 21604 44639 34243 31004 30012 5617 -11054
6549 -11054 -13558 6734 13835 -3616 11646 37456 18124 -561 24008 45466 12696 -30498
6537 -30498 -58506 -73433 -80462 -85196 -49733 -27777 6150 34163 30699 37291 36095 749 -13787
6524 -13787 -15763 2719 1060 -14700 -32043 -61154 -49464 -44399 -25207 -7893 5366 -35708
6512 -35708 -47715 -30448 -298 5638 -2409 -34591 -30197 -15968 -4398 -9060 -42149 -76195 -78451
6499 -78451 -61198 -21879 -12972 -30733 -48394 -16947 -18923 -21046 3614 -23414 -14396 -23182 -23339
6486 -23339 22606 52276 52847 11975 -46859 -77946 -45460 -12273 -4894 12066 22046 15906 7892
6473 7892 -20734 -58470 -61127 -12725 2768 -4273 -1259 -11968 -25551 -27608 -9034 21703 41475
6460 41475 11375 -26320 -13016 15272 -4905 -1980 -15995 -44839 -29525 -14008 4466 -25463
6448 -25463 -21524 1741 4000 22845 6023 -8116 -12132 -7722 -14457 1853 14635 -1371 8741
6435 8741 29488 16346 -292 22635 34493 -5938 -442 11274 -3144 -11545 -841 6828 -4520
6422 -4520 -21048 -39237 -45607 -11778 11952 11191 -19206 -19936 -53312 -54480 -49784 -24508 -6279
6409 -6279 34103 28365 -1794 -17745 -28127 -14457 31391 55732 32209 20460 21380 14077 13663
6396 13663 -17612 -24145 -12644 -9383 22361 15418 1894 -21351 -17712 9693 6998 -15707 -13721
6383 -13721 -28609 -16424 -5485 14986 14 -1111 -14794 -13218 -30177 -18789 -1670 -25859
6371 -25859 -46207 -54781 -10416 3051 -22412 -33538 -22274 -2925 -43306 -71323 -64489 -37192
6359 -37192 -34950 -34172 -8821 4073 35927 70113 75714 42186 18351 -14022 -3619 -14723 -31554
6346 -31554 -45137 -44650 -12965 21792 8950 -11865 -51575 -54056 -43456 -42164 -61976 -54693 -6474
6333 -6474 16299 7375 -4003 -14675 -22813 -5355 -16607 -8090 -33135 -57680 -48312 -38335 -15082
6320 -15082 -25470 -49856 -53342 -36604 -35278 1393 -7888 -34830 -23880 -18364 7462 11851 1502
6307 1502 13302 -1615 9231 31426 19770 2347 11237 31511 41161 16884 -4511 -33481
6295 -33481 -58290 -25951 7847 -12802 -16358 -14836 -8064 -1534 -5225 -10502 -19458 4277 17698
6282 17698 8323 6907 1591 13609 21313 26071 47710 47365 32402 7070 7553 -8849 -42394 -49128
6268 -49128 -19800 -26156 -29056 -49444 -27524 -45888 -65025 -53070 -25342 -15303 509 -2416
6256 -2416 -3585 -21218 -41372 -33551 -35032 -43857 -27866 -49275 -34196 -25940 -17813 -17001 -36297 -29373
6242 -29373 -44860 -54030 -42615 -31819 -58586 -58483 -58550 -56552 -75495 -41340 -12593 -2609 -15735
6229 -15735 -22425 8124 19328 8535 9689 6849 27000 31058 37265 16367 23850 19310 18787 13798
6215 13798 4399 21052 17228 -18930 -12404 1371 -20962 -41211 -50436 -61179 -60772 -60166 -12243
6202 -12243 39121 49120 -330 -22569 -29057 -31222 -21664 -10757 -27046 -56651 -47727 -24749 -29625
6189 -29625 -5916 -13668 -19429 -44202 -38100 -28712 6320 18070 5810 -14669 -72061 -70929 -34008
6176 -34008 -17301 -23134 -44522 -72899 -85993 -55674 -37918 -16033 -30773 -50529 -76314 -89517
6164 -89517 -98451 -79823 -60415 -51772 -31530 -32680 -59131 -72777 -56459 -36950 7624 40230
6152 40230 -4582 -28840 -31300 -40464 -80986 -88457 -86940 -72097 -40630 8149 8204 2504 2469 -14553
6138 -14553 6645 41828 16919 -6768 17891 32465 19225 -3330 -2103 -11362 -8607 -23601
6126 -23601 27767 22300 -13589 -12512 -3932 -14491 -19764 -29629 -14551 -28535 -36929 -23905 -15034
6113 -15034 -30678 -41690 -14762 -16815 -39652 -26328 -48566 -32178 -28052 -21113 -19994 -27438 -14693
6100 -14693 11033 12129 -10236 -13409 -21555 -48830 -30964 -33866 -45064 -32972 -39362 -47717 -37059
6087 -37059 -36455 -24975 -11080 -22016 -26916 -10413 -934 -7414 -16565 -50928 -35415 4140 16863
6074 16863 -9886 -17930 -20380 -17218 -22691 -23549 -23227 -33661 -49504 -47739 -35253 -25899 -29401 -3508
6060 -3508 -5122 -34842 -42422 -55752 -63375 -80159 -76422 -50675 7750 -15683 -31976 -28344 -20983
6047 -20983 -7239 12235 40375 49272 60693 31448 14298 6641 28618 24553 12774 831
6035 831 -20153 -33191 -61261 -70071 -86442 -88668 -86325 -65777 -57918 -45343 -19723 -6634 4916
6022 4916 6275 24960 30485 24405 16517 17871 27001 5287 -27454 -8584 5877 -2340 -265 19723
6008 19723 5186 -2550 2077 31210 36256 3507 -24843 -9631 -13344 -34453 -46503 -26246 5589
5995 5589 3559 -1730 17007 9555 -20584 -47838 -65049 -73977 -53840 -2243 46910 58631 50902
5982 50902 15483 -294 10104 8075 17435 -14632 -38090 -26023 -21464 110 -12832 -31436
5970 -31436 -26157 -23501 -19109 -13571 -20175 -31228 -18618 -8131 861 -6436 -8629 -11365 -12502 -19228
5956 -19228 -2858 37927 30757 4293 5526 12380 5797 25897 59549 6914 -43009 -42525 -21195
5943 -21195 -32526 -21343 -17604 -6988 -25994 -21057 -68018 -48282 -27297 -6683 -6455 -14711 -35917
5930 -35917 -51394 -27282 -1768 7830 6338 -4103 8618 17755 -32441 -71709 -61526 -38061
5918 -38061 4158 24377 44590 25872 3085 -18532 -26001 -25010 23095 56896 58717 66908 73310
5905 73310 45750 25887 21934 23527 25370 472 14455 13016 10477 20007 25195 -5506 -18771
5892 -18771 -5601 17663 13853 11680 24363 16574 -5711 -13028 -18517 1464 -1206 31333 30994
5879 30994 35688 54281 80257 103795 67692 23387 2623 -23100 -31302 -26311 -41706 -69927
5867 -69927 -53222 -5788 19665 9569 -399 -1354 -10762 -817 1059 -22110 -30658 -42662 -78848
5854 -78848 -87553 -12447 27781 23725 5216 -13759 -9710 -13673 15213 13865 -13050 -22143 -38777
5841 -38777 -36279 -26016 8183 8370 7047 6112 14115 16028 8139 22068 7520 -11949 -4578 8119
5827 8119 4286 9582 20043 6916 -30971 -18671 -2422 -25513 -8191 25115 32780 42154 29980
5814 29980 23457 20534 -15564 -38838 -27113 -4973 -15554 -706 13692 21486 -8231 7032
5802 7032 16370 21913 11532 -4915 -20573 -30017 -27587 3186 24417 -446 -17260 -16332 12646
5789 12646 11204 -3036 -17641 3033 43383 58619 10407 -23566 -51933 -63871 -51600 -25131
5777 -25131 9655 91 8887 15608 -15231 8571 48467 50183 48423 40706 47117 28375 8711
5764 8711 34988 75490 56469 27841 31726 -6157 -24483 -8081 -5945 -11588 -7033 17930 -768
5751 -768 -32463 -40825 -17716 -11282 -16560 -2609 3524 17872 19975 14681 -16535 -38628 -34353 -34343
5737 -34343 -22522 -7757 -3002 -33102 -41150 -48637 -59451 -27122 15855 16185 36420 47224 39710
5724 39710 10454 -36542 -42499 -1977 8380 -4278 -17147 -4288 -22144 -20399 -14954 -16447 -23674
5711 -23674 -4492 16056 -16137 -48071 -41557 -47767 -52977 -29928 -45342 -29337 3060 -7184
5699 -7184 -9053 -33781 -11908 13732 39666 68727 63748 26790 14310 16262 43515 47796 29178
5686 29178 -12421 -19764 -18474 -9334 -29990 -17309 -16026 2689 27647 49270 47422 47523 40761
5673 40761 9969 -12075 -25454 -21404 -28425 -39193 -68935 -59722 -25545 22658 51049 55841 55950
5660 55950 53121 45230 71218 89837 63704 12321 5570 37148 65596 61222 44333 28997 41306
5647 41306 39111 43032 34636 29415 29536 17465 2115 15503 -25839 -28229 -21997 -16787 -41493 -71018
5633 -71018 -66378 -16006 -18517 -58357 -46100 -20977 317 4268 -5455 -12073 7190 32639 35621
5620 35621 26699 -9147 -2000 5468 -15819 -31133 -3935 3068 -15871 3340 -14976 -23635 -24240
5607 -24240 -27807 -46184 -1892 246 -49853 -43663 -15873 8743 7015 21935 10498 -7528 -3806
5594 -3806 -21216 -38948 -11560 -842 3475 11823 10621 8458 11729 22736 16672 -19255 -62111
5581 -62111 -43260 -21047 -43713 -69213 -70579 -64959 -65903 -40396 -7291 8513 -6140 -22232 -34717
5568 -34717 -62553 -97500 -92767 -72837 -50849 1694 15753 25705 18557 3971 -11520 -15352 -4838
5555 -4838 66 -7357 -35820 -13399 -12475 -31777 -31110 -24317 -9916 -27615 -10445 -14200 -5865 11931
5541 11931 -9569 1251 32000 26429 -18670 -46012 -29842 -23716 10476 13586 16576 16813 -3980
5528 -3980 -12252 1194 -2849 1816 27069 20657 19748 36935 7873 -10734 22916 35041 28088
5515 28088 17680 -15069 -29670 -19845 -7152 -24465 -39548 -25558 -15031 -5280 28132 43738
5503 43738 35367 25501 15486 21823 36083 51229 49538 49203 41600 25711 -166 24283 56748
5490 56748 71113 64755 35383 10581 12522 -11713 -35239 -43783 -16394 -20832 -23005 -10068 7063
5477 7063 2744 -1391 -127 -6898 5028 7076 -5299 -3247 -30668 -57347 -41932 -10576 1818
5464 1818 -27112 -13339 -14498 -21139 -42590 -30053 15517 13899 -18104 -35599 2972 -34481 -41411
5451 -41411 1374 20598 -68 -28125 -25659 -34904 -65365 -66012 -37877 6171 9622 10869 19667
5438 19667 42907 53818 58438 12810 -10421 -54042 -24243 -18354 -11425 19018 12340 9738 16682
5425 16682 28328 49832 32406 3873 9523 -4384 -26975 -35336 -13069 -23768 -13456 6236
5413 6236 17985 31393 49242 33512 13667 -17441 1518 24885 20699 19265 8932 4223 -2948
5400 -2948 192 -27079 -56838 -28500 14800 25012 26309 36296 21223 -38946 -3477 7244 -8228
5387 -8228 -42668 -15185 21596 22181 -5177 -26496 -15530 -9029 -5601 1068 -17896 -28551 -19714
5374 -19714 -24585 -14643 -19877 -37501 -35180 -51158 -41469 -26838 -12445 4857 6222 8452 35846
5361 35846 12914 193 3059 14549 8923 -4978 -3903 4208 -7523 -7029 13869 10902 12077
5348 12077 -3392 -16073 7404 -2126 34534 61434 27918 16046 25073 31501 34481 29522 56182
5335 56182 32628 14722 6649 -17275 9361 14023 -10653 -10980 8623 -8856 -25464 -26345 -25244
5322 -25244 -27487 -17155 -19683 -13053 21453 32178 16197 -4799 -16515 -38643 -11567 -11263 -3333
5309 -3333 15673 11523 9851 18442 28785 54362 45345 9135 4713 18431 7876 6804 29653
5296 29653 11700 -36466 3919 36518 29048 24939 25243 16658 7137 -38566 -69483 -64890 -7273
5283 -7273 3738 796 -23680 -66000 -44620 -27241 -29071 -42649 -51390 -64270 -31374 9725 40436
5270 40436 15863 1593 -11750 -26093 -15180 -7876 -6322 29249 34239 12477 -29071 -71056
5258 -71056 -72711 -88593 -75312 -42130 -66502 -62315 -71351 -46665 -52169 -54971 -12380 7668 -12180
5245 -12180 -30209 -32995 -31172 -38053 -36915 -18649 -22180 -21771 -4393 2366 12967 32111 63788
5232 63788 54660 18803 -17231 -11583 -17230 -38121 -32336 -33842 2643 17464 -11767 -18250 -17051
5219 -17051 -28587 -28595 -27579 -32256 -11914 16499 2151 7722 9414 -17405 -35826 -21594 -23266 -20987
5205 -20987 -1910 17093 14496 2159 -2116 -8030 -19279 9796 28893 27381 -4194 -20992 -31126
5192 -31126 -42524 -11323 21543 12869 33970 37335 37862 49898 6581 -43100 -48539 -5453 1821
5179 1821 3538 4268 12383 3276 15273 -2851 -2254 9315 7804 -19189 -4045 52988 72454 36847
5165 36847 11267 -3662 -20837 -12876 -25078 -20381 -16405 -2769 6377 -34182 -21927 1258 9776
5152 9776 24175 2568 -13548 4041 22020 15722 -434 -40642 -39302 -10285 34962 32360 47313
5139 47313 50274 -1175 -19348 -7008 -47881 -55369 -32624 -15209 -44491 -82790 -84999 -82377 -124252
5126 -124252 -133668 -90866 -49641 -43920 -24927 -1589 3217 33161 40874 37457 22181 -33979 -27409
5113 -27409 -11843 -14540 312 -646 15346 33388 28078 33285 58337 19263 -1299 -3590 18634
5100 18634 13346 8423 4030 -3439 22926 51496 33683 5945 9051 61019 222 -11131 45845
5087 45845 69099 27325 -23817 -48347 -30130 -9240 24950 2145 -13225 -3789 -14297 -35416
5075 -35416 -30115 -2289 458 -38573 -46665 -23498 -24071 -20867 -8271 -18301 -29034 -44074 -42199
5062 -42199 -40358 -41804 -18057 5975 20444 19531 12727 6347 5677 -5423 4960 29594 32424 12511
5048 12511 -7458 1319 3891 28502 39004 7906 -15331 -41102 -44679 -6448 16272 -1157
5036 -1157 -11099 -20640 -15937 -27158 -36521 -35886 3226 24801 -41303 -46581 -4675 3420 -38092 -57483
5022 -57483 -35691 -34985 -20522 -2333 4457 5526 16333 10627 21192 10275 16847 37430 49468
5009 49468 26936 4069 -18814 -4645 8244 14922 6186 -11590 -17267 -6299 29084 48850
4997 48850 26081 -32984 -67174 -54499 -20849 -20548 -13902 5392 25251 -32096 -48308 -39675 -34254
4984 -34254 -20352 14867 45835 59875 29854 -1331 2722 33535 55636 42751 40797 28438
4972 28438 9256 784 3724 -10952 -4847 -35813 -59268 -24968 -18685 -2996 13496 2074 -18571
4959 -18571 -18609 2337 6284 -16093 -20777 -2963 9541 -10996 -20361 -13799 5115 7843 1962 17866
4945 17866 3098 21411 49172 64037 47898 34766 50847 27826 -14885 -16099 -39402 -48047
4933 -48047 -19767 -27330 -36094 -27358 -18768 -25487 -4521 31975 38996 14580 7406 36031 32912
4920 32912 37995 60330 44154 34298 19122 2046 -18582 -29506 -8477 18724 28792 28867 46702
4907 46702 29923 14662 20382 10474 8650 -18629 -5761 -17716 11226 27685 27236 19166 8763
4894 8763 -134 -5826 -19271 5122 58661 72292 52863 40038 45429 27838 6448 -10396 -40161
4881 -40161 -85593 -69450 -53108 -42914 -22467 -8786 -34027 -55745 -46715 -30731 -26998 -14126
4869 -14126 -12139 -17204 8340 -11884 -28666 -28733 -8659 1092 -23997 -19841 1442 26190 -2990
4856 -2990 5722 16635 3024 -25854 -29131 -12983 -10806 -6288 -45031 -52984 -31006 -44721 -17452
4843 -17452 39354 47963 51434 73010 47389 14032 -15792 -10004 3488 22950 30745 22663 15964
4830 15964 -10794 -22716 16524 28038 46700 4964 -38717 -18447 -52018 -71060 -49803 -35232
4818 -35232 -34186 -45576 -4871 16496 -5521 -10754 -1923 33598 63510 40919 13953 -2992
4806 -2992 14266 22497 42311 29239 5297 -10383 -27960 -33811 -24589 -10071 -16784 -28855 -32721
4793 -32721 -10052 49778 19275 10189 26467 8108 -14849 28466 17867 1137 17280 75417
4781 75417 95711 63941 15702 9391 -15586 -14212 -33493 -13669 -26472 -25712 -31498 -72438 -55937
4768 -55937 -36668 -14889 31061 29493 17356 -17434 -7511 17261 7820 7008 -16194 -33903 -29621
4755 -29621 -46270 -43435 -34171 -18366 16005 35166 11063 -31172 -22263 -25278 -26873 -11139 16824
4742 16824 35424 28020 -4838 -19644 -30834 -35342 -6660 24615 28545 25153 20888 22493 25592
4729 25592 -343 -40132 -39597 -51546 -25306 -5841 16377 26730 49804 69547 51943 1140
4717 1140 -14652 777 39619 38523 -1565 -27818 -12122 -36512 -44896 -35456 -39453 -35812 -19614
4704 -19614 -19794 -20554 -11480 38619 47763 24162 5137 -20159 -23697 -26348 -21958 -32708 8055 18458
4690 18458 12475 28781 47403 13619 -13155 -13395 -38308 -1935 13286 5519 -16995 -45302 -10810
4677 -10810 -6530 -43239 -48104 -44053 -45508 -42219 -10169 -8708 -23143 -27133 16 2854 -28781
4664 -28781 -40270 -38224 -44404 -14979 -5739 -35688 -22033 -17844 -42095 -56449 -48481 -17858 -2807
4651 -2807 -23991 -46942 -63070 -51294 -20195 7138 3311 -15388 -38680 -28064 -44655 -43836 -66323
4638 -66323 -84089 -65541 -46098 -20108 -15001 -5851 10614 14825 15446 18536 11972 23035 4263
4625 4263 -22283 -16309 4457 14244 18152 22313 12921 -4734 -33627 -45727 -27777 11295 1770
4612 1770 -4465 3070 21608 14320 8699 24626 13733 2785 31871 58749 30372 -39662 -75638
4599 -75638 -72456 -81955 -66606 10475 54911 50657 27252 38989 42116 28003 9680 23116 17129
4586 17129 20741 28744 34364 6657 -8142 3727 12861 -15298 -14543 -23316 -13176 -8023 -28123
4573 -28123 -997 814 -17323 -308 -9469 5497 17288 45158 62124 49197 17622 -31166
4561 -31166 -39264 -41516 -45020 -42008 -53796 -88075 -75672 -59396 -34041 -23681 -59327 -77669 -87317
4548 -87317 -84736 -44704 -36018 -58278 -50726 -50787 -17999 8303 12507 24055 19966 -233 1186 13649
4534 13649 24639 -2298 9952 10591 23289 22287 23170 43988 15921 2744 3412 -17958 -66819
4521 -66819 -35758 -26165 23193 96479 101997 26028 -51815 -56152 -34975 -30534 -22056 -11805 -4173
4508 -4173 4731 -4871 -28806 -43007 -30609 -23709 -15692 -23979 -5394 5220 2283 -22810 -26590
4495 -26590 9522 8081 -13996 -22771 -43596 -53109 -26418 -27636 10104 15779 20294 45782 26903
4482 26903 4906 -1873 -32304 -39840 -56805 -63943 -29662 -11139 -17106 -2683 -30954 -6747 38
4469 38 -29009 -26738 4072 15588 30845 83136 65005 47272 35175 47474 35506 7732 -4800
4456 -4800 -12327 -14571 3606 18862 22606 23890 25755 5271 28932 17343 26187 35941 5038
4443 5038 -1043 10012 12452 9719 25218 42093 23977 21819 20594 33549 32196 6552 -26974
4430 -26974 -29259 -30690 -35442 -40222 -16896 -7338 -8637 2265 1243 -5952 -5600 -15735 -28944 -37086
4416 -37086 -62902 -64665 -19248 -6938 -14045 -14361 -10080 -11125 -5795 5907 36811 49044 51538
4403 51538 -4344 -38513 -29237 -2283 34133 41751 -6571 2696 6878 -16850 6106 38396 70153
4390 70153 34537 24199 39174 24480 34508 18766 13073 -7087 -1026 -3298 -20876 -22532 3709
4377 3709 23339 26350 46566 68214 75429 33807 -21035 -22585 -1126 -4410 -35990 -20492 3712
4364 3712 -10504 -10144 14101 32776 27076 23704 36586 27265 -3688 -39378 -57087 -42581 -45510
4351 -45510 -21713 8356 29967 17093 28607 -4296 -3315 -6299 2637 15668 8612 -13018 -35287
4338 -35287 -12675 -12229 -8915 -15408 -20231 -39362 -30905 8655 15957 -3117 10564 -26790 -56773
4325 -56773 -41213 -27563 -21944 2001 -19300 -26980 -5552 44310 29365 -1763 -1396 -2816 25306
4312 25306 103 -23858 -19041 -18871 12213 58138 33089 6986 12118 2052 -3204 -14850 -20762
4299 -20762 -19641 -15724 8593 435 -5530 31155 24487 -3128 -12142 4708 -4004 8666 20071
4286 20071 2790 2501 4362 13430 23450 20099 18376 61675 78635 78768 75476 33745 -5402 18053
4272 18053 -19948 -63041 -51341 -52391 -68062 -69084 -11597 -10203 -18731 -47401 -27027 7393 -817
4259 -817 -36647 -20187 -19138 -10294 -1452 -4086 -13745 11420 27859 47010 14570 4485 -1310
4246 -1310 -22615 -32676 -38547 -22035 7248 34411 46075 -230 -7879 -6202 -23080 -53916 -46325
4233 -46325 -13810 -6022 11966 2718 -18185 9060 2385 18325 14441 -1169 -9218 -35288 -24946
4220 -24946 -11717 -12809 -17910 -8349 -38119 -50923 -29554 -40354 -55756 -72233 -56029 -42214
4208 -42214 -48926 -36401 -34522 -31557 -16758 3203 -22874 -55834 -60916 -35692 -36007 -37076 -20733
4195 -20733 -6234 -1594 521 18559 -9457 -17136 -26420 -29814 16378 23474 -42319 -52586 -27765
4182 -27765 -15472 24314 34303 39050 51881 63945 62690 26077 37214 7686 -10232 -1684 -28073
4169 -28073 -33972 -28117 9507 49976 18145 6835 -16769 -20915 -8994 -2079 -1295 42984 91102
4156 91102 74270 27768 3063 -12688 -16889 -248 25145 54009 49602 29947 25582 16726 33838
4143 33838 1341 -23646 -14712 518 5019 11690 38439 30834 10253 5560 28087 22416 275
4130 275 4735 29579 30208 24671 9127 -1310 472 -4623 2471 36466 -3084 -32866 -22128 -7632
4116 -7632 -17508 -35903 -18231 5927 9175 1132 -14115 -6096 -18471 21456 36607 34081 15025
4103 15025 47150 55384 18266 24436 43323 22640 -15538 -43442 -43706 -44942 -16750 -38169 -45107
4090 -45107 -24691 40588 39387 62027 45009 22708 34948 49176 33312 17903 -19415 -13561
4078 -13561 -19901 -15082 -5697 17780 25226 49701 66102 66854 68334 60671 33500 8040 -8114
4065 -8114 8315 -4051 -18250 -9056 -14483 -21124 -26283 -36553 -40546 -37951 -26014 -36130 -37050 963
4051 963 3365 -47318 -50657 -17075 44649 11726 -32532 -16091 -29252 -26770 -1158 -21554 -25541
4038 -25541 1383 -13328 -8887 -16222 -36362 -14116 -18756 -37895 11951 30362 41496 33773 -8456
4025 -8456 -21952 -14768 -18303 -22429 -4077 4503 16894 15331 7168 -16264 19629 32128 3912
4012 3912 5361 24289 27178 26935 4569 11577 36324 21388 8955 6921 11790 16089 -8210 -459
3998 -459 14893 20472 12019 26895 51201 16186 -7311 2272 21815 40393 -6500 -1760 30004
3985 30004 42702 2151 -26940 -12838 44588 69702 80288 34303 -2279 -19866 -7579 -16188
3973 -16188 -17896 -3169 6784 6309 2877 4653 239 30850 31656 -24802 -23316 1687 18132 22121
3959 22121 35080 26935 21251 11371 19739 10878 39084 42516 26439 27486 15268 9488 17004 21245
3945 21245 13797 6554 10753 -15079 -27446 -3476 3015 17161 11546 12107 -11500 -2276 19091
3932 19091 34920 29664 19693 15592 -5435 22050 18847 26715 57286 56650 43581 36659 35164 8282
3918 8282 40238 85462 92974 81769 61475 62999 76779 91743 85384 40929 24420 10845 19034
3905 19034 32124 41962 57953 51297 59502 55640 24194 36576 50941 47079 64110 54278 20676
3892 20676 29780 11019 6838 -6580 -22793 -36501 -52651 -31249 -28958 -16402 27386 19602 27430
3879 27430 21969 3442 5379 36523 37565 -1203 -18838 18751 27029 33837 34772 49262 68370
3866 68370 79955 65491 13525 10742 14983 36925 72281 74263 30853 3265 -17923 -18896 13348
3853 13348 46665 50721 63128 90051 64313 30869 -13100 -17585 9507 50067 74071 54464
3841 54464 28028 -7451 -47797 -82063 -73083 -43766 -27065 -25355 -15558 2807 3611 -19644 -26520
3828 -26520 -14673 18977 15443 10626 7468 -7599 -23911 13411 38545 16450 -6539 26401
3816 26401 28665 16706 4335 -2733 -12549 -44561 -6477 42080 62714 62859 25089 32798 11984
3803 11984 -1068 -2454 -9334 -33568 -21789 -21471 -15204 -3584 21041 30902 41492 28330 36777
3790 36777 7621 -18173 -27545 -16933 5925 -9729 -13930 -13966 25716 34537 36250 39007 9922
3777 9922 -8477 -49578 -67178 -47463 16644 38931 4736 -32139 -62691 -48690 -11534 14378
3765 14378 10143 907 -20473 -3843 -25734 -55949 -47564 -28863 -18372 -56638 -54084 -38716 -50503
3752 -50503 -33175 7150 3563 -1704 17310 3169 -473 5371 10395 7206 116 -1923 -8781 14500
3738 14500 41604 62958 56368 -3617 -37604 -16210 -30781 -31815 -15002 12459 28496 57227
3726 57227 68521 58635 26509 -25918 -17333 6767 13942 12248 4009 -32554 -52887 -51596 -2976
3713 -2976 2994 -19313 -12318 29173 39344 42777 32957 13733 10343 10657 30498 -7333 -57504
3700 -57504 -50474 -13131 -10904 -26497 -22179 -2720 -6440 -20327 -33461 -28838 18700 23225 40558
3687 40558 39408 25101 48035 28822 22159 -10583 -7513 5871 24902 34644 37464 6952 -10280
3674 -10280 -37892 -55164 -69414 -52084 -26567 -21218 -24167 -12191 101 19085 24351 26931 16862
3661 16862 -9005 -13891 -20263 -21601 -27984 -44813 -38622 5336 1600 -7830 -6833 -19490 -36631 -54802
3647 -54802 1130 17976 31428 -2568 -38791 -15533 6343 9552 12364 -14418 -6307 -6156 13343
3634 13343 -6889 -55207 -38252 6558 -2393 10533 27039 28578 49221 39645 47647 30353 23975
3621 23975 11789 1446 19690 64193 31173 11133 -8072 9521 1723 -16170 -6396 18874
3609 18874 21033 43719 30480 6919 37552 29719 -21270 -34227 -9879 22867 18174 342
3597 342 -28908 -42239 -43107 -57251 -56111 -21958 -432 12473 7688 -49272 -50093 -41314 -41533 -35068
3583 -35068 -66191 -78001 -40035 -1950 32469 28067 24793 14364 -3978 8474 3763 39312
3571 39312 29906 -4802 2795 -17536 -4107 -27272 -21086 24175 55464 12054 -19415 -34559
3559 -34559 -41927 -66705 -44798 -4466 11928 23140 -19126 -24783 -43306 -60546 -58477 -39521
3547 -39521 -8153 -2398 -10560 -13067 -8325 1742 28261 38849 31449 15587 21194 15572 -1503
3534 -1503 -16492 29476 24646 -36025 -3591 15552 12862 15297 -4741 -4536 -9300 -324 19312
3521 19312 -13426 -46829 -32331 -54360 -68616 -24630 -6642 17076 26272 20160 6174 32747
3509 32747 27416 11277 17608 26573 3779 -6629 -4776 16868 43654 202 -18623 4137 9485
3496 9485 20460 34145 69475 91453 97902 71844 42987 25043 18042 14002 48960 70947 57883
3483 57883 43474 25635 34724 29253 32907 3902 12065 38624 29403 24190 45715 51865 63796
3470 63796 44105 28288 54231 56876 55113 32997 24969 42898 21676 1207 3472 207 185
3457 185 -3912 36371 35688 32351 34851 57881 82838 65754 52043 41825 -3877 22659 41716
3444 41716 19170 25662 564 -39482 -48494 -16620 -12430 -25661 -21941 -43426 -45869 -15815 9449
3431 9449 19330 28305 34170 7742 -16547 -26575 4162 33742 58809 44392 -2060 -41707 -36793
3418 -36793 17549 40684 55635 50652 42069 36730 17741 18748 42122 65574 84337 67421 6132
3405 6132 -35615 -43320 -23884 -36569 -46280 -39726 -5672 -16241 -31300 -18114 -5802 -21298 -11535
3392 -11535 -26243 -28265 -8755 -14021 -35320 -6889 -23509 -54638 -54003 -20774 -11934 -36411 -16428
3379 -16428 39097 41125 33092 3554 -10397 -19496 -34724 -19600 4054 41449 36199 -7616 -1588
3366 -1588 -4314 -21759 -24287 -65580 -49653 3354 36352 19917 34143 30378 -5445 -17037 -21052
3353 -21052 -21277 -21675 -19628 16472 29353 36373 36072 34175 19446 -280 3031 -3291 7693 4398
3339 4398 -3412 10363 1893 -3275 8999 40702 18916 -1486 -19348 -43882 -57666 -28884 -8036
3326 -8036 -20550 -21696 -45794 -48337 -8290 25631 9702 4897 25509 36633 12336 -4164 -19648
3313 -19648 -27057 -18155 -30347 -68157 -100626 -55760 -24122 -8554 -8519 7222 42778 36587 -17560
3300 -17560 -32386 4724 21160 898 -20493 -9853 5975 17469 23598 24393 -3781 -11853 -17760
3287 -17760 -13439 -12304 31148 50013 46537 22602 26505 429 -7230 32149 37243 3658 1432
3274 1432 -6797 4114 -8044 -29501 -11851 -1476 -52871 -72239 -38544 -32163 -19161 24116
3262 24116 39676 52843 25620 -5882 30908 38949 27593 42875 48458 32461 45054 83291
3250 83291 96973 88908 39096 20418 29578 52928 18100 14523 29799 1719 25563 4666
3238 4666 -37132 -44332 -35197 -31803 -11128 11211 23650 56227 43497 16102 14244 11840 7541
3225 7541 31790 49137 20775 11540 -21790 -20041 -14658 1780 -8176 -19785 -17716 -3608 -25968
3212 -25968 -44549 -44918 -45978 -58902 -41468 -11863 41665 21835 12029 4251 17412 37129 12400
3199 12400 9422 12590 -6427 -21288 -16515 10768 39774 29421 9319 835 4483 30449 58266
3186 58266 39762 9789 8646 21656 71215 74322 46738 45595 16630 -13145 -35719 -27437 -7131
3173 -7131 -4240 -16249 19641 13786 -17136 -59365 -45908 -13347 10718 16295 32557 30351 15200
3160 15200 -18766 -30160 -432 -7528 -7521 -21999 -10945 -20318 -4827 28794 39211 19547 -15271
3147 -15271 -25890 -35692 -2520 -4889 -29891 -53088 -39340 -5060 8557 16973 9656 24938 12320
3134 12320 5688 5998 5165 19531 9447 -670 10462 32388 16720 -8530 -20912 -9319 25894
3121 25894 15251 27834 30738 7134 -30555 -29820 -5573 28736 21796 43641 38649 31091 7568
3108 7568 -5681 -30622 -17951 -13056 -15375 -19756 -7077 -6118 -4207 -10355 7009 2014 3195 5511
3094 5511 -267 3678 11731 -14698 -21780 5208 -4864 -12318 -26059 4425 41781 51328 55176
3081 55176 80956 62699 20906 -17364 910 6738 9542 18401 14725 -970 1174 -10033 -27274
3068 -27274 -6596 16137 18647 -8421 4630 -6673 4080 64505 75441 49336 5639 -13946
3056 -13946 8686 -615 -31517 -54935 -23301 -16602 -15757 -15021 328 2833 -25028 2811 26599
3043 26599 -4276 -30628 -13883 9427 35100 25274 12661 1064 -14195 -16673 8163 16233
3031 16233 14110 -9605 9683 6303 -3592 -36740 -73277 -72917 -35902 -1267 -2561 -11821 -31787
3018 -31787 -65697 -50620 -14513 3126 14096 16587 14764 -10968 -36617 -16293 -8968 -35266
3006 -35266 -45698 -37558 -10656 -13704 344 17537 11307 13904 12899 -10800 -13208 -21308 -31590
2993 -31590 -36913 -21788 13821 29283 38922 9781 -5907 1535 27989 60640 55867 59306 10156
2980 10156 -34373 -72 40796 20755 213 -14373 -46214 -36936 -26112 20411 51066 59945
2968 59945 44887 28004 -66 -29290 -8774 2273 1035 -24589 -16413 -8653 -14870 -15204 7647
2955 7647 21478 8616 9077 7 5416 35656 60592 91209 64574 19597 -5714 -4075 -16705
2942 -16705 1182 -25986 -33444 -22190 -7666 -25518 -17275 -19581 5170 50033 38140 -10708
2930 -10708 -33026 -18629 -25560 -34904 -14998 -9570 -29751 -16190 20650 15915 20542 29966 221
2917 221 15496 26296 35237 31600 16107 -604 -3731 5053 -13025 916 29632 19577 19377
2904 19377 18476 3021 27718 6378 -30810 -29007 -30258 -46495 -27170 -21004 4105 15529 10270
2891 10270 23927 54275 91579 100779 89812 69554 44410 46004 78012 96576 71445 57639
2879 57639 33306 28194 30795 29444 17758 3027 -13807 -7741 18476 8990 -5801 -20315 -3316
2866 -3316 -7260 -22214 6231 33445 37063 29963 26776 29016 30940 22294 13515 -179 -5065 -23435
2852 -23435 -30144 -35064 -36753 -1906 26545 -5394 -7136 4110 -28186 -66377 -76483 -106689 -75260
2839 -75260 -43811 8745 14777 17612 5098 -9069 5673 1807 6033 34273 15501 5538 12808
2826 12808 -2900 -10199 3831 24298 36436 17633 -5283 8234 22873 31403 26934 14381
2814 14381 23820 55712 44666 6270 8486 19724 -9477 -9113 3397 -2335 -6226 894 -6428
2801 -6428 -6842 -1113 -7158 -33646 -41701 -36372 -13719 -36661 -49268 -24517 -17033 -44989 -43136 -15451
2787 -15451 -32726 -41950 -47209 -43286 -34232 -45168 -17579 8187 33803 74352 76640 65036 33324
2774 33324 7289 10785 26360 42154 37068 24435 39146 46383 24148 -28059 -35789 -13306 18881
2761 18881 9830 -5896 464 31982 39687 18185 -17889 -29681 -12964 -31929 -32707 -25350 -12375
2748 -12375 14924 35494 13016 25706 43187 11898 -28098 -19161 26529 6746 23264 42958
2736 42958 63232 25586 -13163 14034 33335 24465 41373 49252 47000 22588 12690 -4347 -29214
2723 -29214 -11377 -4316 4377 24980 35242 5972 25740 4901 -20054 -9389 25566 53233
2711 53233 69951 29350 -11626 -30188 -10988 35425 71699 77264 43804 10338 41429 47136
2699 47136 34265 3120 8574 42202 46215 31025 6142 19112 54958 59108 38285 1403
2687 1403 -2013 -4411 7056 3846 6042 30399 29483 15974 16236 18640 -12423 -20833 -5219 32615
2673 32615 37099 2069 -2050 -15485 -23508 -47855 -42444 -8222 2658 4187 -15141 -22369 -16477
2660 -16477 -6308 24674 25667 911 -7134 5199 -17476 -22696 5379 10352 41867 23745 41279
2647 41279 26010 18900 4392 3237 22482 46083 66333 43438 20624 4293 -16164 -4313
2635 -4313 1660 -2602 -6915 823 -8152 3120 -11605 20212 61409 6708 -3607 -799 -13628
2622 -13628 -14892 -37672 -70964 -80546 -36747 7 18942 -2329 -17604 1920 13371 31494
2610 31494 31406 17384 9922 12670 32149 44023 27389 1114 19291 21336 39250 45164 38521
2597 38521 28578 16765 7808 23171 14216 -28232 -17528 -18241 -1646 5428 4218 -2475 11268
2584 11268 -9518 -32642 -20789 -13799 -22668 -27799 -18108 -36695 -15362 23082 34682 19422 17872
2571 17872 31254 27435 15556 43949 75480 53400 73965 47061 53129 40174 -17255 -45105
2559 -45105 -39671 -31995 -17772 -25882 -43931 -51163 -39590 -39368 -38633 -30965 -22942 -8461 -21850 -16484
2545 -16484 -6223 -22549 -19901 -8085 -6418 -45606 -79314 -58626 -54507 -56253 -49857 -44928 -25762
2532 -25762 -22163 9592 63955 58631 52746 71288 59004 30867 -11388 -20162 -10121 19875 24677
2519 24677 -8916 -31018 -17819 -18877 -41342 -43570 -32492 -52678 -68937 -44616 -25754 -38761
2507 -38761 -72621 -51852 -29082 -34081 14380 30947 21114 -1728 -21457 -43814 -70444 -48483
2495 -48483 13341 40890 8290 -3813 -25739 -22319 9083 20212 19769 25209 38498 33842 19686
2482 19686 11570 5775 9643 -4739 -245 37364 42545 36605 3112 23288 75798 71375 61575
2469 61575 70959 55205 26271 13032 -3765 -58713 -56396 -20456 16083 24148 -3016 -8125 7104
2456 7104 26163 20887 31296 87854 110125 58135 43523 17596 12090 19882 598 -17784 -31860
2443 -31860 -15128 6204 18667 53483 60595 66130 51043 30350 14409 8986 10868 13020 -9079
2430 -9079 799 29443 46726 46078 36101 51050 32562 20888 12863 13467 20311 710 -9382 -22677
2416 -22677 -30018 -32097 -41321 -42817 -22685 -34252 -44359 -35265 1008 33168 20421 2629 23216
2403 23216 33831 29464 -3571 -12045 -14362 -16144 -45193 -85518 -79019 -58465 -39765 -7445 31480
2390 31480 24385 17347 24570 7879 -11099 -41286 -31580 -10120 158 -22474 -31851 -23117 -15315
2377 -15315 -5854 -20350 -20491 24167 31473 3206 -25883 -17506 -4490 4977 -8442 -6321 -1440
2364 -1440 -11809 -6247 19772 31308 34721 52467 58057 42975 41004 39288 -2421 24473 6185
2351 6185 -38510 -2693 37056 6926 -22698 13256 35378 31757 15063 12006 -23154 -18144 11708
2338 11708 51178 61346 53308 48019 15054 -9498 -30452 -26951 -32125 -7852 45905 25674 29882
2325 29882 56762 45388 31075 36520 36818 45140 66927 52496 45766 30096 39265 48717 50376
2312 50376 47752 21498 -7622 -12362 -7248 -1490 20217 16342 -2006 -3015 912 -18002 499
2299 499 8524 -5560 7232 10544 19150 16814 41902 24999 10860 19825 15921 -16153 -23404 -16495
2285 -16495 -20285 -36265 -46682 -13655 8051 7219 -14230 -31013 -63561 -82387 -77537 -52186 -36016
2272 -36016 -8250 31839 40166 31850 10126 10355 39730 2245 7747 22140 16416 13898 2326
2259 2326 3200 12562 8083 31474 35610 11891 3284 7610 16645 5855 -1789 11153 35636 30002
2245 30002 39403 53523 41862 33785 8171 -24616 -31565 3384 27301 7150 -22876 9463
2233 9463 31449 34816 21339 32054 10300 16443 16710 -8283 -6426 15696 21881 8854 8962 -15441
2219 -15441 -17258 6661 7736 1718 -18192 -1536 -29696 -50511 -55422 -65922 -56431 -12844 13961
2206 13961 -4919 -9845 -8196 14779 62652 53680 24575 -4215 -25335 -39034 -10166 20685
2194 20685 16075 11478 19324 37959 13637 10095 9415 24065 16876 41273 64333 71194 55093
2181 55093 47018 36014 28982 26296 14925 11419 8339 -14938 -21072 -20382 -6078 -18281 -52786
2168 -52786 -26017 -11964 -32285 -42779 -10273 33559 28327 -1128 16245 17267 -17889 -28035
2156 -28035 -7743 30551 1425 3692 -4251 10721 11158 4544 22829 64352 71476 36983 14238
2143 14238 26534 47669 20694 9147 5641 -342 756 -20110 -29454 -19114 -10730 -17613 -35628
2130 -35628 -43423 -31872 -24061 -5039 -393 -6388 -21896 -28942 -3789 -2926 39325 21795 6054
2117 6054 -835 -10918 -8810 -9611 2129 -20361 -39370 -43054 -8945 -993 -833 5623 -5424 -31439
2103 -31439 -37858 -10094 -16476 -25024 -9681 -2899 4726 10811 -16001 -53767 -53537 -36943 -20782
2090 -20782 -8996 -16929 -2231 -7370 -35634 -18138 29438 -9641 -45440 -40549 9529 32416
2078 32416 45332 58830 10260 7123 17774 22038 56479 104172 101787 42771 -7132 8377
2066 8377 6397 -12070 -11896 -10862 20156 12339 -11092 -6278 -11934 -22565 -22079 -9122 29441 8093
2052 8093 -14798 -34836 -35034 -13483 -5099 -26031 -28334 -26187 281 -1214 4292 22643 48944
2039 48944 44304 17538 32713 42507 -6967 -33 13842 3591 8273 18843 14296 15477 27027
2026 27027 46853 44046 32661 23200 -6238 13006 20799 24303 30454 8266 -14370 -22520 7678
2013 7678 -7212 -6342 268 -12121 -38625 -48386 -40610 -16325 7948 27047 35761 12431 6270
2000 6270 17082 11605 5502 -8296 -25408 -40752 -6896 19962 693 13970 -4945 -20994
1988 -20994 13353 18524 -11279 -20920 -17932 -22342 -29367 -28185 -34282 -44670 -51930 -14101 25489
1975 25489 12933 -8138 -2790 -7813 13674 34023 7958 -109 -17883 -38866 -60394 -71957
1963 -71957 -49368 -11126 21236 36686 41094 38332 31949 18717 -21742 -8479 50753 60848
1951 60848 40285 26674 24159 61333 18376 -25009 -17594 30153 -9992 -23805 207 2561
1939 2561 19495 47117 69537 28981 -2036 -24692 -33397 -28705 4842 36828 47523 10185
1927 10185 -8336 16487 31387 496 -10686 4908 1428 1165 -23692 -11530 -19779 -19019 -35183
1914 -35183 -50409 -19042 -7420 -10399 -4193 -9373 -38791 -62788 -49011 -49032 -30548 -27432 -7513
1901 -7513 20369 23002 -4792 4729 39194 42588 18321 7324 -15989 -12514 -25065 -31113 -10040
1888 -10040 28734 37592 3375 6505 50693 66810 57829 49881 17059 -12196 -10422 6323 44521
1875 44521 21600 3159 24600 20135 -2229 -13704 -19129 -6668 2574 -11887 -23095 18842
1863 18842 30243 7653 -3987 -3158 20415 22614 21315 21301 670 -21512 -24647 -16156 -2705 39917
1849 39917 35946 17367 51601 63272 45587 23697 -7113 -18011 -53798 -89433 -74731 -45769
1837 -45769 -63733 -67616 -65171 -51806 -35292 -19432 -9332 -12948 -24065 -23907 607 38594 52556
1824 52556 47883 7092 15221 9490 -9611 -10582 6908 1205 -3432 -22040 3211 20923 -6636
1811 -6636 -3561 -22058 -5437 1315 19998 -8721 -26161 -880 15740 -1623 14282 25423
1799 25423 10583 10426 39901 26985 2742 -10236 3665 -4994 -6473 21318 40401 39999 13109
1786 13109 36818 44037 21637 -20062 -31706 -24093 -39172 -14268 7799 -17754 -34546 -8347
1774 -8347 -16363 -9725 1688 5272 -22654 -20545 7343 -6734 -16234 5760 9371 15854 25043 16146
1760 16146 18196 33105 2326 -11646 -6092 3178 21939 20349 12619 -6446 -21707 -16650 -18950
1747 -18950 -13820 8127 17153 16091 9890 -18561 -73783 -80571 -57750 -60300 -36353 -19255 -20772
1734 -20772 25222 51320 35422 -6246 -12613 12280 -23972 -36064 -35687 -15829 6913 9816 17303
1721 17303 62216 51624 4225 -13804 -3964 12665 7466 17697 14801 -6007 -2462 -19193 -844
1708 -844 8603 8867 24397 -7698 -22204 -26427 -56995 -38073 -42441 -71751 -77922 -44978 -18913
1695 -18913 12498 13039 -8728 -8058 6765 12378 16968 -7763 -28915 -21213 -392 4443 -846 -14313
1681 -14313 -23515 16023 27827 12150 21018 13038 -2991 2467 6116 28297 43500 19453 -29386
1668 -29386 -136 27989 24867 -1733 -7408 1516 -20403 -7041 13579 -1033 -25168 -31053 -23557
1655 -23557 -18630 -14320 14499 33910 29555 2557 -20894 -38836 -26739 -16117 14240 5561 -27821
1642 -27821 -288 -6161 -12668 -25159 15034 49229 33069 -24238 -45063 -22170 -19734 -14565 -12404
1629 -12404 -43619 -40428 11501 51249 22156 -15168 8892 25388 43302 63737 54906 37541
1617 37541 38404 6704 -113 -28689 -42079 -15787 3747 15223 35490 35672 31787 36739 33032
1604 33032 -5792 -30305 -20518 -22228 3551 13373 9909 23730 12512 20798 21947 14287 -28459
1591 -28459 -49740 -38345 -30982 -36292 -8417 -33841 -52864 -50288 -16770 8836 28072 3671
1579 3671 -31502 -20874 10944 -17166 -50821 -40560 -55953 -45536 -6718 -6434 -4181 -9954 -53723
1566 -53723 -66205 -56900 -23365 20791 44924 36632 41914 34240 12845 1589 7200 42670 37860
1553 37860 27751 46828 19700 1146 12836 18001 7582 11294 18144 -29096 -76709 -58606
1541 -58606 -45184 -29844 -27455 -32974 -20363 -2950 -16035 -26638 -16893 -29969 -12641 24456
1529 24456 23179 20261 -7336 -10258 2324 -4650 -25788 -10878 28650 78917 105270 53925 39881
1516 39881 30827 12648 -19652 -22866 -8435 -7092 9742 2818 -3152 -5432 3106 24889 39363
1503 39363 29502 30467 34185 40985 5407 2353 12414 26356 34735 47148 15206 -1799 11098
1490 11098 35777 15107 10107 4755 16818 14906 13373 22975 27900 -8082 -56957 -51590 -7207
1477 -7207 -17948 -44270 -36924 -33956 -6302 -5917 -38371 -41670 -16035 13111 52980 38495 30946
1464 30946 44239 31850 13150 -12859 -33468 -33926 -42009 -22155 -5872 4014 11 -3996 15319
1451 15319 8658 -25924 -42283 -31403 -3203 39468 79783 105247 125110 101055 53592 31720
1439 31720 21949 -3062 11556 27636 14988 16215 27496 34808 42345 35530 48724 32994 43073
1426 43073 35754 50334 57703 47215 82901 91131 67136 38164 12489 6418 6223 -381 11539
1413 11539 14360 -14843 -26679 -14285 8950 5751 -32750 -20042 -18655 -29973 -10552 -13104 -25681
1400 -25681 -16121 -25617 -21872 -23535 -4691 16285 -20503 -65676 -80505 -48475 -48900 -60053 -44173
1387 -44173 -28842 -27861 -10993 19468 28217 19722 14612 8018 -11208 9196 4967 7138 45470
1374 45470 59386 36788 19381 -13011 18905 50895 51561 73143 63297 59666 13330 7689 1064
1361 1064 -13289 -24061 492 17476 21929 -26106 -49137 -50663 -38500 2089 26368 9940
1349 9940 22924 51688 48959 8475 17786 28354 36775 42596 20307 -18611 -25515 -25013 -5078
1336 -5078 13655 28262 31450 37075 42539 45283 16845 1756 -29574 -32063 -18557 -8064 -14007
1323 -14007 -31744 -34954 -46466 -71056 -66563 -45280 -36449 -19627 30648 53997 346 33 16185
1310 16185 33870 47788 995 -11855 1678 13411 39408 44493 30946 51047 71932 33190
1298 33190 19482 37743 17845 -1628 -18600 11311 27212 -4707 -6424 -7029 17215 -728
1286 -728 7541 16073 433 -10610 555 4588 7994 -17667 -33565 -25015 -23901 -14816 22985 19818
1272 19818 19718 17399 17902 5631 -2710 36037 63649 35507 8276 -25155 -18062 16195 46436
1259 46436 47964 56367 77564 37259 23706 17083 47537 31822 19339 17845 4101 -15022 -5735
1246 -5735 25924 15109 13193 8451 -36441 -36602 -19808 -24594 -29047 -3272 497 -2448 -720 -17739
1232 -17739 2383 -13440 -26658 -18033 -13557 -15206 -24689 -18295 -31752 -15007 -15370 -28584 -26358
1219 -26358 -5962 -13232 -8940 -1182 -22027 -15072 -18686 -26463 -21109 -10211 -2147 19361 4056
1206 4056 -7338 -4903 5561 -1902 -35971 -38341 -19912 4109 17185 4601 22536 11144 -5878
1193 -5878 9397 28799 37122 26756 15803 -11586 2537 25737 31420 46724 25771 -5405
1181 -5405 -13190 -9516 10346 16932 -4692 -43680 -25537 -9621 12828 -1321 2077 8804 12422
1168 12422 36495 25616 24105 6641 -16146 13227 32682 9439 -212 10645 26445 43276
1156 43276 43714 24076 124 339 4725 3677 -12709 -233 -5065 -7859 20208 28872 6922 -27166
1142 -27166 -34262 -46967 -25618 4651 13441 1260 -1816 -11408 -18366 -23638 -15432 -5501 23244
1129 23244 14216 -12593 -38017 -58524 -33294 5810 -9944 -37395 -37567 -28870 -53700 -58737 4215
1116 4215 25730 43688 42168 21589 -2171 -7939 -18563 -30876 -50162 -64815 -42700 -11470
1104 -11470 -12878 -22068 -1042 -17894 -10379 15390 18470 11464 47997 62968 55102 18351 41381
1091 41381 62810 6313 7933 63090 97190 85768 56051 40422 18926 -3614 -8106 -16612
1079 -16612 -7137 2920 -19100 -5537 -20734 -43521 -7302 12489 19309 32353 3966 -4903
1067 -4903 -10141 2544 30737 51562 45723 17103 -33074 -58804 -53016 -78636 -47705 -48856 -48741
1054 -48741 -31969 -49987 -84345 -65971 -41353 -22451 -32289 -31890 -27366 -26327 -47352 -27701 -19225
1041 -19225 -37345 -31178 -57490 -74817 -76420 -56916 -48994 -9102 9129 -41804 -51881 -32371
1029 -32371 -1138 12353 14868 7466 -5959 7752 20770 45438 31108 45627 32444 28741
1017 28741 41159 42097 64650 59638 53529 953 -562 -9463 -13213 11298 15039 10462 8797 33854
1003 33854 34955 22836 19526 22167 18521 20050 15857 -2354 -32177 -28696 -20681 -46954 -49495 -32693
989 -32693 -38714 -29109 -13173 16295 10690 21887 6949 -18965 -58415 -67285 -39307 8509 25058
976 25058 16132 8103 -18006 -42651 -31016 -37238 -46286 -13005 -1711 -9568 -11953 -10703 -4495 -3467
962 -3467 -16493 2250 39523 37050 41214 12922 26291 32422 36964 17981 10302 45775 21377
949 21377 -1955 -16905 -30877 -47729 -77279 -53761 -38575 -26175 -21767 -7005 -8159 11324
937 11324 25529 36037 22258 10568 29798 39248 15026 8125 -12497 2555 18794 9112 -12179
924 -12179 -45716 -52200 -51819 -3293 16543 25861 65599 57103 10030 553 33767 23955 31812 37574
910 37574 28171 31708 11423 -21681 -24425 -8983 2181 -10430 -174 22014 6562 -11219 514
897 514 8150 21278 45776 68105 49555 38249 6536 -9290 12934 14879 -9800 -43785 -17857
884 -17857 2077 -622 -6021 12960 669 -12208 7565 -2017 -14706 -23566 -39160 -47705 -52143
871 -52143 -58239 -64682 -78924 -63047 -17830 -25910 -23031 -6425 14606 20128 20535 30667 32495 40726
857 40726 5935 -24985 -36171 -27703 -44235 -54198 -27903 213 -12319 -34179 -50413 -52831 -41684
844 -41684 -30961 -11133 -10755 -12786 -8884 -2456 -17017 -32221 -35938 -19317 -6244 -1869 -1472 -5416
830 -5416 -9204 18009 9635 -7422 9044 29525 35453 18230 -13585 -54831 -41987 -33653 -38331
817 -38331 25123 44125 26589 -3423 28499 30480 21890 14412 9088 32648 23726 25580 25091 25008
803 25008 17511 19258 -156 -42894 -32306 -27105 -31693 -33267 -15056 20530 26187 38137 44220
790 44220 30826 -10878 -48718 -40457 -43041 -1908 19353 -7556 -11642 -4165 -20305 -37595 912
777 912 -18890 -21762 -19495 -15795 -21150 -24741 -26295 -43738 -24234 2539 6202 22490 35352 19853
763 19853 17711 27860 31837 8768 -18974 -41615 -16945 22894 43949 1880 -14203 13226
751 13226 -15056 -32418 -3399 46475 75673 84790 60967 29191 -14187 -26464 -17347 -37472
739 -37472 -11703 8393 41798 25969 27602 36448 25729 10895 5885 5124 1833 -36067 -17139
726 -17139 17102 6727 8013 -8758 -11215 2439 -8278 5075 -6254 -31445 -30159 -15240 -2813
713 -2813 25658 27667 55069 87480 77389 28437 23157 45814 65662 63137 28279 9466 54574
700 54574 100622 84123 72469 32895 -5963 -15464 -8846 12418 4351 -8408 7594 8618 11633
687 11633 8492 13026 -8041 -37367 -18434 -22728 -28997 -33157 -8443 1710 -30240 -42799 -69773
674 -69773 -66257 -64501 -64937 -64195 -36867 6436 3218 -3303 -4492 21985 26224 22807 11711 -3249
660 -3249 31497 38662 28545 3915 -6346 -648 -15404 27250 59587 51393 5146 -35175 -20047
647 -20047 -2235 -2700 -15359 -19694 -5908 14478 22387 23817 17340 19245 19520 15402 -24324 -40638
633 -40638 2675 -4841 -23207 -1316 31048 7967 7818 -13612 -19856 -39143 -50696 -37324 -18395
620 -18395 10673 46858 59158 55412 28075 4435 -5979 -1459 25958 -8817 -6945 27044 47157
607 47157 46554 48532 27496 22616 30276 25448 37030 46261 49831 42390 38595 34223 -5223 -17782
593 -17782 -31458 -38825 -18050 9923 37820 18842 6959 10940 -3763 -3636 11291 12639 2090
580 2090 -22036 -37560 -25645 -269 2558 15041 36014 54057 36062 13494 -24022 -11575
568 -11575 5457 -6173 16307 8985 -30115 -17802 -7208 -36599 -80015 -80922 -22555 19163 3011
555 3011 -25602 -27343 -23398 -25685 -33468 -45501 -38501 -22614 -53580 -41591 -22756 -11890 22549
542 22549 29769 10022 19309 -2535 -4333 6296 -908 -1258 -10679 -11509 12488 1599 6937 30406
528 30406 26660 6179 196 -6796 -11669 17776 12605 23024 19735 -19887 -30072 17677 43274
515 43274 49757 25012 5201 5944 5774 7640 -1659 -4873 7988 -34569 -9837 28968 26261 43168
501 43168 15511 -16896 6940 30918 46395 46855 48061 16879 23536 5280 -14619 -52785 -91994
488 -91994 -102980 -65194 -52319 -56538 -64087 -46133 -47892 -59017 -64440 -39198 -19404 -33189 -35469
475 -35469 -34545 -11017 -24176 -28627 18400 21048 -32973 -51121 -35535 -35413 -36205 -34894 6005 2568
461 2568 2893 -3294 -8678 9863 498 -6942 -27912 -48316 -66585 -42316 -11743 -21796 -11566
448 -11566 37036 47925 20733 24168 35228 32083 23517 18834 12163 24539 41557 11493 -20131
435 -20131 -17175 10860 9420 -25872 -28467 16048 8779 280 28779 42318 37637 21183 -4163
422 -4163 -120 -5586 -10710 13513 19821 22579 23523 15496 6489 -4197 -9146 -28744 -26625 -24043 -4281
407 -4281 -10184 -9980 -17366 -10097 -2938 8524 -4675 -564 -4008 -32115 -47186 -18048 8271 3501
393 3501 5415 8330 13020 21524 55417 85583 71429 80445 61553 26806 -2530 13430 18663
380 18663 -10711 1098 14108 -16356 -44204 -52448 -17833 -4486 -6536 -21311 -22147 -13072 -29872
367 -29872 -10557 15684 41550 49885 50206 50032 18503 18957 41113 27418 5380 2697 377 18672
353 18672 26587 37868 50372 55571 15813 -5254 -10387 -35678 -37316 -51540 -43053 7487 4533
340 4533 -6095 24937 38391 24614 -7849 -15156 25737 6086 8174 -176 -30 9110 54784
327 54784 60866 43725 20127 15377 48073 61100 29996 14227 31836 39108 17725 11456 -23432
314 -23432 -36749 -14240 2046 20625 3955 -11886 -3820 -811 -20539 -45502 -31483 -5036
302 -5036 2269 38014 40067 24371 25315 29821 26747 13804 7636 4746 2057 -433 -32974 -25992
288 -25992 -17460 -2008 -35272 -49729 -40412 -39860 -21558 -10060 -14526 -41733 -47369 -32223 -14369
275 -14369 -17647 -10113 -11044 -9056 13342 39163 43723 19961 -3740 -17173 -12827 -38926 -42570 -36924
261 -36924 537 13571 18876 3759 -8752 -26763 -20453 2289 17040 8714 -33250 -62960 -44288
248 -44288 -5791 14133 29201 18028 31316 25405 -704 -19395 -17819 -8878 5107 -6699 -9272
235 -9272 19364 23673 -3595 409 12726 10163 4571 -973 12788 5487 -14341 -11646 -23262 -27027
221 -27027 -40592 -15931 -17253 -30928 4593 18462 12512 -19582 -25842 -28568 -23421 -2521 13554
208 13554 11863 7276 3321 5277 17861 5739 4548 6371 -499 -31444 -14898 -8659 -20747 -42180
194 -42180 -50425 -50023 -61421 -46076 -35834 -29681 -31679 -25148 -15482 -2683 -1644 4002 15874 32203
180 32203 8779 3623 11446 27795 25686 19222 26397 25191 5252 5940 -2382 41405 62217 62614
166 62614 18692 6687 15240 -3653 17656 55666 50695 -3521 -11344 -12793 -6595 -20633 -16057
153 -16057 -14862 3265 14407 4024 14942 -484 -41703 -62144 -37741 -36886 -39401 -28431 -27009
140 -27009 -34611 -30361 -38749 -21475 -20691 -26781 -10934 -21366 -7808 -22624 -38041 -51058 -63649
127 -63649 -66430 -15929 12432 7928 19349 26355 32778 28386 6764 9386 28705 19537 11994 13432
113 13432 -5865 -29588 -31524 -23120 -3269 3279 -9896 -23843 -35634 -24575 -1610 6156 8248
100 8248 1214 16023 11168 -1930 7638 23493 8660 8620 5455 -33196 -52699 -47655 -36090 -17198
86 -17198 -20499 -23859 -22033 7555 48112 51295 44465 40770 28392 12385 8980 -6078 -18567 -27059
72 -27059 -6569 13551 27474 18301 23700 4935 -8921 3436 -7979 -34328 -43637 -36976 -22636
59 -22636 -4327 805 -9272 4260 18444 -14011 -37635 -36322 -16803 13698 20866 40951 33267
46 33267 25934 28444 25122 5203 -19065 -41100 -45364 -54352 -20919 14336 4315 546 19458
33 19458 17455 42585 42468 49967 38558 16128 33197 26793 -2820 668 6263 -20838 -23207 -21964
19 -21964 -37441 -50251 -37819 -39636 -6217 -19913 -24060 -10800 -3149 -253 -2781 -17101 -19661
6 -19661 -8051 -15658 -31680 -10958 8955 10710
0 10710
$$ Imaginary data points
##PAGE= N=2
##DATA TABLE= (X++(I..I)), XYDATA
32767 34216 53458 46771 38214 33911 38187 78358 75720 60261 61177 52102 45187 48265 53924 78928
32753 78928 126291 111230 75464 52050 44910 67176 94850 110661 101827 91904 104048 137166
32741 137166 137506 128073 107671 111068 115970 112331 96945 95262 76613 63702 70538 75369 80344
32728 80344 100016 100819 116219 133342 132040 111657 105800 106698 119777 131615 140088 131386 133785
32715 133785 143809 134890 135090 124717 107603 106071 102742 111322 103573 117855 124233 130880 122008
32702 122008 104478 94459 112755 166677 175247 156285 139510 133655 127984 126003 123025 123543 117189
32689 117189 111815 126734 126123 117208 122325 133120 152886 149188 171326 172011 158421 160915 159079
32676 159079 141603 136826 130186 120435 121065 127882 129533 127145 139238 142709 148430 164291 175497
32663 175497 167785 153731 143562 131730 150188 143372 142517 122955 123294 117505 126956 123175 120919
32650 120919 130610 152737 164714 171940 178062 165352 145993 127787 151275 164421 171499 172469 182672
32637 182672 181159 160344 144624 165909 162138 167714 162684 163148 180599 184451 162695 147118 165237
32624 165237 193565 226793 209198 179848 172871 182568 174879 173925 164099 154906 168823 187562 187382
32611 187382 168233 156739 168774 191579 185355 154926 151158 152190 145205 164355 178438 212440
32599 212440 212471 209439 221514 218163 190982 168906 156938 189098 210417 199178 204679 230456 223949
32586 223949 193134 192616 197971 217107 195265 184660 212666 222458 225355 230942 219642 211122 199885
32573 199885 192243 195444 186944 198945 195119 202992 230731 232611 222355 216192 209276 182333 174883
32560 174883 222168 259055 219714 194079 213698 219226 208171 190365 191234 212417 234653 237001
32548 237001 245949 221054 211288 204480 180852 195392 232807 237620 217433 240438 261580 272213
32536 272213 253866 254854 243637 212653 218057 211964 224516 233441 251098 246311 262031 250231 220439
32523 220439 217911 209438 234390 228838 231808 259368 253883 242909 229485 230872 250501 233170 219214
32510 219214 229631 241622 228393 254418 288107 310843 317106 299351 293547 284604 264500 227063
32498 227063 231513 243334 270984 257787 247015 251379 240947 247418 267772 258702 262316 257104 255098
32485 255098 253085 225080 212976 232253 211462 230022 248359 269470 267597 255790 262150 279894
32473 279894 291461 278413 239751 241309 251599 275812 278384 276608 263113 261574 263224 250097
32461 250097 280560 281907 288045 260272 234272 258768 290819 289652 267274 274915 274193 266624 279377
32448 279377 264216 269308 284609 283763 254449 244178 242500 234754 228584 222078 247599 237704 237093
32435 237093 232706 244554 300887 332461 305323 316648 301621 260723 272385 281513 281813 273542
32423 273542 273953 281286 274655 273152 299282 309007 321548 327519 305526 305394 312028 285051 299504
32410 299504 301730 265494 286425 317065 312693 310709 295896 283372 269551 282702 294468 262470
32398 262470 225089 234926 263305 283414 294717 311389 317711 342356 317838 307820 300648 311273
32386 311273 316355 323695 315735 314640 330828 337364 322424 337696 291642 301714 302107 296578 285794
32373 285794 266430 307202 307318 284111 317499 323605 311500 312488 295423 280017 293572 313719
32361 313719 311442 302007 314461 308808 262153 246844 261856 286614 301890 310936 315146 286351
$$ [...]
##END NTUPLES=NMR SPECTRUM
##END=
