##TITLE=Analysis number 308234
Compound Code tl 00555
Book Reference 350/150
Project Code adrs
Chemist Name chrisr
##JCAMPDX= 6.0         $$ Bruker NMR JCAMP-DX V2.0
##DATA TYPE= NMR SPECTRUM
##DATA CLASS= NTUPLES
##ORIGIN= Bruker BioSpin GmbH
##OWNER= NMR
$$ XWIN-NMR		Version 3.5
$$ Mon May 23 12:54:55 2005 GMT Daylight Time (UT+1h)  MAYBRIDGE\NMR@NMR_250MHZ
##.OBSERVE FREQUENCY= 250.131544655141
##.OBSERVE NUCLEUS= ^1H
##.ACQUISITION MODE= SIMULTANEOUS (DQD)
##.ACQUISITION SCHEME= undefined
##.AVERAGES= 16
##.DIGITISER RES= 18
##SPECTROMETER/DATA SYSTEM= dpx250
##.PULSE SEQUENCE= zg30
##.SOLVENT NAME= DMSO
##.SHIFT REFERENCE= (INTERNAL, DMSO, 0, 16.522)
##AUDIT TRAIL= $$ (NUMBER, WHEN, WHO, WHERE, WHAT)
$$ ##TITLE= Audit trail, XWIN-NMR		Version 3.5
$$ ##JCAMPDX= 5.01
$$ ##ORIGIN= Bruker BioSpin GmbH
$$ ##OWNER= NMR
$$ C:\u/data/dgb/nmr/ADRS/3290/pdata/1/auditp.txt
$$ ##AUDIT TRAIL=  $$ (NUMBER, WHEN, WHO, WHERE, WHAT)
(   1,<2005-05-23 12:54:35.12 +100>,<MAYBRIDGE\NMR>,<NMR_250MHZ>,
      <created by zg, POWCHK disabled, PULCHK disabled
       configuration hash MD5:
       62 19 C7 07 E1 42 D1 B7 37 6C 3D D0 77 39 F9 E6
       data hash MD5: 64K
       BC 3E B6 C5 83 41 18 BC B9 FF 18 54 A4 BE E8 19>)
(   2,<2005-05-23 12:54:46.09 +100>,<MAYBRIDGE\NMR>,<NMR_250MHZ>,
      <Start of raw data processing
       ef LB = 0.3 FT_mod = 6 PKNL = 1 SI = 32K 
       data hash MD5: 32K
       85 C3 33 F6 20 0F BC 91 B7 89 12 0B 9B 1C C5 50>)
(   3,<2005-05-23 12:54:47.68 +100>,<MAYBRIDGE\NMR>,<NMR_250MHZ>,
      <apk 
       data hash MD5: 32K
       15 B7 88 DA FF 75 82 AE 9D 70 75 AB EB 05 87 43>)
(   4,<2005-05-23 12:54:48.38 +100>,<MAYBRIDGE\NMR>,<NMR_250MHZ>,
      <abs ABSG = 5 
       data hash MD5: 32K
       79 A4 7F 91 B5 E6 68 66 22 F1 62 32 07 54 E1 C1>)
$$ ##END=
$$ 
$$ hash MD5
$$ 88 9D 4E 66 63 74 4A 8B C7 E9 87 85 71 3E 63 02
##$RELAX= 
##$RELAX= 
##$RELAX= 
##$RELAX= 
##$RELAX= 
##$RELAX= 
##$RELAX= 
$$ Bruker specific parameters
$$ --------------------------
##$DU= <C:\u>
##$EXPNO= 3290
##$NAME= <ADRS>
##$PROCNO= 1
##$TYPE= <nmr>
##$USER= <dgb>
##$AMP= (0..31)
100 100 100 100 100 100 100 100 100 100 100 100 100 100 100 100 100 100 
100 100 100 100 100 100 100 100 100 100 100 100 100 100 
##$AQSEQ= 0
##$AQ_mod= 3
##$AUNM= <au_zg>
##$AUTOPOS= <29 >
##$BF1= 250.13
##$BF2= 250.13
##$BF3= 250.13
##$BF4= 250.13
##$BF5= 500.13
##$BF6= 500.13
##$BF7= 500.13
##$BF8= 500.13
##$BYTORDA= 1
##$CFDGTYP= 0
##$CFRGTYP= 5
##$CHEMSTR= <none>
##$CNST= (0..31)
1 1 145 1 1 1 1 1 1 1 1 1 1 1 1 1 1 1 1 1 1 1 1 1 1 1 1 1 1 1 1 1 
##$CPDPRG= <>
##$CPDPRG1= <>
##$CPDPRG2= <>
##$CPDPRG3= <>
##$CPDPRG4= <mlev>
##$CPDPRG5= <mlev>
##$CPDPRG6= <mlev>
##$CPDPRG7= <mlev>
##$CPDPRG8= <mlev>
##$CPDPRGB= <>
##$CPDPRGT= <>
##$D= (0..31)
0 1 0 0 0 0 0 0 0 0.06 0 0 0 0 0 0 0.0002 0 0 0 0 0 0 0 0 0 0 0 0 0 0 
0 
##$DATE= 1116849274
##$DBL= (0..7)
120 120 120 120 120 120 120 120 
##$DBP= (0..7)
150 150 150 150 150 150 150 150 
##$DBP07= 0
##$DBPNAM0= <>
##$DBPNAM1= <>
$$ [...]
##$SUBNAM6= <"">
##$SUBNAM7= <"">
##$SUBNAM8= <"">
##$SUBNAM9= <"">
##$SW= 20.6930455092707
##$SWIBOX= (0..15)
0 0 3 0 0 0 0 0 0 0 0 0 0 0 0 0 
##$SW_h= 5175.983436853
##$TD= 65536
##$TD0= 1
##$TE= 295.16
##$TE2= 300
##$TE3= 300
##$TEG= 300
##$TL= (0..7)
0 120 120 120 120 120 120 120 
##$TP= (0..7)
150 150 150 150 150 150 150 150 
##$TP07= 0
##$TPNAME0= <>
##$TPNAME1= <>
##$TPNAME2= <>
##$TPNAME3= <>
##$TPNAME4= <>
##$TPNAME5= <>
##$TPNAME6= <>
##$TPNAME7= <>
##$TPOAL= (0..7)
0.5 0.5 0.5 0.5 0.5 0.5 0.5 0.5 
##$TPOFFS= (0..7)
0 0 0 0 0 0 0 0 
##$TUNHIN= 0
##$TUNHOUT= 0
##$TUNXOUT= 0
##$USERA1= <user>
##$USERA2= <user>
##$USERA3= <user>
##$USERA4= <user>
##$USERA5= <user>
##$V9= 5
##$VALIST= <valist>
##$VCLIST= <CCCCCCCCCCCCCCC>
##$VD= 0
##$VDLIST= <DDDDDDDDDDDDDDD>
##$VPLIST= <PPPPPPPPPPPPPPP>
##$VTLIST= <TTTTTTTTTTTTTTT>
##$WBST= 1024
##$WBSW= 4
##$XGAIN= (0..3)
0 0 0 0 
##$XL= 0
##$YL= 0
##$YMAX_a= 239758
##$YMIN_a= -329159
##$ZGOPTNS= <>
##$ZL1= 120
##$ZL2= 120
##$ZL3= 120
##$ZL4= 120
##$ABSF1= 16.522
##$ABSF2= -4.171173
##$ABSG= 5
##$ABSL= 3
##$ALPHA= 0
##$AQORDER= 0
##$ASSFAC= 0
##$ASSFACI= 0
##$ASSFACX= 0
##$ASSWID= 0
##$AUNMP= <proc_1d>
##$AZFE= 0.1
##$AZFW= 0.1
##$BCFW= 0
##$BC_mod= 0
##$BYTORDP= 0
##$COROFFS= 0
##$CY= 12.5
##$DATMOD= 1
##$DC= 0
##$DFILT= <>
##$DTYPP= 0
##$F1P= 14.0000005364418
##$F2P= -0.99999901652339
##$FCOR= 0.5
##$FTSIZE= 32768
##$FT_mod= 6
##$GAMMA= 0
##$GB= 0
##$INTBC= 1
##$INTSCL= 1
##$ISEN= 128
##$LB= 0.3
##$LEV0= 0
##$LPBIN= 0
##$MAXI= 10000
##$MC2= 0
##$MEAN= 0
##$ME_mod= 0
##$MI= 0
##$NCOEF= 0
##$NC_proc= -4
##$NLEV= 6
##$NOISF1= 0
##$NOISF2= 0
##$NSP= 0
##$NTH_PI= 0
##$NZP= 0
##$OFFSET= 16.522
##$PC= 1
##$PHC0= -73.74263
##$PHC1= 0
##$PH_mod= 1
##$PKNL= yes
##$PPARMOD= 0
##$PSCAL= 4
##$PSIGN= 0
##$REVERSE= no
##$SF= 250.13
##$SI= 32768
##$SIGF1= 0
##$SIGF2= 0
##$SINO= 400
##$SIOLD= 32768
##$SREGLST= <1H.DMSO>
##$SSB= 0
##$STSI= 32768
##$STSR= 0
##$SW_p= 5175.98343685301
##$SYMM= 0
##$S_DEV= 0
##$TDeff= 65536
##$TDoff= 0
##$TI= <Analysis number 999999
Compound Code 99
Book Reference 9
Project Code 9>
##$TILT= no
##$TM1= 0
##$TM2= 0
##$TOPLEV= 0
##$USERP1= <user>
##$USERP2= <user>
##$USERP3= <user>
##$USERP4= <user>
##$USERP5= <user>
##$WDW= 1
##$XDIM= 32768
##$YMAX_p= 369432417
##$YMIN_p= -463956
$$ End of Bruker specific parameters
$$ ---------------------------------
##NTUPLES= NMR SPECTRUM
##VAR_NAME=  FREQUENCY,     SPECTRUM/REAL,   SPECTRUM/IMAG
##SYMBOL=    X,             R,               I
##VAR_TYPE=  INDEPENDENT,   DEPENDENT,       DEPENDENT
##VAR_FORM=  AFFN,          ASDF,            ASDF
##VAR_DIM=   32768,         32768,           32768
##UNITS=     HZ,            ARBITRARY UNITS, ARBITRARY UNITS
##FACTOR=    0.157963299565203, 1,           1
##FIRST=     4132.6476996994, 0,             0
##LAST=      -1043.33573715361, 0,           0
##MIN=       -1043.33573715361, -463956,     0
##MAX=       4132.6476996994, 369432417,     0
$$ Real data points
##PAGE= N=1
##DATA TABLE= (X++(R..R)), XYDATA
$$ [...]
15473b9082m3283k9312J2932N3167N8116o9908p7500K2237L6388j5774Q5063K3123
15461B6167q0023n5360M0087P2960J0228m4333j06013j7087N5740R9469r349j7330
15449b4844N3867R0845J3380k7117l8548J02N1413R3752N3709k7013j72903n5635
15437A1008M881j9294l1293M6558Q4555l4109j28569r6129R9654Q1915l1737j34032
15425a46592L9472j3163M3617L648N5859j9583O3626L5691k9361j364N5766J08384
15413A96000p0973j30405q076k2600l4341N6613L3464O747r034p3813q1145K8066
15401a09497M9460M8007N2307n0807K0340j3136p3264l6637N4014k7369l889O354
15389h4117m0674m3910O3424K0288L8976k7086P2639j00521p2083L0367J5496
$$ y = [-29082, -72365, -101677, -88745, -35578, 22538, -47370, -124870, -102633, -66245, -82019, 3044, 26167, -53856, -109216, -69129, 3831, 14059, -30274, -136287, -153374, -97634, 1835, -7514, -24844, 29023, 119868, 133248, 106131, 67583, 67685, 119098, 212850, 266559, 239546, 66643, 11008, 15889, -3405, -34698, 11860, 96415, 62306, -66263, -162392, -62738, 19177, -12560, -146592, -107120, -120283, -76666, -73018, -17159, -36742, 26884, 62575, 33214, 31850, 87616, 196000, 125027, -5378, -13454, -36054, -70395, -13782, 19682, 26429, 17395, -56418, -137563, -109497, -60037, -12030, 40277, -10530, 9810, -3326, -76590, -113227, -59213, -86582, -90471, -84117, -124791, -168701, -105277, -84989, -46013, -73099, -460, -100981, -173064, -142697, -127201]
15378a27201Q4821R1638L7973L1450q1575j69484l4539J9596N3150L0195N8702
15367e274l7290L2181L4323j17736L8128l7871p4784R2737L3274n3063N2641J52175
15355A09441J24663o6106p0088r0958P186L8891J20248k6819q6744o0947p0369
15344g1602r364P9679L0698q2018j9402M4734q9047j8219J4954m6291J6263L1980
15332a17635M9388N2598k5333k5667q7129k2796K8423l2279m8474j1082L1543
15321b08443O6122J47682J38319m7912j22418J4423J7115l6615O9201J06355j02
15310A43727l4327n1302j42935q7232K7277J39038N6740k2036o6839n0143N2412
15299c5620M1808j49752j8897N4372p106N4236Q7227l6747l9846k0881k780j22908
$$ y = [-127201, -42380, 49258, 87231, 118681, 37106, -132378, -166917, -147321, -94171, -63976, -5274, -42564, -10383, 23940, -93796, -55668, -93539, -168323, -75586, -42312, -95375, -42734, 109441, 234104, 167998, 97910, 6952, 14138, 53029, 173277, 146458, 59714, -1233, -71602, -80966, -1287, 29411, -52607, -72009, -27275, -116322, -134541, -119587, -165878, -149615, -117635, -68247, -15649, -40982, -66649, -153778, -176574, -148151, -180430, -228904, -239986, -208443, -142321, 5361, 143680, 95768, -26650, -12227, 4888, -31727, 37474, 143829, 143727, 109400, 58098, -84837, -172069, -144792, -5754, 50986, 28950, -37889, -88032, -35620, 6188, -143564, -162461, -108089, -115195, -60959, 26268, -10479, -50325, -71206, -73986, -196894]
15287a96894J4852J62070L8202l3747r8785n861m4029m2441k1965L6478m0469
15276b32589O7349O3251L9097M8545m8274K1309j4943q586R6428l1209O6345q5427
15264a8704O001K6649j67857n4740p637Q6422L8790r2913L0958P9955J30267M3506
15252A00697L0969n7530p452j14469j19395q760J10158J30069L714j00999J2808
15241b0190J3729m3315P4768r6929j2272R881p1033k8663J04947N6748m3046J03588
15229D8213M0057j12743o629r017N5753J6403J1989K9174n6009j10473M2438n6808
15217a07652q6066J11408r958L9446j28477j6379m6800L1752R0302k1193Q836
15206a34781R5873L0849N7776n4382k0902N8137M6606q1300l3628q4779n4912
$$ y = [-196894, -182042, -19972, 18230, -15517, -114302, -120163, -164192, -206633, -228598, -192120, -232589, -165240, -101989, -62892, -14347, -62621, -41312, -56255, -64841, 31587, 378, 66723, -18704, -12703, 13946, -153911, -208651, -216288, -129866, -91076, -183989, -153031, -73076, 57191, 100697, 131666, 74136, 66684, -47785, -167180, -175940, -65782, 64287, 68001, -32998, -20190, -6461, -49776, 24992, -71937, -84209, -74328, -145361, -174024, -69077, -12329, -55375, 48213, 88270, -24473, -31102, -40119, 15634, 32037, 44026, 73200, 17191, -93282, -50844, -107652, -193718, -82310, -92268, -52822, -181299, -197678, -244478, -212726, -122424, -143617, -134781, -38908, -8059, 49717, -4665, -25567, 32570, 79176, -2124, -35752, -120531, -175443]
15195a75443J7581N5604R3411p996O7501K2079m6747o6186r2340O0290J01184
15184B8938k4171r2545N7389j6555k6430L3275N9866q2236q2374R5429N1987L5372
15172C7945j8550l270L2762p949p2554M8174k6269r4150n4355j02019J735J70656
15160h7844M8844p3490o34L1292P274q424J9785N148K0337m4905j5422P6255O6687
15147D4903M697k1390j02550O5168O8051o326K3979j15621m071L1123J04061N3663
15135A45687l4690l2840r7668n8605o778K3707K8805o3903n4424m7574o5399K03382
15123f0300N1668o1495n1853j5963k7056M9874m665P7782Q4533j12756K6668J12583
15111F9020M9406m4404n9029j10095J2814N6734O8751l0117k3856L5747p3018
$$ y = [-175443, -157862, -102258, -8847, -16843, 50658, 72737, 25990, -40196, -132536, -72246, 28938, 4767, -87778, -30389, -46944, -73374, -40099, 19767, -62469, -144843, -49414, 2573, 37945, 19395, 16125, 48887, 40938, -31616, 16558, -9711, -103861, -158216, -260235, -258500, -87844, -39000, -112490, -113124, -81832, -74558, -82982, -63197, -58049, -37712, -82617, -98039, -21784, 44903, 49600, 28210, -74340, -9172, 58879, 52553, 76532, -39089, -43160, -12037, 92024, 145687, 110997, 78157, -19511, -78116, -84894, -61187, -32382, -96285, -150709, -198283, -263682, -60300, -8632, -70127, -121980, -137943, -164999, -115125, -119790, -42008, 42525, -70231, -43563, 69020, 118426, 74022, 14993, -95102, -82288, -25554, 43197, 13080, -10776, 24971, -48047]
15100d8047o1908J2981Q8707n7831l5822N9496J6559m4088m3694K0293k0821k4545
15088a38720R6603Q9495L9466J5942j54227j19495m6851n976P9194J59529O8625
15077H3585N3158n123Q1451K8802l4688m3626l5441j52112o9943N2690O4714n2360
15065b8893k9032M2615L9843m7081N3671P9265k6871O2366q7839m1527K0288M5210
15053H2015J01956M5691K2134P008p1728j69586j04971j05523O3937k951K4834
15042a07184P832J4711M5866M6089n0623n0560K1342n1920l7501m8821m1064N4627
15030a97206J19618O9724O010j2250L9532J1443l3954O0494R582p0475J6977k591
15018A6904N759j13102o9293J742Q2961K0536P253o5055K472k7538n5377J4782
$$ y = [-48047, -109955, -96974, -8267, -66098, -101920, -42424, -25865, -69953, -113647, -93354, -114175, -138720, -42117, 47378, 86844, 102786, -51441, -170936, -217787, -223763, -144569, 14960, 83585, 136743, 131620, 213071, 241873, 207185, 163559, 128118, -23994, -93937, -41247, 23467, -28893, -57925, -15310, 24533, -22548, 31123, 110388, 83517, 145883, 58044, 16517, 36805, 82015, 183971, 229662, 251796, 258804, 187076, 17490, -87481, -193004, -129067, -132018, -107184, -99352, -84641, -38775, 7314, -43309, -93869, -72527, -124447, -161948, -210769, -251833, -197206, -77588, -7864, -1854, -14104, 25428, 36871, 2917, 63411, 72993, 2518, 19495, 16904, 22663, -90439, -159732, -157990, -75029, -54493, -47240, -112295, -109823, -137361, -192738, -177956]
15006a77956Q3708N2125M0558k3221J8825j14344l2120L1211l542l49R1629J467
14994c2009q0716j21755P6470P0603J20922j814L0237j7344l1665K813l2439J4575
14982b122k5952o4570M9188J9081J18062m7698J9143J8715n5156m0018o1932K279
14970g0980J05900q0187J40576N0196J1950j19328j8879n387K9334K7709L0767
14959A01671L2149Q0016p4364r1060l5242J9451N3207o9326Q9474J02239q5855
14948A22360j13859o8399K2662p171k0607O9498J5664k3888O2432J5995J702r5026
14936a8637J48M3672L1197k5216l4382J392K0631P8461O2111N784p3150j5961
14924G6050L9912l6225k6969K3641N8329m6917k14969j00914j3733j3762P7968
$$ y = [-177956, -94248, -42123, -1565, -24786, -5961, -120305, -152425, -121214, -124756, -125105, -33476, -32009, -112725, -234480, -158010, -87407, 33515, 31701, 61938, 44594, 12929, 15742, -16697, -2122, -28074, -92644, -43456, -24375, 93687, 45989, 65132, 83847, 28691, -11327, -73259, -70980, 34920, -45267, 95309, 145505, 157455, 38127, 19248, 13861, 43195, 70904, 101671, 133820, 213836, 139472, 48412, 13170, 32621, 85828, 16502, 105976, 208215, 122360, 8501, -59898, -37236, -44407, -65014, 4484, 20148, -3740, 58692, 74687, 76389, -18637, -18489, 25183, 56380, 31164, -3218, -1826, 18805, 97266, 159377, 165161, 92011, 76050, 115962, 79737, 52768, 76409, 134738, 87821, -127148, -228062, -241795, -255557, -177589]
14913a77589m4506m4326P6618J07880q409P1935O0604N1620r115r951n6720j1206
14901F835J3552j24291o2787N5985M9023p947k0852M118l3257J0077J9821K8046
14889f1677j6323n422j2597N781L9117J10537N8430O3914j77411l9214J2778J6156
14877e931k8995J0954L781L4743m696L400J38408J08165l4985j30723j24969m218
14865c5066J4812k9903n7535p9849J2049Q8603J26409L9008O6462k0536j0243
14854A14211l4728r9867j03861N9629O2425J719m6804K2082J5549L8087o2225
14843c3783p3142r7140m2224O7435J04843O869k0042O3821n5434k254N2527Q932
14831a9592m8155o8883m6838M77N2340O2369k5086o476p655O1545L1062K8466
$$ y = [-177589, -222095, -266421, -189803, -81923, -90332, -18397, 42207, 93827, 84712, 74761, 18041, 6835, 20387, -103904, -166691, -110706, -61683, -69630, -90482, -86364, -119621, -109544, -89723, -61677, -78000, -83422, -96019, -90238, -51121, 59416, 117846, 181760, 4349, -34865, -22087, -5931, -34926, -23972, -20191, 14552, 9856, 13256, 151664, 259829, 224844, 94121, -30848, -35066, -20254, -50157, -107692, -187541, -175492, -86889, 39520, 78528, 144990, 124454, 114211, 79483, -20384, -124245, -64616, -2191, -472, -47276, -25194, -9645, 28442, -33783, -106925, -204065, -246289, -178854, -74011, -67142, -87184, -23363, -78797, -81051, -28524, -19592, -67747, -136630, -183468, -182991, -130651, -68282, -93368, -99844, -107499, -45954, -14892, 13574]
14819A3574p9049j29849J3697L0219J9422n7108R2186O5047N5944J0638j7951
14808A6770j4185m7898N2554j5087k7083K3893P8380N2272n1544m6778j3503j0307
14796b516M0857J4105n2495k9901O1968P954r2562r4617R302J8112K7630o7552
14784a59715j33215P2473N0211L2067J19918J09795M3977q4443j64157p349J4375
14773a06063r7878m2599p6071N4657J63786r04l8030j9833J8012j0521K7991J14434
14761a3019m8993j7021R665o7499k6703J1714Q0570K2428O682r477o995o4958
14749a23606k7037L7604J09156K9418M939K9742m650O024P223N8819J4097L1565
14737A73294q1981p8461J2017L5887P2453k7305j33998r4913M3686P2053O6204
$$ y = [13574, -65475, -195324, -181627, -151408, -131986, -189094, -96908, -31861, 24083, 34721, 16770, 2585, -45313, 7241, -7846, -34929, -11036, 67344, 119616, 68072, 21294, 7791, -2516, 38341, 52446, -49, -29950, 32018, 39972, -52590, -147207, -137905, -119793, -92163, -159715, -292930, -220457, -170246, -138179, -18261, 91534, 135511, 51068, -113089, -120438, -106063, -203941, -246540, -322611, -267954, -104168, -105072, -143102, -162935, -144923, -155444, -127453, -13019, -62012, -79033, -69368, -136867, -163570, -151856, -71286, -48858, -42176, -51653, -58648, -123606, -150643, -113039, -3883, 25535, 30474, 60216, 55566, 61590, 68813, 127632, 141729, 173294, 91313, 12852, 24869, 60756, 133209, 105904, -28094, -123007, -79321, -7268, 58936]
14726E8936r6189J5409j9403O0476n2509n5163j522j7540k5632O9687q655m7917
14714a20022n0585J24649K6439j5736n2920L2591o090l3393M6941k5645J20154
14703D6383J7547m6606j03828J36893M4261j02111o893N6441K1404M233J1436
14692G9160j3446j0269q851j69820j07813R6847R3617j8609p719L6434l9168l5100
14680a04737j2386L3563M4025n4456m7130n5318q0813P2168J12960R1533k3325
14669b3916j32140L5551M592r2934J0688J0432Q4234l2928p1895l2539J08736
14658a32119J14738J0426J5015n0239p9581Q633N2405M22M6554J4759M4146r1219
14646d6060o3546k3373M1975N2456j2747N9637N6050o1934j09914L1442L5565
$$ y = [58936, -37253, -21844, -41247, 19229, -33280, -88443, -89965, -107505, -133137, -63450, -72105, -120022, -170607, -45958, -19519, -35255, -88175, -55584, -61674, -95067, -48126, -73771, 46383, 63930, 17324, -86504, 50389, 94650, -7461, -14354, 42087, 63491, 67724, 79160, 65714, 55445, 46594, -123226, -231039, -134192, -40575, -59184, -66903, -30469, -69637, -104737, -117123, -83560, -39535, -93991, -141121, -196439, -277252, -205084, -92124, -591, -23916, -156056, -120505, -115913, -208847, -198159, -187727, -103493, -136421, -208316, -240855, -132119, -17381, -6955, 8060, -42179, -121760, -113127, -60722, -60300, -13746, 1013, 45159, -46060, -109606, -132979, -91004, -38548, -51295, 8342, 64392, 2458, -107456, -76014, -40449]
14635d0449N9971Q892q9436O069M833o044k197r8104n1974R9097J16982J00817
14623A08457j25034k9278N4582r7561o1613P2046O5629n1490m8953J0382M1773
14612f1060l9918j13915n1486J53012P0727p8522J2564R7852Q300J11880m9238
14601F0196r9310J5959n964K4786M3985J5899p9845j57194m5548l4004M0427M8508
14589a72105J2296R9154R9745K1639r4922p8575l5427K7287L5405l7086K7346
14578i5243R2602O5375j47727L0861N6137J5432k8482n2854o556J3823L4767M2780
14566B0915n2852r8336N5697L7913J05894l3369r8056P488L302M510K4442K4866
14554B414l2801m928j5108j153k5809L2554K7542o1944o1072p8750J50031N2611
$$ y = [-40449, 19522, 28414, -61022, -54953, -50120, -56164, -58361, -156465, -208439, -109342, 7640, 108457, -16577, -45855, 8727, -88834, -150447, -78401, -12772, -64262, -113215, -102833, -61060, -100978, -214893, -266379, -113367, -42640, -121162, -108598, -10746, -2446, 109434, 60196, -39114, -23155, -29119, -4333, 39652, 55551, -24294, -181488, -227036, -261040, -220613, -172105, -159809, -60655, 39090, 60729, -34193, -112768, -148195, -120908, -85503, -122589, -95243, -2641, 62734, -84993, -54132, 2005, 17437, -11045, -63899, -70455, -56632, -21865, 20915, -31937, -130273, -74576, -36663, 69231, 35862, -62194, -54706, -51404, -46894, -22452, 2414, -30387, -35315, -50423, -51576, -77385, -44831, -17289, -79233, -140305, -219055, -69024, -16413]
14542a6413n8139J04660r2448M0213M5820j3567K8294l2023j5498N4403n1340
14531f038k2791P1807p7289n1685j0420L5172n108j33407j75108Q9056P3073n92
14519b13330j8173J18513Q6395M3771J31655l9231q8096j06569o4103n4741N6543
14508a47366N5652L1747l7771j20857R3333o6880j8970L2637J21101o375l3459
14497i7208N9217L859Q1999N8507J4967j6546q8727l9354L0800R104j4708J3745
14485A5655p2281J957l6635K9740J22811n2554r0791j40714P729J35749p335m402
14473i1071J9432m6445l9500N4236O9128P4401r740J6927J26081J6579r7462p3124
14461A9442o7616n4037q4111l1575N4429Q1464k8714j0298l0228r973l6602k0576
$$ y = [-16413, -74552, 30108, -62340, -22127, 23693, 10126, 38420, 6397, -9101, 45302, -6038, -28829, 42978, -34311, -85996, -96416, -61244, -66352, -199759, -374867, -285811, -212738, -213330, -231503, -112990, -26595, 17176, 148831, 109600, 21504, -85065, -149168, -203909, -147366, -91714, -59967, -97738, -218595, -125262, -192142, -211112, -178475, -57374, -63749, -97208, -37991, -34132, 47867, 106374, 121341, 104795, 16068, -23286, 7514, 16618, 1910, 15655, -56626, -54669, -91304, -61564, 61247, 8693, -82098, -222812, -215083, -79334, -86669, -91071, -71639, -118084, -157584, -103348, -34220, 40181, 30441, 47368, 173449, 190028, 92566, 19442, -48174, -102211, -186322, -217897, -163468, -82004, -110718, -121016, -151244, -161217, -197819, -218395]
14449b18395Q0804Q9516P5897l2140j02012N5449R137O0243n1033n9969l6365
14438a28868L8800k338r155K3760O3697P4933N8275R6371n3948j06544l4994l023
14426A6966o7165k06138p2480J1692Q0811M2812L3903N1166O2188M7056k6413
14415b5602n7918k9818J05815J0980M3270n168l7580k0338o3188m1563k0516k3229
14403a64855j419K325P6924O258q8968R0486N0534Q739k2314P5804j0535o6787
14391d3808p5665K6671P6381O9293p7868q7271r7555L8243M2561K0111j8700M6373
14379h1234N0832q499j05103m1923J18142q395o2079l917o0568L0211M0039k6225
14367a58719L7868l4953k6556o323R6945J08830R7363j07448l8253j713M3987
$$ y = [-218395, -137591, -48075, 27822, -4318, -106330, -50881, -41744, 18499, -32534, -92503, -128868, -90068, -92406, -101561, -77801, -14104, 60829, 119104, 215475, 161527, 54983, 19989, 16966, -50199, -256337, -328817, -317125, -236314, -193502, -159599, -108433, -46245, 811, -25602, -83520, -113338, -7523, 3457, 46727, 41559, 3979, -16359, -79547, -121110, -141626, -164855, -166274, -163949, -87025, -80767, -169735, -79249, -28715, -19976, -42290, 33514, 22979, -43808, -119473, -92802, -16421, 52872, -24996, -112267, -209822, -171579, -129018, -108907, -127607, -81234, -30402, -38901, -144004, -185927, -67785, -76180, -138259, -142176, -202744, -172533, -132494, -158719, -120851, -155804, -182360, -188683, -91738, 17092, 114455, 7007, -31246, -32959, 11028]
14356A1028N6832m4668J4557n5449n2644p7672l4498J9879N4853P2284N0871M4232
14344E9605n9207j75519K2095O5397O7160m7826q4953j2694p310M3460N2250P7949
14332D07n1795q4509N5879n2059M3408q546O0456j4335Q8960k6183k6148L6709
14320B2244j0277j28459O2619k3086r1343l2682M904O7592K0071O5987q591l7467
14308h8488J4312L2242n4045J3494O7379Q556j29499N378P5990J098q7054l5720
14296a76357N0046L1199p377M9939m3970j3216N8732M2092j2502o7846j3343J2303
14284i0300n6145J1265N9816l2404N427K9162K9610N5395L7990q9801o6384j3023
14272a19392k0781M5955J60616K380j03776o9720p3839l4713n62R4987P1613J6453
$$ y = [11028, 67860, 23192, 37749, -17700, -70344, -148016, -182514, -162635, -107782, -35498, 15373, 59605, 398, -175121, -153026, -87629, -20469, -68295, -153248, -165942, -173252, -129792, -77542, 407, -51388, -135897, -80018, -132077, -88669, -97215, -36759, -51094, 37866, 11683, -14465, 22244, 11967, -116492, -53873, -76959, -168302, -200984, -196080, -128488, -108417, -42430, -51021, -88488, -74176, -41934, -95979, -82485, -15106, -6550, -136049, -130671, -54681, -53583, -140637, -176357, -126311, -95112, -102489, -52550, -96520, -109736, -51004, -8912, -21414, -89260, -102603, -90300, -146445, -135180, -75364, -107768, -102341, -73179, -43569, 11826, 49816, -39985, -106369, -119392, -140173, -94218, 66398, 68778, -34998, -104718, -178557, -213270, -213832, -118845, -47232, -30779]
14260c0779K4098J6940Q748j728M891l1107l863j01003J49591J62242m0844n7516
14248I9670l5552l8296j45578N849O8789o493k9471Q2998o403M6234L5336m8119
14236B8964l5142L6767O3179j24702k7626N8880L0648K7912j34462l8448P8348
14225c5682J64399M1261n9791L4643L9882m794Q0090l0687j55238M5274j8482
14214A00875p2063j2545L8580p7891p1662n363P1131k0911K1645p1141m4551q367
14202a52263R642m6845J01345M8556K5742k8974o4150K9298q635Q4474k0446J1902
14190a0354Q2891J8224q266j14780m3722N6986N934N8325N0329r2041M4911O7900
14178A16337q9985j42826M168Q4381o1721N4871K4717R953p1433m2842N6457R5574
$$ y = [-30779, -6681, 10259, 19007, 17279, 22170, -8937, -12800, -113803, 35788, 198030, 157186, 99670, 64118, 25822, -119756, -113907, -45118, -51611, -81082, 1916, -4487, 41747, 77083, 28964, -6178, 30589, 93768, -30934, -58560, 320, 30968, 58880, -75582, -114030, -35682, 128717, 169978, 110187, 144830, 184712, 179918, 260008, 229321, 74083, 119357, 100875, 28812, 16267, 54847, -23044, -94706, -100069, -28938, -49849, -28204, -99345, -143896, -152263, -142621, -189466, -88121, -39565, -13823, -42797, -106947, -77649, -86284, -1810, -22256, -10354, 72537, 90761, 82495, -32285, -76007, -19021, -13087, 45238, 95567, 3526, 48437, 116337, 26352, -116474, -112306, -27925, -89646, -34775, -10058, -105, -71538, -114380, -57923, 37651]
14166C7651k6161r0533R763J2220J1468J892o1867Q8649L25j49543j2883O3247
14154a15772P3157L8739M6829L0404j4827m9932j3934L9969O0621l7970q1654
14143b4370j938n5908k6812K1329l2133N8827J18641J5734m8617l3890o2320j9772
14131i1229L8416K8999j6984N5747j2742q8367o3006O2567P6332J38728J22147
14120B50608l1647j38922r9559r7015q1224o4905L6089M5821L8060O0312L9059
14109d3323m2130K0659k4901N551L8637q6578Q658K9768l7239l104O3709N6283
14097a4010k8439m7524k0182J5204O2846k164k6817J7364M1744l2957q0639o5132
14085a80706k0754p3169k1526m7881J2199O4110R6968J34232l1345k146L2059
$$ y = [37651, 11490, -79043, -69280, -57060, -45592, -43700, -105567, -16918, -16593, -166136, -179019, -115772, -42615, -3876, 42953, 73357, 58530, 8598, -5336, 34633, 95254, 57284, -24370, -26308, -82216, -109028, -87699, -119832, -61005, 57636, 73370, 24753, -9137, -71457, -91229, -52813, -23814, -40798, 14949, 2207, -86160, -149166, -86599, -10267, 128461, 250608, 218961, 80039, -19520, -116535, -197759, -262664, -226575, -180754, -142694, -82382, -43323, -85453, -64794, -89695, -84144, -45507, -132085, -123427, -93659, -130898, -134002, -70293, -14010, -42449, -89973, -110155, -94951, -32105, -34269, -61086, -43722, -1978, -34935, -115574, -180706, -201460, -274629, -296155, -344036, -331837, -267727, -170759, -36527, -67872, -70018, -37959]
14074c7959O8075K5745q3720K3429Q1103R1100j05671J773P0843p3621p2856k0937
14062c2696o4511m6490R8289M5694o822n0178Q16J6745L3792k2082R243j4527
14050c2727m5977j9045q022m0875O3322N299o4839J5391N1816K1928K2528o1338
14038i2539j6528k4259l980N1874L1250r948n4753N7951K6752K1894j9971k6215
14026e8472r0456p980J3905L1959J16907O6937J2346r1121j6294j0347l4134N6989
14014i761P5460n7406j60192j47034J4435J10127q397L8114N8133r5195n97n2319
14002b34632k8263N2233Q048k4741J505N7057k1035N7167L2320J37530L5613p5398
13990b596l4482j9318k6073K6638l2822m2448R3151L7384r5132O798N7946l8649
$$ y = [-37959, 30116, 55861, -27859, -4430, 76673, 167773, 62102, 63875, 134718, 61097, -11759, -32696, -97207, -143697, -45408, 286, -6536, -56714, -55898, -39153, -5361, -27443, -18200, -32727, -78704, -97749, -105771, -146646, -83324, -78025, -142864, -127473, -75657, -53729, -31201, -92539, -109067, -133326, -137306, -85432, -54182, -64130, -118883, -60932, -34180, -12286, -32257, -58472, -148928, -156908, -143003, -111044, 5863, 72800, 85146, -5975, -22269, -32616, -66750, -9761, 65699, 8293, -151899, -298933, -284498, -174371, -182768, -144654, -86521, -181716, -182313, -234632, -262895, -210662, -202614, -227355, -225850, -168793, -189828, -132661, -100341, 37189, 72802, -2596, -37078, -56396, -82469, -55831, -88653, -131101, -37950, -566, -95698, -88900, -30954, -69603]
13978f9603j10371Q8811J0029q942j7529M1756O0420m809l6233j9115m991O374
13966f4203Q9193P3254o1093l8860n3144N8553M9304j10117o18J11826M8480K2388
13954A24963Q993j66995o0834P0511j2424J3987J1613N0955o4935j20494q395
13943a53055N4392L2797N8994Q0287k0555q2119Q0455j4221q6864o4238r5026
13932b09153m1211P2006P9968R370j26191J433P1198J7791K4039L4538K7422l0765
13920f9555P1483R0768j3412n5553m4632M8081j4037L2742K3479k0715o8064j9500
13908c8915j3293j7832N2014Q1500M6336q464q3818n6515j4771o1858n3349M7663
13896a21302Q5881M3127L2060j6577J3181P8335L3490q571j42966r7745O0490
$$ y = [-69603, -179974, -91163, -81134, -90076, -107605, -65849, -5429, -10238, -46471, -65586, -70577, -64203, 24990, 98244, 37151, -1709, -54853, 3700, 53004, -57113, -57731, 54095, 102575, 124963, 133956, -33039, -93873, -23362, -35786, -21799, -10186, 40769, -24166, -144660, -153055, -98663, -65866, -6872, 73415, 52860, -29259, 51196, 36975, -49889, -114127, -209153, -250364, -178358, -98390, -89020, -215211, -213778, -142580, -124789, -100750, -66212, -38790, -69555, 1928, 92696, 79284, 23731, -20901, 27180, 13143, 45885, 69364, 48649, -19415, -38915, -52208, -70040, -18026, 63474, 109810, 101346, 17528, -38987, -53758, -115616, -168965, -121302, -35421, 7706, 39766, 23189, 36370, 114705, 148195, 139624, -3342, -101087, -40597]
13885d0597N1364M515j12924l5300l4129m0023J07969M9055k8052K5269q5826
13874a38679k4238q838Q1229M1413p2465r3645K9000P4966N6373n0808K1246J1876
13862g2570J489J71o0615n0030J6336J23119o939M7803J33489K2005r4299r3479
13850c3520j4008O518O0410k2982L974O263r333P883Q4028J3667o8750M8865N1196
13837A34211m0289j21156J0775l7992n3843J0240L0842j4506J0684P6010p5579
13826g0603n2129J7145k076j8000J46698Q857n8609j61503l117P8486L0623j9679
13814a03907R6323K5221o5580n9717K1628N5461m8785k3945J1896N6176K9597
13803e632Q0647J7033j10944p7383L8677J2207j2631L2434M409p1417l3456r699
$$ y = [-40597, 10767, 15282, -97642, -132942, -167071, -207094, -99125, -50070, -78122, -52853, -138679, -162917, -171755, -90526, -49113, -121578, -215223, -186223, -111257, -54884, -105692, -84446, -72570, -71081, -70910, -131525, -181555, -165219, -42100, -49039, -1236, 132253, 154258, 59959, -33520, -47528, -41010, 19400, -3582, 392, 6655, -2678, 5205, 89233, 102900, 34150, 83015, 134211, 93922, -27234, -16459, -54451, -108294, -98054, -67212, -81718, -71034, 4976, -70603, -122732, -105587, -107663, -125663, 21035, 29892, -28717, -190220, -193337, -114851, -84228, -103907, -7584, 17637, -47943, -107660, -86032, -30571, -79356, -103301, -91405, -35229, -5632, 75015, 92048, -18896, -96279, -57602, -45395, -58026, -25592, -21183, -92600, -126056, -135755]
13791a35755J11455o0713R915J02994J02851q5249k8447M5272o8364q5078m6388
13780a37507l696m4555O7282R5298J03824J50176j00400q9927o7443l7295R3996
13769B9753j17306O0270Q3047n2534m482k8702K7979m8553r32j5545K5629l3690
13757g5066O316L8757o059n7264K2863j9016l7386p9233m8581M1844O2184Q5084
13745f5557m8912l2611L2707M7506o290l6483O1000j2838R346M384J0989m6045
13733h2804N3392R5965q184J7949K3534m835k5300r9638r756n0280j0012q544
13721a08513l9138n0707M7954O4378m8736N2244k8091M2064N1285o4416P6488
13710e188Q63l7752o02J22385m7013r0942P3193j03002o6402O6478J28010o6924
$$ y = [-135755, -24300, -85013, -75098, 27896, 130747, 45498, 17051, 62323, -6041, -91119, -137507, -141203, -185758, -118476, -23178, 80646, 230822, 130422, 40495, -26948, -64243, 29753, -87553, -27283, 55764, 3230, -1252, -29954, -1975, -50528, -51460, -67005, -41376, -75066, -68750, -29993, -36052, -93316, -70453, -89469, -126855, -206088, -254669, -212825, -150641, -65557, -114469, -147080, -114373, -66867, -73157, -109640, -48640, -61478, -52132, -47748, -36759, -82804, -29412, 66553, 58369, 76318, 99852, 95017, 69717, -29921, -39677, -89957, -99969, -108513, -147651, -198358, -150404, -86026, -134762, -82518, -110609, -68545, -17260, -81676, -5188, -4325, -42077, -42679, 79706, 32693, -58249, 14944, -88058, -154460, -87982, 40028, -26896]
13698b6896k1568l0326q135J7561L1524P310L9297N6456L311K3639l1533p9761
13686a9121M319N4467m9766l5327Q5745K6530j07516l1498K1245J40068K4995
13675A14141j27212j5803J8887n7262k7485m782l5810j36595j43494P4829P0283
13664b70303Q0085K9592O1292J17400j5558l0298q767m1595M6318M0462n968j05360
13652a02700l8631J08464J4007l8253l3861l0083Q7651m618m4676l2077k4916
13641a39693K4627J0403m9918n067Q7010N7500L8053O639o1264j1859N1549K8554
13629C6534m3790j33603M8067P6259l3665M5296m562L2832M3996r9981n0183K0774
13617f2026L4668O4351M305L0949K5154o6565l2126k7303q7582l7377l789K5085
$$ y = [-26896, -48464, -78790, -86925, -69364, -37840, -30530, 8767, 65223, 68534, 92173, 60640, -19121, -14802, 39665, -10101, -45428, 40317, 66847, -40669, -72167, -50922, 89146, 114141, -13071, -28874, -9987, -67249, -94734, -99516, -135326, -271921, -415415, -340586, -270303, -190218, -160626, -99334, 18066, 2508, -27790, -36557, -78152, -31834, 8628, 2660, -102700, -141331, -32867, -18860, -57113, -90974, -121057, -33406, -38024, -82700, -114777, -139693, -115066, -104663, -154581, -159648, -72638, -15138, 22915, 29554, -31710, -43569, 7980, 36534, -7256, -140859, -92792, -16533, -50198, -4902, -9464, 23368, 67364, -32617, -82800, -62026, -27358, 36993, 41298, 72247, 97401, 30836, -1290, -28593, -116175, -153552, -157341, -132256]
13605a32256L1204P1118M9015n7728R096j0422j3116k3673M5019l7760k2829P59
13593i1573M0405R517q396Q8359L8636K0825l5800K0186l6785r7227j28809q3452
13581b64114k9915K3946J1601N6546N2218n0070L4419k332M2602m447R1949R1291
13569E3694l3471q4090J8929J34034O3520L6256r2624P21j30734K1120n1223K9080
13557c4788M0068K9461M0805M6412k2670l9982j0543p3997j24528J8880R7695
13546c3187J2916m1004J7148L590r1086k7536K0230m4307q2257Q1108P4731R737
13534i9917N0680N257J3575o7361l4196k2371q9524l1691M079O800P4557J2343
13522a77769o2097L3066J57486K8626m7069L8461l2687m2036P4804Q0363k5072
$$ y = [-132256, -101052, -29934, 19081, -38647, -29551, -39973, -53089, -76762, -31743, -69503, -92332, -91573, -51168, -41651, -50047, 38312, 76948, 97773, 61973, 82159, 45374, -51853, -180662, -264114, -294029, -270083, -258482, -201936, -149718, -199788, -165369, -167701, -125099, -129546, -37597, 53694, 20223, -63867, -44938, 89096, 152616, 188872, 96248, 96969, -33765, -12645, -63868, -34788, 5280, 34741, 75546, 121958, 99288, 59306, 48763, -25234, -149762, -130882, -33187, -20271, -61275, -44127, -40537, -131623, -159159, -138929, -183236, -265493, -184385, -109654, -99917, -49237, -43980, -30405, -97766, -131962, -154333, -243857, -275548, -271469, -264669, -190112, -177769, -239866, -206800, -49314, -20688, -67757, -29296, -61983, -104019, -29215, 51148, 26076]
13511B6076k2220n4972K9711M511k7330m7837N6238K7514J5913P4641P0656j15976
13499C6925L5944L476j78977k8425o1614O0941R3335R9078K9824q4895N472m7678
13487c6594p3163j6556k1859l8458M7516l4816J1275O213j4585J00962J05521
13476C5456Q034q1871o2542n7306J03283N17K0932J9729q0692K2102R9467M8140
13464G5249J9985o4457M5300k4806p0585j4834k5667L8533J16823q7178p3665
13453f5302P2813J07687K2022l7941o2256J3170n1876r1561o0981j408Q5879j280
13441g1034k3284j6712J5605Q3723O2199N4956j10733q9647K99m0686j9379J02929
13429e1764J10553j9004l9342n618k6213J7609j3174M662l5697n013M6441o8814
$$ y = [26076, 3856, -51116, -21405, -16894, -44224, -92061, -35823, -8309, 7604, 82245, 152901, 36925, 72869, 76345, -102632, -131057, -192671, -131730, -38395, 60683, 90507, 5612, 11084, -36594, -109757, -126313, -148172, -186630, -139114, -173930, -162655, -156442, -171027, -70065, 35456, 43490, -38381, -100923, -158229, -54946, -54429, -33497, -13768, -94460, -72358, 27109, 75249, 95234, 30777, 76077, 51271, -19314, -34148, -59815, -21282, 95541, 8363, -65302, 7511, 115198, 137220, 99279, 37023, 50193, -1683, -93244, -154225, -155633, -69754, -71034, -94318, -111030, -95425, -11702, 50497, 105453, -5280, -94927, -94628, -135314, -154693, -51764, 58789, 39785, 443, -5175, -31388, -13779, -26953, -22291, -57988, -63001, -16560, -85374]
13417h5374n8058P4953J17525P434K9191L4328r1904j9354P6400o940K268J5191
13405I5660o8174p1159j504L4388K2315r671K6789K7334o8083j81097j03713J3952
13393b82963M1881J46363P2922P8730n188r5316l4969j86752l0175N1194K6386
13382b17887K2091k9312P1401O8355j17334P8278L4567j3411K6675j3589Q707
13371h1459N9853k9569Q2837K1313j00837p819l7560P55K6555P0078J3389j47069
13359a29533N1097J3202K5067L7064p6033q7915J4746J21727Q7236n1434n5043
13348d9819k215J6151m9776j4615N8282M9458O5259K3809n2920p6139l4664L3770
13336c3419M9052r741P4644M6548J8914o6663j20982n6503N7419L8343k4829N5186
$$ y = [-85374, -143432, -68479, 49046, 56480, 85671, 119999, 28095, 8741, 85141, 78201, 80469, 95660, 27486, -43673, -45177, -10789, 11526, 1855, 28644, 55978, -12105, -193202, -296915, -282963, -241082, -94719, -21797, 56933, 51745, -43571, -78540, -265292, -295467, -244273, -217887, -195796, -225108, -153707, -85352, -202686, -124408, -89841, -103252, -76577, -90166, -81459, -21606, -51175, 31662, 52975, -47862, -55681, -93241, -92486, -65931, 4147, 17536, -129533, -78436, -65234, -40167, -3103, -79136, -167051, -152305, -30578, 56658, 5224, -49819, -52034, -35883, -85659, -100274, -41992, 7466, 72725, 96534, 43614, -32525, -67189, -33419, 15633, 5892, 80536, 127084, 145998, 79335, -41647, -98150, -40731, -2388, -27217, 27969]
13324B7969o2712o7385J877K7600K4517k8539O0234l2009r8578n9417N99J5524
13312a90320N0754Q7241j990o7511m043N7308R7815j9695j35110P8201M9328l2139
13300c0161P304J1716O759K8302m016J338n4353j26554P3479J46402m0598q9231
13288f9613K8928L2929j4900O1421Q4467q057j0636N362l844j32483k0585l1456
13276g8467K8268r918q97P1973m7589m6864O5805J7203K3323J0861j9834p3678
13264e9814l7705k7655p3133n9025K39426J13431p0069m5930o3636l3501L8751
13253g8860J1874P5652j12290m4419K574P7471M5699L4441n1833M0319Q7104l7788
13241D9944p6936N91K1677m4898M2554L3245j05263k6355J09481N447k6338o2964
$$ y = [27969, -34743, -102128, -100251, -72651, -48134, -76673, -16439, -48448, -147026, -206443, -205844, -190320, -139566, -52325, -54315, -121826, -125869, -68561, 29254, 9559, -125551, -47350, 1978, -30161, -22857, -11141, -4382, 23920, 19904, 21242, -33111, -159665, -86186, 60216, 19618, -69613, -40685, -7756, -22656, 38765, 123232, 115175, 104539, 109901, 106057, -26426, -47011, -78467, -50199, -60117, -61014, 10959, -36630, -83494, -17689, -486, 22837, 33698, 13864, -59814, -97519, -125174, -198307, -257332, -17906, 95525, 25456, -20474, -84110, -117611, -78860, -66986, 8666, -103624, -148043, -145469, -67998, -22299, 12142, -39691, 628, 87732, 49944, -26992, -26401, -4724, -49622, -7068, 26177, -79086, -105441, 4040, 9487, -16851, -79815]
13229g9815k4288K2075j2703L254r155j4576J5848J61791K2001j17301k5056K0592
13217c7333N1019R2424N9611j38423j39681k5568p0419p2775J5343j2611m4784
13206c23197J4730N9366O70O1156o679l5436M4808J11197J3154j4663o4651q5438
13194b24983L227J55506J8454m9852l9415J1438M0421M3619p62K794q894q0711
13182a29158o742M5551Q4230j8771j1612J4129J3902K5133K5037J0050J4607j6176
13170E0180j17963j511P8050J00060j5542K1719l9103r662n7520K222o373L36
13158D893J7733k0521P1878K5102m7213K6981J2461p911N32k21758j92310K5120
13146c05013R7426R9804M352K9517M4783j04294n1661R6312Q6256k6857r32o9322
$$ y = [-79815, -104103, -82028, -94731, -91477, -100632, -115208, -99360, 62431, 84432, -32869, -57925, -37333, 13686, 106110, 165721, 27298, -112383, -137951, -208370, -281145, -265802, -278413, -323197, -308467, -249101, -248431, -187275, -193954, -229390, -184582, -73385, -60231, -74894, -139545, -224983, -221756, -66250, -47796, -97648, -137063, -125625, -85204, -41585, -42347, -39553, -48447, -129158, -135900, -90349, -6119, -24890, -36502, -22373, -8471, 16662, 41699, 51749, 66356, 50180, -67783, -69294, 8756, 108816, 93274, 114993, 75890, 66228, 8708, 10930, 4557, 4893, 22626, 2105, 73983, 99085, 51872, 78853, 91314, 83403, 83935, -137823, -330133, -305013, -207587, -107783, -103431, -73914, -29131, -133425, -185086, -88774, -2518, -29375, -30307, -99629]
13134i9629q1274K4173l1361m7652J2708k4067K571J5734K0920m9060j9448Q6918
13122a89467N5142k131J1680o037Q363l8643m9810o7029m3509J9499J38918P4970
13110h8054q7105q085N0858l4599L3506m2859j7744M0952O9476K0912m5983Q1965
13098b6760N9040j0503l729n3480k8873q467m292k8959M0791j9563l012J1191
13086g6616o1976L5261q121K8344l3527J60775K4934r7436p0187k0211N6677K9046
13074c3037k8067n5180P6203l8346j5473k6206K1378N5925N6480J0734N4089m5401
13062C3099p6876m1595j91r620Q708R3070J2336q969j44924j62181L230M3147
13050b50766K4119l9061J34570J00476J08183l1535j2957j6473j03906k1023J09473
$$ y = [-99629, -180903, -156730, -188091, -235743, -223035, -247102, -244531, -228797, -207877, -256937, -276385, -189467, -134325, -136456, -124776, -130813, -122450, -161093, -210903, -277932, -321441, -301942, -163024, -88054, -175159, -183244, -132386, -166985, -133479, -176338, -194082, -153130, -83654, -62742, -108725, -26760, 32280, 21777, 18048, -35432, -64305, -72772, -77064, -106023, -65232, -84795, -87807, -76616, -138592, -103331, -111452, -83108, -116635, 44140, 69074, -28362, -98549, -118760, -62083, -33037, -61104, -116284, -40081, -78427, -93900, -120106, -98728, -42803, 13677, 24411, 78500, 33099, -43777, -85372, -85563, -95183, -86475, 6595, 18931, 9962, -134962, -297143, -293913, -250766, -226647, -265708, -131138, -30662, 77521, 45986, 33029, 16556, -87350, -108373, 1100]
13039A100M979j09633k2325k372l0828K1761j7183M0941J04002J4111J76171j14026
13027F6698j12603J5745m2567m0540J22652M6799n1148j0835l8387p263j9481
13016g0930p4870p6318o2445N0694k6287K9028P7099J70m5763O4954N9928o0984
13004a35724P264M1300L8329k7443k8102j1981Q9495L3935M8719J0185j6119n0525
12992f67k7681k847J5066l9046k5665J7012L6642k1961o6630j8753M9366m4874
12980a30038k813J0155j02567m2505J20838J57476l533M6941J07964P0433k7419
12969B04932j44862k7226O3330k3131j01181M1525L8950K4063M968k5272l1870
12958B4226r1442K527j0005L935Q088k2298k2998K7412J9624l1700j9818J02493
$$ y = [1100, 6079, -103554, -125879, -128251, -159079, -137318, -154501, -113560, -9558, 4553, 180724, 66698, -45905, -30160, -72727, -113267, 9385, 56184, 5036, -5799, -44186, -51449, -70930, -145800, -222118, -284563, -233869, -260156, -231128, -154029, -153859, -199622, -134668, -74740, -135724, -128460, -87160, -48831, -76274, -104376, -116357, -26862, 7073, 55792, 65977, 49858, -667, -28348, -31195, -16129, -55175, -80840, -63828, -27186, -49147, -115777, -134530, -85164, -130038, -132851, -122696, -225263, -267768, -146930, 10546, 7013, 53954, 161918, 232351, 204932, 60070, 32844, 96174, 73043, -28138, 13387, 52337, 76400, 81368, 56096, 24226, -67216, -64689, -74694, -70759, -62671, -84969, -107967, -80555, -60931, -92631, -112449, -9956]
12946i956O889P9138n3686o0600n1905O1591K5712o4239M1762L8269p2394j35650
12934a95069n10K5401P1595K1996j6448P4935k3359k3575n336q5559K0800L9730
12922i5399m0279L3469J28282k6154r425M1256j2534r578K4119p9151N5361J14440
12910A24407l5467L9941p6416l0812p6868p052k7302n0942j5501n2196j51052
12899c59260Q3141R0991n119J6122P5136q0815m4347P5181P8760l258k6685N4764
12887d5389k2126k2078P8057M0370K8631K313n960p3112m002m8974j23136l6662
12875b32068Q2495K5721Q5683J03397l4276o8926m18l5842q069o8793j7161J15156
12863e3101J00183N4345m7576l0976k2652j9814j5012N8218m582j1006p788l2286
$$ y = [-9956, -3067, 76071, 22385, -38215, -90120, -28529, -2817, -67056, -25294, 12975, -59419, -195069, -195579, -170178, -98583, -76587, -93035, -18100, -41459, -65034, -70370, -155929, -135129, -95399, -135678, -102209, 26073, -81, -9506, 31750, 19216, 9638, 33757, -45394, 9967, 124407, 88940, 128881, 52465, 21653, -55215, -62267, -89569, -140511, -156012, -208208, -359260, -276119, -185128, -190247, -174125, -98989, -179804, -224151, -148970, -70210, -73468, -100153, -45389, -67515, -89593, -11536, 28834, 57465, 59778, 53818, -19294, -23296, -72270, -195406, -232068, -149573, -123852, -38169, 65228, 30952, -37974, -38392, -74234, -82303, -151096, -168257, -53101, 47082, 101427, 53851, 22875, 223, -19591, -34603, 23615, 19033, 8027, 239, -32047]
12851c2047k2035n5813n8348j7659M9652m6835K978L2548Q3652J7801l2253l4473
12839a12832M7887j5434K7991R3934m4010n2861j3962j2606K0974M76l2499N423
12827h7519j1092L270m0382Q4116J9287k5738M5998k7714J4654M3103n4603k9734
12815f6354r890O8723R4105o8479k8334j3045q088L9370K3605n7631m2344K3610
12803d4752j9188O0375l9168n9876J4908L0522N6441k1598p7581m3128J9535N6530
12791f6980J16858j0165N0381R9804K9306j05370r9310o0059n737N0702l1775
12780c2345n9126L8766k768K4708k288l3228K9439M0496Q409J8047N0018n6803
12768B3325j09375k3836Q4425m2102J2406J4022N9265l600m4889j1316q0155k2737
$$ y = [-32047, -54082, -109895, -168243, -185902, -136250, -183085, -180107, -147559, -63907, -46106, -78359, -112832, -64945, -80379, -52388, 41546, -2464, -55325, -69287, -81893, -60919, -60443, -92942, -87519, -98611, -95341, -135723, -51607, -32320, -58058, -12060, -39774, -25120, 17983, -36620, -66354, -76244, -7521, 86584, 18105, -10229, -23274, -31362, 8008, 31613, -26018, -68362, -44752, -63940, -3565, -42733, -102609, -87701, -57179, -738, -22336, -99917, -143045, -123510, -66980, 49878, 39713, 90094, 189898, 219204, 113834, 14524, -45535, -51272, -570, -32345, -91471, -52705, -55473, -30765, -33053, -66281, -36842, 3654, 12063, 30110, 80128, 23325, -86050, -109886, -25461, -67563, -55157, -41135, 18130, 14530, -30359, -41675, -121830, -144567]
12756a44567J22112K5325o1771L8763K1175l484p4158J3494r3485J3117K2583
12745a20896M0118K3547l1908J1562M0912j8685K5979k4440L6124k4409M2603
12734E07n9937j6333M9928R3023M5248Q408K3716j7458j00816m0155l6816R217
12722d1468n7548R9069J46816j6710p2861p2667K1884J4298p8984j9932m3629
12711a21732P4356n208J4459J10371m8785k7574J1841p2003J2691q2811l4556
12700a68951L6420q3742O524N6670J03797l601J5312k1170l8685n666N9720R2950
12688D9578K204Q40n6472O3927p6933q7723J16002M8198R673R4999j8359m6562
12676I9372N3587m0752k7079p1413l8226q7654L7834N7051J11537K8190q2776
$$ y = [-144567, -22455, 2870, -58901, -20138, 1037, -2447, -76605, -63111, -156596, -143479, -120896, -80778, -57231, -89139, -77577, -36665, -55350, -29371, -53811, -17687, -42096, 507, -59430, -75763, -25835, 67188, 112436, 120844, 144560, 127102, 26286, -13869, -50685, -41468, -99016, 53, 146869, 130159, 57298, -15369, 6515, 20813, -58171, -78103, -121732, -47376, -52584, -38125, 72246, 23461, -4113, 7728, -64275, -51584, -134395, -168951, -132531, -216273, -209749, -153079, -49282, -52883, -37571, -58741, -97426, -103092, -43372, 49578, 51782, 52622, -3850, 60077, -16856, -104579, 11423, 59621, 69294, 164293, 145934, 99372, 152959, 112207, 85128, 13715, -24511, -112165, -74331, -17280, 94257, 122447, 39671]
12665C9671L2635k5626M7172k8854o9200o3518n5624M8474R4690j8178J7596q509
12653A0729q7743K3677O2503K4457j15660K7560P3202k6659j761Q4871K2619k0762
12641G7033m0685j11701j4740K9297J16816O5680J3007Q7153j1464j27663o0972
12630B1761k3602L0299m9572n8958m6519M2146J54087k1536P582l717N0556k5390
12618G7137n5545j9147n9903p5171Q0480Q3526Q1424K8559q1206n8826p1204l8422
12606a08298J09191J12179Q6167m9043p1013k3766m4508m6356l0288L9919M0030
12595A4214k8471q920N109O7085j1631j00907k1119l3385p259Q6531Q8041K8868
12583G8156o0982L6844N7743M1486k3706j6345k5609l9665N740M0839N7596k8093
$$ y = [39671, 72306, 46680, 93852, 64998, -4202, -67720, -123344, -74870, 19820, 1642, 19238, 10729, -77014, -53337, 9166, 33623, -82037, -54477, 18725, -7934, -9695, 75176, 97795, 77033, 36348, -75353, -90093, -60796, 56020, 121700, 134707, 221860, 210396, 82733, 21761, -1841, 28458, -21114, -80072, -126591, -84445, 69642, 48106, 55688, 51971, 102527, 77137, 21592, 2445, -57458, -132629, -52149, 31377, 112801, 141360, 60154, 1328, -69876, -108298, 893, 113072, 199239, 150196, 79183, 55417, 10909, -35447, -65735, -25816, 14214, -14257, -23177, -18068, 49017, 37386, -63521, -84640, -118025, -125284, -38753, 49288, 78156, 17174, 54018, 111761, 153247, 129541, 113196, 87587, 47922, 53662, 94501, 152097, 124004]
12571A24004j3562M2241j11844m0111L6298M856o6205Q003Q0020O8764j21548
12560A0916m7321J10939N6941m4342o4627j42371P7634R5133P175j39242j06074
12549a85239n0305K874J8547O2429J63711M4584l0440N1N9104R9182J1535n2740
12537A43293q7583n55j60r1093Q993K4101m3242l0164J8018M913L2901O4120Q1392
12524A24934K312n1176l2480K5507n1509k9967O5479q261Q4980R902o4561J10686
12512A85846m4577p6637K6852j9877j33011o833J03716J05084k3915l416M2010
12501A55242K3710j2366L27k9963K7576N1178L0456J5495O143r6811n2907l1033
12489H7047J5902L1872K1023j9180K8727K3557m8335k1811j1628J9858L3313j24223
$$ y = [124004, 110442, 152683, 40839, 728, 37026, 41882, -24323, -16320, 63700, 132464, 10916, -36405, 74534, 131475, 87133, 22506, -119865, -42231, 52902, 60077, -79165, -185239, -235544, -232670, -214123, -151694, 12017, 56601, 26161, 26212, 85316, 184498, 196033, 143293, 55710, 55155, 54995, -36098, -27105, -3004, -46246, -76410, -58392, -53479, -20578, 43542, 124934, 127246, 76070, 43590, 69097, 17588, -12379, 53100, 44839, 129819, 139721, 75160, 185846, 141269, 64632, 91484, 71607, -61404, -68237, 35479, 140563, 116648, 113232, 155242, 178952, 166586, 166913, 136950, 164526, 215704, 246160, 261655, 267798, 170987, 118080, 87047, 102949, 134821, 155844, 136664, 165391, 188948, 140613, 118802, 107174, 127032, 160345, 36122]
12477C6122M024L8432J7777J3493m5213n2861n8580J7834K0699J0256K5536n832
12465B1687j09159K1582P0803M4515K0567P5652k6905q185j2554m3547L8156J469
12453I4081O6179O790m5834k9448J01184M3825k9213l1182N5155J8928k0960q9767
12441A39738k9091M193m949K9042L3819k751j21181k3485K8451L5059n1635M2227
12429G9437J06312M1727r4758m4963j10672k3751N4414N6968N6556n309L2932
12418A48893n9264n5364Q404m092M3343m158M26o2837o4651M2492N1819p836q6837
12405d9662k537L7086L0669j3787n6283L8626K7570J10649N9986r9730k3588r9542
12393d0543m2612L0500j8880J0075R1579K7339K2773M152q2012O7264R7993P3589
$$ y = [36122, 40146, 78578, 96355, 109848, 64635, 11774, -46806, -28972, -8273, 1983, 27519, 21687, -87472, -65890, 4913, 49428, 69995, 145647, 118742, 110557, 98003, 54456, 92612, 94081, 160260, 167050, 121216, 91768, 192952, 236777, 207564, 176382, 231537, 250465, 229505, 139738, 110647, 114840, 109891, 138933, 172752, 170001, 48820, 25335, 53786, 88845, 37210, 79437, 185749, 227476, 132718, 87755, -22917, -46668, 7746, 64714, 121270, 115961, 148893, 89629, 34265, 42669, 38577, 81920, 77762, 78188, 15351, -49300, -6808, 45011, 37175, -49662, -52199, -15113, 15556, 1769, -54514, -15888, 11682, 122331, 182317, 82587, 58999, -40543, -83155, -52655, -71535, -61460, 30119, 57458, 80231, 84383, 2371, 69635, 167628, 241217]
12381B41217n3024n4045K9619K5923Q0790l9965p8865K2837J9692J7957j06375
12370A05761j20603m6245M4838Q2691J1716Q3876P8891k7403j22164l8203J7938
12359G1093k3400m3054N9775J21939R861J5750q9118p0705j9674L5229Q4045R6773
12347B48514L719M2409m3479l1781N7595K5295J308m6408n3362p3786M2340r6242
12335G6122R8013J06329L8584R8j16920l6651M6289n251l0118K2367n9982k4709
12323A14171R3972l5596k7214M479O218L8031M3283O1042p482j3200L7697Q1041
12311C96442L2237n4275r2674N1468M713l9861L8875l4075o3130p1017p752O4236
12299B25187J41247l9334n6895k2646o2097J6472K7547l4294m1099j03236j0246
$$ y = [241217, 188193, 134148, 163767, 189690, 270480, 230515, 151650, 174487, 194179, 212136, 105761, -14842, -61087, -16249, 66442, 78158, 162034, 240925, 213522, 91358, 53155, 71093, 47693, 4639, 64414, 186353, 196214, 211964, 122846, 52141, 32467, 67696, 151741, 248514, 252233, 294642, 251163, 219382, 276977, 302272, 303580, 257172, 203810, 130024, 172364, 76122, 174135, 280464, 319048, 319146, 202226, 165575, 211864, 206613, 176495, 198862, 138880, 114171, 208143, 172547, 145333, 149812, 156030, 194061, 237344, 298386, 290904, 277704, 315401, 396442, 428679, 374404, 281730, 333198, 337911, 298050, 336925, 302850, 239720, 168703, 160951, 225187, 366434, 327100, 270205, 247559, 185462, 201934, 229481, 195187, 154088, 50852, 40606]
12288D0606J14433J48729m9306l0518P5914J5697o2560n9251N5030J8795l7697
12277B29872K9480k104L8772N978L0895j5128l3572m7385o4123j2859J34675J27084
12265D21585j30186q6454k5601j5045J9689O8812Q5653o4708P6373m7043p1093
12254B31982j5981N5026J54307L7074r2910k3303p1282l6074n7284K9862K8158
12243B39575m283k4455Q5279R7615J1464K1748O2011j08572r0289J4465R2868
12232C97426N5394n8165j43837J156O8696l5525K7022N7507k6104p6687K7389
12221B94272J5916L1459Q087J0982J721r595k1842L8721l83J503l171N1265P509
12208D26444p0146L0173M4158j8227q976K6609N5461p8698p759P3689O314r6301
$$ y = [40606, 155039, 303768, 254462, 223944, 299858, 315555, 252995, 193744, 248774, 267569, 229872, 259352, 257248, 296020, 301998, 332893, 317765, 284193, 236808, 172685, 159826, 294501, 421585, 291399, 204945, 179344, 164299, 183988, 252800, 338453, 273745, 350118, 303075, 231982, 216001, 271027, 425334, 462408, 369498, 346195, 274913, 238839, 181555, 211417, 239575, 235292, 210837, 296116, 393731, 405195, 426943, 488954, 380382, 290093, 304558, 397426, 452820, 394655, 250818, 251974, 320670, 285145, 312167, 369674, 343570, 266883, 294272, 310188, 341647, 349734, 360716, 362437, 352842, 331000, 369721, 369338, 370841, 367670, 418935, 426444, 356298, 386471, 430629, 412402, 403426, 430035, 485496, 406798, 399039, 472728, 479042, 382741]
12196C82741l6381K01384R3854n5158m6069p093k3691O2265L8087j3998q4918
12185E11023m8125M0104J22423O979M8649l10p920O9657q6952j35384n6366K7147
12173D90925n81M3742J33270J00009o0383j22001o2741O2496Q2660M5080j09068
12162F03408j30944n394J14619Q5819K1091M2535r7592L1976N9169j10517K7719
12151F41889j2284R7553J06137Q858k8980l5663K4777J16861Q9o5996j4702p0906
12139G67633M2377P6639K0090O522n822Q3501M0356q3864N0319O7686m4709j24724
12127H96004k4788M9274K384j732j3376j6688l9269q584P8460M8707M5948J07235
12115A123575M2615m6380n6514J0603M1753K6308p4925m9061J1255j9633L8649
$$ y = [382741, 346360, 547744, 641598, 586440, 540371, 533278, 509587, 571852, 609939, 595941, 511023, 462898, 503002, 625425, 632404, 681053, 680743, 672823, 742480, 655528, 520144, 463778, 490925, 490344, 534086, 667356, 767365, 706982, 584981, 522240, 584736, 667396, 712476, 603408, 472464, 467070, 581689, 667508, 688599, 731134, 633542, 665518, 724687, 614170, 641889, 629605, 727158, 833295, 842153, 813173, 777510, 802287, 919148, 919237, 853241, 838539, 767633, 810010, 886649, 906739, 913261, 907439, 990940, 1031296, 947432, 997751, 1065437, 1020728, 896004, 871216, 920490, 922874, 921142, 907766, 891078, 851809, 843225, 921685, 970392, 1016340, 1123575, 1166190, 1119810, 1063296, 1073899, 1115652, 1141960, 1067035, 1017974, 1029229, 1009596, 1048245]
12104A048245J19253l1060m2008L6576J40202N0173j2179r9255q2636K6131Q8076
12093A241518J53718R8532O3084M0146q9571K7051r7523q0150l6371J23988j2641
12082A431781L7532N7722j2427J5716N878N0185N2040L3579L08Q0498K7244l1442
12070A748614k4998P721n5763R8403R019k1574M2240L5650L5030K7201J5029O2205
12058A978777k1875Q7219J01470j2268j7482q2750M514L1393P6424J06597R0970
12047B342989l103n2632M7073N4140J5517J1972k4331J53375M0729L5071J09967
12036B730767J67367k8835m3614J36479N167j28845L0088N6673J29904J19559
12026C174710K2214P437J04058K1111j115k5193M8576J67035M7934P6044Q126
$$ y = [1048245, 1167498, 1136438, 1094430, 1131006, 1271208, 1321381, 1309202, 1209947, 1127311, 1153442, 1241518, 1395236, 1493768, 1556852, 1596998, 1507427, 1534478, 1436955, 1356805, 1320434, 1444422, 1431781, 1469313, 1527035, 1514608, 1530324, 1536202, 1586387, 1638427, 1672006, 1672314, 1752812, 1780056, 1748614, 1723616, 1731337, 1675574, 1773977, 1782996, 1761422, 1803662, 1839312, 1874342, 1901543, 1916572, 1978777, 1956902, 2044121, 2145591, 2133323, 2115841, 2033091, 2037605, 2068998, 2145422, 2252019, 2342989, 2339886, 2287254, 2334327, 2388467, 2403984, 2415956, 2391625, 2545000, 2585729, 2620800, 2730767, 2898134, 2869299, 2825685, 2962164, 2967331, 2838486, 2868574, 2925247, 3055151, 3174710, 3196924, 3204361, 3308419, 3329530, 3328415, 3303222, 3351798, 3518833, 3566767, 3642811, 3650937]
12015C650937k6229J59651N1342J988O4888J14147J13704J2188k8163N3673R8014
12004D266140J44948J71827Q5955J701K8269J62332N7875l0602J71920J16376
11994E176741J17721J61412M171R1855J86924Q7371N4133J16986J06193J85970
11984F289477J40622L1067P7998J46174J19989Q5150L081O3791K44219K17841
11974G419409J55400J43973J54942K24613L1279J21728J89084J93479R4678R0459
11964H819044R0136K27454J45422J05504K23894J57930J96138J47120J39123J55230
11954A0406995K33657J39828J00133J81647K77241L07946K44121Q7520J21925
11945A2101013K32416K58137L11448J77437O0902R2858Q1156P1465K28609J37471
$$ y = [3650937, 3624708, 3784359, 3835701, 3837689, 3902577, 4016724, 4130428, 4142616, 4114453, 4168126, 4266140, 4411088, 4582915, 4668870, 4670571, 4698840, 4861172, 4919047, 4888445, 5060365, 5176741, 5294462, 5455874, 5460045, 5551900, 5738824, 5826195, 5880328, 5997314, 6103507, 6289477, 6430099, 6461166, 6539164, 6685338, 6805327, 6890477, 6893558, 6957349, 7201568, 7419409, 7574809, 7718782, 7873724, 8098337, 8129616, 8251344, 8440428, 8633907, 8728585, 8819044, 8909180, 9136634, 9282056, 9387560, 9611454, 9769384, 9965522, 10112642, 10251765, 10406995, 10640652, 10780480, 10880613, 11062260, 11339501, 11647447, 11891568, 11979088, 12101013, 12333429, 12591566, 12903014, 13080451, 13141353, 13234211, 13315367, 13386832, 13615441, 13752912]
11935A3752912R0249J47055J47803J66045J10049J18142J24677K36225J25781
11926A5018938K6404R315J61574J46883P8411R6440K1073N7506K0484M1169J85453
11915A5863650P1821q7365n3516j04851l7721L4276q7783j73277L788k6993j05749
11904A5296280j33999j65829j80570j21432j79925o9446o2930j55853j75992j49300
11894A3901004j15168j21694j21326r8086j59015k26127k53233j97051k51565
11885A2357739j91059l00685k18599j13027j11104j29196j85663j36607j33802
11876A0837997j47808k87776k20685k10124j33811j03285j41327j85238j72805
11867I235138j41273j06764j64934j78434j42377r6074j02332j20403j94763j56459
$$ y = [13752912, 13843161, 13990216, 14138019, 14304064, 14414113, 14532255, 14656932, 14893157, 15018938, 15045342, 15054657, 15216231, 15363114, 15441525, 15537965, 15559038, 15616544, 15637028, 15678197, 15863650, 15935471, 15848106, 15794590, 15689739, 15652018, 15686294, 15598511, 15425234, 15429022, 15402029, 15296280, 15162281, 14996452, 14815882, 14694450, 14514525, 14445079, 14382149, 14226296, 14050304, 13901004, 13785836, 13664142, 13542816, 13444730, 13285715, 13059588, 12806355, 12609304, 12357739, 12166680, 11865995, 11647396, 11534369, 11423265, 11294069, 11108406, 10971799, 10837997, 10690189, 10402413, 10181728, 9971604, 9837793, 9734508, 9593181, 9407943, 9235138, 9093865, 8987101, 8822167, 8643733, 8501356, 8405282, 8302950, 8182547, 7987784, 7831325]
11857G831325j39033j67370j73995j11901q1441j84415j29895j29283j49050p5565
11847F489377j50547j58285p4054o2970r6590p2537j37626j04394m6709n8748
11837E526917r2467j42978j16185q0715j0830l6770j43252n2025q3097j25840
11827D642758j34750l8945j02774m1037m1466r1192r0002M9458k6708M1409j50779
11816D015972p0177l3119q9109j19740o4592j77957j45416P7858J1808J0862r692
11805C406698p8063l7755j30999k1748l9043m8412m1738n8867l0469p9864j31831
11794B707909J3646m2821r102P0063j24283j86907n0110L5180j4219L7988l3818
11783B403526r027R1421j6691j13499k4187k5475j4089K594K9335M6693n8862
$$ y = [7831325, 7692292, 7524922, 7350927, 7239026, 7157585, 6973170, 6843275, 6713992, 6564942, 6489377, 6338830, 6180545, 6106491, 6043521, 5946931, 5874394, 5736768, 5632374, 5585665, 5526917, 5434450, 5291472, 5175287, 5094572, 5083742, 5046972, 4903720, 4851695, 4768598, 4642758, 4508008, 4469063, 4366289, 4325252, 4283786, 4192594, 4102592, 4152050, 4125342, 4166751, 4015972, 3945795, 3912676, 3823567, 3703827, 3639235, 3461278, 3315862, 3393720, 3405528, 3416390, 3406698, 3328635, 3290880, 3159881, 3138133, 3099090, 3050678, 3008940, 2950073, 2919604, 2839740, 2707909, 2721555, 2678734, 2669632, 2739695, 2615412, 2428505, 2378395, 2413575, 2399356, 2437344, 2403526, 2394499, 2485920, 2469229, 2355730, 2331543, 2306068, 2291979, 2294573, 2323908, 2370601, 2311739]
11772B311739j12797m1189p689L7462j55839n1715k721n8013m6750Q5014m2179
11761A915323j16149q3690K1610j0802j14846L1536Q0593M3998o324k1075j29043
11750A611131p1687P7453M1772r4810R047k8839k648m0001m6932p3006j7558M7674
11738A411596R440p3630K1571K8788m9292o2007N5910K9916J3441m8960o5395
11727A271378l8836r1776L8505Q5930L9053n9404K690j1065m0635m2745m784j1042
11715A137269n6763m592Q475R458J4307P690K0341L810n9009r756K8234J13778
11703A213242p2893j09161p2437n5506j514l4883L9936K2273r128N4969R5528
11692A070426j10546r1374N0853k8081n8774j1671K9694M3894O9107k9814p5528
$$ y = [2311739, 2198942, 2157753, 2150064, 2187526, 2031687, 1979972, 1977251, 1919238, 1872488, 1957502, 1915323, 1799174, 1715484, 1737094, 1726292, 1611446, 1642982, 1723575, 1767573, 1761249, 1740174, 1611131, 1539444, 1616897, 1658669, 1563859, 1572906, 1544067, 1541419, 1501418, 1454486, 1381480, 1363922, 1411596, 1421036, 1347406, 1368977, 1397765, 1348473, 1286466, 1342376, 1372292, 1385733, 1336773, 1271378, 1232542, 1140766, 1179271, 1265201, 1304254, 1244850, 1247540, 1236475, 1195840, 1153095, 1148311, 1137269, 1080506, 1075914, 1084389, 1093847, 1108154, 1115844, 1136185, 1139995, 1080986, 1071230, 1099464, 1213242, 1140349, 1031188, 958751, 903245, 901731, 866848, 906784, 929057, 919929, 974898, 1070426, 959880, 868506, 919359, 891278, 832504, 820833, 850527, 894421, 963528, 933714, 858186]
11681H58186k9507l0614o058N2007L1670K8632J3651j5494p8584p9346M6458R1825
11669H82826j5910J3132J4270J368j17586p6314j0044j09193j910O9076q2008
11658E67707n4675j0606p0213K9187Q2772R6783J42157J8057l9520m2439q0520
11647F38690l4035O4635M8805o2723M515q134j1821M7409j14512o1294M3275P2190
11635F27000N8941m6250n7440K5782j9371l5035P3955l9734n1681q8294K5170
11624D73043L8691L0211M5897l4084n9540m7383k5422O3783P7668J7811n6813
11613E23862l999l5773P7998j32465J1544J47296K146M437n6972p6503K4046J24178
11601F09795j13768n9258L4708j4050j46230m1408R8013O8301k9378j2246k8142
$$ y = [858186, 828679, 798065, 792007, 844014, 875684, 904316, 917967, 902473, 823889, 744543, 791001, 882826, 866916, 880048, 894318, 895686, 778100, 701786, 691742, 582549, 580639, 649715, 567707, 513032, 502426, 432213, 461400, 544172, 640955, 783112, 801169, 761649, 719210, 638690, 604655, 669290, 718095, 655372, 659887, 651753, 639932, 687341, 572829, 511535, 554810, 627000, 685941, 639691, 582251, 608033, 588662, 553627, 627582, 587848, 536167, 447873, 473043, 511734, 541945, 587842, 553758, 494218, 446835, 421413, 485196, 562864, 580675, 523862, 519863, 484090, 562088, 429623, 441167, 588463, 590609, 595046, 538074, 461571, 485617, 609795, 496027, 436769, 471477, 457427, 311197, 269789, 367802, 436103, 406725, 394479, 366337]
11590C66337j12033L0409R5221j8648p6511P675O9301j2327N1159O3299r1019
11579C72863m4465m0316O4872j4977k9657R4263l0470k0800K7173N8371O826j0365
11567D33318p3931o5420K4742Q0061K0792j46162L4697K0344k1103n1736m5387
11556B10215M1802L1674o1451n361P2674P5270Q2660l4828j11642n374n169R288
11544B99758Q436m7593O8518l3312K5073K9242j5911J004k7159j6527r1129l8188
11532A62212k9445l753J72517O7912j96735m4045J10871N4549j9932m6711j00835
11521A26605o1348O2206P2809K2556L6628J14821n1216j10417r2295O6403k0087
11510A66665n69O0379r8906K0350J20438k557o3283j22504R90O3861P6517J51
$$ y = [366337, 254304, 284713, 379934, 361286, 284775, 292450, 361751, 349424, 400583, 463882, 372863, 328398, 288082, 352954, 337977, 308320, 402583, 372113, 351313, 378486, 436857, 443683, 433318, 359387, 293967, 318709, 398770, 419562, 273400, 308097, 328441, 307338, 255602, 210215, 252017, 283691, 222240, 216879, 289553, 364823, 447483, 412655, 301013, 295639, 290470, 299758, 308194, 260601, 329119, 295807, 320880, 350122, 334211, 335215, 308056, 291529, 200400, 162212, 132767, 129014, 301531, 369443, 172708, 128663, 239534, 294083, 274151, 227440, 126605, 65257, 127463, 200272, 222828, 259456, 374277, 323061, 212644, 120349, 186752, 166665, 166096, 226475, 127569, 147919, 268357, 265800, 202517, 80013, 81003, 144864, 221381, 221532]
11498B21532k3036k0032K9288N1732k776J5695k3482p3704p9288N8529P9797o7404
11486A66851o612j8113L2386J6858n6191p650m4576m0492k243L1703M9407l2976
11474H8352R797j1068L2960N5722J03780J5445n8088p1143j1423l3158j00853
11463B0323o9023O8655J9358J2925O5641N3145j2689l1132m2306J610J5583K796
11451A04886M9760k792Q3457R5178j9677p0406j07173m1321N2762J49254Q0314
11440C74242j13394j23010j19540n1041J6345N4322J98791O6805K0252q8778k4613
11429B10381L6119p4581o3029o5991J2845J1933m2508j7316m3015M9184J03778
11418A17800m5696M2951J7252p2736j6692R0164J4753p5783p452j3457N3124L1498
$$ y = [221532, 198496, 178464, 207752, 259484, 256708, 272403, 248921, 175217, 95929, 154458, 234255, 166851, 160239, 142126, 174512, 191370, 135179, 127529, 82953, 42461, 40218, 71921, 121328, 88352, 98149, 87081, 120041, 175763, 279543, 294988, 236900, 165757, 154334, 121176, 20323, -48700, 19955, 39313, 52238, 117879, 171024, 158335, 127203, 84897, 86507, 102090, 104886, 154646, 151854, 235311, 330489, 310812, 240406, 133233, 91912, 144674, 293928, 374242, 260848, 137838, 18298, -32743, -16398, 37924, 236715, 303520, 323772, 234994, 210381, 246500, 171919, 108890, 42899, 55744, 67677, 25169, 7853, -35162, 14022, 117800, 72104, 115055, 132307, 59571, 42879, 133043, 147796, 72013, 64561, 51104, 104228, 135726]
11406A35726J48640L9995p5350o2199l7291m2944J9007l6899L7346O4879n1383
11395A39527k4402O5529l3360m3756m5015K1003N1846l3674j7163j8252n896k7057
11383B9330k4240J5170Q1475M3118k4492K3754m6991m4746r1272K5499J31060
11372A17665p0332o3851p0723N630M6645J24026r895k1681M8552K2029l4059j38469
11360d4463j45602M2797J44571N2451K8456l1314o1771N3182N6690j3841o2712
11349A8444j3329k9542O7562L6882K81Q565o5145j4418l2555j0777M5542k9464
11337a7954O5570K4127N8297r0146k3019J2469J0506m3038K0297r700j5991L3056
11325B4474q974j3206L0785M4192R5641n6320n8538M3211n1339r7713o0512o738
$$ y = [135726, 284366, 324361, 249011, 186812, 149521, 106577, 125584, 88685, 126031, 190910, 139527, 115125, 180654, 147294, 103538, 58523, 79526, 131372, 97698, 80535, 62283, 56387, 29330, 5090, 20260, 101735, 144853, 120361, 144115, 97124, 52378, -38894, -13395, 117665, 47333, -16518, -87241, -81611, -34966, 89060, 79165, 57484, 106036, 128065, 94006, -44463, -190065, -147268, -2697, 49754, 78210, 46896, -14875, 38307, 94997, 81156, 18444, 5115, -24427, 43135, 80017, 80298, 88863, 23718, 9300, -23255, -34032, 11510, -17954, 47616, 71743, 130040, 39894, 16875, 29344, 39850, -3188, 17109, 7409, -8582, 24474, 15500, 2294, 33079, 77271, 172912, 116592, 58054, 101265, 49926, -47787, -108299, -115037]
11313a15037K3829r0225J7727J48746P899o2669K9370M2397j7004j02163j0842
11302a27972k5612N9521O6400P1487n7573q3316j18638r938R1225m5035k4169
11291b03620Q2154J11543Q1271m756q5945M7902Q5136o4464r1515k4815J2022
11280e5087l4262k1738K3878m5058J17292J1130N5969j21244j7576K7692j5594
11269g4598O9447M2849J03108l8590m7953J8940J6426q6934J7838L2547k5887
11258B7193l6967m0699m4843R473J04355P6017n8527q2463p1449L1142P4525J1210
11246a033l2960J1226N1941Q5515O7742o8409j19409K6404Q8556l7764n4019j18945
11234a01155p5864L0008M4286N0149O6313l163o139p5888k8995J5135R4858o0433
$$ y = [-115037, -91208, -181433, -163706, -14960, -7061, -69730, -40360, 2037, -14967, -117130, -127972, -153584, -94063, -27663, 43824, -13749, -97065, -215703, -225641, -134416, -179451, -203620, -121466, -9923, 71348, 66592, -19353, 28549, 113685, 49221, -42294, -67109, -55087, -89349, -111087, -87209, -132267, -14975, -3845, 52124, -69120, -86696, -59004, -74598, -5151, 37698, 140806, 102216, 54263, 73203, 89629, 2695, 20533, 53080, 27193, -9774, -50473, -95316, -85843, 18512, 94529, 36002, -46461, -117910, -86768, -12243, -1033, -33993, -22767, 29174, 114689, 182431, 114022, -5387, 21017, 109573, 71809, 17790, -101155, -177019, -147011, -102725, -52576, 13737, 10574, 4435, -71453, -100448, -85313, 9545, -50888]
11222e0888J15196O7466p6236j8947m1526m0171L1386J0038o014L2306R7323J1519
11210A31452O2861N4667j2180j84454n8899o226N8779l8739j08340n6203m4650
11199b01932J0435q324N2266l197m2662O0996K1540M9872M051k4925p0822J7871
11187a34831N9024M2417K2493O514o3017n5105J0168N8483O0873Q6318R2272q8267
11175I7342j27256j5471k4991j13014J7824J6442l3524l054J23915K7434o5874
11164a00227o023J00817M3561Q7376m8111p5631k3253j03151q179R1450L7641
11153c730k1654j4407j1177j4136j6010M7948n2516j35507M1055N3501M2708P3667
11141a0258l3844q1645j9327J21855L575r3601j3145m5688P3542N1603p2325L8075
$$ y = [-50888, 64308, 131774, 55538, 36591, -4935, -45106, -13720, -3682, -9696, 22610, 119933, 131452, 194313, 248980, 236800, 52346, -6553, -12779, 46000, 7261, -101079, -157282, -201932, -191497, -199821, -147555, -150752, -193414, -132418, -110878, -61006, -56955, -81880, -152702, -134831, -75807, -33390, -10897, -4383, -67400, -122505, -112337, -53854, 7019, 93337, 185609, 97342, -29914, -45385, -70376, -183390, -165566, -149124, -182648, -185702, -61787, -34353, -100227, -106250, -5433, 38128, 125504, 77393, 1762, -21491, -124642, -132821, -41371, -3730, -25384, -39791, -50968, -65104, -81114, -33166, -85682, -221189, -180134, -126633, -83925, -10258, -44102, -125747, -145074, -23219, -19644, -113245, -126390, -172078, -98536, -46933, -119258, -81183]
11129h1183Q2588K710J5614m5668q7973q1482k777n274l2824M9583Q073L7114
11117a41499O815P7804N8055k0617J10457M5828l1188r5439j19742N3604M5512
11106a0410p0715n2837j2022m4155n664n395N0744J59533M1774p9775j7584n0315
11094i6821j09314n6153K7514N078J6571j2409M9370K7984n9723N8386N9957L4910
11082e4650L9774O507r3169J2340k9104q688M7748Q4658j1808n5123n0018j08734
11070b20267l93J27538N4453j00488O6500P0148k5018n9263m818M6576L2094j01029
11058a13967j40236K420O314J34486P6577K2403l7705J5728N8286q8607K7952
11047c6349J38341K6171O8429L2020m3621j11157J3322P7395L8969j469o1399
$$ y = [-81183, 1405, 4115, 19729, -25939, -113912, -195394, -198171, -203445, -236269, -186686, -178613, -141499, -134684, -56880, 1175, -19442, 91015, 136843, 105655, 10216, -109526, -55922, -10410, -81125, -133962, -145984, -190139, -195803, -201198, -150454, 9079, 50853, -28922, -46506, -96821, -206135, -262288, -234774, -229696, -213125, -225534, -176164, -148180, -207903, -149517, -89560, -54650, -14876, -8369, -101538, -89198, -118302, -126990, -79242, 5416, -6392, -61515, -111533, -220267, -220660, -93122, -38669, -139157, -72657, -2509, -27527, -86790, -91608, -45032, -12938, -113967, -254203, -251783, -245469, -110983, -34406, -12003, -49708, -33980, 24306, -64301, -36349, 101992, 128163, 196592, 228612, 184991, 73834, 87156, 164551, 203520, 202051, 140652]
11036A40652L5499M4398J46223J79638O1751L7847M583M9663n5088r2046l6770
11025E16350j0924K4758K6640O5798J309J50226J55593k7902j92931k06216k03593
11014B99108l6769P2587M9086L5237J8033J04921J10941M2925m7547j03328o9970
11003D75224j35545j09190o9571l5484n5418P4248J3249R2522j6407M7920k8320
10992B53228j16124q3960j06712K9523o8597m7009J0480J04704l6071q3696J8796
10981a25438O0497k9215j59392j0762l0076l1737K7840Q9159q500R358m51n5605
10969b64322n2688L2013j0436M1232L19R000J1056P2206K4744l0290M3780Q2222
10957d1164n44j1043j16108k6173Q0096K0236j1697M7979M3606m4986O518k2476
$$ y = [140652, 176151, 220549, 366772, 546410, 608161, 646008, 650591, 700254, 645166, 553120, 516350, 505426, 530184, 556824, 622622, 623931, 774157, 929750, 901848, 708917, 502701, 299108, 262339, 334926, 384012, 419249, 437282, 542203, 653144, 696069, 648522, 545194, 475224, 339679, 230489, 160918, 125434, 70016, 144264, 157513, 250035, 233628, 281548, 253228, 137104, 53144, -53568, -24045, -92642, -139651, -129171, -24467, -60538, -144234, -125438, -64941, -94156, -253548, -264310, -294386, -326123, -298283, -209124, -217624, -208266, -208717, -264322, -317010, -284997, -295433, -254201, -253882, -244882, -233826, -161620, -136876, -167166, -123386, -41164, -41708, -52751, -168859, -195032, -114936, -94700, -106397, -58418, -14812, -59798, -53280, -75756]
10945g5756m807J9114n2601o5916m0993O3924n627j0259N4129k6124O6631J22314
10933D4029L5507j33834j94888q836J08144K7941n1943j8894J32325J03577K273
10922D5401q8177k7484M9026M2616k7442L55M4314j9267p9367m4307J9144J2930
10910g2258n4269j633K8358Q1100j1344j5552j3944j2532o8871k3477J5932o6130
10898b14620m3869o0794R8910O4804L4984L370M740L9222K4682k3461J5317N3929
10886b786K3665p6485q7328n196J711J307o2742j8053O3843q814r1864M9607j8889
10873b32024J3262L9430J18789J28006l6084n5059m2506m0279J9897r8155J7246
10862a67477o412P3317J12990m194m7654R0808J08425r4132o9875N6339N1295
$$ y = [-75756, -80563, -61449, -114050, -179966, -220959, -157035, -162662, -172921, -118792, -144916, -78285, 44029, 79536, -54298, -249186, -258022, -149878, -121937, -173880, -192774, -60449, 43128, 45401, -42776, -70260, -21234, 21382, -6060, -5705, 38609, 19342, -60025, -104332, -85188, -72258, -126527, -128160, -99802, -18702, -30046, -45598, -59542, -72074, -140945, -164422, -148490, -214620, -258489, -319283, -220373, -155569, -120585, -117215, -112475, -73253, -48571, -72032, -56715, -2786, 20879, -55606, -142934, -148130, -146419, -145112, -207854, -225907, -162064, -170878, -262742, -213135, -232024, -218762, -179332, -60543, 67463, 31379, -23680, -66186, -106465, -86568, -184723, -167477, -173889, -100572, 12418, 8224, -39430, 51378, 159803, 65671, -4204, 52135, 103430]
10851A03430k0862l9881J9727P23J8264r406q9773m406L3371K0609o9375M4572
10839F993K6908k6582O2961L7223L8897J7883q4888o5515N2771M4455r9518j03824
10827i2236o4965K4475L276l5063J0133j9041N7141L2972m7009k9937J3725o640
10815a53169J1611O8513k5800r509M8053o4383q7135K3696J3157L884l6894o2783
10803b70759L3533M4560m3296P6363J15359Q569k7657k7162n9368j8363L9252
10792a28969o8691M804N224M0387J1028n369Q7437j05597q1551j09102N1630P8955
10780b19814N5556m9463k7705l8385l6085l6530p603J34876k2075r9054k7124
10769c73406L5408J98N9011K4612M6373K8963O7682M5793K2475k5796k3171K0063
$$ y = [103430, 82568, 42687, 62414, 63137, 81401, 71995, -17778, -22184, 11187, 31796, -37579, 6993, 33901, 7319, 70280, 107503, 146400, 164283, 79395, 13880, 66651, 111106, 11588, -92236, -157201, -132726, -129450, -164513, -154380, -173421, -116280, -83308, -130317, -160254, -146529, -153169, -141558, -73045, -98845, -108354, -60301, -124684, -211819, -188123, -174966, -171082, -207976, -270759, -237226, -192666, -235962, -159599, -44240, -35671, -63328, -90490, -149858, -168221, -128969, -197660, -192856, -187632, -147245, -136217, -141586, -54149, -159746, -241297, -350399, -298769, -219814, -164258, -213721, -241426, -279811, -315896, -352426, -360029, -225153, -247228, -346282, -373406, -337998, -337800, -278789, -254177, -207804, -178841, -111159, -65366, -42891, -68687, -91858, -71795]
10757g1795L1293j11554m6395m9629j6240p2900j12042j4694J76601K3431N5910
10746b08014J17536K5502n3720m7989r6652o3150j02560M4892L8740J3862N1844
10735b79709M3930p498j1661n115n0394o8603j4810L6399k27j542R6733N0208
10723b12289j974J5260k1623l7218O2307o1403L873k4888O6831J06182p166l6360
10711a48468q5341m8038n4260J15999M6651m734J4299r337l7105p0398M2805Q5338
10699a52589M3926J9294j15183r2331M4336j0308L9897L8827n6888R6542j00712
10688b45189p7050Q729l0253k0414O0855k34m479M3238j6403n0558L3431j5591
10676c13918N7189J16607J47261j33500k32932P4034Q9358L3158o1892p4110Q1918
$$ y = [-71795, -40502, -152056, -198451, -248080, -264320, -337220, -449262, -463956, -287355, -263924, -208014, -90478, -64976, -118696, -166685, -263337, -326487, -429047, -384155, -345415, -331553, -279709, -235779, -243277, -254938, -260053, -310447, -379050, -393860, -357461, -357688, -359230, -262497, -212289, -214263, -199003, -220626, -257844, -195537, -256940, -253067, -277955, -211124, -104942, -112108, -148468, -233809, -281847, -336107, -220108, -173457, -178191, -163892, -173229, -210334, -280732, -237927, -152589, -108663, -89369, -204552, -296883, -252547, -262855, -222958, -184131, -241019, -144477, -245189, -322239, -313510, -343763, -364177, -303322, -303556, -308035, -264797, -281200, -331758, -298327, -313918, -256729, -140122, 7139, -126361, -359293, -285259, -195901, -162743, -224635, -298745, -216827]
10665b16827L5796l1920n4291m345r8807M1742l1941O1030P6111O026J22794l4140
10653a28772n6248m6519K4766j2394O4064N1901Q608N475N3145O0015p7682j6081
10641f9722K1443J22490m4094k2057N2633J14240K38458J75565K18401K27422
10631A034779K51810K91345K53085L06381K48439K23015L40517N32051O97060
10622D178482R39958J194114J785658K625237L674141N175285O899993Q411733
10614C4884601Q736790O813028L207269m19678k755217k890325j487045Q67835
10606D6957258M073634Q258502J3031412J7212811J7693202J2232152K720768
10599A22179739o334262j1038199j0604826p052767k007100L878273J0465473
$$ y = [-216827, -181031, -212951, -267242, -271587, -370394, -328652, -360593, -299563, -223452, -217426, -94632, -128772, -185020, -231539, -206773, -219167, -155103, -103202, -94594, -89119, -35974, 24041, -53641, -69722, -48279, 74211, 30117, 8060, 60693, 174933, 413391, 588956, 807357, 1034779, 1286589, 1577934, 1831019, 2137400, 2385839, 2608854, 2949371, 3481422, 4178482, 5118440, 6312554, 8098212, 10723449, 14397590, 19572875, 26472868, 34884601, 43621391, 50434419, 53641688, 53222010, 50466793, 47576468, 46089423, 46957258, 51030892, 59289394, 72320806, 89533617, 107226819, 119458971, 122179739, 115845477, 104807278, 94202452, 87149685, 85142585, 89020858, 99486331]
10592I9486331J7358971K2556541K1496307J1912950k580024j5209754k1062831
10585A33958491j9796265j4892562q755939k673120L337769Q717637J2139526
10578A12035537J0587198L421718o340429j4074149j6938149j5209149j1452040
10571F2030537p261106l528393m18355K087303L177408K287610p76692m770230
10563E2828082p589839q408662p759367o339153m774985l504707k691626j942654
10555I817089j339443j146149r42412p50088n31662m84842m18746k93644l51723
10546C558380l88695k05276j22028k58559j04469J4102j17416r3102o4322r8173
10536B120442r6181j02785k11132p0443L6092R9190k5222j12852o2842O87J03421
$$ y = [99486331, 116845302, 139401843, 160898150, 172811100, 170231076, 155021322, 133958491, 114162226, 99269664, 90513725, 87840605, 91178374, 99896011, 112035537, 122622735, 126044453, 119704024, 105629875, 88691726, 73482577, 62030537, 54769431, 51241038, 50822683, 52909986, 56087394, 58375004, 57598312, 52828082, 45238243, 36829581, 29070214, 22731061, 17956076, 14451369, 11759743, 9817089, 8477646, 7331497, 6389085, 5638997, 5107335, 4622493, 4203747, 3910103, 3558380, 3169685, 2964409, 2842381, 2583822, 2479353, 2493455, 2376039, 2282937, 2218615, 2120442, 2024261, 1921476, 1710344, 1639901, 1675993, 1775183, 1749961, 1637109, 1574267, 1574954, 1678375]
10525A678375J06370q0205m5690J308P1107N3224l5540o7959j10818j27850k7638
10514A414684n9452q2963k1323p2826l8311p4801n2782p8355j29554m0331R3140
10503H57126L3547j17736n6366l5847L4380J49816R2104m7021r1538m7506N8133
10492H29092j633K7450N0374Q283m4262P8993R4726O2384K13215J53746K10921
10481A683289L05525K42808K66266K58888L13552J66114J06454K8143J07102K5681
10471C503822j25427k40148l19753k92102l86684l98812l04139o4395l1039k05001
10461A136322j37978o514o7529m031n77N360n1392j37318j31044M9418k1227m0727
10449E92763K7800p6187K8901R5927j5163l1623m8015j14293k4407p982P107m8203
$$ y = [1678375, 1784745, 1704540, 1658850, 1660158, 1731265, 1784489, 1748949, 1680990, 1570172, 1442322, 1414684, 1355232, 1272269, 1250946, 1178120, 1139809, 1065008, 1012226, 933871, 804317, 763986, 857126, 890673, 772937, 716571, 680724, 715104, 864920, 957024, 910003, 818465, 770959, 829092, 827459, 854909, 905283, 913566, 869304, 948297, 1043023, 1105407, 1318622, 1472368, 1683289, 1988814, 2231622, 2497888, 2756776, 3070328, 3236442, 3342896, 3371039, 3478141, 3503822, 3378395, 3138247, 2818494, 2526392, 2139708, 1740896, 1436757, 1372362, 1341323, 1136322, 998344, 991830, 924301, 920270, 919693, 925053, 873661, 736343, 605299, 654717, 633490, 592763, 620563, 544376, 573277, 669204, 654041, 622418, 574403, 460110, 435703, 427721, 434828, 386625]
10437C86625r8419m6086J38178O2331o8445m1335L5649k1433O805o0180L3083
10426C26773q5544J1475R6006L5805K0670j06820j39020K2920J09111N1873K64
10415C43513O3952l8699M403O9791n8184r3839P1141N642n7238j10820l3690L3035
10403A99007J5075M9614m8096K6006O3309O4814j02499o9292O5745P8032O0535
10392D02250m0735j12378j5834K2569J7218N1543J7726J02971j7986j38251j10179
10381A78914J9657J11869L132j00102O268L1748l6014p2033K5203P9519O896r4725
10369A60332j9059J383m3755j8778m8555P1099P7613N5918q6307O9648l8373K7971
10357B09137q8821j4674J03049J31108n6471n8062l9371k7952q4818q193O1225
$$ y = [386625, 288206, 242120, 380298, 442629, 374184, 332849, 368498, 347065, 353870, 293690, 326773, 241229, 252704, 348710, 384515, 405185, 298365, 159345, 182265, 291376, 343249, 343513, 407465, 368766, 373169, 442960, 384776, 290937, 362078, 367720, 310482, 199662, 165972, 199007, 214082, 263696, 215600, 241606, 304915, 369729, 267230, 197938, 263683, 341715, 402250, 361515, 249137, 233303, 255872, 273090, 324633, 342359, 445330, 427344, 289093, 178914, 198571, 310440, 313572, 213470, 219738, 251486, 215472, 143439, 168642, 248161, 255057, 160332, 141273, 142656, 98901, 80123, 31568, 102667, 180280, 236198, 149891, 219539, 181166, 209137, 120316, 105642, 208691, 339799, 283328, 225266, 185895, 157943, 73125, 64932, 126157]
10346A26157J16926l8369j54544p55O1675P0227R8340Q203k3859J221N8306M3644
10334C67172r3148j6662K0667L493j4851K846o9010P9085N2238Q2818L7740j19757
10322C32631l9723Q5387K4742Q4190J53414J37463J41142L96981N45170N08592
10312B369989K45586r0250m15548m46273l55764l56028l14581j05159j08858j42325
10302B80789k626p2142k30R2645k4728o0744N15o9739p4444n2358o565J25931
10290A36304n463p9388K1926j6674R4897k9201j07592l7509l2488p0646O513M5741
10278g3580O6060n1785Q5305J23516L2282L5000q5203j07550l4289J05327N1153
10267A46236L5424k8995o4693P93L304j305l5402n0195N622K6914j07405j40896
$$ y = [126157, 243083, 204714, 50170, 49415, 111090, 181317, 279657, 287860, 264001, 265222, 323528, 367172, 274024, 257362, 278029, 281522, 266671, 269517, 200507, 279592, 331830, 414648, 452388, 332631, 292908, 378295, 403037, 487227, 640641, 778104, 919246, 1316227, 1861397, 2369989, 2615575, 2525325, 2109777, 1663504, 1307740, 951712, 637131, 531972, 423114, 280789, 278163, 206021, 205791, 298436, 273708, 212964, 213479, 143740, 69296, 16938, 10373, 136304, 130841, 51453, 73379, 56705, 151602, 122401, 14809, -22700, -55188, -125834, -119321, -73580, -7520, -59305, 26000, 149516, 181798, 216798, 131595, 24045, -10244, 95083, 146236, 181660, 152665, 87972, 88765, 92069, 90764, 55362, 5167, 10789, 37703, -69702, -210598]
10255b10598J16065J46371L1231p319N7303O4142m5355k9349o6120l4645K4094
10244D5820j5831L2252J14132N7881L8019N7246j2071j26316r4654M3058J1607
10233A51143J7146j641n320R7435L5998r9301r2409K7631k1866q8933m6475J3668
10221a2924K3836j6839L5142L4799n2083M005N0763Q1193j6066o7499l5020M3289
10209G2596k9264R156K5784N6564J2000R997R2053M7277q3320p9497K7922J17278
10197B78546m950K0816Q4034q5859j38893J812m911N5135o5067n008J17338N4039
10185C07032p4154J0062O0R374M8731J12818O3409N0137J15918P0129p3944J9650
10173F59222M3839K1580m7979m9212L8699M3225O9352J15042M3505J42122l198
$$ y = [-210598, -94533, 51838, 83069, 75750, 133053, 197195, 151840, 122491, 56371, 21726, 45820, 29989, 62241, 176373, 234254, 272273, 329519, 317448, 191132, 96478, 139536, 151143, 168289, 166648, 161328, 258763, 294761, 195460, 103051, 130682, 108816, 19883, -26592, -12924, 10912, -5927, 29215, 64014, 11931, 15936, 66699, 147892, 131826, 64327, 29307, 72596, 43332, 52488, 78272, 134836, 146836, 156833, 248886, 296163, 212843, 133346, 161268, 278546, 273596, 294412, 378446, 292587, 153694, 155506, 150595, 205730, 140663, 135655, 252993, 307032, 232878, 242940, 243000, 252374, 301105, 413923, 477332, 527469, 643387, 713516, 639572, 659222, 703061, 724641, 676662, 627450, 666149, 709374, 778726, 893768, 937273, 1079395, 1076197]
10162A076197k6636j3221q2762r7258j929J77496J44073R4614L999J42528J02674
10151A519775R9152j17233k32138o3012k2788l0828J0495J33898J13646Q0008
10141A490975O6722m8032J2490k047k981J82757p0936q1953L879R4086Q4971n0712
10129A679219q7244L6424l0769j74322j21196k6149J63103J1528O0166J05626
10119A616386J58083J25025J47558J81905N0108J82035L50172J25751R9520K46039
10109C282582L01945L10670K78690L32583L83917L28836N58050O39309O70245
10100G086827P83216R76653J248543J406981J517697J687064J899613J968583
10092A8575177K245438K588486K920267L411681M324717N667800P850879J0915568
$$ y = [1076197, 1049561, 1036340, 953578, 856320, 854391, 1031887, 1175960, 1270574, 1274573, 1417101, 1519775, 1618927, 1501694, 1269556, 1206544, 1183756, 1152928, 1163423, 1297321, 1410967, 1490975, 1557697, 1509665, 1522155, 1520108, 1517127, 1699884, 1628948, 1546995, 1550874, 1644960, 1729931, 1679219, 1591975, 1628399, 1597630, 1423308, 1302112, 1275963, 1439066, 1450594, 1510760, 1616386, 1774469, 1899494, 2047052, 2228957, 2279065, 2461100, 2811272, 2937023, 3036543, 3282582, 3584527, 3895197, 4173887, 4506470, 4890387, 5219223, 5777273, 6416582, 7086827, 7870043, 8846696, 10095239, 11502220, 13019917, 14706981, 16606594, 18575177, 20820615, 23409101, 26329368, 29741049, 34065766, 39733566, 47584445, 58500013]
10084E8500013J5504176K1901234L0297942L8452327M3334242M4440547M1065728
10077B93496209L4831227K6293372J4139495O72114j2951159k4914149l3358726
10070B98208383l9980569m3292228m1787868l6643599k9051571k1729235j6065025
10063F9658288j1844121q825307o634317n095042m035976l272121k788017k488052
10055B4675335k286129k127178j977032j783218j545165j423081j241372j074401
10047A1217759r78947q45595p92896o42867n99142m61154l84967l81643l28639
10038E801909k55994k16620k21672j66067k25867k18955q0200j41656k48596j78742
10028C847540l3723k05357j34315j00364m7988q1590p2827m7569j04994k08281
$$ y = [58500013, 74004189, 95905423, 126203365, 164655692, 207989934, 252430481, 293496209, 328327436, 354620808, 368760303, 369432417, 356481258, 331567109, 298208383, 258227814, 214935586, 173147718, 136504119, 107452548, 85723313, 69658288, 57814167, 48988860, 42354543, 37259501, 33223525, 29951404, 27163387, 24675335, 22389206, 20262028, 18284996, 16501778, 14956613, 13533532, 12292160, 11217759, 10238812, 9393217, 8600321, 7957454, 7358312, 6897158, 6512191, 6130548, 5801909, 5545915, 5329295, 5107623, 4941556, 4715689, 4496734, 4416534, 4274878, 4026282, 3847540, 3813817, 3608460, 3474145, 3373781, 3325793, 3244203, 3171376, 3123807, 3018813, 2810532]
10018B810532j9270m1221r370r181l9272Q120N3845O6532L1951N359p2006n8953
10006B727066j08689j25097q5137j27651j58635l1811j33490k1440n9188j39572
9996A736356j03285K0411k8941o6927N1072n4074m9689k6808j15137j48087j2507
9985A202384L0965L2243J4262n8150q7916o0273j8642q043l8773L9810j8551L9886
9973A069202Q584l3270J09009j42601j11061Q2082N2802l9826j2154o3443J0874
9962I30198o080j35j44831O166Q7565l0584l0984J8560J08223K777l5139m2520
9950H63216o4371J2035N9280Q6981l2803j514K2252J9812j7351p1900q1798R675
9938H03514j1304J6160p3163J8658k270O1858J44556J05025J10719K979p7448
$$ y = [2810532, 2791262, 2750041, 2740671, 2731490, 2692218, 2700338, 2754183, 2820715, 2852666, 2858025, 2786019, 2727066, 2618377, 2493280, 2408143, 2280492, 2121857, 2090046, 1956556, 1935116, 1875928, 1736356, 1633071, 1653482, 1624541, 1557614, 1608686, 1554612, 1504923, 1478115, 1362978, 1214891, 1202384, 1233349, 1265592, 1279854, 1221704, 1133788, 1073515, 1054873, 1046830, 1008057, 1047867, 1029316, 1069202, 1077786, 1044516, 1153525, 1010924, 899863, 981945, 1034747, 994921, 982767, 919324, 930198, 924118, 923983, 779152, 785318, 872883, 842299, 811315, 829875, 938098, 940875, 905736, 863216, 798845, 810880, 870160, 957141, 924338, 922824, 945076, 964888, 947537, 875637, 793839, 803514, 792210, 808370, 735207, 753865, 751595, 813453, 958009, 1063034, 1173753, 1176732, 1099284]
9927A099284k10569j32669j06037l0507n4966O2909k8669k3256M5222o6933k03865
9916C49944k8562J4025O5593L6364J78372R4402j2979m7050m8196m4372p9360
9905D78181n9985J497l0853p2155m2797N1278O0828O1579K6753Q4894J04358p7959
9893E85619j35728k061M2822o8067k9574L1031J3533J05848N677l5312r4621m6940
9881C72227N3420O1450R4255P7170l1117p9232P431R846m1405o4593j8283q8308
9869C52861r9525N5804Q5202k9551n760M7979K2096l2264j09007j6076m5575M0497
9857B66681M2810M798O200p7004P6176K5448r7079N1157n5785j6978J8845L8054
9845B83323k8767J13450J24424k0719r5454p7888O6958N8526q7001P149M953l3215
$$ y = [1099284, 888715, 756046, 650009, 619502, 564536, 627445, 598776, 575520, 620742, 553809, 349944, 321382, 335407, 401000, 437364, 615736, 710138, 697159, 650109, 601913, 557541, 478181, 418196, 419693, 388840, 316685, 273888, 325166, 385994, 447573, 474326, 559220, 663578, 585619, 449891, 447830, 490652, 422585, 393011, 424042, 437575, 543423, 549100, 513788, 419167, 372227, 425647, 487097, 581352, 658522, 627405, 548173, 555604, 565450, 524045, 459452, 441169, 352861, 253336, 309140, 394342, 364791, 359031, 407010, 429106, 396842, 287835, 271759, 226184, 266681, 309491, 314289, 320489, 243485, 319661, 345109, 248030, 299187, 243402, 226424, 245269, 283323, 254556, 368006, 492430, 471711, 376257, 298369, 365327, 423853, 336852, 344001, 348954, 315739]
9833C15739O4438L0227k322N96n2565K6694L1979m0111n6730l0286j01276k9084
9821A57299k5660N3560P5279M582K6579P5525j5351o1638j6291L4383M0908j1953
9809C37222q1618m0693K0781K061N1199n0333j18558J13712K9462p8318K0321
9798B05238J36132k3799j7363k9219p316Q930l7940J1935P5358l5270k7091M9464
9786C09059p5134M1291Q0952K6930l6518n0948r6512N2791M6067j2966q3466p6582
9774A24964J81P9693R8484J5329j4043M9021L9051l6755j47337K6211O8466k6263
9762B77002l7783L0447K5764o4149R8548J12409J460j15314o5482R7847P746r5331
9750B73164m9027O975O1457O2836l9586K8296p5737o744n103o8071L084j5825
$$ y = [315739, 380177, 410404, 408082, 408678, 356113, 382807, 414786, 374675, 317945, 287659, 186383, 157299, 131639, 185199, 260478, 265060, 291639, 367164, 351813, 290175, 273884, 308267, 349175, 337222, 255604, 214911, 235692, 237753, 288952, 238619, 120061, 233773, 263235, 184917, 205238, 341370, 317571, 300208, 270989, 263673, 272603, 234663, 246598, 321956, 286686, 259595, 309059, 233925, 275216, 356168, 383098, 346580, 295632, 199120, 251911, 297978, 285012, 201546, 124964, 125145, 204838, 303322, 318651, 304608, 353629, 392680, 355925, 208588, 234799, 303265, 277002, 239219, 269666, 295430, 231281, 329829, 442238, 443698, 328384, 262902, 360749, 368495, 273164, 224137, 231112, 292569, 355405, 315819, 344115, 268378, 261634, 256531, 188460, 191544, 175719]
9738A75719l6459K7506k6089J6726R1687J2768N102M0055L4519j81103j42424
9727A8007J1328P6002M7316l7599J7961Q026J5185J32494P786O994k3217o336
9715B73947N2024N4060l9065n3607m2759J6503J7646m6822K4966J3249L5696p9789
9703B26049Q5255N7254j52390O800O4089j02140l7149R9490L3238o6100l3603
9692A80793J87811O1381o5090q6578Q1960P2652q17r749J01386M9658J13647L9923
9680G26977P9858J81373J10331J99807K56743J65485K17725J02845P1648o7646
9670B045146j01046n8548j67375k59198j33861j96288j33043j46147j26144q2808
9660F40688N8096r8928k2426k4585k0239L2776O3035Q7076K67015L46676J68153
$$ y = [175719, 139260, 166766, 140677, 157403, 249090, 261858, 266960, 307015, 341534, 160431, 18007, 29335, 105337, 152653, 115054, 133015, 141041, 156226, 288720, 296506, 303500, 280283, 273947, 325971, 380031, 340966, 287359, 244600, 261103, 278749, 231927, 256893, 270142, 305838, 226049, 311304, 368558, 216168, 222968, 287057, 184917, 147768, 247258, 280496, 214396, 180793, 368604, 429985, 364895, 278317, 360277, 432929, 432112, 422363, 523749, 573407, 687054, 726977, 806835, 988208, 1098539, 1298346, 1555089, 1720574, 1938299, 2041144, 2112792, 2045146, 1944100, 1885552, 1718177, 1458979, 1325118, 1128830, 995787, 849640, 723496, 640688, 698784, 599856, 577430, 552845, 532606, 565382, 628417, 715493, 982508, 1329184, 1497337]
9649A497337r9725k33985k91756k20345j07198j32886k1163L5823o1770P009r4852
9638B76489q9496m6291P0525M7524o9390l8792L7478k3536L388n591Q3649O7107
9626C13064l7733j3278K6467Q174k9177m9823j07355q7782M3728P6984o4062J3731
9614I2938P363K2691J33344m2107o9782k2350N5341k0695m2955J751L2785N4959
9602B03283j5177r3548j5315K6079K1932l9264p3035J15742J49132n2054q3980
9591A43795K1704l45K536K6880O6387O0927n0627O0226k6942n6821n6854k002
9579A88864N0496M8303j3344k0444m8985k1280P5397K4782L3587n7839K3526J0374
9567B93437m6888l9816n2641K8288j4147m7945q5367K0626O2128q9026n9316J13113
$$ y = [1497337, 1397612, 1163627, 871871, 651526, 544328, 411442, 390279, 426102, 364332, 371341, 276489, 186993, 140702, 211227, 258751, 189361, 150569, 188047, 164511, 167899, 162308, 245957, 313064, 275331, 262053, 288520, 296694, 267517, 217694, 110339, 22557, 66285, 143269, 79207, 92938, 100301, 122992, 256336, 214229, 144447, 122097, 177438, 156743, 113788, 115539, 148324, 203283, 188106, 94558, 79243, 105322, 127254, 87990, 14955, 130697, 279829, 227775, 143795, 165499, 165154, 167690, 194570, 260957, 321884, 271257, 331483, 304541, 247720, 190866, 188864, 239360, 287663, 274319, 253875, 204890, 183610, 259007, 283789, 317376, 259537, 283063, 293437, 246549, 206733, 154092, 182380, 168233, 120288, 34921, 55547, 117675, 28649, -30667, 82446]
9555H2446l8126N0791J45035m1160n5895k326j5029l3656j3119K9809J10767J2446
9543B31983k7868r6585l760R9365j35759q3596O7062k7463j94O2362L8537l3424
9531I0660q5687n6493J00302J22315K5604j38541Q7746J58264M5636k21030q3196
9520D5580n8206l8361J4051L0990J8360p6077j09120R1279K23067J19867o1057
9509B00373o7142O2824p4754p9427j00267m5776P3387J62815J02421p0485N2741
9498B16710M8689m209l6209n8822k498k472j427L2592n1215o7288l9546q2936
9486d8631p0971j616Q0822L2603K4303l2590J4768J80886M1242o4596L0197M2503
9474B28920K5584J2817k2244o7805k3883J9910k2037o5248j00514k3994J18063
$$ y = [82446, 44320, 95111, 240146, 198986, 143091, 140765, 125736, 92080, 78961, 108770, 219537, 231983, 204115, 107530, 103770, 203135, 67376, -16220, 50842, 23379, 23185, 85547, 124084, 90660, 4973, -51520, 48782, 171097, 196701, 58160, 145906, 304170, 349806, 128776, 45580, -12626, -50987, -36936, -5946, 12414, -63663, -172783, -81504, 141563, 261430, 200373, 133231, 196055, 121301, 41874, -58393, -104169, -30782, 132033, 234454, 163969, 216710, 265399, 261190, 224981, 166159, 163661, 161189, 159762, 192354, 141139, 73851, 34305, -48631, -119602, -121218, -40396, -7793, 16510, -16080, -1312, 179574, 220816, 156220, 186417, 228920, 254504, 267321, 245077, 177272, 153389, 173299, 151262, 86014, -14500, -38494, 79569]
9463G9569R6631j07341p7898N7050M5384l6933k344M5593J267L4274o5884K571
9451G1939l6234k0515p8805o2160K7526N133J21026L6105K391n033N5379K5635
9439A42387L9314l882j12566k5974L4683J31223K3639l4576p0378k355m9988n44
9427G0983P3048k8671N1737l5587q2819k0970j14062L1265O1048O5231L312l5033
9415C9482j1347O8387O7417K6024o9312o6365P8256J27730j8250J0735p4276n3739
9403A24742J7250K2640K9046K1311p4119O6615K8226j57768n6276K3648K253l8948
9391H620m7296J1380M1053j2657o332K1402Q8164P9912r2111m7088O2039K5938
9379A33024M0902j14780k5058O5222Q7090o9l5198J6416n6614K0644P2933l0979
$$ y = [79569, 176200, 68859, -9039, 48011, 93395, 56462, 54118, 99711, 100978, 135252, 69368, 71939, 35705, 15190, -63615, -125775, -98249, -93116, 27910, 64015, 66406, 61373, 116752, 142387, 181701, 177819, 65253, 39279, 73962, 205185, 228824, 194248, 123870, 121515, 71527, 70983, 144031, 115360, 167097, 131510, 48691, 27721, -86341, -55076, 5972, 71203, 74515, 39482, 28135, 96522, 163939, 189963, 120651, 54286, 132542, 260272, 242022, 252757, 178481, 124742, 141992, 164632, 193678, 214989, 140870, 207485, 235711, 77943, 21667, 45315, 47568, 8620, -38676, -27296, 13757, 1100, -5232, 16170, 104334, 184246, 92135, 45047, 107086, 133024, 173926, 59146, 34088, 99310, 186400, 186331, 151133, 167549, 110935, 131579, 204512, 173533]
9367A73533k4138l4528j65394m0879J33279L4543o1796L3544R9213o1515r0153
9356d291o3034M2213l9277J4713K0169r1049j1967R3463O8503P431l445P8409
9344A11838L5753j7039n6228N5306r1936k4323N9770J5665K2276N81n975j68384
9332f2696r9518P5846O603N099M8306j4700n0430P7437J74904M0229r5291j15172
9320i383O4466J05681n1513J3811j8849R432l3187n7143O1285O8125N401n0212
9308A07914K6632l519J493j5645r5841r6875l3999K8345O6216L8286P906J1229
9296D2142M6522J8884n967J3624L5521n0190q0451N2330k2710J8683Q424l0301
9284D6511P2294L6651L9032j6464q2126j08046p7686J0930M1577j9678m1639m9955
$$ y = [173533, 149395, 114867, -50527, -91406, 41873, 76416, 14620, 48164, 147377, 85862, -4291, -67325, -25112, -64389, -49676, -29507, -120556, -132523, -39060, 29443, 36874, 33429, 111838, 147591, 130552, 74324, 129630, 37694, 13371, 73141, 88806, 111082, 111663, 105688, -62696, -162214, -86368, -79765, -74666, -26360, -41060, -91490, -14053, 160851, 201080, 105789, -9383, 55083, 160764, 109251, 123062, 104213, 113645, 80458, 23315, 84600, 152725, 158126, 107914, 134546, 131027, 132520, 116875, 21034, -75841, -109840, -81495, -15279, 23007, 30913, 42142, 88664, 107548, 101581, 115205, 150726, 100536, 20085, 72415, 49705, 68388, 76812, 46511, 118805, 155456, 194488, 178024, 95898, -12148, -89834, -78904, -37327, -57005, -98644, -148599]
9272a48599P0003R0659P3099j62305k4862J6219L0540k3459J8449R8903m579k5226
9260H842p206N7459O1199l7768K7883m6597l4959M4657n5656r425m121m131m075
9247c898m0059j9528J12274P7028o3839l3122k3251M442M908P3461M8083r8609
9235C7890p7712q877K239J03383J13028o5821j56091K4809J2981l5754p099Q4408
9223B7384j9714j02862p2838K6160O188P5727K3518P8052J55588m1086r1858r2004
9211b7745K4192n2846n055N7933Q4364n5985p4534J02152O6735o0440r3396K0425
9199a4200P2283o3883M1392J1303q7453j00182n6778R5979Q0232M7296J1731n0789
9187a3069m5066N4371J18508P5917M1750k3376k4773k9562j29781L2861M3100
$$ y = [-148599, -78596, 12063, 85162, -77143, -102005, -85786, -55246, -78705, -60256, 38647, 34068, 8842, 1636, 59095, 120294, 82526, 110409, 63812, 28853, 73510, 17854, 8429, 4308, 177, -3898, -43957, -63485, 48789, 125817, 61978, 28856, 5605, 10047, 14955, 88416, 136499, 37890, -39822, -48699, -46460, 56923, 169951, 104130, -51961, -27152, -14171, -49925, -57024, 27384, 7670, -95192, -168030, -141870, -135682, -59955, -36437, 41615, 197203, 156117, 64259, -27745, -3553, -56399, -61454, -3521, 80843, 24858, -49676, 52476, 119211, 58771, -34625, -14200, 58083, -5800, 35592, 46895, -40558, -140740, -197518, -101539, -21307, 25989, 37720, -13069, -58135, -3764, 114744, 190661, 232411, 209035, 184262, 154700, 24919, 57780, 100880]
9176A00880j7923M2277o4232k6451L2815m0897M6941O0552J1850m3481O079m7671
9164F0739N0367J11051o5825n6741M1965J4222j9646p8383n1752M0419N9498J51818
9152B57732k2633r5055m4438l1883N3555P421k8128m1289j0992k4202m1851o860
9140b8623n6357L2493M7824r837j25747q2368O46J74144P7950K1498N7451O6755
9128A75829m3629O993K8120k8777l809O9207J2476l4614k4953j40056j26681l1512
9116a41406J31808J57220J5767j54797j7118O6994j37275N079N8268N0805N3020
9105H8365J5321k4418M5783P530K6820m7789o4810j4050K7175o9667K436N9767
9093E2463O6519Q1834m3569n9393J11749n3796j18724J9730L6357K7348J89l4438
$$ y = [100880, 82957, 125234, 61002, 34551, 67366, 26469, 73410, 133962, 145812, 102331, 108410, 60739, 111106, 222157, 156332, 99591, 141556, 155778, 136132, 57749, 5997, 46416, 105914, 257732, 235099, 140044, 95606, 63723, 117278, 124699, 96571, 55282, 44290, 20088, -21763, -28623, -84980, -52487, -4663, -14500, -140247, -222615, -221969, -47825, 30125, 51623, 109074, 175829, 132200, 139193, 167313, 138536, 134727, 203934, 216410, 181796, 156843, 16787, -109894, -141406, -9598, 147622, 163389, 8592, -8526, 58468, -78807, -73728, -15460, 35345, 88365, 103686, 79268, 125051, 132581, 159401, 111612, 46802, 32752, 59927, -9740, -7304, 52463, 118982, 200816, 157247, 97854, 209603, 155807, 37083, 56813, 93170, 120518, 120707, 86269]
9081H6269o9474K2209p1453O588j6460j4314p1730N1988O6035O3026K3992O082
9069H2758p5656j0173M1558J60314N889n0664J30327j2493p2244o1084k3818J6119
9057A30833L0516j9389J2154k8228j70121k4258Q8100N6690l3071k1073r038O0951
9045G4066M4992J5393n1048j02990q2762k3605P4614J93043r8336p4818j5650
9034d7101M3549o8502j06226K8443J45539L2174o7424O9036J01510l6896N482
9023I9584K3308l119L1803O1086k4265p5130q1431L163p2243O2997J36743L4803
9011A97299J9611j4598n5049j8972r603k7468l4551n0861j5984r0977n5049L9951
8999a16251P5187O7623o4987M9362O4040M3381o8837q2422O1259J00209R442r899
$$ y = [86269, 16795, 39004, -32449, -25861, -42321, -56635, -128365, -76377, -10342, 52684, 76676, 82758, 7102, -3071, 38487, 198801, 204690, 154026, 284353, 271860, 199616, 138532, 114714, 130833, 161349, 141960, 154114, 125886, -44235, -68493, 19607, 76297, 43226, 22153, 13115, 74066, 119058, 134451, 83403, -19587, -102349, -125954, -51340, 141703, 43367, -31451, -47101, -3552, -72054, -178280, -149837, -4298, 27876, -39548, 29488, 130998, 94102, 99584, 122892, 119773, 151576, 212662, 188397, 113267, 31836, 34999, -37244, 25753, 162496, 197299, 216910, 202312, 147263, 128291, 118688, 91220, 56669, 5808, -10176, -101153, -156202, -116251, -41064, 26559, -38428, 10934, 74974, 118355, 49518, -32904, 28355, 128564, 138006, 128107]
8987A28107j0642K8487k5022o6124q133r8353L1279K8265J3157M7322M7769J16801
8975B32913n877r8182j35078p9510M120K1130P9837m2874O6912P997L8683L1384
8963A21455p4533q6804P0771m2760N661J9395k8115P8759N5203K2446p8361j4042
8951D9075M851M0982J5710j13165q6465O3282N0630j8567m3858L4130K0382L4700
8939E1687P7072Q5662j31064p4024M4993j3803O2211k5607q0613J078k6223m5566
8927g4197J03522J06886N2189m0924n7507J2725R379n956m07j3849K9556J4527
8915A35944j16291j9443K8054j05314l7084O9381M6081K379j06952J7331o5846
8904a51760L1573J97113J80456q4576j13416O0396Q917m9743Q477m4203P50Q6469
$$ y = [128107, 117465, 145952, 120930, 54806, 46673, -51680, -20401, 7864, 21021, 68343, 116112, 232913, 227036, 128854, -6224, -85734, -81614, -60484, 19353, -23521, 43391, 51388, 90071, 121455, 46922, -39882, 30889, -11871, -6210, 13185, -14930, 63829, 119032, 141478, 63117, 49075, 53926, 94908, 110618, -2547, -89012, -25730, 24900, 6333, -37525, -3395, 16987, 51687, 128759, 214421, 83357, 9333, 54326, 40523, 102734, 77127, -3486, -2408, -28631, -74197, 29325, 136211, 188400, 147476, 89969, 102694, 112073, 106117, 105710, 91861, 121417, 135944, 19653, 210, 28264, -77050, -114134, -44753, 1328, 3707, -103245, -85914, -151760, -120187, 76926, 257382, 172806, 59390, 119786, 128703, 78960, 87437, 43234, 43984, 130453]
8892A30453k011n6333l8823r1967j53650K5396N9279K5354l8872K5309P463P551
8880a00851N152P3584M6826n3180K7664K5700J803j3215k1170r523J5475m3690
8868d5425o6610k7670O7569p295J00287K3717o6444n8892j09363R3327N5044k3761
8856f5516O0318J19653J0166M3165M3448r8389n9482m724J1536j1394J07621M2005
8844A98407l8993k8392n7939O3868Q4284J27437Q5421n1305j31459j22273j26728
8833B328j09904O0684J81078Q0432j50347n8873M6357J0346j01364n4409M795
8822h8877N3816k0475J3340O5217K4614P3591k7593o7373K4515L2992m5763m3632
8810e628k4520l3987J21192N9048n3894o1255o5705n0563J02995P3378j6755l424
$$ y = [130453, 128442, 72109, 33286, -58681, -212331, -186935, -127656, -102302, -141174, -115865, -108402, -100851, -95699, -22115, 24711, -28469, -805, 24895, 26698, 13483, -7687, -17210, -1735, -45425, -112035, -139705, -72136, -79431, 20856, 44573, -21871, -80763, -190126, -96799, -41755, -65516, -5198, 114455, 124621, 167786, 211234, 112845, 53363, 48639, 60175, 48781, 156402, 198407, 159414, 131022, 73083, 136951, 221235, 348672, 434093, 382788, 251329, 129056, 2328, -107576, -46892, 134186, 214618, 64271, 5398, 51755, 62101, -39263, -93672, -88877, -35061, -55536, -42196, 23021, 47635, 121226, 93633, 26260, 50775, 83767, 38004, -5628, -30148, -64135, 57057, 116105, 62211, 956, -64749, -115312, -12317, 61061, 44306, 40882]
8798D0882N7002P9905j8629n3861r1403m29k5138n8796O2718j8854J1602l2338
8786d7339l488K4691k1478M9170J00395j6476q7884l8856j3222j7741J51660J15925
8774A95357r1382n5493O2669q2454j2080K6979l9057m3063l87j4752O2698R9952
8762A08987L6320O138o2855p3545q7874J0372J00114M2374j09649O2042l8185
8751e761r8616j41969K5481J30379P5011m1013p655M2114Q2706N8030K9900l2213
8739A16394r6534l9625m2675K9808N1448Q983r2304l0748J1456o2297m2557J16448
8727g2203J21846k0388K3921n4139L9827J0491J8977k7555K5093m6462j07753
8716h8345o3500R2341R4039l9794J9772J4941o986N8355L5642k5066J360q9184
$$ y = [40882, 97884, 177789, 159160, 105299, 13896, 13467, -11671, -70467, -7749, -26603, -15001, -47339, -50827, -26136, -47614, 1556, 101951, 85475, -2409, -41265, -54487, -72228, 79432, 195357, 103975, 48482, 111151, 28697, 16617, 43596, 4539, -38524, -38911, -53663, 9035, 108987, 145307, 151445, 88590, 15045, -72829, -62457, 37657, 80031, -29618, 32424, -5761, -104377, -246346, -220865, -90486, -15475, -56488, -64143, -22029, 60677, 118707, 148607, 116394, 19860, -19765, -62440, -32632, 18816, 27799, -64505, -95253, -83797, -146094, -188651, -72203, 49643, 29255, 53176, -963, 38864, 49355, 68332, 40777, 65870, 19408, -88345, -151845, -59504, 34535, -5259, 14513, 29454, 22468, 80823, 116465, 91399, 92759, 3575]
8704C575q3045j0731P3334k2065k0103O6150M2532k172o4792M2306K0617o0081
8692a4475N8326K9718J2544p337M468N9509m00m2768k6044j5469n988Q0154l922
8679A28316q9875n1580o7972m4576j5396R1952J7763l7559j1441k9606M5586N8780
8667e608k6398J4047l782j01739K2651J23027J669q9604j5345L1881L9216n2087
8655f2072L568Q719J6447K2420J3550J3755l7117j678K8143K0398O5706l9981
8643E1858n7946j8521K2610N3481o1498K824j1339J8244M4297L8538n4846p144
8631B0558N1407k3328M1660K2788n3107r6550r0660k8995J23638L4857o8193P860
8619e8065P1295L3637R2196r7601k0711j515J4123M448p908M6177P6464J3893
$$ y = [3575, -79470, -90201, -16867, -38932, -59035, 7115, 49647, 47475, -17317, 24989, 45606, -14475, 43851, 73569, 86113, 78776, 83244, 142753, 142353, 99585, 73541, 58072, 52084, 132238, 128316, 38441, -13139, -81111, -125687, -141083, -49131, -31368, -68927, -80368, -109974, -64388, -5608, -32006, -17959, -21741, -123480, -100829, 22198, 23867, -65737, -81082, -49201, -9985, -62072, -58504, -49785, -33338, -10918, 2632, 16387, -20730, -22408, 5735, 26133, 91839, 51858, -6088, -24609, -1999, 51482, -10016, -7192, -18531, -287, 44010, 82548, 27702, 20558, 71965, 48637, 90297, 113085, 59978, -36572, -127232, -156227, -32589, 2268, -65925, -58065, 13230, 46867, 139063, 41462, 20751, 19236, 33359, 37807, 29899, 76076, 152540, 166433]
8607A66433K2708n5407J7622K1063j1378o5369o9661L5172J455j05547m8918N2067
8595c9760M9678K2719L3403K9276n181M7045J2799O94l5942P181l3676l1911m0643
8582A5682n5522p5345p5085K2608P2931M0582M3612J0566M0930P7415k2065l5609
8570F0700j6675k2443P200K9062k5676L6053N8837m1370q96O3122K7038j09867
8558F5085p842l665k5762j20915k1953L2920P2495O0559m9318J00290J31144l9356
8546A93682q0507j06054m3041m1801k0031J4279J49974O3569j00922j23858L6871
8535e7839J48312M616l7693J8322r8788n1812K7634N6690Q7065p7193m4407J4361
8523a0732j5910J7951L7537N3366K1571O2792j5003q6695r8724q5601L9504J13260
$$ y = [166433, 189141, 133734, 151356, 172419, 161041, 95672, 26011, 61183, 62638, -42909, -91827, -39760, 9918, 32637, 66040, 95316, 90135, 137180, 149979, 150673, 114731, 121912, 88236, 56325, 15682, -39840, -115185, -190270, -167662, -94731, -54149, -10537, 29, 40959, 118374, 96309, 60700, 44025, 21582, 28782, 57844, 32168, 68221, 127058, 85688, 84792, 147914, 174952, 65085, 57243, 53578, 27816, -93099, -115052, -82132, -9637, 50922, 1604, 101894, 233038, 193682, 113175, 7121, -35920, -77721, -97752, -83473, 66501, 130070, 29148, -94710, -57839, 90473, 95089, 57396, 75718, -23070, -74882, -47248, 9442, 96507, 19314, -25093, -10732, -26642, -8691, 28846, 82212, 103783, 166575, 151572, 64877, -33847, -119448, -79944, 33316]
8511C3316J01845J360N0943j5457q8435R496J9565J0369n0811l7670k5057l4998
8499b5534P3277P3371o1306j6682P0972P118j12707l6486J49660P399m68M6408
8487A75022L8056j03457n5215j4741j11027K953R4207j1037L6276J1679m9762
8476A2954j8932L3311L4256q4488K289n985L9950k7625n774n7815N8562j0607
8464b9904j6161l8428L5816J29674Q6677N6365n2245j28146p4836K3561j0448
8453a8075p7950l9722R098j4855R6085k0617K6060o423r1501k446J7211N1495
8441g1640l5981K1802L949J85Q6140O8935l848K993N9005N5802r1648o3366o5513
8428c3185J2778M4689l2441n1042N085m8311l3549j336L8802J42465M1308o1217
$$ y = [33316, 135161, 136521, 187464, 172007, 83572, 93068, 112633, 123002, 72191, 34521, 9464, -25534, 47743, 121114, 59808, 43126, 114098, 121216, 8509, -27977, 121683, 129082, 128614, 175022, 213078, 109621, 54406, 39665, -71362, -68409, 25798, 14761, 51037, 62716, 12954, -5978, 27333, 61589, -22899, -20610, -26595, 13355, -14270, -20044, -77859, -19297, -29904, -46065, -84493, -48677, 80997, 167674, 224039, 171794, 43648, -31188, -7627, -18075, -96025, -135747, -126649, -141504, -45419, -66036, -39976, -46399, -137900, -140346, -123135, -71640, -107621, -85819, -81870, -81685, 4455, 73390, 69542, 72535, 131540, 187342, 95694, 32328, -33185, -20407, 24282, -8159, -59201, -54116, -102427, -135976, -137312, -98510, 43955, 85263, 24046]
8416B4046o5786p6934O8846J18670J4085q615K7963M3710o6561r2098N8028l1724
8404A3630k3193J554J5525j3128K9800l4514j8769j5818L2307j4615Q3532p9950
8392b3639k9071l196n580k3929J47940N2942o9050q8669n1637j933K9956K0846
8380d5020J7227K739l8779n2492K6040n009M9834J392O6909M0518j6899j12627
8368f6167K111K9720R7050q8636m1489k1908j04148N0949J47145M6674j06815
8357e5514j3808J0564K6466M8917j740o1530o2210O5866J22324l8513n6707N760
8345a0125J6078r9935K9126P3923K0605m6814j44680J11840L1784j8591P4280
8334C7491J66909m1321l5511n0053o4343N1068l7602o3439n7335N9337Q5898M6388
$$ y = [24046, -41740, -118674, -49828, 68842, 82927, 74312, 102275, 145985, 79424, -12674, 45354, 13630, -9563, -8009, 7516, -5612, 24188, -10326, -29095, -44913, -12606, -27221, 56311, -23639, -52710, -55906, -61486, -85415, 62525, 115467, 46417, -42252, -93889, -95822, -65866, -45020, -27793, -25054, -63833, -116325, -90285, -95294, -45460, -44068, 22841, 63359, 46460, -66167, -64056, -34336, 62714, -25922, -67411, -89319, -193467, -142518, 4627, 51301, -55514, -69322, -58758, -32292, 16625, 14885, -46645, -108855, -42989, 79335, 40822, -15885, -10125, 5953, -93982, -64856, 9067, 29672, -17142, -161822, -49982, -18198, -36789, 37491, 204400, 163079, 127568, 77515, 13172, 64240, 26638, -36801, -94136, -34799, 51099, 97487]
8322I7487K7734j486j2717k4004L7525P381L2311N4705n7573N069j0570o977l3837
8309A15048n3758N594P7327L3851j71243n5269J06058o5644J3879K122n8623J2760
8297c7898J9926p052j00637q0868O6335M4707N7200k9218n4889K7321J8180J3511
8285f3382L1654J32861J08650j42225j89859n8554n1207j8851O0549J11891m6888
8274a25361j2245N7032J7506n0583k0873L9092J76038M4657q2810k9695P7833
8263I0591P7898l4938k5647o8256j3758r8173M5004M5079N2663K7215l8815m9135
8251I728n8211Q3022N1519n6165j9317K7086O7582K7881j6511J5088n8066o0329
8239A3307j3315M0638j18269p277J17630J11791m4883L1705j3197l1828l9983
$$ y = [97487, 125221, 123735, 111018, 87014, 124539, 131920, 164231, 218936, 161363, 166432, 155862, 148885, 115048, 61290, 66884, 144211, 178062, 6819, -48450, 57608, -8036, 5843, 7965, -50658, -37898, -17972, -25024, -125661, -206529, -140194, -95487, -38287, -67505, -122394, -95073, -76893, -63382, -31728, 101133, 209783, 67558, -122301, -180855, -232062, -250913, -190364, -78473, -125361, -137606, -80574, -63068, -113651, -134524, -95432, 80606, 125263, 42453, 12758, 90591, 168489, 133551, 107904, 39648, 25890, -72283, -27279, 17800, 70463, 97678, 58863, 9728, -48483, 34539, 86058, 29893, 10576, 37662, 105244, 133125, 116614, 131702, 73636, 13307, -8, 40630, -77639, -84916, 32714, 144505, 99622, 131327, 118130, 86302, 46319]
8228D6319Q3560J29660k2504j51770m2607L4069Q292k4634N2363m8011k2581l9196
8216B960j9730m4779o3917K5589p553P292P5185j8453n8235j8908M0910J02448
8204B2809N0808r3427Q778L3011j7400J7505L1629n1745j40090n4782K7874O1108
8192a03922N5719J0941l6737J5652J19051N4206J3161l8876o0720J5914n1161
8181f772N581l0718j13210n0176O7962J75871p5990n7992M3634M5953M0038j6661
8169B7520n9532k658j8241n7252j05058O9500N3556J08219j7985K8235j9184N0225
8157E7345K8795p460j16403p0221J03046Q3763N9120j1221r3840j27055q554N7028
8145d5657R374p0357M6384m778J6745R6353M4032q216L4529L4645j14189j00066
$$ y = [46319, 129879, 259539, 237035, 85265, 42658, 76727, 85019, 60385, 112748, 64737, 42156, 2960, -16770, -61549, -125466, -99877, -107430, -100138, -24953, -43406, -101641, -120549, -79639, 22809, 73617, -19810, -11032, 21979, 4579, 22084, 53713, 1968, -138122, -192904, -165030, -103922, -48203, -37262, -73999, -58347, 60704, 114910, 128071, 89195, 28475, 44389, -6772, -1191, -31909, -145119, -195295, -127333, 48538, -27452, -85444, -41810, 4143, 44181, 27520, -32012, -34670, -52911, -110163, -215221, -145721, -92165, 16054, -1931, 26304, 7120, 57345, 86140, 78680, -37723, -107944, -4898, 78865, 137985, 126764, 32924, -94131, -102685, -45657, -36283, -106640, -60256, -65034, -48289, 48064, 92096, 83880, 118409, 153054, 38865, -61201]
8133f1201R488N3044L1142K4155L5971j2120M9931k5278m0010K7553L3578m0446
8121H5807q0199l5217Q4624M8096m0029k6164j3776q236l7408N054J9534K8303
8109C0389L0864J3787j7377n181M4390m7917j07921k2248J25103J6831l6764j2989
8097A0967o126K9817O2065L7771k8503m808P2362k912j72517J7552P7741j34366
8085d0957l2734L2268J04047J3669j8630N709m0752n7939o7935K0879l2051L1636
8073h2790o4791J9490J9676P9238O576J5898N3914K1537M8093L5787l4534m5783
8061G2311j36293k8435O9341n2675K4563M7165N3868n1690N2429N0935L6115R771
8049A47405j15k6152K0185M9750j7282o8502l4396l8407N7691P8811l7074K7332
$$ y = [-61201, -51713, 1331, 32473, 56628, 92599, 80479, 130410, 105132, 65122, 92675, 126253, 85807, 5608, -29609, 55015, 103111, 63082, 36918, 23142, 14906, -22502, -17448, 2086, 30389, 61253, 75040, 57663, 52482, 96872, 48955, -58966, -81214, 43889, 60720, 23956, 10967, 4841, 34658, 96723, 134494, 105991, 101183, 173545, 170633, -1884, 15668, 93409, -40957, -73691, -41423, 62624, 76293, 57663, 63372, 22620, -35319, -103254, -82375, -114426, -82790, -147581, -128091, -108415, -29177, -22601, -6703, 47211, 68748, 116841, 152628, 118094, 72311, -63982, -92417, -23076, -75751, -51188, -4023, 49845, -1845, 50584, 101519, 137634, 147405, 147290, 121138, 141323, 191073, 173791, 105289, 70893, 32486, 90177, 168988, 131914, 159246]
8037A59246M0062l8028j8175j04914j61996n7479J21883N3111P8954j5927K4137
8026H0874P8644q7301q0347r3193o2464K8572N7031O2019M6960K2715k8981k237
8014B2292n1817R7243m5273o1165k636n5955J0369Q675O0321R3924O7854p77R8511
8001B41566m9712q8389m6850K0288Q3270j3194n3203M6831j28002k3734j4645
7990b5774K431Q7193J6558p4398L785l1168n0505J17955N6896l5861r8960j21677
7978a53525L517J12585Q0565N9097p4561l2117j3365p1073K8142J52234P6017
7967A67516o4420p8079j0701Q5143K0467J4917Q4396n9728q2184l3517m76J2179
7955E5513P7879o3652L522l8651k5370j5979M2635n1136r418M787N3179o8400
$$ y = [159246, 199308, 161280, 143105, 38191, -123805, -181284, -59401, -6290, 72664, 56737, 80874, 159518, 72217, -8130, -101323, -163787, -135215, -78184, -16165, 30795, 53510, 24529, 22292, -29525, 67718, 22445, -38720, -41356, -97311, -86942, -78267, -17946, 75978, 143832, 143055, 241566, 191854, 103465, 56615, 76903, 160173, 146979, 93776, 140607, 12605, -11129, -25774, -23343, 63850, 80408, 6010, 9795, -21373, -71878, 46077, 102973, 67112, -31848, -153525, -150008, -37423, 43142, 102239, 27678, -4439, -17804, -88877, -60735, 91499, 167516, 103096, 25017, 14316, 99459, 119926, 134843, 219239, 159511, 77327, 43810, 43334, 55513, 133392, 69740, 73262, 34611, 9241, -6738, 35897, -15239, -24657, -19870, 33309, -35091]
7943c5091k9522l409J0943L3928J3102J9314J9032J353l719M3820L9589k3503
7931H5837p3694r0608J4153M1212K3261M754J585q026j9142l6919o6378q8856
7919b12821L3608M8793k8695L5319O9228J8453k7164K4877L483l2311n5828j0691
7907a33749P2448J3672Q1046P86M2186n788n1268P2223N1366k666j04369n8186
7895b2299k8377p7130N3230K5588J16003Q2895j4884j60531n7521l356L8684R48
7883d6750N395Q0646O1622j6428k1107o6222n7613P978j7818N8130Q0995o8918
7871i0q9336l0421k1296k0795j1978M6405M3334M2784R348L1906j1585j137m7283
7858f0144K9244k2217J8088J16009l1231o1643O9414q0379j10139k199l5572P4035
$$ y = [-35091, -64613, -68022, -57079, -23151, -10049, 9265, 28297, 29650, 25931, 69751, 109340, 85837, 12143, -78465, -64312, -23100, 161, 4915, 6500, -1526, -20668, -57587, -123965, -212821, -179213, -130420, -159115, -123796, -54568, -36115, -63279, -38402, -34919, -67230, -123058, -133749, -61301, -47629, 33417, 34203, 76389, 70601, 19333, 91556, 142922, 140256, 35887, -22299, -50676, -127806, -74576, -48988, 67015, 149910, 135026, -25505, -83026, -86382, -47698, -46750, -41355, 39291, 100913, 84485, 63378, -2844, -60457, -52479, -70297, -12167, 68828, -90, -89426, -119847, -141143, -161938, -173916, -127511, -84177, -41393, -32045, -139, -11724, -12861, -60144, -30900, -53117, -35029, 80980, 49749, -11894, 57520, -22859, -132998, -135197, -170769, -96734]
7846i6734Q5135j8228K2564j1841n0782O9383O2660K6904M6529j9610Q8514K15
7834B04709k05049l9599M5485n4307j1784R896P5565K5921Q3045J05450j28649
7823A10683r1472M5884K1743l1904j04326k6321j3750J28693R6104k2617q7520
7812B5197p8555k8317j5772P7817N7959o7437K8683M6205l9865l8517o3304R0537
7800e369J57241o5844j35649j18239P323J07256J1481N5022j722l6121P4497k0572
7788B9304p3123q5384r4707o1496K3281P9864K6046R4415R4634M8575j29368m1778
7776h9737J1131m9712p217J32357J54458q1244p7493k6108J1576J6924j0773P834
7764h004L9864J72o3952P5045O4863o1608o8326k5510j3550J05020R037j5645
$$ y = [-96734, -11599, -29827, -7263, -19104, -69886, -503, 62157, 89061, 135590, 115980, 204494, 204709, -340, -39939, 5546, -48761, -60545, -50649, 24916, 50837, 133882, 239332, 110683, 19211, 65095, 86838, 54934, -49392, -75713, -89463, 39230, 135334, 112717, 25197, -53358, -81675, -97447, -19630, 38329, -29108, -425, 45780, 5915, -32602, -95906, -5369, 151872, 86028, -49621, -167860, -160537, -53281, -41800, 13222, 11500, -24621, 49876, 29304, -43819, -129203, -223910, -285406, -262125, -182261, -156215, -61800, 32834, 81409, -47959, -89737, -78606, -128318, -135535, -3178, 151280, 70036, -7457, -33565, -21989, -5065, -15838, -8004, 31860, 32032, -31920, 43125, 107988, 46380, -21946, -47456, -61006, 44014, 53051, 37406]
7752C7406n1037p8146l0909m1678Q5232O4683P736n4546j4883k5273O4826J00591
7740F4002L1156j6497l6488M7186j479k3367P399m526j07327r7450K3097k855
7728a17149J56373J45935L5381N6346n0075j57328l2532O3851l9530n4392O7970
7717G4850J3528p5806o1066n4180k2732O3599J26533L9918L6426r2900n3727L1755
7705B6198q0030K6991l130N3228M746P8267k458m7841K5667K441j2044j1189n5496
7692E350m3015q8073K5880O1845M4522j6586l9988O8832J3336K700q2925o4192
7680a12314N4547n3090n9350L9088Q1791k5328m190j2340k2218O9227j9492m0151
7668a03820K2039Q8595R4864Q402o9742q2654O8706l6964o9761N3384L9681J0164
$$ y = [37406, -13631, -91777, -122686, -164364, -79132, -14449, -6713, -61259, -76142, -101415, -36589, 64002, 95158, 78661, 42173, 89359, 87880, 64513, 71912, 67386, -39941, -137391, -114294, -117149, 39224, 185159, 220540, 276886, 226811, 69483, 36951, 100802, 61272, 6880, 74850, 88378, 12572, -48494, -102674, -125406, -61807, 64726, 104644, 141070, 48170, -5557, 26198, -53832, -26841, -29971, 23257, 28003, 106270, 103812, 55971, 81638, 84079, 72035, 60846, 5350, -37665, -125738, -99858, -38013, 6509, -10077, -50065, 18767, 32103, 34803, -48122, -112314, -57767, -110857, -170207, -131119, -49328, -74656, -78846, -91186, -113404, -44177, -63669, -103820, -81781, 6814, 101678, 110080, 40338, -42316, 26390, -10574, -80335, -26951, 12730, 22894]
7656B2894m9047p0138q4313P878Q0925L1900R7322Q369N1318K479O520l4238k4307
7643D7562J9016q330P0685o606r3201j2202N3906m0595J9940m6287j31475l6170
7631a63757K5962Q9751J0001l980M0915o2371K6253N7046L202P0383P1713q249
7619A56869p5780p4606m3983p0588j7911R1465J37160k260m572O674m4382m6959
7607A1127r5409K4909N8116k9712p2844j5870J16885J919j7663P6524k2270Q339
7595D4051O3702j5135L8850o4469n1824k9335O257j8483p9040m4730K5708R6562
7583b7886R2028K0193r3687J854P7629M8948L0487m2387j27797K5260m4797r6726
7571a36881J4294M072M5570O6225K2808L5747j8572O3129J04883N115p5834j29608
$$ y = [22894, -26153, -96291, -180604, -172726, -91801, -59901, 37421, 45790, 97108, 99587, 106107, 71869, 47562, 66578, 58248, 128933, 122327, 29126, 16924, 70830, 30235, 50175, 3888, -127587, -163757, -137795, -48044, -38043, -42023, -1108, -63479, -37226, 19820, 23022, 93405, 165118, 156869, 81089, 6483, -37500, -108088, -125999, -34534, 102626, 100366, 95794, 102468, 58086, 11127, -84282, -59373, -1257, -30969, -103813, -119683, -2798, -879, -18542, 57982, 35712, 44051, 107753, 92618, 131468, 66999, 15175, -14160, -7903, -26386, -105426, -150156, -124448, -27886, 64142, 84335, -9352, -7498, 70131, 119079, 149566, 107179, -20618, 4642, -40155, -136881, -122587, -118515, -72945, -6720, 16088, 51835, 33263, 96392, 201275, 206390, 130556, 948]
7559I48j7954n9849R086J11731R41j93098K2423P1142k6287N7436M7665n6213
7547c2029o5563l9873N3761L8083m5178P3021j972l2458o7103j430M8083k443
7535g5101M5059L3174J4897K4699N1244j1808o989j938M4151o9673j17387N9524
7523a0148J25910M61l9078k6921j670O4880o9790p8778O676J562k8603Q58J52829
7510I8188J09612K3002n4597p0140j1918J1161m4838j37953m7169P2130L8142
7499a4380Q7543k1800o4135k6095L240K8679R3913o7324r0531N8919K406P738
7487a827K3500k1940j9813r1539p5170J11263L7119n0251L6742P7064N2057J2415
7475H9620k9401o6378l6104j0721o120j8836n008o3891K0131J05344J17917O9906
$$ y = [948, -17006, -76855, -67769, 43962, 44903, -148195, -125772, -54630, -80917, -23481, 24184, -32029, -97592, -137465, -83704, -45621, -90799, -17778, -19750, -52208, -119311, -120741, -72658, -75101, -30042, 3132, 18029, 42728, 93972, 82164, 75175, 73237, 117388, 47715, -69672, -10148, 115762, 116223, 77145, 50224, 48554, 113434, 43644, -35134, -28458, -26896, -55499, -54641, 98188, 207800, 230802, 176205, 106065, 94147, 105308, 60470, -77483, -124652, -52522, -14380, 73163, 51363, -12772, -38867, -35627, -6948, 86965, 19641, -70890, -11971, -9565, -1827, 21673, -267, -20080, -111619, -186789, -75526, -38407, -88658, -51916, 25148, 77205, 89620, 60219, -6159, -42263, -52984, -59104, -77940, -82948, -146839, -126708, -21364, 96553, 166459]
7463A66459o5149n1618n7331k3886P9444k5022M0180M8397o7797p3311J5675P2884
7451E8925J5897l8216j39476j48753k247K21756K62148N1280j40635j08265o9032
7440c6618k4956L3359K5854M4978Q5748J17446o4284j37459o2060n6606m7061
7429a21659M5302L2519n6129m4854N01J03199k3559P060P9601m5831j8019N6795
7417A4926R6162L4905p775n3949j66176m8977l4495L2805J05259r7306m9616O5152
7405a09085O4254j17821o6481K2669j8218M9499J32638J48977j8017j24476n3163
7394h9224P8338k2873L5485N3143J8511N7523k0954j15617k8696P5669j7503j1487
7382A2315n2849n2160o8532O2220O1515m2897J5J9189P2822k539k5902j504J4942
$$ y = [166459, 101310, 49692, -7639, -31525, 47919, 22897, 63077, 111474, 43677, -29634, -13959, 58925, 74822, 36606, -102870, -251623, -253870, -32114, 230034, 281314, 140679, 32414, -36618, -61574, -28215, -2361, 42617, 128365, 245811, 181527, 44068, -17992, -74598, -121659, -76357, -43838, -99967, -144821, -144320, -41121, -64680, -57620, 21981, -23850, -41869, 14926, 111088, 145993, 138218, 84269, -81907, -130884, -165379, -132574, -27315, -124621, -174237, -109085, -44831, -162652, -229133, -206464, -224682, -175183, -42545, 106432, 88415, -36061, -89224, -10886, -33759, 1726, 54869, 73380, 130903, 109949, -5668, -34364, 41305, 23802, 12315, -40534, -92694, -161226, -99006, -37491, -80388, -80373, -61184, 11638, 9099, -16803, -18307, -3365]
7369c365k2317n6547L8270R1775n3847o7445K5392K2091M3431J4067O2348K1732
7357A15585j17917J7534J17985j7881J4954O2370m8083l1240m8473p2807N6445
7346D8472p7663N9875N3791n5638J2074l6081j6956l0719P1096J529k6904Q6448
7334H9324l899k7872P778q4148j65690m3470l6749k7553N2288J24934J34182R9276
7322A18401o9200p2140n8344P981m5555J196J5761J5442R995L8907k7277K3381
7310d1452M594l4444J8028J9827N2463J18575L6124n5787p93N428o7209r5793
7298d0439k9935M1461K7714O8213J0800j2395L4861o8193j4116j0731J8284P2195
7286I7719k8301j6980J2780O9532R150j01100m492O2787J51645j5385j23867q047
$$ y = [-3365, -25682, -82229, -43959, 47816, -6031, -73476, -48084, -25993, 17438, 31505, 93853, 115585, -2332, 15202, 133187, 115306, 130260, 192630, 144547, 113307, 64834, -7973, 48472, -29191, 30684, 84475, 28837, 40911, 4830, -12126, -42845, 28251, 29780, 2876, 89324, 85425, 57553, 65331, -18817, -184507, -227977, -264726, -292279, -239991, -115057, 19125, 118401, 49201, -22939, -81283, -73302, -118857, -117661, -101900, -86458, -76463, -37556, -64833, -41452, -36858, -71302, -53274, -33447, 19016, 137591, 173715, 117928, 117135, 122563, 55354, -40439, -70374, -28913, -1199, 67014, 77814, 65419, 100280, 32087, 17971, 7240, 25524, 97719, 69418, 52438, 65218, 134750, 143900, 42800, 38308, 101095, 252740, 237355, 113488, 105441]
7274A05441j18937n1887o8061P1722J30670J11260n1582j18156k4135N3134l3798
7263E671K2178j09593k2580J49777K7754J245n4290n6907j5638m2851K725K3562
7251f8947j9619r7150N3236j5338o3037J15971J8162O9091J55757o6267j6123
7240F5736L8237M2502K7082n2544m6541N3458j5956j20121N6187m4529l7585K7849
7228f225o4983L7814J32465R1632J9832p8370j15057n4781n5829j27N0283O1481
7216A8135N3100Q334J7728o6726m4775j3245O1610j04569R648L2063M9734N86
7204B1623M9037M5395L3800J9761m7047N4781k5692r1429J013L3263M284K4865
7192A23654m2862k4936j11534J4807J713K3202l8019n3913p3963R129J39061R4937
$$ y = [105441, -13496, -65383, -133444, -61722, 68948, 180208, 128626, 10470, -13665, 39469, 5671, 27849, -81744, -104324, 45453, 73207, 74452, 20162, -36745, -52383, -95234, -92509, -68947, -88566, -185716, -132480, -147818, -210855, -94884, -76722, -7631, 148126, 81859, 65736, 103973, 146475, 173557, 121013, 74472, 127930, 111974, -8147, 48040, 3511, -34074, -6225, -71208, -33394, 99071, 190703, 210535, 132165, 17108, -37673, -93502, -93629, -43346, 18135, 71235, 79569, 97297, 30571, -14204, -27449, 34161, -70408, -60760, -28697, 21037, 21623, 70660, 116055, 149855, 169616, 122569, 177350, 151658, 60229, 61242, 94505, 98789, 123654, 80792, 55856, -55678, -40871, -39158, -15956, -53975, -107888, -181851, -172722, -33661, 61276]
7180F1276K7876l6288k744q6166K9495R1235M4401j36144q5948L3976j4966K1011
7168e2986J10130j3248k7388o8247P0646N1334p5843o1013k123K5063Q801j7213
7156e2087q422j0818J9307j4998j35211J0491Q3720N945J5811j1943N8709J0986
7144b8510O419J23602N6416r5531j45404l8925P6768R161j6117M7633R8701N5357
7132A49570n6580j47763M9542P7309j7142p0818n2427J9707o3229j7200K3180
7121a05851J36355Q6176j14000M7621J18940O1103n6602n2397r9787o0682J8703
7110b0421O626o1968K0654Q5946p3072P636P6037o6601J13933M4837m7562k4005
7098F2040n8094o328R343j00988O316K5787L3686P382k8984M2576l266j8159k840
$$ y = [61276, 89152, 52864, 50120, -36046, -6551, 84684, 129085, -7059, -93007, -59031, -73997, -52986, 57144, 43896, 16508, -51739, 18907, 70241, -5602, -66615, -68738, -43675, -34874, -52087, -60509, -71327, -52020, -67018, -202229, -191738, -108018, -102073, -86262, -98205, -39496, -28510, -22091, 101511, 157927, 62396, -83008, -121933, -45165, -36004, -52121, -4488, 94213, 149570, 92990, -54773, -5231, 72078, 54936, -15882, -68309, -48602, -111831, -129031, -105851, 30504, 116680, 2680, 50301, 169241, 230344, 173742, 121345, 21558, -39124, -20421, -13795, -75763, -55109, 30837, -42235, -34599, 41438, -25163, 88770, 133607, 86045, 62040, 3946, -2382, 6961, -94027, -87711, -61924, -28238, -20856, -49840, -7264, -10530, -28689, -31529]
7085c1529L1331R036l8785o8999l5291Q1694K2159K3269k6505j0106L9950k632
7073f408p578m0964q1124n1943P8280J06655N3879Q0860p5956k2309R137o7189
7061b4660m6575k3896n839l0665J3585k3170m8598N3341J22289k649q2119q6234
7049a85190p8113P3865J59942M3057l0808r2549k5175l2937l2786Q8729J3056
7038i8909l8061J6924j8323M0473M2087m800M7580R066J8058K3745k5179q0508
7026f7847q1238N0324Q6060l4208r0198J36035J25397p7848j0418l9771J4210
7015A0498M4886O92q5490k9275K2558m1387j1508M2155l9187R3260L2351r4654
7003e5101n4111J5944J4368J3454M3662j21491k06308J43226J46737M8729N9906
$$ y = [-31529, -198, 8838, -29947, -98946, -134237, -52543, -30384, -7115, -33620, -43726, -3776, -6408, -13986, -54950, -136074, -188017, -109737, -3082, 50797, 131657, 55701, 33392, 42529, -24660, -71235, -95131, -100970, -131635, -118050, -141220, -189818, -136477, -14188, -16837, -98956, -185190, -263303, -189438, -29496, 13561, -17247, -109796, -134971, -167908, -200694, -111965, -98909, -136970, -120046, -138369, -97896, -55809, -60609, -13029, -3963, 14095, 37840, 12661, -67847, -149085, -98761, -12701, -46909, -137107, -1072, 124325, 46477, 36059, -3712, 10498, 55384, 56076, -29414, -58689, -36131, -77518, -89026, -46871, -86058, 7202, 39553, -55101, -109212, -93268, -78900, -65446, -21784, -143275, -349583, -206357, -59620, -10891, 49015]
6992D9015L9707P0369L8688q9917j22847k1270j4915o42n0796J63423l9474j5045
6980F296p154l3101n6966K1226l9380O5356L6046k8398P6608M3756K4511N6199
6968A64999m0505m3444N3977l9762m665q4192n5653K1600q9464J8748M2175r824
6956f6010J13824J17244k7571p5373J7651m9182p651q942p0099l6713r599l170
6944a05591R0765J4020m1466J8335M1913R3531J7332o3573K4879r2230r6718M4560
6932e4243P9782j1691o4736j00436p4705J1659J1875O7117J83285Q5459j530r2317
6920C9519j220N8213n8370M8919r1532k1271Q4100Q900k5205j03592n4429k0037
6908a36005J5930J0729k9089k7244p1727M0016O7109j4783P1626L4244k7743J05001
$$ y = [49015, 88722, 159091, 197779, 107862, -14985, -36255, -51170, -51812, -102608, 60815, 21341, 6296, -858, -33959, -90925, -69699, -109079, -43723, -7677, -36075, 40533, 84289, 108800, 164999, 124494, 81050, 135027, 95265, 90600, 6408, -49245, -27645, -117109, -98361, -56186, -66010, 47814, 165058, 137487, 62114, 79765, 30583, 22932, 13990, -56109, -92822, -102421, -105591, -14826, -806, -42272, -23937, 17976, 111507, 128839, 65266, 90145, -2085, -98803, -54243, 25539, 13848, -50888, -151324, -226029, -214370, -202495, -135378, 47907, 133366, 131836, 39519, 38299, 96512, 38142, 87061, -4471, -25742, 58358, 67258, 42053, -61539, -115968, -136005, -120075, -109346, -138435, -165679, -237406, -197390, -130281, -145064, -73438, -39194, -66937, 38064]
6896C8064J361K1422l106m8245o6045p7274m5411n6445N7381Q5565M246j3082
6884a01569L9198K9302M1110K7287m3735j3090R4356O7553l8730k2829R7109r7601
6872G8361j39539o777M7412Q4637J9140j16882j1621k8741J7394P03o5209m0922
6860a62044m4278R7629L527k0317j9675K7069J5907Q4572J45905K119j64726p7403
6848a11715J31753J6218L2104Q9619o7960o0725J9968O3618m4463o8625N903o556
6836h61k6830k4796j0588k6749O362N4890N2422P8882m4611L1448m3006r3879
6824d7316K2059j9226k4425k1031M2151R2337K1115o4625k5090p0296m5332j4556
6812a54235j5070O1403j9860J0696L3013R7780P3027K7359J11315j9080j77936
$$ y = [38064, 39425, 60847, 57741, 9496, -56549, -133823, -179234, -235679, -178298, -92733, -88487, -101569, -62371, -33069, 8041, 35328, -8407, -21497, 72859, 140412, 101682, 78853, 175962, 78361, -61178, -67955, -20543, 64094, 83234, -33648, -45269, -74010, -56616, -55913, -121122, -162044, -206322, -108693, -105166, -125483, -145158, -118089, -102182, -17610, 128295, 130414, -34312, -111715, 20038, 36256, 68360, 157979, 90019, 29294, 49262, 112880, 68417, -208, 5695, -861, -27691, -52487, -63075, -89824, -83462, -28572, 23850, 102732, 58121, 89569, 46563, -47316, -25257, -44483, -68908, -89939, -47788, 44549, 65664, 1039, -24051, -94347, -139679, -154235, -169305, -107902, -127762, -117066, -84053, 13727, 86754, 114113, 225428, 206348, 28412]
6801B8412m1220N2661m7846r4274K8780k0780r536J3173n5524n562P5456N660
6789g0600M4046p7937O0210l8221k6820J24527L5617r2607l9830P5005K7678J0098
6777C1166j397m3740l4871p3562l6205L8454k1689R1454M8994r912j44574m4528
6765b00410O3206P5003L143N1836J7560r1916p4913j0938J24115P9847l8647r399
6753a1513k4377L1824o8305M9342q981j2012l2651M9072N6747J4648J29382j77192
6741d016r5314P1867J3783J0756k0879m132L6340k1364J5195n0050j4662K4825
6729c7651k9738M3929O938j3459r947J2524M3245K6665o089M9096J48900n8928
6717A75485q2502n9247l9400o3611n8937J0478J14560M1049M2226L7168n4901
$$ y = [28412, -12808, 39853, -7993, -102267, -73487, -94267, -103803, -90630, -146154, -151716, -76260, -70600, -26554, -104491, -44281, -82502, -109322, 15205, 50822, -41785, -81615, -6610, 21068, 31166, 29769, -13971, -48842, -122404, -158609, -120155, -141844, -50390, -1396, -11308, -155882, -200410, -137204, -62201, -59058, -7222, 10338, -81578, -156491, -167429, -43314, 36533, -2114, -11513, -35890, -4066, -72371, -23029, -32010, -44022, -76673, -27601, 29146, 43794, 173176, -4016, -99330, -27463, -13680, -2924, -23803, -27935, 8405, -12959, 2236, -47814, -62476, -37651, -67389, -23460, -16522, -29981, -39928, -27404, 15841, 42506, 36417, 85513, 234413, 175485, 92983, 33736, -5664, -69275, -128212, -117734, -3174, 37875, 80101, 117269, 62368]
6706F2368l7199L7619o1600m7482N7451N1103K2016l8683j5557k1215m8148m024
6694d3351K9212L12P2570l4056r6096J6866K9978k9083o849N9976L6903l883p7464
6681d4965r6825P2486J52917J6093P36K1956n815l2969J8944n0804m8510l2407
6669b9163p256N6505L9247l1936l1615m4895j72807J3056J63227P3619j7443j16927
6657a06388n672j0558n5579r4403L5623Q2150J7886N6616J17587K2260p0909l3695
6645d5082L9101Q7156P0153K4520o4447m4781l3602J10556j19646j69053Q269
6634a36856R6582K4990l6067o34N2873O9795L900l7378K0790O5800m3045j15938
6622c5188l138J38735L3986L4846l7925J624p6663m4010m6625M9038M1927r827
$$ y = [62368, 25169, 62788, 1188, -46294, 11157, 62260, 84276, 45593, 30036, 8821, -39327, -43351, -14139, -13827, 58743, 24687, -71409, -54543, -24565, -53648, -60497, -521, 36382, 32499, -44965, -141790, -69304, 83613, 99706, 100442, 122398, 116583, 83614, 102558, 51754, 3244, -29163, -36419, 20086, 59333, 27397, -4218, -49113, -221920, -208864, -45637, 27982, 10539, -106388, -112060, -122618, -178197, -272600, -236977, -154827, -136941, -80325, 37262, 59522, -11387, -45082, -5981, 81175, 151328, 175848, 111401, 66620, 33018, 143574, 23928, -145125, -136856, -40274, -15284, -51351, -51985, 888, 70683, 74583, 37205, 57995, 123795, 80750, -35188, -38326, 100409, 134395, 169241, 131316, 132940, 56277, 12267, -34358, 14680, 56607, 46780]
6610D6780N3222Q0174N6990o6182k2702M3270l9544p6412r6917N1337q5995R7083
6598D1104J19981k5857q2157n2855Q9443R3145o2186l7024o0814j1349K4049L9525
6586G5005o3116K9436k3864J5386k4609O3699O2440Q7525j2340j48507l2213J4220
6574D3062O0056R575p8243l0097j8744K2344N7334L4276o4186N9434K4740l6826
6562H2725O1402L7390j09716n8392P0595N7565o559o475m5459k6200J10226O8423
6550B35525p3732q4448N0986q2868l8688N346Q6175L9378p5358j9523j7872p952
6538A6969K7251p9700j10576m1870k0188O2492L5544n5956o2340J51206J6984
6527f0184L911P2602J092n6261j1644q552K563O0520l0351k0201N2328N5570m603
$$ y = [46780, 100002, 180176, 237166, 170984, 148282, 191552, 152008, 75596, -21321, 30016, -55979, 41104, 161085, 135228, 53071, 216, 89659, 182804, 120618, 83594, 22780, 11431, 35480, 75005, 11889, 41325, 17461, 32847, 8238, 71937, 134377, 221902, 209562, 61055, 28842, 43062, 103118, 112693, 34450, 4353, -14391, 7953, 65287, 99563, 35377, 94811, 119551, 82725, 144127, 181517, 71801, 13409, 84004, 141569, 135010, 128535, 83076, 56876, 167102, 235525, 161793, 77345, 128331, 45463, 6775, 12121, 98296, 137674, 62316, 42793, 24921, 16969, 44220, -35480, -146056, -187926, -208114, -145622, -110078, -166034, -228374, -77168, -60184, -56273, 16329, 17421, -38840, -50484, -59036, -56473, 4047, -26304, -46505, 5823, 61393, 56790]
6514E6790m4308M2517j6295o4884o6593N9612L0033L5995l9925k9979M4127J14241
6502A21331k8513n1452o949P996l9344k9820J7644m3322j41270N1146J24890K8402
6490A0739k8148M98J6486O05p3308P7533J6226l6354o1135l947M4863K5927O0515
6477E0500L0324n3741l6527J3921M0590L3411p0222l0738M7554M5840K4274j13297
6465a8111K9986N5479n7842l5529M3126j3285j8128n6249m8833L7573J28480L893
6453E0560J2499j16637o8866j746k2623L7676J04282k293N5756K3944j03843j02603
6441a33894l6915N806N5879O7456P6806O8194r3953q3965k5736N7184n487M6163
6429b462O0484K4615m7976K4855m3442p6187J865J06486O0450j19888n5428L8635
$$ y = [56790, 12482, 54999, 38704, -26180, -92773, -33161, -3128, 32867, -7058, -37037, 7090, 121331, 92818, 41366, 34417, 42413, 3069, -26751, -9107, -52429, -193699, -142553, -17663, 10739, -17409, -16911, -425, 180, -73128, 4405, 20631, -15723, -76858, -80805, -35942, -10015, 50500, 80824, 27083, -9444, 4477, 45067, 78478, 8256, -22482, 25072, 70912, 95186, -18111, 11875, 67354, 9512, -26017, 17109, 3824, -14304, -70553, -119386, -81813, 46667, 50560, 63059, -53578, -122444, -124190, -146813, -109137, -4855, -7148, 48608, 72552, -31291, -133894, -170809, -165003, -109124, -41668, 35138, 103332, 9379, -74586, -100322, -43138, -48625, -2462, 58022, 82637, 34661, 59516, 16074, -60113, -58248, 48238, 108688, -11200, -66628, -27993]
6417b7993M9911K9856q4738N5758n6479m0984K6423R4384J9774M3476J1599k136
6405A18851P3824o4711j02143j33231q6262J20809J11103P1623q2075J2501n1111
6394a0822m0554O9458M5833m0282p5143o717n1458p2236M7003J10876L0762K0553
6382B7273p2323p2988K3401m629k5057M2348K4074m7064o2289k4136Q5815J05978
6370D03K8083j25580K2119L6837O518M319j7316J1888J5518Q680o157J9642Q4279
6357H9233N4172j412o7815k8909K4356j0442P2646n4764m9731j8215J6405P5217
6345A00741Q4521m5104p4195K904l3839m3503M2601J4279p8762j12247l639N4124
6333i2119L9587R212J4867K7880R820m7450j04107M216R0638K5369N8860R2290
$$ y = [-27993, 21918, 51774, -32964, 22794, -33685, -74669, -48246, 46138, 65912, 109388, 120987, 118851, 192675, 127964, 25821, -107410, -193672, -72863, 38240, 109863, 27788, 40289, -10822, -51376, 18082, 63915, 23633, -51510, -58227, -109685, -181921, -134918, -24042, 6720, 27273, -45050, -118038, -94637, -99266, -124323, -81975, -57901, -104965, -167254, -191390, -105575, 403, 28486, -97094, -74975, -38138, -31620, -27301, -44617, -32729, -17211, -8531, -14688, 4954, 89233, 143405, 141993, 74178, 45269, 69625, 59183, 131829, 77065, 27334, 9119, 25524, 100741, 185262, 140158, 65963, 68867, 35028, -8475, 34126, 48405, -30357, -142604, -146243, -92119, -52532, -43320, -28453, -573, 9247, -38203, -142310, -138094, -47456, -22087, 36773, 129063]
6321A29063m5693l9789j5644J6313L4447R156o9380j30491J6150Q3355O6266l5658
6309A8095L9781Q0267O1464j14713n8533N9796p9849o4797L6919l7981N7896R5448
6297I3793K1529m1044j1466j9030l8848J9491j4590j7083r690J08038l5589m7507
6285H004L6316n0947K8734Q1991p3390l6791M4248p365m2103M319Q0304r423j24837
6272f0940M0836j730j8682k9839K6095P615p6082l1005O1684R6753O85l3433J7582
6259d61P5692p005m9955n5538L4760j06966m9430O728M2606J8120J3687K3360
6247e4402n4519K7999J5556P8393j1192K5111l4106O1609P3361p8807j02486o4605
6235a18088N2261J8395M0375k3666n6121L8194J07563k2920p3710R8065P1954
$$ y = [129063, 83370, 43581, 27937, 44250, 78697, 87853, 18473, -112018, -95868, -12513, 53753, 18095, 57876, 138143, 199607, 84894, 26361, 86157, 6308, -58489, -21570, -59551, -1655, 93793, 115322, 74278, 62812, 43782, 4934, 24425, 9835, -7248, -16938, 91100, 55511, 8004, 44320, -6627, 22107, 104098, 30708, -6083, 38165, 30800, -11303, -6984, 73320, 63897, -60940, -20104, -21834, -40516, -70355, -44260, -36645, -112727, -143732, -82048, 14705, 15390, -18043, -461, 75231, 68226, 18271, -37267, -2507, -109473, -158903, -152175, -109569, -91449, -77762, -54402, -108921, -80922, -65366, 13027, 1835, 26946, -7160, 54449, 127810, 49003, -53483, -118088, -65827, -47432, -7057, -30723, -86844, -48650, 58913, 35993, -37717, 60348, 132302]
6224A32302k9593L047k0632J607L8526j7201r1841j51479k192Q4549J32055j3531
6212F5617M7943L1924J7278r6974n7406N71L7129L554k8068o0738l6694L1L5636
6199d0197N2024q7698m3324m874k6760Q232l5279P8489M0209K2130o9576k8065
6187a34689M6508L227l5799M98N3479l2533j7204K7068n545O4202Q6964m5945
6175A0231o4181l2442m4916P373J8575k3450j0972p391M1378K7553Q2469n028
6163h01r2598J550P0139L4330m6349R4795J10682j82525o9429O1635n3802m6610
6151a18983Q6886J15713q607o1592M9578n619m4776q1021l0024K6237R799J7787
6139d4622R1171r306j16960n2308M4937N1496K3775j275j4500J241Q3107J45182
$$ y = [132302, 102709, 105756, 85124, 86731, 125257, 108056, 16215, -135264, -137456, -52907, 79148, 65617, 113560, 145484, 162762, 65788, 8382, 8953, 46082, 49636, 21568, -39170, -75864, -75833, -40197, 11827, -75871, -119195, -124069, -150829, -142597, -177876, -99387, -59178, -37048, -106624, -134689, -88181, -84954, -120753, -120255, -66776, -99309, -116513, -89445, -94990, -30788, 56176, 10231, -53950, -86392, -131308, -123935, -105360, -128810, -139782, -147173, -105795, -78242, 4227, -801, -93399, -91849, -21710, 12620, -33729, 61066, 171748, -10777, -80206, -18571, -72373, -118983, -32097, 83616, 75009, 13417, 62995, 57376, 12600, -68421, -98445, -72208, -62409, -44622, 46549, 37243, -79717, -132025, -87088, -35592, -11817, -13092, -27592, -26351, 56756, 201938]
6127B01938k5389p2688q1758j00587l5524j15498k8048J31771J72706J8726k945
6116F2704n4783q2998n1148K5609Q0164R2529K4507K3704n4516Q723K0153j25731
6104c1083q5810L2684L7221J676l5181o3809O2366Q5648r161m293k4965m0694
6092g5401j9385j8185Q5470K4476l7655R641M616P6064o435j09085o8561N5243
6080g9197O7519l2614j8874m2297J1822P7053J05861n2210m1058o1355l0401J4007
6068h1744J3134k6777J5034K3211j18632m7570p246R472K2367L3914J4952K8302
6056a21583P8614J090r0278j03552J07008P2120J7599J5966o903l4237l9390K6249
6044g7297M4032P3228k4048P7420Q7189m3738m0634O222M2555p2916m1763m8308
$$ y = [201938, 176549, 103861, 22103, -78484, -114008, -229506, -257554, -125783, 46923, 65649, 62704, 7921, -75077, -126225, -100616, -20452, 72077, 96584, 120288, 65772, 74495, 94648, -31083, -116893, -84209, -46988, -45312, -80493, -144302, -81936, 3712, -5449, -9742, -34707, -75401, -94786, -112971, -27501, -3025, -40680, -31039, -26423, 49641, 43206, -65879, -134440, -79197, -11678, -44292, -63166, -105463, -93641, -16588, 89273, 37063, -3995, -65350, -95751, -81744, -68610, -95387, -80353, -57142, -175774, -223344, -230590, -221118, -198751, -164837, -149885, -121583, -42969, -41879, -132157, -235709, -128701, -56581, -38982, -23016, -29919, -64156, -103546, -77297, -33265, 39963, 15915, 93335, 180524, 136786, 96152, 102374, 144929, 72013, 30250, -18058]
6032a8058K8161l0466M9688l6643L7991l4456o6607J8024m9098p2558K4711J51142
6020A831J00836l1821J5767J2708p6511K2297N9305p351o2445r1073r2996l7874
6008a87327P4624l5917n1073n4669K9668Q1423o2180M5968J37870K9457R2850
5997A00694j25506r9644J1897J4601J5492O5324k407N8275K0161k709m1141j10813
5985i5776n8905J10032R5257N1896j15080p3213l0209m174m2988Q6820J43543
5974F7203N4806m6531m2053o5027M9533M1248L459m3598K81L1383o1732o8810
5962g9838r795O5476P76o1319j18238m0531J46952N7349n3748R5744M4453M8625
5950I5906J6747r5273m1302N0310L3561m2930M893l0747Q8725J31301p6548l6842
$$ y = [-18058, 10103, -20363, 29325, -7318, 30673, -3783, -70390, -52366, -101464, -174022, -149311, 1831, 102667, 70846, 86613, 99321, 22810, 45107, 104412, 97061, 34616, -56457, -149453, -187327, -112703, -148620, -199693, -254362, -224694, -143271, -205451, -159483, -21613, 7844, 100694, -24812, -124456, -112559, -97958, -82466, -17142, -19549, 38726, 58887, 56178, 15037, -95776, -154681, -44649, 50608, 102504, -12576, -85789, -115998, -120172, -163160, -76340, 67203, 122009, 75478, 33425, -31602, 17931, 59179, 62638, 19040, 19321, 50704, -11028, -79838, -89633, -24157, -23381, -84700, -202938, -243469, -96517, -39168, -92916, 2828, 47281, 95906, 112653, 17380, -23922, 26388, 59949, 17019, 21912, -8835, 79890, 211191, 134643, 97801]
5938I7801l0092q3615m8026j44776j8401Q2476M7208j09112m9578O7133M8680
5927a40302O0558m0308P7142l9424j00648P3324K1588P80N6846K0840k4601l1602
5915f5807M0949j1947R897M1038J68928J9981j27837r0721J00574J08892m5225
5904A48722j56993l763n7190K5763o2230k7576J7625K27Q0162k3544l8452N9839
5892c7410L6690M8931j01490l5772j0345M6960m2403L8517P0591M4513p8484N343
5880a4359K7695M959n7895j2964k0235m669M7166l1482p8973l0707L3533J12855
5868b5076M9729L0422m1709p9163K026o1700R133k1390Q6001J61528L1172m8144
5856I2829r4890o9270M0538Q474o6847M1401K6577m1943m971n3774k0756J00487
$$ y = [97801, 67709, -15906, -63932, -208708, -227109, -144633, -97425, -206537, -256115, -188982, -140302, -79744, -120052, -42910, -82334, -182982, -109658, -88070, -87290, -30444, -9604, -34205, -65807, -24858, -36805, -26908, 14130, 183058, 203039, 75202, -15519, 85055, 193947, 148722, -8271, -12034, -69224, -43461, -105691, -133267, -115642, -115415, -35253, -58797, -97249, -37410, -720, 48211, -53279, -89051, -99396, -52436, -94839, -56322, 14269, 58782, -19702, -14359, 13336, 18295, -39600, -52564, -72799, -77468, -30302, -61784, -140757, -171464, -137931, -25076, 24653, 55075, 13366, -65797, -63771, -125471, -116338, -137728, -51727, 109801, 140973, 92829, -2061, -71331, -30793, -22319, -89166, -47765, -21188, -63131, -68102, -121876, -142632, -42145]
5844d2145Q2503N4119j7645p64J1908j07416J7685K3770K2293j41713m9883j4182
5832a61470N5753K4674P3517P1375k2127m0150p937Q1726M1389n0152o010j0956
5820D9632q5647j05049K5265J8445k1152L1709k4506k2322P5496J5056j10431
5809a53504p748J20406P7206Q3963J06986o2594j52458j14701R2822R0548M8587
5798A29513P4524q3152K9004j2563k6558l6064l9598Q6964J04777m8014k4652
5787A54181k1056r6738j06161J1642K3993r1598j3188p5594o784J85392Q0421
5776D4510n2723o0509r0215L990M3154M4067K3789l6163J12545P5553j2528l9752
5764E5718L8641j9688m4554p2567L974K3427j2787l3112M8437N5948Q8508P8968
$$ y = [-42145, 40358, 94477, 76832, 76068, 87976, -19440, -1755, 22015, 44308, -97405, -147288, -161470, -105717, -81043, -7526, 63849, 41722, 1572, -6365, 75361, 116750, 66598, 60588, 49632, -36015, -141064, -115799, -97354, -118506, -86797, -111303, -133625, -58129, -43073, -153504, -161252, -40846, 36360, 120323, 227309, 164715, 12257, -102444, -9622, 80926, 129513, 204037, 120885, 149889, 137326, 110768, 74704, 35106, 122070, 226847, 178833, 154181, 133125, 36387, -69774, -58132, -34139, -125737, -138925, -214519, -221303, -35911, 44510, -8213, -68722, -158937, -154947, -111793, -67726, -43937, -80100, 32445, 107998, 95470, 55718, 94359, 74671, 30117, -42450, -38476, -15049, -27836, -60948, -12511, 43437, 131945, 210913]
5752B10913q0037p26n0874L3041j14158J1279N0658J2977l4835m1206R970N218
5740A2220l1949N1507J23561p1270k4345o5595p853K4954K9701o7772J5566Q0915
5728F9640l7940L7274o949k5845Q7236j575n1697L919P725m1235j670L2532n0689
5715B0726N0139K2193O6815m2289q0621l6389N8085O7001j06331j33807J6439
5704i8039J6367M8675R6267l3829K6274P7318O1713Q493n8431j12396j18721o5703
5692a52012j8433O9451P0739O022L5119J25444J17736r5334p7195n2030o2663
5681c3156K5271R1747O4991m7941o3656M2053L4674k3823L3164Q8474l9479M0329
5669B12648P700M4772n2663j28076j37186m6321k0360K110K4309O9632J4181K8198
$$ y = [210913, 130876, 130150, 79276, 112317, -1841, 9438, 60096, 73073, 38238, -2968, 7002, 12220, -19729, 31778, 155339, 84069, 59724, -5871, -13724, 11230, 40931, -26841, -11275, 69640, 31700, 68974, 62025, 36180, 123416, 121841, 70144, 74063, 81788, 40553, 38883, 71415, 20726, 70865, 93058, 159873, 117584, 36963, 574, 58659, 125660, 19329, -114478, -98039, -81672, -32997, 63270, 29441, 55715, 133033, 194746, 203239, 144808, 32412, -86309, -152012, -170445, -100994, -30255, -24233, 10886, 136330, 254066, 158732, 81537, 29507, -33156, -7885, 83862, 148853, 100912, 37256, 79309, 113983, 90160, 123324, 211798, 172319, 212648, 220348, 265120, 212457, 84381, -52805, -99126, -119486, -117376, -93067, -23435, -9254, 18944]
5657A8944j01714r3492M6262N001k2001P5415L3638L5245n6659M1607R1955L1669
5645A05870k2597L700l6530L7132O710j8325K7607o7094j25048o8974M7859Q2399
5633b7291M5590P4641m0216j10043p790j565N1794N4145N4693J287m8065r0364
5621d3184o7976L8280R4372O4469o4157o1186n1981l8529L8338N2597Q9629P857
5609E8529Q6863K6235k6693k1489j22226m5836j1096m9634o6093O2527N1869P243
5597d9801j9356L2378Q1580j2247m2416m0801l9395L2934l4069K0131J3226j8928
5585g6764L6352j8637j13229K4835O1837K254J12563N2729o7169m0239n0256L6799
5573c8925K7290J8580m6640r660k4946J4189J03136j49379j184N6186l9633j6638
$$ y = [18944, -82770, -176262, -130000, -124999, -147000, -71585, -37947, -2702, -59361, -17754, 74201, 105870, 83273, 86973, 50443, 87575, 94285, 75960, 103567, 36473, -88575, -157549, -109690, -27291, 18299, 92940, 52724, -57319, -65109, -66674, -14880, 39265, 93958, 95245, 47180, -43184, -111160, -72880, 21492, 85961, 21804, -39382, -91363, -129892, -91554, -38957, 50672, 58529, 145392, 171627, 144934, 123445, 1219, -44617, -55713, -105347, -171440, -108913, -57044, -49801, -69157, -36779, 44801, 32554, -9862, -50663, -90058, -57124, -91193, -71062, -57836, -76764, -40412, -59049, -172278, -147443, -85606, -83352, 29211, 81940, 14771, -25468, -75724, -38925, -11635, 6945, -39695, -49355, -74301, -60112, 43024, -106355, -107539, -51353, -90986, -107624]
5561a07624N4365M0922O379Q8179L8624j073k8309l3221l0801o8442m7933j9236
5549a08170j3125J0721P7198R6430m1048o4484m4268l4076Q6982J25163q851p4877
5537G595m6331L278L4035J3252k6099j25131j2528J15598R091o7470j3755P0767
5525c7698M5314L205r3058q6524p017K6585O7092P6661N8901k1345q726j52m6398
5512b3160q3051J5930J4349M8071L8189L0531n442p763j3195p8527J4782m8461
5500i7747J15108m837Q282n8516r4699j3166J01146R9772l2450R915N715l6349
5488B174L013K6329j8822q4839n0054R6825o8008n2403j3538j18501N1770J31944
5476i4110k672k6909l8981L5510l6948R864J83166K8793L1206j2918q7719l3274
$$ y = [-107624, -53259, -12337, -5958, 82221, 120845, 119772, 91463, 58242, 27441, -41001, -88934, -108170, -121295, -110574, -33376, 63054, 22006, -42478, -86746, -120822, -33840, 91323, 82472, 7595, -38736, -35458, -1423, 11829, -14270, -139401, -151929, -36331, -27240, -94710, -108465, -37698, 7616, 10821, -82237, -168761, -175778, -149193, -82101, -5440, 53461, 32116, 23390, 23238, -23160, -106211, -90281, -75932, -27861, 10328, 40859, 35417, 27654, 14459, -64068, -49286, -97747, 17361, 12524, 20806, -37710, -132409, -145575, -44429, 55343, 22893, 32808, 38523, 2174, 5187, 31516, 12694, -72145, -122199, -25374, -93382, -145785, -159323, -277824, -226054, -94110, -96782, -123691, -162672, -127162, -164110, -154246, 28920, 57713, 88919, 76001, -11718, -44992]
5464d4992l4922J5802R357M055k2429O5053l6396p3102n6843l6468Q1162P1847
5452e7876J7363M9806Q6336N3748m5060r2889n1788j3150J06652R7245q96j7743
5440A31748j52773m1974J42126J066j37226j56691r3050Q3851J27480M1612K9706
5429b4125J9337j100K7745k7569J05049M7205m6197o4992j10986p1187k1189q5942
5417b53951k8159K2745Q7315J38513O6555K4371m5213K627o5904P316l4066M3771
5405c4080j00299N2253L3997j2214P094J4585m5454n5390M3713K0411R4367O2973
5393H1956m3966M2634k4802k1516l2678M3863N5583Q1397J3206k4989j16831j15380
5381f1523K458j9712N0747P1210j4350l9704k6509J08882p388o2310m5576j09329
$$ y = [-44992, -79914, -64112, -54755, -50700, -73129, -8076, -44472, -117574, -174417, -210885, -129723, -57876, -40513, 9293, 95629, 149377, 104317, 11428, -40360, -53510, 53142, 150387, 149491, 131748, -21025, -62999, 79127, 80193, -57033, -213724, -306774, -222923, -95443, -53831, -24125, -4788, -5888, 21857, -5712, 99337, 146542, 100345, 35353, -75633, -146820, -168009, -253951, -282110, -259365, -172050, -33537, 33018, 57389, 12176, 14803, -51101, -43785, -77851, -34080, -134379, -82126, -48129, -60343, -53249, -38664, -84118, -139508, -95795, -75384, 18983, 81956, 37990, 80624, 55822, 34306, 1628, 45491, 101074, 182471, 195677, 170688, 53857, -61523, -59065, -78777, -28030, 43180, 28830, -10874, -37383, 71499, 64111, 1801, -43775, -153104]
5369a53104q2120L8071R0051Q9511j0881m883K9609q5889q5178J2450Q6383N5524
5357b0456m663l6983L765L6423n4943M0833J6644J1812O8114l8393j4525M471
5345A2099J2432J9651K6199P5986N864p9458q2558K3555k77l6132o121q463n4761
5332i1984r951R5670R315j47074N8481R4175k935M3970N528j1425m3621M1312
5320D1461j1467j0715o4774o1555L436j6252m4587N1752N5622j8128n682j7712
5308i8601P054O8128k0898l8901N2678l1921q9292J1806N8827K0111L5354n712
5296c1367n9406j8272p556P0458N8065j4191j0348o7666o3032l6866L1403K5617
5284a23161R3033Q114n2953J9853n9208K7396j3424N4389M6201M3802L7562L8290
$$ y = [-153104, -235224, -197153, -107102, -17591, -28472, -33355, -3746, -89635, -174813, -162363, -75980, -20456, -25119, -62102, -58337, -21914, -76857, -36024, -19380, -7568, 60546, 22153, 7628, 12099, 24531, 44182, 70381, 146367, 152231, 72773, -9785, 13770, 13493, -22639, -28760, -37223, -91984, -101935, -6265, 3050, -144024, -85543, 8632, 5697, 49667, 55195, 43770, 149, 41461, 29994, 19279, -45495, -107050, -103614, -119866, -164453, -112701, -57079, -75207, -80889, -98601, -91547, -23419, -44317, -83218, -30540, -62461, -151753, -139947, -81120, -61009, -25655, -31367, -90773, -109045, -116601, -46143, 11922, -2269, -12617, -80283, -143315, -180181, -148778, -123161, -30128, -22014, -74967, -55114, -114322, -86926, -100350, -45961, 240, 44042, 81604, 119894]
5272A19894l9085j369j6607p6830p7757Q6410L8006j08887q6407J50954J16543
5261A04865m0327j29252r7200k3766O7452J47398M938j04006j5004O7j314M499
5249h1650p8799K1870N2879P5650k7465o35m4370M5395Q4475J2811k4206m7976
5237a2021M6932p1020K6871J13375q1828r5642L0172M6889J56l4699r546J1325
5225b9036J00877O1857n2242r3985j7947L0136j22372m696O7109q48O4974m4138
5213d0311j10691M7343k0636j5919P7410m1771O408O259P0508L3841L2404R1511
5201A36356l3723j42502j070Q0816J6294J7443n1488r925R647m2706k1278N1563
5189I427o2916R307J0332P034O939o3910J6995M2507m1622R9512N8374l3875m7813
$$ y = [119894, 80809, 79440, 62833, -13997, -91754, -5344, 32662, -76225, -162632, -11678, 104865, 64538, -64714, -161914, -185680, -118228, 29170, 34108, -69898, -84902, -84835, -86149, -81650, -160449, -138579, -85700, -10050, -37515, -38150, -82520, -37125, 47350, 60161, 35955, -12021, 34911, -36109, -9238, 104137, 22309, -73333, -43161, 3728, 3884, -30815, -40361, -29036, 71841, 133698, 81456, -12529, -30476, -340, -122712, -127408, -60299, -61147, 3827, -40311, -151002, -103659, -124295, -140214, -62804, -104575, -98167, -91908, -21400, 12441, 44845, 136356, 102633, -39869, -40939, 39877, 56171, 73614, 22126, 12201, 21848, -20858, -42136, 9427, -53489, -44182, -33850, -26816, -19877, -83787, -66792, -24285, -65907, 33605, 91979, 58104, 10291]
5176A0291M7336J6289J3514j8338J0630o539q2450L7555J09543k7077l2512J5482
5164I3724M4539p2840q8081j15834m0596M1458M2328Q9258l3205L0600l8667Q192
5152c9124n77r1175k4189K4660Q5565K3855p582J819J4885L3351J1776M8263J1948
5139I3475M1120k7290l5467l7291l097j5894N3940k6487l3738l0230m027r4667
5127a19653r6749K3695J06969R0408N9205M1186N2649n8602j82612k0927J6011
5116h8420J30236J5805L216N1284j15204j36375K1316k5762K6648Q1937J104N5517
5104B1302J7549N2726k0307m0250N5801m8594l813o0745j6590K9735k713m2343
5092e8242J15654M0087j17036R8237O0141j53189o3611k4494N5194O8190k4019
$$ y = [10291, 57627, 73916, 87430, 69092, 79722, 73183, -9267, 28288, 137831, 110754, 78242, 93724, 138263, 65423, -22658, -138492, -179088, -137630, -95302, -6044, -39249, -8649, -47316, -39124, -39701, -130876, -155065, -130405, -44840, -20985, -28567, -26748, -11863, 21488, 33264, 81527, 93475, 134595, 107305, 71838, 34547, 31450, 15556, 69496, 43009, 9271, -20959, -24986, -119653, -216402, -192707, -85738, 4670, 63875, 105061, 157710, 99108, -83504, -104431, -88420, 41816, 57621, 60837, 112121, -3083, -139458, -118142, -143904, -117256, -35319, -34215, 21302, 38851, 91577, 71270, 31020, 86821, 38227, 34414, -26331, -42921, -13186, -15899, -58242, 57412, 97499, -19537, 78700, 138841, -14348, -77959, -102453, -47259, 20931, -3088]
5081c088M0721O1841n0719P800n936o097m3761r6415n6112Q837M1508K4461Q4441
5068G481K2790J8884L5559O725K6245j4874M0308q0501m9102l0030K5221o892
5056A814r3103P9394R5053r4199k7689j2093k9094P7848L3780K1428n4040j9269
5044b0170j3612o873O4138P838n5882N4379k183j0701k5279m0565j3833O9366
5032F623l4865l9032j8883O8837Q8086M3805n6902l1624m446k3882l5458j769
5020c9510M5742j72K4794o6019k9236K6434M5443M7937j953m4576q0844k3047
5008i5007R4526L9438P429K2779k9600n1126k3055j0783p2728o1903R4533J66785
4996H1288N4077k3463m1139J3249l5749K9052M4862o0282r5890P4608P7057L5439
$$ y = [-3088, 37633, 99474, 48755, 56555, 50619, 44522, 761, -95654, -151766, -142929, -101421, -76960, 7481, 30271, 49155, 84714, 91439, 117684, 102810, 143118, 62617, 13515, -16515, 8706, 1814, -91289, -11895, 83158, -11041, -38730, -50823, -79917, -2069, 31711, 53139, -901, -20170, -33782, -40655, 23483, 31321, -24561, 29818, 27635, 16934, -8345, -48910, -62743, 6623, -28242, -67274, -86157, -17320, 70766, 114571, 57669, 26045, 21599, -2283, -37741, -39510, 6232, 6060, 30854, -35165, -64401, -37967, 7476, 55413, 53460, 8884, -71960, -95007, -481, 38957, 46386, 69165, 39565, -11561, -34616, -45399, -118127, -180030, -85497, 81288, 135365, 111902, 70763, 84012, 48263, 77315, 122177, 61895, -33995, 40613, 117670, 153109]
4984A53109j4208o8053O0582K5766q1583p5829M3303j34080k1680P0430o7655
4973a09898k9800P8687O4839k4244o4977l456l4916k2862J02002M5854N244Q9777
4961I6250r9326p4920K2530n4718J41977J34124j5492K141K6631o1252j25854
4950g909p7240P4858L2953O3398M7105q551p5358j8760l6690K3778l9828k9968
4938e2212j1802j01882N2900O5245K2812J33299N4609l8753o8650m8237P6735
4927H4064K5694j2334o9732j8149m8936j7828R3196O9913j6459J3371K3349q712
4915A17437q8564m7313k0052l8985o3648J9040l818R7105R596M9390P6453J07948
4903B14589j42406j01988K7328J42565j1852o8914l4818J9151j4219j2399n336
$$ y = [153109, 138901, 70848, 131430, 157196, 75613, -216, 43087, -90993, -112673, -42243, -109898, -139698, -61011, 3828, -20416, -85393, -88849, -123765, -146627, -44625, 1229, 6473, 96250, -3076, -77996, -55466, -110184, 31793, 165917, 150425, 152566, 179197, 117945, -7909, -85149, -10291, 22662, 86060, 133165, 124614, 49256, 30496, -6194, 17584, -22244, -52212, -64014, -165896, -112996, -47751, -24939, 108360, 162969, 124216, 55566, 7329, 84064, 109758, 97424, 27692, 9543, -39393, -57221, 35975, 105888, 89429, 102800, 126149, 117437, 28873, -18440, -38492, -77477, -141125, -122085, -125903, -28798, -19202, 30188, 106641, 214589, 72183, -29805, -2477, 140088, 128236, 59322, 24504, 43655, 29436, 17037, 11701]
4892A1701j7846m4247J967p8602M3448Q4194N9121k82n2055j43194o3425O5188
4880a34032P804j4527o259R6809K5909l3188K9899J2065k2722K6686j19519J0657
4868a20418n1328j6916q964N0866P1377k8354o612R2701N0037r5617k5933Q1482
4856g679O484M1262K3391L5093J03947M1246p5319p8839k1519J2891q5181o0153
4844f4376l5431N0560Q2303j2871O6847k0753n2414L1729Q7009L8746p7129l9793
4832E4427o2541K7329k0324M1861K3078K3147n2732Q3398J32354O9127k4542n6539
4820B38043k0877p9020o7150k9279J1470K899Q1866L4813j48186j42216n4548
4809a72185P6675J22544M6825q864l1549p2579l5742J7524P1695J2729l0835p9061
$$ y = [11701, -6145, -50392, -48425, -127027, -83579, 615, 59736, 59454, 7399, -135795, -199220, -134032, -126228, -140755, -147014, -50205, -24296, -57484, -27585, -15520, -38242, -11556, -131075, -120418, -171746, -188662, -197626, -146760, -75383, -103737, -110349, -17648, 32389, -63228, -89161, -7679, -1195, 40067, 63458, 98551, 202498, 243744, 168425, 89586, 68067, 80958, -4223, -64376, -99807, -49247, 33056, 20185, 87032, 66279, 13865, 45594, 132603, 171349, 94220, 54427, -8114, 19215, -1109, 40752, 63830, 86977, 34245, 117643, 249997, 319124, 294582, 238043, 217166, 138146, 70996, 41717, 53187, 56086, 137952, 172765, 24579, -117637, -172185, -95510, 27034, 73859, 64995, 33446, -39133, -74875, -57351, 14344, 27073, -3762, -82823]
4797h2823P9420J00964l3922j14981o0640R4238L3966J5550L8308Q393p9153n6059
4785e6739P398j9611n3841K4775N9058k2647l6769M0808N6300l7963N4040J4619
4773B9428r1412K1410O0994l637M4336O2532o5449k8163M8325K7864o0099l7259
4761H870m8639j03929n3414P6708J16976m0824j18532k887J1026J7859N9343Q4802
4749G359M7378j6363L7572N778M7723r910n0240j20227k3958k9385m8794J01140
4737e1927J08002N9113M0817k1916o9834k214M375L9829R0735m1054p8896k3277
4725E3753L9441m7812l1271K1529j04990J1533M4591P7693j3988m5829N6911N3819
4713A15380l1973r9290m021J35959m9811r7939L7556M398m5122K9780r0006l5702
$$ y = [-82823, -3403, 97561, 63639, -51342, -111982, -17744, 16222, 31772, 70080, 78473, -680, -56739, -49341, -68952, -122793, -98018, -38960, -61607, -98376, -57568, -1268, -39231, 14809, 29428, -61984, -40574, 20420, 16783, 61119, 123651, 58202, 30039, 78364, 106228, 46129, 8870, -39769, -143698, -197112, -120404, -3428, -44252, -162784, -165671, -154645, -136786, -77443, 7359, 54737, 38374, 75946, 81724, 129447, 119537, 69297, -50930, -74888, -104273, -153067, -51927, 56075, 115188, 156005, 134089, 64255, 62041, 66416, 106245, 196980, 155926, 77030, 53753, 93194, 45382, 14111, 35640, -69350, -57817, -13226, 64467, 50479, 4650, 61561, 115380, 83407, -15883, -19904, 116055, 66244, -31695, 5861, 10259, -34863, -5083, -95089, -130791]
4701a30791J49400Q9675J2443R67J6279m2278J1647L2463p9964m9608j6497O4017
4689E7753J15227n7528j40095P1500l8690q443l8438K2854R6166N7783q0399n5996
4677A694P4430L8578K8414n6502k2040J0047k4610l3915k1963N5543K842o01l5599
4664A6318o6632q2312l3741O4625P3021q1191K9919L2693J7118P6609n1669q0188
4652h5430M7177J4967l4615n6015m0750l939J5371m929J58180j4846j42305O23
4640a46511j5612K6361l5444P7665l699o4515j7378N489J20590P5011J3861J1556
4628D7374J1080J8603K4564j9613P643L6408l1336O555k7697j34969l4058J47008
4616E1562k6816j0479o0085q606Q3878o1029o5746K4035J04525M7900n1290P51
$$ y = [-130791, 18609, 108284, 120727, 121694, 137973, 95695, 107342, 139805, 59841, 10233, -6264, 57753, 172980, 115452, -24643, 46857, 8167, -276, -38714, -15860, 80306, 138089, 57690, 1694, 76124, 114702, 143116, 86614, 64574, 74621, 50011, 16096, -5867, 49676, 52518, 51917, 16318, -50314, -132626, -166367, -101742, -28721, -109912, -79993, -47300, -30182, 46427, -5242, -85430, -38253, -23286, -57901, -113916, -154666, -158605, -143234, -148163, 10017, -4829, -147134, -146511, -162123, -135762, -171206, -93541, -97240, -161755, -179133, -173644, -53054, 21957, 35818, 47374, 58454, 77057, 101621, 82008, 89651, 126059, 94723, 101278, 73581, -61388, -95446, 51562, 24746, 14267, -45818, -54424, 29454, -31575, -97321, -73286, 31239, 79139, 27849, 28600]
4604B8600J07847N318j45484k0988p204r4455M2081k5558N332J35956P6155q4639
4592B2961n8520O2335Q885L1345M9429N4079l9912l5313m2297m709o1877q8218
4580a01812R194m2049K8277R1424Q9302r3059r8695L428L8141P0198J34698p2396
4568E6651m2057j663k8096Q8230P0302P6914N3353j7868j06781k38241L2620J41725
4556H5089L7302p3796P924R12l5397n2185m7864O1944o1584j6912P6289J6157
4544b121N9397J1732p8241k9314N241m1813q756K0855K0341m8748K0461m285j0565
4531h5816P1407K2865K5518m2421m7622j34078K1309J21761K6700P2405j8115
4520C3913j20927N1803J3681J7704P132P303k9820p436j3563m9412M8060n9999
$$ y = [28600, 136447, 141765, -3719, -24707, -31911, -126366, -84285, -109843, -104511, 31445, 107600, 22961, -35559, 26776, 35661, 67006, 116435, 170514, 130602, 95289, 52992, 48283, -13594, -101812, -92618, -134667, -106390, -14966, 74336, -18723, -117418, -113990, -75849, -5651, 129047, 56651, 14594, 12931, -15165, 73065, 143367, 220281, 273634, 255766, 148985, -89256, -56636, 85089, 122391, 48595, 56519, 57431, 22034, -30151, -78015, -16071, -77655, -94567, -18278, -2121, 57276, 69008, -9233, -38547, -33306, -75119, -83875, -63020, -42679, -91427, -70966, -75251, -85816, -14409, 8456, 33974, -8447, -56069, -190147, -168838, -47077, -20377, 52028, 33913, -87014, -35211, -21530, -3826, 3306, 10609, -19211, -26647, -40210, -89622, -41562, -101561]
4508a01561p726J89N4947j9244J31337n2434j9667o712j9481l6268j0657J3732
4496g3545M7528j4472Q608P7543O0515K6876N5378q645k281q6702p7884j512j3012
4483a605o8504L9413M0839j4718M5414M5417Q914M0464m9971p1229o6295J1857
4471d0004q733o1090J08391L0339o2750j5585o2632o4717j3888N1641J31223O5152
4459E7347P5859l1976j2275j7868M2813P1156j31804r4698P5713K1037q7936m3243
4447g5875K6463L0861k654n321J3742L7038P2868R9958p9677m4180O0049k8488
$$ y = [-101561, -109287, -109098, -54151, -73395, 57942, 5508, -14159, -20871, -40352, -76620, -87277, -73545, -26017, -40489, -31881, 45662, 106177, 133053, 188431, 179786, 177505, 90803, 12919, 11407, -1605, -70109, -30696, 10143, -4575, 40839, 86256, 95170, 135634, 85663, 14434, -51861, -40004, -48737, -109827, -1436, 28903, -33847, -49432, -112064, -176781, -190669, -139028, -7805, 57347, 133206, 101230, 88955, 71087, 113900, 185056, 53252, -41446, 34267, 55304, -32632, -75875, -49412, -18551, -21205, -26526, -12784, 24254, 97122, 197080, 117403, 73223, 133272, 104784]
$$ [...]
##END NTUPLES=NMR SPECTRUM
##END=
