##TITLE=Analysis number 312075
Compound Code tl 00659
Book Reference 399/175
Project Code adrs
Chemist Name evam
##JCAMPDX= 6.0         $$ Bruker NMR JCAMP-DX V2.0
##DATA TYPE= NMR SPECTRUM
##DATA CLASS= NTUPLES
##ORIGIN= Bruker BioSpin GmbH
##OWNER= NMR
$$ XWIN-NMR		Version 3.5
$$ Mon Jul 25 09:23:56 2005 GMT Daylight Time (UT+1h)  MAYBRIDGE\NMR@NMR_250MHZ
##.OBSERVE FREQUENCY= 250.131544655141
##.OBSERVE NUCLEUS= ^1H
##.ACQUISITION MODE= SIMULTANEOUS (DQD)
##.ACQUISITION SCHEME= undefined
##.AVERAGES= 16
##.DIGITISER RES= 18
##SPECTROMETER/DATA SYSTEM= dpx250
##.PULSE SEQUENCE= zg30
##.SOLVENT NAME= CDCl3
##.SHIFT REFERENCE= (INTERNAL, CDCl3, 0, 16.522)
##AUDIT TRAIL= $$ (NUMBER, WHEN, WHO, WHERE, WHAT)
$$ ##TITLE= Audit trail, XWIN-NMR		Version 3.5
$$ ##JCAMPDX= 5.01
$$ ##ORIGIN= Bruker BioSpin GmbH
$$ ##OWNER= NMR
$$ C:\u/data/dgb/nmr/ADRS/6450/pdata/1/auditp.txt
$$ ##AUDIT TRAIL=  $$ (NUMBER, WHEN, WHO, WHERE, WHAT)
(   1,<2005-07-25 09:23:33.64 +100>,<MAYBRIDGE\NMR>,<NMR_250MHZ>,
      <created by zg, POWCHK disabled, PULCHK disabled
       configuration hash MD5:
       62 19 C7 07 E1 42 D1 B7 37 6C 3D D0 77 39 F9 E6
       data hash MD5: 64K
       9C 20 8A 42 C9 2D BE 85 C2 1D D5 AA 35 B5 46 3C>)
(   2,<2005-07-25 09:23:45.89 +100>,<MAYBRIDGE\NMR>,<NMR_250MHZ>,
      <Start of raw data processing
       ef LB = 0.3 FT_mod = 6 PKNL = 1 SI = 32K 
       data hash MD5: 32K
       A9 E3 DF 48 8B 53 83 9E 14 AE F5 14 2A 18 CD C7>)
(   3,<2005-07-25 09:23:47.80 +100>,<MAYBRIDGE\NMR>,<NMR_250MHZ>,
      <apk 
       data hash MD5: 32K
       CC CB 9D 2F 81 7C 8C FC FD 1F DB A7 81 4E 88 31>)
(   4,<2005-07-25 09:23:48.52 +100>,<MAYBRIDGE\NMR>,<NMR_250MHZ>,
      <abs ABSG = 5 
       data hash MD5: 32K
       D5 5E FC A6 08 63 F8 B6 29 C1 85 56 FF 55 93 33>)
$$ ##END=
$$ 
$$ hash MD5
$$ CF 09 B3 F0 A6 C1 F1 60 5D 10 84 11 C0 56 17 4E
##$RELAX= 
##$RELAX= 
##$RELAX= 
##$RELAX= 
##$RELAX= 
##$RELAX= 
##$RELAX= 
$$ Bruker specific parameters
$$ --------------------------
##$DU= <C:\u>
##$EXPNO= 6450
##$NAME= <ADRS>
##$PROCNO= 1
##$TYPE= <nmr>
##$USER= <dgb>
##$AMP= (0..31)
100 100 100 100 100 100 100 100 100 100 100 100 100 100 100 100 100 100 
100 100 100 100 100 100 100 100 100 100 100 100 100 100 
##$AQSEQ= 0
##$AQ_mod= 3
##$AUNM= <au_zg>
##$AUTOPOS= <2 >
##$BF1= 250.13
##$BF2= 250.13
##$BF3= 250.13
##$BF4= 250.13
##$BF5= 500.13
##$BF6= 500.13
##$BF7= 500.13
##$BF8= 500.13
##$BYTORDA= 1
##$CFDGTYP= 0
##$CFRGTYP= 5
##$CHEMSTR= <none>
##$CNST= (0..31)
1 1 145 1 1 1 1 1 1 1 1 1 1 1 1 1 1 1 1 1 1 1 1 1 1 1 1 1 1 1 1 1 
##$CPDPRG= <>
##$CPDPRG1= <>
##$CPDPRG2= <>
##$CPDPRG3= <>
##$CPDPRG4= <mlev>
##$CPDPRG5= <mlev>
##$CPDPRG6= <mlev>
##$CPDPRG7= <mlev>
##$CPDPRG8= <mlev>
##$CPDPRGB= <>
##$CPDPRGT= <>
##$D= (0..31)
0 1 0 0 0 0 0 0 0 0.06 0 0 0 0 0 0 0.0002 0 0 0 0 0 0 0 0 0 0 0 0 0 0 
0 
##$DATE= 1122279812
##$DBL= (0..7)
120 120 120 120 120 120 120 120 
##$DBP= (0..7)
150 150 150 150 150 150 150 150 
##$DBP07= 0
##$DBPNAM0= <>
##$DBPNAM1= <>
$$ [...]
##$SUBNAM7= <"">
##$SUBNAM8= <"">
##$SUBNAM9= <"">
##$SW= 20.6930455092707
##$SWIBOX= (0..15)
0 0 3 0 0 0 0 0 0 0 0 0 0 0 0 0 
##$SW_h= 5175.983436853
##$TD= 65536
##$TD0= 1
##$TE= 296.16
##$TE2= 300
##$TE3= 300
##$TEG= 300
##$TL= (0..7)
0 120 120 120 120 120 120 120 
##$TP= (0..7)
150 150 150 150 150 150 150 150 
##$TP07= 0
##$TPNAME0= <>
##$TPNAME1= <>
##$TPNAME2= <>
##$TPNAME3= <>
##$TPNAME4= <>
##$TPNAME5= <>
##$TPNAME6= <>
##$TPNAME7= <>
##$TPOAL= (0..7)
0.5 0.5 0.5 0.5 0.5 0.5 0.5 0.5 
##$TPOFFS= (0..7)
0 0 0 0 0 0 0 0 
##$TUNHIN= 0
##$TUNHOUT= 0
##$TUNXOUT= 0
##$USERA1= <user>
##$USERA2= <user>
##$USERA3= <user>
##$USERA4= <user>
##$USERA5= <user>
##$V9= 5
##$VALIST= <valist>
##$VCLIST= <CCCCCCCCCCCCCCC>
##$VD= 0
##$VDLIST= <DDDDDDDDDDDDDDD>
##$VPLIST= <PPPPPPPPPPPPPPP>
##$VTLIST= <TTTTTTTTTTTTTTT>
##$WBST= 1024
##$WBSW= 4
##$XGAIN= (0..3)
0 0 0 0 
##$XL= 0
##$YL= 0
##$YMAX_a= 820704
##$YMIN_a= -800964
##$ZGOPTNS= <>
##$ZL1= 120
##$ZL2= 120
##$ZL3= 120
##$ZL4= 120
##$ABSF1= 16.522
##$ABSF2= -4.171173
##$ABSG= 5
##$ABSL= 3
##$ALPHA= 0
##$AQORDER= 0
##$ASSFAC= 0
##$ASSFACI= 0
##$ASSFACX= 0
##$ASSWID= 0
##$AUNMP= <proc_1d>
##$AZFE= 0.1
##$AZFW= 0.1
##$BCFW= 0
##$BC_mod= 0
##$BYTORDP= 0
##$COROFFS= 0
##$CY= 12.5
##$DATMOD= 1
##$DC= 0
##$DFILT= <>
##$DTYPP= 0
##$F1P= 14.0000005364418
##$F2P= -0.99999901652339
##$FCOR= 0.5
##$FTSIZE= 32768
##$FT_mod= 6
##$GAMMA= 0
##$GB= 0
##$INTBC= 1
##$INTSCL= 1
##$ISEN= 128
##$LB= 0.3
##$LEV0= 0
##$LPBIN= 0
##$MAXI= 10000
##$MC2= 0
##$MEAN= 0
##$ME_mod= 0
##$MI= 0
##$NCOEF= 0
##$NC_proc= -1
##$NLEV= 6
##$NOISF1= 0
##$NOISF2= 0
##$NSP= 0
##$NTH_PI= 0
##$NZP= 0
##$OFFSET= 16.522
##$PC= 1
##$PHC0= -82.53522
##$PHC1= 5.603109
##$PH_mod= 1
##$PKNL= yes
##$PPARMOD= 0
##$PSCAL= 4
##$PSIGN= 0
##$REVERSE= no
##$SF= 250.13
##$SI= 32768
##$SIGF1= 0
##$SIGF2= 0
##$SINO= 400
##$SIOLD= 32768
##$SREGLST= <1H.CDCl3>
##$SSB= 0
##$STSI= 32768
##$STSR= 0
##$SW_p= 5175.98343685301
##$SYMM= 0
##$S_DEV= 0
##$TDeff= 65536
##$TDoff= 0
##$TI= <Analysis number 999999
Compound Code 99
Book Reference 9
Project Code 9>
##$TILT= no
##$TM1= 0
##$TM2= 0
##$TOPLEV= 0
##$USERP1= <user>
##$USERP2= <user>
##$USERP3= <user>
##$USERP4= <user>
##$USERP5= <user>
##$WDW= 1
##$XDIM= 32768
##$YMAX_p= 286823853
##$YMIN_p= -12573
$$ End of Bruker specific parameters
$$ ---------------------------------
##NTUPLES= NMR SPECTRUM
##VAR_NAME=  FREQUENCY,     SPECTRUM/REAL,   SPECTRUM/IMAG
##SYMBOL=    X,             R,               I
##VAR_TYPE=  INDEPENDENT,   DEPENDENT,       DEPENDENT
##VAR_FORM=  AFFN,          ASDF,            ASDF
##VAR_DIM=   32768,         32768,           32768
##UNITS=     HZ,            ARBITRARY UNITS, ARBITRARY UNITS
##FACTOR=    0.157963299565203, 1,           1
##FIRST=     4132.6476996994, 0,             0
##LAST=      -1043.33573715361, 0,           0
##MIN=       -1043.33573715361, -12573,      0
##MAX=       4132.6476996994, 286823853,     0
$$ Real data points
##PAGE= N=1
##DATA TABLE= (X++(R..R)), XYDATA
$$ [...]
19644B869o67j144J150M54L692J026l096o3q35k947J773K706l2K823L6j582j142
19627E021n88n96j081k240p81P26J395J919r93j886o99n36J226J574j302O4L88
19610A611R0k414k357r34L017K876J731j260j784j341J614m31j82J804J368J779
19594E187k714o95j638o45j474K93J795K688l12J695j834j65K471l617k980l218
19578e163L958j401p68L415L207j03j168O20k259L13J637K479K58l574k535l4
19562a118k429k2M145L732p48k836j328K471M748J736j51l502j198K199n26J027
19546F200j692k780j939k420O37L672P05l657R89K725K068l61j984j573j533j640
19530b583R6J104L108R72Q7j519l368K055L568J77J220L824l367k855P91K7l163
$$ plain form
19644 2869 2202 1058 2208 2662 6354 7380 4284 4221 3386 439 2212 4918 4886 7709 7745 6163 5021
19627 5021 4433 3837 2756 516 -265 461 1856 3775 2782 896 197 -339 887 2461 1159 1223 1611
19610 1611 1701 -713 -3070 -4004 -987 1889 3620 2360 576 -765 849 418 236 2040 3408 5187
19594 5187 2473 1778 140 -505 -1979 -1686 109 2797 2485 4180 2346 2181 4652 1035 -1945 -5163
19578 -5163 -1205 -2606 -3374 41 3248 3145 1977 2597 338 651 2288 4767 5025 1451 -1084 -1118
19562 -1118 -3547 -3569 576 4308 3560 724 -604 1867 6615 8351 8200 4698 3500 5699 5173 6200
19546 6200 4508 1728 -211 -2631 -1994 1678 2383 -1274 -285 2440 4508 4147 2163 590 -943 -2583
19530 -2583 -2487 -1383 1725 2697 2784 1265 -2103 -48 3520 3697 4917 8741 5374 2519 3310 3337 174
19513A74O10q98J685K102Q41J651L197j317l138q66J33J594j285j364j009l30
19497A780n34k026r55O079N764k56n298j546j697k01J650k301J699J229j545R3
19481A935n88N54K263M244K320n867m252K059M18l33l062j879P84M267L004p98
19465E069k613N10m067J249j38M89L874N57M57m11j543M6K502M69p71q62P9n39
19447D357R01K652q45k938k6j273j260N464j649l006P13L570j506k934k668L821
19431C373K966K92K553k06j361J098j737l308J352J718m200K252K128Q33k105
19416E648j854L73l053q94J617K638k77N02k82j378R39L139k280j455J667K192
19400G242J49o64J270J945J535k18j788j145m73N45j754o42P85J408L509Q02k394
$$ plain form
19513 174 784 -114 1571 3673 4514 6165 9362 8045 4907 4041 4174 5768 4483 3119 2110 1780
19497 1780 1246 -780 -1735 4344 10108 9852 4554 3008 1311 1110 2760 459 2158 3387 1842 1935
19481 1935 1347 1901 4164 8408 10728 4861 609 2668 3086 2753 -309 -2188 -1404 2863 5867 5069
19465 5069 2456 2966 -1101 148 10 499 4373 4930 5387 4976 3433 3479 5981 6450 5679 4817 4896 4357
19447 4357 5258 7910 7065 4127 4101 2828 1568 7032 5383 2377 3090 6660 5154 2220 -448 3373
19431 3373 6339 6631 9184 8978 7617 8715 6978 3670 5022 6740 2540 4792 6920 7753 5648
19416 5648 3794 4167 1114 220 1837 4475 4198 4700 4418 3040 3979 7118 4838 3383 5050 7242
19400 7242 7391 6727 7997 9942 11477 11259 9471 8326 7853 8398 6644 6002 6787 8195 11704 12506 10112
19383A0112o27N7J446J469K736J452K369L791J607M5M27j665O33L069r7M621Q189
19366C9634Q847J5162J8589K6474L2081M2785M5968L0579Q336j1076j8293m236
19354B34850J5129K2543J84k5691m3257m6460m0574l1169j6473j4775j1724q018
19342C4565n136o177n578k087o44k134J803J508k948k992l09K606o07k368n4Q77
19326A0325J85k368l258K365L308j815r72j327k020J402J452K809k37m140k156
19311C553N91k36j313j006J904L677j466J698R78j720o94l450j226L010J492k79
19295E513K49k289l860k450N26O56J003n87K574J815l496k368K039J236J954J612
19279D127L28O345K667m024l312R56p53j12K933L434J262m87L43j769K53j00K273
$$ plain form
19383 10112 9485 9542 10988 12457 15193 16645 19014 22805 24412 24457 24884 23219 23852 26921 26824 31445 39634
19366 39634 48481 63643 82232 108706 140787 183572 229540 260119 268455 257379 239086 234850
19354 234850 249979 272522 272706 247015 203758 157298 116724 85555 69082 54307 42583 34565
19342 34565 29429 23252 17674 15587 14943 12809 14612 16120 13172 10180 9871 12477 11870 9502 9448 10325
19326 10325 10510 8142 4884 7249 10557 8742 7770 6443 4423 5825 7277 10086 9849 5709 3553
19311 3553 4144 3908 2595 1589 3493 7170 5704 7402 8380 6660 5966 2516 1290 4300 5792 5513
19295 5513 5762 3473 -387 -2837 -2311 -1655 -652 -1239 1335 3150 -346 -2714 -675 561 2515 4127
19279 4127 4455 10800 13467 9443 6131 7087 6334 6222 9155 12589 13851 13364 13707 11938 12191 12091 14364
19262A4364j543k820K811K9m48j44j068k701j214j512Q80R32k63K793J893O79
19246A2668J106k411j706j037k804j579L407L163K614j270J074n79l820k642L0
19231F214o28N35M820Q87l369o33Q88J965J508j954j078m50k262k974j165l227
19215i23J973R2L575q73K603L586J779j972p35J116l404j410n44n01P12J56p66
19198D464K517J096m224m20J998L522L13J045L221L51m408l164L518J82N20l53
19182A0178R7l822J082O385J489R19K803J535l234l413r50o66k294k39M089J032
19166A4991J717k901k774K041J635L630J012j416J63r26k422n29J963J468K020
19151A9672Q24j416l34k346Q1K022N744O736J144K807O704N683O913Q570Q124
$$ plain form
19262 14364 12821 10001 12812 12841 12393 12249 11181 8480 7266 5754 6634 7566 7303 10096 11989 12668
19246 12668 13774 11363 9657 8620 5816 4237 7644 10807 13421 12151 13225 12646 8826 6184 6214
19231 6214 5586 6121 10941 11828 8459 7826 8714 10679 12187 10233 9155 8705 6443 3469 2304 -923
19215 -923 1050 1142 4717 3844 6447 10033 11812 9840 9105 10221 6817 5407 4863 4362 5074 5230 4464
19198 4464 6981 8077 3853 3433 5431 8953 9266 10311 13532 13883 9475 6311 9829 10011 10531 10178
19182 10178 10275 6453 7535 13920 15409 16328 19131 20666 17432 14019 13069 12403 10109 9870 13959 14991
19166 14991 16708 13807 11033 13074 14709 18339 19351 17935 18098 17172 14750 14221 16184 17652 19672
19151 19672 20496 19080 18746 16400 16481 18503 24247 30983 32127 34934 41638 47321 54234 62804 70928
19136G0928J1311J3232J4879J6468J8623J9255J5022J2854O517O589N319M007
19124B15004l328r369j0100j0589j2914j6088j7589j6717j6159j6459j1973j0580
19112F3139q476n919o160n905k836m181n182J268m0k102q5R98r32M63L12k399
19096B1963j022J883J098k636J136l295j734J823j99j129l545J002k956j668o66
19081A0055m111K650J825j150M333J361k01J125n97M03k748j450O19k717K19Q99
19065A0515K515J158o25J162L804L972k717O75J148j712j701J74j208n70j360
19050A5230l40j193l507o20L887K288K858J488N81r02m457m522N24J551L683m94
19034A6055K59j645Q72J08J001j310j071l70j014j724j002K325J569R18K344O304
$$ plain form
19136 70928 82239 95471 110350 126818 145441 164696 179718 192572 199089 205678 210997 215004
19124 215004 211676 202307 192207 181618 168704 152616 135027 118310 102151 85692 73719 63139
19112 63139 54663 48744 42584 36679 33843 29662 24480 25748 25708 23606 23521 24519 23587 24050 24362 21963
19096 21963 20941 22824 23922 21286 22422 19127 17393 19216 19017 17888 14343 15345 12389 10721 10055
19081 10055 5944 8594 10419 9269 13602 14963 14762 15887 15290 15693 12945 11495 12114 9397 9616 10515
19065 10515 13030 14188 13563 14725 18529 22501 19784 20459 21607 19895 18194 18368 17160 16590 15230
19050 15230 14890 13697 10190 9570 13457 15745 18603 20091 20672 19770 15313 10791 11315 12866 16549 16055
19034 16055 16314 14669 15541 15649 16650 15340 14269 13899 12885 11161 10159 12484 14053 14971 17315 23619
19018B3619N142J146m677m481N63Q34J659J91K720O98k088k31K046P409P629N747
19002D7926M065l88m252j595L007O30M328L441l095o191p884n361m514J483j13
18987C1487m351m36l534j827j583j885K943L914J342q64J750K674j723P01J128
18972B9736L607O55j208L1K07j990Q41J552j837R81J174J348l117j537R48q53
18956C0538J29j576J615qJ485N90k646m029n106l11J535r82R30M193k83l43J04
18939B5835k095j730k764L335L01K149O6p0K020o96j910k769K836L30l476P39
18923B2101L549K810J759P67N49K060N2k486j568K494R65q93j09r48J237J70J76
18906C2685j751J332K201J689K493K146n09J215J136N28J780N78k12K710j01r17
$$ plain form
19018 23619 28761 29907 25230 20749 21312 22146 23805 23996 26716 27414 25326 25095 27141 34550 42179 47926
19002 47926 51991 51603 47351 45756 48763 49393 53721 57162 54067 47876 39992 34631 30117 31600 31487
18987 31487 27136 26700 23166 21339 19756 17871 20814 24728 26070 25206 26956 29630 27907 28608 29736
18972 29736 33343 33998 32790 32821 33028 31038 31879 33431 31594 32575 33749 35097 31980 30443 31391 30538
18956 30538 30667 29091 30706 30698 32183 32773 30127 26098 20992 20681 22216 21234 22164 26357 26074 25731 25835
18939 25835 23740 22010 19246 22581 22882 25031 25097 25027 27047 26351 24441 21672 24508 24838 21362 22101
18923 22101 25650 28460 30219 30986 31535 33595 33647 31161 29593 32087 33052 32159 32050 31102 32339 32509 32685
18906 32685 30934 32266 34467 36156 38649 40795 40286 41501 42637 43165 44945 45523 45311 48021 47920 47003
18890D7003r76L65J292J056K45J421N603P491Q758Q661J0758J9982J9739J0699
18876A42097P288M005r13l180N587O667L263j203j0960j8244j6775j1950o261
18863I9421k896j722M528O20m444l065j722k183l599K33K202R03j601m0J127L072
18847I0834K461K151J205J418K438O06M839N184K145K650J818L056P69J793N449
18832A28816R138J0027P585L440R011J3619K1726L1193M1572N6561O9547P0826
18820D73061M0545O210j4586j1269J1675K9523J3756k4798n7955o4219m8949l2134
18808C20860j7199q090j008J149O111Q178J1309J6495K1389L1971M4673O3226
18796D99064P1609O3266L5674J4857J2822L0383N8882Q4864P9455L8024j0785
$$ plain form
18890 47003 46027 46392 47684 48740 48985 50406 56009 63500 72258 80919 91677 111659 131398 142097
18876 142097 149385 153390 152477 149297 154884 161551 164814 163611 152651 134407 117632 105682 99421
18863 99421 96525 94803 99331 99951 95507 92442 90720 88537 84938 85171 87373 88276 86675 86635 87762 90834
18847 90834 93295 95446 96651 98069 100507 101113 105952 111136 113281 115931 117749 120805 121574 123367 128816
18832 128816 137954 147981 155566 159006 168017 181636 203362 234555 276127 332688 402235 473061
18820 473061 513606 519816 505230 493961 505636 535159 548915 524117 466162 401943 352994 320860
18808 320860 303661 295571 294563 295712 301823 310001 321310 337805 359194 391165 435838 499064
18796 499064 570673 633939 669613 684470 697292 727675 786557 871421 950876 988900 978115
18785I78115m1187l0105J972L2707M9388L3222K675k2000j2128J5858M3658O1555
18773A113730O5575O8365P3348R1384J19305J50952J84765K22188K59117L05105
18763B653834L68467M51693N66419P13805Q97933J162406J568246K229935L290842
18754A3903580M920132P129876R138681Q752889M544792n73067l535982k886898
18746D1394003P79024M155283L893343o75267n851063r026855r002819o913095
18738A8752554m832544l336089k331303j674699j241360r46295p27207n62921
18730C100136m39707l45552k73850k18620j85323j57839j32139j10854r3487o9896
18720A072869m8012l1995k5487l0976k8795j4688N583J5756N342k0018m8392m5576
$$ plain form
18785 978115 936928 906823 908795 941502 990890 1024112 1026787 1004787 992659 1008517 1052175 1113730
18773 1113730 1179305 1247670 1321018 1412402 1531707 1682659 1867424 2089612 2348729 2653834
18763 2653834 3022301 3473994 4040413 4754218 5652151 6814557 8382803 10612738 13903580
18754 13903580 18823712 25953588 35092269 43845158 48389950 47816883 44280901 41394003
18746 41394003 42173027 46328310 50221653 49546386 43695323 34668468 25665649 18752554
18738 18752554 13920010 10583921 8252618 6577919 5336559 4390264 3663057 3100136
18730 3100136 2660429 2314877 2041027 1822407 1637084 1479245 1347106 1236252 1142765 1072869
18720 1072869 1024857 992862 967375 936399 907604 892916 898499 914255 919597 899579 851187 805611
18708H05611k2068O127K4633K0914q778n0624p2671o8692m4588j3211O083p121
18696E75615l2431n5175o3158n5962m2405l1225k2607j6980j3119j0359p092n490
18684B19612o478q164j0505j1932r430o759n626n499p624j762k306n101k776k833
18670A32817l619K776K746j141j496p71k723R94M6n67k938o765n219m080m525
18655A05535j594j128k991j897k242k230q55l32r21J76K64q98j9o71j318j086
18639H7793r56L473J402Q16k476k973k91J626L241J058r97L234l53J378R94J558
18623I8527J680L40k494r61L64J643L086L258N2L363N006K887k071j76O267J0828
18607A31599J3947J6000J0725M951M143K291j887j899J704K060mm245m733n869
$$ plain form
18708 805611 783543 789670 814303 835217 826439 775815 703144 634452 589864 576653 582736 575615
18696 575615 543184 488009 424851 368889 326484 295259 272652 255672 242553 232194 225102 219612
18684 219612 213134 204970 194465 182533 173103 166344 160718 155219 147595 145833 143527 138426 135650 132817
18670 132817 129198 131974 134720 133579 132083 131312 128589 129583 129629 129062 126124 119359 114140 110060 105535
18655 105535 103941 102813 99822 97925 95683 93453 92598 92266 91345 91521 91785 90887 90868 90197 88879 87793
18639 87793 86837 90310 91712 92528 90052 87079 86788 88414 91655 92713 91716 94950 94597 95975 96969 98527
18623 98527 100207 100547 98053 97092 97456 99099 102185 105443 105495 108858 113864 116751 114680 114504 120771 131599
18607 131599 145546 161546 172271 177222 181365 183656 181769 179870 181574 183634 183630 179385 174652 168783
18593A68783p539r831p664l775l518k744R88J722R36l56o94L473L158K514K800
18578A48253R23p1j881L251N35J170J988j433l743l76M259K33j464Q30L178J850
18562A57502l160O30J805K897M329O972O153K133L811L424M127O907M905N500
18548B07935P225L992J237K719L801L450Q593R143J0329P979N513L709P925J0481
18534B94031Q661R041J3306J3212J4703J4245J9030J4817J7555K0018K0393K1402
18522D80414K8023L0222L0697L6360L8941M7900M5903M8195N4036O0665O1845
18511I63201O1486O3796O6156O6988P2520P3136P2149P8008Q4210R3831J00811
18500A796292J13561J33825J61220J90095K21140K57162L10555L72128M47333
$$ plain form
18593 168783 161244 151413 143749 139974 136456 133712 134700 136422 137358 137002 136308 139781 142939 145453 148253
18578 148253 149176 149105 147224 150475 151010 152180 154168 152735 148992 148616 152875 153108 151644 152474 155652 157502
18562 157502 154342 154972 156777 159674 164003 170975 177128 179261 183072 186496 190623 197530 202435 207935
18548 207935 215160 219152 220389 223108 226909 230359 238952 248095 258424 266403 271916 275625 283550 294031
18534 294031 302692 311733 325039 338251 352954 367199 386229 401046 418601 438619 459012 480414
18522 480414 508437 538659 569356 605716 644657 692557 738460 786655 840691 901356 963201
18511 963201 1024687 1088483 1154639 1221627 1294147 1367283 1439432 1517440 1601650 1695481 1796292
18500 1796292 1909853 2043678 2204898 2394993 2616133 2873295 3183850 3555978 4003311
18491D003311N41243O64226Q23465J038719J316449J655263K044688K448236K816165
18482A7351765L120009L326054L346252L124879K754434K309282J769194J133501
18474C8235370M49573k64426r69730j594513k120712k582420k975015l234922
18466B4943205l303591l184025k927803k600485k226872j836361j474608j169975
18458F219485r23121p36874n88522m73938l87047l19370k68687k24102j82839
18449B114985j55749j31713j09672r4976q6606p7481o8336o9171o6963o7685o5574
18438A121059o6327o7472o2338o2782o2346n6472m9595m6366m7699m2851l8640
18427E18171l2601k7049k2749k0496j9176j5865j5832j2780j0809j4533j4424
$$ plain form
18491 4003311 4544554 5208780 6032245 7070964 8387413 10042676 12087364 14535600 17351765
18482 17351765 20471774 23797828 27144080 30268959 33023393 35332675 37101869 38235370
18474 38235370 38684943 38420517 37450787 35856274 33735562 31153142 28178127 24943205
18466 24943205 21639614 18455589 15527786 12927301 10700429 8864068 7389460 6219485
18458 6219485 5296364 4559490 3970968 3497030 3109983 2790613 2521926 2297824 2114985
18449 2114985 1959236 1827523 1717851 1622875 1536269 1458788 1390452 1321281 1254318 1186633 1121059
18438 1121059 1054732 987260 924922 862140 799794 743322 693727 647361 599662 556811 518171
18427 518171 485570 458521 435772 415276 396100 380235 364403 351623 340814 326281 311857
18416C11857j0485p320q717p334r776r557q804o319o043q825p870q617q214q243
18402A95733q893l868k899k410k795o463o775m850j562j302k365l611n353l530
18388A39057j416n226n889j978J616m489o691k219j930m35P39k2N66r83m402n110
18372A01188n07m525k200k107M50l794k971N43k442j953J272J505M13m28q88n87
18356H2969q17Q39j374o006j507J86K470j013k131k25J914K350j611k494k789
18341G0761l306K68K250J295k291k128l638l183j383J48k269j622J86J442J870
18326E8400l07N55k235j24j809k098k519k974n9O36L734M813l36j655K871R05
18310E7798M665K337r42L172K916K769m315l454M213J959J76K173p90k471L76
$$ plain form
18416 311857 301372 294052 285335 278001 268225 258668 249864 243545 237502 228677 220807 212190 203976 195733
18402 195733 186840 182972 180073 177663 174868 168405 161630 156780 155218 153916 151551 147940 142587 139057
18388 139057 137641 132415 126526 124548 126164 121675 114984 112765 110835 110400 111139 111117 111683 110700 106298 101188
18372 101188 100681 96156 93956 91849 92299 88505 85534 86077 83635 81682 82954 84459 84872 84444 83556 82969
18356 82969 82152 82991 81617 75611 74104 74290 76760 75747 73616 73391 75305 77655 76044 73550 70761
18341 70761 67455 67723 69973 71268 68977 66849 63211 60028 58645 58793 56524 54902 55088 56530 58400
18326 58400 58093 58648 56413 56289 54480 52382 49863 46889 46830 47466 51200 56013 55677 54022 56893 57798
18310 57798 62463 64800 63858 67030 69946 72715 68400 64946 69159 71118 71294 73467 72677 70206 70582
18295G0582m324l195j201k131J716q91j471m677l753r35l685p87j601j241k367
18280D0039M44l384J424p72k792o00n898k876L66P05R01j880j48l846j252Q13
18264B1244j651l147N13K599k879l347N23K93k774l857k005M502K576J158J507
18249A5255k432m07L102J405n40J907q48p94L033N285L474J475K68J095J354J226
18233C3858K308r71k253j585m805o417r06K46o31M9K453o5J082O19L10m61J539
18216B4370R0J335k330l350o94m51m683k336K567K441N95n82k899M07K120J500
18200A8100J046k14j073k341l41J517l061k465L058m27J986J933J251N59M74l28
18184A9674J297M08j12Q9J527j134L43o10L82L568r86p356j313O21j010j515j739
$$ plain form
18295 70582 66258 63063 61862 59731 61447 60556 59085 54408 50655 49720 46035 45248 43647 42406 40039
18280 40039 40483 37099 38523 37751 34959 34359 28461 25585 25951 26656 27557 25677 25529 21683 20431 21244
18264 21244 19593 16446 16959 19558 16679 13332 13855 14148 11374 7517 5512 10014 12590 13748 15255
18249 15255 12823 12416 15518 16923 16383 18290 17442 16648 19681 24966 28440 29915 30183 31278 32632 33858
18233 33858 36166 35195 32942 31357 26552 20135 19229 19475 18844 18893 21346 21281 22363 22982 23292 22831 24370
18216 24370 24460 25795 23465 20115 19421 18970 14287 11951 14518 16959 17554 16972 14073 14480 16600 18100
18200 18100 19146 18932 17859 15518 15177 16694 13633 11168 14226 13799 15785 17718 18969 19528 20002 19674
18184 19674 20971 21379 21267 21356 22883 21749 22092 21482 21864 25432 24446 17090 15777 16398 15388 13873 12134
18167A2134K65J546j189M577L692K319o50k345n89N33L710K780L845m27k290J904
18151B9815M027M289K979Q01J654K577K931K559M991N663Q143J2788J7343K9670
18137A30230L6631M9142N1955L2300N876p867j1436q76J5441K1219Q605j6022
18125C15198l3058l4572k5838j2512j162R822J9745K6551L5303N4603P3685R4929
18113E22694J35273K15898L61828O12697J047668J552962J445254K40130q12867
18104E321537j477313j352485q45482n13267l21116k04641j43821j03601p4600
18095B85211n4648l9403k7735k4155j9739j5475j2325q218r369n374o016j1245
18083E1509l835m17Pj345l863k148l520n752m134l118o45r0j452j989n92m741
$$ plain form
18167 12134 12399 13945 12756 17333 21025 23344 22694 20349 19760 20293 24003 26783 30628 30201 27911 29815
18151 29815 33842 38131 41110 41911 43565 46142 49073 51632 56623 62286 70429 83217 100560 130230
18137 130230 166861 216003 267958 300258 306134 298267 286831 285955 301396 322615 331220 315198
18125 315198 282140 247568 221730 209218 208056 217878 237623 264174 299477 354080 427765 522694
18113 522694 657967 873865 1235693 1848390 2896058 4449020 5894274 6134404 5321537
18104 5321537 3844224 2491739 1646257 1132990 811874 607233 463412 359811 285211
18095 285211 230563 191160 163425 139270 119531 104056 91731 83513 74144 68770 62754 51509
18083 51509 47674 47257 47264 45919 42056 39908 36388 30636 26502 23384 22739 22649 21197 19208 18616 13875
18067A3875m011k259K041J140j992K277L357j129l793Q06M143K148q50k681o289
18052F783q30K786j54J138M7r77j348j753K56j505k902J763L103J316K846q22
18036I747k416j620K268J171k473n040l412L953N679K311O3o75j405k151j880
18021D120J183K956m33J121K475j75k196j826j39o61m6L204L798J145k638k612
18005I276k794j616j137J034J944k764Q40R02j132J441l97J922n93j53j039K11
17989E945J83N43l167q9j028l298K109L027l50K196K46k393n024k536j637J602
17973c671K38l9q16Q55L68j271l280J131j54j52M621J795j8J299J740N17l299
17956a36k359O715O77l293j454L444K793k965O0q53n33J117o464j923L734j829
$$ plain form
18067 13875 9864 7605 9646 10786 8794 11071 14428 13299 9506 10312 14455 16603 15753 13072 6783
18052 6783 5953 8739 8585 9723 9770 8793 7445 5692 5948 4443 1541 3304 6407 7723 10569 9747
18036 9747 7331 5711 7979 9150 6677 1637 -1775 2178 7857 10168 10231 9556 8151 6000 4120
18021 4120 5303 8259 7826 8947 11422 11247 9051 7225 7086 6425 6379 9583 13381 14526 11888 9276
18005 9276 6482 4866 3729 4763 6707 3943 4783 5685 4553 5994 5597 7519 6926 6773 5734 5945
17989 5945 6128 6671 3504 3415 2387 -911 1198 4225 3875 6071 6317 3924 -1100 -3636 -5273 -3671
17973 -3671 -3433 -3472 -4288 -3433 -3065 -4336 -7616 -6485 -6639 -6791 -2170 -375 -393 906 2646 3163 -136
17956 -136 -2495 4220 4897 1604 150 3594 6387 3422 3482 2629 2096 3213 -3251 -5174 -1440 -3269
17940c269n73N37R7m01k26J961L628J71k76n47m012k599L320l321k505K305M558
17923a152K365K912q32M64J26k384j985l97j998L566K269L393j461j872k868k359
17907b213Q29j586k36p26j606J872J327l965o68K873J970M31l090k26k82K958
17891b338L346K675K24M70j352m057L333K268l363k119j730J156N09J806J578
17876B406m20l795l231J359N53j10q52K40K050j500j268L451M030J338L33Q44
17860E428j429J350J219K33j891k95K537M76j242j738J285K235J898r14r48j513
17844F691n61q13K30N110K930K060K360j755j509K12K729J067K128K692M559N467
17828C3597O581M606J0217J1530J2358J5063J7857J5600J4628J4153J7992J3321
$$ plain form
17940 -3269 -3842 -3305 -3208 -3609 -3835 -1874 1754 1925 1649 1102 -2910 -5509 -2189 -5510 -8015 -5710 -1152
17923 -1152 1213 4125 3293 3757 3883 1499 -486 -883 -2881 685 2954 6347 4886 3014 146 -2213
17907 -2213 -1384 -2970 -3206 -3932 -5538 -3666 -2339 -6304 -6972 -4099 -2129 -1698 -4788 -5014 -5296 -2338
17891 -2338 1008 3683 3907 4377 3025 -1032 2301 4569 1206 -913 -2643 -1487 -978 828 2406
17876 2406 1986 -1809 -5040 -3681 -3128 -3238 -4090 -3850 -1800 -3300 -4568 -1117 2913 4251 4584 5428
17860 5428 3999 5349 6568 6801 4910 4615 7152 7628 6386 4648 5933 8168 10066 9152 8204 6691
17844 6691 6130 5317 5547 10657 13587 15647 18007 16252 14743 14955 17684 18751 20879 23571 28130 33597
17828 33597 40178 44784 55001 66531 78889 93952 111809 127409 142037 156190 174182 187503
17816A87503J1720R910J231j564n092p016j1858j3739j6171j7579j8586k0445
17804I8314j5762j4629j1271m051r210q879k571m367n457m472j413j423j625j959
17790A1225N2J128l90n294k239m8N32K620k421j136j035m96J456J793L17l218
17774B846j17m93J802j117k115n51j333L534J692n409K61K690L35j609J130K6
17758A572j970k893J690M412J089k198J172j707l085J323m10Q40P3O80Q28l443
17742b027j890O02N84N65J037K174J829L209J052k017J321n48k461j728J348p32
17726B318k743q55O17k563J000L78K696o93k503o40o58L044j39Q49j273n39k78
17709a982K025J649j204Q09p23K785J168J887L025K993J261r83k215l66J169k98
$$ plain form
17816 187503 199223 209133 210364 208800 203708 196692 184834 171095 154924 137345 118759 98314
17804 98314 82552 67923 56652 52601 43391 34512 31941 27574 22117 17645 16232 14809 13184 11225
17790 11225 11277 12405 12015 6721 4482 4434 4966 7586 5165 4029 2994 2498 3954 5747 6064 2846
17774 2846 2729 2236 4038 2921 806 255 -1078 2456 4148 -1261 -1000 1690 2025 416 1546 1572
17758 1572 -398 -3291 -1601 2811 3900 1702 2874 1167 -1918 -595 -1005 -165 -92 588 1416 -2027
17742 -2027 -3917 -3315 -2731 -2166 -1129 1045 2874 6083 7135 5118 6439 5891 3430 1702 3050 2318
17726 2318 -425 -1280 -663 -3226 -2226 -1848 848 155 -2348 -2988 -3646 -602 -741 108 -1165 -1704 -1982
17709 -1982 43 1692 488 1297 574 3359 4527 6414 9439 12432 13693 12710 10495 10129 11298 11000
17693A1000K554M985M836P442J391K165K022K690N083M793K048K787l20k160o155
17678D5161m737k530p118n136P82k381k194k261p489l574k825l480J665L94l025
17663A252J351J806o21o73K309J937j126l051l541m054J397M575J589l64R24l045
17647F65K7J634K661K155J11k94l671j803j006p28J752Q50M25k810m099n0K775
17630a406l029N7m89j90q58L6L581p78J950J39J428M33L1j062Q15J751J219j062
17612B566l104J396K790K5m446n987q66N955K678k943k446j540p66n6K30K179
17596d335J524R13O61J553o88K580M15k335j180j341l068k229K771L548N20j982
17580b673J590K089k229K3j201k326N62o2j155K2K481K012K724J044j284j613
$$ plain form
17693 11000 13554 18539 23375 30817 32208 34373 36395 39085 44168 48961 51009 53796 53476 51316 45161
17678 45161 40424 37894 30776 25640 26422 24041 21847 19586 12097 8523 5698 2218 3883 4277 1252
17663 1252 2603 4409 3788 3115 5424 7361 6235 3184 -357 -4411 -3014 1561 3150 2786 3710 665
17647 665 692 2326 4987 7142 7253 6959 3288 1485 479 -249 1503 2353 2778 -32 -4131 -4181 -1406
17630 -1406 -4435 -4378 -4867 -5057 -5915 -5879 -2298 -3076 -1126 -987 441 874 905 -157 658 2409 3628 2566
17612 2566 -538 858 3648 3673 -773 -6760 -7626 -1671 1007 -1936 -4382 -5922 -6688 -6744 -6514 -4335
17596 -4335 -2811 -1898 -1237 316 -372 2208 2623 288 -892 -2233 -5301 -7530 -4759 -1211 -691 -2673
17580 -2673 -1083 1006 -1223 -1200 -2401 -4727 -4165 -4227 -5382 -5360 -2879 -867 1857 2901 1617 4
17564Do0k74j468O42j685m125M15K542o88K378K378l43J776L217L289M55l648
17547D805l249l109k771J60K274J805j10j443m891l82N710K932J442M302J11k137
17531E449p98k131o30k122k011j229L15Q84M37k511q50L772Q85j446k659j412
17515f057J542J170K314M293o4l029k347n200j698j22J850K075J074J406j407
17500d200Q94J954P36j185j579J669n11L19J431j199k012M47O89O30J464J042
17484E89J127J908m62m929m237k243P56L024K901N80n83P52J014L276k209l453
17468b189j95m74m53M56q36k044p52J580K992l43J66K326J790k259l95N560N19
17451E449q11j589p7K634l131K563K852K900K960J465L138R159J0907O039l567
$$ plain form
17564 4 -56 -330 -1798 -1156 -2841 -6966 -6551 -4009 -4697 -2319 59 -284 1492 4709 7998 8453 4805
17547 4805 1556 -1553 -4324 -4164 -1890 -85 -195 -1638 -6529 -6911 -1201 1731 3173 7475 7586 5449
17531 5449 4651 2520 1890 -232 -2243 -3472 -3157 -2273 -1836 -4347 -5197 -1425 -540 -1986 -4645 -6057
17515 -6057 -4515 -3345 -1031 3262 3198 169 -2178 -7378 -9076 -9198 -7348 -5273 -4199 -2793 -4200
17500 -4200 -3306 -1352 -616 -1801 -3380 -1711 -2222 -1903 -472 -1671 -3683 -3236 -2547 -1917 -453 589
17484 589 1716 3624 3162 -1767 -6004 -8247 -7491 -4467 -1566 -986 -1569 -817 197 3473 1264 -2189
17468 -2189 -2384 -2858 -3311 -2855 -3691 -5735 -6487 -4907 -1915 -2258 -2092 234 2024 -235 -630 4930 5449
17451 5449 4638 3049 2972 5606 2475 5038 7890 10790 13750 15215 18353 27512 38419 44458 40891
17436D0891o868k178L896J152O00J774l531q51L565K845L749P271P6l912n885
17421D2594n864o306j637j154j375l984R17k576o115j837j693n894m886J171K396
17406C757j157J79n05l620q89J989L725Q03j573k787r4K337k13o25R59l051k177
17389b942n7J62J610q53l723K784L307L166n37n73J004J675r72k10J98k478l057
17372a496j39p9K091j012l945K499J564M74p59J133N80k31K6l07j418J05L511
17355B597N71l412J641M92k707k367J55J306L038K100J55j865P11L37k396O45
17339A001J033M18J34k397o10k063p52j571j249J745K456Q29m28k850J877J63
17323b264r88N125K908J145m612j048P2l074k133K158q89J493L07M91l110N06
$$ plain form
17436 40891 34023 31845 35741 36893 37493 39267 35736 34885 38450 41295 45044 52315 52391 48479 42594
17421 42594 36730 30424 28787 27633 26258 22274 23191 20615 14500 12663 10970 5076 190 1361 3757
17406 3757 2600 2779 2274 -1346 -2235 -246 3479 4282 2709 -78 -172 2165 1952 1327 2286 -765 -2942
17389 -2942 -2999 -2837 -1227 -2080 -5803 -3019 288 3454 2917 2344 3348 5023 4051 3841 4039 1561 -1496
17372 -1496 -1635 -1714 377 -635 -4580 -2081 -517 -43 -802 331 911 680 706 399 -1019 -914 2597
17355 2597 3168 -244 1397 1889 -818 -3185 -3030 -1724 1314 3414 3569 1704 2415 2752 356 1001
17339 1001 2034 2452 2586 189 -421 -2484 -3236 -4807 -6056 -4311 -1855 -1026 -1454 -4304 -2427 -2264
17323 -2264 -3252 1873 4781 5926 1314 266 338 -2736 -4869 -2711 -3600 -2107 -1800 -1309 -4419 -3913
17307c913L809J3l844K066J872P6j768j640pk914j46M270o08O99n28M21L033K386
17289C277m582k634n29J997J138j313o3Q77L046o0p81j57j670o34p45J47m16P80
17271b322L065l82o76M56K067J107k299r97J307l773l594Q53M342K802k898k616
17255c558j175J047j43r51j812Q53J859l058j071M839J139l08o67j381j893J07
17239f173R31J140J708k89P1J548k854k941R17L328K576K430l174k360Q65L078
17223H01m400j449K482L133k185k550J507J215p97K676k963j805O50N33q28l277
17207g257o68q29J513K070L708K007L03j47P56j229p75j580k164o308j973K832
17191i741N522J730J467J588q00K0k334o445j177Q77O580M071N47j348m122l408
$$ plain form
17307 -3913 -104 -91 -3935 -1869 3 79 -1689 -3329 -3336 -6250 -6396 -2126 -2734 -2035 -2563 -2142 891 3277
17289 3277 -1305 -3939 -4468 -2471 -1333 -2646 -2709 -1832 1214 1154 373 216 -1454 -2088 -2833 -2686 -3102 -2322
17271 -2322 743 361 -315 141 2208 3315 1016 19 1326 -2447 -6041 -5188 -846 1956 -942 -3558
17255 -3558 -4733 -3686 -3829 -4780 -6592 -5739 -3880 -6938 -8009 -3170 -2031 -2339 -3006 -4387 -6280 -6173
17239 -6173 -5242 -4102 -2394 -2683 -2612 -1064 -3918 -6859 -5942 -2614 -38 2392 -782 -3142 -2277 801
17223 801 -3599 -5048 -2566 567 -1618 -4168 -2661 -1446 -2243 433 -2530 -4335 -3685 -3152 -3980 -7257
17207 -7257 -7925 -8754 -7241 -5171 -1463 544 847 700 1456 227 -548 -2128 -4292 -10600 -12573 -9741
17191 -9741 -4219 -2489 -1022 566 -234 -214 -2548 -8993 -10170 -9293 -2713 1358 1905 557 -3565 -6973
17175f973k630j257L659J741j404J041K004K680r89K87L225k565l222m18J839
17160b982K123n78k048j860J113m00j506N84Q34L371M22k528J17N26O56j144Q66
17143b434K169J462l573j187L746L963l944l421J858j029k349J367L161J925k868
17128a154l249j390N17K503j681k286J590M207N41O06p47j094J756N76k18O43
17112A120L304l112l702k094J408L659k149K299K629j582k289k038k32J819M72
17097d88l21k640q93M396M248q93j563r76k405m011J089M10n28N08K129L417k753
17080a274l277j3j587j393J533K598r09q0j563o8j095k272N657N196O92k414J227
17063I58J243R65j490j59k50k986q10L134L229k353m251J375L224K676m180J370
$$ plain form
17175 -6973 -9603 -10860 -7201 -5460 -6864 -5823 -3819 -1139 -2128 -1841 1384 -1181 -4403 -4821 -2982
17160 -2982 -859 -1437 -3485 -5345 -4232 -4632 -6138 -5554 -4720 -1349 -927 -3455 -3338 -2812 -2156 -3300 -2434
17143 -2434 -265 1197 -2376 -3563 183 4146 202 -3219 -1361 -2390 -4739 -3372 -211 1714 -1154
17128 -1154 -4403 -5793 -5276 -2773 -4454 -6740 -5150 -943 -402 204 -543 -1637 119 695 477 1120
17112 1120 4424 1312 -2390 -4484 -3076 583 -1566 733 3362 1780 -509 -2547 -2779 -960 -488
17097 -488 -809 -3449 -4342 54 4302 3409 1846 870 -1535 -5546 -4457 -4047 -4575 -4067 -1938 1479 -1274
17080 -1274 -4551 -4564 -6151 -7544 -6011 -3413 -4322 -4402 -5965 -6033 -7128 -9400 -3743 1453 2145 -269 958
17063 958 2201 3166 1676 1517 1267 -1719 -2529 605 3834 1481 -2770 -1395 1829 4505 325 1695
17047A695J836k510l829k468o15J776L967j382P15J434k265l433J645M411L736
17032D713j624n94J18m260Q71K935j638j462J655j871l64k37N60K194m74j157
17016f35k212k481j218J762M675j836J915K76K93j848k698O20K383K040n735j387
17000f086K063K739J405q09M73j00l53m607j943P46K754K146p53j772J088M0p71
16983c740r2K416N46j249M412k310k694p00l08J235L83R66L685j568l671p73P7
16966c385J65O05k5o58K480J268j040J05J223r37j599q84J275J244O97L836j332
16949C038l091j142O97J174M12j970j9N08jM66L786m413k142k297l714K55K483
16932e970J440j586n59R2P59Q44l395J388J054k302j089Q83K861N447K586k474
$$ plain form
17047 1695 3531 1021 -2808 -5276 -5891 -4115 -148 -1530 -815 619 -1646 -5079 -3434 977 4713
17032 4713 3089 2495 2613 -1647 -776 2159 521 -941 714 -1157 -1521 -1758 -1198 996 522 -635
17016 -635 -2847 -5328 -6546 -4784 -109 -1945 -30 246 539 -1309 -4007 -3387 -1004 1036 -4699 -6086
17000 -6086 -4023 -1284 121 -688 -215 -315 -668 -5275 -7218 -6472 -3718 -1572 -2325 -4097 -3009 -2969 -3740
16983 -3740 -3832 -1416 -870 -2119 2293 -17 -2711 -3411 -3719 -2484 -2101 -1135 2550 982 -2689 -3462 -3385
16966 -3385 -3220 -2615 -2640 -3298 -818 450 -590 -485 738 -199 -1798 -2682 -1407 -163 534 4370 3038
16949 3038 -53 -1195 -498 676 1088 -882 -901 -393 -394 72 3858 -555 -2697 -4994 -8708 -8453 -5970
16932 -5970 -4530 -6116 -6675 -6583 -5824 -4980 -8375 -6987 -5933 -8235 -9324 -8441 -5580 -133 2453 -21
16916b1k295J930j459k285J716L77m201k05M432J097j2k38o32j256L56K964j377
16899a109l978j803Q17K829o08N25M203M810j714k538L51j682k230k414k2m99
16883e062j250j982j66K413M842K721l00J036j526k995K41j092j137k034l74J161
16867e504N545K694j718n100k809J576Q09L113L375L350n86m130n124j985J701
16852d793O21j309P62M272K86j447J87q97J281N06Rl697j059L9J668K559l384
16835d396l193J028J712l51P24kK943n1j076K82k667J060R67j312K093K182k561
16818b618l792O52K330k81j681J783N664j95l321j207j144o9N44p05j85n37k56
16801e018o3k941J443J788M49J673L238K4j434q8k219k169Q50K52L205R98J706
$$ plain form
16916 -21 -2316 -386 -1845 -4130 -2414 -2037 -6238 -6443 -2011 -914 -926 -1164 -1796 -3052 -2696 268 -1109
16899 -1109 -5087 -6890 -6073 -3244 -3852 -3327 876 5686 3972 1434 1785 103 -2127 -4541 -4563 -5062
16883 -5062 -6312 -8294 -8460 -6047 -1205 1516 1216 2252 726 -2269 -2028 -3120 -4257 -6291 -6665 -5504
16867 -5504 41 2735 1017 -4083 -6892 -5316 -4507 -1394 1981 5331 4745 615 -4509 -6494 -4793
16852 -4793 -4172 -5481 -4719 -447 -161 -1608 -1421 -2318 -1037 -531 -522 -4219 -5278 -5239 -3571 -1012 -4396
16835 -4396 -7589 -6561 -4849 -5200 -4476 -4478 -1535 -1586 -2662 -2380 -5047 -3987 -3020 -4332 -2239 -57 -2618
16818 -2618 -6410 -5758 -3428 -3709 -5390 -3607 2057 1862 -1459 -2666 -3810 -3879 -3335 -4040 -4225 -4762 -5018
16801 -5018 -5081 -8022 -6579 -4791 -4342 -2669 569 593 -841 -929 -3148 -5317 -4467 -4215 -1010 -12 1694
16784A694K03Q93l62j596l409j046n78j742M31M08j28j346K446k736k481K899
16768f450J685r46K9J245J213M034R38p89j181j422k920j324N041L391j735J85
16752I94k503j444K218N88j229n92J895K464j055j72L829j942l795L92l166k544
16736f062K849O21j965K023o42j446k703J930J853q97J119P6k190n19J834Q18
16720c301M164K426l62m241k310p20O17R43O38n63q97j495J55J542J364q70M7
16703b863J422L155J315j423m573k240L041J856j462j930O57L053k060K832K847
16688C627m760j322m4O27K48L14J822m48r80L228R28l944l014j60J731J530m320
16671d937k961K306N055q4l4L780K098n590k177K107j663l617k887L128M166K27
$$ plain form
16784 1694 1897 2790 2428 832 -2577 -3623 -4201 -5943 -5512 -5104 -5232 -6578 -4132 -6868 -9349 -6450
16768 -6450 -4765 -5711 -5682 -4437 -3224 810 1748 959 -222 -1644 -4564 -5888 -847 2544 809 994
16752 994 -1509 -2953 -735 -147 -1376 -1968 -73 2391 1336 1164 4993 3051 -744 -352 -3518 -6062
16736 -6062 -3213 -2592 -4557 -2534 -3176 -4622 -7325 -5395 -3542 -4439 -3320 -3244 -5434 -5953 -4119 -3301
16720 -3301 863 3289 2927 -1314 -3624 -4344 -3727 -2784 -2146 -2709 -3606 -5101 -4946 -3404 -2040 -2910 -2863
16703 -2863 -1441 1714 3029 1606 -2967 -5207 -2166 -310 -1772 -3702 -3045 8 -2052 780 3627
16688 3627 -1133 -2455 -2499 -1872 -1624 -1310 512 64 -916 2312 3240 -704 -3718 -3878 -2147 -617 -4937
16671 -4937 -7898 -5592 -537 -621 -655 3125 5223 -367 -2544 -437 -2100 -5717 -8604 -5476 -1310 -1083
16655a083L020L002j184l259j078L249Q87j675m458j355K308N70K278K084Q46
16640D152k2o60l136N14r27J707J324m410k618L135K231m69k683j502K15J743
16624a406R73o44L28L26j039N47L137j9n695k294L886R8j188k98K69P39o42L345
16606D23J085k626m401j428L065p78J2o10J433L051L386J93m18j97l213l401J275
16589c149J171K33k472K207K931n07k611K237J504k397l584m91J078J522N27Q88
16573i13J070L322m50p84j05k392O52J509P16O33n53j751j845N5J427J283p37
16556A137o45l97J52j085k941K05j655l301K662J606J072K09k23k312l668J375
16540g809P40j112j883j1K047K475Q90L430L016r34l836M64j088K172j0p38l56
$$ plain form
16655 -1083 1937 4939 3755 496 -582 2667 3554 1879 -2579 -3934 -1626 -1056 1222 3306 4152
16640 4152 4130 3470 334 848 -79 1628 2952 -1458 -4076 -941 1290 821 -1862 -3364 -3149 -1406
16624 -1406 -433 -1077 -749 -423 -1462 -915 2222 2203 -3492 -5786 -1900 -1802 -2990 -3288 -3019 -2280 -2922 423
16606 423 1508 -1118 -5519 -6947 -3882 -4660 -4648 -5258 -3825 -774 2612 2805 2387 2190 -1023 -4424 -3149
16589 -3149 -1978 -1745 -4217 -2010 921 414 -2197 40 1544 -853 -4437 -4928 -3850 -2328 -1801 -913
16573 -913 157 3479 3029 2245 2140 -252 400 1909 2625 3258 2705 954 -891 -836 591 1874 1137
16556 1137 492 95 247 -838 -3779 -3574 -5229 -8530 -5868 -4262 -3190 -2981 -3204 -5516 -9184 -7809
16540 -7809 -7069 -8181 -10064 -10075 -8028 -5553 -4663 -1233 1783 849 -2987 -2523 -3611 -1439 -1449 -2187 -2543
16523b543J913M118K207l449l814j67j797j144Q02L316q42k101M55j454j339K52
16507e587L793j039K03L332Q13j060l605o77J130J325j982j24k98k026j68K092
16491c878J529j07LJ98p49l556j465N09k881K346L397K331J01K89J656j853j299
16474c429J26j272Q51k638P50K086o68J27J95J320p45J841J699l76l988m353J404
16457g070M548K116P75J620j878j363k054j096r77O12K94j152K71r71j652J666
16441f311K196M114l149L548J392n05R29k247j856j000j249r98j337j849P39n11
16425h094K363J834M150Q15k176r66J798K62n35j75k644k40J233J907K588j267
16409H53k334j242k179M89k101l5J293K891J937j665N36L50p95K002l54Q06q05
$$ plain form
16523 -2543 -630 3488 5695 2246 -1568 -1735 -3532 -4676 -3874 -558 -1400 -3501 -3046 -4500 -5839 -5587
16507 -5587 -1794 -2833 -2630 702 1515 455 -3150 -3827 -2697 -1372 -3354 -3478 -3776 -5802 -5970 -3878
16491 -3878 -2349 -2456 -2453 -2255 -3004 -6560 -8025 -7516 -10397 -8051 -4654 -2323 -2222 -1933 -277 -2130 -3429
16474 -3429 -3303 -4575 -3724 -6362 -5612 -3526 -4194 -4067 -3872 -2552 -3297 -1456 243 -133 -4121 -8474 -7070
16457 -7070 -2522 -406 369 1989 111 -1252 -3306 -4402 -5379 -4767 -4473 -5625 -5354 -6325 -7977 -6311
16441 -6311 -4115 -1 -3150 398 1790 1285 2214 -33 -1889 -2889 -4138 -5136 -6473 -8322 -7583 -8094
16425 -8094 -5731 -3897 253 1068 -1108 -2074 -276 -14 -549 -724 -3368 -3608 -2375 -468 2120 853
16409 853 -1481 -2723 -4902 -4413 -6514 -6549 -5256 -2365 -428 -2093 -1557 -1207 -2002 0 -354 452 -353
16392c53k277q61M334p75k191p02N81k099k427j407K66L377K594L73J350P83l0
16375E36L81K122j22k267q56k086j113j459Q64K332N6J181l106J081J426J469
16359D39k119O7J677O97M13l74K781J360l104Q32p37j080K991P27j781m598l194
16342e003L821J986j879J537l865j431K578J683M10l706l542J625J407R53O19
16327b807N29J114o96M13J67l769l38J597J249k90j496J009K912J02k7r72j679
16310b982k033j882J623J433l76O99M84Q57P96J063O79j000m151o18L794k48j495
16293c357L36J267l018L577L607K038k933m85k080R83j335M87k05Q43Q91n82p16
16276f82j347J35l50o07k914M110Q08j861J408O23l10j751J22L94R09J371j469
$$ plain form
16392 -353 -2630 -3491 843 68 -2123 -2825 -2244 -4343 -6770 -8177 -7911 -4534 -1940 -1567 -217 566 536
16375 536 917 3039 2917 650 -206 -2292 -3405 -4864 -4000 -1668 -1612 -431 -3537 -2456 -1030 439
16359 439 -1680 -1613 64 761 1174 800 3581 4941 1837 2669 1932 852 3843 4570 2789 -1809 -5003
16342 -5003 -1182 804 -1075 462 -3403 -4834 -2256 -573 -163 -3869 -7411 -5786 -4379 -3426 -2807
16327 -2807 -2278 -1164 -1860 -1447 -1280 -5049 -5387 -3790 -2541 -2831 -4327 -3318 -406 -304 -331 -1303 -2982
16310 -2982 -5015 -6897 -5274 -3841 -4217 -3518 -3034 -2177 -1381 -318 361 -639 -4790 -5408 -1614 -1862 -3357
16293 -3357 -3021 -1754 -4772 -1195 2412 4450 1517 1032 -1048 -65 -1400 -913 -1118 -275 616 34 -682
16276 -682 -2029 -1894 -2244 -2851 -5765 -1655 -847 -2708 -1300 -677 -987 -2738 -2616 -2222 -1313 58 -1411
16259a411q00j02m192K49N47j28J545P84J287K535J155L98j529k261p5R02p02
16242a798K824L68k067j978R21j409o43j554K664r37j780j732P60L492m76J212
16226b133P44K535Q87k533m25j224j686o08r18J885K014K219M680N16O39m336
16210B256j767j662k309K194L027K108j944n807k67R97K488K137K228k655l228
16195b204J573O2L322J393L489K22l824j512r93R1K098L17M53l851j811j706m76
16178c357J567M61j105J279J913q05k545j151j146P13J810J40R75j462o57j227
16162d597K63M282J299l716k603P14N332J552K352J399j772l832p16M12j016Q29
16146A82j046k854J954r79l675p31N824K743L26n56j247j373K145J455k964J882
$$ plain form
16259 -1411 -2211 -2313 -6505 -6256 -5709 -5837 -4292 -3508 -2221 314 1469 1867 338 -1923 -1998 -1096 -1798
16242 -1798 1026 1394 -673 -2651 -1730 -3139 -3782 -5336 -2672 -3609 -5389 -7121 -6361 -2869 -3345 -2133
16226 -2133 -1389 1146 2033 -500 -925 -2149 -3835 -4443 -5361 -3476 -1462 757 5437 5953 6592 2256
16210 2256 489 -1173 -3482 -1288 1739 3847 1903 -3904 -4171 -3174 -686 1451 3679 1024 -2204
16195 -2204 -631 -569 2753 4146 7635 7857 4033 2521 1528 1619 3717 4034 4487 636 -1175 -2881 -3357
16178 -3357 -1790 -1329 -2434 -1155 758 -47 -2592 -3743 -4889 -4176 -2366 -2226 -1251 -2713 -3370 -4597
16162 -4597 -4334 -52 1247 -2469 -5072 -4358 974 2526 4878 6277 4505 673 -43 369 -647 182
16146 182 -864 -3718 -1764 -2743 -6418 -7149 -1325 1418 1744 1188 -59 -1432 713 2168 -796 1086
16130A086L238n6m430j203j063l901K647M358j655k646l03J135l133k480J609
16115f797J727p55M52K473K890K177p2L566j127k755J376N04j454j915l93k147
16099b250J647J454k134o43K018K18N09r77j311j101m05J780k860j898j687Q66
16083f774M515l10M12K332o74L47J262m70J049j261k298j119j704K912j891k727
16067f399K611M410j07j539K264p44R02m65m308n561k83M204K000K585r46q08
16051b184L6J658K980o9j942l893J79n37p8j49P52k7J46L14K043J498l457k696
16033e426L578J234L93L319P30m061j660o36j835j632K193K976K294p82K096K294
16017E075l220k554r06J259j84j932q68L568K517j846l108K78j026M079J561k494
$$ plain form
16130 1086 4324 4268 -162 -1365 -2428 -6329 -3682 676 -979 -3625 -3928 -2793 -5926 -8406 -6797
16115 -6797 -5070 -5825 -5373 -2900 -10 2167 2095 5661 4534 1779 3155 3659 2205 290 -103 -2250
16099 -2250 -603 851 -1283 -1926 92 310 819 -158 -1469 -2570 -2975 -1195 -4055 -5953 -7640 -6774
16083 -6774 -2259 -2569 -2157 175 -499 -152 1110 640 1689 428 -1870 -2989 -4693 -1781 -3672 -6399
16067 -6399 -3788 622 515 -1024 1240 496 1398 933 -3375 -8936 -9219 -5015 -3015 -430 -1376 -2184
16051 -2184 -2148 -490 2490 2421 479 -3414 -3235 -3772 -3850 -3999 -3247 -3274 -3128 -2814 -771 727 -2730 -5426
16033 -5426 -1848 -614 -221 3098 3828 -233 -1893 -2529 -4364 -5996 -3803 -827 1467 685 2781 5075
16017 5075 1855 -699 -1605 -346 -530 -2462 -3330 238 2755 909 -2199 -1921 -2947 1132 2693 199
16001A99q83J336N12m692m52K149M65R12j623l74J080j032l83p08J94J710j08
15984a698J664j04k999l971r11K332J611J557q8n62J661j211j986K35K034O12
15968a824j815R15J424j467r78k825K326K659k80q96k578J763m10L96q19j263
15952e672k53K400K157K233j028l335K474J387o340j688O114L740J198L067j920
15937D534k306k730l651j464N72j010L282K275J794L584j444k885j970q94R26
15922a387j122J209J175k982l94L008J55n58q32n28M03n95j875O91K60L180K641
15905B449k274j991k862K511J266j605k240k43p3K255P2Q59K452J510n000k730
15889e644L565J790J716r22p03j324L38l693J111K665r0Q90O11P15M25j448N237
$$ plain form
16001 199 -684 652 1164 -3528 -3980 -1831 -1366 -454 -2077 -2451 -1371 -2403 -2786 -3494 -3300 -1590 -1698
15984 -1698 -34 -138 -3137 -7108 -8019 -5687 -4076 -2519 -2607 -3169 -1508 -2719 -4705 -4470 -2436 -1824
15968 -1824 -3639 -2724 -1300 -2767 -3745 -6570 -4244 -1585 -1865 -2761 -5339 -3576 -3986 -3590 -4409 -5672
15952 -5672 -5925 -3525 -1368 865 -163 -3498 -1024 363 -5977 -7665 -1551 2189 3387 6454 4534
15937 4534 2228 -502 -4153 -5617 -5045 -6055 -2773 -498 1296 4880 3436 551 -1419 -2313 -1387
15922 -1387 -2509 -1300 -125 -3107 -3501 -493 -338 -896 -1728 -2256 -1853 -2448 -4323 -3632 -3372 -192 2449
15905 2449 175 -1816 -4678 -2167 -901 -2506 -4746 -4989 -5062 -2807 -2735 -1876 576 2086 -2914 -5644
15889 -5644 -2079 -289 1427 505 -198 -1522 -1184 -4877 -3766 -1101 -1191 -301 310 1025 1450 2 5239
15872E239K418j135m463l123J189J047j362Q77J614k432k884l623J862j109M77
15857e408j051N15J363q24Q95K877P50k447O33K8k793j423K26J405L176K493j020
15840f05j399L874M46j395l804J662N74K338K87j568l624K95J580J740k356J32
15824a823J48J388L21K58j685j459l044l47M77J860L132K589K017K845L072o84
15808I065k405o310k421J9L59J475m157k555K48J673J667K988J414L898K151k047
15792E062m424j891R82J093Q01J645l649q40k016j050J93K727L407K62m667j747
15776d112L521L46l07j406K346k873j981L306M238k19l418N36o11p81j849R03
15760b361j361J278K354l005O62K275J327l40P88K78l433k831J075j344l250J077
$$ plain form
15872 5239 7657 6522 2059 -1064 125 1172 -190 687 2301 -131 -3015 -6638 -4776 -5885 -5408
15857 -5408 -6459 -5944 -4581 -5405 -4510 -1633 -883 -3330 -2697 -2669 -5462 -6885 -6659 -5254 -2078 415 -605
15840 -605 -2004 1870 2316 921 -2883 -1221 -647 1691 1978 410 -3214 -2919 -1339 401 -1955 -1823
15824 -1823 -1675 -287 34 292 -1393 -2852 -5896 -6243 -5766 -3906 -774 1815 3832 6677 9749 9065
15808 9065 6660 350 -2071 -2052 -1693 -218 -4375 -6930 -6682 -5009 -3342 -354 1060 4958 7109 5062
15792 5062 638 -1253 -271 822 1623 3268 -381 -1221 -3237 -4287 -4094 -1367 2040 2302 -2365 -4112
15776 -4112 -591 -245 -552 -1958 388 -2485 -4466 -1160 3078 2859 -559 -23 -634 -1415 -3264 -2361
15760 -2361 -3722 -2444 -90 -3095 -2433 -158 1169 829 1617 1895 -1538 -4369 -3294 -4638 -7888 -6811
15744f811J736L881l780l513J633L243L375J97p98k162j335J459K847k415Q50
15729a593M535j261k128k707l7L764Q16j980K157O85m158j894J790j003m226O89
15713f551o38J343K454K470K79M197j379J29j64J557j423J03J45k856k472O1J624
15696a121N43K91j36MJ256j769p85q51k055k89K420N41L43j89q03j268Q94n50
15678c524J737L813J87J761K64m20k41q08J324r33j309k663q15K527R7m222j650
15661d875L66P60J179J671j192L16J236Q83O09K22k044k358q83J350L892J144
15645B276j934r76k65l383k329K81J143J118P95L870k378j595j326k344N280N759
15629C992K128J55q56k282k432o60N13K778Q30o04k971o31J155J175J331j863
$$ plain form
15744 -6811 -5075 -1194 -4974 -8487 -6854 -3611 -236 -39 -837 -2999 -4334 -2875 -28 -2443 -1593
15729 -1593 2942 1681 -447 -3154 -3191 573 1389 -591 1566 2251 -1907 -3801 -2011 -3014 -7240 -6551
15713 -6551 -7189 -5846 -3392 -922 -643 3554 2175 2304 2140 3697 2274 2377 2522 -334 -2806 -2745 -1121
15696 -1121 -578 -287 -423 -419 837 -932 -1717 -2568 -4623 -4912 -2492 -1951 -1608 -1797 -2600 -3868 -2974 -3524
15678 -3524 -1787 2026 2213 3974 4238 3818 3577 2769 4093 3160 1851 -812 -1627 900 997 -3225 -4875
15661 -4875 -4509 -3749 -2570 -899 -2091 -1775 -539 344 953 1175 -869 -3227 -4110 -2760 1132 2276
15645 2276 342 -634 -899 -4282 -6611 -6330 -5187 -4069 -3274 596 -1782 -3377 -4703 -7047 -1767 3992
15629 3992 6120 6275 5419 3137 705 45 558 3336 4166 3562 591 -40 1115 2290 3621 1758
15613A758j051k237l746j346L311L049M25K40k059k453N1L526K735l861n027k83
15597f968O642J723m651P91N50j984p14m80r16j004N152L77k801p49k021j269
15581h322K550J386L333L200K001J26j731M81J72n39j566j930k068l432j406k755
15565a0500J400N112L642R5l47J773J215J863K34R42l660j108j653k145o35J926
15549a846j932J68j944J534Q96j455j15K226r30O23Q3n59L199K160k151l738L8
15532c743J876R1p95k40q3M93j948j52Q89J281k242k320J826K958K588M093J806
15515F378k876O21l125l074l044j028m3l23l61L50L099L287K091k210j060J47
15499a171l93J61q09q36J194J59J790m35j140l999k73K187J168K542J313k926
$$ plain form
15613 1758 707 -1530 -5276 -6622 -3311 -262 163 403 -1656 -4109 -4058 -532 2203 -1658 -6685 -6968
15597 -6968 -326 1397 -3254 -2463 -1913 -3897 -4611 -5091 -6007 -7011 -1859 -1482 -4283 -5032 -7053 -8322
15581 -8322 -5772 -4386 -1053 2147 4148 4274 2543 3024 3196 2657 1091 -839 -2907 -6339 -7745 -10500
15565 -10500 -9100 -3988 -346 -251 -598 1175 2390 4253 4487 5429 1769 661 -992 -3137 -3772 -1846
15549 -1846 -3778 -3610 -5554 -4020 -3124 -4579 -4694 -2468 -3398 -2775 -2692 -3251 -52 2108 -43 -3781 -3743
15532 -3743 -1867 -1776 -2571 -2811 -2894 -2401 -4349 -4501 -3612 -2331 -4573 -6893 -5067 -2109 479 4572 6378
15515 6378 3502 4123 998 -2076 -5120 -6148 -6191 -6514 -6875 -6525 -3426 -139 1952 -258 -1318 -1171
15499 -1171 -1564 -1403 -2212 -3048 -1854 -1695 95 -340 -1480 -5479 -5752 -3565 -2397 145 1458 -1468
15483a468k640J380L34J246J766P03m012m15L262j948k0L091k596K344M099k752
15467B374q55j807k264R17K860k82n246N23K395K50p13l511j199p10O93j740r29
15450i244j292K946L216O70K501R10J064N56R57K044j125l190l219N9K728j60
15434e79j329K86K527P61m58q53j895j574p91J457J885n32o31J709j778Q67j363
15417b291j379j15J075M206L655l239j80J984n02j707j016K28N30j704j950n59
15401b964N97L173J092m147J930K173M76j258m104N26p71k511K519J857j45J903
15385C46k197p57k181L61J095r29M52o02P11P39L031K900k581M06K86j095k458
15368b473k505n09K416J830k417j767j640M30K85L535K838k008l500J405k121
$$ plain form
15483 -1468 -4108 -2728 -2394 -1148 618 1321 -2691 -3106 156 -1792 -1812 1279 -1317 1027 5126 2374
15467 2374 1519 -288 -2552 -1635 1225 943 -4303 -3780 -1385 -1135 -1848 -5359 -6558 -7268 -6575 -8315 -9244
15450 -9244 -10536 -7590 -4374 -3704 -1203 -293 771 1327 2284 4328 3203 13 -3206 -3147 -419 -579
15434 -579 -1908 -1622 905 1666 1208 355 -1540 -3114 -3905 -2448 -563 -1095 -1726 -17 -1795 -928 -2291
15417 -2291 -3670 -3785 -2710 1496 5151 1912 1732 3716 3214 1507 491 719 1249 -455 -2405 -2964
15401 -2964 -2367 806 1898 -2249 -319 1854 2330 1072 -3032 -2506 -3277 -5788 -3269 -1412 -1557 346
15385 346 -1851 -2608 -4789 -4428 -3333 -4262 -3810 -4412 -3701 -2962 69 2969 388 794 1080 -15 -2473
15368 -2473 -4978 -5487 -3071 -1241 -3658 -5425 -7065 -6635 -6350 -2815 23 -1985 -5485 -4080 -6201
15353f201j911J445K074N06J249k422r67r94j489J377K043L150k711k039J905
15338d985N35K320L218o40j34k98J758o0k39k440K93J725j911k800J857K390l116
15321b527k243L792k33P96j608L65p23j812K327K921k51R78L261m504j3P11l28
15304I09j551q12l537M34N51P87L9M173l371n42j162K667L496K959j662k040j746
15287d08j657j605j620J080K197j838j122K29N10L293J091q15J023j039p49K992
15271A562l810J873K173m03R84j918k623J055K401j307n360K09J091r66j50J428
15255c761J39K9P01J288j093p94M65k16J387O82O02l942J489k129k524N150O73
15238a854K593P4k24q78j885J200m66m63p26J086l713k130K519o21Q38J869L362
$$ plain form
15353 -6201 -8112 -6667 -4593 -4087 -2838 -5260 -6227 -7221 -8710 -7333 -5290 -2140 -4851 -6890 -4985
15338 -4985 -4450 -2130 1088 448 314 16 1774 1714 1475 -965 -672 1053 -858 -3658 -1801 589 -2527
15321 -2527 -4770 -978 -1211 -415 -2023 -1658 -2381 -4193 -1866 1055 804 1782 5043 539 526 1237 909
15304 909 -642 -1454 -4991 -4557 -4006 -3219 -3180 993 -2378 -2920 -4082 -1415 2081 5040 3378 1338 -408
15287 -408 -2065 -3670 -5290 -4210 -2013 -3851 -4973 -4744 -4234 -941 150 -665 358 -681 -1430 1562
15271 1562 -2248 -375 1798 1395 2379 461 -2162 -1107 1294 -13 -5373 -5164 -4073 -5039 -5189 -3761
15255 -3761 -3622 -3593 -2892 -1604 -2697 -3491 -3026 -3242 -1855 -1173 -571 -4513 -3024 -5153 -7677 -2527 -1854
15238 -1854 739 813 589 -289 -2174 -974 -1440 -1903 -2629 -1543 -5256 -7386 -4867 -5488 -4650 -2781 581
15221E81j215l410K435o3j175J109m04%L496j362m544o72j472O10j027J715J44
15204e254M99J276K005o98j520j358J355K783K925m066l044K337k9K043K237m814
15188c323j429K951J702j816J536J476Q53p96j065j40K459l12k752n28N97j617
15172b204J299J815r70k80J526J387J809k137l480M75K009j213K883J929o099
15157a251n470L913K044k465J611J944K58j929N57k514n35q40K475j38j226J202
15141b364K4P98p52o79k3K105k000R44k067j68J404J31K047q35K90j103J67J776
15123c05J158n34K437J78l876Q31J832M6p86j273P96p55k53m91l038j424l33k028
15105g818J640Q88k97M691J352K78K621j068l398m670j540L168L257J606K77q04
$$ plain form
15221 581 -634 -4044 -1609 -1672 -2847 -1738 -2142 -2142 1354 -8 -4552 -5224 -6696 -6086 -7113 -5398 -5254
15204 -5254 -4755 -3479 -1474 -2172 -3692 -5050 -3695 -912 2013 -2053 -5097 -2760 -2789 -746 1491 -3323
15188 -3323 -4752 -1801 -99 -1915 -379 1097 1950 1154 89 -51 2408 2096 -656 -1184 -587 -2204
15172 -2204 -905 910 -60 -340 1186 2573 4382 2245 -1235 -760 1249 36 2919 4848 -1251
15157 -1251 -6721 -2808 -764 -3229 -1618 326 584 -1345 -788 -3302 -3837 -4677 -2202 -2340 -3566 -2364
15141 -2364 -2340 -1542 -2294 -2973 -2996 -891 -2891 -1947 -4014 -4182 -2778 -2647 -600 -1435 -1145 -2248 -2081 -305
15123 -305 853 319 2756 2934 -942 -111 1721 1767 981 -292 504 -251 -504 -995 -4033 -5457 -5790 -7818
15105 -7818 -6178 -5290 -5587 -896 456 734 3355 2287 -1111 -5781 -7321 -4153 -896 710 987 183
15089A83N67j967l314p03L339J884O55k442j378m97j111L893J114K267k783l515
15073c808j222M72L765K016l738m520l398r88m5J818M556K631L200O94p16Q88
15057A605j131m759j085J098K442J200O69J155Q76K35l370r6J69q78m585j173
15041g628L034L733j14K210j745j812j456k811k504j464L092J983k236L85q77
15026h210J460K181K31j198l40K000P95k070L727K954j99k227n507J209J537k405
15010f062l17K178J213j219r24m07J045L965J049j6K071l185k941J021k992l40
14994e861K570Q2p1o11k205m36N8r27J597K254M78R38J509J460L327r09j433k107
14976b87l41l56l142Q48J870J833k229j690O2L32J369K0J568L901L187j526l330
$$ plain form
15089 183 750 -1217 -4531 -5234 -1895 -11 644 -1798 -3176 -3673 -4784 -891 223 2490 -293 -3808
15073 -3808 -5030 -4558 -793 1223 -2515 -7035 -10433 -11421 -11466 -9648 -5092 -2461 739 1433 717 1605
15057 1605 474 -4285 -5370 -4272 -1830 -630 39 1194 2070 2305 -1065 -1161 -992 -1870 -6455 -7628
15041 -7628 -4594 -861 -975 1235 -510 -2322 -3778 -6589 -9093 -10557 -7465 -5482 -7718 -7333 -8210
15026 -8210 -6750 -4569 -4338 -5536 -5876 -3876 -3081 -5151 -1424 1530 1331 -896 -6403 -5194 -3657 -6062
15010 -6062 -6379 -4201 -2988 -4207 -5131 -5538 -4493 -528 521 505 2576 -609 -3550 -2529 -5521 -5861
14994 -5861 -3291 -3209 -3280 -3891 -6096 -6532 -6474 -7401 -5804 -3550 -3072 -2134 -625 835 4162 3253 1820 -287
14976 -287 -628 -984 -4126 -3278 -1408 425 -1804 -3494 -3432 -3100 -1731 -1711 -143 3758 6945 5419 2089
14959B089l289j734M571J612j513j977J872Q61l154j201j540o03J437L267o52
14944D6l991j644M385N170j454p14p19P2K041l59k197j767j020q21J759K07j253
14927b259L247j1k624k622n09R10Q35L155r04j318P97J356j893L06K390J549j445
14910I60l560K178L384q05j562N46j77N62L703k633l60r68j227P0k48M91l63J278
14892A269o94M384k273j573p45J010L69J100j199L67P72l087l252L229j821j316
14876c460L128j251m378k270q12K934J284o21J127J479J450k960l72J057J857
14861a808l47k171j683l384L426N781K469l611j795J211p51K445K004j945j079
14846a238r31Q58L449J105k785j023R57j191n43k322M84L409R5N20j34j462K551
$$ plain form
14959 2089 -1200 -2934 1637 3249 1736 -241 1631 2492 -662 -1863 -3403 -4006 -2569 698 46
14944 46 -3945 -5589 -1204 3966 2512 1798 1079 1151 3192 2833 636 -1131 -2151 -2972 -1213 -1006 -2259
14927 -2259 988 977 -1647 -4269 -4778 -3868 -3033 122 -782 -2100 -1303 53 -1840 -1534 856 2405 960
14910 960 -2600 -422 2962 2157 595 1141 964 1526 5229 2596 2236 1268 41 111 -137 354 -9 1269
14892 1269 575 4959 2686 1113 368 1378 1747 2847 1648 2015 2787 -300 -3552 -323 -2144 -3460
14876 -3460 -332 -1583 -5961 -8231 -9043 -6109 -4825 -5446 -4319 -2840 -1390 -4350 -4722 -3665 -1808
14861 -1808 -2155 -4326 -6009 -9393 -5967 -186 2283 -1328 -3123 -1912 -2663 -218 1786 -159 -1238
14846 -1238 -2169 -1311 2138 3243 458 -565 392 -799 -1342 -3664 -3180 229 324 844 710 -752 1799
14829A799k625j131M26L20j113l18J714L413k677o84Q91k314k414J388L039K771
14813B485k253j956j501j933M83j4K473R45O9q71q88j778L992N853m62l038k28
14796A378K761k409n71j186r2L63J359J140M350j152q46j507j812R08j377k974
14780a667J794K521J82o349j807N729j36j890J552J808J800j854j757j232N64
14765g42m2k742K308K024K013L124j397l163q48n57M53q7j579J160K638k740k061
14748b238J062Q78K702k845p65J849J778P47r75J4k306q18o03K162M177j023j64
14731C632k070O6j097J028P27q54L438L139k186k263k073m273q89K608K47m27
14715a247J691J719R18k113m176k288K308M329n10J427j391l524r7J528n25j226
$$ plain form
14829 1799 -826 -1957 -1531 -1211 -2324 -2642 -928 2485 -192 -876 15 -2299 -4713 -3325 -286 2485
14813 2485 232 -1724 -3225 -5158 -4675 -4689 -2216 -1271 -1202 -2073 -2961 -4739 -747 5106 4644 1606 1378
14796 1378 4139 1730 1159 -27 -119 244 1603 2743 7093 5941 5095 3588 1776 2684 1307 -1667
14780 -1667 127 2648 2830 -3519 -5326 403 267 -1623 -71 1737 3537 1683 -74 -1306 -742
14765 -742 -784 -3526 -1218 806 2819 5943 4546 1383 535 -22 431 344 -1235 -75 2563 -177 -2238
14748 -2238 -1176 -298 2404 -441 -1206 643 2421 3168 2193 2207 -99 -917 -1520 642 4819 3796 3632
14731 3632 1562 1628 531 1559 2286 1432 4870 8009 5823 3560 1487 -2786 -3675 -1067 -820 -1247
14715 -1247 444 2163 3081 968 -3208 -5496 -3188 1141 631 2058 667 -2857 -2954 -1426 -1951 -3177
14699c177l176M079K307p35l379J85K171Q90k078N0L436q54k743J196J702r47
14683a073M19l85M342Q81j333Q72J823l07j26k713k812j174j676Q23j149j126
14667d714j72K191L466O53K39N6J228J686k806k440J207n41k485R74j182k684
14651e324m5K625J135o7O07J894R09M8J51m557j998%K605L931Q45J252l013m167
14633c169J014J981R15N66j311N11J677k380m206N5L611J496n09K000J736O74
14617D661k4q55k951p08P78K268l212j301L270k96J499o93q17J513k751j638P86
14600d71j839J048l63l87L375M021k32p28Q39J73j799l708J66J092Q4m99J47M
14582I23L67l767k16J06l118l99N403M308j455r79j354P83J558j695r98K413J88
$$ plain form
14699 -3177 -6353 -2274 33 -702 -4081 -3896 -1725 -835 -2913 -2863 573 -281 -3024 -1828 -126 -1073
14683 -1073 -654 -1039 3303 4184 2851 3723 5546 5239 5113 2400 -412 -1586 -3262 -2439 -3588 -4714
14667 -4714 -4886 -2695 771 1424 1663 1719 2947 4633 1827 -613 594 53 -2432 -1458 -2640 -5324
14651 -5324 -5369 -2744 -1609 -1676 -1069 825 1734 1782 1933 -2624 -4622 -4622 -2017 1914 2759 4011 998 -3169
14633 -3169 -2155 -174 741 1307 -4 507 2184 -196 -4402 -4347 -736 760 251 2251 3987 4661
14617 4661 4637 3782 831 123 901 3169 -43 -1344 1926 1630 3129 2436 1619 3132 381 -1257 -471
14600 -471 -2310 -1262 -1625 -2012 1363 5384 5152 4424 5263 5436 3637 -71 95 1187 1271 772 919 923
14582 923 1290 -2477 -2693 -2587 -5705 -6104 -701 3607 2152 1173 -181 602 2160 465 -533 1880 2068
14565B068m85k000j413j048l060J210j051o92j2M08J133N038N865J003j419l091
14549B454j830k9o71R12j477k126k475J805K979M016J574J187j527J447J80j140
14533E279Jm449k689J90j746l721J655M450L178j026j325p64J359M89l340j479
14517c938N533R24l915P92K171K569L48j090k308k668j768K90J822j529K1k50
14501b996K415M204J72n36k056J394M85j554k04o20q39N36L23K94j94k539j416
14484c131K871J845M75p46j939R14L506m27J58m581Q35J606l976o90K449q84L791
14467B076L236k18k04k590n695j165J485n62L32J09K726K034k703J238J054l174
14451b021o90J598M10J92q22J055J630k959J281K034q08j265J858r66q29l296
$$ plain form
14565 2068 1583 -417 -1830 -2878 -5938 -4728 -5779 -6471 -6483 -6075 -4942 96 5961 6964 5545 2454
14549 2454 624 595 -76 836 -641 -2767 -5242 -3437 -458 3558 5132 6319 4792 6239 6419 5279
14533 5279 5280 831 -1858 -1668 -3414 -7135 -5480 -1030 2148 1122 -203 -967 392 881 -2459 -3938
14517 -3938 1595 2519 -1396 -604 1567 4136 4484 3394 1086 -1582 -3350 -3060 -1238 -2767 -2746 -2996
14501 -2996 -581 3623 3795 3259 1203 2597 3082 1528 1324 704 -135 401 724 1018 824 -1715 -3131
14484 -3131 -260 1585 2060 1314 -625 289 3795 3368 3526 -1055 -220 1386 -2590 -3280 -831 -1715 2076
14467 2076 5312 5094 4890 2300 -3395 -4560 -3075 -3637 -3305 -3196 -470 1564 -1139 99 1153 -2021
14451 -2021 -2711 -1113 -703 -511 -1333 -278 1352 -1607 -326 1708 900 -365 1493 527 -302 -3598
14435c598k692Q50M788L000k097j32J735Q52j998q55L77N98K005j424k591n50
14419a732K88L07j767K301J42l418K208J891q69J811o9O76K16j343K3r76K92N11
14401D92R79j299k124J547M35J912j195q41L587k752r73J353K410N280k645j321
14385D845j654j840k08J9M748Q02n172k279J244K89j896o77M43J979K457Rl607
14368d98l97L333K324k686k353M49o65k823L565M869K124k504j663j213j760K022
14352B124j766K154M45L462O31k147l099j482R89M785J539j211j547k939k883
14337i45K372K174m5J253r73m254J001N63J74%J487L19J063L081p58j769n79K073
14319F237o52l933J101N63k161m05J290j099M44k310r74J269j469K004q8P88K329
$$ plain form
14435 -3598 -6290 -5440 -652 2348 251 119 1854 2706 708 -147 230 828 2833 1409 -1182 -1732
14419 -1732 -1444 -1137 -2904 -603 -461 -3879 -1671 220 -649 1162 1093 1769 1985 642 665 -311 -19 492
14401 492 1471 172 -1952 -405 30 1942 747 -94 3493 741 -232 1121 3531 8811 6166 4845
14385 4845 3191 1351 1143 1162 5910 6712 1540 -739 505 794 -1102 -1779 -1336 643 3100 3109 -498
14368 -498 -895 2438 4762 2076 -277 172 -493 -3316 249 5118 7242 4738 3075 1862 102 2124
14352 2124 358 2512 2957 6419 7050 4903 1804 322 1311 6096 7635 6424 4877 1938 -945
14337 -945 1427 3601 3556 4809 3836 -418 583 1146 1320 1320 2807 3126 4189 7270 6512 4743 4164 6237
14319 6237 5585 1652 2753 3316 1155 750 2040 941 1385 -925 -1899 -630 -2099 -95 -183 605 2934
14302B934N25j861J803j711k226J507K918K106O4r54l589L8J974K9K92Q75J61
14285D885O43N42m34o04j20M452J888l799m985k376p81n81J914K217o93P06K220
14268E094M068O11M71k966o0J107j089M193j342n096l171L411R58N24R30R64P97
14251I404j283j511m479k438Q47O92J780j339j364k203l491K285L135J418L437
14236D890K14j66m100Q93n01l365K607N224L960j94j736n875j605K726O26q44
14220B754m187j017M6L569N006M800k962k901P83R02m13J02L70K69L47O6o265
14203A269j078O90L406J606p57L97k267k205P71O46K061K079R17k761k059P50
14187C465q53Q95K283m270M90K462N57J255L47J549k474m198l830K094J843j937
$$ plain form
14302 2934 3459 1598 3401 1690 -536 971 3889 5995 6059 5105 1516 1554 3528 3557 3849 4724 4885
14285 4885 5528 6070 5636 5032 4912 9364 11252 7453 2468 92 -689 -1270 644 2861 2168 2874 5094
14268 5094 9162 9773 10244 7278 7218 8325 7236 11429 10087 4991 1820 5231 6189 6713 7643 8607 9404
14251 9404 8121 6610 2131 -307 540 1232 3012 1673 309 -1894 -5385 -3100 35 1453 4890
14236 4890 5104 4938 838 1731 1230 -2135 472 5696 9656 9462 7726 1851 246 2972 3598 2754
14220 2754 -1433 -2450 -2404 1165 6171 10971 8009 5108 5891 6793 6380 6482 6852 7121 7468 7534 1269
14203 1269 191 881 4287 5893 5136 5533 3266 1061 1832 2478 4539 6618 7535 4774 2715 3465
14187 3465 2612 3507 5790 1520 2010 4472 5029 6284 6631 8180 5706 1508 -2322 -228 1615 -322
14171c22o03Q74j063j204o18L302L026J057m69k123j44p39J90N26L960o4J596
14154G182j17n24N95k827P95R70J343j82k954k685K133L368n507l518O82N55P51
14137F0J014O95L513Q58l434l015p17J755P7l37j709j655K673L943L519Q17p75
14120G282O81p36n13k190o94K294L63K45M38j714L82r76K52Q3j907o19l06r48
14102A417J63J479n75J381J44l228q23J338M074K464J49k709l115K29L505N555
14086A1448J851j113l906l331j900l02j509k439k14N033L893J984j128j722r50
14071E695k82K199l679j467K646N74P07J260M08R3k408Q72j550L15J758M877N64
14054A2582k547K84k530k447P92K304j49o23L1J060j499k641n20l50L65m03k681
$$ plain form
14171 -322 -925 -51 -1114 -2318 -2936 366 3392 4449 3980 1857 1713 974 1164 1690 5650 5586 7182
14154 7182 7065 6541 7136 4309 5104 6074 7417 7235 4281 1596 3729 7097 1590 -1928 -1246 -691 60
14137 60 1074 1769 5282 6140 2706 -309 -1026 729 806 469 -1240 -2895 -222 3721 7240 8057 7282
14120 7282 7963 7227 6714 4524 3830 6124 6487 6732 7170 5456 5838 4862 5114 5197 3290 2671 2365 1417
14102 1417 1580 3059 2484 3865 4009 781 -42 1296 5370 7834 7983 5274 2159 2388 5893 11448
14086 11448 13299 12186 8280 4949 3049 2747 1238 -1201 -1415 3618 7511 9495 8367 6645 5695
14071 5695 5413 7612 3933 2466 5112 5686 6393 7653 8061 8154 5746 6618 5068 5383 7141 12018 12582
14054 12582 10035 10319 7789 5342 6134 8438 8289 7666 7697 8757 7258 4617 4097 3747 4112 3709 1028
14037A028J089J818J15J104q63O69L96l62r26J162J849j165O13q68m074K5J81
14020A791K594J312j093P38m085R09n86O63K671r8k86mj885j055j806J516L862
14003E158J547J442q50J301j560m179m13j042J160k08r73P70J032L478L48O69
13987G680l93K393K572k689l102o5j039K063J202Q90k60p86k313k250J951p01
13971E153J75j215J019K31P23J193k09O00j075Q84k48p39o95q47p18j502J119
13954C849M416J616k014k609J789k105L366L32q45m15k024k074J523J391P17n35
13938F378j166N44K114K256k185m260l385K190K626k165j668m55j632J321K708
13923C221R72k200l504P15q07q07K087j735j199J239M170O57k739K802j247J025
$$ plain form
14037 1028 2117 3935 4050 5154 4291 4960 5356 4994 4068 5230 7079 5914 6527 5659 1585 1610 1791
14020 1791 4385 5697 4604 5342 1257 2166 1580 2243 4914 4816 4530 4526 2641 1586 -220 1296 5158
14003 5158 6705 8147 7297 8598 7038 2859 2446 1404 2564 2356 1383 2153 3185 6663 7011 7680
13987 7680 7287 9680 12252 9563 6461 6396 5357 7420 8622 9512 9252 8466 6153 3903 5854 5153
13971 5153 5328 4113 5132 5363 6086 7279 7070 7670 6595 7479 7231 6492 5797 4950 4232 2730 3849
13954 3849 8265 9881 7867 5258 7047 4942 8308 8640 7795 7380 5356 3282 4805 6196 6913 6378
13938 6378 5212 5756 7870 10126 7941 3681 296 2486 5112 2947 1279 824 -808 513 3221
13923 3221 4193 1993 -1511 -796 -1603 -2410 -323 -2058 -3257 -2018 2152 2809 70 2872 1625 2650
13907B650J360J398l41m580j243L683J694k274K42L764L907p9j501P25J672l061
13891H016k856m09L29O38J9o97K217J274j135l27p41L47N03O13J152J216J687
13874A1846j532l252J200M85o98j564k812j752Q82J308J795r95J746K747m9j016
13858H339j030J588l76o76J421J601o17O24j548l324J071J967k90k511n2j328
13842D859J681l61j830R41o07q63O58K905o51j693J353k259j280L458L933R88
13826A1232m018N15J38J990k010l249L40qq90j228R18J898k357k3L162K036K448
13809A0894k914j469l623n86K496M952K8j377m143m348J3J402o7J027M208J440
13793G933K995r06j239k73k372j153K12J365N96K553K775J072q89j40K141j732
$$ plain form
13907 2650 4010 5408 5067 487 -756 2927 4621 2347 2589 6353 10260 10181 8680 9405 11077 8016
13891 8016 5160 4751 5080 5718 5737 5040 7257 8531 7396 7069 6328 6675 7178 7791 8943 10159 11846
13874 11846 10314 7062 8262 8747 8049 6485 3673 1921 2803 4111 5906 4911 6657 9404 9355 8339
13858 8339 7309 8897 8521 7845 9266 10867 10250 10874 9326 6002 7073 9040 8750 6239 6187 4859
13842 4859 6540 6179 4349 5290 4683 3820 4478 7383 6732 5039 6392 4133 2853 6311 10244 11232
13826 11232 7214 7729 7867 9857 7847 4598 4938 4930 4040 2812 3730 5628 3271 3248 6410 8446 10894
13809 10894 7980 6511 2888 2302 4798 9750 9778 8401 4258 -90 -77 1325 1258 2285 6493 7933
13793 7933 10928 10022 8783 8510 6138 4985 5197 6562 7158 9711 12486 13558 12669 12529 14670 12938
13777A2938l549r38m105j337J142J455L261L103R18l22k750J759r02j418P77K077
13761A2109n86k05k053j792q57K806O41J650Q97l761n580m81M207L329J690k751
13745I263J0J412p90l388k194J065O99k830J69K91M81q54j841K052K118J22j678
13728D107K926o98k177K51L002k356k381M209K818R93j448k401L442R27j188Q00
13712A0826j921M65J065O63j523j377j556j724J607J745K39N52o93P75j128j941
13696F074O043J359l089j630j46J635K06K569j322m680j926L083P11n23N43J256
13680A0163K042N21j828j962K580L264m09r44l119j510L88K426K415j902j661
13665A0464m042k140J091j392P10K041j500R28P66L02K33J017R38j456j081O51
$$ plain form
13777 12938 9389 8451 4346 3009 4151 5606 8867 11970 12888 12566 9816 11575 10673 9255 10032 12109
13761 12109 11523 11318 9265 7473 6616 9422 10063 11713 12610 8849 3269 2788 6995 10324 12014 9263
13745 9263 9273 10685 9895 6507 4313 5378 6077 3247 3416 3707 4188 3334 1493 3545 5663 5785 4107
13728 4107 7033 6335 4158 4409 7411 5055 2674 6883 9701 10694 9246 6845 10287 11214 10026 10826
13712 10826 8905 9370 10435 11098 9575 8198 6642 4918 6525 8270 8509 9061 8368 9143 8015 6074
13696 6074 12117 13476 10387 8757 8611 10246 10452 13021 11699 7019 5093 8176 8887 8364 8907 10163
13680 10163 12205 12726 10898 8936 11516 14780 14371 13427 10308 8798 9186 11612 14027 12125 10464
13665 10464 6422 4282 5373 3981 4691 6732 5232 6160 6926 7228 7461 8478 9416 7960 6879 7530
13649G530M3J208K686J462j367M80n52j048n85r24M994K564j396k806l794j665
13633F830J958k017j535J71o61m43J29K716K358J109k122J527J740k949k574N38
13617F775p50j772L09J249J733J185J695k116l427J691K778q5m52N39K947N57
13601A2856M49J939k46J36l659k214Q74J273j235J070K849k308K249J560q35O64
13585A5422Q01j494j044k109J302J281k29o93q83n323j910K475J356k825j602
13570D525P16J062n048j03K177n81N104L632n74j551lJ685K756j552k43n89K404
13553A3817P26k001J191K842O24l74l785k952k056O95L024J049K341k011O18O41
13537A4389j1m53n77m81j542R7L592J364k994N48J883k866q3J439p86M242j065
$$ plain form
13649 7530 7573 8781 11467 12929 11562 12042 11490 10442 9857 8933 13927 16491 15095 12289 8495 6830
13633 6830 8788 6771 5236 5407 4746 4303 4432 7148 9506 10615 8493 10020 11760 8811 6237 6775
13617 6775 6025 4253 4562 5811 7544 8729 10424 8308 4881 6572 9350 9265 8813 9352 12299 12856
13601 12856 13305 15244 14998 15134 11475 9261 10135 11408 10173 11243 14092 11784 14033 15593 14758 15422
13585 15422 16223 14729 13685 11576 12878 14159 13930 13237 12354 7031 5121 7596 8952 6127 4525
13570 4525 5241 6303 1255 1152 3329 2748 7852 11484 10910 9359 9356 11041 13797 12245 12002 11413 13817
13553 13817 14543 12542 13733 16575 17199 16825 13040 10088 8032 8727 11751 12800 15141 13130 13748 14389
13537 14389 14378 13925 13348 12867 11325 11422 15014 16378 13384 13932 15815 12949 12866 14305 13519 17761 16696
13520A6696m325k488j717j139K40J322K638M980K515K277k272j011J22j142j463
13505A5233J448K998l320k176l98L14o64k62K835j161l178l966K227N50J3l641
13489F852n73N281P442J645p17J232j085l4K521q77q96K097J883N62j229l106
13473B0998j191j777k217p54J647k35j13L628n37l987k132k18J445j737k903j756
13457H161o38K354M328p05j927J354M851J805k921k306k027L867M635k022l655
13442A5154j296O63K64p21J654J314O708P184L422K337N719L168k342j233m912
13427C7083n939m612n950J071p94j567j337N08J928p42J142J403N36j167o25l22
13411B0616J419k63k095o29j33J238K013q99J691o48L52K731o71o54K90O09j295
$$ plain form
13520 16696 12371 9883 8166 7027 7267 8589 11227 16207 18722 20999 18727 17716 17838 16696 15233
13505 15233 16681 19679 16359 14183 13785 14099 13435 13173 16008 14847 11669 7703 9930 10480 10493 6852
13489 6852 6279 11560 19002 20647 19930 21162 20077 20043 22564 21687 20791 22888 24771 25333 24104 20998
13473 20998 19807 18030 15813 15059 16706 16471 16358 19986 19449 15462 13330 13112 14557 12820 9917 8161
13457 8161 7523 9877 14205 13500 11573 12927 17778 19583 16662 14356 12329 16196 20831 18809 15154
13442 15154 13858 14521 14785 14064 15718 17032 23740 30924 34346 36683 42402 45570 43228 41995 37083
13427 37083 31144 26532 20582 21653 20859 19292 17955 18463 20391 19649 20791 22194 22730 21563 20938 20616
13411 20616 22035 21772 19677 19048 18915 20153 22166 21267 22958 22310 22662 25393 24722 24068 24358 24967 23672
13394B3672j462N33J710L058J611L694N838M540M741K755j126n359n624p371p141
13379B4069j675L27l36m47m515Q38k328p50J238j861n15L630O13j885J111k429
13363A5085K374L866L6l318r53j644J714L641Q98j272k283j520J545R55K075P91
13347B1990m234J577J735J090L627L366J669J751j10k057l081l941j300L000j665
13332B3417j15j145k004m412k651k114J432R12M83J764m32Q71L786K971j043l048
13316A8672k352N43K372L602J008P09O91O92M29J02K88n07k283m85r64M56J184
13299B4157o01K305O137R720M663P67k066j326o349p519k744j880j607k797N3
13284B0913K963q89m729n397j134M015K999J024p59L058K724K711j098J611J731
$$ plain form
13394 23672 22210 22743 24453 27511 29122 32816 38654 43194 47935 50690 49564 44205 38581 31210 24069
13379 24069 22394 22721 22385 21938 17423 18261 15933 15183 16421 14560 14045 17675 18288 16403 17514 15085
13363 15085 17459 21325 21361 18043 17090 15446 17160 20801 21699 20427 18144 16624 18169 19124 21199 21990
13347 21990 17756 19333 21068 22158 25785 29151 30820 32571 32461 30404 27323 23382 22082 25082 23417
13332 23417 23302 22157 20153 15741 13090 10976 12408 13320 13803 15567 15135 16006 19792 22763 21720 18672
13316 18672 16320 16863 19235 22837 23845 24554 25245 25937 26366 26468 26756 26249 23966 23481 22517 22973 24157
13299 24157 23556 25861 31998 41718 46381 47148 45082 43756 37407 29888 27144 25264 23657 20860 20913
13284 20913 23876 22987 18258 12861 11727 15742 18741 19765 19006 22064 24788 27499 26401 28012 29743
13269B9743j261jn94q50J76K937o80k413k941K98K973n82m39l079k027J654j067
13252B1847n177j799M408P39J676K074R04n62m755j064R01M66L48N907O209J13
13236C2235K682K129K453q41J095J754m434j981k203O30J977K069N57q85N084
13221D2321L182n818L13O454L240j805k002n92j474l138l069o74p63P42k105K217
13205C7029O36P61M74k989o85P53J899M590j256j077j503m122p081k778M464j72
13189B8943l76k80M154K66J295L825N972O141j551M463O454M701N783J0859J1920
13174I2569J2771J2779J1706K1157L0315M1386N8851R3465J43296K07455K22934
13163I48684J52712P5536K2126l6166j16557j85585k16032j78186j22147q3612
$$ plain form
13269 29743 28482 28481 27887 27037 27213 30150 29470 27057 24116 24414 27387 26805 26366 23287 21260 22914 21847
13252 21847 16670 14871 19279 20018 21694 23768 24672 24110 19355 18291 19192 19658 20006 25913 32122 32235
13236 32235 34917 37046 39499 38658 39753 41507 37073 35092 32889 33519 35496 37565 38122 37237 42321
13221 42321 45503 39685 39998 46452 49692 47887 45885 45293 43819 40681 37612 36938 36175 36917 34812 37029
13205 37029 37665 38426 38900 35911 35226 35979 37878 42468 41212 40135 38632 34510 27429 24651 29115 28943
13189 28943 28567 28287 32441 32707 34002 37827 43799 49940 48389 52852 59306 64007 69790 80649 92569
13174 92569 105340 118119 129825 150982 181297 222683 281534 374999 518295 725750 948684
13163 948684 1101396 1176932 1199058 1162892 1046335 860750 644718 466532 344385 260773
13153B60773n5541l8176k4351j4965j4130j2927q892k640l453l143k625n034l457
13140G1439l707j810n018m690j060j536N062J627m369J676N28j847l878r75j290
13125E0152K140K070j101j979j633K539M976m15L401L829k235q15k9J369J86j954
13109F0501K308N249P35K310N380N752Q944O265Q696J6790J6015J8243K2313K7470
13095B06971M1679O9425J21620K05982L13613L89171K90999r655k43073l63966
13085A022766l16067k09100j34609q9169n9756l9392k9831j9723r078p683l815
13074A04543q619j0849q694k313j005k1L961M106l393p121r482l817L827Q22p26
13059F1219P91j323L589j224j721j750m454n255l080j327l912M73M254L17j042
$$ plain form
13153 260773 205232 167056 142705 127740 113610 100683 91791 89151 85698 82555 79930 74896 71439
13140 71439 67732 65922 60904 56214 55154 53618 58680 60307 55938 57614 58142 56295 52417 51442 50152
13125 50152 52292 54362 53261 51282 49649 52188 57164 56749 60150 63979 61744 60929 60900 62269 62455 60501
13109 60501 62809 68058 68793 71103 76483 82235 91179 97444 106140 122930 138945 157188 179501 206971
13095 206971 248650 318075 439695 645677 959290 1348461 1639460 1629805 1386732 1022766
13085 1022766 706699 497599 362990 273821 214065 174673 144842 125119 116041 108358 104543
13074 104543 95924 85075 76381 74068 73063 73042 77003 81109 77716 70595 61113 57296 61123 61945 61219
13059 61219 62010 60687 64276 63052 61331 59581 55127 49872 46792 45465 41553 42026 46280 46597 45555
13044D5555m38M847K653k92k302j734k727P49J482P21J385k74K901K058l00M172
13028E8456M609M887N560R56J810j007n764p342o547m554o221o498j665J816j452
13013C7044n57K33L64L385J399L951K523K551L531l100p292m041j235J116O84
12998D0556J569k069M593N015O792M912M003J154J398j17K422L90K548M799J993
12983G9958K472L301L568K876j987J224P57K105N127N225J3239K4298L1034L1859
12969B05056L4343L234j1906p455j2350l4691l2206k1081j5501j4056j2868j0300
12957G0219q846k795j279m9O063Q860N812K422J637J467L926M546Q937J0698J0363
12942A21981N389N296N072N673J0200J1969J2428P061n61j2179j8754j8654j4313
$$ plain form
13044 45555 45117 49964 52617 52325 50023 48289 45562 46311 47793 48514 49899 49625 52526 54584 54284 58456
13028 58456 63065 67952 73512 74468 76278 75271 69507 62165 55618 51064 44843 38345 36680 38496 37044
13013 37044 36487 36720 37084 40469 41868 45819 48342 50893 54424 51324 44032 39991 38756 39872 40556
12998 40556 42125 40056 44649 49664 56456 61368 65371 66525 67923 67806 70228 70618 73166 77965 79958
12983 79958 82430 85731 89299 92175 90188 91412 92169 94274 99401 104626 117865 142163 173197 205056
12969 205056 239399 242633 230727 223272 210922 176231 144025 122944 107443 93387 80519 70219
12957 70219 61373 58578 57299 57250 63313 72173 77985 80407 82044 83511 87437 91983 100920 111618 121981
12942 121981 127370 132666 137738 143411 153611 165580 178008 185069 184508 172329 153575 134921 120608
12929A20608j2318j0407n586l166K90j253j58l422j968J325K640L944O816M191
12915A01536k285k580j1019j0234k635j325k044J646R452J2380J1385M772M295
12902A13344P697J872o65k86O54k974k014q73K787K485l945j263K970N75J08K167
12886A22639K359J868M034O396J6932M0724N6851M2355M0340J2172m7923l7351
12874B61396k4763k2762k1920j7851j9458j7967j2577j0795p043j618R618J1286
12862A25546J0427J1223J3916J1635J0201J1022P730N526O794J3174J9790K1645
12850B68629K3926L2020N2439P2561Q3055P0611N8351L9238M529l9436n5197n4966
12838E55760o8756p0612m1453k7786k0053j1347j1572j0096k702m7K446O286K385
$$ plain form
12929 120608 108290 97883 92297 89131 89421 88168 88010 84588 82620 83945 86585 90529 97345 101536
12915 101536 99251 96671 85652 75418 72783 71458 69414 71060 80512 92892 104277 109049 113344
12902 113344 121041 122913 122248 121962 122616 119642 117628 116755 119542 122027 118082 116819 119789 120364 120472 122639
12886 122639 124998 126866 130900 137296 154228 194952 251803 294158 334498 346670 298747 261396
12874 261396 236633 213871 191951 174100 154642 136675 124098 113303 106260 104642 114260 125546
12862 125546 135973 147196 161112 172747 182948 193970 201700 207226 214020 227194 246984 268629
12850 268629 292555 324575 377014 449575 532630 603241 661592 700830 705359 665923 610726 555760
12838 555760 487004 416392 374939 347153 327100 315753 304181 294085 291383 291336 293782 300068 302453
12825C02453l139q125j2201j0621j0142k278J1133J8619J4135O610N298Q937R356
12812C30035J4853J7655M908O805J2137o39j492p474j7328j4707j384k44M906
12799C48031J0978J4651J2141J1216J1279R076R696J0359J4403J9873K8463K8820
12787E28986K2783J7977O454k515l731o96O902N894P995J1594J8112K2070K0493
12774F62318K7519L4787M0245N0618M7095M3445L5259L4851L5385L3683M5829
12763A091034O0670P1385P7364Q5457Q8276Q8865J03853J28807J62496J60681
12753B118888J13452O1775K6764j5402k1613M4146Q8354J16781J44266J70497
12743B847908J92550K26154K74895L23506L69659M19042M72988N49133O56806
$$ plain form
12825 302453 299314 291189 278988 268367 258225 255947 267080 285699 299834 306444 311742 320679 330035
12812 330035 344888 362543 367451 374256 386393 385754 384262 376788 359460 344753 343369 343125 348031
12799 348031 359009 373660 385801 397017 408296 417372 427068 437427 451830 471703 500166 528986
12787 528986 551769 569746 576200 573685 569954 569258 576160 582054 590049 601643 619755 641825 662318
12774 662318 689837 724624 764869 815487 862582 906027 941286 976137 1011522 1045205 1091034
12763 1091034 1151704 1223089 1300453 1385910 1474186 1563051 1666904 1795711 1958207 2118888
12753 2118888 2232340 2294115 2320879 2305477 2283864 2328010 2416364 2533145 2677411 2847908
12743 2847908 3040458 3266612 3541507 3865013 4234672 4653714 5126702 5675835 6332641
12734F332641Q02214J003950J250928J497819J728393K059961K536057L189784
12726B0401747M117203N501324P693383J1356026J7292425K6511811L7675515
12719A30549434M1608461K8510226J2470860M124492m345326j8236836l0883917
12712A63797394l9009878l5789844k5222999j6735927j1295474p835577n624186
12705B2283509m175605l124759k353970j839838j514530j282238j095918r08410
12697E988241p27154n77132m70006l87172l14276k65286k21668j88120j73860
12688B663567j66736j46179j21662j09181r1404o5281m7716m1540m1840n3431
12678A778597o3601o6027o2566n1427k8627M392M2485N8313N6514L7963J2743
$$ plain form
12734 6332641 7134855 8138805 9389733 10887552 12615945 14675906 17211963 20401747
12726 20401747 24518950 30020274 37713657 49069683 66362108 92873919 130549434
12719 130549434 172157895 200668121 213138981 217263473 212918147 194681311 163797394
12712 163797394 124787516 88997672 63774673 47038746 35743272 27907695 22283509
12705 22283509 18107904 14983145 12629175 10789337 9274807 7992569 6896651 5988241
12697 5988241 5261087 4683955 4213949 3826777 3512501 3247215 3025547 2837427 2663567
12688 2663567 2496831 2350652 2228990 2119809 2028405 1963124 1915408 1873868 1832028 1778597
12678 1778597 1714996 1648969 1586403 1534976 1506349 1510741 1553226 1611539 1668053 1706016 1718759
12667A718759n156j0832r136J1146L5196M8593N8315P8947R2971J06999J19430
12656B245232J24069J23191J33860J65658J98467K35187K83887L33709L74747
12647D218007M21315M64586N43145O84437Q70167J141991J482623J828019J995576
12638A3649866K092611K446332L118215M261028N902574Q473712J2932272K0568511
12630G3445121L3289530N1801501O6954468N4044489P288744l2160548n8220355
12623A96442950n8992352m1917261k7445938j8145536j2225286q455304n989594
12616B3271679m263543k984227k136159j771412j627939j516131j344032j077894
12608F550342q53219o76094n42366m22391l36777k78455k33182k17749k13361
$$ plain form
12667 1718759 1713603 1702771 1693635 1704781 1739977 1788570 1846885 1925832 2018803 2125802 2245232
12656 2245232 2369301 2492492 2626352 2792010 2990477 3225664 3509551 3843260 4218007
12647 4218007 4639322 5103908 5647053 6331490 7201657 8343648 9826271 11654290 13649866
12638 13649866 15742477 18188809 21307024 25568052 31470626 39944338 52876610 73445121
12630 73445121 106734651 158536152 225490620 279535109 286823853 254663305 196442950
12623 196442950 137450598 95533337 68087399 49941863 37716577 29261273 23271679
12616 23271679 19008136 16023909 13887750 12116338 10488399 8972268 7628236 6550342
12608 6550342 5697123 5021029 4478663 4056272 3719495 3441040 3207858 2990109 2776748
12599B776748k02489j85738j69100j37090j03039q9415r5161q9063p3365q3488
12589A548800q5952q5821j11702j07914q5423p8257n6969k3025o079n008k451
12578I00199k0640l9314m5913m5692l7670k2346r739n26J985l280q314j6536k2654
12565F29560k4169k2905j4374j6575k1024k7419l2698l4845l1809j9820q364j107
12553C74451N130P461M969k024p680j1443q002o026O34O318K349n086j0246j5682
12539C35123j5468j6082k6526j7219j2633j7257k0078m797J552R132J4370J0764
12527B40881P289J473l809l906k889l748l749q352j1667j3765j1466j0685o806
12514A68801M428P930M242m54l803k511l98K31p528r823p823P988J3491N995K3004
$$ plain form
12599 2776748 2574259 2388521 2219421 2082331 1979292 1889877 1794716 1705653 1632288 1548800
12589 1548800 1462848 1377027 1265325 1157411 1071988 993731 936762 913737 907658 902650 900199
12578 900199 879559 840245 794332 748640 710970 688624 678885 678359 680344 677064 668750 652214 629560
12565 629560 605391 582486 568112 551537 530513 503094 470396 435551 403742 383922 375558 374451
12553 374451 379581 387042 392011 389987 382307 370864 362862 356836 357470 363788 366137 361051 350805 335123
12539 335123 319655 303573 277047 259828 247195 229938 209860 205063 206615 215747 230117 240881
12527 240881 248170 249643 245834 241928 239039 235291 231542 223190 211523 197758 186292 175607 168801
12514 168801 173229 181159 185401 184947 181144 178633 178235 178466 170938 161115 153292 161280 174771 180766 203770
12499B03770o77k5131q339k0263j8204p504K558L869K381L59m83n285l148k817
12485A21086m864j210K037J1321J8486J0905L401l358q34K642k806o773j1784
12472A38249r276m659j2922j7834j3077n418N486K1263K7765K6946K0529J4590
12460A91642M751L029o953j1913j3588j1211j2942j4579r391j0497j5504j0769
12448H2075q343j3673k173K467J032L885P94N388M099r05j460Q30K836O600J3561
12433I7013N384O46o118j4602j1867p793m409n64O754O990L048K295j053l332
12419G2392o355m617j270j041o327n306o375q420r590p149l108p341m262L7N581
12404F849J542j078j743L398P096O811Q174L553J338P341R966O139J0284P360
$$ plain form
12499 203770 203093 177962 169623 149360 131156 123652 126210 130079 132460 132819 132336 127051 123903 121086
12485 121086 116222 115012 117049 128370 146856 157761 161162 157804 156970 159612 156806 150033 138249
12472 138249 128973 124314 111392 93558 80481 75063 80549 101812 129577 156523 177052 191642
12460 191642 196393 199422 192469 180556 166968 155757 142815 128236 118845 108348 92844 82075
12448 82075 73732 60059 57886 60353 61385 65270 66064 71452 75551 74646 73186 74016 76852 83452 97013
12433 97013 102397 103043 96925 82323 70456 62663 58254 57690 64444 71434 74482 76777 75724 72392
12419 72392 66037 61420 60150 59109 52782 47476 41101 32681 23091 15942 12834 5493 1231 1268 6849
12404 6849 8391 7313 5570 8968 16064 22875 31049 34602 35940 43281 53247 59386 69670 77030
12390G7030O964L825O103Q659O657K639K666J464L109J9170L7397M6828N3274
12377B75785M6477K0117l092k2184m3836m9460m3235l2232k1710j7671j3978j2742
12365H2239j2495j1818q005o158m442j814J086J143J185j407k251k099j960j866
12351C1338j149Q29K720J322J940M042O218M256L037j015k646k513m679l216j050
12336C9434J214J236K136K207q73j294P69L606m90k507j105o513o989p990n393
12321A7448k457l772p191j291J784K051L28L569L241k078Q16N950L587L165M417
12306B9567M503N01l716k889j092p01p90J294P94k58O02J821r53K730J09K583
12290C4105J393K30k359l017j317P87K411M906L588M548L987M220O309J2830J4103
$$ plain form
12390 77030 83994 87819 93922 102581 109238 111877 114543 116007 119116 138286 175683 222511 275785
12377 275785 322262 342379 339287 317103 273267 223807 180572 148340 126630 108959 94981 82239
12365 82239 69744 57926 49921 43763 39321 37507 38593 39736 40921 39514 37263 35164 33204 31338
12351 31338 30189 31018 33738 35060 37000 41042 47260 51516 54553 53538 50892 48379 43700 40484 39434
12336 39434 40648 41884 44020 46227 45354 44060 44829 48435 47945 45438 44333 37820 30831 22841 17448
12321 17448 14991 11219 4028 2737 4521 6572 6900 10469 13710 11632 12448 18398 21985 25150 29567
12306 29567 34070 34571 30855 27966 26874 26173 25383 26677 27471 27213 27815 29636 28683 31413 31522 34105
12290 34105 35498 35728 33369 30352 29035 29822 32233 37139 40727 45275 49262 53482 59791 72621 86724
12275H6724J2928J8184K4290K8429M8249P3576J13528J76056K28940K00737J14046
12264A125687N8334j206p3901j56935k10695k09069j48153r7966o5479m5222l1544
12253A43851k5566j7160p908j0102j0345o114q952p425j216k366p454n607p24
12240C2912n98j367j685k656j752j748j276j055p91P44j228j726o30m38k910j056
12224A2740J380L281L695n38j59M4k407q22K258K823j509J735j520r194L302L234
12208A8343j312n212j010J802K136l575l568l699j320j229R88j98K741J554J148
12193G589M81O36K162k62l581p48K691J353M720O285Q497N840j440l446m315M94
12177B6956K551R008P676N337M038N396J447L338O996Q609J3303J5995J7375K9707
$$ plain form
12275 86724 99652 117836 142126 170555 218804 292380 405908 581964 810904 1011641 1125687
12264 1125687 1184021 1182815 1108914 951979 741284 532215 384062 286096 220617 175395 143851
12253 143851 118285 101125 93217 83115 72770 66656 57704 50279 49063 46697 39243 33636 32912
12240 32912 32314 30947 29262 26606 24854 23106 21830 20775 19984 20728 19500 17774 17144 16706 13796 12740
12224 12740 14120 17401 21096 20558 20399 20443 18036 17214 19472 22295 20786 22521 21001 11807 15109 18343
12208 18343 17031 11819 10809 12611 14747 11172 7604 3905 2585 1356 2344 2146 4887 6441 7589
12193 7589 8070 8706 10868 10606 7025 6277 8968 10321 15041 21326 29823 35663 34223 30777 26462 26956
12177 26956 29507 38515 46191 51528 55566 60962 62409 65747 72743 81352 94655 110650 128025 157732
12163A57732M0802O0021R8169J59631K55208L60153L67745J39258j40206l25227
12153A173286l53248k53176j69809j13681p3368m6742l6172k3408j5115j1261
12143G7306p780o168p028j0295q233p669o233k459p66K316P16j784l402n327J459
12128A4653j245k200l292O8M098L585j247j377K88J222m478k593l401m174j328
12113a421L309l23r6Q33O00k233K2N77K64J056J515n48J938k22K077O62n81p58
12095F671L407M343l926o481k816o52J181L113J329j734Q37R59k856k913o12l63
12079e13M598L862J036k92j710k423l091k115j504L53L505M746m27J320L001K720
12063A3066K490l847k310N91P91m357k446k377M28K560l09K429L552j189m272
$$ plain form
12163 157732 198534 258555 356724 516355 771563 1131716 1499461 1638719 1498513 1173286
12153 1173286 820038 566862 397053 283372 210004 163262 127090 103682 88567 77306
12143 77306 69526 63358 56330 46035 37802 30133 23900 21441 20675 22991 23707 21923 18521 13194 14653
12128 14653 13408 11208 7916 7984 12082 15667 14420 13043 13331 14553 10075 7482 4081 -93 -1421
12113 -1421 1888 1565 1469 2302 2902 669 691 1268 1532 2588 4103 3555 5493 5271 7348 8010 7429 6671
12095 6671 10078 14421 10495 4014 1198 546 1727 4840 6169 4435 5272 6231 3375 462 -150 -513
12079 -513 4085 7947 8983 8691 6981 4558 1467 -648 -2152 -1799 1706 6452 6025 7345 10346 13066
12063 13066 15556 11709 9399 9990 10781 6424 3978 1601 2029 4589 4280 6709 10261 9072 4800
12048D800l26M74L90K27O08K448k354m118l66P33R51l312j851L79k28p81K118
12031b08K835P29k496R25M66K83L50q03l75J879j781l156n225L590M060J306j044
12014A335j583O5J27M779M947j057j751l15L82J120j275o32P83L75l047k625M68
11997B096K589M097j203l347k535m34K318k036J798K121l047k407K051q86l41
11982H34J468K662J022l01l647k917K290j326K701L390J647j334j541J593k849
11967C692L27L381O88k931m06J314l074k167k531j332p72L40K90j73j748k625
11951g727J92Lj005M290J754L114Q59l403n29M60j113k17l06k58L922L263p03
11934B596k135M521K914l032j816L66j542k276N73J957M427l077l277l09k119
$$ plain form
12048 4800 4474 4948 5338 5565 6173 8621 6267 2149 1783 2516 3467 155 -1696 -1317 -1545 -2326 -208
12031 -208 2627 3356 860 1785 2251 2534 2884 2081 1706 3585 1804 -1352 -6577 -2987 1073 2379 1335
12014 1335 -248 -183 -56 4723 9670 8613 6862 6547 6929 8049 6774 6142 6925 7300 4253 1628 2096
11997 2096 4685 8782 7579 4232 1697 1263 3581 1545 3343 5464 2417 10 2061 1175 834
11982 834 2302 4964 5986 5685 2038 -879 1411 85 2786 6176 7823 6489 4948 6541 3692
11967 3692 4019 7400 8088 5157 4751 6065 2991 824 -1707 -3039 -3811 -3471 -3181 -3354 -5102 -7727
11951 -7727 -7535 -7532 -8537 -4247 -2493 621 1480 -1923 -2452 -1992 -3105 -3322 -3628 -3886 36 3299 2596
11934 2596 461 4982 7896 4864 3048 3414 1872 -404 169 2126 6553 3476 199 -110 -2229
11919b229l28J843J512J953M56n43j652k99n59k222M92K294J686j781r75J132
11903G80j230j308K848J048J822k56k793k512J115K698Q2l93k188j156L912K229
11887D698J57m645l04L30j529M78j030j076K13k686J84M237K393n46Q45J201N88
11870C508L559j308l426j78k321j628J464K43j214q95K181j907J270N01j144K687
11854A392J208j938J265P5J182J897P89j618J896L11k530m623K48J536J651J503
11838D244J785k946j733j496K25J207J851K356R70M88J020J504J8k039o561j641
11822g48k29K288K288p00K172Q33k0j94J226j121Q21J34j757k031Q16M13R96j514
11804C673k574j927k935o50K276k252O5M811J252j212o28pQ32m07k979m14j223
$$ plain form
11919 -2229 -2557 -714 798 2751 3207 2664 1012 713 154 -2068 -1576 718 2404 623 -352 780
11903 780 -450 -1758 1090 2138 3960 3704 911 -1601 -486 2212 2294 1901 -287 -1443 2469 4698
11887 4698 4855 210 -94 236 -1293 -815 -1845 -2921 -2708 -5394 -5210 -973 1420 874 1719 2920 3508
11870 3508 7067 5759 2333 2155 -166 -1794 -330 -87 -1301 -2196 -15 -1922 -652 -151 -1295 1392
11854 1392 2600 662 1927 2002 3184 5081 5870 4252 6148 6459 3929 -694 -446 1090 2741 4244
11838 4244 6029 3083 1350 -146 79 1286 3137 5493 6463 6951 7971 9475 9493 7454 893 -748
11822 -748 -977 1311 3599 2899 5071 5904 5884 5690 6916 5795 6616 6750 4993 2962 3778 4191 5187 3673
11804 3673 1099 -828 -3763 -4413 -2137 -4389 -4324 487 1739 527 -101 -108 724 317 -2662 -3076 -4299
11787d299j018l76J741O7J676k078j27J9j52J550K787R90j90K35j557L47L547
11770C162k743m218l152n11R98K695J653L571J284k721k729J766J026J578o46
11755A013n49J782K014o09k863j113K540K73k729o47M981K084j846l481j843M72
11739e21l38j033l52o19J570r05P59o08K88P74J121J01M074K55J789N081P022
11722A8458O868R888J5176K3267J8614L623j2629k1014j7051j1732p607n820r999
11709A0042l376j104K601m9J331j964n918j868J292L344K73n47L82l21o44j338
11693B136J166L75l69j005l48r6J010L457J181L1n77j489M65J355k131k645j956
11676E60m8k155n158j406J03L188J681K10J963p04Q93P39k595o61K934J981p75
$$ plain form
11787 -4299 -5317 -5693 -3952 -3885 -2209 -4287 -4414 -4395 -4547 -2997 -210 780 590 825 -732 -385 3162
11770 3162 419 -3799 -6951 -7462 -6464 -3769 -2116 1455 2739 18 -2711 -945 81 1659 1013
11755 1013 464 2246 4260 3651 788 -325 2215 2488 -241 -888 4093 6177 4331 850 -993 -521
11739 -521 -859 -1892 -2244 -2863 -1293 -2198 -1439 -2047 -1759 -985 136 237 4311 4566 6355 11436 18458
11722 18458 25326 35214 50390 73657 92271 95894 83265 62251 45200 33468 25861 20041 10042
11709 10042 6666 5562 8163 8114 9445 7481 1563 -305 987 4331 4604 4057 4439 4118 3474 2136
11693 2136 3302 3677 3308 2303 1955 1859 2869 6326 7507 7538 6961 5472 5937 7292 5161 2516 560
11676 560 512 -1643 -6801 -8207 -8104 -4916 -3235 -3025 -1062 -1766 -873 -134 -2729 -3390 -456 1525 750
11659G50l314j551J793K872L63j895n473j082Q94L014J387k510r39k65O14L432
11643a910J385M49L952O67k152j462l00J325K942o67j613M08r6j221j891j613
11627a797k73j909R5l22k562J042L005J333o49j005j064k300J692j672k441J927
11611f900J588J677P65l605KK020P70k335j004K145K467J909k10J639K856k785
11595I99l258k093J412J138J572L1J266K021P55l349l768M79J785j779l79N730
11579B562M11j827m100j147j098K575L274O01j16r89p16p20Q9l442L407K063j093
11562b66j283l518k406K557L824P3l54l073J063n84J013k052r46J847Q86q04J078
11545b945j452O0j556J857J547r46m79J56L094Q65m212j964J914K655J009J579
$$ plain form
11659 750 -2564 -4115 -2322 550 913 -982 -6455 -7537 -6643 -3629 -2242 -4752 -5691 -5956 -5342 -1910
11643 -1910 -525 -76 3876 4543 2391 929 629 1954 4896 4229 2616 3024 2928 1707 -184 -1797
11627 -1797 -2070 -3979 -3884 -4206 -6768 -5726 -2721 -1388 -2037 -3042 -4106 -6406 -4714 -6386 -8827 -6900
11611 -6900 -5312 -3635 -2870 -6475 -6473 -4453 -3683 -6018 -7022 -4877 -2410 -501 -711 928 3784 999
11595 999 -2259 -4352 -2940 -1802 -230 -199 1067 3088 3843 494 -3274 -2795 -1010 -2789 -3168 2562
11579 2562 2973 1146 -2954 -4101 -5199 -2624 650 1251 1135 146 -570 -1290 -1201 -4643 -1236 827 -266
11562 -266 -1549 -5067 -7473 -4916 -1092 -1019 -1373 -4446 -3383 -3967 -2954 -5006 -5952 -4105 -3219 -4023 -2945
11545 -2945 -4397 -4337 -5893 -4036 -2489 -3435 -3914 -3758 -664 201 -4011 -5975 -4061 -1406 -397 1182
11529A182j603l235o89n93n11K424K949n50K820j002j194K713m79j659J698K541
11513D812J102Q88n288l930j428j383K708J407j708j667j502j019L397J950J437
11498b24k11j092k732J195K994r69n637r18K307J798j861O56Q65J711J109l004
11482d013r59J959K792K366K470l221j630j513Q39k279K638K99r46J872Q73n72
11466I75R51l423k588J534K343Q28j998l601P69K933K204m94k9j03P89j649J381
11449H22K289L106q48k838k270l274j367J364n10L605K543O04J378l122k114J357
11433G25K458N74J030j999L7O70k988o50k460N82o51j233L326L015J99L39j820
11416A154k772J101j246j674J035j990o05J696J171M334k096q25J088M20j485
$$ plain form
11529 1182 -421 -3656 -4345 -4938 -5449 -3025 -76 -626 2194 1192 -2 2711 2232 573 2271 4812
11513 4812 5914 6802 1514 -2416 -3844 -5227 -2519 -1112 -2820 -4487 -5989 -7008 -3611 -1661 -224
11498 -224 -435 -1527 -4259 -3064 -70 -1039 -6676 -7594 -5287 -3489 -5350 -4694 -3829 -2118 -1009 -4013
11482 -4013 -4972 -3013 -221 2145 4615 1394 -236 -1749 -910 -3189 -551 -252 -1198 674 1547 975
11466 975 1926 -1497 -4085 -2551 -208 620 -1378 -4979 -4210 -1277 927 433 404 301 1090 -559 822
11449 822 3111 6217 5369 2531 261 -3013 -4380 -3016 -3526 79 2622 3226 4604 1482 -632 725
11433 725 3183 3757 4787 2788 2825 3495 507 -143 -2603 -2021 -2672 -3905 -579 2436 2635 2974 1154
11416 1154 -1618 -517 -1763 -3437 -2402 -4392 -4997 -3301 -2130 2204 108 -717 371 791 -694
11401f94j026J780M82n527J28K954r82k49k257k618R41L134J224j585J240K949
11385a06N20J317l061p93j353q55J21K248j943j448P54M204L61m41K043J045N58
11368C171m330k137q47p31j8k44K702K513r24j573k288l79j771J391J188K079
11352b198k284r30OK81Kj177M068j34k151J09P86N41K895k993k776j396J890J291
11334d170M6j434J428M11L843Q30N07k100J372J261m110k993L72O519L68l891
11318a741K137L943r2K075k529n210J324N832K644j604l843n428j685j273J906
11303c544J304K657K662j903l337K309J736O91p09m622k225n48K86K548N218k206
11287C17l040Q89m93J085K345O38J643j133r05q00m56j669J344n70L311J887k977
$$ plain form
11401 -694 -1720 60 542 -4985 -4857 -1903 -2885 -3134 -5391 -8009 -7068 -3934 -2710 -4295 -3055 -106
11385 -106 414 1731 -1330 -2123 -3476 -4331 -4210 -1962 -3905 -5353 -4599 -395 -34 -475 1568 2613 3171
11368 3171 -1159 -3296 -4143 -4874 -4892 -5136 -2434 79 -845 -2418 -4706 -5085 -6856 -5465 -4277 -2198
11352 -2198 -4482 -5412 -5406 -5125 -5123 -6300 -2232 -2366 -4517 -4408 -3622 -3081 -186 -3179 -5955 -7351 -5461 -4170
11334 -4170 -4124 -5558 -4130 -3719 124 954 1461 -639 733 1994 -2116 -5109 -4737 1782 2150 -1741
11318 -1741 396 4339 4247 6322 3793 -1417 -93 5739 8383 6779 2936 -2492 -4177 -5450 -3544
11303 -3544 -2240 417 3079 1176 -2161 148 1884 2575 1866 -2756 -4981 -5529 -5243 -2695 2523 317
11287 317 -2723 -1834 -2327 -1242 1103 1741 3384 2251 1346 546 90 -1579 -235 -805 2506 4393 1416
11270A416k101K444l224j120L605J496M052J414j225j18R21m073j369q26L961
11255E253j154m465k950j282K693J370k762q25J72Q55k31O29q0j382Q12K029q58
11238b176j281P09J751j572k99k042P98K675j57L681L992o60l882l86R96k097
11222E0l745J548K754j857J106O37J363j051n84j71j93o74j450O13M30K4L022
11205A822J319J472K185J118l134n352k041j497R77L304O99k098J4j033N39O01
11189a105k8j841j271j020j831p54Q37K080K155K308n8j5K99L16r27K331R28P68
11171C172k600k060m311q06J076J023k29K511p86l4L151K6k70J703N01O57M099
11154F823k048j76l944n71J583j577j342l535j391R72j83L240L686Q2j240l026
$$ plain form
11270 1416 -685 1759 -1465 -2585 1020 2516 6568 7982 6757 6639 7560 3487 2118 1292 5253
11255 5253 4099 -366 -3316 -4598 -1905 -535 -3297 -4122 -3950 -3095 -3326 -2697 -2777 -4159 -3347 -1318 -2176
11238 -2176 -3457 -2748 -997 -2569 -2868 -4910 -4112 -1437 -1594 2087 6079 5419 1537 1151 2147 50
11222 50 -3695 -2147 607 -1250 -144 493 1856 805 221 50 -143 -817 -2267 -1654 -1224 -1200 1822
11205 1822 3141 4613 6798 7916 4782 -570 -2611 -4108 -3131 173 872 -1226 -1212 -2245 -1706 -1105
11189 -1105 -1133 -2974 -4245 -5265 -7096 -7850 -7013 -4933 -2778 -470 -528 -543 -244 72 -855 1476 2404 3172
11171 3172 572 -1488 -5799 -6605 -5529 -4506 -4735 -2224 -3010 -3044 107 133 -137 1566 2067 2724 6823
11154 6823 4775 4599 655 84 1667 90 -1252 -4787 -6178 -5206 -5389 -2149 1537 1619 379 -2647
11138b647k342N05p87L644L196o99n48l50j48r13J036L267L976k756j990N52j635
11121A361j809o01Q69J85j580L82L117K331M12l46k742p53J070k898O01o69k213
11104c283O9J056J594j810k179Q39M68J452O11J131j418j229l47P3l89l93J93
11087c562J480J863J523j146k76k107l163p43M571J691l210K306L513K39k14p42
11071B023n21k869J896j56O4N72K496p03p38k552r11L121K315l356j758L301J769
11054C993k277l580j297j163n77q80M273J924l69K168J250Q74K136M31l081l384
11038D41m365J292k57j704J917J277j791j066R28K823L053k619r54N933J848j70
11022F586N65l31j167q23J379l403j899l29N43k25K777j112j606Q4J1P7k055J167
$$ plain form
11138 -2647 -4989 -4484 -5271 -1627 1569 870 322 -28 -176 -1089 -53 3214 7190 4434 2444 2996 1361
11121 1361 -448 -1049 -180 5 -1575 -1193 1924 4255 4667 4321 1579 826 1896 -1002 -401 -1070 -3283
11104 -3283 -3214 -2158 -564 -2374 -4553 -3714 -3246 -1794 -1183 -52 -1470 -2699 -3046 -2973 -3362 -3755 -3562
11087 -3562 -2082 -219 1304 158 -118 -2225 -5388 -6131 -1560 131 -3079 -773 2740 2979 2765 2023
11071 2023 1502 -1367 529 373 437 1009 3505 2802 2064 -488 -1399 1722 4037 681 -1077 2224 3993
11054 3993 1716 -1864 -3161 -4324 -4901 -5781 -1508 416 47 2215 3465 4339 6475 6906 3825 441
11038 441 -3924 -2632 -2889 -4593 -2676 -1399 -3190 -4256 -3328 -505 2548 -71 -1025 4908 6756 6586
11022 6586 7151 6820 5653 4830 6209 2806 907 578 1121 896 3673 2561 955 1039 1050 1127 -928 239
11004B39M19O96k15J743p70q84J31j998M57P23m50l032K054Q12k638J439L806
10987B532l27j871J457J888O9J282k644n423j145K900Q44M26j931J846N057k03
10971D757k247J45j631r34K483o75j015j530l737N17k29K935K043L428k95k276
10955A739l877m0K101o99k156k356M79L362P51k14J664j769M36J761j814j416
10939b048l288k523J062J925K255L722L402K665j461k987j795l741l113N324L893
10924C292l616j088r70J076j131k716l83K140J692K467J585R52p29L05j383Q3
10908A576Q71mR1J624J962M45K8l176k216m24j283N04K671J290k011j507j39N50
10890H52k326k11M192k03j281J285J88K262j356k162j039K864L113k020m814m27
$$ plain form
11004 239 658 1354 1139 2882 2112 1228 1359 -639 -182 541 91 -2941 -887 -75 -2713 -1274 2532
10987 2532 2205 334 1791 3679 3748 5030 2386 -3037 -4182 -1282 -438 -12 -1943 -97 4960 4757
10971 4757 2510 2655 1024 90 2573 1898 883 -647 -4384 -3867 -4096 -1161 882 4310 4015 1739
10955 1739 -2138 -2178 -77 -776 -2932 -5288 -4809 -1447 -696 -910 754 -1015 -579 1182 -632 -2048
10939 -2048 -5336 -7859 -6797 -4872 -2617 1105 4507 7172 5711 2724 929 -2812 -5925 -601 3292
10924 3292 -324 -1412 -2382 -1306 -2437 -5153 -5536 -3396 -1704 763 2348 3300 2571 2876 1493 1576
10908 1576 2447 2443 2534 4158 6120 6565 6593 3417 1201 777 -506 -2 2669 3959 1948 441 302 852
10890 852 -1474 -1685 2507 2304 1023 2308 2496 4758 3402 1240 201 3065 6178 4158 -656 -1083
10874a083K449L205q58k668J675J242l651L340O29j892o82N3J099j758l370P48
10858a522J558J845J16l67j796o02K995J45M407M798j314J332ml603N5N50M15
10841I008k4j746l62K061L437K111l49k117k166n543l37R37r29j395p57j209r5
10824E25N67j821j113j39M061J885p89k648k10J549j852J466m93j127L643p16
10808B788l429K825J594K678K96m91j652J931M167O682J0645Q397k843p199l732
10793B2657o421m687q94j629l67J514j214j586K250r43j612j212m02j834k132
10778A488J242R31J370j689q24j472N4K023K188l89k873k099J841M890o95q11
10762E175m24k079J90N47N3j318k097p48R60N90M566R41k493K817J144J2j127
$$ plain form
10874 -1083 1366 4571 3713 1045 2720 3962 311 3651 4280 2388 1706 1759 2858 1100 -2270 -1522
10858 -1522 36 1881 1997 1630 -166 -768 2227 2372 6779 11577 10263 11595 11591 7988 8043 8593 9008
10841 9008 8984 7238 6876 8937 12374 14485 14136 12019 9853 4310 3973 4910 3981 2586 1829 620 525
10824 525 1092 -729 -1842 -1981 2080 3965 3176 528 318 1867 15 1481 988 -139 3504 2788
10808 2788 -641 2184 3778 6456 6752 6261 4609 6540 10707 17389 28034 36431 33588 26389 22657
10793 22657 16236 11549 10655 9026 8659 10173 8959 7373 9623 8680 7068 5856 5454 3620 1488
10778 1488 2730 3661 5031 3342 2518 1046 1100 3123 5311 4922 2049 -50 1791 6681 5986 5175
10762 5175 4751 2672 2862 3409 3462 2144 47 -701 259 849 5415 6356 3863 6680 7824 7836 6709
10745F709K175K056j088m582j172K099K298J582j093j746l468K052L435o40k118
10730F499K951N443Q99J026l566m189m467n3L683m56M06k393n02K599L69j027
10714G222m48j850p53R72N48L48K641J619l299j612k10l61R41m40L3p33J63Q68
10696E649J179O17K545K403o064j696k6n49J970K459R95j107K320M130l67l734
10680A0724o574L30L164K312j709l043K748J588r57K015J519p36N00k206j679
10665G996j910j363J067J021L260K549r07j646N05R96K159J763J143l799j694
10650A1140j187j814o34r23K803M001L96j454m407K14L030K711J642j444j075
10635A2999o01k079Q82P58K784J892j113j452j02J48J198M927J994j682j951j202
$$ plain form
10745 6709 8884 10940 9852 5270 4098 6197 8495 10077 8984 7238 3770 5822 9257 8617 6499
10730 6499 9450 14893 15792 16818 13252 9063 4596 4543 8226 7770 8176 5783 5281 7880 8249 7222
10714 7222 6774 4924 4171 5143 5691 6039 8680 10299 7000 5388 5178 4817 5758 5318 5351 4618 4781 5649
10696 5649 6828 7445 9990 12393 6329 4633 4607 4058 6028 8487 9482 8375 10695 14825 14458 10724
10680 10724 4150 4480 7644 9956 8247 5204 7952 9540 8583 10598 12117 11381 11881 9675 7996
10665 7996 6086 4723 5790 6811 10071 12620 11713 10067 10572 11568 13727 15490 16633 12834 11140
10650 11140 9953 8139 7505 6582 9385 13386 13782 12328 7921 8135 11165 13876 15518 14074 12999
10635 12999 12398 10319 11201 11959 14743 16635 15522 14070 13968 14116 15314 20241 22235 20553 18602 17400
10619A7400r66k20M671k042j283L331J409j070J369m24r41M7M607p47L13K95l7
10602B5712p2m78L036j096k871j082l32L240o24j981k61M056Q66j895j676O91
10586B5233q75L00J595J769K899N23J079K234j438J847N069o84j638R00P54K888
10570D2455K611j025j380J48J454K211N156L752P83J82K485O015O793N319N644
10555H2603O842R286J1497K4144K4712P325j2084k2515j7924j0325m193p345k980
10542H9043L317L565L486O158K831K523L698K442M586L429K265K149O263Q762
10528A44517R383O420P150P451R047P959P716Q772R133J3195J3109J2525J3815
10515B70192J7673J5233J7947J3506J9438K2245K6466K7499K9911L1395L3697
$$ plain form
10619 17400 16434 16214 20885 18843 17560 20891 22300 21230 22599 22175 21234 21281 25888 25141 25454 25749 25712
10602 25712 25640 25162 28198 27102 24231 23149 22817 26057 25433 23452 23191 27247 28113 26218 24542 25233
10586 25233 24358 24658 26253 28022 30921 31444 32523 34757 33319 35166 40235 39551 37913 38813 39567 42455
10570 42455 45066 44041 42661 42809 44263 46474 51630 55382 56165 56347 58832 64847 71640 76959 82603
10555 82603 89445 98731 110228 134372 159084 166409 154325 131810 113886 103561 99368 92023 89043
10542 89043 92360 95925 99411 105569 108400 110923 114621 117063 121649 125078 127343 129492 135755 144517
10528 144517 153900 160320 167470 174921 183968 191927 199643 208415 217548 230743 243852 256377 270192
10515 270192 287865 303098 321045 334551 353989 376234 402700 430199 460110 491505 525202
10504E25202L6051L8365M2535M6955N0539N1227N6406O4574O6390O2498O4415
10493A105157O6294O4612N6215N1994M6013K9668J7018Q214p969j8436k8884m0783
10481A349113n1649n7507o0097o1205o6456o4966o1417o0595n6722n6308n0143
10470G02048m9683m5201l9096l8438l2229k8447k8419k6789k2487k2035j9412
10459C49812j3228j8703j5876r669j0339o786n867r403q986p442o281Q23L658
10446B41713Q311J3501J6870K1220L5198N4037Q4378J34698K35090L88939N39944
10435A773899M70633O2594l03754n17927m69113l05087j89016j24586q6275n8462
10425B52906m1886k8472k2115k2128j4993r329o728m430l939l101k180n542r707
$$ plain form
10504 525202 561253 599618 642153 689108 739647 790874 847280 911854 978244 1040742 1105157
10493 1105157 1171451 1236063 1292278 1344272 1390285 1419953 1436971 1445185 1437216 1418780 1389896 1349113
10481 1349113 1297464 1239957 1179860 1118655 1052199 987233 925816 865221 808499 752191 702048
10470 702048 652365 607164 568068 529630 497401 468954 440535 413746 391259 369224 349812
10459 349812 336584 317881 302005 292336 281997 275211 269344 259941 250955 243513 237232 238055 241713
10446 241713 250024 263525 280395 301615 336813 390850 475228 609926 845016 1233955 1773899
10435 1773899 2244532 2307126 2003372 1485445 1016332 711245 522229 397643 311368 252906
10425 252906 211020 182548 160433 138305 123312 113983 107255 102825 98886 95785 93605 88063 78356
10412G8356n444l277k568o185m697m188M03l12N35K79j437j268p124l127o38M8
10396C9356l206j227j759l35J596l864k354L580J505J740p86k904k764J908K655
10381C3141j656j6q14j68J554l31k328l675k651K73J792k244j293J917L094j275
10365B5320L969n61k583j251j487N240R393Q639Q854L208j895n689q114o141p654
10350B9248l231q68j111p40j334J246k224k142o65l96J40p05J200K76K84l57r0
10333A8531l98j535j344l134q38K348j978J86P04J657m87m61n413l026j039j66
10317C607K944J297p29j131j515l502L559N264J257j115j597l43K745R97j469
10302A0269K11j913j354K097K362j670j846J77j608k524J431J600J231n81N68
$$ plain form
10412 78356 72912 69635 67067 60882 56185 51997 52400 52088 52623 52902 51465 50197 43073 39946 39308 39356
10396 39356 36150 34923 33164 32829 34425 30561 28207 31787 33292 35032 34246 31342 28578 30486 33141
10381 33141 31485 31469 30655 30487 32041 31710 29382 25707 23056 23329 25121 22877 21584 23501 26595 25320
10365 25320 29289 28728 26145 24894 23407 28647 38040 46679 55533 58741 56846 51157 43043 36902 29248
10350 29248 26017 25149 24038 23298 21964 23210 20986 18844 18179 17783 17923 17218 18418 18694 18978 18621 18531
10333 18531 18133 16598 15254 12120 11282 13630 11652 11838 12542 14199 13712 13251 7838 4812 3773 3607
10317 3607 6551 7848 7119 5988 4473 971 4530 9794 11051 9936 8339 7996 10741 11738 10269
10302 10269 10480 8567 7213 9310 11672 10002 8156 8333 6725 4201 5632 7232 8463 7882 8450
10287H450J636l988r82R55m392j892L394J496O9J550J52m026l08j21j712K618
10271B899L669j376j973L51j124M21K121O58r0K8j424P58K130k896J762R88k260
10254D642k410l44j73J007Q99N17M73n6Q89R15O15j690o60p48j423N38j031K677
10236D637l815j767Q74J232k566n70M080L980n57o42n43m386q87L219J242k625
10220I06j754p77L734J078j502J20p74q65N72J601J159k130j164l62K970o37J44
10203B319J292J171J64r9o56n41Q91j586N45L79l270l165j045j609L133L245R55
10186B123J79O62J94j920n58J410j782j492P46j149n90O4M01J015j140j401k254
10169e492L000L295O96K136j185j144O10K82m56J542L82J699J182p40M81q08n78
$$ plain form
10287 8450 10086 6098 5116 6071 1679 -213 3181 4677 4746 6296 6448 2422 2114 1993 281 2899
10271 2899 6568 5192 3219 3570 2446 2867 4988 5646 5556 5584 4160 4918 7048 4152 5914 6902 4642
10254 4642 2232 1888 1715 2722 3621 4138 4611 4555 5444 6359 6974 5284 4624 3876 2453 2991 1960 4637
10236 4637 822 -945 -71 1161 -1405 -1975 2105 6085 5528 4886 4343 -43 -930 2289 3531 906
10220 906 -848 -1625 2109 3187 1685 1805 1031 166 738 2339 3498 1368 204 -158 2812 2175 2319
10203 2319 3611 4782 4946 4847 4191 3650 4541 2955 3500 3879 609 -2556 -3601 -5210 -2077 1168 2123
10186 2123 2302 2964 3158 1238 680 2090 308 -1184 -438 -1587 -2177 -2113 -1712 -697 -1837 -3238 -5492
10169 -5492 -2492 803 1499 3635 2450 1306 1916 2198 1742 3284 3666 5365 6547 5807 6288 5480 4902
10152D902k878k114n10K268P04po80k446j156J886L417L61k920k92O87l185J122
10135h41J271K412J13R80l76m630J606K379j889J582O2R86J446M13j396J66j386
10118B898R06j149j158K365J854q32P29L155m817R38M717J360n616k184Q74j93
10102C847l532j381M733J84l397L15P93o19m95M107O00j224k051q29L804K474
10086G329j427J245N82j270k469L0j253J310n92Q96L700J868Q98P50J16p37r18
10069A0058l025m736j932M71M08p63j710k323J337L588J979l783k173Q3k026M74
10053d073K270L679L113l358k844K901l86k618J04n5K647l91j46J876l68k384
10037c3j548j411K345J203J706l26k474j801J514N767L439N77J29m91N8Q02k925
$$ plain form
10152 4902 2024 -90 -600 1668 2372 2365 1685 -761 -1917 -31 3386 3747 827 535 1222 -1963 -841
10135 -841 430 2842 2955 3935 3559 -1071 535 2914 1025 2607 2669 3655 5101 5514 4118 4284 2898
10118 2898 3804 2655 1497 3862 5716 4884 5613 8768 3951 4889 9606 10966 5350 3166 4040 3847
10102 3847 315 -1066 3667 3851 454 769 1562 943 448 4555 5155 3931 1880 1051 4855 7329
10086 7329 5902 7147 7729 6459 3990 4020 2767 4077 3485 4381 8081 9949 10847 11597 11713 10976 10058
10069 10058 7033 2297 365 836 1244 481 -1229 -3552 -2215 1373 3352 -431 -2604 -2521 -4547 -4073
10053 -4073 -1803 1876 4989 1631 -1213 1688 1302 -1316 -1212 -1267 1380 989 843 2719 2351 -33
10037 -33 -1581 -2992 -647 556 2262 1936 -538 -2339 -825 4942 8381 8958 9087 8596 8654 9456 6531
10020F531K761M32R65O54M53l322qJ472l002j318k482k5p17K53p4k83j507j850
10002a067j29L968m94J975O13j442j303j273j778J784j770M46j454p18o5n74j327
9985d608k49J585L982j846k010P1q7J022J531J536J020J063J652j11m31j105k82
9968B733j587j1r25J669K744R85k06J296N468L396N693P403J3174O745l408p215
9952C7954j3537q619k553m169n966P78J873M98m98l623j559L04K117l85R69J922
9936E506j010l083j730j641O8J742j519r69J133J832q13l32K178R47k900o75L36
9919i30K530j783k779J35Q54r91k473K952Q88L13K922J486k731l433k80J018j206
9902c508j017P43N607J271j870k674j392J767R07K771j555p20j941l01k524J866
$$ plain form
10020 6531 9292 9724 10689 11343 11796 8474 8466 9938 6936 5618 3136 3111 2394 2647 2573 2290 783 -1067
10002 -1067 -1196 2772 2278 4253 4866 3424 2121 848 -930 854 -916 -470 -1924 -2642 -2707 -3281 -4608
9985 -4608 -4857 -3272 710 -1136 -3146 -3075 -3162 -2140 -609 927 1947 3010 4662 4551 4120 3015 2733
9968 2733 1146 1135 210 1879 4623 5608 5402 6698 12166 15562 21255 28658 41832 48577 45169 37954
9952 37954 24417 15798 13245 9076 3110 3888 5761 6259 5761 2138 579 883 3000 2615 3584 5506
9936 5506 4496 1413 -317 -1958 -1890 -148 -1667 -2636 -1503 329 -484 -816 1362 2309 -591 -1266 -930
9919 -930 1600 -183 -2962 -2827 -1973 -2964 -5437 -2485 -1597 -1284 1638 3124 393 -3040 -3320 -2302 -3508
9902 -3508 -4525 -3782 1825 3096 1226 -1448 -2840 -1073 -166 2605 1050 330 -1611 -1912 -4436 -2570
9886b570M45m35J457J103J39K470L2k022J571K677J495R29J02l2P66k950j750
9869C427J213J534p06l585J522O51p63j168l88j636r93J198M20r21j2k968j939
9852e114P41O77q30m73J058L090r0k054J987L5L49K563K00j825j005J798Q15K172
9834D094k067p285M08J991P21m67k589J918l37J638l827l372L254J467K027m198
9818f624j785M497K273q1J596J475j079N56L37j62o97k6q77l97J166J144n28J20
9800I08J324L360R84m26k902j460M844M98k161j457J222K329M138L341K690l86
9784A6846o558q048j521j331m658q56K543p9P30R2K383J859j285O16p66J445K066
9767C478O07j731l247L54m683M78J666J389K499O99N21J912J43n91m091l367J89
$$ plain form
9886 -2570 -2125 -2560 -1103 0 139 2609 2641 619 2190 4867 6362 7291 7393 7361 8127 5177 3427
9869 3427 4640 6174 5468 1883 3405 4056 3293 2125 1737 101 -892 306 726 -195 -207 -3175 -5114
9852 -5114 -4373 -3696 -4526 -4999 -3941 -851 -941 -2995 -1008 -973 -624 1939 2139 314 -691 1107 1922 4094
9834 4094 2027 -5258 -4850 -2859 -2138 -2605 -5194 -3276 -3613 -1975 -5802 -9174 -5920 -4453 -2426 -6624
9818 -6624 -8409 -3912 -1639 -1720 -124 1351 272 828 1165 1003 306 280 -597 -994 172 1316 788 908
9800 908 2232 5592 6576 6150 3248 1788 6632 7130 4969 3512 4734 7063 11201 14542 17232 16846
9784 16846 10288 2240 719 -612 -5270 -6126 -3583 -3662 -2932 -2840 -457 1402 117 733 -33 1412 3478
9767 3478 4085 2354 -893 -539 -5222 -4744 -3078 -1689 810 1509 2030 3942 4085 3494 -597 -3964 -3775
9750c775J337M55J072j188L04J825o31k118r53L004K189J481j875k887l160j047
9734e967n53L126R09o44J135J380n05p24k301J013k90Q81J156j638K8P74j094
9717c314k403K311K18m30R58J35J526L289L36n04O34N34l016k325j010j34l063
9700f258j77L007J913J358p17J520L386j620r40j32j921N29j547j084N87L86l30
9683b040P51M648J068k73l288m65p16j07l20n03K080j110k60m84m51M829L58q62
9665B855j694q01J62k322K977K10m821j360P98L659j538K031N168L93l61p72j402
9648C182o96k111L713M928k551k139N80L90j373l638j977q28k949K629K608l445
9632c677j0K301O89j729k940J660N6o5J140N149K152k561Q90L215O87l541j385
$$ plain form
9750 -3775 -2438 -1983 -911 -2099 -1795 30 -601 -2719 -3672 -668 1521 3002 1127 -1760 -4920 -5967
9734 -5967 -6520 -3394 -2485 -3129 -1994 -614 -1119 -1843 -4144 -3131 -3421 -2540 -1384 -3022 -2994 -2220 -3314
9717 -3314 -5717 -3406 -3188 -3618 -2660 -2525 -999 2290 2626 2122 2756 3290 274 -2051 -3061 -3195 -6258
9700 -6258 -6435 -3428 -1515 -157 -874 646 4032 2412 1472 1340 -581 -52 -1599 -2683 -2096 -1710 -2040
9683 -2040 -1289 3359 4427 4154 866 401 -315 -422 -742 -1245 835 -275 -535 -1019 -1470 3359 3717 2855
9665 2855 1161 360 522 -1800 1177 1387 -3434 -4794 -3996 -337 -1875 156 5324 5717 5356 4584 3182
9648 3182 2486 375 4088 9016 6465 4326 4906 5296 3923 285 -1692 -2520 -5469 -2840 -232 -3677
9632 -3677 -3687 -1386 -697 -2426 -5366 -3706 -3650 -3715 -2575 2574 4726 2165 3055 6270 6957 3416 2031
9615B031N0m533l287r49J787L742N58j320K83L86J46O54J379k203J3K755J107
9598B599J310L77j478l69n88j089o20r62O24R02J401K874k136k603j580j107J473
9581i72j938J366J962P57p9J795j542j346j239j748J779K567K796n25m046l928
9565d341K422J992O53k237O9j436J028J121M55J383o00q70J344j57K033J80o72
9548B367R01j757l926k020K450K852K546k02l762j388N87m43k221L23L07J816
9532a570J476j258j0j390l103K221J087n32J222J801J477Q61j844r47K501j259
9516G33j143k64K440J28j41K13m62j416q64J451J64r64J207L84J851j513k247
9499d43k294K270k356R57Q00m28J783k271k360j49L272K338l226j813M469L230
$$ plain form
9615 2031 2081 -2452 -5739 -6688 -4901 -1159 -601 -1921 -1638 -1252 -1106 -452 927 -1276 -1263 1492 2599
9598 2599 3909 4286 2808 2439 1851 762 142 -820 -196 706 2107 4981 2845 242 -1338 -2445 -972
9581 -972 -2910 -1544 418 1175 1096 2891 1349 3 -1236 -2984 -1205 1362 4158 3633 -413 -4341
9565 -4341 -1919 73 726 -1511 -1442 -2878 -1850 -729 -274 1109 509 -361 983 826 2859 3039 2367
9548 2367 3268 1511 -2415 -4435 -1985 867 3413 3211 -551 -1939 -1352 -1795 -4016 -3693 -3386 -1570
9532 -1570 -94 -1352 -1362 -2752 -5855 -3634 -2547 -3079 -1857 -56 1421 2282 438 -509 1992 733
9516 733 -410 -674 1766 1894 1753 1966 1504 88 -776 675 839 -125 1082 1466 3317 1804 -443
9499 -443 -2737 -467 -2823 -1866 -1066 -1494 289 -1982 -4342 -4491 -1219 1119 -2107 -3920 549 3779
9483C779K149k281k947r10q55k867L12J736J092q06L32j427K564J654k24m663
9467c362m39K779Q99K261K055K120l585o97K52j533k744n260n39L216L928j008
9451a657n495j273J710J140J624J487M6K869K311p73l658k426k293m72K353M825
9435C18K343P55Nr32P33j207m569k972N330n56l022J301N268J192j554j404k320
9418a291o11o44k259l39o15k605L989K531J66l386J391N35%K483kj816K799J672
9400A998q78m392j148n51L129N236L00l494J370Q42j081k322J63k214O91J596
9384g55j353J087K843K575Q41k456j961Q11l709q74P1K789M961R10j829j406j095
9367A450l330J247O91M65j481p8o71o64p51J780K849K973j978k150N60m289l0
$$ plain form
9483 3779 5928 3647 700 -210 -1065 -3932 -3620 -1884 -792 -1598 -1266 -2693 -129 1525 1301 -3362
9467 -3362 -3801 -1022 -123 2138 4193 6313 2728 2031 2283 750 -1994 -7254 -7793 -4577 -649 -1657
9451 -1657 -7152 -8425 -6715 -5575 -3951 -2464 -2418 451 2762 1989 -1669 -4095 -6388 -6860 -4507 318
9435 318 2661 3416 3421 2489 3222 2015 -2554 -5526 -196 -752 -3774 -2473 2795 3987 2433 1029 -1291
9418 -1291 -1902 -2546 -4805 -5144 -5759 -8364 -4375 -1844 -1678 -5064 -3673 -3138 -3138 -655 -657 -2473 326 1998
9400 1998 1120 -3272 -4420 -4971 -1842 3394 3694 200 1570 2412 1331 -991 -828 -3042 -2351 -755
9384 -755 -2108 -1021 1822 4397 5238 2782 821 1632 -2077 -2951 -2880 -91 4870 5780 3951 2545 1450
9367 1450 -1880 -633 58 523 -958 -1036 -1707 -2371 -3122 -1342 1507 4480 2502 352 912 -3377 -3407
9350c407M515j366j987Q00K648J787l030K537K85k401j725k14J33L441K957M96
9334E469M40k55j592j865J635k826k540j91R08l019L327L989k456j705j595n07
9318b783J675k086j843l00l280j25M138J081j32n32k56L09j382o84J711J081L356
9301e2j616Jj116Q83K187Q00L031K373r66j048l14p39M61J94j387j311L590m43
9283D528l307l01J299r06m95j882O79J439l87k11m03Q89p18J914J547k940K398
9266C143l2k737K97j043R02p84J503J650J3k457m126K432N657J978k069k785M38
9249A980l80n55j222k847J372Q04M6L372J551l481n451K024L487P27k573J050
9233i6J81k398l97K189J660J317j180j316P15m60K013J693j48l585k575K32K10
$$ plain form
9350 -3407 1108 -258 -2245 -1445 1203 2990 -40 2497 2782 381 -1344 -1558 -1425 2016 4973 5469
9334 5469 5909 5654 4062 2197 3832 1006 -1534 -1725 -817 -3836 -509 3480 1024 -681 -2276 -2783
9318 -2783 -1108 -3194 -5037 -5337 -8617 -8742 -4604 -3523 -3655 -4187 -4443 -4134 -5516 -6200 -4489 -3408 -52
9301 -52 -1668 -1667 -2783 -1900 287 1087 4118 6491 5525 4477 4163 3424 3885 4079 2692 1381 4971 4528
9283 4528 1221 920 2219 1313 818 -1064 -385 1054 667 456 53 942 224 2138 3685 745 3143
9266 3143 3111 374 671 -372 530 -254 1249 2899 2912 455 -3671 -1239 4418 6396 4327 1542 1980
9249 1980 1600 1045 -177 -3024 -1652 -848 -802 2570 4121 640 -4811 -2787 700 1427 -1146 -96
9233 -96 85 -2313 -2710 -521 1139 2456 1276 -40 675 215 2228 3921 3773 188 -2387 -2155 -1945
9216a945J301M565K087j069j677L053M866N400N532N036R673L368l057o896m079
9201B6158o838n275q91r24j069m074O04K785k658k97Q86k872o865n154L121K519
9185h44K004k65J142K5r94j595K798L02k467Q48l59N95P55j590k380J16K470R94
9167A555K329L025j067j824j338j407m99k862j229k309j313K713L870k452j559
9152d367Q13k265k706J741J100j243l260J857P97K488k382L397M735j020l151
9137c466K750j96j14J96k245k616j076K6K184p33J292K004R48J381L22l328j350
9120d021N28m44l38j582L63L124o36l329P96K130N39P76J478n80j215L57O72k710
9102d092o17r40J023K253J077M880Q20J606l885k721O72k47R81q14J395k476J110
$$ plain form
9216 -1945 -644 3921 6008 4939 3262 6315 11181 16581 22113 27149 36822 40190 37133 30237 26158
9201 26158 19320 14045 13154 12230 11161 7087 7691 10476 7818 7521 8407 5535 -1330 -6484 -3363 -844
9185 -844 1160 895 2037 2062 1068 -527 2271 2573 106 954 595 1190 1945 355 -2025 -1909 561 1555
9167 1555 3884 6909 5842 4018 2680 1273 774 -2088 -3317 -5626 -6939 -4226 -356 -2808 -4367
9152 -4367 -3554 -5819 -8525 -6784 -5684 -6927 -10187 -8330 -7533 -5045 -7427 -4030 705 -315 -3466
9137 -3466 -716 -912 -1026 -830 -3075 -5691 -6767 -6741 -4557 -5290 -3998 -1994 -1046 335 657 -2671 -4021
9120 -4021 -3493 -3937 -4275 -5857 -5494 -2370 -3006 -6335 -5539 -3409 -2870 -2094 -616 -1196 -2411 -2054 -1382 -4092
9102 -4092 -4709 -5649 -4626 -2373 -1296 3584 4404 6010 2125 -596 76 -171 810 -4 1391 -1085 25
9085B5K148l332o00L719j548l843j625K468R54J048j782r8J575K948j493n95J209
9068A178j361m137j560J696m87J403J199K239j005K11J23j845K49J674K060K704
9052D341p69p16l433L09J604J519r08K728J952m948j904q59J507J857j414o333
9036e467j717N856Q334k10n77j595l720k154M71p91n02K9j594J787L038M69l703
9019b046l134J396m00P39J529P43J246J543j735O40R6k16n1n68o77J451L135k64
9001C427K35k43j009P82l92N8N2j024j681J25k701m0R27j269J291K092k797J361
8983h06p00n28j185K250r31m03l136n57J714L515l82m817k190M044M685J017j38
8966A452k88j52K212j952k486M25k073P08K5r96J928M74J436n36L203J629k124
$$ plain form
9085 25 2173 -1159 -1759 1960 412 -3431 -5056 -2588 -1634 -586 -2368 -2466 -891 2057 564 -31 1178
9068 1178 -183 -4320 -5880 -4184 -4671 -3268 -2069 170 -835 -624 -501 -2346 -2097 -423 1637 4341
9052 4341 3572 2856 -577 -268 1336 2855 1947 4675 6627 1679 -225 -1084 423 2280 866 -5467
9036 -5467 -7184 -1328 7006 6796 6219 4624 904 -1250 -779 -1570 -2072 -2043 -3637 -1850 1188 1657 -2046
9019 -2046 -5180 -3784 -4184 -3445 -1916 -1173 73 1616 -119 521 617 401 350 -218 -895 556 3691 3427
9001 3427 3662 3419 2410 3192 2800 2858 2910 1886 205 330 -2371 -2411 -1484 -2753 -1462 630 -2167 -806
8983 -806 -1506 -2034 -3219 -969 -1900 -2303 -5439 -5996 -4282 -767 -1149 -5966 -8156 -4112 573 1590 1452
8966 1452 1164 1012 3224 1272 -1214 -789 -2862 -2154 -2129 -3125 -1197 -723 713 177 3380 5009 2885
8949B885k890k791K033Q74K403J146O67j562k509k273m223J327R65J065K313j381
8933a951O13L184l9K154J782q95j892l464j580k920j783J189J130R78M43k275
8917e326P00L223K690K569L4k281k65m91j359J360j836l005J833k107Q34L933
8901E06l70J540L239K660m39l954K24k343l087K320J653J240P35n1j205l70L88
8884B686J922l950j555J233%L625P78J100k165k279N70m42k371j356J887N51K75
8867E09L061P66j390m814k696J497L162J177o12K894K660J482j273K382Q710Q310
8851B5825Q021M902k765m707o046o963l741k781n043J702K747Q71l181l943J067
8836E965K715M36L081K396k724j398k401k732N15k015m226j135M750K579r07j609
$$ plain form
8949 2885 -5 -2796 -763 111 2514 3660 4327 2765 256 -2017 -6240 -4913 -3948 -2883 -570 -1951
8933 -1951 -1338 1846 1807 3961 5743 4848 2956 -508 -2088 -5008 -6791 -5602 -4472 -3494 -3051 -5326
8917 -5326 -4626 -1403 1287 3856 3890 1609 1344 853 -506 854 -982 -3987 -2154 -4261 -3427 506
8901 506 136 1676 4915 7575 7136 3182 3406 1063 -2024 296 1949 3189 3924 3873 2668 2298 2686
8884 2686 4608 658 -897 336 336 3961 4739 5839 3674 1395 1965 1523 -848 -2204 -317 234 509
8867 509 3570 4336 2946 -1868 -4564 -3067 95 1272 660 3554 6214 7696 6423 8805 17515 25825
8851 25825 33846 38748 35983 31276 25230 18267 14526 11745 6702 8404 11151 12022 8841 4898 5965
8836 5965 8680 9116 12197 14593 11869 10471 8070 5338 5853 3838 -388 -1523 3227 5806 4899 3290
8820C290Q04r51q46o51J858M290J654k049M55J610L043Q733R589R383J3207J0504
8804F3923M833q61j3288j4984j2423r902l468k006m248o633j032K755K413j442
8790C637j550J061J467j854J292Q7o19N79j206o77k456n97n48P90J441J841q98
8773A790k42L62J056J20k293j314l913M927N233N55J478N872O210N374M979J99
8757C0393m024m414o290o116k093L517k230l922j285l10r15k681q40J232J401
8742A423l232k970mP96J359j710Q38K325j089R94k451L05N923M49r38j612m90
8725h4N98j035k86M63l50J226K723j05J73J33l308k70L760J022k789j38J221j120
8707A834r01j217L375L88q57j390j171O59K413J49k434k321k209J270J97k714
$$ plain form
8820 3290 4094 3143 2297 1646 3504 7794 9448 7399 7854 9464 12507 21240 30829 40212 53419 63923
8804 63923 68756 67895 54607 39623 27200 17298 13830 11824 7576 943 -89 2666 5079 3637
8790 3637 2087 3148 4615 2761 4053 4140 3521 4100 2894 2217 -239 -836 -1384 -594 847 2688 1790
8773 1790 1548 1910 2966 3086 793 -521 -4434 493 5726 6281 7759 13631 19841 25215 30194 30393
8757 30393 26369 21955 15665 9549 7456 10973 8743 4821 3536 3226 2311 -370 -1210 22 1423
8742 1423 -1809 -4779 -4783 -3987 -2628 -4338 -3500 -1175 -2264 -1270 -3721 -3416 2507 2956 2018 406 -84
8725 -84 514 -521 -807 -344 -694 532 3255 3150 3323 3456 148 -122 3638 4660 1871 1733 2954 1834
8707 1834 933 -284 3091 3479 2622 1232 61 720 3133 3282 848 -1473 -3682 -2412 -2215 -4929
8691d929l98k038O9K469K382o37J993L492k165l985L88k35K385K956P9k242j811
8674b227k349K451L140K231k058K777K573q06m166k622k01k406J518J648j954
8659b451J933J871n24k846L11J613L009l102m068J562K670L081r72j343l443p31
8643c430O20r07O74k10R47K084p1L93Q49J457J488J638j316O73l12l97o69K753
8625F264k47n405k880J84K143j948n484J65J559J217n36J72m64K018K525o10K060
8608G33l380O5J683o55m94Q82L41m27m9m53N875K909j708n7J280k040k445k34
8590A826l339J216M845J83l359K18J064K48J258m97l628q09J848K177p69l114
8574f32k429j10P16O29K31q62K58L223Q29n2J173j03m161j222M48L97k569J322
$$ plain form
8691 -4929 -5327 -7365 -7296 -4827 -2445 -3082 -1089 2403 238 -3747 -3359 -3594 -1209 1747 1826 -416 -2227
8674 -2227 -4576 -2125 1015 3246 1188 3965 6538 5732 1566 -1056 -1257 -3663 -2145 -497 -2451
8659 -2451 -518 1353 829 -2017 -1706 -93 2916 -186 -4254 -2692 -22 3059 2087 744 -2699 -3430
8643 -3430 -2810 -3717 -3043 -3253 -2306 -222 -293 100 949 2406 3894 5532 4216 4889 4577 4180 3511 6264
8625 6264 6017 612 -2268 -2084 59 -1889 -7373 -7208 -5649 -4432 -4968 -4796 -5260 -3242 -717 -1327 733
8608 733 -2647 -2582 -899 -1554 -2048 -1166 -825 -1252 -1301 -1754 4121 7030 5322 5265 6545 4505 2060 1826
8590 1826 -1513 -297 4548 4731 1372 1590 2654 2902 4160 3663 35 -774 1074 3251 2482 -632
8574 -632 -3061 -3171 -2455 -1826 -1595 -2457 -2199 1024 1853 1801 2974 2871 -1290 -2512 -2064 -1667 -4236 -2914
8556b914K999n84j164J35J054j943j015j319K823J37k162L051K452m95J27M48
8540A630j56L91j419j396R43j244J346K008R16k729m968M63O974O29k575l16O27
8523A124K278L084k928m39k02l35p14J686K798J752L238j972k685j300j709J62
8507C838J163N86j340l302j093Q60L813Q23k698k961M75n9j261K103L906q57k072
8490A924l73J875j097n73K71k14K36k959j62K577K334l613P90j965N03O30m60
8473b76J182r22J476M41l733l275k471K088M241L912j94j182l651n151p63K803
8457e475K912Q22l091O18J684L247J624j016l18j501P04j405j623J806L35L121
8441B444j3l909l219n02K929O7J799J549j924l559k224J798J094j072K462j400
$$ plain form
8556 -2914 85 -499 -1663 -1528 -474 -2417 -3432 -4751 -1928 -1791 -3953 -902 1550 1055 1182 1630
8540 1630 1474 1865 446 -950 -7 -1251 95 2103 3019 290 -4678 -4215 2759 3388 813 497 1124
8523 1124 3402 6486 3558 3119 2917 2582 1868 3554 6352 8104 11342 9370 6685 5385 3676 3838
8507 3838 5001 5587 4247 945 -148 712 4525 5348 2650 -311 164 105 -1156 947 4853 3996 1924
8490 1924 1551 3426 2329 1756 2027 1813 2049 -910 -1072 1505 3839 226 1016 -949 -446 184 -276
8473 -276 906 -16 1460 1901 -1832 -5107 -7578 -5490 -1249 2663 2469 1287 -2364 -7515 -8278 -5475
8457 -5475 -2563 -1741 -4832 -4214 -2530 717 2341 1325 1007 -494 210 -1195 -2818 -1012 -677 2444
8441 2444 2431 -1478 -4697 -5199 -2270 -2203 -404 1145 -779 -4338 -6562 -4764 -3670 -4742 -2280 -3680
8425c680l344J628R04K546N821n66l801j936K74m130j613M03K993J506K145J008
8409A58j343K677J708p35k179N70l280k546K668L384K075P14m719l738L232L974
8393B620k064j659J80M30j94K42M81m87P2k39j073k830k868M333N092o25j071
8376C40n89l287j301K249J704m97J368P89k066j141q66J043P59K425J373K930
8360E233N73k668k222j385j239j606R38r54L93L673M32j105J498j456j704L67
8344a232M021o11j946l398O63J687j934M18K782K972k723k882J543J168J402L82
8328B312p79m87m165J66j302O90Q13l72P68J951N008J099k509m680Q62J246q24
8311b03J65j462k179j401n84R35K19K379J892m2m35K836K591q55l619j418l134
$$ plain form
8425 -3680 -7024 -5396 -4492 -1946 3875 3309 -492 -2428 -2154 -6284 -7897 -7494 -4501 -2995 -850 158
8409 158 -1185 1492 3200 2465 286 856 -2424 -4970 -2302 1082 3157 3871 -848 -4586 -1354 2620
8393 2620 556 -1103 -923 -493 -687 -445 36 -451 -379 -618 -1691 -4521 -7389 -3056 2036 1411 340
8376 340 -249 -3536 -4837 -2588 -884 -1381 -13 776 -1290 -2431 -3297 -2254 -1495 930 2303 5233
8360 5233 5806 3138 916 -469 -1708 -3314 -2376 -3330 -2937 736 1168 63 1561 105 -1599 -1232
8344 -1232 2789 2178 232 -3166 -2503 -816 -2750 -2332 450 3422 699 -2183 -640 528 1930 2312
8328 2312 1533 1046 -3119 -2953 -4255 -3565 -2752 -3124 -2356 -405 4603 5702 3193 -1487 -625 621 -203
8311 -203 -38 -1500 -3679 -5080 -5664 -4729 -4510 -2131 -239 -281 -716 2120 4711 3856 237 -1181 -4315
8294d315J418K361J412M744O82P69l16j836j494m30k815j025n94k165j057J67
8278d494L674J42k546o20K69q05L547L281m134o14M426L132j099n566J021P61
8262C75O57K04L37M07K182o74l170P24k175L823K203o007n70j39J429L766l42
8245C030k165o60K570J918J666l226p94J005J348j303k554l935n2L062L183K902
8229E995Q37m6p66k227l585J82J404m10P96N90j224K02n6p22k108l770K129K563
8211b16J102k281K397J712j148l89p72j41K510J121j219J320j875l376L387P49
8195B881l334j922K805k55J136j206r1K497j581K12p67j688j696k173J335J657
8179b190J923l50k330L01M45r84J850J796O71j94L70p49j445j99o86j302O35J355
$$ plain form
8294 -4315 -2897 -536 876 5620 6302 7071 6755 4919 3425 2995 180 -845 -1439 -3604 -4661 -4494
8278 -4494 -820 -678 -3224 -3844 -3575 -4380 -833 2448 -1686 -2300 2126 5258 4159 -1407 -386 375
8262 375 1032 1236 1573 1980 4162 3488 318 1042 -1133 2690 4893 -1114 -1684 -1823 -394 3372 3030
8245 3030 865 205 2775 4693 6359 3133 2339 3344 4692 3389 835 -3100 -3152 -90 3093 5995
8229 5995 6832 6786 6020 3793 208 390 1794 1384 2180 2770 1546 1748 1692 970 -1138 -4908 -2779 -216
8211 -216 886 -1395 1002 2714 1566 1177 405 264 2774 3895 2676 3996 2121 -1255 2132 2881
8195 2881 -453 -2375 430 175 1311 105 14 2511 930 1142 375 -1313 -3009 -5182 -3847 -2190
8179 -2190 -267 -617 -2947 -2646 -2201 -3185 -1335 461 1132 938 1308 559 -886 -1085 -1771 -3073 -2438 -1083
8161a083J83M51p29N64J268k206R27j605J322k319j529m59k32N562L648J49j104
8144B808k985J748L425j428M62J995k575n147j359J111L260m98l303R82P74K06
8128e24P37N78o4M08j553j748r03JK22J74J506L356k17j702K28j248j535j361
8110c645K787k810l197K74J939j217k58K759K623J726J933k990j676k01P18P20
8094e15o98j791j024J281o72l069m83L202M19Q19N47M571m17n989j485K817L34
8077b153q53L9j134n67K046P84K293m58n312l661K576J547O059J561j607Q25N34
8060B519N95k770l555j064L369K228O18N01k761j918k86j679J4P81j932M33L371
8043a536J212p19j213M747K240j876o92j217j668j862K365j904K518M847n83j744
$$ plain form
8161 -1083 -900 -449 -1178 -614 654 -1552 -625 -2230 -908 -3227 -4756 -5215 -5447 115 3763 3912 2808
8144 2808 -177 1571 4996 3568 4030 6025 3450 -1697 -3056 -1945 1315 817 -2486 -1504 -730 -524
8128 -524 213 791 727 1135 -418 -2166 -3069 -3068 -2846 -2672 -1166 2190 1973 271 499 -749 -2284 -3645
8110 -3645 -858 -3668 -6865 -6591 -4652 -5869 -6127 -3368 -745 981 2914 -76 -1752 -1953 -1235 -515
8094 -515 -1213 -3004 -4028 -2747 -3419 -6488 -6971 -3769 -3350 -2531 -1984 2587 2170 -3819 -5304 -2487 -2153
8077 -2153 -3006 -2967 -4101 -4668 -2622 -1838 455 -3 -5315 -8976 -6400 -4853 1206 2767 1160 1985 2519
8060 2519 3114 344 -3211 -4275 -906 1322 1940 2441 -320 -2238 -2524 -4203 -4189 -3408 -5340 -4907 -1536
8043 -1536 -324 -1043 -2256 2491 4731 2855 2163 946 -722 -2584 -219 -2123 395 5242 4659 2915
8027B915j237j950K72o1N68O73j321k329L499K86j057p6N87j440K580j149k256
8010a496L302k33j740J726j275K951o16l763k449J217K983j677j513K906M647
7995D970J800k173l942k084k413k390J697M094J207K151p97j542L54J966p34K91
7979B455K798K20k426j575j72J215j428O26j489k034Q15j446J420J762l54m910
7963d523k620N274O423r64o77J173j495l619R82L195o77k783j638K107L08k490
7947b024L10J764k44l947J536L361M09j371N30p97j974j340n62K415K90l732l59
7930e735L785J422O9Q39L067K150p42O70m42j313J077J490K752j566n049j24K75
7913B625k046o41J033K909n08j031M95l715j182j819l41L817j062K42k807r24
$$ plain form
8027 2915 1678 -272 0 -61 507 1180 -141 -2470 1029 1315 258 182 769 -671 1909 760 -1496
8010 -1496 1806 1573 -167 1559 284 3235 2619 -1144 -3593 -2376 607 -1070 -2583 323 4970
7995 4970 6770 4597 655 -1429 -3842 -6232 -4535 -441 766 2917 2120 578 932 2898 2164 2455
7979 2455 5253 5473 3047 1472 1300 2515 1087 1713 224 -1810 -995 -2441 -1021 741 387 -4523
7963 -4523 -7143 -1869 4554 3590 2913 4086 2591 -1028 -46 3149 2472 -311 -1949 158 466 -2024
7947 -2024 -1714 50 -194 -4141 -2605 756 1165 -206 324 -473 -2447 -3787 -4349 -1934 -1644 -5376 -5735
7930 -5735 -1950 -528 -459 380 3447 5597 4855 5525 5083 3770 4847 6337 9089 7523 2474 2350 2625
7913 2625 579 -62 971 3880 3372 2341 2836 -879 -2061 -3880 -4221 -404 -1466 -1224 -4031 -4955
7897d955J224K399J336L62q70k79p89l09K094M636k330P22l76j244j265k37j670
7880a551j514L193j097m756L929Q32j062J528R40k73J71k98M68nJ13M72K356N077
7862H523M40m383l530j136p93K387O99J404l08P51m55j763q76L10r86j361N7m14
7844a434j682o77k209J954J984K381M93j817p34k409K430K260K237Q30m73M58
7828C592Q05k641m079J367L618L61P15M36J113j409l160K519J947l396m333o90
7812c235K363J263l195k859k808K932J910L01m78J154N016k20Q91j619j923j047
7796a554r31M126K743R11J234p98j707J896k197j790j407Q81K104j142m01j639
7780C29k094P85M457M99j257j275l58Q0P97J427o03l943l323j743Q17k71J88K7
$$ plain form
7897 -4955 -3731 -1332 4 366 -504 -783 -1572 -1881 213 4849 2519 3241 2865 1621 356 119 -1551
7880 -1551 -3065 128 -969 -5725 -1796 -964 -2026 -498 442 169 340 42 510 505 618 1090 3446 8523
7862 8523 8963 4580 1050 -86 -879 1508 2207 3611 3303 4054 3599 1836 960 1270 284 -1077 -1020 -1434
7844 -1434 -3116 -3793 -6002 -4048 -2064 317 810 -1007 -1741 -4150 -1720 540 2777 3607 3134 3592
7828 3592 4397 1756 -2323 -956 2662 3023 3738 4174 5287 3878 718 3237 5184 1788 -2545 -3235
7812 -3235 -872 391 -2804 -5663 -8471 -5539 -3629 -3328 -3806 -2652 2364 2144 3035 1416 -507 -1554
7796 -1554 -2485 1641 4384 5295 6529 5731 4024 5920 3723 1933 526 1407 3511 2369 1968 329
7780 329 -1765 -980 3477 3976 2719 1444 1086 1166 1963 3390 2787 -1156 -4479 -6222 -5405 -5676 -5488 -5461
7762e461K629O093J77j162m793j413N22K867J770K540k068M85J52k859K266m64
7746A281n83L59J006J462N43j275m147N77L273J430J064j44k244k469j084j738
7730b689l021K787K618L19k28J622m74k55j491q69M71N15O79m60n67j438r77J396
7712b062r52k589K836K077J845j710j24m496k837j002N909K205P43k359m503k393
7696i412L935J852r36K559K638K309o00l825m708j067J41L34J985J19k77j380
7680f333P64j677K40o54j693J069L283K518J494J48j820J432J143K09K1j963j793
7663c612N56K087Q64P42P84j71j236k519L355o2k357J080L873j444k637j159q25
7646b681m85M25L667L17q42p15J494k940o39J316k469j08L093K52Q97L311J360
$$ plain form
7762 -5461 -2832 3261 3438 2276 -2517 -3930 -3408 -541 1229 3769 1701 2186 2338 -521 1745 1281
7746 1281 698 1057 2063 3525 4068 2793 -1354 -777 2496 3926 4990 4846 2602 133 -951 -2689
7730 -2689 -5710 -2923 -305 14 -214 1408 934 679 -812 -1681 -1210 -695 -16 -476 -1043 -2481 -3458 -2062
7712 -2062 -3014 -5603 -2767 -690 1155 -555 -679 -5175 -8012 -9014 -3105 -900 -157 -2516 -7019 -9412
7696 -9412 -5477 -3625 -4561 -2002 636 2945 2345 -1480 -6188 -7255 -7114 -6780 -4795 -4676 -4953 -6333
7680 -6333 -5569 -7246 -7006 -7660 -9353 -8284 -5001 -2483 -989 -841 -2661 -1229 -86 123 144 -1819 -3612
7663 -3612 -3056 -969 -105 637 1421 1250 14 -2505 850 788 -1569 -489 3384 1940 -697 -1856 -2681
7646 -2681 -3166 -2741 926 1243 401 -314 1180 -1760 -2399 -1083 -3552 -3660 -567 -315 582 3893 5253
7629E253n717j200R02K054R9k615n05K664L3l534J681N72M68J834M371N00J039
7612G899n636j756N4k438J048Q52j88j797k31l561j110O100K656l700J540L085
7596B817j347J202J116j117k498p05K89k056l591J702L928L140r49j868j250Q53
7580c34k497J945O43j834j827n16J250p99P71k1j868k968J134L296p93m85M04
7563d499K018J28K365K007l349N81j839j011N26j896P0K080J476j50L283K222
7547D012l071O14p40j298J712J299J434k76k620l070j972k318r48K430K491M0
7531b281K80K203k099l592j128M044L066N97l204K056j255j920L908j88M8j19
7515D16J072k878j909j486K003Q19L38L8k650k825J657M083K7K181l828k597j530
$$ plain form
7629 5253 -464 -1664 -762 1292 1391 -1224 -1729 935 968 -2566 -885 -313 155 1989 6360 6860 7899
7612 7899 2263 507 561 -1877 -829 23 -165 -1962 -2193 -5754 -6864 -764 1892 -1808 -268 2817
7596 2817 1470 2672 3788 2671 173 -532 -243 -2299 -5890 -4188 -260 2880 1931 63 -1187 -334
7580 -334 -2831 -886 -243 -2077 -3904 -4420 -3170 -3969 -3198 -3219 -5087 -8055 -6921 -3625 -4418 -4903 -4499
7563 -4499 -2481 -2353 12 2019 -1330 -749 -2588 -3599 -3073 -4969 -4899 -2819 -1343 -1493 1790 4012
7547 4012 941 1555 815 -483 1229 2528 3962 3686 1066 -2004 -3976 -6294 -7242 -4812 -2321 -2281
7531 -2281 -2001 202 -1897 -5489 -6617 -2573 493 1090 -2114 -58 -1313 -3233 675 487 535 416
7515 416 1488 -1390 -3299 -4785 -2782 -1963 -1625 -1587 -4237 -7062 -5405 -1322 -1295 886 -2942 -5539 -7069
7498g069j718R55K775L753L535j800k801k104J619J344p59J344j320Q24k767j38
7482d327j961L575L483p31l131N79m86o93p2M718k85k089j47K067J701j260j44
7465G97j27q93J203j396j442m4O19K060K168k88k057n83l85K252K239j019l03
7448B801j219M45K23q68k522L29k540K021o02l210k155Q13M417K467J64Q90k793
7431a339j271j946p90J151J301j066k158J15K07q95R53K758n92n57q73j067K295
7414c774r37K362J938L22k257r18K877K595m484k566J575J353K010j50K211K478
7398D635O65K98M71m591l317R78J237n75M11J366j600k593j505L96R89j380q87
7381e002J790J397J403q64l002k638N19K709J690P07q60j206N12j692j487j694
$$ plain form
7498 -7069 -8787 -7832 -5057 -1304 2231 431 -2370 -4474 -2855 -1511 -2270 -926 -2246 -1422 -4189 -4327
7482 -4327 -6288 -2713 770 39 -3092 -2513 -2999 -3692 -3764 954 669 -1420 -1567 500 2201 941 797
7465 797 670 -223 980 -416 -1858 -1902 -1283 777 2945 2657 600 17 -368 1884 4123 3104 2801
7448 2801 1582 2027 2250 1382 -1140 -811 -3351 -1330 -1932 -5142 -7297 -6484 -2067 400 564 1454 -1339
7431 -1339 -2610 -4556 -5346 -4195 -2894 -3960 -6118 -6003 -5796 -6691 -5738 -2980 -3572 -4129 -5002 -6069 -3774
7414 -3774 -4711 -2349 -411 -89 -2346 -3264 -387 2208 -2276 -4842 -3267 -1914 96 -54 2157 4635
7398 4635 5300 5598 6069 1478 -1839 -861 376 -199 212 1578 -22 -2615 -4120 -3724 -2735 -4115 -5002
7381 -5002 -3212 -1815 -412 -1276 -4278 -6916 -6397 -3688 -1998 -1291 -2151 -3357 -2845 -4537 -6024 -7718
7365g718q16M577j688J848K249p7j56l996j631J210J246L040K004j151k046N3
7349c052k594K89j794N77m03J282J929r44k99M794j908m269k158K960J315r52
7333e227o59j284L751K494L409M61j028k897l464J339q70k459J297l70j806j410
7317h723J394j9j198J231M044Q50m058j047M443L580m21j620l096K013r54l403
7301f984o39K444K570L146r34p35J554q45J662J266P29K417k375l291k261L75
7285a901K27O93J867j21N7K030j41k026k555k296m24K746J091l694l261J326M358
7268b024P43k219l031K224K403L044q42l609j489j93L798L751j051j844N73k088
7252a854R5k895j090M323M181J045k84P0k327j779j800m15O26K95p4L26k61j837
$$ plain form
7365 -7718 -8534 -3957 -5645 -3797 -1548 -1625 -1781 -5777 -7408 -6198 -4952 -1912 92 -1059 -3105 -3052
7349 -3052 -5646 -5357 -7151 -6574 -6977 -5695 -3766 -4710 -5009 -215 -2123 -6392 -8550 -5590 -4275 -5227
7333 -5227 -5886 -7170 -3419 -925 2484 2945 1917 -980 -4444 -3105 -3975 -6434 -5137 -5507 -7313 -8723
7317 -8723 -7329 -7348 -8546 -7315 -3271 -2421 -6479 -7526 -3083 497 76 -1544 -4640 -2627 -3581 -6984
7301 -6984 -7623 -5179 -2609 537 -397 -1132 422 -423 1239 2505 3234 5651 3276 -15 -2276 -1901
7285 -1901 -1674 -981 886 765 822 2852 2711 685 -1870 -4166 -4590 -1844 -753 -4447 -7708 -6382 -2024
7268 -2024 -1281 -3500 -6531 -4307 -1904 1140 298 -3311 -4800 -4993 -1195 2556 1505 -339 234 -1854
7252 -1854 -1759 -4654 -5744 -1421 2760 3805 3521 3591 1264 -515 -2315 -2730 -2104 -1809 -1883 -1557 -1818 -3655
7234c655l094l241J503J631R70J165k15J551J57L752J900k296q66j28k216l944
7218g026J196K538R70k642J071M175J256k61j22J09j069l7P84q11j2p31o45j204
7200b461K24k043N20L709j248k861k644L14K559j146N80q47k30M212L240l59M5
7183A564k410j073j32o1J890K606j914l245o39J536J00J247o32J563k99j447Q43
7166e03P91j743r67J086L310L31J772L270M46n007M75Q20j03j022K13m118J109
7149A60M130J056J88J247j012n13q89n727j362J508m92j756m63J61l028L06q39
7132g325M214K579k113j089L477r84J369O97J230j910l49J882K12k442j038K44
7116a346j321k45J781M73j409P65J066j441j503n33k390o98r9k990J462L189J31
$$ plain form
7234 -3655 -6749 -9990 -8487 -6856 -5886 -4721 -4936 -3385 -3228 524 2424 128 -738 -866 -3082 -7026
7218 -7026 -5830 -3292 -2322 -4964 -3893 282 1538 1277 1155 1264 195 158 942 131 119 -612 -1257 -2461
7200 -2461 -2237 -4280 -3760 -51 -1299 -4160 -6804 -6490 -3931 -5077 -4497 -5344 -5574 -1362 1878 1519 1564
7183 1564 -846 -1919 -2051 -2112 -222 2384 470 -2775 -3414 -1878 -1778 -531 -1163 400 101 -1346 -503
7166 -503 288 -1455 -2422 -1336 1974 2305 4077 7347 7793 2786 3261 4081 3978 2956 3169 -949 160
7149 160 4290 5346 5534 6781 5769 5256 4367 -1360 -2722 -1214 -1706 -3462 -3925 -3764 -6792 -6486 -7325
7132 -7325 -3111 -532 -2645 -3734 -257 -1241 128 825 2055 145 -204 1678 1890 -552 -1590 -1346
7116 -1346 -2667 -2912 -1131 -658 -2067 -1302 -236 -1677 -3180 -3713 -6103 -6801 -6900 -9890 -8428 -5239 -5108
7099e108k561J095J320K096J816q90J379J651J477j369M81J90j770k15K829o82
7083A739m438j87K185J463K305j524n46p5O44P68N14j776P31k118j190k413O42
7066c276n60l400N19j44J494J636J513R5k827K95K624J269K081K82J53K63p6j333
7048F08J267k8j892j182r24j456k161m25K605L712M04k721l099L81j14K300R08
7031a817j167j803N86J447J81J683N78P58r8L433R54p01j790j10J370K037k088
7014C453m710R19J364l899k962Q92J560J769m246O45J790r56o45K898J822j756
6998b062j988n11J037K173l252O3K767M57L625K393k211p069k495l19J413J766
6982d213J383J112j30n150O16L209o99K002n62k32K277j639k270K9J308K021J271
$$ plain form
7099 -5108 -7669 -6574 -5254 -3158 -1342 -2232 -853 798 2275 906 1387 1577 -193 -408 2421 1739
7083 1739 -2699 -2886 -701 762 3067 1543 997 922 1566 2334 2848 1072 1803 -315 -1505 -3918 -3276
7066 -3276 -3836 -7236 -6717 -6861 -5367 -3731 -2218 -2123 -4950 -4655 -2031 -762 1319 1601 1754 2017 1941 608
7048 608 1875 1847 -45 -1227 -2151 -3607 -5768 -6193 -3588 124 528 -2193 -5292 -4911 -5025 -2725 -1817
7031 -1817 -2984 -4787 -4201 -2754 -2573 -890 -312 446 348 3781 4735 4034 2244 2134 3504 5541 3453
7014 3453 -1257 -338 1026 -2873 -5835 -4943 -3383 -1614 -5860 -5215 -3425 -4381 -5026 -2128 -306 -2062
6998 -2062 -4050 -4561 -3524 -1351 -4603 -4540 -1773 -1316 2309 4702 2491 -4578 -7073 -7392 -5979 -4213
6982 -4213 -2830 -1718 -1848 -6998 -6382 -3173 -3872 -1870 -2432 -2664 -387 -2026 -4296 -4267 -2959 -938 333
6965C33J665k107m48M43j834k367Q85K211J023l801k410j230N78p48J34J036M141
6948b496R28L96p22k648l25O07R78K552K904j847k656q34O15K251L23k39P09l74
6930A22j017l34k362Q45K592K413K722j843j084j835p57k632N57K653L843J976
6914E859l865j517o12j753N17j076J095J367j811J113O39m24j177j702O32K584
6898a31j15j232M97j354O74L375K751K643J623l748l315k432k04K645L895M21
6882E993k939j684j608o20K715J899m053k589K072M010Q19k311J230M4j153L53
6866B178K599m32j94j548l069r44J127q62p66j175k622K499N97L758L254k547
6850A853j69q86q11J65p60J583K677l048j930R04J693J696l983l364K216J712
$$ plain form
6965 333 1998 -109 -557 -114 -1948 -4315 -3430 -1219 -196 -3997 -6407 -7637 -7059 -7807 -7673 -6637 -2496
6948 -2496 -1568 -1172 -1894 -4542 -4867 -4260 -3282 -730 2174 327 -2329 -3163 -2548 -297 26 -213 496 122
6930 122 -895 -1229 -3591 -2746 -154 2259 4981 3138 2054 219 -538 -3170 -2613 40 3883 5859
6914 5859 1994 477 -135 -1888 -1371 -2447 -1352 15 -1796 -683 -44 -468 -1645 -3347 -2715 -131
6898 -131 -246 -1478 -981 -2335 -1661 1714 4465 7108 8731 4983 1668 -764 -968 1677 5572 5993
6882 5993 3054 1370 -238 -858 1857 3756 -297 -2886 -814 3196 4015 1704 2934 2978 1825 2178
6866 2178 4777 4345 4151 2603 -466 -1410 -283 -1145 -1911 -3086 -5708 -3209 -2612 1146 4400 1853
6850 1853 1684 798 -13 152 -608 975 3652 604 -1326 -422 1271 2967 -1016 -4380 -2164 -452
6834d52j561j655j413o97J830L047N292j74j920J43k9J42J926j583l701m584N84
6817d805M583L243N57k357p34l9K669l55k449M04j408k384n4m64j276k029L088
6800c810K740J414J856L010J406j692k865J173o94Q10j098M63J837j101j309j871
6784B69O45o09L88M38r53M62L176K120m5p38l607r57j035j733M554J859k84j637
6766B313m112r61O39o68j616J095k34j178k16l334l01J319M050l38o49q35J964
6749c062M018l98p97k2L81R64N70j641j89K572J706q78k09j021q68j224L639j996
6731A545m853P35J092j87L159J11k973J245J491M34j983k279L389K664j366O26
6715B850j925j882j147j054q71J582j4K627m10o29j934j721L04K201J40j347K795
$$ plain form
6834 -452 -2013 -3668 -5081 -5778 -3948 -901 4391 4217 2297 2440 2411 2553 4479 2896 -805 -5389 -4805
6817 -4805 -222 3021 3578 1221 487 448 3117 2762 313 717 -691 -3075 -3129 -3593 -4869 -6898 -3810
6800 -3810 -1070 344 2200 5210 6616 4924 2059 3232 2538 3348 2250 2713 4550 3449 2140 269
6784 269 914 305 693 1131 178 640 3816 5936 5891 5153 1546 589 -446 -2179 2375 4234 3950 2313
6766 2313 -1799 -2760 -2121 -2789 -4405 -3310 -3544 -4722 -4938 -8272 -8573 -7254 -3204 -3542 -4191 -5026 -3062
6749 -3062 956 558 -239 -261 120 1084 1654 13 -176 2396 4102 3224 3015 1994 1126 -98 3541 1545
6731 1545 -3308 -2573 -1481 -1668 1491 1602 -1371 -126 1365 1799 -184 -2463 926 3590 2224 2850
6715 2850 925 -957 -2104 -3158 -4029 -2447 -2461 166 -244 -873 -2807 -4528 -4224 -2023 -1883 -3230 -435
6698d35l03j603N97L030M051q08k665r21j971n098j957K027J166J781K932R14
6682G37r94n09l26J159k553N8M435J490k230j162k59j629q63K934%m16L298L142
6664F312k132j281k521k299k30k15j84n08J309J669O44m43K26K053J601L88L002
6647G391L451K939L027o09Q39O27l614l868m712k219j77J097o90j026j437O36
6631A655J190J692k940k938k078j34Q35k702L290J072Q53J134k82o41j328j513
6615b835K562J101o7J350R07J722k800k212j26J829L15k11K58j100N85L6l39k704
6597a729J454K216j620m39J228J522j18l208j900P61m027j67K146M69j047L266
6581a193L976R07n121j320L41J110k213j288K662K174J70J621J200L0j526R22
$$ plain form
6698 -435 -738 -2341 -1744 1286 5337 4529 1864 943 -1028 -6126 -8083 -6056 -4890 -3109 -177 737
6682 737 -257 -766 -1092 67 -2486 -2428 2007 3497 1267 105 -154 -1783 -2646 288 288 -128 3170 6312
6664 6312 4180 2899 378 -1921 -2151 -2366 -2550 -3058 -1749 -80 564 121 347 2400 4001 4389 7391
6647 7391 10842 13781 16808 16199 17038 17665 14051 10183 5471 3252 3075 4172 3482 2456 1019 1655
6631 1655 2845 4537 1597 -1341 -3419 -3553 -2718 -5420 -2130 -1058 -205 929 647 6 -1322 -2835
6615 -2835 -273 828 761 2111 3018 4740 1940 -272 -398 1431 1746 1535 1793 693 1278 1314 975 -1729
6597 -1729 -275 1941 321 -118 1110 2632 2514 -694 -2594 -1833 -5860 -6027 -3881 -3412 -4459 -1193
6581 -1193 2783 3690 -1431 -2751 -2410 -1300 -3513 -4801 -2139 35 205 1826 3026 3056 1530 2452
6565B452m79j397k229o52R58J29M348J15k388k748Qj680J203j546n89L71J853
6548b271j117J082K241q26k093M35M22j404o28k11j369j707N264Q66j114J52K557
6531B79k37j129j91j75O63K806J148j888k161k22L43j624j051L104p53k672j132
6514d892j292k263n05N491M996j025m001o090m43R51M812O197n59j90J212l163
6498g64o405J264L461K92j11q31p48J311K693j996r58j287L822L531K145N95l842
6481B172k12j181p34L51L609K160N80k63j79j521k711k737l220l01J193J183Q70
6464i41m12n28l84M84L784J202j332j45m70R61J008j518j629J677m49k47J332
6447B393p07r81j589j121L801K50j931n06K750j055l812L17k422K544j656k778
$$ plain form
6565 2452 1973 576 -1653 -2305 -1347 -1218 3130 3245 857 -1891 -1883 -3563 -2360 -3906 -4495 -4124 -2271
6548 -2271 -3388 -2306 -65 -891 -2984 -2549 -2127 -3531 -4159 -4370 -5739 -7446 -2182 -1316 -2430 -2278 279
6531 279 42 -1087 -1278 -1453 -790 2016 3164 1276 -885 -1107 -764 -2388 -3439 -335 -1088 -3760 -4892
6514 -4892 -6184 -8447 -8952 -3461 1535 510 -3491 -9581 -10024 -9073 -4261 1936 1377 1187 2399 -764
6498 -764 -7169 -5905 -2444 -2152 -2263 -3094 -3842 -2531 162 -1834 -2792 -4079 -257 3274 5419 6014 2172
6481 2172 1960 779 45 396 4005 6165 6745 6482 6303 4782 2071 -666 -3886 -4187 -2994 -1811 -941
6464 -941 -1353 -1881 -2265 -1781 2003 3205 1873 1728 1258 2219 3227 1709 80 1757 1308 1061 2393
6447 2393 1686 705 -884 -2005 1796 2046 115 -391 2359 1304 -2508 -2191 -4613 -2069 -3725 -6503
6431f503k216K133p06M10L094K169M076K328k90j317k693J187j312j310l074j9
6415d043K249K98l031L156O3n97L329K952L2j922j316l608j110N58R74p7K273
6398A80J73k938m820L72M958K678L026j699j736J098J457p55k092j266J994j744
6382a114k484Q43J863m59j942Q50k352J007K531l105j56L159m7O88j15L41K955
6365B463m6l550k022j431K462K015j273m044j069K855J850K596J943j577q12m26
6349f6p89M6J357J327J730p95r28k736l66P36O51O9k545O42O64r51j555j022N11
6330d020L203j200j078J317L746j221k100k60J454j021k169O32L239m32l537j137
6314d584M79K390K997N66j888K76J284l184K292L286l895j661k606k721O64K683
$$ plain form
6431 -6503 -8719 -6586 -7292 -6882 -3788 -1619 2457 4785 4495 3178 485 1672 360 -950 -4024 -4043
6415 -4043 -1794 -1496 -4527 -1371 -1308 -1905 1424 4376 4408 2486 1170 -2438 -3548 -2990 -2016 -2093 180
6398 180 353 -2585 -7405 -7033 -2075 603 3629 1930 194 1292 2749 1994 -98 -1364 630 -1114
6382 -1114 -3598 -2755 -892 -1351 -3293 -2443 -4795 -3788 -1257 -4362 -4518 -1359 -1406 -718 -833 -492 2463
6365 2463 2417 -1133 -3155 -4586 -2124 -109 -1382 -5426 -6495 -3640 -1790 806 2749 1172 360 -66
6349 -66 -855 -809 548 1875 3605 2810 1882 -854 -1220 -484 167 236 -2309 -1667 -1003 -1954 -3509 -4531 -4020
6330 -4020 -817 -2017 -3095 -1778 1968 747 -1353 -1613 -159 -1180 -3349 -2717 522 90 -3447 -4584
6314 -4584 -4105 -1715 1282 1848 -40 236 1520 -1664 628 3914 19 -1642 -4248 -6969 -6305 -3622
6298c622j241J932J025O91K817o74L03K907J201p29l335k287R90j58R39J541J858
6281D158q31l313k904m55O24j159j897N14k549j718P06L723O25Q55K553j44j891
6264c103q16J994L48K780N97j422l945k994J884L496J977k355m563O32K802L015
6248C27L377M60K766J111k808k771l597l781J031J084L203k609j171j172R2r14
6232e372J381m86J140M029J643k814R16j017j642k976J520L098J91R97p71j129
6216a292j791n56j333j972k569K016J319J982K168J078l77J308k493j995K913
6201a594J373j670l756j295K258K617M87n11k226k415m12N7J288J155K865J639
6185a40l068J7k927J549o91n48K619L771L471J148K46m878m932K517K766L221
$$ plain form
6298 -3622 -4863 -2931 -1906 -1215 1602 928 1231 4138 5339 4610 1275 -1012 -22 -180 759 2300 4158
6281 4158 3327 14 -2890 -3345 -2721 -3880 -5777 -5263 -7812 -9530 -8824 -5101 -4476 -3621 -1068 -1212 -3103
6264 -3103 -3919 -1925 -1577 1203 1800 378 -3567 -6561 -4677 -1181 796 -1559 -6122 -5490 -2688 327
6248 327 3704 4164 6930 8041 5233 2462 -1135 -4916 -3885 -2801 402 -2207 -3378 -4550 -4458 -5372
6232 -5372 -3991 -4477 -3337 692 2335 -479 437 -580 -2222 -5198 -3678 -580 -389 608 -163 -1292
6216 -1292 -3083 -3639 -4972 -6944 -9513 -7497 -6178 -4196 -2028 -950 -1327 -19 -2512 -4507 -1594
6201 -1594 -221 -1891 -5647 -6942 -4684 -2067 -1580 -2091 -4317 -6732 -7144 -7087 -5799 -4644 -1779 -140
6185 -140 -3208 -3191 -6118 -4569 -5260 -5808 -3189 582 4053 5201 5447 569 -4363 -1846 920 4141
6169D141n89o37L36j984j392L15N638O84p309o672l394K367N142m138O98K355
6153d439L530R17j964j709J484k12j033J399R34J681r81o91j914k373k543l20
6137h234L194J297J482p14j444K673m09j38K197J258l483n66J789O05J649O23
6121A779o73q25q39j115J530L574m08k26k669k457L17J333m84j022j554N16L515
6104B92L037j817Q09j506R88o3o76j660J18o19K86J753J529J292o42R16k409k174
6086e46j65j380L23j48K82j05K766q07j369j667J674L623k789L61l47J191L132
6069D029p96j387l886n288R22J208L657O14j332k359L279j274k04j69k683k44
6053e913K706j861j517J724K158o17k5M57rJ311K121j048j877P23L99J220n85
$$ plain form
6169 4141 3552 2915 3251 1267 -125 190 5828 6512 -797 -7469 -10863 -8496 -3354 -7492 -6794 -4439
6153 -4439 -909 8 -1956 -3665 -2181 -2393 -3426 -2027 -1093 588 -393 -1084 -2998 -5371 -7914 -8234
6137 -8234 -5040 -3743 -2261 -2975 -4419 -1746 -2155 -2293 -96 1162 -2321 -2887 -1098 -493 1156 1779
6121 1779 1106 281 -558 -1673 -143 3431 3023 2797 128 -2329 -2012 -679 -1163 -2185 -3739 -3223 292
6104 292 3329 1512 2321 815 1803 1740 1064 -596 -478 -1097 -811 942 2471 3763 3121 4037 1628 -546
6086 -546 -711 -2091 -1768 -1916 -1634 -1739 1027 220 -1149 -2816 -1142 2481 -308 53 -294 897 4029
6069 4029 3233 1846 -2040 -7328 -6406 -5198 -1541 -927 -2259 -4618 -1339 -2613 -2817 -2986 -5669 -5913
6053 -5913 -3207 -5068 -6585 -4861 -2703 -3320 -3345 -2888 -2897 -1586 535 -513 -2390 -1667 -1268 -48 -633
6036f33k228j028j388M52M034M23L00J302L253o41j557j50j785k49j882n16L378
6019A085j711M07j521K140J299p77p67J287J825j45N3q18q78l85J565o06j146
6002I07j940K846j804k422J474L255k278j373J606N64j508q34L256k221k002R06
5986a568K736j285qJ869j484l78J342Q10l023m201p61M281L377j33j913j949L029
5969G41K976J180j963R55j366j772J460j621j596J908k035M69n38O22q99O56J254
5952D31j307q19p21N84N0K078q33L35K685j516j436p95k018j484P86R18j439J601
5934b900M7j622K292L053N75j424q38K70L40J796K093O0p20k079J038J5k264K16
5916e2M663K086m295j882k029J456K998l72k367J482K081k316l92L164R58J680
$$ plain form
6036 -633 -2861 -3889 -5277 -4825 -791 -368 -68 1234 4487 3846 2289 2139 354 105 -1777 -2293 1085
6019 1085 -626 -219 -1740 400 1699 922 155 1442 3267 3122 3175 2357 1479 1094 2659 2053 907
6002 907 -1033 1813 9 -2413 -939 2316 38 -1335 271 835 -673 -1507 1749 -472 -2474 -1568
5986 -1568 1168 -117 -125 1744 260 -118 1224 2034 -989 -5190 -5951 -1670 1707 1574 -339 -2288 741
5969 741 3717 4897 2934 3889 2523 751 2211 590 -1006 902 -1133 -664 -1202 -580 -1479 -823 431
5952 431 -876 -1695 -2416 -1832 -1782 296 -537 -202 2483 967 -469 -1264 -3282 -4766 -3980 -3062 -4501 -2900
5934 -2900 -2853 -4475 -2183 870 1445 21 -817 -547 -207 1589 3682 3742 3022 943 1981 1996 -268 -52
5916 -52 4611 6697 2402 520 -1509 -53 2945 2573 206 1688 3769 1453 1061 4225 5183 6863
5900F863q29l3l361l917k470J546J210Q44N9N77Q71n34o05k298j458P12K885j279
5882a217L976k262k385K086j09L62J209K135l149j777K988J74r41P92R07k509
5866B80j055Q93j22j665o66QJ413m908o41J131J701J483N37l150J750R06K185
5849H0n28L48K724J398J066J02j256q90k120l239m06o20k302j385m92L087L193
5832a240J971l219j783J402J840r69j359L813O81j702m980l097L589J939j431
5817d545J200n53P40R47P59J328J181K037j074M2J017J18K715o61j341q51j190
5800A869N06L667k425k835j508l55j827J914M747K032j749j188j517K613J696
5785E640m704l393J637P52L135O41r9L07j282j016j189j037J194M94l061j334
$$ plain form
5900 6863 6034 6001 2640 -1277 -3747 -2201 -991 -147 -88 489 1360 826 221 -2077 -3535 -2823 62 -1217
5882 -1217 2759 497 -1888 198 89 451 1660 3795 646 -1131 1857 2031 1090 1882 2789 280
5866 280 -775 118 -4 -1669 -2335 -2327 -914 -5822 -6463 -5332 -3631 -2148 -1611 -4761 -3011 -2105 80
5849 80 -448 -100 2624 4022 5088 5190 3934 3044 924 -2315 -2721 -3341 -5643 -7028 -7520 -4433 -1240
5832 -1240 731 -2488 -4271 -2869 -1029 -1998 -3357 456 1137 -565 -5545 -8642 -5053 -3114 -4545
5817 -4545 -3345 -3898 -3158 -2211 -1452 -124 1057 3094 2020 2062 3079 3197 5912 5251 3910 3059 1869
5800 1869 2375 6042 3617 782 -726 -1081 -2908 -994 3753 5785 4036 2848 1331 3944 5640
5785 5640 936 -2457 -820 -68 3067 3708 3609 3916 2634 1618 429 -608 586 1080 -1981 -3315
5769c315o14K013J683m08o55k38J165k57k539j16M039K088l582K601K097r02k43
5752B817K88J985O82k506NJ09l679O97K730k265j885N64L269J060j079j770l959
5735b937J379L478j075o98N124M42l904k380N90k318P79R87L0Q4R14J029k519
5718i95K26J099l503m069j199K226R77j609N559K765l79O25l249j933J237K360
5702A38J364r25k297K299N7o95L35O09M116m00p035m343l76K318L903K902k554
5685e84j130k219k018L60L459P99R86J477J256l05Q26k92J603k011m826L4J982
5668f03L381L789j439k411r14Q7K672q29q87q188n946K769K943P54K247J392J247
5651F4N20K879J708j789l245k453j561L359R03k289J390L500l209l881l70J704
$$ plain form
5769 -3315 -3929 -1916 -233 -641 -1296 -1534 -369 -626 -3165 -3281 758 2846 -736 1865 3962 3060 2817
5752 2817 3105 5090 5772 3266 3271 3380 -299 398 3128 863 -1022 -458 2811 3871 2792 1022 -2937
5735 -2937 -1558 1920 845 147 5271 5713 1809 -571 19 -2299 -1520 -533 -503 -419 495 1524 -995
5718 -995 -769 330 -3173 -7242 -8441 -6215 -5238 -6847 -1288 1477 1098 1723 -1526 -3459 -2222 138
5702 138 1502 577 -1720 579 636 -59 276 885 5001 4601 -2434 -6777 -7153 -4835 -932 1970 -584
5685 -584 -1714 -3933 -5951 -5591 -2132 -1333 -347 1130 2386 2081 2907 2615 4218 2207 -2619 -2585 -603
5668 -603 2778 6567 5128 2717 1803 1890 4562 3733 2846 -5342 -11288 -8519 -5576 -4822 -2575 -1183 64
5651 64 584 3463 5171 3382 137 -2316 -3877 -518 385 -1904 -514 2986 -223 -4104 -4474 -2770
5635b770J862J175K80P5k105k37N52R65j98K683j011l476n634K658J500L46l23
5618c658M278q08l95j275j888L40N824J282j368q74m582O55M479Q51k306L25l187
5601b307k16L55J402L970J459R90j553l200j463R40L600Q62K119K604j608l426
5585D528l931l096R42Q56J601j857p76l028q56j188R08j441O11K230K140q30k725
5568e912j555P45K853K070M826K333r29k425k122j317p10n39Q82j021m42K684
5552e79J416K160j73k330k217k144j998j075k2J160j111Q55J816L338j506j838
5536d248J021J259J812N94q28J71R97K616K003j039m380k818l70j557M610M556
5520D399K201j055j544R84k407l355j725L638P8m088j158L8M844K124J701J071
$$ plain form
5635 -2770 -908 267 547 622 -1483 -1720 -1168 -203 -401 2282 1271 -2205 -7839 -5181 -3681 -3335 -3658
5618 -3658 620 -188 -583 -1858 -3746 -3406 2418 3700 2332 1458 -3124 -2469 2010 2861 555 880 -2307
5601 -2307 -2523 -2168 -766 3204 4663 5653 4100 900 -563 377 3977 4839 6958 9562 7954 4528
5585 4528 597 -2499 -1557 -701 900 -957 -1733 -4761 -5617 -6805 -5897 -7338 -6727 -4497 -2357 -3187 -5912
5568 -5912 -7467 -6722 -3869 -1799 3027 5360 4431 2006 -116 -1433 -2143 -2682 -1800 -2821 -3263 -579
5552 -579 837 2997 2824 494 -1723 -3867 -5865 -6940 -6962 -5802 -6913 -6058 -4242 -904 -2410 -4248
5536 -4248 -3227 -1968 -156 438 -390 -219 778 3394 5397 4358 -22 -2840 -3210 -4767 -157 4399
5520 4399 6600 5545 4001 4985 2578 -777 -2502 1136 1214 -2874 -4032 -3994 850 2974 4675 5746
5504E746j038k525p29o9J359J85o99m717j453K052J715R83l77j973L85j382j130
5487c667k246k065M199J772O97j052J329J856J172K681k083n803P37j098J161
5472b410K615L682k370l001j844J437J57k771M25J284R23m78j243j547M07J160
5456c574Q54L28L101k69M839j771m156j117R33J01l0m728r03n20m87O16O3K599
5438d121K428J91M229J129q97o20j973j444K556l039L68N94k29J329o56p25K478
5421A598J143j51l341m132n67J995L191K818K448n85m243l001J366K766J719j489
5405A535k583l067L43J157k181J271K949K331J146j894j731k406j915j210l13
5390f568M103J033p10m42K470l44l382m81j099O32J187j273J168J99j014J102
$$ plain form
5504 5746 4708 2183 1454 1385 2744 2929 2230 -2487 -3940 -1888 -173 810 433 -1540 -1155 -2537 -3667
5487 -3667 -5913 -7978 -3779 -2007 -1310 -2362 -1033 823 1995 4676 2593 -3210 -2473 -3571 -2410
5472 -2410 205 3887 1517 -1484 -3328 -1891 -1734 -4505 -4080 -2796 -1873 -2351 -3594 -5141 -4734 -3574
5456 -3574 -2720 -2392 709 440 5279 3508 -648 -1765 -832 -731 -761 -5489 -6392 -6912 -7399 -6783 -6720 -4121
5438 -4121 -1693 -1502 2727 3856 2959 2339 366 -1078 1478 -1561 -1193 -599 -828 501 -155 -880 1598
5421 1598 2741 2590 -751 -4883 -5450 -3455 -264 2554 5002 4417 174 -2827 -1461 1305 3024 1535
5405 1535 -1048 -4115 -3772 -2615 -4796 -3525 -576 1755 2901 1007 -724 -3130 -5045 -6255 -6568
5390 -6568 -2465 -1432 -2142 -2584 -114 -458 -3840 -4321 -5420 -4788 -3601 -4874 -3706 -3507 -4521 -3419
5374c419J829l31m02J624Q55j634K417J569Q42n38j336k907j202k40J661N192
5358C980J310k411k155j376L038K65j900K772J968k398q81p37k135M20K148j936
5342b8N92j315n592o20K725K277L156J842p78Q8p51k896n70J243k237k624J530
5325c958N178j93j298K79R88j082j921o26j30J494K203k402K270J321o796N9L465
5308a149K023j304j256J638K684k332j858r94J335J276O7j008N63k221J850J570
5292H84n96P2j115j083l222k415K018J888N948R1n68j594q22j3k335j384j415
5275e661J342q44k337Q92L337Q95K73O13P9n07j712k984M07K097o59j014l09O95
5257e397J920K734l087K241P26j222M15J796r7r77j267j92l778q79M032K385P25
$$ plain form
5374 -3419 -1590 -1921 -2323 -699 156 -1478 939 2508 3350 2812 1476 -1431 -2633 -2873 -1212 3980
5358 3980 5290 2879 724 -652 2386 2651 751 3523 5491 3093 2212 1475 -660 -240 1908 -28
5342 -28 564 -751 -6343 -6963 -4238 -1961 1195 3037 2259 2347 1596 -1300 -1870 -627 -2864 -5488 -3958
5325 -3958 1220 1027 -271 8 996 -86 -2007 -2633 -2763 -1269 934 -1468 802 2123 -4673 -4614 -1149
5308 -1149 874 -430 -1686 -48 2636 304 -1554 -2548 -1213 63 130 -878 -315 -2536 -686 884
5292 884 288 360 -755 -1838 -5060 -7475 -5457 -3569 2379 2470 1902 308 -514 -527 -2862 -4246 -5661
5275 -5661 -4319 -5163 -7500 -6608 -3271 -2376 -2103 -1490 -1411 -1918 -3630 -6614 -6207 -4110 -4769 -5783 -6092 -5397
5257 -5397 -3477 -743 -3830 -1589 -863 -2085 -1670 126 29 -948 -2215 -2407 -6185 -7064 -3032 -647 78
5240G8l9Q65k4N64j091j691j362j394p95J060K563l692M03K67J509Q9Q75r06q24
5221c545N35K175j332r53J104l25j38q10J382k3J472J495J373L904J703m286k725
5204A006k722l791r66N30j020l69j113J22j277L591L62j202L932L975J599Ll878
$$ plain form
5240 78 39 904 880 1444 353 -1338 -2700 -4094 -4889 -3829 -1266 -4958 -4555 -4288 -2779 -2690 -1815 -2721 -3545
5221 -3545 -3010 -835 -2167 -3120 -2016 -2341 -2479 -3289 -1907 -1930 -458 1037 2410 6314 8017 3731 1006
5204 1006 -1716 -5507 -6473 -5943 -6963 -7332 -8445 -8323 -9600 -6009 -5647 -6849 -2917 1058 2657 2660 -1218
$$ [...]
##END NTUPLES=NMR SPECTRUM
##END=
