##TITLE=Analysis number 312689
Compound Code tl 01023
Project Code adrs
Chemist Name synnovation
##JCAMPDX= 6.0         $$ Bruker NMR JCAMP-DX V2.0
##DATA TYPE= NMR SPECTRUM
##DATA CLASS= NTUPLES
##ORIGIN= Bruker BioSpin GmbH
##OWNER= NMR
$$ XWIN-NMR		Version 3.5
$$ Thu Aug 11 09:40:22 2005 GMT Daylight Time (UT+1h)  MAYBRIDGE\NMR@NMR_250MHZ
##.OBSERVE FREQUENCY= 250.131544655141
##.OBSERVE NUCLEUS= ^1H
##.ACQUISITION MODE= SIMULTANEOUS (DQD)
##.ACQUISITION SCHEME= undefined
##.AVERAGES= 16
##.DIGITISER RES= 18
##SPECTROMETER/DATA SYSTEM= dpx250
##.PULSE SEQUENCE= zg30
##.SOLVENT NAME= DMSO
##.SHIFT REFERENCE= (INTERNAL, DMSO, 0, 16.522)
##AUDIT TRAIL= $$ (NUMBER, WHEN, WHO, WHERE, WHAT)
$$ ##TITLE= Audit trail, XWIN-NMR		Version 3.5
$$ ##JCAMPDX= 5.01
$$ ##ORIGIN= Bruker BioSpin GmbH
$$ ##OWNER= NMR
$$ C:\u/data/dgb/nmr/ADRS/7580/pdata/1/auditp.txt
$$ ##AUDIT TRAIL=  $$ (NUMBER, WHEN, WHO, WHERE, WHAT)
(   1,<2005-08-11 09:39:45.75 +100>,<MAYBRIDGE\NMR>,<NMR_250MHZ>,
      <created by zg, POWCHK disabled, PULCHK disabled
       configuration hash MD5:
       62 19 C7 07 E1 42 D1 B7 37 6C 3D D0 77 39 F9 E6
       data hash MD5: 64K
       CB 38 ED B0 FE CA 30 CE F0 C7 A3 82 F4 81 3A A5>)
(   2,<2005-08-11 09:40:02.68 +100>,<MAYBRIDGE\NMR>,<NMR_250MHZ>,
      <Start of raw data processing
       ef LB = 0.3 FT_mod = 6 PKNL = 1 SI = 32K 
       data hash MD5: 32K
       B9 4F 98 0D 8B 86 F2 8F 02 F7 54 F2 4E E5 7A 31>)
(   3,<2005-08-11 09:40:06.42 +100>,<MAYBRIDGE\NMR>,<NMR_250MHZ>,
      <apk 
       data hash MD5: 32K
       E3 C2 F4 EE 3F 78 4E 5C 1D C2 D3 60 96 23 60 F6>)
(   4,<2005-08-11 09:40:08.00 +100>,<MAYBRIDGE\NMR>,<NMR_250MHZ>,
      <abs ABSG = 5 
       data hash MD5: 32K
       75 D8 51 9F 5A 47 8D 00 B9 BF 0F EC 50 7A 5C 73>)
$$ ##END=
$$ 
$$ hash MD5
$$ 81 D0 68 0E 29 20 28 25 AE 1A 37 FB 59 2A D0 A1
##$RELAX= 
##$RELAX= 
##$RELAX= 
##$RELAX= 
##$RELAX= 
##$RELAX= 
##$RELAX= 
$$ Bruker specific parameters
$$ --------------------------
##$DU= <C:\u>
##$EXPNO= 7580
##$NAME= <ADRS>
##$PROCNO= 1
##$TYPE= <nmr>
##$USER= <dgb>
##$AMP= (0..31)
100 100 100 100 100 100 100 100 100 100 100 100 100 100 100 100 100 100 
100 100 100 100 100 100 100 100 100 100 100 100 100 100 
##$AQSEQ= 0
##$AQ_mod= 3
##$AUNM= <au_zg>
##$AUTOPOS= <7 >
##$BF1= 250.13
##$BF2= 250.13
##$BF3= 250.13
##$BF4= 250.13
##$BF5= 500.13
##$BF6= 500.13
##$BF7= 500.13
##$BF8= 500.13
##$BYTORDA= 1
##$CFDGTYP= 0
##$CFRGTYP= 5
##$CHEMSTR= <none>
##$CNST= (0..31)
1 1 145 1 1 1 1 1 1 1 1 1 1 1 1 1 1 1 1 1 1 1 1 1 1 1 1 1 1 1 1 1 
##$CPDPRG= <>
##$CPDPRG1= <>
##$CPDPRG2= <>
##$CPDPRG3= <>
##$CPDPRG4= <mlev>
##$CPDPRG5= <mlev>
##$CPDPRG6= <mlev>
##$CPDPRG7= <mlev>
##$CPDPRG8= <mlev>
##$CPDPRGB= <>
##$CPDPRGT= <>
##$D= (0..31)
0 1 0 0 0 0 0 0 0 0.06 0 0 0 0 0 0 0.0002 0 0 0 0 0 0 0 0 0 0 0 0 0 0 
0 
##$DATE= 1123749584
##$DBL= (0..7)
120 120 120 120 120 120 120 120 
##$DBP= (0..7)
150 150 150 150 150 150 150 150 
##$DBP07= 0
##$DBPNAM0= <>
##$DBPNAM1= <>
##$DBPNAM2= <>
$$ [...]
##$SUBNAM7= <"">
##$SUBNAM8= <"">
##$SUBNAM9= <"">
##$SW= 20.6930455092707
##$SWIBOX= (0..15)
0 0 3 0 0 0 0 0 0 0 0 0 0 0 0 0 
##$SW_h= 5175.983436853
##$TD= 65536
##$TD0= 1
##$TE= 295.16
##$TE2= 300
##$TE3= 300
##$TEG= 300
##$TL= (0..7)
0 120 120 120 120 120 120 120 
##$TP= (0..7)
150 150 150 150 150 150 150 150 
##$TP07= 0
##$TPNAME0= <>
##$TPNAME1= <>
##$TPNAME2= <>
##$TPNAME3= <>
##$TPNAME4= <>
##$TPNAME5= <>
##$TPNAME6= <>
##$TPNAME7= <>
##$TPOAL= (0..7)
0.5 0.5 0.5 0.5 0.5 0.5 0.5 0.5 
##$TPOFFS= (0..7)
0 0 0 0 0 0 0 0 
##$TUNHIN= 0
##$TUNHOUT= 0
##$TUNXOUT= 0
##$USERA1= <user>
##$USERA2= <user>
##$USERA3= <user>
##$USERA4= <user>
##$USERA5= <user>
##$V9= 5
##$VALIST= <valist>
##$VCLIST= <CCCCCCCCCCCCCCC>
##$VD= 0
##$VDLIST= <DDDDDDDDDDDDDDD>
##$VPLIST= <PPPPPPPPPPPPPPP>
##$VTLIST= <TTTTTTTTTTTTTTT>
##$WBST= 1024
##$WBSW= 4
##$XGAIN= (0..3)
0 0 0 0 
##$XL= 0
##$YL= 0
##$YMAX_a= 425896
##$YMIN_a= -549240
##$ZGOPTNS= <>
##$ZL1= 120
##$ZL2= 120
##$ZL3= 120
##$ZL4= 120
##$ABSF1= 16.522
##$ABSF2= -4.171173
##$ABSG= 5
##$ABSL= 3
##$ALPHA= 0
##$AQORDER= 0
##$ASSFAC= 0
##$ASSFACI= 0
##$ASSFACX= 0
##$ASSWID= 0
##$AUNMP= <proc_1d>
##$AZFE= 0.1
##$AZFW= 0.1
##$BCFW= 0
##$BC_mod= 0
##$BYTORDP= 0
##$COROFFS= 0
##$CY= 12.5
##$DATMOD= 1
##$DC= 0
##$DFILT= <>
##$DTYPP= 0
##$F1P= 14.0000005364418
##$F2P= -0.99999901652339
##$FCOR= 0.5
##$FTSIZE= 32768
##$FT_mod= 6
##$GAMMA= 0
##$GB= 0
##$INTBC= 1
##$INTSCL= 1
##$ISEN= 128
##$LB= 0.3
##$LEV0= 0
##$LPBIN= 0
##$MAXI= 10000
##$MC2= 0
##$MEAN= 0
##$ME_mod= 0
##$MI= 0
##$NCOEF= 0
##$NC_proc= -3
##$NLEV= 6
##$NOISF1= 0
##$NOISF2= 0
##$NSP= 0
##$NTH_PI= 0
##$NZP= 0
##$OFFSET= 16.522
##$PC= 1
##$PHC0= -83.86415
##$PHC1= -6.249338
##$PH_mod= 1
##$PKNL= yes
##$PPARMOD= 0
##$PSCAL= 4
##$PSIGN= 0
##$REVERSE= no
##$SF= 250.13
##$SI= 32768
##$SIGF1= 0
##$SIGF2= 0
##$SINO= 400
##$SIOLD= 32768
##$SREGLST= <1H.DMSO>
##$SSB= 0
##$STSI= 32768
##$STSR= 0
##$SW_p= 5175.98343685301
##$SYMM= 0
##$S_DEV= 0
##$TDeff= 65536
##$TDoff= 0
##$TI= <Analysis number 999999
Compound Code 99
Book Reference 9
Project Code 9>
##$TILT= no
##$TM1= 0
##$TM2= 0
##$TOPLEV= 0
##$USERP1= <user>
##$USERP2= <user>
##$USERP3= <user>
##$USERP4= <user>
##$USERP5= <user>
##$WDW= 1
##$XDIM= 32768
##$YMAX_p= 388984416
##$YMIN_p= -122067
$$ End of Bruker specific parameters
$$ ---------------------------------
##NTUPLES= NMR SPECTRUM
##VAR_NAME=  FREQUENCY,     SPECTRUM/REAL,   SPECTRUM/IMAG
##SYMBOL=    X,             R,               I
##VAR_TYPE=  INDEPENDENT,   DEPENDENT,       DEPENDENT
##VAR_FORM=  AFFN,          ASDF,            ASDF
##VAR_DIM=   32768,         32768,           32768
##UNITS=     HZ,            ARBITRARY UNITS, ARBITRARY UNITS
##FACTOR=    0.157963299565203, 1,           1
##FIRST=     4132.6476996994, 0,             0
##LAST=      -1043.33573715361, 0,           0
##MIN=       -1043.33573715361, -122067,     0
##MAX=       4132.6476996994, 388984416,     0
$$ Real data points
##PAGE= N=1
##DATA TABLE= (X++(R..R)), XYDATA
$$ [...]
16508a037M690k2199j9527J4039K1823m348j0020J0646r639n19Q534j7937l30
$$ -1037 3653 -18546 -38073 -24034 -2211 -6559 -16579 -5933 -15572 -16091 -7557 -25494 -25824
16495b5824J1883l957J1571P385k0768j6523J3647J8194k3190j1803J5107p762
$$ -25824 -13941 -17898 -6327 1058 -19710 -36233 -22586 -4392 -27582 -39385 -24278 -32040
16483c2040N034o407m574L985j8307K3866L9466q656k663j0242p177j2564J6049
$$ -32040 -27006 -33413 -37987 -34002 -52309 -28443 11023 2367 -296 -10538 -17715 -30279 -14230
16470a4230J675J7515j124q990R811J9039J9081J743j7222k8178N605J6174J0893
$$ -14230 -12555 4960 3836 -5154 4657 23696 42777 44520 27298 -880 4725 20899 31792
16457C1792k1596j0623j0723j7365j1859K0829K4628j7424o776k1227k819n188
$$ 31792 10196 -427 -11150 -28515 -40374 -19545 5083 -12341 -19117 -40344 -43163 -48351
16445d8351M099r031K837J2631n639J996j4895j2760M09K0272Q548K4449K851
$$ -48351 -44252 -53283 -50446 -37815 -43454 -41458 -56353 -69113 -68704 -48432 -39884 -15435 -12584
16432a2584J2276K1773J4150m2895p707k092K985J963N045J0751j9325Q628O181
$$ -12584 -308 21465 35615 -7280 -14987 -17079 -14094 -12131 -7086 3665 -15660 -7032 -851
16419h51J3096j4811k356J6269j8021o712p291n812J8668j277L5926Q975O698
$$ -851 12245 -2566 -4922 11347 -6674 -13386 -20677 -26489 -7821 -9098 26828 35803 42501
16406D2501L0836k9339j6941o793j1048o08m580j8656L551J3410O951l473j8059
$$ 42501 73337 43998 27057 20264 9216 8608 4028 -14628 -11077 2333 9284 5811 -12248
16393a2248k6099j7512m4n411O711j1209Q632J9777K4558Q914O654Q88J9746j0972
$$ -12248 -38347 -55859 -55903 -61314 -54603 -65812 -57180 -37403 -12845 -3931 2723 3611 23357 12385
16379A2385j2095q693L827L5153j2386j9624L0381o536j3522p973k3126k811J9287
$$ 12385 290 -8403 -4576 30577 18191 -1433 28948 22412 8890 917 -22209 -25020 -5733
16366e733J7729K0151P876R9j6408n2488l1088k0266K4504L6546J2413O840J8939
$$ -5733 11996 32147 40023 40122 23714 -28774 -59862 -80128 -55624 -19078 -6665 175 19114
16353A9114l5341J668M6487o711m7831r894r112o567K5380j3212J3675N859J4589
$$ 19114 -16227 -14559 31928 25217 -22614 -32508 -41620 -48187 -22807 -36019 -22344 -16485 -1896
16340a896J5862J4619k8222k919L0598o46k944p000M272P353k5943p144M260J2770
$$ -1896 13966 28585 363 -2556 28042 27396 24452 17452 21724 29077 3134 -4010 250 13020
16326A3020J4447j1171k062K3524J7621n920k9696k064J0684l9731m564j6057
$$ 13020 27467 16296 14234 37758 55379 49459 19763 17699 28383 -11348 -15912 -31969
16314c1969k1566L5786O041l23k157l235N224P317p183k3707J8129N1801N129
$$ -31969 -53535 -17749 -11708 -12031 -14188 -17423 -12199 -4882 -12065 -35772 -17643 34158 39287
16301C9287J3684K0005O704l192n5624l6941n175K6505K1397M857j9040p862j6922
$$ 39287 52971 72976 79680 76488 20864 -16077 -21252 5253 26650 31507 12467 4605 -12317
16288a2317j0975K3059m612j2094M916p945j2047l757N5o262r599R457J8722J5027
$$ -12317 -23292 -233 -4845 -16939 -12023 -19968 -32015 -35772 -35717 -41979 -51578 -42121 -23399 -8372
16274h372q552K819N111K696j0018N029o019K3822n363m2400r719J2047O200K6410
$$ -8372 -16924 -14105 -8994 -6298 -16316 -11287 -17306 6516 1153 -41247 -50966 -38919 -32719 -6309
16260f309q414j7278j6878N870J634l179P674j0550Q169J6321j150j9681K0107
$$ -6309 -14723 -32001 -48879 -43009 -41375 -44554 -36880 -47430 -39261 -22940 -24090 -43771 -23664
16247b3664L6706p713L09n13j581J4240k668k754j9734K0319l951N5K0799P967
$$ -23664 13042 5329 5638 5125 3544 17784 15116 12362 -7372 12947 8996 9051 29850 37817
16233C7817m546m0464j1227L029R458K3431J7712Q387j3900k2919j4917j360n887
$$ 37817 33271 -7193 -18420 -15391 -5933 17498 35210 43597 29697 6778 -8139 -9499 -15386
16220a5386J0440J6054M683j7128L1262K8468l8786j3826J3025J5150L555n753
$$ -15386 -4946 11108 15791 -1337 29925 58393 19607 5781 18806 33956 37511 31758
16208C1758m147m074r027q706Q159l801l1617j2341K0461M708R082P195p24j0462
$$ 31758 27611 23537 14510 5804 13963 10162 -21455 -33796 -13335 -8627 455 7650 6926 -3536
16194c536O95j653J2619J1867k0522K4962K7023Q86k729j6053J1613M179k8357
$$ -3536 -2841 -4494 8125 19992 -530 24432 51455 52341 49612 33559 45172 49351 20994
16181B0994k7682Q189J1747N899j498K684L1224j5022n388j2268k1784k757j3083
$$ 20994 -6688 1501 13248 19147 17649 20333 51557 36535 31147 18879 -2905 -5662 -18745
16168a8745j1738K7849K2028L1709r011n3723j3711k768q273O346k520N634j815
$$ -18745 -30483 -2634 19394 51103 42092 -11631 -25342 -28110 -36383 -30037 -32557 -26923 -28738
16155b8738J9432j7801k1478p458M9037P401j0719j0844j3942O784P581J6538
$$ -28738 -9306 -27107 -48585 -56043 -7006 395 -10324 -21168 -35110 -28326 -20745 -4207
16143d207J5132r673k0323l38J6795j0915l1393k1195N515O8121j6403n4124J866
$$ -4207 10925 1252 -19071 -19409 -2614 -13529 -44922 -66117 -60602 7519 -8884 -63008 -61142
16130f1142L7843J2925j0423N723P057J032j0822m514k3399K299P422j8034m316
$$ -61142 -23299 -10374 -20797 -15074 -8017 -6985 -17807 -22321 -45720 -43421 -35999 -54033 -58349
16117e8349L8178N328O19J04p836M462q474j0960L1542L765J3393l915o29k2997
$$ -58349 -20171 -14843 -14224 -14120 -21956 -17494 -25968 -36928 -5386 -1621 11772 7857 7228 -15769
16103a5769m124P247l385n799O480K0956J018K926n623K591j2507m0717J778J357
$$ -15769 -19893 -12646 -16031 -21830 -15350 5606 6624 9550 3927 6518 -5989 -46706 -44928 -43571
16089d3571M6237k768j4257l3070K9001M4574K0496j7919m711j8514j3099j2549
$$ -43571 2666 -102 -14359 -47429 -18428 26146 46642 28723 24012 5498 -7601 -20150
16077b0150M244k887l2018j8897K4220K4216J4025l296J5952j8415J1291O158
$$ -20150 -15906 -18793 -50811 -69708 -45488 -21272 -7247 -10543 5409 -13006 -1715 4443
16065D443j3552k249j0427j7023J064P857K0862P55k5051j3832K387K1311M548
$$ 4443 -9109 -11358 -21785 -38808 -37744 -29887 -9025 -8270 -33321 -47153 -44766 -23455 -18907
16052a8907j7967j2041Q092K1367M251n250J7230n545k7527j1973K1453J8841
$$ -18907 -36874 -48915 -40823 -19456 -15205 -20455 -3225 -8770 -36297 -48270 -26817 -7976
16040g976J6453O932R997L043j0822J4480j006j498j8480q951o316n686k3608
$$ -7976 8477 15409 25406 28449 17627 32107 31101 29603 11123 2172 -4144 -9830 -33438
16027c3438o481J3943K7048R304k6238J1042o79r405J0034N43M702l065k2692
$$ -33438 -39919 -25976 1072 10376 -15862 -4820 -5499 -14904 -4870 -4327 375 -2690 -25382
16014b5382j6612n558o311N327K7632K5277l610p229J2931J0957k0367J4371j0434
$$ -25382 -41994 -47552 -53863 -48536 -20904 4373 763 -6466 6465 17422 -2945 11426 992
16001I92J8097K9815j2603m9446J17j91R164L7091L6580k6349k5182l200p861
$$ 992 19089 48904 36301 -13145 -13028 -13219 -4055 33036 69616 43267 18085 14885 7024
15988G024J4072J1242l063k659j8980l3112k531K2693R944O710O129M65J3128
$$ 7024 21096 32338 29275 26616 7636 -25476 -28007 -5314 4630 11340 17469 17934 31062
15975C1062J2948L342k5119r279k8051q558J3902J125k3730J2777K2652n010n597
$$ 31062 44010 47352 22233 12954 -15097 -23655 -9753 -8628 -32358 -19581 3071 -1939 -7536
15962g536P004O591J4361j4008J0766J5561q429j3778k8464r213k7408Q608J5818
$$ -7536 -532 6059 20420 6412 17178 32739 24310 10532 -17932 -27145 -54553 -45945 -30127
15949c0127J5573j742K4039J9049k715k43M147J6524j8038n2031m896m773j9122
$$ -30127 -14554 -16296 7743 26792 24077 23834 27981 44505 26467 -25564 -30460 -35233 -54355
15936e4355K2692L1813J4507o260j5813o457K6949j1915q136Q705K124L143j3807
$$ -54355 -31663 150 14657 8397 -7416 -13873 13076 1161 -6975 1730 3854 6997 -6810
15923f810r036L662J1217p270m439Q283j3851j4571m241k2504n811N694l592L7300
$$ -6810 -15846 -12184 -967 -8237 -12676 -4393 -18244 -32815 -37056 -59560 -65371 -59677 -63269 -25969
15909b5969J5549J6772R250m294k4201j4824R095K5134N881Q275J1537J8289k6885
$$ -25969 -10420 6352 15602 11308 -12893 -27717 -18622 6512 12393 20668 32205 50494 23609
15896B3609l4897j6183j906k0808J6776J7075K7371P29k94K9903j2822k6408K8648
$$ 23609 -11288 -27471 -29377 -50185 -33409 -16334 11037 11766 11472 41375 28553 2145 30793
15883C0793N278j5748k7108k8590j4329J7943K576j1909J1816L3699P477j6143
$$ 30793 36071 20323 -6785 -35375 -49704 -31761 -29185 -41094 -29278 4421 11898 -4245
15871d245j6437N555K2096J721P850M816n939l3707j6435r536K169j2853J7377
$$ -4245 -20682 -15127 6969 8690 16540 21356 15417 -18290 -34725 -44261 -42092 -54945 -37568
15858c7568J7506J5712J1693P334p254j6831J6498J4899J6785J2835j0816J004
$$ -37568 -20062 -4350 7343 14677 7423 -9408 7090 21989 38774 51609 40793 41797
15846D1797k2827l2485J6727j795j2757r729J2317j8313q953J9147J7279j3716
$$ 41797 18970 -13515 3212 1417 -11340 -21069 -8752 -27065 -36018 -16871 408 -13308
15834a3308J0722P876J1541J6328k3421q128o72O798N841K0784J2908k3095l4242
$$ -13308 -2586 5290 16831 33159 9738 1610 938 7736 13577 34361 47269 24174 -10068
15821a0068l8480p50K4572J6137j231k7345k3890R987O6J0808j752P570J1344
$$ -10068 -48548 -49298 -24726 -8589 -9820 -37165 -61055 -51068 -51002 -40194 -41946 -34376 -23032
15808b3032J4601Q155J3446K0182k5644r713n752k2734K620M346O830j013P010
$$ -23032 -8431 -276 13170 33352 7708 -2005 -7757 -30491 -27871 -23525 -16695 -17708 -10698
15795a0698k770j2898k7251J3460J3388M262k088m636R277J6664R936Q546J6079
$$ -10698 -13468 -26366 -53617 -40157 -26769 -22507 -24595 -29231 -19954 -3290 6646 15192 31271
15782C1271K534o829l369j1179j334R175j4180K000P82K7020N879j8154k7169
$$ 31271 33805 26976 23607 12428 11094 20269 6089 8089 8871 35891 41770 23616 -3553
15769c553J5406j4206L7411j9122l3215J3189L3134J5680k675j902L7221j2298
$$ -3553 11853 -2353 35058 15936 -17279 -4090 29044 44724 42049 40147 77368 65070
15757F5070j7967J0685l842L6764L6242N2351J43770K74929L83542K55184j83838
$$ 65070 47103 57788 53946 90710 126952 179303 323073 598002 981544 1236728 1052890
15746A052890l87717k69508j27738r3576m8497m5457j0607q943n148m550k8445
$$ 1052890 665173 395665 267927 174351 125854 80397 69790 60847 55699 51149 22704
15735B2704K784J4363M777n055j1505J742Q021k0164o023o000M552l9340m0396
$$ 22704 25488 39851 44628 39573 28068 29810 37831 17667 11644 5644 10196 -29144 -69540
15722f9540M4415N6173J5996M546m2174l8654J3247j1633m876J7629J6181j1877
$$ -69540 -25125 31048 47044 51590 9416 -29238 -15991 -27624 -32500 -14871 1310 -10567
15710a0567j091J6346n473k643J473l832j1231K0895K4681O039n617l6922N490
$$ -10567 -11658 4688 -785 -3428 -1955 -5787 -17018 3877 28558 34597 28980 -7942 -2452
15697b452K1080J9952R611j4853M294j6459Q740q316q134l2950k563L5521o424
$$ -2452 18628 38580 48191 33338 37632 21173 29913 21597 13463 -19487 -22050 13471 7047
15684G047j3870j2425K970J2303Q260J0128J529m112N879r98k0066k6415L2943
$$ 7047 -6823 -19248 -16278 -3975 4285 14413 15942 11830 17709 16711 -3355 -29770 3173
15671C173L7665Q629l2416n1577k0102N407R562J954K1340K069R340o205J8327
$$ 3173 40838 49467 17051 -34526 -54628 -49221 -39659 -37705 -16365 -14296 -4956 -11161 7166
15658G166J6288k486m0727j5482m863L914L1166K477N624j9796q69n668m445J0879
$$ 7166 23454 20968 -19759 -35241 -40104 -36190 -5024 -2547 3077 -16719 -17588 -23256 -27701 -16822
15644a6822L8134J6628l222l9679k0222J6221K3763M367j1853Q31J1500j1675
$$ -16822 21312 37940 34718 -4961 -25183 -8962 14801 19168 7315 8146 19646 7971
15632G971r77j1106J609J0979O058r892K6635M96j2668j4634j8632k412J1657
$$ 7971 6994 -4112 -2503 8476 14534 4642 31277 31773 19105 4471 -14161 -16573 -4916
15619d916J081R10R938o927K5941N014j1136J6631O65J5792N507m5538n7625p323
$$ -4916 -3835 -2925 7013 86 26027 31041 19905 36536 37201 52993 58500 12962 -44663 -51986
15605e1986L094l559J4723K3260J2696o558J2164k2018m605M936J7905j1236j7734
$$ -51986 -48892 -52451 -37728 -14468 -1772 -8330 3834 -18184 -22789 -17853 52 -11184 -28918
15592b8918K462m711M59j2403K2481J1968j0082J4559J5390M403k581m0269k2199
$$ -28918 -26456 -31167 -30708 -43111 -20630 -8662 -18744 -4185 11205 15608 13027 -27242 -49441
15579d9441J080K4349J4448K0420J6476j4442l1477N803L5148J4006k9261K0845
$$ -49441 -48361 -24012 -9564 10856 27332 12890 -18587 -12784 22364 36370 7109 27954
15567B7954q465l8513k2313j6154j7824j198O961N018j5769M2097K0878P408m195
$$ 27954 19489 -19024 -41337 -57491 -75315 -76513 -69552 -64534 -80303 -38206 -17328 -9920 -14115
15554a4115J0975k0078P796R269O829l953k686p638k1829L417J4867l3899j1705
$$ -14115 -3140 -23218 -15422 -6153 676 -3277 -5963 -13601 -35430 -32013 -17146 -51045 -62750
15541f2750N741p525M7583M0373o397k8424j8723M534J6045K2777K9530j1714
$$ -62750 -57009 -64534 -16951 23422 17025 -11399 -30122 -25588 -9543 13234 42764 31050
15529C1050j1553M072J817j788j185p433j161k7100j8862J2935Q88Q324j1916
$$ 31050 19497 23569 25386 23598 22413 14980 13819 -13281 -32143 -19208 -18320 -9996 -21912
15516b1912J5761j0133Q534j5346q195K1412K1181k7848O419J6203p689m538l026
$$ -21912 -6151 -16284 -7750 -23096 -31291 -9879 11302 -16546 -10127 6076 -1613 -6151 -9177
15503i177k348N194n30J2232J0815j2139Q909Q683q535k0701q249K6786K3595
$$ -9177 -11525 -6331 -6861 5371 16186 4047 12956 21639 13104 -7597 -15846 10940 34535
15490C4535O752K194j3665k4303j3393k698j4693Q56j2017j869K3695J2586j9411
$$ 34535 41287 43481 29816 5513 -7880 -10578 -25271 -24415 -36432 -38301 -14606 -2020 -21431
15477b1431k051N220J7277J032j1027k1815J2183K2361K9324m279j1160k0078
$$ -21431 -23482 -18262 -985 47 -10980 -32795 -20612 1749 31073 26794 15634 -4444
15465d444j0617o987J7414P212l76k0170l208J5605K3948J0304K5649R881l703
$$ -4444 -15061 -22048 -4634 2578 2202 -17968 -21176 -5571 18377 28681 54330 64211 60508
15452F0508j6854r650n474P889k216J2680j5482l4000N985r284j6152M73o609
$$ 60508 43654 34004 28530 36419 34203 46883 31401 -2599 3386 -5898 -22050 -21577 -28186
15439b8186J330p583J1534M680n988j6320k372R714K4130l53K1709M008J8754
$$ -28186 -26856 -34439 -22905 -18225 -24213 -40533 -42905 -33191 -9061 -9414 12295 16303 35057
15426C5057L554j1117j5707j8771M02l1163j268J7105K5716J463o775J1127J2888
$$ 35057 38611 27494 11787 -6984 -6582 -37745 -39013 -21908 3808 5271 -1504 9623 22511
15413B2511p058J1676o796j8723l9654k5469L2624J9097k807K892l797L122J0410
$$ 22511 15453 27129 20333 1610 -38044 -63513 -30889 -11792 -14599 -11707 -15504 -12382 -1972
15400a972K388k0679m3614L821N2149L7670k9088q283j4877k9521J0384L2433
$$ -1972 416 -20263 -63877 -60056 -7907 29763 675 -7608 -22485 -52006 -41622 -9189
15388i189J6133K2986k083k4235j0647k9527K1035Q313q459n261J9658P750J451
$$ -9189 6944 29930 27847 3612 -7035 -36562 -15527 -7214 -15673 -20934 -1276 6474 7925
15375G925p788P003K6151j5324m071R078J7083j3587M797J9325J4812k9581Q818
$$ 7925 137 7140 33291 17967 13896 22974 40057 26470 31267 50592 65404 35823 44641
15362D4641Q630o025j7837k2755M512k6558j6539m814k692K4088L7662l0456n921
$$ 44641 53271 47246 29409 6654 11166 -15392 -31931 -36745 -39437 -15349 22313 -8143 -14064
15349a4064K5541O518p089p938p349J6360J933k4722q034N1393M079k3713M890
$$ -14064 11477 17995 10906 2968 -4381 11979 13912 -10810 -18844 32549 36628 12915 17805
15336A7805Q898n445k7104J3242K2501J6541Q070l6868k663j2433q878M292L1513
$$ 17805 26703 21258 -5846 7396 29897 46438 54508 17640 14977 2544 -6334 -2042 29471
15323B9471J907q633j7203l0245J4885L577n887o923O614J8882R073K0588M882
$$ 29471 31378 22745 5542 -24703 -9818 -6241 -12128 -19051 -12437 6445 15518 36106 40988
15310D0988m22j4247r420l2955m4855K7263K9663J6168O377o528j793l677p196
$$ 40988 40566 26319 16899 -16056 -60911 -33648 -3985 12183 18560 12032 10239 6562 -634
15297f34k1938j1721P197j2933q649K4729j1689k4137K1068M4119Q697J8290j3107
$$ -634 -22572 -34293 -27096 -40029 -48678 -23949 -35638 -59775 -38707 5412 14109 32399 19292
15284A9292j3990j6261M298M980J6464J0727k6820r261M0318n379j0868J267K4052
$$ 19292 5302 -10959 -6661 -1681 14783 25510 -1310 -10571 29747 24368 13500 14767 38819
15271C8819k433l0190k4975K6562M450q287p231L002k516n069K619M92m4M724
$$ 38819 36386 6196 -18779 7783 12233 3946 -3285 -283 -2799 -7868 -5249 -4757 -4801 -77
15257g7j4588j4185n593k5520K3652L8131N135m2630J2313P213R647j0013j5484
$$ -77 -14665 -28850 -34443 -59963 -36311 1820 6955 -35675 -23362 -16149 -6502 -16515 -31999
15244c1999j823o855N655N183P897J6338K2171j2547l9568j5093r261M2492K4306
$$ -31999 -33822 -40677 -35022 -29839 -21942 -5604 16567 4020 -35548 -50641 -59902 -17410 6896
15231F896k2619k3110k4500p158K1641K6524P073K0475K4019K8644l722j3941
$$ 6896 -15723 -38833 -63333 -70491 -48850 -22326 -15253 5222 29241 57885 54163 40222
15219D0222l196j9633l6057K1492O785Q673j9881R846n706n466K0461K982J4283
$$ 40222 37026 17393 -18664 2828 9613 18286 -1595 8251 2545 -2921 17540 20522 34805
15206C4805J204k9071p415Q903q410Q3k4929r27J7033K705j1372K8670J4705j7715
$$ 34805 36009 6938 -477 8426 16 99 -24830 -25757 -8724 -6019 -17391 11279 25984 8269
15192H269N976K1852N150j314j1260R17o856n95K5712l696o2137j3588L7719K9503
$$ 8269 14245 36097 41247 39933 28673 29590 22734 22139 47851 44155 -17982 -31570 6149 35652
15178C5652R11j5499l2608N951J7674l492O666m962j1101J9650N301P449q11m564
$$ 35652 36563 21064 -11544 -5593 12081 8589 15255 10293 -808 18842 24143 31592 30781 26217
15164B6217l4j3155m5582k712K0368L615m343J4862J1529J7002k2059k2109j3767
$$ 26217 26183 13028 -32554 -35266 -14898 -11283 -15626 -764 10765 27767 5708 -16401 -30168
15151c0168j0323K5517j6575j4016n250J4490q61l2913N576K9610J8565k479J0283
$$ -30168 -40491 -14974 -31549 -45565 -50815 -36325 -37186 -70099 -64523 -34913 -16348 -18827 -8544
15138h544K7364l220p955R737j3153R474N484J3553J9348o105q479j3570l3458
$$ -8544 18820 15600 7645 17382 4229 13703 19187 32740 52088 45983 37504 23934 -9524
15125i524m821r055j6440L0519Q204k2961Q459K5793j011K2432O868j3793k906
$$ -9524 -14345 -23400 -39840 -9321 -1117 -24078 -15619 10174 9163 31595 38463 24670 21764
15112B1764O337M783o068k1632k8625j0457J1423L1261Q909k8086k7617K2914
$$ 21764 28101 32884 26816 5184 -23441 -33898 -22475 8786 17695 -10391 -38008 -15094
15100a5094L7233J5021l2549o0164p173K9624J3499j1805R617L3026K5390j0845
$$ -15094 22139 37160 4611 -55553 -62726 -33102 -19603 -31408 -21791 11235 36625 25780
15088B5780j9897p268j2392J00K047j480J7722J5939n175p735n351J73J4728K6765
$$ 25780 5883 -1385 -13777 -13677 -11630 -13110 4612 20551 15376 7641 2290 2463 17191 43956
15074D3956J4712j7154q769J0321j1312j1891j0071M229J1881L9418R009k8550
$$ 43956 58668 41514 32745 43066 31754 19863 9792 14021 25902 65320 74329 45779
15062D5779l3103J4948K3652n224l746k469j5344k4387N406p400M2165J7871J7421
$$ 45779 12676 27624 51276 46052 42306 39837 24493 106 5512 -1888 40277 58148 75569
15049G5569q147l0039n0054j3732J6113J514k8375Q546M1748R682k6595J2791
$$ 75569 67422 37383 -12671 -26403 -10290 -8776 -37151 -28605 13143 22825 -3770 9021
15037I021J5051l071j0519m2886J2931L7832J2809l7623L914l403P318L213M797
$$ 9021 24072 21001 10482 -32404 -19473 18359 31168 -6455 -2541 -5944 1374 4587 9384
15024I384l0467J559K1550k9002m69L8119P469j5390k0571k0572n689n050P647
$$ 9384 -21083 -19524 2026 -26976 -27445 10674 18143 2753 -17818 -38390 -44079 -49129 -41482
15011d1482K2552P321J6L809L073j7235J0171L841l134j0721o746J4447J8753
$$ -41482 -18930 -11609 -11593 -7784 -4711 -21946 -11775 -7934 -11068 -21789 -28535 -14088 4665
14998D665r510j330mm274m775J2204k950n171J8767J6160J854n6859k4063J3948
$$ 4665 -4845 -6175 -6179 -10453 -15228 -3024 -5974 -11145 7622 23782 25636 -31223 -55286 -41338
14984d1338P265p00l07l138J4865J7403j8812N235L1169J788P871j1639j0365
$$ -41338 -34073 -34773 -35080 -38218 -23353 -5950 -24762 -19527 11642 13430 21301 9662 -703
14971g03k987j5155k0855o792K5722J9694j1648p482j1559L4253L2711M691k1545
$$ -703 -3690 -18845 -39700 -46492 -20770 -1076 -12724 -20206 -31765 2488 35199 39890 18345
14958A8345Q810k5082l0859J2317M3103L6406j9563j2267l3697J6713L7661r705
$$ 18345 27155 2073 -28786 -16469 26634 63040 43477 31210 -2487 14226 51887 42182
14946D2182k8482R201J705j6945j4278P279r079J4793R497M87J7426j583M544
$$ 42182 13700 22901 24606 7661 -6617 662 -8417 6376 15873 16360 33786 32203 36747
14933C6747p520J5504m067n712j365N180N123k0837j3150j4707j0864p006j5879
$$ 36747 29227 44731 40664 34952 33587 38767 43890 23053 9903 -4804 -15668 -22674 -38553
14920c8553J93l173P589R234M13o781J1655j7099Q787K8250o889J3132K6647k6995
$$ -38553 -38360 -41533 -33944 -24710 -24297 -31078 -19423 -36522 -27735 515 -6374 6758 33405 6410
14906F410k1298k968K4222M671j0258K1915Q614j612J2094K72j4081j2489q320
$$ 6410 -14888 -17856 6366 11037 779 22694 31308 29696 41790 42062 27981 15492 7172
14893G172j1519j0839r370l0335J0093K8378k4573K7040L7049o187k0937j2189
$$ 7172 -4347 -15186 -24556 -54891 -44798 -16420 -40993 -13953 23096 16909 -4028 -16217
14881a6217j5974k1888J0713L7618K0346M358j745Q90j1311o156k0152l2869K3259
$$ -16217 -32191 -54079 -43366 -5748 14598 18956 17211 18101 6790 634 -19518 -52387 -29128
14868b9128K5587K3855r50j3054O692k7808K1785j0574K967J9079J9180j8044
$$ -29128 -3541 20314 19364 6310 13002 -14806 6979 -3595 -628 18451 37631 19587
14856A9587l3562k4576L76K9642K2608l1721j0054L0754L0462K0158k8004j3424
$$ 19587 -13975 -38551 -38175 -8533 14075 -17646 -27700 3054 33516 53674 25670 12246
14844A2246P214q9k795p923j5748k397j2899k2784n318K5922Q53J3825P474J0524
$$ 12246 19460 19371 16576 8653 -7095 -9492 -22391 -45175 -50493 -24571 -23718 -9893 -2419 8105
14830H105K6417j6601k5598k3108k390L694J4795L997j6941k482K956q587j158
$$ 8105 34522 17921 -7677 -30785 -33175 -29481 -14686 -10689 -27630 -30112 -27156 -35743 -36901
14817c6901L2619K0792m411q947J8909P932k1763j1027o294l2161K7791J0376
$$ -36901 -4282 16510 12099 3152 22061 29993 8230 -2797 -9091 -41252 -13461 -3085
14805c085r105L549Q149O7j1064K1524J9120j1969O201P59M413M4j1052j8814
$$ -3085 -12190 -8641 -492 -425 -11489 10035 29155 17186 23387 24146 28559 28603 17551 -1263
14791a263J269p328j1824J8439K1775n914q243J7497R642k065j4429j6800j9121
$$ -1263 6 -7322 -19146 -707 21068 15154 6911 24408 34050 31985 17556 756 -18365
14778a8365K2728j3196j3191J4365L0443q094k4581J4405K1202J1738J4265l0189
$$ -18365 4363 -8833 -22024 -7659 22784 14690 -9891 4514 25716 37454 51719 21530
14766B1530r569j4162M944J4533k1349k2637L0130K2661l1728k5477Q923J3540
$$ 21530 11961 -2201 2743 17276 -4073 -26710 3420 26081 -5647 -31124 -22201 -8661
14754h661j3856l3516K3088k458j6070Q251K6308K0221J6598J540j0531p537J4964
$$ -8661 -22517 -56033 -32945 -35403 -51473 -43222 -16914 3307 19905 21445 10914 3377 18341
14741A8341N303j634J5582l4801l4158J4883R020Q573l719j4077l361K2327J7689
$$ 18341 23644 22010 37592 2791 -31367 -16484 -7464 1109 -2610 -16687 -20048 2279 19968
14728A9968J1889m318Q543n560m5393j6584J8190L1236j0410k2894p660K5806
$$ 19968 31857 27539 36082 30522 -14871 -31455 -13265 17971 7561 -15333 -22993 2813
14716B813K5741l2477k1676N636R629O081o205J7402O899m333j1719n033j3707
$$ 2813 28554 -3923 -25599 -19963 -10334 -4253 -10458 6944 13843 9510 -2209 -7242 -20949
14703b0949K7937J8758j0610r956K2762J2384q552k192j3255j7716j9362j2074
$$ -20949 6988 25746 15136 5180 27942 40326 31774 29582 16327 -1389 -20751 -32825
14691c2825k4837K746K3956J5155J3814K3380Q0n080Q536K5622j2562l4861J7382
$$ -32825 -57662 -54916 -30960 -15805 -1991 21389 21469 16389 24925 50547 37985 3124 20506
14678B0506J1501l5309J3803K1838j5812l1666J483J3428n122J2462p975l7656
$$ 20506 32007 -3302 10501 32339 16527 -15139 -13656 -228 -5350 7112 -863 -38519
14666c8519J6662J0389p510l2479k004M1235J1886k795k2931K4949J7031P497
$$ -38519 -21857 -11468 -18978 -51457 -53461 -12226 -340 -3135 -26066 -1117 15914 23411
14654B3411m142j6666j5419k370J218M1092P245j8502N311N307P871n282m3283
$$ 23411 19269 2603 -12816 -15186 -13968 27124 34369 15867 21178 26485 34356 29074 -14209
14641a4209l846K8526J6842P027J602j7134j9859p849J0564J9652P361J1047r920
$$ -14209 -18055 10471 27313 34340 35942 18808 -1051 -8900 1664 21316 28677 39724 29804
14628B9804j6628j983k1845Q614j9311j4646j6867J8964R230o023l507N391J9478
$$ 29804 13176 11193 -10652 -2038 -21349 -35995 -52862 -33898 -24668 -30691 -34198 -28807 -9329
14615i329J9518J8990R73k2858k076k375P789j228Q816j2701j8508j3235K6883
$$ -9329 10189 29179 30152 7294 5218 2843 10632 9404 18220 5519 -12989 -26224 659
14602F59P338j6039K861K4626K3699J0114P182j5205j5201M012N172j4476O490
$$ 659 7997 -8042 -5181 19445 43144 53258 60440 45235 30034 34046 39218 24742 31232
14589C1232N131j6080k2006Q070O437K2243P153k3959j2455P293J577j5008J3353
$$ 31232 36363 20283 -1723 6347 12784 35027 42180 18221 5766 13059 14636 -372 12981
14576A2981J967o654j4223N545M625k0828j4158M2959L6610r089J224k299j6272
$$ 12981 14948 8294 -5929 -384 4241 -16587 -30745 12214 48824 39735 40959 38660 22388
14563B2388J044l725P775J4112R541J67l3562k6277J5306J7122K2639k0552j4231
$$ 22388 23432 19707 27482 41594 51135 51302 17740 -8537 6769 23891 46530 25978 11747
14550A1747R648l666J0193o254j409n358k6112j8250L0741J6180K2672j9582L67
$$ 11747 21395 17729 27922 21668 20259 14901 -11211 -29461 1280 17460 40132 20550 20917
14537B0917J0154l619J0068j2545q09j0673L121K8367J2880k6801l9016j898J1925
$$ 20917 31071 27452 37520 24975 24166 13493 16614 44981 57861 31060 -7956 -9854 2071
14524B071r639O847J9110K1637p961k2317m601J2304r267j1186j0549K8928J5852
$$ 2071 -7568 -721 18389 40026 32065 9748 5147 17451 8184 -3002 -13551 15377 31229
14511C1229l7274k6087J8497L34l603J1914K1729J4619Q807J5434m276j766j8392
$$ 31229 -6045 -32132 -13635 -13301 -16904 -4990 16739 31358 40165 55599 51323 49557 31165
14498C1165m124l134J815j7853k0607q194J5884j2682l0923P607J8178j1825j0649
$$ 31165 27041 23907 25722 7869 -12738 -20932 -5048 -17730 -48653 -41046 -22868 -34693 -45342
14485d5342M668Q636L642p140L339K535q812J9438L4922q429J7082m778m0838
$$ -45342 -40674 -32038 -28396 -35536 -32197 -29662 -38474 -19036 15886 7457 24539 19761 -21077
14472b1077k8855K823R026J3997L5693J4019J3337p851l9926k4160J0740J2613
$$ -21077 -49932 -47109 -38083 -24086 11607 25626 38963 31112 -8814 -32974 -22234 -9621
14460i621K6140R364k3278P419J536J1140L972p802j1626k3644k090L5813J2773
$$ -9621 16519 25883 2605 10024 11560 22700 26672 18870 7244 -16400 -18490 17323 30096
14447C0096L52Q532r054O74p821j1287j7704J2581j6614M832J3744m703r844o264
$$ 30096 30448 38980 29926 30600 22779 11492 -6212 6369 -10245 -5413 8331 3628 -6216 -12480
14433a2480k5969L9125J1085j8304J2525r738J0632l297k113p805j3019K8068
$$ -12480 -38449 676 11761 -6543 5982 -3756 6876 3579 1466 -6339 -19358 8710
14421H710P038m85m20j8591J3128N030l1271m5561n736L6670J1109k6988J3555
$$ 8710 15748 15263 14843 -3748 9380 14410 -16861 -62422 -68158 -31488 -20379 -47367 -33812
14408c3812n296K9369Q204l9480J7267J3203M582O753l3015j8972n097J4927J4042
$$ -33812 -39108 -9739 -1535 -41015 -23748 -10545 -5963 790 -32225 -51197 -56294 -41367 -27325
14395b7325j9743n478Q272J5363K38P165K184J0610J4309R638j4178j8113O168
$$ -27325 -47068 -52546 -44274 -28911 -28673 -21508 -19324 -8714 5595 15233 1055 -17058 -10890
14382a0890j0694J353j5795q373J1514J7433K8165j5094K622M066o367R88L2932
$$ -10890 -21584 -20231 -36026 -44399 -32885 -15452 12713 -2381 241 4307 -2060 -1072 31860
14369C1860k239m1767R654K0723j73K9129J2819o432j8979j0872p120J9264m239
$$ 31860 29621 -12146 -2492 18231 18058 47187 60006 53574 34595 23723 16603 35867 31628
14356C1628k9299j905P537O659L061r046K167K7096N018j6569j8677j7681k3233
$$ 31628 2329 424 7961 14620 17681 8635 10802 37898 42916 26347 7670 -10011 -33244
14343c3244J155J9743J1126j1434k4094J2683j77j0616J632j563J1687N506J4930
$$ -33244 -32089 -12346 -1220 -12654 -36748 -24065 -24242 -34858 -33226 -34789 -23102 -17596 -2666
14330b666j4046j472R937L4333K4547N816k1705J06q155J2239J259j9644p397
$$ -2666 -16712 -18184 -8247 26086 50633 56449 34744 34850 26695 38934 40193 20549 13152
14317A3152o112R497j9823j6425J7464J3206q712P667M421j1332p087M553j4894
$$ 13152 7040 16537 -3286 -19711 -2247 10959 2247 9914 14335 3003 -4084 469 -14425
14304a4425M681j4R523P888n261k9142q918M7139L0583j7111j5832j4864P370
$$ -14425 -9744 -9758 -235 7653 2392 -26750 -35668 11471 42054 24943 9111 -5753 1617
14291A617o185N835j2556j9483J8789O546K961k948J8363Q221q481J3831J5408
$$ 1617 -4568 1267 -11289 -30772 -11983 -5437 -2476 -5424 12939 21160 12679 26510 41918
14278D1918l8646k2617M268R593K1423o504O744J4943j989r286j2092j5886k6382
$$ 41918 3272 -19345 -15077 -5484 15939 9435 16179 31122 29133 19847 7755 -8131 -34513
14265c4513l529J9796J7715K9573J1383l5651l4857M0543K3491k1124r460R165
$$ -34513 -38042 -18246 -531 29042 40425 4774 -30083 10460 33951 12827 3367 12532
14253A2532N989J8569l575o421P257L2809k7840k4369j7381O202K5652J9400j1433
$$ 12532 18521 37090 33515 27094 34351 67160 39320 14951 -2430 3772 29424 48824 37391
14240C7391K522j8612j4861l73j0835L085J3312L021J662J610J1869L9298J6233
$$ 37391 39913 21301 6440 6067 -4768 -1683 11629 14650 16312 17922 29791 69089 85322
14227H5322m1427J902l4k5678K0509J9603m330k418r154m871j9791Q248K7992
$$ 85322 43895 45797 45763 20085 40594 60197 55867 53449 44295 39424 19633 27881 55873
14214E5873J3179l1794k8013J4292J8756P347j2750r935N765R163l442p153K1051
$$ 55873 69052 37258 9245 23537 42293 49640 36890 26955 32720 41883 38441 31288 52339
14201E2339k533k4880K091l852r98O558J7890k0331k1804J786L0831M518J3240
$$ 52339 49806 24926 27017 23165 22167 28725 46615 26284 4480 6266 37097 41615 54855
14188E4855j96q066k8691J5215J9573k9029m357K1806P675K441j547q234K019
$$ 54855 54659 46593 17902 33117 52690 23661 19304 41110 48785 51226 49679 41445 43464
14175D3464J2221j9475j5361J3238Q97j4207K40k1294k135O37Q327J8382J711
$$ 43464 55685 36210 20849 34087 34984 20777 21017 -277 -2412 -1775 6552 24934 26645
14162B6645J8463P944k4061R419m9558j0514L4429n237m646q955r313l62M779
$$ 26645 45108 53052 28991 38410 -11148 -21662 12767 7530 2884 -6071 -15384 -15746 -10967
14149a0967l586L0741K7927j3995k9725O650j8662r196k542k069J4738K4356R398
$$ -10967 -14553 16188 44115 30120 395 7045 -11617 -20813 -23355 -25424 -10686 13670 23068
14136B3068j2850j8395N708M3520K1276j538L816j9108r88k4850k1612J9145K0766
$$ 23068 10218 -8177 -2469 41051 62327 60789 64605 45497 44509 19659 -1953 17192 37958
14123C7958K2139k6065n039j4674n3618k1208M519L3668J2474j9670P083l838
$$ 37958 60097 34032 28993 14319 -39299 -60507 -55988 -22320 -9846 -29516 -22433 -26271
14111b6271R402L6396J6430r474j7981j4159l234J3574N83q598j6740l714p222
$$ -26271 -16869 19527 35957 26483 8502 -5657 -8891 4683 5266 -3332 -20072 -23786 -31008
14098c1008J8496L7641o797r591N666j1199p019q572j2Q953J7240m04j6797J024
$$ -31008 -12512 25129 18332 8741 14407 3208 -3811 -12383 -12395 -3442 13798 13394 -3403 -2379
14084b379J6816m111q517n556r695Q789J7984K1890n581m1883k6509j0662J0645
$$ -2379 14437 10326 1809 -3747 -13442 -4653 13331 35221 29640 -12243 -38752 -49414 -38769
14071c8769K0599J5815p754j2203R02K142k440N1l177J8531K9334Q042l6401N265
$$ -38769 -18170 -2355 -10109 -22312 -21410 -19268 -21708 -21657 -24834 -6303 23031 31073 -5328 -63
14057f3j331K2715R24q609k1673j8673q600J253M760m573L854O644Q685O114J1796
$$ -63 -1394 21321 22245 13636 -8037 -26710 -35310 -34057 -29297 -33870 -30016 -23372 -14687 -8573 3223
14042C223k716j2962k3887m882M4696J4080J1753J5973k6195k1680J396k0571
$$ 3223 507 -12455 -36342 -41224 3472 17552 29305 45278 19083 -2597 -1201 -21772
14030b1772K0761K5017J2914k8165j5391R186K0805K709P479j1602k9614J3497
$$ -21772 -1011 24006 36920 8755 -6636 2550 23355 26064 33543 21941 -7673 5824
14018E824J2363p176K0213M262Q203K5424k4986l490j0910j1893k2537j4131L2089
$$ 5824 18187 11011 31224 35486 43689 69113 44127 40637 29727 17834 -4703 -18834 13255
14005A3255k2058l2135J9201J3916p499M37o050J0099j1299K4420K3014k3413
$$ 13255 -8803 -40938 -21737 -7821 -15320 -14883 -20933 -10834 -22133 2287 25301 1888
13993A888k859K1488J1504l203P886j1969N700P565K525l4828k5649J6870J7265
$$ 1888 -971 20517 32021 28818 36704 24735 30435 38000 40525 5697 -19952 -3082 14183
13980A4183J4899L6068k8213l4979n334J4355q459J6131J2277r05m048j342K0907
$$ 14183 29082 65150 36937 1958 -3376 10979 2520 18651 30928 30023 25975 24633 45540
13967D5540J1371r130k7510k1328m046J7867J1912Q605r53Q320J5343P031R437
$$ 45540 56911 47781 20271 -1057 -5103 12764 24676 33281 32328 40648 55991 63022 72459
13954G2459k5959n366o644k3180q23J304j2447k1850L86K3821K7829J255q849
$$ 72459 46500 41134 34490 11310 10487 11791 -656 -22506 -22120 1701 29530 30785 21936
13941B1936K864p72j4131J0268J1313j2088k3699j5506R007j7481K0552K5214
$$ 21936 24800 24028 9897 20165 31478 19390 -4309 -19815 -10808 -28289 -7737 17477
13929A7477o337j4270k0812K916K2393K9577j3400l141l961j1769p463Q904J7347
$$ 17477 11140 -3130 -23942 -21026 1367 30944 17544 14403 10442 -1327 -8790 114 17461
13916A7461k724K9532K477M387N931M521J348j4947m1196k4138J0692L6551J3988
$$ 17461 14737 44269 46746 51133 57064 61585 62933 47986 6790 -17348 -6656 29895 43883
13903D3883o370l3690j0607J9649J5023m387R742J0011o724k6469k3897j6844
$$ 43883 37513 3823 -6784 12865 27888 23501 33243 43254 36530 10061 -13836 -30680
13891c0680J9055J507N298J3246J4225k0185k0786K0305M504o021p054J1734M310
$$ -30680 -11625 -10118 -4820 8426 22651 2466 -18320 1985 6489 468 -6586 5148 9458
13878I458k1440K7822J5361k5713m153j0969K1769J7149J0897j7623J3250P98
$$ 9458 -11982 15840 31201 5488 1335 -9634 12135 29284 40181 22558 35808 36606
13866C6606l12p33m3567j5717M975j2432J7913R477j143K3664l157k4910k0041
$$ 36606 36294 35561 -8006 -23723 -18748 -31180 -13267 -3790 -4933 18731 15574 -9336 -29377
13853b9377p363l548L2919L6831J4498j6311k2327N795j7624K9698N2848r235
$$ -29377 -36740 -40288 -7369 29462 43960 27649 5322 11117 -6507 23191 76039 66804
13841F6804l893J1543n522m0602k5352j6764O46N359k179L918m856l253n247j075
$$ 66804 62911 74454 68932 28330 2978 -13786 -13140 -7781 -9960 -6042 -10898 -14151 -19398 -20473
13827b0473J7060L1400N389m969M393K8821n849l3761j3668O669k4625j1755J3665
$$ -20473 -3413 27987 33376 28407 32800 61621 55772 22011 8343 15012 -9613 -21368 -7703
13814g703M197k4828j1865L5788L1264n328k4609k0026P646L4019M269k3838k4488
$$ -7703 -3506 -28334 -40199 -4411 26853 21525 -3084 -23110 -15464 18555 22824 -1014 -25502
13801b5502K8901J3874m466l937L105m059O72j4772j386O734P391Q345J7170Q527
$$ -25502 3399 17273 12807 8870 11975 7916 8588 -6184 -7570 -836 6555 14900 32070 40597
13787D0597q206J9265j1534K536k0352o015J2788p959j2543K8308K2223j5407
$$ 40597 32391 51656 40122 42658 22306 16291 29079 21120 8577 36885 59108 43701
13775D3701l2795K3383L3640Q821m0968J875J1379R171r163J2883J3896j3611
$$ 43701 10906 34289 67929 76750 35782 37657 49036 58207 49044 61927 75823 62212
13763F2212k3536J2554L144J3598O256m2296m7789N282Q767J3519K6637J2502
$$ 62212 38676 51230 54374 67972 74228 31932 -15857 -10575 -1808 11711 38348 50850
13751E0850k090K1157l546k6280k1540j8797L3174K3339K328K525m108o152j4332
$$ 50850 48760 69917 66371 40091 18551 -246 32928 56267 58595 61120 57012 50860 36528
13738C6528J7107k1243m3604P680K4078K950J7393j2098Q677J5931j7042k6807
$$ 36528 53635 32392 -11212 -3532 20546 23496 40889 28791 37468 53399 36357 9550
13726I550N441L2230P505L343k8941l5422J2571j7869k6051O370J5020Q197J5075
$$ 9550 14991 47221 54726 58069 29128 -6294 6277 -11592 -37643 -31273 -16253 -8056 7019
13713G019k1498P505L2265r414k401p316J1780r222j8135j0198l92J3185J2790
$$ 7019 -14479 -6974 25291 15877 13476 6160 17940 8718 -9417 -19615 -20007 -6822 5968
13700E968l018j9925J5115R342k3133J6885n582Q38j1024L421j425J489J7753
$$ 5968 2950 -16975 -1860 7482 -15651 1234 -4348 -3510 -14534 -11113 -12538 -11049 6704
13687F704P364J9725k8549J0148L3533L837j2610M91k4525k384J3140l789k532
$$ 6704 14068 33793 5244 15392 48925 52762 40152 40643 16118 13734 26874 23085 20553
13674B0553K1651J8190m545J2500j2840n0590j3913J4561K9179N044k699K3865
$$ 20553 42204 60394 55849 68349 55509 4919 -8994 5567 34746 39790 37091 60956
13662F0956j800j8012J085Q094j4709N952q387j1136j7676k4121K9618N7982k4065
$$ 60956 59156 41144 42229 50323 35614 41566 33179 22043 4367 -19754 9864 67846 43781
13649D3781j4631j0360J1011K6600l0990j6405J9284J8570Q166j9845k294M949
$$ 43781 29150 18790 29801 56401 25411 9006 28290 46860 55026 35181 32887 37836
13637C7836J7614M851l859q220O557j2956k2167l6050J9668l695K0027M900L9299
$$ 37836 55450 60301 56442 48222 54779 41823 19656 -16394 3274 -421 19606 24506 63805
13624F3805P183M078l0009k4776m1697J8933K5671J0846q983J2250K5058O87p22
$$ 63805 70988 75066 45057 20281 -21416 -2483 23188 34034 25051 37301 62359 63046 62324
13611F2324L0634k818l0961k4191k062j9413n87J7901L6249k2999p654j5723J3050
$$ 62324 92958 90140 59179 34988 32926 13513 12926 30827 67076 44077 36423 20700 33750
13598C3750r903k6074j1412j0628k0408J7401K7162K0443M6312K1293l4933l3196
$$ 33750 23847 -2227 -13639 -24267 -44675 -27274 -112 20331 66643 87936 53003 19807
13586A9807j2346p417J2880J6255M751k533k4441L359K6427Q125J0170m2089m322
$$ 19807 7461 44 12924 29179 33930 31397 6956 10315 36742 44867 55037 12948 8626
13573H626K9485K9347N134r644q819l5650j4902R68j1402m225K5906L8234k680
$$ 8626 38111 67458 72592 62948 54129 18479 3577 4545 -6857 -11082 14824 53058 50378
13560E0378J778l933j696k4028L7792r666L616N29k1778k733j1903J070J2084
$$ 50378 52156 48223 46527 22499 60291 50625 54241 54770 32992 30259 18356 19426 31510
13547C1510j97J7708j1449l8268J095J6804o841q176L1851n281k0158M025N870
$$ 31510 31313 49021 37572 -696 399 17203 10362 2186 34037 28756 8598 12623 18493
13534A8493R141J5319q725l32j8109M54J7374r037k6095L026R342R864J6733K1951
$$ 18493 27634 42953 34228 33896 15787 16241 33615 24578 -1517 1509 10851 20715 37448 59399
13520E9399k0175k1098j5999j4228J3626K6174J7605j3937Q071J5263k764l5604
$$ 59399 39224 18126 2127 -12101 1525 27699 45304 31367 39438 54701 51937 16333
13508A6333j4632J002N55m161o655J1870L1344j3777q396p593p278p634J5257
$$ 16333 1701 2703 3258 -903 -7558 4312 35656 21879 13483 5890 -1388 -9022 6235
13495F235L1066K995o487K3506l434J5974l072j7507K066m642j5745j2886p282
$$ 6235 37301 40296 33809 57315 53881 69855 66783 49276 51342 46700 30955 18069 10787
13482A0787q85L4076k07m1922j6293J1928K9654L864r637r657R615K4555K1584
$$ 10787 9902 43978 43771 1849 -14444 -2516 27138 31002 21365 11708 21323 45878 67462
13469F7462K779k9017n2113n273R459O160J4844O366J9237K0700m143k527N853
$$ 67462 70241 41224 -10889 -16162 -6703 -543 14301 20667 39904 60604 56461 53934 59787
13456E9787M553J477J9546K689k9335l4813J2368K2186N215p936N73P69J2218
$$ 59787 64340 65817 85363 88052 58717 23904 36272 58458 63673 55737 56310 57079 69297
13443F9297k6699k3018K5717J0426k1605M762N654k3456L855K7748O941N156k3909
$$ 69297 42598 19580 45297 55723 34118 38880 44534 21078 24933 52681 59622 64778 40869
13430D0869r458M863J1663l3372q473k350k191o006k0082j4887J8114M2113J4796
$$ 40869 31411 36274 47937 14565 6092 3742 1551 -4455 -24537 -39424 -21310 20803 35599
13417C5599k5750l923n102m727L984J0334J1570K5347J7742o309k3914m075R473
$$ 35599 9849 5926 824 -3903 81 10415 21985 47332 65074 58765 34851 30776 40249
13404D0249P25l151J9525r38l0282j8210o184n107l301J8416j5998q493K1053
$$ 40249 40974 37823 57348 56410 26128 7918 1734 -3373 -6674 11742 -4256 -12749 8304
13391H304l85j2915j1521p9R219J6604k115J2025J3009K9938J3738k3692k1301
$$ 8304 7919 -4996 -16517 -16596 -7377 9227 7112 19137 32146 62084 75822 52130 30829
13378C0829r428l464m69M185M775J0060L466J6284J5685o570j2998j8858o007
$$ 30829 21401 17937 17468 21653 26428 36488 39954 56238 71923 65353 52355 33497 27490
13365B7490o951K8645J7027J98o790N88r956M044L7869k4068k3043m719P202K5582
$$ 27490 20539 49184 66211 66409 59619 60207 50251 54295 92164 68096 45053 40334 47536 73118
13351G3118M128K2983M531k3295m2519L705L1001O46J6481J5829k6895j6624j0056
$$ 73118 77246 100229 104760 81465 38946 42651 73652 74298 90779 106608 79713 63089 53033
13338E3033J325k191l1142O359Q871p720N622j3874J4878P387k2725m330L749
$$ 53033 54358 52167 21025 27384 36255 28535 34157 20283 35161 42548 19823 15493 19242
13325A9242j896J2617J0719p232J2677J1198j6636Q350K4274j8567L4441Q947
$$ 19242 17346 29963 40682 33450 46127 57325 40689 49039 73313 54746 89187 98134
13313I8134K84j2833l5234j8692J8571J3583N247l316l3725J4135j6971P961o679
$$ 98134 98418 85585 50351 31659 50230 63813 69060 65744 32019 46154 29183 37144 30465
13300C0465j1873J2224R3k928q624J5013L9427K1163l2968k3119J4160J6015J9607
$$ 30465 18592 30816 30909 27981 19357 34370 73797 94960 61992 38873 53033 69048 88655
13287H8655O313K801j2071Q986J0443l0630k7607k3310P940K2667M2880j194K840
$$ 88655 94968 97769 85698 94684 105127 74497 46890 23580 31520 54187 97067 95873 98713
13274I8713N865k0944K9280l426k1370l7102R198q138m078L629K129K1181O112
$$ 98713 104578 83634 112914 109488 88118 51016 60214 52076 47998 51627 53756 74937 81049
13261H1049k8792q115j3146K7606J6313J0880k8124k9341J3291O731o887k9285
$$ 81049 52257 44142 30996 58602 74915 85795 57671 28330 41621 48352 41465 12180
13249A2180j1050K7560K1764J0591Q3J2804j3695J110j4778j7184J7733l54K2237
$$ 12180 1130 28690 50454 61045 61128 73932 60237 61347 46569 29385 47118 46764 69001
13236F9001K0549K2691k6686l2838j2951k0612k3832M251K4033j4028j3341J794
$$ 69001 89550 112241 85555 52717 39766 19154 -4678 -427 23606 9578 -3763 -1969
13224a969J3848M3796M3346p92l8522j2267l579o737l370j0652j1995J6292K4883
$$ -1969 11879 55675 99021 98229 59707 47440 43861 37124 33754 23102 11107 27399 52282
13211E2282L4051J2202j8414j2001K000j1566J0606J850r75n024R134j6832m2384
$$ 52282 86333 98535 80121 68120 70120 58554 69160 71010 70035 65011 74145 57313 14929
13198A4929J1846O980j1837J0659P352K4191J3478j8777l3479R820P586k5605
$$ 14929 26775 33755 21918 32577 39929 64120 77598 58821 25342 35162 42748 17143
13186A7143R9J8244q843N149q028k1742J7265J8374J9599J9595k2156k8493K7403
$$ 17143 17242 35486 26643 31792 23764 2022 19287 37661 57260 76855 54699 26206 53609
13173E3609L3880J356l551k1335o71N904j8772j4479M591R187n981j4825k6077
$$ 53609 87489 88845 85294 63959 63288 69192 50420 35941 40532 49719 43738 28913 2836
13160B836K7057L3732k719j7468k81k942l41L545J0275j9292P422J0336J9791
$$ 2836 29893 63625 60906 43438 43157 40215 39874 43419 53694 34402 41824 52160 71951
13147G1951N636o723K8896J429j2581J4718k2307j4118j1418P335j364j929k80
$$ 71951 77587 70864 99760 101189 88608 103326 81019 66901 55483 62818 61454 59525 59245
13134E9245j2054k2535Q85K1851j0059J380j6092M099Q465M0973K492j2920l0659
$$ 59245 47191 24656 25541 47392 37333 38713 22621 26720 35185 76158 78650 65730 35071
13121C5071k1823k0992J9359L455j187J11M550K6276J7880j520n328K2797L405
$$ 35071 13248 -7744 11615 15070 13883 13994 18544 44820 62700 61180 55852 78649 82054
13108H2054j5440j4586n949O201K3610J5031k6535K497J782o173k3369K0400l1337
$$ 82054 66614 52028 46079 52280 75890 90921 64386 66883 68665 62492 39123 59523 28186
13095B8186J3551J3962J7466J6077k6988j1267J7244k7345j7859n354J2042K2549
$$ 28186 41737 55699 73165 89242 62254 50987 68231 40886 23027 17673 29715 52264
13083E2264j2738K1389J6674J1859Q301q815J1272j0433R896k9664j3885J4883
$$ 52264 39526 60915 77589 89448 97749 88934 100206 89773 99669 70005 56120 71003
13071G1003M143q163k1724j2149P262j4181j4322j3486J5862K7630L9669M535
$$ 71003 75146 66983 45259 33110 40372 26191 11869 -1617 14245 41875 81544 86079
13059H6079k3067j094j2495J5736J4930k9532J763J5475j5693L4492J3930P524
$$ 86079 63012 61918 49423 65159 80089 50557 52320 67795 52102 86594 100524 108048
13047A08048L776j6233j412j5177j3869L0614J0587k653r401j7418k0002j0283
$$ 108048 111824 95591 94179 79002 65133 95747 106334 103681 94280 76862 56860 46577
13035D6577L8856J5521L513P191k932k2101j5475K0614l4654m5249r237j9486
$$ 46577 85433 100954 104467 111658 108726 86625 71150 91764 57110 11861 2624 -16862
13023a6862K7343K8025K0895J0643J6649K3361m736j4705k7304r486J6995r227
$$ -16862 10481 38506 59401 70044 86693 110054 105318 90613 63309 53823 70818 61591
13011F1591P93p904j460J2101J8345J5953R083M642l5544J2654K693n463m191
$$ 61591 62384 54480 53020 65121 83466 99419 108502 113144 77600 90254 92947 87484 83293
12998H3293J520l5802j4594J1567R2O792J3202J8020J8797r374M880R277k0800
$$ 83293 84813 49011 34417 45984 46076 52868 66070 84090 102887 93513 98393 107670 86870
12985H6870m0795N640K9670Q588m4278j7154J7178L6984q2K9929R410J5215K882
$$ 86870 46075 51715 81385 89973 45695 28541 45719 82703 82621 112550 121960 137175 140057
12972A40057l8435j9192j9907m997O2760L6604J8371k7542m1006j7409J0297j2858
$$ 140057 101622 82430 62523 57526 120286 156890 175261 147719 106713 89304 99601 86743
12960H6743m080k2141K5294J8355N450r162l5515m376K5353J5556J1781J3598
$$ 86743 82663 60522 85816 104171 109621 100459 64944 60568 85921 101477 113258 126856
12948A26856k9443q317l4716r987p595J5846L3586J283K826j0385J73j0135K1010
$$ 126856 97413 89096 54380 44393 36798 52644 86230 87513 90339 79954 80127 69992 91002
12935I1002j2566J8741J7354L3k7194k4921K8452N438o944J3127k2730J9978K3488
$$ 91002 78436 97177 114531 114564 87370 62449 90901 96339 89395 102522 79792 99770 123258
12922A23258j6153k1140N40R361K8582k572j0368k1094r185J18j0579Q512M5989
$$ 123258 107105 85965 86505 95866 124448 121876 111508 90414 81229 81347 70768 79280 125269
12909A25269K6657k7463r064n084K0602N177j1766K221K588j2427m6570k865K3907
$$ 125269 151926 124463 115399 110315 130917 136094 124328 126549 129137 116710 70140 67275 91182
12896I1182j3987N548O741k0836j4146r40J1364K6734K3484J0608k9858R632j616
$$ 91182 77195 82743 89484 68648 54502 53562 64926 91660 115144 125752 95894 105526 103910
12883A03910l9065j0138K2064k7533r948J0300O170j748J5448J1249L3509j2505
$$ 103910 64845 54707 76771 49238 39290 49590 55760 54012 69460 80709 114218 101713
12871A01713k2634j379J3645j1719J2359K0717j323K2894j3312N897k617M680
$$ 101713 79079 77700 91345 79626 91985 112702 111379 134273 120961 126858 124241 128921
12859A28921R865o500k2002l7382j5805J5676L2012L5100J2554r67j4588m0677
$$ 128921 138786 132286 110284 72902 57097 72773 104785 139885 152439 151472 136884 96207
12847I6207k5755J6334K9769o485K5139l8809j0107O149k234J3948j0401j1535
$$ 96207 70452 86786 116555 110070 135209 96400 86293 92442 90208 104156 93755 82220
12835H2220J0767K953J6370J4076M428p886p433K5118m028m801M296l818K9845
$$ 82220 92987 95940 112310 126386 130814 122928 115495 140613 136585 131784 136080 132262 162107
12822A62107k984l5436n134J7789J5444L268J4509j3709j1850j8961j3489N968
$$ 162107 159123 123687 118553 136342 151786 155054 169563 155854 144004 125043 111554 117522
12810A17522k4163l7148J8437K8379o898K3550l578R671M584j513j938J1597K079
$$ 117522 93359 56211 74648 103027 96129 119679 116101 125772 130356 128843 126905 138502 140581
12797A40581K3738p27K7467J194l6625k7661j3613P653J6309J4151J5514j1756
$$ 140581 164319 163592 191059 192253 155628 127967 114354 122007 138316 152467 167981 156225
12785A56225J1824J938P819r0R66k7218q169J152j3910j4753k370K4208p510L355
$$ 156225 168049 169987 177806 177716 178682 151464 143295 144447 130537 115784 113414 137622 130112 133467
12771A33467J9113K6954j0345j2283j1128m726L3496K5056k6660m1316j7574K3229
$$ 133467 152580 179534 169189 156906 145778 141052 174548 199604 172944 131628 114054 137283
12759A37283J9335l1083O830J0082l856l608k53j1913j4264j942J7361K3538P552
$$ 137283 156618 125535 132365 142447 138591 134983 134730 122817 108553 106611 123972 147510 155062
12746A55062J5236K6353o157j1083j6028o384P413Q382p386j8664K4725J8517
$$ 155062 170298 196651 190494 179411 163383 156999 164412 172794 165408 146744 171469 189986
12734A89986Q27k0360o927J212m426Q222j3816J296j4188J8822L7488P392q168
$$ 189986 190813 170453 163526 164738 160312 168534 154718 156014 141826 160648 198136 205528 197360
12721A97360j3263j0849l5938M572j8230M148J6449J2224J5688l711K01j388j109
$$ 197360 184097 173248 137310 141882 123652 127800 144249 156473 172161 168450 168651 167263 166154
12708A66154J057K8596J0354j5493L157K8681R296P156J1908J8253J7435K953
$$ 166154 167211 195807 206161 190668 193825 222506 231802 238958 250866 269119 286554 289507
12696B89507m538K9494J0400L5745R257N683M1498N4187R4687J21087J11955J23238
$$ 289507 284969 314463 324863 360608 369865 375548 417046 471233 565920 687007 798962 922200
12684I22200J42121J17597Q6234L7925N836p7485j19339j25680j29634j01162
$$ 922200 1064321 1181918 1268152 1306077 1311913 1234428 1115089 989409 859775 758613
12674G58613j11626r0488m8336n9728l6525j3283m2960k5756k524K7099k2644
$$ 758613 646987 556499 508163 448435 411910 398627 355667 329911 327387 354486 331842
12663C31842p780k0186q263M36K2886M8881J4933m173j0257j9994j1595k1885
$$ 331842 324062 303876 295613 296049 318935 367816 382749 378576 368319 348325 336730 314845
12651C14845k0505k3363M839j0172j5864j7907r811k3126K0349J3510j4673q959
$$ 314845 294340 270977 275816 265644 249780 231873 222062 198936 219285 232795 218122 209163
12639B09163O465K0917L2092J5541j99m4064K377J9571p631m519o293M614J525
$$ 209163 215628 236545 268637 284178 283979 239915 242292 261863 254232 249713 243420 248034 249559
12626B49559K8692n142j1816o648q605N774m5114N020K6514j867j1717l396j233
$$ 249559 278251 273109 261293 254645 246040 251814 206700 211720 238234 236367 224650 221254 220021
12613B20021j0718M1273J596l3564m482k181P83L5132K4824m106Q614R727j8569
$$ 220021 209303 250576 252172 218608 214126 211945 212728 247860 272684 268578 277192 286919 268350
12600B68350r104l393K1207j6588k1173O589M43n632l165m3519j1454K0239O973
$$ 268350 259246 255853 277060 260472 239299 245888 246331 240699 237534 194015 182561 202800 209773
12587B09773j0711r460j5884K2860J5734J744l0194K4646K4289k617k5910q299
$$ 209773 199062 189602 173718 196578 212312 214056 183862 208508 232797 230180 204270 195971
12575A95971j8620P615J6337k3471M121L373J9582j2608N155L246K5108K1016
$$ 195971 177351 184966 201303 177832 181953 185326 204908 192300 197455 200701 225809 246825
12563B46825K2861O925j4647l8366k1005L5427K1907k435j5731j295p49J901J6766
$$ 246825 269686 276611 261964 223598 202593 238020 259927 257492 241761 240466 239717 241618 258384
12550B58384K3161K3354j1629m2447j0584L0920K8716J9803L1987q71k5334J4011
$$ 258384 281545 304899 293270 250823 240239 271159 299875 319678 351665 350794 325460 339471
12538C39471n971J1581K9176Q735K2887j1193n760J0756J9401K6730k3996J6647
$$ 339471 333500 345081 374257 382992 405879 394686 388926 399682 419083 445813 421817 438464
12526D38464q185k1834j7581k4210J1007j0349j7079J0547N060M762p363j2206
$$ 438464 430279 408445 390864 366654 377661 367312 350233 360780 365840 370602 363239 351033
12514C51033J878J1639k529m1030L925O349Q485j4642k1642n376j4199J5327Q666
$$ 351033 352911 364550 362021 320991 324916 331265 339750 325108 303466 298090 283891 299218 307884
12501C07884J0742J7978k313j7640j1236Q492o89J3765O816j2813R645r271k277
$$ 307884 318626 336604 334291 316651 305415 313907 313218 326983 333799 320986 330631 321360 319083
12488C19083J9299K7699O550K501k1266k3092j9206q985j290J9924J2827L208
$$ 319083 338382 366081 372631 375132 353866 330774 311568 302583 301293 321217 334044 337252
12476C37252k4996J1722L9830K0910P20R293K0942L596l0876l2767K960n083o978
$$ 337252 312256 323978 363808 384718 385438 394731 415673 419269 388393 355626 358586 353503 346525
12463C46525K0268L1163p488M252Q719k897o43k1464K847K3045L7637k220j6005
$$ 346525 366793 397956 390468 394720 403439 400542 399899 378435 381282 404327 441964 439744 423739
12450D23739N344l32O78P700j941K577K0975O157o366m557K284k0965r355o424
$$ 423739 429083 428751 429429 437129 435188 437765 458740 464897 458531 453974 456258 435293 425938 419514
12436D19514N806K5922r602l6858P28J3799J7967k718M4685J3071K828P810L6453
$$ 419514 425320 451242 441640 404782 405510 419309 437276 434558 479243 492314 495142 502952 539405
12423E39405K1323k6255L8435M3707M0726J7328L8995L8229P1379M1827N0888
$$ 539405 560728 534473 572908 616615 657341 674669 713664 751893 823272 865099 915987
12412I15987M8135N007M0612Q0647J01996P7579P0963O9896O5334M3606k2183
$$ 915987 964122 969129 1009741 1090388 1192384 1269963 1340926 1410822 1476156 1519762 1497579
12401A497579j16175j10350o4244j00508j27533j05091p5188n4697j5526l0447
$$ 1497579 1381404 1271054 1206810 1106302 978769 873678 798490 743793 728267 697820
12391F97820k6256k0537k7145k8399K5629K1095j2111M743J5395J3150J5936J5267
$$ 697820 671564 651027 623882 595483 621112 642207 630096 634839 650234 663384 679320 694587
12379F94587M301k1135J151J6004j1373L1937M21J6678L0059K346J5769k662k114
$$ 694587 698888 677753 678904 694908 683535 715472 715893 732571 762630 764976 780745 778083 775969
12366G75969L4495J2735j8215j2028K3047M865p750k739K1325L2741O989R959
$$ 775969 810464 823199 804984 792956 816003 820868 813118 810379 831704 864445 871434 881393
12354H81393j408k750J6781J219m841K5444K9939J7805K2214K770j0033K2173
$$ 881393 879985 877235 894016 895235 890394 915838 945777 963582 985796 988566 978533 1000706
12342A000706M9959K0494L0962M6207M7609R872K4397M8666M2365N7245N3222
$$ 1000706 1050665 1071159 1102121 1148328 1195937 1205809 1230206 1278872 1321237 1378482 1431704
12331A431704J2443K812j1735L9577R3666L6466L9139K8216N3882N0080M0627
$$ 1431704 1444147 1446959 1435224 1474801 1568467 1604933 1644072 1672288 1726170 1776250 1816877
12320A816877O3820P4262O3387O4892R8213J29757J19150J33595J60657J47456
$$ 1816877 1880697 1954959 2018346 2083238 2181451 2311208 2430358 2563953 2724610 2872066
12310B872066J36634K37044K35226K62930L74623M04518N15034N98080O06543
$$ 2872066 3008700 3245744 3480970 3743900 4118523 4523041 5038075 5636155 6242698
12301F242698O73911O81558P18191O86693O09788O17490P19957R21158J166183
$$ 6242698 6916609 7598167 8316358 9003051 9612839 10230329 10950286 11871444 13037627
12292A3037627J452646J811900K322816K977466L916400N246379P175634J0066185
$$ 13037627 14490273 16302173 18624989 21602455 25518855 30765234 37940868 48007053
12284D8007053J4160771J9416025K5289792L0607751L4279958L4064260K6487775
$$ 48007053 62167824 81583849 106873641 137481392 171761350 205825610 232313385
12277B32313385J3827039K610119q150825k1243131l1312334l3985976l1634466
$$ 232313385 246140424 248750543 240599718 219356587 188044253 154058277 122423811
12270A22423811k7131578k1661388j6267138j1800783q535236o318368m752658
$$ 122423811 95292233 73630845 57363707 45562924 37027688 30709320 25956662
12263B5956662l658599k879515k309991j850229j483580j159511r24834p56568
$$ 25956662 22298063 19418548 17108557 15258328 13774748 12615237 11690403 10933835
12255A0933835o24471n44859n32535n49711n74892n56558n52073n61469n34031
$$ 10933835 10309364 9764505 9231970 8682259 8107367 7550809 6998736 6437267 5903236
12246E903236m71387m41815l88581l11324k59915k45492k10018j89821j44960
$$ 5903236 5431849 4990034 4601453 4290129 4030214 3784722 3574704 3384883 3239923
12237C239923j07753j06759j09968j60557j25514r0046n7174m5416o6289o1143
$$ 3239923 3132170 3025411 2915443 2754886 2629372 2539326 2482152 2436736 2370447 2309304
12227B309304n8973q1271n7572o0331p2661j8128J14j9259n1423j9681j7708n5394
$$ 2309304 2250331 2169060 2111488 2051157 1978496 1960368 1960482 1941223 1889800 1870119 1852411 1797017
12215A797017n9864l1704K371j0227j7182k1091R606j1705n5006n1671q101J6895
$$ 1797017 1737153 1705449 1707820 1697593 1680411 1659320 1668926 1657221 1602215 1550544 1542443 1559338
12203A559338j0389j2091k1134j4711l4625j2820j8148k9112j4230k1091j2739
$$ 1559338 1548949 1536858 1515724 1501013 1466388 1453568 1435420 1406308 1392078 1370987 1358248
12192A358248J7934K1406j8543l1294J475P487m272K156J2766O297p758j0508
$$ 1358248 1376182 1397588 1379045 1347751 1349226 1356713 1352441 1354597 1367363 1373660 1365902 1355394
12180A355394J2579L1037N163J4242j7028k5159j3905Q824Q124L933J2756n235
$$ 1355394 1367973 1399010 1404173 1418415 1401387 1376228 1362323 1371147 1379271 1383204 1395960 1390725
12168A390725J630P509O063K5202J2591k0386J5168J5149n383j3940k6128j4975
$$ 1390725 1392355 1399864 1405927 1431129 1443720 1423334 1438502 1453651 1448268 1434328 1408200 1393225
12156A393225M63L9605N6427K3999J0698j6029l0785l0134m690O923k4021L627
$$ 1393225 1393688 1433293 1489720 1513719 1524417 1508388 1477603 1447469 1442779 1449702 1425681 1429308
12144A429308j5967j437j0061n448J738M1486M6521J3893j071j1437K5055L5147
$$ 1429308 1413341 1411904 1401843 1396395 1398133 1439619 1486140 1500033 1498962 1487525 1512580 1547727
12132A547727K3443J425J5315K7314Q096p113j60m226j2109m090Q342p937N842
$$ 1547727 1571170 1572595 1587910 1615224 1623320 1616207 1616047 1611821 1599712 1595622 1603964 1596027 1601869
12119A601869N36L486K8020J8013J6800N658k8574j2025L1659K0806L9197L7092
$$ 1601869 1602405 1605891 1633911 1651924 1668724 1674382 1645808 1633783 1665442 1686248 1725445 1762537
12107A762537R92k3445p918K4544J7345k4661j1777K9796R059K8556p93K0635
$$ 1762537 1763529 1740084 1732166 1756710 1774055 1749394 1737617 1767413 1776472 1805028 1804235 1824870
12095A824870J1895k2082l708L5869N82N545J4616J1193N1130N0429m403p661
$$ 1824870 1836765 1814683 1810975 1846844 1847426 1852971 1867587 1878780 1929910 1980339 1975936 1968275
12083A968275M715p870J7973J4216L4191M1806J3216o780L3632J1281J8768N389
$$ 1968275 1972990 1965120 1983093 1997309 2031500 2073306 2086522 2079742 2113374 2124655 2143423 2148812
12071B148812j4614L8903M0604K8117J3987j2023j6591K3519L3944j133J9964
$$ 2148812 2134198 2173101 2213705 2241822 2255809 2243786 2227195 2250714 2284658 2283525 2303489
12060B303489L5600K9866O163k667J8750K5407M146K8523K0794l390K3696K6200
$$ 2303489 2339089 2368955 2375118 2372451 2391201 2416608 2420754 2449277 2470071 2466681 2490377 2516577
12048B516577L6271k595J5760j614Q005K1230L7449K0969L1681L6684K0443L4365
$$ 2516577 2552848 2550253 2566013 2564399 2572404 2593634 2631083 2652052 2683733 2720417 2740860 2775225
12036B775225K3185K5195J9507K7959l0559J5785N6247L6512K4735K5633J7060
$$ 2775225 2798410 2823605 2843112 2871071 2840512 2856297 2912544 2949056 2973791 2999424 3016484
12025C016484P160J3719L2159M2161R710K5086K1401M4800O2710K5163O264M784
$$ 3016484 3023644 3037363 3069522 3111683 3121393 3146479 3167880 3212680 3275390 3300553 3306817 3311601
12013C311601K172K3053K0566M4831n875J7431M4958k471J4565M6057L3395L6587
$$ 3311601 3313773 3336826 3357392 3402223 3396348 3413779 3458737 3456266 3470831 3516888 3550283 3586870
12001C586870K5288L2855K2007N710J8368M925J5028L0048K0734L7675K6337j5787
$$ 3586870 3612158 3645013 3667020 3672730 3691098 3696023 3711051 3741099 3761833 3799508 3825845 3810058
11989C810058J0998N3392J2769R758M2865N3330K5877O915J7734L7571L9918K8321
$$ 3810058 3821056 3874448 3887217 3896975 3939840 3993170 4019047 4025962 4043696 4081267 4121185 4149506
11977D149506K812L0824L0296L5205K9093l461j2321J9602J3964J4357L1236K1489
$$ 4149506 4152318 4183142 4213438 4248643 4277736 4274275 4261954 4281556 4295520 4309877 4341113 4362602
11965D362602J5526K1076L959j4025M275R576K4642k601L894J4844O583K3317
$$ 4362602 4378128 4399204 4403163 4389138 4393413 4402989 4427631 4425030 4428924 4443768 4450351 4473668
11953D473668J1839o68J0502M329L4227l383J535k2458Q928L8243L0265n476k3533
$$ 4473668 4485507 4484839 4495341 4499670 4533897 4530514 4532049 4509591 4518519 4556762 4587027 4581551 4558018
11940D558018J6594N2346R684n001J373k0817j9655j3444j4236m398L106K3486
$$ 4558018 4574612 4626958 4636642 4631641 4633014 4612197 4592542 4579098 4564862 4560464 4563570 4587056
11928D587056K5856Q527k2659m0096k2331K7126k0791l1657R124l21k3800N499
$$ 4587056 4612912 4621439 4598780 4558684 4536353 4563479 4542688 4511031 4520155 4519834 4496034 4501533
11916D501533k1120k4456O099q033o803k1461k9781m556P203k508j15j379K5160
$$ 4501533 4480413 4455957 4462056 4454023 4447220 4425759 4395978 4391422 4398625 4396117 4396002 4394623 4419783
11903D419783o5588k9803k7038k5178j6011j2690j4169m3275R463k2203n2682
$$ 4419783 4354195 4324392 4297354 4272176 4256165 4243475 4229306 4186031 4195494 4173291 4120609
11892D120609J3810M324j3680j9808k6614j4154n83k1682l396L655m8378k1803
$$ 4120609 4134419 4138743 4125063 4105255 4078641 4064487 4063904 4042222 4038826 4042481 3994103 3972300
11880C972300j289j7043j3012p430J2734M1727O1727O3337R0715J41977J33745
$$ 3972300 3971011 3953968 3940956 3933526 3946260 3987987 4049714 4113051 4203766 4345743 4479488
11869D479488O0308M4780J6356R339p1819j42357j29470j50102j42821j36484
$$ 4479488 4539796 4584576 4600932 4610271 4538452 4396095 4266625 4116523 3973702 3837218
11859C837218j04569j29542q5065l6005l5103q1191m1248j5675o8118o0696j4705
$$ 3837218 3732649 3603107 3518042 3482037 3446934 3365743 3324495 3308820 3240702 3180006 3165301
11848C165301k2079j8149j9708l6288k1769k9552j9921k7011k7537k7635j8705
$$ 3165301 3143222 3125073 3105365 3069077 3047308 3017756 2997835 2970824 2943287 2915652 2896947
11837B896947l4903N835j5328n1481k9915l8202n5150j7916m6679k4803K86j5212
$$ 2896947 2862044 2867879 2852551 2801070 2771155 2732953 2677803 2659887 2613208 2588405 2588691 2573479
11825B573479j5907P169j2588l5785j8831j262m2254m9156l7810k1198q237k0965
$$ 2573479 2557572 2564741 2552153 2516368 2497537 2496275 2454021 2404865 2367055 2345857 2337620 2316655
11813B316655j6669j0459j4923k4133j4403j4720L004l2773J0071J1956j9925
$$ 2316655 2299986 2289527 2274604 2250471 2236068 2221348 2224352 2191579 2201650 2213606 2193681
11802B193681j5176k3987k3654k4210l6266j2977N078r626m5592n4602n923j3107
$$ 2193681 2178505 2154518 2130864 2106654 2070388 2057411 2062489 2052863 2007271 1952669 1946746 1933639
11790A933639m7284P980J7979K099m068j3010k8277n3885k8608n9j5495p243j8323
$$ 1933639 1886355 1894335 1912314 1914413 1910345 1897335 1869058 1815173 1786565 1786506 1771011 1763768 1745445
11777A745445m213j6642k0390j6750P58P281j1649N710k1277m312l767j7929j8508
$$ 1745445 1741232 1724590 1704200 1687450 1688208 1695489 1683840 1689550 1668273 1663961 1660194 1642265 1623757
11764A623757j1636l5061l6012j3956K0143k3908m5006L453L250J113q165m2561
$$ 1623757 1612121 1577060 1541048 1527092 1547235 1523327 1478321 1481774 1485024 1486137 1477972 1435411
11752A435411Q770K3160m5481k2412J1054o372m1502j9936J5300J0024l7850k873
$$ 1435411 1444181 1467341 1421860 1399448 1410502 1404130 1362628 1342692 1357992 1368016 1330166 1327293
11740A327293q641l739r592j3219k7337k4601j6220j2450k662L0792r924k8104
$$ 1327293 1318652 1314913 1305321 1292102 1264765 1240164 1223944 1211494 1208832 1239624 1229700 1201596
11728A201596j2512J1868K4529j4790j8117r931j7129j3243l1151k5224n710K0941
$$ 1201596 1189084 1200952 1225481 1210691 1192574 1182643 1165514 1152271 1121120 1095896 1090186 1111127
11716A111127J5770k0417j7840J5704j875l5832j4336Kn863j6009j9203k0042
$$ 1111127 1126897 1106480 1088640 1104344 1102469 1066637 1052301 1052303 1046440 1030431 1011228 991186
11704I91186j5945J6613O823k296j9518k0095l3178k149K5791L4689q523J1591
$$ 991186 975241 991854 998677 996381 976863 956768 923590 921441 947232 981921 973398 984989
11692I84989j9980k3212j8796l2200N504K258l005K0937m857p881r707K2430J710
$$ 984989 965009 941797 923001 890801 896305 898563 895558 916495 911638 903757 894050 916480 918190
11679I18190m409l6793O966K0700J3358l4492l0102L2210J7675m3470m3209o456
$$ 918190 913781 876988 883954 904654 918012 883520 853418 885628 903303 859833 816624 810168
11667H10168K4511J07o4025k8344L2643L4649m347j7512k2685M292J447l3598
$$ 810168 834679 834786 770761 742417 775060 809709 805362 787850 765165 769457 770904 737306
11655G37306m637j1021K9563M9969K7904L6296K3104L5158M6119R3120J34502
$$ 737306 732669 721648 751211 801180 829084 865380 888484 923642 969761 1062881 1197383
11644A197383J22144M8852m3725j15694j33513j03001n1059l4928p0994m4032
$$ 1197383 1319527 1368379 1324654 1208960 1075447 972446 921387 886459 815465 771433
11634G71433j0586o755j4716m081l0788j3218L889k3620O607K4822J3103m575
$$ 771433 760847 754092 739376 735295 704507 691289 695178 671558 678165 702987 716090 711515
11622G11515j6834k5470k3955j9648N040J6466K7748M255J8612l0079l3539k9334
$$ 711515 694681 669211 645256 625608 630648 647114 674862 679117 697729 667650 634111 604777
11610F04777j2868K0753k965J5713k2872j0368q806j6619j4194O593J5540j9965
$$ 604777 591909 612662 609697 625410 602538 592170 583364 566745 552551 559144 574684 554719
11598E54719J0746L988j3118K2944O424J3831o084k3004l7300k4681j417M221
$$ 554719 565465 569453 556335 579279 585703 599534 593450 570446 533146 508465 507048 511269
11586E11269K8513K0852j8243p225M966L0365J2326q617j8277n062k3206k9235
$$ 511269 539782 560634 542391 535166 540132 570497 582823 574206 555929 550867 527661 498426
11574D98426l1199K926l412K1885L4152p627k2314L911R243K0480j8507K003Q198
$$ 498426 467227 470153 466741 488626 522778 515151 492837 496748 505991 526471 507964 509967 518165
11561E18165k4538r395j5265j341J5393Q061R032j4319k3982N724J5065J591k1579
$$ 518165 493627 484232 468967 467626 483019 491080 500112 485793 461811 467535 482600 484191 462612
11548D62612m0865l440J3678J2786p188k353k7433K3142N0774J2512j5399o869
$$ 462612 421747 418307 431985 444771 437583 435230 407797 430939 481713 494225 478826 471957
11536D71957J3815M772j7197k2781k3384j5552r928K251l7289k733K5166Q107
$$ 471957 485772 490544 473347 450566 427182 411630 401702 403953 366664 363931 389097 397204
11524C97204J6670J5109m061q078j3070m914J8376L3842J8438k7610j1515J2436
$$ 397204 413874 428983 424922 416844 403774 398860 417236 451078 469516 441906 430391 442827
11512D42827J1737j7218l1251j7623k4999j0037K5640L2290K6137r955p045j8322
$$ 442827 454564 437346 406095 388472 363473 353436 379076 411366 437503 427548 420503 402181
11500D02181J6674q577j0228j5165k6842j6217M415k225q800J6246p362K6538
$$ 402181 418855 410278 400050 384885 358043 341826 346241 344016 335216 351462 344100 370638
11488C70638K64j5503m595J3183J2768j2393P82k619q76o931j5232M206K7157
$$ 370638 370902 355399 350804 363987 376755 364362 365144 362525 361649 354718 339486 343692 370849
11475C70849M360l0079k3670J5210J5754q471K8154N0482k364k2430k318L528
$$ 370849 375209 345130 321460 336670 352424 343953 372107 422589 420225 397795 395477 399005
11463C99005k381J9972L9070M0787L3389O3061J02911J51625J54343k3938j26373
$$ 399005 396624 416596 455666 496453 529842 592903 695814 847439 1001782 977844 851471
11452H51471j48728j23461r8434l4386k7800m1128k221l1579l611K974o159k937
$$ 851471 702743 579282 480848 446462 418662 377534 375313 343734 340123 343097 336938 334001
11440C34001J3453J837O519j1633j4107J1816k153R869k9748k4074M63j1223K5398
$$ 334001 347454 349291 355810 344177 330070 341886 339733 349602 319854 295780 296243 285020 310418
11427C10418k7672M664L57J8786J1666k9378l3145m47k883o498l604K9347J8908
$$ 310418 282746 287410 287767 306553 318219 288841 255696 255249 252366 245868 242264 271611 290519
11414B90519k6414k1452J7187O635K929J7790L723J2491k9409P293m788q068n341
$$ 290519 264105 242653 259840 266475 269404 287194 290917 303408 273999 281292 276504 268436 263095
11401B63095N338J6994J4700k4685k4846K7218L1857j4069m469J5540p328k28
$$ 263095 268433 285427 300127 275442 250596 277814 309671 295602 291133 306673 299345 299117
11389B99117o470j9601k7886j074J1232j2031M10l646l661j3149k0400J2072J7800
$$ 299117 292647 273046 245160 244086 255318 243287 243697 240051 236390 223241 202841 214913 232713
11376B32713k5922J1023K4461L011M3091l98p84j5440j805J8434j0721o70p009
$$ 232713 206791 217814 242275 245286 288377 287979 287195 271755 269950 288384 277663 276993 269984
11363B69984Q873J2098k3415l1283j2075j9374P942M0034J9766J0669M993q197
$$ 269984 278857 290955 267540 236257 224182 204808 212750 252784 272550 283219 288212 280015
11351B80015k341j3762n206J2871J4673k3563l556K607Q635o259k1070j5377j7463
$$ 280015 277674 263912 258706 271577 286250 262687 259131 261738 270373 264114 243044 227667 210204
11338B10204O480L0793K6603k2019Q60j5638j2011J1368j0664n828q907J4258
$$ 210204 216684 247477 274080 252061 252921 237283 225272 236640 225976 220148 211241 225499
11326B25499K2435k2844l2750L703K7851K3167J1553k0078J0411L066j090j5237
$$ 225499 247934 225090 192340 196043 223894 247061 258614 238536 248947 252013 250923 235686
11314B35686o60q21j3183j0453N704k0632P66r032J685j8658j616L5243Q706J0408
$$ 235686 235026 234205 221022 210569 216273 195641 196407 187375 189060 170402 168786 204029 212735 223143
11300B23143J9q101k3146J4112L3097J197k7785j5252o058J6458K3066M848k0632
$$ 223143 223162 215061 191915 206027 239124 240321 212536 197284 191226 207684 230750 235598 214966
11287B14966j1128J2660K223j0233J7417K2381L2619l447n720n59j3007j8113
$$ 214966 203838 216498 218721 208488 225905 248286 280905 277458 271738 271179 258172 240059
11275B40059k515j7460j3721j2090O086K0496J1924k3771j5083M877k2789J8235
$$ 240059 237544 220084 206363 194273 200359 220855 232779 209008 193925 198802 176013 194248
11263A94248M971Q165M521j2367j0030N020J2253J9696J8576N596j5888l7072
$$ 194248 199219 207384 211905 199538 189508 194528 206781 226477 245053 250649 234761 197689
11251A97689l867L292k4154M120J2050O863k5126j9434p24K4904N348P238O674
$$ 197689 193822 197114 172960 177080 189130 195993 170867 151433 150709 175613 180961 188199 194873
11238A94873M248j969m015k3200k464K694q51J3633L038K530M131K315K1367o117
$$ 194873 199121 197152 193137 169937 167473 170167 169316 182949 185987 188517 192648 194963 216330 210213
11224B10213l501J691j2926R105M993j3905L733O169p689J4913P763J1228R426
$$ 210213 206712 208403 195477 204582 209575 195670 199403 205572 197883 212796 220559 231787 241213
11211B41213j4196q689j9810M120J9333L453j4909Q815K1810n919j8475j6757
$$ 241213 227017 218328 198518 202638 221971 225424 210515 219330 241140 235221 216746 199989
11199A99989o57j666r091r586l231J965j4382R410K2479J3826P945L092m746m191
$$ 199989 199332 197666 188575 178989 175758 177723 163341 172751 195230 209056 217001 220093 215347 211156
11185B11156k1701J0059j1847k9269J7795L1589j2507J0571j787O468K033R698
$$ 211156 189455 199514 187667 158398 176193 207782 195275 205846 204059 210527 212560 222258
11173B22258J6434j3399l7502p786N62J7590Q708O251j6204l5705j1058L3580
$$ 222258 238692 225293 187791 180005 180567 198157 206865 213116 196912 161207 150149 183729
11161A83729P714r777K9098j9935L081N014j3464l2828J1835Q395q979K1355q78
$$ 183729 191443 181666 210764 190829 193910 198924 185460 152632 164467 172862 163883 185238 184360
11148A84360o298K5162O76j4769N929K768K4023j768P236K1227p814K7769K9253
$$ 184360 178062 203224 203900 189131 195060 197828 221851 220083 227319 248546 240732 268501 297754
11135B97754L781N808l8578r600M609K3542K3548l4197j9971k1723l5248K635
$$ 297754 301535 307343 268765 259165 263774 287316 310864 276667 256696 234973 199725 202360
11123B02360J026K4081K3062j7685k2062o187p633j4378m959P056K6770j219j591
$$ 202360 203386 227467 250529 232844 210782 204595 196962 182584 177625 184681 211451 210232 208641
11110B08641l1122l9781Q902J4193R621P808l736j5956K9902O635m556k5556n131
$$ 208641 177519 137738 146640 160833 170454 178262 174526 158570 188472 195107 190551 164995 159864
11097A59864L95J9350P521j7905n284K5739L47j1434l616p24K3393J9246N1932
$$ 159864 160259 179609 187130 169225 163941 189680 190027 178593 174977 174253 197646 216892 268824
11084B68824M8229K1654L0299K5154N2114Q4744N7834P7213O3036l187m7184l3115
$$ 268824 317053 338707 369006 394160 446274 531018 588852 666065 729101 725914 678730 645615
11072F45615o8037m2123m7096q3835n9467k8589j5600q863r628O115Q62k4737
$$ 645615 577578 535455 488359 404524 345057 316468 300868 292005 282377 288492 289354 264617
11060B64617l2902j8617K2257K5941M467j5018J0069J719j3620Q567K7226k902
$$ 264617 231715 213098 235355 261296 265763 250745 260814 262533 248913 257480 284706 281804
11048B81804K1052M1478K5079K1626M7906L0616M4107O5100J09458J51482K13501
$$ 281804 302856 344334 369413 391039 438945 469561 513668 578768 688226 839708 1053209
11037A053209K53460K61011L13447K92641J62766M4438J8323m3792k11560l07437
$$ 1053209 1306669 1567680 1881127 2173768 2336534 2380972 2399295 2355503 2143943 1836506
11027A836506l06488k90131k31616j68249j38391n5287j5852k117k2503m7931
$$ 1836506 1530018 1239887 1008271 840022 701631 646344 630492 628375 605872 557941
11017E57941o6299m7746J0729r530m5155j3186M1283K4179j6321l2335J1709j4753
$$ 557941 491642 443896 454625 445095 399940 386754 428037 452216 435895 403560 415269 400516
11005D00516l8994k6844L426J8526J1919Q400l7027j0168j5553k0740M743n0531
$$ 400516 361522 334678 338104 356630 368549 376949 339922 329754 314201 293461 298204 247673
10993B47673k3112r350j8280k0243M975L2152L9090O152k3250k5549l493j8716
$$ 247673 224561 215211 196931 176688 181663 213815 252905 259057 235807 210258 206765 188049
10981A88049M2648L1314j4260j1386o76L780R141j2009k8183o658K4262k994l7304
$$ 188049 230697 262011 247751 236365 235689 239469 248610 236601 208418 201760 226022 223028 185724
10968A85724J5300K3202m212J7702P217k8620j5923l980J4509J4719p832l0205
$$ 185724 201024 224226 220014 237716 244933 216313 200390 196410 210919 225638 217806 187601
10956A87601l9331L0492L8336J4256J7624n607k166L18j1365j7230k282q35k447
$$ 187601 148270 178762 217098 231354 248978 243371 241205 241523 230158 212928 210646 209811 207364
10943B07364J1763j6003j8720n955o68j5256p356N560J4086L757j4538J352O284
$$ 207364 219127 203124 184404 178449 177781 162525 155169 160729 174815 178572 164034 165386 171670
10930A71670j0584l4478k8107M988L7864q5K113K5103K2497j5682j2548l8733
$$ 171670 161086 126608 98501 103489 141353 141268 143381 168484 190981 175299 162751 124018
10918A24018q589J1434N515J1454L4808K3904n149j76j2932J3714L581K852K471
$$ 124018 115429 126863 132378 143832 178640 202544 197395 197219 184287 198001 201582 204434 206905
10905B06905k3255k5714K0872J8650j3777K3076K8436j2803M142R725j0175m569
$$ 206905 183650 157936 178808 197458 183681 206757 235193 222390 226532 236257 226082 221513
10893B21513J2288K3458m885j5944p305K7614J0717J3192K5761M1285P0183K9477
$$ 221513 233801 257259 252374 236430 229125 256739 267456 280648 306409 347694 417877 447354
10881D47354K1665J3209Q741J3763J2201n4537l8786l8643k3832l5115m1329j3869
$$ 447354 469019 482228 490969 504732 516933 462396 423610 384967 361135 326020 284691 270822
10869B70822n574l394O599Q40J1015k671k0785r761L752K4859J0730j282k834
$$ 270822 265248 261854 268453 269293 280308 277637 256852 247091 250843 275702 286432 285150 282316
10856B82316K4697Q634j5693k4611k080R662O820K040J9002J5089J6371m3399
$$ 282316 307013 315647 299954 275343 273263 282925 289745 291785 310787 325876 342247 298848
10844B98848m7953J3840j2954m394K722J5560J5362K0514N711J5539j2180j006
$$ 298848 250895 264735 251781 247387 250109 265669 281031 301545 307256 322795 310615 309609
10832C09609J8693J9740K6340m6945l0631K3202J2317O384l1130L327K9271P696
$$ 309609 328302 348042 374382 327437 296806 320008 332325 338709 307579 310906 340177 347873
10820C47873o447j6072K1961K9696j3847l4387j444j6254l1824N031P524j7165
$$ 347873 341426 325354 347315 377011 363164 328777 327333 311079 279255 284286 291810 274645
10808B74645J1121L1061q533j768J7749j130P631o495J9909L0980J7985n666J8015
$$ 274645 285766 316827 308294 306526 324275 323145 330776 324281 344190 375170 393155 387489 405504
10795D05504Q984k6524r519J4418K1361j7589k0278j3579J0231J4494K907Q883
$$ 405504 414488 387964 378445 392863 414224 396635 376357 362778 373009 387503 390410 399293
10783C99293Q872n127l4982k2359q057q56j429k2992k6693n478N2247M0358M7637
$$ 399293 408165 403038 368056 345697 337640 336784 335355 312363 285670 280192 332439 372797 420434
10770D20434M3826K3401O4603R9945J44037J68781J53880j8829j21182q1689l5454
$$ 420434 464260 487661 552264 652209 796246 965027 1118907 1100078 978896 897207 861753
10759H61753j8648N5756J09831J12496J73085J65719J38997N0026K9618K1717
$$ 861753 843105 898861 1008692 1121188 1294273 1459992 1598989 1649015 1678633 1700350
10749A700350o1784j44329j70289j54192j23094r6557j01882q4502m2949m9651
$$ 1700350 1638566 1494237 1323948 1169756 1046662 950105 848223 763721 720772 671121
10739F71121l0132P18n2300j0225m969J0248J0202K4629L2256L397n064R174l290
$$ 671121 640989 641707 589407 579182 574213 584461 594663 619292 651548 654945 649881 659055 655765
10726F55765j1197n319m278J7356K2631K4450K7167M2459M6587J0027L5548K7335
$$ 655765 644568 639249 634971 652327 674958 699408 726575 769034 815621 825648 861196 888531
10714H88531R61Q847K8160L7416j957M4638K0949k9232l0873K270K1530L611J7553
$$ 888531 889492 898339 926499 963915 961958 1006596 1027545 998313 967440 969710 991240 994851 1012404
10701A012404j0753j527j1906m5274l773N1887N1980J5381J2181L5899O5657M4884
$$ 1012404 1001651 1000124 988218 942944 939171 991058 1043038 1058419 1070600 1106499 1172156 1217040
10689A217040P077M0858K3166J2426L1811N0018M6149K3292J1782L7304N1231
$$ 1217040 1224117 1264975 1288141 1300567 1332378 1382396 1428545 1451837 1463619 1500923 1552154
10678A552154P0418O6793M4666M6199N3564Q1414P1252P8771J16866J07351J13119
$$ 1552154 1622572 1689365 1734031 1780230 1833794 1915208 1986460 2065231 2182097 2289448 2402567
10667B402567J15509J67564K15101K39292K63972L23075L78152M29213M14003
$$ 2402567 2518076 2685640 2900741 3140033 3404005 3727080 4105232 4534445 4948448
10658D948448M03081L89552L66887L42191L83834L94813M41571M89335N68979
$$ 4948448 5351529 5741081 6107968 6450159 6833993 7228806 7670377 8159712 8728691
10649H728691N81467N43831N94121P17928P28749P57757R92932J352926J791199
$$ 8728691 9310158 9853989 10448110 11166038 11894787 12652544 13645476 14998402 16789601
10640A6789601K451507L313651M406321N517599O592884Q371043J1947109J7955304
$$ 16789601 19241108 22554759 26961080 32478679 39071563 47442606 59389715 77345019
10632G7345019K6428312L6391649M4998139N1497687N8024784N5154846L0794272
$$ 77345019 103773331 140164980 185163119 236660806 294685590 349840436 380634708
10625C80634708O827098J522610j1561175m0839717n6819257n4417446m8506570
$$ 380634708 387461806 388984416 377423241 336583524 279764267 225346821 176840251
10618A76840251m1713152l2262414k2542973j4838731r674918o798773n587238
$$ 176840251 135127099 102864685 80321712 65482981 55808063 49009290 43422052
10611D3422052n050062m440636l580142k501892j346360j44139J208105K585378
$$ 43422052 38371990 33931354 30351212 27849320 26502960 26358821 27566926 30152304
10603C0152304L830586M099454K586217j14762k529329l558021l299165k192338
$$ 30152304 33982890 38082344 40668561 40553799 38024470 34466449 31167284 28974946
10595B8974946q34168O66917K304777L980220N238295N184083K687873j504122
$$ 28974946 28140778 28807695 31112472 35092692 40330987 45515070 48202943 46698821
10587D6698821m844467n829222n050509l557737j987149n26218Q63506K124533
$$ 46698821 41854354 36025132 30974623 27416886 25429737 24903519 25767025 27891558
10579B7891558K961034K648012O56484k187787m195539m591479l828070k724846
$$ 27891558 30852592 33500604 34157088 31969301 27773762 23182283 19354213 16629367
10571A6629367j685393q15229m7664N24981P54065M75932l41389j421006k134682
$$ 16629367 14943974 14128745 14081081 14606062 15360127 15836059 15494670 14073664 11938982
10562A1938982k247255j940709j534397j166375q45020o17556m74204l41521k58282
$$ 11938982 9691727 7751018 6216621 5050246 4205226 3587670 3113466 2771945 2513663
10553B513663k02065j98019j75624j46175j36803j19421j06316q7791o7578p5924
$$ 2513663 2311598 2113579 1937955 1791780 1654977 1535556 1429240 1341449 1273871 1197947
10543A197947j01150n9422L893j5787k8668l6321o0878k7786P576k2820k4761
$$ 1197947 1096797 1037375 1041268 1025481 996813 960492 899614 871828 879404 856584 831823
10532H31823l1017j3355L375k4416j8328j5015m0792k3602j7488K692J9475K457
$$ 831823 800806 787451 790826 766410 748082 733067 692275 668673 651185 653877 673352 675809
10520F75809j4725J4687K4605J5976j8954K528k4993J5049P74J9834L3352m076
$$ 675809 661084 675771 700376 716352 697398 699926 674933 689982 690756 710590 743942 739866
10508G39866J3442K2462k4445k179K7439n527M2053K1869o1179k1925j1949o8314
$$ 739866 753308 775770 751325 749146 776585 771058 813111 834980 773801 751876 739927 671613
10496F71613o2758n4281m1025j8409j5478o4642m3242Q110L6533j8838j7358J2767
$$ 671613 608855 554574 513549 495140 479662 415020 371778 379888 416421 397583 380225 392992
10484C92992J3539O470Q528K0950K959L4112P00n781p224K701J8349K2139j9543
$$ 392992 406531 413001 421529 442479 445438 479550 480250 474469 467245 469946 488295 510434 490891
10471D90891n5856n4310j9280r407o786l800k1089j0885R707P729j8258l718J9637
$$ 490891 435035 380725 361445 352038 345252 341452 320363 309478 319185 326914 308656 304938 324575
10458C24575K541k4505r239J7938k281J8267n805k474J2004k3002L832K620K2342
$$ 324575 327116 302611 293372 311310 309029 327296 321491 319017 331021 308019 311851 314471 336813
10445C36813J6511k2301K788K3686J6487j0209j3135j7966k4814m2142r494n566
$$ 336813 353324 331023 333811 357497 373984 363775 350640 332674 307860 265718 256224 250658
10433B50658j5798J0835J0782O560R136K7793J6066p722j4766L9266K2970J5608
$$ 250658 234860 245695 256477 263037 272173 299966 316032 308310 293544 332810 355780 371388
10421C71388j7062l8960j0680k9452p547J8642K3248r146J003J6713R125J8242
$$ 371388 354326 315366 304686 275234 267687 286329 309577 300431 301434 318147 327272 345514
10409C45514j1208k4010r999k1382O574j7634p416k056q184k9594q980J1311J4289
$$ 345514 334306 310296 300297 278915 285489 267855 260439 258383 250199 220605 211625 222936 237225
10396B37225K1268J7274J3531J3490J9556K836J2963K1142K9644L2347O0231L1471
$$ 237225 258493 275767 289298 302788 322344 325180 338143 359285 388929 421276 481507 512978
10384E12978P0249R0749R3011J53017J58097J36599J14405P8901M4554M3767j7977
$$ 512978 583227 673976 766987 920004 1078101 1214700 1329105 1408006 1452560 1496327 1478350
10373A478350p9180p9239q2130j07743j34158j12416o9176m8328k8867m2580l2314
$$ 1478350 1399170 1319931 1237801 1130058 995900 883484 814308 765980 737113 694533 662219
10362F62219l3811l3808l5992l0324J887K4266J8636p143j0781J0816j736N157
$$ 662219 628408 594600 558608 528284 530171 554437 573073 565930 555149 565965 564229 569386
10350E69386L3993r626k0055K0113J1717M2456M0598L6018M227J4972R633M634
$$ 569386 603379 593753 573698 593811 605528 647984 688582 724600 728827 743799 753432 758066
10338G58066J3566J1820j1751K7362L86l1148K2995M6160J0138j0416J3333L0873
$$ 758066 771632 783452 771701 799063 799449 768301 791296 837456 847594 837178 850511 881384
10326H81384K3321J7641J8337J2296L27o9L4695K3268K2535J9878K0089L0242
$$ 881384 904705 922346 940683 952979 953306 953237 987932 1011200 1033735 1053613 1073702 1103944
10314A103944M0555K5005K7831K2081M2193L3132K0038L3944J8025K4372L5334
$$ 1103944 1144499 1169504 1197335 1219416 1261609 1294741 1314779 1348723 1366748 1391120 1426454
10303A426454M4224M4872O6683O2478N8280N9116O5813M7481N6053O3831P6944
$$ 1426454 1470678 1515550 1582233 1644711 1702991 1762107 1827920 1875401 1931454 1995285 2072229
10292B072229R5949Q6389Q4578J42134J34948J23135J27342J72032J85743K00431
$$ 2072229 2168178 2254567 2339145 2481279 2616227 2739362 2866704 3038736 3224479 3424910
10282C424910J97337K41651K78238L18157L95751N09715O11461O83398P43115
$$ 3424910 3622247 3863898 4142136 4460293 4856044 5365759 5977220 6660618 7403733
10273G403733Q78882R86005J042773J110601J216801J346995J471477J745367
$$ 7403733 8282615 9268620 10311393 11421994 12638795 13985790 15457267 17202634
10265A7202634K141352K647944L483858M721117O475823R132877J2874231J7811400
$$ 17202634 19343986 21991930 25475788 30196905 36672728 45805605 58679836 76491236
10257G6491236K3845290L0900210L7982358M2146944M2923287M2417192L5526547
$$ 76491236 100336526 131236736 169219094 211366038 254289325 296706517 332233064
10250C32233064J8666497M162505n196367k0447892l6180546m1854119m2227133
$$ 332233064 350899561 355062066 349865699 329417807 293237261 251383142 209156009
10243B09156009m1325946l6948710l0079924k3403343j7677525j2921360r267117
$$ 209156009 167830063 130881353 100801429 77398086 59720561 46799201 37532084
10236C7532084o649025m886737l630084k788664k171953j780689j443854j223699
$$ 37532084 30883059 25996322 22366238 19577574 17405621 15624932 14181078 12957379
10228A2957379j076750r72999q73129q39850q08415p47241o64363n69998m98002
$$ 12957379 11880629 10907630 10034501 9194651 8386236 7638995 6974632 6404634 5906632
10219E906632l93061k40949j12143k2773l434K1376q4864j74107j92479k93361
$$ 5906632 5513571 5272622 5160479 5137706 5134272 5155648 5070784 4896677 4704198 4410837
10209D410837l88915m06991l83745l35810l28112k64738k32525j45474j05271
$$ 4410837 4021922 3614931 3231186 2895376 2567264 2302526 2070001 1924527 1819256
10200A819256j09283j15974j16266q5409o6675q1629m9719l7504k7393m8791o1693
$$ 1819256 1709973 1593999 1477733 1392324 1325649 1244020 1194301 1156797 1129404 1080613 1018920
10189A018920l3582k9280q945k975O077k3446k9225l1442m7126j9910K0741J9317
$$ 1018920 985338 956058 947113 944138 950215 926769 897544 866102 818976 799066 819807 839124
10177H39124J6826m2271o2057o7476n8083j991j6780o497l0473m8367K3992J6880
$$ 839124 855950 813679 751622 684146 626063 624072 607292 600795 570322 521955 545947 562827
10165E62827J8806J7916K076l8943j6613N358P472k0640j0541L2770M6702J8309
$$ 562827 581633 599549 601625 562682 546069 551427 558899 538259 527718 560488 607190 625499
10153F25499K0589J7020k4596l5365j990k6980j5700l8586k3521j300j7727r23
$$ 625499 646088 663108 638512 603147 601157 574177 558477 519891 496370 495070 477343 476420
10141D76420K7370J0088n976m2067l6302j9385j2020j9219l9914l819K6349J0852
$$ 476420 503790 513878 507902 465835 429533 410148 398128 378909 338995 335176 361525 372377
10129C72377J3966l721o841l0084l4672j4269J9431m3230m8408r424l278r833
$$ 372377 386343 382622 375781 345697 311025 296756 316187 272957 224549 215125 211847 202014
10117B02014n688j8661k3923K2315K2202l4420k8222L06J2131j0972p295m515
$$ 202014 196326 177665 153742 176057 198259 163839 135617 135923 148054 137082 129787 125272
10105A25272J7960p04k953K4993J4124M3069L2882j3300j6497N234k3588m2094
$$ 125272 143232 142528 139575 164568 178692 221761 254643 241343 224846 230080 206492 164398
10093A64398o1607j4688J6479p090k3996j3038k839J1247k843L6185L56J3247
$$ 164398 102791 88103 104582 97492 73496 60458 57619 68866 66023 102208 102564 115811
10081A15811j3603J4630l754l860p496l4448K7837j078J3632J9126k1665l7952
$$ 115811 102208 116838 113084 109224 101728 67280 95117 94039 107671 126797 105132 67180
10069F7180k0359k0233P368K1076K8052r440j6261k175l472j5793j3565N981q766
$$ 67180 46821 26588 33956 55032 83084 73644 57383 55208 51736 35943 22378 28359 19593
10056A9593N632J6116P229K8933j948K6598Q90j0062k3661j7743K7564O811k2752
$$ 19593 25225 41341 48570 77503 75555 102153 103043 92981 69320 51577 79141 85952 63200
10043F3200k1505k3283k3947J3809K6814m795j8239k0976J4238N1009Q65J8163
$$ 63200 41695 18412 -5535 8274 35088 30293 12054 -8922 5316 56325 57190 75353
10031G5353K779j0601N212J396O078l4326l2042k995l011j9597p380J4801K2179
$$ 75353 78132 67531 72743 74139 80217 45891 13849 10854 7843 -11754 -19134 -4333 17846
10018A7846o223j9255K4539L7538j1332k3976J1808n384j1320J9668J6951L3671
$$ 17846 11623 -7632 16907 54445 43113 19137 30945 25561 14241 33909 50860 84531
10006H4531J7803l0313m2550j4919J6493j3031k3254l1421J7979L8796M3787K8687
$$ 84531 102334 72021 29471 14552 31045 18014 -5240 -36661 -18682 20114 63901 92588
9994I2588l5800j8608l088O316K260J5663j9573J5455K3453k1581l625o958j5308
$$ 92588 56788 38180 35092 41408 43668 59331 39758 55213 78666 57085 53460 46502 31194
9981C1194k637j6545k2470J8231L756J0397J4322J9875K3082J5767n101m9869
$$ 31194 28557 12012 -10458 7773 11529 21926 36248 56123 79205 94972 89871 40002
9969D0002j4888L7742K633k5706l307K5090q327j3965k7230l7156J614L0945J4587
$$ 40002 25114 62856 65489 39783 36476 61566 53239 39274 12044 -25112 -23498 7447 22034
9956B2034l736R05K645P174J6805q985P142o285J4680J2744J7341O806j5219l2381
$$ 22034 18298 19203 21848 29022 45827 36842 43984 37699 52379 65123 82464 89270 74051 41670
9942D1670K5215R305j6074L6022J5653J4663M23j5691l4512j6065J0210L0972
$$ 41670 66885 76190 60116 96138 111791 126454 126877 111186 76674 60609 70819 101791
9930A01791J2395M0327j2493m9529k7308n477k1674O20M4715R509j8411J3025
$$ 101791 114186 154513 142020 92491 65183 59706 38032 38652 83367 92876 74465 87490
9918H7490M8272N0932N6624J20931J74517K62440J23117j43507k35931k11688
$$ 87490 135762 186694 243318 364249 538766 801206 924323 780816 544885 333197
9908C33197j12273m3054n2993l9346L848L4338k5915m9351k4558K1175N978m4185
$$ 333197 220924 177870 124877 85531 89379 123717 97802 48451 23893 45068 51046 6861
9896F861J1968J7097k748j8050J7715M999J9536N3655J1546j0127l0945j6601
$$ 6861 18829 35926 33178 15128 32843 37842 57378 111033 122579 112452 81507 64906
9884F4906k3314k5718M6028J7166J5867p606l1422k5416j4643L556L2704k8J6120
$$ 64906 41592 15874 61902 79068 94935 87329 55907 30491 15848 19404 52108 52080 68200
9871F8200q542k700k022J0643O027P569k8908j9887k5591L7699L9201j1936l6094
$$ 68200 59658 56958 54936 65579 71606 79175 50267 30380 4789 42488 81689 69753 33659
9858C3659k2277L2688J1551k998N0058J1280Q050K3566q130M4842M5083O9293
$$ 33659 11382 44070 55621 52623 102681 113961 122011 145577 137447 182289 227372 296665
9846B96665J22104J37203J11785J58660K17170K18032J99826K02127J63967M8376
$$ 296665 418769 555972 667757 826417 1043587 1261619 1461445 1663572 1827539 1875915
9836A875915Q245p5259j71051k00978k14254k13020k13981j97520j40590j10979
$$ 1875915 1884160 1808901 1637850 1436872 1222618 1009598 795617 598097 457507 346528
9826C46528o2925l1791l5427m6718m8642k3745L2572o254k3379l2039k0162r161
$$ 346528 283603 251812 216385 169667 121025 97280 129852 123598 100219 68180 48018 38857
9814C8857p486j7815K0866J5064j4081j547m40k6056m5489N818J0575J3641k5360
$$ 38857 31371 13556 34422 49486 35405 33858 33418 7362 -38127 -32309 -21734 -8093 -33453
9801c3453O987K1026K0325L657N289J8262M299k0166j3492r664J4100L36l403
$$ -33453 -26466 -5440 14885 18542 23831 42093 46392 26226 12734 3070 17170 17506 14103
9788A4103l0915o77N011N404J9331J7235O720L89J945J7600J2296k0085l3937
$$ 14103 -16812 -17489 -12478 -7074 12257 29492 36212 36601 38546 56146 68442 48357 14420
9775A4420M475K707m630m543J2458K0302k1743k2902k0685R000L7297K0124l7790
$$ 14420 18895 21602 16972 12429 24887 45189 23446 544 -20141 -11141 26156 46280 8490
9762H490k3647K6148M617O940k8044k587K5179J3599k741j7592p631k109m644
$$ 8490 -15157 10991 15608 22548 -5496 -8083 17096 30695 27954 10362 2731 622 -4022
9749d022k1614P825K1197o555l116J5316m7064j0479L1588K0273J8834J726m851
$$ -4022 -25636 -17811 3386 -3169 -6285 9031 -38033 -48512 -16924 3349 22183 23909 19058
9736A9058r378l3502k2290K153L0046N970j600L0845L844p936Q85M292M416j0746
$$ 19058 9680 -23822 -46112 -43959 -13913 -7943 -9543 21302 25146 17210 18095 22387 26803 16057
9722A6057j2613j9890K3965k3609l4420j0229K2316M7701L8987k5164p003l3536
$$ 16057 3444 -16446 7519 -16090 -50510 -60739 -38423 9278 48265 23101 16098 -17438
9710a7438k7132J8990J9639O590N032J042j653m636k0062J0465J4246R325k1787
$$ -17438 -44570 -25580 -5941 649 5681 6723 5070 434 -19628 -9163 5083 14408 -7379
9697g379k1276L527J6371J0551J788K821J758K4849K3658j2842k2611k1632R022
$$ -7379 -28655 -25128 -8757 1794 3582 6403 8161 33010 56668 43826 21215 -417 8605
9684H605j5348n08K0922r035R474K3562O013r131K107J3554j1322k2077l0720
$$ 8605 -6743 -7251 13671 4636 14110 37672 43685 34554 36661 50215 38893 16816 -13904
9671a3904R602p770k3000J2520j7302J475o356K2751L285M178J1325k4535J4957
$$ -13904 -4302 -12072 -35072 -22552 -39854 -38379 -44735 -21984 -18699 -14521 -3196 -27731 -12774
9658a2774L0068L722Q577n728n981L5330M8704N0100L4255M829m2487n5213j1083
$$ -12774 17294 21016 29593 23865 17884 53214 101918 152018 186273 191102 148615 93402 82319
9645H2319k5308k3979J6105q943J0209l6468k9499l316L491j22m537J3824J7449
$$ 82319 57011 33032 49137 40194 50403 13935 -15564 -18880 -15389 -15511 -20048 -6224 11225
9632A1225K6052j0513m8456k3407O133Q933j559K5430o150j5466K328O471J1116
$$ 11225 37277 26764 -21692 -45099 -38966 -30033 -31592 -6162 -12312 -27778 -25450 -18979 -7863
9619g863M521K271m214K104j8009J4167J536l2662k3769K3416K9603K5107p675
$$ -7863 -3342 -1071 -5285 -3181 -21190 -7023 -5487 -38149 -61918 -38502 -8899 16208 8533
9606H533l0147l653J1468J0985Q311l038o227j918j7177K1447K6680q679q075
$$ 8533 -21614 -25267 -13799 -2814 5497 2459 -3768 -5686 -22863 -1416 25264 16585 8510
9593H510j2678K358L059l8864k2969Q769M2497L3350M257L997M952k9703O5J7962
$$ 8510 -4168 -1810 1249 -37615 -60584 -51815 -9318 24032 28289 32286 37238 7535 7600 25562
9579B5562k4398L181J3460J2869k260k4357J723K8311K390p949r287j399K702
$$ 25562 1164 4345 17805 30674 28414 4057 5780 34091 36481 28532 19245 17846 20548
9566B0548k2047j0498K5850j298j4509N516K8638J1392R568j2872r49j5217j5743
$$ 20548 -1499 -11997 13853 12555 -1954 3562 32200 43592 53160 40288 39339 24122 8379
9553H379k2728j6017L287j0636P037K2849p449K8300J4162k0367M141J5011k3724
$$ 8379 -14349 -30366 -27079 -37715 -30678 -7829 -15278 13022 27184 6817 10958 25969 2245
9540B245l5550P521P965j6130l268J1470Q22J6451N438j5652J6968J6954k2129
$$ 2245 -33305 -25784 -17819 -33949 -37217 -25747 -24925 -8474 -3036 -18688 -1720 15234 -6895
9527f895j0451J2166J3103P939P289j0641q331Q619j1616m491J8967k1583l503
$$ -6895 -17346 -5180 7923 15862 23151 12510 4179 12798 1182 -3309 15658 -5925 -9428
9514i428P053n380J0364J0158J0426K0553j8032j7157L9316J2062j8604n108P576
$$ -9428 -2375 -7755 2609 12767 23193 43746 25714 8557 47873 59935 41331 36223 43799
9501D3799k5658l7694k1579j6964K0774l60J2872n596J1567Q908k4160k1513m819
$$ 43799 18141 -19553 -41132 -58096 -37322 -37682 -24810 -30406 -18839 -9931 -34091 -55604 -60423
9488f0423j2096J8241J4639l722n501J5072O169J6082j6929j2964L2309J8951
$$ -60423 -72519 -54278 -39639 -43361 -48862 -33790 -27621 -11539 -28468 -41432 -9123 9828
9476I828j5795r227J3360P014L822j1969j1985q525J4503J6597q318l5988k5924
$$ 9828 -5967 -15194 -1834 5180 9002 -2967 -14952 -23477 -8974 7623 -695 -36683 -62607
9463f2607N0858M0347q015j5072K0259j2335k0207l0307o806Q46k295M3544J7010
$$ -62607 -11749 28598 20583 5511 25770 13435 -6772 -37079 -43885 -43039 -45334 -1790 15220
9450A5220k4417k7650j5704K8564K6260P636J54j3702j9449J975J5344o471k5402
$$ 15220 -9197 -36847 -52551 -23987 2273 9909 10063 -3639 -23088 -21113 -5769 -12240 -37642
9437c7642p479K0019J1902r08j0175r221j1564K708N711m21Q960k2607L3210L5642
$$ -37642 -45121 -25102 -13200 -14108 -24283 -33504 -45068 -42360 -36649 -37070 -28110 -50717 -17507 18135
9423A8135k8028j3857l611Q337J0009k9528q923J4906M8854L0513j4942j1158
$$ 18135 -9893 -23750 -27361 -19024 -9015 -38543 -47466 -32560 16294 46807 31865 20707
9411B0707J3691k1204K740M780m743j4125q503J833k0474j350J440K5564Q789
$$ 20707 34398 13194 15934 20714 15971 1846 -6657 -4824 -25298 -26648 -25208 356 9145
9398I145p802L4441M606k5323L5615J2196j8148l5852n175L1137l83j3982j2317
$$ 9145 1343 35784 40390 15067 50682 62878 44730 8878 3703 34840 34457 20475 8158
9385H158p751k6063m0618M533L0620j104K5263j2056N109J8145k347l381J3619
$$ 8158 407 -25656 -66274 -61741 -31121 -32225 -6962 -19018 -13909 4236 1889 -1492 12127
9372A2127P00j8742P994n591j3762K2151J8849j9292k3790k423M8339k3333j2429
$$ 12127 12827 -5915 2079 -3512 -17274 4877 23726 4434 -19356 -21779 26560 3227 -9202
9359i202L7559l363k3876N616k2524o975m196Q92l3961j6582R592K9325O17J439
$$ -9202 28357 24994 1118 6734 -15790 -22765 -26961 -26069 -60030 -76612 -67020 -37695 -37078 -35639
9345c5639j5277J2940L566J4265L253k606j7579O209K8009J6622o146j719P967
$$ -35639 -50916 -37976 -34410 -20145 -16892 -19498 -37077 -30868 -2859 13763 7617 5898 13865
9332A3865j1205k4309j3918R651J9604O461j3098m708K5598J7364j8423k5243
$$ 13865 2660 -21649 -35567 -25916 -6312 149 -12949 -17657 7941 25305 6882 -18361
9320a8361p87K5651j0725j66J1448O725J0283j9993n541j071J8772P450J487P873
$$ -18361 -19148 6503 -4222 -4388 7060 13785 24068 4075 -1466 -2537 16235 23685 25172 33045
9306C3045j1181k3004k7351k6513J5134L6998j6904j7159O1028J4034l7992K45
$$ 33045 21864 -1140 -28491 -55004 -39870 -2872 -19776 -36935 24093 38127 135 380
9294C80m957L704J096R314J6922j072n727K5139k0383m3295J7R580k246o436k8373
$$ 380 -4577 -873 223 9537 26459 25387 19660 44799 24416 -18879 -18862 -9282 -11528 -17964 -46337
9279d6337N815k4010j503K1470R918J5524K6247J4396r316o411o684K1753J9636
$$ -46337 -40522 -64532 -66035 -44565 -34647 -19123 7124 21520 12204 5793 -891 20862 40498
9266D0498k929j8586l808J2425L77M256j4011l9492K5301K7881p164j4480l1128
$$ 40498 37569 18983 15175 27600 27977 32233 18222 -21270 4031 31912 24748 10268 -20860
9253b0860l0137J1444J7208K0263L0737j8833j5623n677m106K4566J2477R302
$$ -20860 -50997 -39553 -22345 -2082 28655 9822 -5801 -11478 -15584 8982 21459 30761
9241C0761K26J1568J4168j340P406j6212j1277p118j7209k3665j739R279J589
$$ 30761 30987 42555 56723 55383 62789 46577 35300 28182 10973 -12692 -14431 -5152 -3563
9228c563p125r077p747K6360J2309K0525L1401L095k3425k598j8963n018j4815
$$ -3563 -10688 -19765 -27512 -1152 11157 31682 63083 66178 42753 40155 21192 16174 1359
9215A359k2633k8238k600L4564K4020m301j742j7171o821R768L7931r617K437
$$ 1359 -21274 -49512 -52112 -17548 6472 2171 429 -16742 -23563 -13795 24136 14519 16956
9202A6956M2783j2013j5322j6877l296m621L526j2146N987J2536P189l944k2078
$$ 16956 59739 47726 32404 15527 12231 7610 11136 -1010 4977 17513 24702 20758 -1320
9189a320k3525R966K5187J2495n14l474k374O147J8427O098j9122k5312j1471
$$ -1320 -24845 -14879 10308 22803 22289 18815 16441 22588 41015 47113 27991 2679 -8792
9176h792J2013J1396J8663p428k6093j9983J394L2290k728j3961O91J1672l97
$$ -8792 3221 14617 33280 25852 -241 -20224 -18830 13460 10732 -3229 -2538 9134 8737
9163H737N073J913L025L0586j8242l0600j3054M488K1708O061l0876R597q226
$$ 8737 13810 15723 18748 49334 31092 492 -12562 -8074 13634 19695 -11181 -1584 -9810
9150i810N12K0139q114r310k390J8884Q382j4217l898r09J4632J0629j1805J3891
$$ -9810 -9298 10841 2727 -6583 -8973 9911 18293 4076 178 -731 13901 24530 12725 26616
9136B6616K1527k0207j8375J1016J834M228J3760j0648j9822o472K7995K3026
$$ 26616 48143 27936 9561 20577 22411 26639 40399 29751 9929 3457 31452 54478
9124E4478Q789j8702o563L266l444k511J724l638k655J4994j4607k2792J603J6427
$$ 54478 63267 44565 38002 41268 37824 35313 37037 33399 30744 45738 31131 8339 9942 26369
9110B6369J7550j6287k2376J673o829j1252K8997J5780k0107k2866k2306K0239
$$ 26369 43919 27632 5256 6929 100 -11152 17845 33625 13518 -9348 -31654 -11415
9098a1415L0215p155r562K2021K0764P906j5467k8484l003L567P347O517K4526
$$ -11415 18800 11645 2083 24104 44868 52774 37307 8823 5820 9387 16734 23251 47777
9085D7777L385j1738Q523J1665p911k1528j5308L697k834J0518j261j6874m032
$$ 47777 51162 39424 47947 59612 51701 30173 14865 18562 15728 26246 24985 8111 4079
9072D079J513K1805j385k4122l324K9274K514j4096j6807K981j1150k492j5752
$$ 4079 5592 27397 26012 1890 -1434 27840 30354 16258 -549 2432 -8718 -11210 -26962
9059b6962l027l481j1645K7103K953R906M171j116L3353P170K30j5866j7487J7328
$$ -26962 -29989 -33470 -45115 -18012 -15059 -5153 -982 -2098 31255 38425 38655 22789 5302 22630
9045B2630L4728K7378p71m8960l6257K7617O185j2297l4762j2086J1053q718K4132
$$ 22630 57358 84736 83965 35005 -1252 26365 32550 20253 -14509 -26595 -15542 -24260 -128
9032a28l749L8155K3368l0819k384P120k469n254j4648J1743J1323l7626O949
$$ -128 -3877 34278 57646 26827 24443 31563 29094 23840 9192 20935 32258 -5368 1581
9019A581N333j0917N61J3125J1745n037J0942J7488n23j5660j1180L383n781j1731
$$ 1581 6914 -4003 -3442 9683 21428 16391 27333 44821 44298 28638 17458 20841 15060 3329
9005C329L520K5794J776N516j1130l1167L2839K2727K798l0516l1171J0667J3117
$$ 3329 6849 32643 34419 39935 28805 -2362 30477 53204 56002 25486 -5685 4982 18099
8992A8099J2695k323j591k215j3120q044j3610K746p111r659o605j3130O37K106
$$ 18099 30794 28471 26880 24665 11545 3501 -10109 -7363 -14474 -24133 -30738 -43868 -43231 -41125
8978d1125K3057M150p999J2272L0483J581j6499k4351J1040K7535k196J4071K2969
$$ -41125 -18068 -13918 -21917 -9645 20838 22419 5920 -18431 -7391 20144 17948 32019 54988
8965E4988M860r270K2182k0556l5092j8120k23m029j205L352j210J0901J354j7362
$$ 54988 59848 50578 72760 52204 17112 -1008 -1231 -5260 -6465 -3113 -4323 6578 7932 -9430
8951i430J2206J0854j5436l192J5149J5028K855j23k1586j7530Q924J2411k811
$$ -9430 2776 13630 -1806 -4998 10151 25179 28034 27911 6325 -11205 -2281 10130 7319
8938G319j767j9353q128n816J1530m760l1622L5451M0112M348p845J1519K1198
$$ 7319 5552 -13801 -21929 -27745 -16215 -20975 -52597 -17146 22966 27314 19469 30988 52186
8925E2186q047r384j7600j5940o808J9424J2006J0069J4729j6398k4186j197l077
$$ 52186 44139 34755 17155 1215 -5593 13831 25837 35906 50635 34237 10051 8854 5777
8912E777n049j316j9138j056j0203J058J0355J5481p462K1619P227n849J8255
$$ 5777 728 -588 -19726 -20782 -30985 -29927 -19572 -4091 -11553 10066 17293 11444 29699
8899B9699j2015j0741k822p625o973P266J2108O45j0015N672K1021K5647N562
$$ 29699 17684 6943 4121 -3504 -10477 -3211 8897 9542 -473 5199 26220 51867 57429
8886E7429k7674k4862P785N626p336K428o53K1341J0178l4697P118K0730M261
$$ 57429 29755 4893 12678 18304 10968 13396 12743 34084 44262 9565 16683 37413 41674
8873D1674o725r951k358J3104k250l0171l0582l606K8282m882j3256K9406R800
$$ 41674 34949 24998 22640 35744 33494 3323 -27259 -30865 -2583 -7465 -20721 8685 18485
8860A8485n915r37K4312L667k739o843k4944L6136l429k9878p946R762J8201K3761
$$ 18485 12570 11633 35945 39612 36873 30030 5086 41222 37793 7915 -31 9731 27932 51693
8846E1693J0424k2537j7675l0609Q24J8503R158L3762J3009P676k7745p296J3497
$$ 51693 62117 39580 21905 -8704 -7880 10623 19781 53543 66552 74228 46483 39187 52684
8833E2684k6679l6036L295J6783O5J9873N700K8659j0615m9828j451L3287J2951
$$ 52684 26005 -10031 -6736 10047 10112 29985 35685 64344 53729 3901 2450 35737 48688
8820D8688P556o221j5147j937l674l4443Q932j6382o30J6885L4012l6710j3225
$$ 48688 56244 50023 34876 32939 29265 -5178 3754 -12628 -13258 3627 37639 929 -12296
8807a2296L0946K132k426l2069k916K8219N512M3579L1657k60J454L1588j6620
$$ -12296 18650 20782 18356 -13713 -16629 11590 17102 60681 92338 92078 93532 125120 108500
8794A08500l4120k8251l1557q640J3937K0446l858J219l0884j0091K2656K9745
$$ 108500 74380 46129 14572 5932 19869 40315 36457 37676 6792 -3299 19357 49102
8782D9102o680j9276M858L0041j0422k980j0515J760K4787j4066j7879M06j833
$$ 49102 42422 23146 28004 58045 47623 44643 34128 35888 60675 46609 28730 29136 27303
8769B7303K858J3080p101J2028k488M55j836j2905J0250J8164p894j6770j6336
$$ 27303 30161 43241 36140 48168 45680 46135 44299 31394 41644 59808 51914 35144 18808
8756A8808j1045q949l4046m10J7670j1836N898N550J9436J685J4371K2263L0034
$$ 18808 7763 -1186 -35232 -35642 -17972 -29808 -23910 -18360 1076 2761 17132 39395 69429
8743F9429l880l2211K191o971l3266K1361J4043L0489j2600j6292M841p523k8565
$$ 69429 65549 33338 35529 28558 -4708 16653 30696 61185 48585 32293 37134 29611 1046
8730A046j5701K052J6194J1516j3943k3488K378n51n110R268j1420l3841J1173
$$ 1046 -14655 -12603 3591 15107 1164 -22324 -19946 -20497 -25607 -16339 -27759 -61600 -50427
8717e0427J9204q407K5095J2121Q56J6934o95j9044J8676J6377J3790j9122P154
$$ -50427 -31223 -39630 -14535 -2414 -1558 15376 14681 -4363 14313 30690 44480 25358 32512
8704C2512p81N229J3041j8475L694M472j5658J3093j0270r594j822J1885O284
$$ 32512 31731 36960 50001 31526 35220 39692 24034 37127 26857 17263 15441 27326 33610
8691C3610r146J3261P806K1693j3727l7478m4069r423J840J5409K6311L090O043
$$ 33610 24464 37725 45531 67224 53497 16019 -28050 -37473 -35633 -20224 6087 9177 15220
8678A5220k824J1493K7364j926N429j6902j3267L841j6444L418K2009m704m045
$$ 15220 12396 23889 51253 49327 54756 37854 24587 28428 11984 15402 37411 32707 28662
8665B8662k208j3603m26k4644M144L708N241K3902o117j483J6176J7453K630J8723
$$ 28662 26454 12851 12425 -12219 -8075 -4367 874 24776 18659 17176 33352 50805 53435 72158
8651G2158l1128k2232J8379J2008m767Q526M1236n818q953k2498k7121M878R341
$$ 72158 41030 18798 37177 49185 44418 52944 94180 88362 79409 56911 29790 34668 44009
8638D4009O167j2019j5968P504j8548k7068N414L211K2540M7533J9815k2285k6265
$$ 44009 50176 38157 22189 29693 11145 -15923 -10509 -7298 15242 62775 82590 60305 34040
8625C4040o982j3802j2453P864k2713L5350J5651k3553l0525J7772N774j015n363
$$ 34040 27058 13256 803 8667 -14046 21304 36955 13402 -17123 649 6423 5408 45
8612D5o326K6011K3602L159k9813j7528P808K614k1581K1119R267k235k4553J3375
$$ 45 -6281 19730 43332 46491 16678 -850 6958 9572 -12009 9110 18377 16142 -8411 4964
8598D964N9417J0958K297j853j3349l5107k1821k2949M599O9010L1002r303j5640
$$ 4964 64381 75339 77636 75783 62434 27327 5506 -17443 -12844 56166 87168 77865 62225
8585F2225L432K1772P599j4027j0163j400K9007L226k2598Q09j189J5534j786
$$ 62225 65657 87429 95028 81001 70838 69438 98445 101671 79073 79882 78693 94227 92441
8572I2441j0916j62m1299j0383M549J4292J6195M565m456j2798j7815j7526L85
$$ 92441 81525 81363 40064 29681 34230 48522 64717 69282 64826 52028 34213 16687 17072
8559A7072n678N54j2227l302l441Q191M3287L183J913j1522r241l572l6536j2374
$$ 17072 11394 11948 -279 -3581 -7022 1169 44456 47639 49552 38030 28789 25217 -11319 -23693
8545b3693K4330J5800l848K1991J653j3746k6085j5696K0603K5997j5515k0688
$$ -23693 637 16437 12589 34580 36233 22487 -3598 -19294 1309 27306 11791 -8897
8533h897p716J3835J2485R03L6115M896J397r197o375K417j6944j9677Q730l368
$$ -8897 -16613 -2778 9707 10610 46725 51621 53018 43821 37446 39863 22919 3242 11972 8604
8519H604n565q384J3190N2440R761l8768j2984K1386p316j7521J6900r591l652
$$ 8604 3039 -5345 7845 60285 70046 31278 18294 39680 32364 14843 31743 22152 18500
8506A8500J3444m662l942J8861j6200j6971J1582O341K5736K071o0173k2474K3426
$$ 18500 31944 27282 23340 42201 26001 9030 20612 26953 52689 54760 -5413 -27887 -4461
8493d461L4278K6906L108m216r294o972j5487J988p926K86j4953n277J3156J2591
$$ -4461 29817 56723 59831 55615 46321 39349 23862 25850 17924 18210 3257 -2020 11136 23727
8479B3727J0079l1816p81J1248M260k774M285K4151m09l6899M686L5653J6243
$$ 23727 33806 1990 1209 12457 16717 13943 18228 42379 41970 5071 9757 45410 61653
8466F1653r357o146P31N0L303k3038j2067J3592o628k714J1298J7203K7365o176
$$ 61653 52296 46150 46881 46931 50234 27196 15129 28721 22093 19379 30677 47880 75245 69069
8452F9069P452k6864q965j3686J6821n741N610J9937q033j4462N433J4051l142
$$ 69069 76521 49657 40692 27006 43827 38086 43696 63633 55600 41138 46571 60622 57480
8439E7480J2709k0136m1593p70K042J8262Q951J3553j414j3146j3179O128j1439
$$ 57480 70189 50053 8460 7690 9732 27994 36945 50498 49084 35938 22759 28887 17448
8426A7448J945j1111k3727K2906R225k106j9735K190M5615K9408q942l9054k8551
$$ 17448 19393 8282 -15445 7461 16686 14580 -5155 -2965 42650 72058 63116 24062 -4489
8413d489m782O71M413k336J041n577Q636K6688K0797J04r943J4647j1180Q897
$$ -4489 -9271 -8600 -4187 -6523 -5482 -11059 -2423 24265 45062 45166 35223 49870 38690 47587
8399D7587M42j5209J4479k3791j5292J2138R748K180j4301j586k113m78k7428
$$ 47587 48029 32820 47299 23508 8216 20354 30102 32282 17981 16395 14282 13804 -13624
8386a3624o890J2765k883p534J158L0072K8303j2666l6933j2451J9175R916l792
$$ -13624 -20514 -7749 -10632 -18166 -17008 13064 41367 28701 -8232 -20683 -1508 8408 4616
8373D616r870J1070L0123p903j9347P270M802J838k8326R627o322M604K5356k704
$$ 4616 -5254 5816 35939 28036 8689 15959 20761 22599 -5727 3900 -2422 2182 27538 24834
8359B4834j8333K8031M5883n667r096J2584k7414j6826j5914K506j8815j6004
$$ 24834 6501 34532 80415 74748 65652 78236 50822 33996 18082 20588 1773 -14231
8347a4231R043L2585r488j6228L262j239P1j6022J8131j2557L3489n406j1985
$$ -14231 -5188 27397 17909 1681 4943 3704 3775 -12247 5884 -6673 26816 21410 9425
8334I425k7521j4674J3969J2769L6055J8423q488L358n225K914M882P08L429o441
$$ 9425 -18096 -32770 -18801 -6032 30023 48446 39958 43316 38091 41005 45887 46595 50024 43583
8320D3583j7318k869J2053k1752m214Q913q130J4942N477m6922j7608K0776K6757
$$ 43583 26265 23396 35449 13697 9483 18396 10266 25208 30685 -16237 -33845 -13069 13688
8307A3688J9940J4534k7057j0163j3447P693K616O976P987j035J1541k0996l6119
$$ 13688 33628 48162 21105 10942 -2505 5188 7804 14780 22767 21732 33273 12277 -23842
8294b3842k7288J4748J623j1321J5965M3600K1005K4066P153k8824j9720q587
$$ -23842 -51130 -36382 -34759 -46080 -30115 13485 34490 58556 65709 36885 17165 8578
8282H578j659k7915k656K927L0119M326J5168p63k0889k6346M828N244j8523q684
$$ 8578 6919 -20996 -23652 -20725 9394 13720 28888 28125 7236 -19110 -14282 -9038 -27561 -36245
8268c6245J9269M476K0344J1655R64n636k3075l0214O354K1572L4189J3463p878
$$ -36245 -16976 -12500 7844 19499 20463 14827 -8248 -38462 -32108 -10536 23653 37116 29238
8255B9238o451j9933k3778j2579r92J6356j3572j3429K4037k3390K4264J0840
$$ 29238 22787 2854 -20924 -33503 -34495 -18139 -31711 -45140 -21103 -44493 -20229 -9389
8243i389J4816M973r419M476j3480k4636L5690R710p540N150j5667J211o137P498
$$ -9389 5427 10400 981 5457 -8023 -32659 3031 12741 5201 10351 -5316 -4105 -10242 -2744
8229b744J6514j1927K6344R655O40J3503j8958N246m192J1441K410l7664j6178
$$ -2744 13770 1843 28187 37842 38482 51985 33027 38273 34081 45522 47932 10268 -5910
8216e910k9263j1563o176j945K9252K5132K489j7613l180r373R316J1097L210
$$ -5910 -35173 -46736 -52912 -54857 -25605 -473 2016 -15597 -18777 -28150 -18834 -7737 -4527
8203d527o671n226K8831K6798k987o854O773m344j1129o998Q8J8009R938m0399
$$ -4527 -11198 -16424 12407 39205 36218 29364 36137 31793 20664 13666 13754 31763 41701 1302
8189A302p694L1811J8131l2514j2290J0469Q796K1714l820n511K6337R045k524
$$ 1302 -6392 25419 43550 11036 -1254 9215 18011 39725 35905 30394 56731 65776 63252
8176F3252k749o033j5792j1294p982R331o545k61J6333K0379k8382k2985k0200
$$ 63252 60503 54470 38678 27384 19402 28733 22188 21927 38260 58639 30257 7272 -12928
8163a2928R299j6169n980K9576J9047J1567k930l655J5874K8808j5271l9412k7832
$$ -12928 -3629 -19798 -25778 3798 22845 34412 31482 27827 43701 72509 57238 17826 -10006
8150a0006m402k1933k594j1856R03K375P946J9008O952j3268l615L1940q39j5772
$$ -10006 -14408 -36341 -38935 -50791 -49888 -47513 -39567 -20559 -13607 -26875 -30490 1450 611 -15161
8136a5161o882Q586j257K1347k8561j5561J6759J4115L0326J2315j2929j5522
$$ -15161 -22043 -13457 -14714 6633 -21928 -37489 -20730 -6615 23711 36026 23097 7575
8124G575K6455M286k9422l4582k1827p102j1298L3588K2516K566J2387j7209k7211
$$ 7575 34030 38316 8894 -25688 -47515 -54617 -65915 -32327 -9811 -7245 5142 -12067 -39278
8111c9278L0774q693k7484K2002K5061j406l447j3798p196K9966r726l1970K3627
$$ -39278 -8504 -17197 -44681 -22679 2382 976 -2471 -16269 -23465 6501 -3225 -35195 -11568
8098a1568L524j4272Q15j349j0907m508R959K3137N170J485r934J3246j7892j6989
$$ -11568 -8044 -22316 -21501 -22850 -33757 -38265 -28306 -5169 1 1486 -8448 4798 -13094 -30083
8084c0083Q46Q824O839J9049n187j2309m981n870k3150q176m171K2085K4868M1859
$$ -30083 -29237 -20413 -13574 5475 288 -12021 -17002 -22872 -46022 -54198 -58369 -36284 -11416 30443
8070C0443j9579l51j0997r877K4716k1540j4280J2167k1212L022M635m263l349
$$ 30443 10864 10513 -484 -10361 14355 -7185 -21465 -9298 -30510 -27488 -22853 -27116 -30465
8057c0465N773L5976L999j5155m454n178K9974L0760J1995k0346j9756k4829j2489
$$ -30465 -24692 11284 15283 128 -4326 -9504 20470 51230 63225 42879 23123 -1706 -14195
8044a4195N967j0391j0115N527K7961k0473j2677K6832N11j0020k4782r49J7533
$$ -14195 -8228 -18619 -28734 -23207 4754 -15719 -28396 -1564 -1053 -11073 -35855 -36804 -19271
8031a9271p160M546J4382k4176j6169N05n350J4096P167P320J4998J1984J4133
$$ -19271 -26431 -21885 -7503 -31679 -47848 -47343 -52693 -38597 -31430 -24110 -9112 2872 17005
8018A7005m001N918M1676j3230j2046j8877j4813n330Q02j5431o231j5315l443
$$ 17005 13004 18922 60598 47368 35322 16445 1632 -3698 -2896 -18327 -24558 -39873 -43316
8005d3316O929R288l692j7756j2637K6287K2357l553P384P273j5809J5464p287
$$ -43316 -36387 -27099 -30791 -48547 -61184 -34897 -12540 -16093 -8709 -1436 -17245 -1781 -9068
7992i068j8488K8299j3247k0581q73K5170J7830j2779N305N103j377N088l064
$$ -9068 -27556 743 -12504 -33085 -33958 -8788 9042 -3737 1568 6671 5294 10382 7318
7979G318J0486j0323j1011p826Q623J7619J7571J2631l428j9731l576J6747K2641
$$ 7318 17804 7481 -3530 -11356 -2733 14886 32457 45088 41660 21929 18353 35100 57741
7966E7741j7387j4192j5876n1134j7051L0831K4444k374o810j6608J8996j2754
$$ 57741 40354 26162 10286 -40848 -57899 -27068 -2624 -4998 -11808 -28416 -9420 -22174
7954b2174q947J9443J3594N214M4022Q793j7377J586J1112j3085l6037o269j5001
$$ -22174 -31121 -11678 1916 7130 51152 59945 42568 44154 55266 42181 6144 -125 -15126
7941a5126J1841J9142K401k3842J033J9692J2086m281J650j1465k2358o520k4810
$$ -15126 -3285 15857 18258 -5584 -4551 15141 27227 22946 24596 13131 -9227 -15747 -40557
7928d0557j3644J3534L4939P928j9966l489P255J5068j068j3392K4276K25j8127
$$ -40557 -54201 -40667 -5728 2200 -17766 -21255 -14000 1068 0 -13392 10884 11109 -7018
7915g018K589j0747j425J7328P660k892K1680K093k2956O52J8627J3189M986L7727
$$ -7018 -4429 -15176 -16601 727 8387 5495 27175 29268 6312 6964 25591 38780 43766 81493
7901H1493K152o3518k23L0036l0530k1298P690m910J0454O638L0095o459j9297
$$ 81493 83645 20127 19904 49940 19410 -1888 5802 892 11346 17984 48079 41620 22323
7888B2323n065k8202j0539m486J9527J3414k0198J4848K8818L953m1991k6766
$$ 22323 17258 -10944 -21483 -25969 -6442 6972 -13226 1622 30440 34393 -7598 -34364
7876c4364j956J9985K6695L0959O152l2468j5605j916K0924j2094k064K9775J0832
$$ -34364 -36320 -16335 10360 41319 47471 15003 -602 -2518 18406 6312 4248 34023 44855
7863D4855l6012q744j8099J9135n45k0314O168K3127K7788J2466k1412j3488j5947
$$ 44855 8843 99 -18000 1135 590 -19724 -13556 9571 37359 49825 28413 14925 -1022
7850a022m764J0741l805j0323o743m756P202J7167k9738k6299q93K597K5329J5928
$$ -1022 -5786 4955 1150 -9173 -15916 -20672 -13470 3697 -26041 -52340 -53233 -50636 -25307 -9379
7836i379m581J0483J559J494j0290J5781j2241o033K7762L2784N447m3428j86
$$ -9379 -13960 -3477 -1918 -424 -10714 5067 -7174 -13207 14555 47339 52786 9358 9172
7823I172N999P153j983k1645k387J937K4998K1090K4367L583k0338l9763r723
$$ 9172 15171 22324 20341 -1304 -3691 -1754 23244 44334 68701 72284 51946 12183 2460
7810B460O225j4140J1939J12j0145J7898j1077j9811K2071R6K8539J6138j2891
$$ 2460 8685 -5455 6484 6596 -3549 14349 3272 -16539 5532 5628 34167 50305 37414
7797C7414k7151r444K2220o573M507M024j6310r235Q942M778j0458j88j4730l957
$$ 37414 10263 819 23039 16466 20973 24997 8687 -548 8394 13172 2714 2526 -12204 -16161
7783a6161q265R803K4482R28K3269j6803j9533j8458k653L089J3205Q788m174
$$ -16161 -24426 -14623 9859 10787 34056 17253 -2280 -20738 -23391 -20302 -7097 1691 -2483
7770b483n083j5530k559J0326j1968l2032n069J3253J8002J5432K2624K184j6670
$$ -2483 -7566 -23096 -25655 -15329 -27297 -59329 -64398 -51145 -33143 -17711 4913 7097 -9573
7757i573r068O128K7164J5435j5010k0994j8656j062J4024J762j7242J9019J3593
$$ -9573 -18641 -12513 14651 30086 15076 -5918 -24574 -25636 -11612 -9850 -27092 -8073 5520
7744E520j2453k8930l846R409L2730R455J2283J0568j3933K884k0486M533M063
$$ 5520 -6933 -35863 -39709 -30300 2430 11885 24168 34736 20803 23687 3201 7734 11797
7731A1797l6816j5084K6209R012k4458j8930K5514K0755J0144N134K2933J7868
$$ 11797 -25019 -40103 -13894 -4882 -29340 -48270 -22756 -2001 8143 13277 36210 54078
7719E4078N619j1030j3347k9425r305k8256r301J2500k0015M384J9707r472n315
$$ 54078 59697 48667 35320 5895 -3410 -31666 -40967 -28467 -48482 -44098 -24391 -33863 -39178
7706c9178k502k4880J1822R789K9927K8645K4988L465l866J4165k8593l7804j6976
$$ -39178 -41680 -66560 -54738 -44949 -15022 13623 38611 42076 38210 52375 23782 -14022 -30998
7693c0998J3018j780J1290k1893R683J7647j3069j1709J4520k2924l4559m903
$$ -30998 -17980 -19760 -8470 -30363 -20680 -3033 -16102 -27811 -13291 -36215 -70774 -75677
7681g5677J6114J3894m895j2790J0136K6333J8863j2816k0709N14L2171K1420
$$ -75677 -59563 -45669 -50564 -63354 -53218 -26885 -8022 -20838 -41547 -41033 -8862 12558
7669A2558N661m1732j5487J5221K4703r708o818J2329N3067J2354r854k0452j8397
$$ 12558 18219 -23513 -39000 -23779 924 -8784 -15602 -3273 49794 62148 52294 31842 13445
7656A3445k2806k1858m713j1793J752J1571K4027J5134n853Q230J664R134J0811
$$ 13445 -9361 -31219 -35932 -47725 -45973 -34402 -10375 4759 -1094 7136 8800 17934 28745
7643B8745k0232k0793k1613j2119j0360K1096L7697k558r23P426M695n918q552
$$ 28745 8513 -12280 -33893 -46012 -56372 -35276 2421 -137 -1060 6366 11061 5143 -3409
7630c409k3324R654K585l2604j9771M4243K9144j2237j5496m763K2612K7241j8096
$$ -3409 -26733 -17079 -14494 -47098 -66869 -22626 6518 -5719 -21215 -25978 -3366 23875 5779
7617E779K0346L1739J466K65j1485k1831o999l3092O749J5243j5743l1083j0183
$$ 5779 26125 57864 59330 59595 48110 26279 19280 -13812 -7063 8180 -7563 -38646 -48829
7604d8829J8835K0676K7856J5412k83j6214k726k6971n250J5438m895J222p155
$$ -48829 -29994 -9318 18538 33950 33667 17453 14727 -12244 -17494 -2056 -6951 -5729 -12884
7591a2884K0242K491J1110k8984j2318J7282K9514q460O645j1606J6830k6227
$$ -12884 7358 9849 20959 -8025 -20343 -3061 26453 17993 24638 13032 29862 3635
7579C635k7554l7856K0112J2763K1833L0853J2356k7767k3036k5968k4344J1701
$$ 3635 -23919 -61775 -41663 -28900 -7067 23786 36142 8375 -14661 -40629 -64973 -53272
7567e3272J9060K9403K6497k113j1103M305m6528m519M010J0497J3082K738n721
$$ -53272 -34212 -4809 21688 19575 8472 12777 -33751 -38270 -34260 -23763 -10681 -7943 -13664
7554a3664L093r000M50j6158l0787J0136j0221O547L469Q105O880j668j7716L8826
$$ -13664 -10571 -19571 -19121 -35279 -66066 -55930 -66151 -59604 -56135 -48030 -41150 -42818 -60534 -21708
7540b1708J5088q736Q29J3102L891j2964k8187k9893j2019K1205K7063J975n86
$$ -21708 -6620 -15356 -14527 -1425 2466 -10498 -38685 -68578 -80597 -59392 -32329 -30354 -30940
7527c0940O92j3339j5890l780p078m088K6841J2802j798J8108J3326K6233k2043
$$ -30940 -30248 -43587 -59477 -63257 -70335 -74423 -47582 -34780 -36578 -18470 -5144 21089 -954
7514i54l8966K1692N14r955n397j4403O810m626J8771L60J7372j9239q487l718
$$ -954 -39920 -18228 -17714 -27669 -33066 -47469 -40659 -45285 -26514 -26154 -8782 -28021 -36508 -40226
7500d0226K2028K3268M973M339n664q462K3099Q101l83j927j8222k7166r546j3706
$$ -40226 -18198 5070 10043 14382 8718 256 23355 31456 31073 29146 10924 -16242 -25788 -39494
7486c9494J5089K3756k5301k613R644k6200k0231J639j090P393J2321L2211k2544
$$ -39494 -24405 -649 -25950 -28563 -18919 -45119 -65350 -63711 -64801 -57408 -45087 -12876 -35420
7473c5420n916P306n838J0464K802j5150Q828L25n296r606K1412M2623O915l937
$$ -35420 -41336 -34030 -39868 -29404 -26602 -41752 -32924 -32599 -37895 -47501 -26089 16534 23449 19512
7459A9512l5899J1324P540k1755j8196J6500K5357o234j6690P951J8889N601R84
$$ 19512 -16387 -5063 2477 -19278 -37474 -20974 4383 -1851 -18541 -10590 8299 13900 14884
7446A4884O914j7027j0086J5420P080K8551j177l9849m5491J6900j205J0040k4940
$$ 14884 21798 4771 -5315 10105 17185 45736 44559 4710 -40781 -23881 -25086 -15046 -39986
7433c9986k8259j1472K4211J7906q11K5560j4392k357J7090l3458j6142j0120
$$ -39986 -68245 -79717 -55506 -37600 -38411 -12851 -27243 -29600 -12510 -45968 -62110 -72230
7421g2230J228M4497L7364m475k716J5849l846j2549j2024J112J4177K5982K010
$$ -72230 -71002 -26505 10859 6384 3668 19517 15671 3122 -8902 -7790 6387 32369 34379
7408C4379J3727J2056j4344k4211m2406P810J667j9200K3380J0718O093r387j1284
$$ 34379 48106 60162 45818 21607 -20799 -12989 -11322 -30522 -7142 3576 9669 282 -11002
7395a1002k6741J1459M1822j715J6115l327m6913k1534O594J3373j7178J4153
$$ -11002 -37743 -26284 15538 13823 29938 26611 -20302 -41836 -35242 -21869 -39047 -24894
7383b4894L3707K8196j1671l726J3932p163l5820k2721r268R283j0714m343L5656
$$ -24894 8813 37009 25338 21612 35544 28381 -7439 -30160 -39428 -30145 -40859 -45202 -9546
7370i546J7754j2320N121j7114K2107K8984j1006r166j0832J7142j873k7529k017
$$ -9546 8208 -4112 1009 -16105 6002 34986 23980 14814 3982 21124 19251 -8278 -10295
7357a0295Q632k2261J54L888K700L612J0134J9777K4824k5462k9930k6579J513
$$ -10295 -1663 -23924 -23770 -19882 -17182 -13570 -3436 16341 41165 15703 -14227 -40806 -39293
7344c9293K1619L5309J5362j2335K2630R426k0778j7210j5546q252j5915k4562
$$ -39293 -17674 17635 32997 20662 43292 52718 31940 14730 -816 -9068 -24983 -49545
7332d9545l740L1249J8783J0147j0711j3922k4406J0123J3053J5896j4241K449
$$ -49545 -53285 -22036 -3253 6894 -3817 -17739 -42145 -32022 -18969 -3073 -17314 -14865
7320a4865J7952J9916J7668r617J4839L173j1605L960j7620j7625L2709j581N651
$$ -14865 3087 23003 40671 31054 45893 49066 37461 41421 23801 6176 38885 37304 42955
7307D2955K1892l38J036m091J6319m1443k5782j7810j7741J465K0503j5028n398
$$ 42955 64847 64509 65545 61454 77773 36330 10548 -7262 -25003 -23538 -3035 -18063 -23461
7294b3461r663k8688K607j877Q890J3380L1589j3254m7740k830M004L0716M1687
$$ -23461 -33124 -61812 -59205 -61082 -52192 -38812 -7223 -20477 -68217 -71047 -67043 -36327 5360
7281E360N614q551K0003N879j5007k1681J3193k468O274j7102k2405k0474P925
$$ 5360 10974 2423 22426 28305 13298 -8383 4810 2342 8616 -8486 -30891 -51365 -43440
7268d3440R712K5043L3328j4850j602K8678M1740k9066o6599J9588m075j3766
$$ -43440 -33728 -8685 24643 9793 8191 36869 78609 49543 -17056 2532 -1543 -15309
7256a5309j10j5626n109j5254J1825J8600j9324k6749n193L0812K5463K0014J6550
$$ -15309 -15419 -31045 -36154 -51408 -39583 -20983 -40307 -67056 -72249 -41437 -15974 4040 20590
7243B0590K2621k4903j6668o126P849J9534j3037M281j3780k9345l796J0189K3717
$$ 20590 43211 18308 1640 -4486 3363 22897 9860 14141 361 -28984 -32780 -22591 1126
7230A126J7336K99o35j4358J4799j3682J0462m4178q751L1078J145j4580j4478
$$ 1126 18462 18761 18126 3768 18567 4885 15347 -28831 -37582 -6504 -5359 -19939 -34417
7217c4417n158J9770J0720K7354J7208k6214l382J6112k1545k292j6219K8656
$$ -34417 -39575 -19805 -9085 18269 35477 9263 5881 21993 448 -1844 -18063 10593
7205A0593k2800j0084J5378K944l868K7793l347k6521J8488j5694j0086K390L2607
$$ 10593 -12207 -22291 -6913 -3969 -7837 19956 16609 -9912 8576 -7118 -17204 -14814 17793
7192A7793M2117N215k3695j8270P646K2656j6058o017P256k5991r024J3785o49
$$ 17793 59910 65125 41430 23160 30806 53462 37404 31387 38643 12652 3628 17413 16764
7179A6764j2731L156j6341k6052j6364r608K0636L0397L2828k4425m4124r858
$$ 16764 4033 7189 -9152 -35204 -51568 -61176 -40540 -10143 22685 -1740 -45864 -55722
7167e5722R907p548L1869m703j0896J1794n749O236L0522K6453j1275j8851p311
$$ -55722 -45815 -53363 -21494 -26197 -37093 -25299 -31048 -24812 5710 32163 20888 2037 -5274
7154e274O585K7644j6450j4011j0865J1768m067j8511J4347o099j4245j3237M888
$$ -5274 1311 28955 12505 -1506 -12371 -603 -4670 -23181 -8834 -14933 -29178 -42415 -37527
7141c7527J0784J5558K6390j6590j7787j0198J8008O890r678l8296n499M178J1663
$$ -37527 -26743 -11185 15205 -1385 -19172 -29370 -11362 -4472 -14150 -52446 -57945 -53767 -42104
7128d2104J1169K703K4125K540k1241N652K9099J4257k50o839m0335l9269j097
$$ -42104 -30935 -28232 -4107 -1567 -22808 -17156 11943 26200 25950 19111 -21224 -60493 -61590
7115f1590K6559K2175Q985J1239j0132j6171L651P366J0495o114j1577J6218J9957
$$ -61590 -35031 -12856 -3871 7368 -2764 -18935 -15284 -7918 2577 -3537 -15114 1104 21061
7102B1061R805J5419k8259l5495l237j5605J3143K6265M916m715m237j1382j5585
$$ 21061 30866 46285 18026 -17469 -20706 -36311 -23168 3097 8013 3298 -939 -12321 -27906
7089b7906J584j1744L1471J1914Q071L927k6933J410L7737R039j343p476j002
$$ -27906 -26322 -38066 -6595 5319 13390 17317 -9616 -8206 29531 38570 37227 29751 28749
7076B8749K497m230k687o121l1968l1313j0542L5223J3855j320J6543J8320J806
$$ 28749 31246 27016 24329 18208 -13760 -45073 -55615 -20392 -6537 -7857 8686 27006 28812
7063B8812l8271Q543j0794k3344L5779J4501l345j4899K1343Q783j6037j1283
$$ 28812 -9459 -916 -11710 -35054 725 15226 11881 -3018 18325 27108 11071 -212
7051b12J9211j67j8156k2933J3637K1499J0129R547j5088q632k2439J6136J0927
$$ -212 18999 18832 676 -22257 -8620 12879 23008 32555 17467 8835 -13604 2532 13459
7038A3459J8503j0101k4608m8L2944m032p125K1776m717j5996q100J9911K8282
$$ 13459 31962 21861 -2747 -2795 30149 26117 18992 40768 36051 20055 11955 31866 60148
7025F0148O524q821k4411k9052p94m53j7328N608j051j5215L123J0157q067l0955
$$ 60148 66672 57851 33440 4388 3594 3141 -14187 -8579 -9630 -24845 -21722 -11565 -19632 -50587
7011e0587m46K3322J0752l227R615J3636P413l27k8172O169J1958j2103J6892
$$ -50587 -51033 -27711 -16959 -20186 -10571 3065 10478 10151 -18021 -11852 106 -11997 4895
6998D895j2452j5862L222j21M573q74O564J0537J5295r428k2484k5055Q574L5265
$$ 4895 -7557 -23419 -20197 -20318 -15745 -16619 -10055 482 15777 6349 -16135 -41190 -32616 2649
6984B649j1418l6853L7234L2477j0670l0135j9349J4069j3269j4646L158J1597
$$ 2649 -8769 -45622 -8388 24089 13419 -16716 -36065 -21996 -35265 -49911 -46753 -35156
6972c5156J0135J4244J109q671K063j4846k2537l4635J7126L7147L6452M265k0495
$$ -35156 -25021 -10777 -9668 -18339 -16276 -31122 -53659 -88294 -71168 -34021 2431 6696 -13799
6959a3799O206J1392k7322j580K3145j5293K4845j143m2821j6274j1551O117J6359
$$ -13799 -7593 3799 -23523 -25103 -1958 -17251 7594 6451 -36370 -52644 -64195 -58078 -41719
6946d1719J6365K7422J910o338Q836n716m092k126J7662M88l8889r933L4899r016
$$ -41719 -25354 2068 3978 -2360 6476 760 -3332 -5458 12204 12692 -26197 -36130 -1231 -10247
6932a0247l36j1497K1608N7r087r843n800J1721j3757j0604r077j8644n091J3432
$$ -10247 -10583 -22080 -472 -415 -9502 -19345 -25145 -13424 -27181 -37785 -46862 -65506 -70597 -57165
6918e7165K6651J2299j3044J0328k9601j7148j949J9012J3612o430j0086n334
$$ -57165 -30514 -18215 -31259 -20931 -50532 -67680 -69629 -50617 -37005 -43435 -53521 -58855
6906e8855m249O037J3368M057k1942K4050K1083J3196j1474j2375p945L864K2026
$$ -58855 -63104 -57067 -43699 -39642 -61584 -37534 -16451 -3255 -14729 -27104 -35049 -31185 -9159
6893i159L0967J3137q004l1744J3067M783l4300l036j1308j421M2092j1843k5870
$$ -9159 21808 34945 26941 -4803 8264 13047 -21253 -24289 -35597 -37018 5074 -6769 -32639
6880c2639O105J5969L1697K690k4954N204j0631j8536J9066K6403j908k1416j111
$$ -32639 -26534 -10565 21132 23822 -1132 4072 -6559 -25095 -6029 20374 18466 -2950 -4061
6867d061P057q183J0685m1005j7765J3128J9224J7152m390j1149R157J7786l290
$$ -4061 2996 -5187 5498 -35507 -53272 -40144 -20920 -3768 -8158 -19307 -10150 7636 4346
6854D346o477k0815j7404P823P427j2907K362j7519K1729K5664J8701l546J5979
$$ 4346 -2131 -22946 -40350 -32527 -25100 -38007 -35645 -53164 -31435 -5771 12930 9384 25363
6841B5363L197l220k2406J1208Q886j6395Q0k3588j9690N847j827M178J7914R904
$$ 25363 28560 25340 2934 14142 23028 6633 6713 -16875 -36565 -30718 -32545 -28367 -10453 -549
6827e49k1000j0116j7689J0258L6474K797m448J3377J4049j6460k0272k4907k5675
$$ -549 -21549 -31665 -49354 -39096 -2622 175 -4273 9104 23153 6693 -13579 -38486 -64161
6814f4161j1294j522L1264j108k1217K8104L0089J8441K2167j5836j3801k0682
$$ -64161 -75455 -76977 -45713 -46821 -68038 -39934 -9845 8596 30763 14927 1126 -19556
6802a9556k2988J3688K9717L7301J0902J54k5837K832J1012j9186k3043J5890
$$ -19556 -42544 -28856 861 38162 49064 49218 23381 26213 37225 18039 -5004 10886
6790A0886J6332r026M226l9702R836J1511j3822j3086M8028L104k6125O149N084
$$ 10886 27218 18192 22418 -17284 -7448 4063 -9759 -22845 25183 28287 2162 8311 13395
6777A3395j4717o668j2558K1585K140K8583J2393o740j7160o720k5231j3204O891
$$ 13395 -1322 -7990 -20548 1037 3177 31760 44153 37413 20253 13533 -11698 -24902 -18011
6764a8011L1818j412j4438q920j476K868k0727j4088K8971K0895P610J4409R435
$$ -18011 13807 12395 -2043 -10963 -12439 -9571 -30298 -44386 -15415 5480 13090 27499 36934
6751C6934K299j5974j0007Q131m164q620k2934J1088J6221r736m5499J2632L4673
$$ 36934 39233 23259 13252 21383 17219 8599 -14335 -3247 12974 3238 -42261 -29629 5044
6738E044L0909k0873m9564k2780J5188K9270R344j8759K1482K1209k9997k6180
$$ 5044 35953 15080 -34484 -57264 -42076 -12806 -3462 -22221 -739 20470 -9527 -35707
6726c5707J5796J1372p088J508j1709m727O144J7667L3679q343j5795R952j30
$$ -35707 -19911 -8539 -15627 -14119 -25828 -30555 -24411 -6744 26935 18592 2797 12749 12619
6713A2619P714j5477o435k9440J346K3989j1552J3877J6578O006j2834j2413j4620
$$ 12619 20333 4856 -1579 -31019 -29673 -5684 -17236 -3359 13219 19225 6391 -6022 -20642
6700b0642l4815J5206L5898m599p801q0Q078K367J0325J8478k6831n618J5901
$$ -20642 -55457 -40251 -4353 -8952 -16753 -16833 -8755 -6388 3937 22415 -4416 -10034 5867
6687E867m522k6679l0342P331L0034J2773p213m816j1568J7530J415P548j5331
$$ 5867 1345 -25334 -55676 -48345 -18311 -5538 -12751 -17567 -29135 -11605 -10190 -2642 -17973
6674a7973j4498r818J3938Q587K331k47j3021R659J670K1117L4992K2537j9704
$$ -17973 -32471 -42289 -28351 -19764 -17433 -17680 -30701 -21042 -19372 1745 36737 59274 39570
6661C9570l7824j4423M280J5811l553k1723j3999J962J4452m219J030j1411J5500
$$ 39570 1746 -12677 -8397 7414 3861 -17862 -31861 -29899 -15447 -19666 -18636 -30047 -14547
6648a4547K3268J6088o487r119j4392K4128K060o993R38J5451M55j1237p112L805
$$ -14547 8721 24809 18322 9203 -5189 18939 20999 14006 14944 30395 30850 19613 12501 16306
6634A6306O559J4705L9583j4685l4885l2379R441J5958K5521J3574k4774P123
$$ 16306 22865 37570 77153 62468 27583 -4796 4645 20603 46124 59698 34924 42047
6622D2047k3864K069j074J1394J6360j3946L201j6029J1443R280j8507Q70j1702
$$ 42047 18183 20252 19178 30572 46932 32986 36187 20158 31601 40881 22374 23244 11542
6609A1542R149r109k2110j935K6918R601j2945j1054P822j234Q732k4362k1711
$$ 11542 20691 11582 -10528 -12463 14455 24056 11111 57 7879 6645 15377 -8985 -30696
6596c0696m761R27j0185J1529Q810j3857J9306N7412J9337m590l806J2825n415
$$ -30696 -35457 -34530 -44715 -33186 -24376 -38233 -18927 38485 57822 53232 49426 62251 56836
6583E6836k8522k7920k2827K4126K6369j789j9282l6910k3531K5077J605K2438
$$ 56836 28314 394 -22433 1693 28062 26273 6991 -29919 -53450 -28373 -26768 -4330
6571d330J6959j567m698j4827K2296k896j6871n224K1756J60K2490j5408k177
$$ -4330 12629 11062 6364 -8463 13833 10937 -5934 -11158 10598 10758 33248 17840 15663
6558A5663J6059j2700j1515k9511q702J4434J6687K0738N765k344j6688L485Q498
$$ 15663 31722 19022 7507 -22004 -30706 -16272 415 21153 26918 24574 7886 11371 19869
6545A9869J669J4034P072O009J694J2494K9j3229j0139N627J3883L1443J1463
$$ 19869 21538 35572 42644 48653 50347 62841 62870 49641 39502 45129 59012 90455 101918
6532A01918k8431M0j4519Q20j230R158N083q464j5855M090K8722k3093k5628p612
$$ 101918 73487 73527 59008 59828 58598 67756 72839 64375 48520 52610 81332 58239 32611 24999
6518B4999j4459j9782m997j5715l796n190R89K7239L5191o214j5598p722j0778
$$ 24999 10540 -9242 -14239 -29954 -33750 -38940 -37951 -10712 24479 18265 2667 -5055 -15833
6505a5833J2584J9962k2566j8573m656l738J1201j7531j6580L9880O686l80o850
$$ -15833 -3249 16713 -5853 -24426 -29082 -32820 -21619 -39150 -55730 -15850 -9164 -9544 -16394
6492a6394Q203K2053M3940k936k0100k7949l1407M3632k479l0726K8491P757l0895
$$ -16394 -8191 13862 57802 54866 34766 6817 -24590 19042 16563 -14163 14328 22085 -8810
6479h810k2417j300K0555j5418j8216M3812J603j3587p037q86m165L774M865p507
$$ -8810 -31227 -32527 -11972 -27390 -45606 -1794 -191 -13778 -20815 -21701 -25866 -22092 -17227 -24734
6465b4734j1284p024o461q128l4838o395J8949L4736J795o126K2178l519L984
$$ -24734 -36018 -43042 -49503 -57631 -92469 -98864 -79915 -45179 -43384 -49510 -27332 -30851 -26867
6452b6867J7656m060K5280j1458k7674o992K2030j1064k273K2490J5525j235L404
$$ -26867 -9211 -13271 12009 551 -27123 -34115 -12085 -23149 -25422 -2932 12593 11358 14762
6439A4762L290j0077J3484j1026J2656j209p697n166j6345k1568m058m19q002
$$ 14762 18052 7975 21459 10433 23089 21880 14183 9017 -7328 -28896 -32954 -33373 -41375
6426d1375N6208J1695m44n151P945M027j7219k1091j4543j1439p806k8413J6930
$$ -41375 14833 26528 26084 20933 28878 32905 15686 -5405 -19948 -31387 -39193 -67606 -50676
6413e0676K535L9334K7161k9069j3078k0960J5012K2333l512j2130p095J4872
$$ -50676 -48141 -8807 18354 -10715 -23793 -44753 -29741 -7408 -10920 -23050 -30145 -15273
6401a5273j5108j1929Q710j0206r800J7687L7603J2844Q09l4933Q72K5128P686
$$ -15273 -30381 -42310 -33600 -43806 -53606 -35919 1684 14528 15337 -19596 -18724 6404 14090
6388A4090O614j099j0892k3506k2621J5629K6322M953J1014J426j5804q751M845
$$ 14090 20704 19605 8713 -14793 -37414 -21785 4537 9490 20504 21930 6126 -2625 2220
6375B220r6N630J0643R924j6644J2602o050j5086j4671L0951J4311m2623n3643
$$ 2220 2124 7754 18397 28321 11677 24279 18229 3143 -11528 19423 33734 -8889 -62532
6362f2532j1363J360K4741K3066J1750j9865M964K7814k780l8442k4530J0826
$$ -62532 -73895 -72535 -47794 -24728 -12978 -32843 -27879 -65 -2845 -41287 -65817 -54991
6350e4991R212J2969L3528J6346J7843Q884k2986j2921R597J87r788k643l3500
$$ -54991 -45779 -32810 718 17064 34907 43791 20805 7884 17481 17668 7880 5237 -28263
6337b8263M446L847R93k1103j8926p34K1537k51k4642L5915K2417k1782J9906
$$ -28263 -23817 -19970 -18977 -40080 -59006 -59740 -38203 -38454 -63096 -27181 -4764 -26546 -6640
6324f640L8013L6802j7030j6043k0518k809J6473M714K69r407k0470J3850j9284
$$ -6640 31373 68175 51145 35102 14584 11775 28248 32962 33231 23824 3354 17204 -2080
6311b080l864P624k5628l604M9763J9568j0320J810q043J8063K063k3826j9185
$$ -2080 -5944 1680 -23948 -27552 22211 41779 31459 33269 25226 43289 45352 21526 2341
6298B341o691l8249j0131J6050K1262J3086k2443J2087M106K5239J750m3876R48
$$ 2341 -4350 -42599 -52730 -36680 -15418 -2332 -24775 -12688 -8582 16657 18407 -25469 -24521
6285b4521o163J0422q38J2516M302R630j8948k0319J2929K4320Q268q077j6393
$$ -24521 -30684 -20262 -21100 -8584 -4282 5348 -13600 -33919 -20990 3330 11598 3521 -12872
6272a2872q01k7539j0846J6642K3430j439l176K3418r829j1248r959r792K5269
$$ -12872 -13673 -41212 -52058 -35416 -11986 -13425 -16601 6817 -3012 -14260 -24219 -34011 -8742
6259h742k3n689l112q92K5724J6257j0723j7370K519J2041j818n533M989K0766
$$ -8742 -8765 -14454 -17566 -18458 7266 23523 12800 -4570 -2051 9990 8172 2639 7628 28394
6245B8394N238m143j8015L975P354K7608p55r549k1436l7464j3009r23q236j5204
$$ 28394 33632 29489 11474 15449 22803 50411 49656 40107 18671 -18793 -31802 -32725 -40961 -56165
6231e6165J2150J8100R948J9498j0471j7927n7k6915m0301j7741L2362K5544p391
$$ -56165 -44015 -25915 -15967 3531 -6940 -24867 -24924 -51839 -92140 -109881 -77519 -51975 -59366
6218e9366k2150M229J1603j5373K9044L0899q016j8950L930J2719L3109M2480
$$ -59366 -81516 -77287 -65684 -81057 -52013 -21114 -29130 -48080 -44150 -31431 1678 44158
6206D4158J0053l0282l0802r420J1129o020K2544n148k5212J4129O376n678J7668
$$ 44158 54211 23929 -6873 -16293 -5164 -11184 11360 6212 -19000 -4871 1505 -4173 13495
6193A3495j2545o722K385q502l084j8568O888l651j0430o120k1642k09M27m884
$$ 13495 950 -5772 -3387 -11889 -14973 -33541 -26653 -30304 -40734 -46854 -68496 -68705 -68278 -73162
6179g3162K7879L3231J4918K711J3943K8263m65j7838N337j7533J7159J0511j6744
$$ -73162 -45283 -12052 2866 5577 19520 47783 47318 29480 34817 17284 34443 44954 28210
6166B8210J331p893J2538j1365k4639M236J7230L878R534q276k7461r147n934
$$ 28210 29541 21648 34186 22821 -1818 2418 19648 23526 33060 24784 -2677 -11824 -17758
6153a7758l1057k7157J6608K5647j490J805K9210K8568J9436K306j8295M651j402
$$ -17758 -48815 -75972 -59364 -33717 -35207 -33402 -4192 24376 43812 46118 27823 32474 31072
6140C1072m431j1063P406q677k439k0624J9411J6142J0647J4640j8968j4067J816
$$ 31072 26641 15578 22984 14307 11868 -8756 10655 26797 37444 52084 33116 19049 20865
6127B0865j3227J3048j9027l0311J5842K925m543p98J6341J0845m860k3869m0768
$$ 20865 7638 20686 1659 -28652 -12810 -9885 -14428 -15226 1115 11960 7100 -16769 -57537
6114e7537k1548K0314M6065J3713L0607Q57j4792j3412J2521l503l055j5946j504
$$ -57537 -79085 -58771 -12706 1007 31614 32471 17679 4267 16788 13285 10230 -5716 -7220
6101g220k8052l0394P556K3028J6770J3145J1598q502M448k6368k447j0142k1211
$$ -7220 -35272 -65666 -58110 -35082 -18312 -5167 6431 -2071 2377 -23991 -26438 -36580 -57791
6088e7791n593J9847J9288j2866j5561J2558K6379l331R720J0949L3617j2570
$$ -57791 -63384 -43537 -24249 -37115 -52676 -40118 -13739 -17070 -7350 3599 37216 24646
6076B4646j1075J927P114k3672j9671J3846Q359J9434j6756J886j7366j0799j823
$$ 24646 13571 15498 22612 -1060 -20731 -6885 1474 20908 4152 6038 -11328 -22127 -23950
6063b3950k2842j6104J1821k1948K0382M6185K9462l4670r331K0984J5658L864
$$ -23950 -46792 -62896 -51075 -73023 -52641 -6456 23006 -11664 -20995 -11 15647 19511
6051A9511o994J7080j1983k6752J9674M0145R968n768k6443j0905k9030O980K1297
$$ 19511 12517 29597 17614 -9138 10536 50681 60649 54881 28438 17533 -11497 -4517 16780
6038A6780P617K7211j746j8923k2387k7109J067n262n6O899J5654J3156K2808
$$ 16780 24397 51608 49862 30939 8552 -18557 -17490 -22752 -22808 -15909 -255 12901 35709
6025C5709j225p330J1250L610k0457J609n801p922k8396q511J5267Q421K5802
$$ 35709 34484 27154 38404 42014 21557 23166 17365 9443 -18953 -27464 -12197 -3776 22026
6012B2026p326o547n722o194J8156j3355j626k2915j0506J7185K0588K2494k2765
$$ 22026 14700 8153 2431 -3763 14393 1038 -588 -23503 -34009 -16824 3764 26258 3493
5999C493k2554M3878J1997k9541l5017j0208N266L1268J084j1085j9295J4066
$$ 3493 -19061 24817 36814 7273 -27744 -37952 -32686 -1418 -334 -11419 -30714 -16648
5987a6648K4399j5834q264J7506P541M773J0642J487K0589L566l848m0658j4623
$$ -16648 7751 -8083 -16347 1159 8700 13473 24115 25602 46191 49757 45909 5251 -9372
5974i372j5385K3217J5314p197O893k7065q383o992P540N882K017J001j0214Q862
$$ -9372 -24757 -1540 13774 6577 13470 -13595 -21978 -28970 -21430 -15548 -13531 -12530 -22744 -13882
5960a3882N704j6895r532M213R541J4532K0451O394J6411l043k598K685j561j2999
$$ -13882 -8178 -25073 -34605 -30392 -20851 -6319 14132 20526 36937 33894 31296 33981 32420 19421
5946A9421k0841j7217O341O926j2233K6823K4735k2694l9142N540R571N863L925
$$ 19421 -1420 -18637 -12296 -5370 -17603 9220 33955 11261 -27881 -22341 -12770 -6907 -2982
5933b982J2227k0081q948j5342l6123L763L6921K5884K9627K0592n81j5062k7610
$$ -2982 9245 -10836 -19784 -35126 -71249 -67486 -30565 -4681 24946 45538 44957 29895 2285
5920B285l2616j7209j0225k63M268K3228J2055J6205J2156j2743l4603P930M133
$$ 2285 -30331 -47540 -57765 -58028 -53760 -30532 -18477 -2272 9884 -2859 -37462 -29532 -25399
5907b5399K4625K51q529j8640m622L032l075P301J2107J4920K1551p55j4563m660
$$ -25399 -774 -523 -9052 -27692 -32314 -29282 -32357 -25056 -12949 1971 23522 22767 8204 3544
5893C544J4042l759o335J0347o035j1495j3964K0959L446Q08r372J5480q798k1936
$$ 3544 17586 13827 7492 17839 11804 309 -13655 7304 10750 11558 2186 17666 8868 -13068
5879a3068L610l422R433K5876j5168p106l273k744Q064l059p629j0408J6760L348
$$ -13068 -9458 -12880 -3447 22429 7261 155 -3118 -5862 2202 -857 -8486 -18894 -2134 1214
5865A214J6033J2188l513q897j7057J0171R61q549K565p161K6032J1997o88j4701
$$ 1214 17247 29435 25922 17025 -32 10139 11100 2551 5116 -2045 23987 35984 35296 20595
5851B0595J5009l5001J2450n242k5288j4959J829J9535K4913K7742j6949m112
$$ 20595 35604 603 13053 7811 -17477 -32436 -30607 -11072 13841 41583 24634 20522
5839B0522k02j7526P295r714n764Q024J8407r89O104J0729k1744l9431k4967L4034
$$ 20522 20320 2794 10089 375 -5389 2635 21042 20053 26157 36886 15142 -24289 -49256 -15222
5825a5222J4335p451j745J4637j0979J0817n17q101J3484Q744J0537m0414q571
$$ -15222 -887 -8338 -10083 4554 -6425 4392 3875 -4226 9258 18002 28539 -11875 -20446
5812b0446j2808L1K3696L3741r013j5878q67j353J2173k0146R79j1885R732K6969
$$ -20446 -33254 -33223 -9527 24214 15201 -677 -1544 -2897 9276 -10870 -9891 -21776 -12044 14925
5798A4925j0868o361J3329j6776m1324j6242j0907j219K0433J9025J209k91L737
$$ 14925 4057 -2304 11025 -5751 -47075 -63317 -74224 -75443 -55010 -35985 -34776 -35067 -31330
5785c1330K0164k611j5399k605R019J6236J2233o777l1635k0506N596J093j0942
$$ -31330 -11166 -13777 -29176 -31781 -22762 -6526 5707 -1070 -32705 -53211 -47615 -46522 -57464
5772e7464j5390K9314J1461J3447P2p329K6550J0162j6030N582R20j2281j588
$$ -57464 -72854 -43540 -32079 -18632 -18560 -25889 661 10823 -5207 375 1295 -10986 -12574
5759a2574k4084k778K0732m208l6874J365K5302L1829l2025o55M293N588r384
$$ -12574 -36658 -39436 -18704 -22912 -59786 -58421 -33119 -1290 -33315 -33970 -29677 -24089 -33473
5746c3473R252M7065K6659j0206n286m8371l0145o375K0099J4882J7110J9925
$$ -33473 -24221 22844 49503 39297 34011 -14360 -44505 -50880 -30781 -15899 1211 21136
5734B1136J1757o071l025n2871j3587J5094j9784l8920M5480M2045R929k4981
$$ 21136 32893 26822 23797 -29074 -42661 -27567 -47351 -86271 -40791 1254 11183 -13798
5722a3798k3229O923J3635N633M93m469J1541k610k8500K0663J8005J6299k3958
$$ -13798 -37027 -30104 -16469 -10836 -10343 -14812 -3271 -5881 -34381 -13718 4287 20586 -3372
5709c372k7064j4359p742K2650K5080k5065K19L3968Q123j0328l435q825Q532
$$ -3372 -30436 -44795 -52537 -29887 -4807 -29872 -29653 4315 12438 2110 -1325 -10150 -1618
5696a618J9738o704m303j9362n068j875R590m766n130J5739l284j0957J9472N826
$$ -1618 18120 11416 7113 -12249 -17317 -19192 -9602 -14368 -19498 -3759 -7043 -18000 1472 7298
5682G298k8528j227J4429N78k5930q256M4736K2165m480M45o541O643j4044k3626
$$ 7298 -21230 -22457 -8028 -7450 -33380 -41636 3100 25265 20785 21230 14689 21332 7288 -16338
5668a6338j8038P879K0697K1508n947k5921Q761P632j8069J7617K2209k1070j198
$$ -16338 -34376 -26497 -5800 15708 9761 -16160 -7399 233 -17836 -219 21990 920 -278
5655b78j5643J1597J8471j334K397J3832J9055k4380K9364j0776k4296p222k4179
$$ -278 -15921 -4324 14147 12813 15210 29042 48097 23717 53081 42305 18009 10787 -13392
5642a3392j66J3259J2275k8465j0088K4294J4197N160k6933k740j604k2724p808
$$ -13392 -13558 -299 11976 -16489 -26577 -2283 11914 17074 -9859 -12599 -14203 -36927 -44735
5629d4735J913m820k579k861K6281J0302j0520J7746L0304N673j1676K7639m731
$$ -44735 -42822 -47642 -50221 -53082 -26801 -16499 -27019 -9273 21031 26704 15028 42667 37936
5616C7936j5682k7060M013j2481J5330j4487j3419j9483r307n490L476j0188K9171
$$ 37936 22254 -4806 -793 -13274 2056 -12431 -25850 -45333 -54640 -60130 -56654 -66842 -37671
5603c7671L9742o6j0943k4977j3819o949N974n931J2724K5350K7531J214k9847
$$ -37671 2071 2005 -8938 -33915 -47734 -54683 -48709 -54640 -41916 -16566 10965 12179 -17668
5590a7668l221K7328J8161j4200o134J0317K5271J5304J6484n119j872l5669n2370
$$ -17668 -20889 6439 24600 10400 4266 14583 39854 55158 71642 66523 64651 28982 -23388
5577b3388J5136J9781k29J1804k3715j2696M8832L3405j4577n0435j8059J8315
$$ -23388 -8252 11529 11300 23104 -611 -13307 35525 68930 54353 3918 -14141 4174
5565D174K1357Q90j1793l135j2997p526J389l285R683N186l688k0166j6392j4798
$$ 4174 25531 26421 14628 11493 -1504 -9030 -7641 -10926 -1243 3943 255 -19911 -36303 -51101
5551e1101N35M1747K5362J7035k874j7296J6167M076K456j6164l8981k1034J6494
$$ -51101 -50566 -8819 16543 33578 30704 13408 29575 33651 36107 19943 -19038 -40072 -23578
5538b3578M1930K280q45j9308L319j0793k3971r833K3760K2510J7731j1656n622
$$ -23578 18352 20632 19787 479 3798 -6995 -30966 -40799 -17039 5471 23202 11546 5924
5525E924k920K5002j4872m0867q134L627N449J1011j366j8973k4863J5225K2933
$$ 5924 3004 28006 13134 -27733 -35867 -32240 -26791 -15780 -17146 -36119 -60982 -45757 -22824
5512b2824m959J7247K0358J528k4000J0657m477j1676K06J0465j018j5353M122
$$ -22824 -27783 -10536 9822 11350 -12650 -1993 -6470 -18146 -17940 -7475 -8493 -23846 -19724
5499a9724Q095M643M745Q090P945j3637R580K846j5944q294Q498r909q581K9372
$$ -19724 -11629 -6986 -2241 5849 13794 157 9737 12583 -3361 -11655 -3157 -13066 -21647 7725
5485G725o507k6121N022k710l660O234M645l447N923J8603o18j4029K1900K555
$$ 7725 1218 -24903 -19881 -22591 -26251 -20017 -15372 -18819 -12896 5707 5089 -8940 12960 15515
5471A5515j491K078R459M967j3738k6713n60J5010R753q269l050n077r942m3693
$$ 15515 14024 16102 25561 30528 16790 -9923 -10483 4527 14280 6011 2961 -2116 -12058 -55751
5457e5751J4502K5917j1801K04J3707M5398J6629j98n874j0292k4061J8057J5526
$$ -55751 -41249 -15332 -27133 -26929 -13222 32176 48805 48607 42733 32441 8380 26437 41963
5444D1963ml099l5491J685j5507j2101P794k0802j34K4556L4643P956j8978l7214
$$ 41963 41959 38860 3369 5054 -10453 -22554 -14760 -35562 -35696 -11140 23503 31459 12481 -24733
5430b4733k3942M615J5684L357L8535N987j5401q787K5339J3706j6227k2741k7335
$$ -24733 -48675 -44060 -28376 -25019 13516 19503 4102 -4685 20654 34360 18133 -4608 -31943
5417c1943J772K4224j9481l916m910k3132J2575M0325j3405J5969J6673L76J2739
$$ -31943 -30171 -5947 -25428 -29344 -34254 -57386 -44811 -4486 -17891 -1922 14751 15127 27866
5404B7866o492l6116M962j5318p128J0713L0590k8385j5409K0855l193L102j836
$$ 27866 21374 -14742 -9780 -25098 -32226 -21513 9077 -19308 -34717 -13862 -17055 -13953 -15789
5391a5789N534J7429j2974j8978P982K656J0337j8637q085K7180R920k6089O66
$$ -15789 -10255 7174 -5800 -24778 -16796 -14140 -3803 -22440 -30525 -3345 6575 -19514 -18848
5378a8848J1519O117K0349k2959k892K0475Q430j8620j1381l381k8027Q766J4631
$$ -18848 -7329 -1212 19137 -3822 -6714 13761 22191 3571 -7810 -11191 -39218 -30452 -15821
5365a5821n457l069N0J6374j1650j3848k295n02R185J4485p49P32J6459R655L577
$$ -15821 -21278 -24347 -24297 -7923 -19573 -33421 -35716 -36218 -27033 -12548 -13297 -12565 3894 13549 17126
5350A7126k5814l5247J431M0497L27j2959J7110m387p81J2230J1668J35k9874
$$ 17126 -8688 -43935 -42504 -2007 -1680 -14639 2471 -1916 -2697 9533 21201 21336 -8538
5337h538j7085K0812K2462p287j9756k7001j9694J8174L0349r096n5324l1842
$$ -8538 -25623 -4811 17651 10364 -9392 -36393 -56087 -37913 -7564 -16660 -71984 -103826
5325a03826M0222O182K0284L2852K269o479j4879J2597J2424k0116k8672K0646
$$ -103826 -63604 -57422 -37138 -4286 -2017 -8496 -23375 -10778 1646 -18470 -47142 -26496
5313b6496J5354J4152K224r871j1972Q111K0432j5703N340K6105j9766o56J7975
$$ -26496 -11142 3010 5234 -4637 -16609 -8498 11934 -3769 1571 27676 7910 7254 25229
5300B5229R596J938j1817J8273N886j6428l6145j4341K0347l056q888j7230R708
$$ 25229 34825 36763 24946 43219 49105 32677 -3468 -17809 2538 -518 -9406 -26636 -16928
5287a6928K5524o688j0957J8778m018l4717k1059p112K1206l695L465j5479N355
$$ -16928 8596 1908 -9049 9729 5711 -29006 -50065 -57177 -35971 -39666 -36201 -51680 -46325
5274d6325J3098J0905j2624j4323j4396j1891N2871L2773k1468L432M359p535
$$ -46325 -33227 -22322 -34946 -49269 -63665 -75556 -22685 10088 -11380 -7948 -3589 -11124
5262a1124j928k6531J0147K5971K2770j6316M03K1657j949p238k6562Q357o164
$$ -11124 -13052 -39583 -29436 -3465 19305 2989 3392 25049 23100 15862 -10700 -2343 -8507
5249h507J0003R169l0356j2351N219n824O603L2583p168P138K583k2142l160j8368
$$ -8507 1496 10665 -19691 -32042 -26823 -32647 -26044 6539 -629 6509 9092 -13050 -16210 -34578
5235c4578m1700k0347J5442L475M9771J8327L499J1865j0826M130R773P796K6354
$$ -34578 -76278 -96625 -81183 -77708 -27937 -9610 -6111 5754 -5072 -942 8831 16627 42981
5222D2981k898l2310j3090J4154J657K0981L652k012L474m238k2600j9009J6583
$$ 42981 40083 7773 -5317 8837 10494 31475 35127 33115 36589 32351 9751 -9258 7325
5209G325K0359k1999k5133J0157J9835j475j5820N396J5115j2980j1795l3339
$$ 7325 27684 5685 -19448 -9291 10544 9069 -6751 -1355 13760 780 -11015 -44354
5197d4354j9922O272K5014L9344J4028j3262l3884P584L4707K224k5782k9561
$$ -44354 -64276 -58004 -32990 6354 20382 7120 -26764 -19180 15527 17751 -8031 -37592
5185c7592J3073L8262L8159j1592l5181p122r132q157k772r302j4242J40K5552
$$ -37592 -24519 13743 51902 40310 5129 -1993 -11125 -19282 -22054 -31356 -45598 -45458 -19906
5172a9906K1283K975q598j2252l315P08Q772J9477l029m612r603o920j6146L345
$$ -19906 1377 4352 -4246 -16498 -19813 -19105 -10333 9144 6115 1503 -8100 -15020 -31166 -27821
5158b7821K294J3812p584l064n123M324j6110L4621J5826k1898j6167j014L4308
$$ -27821 -25527 -11715 -19299 -22363 -27486 -23162 -39272 -4651 11175 -10723 -26890 -27904 6404
5145F404J8038p909k6904j7296l3143J9037N7893j3817n562K5827k5862L004o540
$$ 6404 24442 16533 -10371 -27667 -60810 -41773 16120 2303 -3259 22568 -3294 -290 -6830
5132f830j7045n136j5368j976O431K2914l102o503m06K3384J3724k520j8890O261
$$ -6830 -23875 -29011 -44379 -46355 -39924 -17010 -20112 -26615 -27021 -3637 10087 7567 -11323 -5062
5118e062J8788J8058k34j0544l4021k1264p985J2564k684n54K5580R480r379j0235
$$ -5062 13726 31784 31550 21006 -13015 -34279 -42264 -29700 -32384 -32938 -7358 2122 -7257 -17492
5104a7492j6609m67K2521j4700j0811M3806M6235N273Q896j5919o4724o266q810
$$ -17492 -34101 -34568 -12047 -26747 -37558 6248 52483 57756 66652 50733 -13991 -20257 -29067
5091b9067p236r682K5515J7025O638J0161J8964M04m827j5709O433O799K283r997
$$ -29067 -36303 -45985 -20470 -3445 3193 13354 32318 32722 27895 12186 18619 25418 27701 17704
5077A7704o587o016k763j8844r115P627J3362j9127n450m279Q332K6845J3558
$$ 17704 11117 5101 2338 -16506 -25621 -17994 -4632 -23759 -29209 -33488 -25156 1689 15247
5064A5247R919M382j9678j9335k0633j3597K0429K008O135j943O559K4405K5099
$$ 15247 25166 29548 9870 -9465 -30098 -43695 -23266 -21258 -15123 -17066 -10507 13898 38997
5051C8997o867J173j7309j3890q953K2062p013k0376L241O926j7784K0670P678
$$ 38997 32130 33303 15994 2104 -6849 15213 8200 -12176 -8935 -2009 -19793 877 8555
5038H555l7990k3906K6671M877p211J6708N881L5488J9050J808k1992p562j1628
$$ 8555 -29435 -53341 -26670 -21793 -29004 -12296 -6415 29073 48123 49931 27939 20377 8749
5025H749o849J8340K2584m11J826k038L809r418l2298J3761J6205j7452j8148
$$ 8749 1900 20240 42824 42413 44239 42201 46010 36592 4294 18055 34260 16808 -1340
5012a340l891O525p292r06j7192K2904P690j0447k7017k4001K2467K3780j1286
$$ -1340 -5231 1294 -5998 -6904 -24096 -1192 6498 -3949 -30966 -54967 -32500 -8720 -20006
4999b0006l8543R260K4635j9358j8263K8901J8899P510J8860N02k0751j8299O865
$$ -20006 -58549 -49289 -24654 -44012 -62275 -33374 -14475 -6965 11895 12397 -8354 -26653 -19788
4986a9788k939J1843j1679n383k1328k1624Q994K7209P693j2779k286N616K694
$$ -19788 -22727 -10884 -22563 -27946 -49274 -70898 -61904 -34695 -27002 -39781 -42067 -36451 -33757
4973c3757K4304J2575J3615Q597k4434j6817J5027j2746j3758J7901J7645R978
$$ -33757 -9453 3122 16737 25334 900 -15917 -890 -13636 -27394 -9493 8152 18130
4961A8130J213p041L979Q666J372J7988J2028j557j6278j7285j4334r612k84k5360
$$ 18130 19343 12302 16281 24947 26319 44307 56335 54778 38500 21215 6881 -2731 -3015 -28375
4947b8375k0760L027L1148M959Q384J9614j7744Q440j811j7367o514j2530q887
$$ -28375 -49135 -46108 -14960 -10001 -1617 17997 253 8693 6882 -10485 -16999 -29529 -38416
4934c8416K709j4644j8461L0149J7741N470j4050M40L0908J7363J1164n304Q499
$$ -38416 -35707 -50351 -68812 -38663 -20922 -15452 -29502 -29062 1846 19209 30373 25069 33568
4921C3568J4415Q349Q81j7356r690p482k0180k8671j4142P194j8650K0134J9185
$$ 33568 47983 56332 57213 39857 30167 22685 2505 -26166 -40308 -33114 -51764 -31630 -12445
4908a2445M497J4002J0358k5177o848j0615j0169j3276K1591J2461m522p485J9883
$$ -12445 -7948 6054 16412 -8765 -15613 -26228 -36397 -49673 -28082 -15621 -20143 -27628 -7745
4895g745R024J2625k710p797j6406n003p445q848J7716j0649j1230Q707K2758
$$ -7745 1279 13904 11194 3397 -13009 -18012 -25457 -34305 -16589 -27238 -38468 -29761 -7003
4882g003J6634J5410J024Q266m276j4740K1674J079k1869q139j639R715k1365
$$ -7003 9631 25041 26065 34331 30055 15315 36989 38068 16199 8060 6421 16136 -5229
4869e229K035M532Q861O876k2102O298P64M154j4312j2073O184J272J1315l0524
$$ -5229 -3194 1338 10199 17075 -5027 1271 2035 6189 -8123 -20196 -14012 -12740 -1425 -31949
4855c1949m0307M151K875J1050M983J1818K3778q573n290J6357J5092p416j3940
$$ -31949 -72256 -68105 -65230 -54180 -49197 -37379 -13601 -22174 -27464 -11107 3985 -3431 -17371
4842a7371j738K2125K920J8567l2583N049J7075M1057J1197k7253n373P051j1751
$$ -17371 -19109 3016 5936 24503 -8080 -3031 14044 55101 66298 39045 33672 40723 28972
4829B8972k2750j4092j0500J5028k787O285K1804K029j0694l218j6030Q75j5613
$$ 28972 6222 -7870 -18370 -3342 -6129 156 21960 23989 13295 10077 -5953 -5078 -20691
4816b0691n317J299k876J0949K3907J2344j1863J043j0282j7505J0115k078j086
$$ -20691 -26008 -24709 -27585 -16636 7271 19615 7752 8795 -1487 -18992 -8877 -10955 -12041
4803a2041l489k688L7129N0670j6487n2676l8610N503N896j2521Q073K3201p382
$$ -12041 -15530 -18218 18911 69581 53094 418 -38192 -32689 -26793 -39314 -31241 -8040 -15422
4790a5422j4123K142K9998K0532K7776K103J300k0442m363P136N865m1571o221
$$ -15422 -29545 -27403 2595 23127 50903 53006 54306 33864 29501 36637 42502 931 -5290
4777e290L3386M015q376j4657n428J6740l370j9941j404P875l532J3402J3336
$$ -5290 28096 32111 23735 9078 3650 20390 17020 -2921 -4325 3550 18 13420 26756
4764B6756k5189J3199K3614p897l7858j5912K9570J2140j5990l9129J2938Q329
$$ 26756 1567 14766 38380 30483 -7375 -23287 6283 18423 2433 -36696 -23758 -15429
4752a5429j0745N779L2429n997N701l500j5481K2945J1555k51K769p519J193k4183
$$ -15429 -26174 -20395 12034 6037 11738 8238 -7243 15702 27257 27006 29775 22256 23449 -734
4738g34k7812j2342J0754k4691k1410M1756M1675J9575q865l008J00J6934k9132
$$ -734 -28546 -40888 -30134 -54825 -76235 -34479 7196 26771 17906 14898 14998 31932 2800
4725B800m2997j065J4226J5093n180k031N963O001j7008k929K6135J0525k9846
$$ 2800 -40197 -41262 -27036 -11943 -17123 -19154 -13191 -7190 -24198 -27127 -992 9533 -20313
4712b0313p507o459m202J1206J8810j912l0183j2336L329K1345k089o731j766
$$ -20313 -27820 -34279 -38481 -27275 -8465 -10377 -40560 -52896 -49567 -28222 -30311 -37042 -38808
4699c8808O431M012L4721o062j3801o184M268j6184k048K166J457j4269j081K9992
$$ -38808 -32377 -28365 6356 294 -13507 -19691 -15423 -31607 -33655 -31489 -30032 -44301 -45382 -15390
4685a5390K4278M0199M030n1320l0883j385P301O529L6862M2748l5038l7598j2385
$$ -15390 8888 49087 53117 1797 -29086 -30471 -23170 -16641 20221 62969 27931 -9667 -22052
4672b2052K3082J7043l362J1406K2849j2373O523M448m9680J8382J8252J0524
$$ -22052 1030 18073 14711 26117 48966 36593 43116 47564 -2116 16266 34518 45042
4660D5042j2059j4648q667l871k329o461J0860j8558l2011j3625M8342p459j573
$$ 45042 32983 18335 9668 5797 3468 -2993 7867 -10691 -42702 -56327 -7985 -15444 -17017
4647a7017Q151J3554m7050k3012O901K2010k55j1554j3400n843p428J7419K2791
$$ -17017 -8866 4688 -42362 -65374 -58473 -36463 -36718 -48272 -61672 -67515 -74943 -57524 -34733
4634c4733r798Q015K1272K0018r496k8711j3215k4299J320M9509K2922R136o86
$$ -34733 -44531 -36516 -15244 4774 -4722 -33433 -46648 -70947 -69627 -20118 2804 11940 11254
4621A1254K6858j1417l7633J60k218J0643P515m555k610k317j6086j0866P77j3601
$$ 11254 38112 26695 -10938 -10778 -12996 -2353 5162 607 -2003 -4320 -20406 -31272 -30495 -44096
4607d4096K3247L0256J8341L235j0181j945l689l7174j8682L236L3770L9101l1216
$$ -44096 -20849 9407 27748 30983 20802 18857 15168 -22006 -40688 -37452 -3682 35419 4203
4594D203k3940j4965J0528J0201N477l7852p35L4099K1267l0248L904P946P761
$$ 4203 -19737 -34702 -24174 -13973 -8496 -46348 -47083 -12984 8283 -21965 -18061 -10115 -2354
$$ [...]
##END NTUPLES=NMR SPECTRUM
##END=
