##TITLE=Analysis number 313232
Compound Code tl 04666
Project Code adrs
Chemist Name dona
##JCAMPDX= 6.0         $$ Bruker NMR JCAMP-DX V2.0
##DATA TYPE= NMR SPECTRUM
##DATA CLASS= NTUPLES
##ORIGIN= Bruker BioSpin GmbH
##OWNER= NMR
$$ XWIN-NMR		Version 3.5
$$ Tue Aug 30 11:06:52 2005 GMT Daylight Time (UT+1h)  MAYBRIDGE\NMR@NMR_250MHZ
##.OBSERVE FREQUENCY= 250.131544655141
##.OBSERVE NUCLEUS= ^1H
##.ACQUISITION MODE= SIMULTANEOUS (DQD)
##.ACQUISITION SCHEME= undefined
##.AVERAGES= 16
##.DIGITISER RES= 18
##SPECTROMETER/DATA SYSTEM= dpx250
##.PULSE SEQUENCE= zg30
##.SOLVENT NAME= CDCl3
##.SHIFT REFERENCE= (INTERNAL, CDCl3, 0, 16.522)
##AUDIT TRAIL= $$ (NUMBER, WHEN, WHO, WHERE, WHAT)
$$ ##TITLE= Audit trail, XWIN-NMR		Version 3.5
$$ ##JCAMPDX= 5.01
$$ ##ORIGIN= Bruker BioSpin GmbH
$$ ##OWNER= NMR
$$ C:\u/data/dgb/nmr/ADRS/8730/pdata/1/auditp.txt
$$ ##AUDIT TRAIL=  $$ (NUMBER, WHEN, WHO, WHERE, WHAT)
(   1,<2005-08-30 11:06:30.83 +100>,<MAYBRIDGE\NMR>,<NMR_250MHZ>,
      <created by zg, POWCHK disabled, PULCHK disabled
       configuration hash MD5:
       62 19 C7 07 E1 42 D1 B7 37 6C 3D D0 77 39 F9 E6
       data hash MD5: 64K
       E7 DE EE 8A 21 BC 70 B4 01 4D 62 82 33 A6 73 6D>)
(   2,<2005-08-30 11:06:43.11 +100>,<MAYBRIDGE\NMR>,<NMR_250MHZ>,
      <Start of raw data processing
       ef LB = 0.3 FT_mod = 6 PKNL = 1 SI = 32K 
       data hash MD5: 32K
       4A 52 47 D2 A1 C0 05 1A 5D B3 EE 8F 0D C2 1A D2>)
(   3,<2005-08-30 11:06:45.94 +100>,<MAYBRIDGE\NMR>,<NMR_250MHZ>,
      <apk 
       data hash MD5: 32K
       F7 6D 2E D6 57 B3 74 2B 52 36 1B 1E D4 EE 08 5C>)
(   4,<2005-08-30 11:06:46.61 +100>,<MAYBRIDGE\NMR>,<NMR_250MHZ>,
      <abs ABSG = 5 
       data hash MD5: 32K
       5D 1D F1 8E 71 A9 40 9E 76 09 8B 4B BE 0F 59 BE>)
$$ ##END=
$$ 
$$ hash MD5
$$ 03 DC AA 5C 54 9D 5C 3A B8 3D CA EF 2B 42 A6 71
##$RELAX= 
##$RELAX= 
##$RELAX= 
##$RELAX= 
##$RELAX= 
##$RELAX= 
##$RELAX= 
$$ Bruker specific parameters
$$ --------------------------
##$DU= <C:\u>
##$EXPNO= 8730
##$NAME= <ADRS>
##$PROCNO= 1
##$TYPE= <nmr>
##$USER= <dgb>
##$AMP= (0..31)
100 100 100 100 100 100 100 100 100 100 100 100 100 100 100 100 100 100 
100 100 100 100 100 100 100 100 100 100 100 100 100 100 
##$AQSEQ= 0
##$AQ_mod= 3
##$AUNM= <au_zg>
##$AUTOPOS= <11 >
##$BF1= 250.13
##$BF2= 250.13
##$BF3= 250.13
##$BF4= 250.13
##$BF5= 500.13
##$BF6= 500.13
##$BF7= 500.13
##$BF8= 500.13
##$BYTORDA= 1
##$CFDGTYP= 0
##$CFRGTYP= 5
##$CHEMSTR= <none>
##$CNST= (0..31)
1 1 145 1 1 1 1 1 1 1 1 1 1 1 1 1 1 1 1 1 1 1 1 1 1 1 1 1 1 1 1 1 
##$CPDPRG= <>
##$CPDPRG1= <>
##$CPDPRG2= <>
##$CPDPRG3= <>
##$CPDPRG4= <mlev>
##$CPDPRG5= <mlev>
##$CPDPRG6= <mlev>
##$CPDPRG7= <mlev>
##$CPDPRG8= <mlev>
##$CPDPRGB= <>
##$CPDPRGT= <>
##$D= (0..31)
0 1 0 0 0 0 0 0 0 0.06 0 0 0 0 0 0 0.0002 0 0 0 0 0 0 0 0 0 0 0 0 0 0 
0 
##$DATE= 1125396390
##$DBL= (0..7)
120 120 120 120 120 120 120 120 
##$DBP= (0..7)
150 150 150 150 150 150 150 150 
##$DBP07= 0
##$DBPNAM0= <>
##$DBPNAM1= <>
##$DBPNAM2= <>
##$DBPNAM3= <>
$$ [...]
##$SUBNAM7= <"">
##$SUBNAM8= <"">
##$SUBNAM9= <"">
##$SW= 20.6930455092707
##$SWIBOX= (0..15)
0 0 3 0 0 0 0 0 0 0 0 0 0 0 0 0 
##$SW_h= 5175.983436853
##$TD= 65536
##$TD0= 1
##$TE= 295.16
##$TE2= 300
##$TE3= 300
##$TEG= 300
##$TL= (0..7)
0 120 120 120 120 120 120 120 
##$TP= (0..7)
150 150 150 150 150 150 150 150 
##$TP07= 0
##$TPNAME0= <>
##$TPNAME1= <>
##$TPNAME2= <>
##$TPNAME3= <>
##$TPNAME4= <>
##$TPNAME5= <>
##$TPNAME6= <>
##$TPNAME7= <>
##$TPOAL= (0..7)
0.5 0.5 0.5 0.5 0.5 0.5 0.5 0.5 
##$TPOFFS= (0..7)
0 0 0 0 0 0 0 0 
##$TUNHIN= 0
##$TUNHOUT= 0
##$TUNXOUT= 0
##$USERA1= <user>
##$USERA2= <user>
##$USERA3= <user>
##$USERA4= <user>
##$USERA5= <user>
##$V9= 5
##$VALIST= <valist>
##$VCLIST= <CCCCCCCCCCCCCCC>
##$VD= 0
##$VDLIST= <DDDDDDDDDDDDDDD>
##$VPLIST= <PPPPPPPPPPPPPPP>
##$VTLIST= <TTTTTTTTTTTTTTT>
##$WBST= 1024
##$WBSW= 4
##$XGAIN= (0..3)
0 0 0 0 
##$XL= 0
##$YL= 0
##$YMAX_a= 628157
##$YMIN_a= -480506
##$ZGOPTNS= <>
##$ZL1= 120
##$ZL2= 120
##$ZL3= 120
##$ZL4= 120
##$ABSF1= 16.522
##$ABSF2= -4.171173
##$ABSG= 5
##$ABSL= 3
##$ALPHA= 0
##$AQORDER= 0
##$ASSFAC= 0
##$ASSFACI= 0
##$ASSFACX= 0
##$ASSWID= 0
##$AUNMP= <proc_1d>
##$AZFE= 0.1
##$AZFW= 0.1
##$BCFW= 0
##$BC_mod= 0
##$BYTORDP= 0
##$COROFFS= 0
##$CY= 12.5
##$DATMOD= 1
##$DC= 0
##$DFILT= <>
##$DTYPP= 0
##$F1P= 14.0000005364418
##$F2P= -0.99999901652339
##$FCOR= 0.5
##$FTSIZE= 32768
##$FT_mod= 6
##$GAMMA= 0
##$GB= 0
##$INTBC= 1
##$INTSCL= 1
##$ISEN= 128
##$LB= 0.3
##$LEV0= 0
##$LPBIN= 0
##$MAXI= 10000
##$MC2= 0
##$MEAN= 0
##$ME_mod= 0
##$MI= 0
##$NCOEF= 0
##$NC_proc= -4
##$NLEV= 6
##$NOISF1= 0
##$NOISF2= 0
##$NSP= 0
##$NTH_PI= 0
##$NZP= 0
##$OFFSET= 16.522
##$PC= 1
##$PHC0= 127.4672
##$PHC1= 6.753531
##$PH_mod= 1
##$PKNL= yes
##$PPARMOD= 0
##$PSCAL= 4
##$PSIGN= 0
##$REVERSE= no
##$SF= 250.13
##$SI= 32768
##$SIGF1= 0
##$SIGF2= 0
##$SINO= 400
##$SIOLD= 32768
##$SREGLST= <1H.CDCl3>
##$SSB= 0
##$STSI= 32768
##$STSR= 0
##$SW_p= 5175.98343685301
##$SYMM= 0
##$S_DEV= 0
##$TDeff= 65536
##$TDoff= 0
##$TI= <Analysis number 999999
Compound Code 99
Book Reference 9
Project Code 9>
##$TILT= no
##$TM1= 0
##$TM2= 0
##$TOPLEV= 0
##$USERP1= <user>
##$USERP2= <user>
##$USERP3= <user>
##$USERP4= <user>
##$USERP5= <user>
##$WDW= 1
##$XDIM= 32768
##$YMAX_p= 314410054
##$YMIN_p= -300079
$$ End of Bruker specific parameters
$$ ---------------------------------
##NTUPLES= NMR SPECTRUM
##VAR_NAME=  FREQUENCY,     SPECTRUM/REAL,   SPECTRUM/IMAG
##SYMBOL=    X,             R,               I
##VAR_TYPE=  INDEPENDENT,   DEPENDENT,       DEPENDENT
##VAR_FORM=  AFFN,          ASDF,            ASDF
##VAR_DIM=   32768,         32768,           32768
##UNITS=     HZ,            ARBITRARY UNITS, ARBITRARY UNITS
##FACTOR=    0.157963299565203, 1,           1
##FIRST=     4132.6476996994, 0,             0
##LAST=      -1043.33573715361, 0,           0
##MIN=       -1043.33573715361, -300079,     0
##MAX=       4132.6476996994, 314410054,     0
$$ Real data points
##PAGE= N=1
##DATA TABLE= (X++(R..R)), XYDATA
$$ [...]
13733C38Q180M473j3442j024R087J241n729K813P704R514q60J1839R516K044j8399
13718B7295k1584l406J67M191p252m798r84j869O440M855M120j610j0390r671
13704a4496J8634J7263l844o023l998j6744n817K312J887O814L644N630j1817
13691f555r225j967M523L059K900p36J4978J682J582J1750J892j2863n391j1895
13677f266j3259r526m339Q120Q813J3505L610n205m852K0213K187n95O682j947
13663A7141R154j654j1999j6072j3430P501M535o188j1480k812J3176M749J9158
13650A1779N747o688k3169J355R414J982j136m790N336k183j0825j2161L576n051
13636b6814N967L749N078N287M989J167J2617J3297L100m321N166K594q296k2650
$$ plain form
13733 338 8518 12991 -451 -1475 7612 8853 3124 5937 13641 23155 22295 34134 43650 45694 27295
13718 27295 5711 2305 2472 6663 -589 -5387 -6371 -8240 -1800 3055 7175 5565 -4825 -14496
13704 -14496 4138 21401 17557 11534 7536 -9208 -15025 -12713 -10826 -4012 -368 5262 -6555
13691 -6555 -15780 -17747 -13224 -10165 -7265 -8001 6977 8659 10241 21991 23883 11020 5629 -6266
13677 -6266 -19525 -29051 -33390 -25270 -16457 -2952 658 -4547 -9399 10814 13001 12406 19088 17141
13663 17141 26295 24641 12642 -3430 -16860 -9359 -4824 -11012 -22492 -25304 -12128 -7379 11779
13650 11779 17526 10838 -12331 -10976 -1562 420 -716 -5506 -170 -2353 -13178 -25339 -21763 -26814
13636 -26814 -20847 -17098 -12020 -6733 -1744 -577 12040 25337 28437 24116 29282 31876 23580 930
13622I30o714J4887O903M132j2505p411m858J4633N651j3562j7232n997J6358
13609d785Q937N584N751J197n03j3906o973K537M133l114l142k60L505L366n843
13594c516L545k059M140Q656p206J47m726Q168j097n738J5597O597j3208p528
13580A772J6024m48j0138j2157Q759J1249k865j86N642Q947K952o11p20L06R210
13565C7736j0929j9438N820L235L319o203j4816m488K501L847M844O563j6497
13552d506j3373l111J1821m832M882J0542J2116K704J142K910q501m94O092o013
13538A1379k5313K290K1867K243O357K511n074l804J6342O034j239k79o803l339
13524B3172j8587J2285o997j4091J3098q524k259K684n488n068L724j0480J634
$$ plain form
13622 930 -5784 9103 16006 20138 7633 222 -4636 9997 15648 2086 -15146 -21143 -4785
13609 -4785 4152 9736 15487 16684 16181 2275 -4698 -2161 1972 -1142 -4284 -4544 -1039 2327 -3516
13594 -3516 29 -2030 2110 10766 3560 3707 -1019 7149 6052 314 15911 22508 9300 1772
13580 1772 17796 17348 7210 -4947 3812 15061 12196 12010 17652 26599 29551 28940 28220 28526 37736
13565 37736 26807 7369 13189 16424 19743 13540 -1276 -5764 -3263 584 5428 11991 -4506
13552 -4506 -17879 -20990 -9169 -14001 -9119 1423 13539 16243 17385 20295 11794 11300 17392 11379
13538 11379 -13934 -11644 10223 12466 18823 21334 16260 12456 28798 34832 33593 33314 26511 23172
13524 23172 4585 16870 9873 -4218 8880 356 -1903 781 -4707 -9775 -6051 -16531 -14897
13511a4897J1943K685j2235o168Q904Q708O986k602o807M954J1608K794n809J7133
13497B7197K167j0989q969K565n47j0233M652M650j5742K284R215M303q343P871
13483A0081k630J018l663j8704J0244L514J345P35J4991p247j1153O223N129P977
13469A7860N834m356q040j3723q690J251N945p349p513J6602O353J431L188K613
13455A1406l40r256k2158O032J5052O808N841r4r596j4687j7133K739J0781J2305
13441b300K2842j779k384j5374K714j0794N203J2085p4r074j3266n265L060L827
13427a0579J3051J0577O44J944l313q007k962m330p170k093L458N34J3377L552
13413H683O294J2814j1420J66o00L30P804j5499J413J3492J0001J3446j154r721
$$ plain form
13511 -14897 -2954 -269 -12504 -18672 -9768 -1060 5926 3324 -3483 1471 13079 15873 10064 27197
13497 27197 29364 18375 9406 11971 11424 1191 5843 10493 -5249 -2965 6250 10553 2210 10081
13483 10081 7451 8469 4806 -13898 -3654 -140 1205 1940 16931 9684 -1469 4754 9883 17860
13469 17860 23694 19338 11298 -2425 -11115 -9864 -3919 -11268 -18781 -2179 4174 5605 8793 11406
13455 11406 11066 1810 -20348 -14316 736 7544 13385 13291 3695 -10992 -28125 -25386 -14605 -2300
13441 -2300 20542 18763 16379 1005 3719 -7075 -1872 10213 10139 1065 -12201 -17466 -14406 -10579
13427 -10579 2472 13049 13693 15637 12324 4317 1355 -2975 -10145 -12238 -8780 -8246 5131 8683
13413 8683 14977 27791 16371 16537 15937 16267 24071 8572 9985 23477 33478 46924 45770 36049
13399C6049r690l585M720o824p932N72j5206j3032N944J7160J722O291N837N357
13385B7383j2958j4226j6838l852J0930J0893J194N730P274J1838R44n177q723
13372A4412p59M659K082N226J0112J0189q858l892P989r645o005K119L070j2343
13358A8356O202m866p342N387M068k3203r925p695q31R89O963J2610m411p745
13344a1443P762J2734M162O821M588k206J169J0452j2835j1781m45l451L890K633
13330A2050k414j6327J627J2464r04k7574J533J1135J7622J5765M967J862j0973
13317B0833j0630l110j2088j0496N057K726k982k468J7906j706q759M526J6110
13304A4919m599o219n827O667r590r764j807O286P25k232M591M58R321R423M723
$$ plain form
13399 36049 26359 22774 27494 20670 12738 13310 -1896 -14928 -8984 8176 9898 16189 22026 27383
13385 27383 14425 199 -16639 -20491 -9561 1332 2526 8256 15530 27368 28312 23135 14412
13372 14412 13653 18312 20394 25620 35732 45921 37063 33171 41160 31515 25510 27629 30699 18356
13358 18356 24558 19692 12350 17737 21805 -1398 -11323 -19018 -19849 -18860 -11897 713 -3698 -11443
13344 -11443 -3681 9053 13215 20036 24624 22418 23587 34039 21204 9423 8978 5527 9417 12050
13330 12050 9636 -6691 -5064 7400 6496 -21078 -19545 -8410 9212 24977 29944 31806 20833
13317 20833 10203 7093 -4995 -15491 -10434 -7708 -10690 -13158 4748 3042 -5717 -1191 14919
13304 14919 10320 4101 -1726 4941 -4649 -14413 -16220 -9934 -9209 -11441 -6850 -6392 2929 12352 17075
13289A7075m641L552M940q460r7M098j0071p60O450m663L668m56J4287J679p222
13274A9379K260k671k283J2917j103j7736p913j445p652J5521M339j1646j199
13261G68j922Q908J1047l630P289j5615j334r69O528R946N170K803p887q168m90
13246A2444l012m58j835M714R347r519P585J2832j9571j1584J0753M007m107j3511
13232a915R910J6338N599n781l760P578j0878p59J0770P242R45n607j586j5296
13218A2800p836N759k098j336j31K617J1515J1014n220n783j2168k793l693k000
13204F47J064l011P492M675M621J0756J0430o014j2788K51P381J303J740j973
13190B6574r229M899J1418j3472r105O531M424r505l736K196k836J0642J4501
$$ plain form
13289 17075 12434 15986 20926 12466 12369 16467 6396 5636 12086 7423 11091 10635 24922 26601 19379
13274 19379 21639 18968 16685 29602 28499 10763 2850 1405 -6247 9274 13613 1967 768
13261 768 -1154 7754 18801 15171 22460 6845 5511 4542 11070 21016 26186 28989 21102 12934 12444
13246 12444 9432 8974 7139 11853 21200 11681 19266 32098 12527 943 11696 15703 11596 -1915
13232 -1915 7995 24333 29932 24151 20391 27969 17091 16332 27102 34344 35289 29682 28096 12800
13218 12800 4964 10723 8625 7289 7158 9775 21290 32304 27084 21301 9133 6340 2647 647
13204 647 1711 -1300 6192 10867 15488 26244 36674 30660 17872 18123 25504 26807 28547 26574
13190 26574 17345 22244 33662 20190 11085 17616 22040 12535 8799 10995 8159 18801 33302
13177C3302j1362j1240r661j3602L460J8225O893P7K879N155p567r114n496l550
13163a601n375L395J968P632J978N794P281L530j217J0605l636m496q444o506
13149A0908M480J2400j433j2265M424N445L430O11k0371j1072P939O999N674Q308
13135B5477n382n604J3292R261q981j3824m388q959n793J074K1014n493r187m299
13121a792N667P104J6687L707J226j08L568M161j319n866l1m217K620j397N942
13106C5952l021j0136j850K092L827J1195Q594j7453j8849l162q522L660K1652
13093B3979J0544k656J314O633n662k5119j2649P96J0953m492n702J026J3629
13080A2594P819O79p960p957N401L410L567O830K440m288L929K616K019m95N737
$$ plain form
13177 33302 21940 10700 1039 -12563 -9103 9122 16015 16092 18971 24126 16559 7445 1949 -1601
13163 -1601 -6976 -3581 -1613 6019 7997 13791 21072 24602 23385 33990 30354 25858 17414 10908
13149 10908 15388 27788 26355 14090 18514 23959 27389 28000 7629 -3443 4496 11495 17169 25477
13135 25477 20095 14491 27783 37044 28063 14239 9851 892 -4901 -3827 17187 11694 2507 -1792
13121 -1792 3875 10979 27666 31373 32599 32491 36059 40220 38901 33035 33004 28787 31407 30010 35952
13106 35952 32931 22795 20945 23037 26864 38059 46653 29200 10351 7189 -1333 2327 23979
13093 23979 34523 31867 33181 39814 34152 9033 -3616 -2820 8133 3641 -2061 -1035 12594
13080 12594 20413 21092 13132 5175 10576 13986 17553 24383 26823 22535 26464 29080 31099 30604 36341
13065C6341J0499q580k168%q105p093k49r856Q842O528O368J2870j0867j1485
13051B3045n449L336J636P316o77m665n506r719l688k996n889J2157J0843J2830
13037C2574p706j0156m384O454N059o254J722Q982l439n143M734K889J637J2184
13023C9153k907j5993k845l50j4672j0153R093J2200J1183Q890J219q110P493
13010C4201J1005j140j635n273o269k588j2411q09P485l166k754l022P137O844
12996B7605K302q769n164j0341m579Q157R71J0452N75r274m789J252m936o277
12982b815J3697J1011J103O278L790o169J980P265o471k025J781m388j754k281
12968B1002J3249L676J6445o452n807O680q910p707M783n611m926J747n763j3579
$$ plain form
13065 36341 46840 38260 36092 36092 27987 20894 20645 10789 19631 26159 32527 45397 34530 23045
13051 23045 17596 20932 22568 29884 29207 24542 19036 9317 5629 2633 -3256 8901 19744 32574
13037 32574 24868 14712 10328 16782 21841 15587 17309 26291 22852 17709 22443 25332 26969 39153
13023 39153 36246 20253 17408 17058 2386 -7767 1326 13526 24709 33599 34818 26708 34201
13010 34201 45206 44066 42431 37158 30889 28301 15890 15081 22566 19400 16646 13624 20761 27605
12996 27605 29907 21138 15974 5633 1054 9211 10182 20634 21209 11935 7146 8398 3462 -2815
12982 -2815 10882 21893 22996 29274 33064 26895 28875 36140 29669 27644 29425 25037 23283 21002
12968 21002 34251 37927 54372 47920 42113 48793 39883 32176 36959 31348 26422 28169 22406 8827
12954H827j948P941J4647j001j1290r824O940P107K320O371J828O092j3677j477
12940B2856J1505j164j987l797j1068P322L958p795j3112l599L80l356O612J175
12926G930O638k40q759P840K344M878L710q064r35O236P161Q083n853j1153J1736
12911C1552O450j228K892l382Q491K433l749j4310j5909n621o075k651J0282J415
12897A0590o325j5697l276R927N554M088J4914R334J1243j1004J230J296p987
12884B3887n484j8440p506P598J2026N459k412L860M364n117L043J2617k588Q917
12870D0224K582n509j0409r978r924j454J8659J8324J8594K812j6597j5535j8629
12857A3160l605J6861o534K887J452M261L041j854N882O27J509M107j162j1732
$$ plain form
12954 8827 6879 14820 29467 28466 17176 7352 14292 21399 23719 30090 31918 38010 24333 22856
12940 22856 34361 33197 31210 27413 16345 23667 27625 19830 6718 3119 3499 143 6755 7930
12926 7930 14568 14328 5569 13409 15753 20631 24341 16277 15342 21578 28739 36822 30969 19816 31552
12911 31552 38002 36774 39666 36284 44775 47208 43459 29149 13240 7619 1544 -1107 9175 10590
12897 10590 4265 -11432 -14708 -4781 773 4861 19775 29109 40352 29348 30578 31874 23887
12884 23887 18403 -37 -7543 55 12081 17540 15128 18988 23352 18235 21278 33895 31307 40224
12870 40224 42806 37297 26888 16910 6986 5532 24191 42515 61109 63921 47324 31789 13160
12857 13160 9555 26416 19882 22769 24221 28482 31523 29669 35551 36178 37687 41794 40632 28900
12843B8900k22J7812O895p533l294L536o38j722M110l105j0929Q096J4419q57
12829E5468j1140p394l82k655m944N789Q587M104n518M40P507N987N226Q651O771
12814G6497j2689j7197R945j0627q339k820J2538m070j8664r775J6113J0348k303
12801C8957J675P553R061o794m949k637O643O358M941j008p823r899n536r40P671
12786D3273k640o305L190O472L853n414J204L149o77n197j6208r923K564J4304
12772C1645R746J751J0264J728J658R083J619M263r080j3960q952j0100P071L929
12758D0665l873P853p813m975l260m667P548l041n895J090J7398O085P44r971
12744C7888K975r082N04o87M808O91o362L732J5907N72j0752J6166J1732L833
$$ plain form
12843 28900 28678 46490 53385 45852 42558 46094 45456 43734 47844 44739 33810 41906 56325 55468
12829 55468 44328 36934 36552 33897 28953 34742 43329 47433 41915 42355 49862 55849 61075 69726 76497
12814 76497 63808 46611 56556 45929 37590 34770 47308 43238 24574 14799 30912 41260 38957
12801 38957 40632 48185 57246 50452 45503 42866 49509 55867 60808 59800 51977 42078 36542 35602 43273
12786 43273 40633 34328 37518 43990 47843 42429 43633 46782 46105 40908 24700 14777 17341 31645
12772 31645 41391 43142 53406 55134 56792 65875 67494 71757 62677 48717 39765 29665 36736 40665
12758 40665 36792 44645 36832 31857 28597 23930 31478 28437 22542 23632 41030 47115 47859 37888
12744 37888 40863 31781 32285 31598 36406 37097 30735 34467 50374 50946 40194 56360 68092 71925
12730G1925j1126p867j6439j0406O851M632M812n920P348j556j5109l067N619
12717B9697m729P344J455m182K2885P936k4827j9890N484J0915K510J107M865
12704D0570M846k388m034J056M458O359N369J6702j824j7778o755k062J6638j2207
12690D8950j0189j7367K014O987Q268J0255J4149J3374m764p098J845J2743K694
12677H1861r133j3689N752l433L456K428n338O493l511q254m746M505P773M414
12663F8578P519Q803K299J3084R197J6233l331P589J0849L1473K5169O603K2525
12650B26590N2637R2359J25048J63822J45465P3616k1805j15327j47487j35185
12640D59733j14401p7094n5326l8704k4888o202N330p615k1008k0215j9577P23
$$ plain form
12730 71925 60799 52932 36493 26087 32938 37570 42382 36462 43810 42254 27145 24078 29697
12717 29697 24968 32312 33767 29585 52470 60406 35579 15689 21173 32088 34598 35705 40570
12704 40570 45416 43028 38994 40050 44508 50867 56236 72938 71114 53336 46581 44519 61157 48950
12690 48950 38761 21394 23408 30395 38663 48918 63067 76441 71677 64579 66424 79167 81861
12677 81861 72728 59039 64791 61358 64814 67242 61904 68397 64886 56632 51886 56391 64164 68578
12663 68578 76097 84900 87199 100283 109480 125713 122382 129971 140820 172293 197462 204065 226590
12650 226590 279227 371586 496634 660456 805921 879537 857732 742405 594918 459733
12640 459733 345332 268238 212912 174208 149320 143118 148448 140833 119825 99610 80033 80756
12628H0756J156O198M250L92Q029J3016J9072O794l940L20J1488K0303J7288K3051
12614B08173L8643K2890J6232L2115N1204Q8557J46588K12266K94194L35017K59204
12603A705083P1914j27089k58143k91017k61407j99619j58619j06931o6038m2031
12593B66103l9068j9687j1710j8883k7691l2343j3505l04M002N440l852L81r92
12580A07891Q062O594n39M951J1011L032O134K2755O610J4080L1634K3112L2842
12567B78169N7252P5067J08914J35057J56073J22320L0810m3306j14912j58255
12557F47189j52965j18721p5771m1524l1146k7875k0034j2730j5438k2098l3648
12546I5239o939O285J1118p211m182R477l433K847K314k174j2609r335K329J2790
$$ plain form
12628 80756 81912 88110 92360 92752 100781 113797 132869 139663 135723 136043 147531 167834 185122 208173
12614 208173 246816 269706 285938 318053 369257 457814 604402 816668 1110862 1445879 1705083
12603 1705083 1776997 1649908 1391765 1100748 839341 639722 481103 374172 308134 266103
12593 266103 227035 207348 195638 176755 149064 116721 103216 102912 106914 112354 108502 108883 107891
12580 107891 115953 122547 122008 126959 137970 141002 147136 169891 176501 190581 222215 245327 278169
12567 278169 335421 410488 519402 654459 810532 932852 963662 920356 805444 647189
12557 647189 494224 375503 299732 258208 227062 199187 179153 166423 150985 128887 95239
12546 95239 88300 94585 105703 98492 94310 103787 100354 103201 105515 103341 90732 81397 83726 96516
12532I6516N504J1290K136r378j514R586O661j8807m631q20J2181l33j613j3140
12518I3638J928O262m801O118J2025j6395j2497l349J4673N706m887r714r411
12505G9296j1018l812r156N276R600L637J1224J4484J5899N793J3729J083q946
12492A27089j2620j1470M756M933l153n289n136j120r07m962N693M213m505j2048
12478H5474L120L302j269q480q393N820J2135R459L21o570L00K586j119j0537
12464H6149K408j2127q258j917J0895J0376J0131J9922K0774R441O295N676j3267
12451A46498n985J9210L2952K5552K6152Q000q162k5762k4832k2642l1679k284
12439A37018j1288m567J4317O932M235p258j641R834Q366M302J5163o074j1299
$$ plain form
12532 96516 102020 113310 115446 106068 104554 114140 120801 101994 97363 96543 108724 108391 106778 93638
12518 93638 95566 101828 97027 103145 115170 98775 86278 82929 97602 103308 98421 88707 79296
12505 79296 68278 64466 55310 60586 70186 73823 85047 99531 115430 121223 134952 136035 127089
12492 127089 114469 102999 107755 112688 109535 104246 99110 97990 97083 92121 97814 102027 97522 85474
12478 85474 88594 91896 90627 82147 73754 79574 91709 101168 101489 94919 95219 97805 96686 86149
12464 86149 88557 76430 68172 66255 77150 87526 97657 117579 138353 147794 154089 159765 146498
12451 146498 140513 159723 192675 218227 244379 252379 244217 218455 193623 170981 139302 137018
12439 137018 125730 121163 135480 142412 146647 139389 137748 147582 155948 160250 175413 169339 158040
12426A58040r521j3974n065p050M168J5111J14J6082Q463K086m813L334N744q764
12412A63955j1566o0N494J8645L7259O8515Q1898N7951O717m6871n4634l7726
12400B89577l8372l9104k9515j5636k6057j7143J1090j20Q79O747r21K2064L8331
12387B01820M2177M7852M7817L9269K1812l240j9965k0235l4478m4458k8707j1805
12375B37859j0152o609M28j9561j321K82l991N724R394J6789L9705M4775L5708
12362C49030J206k4749l1560j8037j3394j3217j4468j6251k6485k6250k2026k5939
12350A17860j0651j5262Q452L6801L9522Q0058J01897R5941P7461N1132P545j9225
12338E71531l5348l5458m6057n5892k6968j6138P152R116Q509J4395Q125K529
$$ plain form
12426 158040 148519 134545 129480 122430 126598 141709 141823 157905 166368 168454 163641 166975 172719 163955
12412 163955 152389 152329 157823 176468 213727 282242 364140 422091 428808 381937 327303 289577
12400 289577 251205 212101 182586 166950 140893 123750 134840 134720 135599 142346 141425 163489 201820
12387 201820 243997 291849 339666 378935 400747 397507 377542 357307 322829 278371 249664 237859
12375 237859 227707 221098 221526 201965 200644 200926 196935 202659 212053 228842 268547 313322 349030
12362 349030 350236 325487 293927 275890 262496 249279 234811 218560 192075 165825 143799 117860
12350 117860 107209 91947 100399 137200 176722 256780 358677 454618 532079 583211 590756 571531
12338 571531 536183 500725 454668 398776 371808 355670 362822 371938 380447 394842 402967 405496
12326D05496L2872N0522L9185M4807P2048M7823j1659o5996q8889q4847o7910
12315C73452m8727k9429q866l525l665j1827k9612k2459p063r127k202K2735L9794
12302B59479O1966P0139O3354L5077K5959Q878j9336k2681j1242j7780j1422Q776
12290D51167K5706L3572L3137M8305M3174M5821M0845P3864J30369J56543J26055
12279A208558M8978p4328j59255j71038j30764j10231p1711n1582l7638k0287
12269D30702K41K2274J8729L626O490k977j2946r18J9970K4294J2285J5199J2163
12256E49132K3261K0503K1616J9177K7043K6813L2206M8068M1816L7291L9420
12245H86346M8667M1286J9587K1878N5231Q1985J04793J06375P5328K5472k9379
$$ plain form
12326 405496 438368 488890 528075 572882 644930 692753 681094 615098 526209 441362 373452
12315 373452 324725 295296 286430 282905 279240 267413 237801 215342 208279 199152 196950 219685 259479
12302 259479 321445 391584 454938 490015 515974 524852 505516 482835 471593 453813 442391 451167
12290 451167 476873 510445 543582 591887 635061 680882 721727 795591 925960 1082503 1208558
12279 1208558 1257536 1183208 1023953 852915 722151 611920 540209 488627 450989 430702
12269 430702 430943 453217 471946 475572 482062 479085 466139 465221 485191 509485 521770 536969 549132
12256 549132 572393 592896 614512 633689 660732 687545 719751 767819 809635 846926 886346
12245 886346 935013 976299 995886 1017764 1072995 1154980 1259773 1366148 1441476 1466948 1437569
12234A437569n2006m6537k7682m807J3405L6862O9131O7183P9049R3222J11147
12223A776536J17535J01760J03914J07530J37281J50677J69910K11808K38858
12214C115809K67113L25214L98372M78305N72410P09061Q99371J145439J387360
12205I298454J662089J974685K407429K993234L868808N280691P642969J1613595
12197D6741954J7710749K4922469K9140652K4780803J0936813o698108k1234612
12190A26300720k7817674k6233570k0134706j3715408q932905n782668l729806
12183A9953983k429530j680058j302110j156297j087492r76614q12227n85536
12175I924119l32299j21216N5420K26459L88849N91900P91668J052464J438337
$$ plain form
12234 1437569 1385563 1339026 1311344 1306537 1319942 1356804 1425935 1493118 1572167 1665389 1776536
12223 1776536 1894071 1995831 2099745 2207275 2344556 2495233 2665143 2876951 3115809
12214 3115809 3382922 3708136 4106508 4584813 5157223 5866284 6765655 7911094 9298454
12205 9298454 10960543 12935228 15342657 18335891 22204699 27485390 35128359 46741954
12197 46741954 64452703 89375172 118515824 143296627 154233440 147535332 126300720
12190 126300720 98483046 72249476 52114770 38399362 29466457 23683789 19953983
12183 19953983 17524453 15844395 14542285 13385988 12298496 11321882 10509655 9924119
12175 9924119 9591820 9470604 9526024 9752483 10141332 10733232 11524900 12577364 14015701
12166A4015701J924796K472919K963108L427772L988583M840279O097459Q075822
12158D7806439J1253513J6602571K5522571L8843830N3314128N8836603M4901655
12151B97081310J2543193k2176817m6001318n5219665m8858720l6571829k5962898
12144G4833256j7978342j2131261q084516n457787l864201l089827k799512k642189
12136A8785621k434429k088544j643389j240654q94844o32960l95381k15231n0717
12127I189472R8096K83418M98423P19382R35168J157401J409609J777667K296665
12118A8365301L046500M093217N738334Q465315J2936288J9588635K6901806L0243990
12110A29379386K4390360Q819700r920215k4131682k9994303k7395752k0559932
$$ plain form
12166 14015701 15940497 18413416 21376524 24804296 28792879 33633158 39730617 47806439
12158 47806439 59059952 75662523 101185094 140028924 193343052 252179655 297081310
12151 297081310 309624503 287447686 241446368 186226703 137367983 100796154 74833256
12144 74833256 56854914 44723653 36639137 31181350 27317149 24227322 21427810 18785621
12136 18785621 16351192 14262648 12619259 11378605 10483761 9850801 9455420 9240189 9189472
12127 9189472 9287568 9570986 10069409 10788791 11723959 12881360 14290969 16068636 18365301
12118 18365301 21411801 25505018 31243352 39708667 52644955 72233590 99135396 129379386
12110 129379386 153769746 162589446 152669231 128537549 98543246 71147494 50587562
12103E0587562j3936359r133860n977429l932244k643858j859787j477193j363888
12095A0262944j308747j225993j066838q67404p18121n83609n06967m35872l57232
12086C192161l01859k61175k13953j99534j69914j33212j09184q8442p9818o3760
12076A571310m2658n7853o9955l8976k4752l1057k4087l0516m6053n8605p9082
12065A067716r3075q6473p7509n1858m4737m3913l0977k1242j812Ok2732k4392
12053E69002l858l372j0200O331K9r555n585j2829j3285j866J2462N483q546j6701
12039E07510j4089L000p434p410N996J0132M377R774P388J1779L3930R442j8728
12026E55667l2963p6622j12433r3434m7898l6901j4277J047N142J8232Q702L219
$$ plain form
12103 50587562 36651203 27517343 21539914 17607670 14963812 13104025 11626832 10262944
12095 10262944 8954197 7728204 6661366 5793962 5075841 4492232 3985265 3549393 3192161
12086 3192161 2890302 2629127 2415174 2215640 2045726 1912514 1803330 1714888 1635070 1571310
12076 1571310 1528652 1470799 1400844 1361868 1337116 1306059 1281972 1251456 1205403 1146798 1067716
12065 1067716 974641 888168 810659 758801 714064 670151 639174 617932 616120 616126 593394 569002
12053 569002 565144 561772 551572 557903 557932 548377 542792 529963 516678 514812 527274 532757 524211 507510
12039 507510 493421 496421 488987 481577 487573 497705 502082 511856 519244 531023 564953 574395 555667
12026 555667 522704 446082 333649 240215 192317 155416 141139 142186 147328 165560 174262 177481
12014A77481L585j0868n67o415j9450l5229k7423k1329k1575o314J0836J5629
12002E8361J9416L2490N2107N9569M1111K0419J3773j1600k1137k6475m389j2984
11990B20661j1731R554J9595J3214P905R446m73l8654o4220p0337m0975j9779
11978C4206k3850n240J1460R099J714r572l66Q451k2534l8141l0177l4561m5007
11965a44518m3536m7778m4294j9953J2718N1993Q6692J01837Q6642N8066M3973
11954A41842K1443J843j7771k0950j8900k9633j3824k430L458j458l960J311m155
11941E6816k539J0888j0118o617K452M104j0165Q483P682m172L617j6084j4131
11928C0216j2699j7879l1821j9626k0099l4632k8687j1201j3189k0060Q546L9582
$$ plain form
12014 177481 181066 170198 169631 163216 143766 108537 81114 59785 38210 31896 42732 58361
12002 58361 77777 110267 162374 221943 263054 283473 297246 285646 264509 238034 233645 220661
11990 220661 208930 218484 238079 251293 259198 268644 268171 229517 165297 94960 53985 34206
11978 34206 10356 5116 16576 25675 27389 17817 17451 25902 3368 -34773 -64950 -99511 -144518
11965 -144518 -188054 -235832 -280126 -300079 -287361 -235368 -148676 -46839 39803 97869 141842
11954 141842 163285 165128 147357 126407 107507 77874 64050 61620 65078 63620 59660 60971 56816
11941 56816 54277 65165 55047 48430 50882 54986 44821 53304 60986 56814 60431 44347 30216
11928 30216 17517 -362 -32183 -51809 -71908 -106540 -135227 -146428 -159617 -179677 -171131 -131549
11916a31549N1364M5251L2578K4873J9838J7205O50j047j2106j5973j4244l950
11904A2890M121n705q897J1825Q208P064K3467J4215m944O738p640j7950L999
11891D7391Q504k4198j2172q76m446K09j641M586J0596N939m789j1230q433j420
11877H020j167r458n682r746n723L939M109n4O042J0685j991r865n446M42M324
11862a1571J4030J7096m067M483p576k580J6151J6941j233j6457n535j7233r868
11849g419K811p74K12J8800K0039O178J1464J2990k432n253j0681r866o612R189
11835C8646L432r156q288n537N933n317n504J128M376q026K235r248j0498q571
11821a4395R769Q642N605r105N364M339o248l135k093J3614j3373j2593Q336J4711
$$ plain form
11916 -131549 -80185 -34934 -2356 22517 42355 59560 60210 59163 47057 31084 16840 12890
11904 12890 17011 11306 2409 14234 22442 29506 52973 67188 62244 68982 61342 43392 47391
11891 47391 55895 31697 19525 18649 14203 14412 12771 17357 27953 33892 29103 17873 9440 8020
11877 8020 6853 -2605 -8287 -18033 -23756 -19817 -15708 -15762 -9720 965 -1026 -10891 -16337 -15895 -11571
11862 -11571 2459 19555 15488 19971 12395 9815 25966 42907 41674 25217 19682 2449 -7419
11849 -7419 -4608 -5382 -5170 13630 33669 39847 51311 64301 61869 56616 45935 36069 29457 38646
11835 38646 42078 32922 24634 19097 25030 19713 14209 15337 19713 11687 13922 4674 -5824 -14395
11821 -14395 -4626 4016 9621 516 5880 10219 3971 836 -1257 12357 -1016 -13609 -5273 9438
11807I438n678j7918L216L4264L1507J3118J9390k360j4781o92j6709j2464q734
11794C1597J374j689j430J366k718j2382n343P621N109K247r971j3170q607M752
11780a244j298P793J5072q91j0253j257j0483j1689L411N034q051M003j0520Q688
11766a1685Q457Q453P300O507o411M29Q809N367K4168J4919j8028j5269m917o712
11752B1387r881l353Q331K258p305n2J4867J5051J3026J3667J2915K6107K7223
11739A34241L6364O8759R1547J24601J57812J37404P0754l3747j22041j48095
11729E17599j34592j10926p4220n4112k0720k0578j0384j8748n933J5945k247
11718H1084l312M924M096J804p801P237q444k0705J0093J2516J1884P830J2726
$$ plain form
11807 9438 3760 -14158 -10942 23322 54829 67947 87337 84977 70196 69504 52795 40331 31597
11794 31597 32971 31282 29852 31218 28500 16118 10775 18396 23505 25752 15781 2611 -5996 -1244
11780 -1244 -2542 5251 20323 19432 9179 7922 -2561 -14250 -10839 -5805 -13856 -9853 -20373 -11685
11766 -11685 -3228 5225 12525 19032 12621 13050 21859 27226 51394 66313 48285 33016 28099 21387
11752 21387 11506 8153 16484 18742 11437 11385 26252 41303 54329 67996 80911 107018 134241
11739 134241 170605 239364 330911 455512 613324 750728 821482 787735 665694 517599
11729 517599 383007 272081 197861 143749 123029 102451 92067 73319 67386 83331 81084
11718 81084 77772 82696 86792 88596 80795 88032 79588 58883 68976 81492 93376 101206 113932
11705A13932J6717R205L131J5463J7407L9360M3410M5994P8699J34920K26041
11694G44279K74149L12148K38695P0528r7309k35565k90549k58358j95342j28740
11684D33936r8216q0349n2458l4391k4144j5931j5865p246k064j131r186j6888
11672G6067K832N1n161k635j4329R22J6212K146o726j258M466L941L250M532J4907
11657I9217J6830L8293O3213O8329J04296J37986J59465J37759M5873n9018j27823
11646F84420j65327j50829j09041p6793m7591l5555k1758j5007m017j20o710j6060
11634C5612n471j382P008p478N59n002n705j5067o919J4760J5663K423j077j4545
11620A3379j3421o303j4665N242J3637k994p057p7l263J447K643J556N763o024
$$ plain form
11705 113932 130649 139854 142985 158448 175855 215215 258625 304619 383318 518238 744279
11694 744279 1018428 1330576 1569271 1639799 1542490 1306925 1016376 758018 562676 433936
11684 433936 335720 255371 202913 168522 144378 128447 112582 105336 103272 102141 92955 76067
11672 76067 78899 78950 73789 71154 56825 57747 73959 76105 69379 68121 72587 76528 79778 84310 99217
11657 99217 116047 154340 217553 285882 390178 528164 687629 825388 871261 812243 684420
11646 684420 519093 368264 259223 182430 134839 99284 77526 62519 58502 58382 51672 35612
11634 35612 30141 28759 35767 28289 28848 23846 18141 3074 -3845 10915 26578 29001 27924 13379
11620 13379 -42 -6345 -21010 -15768 -2131 -5125 -12182 -12259 -15522 -14075 -11432 -9876 -4113 -10137
11606a0137k945J18o903O356P386J885j461o039O80K972n243p730K835M781K106
11591a1339K307p475l958O038o58j667m032l789o750o661K187j331p882P964R035
11576b8011q5k419n295P269J1692n054p926j704l816P900L680K0195R514j2247
11562f307n624J137J6748J6808K21j0052j3641j5431P594O917k855R663p141r357
11548a1320l542O494M517k324r206j097J73R555O159J86J53r325J1110n653p27
11533d847K117n520J1760N820k528o558L126O042n91J995L904j4850j1729K160
11519i699K503L042l868k734j4786K905J3662J5645Q596p122j2708N974j1801
11506a0391j1639n986K15l699p777J3690P219P843m55j7585j1839O405J3077K7795
$$ plain form
11606 -10137 -13082 -12964 -19867 -13511 -6125 -4240 -5701 -11740 -11060 -8088 -13331 -21061 -18226 -13445 -11339
11591 -11339 -9032 -16507 -20465 -14427 -15085 -16752 -20784 -24573 -31323 -37984 -35797 -37128 -45010 -37046 -28011
11576 -28011 -28096 -30515 -35810 -28541 -16849 -21903 -29829 -31533 -35349 -27449 -23769 -3574 5940 -6307
11562 -6307 -11931 -10794 5954 22762 22983 12931 -710 -16141 -8547 -1630 -4485 5178 -1963 -11320
11548 -11320 -14862 -8368 -3851 -6175 -15381 -16478 -16305 -6750 -591 -405 -252 -9577 1533 -4120 -4847
11533 -4847 -2730 -8250 3510 9330 6802 244 3370 9412 8821 10816 14720 -130 -11859 -9699
11519 -9699 -7196 -4154 -8022 -10756 -25542 -22637 -8975 6670 15266 8144 -4564 1410 -10391
11506 -10391 -22030 -28016 -27801 -31500 -39277 -25587 -18368 -10525 -10980 -28565 -40404 -33999 -20922 6873
11492F873K6838Q112m870j1027j9915j0870n079R727O247L827p736o301r959L951
11478a0182J0317j2026K609L528m135q304L760m229O219J8175J662j2973n142
11465a0721R87j124q584m247J544L122j310l827m118m668o866R603J0019J3583
11451f607j180j0475q154p690l52J4743J712j818l661M523m827j053K430j517
11437b3926M993J278J0679N820l585J8643j0536j577K367r551j119O145m962q522
11423a3853O386J4575J333l22k0160n120K695K655n074n671L569M511N542o830
11409a5764K79o266k1931J7351K431J06j3506M350J7556K279K609K1034O407k1918
11395d983m819L052J1507Q286M235M978o141l442l714j0729q741K991N823l117
$$ plain form
11492 6873 33711 41823 36953 25926 6011 -4859 -9938 -211 6036 9863 2127 -4174 -14133 -10182
11478 -10182 135 -11891 -9282 -5754 -9889 -18193 -14433 -18662 -12443 5732 7394 -5579 -10721
11465 -10721 -9734 -10858 -19442 -23689 -22145 -19023 -20333 -24160 -28278 -32946 -39812 -30209 -20190 -6607
11451 -6607 -7787 -18262 -26416 -34106 -34458 -19715 -18003 -19821 -23482 -18959 -23786 -24839 -22409 -23926
11437 -23926 -18933 -17655 -6976 -1156 -4741 13902 3366 1789 4156 -5395 -6514 -369 -5331 -13853
11423 -13853 -7467 7108 8441 8119 -12041 -17161 -14466 -11811 -16885 -22556 -18987 -14476 -8934 -15764
11409 -15764 -15485 -21751 -43682 -26331 -23900 -23794 -37300 -32950 -15394 -13115 -10506 10528 16935 -4983
11395 -4983 -9802 -6750 4757 13043 17278 22256 16115 12673 8959 -1770 -10511 -7520 -1697 -4814
11381d814R145J389j1323L46L328O982j558l098k726p132j973P199R088M732L234
11366A2819j4948j886M01j1645j1891J290L895Q432O809m073P005K498O112K390
11352G208o444r295l902J2298o511K977j703P773j601j2500j127L098o56j29M558
11337e956P828M940O688j702K052J154K194o665j4565q967j1995P577L280j640
11323a5777L610L279q483L676L538n052O918O120L962j153J51M781K738O504O690
11308B1502l598o694r299k813M609Q200Q660p387M679j1738j9229r144N400O836
11294a0016J8968J4146K52j0771j5315L174J7023j637m349K616J87l868N565J583
11280A7558L686j3678P87k561j946j3219q86M523j4316K405q41j656Q620J4457
$$ plain form
11381 -4814 4331 5720 -5603 -5257 -1929 5053 3495 397 -2329 -9461 -11434 -4235 4853 9585 12819
11366 12819 -2129 -4015 -3614 -15259 -27150 -25860 -21965 -13533 -6724 -10797 -3792 -1294 4818 7208
11352 7208 764 -8531 -12433 -135 -6646 -3669 -5372 2401 800 -11700 -12827 -9729 -10385 -10514 -5956
11337 -5956 1872 6812 13500 11798 13850 15004 17198 10533 -4032 -12999 -24994 -17417 -14137 -15777
11323 -15777 -12167 -8888 -17371 -13695 -10157 -15209 -8291 -2171 1791 638 789 5570 8308 14812 21502
11308 21502 17904 11210 1911 -902 3707 11907 20567 13180 17859 6121 -13108 -22252 -16852 -10016
11294 -10016 8952 23098 23350 12579 -2736 438 17461 15824 11475 14091 14278 10410 15975 17558
11280 17558 21244 7566 8353 5792 3846 -9373 -10259 -5736 -20052 -17647 -18488 -20144 -11524 2933
11266B933M113J06p635M050J040p136J804m121p582K459N650J948R42N548J1165
11251A5284q671n656K515Q75m728j0633j2668l27J7191l753K0913q636j3269J487
11237a0076M544M094j941r738J3092O587j3150m712J589j040J2535R50j312r939
11223h517n937Q801J0453J639q223L128k178P02K976j1203J3163Q736n729m536
11209C275J645L302k373j2365k0803K989J1687N760J839p373J786M65k899K935
11195a0130r50O104O8n857J593M017r56l4J100m826Q137J1105n876J0544K152
11180A6191l942p818Q704q011n437m773N986L43n60J970R545J004r437j3263q37
11165a0335K354J857Q14k219L865N85J240O415M845K028q06Q00j4091p403J387
$$ plain form
11266 2933 7046 7152 -483 3567 4607 -2529 -725 -4846 -12428 -9969 -4319 -2371 -1429 4119 15284
11251 15284 6613 957 3472 4347 -381 -11014 -23682 -24009 -6818 -10571 10342 1706 -11563 -10076
11237 -10076 -5532 -1438 -3379 -13117 -25 6562 -6588 -11300 -9711 -10751 1784 2734 1422 -8517
11223 -8517 -14454 -5653 4800 6439 -1784 1344 -834 -132 2844 -8359 4804 13540 7811 3275
11209 3275 4920 8222 5849 -6516 -27319 -24330 -12643 -6883 -5044 -12417 -10631 -10166 -13065 -10130
11195 -10130 -11080 -4976 -4908 -10765 -9172 -5155 -6111 -6145 -5045 -9871 -1734 9371 3495 14039 16191
11180 16191 12249 4431 13135 5124 -313 -5086 900 1243 683 2653 12198 13202 3765 -9498 -10335
11165 -10335 -7981 -6124 -5310 -7529 -3664 -3079 -1839 4576 9421 11449 10643 11443 -2648 -10051 -8664
11150h664J2790R28n413n828j3879j2619Q735K951o087k1607O188O791k589J2038
11136b6265R856J8392M593l487N457l146p52K453j2879q856R561K1p21k912r764
11121a8449J560j0796q518p81J8226J5371o572k702j278l360J3188J0289p295
11108a117k460k420K542J789n464K997P708n692J351o660m705p623Q407j73q851
11093b0371R942P400O402R287J242j3548j6319P508J6932J510J600Q488M441m825
11079A9689j0344J108n627j0828k1712m54J3345l179R581M527N505M795m875N933
11065G464N783p276j0066L497O70M136j9239j0457O362J0880K140Q363P134k2800
11051a3409j2034O24J9789Q339J138J1577j09n014k104p436k969J70N996m915
$$ plain form
11150 -8664 4126 5054 -359 -6187 -20066 -32685 -23950 -20999 -27086 -48693 -42505 -35714 -38303 -26265
11136 -26265 -16409 1983 6576 3089 8546 5400 4648 7101 -5778 -14634 -5073 -5052 -5773 -8685 -18449
11121 -18449 -16889 -27685 -36203 -36984 -18758 -3387 -9959 -12661 -13939 -17299 -4111 6178 -1117
11108 -1117 -3577 -5997 -3455 -1666 -7130 -4133 3575 -2117 -766 -7426 -12131 -19754 -11347 -11520 -20371
11093 -20371 -10429 -3029 3373 12660 13902 354 -15965 -8457 8475 9985 11585 20073 24514 19689
11079 19689 9345 10453 4826 -6002 -27714 -28168 -14823 -18002 -8421 -3894 1611 6406 1531 7464
11065 7464 13247 5971 -4095 -598 72 4208 -15031 -25488 -19126 -8246 -6106 2257 9391 -13409
11051 -13409 -25443 -24819 -5030 3309 4447 16024 15915 10901 8797 1361 -1608 -1438 4558 -357
11037c57p078k165P796J2160Q47j1580m703M281J1633K934l436j4486J740J2389
11023I975J1458k550n749j1423m443L265M5m450O453P17m979q035Q373j427K625
11008a45J0677M569K22K862n963m304P882J0074n459m468j2502j2407j125R554
10994e33k177n711J942N732l66J4275p118m81O759q261j3473M377m772J412J512
10979f883O547l146J0883J183m045M247n365L385J1214n244l477O808o972r668
10965e33j6091r513J1579k71K930q49l034R392Q880K64p088j5791n150R672K259
10950a3344o069K1197M618L580J9958J8123o449j3998K597O258R733k648r180
10937C4376p269L753j2629n923J0876J9506n035j1778j2467j389J941M71J91k399
$$ plain form
11037 -357 -7435 -9600 -1804 10356 11203 -377 -5080 -799 10834 13768 10332 -4154 -2414 9975
11023 9975 21433 18883 13134 1711 -2732 533 578 -3872 2581 3298 -1681 -9716 -1343 -2770 -145
11008 -145 10532 15101 15323 18185 12222 7918 15800 25874 20415 15947 3445 -8962 -10087 -533
10994 -533 -2710 -8421 -6479 -747 -1113 13162 6044 5563 12322 4061 -9412 -5035 -9807 -8395 -6883
10979 -6883 -336 -3482 7401 8584 4539 8786 3421 6806 18020 12776 9299 16107 9135 -533
10965 -533 -16624 -26137 -14558 -14829 -11899 -12748 -15782 -6390 2490 2754 -4334 -20125 -25275 -15603 -13344
10950 -13344 -19413 1784 6402 9982 29940 48063 41614 27616 30213 36471 46204 43556 34376
10937 34376 27107 30860 18231 12308 23184 42690 37655 25877 13410 12021 13962 14433 14624 12225
10923A2225j8482o196J5444J649Q704o300k511j1853K425R422J604L138J0413
10910A9682R281j4578o649L331P119Q404R603N904k534k920q451j220j4770j3752
10896a550M918L955J2574R824J914n839O704k989j052P44j1319k0997M569Q277
10882I733q638r189K27k632m211J0659O158L545q224j7308N194Q560R920R091
10868A2885L762n750j1713l761K0596R226j553j3917K446j299l793j1257P509
10855C381j252k79L459M815O362O192k879j0389m238J1797J2810l682j0841m071
10841A1185J96r0J285r908n117N41j427P354k340j789j6394R908R138J998L827
10826H367J713L211O008o76Q867j0305q220k790j892q260j0022j1771k995J1890
$$ plain form
10923 12225 -6257 -12453 2991 4640 13344 7044 4533 -7320 -4895 4527 6131 9269 19682
10910 19682 28963 14385 7736 11067 18186 26590 36193 42097 39563 36643 28192 26972 12202 -1550
10896 -1550 3368 7323 19897 29721 31635 25796 32500 29511 28459 29203 17884 -3113 1456 9733
10882 9733 1095 -8094 -7867 -10499 -14710 -4051 2107 5652 -2572 -19880 -14686 -6126 3794 12885
10868 12885 16647 10897 -816 -4577 16019 25245 23692 9775 12221 10922 7129 -4128 3381
10855 3381 2129 1850 5309 10124 16486 22678 19799 9410 5172 16969 29779 26097 15256 11185
10841 11185 11381 11291 12576 2668 -2449 -1908 -3335 4019 1679 -110 -16504 -6596 2542 4540 8367
10826 8367 10080 13291 19299 18623 27490 17185 8965 6175 4283 -3977 -13999 -25770 -28765 -16875
10812a6875K5580J5431j031j5753j6372Q305N468P807Q824Q62l976J0164l440
10799B4994M670m966K090l413l402M79N013J3608j0043n771j019j4061k3635q294
10785b3750J2103P799K010K3146J9294j2225k5745o225l519j9103J9205J8163
10773A1153K021r42m905p829j959j0244K914K1840N804l749o254j3920O083N976
10759E989J993k831nJ2459o051N981N701k385m597O572J903o14L326M361r253
10744B2549o454J48L404k75j375j3634j2266k336n274M834J0346Q089k07J131
10730H680K611n851k917p776J1948P790o360O25j535k998n853o740M45J8320J7043
10715B7432m700j1252k1021J964K6820Q198Q497j7017j7785J2180O838P70p971
$$ plain form
10812 -16875 8705 24136 23105 7352 -9020 -715 4753 12560 21384 22246 18270 28434 24994
10799 24994 29664 24698 26788 23375 19973 20452 25465 39073 29030 23259 22240 8179 -15456 -23750
10785 -23750 -11647 -3848 -1838 21308 40602 28377 2632 -3593 -7112 -26215 -7010 11153
10773 11153 13174 12232 7327 -502 -2461 -12705 -9791 12049 17853 14104 7850 -6070 13 5989
10759 5989 7982 5151 5146 17605 11554 17535 23236 20851 16254 22826 24729 24115 27441 31802 22549
10744 22549 16095 16243 19647 19372 17997 4363 -7903 -10239 -15513 -10679 -333 7756 7549 8680
10730 8680 11291 5440 2523 -5253 6695 14485 8125 8750 7215 4217 -1636 -8376 -7931 10389 27432
10715 27432 22732 11480 -9541 -7577 19243 27441 35938 18921 1136 13316 20154 20924 12953
10702A2953J590j61J601M833L002O006P89m933R94L171k854p030N80K00n545p905
10686G291p978P235J0930M642J403k734o764J424K062M294J218J2297j524j6276
10672A7520j1321l715N81P278j471L067J951J0168O521r353j1186L445K702j1061
10658E126j8035j431J5761J9800m790O724L66m494P039J7352J251k293L079J241
10644D6696j523j2205o213k524K255N599o324m968L844q523j2433M942P926K929
10630A9478N018L277L259o980k44J3427P910j3344n155L789r110n743j3026J3237
10616A5793J3198j350j243N298n4p614l378K70j208j3285p877j233J522N680M259
10601H778k962R873n881L863l589m8J1797j1975n553J2571O951Q23N231n1J882
$$ plain form
10702 12953 14543 14382 15983 20816 23818 29824 30613 25680 26674 29845 26991 19961 20541 20741 15196 7291
10686 7291 -687 6548 17478 22120 23523 20789 14025 15449 17511 21805 23023 35320 33796 17520
10672 17520 6199 2484 3065 10343 8872 11939 13890 24058 30579 21226 10040 13485 16187 5126
10658 5126 -12909 -14340 1421 21221 16431 23155 23521 19027 26066 43418 44669 42376 45455 46696
10644 46696 45173 32968 26755 24231 26486 32085 25761 20793 24637 16114 3681 8623 16549 19478
10630 19478 24496 27773 31032 24052 23808 37235 45145 31801 26646 30435 21325 15582 2556 15793
10616 15793 28991 27641 26398 31696 31642 24028 20650 20920 19712 6427 -1450 -2683 -1161 4519 8778
10601 8778 5816 15689 9808 13671 10082 10034 21831 9856 4303 16874 23825 24648 29879 29828 31710
10586C1710k699N268r449j8073L64L77N082N229o086N614m612m992p074j718J0365
10571I306j215l404K539J4284O934o714n551p910k444N517J1774J4582n58j7639
10557A9501j1611j4951J623J2023n595j1780j364J6825R895j2104j1123K1036
10545A2375M568q794J381M480N13N918j24j288R25k724m011L83m669N750J383
10530A6066K604P557l122n372J274r21P298J0436o055j5627N062J2339M457p537
10516B8459q187j0507K882J2548J6179R71K614K198j228o04p058m826m385J2910
10502D1966M087j4164n645J1097N914j1799o3L316m719q016N944P089o787j3079
10488A5141l956K3837K123r981L563N396N027r560n651J1572K220k310J0191k848
$$ plain form
10586 31710 29011 34279 24830 6757 7121 7498 12580 17809 11723 17337 12725 7733 659 -1059 9306
10571 9306 8091 4687 7226 21510 28444 21730 16179 8269 5825 11342 23116 37698 37140 19501
10557 19501 7890 -7061 -5438 6585 990 -10790 -12154 4671 14566 2462 -8661 12375
10545 12375 16943 8149 9530 14010 14523 20441 20317 19029 19954 17230 13219 13602 8933 14683 16066
10530 16066 18670 26227 23105 17733 19007 18086 25384 35820 29765 14138 19200 31539 35996 28459
10516 28459 20272 9765 12647 25195 41374 42345 44959 47157 45929 45325 38267 33441 29056 41966
10502 41966 46053 31889 26244 37341 43255 31456 31393 34709 29990 21974 27918 35007 28220 15141
10488 15141 11185 35022 37145 27164 30727 36123 41150 31590 25939 37511 39731 37421 47612 44764
10474D4764j0720K050p054O592j552l290l621Q482P011O104k206K262r411j6066
10460B3345j252J6101o8j8212n524L868q209K078J652J0650J8443J2936n488P93
10446E1113J891n606j1824j415J5184R942o701l508m145J453k153J407J3677j252
10432E8063n122O46n334m821J776L246R645J5628j0761j4125m625k463Q565j1615
10418C8703K755J930j1544J69k002J4909K259p128j1116r16m89J0216N580l869
10404C9457p315m985o001K471M787L015R6R022p111Q87O544p041M534M427m661
10389C8126p135n16K363j587Q359N349k215P037l466j6734r112J3879J933J815
10375C8096j776J187O105L740j3925j862Q418Q927j2906m997j240q665K857J0534
$$ plain form
10474 44764 34044 36094 29040 35632 34080 30790 27169 35651 42662 48766 46560 48822 39411 23345
10460 23345 22093 38194 38126 19914 14390 18258 10049 12127 13779 24429 42872 55808 50320 51113
10446 51113 53004 47398 35574 34159 49343 59285 52584 49076 44931 46384 44231 45638 59315 58063
10432 58063 52941 53587 48253 43432 45208 48454 58099 73727 62966 48841 44216 41753 50318 38703
10418 38703 41458 43388 31844 32013 30011 44920 47179 40051 28935 28019 27530 37746 43326 39457
10404 39457 32142 27157 21156 23627 28414 31429 31525 40547 33436 34323 40867 33826 38360 42787 38126
10389 38126 30991 30475 32838 31251 39610 44959 42744 49781 46315 29581 20469 34348 36281 38096
10375 38096 36320 37507 43612 47352 33427 31565 39983 48910 36004 31007 29767 21102 23959 34493
10361C4493J876M008o358j468m057J4653o034k497l890m907R204p349Q655j443
10347C4886j3090J574K212M2J2348J660N83K98n448j532K500j717m609o286j5642
10332G779r601J0534J0687N335N714k489j954k431N446J111o934j052M356Q508
10318C5009Q932K133M110R181j5694n240J6619L832p069p254M045j755j0645j1360
10304B4844J2453P381m949L862P228R65j493J4596j739J581P970N84n665j6180
10290E1438k66j0711p19J473R925N406j3567n419k299J5271N466o953n262J270
10276D5053J1149r432j1523P461l198j4999j3990J1421J4488j212o12j820J458
10263C4244Q809N450n918j1602M992J1508J0726n462o011j1614R209N563o703
$$ plain form
10361 34493 36369 40377 34019 32551 28494 43147 37113 34616 30726 25819 35023 27674 36329 34886
10347 34886 21796 23370 25582 25624 37972 39632 40215 40513 35065 33533 36033 34316 29707 23421 7779
10332 7779 -1822 8712 19399 24734 30448 27959 26005 23574 29020 30131 23197 22145 26501 35009
10318 35009 43941 46074 50184 59365 43671 38431 55050 58882 51813 44559 48604 46849 36204 24844
10304 24844 37297 44678 39729 43591 50819 51784 50291 64887 63148 64729 72699 73283 67618 51438
10290 51438 51172 40461 39742 41215 51140 56546 42979 37560 35261 50532 55998 49045 43783 45053
10276 45053 56202 46770 35247 42708 39510 24511 10521 21942 36430 35218 34606 32786 34244
10263 34244 43053 48503 42585 30983 35975 47483 58209 52747 46736 35122 44331 49894 43191
10250D3191o766j0704Q509J2638K990j347k830p202j690j904j099J5179N642j265
10236E3342p589q951P887Q567p977j0923p682J3913J4121J3112J41j8028r264
10223D0669M781j078o880j642J51M918L838l361l417M798J8032R589j1238k41
10209E8919p032q811p782J359J20N560o78r806j9314p49O756J144J8608J3978
10195E2272m375M325P977J5j2540p210P4R975K262O603m016n048O70r447j2707
10180B8830K5047J7617j0472o664Q339J0562j0797j1282K0595K0956j4070j6781
10168F1880j489m486o492O671R555q238n536L772K584J1082J191L400m29p217
10154F6248O214N21J025r613j2386l460l133Q17J1737P289O449m997j3146j0254
$$ plain form
10250 43191 36425 25721 34230 46868 49858 48511 45681 38479 36789 34885 33786 48965 54607 53342
10236 53342 45753 36802 44689 53256 45279 34356 26674 40587 54708 67820 67961 49933 40669
10223 40669 45450 44372 37492 35850 36001 40919 44757 41396 37979 42777 60809 70398 59160 58919
10209 58919 51887 43076 35294 36653 36773 42333 41655 31849 12535 11786 18542 19686 38294 52272
10195 52272 47897 52222 60199 60214 47674 40464 40538 50513 52775 59378 55362 50314 50984 41537 28830
10180 28830 53877 71494 61022 54358 62697 73259 62462 51180 71775 92731 78661 61880
10168 61880 60391 55905 49413 56084 65639 57401 51865 55637 58221 69303 70494 73894 73465 66248
10154 66248 72462 72983 74008 64395 52009 48549 45416 46233 57970 65259 71708 66711 53565 43311
10140D3311J885J2503j506R86j286J514j0969M654K2016k11p593m705K167j0623
10126E2143n98L361k037j667j988k608o078j0106m112k659K0336J1905j1461j7623
10112B6808P774j467l116O500O411L650J1976r08m797M156p649K919K9306J986
10098H3549L063p175o885k230O682j4059r033O749J0667J887r276J409K560L926
10084G1834p134r611M473J1088m111j786R489J0387j7243m140M701j39O0K0304
10070H8172O519j1295p618k156j637J1296N571j6054j1706J796J6638J7075O1
10057I6662J399J067n7p463P930N541N61N22K7148P929J219J1822J1637J1426
10043A77343J3649J9855J6689K5452M6277P2483Q5428J01848J34977K20947M09933
$$ plain form
10140 43311 45196 57699 56193 57179 55893 57407 46438 51092 73108 72897 65304 60599 62766 52143
10126 52143 51545 54906 52869 51202 49214 46606 40528 30422 26310 23651 43987 55892 44431 26808
10112 26808 34582 33115 29999 36499 42910 46560 58536 57628 52831 56987 49338 52257 81563 83549
10098 83549 86612 79437 72552 70322 77004 62945 53912 60661 71328 73215 63939 65348 67908 71834
10084 71834 64700 55089 59562 70650 66539 64753 74242 84629 67386 63246 67947 67808 67868 88172
10070 88172 94691 83396 75778 73622 71985 83281 88852 72798 61092 62888 79526 96601 96662
10057 96662 98061 99128 99071 91608 99538 105079 105640 106162 133310 141239 142458 154280 165917 177343
10043 177343 190992 210847 227536 252988 299265 371748 457176 559024 694001 914948 1324881
10032A324881P84085J266341J171887J57401m86665j081884j170357p31600m23794
10023H10295k41200j45484q7508o5892m4337k5835j5055k0095j5683j3052l231
10012A32923K302P993j4966q437l836r36j6844j6832L91Q263m425r878Q79n165
9998G1432q25R343Q862n10p379L379L949n655o927j020j131K679J3540O959q957
9983H7739r471m424L900q192K165L558l323k684J0360K992p994n284L087j1293
9969F1136l008P346L987Q857q05j0793k906o389n696J0171J3727K070m768q421
9955F4508m961J489J4283Q53l41L095j270r274M987p416M924N54L51N658L896
9940H1336J960m004J930o841o71n624n543P597J1087M859N291N171m912q882o796
$$ plain form
10032 1324881 2108966 3375307 4547194 4704595 4217930 3136046 1965689 1234089 810295
10023 810295 569095 423611 336103 270211 225874 200039 184984 164889 149206 136154 132923
10012 132923 135225 143218 128252 119815 115979 115043 98199 81367 81758 90021 85596 75718 76597 71432
9998 71432 70607 79950 88812 88302 80923 84302 88251 82596 75669 74649 73518 76197 89737 96696 87739
9983 87739 78268 73844 77744 69552 71717 75275 71952 69268 79628 82620 74626 69342 72429 61136
9969 61136 58128 65474 69461 78318 77513 66720 63814 57425 51729 61900 75627 77697 72929 64508
9955 64508 59547 61036 75319 76172 75831 78926 77656 68382 73369 65953 70877 71431 71782 77440 81336
9940 81336 83296 79292 81222 74381 73710 68086 62543 70140 81227 86086 91377 96548 91636 82754 75958
9925G5958m089q29P313l972n469N379p571o37J0456m037l041Q471J845p986P796
9910G9587k259l88l937O41J5003J7281q568j800k069p507J2767R096J747q517
9896A01077m559l874k001o586N976J2404L08n761K468k448l537q661K33n984O047
9881H5102J3622K817l872K918J035Q671j1200j606J2016m150j3001r684l503M247
9867H3412O116L851J3164m805j7903l700O35L179N875j655J1734J2960o624j3974
9853I2265m218p983j6881o798n745J3797M217K826J2748J5949N362r16m339P624
9839A07908k737n630P795l742k262q128l004m174o949j965N551R041R598J4457
9825A15759k76J6679J736j0803L312n74j9176r432k295N213P244J2632j4073K097
$$ plain form
9925 75958 71869 71040 78353 74381 68912 74291 66720 66083 76539 72502 69461 77932 79777 71791 79587
9910 79587 77328 76940 73003 73644 88647 105928 97360 95560 93491 85984 98751 107847 109594 101077
9896 101077 96518 92644 90643 84057 90033 102437 102745 96984 99452 97004 93467 84806 85039 79055 85102
9881 85102 98724 101541 97669 100587 101622 110293 99093 97487 109503 105353 92352 82668 79165 83412
9867 83412 89528 93379 106543 101738 83835 80135 80770 83949 89824 88169 99903 112863 106239 92265
9853 92265 88047 80064 63183 56385 50640 64437 68654 71480 84228 100177 105539 104623 100284 107908
9839 107908 105171 99541 107336 103594 101332 93204 90200 86026 79077 77112 82663 91704 101302 115759
9825 115759 115483 132162 133898 123095 126407 125833 106657 97225 94930 100143 107387 120019 105946 108043
9811A08043R77O505N661q784j7935j34j592j046O334P067q770q107p234J0693
9797I1678J6946J7193M027j5501j7423p865N011J220P558Q272J0308o562O288
9784A21150n496q993o36P342O467o451N478j2879m382J6008J5828J3324J368j202
9770A46926J4662J2782J9801P347R482n265j2081p991j3615p424L684n95m29n224
9756A62060L625l226n339m239n372n340l733N121p081l645j286J3866P690O563
9742A59664M278J2098J8659n217o961J2842J7039J2712O022P327M649L4284L2442
9729C09838J5934K9226K9765K8891K2372J8155j7239l336N957r27j5112k8189
9717C95335j3207k2923j7605j9403k0029j5572K46Q140q6q585k3234k0927R388
$$ plain form
9811 108043 109020 115525 121186 112402 94467 94333 92741 91695 98029 105096 96326 88219 80985 91678
9797 91678 108624 125817 129844 114343 96920 89055 94066 95286 102844 111116 121424 114862 121150
9784 121150 115654 106661 106025 113367 119834 113383 118861 105982 101600 117608 133436 146760 148128 146926
9770 146926 161588 174370 194171 201518 211000 205735 193654 185663 172048 164624 168308 167713 167284 162060
9756 162060 165685 162459 157120 152881 147509 142169 138436 143557 136476 132831 131545 145411 153101 159664
9742 159664 163942 176040 194699 189482 182521 195363 212402 225114 231136 238463 243112 277396 309838
9729 309838 325772 354998 384763 413654 436026 454181 436942 433606 439563 438636 423524 395335
9717 395335 382128 359205 341600 322197 302168 286596 286842 294982 294896 286311 263077 242150 251538
9704B51538r952j2446m373O966P793L212j242L38J3493J3447K578J3146K0844
9691C05342Q412K9768K8830K2497K6301L5077L2688L0262L1403K9800M41M088
9679E84909Q99p721j2555q953o766l498M156p779j8758j3592j9581l1555k7262
9666D31944k9546l2888k0986o232L253m218j3204k2974k5665M48J2283K838j0644
9653B84409j8677l312k931O359M938L470J0889J2044K2414J1036K4388J1972R459
9640C76458J4500R600K3693J7225K373Q546K1844L9710M6238J9944l42j0541j9298
9627E49950k6092n6209l3294l2496l6064k8390j6937j1769k5124k3299o706o54
9615B52916J014n794j1124j3082K327R271r466j1392n678L760p840l224Q874K57
$$ plain form
9704 251538 241586 229140 224767 231733 239526 242738 241496 241834 255327 268774 271352 284498 305342
9691 305342 313754 343522 372352 394849 421150 456227 488915 519177 550580 580380 580821 584909
9679 584909 585808 578087 565532 556579 549813 546315 550471 542692 523934 510342 490761 459206 431944
9666 431944 402398 369510 348524 342292 345545 341327 328123 305149 279484 279932 292215 295053 284409
9653 284409 265732 262420 259489 265848 270786 274256 285145 297189 319603 330639 355027 366999 376458
9640 376458 390958 400558 424251 441476 443849 452395 474239 513949 560187 580131 579789 569248 549950
9627 549950 523858 467649 434355 401859 365795 337405 320468 308699 283575 260276 253570 252916
9615 252916 253930 248136 237012 223930 226257 235528 226062 214670 208992 212752 204912 201688 210562 210819
9601B10819n647N474r8J1632N780k655P930M887J5199K3328K9372J3113J8144
9588C37278L435k0390j0386n604n314k2339j590J340k1471r612L739q054J006
9575B42038P47o840p412N732n488r50M582K4538n287k4356o003J3015O295j0301
9561B30310j2885k149O75L528P491N024P200p166N017J7668N512j502l927r435
9547B45361p039O193K632j029M43l455J364K914J4437J3953k05o2J647L545J7260
9532B97959l081j3249J091Q420L124M048j724K119J9475J0720k0j887r604M233
9518C21624n350j691J2326R882O879R439J5081Q313J4723o765j0881q526N071
9505C70125P823k885m380L622M520J0058j230J1769K604P720Q675J678p618Q613
$$ plain form
9601 210819 205172 210646 210548 222180 227960 225305 233235 238122 253321 276649 306021 319134 337278
9588 337278 340713 320323 309937 304333 299019 276680 275090 276430 254959 245347 249086 241032 242038
9575 242038 242785 235945 228533 234265 228777 227827 232409 256947 251660 227304 221301 234316 240611 230310
9561 230310 217425 215276 215951 219479 226970 231994 239194 232028 237045 254713 260225 258723 254796 245361
9547 245361 238322 244515 247147 246118 246561 243106 244470 247384 261821 275774 275569 275507 277154 280699 297959
9532 297959 294878 281629 282720 291140 294264 298312 296588 298707 318182 328902 328882 326995 317391 321624
9518 321624 316274 314583 326909 336791 343670 353109 368190 376503 391226 384461 373580 365054 370125
9505 370125 377948 375063 370683 374305 378825 388883 387653 399422 402026 409746 418421 420099 412481 421094
9491D21094J1527O317n341j9950k409M69J0184O885p492l236k347k560L141n73
9477D15709p266j767J4457Q454J3561L748M693N879r30o639K0140R149J9018L632
9463E01838j0278K0515L1404J7790N373K3696J8549J1132N807R981J2613K201
9451F50621m753p010R435M449q229j9935k2854p878p035l680l70L088j819O24
9437E84654J725J1722J4291j124j6797l232j925L10J3626J5979J3865J8288J1109
9424F62491K0387K0514J6825K3876K8564J7336K5297K9498K6758R874K3406K3483
9412I28309O370O084K280J9090M4980J8327R917N563J2291J7077K169n59K3851
9399A095749K5024K7411K9625K8516K9270K2099J6356K2428K7886K6663N0928
$$ plain form
9491 421094 432621 438938 433597 413647 411238 411707 421891 428776 421284 418048 415701 413141 416282 415709
9477 415709 408443 406676 421133 429587 443148 446896 451589 457468 456538 449899 470039 479188 498206 501838
9463 501838 491560 512075 543479 561269 566642 590338 608887 620019 625826 635807 648420 650621
9451 650621 645868 638858 648293 652742 644513 624578 601724 593846 586811 583131 582761 585849 584030 584654
9437 584654 586379 598101 612392 611268 594471 591239 589314 589624 603250 619229 633094 651382 662491
9424 662491 682878 703392 720217 744093 772657 789993 815290 844788 871546 881420 904826 928309
9412 928309 934679 940763 943043 962133 1007113 1025440 1035357 1040920 1053211 1070288 1072457 1071898 1095749
9399 1095749 1120773 1148184 1177809 1206325 1235595 1257694 1274050 1296478 1324364 1351027 1401955
9388A401955N5826P5123Q7936R3318J20430J44395J63184J91046K51103K97953
9378B882269L50736M10459M82553N55756O78720Q47114J107196J439439J783241
9369A0537483J989632J889862J525413J109685P62068M85521J41236l31819q71862
9360A7237219j304114j478140j425748j211988r99963q37745p11973o19580n04885
9351H143083m09113l02393k01358j30040p3455r516N0309J16612K21920L60764
9341G766813N30991P16358R30104J137239J324942J474416J630939J846761K214081
9332A9572644K722199L370068M148285M911270N415016N466018N024872M227673
9324E4858045L321568K353982J332179J44540j272337k721413l971246m726726
$$ plain form
9388 1401955 1457781 1532904 1620840 1714158 1834588 1978983 2142167 2333213 2584316 2882269
9378 2882269 3233005 3643464 4126017 4681773 5360493 6207607 7314803 8754242 10537483
9369 10537483 12527115 14416977 15942390 17052075 17814143 18299664 18440900 18109081 17237219
9360 17237219 15933105 14454965 13029217 11817229 10817266 9979521 9267548 8647968 8143083
9351 8143083 7733970 7431577 7230219 7100179 7026724 7017208 7067517 7184129 7406049 7766813
9341 7766813 8297804 9014162 9944266 11081505 12406447 13880863 15511802 17358563 19572644
9332 19572644 22294843 25664911 29813196 34724466 40139482 45605500 50630372 54858045
9324 54858045 58179613 60533595 61865774 62010314 60737977 58016564 54045318 49318592
9316D9318592m887522m475534l689242k807268k009840j367631r41361p27958
9308B8412236o90678p86357r46614j091424j134466j037332q93083o51070l55570
9299B0825642k9316K99693O33219R12746J170408J390100J656206J996664K459802
9290C1315164L096215L900562M805721N714630O420796O688106O467347N812904
9282G4221445M732058L269869J614716L8564j234410j911107k039380j937536
9274G6754219j888296j982660j994010j791204j518333j536150k085231l021001
9266F0937334l948240m535867m642772m419882l995374l456989k924901k419343
9258C0593966j948484j592494j310728j107734r52099p41111m68204j62942J56824
$$ plain form
9316 49318592 44431070 39955536 36266294 33459026 31449186 30081555 29140194 28412236
9308 28412236 27721558 26935201 25988587 24897163 23762697 22725365 21832282 21181212 20825642
9299 20825642 20796326 21096019 21729238 22641984 23812392 25202492 26858698 28855362 31315164
9290 31315164 34411379 38311941 43117662 48832292 55253088 61941194 68408541 74221445
9282 74221445 78953503 82223372 83838088 83876652 82642242 80731135 78691755 76754219
9274 76754219 74865923 72883263 70889253 69098049 67579716 66043566 63958335 60937334
9266 60937334 56989094 52453227 47810455 43390573 39395199 35938210 33013309 30593966
9258 30593966 28645482 27052988 25742260 24634526 23682427 22941316 22473112 22310170 22466994
9249B2466994M93897Q61716J274820J735571K258359K802728L321167L661033
9241C8876285L681443L318599K693057K050069J703393J873412K593641L615884
9233F0405783M351899M284650L383419K168630J100130P161j646197l945453o307237
9224F3802785p895913q228059p458636o153086m869326l811606k992167k374801
9216B0019191j928838j623558j432941j307765j209291j111285r94831q32062
9208I578620o71905n48465m29104l21201j89062n5510J11786K90993M72638O62390
9198H901180Q70200J053538J237208J462541J776478K240788K810055L265903
9190B3617891L379323K951550K127427J073066k05988j675757l098683m120242
$$ plain form
9249 22466994 22960891 23822607 25097427 26832998 29091357 31894085 35215252 38876285
9241 38876285 42557728 45876327 48569384 50619453 52322846 54196258 56789899 60405783
9233 60405783 64757682 69042332 72425751 74594381 75694511 75701672 74055475 70110022 63802785
9224 63802785 55906872 47678813 40220177 34067091 29197765 25386159 22393992 20019191
9216 20019191 18090353 16466795 15033854 13726089 12516798 11405513 10410682 9578620
9208 9578620 8906715 8358250 7929146 7607945 7418883 7363373 7475159 7766152 8238790 8901180
9198 8901180 9771380 10824918 12062126 13524667 15301145 17541933 20351988 23617891
9190 23617891 26997214 29948764 32076191 33149257 32943269 31267512 28168829 24048587
9182B4048587m473555m133197l350514k500339j793256j271770r06889o71136
9174D947931n15859m17177l50405k93845k56202k36441k15703j77942j34004j01009
9164B249344p5409o2871p5425o2294o2074m9447n4804m7937m8153n9564n1455
9153A599911n0031l7894n6506n0659m4454n2311m3961j5356j3580k1673k8518
9142A184968k8556k7886l2685k7632l2755l4722k9801k262o207j3803k2902p987
9130I17770N993K0489Q571K1819P620J3098L2318K4566J7512M4474N4702M5704
9118A214636O9737P4678O4215O7679O1606N3031L3379o279k2672l6009m5488o6539
9106A461974o3739n9418o4604m1944m3596l9606l3095k9164l3228k1180n945j0760
$$ plain form
9182 24048587 19575032 15441835 12091321 9590982 7797726 6525956 5619067 4947931
9174 4947931 4432072 4014895 3664490 3370645 3114443 2878002 2662299 2484357 2350353 2249344
9164 2249344 2173935 2111064 2035639 1973345 1911271 1861824 1807020 1759083 1710930 1651366 1599911
9153 1599911 1549880 1511986 1455480 1404821 1360367 1308056 1264095 1248739 1235159 1213486 1184968
9142 1184968 1156412 1128526 1095841 1068209 1035454 1000732 970931 968669 962462 948659 925757 917770
9130 917770 923763 944252 952823 974642 982262 995360 1027678 1052244 1069756 1114230 1168932 1214636
9118 1214636 1284373 1359051 1423266 1490945 1552551 1605582 1638961 1632682 1610010 1574001 1528513 1461974
9106 1461974 1398235 1338817 1274213 1232269 1188673 1149067 1115972 1086808 1053580 1032400 1026455 1015695
9094A015695j5750j9165j9893j1660j1812j4836j4248Q777J3640P999J7303K8831
9082I84881L3663L8599M9763M0711N2253Q2088J26836J51341J89451K38920K86282
9071B274788L61938M83850O94808J148336J972883L019742K919551Q00588r68466
9062A2708018k162011k937662k261854j368821q10752n13634k99967j83887j40889
9053B028541j10930q6330q9627r3300r8206r8211r5452r5912r7074p3717l7105
9042A052677m8524l2546j8832l739j299K078k334j164R682K1240K9614K9461K7786
9029A064100L0876J7463K4309K7362L1921M3030M8587L0256J1862p092j737k3446
9017A297491k5309r387J6153K5089M5475L7412M9260N1831K4000j7088n7903n2830
$$ plain form
9094 1015695 999945 980780 960887 949227 937415 922579 908331 917108 930748 938747 956050 984881
9082 984881 1018544 1057143 1106906 1147617 1199870 1281958 1408794 1560135 1749586 1988506 2274788
9071 2274788 2636726 3120576 3815384 4963720 6936603 9956345 12875896 13676484 12708018
9062 12708018 10546007 7608345 5346491 3977670 3166918 2653284 2353317 2169430 2028541
9053 2028541 1917611 1831281 1741654 1648354 1550148 1451937 1356485 1260573 1163499 1089782 1052677
9042 1052677 1004153 971607 952775 949036 947737 949815 947481 946317 955999 977239 1006853 1036314 1064100
9029 1064100 1094976 1112439 1136748 1164110 1196031 1239061 1287648 1317904 1329766 1322674 1320937 1297491
9017 1297491 1272182 1262795 1278948 1304037 1349512 1386924 1436184 1488015 1512015 1494927 1437024 1384194
9005A384194m6290n2459n2568n2936k9033M343K0346J9264K4267N685N655K1416
8993A251884n450r578j7183o741L024m751j8673J2829j951k7078j9966j1611k542
8980A142213P426P920J0608R004J3110J9601L2109N8815N7813N8244O6561P2487
8968A555911O3824P2045M8004M090o681k7608k8554m380j326K4329M9236P7453
8956A826343P8593Q4667Q6975P3274N2223L8687M1385L1391K1400L4126L2965
8945B402029O8341J19386J44683J76777K12086K65427L24113L76121M31697M84109
8935E004769N59046P08441Q50617Q80624P10659M53003K90932L04265M99158P95371
8925A1056885J113063J420387J614464J604721J234516N06385l94905j142520
$$ plain form
9005 1384194 1337904 1285445 1232877 1179941 1150908 1155251 1175597 1194861 1219128 1224813 1230468 1251884
8993 1251884 1246434 1236856 1219673 1212932 1215956 1211205 1192532 1205361 1203410 1176332 1156366 1144755 1142213
8980 1142213 1149639 1157559 1168167 1177171 1190281 1209882 1241991 1300806 1358619 1416863 1483424 1555911
8968 1555911 1619735 1691780 1739784 1743874 1737193 1709585 1681031 1676651 1675325 1699654 1748890 1826343
8956 1826343 1904936 1989603 2076578 2149852 2202075 2240762 2282147 2313538 2334938 2369064 2402029
8945 2402029 2470370 2589756 2734439 2911216 3123302 3388729 3712842 4088963 4520660 5004769
8935 5004769 5563815 6272256 7122873 8003497 8714156 9167159 9458091 9762356 10261514 11056885
8925 11056885 12169948 13590335 15204799 16809520 18044036 18550421 18155516 17012996
8917A7012996j530356j523801j228469q18394m48338k52328k30620l37123m29925
8908A0213642m09407k33053N1801L83192P31031R84993J101841J019541P23996
8899A4567577L52395Q9763L2104K31612N80609R73357J290479J421499J309454
8890B0848849J021926O55452M00467M46724Q84135J703978K715434L601195M004701
8881C6282861L789007K980822J862611O38244m22893j100293j366821j378236
8873D1285302j208767q62617m68459q5141K20844M27451M99191L31999p6583o23021
8863C9440199j092140j284993j205817j001263p86004o11707n48294n34296m93446
8854C1882239l74390j67583J51449N50796J017576J314476J376862J297140J155098
$$ plain form
8917 17012996 15482640 13958839 12730370 11911976 11463638 11211310 10980690 10643567 10213642
8908 10213642 9804235 9571182 9622983 10006175 10737206 11722199 12824040 13843581 14567577
8899 14567577 14919972 15009735 15041839 15273451 15854060 16827417 18117896 19539395 20848849
8890 20848849 21870775 22526227 22926694 23373418 24257553 25961531 28676965 32278160 36282861
8881 36282861 40071868 43052690 44915301 45553545 45130652 44030359 42663538 41285302
8873 41285302 40076535 39213918 38745459 38660318 38881162 39308613 39807804 40139803 40063220 39440199
8863 39440199 38348059 37063066 35857249 34855986 34069982 33458275 32909981 32375685 31882239
8854 31882239 31507849 31340266 31491715 32042511 33060087 34374563 35751425 37048565 38203663
8845C8203663J107891J236675J526785J859023K220606K459046K318554J693631
8837E2625874P22716j86034n94671m00944J63021O47911P71664M57792j18373
8828E4088956o26790q74846p56618m69271k02705K9307J53954J65813O5082j93008
8818E1379874n35538q72624j159637j405945j562016j558149j311193r06646n13649
8809D1554477k10536j17443k13304m01102n06134l83467k9776L47248L96069k2372
8799D0413660o99661j294230j536452j327818q62182l85617N2717N04691J050787
8790C5915895J725159K424525K959094L020340K430203J440861N51748J72415
8782E0640240L42329P89982J181337J298844J044589N55577l7453o12728j049733
$$ plain form
8845 38203663 39311554 40548229 42075014 43934037 46154643 48613689 50932243 52625874
8837 52625874 53348590 53162556 52567885 52166941 52329962 52977873 53749537 54207329 54088956
8828 54088956 53462166 52587320 51830702 51361431 51158726 51188033 51341987 51507800 51572882 51379874
8818 51379874 50844336 49971712 48812075 47406130 45844114 44285965 42974772 42068126 41554477
8809 41554477 41343941 41226498 41013194 40612092 40105958 39722491 39692715 40039963 40436032 40413660
8799 40413660 39713999 38419769 36883317 35555499 34693317 34307700 34360417 34865108 35915895
8790 35915895 37641054 40065579 43024673 46045013 48475216 49916077 50467825 50640240
8782 50640240 50982569 51772551 52953888 54252732 55297321 55852898 55815445 55202717 54152984
8773E4152984j362797j702604k056361k397241k731830k892814k724075k184512
8765C6100750j354137m11447L16699O51410O54050N08301K34409j25268o13299
8756C5961468j099736j302261j128145o13545r885M70165Q72655J294389J840730
8747C6285835K495350L126511L620692L764132L298540K206433R17954j36908
8739E5578539q16284j095973j192484j240861j108447q29990n28161j28584K77578
8730D8915333N42859N10300L02610J62513J22466L32849Q24481J323723J554401
8721E4591535J460359J329714J308307J497530J963856K613042L396490M259290
8713G2420123N181523N957268O326263O540982O445789N817174M745719L203403
$$ plain form
8773 54152984 52790187 51087583 49031222 46633981 43902151 41009337 38285262 36100750
8765 36100750 34746613 34335166 34651865 35303275 35957325 36465626 36700035 36574767 35961468
8756 35961468 34861732 33559471 32431326 31817781 31807896 32278061 33150716 34445105 36285835
8747 36285835 38781185 41907696 45528388 49292520 52591060 54797493 55715447 55578539
8739 55578539 54762255 53666282 52473798 51232937 50124490 49294500 48766339 48637755 48915333
8730 48915333 49458192 49968492 50271102 50433615 50556081 50888930 51713411 53037134 54591535
8721 54591535 56051894 57381608 58689915 60187445 62151301 64764343 68160833 72420123
8713 72420123 77601646 83558914 89885177 96426159 102871948 108689122 113434841 116638244
8705A16638244J498408L50056k04011o99384j676847k952527l761249l558169
8697A05634521k414177r38573P9859L12413K68657Q09294J889549L335715N172246
8688A14149504O984413Q440956R427595R685832R260412Q048185N956531K870816
8680A74824244j044926n316298r304076j2013850j2495357j0668217p321502l755724
8672A12904294j016243N04900J236809J894755K564796L125366L530444L728397
8664A28473518L442302K416850O66763j176944k492758l203980l566409m240089
8656A20319253n120078n565051n363971m809884m338672m332349m465678m136015
8648H2187555l270241k176875j367913j058215j095118r02400j20100J216196
$$ plain form
8705 116638244 118136652 118486708 118282697 117583313 115906466 112953939 109192690 105634521
8697 105634521 103220344 102281771 102361630 102674043 102942700 103751994 105641543 108977258 114149504
8688 114149504 121133917 129574873 139002468 148688300 157948712 165996897 171953428 174824244
8680 174824244 173779318 168463020 159158944 147145094 134649737 123981520 116660018 112904294
8672 112904294 111888051 112392951 113629760 115524515 118089311 121214677 124745121 128473518
8664 128473518 131915820 134332670 134999433 133822489 131329731 128125751 124559342 120319253
8656 120319253 115199175 109634124 104270153 99460269 95121597 90789248 86323570 82187555
8648 82187555 78917314 76740439 75372526 74314311 73219193 72316793 72196693 73412889
8640G3412889K505888L003850K515362J720811J001695L35019m25515j588810
8632H2481189k863756l531204l489139k998780k451494k228078k392402k859888
8624E9666448l665716m593740n184829n106090m289221k925036j402346N0145
8616C2549615J291410K123360K573404K697791K313928J248356m52678k403435
8608D1941751l934516m598266m308992l547148k705096j924155j321176q65040
8600A8737362m62445k08491j62673k35394m44145p96951j161018j324982j246604
8591A2694659r29249m90196j35104L3065J30964K71305M16466L74041Q184n14515
8581A1859620r54137j131791j010108p35127m54491k24778n0686O4279P5450k5264
$$ plain form
8640 73412889 75918777 78922627 81437989 83158800 84160495 84495514 84069999 82481189
8632 82481189 79617433 76086229 72597090 69598310 67146816 64918738 62526336 59666448
8624 59666448 56000732 51406992 46222163 41116073 36826852 33901816 32499470 32549615
8616 32549615 33841025 35964385 38537789 41235580 43549508 44797864 44345186 41941751
8608 41941751 38007235 33408969 29099977 25552829 22847733 20923578 19602402 18737362
8600 18737362 18274917 18066426 17903753 17668359 17224214 16427263 15266245 13941263 12694659
8591 12694659 11765410 11275214 11140110 11173175 11304139 11575444 11991910 12365951 12374135 11859620
8581 11859620 10905483 9773692 8763584 8028457 7573966 7349188 7298502 7362781 7438231 7412967
8571G412967j78701k62529k09737o2142N3843L8976n2480j47796j74081j05230
8561F313090P7187K40399K40310P3454k12964m94855o72644p13542o25935m86391
8551C738109l76019l09639k73492k39478j94422j14747n2873m1430l6351o2847
8541B036811p6684q3297q1918n4382J487L5952R9016J69997K82350L31763L05022
8530B966117K09178L780j82666k72359k88110k76541k50838k37475k17256j87169
8520A266661j69950j12388q0873n5496l6366l9422k0752k7959p986k0463j4539
8509F80467j8581l6154k4905j9102k1579k0254k3918j8811j8238k8380l7470j9900
8497C93175j9710j7140m780J122p668N817J3436N959L4423L0291L0234K2839J4317
$$ plain form
8571 7412967 7234266 6971737 6762000 6699858 6753701 6792677 6740197 6592401 6418320 6313090
8561 6313090 6390277 6630676 6870986 6944440 6731476 6236621 5563977 4850435 4224500 3738109
8551 3738109 3362090 3052451 2778959 2539481 2345059 2230312 2177439 2136009 2099658 2036811
8541 2036811 1960127 1876830 1794912 1740530 1742017 1777969 1876985 2046982 2329332 2661095 2966117
8530 2966117 3175295 3179075 2996409 2724050 2435940 2159399 1908561 1671086 1453830 1266661
8520 1266661 1096711 984323 903450 847954 811588 772166 751414 723455 715469 695006 680467
8509 680467 661886 625732 600827 581725 560146 539892 515974 497163 478925 450545 413075 393175
8497 393175 373465 356325 351545 352667 344999 350816 364252 370211 404634 434925 465159 487998 502315
8484E02315Q439j479L462j1118r130p887R612M992L958r138L226M675K5727J4631
8470E42285K926Q963J7547K5205J9530j2001j1501Q16J4654J3936L4809K6717
8458F83886K488j003K5271J9340J3458K4441L0088J0161J887Q534J6784J4785
8446H50120K0920M979k2953k8020p527j0776j3095q262n712m673J617k2761k938
8433G50919J2527L080P923K504L090P135J3688O559L5827M0290K8259L7861K4812
8420I74474L7250M9819L4104O0134P5044J12995J40334J59884J54618O6699k6305
8409A839050j16895j67082j78607j54350j37530j01152p0558o5589n5227n0779
8399G41281l9121l8913l0747j1527K867J1776J0299j22l892j7187j1524k7239
$$ plain form
8484 502315 510754 509275 512737 501619 492489 484602 494214 499206 503164 494026 497252 501927 527654 542285
8470 542285 545211 554174 571721 596926 616456 604455 592954 593770 608424 622360 657169 683886
8458 683886 686374 685371 710642 729982 743440 767881 797969 808130 810017 818551 835335 850120
8446 850120 871040 876019 853066 825046 817519 806743 793648 785386 779674 775001 776618 753857 750919
8433 750919 763446 766526 774449 776953 780043 787178 800866 807425 843252 883542 911801 949662 974474
8420 974474 1011724 1061543 1095647 1155781 1230825 1343820 1484154 1644038 1798656 1865355 1839050
8409 1839050 1722155 1555073 1376466 1222116 1084586 983434 912876 847287 792060 741281
8399 741281 702160 663247 632500 620973 623840 635616 645915 645793 641901 624714 613190 585951
8387E85951j0138j6624q42J0685l958n12M160K2420L2529M0857J8960K9290K7542
8374G40320J0799K0773J9404J2975j8103j8039j0028j9216k113L368J1708O716
8362G58564j5467j2014j9858m5415p7000m9998k7347p87j5086j3152N704L0933
8350E19077K9967K581j2875j5242j1474k2960m265o111K238j2662k917j6857k9196
8337D19304k6327k1668j0800o319n271p795j725Q579K3835L9748L5081K4974K7573
8324D99189J7031J3835K6686L1183L8158J4196J1231O086R343K3637K7630K6763
8312G44968L2652J2907j7100l5157m5729m5413l1189k1137k2107j0144q510J4125
8300E68166J8704L6059N4888O7135N6386L5702N178j5548k9590n6898m7651m7485
$$ plain form
8387 585951 575813 559189 558347 569032 565074 564562 568722 591142 623671 664528 683488 712778 740320
8374 740320 751119 771892 791296 804271 786168 768129 758101 738885 736772 740140 751848 758564
8362 758564 743097 731083 711225 665810 588810 538812 511465 510678 495592 482440 488144 519077
8350 519077 549044 551625 538750 523508 512034 489074 484809 478698 480936 468274 465357 448500 419304
8337 419304 392977 371309 360509 354190 348919 341124 339399 347978 371813 411561 446642 471616 499189
8324 499189 516220 530055 556741 587924 626082 640278 651509 657595 666938 690575 718205 744968
8312 744968 777620 790527 773427 738270 692541 647128 615939 594802 572695 562551 554041 568166
8300 568166 586870 622929 677817 744952 801338 837040 842218 826670 797080 740182 692531 645046
8288F45046k8247q497p990N349R364Q306o251L103K223P513P384J0169J4584N0357
8274G12413Q5066O7128L2674P742j2263j7647j2865j0907p987k3108l9245m0803
8262G40198l7119k5408o676m828K3424M6695M9019N4982N9196O3393N6187M7187
8250A066250K5556j0008n1106o7954p5439o4931n0078m0955k7269k3723j5650
8239F64693j7912j6737n995r29K0645K1238J9551M672M051P788m185n137M099
8226F95842J0374J0868O032j3896k3364n3483m8339k5946k7152j4512K327K3473
8214E42224L9932N9223J00182J05745J04413Q5667L3929k634k6006n4258n1865
8203I36552m8211n4578k7103j647J9797K7841J9084K1069L1191J9359L0088J7543
$$ plain form
8288 645046 616799 608302 600312 605661 615025 623331 617080 620183 622406 629919 637303 647472 662056 712413
8274 712413 797479 864607 897281 905023 892760 875113 862248 851341 843354 820246 781001 740198
8262 740198 703079 677671 670995 666167 689591 736286 785305 840287 899483 962876 1019063 1066250
8250 1066250 1091806 1081798 1030692 962738 887299 822368 772290 731335 704066 680343 664693
8239 664693 646781 630044 624049 623120 643765 665003 684554 689226 693277 701065 696880 691743 695842
8226 695842 706216 717084 723116 709220 685856 632373 584034 558088 530936 516424 518751 542224
8214 542224 582156 641379 741561 847306 951719 1037386 1071315 1068681 1042675 988417 936552
8203 936552 888341 833763 806660 805013 824810 852651 871735 892804 923995 943354 973442 990985
8191I90985J0683l297j6257k9313m9598m4948k9803j7998k0267j8376j1310j2398
8179G48103M350k718L671J5063K4552K5154K0919K5979K0381J6404J9351N0632
8167I71841L4825J8872K3767K9240L3808L0448J5525J2782K2826L7864M5478N4145
8155A331421O4487P9173R7535J09897J33434J84459K56884K85518K27652J25224
8145B895684Q518m2874n0941n3016l5778k0425k1639l4704l7954r937K767j2918
8133B586783j3048j6753R391L9767J02880J53182J40026J02127O2385L526p7277
8122C092989j15858r8173q5236o6173k4869J2940N0717Q3223Q5243Q3124R3370
8111C111297J16123J34088K01167K63488L00730L18890K82600K01614J06338L5313
$$ plain form
8191 990985 1001668 998371 982114 952801 903203 858255 828452 810454 790187 771811 760501 748103
8179 748103 752453 749735 753406 768469 793021 818175 839094 865073 885454 901858 921209 971841
8167 971841 1006666 1025538 1049305 1078545 1112353 1142801 1158326 1171108 1193934 1231798 1277276 1331421
8155 1331421 1395908 1475081 1572616 1682513 1815947 2000406 2257290 2542808 2770460 2895684
8145 2895684 2904202 2861328 2810387 2757371 2721593 2701168 2679529 2644825 2606871 2596934 2599701 2586783
8133 2586783 2573735 2556982 2566373 2606140 2709020 2862202 3002228 3104355 3166740 3170266 3092989
8122 3092989 2977131 2878958 2793722 2727549 2702680 2715620 2766337 2849560 2934803 3017927 3111297
8111 3111297 3227420 3361508 3562675 3826163 4126893 4445783 4728383 4929997 5036335 5071648
8101E071648j723j2903M627R738K1393K9005M0161P4980J11011J68528K23682
8090E740147K99698L46552M19474M82594N48563O13541P55732R93962J279855
8081A1480118J507829J551999J426079J256987J191438J342606J689621K023919
8073B3470596K142357K076807K258641L089676M989945P858466J0697747J2155811
8065F8740046J1937397J0261290P276330M364690J552297j613723m260020o038535
8057I2219772o741540o308135m911496l245250j949933j537376k069513l001335
8049F2455194l586416l361468k318648q70487M60828J208711J306182J049973
8041E6343869Q53052J073989J624784K177568K612270K918677L232670L635439
$$ plain form
8101 5071648 5069925 5057022 5061649 5071387 5092780 5121785 5161946 5236926 5347937 5516465 5740147
8090 5740147 6039845 6386397 6805871 7288465 7837028 8450569 9206301 10200263 11480118
8081 11480118 12987947 14539946 15966025 17223012 18414450 19757056 21446677 23470596
8073 23470596 25612953 27689760 29948401 33038077 38028022 45886488 56584235 68740046
8065 68740046 80677443 90938733 98215063 102579753 104132050 102518327 98258307 92219772
8057 92219772 85478232 79170097 74258601 71013351 69063418 67526042 65456529 62455194
8049 62455194 58868778 55507310 53188662 52318175 52779003 53987714 55293896 56343869
8041 56343869 57196921 58270910 59895694 62073262 64685532 67604209 70836879 74472318
8033G4472318L975041M042441L612775K964005K622478K811965L992752O489699
8025A04983474J0522446J6748569K6386655L9595475N0236852M5215337K0721246
8018C14410054r401125l5291456m8919614m6226386l5834777k4976277j6578868
8011I7181551j1459967q764668p124710n625928m005910k564129j773440j848929
8003E4013870k401352k889873l058022k782273k242708j760224j429486j255269
7995C6194663j124822q64403m34600J51432N80626O82507O78228Q03542J363762
7986C8030935K596592M256769N798870O672911O801615O718136O968185P516500
7978H5360513P814981O766373L787830p8143l591151o884050r488759j0451677
$$ plain form
8033 74472318 78447359 82489800 86102575 89066580 91689058 94501023 98493775 104983474
8025 104983474 115505920 132254489 158641144 198236619 248473471 293688808 314410054
8018 314410054 305008929 269717473 220797859 174571473 138736696 113760419 97181551
8011 97181551 85721584 76956916 69832206 64206278 60200368 57636239 55862799 54013870
8003 54013870 51612518 48722645 45664623 42882350 40639642 38879418 37449932 36194663
7995 36194663 35069841 34205438 33770838 33922270 34502896 35185403 35863631 36667173 38030935
7986 38030935 40627527 44884296 50683166 57356077 64157692 70875828 77844013 85360513
7978 85360513 93175494 99941867 103729697 103651554 100060403 93176353 83687594 73235917
7970G3235917j0412588r767932q564927p175103n967568m736074l558021k724124
7962B0329580k183204j811054j455274j084327p90447n59964m47814m92289n91457
7953A0913750p00685p33712p37918p15391o44973n76778n08941m54846l89512
7944E450994l34267k78553k15794j68363j78841j92028j82479j66164j49568j46821
7934C438116j57249j57259j41084j54146j51398j46227j39961j39901r7153o8149
7924B085589n8294k3464k573j5245k9976l7193k8039l697k0816m6099n0647n2335
7912A717211n6905n0191l9486k7081m9604m7429m0329m5759k9970l3650m6614
7901A250193k8979k6394j2954j493M192L669j7123l4532o3293j06401r6684n9962
$$ plain form
7970 73235917 62823329 53055397 44490470 37315367 31347799 26611725 23053704 20329580
7962 20329580 18146376 16335322 14880048 13795721 13005274 12445310 11997496 11505207 10913750
7953 10913750 10213065 9479353 8741435 8026044 7381071 6804293 6295352 5840506 5450994
7944 5450994 5116727 4838174 4622380 4454017 4275176 4083148 3900669 3734505 3584937 3438116
7934 3438116 3280867 3123608 2982524 2828378 2676980 2530753 2390792 2250891 2153738 2085589
7924 2085589 2027295 2003831 2001258 1986013 1956037 1918844 1890805 1887108 1866292 1820193 1769546 1717211
7912 1717211 1660306 1610115 1570629 1543548 1493944 1446515 1406186 1360427 1330457 1296807 1250193
7901 1250193 1221214 1194820 1181866 1180373 1184565 1188234 1171111 1136579 1073286 966885 870201 810239
7889H10239m8656k7696j7736L728M300L909K3861J0530k7813m0275l8449n3600
7877F02342n9952p1377o3347l6484m923P004j297J0431K4397J7327K1673J2923
7865D58717O640o53j3105o382j7036j4135O447R884L323k22j464j6441j3682k6819
7851C75072m3950m9421m1027m4590l2252j3525j3505l9878j4246n597P959l123
7839H1917j3905n569l158j1180k6767l8476m0387n4154m2909k4946L025L7869
7827a38640M5137O0732P5251N8707M7458L0623K0224j1198k1335j9461j9815j4771
7815A12912j471n98o306j3873q921l005K003N736P92J765R375j474j2662j0745
7801G3528j7167k704R821M243j0911j0588k4495k3544j9541j0855j1399q340k1793
$$ plain form
7889 810239 761583 733887 716151 719879 724179 728088 751949 762479 734666 694391 655942 602342
7877 602342 542390 471013 407666 371182 366259 373263 371966 382397 406794 424121 445794 458717
7865 458717 465357 464704 451599 445217 428181 414046 420493 430377 433700 433478 432014 415573 401891 375072
7851 375072 331122 281701 240674 196084 163832 150307 136802 96924 82678 77081 85040 81917
7839 81917 68012 62443 59285 48105 21338 -17138 -57525 -111679 -154588 -179534 -176509 -138640
7827 -138640 -93503 -32771 42480 101187 148645 179268 199492 188294 166959 147498 127683 112912
7815 112912 111441 110843 104537 90664 81743 78738 80741 86477 87269 89034 98409 96935 84273 73528
7801 73528 56361 53657 63478 67721 56810 46222 21727 -1817 -21358 -32213 -43612 -51952 -73745
7788g3745n771p21j321O600P136K1969J5257J4894L5264J9093R427j592M780J327
7774E2597l403L25N471O483p530j3432K756J3294L858J0501M338m604r076J2123
7760G3701l045q041j182J384j5257O05j6822r548L615J0951K265q176p112R492
7746C2830j1581m198R520j458J364M533J5208p841p91j17P814O464k878j4374
7732C4495m61j687o630M692N290r341R944J5869J5591O311N996j0415p380n36
7718F1738r753p944m386j1874r82J659J95J3804K2077M818O282J791J976n887
7704G3514j2093N335q548r216o610k351k350J3062J3180r196j3377m924L910o806
7690C3530K303J8066J1275O137l840M105R934j488M291Q489N289J786Q651K003
$$ plain form
7788 -73745 -79516 -80237 -81558 -74958 -67822 -45853 -30596 -15702 19562 38655 48082 46490 51270 52597
7774 52597 49194 49519 54990 61473 53943 40511 43267 56561 60419 70920 75258 70654 61578 73701
7760 73701 70656 62615 61433 62817 47560 48165 31343 21795 25410 36361 38626 30450 23338 32830
7746 32830 21249 17051 26571 25113 26477 31010 46218 38377 37586 37469 45283 51747 48869 34495
7732 34495 34034 32347 25717 30409 35699 26358 36302 52171 67762 74073 80069 69654 62274 61738
7718 61738 51985 44041 39655 27781 26799 28458 28653 42457 64534 69352 75634 77425 79401 73514
7704 73514 61421 66756 58208 48992 42382 40031 37681 50743 63923 54727 41350 36426 40336 33530
7690 33530 35833 53899 65174 71311 67471 71576 81510 80022 84313 92802 98091 99877 108528 110531
7676A10531n117J4244J2578J5676K6204L9952O9952P9369Q5834R0485O8898N5228
7664F63834K3174n753l8082o3765n9771m3513l0327k9909l9511m0889r915q893
7652C16680l1792j8385K252k813j2252n124j9513j4845m3J8564Q809R398K2495
7639B73431K8853J5647K2609L3130M2278K5337K0038L6357M0979L6103M7742N0484
7627F72988P2347J09885J73876K48448K83798J99686K7908j47432k69504l05659
7617A066341k44645j64846j07128p9691m4341l0698l2840l1086l5980l4657j8124
7606B42305o879k0515q080n257j4839j9259j3065j4781k0088r859J1210J9813
7594A40706J3995R120M589J9573J532p550J1209L0766K7283K2187M3325P5004
$$ plain form
7676 110531 105414 119658 132236 147912 174116 214068 284020 363389 449223 539708 608606 663834
7664 663834 687008 681255 643173 579408 519637 476124 445797 415888 376377 335488 325573 316680
7652 316680 284888 266503 268755 265942 253690 248566 229053 214208 214165 232729 241538 250936 273431
7639 273431 302284 317931 340540 373670 415948 441285 461323 497680 538659 574762 622504 672988
7627 672988 745335 855220 1029096 1277544 1561342 1761028 1788936 1641504 1372000 1066341
7617 1066341 821696 656850 549722 470031 425690 394992 362152 331066 295086 260429 242305
7606 242305 235426 214911 206831 201574 186735 167476 154411 139630 119542 109683 120893 140706
7594 140706 154701 163821 168410 187983 189515 181965 193174 223940 251223 273410 316735 391739
7582C91739R5431P4874Q5042P1152L2417Q002k7415p9599r1030j09765r1369q8230
7570B71249p7369m1363l0066k7931n236j301l368j0032j5020j0503j5607J671
7558C5124K963o7j125M611p078j2332M373N273l506p946J0225P008j0523M478
7544C1478J1563l059O054N3q213k4806j7482k404J1693l874k635J788O94J1624
7530A2474l849p676J431O317j325k917P011R609p822j2416n349j90m782L080r139
7515a5543k914P617N52Q123J760L19j3929r741M145M161N193L859n799o997l892
7500b3086j462j882k818q587Q040Q157L786J5334J853m827R821J0231m24p36o545
7485F855l566J53O79j2174J758k260j808K252m26K973k800k820M908k832m95m188
$$ plain form
7582 391739 487170 562044 647086 718238 750655 758657 731242 651643 560613 450848 359479 271249
7570 271249 193880 152517 122451 94520 89284 87983 84615 74583 59563 49060 33453 35124
7558 35124 38087 38020 36895 41506 34428 22096 26469 31742 28236 20290 30515 37523 27000 31478
7544 31478 43041 39982 46036 46089 37876 13070 -4412 -6816 4877 1003 -1632 156 850 12474
7530 12474 8625 949 2380 8697 7372 4455 11466 21075 13253 837 -4512 -4702 -9484 -6404 -15543
7515 -15543 -18457 -10840 -10288 -2165 -405 -86 -14015 -23756 -19611 -15450 -10257 -6398 -12197 -19194 -23086
7500 -23086 -24548 -26430 -29248 -37835 -29795 -21638 -17852 -2518 -665 -5492 4329 14560 14136 13400 6855
7485 6855 3289 3442 4121 -8053 -6295 -8555 -10363 -8111 -8537 -5564 -8364 -11184 -6276 -9108 -9603 -13791
7469a3791q911l856j944J2116J30l731Q099l685m26q040m491j0066J0479K3212
7455d905P302n09j2977p712l173Q55J1579l994L16O559m444j2453J361L091M355
7440a4749K027k327p878q704L78M438K400K117J7760J2430n472o236K0181J492
7426A7857k0741r099p704j2397l425J4325J1145o487p183P432L968j544Q633P739
7412B519k643l90O412j5437l090J1033O22q539N948o981J295n766j0263l849n93
7397b9722Q569J6393J803O970J0252j1599k33P68m704j006l084M183J865p121
7383f666J1775J7114K564p378j0316p752q530j1567Q096J360P912J2926m436j3147
7369h045Q718N864l217Q284J0672j5909j0273o694l813K826J600M477J60m134
$$ plain form
7469 -13791 -22702 -26558 -28502 -16386 -16256 -19987 -11888 -15573 -15999 -24039 -28530 -38596 -28117 -4905
7455 -4905 2397 1888 -11089 -18801 -21974 -21119 -9540 -13534 -13218 -6659 -11103 -23556 -22195 -19104 -14749
7440 -14749 -12722 -15049 -22927 -31631 -31253 -26815 -24415 -22298 -4538 7892 2420 -3816 16365 17857
7426 17857 -2884 -11983 -19687 -32084 -35509 -21184 -10039 -16526 -23709 -16277 -12309 -13853 -5220 2519
7412 2519 -124 -514 5898 -9539 -12629 -1596 -974 -9513 -3565 -10546 -9251 -15017 -25280 -29129 -29722
7397 -29722 -21153 -4760 -2957 4013 14265 2666 2433 3201 -1503 -2509 -5593 -1410 455 -6666
7383 -6666 5109 22223 24787 17409 7093 -659 -9189 -20756 -12660 -11300 -3388 9538 5102 -8045
7369 -8045 673 6537 3320 11604 22276 6367 -3906 -10600 -14413 -11587 -9987 -5510 -5350 -9484
7355i484R44R854j4551j5788O985K1297M424j4382j3077r578m185R056J669J3589
7341a3227O400j7121j1670J5798N71j0533j764l339j1989l888J1165L543O84R863
7327b5507p18l306P349p569l235N706n658l296p007K082o376M588R851M84N963
7312b6649J4738m915j2164l406j114J269J1121j268j130o335j0098k0690R151
7299e1490J6880J3032Q285K325J521j1093j002K342j1838Q355R225K624N197l812
7285i449j7206j1645q73Q719O507M319N919L644m083r079o087J9882j891j925
7271a3248n210j483o67K74n375K715l437M156M22L751j1940L287J6381R518j0206
7256a1062L900L029q548n815j4924Q95K0731o933L308J7259j064K636k0542j4032
$$ plain form
7355 -9484 -8540 1314 -13237 -29025 -22040 -743 3681 -10701 -23778 -33356 -37541 -28485 -26816 -13227
7341 -13227 -6827 -23948 -35618 -19820 -19249 -29782 -31546 -34885 -46874 -50762 -39597 -36054 -35370 -25507
7327 -25507 -26225 -29531 -22182 -29751 -32986 -27280 -32938 -36234 -43241 -41159 -47535 -42947 -33096 -32612 -26649
7312 -26649 -11911 -16826 -28990 -32396 -33510 -32241 -21120 -22388 -23518 -29853 -39951 -60641 -51490
7299 -51490 -34610 -21578 -13293 -10968 -9447 -20540 -21542 -19200 -31038 -22683 -13458 -10834 -5637 -9449
7285 -9449 -26655 -38300 -39173 -30454 -23947 -19628 -13709 -10065 -14148 -23227 -29314 -9432 -11323 -13248
7271 -13248 -18458 -19941 -20608 -20334 -25709 -22994 -26431 -22275 -21853 -18102 -30042 -26755 -10374 -856 -11062
7256 -11062 -7162 -4133 -12681 -18496 -33420 -32525 -11794 -18727 -15419 1840 776 3412 -17130 -31162
7242c1162R853L665k2831m624J1238l64K641N072K394j1909l877R007J3387J4104
7228c406M210k3922K432K362p222j0422K374M920N262m746p957J9381J5395n380
7214f719k61l572J501J702j514L582P332k108p035K090l890q814j7478J2422J1292
7199a1470l955j8158J453J7225o382j1104r910n02K5643J6409Q961j309q454J482
7185g1p422n968J2223J461q39K265K110j0522P703j3450m692P034k436L849o708
7170a5463j2645j627p838k974M143J872P138M106j786R274K826j3466k0481L468
7156d3453P27P597J6923j475M679P941M134n872n139Q346R206j2866j4707N423
7142a8536Q948j6731K086K0886M259q915j1654k02J2023p995r616r543p655L360
$$ plain form
7242 -31162 -21309 -17644 -40475 -45099 -33861 -34225 -31584 -26512 -24118 -36027 -39904 -30897 -17510 -3406
7228 -3406 804 -23118 -20686 -18324 -25546 -35968 -33594 -28674 -23412 -28158 -36115 -16734 -1339 -6719
7214 -6719 -6980 -10552 -9051 -7349 -8863 -5281 2051 -57 -7092 -5002 -8892 -17706 -35184 -22762 -11470
7199 -11470 -15425 -33583 -32130 -14905 -21287 -32391 -42301 -42803 -17160 -751 8210 6901 -1553 -71
7185 -71 -7493 -13461 -1238 223 -616 1649 3759 -6763 940 -12510 -17202 -10168 -12604 -8755 -15463
7170 -15463 -28108 -29735 -37573 -40547 -36404 -34532 -27394 -23288 -25074 -15800 -12974 -26440 -46921 -43453
7156 -43453 -42726 -35129 -18206 -19681 -15002 -7061 -2927 -8799 -13938 -5592 3614 -9252 -23959 -18536
7142 -18536 -9588 -26319 -24233 -3347 912 -8003 -19657 -19859 -7836 -15831 -25447 -34990 -42645 -39285
7128c9285J052J2893L880J0942M218l836k471l765q456m445o274J2340K1760k233
7114c680r525l814o296k86J933k658J1671Q886j2993j240J5554O831j0413n183
7100a1213j81j1436j0352l813J5002L495L367J2677K29p209R6J402o315q219o388
7085b8858Q451Q182o498m649j1238P227O122M368j179J862J15J045j8735l120
7071c6905K611J4907N605k009m234j0024N69J4971Q290K986l271j2130l212J1599
7057a0247N923K978j2465n703N486j072l619m865j2924k994O095p98J1302J1969
7043a0934N544m635j222m425r085J7581Q279q319m306q298P681O47O93J953j788
7028a0634q088l509j2321q224J7407Q461j4256K863L207l63p265l102j352q772
$$ plain form
7128 -39285 -38233 -25340 -21460 -10518 -6300 -10136 -12607 -16372 -24828 -29273 -35547 -23207 -1447 -3680
7114 -3680 -13205 -17019 -23315 -23601 -21668 -24326 -12655 -3769 -16762 -18002 -2448 4383 -6030 -11213
7100 -11213 -11394 -22830 -33182 -36995 -21993 -18498 -15131 -2454 -2225 -9434 -9338 -7936 -14251 -22470 -28858
7085 -28858 -20407 -12225 -18723 -23372 -34610 -27383 -21261 -16893 -18072 -16210 -16095 -15050 -33785 -36905
7071 -36905 -34294 -19387 -13782 -15791 -20025 -30049 -29480 -14509 -6219 -3233 -6504 -18634 -21846 -10247
7057 -10247 -4324 -1346 -13811 -19514 -14028 -15100 -18719 -23584 -36508 -39502 -33407 -34205 -22903 -10934
7043 -10934 -5390 -10025 -11247 -15672 -24757 -7176 1103 -7216 -11522 -19820 -12139 -11492 -10799 -8846 -10634
7028 -10634 -18722 -22231 -34552 -42776 -25369 -16908 -31164 -28301 -25094 -25457 -32722 -35824 -37176 -45948
7014d5948l864Q675Q255P970j1647p291l894O106K1876J4342l480j28Q59P416
7000g53q136q632P870J162k513J62K50K162n181k164m423M205J3859j4715p485
6985b4332j811q13K622O868L146K201L795N887q307q137P737q78O039M615O068
6970D700j4232p045j395M138K925J1169J2456J027j0444k1485n904M145R471l122
6956a3596j311l967j716J2054P21p277o674Q22l423R279M202n045j0821j0886
6942c7638j726k873M852J1403l132l914M39J2638M487K24j0053J113n252k626
6928c2058R840m48O469M246q53q029J151L405J2896k173O093k0415j6631M181
6914c2326P016n796k657J094l508r7O997j304p48O678J0088q704j6980j055P266
$$ plain form
7014 -45948 -49812 -41137 -32882 -24912 -36559 -43850 -47744 -41638 -19762 -5420 -8900 -9028 -8169 -753
7000 -753 -8889 -17521 -9651 -8489 -11002 -10840 -10590 -8428 -13609 -15773 -20196 -15991 -2132 -16847 -24332
6985 -24332 -26143 -26956 -24334 -17466 -14320 -12119 -8324 -2437 -10744 -18881 -11144 -12022 -5983 -1368 4700
6970 4700 -9532 -16577 -17972 -13834 -10909 260 12716 13743 3299 -18186 -24090 -19945 -10474 -13596
6956 -13596 -14907 -18874 -20590 -8536 -7815 -15092 -21766 -20944 -24367 -15088 -10886 -15931 -26752 -37638
6942 -37638 -39364 -42237 -37385 -25982 -29114 -33028 -32589 -19951 -15464 -15240 -25293 -24180 -29432 -32058
6928 -32058 -22218 -22666 -16197 -11951 -12804 -20833 -19682 -16277 -3381 -5554 539 -19876 -36507 -32326
6914 -32326 -25310 -31106 -33763 -32669 -36177 -36274 -29277 -30581 -31329 -24651 -14563 -23267 -40247 -41302 -34036
6899c4036Q810J6938K826Q826k294m174j2211K228n098O182n331m982n605L054
6885b4867L722L977J1755q307r532M434L393q366K713J6020o055j1168L373J4983
6871c925M195n95L924m541N195L691j1481j5670O740N356q947k106o660K88p591
6856c2127Q749J0091o352K74R46P89M979P729P290m952j1058K107J0157K912l26
6841A208n899L67J6377j536r788j458J701J084M80O503o583j4317q042o30n006
6826b5539J588J82J262K251N089P19Q77J2763l150k260L301r583j2762n131k831
6811c3224j336N750N449P08k815R66O45J7603K094K466N47j547r346J783M291
6796e966R165P570q752k5159o641K106Q142N325P792l742q325m571N778K734j003
$$ plain form
6899 -34036 -25226 -8288 -5462 3364 1070 -3104 -15315 -13087 -18185 -12003 -17334 -22316 -27921 -24867
6885 -24867 -21145 -17168 -5413 -13720 -23252 -18818 -15425 -23791 -21078 -5058 -11113 -22281 -18908 -3925
6871 -3925 270 -325 3599 -942 4253 7944 -3537 -19207 -12467 -7111 -16058 -18164 -24824 -24536 -32127
6856 -32127 -23378 -13287 -19639 -19365 -18419 -17630 -12651 -4922 2368 -2584 -13642 -11535 -1378 1534 1208
6841 1208 -4691 -4324 12053 10517 729 -729 972 2056 2536 9039 2456 -11861 -19903 -20533 -25539
6826 -25539 -23951 -23769 -22507 -20256 -15167 -14448 -13571 -808 -3958 -6218 -2917 -12500 -25262 -30393 -33224
6811 -33224 -34560 -28810 -23361 -22653 -25468 -24502 -23857 -6254 -4160 -1694 -1147 -2694 -12040 -10257 -5966
6796 -5966 3199 10769 2017 -23142 -29783 -27677 -19535 -14210 -6418 -10160 -18485 -23056 -17278 -14544 -15547
6781a5547M375J249o214m58j155l678p46L449n663m129j604J736j637R611J7581
6766b830P145M999n071N922K218j2389j3291J0085L418r49K848J183j4660n694
6752a7066k355L330o140p014k084J1011J0474N528P523j4425k764Q755J993J4127
6738A0893N587l352M701o844M36k647Q257M596Q439j712j375m119j8458q31O234
6723I805p450j2620O440J2446O130Q574m238j8707j5929o837qM85K529R490M208
6708e682Q230Q557j504J142M502K423m426J268N788j87J0822R726N065J662K306
6693D9692n903k3013k16n126j4065N725m844n532J2840m949j234Q15k083J061
6679C168L130m638m666o72n130Q57J180r820o373q523O744J1053P366m809P340
$$ plain form
6781 -15547 -11172 -9923 -16137 -16595 -17750 -21428 -22174 -18725 -24388 -28517 -30121 -28385 -30022 -20411 -2830
6766 -2830 4315 9314 4243 10165 12383 -6 -13297 -3212 206 -743 2105 3288 -11372 -17066
6752 -17066 -19421 -16091 -22231 -29245 -31329 -20318 -9844 -4316 3207 -11218 -13982 -5227 -3234 10893
6738 10893 16480 13128 17829 10985 11421 8774 17031 21627 30066 28354 26979 22860 4402 3571 9805
6723 9805 2355 -10265 -3825 8621 14751 23325 19087 380 -15549 -22386 -22394 -21909 -19380 -9890 -5682
6708 -5682 2548 11105 9601 10743 15245 17668 13242 14510 20298 20111 30933 40659 45724 47386 49692
6693 49692 43789 20776 20560 15434 1369 7094 2250 -3282 9558 4609 3375 4190 2107 3168
6679 3168 6298 1660 -3006 -3678 -8808 -7951 -6771 -16591 -22964 -31487 -24743 -13690 -6324 -11133 -3793
6664c793J3454Q290R969r390J147l773L63n900j6232j793J692J2733j5L625j7862
6649g485j4638m480n731L128O558M107o895j037L996o50P162K1345O662j729r558
6634G55n326m740j3047n506R642k328J4115J7050j2279k0891L966J3371j871j5153
6620b2242j1071R006J0705J331k577Q460O855O484r020j385L146M248q075j2166
6606a6301P357q038r766o851J237K495J4770K0415p999j3969j7994N720M834k25
6592b4315J1237M021N741r043M317J2959n631l498M766q025n375Q362o123l191
6578a3798P490P804j4622j4634J4209P776l743j2655n300k027J2028m664j613
6565b3749K4485J1094o445l344l283R126K334j0281Q15J2076N05k392o410m831
$$ plain form
6664 -3793 9661 17951 27920 18530 19677 15904 16267 10367 -5865 -7658 -5966 6767 6752 10377 -7485
6649 -7485 -22123 -26603 -32334 -29206 -22648 -18541 -25436 -26473 -22477 -23127 -15965 5380 12042 10313 755
6634 755 -4571 -9311 -22358 -27864 -18222 -20550 -6435 10615 -1664 -22555 -18589 -5218 -7089 -22242
6620 -22242 -33313 -24307 -13602 -12271 -14848 -6388 467 6951 -2069 -3454 -308 3940 -4135 -16301
6606 -16301 -8944 -16982 -26748 -33599 -32362 -29867 -15097 5318 -2681 -16650 -34644 -28924 -24090 -24315
6592 -24315 -13078 -9057 -3316 -12359 -8042 4917 -714 -4212 554 -7471 -12846 -4484 -10607 -13798
6578 -13798 -6308 1496 -13126 -27760 -13551 -5775 -9518 -22173 -27473 -29500 -17472 -22136 -23749
6565 -23749 736 11830 5385 2041 -1242 7884 10218 -63 752 12828 13333 10941 4531 -300
6551c00L518M52j2084k3224m563N646n37m677J4985P556r184O030p853j515Q889
6536a6861J5620L32j0511j1279P667K706J138m484k538O690Q714R572p106j2026
6522a2366M655j1307p309L644L834p029j693N421K727M337L870J748J194P572
6508g02k197r039j067q963M147J4871J5133O331j243o393m916o068K641M252j68
6493F619r188m513q212J530O321p172l803J3267r801j33P842p546m762m15P63
6478a9203m633m90J553p804j937K066Q737k800o26K2512Q268K132j572J826q359
6463c30k1694j2289L391L607m379J770O999Q062j3311m043J8698O523p379M737
6449i638n344L734O786L91p213n627J575K137k320L970p973m303K570L570j409
$$ plain form
6551 -300 3218 3670 -8414 -31638 -36201 -30555 -31092 -35769 -20784 -13228 -22412 -16382 -24235 -25750 -16861
6536 -16861 -1241 -909 -11420 -22699 -15032 -12326 -11188 -15672 -18210 -11520 -2806 6766 -340 -12366
6522 -12366 -7711 -19018 -26327 -22683 -18849 -25878 -27571 -22150 -19423 -15086 -11216 -9468 -8274 -702
6508 -702 -2899 -11938 -13005 -21968 -17821 -2950 12183 18514 17271 10878 5962 -106 2535 6787 6619
6493 6619 -2569 -7082 -15294 -13764 -7443 -14615 -18418 -5151 -14952 -15085 -7243 -14789 -19551 -19966 -19203
6478 -19203 -23836 -24326 -22773 -30577 -32514 -30448 -21711 -24511 -25137 -2625 5643 7775 6203 8029 -330
6463 -330 -22024 -34313 -30922 -27315 -31694 -29924 -22925 -14863 -28174 -32217 -13519 -6996 -14375 -9638
6449 -9638 -14982 -11248 -4462 -4071 -11284 -16911 -15336 -13199 -15519 -11549 -19522 -23825 -21255 -17685 -19094
6434a9094r034M056L525L853K275L262l78j2486L293R340o262q364j716P493M800
6419a5437m914N496j125R84j461m349J7835J4122q677M043p633j4916j609K016
6405a5625N323p749J0716J0742K761k944M818r222n047K768m25k197q255r957
6391b4293P993J2367N268k9j123l489m724O211q497L667N852n042p38M903k679
6376d353r835o31k402j2845L28O552K842L74m006J1250k238K433m342j881l927
6361b2681J846J5957L452p113l318M892J4625N853j4931j2511R710L063j6358
6348a7514j5089j985j478R820q752L737j906Q089J7661o1N118J1530O39p902r939
6333h032j1503M565L317P745Q498O940k437j3343R506J3102o656J103J815l656
$$ plain form
6434 -19094 -28128 -24072 -20547 -16694 -14419 -11157 -11535 -24021 -20728 -11388 -17650 -26014 -27730 -20237 -15437
6419 -15437 -20351 -14855 -15980 -14996 -16457 -20806 -2971 11151 2474 6517 -1116 -16032 -17641 -15625
6405 -15625 -10302 -18051 -7335 3407 6168 3224 8042 -1180 -6227 -3459 -3884 -6081 -14336 -24293
6391 -24293 -16300 -3933 1335 1306 183 -3306 -8030 -1819 -10316 -6649 -797 -5839 -6577 -1674 -4353
6376 -4353 -14188 -14819 -17221 -30066 -29738 -23186 -20344 -19970 -23976 -12726 -14964 -12531 -16873 -18754 -22681
6361 -22681 -20835 -4878 -1426 -8539 -11857 -6965 7660 13513 -1418 -13929 -4219 -1156 -17514
6348 -17514 -32603 -34588 -36066 -26246 -34998 -31261 -33167 -25078 -7417 -7478 -2360 9170 9809 1907 -8032
6333 -8032 -19535 -14970 -11653 -3908 4590 11530 9093 -4250 5256 18358 11702 12805 14620 10964
6319A0964j955L279J432q734n114J140r441P986P123m672r370J773O238K307R29
6304C885l384j464r362n933p673R766j431o285n813J206O393J190k206J3192O091
6289a828J2126L915p253p278o414k604m257q39n338J1925n1j4789p798Q856J5601
6274f026K197j532j9247o706Q074R137k76n074J979n978m324J0121K3361P153
6260A2859M015O893n909j8954n891j3316j2427J056O841J1624J8304o540j5421
6247a6866l160K0571Q252M725J541J219j0409j459p136o741J66p193O497P912
6233b081l168j4207Q57J1491n671q303l154J2375J0296J3480N607k4687r276j4042
6219c0483R827J7664J2740j858p659q379l196q945k88J2248O518j2416p17n626
$$ plain form
6319 10964 9009 12288 13720 4986 -128 1012 -8429 -443 6680 2008 -7362 -5589 649 2956 3885
6304 3885 501 -963 -10325 -16258 -23931 -14165 -15596 -21881 -27694 -26488 -20095 -18905 -21111 -7919 -1828
6289 -1828 10298 14213 6960 -318 -6732 -9336 -13593 -14432 -19770 -7845 -7896 -22685 -30483 -21627 -6026
6274 -6026 -3829 -5361 -24608 -31314 -23240 -14103 -14379 -19453 -17474 -23452 -27776 -17655 5706 12859
6260 12859 16874 23767 17858 -1096 -6987 -20303 -32730 -31674 -24833 -13209 5095 -1445 -16866
6247 -16866 -20026 545 8797 13522 15063 16282 5873 4414 -2722 -9463 -9297 -16490 -9993 -2081
6233 -2081 -5249 -19456 -18599 -7108 -12779 -21082 -24236 -11861 -1565 11915 17522 -7165 -16441 -30483
6219 -30483 -20656 -2992 9748 7890 231 -8148 -11344 -20289 -20577 -8329 -1811 -14227 -14944 -20570
6205b0570j2188P689P620k346O813J1120j004L005k721j437N495J1188l202p907
6191A555N093Q571q067j2240m428k828l685N21K057L473l605N975l659p659O566
6176a2360K321m510M476O92n118M091l513j518m19k987N13J136m061J0143Q247
6161b867J4389R72m881N18n879j6510p991k648K490J0366P523Q047j5905j4188
6147b6564Q576m146n405J4617N172O901K588r439J7945N477j8717j8434j973R096
6133a4306J1663Q664j818P87J225K500J429l485P327q051k711J078J901q12K478
6118G869k330l441j6643r485Q682m849J935J2987N247O91j1092O409J5773j612
6104A0141m699J883M383J6282n613j3766N5L097r579n514O80j4674l959L294Q583
$$ plain form
6205 -20570 -32758 -25069 -17449 -19795 -12982 -1862 -2866 139 -2582 -4019 1476 12664 9462 1555
6191 1555 6648 15219 7152 -5088 -9516 -12344 -16029 -15508 -13451 -9978 -13583 -7608 -11267 -18926 -12360
6176 -12360 -10039 -14549 -10073 -9381 -14499 -10408 -13921 -15439 -15858 -18845 -18332 -17196 -21257 -11114 -2867
6161 -2867 11522 12494 7613 8131 2252 -14258 -22249 -24897 -22407 -12041 -4518 3529 -12376 -26564
6147 -26564 -17988 -22134 -27539 -12922 -7750 -849 1739 -7700 10245 15722 -2995 -21429 -23402 -14306
6133 -14306 -2643 6021 4203 4990 6215 8715 10144 6659 13986 5935 3224 4302 6203 5391 7869
6118 7869 5539 2098 -14545 -24030 -15348 -20197 -18262 -5275 -28 663 -10429 -4020 11753 10141
6104 10141 5442 7325 11708 27990 22377 8611 8666 11763 2184 -3330 -2650 -17324 -21283 -17989 -9406
6089i406L632m710j3948N855J9700O289l99M086k88n565r870j312J2195J4743
6075B1002r236j7196K423J9360J2318j2469j3962K324o650o216K108m5q633j0271
6061b5143J0325J2315N211j2301J60K67N80L072n253j1466L203J3752J8387q736
6047D373j6113k8J0879N77r370m290m084k007m448o445P38L326J760j143Q166
6032a8109J0253Q400K473j3404j1967L135O112J070k171O213P507P448j7083n290
6018a5413O908J495j817q102J797J2308J6743p925j5011j0820J5758P702l704
6005h1m023j0385O434J0259Q800o828l392n824Q97Q917J5787j620l776j7914n298
5990h047J2417O947l195r244O862K463l571j0273l114n480j0645j5434J3378J4938
$$ plain form
6089 -9406 -5774 -10484 -24432 -18577 1123 7412 7013 11099 10811 5246 -4624 -5936 6259 21002
6075 21002 11766 -5430 -3007 16353 28671 16202 2240 4564 -2086 -8302 -6194 -6239 -14872 -25143
6061 -25143 -14818 -2503 2708 -9593 -9433 -9166 -8586 -5514 -10767 -22233 -19030 -5278 13109 4373
6047 4373 -11740 -11768 -889 -312 -9682 -13972 -18056 -20063 -24511 -30956 -30218 -26892 -25132 -26275 -18109
6032 -18109 -7856 544 3017 -10387 -22354 -19219 -13107 -12037 -14208 -7995 -488 6960 -10123 -15413
6018 -15413 -8505 -7010 -8827 -16929 -15132 -2824 13919 5994 -9017 -19837 -4079 3623 -81
6005 -81 -4104 -14489 -8055 2204 11004 4176 784 -5040 -4143 4774 20561 18941 15165 -2749 -8047
5990 -8047 4370 11317 8122 -1122 5740 8203 4632 -5641 -8755 -14235 -24880 -40314 -26936 -11998
5976a1998P85L780Q862J198j808q667M901O939J2659m651L609p199n254j0638
5962g482P53J7234O683p477m240J6902j0123o173P324N10o550j7557p821K4673
5948F656M037j2627k242l755K819J8q417l453L856Q300O988m358L628J1115N960
5933A8525j919k098k107L112P80k755j0635l460M886r809j6602K9r97L13O735
5918a6002q274r214m011J0476J6055J6149n487j294j664m464R382Q700J822j2536
5904c62j0416K89J3823J4842n36j9434n219j978l900J155Q396O456M556k426j9634
5889a4388j2834J80P159k866m975R394J3707M895r482o781L960Q072l711q49M388
5874d131L247O65J762N998n799K765Q022j7129q530K536L586k86m058m740P587
$$ plain form
5976 -11998 -11213 -7433 1429 2627 819 -7848 -2947 3992 16651 12000 15609 8410 3156 -7482
5962 -7482 -6729 10505 17188 9711 5471 22373 12250 6077 13401 13911 7361 -10196 -18017 6656
5948 6656 10693 -1934 -4176 -7931 -5112 -5094 -13511 -16964 -13108 -4808 2180 -2178 1450 12565 18525
5933 18525 16606 14508 12401 15513 16293 13538 2903 -557 4329 -5480 -22082 -22053 -23050 -22737 -16002
5918 -16002 -24276 -33490 -37501 -27025 -10970 5179 -308 -1602 -3266 -7730 1652 10352 12174 -362
5904 -362 -10778 -10489 3334 18176 17640 -1794 -7013 -8991 -12891 -11736 -3340 3116 7672 5246 -14388
5889 -14388 -27222 -27042 -19883 -22749 -27724 -18330 -4623 272 -9210 -15991 -12031 -3959 -7670 -8519 -4131
5874 -4131 -884 -219 1543 7541 1742 4507 12529 -4600 -13130 -10594 -7008 -7294 -11352 -16092 -8505
5859h505O694K069J3360j246j5405j2296Q97n059L946L344Q554O609j0592o682
5845a4312j571l566j434j778O09R491O006Q318j784k299m655l631J1097N579M220
5830A0290j1740j2107J234K431J4601Q115r995j0472m052J195N437q653j0314
5817b4030l153J2440L029n628J3021J4738P42j5551r790M321j721J0233R259j380
5803F530O093K059l235j2773o807M745o023k902J1424J262L30K451J005N502k111
5788G550k396o78r510M920q903k342J0507O37J682j1563n397J57m00Q249M930
5773b557o15l889R071m114m847r347J3782J2816l100r896p915p636J9369Q773
5759I895m925r997j7860O175J1958J995j653j442J1436Q590k282N6r837p942L417
$$ plain form
5859 -8505 -1811 258 13618 12372 -3033 -15329 -14432 -19491 -15545 -12201 -3647 2962 -7630 -14312
5845 -14312 -15883 -19449 -20883 -22661 -22052 -12561 -6555 1763 -21 -2320 -6975 -10606 491 6070 10290
5830 10290 -1450 -13557 -12323 -9892 4709 12824 2829 -7643 -11695 -10500 -5063 -13716 -24030
5817 -24030 -27183 -14743 -11714 -17342 -4321 10417 11159 -4392 -14182 -9861 -11582 -1349 7910 6530
5803 6530 12623 14682 11447 -1326 -8133 -3388 -9411 -12313 -889 373 703 3154 4159 9661 7550
5788 7550 5154 4476 -5034 -114 -9017 -11359 -852 -215 1467 -10096 -15493 -15336 -15736 -7487 -2557
5773 -2557 -3172 -7061 2010 -2104 -6951 -16298 -2516 10300 7200 -2696 -10611 -18247 1122 9895
5759 9895 4970 -5027 -22887 -16712 -4754 -2759 -4412 -5854 5582 14172 11890 11946 2109 -5833 -2416
5744b416n446N220j0029m809q770N280O843J4350o321n226l471L1q22N798o068
5729a5856O38J1693k832l936O891K754o036L05P838P010j1897L774L018K578l921
5714B021k390j960J0539j1401j0103J2206J6743k268M950L398L808m321j6690
5701D532l028m997p039k042N484o760K474j2581N890J6241o91J150n477M921P5
5686a848k661K048J368O936J3726M624k620n210r215N202J3616j796o939m630
5672A2601J411k718j8249R709L727k824l966k1631j162Q210M416M987o155L304
5658h340m50o159J513j703L219K819j984j6468k427j971O473Q552k600L388J5341
5643g97K803L23Q696O966j2074r377j1353K698K0311R038J890k306j2083n979
$$ plain form
5744 -2416 -7862 -2642 -12671 -17480 -26250 -20970 -14127 223 -6098 -11324 -14795 -14764 -15586 -9788 -15856
5729 -15856 -15218 -3525 -6357 -10293 -3402 -648 -6684 -6379 1459 8469 -3428 346 3364 5942 2021
5714 2021 -369 -2329 8210 -3191 -13294 -1088 15655 13387 18337 21735 25543 21222 4532
5701 4532 1504 -3493 -10532 -12574 -7090 -13850 -11376 -23957 -18067 -1826 -2517 -1367 -6844 -1923 -1848
5686 -1848 -4509 -2461 -1093 5843 19569 24193 21573 16363 7148 12350 25966 24170 17231 12601
5672 12601 14012 11294 -6955 2754 6481 3657 -309 -21940 -23102 -14892 -10476 -5489 -11644 -8340
5658 -8340 -8790 -14949 -13436 -15139 -11920 -9101 -11085 -27553 -29980 -31951 -25478 -16926 -19526 -16138 -797
5643 -797 2006 2329 11025 17991 5917 -3460 -14813 -12115 8196 17234 19124 16818 4735 -1244
5629a244m419Q388J0745N296j577n92o350m591j5513l653j373P022J2434q161
5615c588m428l453j3566N727R366M222M308J1642K092q043m767j092J1278L195
5601A2893m515j409N304J759m045K562K060o668m365j1743n478l125q32L251J3335
5586a016J5276L163j7963j4985k808j0061k061Q155O231M274P12o502O360M721
5572f504L556r886m759L921O132J0710J400j0602j876j1988N481P010K309R4j910
5557f912p872O39j749M23M048N686j925l446j0893j834P459N919N615k485j708
5542i035R325N868j248n958k447m344o820r455n006J0846N884k891R697P295k847
5527a136M188k24m274R073L536l36N183k584n855R01O1n199J542j2798q545m342
$$ plain form
5629 -1244 -5663 2725 13470 18766 17189 16597 10247 5656 -9857 -13510 -14883 -7861 4573 -3588
5615 -3588 -8016 -11469 -25035 -19308 -9942 -5720 -1412 10230 12322 4279 -488 -1580 9698 12893
5601 12893 8378 6969 12273 14032 9987 12549 14609 7941 3576 -8167 -13645 -16770 -17602 -14351 -1016
5586 -1016 14260 17423 -540 -15525 -18333 -28394 -30455 -22300 -16069 -11795 -11083 -17585 -11225 -6504
5572 -6504 -2948 -12834 -17593 -13672 -7540 3170 4570 -6032 -7908 -19896 -14415 -7405 -5096 -5002 -6912
5557 -6912 -14784 -14145 -15894 -15471 -11423 -5737 -7662 -11108 -22001 -23835 -16376 -10457 -4842 -7327 -9035
5542 -9035 290 6158 4910 -1048 -3495 -7839 -14659 -24114 -29120 -18274 -12390 -15281 -5584 1711 -1136
5527 -1136 3052 2828 -1446 7627 11163 10827 16010 13426 7571 8472 8533 3334 4876 -7922 -16467 -20809
5511b0809O34J1797l101j605J1209o079m143J3718N504N606p703m702n636J134
5497d176o120o722K195O649N624J712k560p71p596k641k30n906P440L297m699
5482a4504M719p42N107p76M289J1784n998p128K045r623N795J0858m461p044M066
5467a613L351k891k053M269j004o069N320J307M487O320J133l315j3564j270j449
5452g041P538R419J2482k4900m402M037j1008k1824L035R207J33K5304P641P532
5438A7153J4091L834j4414j5297j181n261M328J3821j1241j4833o829J0878l990
5425h941L321J7083n326K010j5379M809O339l83M683N987k584n259o394m274l147
5410g455l293P997K0750J839j2958j274p892n564L363n21R267K094n1l952m675
$$ plain form
5511 -20809 -20175 -8378 -11479 -13084 -1875 -7954 -12097 1621 7125 12731 5028 326 -5310 -4176
5497 -4176 -10296 -17018 -14823 -8174 -2550 -838 -3398 -4169 -11765 -14406 -14636 -20542 -13102 -9805 -14504
5482 -14504 -9785 -10527 -5420 -6196 -1907 9877 3879 -3249 -1204 -10827 -5032 5826 1365 -5679 -1613
5467 -1613 1738 -1153 -3206 1063 59 -6010 -690 617 5104 11424 12557 9242 -4322 -5592 -7041
5452 -7041 497 9916 22398 -2502 -6904 -2867 -13875 -35699 -32664 -23457 -23324 1980 9621 17153
5438 17153 31244 35078 20664 5367 4186 -1075 3253 17074 5833 -9000 -15829 -4951 -8941
5425 -8941 -5620 11463 6137 8147 -7232 -2423 3916 3533 8216 14203 11619 6360 -34 -4308 -7455
5410 -7455 -10748 -2751 17999 19838 6880 5606 -2286 -7850 -4487 -5008 4259 6353 6302 2350 -2325
5395b325K853o245P828O353N064K85o932j1986k0658J566J3549J2317L9m999j936
5380e227o302N789M621j2551J3203J2349o977J76l597N794R038n145j9248J317
5366f760Q785R04o06o259k885q356j0359J225O216Q438R590R63p275q64O712N544
5350E013n777l607N294j823N137j5403r938O102J1343q8k397J7370p511l541J1438
5335A1612O518K664j3851M371P48j0699L646k295p033j5918k357R204M562N231
5321c597J4m49j137k628q809J0092R203J694L032M409k752k188M334k134q582
5306E02p961p406R617K419n683K028k674J1202J985j3075L634J2386M314K174
5292A3462o140p627m292p292R79J2656Q275P56o430k333J144o74p381r677o41
$$ plain form
5395 -2325 528 -5717 2111 8464 13528 13813 6881 -5105 -25763 -24197 -10648 1669 1708 -3291 -5227
5380 -5227 -11529 -5740 -1119 -13670 -467 11882 4905 5081 1484 7278 16316 11171 -8077 -6760
5366 -6760 2025 2929 2323 -3936 -6821 -15177 -25536 -24311 -18095 -9657 -67 896 -6379 -7243 -531 5013
5350 5013 -764 -4371 923 -900 4237 -11166 -21104 -15002 -3659 -3747 -6144 11226 3715 174 11612
5335 11612 18130 20794 6943 11314 12062 1363 5009 2714 -4319 -20237 -22594 -13390 -8828 -3597
5321 -3597 -3583 -4032 -5169 -7797 -16606 -6514 2689 4383 7415 11824 9072 6884 11218 9084 502
5306 502 -7459 -14865 -5248 -2829 -8512 -6484 -9158 2044 4029 -9046 -5412 6974 11288 13462
5292 13462 7322 -305 -4597 -11889 -10910 1746 10021 10777 4347 2014 3158 2484 -4897 -14574 -15215
5277a5215M376n15J456r55m37k348L18n671R788J3725M938m514M718n330o892
5262b558K4784M058j3158j984m888l478L280q65q662M658p136L614q53J198r45
5247b935m703J890p693l506j5462k23J0739R641O673M034k762o342O473J5838
5233A1662R352j1101j677r35o040J0112J080m626m196p944r550M189k221P750
5219d145o90q898N13k487m419R53J7034n131J078n471j436j715n194l673K2787
5204h94K4922m622j4384Q71k848n356r73L604m786Q844R483J2128p611j5973l385
5189i80P715M578k0676j6989K519L080q630n589j255J83J2418N273O517l571r254
5174b4661L894O362k27L045l067j663J3182m47p456Q499Q307J40J450j5353Q671
$$ plain form
5277 -15215 -10839 -11354 -9898 -10853 -11290 -13638 -13320 -18991 -9203 4522 9460 4946 9664 4334 -2558
5262 -2558 22226 26284 13126 11142 6254 2776 6056 5191 -3471 1187 -5949 -2335 -3188 -1990 -2935
5247 -2935 -7638 -5748 -13441 -16947 -32409 -32632 -21893 -12252 -5579 -1545 -4307 -10649 -4176 11662
5233 11662 21014 9913 8236 7301 1261 11373 12453 7827 3631 -4313 -13863 -9674 -11895 -4145
5219 -4145 -4835 -13733 -13220 -15707 -20126 -19173 -2139 -7270 -6192 -11663 -13099 -14814 -20008 -23681 -894
5204 -894 24028 19406 5022 5893 3045 -2311 -3284 320 -4466 4378 13861 25989 18378 2405 -980
5189 -980 6735 11313 -9363 -26352 -23833 -20753 -29383 -34972 -36227 -36044 -23626 -18353 -11836 -15407 -24661
5174 -24661 -20767 -14405 -14632 -11587 -14654 -16317 -3135 -3582 -11038 -2539 5768 5908 7358 -7995 676
5159F76l484n393j116o7P204J9495j496j567K599N809J339p2J559l475J680j4671
5143I020l57n568o008l271J5968k334j6257M31j0396j0759L331J1108Q794O267
5129c1J288n781M850j455J294R416r99k1308j4392L786N275L806j9256p465J4383
5114b6589R977J7565l177j3455k168Q825M867k881M692r162P038J6794m088Q006
5100A6244m276q97J1061R865R046j8919j133J9092j040j9889j4239n498l459J886
5086b156j617J08J4135N786l979K596m286l97j2672o694Q892N786j73J052n294
5071A087N871m537l378O137L737p445N433O514k056J746P774N196l116j049j0926
5056A0988m731q923K923M489j434n276R57O485l303p966n385K371J7898J0126
$$ plain form
5159 676 -2808 -8201 -9317 -9384 -2180 17315 15819 14252 16851 22660 23999 23927 25486 22011 23691 9020
5143 9020 8663 3095 -2913 -6184 9784 7450 -8807 -8376 -18772 -29531 -26200 -15092 -6298 -31
5129 -31 1257 -4524 326 -1129 165 9581 8582 -12726 -27118 -23332 -18057 -14251 -33507 -40972 -26589
5114 -26589 -16612 953 -2224 -15679 -17847 -9022 -4155 -7036 -2344 -11506 -4468 12326 8238 16244
5100 16244 11968 11071 22132 31997 41043 22124 20991 40083 39043 19154 4915 -583 -4042 -2156
5086 -2156 -3773 -3665 10470 16256 12277 14873 10587 10190 -2482 -9176 -284 5502 5329 6381 1087
5071 1087 6958 2421 -957 5180 8917 1472 6905 13419 11363 13109 20883 26079 22963 21914 10988
5056 10988 6257 -2666 257 4746 3312 -1964 -1007 5478 2175 -5791 -11176 -8805 9093 19219
5042A9219j8743j3237j0058j849R570K3659R149l411J054N645K402j2521n065
5029E814P642j1554k2634n301J0256J8350J756n993l211n115l162j96J5129J008
5015B789j181j657J1352J4210j2708q748n13K513p23P270j844p061r904n298n242
5000a6745K154n217N852J8650K428j0460k374P257K252O272j6073p521l856p626
4986b5007R694J9905p97k640O597l14j588m521j6360k010J352l526L674l537r009
4971b8087m349M039m353O629K0334M969O810J176L588k736q88o40p801m823o849
4956a2981K882r64m435P526Q580j7400j382M009n076j3438P961R402Q510j894
4942h700n45Q028n049j2596j0484Q359J4062N31L004P402k257O600r467o78J1424
$$ plain form
5042 19219 476 -12761 -22819 -24668 -15098 8561 17710 14299 15353 20998 23400 10879 5814
5029 5814 13456 1902 -20732 -26033 -15777 2573 4329 -1664 -4875 -9990 -13152 -13348 1781 2789
5015 2789 1608 -49 11303 25513 12805 4057 3544 6057 5334 12604 10760 3699 -6205 -11503 -16745
5000 -16745 -14591 -19808 -13956 4694 7122 -3338 -5712 1545 3797 10069 -6004 -13525 -17381 -25007
4986 -25007 -15313 4592 3795 1155 7752 7438 5850 1329 -15031 -17041 -15689 -19215 -15541 -19078 -28087
4971 -28087 -32436 -28397 -32750 -26121 -5787 -818 5992 7168 10756 8020 7132 6492 -1309 -6132 -12981
4956 -12981 -10099 -11063 -15498 -7972 608 -16792 -18174 -14165 -19241 -32679 -24718 -15316 -6806 -8700
4942 -8700 -9245 -1217 -6266 -18862 -29346 -20987 -6925 -6394 -3390 4012 1755 8355 -1112 -1790 9634
4927I634L736J431k724j3768p564M772J1744J3207j2847L103J1762q709j9411
4914e634q484J171m190L022K1607K742r15q292Q628N630M314N55j1008r704l793
4899d351L659K361n626j0251k195M787p290J561K2862P11k349j0035m511O161
4885d506o870r555j667J5225N488k470q64r28J6262J3961K244L509o892l318p398
4870A2221j895Q969o928j0744P839L386l054j5428N300M321o536L683m726r321
4856a2913m879K1593K731p159L32j0141n631L576N706p145r377j0911J2361J2927
4842h930J5865m725J014k279J035j75N397N47N421q285j9320k540l97p985j215
4827b6572K404J8379m983j146R060J431j5771L375Q471m280l152m851j2072K1186
$$ plain form
4927 9634 13370 14801 12077 -1691 -9255 -4483 7261 20468 7621 10724 22486 13777 -5634
4914 -5634 -14118 -12947 -17137 -14115 7492 10234 9319 1027 9655 15285 19599 20154 9146 -558 -4351
4899 -4351 -692 1669 -3957 -14208 -16403 -11616 -18906 -17345 5517 6228 3879 -6156 -10667 -4506
4885 -4506 -11376 -20931 -22598 -7373 -1885 -4355 -5219 -6147 10115 24076 26320 29829 22937 19619 12221
4870 12221 10326 19295 12367 1623 9462 12848 9794 -5634 -334 3987 -2549 1134 -3592 -12913
4856 -12913 -17792 3801 6532 -627 -295 -10436 -16067 -12491 -6785 -13930 -23307 -34218 -21857 -8930
4842 -8930 6935 2210 3224 945 1980 1805 7202 7749 13170 4885 -14435 -16975 -17372 -25357 -26572
4827 -26572 -24168 -5789 -10772 -11918 -2858 -1427 -17198 -13823 -5352 -9632 -12784 -17635 -29707 -8521
4813h521J3109K297m010n867j057J2563O187m26m643m8J5510j921q07r676k5365
4798a2675l170J5990O065m618l298j9196Q579k624J1426J4907j5986p36m64N504
4784b96p236j6168M344N549J521p53M256K282j3852M102O920L379K56N087J3523
4769A2914r497r600P080j647j8936q3O45J376l660N516J2235M744j0699O67J9073
4754A0128j447K732K964q204m994Q83M934q994Q68J907m798J0016q441j0957j0075
4739b3478Q986q165j179M607l451M247r64N493P449N729L586o770p2q699N728
4724f953Q139M118m114j916m860p121N360O76M632R700J4652j2725j3353n155
4710h920M835r531L402N847q244K786j144P673N705L478k969K919q311j8339N734
$$ plain form
4813 -8521 4588 6885 2875 -2992 -4049 8514 14701 14275 9632 9584 25094 23173 22366 12690 -12675
4798 -12675 -15845 145 6210 1592 -1706 -20902 -12323 -14947 -3521 11386 -4600 -5336 -5800 -296
4784 -296 -7532 -23700 -19356 -13807 -12286 -13039 -8783 -6501 -20353 -16251 -9331 -5952 -5696 -609 12914
4769 12914 3417 -6183 897 -750 -19686 -19769 -19124 -17748 -21408 -15892 -3657 1087 -9612 -8945 10128
4754 10128 8681 11413 14377 6173 1179 2062 6996 -1998 -1130 777 -4021 5995 -2446 -13403 -23478
4739 -23478 -14492 -22657 -23836 -19229 -22680 -18433 -19397 -13904 -6455 -726 2860 -3910 -3982 -12681 -6953
4724 -6953 1186 5304 1190 -726 -5586 -12707 -7347 -6671 -2039 7661 22313 9588 -3765 -8920
4710 -8920 -4085 -13616 -10214 -4367 -12611 -9825 -10969 -3296 2409 5887 2918 5837 -2474 -20813 -15079
4695a5079L333J183J2543O380r966o515Q387J490J222p92J870n439n899L765m27
4680c944p525M950R603m742r744J0278l227q257k184K701J433j3143n429J476
4666b7754K4923O559k370K003n751J0458J3297o622k017J0519K135j0195j4484
4653G01J0288k006L636P061O970M99j1910r770j1785Q725M550Q051J0936K535
4639B8481r59k1572o653l809m467K765J3808j943j8866R00J2602J2050Q835o395
4625A4777j0403o890p665J1329O241k637N548m817M660J4986q151j0365P602m423
4611I792J633Q008M409j894r377k114Q445r348N400K357j5452j1002n262M704
4597i701l530N095n591K501J0790K989j349r096L974p256J601O962j086O287j1045
$$ plain form
4695 -15079 -11746 -10563 1980 8360 -1606 -8121 266 1756 2978 2186 4056 -1383 -7282 -3517 -3944
4680 -3944 -11469 -6519 3084 -1658 -11402 -1124 -4351 -12608 -14792 -12091 -10658 -23801 -29230 -27754
4666 -27754 -2831 3728 1358 3361 -2390 8068 21365 14743 12726 23245 25380 15185 701
4653 701 10989 8983 12619 19680 26650 27149 15239 5469 -6316 2409 6959 15010 25946 28481
4639 28481 27522 5950 -703 -4512 -8979 -6214 7594 5651 -13215 -12315 287 12337 21172 14777
4625 14777 4374 -2516 -10181 1148 7389 4752 10300 5483 10143 25129 16978 6613 14215 9792
4611 9792 11425 19433 23842 21948 12571 10457 18902 9554 14954 17311 1859 -9143 -14405 -9701
4597 -9701 -13231 -8136 -13727 -11226 -436 2553 1204 -7892 -3918 -11174 -9573 -2611 -3697 2590 -8455
4582h455j115J1136o9q215K382J3905l880L829l831R135J7153N287M207o357p186
4567B7926j1980N888q059l950j2970r192J1085J560l390j666j80M705K74J9645
4553A9696J2390J2414L307P264J28n008j4609j0995o436r125l106j588j4388K459
4539g597R933P541J553k612j3749j1072O847p365j455R549Q678N619O695q122
4525D443k650K11l922L109n097P42o70n608Q621q953j1914P061J687n150p4K211
4509a5953n924M929J1385J1732N738l940J261M932o956K840n770p841R971k139
4495D265j4883k027J0624R410n821q866M758P032L870j2745j4437l431J1054O884
4481d313N506R330L682L27p424o505j1266j5867m48R378J7741Q667r256r423j0745
$$ plain form
4582 -8455 -9570 1566 1497 -6718 -4336 9569 5689 9518 5687 14822 31975 37262 41469 35112 27926
4567 27926 15946 21834 13775 9825 -3145 -12337 -1252 308 -3082 -4748 -4928 -223 51 19696
4553 19696 32086 44500 47807 55071 55199 50191 35582 24587 18151 9026 5920 4332 -10056 -7597
4539 -7597 2336 9877 11430 8818 -4931 -16003 -9156 -16521 -17976 -8427 251 5870 12565 4443
4525 4443 1793 2004 -1918 1191 -3906 -3164 -3834 -9442 -821 -9774 -21688 -14627 -12940 -18090 -18164 -15953
4509 -15953 -21877 -16948 -5563 6169 11907 7967 9228 14160 7204 10044 4274 -3567 6404 4265
4495 4265 -10618 -12645 -2021 7389 1568 -7298 -2540 4492 8362 -4383 -18820 -22251 -11197 -4313
4481 -4313 1193 10523 14205 14532 7108 603 -10663 -26530 -26978 -17600 141 8808 -448 -9871 -20616
4466b0616l37J0194N594J210l338l508K376J969K306k021N924j201r25Q288R898
4451A5813M300j1905P51k268r089o901l686K850M420N31j251j676L256j5701o315
4436b6871L812N589J1637J2706O04J098K381j0391Q858Q416O424o203q833p061
4422B166p382j0993q809m317l038R979k86q373o77Q111M070J1486P855J0185N980
4407A5957l377O020P58j7604r225r498J0062P634j477m393R95n459p759n522N942
4392a6946M365J8304O808p973j6319K080J0286K503m517L533j277n031L449J648
4378I13R601J820j0718R946o150j2544r802M283N718M953p599n706l160J721J1440
4363e284L511R707K38K604n0j8149J584q54p015R020J0765M100J2129o216o704
$$ plain form
4466 -20616 -20953 -10759 -5165 -3955 -7293 -10801 -8425 -6456 -4150 -6171 -247 -1448 -2373 5915 15813
4451 15813 20113 8208 8959 6691 -2398 -9299 -12985 -10135 -5715 -5184 -6435 -8111 -4855 -20556 -26871
4436 -26871 -23059 -17470 -5833 6873 7477 8575 10956 565 9423 17839 24263 18060 9227 2166
4422 2166 -5216 -16209 -25018 -29335 -32373 -22394 -22680 -31053 -31730 -23619 -19549 -8063 -208 9977 15957
4407 15957 12580 18600 19358 1754 -7471 -16969 -6907 727 -750 -5143 -4148 -9607 -17366 -22888 -16946
4392 -16946 -12581 5723 12531 4558 -11761 -9681 605 3108 -1409 2124 847 -4184 -735 913
4378 913 10514 12334 1616 11562 5412 -7132 -16934 -12651 -6933 -1980 -9579 -15285 -18445 -16724 -5284
4363 -5284 -1773 7934 8172 10776 10726 -7423 -5839 -6693 -13708 -4688 6077 10177 22306 16090 9386
4348I386n202j40N166p787k836J2j1294j2408Q688n646j241Q634J3552l643M026
4333g33o324p423j421j889N089k700P517M195K186L419o456L435n25K154r49l644
4317d069J156N494P265L023o856p095m906Q196J433N07m054M985O882m787n826
4302A348q054J720J4074J2413P039m721O941j5854j3664r390o777O934P234J1243
4288A0486K470o775L184l405l770R04O86p477j1598k345K819Q012M51K878K592
4273h88M686n293p009j071P205L520Q431P823p19j0215M814M874K965j3773k931
4258B419m099k041M019k642j8990r151N335K0006J1374n350k964J2454j719j6153
4244g502K142j5722n146J2595Q900Q188j0175P470p387J223o05R143L896O963
$$ plain form
4348 9386 4184 4044 9210 1423 -1413 -1401 -12695 -25103 -16415 -22061 -23302 -14668 -1116 -4759 -733
4333 -733 -7057 -14480 -15901 -17790 -12701 -15401 -7884 -3689 -1503 1916 -4540 -1105 -1630 524 -425 -4069
4317 -4069 -2913 2581 9846 12869 6013 -1082 -5988 2208 3641 4148 94 5079 11961 7174 1348
4302 1348 -6706 -4986 9088 21501 28540 23819 30760 14906 1242 -8148 -14925 -7991 -757 10486
4288 10486 12956 6181 9365 5960 2190 3094 3780 -3697 -15295 -17640 -14821 -6809 -6358 -3480 -888
4273 -888 3798 -1495 -8504 -9575 -2370 1150 9581 17404 16685 6470 11284 16158 19123 5350 2419
4258 2419 -1680 -3721 298 -2344 -21334 -30485 -25150 -5144 6230 880 -2084 10370 8651 -7502
4244 -7502 -5360 -21082 -26228 -13633 -4733 3455 -6720 750 -6637 -5414 -6019 3124 7020 13983
4230A3983l459n120N777K142J660N521n169j6025O720Q845q112J1896J111j4788
4216D982Q176J667J4380o799j2648L968j889q347%p766J939n743m263K86l064
4201a5121n95P977l258p17K108J3718n72r813j168L015J7718n3m9K925k07R581
4185B5489j605m845J261j005p026p722j1072j5786K300R799M938P196k714q814
4171i606O557J1820L779l738j7274Q60k923j0226J002L332J6669J3122l686Q663
4157A8351M324K884k054r418j596j150j1004O143Q613j367J654J717j1113l463
4143B521M805n260j783j372r21J5352K499j1716q936L457k351k936L652M240J2819
4128A4070q43M059P216o595q489k006o706N125N512K262p183p887O84J907j235
$$ plain form
4230 13983 10524 5404 11181 13323 14983 20504 15335 -690 6030 14875 6763 18659 19770 4982
4216 4982 13158 14825 29205 22406 9758 13726 11837 3490 3490 -4276 -2337 -8080 -12343 -12057 -15121
4201 -15121 -15716 -7739 -10997 -11714 -9606 4112 3540 -6273 -7441 -4426 13292 13239 13190 16115 15908 25489
4185 25489 23884 19039 20300 19295 12269 4547 -6525 -22311 -20011 -10212 -5274 1922 -792 -9606
4171 -9606 -3049 8771 12550 8812 -8462 -7602 -10525 -20751 -19749 -16417 252 13374 9688 18351
4157 18351 22675 25559 23505 14087 12491 11341 337 6480 15093 13726 15380 17097 5984 2521
4143 2521 7326 2066 283 -1089 -2010 13342 15841 4125 -4811 -1354 -3705 -6641 -2989 1251 14070
4128 14070 13227 17286 24502 17907 9418 7412 706 5831 11343 13605 6422 -1465 -781 1126 -109
4113a09o604j246Q603J9153q0o537L68p827p562r977L883J659K867J0069l800
4098B860j775M199K708j2867n568o243P108K3198J8584j4116j9058M6q66j0488
4084a2278M858k090J309n322J999J544K382J684j1053l399M172K381K678l333
4070a4468P356J2990J3494k251j2784j4548j710J6677k070J1543J1972r69p909
4057A7323r140j5987O795J3630J0533k81j0230o09J485M312p158j1796m966l708
4043i797L979K101P348O379K968j1369p275o565p461r43k065O726J1880J4741
4029A0647P830n830k423J1982O445j7909j5054j234M392l60J3290Q716r207j4297
4015c012j9772M261K136N118J7268K0179P756j2046j3113J746q117j6816q633
$$ plain form
4113 -109 -6713 -7959 644 19797 19717 13180 13548 5721 -1841 -11818 -7935 -6276 -3409 6660 2860
4098 2860 1085 5284 7992 -4875 -10443 -16686 -9578 13620 32204 18088 -970 -924 -1790 -12278
4084 -12278 -7420 -9510 -8201 -13523 -11524 -9980 -7598 -5914 -16967 -20366 -16194 -13813 -11135 -14468
4070 -14468 -7112 5878 19372 17121 4337 -10211 -11921 4756 2686 14229 26201 25232 17323
4057 17323 8183 -7804 -1009 12621 23154 22873 12643 12034 13519 17831 10673 -1123 -6089 -9797
4043 -9797 -5818 -3717 3631 10010 12978 1609 -5666 -12231 -19692 -20635 -22700 -15974 -4094 10647
4029 10647 18477 12647 10224 22206 28651 10742 -4312 -5546 -1154 -1514 11776 20492 11285 -3012
4015 -3012 -22784 -18523 -16387 -11269 5999 26178 33934 21888 8775 10521 2404 -14412 -23045
4002b3045J961J4213k018l133q630M503Q007l942J8268O234o952L102j4712n134
3988a1278N127R194n032q626q180N345K775N186J097J1689J2628k00j2124q864
3974a263L960j242j5629j5721m974k752L509J6117N595L467K512j54R504J057
3960C986n388j851J0666J8086n974q940J3575n835j0612L481O438r97r551o707
3946C77p212M08k209o928O448K732P807J3999J1268j5466j3461q511k056j2972
3932b5776J607Q657J6490N862K459j2683j0104K569k1197q28R134J5828J5177
3919G195M731k072K32m616q309l487k899K291J7450l755j6912p794Q411L361P811
3904A638j4003k204J362L467J5587J037r468j5071j3071K807O968J1773K0461
$$ plain form
4002 -23045 -21084 -6871 -8889 -12022 -20652 -16149 -8142 -12084 6184 12418 5466 8568 -6144 -11278
3988 -11278 -6151 3043 -1989 -10615 -18795 -13450 -10675 -5489 -4392 7297 19925 19725 7601 -1263
3974 -1263 2697 1455 -14174 -29895 -34869 -37621 -34112 -17995 -12400 -8933 -6421 -6575 2929 3986
3960 3986 -1402 -3253 7413 25499 19525 10585 24160 18325 7713 11194 17632 16635 7084 377
3946 377 -6835 -6427 -8636 -15564 -9116 -6384 1423 15422 26690 11224 -2237 -10748 -12804 -25776
3932 -25776 -24169 -15512 978 6840 9299 -3384 -13488 -10919 -32116 -32944 -23810 -7982 7195
3919 7195 11926 9854 10086 5470 -2839 -6326 -9225 -6934 10516 6761 -10151 -17945 -9534 -6173 1638
3904 1638 -12365 -14569 -13207 -9740 5847 6884 -2584 -17655 -30726 -27919 -20951 -9178 11283
3891A1283J5421N225J319M462Q140j289j0512r389o104o760j5432j5557J229m127
3877b2091k699Q049Q667K28k013k433l680O809J3700L123o384j4277m144R100
3863h045L743K5381r86k7432j3440N002r657J6263K4275J0725m401j3403k360
3850E665j3708k682J0779R296K0415O405K175l972p918j9009j1367k103J3518
3837G494M509P79Q192l692r876m831L948n64O663o19j6100l13j362K475k206L547
3821a956j909J0315N630J779k949j7690q844N304J8806n730j5135Q861J5408o673
3807E217r264j4775J0289J309K441p626L299J4507J4147M252L354p573j0086K49
3793I740M652j544p083K170M516l839K364l096j1221k4J1628j2453j0579L562
$$ plain form
3891 11283 26704 31929 33248 37710 45850 44561 34049 24660 18556 11796 -3636 -19193 -17964 -22091
3877 -22091 -24790 -16741 -8074 -7846 -9859 -12292 -15972 -9163 4537 7660 1276 -13001 -17145 -8045
3863 -8045 -4302 21079 20093 -7339 -20779 -15777 -25434 -9171 15104 25829 21428 8025 5665
3850 5665 -8043 -10725 54 9350 29765 36170 38345 34373 26455 7446 -3921 -6024 7494
3837 7494 12003 12782 20974 17282 7406 2575 6523 5959 12622 12003 -4097 -4410 -5772 -3297 -5503 -1956
3821 -1956 -3865 6450 12080 13859 10910 -6780 -15624 -10320 8486 2756 -12379 -3518 11890 5217
3807 5217 -4047 -18822 -8533 -7224 -4783 -12409 -9110 5397 19544 23796 27150 19577 9491 9740
3793 9740 14392 12848 5765 7935 12451 8612 10976 7880 -3341 -3365 8263 -4190 -14769 -11207
3779a1207L246M12j462R354R432q325K197r709m507O884J0517N463J7129M870
3765C4294j3711j2536j5740j158J2769M007Q742o481q099R17j0875j673k315m81
3751a2340N868J004j890j336n578p018r00O244Q224q464j0314Q514l708J151R701
3736a0842k002p152p922J0905P199J1680K948Q789p794j1509j129L595J17k32
3722c349K065m088J355K389p206P095J1434l619m109n110k800M848J0038J2835
3708B1778K423l660o363N40L987L369j537k601J0756o400j6526j5914r050M240
3694a4958J4082l707Q942J1619n980o043P384p132m227K23L819j650j0732j971
3680a0331P114n014K360K51L88L575J023Q651J3132K836k07L755l840K641o337
$$ plain form
3779 -11207 -7961 -7549 -9011 343 9775 1450 3647 -6062 -10569 -3685 6832 12295 29424 34294
3765 34294 20583 8047 -7693 -8851 3918 7925 16667 10186 2087 3004 -7871 -9544 -11859 -12340
3751 -12340 -6472 -5468 -7358 -8694 -14272 -21290 -22190 -15946 -7722 -16186 -26500 -17986 -21694 -20543 -10842
3736 -10842 -12844 -19996 -27918 -17013 -9814 1866 4814 13603 5809 -5700 -6829 -3234 -3117 -3349
3722 -3349 -1284 -5372 -4017 -1628 -8834 -1739 9695 6076 1967 -3143 -5943 -1095 8943 21778
3708 21778 24201 20541 14178 14718 18705 22074 20537 17936 28692 22292 5766 -10148 -19198 -14958
3694 -14958 -876 -4583 4359 15978 9998 3955 11339 4207 -20 203 4022 2372 -8360 -10331
3680 -10331 -3217 -8231 -5871 -5620 -5232 -1657 -634 8017 21149 23985 23778 27533 23693 26334 19997
3665A9997j2587p391k863J1740K86q178j520m307P341P668M604J0554j1658q359
3651E327q761n2Q602r343m234J0117O071R890N080J434p197j3035o784j768j0715
3636a5368P175o247N300J35O256R82j6465j276J7384J0328j808j1765J0438J0316
3622A5385k763J0436J1181o688L208J0724M87j7531j0342r865J386O67J083o872
3608D96l465k06K927J9672J8676k082N06n311m448j6464q475J0944J279o480p476
3593I3Q195J1286Q03o854P753j0926m501L327j2781j856n77R115q659j188M411
3578b359k450r854O463M704l777M739M127Q289J6930m016J404m878o870j257j642
3563I553r821n998q574J19J2426N425l999M614m723P757O786r821p368n231n934
$$ plain form
3665 19997 7410 19 -2844 8896 9182 1004 -516 -4823 2518 10186 14790 25344 13686 5327
3651 5327 -3434 -3486 5116 -4227 -8461 1656 7727 17617 22697 24131 16934 3899 -2885 -4653 -15368
3636 -15368 -8193 -14440 -9140 -9005 -2749 -1767 -18232 -19508 -2124 8204 6396 -5369 5069 15385
3622 15385 12622 23058 34239 27551 30759 41483 41970 24439 14097 4232 5618 6285 7368 496
3608 496 -2969 -3175 -248 19424 38100 36018 36524 31213 26765 10301 1826 12770 14049 7569 93
3593 93 8288 19574 20377 13523 21276 10350 5849 9176 -3605 -5461 -6038 3077 -5582 -6770 -2359
3578 -2359 -4809 -14663 -8200 -3496 -7273 -2534 1593 9882 26812 22796 24200 19322 12452 11195 9553
3563 9553 -268 -6266 -14840 -14721 -2295 3130 -869 3745 -978 6779 13565 3744 -3624 -8855 -14789
3548a4789K254L77P527L912j2517p960l554J3460K5713R575k847j4788r919n198
3534h754l854q433p092K936R688l060K945p090m464P717l971P225J3649n296j637
3519i491k746r103Q78J7266J2064M327N98j4913j636Q837J416q136n900Q689J1743
3504A3893J0822M41l973k083j4260j1242j6942j971J5325M571O973P839q14L62
3490H941r236j0598p662L368j359J6209O889j3387K876J0657j439J1657L740p791
3476A2865p62j0068j0769J7074o791j2320q16o781j235M74N777Q296M957l569
3462c668J734P316J4039q86o95J23J055O475q68j8376r098P567m335R823P211
3447A7417n365l186R18J042P115N570k533j327j1244j475J4603o322P37P036K791
$$ plain form
3548 -14789 -12535 -12158 -4631 -719 -13236 -21196 -24750 -11290 14423 23998 21151 6363 -3556 -8754
3534 -8754 -12608 -21041 -28133 -25197 -15509 -18569 -15624 -22714 -27178 -19461 -23432 -16207 -2558 -7854 -9491
3519 -9491 -12237 -21340 -20462 -3196 8868 13195 13793 -1120 -2756 6081 7497 -639 -6539 2150 13893
3504 13893 24715 25156 21183 19100 4840 -6402 -23344 -25315 -9990 -5419 1554 9393 8579 8941
3490 8941 -295 -10893 -18555 -15187 -16546 -337 6552 -6835 -3959 6698 5259 16916 20656 12865
3476 12865 12103 2035 -8734 8340 1549 -10771 -11587 -18368 -19603 -19129 -13352 -5056 -99 -3668
3462 -3668 -1934 5382 19421 18535 17840 17963 19018 25493 24625 6249 -2849 4718 383 10206 17417
3447 17417 12052 8866 9784 10826 17941 23511 20978 19651 8407 6932 21535 15213 15950 22986 25777
3432B5777o055J2663o064j0182l087n709N711j724J294r898M481k596l834o74
3418A03N392L930L133L488J1729O609j1742j6935J2091R587n38m785j0559j915
3404I588p381M639O182Q86q53K618k52j6754k279k977j8362q906J5626K0308J5029
3389A7112k828j3454J070J51k609r052m549q606O892j726k652K165J4117P064
3375C095R234k105q193j1784l956K087J0022M126l484m671J399k823n188m611
3361a6852J152P833Q594J1751j108n497n107K933o058M131M759p545M116q855
3347e753r87L579j5676J7664Q929J102l628k575k660q78J4784N297n435j831N236
3332A7168Q95p48P910l895j987N536m246j2811J555K058j7349N928M576p691m613
$$ plain form
3432 25777 19722 32385 26321 16139 13052 7343 13054 11330 12624 2726 7207 4611 777 103
3418 103 5495 9425 12558 16046 27775 34384 22642 5707 17798 27385 26847 22062 11503 9588
3404 9588 2207 6846 13028 13914 13061 15679 15427 -1327 -3606 -6583 -24945 -33851 -18225 2083 17112
3389 17112 14284 830 1900 2051 -558 -9610 -14159 -22765 -15873 -17599 -20251 -18086 -3969 3095
3375 3095 12329 10224 2031 -9753 -13709 -11622 -1600 2526 -958 -5629 -4230 -7053 -12241 -16852
3361 -16852 -15700 -7867 727 12478 11370 5873 766 3699 -2359 1772 6531 -1014 3102 -5753
3347 -5753 -6740 -3161 -18837 -1173 7756 8858 5230 2655 -5 -883 13901 19198 13763 11932 17168
3332 17168 18063 17315 25225 21330 19343 24879 20633 7822 9377 11435 -5914 14 4590 -3101 -7714
3317g714l996O674N900m38K521l023J9l3p557J0113j2643k66M094L328o443j9796
3301b9260L473Q787L876J5223L261M094L49J5063n455L259N383Q103p692j6177
3287A2287J1396J1182K80o830j7820j2562P228K012p447j932O77J2446m78r006
3273A433o82J373J584p966o302j1282j683K0689O152r2l900P812j0380p346J1410
3258H20p184n844l257k137J004O948N911k551L107Q580j4074m146K02j821K846
3243a1596J474L881L730M753P858k017k98N71o889j4706n352J2999L756r615j3314
3228b4765M128L45J196R050J1293J3656K452q185m907K692O05p142J132j2501
3214a0951l426J5432L676L599k027j424J521Q204J1154k828r228l664j3735O958
$$ plain form
3317 -7714 -11710 -5036 864 426 2947 -76 -57 -90 -7647 2466 -10177 -10443 -6349 -3021 -9464 -29260
3301 -29260 -25787 -17000 -13124 2099 5360 9454 9803 24866 19411 22670 28053 36156 28464 12287
3287 12287 23683 34865 35145 28315 10495 -2067 5161 7173 -274 -2206 -1529 10917 10439 1433
3273 1433 751 2124 3708 -4258 -10560 -21842 -23525 -2836 3316 3224 -676 7136 -3244 -10590 820
3258 820 -6364 -12208 -15465 -17602 -16598 -9650 -3739 -6290 -3183 5397 -8677 -12823 -12621 -14442 -11596
3243 -11596 -10122 -6241 -2511 2242 10100 8083 7785 8356 1467 -13239 -18591 -5592 -1836 -11451 -24765
3228 -24765 -20637 -20292 -19096 -10046 1247 14903 17355 9170 4263 6955 7560 418 1550 -10951
3214 -10951 -14377 1055 4731 8330 6303 4879 6400 14604 25758 22930 13702 10038 -3697 3261
3200C261O776N712M833m575J0168p175j0473j2177o698Q821Q785O710J555K808
3186A8331l924L830p261r25N684o321k398l860m18J7146j032K967M084l623p552
3171A4728l31k907j2297n680q77j305J1075P449j1389l119L984J3067L939O50
3157A6987O57n961Q215j7184p010O610p177L811P177L253l25J156L31J440k559
3142I421J955m446j402J180J0785J4181%m999j1083j1822l325M055k608m735M048
3127A205j356Q343J323N869r27r702o234n464j659J097J384l573P740K177J3737
3112A3960k983j3697j99M443k933M56Q48m499K119q413O43K770K182R901Q310
3097A2908O355n216o105J395l408M268k087j032r00J394m838M736l47j329q607
$$ plain form
3200 3261 10037 15749 20582 16007 26175 19000 8527 -3650 -10348 -1527 7258 13968 15523 18331
3186 18331 14407 18237 10976 10051 15735 9414 7016 3156 2738 19884 18852 21819 25903 22280 14728
3171 14728 14397 11490 -807 -6487 -7364 -8669 2406 9855 -1534 -4653 -669 12398 16337 16987
3157 16987 17644 11683 19898 2714 -4296 2314 -4863 -1052 6125 9378 9053 10209 10540 11980 9421
3142 9421 11376 6930 5528 6708 17493 31674 31674 26675 15592 3770 445 4500 1892 -2843 1205
3127 1205 -151 8192 9515 15384 14457 4755 -1479 -6943 -8602 -7505 -6121 -9694 -1954 223 13960
3112 13960 10977 -2720 -2919 1524 -1409 -953 -105 -4604 -2485 -10898 -10255 -7485 -5303 4598 12908
3097 12908 19263 14047 7942 9337 5929 10197 8110 7078 6178 7572 2734 7470 7123 5794 -2813
3082b813O676N563N663k453o928L221k937j2445j6387p715j1685R886J6427P490
3068h437m58J4412Q933l393L412n82p755m022j194m991j1444M689J5277N596m103
3053E940p134l780O087J1092l139q642q588q161k843l447Q818J1742L519q721
3039g257N127L000j174o594M297O065L323O412M64j703J804Q901p292j2646p522
3024d795O355K354L22q518j299R746M558r25J4899L448j1581n288j1041j6319
3010a8084M226J7349j955p955J1633P481L033k037j1143j5554o22N087K645n954
2996a1850k43j1013K559K153J6334J2967o766O862N057J394j906p292j3968q346
2982a4058j45K510N367j1974N281J7696N963N582j454q83r4k959K693k106J2186
$$ plain form
3082 -2813 3863 9426 15089 12636 5708 8929 5992 -6453 -22840 -30555 -42240 -32354 -15927 -8437
3068 -8437 -8895 5517 14450 11057 14469 13887 6132 2110 916 -4075 -15519 -10830 4447 10043 5940
3053 5940 -1194 -4974 1113 12205 9066 424 -8164 -16325 -19168 -22615 -13797 -2055 1464 -7257
3039 -7257 -2130 870 -304 -6898 -2601 3464 6787 13199 13663 11960 13764 22665 15373 2727 -4795
3024 -4795 1560 3914 4236 -4282 -5581 4165 8723 7798 22697 26145 14564 9276 -1765 -18084
3010 -18084 -13858 3491 1536 -6419 5214 12695 15728 13691 2548 -13006 -13628 -8541 -5896 -11850
2996 -11850 -12093 -23106 -20547 -18394 -2060 10907 4141 11003 16060 17454 15548 8256 -5712 -14058
2982 -14058 -14203 -11693 -6326 -18300 -13019 4677 10640 16222 14768 13885 13791 10832 13525 11419 23605
2967B3605K840j1867j3271p021J863P060J619o94r817K36J955Q770O165N149O177
2952B2769K33R23o075j7331j4733p288J516k93L932P812N067p662n768j403K935
2937a5366J0673J1452K759j033l25M005J4817j3025r771O046j0541m488J3928
2924I131N847j341j0027m046j728K77k32P192k052l729j2163p355J861J0021n929
2909a4273O746M968L36J5166Q097O998j883J875j2558j0835p626m622L842l30
2895d099m10N587j0025k934Q902K982J0406O883j1066p143n412O64Q605P811J841
2880A2592P763K039j2290j2107j679l184r63J2849q35n308O608j6411M38N350
2866e138N526j594J3360k115p613m270j4640r050P745k458q001J0680J0002O105
$$ plain form
2967 23605 26445 14578 1307 -5714 -3851 3209 4828 4134 -5683 -5447 -3492 5278 11443 16592 22769
2952 22769 23002 23925 17850 519 -14214 -21502 -19986 -20279 -16347 -8535 -3468 -11130 -16898 -18301 -15366
2937 -15366 -4693 6759 9518 8485 8160 12165 26982 13957 4186 10232 -309 -4797 9131
2924 9131 14978 13637 3610 -436 -2164 -1887 -2119 5073 3021 -708 -12871 -20226 -18365 -8344 -14273
2909 -14273 -7527 -2559 -2223 12943 21040 28038 26155 28030 15472 4637 -2989 -7611 -3769 -4099
2895 -4099 -4509 1078 -8947 -11881 -2979 3 10409 17292 6226 -917 -6329 -5665 2940 10751 12592
2880 12592 20355 22394 10104 -2003 -3682 -6866 -7829 5020 4185 -1123 5485 -10926 -10488 -5138
2866 -5138 388 -1206 12154 10039 2426 -1844 -16484 -25534 -17789 -20247 -28248 -17568 -7566 -1461
2852a461p019m309l755j620J0170J0156O83M772L092j5746K986J6876j201J655
2838A5279J992P35k014j3959j7418J0572J4335L164P46K721r29K54K984l316n62
2823A4584m322l558K734j571R28p368J0901J8916k099j5328k2042K483L418R025
2809F701J5048J367j3631j3938J0065R306n89n207p494k571n748O611k240o431
2795h751J1980j47j0030J3290O981k0288m803J4430N516l73m188j5395k966J0284
2781d460J6664J1325n449l006M687j3595L367j881j0119j248K0466J1675k767
2768B5659l692j1738j2629k393R036N968M175l166p301p44N765q618q512k565
2754a0755n10J6407J4140k903Q38L917l731r406K152j458j4577o038M66o266m753
$$ plain form
2852 -1461 -8480 -12789 -16544 -18164 -7994 2162 2845 7617 10709 -5037 -2051 14825 13624 15279
2838 15279 17271 18006 15992 2033 -15385 -4813 9522 12686 13432 16153 15224 15478 18462 15146 14584
2823 14584 10262 6704 9438 7867 8795 1427 12328 31244 29145 13817 -8225 -5742 -2324 6701
2809 6701 21749 23116 9485 -4453 5612 14918 14329 9122 1628 -943 -6691 -80 -2320 -8751
2795 -8751 3229 3082 -6948 6342 13323 -6965 -11768 2662 8178 7805 3617 -11778 -14744 -4460
2781 -4460 12204 23529 18080 15074 19761 6166 9533 7652 -2467 -3715 16751 28426 25659
2768 25659 21967 10229 -2400 -4793 4243 10211 14386 11220 3919 3175 8940 322 -8190 -10755
2754 -10755 -11265 5142 19282 16379 17217 21134 17403 7997 10149 8691 -5886 -11924 -11458 -17724 -22477
2739b2477m18k437Q420J9136j463j0069j6566N097J3488J0430J3536o647r834
2726A96j7911N754J5907Q388j1J1253J14j5051m421m643r146K861K947k872Q181
2711A546J462N179l299N209Q024q821q199j912m147l989J23N098J5452m452j158
2696F116R881K63j471j1075J0550R422O71j3036l230N744j0875j3813j447K725
2682i575J5012R094P788k458r615p746m934K54l920O294L201m372j154Q896R291
2667A6056l489k259j185J2019q191q73J3124J653M385k945j0352o796L494J540
2653A6181p53k034N000k491l50L078j0880l855R100O373j2531k819N701K2171
2639C1891k101j618k723J881J356j7610j6778k192O781R568n538k936o072m657
$$ plain form
2739 -22477 -22895 -25332 -16912 2224 761 -9308 -25874 -20777 -7289 3141 16677 10030 196
2726 196 -17715 -11961 3946 12334 12323 23576 23690 8639 4218 -425 -9571 -6710 -3763 -6635 1546
2711 1546 3008 8187 4888 10097 18121 9300 1101 -811 -4958 -8947 -8824 -3726 11726 7274 6116
2696 6116 15997 16260 14789 3714 14264 23686 24357 11321 8091 13835 2960 -10853 -12300 -9575
2682 -9575 5437 14531 22319 19861 10246 2500 -2434 -2180 -6100 194 3395 -977 -2131 6765 16056
2667 16056 12567 10308 9123 21142 12951 12078 25202 26855 31240 28295 17943 11147 14641 16181
2653 16181 15428 13394 18394 15903 15553 18631 7751 3896 12996 19369 6838 4019 9720 31891
2639 31891 29790 28172 25449 27330 28686 11076 -5702 -7894 -1113 8455 2917 -19 -6091 -10748
2625a0748P030M356n433Q065N918O656Q720J935k694J32J4027j1283j0292J157
2611A7546n026R823Q228j0495K084j2851r978K3749R642o495J2278L457j0017
2598C1945p905o018J603P271j1326m912K960q86q219q50r955J0111J048l447j2470
2583a1050N37J2736O490J0274r687p636r315j751J038m372J155q19L554J0393
2569A547Q102j595r641m072M578N150N291o008m461J4861R460n674l354r929m834
2554e79m210N387M615J2661j2513j2872J671r637j3163J0153Q713M754J1744K725
2540I449j517j181j3727P745R452L62o390l032r709n865L730o330j313n563K699
2525b1190J2810J8164N33j1747j2578m112J2953n168j2510l809R560K233R653
$$ plain form
2625 -10748 -3718 638 -4795 3270 9188 15844 24564 26499 23805 23937 37964 26681 16389 17546
2611 17546 12520 22343 30571 20076 22160 9309 -669 23080 32722 26227 38505 41962 31945
2598 31945 24040 18022 19625 26896 15570 10658 13618 12732 4513 3663 -6292 3819 4867 1420 -11050
2583 -11050 -10513 2223 8713 18987 9300 1664 -7651 -9402 -8364 -12736 -11581 -12400 -8846 1547
2569 1547 9649 8054 -1587 -5659 -1081 4069 9360 3352 -1109 13752 23212 17538 14184 4255 -579
2554 -579 -4789 598 5213 17874 5361 -7511 -5840 -15477 -28640 -18487 -9774 -5020 6724 9449
2540 9449 7932 6751 -6976 769 10221 10583 4193 1161 -8548 -14413 -10683 -17013 -18326 -23889 -21190
2525 -21190 -8380 9784 10317 -1430 -14008 -18120 -5167 -10335 -22845 -26654 -17094 -14861 -5208
2512e208j295l289j684M771J3270J743m736j30j1594j2643L304P346N861P971
2498C687q673R55j017r227j2989R054J0667k952J1329J0593j3019o154J0734O66
2484C654l583Q293L744J531j2080j0520O868R305l679k674j3102q666p903J692
2470b7120J0321J6274P880R461R922n567j5482l161p334K264j141L994j270m780
2456e739N843k822j62j388k424N449n317J0845K238k423r496j612k974O9m499
2441a4412r589j0054M480J1206J9310N4J3011K882j5079K241Q771j0030L142Q741
2427A4674l359R33J710j1291n565j404n493J41J722J1141L545l116J517Q93p521
2412a473N810M350o115o593q300j0372Q344J7061K940l02j0057M196j2885J870
$$ plain form
2512 -5208 -6503 -9792 -11476 -6705 6565 8308 3572 3442 -8152 -20795 -17491 -10145 -4284 3687
2498 3687 -4986 -4031 -5048 -14275 -27264 -18210 -7543 -10495 834 11427 -1592 -7746 2988 3654
2484 3654 71 8364 12108 13639 1559 -8961 -2093 7212 3533 859 -12243 -20909 -28812 -27120
2470 -27120 -16799 -525 7355 16816 26738 21171 5689 2528 -4806 -2542 -3683 311 -959 -5739
2456 -5739 104 -2718 -2880 -4268 -6692 -1243 -6560 4285 6523 4100 -5396 -7008 -9982 -9913 -14412
2441 -14412 -24001 -34055 -29575 -18369 941 995 14006 16888 1809 4050 12821 2791 5933 14674
2427 14674 11315 12248 13958 2667 -2898 -4302 -9795 -9654 -7932 3209 6754 3638 5155 6048 -1473
2412 -1473 4337 8687 2572 -4021 -12321 -22693 -14349 2712 5652 5350 -4707 -511 -13396 -11526
2398a1526O713J4575J0270j307M909K083q348j4701L35j458m327J3966N924j1689
2384E419N062N343m364m019O027l450K054P891n861N150m03n192n278p139J004
2369B244Q524R620J263o952j0664L301J3244j0409r900J176m45j3434J3456P783
2355H807j2948o128N446J3075J4256j4192j2924M108R509J8078q372p019m817
2342F879L387p300k547n181N14L597p138M589Q251Q07K404O197l230L355k126
2327A2458K505q506j825k27m194j0995l751M086P94k564K880R808o422N108k691
2312c536k937J1116m867p638l603j1153O985J6468J2546k743O48j2825o897K759
2298e677K0033J3677q222p116N21n602l691j3933J1303J5058p598o90J3061L04
$$ plain form
2398 -11526 -4813 9762 20032 18725 23634 25717 17369 2668 3003 1545 -2782 11184 17108 5419
2384 5419 10481 15824 11460 7441 13468 10018 12072 19963 14102 19252 18849 13657 8379 1240 2244
2369 2244 10768 20388 21651 14699 4035 7336 20580 10171 271 1447 1002 -12432 1024 8807
2355 8807 -4141 -10269 -4823 8252 22508 8316 -4608 -500 9009 27087 18715 11696 6879
2342 6879 10266 2966 419 -4762 -4248 -651 -7789 -3200 5051 5858 8262 14459 11229 14584 12458
2327 12458 14963 6457 4632 4405 211 -10784 -14535 -10449 -9655 -12219 -9339 469 -5953 -845 -3536
2312 -3536 -6473 4643 -224 -7862 -11465 -22618 -15633 835 13381 10638 11286 -1539 -8436 -5677
2298 -5677 14356 28033 19811 12695 13216 7614 3923 -10010 1293 16351 8753 8063 21124 21428
2284B1428l933j6404j5210j476J4267R509k197p283p893J254J4505p643K300N248
2270F472p777r843L11J8883K168n602n704j9309l012K0956K123L093L697r14J1752
2255A7294N501p793j6078m131M510O756J801K51m385q322O333L088P292j2028
2241H9p724k047L329O977j1929j5521P747J8695J3489m866o603n70p121N121n008
2226e942m059j271O194j856r26l192j657Q384R556O91q820k554r573o44J1974
2211c695n24o086L022m894J3272l166r658O5J507l494M194K139j3123O000J4438
2196cJ5628j8390j507K284J367M261p937j1983L723O216N597N164q20k046N087
2181F641J167l497o780n97j171m782k51J707r331n447K484J4939M032p764r57
$$ plain form
2284 21428 17495 1091 -14119 -15595 -1328 8181 5984 -1299 -9192 -7938 6567 -1076 1224 6472
2270 6472 -1305 -11148 -10837 8046 10214 4612 -1092 -20401 -23413 -2457 -334 2759 6456 5542 17294
2255 17294 22795 15002 -1076 -5207 -697 6059 7860 8111 3726 -4596 1737 4825 12117 89
2241 89 -7635 -9682 -6353 624 -11305 -26826 -19079 -384 13105 8239 1636 1066 -6055 -934 -5942
2226 -5942 -10001 -11272 -5078 -6934 -7860 -11052 -12709 -4325 5231 5922 -2898 -5452 -15025 -15669 -3695
2211 -3695 -4219 -10305 -7283 -12177 1095 -2071 -11729 -11664 -10157 -13651 -9457 -7318 -20441 -14441 -3
2196 -3 15625 -2765 -4272 -1988 -621 3640 -4297 -16280 -12557 -6341 -744 4420 3600 1554 6641
2181 6641 7808 4311 -2469 -3066 -4237 -9019 -9270 -7563 -16894 -22341 -19857 -4918 -886 -8650 -9607
2166i607L821K487m131n962L927R422Q711q660j2224j1174J3250M289j0580o951
2152b3382L522J0182J6054J140p916j5402J3491K470J3015K991m086l040J308
2139A0347o036n315j3562N187M571k749J1636N962j6984p551J1002oM237K487
2125C226N210m773j4668p799R322J0583J638m576P639j0605n021k387o375J2558
2111f028L558n38J685R962o666j0024l919j2543J3960j627N486j4814n616J3941
2097a3183l771O406J2225O827r479o564n397R013n861p103J3975J7193j944p556
2083D781P621j1179j7402J605Q539j69j549R45N039M17M351l602k107P702R57
2068E949r58J593q173q189o770K153L808k886O782K421j0551P819J1222l705J209
$$ plain form
2166 -9607 -5786 -3299 -7430 -13392 -9465 -43 8668 8 -12216 -23390 -10140 -5851 -16431 -23382
2152 -23382 -19860 -9678 6376 7516 -400 -15802 -2311 159 13174 16165 12079 9039 10347
2139 10347 4311 -1004 -14566 -9379 -4808 -7557 4079 10041 -6943 -14494 -3492 -3498 739 3226
2125 3226 8436 3663 -11005 -18804 -9482 1101 2739 -1837 5802 -4803 -9824 -12211 -18586 -6028
2111 -6028 -2470 -3008 -1323 8639 1973 -8051 -11970 -24513 -10553 -12180 -6694 -21508 -27124 -13183
2097 -13183 -16954 -10548 1677 8504 -975 -7539 -12936 -3923 -9784 -16887 -2912 14281 12337 4781
2083 4781 12402 1223 -16179 -14574 -6035 -6204 -7753 -6808 -1769 -1352 2999 -603 -2710 4992 5949
2068 5949 4991 6584 -1589 -9778 -16548 -14395 -10587 -13473 -6691 -4270 -14821 -7002 4220 515 1724
2053A724n669j088j6525q09P105J1659J303J4385L21l692j1592Q296l150R043
2039A1311P410q215l223O16q43M76N896L302K740r238j1666k607J2111n781J3070
2024A5359P054k430K775m867o651R636Q033j0330p220Q776o66k243j0706j401
2010E119J8676j3516m439l282J520k861K057k037r91o762j1683l405J004j182
1996b1782J1376l723M819k826M051M975J1431J72n984L325J4436K638j4429p119
1982A360p081p882j263N160R851K205Q008P821P117M849M977j3368q579K491j2899
1967B767j758p761Q640K1680K349o290o557j0138q104O903O111N730j014J4877
1953B7435J1422l276j4152j8297J556K656l681l309k830J6337J1952j2065j2550
$$ plain form
2053 1724 -3945 -5033 -21558 -22367 -15262 -3603 -2300 12085 12406 8714 -2878 5418 2268 11311
2039 11311 18721 10506 7283 7899 7056 7532 13428 16730 19470 10232 -1434 -4041 8070 2289 15359
2024 15359 22413 19983 22758 17891 11240 20876 28909 18579 11359 20135 19469 17226 6520 5119
2010 5119 23795 10279 5840 2558 4078 1217 3274 1237 246 -6516 -18199 -21604 -20600 -21782
1996 -21782 -10406 -14129 -9310 -12136 -8085 -3110 8321 8493 2509 5834 20270 22908 8479 1360
1982 1360 -5721 -13603 -14866 -9706 145 2350 10358 18179 25296 30145 35122 21754 13175 15666 2767
1967 2767 1009 -6752 1888 23568 25917 19627 13070 2932 -5172 1731 7842 13572 12558 27435
1953 27435 38857 35581 21429 3132 4688 7344 3663 354 -2476 13861 25813 13748 1198
1940A198p21J6319m590o112q77j4825q157L506L357N159l891J394L511K900O292
1925D463n331K761m926n380O881j228l962M629J7753J0785r293r708j5192L234
1911d514J0589M157p934p225K782J550J447R777J1251j1307j7129P201J1804l938
1897H511n636j6012L76J3362J311j832K860j0094p066P897J3174N368O379j1314
1883G284j5931n767J2124J4652r795j324L306l658P814o008P343m753m981j1508
1869a1202m645O490J0910N998J7923q315L151J1008o726m172r343o018P320R437
1855B1816q540o477n367R147J800p23J111J962R574j710o888l075r576n620R523
1840F957J0683o022j3425l255n494j199J0627Q721J410J3338n634k1250j1261
$$ plain form
1940 1198 477 16796 12206 6094 5217 -9608 -17765 -14259 -10902 -5743 -9634 -8240 -4729 -1829 4463
1925 4463 -868 1893 -3033 -8413 -1532 -2760 -6722 -2093 15660 26445 17152 7444 -7748 -4514
1911 -4514 6075 10232 2298 -4927 -2145 -595 852 10629 21880 10573 -6556 645 12449 8511
1897 8511 2875 -13137 -12761 601 1912 80 2940 -7154 -14220 -6323 6851 12219 18598 7284
1883 7284 -8647 -14414 -2290 12362 2567 1243 4549 891 8705 2697 10040 5287 306 -11202
1869 -11202 -15847 -9357 1553 7551 25474 17159 20310 31318 24592 20420 11077 5059 12379 21816
1855 21816 13276 6799 1432 10579 12379 11656 12767 14729 24303 22593 15705 12630 3054 -2566 6957
1840 6957 17640 11618 -1807 -5062 -10556 -11755 -1128 7593 9003 22341 16707 -4543 -15804
1827a5804J7836R472J136l381j0561P36R48m163J1661N26o854k044k225p43J0030
1812F570j092m129O478R208q232m319j1534O415R753P131J724J382M579k971j440
1797A9523j7796j0245q40N032l619k584O543L869j3791j1938j320J2550J0805
1784c811q357k799m248j806O856J3321J1758J57N183j230j2407Q535m737J860
1770H275J6639k639j6209P79m540M057n363p859j718m846m362O631P441L841n742
1755e615k598J9861l642k320N575j0743l40n064o934N589R909N491m181n822q761
1740i595j2279n786l401R737Q705J7855m20j145j442O323o571p627Q82K709k881
1725d936K960k440J3469q503m605P765N970N520R567L062l837q681j3980J12l226
$$ plain form
1827 -15804 2032 11504 12640 9259 -1302 -566 382 -3781 7880 8406 1552 -492 -2717 -3460 6570
1812 6570 5478 1349 7827 17035 8803 4484 -7050 -635 9118 16249 17973 19355 23934 20963 19523
1797 19523 1727 -8518 -9358 -4326 -7945 -10529 -3986 -117 -13908 -25846 -27166 -14616 -3811
1784 -3811 -12168 -14967 -19215 -21021 -14165 -844 10914 11071 16254 15024 2617 11152 6415 8275
1770 8275 24914 22275 6066 6845 2305 6362 999 -6860 -8578 -13424 -17786 -11155 -3714 127 -5615
1755 -5615 -8213 11648 8006 5686 11261 518 178 -4886 -11820 -6231 3678 9169 4988 -834 -9595
1740 -9595 -21874 -27660 -31061 -21324 -12619 5236 4816 3671 2229 8552 1981 -5646 -4764 -2055 -4936
1725 -4936 -1976 -4416 9053 550 -4055 3710 9680 15200 24767 27829 23992 15311 1331 1443 -1783
1710a783j504P902r145p73L8L959J1896N759j1928J0812O170j3151p046m273m363
1695g430K057q830r914k78J6272k776j329k571Q827L564j0567N410J603m60L606
1680b816J1120m401j4581L354J424Q8N37m714N603n03l592J842L048J7312O738
1665B0459q201p689J079j995j9803j5569P372J5840J5068K803l575m844R220O411
1651A6576l74N967l492r850k528P218M861J9095j0191j4038j6628K868J9664m503
1637A4645p062p583l461j618J2014m887L742L452r140p034p84j0413m83N535J4160
1622A083M785m710o262k942Q606L803n116n328j4203M415J3038J0298p188j0506
1608a0227k5073M96M717J2645J0895Q934r815r48R834j0362r579K191Q339J2162
$$ plain form
1710 -1783 -3287 4615 -4530 -5303 -5265 -1306 10590 16349 4421 15233 21403 8252 1206 -3067 -7430
1695 -7430 -5373 -14203 -24117 -24395 -8123 -10899 -12228 -14799 -5972 -2408 -12975 -7565 -5962 -6422 -2816
1680 -2816 8304 3903 -10678 -7324 -5900 -5812 -5275 -9989 -4386 -4889 -8481 -6639 -3591 13721 20459
1665 20459 12258 4569 5648 3653 -16150 -31719 -24347 -8507 6561 9364 5789 945 10165 16576
1651 16576 16202 22169 18677 8827 6299 13517 18378 37473 27282 13244 -3384 -516 19148 14645
1637 14645 7583 0 -3461 -5079 6935 2048 5790 9242 102 -6932 -7716 -18129 -18612 -13077 1083
1622 1083 5868 1158 -5104 -8046 560 4363 -753 -6081 -20284 -15869 -2831 7467 279 -10227
1608 -10227 -35300 -34804 -30087 -17442 -6547 2387 -7428 -8376 1458 -8904 -18483 -16292 -7953 4209
1594D209n898p442N560J472j271m998k052j212N515J6396j3652m472n648J1531
1580a962M287q830j3857J1710J1315p333o425P200L161P416l448L046L934n82
1566I632l471k641N424L998m670q832p83R312J4926p959m477q463p863J303J711
1551b853N785M627K188q187l367N950J1716N472j109o183p788l203L738l833L561
1536F514L034m882J934M235m684m473k656K533n318n380J3704J2737l827R928
1522B3399K400k183n749j3369K926L02j0312n048P050q76r801K3975p831k0366
1508a5483K608J0982m00N042q201j6416J696J2753J8605j3639o717O772P111J0084
1494A4797K130j3219j1877R120J0068m28m334l276q314j0692j0822L092J3381
$$ plain form
1594 4209 -1689 -9131 -3571 -2099 -3370 -8368 -10420 -11632 -6117 10279 -3373 -7845 -13493 -1962
1580 -1962 2325 -6505 -20362 -8652 2663 -4670 -11095 -3895 -734 6682 3234 6280 10214 9632
1566 9632 6161 3520 8944 12942 8272 -560 -1343 7969 22895 14936 10459 1996 -5867 -4564 -2853
1551 -2853 2932 7559 9747 1560 -1807 4143 15859 21331 20222 14039 6251 3048 6786 2953 6514
1536 6514 9548 4666 6600 10835 6151 1678 -978 1555 -3763 -9143 4561 17298 13471 23399
1522 23399 25799 23616 17867 4498 7424 7726 -2586 -7634 -584 -1460 -11261 12714 4883 -15483
1508 -15483 -12875 -1893 -2293 2749 -5452 -21868 -20172 -7419 11186 -2453 -9170 -2398 4713 14797
1494 14797 16927 3708 -8169 951 11019 10591 6257 2981 -5333 -16025 -26847 -23755 -10374
1481a0374L074k943K542J0166M927n282J1560P801j4126o20k303p644l274n173
1467a1669L713N183K170L672q765M782Q2J072J2124O64k068j344O573q710m887
1452B592n210q262P238j731n007l530J3178R606r67P746L845j4797m077M978q09
1437D793l081J549J0112m768l239p857p23N961n671j1026o925O090O064j1670
1423b0391R815J2386p265k49j757m803n898P640K720j895M04R053J3361R165k627
$$ plain form
1481 -10374 -7300 -10243 -7701 2465 7392 2110 13670 21471 7345 6725 4422 -3222 -6496 -11669
1467 -11669 -7956 -2773 -603 3069 -5696 -914 -832 240 12364 13028 10960 9616 16189 7479 2592
1452 2592 -2618 -10880 -3642 -5373 -10380 -13910 -732 8874 7907 15653 19498 4701 624 5602 4793
1437 4793 1712 3261 13373 8605 5366 -2491 -3214 2747 -2924 -13950 -20875 -14785 -8721 -20391
1423 -20391 -10576 1810 -5455 -5704 -7461 -12264 -18162 -10522 -7802 -9697 -9293 -240 13121 22286 19659
$$ [...]
##END NTUPLES=NMR SPECTRUM
##END=
