##TITLE=Analysis number 318805
Compound Code ac 11641
Project Code adrs
Chemist Name acros
##JCAMPDX= 6.0         $$ Bruker NMR JCAMP-DX V2.0
##DATA TYPE= NMR SPECTRUM
##DATA CLASS= NTUPLES
##ORIGIN= Bruker BioSpin GmbH
##OWNER= nmr
$$ XWIN-NMR		Version 3.5
$$ Tue Apr 18 14:26:05 2006 GMT Daylight Time (UT+1h)  MAYBRIDGE\nmr@NMR_250MHZ
##.OBSERVE FREQUENCY= 250.131544655141
##.OBSERVE NUCLEUS= ^1H
##.ACQUISITION MODE= SIMULTANEOUS (DQD)
##.ACQUISITION SCHEME= undefined
##.AVERAGES= 16
##.DIGITISER RES= 18
##SPECTROMETER/DATA SYSTEM= dpx250
##.PULSE SEQUENCE= zg30
##.SOLVENT NAME= CDCl3
##.SHIFT REFERENCE= (INTERNAL, CDCl3, 0, 16.522)
##AUDIT TRAIL= $$ (NUMBER, WHEN, WHO, WHERE, WHAT)
$$ ##TITLE= Audit trail, XWIN-NMR		Version 3.5
$$ ##JCAMPDX= 5.01
$$ ##ORIGIN= Bruker BioSpin GmbH
$$ ##OWNER= nmr
$$ C:\u/data/dgb/nmr/ADRS/2700/pdata/1/auditp.txt
$$ ##AUDIT TRAIL=  $$ (NUMBER, WHEN, WHO, WHERE, WHAT)
(   1,<2006-04-18 14:25:40.59 +100>,<MAYBRIDGE\nmr>,<NMR_250MHZ>,
      <created by zg, POWCHK disabled, PULCHK disabled
       configuration hash MD5:
       84 BC 41 DB A1 6E 1D 46 DA 25 12 A5 C1 ED C5 3A
       data hash MD5: 64K
       39 70 0E 12 F8 5F B2 94 76 9C BF 43 51 20 F6 1B>)
(   2,<2006-04-18 14:25:55.20 +100>,<MAYBRIDGE\nmr>,<NMR_250MHZ>,
      <Start of raw data processing
       ef LB = 0.3 FT_mod = 6 PKNL = 1 SI = 32K 
       data hash MD5: 32K
       F0 28 37 68 14 4D 90 AF 0B 99 20 9F C5 65 84 54>)
(   3,<2006-04-18 14:25:56.78 +100>,<MAYBRIDGE\nmr>,<NMR_250MHZ>,
      <apk 
       data hash MD5: 32K
       2B 9B D2 5D 0E 2A 48 34 C0 AA 21 E0 DB E3 A8 B1>)
(   4,<2006-04-18 14:25:57.61 +100>,<MAYBRIDGE\nmr>,<NMR_250MHZ>,
      <abs ABSG = 5 
       data hash MD5: 32K
       CE 7D 3C A1 0F D4 66 A1 DA EB CA 16 BF 56 91 F7>)
$$ ##END=
$$ 
$$ hash MD5
$$ 03 97 2C B3 5D D8 EC 8D 94 D7 1F A4 3C 78 B0 07
##$RELAX= 
##$RELAX= 
##$RELAX= 
##$RELAX= 
##$RELAX= 
##$RELAX= 
##$RELAX= 
$$ Bruker specific parameters
$$ --------------------------
##$DU= <C:\u>
##$EXPNO= 2700
##$NAME= <ADRS>
##$PROCNO= 1
##$TYPE= <nmr>
##$USER= <dgb>
##$AMP= (0..31)
100 100 100 100 100 100 100 100 100 100 100 100 100 100 100 100 100 100 
100 100 100 100 100 100 100 100 100 100 100 100 100 100 
##$AQSEQ= 0
##$AQ_mod= 3
##$AUNM= <au_zg>
##$AUTOPOS= <51 >
##$BF1= 250.13
##$BF2= 250.13
##$BF3= 250.13
##$BF4= 250.13
##$BF5= 500.13
##$BF6= 500.13
##$BF7= 500.13
##$BF8= 500.13
##$BYTORDA= 1
##$CFDGTYP= 0
##$CFRGTYP= 5
##$CHEMSTR= <none>
##$CNST= (0..31)
1 1 145 1 1 1 1 1 1 1 1 1 1 1 1 1 1 1 1 1 1 1 1 1 1 1 1 1 1 1 1 1 
##$CPDPRG= <>
##$CPDPRG1= <>
##$CPDPRG2= <>
##$CPDPRG3= <>
##$CPDPRG4= <mlev>
##$CPDPRG5= <mlev>
##$CPDPRG6= <mlev>
##$CPDPRG7= <mlev>
##$CPDPRG8= <mlev>
##$CPDPRGB= <>
##$CPDPRGT= <>
##$D= (0..31)
0 1 0 0 0 0 0 0 0 0.06 0 0 0 0 0 0 0.0002 0 0 0 0 0 0 0 0 0 0 0 0 0 0 
0 
##$DATE= 1145366738
##$DBL= (0..7)
120 120 120 120 120 120 120 120 
##$DBP= (0..7)
150 150 150 150 150 150 150 150 
##$DBP07= 0
##$DBPNAM0= <>
##$DBPNAM1= <>
##$DBPNAM2= <>
$$ [...]
##$SUBNAM7= <"">
##$SUBNAM8= <"">
##$SUBNAM9= <"">
##$SW= 20.6930455092707
##$SWIBOX= (0..15)
0 0 3 0 0 0 0 0 0 0 0 0 0 0 0 0 
##$SW_h= 5175.983436853
##$TD= 65536
##$TD0= 1
##$TE= 294.16
##$TE2= 300
##$TE3= 300
##$TEG= 300
##$TL= (0..7)
0 120 120 120 120 120 120 120 
##$TP= (0..7)
150 150 150 150 150 150 150 150 
##$TP07= 0
##$TPNAME0= <>
##$TPNAME1= <>
##$TPNAME2= <>
##$TPNAME3= <>
##$TPNAME4= <>
##$TPNAME5= <>
##$TPNAME6= <>
##$TPNAME7= <>
##$TPOAL= (0..7)
0.5 0.5 0.5 0.5 0.5 0.5 0.5 0.5 
##$TPOFFS= (0..7)
0 0 0 0 0 0 0 0 
##$TUNHIN= 0
##$TUNHOUT= 0
##$TUNXOUT= 0
##$USERA1= <user>
##$USERA2= <user>
##$USERA3= <user>
##$USERA4= <user>
##$USERA5= <user>
##$V9= 5
##$VALIST= <valist>
##$VCLIST= <CCCCCCCCCCCCCCC>
##$VD= 0
##$VDLIST= <DDDDDDDDDDDDDDD>
##$VPLIST= <PPPPPPPPPPPPPPP>
##$VTLIST= <TTTTTTTTTTTTTTT>
##$WBST= 1024
##$WBSW= 4
##$XGAIN= (0..3)
0 0 0 0 
##$XL= 0
##$YL= 0
##$YMAX_a= 276173
##$YMIN_a= -472966
##$ZGOPTNS= <>
##$ZL1= 120
##$ZL2= 120
##$ZL3= 120
##$ZL4= 120
##$ABSF1= 16.522
##$ABSF2= -4.171173
##$ABSG= 5
##$ABSL= 3
##$ALPHA= 0
##$AQORDER= 0
##$ASSFAC= 0
##$ASSFACI= 0
##$ASSFACX= 0
##$ASSWID= 0
##$AUNMP= <proc_1d>
##$AZFE= 0.1
##$AZFW= 0.1
##$BCFW= 0
##$BC_mod= 0
##$BYTORDP= 0
##$COROFFS= 0
##$CY= 12.5
##$DATMOD= 1
##$DC= 0
##$DFILT= <>
##$DTYPP= 0
##$F1P= 14.0000005364418
##$F2P= -0.99999901652339
##$FCOR= 0.5
##$FTSIZE= 32768
##$FT_mod= 6
##$GAMMA= 0
##$GB= 0
##$INTBC= 1
##$INTSCL= 1
##$ISEN= 128
##$LB= 0.3
##$LEV0= 0
##$LPBIN= 0
##$MAXI= 10000
##$MC2= 0
##$MEAN= 0
##$ME_mod= 0
##$MI= 0
##$NCOEF= 0
##$NC_proc= -3
##$NLEV= 6
##$NOISF1= 0
##$NOISF2= 0
##$NSP= 0
##$NTH_PI= 0
##$NZP= 0
##$OFFSET= 16.522
##$PC= 1
##$PHC0= 169.0075
##$PHC1= 5.759601
##$PH_mod= 1
##$PKNL= yes
##$PPARMOD= 0
##$PSCAL= 4
##$PSIGN= 0
##$REVERSE= no
##$SF= 250.13
##$SI= 32768
##$SIGF1= 0
##$SIGF2= 0
##$SINO= 400
##$SIOLD= 32768
##$SREGLST= <1H.CDCl3>
##$SSB= 0
##$STSI= 32768
##$STSR= 0
##$SW_p= 5175.98343685301
##$SYMM= 0
##$S_DEV= 0
##$TDeff= 65536
##$TDoff= 0
##$TI= <Analysis number 999999
Compound Code 99
Book Reference 9
Project Code 9>
##$TILT= no
##$TM1= 0
##$TM2= 0
##$TOPLEV= 0
##$USERP1= <user>
##$USERP2= <user>
##$USERP3= <user>
##$USERP4= <user>
##$USERP5= <user>
##$WDW= 1
##$XDIM= 32768
##$YMAX_p= 402405105
##$YMIN_p= -132707
$$ End of Bruker specific parameters
$$ ---------------------------------
##NTUPLES= NMR SPECTRUM
##VAR_NAME=  FREQUENCY,     SPECTRUM/REAL,   SPECTRUM/IMAG
##SYMBOL=    X,             R,               I
##VAR_TYPE=  INDEPENDENT,   DEPENDENT,       DEPENDENT
##VAR_FORM=  AFFN,          ASDF,            ASDF
##VAR_DIM=   32768,         32768,           32768
##UNITS=     HZ,            ARBITRARY UNITS, ARBITRARY UNITS
##FACTOR=    0.157963299565203, 1,           1
##FIRST=     4132.6476996994, 0,             0
##LAST=      -1043.33573715361, 0,           0
##MIN=       -1043.33573715361, -132707,     0
##MAX=       4132.6476996994, 402405105,     0
$$ Real data points
##PAGE= N=1
##DATA TABLE= (X++(R..R)), XYDATA
$$ [...]
$$ plain form
16072 -6571 -33615 -66089 -50704 -68287 -58186 -45013 -7382 -1913 -8181 -1003 31713 36713 -32363
16059 -32363 -63115 -58536 -46746 -101985 -103690 -68480 -9872 7951 30120 30730 21907 4806 -5885
16046 -5885 -9463 -29708 -35453 -30483 -39557 -21818 2814 16160 18660 -1981 9673 30146 31021
16033 31021 9456 -23177 -32538 -16719 26556 33863 13681 -17969 -15248 2810 -22383 -41359
16021 -41359 -36086 -30994 22608 17335 -27455 -59238 -70628 -67119 -69136 21905 59262 35642 -6484
16008 -6484 -39034 -43727 -41821 -10026 -23750 -38629 -64076 -41523 -20081 -9369 5085 -16965
15996 -16965 -27501 -12031 10141 -1586 -45597 -25756 16669 -5195 -37207 -61546 -79339 -102474
15984 -102474 -81950 -15001 13250 -23959 -5953 8225 12633 -45289 -50301 -20665 -3638 5318
$$ packed form
16072f571k7044l2474J5385j7583J0101J3173L7631N469o268P178L2716N000o9076
16059c2363l0752M579J1790n5239j705L5210N8608J7823K2169O10q823j7101j0691
16046e885l578k0245n745M970r074J7739K4632J3346K500k0641J1654K0473Q75
16033C1021k1565l2633r361J5819M3275P307k0182l1650K721J8058k5193j8976
16021d1359N273N092N3602n273m4790l1783j1390L509k017R1041L7357k3620m2126
16008f484l2550m693J906L1795j3724j4879k5447K2553K1442J0712J4454k2050
15996a6965j0536J5470K2172j1727m4011J9841M2425k1864l2012k4339j7793k3135
15984a02474K0524O6949K8251l7209J8006J4178M408n7922n012K9636J7027Q956
$$ plain form
15972 5318 21771 -20041 -29632 16683 9461 -29605 -29576 106 16997 5391 -1796 18359 2909
15959 2909 7125 -1130 -25512 -15352 -22252 -28354 -3505 14746 40418 50112 26311 -5051 4009
15946 4009 17343 -13290 -4505 19793 7275 -1045 7488 -21038 -13689 8054 12850 -7310 24972
15933 24972 25513 2223 -40557 -23203 84 -23689 -64850 -82289 -70069 -88963 -58618 -29204
15921 -29204 11970 19609 44333 23495 6382 6837 6761 -20182 4330 -6288 -18843 3504 8601
15908 8601 -3743 22823 27763 -149 -43656 -24397 -15954 -20369 -5707 -11025 -28528 -49120 -67587
15895 -67587 -71398 -43002 -3733 -11354 -24451 -29527 -12238 -8553 10330 20366 13731 -20390 -24460
15882 -24460 -8429 15310 13425 29619 11088 -22481 -36434 -30517 -1634 12712 15214 -25429
$$ packed form
15972E318J6453m1812r591M6315p222l9066K9K9682J6891j1606p187K0155j5450
15959B909M216q255k4382J0160o900o102K4849J8251K5672R694k3801l1362R060
15946D009J3334l0633Q785K4298j2518q320Q533k8526P349K1743M796k0160L2282
15933B4972N41k3290m2780J7354K3287k3773m1161j7439J2220j8894L0345K9414
15921b9204M1174P639K4724k0838j7113M55p6k6943K4512j0618j2555K2347N097
15908H601j2344K6566M940k7912m3507J9259Q443m415J4662n318j7503k0592j8467
15895f7587l811K8396L9269p621j3097n076J7289L685J8883J0036o635l4121m070
15882b4460J6031K3739j885J6194j8531l3569j3953N917K8883J4346K502m0643
$$ plain form
15870 -25429 12442 27669 3238 -17642 -356 39846 27102 25147 1651 -13722 -21640 -16371
15858 -16371 -17754 5656 17831 -289 -15005 44791 78684 46047 8695 -7104 -25592 -16815
15846 -16815 -18540 -20675 -24901 -1787 -22780 -20749 1576 -8732 -16680 -5693 -814 -31393 -67010
15833 -67010 -16616 -8520 12384 -10533 -43344 -34549 -19943 -16693 12964 58923 44349 -25836
15821 -25836 -64749 -75170 -40835 -39211 -59240 -44935 -2020 -250 -8416 -42299 -42465 -15435 -18203
15808 -18203 -17193 -42644 -37742 -10190 -11255 -43901 -77871 -54309 -27507 -25471 -48438 -77154
15796 -77154 -62066 -42702 -59723 -47155 -937 5241 -15484 -13872 4463 -26868 -44460 -30733
15784 -30733 -2011 446 -6878 -12599 -10248 -13249 -18237 -37073 -50610 -62207 -52973 -45258 -71788
$$ packed form
15870b5429L7871J5227k4431k0880J7286M0202j2744j955k3496j5373p918N269
15858a6371j383K3410J2175j8120j4716N9796L3893l2637l7352j5799j8488Q777
15846a6815j725k135m226K3114k0993K031K2325j0308p948J0987M879l0579l5617
15833f7010N0394Q096K0904k2917l2811Q795J4606L250K9657M5959j4574p0185
15821b5836l8913j0421L4335J624k0029J4305M2915J770q166l3883j66K7030k768
15808a8203J010k5451M902K7552j065l2646l3970K3562K6802K036k2967k8716
15796g7154J5088J9364j7021J2568M6218O178k0725J612J8335l1331j7592J3727
15784c0733K8722K457p324n721K351l001m988j8836j3537j1597R234P715k6530
$$ plain form
15771 -71788 -91444 -73828 -83455 -132707 -126945 -82929 -65650 -18353 35432 26358 -12339 -48375
15759 -48375 -34872 -18140 -28226 -9981 -4552 21569 3024 -1967 23860 46905 30295 -6885
15747 -6885 -18540 22352 25438 -2525 9719 18139 4635 -12621 -23093 10876 11456 20716 -4196
15734 -4196 2977 5149 24011 33499 61830 49325 19623 31413 30612 9424 -25343 -51874 -37208
15721 -37208 -3400 -17227 -44664 -31029 -23723 -40434 -11376 -8036 -8964 1761 17438 55865
15709 55865 40261 15996 10342 18600 -15538 -24628 -38280 -56563 -32171 1997 -12711 11415
15697 11415 1227 -12948 -25189 -77965 -78246 -18175 5604 11453 40436 18299 -21531 -27783
15685 -27783 -40642 -40974 -43704 -34882 -34458 -12159 13833 10104 27283 14949 19473 -1260 -52593
$$ packed form
15771g1788j9656J7616r627m9252N762M4016J7279M7297N3785r074l8697l6036
15759d8375J3503J6732j0086J8245N429K6121j8545m991K5827K3045j6610l7180
15747f885j1655M0892L086k7963J2244Q420j3504j7256j0472L3969N80R260k4912
15734d196P173K172J8862R488K8331j2505k9702J1790q01k1188l4767k6531J4666
15721c7208L3808j3827k7437J3635P306j6711K9058L340r28J0725J5677L8427
15709E5865j5604k4265n654Q258l4138r090j3652j8283K4392L4168j4708K4126
15697A1415j0188j4175j2241n2776k81O0071K3779N849K8983k2137l9830o252
15685b7783j2859l32k730Q822M24K2299K5992l729J7179j2334M524k0733n1333
$$ plain form
15672 -52593 -53704 -360 27238 15926 -9426 -8439 -1679 10391 15931 -2560 -38271 -25268 -23130
15659 -23130 -35223 -29378 -31899 -33301 -26825 -40309 -46072 -39996 -24246 9526 39666 32721 31548
15646 31548 22481 19761 19369 2092 -12756 -4519 -7905 -25101 -39375 -43820 -45792 -23534 3234
15633 3234 22794 22335 52720 39305 34025 20273 23056 410 -34589 -55807 -56686 -55609 -29218
15620 -29218 -6524 -4698 -13331 22689 -5640 -17437 -7800 1048 -29992 -16626 1673 -6542 -23033
15607 -23033 -16377 -433 7674 26075 7049 -24712 -8696 -36306 -68770 -47794 -32377 -61877
15595 -61877 -36811 -16304 -17171 1325 14338 -4052 -48491 -44495 -27127 -25002 -35323 -28461 -7005
15582 -7005 -27737 -42435 -66945 -60295 -47725 -73429 -102310 -108742 -67568 -23025 14810 9655
$$ packed form
15672e2593j111N3344K7598j1312k5352R87O760J2070N540j8491l5711J3003K138
15659b3130j2093N845k521j402O476j3484n763O076J5750L3772L0140o945j173
15646C1548r067k720l92j7277j4848Q237l386j7196j4274m445j972K2258K6768
15633C234J9560m59L0385j3415n280j3752K783k2646l4999k1218q79J077K6391
15620b9218K2694J826q633L6020k8329j1797R637Q848l1040J3366J8299q215j6491
15607b3033O656J5944Q107J8401j9026l1761J6016k7610l2464K0976J5417k9500
15595f1877K5066K0507q67J8496J3013j8390m4439L996J7368K125j0321O862K1456
15582g005k0732j4698k4510O650J2570k5704k8881o432M1174M4543L7835n155
$$ plain form
15570 9655 -1416 -5720 30590 37714 34828 62453 72544 58795 42020 27935 -23005 -58195
15558 -58195 -69501 -43432 -28242 -44408 -50621 -57499 -84566 -110645 -97875 -44707 -64254 -63233
15546 -63233 -20357 23149 -24024 -69170 -47460 -11706 -753 -1573 -4799 18048 283 -13524
15534 -13524 -2343 -1162 -30486 -30779 17390 45882 59243 39348 -3507 -22917 -21875 6767
15522 6767 37953 37685 -13105 -42002 -43352 -16471 -513 -17729 -31675 -22499 -38371 -27494 -10711
15509 -10711 -39906 -43660 -53011 -46973 -11356 12678 -38338 -42484 -48191 -4406 7621 492 -11033
15496 -11033 -30992 -28126 -39240 -53136 -16944 -21116 -24498 -3937 25010 6152 -17100 -17385 -6282
15483 -6282 14211 17808 3286 -32597 -43024 -8446 24046 30446 62385 30662 9911 27099
$$ packed form
15570I655j1071m304L6310P124k886K7625J0091j3749j6775j4085n0940l5190
15558e8195j1306K6069J5190j6166o213o878k7067k6079J2770N3168j9547J021
15546f3233M2876M3506m7173m5146K1710L5754J0953q20l226K2847j7765j3807
15534a3524J1181J181k9324k93M8169K8492J3361j9895m2855j9410J042K8642
15522F767L1186k68n0790k8897j350K6881J5958j7216j3946R176j5872J0877J6783
15509a0711k9195l754r351O038L5617K4034n1016m146n707M3785J2027p129j1525
15496a1033j9959K866j1114j3896L6192m172l382K0561K8947j8858k3252k85J1103
15483f282K0493L597j4522l5883j0427L4578L2492O400L1939l1723k0751J7188
$$ plain form
15471 27099 -17636 -18130 -4061 5169 11574 -17306 -23620 -26550 -31302 -26969 -36157 -19114 30654
15458 30654 48272 43610 7715 -10885 15855 40667 11882 -12834 -84 23281 17124 -16922
15446 -16922 -28257 -9077 -18902 -29987 -21651 -2079 -21944 -52887 -23978 20711 45263 46833
15434 46833 7673 -1125 9048 -13844 -2038 23821 70637 58537 56134 55154 76000 108331
15422 108331 121849 76276 57166 38392 35810 45449 59882 48893 25132 33512 23215 -4043
15410 -4043 -35631 -21376 -7390 8909 3320 -4542 -29766 2752 15216 -5971 -3004 -68 2362
15397 2362 -17377 -32190 -44257 -53283 -73823 -32976 7997 15757 1982 -7277 -10081 5752 675
15384 675 17389 5369 -21248 -38473 -19084 -4124 6523 7751 -8265 -9935 7827 -28236
$$ packed form
15471B7099m4735m94J4069R230O405k8880o314k930m752M333r188J7043M9768
15458C0654J7618m662l5895j8600K6740K4812k8785k4716J2750K3365o157l4046
15446a6922j1335J9180r825j1085Q336J9572j9865l0943K8909M4689K4552J570
15434D6833l9160q798J0173k2892J1806K5859M6816j2100k403r80K0846L2331
15422A08331J3518m5573j9110j8774k582R639J4433j0989k3761Q380j0297k7258
15410d043l1588J4255J3986J6299n589p862k5224L2518J2464k1187K967K936K430
15397B362j9739j4813j2067r026k0540M0847M0973P760j3775r259k804J5833n077
15384F75J6714j2020k6617j7225J9389J4960J0647J228j6016j670J7762l6063
$$ plain form
15372 -28236 -42788 -52472 -68123 -70794 -46010 -24997 29804 55503 52446 49145 71336 77552 97743
15359 97743 108930 59943 6029 -14497 -16115 -47068 -43094 -20654 -6301 -21797 -41481 -34794
15347 -34794 -59011 -72637 -68426 -25252 -21909 -6518 14739 13998 983 14559 19468 32063 23257
15334 23257 39245 7408 -42093 -46660 -35560 -5858 7101 9395 24186 34679 30684 15004
15322 15004 -6908 -33261 -8713 -14650 -23003 -15702 3322 5942 -1194 21011 38862 54918 52214
15309 52214 46339 52448 39762 29493 38378 42072 25450 38047 57139 51735 4954 866 39936
15296 39936 39338 36053 13308 19874 24776 32089 21900 3163 -26476 7095 22061 56163 33547
15283 33547 -10504 9800 62738 79092 33134 39449 22212 -12892 -14625 5157 -23017 -48937
$$ packed form
15372b8236j4552r684j5651k671K4784K1013N4801K5699l057l301K2191O216K0191
15359I7743J1187m8987n3914k0526j618l0953L974K2440J4353j5496j9684O687
15347c4794k4217j3626M211M3174L343J5391K1257p41j3015J3576M909J2595q806
15334B3257J5988l1837m9501m567J1100K9702J2959K294J4791J0493l995j5680
15322A5004k1912k6353K4548n937q353P301J9024K620p136K2205J7851J6056k704
15309E2214n875O109j2686j0269Q885L694j6622J2597J9092n404m6781m088L9070
15296C9936n98l285k2745O566M902P313j0189j8737k9639L3571J4966L4102k2616
15283C3547m4051K0304N2938J6354m5958O315j7237l5104j733J9782k8174k5920
$$ plain form
15271 -48937 -37459 -30016 -33582 -9705 28844 14708 -1997 5749 30071 23932 -14808 -16555 -14720
15258 -14720 -24575 -11195 14922 4401 19008 51579 36689 -24611 -45867 -22272 -460 -13848
15246 -13848 -29737 -14831 -4409 10445 -8528 -15163 -17322 -7547 23133 -13118 -9984 -3169 -4329
15233 -4329 -1703 -550 -45716 -63179 -72980 -50151 -7780 -22559 -37686 -3948 10779 3514 8471
15220 8471 10259 3664 -102 -26397 -53461 -62313 -49281 -67422 -64556 -40559 -39348 -44442 -63316
15207 -63316 -75993 -39028 4027 -879 -27732 -43598 -37453 1236 -422 -15062 -19562 -36486
15195 -36486 -57460 -66593 -51980 -7509 18463 300 -33009 -31469 -26076 -37532 -5679 8374
15183 8374 -7854 -29149 -32203 -31548 -3020 21203 15200 -5859 567 -10991 17905 17042 28782
$$ packed form
15271d8937J1478P443l566K3877L8549j4136j6705P746K4322o139l8740j747J835
15258a4720r855J3380K6117j0521J4607L2571j4890o1300k1256K3595K1812j3388
15246a3848j5889J4906J0422J4854j8973o635k159R775L0680l6251L134O815j160
15233d329K626J153m5166j7463r801K2829M2371j4779j5127L3738J4727p265M957
15220H471J788o595l766k6295k7064q852J3032j8141K866K3997J211n094j8874
15207f3316j2677L6965M3055m906k6853j5866O145L8689j658j4640m500j6924
15195c6486k0974r133J4613M4471K5972j8163l3309J540N393j1456L1853J4053
15183H374j6228k1295l054O55K8528K4223o003k1059O426j1558K8896q63J1740
$$ plain form
15170 28782 25656 -5119 425 33777 24309 21451 9970 -19843 -42940 -37751 6137 50536 67092
15157 67092 37897 13465 -6763 11681 7547 -25834 -29185 -27118 -14722 25425 15351 32599
15145 32599 36756 27589 13308 -19109 -27463 -14465 -2821 2669 2196 9730 -2250 -17081 -2083
15132 -2083 26948 15641 -2947 -17597 -27207 -32057 -58173 -36916 -53505 -55459 -19755 -10518 -14801
15119 -14801 1316 17896 46006 84425 71276 49818 43639 39070 62290 99630 65895 38051
15107 38051 38163 33601 6742 148 14597 3059 -20732 22227 29672 -5063 5439 -21871 -30789
15094 -30789 -21742 -42220 -24910 -29422 2304 41915 27588 11842 -16540 -45963 -59550 -65729
15082 -65729 -49172 -11169 5480 -22590 5868 25263 2526 -9150 -29493 -32416 -40253 -43286
$$ packed form
15170B8782l126l0775N544L3352r468k858j1481k9813k3097N189M3888M4399J6556
15157F7092k9195k4432k0228J8444m134l3381l351K067J2396M0147j0074J7248
15145C2599M157r167j4281l2417q354J2998J1644N490m73P534j1980j4831J4998
15132b083K9031j1307j8588j4650r610m850k6116K1257j6589j954L5704R237m283
15119a4801J6117J6580K8110L8419j3149k1458o179m569K3220L7340l3735k7844
15107C8051J12m562k6859o594J4449j1538k3791M2959P445l4735J0502k7310q918
15094c0789R047k0478J7310m512L1726L9611j4327j5746k8382k9423j3587o179
15082f5729J6557L8003J6649k8070K8458J9395k2737j1676k0343k923p837l033
$$ plain form
15070 -43286 -31112 -36029 -19987 9914 13679 -31127 -42466 -40150 -35055 -52440 -22580 9289
15058 9289 18563 -14446 -10652 6617 12589 -7101 -842 -28363 -50212 -33787 -18992 -30549 13883
15045 13883 15570 -1943 -3749 -11127 -15268 -28573 16623 34919 8868 -13499 -18524 -19074 -25423
15032 -25423 -26239 -25525 -39287 -276 5355 4907 -33075 -59867 -59450 -31491 4381 26936 -12758
15019 -12758 -36320 -8564 16046 -18966 -26570 -49350 -51395 -11269 -8757 13996 12738 -4114
15007 -4114 -18256 -26382 -5382 -30017 -44170 -46180 -40362 -9612 -11204 -28999 -20640 -10198 -23330
14994 -23330 -38668 -9364 19053 17908 -5007 -22949 -51881 -39915 -20162 -14022 -12588 -47116
14982 -47116 -50583 -33589 3404 -5583 5732 4814 -18021 -3178 14430 34311 71921 70760 54236
$$ packed form
15070d3286J2174m917J6042K9901L765m4806j1339K316N095j7385K9860L1869
15058I289R274l3009L794J7269N972j9690O259k7521k1849J6425J4795j1557M4432
15045A3883J687j7513j806p378m141j3305M5196J8296k6051k2367n025n50o349
15032b5423q16P14j3762L9011N631m48l7982k6792M17K7959L5872K2555l9694
15019a2758k3562K7756K4610l5012p604k2780k045M0126K512K2753j258j6852
15007d114j4142q126K1000k4635j4153k010N818L0750j592j7795Q359J0442j3132
14994b3330j5338K9304K8417j145k2915j7942k8932J1966J9753O140J434l4528
14982d7116l467J6994L6993q987J1315r18k2835J4843J7608J9881L7610j161j6524
$$ plain form
14969 54236 26879 23535 15974 47923 47047 23915 2192 -30244 -36696 -35523 -36156 -53612 -64772
14956 -64772 -75789 -52520 768 15511 25441 36424 16103 -37003 -49940 -28467 9100 9067
14944 9067 -30476 -58071 -44128 -22170 -18014 -27854 -23582 -1974 -221 -11425 -11447 -15538 -32547
14931 -32547 -13209 44324 98568 90448 50604 11499 -43640 -9813 29141 46992 24665 25942
14919 25942 34533 23539 39068 42625 34957 26313 9788 -12583 3497 1229 18591 33533 44951
14906 44951 65961 54379 40472 16923 12478 13840 32656 4715 -10123 43586 66904 19374
14894 19374 14844 -15086 14719 44383 44645 38590 41050 16468 -16657 -35338 -18898 -54341 -54260
14881 -54260 -19952 -15379 -19382 -13001 -19800 -9783 2301 15794 18236 -40283 -32709 -17507 -31230
$$ packed form
14969E4236k7357l344p561L1949q76k3132k1723l2436o452J173o33j7456j1160
14956f4772j1017K3269N3288J4743R930J0983k0321n3106j2937K1473L7567l3
14944I067l9543k7595J3943K1958M156r840M272K1608J753j1204k2m091j7009
14931c2547J9338N7533N4244q120l9844l9105n5139L3827L8954J7851k2327J277
14919B5942Q591j0994J5529L557p668q644j6525k2371J6080k268J7362J4942J1418
14906D4951K1010j1582j3907k3549m445J362J8816k7941j4838N3709K3318m7530
14894A9374m530k9930K9805K9664K62o055K460k4582l3125j8681J6440l5443Q1
14881e4260L4308M573m003O381o799J0017J2084J3493K442n8519P574J5202j3723
$$ plain form
14868 -31230 -37614 -8333 26978 36890 30733 23586 14702 13687 18562 357 12941 29674 -19
14855 -19 -19232 -11934 -37209 -55436 -45027 -27021 -15666 -11477 -11329 6744 27796 -817 -4808
14842 -4808 -17798 -33305 -42138 -33973 -21360 13165 34380 28527 8511 4112 -8563 -24078 -20136
14829 -20136 -36708 -54030 -55535 -22299 -2713 20687 92 -21621 -40380 -56925 -75804 -28220
14817 -28220 -3788 4569 -44580 -102793 -81821 -62629 -58576 -47883 -24403 639 1566 -7507 -24736
14804 -24736 -29899 -33198 -19277 -560 19622 51908 33134 12015 -3530 3098 12307 -1511
14792 -1511 -24441 -53196 -58994 -23131 -2762 4106 -14508 -44941 -44797 -37174 -31406 -45321 -12097
14779 -12097 22266 38029 59635 97878 57653 10631 -5441 -11003 -11279 15198 28040 25430
$$ packed form
14868c1230o384K9281L5311R912o157p147q884j015M875j8205J2584J6733k9693
14855a9j9213P298k5275j8227J0409J8006J1355M189J48J8073K1052k8613l991
14842d808j2990j5507q833Q165J2613L4525K1215n853k0016m399j2675j5515L942
14829b0136j6572j7322j505L3236J9586K3400k0595k1713j8759j6545j8879M7584
14817b8220K4432Q357m9149n8213K0972J9192M053J0693K3480K5042R27r073j7229
14804b4736n163l299J3921J8717K0182L2286j8774k1119j5545O628R209j3818
14792a511k2930k8755n798L5863K0369O868j8614l0433J44P623N768j3915L3224
14779a2097L4363J5763K1606L8243m0225m7022j6072n562k76K6477J2842k610
$$ plain form
14767 25430 2750 -35575 -42309 -40568 -19634 -30408 -51637 -46549 -51426 -38824 -21637 -31381 -35058
14754 -35058 -13264 -27244 -57220 -56717 -30493 -36483 -30166 -23813 -32553 -19124 9342 1961 -41862
14741 -41862 -63526 -54012 -41707 -44787 -17845 7649 39902 17335 5313 -14985 -31133 -34078
14729 -34078 -40570 -51744 -48265 -53521 -45943 -35929 -17346 -27005 -65070 -74782 -71489 -55197 -31844
14716 -31844 -19313 11992 45081 25121 4779 18756 6330 -34095 -22185 -4410 -4527 -15086
14704 -15086 -2784 -39353 -59156 -28269 -23359 -11342 14663 -10860 -39718 -46803 -31121 -18125
14692 -18125 -33571 -25264 -40884 -37437 -27670 -41520 -14365 33671 41545 10340 11182 1998 12689
14679 12689 37821 13770 -4383 -25716 -48177 -48282 -23117 11902 18732 14374 42543 21624
$$ packed form
14767B5430k2680l8325o734J741K0934j0774k1229N088m877J2602J7187r744l677
14754c5058K1794j3980k9976N03K6224n990O317O353q740J3429K8466p381m3823
14741d1862k1664R514J2305l080K6942K5494L2253k2567j2022k0298j6148k945
14729c4078o492j1174L479n256P578J0014J8583r659l8065r712L293J6292K3353
14716c1844J2531L1305L3089j9960k0342J3977j2426m0425J1910J7775j17j0559
14704a5086J2302l6569j9803L0887M910J2017K6005k5523k8858p085J5682J2996
14692a8125j5446Q307j5620L447R767j3850K7155M8036P874l1205Q42r184J0691
14679A2689K5132k4051j8153k1333k2461j05K5165L5019O830m358K8169k0919
$$ plain form
14667 21624 57970 29496 388 -1029 -23914 -4302 9927 -9020 -25552 -51784 -20996 12924
14655 12924 -4888 -24827 -41591 -43978 -18897 4946 32745 26238 -18814 -58907 -85741 -51570
14643 -51570 -19633 4613 -5343 3549 -14196 -31962 -13001 -18347 -23151 -51480 -79095 -89973
14631 -89973 -66459 -47393 -95018 -77768 -16822 9460 25733 16613 12570 6787 -678 5145 21301
14618 21301 13437 25241 -14918 -40364 -38903 -38545 -35273 -40230 -31551 -58028 -67386 -63975 -32485
14605 -32485 -988 39065 30227 7760 5173 -23377 -45638 -56844 -53766 -40375 -31024 -2943
14593 -2943 14494 20997 12395 12542 14182 12066 27566 27154 24636 23224 20058 7250 -27828 -23647
14579 -23647 7972 18088 11621 16208 15075 36331 16139 6589 -15874 -31877 -38390 -14920 34626
$$ packed form
14667B1624L6346k8474k9108j417k2885J9612J4229j8947j6532k6232L0788L3920
14655A2924j7812j9939j6764k387K5081K3843K7799o507m5052m0093k6834L4171
14643e1570L1937K4246r956Q892j7745j7766J8961n346m804k8329k7615j0878
14631h9973K3514J9066m7625J7250O0946K6282J6273r120m043n783p465N823J6156
14618B1301p864J1804m0159k5446J461L58L272m957Q679k6477r358L411L1490
14605c2485L1497M0053q838k2467k587k8550k2261j1206L078J3391R351K8081
14593b943J7437O503q602J47J640k116J5500m12k518j412l166j2808l5078M181
14579b3647L1619J0116o467M587j133K1256k0192r550k2463j6003o513K3470M9546
$$ plain form
14566 34626 10870 -14744 -44582 -59347 -17477 5734 4449 -37193 -27948 -15224 -3751 -4276
14554 -4276 2624 32179 16717 -17443 -25346 -16021 -10062 4124 14117 -21326 -39061 -7209 -986
14541 -986 721 -6479 24040 59693 52195 59937 37555 15469 -23921 733 26540 -12014 6336
14528 6336 14751 -5224 12103 6946 -4270 -1034 23892 78215 79825 65323 21236 -25099 -61468
14515 -61468 -64438 -15112 7231 19763 -5055 -54312 -51781 12465 42804 48390 6430 29916
14503 29916 36975 38114 16608 14786 21063 27116 40396 49558 14733 -13296 -13424 -4409 -745 41095
14489 41095 48205 6045 -39336 -60163 -38256 32623 43946 36683 15099 -6554 -15130 154
14477 154 13050 35678 18439 19380 15102 -2737 -27336 -14871 3101 6482 132 -96 9448 6876
$$ packed form
14566C4626k3756k5614k9838j4765M1870K3211j285m1642R245J2724J1473n25
14554d276O900K9555j5462l4160p903R325N959J4186R993l5443j7735L1852O223
14541i86J707p200L0519L5653p498P742k2382k2086l9390K4654K5807l8554J8350
14528F336Q415j9975J7327n157j1216L236K4926N4323J610j4502m4087m6335l6369
14515f1468k970M9326K2343J2532k4818m9257K531O4246L0339N586m1960K3486
14503B9916P059J139k1506j822O277O053J3280R162l4825k8029j28R015L664M1840
14489D1095P110m2160m5381k0827K1907P0879J1323p263k1584k1653q576J5284
14477A54J2896K2628j7239R41m278j7839k4599J2465J7972L381o350k28R544k572
$$ plain form
14463 6876 4487 21599 45236 35305 -8002 -18155 -24536 -19068 -21721 -8393 1940 434 -21251
14450 -21251 -58478 -22294 19057 13497 -14644 -29360 -31136 -16415 10483 27881 27808 22297 10024
14437 10024 26747 11842 16761 36333 30527 35377 6688 10578 9934 -8799 15610 28472 7912
14424 7912 4647 -11021 -51489 -65450 -62093 -68572 -55673 -7989 -5013 -5855 -24457 -46735 -26522
14411 -26522 -22141 -8321 12471 24865 14181 3667 10025 -23583 -75621 -70838 -46884 -44684
14399 -44684 -8964 28291 -12144 -31916 -17813 22384 15862 12733 8660 15679 29925 27647 39903
14386 39903 17431 15168 -14032 -24486 -41403 -51579 -55596 -51035 -42762 -32389 -29138 18211 37012
14373 37012 231 6985 24337 22672 -7361 3612 24693 34670 -19349 -59696 -93736 -96923
$$ packed form
14463F876k389J7112K3637r931m3307j0153o381N468k653J3328J0333j506k1685
14450b1251l7227L6184M1351n560k8141j4716j776J4721K6898J7398p3n511j2273
14437A0024J6723j4905M919J9572n806M850k8689L890o44j8733K4409J2862k0560
14424G912l265j5668m0468j3961L357o479J2899M7684K976q42j8602k2278K0213
14411b6522M381J3820K0792J2394j0684j0514O358l3608n2038M783K3954K200
14399d4684L5720L7255m0435j9772J4103M0197o522l129m073P019J4246k278J2256
14386C9903k2472k263k9200j0454j6917j0176m017M561Q273J0373L251M7349J8801
14373C7012l6781O754J7352j665l0033J0973K1081R977n4019m0347l4040l187
$$ plain form
14361 -96923 -64855 -33901 -28164 -65761 -21550 -2354 -7501 -45186 -63007 -51135 -24110 -7041
14349 -7041 -18427 -5804 10002 -13685 -27418 944 1489 -628 -6115 -24269 -39695 -39051 -16556
14336 -16556 16718 17808 17037 30420 23881 45980 44463 5132 -13321 -23026 -36361 -51093 -30668
14323 -30668 -36019 -44568 -7832 59642 57068 39849 3445 684 33086 13860 1332 7865 12437
14310 12437 -14010 -7627 5375 614 -29391 -50188 -53574 -41752 -33008 -34062 -45089 -26005 3767
14297 3767 5664 -27422 -69362 -98866 -59254 -19090 2362 10931 14778 15997 3438 -26119 -21395
14284 -21395 -12310 -18512 -3960 -1364 10473 19084 -7356 5542 17099 34952 51425 86781
14272 86781 51721 32334 9865 27462 7825 -22074 17119 50054 38269 -4804 21388 26881
$$ packed form
14361i6923L2068L0954N737l7597M4211J9196n147l7685j7821J1872K7025J7069
14349g041j1386J2623J5806k3687j3733K8362N45k117n487j8154j5426O44K2495
14336a6556L3274J090p71J3383o539K2099j517l9331j8453r705j3335j4732K0425
14323c0668n351q549L6736O7474k574j7219l6404k761L2402j9226j2528O533M572
14310A2437k6447O383J3002m761l0005k0797l386J1822Q744j054j1027J9084K9772
14297C767J897l3086m1940k9504L9612M0164K1452Q569L847J219j2559k9557M724
14284b1395R085o202J4552K596J1837Q611k6440J2898J1557J7853J6473L5356
14272H6781l5060j9387k2469J7597j9637k9899L9193L2935j1785m3073K6192N493
$$ plain form
14260 26881 -1981 -17080 -20831 7559 -2874 -12582 7401 20932 20548 26289 8813 14075 -22797
14247 -22797 -67927 -73498 -18100 -12593 -41585 -81487 -79837 -46654 -40156 -24178 16970 -4267
14235 -4267 1894 11565 21372 31920 7760 -7321 -22529 -19456 -11694 -14205 -26417 23854 48106
14222 48106 -1334 -49444 -41148 -64029 -68047 -65471 -45842 -42975 -25876 -45526 -30905 1609
14210 1609 21867 5118 -31978 -27063 -19399 5028 -21932 -35444 -30253 -34980 -19165 -10488 -979
14197 -979 -28272 -45269 -19906 24092 24942 1240 -2782 9980 5787 -14090 -13625 15656 -6611
14184 -6611 -20808 -16467 -18864 -13585 -6260 -4880 2839 -18626 -2778 -15544 -39538 -30486 3554
14171 3554 5921 10254 37710 24536 13940 17976 23571 2674 10072 14616 63360 66037 38996
$$ packed form
14260B6881k8862j5099l751K8390j0433r708J9983J3531l84N741j7476N262l6872
14247b2797m5130n571N5398N507k8992l9902J650L3183O498J5978M1148k1237
14235d267O161R671R807J0548k4160j5081j5208L073P762k511j2212N0271K4252
14222D8106m9440m8110Q296k2881m018K576J9629K867J7099j9650J4621L2514
14210A609K0258j6749l7096M915P664K4427k6960j3512N191m727J5815Q677R509
14197i79k7293j6997K5363M3998Q50k3702m022J2762m193j9877M65K9281k2267
14184f611j4197M341k397N279P325J380P719k1465J5848j2766k3994R052L4040
14171C554K367M333K7456j3174j0596M036N595k0897P398M544M8744K677k7041
$$ plain form
14158 38996 28976 30731 13734 20064 35906 290 -18545 -12652 -5209 -30396 -16309 -9504 -21908
14145 -21908 -20599 -22530 -25564 -21735 -5524 -10094 -6369 -37097 -38064 4933 18256 9843 -14166
14132 -14166 -29086 -32620 -57908 -27450 -5486 -39742 -27558 -35517 -39886 -21558 9201 7632
14120 7632 -6940 7049 26454 18058 15675 13592 -18070 12814 46697 74928 50558 41915 33877
14107 33877 14177 37521 41180 2551 38722 40756 18962 26209 5842 -36960 -41210 -36122 -19569
14094 -19569 1319 -4894 -11915 -45611 -27618 1287 15886 -21096 -38535 -36405 -9435 2298
14082 2298 7429 -17758 -23738 -12894 5972 -11242 11549 5468 -10164 -20511 -19925 -19217 -44477
14069 -44477 -17224 1267 -10575 -2677 27273 -2875 -1759 24671 18444 767 -14821 3912
$$ packed form
14158C8996j0020J755j6997O330J5842l5616j8835N893P443k5187J4087O805j2404
14145b1908J309j931l034L829J6211m570L725l0728r67M2997J3323q413k4009
14132a4166j4920l534k5288L0458K1964l4256J2184p959m369J8328L0759j569
14120G632j4572J3989J9405q396k383k083l1662L0884L3883K8231k4370q643q038
14107C3877j9700K3344L659l8629L6171K034k1794P247k0367m2802m250N088J6553
14094a9569K0888o213p021l3696J7993K8905J4599l6982j7439K130K6970J1733
14082B298N131k5187n980J0844J8866j7214K2791o081j5632j0347N86P08k5260
14069d4477K7253J8491j1842P898K9950l0148J116K6430o227j7677j5588J8733
$$ plain form
14057 3912 28387 48137 23735 12822 13208 46263 45673 23818 37719 52399 -16252 -45299 -37270
14044 -37270 -10137 6660 13661 -11904 -15133 5069 13495 -8703 -16514 -47335 -58007 -46503
14032 -46503 -33514 -20756 -9755 39999 85356 54312 26194 4051 -24526 -47827 -33408 -20496
14020 -20496 -28429 -22908 -7923 -21941 -13620 -5572 -38812 -44701 -52407 -57557 -38789 -38913 -8973
14007 -8973 -5824 5591 -22310 -53680 -51098 -41455 -16926 2506 -7618 -32835 30798 87969
13995 87969 90184 57608 36390 32885 30988 13373 -25522 -30258 870 1374 1529 10441 -4788
13982 -4788 -30924 -35197 7809 55952 59782 9738 -7575 2089 28215 21198 34689 37712 7399
13969 7399 8387 4648 -26399 -8244 31440 38767 23981 33797 30775 4218 -21348 -34599 -39408
$$ packed form
14057C912K4475J9750k4402j0913L86L3055n90k1855J3901J4680o8651k9047Q029
14044c7270K7133J6797P001k5565l229K0202Q426k2198p811l0821j0672J1504
14032d6503J2989J2758J1001M9754M5357l1044k8118k2143k8577k3301J4419J2912
14020b0496p933N521J4985j4018Q321Q048l3240n889p706n150J8768j24K9940
14007h973L149J1415k7901l1370K582R643K4529J9432j0124k5217O3633N7171
13995H7969K215l2576k1218l505j897j7615l8895m736L1128N04J55Q912j5229
13982d788k6136m273M3006M8143L830n0044j7313R664K6126p017J3491L023l0313
13969G399R88l739l1047J8155L9684P327j4786R816l022k6557k5566j3251m809
$$ plain form
13956 -39408 -34555 -29187 -19288 -20235 -28087 -38018 -13491 -13282 692 7440 2020 -17774 -10817 -29240
13942 -29240 -37347 -22408 -20310 -18874 -32729 -39987 -31440 -32297 -37914 -34245 -16874 -20162 -11871 -1018
13928 -1018 10677 3774 -17875 -30437 15172 35865 32672 34456 20401 -9200 -18351 -11839 -28686
13915 -28686 -58602 -57411 -16480 -22691 -31432 -7578 25915 46051 22897 -12183 -40743 -10868
13903 -10868 23354 55128 67961 50184 39785 27846 4333 17567 22501 -2882 -30262 -49041
13891 -49041 -5288 22473 21015 24310 3787 -16665 9226 -8914 -38815 -22514 -658 -5379
13879 -5379 -35795 -63868 -46650 -23299 -4719 56607 69202 29100 40892 42544 59948 29124
13867 29124 9130 -19291 -60325 -77049 -46215 -15861 -25878 -29405 -23454 -28523 -23320 -13755 -6314
$$ packed form
13956c9408M853N368R899r47p852r931K4527K09J3974O748n420j9794O957j8423
13942b9240q107J4939K098J436j3855p258Q547q57n617L669J7371l288Q291J0853
13928a018J1695o903k1649j2562M5609K0693l193J784j4055k9601r151O512j6847
13915b8686k9916J191M0931o211q741K3854L3493K0136k3154l5080k8560K9875
13903a0868L4222L1774J2833j7777j0399j1939k3513J3234M934k5383k7380j8779
13891d9041M3753K7761j458L295k0523k0452K5891j8140k9901J6301K1856m721
13879e379l0416k8073J7218K3351J8580O1326J2595m0102J1792J652J7404l0824
13867B9124j9994k8421m1034j6724L0834L0354j0017l527N951n069N203R565P441
$$ plain form
13854 -6314 1872 7816 28075 48824 34679 4260 -12801 -38118 -39839 -11096 13114 27784
13842 27784 21875 18268 27613 27685 22712 27692 23811 -407 -16262 20691 31500 51292 62286
13829 62286 42442 1638 -22057 3156 25505 6335 -17918 -51693 -60845 -76769 -109259 -117185
13817 -117185 -111344 -86889 -72783 -30263 -10094 -56923 -78750 -87441 -65630 -30871 -31931 -50859
13805 -50859 -24752 -15176 -4517 -12291 -16086 -10385 -3809 696 -4028 17961 8041 7319 -1155 2920
13791 2920 30164 13415 -23256 -52361 -24188 -3326 -24578 -44514 -50207 -33891 -37489 -27297
13779 -27297 -33676 -64182 -74797 -60250 -34866 -19871 -32855 -29756 -15415 -12298 -12506 21104 8546
13766 8546 -25496 -11154 -20096 -22852 -37656 -65813 -70316 -75651 -70800 -47054 -55276 -58913 -74070
$$ packed form
13854f314Q186N944K0259K0749j4145l0419j7061k5317j721K8743K4210J4670
13842B7784n909l607R345P2m973M980l881k4218j5855L6953J0809J9792J0994
13829F2286j9844m0804k3695K5213K2349j9170k4253l3775r152j5924l2490p926
13817a17185N841K4455J4106M2520K0169m6829k1827q691K1811L4759j060j8928
13805e0859K6107R576J0659p774l795N701O576M505m724K1989r920p22q474M075
13791B920K7244j6749l6671k9105K8173K0862k1252j9936n693J6316l598J0192
13779b7297o379l0506j0615J4547K5384J4995j2984L099J4341L117k08L3610j2558
13766H546l4042J4342q942k756j4804k8157m503n335M851K3746q222l637j5157
$$ plain form
13753 -74070 -107330 -74770 -37149 -25926 -7780 18439 -16586 -33009 -14964 8344 -5149 12935
13741 12935 34209 37078 25476 22123 7395 -8742 -40458 -39408 -28519 1649 -17515 -32821
13729 -32821 -69132 -69363 -22015 -623 -11998 17444 54525 73544 56201 18979 -22046 2009
13717 2009 29776 23831 3692 -9370 -28598 -39552 -20812 -58473 -72005 -56641 -74874 -62309
13705 -62309 -25657 -11558 -22874 -24231 -40490 -65223 -67036 -22084 -14599 -37261 -29080 -57135
13693 -57135 -56344 -7915 11870 39861 22820 5907 1521 -20324 -19455 -23402 -30232 -43308 -26223
13680 -26223 -26120 -49699 -73712 -74905 -34521 -12222 10568 19769 130 20125 12074 21742 12415
13667 12415 7074 10792 31138 38160 17969 32471 44941 69715 93877 78581 10114 3556
$$ packed form
13753g4070l3260L2560L7621J1223J8146K6219l5025j6423J8045K3308j3493J8084
13741A2935K1274K869j1602l353j4728j6137l1716J050J0889L0168j9164j5306
13729c2821l6311k31M7348K1392j1375K9442L7081J9019j7343l7222m1025K4055
13717B009K7767n945k0139j3062j9228j0954J8740l7661j3532J5364j8233J2565
13705f2309L6652J4099j1316j357j6259k4733j813M4952P485k2662Q181k8055
13693e7135P91M8429J9785K7991j7041j6913m386k1845Q69l947o830j3076J7085
13680b6223J03k3579k4013j193M0384K2299K2790R201j9639J9995q051R668r327
13667A2415n341L718K0346P022k0191J4502J2470K4774K4162j5296o8467o558
$$ plain form
13655 3556 4801 -8399 19801 21897 9800 -16199 -10395 -27491 -55761 -20828 12850 19472 -14502
13642 -14502 -63447 -52272 -21840 -12029 -1550 20208 34875 5386 -14498 -17695 -25916 -59930
13630 -59930 -68300 -53232 -37100 -3049 13821 44648 42320 32322 16920 6429 -16657 -1070
13618 -1070 6971 12708 35252 43446 12320 -2134 -2588 374 -6078 -27592 -41337 -47225 -14280
13605 -14280 -1469 -30153 -9172 4431 -19816 -8672 -13135 -25679 -20652 14696 13937 -22665
13593 -22665 -68232 -115811 -124301 -114493 -76415 -66047 -34279 -11697 11852 21069 -6343 -1782
13581 -1782 22958 22015 7050 -23881 -24516 -37332 -28880 -8334 4003 5653 -26478 -32626 -24268
13568 -24268 -40144 -41801 -39772 -67067 -56375 -45234 -25820 -17070 -41402 -20245 22716 7423
$$ packed form
13655C556J245j3200K8200K096j2097k5999N804j7096k8270L4933L3678O622l3974
13642a4502m8945J1175L0432R811J0479K1758J4667k9489j9884l197q221l4014
13630e9930q370J5068J6132L4051J6870L0827k328r998j5402j0491k3086J5587
13618a070Q041N737K2544Q194l1126j4454m54K962o452k1514j3745n888L2945
13605a4280J2811k8684K0981J3603k4247J1144m463j2544N027L5348p59l6602
13593b2665m5567m7579q490R808L8078J0368L1768K2582K3549R217k7412M561
13581a782K4740r43j4965l0931o35j2816Q452K0546J2337J650l2131o148Q358
13568b4268j5876j657K029k7295J0692J1141J9414Q750k4332K1157M2961j5293
$$ plain form
13556 7423 -6443 -8018 -15019 -34343 -22498 31833 15433 -458 28127 62338 33714 18927
13544 18927 -11192 -13437 -25566 -30919 -35356 -14698 -11413 -16401 -27525 -30990 -29589 -51803 -66686
13531 -66686 -40772 -34604 -50723 -25709 -19101 -22311 -13245 31383 39521 19987 19939 14434 -16164
13518 -16164 -17890 -43936 -29092 -410 8209 -34828 -34544 -35279 -12041 -18814 -28181 -35260 -33647 -43786
13504 -43786 -22671 -8742 -45145 -58823 -49470 -28717 -1598 -19995 -43054 -35294 -7662 -18455
13492 -18455 -17548 -10155 -13157 -15658 -27573 -8479 27215 2890 -35773 -11468 -22706 -60259 -53045
13479 -53045 -31235 -47821 -66447 -82685 -62012 -47465 -36737 2382 -30815 -74470 -82974 -45986
13467 -45986 -32930 -28260 -27420 -22728 -30862 -42230 -30891 -18325 -41973 -58767 -90572 -112593 -53107
$$ packed form
13556G423j3866j575p001j9324J1845N4331j6400j5891K8585L4211k8624j4787
13544A8927l0119k245j2129n353m437K0658L285m988j1124l465J401k2214j4883
13531f6686K5914O168j6119K5014O608l210R066M4628Q138j9534m8n505l0598
13518a6164j726k6046J4844K8682Q619m3037K84p35K3238o773r367p079J613j0139
13504d3786K1115J3929l6403j3678R353K0753K7119j8397k3059P760K7632j0793
13492a8455R07P393l002k501j1915J9094L5694k4325l8663K4305j1238l7553P214
13479e3045K1810j6586j8626j6238K0673J4547J0728L9119l3197m3655q504L6988
13467d5986J3056M670Q40M692q134j1368J1339J2566k3648j6794l1805k2021N9486
$$ plain form
13454 -53107 -17039 14333 -5923 -17936 -5101 -37855 -75407 -72659 -82530 -84927 -71165 -50294
13442 -50294 -23807 -33711 -50746 -1443 -4516 -5580 -34567 -73443 -35884 -7059 -43132 -37713
13430 -37713 -18516 -9742 -38993 -55447 -32793 -19052 14941 38794 14688 4543 -21655 8042
13418 8042 -498 -15950 -33826 -9619 20975 34347 1384 -11484 -7045 -18278 -23264 -32929 -22602
13405 -22602 3905 12347 4088 -15044 -1713 7430 -14500 -34814 -49404 -62863 -56242 -32250
13393 -32250 -29734 -13140 4136 -31184 -63666 -49478 -42393 -82904 -130593 -101690 -88199 -61253
13381 -61253 -34408 -61208 -53566 -40111 -16163 -36772 -38024 -35217 -35366 -27129 -2789 -15156 -21435
13368 -21435 -16378 1405 43137 58756 51031 9441 -9709 5677 4408 6818 -16138 -3228
$$ packed form
13454e3107L6068L1372k0256j2013J2835l2754l7552K748r871k397J3762K0871
13442e0294K6487r904j7035M9303l073j064k8987l8876L7559K8825l6073N419
13430c7713J9197Q774k9251j6454K2654J3741L3993K3853k4106j0145k6198K9697
13418H042q540j5452j7876K4207L0594J3372l2963j2868M439j1233m986r665J0327
13405b2602K6507Q442q259j9132J3331R143k1930k0314j4590j3459O621K3992
13393c2250K516J6594J7276l5320l2482J4188P085m0511m7689K8903J3491K6946
13381f1253K6845k6800P642J3455K3948k0609j252K807j49Q237K4340j2367o279
13368b1435N057J7783M1732J5619p725m1590j9150J5386j269K410k2956J2910
$$ plain form
13356 -3228 10514 12335 28199 -4285 -9613 22811 33792 21181 -10362 -37824 -36570 -51277
13344 -51277 -46479 -27523 -1447 30586 37118 48243 27018 -24490 -42679 -16977 -8235 -13325
13332 -13325 -749 -7248 15804 34088 57972 40535 13524 -14215 20876 10103 -7875 11602
13320 11602 6762 -6993 14110 12069 -1499 16366 45469 48014 55935 28017 20949 26886 6890
13307 6890 27002 43856 41651 32321 6398 16607 -6920 -16779 -25516 -30817 -27559 -19557 -9521
13294 -9521 10465 51276 62589 53612 44052 56317 70543 39674 27113 21120 -10990 -32242
13282 -32242 -21551 -43881 -48820 -36122 -28178 -42168 16363 32114 25028 12397 8061 9318 49838
13269 49838 47594 29518 6214 -27299 -21738 22288 20832 29864 78889 93563 47068 3454
$$ packed form
13356c228J3742J821J5864l2484n328L2424J0981j2611l1543k7462J254j4707
13344e1277M798J8956K6076L2033O532J1125k1225n1508j8189K5702Q742n090
13332a3325J2576o499K3052J8284K3884j7437k7011k7739L5091j0773j7978J9477
13320A1602m840j3755K1103k041j3568J7865K9103K545P921k7918p068N937j9996
13307F890K0112J6854k205r330k5923J0209k3527r859q737n301L258Q002J0036
13294i521J9986M0811J1313q977r560J2265J4226l0869j2561n993l2110k1252
13282c2242J0691k2330m939J2698P944j3990N8531J5751p086j2631m336J257M0520
13269D9838k244j8076k3304l3513N561M4026j456R032M9025J4674m6495m3614
$$ plain form
13257 3454 -20077 -8784 -12445 -16827 -33970 -38298 -8314 8155 29313 27504 6477 -33881 -75184
13244 -75184 -49290 -1137 28117 44505 40382 35866 17077 34474 52412 32980 21788 2
13232 2 11909 5504 12138 -4968 -36603 -17442 -14038 -6642 -15532 -9273 14002 26452 34288 30700
13218 30700 12902 -8449 -6210 5907 10983 24107 33978 41542 49941 52843 15121 6922 18518
13205 18518 21695 12088 42669 94027 149150 152804 132114 103174 76478 69921 42414 15963
13193 15963 3685 32561 49923 76573 136284 202973 292619 423928 644094 886278 1107181
13182 1107181 1141319 991171 762114 560761 413919 318638 261203 244271 235673 209143 214489
13171 214489 230193 222292 225988 247465 290208 310205 277928 208399 169260 157354 164018 125853
$$ packed form
13257C454k3531J1293l661m382j7143m328K9984J6469K1158j809k1027m0358m1303
13244g5184K5894M8153K9254J6388m123m516j8789J7397J7938j9432j1192k1786
13232BJ1907o405O634j7106l1635J9161L404P396q890O259K3275J2450P836l588
13218C0700j7798k1351K239J2117N076J3124R871P564Q399K902l7722q199J1596
13205A8518L177r607L0581N1358N5123L654k0690k8940k6696o557k7507k6451
13193A5963j2278K8876J7362K6650N9711O6689Q9646J31309K20166K42184K20903
13182A107181L4138j50148k29057k01353j46842r5281n7435j6932q598k6530N346
13171B14489J5704p901L696K1477M2743J9997l2277o9529l9139j1906O664l8165
$$ plain form
13159 125853 94291 134934 147951 137005 99778 74973 81131 75326 67273 69783 55926 83794
13147 83794 112243 128260 119274 74954 15240 14069 42717 37830 44739 37248 48119 65083 77249
13134 77249 49163 16384 34534 61167 49514 37943 41525 45754 71717 116412 115627 89227
13122 89227 132384 145651 161036 162965 169914 105098 74786 94509 82699 83818 99510 86060
13110 86060 80183 50459 41064 35820 48969 93016 91694 53448 26513 9055 27434 64937
13098 64937 50866 12540 11259 -4582 9694 -5813 1281 16573 30343 32246 36876 23465
13086 23465 7145 52719 72264 45107 36393 52440 38830 45605 56816 101059 150186 130417
13074 130417 94029 65598 35887 20367 6234 -7431 31199 29710 34296 21796 438 -1450
$$ packed form
13159A25853l1562M0643J3017j0946l7227k4805O158n805q053K510j3857K7868
13147H3794K8449J6017q986m4320n9714j171K8648m887O909p491J0871J6964J2166
13134G7249k8086l2779J8150K6633j1653j1571L582M229K5963M4695p85k6400
13122H9227M3157J3267J5385J929O949o4816l0312J9723j1810J119J5692j3450
13110H6060n877k9724r395n244J3149M4047j322l8246k6935j7458J8379L7503
13098F4937j4071l8326j281j5841J4276j5507P094J5292J3770J903M630j3411
13086B3465j6320M5574J9545k7157q714J6047j3610O775J1211M4243M9127j9769
13074A30417l6388k8431k9711j5520j4133j3665L8630j489M586j2500k1358j888
$$ plain form
13062 -1450 -2696 41976 26783 5174 25828 45267 51693 82006 103820 103506 74841 39940 42081
13049 42081 24872 44569 70082 81536 95004 69707 56028 48763 34072 36741 42261 55369
13037 55369 62281 56509 45016 17157 -4313 -35335 -26959 -986 7542 -17535 -48011 -41503 -32887
13024 -32887 -16087 8034 12618 16536 38371 47291 47875 38513 18872 -13080 -23957 -22889 -50312
13011 -50312 -63508 -49126 -17248 -260 -9625 -19271 -59428 -54110 -30933 -36560 -44516 -45512 -8951
12998 -8951 37831 43166 43082 41225 72457 68276 36694 28434 16573 46373 59250 65567 63938 82287
12984 82287 92928 69567 41422 41725 24688 14041 8956 36375 67044 79600 96539 82025
12972 82025 59013 44935 30942 7457 19380 39662 55490 41411 17532 19007 23956 35669
$$ packed form
13062a450j246M4672j5193k1609K0654J9439O426L0313K1814l14k8665l4901K141
13049D2081j7209J9697K5513J1454J3468k5297j3679p265j4691K669N520J3108
13037E5369O912n772j1493k7859k1470l1022Q376K5973Q528k5077l0476O508Q616
13024c2887J6800K4121M584L918K1835Q920N84r362j9641l1952j0877J068k7423
13011e0312j3196J4382L1878J6988r365r646m0157N318K3177n627p956r96L6561
12998h951M6782N335q4j857L1232m181l1582q260j1861K9800J2877O317j629J8349
12984H2287J0641k3361k8145L03j7037j0647n085K7419L0669J2556J6939j4514
12972H2025k3012j4078j3993k3485J1923K0282J5828j4079k3879J475M949J1713
$$ plain form
12960 35669 57559 47714 38195 13852 10798 45789 64256 39843 28131 40007 34882 19789
12948 19789 38640 80935 78534 44833 49206 59067 29796 49230 51122 14951 2726 5482 3408
12935 3408 17384 41897 63201 54709 53407 42524 29079 4994 7758 46020 52199 58217 39885
12922 39885 54408 69179 42869 18991 -23692 -15544 -23397 -41839 -54247 -49081 -29118 -15362
12910 -15362 -19845 19673 36323 21159 -14375 -24170 -23136 -20722 -477 39268 22134 -12945
12898 -12945 -29797 -47849 -33648 -49938 -65532 -26176 6678 -8565 43 -11833 -32091 -20875
12886 -20875 -20535 -30335 -37810 -38734 11458 3653 -8997 11407 23084 -17917 -16492 -15389 -29849
12873 -29849 -36782 -14089 -7734 6141 -17098 -50539 -59687 -43631 22462 184450 373602 554973
$$ packed form
12960C5669K1890r845r519k4343l054L4991J8467k4413j1712J1876n125j5093
12948A9789J8851M2295k401l3701M373R861k9271J9434J892l6171j2225K756k074
12935C408J3976K4513K1304q492j302j0883j3445k4085K764L8262O179O018j8332
12922C9885J4523J4771k6310k3878m2683Q148p853j8442j2408N166J9963J3756
12910a5362m483L9518J6650j5164l5534r795J034K414K0245L9745j7134l5079
12898a2945j6852j8052J4201j6290j5594L9356L2854j5243Q608j1876k0258J1216
12886b0875L40r800p475r24N0192p805j2650K0404J1677m1001J425J103j4460
12873b9849o933K2693O355J3875k3239l3441r148J6056O6093J61988J89152J81371
$$ plain form
12861 554973 725446 906155 1050965 1163474 1209772 1152269 1045561 930086 786997 711518
12851 711518 698078 674253 641159 620632 590077 579973 563398 542744 566747 610689 580858
12840 580858 527300 492000 506142 481425 428141 407864 372647 390147 414476 421586 430955 419946
12828 419946 420216 430523 405190 398072 381729 357221 333760 368106 371444 371476 354710 346398 363818
12815 363818 381414 390262 407939 404376 410368 396353 369414 400398 434666 443861 459091 482305
12803 482305 497409 483014 494203 535575 533403 502328 472219 441808 446104 459431 415600 414522
12791 414522 419542 420812 428105 423926 447908 481419 513099 554257 543997 539212 545367 557713 594975
12778 594975 647457 722600 769794 769144 764532 732767 747201 819152 880301 929931 993718 1069026
$$ packed form
12861E54973J70473J80709J44810J12509M6298n7503j06708j15475j43089p5479
12851G11518j3440k3825l3094k0527l0555j0104j6575k0654K4003M3942k9831
12840E80858n3558l5300J4142k4717n3284k0277l5217J7500K4329P110R369j1009
12828D19946K70J0307k5333p118j6343k4508k3461L4346L338L2j6766q312J7420
12815C63818J7596Q848J7677l563N992j4015k6939L0984L4268R195J5230K3214
12803D82305J5104j4395J1189M1372k172l1075l0109l0411M296J3327m3831j078
12791D14522N020J270P293m179K3982L3511L1680M1158j0260m785O155J2346L7262
12778E94975N2482P5143M7194o50m612l1765J4434P1951O1149M9630O3787P5308
$$ plain form
12766 1069026 1129117 1182829 1239606 1344581 1415915 1499133 1584976 1694423 1849920 2051340
12756 2051340 2298677 2575375 2848976 3133026 3452222 3860350 4426833 5137626 5981580
12747 5981580 6889598 7769682 8674020 9820464 11427964 13840249 17332455 22612106 30827849
12738 30827849 44248019 67106621 104811951 157234787 208199355 229364744 204624638
12731 204624638 152884954 105613165 75582637 57695593 46640882 39380123 34264522
12724 34264522 30441107 27479561 25171102 23335182 21755679 20216940 18718831 17339229
12716 17339229 16187466 15235069 14404043 13685065 13062740 12544768 12096108 11621064 11210803
12707 11210803 10867716 10499940 10113444 9786097 9409534 9055348 8772810 8544990 8330594
$$ packed form
12766A069026O0091N3712N6777J04975P1334Q3218Q5843J09447J55497K01420
12756B051340K47337K76698K73601K84050L19196M08128N66483P10793Q43954
12747E981580R08018Q80084R04338J146444J607500K412285L492206N279651Q215743
12738C0827849J3420170K2858602L7705330N2422836N0964568K1165389k4740106
12731B04624638n1739684m7271789l0030528j7887044j1054711p260759n115601
12724C4264522l823415k961546k308459j835920j579503j538739j498109j379602
12716A7339229j151763r52397q31026p18978o22325n17972m48660m75044m10261
12707A1210803l43087l67776l86496l27347l76563l54186k82538k27820k14396
$$ plain form
12698 8330594 8181351 8015155 7832864 7622527 7430862 7237110 7063336 6863887 6669354
12689 6669354 6435897 6211518 6026786 5852357 5708611 5550421 5382594 5297351 5248488 5153767
12679 5153767 5041290 4972558 4894980 4788695 4672137 4553648 4451530 4361301 4265640 4128066
12669 4128066 4017226 3890317 3772991 3675731 3593905 3519555 3444388 3416549 3377556 3279852 3181085
12658 3181085 3095689 3037610 2967844 2912505 2825688 2759759 2738990 2679207 2644995 2610413 2598162
12647 2598162 2539710 2469842 2383894 2346397 2306307 2257186 2200468 2183464 2160000 2115717 2070379
12636 2070379 2013014 1981945 1935373 1854532 1790550 1784529 1768036 1752915 1698745 1610364 1573665
12625 1573665 1546149 1488530 1437318 1440677 1415350 1392606 1370140 1334224 1296094 1295133 1328121 1357462
$$ packed form
12698H330594j49243j66196j82291k10337j91665j93752j73774j99449j94533
12689F669354k33457k24379j84732j74429j43746j58190j67827q5243m8863r4721
12679E153767j12477o8732p7578j06285j16558j18489j02118r0229r5661j37574
12669D128066j10840j26909j17326r7260q1826p4350p5167k7839l8993r7704r8767
12658C181085q5396n8079o9766n5339q6817o5929k0769n9783l4212l4582j2251
12647B598162n8452o9868q5948l7497m0090m9121n6718j7004k3464m4283m5338
12636B070379n7365l1069m6572q0841o3982o021j6493j5121n4170q8381l6699
12625A573665k7516n7619n1212L359k5327k2744k2466l5916l8130r61L2988K9341
$$ plain form
12613 1357462 1359073 1359385 1423409 1495626 1559534 1696332 1834732 1963430 2019363 1968166 1828158
12602 1828158 1686673 1634915 1570851 1502279 1426033 1375648 1345738 1307476 1264283 1206929 1203497
12591 1203497 1191148 1172785 1154553 1122833 1088407 1070118 1052930 1047922 987128 956230 950646 942948
12579 942948 924904 923676 899901 858693 824401 823152 838071 846425 826916 813298 800966 781701
12567 781701 772058 755792 697053 658136 646934 608581 580642 571125 563685 574813 614688 638106
12555 638106 627701 648292 627674 609200 619781 594857 607077 643978 611033 577999 553186
12544 553186 502913 460172 464757 470498 456279 482309 468125 443682 436606 430698 416550 355271
12532 355271 336895 356881 358332 328752 367452 390868 365257 392329 402186 328620 334346 356657
$$ packed form
12613A357462J611L12O4024P2217O3908J36798J38400J28698N5933n1197j40008
12602A828158j41485n1758o4064o8572p6246n0385k9910l8262m3193n7354l432
12591A203497j2349j8363j8232l1720l4426j8289j7188n008o0794l0898n584p698
12579I42948j8044j228k3775m1208l4292j249J4919Q354j9509j3618j2332j9265
12567G81701r643j6266n8739l8917j1202l8353k7939r517p440J1128L9875K3418
12555F38106j0405K0591k0618j8474J0581k4924J2220L6901l2945l3034k4813
12544E53186n0273m2741M585N741j4219K6030j4184k4443p076n908j4148o1279
12532C55271j8376J9986J451k9580L8700K3416k5611K7072R857p3566N726K2311
$$ plain form
12520 356657 330218 311313 312659 302924 279741 278819 286831 295529 284086 262994 276206 289755 268037
12507 268037 244087 227580 222868 262404 291235 287904 267149 244635 216258 229222 222777 226737
12495 226737 244073 221255 216297 214873 227319 209381 213737 232193 217538 201133 227453 222302
12483 222302 221488 204308 196874 189585 174450 171391 171182 203893 231171 218176 195772 197956 205390
12470 205390 198334 158322 120069 139077 147112 143343 172865 182639 200545 192210 172766 143478
12458 143478 137794 166536 149117 138252 137199 144856 109872 74391 74382 97857 98957 81934 49857
12445 49857 57447 62846 66455 112231 131898 123121 95020 59455 70502 84876 103709 110417 139144
12432 139144 158613 127420 89394 65665 71391 100507 118052 112941 109009 103090 55354 39529
$$ packed form
12520C56657k6439j8905J346r735k3183r22Q012Q698j1443k1092J3212J3549k1718
12507B68037k3950j6507m712L9536K8831l331k0755k2514k8377J2964o445L960
12495B26737J7336k2818m958j424J2446j7938M356J8456j4655j6405K6320n151
12483B22302q14j7180p434p289j5135l059k09L2711K7278j2995k2404K184P434
12470B05390p056m0012l8253J9008Q035l769K9522R774J7906q335j9444k9288
12458A43478n684K8742j7419j0865j053P657l4984l5481rK3475J100j7023l2077
12445D9857P590N399L609M5776J9667q777k8101l5565J1047J4374J8833O708K8727
12432A39144J9469l1193l8026k3729N726K9116J7545n111l932n919m7736j5825
$$ plain form
12420 39529 37567 63916 56436 57615 48452 50088 60881 54705 51932 44467 35843 46453 74474
12407 74474 68295 69874 97968 109159 88246 66650 73294 74707 54250 50403 44817 37709 39295
12394 39295 36671 20511 28557 30323 2667 11692 -15294 -29083 -23426 20538 21646 34296 37320
12381 37320 42662 43533 35738 12964 40258 102900 97225 81248 105080 100573 92462 96169 69194
12368 69194 56045 63618 50419 30661 44536 58830 84022 86929 74748 70415 43758 18787
12356 18787 24430 35246 60518 48683 53128 53982 64023 73577 67876 59169 79641 101589 115102
12343 115102 102392 74168 52857 43322 37593 47508 37447 56942 54314 13054 14394 27999
12331 27999 35413 51807 69698 67244 44508 16992 19748 10716 35187 68936 74588 60647 47649
$$ packed form
12420C9529j962K6349p480J179r163J636J0793o176k773p465q624J0610K8021
12407G4474o179J579K8094J1191k0913k1596O644J413k0457l847n586p108J586
12394C9295k624j6160Q046J766k7656R025k6986j3789N657M3964J108J2650L024
12381C7320N342Q71p795k2774K7294O2642n675j5977K3832m507q111L707k6975
12368F9194j3149P573j3199j9758J3875J4294K5192K907j2181m333k6657k4971
12356A8787N643J0816K5272j1835M445Q54J0041R554n701q707K0472K1948J3513
12343A15102j2710k8224k1311r535n729R915j0061J9495k628m1260J340J3605
12331B7999P414J6394J7891k454k2736k7516K756r032K4471L3749N652j3941j2998
$$ plain form
12318 47649 37431 36466 48300 25358 6853 30926 41417 24175 3605 -21181 -22433 -5765
12306 -5765 -10087 -7614 -14482 5174 26238 60480 21195 6926 20033 51107 85314 97148
12294 97148 102333 101019 103847 88679 54161 39755 68260 91877 87967 106688 147233 170358
12282 170358 189773 243298 368776 573597 864679 1097965 1154512 1002797 766536 570737
12272 570737 449423 334206 248550 201515 185565 185723 167872 177316 146428 108381 108028 98886
12260 98886 85573 75208 100252 118463 96259 78307 89646 97334 79333 56617 65603 63930
12248 63930 56899 45635 39411 40308 77401 98364 103897 92375 89790 89393 57376 51637 39017
12235 39017 44602 31593 -3140 -45561 -34066 -2484 -15241 -38764 -34741 -11640 40415 37632
$$ packed form
12318D7649j0218r65J1834k2942j8505K4073J0491j7242k0570k4786j252J6668
12306e765m322K473o868J9656K1064L4242l9285j4269J3107L1074L4207J1834
12294I7148N185j314K828j5168l4518j4406K8505K3617l910J8721M0545K3125
12282A70358J9415N3525J25478K04821K91082K33286N6547j51715k36261j95799
12272E70737j21314j15217q5656m7035j5950J58j7851R444l0888l8047l53r142
12260I8886j3313j0365K5044J8211k2204j7952J1339P688j8001k2716Q986j673
12248F3930p031j1264o224Q97L7093K0963N533j1522k585l97l2017n739j2620
12235C9017N585j3009l4733m2421J1495L1582j2757k3523M023K3101N2055k783
$$ plain form
12223 37632 6263 9022 23776 20316 9100 -10038 -18075 -19150 -16336 -8344 20476 16654 2936
12210 2936 36793 39659 -3877 -6504 -3401 -6545 14153 -8230 -4483 2686 42 -10412 -11000 -6304
12196 -6304 31519 41403 -19828 -21830 18122 5053 11993 5729 -2760 4909 20633 29978 39514
12183 39514 18058 5738 3535 -40236 -41859 -60555 -58578 -17043 18503 44077 30520 -21116
12171 -21116 -49527 -21419 -8583 -3924 -33787 -58606 -61701 -51434 -14348 21891 18274 6984
12159 6984 -1125 -5428 3353 15446 18494 -3090 18568 32825 -1051 33444 52502 15243 -1207
12146 -1207 -912 28978 47320 22788 27576 39366 54460 19152 15060 9991 4395 16826 -10070
12133 -10070 15836 64420 47961 -2274 -38539 -46264 -21559 870 11192 36208 68022 71098
$$ packed form
12223C7632l1369K759J4754l460j1216j9138q037j075K814P992K8820l822j3718
12210B936L3857K866m3536k627L103l144K0698k2383L747P169k644j0454n88M696
12196f304L7823R884o1231k002L9952j3069O940o264q489P669J5724R345R536
12183C9514k1456j2320k203m3771j623j8696J977M1535L5546K5574j3557n1636
12171b1116k8411K8108J2836M659k9863k4819l095J0267L7086L6239l617j1290
12159F984q109m303Q781J2093L048k1584K1658J4257l3876L4495J9058l7259j6450
12146a207K95K9890J8342k4532M788J1790J5094l5308m092n069n596J2431k6896
12133a0070K5906M8584j6459n0235l6265p725K4705K2429J0322K5016L1814L076
$$ plain form
12121 71098 41164 -24412 -43014 -18734 -11708 -16813 -40746 -39009 -34872 -21560 4492 11197 42708
12108 42708 41640 16443 22561 15349 13781 -20664 -46300 -44686 -13928 4185 8070 -8998 -18599
12095 -18599 -23230 -9724 2238 42832 53176 48970 39785 20396 26293 45849 45652 74635 71734
12082 71734 43638 17088 4387 -17060 308 21407 -5286 -33400 -33942 -22342 -33591 -42142
12070 -42142 -21616 1456 10832 3500 -33841 -53831 -55449 -38034 -57903 -81234 -106987 -79493
12058 -79493 -43643 5864 25548 20217 7357 -13672 -1283 -16845 -44996 -20367 34441 55805
12046 55805 53531 -5710 -69592 -51851 -20685 -2424 27517 28321 15154 16538 36128 20716
12034 20716 -13456 21782 34500 25624 24230 -10194 -4085 -28709 -29044 3313 -32062 -58082 -35380
$$ packed form
12121G1098k9934o5576j8602K4280P026n105k3933J737M137J3312K6052O705L1511
12108D2708j068k5197O118p212j568l4445k5636J614L0758J8113L885j7068r601
12095a8599m631J3506J1962M0594J0344m206r185j9389N897J9556j97K8983k901
12082G1734k8096k6550j2701k1447J7368K1099k6693k8114n42J1600j1249q551
12070d2142K0526K3072R376p332l7341j9990j618J7415j9869k3331k5753K7494
12058g9493L5850M9507J9684n331j2860k1029J2389j5562k8151K4629N4808K1364
12046E5805k274n9241o3882J7741L1166J8261K9941Q04j3167J384J9590j5412
12034B0716l4172L5238J2718q876j394l4424O109k4624l35L2357l5375k6020K2702
$$ plain form
12021 -35380 -7764 -6492 25901 37317 19987 11580 6349 18122 13357 16204 1769 -22631 33409
12008 33409 40450 48724 32323 19930 2669 -13490 1106 15390 -10636 -42783 -19031 -4672
11996 -4672 95 16238 31168 53496 43619 31294 -6283 -13652 -7598 5234 5804 22775 28546
11983 28546 142 4260 18940 39848 68999 31821 6963 -30492 -53112 -34002 -27003 8614
11971 8614 8430 16029 16060 40860 19615 -5966 6023 28382 14601 -12260 -20116 -37606 -29883
11958 -29883 -29433 -35015 -35331 -10115 5177 23212 15562 11870 8179 9400 16084 36289 60811 26509
11944 26509 2690 21049 20488 5149 -4377 -10906 -16635 -11646 23731 19755 -24196 -910 -4504
11931 -4504 -36598 -30246 -23453 -7222 13339 22194 20029 -10283 -21146 -40873 -54409 -44005 -42448
$$ packed form
12021c5380K7616J272L2393J1416j7330q407n231J1773m765K847j4435k4400N6040
12008C3409P041Q274j6401j2393j7261j6159J4596J4284k6026l2147K3752J4359
11996d672M767J6143J4930K2328r877j2325l7577p369O054J2832N70J6971N771
11983B8546k8404M118J4680K0908K9151l7178k4858l7455k2620J9110O999L5617
11971H614j84P599L1K4800k1245k5581J1989K2359j3781k6861p856j7490P723
11958b9883M50n582l16K5216J5292J8035p650l692l691J221O684K0205K4522l4302
11944B6509k3819J8359n61j5339r526o529n729M989L5377l976m3951K3286l594
11931d504l2094O352O793J6231K0561Q855k165l0312j0863j9727j3536J0404J557
$$ plain form
11918 -42448 -6650 14940 -45594 -44239 -48631 -25255 -13187 19005 10788 -10732 10878 11938
11906 11938 6351 1322 20330 11229 -25565 -47069 -39368 -27130 18261 42803 5198 -24348
11894 -24348 -54212 -60100 -11230 43750 59268 43127 29222 -10392 -34691 -10865 -23975 -41896
11882 -41896 -9668 -33566 -54403 -45016 -50632 -14029 -13220 -4618 6841 -5107 -10972 28235 12822
11869 12822 -14646 -6861 885 -11633 -5677 -3236 -10913 -23764 -9038 6368 5488 -26720 -40299
11856 -40299 -27949 -13034 -7173 -23899 -15048 -36406 -37589 -9730 3834 22323 -19190 -21266
11844 -21266 38159 27905 -14268 -7021 28232 48307 58498 71933 62005 54775 42380 672
11832 672 16643 16520 11620 12388 -14850 -2332 -19271 -42946 -44753 -55887 -26600 -5495 635
$$ packed form
11918d2448L5798K1590o0534J355m392K3376J2068L2192q217k1520K1610J060
11906A1938n587n029J9008r101l6794k1504P701J2238M5391K4542l7605k9546
11894b4348k9864n888M8870N4980J5518j6141j3905l9614k4299K3826j3110j7921
11882d1896L2228k3898k0837R387n616L6603Q09Q602J1459j1948n865L9207j5413
11869A2822k7468P785P746j2518N956K441p677j2851J4726J5406q80l2208j3579
11856d0299J2350J4915N861j6726Q851k1358j183K7859J3564J8489m1513k076
11844b1266N9425j0254m2173P247L5253K0075J0191J3435r928p230j2395m1708
11832F72J5971j23m900P68k7238J2518j6939k3675j807j1134K9287K1105O130
$$ plain form
11819 635 29225 40416 40084 19922 7811 13495 -2582 -39650 -45347 -18723 -1888 -19398 -40053
11806 -40053 -35630 -33188 -6931 25956 19653 -5880 -24540 -26628 -18334 -26919 -6916 22360 41793
11793 41793 60293 31908 46286 41882 68447 81972 62414 50515 29004 38671 32395 -2276
11781 -2276 -12396 25647 46632 25514 -8625 4597 23477 32429 23779 4017 -1222 -8930 -29313
11768 -29313 -33323 -32542 -45310 -39171 27612 52731 30620 18410 31164 31072 28034 13015 24154
11755 24154 31104 26772 9211 10313 22139 39327 42435 38149 -6912 -50551 -36905 -35486 -47520
11742 -47520 -15218 -13155 -22489 -16227 -17576 -71537 -81885 -51005 -24395 24358 2197 -22555
11730 -22555 5958 -3131 -17334 1329 44731 59682 23425 7663 23586 18215 39017 49728
$$ packed form
11819F35K8590J1191l32k0162j2111N684j6077l7068n697K6624J6835j7510k0655
11806d0053M423K442K6257L2887o303k5533j8660k088Q294q585K0003K9276J9433
11793D1793J8500k8385J4378m404K6565J3525j9558j1899k1511R667o276l4671
11781b276j0120L8043K0985k1118l4139J3222J8880Q952q650j9762n239p708k0383
11768b9313m010P81j2768O139O6783K5119k2111j2210J2754r2l038j5019J1139
11755B4154O950m332j7561J102J1826J7188L108m286m5061m3639J3646J419j2034
11742d7520L2302K063r334O262j349n3961j0348L0880K6610M8753k2161k4752
11730b2555K8513r089j4203J8663M3402J4951l6257j5762J5923n371K0802J0711
$$ plain form
11718 49728 30052 35994 50801 43804 22014 20440 23031 13880 12090 16628 -34289 -52487 -35829
11705 -35829 -13829 -8372 -797 16051 34473 -3398 -6862 31060 66136 96828 104328 69324
11693 69324 9621 -11949 -20689 -41850 6015 25983 25621 -8597 -18782 -15242 20187 29509 -17863
11680 -17863 -26585 -1207 -1372 15572 25166 31401 27392 18612 55441 77388 70586 71112 78187 49320
11666 49320 41427 52851 -3725 -17226 3374 11976 43740 47448 38107 27385 41237 43207 42763
11653 42763 32797 20707 222 -32602 -15558 19835 3570 6585 28732 22563 20863 37590
11641 37590 21605 10891 -11018 -24051 -24149 9977 26311 52326 55693 23518 2654 41339
11629 41339 43659 77432 132271 143171 119890 121082 131770 126544 131186 114101 116896 151551 118576
$$ packed form
11718D9728j9676N942J4807o997k1790j574K591r151j790M538n0917j8198J6658
11705c5829K2000N457P575J6848J8422l7871l464L7922L5076L0692P500l5004
11693F9324n9703k1570q740k1161M7865J9968l62l4218j0185L540L5429R322m7372
11680a7863q722K5378j65J6944R594O235m009q780L6829K1947o802N26P075k8867
11666D9320p893J1424n6576j3501K0600Q602L1764L708r341j0722J3852J970m44
11653D2763r966j2090k0485l2824J7044L5393j6265L015K2147o169j700J6727
11641C7590j5985j0714k1909j3033r8L4126J6334K6015L367l2175k0864L8685
11629D1339K320L3773N4839J0900k3281J192J0688n226M642j7085K795L4655l2975
$$ plain form
11616 118576 87442 97710 103324 126825 87001 54065 46741 44164 48743 44062 37683 38748 41838
11603 41838 67069 70411 68206 49298 54985 39093 12441 13419 31404 57092 36495 26039 70486
11590 70486 91560 111312 105594 96525 72544 48608 42367 60984 46785 24639 38660 71233
11578 71233 113603 133805 136935 95677 125979 162968 174034 129680 107668 105305 144526 152900
11566 152900 132761 92753 58740 74116 89847 98194 115877 106451 96451 80275 46196 49229
11554 49229 29353 5765 -21215 -19026 17907 46737 70581 5014 -10950 21498 25460 31743
11542 31743 1159 7759 38666 54608 40477 19563 12441 12993 11360 22270 29672 16550 4350
11529 4350 24908 35535 34744 28426 16046 23071 13387 -26009 1348 33460 36400 26082 -1819
$$ packed form
11616A18576l1134J0268N614K3501l9824l2936p324k577M579m681o379J065L090
11603D1838K5231L342k205j8908N687j5892k6652R78J7985K5688k0597j0456M4447
11590G0486K1074J9752n718r069k3981k3936o241J8617j4199k2146J4021L2573
11578G1233M2370K0202L130m1258L0302L6989J1066m4354k2012k363L9221Q374
11566A52900k0139m0008l4013J5376J5731Q347J7683r426j0000j6176l4079L033
11554D9229j9876k3588k6980K189L6933K8830K3844o5567j5964L2448L962O283
11542C1743l0584O600L0907J5942j4131k0914p122N52j633J0910P402j3122j2200
11529D350K0558J0627p91o318j2380P025r684l9396K7357L2112K940j0318k7901
$$ plain form
11516 -1819 996 52840 46942 29974 38056 59246 39401 18540 -513 -26586 -39646 -17113
11504 -17113 -6297 17883 52628 41869 -4289 7396 37590 48645 57208 57759 50971 62336
11492 62336 45597 34582 40265 17266 1109 -4539 -1069 -3483 47574 72713 43899 58991
11480 58991 54364 44511 48858 23099 25743 36973 52165 43853 18516 4476 4924 -3232 26985
11467 26985 24934 -15274 -8304 -13225 7827 19033 33141 38139 42267 29585 30577 30375 9980
11454 9980 8706 40612 66298 99326 108243 76416 11023 1002 29675 43720 34748 32041 53149
11441 53149 27600 42945 54036 64763 72921 87171 72511 73154 59652 64808 69103 37506 -2932
11428 -2932 -2160 35809 38501 32489 48507 57915 38057 44465 67430 51077 21133 35391 34216
$$ packed form
11516a819K815N1844n898j6968Q082K1190j9845k0861j9053k6073j3060K2533
11504a7113J0816K4180L4745j0759m6158J1685L0194J1055Q563N51o788J1365
11492F2336j6739j1015N683k2999j6157n648L470k414N1057K5139k8814J5092
11480E8991m627r853M347k5759K644J1230J5192q312k5337j4040M48q156L0217
11467B6985k051m0208O970m921K1052J1206J4108M998M128j2682R92k02k0395
11454I980j274L1906K5686L3028Q917l1827o5393j0021K8673J4045q972k707K1108
11441E3149k5549J5345J1091J0727Q158J4250j4660O43j3502N156M295l1597m0438
11428b932P72L7969K692o012J6018R408j9858O408K2965j6353k9944J4258j175
$$ plain form
11415 34216 56710 41072 12129 5351 56793 78301 100217 80980 40465 45006 56775 55004
11403 55004 110974 141080 143684 122986 118044 177890 218166 194943 168684 119499 97239 104130
11391 104130 117662 94632 66755 71496 96847 125409 83912 102362 115119 74179 76276 124159
11379 124159 156994 130544 136020 145237 108366 78179 71627 61255 107183 132376 148682 128636
11367 128636 137303 119363 88163 105315 94173 100496 115254 100143 100887 106108 126450 149792
11355 149792 163381 193221 203442 224381 243102 276849 285226 283465 250877 242388 246681 217880
11343 217880 233405 244819 227571 213125 235010 230681 220470 244016 282883 294063 286562 304437
11331 304437 326698 282375 291184 311054 299911 256858 247945 260745 280563 274198 245273 288724
$$ packed form
11415C4216K2494j5638k8943o778N1442K1508K1916j9237m0515M541J1769j771
11403E5004N5970L0106K604k0698m942N9846M0276k3223k6259m9185k2260O891
11391A04130J3532k3030k7877M741K5351K8562m1497J8450J2757m0940K097M7883
11379A24159L2835k6450N476R217l6871l0187o552j0372M5928K5193J6306k0046
11367A28636Q667j7940l1200J7152j1142O323J4758j5111P44N221K0342K3342
11355A49792J3589K9840J0221K0939J8721L3747Q377j761l2588q489M293k8801
11343B17880J5525J1414j7248j4446K1885m329j0211K3546L8867J1180p501J7875
11331C04437K2261m4323Q809J9870j1143m3053q913J2800J9818o365k8925M3451
$$ plain form
11319 288724 295874 285615 271316 229168 237125 286720 314840 314428 316756 302460 341235 397857
11307 397857 409596 426705 428143 483812 535952 574616 624174 684641 767211 853879 903381 957537
11295 957537 1022876 1104356 1209841 1306265 1467995 1614532 1786111 1979132 2237725 2655174
11285 2655174 3307714 4260248 5584307 7168533 8645192 9631755 10286006 11236019 12782182
11276 12782182 14546327 15600709 15217608 13811770 12491437 11872791 11576660 11018868 9837451
11267 9837451 8287540 6886855 5836118 5109772 4612055 4246466 3953629 3750768 3613776
11258 3613776 3528190 3519885 3558487 3673154 3873161 4239548 4756548 5325562 5738583 5845958
11248 5845958 5734893 5724892 5968370 6333750 6501856 6372839 6167013 6237939 6726380 7674123
$$ packed form
11319B88724P150j0259j4299m2148P957M9595K8120m12K328j4296L8775N6622
11307C97857J1739J7109J438N5669N2140L8664M9558O0467Q2570Q6668M9502N4156
11295I57537O5339Q1480J05485R6424J61730J46537J71579J93021K58593M17449
11285B655174O52540R52534J324059J584226J476659R86563O54251R50013J546163
11276A2782182J764145J054382l83101j405838j320333o18646k96131n57792j181417
11267I837451j549911j400685j050737p26346m97717l65589k92837k02861j36992
11258C613776q5586q305L8602J14667K00007L66387N17000N69014M13021J07375
11248E845958j11065j0001K43478L65380J68106j29017k05826P0926M88441R47743
$$ plain form
11238 7674123 9183395 11091237 12994802 14527268 15796248 17178790 18667072 19921328
11230 19921328 20789471 21453739 22104729 22542294 22064247 20456524 18549690 17190007 16548138
11221 16548138 16162006 15323362 13932243 12445910 11425486 11077230 11434175 12267544 13027935
11212 13027935 13140934 12530380 11950571 11934157 12303996 12437558 11756030 10428687 9158403
11203 9158403 8338869 8002212 8112472 8575380 9054358 9232101 9112880 8960717 9062438
11194 9062438 9367665 9538475 9198071 8391515 7616954 7100015 6792685 6667442 6701150 6894807
11184 6894807 7283703 7982528 9097922 10808201 13126715 15821504 18321828 20262320
11176 20262320 21963144 23828090 25576817 26353644 25751012 24272880 22740172 21365057
$$ packed form
11238G674123J509272J907842J903565J532466J268980J382542J488282J254256
11230A9921328Q68143O64268O50990M37565m78047j607723j906834j359683o41869
11221A6548138l86132q38644j391119j486333j020424l48256L56945Q33369P60391
11212A3027935J12999o10554n79809j6414L69839J33562o81528j327343j270284
11203I158403q19534l36657J10260M62908M78978J77743j19221j52163J01721
11194I062438L05227J70810l40404q06556p74561n16939l07330j25243L3708J93657
11184F894807L88896O98825J115394J710279K318514K694789K500324J940492
11176B0262320J700824J864946J748727P76827o02632j478132j532708j375115
$$ plain form
11168 21365057 19628836 17203298 14447269 12087349 10297113 8971900 8036114 7334299
11160 7334299 6834475 6408197 6046987 5703745 5399009 5122315 4899114 4692640 4549291
11151 4549291 4402240 4254098 4091711 3955673 3771994 3600291 3496206 3422863 3317463 3206388
11141 3206388 3135701 3025944 2937787 2853590 2777251 2700769 2621597 2544368 2516673 2453612 2378457
11130 2378457 2326928 2276636 2233882 2186850 2142570 2108173 2065719 2012580 1969725 1927343 1887283
11119 1887283 1868512 1835141 1782129 1736130 1721676 1674798 1640522 1582573 1538595 1520777 1498853
11108 1498853 1445067 1446557 1451509 1414288 1378352 1398707 1374748 1350928 1319819 1294562 1284464 1300115
11096 1300115 1277027 1226882 1214798 1203203 1191474 1171283 1121555 1039578 1014275 1033659 1036967
$$ packed form
11168B1365057j736221k425538k756029k359920j790236j325213r35786p01815
11160G334299m99824m26278l61210l43242l04736k76694k23201k06474j43349
11151D549291j47051j48142j62387j36038j83679j71703j04085p3343j05400j11075
11141C206388p0687j09757q8157q4197p6339p6482p9172p7229k7695o3061p5155
11130B378457n1529n0292m2754m7032m4280l4397m2454n3139m2855m2382m0060
11119A887283j8771l3371n3012m5999j4454m6878l4276n7949m3978j7818k1924
11108A498853n3786J490M952l7221l5936K0355k3959k3820l1109k5257j0098J5651
11096A300115k3088n0145j2084j1595j1729k0191m9728q1977k5303J9384L308
$$ plain form
11085 1036967 1041127 1003912 984840 975360 983779 986667 952795 942035 922159 858020 805283 807596
11073 807596 845338 883053 871915 856413 851145 852741 845495 826469 851981 889288 949539 954913
11061 954913 965023 960452 919434 902189 917647 883307 847021 776290 725331 714426 716951 689758
11049 689758 676873 691669 666321 644964 622379 615968 626760 633895 622150 623474 612460 605833
11037 605833 617674 647110 643437 611832 577578 498837 413250 391825 405763 431782 437237 429002
11025 429002 423373 395816 361438 398461 417708 387263 374576 384038 412163 406442 391940 393956
11013 393956 366669 354251 342001 347310 329950 293215 280830 254490 229354 242182 242138 266081
11001 266081 309087 361223 376108 334594 306388 276936 271780 264666 265704 238467 221716 218792
$$ packed form
11085A036967M160l7215j9072r480Q419K888l3872j0760j9876o4139n2737K313
11073H07596L7742L7715j1138j5502n268J596p246j9026K5512L7307O0251N374
11061I54913J0110m571m1018j7245J5458l4340l6286p0731n0959j0905K525k7193
11049F89758j2885J4796k5348k1357k2585o411J0792P135j1745J324j1014o627
11037F05833J1841K9436l673l1605l4254p8741q5587k1425J3938K6019N455q235
11025D29002n629k7557l4378L7023J9247l0445j2687R462K8125n721j4502K016
11013C93956k7287j2418j2250N309j7360l6735j2385k6340k5136J2828m4K3943
11001B66081M3006N2136J4885m1514k8206k9452n156p114J038k7237j6751k924
$$ plain form
10989 218792 248272 280815 280556 244433 236942 251485 251376 214745 204449 208230 223705 222969 229585
10976 229585 215676 228264 228281 231713 212697 216612 246210 243429 217292 186918 157822 128638 152541
10963 152541 187006 223748 218315 185794 199572 195240 169718 138235 109726 113351 113784 89890
10951 89890 123694 164740 174623 204228 236838 262537 283303 337466 376179 381820 397222 418167
10939 418167 407547 386718 350141 369650 442500 518643 563809 594110 644820 667410 604672
10928 604672 505511 439645 383728 333074 328497 377340 402400 383254 329957 328305 310059 302296
10916 302296 275380 252634 239917 209459 218874 247332 266935 291276 333833 365356 355038 354143
10904 354143 352174 338735 306367 273854 226367 207574 238003 297212 309844 327166 313111 337961
$$ packed form
10989B18792K9480L2543k59l6123p491J4543j09l6631j0296L781J5475p36O616
10976B29585j3909J2588J7L432j9016L915K9598k781k6137l0374k9096k9184K3903
10963A52541L4465L6742n433l2521J3778m332k5522l1483k8509L625M33k3894
10951H9890L3804M1046R883K9605L2610K5699K0766N4163L8713N641J5402K0945
10939D18167j0620k0829l6577J9509P2850P6143M5166L0301N0710K2590o2738
10928F04672r9161o5866n5917n0654m577M8843K5060j9146n3297j652j8246p763
10916C02296k6916k2746j2717l0458R415K8458J9603K4341M2557L1523j0318q95
10904C54143j969j3439l2368l2513m7487j8793L0429N9209J2632J7322j4055K4850
$$ plain form
10892 337961 357576 395645 386294 374824 421036 449058 421814 409993 398312 398846 385917 399023
10880 399023 442538 418247 388127 400742 368021 353188 330472 341205 366929 357625 352456 346215
10868 346215 347087 367059 426219 419509 418871 440575 408661 360032 359244 386290 450586 494436 505941
10855 505941 499774 487607 491832 508884 544039 568261 583037 637568 693830 687972 678812 714808
10843 714808 781308 871634 962360 1015486 1106845 1232778 1340584 1421835 1520466 1650568 1861588
10832 1861588 2091560 2343333 2634198 3005079 3482189 4125297 5056878 6405760 8392283
10823 8392283 11207491 14896266 19196026 23364614 26526771 28296806 28838447 28235577
10815 28235577 26278012 22993751 19152041 15625163 12872034 10887061 9480374 8492489
$$ packed form
10892C37961J9615L8069r351j1470M6212K8022k7244j1821j1681N34j2929J3106
10880C99023M3515k4291l0120J2615l2721j4833k2716J0733K5724r304n169o241
10868C46215Q72J9972N9160o710o38K1704l1914m8629p88K7046O4296M3850J1505
10855E05941o167j2167M225J7052L5155K4222J4776N4531N6262n858r160L5996
10843G14808O6500R0326R0726N3126R1359J25933J07806Q1251R8631J30102K11020
10832A861588K29972K51773K90865L70881M77110O43108R31581J348882J986523
10823H392283K815208L688775M299760M168588L162157J770035N41641o02870
10815B8235577j957565l284261l841710l526878k753129j984973j406687r87885
$$ plain form
10807 8492489 7768117 7212639 6781113 6461713 6246510 6194943 6264018 6429047 6800019 7454302
10797 7454302 8341544 9248322 9754689 9517484 8667577 7632991 6784021 6208034 5959943
10788 5959943 5966549 6233257 6810627 7861861 9527645 11668100 13792672 15145737 15075066
10779 15075066 13614291 11671167 10023796 8950983 8459259 8493230 8963858 9928084 11475361
10770 11475361 13662918 16323277 18846544 20515533 21020698 20854249 20899707 21664346 23012047
10761 23012047 24305651 25014145 24972433 24089653 22203528 19423063 16374007 13755151 11816931
10752 11816931 10491350 9651666 9179645 9027854 9151337 9517842 10047533 10654888 11034185
10743 11034185 10851499 10083728 8944714 7815178 6952878 6337467 5903031 5603738 5440010
$$ packed form
10807H492489p24372n55478m31526l19400k15203n1567O9075J65029L70972O54283
10797G454302Q87242R06778N06367k37205q49907j034586q48970n75987k48091
10788E959943O606K66708N77370J051234J665784K140455K124572J353065p0671
10779A5075066j460775j943124j647371j072813m91724L3971M70628R64226J547277
10770A1475361K187557K660359K523267J668989N05165j66449M5458P64639J347701
10761B3012047J293604P08494m1712q82780j886125k780465l049056k618856j938220
10752A1816931j325581q39684m72021j51791J23483L66505N29691O07355L79297
10743A1034185j82686p67771j139014j129536q62300o15411m34436k99293j63728
$$ plain form
10734 5440010 5272500 5175864 5131387 5095347 5063838 5101862 5213012 5414526 5714283 6142474
10724 6142474 6843428 7925745 9501447 11585903 13956356 16035110 17237942 17465016
10716 17465016 17216119 17153451 17384994 17359339 16496563 14691188 12418960 10366457 8756709
10707 8756709 7615993 6789803 6170186 5689546 5276650 4964747 4651960 4390165 4188313
10698 4188313 4004804 3810964 3689249 3528313 3385510 3281346 3191798 3145659 3045708 2938766
10688 2938766 2861386 2760613 2683987 2605053 2523275 2468028 2412007 2355419 2291916 2225304 2172071
10677 2172071 2147275 2087398 2036923 1976904 1949745 1897464 1858471 1827019 1779670 1740249 1728221
10666 1728221 1729533 1712398 1648168 1569872 1516474 1502537 1470681 1441975 1417308 1409882 1386518 1348640
$$ packed form
10734E440010j67510r6636m4477l6040l1509L8024J11150K01514K99757M28191
10724F142474P00954J082317J575702K084456K370453K078754J202832K27074
10716A7465016k48897o2668K31543k5655q62776j805375k272228k052503j609748
10707H756709j140716q26190o19617m80640m12896l11903l12787k61795k01852
10698D188313j83509j93840j21715j60936j42803j04164q9548m6139r9951j06942
10688B938766p7380j00773p6626p8934q1778n5247n6021n6588o3503o6612n3233
10677B172071k4796n9877n0475o0019k7159n2281l8993l1452m7349l9421j2028
10666A728221J312j7135o4230p8296n3398j3937l1856k8706k4667p426k3364l7878
$$ plain form
10654 1348640 1327816 1298635 1242712 1204120 1223741 1222795 1179175 1170197 1157272 1145721 1137564 1116436
10642 1116436 1095940 1081389 1082939 1098335 1112608 1091775 1073841 1081413 1089973 1046778 1031408 1002997
10630 1002997 971807 918696 846937 848771 852594 835144 786201 756974 777153 798842 789001 762083
10618 762083 769960 739397 711901 671007 674324 680692 641121 637118 627171 585185 579362 589295 606051
10605 606051 609930 574195 572358 563362 542553 526648 547113 566090 581201 563578 579898 589371
10593 589371 615414 642394 627575 607120 608919 620121 644766 643118 631628 605044 629253 661898
10581 661898 663187 679906 656318 611299 560490 536913 577938 595225 574871 518799 495674 469775
10569 469775 443624 423312 408560 418912 415446 397869 352857 368173 360649 337930 334296 330054
$$ packed form
10654A348640k0824k9181n5923l8592J9621r46m3620q978j2925j1551q157k1128
10642A116436k0496j4551J550J5396J4273k0833j7934P572Q560m3195j5370k8411
10630A002997l1190n3111p1759J834L823j7450m8943k9227K0179K1689r841k6918
10618G62083P877l0563k7496m0894L317O368l9571m003r947m1986n823R933J6756
10605F06051L879l5735j837q996k0809j5905K0465J8977J5111j7623J6320R473
10593E89371K6043K6980j4819k0455J799J1202K4645j648j1490k6584K4209L2645
10581F61898J289J6719k3588m5019n0809k3577M1025J7287k0354n6072k3125k5899
10569D69775k6151k0312j4752J0352l466j7577m5012J5316p524k2719l634m242
$$ plain form
10557 330054 346432 331151 312785 307096 296164 328069 321223 344386 369595 368317 376822 354558
10545 354558 363907 356830 303308 238719 223753 278498 327848 341142 317162 277788 274217 293029
10533 293029 318197 300277 266541 280145 318302 330493 338372 334749 312872 261038 273243 319359
10521 319359 327337 334413 348455 326366 320387 279825 253245 241454 224951 204095 181046 156100
10509 156100 135014 118940 103190 108682 106357 131152 199242 216755 205881 193993 214931 243787
10497 243787 271947 303786 291609 239472 195044 195595 182622 173557 156750 152153 166632 169103
10485 169103 175426 187913 173230 150446 146622 124013 113482 168357 174650 186996 217720 222229
10473 222229 209336 180570 161963 134751 143030 148021 120195 101009 103168 133797 123286 85851
$$ packed form
10557C30054J6378j5281j8366n689j0932L1905o846K3163K5209j278Q505k2264
10545C54558R349p077n3522o4589j4966N4745M9350J3294k3980l9374l571J8812
10533B93029K5168j7920l3736J3604L8157J2191P879l623k1877n1834J2205M6116
10521C19359P978P076J4042k2089n979m0562k6580j1791j6503k0856k3049k4946
10509A56100k1086j6074j5750N492k325K4795O8090J7513j0874j1888K0938K8856
10497B43787K8160L1839j2177n2137m4428N51j2973r065j6807m597J4479K471
10485A69103O323J2487j4683k2784l824k2609j0531N4875O293J2346L0724M509
10473B22229j2893k8766j8607k7212Q279M991k7826j9186K159L0629j0511l7435
$$ plain form
10461 85851 129382 252630 483687 777229 1063999 1430452 1787765 2068910 2251564 2351569
10451 2351569 2335390 2162812 1945362 1711333 1528057 1429930 1358819 1330035 1327930 1308061 1259728
10440 1259728 1245345 1221092 1176656 1149152 1141998 1102797 1081092 1084704 1049887 1009665 987857 1012554
10428 1012554 997503 949270 928296 938627 972750 951470 934807 965326 1006404 1020194 1037179
10417 1037179 1025031 988558 959947 944354 925228 902824 906654 921898 947836 985497 972407
10406 972407 942320 973758 1031112 1062217 1068199 1046827 1053644 1116326 1175757 1241057 1292090 1320454
10394 1320454 1343577 1354563 1304151 1234097 1141307 1122954 1131751 1142201 1139976 1195706 1181892 1208830
10382 1208830 1230732 1241756 1278609 1359958 1394447 1428942 1463116 1481358 1509409 1550081 1580358
$$ packed form
10461H5851M3531J23248K31057K93542K86770L66453L57313K81145J82654J00005
10451B351569j6179j72578k17450k34029j83276r8127p1111k8784k105j9869m8333
10440A259728j4383k4253m4436k7504p154l9201k1705L612l4817m0222k1808K4697
10428A012554j5051m8233k0974J0331L4123k1280j6663L0519M1078J3790J6985
10417A037179j2148l6473k8611j5593j9126k2404L830J5244K5938L7661j3090
10406I72407l0087L1438N7354L1105N982k1372O817O2682N9431O5300N1033K8364
10394A320454K3123J0986n0412p0054r2790j8353Q797J0450k225N5730j3814K6938
10382A208830K1902J1024L6853Q1349L4489L4495L4174J8242K8051M0672L0277
$$ plain form
10371 1580358 1649372 1740279 1807491 1887422 1979775 2074726 2203626 2345983 2509202 2712720
10361 2712720 2895248 3025326 3164013 3316829 3482543 3678138 3975169 4308736 4707098
10352 4707098 5234333 5913489 6718824 7578133 8549331 9713813 11021693 12495858 13912682
10343 13912682 15128553 16166814 17344273 19096703 21679820 25394891 30566753 37904684
10335 37904684 48516610 64374732 88942057 127854094 187843369 269533016 353998354
10328 353998354 402405105 384252461 311348970 230416221 169735365 129923780 104146009
10321 104146009 86915709 74764122 65740057 58711738 53129505 48667257 45148597 42365642
10313 42365642 40118991 38160667 36243335 34256811 32267138 30400921 28707867 27246468
$$ packed form
10371A580358O9014R0907O7212P9931R2353R4951J28900J42357J63219K03518
10361B712720J82528J30078J38687J52816J65714J95595K97031L33567L98362
10352D707098N27235O79156Q05335Q59309R71198J164482J307880J474165J416824
10343A3912682J215871J038261J177459J752430K583117L715071N171862P337931
10335C7904684J0611926J5858122K4567325L8912037N9989275Q1689647Q4465338
10328C53998354M8406751j8152644p2903491q0932749o0680856l9811585k5777771
10321A04146009j7230300j2151587r024065p028319n582233m462248l518660k782955
10313D2365642k246651j958324j917332j986524j989673j866217j693054j461399
$$ plain form
10305 27246468 25947985 24823597 23843688 22959727 22098623 21243437 20462187 19739655 19091408
10296 19091408 18494624 17953483 17490495 17074063 16655255 16288491 15866687 15468786 15018034
10287 15018034 14580282 14105457 13690194 13283538 12889756 12532813 12179217 11853526 11504051
10278 11504051 11192825 10954059 10778899 10612792 10441843 10213196 10013230 9802380 9598845
10269 9598845 9395311 9195116 8966358 8719348 8456344 8212854 8006967 7812232 7611606
10260 7611606 7471389 7322896 7139330 6973331 6805047 6687141 6536859 6379053 6252578
10251 6252578 6132484 6052941 5932129 5802840 5700386 5592213 5493191 5406425 5278966 5134316
10241 5134316 5046394 4963265 4885008 4770437 4661707 4571327 4483850 4431269 4335841 4272545 4219984
$$ packed form
10305B7246468j298483j124388r79909q83961q61104q55186p81250p22532o48247
10296A9091408n96784n41141m62988m16432m18808l66764m21804l97901m50752
10287A5018034m37752m74825m15263m06656l93782l56943l53596l25691l49475
10278A1504051l11226k38766j75160j66107j70949k28647j99966k10850k03535
10269I598845k03534k00195k28758k47010k63004k43490k05887j94735k00626
10260G611606j40217j48493j83566j65999j68284j17906j50282j57806j26475
10251F252578j20094p9543j20812j29289j02454j08173r9022q6766j27459j44650
10241E134316q7922q3129p8257j14571j08730r0380q7477n2581r5428o3296n2561
$$ plain form
10230 4219984 4178070 4062501 3942394 3811836 3712049 3619218 3508261 3413580 3355674 3311499
10220 3311499 3233405 3148672 3067572 2993748 2931369 2902330 2872467 2819114 2753206 2698539 2684557
10209 2684557 2690253 2691314 2737998 2819990 2936895 3143465 3383783 3587323 3772718 3872359 3843654
10198 3843654 3697712 3521924 3343736 3213148 3075714 2927776 2821215 2751326 2685713 2591038
10188 2591038 2519092 2460751 2429426 2378255 2329919 2288134 2196672 2147936 2149896 2109296 2078689
10177 2078689 2043394 1992724 1951697 1910394 1841101 1768113 1737901 1738150 1774118 1743974 1712847 1642340
10165 1642340 1548910 1504128 1501557 1493558 1495326 1486921 1426552 1384179 1357174 1321768 1287885 1245980
10153 1245980 1271942 1309387 1304306 1291527 1305441 1305769 1287377 1262273 1238792 1227866 1231424 1214804
$$ packed form
10230D219984m1914j15569j20107j30558r9787r2831j10957r4681n7906m4175
10220C311499p8094q4733q1100p3824o2379k9039k9863n3353o5908n4667j3982
10209B684557N696J061M6684Q1992J16905K06570K40318K03540J85395R9641k8705
10198C843654j45942j75788j78188j30588j37434j47938j06561o9889o5613r4675
10188B591038p1946n8341l1325n1171m8336m1785r1462m8736J960m0600l0607
10177B078689l5295n0670m1027m1303o9293p2988l0212K49L5968l0144l1127p0507
10165A642340r3430m4782k571p999J768q405o0369m2373k7005l5406l3883m1905
10153A245980K5962L7445n081j2779J3914L28j8392k5104k3481j0926L558j6620
$$ plain form
10141 1214804 1183139 1122807 1042714 1024877 1005060 963990 958997 949025 911092 897021 885136 844826
10129 844826 851004 890278 910778 888208 875894 857432 822068 813032 798577 776893 802082 822505
10117 822505 786190 763715 766101 755999 710937 663644 635585 656682 679087 651705 642673 639180
10105 639180 633217 643518 623626 610450 627121 630166 619420 596141 562260 536277 542082 562077
10093 562077 577168 560274 543399 544961 525259 533293 552118 540617 534721 524336 537333 539155
10081 539155 492411 460822 472068 507501 505350 479003 417602 369016 374456 386436 391911 399308
10069 399308 411548 393748 392985 413741 415760 401523 367435 369130 357503 366528 395845 391522 403026
10056 403026 429983 407763 392966 388323 374698 384823 377708 350927 350598 371220 381751 356194
$$ packed form
10141A214804l1665o0332q0093j7837j9817m1070m993r972l7933j4071j1885m0310
10129H44826O178L9274K0500k2570j2314j8462l5364r036j4455k1684K5189K0423
10117H22505l6315k2475K386j0102m5062m7293k8059K1097K2405k7382r032l493
10105F39180n963J0301j9892j3176J6671L045j0746k3279l3881k5983N805J9995
10093E62077J5091j6894j6875J562j9702Q034J8825j1501n896j0385J2997J822
10081E39155m6744l1589J1246L5433k151k6347o1401m8586N440J1980N475P397
10069C99308J2240j7800p63K0756K019j4237l4088J695j1627R025K9317m323J1504
10056D03026K6957k2220j4797m643j3625J0125p115k6781l29K0622J0531k5557
$$ plain form
10044 356194 341029 338379 342865 325069 313843 283795 282511 296718 287060 279123 286476 270101 245876
10031 245876 245816 235969 256344 262585 217738 226319 272953 269705 223113 191992 179087 140035 166456
10018 166456 170628 188163 206968 232368 249420 228448 200087 217562 215688 156901 151380 151890
10006 151890 164768 200584 175109 142678 143145 140030 98444 60817 66639 109981 138824 153178
9994 153178 143823 120313 106000 98702 99373 125298 118587 118848 124356 128875 152289 155113 152479 142670
9980 142670 138568 135126 145125 124810 99785 98571 106017 99069 93094 59909 63584 111046 114458
9967 114458 98661 102818 104482 90544 110735 104642 102449 106202 73462 35706 66717 51052 61428
9954 61428 80363 83444 79281 97760 94693 94360 122589 128284 128321 134272 169332 122441 133344 183944
$$ packed form
10044C56194j5165k650M486j7796j1226l0048j284J4207r658p937P353j6375k4225
10031B45876o0r847K0375O241m4847Q581M6634l248m6592l1121j2905l9052K6421
10018A66456M172J7535J8805K5400J7052k0972k8361J7475j874n8787n521N10
10006A51890J2878L5816k5475l2431M67l115m1586l7627N822M3342K8843J4354
9994A53178r355k3510j4313p298O71K5925o711K61N508M519K3414K824k634r809
9980A42670m102l442R999k0315k5025j214P446o948n975l3185L675M7462L412
9967A14458j5797M157J664j3938K0191o093k193L753l2740l7756L1011j5665J0376
9954F1428J8935L081m163J8479l067l33K8229N695L7N951L5060m6891J0903N0600
$$ plain form
9940 183944 163516 104572 98057 92988 100467 131072 186200 226012 199178 144548 127000 100883
9928 100883 107403 138800 165759 165504 141848 126605 121669 137901 122907 145965 182342 200885
9916 200885 205618 221071 222478 285623 326007 417244 594544 773150 951336 1153720 1346977
9905 1346977 1490063 1552059 1500914 1358886 1166128 969524 840069 744808 652107 581282
9895 581282 479883 413376 359716 325003 304499 252250 239762 254837 257336 194023 138720 166466
9883 166466 198402 192426 181874 196539 231201 238594 207726 182116 139521 124721 153262 192095
9871 192095 224194 223257 240443 249558 254849 243221 230276 239300 250780 288072 355722 481913
9859 481913 642933 853869 934857 841050 659089 478754 344541 266172 245906 233745 215965
$$ packed form
9940A83944k0428n8944o515n069P479L0605N5128L9812k6834n4630j7548k6117
9928A00883O520L1397K6959k55k3656j5243m936J6232j4994K3058L6377J8543
9916B00885M733J5453J407O3145M0384R1237J77300J78606J78186K02384J93257
9905A346977J43086O1996n1145j42028j92758j96604j29455r5261r2701p0825
9895E81282j01399o6507n3660l4713k0504n2249j2488J5075K499o3313n5303K7746
9883A66466L1936n976j0552J4665L4662P393l0868k5610m2595j4800K8541L8833
9871A92095L2099r37J7186R115N291j1628j2945R024J1480L7292O7650J26191
9859D81913J61020K10936Q0988r3807j81961j80335j34213p8369k0266j2161j7780
$$ plain form
9848 215965 208721 199231 173932 139333 109259 123058 146321 169843 194218 174745 165026 170418
9836 170418 175438 191352 169236 137160 105396 117537 112295 107722 91684 95308 121326 144923
9824 144923 153475 124817 91994 48316 23136 41250 51857 25641 -13467 -24068 12632 66022
9812 66022 85945 42986 29583 55611 44200 34566 33392 38829 55271 77058 74764 40499 5053
9799 5053 35955 81844 84238 63977 56331 69028 67102 62081 58530 66674 61564 44764 56850
9786 56850 57321 28805 -17476 19762 45767 47833 58437 48710 25940 15121 -11231 -4893 5496
9773 5496 -5304 16218 23733 49233 32201 22022 42723 39711 37566 34274 39608 36179 38407
9760 38407 28818 16624 28758 8907 24965 25552 7542 9376 10482 10176 15025 18919 26392 6584
$$ packed form
9848B15965p244r490k5299l4599l0074J3799K3263K3522K4375j9473r719N392
9836A70418N020J5914k2116l2076l1764J2141n242m573j6038L624K6018K3597
9824A44923Q552k8658l2823m3678k5180J8114J0607k6216l9108j0601L6700N3390
9812F6022J9923m2959j3403K6028j1411r634j174N437J6442K1787k294l4265l5446
9799E053L0902M5889K394k0261p646J2697j926n021l551Q144n110j6800J2086
9786E6850M71k8516m6281L7238K6005K066J0604r727k2770j0819k6352O338J0389
9773E496j0800K1522P515K5500j7032j0179K0701l012k145l292N334l429K228
9760C8407r589j2194J2134j9851J6058N87j8010J834J106l06M849L894P473j9808
$$ plain form
9746 6584 2989 23735 19538 36187 56885 67097 87235 84602 37251 -2652 23102 62236 49479
9733 49479 43433 54743 82536 72918 63894 46746 15811 -11239 -19103 -16709 9236 10559 19257
9720 19257 -8397 -27674 -12123 18763 -19548 -60854 -46272 -30948 -26075 17481 42895 37277
9708 37277 52579 43969 37456 12226 -14918 -35160 -19341 -23823 -12140 6113 -12479 139
9696 139 13895 34991 40356 49594 42787 33690 32442 10748 -7507 22056 42894 71843 62410
9683 62410 40793 1273 -1883 7515 -30519 -27487 -34209 -61133 -24007 9495 -983 1001 12187
9670 12187 5985 -26340 1544 3418 -23808 16984 48271 37335 50519 28927 29370 47850 26898
9657 26898 17849 24929 58105 40723 19215 -17122 -57164 -41802 -11415 10663 25043 8307
$$ packed form
9746F584l595K0746m197J6649K0698J0212K0138k633m7351l9903K5754L9134j2757
9733D9479o046J1310K7793r618r024j7148l0935k7050p864K394K5945J323Q698
9720A9257k7654j9277J5551L0886l8311m1306J4582J5324M873M3556K5414n618
9708C7277J5302q610o513k5230k7144k0242J5819m482J1683J8253j8592J2618
9696A39J3756K1096N365R238o807r097j248k1694j8255K9563K0838K8949r433
9683F2410k1617l9520l156R398l8034L032o722k6924L7126L3502j0478J984J1186
9670A2187o202l2325K7884J874k7226M0792L1287j0936J3184k1592M43J8480k0952
9657B6898r049P080L3176j7382k1508l6337m0042J5362L0387K2078J4380j6736
$$ plain form
9645 8307 -13221 -38190 -35539 -18402 11974 34270 36446 34079 40551 50475 49053 21336 -691
9632 -691 -18644 -9547 -6231 15099 28040 51587 76094 74481 58240 52982 41885 33220 28676
9619 28676 22190 19235 -11307 -37700 -12712 -4178 6728 26866 47627 39861 35281 36542 47250
9606 47250 55298 42534 44820 23789 14544 41849 48429 26222 -28242 -58303 -60730 -35374 3359
9593 3359 47561 27277 49713 82041 74815 72049 40134 55730 53207 44189 24999 -18558 -47582
9580 -47582 -25536 6831 -14936 -35391 -19850 -10923 -27660 -21369 -14984 -12031 -22459 -19553 -704
9567 -704 4293 19245 9121 28880 26914 3226 890 14619 -2356 -6427 -31045 -49810 -20171
9554 -20171 2494 -16198 15944 54899 89845 72327 59144 57799 69637 86689 80969 77155
$$ packed form
9645H307k1528k4969K651J7137L0376K2296K176k367O472R924j422k7717k2027
9632f91j7953R097L316K1330J2941K3547K4507j613j6241n258j1097q665m544
9619B8676o486k955l0542k6393K4988Q534J0906K0138K0761p766m580J261J0708
9606D7250Q048j2764K286k1031r245K7305O580k2207n4464l0061k427K5356L8733
9593C359M4202k0284K2436L2328p226k766l1915J5596k523r018j9190m3557k9024
9580d7582K2046L2367k1767k0455J5541Q927j6737O291O385K953j0428K906J8849
9567g04M997J4952j0124J9759j966k3688k336J3729j6975m071k4618j8765K9639
9554b0171K2665j8692L2142L8955L4946j7518j3183j345J1838J7052n720l814
$$ plain form
9542 77155 88149 100303 128177 105409 71097 83984 93153 94502 93601 51393 64347 62422 56755
9529 56755 75546 97415 68930 22474 -24480 -19356 1453 10104 33973 40603 9547 -8099
9517 -8099 -27082 -21995 -11371 6467 36590 41373 26042 18309 12390 49331 77831 42608 21111
9504 21111 36443 53666 69027 78803 71392 30480 49671 69703 40883 4124 8594 44365
9492 44365 41451 26445 36382 57988 63872 74951 62700 63742 77550 104475 96956 87503 88284
9479 88284 94979 102396 64504 37915 73159 121620 112876 93159 108315 145704 150277 143582 115881
9466 115881 72290 98072 120622 124669 100768 113552 129580 111566 107521 81521 72140 98639
9454 98639 119734 132600 121133 125349 130359 143128 141365 119485 116386 135164 148412 156986 139244
$$ packed form
9542G7155J0994J2154K7874k2768l4312J2887R169J349r01m2208J2954j925n667
9529E6755J8791K1869k8485m6456m6954N124K0809Q651K3869O630l1056j7646
9517h099j8983N087J0624J7838L0123M783j5331p733n919L6941K8500l5223k1497
9504B1111J5332J7223J5361R776p411m0912J9191K0032k8820l6759M470L5771
9492D4365k914j5006R937K1606N884J1079j2251J042J3808K6925p519r453P81
9479H8284O695P417l7892k6589L5244M8461q744j9717J5156L7389M573o695k7701
9466A15881m3591K5782K2550M047k3901J2784J6028j8014m045k6000r381K6499
9454I8639K1095J2866j1467M216N010J2769j763k1880l099J8778J3248Q574j7742
$$ plain form
9441 139244 190405 217783 225034 223370 271481 295723 365787 430680 442343 509993 622929 702650
9429 702650 786299 891380 1047986 1251154 1508326 1909677 2446932 3223329 4360049 5986312
9419 5986312 8182196 10524367 12125218 12055630 10346728 8128949 6265567 4931077 3979525
9410 3979525 3307719 2838020 2498649 2220564 1972519 1781121 1600536 1454330 1349839 1287629
9400 1287629 1224038 1164099 1126513 1082239 1009381 928482 866349 837556 794019 756783 734377
9389 734377 708329 693580 692729 700651 684811 640228 634740 656730 630116 590600 556676 573833
9377 573833 574179 514204 473989 459648 432311 405733 422848 423444 418993 412228 385254 368202 370585
9364 370585 357898 350032 320892 345485 336106 332574 320014 280790 284773 324620 334442 308841 300357
$$ packed form
9441A39244N1161K7378P251j664M8111K4242P0064O4893J1663O7650J12936P9721
9429G02650Q3649J05081J56606K03168K57172M01351N37255P76397J136720J626263
9419E986312K195884K342171J600851o9588j708902k217779j863382j334490r51552
9410C979525o71806m69699l39371k78085k48045j91398j80585j46206j04491o2210
9400A287629o3591n9939l7586m4274p2858q0899o2133k8793m3537l7236k2406
9389G34377k6048j4749q51P922j5840m4583n488K1990k6614l9516l3924J7157
9377E73833L46n9975m0215j4341k7337k6578J7115N96m451o765k6974j7052K383
9364C70585j2687p866k9140K4593r379l532j2560l9224L983L9847R822k5601q484
$$ plain form
9351 300357 295044 284194 263776 252669 264326 264938 271508 268861 220922 213497 198722 161080 154588
9338 154588 209132 223946 194047 178852 189574 192316 204394 228397 209099 182803 152784 157557
9326 157557 157126 177462 188148 157201 137123 151188 176364 199737 195413 204195 182043 132130
9314 132130 68538 55914 108127 133431 121207 103069 95216 92456 101592 99712 73108 61470
9302 61470 83285 78511 89718 125531 135350 135018 112069 110092 119440 110446 95771 124808 137165
9289 137165 126501 114326 138938 158431 138234 116525 94506 90428 89616 118713 122555 98270
9277 98270 103214 102907 100234 58292 33775 35461 72635 99803 82263 56020 60015 62478 63866
9264 63866 55159 49757 44851 50812 74360 55321 21629 30395 64342 40788 26468 49764 76765
$$ packed form
9351C00357n313j0850k0418j1107J1657O12O570k647m7939p425j4775l7642o492
9338A54588N4544J4814k9899j5195J0722K742J2078K4003j9298k6296l0019M773
9326A57557m31K0336J0686l0947k0078J4065K5176K3373m324Q782k2152m9913
9314A32130o3592j2624N2213K5304j2224j8138p853k760R136j880k6604j1638
9302F1470K1815m774J1207L5813R819l32k2949j977R348q994j4675K9037J2357
9289A37165j0664j2175K4612J9493k0197k1709k2019m078q12K9097L842k4285
9277I8270M944l07k673m1942k4517J686L7174K7168j7540k6243L995K463J388
9264F3866q707n402m906N961K3548j9039l3692Q766L3947k3554j4320K3296K7001
$$ plain form
9251 76765 70519 65836 81630 58342 71359 58871 48094 65614 60434 53938 39132 63114 70390
9238 70390 49168 2064 -23142 29416 77491 99312 76504 49782 46172 27626 14934 9327
9226 9327 15979 3043 -6752 16931 32434 34602 35369 19173 5599 -15398 -10039 -9918 11919 37249
9212 37249 22339 -3452 -21164 -18646 31108 24839 21505 21195 5432 -949 30031 34691 25149
9199 25149 50757 52818 45998 31987 51038 58069 13232 12310 24793 17639 13375 34483 41754
9186 41754 75703 76457 49836 20737 -7573 21351 24635 -3081 -43599 -62030 -30331 -9607
9174 -9607 39392 43572 8552 2058 33567 43282 58355 43598 48365 42167 76235 57781 7655
9161 7655 -636 33571 41043 27086 31919 11538 28686 46957 33187 27034 35682 20585 16902
$$ packed form
9251G6765o246m683J5794k3288J3017j2488j0777J7520n180o496j4806K3982P276
9238G0390k1222m7104k5206N2558M8075K1821k2808k6722l610j8546j2692n607
9226I327O652j2936r795K3683J5503K168P67j6196j3574k0997N359J21K1837K5330
9212C7249j4910k5791j7712K518M9754o269l334l10j5763o381L0980M660r542
9199B5149K5608K061o820j4011J9051P031m4837r22J2483p154m264K1108P271
9186D1754L3949P54k6621k9099k8310K8924L284k7716m0518j8431L1699K0724
9174i607M8999M180l5020o494L1509R715J5073j4757M767o198L4068j8454n0126
9161G655q291L4207P472j3957M833k0381J7148J8271j3770o153Q648j5097l683
$$ plain form
9148 16902 25640 15122 -18385 35876 48510 7630 23562 51340 31139 20774 20887 12662 31587
9135 31587 33154 47768 64608 49998 13225 1505 26640 23194 1573 -9231 -25746 -8562
9123 -8562 23828 15608 -4364 -5225 10458 40944 53840 62021 33560 58550 52120 30781 22221
9110 22221 33020 59265 61657 48096 52823 83644 57462 8838 -22293 -18598 3306 11588 3406
9097 3406 -26658 -39363 -40979 -32610 -6612 50044 53212 12844 13646 36606 28538 24398 34039 26155
9083 26155 -4389 -11065 -1909 20744 75061 80187 53462 41602 46104 38288 22658 26046 13262
9070 13262 -15125 16967 -5706 -24428 -28167 -23286 -4467 -17927 -13893 16214 -2786 -23822
9058 -23822 -11731 -21134 -26211 -5872 -33831 -7892 12633 19334 1490 2471 11324 -1131 10562
$$ packed form
9148A6902Q738j0518l3507N4261J2634m0880J5932K7778k0201j0365J13q225J8925
9135C1587J567J4614J6840j4610l6773j1720K5135l446k1621j0804j6515J7184
9123h562L2390q220j9972q61J5683L0486J2896Q181k8461K4990o430k1339q560
9110B2221J0799K6245K392j3561M727L0821k6182m8624l1131L695K1904Q282q182
9097C406l0064j2705j616Q369K5998N6656L168m0368Q02K2960q068m140R641p884
9083B6155l0544o676R156K2653N4317N126k6725j1860M502p816j5630L388j2784
9070A3262k8387L2092k2673j8722l739M881J8819j3460M034L0107j9000k1036
9058b3822J2091r403n077K0339k7959K5939K0525O701j7844R81Q853j2455J1693
$$ plain form
9045 10562 49152 3510 -24972 -6092 29719 39391 18174 22845 21516 33981 28382 42358 43606
9032 43606 43956 28240 -10639 -10192 -11399 -42625 -37974 -30243 1344 28936 46340 16263 -7059
9019 -7059 8155 37785 7442 -24123 -39896 -13741 -7126 8332 19963 -6291 -21576 -34789
9007 -34789 -23099 -8759 -2606 15630 41641 46194 7987 -14894 4459 8134 28217 8775
8995 8775 -16217 5521 50725 64638 40473 46326 62947 52358 35118 25301 2631 -523 16787
8982 16787 24026 31843 22369 14473 16653 26639 17554 24739 11893 -216 12358 -3419 -7269 -11372
8968 -11372 26394 38582 49443 62484 39468 37307 14566 -31213 -24657 -11144 15536 40337
8956 40337 74128 38306 15211 -15732 -36935 -7276 22640 17037 248 -24421 -27063 -24706
$$ packed form
9045A0562L8590m5642k8482J8880L5811R672k1217M671j329J2465n599J3976J248
9032D3606L50j5716l8879M47j207l1226M651P731L1587K7592J7404l0077k3322
9019g059J5214K9630l0343l1565j5773K6155O615J5458J1631k6254j5285j3213
9007c4789J1690J4340O153J8236K6011M553l8207k2881J9353L675K0083j9442
8995H775k4992K1738M5204J3913k4165N853J6621j0589j7240r817k2670l154J7310
8982A6787P239P817r474p896K180R986r085P185j2846j2109J2574j5777l850m103
8968a1372L7766J2188J0861J3041k3016k161k2741m5779O556J3513K6680K4801
8956D0337L3791l5822k3095l0943k1203K9659K9916n603j6789k4669k642K357
$$ plain form
8944 -24706 -5646 -34832 -507 47689 68324 41240 858 -9969 -23391 -47447 -48656 6716
8932 6716 42021 15753 -14433 -18798 -2439 -11055 -18975 -24458 -53905 -31647 -17010 -8570 -4215
8919 -4215 19693 41380 20089 19282 40841 35163 7973 37652 41713 3890 -21456 -26401 -22747
8906 -22747 16887 3925 4709 1034 -34147 -50380 -48723 -14658 16876 22973 3236 -6126 32628
8893 32628 29280 -8320 -11688 -28841 -3109 667 -10305 -10404 -1902 2777 4641 4279 10858 -27186
8879 -27186 -5701 44080 54819 22856 4411 -8313 -15555 1828 2836 2954 -30520 -57394 -66501
8866 -66501 -54389 -42593 -11202 30018 37217 7894 -32608 17750 26846 12446 9563 55868
8854 55868 54997 36509 13199 17106 -9419 186 2934 17337 37908 29067 4459 -6705 -5343
$$ packed form
8944b4706J9060k9186L4325M8196K0635k7084m0382j0827j3422k4056j209N5372
8932F716L5305k6268l0186m365J6359q616p920n483k9447K2258J4637Q440M355
8919d215K3908K1687k1291q07K1559n678k7190K9679M061l7823k5346m945L654
8906b2747L9634j2962P84l675l5181j6233J657L4065L1534O097j9737r362L8754
8893C2628l348l7600l368j7153K5732L776j0972r9Q502M679J864l62O579l8044
8879b7186K1485M9781J0739l1963j8445j2724p242J7383J008J18l3474k6874r107
8866f6501J2112J1796L1391M1220P199k9323m0502N0358R096j4400k883M6305
8854E5868q71j8488k3310L907k6525R605K748J4403K0571q841k4608j1164J362
$$ plain form
8841 -5343 -37213 -13281 27501 20413 21188 25783 29208 7573 829 17631 28476 6195 8252
8828 8252 20003 21291 -1542 18727 23726 -661 -14002 -5846 -19199 -402 -3404 -27727 1329
8815 1329 12482 25228 37570 15888 18539 29177 11965 18717 6537 16580 -18056 -7794
8803 -7794 6823 18390 38517 49637 52065 89299 69118 51260 44600 51025 46635 22529 -6545
8790 -6545 -3420 28772 55792 56100 16407 -6955 -11881 -52314 -57242 -49473 -28437 7538 23860
8777 23860 74659 80563 35312 32846 50095 41517 7637 -3215 -10705 -5184 -29748 -38817 -40033
8764 -40033 -31960 -1525 26886 65096 51903 24181 26270 31184 42589 49842 28336 20744 46466
8751 46466 38357 16458 29654 40030 13415 14971 11277 9221 -2260 -9318 8370 -2788 -1463
$$ packed form
8841e343l1870K3932M0782p088P75M595L425k1635o744J6802J0845k2281K057
8828H252J1751J288k2833K0269M999k4387j3341Q156j3353J8797l002k4323K9056
8815A329J1153J2746J2342k1682K651J0638j7212O752j2180J0043l4636J0262
8803g794J4617J1567K0127J1120K428L7234k0181j7858o660O425m390k4106k9074
8790f545L125L2192K7020L08l9693k3362m926m0433m928P769K1036L5975J6322
8777B3860N0799N904m5251k466J7249q578l3880j0852p490N521k4564r069j216
8764d0033Q073L0435K8411L8210j3193k7722K089M914J1405P253k1506p592K5722
8751D6466q109k1899J3196J0376k6615J556l694k056j1481p058J7688j1158J325
$$ plain form
8738 -1463 37013 52094 48800 12913 -16718 14000 18503 21880 -16703 -29897 -9999 11884 35854
8725 35854 22843 901 11007 -45279 -86739 -49201 29730 33662 -15063 -9755 -36473 -22717
8713 -22717 37143 57288 66314 37408 42124 45085 65888 106960 135149 125080 71715 72550 101229
8700 101229 54097 15613 -2444 7133 17414 16717 -2774 -33911 8053 27804 18795 -8635
8688 -8635 -6062 797 36154 70500 47991 11782 37439 44978 35406 51904 19311 17681 66969
8675 66969 78865 36444 12039 -4360 -26305 -4719 -2997 736 6051 7916 41375 33991 44763
8662 44763 41681 48770 73440 107961 174687 243551 270175 272026 254207 198103 171979 155932
8650 155932 137039 121585 101506 87849 96974 83134 67372 86646 93979 58214 72737 55922
$$ packed form
8738a463L8476J5081l294l5887k9631L0718M503L377l8583j3194J9898K1883K3970
8725C5854j3011k1942J0106n6286m1460L7538P8931L932m8725N308k6718J3756
8713b2717N9860K0145R026k8906M716K961K0803M1072K8189j0069n3365Q35K8679
8700A01229m7132l8484j8057R577J0281o97j9491l1137M1964J9751r009k7430
8688h635K573O859L5357L4346k2509l6209K5657P539r572J6498l2593j630M9288
8675F6969J1896m2421k4405j6399k1945K1586J722L733N315J865L3459p384J0772
8662D4763l082P089K4670L4521O6726O8864K6624J851j7819n6104k6124j6047
8650A55932j8893j5454k0079j3657R125j3840j5762J9274P333l5765J4523j6815
$$ plain form
8638 55922 63459 62401 61087 50101 43953 40713 33609 37366 68342 72198 70677 71087 42072 59380
8624 59380 80353 120168 133750 135211 136016 94446 66168 92956 128310 140982 174243 235139
8612 235139 300351 379367 488650 526180 403140 288180 204765 176369 155585 153455 133417
8601 133417 108819 113184 133133 107342 101762 78507 46884 41354 71627 44192 43432 58050 70591
8588 70591 77879 75665 54929 23207 25564 25358 -11955 -48168 -48764 -4290 26980 57117 44894
8575 44894 23277 54002 69365 75829 79024 110239 135390 151481 174890 224078 297893 306425
8563 306425 257359 204711 176005 161254 176242 198381 163055 118890 61856 28980 42560 76507
8551 76507 67945 67793 95234 89234 65398 48572 60074 11647 56480 102537 87674 47021 37170
$$ packed form
8638E5922P537j058j314j0986o148l240p104L757L0976L856j521M10k9015J7308
8624E9380K0973L9815J3582J461Q05m1570k8278K6788L5354J2672L3261O0896
8612B35139O5212P9016J09283L7530j23040j14960q3415k8396k0784k130k0038
8601A33417k4598M365J9949k5791n580k3255l1623n530L0273k7435p60J4618J2541
8588G0591P288k214k0736l1722K357k06l7313l6213n96M4474L1270L0137j2223
8575D4894k1617L0725J5363O464L195L1215K5151J6091K3409M9188P3815Q532
8563C06425m9066n2648k8706j4751J4988K2139l5326m4165n7034l2876J3580L3947
8551G6507q562j52K7441o000k3836j6826J1502m8427M4833M6057j4863m0653r851
$$ plain form
8538 37170 -5421 -27903 -16709 -33807 -45790 -20183 -20462 -20467 -22453 -36938 -32969 -1563 21435
8525 21435 -5408 -3867 -6969 -13426 -72233 -58866 -18554 17519 25142 29210 22509 60116 60671
8512 60671 57456 47752 33294 24564 -504 -7598 -16382 -15565 12964 18090 48421 60629 34205
8499 34205 53406 60723 50505 75005 72959 61897 44420 42412 39477 59299 53934 37213 19567
8486 19567 -8200 -12221 25871 21026 1894 -27386 -31158 -24178 -42624 -60280 -37651 -36034 -39030
8473 -39030 -46864 -41095 -38789 -53356 -42788 -45870 -47425 -29817 -47203 -58159 -37050 -27623 -62171
8460 -62171 -62120 -35917 -37859 -61895 -69541 -53297 -18276 16403 14194 6773 -13960 -12114 -1031
8447 -1031 28763 19640 11425 734 -18846 -22362 -25804 -15697 -12889 -13153 30496 66195 64231 74066
$$ packed form
8538C7170m2591k2482J1194j7098j1983K5607k79nj986j4485L969L1406K2998
8525B1435k6843J541l102o457n8807J3367M0312L6073P623M068o701L7607N55
8512F0671l215r704j4458q730k5068p094q784Q17K8529N126L0331J2208k6424
8499C4205J9201P317j0218K4500k046j1062j7477k008k935J9822n365j6721j7646
8486A9567k7767m021L8092m845j9132k9280l772O980j8446j7656K2629J617k996
8473c9030p834N769K306j4567J0568l082j555J7608j7386j0956K1109R427l4548
8460f2171N1K6203j942k4036p646J6244L5021L4679k209p421k0733J846J1083
8447a031K9794r123q215j0691j9580l516l442J0107K808k64M3649L5699j964R835
$$ plain form
8433 74066 68877 34894 34519 52076 57311 75184 97451 39512 -10038 -6959 18574 17035 30600
8420 30600 40427 26050 -10340 2335 22245 11220 17483 17431 59381 72674 62799 64099 51083
8407 51083 59861 47903 28594 21573 14527 35160 34508 48430 37776 34017 32819 -297 -11728
8394 -11728 -8428 10376 103 -4722 -37452 -17422 41442 47156 13946 -4499 -19420 -36473
8382 -36473 -23457 -25700 -17359 -3024 4400 -6535 11525 11261 18865 26992 40875 37987 23235
8369 23235 9048 -17042 -49884 -51220 -25505 11355 54799 59182 6467 16969 30058 20935
8357 20935 32035 64234 76677 37847 7644 12023 33663 49245 12327 -34460 -49419 -18403
8345 -18403 14136 25940 40916 42046 -7037 -21869 -9532 -2630 -7877 -28636 -44989 -23646
$$ packed form
8433G4066n189l3983l75J7557N235J7873K2267n7939m9550L079K5533j539J3565
8420C0600R827j4377l6390J2675J9910j1025O263n2M1950J3293r875J300j3016
8407E1083Q778j1958j9309p021p046K0633o52J3922j0654l759j198l3116j1431
8394a1728L300J8804j0273m825l2730K0030N8864N714l3210j8445j4921j7053
8382c6473J3016k243Q341J4335P424j0935J8060k64P604Q127J3883k888j4752
8369B3235j4187k6090l2842j336K5715L6860M3444M383n2715J0502J3089r123
8357B0935J1100L2199J2443l8830l0203M379K1640J5582l6918m6787j4959L1016
8345a8403L2539J1804J4976J130m9083j4832J2337O902n247k0759j6353K1343
$$ plain form
8333 -23646 -8869 -33442 -42870 -54130 -44567 -5380 43975 52733 -5383 -30666 -18268 36994
8321 36994 88696 41339 -5484 5682 -1479 -36386 -12209 -5339 -1312 -7974 8477 -9970 -42946
8308 -42946 -35688 -2374 15347 12466 -18226 -27613 -48113 -21158 -4087 4178 -11084 -729 -7515
8295 -7515 9201 -11971 -30482 -51429 -62591 -23503 14889 8999 -16377 -15531 -29796 -16274 -6221
8282 -6221 -49866 -56389 -51116 -24976 -12010 8243 4714 -1140 -2419 -23445 -30742 -20073 -22561
8269 -22561 -23752 -12907 25321 50227 50677 19410 11507 5130 -719 -6012 -31137 -8827 4844
8256 4844 -8299 -45751 -58459 -51581 -16105 -15690 5501 20642 -2241 -33671 -59519 -25972 -23660
8243 -23660 -8595 -8532 -33637 -19560 -43149 -22999 -3151 -1718 -6962 -24572 -39200 3894 34701
$$ packed form
8333b3646J4777k4573r428j1260R563L9187M9355Q758n8116k5283J2398N5262
8321C6994N1702m7357m6823J1166p161l4907K4177O870M027o662J6451j8447l2976
8308d2946P258L3314J7721k881l0692r387k0500K6955J7071Q265j5262J0355o786
8295g515J6716k1172j8511k0947j1162L9088L8392n890k5376Q46j4265J3522J0053
8282f221m3645o523N273K6140J2966K0253l529n854j279k1026p297J0669k488
8269b2561j191J0845L8228K4906M50l1267p903o377n849n293k5125K2310J3671
8256D844j3143l7452j2708O878L5476M15K1191J5141k2883l1430k5848L3547K312
8243b3660J5065O3k5105J4077k3589K0150J9848J433n244j7610j4628M3094L0807
$$ plain form
8230 34701 7235 -1590 9142 14251 -22537 -32684 -24498 -15772 -22617 -29338 -30176 15634 75871
8217 75871 83317 58439 53879 36400 54999 63619 25287 38771 24942 24520 7403 6354 21413
8204 21413 285 -36917 -58732 -34028 -29824 -49741 -12459 4253 -13998 12744 27748 8521
8192 8521 -26383 10595 42633 51458 30383 -38123 -48048 -2249 -4404 15216 20923 -33266 -52502
8179 -52502 -32035 -27590 -4141 12553 13107 32173 45108 32361 1218 40221 37830 26392 32470
8166 32470 32044 29466 29269 -24338 -28233 -882 31517 47351 63656 41913 46338 52731 6259
8153 6259 -22646 -10734 -4574 -28165 -25941 -46546 -21346 5796 807 -31118 -51552 -50147 -58760
8140 -58760 -49540 -42403 -32919 -32276 8407 32020 12899 37321 44589 -14075 -20803 26382 34808
$$ packed form
8230C4701k7466q825J0732N109l6788j0147Q186Q726o845o721q38M5810O0237
8217G5871P446k4878m560j7479J8599Q620l8332J3484j3829m22j7117j049J5059
8204B1413k1128l7202k1815K4704M204j9917L7282J6712j8251K6742J5004j9227
8192H521l4904L6978L2038Q825k1075o8506r925M5799k155J9620N707n4189j9236
8179e2502K0467M445K3449J6694N54J9066J2935j2747l1143L9003k391j1438O078
8166C2470m26k578j97n3607l895K7351L2399J5834J6305k1743M425O393m6472
8153F259k8905J1912O160k3591K224k0605K5200K7142m989l1925k0434J405q613
8140e8760R220P137R484O43M0683K3613j9121K4422P268n8664o728M7185Q426
$$ plain form
8127 34808 26724 -20030 -15006 13465 2240 -11453 -13951 -3755 -6588 -6144 12894 17076 14647
8114 14647 -7012 -11370 9728 3260 -34329 -25037 3592 13527 -7242 5429 46563 54997 48728
8101 48728 30241 43723 61402 27991 -13061 -25588 32506 60981 16282 4018 24493 5739
8089 5739 -544 36215 45538 5775 -63770 -64581 -55355 -52008 -68154 -70683 -33454 15891 27827
8076 27827 5244 21637 19669 17197 -338 -10717 -27299 -48336 -67450 -15060 1546 -11156
8064 -11156 -10558 28378 60695 67977 71192 57541 74201 53752 43087 55649 71672 83786 64332
8051 64332 48889 32504 65160 73025 75406 69444 73803 52356 31482 27177 43669 49274 40796
8038 40796 35449 36059 62898 84453 74942 47020 47600 66864 111325 118217 119690 99929 74441
$$ packed form
8127C4808q084m6754N024K8471j1225j3693k498J0196k833M44J9038M182k429
8114A4647k1659m358K1098o468l7589R292K8629R935k0769J2671M1134Q434o269
8101D8728j8487J3482J7679l3411m1052j2527N8094K8475m4699j2264K0475j8754
8089E739o283L6759R323l9763o9545q11R226L347j6146k529L7229M9345J1936
8076B7827k2583J6393j968k472j7535j0379j6582k1037j9114N2390J6606j2702
8064a1156N98L8936L2317P282L215j3651J6660k0449j0665J2562J6023J2114j9454
8051F4332j5443j6385L2656P865K381n962M359k1447k0874m305J6492N605q478
8038D0796n347O10K6839K1555r511k7922N80J9264M4461O892J473j9761k5488
$$ plain form
8025 74441 25933 16187 2885 -3708 23880 46030 41086 62859 50649 51552 62039 84435 179415
8012 179415 216268 237992 204349 165532 152078 179683 183449 154709 132738 123275 125206 146206
8000 146206 138887 96568 84530 72124 33855 45182 52945 44002 41832 29441 41227 79458
7988 79458 82036 95078 85605 70074 79217 88234 104623 85569 27974 37969 107232 132105 78596
7975 78596 29941 41670 36503 22006 11692 9732 31429 73281 100442 125978 144121 117221
7963 117221 57563 48155 67299 52252 48872 62090 58164 14216 6574 11552 14910 34153 34460
7950 34460 17143 15523 -17130 -12604 45760 54342 41413 41265 32272 51889 41399 16571 -3619
7937 -3619 7450 2723 14115 -5629 6345 7085 860 -1570 10950 26210 62984 38418 22701
$$ packed form
8025G4441m8508r746j3302o593K7588K2150m944K1773j2210R03J0487K2396R4980
8012A79415L6853K1724l3643l8817j3454K7605L766k8740k1971r463J931K1000
8000A46206p319m2319j2038j2406l8269J1327P763q943k170j2391J1786L8231
7988G9458K578J3042r473j5531R143R017J6389j9054n7595R995O9263K4873n3509
7975G8596m8655J1729n167j4497j0314j960K1697M1852K7161K5536J8143k6900
7963A17221n9658r408J9144j5047l380J3218l926m3948p642M978L358J9243L07
7950C4460j7317j620l2653M526N8364Q582j2929j48q993J9617j0490k4828k0190
7937c619J1069m727J1392j9744J1974P40o225k430J2520J5260L6774k4566j5717
$$ plain form
7924 22701 41054 76367 116034 110044 57406 29460 24864 22005 39482 34283 50973 88939 86416
7911 86416 55983 -1380 -3796 -7730 -26829 22104 19434 21286 -51 -39102 -32024 -30631 -32703
7898 -32703 -14686 2262 52938 60597 49514 52132 57548 12790 14715 23445 47666 67771 57906
7885 57906 12003 33841 57377 74377 69895 46357 38334 19411 27807 7517 7718 23020 28200
7872 28200 5276 -8652 -9674 19483 57428 47344 39397 51980 75060 88645 68080 54836
7860 54836 22542 -39684 -25927 -22953 -2208 29272 21223 9406 7094 2864 -17624 3842 13613
7847 13613 10406 -9103 -8078 -4150 26420 37859 23643 12720 677 12807 -3901 -13418 -16527
7834 -16527 -30428 -47570 -26268 -14699 -81659 -95962 -42747 -9 -7341 -2298 -1155 19826
$$ packed form
7924B2701J8353L5313L9667n990n2638k7946m596k859J7477n199J6690L7966k523
7911H6416l0433n7363k416l934j9099M8933k670J852k1337l9051P078J393k072
7898c2703J8017J6948N0676P659j1083K618N416m4758J925Q730K4221K0105r865
7885E7906m5903K1838K3536J7000m482k3538q023j8923Q396k0290K01J5302N180
7872B8200k2924j3928j022K9157L7945j0084p947J2583K3080J3585k0565j3244
7860E4836l2294o2226J3757K974K0745L1480q049j1817k312m230k0488K1466R771
7847A3613l207j9509J025L928L0570J1439j4216j0923j2043J2130j6708r517l109
7834a6527j3901j7142K1302J1569o6960j4303N3215M2738p332N043J143K0981
$$ plain form
7822 19826 26563 38236 37199 44819 26237 8022 -4975 -7686 3645 -14811 -13256 -23058 11972
7809 11972 36283 10683 6091 -22151 -40389 -16931 -9986 -18578 -22402 -35905 -58381 -70475 -88502
7796 -88502 -53339 -7109 10991 44573 48100 1238 -10895 -22599 -29192 -18793 1702 3797
7784 3797 -23570 -43526 -18130 12111 30604 20820 1027 -3855 23114 27117 36842 40975 46989
7771 46989 33380 73972 77762 86424 73180 61066 35215 18631 21707 27252 42945 51115 58439
7758 58439 60247 35629 31613 33454 22892 -5447 -18130 -21082 2177 22113 -724 9198 10612
7745 10612 14688 12537 -8015 -20529 -824 24684 23419 31396 18220 44538 37993 25438 -9599
7732 -9599 -852 7276 17075 40453 45666 53589 69727 60125 59630 26604 -24879 -42495 -101239 -100635
$$ packed form
7822A9826O737J1673j037P620j8582j8215j2997k711J1331j8456J555r802L5030
7809A1972K4311k5600m592k8242j8238K3458O945q592l824j3503k2476j2094j8027
7796h8502L5163M6230J8100L3582L527m6862j2133j1704o593J0399K0495K095
7784C797k7367j9956K5396L0241J8493r784j9793m882K6969M003R725M133O014
7771D6989j3609M0592L790Q662j3244j2114k5851j6584L076N545J5693Q170P324
7758E8439J808k4618m016J841j0562k8339j2683k952K3259J9936k2837R922J414
7745A0612M076k151k0552j2514J9705K5508j265P977j3176K6318o545j2555l5037
7732i599Q747Q128R799K3378N213P923J6138r602m95l3026n1483j7616n8744O04
$$ plain form
7718 -100635 -52853 -29490 -4978 8097 12857 4586 -4584 -25980 -49617 -16535 -2760 -25508
7706 -25508 -25446 -46331 -44564 -39029 -40247 -26120 -26934 -18455 -14795 4555 -14057 -39669 -29564 7785
7692 7785 7587 2671 19690 63883 83013 125824 147191 102363 40480 23536 18537 31037 22605
7679 22605 28046 31767 22668 2660 9574 30199 41826 25807 1327 16558 31471 16695 -39188
7666 -39188 -77589 -80871 -51837 -419 -8983 -34924 -14522 15709 4041 -6201 -15464 2046
7654 2046 14208 46454 73262 47606 17572 -5930 -39862 -45521 -39772 -64227 -48783 6242
7642 6242 12368 4645 -47856 -32709 -13856 -23853 -20413 -27622 -5482 18965 17233 1383 4600
7629 4600 14635 10312 -15914 -19937 -9244 -31132 -51606 -22472 4455 15690 48086 50227 38696
$$ packed form
7718a00635M7782K3363K4512J3075M760q271r170k1396k3637L3082J3775k2748
7706b5508O2k0885J767N535j218J4127q14Q479L660J9350j8612k5612J0105L7349
7692G785j98m916J7019M4193J9130M2811K1367m4828o1883j6944m999J2500q432
7679B2605N441L721r099k0008O914K0625J1627j6019k4480J5231J4913j4776n5883
7666c9188l8401l282K9034N1418q564k5941K0402L0231j1668j0242r263J7510
7654B046J2162L2246K6808k5656l0034k3502l3932n659N749k4455J5444N5025
7642F242O126p723n2501J5147J8853r997L440p209K2140K4447j732j5850L217
7629D600J0035m323k6226m023J0693k1888k0474K9134K6927J1235L2396K141j1531
$$ plain form
7616 38696 -4989 2101 -42151 -37951 -26935 -18188 8033 8809 6363 -4190 -25615 -6673 -16589
7603 -16589 -12379 48 -2400 -5442 -43181 -66845 -62722 -57684 -56196 -36711 -25245 -12619 -6815
7590 -6815 19295 30038 18212 -21990 -56866 -31355 -29473 -40212 -36172 -11760 5531 25526
7578 25526 3589 -10115 -20751 -3983 12924 1562 -13649 4337 28347 41127 46443 1548
7566 1548 -7612 -39009 -38515 -22953 -2714 -18679 -2021 13241 13015 906 -17013 -14830 -7249
7553 -7249 36470 26561 -1196 -37001 -23383 -23639 -52043 -55796 -19726 -21497 -38106 2913 13919
7540 13919 15958 -9270 5169 39587 47175 16764 -11001 -2865 11031 22481 46135 67603
7528 67603 64809 73087 54064 15448 -12835 -27913 -6223 5583 21979 51763 42560 37978 59647
$$ packed form
7616C8696m3685P090m4252M200J1016Q747K6221P76k446j0553k1425J8942r916
7603a6589M210J2427k448l042l7739k3664M123N038J488J9485J1466J2626N804
7590f815K6110J0743j1826m0202l4876K5511J882j0739M040K4412J7291J9995
7578B5526k1937j3704j0636J6768J6907j1362j5211J7986K4010J2780N316m4895
7566A548r160l1397M94J5562K0239j5965J6658J5262k26j2109j7919K183P581
7553g249M3719r909k7757l5805J3618k56k8404l753L6070j771j6609M1019J1006
7540A3919K039k5228J4439L4418P588l0411k7765Q136J3896J1450K3654K1468
7528F7603k794Q278j9023l8616k8283j5078K1690J1806J6396K9784r203m582K1669
$$ plain form
7515 59647 43183 8881 -22502 -32165 -15274 7734 4030 -16340 -9327 29075 6459 -10354
7503 -10354 -29624 -44374 -65077 -49211 -30037 -10189 -3009 -18217 -18648 -55874 -55921 -58182 -43841
7490 -43841 -35210 -32534 -20112 -31150 -27709 -23884 -15969 -20252 -25046 -7809 -23479 -27803 -20934 -16876
7476 -16876 -33852 -20105 10847 34646 53477 14423 -36943 -23663 9057 30200 24669 28919
7464 28919 59480 42251 24499 28121 32330 49722 14902 3306 -245 14757 17027 16848 38289
7451 38289 44681 19724 22387 4733 15240 15959 27571 36175 12254 -29903 -23292 -8154 6282
7438 6282 32389 22327 5241 376 -4050 -29599 -60874 -72236 -67064 -59833 -57170 -72862 -34627
7425 -34627 9142 27592 24016 169 -17710 -24503 11816 18261 254 -17572 8577 22710
$$ packed form
7515E9647j6464l4302l1383r663J6891K3008l704k0370P013L8402k2616j6813
7503a0354j9270j4750k0703J5866J9174J9848P180j5208m31l7226m7k261J4341
7490d3841Q631K676J2422j1038L441L825P915m283m794J7237j5670m324O869M058
7476a6876j6976J3747L0952K3799J8831l9054n1366J3280L2720K1143n531M250
7464B8919L0561j7229j7752L622M209J7392l4820j1596l551J5002K270j79K1441
7451C8289O392k4957K663j7654J0507P19J1612Q604k3921m2157O611J5138J4436
7438F282K6107j0062j7086m865m426k5549l1275j1362N172P231K663j5692L8235
7425c4627M3769J8450l576k3847j7879o793L6319O445j8007j7826K6149J4133
$$ plain form
7413 22710 25600 2348 -41743 -40212 -27042 -18843 -14456 -15818 18293 17995 7499 3834 -8051
7400 -8051 10843 21946 8723 7360 9050 13189 -1953 17583 45236 43725 -519 -35556 -25463
7387 -25463 -283 17986 406 -4081 5132 25148 36939 31101 38216 20284 -17269 -27860 -24572
7374 -24572 -12900 13678 40481 53191 60423 33859 22627 15434 30835 43996 54217 49390
7362 49390 44803 10621 -31513 -49268 -34096 -39259 11047 22209 41054 58290 27163 29970
7350 29970 -1206 21543 11602 5610 18087 30223 12785 14319 19823 -8424 18844 33781 10710
7337 10710 28135 54905 36331 25324 39845 -6512 -26364 12173 45938 80191 84990 68709
7325 68709 56016 64674 55360 71066 81173 97179 41933 -15853 -24609 -17636 -17015 -27906 -14873
$$ packed form
7413B2710K890k3252m4091J531J3170Q199M387j362L4111k98j0496l665j1885
7400h051J8894J1103j3223j363J690M139j5142J9536K7653j511m4244l5037J0093
7387b5463K5180J8269j7580m487R213K0016J1791n838P115j7932l7553j0591L288
7374b4572J1672K6578K6803J2710P232k6564j1232p193J5401J3161J0221m827
7362D9390m587l4182m2134j7755J5172n163N0306J1162J8845J7236l1127K807
7350B9970l1176K2749r941n992J2477J2136j7438J534N504k8247K7268J4937k3071
7337A0710J7425K6770j8574j1007J4521m6357j9852L8537L3765L4253M799j6281
7325F8709j2693Q658r314J5706J0107J6006n5246n7786q756O973O21j0891J3033
$$ plain form
7312 -14873 1494 -714 24154 27214 12919 -20170 -16124 -19096 -35671 -67225 -33848 -9481 -23850
7299 -23850 -14045 -18038 -61635 -81314 -100856 -77194 -67579 -23979 -14785 -41677 -38390 2917 842
7286 842 -16428 -16522 -29402 -37487 -54101 -28673 14672 1722 -29000 -40033 -24173 30884 59207
7273 59207 28643 29336 28087 15281 -17765 -28838 -19808 -14802 9763 23065 28783 7906 3431
7260 3431 16583 19022 3132 26888 39061 20281 610 20842 40103 29892 38849 15356
7248 15356 10340 19232 32390 43753 68722 76033 30367 -16652 -51322 -34657 -18047 -12671 -4028
7235 -4028 6654 31876 29604 -7950 -57172 -75329 -52327 -30766 -4122 3120 -3590 -31098 -43732
7222 -43732 -39122 -55472 -39896 -31282 -28327 -24368 -31043 1328 24227 2739 -28295 10470 29378
$$ packed form
7312a4873J6367k208K4868L060j4295l3089M046k972j6575l1554L3377K4367j4369
7299b3850R805l993m3597j9679j9542K3662R615M3600R194k6892L287M1307k075
7286H42j7270r4j2880q085j6614K5428M3345j2950l0722j1033J5860N5057K8323
7273E9207l0564O93j249j2806l3046j1073R030N006K4565J3302N718k0877m475
7260C431J3152K439j5890K3756J2173j8780j9671K0232J9261j0211Q957k3493
7248A5356n016Q892J3158J1363K4969P311m5666m7019l4670J6665J6610N376Q643
7235d028J0682K5222k272l7554m9222j8157K3002K1561K6644P242o710k7508j2634
7222d3732M610j6350J5576Q614K955L959o675L2371K2899k1488l1034L8765J8908
$$ plain form
7209 29378 -6943 -15835 8427 -2807 -57096 -89747 -58290 -41063 -28815 -13144 -11254 -2356
7197 -2356 -31278 -17300 -10828 21784 21759 11865 22486 23863 28270 7702 -3045 -5343 10518 27176
7183 27176 7709 -25939 -15274 -7955 -8512 -29354 -49087 -27572 -18935 -8706 10342 3752 -14647
7170 -14647 -35358 -59542 -64129 -36835 -3792 -30266 -42790 -40061 -23288 -13727 -31089 4249
7158 4249 27467 50927 66854 78575 53333 36295 9240 -15069 -16481 -15196 -16539 -19473 -48147
7145 -48147 -70153 -33215 -9463 -36034 -49739 -23721 2020 6787 -5388 -8321 -6982 -12265 -18628
7132 -18628 -31909 -1613 -10135 -60391 -87486 -88291 -74527 -75935 -44219 4523 3899 -16257 -40931
7119 -40931 -11179 18741 4820 -47914 -34560 -11624 -18559 -24579 -34526 -55532 -70047 -47248
$$ packed form
7209B9378l6321q892K4262j1234n4289l2651L1457J7227J2248J5671J890Q898
7197b356k8922J3978O472L2612k5r894J0621J377M407k0568j0747k298J5861J6658
7183B7176j9467l3648J0665P319n57k0842j9733K1515Q637J0229J9048o590j8399
7170a4647k0711k4184m587K7294L3043k6474j2524K729J6773R561j7362L5338
7158D249K3218K3460J5927J1721k5242j7038k7055k4309j412J285j343k934k8674
7145d8147k2006L6938K3752k6571j3705K6018K5741M767j2175k933J339n283o363
7132a8628j3281L0296q522n0256k7095q05J3764j408L1716M8742o24k0156k4674
7119d0931K9752K9920j3921n2734J3354K2936o935o020r947k1006j4515K2799
$$ plain form
7107 -47248 -8060 9146 5378 -15399 -18390 -30316 -17635 -26104 -49929 -65576 -85381 -58358
7095 -58358 -19887 -22520 -34817 -25114 -73406 -76786 -31772 -2664 38790 36618 12125 -11044 -9295
7082 -9295 -2583 -3454 -28561 -59351 -84151 -56336 -41816 -48392 -53885 -34100 8400 -29854 -46383
7069 -46383 -11669 5756 -31718 -87897 -55121 -19160 -11467 -12731 -8107 6793 3956 -1574 7827
7056 7827 1880 -18289 -24398 -23838 -61005 -40972 -25222 -21972 -39942 -49223 -11358 34059 17761
7043 17761 9029 21965 55139 71968 66088 59616 39144 19767 128 11740 10584 18415 46310
7030 46310 28639 4687 9814 19953 45692 31080 -7663 -35757 -41096 -51248 -59871 -18741
7018 -18741 -10807 -20317 10669 31712 17529 22292 13169 -15938 -37040 -21041 -4489 21905 -3811
$$ packed form
7107d7248L9188J7206l768k0777k991j1926J2681q469k3825j5647j9805K7023
7095e8358L8471k633j2297R703m8292l380M5014K9108M1454k172k4493k3169J749
7082i295O712q71k5107l0790k4800K7815J4520o576n493J9785M2500l8254j6529
7069d6383L4714J7425l7474n6179L2776L5961P693j264M624J4900k837n530R401
7056G827n947k0169o109N60l7167K0033J5750L250j7970r281L7865M5417j6298
7043A7761q732J2936L3174J6829n880o472k0472j9377j9639J1612j156P831K7895
7030D6310j7671k3952N127J0139K5739j4612l8743k8094n339j0152q623M1130
7018a8741P934r510L0986K1043j4183M763r123k9107k1102J5999J6552K6394k5716
$$ plain form
7005 -3811 -12771 -19624 -42339 -50499 -81611 -82059 -59204 -20010 18445 32673 -8362 -26808 9026
6992 9026 31670 62771 66958 30871 -26360 -45799 9004 40844 45677 16486 -31302 -45277
6980 -45277 -20132 -16122 -9160 11117 3465 -7085 283 -9012 4043 12056 2929 -34035 -50257
6967 -50257 -45109 -66331 -92838 -43759 21955 68512 98606 88091 50704 49665 80088 52648
6955 52648 28477 13802 -17090 -40399 -26826 -19799 -7580 -26320 -29162 -32205 4320 33062
6943 33062 35655 26273 36866 25748 2557 2015 11912 25863 39278 23567 10549 28945 52230
6930 52230 50505 14292 -2222 14552 15608 3964 8820 769 -16676 16289 22900 10062 -2001
6917 -2001 -15897 8809 2570 2689 -8610 -12644 -9778 13626 -18867 -5208 8853 3003 -18792
$$ packed form
7005c811q960o853k2715q160l1112m48K2855L9194L8455J4228m1035j8446L5834
6992I026K2644L1101M187l6087n7231j9439N4803L1840M833k9191m7788j3975
6980d5277K5145M010O962K0277p652j0550P368r295J3055Q013r127l6964j6222
6967e0257N148k1222k6507M9079O5714M6557L0094j0515l7387j039L0423k7440
6955E2648k4171j4675l0892k3309J3573P027J2219j8740k842l043L6525K8742
6943C3062K593r382J0593j1118k3191n42R897J3951J3415j5711j3018J8396K3285
6930E2230j725l6213j6514J6774J056j1644M856q051j7445L2965O611j2838j2063
6917b001j3896K4706o239J19j1299m034K866K3404l2493J3659J4061n850k1795
$$ plain form
6904 -18792 -45495 -15290 43723 28074 7517 3255 -30614 -46397 -42395 -40032 -16700 -10951 -29700
6891 -29700 -36094 -24082 5412 -6591 -23575 -7214 14740 2559 3786 15596 30504 23111
6879 23111 16572 51453 67468 37938 5527 -10260 -29585 -16747 6201 33687 33253 24357 19515
6866 19515 22679 33344 48596 76977 65445 46985 6849 4710 -12377 -37683 -38252 -18240 -15225
6853 -15225 2378 -704 -19250 -20099 -45655 -31296 -13761 11866 8839 -37448 -17580 -9607 -12814
6840 -12814 -3765 -11919 -18718 -15512 -17619 -55095 -69448 -76574 -59906 -5607 9861 1153 -6145
6827 -6145 -9767 -13029 -2923 12339 -7660 -12824 -3929 -9096 -31549 -21728 9088 8479 -36263 -44209
6813 -44209 -49607 -40573 -49071 -36354 -10971 -5653 6629 40922 52584 25271 -5191 -30179 -23946
$$ packed form
6904a8792k6703L0205N9013j5649k0557m262l3869j5783M002K363K3332N749j8749
6891b9700o394J2012K9494j2003j6984J6361K1954j2181J227J1810J4908p393
6879B3111o539L4881J6015k9530l2411j5787j9325J2838K2948K7486m34q896m842
6866A9515L164J0665J5252K8381j1532j8460m0136k139j7087k5306n69K0012L015
6853a5225J7603l082j8546q49k5556J4359J7535K5627l027m6287J9868P973l207
6840a2814R049q154o799L206k107l7476j4353p126J6668N4299J5468q708p298
6827f145l622l262J0106J5262j9999n164Q895n167k2453R821L0816o09m4742p946
6813d4209n398R034q498J2717K5383N318J2282L4293J1662k7313l0462k4988O233
$$ plain form
6800 -23946 -20197 -9783 8812 17555 -18717 -33445 -27342 -15162 873 2566 14030 -15034 -14632
6787 -14632 -11187 -1580 26402 19721 -2817 -24428 -31804 -33776 -18284 -20077 -17741 -24789 -24140 -34168
6773 -34168 -27772 -12078 -6449 -2483 -601 -15904 -22346 -33206 -34536 -34167 -26641 12651 19493 24274
6759 24274 33915 26969 -4757 -9191 4410 -14838 -49752 -49662 -25746 -61642 -69421 -47279 -2136
6746 -2136 1011 9956 -24119 -6954 5316 -7121 13726 25974 152 -5900 -1757 -19912 -31284
6733 -31284 -14272 -3669 4834 -8748 -26576 -25735 -8875 -739 -14183 -16375 -26496 -30738 -16046
6720 -16046 -12225 -14860 -29144 32433 54664 33433 24608 -10986 -26982 -25791 -21358 -28758 -14633
6707 -14633 -6473 -66645 -92124 -85707 -79499 -64664 -28777 -2132 -13040 -27827 -40363 -40439 -17931
$$ packed form
6800b3946L749J0414J8595Q743l6272j4728O103J2180J6035J693J1464k9064M02
6787a4632L445R607K7982o681k2538k1611p376j972J5492j793K336p048O49j0028
6773c4168O396J5694N629L966J882j5303o442j0860j330L69P526L9292O842M781
6759B4274R641o946l1726m434J3601j9248l4914R0K3916l5896p779K2142M5143
6746b136L147Q945l4075J7165J2270j2437K0847J2248k5822o052M143j8155j1372
6733c1284J7012J0603Q503j3582j7828Q41J6860Q136j3444k192j0121m242J4692
6720a6046L821k635j4284O1577K2231k1231q825l5594j5996J191M433p400J4125
6707a4633Q160o0172k5479O417O208J4835L5887K6645j0908j4787j2536p6K2508
$$ plain form
6694 -17931 -9458 -27794 16138 36364 34438 4205 -167 -14845 -28547 -38007 -5520 9273 2531
6681 2531 -16366 -26250 -1864 28125 -4124 -5471 17248 50844 41629 19750 9359 960 -24516
6668 -24516 -38479 -36595 -54740 -24127 -10341 -21770 -49730 -66035 -50829 -28487 -36273 -47460
6656 -47460 6170 23566 -15227 -44464 -50743 -4936 44254 53411 70140 33259 -32174 -33991
6644 -33991 -20284 -11660 -9362 -19918 106 -27750 -3271 6026 25263 26921 30065 43548 9956
6631 9956 -14656 -42209 -18424 -13652 -30050 472 48201 76240 63479 66594 87296 64401
6619 64401 11911 -32675 -14720 30915 42998 45016 38170 33097 17259 2037 23489 24813 24525
6606 24525 393 -20180 -34029 -67999 -63079 -12326 18066 22435 30188 41967 34063 -6828 -40551
$$ packed form
6694a7931Q473j8336M3932K0226j926l0233m372j4678j3702r460L2487J4793o742
6681B531j8897r884K4386K9989l2249j347K2719L3596r215k1879j0391q399k5476
6668b4516j3963J884j8145L0613J3786j1429k7960j6305J5206K2342p786j1187
6656d7460N3630J7396l8793k9237o279M5807M9190R157J6729l6881o5433j817
6644c3991J3707Q624K298j0556K0024k7856K4479R297J9237J658L144J3483l3592
6631I956k4612k7553K3785M772j6398L0522M7729K8039j2761L115K0702k2895
6619F4401n2490m4586J7955M5635J2083K018o846n073j5838j5222K1452J324k88
6606B4525k4132k0573j3849l3970M920N0753L0392M369P753J1779p904m0891l3723
$$ plain form
6593 -40551 -64295 -82974 -62653 -33529 -44404 -47830 -15605 -15585 -33816 -14605 -17683 -19906 -14394
6580 -14394 1945 47898 66765 49096 34329 16701 -6391 -51218 -74744 -36328 -17740 -15137
6568 -15137 -23158 13721 3644 -2482 17458 53329 76190 47557 45197 24030 -806 -5273 -13037
6555 -13037 -11181 22098 -13420 -35207 -47968 10306 25477 46072 80828 80859 54422 -11018 -30701
6542 -30701 -23557 16745 14600 -5293 3674 6462 18857 20674 2284 12946 -4949 -23563 -18738
6529 -18738 -54231 -41011 -30606 -50722 -6991 15493 1737 -20148 4399 17412 31860 33126
6517 33126 6069 -13604 -6629 1548 12657 20808 44514 53202 29571 8430 -15803 -19833 -1898
6504 -1898 3767 -13802 -27499 -68570 -72657 -36448 -15619 -10702 -22238 -42844 -8357 8033 -12302
$$ packed form
6593d0551k3744j8679K0321K9124j0875l426L2225K0j8231J9211l078k223N512
6580a4394J6339M5953J8867j7669j4767j7628k3092m4827k3526L8416J8588K603
6568a5137q021L6879j0077o126J9940L5871K2861k8633k360k1167k4836m467p764
6555a3037J856L3279l5518k1787j2761N8274J5171K0595L4756L1k6437o5440j9683
6542c0701P144M0302k145j9893Q967K788J2395J817j8390J0662j7895j8614M825
6529a8738l5493J3220J0405k0116M3731K2484j3756k1885K4547J3013J4448J266
6517C3126k7057j9673O975Q177J1109Q151K3706Q688k3631k1141k4233m030J7935
6504a898N665j7569j3697m1071m087L6209K0829M917j1536k0606L4487J6390k0335
$$ plain form
6491 -12302 -32493 -15032 5317 3583 -30953 3577 49 -32215 -29871 17054 31544 919
6479 919 6824 21713 14297 -825 -26145 -55975 -53042 -50377 58 46439 40703 14295 5760
6466 5760 14648 30404 67931 37780 36603 25659 28426 15397 161 5001 -3054 25227 44439
6453 44439 23471 19178 36463 25355 -3370 -16073 -19213 -56486 -63995 -44293 -21381 -20830 -15094
6440 -15094 31184 28094 34526 43480 63477 40338 4434 13387 21446 17598 -3530 -8046 -27844
6427 -27844 -28863 -1986 -208 8849 -6411 -31378 -26137 -6226 9535 4608 11353 26265 4513
6414 4513 7439 10600 18121 10277 21234 -13253 -30464 2420 4672 -40869 -48537 -41562 -44469 -48971
6400 -48971 -85466 -53560 10932 -937 -27137 -55256 -18356 9405 11845 1501 -16873 -27667
$$ packed form
6491a2302k0191J7461K0349j734l4536L4530l528l2264K344M6925J4490l0625
6479I19N905J4889p416j5122k5320k9830K933K665N0435M6381n736k6408q535
6466E760Q888J5756L7527l0151j177j0944K767j3029j5236M840q055K8281J9212
6453D4439k0968m293J7285j1108k8725j2703l140l7273p509J9702K2912N51N736
6440a5094M6278l090O432Q954J9997k3139l5904Q953Q059l848k1128m516j9798
6427b7844j019K6877J778R057j5260k4967N241J9911J5761m927O745J4912k1752
6414D513K926L161P521p844J0957l4487j7211L2884K252m5541p668O975k907m502
6400d8971l6495L1906O4492j1869k6200k8119L6900K7761K440j0344j8374j0794
$$ plain form
6388 -27667 -11941 -12253 -7590 12886 28591 21830 22873 26137 -679 16828 16679 14262 -19256 -62648
6374 -62648 -29046 -39672 -35352 -11538 -12102 5316 24356 25315 38363 33072 -5272 -32261 -4524
6361 -4524 -23589 -45891 -47813 -22466 -1030 16901 36117 34111 28049 25007 18356 -420 -30687
6348 -30687 -21815 -20322 -28518 -27842 -33026 -42520 -45291 -53865 -56037 -50408 -29329 -29447 -47274 -44805 -16060
6333 -16060 17789 34690 19862 3055 31184 1878 -4056 14456 12856 9189 5507 -19799 -50869
6320 -50869 -28694 10175 -23137 -38515 -24103 -22478 -12554 11774 -22801 -19784 7948 35000
6308 35000 35555 37881 56839 43506 9013 -11644 4659 2592 38988 42785 33202 30962 49934
6295 49934 52567 26364 -9614 -41229 -42436 -39460 -23086 -11914 -38520 -75413 -67640 -49267 -60901
$$ packed form
6388b7667J5726l12M663K0476J5705o761J043L264k6816J7507j49k417l3518m3392
6374f2648L3602j0626M320K3814n64J7418J9040R59J3048n291l8344k6989K7737
6361d524j9065k2302j922K5347K1436J7931J9216k006o062l042o651j8776l0267
6348c0687Q872J493q196O76n184r494k771q574k172N629K1079j18j7827K469K8745
6333a6060L3849J6901j4828j6807K8129k9306n934J8512j600l667l682k5306l1070
6320e0869K2175L8869l3312j5378J4412J625R924K4328l4575L017K7732K7052
6308C5000N55K326J8958j3333l4493k0657J6303k067L6396L797r583k240J8972
6295D9934K633k6203l5978l1615j207K976J6374J1172k6606l6893P773J8373j1634
$$ plain form
6282 -60901 -77046 -70597 -57239 -35622 -6465 6284 -2691 -14933 -11955 -28090 -18977 -1395 33330
6269 33330 56079 10585 -46879 -88540 -83942 -44682 -22579 -26159 -44297 -76905 -70916 -59280
6257 -59280 -49679 -54403 -46586 -12463 -21 -17400 -24693 -22825 -27076 -11234 4985 -329 -31309
6244 -31309 -65391 -82443 -71958 -41573 -51140 -69639 -44863 -40011 -45399 -50958 -38760 -37126 -51951
6231 -51951 -37796 -31634 -42916 -46639 -67920 -66136 -78884 -62382 -41554 -48113 -33040 -24785 -1106
6218 -1106 -12655 16975 -3079 -24977 11493 27784 2123 -32540 -69957 -55860 -46664 -64266
6206 -64266 -40784 4330 9912 3155 20671 -13541 -25865 -6571 7749 15610 15999 -1361 -31039
6193 -31039 -29092 -7700 -8447 17329 16471 14760 30658 4986 -19507 -31539 -22589 -16418 -47247
$$ packed form
6282f0901j6145O449J3358K1617K9157J2749q975j2242K978j6135R113J7582L4725
6269C3330K2749m5494n7464m1661M598L9260K2103l580j8138l2608N989J1636
6257e9280R601m724P817L4123J2442j7379p293J868m251J5842J6219n314l0980
6244c1309l4082j7052J0485L0385r567j8499K4776M852n388n559J2198J634j4825
6231e1951J4155O162j1282l723k1281J784j2748J6502K0828o559J5073Q255K3679
6218a106j1549K9630k0054k1898L6470J6291k5661l4663l7417J4097R196j7602
6206f4266K3482M5114N582o757J7516l4212j2324J9294J4320P861L89j7360k9678
6193c1039J947K1392p47K5776q58j711J5898k5672k4493j2032Q950O171l0829
$$ plain form
6180 -47247 -10854 13072 3583 -25213 -49502 -30968 -2034 16730 22315 16056 21415 15395 22956
6167 22956 18202 54170 77465 73229 28036 -21175 -60767 -57301 -31318 -8332 8203 5578 12310
6154 12310 37484 19085 -14942 -27152 13052 26725 6398 -2338 -12361 -11323 -9065 -24673
6142 -24673 -54324 -59349 -65328 -39472 -25251 -21232 -45650 -42125 -11413 -4131 21449 810 9020
6129 9020 30955 27663 30939 75592 54378 2970 -50538 -50121 -32054 -17256 -4048 -16339 -25187
6116 -25187 -38156 -37782 -44636 -21841 11736 9660 -25128 -29622 -9868 -4262 -13418 4921 25413
6103 25413 20541 2531 13212 6672 -1173 25151 32480 23697 18831 8243 -8194 -15771 -13696
6090 -13696 2006 37943 21255 1341 -17662 -2198 -2274 5486 21756 5717 7483 909 -13008
$$ packed form
6180d7247L6393K3926r489k8796k4289J8534K8934J8764N585o259N359o020P561
6167B2956m754L5968K3295m236m5193m9211l9592L466K5983K2986J6535k625O732
6154A2310K5174j8399l4027j2210M0204J3673k0327q736j0023J038K258j5608
6142b4673k9651n025n979K5856J4221M019k4418L525L0712P282K5580k0639Q210
6129I020K1935l292L276M4653k1214n1408n3508M17J8067J4798J3208j2291q848
6116b5187j2969L74o854K2795L3577k076l4788m494J9754N606r156J8339K0492
6103B5413m872j8010J0681o540p845K6324P329q783m866j0588j6437p577K075
6090a3696J5702L5937j6688j9914j9003J5464p6P760J6270j6039J766o574j3917
$$ plain form
6077 -13008 14985 19562 -4431 -23710 -18414 -30454 -44330 -61466 -43707 -11650 -17244 -37994
6065 -37994 -12289 -9517 -11039 1456 16453 6983 -35656 -22043 -3855 19960 51073 17552
6053 17552 -2034 15207 13360 -10755 -13439 -41301 -36778 -4261 -17317 -19503 -23043 -4730 10115
6040 10115 -21825 -16701 -5551 -23111 -32758 -63212 -70286 -44995 -15541 -6242 1372 24014 20347
6027 20347 27535 40439 45621 35377 24957 33235 38549 38683 4762 -32946 -47311 -25484 -21681
6014 -21681 -31968 -27670 -10274 -6497 -24442 -52382 -38446 -48924 -47410 -42724 -16891 32727 35734
6001 35734 1020 5393 18455 35980 37823 15740 20723 29214 50250 53396 5641 -42380 -34137
5988 -34137 -26349 -7820 7291 33998 29229 12652 12763 11149 24834 37011 11118 25415 6224
$$ packed form
6077a3008K7993M577k3993j9279N296j2040j3876j7136J7759L2057n594k0750
6065c7994K5705K772j522J2495J4997r470m2639J3613J8188K3815L1113l3521
6053A7552j9586J7241j847k4115k684k7862M523L2517j3056k186l540J8313J4845
6040A0115l1940N124J1150j7560r647l0454p074K5291K9454R299P614K2642l667
6027B0347P188J2904N182j0244j0420Q278N314J34l3921l7708j4365K1827L803
6014b1681j0287M298J7396L777j7945k7940J3936j0478J514M686K5833M9618L007
6001C5734l4714M373J3062J7525J843k2083M983Q491K1036L146m7755m8021Q243
5988c4137P788J8529J5111K6707m769j6577J11j614J3685J2177k5893J4297j9191
$$ plain form
5975 6224 -23015 -5830 15496 28992 -324 -16059 -9890 -17894 -45499 -49597 -7276 29454 37025
5962 37025 36653 2801 13062 17859 -10991 14562 16992 -15449 -8014 20896 4152 13181 8456
5949 8456 -2059 26893 17285 -24663 -15226 18049 43825 -6456 -12551 16875 -29704 -82743 -89120
5936 -89120 -56277 -33885 -13618 -6793 1914 16996 32910 11928 -12785 -27987 -11204 6321
5924 6321 -1331 -2006 1750 2126 1013 19541 51927 77872 65104 65040 50666 23774 -26494 -51966
5910 -51966 -22450 1070 -3884 -15538 15728 50109 34851 40113 43820 25309 -14214 12999
5898 12999 9983 -24977 -31655 -32432 -43808 -43155 -53853 -46748 -1983 35136 59686 49484 26218
5885 26218 7674 12800 35368 21314 16697 866 -16094 -45654 -29232 -22385 -28587 9753 15740
$$ packed form
5975F224k9239J7185K1326J3496k9316j5735O169q004k7605m098M2321L6730P571
5962C7025l72l3852J0261M797k8850K5553K430l2441P435K8910j6744R029m725
5949H456j0515K8952r608m1948R437L3275K5776n0281o095K9426m6579n3039o377
5936h9120L2843K2392K0267O825Q707J5082J5914k0982k4713j5202J6783J7525
5924F321p652o75L756L76j113J8528L2386K5945j2768o4j4374k6892n0268k5472
5910e1966K9516K3520m954j1654L1266L4381j5258N262L707j8511l9523K7213
5898A2999l016l4960o678p77j1376O53j0698P105M4765L7119K4550j0202k3266
5885B6218j8544N126K2568j4054m617j5831j6960k9560J6422O847o202L8340N987
$$ plain form
5872 15740 14549 40912 35008 -2682 -16142 -2982 -4333 9836 33727 18939 4221 -26537
5860 -26537 -14982 6047 -14088 -36805 -41975 -28604 3215 32535 26985 15519 12375 -17417
5848 -17417 -30277 -22651 -9276 -18134 15446 30294 27596 28230 10812 -2873 -11335 7539 16977
5835 16977 29933 5273 -5261 7726 -6762 -1229 -745 -31050 -27785 -19701 -10410 -3305 -43268
5822 -43268 -41100 -13114 -35213 -22506 -5595 -13448 -24755 -43084 -40937 -34450 -12093 -893 -6265
5809 -6265 -60414 -62445 -30987 594 1767 -33111 -12931 -33710 -21482 -6686 16004 6155 18399
5796 18399 -21832 -29432 -12516 -6855 -30241 -5735 17776 7300 -17284 -81395 -90751 -63210
5784 -63210 -41516 -30406 -29751 -29902 -26561 -29599 -42996 -46716 -27146 -2730 -10008 -2827 22464 38178
$$ packed form
5872A5740j191K6363n904l7690j3460J3160j351J4169K3891j4788j4718l0758
5860b6537J1555K1029k0135k2717n170J3371L1819K9320n550j1466l144k9792
5848a7417j2860P626J3375q858L3580J4848k698O34j7418j3685q462J8874R438
5835A6977J2956k4660j0534J2987j4488N533M84l0305L265Q084R291P105l9963
5822d3268K168K7986k2099J2707J6911p853j1307j8329K147O487K2357J1200n372
5809f265n4149k031L1458L1581J173l4878K0180k0779J2228J4796K2690r849J2244
5796A8399m0231p600J6916N661k3386K4506K3511j0476k4584o4111r356K7541
5784f3210K1694J1110O55j51L341l038j3397l720J9570K4416p278P181K5291J5714
$$ plain form
5770 38178 18159 27474 34495 167 -7551 -5474 1887 -7466 -10219 -41601 -52973 -51789 -22212
5757 -22212 6778 25933 15811 -48526 -55662 -46679 -40520 -42766 -31614 -16173 -7704 -9401 -23754
5744 -23754 -12817 13679 23035 41046 29177 -687 -23210 -34115 -27378 -21784 -5780 -9041 -15332
5731 -15332 17201 19773 -15313 -14681 27120 27458 8104 -24827 -43860 -41379 -18299 -37603 -92156
5718 -92156 -100571 -64082 -36829 -36846 -43093 -50215 -43660 -39394 -33037 -37510 -7568 -8209 -31637 -45896
5704 -45896 -63396 -59793 -53969 -52536 -24231 11354 10766 -22916 -22186 18986 33276 629 -15510
5691 -15510 1840 -1332 -13408 -36433 -32693 21320 62301 25009 -24258 -44550 -28154 -29004 3219
5678 3219 2692 -25574 -28164 -7514 5 5309 43526 23402 -15667 -2306 1525 15401 9832
$$ packed form
5770C8178k0019R315P021l4328p718K077P361r353k753l1382j1372J184K9577
5757b2212K8990J9155j0122o4337p136Q983O159k246J1152J5441Q469j697j4353
5744b3754J0937K6496R356J8011j1869k9864k2523j0905O737N594J6004l261o291
5731a5332L2533K572l5086O32M1801L38j9354l2931j9033K481K3080j9304n4553
5718i2156q415L6489K7253j7o247p122O555M266O357m473K9942o41k3428j4259
5704d5896j7500L603N824J433K8305L5585n88l3682P30M1172J4290l2647j6139
5691a5510J7350l172j2076k3025L740N4013M0981l7292m9267k0292J6396q50L2223
5678C219n27k8266k590K0650P519N304L8217k0124l9069J3361L831J3876n569
$$ plain form
5665 9832 -1952 9647 28597 1974 -33543 -19842 4995 14163 -17869 -25163 -23459 -31421 -38528
5652 -38528 -42617 -25619 -23698 -20765 -26465 -64223 -54577 -11014 18615 54851 46017 26532 22458
5639 22458 15415 -15131 -32111 -33970 -24744 2985 12469 30268 13365 6078 21068 48113 30038
5626 30038 25640 15204 -632 30810 22331 -33690 -60178 -28100 -33013 -35405 -43365 -51587 -32509
5613 -32509 -7078 20988 33612 13835 -5785 23427 21646 13996 44846 39257 16283 38136
5601 38136 53287 63352 50449 267 -50773 -46282 6204 29262 43657 52784 21492 1318
5589 1318 11576 32798 18098 10837 21712 24632 25058 15281 -1995 21788 12459 -25864 -18494
5576 -18494 -19277 -45077 -54095 -49870 -35585 15116 -1286 -4131 13365 14389 2176 21893 17619
$$ packed form
5665I832j1784J1599J8950k6623l5517J3701K4837R168l2032p294J704p962p107
5652c8528m089J6998J921K933n700l7758R646M3563K9629L6236q834j9485m074
5639B2458p043l0546j6980j859R226K7729R484J7799j6903p287J4990K7045j8075
5626C0038m398j0436j5836L1442q479n6021k6488L2078m913k392p960q222J9078
5613c2509K5431K8066J2624j9777j9620K9212j781p650L0850n589k2974K1853
5601C8136J5151J0065j2903n0182n1040M491N2486K3058J4395R127l1292k0174
5589A318J0258K1222j4700p261J0875K920M26r777j7276K3783r329l8323P370
5576a8494p83k5800r018M225J4285N0701j6402k845J7496J024j2213J9717m274
$$ plain form
5563 17619 28061 41094 -1378 -21460 1692 6924 19746 -283 8328 59703 84296 61664
5551 61664 14938 3114 13203 -3039 -39084 -46667 -17431 -24271 -33306 -22740 -15832 -3723 27361
5538 27361 20735 4442 -27381 -55242 -44791 -24517 -15127 -9274 -31919 -22160 -19556 -16599 -22637
5525 -22637 -30273 -41228 -8684 -4001 -14495 -42982 -39247 -25182 -7916 -7415 22305 8894 7309
5512 7309 24658 33153 35105 18535 34800 34551 27984 -26057 -56819 -74580 -63233 -48379 -25088
5499 -25088 -36353 -61464 -49556 -15750 -15815 -41390 -72290 -37596 -60214 -48428 -29080 -26785 -1601
5486 -1601 -19005 -4947 -22970 -39092 -24521 -15193 -13313 9648 21607 -19240 -43465 -55788
5474 -55788 -42279 -31837 -9192 -10716 -24943 -17167 -38992 -19900 -18651 -28373 -26920 -36531 -6037
$$ packed form
5563A7619J0442J3033m2472k0082K3152N232J2822k0029Q611N1375K4593k2632
5551F1664m6726j1824J0089j6242l6045p583K9236o840r035J0566O908J2109L1084
5538B7361o626j6293l1823k7861J0451K0274R390N853k2645R759K604K957o038
5525b2637p636j0955L2544M683j0494k8487L735J4065J7266N01K9720j3411j585
5512G309J7349Q495J952j6570J6265k49o567n4041l0762j7761J1347J4854K3291
5499b5088j1265k5111J1908L3806o5k5575l0900L4694k2618J1786J9348K295K5184
5486a601j7404J4058j8023j6122J4571R328J880K2961J1959m0847k4225j2323
5474e5788J3509J0442K2645j524j4227P776k1825J9092J249r722J453r611L0494
$$ plain form
5461 -6037 -15397 -16523 -690 14044 -2132 -6265 -17164 -33911 -82854 -56930 -44702 -48774 -43609
5448 -43609 -18981 -5963 4952 862 -21391 -8416 27190 39670 34573 34643 39526 24964 666
5435 666 -6218 11176 10087 -26280 -34598 -36184 -36131 -39748 -42285 -30669 -23644 -6160 9672 8726 7417
5420 7417 -20078 -11474 -534 14142 17347 -49133 -55344 -4221 -21557 -32087 -4598 22106 -514
5407 -514 7050 19989 -14581 1476 30212 32447 4116 -41224 -43076 -29977 -48793 -71895 -58536
5394 -58536 -45212 -95942 -99988 -75733 -57431 -20754 -477 29617 32698 13550 16771 25948 19055
5381 19055 51991 39915 25618 10973 4673 11783 17830 -4700 -11852 6251 -11936 -9835 42449
5368 42449 58344 3343 -3436 22561 10082 -30631 -69075 -65139 -60545 -48401 -22566 656
$$ packed form
5461f037r360j126J5833J4734j6176m133j0899j6747m8943K5924J2228m072N165
5448d3609K4628J3018J0915m090k2253J2975L5606J2480n097P0M883j4562k4298
5435F66o884J7394j089l6367q318j586N3l617k537J1616P025J7484J5832r46j309
5420G417k7495Q604J0940J4676L205o6480o211N1123j7336j0530K7489K6704k2620
5407e14P564J2939l4570J6057K8736K235k8331m5340j852J3099j8816k3102J3359
5394e8536J3324n0730m046K4255J8302L6677K0277L0094L081j9148L221R177o893
5381A9055L2936j2076j4297j4645o300P110O047k2530p152J8103j8187K101N2284
5368D2449J5895n5001o779K5997j2479m0713l8444L936M594J2144K5835K3222
$$ plain form
5356 656 3310 -18577 -14309 -4978 -14195 -53934 -64236 -49030 -46108 -40272 -28222 -31132 -23578 8876
5342 8876 27149 2437 49775 69557 47858 -5643 -38804 -43757 -11916 5012 -17030 -30240
5330 -30240 -42198 -53144 -51580 -20225 21248 27589 32061 8453 -2968 71 4859 -2619 -7295
5317 -7295 -10959 -4260 20747 -9645 -17345 11078 15803 44368 89875 73747 86706 86981 72562
5304 72562 42526 7733 -2617 21842 27054 33066 21492 3292 42498 47269 19110 -2267
5292 -2267 13719 28926 7256 8742 11072 9 -17809 -54737 -52177 -3119 8050 24234 19220
5279 19220 -4021 576 391 13661 20253 18849 -12142 -39392 -41584 -8836 20037 22365 15977
5266 15977 -11343 -2514 -13763 -19420 -6241 14936 16785 21029 12063 26122 31074 32184 29095
$$ packed form
5356F56K654k1887M268R331r217l9739j0302J5206K922N836J2050k910P554L2454
5342H876J8273k4712M7338J9782k1699n3501l3161m953L1841J6928k2042j3210
5330c0240j1958j0946J564L1355M1473O341M472k3608j1421L039M788p478m676
5317g295l664O699K5007l0392p700K8423M725K8565M5507j6128J2959K75j4419
5304G2562l0036l4793j0350K4459N212O012j1574j8200L9206M771k8159k1377
5292b267J5986J5207k1670J486K330j1063j7818l6928K560M9058J1169J6184n014
5279A9220k3241M597j85J3270O592j404l0991k7250k192L2748K8873K328o388
5266A5977k7320Q829j1249n657J3179K1177J849M244q966J4059M952J110l089
$$ plain form
5253 29095 14188 36735 71680 39930 7666 1646 2929 -24928 -24305 -46232 -61793 -39267 -22972
5240 -22972 -12306 -19556 -16962 -33462 -19150 -4144 6590 2742 -21002 -23609 -4506 20222 6745
5227 6745 -14131 -26761 7290 2379 -34597 -54076 -49229 -57178 -58311 -31965 -2874 26263 22959
5214 22959 8011 -1360 -6220 -15370 3920 38546 18861 -36223 -64833 -45561 -65829 -79912
5202 -79912 -50296 -65395 -31040 1071 15116 -6214 -10629 3577 -1249 -15685 -24743 -17855 -18394
5189 -18394 -14022 -10288 -3955 13714 -7543 6993 38264 51896 27114 20706 -654 -22088 -24824
5176 -24824 -16248 -8780 -4527 -20123 -9206 16621 43543 20857 8430 4929 23398 13805 39555
5163 39555 64649 21286 -13014 -61504 -68956 -62724 -76904 -49847 -21345 -29591 -46534 -40397 -20432
$$ packed form
5253B9095j4907K2547L4945l1750l2264o020J283k7857O23k1927j5561K2526J6295
5240b2972J0666p250K594j6500J4312J5006J0734l848k3744k607J9103K4728j3477
5227F745k0876j2630L4051m911l6976j9479M847p949j133K6346K9091K9137l304
5214B2959j4948r371m860r150J9290L4626j9685n5084k8610J9272k0268j4083
5202g9912K9616j5099L4355L2111J4045k1330m415J4206m826j4436r058O888n39
5189a8394M372L734O333J7669k1257J4536L1271J3632k4782o408k1360k1434k736
5176b4824Q576P468M253j5596J0917K5827K6922k2686j2427l501J8469r593K5750
5163C9555K5094m3363l4300m8490p452O232j4180K7057K8502q246j6943O137J9965
$$ plain form
5150 -20432 5416 22520 15929 1307 -4865 9353 -4504 -23811 24800 56402 14389 -35297
5138 -35297 -4491 25715 64692 49790 -605 -21474 -34151 -25212 -22755 -10281 1837 44176
5126 44176 65117 45217 -1321 -29328 -35613 -27008 -10777 2960 14492 -630 -26427 -54997
5114 -54997 -45188 -30016 -22330 912 23452 39746 41289 7604 -388 6755 55526 69207 34427
5101 34427 60174 66036 39049 19014 13080 39662 41794 53762 41274 46870 64748 62015 64394
5088 64394 78838 77231 30999 13808 32045 30602 40012 43040 11919 4623 22483 10365 -710
5075 -710 2453 -10795 -21973 -37950 -62119 -45395 -11411 -5075 -9623 -12001 -34211 -57581 -40368
5062 -40368 3103 12893 -15667 -45817 -59064 -46927 -18456 5584 29655 13136 -25023 9916
$$ packed form
5150b0432K5848J7104o591j4622o172J4218j3857j9307M8611L1602m2013m9686
5138c5297L0806L0206L8977j4902n0395k0869j2677Q939K457J2474J2118M2339
5126D4176K0941j9900m6538k8007o285Q605J6231J3737J1532j5122k5797k8570
5114e4997R809J5172P686K3242K2540J6294J543l3685p992P143M8771J3681l4780
5101C4427K5747N862k6987k0035n934K6582K132J1968j2488N596J7878k733K379
5088F4394J4444j607m6232j7191J8237j443R410L028l1121p296J7860j2118j1075
5075g10L163j3248j1178j5977k4169J6724L3984O336m548k378k2210k3370J7213
5062d0368M3471R790k8560l0150j3247J2137K8471K4040K4071j6519l8159L4939
$$ plain form
5050 9916 13438 9125 8057 40253 41371 4467 -7659 17398 30859 27812 17007 -1391 -16238
5037 -16238 -991 2186 12429 -6173 21031 13998 49314 93608 98749 71405 23086 -29521
5025 -29521 -58496 -29492 23458 12977 -11869 -9138 -23774 -49254 -30467 9759 22276 -872
5013 -872 -13508 27456 30470 9382 25495 25298 -24537 -50199 -26869 -10869 14826 44612 25691
5000 25691 -10344 -24706 -4401 25462 11288 -5131 -31223 -13386 -33079 -53639 -68203 -37121
4988 -37121 -6951 12637 3385 13695 25171 21794 -658 -6260 -2725 -7561 -6694 -5383 -87 13660
4974 13660 63 -2643 -5088 14862 13021 -3145 -24907 -26033 26880 32791 10136 2147 4651
4961 4651 -20560 -45616 -60161 -82341 -80265 -50876 -3863 19845 51600 67119 57678 36330
$$ packed form
5050I916L522m313j068L2196J118l6904j2126K5057J3461l047j0805j8398j4847
5037a6238J5247L177J0243j8602K7204p033L5316M4294N141k7344m8319n2607
5025b9521k8975K9004N2950j0481k4846K731j4636k5480J8787M0226J2517k3148
5013h72j2636M0964L014k1088J6113j97m9835k5662K3330J6000K5695K9786j8921
5000B5691l6035j4362K0305K9863j4174j6419k6092J7837j9693k0560j4564L1082
4988c7121L0170J9588r252J0310J1476l377k2452n602L535m836Q67J311N296J3747
4974A3660j3597k706k445J9950j841j6166k1762j126N2913N911k2655p989K504
4961D651k5211k5056j4545k2180K076K9389M7013K3708L1755J5519r441k1348
$$ plain form
4949 36330 42661 58997 54537 42375 12595 -9655 2631 -9659 -20219 -6621 -13073 -33430
4937 -33430 -59661 -39894 -26749 -18505 926 22824 49312 37347 -34964 -43407 -31268 -6370
4925 -6370 33486 18361 -4146 -12648 17513 22789 19521 11965 40072 81587 64528 48328 29984
4912 29984 77020 81211 71662 84571 107010 76857 35108 12805 -949 10994 18181 -7683
4900 -7683 -5117 3513 33043 41231 58455 8829 -38401 -65149 -43698 -58082 -46230 -44675 8417
4887 8417 -4625 -11789 -41304 -74352 -75551 -55416 -33001 -1120 -13378 23567 57308 35018
4875 35018 -10306 -50148 -37898 5023 43754 29451 43676 36540 12913 -12965 -70387 -73370
4863 -73370 -56858 -42093 -69202 -44998 -36835 -18883 -31411 -48350 -52100 -24608 14701 27344
$$ packed form
4949C6330O331J6336m460j2162k9780k2250J2286j2290j0560J3598o452k0357
4937c3430k6231J9767J3145Q244J9431K1898K6488j1965p2311q443J2139K4898
4925f370L9856j5125k2507q502L0161N276l268p556K8107M1515j7059j6200j8344
4912B9984M7036M191r549J2909K2439l0153m1749k2303j3754J1943P187k5864
4900g683K566Q630K9530Q188J7224m9626m7230k6748K1451j4384J1852J555N3092
4887H417j3042p164k9515l3048j199K0135K2415L1881j2258L6945L3741k2290
4875C5018m5324l9842J2250M2921L8731j4303J4225p136k3627k5878n7422k983
4863g3370J6512J4765k7109K4204Q163J7952j2528j6939l750K7492L9309J2643
$$ plain form
4851 27344 32212 18765 10006 683 2960 17001 1717 15079 -5826 -4936 23015 52264 62315
4838 62315 43943 30075 30109 9155 3949 -6561 -7849 14077 -1142 19035 58263 71628 39132
4825 39132 22041 -6543 393 37467 14764 -7081 -579 -1192 -4120 -8378 -5807 683 6831 -3043
4811 -3043 -15981 -21526 -14124 3027 -5788 -20025 -38115 -40320 -22721 -9101 6249 10049 -3835
4798 -3835 -20033 -27203 -29270 -47868 -50212 -2758 41369 28576 28940 28213 31512 37038 34396 418
4784 418 6896 36520 18312 11238 -7368 -15541 9704 20355 1596 -23076 -37011 -27604 -26937
4771 -26937 -41943 -52395 -25683 -23158 -16697 3897 -10291 -30167 -18174 -42938 -45067 -5919
4759 -5919 21163 2623 -19499 -25774 -35715 -32841 -23697 21801 30950 25645 7860 -10133 -10162 -43548
$$ packed form
4851B7344M868j3447q759r323K277J4041j5284J3362k0905Q90K7951K9249J0051
4838F2315j8372j3868L4k0954n206j0510j288K1926j5219K0177L9228J3365l2496
4825C9132j7091k8584O936L7074k2703k1845O502o13k928m258K571O490O148r874
4811c043j2938n545P402J7151q815j4237j8090k205J7599J3620J5350L800j3884
4798c835j6198p170k067j8598k344M7454M4127j2793L64p27L299N526k642l3978
4784D18O478K9624j8208p074j8606q173K5245J0651j8759k4672j3935R407O67
4771b6937j5006j0452K6712K525O461K0594j4188j9876J1993k4764k129L9148
4759e919K7082j8540k2122o275r941K874R144M5498R149n305j7785j7993k9l3386
$$ plain form
4745 -43548 -71609 -71098 -28136 3712 -2841 -56 3665 -44666 -44002 -20840 -27160 -23014 -42599 -48055
4731 -48055 -37912 -1830 -1344 -27160 -27482 -2153 7296 11834 5624 -15420 -25754 -6405 48632
4718 48632 52956 35910 15628 403 -26627 -24901 912 18746 -5792 -18279 -13305 -28554
4706 -28554 -15530 -17456 246 -1917 -14647 -16874 -15587 -12649 -20752 -17328 -4549 681 1570 37349
4692 37349 44473 42052 34884 11490 -13485 9463 35736 13091 -3365 -6833 -7083 -9283 -11744
4679 -11744 -6286 -10898 -11310 -12606 -18025 -42742 -33603 18923 32174 -18468 -46936 -61988 -27780
4666 -27780 -13183 -51041 -61866 -62202 -41571 -42168 1735 19940 2640 -41352 -47667 -40804 -45681
4653 -45681 -26733 -32188 -14591 4496 -7160 21017 23064 3700 18083 50888 51953 -12512
$$ packed form
4745d3548k8061N11M2962L1848o553K785L721m8331O64K3162o320M146j9585n456
4731d8055J0143L6082M86k5816l22K5329R449M538o210k1044j0334J9349N5037
4718D8632M324j7046k0282j5225k7030J726K5813J7834k4538j2487M974j5249
4706b8554J3024j926J7702k163j2730k227J287K938q103L424J2779N230Q89L5779
4692C7349P124k421p168k3394k4975K2948K6273k2645j6456l468k50k200k461
4679a1744N458m612m12j296n419k4717R139N2526J3251n0642k8468j5052L4208
4666b7780J4597l7858j0825l36K0631n97M3903J8205j7300m3992o315O863m877
4653d5681J8948n455J7597J9087j1656K8177K047j9364J4383L2805J065o4465
$$ plain form
4641 -12512 -32611 -22507 -11873 -4274 9734 7886 -21181 -24630 -22700 -70151 -85665 -44753 5170
4628 5170 -4736 -33308 -49650 -52491 -21300 19610 -12125 -34768 -36246 -30542 -17355 -36646 -22262
4615 -22262 30585 45230 13834 -3609 -51209 -60327 -59105 -38387 -30268 -42002 -76708 -54331
4603 -54331 6517 -351 -26636 3110 9945 -20837 -27442 9238 68111 60347 19023 -21365 -12662
4590 -12662 25829 44434 27025 30394 24713 23607 65098 69104 63895 68762 51290 17501 11258
4577 11258 6339 -38505 -79092 -52554 -63615 -68322 -22296 -1244 -2126 6689 -10123 -1312 -31286
4564 -31286 -33996 -30773 -29693 -41475 -32388 -11858 8616 10270 -12937 11481 26709 4062 4715
4551 4715 21466 10944 5011 -8080 9191 1716 -5017 -5875 27997 68684 51103 16153 -29635
$$ packed form
4641a2512k0099J0104J0634P599J4008j848k9067l449J930m7451j5514M0912M9923
4628E170r906k8572j6342k841L1191M0910l1735k2643j478N704J3187j9291J4384
4615b2262N2847J4645l1396j7443m7600r118J222K0718Q119j1734l4706K2377
4603e4331O0848o868k6285K9746O835l0782o605L6680N8873p764m1324m0388Q703
4590a2662L8491J8605j7409L369n681j106M1491M006n209M867j7472l3789o243
4577A1258m919m4844m0587K6538j1061m707M6026K1052q82Q815j6812Q811k9974
4564c1286k710L223J080j1782R087K0530K0474J654k3207K4418J5228k2647O53
4551D715J6751j0522n933j3091J7271p475o733q58L3872M0687j7581l4950m5788
$$ plain form
4538 -29635 -49654 -42076 -15721 -10227 1871 15313 37094 43041 83605 95464 65565 51690
4526 51690 40913 57510 35668 25372 19385 20189 20816 32851 60568 74122 75380 25126 -21752
4513 -21752 -35512 -26842 -36692 -38709 -48338 -42044 -28127 -21104 -20108 -26461 13956 2058 10113 20209
4499 20209 1192 -49897 -76573 -76538 -70571 -82119 -65421 -20555 -22154 -35098 -25880 -46699 -42112
4486 -42112 -43550 -53871 -54783 -39841 -25918 -18730 -23985 -55732 -44820 5267 4727 -10651 -14572
4473 -14572 -26038 16670 47691 44539 48399 47424 22010 32455 45194 42612 46059 30370 29726
4460 29726 40138 -4459 -29973 -36713 -23714 -7627 6325 6974 -6589 -7943 -25704 -16456 60015
4447 60015 80442 55440 56043 56492 42320 44499 60237 83113 54916 6565 -15381 -35453 -49362
$$ packed form
4538b9635k0019P578K6355N494J2098J3442K1781N947M0564J1859k9899j3875
4526E1690j0777J6597k1842j0296n987Q04O27J2035K7717J3554J258n0254m6878
4513b1752j3760Q670r850k017r629O294J3917P023R96o353M0417j1898Q055J0096
4499B0209j9017n1089k6676L5N967j1548J6698M4866j599j2944R218k0819M587
4486d2112j438j0321r12J4942J3923P188n255l1747J0912N0087n40j5378l921
4473a4572j1466M2708L1021l152L860r75k5414J0445J2739k582L447j5689o44
4460B9726J0412m4597k5514o740J2999J6087J3952O49j3563j354j7761R248P6471
4447F0015K0427k5002O03M49j4172K179J5738K2876k8197m8351k1946k0072j3909
$$ plain form
4434 -49362 -18917 33760 47753 30936 8087 20664 18397 380 14031 23654 34556 -2756
4422 -2756 -18148 -21284 -48919 -38138 -16253 -6709 -52688 -63806 -35804 -38085 -17141 -1475 4784
4409 4784 11707 15604 25385 12339 28434 42286 28879 12899 -12073 -555 -37973 -70648 -80860
4396 -80860 -75166 -11263 53453 37025 -868 -7855 18224 22114 34959 34857 55975 48091 44631
4383 44631 38399 -17719 -4533 1609 19138 7247 -531 -36523 -45959 -69363 -89831 -62151 -40641
4370 -40641 -19830 -5315 -11558 -20484 -1103 4618 -20051 -7819 -4075 -38193 -57397 -44744 -30044
4357 -30044 -8135 -4099 34662 -12157 -49333 -45900 -32868 -7427 25123 45694 31744 8550
4345 8550 -405 -21447 -45743 -40862 -9044 -16281 -17213 5889 296 28245 14272 28796 26835
$$ packed form
4434d9362L0445N2677J3993j6817k2849J2577k267j8017J3651R623J0902l7312
4422b756j5392l136k7635J0781K1885R544m5979j1118K8002k281K0944J5666O259
4409D784O923L897R781j3046J6095J3852j3407j5980k4972J1518l7418l2675j0212
4396h0860N694O3903O4716j6428l7893o987K6079L890J2845j02K1118p884l460
4383D4631o232n6118J3186O142J7529j1891p778l5992r436k3404k0468K7680K1510
4370d0641K0811J4515o243q926J9381N721k4669J2232L744l4118j9204J2653J4700
4357c0044K1909M036L8761m6819l7176L433J3032K5441L2550K0571j3950k3194
4345H550q955k1042k4296M881L1818p237r32K3102n593K7949j3973J4524j961
$$ plain form
4332 26835 43691 25665 -1381 7113 15916 -1724 -3641 10776 41337 54545 45794 44714 39054
4319 39054 -2213 -45853 -48469 -16518 7321 33435 11543 -375 37040 26401 -9312 -21168
4307 -21168 -41380 -47880 -18445 3739 25868 17043 3504 31025 48091 40344 31606 41069 24363
4294 24363 10729 5199 -12530 -8146 10489 -3175 -6570 -22911 -13838 -49771 -33612 -9683 -26956
$$ packed form
4332B6835J6856j8026k7046Q494Q803j7640j917J4417L0561J3208q751j080n660
4319C9054m1267m3640k616L1951K3839K6114k1892j1918L7415j0639l5713j1856
4307b1168k0212o500K9435K2184K2129q825j3539K7521J7066p747q738R463j6706
4294B4363j3634n530j7729M384J8635j3664l395j6341R073l5933J6159K3929j7273
$$ [...]
##END NTUPLES=NMR SPECTRUM
##END=
