##TITLE=Analysis number 317574
Compound Code ac 12605
Project Code qc-cat
Chemist Name acros
##JCAMPDX= 6.0         $$ Bruker NMR JCAMP-DX V2.0
##DATA TYPE= NMR SPECTRUM
##DATA CLASS= NTUPLES
##ORIGIN= Bruker BioSpin GmbH
##OWNER= nmr
$$ XWIN-NMR		Version 3.5
$$ Fri Feb 24 09:01:05 2006 GMT Standard Time (UT+0h)  MAYBRIDGE\nmr@NMR_250MHZ
##.OBSERVE FREQUENCY= 250.131544655141
##.OBSERVE NUCLEUS= ^1H
##.ACQUISITION MODE= SIMULTANEOUS (DQD)
##.ACQUISITION SCHEME= undefined
##.AVERAGES= 16
##.DIGITISER RES= 18
##SPECTROMETER/DATA SYSTEM= dpx250
##.PULSE SEQUENCE= zg30
##.SOLVENT NAME= DMSO
##.SHIFT REFERENCE= (INTERNAL, DMSO, 0, 16.522)
##AUDIT TRAIL= $$ (NUMBER, WHEN, WHO, WHERE, WHAT)
$$ ##TITLE= Audit trail, XWIN-NMR		Version 3.5
$$ ##JCAMPDX= 5.01
$$ ##ORIGIN= Bruker BioSpin GmbH
$$ ##OWNER= nmr
$$ C:\u/data/dgb/nmr/ADRS/16810/pdata/1/auditp.txt
$$ ##AUDIT TRAIL=  $$ (NUMBER, WHEN, WHO, WHERE, WHAT)
(   1,<2006-02-24 09:00:43.92 +000>,<MAYBRIDGE\nmr>,<NMR_250MHZ>,
      <created by zg, POWCHK disabled, PULCHK disabled
       configuration hash MD5:
       84 BC 41 DB A1 6E 1D 46 DA 25 12 A5 C1 ED C5 3A
       data hash MD5: 64K
       E3 84 2D 18 0E A8 D3 41 64 63 7F BF 9B CD 8C FF>)
(   2,<2006-02-24 09:00:55.81 +000>,<MAYBRIDGE\nmr>,<NMR_250MHZ>,
      <Start of raw data processing
       ef LB = 0.3 FT_mod = 6 PKNL = 1 SI = 32K 
       data hash MD5: 32K
       1D 82 DF 1E 1D A8 4E ED 11 DF F0 5D DB 0E CE 91>)
(   3,<2006-02-24 09:00:57.52 +000>,<MAYBRIDGE\nmr>,<NMR_250MHZ>,
      <apk 
       data hash MD5: 32K
       C1 F6 A2 28 D3 37 E4 DA 8E A6 68 C4 7C FC 50 C3>)
(   4,<2006-02-24 09:00:58.45 +000>,<MAYBRIDGE\nmr>,<NMR_250MHZ>,
      <abs ABSG = 5 
       data hash MD5: 32K
       34 50 8D DA 90 03 10 B5 44 F6 B6 66 CE 79 42 2B>)
$$ ##END=
$$ 
$$ hash MD5
$$ 3A 23 E2 9F F5 83 81 64 B5 BE 12 C1 19 5C 30 A9
##$RELAX= 
##$RELAX= 
##$RELAX= 
##$RELAX= 
##$RELAX= 
##$RELAX= 
##$RELAX= 
$$ Bruker specific parameters
$$ --------------------------
##$DU= <C:\u>
##$EXPNO= 16810
##$NAME= <ADRS>
##$PROCNO= 1
##$TYPE= <nmr>
##$USER= <dgb>
##$AMP= (0..31)
100 100 100 100 100 100 100 100 100 100 100 100 100 100 100 100 100 100 
100 100 100 100 100 100 100 100 100 100 100 100 100 100 
##$AQSEQ= 0
##$AQ_mod= 3
##$AUNM= <au_zg>
##$AUTOPOS= <4 >
##$BF1= 250.13
##$BF2= 250.13
##$BF3= 250.13
##$BF4= 250.13
##$BF5= 500.13
##$BF6= 500.13
##$BF7= 500.13
##$BF8= 500.13
##$BYTORDA= 1
##$CFDGTYP= 0
##$CFRGTYP= 5
##$CHEMSTR= <none>
##$CNST= (0..31)
1 1 145 1 1 1 1 1 1 1 1 1 1 1 1 1 1 1 1 1 1 1 1 1 1 1 1 1 1 1 1 1 
##$CPDPRG= <>
##$CPDPRG1= <>
##$CPDPRG2= <>
##$CPDPRG3= <>
##$CPDPRG4= <mlev>
##$CPDPRG5= <mlev>
##$CPDPRG6= <mlev>
##$CPDPRG7= <mlev>
##$CPDPRG8= <mlev>
##$CPDPRGB= <>
##$CPDPRGT= <>
##$D= (0..31)
0 1 0 0 0 0 0 0 0 0.06 0 0 0 0 0 0 0.0002 0 0 0 0 0 0 0 0 0 0 0 0 0 0 
0 
##$DATE= 1140771643
##$DBL= (0..7)
120 120 120 120 120 120 120 120 
##$DBP= (0..7)
150 150 150 150 150 150 150 150 
##$DBP07= 0
##$DBPNAM0= <>
##$DBPNAM1= <>
##$DBPNAM2= <>
$$ [...]
##$SUBNAM7= <"">
##$SUBNAM8= <"">
##$SUBNAM9= <"">
##$SW= 20.6930455092707
##$SWIBOX= (0..15)
0 0 3 0 0 0 0 0 0 0 0 0 0 0 0 0 
##$SW_h= 5175.983436853
##$TD= 65536
##$TD0= 1
##$TE= 293.16
##$TE2= 300
##$TE3= 300
##$TEG= 300
##$TL= (0..7)
0 120 120 120 120 120 120 120 
##$TP= (0..7)
150 150 150 150 150 150 150 150 
##$TP07= 0
##$TPNAME0= <>
##$TPNAME1= <>
##$TPNAME2= <>
##$TPNAME3= <>
##$TPNAME4= <>
##$TPNAME5= <>
##$TPNAME6= <>
##$TPNAME7= <>
##$TPOAL= (0..7)
0.5 0.5 0.5 0.5 0.5 0.5 0.5 0.5 
##$TPOFFS= (0..7)
0 0 0 0 0 0 0 0 
##$TUNHIN= 0
##$TUNHOUT= 0
##$TUNXOUT= 0
##$USERA1= <user>
##$USERA2= <user>
##$USERA3= <user>
##$USERA4= <user>
##$USERA5= <user>
##$V9= 5
##$VALIST= <valist>
##$VCLIST= <CCCCCCCCCCCCCCC>
##$VD= 0
##$VDLIST= <DDDDDDDDDDDDDDD>
##$VPLIST= <PPPPPPPPPPPPPPP>
##$VTLIST= <TTTTTTTTTTTTTTT>
##$WBST= 1024
##$WBSW= 4
##$XGAIN= (0..3)
0 0 0 0 
##$XL= 0
##$YL= 0
##$YMAX_a= 299777
##$YMIN_a= -461855
##$ZGOPTNS= <>
##$ZL1= 120
##$ZL2= 120
##$ZL3= 120
##$ZL4= 120
##$ABSF1= 16.522
##$ABSF2= -4.171173
##$ABSG= 5
##$ABSL= 3
##$ALPHA= 0
##$AQORDER= 0
##$ASSFAC= 0
##$ASSFACI= 0
##$ASSFACX= 0
##$ASSWID= 0
##$AUNMP= <proc_1d>
##$AZFE= 0.1
##$AZFW= 0.1
##$BCFW= 0
##$BC_mod= 0
##$BYTORDP= 0
##$COROFFS= 0
##$CY= 12.5
##$DATMOD= 1
##$DC= 0
##$DFILT= <>
##$DTYPP= 0
##$F1P= 14.0000005364418
##$F2P= -0.99999901652339
##$FCOR= 0.5
##$FTSIZE= 32768
##$FT_mod= 6
##$GAMMA= 0
##$GB= 0
##$INTBC= 1
##$INTSCL= 1
##$ISEN= 128
##$LB= 0.3
##$LEV0= 0
##$LPBIN= 0
##$MAXI= 10000
##$MC2= 0
##$MEAN= 0
##$ME_mod= 0
##$MI= 0
##$NCOEF= 0
##$NC_proc= -4
##$NLEV= 6
##$NOISF1= 0
##$NOISF2= 0
##$NSP= 0
##$NTH_PI= 0
##$NZP= 0
##$OFFSET= 16.522
##$PC= 1
##$PHC0= 236.7155
##$PHC1= 3.197298
##$PH_mod= 1
##$PKNL= yes
##$PPARMOD= 0
##$PSCAL= 4
##$PSIGN= 0
##$REVERSE= no
##$SF= 250.13
##$SI= 32768
##$SIGF1= 0
##$SIGF2= 0
##$SINO= 400
##$SIOLD= 32768
##$SREGLST= <1H.DMSO>
##$SSB= 0
##$STSI= 32768
##$STSR= 0
##$SW_p= 5175.98343685301
##$SYMM= 0
##$S_DEV= 0
##$TDeff= 65536
##$TDoff= 0
##$TI= <Analysis number 999999
Compound Code 99
Book Reference 9
Project Code 9>
##$TILT= no
##$TM1= 0
##$TM2= 0
##$TOPLEV= 0
##$USERP1= <user>
##$USERP2= <user>
##$USERP3= <user>
##$USERP4= <user>
##$USERP5= <user>
##$WDW= 1
##$XDIM= 32768
##$YMAX_p= 371616113
##$YMIN_p= -750964
$$ End of Bruker specific parameters
$$ ---------------------------------
##NTUPLES= NMR SPECTRUM
##VAR_NAME=  FREQUENCY,     SPECTRUM/REAL,   SPECTRUM/IMAG
##SYMBOL=    X,             R,               I
##VAR_TYPE=  INDEPENDENT,   DEPENDENT,       DEPENDENT
##VAR_FORM=  AFFN,          ASDF,            ASDF
##VAR_DIM=   32768,         32768,           32768
##UNITS=     HZ,            ARBITRARY UNITS, ARBITRARY UNITS
##FACTOR=    0.157963299565203, 1,           1
##FIRST=     4132.6476996994, 0,             0
##LAST=      -1043.33573715361, 0,           0
##MIN=       -1043.33573715361, -750964,     0
##MAX=       4132.6476996994, 371616113,     0
$$ Real data points
##PAGE= N=1
##DATA TABLE= (X++(R..R)), XYDATA
$$ [...]
18076G0542k9319J0630K0306j1630m2109K6789O698l0941o0421l0787M3423K6158
$$ 70542 41223 51853 72159 60529 18420 45209 51907 20966 -39455 -70242 -26819 -661
18064f61J0702j2325L66J8750M5067N0522M6117Q0092L1180o952k1556k32L7774
$$ -661 10041 -2284 -1918 16832 61899 112421 158538 238630 269810 262858 241302 241070 278844
18051B78844K5160j9073K188O6091M5621M2573J2796k3954j5547J3498M3053O0544
$$ 278844 304004 284931 287119 353210 398831 441404 454200 430246 414699 428197 471250 531794
18039E31794J5968N1660K1934q437l7001L888l246K2792O4533M7632L6908j7947
$$ 531794 547762 599422 621356 612919 575918 579806 576560 599352 663885 711517 748425 730478
18027G30478P5487J78351J28620J63416J87966K34030L58374M82442P27568R43921
$$ 730478 805965 984316 1112936 1276352 1464318 1698348 2056722 2539164 3266732 4210653
18017D210653J273644J746187K444826L196003L388340K975281K090122J287962
$$ 4210653 5484297 7230484 9675310 12871313 16259653 19234934 21325056 22613018
18009B2613018O02416J18922n27683j498768k451371l069707l225561k763789
$$ 22613018 23215434 23334356 22806673 21307905 18856534 15786827 12561266 9797477
18001I797477k074658j503724j066585p57957n42370l52898k86148k25639j82976
$$ 9797477 7722819 6219095 5152510 4394553 3852183 3499285 3213137 2987498 2804522
17992B804522j21122j12361r6695j31254q9339k9429J3995m9827j13143q1862
$$ 2804522 2683400 2571039 2474344 2343090 2253751 2224322 2238317 2188490 2075347 1993485
17982A993485M0632J00059Q8501J47621K03642J73377M3690J01438K33621L30271
$$ 1993485 2034117 2134176 2222677 2370298 2573940 2747317 2791007 2892445 3126066 3456337
17972C456337L37690M72836O46514Q46424J150896J568520K236264L339808M689760
$$ 3456337 3794027 4266863 4913377 5759801 6910697 8479217 10715481 14055289 18745049
17963A8745049O235006P389991P123760N704303L696783J818905O47694l56607
$$ 18745049 24980055 32370046 39493806 45198109 48894892 50713797 51361491 51004884
17955E1004884k161977m517573o422568p377704o848388n422445l878542k742367
$$ 51004884 48842907 44325334 37902766 30525062 23676674 18254229 14375687 11633320
17947A1633320j965799j568825j141211q69033o81432n31074m50624m22502k77079
$$ 11633320 9667521 8098696 6957485 6088452 5407020 4875946 4425322 4002820 3725741
17938C725741j42469j40522j88179j75036k08077j79649j40934j9601M1693L1202
$$ 3725741 3583272 3442750 3254571 3079535 2871458 2691809 2550875 2531274 2572967 2604169
17928B604169J6757L4127N5199R5067R907J163R2931J78058J81096K31902L03703
$$ 2604169 2620926 2655053 2710252 2805319 2815226 2816389 2909320 3087378 3268474 3500376 3804079
17917C804079M77869P44556R98594J447621K047938K833308L753574M177122L845233
$$ 3804079 4281948 5026504 6025098 7472719 9520657 12353965 16107539 20284661 24129894
17908B4129894K812732J517919N61792K3874o00236j717656l037626m008219m239766
$$ 24129894 26942626 28460545 29022337 29046211 28445975 26728319 23690693 19682474 15442708
17899A5442708l640354k657083j937783j405137r55765p14845o16009n31318l66165
$$ 15442708 11802354 9145271 7207488 5802351 4846586 4131741 3515732 2984414 2618249
17890B618249l60917k30967j02324j32580k01747j33363n1197j46412j13783q9064
$$ 2618249 2257332 2026365 1924041 1791461 1589714 1456351 1405154 1258742 1144959 1055895
17880A055895n2778k0558R600J1829J3522J1597J6134P365r4781m8796l8472q1194
$$ 1055895 1003117 982559 992159 1003988 1017510 1029107 1045241 1052606 957825 909029 870557 789363
17868G89363p303k1452q8469j12574m6762J8300Q313n9811p4818m5499P602L1139
$$ 789363 782060 760608 672139 559565 512803 531103 539416 479605 404787 359288 366890 398029
17856C98029j7253N9097L8455j5942j5264j2440q5151q6870N27K6321N5478q2090
$$ 398029 380776 439873 478328 462386 447122 434682 349531 262661 263188 289509 344987 262897
17844B62897j28066l0468M5100N9109K3214k0160J3394O6234J9963j4036M0533
$$ 262897 134831 104363 149463 208572 231786 211626 225020 291254 311217 297181 337714
17833C37714n8499j5129K2338m1417j3102m3045m7669M989N2923p4950l3450l594
$$ 337714 279215 264086 286424 245007 231905 188860 141191 146180 199103 124153 90703 87109
17821H7109m3500L8880P0869K0103J9432M3235l1899p7270k3225j1558l465O5170
$$ 87109 43609 82489 153358 173461 192893 236128 204229 126959 103734 92176 88711 153881
17809A53881M2518j1795r8809j4844M1472M0483m008L1068r14l4014K510M6635
$$ 153881 196399 184604 85795 70951 112423 152906 148898 179966 179052 145038 147548 194183
17797A94183K8170n1045l6246K8424Q8140L6972N4760j8226O7308M9101m5377
$$ 194183 222353 171308 135062 163486 251626 288598 343358 325132 392440 441541 396164
17786C96164o6510p1489n0394k3182O342J3773M8510O1846j2635j12049m0859
$$ 396164 329654 258165 207771 184589 190931 204704 253214 315060 302425 190376 149517
17775A49517j2030j7331l676L9947O9622j4442Q800p1359o7618m7367M3235L2118
$$ 149517 137487 120156 116480 156427 226049 211607 220407 149048 81430 34063 77298 109416
17763A09416m2117j2734O1246P318l9163l3991J6592J5848J2952j4073N8955K7842
$$ 109416 67299 54565 115811 123129 83966 49975 66567 82415 95367 81294 140249 168091
17751A68091K3613P142q1691j97n690K8444L5420P0614R448n6603M4528J40800
$$ 168091 191704 198846 117155 116958 111268 139712 175132 245746 255194 198591 243119 383919
17739C83919P4675L5162L2169n1903P494N1830O1515o96o456m8448l4905p0357
$$ 383919 458594 493756 525925 474022 481516 533346 594861 594165 587709 539261 504356 433999
17727D33999J4049j2137L332K079N9056N1904m3056j6603R23o19J6162p428m9999
$$ 433999 448048 435911 439243 441322 500378 552282 509226 492623 493546 492927 509089 501661 451662
17714D51662q1897k3370p4990o5179k0060J8554J2017r272k4510K0254K0789R577
$$ 451662 369765 346395 271405 206226 186166 204720 216737 207465 182955 203209 223998 233575
17702B33575l2481n9133l2792J1399K8909Q1573k9489Q521J7677k5889J06877
$$ 233575 201094 141961 109169 120568 149477 231050 201561 210082 227759 201870 308747
17691C08747P8154N3251J7918j5215J7178O2607J03249L8362M9120K759M7428
$$ 308747 386901 440152 458070 442855 460033 522640 625889 664251 713371 716130 763558
17680G63558J36150J02911J39990J03888M5214O9272Q191j9058K7483O0181L3756
$$ 763558 899708 1002619 1142609 1246497 1291711 1360983 1369174 1350116 1377599 1437780 1471536
17669A471536m2736k8668o0450o2292l3157l8843m1559r4876r0172n3694l3275
$$ 1471536 1428800 1400132 1339682 1277390 1244233 1205390 1163831 1068955 978783 925089 891814
17658H91814m7371n5493p4954j12426o5398m6736l8305o015N2160m66k2667L1945
$$ 891814 844443 788950 713996 601570 536172 489436 451131 445116 497276 496810 474143 506088
17646E06088J0883L1278J2461m8874k5595R203l114J2065q508J3553L3245n9572
$$ 506088 516971 548249 560710 511836 486241 495444 492330 504395 495887 509440 542685 483113
17634D83113k0855k1762p0834k0616N2385P323m2453l1902j5045o884n1981j16605
$$ 483113 462258 440496 369662 349046 401431 408754 366301 334399 319354 312470 260489 143884
17622A43884l4814Q081l7125l310M8164k9489n314k7270o503J1137k3028L4991
$$ 143884 109070 117151 80026 76716 124880 95391 90077 62807 56304 67441 44413 79404
17610G9404M6031K4975l9457n6516K264n3640m8621M0467M7714k2379m9835N563
$$ 79404 125435 150410 110953 54437 56701 3061 -45560 -5093 42621 20242 -29593 -24030
17598b4030K0486j8081K0571o732J9426N2274M620k4853O253j1041K0849L9464
$$ -24030 -3544 -21625 -1054 -7786 11640 63914 68534 43681 49934 38893 59742 99206
17586I9206J00258N6403k4048k8196k6283j5986j3384J6909q391q297l7224K2156
$$ 99206 199464 255867 231819 203623 177340 161354 147970 164879 156488 148191 110967 133123
17574A33123m3211J9077O1712j765P571j7994N820L6050j9036k4278L861r289
$$ 133123 89912 108989 170701 168936 176507 158513 164333 200383 181347 157069 160930 151641
17562A51641n1982n7000K7867O8828N3341j43q1533p8910m661O721K8822N8972
$$ 151641 99659 42659 70526 139354 192695 192552 111019 32109 27448 34169 62991 121963
17550A21963L2151l7776m7360j6716m1626J419M6521j8356n9423j9387J5195R9719
$$ 121963 154114 116338 68978 52262 10636 12055 58576 40220 -19203 -38590 -23395 76324
17538G6324j4131k4728k7691j6137P529N6053K9950L8605M8915P2564k7782q2336
$$ 76324 62193 37465 9774 -6363 1166 57219 87169 125774 174689 247253 219471 137135
17526A37135K5490M6123l8797M4420m5578K1393l7757o8702Q7669M6676l5495
$$ 137135 162625 208748 169951 214371 168793 190186 152429 83727 171396 218072 182577
17515A82577j9526k0756j3544k2823l6521P822J6317M9251N3581K2329J5582l4497
$$ 182577 163051 142295 128751 105928 69407 77229 93546 142797 196378 218707 234289 199792
17503A99792n8342l4080m9129j6731l0143k8844J0973K4083M4841L0834k9569
$$ 199792 141450 107370 58241 41510 11367 -17477 -6504 17579 62420 93254 63685
17492F3685m9156n0275l2016O6373N4667M501J4253K9869O5258j2401q9379k7418
$$ 63685 14529 -35746 -67762 -1389 53278 57779 72032 101901 167159 154758 65379 37961
17480C7961M7475K4168K5430j4983j3700K0953J6967M1998M0227K0949M1387L847
$$ 37961 85436 109604 135034 120051 106351 127304 144271 186269 226496 247445 288832 292679
17468B92679K8831K1151m8130m8237j2828N0708M2410J450m6624n1305O5611P6587
$$ 292679 321510 342661 294531 246294 233466 284174 326584 328034 281410 230105 295716 372303
17456C72303M0081K8180M3270J3396k1387p564l3559k7927r5842j24204l9129
$$ 372303 412384 440564 483834 497230 475843 468279 434720 406793 310951 186747 147618
17445A47618j6216k5204N7015L8585k2310J0462l1299p456m1147l9561J1511l5477
$$ 147618 131402 106198 163213 201798 179488 189950 158651 151195 110048 70487 81998 46521
17433D6521K1538L7333l6892m1319J1826O0886n7530k3944L1055k8274K371P561
$$ 46521 68059 105392 68500 27181 39007 99893 42363 18419 49474 21200 23571 31132
17421C1132j8077l8002L6784O9951L7821J7331o5898r410L3105o1448k4444P337
$$ 31132 13055 -24947 11837 81788 119609 136940 71042 61632 94737 33289 8845 16182
17409A6182M3662M2600L2749N5093R5159O0799l2320k7040o428l2404m3248k0606
$$ 16182 59844 102444 135193 190286 285445 346244 313924 286884 280456 248052 204804 184198
17397A84198j4324j3558m3770m0111J5222L3790L0605K617j984K1181k108p4620
$$ 184198 169874 156316 112546 72435 87657 121447 152052 154669 152685 173866 171758 97138
17385I7138K2308l807j0049j2591J8428M8774J167R811P73l6181l2007Q370o52
$$ 97138 119446 115639 105590 92999 111427 160201 161368 171179 171952 135771 103764 112134 111482
17372A11482l6191K4615p627K606j870l009o6631J0172P6139M1166m1582l1665
$$ 111482 75291 99906 92279 94885 93015 90006 23375 33547 109686 150852 109270 77605
17360G7605l8978p2016q538L6783j7005J8036j5642K1138J556k3376k1773O8642
$$ 77605 38627 -33389 -41927 -5144 -22149 -4113 -19755 1383 2939 -20437 -42210 26432
17348B6432R9988k3694j1307l958n0741L8101k5854m3591L287L9180j4620l8726
$$ 26432 126420 102726 91419 87461 36720 74821 48967 5376 8663 47843 33223 -5503
17336e503L059J2647N9877K6751k1586n095L0781K9844L0000J1845j5911o9814
$$ -5503 -2444 10203 70080 96831 75245 70150 100931 130775 160775 172620 156709 86895
17324H6895j0844J5205O2002M1791o4266j8816q7097M7476O7660L6119O176J4937
$$ 86895 76051 91256 153258 195049 130783 111967 24870 72346 140006 176125 182301 197238
17312A97238j08743r1906N7092k2834q2223L4144j1908p786J3757K7772l592k3964
$$ 197238 88495 -3411 53681 30847 -51376 -17232 -29140 -36926 -23169 4603 1011 -22953
17300b2953o8331L0670O0003K3884M193m0066j2827L6968J3141L078j5973j9218
$$ -22953 -91284 -60614 -611 23273 27466 -12600 -25427 11541 24682 27760 11787 -7431
17288g431l89K8546k3194J523j4515q422m843J166J04306L3278L0110J5442J1603
$$ -7431 -7820 20726 -2468 -945 -15460 -23882 -28725 -27559 76747 110025 140135 155577 167180
17275A67180l9935q0963p230J5878j9577m533M7044n3494L149P740J0547J6312
$$ 167180 127245 46282 39052 54930 35353 30820 77864 24370 27519 35259 45806 62118
17263F2118l3911o1760J1010m6126R381K8996j2296L8921K0786K192l0690o5905
$$ 62118 28207 -33553 -22543 -68669 -59288 -30292 -42588 -3667 17119 19311 -11379 -77284
17251g7284O8029K3953n0029J734K2955N2796l104j6076m8195q287L7473n1801
$$ -77284 -9255 14698 -35331 -33597 -10642 42154 39050 22974 -25221 -33508 3965 -47836
17239d7836j7675N736r430L7126k5520j1759N6726N0392l8574q3850J708K8123
$$ -47836 -65511 -59775 -69205 -32079 -57599 -69358 -12632 37760 -814 -84664 -82956 -54833
17227e4833P2299M0001p5654M029J6905j575l4280L3601M280j3214j8795m9029
$$ -54833 17466 57467 -18187 -14158 2747 1172 -33108 493 4773 -8441 -27236 -76265
17215g6265k2188O4728L1722j0321k3923j883P052k374Q2877j0964j1777K6679
$$ -76265 -98453 -33725 -2003 -12324 -36247 -38130 -31078 -33452 49425 38461 26684 53363
17203E3363l763n9075k4554j8573l174O1366L5726O9114K4475j43984n4874K4818
$$ 53363 49600 -9475 -34029 -52602 -55776 5590 41316 110430 134905 -9079 -63953 -39135
17191c9135M5182K4313k314K8275j2941j5414O370k5371n0521M6773L0743m3246
$$ -39135 6047 30360 28046 56321 43380 27966 34336 8965 -41556 5217 35960 -7286
17179g286K9602J0557J2720P8116j9995o3431l1295L5028n1806K9213J2369p8206
$$ -7286 22316 32873 45593 123709 103714 40283 8988 44016 -7790 21423 33792 -44414
17167d4414N7540L1278j0707N6434M0297j5391n7446J3677M1257K486k7494o66
$$ -44414 13126 44404 33697 90131 130428 115037 57591 71268 112525 115011 87517 86851
17155H6851L4797l464j999k9964k2695Q3472N8341o3980j6678m8209m0831K5392
$$ 86851 121648 118184 116185 86221 63526 146998 205339 141359 124681 76472 35641 61033
17143F1033P3338K7626l1636j1629N367M6011j047j9112n0810m0030l933J9057
$$ 61033 134371 161997 130361 118732 124099 170110 169063 149951 99141 59111 55178 74235
17131G4235N3447J1187K4245N4898J1715l8842K3676M2231L9705m7158J4074K3641
$$ 74235 127682 138869 163114 218012 229727 190885 214561 256792 296497 249339 263413 287054
17119B87054L3289K8367l9739P846O3932N4835n70n435L1948k3609N4336O3028
$$ 287054 320343 348710 308971 316817 380749 435584 435014 429579 461527 437918 492254 555282
17107E55282K5654N0763O7683P8904O8186j5968P7476R8603O6758J60407J37128
$$ 555282 580936 631699 699382 778286 846472 830504 907980 1006583 1073341 1233748 1370876
17096A370876J00026J16453R6118J74319J48891L22077M62925M86566O20143P86651
$$ 1370876 1470902 1587355 1683473 1857792 2006683 2328760 2791685 3278251 3898394 4685045
17086D685045R88342J319354J543018J672955J566960J405725J368951J463154
$$ 4685045 5673387 6992741 8535759 10208714 11775674 13181399 14550350 16013504
17078A6013504J581618J441366J175306Q19943N20102K88477L12302N62103R20630
$$ 16013504 17595122 19036488 20211794 21031737 21551839 21840316 22152618 22714721 23635351
17069B3635351R74606O30234J37558p9275n7570K96465N12259N07470J75726l10720
$$ 23635351 24609957 25240191 25377749 25298474 25240904 25537369 26049628 26557098 26732824 26422104
17059B6422104q09516j191777j446899j378478j286045j529286j993832k286484
$$ 26422104 25612588 24420811 22973912 21595434 20309389 18780103 16786271 14499787
17051A4499787k342167k012060j606249j174379q90270p22771n38037l31913k73701
$$ 14499787 12157620 10145560 8539311 7364932 6474662 5751891 5213854 4881941 4608240
17042D608240j96312o6081m3277k5590J49121K30629M02144N60932P79401J036987
$$ 4608240 4411928 4345847 4302570 4276980 4426101 4656730 5058874 5619806 6399207 7436194
17032G436194J132981J125987J090402R47409R03224J053785J120020J034504
$$ 7436194 8569175 9695162 10785564 11732973 12636197 13689982 14810002 15844506
17024A5844506Q86587O93970N80403L86493M97377Q71230J257634J376790J093208
$$ 15844506 16731093 17425063 18005466 18391959 18889336 19760566 21018200 22394990 23488198
17015B3488198O55687K39543K37854M77621P04643P70414M34709j00694o81001
$$ 23488198 24143885 24383428 24621282 25098903 25803546 26573960 27008669 26907975 26226974
17006B6226974j310078j625049j518214j485337j423933j752233k032818k055007
$$ 26226974 24916896 23291847 21773633 20288296 18864363 17112130 15079312 13024305
16998A3024305j797818j336859q51372n07078j65893P5067L08330P34536J103595
$$ 13024305 11226487 9889628 9038256 8531178 8365285 8440352 8748682 9483218 10586813
16989A0586813J558160J818672K088418K149947K019634J702137J079949O52545
$$ 10586813 12144973 13963645 16052063 18202010 20221644 21923781 23003730 23656275
16981B3656275N39397O07393R07623J396110J900035K093798K286356K248479
$$ 23656275 24195672 24803065 25710688 27106798 29006833 31100631 33386987 35635466
16973C5635466K172320J944550J483514R58332L84626j81988o38813p71500n19381
$$ 35635466 37807786 39752336 41235850 42194182 42578808 42396820 41758007 40986507 40467126
16964D0467126M4511O37385R07671P71863Q5561p97157j670431k273576k535096
$$ 40467126 40511637 41149022 42056693 42828556 42914117 42116960 40446529 38172953 35637857
16955C5637857k634154k526062k319452k035105j724603j341706r10663n98962
$$ 35637857 33003703 30477641 28158189 26123084 24398481 23056775 22146112 21547150
16947B1547150m84027o52003j055902j622379k023600k189261k160990j835292
$$ 21547150 21063123 20411120 19355218 17732839 15709239 13519978 11358988 9523696
16939I523696j518266j234500r21358o74697n56133m69194m01088l68467k75124
$$ 9523696 8005430 6770930 5849572 5174875 4618742 4149548 3748460 3379993 3104869
16930C104869j50455j39940k21802j51230j90173j61937j09998p2507p0983l4627
$$ 3104869 2954414 2814474 2592672 2441442 2251269 2089332 1979334 1906827 1835844 1801217
16920A801217n3583o0953n1525j4320o7679m8868l2066j4909l5453L0883O72m7437
$$ 1801217 1747634 1686681 1635156 1620836 1553157 1504289 1472223 1457314 1421861 1452744 1453416 1405979
16908A405979J6701J567K5767P2795J49029M8322Q400M1211O9046J37475O9205
$$ 1405979 1422680 1424247 1450014 1522809 1671838 1720160 1728560 1769771 1838817 1976292 2045497
16897B045497M3148J34936K32573K09183K50017L10892L94453N27255P74540J023154
$$ 2045497 2088645 2223581 2456154 2665337 2915354 3226246 3620699 4147954 4922494 5945648
16887E945648J489414K099290K561256K660247K450098K089534K023470K258837
$$ 5945648 7435062 9534352 12095608 14755855 17205953 19295487 21318957 23577794
16879B3577794K347202J920088J087157K40645n11496p90563n83304l46774l30510
$$ 23577794 25924996 27845084 28932241 29172886 28661390 27870827 27287523 26940749 26610239
16870B6610239p05669r85845j033092q22319l26947J75760M42879K56222k13313
$$ 26610239 25904570 24918725 23885633 23063314 22736367 22912127 23355006 23611228 23397915
16861B3397915q11697j239351j463217j448989j429802j613798j987671k198641
$$ 23397915 22586218 21346867 19883650 18434661 17004859 15391061 13403390 11204749
16853A1204749k008564j546576j103641p85536n36452l84345k87251k10848j08644
$$ 11204749 9196185 7649609 6545968 5760432 5223980 4839635 4552384 4341536 4232892
16844D232892o5615p2944L2890J71577K62974L66330M99647P04219J108393J514987
$$ 4232892 4167277 4094333 4127223 4298800 4561774 4928104 5427751 6131970 7240363 8755350
16834H755350J962846K327580K314071J920575J591516J614537J790357J800854
$$ 8755350 10718196 13045776 15359847 17280422 18871938 20486475 22276832 24077686
16826B4077686J542820Q53159n7184p26425q46407n20589j32766j943k69586o02504
$$ 24077686 25620506 26473665 26416481 25690056 24843649 24323060 24190294 24188351 23918765 23316261
16816B3316261p72433n51947j18843L55810M55835P5864m59224j105468j643413
$$ 23316261 22543828 21991881 21873038 22228848 22684683 22760547 22301323 21195855 19552442
16807A9552442j779196j587508j531125j741491j990340k050421j735556j283176
$$ 19552442 17773246 16185738 14654613 12913122 10922782 8872361 7136805 5853629
16799E853629r35285o92693n49551m72358l64683k44280j98028j38426j61299
$$ 5853629 4918344 4225651 3676100 3203742 2839059 2594779 2396751 2258325 2097026
16790B097026q0613j14841j05851j27539j20870j23978n1779o3349j15129o5006
$$ 2097026 2016413 1901572 1795721 1668182 1547312 1423334 1371555 1308206 1193077 1128071
16780A128071j09396j31172k5776m3645m0673N1102n4748k0361M864j2833o5054
$$ 1128071 1018675 887503 861727 818082 777409 828511 773763 753402 758266 745433 680379
16769F80379j10289o0076M1299J3913k4470o0468j9576P764m0971k2698q473k0274
$$ 680379 570090 510014 551313 565226 540756 480288 460712 468476 427505 404807 396334 376060
16757C76060l2549l7048L3680m1137m1359J051N8282J3066q1q22j792k1726o4137
$$ 376060 343511 306463 340143 299006 257647 258698 316980 330046 329965 329143 327351 305625 241488
16744B41488N2346L3961L4666l4548l0753l8838J4850k9800k2347N527M3229o8204
$$ 241488 293834 327795 362461 327913 297160 258322 273172 243372 221025 226552 269781 201577
16732B01577j8106K8291Q6483L0131k0499m915K1992N1051N0312l7934j2282m7553
$$ 201577 183471 211762 298245 328376 307877 302962 324954 376005 426317 388383 376101 328548
16720C28548l6275L5774N5471j860j1855J3900k2493k8748P1570M5275k1734J3025
$$ 328548 292273 328047 383518 381658 369803 383703 361210 332462 404032 449307 427573 440598
16708D40598k1251k6118j0835L8935j2502m803N9295j159p7324q6501m1596m3080
$$ 440598 419347 393229 382394 421329 408827 404024 463319 462160 384836 298335 256739 213659
16696B13659l8898P5143K3518K0419m5896j3920R651l2553N169J8118J7370k9220
$$ 213659 174761 249904 273422 293841 247945 234025 243676 211123 216292 234410 251780 222560
16684B22560l6768K01j3445J7459p0975l6892k3851Q8781K1079m6758m228M6861
$$ 222560 185792 185993 172548 190007 119032 82140 58289 147070 168149 121391 117163 164024
16672A64024M6245M4320L8342O7957m7049m6850R962Q037j6397o069o86J7109
$$ 164024 210269 254589 292931 360888 313839 266989 276951 284988 268591 262522 261836 278945
16660B78945M992j3652K4088P7716J6790m6019n0936k2760L6519N0653k6338l9839
$$ 278945 283937 270285 294373 372089 388879 342860 291924 269164 305683 356336 329998 290159
16648B90159o43k0323l4719o887k5726j7219K3640M83K2263j7474j8975m1792
$$ 290159 289516 269193 234474 227587 201861 184642 208282 208765 231028 213554 194579 152787
16636A52787K6157P181O619J7434L868n4928j0603m3002j5324k4869o7926M9086
$$ 152787 178944 186125 192744 210178 214046 159118 148515 105513 90189 65320 -2606 46480
16624D6480P8250M3857k1085n0231k0603l0118L040M6546J1029j9745K0593R345
$$ 46480 124730 168587 147502 97271 76668 46550 49590 96136 107165 87420 108013 117358
16612A17358J1044l0580k9449m5692m9677o4074l6624L7014O9934k0418J8383
$$ 117358 128402 97822 68373 22681 -26996 -91070 -127694 -90680 -20746 -41164 -22781
16601b2781R844L3763K9980K3541K5864K9039J0832M208J1458j4397j5496L9133
$$ -22781 -12937 20826 50806 74347 100211 129250 140082 144290 155748 141351 125855 164988
16589A64988q353p282l3613n6379J9218m0732k1778O2224K5538K1476L3471r695
$$ 164988 156635 149353 115740 59361 78579 37847 16069 78293 103831 125307 158778 149083
16577A49083r0240k0647k980M7892K9615N5277K7367K9643r889l3494J6278K425
$$ 149083 58843 38196 35216 83108 112723 168000 195367 225010 215121 181627 197905 200330
16565B00330L6004N777j2553O297j1104K7025n870M611k2544m6163M0130k218
$$ 200330 236334 242111 229558 235855 224751 251776 245906 250517 227973 181810 221940 219722
16553B19722o1511n2614L0992k1835n0177L9785p635o9470l7237J2696J1775K6962
$$ 219722 158211 105597 136589 114754 64577 104362 96727 27257 -9980 2716 14491 41453
16541D1453J3254J5766r491j7561J4492N728L6462J0071P876j0434L5740M9296
$$ 41453 54707 70473 60982 43421 57913 63641 100103 110174 118050 107616 143356 192652
16529A92652k4666l0393o1351K4156M4697j1885l8678k0548N6493j0731J3146
$$ 192652 167986 137593 76242 100398 145095 133210 94532 73984 130477 119746 132892
16518A32892P751R129M161m2369M4306J55994L6163q5896j01436l9264p780l8925
$$ 132892 140643 149772 153933 111564 155870 311864 348027 262131 160695 121431 113651 74726
16506G4726N3854J12338o1384k5343Q4l1599K9235M8822K8304n1373K091L8579
$$ 74726 128580 240918 179534 154191 154275 122676 151911 200733 229037 177664 179755 218334
16494B18334k2538m1781m3367j6103J9394N7678M7693j5546l5451k8584N53K2225
$$ 218334 195796 154015 110648 94545 113939 171617 219310 203764 168313 139729 140282 162507
16482A62507j90r493L0994J3078j7963k6370l4300M4925L3382M92K930j3068l5575
$$ 162507 162317 152824 183818 196896 178933 152563 118263 163188 196570 197062 199992 186924 151349
16469A51349L6342M5152P831n516n1371L3431R5867n999m1267k5487o1194j2332
$$ 151349 187691 232843 240674 235158 183787 217218 313085 307086 265819 240332 179138 166806
16457A66806N4411k3095k5598k4115m9629K0640j6814N306r3502j3651M9606j3852
$$ 166806 221217 198122 172524 148409 98780 119420 102606 107912 14410 759 50365 36513
16445C6513K8846O3809K8840o1825l0445J6429j9685n0657L3559k966K2476J491
$$ 36513 65359 129168 158008 96183 65738 82167 62482 11825 45384 42418 64894 66385
16433F6385l8404r195K5870J885k4397N3930L5105j718J9628k2170m5264r6977
$$ 66385 27981 18786 44656 46541 22144 76074 111179 109461 129089 106919 61655 -35322
16421c5322r4807M5329M4463K6138K8781L5284j893j0139L1098J3660J8062j3836
$$ -35322 -130129 -84800 -40337 -14199 14582 49866 47973 37834 68932 82592 100654 86818
16409H6818n8768K1288m5085l1669Q483K8899k1245n693o982L8086J4674k6001
$$ 86818 28050 49338 4253 -27416 -18933 9966 -11279 -16972 -23954 14132 28806 2805
16397B805o8393q730M9595N9233M1410L965j5352m155l4888j423j9300k1923j4845
$$ 2805 -65588 -74318 -24723 34510 75920 79885 64533 60378 25490 24067 4767 -17156 -32001
16384c2001m6472l0878J5759K573j8109J7811N9688J12007N4824n379m8201K9354
$$ -32001 -78473 -109351 -93592 -91019 -109128 -91317 -31629 80378 135202 129823 81622 110976
16372A10976j1518k6601N6358l6432n045M6095k0656j15229n2240K7957L7832
$$ 110976 99458 72857 129215 92783 87738 133833 113177 -2052 -54292 -26335 11497
16361A1497K2772M0516K7799n7537j1833K4923L3853k703L2301k9262J4055K5780
$$ 11497 34269 74785 102584 45047 33214 58137 91990 89287 121588 92326 106381 132161
16349A32161m0648N5973J9661m4876K3644P832p3075j05986k1561K968n464p02
$$ 132161 91513 147486 167147 122271 145915 153747 80672 -25314 -46875 -43907 -49371 -50073
16337e0073j0019J4135k747M2707N5236k288o800l0747k2991M5666J2648l6083
$$ -50073 -60092 -45957 -48704 -5997 49239 46951 40151 9404 -13587 32079 44727 8644
16325H644m9402j7713m017L4113M9114J0823N6286N3408o001n4143O57J8402L4865
$$ 8644 -40758 -58471 -62488 -28375 20739 31562 87848 141256 135255 81112 81769 100171 135036
16312A35036L5247J7139L0622j6477m7139n6601J0884Q7789l373m7028k6617P622
$$ 135036 170283 187422 218044 201567 154428 97827 108711 196500 193127 146099 119482 127104
16300A27104j3863o3598M849Q7610K5768q2840m4115k081r853j984N911j5746
$$ 127104 113241 49643 54492 142102 167870 85030 40915 38834 28981 26997 32908 17162
16288A7162k9636l197Q2598k9569n9877n3361M5101k7512n1158M1771k0856J7338
$$ 17162 -12474 -15671 66927 37358 -22519 -75880 -30779 -58291 -109449 -67678 -88534 -71196
16276g1196K1307K015l5192n3739L1799k415L078K3819K798L0747M3624l4317
$$ -71196 -49889 -47874 -83066 -136805 -105006 -107421 -104343 -80524 -77726 -46979 -3355 -37672
16264c7672O26J8807L2064O622P912J4180O003n230k8838m2239M2001K2007K5481
$$ -37672 -37046 -18239 13825 20447 28359 42539 48542 43312 14474 -27765 14236 36243 61724
16251F1724L226L5404J1108J3019O4630j06971o5033K5226o6659j7671M1125p8329
$$ 61724 64950 100354 111462 124481 189111 82140 17107 42333 -24326 -41997 -872 -79201
16239g9201o8047N5135k5257j9849l8595J6331M6032j3867o963Q5229R840l635
$$ -79201 -147248 -92113 -117370 -137219 -175814 -159483 -113451 -127318 -134281 -49052 -39212 -42847
16227d2847P2813l7075m6422K7197l8523l741P6595k9434j8831J5130K092k4180
$$ -42847 29966 -7109 -53531 -26334 -64857 -68598 7997 -21437 -40268 -25138 -23046 -47226
16215d7226L7843K7406L2766J4147k6587M0423j1479K5273J3625n5840j8635O915
$$ -47226 -9383 18023 50789 64936 38349 78772 67293 92566 106191 50351 31716 38631
16203C8631N1566J8550l4098l1769J4700J4463n5158m2051k9043K9084j402j6656
$$ 38631 90197 108747 74649 42880 57580 72043 16885 -25166 -54209 -25125 -26527 -43183
16191d3183k6119O8138M5682p1839n2681k8902l9860M7365N3292J2808o399O701
$$ -43183 -69302 -1164 44518 -27321 -80002 -108904 -148764 -101399 -48107 -35299 -41698 -34997
16179c4997n2185p6614M7747Q5815N1743K2026J3169m5261n6799j4461K9526K0447
$$ -34997 -87182 -163796 -116049 -30234 21509 43535 56704 11443 -45356 -59817 -30291 -9844
16167i844J9935J6554J7506k3360j1751m2279q017M7659Q2034P808j8446j4630
$$ -9844 10091 26645 44151 20791 9040 -33239 -41256 6403 88437 96245 77799 63169
16155F3169p0556l9425L1935J7274j0340n3408O4108O3907J091n0090k5445j918
$$ 63169 -7387 -46812 -14877 2397 -7943 -61351 2757 66664 67755 17665 -7780 -9698
16143i698L2677j9465k6976J8387j1798j7786m6103L7484R5171M9005k9961J0851
$$ -9698 22979 3514 -23462 -5075 -16873 -34659 -80762 -43278 51893 100898 70937 81788
16131H1788j5974l8404J31n4608N6075j512M593l1533p0703J6128J6031M418O463
$$ 81788 65814 27410 27541 -27067 29008 27496 32089 556 -70147 -54019 -37988 -33570 -27107
16118b7107L6971L2722j165m4228K4214O386m3842K2243K1923j02841j6658P0428
$$ -27107 9864 42586 41421 -2807 21407 27793 -16049 6194 28117 -74724 -91382 -20954
16106b0954K9757P8522j6360n963M5041m6306n6716L5839N0236j0191p5393J2099
$$ -20954 8803 87325 70965 65002 110043 63737 7021 42860 93096 82905 7512 19611
16094A9611j9689J9589j4984k3841j6705k3702K2745J5243L530k9368J6J2794
$$ 19611 -78 19511 4527 -19314 -36019 -59721 -36976 -21733 -18203 -47571 -47555 -34761
16082c4761l3466L4223N376n552r335O355L1980n0090J9169J6614L5251K1312
$$ -34761 -68227 -34004 -28628 -34180 -43515 -37160 -5180 -55270 -36101 -19487 15764 37076
16070C7076J457l7867K01O375m3915P594O4546N6296q488j0492l0706m144l9555
$$ 37076 38533 666 867 7242 -36673 -29079 35467 91763 83275 72783 42077 37933 -1622
16057a622r463n1345K6574R748L986M846j1909M1829J9828M0276j1947k2321l9079
$$ -1622 -11085 -62430 -35856 -26108 -22122 -17276 -29185 12644 32472 72748 60801 38480 -599
16044e99l3054m882k5618L3188O1670n52m6539J0861P914k4156K5688L7557P2417
$$ -599 -33653 -38535 -64153 -30965 30705 30153 -16386 -5525 2389 -21767 3921 41478 113895
16031A13895r307j14929p4892K8711J02968O7890o348m6056j6004j7764j2663
$$ 113895 104588 -10341 -85233 -56522 46446 114336 107988 61932 45928 28164 15501
16020A5501L4454K4616L5372l7294L0396J552j5336j3474l6701o1393k3974R939
$$ 15501 49955 74571 109943 72649 103045 104597 89261 75787 39086 -22307 -46281 -36342
16008c6342k992N46K5559J0402K1946J534O080K7242J9052O2460j07459r6245
$$ -36342 -39334 -38788 -13229 -2827 19119 20653 26733 53975 73027 135487 28028 -68217
15996f8217l1719l520j2484M2989R6708L5816L0889L9320o9269n5276j2530m6381
$$ -68217 -99936 -103456 -115940 -72951 23757 59573 90462 129782 60513 5237 -7293 -53674
15984e3674K098K9436M4970o7095p0311j598Q90Q5516L0920m3308J7260P9733
$$ -53674 -51576 -22140 22830 -44265 -114576 -116174 -115284 -29768 1152 -42156 -24896 54837
15972E4837M7862j3195p3500j07426k6916l869N1505o119J4887J6994k4534o0134
$$ 54837 102699 89504 16004 -91422 -118338 -122207 -70702 -76821 -61934 -44940 -69474 -129608
15960a29608l9842j033P3089P421j3645k1689L8576P6104K9047o033O907K78k5988
$$ -129608 -169450 -170483 -97394 -89973 -103618 -125307 -86731 -10627 18420 12387 19294 19572 -6416
15947f416L8600o388n1096m7282N8021M9609L3463k4529O710P588l9659n3291
$$ -6416 32184 25796 -25300 -72582 -14561 35048 68511 43982 50692 58280 18621 -34670
15935c4670Q38Q973n3203p8306L9205M6922M824J0187J1785j1718J1669K7860
$$ -34670 -33832 -24859 -78062 -156368 -117163 -70241 -65417 -55230 -43445 -55163 -43494 -15634
15923a5634k9764n3663j9824Q0451O0336q893m4496j8297m671K4397L0299n6362
$$ -15634 -45398 -99061 -118885 -38434 21902 13009 -31487 -49784 -54455 -30058 241 -56121
15911e6121J6130M8228J8012r34j9508o1403K029N4934K3463J6725j2965m8406
$$ -56121 -39991 8237 26249 25315 5807 -55596 -53567 1367 24830 41555 28590 -19816
15899a9816M956n6145p715N8823K0948k6836P174L1455q361o2398l0640l1752
$$ -19816 -14860 -71005 -78720 -19897 1051 -25785 -18611 12844 4483 -57915 -88555 -120307
15887a20307N083N5762M844K2844J600r451M3309l357j4943o63Q555M2558L0180
$$ -120307 -115224 -59462 -54618 -31774 -30174 -39625 3684 327 -14616 -15279 -6724 35834 66014
15874F6014j1985m6786j0206l8077M296K9873k310L8553m052L031l5728m4705
$$ 66014 54029 7243 -2963 -41040 -36744 -6871 -9181 29372 25320 28351 -7377 -52082
15862e2082o970J10028k1121m5226J0576j4002n4293n1346K6496R0194R1602j0038
$$ -52082 -59052 50976 29855 -15371 -4795 -18797 -73090 -124436 -97940 -7746 83856 73818
15850G3818m9758l560l1196p8161J9285Q8732K4935p8750N930L4767L3567J2300
$$ 73818 24060 20500 -10696 -88857 -69572 19160 44095 -34655 -28725 6042 39609 51909
15838E1909p7981O055L3609o8463j925K2859j1731Q215l49k1798m7950k1381K7101
$$ 51909 -26072 -20017 13592 -54871 -56796 -33937 -45668 -37453 -37802 -59600 -107550 -128931 -101830
15825a01830P609o049M7770O6195q847n3093o4454K1883K4781J1971K1976l9561
$$ -101830 -94221 -100270 -52500 13695 4848 -48245 -112699 -90816 -66035 -54064 -32088 -71649
15813g1649j1669N3035O8619K6139l300l5382k3361j1545o6249l2788J6023N910
$$ -71649 -83318 -30283 38336 64475 61175 25793 2432 -9113 -75362 -108150 -92127 -86217
15801h6217J2585p303L6750l9851q9765L3317M8074n022N1495L2374M708m1105
$$ -86217 -73632 -80935 -44185 -84036 -173801 -140484 -92410 -97432 -45937 -13563 -8855 -49960
15789d9960n4686o352P3193N113q087L9874k1496K8428j2168k5415l4106k3418
$$ -49960 -104646 -110998 -37805 -32692 -40779 -905 -22401 6027 -6141 -31556 -65662 -89080
15777h9080K2421M1318j5035q371k4431k3287N6018L0586P171l102k7287r327
$$ -89080 -66659 -25341 -40376 -48747 -73178 -96465 -40447 -9861 -2690 -5792 -33079 -42406
15765d2406m9106n4382R522j2923K3777J7623J6210K2815M2808L939M902j548
$$ -42406 -91512 -145894 -136372 -149295 -125518 -107895 -91685 -68870 -26062 -22123 -17221 -18769
15753a8769j836P016n5514L1699l311J989k3811l3370m69K4616j4304L632L2217
$$ -18769 -20605 -13589 -69103 -37404 -40715 -38726 -62537 -95907 -96376 -71760 -86064 -82432 -50215
15740e0215M1470r8266m4577N4952M1583l2760m2676j5726L1476K0612k2241k3916
$$ -50215 -8745 -107011 -151588 -96636 -55053 -87813 -130489 -146215 -114739 -94127 -116368 -140284
15728a40284L3409L8800p625l1997l2271J4843M7403L1689l8142j9297M8702K7012
$$ -140284 -106875 -68075 -75700 -107697 -139968 -125125 -77722 -46033 -84175 -103472 -54770 -27758
15716b7758L5728L5767M41p9422p018J2822P1118j0508k023J1124M9730m7623
$$ -27758 7970 43737 44178 -35244 -42262 -29440 41678 31170 29147 40271 90001 42378
15704D2378n2367k9030K4144n3461k9913O3214N8319J8033K9617j7143m6436q98
$$ 42378 -9989 -39019 -14875 -68336 -98249 -35035 23284 41317 70934 53791 7355 6457
15692F457o2910k5896J4637L9356N0991K206j7231k3451j02158J2850O3581P803
$$ 6457 -56453 -82349 -67712 -28356 22635 24841 7610 -15841 -117999 -105149 -41568 -33765
15680c3765k5895l0751j0938K3794k7735k2297L7254P9021O4722J8995J699m9297
$$ -33765 -59660 -90411 -101349 -77555 -105290 -127587 -90333 -11312 53410 72405 74104 24807
15668B4807n2074p2888o8922Q330J08977J16527K6736j04600n4464j7488P0873
$$ 24807 -27267 -100155 -169077 -160747 -51770 64757 91493 -13107 -67571 -85059 -14186
15657a4186J5630M11p7011j6354K1861N044r871L9884J9758n5972p1834M7965
$$ -14186 1444 1855 -75156 -91510 -69649 -64605 -74476 -34592 -14834 -70806 -142640 -94675
15645i4675P1603J5593K1276j1079M2991N1496j3799q3214n577J1546k3K6208
$$ -94675 -23072 -7479 13797 2718 45709 97205 83406 192 -5385 6161 6138 32346
15633C2346m1261k2993M4798r961K2417L5278k2363m3233r09o602n1677M546k4563
$$ 32346 -8915 -31908 12890 2929 25346 60624 38261 -4972 -5881 -12483 -64160 -59614 -84177
15620h4177M3052Q358j1835r268N885M2971J5231M242M7385j6232l3672l6635
$$ -84177 -41125 -32767 -44602 -53870 -47985 -5014 10217 14459 61844 45612 11940 -24695
15608b4695l1429L4463M2407J3612k6871J0059O3997r47n1584j2140l7568j9524
$$ -24695 -56124 -21661 20746 34358 7487 17546 81543 80596 29012 16872 -20696 -40220
15596d0220o3052M1665N5036k3634m0607J8239M7427P1327l1621r872m4620k3633
$$ -40220 -103272 -61607 -6571 -30205 -70812 -52573 -5146 66181 34560 24688 -19932 -43565
15584d3565k4032l3009r136N7120M5820L2041n609q1839o9068L6917l4401m1284
$$ -43565 -67597 -100606 -109742 -52622 -6802 25239 19630 -62209 -131277 -94360 -128761 -170045
15572a70045P7182P0330N5218K2855K3874l5168q8636k582J734o063l4366P7348
$$ -170045 -92863 -22533 32685 55540 79414 44246 -44390 -46972 -45238 -51301 -85667 -8319
15560h319K9650n0791n8264p2842n796J9780K1818N4547K3484J3792M9089m5113
$$ -8319 21331 -29460 -87724 -160566 -166362 -146582 -124764 -70217 -46733 -32941 16148 -28965
15548b8965p7706J4625N9354L6505m1395J4314m8287q284p670q888J3646k2844
$$ -28965 -106671 -92046 -32692 3813 -37582 -23268 -71555 -79839 -87509 -96397 -82751 -105595
15536a05595L1603K1618L7164j217m6486n7001K6082N7823r150o4738j2755L0610
$$ -105595 -73992 -52374 -15210 -16427 -62913 -119914 -93832 -36009 -45159 -109897 -122652 -92042
15524i2042N6709J2073J4177j8229n0652K1904k2952L9243n329p986M6256q198
$$ -92042 -35333 -23260 -9083 -27312 -77964 -56060 -79012 -39769 -45098 -53084 -6828 -15026
15512a5026j8682K582N2278o2690l8338k0219p1842J8314P9794k608L9569j605
$$ -15026 -33708 -31126 21152 -41538 -79876 -100095 -171937 -153623 -73829 -76437 -36868 -38473
15500c8473P280K5361M9374K8385q904n9965k5593m8595j7440L319P9528M2476
$$ -38473 -31193 -5832 43542 71927 63023 3058 -22535 -71130 -88570 -85251 -5723 36753
15488C6753m4471l1246K6852L8903K2267k1754M2002J3807m1527k6434N6045m3398
$$ 36753 -7718 -38964 -12112 26791 49058 27304 69306 83113 41586 15152 71197 27799
15476B7799j6616K5742j4275o7504l4818l515Q488J6804k4583m023O6600J5649
$$ 27799 11183 36925 22650 -44854 -79672 -83187 -74699 -57895 -82478 -86501 -19901 -4252
15464d252l6963j2238j0659m0088Q974R0660p154l5078J9197J8069K7934n9449
$$ -4252 -41215 -53453 -64112 -104200 -95226 -4566 -11720 -46798 -27601 -9532 18402 -41047
15452d1047K9143L8684j7802k1690R383K6175k8558n5898J2876K7364L1872k7341
$$ -41047 -11904 26780 8978 -12712 -3329 22846 -5712 -61610 -48734 -21370 10502 -16839
15440a6839K849j8167j5826l4768j8699K2475J02999N6895J3551k6719j9616o2372
$$ -16839 -13990 -32157 -47983 -82751 -101450 -78975 24024 80919 94470 67751 48135 -14237
15428a4237K59k3687o9124J1239O7361p274l171Q983K1770j0869j5159L6221r920
$$ -14237 -13978 -37665 -106789 -95550 -28189 -35463 -38634 -29651 -7881 -18750 -33909 2312 -7608
15415g608l7462l7283o694O1719J8559n9139k4750l364L7538O1007J4430N173
$$ -7608 -45070 -82353 -89047 -27328 -8769 -67908 -92658 -96022 -58484 2523 16953 22126
15403B2126J4546L6117O667o5187J3878k0927R0240K8523o5535o4777l9106j0931
$$ 22126 36672 72789 79456 14269 28147 7220 97460 125983 60448 -4329 -43435 -54366
15391e4366J2449k0475j0397M6965J1098K4203j8632%J7528l7890Q85P3168K5233
$$ -54366 -41917 -62392 -72789 -25824 -14726 9477 -9155 -9155 8373 -29517 -28632 44536 69769
15378F9769J7500l3294o6286n4244K5633P0604J9487k5984L273k9635m2038L6325
$$ 69769 87269 53975 -12311 -66555 -40922 29682 49169 23185 26458 -3177 -45215 -8890
15366h890K2256n341j2838M2306P6881l8851l3526O596m7120p6312L7209P2060
$$ -8890 13366 8025 -4813 37493 114374 75523 41997 48593 1473 -74839 -37630 34430
15354C4430m6912m3657J6848j8271K4918j0256L2326J8826J4678k986J033p1755
$$ 34430 -12482 -56139 -39291 -57562 -32644 -42900 -10574 8252 22930 19944 20977 -50778
15342e0778R508O0161M2982k9748o9392k3831j6138k5229L0515N1283m1800j2641
$$ -50778 -41270 18891 61873 32125 -37267 -61098 -77236 -102465 -71950 -20667 -62467 -75108
15330g5108O2608N1497k4235m5401K6216J3520M4775j6980K799j397m1790j8821
$$ -75108 -12500 38997 14762 -30639 -4423 9097 53872 36892 39691 38294 -3496 -22317
15318b2317m915k424R4657p257k2013p8569n9451j0972j2892o3222n068K4451
$$ -22317 -27232 -29656 65001 57744 35731 -42838 -102289 -113261 -126153 -189375 -194443 -169992
15306a69992N5174R9075M9564J6035o5175j5966p415J1659m1415k9189P4968l4025
$$ -169992 -114818 -15743 33821 49856 -15319 -31285 -38700 -27041 -68456 -97645 -22677 -56702
15294e6702M58J4316K8848L6391Q142j16232k5427l381l5040L133J32490L2766
$$ -56702 -56244 -41928 -13080 23311 31453 -84779 -110206 -113587 -148627 -145494 -13004 19762
15282A9762m5r487l06k1053K1961m7402n8523O5043O0141L2020m84k519q1293
$$ 19762 19717 10230 9924 -11129 10832 -36570 -95093 -30050 30091 62111 61627 59108 -22185
15269b2185k166j74m6099J1137K1521j6284J5471K7340Q373l5036j7914l3961
$$ -22185 -24351 -24525 -70624 -59487 -37966 -54250 -38779 -11439 -3066 -38102 -56016 -89977
15257h9977m4118K6535M4421k1361J7755j831K2524L8109O6568J8029n2576o2241
$$ -89977 -134095 -107560 -63139 -84500 -66745 -68576 -46052 -7943 58625 76654 24078 -38163
15245c8163j3306n6904k9991J5412p548m4755P5033J37363k5356o1934k4027O3505
$$ -38163 -51469 -108373 -138364 -122952 -130500 -175255 -100222 37141 11785 -50149 -74176 -10671
15233a0671L9975j4979L182J0036o3462k8908p231j9870k2867P9651M5881M2967
$$ -10671 29304 14325 17507 27543 -35919 -64827 -72058 -91928 -114795 -35144 10737 53704
15221E3704J4197M1091l601j2021l8965l8297p7148m305K9753l480K5715O8135
$$ 53704 67901 108992 105391 93370 54405 16108 -61040 -65345 -35592 -39072 -13357 54778
15209E4778k8183p3097l7903m0k8891N5818N4897n0807l9954k2788l2803l4624
$$ 54778 26595 -46502 -84405 -84445 -113336 -57518 -2621 -53428 -93382 -116170 -148973 -183597
15197a83597N1673N4446n766o8886k3582M4262L8655R4032J6517j1390M174p8601
$$ -183597 -131924 -77478 -83244 -152130 -175712 -131450 -92795 1237 17754 6364 10538 -68063
15185f8063L5565L5714l7216m9711J4155L5955j446P280j2259L9032j2722K8245
$$ -68063 -32498 3216 -34000 -83711 -69556 -33601 -35047 -27767 -40026 -994 -13716 14529
15173A4529j2805n0746n4960L9010L4421J506j3772J0560K8566J796o0108j8238
$$ 14529 1724 -49022 -103982 -64972 -30551 -29045 -42817 -32257 -3691 -1895 -62003 -80241
15161h0241M1719l8352Q09o02J6592O6338p540l863M7488J2877m9186K7511L4201
$$ -80241 -38522 -76874 -76065 -76667 -60075 6263 -1277 -5140 42348 55225 6039 33550 67751
15148F7751j1755p7505j7442K5654L5942o0880m0592q950m7670j712J22562J03995
$$ 67751 55996 -21509 -38951 -13297 22645 -38235 -78827 -87777 -135447 -137159 -14597 89398
15136H9398K3100k6254m6382n0559K1438m0516m3718q687k8959K6633J4270j8972
$$ 89398 112498 86244 39862 -10697 10741 -29775 -73493 -82180 -111139 -84506 -70236 -89208
15124h9208k3028L9007n401n271J1547m7105P025Q588O7291J8829K5720m818m4823
$$ -89208 -112236 -73229 -78630 -83901 -72354 -119459 -112434 -103846 -36555 -17726 7994 3176 -41647
15111d1647k255P2114n2079M2264M6094k8906p4710k401q8340j4257P8652L7944
$$ -41647 -43902 28212 -23867 18397 64491 35585 -39125 -41526 -129866 -144123 -65471 -27527
15099b7527n3155o9654j9496P7562M7191J0291L2657J1252k5139m6138R598j1672
$$ -27527 -80682 -150336 -169832 -92270 -45079 -34788 -2131 9121 -16018 -62156 -52558 -64230
15087f4230N9398j1498j739J7144j2614l592P123J6882j8030l5892r938l709j9325
$$ -64230 -4832 -16330 -18069 -925 -13539 -17131 -10008 6874 -11156 -47048 -56986 -60695 -80020
15074h0020N7691P0530K1814j08912j6452P6901J4641p755k7995m5330L2274N623
$$ -80020 -22329 48201 70015 -38897 -55349 21552 36193 28438 443 -44887 -12613 -6990
15062f990k3236o985O940j590m9653l7844j7258N4975j3193L2739N602N723J5601
$$ -6990 -30226 -37211 -30271 -31861 -81514 -119358 -136616 -81641 -94834 -62095 -56493 -50770 -35169
15049c5169J1150k3323m117J4792M8388L9938l9120J4565M8870J4988k4928l8113
$$ -35169 -24019 -47342 -51459 -36667 11721 51659 12539 27104 75974 90962 66034 27921
15037B7921J3113l5540P438m339j5453k7791q624P8205p191q613J855l1271k5439
$$ 27921 41034 5494 12932 8593 -6860 -34651 -43275 34930 27739 19126 20981 -10290 -35729
15024c5729N062K2652m0148L8562K293k6697m7499L7949N394o0493p2698q260
$$ -35729 -30667 -8015 -48163 -9601 -7308 -34005 -81504 -43555 -38161 -98654 -171352 -179612
15012a79612L9048J9923K2978K6176R2469K6587k88k9413q814j4866L0122J2135
$$ -179612 -140564 -120641 -97663 -71487 20982 47569 47281 17868 9054 -5812 24310 36445
15000C6445l9642m9870L8610N187p1859k0139Q3229P3594k0014j13928j05944
$$ 36445 -3197 -53067 -14457 -9270 -81129 -101268 -18039 55555 35541 -78387 -184331
14989a84331M80N0797J30812O7780O442p5072J2549L2982K7434m6002l7085L3325
$$ -184331 -183851 -133054 -2242 65538 71980 -3092 9457 42439 69873 23871 -13214 20111
14977B0111L8932j5396m0339l9128n245J00491L6442k3386l4217p1832m1701R3233
$$ 20111 59043 43647 3308 -35820 -41065 59426 95868 72482 38265 -33567 -75268 17965
14965A7965P2141k8772j3247J3128N16q0831l2500L7703R4722J9110o4554p0452
$$ 17965 90106 61334 48087 61215 61731 -19100 -51600 -13897 80825 99935 35381 -35071
14953c5071K0529R534j3141L4375k3829m4311k8389j594j596l3341M3338J7013
$$ -35071 -14542 -5008 -18149 16226 -7603 -51914 -80303 -81897 -83493 -116834 -73496 -56483
14941e6483M5730R861k2171L9139M7675R4645l5759p1842l1822l8986q1716l7497
$$ -56483 -10753 -892 -23063 16076 63751 158396 122637 50795 18973 -20013 -101729 -139226
14929a39226J4724l4402J3485O9743K0720J3962K6420P6405K0477k9370m2927
$$ -139226 -124502 -158904 -145419 -75676 -54956 -40994 -14574 61831 82308 52938 10011
14918A0011m3308l4642M2129j7126P93P702k9262Q35N8673L0521j9113q4665J3717
$$ 10011 -33297 -67939 -25810 -42936 -42143 -34441 -63703 -62868 -4195 26326 7213 -77452 -63735
14905f3735N6304L9661L4839m6421m7284j7306J4887j2151n93J6245N3583M4573
$$ -63735 -7431 32230 67069 20648 -26636 -43942 -29055 -41206 -41799 -25554 28029 72602
14893G2602m17k5154n7898o6837m2614K4175K4477l137M3037r14o0186j626L622
$$ 72602 72185 47031 -10867 -77704 -120318 -96143 -71666 -74803 -31766 -32680 -92866 -94492 -90870
14880i0870m631O6905j3059K3876K0177l3505L021n0215k0784P3074L2653n2807
$$ -90870 -95501 -28596 -41655 -17779 2398 -31107 -28086 -78301 -99085 -26011 6642 -46165
14868d6165l5652K706l2420K2204j9790l1763O055m9644j3738P2214J00475j7036
$$ -46165 -81817 -79111 -111531 -89327 -109117 -140880 -134825 -184469 -198207 -125993 -25518 -42554
14856d2554j8298K364m518j7496K1120K3604n5322J2095L804l4208q331j3999
$$ -42554 -60852 -58488 -63006 -80502 -59382 -35778 -91100 -79005 -75201 -109409 -117740 -131739
14844a31739K8459L0201N3734J0192j092K1398K3277j7142k5020r265k7626K6707
$$ -131739 -103280 -73079 -19345 -9153 -10245 11153 34430 17288 -7732 -16997 -44623 -17916
14832a7916K0870P022P62O2314n4020M2218J9916o4144l3940k6764J3654L3819
$$ -17916 2954 9976 10738 73052 19032 61250 81166 17022 -16918 -43682 -30028 3791
14820C791L6835n8916j58P6011k3071j3843O0956k7877n5264j1715N1915J1579
$$ 3791 40626 -18290 -18448 57563 34492 20649 81605 53728 -1536 -13251 38664 50243
14808E0243k3977o9864n364K5195j8556J7979L6504m0925n4602o874L769O5613
$$ 50243 26266 -43598 -48962 -23767 -42323 -24344 12160 -28765 -83367 -90241 -86472 -20859
14796b0859N0782o965J7129K0177j9411o4483r900L4190k8476M1802J1313l1608
$$ -20859 29923 22958 40087 60264 40853 -23630 -33530 660 -27816 13986 25299 -6309
14784f309k6785p883P55K0604Q6526l1201n5812L86l6417l1467j592O0390P256
$$ -6309 -33094 -40977 -40222 -19618 66908 35707 -20105 -19719 -56136 -87603 -89195 -28805 -21549
14771b1549M5084O136j07212r4025M4715j0511K5636L493J4798P0057K6745o807
$$ -21549 23535 29671 -77541 -171566 -126851 -137362 -111726 -108233 -93435 -23378 3367 -3440
14759c440j1377j4127K0699M1930K7801L3791l8710k0114o709k2075L0387L873
$$ -3440 -14817 -28944 -8245 33685 61486 95277 56567 36453 29744 7669 38056 41929
14747D1929j1884J3171K1997Q811j8594j8938o2637o8121K3492K8768m69m5899
$$ 41929 30045 43216 65213 74024 55430 36492 -26145 -94266 -70774 -42006 -42475 -88374
14735h8374o476P981P9163N5445L1023j1828o0260k7342j5856m8098L801J4948
$$ -88374 -94850 -86869 -7706 47739 78762 66934 6674 -20668 -36524 -84622 -80821 -65873
14723f5873L9687K6295P5437K825o3598m8198m1824K8860m3122L6736N2142l9773
$$ -65873 -26186 109 75546 78371 14773 -33425 -75249 -46389 -89511 -52775 -633 -40406
14711d0406l3368j1419k7016N8458J0483M5450P591j05646l7715K0488Q795p837
$$ -40406 -73774 -85193 -112209 -53751 -43268 2182 9773 -95873 -133588 -113100 -104305 -112142
14699a12142L4860k7687j8216J3793O046K7605L4066P5073J9414J0544K8276p5875
$$ -112142 -77282 -104969 -123185 -109392 -103346 -75741 -41675 33398 52812 63356 91632 15757
14687A5757j17400j767j6034O7379M6052L4556p191K9234l656k7358n6216Q323
$$ 15757 -101643 -103410 -119444 -52065 -6013 28543 21352 50586 46930 19572 -36644 -28321
14675b8321Q525J5265k7982K1011L4374q149J7664l2671J5128K2093j4101p608
$$ -28321 -19796 -4531 -32513 -11502 22872 14723 32387 -284 14844 36937 22836 15228
14663A5228M8637J5767j4250m3114p0638m1137J3433O953j2809O690K3771j2193
$$ 15228 63865 79632 65382 22268 -48370 -89507 -76074 -69121 -81930 -75240 -51469 -63662
14651f3662R943P5915P703n566K1461k9947l8026K603j1934M2721L4535N2373
$$ -63662 -53719 22196 29899 24333 45794 15847 -22179 -19576 -31510 11211 45746 98119
14639I8119m2791k0444Q986k2425k6822q637j1005o867O742M6112p224l0157l5332
$$ 98119 55328 34884 43870 21445 -5377 -14014 -25019 -31886 -25144 20968 13744 -16413 -51745
14626e1745J0227m6598o4655m3190M7872L4936M8776M1286p851k2494l6322R7903
$$ -51745 -41518 -88116 -152771 -195961 -148089 -113153 -64377 -23091 -30942 -53436 -89758 8145
14614H145k9403j6213j1538j1234l4639L8160L7875k6242m903O412J1847K2145
$$ 8145 -21258 -37471 -49009 -60243 -94882 -56722 -18847 -45089 -49992 -43580 -31733 -9588
14602i588J980N8405J236l9791o7997L2781K0142N357K9323j6434k899l4453l9492
$$ -9588 -7608 50797 52033 12242 -55755 -22974 -2832 2525 31848 15414 12515 -21938 -61430
14589f1430j5279K7865q677K1891M9080o8002k8016R1914R986r225l1609l7030
$$ -61430 -76709 -48844 -57521 -35630 13450 -54552 -82568 9346 19332 10107 -21502 -58532
14577e8532k0128N8107K6635k5960N174N48j9389J1768M8314M8625k1556l1130
$$ -58532 -78660 -20553 6082 -19878 -14704 -14156 -33545 -21777 26537 75162 53606 22476
14565B2476l5974j14251J9085K5730m560M0154K6851N3457M912p3572m2969K098
$$ 22476 -13498 -127749 -108664 -82934 -87494 -47340 -20489 32968 37880 -35692 -78661 -76563
14553g6563M2192M92j9354n2157K1676N3848J6056m3382o7569n4341N8123N6172
$$ -76563 -34371 -33879 -53233 -105390 -83714 -29866 -13810 -57192 -124761 -179102 -120979 -64807
14541f4807P842Q0251K5783r3612o8641L232l498O9347P8310P052j5814m7422
$$ -64807 -56965 23286 49069 -44543 -113184 -109952 -113450 -44103 34207 41259 25445 -21977
14529b1977j2180m7989j0668P0539K4803k8817K3223R589N9087M0706r8116j473
$$ -21977 -34157 -82146 -92814 -22275 2528 -26289 -3066 6523 65610 106316 8200 6727
14517F727l4121q163J0664j704K6177O5810l004o0432o5332n4369J0361N4844
$$ 6727 -27394 -35557 -24893 -26597 -420 65390 62386 1954 -63378 -117747 -107386 -52542
14505e2542k8964K4878M0012m212j987j1048L4322l0215m3087N4800k5521m693
$$ -52542 -81506 -56628 -16616 -20828 -22815 -33863 459 -29756 -72843 -18043 -43564 -48257
14493d8257k8797K0541o782l0930n4548R6223Q7002l5555m6554k1057k2532P712
$$ -48257 -77054 -56513 -63295 -94225 -148773 -52550 34452 -1103 -47657 -68714 -91246 -83534
14481h3534Q3576m6361n9944n624m8208P6238O936j0869J1405M1360p752j1606
$$ -83534 42 -46319 -106263 -111887 -160095 -83857 -76921 -87790 -76385 -35025 -42777 -54383
14469e4383l5778l6860N3057Q6240J9363k6767o2889k4794N502M9707L2110j2847
$$ -54383 -90161 -127021 -73964 12276 31639 4872 -58017 -82811 -77309 -27602 4508 -8339
14457h339o682M0022n582l6282k6963l8098K0812N7308M6788K3414N698k6043
$$ -8339 -15021 25001 19419 -16863 -43826 -81924 -61112 -3804 42984 66398 72096 46053
14445D6053K1946l6082n1543j2011N8773J8259M4911p585K64j8790l1223J1902
$$ 46053 67999 31917 -19626 -31637 27136 45395 90306 82721 82985 64195 32972 44874
14433D4874o1464j9875p567L7254N1140q4433m8064J51q860K1382K9635L2988
$$ 44874 -16590 -36465 -44032 -6778 44362 -40071 -88135 -87984 -96844 -75462 -45827 -12839
14421a2839k0150N1861N0170l0706r1968J7719L9130L637j3631r0306n7120J237
$$ -12839 -32989 18872 69042 38336 -53632 -35913 3217 6854 -6777 -97083 -154203 -152966
14409a52966J1247K121O2339N5034M591j6307O4767l2171l771L0295l509n9398
$$ -152966 -141719 -139598 -77259 -22225 -17634 -33941 30826 -1345 -5116 25179 21670 -37728
14397c7728k5103O8195J1590j00532n6992N9540L8149l8128N8770L7845l2567
$$ -37728 -62831 5364 16954 -83578 -140570 -81030 -42881 -81009 -22239 15606 -16961
14386a6961L710r510M0130N2282N621l7081n7560M1908N892n5307P0646m808n7434
$$ -16961 -13251 -22761 17369 69651 75272 38191 -19369 22539 28431 -26876 43770 38962 -18472
14373a8472k9437n732j6964K2390o373J4103k9232n1392J575Q0062J9707j1405
$$ -18472 -47909 -53641 -70605 -48215 -54588 -40485 -69717 -121109 -119534 -39472 -19765 -31170
14361c1170k5310L1136N371J9421o2967j26840l3138P7476J07743N8771L6823
$$ -31170 -56480 -25344 -19973 -552 -63519 -190359 -223497 -146021 -38278 20493 57316
14350E7316m3026p4928J0971K541M6189J2723l186j2283k1757L9262k3592J9566
$$ 57316 14290 -60638 -49667 -47126 -937 11786 8600 -3683 -25440 13822 -9770 9796
14338I796J354k8843m5868j1202M5311L2921k821M288j4223J6297k463m9472r0930
$$ 9796 11150 -17693 -63561 -74763 -29452 3469 648 4936 -9287 7010 4547 -44925 -135855
14325a35855N424j1418K1589O5141M4291P691L7168l9243K474K6191M917n3408
$$ -135855 -130431 -141849 -120260 -55119 -10828 -3137 34031 -5212 -2738 23453 28370 -25038
14313b5038k7783k8320J2625P2355K5981L4511m8446l3935k8087k6957j9776K7670
$$ -25038 -52821 -81141 -68516 3839 29820 64331 15885 -18050 -46137 -73094 -92870 -65200
14301f5200K5582m0397J6513L3899J9604J5299M6379j6404n2447p9807o353M2245
$$ -65200 -39618 -80015 -63502 -29603 -9999 5300 51679 35275 -17172 -96979 -103332 -61087
14289f1087k9219K9892K5187k7192n045J0158M3677j9893l0200K0754K3403J5860
$$ -61087 -90306 -60414 -35227 -62419 -67464 -57306 -13629 -33522 -63722 -42968 -19565 -3705
14277c705L6453Q462N0786P984n4886k5481m9386l0005J3738N2724l740p1315
$$ -3705 32748 41210 91996 99980 45094 19613 -29773 -59778 -46040 6684 2944 -68371
14265f8371k4609p148M669K1420R1158M7945K7445o3969J7697j4988l3994j1350
$$ -68371 -92980 -100128 -95459 -74039 17119 65064 92509 28540 46237 31249 -2745 -14095
14253a4095m929l5040m3180K2969J7208o3236J9157p173L032P1614j2993k1564
$$ -14095 -19024 -54064 -97244 -74275 -57067 -120303 -101146 -108319 -105287 -33673 -46666 -68230
14241f8230M8285J273K9021N7805L6548j0458j4144p1125j5644Q2164K0926j9103
$$ -68230 -19945 -18672 10349 68154 104702 94244 80100 8975 -6669 75495 96421 77318
14229G7318q290l3740k7568l2504j7648K219n88l3714m048K0176M420m653M0985
$$ 77318 69028 35288 7720 -24784 -42432 -40213 -40801 -74515 -78563 -58387 -53967 -58620 -17635
14216a7635J2083l4639j1984j0752l2380j6165K1875l1920L0457P9029k0344n1991
$$ -17635 -5552 -40191 -52175 -62927 -95307 -111472 -89597 -121517 -91060 -12031 -32375 -84366
14204h4366j7632O5206N5912j8597J6530o9800p076K0917r791j6141k3026L5554
$$ -84366 -101998 -36792 19120 523 17053 -52747 -59823 -38906 -48697 -64838 -87864 -52310
14192e2310K9503k8321J1509N1294m089P49j1229L0401j7788p9004l463K6081
$$ -52310 -22807 -51128 -39619 11675 7586 8335 -2894 27507 9719 -69285 -72748 -46667
14180d6667N2233p688k7634j2442L2593J737K041M1486K0028q655m4713m27K3658
$$ -46667 5566 -2122 -29756 -42198 -9605 -7868 -5827 35659 55687 47032 2319 1892 25550
14167B5550K6197l1149l6463N946O6925j5294m0495L9112R6197k7510q4653k2804
$$ 25550 51747 20598 -15865 -9919 57006 41712 1217 40329 136526 109016 24363 1559
14155A559L1443Q0709j7670Q365J4617p3092j5923m7177n8368l332j0045O3064
$$ 1559 33002 113711 96041 104406 119023 45931 30008 -17169 -75537 -78869 -88914 -25850
14143b5850J6305k179n832J8191M9258Q603j5107j6842j5200Q030j9110l8530
$$ -25850 -9545 -11724 -17556 635 49893 58496 43389 26547 11347 19377 267 -38263
14131c8263l4350p92L8094J7986M2939R099j9065R166N431r9L4425P576n7888
$$ -38263 -72613 -73405 -35311 -17325 25614 34713 15648 24814 30245 30146 64571 72147 14259
14118A4259L5522K599n5129m7332j2757J9115J5893M751J4509n219o8551k9698
$$ 14259 49781 52380 -2749 -50081 -62838 -43723 -27830 -23079 -8570 -13789 -82340 -112038
14106a12038K6596P8628m3845n6738J7430j9784L5313M5842L7228P6711J6544
$$ -112038 -85442 -6814 -50659 -107397 -89967 -109751 -74438 -28596 8632 85343 101887
14095A01887m6671N8846l0191k3401m2226k4882K4524L5376L6647L114P665o6017
$$ 101887 55216 114062 83871 60470 18244 -6638 17886 53262 89909 93023 100688 34671
14083C4671j03772q2955L6515K4370l0732P796j8262J9501N0987N5028j6385P904
$$ 34671 -69101 -152056 -115541 -91171 -121903 -114107 -132369 -112868 -61881 -6853 -23238 -15334
14071a5334O843J1075O629q845l2271N6082n5731n4554P7247j8609N0520J4645
$$ -15334 -8491 2584 9213 368 -31903 24179 -31552 -86106 -8859 -27468 23052 37697
14059C7697o093j7243L136J9019p0689J6517N6641J7593N6062l3339j2310J3978
$$ 37697 31604 14361 17497 36516 -34173 -17656 38985 56578 112640 79301 66991 80969
14047H0969J0080l7810l9980J0316J561K96Q297k4685p4521k4677k02L2570L5687
$$ 80969 91049 53239 13259 23575 25136 25432 33729 9044 -65477 -90154 -90356 -57786 -22099
14034b2099M1014q285J1608j3668J0387j1149K0917K6199Q40k5786P022l7145
$$ -22099 18915 10630 22238 8570 18957 7808 28725 54924 55764 29978 37000 -145
14022a45n804J8590N4790J9837k4904j8431l4555o2621L1410O832k2980m7654
$$ -145 -5949 12641 67431 87268 62364 43933 9378 -53243 -21833 -15001 -37981 -85635
14010h5635n4036j213L8092O9539l860k3994J1080k3224k5545l3148K6719Q6470
$$ -85635 -139671 -140884 -102792 -33253 -37113 -61107 -50027 -73251 -98796 -131944 -105225 -18755
13998a8755N9929n410n1956k1007L8135O4678o5645n9969k182J4840M9652k4867
$$ -18755 41174 35764 -16192 -37199 936 65614 -31 -60000 -62182 -47342 2310 -22557
13986b2557k1898J8772q040j7545l1660k9237j6817Q778O4938j3577K0908N0820
$$ -22557 -44455 -25683 -33723 -51268 -82928 -112165 -128982 -120204 -55266 -68843 -47935 2885
13974B885m3444p4339J9069O1585L9620j7269L104K5048L0554o794k7246J3196
$$ 2885 -40559 -114898 -95829 -34244 5376 -11893 -8789 16259 46813 40019 12773 25969
13962B5969M675J7245k7317n3029M6490l3849j5751J4058J4556O9485L8285m3315
$$ 25969 30644 47889 20572 -32457 14033 -19816 -35567 -21509 -6953 62532 100817 57502
13950E7502L363k1773j01966j8203P473J7735O836N3082O951p6114k5157M4450
$$ 57502 60865 39092 -62874 -81077 -73604 -55869 -49033 4049 11000 -65114 -90271 -45821
13938d5821O6378K3619j6089l0156L4570j2181m8844j7758j8096K0777j8262K6686
$$ -45821 20557 44176 28087 -2069 32501 20320 -28524 -46282 -64378 -43601 -61863 -35177
13926c5177M0245R316k5229l590j4902k1573N102L6427P2680N1412j8127j1596
$$ -35177 5068 14384 -10845 -14435 -29337 -50910 -45808 -9381 63299 114711 96584 84988
13914H4988n0789l9276m2365j7043P8752j810K3632Q882r248l2028j1424K6894
$$ 84988 34199 -5077 -47442 -64485 14267 12457 36089 44971 35723 3695 -7729 19165
13902A9165J6449M1803K7157o7555n2713N568J3157K8307l2037k1541J5004K6223
$$ 19165 35614 77417 104574 37019 -15694 -10126 3031 31338 -699 -22240 -7236 18987
13890A8987o6008N016J805M6024R929j5644K2529O4915P7902n621j53278l9578
$$ 18987 -47021 -42005 -40200 5824 15753 109 22638 87553 165455 159834 6556 -33022
13878c3022o2361P405N6775K4817N224J6409J5827O7952q196p1169l3894l8349
$$ -33022 -95383 -87978 -31203 -6386 -1162 15247 31074 99026 90830 19661 -14233 -52582
13866e2582l936j0751J9103K499k8168m9022L885j306L1858l4829o6509M8179
$$ -52582 -56518 -67269 -48166 -45667 -73835 -122857 -118972 -120278 -88420 -123249 -189758 -141579
13854a41579R0072M979J1486l8306k4137K8249N2471J68P3472M1994m4168o8944
$$ -141579 -51507 -46528 -35042 -73348 -97485 -69236 -16765 -16597 56875 98869 54701 -14243
13842a4243J3482N0322l5934j8694K484k8228M2939p102k3597L8213J6870K0376
$$ -14243 -761 49561 13627 -5067 -2583 -30811 12128 5026 -18571 19642 36512 56888
13830E6888J3424j6413l0608k6587o3316Q226L6152Q5102L6313j4270n9919j1315
$$ 56888 70312 53899 23291 -3296 -66612 -58386 -22234 62868 99181 84911 24992 13677
13818A3677O691L4434j7563q7850J8551J8327j4485l0097L7546m3580o5243L22
$$ 13677 20368 54802 37239 -50611 -32060 -13733 -28218 -58315 -20769 -64349 -129592 -129270
13806a29270M7385L114L0234K9790K581N7190N2535j6111K8898n8m8822P694k6872
$$ -129270 -81885 -78771 -48537 -18747 -16166 41024 93559 77448 106346 106288 57466 65160 38288
13793C8288m7607M8621K5459L2618m0595o9970j5456R3N1995J9300k745j0067
$$ 38288 -9319 39302 64761 97379 56784 -13186 -28642 -28549 23446 42746 40001 29934
13781B9934l399o5794K2865m516M5970J5575M4620k8997m6454j9245k030J5488
$$ 29934 26535 -39259 -16394 -20910 25060 40635 85255 56258 9804 -9441 -11471 4017
13769D017R739m6044k2152R077N1102L5568l4443o802k5265J7996K1089J1184
$$ 4017 13756 -32288 -54440 -45363 5739 41307 6864 62 -25203 -7207 13882 25066
13757B5066M8819M0618q5118l5717J227J6636o2692L4016N6454p897j4886j4730
$$ 25066 73885 114503 29385 -6332 -5105 11531 -51161 -17145 39309 31412 16526 1796
13745A796N446O1559k2103K3816M5220j26336l3082N3926N4694k1688m5445j5029
$$ 1796 7242 68801 46698 70514 115734 -10602 -43684 10242 64936 43248 -2197 -17226
13733a7226J4819l1770N171j3103j1776L0871r761l7363k4710M4523j1923n539
$$ -17226 -2407 -34177 -29006 -42109 -53885 -23014 -32775 -70138 -94848 -50325 -62248 -67787
13721f7787M489M3518n686m1314p858k6094N35M9276R0732p3754J3080O2036o877
$$ -67787 -63298 -19780 -25466 -66780 -74638 -100732 -100197 -50921 39811 -33943 -20863 41173 34296
13708C4296m6144Q32p7226j9262L5137M2865j7334p773p272L9491l6887Q928N6043
$$ 34296 -11848 -11016 -88242 -107504 -72367 -29502 -46836 -54609 -61881 -22390 -59277 -50349 5694
13695E694j2354p1207R848o349K9550K5047n3941m9600K1518M1796M5375R1717
$$ 5694 -6660 -77867 -68019 -74368 -44818 -19771 -73712 -123312 -101794 -59998 -14623 77094
13683G7094o0749J0405N8483n7435m8325K995O3147O162n7749j113J9696K9415
$$ 77094 16345 26750 85233 27798 -20527 -17532 45615 51777 -5972 -7085 12611 42026
13671D2026k4716q0789j339j5940J8745J0984k4128k1859J9522K6535L0352K1919
$$ 42026 17310 -63479 -64818 -80758 -62013 -51029 -75157 -97016 -77494 -50959 -20607 1312
13659A312Q765K3716l2843k5970L6018L1731M8808j1702j9246l0399m7991o0106
$$ 1312 10077 33793 950 -25020 10998 42729 91537 79835 60589 30190 -17801 -77907
13647g7907L0273L8355K4677L2179l5303m9307j1431R742O6441N7825O09n0420
$$ -77907 -47634 -9279 15398 47577 12274 -37033 -48464 -38722 27719 85544 86153 35733
13635C5733N3806l4206o8730j3756K1077L6338J7116k2180K859j2245n3521J5564
$$ 35733 89539 55333 -13397 -27153 -6076 30262 47378 25198 28057 15812 -37709 -22145
13623b2145K9495O5275P757p9024n0719l2398k6758O3941j8400k0026k6608K3402
$$ -22145 7350 72625 80382 1358 -49361 -81759 -108517 -44576 -62976 -83002 -109610 -86208
13611h6208N8501n523o1025J460K4035O3802k748L1239J1077K4686l1845K163
$$ -86208 -27707 -33230 -94255 -92795 -68760 -4958 -7706 23533 34610 59296 27451 29614
13599B9614k2888J8669P1519o538p889j3438l9207q6895l5342R8273N5443l6029
$$ 29614 6726 25395 96914 90376 82487 69049 29842 -57053 -92395 5878 61321 25292
13587B5292m0519L7310R5419k1621m3448j0750p8872o3943M2761J1043K6837K0465
$$ 25292 -15227 22083 117502 95881 52433 41683 -37189 -101132 -58371 -47328 -20491 -26
13575b6j9405k6084l7972l0060j2253O6702O0691Q075k9657L2436m9074l3099
$$ -26 -19431 -45515 -83487 -113547 -125800 -59098 1593 9668 -19989 12447 -36627 -69726
13563f9726J06873P691k4796K0239J0258j0464O5520j0830o6835m3750n6913n220
$$ -69726 37147 44838 20042 40281 50539 40075 105595 94765 27930 -15820 -72733 -77953
13551g7953Q492L4963L3520l232M4311J8497l6193K969n394J1245m514K6374O584
$$ -77953 -69461 -34498 -978 -4210 40101 58598 22405 25374 19980 31225 26711 53085 59669
13538E9669J2171j5715m9448L2536L6879j03535j633M5580J09663O0806m6069
$$ 59669 71840 56125 6677 39213 76092 -27443 -29076 16504 126167 186973 140904
13527A40904k8877j7408j5986j0464l1985l1601O443M9370K0206j8277L1662m6326
$$ 140904 112027 94619 78633 68169 36184 4583 11026 60396 80602 62325 93987 47661
13515D7661q2938R609M2616M7400o1399J0481k3821j1975J3232M9781j3008o3358
$$ 47661 -35277 -25668 16948 64348 2949 13430 -10391 -22366 -9134 40647 27639 -35719
13503c5719L7105J173o025o5153J7716R2961O5277m227l208k7111j8732m5601
$$ -35719 1386 2559 -3466 -68619 -50903 42058 107335 103108 99900 72789 54057 8456
13491H456k3494j1296M8095l0717j3012o617l842R142j5458k8353j6898Q3459
$$ 8456 -15038 -26334 21761 -8956 -21968 -28585 -32427 -23285 -38743 -67096 -83994 -535
13479e35L6472K0977J502k3727r059k455l7729L8741k6028m8551J4088N4775k2471
$$ -535 35937 56914 58416 34689 25630 23175 -14554 24187 -1841 -50392 -36304 18471 -4000
13466d000j8697O6079K1292l1534n5209O166N5873J17j4962k1841k6798L6093
$$ -4000 -22697 43382 64674 33140 -22069 -15903 39970 40087 25125 3284 -23514 12579
13454A2579n2540J3212M133k6418O349O2888J2647l8262k7501L1351J8427q728
$$ 12579 -39961 -26749 -22616 -49034 -42685 20203 32850 -5412 -32913 -1562 16865 8137
13442H137L6071l1843M168L0106K8973K7964J03q306m0137o7736j1606R775O18
$$ 8137 44208 12365 16533 46639 75612 103576 103679 95373 55236 -12500 -24106 -14331 -13713
13429a3713L9500N7904Q7673j5832j12293l4288n3019k3290j0615L7318P0605
$$ -13713 25787 83691 171364 155532 43239 8951 -44068 -67358 -77973 -40655 29950
13418B9950M9188o1408k2055K1335J3853K0917p2896P14K4826K2007L694J7170
$$ 29950 79138 17730 -4325 17010 30863 51780 -21116 -20402 4424 26431 30125 47295
13406D7295K1587J8792j7440j4967j0217J5506p686J6341J3935N2189j9908r3134
$$ 47295 68882 87674 70234 55267 45050 60556 52870 69211 83146 135335 115427 22293
13394B2293j10827J212N8699p754M7021K1235m5579K3046j3020j12462q017R3739
$$ 22293 -88534 -87322 -28623 -36377 10644 31879 -13700 9346 -3674 -116136 -124153 -30414
13382c0414M0653L3692J1107m2953k1325O3853J1056j08937l5522l4196K8662
$$ -30414 10239 43931 55038 12085 -9240 54613 65669 -43268 -78790 -112986 -84324
13371h4324j6989p835m343L8321P723j0693j0089Q7266L8981P922J6061K707M1908
$$ -84324 -101313 -109148 -113491 -75170 -67447 -78140 -88229 -963 38018 45940 62001 64708 106616
13358A06616M0859L0870n8140r1306J2861L5083L743o508p1478j1484O9765K8214
$$ 106616 147475 178345 120205 28899 41760 76843 80586 74078 2600 -8884 60881 89095
13346H9095K6464j1099j9023j1912j628k8332j2042L3439N632l9599p8513l4725
$$ 89095 115559 104460 85437 73525 71897 43565 31523 64962 70594 30995 -47518 -82243
13334h2243Q227O4841M1684L098l4112J6676L5206l7294j4424J1575L4547J5620
$$ -82243 -74016 -9175 32509 35607 1495 18171 53377 16083 1659 13234 47781 63401
13322F3401j8951m0449K2931l2545L036P4366M8034m4187j8578j0733o3583L6033
$$ 63401 44450 4001 26932 -5613 -2577 71789 119823 75636 57058 46325 -17258 18775
13310A8775O7087n6418l077J02460J1359r7087q5248K8120M4308J9124L3575J4198
$$ 18775 85862 29444 26367 128827 140186 43099 -42149 -14029 30279 49403 82978 97176
13298I7176m5418k1742O2821j1532p547n6968j8521J4896l2302k3818P6202M8212
$$ 97176 51758 30016 92837 81305 73758 16790 -1731 13165 -19137 -42955 33247 81459
13286H1459N4312k884l1222O387J2137m0114o901p9764l2277M19j0514M8247M5515
$$ 81459 135771 132887 101665 108052 120189 80075 73174 -6590 -38867 -38448 -48962 -715 44800
13273D4800J8901k5409j3388q103L0750M1826k3097J658n2261R80J0269n0258
$$ 44800 63701 38292 24904 16801 47551 89377 66280 67938 15677 16657 26926 -23332
13261b3332m790K9869J7127K7171m9301m8982J6366k9794o7932m8811P5562N1900
$$ -23332 -28122 1747 18874 46045 -3256 -52238 -35872 -65666 -133598 -182409 -106847 -54947
13249e4947N716N9544L6732k3035O449L8755j3282K228j929K766K4338L0436o6642
$$ -54947 -49231 10313 47045 24010 30459 69214 55932 58160 56231 58997 83335 113771 47129
13236D7129l088N8957K3985o8755n6768q68N970k2699k8397M0392m3727o80M3809
$$ 47129 44041 102998 126983 58228 1460 592 6562 -16137 -44534 -4142 -47869 -48549 -4740
13223d740N0645O100j2679j1836n2798p039n2252O4954K7646k9500J9302J0910
$$ -4740 45905 52005 39326 27490 -25308 -32347 -84599 -19645 8001 -21499 -2197 8713
13211H713l8162R653k721M3273q070j6181M1799M9269J2889K9893k7673l3898
$$ 8713 -29449 -19796 -22517 20756 12686 -3495 38304 87573 100462 130355 102682 68784
13199F8784l3305l6770l7085j2432K793j6188J1824O2374k9790K4982J0768P8693
$$ 68784 35479 -1291 -38376 -50808 -48015 -64203 -52379 9995 -19795 5187 15955 94648
13187I4648o9o4563m0988J192K8239n193l0059q917L94L5786O0963K8902R888
$$ 94648 94579 30016 -10972 -9780 18459 13266 -16793 -25710 -25316 10470 71433 100335 110223
13174A10223k2348j6727J6825J4952K879l9703j6380R286l1200o3361J6925O5028
$$ 110223 87875 71148 87973 102925 105804 66101 49721 59007 27807 -35554 -18629 46399
13162D6399J3278J9809j06022L4171J3031K8787n6233m8014q162m531r611M1619
$$ 46399 59677 79486 -26536 7635 20666 49453 -6780 -54794 -62956 -67487 -77098 -35479
13150c5479M4980n94m5741J7120l689J2024M9658R128K8837K445m1981j7686K718
$$ -35479 9501 8907 -36834 -19714 -23403 -11379 38279 47407 76244 78689 36708 19022 21740
13137B1740J7271K9415N156n4675p3274K0684M8633N1307O1798j5387n460M3140
$$ 21740 39011 68426 73582 18907 -54367 -33683 14950 66257 128055 112668 107208 150348
13125A50348M6848l7959k0073n2002p1343j7944k0107P7327K0937k9357j6593
$$ 150348 197196 159237 139164 87162 15819 -2125 -22232 55095 76032 46675 30082
13114C0082J3006j71M5949j605m5957k4043j8524n3699j4136M4617K7622M84j0774
$$ 30082 43088 42917 88866 87261 41304 17261 -1263 -54962 -69098 -24481 3141 3625 -7149
13101g149J5027o5966p829M3231K942J8197O197l9080J9219J5165k6055m7180
$$ -7149 7878 -58088 -65917 -22686 -19744 -1547 4650 -34430 -15211 -46 -26101 -73281
13089g3281J9299N3441O1441L5593k2701o3004K5081k2082K044L5962l0513k3854
$$ -73281 -53982 -541 60900 96493 73792 10788 35869 13787 15831 51793 21280 -2574
13077b574L0463k346j3971M2882L2515j0451K2323J9391p9964q8436o8246J3845
$$ -2574 27889 25543 11572 54454 86969 76518 98841 118232 38268 -50168 -118414 -104569
13065a04569P4850N5772Q2604K8877q097n5409J4011j4944N4925n3871o2325N0890
$$ -104569 -29719 26053 108657 137534 129437 74028 88039 73095 128020 74149 11824 62714
13053F2714j4813R576m7638K1935K8898N0020J64l2067k3328j061M7578j7152
$$ 62714 47901 57477 9839 31774 60672 110692 110856 78789 55461 54400 101978 84826
13041H4826J3506K102l1535J4042K1101k3837k3022O776J5328q790M9449J4372
$$ 84826 98332 100434 68899 82941 104042 80205 57183 63959 79287 70497 119946 134318
13029A34318m2007k2404l9526p7817j3242L5880O8206O942l8697N0845L3129n3914
$$ 134318 92311 69907 30381 -47436 -60678 -24798 43408 50350 11653 62498 95627 41713
13017D1713l813N563o10o18K480j2309m3251l0100n8896M1443J8063N7096L4816
$$ 41713 37900 43463 42853 42235 44715 32406 -10845 -40945 -99841 -58398 -40335 16761 51577
13004E1577l081N0968n230n2046o5334O5037N1616m6581q359k4229k6621M3842
$$ 51577 48496 99464 94234 42188 -23146 41891 93507 46926 38567 14338 -12283 31559
12992C1559M7251m9357r478O636L866R103K1423O957M1450r478J5436p8889l7853
$$ 31559 78810 29453 19975 26611 30477 39580 61003 67960 109410 99932 115368 36479 -1374
12979a374O0804L3727O2138J02836L4110M6545N1304J08490J66383R6919J85608
$$ -1374 59430 93157 155295 258131 292241 338786 390090 498580 664963 761882 947490
12968I47490K53484K95808K24987M7843m4435r0749q5567j26731k87680k47186
$$ 947490 1200974 1496782 1721769 1769612 1725177 1634428 1548861 1422130 1134450 887264
12958H87264j96993j28044j2945j24465j25050l9384j4385m1899l0919k8107K1891
$$ 887264 690271 562227 549282 424817 299767 260383 245998 204099 173180 145073 166964
12947A66964J2985p00K9009l4445m647k0911j4413j6468K3384l8354l8856J7538
$$ 166964 179949 179249 208258 173813 169166 148255 133842 117374 140758 102404 63548 81086
12935H1086K6379P5819K0870M5425L0155R049k031O835K0186l4116m0163l3179
$$ 81086 107465 183284 204154 249579 279734 288783 286752 293587 313773 279657 239494 206315
12923B06315k1146p3988O992l29K515j6995k6820j1180L8853R415o3974k5638
$$ 206315 185169 111181 118173 117844 120359 103364 76544 65364 104217 113632 49658 24020
12911B4020P547L4337M9320K7983K7390l0985p8404J7618K1744q695P032k6219
$$ 24020 31567 65904 115224 143207 170597 139612 61208 78826 100570 91875 98907 72688
12899G2688p8538m6961L9479J8990M9359J2637j3767k078K8524N4566j769k4132
$$ 72688 -5850 -52811 -13332 5658 55017 67654 53887 51809 80333 134899 133130 108998
12887A08998j1604K0534O4512m7595p209R1542K0976r3149m3197J6848j5329J760
$$ 108998 97394 117928 182440 134845 127636 219178 240154 147005 103808 120656 105327 107087
12875A07087K0656m2388m70j8308o4640L6133M8267L8919K3134l904j9728j3762
$$ 107087 127743 85355 84885 66577 1937 38070 86337 125256 148390 144486 124758 110996
12863A10996j6153m300K8713N8154J5966j6526j6881J9067o801m3829P437J1310
$$ 110996 94843 90543 119256 177410 193376 176850 159969 179036 172235 128406 135843 147153
12851A47153N4317L9843L5058o7112p8355J8355M4029K1147j5176m1199M608J8714
$$ 147153 201470 241313 276371 209259 130904 149259 193288 214435 199259 158060 162668 181382
12839A81382Q707L4558l6803m1705K0434j8813n885k0534M9465M8649r332o313
$$ 181382 190089 224647 187844 146139 166573 147760 141875 121341 170806 219455 210123 203810
12827B03810l1950r4201j6965j0517o1448l5449j7257k6204n7779J1350R5990
$$ 203810 171860 77659 60694 50177 -11271 -46720 -63977 -90181 -147960 -136610 -40620
12816d0620L4777j9122K3538J4143k5908L2297O6189L9558r0509q8322N5618L7091
$$ -40620 -5843 -24965 -1427 12716 -13192 19105 85294 124852 34343 -53979 1639 38730
12804C8730Q602n8054J2681l9978o5568O6519P3030K9352K1168l2826L1353J339
$$ 38730 47332 -10722 1959 -38019 -103587 -37068 35962 65314 86482 53656 85009 86348
12792H6348K3847K2246K9327m7783j8831J3752J135K1067l1892l2147K3833K796
$$ 86348 110195 132441 161768 113985 95154 108906 110041 131108 99216 67069 90902 93698
12780I3698M3875k0253m3897L5123K1135k9163R041p4J4149P2265M1471J14731
$$ 93698 137573 117320 73423 108546 129681 100518 109559 109485 123634 195899 237370 352101
12768C52101O3634l8049O577M0277o3616q9801k5628M2823r675j0539K4488j2951
$$ 352101 415735 377686 384263 424540 360924 271123 245495 288318 278643 268104 292592 279641
12756B79641k1474K1489L1769k8679r5419l4281o6725L3186L8362j6719n4390
$$ 279641 258167 279656 311425 282746 187327 153046 86321 119507 157869 141150 86760
12745H6760o774k7878J3906K2386P3314K199n1380L9972L2215o0539n6701n6428
$$ 86760 79986 52108 66014 88400 161714 163913 112533 152505 184720 124181 67480 11052
12733A1052n7085P125R1172K7176P4501K9353m6026k2267J0080O651J2457J594
$$ 11052 -46033 -38908 52264 79440 153941 183294 137268 115001 125081 131732 144189 145783
12721A45783L3502K4947m577k7329m62J5533L8207O2071K1257n7545L5633J673
$$ 145783 179285 204232 199655 172326 171864 187397 225604 287675 308932 251387 287020 288693
12709B88693q1169k8665M2535L5582k4670m093L3153j9689K145N5733k1348n3034
$$ 288693 207524 178859 221394 256976 232306 228213 261366 241677 243822 299555 278207 225173
12697B25173o088j7727k1392J3564p867O1704p02l7878j0284k8960J9895k9330
$$ 225173 219085 201358 179966 193530 185663 247367 246665 208787 198503 169543 189438 160108
12685A60108J9183O3228l8103n2024J1541j6396j7412n337n2352L314o4449l0704
$$ 160108 179291 242519 204416 152392 163933 147537 130125 124788 72436 75750 11301 -19403
12673a9403q8131k19197k45128j60024j9081J03132J52788P8836J30811J79432
$$ -19403 -107534 -326731 -571859 -731883 -750964 -647832 -495044 -416208 -285397 -105965
12663a05965J39098K38212J63640K0549L203j8626k8189j197L5371K279m1940
$$ -105965 33133 271345 434985 455534 458737 440111 411922 410725 446096 448375 406435
12652D06435r672l9636k2336K0033K9104j3424j7451K3312K7966k1663j1869M7629
$$ 406435 396763 357127 334791 354824 383928 370504 353053 376365 404331 382668 370799 418428
12640D18428M8537M1904M7052k6432Q056N2360O4260m4296J2204O7206k0035M8796
$$ 418428 466965 508869 555921 529489 537545 589905 654165 609869 622073 689279 669244 718040
12628G18040j8578p3805L0632L4445J6911J8022o1757m8016O6689L5673L6564
$$ 718040 699462 625657 656289 690734 707645 725667 663910 615894 682583 718256 754820
12617G54820O2652j0084m7821l3248j2011O4526J28417Q0439N013k9895L5829
$$ 754820 817472 807388 759567 726319 714308 778834 907251 987690 992703 962808 998637
12606I98637Q0620J05284J51643K12994K32788L99961O70144R91184J068643Q08478
$$ 998637 1079257 1184541 1336184 1549178 1781966 2181927 2852071 3843255 4911898 5720376
12596E720376L26615J61l03337o33449q83829q63455o42179m60212l09136k10669
$$ 5720376 6046991 6047152 5743815 5110366 4226537 3363082 2720903 2260691 1951555 1740886
12586A740886j70624j36431r8263p8632n5139J5035j8361P8546o498k0264L0818
$$ 1740886 1570262 1433831 1335568 1256936 1201797 1216832 1198471 1277017 1270519 1250255 1281073
12575A281073N4523K6636J1092k1691K2834K5052k6445k9718K6907P3563N6243
$$ 1281073 1335596 1362232 1373324 1351633 1374467 1399519 1373074 1343356 1370263 1443826 1500069
12564A500069K4961J1840L2056M9874P6384L8265L4936J19717J37277Q0156J03387
$$ 1500069 1525030 1536870 1568926 1618800 1695184 1733449 1768385 1888102 2025379 2105535 2208922
12553B208922P3178J39438J74392J54092R3355O6116J40133J74160J72259J95172
$$ 2208922 2282100 2421538 2595930 2750022 2843377 2909493 3049626 3223786 3396045 3591217
12543C591217K48004K50533K89034L16575L24403M15733N30501O03030O78960
$$ 3591217 3839221 4089754 4378788 4695363 5019766 5435499 5966000 6569030 7247990
12534G247990P81688Q08735J012079J160104J499102J785463K186359K446200
$$ 7247990 8029678 8838413 9850492 11010596 12509698 14295161 16481520 18927720
12526A8927720K663309L232341M026226N306533P139899R707818J3949817K0801448
$$ 18927720 21591029 24823370 28849596 34156129 41296028 51003846 64953663 85755111
12518H5755111L1447148M7251674O5330776P1971376N2294839J7565189n516000
$$ 85755111 117202259 164453933 229784709 301756085 354050924 371616113 366100113
12511C66100113j4319764k6329783m7535134o0231633n3946720l9753000k7625623
$$ 366100113 351780349 325450566 277915432 217683799 163737079 123984079 96358456
12504I6358456j9352801j4012268j0348099p899375o193125n010579m090125l358106
$$ 96358456 77005655 62993387 52645288 44745913 38552788 33542209 29452084 26093978
12496B6093978k922900k584553k176897j845859j520469j389375j169868r90697
$$ 26093978 23171078 20586525 18409628 16563769 15043300 13653925 12484057 11493360
12488A1493360q22543p65288o61936o11623n78380m82617l82727m16103l69230
$$ 11493360 10670817 9905529 9243593 8631970 8053590 7570973 7188246 6772143 6402913
12479F402913m06512k97940l17928k71525k36836j87492j54170j86644k45372
$$ 6402913 5996401 5698461 5380533 5109008 4872172 4684680 4530510 4343866 4098494
12470D098494j73824j38595j18552j41614j17553j07778j25021p3866j28531j43324
$$ 4098494 3924670 3786075 3667523 3525909 3408356 3300578 3175557 3101691 2973160 2829836
12460B829836o7531j1630p8721j83926q4978m8702r9975j07655j0140p2799l3832
$$ 2829836 2762305 2750675 2671954 2488028 2403050 2354348 2254373 2146718 2136578 2063779 2029947
12449B029947m4790o1228l4521n7642m2141n2767l1791j3147l6073q4588k9804
$$ 2029947 1985157 1923929 1889408 1831766 1789625 1736858 1705067 1691920 1655847 1571259 1541455
12438A541455l6340o3986r0853j6691q132N1638k6131o3460q5579o2490k1358
$$ 1541455 1505115 1441129 1350276 1333585 1325453 1377091 1350960 1287500 1201921 1139431 1118073
12427A118073J6627Q1072m6945j4245l94K5426J0626M8280k373r3449n5349K6388
$$ 1118073 1134700 1215772 1168827 1154582 1154188 1179614 1190240 1238520 1236147 1142698 1087349 1113737
12415A113737m714o9193k8542k430k0215k912L6872K8138n5090n9479l9276o3049
$$ 1113737 1109023 1039830 1011288 1008858 988643 985731 1022603 1050741 995651 936172 896896 833847
12403H33847j3576J2451K1117n0035m2260j6127P2062j1828N52k3982k6201K5994
$$ 833847 820271 832722 853839 803804 761544 745417 817479 805651 806203 782221 756020 782014
12391G82014N2195m2137p4810r9955j29131N4487J33468K9987r533R738L5424
$$ 782014 834209 792072 717262 617307 488176 542663 676131 706118 696585 706323 741747
12380G41747J9077L442m1517m964n2517M2965J1684p8794K2364K5237m9835r3729
$$ 741747 760824 764266 722749 717785 665268 708233 719917 641123 663487 688724 638889 545160
12368E45160j11150k1974r067j3633L9238O2872P4202R0678J32294J90589J62052
$$ 545160 434010 412036 402969 389336 428574 491446 565648 656326 788620 979209 1141261
12357A141261R0220M4828p5931o835m1259j14254j12999j04217m4628j16471p0842
$$ 1141261 1231481 1276309 1200378 1193543 1152284 1038030 925031 820814 776186 659715 588873
12346E88873q6807L0800L2922l5768q316k0174m4001J5076K2518L1924J1283L9812
$$ 588873 502066 532866 565788 530020 521704 501530 457529 472605 495123 527047 538330 578142
12334E78142j4793n1808k4256l0089l3201m0194n6502Q863O8719Q639q8499m468
$$ 578142 563349 511541 487285 457196 423995 383801 327299 336162 404881 413520 325021 320553
12322C20553L9315j5228P594Q924L4784k1510k4137j7724M672P3852j9274j6492
$$ 320553 359868 344640 352234 361158 395942 374432 350295 332571 337243 411095 391821 375329
12310C75329p471N1128k9077p7297L2487J4512m5085n8127N0267O9143o8j8895
$$ 375329 367858 418986 389909 312612 345099 359611 314526 256399 306666 375809 375741 356846
12298C56846l1058n102K2015L242j9976j0899k8127L8516M2081J2855p235k3599
$$ 356846 325788 320686 342701 345943 325967 315068 286941 325457 367538 380393 373158 349559
12286C49559K8471J2720k9637p1850j4883N7833j8642L2489K8477j5403j0072
$$ 349559 378030 390750 361113 289263 274380 332213 313571 346060 374537 359134 349062
12275C49062k8298k6043k2223j3543R808m174N6403j0300k8163m1623O6845K6260
$$ 349062 320764 294721 272498 258955 268763 264589 320992 310692 282529 240906 307751 334011
12263C34011k533L5895k2430O6993J9842k5198o6011m5684O7377J1898j7101j1068
$$ 334011 331478 367373 344943 411936 431778 406580 340569 294885 362262 374160 357059 345991
12251C45991p307k4682P436k2340k2549L5139l9125l2091k3671j5165J03691M0403
$$ 345991 338684 314002 321438 299098 276549 311688 272563 240472 216801 201636 305327 345730
12239C45730K0014j821m1236k2059L2094n8985M9141M542k8077q389J5443K8932
$$ 345730 365744 363923 322687 300628 332722 273737 322878 327420 299343 290954 306397 335329
12227C35329J4572O488n433j1850k512M2774m0012j6868N0994M8735q031P671
$$ 335329 349901 356389 350956 339106 336594 379368 339356 322488 373482 422217 414186 421857
12215D21857j6299o339J4463l8113P863N3788M9671O7330N23K6804n594j4992
$$ 421857 405558 399219 413682 375569 383432 437220 486891 554221 554744 581548 575954 560962
12203E60962j5275l426M715n3336k6583J222l3300j8602L0813n6648J1023K3502
$$ 560962 545687 542261 546976 493640 467057 468279 434979 416377 447190 390542 401565 425067
12191D25067q599q821k195N5659p285m5824n985l6952j7341m9939O658J4691L690
$$ 425067 416468 407647 405452 461111 453826 408002 402017 365065 347724 297785 304443 319134 322824
12178C22824N3774j8751J3158k5354Q059N2720O8734k3642j0336K8277j170K7489
$$ 322824 376598 357847 371005 345651 353710 406430 475164 451522 441186 469463 468293 495782
12166D95782o2619m5791m066K4238L5148O0612J6026l210M6113k0312k6043m4864
$$ 495782 433163 387372 383306 407544 442692 503304 519330 516120 562233 541921 515878 471014
12154D71014L841K7929k6082K6774Q6555L3636l7470L6327M7324L4186k1558j4760
$$ 471014 474855 502784 476702 503476 590031 623667 586197 622524 669848 704034 682476 667716
12142F67716K4827j0925o428n6483N3871O0753j2608p969k1101K4739R1937L5029
$$ 667716 692543 681618 675190 618707 672578 733331 720723 712754 691653 716392 808329 843358
12130H43358l0505k163M2809J4631M606L2776Q4677K580n534K1813j1537j4111
$$ 843358 812853 810690 853499 868130 872736 905512 990189 992769 987235 1009048 997511 983400
12118I83400N0839m7506m6059J09618L5783k6752O680O394K5587P2277P2845j7807
$$ 983400 1034239 986733 940674 1050292 1086075 1059323 1066003 1072397 1097984 1170261 1243106 1225299
12106A225299k0929o187O5567Q7311j3585k3241N9337P2128K8871J5344J8976
$$ 1225299 1204370 1198183 1263750 1351061 1337476 1314235 1373572 1445700 1474571 1489915 1508891
12095A508891M3697L0762j7979j3335K9221M1363K3274L8424R0772O8208J1136
$$ 1508891 1552588 1583350 1565371 1552036 1581257 1622620 1645894 1684318 1775090 1843298 1854434
12084A854434k1675j1543j3577Q4362N9783J8551J2961J3878L6106P8160J6757
$$ 1854434 1832759 1821216 1807639 1892001 1951784 1970335 1983296 1997174 2033280 2111440 2128197
12073B128197J00112R5690M461l579n093J2447N4866Q6164R9921J04501M3457
$$ 2128197 2228309 2323999 2328460 2324881 2319788 2332235 2387101 2473265 2573186 2677687 2721144
12062B721144J48077J65607J60275K15872K06172K69578L84239L84342L23183
$$ 2721144 2869221 3034828 3195103 3410975 3617147 3886725 4270964 4655306 4978489
12053D978489K15365J11460J03381K4900m9250j9363K3541J02422J97155J95115
$$ 4978489 5193854 5305314 5408695 5433595 5384345 5364982 5388523 5490945 5688100 5883215
12043E883215J41250K95876M68945L92410M22956N52791N90888P09683P86975
$$ 5883215 6024465 6320341 6789286 7181696 7604652 8157443 8748331 9458014 10244989
12034A0244989R32888J106872J231151J374415J645113J894289K176225K301995
$$ 10244989 11177877 12284749 13515900 14890315 16535428 18429717 20605942 22907937
12026B2907937K509025K726482K832789K783684K708054K541144K330087K033728
$$ 22907937 25416962 28143444 30976233 33759917 36467971 39009115 41339202 43372930
12018D3372930J803108J582033J323635J020971P79683N19480K54895n2829l14332
$$ 43372930 45176038 46758071 48081706 49102677 49882360 50401840 50656735 50603906 50289574
12009E0289574m70386n52997n24252l78794q0143K91100N54581R51959J296182
$$ 50289574 49819188 49266191 48741939 48363145 48283002 48574102 49128683 50080642 51376824
12000E1376824J711679K051164K242554K364072K498797K568630K741907K823356
$$ 51376824 53088503 55139667 57382221 59746293 62245090 64813720 67555627 70378983
11992G0378983K752486K576845K283317J909397J574386J119770O46199K87573
$$ 70378983 73131469 75708314 77991631 79901028 81475414 82595184 83241383 83528956
11984H3528956O0647j38984m08411o58814q62300r94708j184167j341204j350574
$$ 83528956 83589603 83450619 83042208 82383394 81521094 80526386 79342219 78001015 76650441
11975G6650441j443096j539950j578693j521807j424507j317884j194493j074076
$$ 76650441 75207345 73667395 72088702 70566895 69142388 67824504 66630011 65555935
11967F5555935q87095o12404m03049r3667O6331K78319N74659Q72122J171067
$$ 65555935 64668840 64056436 63653387 63559720 63626051 63904370 64479029 65351151 66522218
11958F6522218J391767J497580J458956J371127J009251N43095N4037l53358o65753
$$ 66522218 67913985 69411565 70870521 72241648 73250899 73793994 73848031 73494673 72828920
11949G2828920j010393j452042j828243k270466k874067l439583l927941m248782
$$ 72828920 71818527 70366485 68538242 66267776 63393709 59954126 56026185 51777403
11941E1777403m417493m454493m245745l938361l610430l164548k796533k385185
$$ 51777403 47359910 42905417 38659672 34721311 31110881 27946333 25149800 22764615
11933B2764615k107185j863126j585239j412480j331094j100963r05229r17009
$$ 22764615 20657430 18794304 17209065 15796585 14465491 13364528 12459299 11542290
11925A1542290q41931p37413o08663n73427m90517m22130l98211m40830l38403
$$ 11542290 10700359 9962946 9354283 8780856 8290339 7868209 7469998 7029168 6690765
11916F690765k65941k62648k58982k70019k57133j92126j95947j85720k10614
$$ 6690765 6424824 6162176 5903194 5633175 5376042 5183916 4987969 4802249 4591635
11907D591635j59505j48411k02301j97949j47962p9058J7303j69260j63200q7125
$$ 4591635 4432130 4283719 4081418 3883469 3735507 3656449 3673752 3504492 3341292 3254167
11897C254167j16986r1583j76697j49721m0808j2734j08834n8234r9152p3380
$$ 3254167 3137181 3045598 2868901 2719180 2678372 2665638 2556804 2498570 2399418 2326038
11887B326038l5716m4065p6936j36786k30075j01572K9037l633o812l9760n238
$$ 2326038 2290322 2246257 2169321 2032535 1802460 1700888 1729925 1726292 1719480 1679720 1674482
11876A674482P830m3887l9936p4255n3324j4561k8536j9612j8957K6879J3698
$$ 1674482 1682312 1638425 1598489 1524234 1470910 1456349 1427813 1408201 1389244 1416123 1429821
11865A429821K199L269p2776o1275K7040J1502o9935k9146N0357j0711m7437J4534
$$ 1429821 1432020 1435289 1362513 1301238 1328278 1339780 1269845 1240699 1291056 1280345 1232908 1247442
11853A247442K6472m1449K6418l0435k6755J7586J9628O0649J0272Q353K4804
$$ 1247442 1273914 1232465 1258883 1228448 1201693 1219279 1238907 1299556 1309828 1318181 1342985
11842A342985K0673J0994K0577j3192K693P1856Q2447N9163k2098m5628K6269
$$ 1342985 1363658 1374652 1395229 1382037 1384730 1456586 1539033 1598196 1576098 1530470 1556739
11831A556739J34479P6821o2924m6320P5987P7635K5969M3742J5501J5412L4037
$$ 1556739 1691218 1768039 1705115 1658795 1734782 1812417 1838386 1882128 1897629 1913041 1947078
11820A947078o6549l7766k8205L8453N381l6887J3490m933o2464o7801l6328n1225
$$ 1947078 1880529 1842763 1814558 1853011 1858392 1821505 1834995 1830062 1767598 1699797 1663469 1612244
11808A612244n5322k1852L7101K0217o2768l777n2188m3988j0098K4228J6030
$$ 1612244 1556922 1535070 1572171 1592388 1529620 1525843 1473655 1429667 1419569 1443797 1459827
11797A459827J7899j3512j6219m6427q329N3711q468o6247J7749P5537N5859K5854
$$ 1459827 1477726 1464214 1447995 1401568 1393239 1446950 1438482 1372235 1389984 1465521 1521380 1547234
11785A547234l5376j5041K2058N4625k5053k841k5065L5471K0203n7878P691K5170
$$ 1547234 1511858 1496817 1518875 1573500 1548447 1545606 1520541 1556012 1576215 1518337 1526028 1551198
11773A551198j9264n1271o8681L358L8309O4148O7951O6258l055J9594l2808l5335
$$ 1551198 1531934 1480663 1411982 1415340 1453649 1517797 1585748 1652006 1648951 1668545 1635737 1600402
11761A600402J1196R4174O6932J8585M0231R5376N9853k763J1587P1236N9904
$$ 1600402 1611598 1705772 1772704 1791289 1831520 1926896 1986749 1983986 1995573 2066809 2126713
11750B126713J23217N2685K8008L0787J19810O0335R0367J30480J02065Q9472
$$ 2126713 2249930 2302615 2330623 2361410 2481220 2541555 2631922 2762402 2864467 2953939
11740B953939M3006Q8007J78956K24367J89176J95588K23313J73068K33057K59673
$$ 2953939 2996945 3084952 3263908 3488275 3677451 3873039 4096352 4269420 4502477 4762150
11730D762150L38996L51882L46656M09804M72734N46771N56719N79166O97087
$$ 4762150 5101146 5453028 5799684 6209488 6682222 7228993 7785712 8364878 9061965
11721I061965P72212Q08325R45153J058947J093561J059887J187714J200696J146074
$$ 9061965 9834177 10642502 11587655 12646602 13740163 14800050 15987764 17188460 18334534
11712A8334534J116115J084526J006121R00375P18008O46354O29594N19736M83908
$$ 18334534 19450649 20535175 21541296 22441671 23159679 23806033 24435627 24955363 25439271
11703B5439271N71332N63759N58804O46759P96029Q39935Q54587J018816J172678
$$ 25439271 26010603 26574362 27133166 27779925 28575954 29415889 30270476 31289292 32461970
11694C2461970J255402J271891J300139J326224J350708J361806J352718J360958
$$ 32461970 33717372 34989263 36289402 37615626 38966334 40328140 41680858 43041816
11686D3041816J414412J351858J283550J317364J250378J193448J114169J050950
$$ 43041816 44456228 45808086 47091636 48409000 49659378 50852826 51966995 53017945
11678E3017945R94980R42319Q82114P58954O64543O17899N78036O02024N37484
$$ 53017945 54012925 54955244 55837358 56596312 57260855 57878754 58456790 59058814 59596298
11669E9596298M76183L75709L31897L25923K69352K02008K42491K44908L21632
$$ 59596298 60072481 60448190 60780087 61106010 61375362 61577370 61819861 62064769 62386401
11660F2386401L28826L19903L61054M14016N05511N20626N25432N18907M02544
$$ 62386401 62715227 63035130 63396184 63810200 64315711 64836337 65361769 65880676 66283220
11651F6283220K75045K08657M5508r6211r1846k10159l59679m05283m64145n50325
$$ 66283220 66558265 66766922 66812430 66716219 66624373 66414214 66054535 65649252 65185107 64634782
11641F4634782n84397o17459n95590o17898p19905q61855r61736r98685r96728
$$ 64634782 64050385 63432926 62837336 62219438 61499533 60637678 59675942 58677257 57680529
11632E7680529r70579j060511j027054j004181r60410q27726q01875p94626p37829
$$ 57680529 56709950 55649439 54622385 53618204 52657794 51830068 51028193 50233567 49495738
11623D9495738n46129n80894o90026o63175n97076o62276p83736p57451p66496
$$ 49495738 48949609 48368715 47678689 47015514 46418438 45756162 44972426 44214975 43448479
11614D3448479q52471r17601j042384j051250j141691j235005j318509j385394
$$ 43448479 42596008 41678407 40636023 39584773 38443082 37208077 35889568 34504174
11606C4504174j349986j437081j431885j378217j363630j304797j057511j013869
$$ 34504174 33154188 31717107 30285222 28907005 27543375 26238578 25181067 24167198
11598B4167198r93104q93345q35291o39597n53736l77204m15325m30455m02450
$$ 24167198 23174094 22280749 21445458 20805861 20252125 19874921 19459596 19029141 18626691
11589A8626691l80359m25038m01541m53727n92199p05938o98407p34578q02873
$$ 18626691 18246332 17821294 17419753 16966026 16373827 15667889 14969482 14234904 13432031
11580A3432031p60830p51701q27560p12781o14343o95738o52945n86102n20382
$$ 13432031 12671201 11919500 11091940 10379159 9764816 9069078 8416133 7830031 7309649
11571G309649l97737l23979m07530m05532l12415k53693l24148l43054j85705
$$ 7309649 6911912 6587933 6180403 5774871 5462456 5208763 4884615 4541561 4355856
11562D355856j49034j55526j28857j36456j66065j59221j08646q1317p5533j60990
$$ 4355856 4206822 4051296 3922439 3785983 3619918 3460697 3352051 3270734 3195201 3034211
11552C034211m4022o1007j02808n6697j29960j5912n8822n9722o1081n7762m3699
$$ 3034211 2990189 2929182 2826374 2769677 2639717 2623805 2564983 2505261 2444180 2386418 2342719
11541B342719q0318o6317q852K5337J4556m1516n7360m9794o7621j951j9964r5569
$$ 2342719 2262401 2196084 2187232 2212569 2227125 2185609 2128249 2078455 2010834 2008883 1988919 1893350
11529A893350j04604n8194M1865J3120k6568j9061M2700L7097n1462n1478j1651
$$ 1893350 1788746 1730552 1772417 1785537 1758969 1739908 1782608 1819705 1768243 1716765 1705114
11518A705114o5380K0407m9144p8078n4534n9199o8870p948O777l085j8109P201
$$ 1705114 1639734 1660141 1610997 1532919 1478385 1419186 1350316 1342368 1349145 1346060 1327951 1335152
11506A335152J9886j8325j1121l0381o2096j2059o6354M6355O0936Q0502k534
$$ 1335152 1355038 1336713 1325592 1295211 1233115 1221056 1154702 1201057 1261993 1342495 1339961
11495A339961o0596K2123l9757n5587j3712n8584q5345k2994l4391k7501p358
$$ 1339961 1279365 1301488 1261731 1206144 1192432 1133848 1048503 1025509 991118 963617 956259
11484I56259n8873j3074O113Q218K1212L359l2219j7558o2139o3934q298P673
$$ 956259 897386 884312 890425 898643 919855 923214 890995 873437 811298 747364 739066 746739
11472G46739J106j7671M726K2135k0867J2126J7377J5913j5027q5150m8733l683
$$ 746739 747845 730174 734900 757035 736168 748294 765671 781584 766557 681407 632674 628991
11460F28991n939J0061M7150L0530k4925O514k6917r319K784j5183j8181k9011
$$ 628991 623052 633113 680263 710793 685868 692382 665465 656146 658930 643747 625566 596555
11448E96555k0576o870j3107k9400p889L1622P038n1543M2956J3053j23726m5906
$$ 596555 575979 569109 556002 526602 518713 550335 557373 505830 548786 561839 438113 392207
11436C92207O5168J2891J2811k0248M1714k5914J8241M8929j8926k9628o6148
$$ 392207 457375 470266 483077 462829 504543 478629 496870 545799 526873 497245 431097
11425D31097P283J4551n251k6604j7707j7616K8071L9801m7086p0518O342K883
$$ 431097 438380 452931 447680 421076 403369 385753 413824 453625 406539 336021 342363 345246
11413C45246j7495M5875N2571j2976Q898j5365q58p8204k381J083j309N4522L1989
$$ 345246 327751 373626 426197 413221 422119 406754 405896 327692 325311 326394 325085 379607 411596
11400D11596k5317J6149M1526j5937n2447J1265M531q379k9486m8007q669l5771
$$ 411596 386279 402428 443954 428017 375570 386835 391366 382987 353501 305494 296825 261054
11388B61054r262l5401N9355N8667j12957k2903R9022j8120l2922J3465O3661
$$ 261054 251792 216391 275746 334413 221456 198553 297575 279455 246533 259998 323659
11377C23659M187r652Q0693L7042o677n4512p0077j0763j4094J0761l0351P6508
$$ 323659 327846 318194 398887 435929 429252 374740 304663 293900 279806 290567 260216 336724
11365C36724j871k7084o6448q9934N3344L0901j8859q2021K6093K9869N4951K2379
$$ 336724 334853 307769 241321 151387 204731 235632 216773 134752 160845 190714 245665 268044
11353B68044o4900k0197L3549J2914k3853K5275M1596j6089n3881O391N210p1202
$$ 268044 203144 182947 216496 229410 205557 230832 272428 256339 202458 208849 214059 142857
11341A42857q3504N4584K6092k0902m847L3208K8536k1703p57m0756l6051M0489
$$ 142857 59353 113937 140029 119127 114280 147488 176024 154321 153564 112808 76757 117246
11329A17246M104j2346N9171N8488L5263L3098j13652p5725R669M2907r7574j4745
$$ 117246 121350 109004 168175 226663 261926 295024 181372 105647 115316 158223 60649 45904
11317D5904N4768L9411Q4432L5070k1204k3611m9541l4777N698j4941k4169M2688
$$ 45904 100672 140083 224515 259585 238381 214770 165229 130452 136150 121209 97040 139728
11305A39728J6908m7402j0483N4826l111n4739L950J5096K7952k8095J5989M3157
$$ 139728 156636 109234 98751 153577 150466 95727 99677 114773 142725 114630 130619 173776
11293A73776m055K6277N8254M8046J8239m3439m5486j3289K051p3956k8479r583
$$ 173776 169721 195998 254252 302298 320537 277098 231612 218323 220374 146418 117939 108356
11281A08356L351M8272O6547Q963r3009Q818k3311M3781K8454K2150J0515j2223
$$ 108356 111707 159979 226526 235489 142480 151298 127987 171768 200222 222372 232887 220664
11269B20664o9226l5672r898J6034K1760M3062R694l2031j3774K389M1200P374
$$ 220664 151438 115766 105868 121902 143662 186724 196418 164387 150613 153002 194202 201576
11257B01576k8217l1692L373L9444O8637O245n8834m1459n6089K4097N2194K3867
$$ 201576 173359 141667 145040 184484 253121 259366 200532 159073 102984 127081 179275 203142
11245B03142k2168n334m01Q3834k7811l5862K951l4338M7511j7572j4035j6409
$$ 203142 180974 175640 175239 259073 231262 195400 198351 164013 211524 193952 179917 163508
11233A63508m9419Q9904O6701l713o0182O275N2656N5127N2815j262M0339O838
$$ 163508 114089 203993 270694 266981 206799 213074 265730 320857 373672 372410 412749 419587
11221D19587K815l2832k1840K9183J1929J4820j2119l4838j3997N0862R8932o348
$$ 419587 422402 389570 367730 396913 408842 423662 411543 376705 362708 413570 512502 506154
11209E06154J6245Q739j643r0965r9741k1648N4329o785J5618L8395k4033q3394
$$ 506154 522399 531138 529495 438530 338789 317141 371470 364685 380303 418698 394665 311271
11197C11271M4448j4229j0231k658M9587L0229J1438j9310j8842N378j3780q120
$$ 311271 355719 341490 331259 328601 378188 408417 419855 400545 381703 387081 373301 365181
11185C65181P334N5159k71n455K8805p018J1111P0770j590j16805J1835n864k3582
$$ 365181 372515 427674 427403 421948 450753 443735 454846 525616 524026 407221 419056 413192 389610
11172C89610K041r284l5031l321J19220m9885k036k7773m7579j1049m6538K3771
$$ 389610 391651 382367 347336 344015 463235 413350 411314 383541 335962 324913 278375 302146
11160C02146R9409N7803m4294l8092l990m0795j7820l9031l7082M3000O8338j2394
$$ 302146 401555 459358 415064 376972 372982 332187 314367 275336 238254 281254 349592 337198
11148C37198k5629O88k6107J9556k571k3189n3096m7750n8484K1451L5744O824
$$ 337198 311569 312257 286150 305706 303135 279946 226850 179100 120616 142067 177811 184635
11136A84635J3962O6435m0755J2208k7693O615M2184j8888q5203J905L5562J7198
$$ 184635 198597 265032 224277 236485 208792 215407 257591 238703 153500 155405 190967 208165
11124B08165K9882q378m8018j7678k8088L4288K3853Q120o4378r7137o5515L8287
$$ 208165 238047 229669 181651 163973 135885 170173 194026 202146 137768 40631 -24884 13403
11112A3403O2940L2018L4785L9064n86j2217M1282j7824k7504k3214j5201N0661
$$ 13403 76343 108361 143146 182210 181624 169407 210689 192865 165361 142147 126946 177607
11100A77607J4675k9260l7103K8308J6092j6148q765M784P231l4909N4360Q6752
$$ 177607 192282 163022 125919 154227 170319 154171 145406 150190 157421 122512 176872 263624
11088B63624j2636p7739p4938K0308L5699o1274j0893L7320J1318n357j4376J8076
$$ 263624 250988 173249 98311 118619 154318 93044 82151 119471 130789 125432 111056 129132
11076A29132l4785j12893l2839L8212J11788M6861n5154J464n6004M8657P527
$$ 129132 94347 -18546 -51385 -13173 98615 145476 90322 91786 35782 84439 91966
11065I1966K4095m441l0762J0294M9888J0142L194m6663M2823N9544l2011J3507
$$ 91966 116061 111620 80858 91152 141040 151182 154376 107713 150536 210080 178069 191576
11053A91576N725j0043K548N0969L1080Q222m7017l726L2154J8557M98K9458K8247
$$ 191576 197301 187258 189806 240775 271855 280077 233060 229334 261488 280045 280543 310001 338248
11040C38248q478N9627N8508L6455L8729M2309P7014L1727P3823J07257L5790
$$ 338248 329770 389397 447905 484360 523089 565398 642412 674139 747962 855219 891009
11029H91009j8175M7858L9258Q0163J0624l7010k5521l6655j7910k7945o5197
$$ 891009 872834 920692 959950 1040113 1050737 1013727 988206 951551 933641 905696 840499
11018H40499l3623m2596p072L9311N8680N9755j2528m6866J190J8237N6487j2368
$$ 840499 806876 764280 757208 796519 855199 914954 902426 855560 856750 874987 931474 919106
11006I19106j5578L4139K3511K0970l266R5166R6416n205j29279n6833m7432j21438
$$ 919106 903528 937667 961178 982148 978882 1074048 1170464 1165259 1035980 979147 931715 810277
10994H10277q5198o9593l4933j4292l0600p0489o4734p9669J6827N4514m7009
$$ 810277 725079 655486 620553 606261 575661 505172 440438 360769 377596 432110 385101
10983C85101j19685p0724L9809M460m8246k548J6047K0170k7358j1350J7723O215
$$ 385101 265416 194692 234501 238961 190715 188167 204214 224384 197026 185676 203399 209614
10971B09614k695L36l2388q394o4385R913M3851Q2143q123n1806l218L1267k5848
$$ 209614 206919 207255 174867 166473 102088 112001 155852 237995 229872 178066 174848 206115 180267
10958A80267q3144j1146M712j7444j3730k7970k0715J0521k3279k2080M6417k8755
$$ 180267 97123 85977 90689 73245 59515 31545 10830 21351 -1928 -24008 22409 -6346
10946f346o0216M5540N164L8579N0749l0680k0160K1181j0015J0824Q5738J5226
$$ -6346 -66562 -21022 -15858 22721 73470 42790 22630 43811 33796 44620 130358 145584
10934A45584k0340m0387l1227o1726J4790Q6467j7156r0469j4951Q849l8906j0578
$$ 145584 125244 84857 53630 -8096 6694 93161 76005 -14464 -29415 -20566 -59472 -70050
10922g0050q36J8915K7401M1430K9128k7082J4261M1129p332O476k2684K1703
$$ -70050 -70886 -51971 -24570 16860 45988 18906 33167 74296 66964 73440 50756 72459
10910G2459L3032k5547j2074k1058K9020m3417j7315k3648k7781M2785N6516j2402
$$ 72459 105491 79944 67870 46812 75832 32415 15100 -8548 -36329 6456 62972 50570
10898E0570k683R99K5212j0602q4493k0884M6632N274k4711j1062L8360O1344
$$ 50570 47887 48886 74098 63496 -20997 -41881 4751 10025 -14686 -25748 12612 73956
10886G3956K1600k8812j6405J4798n5620l2804K5882m4705L8042M3526K0042J2357
$$ 73956 95556 66744 50339 65137 9517 -23287 2595 -42110 -4068 39458 59500 71857
10874G1857o9941p6J18649j5410q9979K8811l0842p3636O344k3668N0150J00255
$$ 71857 1916 1840 120489 105079 15100 43911 13069 -60567 -54223 -77891 -27741 72514
10862G2514J4823p6501k3799N3456P3081j4447n3786n7965K9742N7768p434p219
$$ 72514 87337 10836 -12963 40493 113574 99127 45341 -12624 17118 74886 67452 60233
10850F0233l2568O282L9146L9024n4448o436K2930m466J2987K4595k5904N3573
$$ 60233 27665 33947 73093 112117 57669 51233 74163 69697 82684 107279 81375 134948
10838A34948L7345l3955j0603o7127K8926N9599j7677j7841K0565m1545k927j170
$$ 134948 172293 138338 127735 60608 89534 149133 131456 113615 134180 92635 89708 88538
10826H8538o3760k9475N7843K0312l8243J3040O6014l0889o6727M031M3528p995
$$ 88538 24778 -4697 53146 73458 35215 48255 114269 83380 16653 20684 64212 56217
10814E6217K3626k0884m9978k7354m0449K5421R8750N295j1952m4238j2128K5466
$$ 56217 79843 58959 8981 -18373 -58822 -33401 65349 70644 58692 14454 2326 27792
10802B7792J7105K5736k5066M778K4439m7231k6266O7304Q7547Q002j0962m9670
$$ 27792 44897 70633 45567 50345 74784 27553 1287 68591 156138 164140 153178 103508
10790A03508k850k396l3391K7708K7339n5737j5855J8586P9989J9480q2301m1463
$$ 103508 100658 98262 64871 92579 119918 64181 48326 66912 146901 166381 84080 42617
10778D2617j9781K3855L1420m2725R529J464l6279q723p492M078p251L5705K5368
$$ 42617 22836 46691 78111 35386 44915 46379 10100 1377 -6115 -2037 -9288 26417 51785
10765E1785j8779J6567j1916j3067k0368q2123j0831O3975M0171j6833j3994n55
$$ 51785 33006 49573 37657 24590 4222 -77901 -88732 -24757 15414 -1419 -15413 -15968
10753a5968J0564j7819m4672n3215J125M8969j21237j4906O4774L7224L8027k4259
$$ -15968 -5404 -23223 -67895 -121110 -119985 -71016 -192253 -207159 -142385 -105161 -67134 -91393
10741i1393l1317K4533P2772k1889k7906k8885J2958J0107L7818K7150m3046J7544
$$ -91393 -122710 -98177 -25405 -47294 -75200 -104085 -91127 -81020 -43202 -16052 -59098 -41554
10729d1554K6126m165J6976J377o130o733p3002M0986J2115K1304N0824N5691
$$ -41554 -15428 -19593 -2617 -1240 -7370 -14103 -87105 -46119 -34004 -12700 38124 93815
10717I3815L9300L6214M9942k4189p4742k0079m2442J3353N8566K1077J9598L5880
$$ 93815 133115 169329 219271 195082 120340 100261 57819 71172 129738 150815 170413 206293
10705B06293K2014j4688j326J3691k3508j7798l1429L1802L8906l1580n5890L0830
$$ 206293 228307 213619 212293 225984 202476 184678 153249 185051 223957 192377 136487 167317
10693A67317J1510j3745n708N8462K1690m474n1997j9444k3958k1937J3956p105
$$ 167317 178827 165082 159374 217836 239526 235052 183055 163611 139653 117716 131672 124567
10681A24567n613M6781j8632R716L5195J7142K2507n199o9894l9757N1078j3527
$$ 124567 118954 165735 147103 156819 192014 209156 231663 226464 156570 116813 167891 154364
10669A54364K1286M3406M6890K7134K216l8739m7621j6795L6855J14873J3295
$$ 154364 175650 219056 265946 293080 295296 256557 208936 192141 228996 343869 357164
10658C57164m3349j9567J1265K6445J1473M7966j0555l0602M7919L9961P4757
$$ 357164 313815 294248 305513 331958 343431 391397 380842 350240 398159 438120 512877
10647E12877M1679P9871M6918N0240P5167R7692J22248k349O450k0831k576P966
$$ 512877 554556 634427 681345 731585 806752 904444 1026692 1024343 1030793 1009962 1007386 1015352
10635A015352n2712l9580j1702R1882Q6292J04174O5277N9151J09877J47066J54507
$$ 1015352 962640 923060 911358 1003240 1089532 1193706 1258983 1318134 1428011 1575077 1729584
10624A729584J80096K37014K93926K67231K55045K45108L22857M64921N41267
$$ 1729584 1909680 2146694 2440620 2707851 2962896 3208004 3530861 3995782 4537049
10615D537049O81384R88194J383028J814121K424127L100943L801004M134783
$$ 4537049 5218433 6206627 7589655 9403776 11827903 14928846 18729850 22864633
10607B2864633L682139K798712K087326J402366Q41132M16450M77508J312539
$$ 22864633 26546772 29345484 31432810 32835176 33676308 34092758 34570266 35882805
10599C5882805K896215M833910O697313P400862O253259M030997K098051N50114
$$ 35882805 38779020 43612930 50310243 57711105 63964364 67995361 70093412 70643526
10591G0643526q34670k109422k373274q52640J956927N128224P858833Q511669
$$ 70643526 69808856 67699434 65326160 64473520 66430447 71558671 79417504 87929173
10583H7929173O378549K799487k60931k460825m695559o864780p360735n765571
$$ 87929173 94307722 97107209 96846278 94385453 89689894 82825114 75464379 69698808
10575F9698808k923473K10981K477141L016708J522549p77287k544747l784587
$$ 69698808 66775335 66986316 69463457 72480165 74002714 73225427 70680680 66896093
10567F6896093n225791o470625o629733n335825l470108j752660n81358k39208
$$ 66896093 61670302 55199677 48569944 43234119 39764011 38011351 37429993 37190785
10559C7190785p74098j582311k308445k883744l329813l744012l850787l400489
$$ 37190785 36416687 34834376 32525931 29642187 26312374 22568362 18717575 15317086
10551A5317086k742845k147893j559249j263067r80687p84758o18962m64680m58733
$$ 15317086 12574241 10426348 8867099 7604032 6623345 5838587 5219625 4754945 4296212
10542D296212l94189l79992k99086k45440k63578j99560j44390j11461r8243j07484
$$ 4296212 3902023 3522031 3222945 2977505 2713927 2514367 2369977 2258516 2160273 2052789
10532B052789j35512j39109p5827q7227j17520j41884j03720n3741l5454J8336
$$ 2052789 1917277 1778168 1702341 1615114 1497594 1355710 1251990 1198249 1162795 1181131
10522A181131l1625j9404r0912p1243l0907n5620p1052r0916o4643j1253L0360
$$ 1181131 1149506 1130102 1039190 967947 937040 881420 810368 719452 654809 643556 673916
10511F73916l8105r2820l3064J0474r16J667q1207m49Q082n0536m2860M2713l8727
$$ 673916 635811 542991 509927 520401 519485 521152 439945 439496 447578 397042 354182 396895 358168
10498C58168N9749K4276j291K1904p2273n0048o3764m4538k214L8012j2217n8218
$$ 358168 417917 442193 440902 462806 390533 340485 276721 232183 229969 267981 255764 197546
10486A97546k3994o685J879n5133k7234P2293J2198J5197L7139J5162l8223q0457
$$ 197546 173552 166867 168746 113613 86379 158672 170870 186067 223206 238368 200145 119688
10474A19688m5819m9310J6860k5879j7213Q6692O0077l0652m6376j36O5680K0755
$$ 119688 73869 24559 41419 15540 -1673 85019 145096 114444 68068 67932 133612 154367
10462A54367j5459k459L3685k3539n8358l9194N4101k1306O853P9831L4568m8846
$$ 154367 138908 136449 170134 146595 88237 49043 103144 81838 88691 168522 203090 154244
10450A54244m7723r4810K1763Q4922K7781j8106l3361k1602j5166N9323K1793
$$ 154244 106521 11711 33474 118396 146177 128071 94710 73108 57942 117265 139058
10439A39058L0073o95j5573K2585J1058J499n3243J4707j2279l1996M5991J09677
$$ 139058 169131 168436 152863 175448 186506 188005 134762 149469 137190 105194 151185 260862
10427B60862K5843m92j3872j9456m2483l9883K2098J1469N8365o798R821K4546
$$ 260862 286705 286213 272341 252885 210402 170519 192617 204086 262451 255653 265474 290020
10415B90020p6689q2277N4483K8108J05K9802l7109k3009n701l1198K191K2000
$$ 290020 213331 131054 185537 213645 213750 243552 206443 183434 177733 146535 148726 170726
10403A70726l737O230k2222l2874q4210j0664L2429K8744j5013M034j5271P097
$$ 170726 166989 173219 150997 118123 33913 23249 55678 84422 69409 73443 58172 65269
10391F5269K3024P472j7421L9631J2341N5289L1243k8754r9460l2580K6498M0307
$$ 65269 88293 95765 78344 117975 130316 185605 216848 188094 88634 56054 82552 122859
10379A22859j3032n0554M8556L3206k0561j04896j9567J3858k1552K6913K8046
$$ 122859 109827 59273 107829 141035 120474 15578 -3989 9869 -11683 15230 43276
10368D3276q289k9510k3770j508J5351N6220L7791m764P264o1517M5753K2545
$$ 43276 34987 5477 -18293 -19801 -4450 51770 89561 84797 92061 30544 76297 98842
10356I8842n0422q390p0598J3301K0867j000P2193N4469m5553l3307k7362l0395
$$ 98842 48420 40030 -30568 -17267 3600 2600 74793 129262 83709 50402 23040 -7355
10344g355j279m942N338Q3441j9165j9268k4406j5660L6842j474k5059l2158m9741
$$ -7355 -8634 -13576 -8238 75203 56038 36770 12364 -3296 33546 32072 7013 -25145 -74886
10331g4886M038L6339M4774K2911O6980j0920m0491K294j5412n4933p1621L250
$$ -74886 -70848 -34509 10265 33176 100156 89236 48745 51039 35627 -19306 -90927 -87677
10319h7677J0066O5969J19436P5356n1987k2482K6420l4397l81J0499J2577n9084
$$ -87677 -77611 -11642 107794 183150 131163 108681 135101 100704 100323 110822 123399 64315
10307F4315j6792J2647L4887m8298m4564r400l1470K8445J2752K2901K3758M5455
$$ 64315 47523 60170 95057 46759 2195 -7205 -38675 -10230 2522 25423 49181 94636
10295I4636n5780o5788M8633o181M1895l8575q5055m4522n560M1869M5801J9057
$$ 94636 38856 -26932 21701 15520 57415 18840 -66215 -110737 -116297 -74428 -28627 -9570
10283i570O2514k2980O371L9759l3290k9571j1591L5454m6382L7225O4875k5280
$$ -9570 52944 29964 36335 76094 42804 13233 1642 37096 -9286 27939 92814 67534
10271F7534J768j0243R3535J803r6793K136O720L144k8186k262j6406J0630k1461
$$ 67534 69302 59059 152594 154397 57604 59740 66460 69604 41418 39156 22750 33380 11919
10258A1919k8139J238J6100l62K9067m0749j599O2814l4658N3672J6783j04491
$$ 11919 -16220 -14982 1118 756 29823 -10926 -12525 50289 15631 69303 86086 -18405
10246a8405j2182J5278k2994m0802N137Q0862P8281o0517K1479M8078k4503J5167
$$ -18405 -30587 -15309 -38303 -79105 -73968 6894 85175 24658 46137 94215 69712 84879
10234H4879O413m4301o4555o051M1780M5953j4811l6901k1203J00192O3119o1715
$$ 84879 91292 46991 -17564 -23615 18165 64118 49307 12406 -8797 91395 154514 92799
10222I2799o6453r958L5020J1784j9738j3298l4141K2846J5688j9735k5592o9201
$$ 92799 26346 16388 51408 63192 43454 30156 -3985 18861 34549 14814 -10778 -79979
10210g9979L5051M3486J2599J1941J4470K6384m7182k6092J5886r362N341j7814
$$ -79979 -44928 -1442 11157 23098 37568 63952 16770 -9322 6564 -2798 2543 -15271
10198a5271K1409J8937L4546K6874n7033o6081l9581Q4120Q2206R031l9420l1325
$$ -15271 6138 25075 59621 86495 29462 -36619 -76200 7920 90126 99157 59737 28412
10186B8412k3462J256J0027P58k2235l5464n9406r288J4996N1009J2926L7924
$$ 28412 4950 6206 16233 16991 -5244 -40708 -100114 -109402 -94406 -43397 -30471 7453
10174G453N9865L6885N5671n309M613J8376K3138q109j312n6047L835N0406j3790
$$ 7453 67318 104203 159874 154565 159178 177554 200692 192583 191271 135224 139059 189465 175675
10161A75675p424M3237J00382P9508J4148O824p0773l9219p0158r287K0349K920
$$ 175675 168251 211488 311870 391378 405526 412350 341577 302358 232200 222913 243262 246182
10149B46182J06525J53847J04466M750l6216N268J752n2312o5235r3118J1161
$$ 246182 352707 506554 611020 615770 579554 584822 586574 534262 469027 375909 387070
10138C87070J4200L4140N2002j5607q0644k4407q2792m6481l4240K8566r955r4255
$$ 387070 401270 435410 487412 471805 391161 366754 283962 237481 203241 231807 221852 127597
10126A27597K5846N8291j4953l0576K0282K9647l0043J7417J3912l1340r9353
$$ 127597 153443 211734 196781 166205 186487 216134 186091 203508 217420 186080 86727
10115H6727k1302M2146J9912R312K6142q169k8231q3282q0133m4523J5116K4166
$$ 86727 65425 107571 127483 136795 162937 154768 126537 43255 -36878 -81401 -66285 -42119
10103d2119L7724J0176j566J657O1076N0062n1560n4160J5928j2713L9671O0684
$$ -42119 -4395 5781 4215 5872 66948 117010 65450 11290 27218 14505 54176 114860
10091A14860n5275p9591m7472L5386O5587N5227J9046K6146R896n9095p0378O225
$$ 114860 59585 -20006 -67478 -32092 33495 88722 107768 133914 143810 84715 14337 20562
10079B0562j5015n9575m8835J1125R1581N1312k7156j8425l9435j3122j5086J9967
$$ 20562 5547 -54028 -102863 -91738 -157 51155 23999 5574 -33861 -46983 -62069 -42102
10067d2102M435O539m207j3492J47K8426M4088O5335k3240q1460l215K3970l0392
$$ -42102 -37667 -31128 -35335 -48827 -48680 -20254 23834 89169 65929 -15531 -18746 5224 -25168
10054b5168m9652p370O282O0055N2724k7963m416j2439j8731M0835l6174k9390
$$ -25168 -74820 -82190 -75908 -15853 36871 8908 4492 -7947 -26678 14157 -22017 -51407
10042e1407L1046J0183j5504l5135q316j8321M8764r30J9042R920l0985J7381
$$ -51407 -20361 -10178 -25682 -60817 -69133 -87454 -38690 -39620 -20578 -10658 -41643 -24262
10030b4262o2912n9428P0299J11566K2026k4478m3755Q108n8061J4412P1168l3888
$$ -24262 -87174 -146602 -76303 35263 57289 32811 -10944 -2836 -60897 -46485 24683 -9205
10018i205j0407j6369L3069n662k136K4320l4691l3208L7949K7329o7167m1826
$$ -9205 -19612 -35981 -2912 -8574 -10710 13610 -21081 -54289 -16340 10989 -56178 -98004
10006i8004L8272J04750m4557k0819j4237n0302J0642J7882L0565L3518n1654
$$ -98004 -59732 45018 461 -20358 -34595 -84897 -74255 -56373 -25808 7710 -43944
9995d3944L67J7215j7390K4457Q808l295l5691N702L5812L6269O2006k681l4224
$$ -43944 -43577 -26362 -43752 -19295 -10487 -13782 -49473 -43771 -7959 28310 90316 87635 53411
9982E3411K9378L1357m1810l3649L1332K0773N0243j2225j0632l9165p1448j6908
$$ 53411 82789 114146 72336 38687 70019 90792 141035 128810 118178 79013 7565 -9343
9970i343j0005O2219k9291l0532k6697J5027O6043j4516p2269N1638O3787n844
$$ -9343 -19348 42871 13580 -16952 -43649 -28622 37421 22905 -49364 2274 66061 60217
9958F0217l7976l4840m7329j9078N0408N5778m4811L2021P0228k9461r7693l7081
$$ 60217 22241 -12599 -59928 -79006 -28598 27180 -17631 14390 84618 55157 -42536 -79617
9946g9617n851L3570L7517K2643j7239j6156l1257M736K5655P053k3978J1306
$$ -79617 -85468 -51898 -14381 8262 -8977 -25133 -56390 -51654 -25999 -18946 -42924 -31618
9934c1618l1009K0889P2398K4181k7313l2820l1210n9366o978o88J0955m5791
$$ -31618 -62627 -41738 30660 54841 27528 -5292 -36502 -95868 -102846 -103534 -92579 -138370
9922a38370l6290k8616J2197Q0937N5502J541m3667m4769J5342J1825R9342M2000
$$ -138370 -174660 -203276 -191079 -110142 -54640 -53099 -96766 -141535 -126193 -114368 -15026 26974
9910B6974O648J1893J8008k0115l2256P019R947r818j4681j8668O1463L0919k7847
$$ 26974 33622 45515 63523 43408 11152 18171 28118 18300 3619 -15049 46414 77333 49486
9897D9486m1484O4475J7469m0033p7694k5543L1283J370n1939m8654J1557J4736
$$ 49486 8002 72477 89946 49913 -27781 -53324 -22041 -20671 -72610 -121264 -109707 -94971
9885i4971L298J757k1218K684J4203M5487K7611N6452L9451k1861m4700n4399
$$ -94971 -91673 -89916 -111134 -108450 -94247 -48760 -21149 35303 74754 52893 8193 -46206
9873d6206K6031l2727J5645m066N2920N7498O2797k2049k9192o2629m4007K2109
$$ -46206 -20175 -52902 -37257 -41323 11597 69095 131892 109843 80651 18022 -25985 -3876
9861c876J212J23J4218P8021m3603l7291j0582n0885L7776M0896o014n4318J701
$$ -3876 -2664 -2541 11677 89698 46095 8804 -1778 -52663 -14887 26009 19995 -34323 -32622
9848c2622K705K8000N4775M445j5321m3696K8717O904J2596O5023J4464m9819
$$ -32622 -29917 -1917 52858 57303 41982 -1714 27003 33907 46503 111526 125990 76171
9836G6171n1756m6023L166n1504J0612Q6279M5115k6967J3617J4525J9917n6782
$$ 76171 24415 -21608 -18442 -69946 -59334 26945 72060 45093 58710 73235 93152 36370
9824C6370n2881o2822JK4404K7535J5858P530o3166n1078o3110R028J30936R427
$$ 36370 -16511 -79333 -79332 -54928 -27393 -11535 -4005 -67171 -118249 -181359 -172331 -41395 -31968
9811c1968l1297k4892J6041l6846j7019L4028M2151K9591K8371p8480l5547J201
$$ -31968 -63265 -88157 -72116 -108962 -125981 -91953 -49802 -20211 8160 -70320 -105867 -104666
9799a04666l3145O6105Q1956Q1649R931l8837l6114n8577N184N9212K0233m0699
$$ -104666 -137811 -71706 10250 91899 101830 62993 26879 -31698 -26514 32698 52931 12232
9787A2232q5142l5208k1498M4047P9793J1168n5712O9797m191l6315M9389J2317
$$ 12232 -72910 -108118 -129616 -85569 -5776 5392 -50320 19477 15286 -21029 28360 40677
9775D0677k775k7977J6960J3431m0095k2153M0049k2187j674M3541J1243j230
$$ 40677 37902 9925 26885 40316 221 -21932 18117 -4070 -5744 37797 49040 47810
9763D7810n4925k5291m3473K2335L5297M4379P36m6748j4719M2615J2956n7518
$$ 47810 -7115 -32406 -75879 -53544 -18247 26132 26868 -19880 -34599 8016 20972 -36546
9751c6546l6054O5467K8944K1680J3757O9441O1975n9516k3257m1789k2582J2395
$$ -36546 -72600 -7133 21811 43491 57248 126689 188664 129148 105891 64102 41520 53915
9739E3915p6930m4209J0604K412M6509N1586J053l7870K9611P8427J8197m9960
$$ 53915 -23015 -67224 -56620 -54208 -7699 43887 44940 7070 36681 115108 133305 83345
9727H3345m1986q4605J6648l333J7142O4250P4820q0363n3606M419m6203k1007
$$ 83345 41359 -43246 -26598 -29931 -12789 51461 126281 45918 -7688 -3269 -49472 -70479
9715g0479M7373M7228n8299m0375j3310K9814N3422j6732l6723J7183k1992n674
$$ -70479 -23106 24122 -34177 -74552 -87862 -58048 -4626 -21358 -58081 -40898 -62890 -68564
9703f8564L5593k953L1975m465P035K7105J2180n0142m053L8299n442p2345j8440
$$ -68564 -32971 -35924 -3949 -8414 -1379 25726 37906 -12236 -16289 22010 16568 -55777 -74217
9690g4217L4544M2539M8477R403o2165L5114l3189k3818R657J681p5136l4309
$$ -74217 -39673 2866 51343 60746 -1419 33695 506 -23312 -13655 -11974 -87110 -121419
9678a21419L4917Q53k0476L1582K0690K967L0394M8535P474j2770k3053O282P77
$$ -121419 -86502 -85649 -106125 -74543 -53853 -50886 -20492 28043 35517 22747 -306 5976 6753
9665F753p7144l084K3381k769k879L1837R489n1748j2749J1645K883j0349L982
$$ 6753 -70391 -73475 -50094 -52863 -55742 -23905 -14416 -66164 -78913 -67268 -64385 -74734 -70752
9652g0752N3547N0765j972p111l5266j4516p532J3342N789M4257m044L9734L9908
$$ -70752 -17205 33560 31588 24477 -10789 -25305 -32837 -19495 -13706 30551 26507 66241 106149
9639A06149m2723n356O0949J2762k4244l1109o145M6804p3274q9584J1584L4103
$$ 106149 63426 58070 119019 131781 107537 76428 70283 117087 43813 -45771 -34187 -84
9627h4j2761l7807J523M170j253j4203O1653k1756r5707m4110Q0651J51235L2534
$$ -84 -12845 -50652 -49129 -44959 -46212 -60415 1238 -20518 -116225 -160335 -79684 71551 104085
9614A04085k2487j9280l6677L6181k5o0667o5767L7420K1750j641p4280r7636
$$ 104085 81598 62318 25641 61822 61797 1130 -64637 -27217 -5467 -7108 -81388 -179024
9602a79024M6174J7988K5196k3108r138R9566L7508N168k3445O1855k2088L0531
$$ -179024 -132850 -114862 -89666 -112774 -121912 -22346 15162 20330 -3115 58740 36652 67183
9590F7183j9491r2455l7793N9489l1443n2529m318Q2947J3445k3421l1862L789
$$ 67183 47692 -44763 -82556 -23067 -54510 -107039 -111357 -28410 -14965 -38386 -70248 -66459
9578f6459K6350l419j6708L826l4471R750K7115k1758J5387L4241L7874L0022
$$ -66459 -40109 -43528 -60236 -56410 -90881 -81131 -54016 -75774 -60387 -26146 11728 41750
9566D1750k329R399J0385j20583j4934K4514j457m9745l1048P9732O4621q327
$$ 41750 39421 48820 59205 -61378 -76312 -51798 -53255 -103000 -134048 -54316 10305 1978
9554A978j0238k1244L6105l8264k9451m7553L1473m0065l202n5603k5148M4682
$$ 1978 -8260 -29504 6601 -31663 -61114 -108667 -77194 -117259 -120461 -176064 -201212 -156530
9542a56530N4812J3133O6566L4690n8966K004L133l0637K6678J9895M8094L8216
$$ -156530 -101718 -88585 -22019 12671 -46295 -44291 -41158 -71795 -45117 -25222 22872 61088
9530F1088n121k2513L1071l2017j9531L6155k8358N971J4460k0268l144k0329
$$ 61088 55967 33454 64525 32508 12977 49132 20774 26745 41205 20937 17793 -2536
9518b536l8828M166L4894K9419K4237n185j3983n0689n5526J7334j0388j1088
$$ -2536 -41364 -37198 -2304 27115 51352 46167 32184 -18505 -74031 -56697 -67085 -78173
9506g8173N9736J06298j3106l5720o8690o717Q0401k727l4163q435l8307p1N4491
$$ -78173 -18437 87861 74755 39035 -29655 -36372 44029 41302 7139 -1296 -39603 -39674 14817
9493A4817M6485k6774n1580K9896L7779L864J8217j2981K5761j0085j04273N2215
$$ 14817 61302 34528 -17052 12844 50623 54487 72704 59723 85484 75399 -28874 23341
9481B3341M3664K2836n6870n3680R067M2537m5473k3699P419K0034K783l5823
$$ 23341 67005 89841 32971 -20709 -11642 30895 -14578 -38277 -30858 -10824 -8041 -43864
9469d3864k2602K6568k6397j7884N2906L8715k6141m4048k7322M0715M1034L2469
$$ -43864 -66466 -39898 -66295 -84179 -31273 7442 -18699 -62747 -90069 -49354 -8320 24149
9457B4149N7476n4765Q770Q36n410N5101m2619p6685m5993L6340K7739j7275m612
$$ 24149 81625 26860 35630 36466 31056 86157 43538 -33147 -79140 -42800 -15061 -32336 -36948
9444c6948K684p403j00235k1392J22255J12264n509O079M052k9506m7633j6777
$$ -36948 -34264 -41667 -141902 -163294 -41039 71225 65716 71795 75847 46341 -1292 -18069
9432a8069p9008M0144Q9973Q389l6867j1925L2732k4376J3652N6966K108l655
$$ -18069 -97077 -56933 33040 41429 4562 -7363 25369 993 14645 71611 73719 70064
9420G0064r1053q9652M880R9764L2792M7018k7755p0678M7973o544r7234j081
$$ 70064 -20989 -110641 -105761 -5997 26795 73813 46058 -24620 23353 16809 -80425 -81506
9408h1506P0963R0769m7724l94L7350o9497o840O3825N5313l5090j5839K7586
$$ -81506 -10543 80226 32502 32108 69458 -39 -6879 56946 112259 77169 61330 88916
9396H8916j4041k6815k2971L6325k388j3700L851L6018l0820q5276K9442K9912
$$ 88916 74875 48060 25089 61414 59026 45326 49177 85195 54375 -30901 -1459 28453
9384B8453l8699o0604L4333J9701J4816M6352o8683j0923M077m6423m2338K4208
$$ 28453 -10246 -70850 -36517 -16816 -2000 44352 -24331 -35254 -31177 -77600 -119938 -95730
9372i5730O1606k4150j9373N3112n837K1210j8320l1738k2959J2150k4024R269
$$ -95730 -34124 -58274 -77647 -24535 -30372 -9162 -27482 -59220 -82179 -70029 -94053 -84784
9360h4784M2303m6901J4247L0348L0133O2473L3330K3516p0919l9138k9979l4635
$$ -84784 -42481 -89382 -75135 -44787 -14654 47819 81149 104665 33746 -5392 -35371 -70006
9348g0006N1523L0335l6026k434P4159p631q0589J0315M1990m1039l8702j2996
$$ -70006 -18483 11852 -24174 -26608 47551 39920 -40669 -30354 11636 -29403 -68105 -81101
9336h1101j5250k278J8496M1673J0245n4129l4636l4515p194M5759L3252L1919
$$ -81101 -96351 -98629 -80133 -38460 -28215 -82344 -116980 -151495 -158689 -112930 -79678 -47759
9324d7759M1929R728m8303L0302j3201m9104j2994k0488l4798k9175K959p129
$$ -47759 -5830 3898 -44405 -14103 -27304 -76408 -89402 -109890 -144688 -173863 -170904 -178033
9312a78033R9768R2046J5317l564l4069m5629m6868K830P1822K8569l2391p0802
$$ -178033 -78265 13781 29098 25534 -8535 -54164 -101032 -98202 -26380 2189 -30202 -101004
9300a01004l682J07004L5128l2928j8183o6693L0461n646P907L0474P554l683
$$ -101004 -104686 2318 37446 4518 -13665 -80358 -49897 -55543 -47636 -17162 -9608 -13291
9288a3291J9902K2483J9162K3128J3619l7702m9459L6083r438j5701N0213k246
$$ -13291 6611 29094 48256 71384 85003 47301 -2158 33925 24487 8786 58999 56753
9276E6753k6515m3891M1165l9937q1658k0718L7567L2497N8602K2283o36L2219
$$ 56753 30238 -13653 27512 -12425 -94083 -114801 -77234 -44737 13865 36148 35512 67731
9264F7731j7225l4391l7078L3320o880M014K8363L9310j230j9380l3269j0676
$$ 67731 50506 16115 -20963 12357 5477 9491 37854 77164 75934 56554 23285 12609
9252A2609K9317O5475m2735l6224P315J7646l9456J3123J239l8272j1829k0642
$$ 12609 41926 107401 64666 28442 35757 53403 13947 27070 28309 -9963 -21792 -42434
9240d2434L0137M6259o4825J7586J7273m1913m0070J6383l2507l1902N4829N5037
$$ -42434 -12297 33962 -30863 -13277 3996 -37917 -77987 -61604 -94111 -126013 -71184 -16147
9228a6147L8616k3870p6649m154N8934j2142l3792R3750M0014o6299l357O616
$$ -16147 22469 -1401 -78050 -82204 -23270 -35412 -69204 24546 64560 -1739 -5096 1520
9216A520K1782L3712K6337o6929q3771m6231N6048R875l5537K8132P9059l8422
$$ 1520 23302 57014 83351 16422 -67349 -113580 -57532 -47657 -83194 -55062 23997 -14425
9204a4425j8042M1531L3312j8376k0391l0040L0055r69k5951O418P990J6138l4407
$$ -14425 -32467 9064 42376 24000 3609 -26431 3624 2655 -23296 -16878 -8888 7250 -27157
9191b7157k5278K8254K0163K3614M526j523k6584o9345K3676J1112j7604M556
$$ -27157 -52435 -24181 -4018 19596 24122 22599 -3985 -73330 -49654 -38542 -56146 -51590
9179e1590K7548L1150j9483r2152m2861r702O4449L7692J582K3833L005q4426
$$ -51590 -24042 7108 -12375 -104527 -147388 -157090 -92641 -54949 -53367 -29534 -26529 -110955
9167a10955o2346K6108Q0772K6683o2999o1660N7098O5661k4224J5262Q568j7903
$$ -110955 -173301 -147193 -66421 -39738 -102737 -164397 -107299 -41638 -65862 -50600 -42032 -59935
9155e9935j4866L9556L2548l495l6091k7635L3637O4913j917l7466K298K9282
$$ -59935 -74801 -35245 -2697 -6192 -42283 -69918 -36281 28632 26715 -10751 -8453 20829
9143B0829p161l0370K5880q116L089j247J8658p172j2673m2829L5703P3643M4862
$$ 20829 13668 -16702 9178 1062 4151 2904 21562 14390 1717 -41112 -5409 68234 113096
9130A13096j7689n4820J7150M2114k5901l282N796l2229j1185p698p1639m65R843
$$ 113096 95407 40587 57737 99851 73950 70668 76464 44235 33050 25352 -46287 -46752 -36909
9117c6909k2017j2520P8156M7668k8491m9271J1842P3618p827p3139l2302J0451
$$ -36909 -58926 -71446 6710 54378 25887 -23384 -11542 62076 54249 -18890 -51192 -40741
9105d0741L3837N4668n900j650k7844j1656k5450J4021O6898j1157L4834l1104
$$ -40741 -6904 47764 41864 40214 12370 714 -24736 -10715 56183 45026 79860 48756
9093D8756m9885j0591L5695N6803K8805k5437O535n825K622K958J8079l0280o9172
$$ 48756 -1129 -11720 23975 80778 109583 84146 90681 84856 87478 90436 108515 78235 9063
9080I063r8246p0945N7706J04557L5292m4058L5727L4907J5413p817j9267k0789
$$ 9063 -89183 -160128 -102422 2135 37427 -6631 29096 64003 79416 71599 52332 31543
9068C1543k3815k1527l7766o1900j0997J8085N5340N2035P575J1787m0053j6970
$$ 31543 7728 -13799 -51565 -113465 -124462 -106377 -51037 998 8573 20360 -19693 -36663
9056c6663L278L8742K605N081J7549m1779k5039M4029K0209l2373k081N0148L9065
$$ -36663 -33385 5357 7962 13043 30592 -11187 -36226 7803 28012 -4361 -6442 43706 82771
9043H2771L814n2739l1379p339L1676L1550J5481m779m034l103n5375q456k568
$$ 82771 86585 33846 2467 -4872 26804 58354 73835 69056 65022 61919 6544 -1912 -4480
9030d480j0425RJ277j7815p1172n8715L3546J6700j9807j8665M4991N5136J9317
$$ -4480 -14905 -14896 -13619 -31434 -102606 -161321 -127775 -111075 -130882 -149547 -104556 -49420 -30103
9017c0103Q8614P1625j3219j7365q847M188n9718p8749m9236l3503L6294O4024
$$ -30103 58511 130136 116917 99552 90705 94893 35175 -43574 -92810 -126313 -90019 -25995
9005b5995j8017J5223P1656L0488j24787o6846L7301L3226J9781R128l2856j3463
$$ -25995 -44012 -28789 42867 73355 -51432 -118278 -80977 -47751 -27970 -18842 -51698 -65161
8993f5161O2593j3871O5837J3614k3108l3185j06886l5175r122l5262P1745O1710
$$ -65161 -2568 -16439 49398 63012 39904 6719 -100167 -135342 -144464 -179726 -107981 -46271
8981d6271N760K0742M3611J5153m235j4070l05j4785l4712m2754M5583M910L8558
$$ -46271 -40511 -19769 23842 38995 34760 20690 20385 5600 -29112 -71866 -26283 -21373 17185
8968A7185N915O070l0868q703L7674j4450k4594o296M0298j8339n4771N6822L7321
$$ 17185 23100 29170 -1698 -10401 27273 12823 -11771 -18067 22231 3892 -50879 5943 43264
8955D3264l8631k2216k3820o8655j7398O4805m3418N8489Q3857K7243n3389l9809
$$ 43264 4633 -17583 -41403 -110058 -127456 -62651 -106069 -47580 36277 63520 10131 -29678
8943b9678o9894L2459q761K0125P0296m6389K579q38J4290L9210M004q1526Q856
$$ -29678 -99572 -67113 -75874 -55749 14547 -31842 -29263 -30101 -15811 23399 27403 -54123 -45267
8930d5267M7843l4998k1076j8527O0410K6100n4574m2905J2077Q967R1025M9407
$$ -45267 2576 -32422 -53498 -72025 -11615 14485 -40089 -82994 -70917 -61950 29075 78482
8918G8482p566l2600k7258q441l4043m9499R946K5229L310M8030M2857o2793n3518
$$ 78482 70916 38316 11058 2617 -31426 -80925 -70979 -45750 -42440 5590 48447 -14346 -67864
8905f7864J2527L1775l9480k0956J0472L9384K3761k0119L1382j0137L385K8930
$$ -67864 -55337 -23562 -63042 -83998 -73526 -34142 -10381 -30500 882 -9255 -5870 23060
8893B3060j6231J9932j7648n8106j4500o058L5734M3009J6572O9935l3784p519
$$ 23060 6829 26761 9113 -48993 -63493 -69551 -33817 9192 25764 95699 61915 54396
8881E4396m9312o3495k802l8918J627P053K830N1857J03272k4293n5653p320M8116
$$ 54396 5084 -58411 -61213 -100131 -98504 -91451 -88621 -36764 66508 42215 -13438 -20758 27358
8868B7358N908q6618L5215m552n1271K8110N8121o201j3709n6092k5296K5188
$$ 27358 33266 -53352 -18137 -22689 -73960 -45850 12271 6070 -7639 -63731 -89027 -63839
8856f3839O9072K3319j8976p437J968j9763m2174k1082N3871M4240J4314l4121
$$ -63839 5233 28552 9576 2139 4107 -15656 -57830 -78912 -25041 19199 33513 -608
8844f08K6687k1055q772L961l641J02271L3149m8407m1919m3167l0232L3038k3850
$$ -608 26079 5024 -3748 213 -3428 98843 131992 83585 41666 -1501 -31733 1305 -22545
8831b2545j9264L1496Q15o0989K933R555m8549o395P6621R1027j6740n9359m5923
$$ -22545 -41809 -10313 -9498 -70487 -67554 -57999 -106548 -112943 -36322 54705 37965 -21394 -67317
8818f7317p653J4636M3881k827r961L381M7026j3699k5524l1645m1544J3921K6362
$$ -67317 -74970 -60334 -16453 -19280 -29241 -25860 21166 7467 -18057 -49702 -91246 -77325 -50963
8805e0963M5857L2783K265J4241n7169l8011n6045o655q072Q968J4649M0935O0710
$$ -50963 -5106 27677 29942 44183 -12986 -50997 -107042 -113697 -121769 -112801 -98152 -57217 3493
8792C493J1433n2008j096K6526r1798k8924J5698K3079q087Q5154j2081j2204
$$ 3493 14926 -37082 -38178 -11652 -103450 -132374 -116676 -93597 -101684 -16530 -28611 -40815
8780d0815m5957k3224N1754K5735j3649K6175O8850J02917l1575l6335o9069p6874
$$ -40815 -86772 -109996 -58242 -32507 -46156 -19981 48869 151786 120211 83876 14807 -62067
8768f2067k076R9912N1967j8557JO0759j638l6902q2092p7230j9767L4484M5297
$$ -62067 -64143 35769 87736 69179 69180 129939 128301 91399 9307 -67923 -87690 -53206 -7909
8755g909J8982r675l6893P2497O6215J2829m4197m6196J5460n936k6076l7619
$$ -7909 11073 1398 -35495 37002 103217 116046 71849 25653 41113 35177 9101 -28518
8743b8518O6591O4604j5495l3572j6915k2987j6337K616k6793m2943M7853k8203
$$ -28518 38073 102677 87182 53610 36695 13708 -2629 -13 -26806 -69749 -21896 -50099
8731e0099k9137L4633N0015l0284K9455O8527J29p0446q1668l0186J9269J4547
$$ -50099 -79236 -44603 5412 -24872 4583 73110 73239 2793 -78875 -109061 -89792 -75245
8719g5245J4052M264j7272N5349K9861j9127m2276j8696k4394l1157N8779M6407
$$ -75245 -61193 -56929 -74201 -18852 11009 -8118 -50394 -69090 -93484 -124641 -65862 -19455
8707a9455J0132o803l7323p74N456m4241N468r664L1360j7747l0271K2046P0688
$$ -19455 -9323 -16126 -53449 -54223 -48767 -93008 -87540 -97204 -65844 -83591 -113862 -91816 -21128
8694b1128R3677L6578n3530J2557m394K4884m0726J175R7554K5655j8568o1991
$$ -21128 72549 109127 55597 68154 63760 88644 47918 49093 146647 172302 153734 91743
8682I1743j16159j9747L9458K9976P289p1075k2498L7302J1338K7414P6968l5370
$$ 91743 -24416 -44163 -4705 25271 32560 -38515 -61013 -23711 -12373 15041 92009 56639
8670E6639n89m5376j7709R603K8626J8200K254l2351O759k4299k5809J1824j3425
$$ 56639 56050 10674 -7035 2568 31194 49394 51648 19297 26056 1757 -24052 -12228 -25653
8657b5653j6922O4532L4090K2214J5712p01l794n625m993M1726J5268j5654l627
$$ -25653 -42575 21957 56047 78261 93973 93272 89478 83853 78860 120586 135854 120200 116573
8644A16573L481J54l4796k4492q6675m9556K376O353K2787L2988l206p732j9712
$$ 116573 120054 120208 85412 60920 -25755 -75311 -72935 -66582 -43795 -10807 -14013 -21745 -41457
8631d1457J3435j8015k3776J3339K0850L0869K7156n377j9204M925l8290K8596
$$ -41457 -28022 -46037 -69813 -56474 -35624 -4755 22401 17024 -2180 2745 -35545 -6949
8619f949N4890n4932j4459P8036q664k5574M7799M4490k5517j4040n7727n3846
$$ -6949 47941 -6991 -21450 56586 47922 22348 70147 114637 89120 75080 17353 -36493
8607c6493P2591N1687J7934M3563K2474J2817q8451p2401p419K0441J8312r136
$$ -36493 36098 87785 105719 149282 171756 184573 96122 23721 16302 36743 55055 45919
8595D5919M890j7359N382J1424N0012k6941p8761M8748Q583l574L8444N79p9449
$$ 45919 50809 33450 38832 50256 100268 73327 -5434 43314 51897 48323 86767 87346 7897
8582G897l3554K5773J6785M685P315k120j1359j3839N744l8430k4314Q681J2273
$$ 7897 -25657 116 16901 21586 28901 26781 15422 1583 7327 -31103 -55417 -46736 -34463
8569c4463k1568j6422L4579P2953M6439O191L2137m1087l8639q090k2597k8571
$$ -34463 -56031 -72453 -37874 35079 81518 87709 119846 78759 40120 32030 9433 -19138
8557a9138M0429L9376j6229L5901l1859O008K4501K7645l5553m5393m4488J304
$$ -19138 21291 60667 44438 80339 48480 54488 78989 106634 71081 25688 -18800 -17496
8545a7496J7391l8924l146j4774O6721K3989P091j9243j1116L3246P9792k0385
$$ -17496 -105 -39029 -42175 -56949 9772 33761 40852 21609 10493 43739 123531 103146
8533A03146m7703l160o1479l8615p194q619j2711K6696O176l863K122j2358k1775
$$ 103146 55443 52283 -9196 -47811 -55005 -63624 -76335 -49639 -43463 -47326 -45204 -57562 -79337
8520g9337M5795J2569K3609M9874L5270N0648q904m0466r9897j896J8409l3898
$$ -79337 -33542 -20973 2636 52510 87780 138428 129524 89058 -10839 -12735 5674 -28224
8508b8224L3991O0920M3113j9486k7958K9295j5858n0024k0404k0210J0405N8298
$$ -28224 5767 66687 109800 90314 62356 91651 75793 25769 5365 -14845 -4440 53858
8496E3858L3837j07111q1465N5106J4061l1348r582k3824K9121j909J5057p818
$$ 53858 87695 -19416 -100881 -45775 -31714 -63062 -72644 -96468 -67347 -69256 -54199 -62017
8484f2017m9876J2251L8284M6667n624l1923J3015K652j3227P133K8127J1848
$$ -62017 -111893 -99642 -61358 -14691 -20315 -52238 -39223 -36571 -49798 -42665 -14538 -2690
8472b690L2221k3564k0421l6665j9950K0061N8929N1361m6492m8668o361L6903
$$ -2690 29531 5967 -14454 -51119 -71069 -51008 7921 59282 12790 -35878 -42239 -5336
8460e336N791j7422Q1390J7779j2102O362j674q2003k2577M1016J1889J5388J5631
$$ -5336 455 -16967 64423 82202 70100 76462 74788 -7215 -29792 11224 23113 38501 54132
8447E4132p7924n7747Q3840k0658k8430N3909M1368j6461P459K5012K1236m1634
$$ 54132 -23792 -81539 2301 -18357 -46787 7122 48490 32029 39488 64500 85736 44102
8435D4102P0852M7758K411P952l8302j7731n1396m1280l784j1062K4774L4983
$$ 44102 114954 162712 165123 173075 134773 117042 65646 24366 20582 9520 34294 69277
8423F9277N9641L6807l2481m3230o5845j06684j1985O3222R4397P4975l2786o7351
$$ 69277 128918 165725 133244 90014 24169 -82515 -94500 -31278 63119 138094 105308 37957
8411C7957j1227M0241K1332k3677q2324l6041k2972L4969K1730k8329k6791k9975
$$ 37957 26730 66971 88303 64626 -17698 -53739 -76711 -41742 -20012 -48341 -75132 -105107
8399a05107J5787Q3684L0645j5661L1278l1662j6775o328j6531k4763M0920L1215
$$ -105107 -89320 -5636 25009 9348 40626 8964 -7811 -14139 -30670 -55433 -14513 16702
8387A6702p453l9492M0924J17333j4986n4821k0572r242P809k4283o2179J4197
$$ 16702 9249 -30243 10681 128014 113028 58207 37635 28393 36202 11919 -50260 -36063
8375c6063P7776Q9986j9234j34214o6269N4645N5507N7812k7295j6847L335j6125
$$ -36063 41713 131699 112465 -21749 -88018 -33373 22134 79946 52651 35804 39139 23014
8363B3014J3798J5042j2556o3305n4708R79k6747r541N5279O2349J2751r348O298
$$ 23014 36812 51854 39298 -24007 -78715 -77736 -104483 -114024 -58745 3604 16355 7007 13305
8350A3305M9959J9378l3938j2711j8836r3786J1789M8311m8562k3244l3687k1008
$$ 13305 63264 82642 48704 35993 17157 -76629 -64840 -16529 -65091 -88335 -122022 -143030
8338a43030L1222J4068J112n5641M335J22808K2831p487k5589K45j5129J5421
$$ -143030 -111808 -97740 -96628 -152269 -147934 -25126 -2295 -9782 -35371 -35126 -50255 -34834
8326c4834K0000j0417l7706l8065O753q677o80j367j0547j888P798l1423m427
$$ -34834 -14834 -25251 -62957 -101022 -94269 -102946 -103626 -104993 -115540 -117428 -109630 -141053 -145480
8313a45480P144O4106P9980j3285n2126J2020K3215j1815P634M0257K1236N6961
$$ -145480 -138336 -74230 5750 -7535 -59661 -47641 -24426 -36241 -28607 11650 32886 89847
8301H9847Q592L8939l0955j11232m5549k2965q796J3927K9029j9180N6296L9278
$$ 89847 98439 137378 106423 -4809 -50358 -73323 -82119 -68192 -39163 -58343 -2047 37231
8289C7231J6815K245l0956l2894l4532l6405k1058l8150K7910O2331N1072k1309
$$ 37231 54046 56291 25335 -7559 -42091 -78496 -99554 -137704 -109794 -47463 3609 -17700
8277a7700k8445L4348N643L2202N6895M189k9436O916k2199j1518l9535n7837
$$ -17700 -46145 -11797 -6154 26048 82943 87132 57696 64612 42413 30895 -8640 -66477
8265f6477M4029L8514l945M5170L2449q3419P266L8073j6574m4309M9908M5731
$$ -66477 -22448 16066 12121 57291 89740 6321 13587 51660 35086 -9223 40685 86416
8253H6416K98p4010q0803L5094K8907r737k4576J6283j5991j7943K7726L0168
$$ 86416 86714 12704 -68099 -33005 -4098 -13835 -38411 -22128 -38119 -56062 -28336 1832
8241A832m3953o0300n4810k8690R4003J6755L2392K0467J9671N759k7501K5770
$$ 1832 -42121 -102421 -157231 -185921 -91918 -75163 -42771 -22304 -2633 3126 -24375 1395
8229A395O351R56N2617p421l8106J293P1125m0031o831K9218q1935j6666P692
$$ 1395 7746 8702 61319 53898 15792 17085 88210 48179 41348 70566 -11369 -28035 -20343
8216b0343n6081L3263M264N268K1544N0288N557l9043j8366P0407O6326l5420
$$ -20343 -76424 -43161 -38897 -33629 -12085 38203 43760 4717 -13649 56758 123084 87664
8204H7664m2486m8694P403J1755o681k5989o8805L8393K8427N7206l5067k1959
$$ 87664 45178 -3516 3887 15642 8961 -17028 -85833 -47440 -19013 38193 3126 -18833
8192a8833j2005R561K2192q435o198l4423j3415k2857R946N0662L143k5786Q533
$$ -18833 -30838 -21277 915 -7520 -13718 -48141 -61556 -84413 -74467 -23805 -20662 -46448 -37915
8179c7915J4987J9212m246q3857K6843M8437o956j6893k8193n175M082M3307M6762
$$ -37915 -22928 -3716 -7962 -91819 -64976 -16539 -23495 -40388 -68581 -73756 -69674 -26367 20395
8166B0395L5590J4864O676k1503M857R504l586o513r6557n1400l609m384j0767
$$ 20395 55985 70849 77525 56022 60879 70383 66797 60284 -36273 -87673 -91282 -95666 -106433
8153a06433L4893J9692j1992N462M2993K5509k0149L8275m9720q9947j8290L402
$$ -106433 -71540 -51848 -63840 -58378 -15385 10124 -10025 28250 -21470 -111417 -129707 -126305
8141a26305J08091k0778j9874L2194k4670J625l531j286M161J1954n1699o9508
$$ -126305 -18214 -38992 -58866 -26672 -51342 -49717 -53248 -54534 -50373 -38419 -90118 -159626
8129a59626k2257O6920N2593L2069l8611p356N1159O6579J8849l8131N7901N621
$$ -159626 -181883 -114963 -62370 -30301 -68912 -76268 -25109 41470 60319 22188 80089 85710
8117H5710k4684K314J1742j956j00010p4169J9043k6219p722J08254L0515M653
$$ 85710 61026 63340 75082 73126 -26884 -101053 -82010 -108229 -115951 -7697 22818 27471
8105B7471q963j0461K4964m9086k6175K052m5572j0278N8595R790K1166o507q596
$$ 27471 18508 8047 33011 -16075 -42250 -40198 -85770 -96048 -37453 -27663 -6497 -13004 -21600
8092b1600j3203J4281l6743k7581J8355L5334l42J1769N1164l7981o9766N8820
$$ -21600 -34803 -20522 -57265 -84846 -66491 -31157 -31499 -19730 31434 -6547 -76313 -17493
8080a7493J2949k440J3511L0467M8160J6083m9470o0273n0043n87J7108l6575
$$ -17493 -4544 -6984 6527 36994 85154 101237 51767 -8506 -58549 -59136 -42028 -78603
8068g8603j268k141M7155p114M868r458l3848L7487J9693j4901K3482L33O678
$$ -78603 -79871 -82012 -34857 -41971 -37103 -46561 -80409 -42922 -23229 -38130 -14648 -14315 -7637
8055g637l9470j1034M9642N0920K2773M1499O6042r7001r2880K8776L8124j4318
$$ -7637 -47107 -58141 -8499 42421 65194 106693 172735 75734 -17146 11630 49754 35436
8043C5436j205m218m4095R276O8334j2124m5177J8860J7409j6791J078L2851J5654
$$ 35436 34231 30013 -14082 -4806 63528 51404 6227 25087 42496 25705 26783 59634 75288
8030G5288K4010l0667q574L4050m0777K7064k4485j8268l7825K0919O5788J2526
$$ 75288 99298 68631 60057 94107 53330 80394 55909 37641 -184 20735 86523 99049
8018I9049m4042m4932k3101N9449O9653L8052o3771r7216j6571k7695k2940N816
$$ 99049 55007 10075 -13026 46423 116076 154128 90357 -6859 -23430 -51125 -74065 -68249
8006f8249M7796L1570j6444J5987K7580J7546j189j5684l8958l2670M2687N4718
$$ -68249 -20453 11117 -5327 10660 38240 55786 54597 38913 -45 -32715 9972 64690
7994F4690r508J1429j4386k5893r4868j9359K2617j2248k6783J998l1459M7242
$$ 64690 55182 66611 52225 26332 -68536 -87895 -65278 -77526 -104309 -102311 -133770 -86528
7982h6528J03500j6352n3512k8882l7872m501M5827J4260O379n467N7532L4731
$$ -86528 16972 620 -52892 -81774 -119646 -124147 -78320 -64060 -57681 -63148 -5616 29115
7970B9115O2358M1848l5323M4063M303p6248l6631J6642J9236J0128J5207o8786
$$ 29115 91473 133321 97998 142061 146364 70116 33485 50127 69363 79491 94698 25912
7958B5912k8636p251J605L8459k6816R361K2175K0777K2581m6865K347L396K942
$$ 25912 -2724 -9975 -8370 30089 3273 12634 34809 55586 78167 31302 33649 37045 39987
7945C9987O657q0491l2502K7136P8221j9111p5151J9388P2824j331n0425P3329
$$ 39987 46644 -33847 -66349 -39213 39008 19897 -55254 -35866 36958 35627 -14798 58531
7933E8531L857P142k7136l3858j2546j9146K5120j6111L0627o4622m3040M7730
$$ 58531 62388 69530 42394 8536 -4010 -23156 1964 -14147 16480 -48142 -91182 -43452
7921d3452M3304J6977l6071K5030N0293j8611k1851k0510J2491k8419q618L0846
$$ -43452 -148 16829 -19242 5788 56081 37470 15619 -4891 7600 -20819 -29437 1409
7909A409J5880j3819J8594j0479m412j0185L0151L399J3763j9889L4651R3374
$$ 1409 17289 3470 22064 11585 7173 -3012 27139 30538 44301 24412 59063 152437
7897A52437m4802q9410j2265o7383R79k532K2067L5483O141N3359j8500n964r717
$$ 152437 107635 18225 5960 -61423 -60444 -62976 -40909 -5426 715 54074 35574 29610 19893
7884A9893K0176J1247J3710o212j8192N2026j8707l3370R121n16K3712n2913J9086
$$ 19893 40069 51316 65026 58814 40622 92648 73941 40571 49692 49176 72888 19975 39061
7871C9061O4323m6675L012j0423l4285m7093N860J6547l127M0082L8458R2174
$$ 39061 103384 56709 59721 49298 15013 -32080 -26220 -9673 -12800 27282 65740 157914
7859A57914m5549n7256L6658J8658l3370n8943j7670J1669l172k9232j0767J3769
$$ 157914 112365 55109 91767 110425 77055 18112 442 12111 8939 -20293 -31060 -17291
7847a7291o724j3914n359j0716r0993R563P3441M9733O6343j9652J1486j1732
$$ -17291 -24015 -37929 -43288 -54004 -144997 -135434 -61993 -12260 54083 34431 45917 34185
7835C4185o8489J0430K3768O6819l0031o4483l0904N3518K0663j1695j8618r397
$$ 34185 -34304 -23874 -106 66713 36682 -27801 -58705 -5187 15476 3781 -14837 -24234
7823b4234O025q357J4224M9999J6647k1488L0900K079n5263l1719j7618k1141
$$ -24234 -18209 -26566 -12342 37657 54304 32816 63716 65795 10532 -21187 -38805 -59946
7811e9946L3793N386J6742M6476K3603q409k7230O3922J1437j7342l5863m9067
$$ -59946 -26153 -20767 -4025 42451 66054 57645 30415 94337 105774 88432 52569 3502
7799C502M066m8835j8782r872j1821n5916K0323j6908L2595J3290K7216K1563
$$ 3502 7568 -41267 -60049 -69921 -81742 -137658 -117335 -134243 -101648 -88358 -61142 -39579
7787c9579O8796j7872j2568K9869L5152o3540l1451m1550J6855O3002k103K666
$$ -39579 29217 11345 -1223 28646 63798 258 -31193 -72743 -55888 7114 5011 7677
7775G677J5768N0298k9551m8275l5259r111q432o521P864m4287M7887N6737k9257
$$ 7677 23445 73743 44192 -4083 -39342 -48453 -56885 -63406 -55542 -99829 -51942 4795 -24462
7762b4462q3403j1052M1332M7651k0765L6621O7226M8105m3977n3626j3736K2674
$$ -24462 -107865 -118917 -77585 -29934 -50699 -14078 53148 101253 57276 3650 -10086 12588
7750A2588P515l901l2527q014K3607O6065J6104o2104m3759L3055q0096n1354
$$ 12588 20103 16202 -16325 -24339 -732 65333 81437 19333 -24426 8629 -71467 -122821
7738a22821P0043O0503K0661m220l5645n801J6967k5131k9570J6239p325l8179
$$ -122821 -52778 7725 28386 24166 -11479 -17280 -313 -25444 -55014 -38775 -46100 -84279
7726h4279J0511M5110J734o369M9482M2265R252j0813K0716M9884Q8711l9212
$$ -84279 -73768 -28658 -26924 -33293 16189 58454 67706 56893 77609 127493 216204 176992
7714A76992k7155k9222m3207m4703N686l8109J5033O274o3018l1384N2833N9907
$$ 176992 149837 120615 77408 32705 38391 282 15315 21589 -41429 -72813 -19980 39927
7702C9927L4270J2269L7854l7505n5118J7416k1818m4160n1552j3086J6553O0566
$$ 39927 74197 86466 124320 86815 31697 49113 27295 -16865 -68417 -81503 -64950 -4384
7690d384M8629k908L230k4870l1711O1126J3094K891Q028o9387l8566n4839o9321
$$ -4384 44245 41337 44567 19697 -12014 49112 62206 65097 73125 3738 -34828 -89667 -158988
7677a58988M6241M8570P6510M9261k4580k0869n5337L4557o578j4226N6338o003
$$ -158988 -112747 -64177 12333 61594 37014 16145 -39192 -4635 -11213 -25439 30899 24896
7665B4896J4251l5791j2049k3977N6935L0371J9948K6571l9560j5311m1816m7019
$$ 24896 39147 3356 -8693 -32670 24265 54636 74584 101155 61595 46284 4468 -42551
7653d2551n5602k6340K6225L4808P5454K1924m646K4980K1180k8979m8427m2516
$$ -42551 -98153 -124493 -98268 -63460 11994 33918 29272 54252 75432 46453 -1974 -44490
7641d4490K6829K8925l1413J366r749M806J3014J6020J7337j6432p05K6795P8053
$$ -44490 -17661 11264 -20149 -18783 -28532 -23726 -10712 5308 22645 6213 5508 32303 110356
7628A10356l0146o3067k6883k5289m6006k7456K0875M4438j785J9255J318l1489
$$ 110356 80210 17143 -9740 -35029 -81035 -108491 -87616 -43178 -44963 -25708 -24390 -55879
7616e5879K9439M9055L0480j1684M8181m904j6710p6880o3397K8174L1328L0305
$$ -55879 -26440 22615 53095 41411 89592 84688 67978 -8902 -72299 -44125 -12797 17508
7604A7508M3651l3735o0459j1397M2318q35m779J02322J0281p5848r0324j4519
$$ 17508 61159 27424 -33035 -44432 -2114 -2949 -7728 94594 104875 29027 -61297 -75816
7592g5816j2498o9747L5577K3998L5190L8959n603j1023L6823J2854K1118n1795
$$ -75816 -88314 -158061 -122484 -98486 -63296 -24337 -29940 -40963 -4140 8714 29832 -21963
7580b1963l0029l3146l3393J0706K8184K9201l7542q297K3658j4248L367K3308
$$ -21963 -51992 -85138 -118531 -107825 -79641 -50440 -87982 -96279 -72621 -86869 -83502 -60194
7568f0194r820n4133k7147J193J7106L5642O9653O9334L6825j560o095j98o4605
$$ -60194 -70014 -124147 -151294 -150101 -132995 -97353 -27700 41634 78459 76899 70804 70606 6001
7555F001j5776l548K5415J0704j1381K7089k3947l3326l0333o493L652M8509K1027
$$ 6001 -9775 -13323 12092 22796 11415 38504 14557 -18769 -49102 -55595 -51943 -3434 17593
7542A7593j6637j4952k1486p11K5692k4978l1822o747K15o044J2365N9328j0783
$$ 17593 956 -13996 -35482 -36193 -10501 -35479 -67301 -74048 -73833 -79877 -67512 -8184 -18967
7529a8967q1185r9926Q515K2523M9311m91L7705L0295P0689J0632J9512M6095
$$ -18967 -100152 -200078 -191563 -169040 -119729 -120220 -82515 -52220 18469 29101 48613 94708
7517I4708p7035j5426j1487o9700K6423P1158K0206r159p7895o622M4578K3406
$$ 94708 17673 2247 -9240 -78940 -52517 18641 38847 29688 -48207 -54829 -10251 13155
7505A3155p1975K7458L5194m4774j1922n5159M4793O1300r707O161M0070Q429
$$ 13155 -58820 -31362 3832 -40942 -52864 -108023 -63230 -1930 -11637 -5476 34594 43023
7493D3023o701o0561q4002Q298O4515J8687J142l1859O7547Q1583k7229j7797
$$ 43023 36322 -24239 -108241 -99943 -35428 -16741 -15599 -47458 20089 101672 74443 56646
7481E6646j0325k3781n9346P335K3590r214K2033q244l7042N0839M2382m4002
$$ 56646 46321 22540 -36806 -29471 -5881 -15095 6938 -1306 -38348 12491 54873 10871
7469A0871L2500j1603J322K5671K8595k0840j1654P636l2233p0004k8838L2438
$$ 10871 43371 31768 33090 58761 87356 66516 54862 62498 30265 -39739 -68577 -36139
7457c6139O6841M6384K4154p3504J3133k6215m7749J1434R2452j4399k9449M8482
$$ -36139 30702 77086 101240 27736 40869 14654 -33095 -21661 70791 56392 26943 75425
7445G5425k5988p7081l6930j3589L0571J01515K0043n3739m4364p861K7447J6356
$$ 75425 49437 -27644 -64574 -78163 -47592 53923 73966 20227 -24137 -31998 -4551 11805
7433A1805L3813J0575r740m1409K476m436N484L8019l5571p191Q071n9188K0392
$$ 11805 45618 56193 46453 5044 7520 3084 8568 46587 11016 3825 11896 -47292 -26900
7420b6900J7679m1221P212J0416N1908m038l1042N1026P1374j4383o9726n539
$$ -26900 -9221 -50442 -43230 -32814 19094 15056 -15986 35040 106414 92031 22305 16766
7408A6766O1269L1250l3900k0648k2082j2722q9098L6630K8303m0745P0244J2306
$$ 16766 78035 109285 75385 54737 32655 19933 -69165 -32535 -4232 -44977 25267 37573
7396C7573J831j4663q3377L6970J0646m348n4808j4887M8286n89J6876o248L9627
$$ 37573 39404 24741 -58636 -21666 -11020 -15368 -70176 -85063 -36777 -37366 -20490 -26738 12889
7383A2889J5810o5151m508K9410P0404J4864j9311p1722n1490M7634j0081r091
$$ 12889 28699 -36452 -40960 -11550 58854 73718 54407 -17315 -68805 -21171 -31252 -40343
7371d0343q978M6921J7140l2463n0977J6896L1193K7209l3145K6410L9519l1799
$$ -40343 -49321 -2400 14740 -17723 -68700 -51804 -20611 6598 -26547 -137 39382 7583
7359G583m2289k0230M7043L8362l5569J9113K2928l5374l7853J0730L0830l7199
$$ 7583 -34706 -54936 -7893 30469 -5100 14013 36941 1567 -36286 -25556 5274 -31925
7347c1925K5613n7657n4492K4066O256L3145L4570M3907L6422O1280M5554p639
$$ -31925 -6312 -63969 -118461 -94395 -88139 -54994 -20424 23483 59905 121185 166739 159100
7335A59100j8666n975k9681o9618p7957o7054m9391M6620M8308N447O932M6190
$$ 159100 140434 134459 104778 35160 -42797 -109851 -159242 -112622 -64314 -58867 -51935 -5745
7323e745J9760k7281m4952J3758l597m2720Q870K0516K5212K8440M181K431K9911
$$ -5745 14015 -13266 -58218 -44460 -48057 -90777 -81907 -61391 -36179 -7739 -3558 -1127 28784
7310B8784m9173M205O2060j9053o0537K9264K3873l3465j0050M082l5225p852
$$ 28784 -20389 -16184 45876 26823 -33714 -4450 19423 -14042 -24092 -20010 -55235 -63087
7298f3087j019o851K3421N2048o517l682O4546j3631k7353J8970J5814j9050r3698
$$ -63087 -64106 -70957 -47536 4512 -2005 -5687 58859 45228 17875 36845 52659 33609 -60089
7285f0089n121J6874K4086K9460K1689m2142j39k7940J0455l9225J8927M4392
$$ -60089 -65210 -48336 -24250 5210 26899 -15243 -15382 -43322 -32867 -72092 -53165 -8773
7273h773l2583k6373M0473j1845k0120l5040M2955J9659N5147M6059L1487q603
$$ -8773 -41356 -67729 -27256 -39101 -59221 -94261 -51306 -31647 23500 69559 101046 92443
7261I2443n3084L9954J6119l1693j9275K0187K9256O000j1452J7625p8818j2486
$$ 92443 39359 79313 95432 63739 44464 64651 93907 99907 88455 106080 27262 14776
7249A4776p6497k7859R377j9729K9031M7930M0388M9173k1321o405J0504o910
$$ 14776 -61721 -89580 -80203 -99932 -70901 -22971 17417 66590 45269 38864 49368 42458
7237D2458j6976K0204p5143m9841K5675K0696o4233n1422M0944L5272J5117r852
$$ 42458 25482 45686 -29457 -79298 -53623 -32927 -97160 -148582 -107638 -72366 -57249 -67101
7225f7101q641k6017L3286K6586k450k8479N2299N5449n243Q279M0833N645k5602
$$ -67101 -75742 -101759 -68473 -41887 -44337 -72816 -20517 34932 29689 37968 78801 84446 58844
7212E8844R301j5896K2544Q3156n788o2905l8851o9033o6415N7963L5906k7561
$$ 58844 68145 52249 74793 157949 152161 89256 50405 -18628 -85043 -27080 8826 -18735
7200a8735P429n0389J3842O4252j6179j8653l793N089Q01p62K698O20n58K323
$$ -18735 -11306 -61695 -47853 16399 220 -18433 -22226 -17137 -16336 -17098 -14400 -13780 -14338 -12015
7186a2015j4510M3870m2694l7623O1612J3178K5442m319O2588k7259k0335J5719
$$ -12015 -26525 17345 -25349 -62972 -1360 11818 37260 32941 95529 68270 47935 63654
7174F3654m7055m0490M3489K4496l3303m4361k6123M922N6533j7544M0766J9617
$$ 63654 16599 -23891 19598 44094 10791 -33570 -59693 -54771 1762 -15782 24984 44601
7162D4601j0465r049l3296P707L5475M586K4452L9096l6191o1940K1800j7599
$$ 44601 34136 25087 -8209 -502 34973 39559 64011 103107 66916 4976 26776 9177
7150I177m2021K2547j0881J7940N0929L0956n1174l884Q086Q627M263m2816n9169
$$ 9177 -32844 -10297 -21178 -3238 47691 78647 27473 23589 31675 40302 44565 1749 -57420
7137e7420M187K3704J0885M0805P853L6459J4265q2482k0954P0891k3043N4114
$$ -57420 -53233 -29529 -18644 22161 30014 66473 80738 -1744 -22698 48193 25150 79264
7125G9264M9353j4904p8694O081M6259l2272n7040j449N7512J0706k3966j4627
$$ 79264 128617 113713 35019 41100 87359 55087 -1953 -3402 54110 64816 40850 26223
7113B6223n9053J7707J6179J6307l8481m2260k4600K1736L8002K3272J6314K342
$$ 26223 -32830 -15123 1056 17363 -21118 -63378 -87978 -66242 -28240 -4968 11346 13688
7101A3688O481J7858L2610j4521J3313O845m9838r5947J3019k6502L1431J1215
$$ 13688 20169 38027 70637 56116 69429 76274 26436 -69511 -56492 -82994 -51563 -40348
7089d0348K7223M2097j584m9137j5000J8193j1163k3887N2145J4667j9894J0800
$$ -40348 -13125 28972 27388 -21749 -36749 -18556 -29719 -53606 -1461 13206 -6688 4112
7077D112J9180R815n2481o5563J3749P4961l662J1382J5701r360J2423l0656J5861
$$ 4112 23292 33107 -19374 -84937 -71188 3773 111 11493 27194 17834 30257 -399 15462
7064A5462l228K1646L0136n7640k2806M4643O0742l289n0433o5848k611J0175
$$ 15462 12234 33880 64016 6376 -16430 28213 88955 85666 35233 -30615 -33226 -23051
7052b3051m5365O2995J05977k945p4407n2215L3165J11289r249r1884p7024l768
$$ -23051 -68416 -5421 100556 97611 23204 -29011 4154 115443 106194 14310 -62714 -66482
7040f6482L6514L1769L1510j0542m1780n4466J0087j984p6723q084Q4561L4533
$$ -66482 -29968 1801 33311 22769 -19011 -73477 -63390 -65374 -142097 -150181 -65620 -31087
7028c1087M1618j0940l4650K336N1979N0691k9669k8352l5936J3077K6210J5339
$$ -31087 10531 -409 -35059 -32723 19256 69947 40278 11926 -24010 -10933 15277 30616
7016C0616K1513o8016o4862r157J9938k3995M794N8482L6267q536k2891q888j9043
$$ 30616 52129 -15887 -80749 -89906 -69968 -93963 -89169 -30687 5580 -2956 -25847 -34735 -53778
7003e3778N7924M7018J2033N262l4019n7833l078P7625N3810n1323l6174j2741
$$ -53778 4146 51164 63197 68459 34440 -23393 -26471 51154 104964 53641 17467 4726
6991D726M997J8481K8389o7602n5180M7681M9947J2258j0096k6208Q421O2837
$$ 4726 9723 28204 56593 -11009 -66189 -18508 31439 43697 33601 7393 15814 78651
6979G8651q375l3428K1857M2624j3904k4758l8853n4571p742l5801L5022L6126
$$ 78651 70276 36848 58705 101329 87425 62667 23814 -30757 -38499 -74300 -39278 -3152
6967c152L7057m7054l2637l2330k1429K7744j3266O1319O884j5756k7678k7170
$$ -3152 33905 -13149 -45786 -78116 -99545 -71801 -85067 -23748 -16864 -32620 -60298 -87468
6955h7468K1495o196L5144l5706l1493M149M6664O1416M2450n9714o3235M2324
$$ -87468 -65973 -72169 -37025 -72731 -104224 -100075 -53411 8005 50455 -9259 -72494 -30170
6943c0170L5689n933l8152j8139J655j8420L4173N09k4356j7971P4752L3699j4025
$$ -30170 5519 -414 -38566 -56705 -55050 -73470 -39297 -38788 -63144 -81115 -6363 27336 13311
$$ [...]
##END NTUPLES=NMR SPECTRUM
##END=
