##TITLE=Analysis number 317706
Compound Code mo 01154
Book Reference 444/98
Project Code adrs
Chemist Name howarde
##JCAMPDX= 6.0         $$ Bruker NMR JCAMP-DX V2.0
##DATA TYPE= NMR SPECTRUM
##DATA CLASS= NTUPLES
##ORIGIN= Bruker BioSpin GmbH
##OWNER= nmr
$$ XWIN-NMR		Version 3.5
$$ Wed Mar  1 11:01:44 2006 GMT Standard Time (UT+0h)  MAYBRIDGE\nmr@NMR_250MHZ
##.OBSERVE FREQUENCY= 250.131544655141
##.OBSERVE NUCLEUS= ^1H
##.ACQUISITION MODE= SIMULTANEOUS (DQD)
##.ACQUISITION SCHEME= undefined
##.AVERAGES= 16
##.DIGITISER RES= 18
##SPECTROMETER/DATA SYSTEM= dpx250
##.PULSE SEQUENCE= zg30
##.SOLVENT NAME= CDCl3
##.SHIFT REFERENCE= (INTERNAL, CDCl3, 0, 16.3977)
##AUDIT TRAIL= $$ (NUMBER, WHEN, WHO, WHERE, WHAT)
$$ ##TITLE= Audit trail, XWIN-NMR		Version 3.5
$$ ##JCAMPDX= 5.01
$$ ##ORIGIN= Bruker BioSpin GmbH
$$ ##OWNER= nmr
$$ C:\u/data/dgb/nmr/ADRS/17160/pdata/1/auditp.txt
$$ ##AUDIT TRAIL=  $$ (NUMBER, WHEN, WHO, WHERE, WHAT)
(   1,<2006-03-01 11:01:05.23 +000>,<MAYBRIDGE\nmr>,<NMR_250MHZ>,
      <created by zg, POWCHK disabled, PULCHK disabled
       configuration hash MD5:
       84 BC 41 DB A1 6E 1D 46 DA 25 12 A5 C1 ED C5 3A
       data hash MD5: 64K
       9C 1C 5F 5B C8 A0 9C 8B 5C 4F 9A 4C 28 EF 89 36>)
(   2,<2006-03-01 11:01:29.12 +000>,<MAYBRIDGE\nmr>,<NMR_250MHZ>,
      <Start of raw data processing
       ef LB = 0.3 FT_mod = 6 PKNL = 1 SI = 32K 
       data hash MD5: 32K
       94 08 82 D1 C3 CD 5A 38 27 1A C8 BA FA B6 18 0D>)
(   3,<2006-03-01 11:01:33.48 +000>,<MAYBRIDGE\nmr>,<NMR_250MHZ>,
      <apk 
       data hash MD5: 32K
       57 F7 71 32 CB FE F8 9F 68 0F 9A A4 C9 12 9F 52>)
(   4,<2006-03-01 11:01:34.29 +000>,<MAYBRIDGE\nmr>,<NMR_250MHZ>,
      <abs ABSG = 5 
       data hash MD5: 32K
       FB F4 2B 69 A2 AF 87 18 1C 4D 62 34 36 B2 41 C1>)
$$ ##END=
$$ 
$$ hash MD5
$$ C6 91 86 2A 06 9E C1 92 68 3E CF AB 47 B9 63 6E
##$RELAX= 
##$RELAX= 
##$RELAX= 
##$RELAX= 
##$RELAX= 
##$RELAX= 
##$RELAX= 
$$ Bruker specific parameters
$$ --------------------------
##$DU= <C:\u>
##$EXPNO= 17160
##$NAME= <ADRS>
##$PROCNO= 1
##$TYPE= <nmr>
##$USER= <dgb>
##$AMP= (0..31)
100 100 100 100 100 100 100 100 100 100 100 100 100 100 100 100 100 100 
100 100 100 100 100 100 100 100 100 100 100 100 100 100 
##$AQSEQ= 0
##$AQ_mod= 3
##$AUNM= <au_zg>
##$AUTOPOS= <18 >
##$BF1= 250.13
##$BF2= 250.13
##$BF3= 250.13
##$BF4= 250.13
##$BF5= 500.13
##$BF6= 500.13
##$BF7= 500.13
##$BF8= 500.13
##$BYTORDA= 1
##$CFDGTYP= 0
##$CFRGTYP= 5
##$CHEMSTR= <none>
##$CNST= (0..31)
1 1 145 1 1 1 1 1 1 1 1 1 1 1 1 1 1 1 1 1 1 1 1 1 1 1 1 1 1 1 1 1 
##$CPDPRG= <>
##$CPDPRG1= <>
##$CPDPRG2= <>
##$CPDPRG3= <>
##$CPDPRG4= <mlev>
##$CPDPRG5= <mlev>
##$CPDPRG6= <mlev>
##$CPDPRG7= <mlev>
##$CPDPRG8= <mlev>
##$CPDPRGB= <>
##$CPDPRGT= <>
##$D= (0..31)
0 1 0 0 0 0 0 0 0 0.06 0 0 0 0 0 0 0.0002 0 0 0 0 0 0 0 0 0 0 0 0 0 0 
0 
##$DATE= 1141210863
##$DBL= (0..7)
120 120 120 120 120 120 120 120 
##$DBP= (0..7)
150 150 150 150 150 150 150 150 
##$DBP07= 0
##$DBPNAM0= <>
##$DBPNAM1= <>
$$ [...]
##$SUBNAM7= <"">
##$SUBNAM8= <"">
##$SUBNAM9= <"">
##$SW= 20.6930455092707
##$SWIBOX= (0..15)
0 0 3 0 0 0 0 0 0 0 0 0 0 0 0 0 
##$SW_h= 5175.983436853
##$TD= 65536
##$TD0= 1
##$TE= 293.16
##$TE2= 300
##$TE3= 300
##$TEG= 300
##$TL= (0..7)
0 120 120 120 120 120 120 120 
##$TP= (0..7)
150 150 150 150 150 150 150 150 
##$TP07= 0
##$TPNAME0= <>
##$TPNAME1= <>
##$TPNAME2= <>
##$TPNAME3= <>
##$TPNAME4= <>
##$TPNAME5= <>
##$TPNAME6= <>
##$TPNAME7= <>
##$TPOAL= (0..7)
0.5 0.5 0.5 0.5 0.5 0.5 0.5 0.5 
##$TPOFFS= (0..7)
0 0 0 0 0 0 0 0 
##$TUNHIN= 0
##$TUNHOUT= 0
##$TUNXOUT= 0
##$USERA1= <user>
##$USERA2= <user>
##$USERA3= <user>
##$USERA4= <user>
##$USERA5= <user>
##$V9= 5
##$VALIST= <valist>
##$VCLIST= <CCCCCCCCCCCCCCC>
##$VD= 0
##$VDLIST= <DDDDDDDDDDDDDDD>
##$VPLIST= <PPPPPPPPPPPPPPP>
##$VTLIST= <TTTTTTTTTTTTTTT>
##$WBST= 1024
##$WBSW= 4
##$XGAIN= (0..3)
0 0 0 0 
##$XL= 0
##$YL= 0
##$YMAX_a= 611247
##$YMIN_a= -545957
##$ZGOPTNS= <>
##$ZL1= 120
##$ZL2= 120
##$ZL3= 120
##$ZL4= 120
##$ABSF1= 16.39773
##$ABSF2= -4.295441
##$ABSG= 5
##$ABSL= 3
##$ALPHA= 0
##$AQORDER= 0
##$ASSFAC= 0
##$ASSFACI= 0
##$ASSFACX= 0
##$ASSWID= 0
##$AUNMP= <proc_1d>
##$AZFE= 0.1
##$AZFW= 0.1
##$BCFW= 0
##$BC_mod= 0
##$BYTORDP= 0
##$COROFFS= 0
##$CY= 12.5
##$DATMOD= 1
##$DC= 0
##$DFILT= <>
##$DTYPP= 0
##$F1P= 14.0000005364418
##$F2P= -0.99999901652339
##$FCOR= 0.5
##$FTSIZE= 32768
##$FT_mod= 6
##$GAMMA= 0
##$GB= 0
##$INTBC= 1
##$INTSCL= 1
##$ISEN= 128
##$LB= 0.3
##$LEV0= 0
##$LPBIN= 0
##$MAXI= 10000
##$MC2= 0
##$MEAN= 0
##$ME_mod= 0
##$MI= 0
##$NCOEF= 0
##$NC_proc= -3
##$NLEV= 6
##$NOISF1= 0
##$NOISF2= 0
##$NSP= 0
##$NTH_PI= 0
##$NZP= 0
##$OFFSET= 16.39773
##$PC= 1
##$PHC0= 124.8992
##$PHC1= -38.08965
##$PH_mod= 1
##$PKNL= yes
##$PPARMOD= 0
##$PSCAL= 4
##$PSIGN= 0
##$REVERSE= no
##$SF= 250.130031082382
##$SI= 32768
##$SIGF1= 0
##$SIGF2= 0
##$SINO= 400
##$SIOLD= 32768
##$SREGLST= <1H.CDCl3>
##$SSB= 0
##$STSI= 32768
##$STSR= 0
##$SW_p= 5175.98343685301
##$SYMM= 0
##$S_DEV= 0
##$TDeff= 65536
##$TDoff= 0
##$TI= <Analysis number 999999
Compound Code 99
Book Reference 9
Project Code 9>
##$TILT= no
##$TM1= 0
##$TM2= 0
##$TOPLEV= 0
##$USERP1= <user>
##$USERP2= <user>
##$USERP3= <user>
##$USERP4= <user>
##$USERP5= <user>
##$WDW= 1
##$XDIM= 32768
##$YMAX_p= 391828929
##$YMIN_p= -93404
$$ End of Bruker specific parameters
$$ ---------------------------------
##NTUPLES= NMR SPECTRUM
##VAR_NAME=  FREQUENCY,     SPECTRUM/REAL,   SPECTRUM/IMAG
##SYMBOL=    X,             R,               I
##VAR_TYPE=  INDEPENDENT,   DEPENDENT,       DEPENDENT
##VAR_FORM=  AFFN,          ASDF,            ASDF
##VAR_DIM=   32768,         32768,           32768
##UNITS=     HZ,            ARBITRARY UNITS, ARBITRARY UNITS
##FACTOR=    0.157963299565203, 1,           1
##FIRST=     4101.56468297839, 0,            0
##LAST=      -1074.41875387462, 0,           0
##MIN=       -1074.41875387462, -93404,      0
##MAX=       4101.56468297839, 391828929,    0
$$ Real data points
##PAGE= N=1
##DATA TABLE= (X++(R..R)), XYDATA
$$ [...]
16762B650L86K238j597l637k162J253L482P15j92k569o32m97K802N809m01l686
16746C962j819k248j910j17K24j219Q35J326P40J201P23j594j269o05K940j134
16730C6j621L153J206R06P82R13r92N1j120j841n82j300l91K578J557j012r03
16713A420k77L397R69k156j64L350j01N5P1j585m79J002J031J815j731k679l145
16696G93q44r99p76L192j114m402j854J546N6J397P68j050q14O37j933J248L416
16679g33Q62m536l170K973M439Q09m879J76L760K172J526j124l673O96J150M116
16663D564j853k420m231j877K158N385Q03j346Q58n48m83Q42k955k563j867J10
16647e423J139n07R09k139L92R09p26m23N491M293j60J708j006J207l601k879
$$ y = [2650, 3036, 5274, 3677, 40, -2122, -869, 2613, 3328, 3136, 567, -65, -562, 2240, 8049, 7648, 3962, 2143, -105, -2015, -2132, -1908, -3127, -2292, -966, -226, 975, 1698, 104, -1165, -1770, 1170, 36, -1585, 1568, 2774, 3680, 4462, 5375, 4383, 4434, 3314, 1473, 891, -409, -800, 1778, 3335, 2323, 1420, 1143, 4540, 5509, 3353, 3189, 6539, 6438, 6493, 6564, 4979, 4500, 5502, 6533, 8348, 6617, 3938, 793, -51, -1050, -1826, 1366, 252, -4150, -6004, -4458, -4402, -3005, -2237, -3287, -4101, -3464, -5397, -4149, -733, 129, -4407, -7577, -4604, -165, 644, -4235, -4059, -299, 1873, 3399, 2275, -1398, -702, 448, 4564, 2711, 291, -3940, -5817, -3659, 1726, 2529, 1183, 2041, 1493, 1010, 1852, -1103, -3666, -5533, -5423, -4284, -4791, -3882, -6021, -5629, -4720, -5446, -5869, -378, 3915, 3755, 5463, 4457, 5664, 2063, -816]
16631h16j434j264M756M713l52M2L012o08m554j653L470Q20j570j288j957j106
16615B11J084J914m469k82k423k723o44J667M198P81M39k040O77M579m87j711
16599G71m849p30N034K150L736l102n691j085J512L007j97k230K62N851J382J356
16583G177M33j202m826k479O50J656m248o00K295j639j92J719j460J217j395M64
16567b430J062j534q63K026N33L17l59p27j344K696K272J190J526n59l590j339
16551a123j972k830m8N224l879n879K362L942J217j533J67j496p45L668M645m36
16535A284K34q22j523J571J681P02M171L45j41o07k551l676J080O073J185j805
16519G201l601j754P48o56j55R15q2j934J21J530k093k985j985o87L031L415N9
$$ y = [-816, -2250, -3514, 1242, 5955, 5603, 5645, 8657, 8049, 3495, 1842, 5312, 6132, 4562, 3274, 1317, 211, 1295, 3209, -1260, -1542, -3965, -6688, -7332, -5665, -1467, -686, -247, -2287, -1610, 2969, 2482, 771, -4078, -4808, 226, 2376, 6112, 3010, -2681, -3766, -2254, 753, 556, -1674, -1412, 4439, 5821, 7177, 7610, 6408, 1582, -897, -247, 1409, -2839, -3439, -1144, -2783, -2975, -1256, -2716, -1499, -2894, -2430, -1368, -2902, -3765, -1739, -1206, -889, -1248, -1975, -3319, -623, 1649, 2839, 4365, 3806, 216, -1123, -3095, -5925, -5973, -749, -4628, -10507, -8145, -4203, -2986, -4519, -4352, -5848, -6593, -2925, 1720, 1284, 1518, 696, -827, 744, 2425, 3127, 7298, 7643, 7502, 6895, 4344, 668, 1748, 7821, 9006, 7201, 3600, 1846, 2594, 1938, 1783, 2698, 2616, 682, 803, 2333, 240, -2745, -4730, -5417, -2386, 1029, 1088]
16502A088k110r49l378q79R05M221L189P42j787N87n17p10J283J17R88j952J46
16485I84K583m725l263L735J944J573j567Q7N238K71l558l99l129k011J697J79
16469c61P9K488M103n082k496o2L39K668k226j208J692k217k285P89Q12R48J08
16452a911n00K604L80mo377j287L180K425L579J103j313k694k396k563R47M336
16436d91K030k59l695l884k076J740K759J681j550L99M209l26l772r53J677J426
16420a085r61k628l39L024K226J978m68l540n36R17P94K045K057k675m10r1k295
16403a987K282j444K71M126k97J003k153J269O6l84K054q33j542r3k013M90K012
16386B827J081l641j022N115J465J501k078K079J540j179n937k707m44J503M235
$$ y = [1088, -1022, -1971, -5349, -6228, -5323, -1102, 2087, 2829, 1042, 1629, 1112, 402, 1685, 1802, 2790, 838, 984, 3567, -1158, -4421, -686, 1258, 2831, 1264, 1351, 6589, 6860, 3302, 2903, -226, -2237, -540, -361, -282, 2206, 6309, 1227, -1269, -1331, -992, 1676, -550, -1758, -66, -2283, -4568, -3779, -2967, -2019, -1911, -2411, 193, 573, 569, -5808, -7095, -3915, -1490, 2089, 3192, 1879, -815, -3211, -5774, -4827, -491, 1539, 1280, -2415, -6299, -8375, -6635, -3876, -2195, -3745, -3346, 863, 537, -3235, -4188, -2511, -1085, -2046, -4674, -5013, -1989, 237, 2215, 1747, -1793, -2329, -1412, -618, 1427, 3484, 809, 399, 308, -1987, 295, -1149, -878, 3248, 2951, 3954, 1801, 3070, 3136, 2752, 4806, 3973, 2431, 2338, 325, 815, 2827, 3908, 267, -755, 4360, 5825, 7326, 5248, 7327, 8867, 7688, 1751, -956, -1400, 103, 4338]
16371D338n11j09K44m2j433j725j74l272l602K866K826J414M440j399k46J111
16355D726m022m090j664R34K25j591M80M113J389m096l868j65q94J697K380N491
16339A045J519k536K341O36j993j656k038M165l127n133j838R62K393K818L11
16324b131l13M03k602n137K775Q83j583L448O78l327j521K105P23k06J670K253
16308a882R70K320J694K4m176j500K266K928K473l736k378K779L889k621l401
16293c51K121K971J939k219k903l23j81m6N622j935l026J753L37l118j213k501
16277c073R72J841K636R68j906q54k039J030K187K288l854j227K289J689k471
16262D76M19j39k936p45j65l10Q65K907l312k933M122L27m400N52K399K717R21
$$ y = [4338, 3827, 3718, 3962, 3920, 2487, 762, 588, -2684, -6286, -3420, -594, 820, 5260, 3861, 3615, 4726, 704, -3386, -5050, -4116, -3891, -5482, -5002, -889, 500, -3596, -7464, -7629, -8523, -6826, -4446, 1045, 2564, 28, 2369, 3005, 1012, -644, -2682, 1483, -1644, -6777, -8615, -7653, -5260, -2442, -2131, -2444, -2041, -4643, -9780, -7005, -6122, -7705, -4257, -3579, -6906, -8427, -6322, -5599, -5805, -4135, -1882, -912, 1408, 3102, 3126, -1050, -2550, -284, 2644, 5117, 1381, -997, 1782, 5671, 3050, -351, 1770, 4741, 6680, 4461, 1558, 1235, 1054, 1008, 6630, 4695, 1669, 3422, 3759, 641, -572, -3073, -2101, -260, 2376, 3344, 1438, 584, -1455, -425, 1762, 4050, 196, -1031, 1258, 2947, 476, 895, 756, -2180, -2925, -3090, -3400, -2535, 372, -2940, -5873, -1751, -1424, -5824, -5272, -2873, -156, 765]
16245G65N40k420K08m19L52L205J929j838l47J907l304J831p60k496L066n47m333
16228b661j695K258L473k112m107J29L162k89p81M06P15R81l6K770J23J083j919
16211A500j523J070P28L147k073p781j613O066K071k486m378j867J095n6j385
16196g485M059M115K445J841k43r79k543m069l572M31M229L582J29J967j605k763
16180d61j862J097k28L689l207J91Q64p40K430j385n203L95M853J546O33m301
16164a689K227L624J423r92o9k220k476K214j217j515j113j240j074L209P45J315
16148A152K539r0l027N73n34Q25K659OJ33j716o72k33j739K456Q84m525m624l27
16130f260K365N60J410K416j685R22N66k447j364k582J372J048J847J617K828
$$ y = [765, 1305, -1115, -907, -1326, -974, 2231, 4160, 2322, 1975, 3882, 578, 2409, 1649, -847, 2219, 1672, -2661, -4356, -2098, 1375, -737, -4844, -4715, -1553, -1842, -2623, -2217, -1502, -521, -557, 2213, 2336, 3419, 1500, -23, 1047, 1775, 4922, 2849, -4932, -6545, -479, 1592, -894, -5272, -7139, -6044, -6100, -7485, -3426, 689, 3134, 4975, 4732, 3753, 1210, -2859, -6431, -6000, -1771, 1811, 1940, 3907, 2302, -461, -2323, -1226, -1454, 2235, -972, -781, 83, -657, 1773, 388, -4815, -4420, 433, 1979, 2612, -1689, 538, 4162, 5585, 4593, 4524, 2304, -172, 2042, 825, -690, -1803, -3043, -4117, -908, -163, 1152, 3691, 3601, 574, 1147, 613, 1438, 4097, 4103, 4236, 2520, 1848, 1615, -124, 2332, 3216, -1309, -5933, -6260, -3895, -3335, -1925, 491, -1194, -272, 294, -2153, -3517, -6099, -4727, -3679, -1832, -215, 2613]
16115B613J160k735J540K198k178q11K90O09m49j434R18L095l50p1k43m005N83
16098G30L29K82K230k54m48j144k262n019q90N402J28J452J308m623l56N389N88
16081B842j70o40l26j034M134J26n7q2k560P24m8n236o56K439L153j695k942k540
16063d568K409K874k357K524J011o90q73P95J553q92k57l660l960R29L230J388
16047e44K426k60J56J143j847o043l801J46j240K27J098L022M116J294l20l09
16031g36P36k2j324l571j78K363J820j75J43j648R10K390Q65J013p32K001J17
16014C972K814n78n168n245O97Q53J999Q20O50q2m707k626J010K156l178J80K103
15997d330J597K431k316m125l909L03O327L756k472K46Q34L54p7j879K769J035
$$ y = [2613, 3773, 1038, 2578, 4776, 2598, 1787, 2077, 2686, 2237, 803, 1721, 4816, 4466, 4395, 4152, 147, 730, 1059, 1341, 3571, 3317, 2869, 1725, -537, -5556, -6446, -1044, -916, 536, 1844, -2779, -3135, 2254, 2842, 2672, 2032, 1706, 672, 4806, 4932, 4875, 4793, 2233, 2957, 2909, -2327, -2983, -544, 2609, 914, -2028, -4568, -2159, 715, -1642, 882, 1893, 1203, 330, 1125, 2678, 1786, 1529, -2131, -6091, -5162, -1932, -544, 1882, 1622, 1778, 2921, 1074, -4969, -8770, -8624, -9864, -9637, -8539, -5517, -1401, -107, -427, -736, 0, -22, -1346, -4917, -5095, -2732, -912, -1087, -944, -2592, -1682, 708, 1573, 2586, 1854, 3855, 3972, 6786, 6208, 1040, -4205, -3508, -2655, -656, 164, 814, 732, -3975, -6601, -5591, -3435, -6613, -6433, -4330, -2733, -302, -2618, -6743, -10652, -10349, -4022, -266, -2738, -2492, -1658, -1304, -1381, -3260, -491, 544]
15981E44m342m342J141K383L302J749J842k95m503j060J186K086o83q76K290k954
15965b532k814J467j047k101J060L437l51n39k446K407J10r02J406j78M79k40
15949b784K695j179j983J205l212j986j407N48M292p94J394K484j545J86L119
15934A033j655l936j427L546k552r58M235K399J822K012K123j540k038j02j856
15919A106k436k213m462K255M391J27n02P9J465r50Q93p87J082k635m30K475o95
15902a237j371r83J889M413J455j902k792j811K139L626j327k822J441O61k100
15887g21j444m791k362L160O047K203m447k222l04K001L82J502j986n54M553r78
15871C9k592P55L355n02m186k148L005J295j413j257R11K09l72J113j0j527M13
$$ y = [544, -3798, -8140, -6999, -4616, -1314, 435, 2277, 1982, -2521, -3581, -2395, -309, -992, -1868, 422, -2532, -5346, -3879, -4926, -7027, -5967, -2530, -2881, -3420, -5866, -3459, -3349, -4251, -2845, -3023, -2544, -2784, -89, -1268, -3251, -2046, -5258, -7244, -8651, -8103, -3811, -4605, -3211, -727, -2272, -2086, 1033, -622, -4558, -5985, -2439, -4991, -5949, -1714, 685, 2507, 4519, 6642, 5102, 3064, 2962, 1106, -1330, -3543, -8005, -5750, -1359, -1232, -1734, -1655, -190, -1140, -247, -1034, 48, -2587, -3017, -542, -1237, -2608, -3591, -1702, 2711, 4166, 2264, -528, -2339, -200, 3426, 2099, -723, 718, 1379, -721, -2165, -6956, -9318, -6158, -111, 2092, -2355, -4577, -4881, -2880, -2498, -996, -2982, -3536, 1017, 39, -2553, -1798, 1557, 1055, -3131, -5279, -2274, -979, -2392, -3649, -2738, -2529, -2901, -1788, -1798, -3325, -2912]
15854b912N23L864j82m146n859m15L325N603n86n004k629o16M388K346L197q25
15838G2j978j927k567l36K606K598L092j367k874J367K375l63R61m040k018J896
15822b503P9m88L031k219j348J686L757M263n38m496N42j164o75k136m17L038
15806D12J911n19j176m45p40J110K552J280p92r24o19R22N5j478J31P82P64P06
15788C932k053Q29j833j359j439l096k14r23k32J525q43P54q63P2P76M34J50K049
15770b334Q99n64j738k71L87J580K84L109N013k052l566l90Q17k105n815n95K956
15753d385k099J141J706R89J97K534k367j800j137o08j984J783K714M518L739
15738D941l268o532m00L24j427m78J600m66Q49K322M55k168j235J747M40r11m40
$$ y = [-2912, -2389, 1475, 1293, -2853, -8712, -9127, -5802, -199, -785, -5789, -8418, -9034, -4646, -2300, 897, 72, -1906, -3833, -6400, -6736, -4130, -1532, 1560, 193, -2681, -1314, 1061, 698, 1659, -2381, -4399, -2503, -2424, -2912, 119, -2100, -3448, -1762, 1995, 6258, 5720, 1224, 1766, 602, -73, -2209, -2626, 412, 2323, 1804, 628, 183, -557, 553, 3105, 4385, 3593, 2669, 2050, 2972, 3027, 1549, 1680, 2462, 3226, 3932, 1879, 2708, 875, -484, -1923, -5019, -5233, -6156, -6388, -4863, -5706, -4952, -5815, -5743, -4967, -4533, -4383, -2334, -1435, -1999, -3737, -4008, -3621, -2041, -1757, 1352, 6365, 4313, 747, 357, 1174, -931, -6746, -7341, -4385, -6484, -5343, -3637, -2648, -2451, 83, -2284, -4084, -5221, -5829, -7813, -6030, -3316, 1202, 4941, 1673, -4859, -5259, -4935, -6362, -6840, -5240, -5706, -4857, -2535, -2080, -4248, -5483, -3736, -3296, -4207, -4647]
15721d647K051l613l923O571K683j195l249r57L659O54n76k94K53L4O12J585K83
15704f9q7j345k310K70K14M295N195L72k019o763m387J797j00N74J680J387J684
15687C88j822j446N08K460N668j40K1k596j800j341j496J683o79K8L1k224q39
15670c596L257P58k080J11L39M33k132R65k359j45N56K245K952p17j583K325K729
15653D058j469l475l655j231j88j090Q40K902J042M77J502J71k680J936K937l444
15637a367l033K539N89m678j088K716K563K090Q74k226P70j770l039o99J566K726
15621a467N41O32K13k111j064l368K687M791k298k893l696N65l56j850K772M853
15605b049j64j391J108K992p58k887j652r75j804m03r84K829L153M02J829J212
$$ y = [-4647, -2596, -6209, -10132, -3561, -878, -2073, -5322, -6279, -2620, -1966, -2542, -2836, -2583, -2549, -1937, -352, -69, -156, -1501, -3811, -3541, -3327, 968, 6163, 6535, 4516, -2247, -6634, -4837, -4937, -4363, -2683, -1296, 388, -1434, -2880, -2372, 88, 5756, 5616, 5637, 3041, 1241, -100, -1596, 87, -592, -564, -533, -2757, -3596, -339, 419, -1661, -1550, -1211, -778, -2910, -1945, -4304, -4449, -3893, -1648, 1304, 587, -996, 1329, 4058, 2589, -886, -4541, -5772, -5960, -7050, -6210, -3308, -2266, -1789, -287, -116, -2796, -860, 2077, -1367, -4400, -1861, -1272, -5950, -7038, -4322, -1759, 331, 1205, -1021, -251, -2021, -5060, -5759, -4193, -1467, -926, -294, -81, -2192, -3256, -6624, -3937, 854, -1444, -4337, -8033, -7468, -7824, -9674, -6902, -2049, -2213, -3604, -2496, 496, -262, -3149, -4801, -5776, -7580, -7983, -8967, -6138, -2985, -2583, -754, 458]
15589D58l166j41J325o26K515N36r41k310j267PJ982M280J43k820k491J388M19
15572g09j667K010J582k33K18J673L803l054n826j97J554j744l424l455N603K339
15556a527m068k525M31K586J619J787k05k013K076L305k664n932J393L632L722
15541A617r5o21k285j683J007j672j381K121L612j585K17K038p57K030L03m140
15525a274J7n09l450o29J86k062n43M059Q61k049P75M40k257K09P83k17R24r6
15507d832q24j019J213n66j009L416m51k442O473K782m509l742RK641J623j586
15491b823N39m95j301P79J717K097J988K610m85Q93k919k342K102r9k677m894
15475e310p32J554K718O63N99j424l3k414P07q4k44n81k892J259N70J765R58j588
$$ y = [458, -2708, -2849, -1524, -2150, 365, 901, -40, -2350, -3617, -3610, -1628, 2652, 2795, -25, -2516, -1128, -709, -2376, -366, 1216, 983, 1201, 2874, 6677, 3623, -2203, -2400, -846, -2590, -6014, -9469, -3866, -1527, -5595, -8120, -7689, -5103, -3484, -1697, -1902, -3915, -1839, 1466, -1198, -7130, -5737, -2105, 1617, 1522, 901, -1384, -3067, -2060, -3732, -5113, -2992, 620, -965, -748, 1290, 533, 2563, 2866, -1274, -1257, -1766, -5216, -5845, -5659, -7721, -8264, -4205, -3344, -5393, -4618, -4178, -6435, -6226, -5443, -5660, -4736, -4832, -5656, -6675, -5462, -6028, -7037, -3621, -4072, -6514, -41, 2741, -1768, -5510, -5501, -2860, -1237, -2823, -2284, -2779, -4080, -3301, -1584, 513, 2501, 5111, 4626, 5519, 2600, 258, 2360, 2261, -416, -5310, -6042, -4488, -1770, -1107, -508, -1932, -1965, -4379, -3672, -3756, -4000, -4581, -7473, -6214, -5644, -3879, -2921, -4509]
15457d509m422L861L016K27l27k920M31M653K682k081J55o51J12k741j181o48
15441d343M755N501k556r60l312m221j632j292K971J723J632k596L05K865k74
15426a434j397q01j474k904j950J804K5k163J417P43K922N250p81m33K394j376
15410a58k669J46K062m02r92l824K543N440l8j686q16m42K61o19j494p05L851
15393D58R78l771R77J3r74j396n169K168K070j152j750k261K920Q75J01K273M15
15376c225r08j906J04L420J101p2J446Q30k58k781r8K556k741l810l63P56J857
15359d092L554Q51M08k674j668k46N69k004K581K334J343L213j227M74l1j949
15343A436j707n29K923k948j624K55p40M81L48k630J139N10K078j101j772j569
$$ y = [-4509, -8931, -5070, -2054, -1827, -2154, -5074, -4643, 10, 2692, 611, 766, 115, 227, -2514, -3695, -4343, 412, 5913, 3357, 2397, -915, -5136, -6768, -8060, -5089, -3366, -1734, -4330, -4025, -1160, -1434, -2831, -3632, -5106, -8010, -9960, -8156, -8131, -10294, -8877, -8134, -5212, 38, -743, -1176, 1218, -158, -2827, -2681, -619, -1021, -2013, -5837, -3294, 2146, 2108, 422, -394, -836, -575, -1194, -2688, -3393, 458, 1436, -2335, -1358, -1345, -2319, -3715, -8884, -6716, -4646, -5798, -7548, -9809, -6889, -6014, -5913, -3640, -3225, -4133, -6039, -5935, -2515, -1414, -1486, -40, 790, 532, -2249, -2347, 209, -2532, -6342, -6705, -5949, -4092, -538, 313, 721, -1953, -3621, -3867, -3298, -5302, -2721, -387, 956, 4169, 2942, 3416, 3385, 1436, -271, -800, 2123, -825, -2449, -2194, -2934, -2453, -2105, -4735, -3596, -3086, -1008, -2109, -3881, -5450]
15327e450j574J284M502l94m92p50l176K254J357j659P32K985M68K47k236R93
15311i09j222j519J521K090J505K224j97k350j308l329L77J187P13P31K755k6
15295B243J643k968l449o95Q55O28k068q50L301Q9N90L150K269k347N40p50k890
15278g09o30O78j224n692j387J876R36L779K257m54j417J207Q08p57j027J360
15262c96n98l758j563J452L589k827k246r97L530l5J82L657K93m322n437P22L464
15245e290M08k716k57j24K081K774m52K043j393n0J479j377l989P41K659J836
15229a627M166J038j997j75m090j350j97K324J099M73r70k147P36L573j282l100
15213c526J381Q28J889p00Q27j304R55j960Q36L84L7j60J67k555J3P76J360j03
$$ y = [-5450, -7024, -5740, -1238, -1632, -2124, -2874, -6050, -3796, -2439, -4098, -3366, -381, 87, 334, -1902, -909, -2131, -3650, -2129, -39, 1466, 3690, 3493, 1143, -165, -3494, -3117, -1930, -1217, -486, 2269, 2243, 3886, 918, -2531, -3226, -2371, -1743, -3811, -4661, -1360, -1271, -681, 2469, 4738, 2391, 2931, 2181, -709, -1339, -661, -1885, -7577, -8964, -7088, -6152, -2373, -116, -570, -1987, -780, 28, -729, -1756, -396, -994, -4752, -6315, -4863, -1274, -4101, -6347, -7344, -3814, -3849, -3667, -10, 283, -4039, -9476, -8754, -5290, -4882, -7598, -7855, -7979, -5898, -3124, -3576, -1533, -2926, -2976, -1497, -2874, -6863, -6122, -3463, -1627, 2539, 3577, 1580, 1405, -2685, -4035, -4232, -1908, -809, -336, -1306, -3453, -2717, 856, -426, -3526, -2145, -1317, 572, -128, 699, -605, 350, -1610, -774, -390, -353, -513, -346, -2901, -2888, -2112, -752, -855]
15195h55K483o49j968m849j614L439L686j503m3j69k584k365J079J612K858K880
15179A438l974n69M770K546j50P88j055k141L098l206k584q79J335O78j61k88
15163c54j4L92j250k422L398L131k830j963j070P36l103j777K917j57j17n31J704
15146c310j707j174L885L164l80j252Q9M22J804R11k853j002K958j181k199J829
15130Dk157R90N21j118J264J643k145j05K506m63n87K310P26m57r04j716K819
15113C131M95p13j11J137J906j642R73j563k380P20j16K416j337k371k464k93
15097b212n02Q3k265K966J747K0K918P64K379k993k583L185j180k713m474n4L947
15080i67k015l90M318M205o49l349j040l300r62M21j485j277K504L162J852k330
$$ y = [-855, 1628, 979, -989, -5838, -7452, -4013, -327, -1830, -1873, -2042, -4626, -6991, -5912, -4300, -1442, 1438, -2536, -3105, 1665, 4211, 4061, 4849, 3794, 1653, 4751, 1545, -1039, -1918, -583, 95, -66, -354, -368, 24, -1226, -3648, -250, 2881, 51, -1912, -2982, -2246, -5349, -7126, -4209, -4366, -4483, -5014, -3310, -5017, -6191, -2306, 858, 478, -774, -685, -263, 1541, 2452, -401, -1403, 1555, 374, -1825, 4, -2153, -1163, -642, -1760, -496, 1147, -998, -1103, 1403, 940, 353, 2663, 3389, 2932, 2028, 312, 3131, 3626, 2913, 2802, 3939, 5845, 4203, 5176, 3613, 1233, 1953, 1837, 4253, 2916, 545, -1919, -2212, -2714, -2631, -4896, -1930, -183, -163, 2755, 3519, 5898, 2905, 322, 3507, 2327, -386, -4860, -4914, -967, -2982, -3372, 946, 5151, 4502, 1153, 113, -3187, -4149, -3728, -5213, -6490, -3986, -824, 1028, -1302]
15064a302n21L417R36j460m820m167J782K399n31P64J062O0J044k38l98Q02K102
15047I31p49P16p30o6o77J168L928m30O00j021j222m080l233n37J655j347J06
15030d988j441J950j556J867J643k34p18P47m32K192K1n45l476k360R34k89K834
15013c851P78m200j62M336R1j333R80j478r35K376Q02K228J826O00j777k269l846
14996e834K980m58K82J745j694p24l38P84J366L42j561J777K331j817m818o39
14980f276J199p85M61R75J63J147J697J404k319k677J533o06k042j019j515p29
14964i389L23K2L952R66N68k829Q92M419O94j662j139J038J69O08p0J984p69J947
14946A724p57m693l825J103J847P12k35p23P4M44k630j31L709L013l12k219k236
$$ y = [-1302, -1823, 1594, 2530, 1070, -3750, -7917, -6135, -3736, -4267, -3503, -2441, -2381, -1337, -1575, -1973, -1171, 931, 182, 898, 168, 102, -575, 593, 4521, 4091, 4691, 3670, 2448, -1632, -4865, -5402, -3747, -5094, -4988, -6429, -4479, -6035, -4168, -2525, -2759, -3477, -2730, -3162, -970, -949, -1494, -4970, -7330, -6396, -6685, -3851, -3073, -7273, -7435, -3099, -3008, -4341, -3361, -4839, -5774, -3398, -2596, -368, 1458, 2058, 281, -1988, -5834, -2854, -3312, -3030, -1285, -2979, -3703, -4041, -3257, -1891, -1549, -3110, -1333, 998, -819, -5637, -6276, -5077, -5862, -5401, -4426, -4263, -3116, -1419, -15, -2334, -5011, -3478, -4084, -6126, -7145, -8660, -9389, -9066, -9044, -5092, -4126, -3558, -6387, -5495, -1076, -382, -2044, -3183, -2145, -1976, -1368, -1438, 546, -223, 1724, 967, -3726, -7551, -6448, -4601, -3889, -4124, -4847, -4773, -4329, -6959, -7090, -3381, -368, -680, -2899, -5135]
14929e135r55M899J056o11k559K022K458K148j607k347m641j746j396K868J110
14914d436n82M433M2k61J673j25J836J737k520j592j389j13L627K025j013l132
14898B10j897q94J44k836k485o57M69J078J584J093J727k25J602K606l65k779
14882a625l73j062N55J779Q54m96l120k340l190J076j31L141J464Q98j22Q76j849
14865c665j71N26J331j493m37L431K768k500l641n39K809R13K758J711p77q13
14849B211j987j068l50J948p14j195p27l204m624j691L589K526P54J504j735J982
14833b781L705m57l806n53N5M839L42p57J338R44j932L59K208m99n35O51K073
14816E194k437l109j206m46j757P70L289P50Ro44j079J651J385Q76j535j494O34
$$ y = [-5135, -6090, -1191, -135, -746, -3305, -1283, 1175, 3323, 1716, -631, -5272, -7018, -8414, -5546, -4436, -5018, -585, -543, -804, 869, 744, 2580, 4317, 1797, 205, -1184, -1297, 2330, 4355, 3342, 210, -1687, -2581, -2437, -5273, -7758, -8415, -7946, -6868, -5284, -4191, -2464, -2689, -1087, 1519, 1154, -1625, -1998, -3060, -2505, -726, 128, -368, -3488, -5828, -9018, -7942, -8073, -4932, -3468, -2570, -2692, -1816, -3665, -3836, -3310, -1979, -3472, -3909, -478, 2290, -210, -3851, -4390, -1581, -668, 2090, 3801, 3024, 2211, 224, -844, -1194, 754, 40, -1155, -1882, -5086, -9710, -11401, -7812, -5286, -4532, -3028, -4763, -2781, 924, 467, -3339, -3892, -3837, 1002, 1344, 587, 1925, 2869, 937, 1296, 3504, 3005, 2470, 3121, 5194, 2757, -352, -1558, -2004, -3761, -2991, 298, 1048, 1057, 413, -666, 985, 2370, 3246, 1711, 217, 851]
14799H51j8j23k315j279k448J104L768K949l351j542j97K70l78K262K546nL23
14782B417J704L705l839m109o29N62K444K48J022l380J267M648K709j291l792
14767C686j560r80n25o26k628n5o3J431K008k227m423k388L516L143q17J241K090
14750H23J208o66j378o3K613l577k247J421J937O25p82P31K079o25L48p23k015
14733b91n50L81n176k94J940J63K926M196J003n235M25l326j388K362N829k000
14717I65m77p61k484m97R41k19Q83K201L090K994K45j449p034j998Q82J178L238
14700A698K829k977m243k887M33M195K577j825k190M49K034L470j144N88K656
14685E663j165l457K022Q63j938J375o33J641j566l219j041j205M71o23J980J968
$$ y = [851, 833, 710, -1605, -2884, -5332, -4228, -460, 2489, -862, -2404, -2601, -2331, -2709, -447, 2099, 2094, 2417, 4121, 7826, 3987, -122, -751, -189, 2255, 2503, 3525, 145, 1412, 6060, 8769, 7478, 3686, 2126, 1146, 621, -5, -2633, -2688, -2751, -1320, 688, -1539, -5962, -8350, -4834, -1691, -2508, -1267, 823, 2031, 1365, -13, -76, 2537, -1040, -3287, -1866, 71, 696, -86, 645, 2724, 2099, 2447, 1724, -291, -841, -460, -5636, -5930, -3990, -3827, -901, 3295, 4298, -937, -512, -3838, -5226, -2864, 2965, 965, 488, -273, -2757, -3254, -2313, -2532, -1649, 552, 3642, 6636, 6881, 5432, -1602, -3600, -2718, -1540, 1698, 4527, 1550, -2693, -5580, -5147, -952, 1625, -200, -2390, -1941, 93, 3563, 2419, 3007, 5663, 4498, 1041, 3063, 3926, 1988, 3363, 2730, 4371, 2805, -414, -1455, -2660, -2189, -2812, -832, 1136]
14669A136k291Q53r07J504J123L874j118ro16j553k378k135J185l206q04J551
14653c791J530O8L286Q92j224k478l312k316K662P181l11m90L8o98J564J912o0
14636D453n591r87K15r93J690L26J107l114R21J644j435J104J952J144J719O11
14620D766j041k829j445J557q98p22J499j201k907M330L513j494o289P14j207
14605c654J882q55Q45L159r03l35j78J282K365j68L76P96j913J32R0j756j373
14588b08k005n2J131J944Q06K65j953k882l586K084N47j713K184J227O88j278
14572b801M876l45k693K287L133N36n714j043j334q99O48j768k148K578K707k01
14556b181j366J504L230J384l129r12l93J582N78k809M27Q90j65k217j544L782
$$ y = [1136, -1155, -302, -1209, 295, 1418, 5292, 4174, 4165, 3549, 1996, -382, -2517, -1332, -4538, -5342, -3791, -2261, -2193, 1093, 1985, 761, -1717, -5029, -7345, -4683, 2498, 2187, 1697, 1735, 1037, 2601, 4513, 4453, -1138, -2125, -1910, -2903, -1213, -887, 220, -2894, -1973, -329, -1764, -660, 1292, 2436, 4155, 4766, 3725, 896, -549, 1008, 110, -612, 887, -314, -3221, 1109, 4622, 3128, -3161, -2447, -3654, -1772, -2627, -1782, 1377, 474, 139, -39, 1243, 3608, 3440, 3816, 4612, 2699, 2831, 2921, 1165, -208, -2213, -2265, -1134, 810, 1616, 1881, -72, -2954, -6540, -4456, -3909, -5622, -3438, -2211, -1523, -2801, 2075, 1730, -963, 1324, 4457, 4993, -721, -1764, -3098, -3997, -3349, -5117, -7265, -4687, -1980, -2181, -3547, -2043, 1187, 2571, -558, -1470, -1863, -281, 297, -2512, -2085, -1195, -1360, -3577, -5121, -1339]
14540a339K590L240J5k718k145J919k369q72n88j651o74Q2L351k23o320R47L701
14523c054K60j704o48L123K786l67k355j901J244M375M969j490k970J421M2k721
14507A010J008j85j194l627j19m49K85n50Q57k347J133M486Q47J022j686j529
14491a038j30k303L55K576n40j444j514q95N315K069k052L29j231K084J269j732
14475A118J12j108k968m58R03k062o60J911r81Q51J106M3j092j980r69j503j302
14458i039L680O931J819j217R94l497n499K871L448K338k642k337q70K781J348
14443A109l555r07J039l78J141P95j92k987o97J722j006P35l27k619r39O33J551
14426d882j3Q6J957K989N20K38j620j123l34L194j778m16L22L244J773l440k834
$$ y = [-1339, 1251, 4491, 4506, 1788, -357, 1562, -807, -1679, -2267, -3918, -4592, -4510, -1159, -1382, -7702, -6755, -3054, -2794, -4498, -5146, -2023, 763, 396, -1959, -3860, -2616, 1759, 6728, 5238, 2268, 3689, 3731, 1010, 2018, 1833, 639, -2988, -3107, -3556, -3271, -3821, -2964, -5311, -4178, 308, 1155, 2177, 491, -1038, -1168, -3471, -3116, -540, -1080, -2524, -4038, -4933, 382, 2451, 399, 728, -503, 1581, 2850, 1118, 1230, 122, -2846, -3304, -2401, -4463, -5123, -3212, -4193, -3342, -2236, -2193, -3285, -5265, -6234, -7737, -9039, -5359, 1572, 3391, 2174, 3168, -329, -5828, -2957, 491, 2829, 187, -2150, -3020, -239, 1109, -2446, -3353, -2314, -2692, -1551, -756, -948, -3935, -4632, -2910, -3916, -3181, -3508, -6127, -7066, -6433, -4882, -4895, -4809, -2852, 137, 657, 895, -725, -1848, -2182, 1012, -766, -1182, -860, 2384, 4157, 717, -2117]
14409b117R65r63J16r90j010j874K248n08J063J766J110k510M641L064l0P6P33
14392E780m177j548J300L50j568k155n125n217P81J304p75J552N29M06L221L672
14376a670K745n378j258L877K217j287l377l28K157p17l23J500Q81K203j964j502
14360b224M106j394l253k801o43k092n22K424K353r52L090K649O98P15p63j558
14344a67j745L066J551j697J008l318l389O17k091L305M97k84K495J528k578k200
14328c402j009K639J823j803j60J919K668k807r26K269k008m10J521K361k657
14313A8l295j330K326L666J621J359k314k688K393L887J101k762k012J090K388
14298E448P08l921l435J209K278r62j118m16L834L291M72k601l749j483j884j491
$$ y = [-2117, -1152, -2115, -1999, -2989, -3999, -5873, -3625, -4133, -3070, -1304, -194, -2704, 1937, 5001, 4971, 5047, 5780, 1603, 55, 1355, 1705, 137, -2018, -7143, -12360, -11579, -10275, -11050, -9498, -8969, -8563, -5342, -1670, 1075, -4303, -5561, -1684, 533, -754, -4131, -4459, -2302, -3019, -3342, -1842, -961, 1242, -722, -2224, 1882, 488, -2765, -5566, -6209, -8301, -8823, -6399, -4046, -4998, -1908, 741, 1439, 2154, 1391, -167, -1912, 1154, 2705, 1008, 2016, -1302, -4691, -4074, -6165, -2860, -2363, -2647, -152, 1376, -1202, -3402, -4411, -1772, 51, -1752, -1912, 7, 2675, -132, -1058, 1211, -797, -1207, 314, 2675, 18, -3277, -4607, -2281, 1385, 3006, 4365, 2051, -637, 1756, 5643, 6744, 3982, 1970, 3060, 5448, 6156, 2235, -1200, 9, 2287, 1325, 207, -209, 3625, 6916, 7388, 4787, 1038, -445, -2329, -3820]
14282c820K07k935l11M111J274k41m63o17J600Q95L98M562P16q46l201r6o62k620
14264b049J322J783K712l566k759m296j237N14L125M059K025j626m275j231L865
14249a634Q86j956j655L259L038o71K375K988k73k690l713J833J771J274J496
14234F328m536j811M014L547n89QJ200p35J056l23r69K70J956K52j542l469k878
14217A779J923o36k506J523M188K1m304l147L456j91j66J223Q14l991J561O79
14201B226j822P61L395J82p81K009N74k070K08L826k501n406l447J280k5j444
14185c035J824P68K299L897K062j059R1K304J500J277k743p71J014M69j095j749
14169G053m32j104K586J236j057j250n440l919J526L475L186j081k10J383L037
$$ y = [-3820, -3613, -6548, -6859, -2748, -1474, -1715, -2178, -2795, -1195, -300, 98, 4660, 5376, 4530, 1329, 1233, 571, -2049, -727, 1056, 3768, 202, -2557, -6853, -8090, -7576, -4451, -392, 1633, 7, -4268, -5499, -1634, -748, -2704, -4359, -1100, 1938, 1267, 3642, 6630, 6357, 3667, -46, 1787, 3558, 4832, 6328, 1792, -19, 3995, 7542, 6953, 6961, 8161, 7426, 8482, 8159, 7190, 7460, 9416, 9668, 8126, 4657, 1779, 3702, 3066, 560, 2083, 6271, 6292, 1988, -1159, 2297, 2106, 1940, 3163, 3977, -14, 1547, 2226, 404, 1165, 4560, 4742, 3961, 5970, 6544, 4474, 4682, 8508, 6007, 601, -2846, -1566, -1591, -3035, -1211, -443, 1856, 5753, 7815, 6756, 6847, 9151, 10651, 11928, 9185, 8414, 9428, 9897, 8802, 7053, 6621, 5517, 8103, 9339, 8282, 7032, 1592, -2327, -801, 2674, 5860, 4779, 4569, 5952, 8989]
14154H989O80K239j22l947k636j636j783L581j807m382J143l121J154J429K81
14139F2L206L252K509k278k146l016l13N088O01j462J261j323r69j525q91j316
14123G40o77M937m02l239j04M257L355P53k307j420k287j940j05Q70k03q05J202
14106B625N02J476m739l432P82M455k07m996L705O00l257K355J914J068K128J30
14090E109j63J66j418k795J918K69k886k142J40Q01L407L73R71J028j422j481
14074A875q5J3L806n22j002p68j918J660j868m629l30O28L859j540j4k29M497
14057C433K610P51L96l129r53K937j672k573j525J513p49K3M74j39m475l62KJ481
14039a957K142N79R50m334l649p25M521J730O97J709k093m542j907N607K282J618
$$ y = [8989, 9669, 11908, 11786, 7839, 5203, 3567, 1784, 5365, 3558, -824, 319, -2802, -1648, -219, 62, 3268, 6520, 9029, 6751, 4605, 1589, 1276, 6364, 6965, 5503, 6764, 5441, 4472, 2947, 2056, 740, 63, 5000, 4598, 1359, 1255, 5512, 8867, 9620, 7313, 5893, 3606, 1666, 1561, 2431, 2228, 1423, 2625, 3127, 4603, -136, -3568, -2786, 1669, 1462, -3534, 171, 771, -2486, -131, 1783, 2851, 4979, 5109, 4946, 5112, 3694, 899, 2817, 3086, 200, -1942, -1802, -1001, 2406, 2779, 3750, 4778, 3356, 1875, 1790, 1803, 5609, 5087, 4085, 3317, 1399, 3059, 1191, -3438, -3768, -3140, 719, -821, -835, -1064, 3433, 6043, 6794, 7190, 4061, 3108, 6045, 4373, 1800, 275, 1788, 1039, 1062, 1536, 1397, -3078, -3440, -3438, -1957, 185, 764, 1714, -2620, -6269, -6994, -2473, -743, -46, 1663, -430, -4972, -6879, -1272, 1010, 2628]
14023B628M268j923j667k160j380o47J364j092p54j772P32M516K745l351l422
14008a915k559K879K493k547k329Q78p7M39K130l009j040L334o13p02J427l892
13992e103j259J699R81J974J233J499J710j077j738K185J902K1n173l48L50j589
13976b733n45o2J905O92Q51k598n325k797M5j877l5K942K316J028L420L892K259
13959C378j540j686J728N26j705J21l143P06L585L070l00K02m039l499l68j251
13943d215j216M27m91L450J08J54j915O58K774Q73p13j134j800r25j68N02J125
13926b506M96k773R59P93J433j590Lj78K254L683K763m93J374M82k394n548J397
13909A55K84L51o51j907p35j938j174J885l56L77P81k97l186q28n21r50m07P69
$$ y = [2628, 6896, 4973, 3306, 1146, -234, -881, 483, -609, -1363, -3135, -2403, 2113, 4858, 1507, -1915, -4474, -1595, 898, -1649, -3978, -3100, -3177, -2738, -608, -3617, -4657, -1323, -1936, -2638, -1211, -5103, -6362, -4663, -3682, -1708, -475, 1024, 2734, 1657, -81, 2104, 4006, 4027, -1146, -1494, -1144, -2733, -3278, -3340, -1435, -743, 108, -2490, -7815, -10612, -10567, -12444, -12479, -9537, -7221, -6193, -2773, 1119, 3378, 1838, 152, 1880, 2406, 701, 822, -2321, -1615, 1970, 5040, 4740, 4942, 903, -2596, -2964, -4215, -5431, -5004, -5495, -2045, -1937, -1783, -3698, -3040, -266, 607, -106, -1240, -3040, -3965, -4133, -3631, -2506, -2010, -4783, -3824, -3031, -1598, -3188, -3185, -3363, -1109, 2574, 5337, 4844, 6218, 6700, 4306, -1242, 155, 439, 790, 139, -1768, -2503, -4441, -5615, -3730, -4086, -3709, -2928, -3225, -6411, -7239, -7760, -8710, -9117, -8348]
13891h348J911N31N01j960J90J160pK42M45R65L113K158J135k238j056m393j421
13874g072R54J560j42j25K276J072l472n55j558N36k30o81J913K026N192O85l490
13857a111k45L026l919j299n160j302L758L250n08L272K031m996l700r47j591
13842i441Q0J042K195K726J753n35j345q95j581j457k251K139J752L81L09K18
13826d910j976J668J913l08k006m91J335P16Q28l78m078J316N86J058j905k335
13810h967k01J920j561J920K434J955M300k160O99k864j897k242K40O065j115
13795a474k802k550O44L024j055k797j70K908J714N89J634j203l483k766l684
13780a1471l31R23L291J806j283k514j097L830k14J328L374J327k833j329m73
$$ y = [-8348, -6437, -5906, -5405, -7365, -7175, -6015, -6022, -5780, -5335, -4370, -1257, 901, 2036, -202, -1258, -5651, -7072, -6118, -4558, -4700, -4825, -2549, -1477, -4949, -5504, -7062, -6526, -6756, -7437, -5524, -3498, 1694, 2379, -1111, -1356, 1670, -2249, -3548, -8708, -10010, -6252, -3002, -3510, -238, 1793, -3203, -6903, -7850, -9441, -9361, -8319, -6124, -3398, -1645, -2180, -3525, -4420, -6001, -7458, -9709, -7570, -5818, -5437, -5128, -4910, -6886, -5218, -3305, -3613, -5619, -6110, -4775, -4059, -3231, -3609, -7687, -6371, -5785, -4727, -6632, -8967, -9168, -7248, -8809, -6889, -4455, -2500, 1800, -360, 339, -2525, -4422, -6664, -6424, -359, -1474, -4276, -6826, -6182, -3158, -4213, -7010, -7180, -4272, -2558, -1969, -335, -1538, -5021, -7787, -11471, -11802, -10879, -7588, -5782, -7065, -9579, -10676, -6846, -7060, -5732, -2358, -1031, -3864, -5193, -5666]
13765e666L113K377K021l074m484K86n43k547Q02K790n26k369k252J090R03j849
13749i928J446K774K967M54l024l696J120l29J467J783l014j436j203j817k83
13734a2719K51K520Q75L423J296J635J717k192o01j59k604l399j190N328K184
13719c635J276j837j164P37m99K445P28J372Q69j350O96P24l451k57J829j556
13703c073P58M11k04J295k769m097M55R19n609j124L196L522J010O73n77l183
13687h397R6o42J010o38j762k722o43J527K129r57k485L459L890L226K641j303
13671a571K138K515k815l693K308R66k326k518r26k815o94j064m21J719M90j771
13655a0478L45R59K601r05j981o55L827N61m750r11N865O81O91l658o09K702K498
$$ y = [-5666, -2553, -176, 1845, -1229, -5713, -5427, -5970, -8517, -7715, -4925, -5451, -7820, -10072, -8982, -8079, -9928, -8482, -5708, -2741, -2287, -5311, -9007, -7887, -8216, -6749, -4966, -7980, -9416, -10619, -12436, -12719, -12468, -9948, -9073, -5650, -4354, -2719, -1002, -3194, -3795, -3954, -6558, -9957, -11147, -5819, -3635, -2359, -4196, -5360, -4623, -5122, -2677, -1949, -577, 292, -1058, -362, 362, -3089, -3346, -1517, -3073, -2315, -1904, -2108, -813, -3582, -7679, -7224, -6305, -11914, -13038, -9842, -6320, -5310, -4637, -5214, -8397, -8301, -8943, -7933, -8571, -10333, -13055, -13698, -12171, -10042, -10999, -13484, -10025, -6135, -2909, -268, -1571, 567, 3082, 267, -3426, -1118, -152, -2478, -4996, -5922, -8737, -9431, -10495, -10916, -9197, -8707, -10478, -10133, -9174, -6573, -7478, -9459, -10114, -6287, -5726, -10476, -11387, -5522, -4841, -4150, -7808, -8417, -5715, -3217]
13638c217o56j535l072K533l66k185l639j236N869q97l551K476k802L628K053
13623f597J440K26r3J40r9J443P10k349m176K04K31J630Kj145N49N09R99l783
13605a0159r78q4K073M24L393J172l845J852J433k019o490l03j532K30K111K059
13589a0663k05N797J006k065m313K21M39L85J383J649n397q3L766J73j56N01p74
13572h336k47P28Q30p40j427j770l95j510l75J638J704J332n20j407J961J848
13556f686j606J09R81O96m04j66O94k227q39J405m3J443j029j311j938K029K044
13539f848j333l384j356j005N22J574j398n18L961L848j723l67K667N72j658k244
13523h690q31j558o0n98o47l379k062N746N715K150k854J151J204k941o23R46
$$ y = [-3217, -3873, -5408, -8480, -5947, -6313, -8498, -12137, -13373, -7504, -8401, -11952, -9476, -12278, -8650, -6597, -5157, -4931, -5024, -4884, -4983, -3540, -2830, -5179, -9355, -9151, -8920, -7290, -7288, -8433, -7884, -7375, -6376, -10159, -11137, -11221, -9148, -8724, -5331, -4159, -8004, -6152, -4719, -6738, -13228, -13531, -15063, -14833, -12722, -10663, -10868, -5071, -4065, -6130, -10443, -10222, -9783, -9398, -8015, -6366, -11763, -11846, -8080, -7907, -8063, -7562, -8336, -8583, -7855, -7025, -7765, -9192, -10962, -11357, -12867, -13242, -11604, -9900, -8568, -9088, -10495, -8534, -6686, -8292, -8183, -7202, -6506, -6910, -7076, -6382, -8609, -9448, -8043, -8086, -6643, -7672, -8983, -10921, -8892, -6848, -8181, -11565, -12921, -13926, -13404, -11830, -13228, -13746, -9785, -5937, -7660, -8027, -5360, -4788, -6446, -8690, -9521, -11079, -11139, -11737, -12384, -15763, -17825, -12079, -6364, -4214, -7068, -5917, -4713, -7654, -8277, -7331]
13507g331k44P14k797K07M97r08L875M787j98M0l574n770J416M579L449q08m529
13490f595K241q14j783p3j986l922P22K746k33M48j789L704M52O72l470j230L276
13473g634K394R72q2l255m400q98K100J783J740l536j47k412J958J929j901p93
13457a2182J53o57Q59J641j411q59J738J078q02K968j664k326N18J534o8j183
13441a0663J032j366k261L028L072o62N21K423k49l000l485K19j518K695K629
13426g585J693l88j400l22k963K41j124k985J391N733p84r07J964P62J607L848
13410a219j55l001N45Q47J088q57n89J54k263l367q96m92K400M618r96k012o90
13393f885j860j555r7K07j80L56J269m513j722L335M044K866j217k506K763L5
$$ y = [-7331, -7575, -6861, -9658, -9451, -8954, -9862, -5987, -1200, -1398, -1358, -4932, -10702, -9286, -4707, -1258, -2066, -6595, -4354, -5168, -6951, -7024, -9010, -12932, -12210, -9464, -9697, -9249, -11038, -7334, -6882, -6210, -9680, -10910, -7634, -5240, -4268, -4350, -7605, -12005, -12903, -10803, -9020, -7280, -10816, -10963, -13375, -11417, -9488, -11389, -12182, -12029, -12686, -11827, -10186, -11597, -12456, -10718, -9640, -10442, -7474, -9138, -11464, -10946, -9412, -9480, -10663, -9631, -10997, -13258, -10230, -7158, -7820, -7299, -4876, -5125, -8125, -11610, -11391, -12909, -10214, -7585, -5892, -6280, -7680, -8002, -10965, -10724, -11848, -14833, -13442, -7709, -8493, -9400, -7436, -6674, -5067, -1219, -1374, -4375, -3830, -2983, -1895, -2752, -3341, -3187, -5450, -8817, -9713, -10205, -7805, -3187, -4183, -6195, -6885, -8745, -10300, -10397, -10190, -10370, -10014, -8745, -13258, -14980, -11645, -7601, -4735, -5952, -8458, -5695, -5660]
13377e660j007j789k053r80K514K256n27j109j575J882k985j413K072K863J853
13362e658J196j025j922L421P74j324J29M62j084K513K901k333k132R6J041J984
13346i61k389l636j110J894r67J397k009j120L946L701j607m629m841N59K404
13331i368K468M334j11j943o674m135j241M109K794J25n155k825K537L262K806
13316i017J8M17j912j685M296N246j721m318J242N17p23J306j029L71l82j901
13300i275j75L195J187R02J320Q79m118k763k29J708j997m764k74K734J472O62
13284i536P40k991j059l657M570O445K19l075J014L694M09J87j265K167k608l208
13268g954p19K781j734K92R86K396L66k364J020k068k876K02K176J14R94j235
$$ y = [-5660, -6667, -8456, -10509, -11489, -8975, -6719, -7246, -8355, -9930, -8048, -11033, -12446, -10374, -7511, -5658, -4462, -5487, -7409, -3988, -3214, -4538, -4409, -3947, -5031, -2518, 383, -1950, -4082, -3986, -2945, -961, -3350, -6986, -8096, -6202, -7169, -5772, -7781, -8901, -4955, -1254, -2861, -7490, -12331, -11772, -9368, -6900, -2566, -2677, -4620, -11294, -15429, -16670, -12561, -9767, -9642, -14797, -17622, -15085, -11823, -9017, -8999, -8582, -10494, -12179, -7883, -2637, -4358, -8676, -7434, -6917, -7640, -6334, -7363, -6992, -7374, -9275, -9450, -6255, -5068, -4166, -2846, -1967, -6085, -8848, -9077, -7369, -9366, -14130, -14404, -11670, -10198, -9536, -8796, -11787, -12846, -16503, -11933, -5488, -5269, -8344, -7330, -3636, -3227, -3040, -4305, -2138, -4746, -7954, -8673, -5892, -7626, -7334, -6348, -3952, -3586, -5950, -4930, -6998, -9874, -9672, -7496, -7382, -6388, -7623]
13252g623J284o63j195J678L1mr82J584k193m629K182N481Q86J962k31j605j94
13235d231q4k251L973m175k593J832J522k75l016k867K72j410L376N388J633M54
13219b452r85k084k584r44j144K271k216N91L471L460j740k872M447K129M77j144
13203a319o24n88n613p98M336L812k70l477J984J630l239k151K07j464r47o6k468
13186a1055j5L12k16p36M277J694l264m618J845J763l95J562K415J036l876M53
13170h818j824l130j82L137J341J509j200J686K278r18N1j373j77k58k02J843
13154f237K098J047l726K008N15j776j685K81L086o536n170k6k61K776K856J169
13138i581k649m77Q12j337k04K626J926P30j561K830K686k053j293n044k191N325
$$ y = [-7623, -6339, -7002, -8197, -6519, -6488, -6492, -7474, -5890, -8083, -12712, -10530, -5049, -4163, -2201, -2432, -4037, -4231, -4315, -6566, -2593, -6768, -9361, -7529, -6007, -6282, -9298, -12165, -11893, -13303, -9927, -4539, -2906, -2452, -3437, -5521, -8105, -9049, -10193, -7922, -10138, -9547, -6076, -2616, -4356, -7228, -2781, -652, -175, -1319, -1943, -2531, -8144, -8942, -4606, -794, -1064, -4541, -2557, -927, -4166, -6317, -6110, -7574, -8521, -8587, -11055, -11070, -10758, -10974, -11710, -7433, -5739, -9003, -13621, -11776, -10013, -10408, -8846, -6431, -5395, -9271, -8818, -10642, -13772, -13954, -10817, -9476, -7967, -9167, -7481, -5203, -6121, -6070, -7443, -7620, -7878, -8080, -6237, -4139, -3092, -6818, -4810, -4295, -6071, -7756, -7475, -4389, -10925, -16095, -16121, -16382, -13606, -10750, -9581, -12230, -12707, -11895, -13232, -13436, -10810, -8884, -8154, -9715, -6885, -4199, -6252, -7545, -12589, -14780, -9455]
13122i455o08j082J330K7J053J32M763K472m196p364j789K430K980J91J59K88
13106h669J542J978k009N40r04P84j95J450J207K735L921j15l492k235n84j820
13090e866l382k726J432K541K055O80l245M35J569j619m63P73N316k607L06j219
13074f020l947l44K872M676l17j612l401n0q52l62J089K197K19L336J147q08j210
13057c387J762J065P21j389m04K450k47J676O039P67q89j478l626n77K321l003
13041A801l168K82K55n183m868J792L306J685j469R16K856P97J366K38j210l213
13025c817k37m113l068P67L671J648j193j199l478n53j133J423j27l714J550L261
13009a0312L781K537O01k96j368K233N738K594L76J185l276l330j305R58n41k617
$$ y = [-9455, -10063, -11145, -9815, -9788, -8735, -8603, -3840, -1368, -5564, -12928, -14717, -12287, -9307, -9116, -8957, -8669, -7127, -5149, -7158, -6618, -7522, -6738, -6933, -5483, -4276, -1541, 2380, 2265, -1227, -3462, -4046, -5866, -9248, -11974, -10542, -8001, -5946, -5266, -8511, -8076, -6507, -8126, -8589, -7816, -2500, -5107, -4801, -6020, -9967, -10311, -7439, -2763, -3080, -4692, -8093, -8143, -8995, -9357, -8268, -6071, -5852, -2516, -1369, -2177, -3387, -1625, -560, 161, -1228, -1632, 818, 571, 2247, 8286, 9053, 8164, 6686, 3060, 2483, 4804, 1801, -1367, -1085, -830, -6013, -10881, -9089, -5783, -4098, -5567, -4651, -1795, -998, 368, 606, -604, -3817, -4054, -8167, -11235, -10468, -6797, -5149, -6342, -7541, -11019, -11572, -12705, -11282, -11409, -15123, -13573, -10312, -6531, -3994, -3393, -3689, -5057, -2824, 2914, 5508, 5884, 7069, 3793, 463, -842, 116, -425, -3042]
12993c042j652K99P96K932K726k83m877k304k416j753j221J337p36j21K022J528
12977f765n8K733J55J051M87k106j38K130q80m771j032q6j466K394L371Mp8j389
12959f444j2J438K167j185K223J62p09l198k147K991o10O80L084O01l209k846
12943g014k548J494j911K390J10m482M77J259J41L559J717k122M75O25k580o098
12927a4508J736N782J978J348n586l625K069j310j06K26r74L85L441J815n747
12912a3076R7N829L567l562m708j610O28K209M299J328n400k295k50l69j135o92
12896a5140nN710J034m835j278M623J214j525k266j127n34K399K446l667k656
12881a5607j301j870q66r59J466L667L32RQ3M11j98J438L47L30k300P47L658J119
$$ y = [-3042, -4694, -4395, -3599, -667, 2059, 1776, -3101, -5405, -7821, -9574, -10795, -9458, -10194, -10315, -8293, -6765, -6823, -4090, -3935, -2884, -2397, -4503, -4641, -2511, -3391, -8162, -9194, -9280, -10746, -8352, -4981, -4977, -5055, -6444, -6456, -5018, -2851, -4036, -1813, -1651, -2360, -5558, -7705, -4714, -5324, -4644, -1560, -959, -4168, -7014, -9562, -8068, -9979, -7589, -7479, -11961, -11484, -10225, -10084, -6525, -4808, -6930, -6455, -5830, -8410, -14508, -12772, -6990, -5012, -3664, -9250, -12875, -10806, -12116, -12222, -11996, -12970, -12585, -9144, -7329, -13076, -12979, -7150, -3583, -7145, -11853, -13463, -12835, -10626, -6327, -4999, -10399, -12694, -12944, -13313, -14448, -15140, -15145, -9435, -8401, -13236, -14514, -9891, -8677, -10202, -12468, -13595, -14129, -11730, -9284, -12951, -15607, -16908, -18778, -19644, -20603, -19137, -15470, -15138, -15129, -15046, -14635, -14833, -13395, -13048, -12718, -15018, -14271, -10613, -9494]
12863i494q57k880j62J08n35K395R62R68l379m005K527J960J841R91m256l395
12847a7211J012L271J976k712j07J025K548J066K0J159m2n12k346J064M009P73
12831e007J228K23j99l302j277N466k24k745j524j90k762R26K35j229L515L044
12815c822J770j172J034K51l161K783P11k28p89r77q99k07J344j604n60M125R52
12798d49m857p29l225k977M57J7O67J522o8j227Q26J852O64k515o68N79j821L72
12780a1580L700J198J538J219j983J065J346kj772j222q08m255K63J664J646j439
12764i422J1j915n088k911N59O500O20M45L328K043K88k825r6K232p30k296J466
12747g791j08l3J53j062j061L44M50K90j449J002L752M032K505k475k048J656
$$ y = [-9494, -10351, -13231, -13393, -13285, -13820, -11425, -10463, -9495, -12874, -16879, -14352, -12392, -10551, -9560, -13816, -17211, -16199, -12928, -10952, -13664, -13771, -12746, -10198, -9132, -9112, -7953, -7995, -8507, -10853, -9789, -5780, -5007, -3779, -3556, -3755, -7057, -8334, -2868, -3092, -5837, -7361, -7551, -10313, -9387, -9152, -10381, -6866, -3822, -2052, -3224, -2190, -1939, -5100, -2317, -1606, -1834, -2623, -3600, -4499, -4706, -3362, -4966, -5526, -1401, -449, -5306, -6035, -9260, -12237, -11780, -11763, -11096, -9574, -9642, -10869, -10043, -8191, -7527, -10042, -10710, -10131, -11952, -11580, -7880, -6682, -5144, -3925, -5908, -4843, -3497, -3499, -5271, -6493, -7301, -11556, -11293, -9629, -7983, -9422, -9411, -11326, -16414, -19325, -18766, -12266, -11646, -11201, -7873, -5830, -5542, -8367, -8463, -6231, -6961, -9257, -7791, -7899, -7932, -7779, -8841, -9902, -9558, -9108, -8818, -10267, -9265, -5513, -1481, 1024, -1451, -3499, -1843]
12731a843L211j324l997l169j439k862K411K917J887r17r18j530l84k629j426
12716a2012o58L520N261J845q61j47r3q07J315j16k683l821k750J310M87L564
12700f646L76j381J573J365o670j874K808M139L111K956j770m000N43O68J781
12685c021J618j431k84q49m76l399j121j93R88k31O51K00L312J820K39j120k7
12668c324J136M054n025p974k408j71Q14L844M213R43j422o00k15K279L98k906
12652f364p28N62K31r60J215Q091L567k075l984j150k758r24j371o88j197k036
12636a0569P54K464M96K116l03N62j798k440o28J072K96Q33J85k470K81K421J426
12619e302J180k439k532L380M77j167N94r06l133o97L291J198Q17K381k881l449
$$ y = [-1843, 1368, 44, -3953, -7122, -8561, -11423, -9012, -6095, -4208, -5125, -6043, -7573, -7957, -10586, -12012, -12670, -9150, -3889, -2044, -2905, -3052, -3145, -3952, -2637, -2753, -5436, -9257, -12007, -10697, -10210, -6646, -6270, -7651, -6078, -4713, -11383, -13257, -10449, -6310, -3199, -243, -2013, -6013, -5470, -4802, -3021, -1403, -2834, -3118, -3967, -4443, -7842, -8963, -9156, -8168, -8399, -7748, -7548, -4236, -2416, -2177, -3297, -3324, -2188, 1866, -3159, -11133, -13541, -13712, -12898, -9054, -4841, -3898, -5320, -5920, -6135, -3856, -3458, -6364, -7092, -6530, -6299, -7259, -6044, 2047, 5614, 3539, -445, -1595, -4353, -5277, -6648, -7336, -8533, -10569, -9815, -7351, -6855, -4739, -5042, -4480, -6278, -8718, -9346, -8274, -7978, -7145, -6960, -9430, -9149, -6728, -5302, -4122, -6561, -9093, -5713, -5236, -6403, -5809, -6715, -9848, -10545, -7254, -6056, -5239, -2858, -5739, -9188]
12603i188j274N924L296m481m141r88J275r98j185N64m70L271K042k416q29j488
12587a1086q26K244m066k116K294J106K633J462k866j401j727j114l4M55K849
12572a2193R58K451L055l5j829k38o16k884k159n526l935J109L304K240K88k89
12556a6299k454j279L725K260K337j763o278J488L975K329r68l183k05J181P95
12541a4339j559K229M481N045l201n179j840j841l083k211M31O77M088k09p47
12526a7258O8j223j46J077o77R3J257K455m47j80M02l188j708k526K698M522K025
12509a2756o97j213j352J076N02K26J929K281j150L36r36l432K395L56j552K275
12493a1712K033L13j194k258j352J876P36J029J028K662l677m359p16P69p30j004
$$ y = [-9188, -10462, -4538, -1242, -5723, -9864, -10852, -9577, -10575, -11760, -11196, -11666, -8395, -6353, -8769, -9598, -11086, -11912, -9668, -13734, -15850, -13556, -12450, -9817, -8355, -11221, -12622, -14349, -15463, -15497, -15042, -12193, -11235, -8784, -5729, -5764, -7593, -7831, -8447, -11331, -13490, -19016, -22951, -21842, -18538, -16298, -16010, -16299, -18753, -20032, -16307, -14047, -11710, -13473, -19751, -18263, -14288, -11959, -12927, -16110, -16315, -15134, -14339, -15898, -13669, -9188, -4143, -7344, -12523, -14363, -16204, -19287, -21498, -21067, -20390, -16302, -16511, -17258, -17190, -18413, -18559, -17482, -18159, -18066, -16809, -14354, -14801, -14981, -14579, -17767, -19475, -22001, -19303, -14781, -12756, -13453, -14666, -16018, -14942, -14440, -14214, -12285, -10004, -11154, -10818, -11754, -15186, -12791, -12435, -13987, -11712, -9679, -9366, -10560, -12818, -14170, -12294, -11558, -10529, -9501, -6839, -10516, -14875, -15591, -14822, -15552, -16556]
12477a6556m2K342J608q72l119J372J035k521O68J101k078J77K276q47j433j892
12461a8781j410K992R66K278Q67m443l480P99%J585K622k04Q09K340K311j166
12445a1915j931K259L010o50j111K3Q10m393q83M28J365M84j272m181L527M570
12429i860j38J33j245l512J015j847j455l35M355K077J435n25J066n78k371n08
12413a2293j40j615mJ645l385l01M289J727k997k895l158m316L297N117K029l767
12397a6767j371J718k108J981J807J536q18l359J447q33J85m70K473k14r93K115
12381a3671j288k830o94n36l614j231J562K137j048K941M166K882k006q94K981
12366a1143p08o348J9M593L87J998O87j336k294k975k916m531m07J912K370R8
$$ y = [-16556, -16598, -14256, -12648, -13520, -16639, -15267, -14232, -16753, -16085, -14984, -17062, -16885, -14609, -15456, -16889, -18781, -20191, -17199, -16233, -13955, -13088, -17531, -21011, -20212, -20212, -18627, -16005, -16209, -15400, -13060, -10749, -11915, -13846, -11587, -8577, -9227, -10338, -10315, -9505, -13898, -14781, -14353, -12988, -12504, -13776, -17957, -14430, -9860, -9998, -9865, -11110, -14622, -13607, -15454, -16909, -17244, -12889, -10812, -9377, -9902, -8836, -9414, -11785, -12293, -12433, -14048, -14052, -12407, -15792, -16093, -11804, -10077, -13074, -15969, -19127, -23443, -20146, -15029, -13000, -16767, -18138, -16420, -18528, -16547, -14740, -13204, -14022, -17381, -15934, -16767, -16582, -17052, -14579, -14793, -15786, -13671, -14959, -17789, -18483, -19019, -22633, -23864, -22302, -20165, -21213, -18272, -14106, -11224, -13230, -14124, -11143, -11851, -18199, -18180, -13587, -13200, -11202, -10515, -11851, -14145, -17120, -20036, -24567, -24974, -23062, -20692, -20594]
12350b0594J685K647J639l087k941l152J120L194J208Q63j053L64L580j021l501
12335a9049k35j136L721M388K468k430M45l33m243K652J523K716J77P4P88J798
12319f676J773N02k210j665k655j097M85o08K471J408L402R68L808M719L940O625
12303A5190N374J7320K9474M6975Q0650J42700K04433J42392P26q7240j51133
12292D46861j49647r9212n6835l4072k5363j7647j1161r048q049j592m828r019
12280B0388o473o111n489k498J602M25K374K55m63q96m54J737J813L029M307O195
12264A9741N899P607J2474J3726J9601K9567M0864O7291J12081J90472L36951
12253H56274N53442O07038J92953j77734l87039n05335l87298k27917j33795q5267
$$ y = [-20594, -18909, -16262, -14623, -17710, -20651, -23803, -22683, -19489, -18281, -17418, -18471, -18107, -14527, -15548, -19049, -19284, -20420, -16699, -12311, -9843, -12273, -11828, -12161, -16404, -13752, -12229, -9513, -9336, -9262, -8474, -6676, -4903, -4401, -6611, -8276, -10931, -12028, -11543, -12151, -9680, -8272, -4870, -3902, -94, 4625, 8565, 15190, 20564, 37884, 67358, 114333, 194983, 337683, 542116, 684508, 685234, 597994, 446861, 297214, 198002, 141167, 107095, 81732, 64085, 52924, 43876, 35827, 34235, 29407, 20388, 13915, 7804, 2315, -183, 1419, 1844, 4218, 4473, 4010, 3114, 2660, 4397, 6210, 9239, 13546, 19741, 25640, 33247, 45721, 59447, 79048, 108615, 149479, 216770, 328851, 519323, 856274, 1409716, 2016754, 2209707, 2031973, 1644934, 1139599, 752301, 524384, 390589, 305322]
12243C05322n7104m2066l2865k5361k0563j7055j2794j2663p797q356n680k648
12231F0370m870k683k476k168l08L045K057k537l29k382o29L404O868J0680R506
12216G7548J6128K7603M0544N7126R2288J52845K63902M62144O39154M28313n7410
12205B200185l02364m93413m67698k97658j72020j04713o8190m8749l9228l2051
12195A74101k5355j9630j8873j4250j4772m494l279m743o288r563m217j502l430
12182D3705j015K332k475l151j614R95Q1n99m7O68M882N826J0054J6166K1461
12167I7269L9254P6224J33153K02373J88887L7440p0820j41550j67685j23156
12157B71389p5922m8317k8851k2130j5540j2609q777m854n180n698l017l465o704
$$ y = [305322, 248218, 206152, 173287, 147926, 127363, 110308, 97514, 84851, 77054, 68698, 63018, 60370, 55500, 52817, 50341, 48173, 47865, 50910, 52967, 50430, 50101, 47719, 47090, 50494, 57362, 68042, 77548, 93676, 121279, 161823, 218949, 311237, 464082, 727984, 1190128, 1829282, 2257595, 2200185, 1897821, 1404408, 936710, 639052, 467032, 362319, 294129, 245380, 206152, 174101, 148746, 129116, 110243, 95993, 81221, 76727, 73448, 68705, 62417, 52854, 48637, 47135, 43705, 42690, 45022, 42547, 39396, 37782, 38777, 38858, 38259, 38212, 38880, 43762, 49588, 59642, 75808, 97269, 136523, 212747, 345900, 548273, 737160, 774600, 703780, 562230, 394545, 271389, 195467, 147150, 118299, 96169, 80629, 68020, 59243, 54389, 49209, 43511, 40494, 37029, 30325]
12144C0325p027n004j496k7J071m299K8m56q42m8K896r26l528l493J57P95k978
12127E148k183k233K305O821J556J030L542J444m302o083l235k309J464o02j971
12112C92j182K009N04q78J759l136j987O03P4K763m39k719j78J772J26n233k03
12095e953L230J051k0N94K728q43o01O92q47o65j176P66M168J755K555r63p82
12078E689j503k922j492k527l33N17M53n216m049J998j74N12L42k164P73N85J862
12061g649M926K221j910Q66M525M061K287O53n85m044k852N4M258L248k865k37
12045F957L829K350k268l628l127l126l150q80j727j623Q80J098l935l125O48
12030a0827j04q55k013k485M530J796K749J823K471L324J242k663J547K265M018
$$ y = [30325, 23298, 18294, 16798, 16771, 17842, 13543, 13571, 13115, 12273, 12225, 15121, 14195, 10667, 7174, 7331, 8126, 5148, 2965, 732, 3037, 9858, 11414, 12444, 15986, 17430, 13128, 7045, 3810, 1501, 2965, 2363, 392, -790, 1219, 1723, 845, 2604, -532, -2519, -1916, -1842, 921, 482, -2237, -2415, -643, -517, -5750, -5953, -2723, -1672, -1692, -1098, 1630, 787, 186, 878, 31, -634, -1810, -1044, 3124, 4879, 7434, 6471, 5689, 4186, 1264, -228, -2755, -3088, -2571, -2118, -7334, -11383, -9385, -9559, -9047, -8705, -10869, -10096, -9511, -7649, -2723, -502, -2412, -1546, 2979, 7040, 9327, 9980, 9395, 5351, 2499, 2553, 6811, 10059, 7194, 6957, 10786, 13136, 10868, 7240, 4113, 987, -2163, -3043, -4770, -6393, -5513, -4415, -8350, -11475, -10827, -10931, -11786, -13799, -16284, -11754, -9958, -7209, -5386, -2915, 409, 1651, -1012, 535, 2800, 6818]
12015F818J086l418j837J845K98k519N9K354k815k853M881O099K421L725j926
12000A4218k198l482l274k738m957l296j361L381M39j240J767j256p501l714M396
11985a0816M089N241K072N543J359o89k243o24J657k861n269j991L027J525J856
11970A876J838N077r35k481k171m114n762j277N033K465j653l023r94K431k164
11955e854J241j484K46L082L514J659K638m52m546n369r21L245J720j046n683
11940h010l00O75J473q19K388K713k206m812O40K164j945L66L429N524O619L200
11924A1099k296p679q557m422k189J159J784M37l193l555Q37M172N389o13L29
11909g298K404K728M203J462K011m194n601N34j640l720j288j123k537n43M340
$$ y = [6818, 7904, 4486, 2649, 4494, 4792, 2273, 2332, 4686, 1871, -982, 3899, 9998, 12419, 16144, 14218, 12020, 8538, 5264, 2526, -2431, -5727, -7088, -3707, -3268, -4508, -2741, -3997, -11498, -15212, -10816, -6727, -1486, 586, 6129, 7488, 6799, 4556, 3932, 5589, 2728, -2541, -4532, -1505, 20, 1876, 3714, 8791, 7856, 5375, 3204, -910, -6672, -7949, -2916, -451, -2104, -5127, -6121, -3690, -5854, -4613, -6097, -5851, -2769, 745, 2404, 5042, 4590, 44, -5325, -6246, -3001, -1281, -2327, -8010, -8310, -7635, -6162, -6981, -4593, -1880, -4086, -8898, -8258, -6094, -8039, -7673, -4244, 1280, 7899, 11099, 8803, 1124, -7433, -11855, -14044, -12885, -11101, -10664, -13857, -17412, -16575, -12403, -7014, -7627, -7298, -4894, -2166, 2037, 3499, 5510, 1316, -4285, -3751, -5391, -9111, -10399, -11522, -14059, -14602, -10262]
11894a0262R81J864K456m935j403j739K80R99O86j888J069K167J085Q70o9k530
11878a0369Q12j594l324L408L218p05M35j026q69j118j780L11j530J438K318M3
11862a0332j69J531J634o59m780l97m80k427o30j140K973L528L290K671m15j227
11846g029m252l83O11M01P68L397n58j700j624n29k857j874j692R5J279M547P913
11829c487M878k899m935n543n321J40K886M545o41j728K276K007k696j999K737
11814i780J210q40J084K203j298k159L448M023L205K020P21k2op32K80j094n81
11797A682j27r68l58k904J639n301k817O69k477l705k520M071L698m96q47M504
11781f257J31p87k568j318n83R02K030p45j570K510J211N85l289m147M08J050
$$ y = [-10262, -9281, -7417, -4961, -9896, -11299, -13038, -12758, -11759, -11073, -12961, -11892, -9725, -8640, -7770, -7839, -10369, -9557, -11151, -14475, -11067, -7849, -8554, -8119, -9145, -10014, -11132, -12912, -12601, -14131, -12693, -10375, -10332, -10501, -8970, -7336, -7995, -12775, -13172, -13652, -16079, -16709, -17849, -14876, -11348, -8058, -5387, -5802, -7029, -11281, -11664, -11053, -10652, -9884, -6487, -7045, -8745, -10369, -10898, -13755, -15629, -17321, -17226, -15947, -11400, -3487, 1391, -1508, -6443, -11986, -17307, -17167, -14281, -9736, -10377, -12105, -9829, -7822, -10518, -12517, -9780, -8570, -9410, -8326, -6123, -7421, -9580, -6132, -2109, 1096, 3116, 3837, 3815, 3809, 3077, 3357, 2263, 1682, 1555, 587, 229, -2675, -1036, -6337, -9154, -8485, -10962, -14667, -17187, -13116, -9418, -9914, -10761, -6257, -6126, -6913, -9481, -10799, -11382, -10480, -8450, -9195, -10765, -8255, -7044, -6459, -9748, -13895, -13487, -12437]
11765a2437K58R78r05K82O585O475Q50j007k540n502k708n87l298Q68O05l075
11749a5158N2J385J97r59L955N124m19J578R886J3561J2686K66k185j1581r384
11734I004p489k671l293k630M63L963J096j913n92j57P407L267N709J4755L1378
11719E8297M1478J4283p846k1367l3606k6453j1925o562l493j130j03n82m377
11706c386n855k967J531k502q75J980J897L906J901R16J361k398m256n524j140
11691a5411J992J38J673N159M465j388n162n384k135M061R39L8j380k867R71L251
11675a1040J069J194l644n11j038j027L217k218p55M023M356J358Nk51l541m081
11659a2884Pp2p65K849k12L00K201K614j280l837k036j079K1n4L156K625j169
$$ y = [-12437, -12179, -11201, -12106, -11824, -5239, 1236, 2086, 1079, -1461, -6963, -9671, -10258, -13556, -12688, -12083, -15158, -15106, -13721, -13524, -14483, -10528, -5404, -5823, -4245, 5641, 19202, 31888, 32154, 29969, 18388, 9004, 1515, -1156, -4449, -7079, -6616, -2653, -1557, -3470, -4062, -4219, 3188, 6455, 12164, 26919, 58297, 99775, 114058, 106212, 84845, 51239, 24786, 12861, 6299, 2806, 1676, 1573, 991, -3386, -9241, -12208, -10677, -13179, -14054, -12074, -10177, -6271, -4370, -3454, -2093, -4491, -8747, -14271, -15411, -13419, -13281, -11608, -6449, -1984, -3372, -8534, -13918, -16053, -11992, -11053, -11015, -12395, -15262, -14291, -11040, -9971, -8777, -12421, -12932, -13970, -14997, -11780, -13998, -14753, -10730, -6374, -5016, -5011, -5262, -8803, -12884, -12877, -12949, -13714, -10865, -11077, -10777, -8576, -5962, -7242, -11079, -13115, -14194, -14173, -14227, -11071, -8446, -9615]
11642i615k153l70O55K26K249L714L478J169J264k966l940m45k613j805N501J866
11626c785l240k667K050R58n029n956j947k617J381O473R17j578j584J850K063
11611a2711r2n722p28N93j926J670K331J784m18j408q55j062j534J642Q30K946
11595a4660M28j051J646J609l62N28k79q10J89j06N660K184m694r36m348l510
11579a8512j202L734L674L936K286j320l803m315qJ051J569J470l020j809J084
11564a5185k000l59O393P080N273K45k07K11j978n273m386n135l329N454n18j090
11548a4804L969q50j781p32N18k199r19j92K60k639l724l338M931L167j457m141
11532b3931k193j390p65k202J958N195N618L576J041j484l787J087L832j629p32
$$ y = [-9615, -11768, -12138, -11483, -11257, -9008, -5294, -1816, -647, 617, -2349, -6289, -6734, -9347, -11152, -5651, -3785, -7025, -9692, -7642, -6684, -11713, -17669, -19616, -22233, -20852, -14379, -13462, -15040, -16624, -14774, -12711, -12803, -18525, -19253, -18660, -20586, -18916, -16585, -14801, -15219, -16627, -17482, -18544, -20078, -18436, -17606, -14660, -14232, -15283, -13637, -12028, -12390, -11862, -12141, -12951, -12762, -12868, -7208, -5024, -9718, -10654, -15002, -18512, -19714, -15980, -12306, -8370, -6084, -7404, -11207, -15522, -15530, -14479, -12910, -11440, -14460, -16269, -15185, -17185, -17544, -11151, -4071, 1202, 1447, 1240, 1451, -527, -5800, -10186, -15321, -18650, -13196, -13714, -14804, -10835, -11685, -13466, -14198, -13680, -15879, -16798, -16990, -16730, -19369, -23093, -26431, -21500, -18333, -19790, -23931, -26124, -27514, -28279, -30481, -28523, -23328, -17710, -14134, -13093, -14577, -18364, -17277, -13445, -15074, -15806]
11517a5806o97j276J80j485L842K126J186o70P45J313L545Q758J8566K5134K1051
11502F6512K0296Q777l197j2186j6466k0695j7750j3791q950p079k698k196j465
11489a0888j324l11M460J883k119n76J327j518l97j43J151j282j405P38l48J079
11473i673P271Q882J1538J7013K0012K0657J3833O350J136j0143j6059j8253j7657
11460C4907j4150j0605p339j935K683J848l300p46K414P550N890k544J520Q51
11446A7044J327P49j84k315K662L73J282M044q75k45l17J168P75l411j77M726
11430B6626Q220M891L841l15M575O933Q639P892J5222K0193K8037L5876L3524
11417B04154J5693l565j7537k6443l4048l4410k7053j6348r789o232J94l241n006
$$ y = [-15806, -16503, -17779, -17599, -19084, -15242, -13116, -11930, -12600, -11855, -10542, -6997, 1761, 20327, 45461, 66512, 86808, 95585, 92388, 80202, 63736, 43041, 25291, 11500, 2550, -4529, -7227, -9423, -10888, -12212, -12523, -8063, -6180, -8299, -8875, -7548, -9066, -9463, -9606, -8455, -9737, -11142, -10404, -10752, -9673, -2402, 6480, 18018, 35031, 55043, 75700, 89533, 95883, 97019, 86876, 70817, 52564, 34907, 20757, 10152, 2813, 878, 3561, 5409, 2109, 1363, 3777, 11327, 17217, 14673, 16193, 17044, 18371, 19120, 18936, 16621, 19283, 19656, 20938, 24982, 24107, 23862, 23545, 24713, 25488, 22077, 21900, 26626, 34846, 39737, 43578, 43263, 47838, 54771, 63410, 71302, 86524, 106717, 134754, 170630, 204154, 219847, 216282, 198745, 172302, 138254, 103844, 76791, 60443, 50654, 44422, 44616, 41375, 36369]
11404C6369n594m901m181o143j07L174L10J050J723n458k884j153n95m939k58
11389F413J139N894J7156K8450L3473L7476L3280J9980K504j4946k3679k7681
11377A19459k6179k0825j9011j1220o876k280j951l776J1q05N83q89k763R42J225
11362B5645J059J297N2K084L016L422L588P34K432j13r29j218k663J021J318J617
11346D2362J565l740k883k145n274p114n912l422j338K646K739N525L317l864
11332B2462o357k372K069j46o18k285K620K05k577m641n143m232l239m292o277
11317a4823o087n485l66J620j593P72J629Q105R884J5655J6325J8636J2072J787
11303E8131j5522j8065j6051o328m655n401Q61l060j253k732J188k295n92O67
$$ y = [36369, 30775, 25874, 21693, 15550, 15443, 18617, 18927, 19977, 21700, 16242, 13358, 12205, 11610, 6671, 6413, 7552, 13446, 30602, 59052, 92525, 130001, 163281, 183261, 185765, 170819, 147140, 119459, 93280, 72455, 53444, 42224, 35348, 33068, 31117, 27341, 27352, 26547, 27130, 26241, 23478, 24420, 25645, 26704, 28001, 28053, 30137, 33153, 36575, 40163, 40897, 43329, 43216, 42287, 41069, 38406, 39427, 40745, 42362, 43927, 40187, 37304, 35159, 29885, 22771, 16859, 13437, 12099, 14745, 17484, 23009, 26326, 22462, 16105, 13733, 15802, 15656, 15038, 12753, 15373, 15578, 13001, 8360, 3217, -1015, -4254, -8546, -14823, -20910, -26395, -26761, -25141, -26734, -25962, -24333, -16228, -6344, 9311, 25636, 44272, 56344, 58131, 42609, 24544, 8493, 2165, -2490, -7891, -7030, -10090, -11343, -14075, -12887, -15182, -15774, -15107]
11289a5107K857M726R571J2724K4160K0252Q123P18j0002j4788j2046p890K323
11276B5621J0527P749k696m994m298j0983q064q380l915j087J831O001R030J5103
11262C1445K5931L2804M0263L5231J7206o937j6704j6986j2410j3262j2160j1370
11250I3051j6774j4769j2511q081r84Q88L067J271M865J7856K0514L0892L9441
11237A58726L1171J3189j0395k1760k9490j7165l776N754P652M609k318j6168
11225A20029k2149k3503j8617j3530n306n00L421J807N649J2437J3041J9769K7021
11212A19569K5778J1076M315K493J680K594k195j0690j6943k2467k4041k0550
11200G0619k1089j7272n372L312n18k709P369J5416K0535K6101J9431M098q849
$$ y = [-15107, -12250, -7524, 2047, 14771, 38931, 59183, 67306, 68024, 58022, 43234, 31188, 23298, 25621, 36148, 43897, 41201, 36207, 31909, 20926, 12862, 4482, 567, -520, 1311, 7312, 16342, 31445, 57376, 90180, 130443, 165674, 182880, 175943, 159239, 142253, 129843, 116581, 104421, 93051, 76277, 61508, 48997, 40916, 39932, 40820, 43887, 45158, 50023, 67879, 88393, 119285, 158726, 189897, 203086, 192691, 170931, 141441, 124276, 120500, 126254, 133906, 138515, 136197, 120029, 97880, 74377, 55760, 42230, 36924, 36424, 39845, 41652, 47301, 59738, 72779, 92548, 119569, 145347, 156423, 160738, 163231, 164911, 167505, 165310, 154620, 137677, 115210, 91169, 70619, 49530, 32258, 26886, 30198, 29680, 26971, 34340, 49756, 70291, 96392, 115823, 119921, 111072]
11187A11072j7278j3314q662k302J0279J7083J8657K3002K6505K4023J3168M678
11175B06911j3410k9437l1374k7329k4784j7528j0944o834j280L327M483R701
11163F1502K2870L6289L9512M4756L0596O454k3522m1499m8853m3795l5118k4682
11151B4510j3914p077p584r656r372m281l457l692o54p50M015N4m547m110k576
11136d3091P39K172J556k537j898k040J509L988L005L960O034O722M730M321O781
11121d049M178J312R50M44K407K692J224m524m50j467l624j396N684Q497Q873
11106B0751J4182J8924J4556K1393L0312L1761L1944L2315L9868M7625N5206N9144
11094D17981O3258P3794Q7808J04339J31345J67988K22137L09723M64088P22056
$$ y = [111072, 93794, 80480, 71818, 69516, 79795, 96878, 115535, 138537, 165042, 189065, 202233, 206911, 193501, 164064, 132690, 105361, 80577, 63049, 52105, 45271, 43991, 47318, 51801, 61502, 84372, 120661, 160173, 204929, 235525, 241979, 218457, 176958, 128105, 84310, 49192, 24510, 10596, 3519, -4065, -13721, -23093, -27374, -30831, -34523, -35177, -35927, -31912, -31858, -36405, -40515, -43091, -42352, -40180, -38624, -41161, -43059, -45099, -43590, -39602, -36597, -32637, -26603, -19881, -15151, -10830, -4049, 129, 1441, 2391, 2835, 5242, 7934, 9158, 4634, 4184, 2717, -907, -2303, 3381, 11878, 20751, 34933, 53857, 68413, 89806, 120118, 151879, 183823, 216138, 256006, 303631, 358837, 417981, 481239, 555033, 642841, 747180, 878525, 1046513, 1268650, 1578373, 2042461, 2764517]
11084B764517J174404J923424K959868L850119M131819L526548J546116p51251
11076B1125564k636792l713864l653172k989178k150607j427322r33665o29285
11068B991679m40313l16514k31115j79705j42037j05085q3623o9590n9252m1555
11058A322890j7180J8444N2875R2726J43804K07414L09985M82805P66615J250180
11048D630558K036520L078217L884070M065869L414543J486609p76696k763557
11040A9056133l860217l795777l110837k187855j404562q90628n68873l62207
11032B875177k26728j30070n5863J4895J10829K37347L81882N38298O75818P42811
11022E164396O90122N24453K88707N2708j01318j36846k2368K02155M47697O09942
$$ y = [2764517, 3938921, 5862345, 8822213, 12672332, 16804151, 20330699, 21876815, 21125564, 18488772, 14774908, 11121736, 8132558, 5981951, 4554629, 3620964, 2991679, 2551366, 2234852, 2003737, 1824032, 1681995, 1576910, 1493287, 1423697, 1364445, 1322890, 1305710, 1324154, 1377029, 1469755, 1613559, 1820973, 2130958, 2613763, 3380378, 4630558, 6667078, 9745295, 13629365, 17695234, 21109777, 22596386, 21819690, 19056133, 15195916, 11400139, 8289302, 6101447, 4696885, 3806257, 3237384, 2875177, 2648449, 2518379, 2462516, 2477411, 2588240, 2825587, 3207469, 3745767, 4421585, 5164396, 5854518, 6378971, 6667678, 6720386, 6619068, 6482222, 6459854, 6662009, 7109706, 7719648]
11012G719648O22418M87917K55756L6973p7048l4372J67458M90880Q57745J209209
11002A1736584J537746J897727K402442L263672M633706O077163O750935O274383
10994D4574358L856107L35966k867198n301770o029058n560603m589124l589342
10986B0829336k833251k247356j744869j242157p46653l29635l4585R5655N0402
10977A1796887j36475l73749n78723o55901n53044k94990N3257L91312O40158
10968A0288732P70399Q20700R35328J328893K266759L845268N516329O351470
10960C2123878N891181L317440l81483l788877o135485o462208n433524l796825
10952A5334097k184265j026508l72699j28530j93873m02716o01505o74972n59365
$$ y = [7719648, 8342066, 8829983, 9085739, 9122712, 9045664, 9011292, 9178750, 9669630, 10527375, 11736584, 13274330, 15172057, 17574499, 20838171, 25471877, 31549040, 38299975, 44574358, 48430465, 48766431, 45899233, 40597463, 34568405, 29007802, 24418678, 20829336, 17996085, 15748729, 14003860, 12761703, 12015050, 11685415, 11650830, 11746485, 11796887, 11660412, 11286663, 10707940, 10052039, 9498995, 9204005, 9257262, 9648574, 10288732, 11059131, 11879831, 12815159, 14144052, 16410811, 20256079, 25772408, 32123878, 38015059, 41332499, 40951016, 37162139, 31026654, 24564446, 19130922, 15334097, 13149832, 12123324, 11750625, 11622095, 11428222, 11025506, 10424001, 9749029, 9189664]
10943I189664k92495O1646L72568N53530N49527L64646Q2853j98542l95212m11584
10933I876601k36858Q6886M63154Q19294J053911J098797R77241P03779L28111
10924A5170916m2483l31533m62565l85855j17925K19643M60754N20493L52671
10915A5384116m7668n26227r58843j217225j222203r93224o07588k37552J6080
10906I589666J09661L4299j31602l01033m22345m41081l44732j48273P3325K18272
10896H236157K33352Q2714j97815n12175p79968r33638r55231q73514p31564n78219
10886B990099m34430l22265k43656j88062j55425j30711j18999j10214r6303q0462
10876A109572o7136n6775m8517m6587m0588l5727l5088l0483k9974k7267k8786
$$ y = [9189664, 8897169, 8958815, 9331383, 9884913, 10434440, 10799086, 10881939, 10683397, 10288185, 9876601, 9639743, 9726629, 10189783, 11009077, 12062988, 13161785, 14139026, 14842805, 15170916, 15128433, 14796900, 14334335, 13948480, 13830555, 14050198, 14510952, 15031445, 15384116, 15336448, 14810221, 13851378, 12634153, 11411950, 10418726, 9811138, 9573586, 9589666, 9699327, 9733626, 9602024, 9300991, 8878646, 8437565, 8092833, 7944560, 8017885, 8236157, 8469509, 8552223, 8354408, 7842233, 7062265, 6128627, 5173396, 4299882, 3568318, 2990099, 2555669, 2233404, 1989748, 1801686, 1646261, 1515550, 1396551, 1286337, 1190034, 1109572, 1042436, 985661, 937144, 890557, 849969, 814242, 779154, 748671, 718697, 691430, 662644]
10865F62644k7420k5794k4239k3485k2993k0051j8060j4169j6405j1092p598q226
10853D43112o878m897n257n658p683j0028p868q417r535j0986o030j312m846p560
10839C46157n425j658r702m650Q46n877n822l202l332k693k257n407n582p690
10825B83706o140j841m426p046m328j994j778j963j15Q25j895j024J992J334j309
10810B53998K602m50k876k046L256Q326N896R574Q603K000J184L016M85R08k6
10795B94450J739N307M203K405N223O342N174R867J7375K0463K7321K8621L3132
10782D61622L4955L0873L1943M1034M6225N0148N8172O9423Q6755J05844J32454
10771A149448J68213K09357K62708L23708M12930N49986P75336J147616J762796
$$ y = [662644, 635224, 609430, 585191, 561706, 538713, 518662, 500602, 486433, 470028, 458936, 451338, 443112, 436234, 431337, 426080, 420422, 412739, 402711, 394843, 386426, 376891, 365905, 359875, 358563, 353717, 346157, 340732, 339074, 329372, 324722, 325568, 319691, 313869, 310667, 307335, 304642, 302385, 296978, 291396, 283706, 277566, 275725, 271299, 264253, 259925, 257931, 256153, 254190, 254075, 254900, 253005, 251981, 253973, 255307, 253998, 256600, 256150, 253274, 251228, 254484, 262810, 268706, 278280, 286883, 288883, 290067, 293083, 293568, 294476, 294450, 296189, 301496, 305699, 308104, 313327, 319669, 324843, 334710, 352085, 372548, 399869, 428490, 461622, 496577, 527450, 559393, 600427, 646652, 696800, 754972, 824395, 911150, 1016994, 1149448, 1317661, 1527018, 1789726, 2113434, 2526364, 3076350, 3851686, 4999302, 6762098]
10762F762098K768096M238778N862884O780805O162961L867754M42061k976727
10754C3908710n190161n800716n147482l853686k533165j478789o92381l6596
10746I175734O58795J580097K886469M534458O037167O555418N391049K487532
10738C9306719j228810m479446o272182o384188n359571l930396k657606j768976
10730G225544j205452q60235o45939n09321m14888l41923k97578k71250k48076
10721B430882k26539j97067j61461j32431j26550j15533j08584r6126p8129n9960
10711A128502m8280l0969k2169j9023j6421j6948j7411j7918k042J3475J6342
10700I67138j993j4220j7770j4944r323p200o651o398K257J0380K7775M0974N0993
$$ y = [6762098, 9530194, 13768972, 19631856, 26412661, 32575622, 36443376, 36885437, 33908710, 28718549, 22917833, 17770351, 13916665, 11383500, 9904711, 9212330, 9175734, 9834529, 11414626, 14301095, 18835553, 24872720, 31428138, 36819187, 39306719, 38077909, 33598463, 27326281, 20942093, 15582522, 11652126, 8994520, 7225544, 6020092, 5159857, 4513918, 4004597, 3589709, 3247786, 2950208, 2678958, 2430882, 2204343, 2007276, 1845815, 1713384, 1586834, 1471301, 1362717, 1266591, 1188462, 1128502, 1080222, 1049253, 1027084, 1008061, 991640, 974692, 957281, 939363, 937321, 950796, 967138, 965145, 950925, 933155, 918211, 908888, 901688, 895037, 888639, 890896, 901276, 929051, 970025, 1021018]
10687A021018P3595R6221J18903J50119J97742K73268L82221N62440Q64173J373940
10677E113640K169659L183714M015212M071604L052410J098844j158764k897359
10669A8648960l646426l453215k701779j827971j093478n66091j69886K13982
10661E404096O85964J361805K291417L309698L911918L596924K193572M4765k102955
10652B0697204l498191l841741l373903k536727j722963j126422p55701n34019
10644C307537l96072k99790k24646j72835j60002j69342j69476j55324j33936
10635A426114j11738j04382r7497q8908p9416o5894m9022l7494k7882j4182N01
10624G50200Q744J2006R709J2089K6540L1893K9072M814j1986j6342k4010l6248
$$ y = [1021018, 1094613, 1190834, 1309737, 1459856, 1657598, 1930866, 2313087, 2875527, 3739700, 5113640, 7283299, 10467013, 14482225, 18553829, 21606239, 22705083, 21546319, 18648960, 15002534, 11549319, 8847540, 7019569, 5926091, 5360000, 5190114, 5404096, 6090060, 7451865, 9743282, 13052980, 16964898, 20561822, 22755394, 22800159, 20697204, 17199013, 13357272, 9983369, 7446642, 5723679, 4597257, 3841556, 3307537, 2911465, 2611675, 2387029, 2214194, 2054192, 1884850, 1715374, 1560050, 1426114, 1314376, 1209994, 1112497, 1023589, 944173, 878279, 829257, 791763, 763881, 749699, 750200, 758944, 770950, 780659, 792748, 819288, 851181, 880253, 885067, 873081, 856739, 832729, 796481]
10612G96481n4272o5826o6169o1006m3945k7640j0063q683j0175j3097j1921q884
10600D14800q486q440n307r82m973m793r854p159o730m724J896j292m484j441
10586C48031P00l023m569j599k973J242O26j091j436m812j566K625l06K264Q072
10571C42185J4252J7527K6912M0472M0540L8078K4537K480j2927l1386m1781l2638
10559D28251l0621k2151j1473o150o513m445n584n630m222n428q135q141n731
10546C04027m307j77L88k224m176j224M51K655Q29M858Q738J8316K9163L7325
10532C94642M6391M1580K3332J1484q7j3341j8931j7131j4318j1594m495q51m796
10519D31885j2746j5887j5711j0363j1834n978m395o424q770r229q979r061n137
$$ y = [796481, 742209, 676383, 610214, 549208, 505263, 477623, 467560, 458877, 448702, 435605, 423684, 414800, 406314, 397874, 392567, 391585, 386612, 381819, 371965, 364806, 358076, 353352, 355248, 353956, 349472, 348031, 348731, 345708, 341139, 339540, 336567, 337809, 338435, 337344, 335908, 331096, 329530, 332155, 331849, 334113, 342185, 356437, 373964, 400876, 441348, 481888, 519966, 544503, 546983, 534056, 502670, 460889, 428251, 397630, 375479, 364006, 357856, 351343, 346898, 341314, 335684, 331462, 326034, 317899, 309758, 304027, 299720, 299543, 299931, 297707, 293531, 292307, 292758, 295413, 296242, 301100, 309838, 328154, 357317, 394642, 441033, 482613, 505945, 517429, 517342, 504001, 485070, 467939, 453621, 442027, 437532, 436681, 431885, 419139, 403252, 387541, 377178, 365344, 359366, 354971, 348547, 339777, 330548, 321569, 312508, 307371]
10506C07371k401k920J119N962J0830N812K059M908K14K018J1776J4483J7123
10493C78354K1766L2170L2221L5827L4829L6510L9623L4200L4435K1012J1319
10482G12266j780j8835l0191l4850l8219l7945m1438l3838k8514k4809j8956j5118
10470C87773j0948m265n66l718L697R665J0251L721J99Qk436l018L858Q210N108
10455D07539J0990K0987K5208L3072M9069N4089N3926N1813O4968Q7055J15598
10444I74314J69419K63641M16770N11774L24367l0368k99878m61666m56240l29510
10434A082623k08533j35262r3385p3434n3491m2094k7531j9045j5263j2075j1381
10423C91129q967p633m397r908q885j0356r108p852n815m196J377P31R72P301
$$ y = [307371, 304970, 302050, 303169, 309131, 319961, 325773, 327832, 332740, 332954, 334972, 346748, 361231, 378354, 400120, 432290, 464511, 500338, 535167, 571677, 611300, 645500, 679935, 700947, 712266, 710486, 691651, 661460, 626610, 588391, 550446, 509008, 475170, 446656, 421847, 402891, 387773, 376825, 372560, 371994, 368276, 371973, 381638, 391889, 395610, 395809, 395817, 393381, 390363, 394221, 402431, 407539, 418529, 439516, 464724, 497796, 546865, 600954, 654880, 706693, 771661, 858716, 974314, 1143733, 1407374, 1824144, 2335918, 2660285, 2629917, 2330039, 1868373, 1412133, 1082623, 874090, 738828, 645443, 572009, 518518, 476424, 448893, 429848, 414585, 402510, 391129, 382162, 374529, 370132, 360224, 351339, 340983, 331875, 324023, 318208, 314012, 315389, 316120, 317092, 324393]
10409C24393J4225J3166J4037O532l665p504n506j2133k2829k2123k2118k2251
10397B54224j5726o793l181k425k991J374K067K354m406n044l662J200M575j158
10383B20408o343m072l711q059m067J305M430L616L463K913K4m619j318P398P918
10368B19286M215L488M100P452O720J126p132q308q772m893j090m070m631p371
10354B00120m145j617j389k19R415J6207J5986L475l980r898j5539j3656l623
10341A91137j587j038L525K897J753N715J4479K5597L4001L2212K6613J1109k781
10328C43632j6282k2994k3415j8033j8191j4031r790j0186l24R989J2928K3481
10316B56784L4149L7728L0806K1516O684j8861k7434l2808l2356k6062j7961j3060
$$ y = [324393, 338618, 351784, 365821, 372353, 368688, 361184, 355678, 343545, 320716, 298593, 276475, 254224, 238498, 231705, 228524, 226099, 223108, 224482, 226549, 228903, 224497, 219453, 215791, 216991, 221566, 220408, 214065, 209993, 206282, 198223, 194156, 195461, 199891, 203507, 206970, 209883, 209907, 205288, 203970, 211368, 219286, 223501, 226989, 231089, 238541, 245261, 246387, 239255, 230947, 222175, 217282, 216192, 212122, 207491, 200120, 195975, 194358, 192969, 192750, 202165, 218372, 234358, 237833, 233853, 223955, 208416, 194760, 191137, 189550, 188512, 192037, 194934, 196687, 202402, 216881, 242478, 276479, 308691, 335304, 346413, 343632, 327350, 304356, 280941, 262908, 244717, 230686, 220896, 210710, 210386, 220375, 233303, 256784, 290933, 328661, 359467, 380983, 387667, 368806, 341372, 308564, 276208, 250146, 232185, 219125]
10304B19125r682l738k406p047m361J443L78N02j199m154n215j0325o073m382
10290A62866k096L579P030J8393K7784K7112K0847J8184J8998J9812K1808J1541
10278C55858K554J040K1082L4935L1904K0026n127j5439P803L9642L8642J173
10266E34093l2549n7174l3459J5267N3221K5829j4531l8295m8761k4832J8814
10255C97623N7379O9745P6448N7633L0479K5387K3280L056k5097n8863p7239p5948
10243E03883o5332n4582m0131l3379k2426j2919r192k958m1J0433K2692K3925
10231C19973K1615J6671Q422M47j0809j0272r502j3222p810l761O630J1095J2829
10218C42306J2313J48m63k137k443P134K9052N1325P7937J16126J80321K58149
$$ y = [219125, 209443, 205705, 203299, 196252, 191891, 193334, 193712, 194214, 193015, 188861, 183646, 173321, 167248, 162866, 160770, 164349, 171379, 189772, 217556, 244668, 265515, 283699, 302697, 322509, 344317, 355858, 358412, 359452, 380534, 415469, 447373, 467399, 462272, 446833, 454636, 494278, 532920, 534093, 501544, 444370, 410911, 426178, 479399, 505228, 490697, 452402, 403641, 378809, 397623, 455002, 524747, 601195, 658828, 689307, 714694, 737974, 741030, 715933, 657070, 579831, 503883, 438551, 383969, 343838, 310459, 288033, 275114, 265922, 262964, 262923, 273356, 296048, 319973, 341588, 358259, 366681, 367128, 356319, 346047, 336545, 323323, 315513, 311752, 318382, 329477, 342306, 354619, 354767, 354304, 352167, 349724, 356858, 385910, 437235, 515172, 631298, 811619, 1069768]
10206A069768L57498N36038Q86150J405362J544404O29311m22950j062885j386305
10197C556391j150988p15460m10185k50380j59984j06689p4330n8842m6645l7812
10187E45076k8585j9360k0739l1121l7231l3518j6921O096L2362K6274n37k2274
10175C99522k2225n545N498J5973L7272N4876L9569K0939J6135J1463l121j6925
10163E53431l3798m5568m5844l2588j8514j3843n088M709J4716J2268J1521J1688
10151D13090K1704K5658J4862K596j338m810j7218k1885k4006k2873k2441j5349
10139C47990m874K929L236l04j783k598J228R603J6611J2320J0324P863P278J8259
10125D28082L7129N5270N7662M8393L6724K4620N64k6468m3755n5679n4770l6542
$$ y = [1069768, 1427266, 1963304, 2849454, 4254816, 5799220, 6428531, 6005581, 4942696, 3556391, 2405403, 1689943, 1279758, 1029378, 869394, 762705, 688375, 629533, 582888, 545076, 516491, 497131, 476392, 445271, 408040, 374522, 357601, 363697, 396059, 422333, 421796, 399522, 377297, 371752, 377250, 393223, 430495, 485371, 524940, 545879, 562014, 573477, 570356, 553431, 519633, 474065, 428221, 395633, 377119, 363276, 358188, 362897, 377613, 389881, 401402, 413090, 434794, 460452, 475314, 477910, 476572, 471762, 454544, 432659, 408653, 385780, 363339, 347990, 343116, 346045, 349281, 348977, 347194, 344596, 345824, 355427, 372038, 384358, 394682, 402545, 409823, 428082, 465211, 520481, 578143, 626536, 663260, 687880, 688444, 661976, 618221, 562542, 507772, 471230]
10113D71230k3746j5928n328j313L85Q344J0186R976J4076K0901J4117J217n664
10100D98453j2377j4167l280O789k605j7249j8401j5909j8863j8361j3349q318
10088C62363p229l825K7J7686L7689N0149N0318L3024J6139J5978K8056K6884
10076F27259K1614J8720K3471L6165N0260P6350J01667J09637J00858P1499L8360
10065A275860J5083J6770M4256P5125J05417J14152J00861R7116P4945N2521O8386
10054B040492J12208J58427K14030K58775L03794L47665L80946M21829M75288
10045D713454N48159O73394Q52421J098660J281458J223348J192188J287608J220083
10036A4090773J236762J585783K157234L073794M429330O452510R581402J4569352
$$ y = [471230, 447484, 431556, 426228, 424915, 425300, 433644, 443830, 453806, 467882, 488783, 502900, 504117, 498453, 486076, 471909, 468629, 475418, 472813, 455564, 437163, 421254, 402391, 384030, 370681, 362363, 355134, 351309, 351336, 369022, 406711, 456860, 507178, 540202, 556341, 572319, 600375, 627259, 648873, 667593, 691064, 727229, 777489, 853839, 955506, 1065143, 1166001, 1237500, 1275860, 1290943, 1307713, 1351969, 1427094, 1532511, 1646663, 1747524, 1844640, 1919585, 1972106, 2040492, 2152700, 2311127, 2525157, 2783932, 3087726, 3435391, 3816337, 4238166, 4713454, 5261613, 5935007, 6787428, 7886088, 9167546, 10390894, 11583082, 12870690, 14090773, 15327535, 16913318, 19070552, 22144346, 26573676, 33026186, 42607588, 57176940]
10028E7176940K2978011L7332483O0617108Q7593075Q7614875L8516437j4075120
10021C77753809m9124762p6070598p5251870n3968793l4152689k1771123j4585002
10014E2828972j0087123p142183n123022l606017k543335k027211j881798j700300
10006A8717983j556282j624957j672441j624404j491359j243358r81012p84325
9998G739845o42206n40751m60344m00249l76724l75557l64822l57377l54064l30886
9988C536865l01484k49608j79669j44490j22530j10361j21490j37534j42775j22973
9978A903951q3955m0919j1047P385J138j1962k1142l1042l4595l7796m8411n1969
9966A539636n8600o2039n2634k9319r330j872j1059l1677m2531m0789l9461m6216
$$ y = [57176940, 80154951, 117487434, 178104542, 265697617, 353312492, 391828929, 377753809, 328629047, 252558449, 177306579, 123337786, 89185097, 67413974, 52828972, 42741849, 35599666, 30476644, 26870627, 24327292, 22300081, 20418283, 18717983, 17161701, 15536744, 13864303, 12239899, 10748540, 9505182, 8524170, 7739845, 7097639, 6556888, 6096544, 5696295, 5319571, 4944014, 4579192, 4221815, 3867751, 3536865, 3235381, 2985773, 2806104, 2661614, 2539084, 2428723, 2307233, 2169699, 2026924, 1903951, 1819996, 1779077, 1768030, 1775415, 1776553, 1764591, 1743449, 1712407, 1677812, 1640016, 1591605, 1539636, 1481036, 1418997, 1366363, 1337044, 1327714, 1325842, 1314783, 1283106, 1240575, 1199786, 1160325, 1114109]
9954A114109m7969n2182n7554m8781l9780l4199k6574k1377k4492l4235l6835
9943F90131k4578q516r1M838M750r17l290L687J52k168r052j7755j3827o659o020
9928F10685j0324o148k674M82P314P063J602o076j1764k3094k4630k3301o458
9915E12677Q936P785k188Q34k541j1117m157J956P609O061n080n921j8611j9625
9901D76618j4091j5822j2494M885K612q091j2P685k875k3456j5329P437J4910
9888D21977Q310K344o425q041o9J5778K6640K5048J6976O652m005p076k546k011
9874D93552p077j0952k0837k9881l1844l4521j9680R771L3134L1321J5203o04
9862D27585p14j394k825p235n173q868r426k541L895J3214J1137J6221J2963Q622
$$ y = [1114109, 1066140, 1013958, 956404, 907623, 867843, 833644, 807070, 785693, 761201, 726966, 690131, 665553, 657037, 656946, 661784, 666534, 665617, 662327, 666014, 666166, 663998, 654946, 637191, 623364, 616705, 610685, 600361, 594213, 591539, 592021, 599335, 606398, 608000, 601924, 590160, 567066, 542436, 519135, 512677, 521613, 529398, 527210, 528044, 525503, 514386, 510229, 512185, 519794, 525855, 520775, 514854, 496243, 476618, 462527, 446705, 434211, 439096, 441708, 433617, 433605, 441290, 438415, 414959, 399630, 407067, 421977, 430287, 432631, 426206, 418165, 418096, 433874, 460514, 485562, 502538, 509190, 505185, 498109, 495563, 493552, 486475, 475523, 454686, 424805, 392961, 358440, 338760, 348531, 381665, 412986, 428189, 427585, 426871, 425477, 422652, 415417, 410244, 401376, 391950, 389409, 393304, 406518, 417655, 433876, 446839, 455461]
9848D55461K636j468J141K283k427j105L988J1865K2269K3287K7147L0444M0725
9835F16246M6136M8278N3912N2630M6021M9996N6944O7631J01188J61894K29213
9824A530089L11961M14844N57636P76700J105582J541631K041529K321350J909733
9815A2511055P57317n85745j601285k017934j884646j458587r95405o38753l96002
9806C690015k33812j32355o4592k3721J1911P3449J78944L58125O14588R04744
9796E377296J096999J032644P35361K97139j09660k71473k00069k411J73488J02709
9786H232023j93899m94680p72255r47094r45466q44657o94389n19311l63417k58996
9776B197859k00102j58255j26231j05653q7027o7134n5374m2456k8361j5253N393
$$ y = [455461, 458097, 456629, 457770, 460053, 457626, 456521, 460509, 472374, 494643, 517930, 545077, 575521, 616246, 662382, 710660, 764572, 817202, 863223, 913219, 970163, 1037794, 1138982, 1300876, 1530089, 1842050, 2256894, 2814530, 3591230, 4696812, 6238443, 8279972, 10601322, 12511055, 13268372, 12682627, 11081342, 9063408, 7178762, 5720175, 4724770, 4086017, 3690015, 3456203, 3323848, 3259256, 3235535, 3247446, 3320895, 3499839, 3857964, 4472552, 5377296, 6474295, 7506939, 8242300, 8539439, 8429779, 8158306, 7958237, 7955826, 8129314, 8232023, 8038124, 7543444, 6771189, 5824095, 4878629, 4033972, 3339583, 2820272, 2456855, 2197859, 1997757, 1839502, 1713271, 1607618, 1520591, 1453457, 1398083, 1355627, 1327266, 1312013, 1317406]
9765A317406K7470N2009Q2769J13892J56739K09997K83466L77342M61647N31119
9755C613856N87814O68292P86447R46164J095668J214512J321629J450078J726522
9746A3410982K260380K696204K387084J100954p68925k337564l098320l039957
9738A2610838k425531j676494j040399n81912k80588j00492J3787J01080J91613
9729F811902K81600M04884O57356J116612J817948K662606L136971K701390J453206
9720B1044475k07859j577056k131240j977878j455189r60459p80084q76026j034816
9711A0043868j200676j306292j254542j101602q99781o75159m94004l68906k87080
9702B455826k25171j84813j50440j09897p5176m7429k4344j8598j6906j7955j0133
$$ y = [1317406, 1344876, 1396885, 1479654, 1593546, 1750285, 1960282, 2243748, 2621090, 3082737, 3613856, 4201670, 4869962, 5656409, 6602573, 7698241, 8912753, 10234382, 11684460, 13410982, 15671362, 18367566, 20754650, 21855604, 21086679, 18749115, 15650795, 12610838, 10185307, 8508813, 7468414, 6886502, 6605914, 6505422, 6519209, 6620289, 6811902, 7093502, 7498386, 8155742, 9272354, 11090302, 13752908, 16889879, 19591269, 21044475, 20836616, 19259560, 17128320, 15150442, 13695253, 12734794, 11954710, 11078684, 10043868, 8843192, 7536900, 6282358, 5180756, 4280975, 3605816, 3111812, 2742906, 2455826, 2230655, 2045842, 1895402, 1785505, 1710329, 1662900, 1638556, 1619958, 1603052, 1585097, 1574964]
9691A574964P649L7547Q0994J38071K06084K53199K88750L22718L86393M97382
9681C793751O38356P89059Q60728Q05349P00348N65571M57421N04885N01499K46056
9671I863023k14647p95238j214571j323503j166665q52628n19570k47090n5552
9662C473559M7693P5177O4252N0549M7251P5083J75435L74953P08044J195471
9652F287467J797216K278288K190183J396935J99667j022959j827287k032429
9644I267081j835945j465843j117685q48725o56501n09622l91605l06629k44221
9635A890305k03193j65754j32309j11753r4136q1629p0974o0019n2314m3546l7243
9624H37435l3088l0146k9552l1574k8997k1539k0954j6363j4110j0113j0309j1416
$$ y = [1574964, 1582613, 1620160, 1701154, 1839225, 2045309, 2298508, 2587258, 2909976, 3296369, 3793751, 4432107, 5221166, 6081894, 6887243, 7587591, 8153162, 8610583, 9115468, 9616967, 9863023, 9648376, 8853138, 7638567, 6315064, 5148399, 4295771, 3776201, 3529111, 3473559, 3521252, 3596429, 3660681, 3711230, 3758481, 3833564, 4008999, 4383952, 5091996, 6287467, 8084683, 10362971, 12553154, 13950089, 14149756, 13126797, 11299510, 9267081, 7431136, 5965293, 4847608, 3998883, 3342382, 2832760, 2441155, 2134526, 1890305, 1687112, 1521358, 1389049, 1277296, 1183160, 1101531, 1030557, 970538, 918224, 874678, 837435, 804347, 774201, 744649, 713075, 684078, 662539, 641585, 625222, 611112, 600999, 590690, 579274]
9612E79274q326j479N132J3222K4082L4113N9265J03046J69382K87454M49997
9601A715162N44932L52661r647k75143m32129m15563k94569j87005j17289p9709
9591H01701n9154m2159k9248j7242o110j18J855m252j6459k6406l3889l3860l4112
9578E00547l1565k6779k0525j1785j5942j7851j8331j1949o100j822o65K579L132
9565C42944N105M953J0638R778J2692J0282Q075n759j7794j6781j1442k573k24
9552C49894P9K873L705K737J761m292p032q593j0149m065k798l606p626p492j30
9537C05266K393O86O142N791Q538N660J4134K8711M9305R8367J43497O1356l2011
9524F97835o7940j12848q3781m1531k3119j2831p784m996j740J961M379M370L952
$$ y = [579274, 570948, 569469, 574601, 587823, 611905, 646018, 705283, 808329, 977711, 1265165, 1715162, 2260094, 2612755, 2603108, 2327965, 1895836, 1480273, 1185704, 998699, 881410, 801701, 742547, 700388, 671140, 653898, 647788, 647670, 649525, 645273, 628814, 602408, 568519, 534659, 500547, 468982, 442203, 421678, 409893, 393951, 376100, 357769, 345820, 339720, 337898, 337233, 339812, 342944, 348049, 353002, 363640, 373418, 386110, 396392, 404467, 398708, 380914, 364133, 352691, 350118, 349894, 349973, 352846, 356551, 359288, 361049, 356757, 349725, 341132, 330983, 326918, 324120, 320514, 312888, 305396, 305266, 307659, 308345, 314487, 320278, 328816, 334476, 348610, 377321, 426626, 524993, 668490, 729846, 697835, 629895, 517047, 433266, 391735, 368616, 355785, 348001, 343005, 341265, 343226, 347605, 351975, 355927]
9511C55927P296J5771K4458M2593P3081R0781N5369L148j7223k0014K5589J05469
9499G62245J45886M4559m2250q8831j09303o0577J2166L2882p473l5794n1111
9488F02399n1084k6985j4698p317r239j9894k2114k2309k4851j7064j1936p886
9476C67022p653n747k398M62l096p38l802l99k03j923k359J06J530j253p79q8
9460C38682k29L87j918l065L908M145J87R53L882Q53P01L040P660K094N479J0102
9444C76861N228M702L098J935K075L755P961O720P677Q419L495N241O781M996
9430D48944J375M761Q866O916R190J0661Q085Q875J2721J4430J7328J5338O744
9417E74234k734l470m022q176M855R611J0329J2587J2037Q064J360n738r508j1182
$$ y = [355927, 363223, 378994, 403452, 446045, 519126, 609907, 665276, 668424, 651201, 631187, 656776, 762245, 908131, 952690, 910440, 821609, 712306, 651729, 663895, 696777, 689304, 653510, 602399, 551315, 524330, 509632, 502315, 493076, 473182, 451068, 428759, 403908, 386844, 374908, 367022, 359369, 353622, 351224, 351686, 348590, 347852, 344050, 343651, 343448, 341525, 339166, 339272, 340802, 339549, 338770, 338682, 338453, 338840, 336922, 333857, 337765, 341910, 342097, 343050, 346932, 347785, 348486, 351526, 359186, 361280, 366759, 376861, 382089, 386791, 389889, 391824, 393899, 397654, 405615, 412335, 420012, 428431, 431926, 437167, 443948, 448944, 450319, 455080, 463946, 470862, 480052, 490713, 498798, 507673, 520394, 534824, 552152, 567490, 574234, 571500, 568030, 564008, 555832, 560687, 570298, 580627, 593214, 605251, 613315, 614675, 608937, 599429, 588247]
9403E88247r494m323l164K358N05K790N219J0178J0931J8777K3608K2572K1424
9390F89628J2832L843O892K922N252O792Q582J5463J7406J9729J9601K4963K1341
9377H55246K2020K3903K8795L9161M7171O0061P8088J01017J31269J59781K03956
9366A750468K78329L91104N38798O77105P51783P08004N26384K68337k8208k95046
9356E567058m29616m34143l34868j80057l8756O9136J83244L35568N55636Q65073
9346F158275J209081J440294J426647J116666N56330q3156o81727j084992j173157
9337H884261j050727p95033m94394k28542j0045J86601M03402O78951J023998
9328H598472J332618J443863J241618P44262J01922n14481r39863j057669q79145
$$ y = [588247, 578753, 574430, 571266, 573624, 574129, 576919, 582138, 592316, 603247, 622024, 645632, 668204, 689628, 702460, 706303, 713195, 716117, 721369, 728161, 736743, 752206, 769612, 789341, 808942, 833905, 855246, 877266, 901169, 929964, 969125, 1016296, 1076357, 1154445, 1255462, 1386731, 1546512, 1750468, 2028797, 2419901, 2958699, 3635804, 4387587, 5095591, 5621975, 5890312, 5862104, 5567058, 5137442, 4703299, 4368431, 4188374, 4149618, 4218754, 4401998, 4737566, 5293202, 6158275, 7367356, 8807650, 10234297, 11350963, 11907293, 11824137, 11142410, 10057418, 8884261, 7833534, 7038501, 6544107, 6315565, 6305520, 6492121, 6895523, 7574474, 8598472, 9931090, 11374953, 12616571, 13360833, 13462755, 12948274, 12008411, 10950742, 10071597]
9319A0071597n01064l8348L75959O19032O76537O31269O00241O59517P94815Q92027
9309A4781582Q45454O49094L68853Q7607j58049l53364m61459m91343m46597l34089
9299A4487689j26238K13625O63755J134439J471153J588208J454237J029901L54154
9290B2270923l24964q71983j171525j140366q63240m97709j94042n8199r6945
9281A7051950j79432j33135J17089N32480R70687J254822J276500Q66343J71555
9272B1928859n74997j284817j655907j605216j286310p99179k90078J17648L82384
9263A4932387N72842P20480Q39742Q92207Q27476O40779K61294k98868q01276
9254A8587063j204707j435533j347712j068694p27461l84063j09894R6625L05515
$$ y = [10071597, 9570533, 9532185, 9908144, 10527176, 11203713, 11834982, 12435223, 13094740, 13889555, 14781582, 15627036, 16276130, 16644983, 16732590, 16574541, 16221177, 15759718, 15268375, 14821778, 14487689, 14361451, 14575076, 15238831, 16373270, 17844423, 19432631, 20886868, 21916769, 22270923, 21945959, 21073976, 19902451, 18762085, 17898845, 17401136, 17207094, 17148895, 17051950, 16872518, 16739383, 16856472, 17388952, 18359639, 19614461, 20890961, 21757304, 21928859, 21353862, 20069045, 18413138, 16807922, 15521612, 14722433, 14432355, 14550003, 14932387, 15505229, 16225709, 17065451, 17957658, 18785134, 19425913, 19687207, 19388339, 18587063, 17382356, 15946823, 14599111, 13530417, 12802956, 12418893, 12308999, 12405624, 12711139]
9245A2711139N91415R54615J345754J642889J719463J465366Q09743l6062q61413
9236B0342909j556001j873803j785653j439157r61452n11645j86786M413J27662
9227A2160487K64886M24482N74915O75474P11247O34463M28112K00262m8703l00446
9217A5725179m45515m96604m99020m62912m18824l82004l30668k57362j86561
9208A2245709j52727j87693k99411m58809n96478o41591n60062l74003j35035
9199H839900R3804K56413L12862K64929J38162o21j04656j48713j36823r3535
9189I421722m7222j9988k1664o5971j69427l13091m56887n80201o65782p03268
9179F378221o89036o05297m77195l21861j59967l3514K8550K1479l7261j21596
$$ y = [12711139, 13302554, 14257169, 15602923, 17245812, 18965275, 20430641, 21240384, 21204322, 20342909, 18786908, 16913105, 15127452, 13688295, 12726843, 12215198, 12028412, 12032825, 12160487, 12425373, 12849855, 13424770, 14100244, 14811491, 15445954, 15874066, 16074328, 16025625, 15725179, 15279664, 14783060, 14284040, 13821128, 13402304, 13020300, 12689632, 12432270, 12245709, 12092982, 11905289, 11605878, 11147069, 10550591, 9909000, 9348938, 8974935, 8839900, 8933704, 9190117, 9502979, 9767908, 9906070, 9905449, 9800793, 9652080, 9515257, 9421722, 9374500, 9354512, 9332848, 9266877, 9097450, 8784359, 8327472, 7747271, 7081489, 6378221, 5689185, 5083888, 4606693, 4284832, 4124865, 4091351, 4119901, 4141380, 4104119, 3982523]
9169C982523j86905j80873j13625k3068K4215K30p1984j42980j99480k29421k33881
9158B624751k43011k44010k30958k09440j71507j34695j08969q9867p3659n8012
9148A060623m0709k5962j2114o171o526j5546k2249k9404l4066l5934k8339k4911
9136G78692k1878j2319n155J540J0806J3369K1197J8725J6414J2038R378K460
9124H45267n05m57l440k555j309j729n529n729m296l379N059O768M403J504n622
9109H28451r530j3495j0628q122m119P469J5315J7639K5550L0047L5492K4473
9097I38542K1615K0255K4363L6665N4406N8461O1528N3656M2420L5869K5564K2776
9085A396120J4835J2451K0645K4990J6219L098p811j3022j5408n128K0683N8458
$$ y = [3982523, 3795618, 3614745, 3501120, 3478052, 3502267, 3502497, 3430513, 3287533, 3088053, 2858632, 2624751, 2381740, 2137730, 1906772, 1697332, 1525825, 1391130, 1282161, 1192294, 1118635, 1060623, 1019914, 993952, 981838, 975667, 969141, 953595, 931346, 901942, 867876, 831942, 803603, 778692, 756814, 744495, 739340, 740880, 751686, 765055, 786252, 804977, 821391, 833429, 842807, 845267, 844762, 844305, 840865, 838310, 837001, 835272, 829743, 824014, 819718, 816339, 821398, 828166, 832569, 834073, 828451, 818921, 805426, 794798, 786676, 782557, 790026, 805341, 822980, 848530, 878577, 914069, 938542, 960157, 980412, 1004775, 1041440, 1095846, 1154307, 1215835, 1269491, 1311911, 1347780, 1373344, 1396120, 1410955, 1423406, 1444051, 1469041, 1485260, 1488358, 1480547, 1467525, 1452117, 1446989, 1467672, 1526130]
9073A526130R9828J42740J86743K19740K31131K51535K79001K99417L10320L14903
9063C861488L07080L07595L11730K89518K37623J79510J41078R2680p889j13336
9053E607077j60195j59298j11726M484J50631L29768N33619P20849Q27285Q30153
9043H572647P76320P25015O62911N61486L92023J64502n1478j93213k83594k74009
9033A1052610j86719r4043k6481k2734j48652l03449l30910k05271N5470L59708
9023A0149529N78370O13740N00513L32001J37264l7059j31454j10866N0623K69508
9013A2352169L99852M07516K84306L3496k71787m86799m65925j74146K24547M60735
9003A2763964M15708K07594J14642K77405O94393J156912J266864Q51869K46556
$$ y = [1526130, 1625958, 1768698, 1955441, 2175181, 2406312, 2657847, 2936848, 3236265, 3546585, 3861488, 4168568, 4476163, 4787893, 5077411, 5315034, 5494544, 5635622, 5728302, 5720413, 5607077, 5446882, 5287584, 5175858, 5180342, 5330973, 5660741, 6194360, 6915209, 7742494, 8572647, 9348967, 10073982, 10736893, 11298379, 11690402, 11854904, 11803426, 11610213, 11326619, 11052610, 10865891, 10771848, 10745367, 10722633, 10573981, 10270532, 9939622, 9734351, 9789821, 10149529, 10727899, 11341639, 11842152, 12174153, 12311417, 12274358, 12142904, 12032038, 12082661, 12352169, 12752021, 13159537, 13443843, 13477339, 13205552, 12718753, 12252828, 12078682, 12303229, 12763964, 13179672, 13387266, 13501908, 13779313, 14473706, 15630618, 16897482, 17749351, 17995907]
8994A7995907l64308r39570j221973j227869j054248p07787k43209L12189Q30126
8985A3379258J161403J265658J138133R62450R13197R70843J262768J749287J995501
8976B4798498J725384J131836M31747j42374l57650k46844j10052j74023k73533
8967B6782989l10053l07770k79150k18628j48758N7638M94313J133780J794523
8958B8998884K108404J789203P82449m95072j416650j649854j130478j05355R95865
8949B9877396J690496J881830J447259L07069o94309j064229r09891l69090J56576
8940C2323107L41357Q5773m28915q70470j043659p79259j05569P07431J362332
8931C1592128J688628J566255R94201R0613j117422k301685l156144l518388l336025
$$ y = [17995907, 17631599, 16692029, 15470056, 14242187, 13187939, 12480152, 12236943, 12549132, 13379258, 14540661, 15806319, 16944452, 17906902, 18820099, 19790942, 21053710, 22802997, 24798498, 26523882, 27655718, 28087465, 27945091, 27587441, 27340597, 27230545, 27056522, 26782989, 26472936, 26165166, 25886016, 25667388, 25518630, 25576268, 26070581, 27204361, 28998884, 31107288, 32896491, 33678940, 33183868, 31767218, 30117364, 28986886, 28881531, 29877396, 31567892, 33449722, 34896981, 35204050, 34509741, 33445512, 32535621, 32166531, 32323107, 32664464, 32750237, 32321322, 31450852, 30407193, 29627934, 29522365, 30229796, 31592128, 33280756, 34847011, 35841212, 35931825, 34814403, 32512718, 29356574, 25838186, 22502161]
8922B2502161k732925j958695j223274o35565j64418J64347K83597K26734O8925
8913A6530887r8844j25920J22623O30329J249353J755459J989651J676449M80844
8904B4210831j104212k321971k902202k879151k390590j736558j177351p98998
8896H899798o35615o14660n93625n09646l67265k13427q6706L4269J72668L56940
8886F442731N50862P48592R12235R64909P05752K1284o80580j113019j266414
8877G286352j143610q87240o37778m49489l25670k37367j70155j28548r0633m4674
8867C171188j0898J4906M6444J05597J96450L18201M35192N44538O73133P28460
8857F223211N27166J21266j46780k92038l31573k11244M251K93807O95377J132844
$$ y = [22502161, 19769236, 17810541, 16587267, 15951702, 15787284, 15951631, 16235228, 16461962, 16530887, 16432043, 16306123, 16428746, 17059075, 18308428, 20063887, 22053538, 23729987, 24210831, 23106619, 20784648, 17882446, 15003295, 12612705, 10876147, 9698796, 8899798, 8264183, 7649523, 7055898, 6546252, 6178987, 5965560, 5878854, 5913123, 6085791, 6442731, 6993593, 7742185, 8654420, 9619329, 10325081, 10346365, 9665785, 8552766, 7286352, 6142742, 5255502, 4617724, 4168235, 3842565, 3605198, 3435043, 3306495, 3215862, 3171188, 3160290, 3175196, 3221640, 3327237, 3523687, 3841888, 4277080, 4821618, 5494751, 6223211, 6750377, 6871643, 6724863, 6432825, 6101252, 5890008, 5894259, 6188066, 6883443, 8016287]
8847H016287J430418J473633J236509P50956R4617n01206q47348q77024o32160
8838A0144682k43646J77372N34801P78219Q36147N66987q940n46898r19676j099471
8828A0219577r69984o59163k82959J11409M73047P42026Q41273P32256M95334
8819A1702816J29848l19049p06199r44735r81538q39767n96197l29355r5401M2961
8809G063384P183j62689l38839n20757o18228n74486m52873l10893j85974r9576
8799C806252n2520p9912j42985j99919k56779k58831k18738j57015q5554l0227
8789B323772J2621L4717N1605P5126J12252J73530K42740L34227M52723O02617
8779D415930P94413J027017J199343J226722J079066P07248J75814k33635l07158
$$ y = [8016287, 9446705, 10920338, 12156847, 12907803, 13002420, 12501214, 11653866, 10776842, 10144682, 9901036, 10078408, 10613209, 11391428, 12227575, 12794562, 12785622, 12238724, 11319048, 10219577, 9249593, 8590430, 8307471, 8418880, 8891927, 9633953, 10475226, 11207482, 11702816, 11832664, 11513615, 10807416, 9862681, 8881143, 8041376, 7445179, 7115824, 7020423, 7063384, 7070567, 6907878, 6569039, 6048282, 5430054, 4855568, 4402695, 4091802, 3905828, 3806252, 3753732, 3673820, 3530835, 3330916, 3074137, 2815306, 2596568, 2439553, 2353999, 2323772, 2336393, 2371110, 2422715, 2497841, 2610093, 2783623, 3026363, 3360590, 3813313, 4415930, 5210343, 6237360, 7436703, 8663425, 9742491, 10449739, 10625553, 10391918, 10084760]
8770A0084760m2462M78386J034914J344373J297837R24630L32935l03926q37498
8761A4313949j203871j398424j376609j142883p44325k37378K83178O88580Q93379
8752A0075596Q74561O39396K57509j18283l15491k56227M6239M94069Q29538Q50019
8742A3376926N37405l4729o66377j184297j461530j503446j384705j154973q94423
8733E629851o55779m44893k67326j39184o9169k5471j2341q2772k27033l43045
8723C362838m02809l95213l18056k26987j51187r1545n3160k6301m155J1780K6614
8712A731819L7934M7389N8809Q4989J17391J66110K23912K77467L42073M32259
8702C520152N63065P60516J008415J262633J421165J378073J073096N54301o0982
$$ y = [10084760, 10042298, 10520684, 11555598, 12899971, 14197808, 15122438, 15455373, 15151447, 14313949, 13110078, 11711654, 10335045, 9192162, 8447837, 8210459, 8493637, 9182217, 10075596, 10950157, 11589553, 11847062, 11728779, 11413288, 11157061, 11203300, 11697369, 12526907, 13376926, 13914331, 13879602, 13213225, 12028928, 10567398, 9063952, 7679247, 6524274, 5629851, 4974072, 4529179, 4261853, 4122669, 4053500, 4028029, 4015688, 3932916, 3705883, 3362838, 2960029, 2564816, 2246760, 2019773, 1868586, 1777041, 1723881, 1697580, 1693425, 1705205, 1731819, 1769753, 1817142, 1875951, 1960940, 2078331, 2244441, 2468353, 2745820, 3087893, 3520152, 4083217, 4843733, 5852148, 7114781, 8535946, 9914019, 10987115, 11541416, 11480434]
8693A1480434o24066r69616j036088q40645m76773n4385L47017O36896P21439
8684I184213N98200K95549o9838l59450m55508l23146k2349L59628O63694P71204
8674A0642197O26370K61490j82415n49657p32849o90225m88006k19650k5209K4408
8664H666454m3850j67204l14006m70184o20113p28955p92677p83256p04736n86246
8654C455227m65103l54527k69704k06526j67801j41109j21097j03091q7539q0791
8644A457939p5908o8353n8218m6284l7396k2144q781J086K0502M4848O1354P6675
8632A345320P9125P5759Q2940R9042J20168J33085J21400J12405J37753J85115
8622B492112K81687M19655N60922O51363O54973N98106M96249L09279K6345k49938
$$ y = [11480434, 10856368, 9886752, 8850664, 8010019, 7533246, 7478861, 7825878, 8462774, 9184213, 9782413, 10077962, 10008124, 9648674, 9193166, 8870020, 8847671, 9207299, 9870993, 10642197, 11268567, 11530057, 11347642, 10797985, 10065136, 9374911, 8886905, 8667255, 8642046, 8666454, 8622604, 8455400, 8141394, 7671210, 7051097, 6322142, 5529465, 4746209, 4041473, 3455227, 2990124, 2635597, 2365893, 2159367, 1991566, 1850457, 1729360, 1626269, 1538730, 1457939, 1382031, 1313678, 1255460, 1209176, 1171780, 1149636, 1140855, 1141941, 1162443, 1207291, 1268645, 1345320, 1424445, 1500204, 1583144, 1682186, 1802354, 1935439, 2056839, 2169244, 2306997, 2492112, 2773799, 3193454, 3754376, 4405739, 5060712, 5658818, 6155067, 6464346, 6490691, 6240753]
8612F240753m39248n03816m17259k18955L6906L24053N63453O55161N70869L76833
8602G188750K51679L13353N21565O42332M84952J52410j58833l69255m21738l06898
8592H298317r1265L8686j44730n35124q35269r62473q58736n98462l18553q4844
8582C907547Q3032J95152L04512M38698N25415M38637J89574k3217q2927N3441
8572F029864K91912M08440K79723K0515j92118l49725m52894m87961m97831m86672
8562D563253m39767l61607k70353j88438j41502j43161j49658j36775q7786j2013
8552B632193N7446J03453J48103K21716L14991L73509L47727K49901Q4266r2415
8542D440890j43534r2301J5758J27674K11759K72713K97653K95677K60941J61149
$$ y = [6240753, 5801505, 5297689, 4880430, 4661475, 4698381, 5022434, 5585887, 6241048, 6811917, 7188750, 7440429, 7753782, 8275347, 8917679, 9402631, 9555041, 9396208, 9026953, 8605215, 8298317, 8207052, 8245738, 8101008, 7565884, 6730615, 5768142, 4909406, 4310944, 3992391, 3907547, 3990579, 4185731, 4490243, 4928941, 5454356, 5892993, 6082567, 6059350, 5976423, 6029864, 6321776, 6730216, 7009939, 7030454, 6838336, 6488611, 6035717, 5547756, 5049925, 4563253, 4123486, 3761879, 3491526, 3303088, 3161586, 3018425, 2868767, 2731992, 2644206, 2632193, 2689639, 2793092, 2941195, 3162911, 3477902, 3851411, 4199138, 4449039, 4533305, 4440890, 4297356, 4205055, 4220813, 4348487, 4560246, 4832959, 5130612, 5426289, 5687230, 5848379]
8532E848379J3872q9254j181K33280N50479Q39594J013258R47404O08820N3679
8522A0018330n62560j022328j216998j132412q53051n00864j53787J46973L81946
8513E105249N10897M36392R4521k25763l70820l38743j22845J45722L89038N53956
8503F177604P14744R89365J315305J616359J641719J233321M84074l69736j041944
8494A2760811j365135j367372j159033q61101o18016m91665m85740n36698n57904
8485E318147n23844m34233l35594k43200j61902r2358K0081J89755M17296O94948
8475D849096Q71892P96279M96996J61019q0572k14727k70284l50224m37686m23601
8465E398188l00093j04295P2801J57048J55023J47111J93127K55481K07987L3273
$$ y = [5848379, 5862251, 5772997, 5771816, 6005096, 6555575, 7395169, 8408427, 9355831, 9964651, 10018330, 9455770, 8433442, 7216444, 6084032, 5230981, 4730117, 4576330, 4723303, 5105249, 5616146, 6052538, 6147059, 5921296, 5550476, 5211733, 5088888, 5234610, 5623648, 6177604, 6892348, 7881713, 9197018, 10813377, 12455096, 13688417, 14172491, 13802755, 12760811, 11395676, 10028304, 8869271, 8008170, 7390154, 6898489, 6412749, 5876051, 5318147, 4794303, 4360070, 4024476, 3781276, 3619374, 3527016, 3547097, 3736852, 4154148, 4849096, 5720988, 6517267, 7014263, 7175282, 7094710, 6879983, 6609699, 6259475, 5821789, 5398188, 5098095, 4993800, 5066601, 5223649, 5378672, 5525783, 5718910, 5974391, 6182378, 6215651]
8455F215651j11593j38579j8991J38648J89824Q2195j05751j77841j28584r4920
8445E850059j59092l34490n09675n69088n04532l57758j73010P99J72767L62902
8435C778882N32292N78695M72660K68014J07719J30691L03172M91303O67866R51598
8425H282892J200289J002544P49889L61581l00410p51320j043184j177065j094840
8416G230376r27849p51919n62595l84875k58083j87584j41178j36968j36387o8152
8406C674786Q5635L75670O80619M24349j8773j13524j02884K51899O86465Q09241
8396F753483N21831k947m75376p35869p70353o48362n17903m17788l23127k21929
8386C161660j06258j1059K3903L3636L1235K0273M2251J18425J73182J00884j316
$$ y = [6215651, 6104058, 5965479, 5946488, 6085136, 6274960, 6357155, 6251404, 6073563, 5944979, 5850059, 5690967, 5356477, 4846802, 4277714, 3773182, 3415424, 3242414, 3243213, 3415980, 3778882, 4311174, 4889869, 5362529, 5630543, 5738262, 5868953, 6172125, 6663428, 7331294, 8282892, 9483181, 10485725, 11235614, 11597195, 11296785, 10545465, 9502281, 8325216, 7230376, 6302527, 5550608, 4988013, 4603138, 4345055, 4157471, 4016293, 3879325, 3742938, 3674786, 3760421, 4136091, 4816710, 5241059, 5222286, 5108762, 5005878, 5257777, 5944242, 6753483, 7275314, 7272367, 6796991, 6061122, 5290769, 4642407, 4124504, 3706716, 3383589, 3161660, 3055402, 3044343, 3068246, 3101882, 3133117, 3153390, 3195641, 3314066, 3487248, 3588132, 3586816]
8375C586816m0724l5657l3967q3203j83896k43308k38151j76102r2758j1835N5664
8364B502879J35910K51222M42095Q20353J443961J345990R0060m38940r03144
8355E690386r25207n05275k04676n5577L7642J32518J91963K03319J92574J42719
8345D900386O1743o1764k31855l64176m10275l75154k80802j76955j00171n3112
8335B907865j4407J2525L1172M7509N5077M8807M3553M8295O0135Q5545J17371
8324C443447J50076J86538K41420L15407L79306M09826M30993M58025N47303N84781
8314G147122J12171l75587n48466o50781m73327k34175q9882j0451L5573P1523
8304D983720R2118J08310J28176J42538J54447J68816J77475J92173K08364K26695
$$ y = [3586816, 3546092, 3510435, 3476468, 3393265, 3209369, 2966061, 2727910, 2551808, 2459050, 2447215, 2502879, 2638789, 2890011, 3332106, 4152459, 5596420, 6942410, 7032470, 6593530, 5690386, 4765179, 4259904, 4055228, 3999651, 4037293, 4169811, 4361774, 4565093, 4757667, 4900386, 4962129, 4900365, 4668510, 4304334, 3894059, 3518905, 3238103, 3061148, 2960977, 2907865, 2893458, 2905983, 2937155, 2984664, 3039741, 3088548, 3132101, 3180396, 3240531, 3326076, 3443447, 3593523, 3780061, 4021481, 4336888, 4716194, 5126020, 5557013, 6015038, 6562341, 7147122, 7259293, 6883706, 6335240, 5684459, 5211132, 4976957, 4887075, 4876624, 4912197, 4983720, 5075838, 5184148, 5312324, 5454862, 5609309, 5778125, 5955600, 6147773, 6356137, 6582832]
8294F582832K41969K51047K53901K56300K63489K70853K95137L26414L52768L70953
8284I465663L94275M07390M26105M51960M75711N08833N38560N68262O07225O52999
8274A4496983O88693P27721P67283Q05087Q52878R04331R59095J010912J059297
8265B2272280J111825J162437J206690J243716J275801J298866J310460J308531
8257C2190606J292393J254484J201967J127797J036024R19589P77944O19129M37143
8248D0857076K46558M7790j48110l42334n27410o94299q48106r85943j097533
8239C6507689j180811j244311j281543j308742j315623j302639j290418j271654
8231B6311948j239997j198474j155387j106414j055187j003865r53760q99332
$$ y = [6582832, 6824801, 7075848, 7329749, 7586049, 7849538, 8120391, 8415528, 8741942, 9094710, 9465663, 9859938, 10267328, 10693433, 11145393, 11621104, 12129937, 12668497, 13236759, 13843984, 14496983, 15185676, 15913397, 16680680, 17485767, 18338645, 19242976, 20202071, 21212983, 22272280, 23384105, 24546542, 25753232, 26996948, 28272749, 29571615, 30882075, 32190606, 33482999, 34737483, 35939450, 37067247, 38103271, 39022860, 39800804, 40419933, 40857076, 41103634, 41151424, 41003314, 40660980, 40133570, 39439271, 38591165, 37605222, 36507689, 35326878, 34082567, 32801024, 31492282, 30176659, 28874020, 27583602, 26311948, 25071951, 23873477, 22718090, 21611676, 20556489, 19552624, 18598864, 17699532]
8223A7699532q51863q07800p64619p28154o86987o43715o08107n71494n42412
8214A1494381n12904m85000m59018m26268m05196l87782l64541l48910l27152
8205G777610l12563k91308k74998k61447k50480k37379k23205k14609k05284j95423
8195E310914j83036j74083j61719j54999j48894j44283j36087j29370j26763j22054
8185C829626j17664j08693j07193j06303j00940r1618r2305q6844q6498q5534
8175B846034q1516p5128p3782p1502p0778o5622n9301n2511n7767n9830n6628
8164B121669n5242m7719m6358m9892m9610m3771l7466l9781m2596l9542l6971
8153A632721l6794l5758l3166l5890l0859k8085k7062k6326k4593k5452k2468
$$ y = [17699532, 16847669, 16039869, 15275250, 14547096, 13860109, 13216394, 12608287, 12036793, 11494381, 10981477, 10496477, 10037459, 9611191, 9205995, 8818213, 8453672, 8104762, 7777610, 7465047, 7173739, 6898741, 6637294, 6386814, 6149435, 5926230, 5711621, 5506337, 5310914, 5127878, 4953795, 4792076, 4637077, 4488183, 4343900, 4207813, 4078443, 3951680, 3829626, 3711962, 3603269, 3496076, 3389773, 3288833, 3197215, 3104910, 3018066, 2931568, 2846034, 2764518, 2689390, 2615608, 2544106, 2473328, 2407706, 2348405, 2295894, 2238127, 2178297, 2121669, 2066427, 2018708, 1972350, 1922458, 1872848, 1829077, 1791611, 1751830, 1709234, 1669692, 1632721, 1595927, 1560169, 1527003, 1491113, 1460254, 1432169, 1405107, 1378781, 1354188, 1328736, 1306268]
8142A306268j8484k0328j9109j4909k0818k0511k0334k1885k3929k6736k7902
8131A071323k3590k0643k1393k2990k2003k2121j8434j6283j3880j4001j5499
8120H60486j0040j1471j3962j0985r144r785r926m436k042l638l776l796k195
8107G65290n937q825j6963k1882j8890j9841j7231j6895j2215r808j1940j1503
8095E93360j2010j4581q282p407p777q138o533m751q583q640p851o920n579p587
8081D78721p448l567q725p282l102k466m556l780j138O52l14k875j407m782l448
8066D24483N371O928P846J7554K0656O289j1610k4865k6495k4125j2497j1472
8054C78063j1287j1291j3201p477n259n968m670p860o572k106k130l097j342L930
$$ y = [1306268, 1287784, 1267456, 1248347, 1233438, 1212620, 1192109, 1171775, 1149890, 1125961, 1099225, 1071323, 1047733, 1027090, 1005697, 982707, 960704, 938583, 920149, 903866, 889986, 875985, 860486, 850446, 838975, 825013, 814028, 804884, 795099, 785173, 780737, 778695, 775057, 771281, 767485, 765290, 759353, 750528, 733565, 711683, 692793, 672952, 655721, 638826, 626611, 616803, 604863, 593360, 581350, 566769, 558487, 551080, 543303, 535165, 528632, 523881, 515298, 506658, 498807, 491887, 486308, 478721, 471273, 467706, 458981, 451699, 448597, 446131, 441575, 437795, 436657, 437309, 436995, 434120, 432713, 427931, 424483, 429854, 436782, 444628, 462182, 482838, 489127, 477517, 452652, 426157, 402032, 389535, 378063, 366776, 355485, 342284, 334807, 329548, 323580, 318910, 311050, 304478, 302372, 300242, 297145, 295803, 299733]
8040B99733j032k056K090p03j101j50J16O77r3p986r743j498r10l397m075j449
8024B68423l15l84j815j269m458k667N148M500J023k729j0965r628q406q807q668
8009B18983n732L480L944L377P170L911k039n788q756p797m106o851p929l526
7995A88341k694j037n3m52m085j928j890l248l540m97J815M43q83p60o94k742
7979A66096J789k363l199p739m127L63r77j076k960k846K079N08l02n166j889
7964A38191k480O745L489P872O802j343o968m682j878k143m459o413l465P77k881
7949A27164l302M25j529J33j98j384N66K500K31m885k700o00n09L34L08m239o260
7932A06055l892j74K639q84l237M10l639J012j170l34l97n693k470K335P041K190
$$ y = [299733, 298701, 296645, 298735, 298032, 296931, 296781, 296897, 297574, 297481, 289495, 279752, 278254, 277344, 273947, 269872, 268423, 268108, 267724, 265909, 264640, 260182, 257515, 262663, 267163, 268186, 265457, 254492, 244864, 236458, 227651, 218983, 213251, 216731, 220675, 224052, 231222, 235133, 233094, 227306, 218550, 210753, 206647, 199796, 191867, 188341, 185647, 184610, 184557, 184105, 180020, 178092, 176202, 172954, 169414, 168917, 170732, 171175, 170292, 169532, 168838, 166096, 167885, 165522, 162323, 154584, 150457, 150820, 149843, 148767, 145807, 142961, 145040, 145548, 145246, 140080, 138191, 135711, 142456, 145945, 153817, 160619, 159276, 152308, 147626, 145748, 143605, 139146, 132733, 129268, 130045, 127164, 123862, 124287, 122758, 122891, 122693, 121309, 121875, 124375, 124606, 119721, 117021, 116421, 115912, 116246, 116554, 112315, 106055, 102163, 101989, 104628, 103744, 100507, 100917, 97278, 98290, 97120, 96786, 96389, 90696, 88226, 90561, 97602, 99792]
7916I9792k96K42n609k871l471n655p06J258l83n99l031j111l692k90j038M0j211
7899G1369m48L7n08L108j149l731l002J272K549L612k094n383l918K03j2L443
7883F5348J775j237n103k688j01k005j326j896J207k78j831J606M742N41m225
7868E4529j49j236k178J209j24k051J064L825J287r84l098l937k180J662L985
7853E1624J775l767k771L89j580L67K110l646k365m10L414k529l94j75l195J090
7837C9937J845K09J746N44n79m403k598j738J853O31L32M72P61j282k822m86K727
7820C7149J819P80m046n43J548k97o35k191q41O91p24k21q3J526k852j616l984
7803B5480l463J677J79J384l36K101K453J785j360m072k716n78J984M177J033
$$ y = [99792, 99496, 99738, 94129, 91258, 87787, 82132, 81426, 82684, 82301, 81702, 78671, 77560, 73868, 73578, 72540, 72580, 71369, 70921, 70958, 70450, 73558, 72409, 68678, 65676, 66948, 69497, 73109, 71015, 65632, 61714, 61917, 61905, 65348, 67123, 65886, 60783, 58095, 57994, 55989, 54663, 52767, 53974, 53696, 51865, 53471, 58213, 58754, 54529, 54380, 53144, 50966, 52175, 52051, 50000, 51064, 54889, 56176, 55192, 52094, 48157, 45977, 47639, 51624, 53399, 49632, 46861, 47250, 45670, 46037, 48147, 44501, 42136, 41726, 45140, 42611, 42217, 42042, 38847, 39937, 41782, 41991, 43737, 44281, 43702, 39299, 36701, 34963, 36816, 37447, 37779, 38251, 39012, 37730, 34908, 34422, 37149, 38968, 39748, 35702, 35159, 36707, 36410, 35775, 33584, 32743, 33434, 32710, 32489, 32406, 33932, 31080, 29464, 25480, 22017, 23694, 23873, 25257, 24921, 27022, 29475, 31260, 29900, 25828, 23112, 22534, 24518, 28695, 29728]
7788B9728J03K770j298l922l221J724J926J735l420o016N90K046K188j942K308
7773B5299Q15O13K287k169p30p11k342m872P36J460Q08L334N31j337j460m0j730
7756B0492K183K326q14m49J578J044j512k608K146K795o68Q38k368k302J013m17
7740B3277n742k022M660K907p19L21L873m68j115q05j869j336k853O8K105J413
7724B1695j270j522N43J148k914O36J780J029k279k193k523j512J310J964K044
7709A7936m479l534J243m42O1R41k463j556J512L302J64j462J168J22R30J561
7693A5004M984j152l856O13k97l151K10P92j868k409k596J263K737J044n188k959
7677C171J308K129J375k083k080K091Q92j953K67p97R40K640l702J616K025j961
$$ y = [29728, 29831, 32601, 31303, 27381, 24160, 25884, 27810, 29545, 26125, 20109, 20699, 22745, 24933, 22991, 25299, 26114, 26727, 29014, 26845, 26115, 25404, 23062, 18190, 18926, 20386, 21194, 24528, 25059, 23722, 22262, 22222, 20492, 22675, 25001, 24187, 23738, 25316, 26360, 24848, 22240, 24386, 27181, 26513, 27351, 24983, 22681, 23694, 23277, 17535, 15513, 20173, 23080, 22361, 22682, 26555, 26087, 24972, 24167, 22298, 20962, 18109, 18177, 20282, 21695, 20425, 18903, 19446, 20594, 17680, 18316, 20096, 21125, 18846, 16653, 14130, 12618, 13928, 15892, 17936, 13457, 9923, 11166, 10724, 10785, 11726, 9263, 7707, 9219, 12521, 12685, 11223, 12391, 12513, 13443, 15004, 19988, 18836, 14980, 15593, 15296, 12145, 12355, 13147, 11279, 8870, 6274, 7537, 10274, 11318, 6130, 3171, 4479, 6608, 7983, 5900, 3820, 5911, 6803, 4850, 5117, 4320, 5260, 7900, 4198, 5814, 7839, 5878]
7661E878j817q31p69k246M599L295J618j050K80r50m553o172J092O67J36M31j789
7644b181p28p8J971M999L790o55j778J333P4J74J121L830K955L95l363j401l800
7627F658n153k43J784l3J320K989j182q56K315J829k172O98k079K13K094r47J50
7610G385J77K470j729m037j163J936K137j607j349M61J538k137k340Q62p87J09
7594A926J402J216q91J58r03k443j704M796P52j127k45J141k782J35q15k962m62
7577b808l80J960k56k85L635j124m210l485j96M856j00j760K391J114J240N33
7561A125j985J59j401mj506k140j096J014J461P20j226n65M63p51l89K094j657
7544e684j928J454O80J711J416k797j244j81j222L880O858K868m474l520o21K283
$$ y = [5878, 4061, 3230, 2461, 215, 4814, 8109, 9727, 8677, 8957, 8007, 3454, -2718, -1626, -959, -823, -392, -2181, -2909, -2987, -1016, 3983, 7773, 7118, 5340, 6673, 6747, 6921, 8042, 11872, 14827, 15222, 11859, 10458, 6658, 1505, 1262, 3046, 3013, 4333, 7322, 6140, 5284, 7599, 9428, 7256, 7954, 5875, 6088, 8182, 7235, 7385, 7562, 10032, 8303, 4266, 3103, 5039, 7176, 5569, 4220, 4681, 6219, 4082, 1742, 2604, 1817, 1926, 3328, 4544, 3653, 3811, 2908, 465, -1239, 3557, 4309, 3182, 2937, 4078, 1296, 1431, 616, -2346, -2808, -3188, -1228, -1484, -1769, 1866, 742, -3468, -6953, -7149, -2293, -2393, -4153, -1762, -648, 592, 1125, -860, -701, -2102, -2106, -3612, -5752, -6848, -5834, -4373, -3653, -4879, -5444, -4981, -5732, -6121, -4027, -5684, -7612, -6158, -5478, -3767, -2351, -5148, -6392, -6573, -7795, -3915, 2943, 5811, 1337, -2183, -2804, -521]
7528e21k332l474Q84J635n52J070J528l43K102L072K23j586l103J475K107j508
7512F77m9l899l802k564M182K977j022Q4k251j187K559K972M14K11K59k553j928
7495d920l610k00Q01K226P97M14K459M866j308j946q19K090m30l62k119M21L444
7478A804J460k672r31N19j98p12J924q06K23O3n95J760j41k276o23K006J165l915
7460a945j12k085j509J730J906L995J491l073n64L18l467m774k591J430J56r9
7444i193j36J481J684R0K660L596R65j440l740j211j186L314J222q72j454K789
7428a431j809j967j694J603J35J064r01j293J44J532j582R94K254j033R27l57
7412c414j478p29p48K806K133O79l90l374l717J606L223l59l046j844Q14o62K62
$$ y = [-521, -2853, -6327, -5443, -3808, -4360, -3290, -1762, -2105, -3, 3069, 3292, 1706, -1397, 78, 2185, 677, 628, -3271, -7073, -9637, -5455, -2478, -3500, -3416, -5667, -6854, -4295, -1323, -909, -698, -439, -2992, -4920, -8530, -8730, -7929, -5703, -4906, -4492, -2033, 2833, 1525, -421, -1240, 850, 420, 58, -2061, -1640, 1804, 3264, 592, -339, 180, -18, -730, 1194, 388, 611, 674, 79, 1839, 1698, -578, -1201, 805, 1970, -1945, -2057, -4142, -5651, -3921, -2015, 1980, 3471, 398, -166, 152, -3315, -8089, -10680, -9250, -9094, -9193, -9329, -7848, -6164, -6074, -3414, 182, 1147, -293, -4033, -5244, -6430, -3116, -1894, -2766, -4220, -1431, -3240, -5207, -6901, -5298, -5163, -4099, -5000, -6293, -6149, -4617, -6199, -5205, -2951, -3984, -3057, -3414, -4892, -5621, -6369, -3563, -1430, -751, -1141, -4515, -8232, -6626, -3403, -3762, -6808, -8652, -7838, -8500, -8238]
7395h238j060K544L744k226Q6j702K554M273J799O67l146J928K922k521j333k542
7379b251m728j092J736Q66n30m63K405o43pj816k935L177P77M90P06j128L587
7362a849K494j253n231O33N38O65J61k40l537P89J669k598q3L544J760l688j496
7345g722P36k506j47J416N49J527K128k748l82J075k595J052N604P26r69j56J746
7328f66j048j354N40N23j216o277j035O037N442N00J431j622k629n626L85r4J564
7311e145M436j822P90R14K312k564n27k81k240j899K959O033J651j043j786j88
7295A600k734j082J413j733r49k247j156M936J247q09j164m746p47K289l11Q17
7279e376J254R94K512j329l386J404L008j002k118j048K129o72k80q4k282R09
$$ y = [-8238, -9298, -6754, -3010, -5236, -5150, -6852, -4298, -25, 1774, 2441, -705, 1223, 4145, 1624, 291, -2251, -6979, -8071, -6335, -5469, -5999, -6462, -4057, -4700, -4707, -6523, -9458, -6281, -5504, -5014, -4308, -5436, -1849, 645, -608, -5839, -5206, -4668, -4003, -3842, -4082, -7619, -6830, -5161, -7759, -7842, -4298, -2538, -6226, -7722, -6986, -9492, -9639, -8223, -7674, -6147, -4019, -6767, -7149, -6074, -8669, -7617, -2013, -1287, -2256, -2412, -666, -1714, -3068, -2528, -2005, -3221, -9498, -10533, -4496, 946, 1446, 2877, 1255, -1374, -7000, -6615, -6709, -5145, -709, -2531, -1741, -827, 1485, -1079, -1606, -1887, -4127, -6026, -3067, 2966, 4617, 3574, 1788, 1600, -1134, -2216, -803, -2536, -3485, -5732, -6888, -1952, -705, -1514, -2678, -7424, -8171, -5882, -6193, -5376, -4122, -3128, -616, -1945, -5331, -3927, -919, -1921, -4039, -5087, -2958, -3630, -3910, -3994, -6276, -5367]
7263e367K919K985j126l496k275j0R87J28j106l359L13K416L087q05k159l775
7247a0643o24J132L20L059N897P73k434J311K150j288j598J098j184k368j853
7232f252n23l01L112J722k263N06O27j520k335m26J943O52m799J491J155j527
7216h738J735K361M494N54l461n53j718K665j08m872J216J600J593J576l353j057
7200f066J216q81j057l061J185N949K967m48j671K49J028o68J092k450L90L054
7184H28j920j058K357N62k189L95j205J863K447j400j670j043p74K140J137o2
7168D08K37m52j378j252K494j59m67L40Q58l56m0j749m627R99R64l87M391m2m961
7149e179k588K716L95L31J63K300o81l582l239N65j311J019J926l93M144N709
$$ y = [-5367, -2448, 537, -589, -4085, -6360, -6370, -5383, -5255, -6361, -9720, -9407, -6991, -3904, -4709, -6868, -10643, -11267, -10135, -9815, -6756, -859, -86, -2520, -1209, 941, -347, -1945, -847, -2031, -4399, -6252, -6775, -7076, -3964, -2242, -4505, -3999, -3372, -4892, -7227, -7653, -5710, -5058, -9857, -8366, -7211, -8738, -7003, -4642, -148, 406, -3055, -3608, -5326, -2661, -2769, -7641, -6425, -4825, -3232, -1656, -5009, -6066, -4850, -5731, -6788, -9849, -8664, -2715, 252, -196, -1867, -1618, -590, -1258, -166, -2616, -2226, 828, -1092, -2150, 207, 769, -1420, -1025, -2230, -367, 2080, 680, -990, -2033, -2807, -667, 470, 408, 645, 193, -1185, -2437, 57, -102, -569, -229, 629, 273, 233, -1516, -6143, -5144, -4180, -4567, -176, -218, -5179, -7767, -5051, -4656, -4325, -4162, -1862, -2543, -6125, -9364, -8799, -10110, -9091, -7165, -7558, -3414, 2295]
7133B295j886n06M44j709q29k317K58p41R86k847l827m486J577N276J564J97L26
7116f225K342M489J420j644P58j043j568r10l395P29M74k444P9k211J836K307
7100e006j107J737J753m816j868Q47j386N382N852k749k672k2n425m403N559O941
7084a383J700M2j793j371o75k650j175J055k505j556J826J050J221L159J520r65
7068b500k528K659L210m132k98J886k478M03Q51j108o97k391j853j63j244k185
7052a2568O39j151J398K948O26M60L11J099K35j021Q39L148L302K42l353j755
7036d601k10J265o29k549l49J191R2J015Q14k223l241J704J84K534J367n323l7
7019h996L3k015K5L998K820L29j960L504J286r79j610N68J042k352j142l114L08
$$ y = [2295, 409, -97, 347, -1362, -2191, -4508, -4250, -4991, -4005, -6852, -10679, -15165, -13588, -8312, -6748, -6551, -6225, -3883, 606, 2026, 382, 1140, 97, -1471, -2381, -5776, -5047, -4573, -7017, -6938, -9149, -7313, -5006, -6113, -4376, -2623, -7439, -9307, -8460, -9846, -4464, 1388, -1361, -4033, -4055, -9480, -13883, -8324, -1383, 317, 359, -1434, -2805, -3480, -6130, -7305, -6250, -8755, -10311, -8485, -7435, -6214, -3055, -1535, -2500, -5028, -2369, 841, -3291, -3589, -1703, -4181, -3778, -2927, -4035, -4732, -7123, -8976, -9139, -10383, -12568, -11929, -13080, -11682, -8734, -8108, -7648, -7337, -6238, -6003, -7024, -6185, -3037, 265, 507, -2846, -4601, -4811, -3546, -4175, -6724, -7073, -5882, -5790, -4775, -3961, -6184, -9425, -7721, -7537, -5003, -3636, -8959, -8996, -8963, -10978, -10953, -6955, -4135, -3806, -5766, -2262, -976, -1955, -3565, -2997, -1955, -4307, -5449, -8563, -8255]
7002h255M935o62l570K153p20j075J65J789K491q27j11J661Q43p37L11J40k424
6985c893m041L19K731Q45K822J516k620Q59J078M336q10l300J414n77m591n69
6969d481K432J183J422j414j046R11K80p33j170j120J544J921r44l691L60J432
6953c114K186q96N87J091p20K4r05m449l005J057K82N435K513k686q76l400p84
6936g660J629L741r78m131J110L516J545l626l087J957n98k808k38K311O27m75
6920g165R32p04Q13K483Q33k587J30O96k229r21R67K890m65l040k952L646J846
6903d827J317k239r12k794k713J250M332K941k53K875q14m457o93J871k0K14L495
6886a427k437n076J660J887p17L344O179J535L405L30l211k978l000j994K89j379
$$ y = [-8255, -3320, -3982, -7552, -5399, -6119, -7194, -7029, -5240, -2749, -3576, -3687, -2026, -1183, -1920, -1609, -1469, -3893, -7934, -7615, -4884, -4039, -1217, 299, -2321, -1462, -384, 3952, 3142, -158, 1256, 679, -3912, -4481, -2049, -866, 556, -858, -1904, -993, -713, -1446, -2616, -3736, -2192, -271, -1215, -4906, -4546, -3114, -928, -1824, -1237, -146, -866, -842, -1747, -6196, -9201, -8144, -7862, -2427, 86, -2600, -3476, -6876, -7660, -6031, -2290, -3268, -7399, -6289, -2773, -1228, -4854, -7941, -5984, -6582, -9390, -9628, -7317, -6690, -7165, -6233, -6937, -6124, -3641, -2808, -5395, -5265, -4569, -6798, -7719, -6752, -3862, -4327, -7367, -10319, -6673, -4827, -3510, -5749, -6661, -9455, -12168, -10918, -6586, -3645, -3898, -1023, -1837, -6294, -6987, -5116, -5136, -4922, -1427, -3864, -8940, -7280, -5393, -6110, -2766, 3413, 4948, 8353, 8683, 5472, 2494, -506, -2500, -2211, -3590]
6870c590j267K05J098O22j429l7j504l469J843K447q65k068J16j729N603K385
6854a639k466J638L023l179l462K376L280k218j34K459j229n856R95J785K463
6839b164r22p54J670J843J704l63j659K466j348K851j795m654k303K151p73m231
6823h281J326K691m072k185J832J302K392K835K493J687k912l147j36J975k980
6808e180j445j331n13J642J607k243n060L486M215K626L86Q68L42l463k834L323
6792c574M280M63o78m11k370k346L790n03j378m03j477j372K043Q52k353Q5k752
6775h104n88J234Q43K368O58p90L861l77o13M695L1K42j574n339n308J570K250
6758d941L963J071j430L85K873K987l550p814m190l07L926N397N616K27l27l637
$$ y = [-3590, -4857, -4652, -3554, -2932, -4361, -4398, -5902, -9371, -7528, -5081, -5946, -8014, -7898, -9627, -4024, -1639, -4105, -2467, 556, -2623, -6085, -3709, -429, -2647, -2781, -322, -1551, -7407, -6412, -4627, -2164, -3086, -3840, -2170, -327, 1377, 1014, -645, 1821, 473, 3324, 1529, -3125, -5428, -3277, -4050, -8281, -6955, -4264, -8336, -10521, -8689, -7387, -4995, -2160, 333, 2020, -892, -4039, -4175, -2200, -5180, -6625, -7956, -8469, -6827, -5220, -7463, -12523, -9037, -4822, -2196, -1810, -942, -600, -4063, -6897, -3574, 706, 1169, 491, 80, -2290, -4636, -846, -1349, -2727, -3130, -4607, -5979, -3936, -3084, -5437, -5352, -8104, -8692, -7458, -6615, -4247, -3589, -4379, -518, -895, -1508, 3187, 3218, 3460, 1886, -3453, -8761, -7191, -4941, -978, 93, -1337, -952, 1921, 4908, 1358, -6456, -10646, -10953, -7027, -1630, 3986, 4213, 3886, 249]
6742B49K9j153k825J256Q4j994j058N112L298J409J868Q80j271k815l695k909
6726c535j238l381M69O270L892M314k083j770n26k140n282p66J47k28K110J962
6710a785J8m69p40J381M0l287J61J101l141L80K949J80M247O85j882n00l887L975
6692e74J684k114j930j249K287M497L38l383m385j565M50k1l52L262K909L67k187
6675a966L85J032Q5J71K392O61p76K57q24j39k453j229M351J820m45k888J87l364
6657b743M178K037p73o49m407j241M8J151l15Q06L39L956l20M18K795N05p46l096
6639A943m157J507R91k680j809q0L87N318J777J762J027j36o40m278k820J517
6623c71j326l161j150Q67k7Q44K71J873J652j49k786L097K474j261N90j784o686
$$ y = [249, 278, -875, -3700, -2444, -2360, -4354, -5412, -300, 2998, 4407, 6275, 7155, 5884, 3069, -626, -3535, -4773, -8154, -7685, -1415, 2477, 6791, 4708, 2938, 2412, 272, -5010, -5776, -5629, -5857, -3747, -1785, -1767, -2236, -2976, -1595, -1555, -4842, -4681, -3580, -6721, -6341, -3392, -3212, 1035, 1720, -162, -662, -4549, -574, 1110, -1004, -2934, -4183, -1896, 2601, 2939, -444, -4829, -6394, -5944, -5965, -6317, -3055, -146, 221, -1966, -1581, -549, -464, -293, 2099, 2760, 1984, 2241, 1417, 1278, -1175, -2404, 1947, 3767, 3322, 434, 621, -2743, 1435, 3472, 2699, 2050, -2357, -3598, -3550, -2399, -2714, -1908, -1569, 2387, 2067, 2485, 5280, 5785, 5039, 1943, -2214, -707, 284, -2396, -4205, -4285, -3898, 1420, 3197, 4959, 5986, 5850, 5210, 932, -1888, -371, -1697, -4858, -6008, -5141, -5168, -4324, -4053, -2180, -528, -677, -3463, -366, 2108, 847, 1437, -347, -7033]
6606g033j487K361K165L573J477N84k486m817k520n25K585O68K716M009l225R51
6590a004K936K089K47J599p17m591j973r9m96j491P43R48j75q93P57L425O84J796
6572C785K263M12M45M41m190K834L386L532n30k577j734M70L706J774L824J939
6556A9780J0090J6230J7402J9469P711r920k2158k0658j6624o580l678o980l485
6543E99o22l45m223K091j298j407J728J511J647j678n19M771J558o103J223K909
6527A842l040k554O69M49j124L817N143l85k020j851L917j97q59J354J119j081
6511E199l91o63l047k881m67K263J007k06O5j328q22j997K800J335j264J259Q12
6494A674l323n0O79L18r06o27K902m19j591q80j977k134J635JO19J416J368L961
$$ y = [-7033, -8520, -6159, -3994, -421, 1056, 1640, -846, -5663, -8183, -8708, -6123, -5455, -2739, 1270, -1955, -1004, 1932, 4021, 4268, 5867, 5150, 559, -1414, -1513, -2009, -3500, -2757, -1809, -1984, -2877, -2120, 1305, 1989, 3785, 6048, 6460, 6905, 7346, 3156, 5990, 9376, 12908, 12378, 9801, 8067, 8537, 12243, 14017, 17841, 19780, 29870, 46100, 63502, 82971, 90682, 80762, 58604, 37946, 21322, 14742, 11064, 4084, 599, -23, -368, -4591, -2500, -3798, -5205, -3477, -1966, -319, -1997, -2516, 2255, 3813, -2290, -1067, 1842, -1198, -3752, -3083, -2634, -3758, 59, 5202, 4817, 2797, 946, 4863, 4666, 3807, 5161, 6280, 5199, 4808, 4145, 1098, -1783, -2250, 13, 1020, 814, 879, -449, -1271, -3268, -468, 867, -397, 862, 1674, -1649, -1699, -1020, -702, -1608, -2235, 667, 248, -1343, -2223, -4200, -6334, -4699, -4698, -4079, -2663, -1295, 2666]
6476B666j80p55m289n045L9O041j977j594P59m4M510j804l493R57L45R08K950
6459fK219N84o95j098k996K124P12p98j14K355L130J037j897l373J586j720n550
6442d500n43k213O84n27L72J716N367M800K031l119m657m598O71J594L271k0K397
6425B726j690k368J402K175l013j765M459n11o10P86J289m827K217N49J220n147
6409c108o399p16J310J701P93K722R68K72n5K058j379J155m292j977j738J060
6393g625N138K789M38n0n49J856K714n210k216j14L512J948k336l940l434J523
6377e556p86K576M894L712j178m722J218O373j340q515L74L741o82J783J101K252
6361E245k290l517j785n71L574K572O03K259k633m979k657J856P09L366M21J542
$$ y = [2666, 2486, 1731, -2558, -7603, -7564, -1523, -3500, -5094, -4335, -4379, 131, -1673, -5166, -4209, -3864, -2956, -6, 2213, 2797, 2102, 1004, -1992, 132, 844, 46, -68, 2287, 5417, 6454, 4557, 1184, 2770, 1050, -4500, -5043, -7256, -6572, -7099, -6727, -5011, 356, 5156, 7187, 4068, -589, -5187, -4516, -2922, 349, 329, 2726, 1036, -1332, 70, 2245, -768, -2533, 1926, 1415, 805, 1591, 2880, -1947, 270, 819, 2039, -3108, -9507, -10223, -8913, -7212, -6419, -3697, -2729, -2457, -2512, -454, -1833, -678, -4970, -6947, -8685, -7625, -2487, 302, 740, 690, 141, 1997, 4711, -499, -2715, -2829, 683, 2631, 295, -3645, -7079, -5556, -6342, -3766, 1128, 4840, 3662, -1060, 158, 6531, 5191, -3324, -2950, 791, 109, 1892, 2993, 5245, 2955, -562, -2347, -2918, 656, 3228, 3831, 6090, 3457, -1522, -4179, -2323, -1614, 1752, 2173, 3715]
6345C715j180m74J404q9m47J453r08j371k531k221j26m394R00L793M234K40l824
6328a826k406q46l07J171L720J700q6K236j868j038J645k78O69R27k221q20M10
6311G82O79L923j91j440k339j656k37L322l08J484j668l48l048K090J547L39l450
6294e19j105l77J511J259n90o84K250j71p17J438j65l009K456j201M6N655j801
6277D276j299m769k493J588R99J994j691j324J200J748j046l813J024M373K19
6262I86j739j05k659k31K075J781O02K661J841j79k718l056K398Mk11q69l838
6245c257J741K249l773K068K138o28K879n26m318j930J666J985J058J697K219
6230E268k744m906q36L406K465j974j72j414J437o05j897L360k759n239q29R53
$$ y = [3715, 2535, 2061, 3465, 3376, 2929, 4382, 3474, 2103, -428, -2649, -2775, -7169, -6269, -2476, 1758, 1998, -1826, -4232, -5078, -5385, -4214, -494, 1206, 1120, 3356, 1488, 450, 2095, 1817, 2486, 3413, 1192, 372, 782, 1461, 5384, 5193, 3753, 1414, -242, -479, 2843, 2535, 4019, 2351, 2003, -1045, 1045, 2592, 2931, -519, -1624, -2001, -490, 769, 179, -505, 1745, 1574, 857, 2295, 2130, -879, 1577, 376, 422, 6077, 4276, 2977, -1792, -4285, -2697, -1698, 296, -1395, -2719, -1519, 229, -817, -4630, -3606, 767, 986, -753, -858, -3517, -3748, -1673, 108, 710, 3371, 5212, 5033, 2315, -741, 1657, 1661, 1450, 581, -3257, -1516, 733, -3040, -972, 1166, 538, 3417, 2891, -1427, -3357, -1691, 294, 1352, 3049, 5268, 2524, -2382, -3218, 188, 2653, 679, 507, -907, 530, -75, -1972, 1388, -1371, -6610, -7439, -6486]
6214f486J719J441M150m91k011k386J643N9K6j012J004K824k658j155k049J238
6198d144J282j423J11L501M263L943m980k007r20r45J207J231l11k200Q59o06
6182a139j862j64k97k115o29L661K325k489K22M287K514j648k4J041R4J36p48
6165C165n45O36l11k765M35j641k980O3L695j523M491L566m732l828J894L777
6149C397N01O95k854m459L185j99J612k21m95q8J228n04j449k483Q50O156K33
6132E105l290o10J485J287l558j100J63J749k218j525J12r11J29J457k129j004
6116d858J495K249L232J67l962j220J967m80k191k386q3K177j968k568j150J531
6100h048K588J59J353K453O99m61J812J981q10m96k273K203o52l637J861J745
$$ y = [-6486, -4767, -3326, 824, 333, -1678, -4064, -2421, -2362, -2336, -3348, -2344, 480, -2178, -3333, -5382, -4144, -2862, -4285, -4174, -673, 3590, 7533, 2553, 546, -374, -1319, -112, 1119, 808, -1392, -533, -1139, -3001, -3165, -3462, -5577, -6206, -2545, -220, -2709, -2487, 1800, 4314, 2666, 2642, 3683, 3777, 3913, 3165, 2620, 3256, 2945, 180, 615, -1026, -4006, -3943, -248, -1771, 2720, 6286, 1554, -2274, -380, 3397, 3898, 4593, 1739, -2720, 465, 266, 1878, 1657, 1162, 1074, 2302, 1798, 349, -2134, -1284, 4872, 5105, 1815, 1205, 2690, 3977, 419, -681, -518, 1231, -987, -2512, -2400, -3311, -3182, -1725, -3854, -4858, -3363, -1114, 2118, 2285, -1677, -2897, -930, -1410, -3601, -5987, -6070, -3893, -5861, -8429, -9579, -8048, -5460, -5301, -3948, -1495, -796, -1257, 555, 2536, 1726, 1230, -1043, 1160, 508, -3129, -1268, 477]
6084D77l77K830O03q62o87j132K27J234k695l12P64j627j441j287J753L565K047
6067C080N34k550l490r31l522l85L658J415r27m55K026K60L448o45l11J744J183
6050D132j848J325r49j205k488K546n21L06p42q29j800NJ226m63l69L739k787
6033g22j915R44J462o73k746K180J965J758K795k329l460k884P18L329M390K411
6017G223l776l697K749J990o06k694j156k149J49K475J591J094k204j795L059
6002B253k510j14K771J734L60N40k140J666J050J018k401o214r8j52j293K033
5986a497J031l264q58m41k107p02j922N94M023M467K801J985J845r50j968j012
5970B025q67k420o144J356N656J528q12j839K225N2k998J396M97J721R51n195
$$ y = [477, 100, 2930, 3533, 2671, 1984, 852, 1079, 2313, -382, -694, 70, -1557, -2998, -4285, -2532, 1033, 3080, 3614, 1064, -2426, -3357, -6879, -7264, -3606, -2191, -3118, -3573, -1547, -1287, 2161, 1516, 1205, 2949, 4132, 2284, 3609, 2660, 1455, -1033, 1513, 992, 1298, 556, -273, -2073, -2068, -842, -1305, -1674, 2065, -722, -2637, -1693, -231, -904, -3650, -1470, 495, 2253, 5048, 2719, -741, -3625, -2907, 422, 4812, 7223, 3447, -250, 2499, 4489, 3883, 1189, 33, -2116, -1967, 508, 2099, 3193, 989, -806, 2253, -257, -371, 2400, 4134, 4494, 5034, 2894, 4560, 5610, 6628, 4227, -1987, -2085, -2237, -3530, -1497, -466, -3730, -4588, -5029, -7136, -7838, -9760, -9166, -5143, -676, 2125, 4110, 5955, 5005, 3037, 2025, 1158, -1262, -7406, -6050, -394, 1134, 322, -1517, 708, 760, -2238, -842, -345, 1376, 2327, -2868]
5954b868j78J241J66K352K954J649J877j548j493J110j901l117m700l846L876
5939d426J727J099K583K273k225m02M85J379m02N67J799J648l229l264k651R01
5923b138N0k05J870L71n43j159m350j226J520o04L138P46r06J107P89L74l55L775
5905B254j005m96J147J211j502o70K339j346n89l765P29l98k53j212L085K90P14
5888E33m179l540M291K912O80j374l470L864N769P77m979k067m85N017p5k477
5872A197j475K442l292j194N46L680O45k917j801j20Q9k64M85J969j202j785m90
5855c487j741M036K235r28k6N10m03O98O56R27k999P8L00k750K48J766j4k535
5837c429K739K579J754k943L196J169j084J170J403m9j655j94j156P42J271j046
$$ y = [-2868, -3046, -1805, -1639, 713, 3667, 5316, 7193, 5645, 4152, 5262, 3361, 244, -4456, -8302, -4426, -2699, -1600, 983, 3256, 1031, 629, 1114, 2493, 2091, 2658, 4457, 6105, 2876, -388, -3039, -2138, -2088, -2293, -423, -52, -595, -1754, -6104, -7330, -5810, -6414, -3276, -2530, -3436, -2329, -1540, -1166, -1521, 2254, 1249, 753, 1900, 3111, 1609, 939, 3278, 1932, 1343, -2422, -1693, -2091, -2344, -3556, -471, -181, 533, -3646, -7186, -2895, 17, 697, -677, -4147, -283, 5486, 6263, 1284, -783, -1268, 3749, 3674, 1197, -278, 2164, -1128, -2322, -1776, 1904, 2549, -368, -2169, -2289, -2200, -2464, -1979, -10, -1212, -2997, -3487, -5228, -1192, 1043, 115, 89, 599, 196, 894, 1550, 2477, -522, -444, -144, -2894, -2646, -880, -894, -3429, -690, 1889, 3643, 700, 3896, 5065, 3981, 5151, 6554, 6505, 4850, 4656, 3500, 4242, 5513, 4467]
5821D467j188K631n86k622j489K880P24L65j243J058k869q4j116j798L268p14
5805A684q94k37m43j008r88J29K841k713j714r80J214K861L022K56J560K878l007
5788D461o556m197P65M986K93J232n56l195J112O025J536l437j829k49j467j543
5772b619K359J735R04K592j033j663J525q59j366j574l90q8M32M987J201k848
5756C295l98n88j50J504m41k059k919M52K00N4K323J415K537k35J61k957m524
5739b330j955J51L23o23j31J794K065k755j903J827J892N01J165L591N49o011
5723a850q49K564K739k144k620j64K679j140j737O18J218p5L754j114k638m12
5707a171L232n90j665N93j100L150R5m413j066N284L355J753J458j064m810k686
$$ y = [4467, 3279, 5910, 5324, 2702, 1213, 4093, 4817, 5182, 3939, 4997, 2128, 2044, 928, -870, 2398, 1684, 790, 553, 110, -898, -1886, -1757, 1084, -1629, -3343, -4323, -3109, -248, 2774, 3030, 4590, 7468, 4461, -2095, -6292, -5527, -541, -248, 984, 428, -2767, -1655, 4370, 5906, 2469, 640, 391, -1076, -2619, -260, 1475, 2379, 4971, 3938, 2275, 3800, 2941, 1575, 1, -389, -477, -45, 4942, 6143, 3295, 2897, 2309, 2159, 3663, 3222, 1163, -1756, -1304, -1104, -1050, 1273, 2688, 5225, 4990, 5151, 2194, -2330, -4285, -4134, -3811, -4434, -4565, -2771, -706, -3461, -5364, -3537, -1645, -1144, 21, 3612, 4161, -1850, -2699, -135, 2604, 460, -2160, -2324, 355, -785, -2522, -1904, -686, -761, 2993, 1879, -759, -1171, 2061, 1471, -194, 399, -701, 2449, 2544, -1869, -2935, 2349, 5704, 7457, 8915, 7851, 3041, 355]
5691C55p3M98K280J831n86j891L139j332n286J53J331K83O464J431p63l812j448
5674B574L556l844j115p05j44l15J290j489P66l31j247k310k855k064K072M672
5658a489p84K17L4J832J474m15J451j58o280m079K187J606K415J749P86j034N35
5641D7k281n44J48j327j365J922Q1m05o43q17J941K084J811l13l030r64O37J338
5623a680L497j084j519J665K588L021j863n08L33n13k593p82j593r69k076m74
5607d550N16M682L63j516K068o4m57R87K150l172l095J592M32J296P32m72Q80
5590B372K680J995p39R9l521k81k770m09K29J713k029j907L516j04r42j287k813
5573d198j735M10M320J481k052M33J131K702k92L399p73k353n072m55P09J206
$$ y = [355, 282, 780, 3060, 4891, 4305, 2414, 5553, 4221, -1065, -912, 419, 702, 7166, 8597, 7834, 4022, 2574, 6130, 2286, 1171, 466, 322, 7, 1297, -192, 574, 243, -1004, -3314, -6169, -8233, -6161, -1489, -2273, -2056, -2022, -190, 1284, 869, 2320, 2162, -4118, -8197, -6010, -4404, -1989, -240, 546, -488, 47, -2234, -2778, -2630, -3957, -5322, -3400, -3319, -3724, -4367, -5184, -3243, -1159, 652, 339, -2691, -3655, -3018, -1680, 1817, 733, -786, 879, 3467, 6488, 4625, 4117, 4450, 3937, 1344, 562, -1031, -2000, -4076, -4550, -4034, 648, 1011, -505, 1563, 1499, 1042, 2029, 4179, 1007, -2088, -496, -64, 1232, 1964, 1492, 2372, 5052, 7047, 6308, 6407, 2886, 2605, -165, -574, -345, 1368, -661, -2568, 948, 844, -98, -1385, -4198, -5933, -5523, -1203, 278, -1774, -1341, -210, 2492, 2200, 5599, 4826, 2473, -2599, -3054, -2345, -1139]
5557a139N69J644K949k852n42L40q77k986j459J93P64L468k69K60n72m145ML808
5539h42K729j043R18J590k947j364L787K434P08%j711j539j079r45K9l168Q10
5522a633r04M24N51k83L93L008L869j13k23j483j057l414l584J122K503l319m057
5505h200L565K979M0r98k467J876J801J511K390L65L93k222L65L966L62J622m447
5488B901j322k034J347K634M22N76K85N23J280j178k108k844r21o31J433O7J279
5471A709K559j832k493j779O351K87l216Q18K173R52Q47l270j732r91j28J775
5455B030L203j613o23l96K920O69l853l084K96J241l65l943L434Q36R41K054J915
5438E662j753j285j461J020o63r58L36p22n393j476P09K232K153R99j808K184
$$ y = [-1139, -570, 1074, 4023, 1171, 629, 969, 92, -2894, -4353, -4160, -3396, 72, -197, 63, -509, -4654, -4650, -842, 1887, 844, 1762, 3352, 405, -959, 2828, 5262, 5970, 5970, 4259, 2720, 1641, 696, 725, -2443, -1633, -2537, -2113, -1562, -1845, -1452, 1556, 5425, 5312, 5089, 3606, 2549, -865, -4449, -3327, -824, -4143, -8200, -4635, -1656, -1616, -2614, -5081, -3205, -1404, 107, 2497, 2862, 3255, 1033, 1398, 5364, 5726, 7348, 2901, 1579, -455, 892, 3526, 3948, 4524, 4809, 5332, 6612, 5434, 3326, 482, -439, -1070, 363, 430, 1709, 4268, 2436, -57, -1836, 4515, 4802, 1586, 2404, 4577, 5529, 6376, 3106, 1374, 383, 255, 2030, 5233, 3620, 2997, 2601, 5521, 6190, 2337, -747, -451, 790, 425, -3518, -84, 752, 1693, 3747, 5662, 3909, 2624, 1163, 2183, 1520, 562, 898, 176, -5217, -6693, -5984, -3752, -1599, -600, -2408, -224]
5422b24M170J718m116M83J395K022K458P55l810j363l487o07L328K153l241k100
5406d66J042m67J034P5l317l40J114j857J094o62j529O86M629K159L10n666k728
5389d889J939N522L429j870n038j47K802j20j943m13M860K132k636j799J621r41
5373B509j875L58q10K69k240K520K567r93l82k81L110M229o9j041o16j015l44
5356E896m518j146j86O62J669O32R13J307l699j618M97Q40J036j395J65J156j660
5339E51l71J227J445J41r76j960k249Q16J08k58J752K78l465k76J655N07M108
5322C033k61m634M69K660k271j479Q54n30J576q90m62j357l219L160L181j662
5306a832l439j741m81M072K923l968j733L192L282K14r67m11Q97J753l33j452
$$ y = [-224, 3946, 5664, 1548, 2031, 3426, 5448, 7906, 8661, 4851, 3488, 1, -606, 2722, 4875, 1634, -466, 576, 109, 1143, 1218, -2099, -2439, -1325, -3182, -2088, -2750, -4279, -3593, 1036, 3195, 3505, -2161, -4889, -2950, 2572, 6001, 4131, -907, -1054, 1748, 1628, -315, -728, 4132, 6264, 3628, 1829, 3450, 2509, 634, 992, 182, 451, -1789, 731, 3298, 2305, 1923, 1642, 4752, 8981, 8912, 7871, 7255, 6240, 5896, 1378, 232, 46, 708, 2377, 3009, 3922, 5229, 1530, -88, 409, 1249, 2285, 890, 1055, 2211, 551, 180, 1407, 2852, 2993, 2017, 57, -2192, -1376, -1268, -1526, 226, 504, -2961, -3237, -1582, -1075, 3033, 2772, -1862, -1393, 1267, -1004, -2483, -1629, -2159, -583, -1473, -1935, -3292, -6511, -3351, -170, -1832, -5271, -7012, -7493, -3421, -498, -4466, -6199, -3007, 275, 489, -478, -889, 8, 1761, 1428, -24]
5290b4j411J631N99K00J433N02J815j160J080J31l6j787k428j659J089J863J776
5273C614J30O9k12P71J931q73n733m147L09L309j60N214K760P22k7j756Q70m558
5255B233k075L005k129J436K55k548J731j481K429J287m817j129P138j127k347
5240A861K80k46J502l997k727J899J943N696N93m955j114m15K577L334j959l445
5224H27n23R00j955N40O7j368k129J169K258K795J187q19L913Qj407R42k800j188
5206B417j147M77M61k629l499J265M807N3J6k537r34k059q83K204M719J894l72
5189D253M36k081k002J486j899P53P61k685J471K361Q62L455M42k042r3j140l025
5172A313J801J177r90L44N10m047O55J311k57o72J811p47l827K571L79p55j180
$$ y = [-24, -1435, 196, 795, 995, 2428, 2930, 4745, 3585, 4665, 4796, 4760, 2973, 545, -1114, -25, 1838, 3614, 3744, 3813, 3601, 4372, 6303, 5430, -303, -4450, -4141, -832, -992, 4222, 6982, 7704, 7677, 5921, 6791, 2233, 158, 3163, 1034, 2470, 2725, 177, 1908, 427, 2856, 4143, -674, -1803, 5335, 4208, 1861, 2141, 1895, 3397, -600, -3327, -1428, 515, 6211, 6804, 1849, 735, 320, 2897, 6231, 4272, 827, 304, 1204, -751, -211, -144, -1512, -3641, -2472, -214, 2581, 3768, 2949, 6862, 6870, 5463, 6405, 3605, 2417, 1270, 1747, 2208, -421, -3920, -2655, 2152, 2205, 2221, -316, -1250, -3309, -4192, -1988, 2731, 4625, 4253, 4689, 2608, 606, 2092, 193, 946, 1707, -978, 493, 2854, 3716, 7171, 7613, 5571, 5478, 4338, 1313, 3114, 4291, 3301, 3645, 4155, 108, 763, 2074, 1817, 1145, 2956, 2209, -1618, 953, 1332, 577, -603]
5155f03j393J821k45J144j493r89K938L144J508l8M14o47J258j835k249k741P5
5138F9R45k17n63l361K393J15j560k327L80K195k79J430J419J006k631j088L705
5121A631N229j285j723j221k085m834O60N782L255N93p9m92k121k115q07J99j227
5104f40J069N82j163p78j010k051KJ251K631J821m665R88L229J803J735k059j826
5087I19L324P85k547j521J203P61n65K023p51J7O252K346m983r46J901J999k171
5070H046j73M55m654l125K63l00r72n90K612j964o79K388K851L092l12l798n37
5053B603J261j396l407j045k456O62L60J891J140j958K180J114J246Q60N98o32
5037C021m207l006Q97q6O79K761J519J9j177K513N20j413j74j275K580L234k015
$$ y = [-603, -1996, -175, -420, 724, -769, -1758, 1180, 4324, 5832, 5794, 6208, 5561, 6819, 4984, 2735, -6, 69, 1014, 797, 234, -3127, -734, -619, -2179, -4506, -4126, -1931, -2210, -780, 639, 1645, -986, -2074, 1631, 6860, 5575, 3852, 2631, 546, -4288, -3628, 2154, 5409, 6002, 5923, 5431, 3310, 1195, 388, 587, -640, 429, 1011, -152, -930, -1940, -3991, -3989, -2738, -107, 1714, -2951, -1963, 1266, 3069, 4804, 2745, 919, 4243, 5028, 2481, 960, 2163, 2924, 2359, 4382, 3631, 3648, 9900, 12246, 7263, 6317, 8218, 10217, 8046, 7873, 8328, 3674, 549, 812, 512, -460, -1050, 1562, -402, -1081, 1307, 4158, 7250, 6938, 3140, 2603, 3864, 2468, -939, -1984, -4440, -3778, -3418, -1527, -387, -2345, -165, 949, 2195, 3055, 3653, 3021, -1186, -4192, -3295, -3381, -2702, 59, 1578, 1597, 420, 2933, 3453, 2040, 1866, 591, 3171, 6405, 4390]
5020D390m01k4L192J494K141K064m97o489k919P70K245Q13l098J065l267j646
5004a67l315M5K202K747Q99j40J02k559J264O39k988K6K910K162J648j338j476
4987B661r52L165k310k165R89M36m861k84L763L82J847J856l559j729q34K008
4971D13J93L190K405p14J305j007k170L65J874q83K561k39k813j222K113O27k228
4954C770q86J359j313k328j295r84j218L400N41L5K990l83K38K946j078K67J413
4937G474j367J133n035j219k202J691M394K56j74n78k073m28J446N33J556m03
4921E004r9L21j403l966l852K148J694K023j969j571K410L127j950q58L60m99
4905I20K3J341J201L040M815l775m973p35k565j832J730L211j876J421M141K992
$$ y = [4390, 3989, 3965, 7157, 8651, 10792, 12856, 12359, 5870, 2951, 3721, 5966, 6779, 3681, 4746, 1479, -167, -3482, -3437, -1235, 1512, 2411, 2271, 2373, -186, 1078, 1717, -1271, -1245, 1665, 3827, 5475, 4137, 2661, 1709, 4874, 2564, 399, 1388, 1824, -3037, -3321, 442, 824, 2671, 4527, 968, -761, -1595, 413, 606, 3796, 6201, 5487, 6792, 5785, 3615, 3980, 5854, 4971, 7532, 7293, 4480, 3258, 5371, 5998, 3770, 2884, 4243, 2930, 602, -693, -1677, -2895, 505, 1046, 1081, 4071, 3688, 3926, 6872, 5794, 6061, 7474, 6107, 7240, 2205, 986, -1216, 475, 4869, 5125, 4951, 4373, 2300, 1872, 3318, 3851, 5407, 5004, 4905, 5226, 3823, -143, -3995, -1847, -153, 1870, -99, -1670, 740, 3867, 1917, 1059, 1419, 920, 943, 2284, 3485, 6525, 11340, 7565, 2592, 1857, -708, -2540, -810, 2401, 525, 1946, 6087, 9079]
4889I079n926p75M126R46n52p39P30j856l775l410K326J924J604M92M14J426J983
4872H017n528m943k98M697L764j236l753k388P273L282N15o736r34m26K32J149
4856B687k25k622K707P49M85j663j664K18K210M69j774K739L94l220M13J179k550
4839E32O02J139J719k347j329n9l109j617K172j344M676K610L11K142K159j279
4823F978l981K142J192j765m95p42J435O45k849k806J083l33K592l660J020L645
4807D101L504J58k843l124l410P03K547j825K800K523k875l01j55J755K240O5
4791E863k267O25J896l359j495j39L423O20K407o58l573N79o42r53J127P97J043
4774E294k677k3M83L111L280j904n193k024K004j681k414M073K347m47n51L50
$$ y = [9079, 3153, 2378, 6504, 7450, 6898, 6159, 6889, 5033, 1258, -2152, 174, 2098, 3702, 4194, 4608, 6034, 8017, 2489, -2454, -2752, 1945, 5709, 4473, 720, -1668, 5605, 8887, 9402, 2666, 1732, 1306, 1538, 2687, 2462, -160, 2547, 3296, 3781, 2118, 454, 672, 2882, 3351, 1577, 4316, 4710, 1490, 1903, 3082, 532, 1134, 2273, 3992, 1645, 316, 257, -2852, -4469, -2297, -3641, 1035, 3645, 3956, 6098, 8257, 6978, 2997, 5139, 6331, 4566, 4071, 3329, 4764, 5409, 2560, -246, 837, 504, 3096, -564, 456, 4101, 7605, 7763, 4920, 1796, -1614, -911, 1636, -189, 2611, 5134, 2259, 1958, 1803, 3558, 5798, 5863, 3596, 4221, 6117, 2758, 1263, 1124, 4547, 5167, 7574, 6916, 3343, 3922, 3280, 2327, 3454, 4251, 5294, 2617, 2594, 3077, 6188, 9468, 7564, 2371, 347, 2351, 670, -1744, 2329, 4676, 4229, 3678, 4028]
4758D028J79J72j976K172k481J684K665p08m164k968j290m71O43J245L325L156
4742E211J250l91N26k290m163j794J73P45P73J659K416K255j617l067j770M53
4726C69j466K5K870j238Q18L584l75M77j101l721j926J734k62L080j194o46P25
4709A753j33k096j181L12J45j124J877J918j318m2N20K134L350J64k57O00j472
4692E150P62j650k532k795J347L790L08J484j948l554k082j472L874o9j001J780
4676A392n51l800M108M479j887j798J189N13l190l40K067J838k121Q07N96k401
4660I01j643o69M93M395o50j993m301J128l34n50K752q36J97n52j578L384J079
4643A223J03j54J555j356j945K056K955M297J843j819k672k535N22M92K756J628
$$ y = [4028, 4207, 4379, 2403, 4575, 2094, 3778, 6443, 5735, 1571, -1397, -2687, -3158, -2515, -1270, 2055, 5211, 6461, 6070, 6596, 4306, 143, -1651, -1478, -733, 40, 1699, 4115, 6370, 4753, 1686, -84, 369, -1097, -1072, 1798, 560, 1378, 4962, 4587, 5064, 3963, 242, -1684, 50, -212, 2868, 1674, 1028, 1753, 1620, -476, -1657, -1345, -1200, -2324, -447, 1471, 153, 111, 631, 2765, 6115, 6279, 6022, 6622, 5150, 5912, 4262, 1730, -1065, 282, 4072, 4380, 5864, 3916, 362, -1720, -3192, 682, 613, -388, 1392, 841, -2959, 1149, 5628, 3741, 1943, 3132, 3645, 455, 115, 2182, 4020, 1899, 2706, 3302, 901, -742, -1411, -918, 3477, 2827, 834, -3467, -2339, -2673, -3223, -471, -1307, -1110, -1662, -3240, 144, 1223, 1326, 1172, 2727, 1371, -574, 1482, 4437, 8734, 10577, 8758, 6086, 3551, 4073, 4565, 7321, 8949]
4627H949o33m213j663O77M22M058l50l041l64k474k107Q78K334K589J663j303
4611E422p097K43R74j124J946j406j459k207m429o50K69K473K630j179K354K436
4595h04L644L321r24p51l393l872m63K859J722m1O37n78k790R81K620J191J88
4578C547J211K611k382m055j42j453j845qk49J698M03l003J360M291L017k329
4562B672J711L619q15j481J984Q76m408m862m90j76J305J871j196k104l67J346
4546e15J321J116k749l404M615M414K491j618l507j342j283j148J523L262j056
4531B120l442L45r19n81M049J165j434M66L142K636j495m11Q37j985l36K314q98
4514E573k672j516M095O053K208j554k599k035k439l821k435J635K013J418j018
$$ y = [8949, 8316, 4103, 2440, 3117, 3539, 7597, 7247, 4206, 3842, 1368, -739, 139, 2473, 5062, 6725, 5422, -1675, -1432, -458, -1582, 364, -1042, -2501, -4708, -9137, -9787, -9518, -7045, -4415, -5594, -3240, -804, 2840, 6161, 5237, 4486, 1093, -2779, -3242, -383, 1339, 1298, 1935, 1357, -1433, -452, 2168, 3359, 3547, 4758, 7369, 4987, 932, 790, -663, -2508, -2516, -2765, -1067, -664, -3667, -2307, 1984, 5001, 2672, 4383, 8002, 7187, 5706, 7690, 8566, 4158, -704, -1194, -1370, -65, 1806, 610, -1494, -1861, -515, 806, 1922, -827, -4231, 384, 4798, 7289, 5671, 2164, 822, -461, -1609, -86, 3176, 2120, -1322, -977, -1896, -2477, 1572, 2737, 1303, 1769, 4911, 7547, 6052, 5641, 6478, 4493, 4157, 6471, 5573, 2901, 1385, 5480, 11533, 13741, 12187, 9588, 7553, 5114, 1293, -1142, 493, 2506, 3924, 2906]
4499B906J148K15k864q80J617N222J105J953o83m535l741K252J917J311j668k44
4483E031j171l415R54m20K322K55j63N0j213j629k468J165j840J532p9k638p88
4466d515L259L193J340l551k566J539K579K019l69K782K61j224l435J030K686
4451E028K05Q51P93q77J690k2j299R44O11Q26j305r63l001O9J486k47L86n17R18
4432E576l91m900q35k213j043L783N167J185q94p27M95J06n81J121L80m540K941
4415D630L739k343l918m26L05k504k691M366m60M75J858j873Q57J201q74j003
4399A339P37L494J015n395j056L176L02K843nJ7J824n206m137O74N82K99Q4O60
4381A247q63J239j7m06r95l564n64N525K129j155k431p46R73M256j368l360l056
$$ y = [2906, 4054, 4269, 1405, 525, 2142, 7364, 8469, 10422, 9739, 5204, 1463, 3715, 5632, 6943, 5275, 5031, 3860, 445, 1399, 979, 3301, 3556, 3393, 3443, 2230, 601, -1867, -702, -2542, -1010, -1089, -3727, -4515, -1256, 1937, 3277, -274, -2840, -1301, 1278, 3297, 2928, 5710, 5971, 4747, 1312, 2342, 5028, 5233, 6084, 6877, 6000, 7690, 7668, 6369, 7313, 7924, 8750, 7445, 6482, 3481, 3550, 5036, 4789, 5175, 4658, 5576, 5185, 285, -550, -2763, -3806, -23, 5144, 6329, 5435, 4708, 5203, 5309, 4728, 5849, 6229, 1689, 4630, 8369, 6026, 2108, 1682, 1987, -517, -3208, 1158, 698, 1173, 3031, 1158, 2015, 3216, 2342, 1339, 2076, 5570, 6585, 1190, 134, 3310, 3612, 6455, 6450, 6467, 8291, 3085, -1052, -378, 204, 503, 587, 1247, 384, 1623, 1606, 1200, 205, -3359, -3923, 1602, 3731, 2576, 145, -601, 372, 4628, 3260, -100, -3156]
4364c156L093J290J022j63m418n17J838N14q0J877p20L333Q35j52k83L75j354
4347C334J690j277p82m65j606k52j293J829L357j057k211j343M851L3m421k945
4331b558k060J032O572l55J074j628r72j492j934k308l26N60K153J614k029l77
4315c034N905N008l046j20k029k583j235L55R28l475n52K630L254J461p25k54
4299B488j497J397J663o47m579k980O81J542Q99J304J947l593J02O83K303Q38
4283B551j418L389l397l453J607K232J530j024k948k192M329J442j357J518K599
4268E408k228l283j548n88K300M6j191K191K213M31J24M48p03j419J803J904L246
4251I154K767l21n751j771p88k258j106j97j697R28K720P22K091l06k203j647
$$ y = [-3156, -63, 1227, 2249, 2086, -2332, -2849, -1011, -497, -577, 1300, 580, 3913, 4748, 4596, 4313, 4688, 3334, 5024, 3747, 2965, 2500, 894, 642, -651, 1178, 4535, 3478, 1267, -76, 4775, 4808, 387, -2558, -4618, -3586, 2986, 2631, 3705, 2077, 1105, -387, -2321, -4629, -4955, -4395, -2242, -628, -2657, -3034, 2871, 7879, 4833, 4713, 2684, 101, -1134, -779, 149, -3326, -3878, -1248, 2006, 3467, 2742, 2488, 991, 2388, 4051, 3404, -1175, -4155, -3474, -1932, -1033, 271, 2218, -1375, -1273, -590, 1713, 2551, 1133, 4522, 1125, -2328, -721, 1511, 3041, 2017, -931, -3123, 1206, 2648, 1291, 2809, 5408, 3180, -103, -1651, -2239, 61, 107, -1084, 1107, 3320, 3751, 3875, 4323, 3620, 2201, 4004, 5908, 9154, 11921, 11600, 5849, 4078, 3290, 1032, -74, -271, -1968, -1040, 1680, 2402, 4493, 4187, 1984, 337]
4235C37P1K7O67j784r27r76l764K28k741K522M962J490J938k09k314k370j949
4218d792K920o2j194N624J108K401l408n518M39K274K48j970J026M264J679M40
4202E479Q22o194j691J359K60J129K994J542l773j616M21j197k348k684j031J177
4186e351N191L471J278O66l239M317j021k931P09J374j854j671k35j042j671K220
4170B11J587L329p2l265K7L0J562L481k089l080k744J813l637L19Q054K115l090
4153D551M25J534K67k487k699l73Q16j941J997J229J947n24j413K290k27K415
4137G807K938m526l385R6j06j456O86K010J093o9J446r66l618m672p63M687M212
4120E414J604R64j149l396k19j729j820J892p99L95K963j425k30p94J563m22J260
$$ y = [337, 408, 435, 1102, -682, -1609, -2585, -6349, -6121, -8862, -6340, -1378, 112, 2050, 1841, -473, -2843, -4792, -1872, -1934, -3128, 2496, 3604, 6005, 2597, -2921, -2482, -208, 40, -1930, -904, 3360, 5039, 5479, 6301, 107, -1584, -225, 35, 1164, 4158, 5700, 1927, 311, 732, -465, -2813, -5497, -6528, -5351, -160, 3311, 4589, 5255, 2016, 6333, 5312, 2381, 3090, 4464, 2610, 939, 704, -338, -2009, 211, 1798, 5127, 5055, 1790, 1817, 1847, 3409, 6890, 4801, 1721, -1023, 790, -2847, -2528, 5526, 7641, 4551, 4976, 6510, 6777, 4290, 1591, 1218, 2034, 93, 2090, 3319, 5266, 4742, 3329, 5619, 5392, 7807, 10745, 6219, 2834, 2930, 2824, 1368, 2054, 4064, 5157, 5088, 6534, 5568, 1950, -2722, -3485, 1202, 5414, 7018, 7982, 6833, 3437, 3218, 1489, -331, 1561, 762, 1157, 4120, 2695, 2465, 1671, 3234, 2812, 4072]
4103D072k60j981Q77J782J104m72o84k157R92k81j655m24L211j932k429q46J173
4086I0j162l72q28m42J745l52k793J721K688O75k653m850K522Q70n7J098L075
4069I75L768l169l936k066l72j337L657J699j1o95k512Q21L305O13k683j2K47
4052a708j194j123K801J525J689k599n36O112N114j162j535j102j880k839m068
4037b505J61O12J64J14o54J034M76L801K66K557r54k055K402J994K64K881m63
4020A0095l839L81q10j58L060Rj674l129m717j504L683K049Nn015j275K609J21
4003a09k196J791l64j588J376J726r88j862K014NK591K427j060q36K162K244k133
3986E200n583k294L091L174k082K248K503l101m116N89K366K549q3L733k767j55
$$ y = [4072, 3812, 1831, 2708, 4490, 5594, 5122, 4438, 2281, 3273, 2992, 1337, 913, 4124, 2192, -237, -1083, 90, -1072, -1444, -2272, -2714, -969, -1321, -4114, -2393, 295, 970, -1683, -6533, -4011, -3141, -3198, -2100, 975, 4743, 1574, -2362, -4428, -4800, -6137, -2480, -781, -792, -1487, -3999, -3178, 127, 740, -1943, -1955, -1708, -2902, -4025, -1224, 301, 1990, -609, -1145, 4967, 10081, 8919, 7384, 6282, 4402, 1563, -2505, -2344, -1732, -1568, -1454, -2108, -1074, -598, 3203, 3469, 6026, 5072, 3017, 5419, 7413, 7677, 10558, 10095, 6256, 6637, 5827, 5669, 8729, 8738, 7064, 3935, -782, -2286, 1397, 3446, 3451, -1564, -2839, -230, -109, -2305, -514, -878, -2466, -1090, 636, -352, -2214, -200, -195, 2396, 4823, 3763, 2927, 5089, 7333, 5200, -383, -2677, 414, 3588, 1506, 3754, 6257, 3156, -960, -371, 1995, 4544, 4461, 8194, 5427, 5272]
3970E272K804n15l235K91K528j870o67Q70J0l048j784K755M186J399l2j725m695
3953B544l870L06J082l287Q9M103K745j285K054L944J850j909q87k530m547J435
3937A837L989j435j206J687J100j708k559k125J603o08M83J074o04J452J597m17
3921D160p39m48Q25K147k94L15J589j12l424K422n24n216m649M61K326R83K763
3904B585L45Q28j229j774R63j296k75Q00L520L080l483j555m57K028Q88k458k130
3887C80j679N661K36j998N72j164k274j937R41J30L406q80j27J681J141K47J368
3870E704k031n00O7l90P37k106p30j559J115M949j423r42k454k455j135L033j31
3853b51j508K524M635J992j541j310m74n36l766j324M64J49K884M204L023R93
$$ y = [5272, 8076, 7561, 4326, 4617, 7145, 5275, 4608, 5478, 5488, 2440, 656, 3411, 7597, 8996, 8964, 7239, 2544, -1326, -1020, 62, -3225, -3136, 967, 3712, 2427, 4481, 8425, 10275, 8366, 7479, 4949, 402, 1837, 5826, 4391, 3185, 4872, 5972, 4264, 1705, -420, 1183, 575, 1058, 2132, 1528, 2980, 4577, 4160, 3421, 2973, 3798, 5945, 5651, 5966, 7555, 7443, 4019, 6441, 5917, 701, -3948, -3487, -1161, -178, 2585, 2930, 3758, 2529, 755, 1718, 422, 147, 947, 4467, 7547, 4064, 2509, 2052, 4080, 4968, 2510, 380, -1299, 4362, 4598, 2600, 3172, 2008, -266, -2203, -1262, -1132, 2274, 1394, 1267, 2948, 4089, 4336, 5704, 3673, 3173, 3240, 2850, 3587, 1481, 751, -808, 307, 5256, 3833, 2891, 437, -2018, -3153, -120, -251, -1759, 765, 5400, 7392, 5851, 4541, 4067, 3531, -235, -1559, -1095, -946, 1938, 6142, 9165, 10158]
3837A0158k140l203K647j093m009l134j110N560M281n414l791M14Q42j85J162
3822I85m20K540j417m185k930L829L657o05J674j2j416J561p59q03L643K087r87
3805F442j636j610k059R08K298r40O66K417m795l298J925J585l30k755l097K80
3789c999K865J430J213J042K765J228j575l007r09j518M78J408J545l526k425
3774b985R51L930m91j280j168k168J774K212j024k274p29L221L43P20O35p28J591
3757B530M74L8j22R85P47r79q57R61K028j61M71K515J413j335m8j256k926k123
3739B355L971l225r71J985N78L96j903l80j127Q0j01J1j362J6L064J302O88j03
3721E274j919K027j489q12J329j172k306O84l505l85L780J970l604p65J37k897
$$ y = [10158, 8018, 4815, 7462, 6369, 2360, -774, -1884, 3676, 7957, 2543, -1248, -834, 8, -177, 985, 565, 3105, 1688, -2497, -5427, -1598, 2059, 1454, 3128, 3116, 1700, 3261, 2502, 1699, 5342, 7429, 6442, 4806, 3196, 1137, 2045, 4343, 3403, 4069, 6486, 1691, -1607, 318, 1903, 1573, -1182, -4279, -3999, -1134, 296, 1509, 2551, 5316, 6544, 4969, 1962, 1053, -465, 13, 1421, 2966, -560, -2985, -2034, 1896, 1405, 125, -1043, -3211, -1437, 775, -249, -2523, -3252, -31, 312, 1032, 1667, 939, 2530, 3004, 3042, 2920, 3905, 4652, 3673, 2816, 3777, 5805, 5644, 6115, 8630, 10043, 8708, 8660, 7404, 4478, 2355, 6326, 3101, 2130, 4115, 4693, 5089, 3186, 2806, 1679, 1759, 1658, 1669, 307, 323, 3387, 4689, 5377, 5274, 3355, 5382, 3893, 3081, 4410, 3238, 932, 1616, -1889, -2274, 1506, 3476, -128, -893, -756, -3653]
3705c653J092J381J739K263k916l090J84Q7L35K588j987k905K50L153K516J58
3689A195l976R60J654K766O9J28k804l759Q91O45N05K938N18K430l28j958m493
3672b619q42q51n80L449N289m395J37L018K273q56p44j490J272j981L48P54n994
$$ y = [-3653, -2561, -1180, 559, 2822, -94, -3184, -3000, -2913, -2578, 10, -1977, -4882, -4632, -1479, 1037, 1195, -2781, -1821, -167, 2599, 2668, 2796, -8, -3767, -2876, -2231, -1726, 1212, 1730, 4160, 3832, 1874, -2619, -3461, -4312, -4892, -1443, 3846, -549, -412, 2606, 4879, 4023, 3279, 1789, 3061, 1080, 1428, 2182, -3812]
$$ [...]
##END NTUPLES=NMR SPECTRUM
##END=
