##TITLE=Analysis number 318937
Compound Code mo 01255
Project Code adrs
Chemist Name matrix
##JCAMPDX= 6.0         $$ Bruker NMR JCAMP-DX V2.0
##DATA TYPE= NMR SPECTRUM
##DATA CLASS= NTUPLES
##ORIGIN= Bruker BioSpin GmbH
##OWNER= nmr
$$ XWIN-NMR		Version 3.5
$$ Tue Apr 25 12:48:57 2006 GMT Daylight Time (UT+1h)  MAYBRIDGE\nmr@NMR_250MHZ
##.OBSERVE FREQUENCY= 250.131544655141
##.OBSERVE NUCLEUS= ^1H
##.ACQUISITION MODE= SIMULTANEOUS (DQD)
##.ACQUISITION SCHEME= undefined
##.AVERAGES= 16
##.DIGITISER RES= 18
##SPECTROMETER/DATA SYSTEM= dpx250
##.PULSE SEQUENCE= zg30
##.SOLVENT NAME= DMSO
##.SHIFT REFERENCE= (INTERNAL, DMSO, 0, 16.522)
##AUDIT TRAIL= $$ (NUMBER, WHEN, WHO, WHERE, WHAT)
$$ ##TITLE= Audit trail, XWIN-NMR		Version 3.5
$$ ##JCAMPDX= 5.01
$$ ##ORIGIN= Bruker BioSpin GmbH
$$ ##OWNER= nmr
$$ C:\u/data/dgb/nmr/ADRS/3000/pdata/1/auditp.txt
$$ ##AUDIT TRAIL=  $$ (NUMBER, WHEN, WHO, WHERE, WHAT)
(   1,<2006-04-25 12:48:18.95 +100>,<MAYBRIDGE\nmr>,<NMR_250MHZ>,
      <created by zg, POWCHK disabled, PULCHK disabled
       configuration hash MD5:
       84 BC 41 DB A1 6E 1D 46 DA 25 12 A5 C1 ED C5 3A
       data hash MD5: 64K
       5C DF B6 DB 4D 06 97 D6 68 F4 2C 1F 79 B1 11 D7>)
(   2,<2006-04-25 12:48:37.53 +100>,<MAYBRIDGE\nmr>,<NMR_250MHZ>,
      <Start of raw data processing
       ef LB = 0.3 FT_mod = 6 PKNL = 1 SI = 32K 
       data hash MD5: 32K
       97 25 50 95 8D 01 60 E4 C0 71 24 55 04 96 6F E9>)
(   3,<2006-04-25 12:48:39.87 +100>,<MAYBRIDGE\nmr>,<NMR_250MHZ>,
      <apk 
       data hash MD5: 32K
       BC B3 37 23 F4 41 57 AD 2E 33 DE AD 9C D0 B6 92>)
(   4,<2006-04-25 12:48:40.61 +100>,<MAYBRIDGE\nmr>,<NMR_250MHZ>,
      <abs ABSG = 5 
       data hash MD5: 32K
       87 24 D2 92 11 B9 1A 97 74 14 2F 2E 31 B1 3C AE>)
$$ ##END=
$$ 
$$ hash MD5
$$ 4F BA 97 FD 98 39 A5 58 A0 14 3A C2 FC BA 32 32
##$RELAX= 
##$RELAX= 
##$RELAX= 
##$RELAX= 
##$RELAX= 
##$RELAX= 
##$RELAX= 
$$ Bruker specific parameters
$$ --------------------------
##$DU= <C:\u>
##$EXPNO= 3000
##$NAME= <ADRS>
##$PROCNO= 1
##$TYPE= <nmr>
##$USER= <dgb>
##$AMP= (0..31)
100 100 100 100 100 100 100 100 100 100 100 100 100 100 100 100 100 100 
100 100 100 100 100 100 100 100 100 100 100 100 100 100 
##$AQSEQ= 0
##$AQ_mod= 3
##$AUNM= <au_zg>
##$AUTOPOS= <31 >
##$BF1= 250.13
##$BF2= 250.13
##$BF3= 250.13
##$BF4= 250.13
##$BF5= 500.13
##$BF6= 500.13
##$BF7= 500.13
##$BF8= 500.13
##$BYTORDA= 1
##$CFDGTYP= 0
##$CFRGTYP= 5
##$CHEMSTR= <none>
##$CNST= (0..31)
1 1 145 1 1 1 1 1 1 1 1 1 1 1 1 1 1 1 1 1 1 1 1 1 1 1 1 1 1 1 1 1 
##$CPDPRG= <>
##$CPDPRG1= <>
##$CPDPRG2= <>
##$CPDPRG3= <>
##$CPDPRG4= <mlev>
##$CPDPRG5= <mlev>
##$CPDPRG6= <mlev>
##$CPDPRG7= <mlev>
##$CPDPRG8= <mlev>
##$CPDPRGB= <>
##$CPDPRGT= <>
##$D= (0..31)
0 1 0 0 0 0 0 0 0 0.06 0 0 0 0 0 0 0.0002 0 0 0 0 0 0 0 0 0 0 0 0 0 0 
0 
##$DATE= 1145965697
##$DBL= (0..7)
120 120 120 120 120 120 120 120 
##$DBP= (0..7)
150 150 150 150 150 150 150 150 
##$DBP07= 0
##$DBPNAM0= <>
##$DBPNAM1= <>
##$DBPNAM2= <>
##$DBPNAM3= <>
$$ [...]
##$SUBNAM7= <"">
##$SUBNAM8= <"">
##$SUBNAM9= <"">
##$SW= 20.6930455092707
##$SWIBOX= (0..15)
0 0 3 0 0 0 0 0 0 0 0 0 0 0 0 0 
##$SW_h= 5175.983436853
##$TD= 65536
##$TD0= 1
##$TE= 295.16
##$TE2= 300
##$TE3= 300
##$TEG= 300
##$TL= (0..7)
0 120 120 120 120 120 120 120 
##$TP= (0..7)
150 150 150 150 150 150 150 150 
##$TP07= 0
##$TPNAME0= <>
##$TPNAME1= <>
##$TPNAME2= <>
##$TPNAME3= <>
##$TPNAME4= <>
##$TPNAME5= <>
##$TPNAME6= <>
##$TPNAME7= <>
##$TPOAL= (0..7)
0.5 0.5 0.5 0.5 0.5 0.5 0.5 0.5 
##$TPOFFS= (0..7)
0 0 0 0 0 0 0 0 
##$TUNHIN= 0
##$TUNHOUT= 0
##$TUNXOUT= 0
##$USERA1= <user>
##$USERA2= <user>
##$USERA3= <user>
##$USERA4= <user>
##$USERA5= <user>
##$V9= 5
##$VALIST= <valist>
##$VCLIST= <CCCCCCCCCCCCCCC>
##$VD= 0
##$VDLIST= <DDDDDDDDDDDDDDD>
##$VPLIST= <PPPPPPPPPPPPPPP>
##$VTLIST= <TTTTTTTTTTTTTTT>
##$WBST= 1024
##$WBSW= 4
##$XGAIN= (0..3)
0 0 0 0 
##$XL= 0
##$YL= 0
##$YMAX_a= 320726
##$YMIN_a= -367053
##$ZGOPTNS= <>
##$ZL1= 120
##$ZL2= 120
##$ZL3= 120
##$ZL4= 120
##$ABSF1= 16.522
##$ABSF2= -4.171173
##$ABSG= 5
##$ABSL= 3
##$ALPHA= 0
##$AQORDER= 0
##$ASSFAC= 0
##$ASSFACI= 0
##$ASSFACX= 0
##$ASSWID= 0
##$AUNMP= <proc_1d>
##$AZFE= 0.1
##$AZFW= 0.1
##$BCFW= 0
##$BC_mod= 0
##$BYTORDP= 0
##$COROFFS= 0
##$CY= 12.5
##$DATMOD= 1
##$DC= 0
##$DFILT= <>
##$DTYPP= 0
##$F1P= 14.0000005364418
##$F2P= -0.99999901652339
##$FCOR= 0.5
##$FTSIZE= 32768
##$FT_mod= 6
##$GAMMA= 0
##$GB= 0
##$INTBC= 1
##$INTSCL= 1
##$ISEN= 128
##$LB= 0.3
##$LEV0= 0
##$LPBIN= 0
##$MAXI= 10000
##$MC2= 0
##$MEAN= 0
##$ME_mod= 0
##$MI= 0
##$NCOEF= 0
##$NC_proc= -4
##$NLEV= 6
##$NOISF1= 0
##$NOISF2= 0
##$NSP= 0
##$NTH_PI= 0
##$NZP= 0
##$OFFSET= 16.522
##$PC= 1
##$PHC0= 170.8583
##$PHC1= -7.278313
##$PH_mod= 1
##$PKNL= yes
##$PPARMOD= 0
##$PSCAL= 4
##$PSIGN= 0
##$REVERSE= no
##$SF= 250.13
##$SI= 32768
##$SIGF1= 0
##$SIGF2= 0
##$SINO= 400
##$SIOLD= 32768
##$SREGLST= <1H.DMSO>
##$SSB= 0
##$STSI= 32768
##$STSR= 0
##$SW_p= 5175.98343685301
##$SYMM= 0
##$S_DEV= 0
##$TDeff= 65536
##$TDoff= 0
##$TI= <Analysis number 999999
Compound Code 99
Book Reference 9
Project Code 9>
##$TILT= no
##$TM1= 0
##$TM2= 0
##$TOPLEV= 0
##$USERP1= <user>
##$USERP2= <user>
##$USERP3= <user>
##$USERP4= <user>
##$USERP5= <user>
##$WDW= 1
##$XDIM= 32768
##$YMAX_p= 306346805
##$YMIN_p= -646871
$$ End of Bruker specific parameters
$$ ---------------------------------
##NTUPLES= NMR SPECTRUM
##VAR_NAME=  FREQUENCY,     SPECTRUM/REAL,   SPECTRUM/IMAG
##SYMBOL=    X,             R,               I
##VAR_TYPE=  INDEPENDENT,   DEPENDENT,       DEPENDENT
##VAR_FORM=  AFFN,          ASDF,            ASDF
##VAR_DIM=   32768,         32768,           32768
##UNITS=     HZ,            ARBITRARY UNITS, ARBITRARY UNITS
##FACTOR=    0.157963299565203, 1,           1
##FIRST=     4132.6476996994, 0,             0
##LAST=      -1043.33573715361, 0,           0
##MIN=       -1043.33573715361, -646871,     0
##MAX=       4132.6476996994, 306346805,     0
$$ Real data points
##PAGE= N=1
##DATA TABLE= (X++(R..R)), XYDATA
$$ [...]
19766 -243540 -302938 -145719 -166591 -247657 -165654 -166173 -181409 -159785 -177906 -124265 -208108 -204536
19754 -204536 -14643 6554 -1493 230390 341464 270615 160584 -20971 -9023 -94939 -46681
19743 -46681 -29350 -147080 -118739 58520 79010 14922 40702 72318 153900 250057 189792
19732 189792 294549 202755 207360 153828 235878 145161 134476 197885 171724 278926 286678
19721 286678 184355 135342 -18755 1866 35766 138750 180367 147019 -55778 -45374 11522
19710 11522 65385 147647 145000 209744 106500 110209 91556 109095 -30903 -125859 -203074 -292706
19698 -292706 -386978 -338786 -202050 -58978 -5688 47984 40584 105954 161696 176442 104981
19687 104981 129896 135391 -9475 -216474 -235873 -91107 -31084 -134191 -184496 -176411 -245654
19676 -245654 -266705 -324213 -317121 -202694 -244804 -389701 -432143 -369134 -445104 -455831 -406640
19665 -406640 -334989 -206244 95715 146844 -5892 -127666 -149418 -175812 -220139 -170127 -70926
19654 -70926 -66572 -186579 -273414 -378694 -212751 -18629 38178 28798 -25904 -136951 184966
19643 184966 255822 108909 -131755 79014 192637 136833 6497 -17548 73553 87674
19633 87674 33541 -186464 -278096 -86994 136502 133908 64031 191344 68318 -113378 -218594
19622 -218594 -228179 -131939 -35119 -56434 -71171 -109626 3594 6842 -38760 48623 20837 -20367
19610 -20367 38102 -10912 -119966 -329845 -218940 -146931 -121488 -178550 -178297 -34400 -48599
19599 -48599 -65207 42706 52885 61580 122687 184630 -23303 -194858 -305996 -279178 -45333
19588 -45333 15313 -30189 94412 63130 214096 329265 231599 184269 30697 -164087 -148456
19577 -148456 -29978 -125712 -123385 -4233 12540 76157 68019 -24001 4483 201346 222808
19566 222808 153334 192080 3269 -101042 -10190 32166 -4650 145605 172307 -17160 -12167
19555 -12167 54259 -85161 -701 172169 265402 88221 28171 95494 54129 7715 -3369
19544 -3369 139051 253359 144322 45662 128070 74853 -65509 -172247 -160766 -128543 -246843
19533 -246843 -123583 30495 103292 79482 -138633 -220024 -78102 106700 164657 209454
19523 209454 162491 -18646 50833 15960 -529 -45421 21386 -58139 32440 34431 16196
19512 16196 51775 -75463 47010 73862 50810 -33784 -18903 174036 205630 32037 -102300
19501 -102300 -85350 -75093 17446 -3975 106991 90615 -39899 -47245 -200807 -260827 -147399
19490 -147399 83556 126259 33283 -77446 -86610 -160633 -145934 19751 190758 124635 155393
19479 155393 32875 -159921 -118050 161779 461086 411819 53621 -296678 -310409 -229435
19469 -229435 -175725 55086 23201 97368 175202 244119 303426 234090 -82987 -91356 6189
19458 6189 -11345 -93427 -280228 -355204 -169986 -169645 -226215 -204165 -211915 -319614 -471610 -565428
19446 -565428 -512246 -202456 -79489 -24725 -11444 57356 -8498 -163184 25423 201840
19436 201840 173120 -8618 -128217 -215116 -176306 -91294 -30467 15077 -134748 -113247 -18509
19425 -18509 -44048 -29214 11462 26428 52285 15256 167558 76009 -33657 -98656 -107462
19414 -107462 -177096 -229679 -264949 -354679 -404176 -239952 -165976 -251620 -206725 -34416 115763
19403 115763 12832 38791 89455 136197 288524 198088 241259 235705 233366 188937 40147
19392 40147 -84104 -125436 -177183 -149949 -138047 -156642 -51535 -107173 -45130 43386 -58437
19381 -58437 -59488 -23063 170266 217153 146007 40075 -84285 -136344 -143441 -16414 -14755
19370 -14755 56218 -181304 -270757 -114920 15593 87995 64793 58833 112376 7156 108155
19359 108155 77628 -72636 37770 77726 29821 -98010 -281192 -337612 -51336 277884
19349 277884 214876 71240 -106968 -79852 77326 49040 195165 234164 -27619 -58755
19339 -58755 -164881 -210819 -224207 -213495 -54159 30678 35072 -137586 -175514 -173900 -38560
19328 -38560 -55662 -241613 -174735 -192257 -82265 5687 -33410 -149194 -120398 -220862 -228480
19317 -228480 -255694 -128377 -345202 -284649 -102421 -29694 -65618 101307 65203 37298 3399
19306 3399 -85567 -152801 -235944 -391567 -356544 -290758 -219181 -111612 -4403 108922 138536
19295 138536 111525 140025 -118494 -130135 -43299 -31321 -59785 -115647 -172868 -274418 -286656
19284 -286656 -109734 -156740 -167748 -59059 -87769 -106541 -233879 -213022 -226784 -361927 -209562
19273 -209562 -57961 -106419 -159933 -199534 -83804 -215073 -268392 -94249 147996 230909
19263 230909 319763 230848 14964 -3879 766 -22201 -99611 -133740 12898 24483 -94894
19252 -94894 -185575 -90033 -31371 -34877 31214 90151 -20451 -76042 -32986 -95484 -105500 -268555
19240 -268555 -499007 -367584 -320479 -317117 -293568 -220379 -180333 -153209 -249788 -256689 -172453
19229 -172453 -10273 210699 183268 23853 55242 -147074 -186656 -175751 -227432 -38161
19219 -38161 113372 -1874 4369 -76759 -151387 -112784 -165986 -267738 -315183 -152422 41476
19208 41476 112448 106238 53410 -66519 -8233 -185640 -170855 -11842 -50478 -155715 -162586
19197 -162586 -131137 -92823 -160623 -149145 -90243 -181515 -215924 -111987 -31235 13349 228251
19186 228251 193000 -28178 -53168 85724 100834 -245443 -262174 -200940 -3386 -65686 -276556
19175 -276556 -144410 -84887 -148169 -163058 -199401 -28657 -20270 -143993 -288507 -218220 9095
19164 9095 100150 -25663 -121036 -151591 -239768 -194357 -56779 119892 -65605 -161491 -91427
19153 -91427 -33249 -68249 -180448 -138093 -33189 10018 -72140 27533 12630 95510 78880
19142 78880 -25446 64121 106168 178423 252945 240567 194843 270686 217265 333165 466446
19131 466446 325352 191505 191117 199922 117646 -125810 -196122 -16536 -65249 -12005 -119483
19120 -119483 -180374 43487 225274 188559 200145 112819 99987 47781 26965 88327 127625
19109 127625 89479 -103681 -105324 -40001 169921 199695 9064 -50233 -108989 -24412 -95034
19098 -95034 -146038 -123083 -77774 -70299 95341 115211 70434 -61776 -179511 -197241 -76830
19087 -76830 102662 -23299 -290726 -268775 41014 121699 -18298 2685 -103609 -74893
19077 -74893 -116754 -174732 -145897 -64685 -20873 143450 275195 300867 249511 23285 -96006
19066 -96006 -111433 -146759 -63007 -192291 -207280 -257213 -237874 -229988 -238460 -264843 -233592 -87254
19054 -87254 -65385 -9573 26103 29488 -85970 -218260 -297982 -91457 119709 -54802 -45676
19043 -45676 115898 118166 190278 360666 309229 264963 207215 -9123 423 121800 103548
19032 103548 22744 -91041 -70912 -7959 171942 162672 144016 83145 -131009 -196013 -155637
19021 -155637 -264471 -153649 -52421 108576 78092 89996 124666 74577 -142267 -375704
19011 -375704 -452463 -341277 -146337 -103623 -40042 -84145 -201449 -164622 -110395 -33999 -160868
19000 -160868 80194 103663 -57107 -69602 -20802 137478 150436 142854 17068 -95484 -108354
18989 -108354 -82066 -63266 -42920 -9076 -178042 -164190 -197478 -428259 -522529 -336476 -189114
18978 -189114 -308128 -236545 6000 163806 123071 24867 -7821 -36566 -14391 52410 28848
18967 28848 -69643 62298 233414 283434 124018 6604 74743 34275 -116231 -58003 21931
18956 21931 -13458 -83543 -42783 3094 -196723 -180442 41283 145018 310903 423668 504341
18945 504341 468662 354552 368757 262136 -21895 -99306 42559 114060 -38560 1834
18935 1834 -123601 -236607 -270055 -137895 -156939 -276007 -204934 -18465 69852 -153233 -199773
18924 -199773 79385 160396 84573 87980 -31966 98848 215464 115882 69035 84746 -6196
18913 -6196 86523 124668 110456 -31895 -230356 -245558 -126001 -160610 -180290 -146904 -51772
18902 -51772 -102779 -95540 35448 84817 93348 45003 -111482 12465 83551 68203 -33926
18891 -33926 -155391 -141138 -172156 -307949 -360608 -286880 -309375 -169053 -151992 -207719 -174402
18880 -174402 29422 -92605 -180542 -109705 51541 106974 101131 -108921 -145547 -23594 60767
18869 60767 137496 148229 324641 262448 228352 82047 -88855 18868 79890 145564 14753
18858 14753 -166051 -240210 -248691 -317410 -213550 -267166 -178424 -83167 -306200 -260610 -1592
18847 -1592 -49215 -286118 -332683 -197917 24826 39877 -247814 -182959 -82728 13067 -5474
18836 -5474 -128902 -302949 -343291 -232830 -227013 -94582 -3187 -14594 -6672 -15715 73493 229838
18824 229838 255778 211302 112267 81733 -8341 88842 -99301 -193040 -167141 -96946 -62920
18813 -62920 -19512 -57665 -194058 -295198 -91481 68820 -86957 -170496 -45185 135569
18803 135569 102226 113286 -49056 -207213 -201764 -227568 -198774 -118307 -5264 146725 218690
18792 218690 173422 173573 117194 -20801 -105058 -87015 67894 114911 94947 15850 -70972
18781 -70972 -73494 115294 183950 258416 342009 324225 109050 76862 118041 197701 54078
18770 54078 -40368 -86105 -127615 -221556 -107665 95200 187316 88719 -166750 -152613 -136558
18759 -136558 -289277 -429929 -355938 -208997 1303 -7453 -99075 -157637 -225602 -147679 -58570
18748 -58570 -88259 77025 141215 -115013 -166371 -37127 -48018 -120210 -198278 -292893 -255212
18737 -255212 -119355 32446 60951 151755 -61839 -185834 -126332 -161663 -299417 -249127
18727 -249127 -171026 -161944 -59659 47848 -24922 -13018 -142315 -266594 -152697 5564
18717 5564 128531 175937 314995 252146 -51937 31585 52016 -4842 32679 16890 25470
18706 25470 157893 231683 206177 285252 458619 543457 594846 826391 924244 892681 976954
18695 976954 1193116 1727836 2186031 2787521 3605295 4491014 5478590 6666023 7828212
18686 7828212 8843755 9773488 10779523 11891282 13062667 14009965 14594047 15101997 15336393
18677 15336393 14941625 14512054 14004710 13370325 12691943 11852209 10903437 9998665 8895515
18668 8895515 7829426 6735465 5994723 5495193 5011195 4496912 4159357 3740665 3454625
18659 3454625 3157788 3058096 3076044 2996026 2818021 2659910 2488405 2316453 2221941 2282847
18649 2282847 2152309 1999568 1947291 1989771 2013868 1901573 1842460 1908761 1740285 1629507
18639 1629507 1587156 1536990 1317093 1329675 1382307 1376296 1265915 1287012 1277372 1178623 1208929
18628 1208929 1173495 1062162 1080390 1035859 947187 942379 918877 895292 908314 844331 765236
18617 765236 902980 1053521 1105216 1156727 1129547 927242 573247 552253 625780 673621 811864
18606 811864 801918 773666 706783 800150 904256 865747 978394 965277 871055 877236 955515
18595 955515 1000873 834982 671884 709345 745511 746416 793304 774499 660189 614237 631629
18584 631629 598787 538493 471496 354325 265754 332219 527603 516005 489580 513653 349103
18573 349103 243897 231460 278134 366541 382408 486044 605818 560953 440898 438414 435103
18562 435103 458405 384100 436328 406060 452620 535999 409434 284918 249826 56438 136236
18551 136236 281766 360931 300738 323008 447900 483868 415201 419782 297989 388418 369351
18540 369351 248685 198151 137407 60041 102618 71650 -21133 -3085 37850 52034 72133
18529 72133 142122 80091 -8635 -104357 -37010 -95877 50720 49673 -29230 -77432 -94601 -141709
18517 -141709 -55565 154741 298322 298417 335376 360555 256999 297020 327547 234600 378382
18506 378382 598700 670453 460279 239151 368085 347525 397166 307938 167313 144117
18496 144117 58930 -57494 -75758 11980 182545 76248 -46633 -101634 -62646 185484
18486 185484 249004 218476 228842 264001 185600 152908 138615 240949 380220 277146 -4116
18475 -4116 -242794 -287307 -145337 -67600 75812 116850 22162 147294 119868 -108053 -74375
18464 -74375 43991 21618 9489 253160 398337 245435 23624 -173546 3193 217873
18454 217873 230513 320476 505290 422059 388527 394176 276981 56275 84595 223047 101175
18443 101175 -52795 -70357 -92838 -107109 -177952 -209474 -295807 -372401 -214786 11449 153904
18432 153904 136435 -41781 -359962 -344603 -186954 -41093 -28228 -101932 -123667 -7621
18422 -7621 126380 226674 100049 25858 19107 89832 97719 187608 292033 222324 43205
18411 43205 -235254 -159106 -200389 -32094 188612 118946 24245 -14095 -111103 -55338 -1273
18400 -1273 -58998 -37777 92191 123873 -45068 -61217 -17765 -55666 -102631 -68980 -68500 18714
18388 18714 127944 134320 109648 80562 -98549 -162546 -109758 -113751 -107674 1973 128448
18377 128448 340387 294196 242500 256448 156615 86114 -110654 -131689 73971 105785 143584
18366 143584 167900 -110321 -265801 -242710 -187337 -70384 -44042 -64061 -18157 -142434 -256319
18355 -256319 -150886 -178677 -123871 -92960 -62423 101582 215525 143826 -24256 -57321 -177995
18344 -177995 -261793 -329835 -241527 -719 253279 323950 272360 160863 45893 19980 -116300
18333 -116300 -136622 -31619 -76768 -45137 -76031 -176474 -88529 -63063 -205946 -208139 10529
18322 10529 167398 211402 113592 116833 62888 -65520 -41224 -73747 -63664 -63029 -241168 -254593
18310 -254593 -143743 -98867 -27354 19261 -57554 -33943 122484 173704 147864 23659 199116
18299 199116 277556 76842 -61491 -95389 -6570 83782 102625 24253 -192055 -191330 35282
18288 35282 180526 27451 21686 115610 58134 10752 71448 73582 178269 287969 126330
18277 126330 -58954 99482 237293 355149 116185 144823 246080 113602 -25687 -37315
18267 -37315 -178670 -47135 968 -136908 -55583 -20963 12522 -33218 -159523 -186892 -280557
18256 -280557 -211003 10414 -167990 -126744 -174533 -213071 761 115312 130500 84415 -23777
18245 -23777 -126776 -103613 58481 43892 1138 -14493 23636 -91090 -105197 -358163 -435699
18234 -435699 -386334 -241434 -200938 -141469 -148246 -234899 -306492 -231965 -59457 -96485 -163671
18223 -163671 -282991 -82586 230175 331436 124240 42427 -178840 -155335 -78765 -34740
18213 -34740 15210 -176286 -284146 -168717 -278457 -395871 -366847 -305840 -116160 -153332
18203 -153332 -101105 120099 323741 419873 170925 38530 -32410 29137 -84066 -12773
18193 -12773 25008 -28011 -5415 95751 220743 325460 306794 312599 201530 81665 77003
18182 77003 73857 -1558 -3310 -15932 12956 -130547 -53147 68592 -64653 -288370 -358873
18171 -358873 -299248 -190423 -110209 -44137 -22302 8927 43345 93525 22484 53974 16908
18160 16908 82838 -12422 -91224 -120014 -76011 -19284 -46005 -41673 58137 128583 -12021 58686
18148 58686 -61662 -103026 -21593 -7861 96260 207944 199747 -1315 -124662 -102143 -209645
18137 -209645 -86398 153188 56950 -50414 -287878 -444460 -255931 -196636 -146727 -186749
18127 -186749 -267495 -219893 -322534 -314007 -94475 -125679 -78156 -30628 109890 53426 56149
18116 56149 53176 -99489 -105259 -14060 32562 36789 -3936 -208205 -352967 -106363 -15347
18105 -15347 -63788 -71601 5095 189281 43170 -142054 -158300 -35705 104101 269880 316210
18094 316210 204181 356815 459333 414103 127694 24445 -142282 -132726 -70537 -136579
18084 -136579 -207358 -285268 -276607 -101548 81926 65957 82056 90040 16193 -147591 -276779
18073 -276779 -378293 -386254 -235784 -182496 -139151 13206 126644 20154 -148665 -16061
18063 -16061 109312 210806 172945 -17382 -58629 118172 109426 857 86963 67165 -20551
18052 -20551 117223 217856 226649 150210 38446 -4711 21363 -43685 123709 217630 100047
18041 100047 37100 56417 7146 -59133 8974 -50623 -17762 59838 -145991 -23434 48761
18030 48761 -36416 14133 154984 179767 165417 117795 82145 156673 240571 182165 154056
18019 154056 384771 300040 102327 66095 10669 -176913 -112234 -255839 -250751 -36843 21359
18008 21359 31989 -44277 -33342 -118025 -28174 106493 57496 134717 -25329 -149025 -146556
17997 -146556 -37584 -136484 -55837 143167 261060 219542 259897 307467 165391 71239 123465
17986 123465 -101396 -6548 257078 254535 76997 -109990 -165362 -73792 -112744 -4133 31582
17975 31582 -12883 60417 162038 52385 -106513 -176412 -167606 -184715 5163 -16467 59032
17964 59032 72091 -112748 -296895 -394351 -400297 -339122 -235153 -176294 -316300 -286373 -213625
17953 -213625 -250085 -317252 -306846 -147042 98614 190987 206207 162963 174063 189792 209842
17942 209842 185462 162735 270335 235521 250675 238771 273903 367721 313707 373249 321008
17931 321008 511160 672529 763780 792306 859180 1250989 1819039 2760487 4026272 5449636
17921 5449636 6723664 7935119 8860802 9631499 10406677 11037416 12250660 13998520 15503226
17912 15503226 16475567 16964723 16997496 16157573 14814715 13759900 13181176 12868776 12278869
17903 12278869 11681749 11021422 9958598 8575021 7245822 6091525 5321749 4519681 3966965
17894 3966965 3695903 3419782 3141572 2832377 2829214 2785997 2690135 2555582 2519520 2525562 2590417
17883 2590417 2465537 2220326 2187446 2063451 1910392 1826803 1767684 1747170 1842479 1834405 1851809
17872 1851809 1779579 1782431 1547621 1514707 1521270 1407612 1400388 1313451 1101375 955319 1098434
17861 1098434 1190658 1230317 1353115 1410682 1305948 1129904 1089701 1157410 1101447 894547
17851 894547 798496 887223 818486 736435 736182 740916 762545 824670 632970 623840 592449 475803
17839 475803 451756 558903 435657 317751 389899 420275 451129 589152 405571 335652
17829 335652 482773 761100 673095 407359 252759 204391 282797 520499 600795 591050 458264
17818 458264 245507 93532 91930 74629 232521 380005 345244 317791 344323 519743 555886
17807 555886 391071 297068 512755 513188 385398 505794 494593 463492 346011 302740 347871
17796 347871 208880 110168 -19309 71721 308046 342100 511697 653451 628341 474965
17786 474965 388321 376219 514107 552652 488793 602923 476421 355802 454259 381478 255416
17775 255416 226106 247116 229494 421940 320475 182600 127752 131224 280412 433190 284798
17764 284798 77426 205947 406809 572224 613468 517561 289872 245725 223453 14583
17754 14583 25904 72326 70365 111040 193888 237438 339086 235996 19394 -91790 -21536
17743 -21536 180169 179626 244121 200761 153624 130592 71093 -59991 -44901 -190486 -54883
17732 -54883 181853 182291 179252 68497 39997 1766 57839 63255 270362 232668 220400 218454
17720 218454 289387 149560 -23771 -11273 463 -138592 -42586 108098 215756 225538 -33962
17709 -33962 -188738 -58138 115771 232416 196814 181630 304316 383372 345826 367227 166051
17698 166051 6025 67550 71824 -50287 -67328 63432 38166 -6842 126627 27460 -114356
17687 -114356 -115553 -5104 203846 313057 179785 259000 235914 309005 296803 105586 -258
17676 -258 -3284 -125069 -92351 111343 195386 204321 12630 -50512 270765 494494 423408
17665 423408 382392 366188 283931 166143 123168 62129 26714 111631 271341 129619 116331
17654 116331 26034 18607 228318 313848 241553 230438 205846 262112 173723 132808 61626
17643 61626 94251 72200 -26820 54191 142929 75088 83639 215616 270469 295611 305059 230785
17631 230785 71401 -73913 72405 374067 424289 402673 293159 194276 147550 179329
17621 179329 137130 -23171 -46241 19351 -30579 52009 157659 73570 222895 418868 237659
17610 237659 -70694 -146698 -250227 -416968 -520769 -331763 -144293 23931 56044 177223
17600 177223 101064 28555 -150216 -203599 -35980 -1045 -75292 121050 314031 317816 154637
17589 154637 179807 164459 20663 -28634 -31258 87089 119529 32450 -34023 -195897 -97005
17578 -97005 116600 190367 195362 57508 -35114 -21318 -46179 -226897 -34843 96260 41279
17567 41279 53913 124296 151682 284214 217591 190007 246185 243812 164649 -32323 -127404
17556 -127404 -129619 -198694 -72659 155997 255895 353501 177551 168744 318790 314145 392078
17545 392078 433689 311314 416668 457444 417741 309451 413208 375312 277336 230536 245936
17534 245936 468532 393409 554817 811887 1091465 1375277 1724487 2238557 3130973 4208248
17524 4208248 5655880 7182675 8362244 9593154 10735796 11750756 12703377 14050148
17516 14050148 15230637 16025762 16559386 16548801 16061423 15368363 14662944 13840744 12860377
17507 12860377 12172467 11388874 10305699 8831793 7462948 6303047 5241505 4546988
17499 4546988 4141372 3830747 3666360 3345475 3114950 2891117 2589242 2632199 2696390 2520692
17489 2520692 2374400 2300983 2227240 2074833 1916229 1966809 1937285 1880497 1992300 2122711
17479 2122711 1997824 1814537 1769626 1780165 1740555 1610125 1581165 1487310 1419091 1435561 1371511
17468 1371511 1362468 1287149 1308391 1303354 1291542 1139884 1069911 1100696 1072428 1140671 1076698
17457 1076698 1313717 1496335 1293983 1175616 1177513 1119359 1144150 1223348 1150689 1029821
17447 1029821 909191 834377 864776 967756 889741 720796 708365 722541 627427 677389 710617
17436 710617 655621 673363 649814 414761 441534 483279 425786 194948 320531 706691 787566
17425 787566 691249 572102 471426 456970 372512 434293 452843 368647 302407 341580 340014
17414 340014 407462 431107 322727 188800 212321 417261 461284 441684 321803 310919 368675
17403 368675 491712 445695 524037 686713 745915 617533 339018 341798 272536 245310 303443
17392 303443 426616 415405 345910 251237 280660 548087 491523 411545 278285 371833 520579
17381 520579 532838 376851 128641 11947 188809 341851 357818 411172 375130 326299
17371 326299 202914 106983 42568 97913 5361 -9523 219300 368317 324823 297685 440351
17360 440351 495460 386875 452135 449388 469734 411681 447466 269741 207101 75487 -94448
17349 -94448 -87824 -69379 16497 110250 153352 28726 26344 124594 92094 14573 35138 -40986
17337 -40986 -80606 41491 222016 119563 27868 -82628 -119722 -35248 -92496 -133310 -201030
17326 -201030 -62566 145992 48767 37318 147957 315698 543976 400530 242097 117569
17316 117569 177628 305205 342220 338372 286991 243673 253463 170257 160478 239633 319792 261248
17304 261248 103311 -29496 62308 -2665 17843 225680 167551 42368 232737 179181
17294 179181 13542 -56825 54579 119061 237307 230411 408640 391535 298044 243462 86231
17283 86231 74551 -33417 -114381 -146749 -183569 -86384 54089 405 199399 251553 161634
17272 161634 -1809 -76797 -2261 32980 139922 76885 1056 42773 92278 318241 278691
17261 278691 325746 387316 307672 325764 358239 226550 116514 180544 63663 135590 320091
17250 320091 317261 173092 230639 147590 -6848 -144158 -67175 -61207 -20998 14903 65139
17239 65139 18908 -79923 -239206 -220641 -138024 -75968 7276 77140 -4232 25305 -129491
17228 -129491 -299599 -432892 -313912 -309606 -147013 59496 42409 -46234 -210011 -264623
17218 -264623 -247760 -78082 -18988 -306575 -331160 -185034 -50042 18668 -34050 67928
17208 67928 43907 -250 -37169 -171716 -188522 -113922 29480 32474 202777 320078 236350
17197 236350 -81014 -159604 -14225 209375 329172 389379 263362 52635 6052 34144
17187 34144 -51924 -99659 -125752 -43437 63768 97769 -147060 -301516 -184051 -298047 -239750
17176 -239750 58314 231126 219178 76565 -17167 117668 236460 129358 100980 91717
17166 91717 52088 -90882 -18864 -96983 -45950 -23160 96680 129846 45237 63695 -7872
17155 -7872 47165 -36696 -154643 -127648 -178256 -169750 -287828 -386022 -289728 -145736 -124479
17144 -124479 -296646 -294407 -184280 -30328 192293 187117 -8010 124801 95124 41400 -111954
17133 -111954 -117519 76587 7452 -64701 -39456 164470 302573 251721 89475 8929 69413
17122 69413 -74669 -184036 -135165 -10726 84938 190377 133873 98641 185997 -60605 -205361
17111 -205361 -101884 59935 107980 117483 131304 158844 154479 48297 31999 91201 166433
17100 166433 20742 -101945 15054 -30327 -37832 -48192 -78179 -631 -12093 23020 -48399
17089 -48399 72830 219140 276139 295001 237899 164041 27115 62226 412233 476954 343249
17078 343249 208026 221239 93512 34247 25978 -49673 -86201 -101588 -68817 12595 6485
17067 6485 -7035 -40713 -158773 -134074 -236792 -169599 -27695 143598 102180 4078 -41626
17056 -41626 -8602 -7911 125119 248304 233498 197642 126339 -91966 -133245 -137471 -91223 -58702
17044 -58702 79119 634 23873 68711 12129 -89315 -75916 85540 77699 780 7614
17033 7614 -5918 75915 200316 216577 161212 226801 256729 316078 345864 275659 46579
17022 46579 -39204 -102621 4888 279397 192876 77576 46603 542 -123641 -114655 100763
17011 100763 118752 134711 -2817 -46275 -5283 68159 -20732 -126752 -160277 1829 118659
17000 118659 31182 99789 115483 141814 252243 250867 131242 228635 219998 195469 171626
16989 171626 88426 175258 129530 17088 64732 143169 226932 330635 383093 349198 433168
16978 433168 369572 85066 -30801 -128414 -21437 -31676 -63253 -54400 -64917 -186830 -231133
16967 -231133 -242202 -143031 -79645 -46756 -118632 -139847 54885 170962 66256 -48622 -149797
16956 -149797 -230704 -216246 -225891 -225766 -248836 -216548 -134680 -94440 -22268 -130220 -133059 -267621
16944 -267621 -146306 -77204 -22881 -76252 -22009 204947 435182 384795 274400 114310
16934 114310 124978 131164 129372 149852 64084 -105399 -195069 -128354 -54738 169005 278851
16923 278851 240998 185886 99211 -155196 -42826 124543 171702 31765 -107758 74024
16913 74024 98379 -6684 -148616 -241964 -242893 -171711 82862 209835 112441 108962 5263
16902 5263 -39034 -163831 -170973 18278 10837 1394 -35303 64498 74104 72255 164323 273455
16890 273455 417377 344878 127242 -51267 38287 159772 68961 57927 140226 -5191
16880 -5191 -16779 -109527 -111383 -91304 -109040 -46313 -7347 136210 216104 33696 -175429
16869 -175429 -103785 -162867 -156095 20099 -45500 -59744 -37539 -85722 -139934 -54909 88207
16858 88207 219055 180856 360659 213799 48438 38724 -30536 -88529 12733 60978 136921
16847 136921 60403 -106482 63578 217173 272517 338852 351275 190199 43336 85233
16837 85233 151616 126574 187903 228876 236271 265947 115434 -42049 53448 70694 -40212
16826 -40212 -163100 -130335 -276119 -254829 -257556 -221787 -165307 -102647 -159015 -323617 -339931
16815 -339931 -303333 -193952 -138625 -242746 -59691 -64383 -55311 -30809 -74186 -67313 -3929
16804 -3929 -32817 -4757 61211 128976 -44823 -128000 -161779 -321999 -243276 -112134 111157
16793 111157 31086 -22653 -211141 -205343 -305339 -335167 -225176 -159686 -260276 25341 264678
16782 264678 272653 -62202 -146959 -165988 -129369 94347 154718 61358 21741 91467 40874
16771 40874 65189 35563 -68540 22724 138681 190433 377662 268123 164653 86436 88236
16760 88236 81939 72673 56002 153925 83765 -53529 216126 252327 198308 112003 90915 53295
16748 53295 1116 23297 112437 146995 106413 168012 102856 126002 -23337 -232072 -279452
16737 -279452 -123568 7789 -14269 50593 138642 187540 236794 205040 135306 -59321 -216315
16726 -216315 -175432 -19221 -22376 144302 442 -267640 -214896 -102811 -45845 -55541 -96592
16715 -96592 -199488 -54868 100981 4575 -12923 -22482 -196130 -334025 -237713 -72436 -5209
16704 -5209 45030 46026 87591 112457 53883 66670 186108 303215 304157 248938 213887 130460
16692 130460 108375 263432 504165 476501 318535 298922 207633 118956 53056 121840 30099
16681 30099 -75437 -125561 57057 52382 30747 -91249 -187752 -176689 -339578 -481055 -252100
16670 -252100 -87731 -172556 -207582 -187888 47677 259827 280311 259216 40961 57128 35274
16659 35274 -185953 -202151 -178311 -131314 -249368 -292630 -333896 -232094 -146946 -70452 -77565
16648 -77565 -52167 68889 -112412 -382281 -330922 -76691 6243 -88449 82083 281578
16638 281578 244630 150190 71232 73804 148133 207527 115466 -34316 -150124 -168569 -113956
16627 -113956 18381 44891 -63010 -138345 22011 53722 -84618 -192410 -110446 -99425
16617 -99425 -204011 -126138 -41502 -160452 -315521 -348862 -543290 -413911 -379115 -259383
16607 -259383 -250328 -142489 -164601 -115826 78107 77323 2698 -17101 -87489 -200148 -239958
16596 -239958 -83470 -47804 50257 172994 138439 55337 -92781 -16404 139162 -106918
16586 -106918 -491623 -551608 -414403 -225413 -198545 -12770 88723 -44658 13351 -56496
16576 -56496 1363 -38979 -265272 -247776 -184464 -136017 -105668 -15517 -134173 -56034 85764
16565 85764 105905 27655 -92381 -12742 -66934 -196697 -205795 -21316 165068 236044 233867
16554 233867 242142 77560 8336 131152 188937 58807 -19038 -27939 -144436 -101522 -105395
16543 -105395 -35798 79869 97904 77706 196716 102590 -35097 31488 -4648 -197233 -168119
16532 -168119 -73030 -284181 -150774 93249 155340 212680 73341 -49917 23293 -49411
16522 -49411 -241846 -116678 -50351 -6027 -89738 -125490 -48793 -163187 -69801 45523 142477
16511 142477 85301 -10825 -34159 -61753 -62671 6487 164963 141363 94121 251677 276709
16500 276709 59459 -120111 27406 160589 228888 225467 110955 115385 360852 448236 120093
16489 120093 -179092 -31163 204191 341816 236408 132230 -3146 32431 -50875 -346698
16479 -346698 -264539 -137851 -140051 -48336 -84007 -23554 179230 383496 440081 231177 -8411
16468 -8411 -132683 -89860 -129984 -137904 -63951 -184493 -292134 -232355 -80620 84454 -72231
16457 -72231 -230242 -365476 -299690 -263073 -71669 27197 -116604 -112345 -101615 -70708 -56647
16446 -56647 9972 -49532 -99123 -210155 -139118 -3092 -23888 40537 75310 -101155 -53541
16435 -53541 -23957 165082 182871 131264 -65622 -181644 -237247 -66049 -97380 -389582 -373017
16424 -373017 -227683 -149172 -177166 -132650 -5452 -58191 -58826 14131 150349 137368 39070
16413 39070 -23930 -221818 -127455 44301 74799 20118 -173429 -18149 134933 -442
16403 -442 -90184 -71153 -81646 -121543 -133327 28321 -312 -109311 -49798 87762 19772
16392 19772 -135204 -110236 -14432 52894 -51473 52467 -124554 -249733 -105582 -117998
16382 -117998 -44781 1539 84907 -28650 -90513 -110340 -226280 -247350 -183304 -197460 -169454
16371 -169454 -185710 -220218 -159765 -234877 -277314 -173749 -143413 -104662 -401 44094 20733
16360 20733 -24496 -159844 -137773 -81024 -79771 -133222 -205352 -75484 141226 102104 57667
16349 57667 19441 -73789 -129568 -133964 -137620 -144261 -165879 -64525 -22226 -14055 246050 335852
16337 335852 169380 53535 -159140 -135937 173395 243362 290845 308480 316201 188461 80633
16326 80633 20089 7267 -206226 -280291 -18927 -2717 42247 -156938 -314610 -115320 48089
16315 48089 239590 108577 2858 20900 -127789 -254451 -348393 -297152 -98555 -111877
16305 -111877 -267879 -305762 -403971 -276004 -276321 -238406 -236279 -34051 -62020 -62667 -52260 91147
16293 91147 96858 107733 230983 129914 89601 92115 103451 -86801 -205933 -187095 -172892
16282 -172892 -125709 100053 177878 56567 -3030 26296 -128536 -175106 -255029 -249751 -342349
16271 -342349 -253965 -110423 -98413 -58242 -66693 -12212 116805 125733 -53933 -53134 -197342
16260 -197342 -373579 -268362 -230189 -118520 24310 -89156 -267164 -206725 -210804 -183050
16250 -183050 115993 280974 208300 13844 -46428 -44143 -43743 109924 208270 60678 -49019
16239 -49019 39578 -198473 -363371 -518517 -627190 -397579 -173728 -241417 -243014 -246380 -165887
16228 -165887 -72326 -75110 -26200 169123 268916 433376 291089 242487 79477 -13133 -46211
16217 -46211 -319999 -130286 11512 -3290 -136809 -211584 -271090 -253399 -302290 -402636 -367916
16206 -367916 -227595 -43918 -20498 -65725 -106700 -3516 140292 -81511 -396342 -426957
16196 -426957 -245297 -163056 -260762 -350953 -262995 -90220 39982 227472 245183 96065
16186 96065 -55338 -61758 -15210 -120995 -219693 -334018 -292379 -98049 24565 43297 -42055
16175 -42055 -81191 61564 53878 139445 -28592 -234265 -223561 -69733 -3066 38283 -102795
16164 -102795 -213328 -177070 -15407 71852 -141782 -400557 -320748 -217120 -168692 -159302 -111496
16153 -111496 -158494 -114892 -42570 -86165 -248666 -328809 -298607 -364829 -268584 -136103 -296426
16142 -296426 -503046 -448874 -314953 -91939 41535 17167 -128042 -91544 2093 -5757 -30156
16131 -30156 -108243 -122666 -8530 -147624 -89286 11991 45174 119693 13703 -51047 -25793
16120 -25793 -35719 104114 231932 236685 209638 166530 90420 6579 1623 -20143 -95568 -130362
16108 -130362 -67346 57795 8241 -54770 -113664 -116050 -37732 -19936 -126182 -127592 -257029
16097 -257029 -284552 -133589 -76859 -108190 -212515 -67508 -147920 -275088 -299501 -218504 -252935
16086 -252935 -352767 -320685 -516162 -527157 -307554 -157282 101812 196004 113502 24968 -196754
16075 -196754 -102342 49808 -37570 -84620 103096 35835 86535 93491 -66373 -177784 -157778
16064 -157778 -161605 -43238 -2850 -86767 -144417 3845 126954 142969 164296 209634 228296
16053 228296 135685 -87 -53415 -149343 -301781 -317780 -255295 -139021 57873 44179 -14931
16042 -14931 5259 -10959 -93411 -202940 -282610 -102517 112531 127464 67625 210684 189225
16031 189225 138180 94562 -21003 -93033 -152226 -155317 -114082 -88423 -5833 43592 -55124
16020 -55124 -127951 -39535 116900 -53504 -57648 -72269 -132219 -219076 -198255 -126369 -142671
16009 -142671 -51190 26794 -144211 -52779 176185 283734 79191 -219115 -376255 -341299
15999 -341299 -206197 -219524 -141936 18567 134978 37816 35795 -64378 -83567 -73389 32252
15988 32252 -37626 -102329 -51730 73729 -106858 -211498 -263733 -329325 -218611 -232951 -233941
15977 -233941 -183524 -131770 -238056 -193732 -185542 -112311 81910 41566 -142816 -389034 -312457
15966 -312457 -295237 -466129 -405517 -343406 -269769 -165315 -176837 -278702 -264927 -420961 -541088
15955 -541088 -474457 -217140 98024 172816 131062 -16606 12232 136102 137506 218158 104321
15944 104321 118776 132256 -42221 -88550 21522 30456 -11031 -248481 -336365 -237218 -135537
15933 -135537 -208514 -74157 -74246 -38279 -139233 -55759 110995 47394 24370 36866 14876
15922 14876 -87645 -187839 -168920 -75932 -114178 -217059 -303705 -387317 -175930 -146931 -68474
15911 -68474 67557 81622 7071 -93570 -44435 -16118 -34206 32301 8703 -67452 -194542
15900 -194542 -309659 -119050 -21933 -91817 264 -76598 -158155 -3433 17962 -137586 -161952
15889 -161952 -63355 -26343 139463 164187 132812 -100507 -123948 38809 -50765 -154385 -215670
15878 -215670 41338 95971 81651 127756 208958 119402 16677 -24593 127815 204383 72598
15867 72598 79013 241709 403125 322960 298201 230431 118100 21808 162046 290812 273272
15856 273272 133153 -9240 -176956 -131978 -56102 96401 122695 106444 120780 -40679
15846 -40679 -113808 -188179 -274933 -124158 -28618 186089 199012 29406 -84705 -180365 -270149
15835 -270149 -157361 49202 -46332 -228211 -317585 -246883 -149034 -206241 -306425 -263761 -69904
15824 -69904 -8039 -11333 -157606 -232525 -184805 -15007 -123349 -166958 65547 213581 96812
15813 96812 17773 -133781 -153432 -118091 -240428 -270049 -279029 -232474 -113041 -13235 147936
15802 147936 110965 -4696 -143752 -115120 -142411 -21066 10938 27251 -56586 -139618 -78450
15791 -78450 -101259 37296 -83458 -79207 16966 83321 63828 85665 90144 187883 146717 137308
15779 137308 223473 170095 5751 118877 126227 1774 -45966 -106767 -129066 28136 57178
15768 57178 -21593 -20382 -98991 112997 317057 238424 170631 116962 -82372 -40036 -139228
15757 -139228 -134426 -124630 -148018 -282911 -402085 -288323 -222264 -291623 -211435 3415 49321
15746 49321 25980 -93590 -252939 -203793 -282999 -199444 -195747 71131 109082 -19414 -106967
15735 -106967 -202023 -125956 84028 132835 66843 14612 48650 -104463 -316799 -404346 -436415
15724 -436415 -227418 -156230 -244594 -69196 -50601 -65586 29036 68145 4206 -108737 28778
15713 28778 -39442 -43776 40897 140298 -87713 -208535 -78657 -76531 99568 123523 60748
15702 60748 40086 9073 -20415 75545 16995 -308395 -470117 -383566 -315134 -300366 -264045
15691 -264045 -75796 66140 79558 -25194 10613 99364 50267 -204170 -142943 -117845 -301557
15680 -301557 -422664 -269295 99274 246476 70481 71923 -17911 46420 132339 37339 -172236
15669 -172236 -240094 -20977 -12475 2833 156970 -14052 -170786 -193316 -142782 -101113 -57885
15658 -57885 -19070 127501 122017 -134858 -113275 190360 125867 -73095 -169974 -231331 -72743
15647 -72743 63984 133168 15727 -193591 -110866 45494 110503 112791 37491 36412 42969
15636 42969 99877 75685 -97528 -229724 -247774 -173468 -152876 -163324 -76505 -36153 -152492
15625 -152492 -231857 -39801 62186 84805 79775 -58396 -30130 35083 84297 191603 251634
15614 251634 224622 79179 86909 31805 -21976 -43110 -124954 -287823 -267191 -289073 -262930
15603 -262930 -313864 -321750 -275872 -235787 -94911 -9558 -120003 -248367 -211822 -103461 -150353
15592 -150353 -50212 202910 226052 192997 111752 -62273 -135177 -109687 -23253 34928 -245407
15581 -245407 -191603 -35370 17517 34956 79459 -7767 48621 1210 -110649 -354884 -205532
15570 -205532 -203603 -58166 -46103 -179754 -140793 -57525 -16257 -52218 -25659 -64233 163706
15559 163706 81721 -32500 36688 64765 -87869 -226462 -317807 -337900 -90875 -158189 -310382
15548 -310382 -371872 -206724 -121326 -67675 52123 -18851 -98833 -17163 -79763 -167864 -18649
15537 -18649 -48088 -11478 -78698 55942 165323 144381 44597 25439 -34914 2107 -216593
15526 -216593 -402832 -375120 -152490 39219 229603 331173 146638 187306 241363 286418
15516 286418 346134 419731 322654 221630 137353 -9194 -10985 31692 41260 117378 92525
15505 92525 164473 72656 -18662 -27013 -111787 -51589 -3078 -23720 -4983 -126560 -90469 -142286
15493 -142286 -56755 57918 118014 116176 90448 105087 -13937 55534 -5439 -5607 182530
15482 182530 224525 189149 38377 122130 215648 285847 205628 216160 188403 314782 300292
15471 300292 239895 162971 93556 260065 96985 -108560 -96052 -109499 -50804 139399 229638
15460 229638 116220 -16245 176426 131233 -77619 -180917 -191889 -92187 -8043 69298
15450 69298 90536 -32132 -48367 -66516 -74194 -218089 -190087 6172 130446 67550 101083
15439 101083 215933 19757 -147103 -245895 -298819 -188617 -71743 66142 142843 172765
15429 172765 -27230 -142797 -75953 102419 105279 116384 177939 181915 228961 289577 293490
15418 293490 200208 41735 -23402 -20084 -12888 65527 129073 150031 17495 65648 172468
15407 172468 177581 253630 295838 180785 -55455 -138415 -37713 -127887 -232910 -321297 -306940
15396 -306940 -215652 -83758 -111113 -110185 -95259 13025 204326 159060 44899 -40772 -142347
15385 -142347 49693 68782 50756 -74320 14320 -45557 -260331 -171897 -77967 -39019 -20949
15374 -20949 -81999 -47293 -91277 -90237 -130132 -181659 -296445 -89403 76766 153230 67247
15363 67247 -76028 -105620 -187074 -196040 -96062 -59830 -110897 -227951 -300485 -142326 90230
15352 90230 66839 95723 106377 80685 6767 -117168 -11434 13151 -45437 -38897 42086
15341 42086 -66548 -104848 -171954 -146014 -3332 24552 -62018 -34180 38505 14344 -57012
15330 -57012 -107638 -99738 -59126 -3798 79675 -93115 -122646 -87831 -42871 -191777 -137708
15319 -137708 -47571 -57423 -241014 -137695 -152247 -137043 -155134 -57415 -38097 -300880 -460192
15308 -460192 -379596 -226628 -137021 14016 81112 89150 2121 39131 17736 85033 96668
15297 96668 76248 11324 136412 51273 -233517 -308670 -344413 -246964 -112122 -2661 78727
15286 78727 69043 67559 54571 16742 -77007 -106828 -80944 47355 205009 290154 186660
15275 186660 18954 -127439 -179989 -216126 -165188 -102392 -10180 16315 109174 -10769 -231120
15264 -231120 -266722 -287036 -328801 -128678 12046 31065 -62847 -135532 -284618 -341394 -226907
15253 -226907 -166649 -211603 -218420 -110036 88454 180255 270524 270260 2741 -209850 -110855
15242 -110855 -29312 37208 -75191 -63377 -160247 -181206 -136792 -47692 64238 -30419 -61939
15231 -61939 8500 -73148 -119879 -69150 -104719 -265235 -319880 -354129 -351012 -145840 -36796
15220 -36796 -115585 -43179 44604 -109736 -212739 -119599 -278420 -448436 -565478 -300869
15210 -300869 -17258 -47780 -23421 -48505 -76603 84671 58599 -77236 107550 261361
15200 261361 270445 208251 142264 -64254 -62305 -128554 -91049 -104578 -162641 -120508 98140
15189 98140 49064 -116581 -31827 39425 100147 176908 213098 134818 126249 32696 91349 -13178
15177 -13178 -43525 -28306 20176 -1693 20552 280020 412966 387300 112231 -39767 -90934
15166 -90934 -211487 9020 85575 166353 139201 101277 194564 250457 264591 161567 139824
15155 139824 146331 -7277 -79286 -140934 -25281 37307 -96954 -47893 -21710 18786 -38484
15144 -38484 -2964 -176713 -177988 -48636 30611 -24135 -97242 -109637 -49420 101584 111476
15133 111476 -40216 47485 140687 -48863 60256 144145 161012 153534 324195 331881 266560
15122 266560 179272 107114 178808 235208 235363 232301 186404 48165 2193 49855 -17251 -105267
15110 -105267 -164676 -170537 -285723 -283527 -283153 -327808 -198306 55377 78714 178438 236484 92675
15098 92675 78280 130135 151153 105031 172348 148414 131517 -16399 -67279 -48996 1417
15087 1417 -48002 18660 49203 -72078 34725 -155654 -181223 -67302 70707 121132 112649
15076 112649 -53245 -117657 -91021 -128802 -132107 1275 -9138 -146120 -118132 -21554 -243745
15065 -243745 -283067 -263601 -341556 -55938 42426 98959 65038 -49150 51788 113343 -17689
15054 -17689 -38077 75004 176654 19835 -130880 -146837 -74333 -55692 19165 51436 -188083
15043 -188083 -124829 67082 51206 39673 59787 -52355 -23651 178386 134696 -142120 -152307
15032 -152307 -209852 -83351 -185859 -228258 -316263 -296556 -52715 6648 -104191 -126507 66118
15021 66118 69362 195357 94601 -74147 -280619 -312670 -147138 -114105 -231382 -205260 -88238
15010 -88238 102903 90053 5103 -59044 -49783 67161 69242 -39884 -171177 -141932 -84127
14999 -84127 96443 40452 -37460 -133969 -31011 126318 143563 207864 150325 -40632 -254214
14988 -254214 -506848 -493941 -467840 -361181 -436088 -338618 -99139 -45383 -189038 -183958 -134334
14977 -134334 58083 240076 232744 152155 81410 22069 -69877 -183562 -173378 -39136 137357
14966 137357 43980 -38612 58504 -16078 -16264 -58800 -80693 -66324 -89488 -48647 104862 207066
14954 207066 145335 152026 -145980 -262899 -230540 -156289 -321047 -145537 19522 198085
14944 198085 256079 102996 83003 217877 77433 43942 -25831 -99152 -77286 185083 341884
14933 341884 211599 234743 212156 64192 57448 38043 60180 170847 -32212 -149337 52409
14922 52409 184595 131309 10581 -1816 -78536 -185879 -272167 -236492 -134227 -584 -32197
14911 -32197 134869 127130 -8014 92656 13488 -47379 -59076 -130378 93661 121239 8056
14900 8056 -5155 -30386 -101784 20617 38111 129170 129793 61685 -130444 -295380 -257437 -65548
14888 -65548 -28993 76170 226344 188955 28792 -43450 33228 122809 171692 207969 213623
14877 213623 156194 26092 -3570 -90238 -56415 123111 169699 167106 114069 94799 29
14866 29 -23095 35537 -83627 -49496 55309 187981 206825 139438 69997 -101263 -193206
14855 -193206 -98120 -83450 -64639 -57219 23089 -35192 -126472 -100438 -47593 58536 105516
14844 105516 110616 137054 42802 -126787 -141463 -94521 55301 104158 -3221 5459 -142965
14833 -142965 -80139 -54973 -154766 -299649 -203440 -148960 -128499 -134422 -110390 -196180 -50022
14822 -50022 72980 -29264 -140405 -265115 -249241 -171049 -92441 13759 112545 2075
14812 2075 -85413 -136291 -143333 -114986 -61358 17520 -8984 -100035 -12839 5096 54696 98957
14800 98957 88110 173976 69696 28833 180979 120636 -9569 -63772 -156313 -184480 -159634
14789 -159634 -31465 16137 5832 -62814 -46918 21280 114810 149650 53500 22380 -65154
14778 -65154 -92848 -63378 -62204 -42404 -14819 -219200 -498539 -477082 -226287 143020 125474
14767 125474 -68726 -45306 -163808 -218009 -180897 -114549 -106079 -169176 -282587 -81740 2084
14756 2084 -105380 -150708 -179751 -122459 7362 25075 -66094 -101742 -65207 -158980 -167740 -28794
14744 -28794 -49839 -17382 -36013 -10557 -17668 -88940 164371 278182 238247 74013 174803
14733 174803 164372 168682 166600 142370 224316 197394 25671 199340 244840 153341 162338 15456
14721 15456 -188672 -130788 36406 98176 -9009 107793 208521 13097 -145246 -284035
14711 -284035 -383908 -254482 -55585 74084 111937 -88374 -58669 59236 3012 6733 -56184
14700 -56184 49759 89216 139084 143359 158955 131531 200116 148652 33796 -37823 -125699
14689 -125699 -112725 -129823 -184273 14176 66317 -66527 -34669 -2595 -96445 -44916 185971
14678 185971 302341 273212 100156 -211141 -249223 -274394 -209256 -276849 -518746 -391255
14668 -391255 -34598 38785 -49727 -40105 -155357 -70243 233656 501797 316227 164993
14658 164993 -16091 -185441 -229354 -174660 50342 131360 178995 229890 194683 272165 205773
14647 205773 85003 88436 119825 42611 71818 142238 53073 -111299 -70819 44792 68754
14636 68754 -12511 -94916 -355025 -567365 -490473 -199522 -160382 -71981 137579 87802 -49461
14625 -49461 -17122 167290 174566 158437 97812 106600 175103 -48829 -22528 96228 17816
14614 17816 -7866 20086 -7895 48513 28871 -667 77516 27783 54334 -61040 -156197
14603 -156197 -14748 125416 19979 -135595 22642 240901 284484 245559 178436 97935
14593 97935 -38265 -222933 -301852 -129601 18633 159641 259237 123286 -28260 -88789
14583 -88789 -43069 6721 22123 66629 64461 54133 24013 -132202 -143641 -174851 -277570
14572 -277570 -92337 -51450 -247173 -263642 -180865 -161334 -137881 -189470 -165394 -200964 -327324
14561 -327324 -304733 -227428 -45601 -56804 -114111 -251676 -242968 -109586 12032 54473 3984
14550 3984 -106086 -232187 -75846 -94958 -144423 -226922 -304141 -232323 -17355 192163 173556
14539 173556 162057 132142 57975 37088 -95235 -100615 -12749 -63082 -26824 37587 131961
14528 131961 16636 86094 43429 28310 -205710 -342324 -296934 -370091 -520254 -486735 -309704
14517 -309704 -175513 -466 -46104 -8374 18142 52605 36087 -123133 -102260 88130 -26015
14506 -26015 -54193 -11902 -42460 -68517 -120955 -58941 129207 162061 170931 86864 -120720
14495 -120720 -305540 -134747 61773 138408 130091 172013 34359 13493 21478 48418 130454
14484 130454 111336 313 56152 65649 80280 65870 5322 22448 -199638 -289544 -361720
14473 -361720 -333842 -263731 -149000 -221454 -214424 -40651 -74899 -218245 -119899 -157021 -112360
14462 -112360 -32960 -1553 -165322 -81661 -106513 -168353 5282 62331 -12641 -83309 -83968
14451 -83968 -205247 -197667 -224553 -216845 -184006 -184189 -249921 -167406 -41963 -23758 -111076 -115671
14439 -115671 -160527 -220379 -126370 -22688 54106 93023 94913 139651 62536 -71083 -140909
14428 -140909 -94666 1734 -119272 -133869 -95229 -82420 -146640 -265833 -225391 -261470 -288625
14417 -288625 -310690 -180108 -267270 -392672 -379612 -277770 -127869 -13404 -96960 -189906
14407 -189906 -112139 -48796 -114262 -70159 -36888 -24870 -40122 -139446 -71790 66495 -31323
14396 -31323 -137268 -126613 11756 98205 31691 126517 215923 318746 307365 260324 246885
14385 246885 348746 213318 235386 295852 415859 441633 534991 402953 254504 179541
14375 179541 19092 34910 66046 145645 48481 -41590 -121124 -129076 -265576 -315549 -109009
14364 -109009 12700 -2677 -31860 118151 79627 97279 -13473 -49526 -26964 -35051 11802
14353 11802 95675 146072 274583 333327 164622 16505 -136494 -185461 -6268 111697
14343 111697 107313 -26660 -132384 -126426 -111930 -201318 -287339 -137107 -176890 -70590 58919
14332 58919 -36150 45012 138633 179828 -72486 -234639 -108395 -59336 -171822 -311685 -241801
14321 -241801 -89001 -27686 -93808 -3143 35685 14345 -64203 -78641 -219552 -152182 -55378
14310 -55378 -66573 -216903 -332628 -259536 -105084 108198 -45544 -218310 -78577 -72348
14300 -72348 106993 144550 -11394 78816 16611 -61859 -134590 -78533 13378 4225 -31805
14289 -31805 104123 126505 192809 167534 378748 550890 518505 393997 299172 444656 678598
14278 678598 719233 713668 833542 941620 1206341 1497791 1825061 2044338 2307144 2724564
14268 2724564 3243176 3573585 4029921 4718207 5685787 7152732 9279710 12245355 16406272
14259 16406272 21955674 28584449 35427705 41476086 45906410 48030069 47692474 44786783
14251 44786783 39787158 33905357 28112483 23123229 19069807 15911359 13733291 12014226
14243 12014226 10862759 9998772 9054006 8436722 7894519 7275167 6698403 6427386 6067964
14234 6067964 5836235 5714544 5471841 5300668 5056779 4729429 4500910 4422285 4479010 4296914
14224 4296914 3960619 3640216 3624305 3653514 3630862 3636053 3580499 3568182 3404028 3172042 3118803
14213 3118803 2934185 2870750 2745240 2676461 2591983 2512870 2511449 2663714 2819752 2883452 2837504
14202 2837504 2705664 2604741 2337356 2062565 2300525 2440922 2454504 2454232 2399256 2263858
14192 2263858 2167769 1923349 1535932 1413470 1509918 1600118 1723364 1731003 1784572 1879549 1726833
14181 1726833 1662305 1519735 1693041 1768528 1662049 1649458 1487814 1316060 1351595 1417087
14171 1417087 1485172 1504306 1535130 1362082 1216393 1057850 1100775 1145504 1097590 1118231 1259941
14160 1259941 1178224 1129252 1126631 1075665 975981 726051 591230 457484 556672 857960 1008400
14149 1008400 1062888 1056654 1014915 936381 1023712 1053199 1037533 1047392 993815 764705 751598
14138 751598 663747 740295 697060 739433 883295 827965 728323 877296 1007524 948155 790924
14127 790924 819952 822008 908414 851840 661695 722209 705246 622977 653803 649357 601551 522336
14115 522336 601604 722707 674487 683830 778522 736578 595267 725559 819637 768441 642623
14104 642623 707631 802353 635279 597836 592368 572963 514820 458903 322393 309289 277540
14093 277540 98139 308512 304524 154223 184601 437623 519987 300244 124597 171808
14083 171808 243055 225531 274199 123244 109439 111030 219947 286937 275631 300884 260901
14072 260901 194865 230847 229267 395137 455509 492558 428903 188422 111278 40916 163368
14061 163368 197912 341946 471398 385614 385089 349038 290851 267802 248951 218247 340568
14050 340568 353460 243538 106114 117442 265446 437793 633632 543472 537469 705366
14040 705366 644873 454006 301407 127941 144274 205792 268074 319873 332669 318921 243497
14029 243497 324900 422714 335421 387591 321778 253167 248537 178748 186563 221497 307202 283894
14017 283894 199256 214117 144238 212247 262329 323080 377851 176011 10081 -30295 -111823
14006 -111823 -65365 119123 181290 80507 55259 112085 95629 78367 213349 335620 400845
13995 400845 303166 63001 16288 43699 79210 127135 202594 309763 322027 156160 -25946
13984 -25946 36337 -20914 -132693 -181150 -200464 -137910 -165267 -88437 -58877 -185562 -227928
13973 -227928 -118769 -123301 -175055 -121136 -34554 -21776 97196 176430 226997 416648 495969
13962 495969 319204 215024 247845 180429 74004 6359 54819 218452 293804 247576 169737
13951 169737 -4739 -70658 45161 141829 202734 143749 102885 91783 70294 136444 133253
13940 133253 103743 -57785 -199064 -229879 -214062 -244949 -360688 -235347 -53441 84277
13930 84277 183259 164825 164348 38353 -78636 54679 84048 148515 98739 -72458 -28370
13919 -28370 66359 242873 176181 -17661 -130694 -6565 167834 279206 100975 35039
13909 35039 84467 54357 128974 301278 271173 83526 135714 322522 281625 36451 71588
13898 71588 85759 3529 -44204 -44685 -37747 94693 230449 144151 163099 27709 16564 -24941
13886 -24941 -88098 4514 159792 172691 273436 353586 220418 86485 39922 234535 234956
13875 234956 201522 97786 60075 142617 214787 265681 53249 150582 196678 125982 36704
13864 36704 -131082 -229798 -300643 -228029 -170562 -99490 -78607 101993 92931 240988 356930
13853 356930 300085 233370 243420 46708 -119925 -18229 -34197 -191363 -170341 180409
13843 180409 386649 403796 212654 143748 182442 214639 98967 122371 213292 274701 186880
13832 186880 -9543 18319 257523 224320 56590 32553 16934 115454 131091 131618 200695
13821 200695 187501 224914 19412 -304712 -270623 -213785 -32253 36677 101552 -5182 11705
13810 11705 89705 250909 275454 368639 429029 407149 144646 94122 109564 110053 197018 158800
13798 158800 87178 174931 207695 296502 252026 138259 70302 76988 280273 327504 365077
13787 365077 343570 220339 -31496 -3157 60818 86190 -50751 -111814 -126133 -142363 8398
13776 8398 16363 -65686 137120 166123 -12975 -50438 94353 20411 -189304 -211116 28050
13765 28050 279264 388973 173986 -1403 -22795 -20973 108747 205770 163394 47533 59308
13754 59308 -39904 -173826 -177694 -124594 -32150 137630 174301 216203 158272 53162 -32694
13743 -32694 -155946 -330555 -262852 -198939 -131292 -112500 -151537 -143837 68722 114380 16070
13732 16070 -3117 78245 31311 152084 158631 102291 207211 338541 339888 91359 -101866
13721 -101866 -166363 -149031 -83554 11490 56288 40936 -7887 -3545 159932 197648 -25820
13710 -25820 44416 95348 250429 98790 179469 341172 446140 157311 58713 -35857 -138114
13699 -138114 -93670 1578 4429 -24732 -38848 -60237 -31585 -15586 19405 166456 83493
13688 83493 91406 270776 318702 169409 133085 211815 265168 291361 241542 180656 174923 80756
13676 80756 -77425 -99626 -38048 -147362 65720 163585 96115 -68798 -15676 126161 348702
13665 348702 330299 28732 -110859 -51730 -43512 6546 -3545 21915 -71341 41882 99543
13654 99543 141621 263813 162802 116801 27352 -28545 -12157 335 -78057 -263350 -127088
13643 -127088 -49249 90989 116297 15855 -27656 -103409 33287 107650 1143 4389 53914
13632 53914 119502 111986 58202 130849 97179 41554 -25211 67611 209720 176356 204446 325518
13620 325518 444460 282772 163899 64825 94797 158765 130743 44916 31134 77949 101638
13609 101638 157909 23541 -46001 -38076 -5592 176303 263093 78065 -70305 -136937 -215689
13598 -215689 -180074 -372214 -374445 -234278 -335625 -291776 -38992 164096 340100 298190
13588 298190 201460 170682 286631 253630 138966 162945 100949 -24497 -41755 -145204 -228889
13577 -228889 -217579 5982 -55162 62139 20735 -106022 15789 104861 235960 176521
13567 176521 144488 -44103 23357 16757 173718 117060 -45863 43343 109227 200458 84348
13556 84348 -75685 65634 198430 255079 163605 137785 11982 -318652 -221948 -82879
13546 -82879 -7674 3748 -112267 -16740 1275 5425 67212 -50434 -34451 126186 80873
13535 80873 131373 111837 148372 64337 10117 -65072 -84042 257762 374324 278868 252063
13524 252063 86321 -13216 132125 312304 112943 -91420 -81414 4843 119352 114608
13514 114608 33100 62635 -124393 -360558 -225543 13143 61945 132371 41552 -157384
13504 -157384 -82936 -101585 -28547 54501 106743 11531 -147105 -183785 -92391 119054 80454
13493 80454 21240 36742 -141691 -137242 -178086 -204318 -71846 47013 32445 -52738 -25375
13482 -25375 410 39661 20818 162459 192585 212909 227516 236285 64589 48738 119025
13471 119025 89206 140135 197192 145697 87242 137667 54455 -77525 -106825 -166565 -78646
13460 -78646 -46270 26204 5507 -1204 -26854 -130187 -35966 -45576 -52141 -97788 -65755 23497
13448 23497 257291 186676 85601 21718 65465 81988 244214 350201 357153 350242 433117
13437 433117 345943 146792 -118655 -118376 -98968 -76773 42450 29010 32329 93123 107506
13426 107506 200555 283503 385489 379571 168431 46566 114387 123632 186784 132068 158069
13415 158069 35777 -104605 -161274 36773 151529 -596 -23311 -36647 -133039 -112225
13405 -112225 -136389 -182248 -123937 -76436 -107021 -37380 -38852 -7084 108981 27069 -101056
13394 -101056 -109445 9999 115994 213146 126441 -3749 53846 27632 -33440 117567 260500
13383 260500 387653 318605 119470 219905 121235 105672 4261 -103548 -160660 -182813
13373 -182813 -151502 -180907 -155938 -3097 110507 5651 7343 -30215 -90657 -64786 -77505
13362 -77505 -100351 -27741 196303 149792 128729 293433 185525 -72315 -130381 90573 142824
13351 142824 182419 538001 643827 457771 219079 190007 39925 -62719 173418 184434
13341 184434 66894 64003 -14246 56570 166307 233182 148952 71105 -5219 122393 91848
13330 91848 -5683 83683 -91082 -43480 152491 35858 -7135 10107 212952 191332 146444
13319 146444 63183 12017 -31625 -186919 -113164 -79207 7332 -17790 124503 133264 49098
13308 49098 -93441 -54467 25797 53432 100382 169616 371093 382864 243353 301375 319810
13297 319810 202385 148986 17276 -37394 73989 64356 30863 -123333 -97753 46618 167151
13286 167151 280089 346976 249144 105726 13692 -2082 105124 286665 179885 111295
13276 111295 175279 133812 14292 -13273 12266 -15040 128766 186975 39954 -170370 -28654
13265 -28654 147186 254354 246271 241872 237740 54709 8013 60550 106908 5087 -34499
13254 -34499 11684 -80976 -109863 -46372 68381 62779 48516 63536 7944 -91128 125400
13243 125400 146171 197733 159603 139890 179895 115107 -50606 -205015 -133527 -55202 -12243
13232 -12243 -2277 -50444 -77144 -169299 -225918 -138690 -10098 -13151 76444 123344 112411 109999
13220 109999 84641 -64390 -147930 -343268 -310799 -112191 -160090 -179262 -169565 415 27287
13209 27287 111966 95291 33264 -95945 -141856 -151313 -84891 200800 246457 113878 188762
13198 188762 105081 124984 92952 88340 35969 42797 142159 64497 11274 -82490 -130042 -206289
13186 -206289 -150923 22286 25064 90941 119683 -17352 -57538 16338 189004 119570 168088
13175 168088 247069 143962 166295 286211 145056 76278 81323 28592 -34420 -56616 19213
13164 19213 90706 244907 255781 284499 226696 204506 262783 240410 184901 98793 -8193
13153 -8193 -625 -25687 35513 167445 199403 104209 165765 157010 250340 138996 -121760 -69417
13141 -69417 68156 274280 124917 -2858 77832 314783 530195 517257 438716 398071
13131 398071 212896 187334 213736 128181 147250 210797 25181 -174462 -210768 -160727 -103092
13120 -103092 -67586 70202 227738 34563 -109357 -53771 67568 68232 4580 61579 208393
13109 208393 137720 165587 33036 70238 101923 85132 151519 220585 158113 220240 283540
13098 283540 118873 167470 227786 189467 207335 329392 342123 249884 102983 108237 119791
13087 119791 44112 54028 1634 -118775 -40594 105082 10209 -30013 -46346 166913 244429
13076 244429 281576 138184 60001 110400 170986 223641 191632 168066 84989 10142 118681
13065 118681 148508 171449 90964 -71636 -113929 97056 322905 239077 258201 213921 187989
13054 187989 -25586 -137017 -141529 -60199 96201 122226 85128 70848 248793 197782 165422
13043 165422 -13905 -144080 -128605 -136237 -177818 -41786 22220 15064 -68005 -232603 -222982
13032 -222982 -106243 -73322 181255 203270 299825 252422 92200 -22175 51171 155843
13022 155843 173471 271188 310675 211438 63971 137675 208309 183777 90038 3664 -28023
13011 -28023 31204 -50170 -10330 54128 20070 -5195 42567 146743 122898 52968 -68448
13000 -68448 -178027 -96019 16533 -128919 -185019 -225072 -113499 37454 93711 211034
12990 211034 428607 386983 212522 9663 -36153 79694 23361 180519 126361 114687
12980 114687 93639 132305 283383 332890 284624 412080 494825 325119 194320 222871 140129
12969 140129 99475 198290 285949 153222 -85849 -38735 137766 416732 338618 206522
12959 206522 275038 243216 57243 -94657 -62073 -86836 -5144 107765 215088 272180 249423
12948 249423 68387 219132 159809 -10680 111032 106825 181318 265418 412669 514461
12938 514461 439652 357695 368998 243019 25934 -65486 37205 132009 185323 107644 -70745
12927 -70745 -78102 -4295 -74816 -30219 141419 203123 114981 165462 221527 266476 215842 65194
12915 65194 -64891 -91302 -213814 -85929 115123 281127 232551 89385 71645 122126
12905 122126 293877 444107 545848 421463 260671 255342 161477 303762 412977 427912
12895 427912 536332 506927 462549 418991 548846 599595 507443 426004 103584 -191780 -16768
12884 -16768 72061 185473 190093 235184 42960 -128962 11089 -2933 7285 94050 117563
12873 117563 263167 358411 220080 221744 302228 306130 278701 247307 224432 91815 162423
12862 162423 334804 417003 224853 125719 118166 162063 162849 184492 237205 298972 327113 275627
12850 275627 160578 9590 184156 132790 100854 211645 386314 199331 28278 -60131
12840 -60131 -34110 -27606 24508 -30397 15261 150233 277637 124940 57167 44567 129329
12829 129329 324475 244932 154901 -2240 -31563 70346 86072 183561 382451 380396 507988
12818 507988 569292 483619 401945 387378 366082 207454 233329 173024 220592 322947 385568
12807 385568 374220 403923 310262 -64575 -181587 -110781 -95200 -153347 -22384 125113 244018
12796 244018 193892 107042 63681 136657 184769 130542 170322 -66367 -51991 77443 328715
12785 328715 490198 477642 436396 232489 121938 288096 417587 344134 352897 247608
12775 247608 173005 61691 32093 66566 -14727 12780 38638 36046 112137 247962 297718
12764 297718 204618 233017 265547 231011 152081 246302 238961 223488 111206 -6603 3632
12753 3632 -9828 49891 103859 153143 150680 80563 253115 413340 127212 156447 293550
12742 293550 255855 283174 210230 190776 213250 145990 219309 434904 327133 148390 170875
12731 170875 294148 127595 19816 156644 238789 304562 201413 174996 258138 510453
12721 510453 439989 429475 517208 614619 444172 343311 395147 450505 404223 316117 201491
12710 201491 131476 110566 249022 193099 249591 370714 338659 321680 362079 338027 315699
12699 315699 450373 394623 283921 251383 186013 170106 249459 221611 210306 101015 173058
12688 173058 340030 351155 386556 353761 40043 -80599 -171994 -34803 243041 388453
12678 388453 312568 195271 170656 71221 -81337 33366 227938 439455 476228 474794 374964
12667 374964 328490 292464 374970 516166 490589 326106 288536 291476 240670 364741 242020
12656 242020 235292 401902 419493 448479 441567 177255 226645 319346 514139 516636 426977
12645 426977 348547 302702 268178 256065 277206 409095 504448 389925 33186 -1051 -53725
12634 -53725 19636 270419 201568 243829 424179 389043 499624 519547 498686 433680 504541
12623 504541 510696 422987 254951 233365 163832 78588 196338 349123 476993 540492 585948
12612 585948 652016 671290 620030 589395 539987 436276 271753 236371 289767 290688 312068
12601 312068 487984 431056 381303 497509 564611 671145 701868 735177 644699 633335 503730
12590 503730 408385 438447 408432 364493 548088 674458 464302 352454 384489 453702 481527
12579 481527 460716 416847 474420 633601 679484 598203 561950 506018 415588 538062 470381
12568 470381 442218 489927 485660 558437 651189 604936 607038 509867 413536 513760 609448 536211
12556 536211 509864 569621 563510 625620 650725 448650 299612 276126 389633 565334 530788
12545 530788 471701 552384 486129 529889 631418 492038 363980 242901 156126 70335 297840
12534 297840 536950 598819 758714 863023 831014 691490 573081 266284 249497 341143
12524 341143 383041 506325 470236 379306 446640 603324 650092 580970 543180 560178 542784
12513 542784 484708 543349 542802 586718 466008 367088 375112 342498 311315 277280 359889 492721
12501 492721 639231 600099 633563 613364 453195 441868 355174 413479 462163 419733 551160
12490 551160 499986 446682 591233 559627 469772 637510 812960 657409 523061 613246
12480 613246 509077 547233 613012 736477 629804 455261 538224 695535 707716 647610
12470 647610 631988 494192 501756 574590 425942 566744 611371 603127 393613 218083 408264
12459 408264 634184 761498 662448 572421 509117 513861 606279 661162 731960 725785 649023
12448 649023 669985 750337 687541 745394 755503 717727 574696 706442 656590 658588 620421
12437 620421 745639 763895 639616 656004 599033 779271 999992 985610 835701 788977
12427 788977 831336 825458 892064 808551 745244 924868 874647 752430 807706 813834 873407
12416 873407 912614 993350 1038117 846430 747830 866081 877904 738643 731933 842546 787909
12405 787909 852349 886495 957592 1014408 890205 818995 886956 992484 879378 895268 1020759
12394 1020759 1079670 1105370 1065539 983515 1007207 896175 859096 803316 784540 735456 913105
12383 913105 1006220 965271 1032841 903811 793415 756649 749079 869460 887512 1011894 1067991
12372 1067991 1098973 1227672 1063891 915096 931274 1094922 1231038 1220298 1208965 1154730
12362 1154730 973517 909318 1109549 1095738 1011890 1099341 1067211 939710 887131 833254 842077
12351 842077 801679 822178 797635 919363 946619 961642 1060974 1263773 1387874 1318599 1210504
12340 1210504 1296612 1343844 1163049 1145473 1053541 1053742 1139997 1345696 1537947 1690877 1589533
12329 1589533 1456347 1438563 1353109 1310402 1381005 1331567 1367782 1437377 1517308 1518247 1380468
12318 1380468 1314292 1249238 1234960 1237541 1193538 1199725 1193186 1178921 1276892 1324058 1351866 1364455
12306 1364455 1547345 1709358 1567883 1566027 1430665 1233848 1153376 1389553 1637172 1666160
12296 1666160 1563791 1394854 1308080 1467320 1638002 1524160 1532380 1501724 1404093 1236299
12286 1236299 1145645 1280930 1425911 1586396 1460888 1485393 1799442 1866005 1765702 1594995
12276 1594995 1504218 1608518 1767730 1682344 1568175 1490815 1557516 1564789 1746701 1867628
12266 1867628 1840791 1655920 1595527 1722031 1735777 1818439 1694763 1705226 1721996 1730510 1711079
12255 1711079 1732022 1831254 1849048 1899349 1920621 2071716 2247946 2223223 2157974 2080609 1925750
12244 1925750 1956719 1972836 1953382 1829044 1781598 1852771 1881482 1932721 1987232 2074882 1772773
12233 1772773 1969767 2098618 1937429 1806832 1819842 2075839 2120394 2052541 2061147 1883665
12223 1883665 1972574 2071450 2145220 2052149 2097191 2197177 2316925 2242421 2156807 2097258 2057646
12212 2057646 2180151 2197943 2215481 2135270 2066996 2184259 2299923 2268750 2367524 2440463 2349882
12201 2349882 2278512 2334045 2354008 2183211 2302416 2407040 2273556 2211483 2356772 2585180
12191 2585180 2654170 2706401 2702852 2590569 2598717 2500488 2459278 2447831 2451950 2406967 2583379
12180 2583379 2636689 2770136 2826310 2764181 2706340 2684398 2776599 2743501 2796364 2594515 2653732
12169 2653732 2848429 2902427 2860655 2731177 2908652 3013300 3188143 3155484 3040041 3233638
12159 3233638 3424308 3423711 3467525 3390929 3395021 3361290 3424183 3280927 3271897 3266472 3315024 3244000
12147 3244000 3281680 3469451 3527196 3505922 3597935 3820308 3805139 3638596 3664131 3591885 3623607
12136 3623607 3763740 4094868 4088953 3966261 3884174 3754925 3773947 3942875 4014607 3954687
12126 3954687 3938124 3977934 4184462 4232156 4345180 4396048 4436982 4391348 4455930 4617952 4528284
12115 4528284 4541478 4742357 4596906 4624210 4626026 4686982 4860412 4973874 4987290 5037252 4966491
12104 4966491 4843404 4800572 4953601 4973473 5043199 4995581 4927274 5179383 5297084 5287344 5278453
12093 5278453 5215596 5347222 5201495 5240089 5438109 5650025 5627920 5651031 5749994 5921521
12083 5921521 5868230 5724844 5834977 6040070 6208817 6199203 6149213 6208090 6086068 6049774
12073 6049774 6304763 6449080 6594774 6785295 6806423 6764158 6728547 6857478 7040560 7128749
12063 7128749 7197076 7340907 7349824 7262277 7335570 7246014 7272012 7518140 7455350 7282622 7262359
12052 7262359 7319700 7635063 7811662 8002052 8169156 8208373 8149194 8187898 8265165 8348998
12042 8348998 8464791 8698430 8901855 8862729 8674005 8704806 8952866 9033662 8950711 9039555
12032 9039555 9123826 9204487 9270411 9531875 9672311 9599370 9526758 9707776 9939177 10067510
12022 10067510 10155368 10225584 10379378 10476893 10564555 10845976 11041005 11272474 11356467 11305813
12012 11305813 11427712 11486368 11591144 11817791 11907236 11762009 11784790 12086154 12282456 12432532
12002 12432532 12686719 12924101 13000047 13023694 13304138 13290560 13213073 13379842 13476618 13536104
11992 13536104 13798824 14116232 14255067 14355262 14525011 14833506 14873584 14905117 14952044 15078633
11982 15078633 15346320 15593960 15969185 16172182 16225766 16253359 16481727 16645764 16739148 16952118
11972 16952118 17159623 17263481 17388129 17573335 17600359 17763996 17945609 18084244 18294623
11963 18294623 18501468 18553792 18726016 18847651 18934775 19165281 19461038 19557962 19895509 20139266
11953 20139266 20091179 20202956 20252122 20546208 20740997 20843663 21006627 21009241 20948043 21099134
11943 21099134 21315883 21536380 21819449 22066632 22283046 22576221 22704046 22714200 22821395
11934 22821395 22807577 22878583 23111469 23276260 23400920 23531223 23608000 23583467 23697636 23735907
11924 23735907 23632921 23725754 23900631 24000794 24136928 24271467 24170424 24165128 24286405 24349770
11914 24349770 24298038 24275143 24400158 24530446 24550176 24462577 24462322 24451089 24714152 24629320 24640632
11903 24640632 24688606 24668000 24687315 24725367 24490893 24441112 24384881 24281322 24409157 24374463
11893 24374463 24021417 23786782 23716609 23735511 23691132 23748218 23733297 23461618 23044619 22999211
11883 22999211 23090270 22953014 22832023 22616553 22455815 22372688 22292998 22241435 22191899 21996713
11873 21996713 21658688 21531141 21391052 21282471 21313198 21384703 21380269 21055969 20684684 20565817
11863 20565817 20311114 20245383 20135380 19960429 19957302 19809118 19601034 19531860 19350810 19124705
11853 19124705 18931740 18716912 18466314 18232122 17942370 17888292 17805279 17664527 17565522 17459347
11843 17459347 17287485 17117055 16971066 16964839 16843053 16624349 16454837 16223371 16162294 16075455
11833 16075455 16002172 15849541 15629159 15304581 15209629 15131163 15146712 15057730 14751448 14584306
11823 14584306 14320709 14301874 14090364 13927266 14018254 13885846 13820270 13680221 13589979 13589827
11813 13589827 13396525 12925848 12697725 12664880 12770111 12801432 12656664 12351189 12327311 12096762
11803 12096762 11836796 11651652 11630250 11597430 11503308 11450223 11570946 11458937 11212268 10914738
11793 10914738 10794928 10810838 10815681 10469687 10252950 10136569 10022338 10122221 10033903 9916180
11783 9916180 9959388 9957237 9732193 9667233 9705399 9612725 9343058 9349426 9153769 9067073 9100579
11772 9100579 9051293 8995181 8760324 8641151 8621437 8636556 8659974 8671152 8672176 8687170 8463864
11761 8463864 8233674 8404133 8264757 8106624 8061415 7997017 7982463 7853577 7873084 7708435
11751 7708435 7663237 7655143 7400038 7361031 7508616 7598354 7439807 7289046 7180169 7079790
11741 7079790 7072144 6946272 6870941 6904818 6979275 6880310 6725684 6503651 6229917 6393589
11731 6393589 6548515 6519782 6290314 6203920 6321282 6330211 6167828 6183122 6113049 6032007 5965094
11720 5965094 5909425 5872784 5638635 5641740 5602854 5644004 5528549 5347123 5295382 5404657 5349340
11709 5349340 5311788 5399332 5634044 5564452 5397414 5375013 5299390 5324608 5301385 5327603 5274983
11698 5274983 5077248 5051806 5031207 4903773 4818937 4725095 4798658 4764702 4719677 4799461 4707934
11687 4707934 4588073 4499851 4426773 4426475 4427855 4338055 4349953 4339544 4440890 4410868 4013241
11676 4013241 4008983 4188066 4251336 4292537 4194142 4050819 3907275 3916471 4031367 4115931 4159682
11665 4159682 4160563 4235385 4184768 4008675 3935307 3805058 3723779 3844269 3819281 3670151 3443442
11654 3443442 3267186 3250080 3325663 3538861 3644714 3723194 3514425 3428196 3492422 3530230
11644 3530230 3464200 3500894 3593043 3646049 3628456 3513140 3393636 3383712 3321844 3340876 3436949
11633 3436949 3374389 3358491 3187297 3105704 3175356 3370754 3363657 3445971 3344492 3425464 3685947
11622 3685947 3737810 3833125 3602602 3441214 3245847 3214268 3243913 3243168 3091198 3147854 3160965
11611 3160965 2957560 2884652 3008008 2958733 2824809 2960125 3125717 2896690 2784251 2721550
11601 2721550 2732855 2744878 2732977 2551365 2509264 2591815 2657131 2513995 2302591 2234537 2327455
11590 2327455 2590398 2705411 2621354 2706797 2667213 2414049 2474604 2411096 2449503 2537754 2377824
11579 2377824 2348185 2264433 2259927 2323622 2331534 2183266 2217734 2316613 2427472 2477821 2315148
11568 2315148 2171922 2193258 2326426 2334829 2387012 2446372 2401641 2308786 2167111 2186606 2192585
11557 2192585 2242624 2386839 2237035 2063022 2095161 2108743 1972633 1862030 1868701 2069136
11547 2069136 2306386 2339963 2331956 2229173 2104199 2043692 2084846 2072941 2047502 2067634 2179419
11536 2179419 2127990 2115284 2026220 2029780 2012186 1909178 1986502 2038431 2000497 2092376 2032025
11525 2032025 2071276 1967057 2058089 2060269 2022899 1878606 1782477 1760536 1692770 1761377 1685273
11514 1685273 1777624 1928292 1958769 1836884 1560595 1438969 1495125 1616302 1781933 1776698
11504 1776698 1633788 1544522 1592015 1560219 1531091 1548296 1640615 1679995 1618443 1491406 1458890
11493 1458890 1457472 1457721 1508383 1699489 1748419 1660718 1596648 1508676 1300811 1400202 1567025
11482 1567025 1617206 1563370 1623711 1681557 1627682 1535874 1509005 1487841 1531356 1322415 1165783
11471 1165783 1209803 1217412 1238322 1342611 1347333 1354648 1306743 1320624 1431207 1514997 1377789
11460 1377789 1368761 1393517 1419448 1447986 1306699 1186672 1131113 1196972 1300897 1238811 1150637
11449 1150637 1060031 1028079 1004890 1111609 1181369 1282795 1328387 1368230 1333982 1371242 1284067
11438 1284067 1143859 1159108 1157901 986279 989305 972250 1016859 1110940 1072136 1049889 1036549
11427 1036549 1177349 1282169 1321849 1208874 1110597 1103313 1056361 1049048 979358 985777 985529 949092
11415 949092 914691 938616 923531 906935 1036607 1118370 1109045 1122611 942158 779962 775720
11404 775720 864041 874929 937622 921688 914101 754201 759979 694822 649150 755096 984395
11393 984395 984785 996069 855330 729251 799272 772980 649771 609641 615133 621243 757218
11382 757218 828485 874433 939105 1033468 978243 969988 960110 884398 793948 918270 896037 888571
11370 888571 835018 900346 951345 902916 827568 755981 787671 750238 705328 836799 775567
11359 775567 680936 701706 750813 736507 624513 890428 930493 824700 879528 821061 669119
11348 669119 811442 883975 827999 669170 605028 508157 464437 692443 899519 900579 818433
11337 818433 743421 666136 657119 796092 1019612 948321 975884 894813 854947 791036 794402
11326 794402 782699 735001 814280 1029139 979318 920223 804326 688261 657880 661720 820150
11315 820150 792179 676721 601953 324727 379223 429512 463962 575847 688838 797449
11305 797449 711476 575726 581070 627277 693479 867757 709377 728989 657331 572226 570805
11294 570805 577352 519514 465111 557008 641952 473523 484623 622351 678657 690900 819753
11283 819753 959085 1013117 893329 817670 779320 694103 743692 817344 620703 458435 535226
11272 535226 811229 837093 764472 914718 924153 735628 855138 896032 834293 710477 605623
11261 605623 555760 560325 641358 719959 843363 770602 699604 797110 800005 584842 563035
11250 563035 646258 531827 555500 519235 493955 515790 496146 618047 640280 584448 741000
11239 741000 803884 676512 646985 643892 767524 721350 570705 456012 494074 409718 454719
11228 454719 386870 379756 428871 411571 418201 499136 481047 314825 390945 526899 516623
11217 516623 451602 437596 883610 935013 775188 553094 496665 439296 401468 515225 634890
11206 634890 695281 657732 524209 430779 343073 367759 530081 479898 486692 413563 363263
11195 363263 266563 198344 184926 292331 448521 411947 463545 663407 788464 746856 759608
11184 759608 795913 667653 454593 407052 431145 402547 438229 358129 309112 190019 328705
11173 328705 407990 531982 430844 441994 351879 335003 288252 193509 234204 172651 118547
11162 118547 84603 76219 121647 199493 332257 271355 321607 470110 539106 429518 331970
11151 331970 306892 195531 90805 68384 -108339 -2912 149880 233236 259250 317635
11141 317635 291466 381186 491769 355569 282968 340802 317015 256432 276152 348661 505341
11130 505341 541750 520481 475146 487231 516729 278687 303633 187595 31343 50254 265382
11119 265382 294468 209838 127921 231673 229418 130579 74423 44713 161576 309249 393975
11108 393975 256363 209786 243814 304476 174843 100304 8201 -16743 201475 354627 214904
11097 214904 215682 304426 358663 402355 330320 448067 427375 214673 142906 104559 33255
11086 33255 307898 437906 372429 422474 645370 729437 556508 508829 439972 319440 216146
11075 216146 214512 114589 204594 319725 259444 128562 140935 325845 210149 333707 186082
11064 186082 -63111 -42748 99155 296389 366801 431164 403829 244703 280407 330383 112945
11053 112945 63431 162858 169917 135991 73994 119007 180760 264714 294795 329516 376881 400574
11041 400574 493643 680960 698376 695846 764837 783851 590571 487823 563338 651737 630009
11030 630009 603012 619595 655210 861430 1071113 1204626 1428488 1532111 1388935 1162794
11020 1162794 1180562 1296735 1443071 1638768 1726707 1698742 1808737 1833411 1810495 1685805
11010 1685805 1537494 1505610 1654471 1584536 1418934 1399957 1414472 1514953 1545049 1356216
11000 1356216 1379153 1255960 1029763 995228 959573 972521 906550 894917 791611 662146
10990 662146 657711 758011 866162 887772 882031 761807 605422 688245 699268 497702 392805
10979 392805 501589 415724 324823 374514 522758 577537 488780 485231 437479 421765 577833
10968 577833 609486 427739 141659 7889 117602 261623 112303 55766 -47575 -321
10958 -321 69044 78682 115927 92701 24731 -45604 -62084 -22098 40075 -67106 -119883 -18708
10946 -18708 62068 227445 179271 76361 40837 -139071 -132414 -36476 52556 178605 198985
10935 198985 60772 -38021 -45223 -95448 -35196 -155421 -153313 179605 213740 76774 125259
10924 125259 178579 64393 28233 106036 99953 -44006 -81794 -6186 121939 174095 92785
10913 92785 -196069 -341416 -215126 -68618 -131814 30066 100657 147501 140565 136879 257928
10902 257928 265051 234373 217031 270928 211552 107860 7989 -34612 -89925 37938 47102
10891 47102 -11783 12839 131512 144535 100662 76881 -495 -105762 -73443 -120916 -22368
10880 -22368 135786 255955 174760 -5583 4165 175004 332937 271982 98637 -11679
10870 -11679 144119 229944 99 -233768 -254039 -226724 -259086 -207576 -136192 -76170 111430
10859 111430 65343 -19327 -162642 -82190 28003 19065 -71521 -39724 -126737 -188156 -61795
10848 -61795 -179952 -178372 -181401 -300622 -295102 -231569 -70932 -2509 -31356 -15927 -202674
10837 -202674 -207128 -131827 -25806 -40492 28385 126018 132192 -31257 -17393 -15511 91557
10826 91557 154980 172456 34741 91764 93699 96805 -8848 54391 101491 139584 184680 82043
10814 82043 -172726 -149343 -196735 -542840 -630468 -546585 -123401 -70316 -485073 -348194 -337562
10803 -337562 -381172 -311674 -341361 -412186 -359150 -395959 -354470 -348641 -468196 -412042 -438651
10792 -438651 -485231 -405710 -183033 -114640 -97421 -268026 -361254 -300238 -220584 -56220 -62553
10781 -62553 -194947 -128519 -91792 -192996 -57555 -18000 -86221 -45089 11246 45875 -119
10770 -119 -34210 39655 115343 275004 225400 34518 59184 197818 270693 180406 136537
10759 136537 61228 85160 108570 99610 283945 383775 486743 625257 575357 566426 733160
10748 733160 615163 596298 347914 386752 397667 375409 350500 473542 582163 650400 646003
10737 646003 673799 750567 703198 797358 824172 807695 899578 920482 961804 977676 1149078
10726 1149078 1300071 1266589 1294202 1319235 1621690 1751070 1960508 2038801 2000526 1938673
10716 1938673 2025868 2201816 2279774 2403323 2537165 2378785 2401541 2300999 2374085 2365120
10706 2365120 2322527 2250641 2370428 2275448 2206689 2081496 2082648 2177294 2262245 2357501 2319542
10695 2319542 2105638 2035548 2024565 1959190 1894912 1938290 2074607 2180080 2231273 2067543
10685 2067543 1873144 1864890 1884896 1836448 1869075 1881130 1800014 1640873 1438971 1326822 1229330
10674 1229330 1306071 1257294 1175577 1325464 1591728 1593533 1511807 1433643 1418906 1387764 1181232
10663 1181232 1131084 1137776 1307258 1283854 1372124 1363739 1369501 1340868 1234440 1196754 1174624
10652 1174624 1258182 1476771 1617968 1585518 1664867 1858027 2021248 2153493 2304484 2436662
10642 2436662 2495883 2509692 2524327 2369952 2292580 2168692 2007791 1926771 2100963 2341083
10632 2341083 2563766 3008264 3643792 4145635 4636550 5425697 6637451 7568811 8221419
10623 8221419 8946389 9481941 9952162 10569294 11425804 12784118 14942217 17927018 21740482
10614 21740482 26962929 33888485 42547919 52985412 64545921 75800362 85501880 93309323
10606 93309323 98965260 101784313 102730793 103779923 107054220 114269211 126701538 144319750
10598 144319750 164927545 184711825 200768799 212199716 217585701 215840306 208939169
10591 208939169 201062657 197267679 200955350 213677514 234671591 259517762 282043509
10584 282043509 298194281 306346805 304622556 291756832 271008001 248782654 230618088
10577 230618088 220150297 218589693 224122662 233022882 240656908 244381920 243010555 235028338
10569 235028338 220016414 200262184 180413766 163836845 152320930 145662676 143050502
10562 143050502 142526709 141824371 139461729 134763211 127175898 116981505 105100230 93123577
10554 93123577 82224075 72892541 65554479 59966137 55394241 51704742 48875517 46210192
10546 46210192 43904290 42018799 40241680 38637499 37274105 35836360 34584996 33387733
10538 33387733 32231077 31256142 30374185 29490789 28447916 27679418 27001552 26196949 25483406
10529 25483406 25022356 24427341 23736455 23041692 22542948 22006849 21644606 21199168 20712749
10520 20712749 20241919 19748044 19225256 18818526 18464201 18029319 17512026 17110663 16806397
10511 16806397 16257124 15732873 15334134 15096800 14745934 14271528 13949029 13650383 13387224
10502 13387224 13181270 12905038 12620977 12387323 12102637 11611833 11308060 11212368 11120198 11105974
10492 11105974 11057331 10953251 10641917 10195111 9887856 9723779 9751187 9844719 9627172 9158155
10482 9158155 9157442 9211822 9181787 9109844 9020972 8981305 9033529 8989630 9022230 8927955 8872740 8833041
10470 8833041 8804681 8712598 8457083 8372230 8355725 8399373 8539329 8595861 8579781 8679768 8430042
10459 8430042 8207673 8184823 8236326 8293272 8236962 8155966 8139236 8032701 8058154 7929738 7704015
10448 7704015 7602525 7568784 7244163 7103527 7035414 6879155 6670377 6470628 6493218 6477916
10438 6477916 6433214 6394677 6293112 6060306 5797945 5571799 5358455 5261071 5149236 5129490
10428 5129490 5095125 5043093 4721759 4605435 4667347 4469973 4297766 4225947 4188209 4139087
10418 4139087 4002069 3843206 3751510 3720598 3809949 3817051 3865778 3768380 3472309 3294113 3164123
10407 3164123 3165305 3199647 3175610 3088100 3087008 3015907 2979734 2899533 2715254 2365360 2284579
10396 2284579 2516095 2748001 2812016 2777894 2779436 2625468 2560241 2549005 2527579 2377827 2351052
10385 2351052 2446725 2423151 2329089 2407421 2454548 2484931 2509036 2497869 2567848 2515998 2560470
10374 2560470 2565616 2435556 2480600 2602432 2444431 2274863 2206540 2006629 1934867 1996971
10364 1996971 2003186 2246840 2409741 2264036 2059949 2057223 2108655 2044168 1992510 1973466 1877286
10353 1877286 1894641 1873084 1880660 2041200 2071318 1929318 2025798 2096722 1931378 1808382 1687231
10342 1687231 1698086 1696387 1757115 1836619 1765522 1787269 1869367 1903186 1817502 1668322 1718973
10331 1718973 1769860 1790190 1742499 1591979 1574058 1614098 1732942 1738085 1732483 1563692 1594623
10320 1594623 1609162 1475684 1415856 1558516 1503510 1424065 1367118 1337382 1431750 1650045 1695711
10309 1695711 1388357 1188425 1222914 1081370 1010705 1014959 1067712 1266387 1179622 1046148
10299 1046148 1072490 1006608 1026587 975025 806557 833296 976752 1111711 920897 848270
10289 848270 975459 1112629 1028080 772340 525004 506080 609039 688558 884426 938302
10279 938302 979782 946798 904669 717145 653475 764156 890919 952722 950293 665928 593276
10268 593276 635416 674763 726428 820535 881543 952209 848783 821247 858940 677407 610149
10257 610149 560887 654277 613815 513458 484127 479984 555108 721955 786323 736835 822227
10246 822227 791881 605663 580667 558834 418283 457683 435259 331610 436168 577347
10236 577347 521585 480590 576047 671118 681806 592844 481898 477348 586160 555712 507116
10225 507116 542880 780971 716395 791458 634045 463666 453081 514501 499454 563607 626366
10214 626366 643831 530120 574526 628849 637875 514301 369194 210384 300645 351956 459839
10203 459839 471696 501953 352865 298356 274839 338755 551018 686226 681481 659061 641405
10192 641405 466895 426811 459448 408462 397584 272093 390672 507559 407166 395793
10182 395793 344411 335065 499748 612693 493793 528035 698523 864771 924231 956854 908165
10171 908165 828766 902217 1028525 1018707 970119 1087553 1187976 1240931 1250869 1182194 1143333
10160 1143333 1346760 1568538 1565612 1444908 1379430 1303448 1001571 1136132 1578823 1736337
10150 1736337 1726863 1845030 1951556 2119300 2080405 1978598 1850352 1892656 1891245 1755272
10140 1755272 1568594 1616489 1614539 1573184 1554012 1584952 1601233 1593485 1602098 1411181 1150305
10129 1150305 1141887 1233915 1232738 1261865 1189368 1068695 1016938 1005578 836312 620176 522638
10118 522638 485604 467841 577814 696317 710148 663135 581841 445595 407545 388070 557260
10107 557260 651867 674587 629248 400449 510407 769191 913333 840147 653329 521782
10097 521782 433268 308636 257555 282231 283643 405033 461959 444412 286444 374059 394142
10086 394142 478694 553915 510491 275095 127535 254504 261691 267420 329946 336236 451206
10075 451206 445710 336738 328972 288875 514449 582512 488433 400851 308729 333938 258559
10064 258559 313485 278212 129184 71215 246536 394760 502572 498262 526795 422358 388422
10053 388422 551532 529385 425878 394649 323760 329409 326141 267044 281673 431872 404119
10042 404119 384152 371383 381494 348449 318765 313757 173432 165361 39963 61376 140710
10031 140710 63854 213046 108295 86625 57938 53927 259876 268322 242206 316232 307097
10020 307097 81759 145338 174350 9359 589 7703 126969 132101 102172 125725 -4861
10009 -4861 -115958 -35929 175266 261491 326223 424204 314091 275888 256222 144842 -4038
9998 -4038 50377 115469 181911 230511 357328 369977 320049 295152 159936 126057 278849
9987 278849 313170 259458 161413 5840 275991 370437 293463 302882 437694 363303 187503
9976 187503 130641 81559 40282 177256 239467 215746 281941 310532 303930 231168 214910 190681
9964 190681 87640 124237 237960 285147 97413 231745 294131 258726 192608 115290 133963
9953 133963 -65371 41471 329348 182332 156543 172658 327202 500913 501061 326395 307260
9942 307260 308327 297577 142365 64763 44998 51256 285711 457956 427838 320407 279083
9931 279083 353445 334226 257331 285629 291383 289572 368365 392985 376152 363758 343954 267160
9919 267160 212535 169684 128115 147182 237516 209812 66377 97451 33865 125143 209203
9908 209203 183799 199477 210628 287798 212086 248245 349187 407139 260053 132002 4220
9897 4220 21629 31490 89610 260141 164199 251867 227117 322430 213357 239355 393002 177617
9885 177617 5145 48378 166113 152048 61531 -47919 -275622 -123691 78648 82912 -81685
9874 -81685 -260208 -228314 -89853 64622 138075 184598 305846 296729 184741 131381 278252
9863 278252 405882 506570 370599 133050 107517 230045 292894 190488 201367 439786
9853 439786 526632 449906 415580 563287 683170 737300 629406 606511 405977 248274 319589
9842 319589 271461 351847 490712 417620 350628 295713 180618 96763 129878 225970 318675
9831 318675 370037 319356 422799 521704 498787 392119 445818 379680 204380 114089 168783
9820 168783 210664 145585 54310 -17035 123724 217045 241055 273065 230277 288020 182497
9809 182497 208988 262120 241204 262056 241804 456014 304259 61473 131692 133371 56386
9798 56386 55315 76023 93031 -125653 -157163 -112200 16719 126816 181140 238512 238560 188748
9786 188748 27918 13433 23799 192635 414648 201478 92724 202592 221087 147913
9776 147913 76846 81184 63811 -11829 60178 27619 -227092 -252483 -57757 -183719 -46490
9765 -46490 190073 184182 275144 404402 462346 371406 307230 161692 158865 81728 35479 2546
9753 2546 -147124 11074 150860 169632 21087 -58100 5817 68783 105525 45622 152567
9742 152567 260192 268111 313742 224424 267843 422763 411508 275383 251951 119989 159104
9731 159104 273612 244491 341095 421135 209702 149888 -4837 7186 47484 8584 103531
9720 103531 176994 216470 121019 85210 90226 42411 128136 311881 318182 403630 450667 294145
9708 294145 264926 308586 312692 291679 333853 337340 222418 100797 -89634 -69625 43990
9697 43990 29501 286538 438638 488328 393525 358087 390174 273510 214258 103166 229066
9686 229066 442342 330885 123475 85680 101437 45934 53504 -68072 -53825 -27742 -15570
9675 -15570 111984 -34644 -109959 -155337 70787 98532 25584 11721 166017 226444 223854
9664 223854 203077 179262 161799 428907 403639 289571 103996 15534 115628 228682 293594
9653 293594 326913 185542 300799 252208 349425 489351 551906 749687 799809 656584 636594
9642 636594 583930 457561 303489 190120 113410 282750 289874 128792 39188 143615 105241
9631 105241 156364 236355 235296 325784 245718 207607 243294 180670 144235 158512 199956 178344
9619 178344 174671 216463 275386 218970 215109 40737 -135816 -111202 -47738 39330 112093 131880
9607 131880 -3977 60639 186591 230123 349774 405866 178876 -47056 -13366 97788
9597 97788 -22474 31208 103738 56860 141692 183965 343185 337464 159929 157221 313284
9586 313284 260803 168680 180599 280164 265121 -2345 -136008 -158682 50818 149407 49026
9575 49026 130857 88501 7115 15541 125742 172308 -73998 -14774 178806 213216 138481
9564 138481 102708 30683 -39557 5833 -69351 -76681 12607 204208 268556 329973 389936 361399
9552 361399 309700 452055 363301 94943 -14491 94143 249888 269800 200818 121656 256861
9541 256861 288287 288149 249844 218340 288946 462224 333064 322051 375842 407412 379757 132515
9529 132515 49600 198103 216468 -30468 -226856 -208992 -143396 134824 248065 358761
9519 358761 184622 -39019 26919 169392 154294 92163 222288 239551 267234 334988 318704
9508 318704 134338 170780 100527 134644 128356 91022 99317 70822 193863 162028 179997 205289
9496 205289 65250 -94013 -39519 179699 147506 166039 337901 144408 -204420 -167826
9486 -167826 -140156 -168329 12704 160464 164988 52787 -76282 78764 191037 145471 -2446
9475 -2446 -91864 -64978 -95072 45415 -4729 -65646 -50683 58652 137506 116739 -91842
9464 -91842 -64010 12752 83777 193984 138826 187699 99561 -39642 -49982 -124620 -149389
9453 -149389 -143780 -72570 -31675 21305 109474 90153 93774 37181 56224 16014 -106029 -26031
9441 -26031 42340 209529 368939 321712 315677 416107 374820 207179 159091 -14418 -89316
9430 -89316 -153934 -193892 -14137 -67573 -952 13808 41169 204187 311500 281498 75265
9419 75265 -111302 -143909 122779 186375 167609 216397 260531 251661 56822 5701 -105750
9408 -105750 66357 277489 157543 43045 -116990 -199364 -160261 -77929 -32227 -32007 86416
9397 86416 149385 7156 -43784 -119791 32297 154926 96818 68219 122847 59329 -117606
9386 -117606 -351452 -229071 -5686 -45205 38721 24138 87937 17040 -42195 -64347 -41021
9375 -41021 65926 236572 102420 110680 141220 89204 168962 226949 231830 392310 294760
9364 294760 114662 76806 -18327 -47216 32186 185867 128258 -32991 -113535 -101696 17600
9353 17600 65317 99291 129160 144308 4154 -98650 -116519 -98739 -54824 121769 51227
9342 51227 -162505 -234872 -74976 -45179 -38889 -37012 73206 187278 40733 -67033 -151030
9331 -151030 -144808 -88978 -45095 50470 228109 339442 304803 199609 269595 386095 221111
9320 221111 117332 133219 216127 123222 27260 73717 5518 -11255 39768 194456 178968
9309 178968 171647 66424 -8275 286088 474712 407733 274057 177984 196261 109442 -127349
9298 -127349 -48335 170282 150384 220615 410057 493769 368994 336877 237582 201534 253945
9287 253945 292348 335532 259339 162363 167001 11532 58775 152423 267478 310179 241771
9276 241771 225589 72146 23824 102447 -52768 -120887 30593 391947 302437 174989 217430
9265 217430 209072 246192 304586 424078 333357 151176 85894 36936 83093 98015 -55886
9254 -55886 -106620 80818 345157 329791 183720 101134 41232 63546 46020 -34019 -107252
9243 -107252 -216383 -379592 -367289 -254085 -1734 174827 84225 181905 191651 109111 -64793
9232 -64793 -10677 -42184 -130196 -153548 -213785 -184058 -23492 176007 190266 294822 275263
9221 275263 95418 111444 88642 180277 209107 238420 375120 462266 307839 153589 50926
9210 50926 -13916 -53420 -62879 -4363 -1501 73221 -40237 -80453 -165513 -255241 -274656 -356281
9198 -356281 -231888 -198075 -51097 -29908 27893 85090 75581 145846 23099 -100247 -69859
9187 -69859 -73177 186784 332190 217122 240857 82246 178698 103254 -39199 -163233 -168820
9176 -168820 44806 287687 410430 173012 123831 62126 129366 262974 45838 -122029
9166 -122029 21435 -3699 -42733 -58601 -99291 -99085 -5252 17283 -41375 -76966 -41675 32278
9154 32278 110958 110794 -131152 -141868 -27574 -46568 -8301 44310 84301 95307 -68282 -113032
9142 -113032 -12825 43694 94423 131515 -43751 -172050 -277945 -198269 9719 131565
9132 131565 -46501 -252928 -223802 -200718 -210020 -62117 82745 152196 212655 75575 282761
9121 282761 296883 133514 -28295 -136745 -49001 -105598 -187036 -166676 65029 214816 290445
9110 290445 363217 243671 159200 182469 118867 -138341 -250267 -47435 -12065 -110897 -229839
9099 -229839 -283500 -233841 -66526 121267 75429 9730 30011 -13240 9808 10898 223487
9088 223487 79358 97257 58657 -74040 -71885 104568 228070 183847 251743 237935 60795
9077 60795 52221 71881 55877 22593 -46336 69752 302078 187386 41648 94784 1211
9066 1211 -103597 -175238 -123495 -60801 21258 67256 59586 32231 -159217 -237156 -149064 35008
9054 35008 527 -268289 -350410 -365699 -257289 -366447 -371177 -217632 -20851 55800 43657
9043 43657 85856 177465 218338 20080 27411 112076 120164 177488 95250 129826 241575 233006
9031 233006 120395 94039 90135 -14567 -55391 -57107 -55269 93339 40718 126911 53000 78797
9019 78797 35873 140332 285081 276390 187659 99713 97259 108497 118970 129845 -82586 -47138
9007 -47138 -15937 118979 260906 160430 143998 150967 139429 -31745 -105733 -106075 -44957 610
8995 610 15016 10944 -109546 109765 215998 297377 259924 -104835 -108046 -47644 25645 -98630
8983 -98630 -147013 -85805 -84750 -48489 139183 122525 -67226 -49548 88827 291305 384614
8972 384614 206344 201198 106993 -35616 -321391 -294208 -204335 -273523 -296787 -251795 -299562
8961 -299562 -183702 -156899 -48813 -119608 -269133 -196791 -109806 -139550 -80439 -83401 -105246
8950 -105246 32720 -222 -264403 -214994 -141241 -36613 36352 -8400 -95067 -127794 -170156
8939 -170156 -65182 -92776 -5273 156164 282054 138904 2302 -30332 1907 -10448 -64528
8928 -64528 -165197 -119498 -59996 -115089 -67018 -215110 -322027 -99312 -76972 9148 94652
8917 94652 -16685 -150857 -169330 -150534 -2857 -12919 31241 -160418 -188458 -80454 -25684
8906 -25684 24365 -76557 -115517 -111135 -118936 -76467 -40704 -133196 -82735 -47086 -65565 21841
8894 21841 53941 148355 141301 20030 58500 98062 76650 119603 29195 41828 29325 43940
8882 43940 143342 198110 39948 4472 113340 91755 34652 61672 -47193 -366342 -421633
8871 -421633 -461889 -501989 -356032 -336674 -166125 -89933 -58051 62870 52829 17289 -82174
8860 -82174 -166557 -73739 -34650 69519 271344 313840 121875 -13956 114308 79631 272785
8849 272785 346155 212011 105216 -10272 -186816 -92615 7209 -20225 -109867 -65227 -48980
8838 -48980 10386 -8591 -108712 -305592 -340863 -250898 -80613 60444 150057 136660 -102469
8827 -102469 -25485 203178 244136 160846 74893 106759 300971 243185 115384 202008 308878
8816 308878 185551 152640 292057 207718 126655 56779 -5587 -370 -50955 -72678 53853
8805 53853 129974 6518 9574 88999 329514 430040 214103 127440 124420 124052 94478 10831
8793 10831 50167 72058 -72163 -107511 -221237 -130970 188721 310180 175375 -67680 -325035
8782 -325035 -196672 -116668 -44022 -65985 -194265 -80454 65926 -24620 -11067 13206 -66822
8771 -66822 -35784 53604 -18037 114722 213608 259488 148852 178638 114171 167975 166352 95118
8759 95118 -29461 43859 329202 329915 74544 -128735 -114144 -21370 107326 153797 -54631
8748 -54631 30304 -59901 -122192 -33580 18587 48823 34719 148696 238509 278111 220024 46765
8736 46765 -80123 -5903 53211 -131198 -316330 -347682 -186576 -19036 122252 159775 271593
8725 271593 298968 315654 242491 130326 107582 49335 54210 136596 12387 55449 136886
8714 136886 158610 130583 -30264 -16606 61993 -68588 92053 115938 109994 199383 141938
8703 141938 23813 50613 7102 72927 127680 287399 463577 280956 -4739 -26241 21078
8692 21078 22928 144239 132669 -101422 -128943 -115006 -87427 180603 199999 107873 46732
8681 46732 -67410 -70245 25724 -202630 -186205 -53329 1033 119968 146113 -31344 -63285
8670 -63285 59948 147195 160594 294954 281249 232097 165959 172868 159066 68415 14883 89377
8658 89377 165919 175870 95360 -10653 13375 107434 228057 108791 -147830 -325746 -179266
8647 -179266 -154284 -142230 -228566 -301014 -462492 -454823 -169501 7245 45311 -5608 -190575
8636 -190575 -140442 21567 -31329 -165892 -215860 -248920 -321338 -375530 -392359 -221177 84256
8625 84256 -27012 -157539 -3129 51535 46771 211240 167657 -58691 -202323 -146115 -191107
8614 -191107 -134574 -7028 69571 -13063 -10628 -161087 -291057 -236724 -59179 -61611 34421
8603 34421 -1765 -109651 -78484 -22421 90099 100340 135778 248130 337975 411594 127789
8592 127789 101347 -14109 3407 -66237 25104 137901 102589 36781 4395 172324 199259
8581 199259 -62956 -268991 -223205 -157204 84664 38568 -121356 -148628 -117689 17349 95886
8570 95886 12569 32765 -38056 -68674 -178778 -118628 39185 -53817 171926 250614 151241
8559 151241 111363 140459 -6718 -56705 -115839 -86185 95536 126874 95034 58037 -103251
8548 -103251 -64398 103554 140111 143990 138620 10250 95242 239928 360382 303763 136069
8537 136069 41154 26778 4479 81754 173990 121120 97610 234591 259230 119296 71277
8526 71277 -41379 -87456 53636 110588 108603 54021 -117794 -267367 -96673 52708 29322
8515 29322 243405 190244 174099 177964 43400 228970 437161 278769 276677 181263 9895
8504 9895 66227 45863 171748 307918 189678 135406 79200 -67784 -82252 -126427 -124301
8493 -124301 -102933 -192567 -100206 3835 -22411 8241 -7801 -85898 -160654 -213574 -237489
8482 -237489 -90902 -82452 -76038 -37734 155758 145175 213699 230836 1658 -8835 -34794
8471 -34794 30552 87818 -61082 -20502 178 49465 214676 280088 249574 307274 211372
8460 211372 82647 122207 274082 150839 -7572 -43228 43800 75953 81794 63210 198718
8449 198718 172948 121300 12418 -28524 -13349 -54953 -33827 40737 -85524 -3861 72701
8438 72701 163045 25561 25789 -73885 47379 -17065 -77165 795 95678 18732 31973 36320
8426 36320 -243161 -436235 -294633 -207119 -27912 -27365 -145228 -293920 -223658 -242254 -359402
8415 -359402 -210611 -20731 242113 271651 75767 -51062 -17052 -22399 3574 40337 -31102
8404 -31102 -73008 -114751 56708 102298 -172707 -202455 -7822 -44228 -207305 -155143 119854
8393 119854 313027 262437 280051 287677 235651 239270 89607 151529 330109 420767 401876
8382 401876 302498 201762 164068 115983 31281 -45066 -30425 97515 62117 11913 -99136
8371 -99136 -173169 -102261 -52345 -54555 -208126 -96866 -222025 -303859 -178708 53247 94499
8360 94499 -79458 -190834 -83524 57851 93329 54911 6424 75441 -72651 -52094 100064
8349 100064 101842 134592 454 -3765 103675 286112 118473 39084 229264 297266 201864
8338 201864 117089 -21832 -121384 -39895 16017 54217 86466 114090 -4768 5996 -12212
8327 -12212 -62922 79153 89012 109433 201768 197281 75403 78951 249740 386135 200407
8316 200407 -78364 -141006 -53544 -156785 -208556 -5003 27263 -111082 -227389 -131702 -109565
8305 -109565 -244625 -187844 14148 -53527 21518 -30131 -178341 -2267 281783 395429
8295 395429 168544 21650 2905 -30026 -69360 -44383 193245 170154 108019 96112 49444
8284 49444 -47634 51392 126606 63418 -19274 -25434 -58549 -65428 -33941 -101928 -281221 -233851
8272 -233851 -107514 13860 -68150 -274981 -281715 -189136 -79864 68148 50290 -12633 -16960
8261 -16960 -136998 -159144 -114479 -24482 161866 65866 -10919 -157417 -218393 -164594 -52269
8250 -52269 53278 -122920 -341231 -268892 -105917 -62367 -177596 -86648 31252 61477 20909
8239 20909 76076 145456 129812 85158 -71509 -105492 -17888 156022 18999 -103489 -133529
8228 -133529 -162647 34992 82726 -67402 -96798 -164772 -179655 -43038 -43560 42246 226102
8217 226102 -19726 -244106 -38037 -2672 67867 3943 105137 143003 94906 33466 5038
8206 5038 -121123 55232 155829 -10283 -109562 -55532 63701 -52157 -164844 -210361 -144371
8195 -144371 -155138 -154756 -76428 -50884 -199818 -189733 18865 111911 118096 139480 141294 199343
8183 199343 160182 144679 18491 -66225 -203226 -240835 -304665 -195819 -10174 -45151 -29832
8172 -29832 -27144 -56425 807 47902 -8803 -89488 -107572 -25664 -37141 -26689 32085 51355
8160 51355 -26593 -202983 -191601 -123647 -53967 -85341 -241815 -337123 -262067 -154572 -146439
8149 -146439 -143338 -92915 -37149 -107451 -104180 49238 87435 -4461 -90068 -18884 36652 -50223
8137 -50223 -111965 -103447 -85786 -227123 -186300 -109250 -90148 14490 106223 44366 162268
8126 162268 161270 215678 -11285 -95269 94918 114435 -42105 -216272 -169634 -198897 -175634
8115 -175634 -167589 -115687 -18931 163342 187554 44308 -175281 -196381 -218707 -300778 -242773
8104 -242773 -193460 -3806 103609 267947 237610 159224 268375 186927 30494 -34519 68021
8093 68021 20727 47149 159707 38478 -138548 -26090 25617 -44036 -156117 -271669 -218005
8082 -218005 -255076 -227018 -195389 -157519 7497 146130 262318 225192 240904 110605 88398
8071 88398 -41294 -50341 49423 81206 127755 210123 295245 404915 328780 201889 13790
8060 13790 -39607 23587 16273 -114753 -171951 -205570 -391755 -434520 -287644 -73918 81865
8049 81865 16169 26062 -27369 -32022 -196531 -231774 -7247 68524 -39853 18101 116126 78863
8037 78863 8419 83534 135875 76890 25649 -82972 -215349 -288496 -36666 78788 9315
8026 9315 30867 -7162 96606 34477 149755 82380 -49304 -83473 54461 246438 203928
8015 203928 203244 217054 126158 -219945 -351453 -309600 -105437 68329 95246 -22028 -142457
8004 -142457 -107745 1617 11139 -131055 -149934 -69125 -86838 30644 271637 171047 44671
7993 44671 -171377 -234155 -91280 -67659 -115153 -356863 -372805 -192465 -7227 -168921 -145109
7982 -145109 -22639 -28242 72530 108417 129717 219214 126850 -193067 -290222 -272615 -133320
7971 -133320 -17382 -123253 -156001 -192631 -157568 6277 -38913 -178622 -93275 -51783 21472
7960 21472 49315 57382 202215 118272 139829 176925 37463 239317 301018 403580 407146
7949 407146 208616 -44461 -140559 -71326 48969 159271 107688 -46908 -52926 -127932 -324
7938 -324 100879 -26204 -177253 -250461 -353495 -237871 -33690 -26820 -109741 -96971 -109190
7927 -109190 -50106 -50327 -91916 75961 -208399 -292491 -244058 -197650 -104392 125899 108731
7916 108731 51331 66210 2011 -11764 -69877 37389 28828 -15605 110525 83967 -15736
7905 -15736 34845 40795 237864 123750 -22201 -105671 22191 2847 -154285 -172816 -104485
7894 -104485 -42335 -3291 -59143 -255369 -251376 -98220 -34121 -116613 -68077 11370 -20248
7883 -20248 -111097 -184293 -144787 -92301 -35978 -17857 -67435 -92412 -160619 -279914 -307880 -218000
7871 -218000 -35196 -20838 -16027 -87237 -126085 -37916 -55637 -61375 181360 321806 306226
7860 306226 229330 151482 204152 188998 172337 186494 63970 -51324 -158507 -109694 127986
7849 127986 114817 -41492 -154511 -110706 2374 -14367 -56478 99025 24826 -19771 146510
7838 146510 259929 132909 26271 -98930 -130420 -300169 -333158 -102399 15441 187975
7828 187975 190697 8295 -106605 -74139 -17462 -187838 -194009 -108999 -135659 -160568 -100580
7817 -100580 -294902 -322792 -51175 82705 132884 126881 178711 222877 83361 -159832 -167478
7806 -167478 -235380 -379089 -388672 -271634 -121408 -199223 -248205 -147037 58012 42200 41615
7795 41615 89108 74113 -76329 -86803 80727 109628 140223 12538 -118583 -116203 -96942
7784 -96942 -200586 -209001 -206581 -24722 32905 165646 129713 145080 257944 263673 178544 286800
7772 286800 169021 -16101 -70353 -24772 103690 101020 217337 424605 464152 377631 225394
7761 225394 158564 134796 12375 -35198 137101 255220 86182 94326 210245 228218 296710
7750 296710 162519 -104227 -8535 110966 -89826 -142938 -67155 263853 252246 150413
7740 150413 105391 15991 -37947 3481 -71508 -98704 74770 -4881 -230101 -289392 -111642
7729 -111642 7927 -166746 -45386 11748 -109140 -170749 -76975 -33144 -1433 170096 70909
7718 70909 39213 81438 -48340 -205033 -296631 -186969 -162290 -32797 46553 152479 202218
7707 202218 154328 22898 680 53124 125028 221227 -31259 -179241 -211338 -71869 21869
7696 21869 -39078 83398 89318 -77766 -252375 -162006 -28695 -173881 -134716 -67927 -92429
7685 -92429 -145782 -253795 -278093 -147173 -31614 -16890 -6375 -40513 116608 281275 198983
7674 198983 149634 178770 236237 265177 309648 213368 41465 106001 270730 345470 203057
7663 203057 66783 -98000 -95425 61930 97244 23223 -8005 -124291 -46778 85878 61064
7652 61064 -59018 -151103 -107804 -83005 -32315 7701 96519 62096 -232247 -193863 -194604 -131284
7640 -131284 -42333 36475 90167 264221 212902 210906 385106 333161 298421 343293 426160
7629 426160 501222 443414 114670 44402 81107 -52993 -41326 39538 -4915 26864 134154
7618 134154 153628 331667 332263 298149 127863 51793 -80914 -260357 -300313 -169020 -89182
7607 -89182 -102408 -242553 -243279 -264561 -317618 -189990 -13824 27980 -45386 -40172 -175101 -218771
7595 -218771 -107314 -107966 -164794 -190065 -7014 -22424 -53388 -33022 -34101 10965 -57267 -179470
7583 -179470 -127694 -138539 -112482 -152053 -231595 -231411 -44403 138564 237226 5489 -123687
7572 -123687 -36123 20097 -14592 83328 158962 148807 171066 25464 48892 193265 250412
7561 250412 129170 253971 310020 284897 164994 84 -200022 -173829 -64754 57773
7551 57773 248570 209663 -7783 -41628 20694 -60205 -212992 -216536 -47616 82726 107046
7540 107046 -16254 -17980 -27750 80905 -41749 -140436 -89251 -117113 -176570 -331382 -129866
7529 -129866 -112515 -201838 -107002 -73376 -74898 -97260 -60896 -116592 -158975 -190423 -310250 -398409
7517 -398409 -318454 -239791 -290442 -308563 -205744 -81753 6363 115527 27697 448 121985
7506 121985 100529 -16148 -83299 -49831 -73414 -223018 -283903 -225544 13900 113261 118891
7495 118891 188051 191205 184515 157090 -73458 -130838 -89742 -76625 -271657 -348328 -307837 -256106
7483 -256106 -159884 -171903 -55375 97528 185771 257159 404911 421731 333410 84953 -66678
7472 -66678 -178293 -371510 -373471 -239652 -73000 -47366 50123 161712 174807 65276 114609
7461 114609 253448 198207 100885 -19604 -102665 -123772 -23171 -14413 -32378 100687 -24822
7450 -24822 -145641 -143139 -193161 -154519 -189912 -126671 -113028 -143106 -144243 -193661 -129382 -10935
7438 -10935 -26479 -65633 -165692 -469706 -432565 -227028 -58575 -136086 -345569 -335324 -319300
7427 -319300 -207917 -249079 -254944 -219589 -125171 -113392 -230259 -166718 -279921 -309384 -242740
7416 -242740 -212290 -29558 3164 -120664 -42991 69167 99005 88829 122728 -162156 -312623
7405 -312623 -207745 -70763 31295 167868 156011 148678 169051 157004 153975 137636 170827
7394 170827 239248 230889 117894 27327 79275 101953 29758 128913 218341 306124 180976
7383 180976 200958 80112 10565 -37468 -53745 -135022 -25814 111425 136575 194046 199839
7372 199839 89743 -44328 -30881 82123 59124 -97517 -171312 -201354 -110252 -159629 -131209
7361 -131209 -61628 -51756 -80278 -46466 -148484 -90691 17608 -40971 -42540 68350 183402
7350 183402 -2819 -154196 -78859 -102830 71771 189090 40856 93665 42727 -68893
7340 -68893 -95466 -70854 -144687 -18447 184276 102184 9314 2583 145348 102169 167168
7329 167168 152886 95492 88588 -31097 -210133 -200901 -71004 71212 196125 211168 188164
7318 188164 38155 -83607 -277949 -191162 -62492 -42244 54609 166055 140740 25148
7308 25148 -122935 -103922 157304 286640 214376 4340 -45198 -101340 -72418 208762 215886
7297 215886 33170 -17232 23661 125529 65098 24291 86185 64222 -55282 -67247 -224196
7286 -224196 -185040 -51620 46460 38910 -10404 103292 218966 160180 70702 -78702 -113069
7275 -113069 9469 125713 77192 103240 128332 69457 160164 210415 98358 -44001 -157650
7264 -157650 -60033 111420 145912 -31268 -341156 -586552 -421382 -331017 -131846 -39715
7254 -39715 -41324 -174204 -92434 -185049 -110057 -123955 -39323 103987 321251 341670 116621
7243 116621 -83592 -191169 -186119 -27597 88876 143370 48373 -14636 -268475 -358189 -124073
7232 -124073 8900 236608 249913 152960 92430 116297 40066 63179 -937 -158713 -23578
7221 -23578 -27185 -91483 -241209 -275508 -237458 -448022 -514433 -477419 -376381 -213366 -190591
7210 -190591 -215122 -197874 -235230 -277996 -91876 -114886 -203315 -186371 -94401 -64542 -106347
7199 -106347 14291 146562 223416 111036 -47464 -2127 -22708 -59331 -162550 -315689
7189 -315689 -34995 88104 107738 163006 48207 -3718 26857 246059 196275 35126 79888
7178 79888 43589 106892 131161 172867 202997 139346 160797 331383 270044 284591 321841 375018
7166 375018 341486 379551 393110 182741 -38079 -54177 -32763 -2005 28505 16275 75542
7155 75542 -27164 -44335 -106410 -49405 40274 111886 86569 11560 9422 -33033 -110917 -29819
7143 -29819 57009 90056 172640 230983 152140 -1514 -65517 -162172 -213789 28329 125484
7132 125484 126001 194306 179123 15416 -14965 80224 -60386 -164934 -167765 -60880 44042
7121 44042 66389 -5836 -47666 60542 65030 -83553 -188107 -85299 6702 44019 -171765
7110 -171765 -287398 -352108 -229275 -210528 -198112 -358423 -194423 -99313 -182304 -415655 -405183
7099 -405183 -211023 -126207 -164809 -186189 -283137 -346007 -204326 911 12782 -131370 -207892
7088 -207892 -268137 -291338 -286481 -292716 -203774 -31304 135143 72450 -91924 -158870 -135722
7077 -135722 -34886 79661 -5314 -158524 -302372 -383361 -444005 -371887 -231576 -289233 -341543
7066 -341543 -171661 -236544 -25871 115432 156292 103014 48289 115657 119504 135534 51174
7055 51174 14950 67829 6819 -15279 -32190 -12052 -46376 -68160 -51058 -27975 215629 135112
7043 135112 49450 156431 173622 14919 -215738 -366580 -249518 -45910 -96186 -87566 -54305
7032 -54305 95071 228212 -11239 -250775 -112459 -10868 1054 119979 -34943 -113595
7022 -113595 3728 2055 -137141 -108836 -4836 59563 58190 58162 6361 58702 156931 109132
7010 109132 -13509 -5788 92316 -89461 -175267 -254635 -126062 135013 165119 43612 46907
6999 46907 168788 145533 78014 9060 83640 -141413 -242494 -188241 -187826 -102380 -14128 -46976
6987 -46976 -191676 -200128 65973 86949 -80610 -157344 -170468 -203134 -251058 -239997 -223992
6976 -223992 -259831 -227032 -176856 -132948 -161102 -16229 152293 -87906 -240220 -104739 3581
6965 3581 143959 78130 194161 185175 243587 214199 -35920 31449 -20419 46226 53526 139682
6953 139682 116852 92156 30598 9396 -57725 -118268 -123901 -198688 -90713 -25144 116017
6942 116017 -21334 -127055 -97896 -358477 -312404 -75690 153041 150257 168768 45994 -75811
6931 -75811 -61128 -32904 -27494 -38363 -29459 -64023 -40754 -43634 -29145 -6405 -147745 -110756
6919 -110756 76966 50449 9888 -93130 -195966 -107631 -133638 -168666 -100639 -329914 -477038
6908 -477038 -383914 -324327 -319886 -325697 -263150 -208938 -20647 41018 17934 -71603 -207545 -175486
6896 -175486 -125245 -98764 -103560 -111983 -191241 -284948 -299272 -307457 -357139 -213189 -49378 71874
6884 71874 341255 354326 377034 269973 184729 153371 130408 76198 166573 157123 186197 119163
6872 119163 41609 44613 84138 164970 99758 4952 -71602 -225871 -228325 -217890 -108154 -43486
6860 -43486 -16147 58856 95796 298132 249516 142732 59622 90519 194346 245627 -7734
6849 -7734 -204786 -58363 98149 125425 27059 129914 80948 2520 -63473 -123681 96412
6838 96412 150176 71242 -84591 -59156 -148046 -62892 -100570 -177085 -36695 -1649 -153102
6827 -153102 -185655 -169809 -172208 30743 6355 188888 309361 141760 -23371 -47020 94599
6816 94599 160530 -19638 79063 12863 20675 -38821 -96134 -94293 -112542 -156031 -71148 20945
6804 20945 163834 116693 -93815 -42668 -134628 -173529 -76624 89011 122903 -63268 -62197
6793 -62197 -18505 -36451 72699 194699 96337 -1108 -125512 -125431 13417 66369 -41590
6782 -41590 -125010 -151160 -47381 -91166 -183497 -79963 -96666 85767 184163 -30315 -147589
6771 -147589 113191 194022 236007 77346 -89642 -124976 -48704 -22015 -5893 150952 31556
6760 31556 -91165 -62523 144233 232793 73706 143723 230959 45117 -27038 -195762 -158262
6749 -158262 -13871 96341 111726 178662 183519 81138 166962 158254 172377 92294 253977
6738 253977 211701 88942 111254 113573 -32607 60083 188464 208484 194388 319780 451776
6727 451776 255054 135909 17990 27694 275958 394136 250131 94308 102611 119908 131755
6716 131755 181310 125129 249010 318206 284787 185218 100357 178160 83954 9740 140181
6705 140181 313578 286745 435755 325521 118542 182453 127644 92161 233034 156901 102422
6694 102422 88804 46056 -6862 2761 -44209 -83431 -77973 -10416 -90761 -77875 -41182 -141756
6682 -141756 -75170 105134 366454 153888 121331 105586 198795 226208 305531 241384 99149
6671 99149 128666 279714 404109 211786 57727 73757 -18270 -6495 -116514 -232663 -279900
6660 -279900 -361888 -490597 -329615 -111249 39942 -45869 -61205 98886 250403 228120
6650 228120 -67634 -74992 -55694 157771 75224 53683 137833 249144 199476 19868 -120289
6639 -120289 -52229 66231 -53259 -100951 -59698 64715 130192 133021 198640 167398 208101
6628 208101 218841 103940 19593 -150350 -215738 -92462 -57522 -180360 -163894 -64141 -30155
6617 -30155 -33581 -17466 31490 1919 -87396 -162469 32907 -74346 -257340 -43183 197271
6606 197271 159397 159819 327257 366406 169134 7445 -23856 68853 58339 123124 114928 60550
6594 60550 25132 87300 108597 -114087 -202823 -309250 -347806 -247098 -196158 -287616 -345793
6583 -345793 -207050 40097 -42571 -255565 -380498 -232499 21951 80779 162501 162815 110684
6572 110684 41276 -103402 -20150 -7628 15953 46179 -28236 -32559 -175663 -122015 30079
6561 30079 1039 -141145 -126705 -255025 -433110 -500654 -536704 -451034 -329837 -218240 -248251
6550 -248251 -425437 -479120 -447135 -314745 -284051 -332854 -164713 35823 990 -67647 50793
6539 50793 -61792 -295241 -270418 -94935 49642 -3064 48018 20702 -70232 -107955 -32128
6528 -32128 -100430 -188031 -411513 -252144 -121744 -77956 -95948 -77998 80603 130197 156250
6517 156250 181727 309849 176699 -18976 -113918 -19180 -847 54014 9960 -54648 56470
6506 56470 82152 227376 58698 -7097 -81444 -173978 -197200 -282599 -167189 -110948 -65179
6495 -65179 -139911 -104669 -136926 -226135 -136652 -160086 -60569 -15485 -38725 -251236 -357519
6484 -357519 -237405 -225960 -302347 -407339 -505344 -568761 -514043 -575378 -555862 -429388 -358268
6473 -358268 -237124 -155102 -122124 -34336 -38305 219307 215994 164383 39236 -80939 -178967
6462 -178967 -176475 -14798 90637 -64093 -248849 -220738 -246454 -143850 -111898 -169455 -43109
6451 -43109 -23380 -87751 -190612 -113154 -5799 -138825 -266201 -270027 -196341 -188943 -318753
6440 -318753 -245475 -119082 -52876 46889 160191 -31490 -54212 101927 215908 46032
6430 46032 -131326 -217764 -198675 -202068 -190453 -98071 -26852 -31009 -63143 -49277 12240 -116478
6418 -116478 -220779 -217689 -17543 131436 -81245 -232076 -129638 32115 56384 -78169
6408 -78169 -143313 -37081 75465 -5897 -25542 8643 53914 107802 35597 -94944 -272328
6397 -272328 -312592 -44649 161815 281015 164682 -36037 -159397 98399 110702 -114617
6387 -114617 -233616 -137956 -169448 -261148 -270528 -161714 -187554 -54312 -166422 -392049 -350339
6376 -350339 -149721 -38776 43207 86416 11978 84300 133471 171234 229838 380619 368751
6365 368751 308307 180957 -105240 -71147 56607 192793 -52095 -175714 -104961 -80866
6355 -80866 -76339 -24147 182917 74360 -93519 -54218 -108413 -240357 -165037 5621 117725
6344 117725 24840 -110672 -22974 -87531 -86441 -162324 -244180 -308450 -173818 -173454 -251203 -303527
6332 -303527 -83696 32878 85455 112054 70148 104293 -2987 -223208 -186296 114737 -59602
6321 -59602 -230613 -52737 157855 38924 -82991 -52659 98311 109002 -43082 -58641
6311 -58641 89861 -34919 -173373 355 1483 -107242 45048 47998 -18527 -25013 35154
6300 35154 -117426 -196486 -198854 -48454 82343 65316 -47430 -113193 5255 46331 12416
6289 12416 56443 82180 82311 90044 52545 12541 -113957 -209888 -272129 -197523 -120171 -243291
6277 -243291 -310437 -194422 36507 64025 -138348 -251813 -218647 -38480 89705 22918
6267 22918 -218557 -106998 29142 15390 95230 67077 43662 90053 210374 166832 175263
6256 175263 103916 95843 173397 -11252 -217770 -152309 -31341 -107026 -139941 -42820 55123
6245 55123 7355 88542 75835 -40012 -129088 -130355 -145738 -92158 -227114 -270856 -112040
6234 -112040 -191650 -258502 6169 110100 283647 204950 2192 -40410 171964 122183 146012
6223 146012 78596 -110373 -112901 88085 -71535 -161103 -132671 -180902 -174731 -128764 -146269
6212 -146269 -15350 65706 -19906 -74860 -4094 125905 262835 236887 19036 -6429 102235
6201 102235 51308 99084 53422 -100631 -107429 -53679 -142701 -36237 -59348 44205 45776
6190 45776 2281 -129463 -124912 70516 94037 68517 -69097 -297216 -275782 87854 159381
6179 159381 155269 189011 264390 137468 95849 96066 195936 208251 251428 155399 -11873 18941
6167 18941 153037 41671 929 47006 101167 -20513 -31498 -28268 36042 36696 149063 141681
6155 141681 51588 34753 126427 -2337 -26568 32007 141408 76225 87592 74318 94627
6144 94627 -35763 -38213 40769 169157 255337 239507 253567 153611 64278 63447 89925 307135
6132 307135 356307 280782 342129 323946 117059 96963 155603 193615 171339 79729 -121466
6121 -121466 -84035 -115895 -126048 -83405 -54715 9997 -110253 -64335 46863 83722 -94685
6110 -94685 -129566 -13913 42648 3791 72944 -13266 -57938 -18119 -44634 -116021 -193395 -50433
6098 -50433 152796 119331 55293 7350 -184296 -268622 -217260 -142434 -101133 99203 104028
6087 104028 144931 208267 127950 123243 53362 -61952 -104500 -86758 -19922 -41989 -82643 -93093
6075 -93093 -72449 -156233 -170481 -81542 -26695 136849 230031 80045 -61869 -137331 -1256
6064 -1256 239199 433580 636983 563652 345801 238209 121614 69788 135908 183248 231025
6053 231025 105879 -38489 -160579 -124702 -66078 -38860 3479 -116839 -18476 -30350 -96763
6042 -96763 -191951 -197032 -244781 -220343 -230406 -127504 -148739 -218379 -295563 -261762 -75452 -65497
6030 -65497 -187293 -177186 -27835 63121 128550 -65543 -127811 -70135 199618 264936 83979
6019 83979 -125854 -216025 -187212 -97075 -119416 -6243 -12005 -132566 -8944 49983 -55182
6008 -55182 -236593 -383882 -367082 -194788 -126552 -130330 -248374 -331691 -240353 -136541 -145744
5997 -145744 -120910 -126480 -116874 -276581 -236456 -159292 -90363 -21217 23235 3063 127276 100498
5985 100498 36595 38291 107980 17139 -52108 -87537 -74633 9944 -151582 -43177 86107
5974 86107 -7854 8099 8981 -162270 -268708 -213275 -163292 44196 106723 -3680 -144154
5963 -144154 -125935 -245977 -209232 -140123 -167228 -76409 17273 -44260 -134956 -277317 -435934
5952 -435934 -243071 18994 -45397 -61413 53421 158322 242415 225631 141168 274739 169613
5941 169613 74342 -18402 -192332 -276859 -154083 -22949 59889 -49049 -179412 -230816 -249219
5930 -249219 -261583 -214828 -175778 -49259 -1830 509 8952 -109161 -140078 -180962 2309
5919 2309 34666 17181 -94011 -176098 -159001 -152007 41048 152106 -43643 -175693 -146234
5908 -146234 -92105 39411 2484 -89122 -46971 -26321 15857 162175 239305 191780 -68514
5897 -68514 -107576 -136934 -173352 16313 271441 343195 250017 179371 132649 82576 145392
5886 145392 186746 205768 110854 -77130 -205736 -284380 -282861 -13435 47100 -30466 -989
5875 -989 -17962 -140201 -134072 -187240 -266488 -275615 -312294 -125116 46329 70124 51361 856
5863 856 -108696 -175214 -173098 -54708 60574 42606 164823 167582 190796 96265 28670 -164365
5851 -164365 -193371 -161153 -156411 -212253 -250533 -254140 -103285 -147738 -105719 -73916 -127061 -155302
5839 -155302 -71877 -67091 -243177 -228147 -152996 -9482 -39795 -189597 -295244 -343970 -258174
5828 -258174 -444227 -454311 -358943 -343987 -260854 -12033 -178017 -252267 -221644 -28242 -23579
5817 -23579 -40178 -122791 -65588 -59474 -68577 -15097 -98834 -205943 -216936 -186329 -297977 -388782
5805 -388782 -276352 -80998 -76530 -61672 -88338 -108080 -245543 -352473 -379383 -299277 -178967
5794 -178967 -105223 -104650 -328570 -488269 -440439 -313426 -187323 6445 57315 -25534 -33977
5783 -33977 -90145 -23687 12745 128081 136490 27887 2128 56450 56659 175529 235241 150137
5771 150137 107711 37715 27023 -22192 -66035 -152446 -135706 -101591 -30057 94461 -27293
5760 -27293 -90489 -83027 119097 -6150 -167356 -238701 -247311 -171305 -267475 -339045 -14119
5749 -14119 91003 92584 26694 -70446 -157004 -222336 -365601 -192819 -231035 -212736 -152027
5738 -152027 -159894 14812 181083 64705 98456 195745 143643 255066 225313 13700 -306951
5727 -306951 -262067 -153778 -22073 12409 94595 -15346 41775 12617 -130870 -256549 -394554
5716 -394554 -286914 -30084 21158 -62578 -175136 -146481 -79932 -126563 -152526 1101 220462
5705 220462 252495 183032 64988 114982 95711 60985 -13970 -34231 -197049 -286499 -200945
5694 -200945 33826 152540 68326 -284010 -275293 -221322 -159451 -265882 -401332 -397618 -256244
5683 -256244 -91234 145270 244754 180269 197148 111955 -46857 53750 233107 191020 104590
5672 104590 -4493 106867 149891 104706 132988 10216 133053 220055 180779 36187 69330
5661 69330 104692 114272 147120 98911 127273 66366 104430 194527 251752 369501 143629 11111
5649 11111 7338 31172 -71965 -158187 -9285 159125 116221 14127 -8081 178524 17277
5638 17277 157244 124422 85098 188598 206407 192087 203262 33917 -207662 -379870 -361436
5627 -361436 -194616 -83992 -102301 -124090 39532 104237 112125 63945 -29480 -56314 -69857
5616 -69857 -59056 -15798 102865 118464 -16155 80536 154734 107360 -51633 44152 33218
5605 33218 152248 106693 64446 128307 110752 80520 122835 107019 51032 -30781 -105288 -125800
5593 -125800 -117101 13913 69164 -13621 2322 -74028 -77922 61931 96014 -208271 -258579
5582 -258579 -52541 -35605 -11960 -51175 -153516 -326202 -125643 -24327 -60640 -96998 -203718
5571 -203718 -215667 -102448 21014 -69155 3902 -3873 143852 208545 76414 14231 -43762
5560 -43762 -205100 -131018 68125 183971 177005 -30861 10482 115070 102614 -120316 -108024
5549 -108024 -80469 -93333 -118844 -105466 54918 32589 -8768 -26773 -29330 83163 30883
5538 30883 5054 -216409 -256847 -141524 -156416 -99266 -20574 -92699 -90980 46293 227785
5527 227785 35914 934 -89281 -73173 -37950 -77879 -103358 -133996 -235064 -216485 -16895
5516 -16895 350001 329700 137056 79644 -35258 12634 -17981 -2359 -133168 -240353 -341765
5505 -341765 -391671 -283635 -203901 -176137 -316726 -333251 -468700 -445868 -191496 26290 175286
5494 175286 106421 56619 -92991 -140285 -204800 -126402 -32326 72983 31738 -46623 -110418
5483 -110418 -153646 -201640 -150591 -72011 -83152 -209409 -270672 -234695 -81003 12994 18024
5472 18024 4052 -57540 -158240 -239816 -194650 -208418 -273456 -151574 11263 -6363 12970
5461 12970 154458 244072 354300 315313 380575 372692 349638 97712 1499 -6509 75226 -31101
5449 -31101 -16626 113768 83842 135891 -53960 -176626 -121558 135791 135207 67838 229164
5438 229164 359926 340981 245515 200507 233705 249205 253546 185318 191592 193299 247521 211186
5426 211186 167128 210272 -14640 77574 194306 40041 -53061 26015 -4217 -33727 -129003
5415 -129003 -268729 -157120 48002 -57065 -118937 -40330 -83870 -135090 -91710 28562 26714
5404 26714 -111870 -158833 -56934 -34362 -255537 -336257 -138184 -141301 -253976 -237830 -120533
5393 -120533 -171580 -235359 -201938 -104080 70389 225089 123764 215087 158979 5068 -160635
5382 -160635 -211625 -181100 -157477 -193466 6082 35035 -21304 -152649 -169843 -242127 -74813
5371 -74813 240761 410471 217880 24383 109430 214643 8156 -72101 -98943 -20911 39282
5360 39282 64934 134528 30206 -48463 -83421 -84819 -48773 -31096 -53732 -142584 -161278 -105095
5348 -105095 91690 17440 -61847 -86856 94298 67811 307912 334111 191294 286054 272730
5337 272730 89753 -77337 -345819 -420572 -339732 -441576 -307233 -39741 -70124 -242394
5327 -242394 -107250 56771 13705 30962 105172 165720 208555 96585 -52265 77730 178975
5316 178975 234427 408677 397058 172513 109029 73468 43688 24875 32579 -12534 -90038
5305 -90038 -114829 -147637 -6802 -53835 15137 23834 -47374 -139203 -93944 134527 85676 -77182
5293 -77182 -109882 -143344 25938 45727 -116 -20841 -4349 75055 61276 -25727 -27169 76269
5281 76269 59912 -71539 -172677 -199246 -264434 -157610 -64409 -29687 73974 99357 206894
5270 206894 225803 80180 -59127 -147338 -273991 -286511 -363359 -263920 -115701 6821 74699
5259 74699 76707 110245 256602 328022 289467 280901 65960 -85210 -183790 -195206 -268077 -238596
5247 -238596 -171520 -110136 -280698 -151862 -27006 -76497 -234932 -177081 52102 -10627 -21402
5236 -21402 -136683 -248279 -123194 -166052 -186520 -176860 -94721 40269 111578 -24139 -98619
5225 -98619 -65224 -216135 -300789 -156704 -106777 -172976 -180777 -226184 -186940 -109105 -163551 -204548
5213 -204548 -318659 -348942 -299378 -354593 -258569 45647 134200 38817 6042 -35743 40216
5202 40216 93682 176398 94372 -64707 -107087 -157600 -194881 -177784 -84901 -272868 -412138
5191 -412138 -392023 -267177 -177086 -389504 -309386 -119691 22335 247466 265072 173763 175090
5180 175090 4386 -56867 32683 -18943 -47864 -5179 -1997 18009 -6081 28554 45738 86167
5168 86167 143680 255077 246952 84244 -172673 -244319 -172510 15600 150588 51996 -138714
5157 -138714 -148833 -184847 -186778 -131681 -128459 -185700 -178796 -1170 160784 340703 312903 178441
5145 178441 126383 92144 9067 98086 106629 -138349 70672 311746 290832 76772 -148644
5134 -148644 -298264 -237893 -208084 -71431 -104352 -54116 -3685 -43467 -230187 24529 201837
5123 201837 212626 276450 218373 84961 152910 242401 195472 187811 140126 14643 -94281
5112 -94281 -19000 -114423 -154267 -104481 -85829 -112579 50715 86337 -95180 -142971 -214227
5101 -214227 -216023 -265891 -222613 -23387 127547 116502 173421 220048 68315 -63928 -114947
5090 -114947 -165897 -177430 -126098 -68794 13489 93683 33716 4185 52706 46955 -23232 8533
5078 8533 24244 62336 158150 211106 83092 297360 280240 203825 252416 138536 61449
5067 61449 -42536 -95012 -70395 91524 59904 -12367 -89000 -43946 -92987 -91957 -230085
5056 -230085 -184025 -144017 -107778 -100603 -91075 -67035 -168442 -216855 -261898 -238572 -274402 -170481
5044 -170481 -94633 -136682 -108000 -88088 -95502 -10568 114808 240632 8118 -19544 24440
5033 24440 -57639 -60828 99696 81084 -24201 -118991 -218524 -131079 -87914 -124048 -269725
5022 -269725 -324523 -240711 -124729 -101460 -183649 -105835 68993 166200 124738 139934 146320
5011 146320 168784 173810 181788 210039 56361 -126590 -298768 -217660 -171422 -335568 -331557
5000 -331557 -215996 -165537 -56207 147252 100321 5599 33108 -55461 -88984 -179229 -153685
4989 -153685 -176191 -13939 194318 270034 190307 99342 -80387 -48131 43176 132832 146969
4978 146969 -47538 127927 132153 55571 -63108 -72227 26606 117219 118597 33885 -170490
4967 -170490 -21408 -20846 -374023 -470489 -466214 -473431 -240356 79097 20882 -10636 -189610
4956 -189610 -173578 -216214 -274557 -409266 -331583 -253232 -115247 -194299 -152716 -65633 -4985
4945 -4985 22091 -93390 -64197 8865 -65304 -26860 -7588 133044 213388 82168 67059
4934 67059 70512 124813 152623 10722 -99724 -204656 -104620 104217 214097 140566 30042
4923 30042 -156326 -38043 73364 135157 100391 10180 27284 -219489 -249923 -123306 -156351
4912 -156351 -162025 -116084 -155904 -370601 -300931 -33307 -51719 82677 110236 115505 321396
4901 321396 138770 -99502 -115211 -70272 -42084 10816 68117 13253 38321 36560 -288758
4890 -288758 -368837 -124295 33414 -67022 -160917 -198031 -148366 -145331 -176629 -240954 -79440
4879 -79440 6959 -17148 -23249 -154968 -107565 -225921 -399460 -340536 -358321 -407734 -451157
4868 -451157 -340755 -131671 -296562 -89766 14347 -76377 -159225 -231610 -34858 86838
4858 86838 116354 977 -218930 -292406 -184006 -210278 -182363 66119 199131 204092 83020
4847 83020 153306 319621 272561 93714 55086 15723 38816 -50386 -144620 -65197 46748
4836 46748 261019 273905 38356 85433 97454 -16599 -10268 35411 50120 18007 -120891
4825 -120891 -333474 -372401 -275396 -177975 -148398 -130011 -189418 -314413 -321967 -113887 -81794
4814 -81794 68697 85553 61473 -7329 -141579 -113766 25003 77020 68986 78152 31058 -44665
4802 -44665 238852 289563 128333 101939 211269 289542 146855 2408 -86387 -261738 -167099
4791 -167099 8179 183560 72747 152518 119655 32569 -99414 -120974 70655 194864
4781 194864 91042 129315 173771 15404 -60372 -222459 -271759 -202281 -131047 -192756 30423
4770 30423 150527 31118 89499 94590 6996 73874 101080 -89332 -146045 -64377 47812
4759 47812 -82783 -260795 -86763 36202 12349 -111458 -1196 148359 113971 112949 -51063
4748 -51063 -308144 -241478 15782 37404 -71464 -155874 -202510 -254081 -170414 -19069 162557
4737 162557 245440 96472 150451 101958 69441 -50383 21723 -40610 -257966 -264132 -19685
4726 -19685 139568 194830 181244 129369 94067 67610 86154 47518 50406 149869 145155 112915
4714 112915 89346 -147827 -225500 5863 133428 -40242 -147846 -160871 -193937 -138482 -29357
4703 -29357 116048 283447 254398 6826 -85119 -113825 -77589 -169866 -378707 -318403 -184916
4692 -184916 13107 57281 43183 -148227 -142251 15652 127176 -43941 -302327 -243467 -16041
4681 -16041 -47666 -108247 -143255 -332864 -302428 -232293 -217998 -109107 -124838 -234612 -292032
4670 -292032 -294453 -447411 -370151 -300383 -223841 -208052 -174775 -118666 -292685 -444434 -215613
4659 -215613 -18592 -135314 -243083 -246339 -238551 -201469 -168080 -170669 42894 51220 -153146
4648 -153146 -137199 -168176 -254570 -153875 -177939 -316484 -401756 -344790 -413731 -271691 -234627
4637 -234627 -151619 70616 19358 -323610 -535067 -490307 -432323 -418787 -481364 -497957 -389536
4626 -389536 -216577 -302982 -354383 -303631 -326892 -453191 -480589 -278091 -246483 -147304 -284218
4615 -284218 -244214 -64319 72925 77070 114061 164023 314974 384094 398240 151513 -203860
4604 -203860 -443416 -325115 -126749 -205995 -339775 -306228 -243035 -118409 -40673 -196145
4594 -196145 -159030 -125201 -319248 -227059 -68150 -172601 -187789 -294687 -163862 -200424 -145159
4583 -145159 6842 176541 159272 150851 174323 180044 228813 291229 36137 -126894 -102161
4572 -102161 76209 62677 81515 156199 94628 -5890 35779 153567 236763 74614 -38923
4561 -38923 -234015 -298975 -169545 -128387 -3214 -14619 62665 43383 -70514 -50818 -16360
4550 -16360 -126690 -168988 -153866 -109573 -21172 178259 323592 86713 -11517 -22486 -26048
4539 -26048 1851 78298 113382 31055 -63254 -192012 -205539 -83247 -106833 -62715 -68311 -14905
4527 -14905 8253 -14798 -105989 -45124 -53104 -272662 -248508 -134715 -41252 -63972 -155771 -243489
4515 -243489 -275541 -252171 -219228 -143871 -216861 -198797 -79819 58690 -43771 -71768 49794
4504 49794 49392 78411 211562 196411 251983 132485 43673 -11769 -53445 -47235 44017 172348
4492 172348 81310 -83677 -161334 -182755 -111804 -22066 22122 -134830 -347453 -270492 -143181
4481 -143181 -79805 -94211 -136627 -105423 -6535 -3407 -39262 72736 4607 -192057 -246687
4470 -246687 -228758 -206085 -184104 -156287 -136469 -64683 -121934 -328397 -182565 4487 166181
4459 166181 277577 181589 -18198 -45924 5988 99016 145667 5191 -48645 -4343 -147014
4448 -147014 -106629 -92549 14891 8278 -210282 -285499 -299539 -363581 -437530 -348426 -105435
4437 -105435 144924 209081 275406 151775 -24808 -54360 122619 198579 35739 -140852
4427 -140852 -135898 16640 75014 -83990 13523 -47437 54057 133048 -30566 -313145 -411073
4416 -411073 -317441 -320887 -230728 -218852 -66061 199537 196744 152848 83679 -39616 27592
4405 27592 128244 225121 -51681 -300270 -192483 -274029 -194658 -128180 -79341 77605 175023
4394 175023 139393 124249 207357 74599 9515 123505 179269 -621 -126464 -72240 -24722
4383 -24722 -41012 81902 121807 10708 -10363 -18048 -15009 -99006 -134720 62551 245051
4372 245051 135971 -43971 43748 -44611 -151371 -118405 -28776 -3067 209775 190489 135910
4361 135910 -56494 -30444 142980 212244 166278 -76221 -107785 -38425 -59837 -167362 -239064
4350 -239064 -161888 -92851 -145030 58553 84616 134230 208518 296621 277343 128727 346
4339 346 -36905 -35979 34578 -81759 -188798 -135004 110755 101603 49122 348654 333237 117940
4327 117940 -126180 -128978 -170781 -111601 31592 236094 260861 147063 44583 -221621 -251698
4316 -251698 -230792 -145884 -138821 -179808 -64162 95365 176300 132312 -26612 -172275 -137176
4305 -137176 -199861 -273399 -270898 -241172 -268121 -287105 -258670 -123084 -136964 -181428 -55595
4294 -55595 33770 27600 67891 69660 53289 24411 -137365 -71199 7792 67800 23146 -40886
4282 -40886 -92106 -23929 -24797 -96784 -183061 -113894 -7516 -33094 -69606 18962 5660 73983
4270 73983 -2456 -35331 -64195 1383 7607 -14271 -12490 -10716 21406 -16581 -69251 -133789
4258 -133789 -219267 -289087 -178250 -31209 101742 77413 -82478 -98524 15775 -74559 -184890
4247 -184890 -239355 -123827 -67430 -61857 -44281 53563 234262 183395 145999 152473 -99188
4236 -99188 -261689 -122724 3031 -33739 -152028 -123668 -123117 -52617 66826 89671 130337
4225 130337 17812 24128 176548 51016 13239 7347 23428 -58145 -5861 181747 167876
4214 167876 63569 -52498 -223602 -313683 -210188 -156407 -80558 -114295 -162747 -117546 67519
4203 67519 188680 186252 22477 -32513 -103256 -2201 130071 78141 142495 187890 116048
4192 116048 53498 98842 152574 5618 -89267 -222200 -222672 -273893 -389501 -294048 -251403
4181 -251403 -113455 -79876 -232413 -207638 -147511 94772 199712 244602 -106867 -69412 -67474
4170 -67474 -176557 -290002 -216729 -243064 -246218 -100800 -241008 -246269 -127790 -147603 -128454
4159 -128454 -89690 -128443 48418 217239 138517 12562 -111764 -183866 -191156 -248103 -112544
4148 -112544 89513 135814 235543 341234 297484 121843 -96703 -184040 -73615 150656
4138 150656 298266 376436 373772 270491 146399 23211 -28664 67991 107585 108623 93134
4127 93134 8195 -32335 85024 116008 197585 107553 2662 42422 23777 111157 36794
4116 36794 -219412 -172163 -49320 -118464 -13714 -97520 -275175 -191822 -74460 47247 -78093
4105 -78093 -29221 40334 170052 220995 69450 -79541 12536 41604 47529 -77837 -98536
4094 -98536 -111840 -61963 -70970 -190296 -186770 -275821 -300758 -95619 141457 326246 258555
4083 258555 259950 247572 26273 201487 193135 -20168 -72240 54525 100531 179478 257102
4072 257102 187009 -92544 -181889 -194204 -316932 -215837 -124578 -26616 76860 -10246 125033
4061 125033 1029 27564 19969 -67788 -27576 -56456 -204789 -240174 -103840 67268 28973
4050 28973 171221 152920 46419 58709 170792 194636 118787 -65375 -40333 125443 259732
4039 259732 151431 107660 110765 53393 185362 82810 -7046 131502 35278 -92837 224
4028 224 -61249 -176622 -77908 64723 147322 23716 -130882 20115 -15336 55387 -7040
4017 -7040 -152912 -181263 -88567 -33638 58845 54545 -37718 39312 14382 -9361 -32490 -184946
4005 -184946 -254553 -170590 -69476 95644 141208 119244 -104445 -57048 93936 32256 -13245
3994 -13245 47343 124297 97019 47609 -2728 -212784 -271042 -278741 -173958 12754 57532
3983 57532 71049 27567 -76702 -146483 -10744 119388 44734 -82718 -19245 7558 -148377
3972 -148377 -222445 -123582 9414 -8383 -229773 -305367 -242417 89702 165368 17083 -13667
3961 -13667 95497 79252 11005 -137004 -286112 -404529 -227396 -81796 -83024 -252715 -258044
3950 -258044 -247137 -298397 -251786 -183360 -139508 -119037 -84002 -114270 -245506 -220994 -44037
3939 -44037 -3784 -72445 -112453 -116203 -62402 -60066 -51561 54903 181622 121629 -101405 -176778
3927 -176778 -265995 -216629 -109721 -169037 -166617 -337513 -351043 -286044 -11774 -2320 -103161
3916 -103161 -160357 -258710 -366563 -205003 -227095 -315873 -366766 -181927 -82563 37033 71235
3905 71235 42650 19095 95764 131070 115767 -106548 -217586 -228156 -157678 -105506 -51331
3894 -51331 -11618 -51197 -115900 -15043 -14059 -85080 26076 -6526 -237356 -260336 -172456 -58968
3882 -58968 -2094 75437 87052 4073 4942 83355 -39453 -224484 -125838 -167776 -100663 145165
3870 145165 138328 46478 -1547 -83012 -62484 -59684 -48229 -57647 -58459 7774 40729 -15878 -7041
3857 -7041 35379 127588 6113 -128859 -239015 -375983 -353396 -117919 22842 -41082 -76231
3846 -76231 -25158 -96319 63226 86778 -118159 -114685 -65378 -22083 -93731 -50635 -150954
3835 -150954 -202275 90022 104992 -38950 50121 -31268 -113749 -146335 -143943 -177518 -92243
3824 -92243 -72487 -210370 -302680 -332845 -431451 -252050 -54878 19590 -4330 -69214 -154227
3813 -154227 -162187 -102050 -152454 -137300 -111022 -31763 23243 160202 129245 -9426 23665
3802 23665 -115014 -89240 83729 200833 20711 -152879 -94571 -1108 75179 111838 181425
3791 181425 -1138 -170381 -203094 -48124 -164837 -299558 -261628 -186433 -124677 -13458
3781 -13458 164114 177516 46434 -49528 -138760 -90657 -65726 -5896 94048 -75019 -107923
3770 -107923 -130608 223581 391288 307578 130391 167108 147712 148478 53641 113355 67061
3759 67061 -118257 -119349 -128247 -197461 -74473 -210633 -197716 -117276 -34393 118265 106089
3748 106089 121004 82028 16844 -83683 -225315 -335805 -276377 -330061 -303990 -233819 -149659
3737 -149659 -77524 -81301 -40542 -6979 -19539 -73826 -105694 -100896 -85872 43133 -32099 50690
3725 50690 190521 99538 -13777 11829 131842 326989 277665 41199 -3060 -7301 195785
3714 195785 66325 -95849 -159636 -64057 -99445 -40910 12848 110051 155543 82345 -56820
3703 -56820 -134113 -72624 -109597 -37910 59752 -42696 -106973 -173184 -187529 -248538 -229290 -141025
3691 -141025 -184019 -342822 -384788 -313739 -211413 -168487 61348 111440 -56839 -172286 528
3680 528 137407 72379 -74176 -15187 125074 104579 157864 82732 125270 251708 135900
3669 135900 133721 311709 200488 -77171 -161089 -27507 62220 88782 -122946 -370207 -522680
3658 -522680 -383019 -157874 -69577 33322 58751 -13224 -70618 94150 40356 -92845 -95865
3647 -95865 -202776 -328181 -257764 -258318 -248636 -56114 88626 107543 263415 312880 304866 262973
3635 262973 245517 188260 20051 -43920 58948 212570 326964 235602 300867 215441 92067
3624 92067 136759 30085 101768 149374 122359 111419 207066 178885 158421 281263 280435 128753
3612 128753 30504 26479 150650 259905 278638 326894 299045 64777 -50335 -72419 -91284
3601 -91284 -171824 -167151 -35985 -53136 156748 207234 25537 84909 130220 228358 145212
3590 145212 -26603 -77326 8056 -53526 39204 129883 117323 1253 14717 -103541 -179589
3579 -179589 -183997 -226162 -107699 -54220 -281 -23893 -156560 -178240 -10470 39109 -150436
3568 -150436 -205276 -239337 -76043 -148272 -192883 -178931 -92639 -73377 -68537 -79329 -79055 148053
3556 148053 269559 216221 -40257 -219337 -183996 14961 -53780 -16680 -39508 -207769 -265639
3545 -265639 -232753 -40043 -110885 -201268 -118560 -146468 -125914 76367 208822 224836 151048
3534 151048 102932 2039 4699 -45399 104759 120140 20501 49300 58463 -14877 -181157
3523 -181157 -261529 -156110 112192 201169 55630 68540 -9137 81462 228596 113735 -118012
3512 -118012 -143141 -196280 -435053 -489237 -308464 -180045 -94380 55432 -132866 -90394 43171
3501 43171 -26216 -140996 -117972 16844 -86731 -342615 -330803 -199480 -103637 39787 53580
3490 53580 4087 -61067 21054 108663 27944 -61992 -143133 -83268 32009 275945 94921
3479 94921 72810 6181 9280 -53894 5600 47133 -172806 -226322 -89388 -132407 -458666
3468 -458666 -453293 -295966 -250550 -68441 22074 3435 49701 -9619 -31254 -101725 38057
3457 38057 128277 -136188 -356921 -280762 -93827 -72665 -92099 -180337 -273716 -261200 -216998
3446 -216998 -208903 -68891 -38839 1086 -66349 -124332 -160841 -139502 -84247 62256 141225
3435 141225 92414 13782 -25528 -163646 -428238 -333926 -115478 -15060 -130601 -178734 -111493
3424 -111493 95338 120448 11565 -148921 -251322 -220147 -168671 -172168 -258394 -194873 -88872
3413 -88872 -69203 -50174 203912 363103 197981 84486 232181 180435 164572 48511 -16816
3402 -16816 -6393 27781 21851 4596 -82692 -107584 -43895 83498 99413 183343 31143 53834
3390 53834 116586 249326 312421 267520 351803 129749 -314318 -399597 -293293 -149290 36072
3379 36072 -13302 -46489 36472 -7336 139875 30213 -62325 -63251 -82067 -176002 -242710 -219667
3367 -219667 -167681 -168994 -165785 13716 42429 -47478 -12932 -150409 -125510 -54149 8371 -112494
3355 -112494 -208508 -83971 36009 139991 285855 189577 158739 198175 126431 -7585 24271
3344 24271 -36415 -20772 68414 148881 -9882 -54151 -96057 -146315 -85398 -46187 -174836
3333 -174836 -134538 10046 127705 282098 301818 156082 128935 247218 233399 84326
3323 84326 -47014 8231 88911 93720 113754 42140 -122122 -213390 -191194 3563 197777
3312 197777 19145 -23462 241120 330019 100057 143949 212706 165690 44763 -77843 2046
3301 2046 -96329 -106290 -41718 -145564 -344067 -430105 -270231 -126412 -173857 -299693 -441380
3290 -441380 -235949 -83370 -94830 -158444 -139982 25319 241069 173637 113809 132930 85114
3279 85114 136359 354412 302817 295381 275094 279064 300608 80833 -79177 -223909 -321481
3268 -321481 -212214 -49065 -158108 -283745 -179667 -142563 -253453 -35438 -35622 -51305 -23051
3257 -23051 -20772 4575 -66966 -153340 76054 187123 135192 -48112 -139039 -126541 -52329
3246 -52329 -50851 -178227 -228966 1352 223412 197196 107602 189965 105082 -30219 -73892
3235 -73892 46601 203010 267712 49682 -125377 58616 122809 87281 80839 52560 62886
3224 62886 121493 10725 63828 133961 235949 179817 79565 182119 340044 218454 148944
3213 148944 164141 -3869 17114 -19837 37905 65420 75153 144125 91715 220433 145923
3202 145923 -84135 -72260 179744 342824 133375 54498 56688 -4887 19785 109298 284499
3191 284499 155015 13063 116059 176850 39046 125135 159057 55962 93051 35899 -111422
3180 -111422 -67472 -65558 9223 232263 154846 -98206 -245555 -201779 -281081 -203072 -61094
3169 -61094 -48933 -101814 -131413 -135171 -144730 -51826 -53751 -78514 17566 163099 224632 158056
3157 158056 141590 -83197 -289537 -376996 -154013 -109299 -104253 -156235 -250053 -53391 73014
3146 73014 -10240 12929 208846 244937 101936 70076 -70944 -167689 -163037 -130187 -125276 -138649
3134 -138649 -110534 -231 64227 21458 54727 162762 183026 195269 270702 185661 135186
3123 135186 99345 125172 223547 250011 216397 152994 224596 263744 210009 124165 88718 -29918
3111 -29918 -147527 -98967 -134086 20599 85232 141075 215210 200027 158735 168055 32960
3100 32960 -141490 -166603 -7832 184509 176551 43413 60224 26142 82992 83324 -30489
3089 -30489 -100408 -83738 -202125 -344915 -238095 -85744 30807 154084 253243 136296
3079 136296 -58241 -108804 -204154 -191794 -138902 -148146 -217093 -223017 -128958 -88698 -29074 -9934
3067 -9934 -155475 -22759 -10820 -82805 17993 19406 3601 19553 130829 289037 376457
3056 376457 164355 -81804 -225698 -346513 -220811 -87249 -65262 -44143 39492 53394
3046 53394 142128 110199 -26680 -164623 -234003 -156345 -24200 82916 124067 -32409 167484
3035 167484 294757 349046 132070 -32538 -99616 -87333 71391 214605 -26255 -9562
3025 -9562 48076 -31246 -70753 -47668 33967 -26926 -245169 -324887 -281005 -300109 -100357 100805
3013 100805 316848 324187 166204 -47728 -138346 -14646 -1021 -1296 220498 -13830 -190978
3002 -190978 -126787 -87632 -21673 45562 -30399 140739 158197 175602 285715 198712 -13125
2991 -13125 -180872 -314507 -185322 -44390 -206754 -9779 220933 339498 167028 -70432
2981 -70432 -125659 -73437 84646 26712 -131180 -181935 -114679 -43469 -173619 -133846 -203452
2970 -203452 -41063 -29172 -115639 -164984 -147895 -22991 -104673 -131680 -4546 -101145 -87306
2959 -87306 18428 181985 167827 251128 204046 115300 13491 105988 80971 152195 261043
2948 261043 208129 31457 -56044 -76817 244823 219533 -121807 -215936 -70176 -192128 -224974
2937 -224974 -58411 50054 192546 57708 -7304 49346 -60810 -278133 -175859 -79943
2927 -79943 -20323 -107009 -32308 59123 -42606 -56055 5813 48614 33154 171024 283997
2916 283997 177721 -24648 -73780 -5391 -60077 -24466 91895 582 -190570 -356604 -250153
2905 -250153 -52875 86568 308384 302658 26470 2975 -20555 122940 97907 -22825 -137842
2894 -137842 -148696 -218640 -294196 -215237 84661 155733 -12545 2037 33206 -49951 -65716
2883 -65716 -35834 130492 86156 78540 30114 -73908 -5468 163909 271666 368701 334085
2872 334085 43775 -171219 -237328 -233627 -239720 -154938 -60468 -123001 -178863 -267342 -190936 -138897
2860 -138897 -161869 -16660 199019 194076 126963 16562 48613 111392 24371 -103591 -100130
2849 -100130 38342 89444 -2204 -58790 -77372 123159 422175 417411 272781 133553 34102
2838 34102 19252 938 99244 197195 164965 -86236 -114039 -126462 -138954 -115877 -35493 134593
2826 134593 22353 77183 22220 -54579 5215 14269 163662 37714 -186945 -59447 -82426
2815 -82426 -58626 -84635 -61489 -163876 60217 340107 398529 295893 119928 14576 134840
2804 134840 236230 286638 357498 269443 164149 33837 150861 206117 19476 -235690
2794 -235690 -267353 -100802 -7461 -179687 -210298 -251488 -302891 -314119 -298540 -156122 -61067
2783 -61067 3282 -82337 -39753 -151753 -181352 -86463 29355 51926 52216 222557 357091
2772 357091 357880 174669 61012 -19619 -11411 -51923 -124723 -107157 -127831 -166723 -90673 -26266
2760 -26266 11389 -37 -128364 -181011 -66140 -185088 -245727 -232051 -98254 43673 118545
2749 118545 -14114 -46590 61361 -2080 -173 34613 53312 -47428 -210544 -413254 -363734
2738 -363734 -222602 -283610 -49144 43209 -80072 -187049 -135372 -37818 63513 133903 187413
2727 187413 322458 177652 54264 105752 104997 73974 85324 -720 105231 274365 245106
2716 245106 -88151 -268941 -351503 -208278 -79985 -47316 -75975 -105784 -254077 -177563 -99735
2705 -99735 -105203 -56729 103179 152214 52290 -93585 -134514 -179832 -168249 -303985 -260880
2694 -260880 -120506 -143675 -192120 -248342 -374296 -215909 -211437 -255812 -140520 35558 46095
2683 46095 -54873 -90319 -111360 -203469 -176824 -98194 -78396 59485 116689 252354 223715
2672 223715 124474 94400 151172 157215 285354 348416 262468 328157 85332 -57256 16259
2661 16259 129545 146967 288359 332008 35699 -93054 -214526 -178121 -97448 -192291 -167237
2650 -167237 -179344 42554 61844 -6904 -149025 -128985 -86806 -26124 -810 -13117 -54055
2639 -54055 -65943 -105352 -72418 -179386 -301511 -348120 -416785 -331774 -105540 -47937 -61342
2628 -61342 -122031 -166851 -510941 -477218 -411970 -364398 -395633 -380912 -304252 -156343 85650
2617 85650 220089 225753 130659 -79886 -128579 -179552 -258691 -305129 -360520 -268668 -105795
2606 -105795 3868 139408 229385 107776 34467 21121 -140183 -225901 -152216 -132650 -153574
2595 -153574 -159129 3654 24417 -105250 -119178 -179447 -142120 82429 114302 184764 20196
2584 20196 3068 48491 105725 184720 237670 258115 143911 264805 481658 382106 288450
2573 288450 179856 66926 -84372 71692 147112 -31633 -134800 -231325 -163371 -95893
2563 -95893 -42019 10634 23833 -101137 -208593 -345580 -252484 -161880 -78063 -37195 34886
2552 34886 68314 18061 -88064 -155093 -235282 -249127 -80090 -77204 150795 246537 166913
2541 166913 51435 140082 238682 285363 226508 238235 104138 8164 -13626 105251 199944
2530 199944 159352 39541 38841 249767 212866 118619 81611 146582 71479 -46689 -106500
2519 -106500 -67556 139738 232721 188018 74469 4691 -16196 -47019 -73546 -144865 -167745
2508 -167745 -105079 -56395 -115330 -129211 -9470 -16302 -121876 -69225 -104944 -228984 -224972
2497 -224972 -181913 -97738 -52698 -119656 -132874 -24261 98807 168385 108816 -32349 -20110
2486 -20110 -154862 6788 62659 -75502 43674 53937 -90678 -326704 -198735 11206
2476 11206 245171 128651 -114166 -98893 -110855 -76641 -81304 -19560 152203 188069 -1794
2465 -1794 -65155 -111120 2665 87726 82290 197741 320071 333960 308563 174967 63157
2454 63157 100074 228581 236461 118568 115277 79102 78404 -91210 -97812 -53745 -6452 -131414
2442 -131414 -212368 -200145 -231688 -173168 -109427 97242 63946 -96131 -246052 -172031 -67742
2431 -67742 68768 126508 -4341 -115477 -76919 119287 134155 55240 -414 34317 235762
2420 235762 197281 170112 156079 44136 45651 -106463 -208553 -96473 10681 99369 19169
2409 19169 -128042 -154369 -170711 -345373 -249251 -248845 -282140 -250310 -230338 -32836 74190
2398 74190 91440 -20714 -99519 -225588 -187859 -201179 -73040 44739 168343 106677 -1797
2387 -1797 -86736 -153369 -39077 -149353 -101904 -93917 -171843 -55007 122803 56828 149777
2376 149777 120180 15085 3859 120520 126032 -22244 99736 240145 338067 347459 242829
2365 242829 74285 137152 164875 32763 -131348 -76723 203584 209401 37944 -47105 -37324
2354 -37324 -96259 -41741 -52424 -72229 -61132 59199 254205 173879 26102 104559 202267
2343 202267 259344 358478 312746 251601 209812 134909 202913 227434 188452 144800 248013
2332 248013 145433 39826 34650 -50058 -131229 -172477 -65440 -32613 -149880 -303303 -197803
2321 -197803 -198331 -120528 64900 130480 -50298 -99606 8588 44784 -37179 -265426 -204423
2310 -204423 -167623 -169983 -40980 -101463 -145076 -121328 -222269 -232666 -442916 -439870 -133920
2299 -133920 77344 150568 11365 85502 266832 188660 37238 -22155 -95154 34570 -134845
2288 -134845 -252593 -65395 155905 100144 69422 47011 126518 100550 89675 247008 492051
2277 492051 577590 422569 256622 141721 -139974 -73767 -1784 159091 119484 181027 107461
2266 107461 93132 111224 89045 119260 -48957 -84457 109287 211805 201462 84869 158846
2255 158846 262146 319358 439164 136630 -37937 -67138 -95441 -6233 159852 212514 57514
2244 57514 -19184 -68494 -201553 -137703 63348 296038 349361 258862 251294 389917 352386
2233 352386 249031 87697 -34969 -199568 -269133 -120138 -78353 -110483 -49242 19648 25003
2222 25003 -124239 -142730 -49591 76106 90810 114075 48334 -111204 -150810 4257 29401
2211 29401 91986 99814 544 -96759 -34605 -52972 -79064 -115420 -218448 -78709 28271
2200 28271 -91375 97555 239175 148875 -157652 -114380 2795 142739 -70528 -72504 5708
2189 5708 197585 98851 -17826 -79805 -24847 -164367 -189531 -265918 -347030 -283727 -109445
2178 -109445 -55006 108976 104003 20661 -29808 -40538 59825 109001 -41671 -71401 -142089
2167 -142089 -304212 -357653 -74843 30312 40348 181915 255830 147079 7935 -10396
2157 -10396 72293 86105 -13517 -135217 -140873 -190240 -75911 104981 23401 30804 56184 71161
2145 71161 110176 103712 90243 197219 271545 164225 26412 -88966 -77531 -30524 120964
2134 120964 188575 277797 313924 276784 189413 197339 104977 76110 174688 166980 162500 45771
2122 45771 -89784 -80832 -27567 100196 88088 235633 255238 265441 255678 -28345 -174261
2111 -174261 -117257 -166583 -319998 -316648 -227125 -90424 -28111 -44984 -12951 6441 -79750
2100 -79750 -14163 15107 2795 -98521 -132294 2158 132814 175020 238290 348263 398754
2089 398754 307326 178175 26807 2908 114598 330247 296788 66923 -33691 -96309
2079 -96309 -115738 -175286 -79068 -104063 -221968 -143258 -47122 -145474 -24553 7380 88392
2068 88392 145116 243450 168581 56461 46885 -43584 -84290 -111767 123221 304529 316324
2057 316324 146941 65110 -78288 -139286 -34298 -99730 28767 123702 61141 -1197 -69754
2046 -69754 -90360 -131612 8233 195952 307759 340241 305167 183074 69489 -4330 -165133
2035 -165133 64125 199963 183015 205096 79424 -59787 -70295 142617 173818 123411 42567
2024 42567 136516 171286 175884 146250 113661 222799 164615 94743 21120 -29218 -58389 -75450
2012 -75450 -47354 -127162 -190556 -37453 -67522 -116240 5361 33306 -143376 -241851 -213620
2001 -213620 -287913 -160630 -122023 56822 78298 39103 -126608 -202806 -145663 -113860 -158264
1990 -158264 -147087 -11949 126095 116439 -17455 -117215 18562 90139 43727 3827 71287
1979 71287 167488 81286 24173 73310 -125897 -137712 -186991 -290497 -203048 -228320 -77004
1968 -77004 150687 139435 97221 -99796 -85312 159181 159691 104910 108190 268672 333724 146035
1956 146035 -46774 8332 -21990 -136847 -91897 26408 90039 36898 -6479 7129 221965
1945 221965 201108 139030 184851 70747 41141 13749 -26083 -1140 -90507 -292816 -107913
1934 -107913 66108 58410 90316 83598 -108551 -29133 -67207 40846 -14241 -229281 -149368
1923 -149368 -182836 -109765 -89600 27527 210759 146224 133831 12638 -176215 -154605 69445
1912 69445 82194 122412 252422 312203 484807 380083 273292 129186 -96584 -231556
1902 -231556 -335807 -270150 -168893 -169756 -184542 -167119 -128414 3844 179331 36968 -74588
1891 -74588 -23254 -190057 -362181 -270225 -175712 -102398 -60797 -12684 -6450 28306 72408 21367
1879 21367 -80657 -165159 -102671 -24837 30856 -8905 -162458 -163108 -186143 -289275 -263633 -273716
1867 -273716 -251982 -96592 -75745 -30627 -52355 -174415 -184733 -99998 165574 328714 285686
1856 285686 112008 86022 43738 14995 -54307 30131 16512 -66359 -204990 -151618 12657
1845 12657 123838 296051 284576 160031 215271 98185 -91436 -10857 35067 61237 -17393
1834 -17393 -61397 -236627 -199350 -44316 -49765 -165561 1700 -100567 -1337 144231 221921
1823 221921 122510 112697 167536 238063 154376 158291 14207 1220 5300 49233 -8768 68050
1811 68050 124776 1679 -40287 139795 223438 272697 175000 135017 71526 -10161 124106
1800 124106 235461 133203 51810 -176731 -169522 44684 205589 208052 202682 214064 177568
1789 177568 11465 -197874 -168111 -95568 61817 79586 145916 76121 -65757 -192138 -114751
1778 -114751 -64628 -71271 3157 92983 141876 163899 36095 -44363 48556 184671 213125
1767 213125 57830 42608 89944 17053 12490 -72546 -34229 -88497 -214327 -332350 -293266
1756 -293266 -71859 -87008 -43480 100855 146378 45170 105324 197406 188719 156336 152545
1745 152545 271969 377484 260770 151540 73965 58150 238309 116906 55667 49229 -68127
1734 -68127 54406 275439 185058 13885 -16906 100816 106057 106751 -3912 -93921 -233861
1723 -233861 -197795 -172757 -32804 55499 73030 145690 33917 121133 151412 206857 178672
1712 178672 28441 -206720 -278100 -207172 -239174 -52261 29063 90359 197096 130476 -73941
1701 -73941 -20892 70796 58928 25991 -56734 -174219 -173779 -162952 -137029 -101201 -92873 -59995
1689 -59995 -52432 -81532 -96169 -91934 -39641 87851 83109 114297 216919 93777 -82024 50355
1677 50355 -15127 -19591 59105 118816 128325 188585 176420 72358 -96640 -122698 -179306 -62726
1665 -62726 81491 165903 248730 279311 149132 166284 158019 190736 197055 -118329 27293
1654 27293 150953 242626 220707 88079 63663 238689 158175 280562 310230 373326 260844
1643 260844 89676 -93753 -134885 -31560 9544 44127 170656 103276 69576 1592 -65276
1632 -65276 -29745 -4960 33440 -100896 25889 53348 41824 97586 -13301 -5431 32621
1621 32621 136568 56804 78102 81859 64893 -5449 -37179 -111908 -120704 -113132 87608 195326
1609 195326 130279 111433 156252 153550 6447 -126328 32390 -60789 -44762 -30618 43032
1598 43032 85322 303392 275109 301842 283663 165064 71151 132731 122308 78875 47692
1587 47692 25505 9903 -97602 -236816 -278805 -411592 -386579 -330924 -193413 -676 142595
1576 142595 32215 -220004 -449273 -463367 -307792 -10140 110014 109685 170892 108617 -22288
1565 -22288 -34390 -69301 -8221 142355 147324 -28448 -270739 -237295 -273740 -203764 -200120 -282052
1553 -282052 -317083 -193456 -80746 50369 64973 -119350 -104301 -40496 -85058 -171386 -224155
1542 -224155 -282774 -172397 28471 12432 97365 89419 -19614 -119049 -126348 1075 57880
1531 57880 -3206 -56928 -34196 139066 109910 -31997 27725 50282 10172 51463 138024
1520 138024 112624 42252 226 -101479 -158900 -54454 -92895 -143404 -115268 -87474 -9896
1509 -9896 118002 29500 76656 50079 -49846 30685 46197 -84278 43470 66055 204561
1498 204561 246745 361443 416151 292685 236719 252383 170524 104662 -93511 -108350 -84935
1487 -84935 -171714 -133938 96808 189771 190710 317375 378288 256521 108219 62919 36979
1476 36979 92803 203037 -42010 -273500 -204995 41869 68041 -83105 -289201 -310376 -115486
1465 -115486 -127595 -260361 -222019 -277522 -258045 -288243 -239307 -168339 21422 91870 62803
1454 62803 -44470 25780 4765 -17353 29047 67819 -77318 -245352 -195531 -54656 54445
1443 54445 126181 85217 -48427 -44196 -46311 100522 265474 333218 405329 423823 229252
1432 229252 84521 -64057 40825 50290 -41108 -35586 36593 58043 -87522 -19032 27728
1421 27728 71576 134216 101997 84405 -58487 -59714 77119 20743 -980 192688 246118
1410 246118 109877 60683 206705 303366 348301 288048 186117 74869 -37989 -37706 12899
1399 12899 -36622 73766 246651 106004 -6767 -29015 193126 328775 97958 -172692
1389 -172692 -150482 69391 205516 233182 96040 49288 88602 67860 -115399 20676 128784
1378 128784 81486 127278 156557 224340 271779 247210 198919 292071 32977 -169589 -111332
1367 -111332 129124 134847 169447 220299 173539 107570 -200148 -265659 -129489 -80724 -68726
1356 -68726 -30907 77713 -36237 2067 153810 266862 54735 -103568 -234643 -224222
1346 -224222 -46655 63408 109567 28991 -92656 -157059 -136243 -186430 -164328 -97303 63878
1335 63878 74466 76972 142234 -22413 -122560 -7526 -39144 -162186 -208459 -39582 127562
1324 127562 221683 127618 42881 15265 -21065 -37384 71408 105413 150174 259007 323909
1313 323909 233995 132215 272704 409043 285517 173939 173421 109731 128189 175176 243130
1302 243130 242633 224281 -28482 -115173 -80034 -26687 24794 253644 398072 514380 386042
1291 386042 205196 231770 242180 116168 213879 235720 322361 217721 131195 206370 400977
1280 400977 270997 203688 259157 271834 131418 74397 13138 78927 25694 63760 222867
1269 222867 216915 134606 11009 -49424 -34041 -67199 -26138 80071 87003 192848 255539
1258 255539 340903 300731 354133 379676 428288 404453 418383 497117 430585 315667 349618
1247 349618 259417 150930 118186 152043 356336 391508 164456 -42256 36758 11358 -90286
1236 -90286 -48788 70507 142121 -151044 -316573 -371810 -364822 -317320 -28377 51000 147582
1225 147582 196879 98442 97450 103255 8690 150641 105850 60953 136264 288610 390802 405599
1213 405599 336475 311620 215367 12907 -121048 -234583 -302248 -353148 -139296 111967 150755
1202 150755 88155 162027 290530 211770 256142 304790 199919 255949 293249 321428 167379
1191 167379 59765 52988 101812 58548 -111589 12294 287692 378244 114519 63465 68025
$$ [...]
##END NTUPLES=NMR SPECTRUM
##END=
