##TITLE=Analysis number 314593
Compound Code mo 01299
Book Reference 449/34
Project Code adrs
Chemist Name davee
##JCAMPDX= 6.0         $$ Bruker NMR JCAMP-DX V2.0
##DATA TYPE= NMR SPECTRUM
##DATA CLASS= NTUPLES
##ORIGIN= Bruker BioSpin GmbH
##OWNER= NMR
$$ XWIN-NMR		Version 3.5
$$ Thu Oct 20 13:07:43 2005 GMT Daylight Time (UT+1h)  MAYBRIDGE\NMR@NMR_250MHZ
##.OBSERVE FREQUENCY= 250.131544655141
##.OBSERVE NUCLEUS= ^1H
##.ACQUISITION MODE= SIMULTANEOUS (DQD)
##.ACQUISITION SCHEME= undefined
##.AVERAGES= 16
##.DIGITISER RES= 18
##SPECTROMETER/DATA SYSTEM= dpx250
##.PULSE SEQUENCE= zg30
##.SOLVENT NAME= DMSO
##.SHIFT REFERENCE= (INTERNAL, DMSO, 0, 16.514)
##AUDIT TRAIL= $$ (NUMBER, WHEN, WHO, WHERE, WHAT)
$$ ##TITLE= Audit trail, XWIN-NMR		Version 3.5
$$ ##JCAMPDX= 5.01
$$ ##ORIGIN= Bruker BioSpin GmbH
$$ ##OWNER= NMR
$$ C:\u/data/dgb/nmr/ADRS/11110/pdata/1/auditp.txt
$$ ##AUDIT TRAIL=  $$ (NUMBER, WHEN, WHO, WHERE, WHAT)
(   1,<2005-10-20 13:07:24.16 +100>,<MAYBRIDGE\NMR>,<NMR_250MHZ>,
      <created by zg, POWCHK disabled, PULCHK disabled
       configuration hash MD5:
       62 19 C7 07 E1 42 D1 B7 37 6C 3D D0 77 39 F9 E6
       data hash MD5: 64K
       94 EA 49 64 0A D0 19 D6 15 23 46 B8 6C A7 31 29>)
(   2,<2005-10-20 13:07:35.24 +100>,<MAYBRIDGE\NMR>,<NMR_250MHZ>,
      <Start of raw data processing
       ef LB = 0.3 FT_mod = 6 PKNL = 1 SI = 32K 
       data hash MD5: 32K
       CB 58 56 8A 1D B8 96 26 DA 36 13 26 20 82 63 B3>)
(   3,<2005-10-20 13:07:37.13 +100>,<MAYBRIDGE\NMR>,<NMR_250MHZ>,
      <apk 
       data hash MD5: 32K
       01 52 77 16 42 1F E4 76 8E B2 38 EF C1 5D 8E 3A>)
(   4,<2005-10-20 13:07:37.80 +100>,<MAYBRIDGE\NMR>,<NMR_250MHZ>,
      <abs ABSG = 5 
       data hash MD5: 32K
       D9 8F 52 21 34 76 37 E8 B9 C6 AF A0 B7 5A BF AD>)
$$ ##END=
$$ 
$$ hash MD5
$$ 8E D4 FF 55 08 69 E0 95 3C 9C E0 8C 9C 91 88 AB
##$RELAX= 
##$RELAX= 
##$RELAX= 
##$RELAX= 
##$RELAX= 
##$RELAX= 
##$RELAX= 
$$ Bruker specific parameters
$$ --------------------------
##$DU= <C:\u>
##$EXPNO= 11110
##$NAME= <ADRS>
##$PROCNO= 1
##$TYPE= <nmr>
##$USER= <dgb>
##$AMP= (0..31)
100 100 100 100 100 100 100 100 100 100 100 100 100 100 100 100 100 100 
100 100 100 100 100 100 100 100 100 100 100 100 100 100 
##$AQSEQ= 0
##$AQ_mod= 3
##$AUNM= <au_zg>
##$AUTOPOS= <33 >
##$BF1= 250.13
##$BF2= 250.13
##$BF3= 250.13
##$BF4= 250.13
##$BF5= 500.13
##$BF6= 500.13
##$BF7= 500.13
##$BF8= 500.13
##$BYTORDA= 1
##$CFDGTYP= 0
##$CFRGTYP= 5
##$CHEMSTR= <none>
##$CNST= (0..31)
1 1 145 1 1 1 1 1 1 1 1 1 1 1 1 1 1 1 1 1 1 1 1 1 1 1 1 1 1 1 1 1 
##$CPDPRG= <>
##$CPDPRG1= <>
##$CPDPRG2= <>
##$CPDPRG3= <>
##$CPDPRG4= <mlev>
##$CPDPRG5= <mlev>
##$CPDPRG6= <mlev>
##$CPDPRG7= <mlev>
##$CPDPRG8= <mlev>
##$CPDPRGB= <>
##$CPDPRGT= <>
##$D= (0..31)
0 1 0 0 0 0 0 0 0 0.06 0 0 0 0 0 0 0.0002 0 0 0 0 0 0 0 0 0 0 0 0 0 0 
0 
##$DATE= 1129810043
##$DBL= (0..7)
120 120 120 120 120 120 120 120 
##$DBP= (0..7)
150 150 150 150 150 150 150 150 
##$DBP07= 0
##$DBPNAM0= <>
##$DBPNAM1= <>
$$ [...]
##$SUBNAM7= <"">
##$SUBNAM8= <"">
##$SUBNAM9= <"">
##$SW= 20.6930455092707
##$SWIBOX= (0..15)
0 0 3 0 0 0 0 0 0 0 0 0 0 0 0 0 
##$SW_h= 5175.983436853
##$TD= 65536
##$TD0= 1
##$TE= 295.16
##$TE2= 300
##$TE3= 300
##$TEG= 300
##$TL= (0..7)
0 120 120 120 120 120 120 120 
##$TP= (0..7)
150 150 150 150 150 150 150 150 
##$TP07= 0
##$TPNAME0= <>
##$TPNAME1= <>
##$TPNAME2= <>
##$TPNAME3= <>
##$TPNAME4= <>
##$TPNAME5= <>
##$TPNAME6= <>
##$TPNAME7= <>
##$TPOAL= (0..7)
0.5 0.5 0.5 0.5 0.5 0.5 0.5 0.5 
##$TPOFFS= (0..7)
0 0 0 0 0 0 0 0 
##$TUNHIN= 0
##$TUNHOUT= 0
##$TUNXOUT= 0
##$USERA1= <user>
##$USERA2= <user>
##$USERA3= <user>
##$USERA4= <user>
##$USERA5= <user>
##$V9= 5
##$VALIST= <valist>
##$VCLIST= <CCCCCCCCCCCCCCC>
##$VD= 0
##$VDLIST= <DDDDDDDDDDDDDDD>
##$VPLIST= <PPPPPPPPPPPPPPP>
##$VTLIST= <TTTTTTTTTTTTTTT>
##$WBST= 1024
##$WBSW= 4
##$XGAIN= (0..3)
0 0 0 0 
##$XL= 0
##$YL= 0
##$YMAX_a= 404550
##$YMIN_a= -423054
##$ZGOPTNS= <>
##$ZL1= 120
##$ZL2= 120
##$ZL3= 120
##$ZL4= 120
##$ABSF1= 16.51402
##$ABSF2= -4.179152
##$ABSG= 5
##$ABSL= 3
##$ALPHA= 0
##$AQORDER= 0
##$ASSFAC= 0
##$ASSFACI= 0
##$ASSFACX= 0
##$ASSWID= 0
##$AUNMP= <proc_1d>
##$AZFE= 0.1
##$AZFW= 0.1
##$BCFW= 0
##$BC_mod= 0
##$BYTORDP= 0
##$COROFFS= 0
##$CY= 12.5
##$DATMOD= 1
##$DC= 0
##$DFILT= <>
##$DTYPP= 0
##$F1P= 14.0000005364418
##$F2P= -0.99999901652339
##$FCOR= 0.5
##$FTSIZE= 32768
##$FT_mod= 6
##$GAMMA= 0
##$GB= 0
##$INTBC= 1
##$INTSCL= 1
##$ISEN= 128
##$LB= 0.3
##$LEV0= 0
##$LPBIN= 0
##$MAXI= 10000
##$MC2= 0
##$MEAN= 0
##$ME_mod= 0
##$MI= 0
##$NCOEF= 0
##$NC_proc= -5
##$NLEV= 6
##$NOISF1= 0
##$NOISF2= 0
##$NSP= 0
##$NTH_PI= 0
##$NZP= 0
##$OFFSET= 16.51402
##$PC= 1
##$PHC0= -81.35626
##$PHC1= 10.2025
##$PH_mod= 1
##$PKNL= yes
##$PPARMOD= 0
##$PSCAL= 4
##$PSIGN= 0
##$REVERSE= no
##$SF= 250.130001994267
##$SI= 32768
##$SIGF1= 0
##$SIGF2= 0
##$SINO= 400
##$SIOLD= 32768
##$SREGLST= <1H.DMSO>
##$SSB= 0
##$STSI= 32768
##$STSR= 0
##$SW_p= 5175.98343685301
##$SYMM= 0
##$S_DEV= 0
##$TDeff= 65536
##$TDoff= 0
##$TI= <Analysis number 999999
Compound Code 99
Book Reference 9
Project Code 9>
##$TILT= no
##$TM1= 0
##$TM2= 0
##$TOPLEV= 0
##$USERP1= <user>
##$USERP2= <user>
##$USERP3= <user>
##$USERP4= <user>
##$USERP5= <user>
##$WDW= 1
##$XDIM= 32768
##$YMAX_p= 388017484
##$YMIN_p= -393593
$$ End of Bruker specific parameters
$$ ---------------------------------
##NTUPLES= NMR SPECTRUM
##VAR_NAME=  FREQUENCY,     SPECTRUM/REAL,   SPECTRUM/IMAG
##SYMBOL=    X,             R,               I
##VAR_TYPE=  INDEPENDENT,   DEPENDENT,       DEPENDENT
##VAR_FORM=  AFFN,          ASDF,            ASDF
##VAR_DIM=   32768,         32768,           32768
##UNITS=     HZ,            ARBITRARY UNITS, ARBITRARY UNITS
##FACTOR=    0.157963299565203, 1,           1
##FIRST=     4130.65208560289, 0,            0
##LAST=      -1045.33135125012, 0,           0
##MIN=       -1045.33135125012, -393593,     0
##MAX=       4130.65208560289, 388017484,    0
$$ Real data points
##PAGE= N=1
##DATA TABLE= (X++(R..R)), XYDATA
$$ [...]
17324c0617K4128n9104r0715J50921r907m2326J08561P2240l7549k1307p800k9389
17312B7136j7572K7029j51257K1045L3054n3882m9809Q4577l165m2510M6421n1320
17300a30253L1537M7238r419n2936m6N7804J9281M3282K2370l750j6809q4936
17288g6637K2292M2942J03103J1662j02252k7693k94q9477J4478l1421k9374J26576
17276c6095K969P116l2810k945P1880n2597O2073P309K3150L0392m973o8354l6880
17263b9765M3473K3612l3731k6150o6510L3496J26202l2308J5837j026M3700l8849
17251E7981q4846r8365L6651N7086L7403Q426j32152M1163N6526J9293j4996N2899
17239C7069l9359l5352J01617m4142L9475J3025n7795j25816Q7788J01878m0850
$$ plain form
17324 -30617 -6489 -65593 -156308 -5387 -15294 -57620 50941 123181 85632 64325 56525 27136
17312 27136 9564 36593 -114664 -93619 -60565 -114447 -164256 -79679 -82844 -125354 -78933 -130253
17300 -130253 -98716 -51478 -60897 -113833 -113879 -56075 -36794 6488 28858 25108 8299 -76637
17288 -76637 -54345 -11403 91700 103362 1110 -26583 -26877 -116354 -101876 -133297 -162671 -36095
17276 -36095 -33126 -26010 -58820 -61765 10115 -42482 19591 26900 50050 80442 75469 7115 -29765
17263 -29765 13708 37320 3589 -22561 -89071 -55575 70627 38319 54156 53130 96830 57981
17251 57981 -26865 -125230 -88579 -31493 5910 14336 -117816 -76653 -20127 -834 -15830 37069
17239 37069 -2290 -37642 63975 19833 59308 72333 14538 -111278 -23490 78388 37538
17228C7538j9144p6364L8149m237k0373L8749R9613R2282j803j53690L0920O8462
17216A30102J1121l7360j41070p8358K8207k7300L225r0950K464J28875R4277
17205B3233L2401l7843r0522M2304O04j1888p7743k3618j9038n0564j27032J18576
17193b21130J55654R444m9959m3011Q3760L5554j14186m5345O7122q183Q5358
17182d4922k4821R1342n5999l0571P0410O3845R740o5595l0354j5263o8752O124
17170i4816l5232k3048L5300J37288J06488Q712r2960J9861K6004o3968j5689
17159G940N7456J9228o3453k4001J7167M7931r8944r7340O821L7905L0115n3275
17147a12450M9511J66416K8295r5794k0484p5911M5732N602k6001l6067j08762
$$ plain form
17228 37538 18394 -57970 -19821 -24058 -44431 -5682 93931 186213 184410 30720 61640 130102
17216 130102 141223 103863 -37207 -115565 -87358 -114658 -111433 -202383 -199919 -71044 23233
17205 23233 55634 17791 -72731 -30427 -29823 -41711 -119454 -143072 -162110 -212674 -339706 -221130
17193 -221130 -65476 -56032 -105991 -149002 -65242 -29688 -143874 -189219 -122097 -130280 -44922
17182 -44922 -69743 21599 -34400 -64971 5439 69284 79024 13429 -16925 -32188 -100940 -94816
17170 -94816 -130048 -153096 -117796 19492 125980 134692 41732 61593 87597 23629 7940
17159 7940 65396 84624 21171 -2830 14337 62268 -36676 -134016 -127195 -89290 -59175 -112450
17147 -112450 -62939 103477 131772 35978 15494 -60417 -14685 -9083 -35084 -71151 -179913
17136a79913q4301M9012Q0335J8714L4933J8048p90p580O2604q4946M3377J04117
17124E3610m9825n8887q8382O914k8823m4074k5383J4476N0480L652J25281J36147
17112I5186k1813m7892O5971J07933J2856j45296n8840O4018l7656K3059N4190
17101A11716p067J9475l7167J1724j30051m5200K6170L2868R2320Q7440k3247
17090A38981n7280n0615m7192j00777L9133P7325l1188j3047M0322Q9640q0845
17079D457p0093L3881J78691O5754l2949o5102r8510Q5449o521L1076j4389Q1778
17067A93522l3085o6291N1338N8421P708K6375q0845n8354o3260k8389L7432l4145
17055A0427o0447k4413k3255L9230R2211M7376j56610j60354J11457R1035P689
$$ plain form
17136 -179913 -264214 -215202 -134867 -116153 -81220 -63172 -63962 -71542 -8938 -93884 -50507 53610
17124 53610 3785 -55102 -143484 -136570 -165393 -209467 -234850 -220374 -169894 -166242 -40961 95186
17112 95186 73373 25481 91452 199385 212241 66945 8105 72123 34467 57526 111716
17101 111716 104649 124124 86957 98681 -31370 -76570 -50400 -17532 74788 162228 138981
17090 138981 81701 31086 -16106 -116883 -77750 -425 -31613 -44660 -4338 85302 4457
17079 4457 -65636 -31755 146936 212690 179741 114639 16129 101578 95057 126133 111744 193522
17067 193522 160437 94146 145484 203905 211613 237988 157143 98789 35529 7140 44572 10427
17055 10427 -50020 -74433 -97688 -58458 33753 81129 -75481 -235835 -124378 -33343 -25654
17044b5654k0867o1301K4459N6513J04024o854m1798J669K3306J077k6927k5926
17032A721N1205j3346k7129l2281l3868K0236R7534l7139l366q5510L7854L7205
17020A3116j9961q6959N87L6677l8725N1305k5789j04665K1582J779q3600N4056
17008a80597K9231R759J40088J44258o905j1716j35620J4151M448r822J22357
16997A19632r0040l4668M2943o9288q7312q580j965j6976N965J08100J9851M1207
16985B8869j03674L3264M4411q4161j7902J619J175R8233j3865P136J01020L0002
16973A26127l7103k25250j55J26439J41476p6554j28491j8271O2039K3828l2849
16962c8764N3199l6807l1598l9720P8311l4542L2205J7324m2583L4431m8774p1434
$$ plain form
17044 -25654 -46521 -107822 -83363 -26850 77174 70320 28522 30191 53497 54574 27647 1721
17032 1721 52926 39580 12451 -19830 -53698 -33462 64072 26933 23567 -61943 -24089 13116
17020 13116 -6845 -93804 -93217 -56540 -95265 -43960 -69749 -174414 -152832 -151053 -234653 -180597
17008 -180597 -151366 -141607 -1519 142739 135834 124118 -11502 2649 7097 -2725 119632
16997 119632 29592 -5076 37867 -31421 -118733 -127313 -129278 -146254 -140289 -32189 -12338 28869
16985 28869 -74805 -41541 2870 -81291 -99193 -97574 -96399 1834 -12031 -4895 96125 126127
16973 126127 89024 -136226 -136381 -9942 131534 54980 -73511 -91782 -29743 -5915 -38764
16962 -38764 14435 -22372 -53970 -93690 -15379 -49921 -17716 -392 -42975 -8544 -57318 -128752
16950a28752j0493J56118J0502j13854p7291K6477R2412n795K2504j4252r1756
16939a34180M0920J08640j8492l6015q3041m489J38109M6024q1556J971m8656
16928g0765L6411O2456p7346n6766L4950J01628j55761o6985J62655L9098n1413
16917d1838O7240m0596p9189p1815M9038l7499k3571O9541N2225N208j9022k8098
16905i8376m1683N3662J36938o422m7772p1260r0241N3924j204k532O8596l4912
16893h1282P48Q1806N723j18451N0421J47444P462L094J4374k27521j1786J7845
16881a10123K9988N0746L0178M6389O8762m2257p0574j21564O5366R6601K6299
16870F9811n5158j2922m36j2865l3297K9668l709N9535o319O548l139m6018m9334
$$ plain form
16950 -128752 -139245 16873 27375 -86479 -163770 -137293 -44881 -50676 -28172 -42424 -134180
16939 -134180 -93260 15380 -3112 -39127 -122168 -126657 11452 57476 -24080 -22109 -70765
16928 -70765 -34354 28102 -49244 -106010 -71060 30568 -125193 -192178 -29523 9575 -41838
16917 -41838 25402 -15194 -94383 -166198 -117160 -154659 -178230 -108689 -56464 -51256 -70278 -98376
16905 -98376 -140059 -86397 50541 44119 -3653 -74913 -165154 -111230 -112434 -114966 -46370 -81282
16893 -81282 -80534 1272 6995 -111456 -61035 86409 93871 96965 111339 -116182 -127968 -110123
16881 -110123 -80135 -29389 789 47178 115940 73683 3109 -118455 -53089 43512 69811
16870 69811 14653 1731 1295 -11570 -44867 -15199 -18908 40627 34308 40856 37717 -8301 -57635
16857e7635J25058O3878k4741j85303m4221o6350M2665P0636n3510p1916Q3346
16846a18093P4318O1188N5908N392j18830L2849K9167N2240p0537M7305M4093
16835I5000K243L6073m7242O1858m7182q7813o1790o6656m3743M0l6257K0917
16823a74552J46897N8885j29813o8104R4755P9107Q917L0116O4892m3544p9718
16812a2162K5650j6802Q1741L8304m9663q1522N4434J51506P013j28446q2995
16801a2942p9950P6105M6806L8577o8305j23554J04414R0661O6825k8935j42012
16790c2310P628m3298n5177j351J76886m8553O50M8925l3051n0690J0417K3621
16778C697j4940R007N5915m6086o3596p7573R6258L3818j12066k7779k1539k9761
$$ plain form
16857 -57635 67423 131301 106560 -78743 -122964 -189314 -146649 -76013 -129523 -201439 -118093
16846 -118093 -43775 17413 73321 78713 -40117 -7268 21899 74139 3602 50907 95000
16835 95000 97243 133316 86074 147932 100750 12937 -48853 -115509 -159252 -159212 -195469 -174552
16823 -174552 -27655 31230 -98583 -166687 -71932 7175 16092 46208 111100 67556 -12162
16812 -12162 13488 -3314 78427 116731 67068 -14454 39980 191486 198499 70053 -12942
16801 -12942 -92892 -16787 30019 68596 291 -123263 -18849 71812 138637 109702 -32310
16790 -32310 -24682 -67980 -123157 -124508 52378 3825 4475 53400 20349 -30341 -19924 3697
16778 3697 -11243 -2236 53679 7593 -56003 -133576 -37318 -3500 -115566 -143345 -164884 -194645
16766a94645L9700j5163N9007k2846N0068R5279L2408m8956O5624K7690m9544
16755C8622r4619n334L0854P5834o6966K6740L990r6975m9317K5556J9783P5483
16743a6349R3866O2749p997p1741n0145p7278o9520m6385K752M4369j87L6129
16731i9737M260N0830J49498N6129m7245Q354K5995k2748p5985q102M5589J6268
16719A03106o4116r0447n82Q3239O0838L5994o659M866o8107M5278Q6405p4441
16707A15374q6185L9273J11316m7283k8721j09736K002O2663P7451k8179l8200
16696F9775O7938J8750p9577m8957m0245k2922j14902M5713R8136L5377l2712
16685c626n6551l6570J25608m2680j3494N2774M3302k2938j04326j03001L8065
$$ plain form
16766 -194645 -154945 -170108 -111101 -133947 -83879 11400 43808 -5148 60476 88166 38622
16755 38622 -55997 -61331 -30477 45357 -21609 5131 9121 -87854 -137171 -111615 -91832 -16349
16743 -16349 77517 140266 132269 60528 10383 -66895 -136415 -182800 -180048 -135679 -135866 -99737
16731 -99737 -95477 -44647 104851 160980 113735 122089 148084 125336 49351 41249 86838 103106
16719 103106 38990 -51457 -52039 31200 92038 128032 121373 126239 58132 103410 189815 115374
16707 115374 29189 68462 179778 132495 103774 -5962 -3960 58703 136154 107975 69775
16696 69775 137713 156463 76886 27929 -12316 -35238 -150140 -104427 -6291 29086 -3626
16685 -3626 -60177 -96747 28861 -13819 -27313 25461 68763 45825 -58501 -161502 -123437
16674a23437n2070j6886N8203R7242j4038q253J64515K371j56343q686r99m0602
16662i8983n125P0728R7344L0711r5513q962O7839M269m6142j04724o8748J68438
16650A1132R3168P71o0054J29535M7242r1597n7957p4943r2192Q0822J4258J04819
16638A05004m1513m1047N3824n0910j2362j0171M8503j479j04565o5653J6143
16627a04226K1593j0976n687J41241J261K4900K909J0217K0214j57483r701K7131
16615c8607j60876j6908L4553l7236p4239J24009O5297N2258L065l3636M714l936
16603h1542o721M0545K9301O7824R8421l2444l1084r6833r6137j4478k1465N5877
16591h8736Q6278l7719L7628K0112q8818m9369L2814N2420Q930n6219n7856Q1097
$$ plain form
16674 -123437 -175507 -192393 -134190 -36948 -50986 -59239 105276 107647 -48696 -57382 -58381 -98983
16662 -98983 -104108 -33380 63964 94675 -838 -9800 58039 62308 16166 -88558 -157306 11132
16650 11132 104300 105071 45017 174552 221794 130197 72240 -2703 -94895 -14073 185 105004
16638 105004 63491 22444 76268 25358 12996 2825 51328 49849 -54716 -120369 -104226
16627 -104226 -82633 -93609 -99296 41945 43206 68106 71015 81232 101446 -56037 -65738 -38607
16615 -38607 -199483 -216391 -181838 -219074 -293313 -169304 -104007 -51749 -48684 -82320 -77606 -81542
16603 -81542 -88263 -47718 -18417 49407 147828 115384 84300 -12533 -108670 -123148 -144613 -88736
16591 -88736 -2458 -40177 -2549 17563 -71255 -120624 -87810 -35390 -26460 -82679 -140535 -59438
16579e9438O8738J5591j8884j84501q5153l5041J06946Q4488Q0888o7021l2130
16568a25517j9244Q237O5694K5689m1756k5586k7000J1435o4970Q7828J24465
16557A9275M4304O5185J25011q2666r2744j25602j06343o2474M2623K0901O3081
16546h9449l441j09018M0645L0001N7601q448j7760N8093l0831j6382O5428K4331
16534G70j1869l1229L516N0127k8097o665K714J10196N7958j35671J2205O7454
16522I1409J05469J6271k14414j10182P5202j18603k2325J06926j9605n6742N6393
16511i0201k9036L0997k1063m4788l0819k2300O9081J27560J05177Q7184o7317
16500A14475q5337r9462m4457J2355O7402O2518J08993n9493j50044m0549n7266
$$ plain form
16579 -59438 9300 24891 6007 -178494 -263647 -298688 -191742 -107254 -26366 -93387 -125517
16568 -125517 -144761 -136524 -70830 -45141 -86897 -112483 -139483 -128048 -193018 -105190 19275
16557 19275 63579 128764 253775 171109 78365 -47237 -153580 -216054 -173431 -152530 -89449
16546 -89449 -92890 -201908 -161263 -131262 -73661 -82109 -99869 -41776 -72607 -88989 -23561 770
16534 770 -11099 -42328 -38812 11315 -16782 -23447 -20733 89463 147421 11750 23955 91409
16522 91409 196878 213149 -1265 -111447 -36245 -154848 -177173 -70247 -89852 -146594 -90201
16511 -90201 -119237 -88240 -109303 -154091 -184910 -207210 -138129 -10569 94608 181792 114475
16500 114475 29138 -70324 -114781 -102426 -35024 27494 136487 76994 -73050 -113599 -170865
16489a70865K619M4235n9992j05791J075J16108J17126M2270o7430n5502L6678
16478i9469M1850Q7862j10284j4374L8626r8002N784L8362l2180n6801J06647
16467i1979J6633m5696M1682M1630n9627r346j1085J3261K0864L4613q222q6191
16455a43463j10479K9407K7356R8196J01050N609p2765M4135m0707r5239k2945
16444a79845j8140K4640N1726L9092M8319o7429N8534J76879j02315k8529M328
16433G260p8915j1637O5571J0864L6838o439q0148l6109N0378O9509r3291p9064
16421a45183L5319M5679m0435K6305P5943j3734o8841K4579N9535J655m8483M6623
16409a038K6727Q788n9800K0845o6366j69790N0831J03221N1256L8870J03163
$$ plain form
16489 -170865 -168246 -124011 -184003 -289794 -288719 -172611 -55485 -13215 -80645 -136147 -99469
16478 -99469 -57619 30243 -80041 -94415 -55789 -153791 -148007 -109645 -141825 -198626 -91979
16467 -91979 -75346 -121042 -79360 -37730 -97357 -106703 -117788 -104527 -83663 -49050 -57272 -143463
16455 -143463 -253942 -224535 -197179 -98983 2067 7676 -65089 -20954 -61661 -156900 -179845
16444 -179845 -197985 -173345 -121619 -82527 -34208 -101637 -43103 133776 31461 2932 7260
16433 7260 -71655 -83292 -17721 -6857 29981 23542 -56606 -92715 -42337 27172 -66119 -145183
16421 -145183 -109864 -64185 -104620 -78315 -2372 -16106 -84947 -60368 -833 822 -47661 -1038
16409 -1038 25689 34477 -25323 -4478 -70844 -240634 -189803 -86582 -35326 3544 106707
16398A06707J3808q359K1821o0431j6176j5974m7696j3170O1248m7644n7503j968
16386f5337K1662o3480k9662O9344J02425L1714k5423j30175o9018l0655q375
16375a96980P2050Q1671O4698J44488m2002j01445m2858n4322j05594M0003l7330
16364a77621J0754O0M8369q242m3046k6293n464M3490M7029J07585J61620J6702
16352A74943m9679m0591k8889l5312J2614Q7506P494r8318k74467l4153K6718
16341b52134O9137J43054K9155k4318N2146j1580n2726P985l7430k9148L5785
16330g0074q617j8483P0686k9476l5639n6302j8365l041R3829J9782j0862k8587
16318i5149L8874K0234q6729N5509O2715O5156N3625q5565o7531L4219J950k2822
$$ plain form
16398 106707 120515 112156 133977 73546 57370 41396 -6300 -19470 41778 -5866 -63369 -65337
16386 -65337 -43675 -107155 -136817 -67473 34952 66666 41243 -88932 -157950 -188605 -196980
16375 -196980 -124930 -43259 21439 165927 123925 22480 -20378 -74700 -180294 -140291 -177621
16364 -177621 -166867 -166807 -118438 -126680 -169726 -196019 -201483 -157993 -110964 -3379 158241 174943
16352 174943 125264 84673 55784 20472 33086 120592 128086 29768 -244699 -278852 -252134
16341 -252134 -182997 -39943 -10788 -35106 17040 5460 -47266 -39281 -76711 -105859 -70074
16330 -70074 -78691 -97174 -26488 -55964 -91603 -147905 -166270 -169311 -75482 -55700 -66562 -95149
16318 -95149 -56275 -36041 -122770 -67261 -4546 60610 114235 28670 -38861 -4642 -2692 -25514
16306b5514K5422m7459p2554m1443L5332l884m1003p3937J5678J05337J8757j07658
16294b12926J14346J13703N738l5054j33401j812Q1661K6933J3367N8983K7798
16283E9336M2738k5227P993M8004L6942o6578n9433M3127j3007q8950q7655L7656
16271f5054M4731J0638J04073P5950P278j01388l0247N3918n9043R3510P4610
16260B08976o7811r8929j44557k8724L5566J5693N6915P5374k1819o9643o6612
16249a05571K5295n5226N9992o6178N313k8056n7942Q5253M8458P0910n1800q3048
16237a52600l7323L2301M3842k3736k5619J00724J22604N2083p8628K9901l2449
16226C1100j35180J8794R2099K6307l8351j12496n1846L5279J55037P0642l0019
$$ plain form
16306 -25514 -92 -47551 -120105 -161548 -126216 -130100 -171103 -245040 -229362 -124025 -105268 -212926
16294 -212926 -98580 15123 20861 -14193 -147594 -149406 -67745 -40812 -27445 31538 59336
16283 59336 102074 76847 84840 132844 169786 103208 43775 86902 73895 -15055 -102710 -65054
16271 -65054 -20323 -9685 94388 170338 177616 76228 45981 99899 40856 134366 208976
16260 208976 141165 42236 -102321 -131045 -95479 -79786 -22871 52503 30684 -38959 -105571
16249 -105571 -80276 -135502 -75510 -141688 -136375 -164431 -222373 -137120 -88662 -17752 -69552 -152600
16237 -152600 -189923 -157622 -113780 -137516 -163135 -62411 60193 112276 33648 63549 31100
16226 31100 -104080 -85286 6813 33120 -5231 -117727 -169573 -134294 20743 91385 61366
16215F1366J9040R2633j5287q6491J6093k4437k4163N9101K8040k9044P414k6093
16203G8172n2242k1723J672q8562k2266L1027l1283J8936Q4957M5713r750O249
16191D0900M6722K5187k8647k5673l2180l1316R337P916Q3814j6385n9554l3383
16179a3262l568j6205N4080k1966m7216l4933k9767O2750J7932P7924N17J1102
16167E7388o9753o4515j164q038J9292P9958q9278p8366L9676J45764J06690m2817
16155I4837j28245J0512m2091l4362P2729j14230L9063N4510R5415l9504m0108
16144c1474n6072J6388R3094j17177p9542Q2293J43647J07250n2527l1425q1291
16133f836l7390L6643n4907k5148M2623n5270M0730P2374K5582J2583l9164K1535
$$ plain form
16215 61366 80406 173039 157752 71261 87354 62917 38754 97855 125895 96851 104265 78172
16203 78172 25930 4207 5879 -82683 -104949 -73922 -105205 -86269 -1312 44401 34651 40900
16191 40900 87622 112809 84162 58489 26309 -5007 4330 12246 96060 79675 20121 -13262
16179 -13262 -16830 -33035 21045 -921 -48137 -83070 -112837 -50087 -32155 45769 46286 57388
16167 57388 -12365 -76880 -78044 -86082 -66790 13168 -76110 -154476 -114800 30964 137654 94837
16155 94837 -33408 -22896 -64987 -99349 -26620 -140850 -101787 -47277 48138 8634 -31474
16144 -31474 -87546 -71158 21936 -95241 -174783 -92490 51157 158407 105880 74455 -6836
16133 -6836 -44226 -7583 -62490 -87638 -45015 -100285 -59555 12819 38401 50984 11820 33355
16121C3355k7738j2532K797R2842m6947r7842l9879O7066p3383r79L1310j14172
16109a86102n4338K9856J11966M0299j1128M7949k4147k1103j9513O0911l2522
16098e7872n808j1028k6393n2628p1408k9717O6260M7458K8583j4528k9402R5606
16086f0877L5855j26227Q3446J52044m6603l6498R4372j04964j86136m4227N1726
16075a88089L9761K2440L1953J15393j2683k4798K4576J36699k5018j45511l2591
16064e7868N7104J1023J67045L7825n7799q3774o1603J01768j3647j51956q4831
16053a36713J16656R7560r5219m9363J3590l464P3887j5410r7220M1381J08149
16042E3834o573j6822L4815N044n2970J7876O2835k935M2559K7098j7116j6942
$$ plain form
16121 33355 5617 -6915 -4118 88724 41777 -56065 -95944 -28878 -102261 -103240 -71930 -186102
16109 -186102 -240440 -210584 -98618 -58319 -69447 -21498 -45645 -66748 -86261 -25350 -57872
16098 -57872 -63680 -74708 -101101 -153729 -225137 -254854 -188594 -141136 -112553 -127081 -156483 -60877
16086 -60877 -25022 -151249 -67803 84241 37638 1140 95512 -9452 -195588 -239815 -188089
16075 -188089 -148328 -125888 -93935 21458 8775 -16023 8553 145252 120234 -25277 -57868
16064 -57868 -764 10259 177304 215129 157330 73556 11953 113721 100074 -51882 -136713
16053 -136713 -20057 77503 -17716 -67079 -53489 -56953 16934 1524 -95696 -54315 53834
16042 53834 47261 30439 65254 70298 17328 35204 98039 95104 137663 164761 147645 130703
16030A30703J472k6646k0404p212J825l5291q2873m9782L7891j0274q5472q787
16018a54850O2379O1578k2418m5836j76861Q8350J27283O4961P142J00318J22900
16007B34946r5509j17852q7115j0528N1759N5181l7798m2162j30341j3579J05612
15996h7386J14155L9101k1371N4545q1300m1696J8545p8539m7934Q09P5186o5159
15984a21044L9370J42271P5478k9261j19702j20851l1721Q0931J13671N2585j00140
15973a8413n5875R814J6324k8763p953q0589k6847n4057n8458M0155p172N6031
15961b15803O8600N5843m285P2135o909m2637k3022j3143M5092J00843o391k1729
15949H594L570K9106J8490m6794L4381N7325j238j4424j1524j08535m3747J5917
$$ plain form
16030 130703 132175 105529 85125 77913 79738 44447 -38426 -88208 -50317 -60591 -146063 -154850
16018 -154850 -92471 -30893 -53311 -99147 -276008 -187658 -60375 4586 11728 112046 234946
16007 234946 139437 21585 -65530 -76058 -24299 30882 -6916 -49078 -179419 -192998 -87386
15996 -87386 26769 65870 44499 99044 17744 -23952 -5407 -83946 -131880 -131071 -55885 -121044
15984 -121044 -81674 60597 136075 106814 -12888 -133739 -165460 -84529 29142 81727 -18413
15973 -18413 -74288 -64474 -48150 -76913 -84866 -165455 -192302 -246359 -304817 -264662 -271834 -215803
15961 -215803 -147203 -91360 -95645 -23510 -30419 -73056 -96078 -109221 -64129 36714 30323 8594
15949 8594 12164 41270 59760 12966 47347 104672 103434 89010 77486 -31049 -74796 -58879
15937e8879P6774K8085n5156J8628N0001m6523j29572N0569M9630p0395j32733
15926b19571L1855J630L1519P4p007J3810j1168L9627L469r738n0902M3040j317
15913a34679j6321m2115p893Q5327j102J6627j17428l6414N446m72L9915R0124
15901a18985P2622o292P433j7647o5026q88Q1238R8218Q9801J9553r232k3803
15889A26992l3920p8242N7698O1242Q9341n2187j00472k4468j5042P6143l0057
15878G7028j13059j9387L3099k8088P9459o5207N1518Q6323P050j19512j13408
15867a24184J1636J10486M2921n8789K2971N1795j4907q0546j06853j04962J7933
15856b32499k1543P0892Q924O707N4439P6016n936j34555n846Q2596N7645O7838
$$ plain form
15937 -58879 17895 45980 -9176 9452 59453 12930 -116642 -66073 -16443 -86838 -219571
15926 -219571 -187716 -186086 -154567 -154493 -161500 -147690 -158858 -119231 -115762 -125500 -176402 -133362 -134679
15913 -134679 -151000 -193115 -201008 -115681 -116783 -100156 -217584 -253998 -248552 -249024 -209109 -118985
15901 -118985 -46363 -52655 -45222 -62869 -127895 -128783 -47545 50673 140474 160027 150795 126992
15889 126992 93072 14830 72528 133770 223111 170924 70452 45984 30942 107085 77028
15878 77028 -36031 -55418 -22319 -50407 29052 -36155 15363 101686 108736 -10776 -124184
15867 -124184 -112548 -2062 40859 -17930 5041 56836 41929 -38617 -145470 -250432 -232499
15856 -232499 -254042 -183150 -174226 -167519 -113080 -37064 -43000 -177555 -183401 -100805 -43160 24678
15844B4678K4230n4698R6106J1310k4031N3742l7538J3189j40725n3390j987M0954
15832d8160M1882o0265m2255P280k400m601J07068Q1561k0141m6866K3373K0900
15820E7376k6780m1785j7120j22025l5432j9671J8892O4734K6745r0832R9165
15809h6733O2702o2489k6027n5331m1092J52461P2197K7711p8295J8716n6869
15798g3049l1149o1967M5506L1655M4159L1666M2093O3269P3839N39j3198L6168
15786A89531m84o0158l0209n8543j07521J03813J53198k6359j43507R3230N359
15775A18350p8407m3524q6384o7474N0270L8231M689Q8261l7961J9103J7600r1216
15763f8462j21799q1706P0286P2516R9024M1962k2897M9500J4595j4837j51441
$$ plain form
15844 24678 48908 -5790 90316 101626 77595 131337 93799 106988 -33737 -87127 -89114 -48160
15832 -48160 -6278 -66543 -108798 -101518 -103918 -108519 -1451 80110 59969 13103 36476 57376
15820 57376 30596 -11189 -28309 -150334 -185766 -205437 -186545 -121811 -95066 -185898 -86733
15809 -86733 -24031 -86520 -112547 -167878 -208970 -56509 15688 43399 -34896 -16180 -73049
15798 -73049 -104198 -166165 -120659 -89004 -44845 -13179 28914 92183 166022 166561 153363 189531
15786 189531 189047 128889 98680 40137 -67384 36429 189627 163268 19761 112991 118350
15775 118350 39943 -3581 -89965 -157439 -107169 -68938 -64249 24012 -13949 5154 22754 -68462
15763 -68462 -190261 -271967 -201681 -129165 -30141 11821 -11076 38424 53019 38182 -113259
15752a13259j14355L494O043J25422J25537m2145k1929L4028q481n5749n663J4763
15740e2294j02277M671J37020J0607r1883r4397O1938J29534O388m734J22888
15729A27461N0383j16717o9567j7338P3044Q6672r8781J6506l803l6922J8981
15718B9919k2480n0307q6049k9930N4689j5535M976R4802M3997k9412m2504L2441
15706a5393l4115j52323p900J30689J3561m6711p132k7363L3119L3914J1651K5381
15694d2622k2251k5481m9563N7588l882o832R7724L5540J1317L3561K1699j8395
15682H8403j2854m9802l4311N238J1035m0398p2873j2417Q1666J02339o1675k4960
15670b0609j65234L7595M5951q101k9063L0729m254K7490m635Q0312Q9254p7575
$$ plain form
15752 -113259 -227614 -224120 -218077 -92655 32882 -9263 -31192 2836 -5645 -61394 -67057 -52294
15740 -52294 -154571 -149900 -12880 -2273 -94156 -188553 -126615 2919 9307 4573 127461
15729 127461 177844 61127 -8440 -25778 47266 133938 35157 51663 47860 10938 29919
15718 29919 7439 -42868 -128917 -158847 -104158 -119693 -114717 -19915 24082 -5330 -47834 -15393
15706 -15393 -49508 -201831 -209731 -79042 -65481 -112192 -119324 -146687 -113568 -79654 -68003 -42622
15694 -42622 -64873 -90354 -139917 -82329 -86211 -93043 4681 40221 51538 85099 106798 88403
15682 88403 75549 25747 -8564 -3326 7709 -32689 -105562 -117979 -36313 66026 4351 -20609
15670 -20609 -185843 -148248 -102297 -110398 -139461 -108732 -112986 -85496 -90131 -9819 79435 1860
15658A860j16968k0726L9350L7802L5461q0969p6350l3634J5864j4M8862N0319
15646i9143p568O3288l0520j3875M8356K2570M764K8802N3517m9252M5210N036
15634G1185j00751K7800Q0039l325P0463n4297j43968q995K03323J497n0445M9493
15622A42019j48r3020l553N4885k5248k5615j06560o6654P0801p5291j6692o56
15610a45732J56181N9353j50687K3067J21451O2266L7068j61912K6742M5582P270
15599H0649N0152R508j0291j31020j2690q363p0780o036J03403L3838N4260O4663
15587A57293o4756m7823n145o7203L0811L3541k6168j10983Q805N2539J2355n7970
15575h4704O2673J7442J9973K2873O2688K5274j32941k6382o817k4442M0901M1677
$$ plain form
15658 1860 -115108 -135834 -96484 -58682 -23221 -104190 -180540 -214174 -198310 -198324 -149462 -99143
15646 -99143 -106711 -43423 -73943 -87818 -39462 -16892 -12128 16674 70191 20939 66149 71185
15634 71185 -29566 -1766 78273 74948 145411 91114 -52854 -61849 141474 142971 92526 142019
15622 142019 141871 48851 45298 100183 74935 49320 -57240 -123894 -53093 -128384 -145076 -145732
15610 -145732 10449 69802 -80885 -57818 63633 125899 162967 1055 27797 73379 80649
15599 80649 130801 140309 130018 -1002 -13692 -22055 -92835 -98871 4532 38370 92630 157293
15587 157293 92537 44714 39569 -27634 3177 36718 10550 -100433 -91628 -39089 -26734 -84704
15575 -84704 -22031 -4589 15384 38257 100945 126219 -6722 -33104 -39921 -64363 -23462 18215
15563A8215p6528m89J30821n8750N7316n5723K3731K3059j23627r5847o2028N9656
15551a60194J11138P7268m6069K1943N9006K0956q6439N0638M0818j12099n4146
15540g7180k9944N9303O6108n677p1443M8418Q389J7281J5524j7658q570r3443
15528h8892p4054J141J5704K484O6609j5431j0282r5048J7998O6454J1984J3970
15516h7363Q0674J713K859P7174q4386r4906q6906O0589J37759N2254j088K8849
15504H7222n0784O870p4370Q949r8400L8747o0300K8357Q2046M1069m0014j40294
15492a70902k3405J5404J9483j3335N7973J9555n0654j850P7017J39835p482j04071
15480d2432j40060P4021j9995l1683J9689j2146J5611j7678k3205K5488L370j6809
$$ plain form
15563 18215 -58313 -58802 72019 13269 70585 14862 38593 61652 -61975 -157822 -219850 -160194
15551 -160194 -49056 28212 -17857 4086 63092 84048 -2391 48247 89065 -23034 -77180
15540 -77180 -107124 -47821 18287 12610 -58833 -10415 -2026 15255 30779 13121 4551 -88892
15528 -88892 -162946 -161805 -146101 -143617 -77008 -92439 -102721 -197769 -179771 -113317 -101333 -87363
15516 -87363 -6689 -4976 -2117 75057 -9329 -104235 -191141 -130552 7207 59461 58373 87222
15504 87222 36438 43308 -31062 -22113 -120513 -81766 -142066 -113709 -31663 9406 -30608 -170902
15492 -170902 -194307 -178903 -159420 -172755 -114782 -95227 -145881 -147731 -70714 69121 61639 -42432
15480 -42432 -182492 -108471 -128466 -160149 -140460 -152606 -136995 -154673 -177878 -152390 -149020 -165829
15468a65829j9095m3010k4154K5252J03372J05572M3887Q124o4588l5479M93M3064
15456b2391k1880M1239R3570L4478k5127J1873K2661o9087r7028N8737l0545N4765
15444E1265q424j1731k82l5633j25388o1890J5174N3042J54431k4408N1914o5279
15432g209K245J15637N213k0313p1201n6551p5645k2371J26594J4577N0522k0497
15420D1001L5588R6198n4378j15162j02593p8274L735p560J12817l8521j6448
15409a23597j2893q6950q306P3406Q2780L3212J6791j15538n925k743o0998N0936
15397a59825J37200P0459J9222l3135p3250o1318m1172R5975j0012j48848Q4271
15386a20433J26386L5385N4500N5030n4015k23272j22864P3167J45413Q6683m4992
$$ plain form
15468 -165829 -184924 -227934 -252088 -226836 -123464 -17892 25995 34119 -30469 -65948 -65455 -22391
15456 -22391 -44271 -3032 90538 125016 99889 111762 134423 65336 -31692 27045 -3500 51265
15444 51265 42841 31110 30828 -4805 -130193 -192083 -176909 -123867 30564 6156 58070 -7209
15432 -7209 -4964 110673 115886 95573 24372 -32179 -107824 -130195 -3601 10976 61498 41001
15420 41001 76589 172787 118409 3247 -99346 -177620 -173885 -181445 -68628 -107149 -123597
15409 -123597 -136490 -223440 -231746 -158340 -75560 -42348 -25557 -141095 -147020 -149763 -210761 -159825
15397 -159825 -22625 47834 67056 33921 -39329 -100647 -141819 -45844 -55856 -204704 -120433
15386 -120433 5953 41338 95838 150868 96853 -126419 -249283 -176116 -30703 55980 10988
15375A0988n1021q4447j0735J28559O4915J8340m3549K7359r6458l0588J093K4287
15363d1257Q1748P6403J8635k802m798l3058J3724N1412J5246O823l7887q2470
15351F1719R419Q650r758L8201l8510j0612P181l2765l1592o5615p1184k4312
15339a59178j223J3273P5352N3906j7576Q0115Q7640j37149n785Q7269k1795j55966
15327a01117o3890R0730M9055M465k3187M4931q241j08463l3917O6492Q3037j22946
15315a23051j7050M4723K4903K5620M9674q367Q433j7583j21107L6616K7498m0045
15303a09736M6054k3955m4928O6884Q1187Q2396q409K4581j6450p8768l8717j8635
15291c8496r6752o9921K5381O0385J9075J07445n5863N6806J10357M1350j7511
$$ plain form
15375 10988 -40033 -124480 -135215 -6656 58259 76599 33050 60409 -36049 -66637 -65544 -41257
15363 -41257 40491 116894 135529 132727 127929 94871 108595 160007 175253 182076 144189 61719
15351 61719 71138 79788 70030 108231 69721 59109 66290 33525 1933 -63682 -134866 -159178
15339 -159178 -160401 -147128 -71776 -17870 -35446 44669 132309 -4840 -10625 76644 54849 -101117
15327 -101117 -165007 -74277 -25222 -20757 -43944 987 -7254 -115717 -149634 -83142 -105 -123051
15315 -123051 -140101 -95378 -70475 -44855 4819 -3548 4885 -12698 -133805 -97189 -69691 -109736
15303 -109736 -63682 -87637 -132565 -65681 15506 97902 89493 114074 97624 18856 -19861 -38496
15291 -38496 -135248 -205169 -179788 -119403 -100328 7117 -48746 8060 118417 159767 142256
15280A42256j6486N0971k9324n5310q2788m5342n2731L5267L8908J8154J8978
15269B2553J6725Q468q452n20M8630K5699M9565j14155n9245M8453m7880L2534
15257B2375J2849j02138q4013O2762R2926m5749n9882J14916N1858q0306l4449
15246d8851J5090K9631P0374p3035o145Q5089m6751O4543R318J9056N4398l8112
15234A34605m0571k1272r7333L2575M7012k2100m4114j1756m4577k6904R0214
15223d221L9807L7667Q3381K6484Q565n4013n0985m6090j36144J2613m7295m4648
15211a74879j3217L9401n334O0662K4736k4725L1193k140J7021k527m3971l9421
15199a33201M7781j1852O8531J20592l5942m5469m4234l8999J7126j5388k4153
$$ plain form
15280 142256 125770 176741 147417 92107 9319 -36023 -88754 -53487 -14579 3575 22553
15269 22553 39278 47746 39294 38774 87404 113103 162668 48513 -10732 37721 -10159 22375
15257 22375 35224 -66914 -150927 -88165 4761 -40988 -100870 14046 65904 -14402 -48851
15246 -48851 -33761 -4130 66244 -6791 -12936 72153 25402 89945 99263 118319 172717 134605
15234 134605 94034 72762 -24571 8004 55016 32916 -11198 -22954 -67531 -94435 -4221
15223 -4221 35586 73253 156634 183118 191683 137670 86685 40595 -95549 -82936 -130231 -174879
15211 -174879 -188096 -148695 -154029 -93367 -68631 -93356 -62163 -64303 -47282 -49809 -93780 -133201
15199 -133201 -85420 -97272 -28741 91851 55909 10440 -33794 -72793 -55667 -71055 -95208
15188i5208k4121k1796L2666j2137J05501n7898K5337K0335n3512j2952j16293
15177b10078K7554J15527o343l9582j2891J4793n3010L5742M3923Q1901K5586
15166B3122o8249m0604K7970O1416j9798j07818j02679P8929J17676l3279q527
15155g1841K2932J2073k9046M1247j9593J4681n9605O628K0015L2347N6874O9833
15143I6545K0230o1632j38697L8317K2860R764M8939N2094o4363J1832p27j06344
15131g1182K088J38456M0059j00918j64773j5381N1477J7242P8674q3549j41131
15120b48938l4875K3436R7326R4956N5080K1471q06N909M719j3616r4340L4587
15108e5091M3803l0247l2701j44635N859Q9495M4816R9021M8716r5385m3931p044
$$ plain form
15188 -95208 -119329 -141125 -108459 -120596 -15095 -72993 -47656 -27321 -80833 -93785 -210078
15177 -210078 -182524 -66997 -73340 -112922 -125813 -111020 -164030 -128288 -84365 -2464 23122
15166 23122 -45127 -85731 -57761 3655 -16143 -123961 -226640 -147711 -30035 -63314 -71841
15155 -71841 -48909 -36836 -65882 -24635 -44228 -29547 -89152 -82524 -62509 -30162 26712 96545
15143 96545 116775 55143 -83554 -45237 -22377 -12613 36326 88420 24057 35889 35162 -71182
15131 -71182 -69094 69362 109421 8503 -156270 -171651 -120174 -102932 -24258 -107807 -248938
15120 -248938 -283813 -260377 -163051 -68095 -13015 8456 7650 13559 18278 4662 -89678 -55091
15108 -55091 -11288 -41535 -74236 -218871 -213012 -123517 -78701 20320 69036 -26349 -70280 -77324
15096g7324l8480M4245l8226o7734j4300k2280j04839p4655J55125R6623J9249
15085a22596k6189M4931L0915M9934P43k554k4450J11281P857q4960O1110N1602
15073I7624n8210O2700Q7872M8496j14562q8873j4017j16011N2945K8486J4707
15062A157o1178L9757l9037j29389O7665N1357k6101N5344n6244k1778M9073o4435
15050a33809O696j4273K8616M6947K1863l9677j7169J2695O9097j2264k7727j8123
15038g7128n0987k4051L3266P9700k0183O646J7825m8634M7248M4768r7680m0117
15026a29327J24200M7633P970j4180M4555o0254l6209l2608o054l2420P5145J8897
15014G348j237l4119K8176n8316m8146k7814O9154L9209L9236M5042q426o6785
$$ plain form
15096 -77324 -115804 -71559 -109785 -177519 -191819 -214099 -318938 -393593 -238468 -141845 -122596
15085 -122596 -148785 -103854 -72939 -23005 -22262 -24816 -49266 62015 69872 -15088 46022 97624
15073 97624 39414 102114 189986 238482 123920 35047 21030 -94981 -42036 -13550 1157
15062 1157 -60021 -20264 -59301 -188690 -121025 -69668 -95769 -40425 -96669 -118447 -69374 -133809
15050 -133809 -127113 -141386 -112770 -65823 -43960 -83637 -100806 -88111 -19014 -31278 -59005 -77128
15038 -77128 -128115 -152166 -118900 -39200 -59383 -52737 -34912 -83546 -36298 8470 -89210 -129327
15026 -129327 -5127 42506 50476 36296 80851 20597 -15612 -48220 -54274 -86694 -11549 7348
15014 7348 6111 -28008 168 -58148 -106294 -134108 -64954 -25745 13491 58533 50107 -16678
15002a6678j17024Q2348O5193k3999R46k1869o2430m4781m328K5595J5998L0244
14990g0785r999j5167K6704l8006o432k4234N5293J1785p1954p566M8015J55475
14978E3129n3511O2501P53L6260o2122N6898q9877j24614j12218q778J95498M2983
14966c098j24234l7407K07961K1906r0719K4322m2231l4637O6183P6197q2196
14955a7953p8964K9552N4620L9774J5446J7854p4053P02N068k4086L5015L9746
14943D2721K3252L8867l9586L6394r3529j2642K9384o5434O154r167k9287j7429
14931i0302j08564J7986R9011J32977M2227o3055M8598k7082j5057o1586l5086
14920e9933k8885j2728M5941j0401N5324q2430o7248k9092J05745R5301P1029
$$ plain form
15002 -16678 -133702 -51354 13839 -10160 -9214 -31083 -93513 -138294 -142622 -117027 -101029 -70785
14990 -70785 -80784 -95951 -69247 -107253 -113685 -137919 -82626 -70841 -142795 -150361 -102346 53129
14978 53129 -382 62119 62872 99132 37010 93908 4031 -120583 -232801 -241579 -46081 -3098
14966 -3098 -127332 -164739 43222 65128 -25591 -1269 -43500 -78137 -11954 64243 -17953
14955 -17953 -96917 -67365 -12745 27029 42475 60329 -13724 -13022 -7954 -32040 2975 42721
14943 42721 65973 104840 65254 101648 8119 -4523 24861 -40573 -34419 -43586 -72873 -90302
14931 -90302 -198866 -180880 -81869 51108 93335 30280 78878 51796 36739 -24847 -59933
14920 -59933 -88818 -101546 -55605 -66006 -10682 -93112 -160360 -189452 -83707 11594 82623
14909H2623r9831j40923j0789P5254J44522J39687j8482j13725q5514J8753K7487
14898A9062J0970J116j26986k6666N5201L1979m3540J5707R0658n0291k9579n5808
14886a08177L7417M3028J22442O3453r0071K657q1281k6009k3186m9606P6720
14875c2613P3570K2443j2561j9644o5602m1546k2229J2284k1891K4218r836k5120
14863a18527K2085J08258J07346j1509l4129p3869o9434l7284L2007M4257L6518
14852E719O6508m3483l5204k0887j03046K0423k7206r0376J09784P0725O3254
14841A6211q3832m7613K7347R658K1864J34719O741j46473N8638M8996J41R10
14829D7307m134K2126j26757j32938l2493Q8804J17449K9582j6136N4936o605
$$ plain form
14909 82623 -17208 -158131 -168920 -93666 50856 190543 172061 58336 -27178 -8425 19062
14898 19062 30032 31148 -95838 -122504 -67303 -35324 -78864 -63157 27501 -22790 -52369 -108177
14886 -108177 -70760 -27732 94710 158163 68092 70749 -10532 -36541 -59727 -109333 -32613
14875 -32613 40957 63400 50839 31195 -34407 -75953 -98182 -85898 -107789 -83571 -93407 -118527
14863 -118527 -96442 11816 119162 107653 73524 -345 -69779 -107063 -75056 -30799 5719
14852 5719 72227 28744 -6460 -27347 -130393 -109970 -137176 -227552 -117768 -47043 16211
14841 16211 -67621 -115234 -87887 -78229 -56365 78354 85095 -61378 -2740 46256 46397 47307
14829 47307 43173 65299 -61458 -194396 -226889 -138085 -20636 8946 -7190 47746 41141
14818D1141M404P0832P7778m0939j0087k9405j42298j26382o858N6188N3777p7245
14806a29094N3676j2877j387j5126m1452J54196J0062K7598K8527Q601p2834o5905
14794e6015o1670j6490k1904Q4633J72069N6174n6357q3925k6670m1899m6980
14783i9034M4885O4605r1879k1445q1609l3738R6899J24848O6076p7911j17616
14772a25919m6403k0916k6793P1021M9015N2294M2365N3302J53717P0860p0898
14761B01645p5979j46967j18017n2706J03594P1667P785L892J01782p127j27912
14750c8343Q970m054k4732m4024o4730n0066J691N9956M0883K1915j3859J03877
14738b516l357L0920o5273p269O9969o0598j7623P5525l9703j47505M6481M1966
$$ plain form
14818 41141 45545 116377 194155 153216 143129 113724 -28574 -154956 -161814 -105626 -51849 -129094
14806 -129094 -75418 -88295 -89682 -104808 -146260 7936 17998 45596 74123 82724 9890 -56015
14794 -56015 -117685 -134175 -156079 -71446 100623 156797 100440 16515 -10155 -52054 -99034
14783 -99034 -54149 10456 -81423 -102868 -184477 -218215 -121316 3532 69608 -8303 -125919
14772 -125919 -172322 -193238 -220031 -149010 -99995 -47701 -5336 47966 201683 272543 201645
14761 201645 125666 -21301 -139318 -192024 -88430 -16763 -8978 -5086 96696 89569 -38343
14750 -38343 -29373 -33427 -58159 -102183 -166913 -216979 -215288 -155332 -114449 -92534 -106393 -2516
14738 -2516 -5873 25047 -40226 -47495 22474 -38124 -55747 19778 -19925 -167430 -120949 -78983
14726g8983M4873j7806n952J7065r725J5009M6644J1660k2276k4216j66983m6862
14714b37552O7120N1401L2340r026L3592P7844Q2091j2395j34403N3298J9172
14703B3482J6112L8659k7794n1342j50191q6095J37567J02804l7135l223Q7097
14692D9941k3306l9980n873k1734l1727K4361p0947P3032q3232M9212J18628K5787
14680F4162k1369l7666j0774j2032p05K2266r5206j13756Q185k6099Q4474P2948
14668f5572o6337O8951Q0727j9167j22153n0364M8427J2122J01200M0429L4839
14657F3102l7821j26903o6705p0930J6133M5850N772J1141k6245o0016m8103P5490
14645b19235j4548O7735L9290K3388R0258o056M5750o2888Q036J9863l4385m6080
$$ plain form
14726 -78983 -34110 -51916 -57868 -40803 -50528 -35519 11125 22785 509 -23707 -190690 -237552
14714 -237552 -170432 -119031 -86691 -95717 -62125 15719 97810 85415 -48988 4310 23482
14703 23482 39594 78253 50459 -883 -151074 -237169 -99602 3202 -33933 -37156 49941
14692 49941 26635 -13345 -19218 -40952 -72679 -48318 -119265 -46233 -129465 -80253 38375 64162
14680 64162 42793 5127 -5647 -17679 -18384 3882 -91324 -205080 -196895 -222994 -138520 -65572
14668 -65572 -131909 -62958 17769 -1398 -123551 -173915 -125488 -113366 -12166 28263 63102
14657 63102 25281 -101622 -168327 -239257 -223124 -177274 -171502 -160361 -186606 -246622 -294725 -219235
14645 -219235 -233783 -166048 -126758 -103370 -13112 -19168 26582 -36306 -28270 -8407 -42792 -88872
14633h8872p3542K9993L6364k3403l9159r5669k1352P7645K9961m7932N0407J39138
14621b6421L4779J3067j86721K1809L5022Q7613K6122r3553l0403n5956o8248
14610b42890l5150j2980l5548Q9542J16383l7808O1583K3035Q719J3594N9101
14599G581j7313j35080n8300Q559L3193o2577p8587M3139J11750j5118Q8331J6732
14587e7690l7854R8605O7038k3876q2797J2649j21643k4358O0815j6029M0388
14576h4752J13901J2538k8865J43224k0922j77661o0019j6654n9876R1241j0607
14565i8452J2832L0944r6041l4776Q0132J11169J8261K6122P5599J1143J2618
14554A49551J6119r1248j06278j3175Q6130R4468j12022j03043Q2422Q6729K3800
$$ plain form
14633 -88872 -162414 -132421 -96057 -119460 -158619 -254288 -275640 -197995 -168034 -215966 -165559 -26421
14621 -26421 8358 21425 -165296 -143487 -108465 -20852 5270 -88283 -118686 -174642 -242890
14610 -242890 -278040 -291020 -326568 -237026 -120643 -158451 -96868 -73833 -65114 -51520 7581
14599 7581 -9732 -144812 -203112 -194553 -161360 -223937 -302524 -259385 -147635 -162753 -74422 -57690
14587 -57690 -95544 3061 70099 46223 -36574 -23925 -145568 -169926 -109111 -125140 -84752
14576 -84752 29149 41687 12822 156046 135124 -42537 -102556 -119210 -179086 -87845 -98452
14565 -98452 -85620 -54676 -150717 -185493 -105361 5808 24069 50191 125790 136933 149551
14554 149551 165670 74422 -31856 -45031 41099 135567 23545 -79498 2924 89653 113453
14543A13453O770n0302k4399o5507J7195k9400j2830k6218q312m8793n0266q2465
14531b61074J4366J17450J00912J12843J54735L6081r5310j01733p6637j18284
14521a16651m3462q505k0828n8027L8162J84646Q1868o5831j05015L0175n212
14510h8680o6867j5139J2414P0800K9523J28082l1634p3491o433O6194L1776M1858
14498I8403j5515k3612k9167K0573j65115o6558P2463K0939Q457o6060K0714j5088
14486a39566O0682J28541j9524M4986K5051R0070j9228m4986j04129p8870n6466
14475a13439j4933O5985O4134k1292j1298O3235l1739L5615k8412k2100n5012
14464f9256N0862J9796r6618l8792r599k3135J23431K3654l4526Q8792l4248n0698
$$ plain form
14543 113453 120223 69921 45522 -19985 -2790 -32190 -45020 -71238 -79550 -128343 -178609 -261074
14531 -261074 -246708 -129258 -28346 84497 239232 275313 180003 78270 1633 -116651
14521 -116651 -160113 -168618 -189446 -247473 -209311 -24665 57203 -8628 -113643 -83468 -88680
14510 -88680 -155547 -170686 -158272 -87472 -57949 70133 38499 -34992 -41425 24769 56545 98403
14498 98403 82888 59276 30109 50682 -114433 -180991 -108528 -87589 -79132 -145192 -124478 -139566
14486 -139566 -78884 49657 30133 75119 100170 190240 171012 126026 21897 -56973 -113439
14475 -113439 -128372 -62387 1747 -19545 -30843 32392 653 36268 7856 -14244 -69256
14464 -69256 -18394 1402 -95216 -134008 -143607 -166742 -43311 -19657 -54183 34609 361 -50337
14452e0337m3006l5785N2111M0826O1930J32741k9739p2626L0858J942l8863n1687
14440a635q2453q4369M4505R2544R8043o4518N8139m122p134o6149p6963J3691
14428h0421J9434m1992n6286j088O6710p2269J1763J21813m1265N5602j9688L8751
14416A064K3898K4383J6027Q3053m0623m0371p0963j5738J6992p318J6085K8793
14404C5282j22618m4609N5778l2899L8361L393n3057N1329K2925m5508o672Q2268
14392a6027o3451j04132K1279L7155n2160J02784M3185Q1739L6493j02646p4378
14381i0159m8334L7400M1195k1296m0567n8210j19610p2176J46177J00803L847
14370a20930L4443J2042k0226Q1587M1808K8277L5928n3733j2575o4147k0186
$$ plain form
14452 -50337 -93343 -129128 -77017 -36191 25739 158480 128741 56115 86973 88915 50052 -1635
14440 -1635 -84088 -168457 -123952 -31408 66635 2117 60256 56134 49000 -17149 -94112 -80421
14428 -80421 -60987 -102979 -159265 -160353 -93643 -165912 -154149 -32336 -73601 -17999 -37687 1064
14416 1064 24962 49345 65372 148425 107802 67431 -3532 -19270 -2278 -9596 6489 35282
14404 35282 -87336 -131945 -76167 -109066 -70705 -67312 -120369 -69040 -46115 -91623 -98295 -16027
14392 -16027 -79478 -183610 -162331 -125176 -177336 -74552 -31367 50372 86865 -15781 -90159
14381 -90159 -138493 -101093 -59898 -81194 -121761 -179971 -299581 -371757 -225580 -124777 -120930
14370 -120930 -86487 -74445 -94671 -13084 28724 57001 92929 39196 26621 -37526 -57712
14359e7712K1950J4689l2993N9796N3565k066P025J0862k1634q3244l5751o1041
14347a26554n1924K0169P4595R7991J437Q0814p281N0165j01038n8629K7801j4684
14335g138k0313L6663Q962J18865O3710n1429k34807r6908O0960j1002r0258K0876
14323b01819J22823o7259L9587P8101K1855K709j84245o1848N0480J61407J02911
14312F4702j01545q4526L4087k0691M4298Q0621m4102p625K9599o5937j20886
14301a92005R6867P7335p295k060o6626k1422R3081r7490m0237K4792l724J39851
14289A067J99633l4868j02760K873P1120N092O006o3560k20483O7681Q4330M3188
14277E9319p5990k7884P6685J9542p0103N580J17028q720j9254o737k006j14590
$$ plain form
14359 -57712 -35762 -21073 -54066 5730 59295 57229 64254 75116 53482 -29762 -65513 -126554
14347 -126554 -178478 -158309 -83714 14277 15714 96528 89247 139412 38374 -20255 7546 -7138
14335 -7138 -27451 9212 18174 137039 200749 149320 -85487 -182395 -121435 -132437 -222695 -201819
14323 -201819 -78996 -146255 -106668 -28567 -6712 -4003 -188248 -250096 -199616 -38209 64702
14312 64702 -36843 -121369 -87282 -107973 -63675 16946 -27156 -34781 -5182 -71119 -192005
14301 -192005 -95138 -17803 -25098 -27158 -93784 -115206 -22125 -119615 -159852 -135060 -138784 1067
14289 1067 200700 165832 63072 65945 137065 142157 148163 84603 -135880 -68199 16131 59319
14277 59319 -16671 -44555 32130 51672 -18431 -12851 104177 95457 76203 69466 67460 -47130
14265d7130j04862P3217J7398M3966J3691k1779o8758M0894m5952M223J16108
14254B1016J17990r445n8898j51310k6221n97O303Q8239j0752j271j4146R873
14242b9219n5459q5657K6735O6112N3781O714l9446P8230K2k6320r8381J7175
14230h5713M6886Q860R4917m1010p7938l9320k7222N902m5167J62M2523J6078
14218a01042p2890J5366J15798P7879m7403o6401k2443m90L8669L0524p553j78280
14206b18266j55150J5541K7989J00845m1069l4635L1512J76828R7324N4293p8736
14195b3524K569N0069n420k37O8560k8325o4573j34267L1400J08581j1986r0024
14183i7177L9327J4227K8819O940j2618l9575J3471P0856J33648m5032j50711
$$ plain form
14265 -47130 -151992 -78775 -61377 -17411 -3720 -25499 -94257 -53363 -99315 -95092 21016
14254 21016 139006 129561 70663 -80647 -106868 -107465 -101162 -12923 -23675 -24946 -39092 -29219
14242 -29219 -84678 -170335 -143600 -77488 -23707 -16993 -56439 21791 21813 -4507 -102888 -85713
14230 -85713 -38827 -29967 64950 23940 -53998 -93318 -120540 -114638 -159805 -159643 -117120 -101042
14218 -101042 -173932 -158566 -42768 35111 -12292 -78693 -101136 -101626 -62957 -32433 -39986 -218266
14206 -218266 -373416 -357875 -329886 -229041 -270110 -304745 -273233 -96405 919 55212 -23524
14195 -23524 -20955 29114 23694 23457 92017 63692 -881 -135148 -103748 4833 -7153 -97177
14183 -97177 -57850 -43623 -14804 -7864 -20482 -60057 -46586 24270 157918 112886 -37825
14172c7825l7382J0563L3234M0385j05985K1449K9889p0678j19617J26041J48912
14161C8986j974O9381j2525o5635j15647r5602j08819o147L9283P2640M9779m8657
14149a84937r2733N1596P5092J8347j16619r169J10006R6445K5108o7256r4591
14138a88711N5588J27284K7672N2634R7597n3620j48757R0113J19725p5721j01168
14127B636j6500M2158J54213L0763j07664l3268L8488l5258j30651m8414k1820
14116a25317L1602L7474J1897O8394l3401j75698k9223J29885Q1479j2130k9630
14105d4668r8392k8019P5477O5108P702O1121N8633M9300k25582j28731m441l1616
14093b44108q773M6196K26333R6923L0851L5287n4513j17162j40633k2128L5058
$$ plain form
14172 -37825 -75207 -64644 -31410 8975 -97010 -75561 -45672 -116350 -235967 -109926 38986
14161 38986 37012 106393 93868 28233 -87414 -183016 -291835 -297982 -258699 -186059 -136280 -184937
14149 -184937 -277670 -226074 -150982 -132635 -249254 -258423 -148417 -51972 -26864 -94120 -188711
14138 -188711 -133123 -5839 21833 74467 172064 118444 -30313 59800 179525 103804 2636
14127 2636 -13864 28294 182507 213270 105606 72338 110826 75568 -55083 -103497 -125317
14116 -125317 -93715 -56241 -44344 24050 -9351 -185049 -214272 -84387 -2908 -15038 -44668
14105 -44668 -143060 -171079 -95602 -30494 -22792 38329 96962 146262 -79320 -208051 -212492 -244108
14093 -244108 -252881 -206685 19648 116571 147422 182709 128196 11034 -129599 -151727 -116669
14082a16669R1043p6841r8411n565J4788P2199L0460j14531N4497O7825N2078
14071b9127M1200K2365r609Q6075K3606K1552K7574r1052r2519j7865M2967L6554
14059F1721p466j8457q1556o9296M1795J06546K4154R2062j18099p4143j3069
14048e5808m9719K6315K3850p0714k4441P1732m3787j2074o7255k6595O3339q70
14036a66027N7169j00039j01711L2434N9898P7292J10293j30888p4942J17995
14026a18526L8053J9047Q8500n529L3853N2914j34028j5242l221n1489l7098l8893
14014a71659N7160k3042K1969p697o8668P252M0954o449j1974m1529k6915R0253
14002a40345P7585K0701n428l6821l8364j02308J09220J26487N4685P0511q9411
$$ plain form
14082 -116669 -25626 -102467 -200878 -206443 -191655 -119456 -88996 -203527 -149030 -81205 -29127
14071 -29127 12073 34438 24829 110904 134510 156062 183636 92584 65 -17800 25167 61721
14059 61721 54255 35798 -45758 -115054 -73259 33287 57441 149503 31404 -42739 -55808
14048 -55808 -105527 -79212 -55362 -126076 -150517 -78785 -122572 -134646 -201901 -228496 -165157 -166027
14036 -166027 -108858 -208897 -310608 -278174 -218276 -140984 -30691 -161579 -236521 -118526
14026 -118526 -80473 -61426 27074 21545 55398 108312 -25716 -40958 -44179 -95668 -132766 -171659
14014 -171659 -114499 -137541 -115572 -123269 -191937 -184685 -143731 -150180 -162154 -203683 -230598 -140345
14002 -140345 -62760 -42059 -47487 -84308 -122672 -224980 -115760 10727 65412 135923 46512
13991D6512O4668j9935r0851q261j1227k1101L2770j05547k6969N4263O4525P336
13979a3817o9676m8363K912K5863Q9088j0560o9065l5436P6211J23021P1231L3650
13967A75059j34518j73481k6776o0710J0691J22359l3460M175J867J25110n9143
13956d8827k900K6934M361N919m5055j26974R2225J01241O1809o1093j2233J4612
13944A0019o7565p3701O8168K3574q5658m6054k0901n9669J6095P5370N9501q1254
13932a82075l1692M8535Q8343N8815N7522o3500k0553J9223r306r9899Q7614J20045
13920G3072K9621N4843N7587j03198m1736q0398q7272j04648q735J7760O3471
13909a29633K3432J6217k4695m8732J9177Q9594J1148j5484N2738o4843K6068
$$ plain form
13991 46512 111180 91245 394 -7867 -19094 -40195 -7425 -112972 -139941 -85678 -21153 -13817
13979 -13817 -83493 -131856 -128944 -103081 -13993 -24553 -93618 -129054 -52843 70178 141409 175059
13967 175059 40541 -132940 -159716 -220426 -209735 -87376 -120836 -116661 -114794 10316 -48827
13956 -48827 -51727 -24793 -20432 -14513 -59568 -186542 -94317 6924 68733 7640 -4593 10019
13944 10019 -57546 -131247 -63079 -39505 -125163 -171217 -192118 -251787 -235692 -160322 -100821 -182075
13932 -182075 -213767 -165232 -76889 -18074 39448 -24052 -44605 -25382 -34688 -134587 -46973 73072
13920 73072 102693 157536 215123 111925 70189 -10209 -97481 -202129 -210864 -193104 -129633
13909 -129633 -106201 -89984 -114679 -163411 -144234 -54640 -43492 -58976 -6238 -71081 -45013
13898d5013j26N5432R2136l410l7962o2283j7110o7970R137P6198j44573n6182
13886b01726J07674R930l482j00731l7148J7019J45724p6479n4435L3852K2185
13875a37617M0382k8150m6721O8632K7813j534K7323P2746p8352r8308L5432O6037
13863e2317P0448j08087M9579J44252j091N6077r1984j27511J3727j4552K1864
13852c9595J26962L3049L333k2358l0717k54469m386J82269J2556o4761P7755
13841A9638k7521k9438K5576J6762k3942M0291L1979p2536j3008p7656L4688K2650
13829e2517O9238p7711p5099l3896P8859K2047J6635m4708L8103J1381l5500j7254
13817a00422R8492N3862k9141j16146n2943k9925P1209L5466J23764N5508M279
$$ plain form
13898 -45013 -45139 10293 102429 99019 61057 -1226 -18336 -86306 -77169 -971 -145544 -201726
13886 -201726 -94052 -84122 -87604 -188335 -225483 -208464 -62740 -139219 -193654 -159802 -137617
13875 -137617 -97235 -125385 -172106 -103474 -75661 -77195 -49872 22874 -55478 -153786 -118354 -52317
13863 -52317 18131 -89956 -40377 103875 102784 158861 66877 -60634 -46907 -61459 -39595
13852 -39595 87367 120416 123749 101391 70674 -183795 -188181 -5912 6644 -58117 19638
13841 19638 -7883 -37321 -11745 5017 -18925 21366 53345 -19191 -32199 -109855 -75167 -52517
13829 -52517 16721 -60990 -136089 -169985 -91126 -69079 -52444 -97152 -59049 -47668 -83168 -100422
13817 -100422 -1930 51932 22791 -93355 -146298 -176223 -105014 -69548 54216 109724 114003
13806A14003n9874n2999n4186J21P8025J11608k4583l4909J7927J3445k2978o9982
13794A5618K432K2876L8430l3995j53013O0330O4670J04932q816m8770l9021j00006
13782g4333M880P1081L2943O638L7253R2865l8439o2205N3009l5681m6966J9530
13770F0575m0947q9027J3125k6073n7723J02811l0233J9121j4676J2287R9564
13759D8804n4856j12158j9201n2448J31336N4049k9621N1523R0659O8390k2909
13748A53568r937q0045k0924j9613j3792k9029p5838P2223M0545M7746l7120L7136
13736F4920j0849j1451M5064l7258N2490m5512l1770k5778L5648m431L3718N4027
13724A18818J35848J19935J1666J9810J23431R8006N2778N9478O0606J51593J67716
$$ plain form
13806 114003 54129 1130 -53056 -52935 25090 136698 112115 77206 95133 108578 85600 15618
13794 15618 18050 40926 79356 45361 -107652 -47322 17348 122280 113464 64694 25673 -74333
13782 -74333 -69453 1628 34571 41209 78462 171327 132888 70683 123692 88011 41045 60575
13770 60575 19628 -69399 -56274 -82347 -140070 -37259 -67492 -48371 -63047 -50760 48804
13759 48804 -6052 -118210 -137411 -189859 -58523 -4474 -34095 17428 108087 176477 153568
13748 153568 143631 63586 42662 23049 9257 -19772 -95610 -23387 17158 64904 27784 64920
13736 64920 54071 42620 87684 50426 102916 57404 25634 -144 35504 31073 64791 118818
13724 118818 254666 374601 386267 406077 529508 627514 680292 739770 800376 951969 1119685
13713A119685J86943R4680O4206J32470N5909k4919k8469o4349j18807k09406
13703A207943j36420r410k5859j72875j86237p5614j2835k6886m8555p2798k2503
13692D17951o5644n9464m9034L7384j9595j7021n0572j3723j2837j946J4781j5184
13680A65096J6126l5817k0910L9726j6208j5164L4837K7983o2181M4721r446q0805
13668H7958n8241r9145K2812K5059O3873J47157Q534L7699q926j59164l357J7892
13656H2151R8967J0495r6969M1356l5305r3740j1762K8597M7570L4493n309n0193
13644E0351q515n1513l9223O50R1658Q0354M0548J13893L5825m9616p5829P7957
13632B66540j6998j13708r5816k1655N5499M6237K508j2899m4976M2335l3289
$$ plain form
13713 1119685 1306628 1401308 1465514 1597984 1653893 1628974 1600505 1536156 1417349 1207943
13703 1207943 1071523 1062113 1036254 863379 677142 601528 588693 561807 513252 440454 417951
13692 417951 352307 292843 243809 281193 261598 244577 194005 180282 167445 165499 180280 165096
13680 165096 181222 145405 124495 164221 148013 132849 167686 195669 133488 178209 168763 87958
13668 87958 29717 -69428 -46616 -21557 42316 189473 198007 235706 226780 67616 64259 82151
13656 82151 181118 191613 94644 136000 100695 6955 -4807 23790 71360 105853 100544 50351
13644 50351 41836 -9677 -48900 -48250 43408 123762 164310 278203 314028 264412 188583 266540
13632 266540 249542 135834 40018 18363 73862 120099 122607 109708 64732 107067 73778
13621G3778o2925J2965L6856J7913k7028L2795J01235o3036p1017l1952Q7563
13610A07147J2274q4634j2764l8464j9826Q7981O0872j19290N274P6294P3333
13599A48197j9223O1593q0620k1803M316l7855J23429j1349o2482q6484r114O0329
13587F8934o5631n3730O1697J3893j9858M1691K3516M7614l9788l9608Q4488j6758
13575A06460M9898n3553l5093J8421P464O7322J24451m4784J0142k0455l7551
13564A92722p5661m5334J9120o173K1470K2379n2445j4992l1612L934n2579M0251
13552B1080l2359k4707L8251K6732j0479L8461l2116r1632L9233J28459J6926
13541A17849J7081J21339l0420p2822o7251j26645L3031J04223j7609j06336l694
$$ plain form
13621 73778 10853 23818 60674 78587 51559 84354 185589 122553 51536 19584 107147
13610 107147 119421 34787 22023 -16441 -36267 51714 112586 -6704 -1430 74864 148197
13599 148197 128974 190567 109947 88144 92460 54605 178034 166685 104203 17719 8605 68934
13587 68934 3303 -50427 11270 25163 5305 46996 70512 118126 78338 38730 123218 106460
13575 106460 156358 102805 67712 86133 93597 160919 285370 240586 250728 230273 192722
13564 192722 117061 71727 90847 84674 106144 128523 76078 61086 29474 33408 -19171 21080
13552 21080 -11279 -35986 2265 28997 18518 56979 24863 -66769 -27536 100923 117849
13541 117849 134930 256269 225849 153027 85776 -40869 -7838 96385 78776 -27560 -31254
13530c1254P3809j50733P300J39163N0883n758N3147n1721n2818l1350O3923K47921
13518C12512N6154j37911q8977M4865M8859L314J15869M6140n4357J51452n182
13507D92738k8024p5026j33620q8707l5675j7503P816k6373p7461m615M2631N102
13495F1283O8785P5178p4389r5259q3769K8702J42329L8443M6276p3450O3379
13484A97508P1871m5557r42P1955J0820j07134l5466J677K9368k7338N1189P2414
13472B90365o8274P7187r1994r5387m3424R146l4344J14286L2456q2331o1016
13461D6670N262m763J9582J06739J3292M3956M9945j24752l545L4505M0319p5684
13449A51526k3448J74448J09322k539J2216L4108p3542j43443k4613m3321l5356
$$ plain form
13530 -31254 42555 -108178 -100878 38285 89168 83410 136557 84836 32018 668 64591 312512
13518 312512 368666 230755 141778 186643 235502 238816 354685 400825 346468 497920 492738
13507 492738 464714 389688 256068 167361 131686 114183 121999 95626 18165 13550 56181 61283
13495 61283 130068 205246 130857 35598 -48171 -19469 122860 161303 207579 134129 197508
13484 197508 269379 223822 222880 294835 305655 198521 163055 164732 194100 166762 217951 290365
13472 290365 222091 299278 207284 111897 68473 77619 43275 157561 190017 107686 46670
13461 46670 51932 47169 66751 173490 186782 230738 280683 155931 152386 186891 227210 151526
13449 151526 128078 302526 411848 409309 421525 455633 382091 238648 214035 170714 135358
13438A35358o6307n3419q9160j1850O4158O0329p1860L2341P2868p238k3027n772
13426C6421k2573M4936O1696J4824J51961N1674J9278k2553O4882Q3472L5216
13415E19234l8959j76762j5111n7508r6938J9695P4624J4844R305P5708K5326
13404C53458q9975m8070K9246j6808J508k8372n1755o9672j71226m1480O132N4145
13392g2869J64135J01719Q535j04236j81497j05393m9901P024M3188J29906K2359
13381c7030P2592J07288O2465P6395N9272N6987J23929J08354m6749n283R6913
13370F75133j9657l1910l8238o4329n8194j8390J29113J86105m840m4984O770
13359G16579N1331P6730m407O6029P2552L113q8412P9131M2766L5644P4709N6474
$$ plain form
13438 135358 69051 15632 -73528 -85378 -21220 39109 -32751 -410 72458 65220 42193 36421
13426 36421 13848 58784 120480 135304 287265 338939 358217 335664 400546 484018 519234
13415 519234 480275 303513 288402 230894 133956 153651 228275 243119 252424 328132 353458
13404 353458 263483 215413 244659 227851 229359 200987 149232 79560 -91666 -133146 -127014 -72869
13392 -72869 91266 192985 201520 97284 -84213 -189606 -239507 -232483 -189295 -59389 -37030
13381 -37030 35562 142850 205315 281710 340982 397969 521898 630252 583503 578220 675133
13370 675133 655476 623566 585328 520999 462805 444415 573528 759633 754793 709809 716579
13359 716579 767910 844640 840233 906262 978814 981927 893515 972646 1015412 1051056 1125765 1182239
13347A182239n9536o4125M9222m0704K2307j3996q2360J06086P7910o263K5451
13336A196231K482l261j450J7045j94N6711L646M1223O6952M5098M3633m172P7096
13323A541040R3030J50832N2697M1302P4484O4490L6312N7502L2129R0642J98772
13312B433232J22784J3133o798J24206N3733J4755K06599K82628J08198K02505
13302C554975J99714N7514J93508K06636J82541O5036J40817K52264L44759M26408
13292E624172L55873L47889K92023N62504N85746N43268O20740O30483Q39075
13283A0401773Q49721J012676J397183J495895J493042J737160K044531K180351
13275B2612332K508357L043415L639540M185627N026887N983818P475715R659957
$$ plain form
13347 1182239 1122703 1058578 1107800 1067096 1089403 1075407 993047 1099133 1177043 1170780 1196231
13336 1196231 1198713 1195452 1194002 1211047 1210853 1267564 1271210 1312433 1379385 1424483 1468116 1463944 1541040
13323 1541040 1634070 1784902 1837599 1878901 1953385 2017875 2054187 2111689 2143818 2234460 2433232
13312 2433232 2556016 2569149 2562351 2686557 2740290 2755045 2961644 3244272 3352470 3554975
13302 3554975 3754689 3812203 4005711 4212347 4394888 4459924 4600741 4853005 5197764 5624172
13292 5624172 5980045 6327934 6619957 7182461 7768207 8311475 8932215 9562698 10401773
13283 10401773 11251494 12264170 13661353 15157248 16650290 18387450 20431981 22612332
13275 22612332 25120689 28164104 31803644 35989271 41016158 46999976 54475691 64135648
13267F4135648J2472003J6455529K1862785K8789043L6849529M4055056M6366680
13260B70986273M0177817K5775841J1136566M914222M788429J794949j0231511
13253C49342586k7311407l9004103m0586819l5701100k8949222k2704891j7822682
13246A37262362j4195741j1748250r884669q343218p334114o759787o424258n968144
13238F6604181n677312n386755m894492m485085m094891l667173l153564k845450
13230C2399459k646460k348932k118946j886610j753142j617179j461067j344255
13222A7222868j218091j049231r23448r70315r72408p04681o02227o58241p35558
13213I388668o27160n37133n49782m78393l77949k91725l56440l24426k16795
$$ plain form
13267 64135648 76607651 93063180 114925965 143715008 180564537 224619593 270986273
13260 270986273 311164090 336939931 348076497 352990719 357779148 359574097 349342586
13253 349342586 322031179 283027076 242440257 206739157 177789935 155085044 137262362
13246 137262362 123066621 111318371 101433702 93090484 85756370 78996583 72572325 66604181
13238 66604181 60926869 55540114 50645622 46160537 42065646 38398473 35244909 32399459
13230 32399459 29752999 27404067 25285121 23398511 21645369 20028190 18567123 17222868
13222 17222868 16004777 14955546 14032098 13061783 12089375 11384694 10782467 10124226 9388668
13213 9388668 8761508 8224375 7674593 7196200 6818251 6526526 6170086 5845660 5628865
13204E628865k76458j91072j22937k89320k59810k91494k78607j11324j20255
13195C687588o1117m5778q9794j62105l2822n5994j29594j02566m6622K4236j37176
13184B848256j64549j63236p9137j2868q2987q2116M5162q9306j12425o0142p5694
13173A970958n2654m9006m6037L1944L5111k1538m7031J4234O062r3227n9372
13162A689444j3348l1468n0660j3650M1342M9979N8539m5795p3300o5590l3244
13151A512249j53046p1614j861L4362j41376r1852O2278J9621j6178j0986Q565
13140A150162J4798j12344k411J8447M2993j9236k1446J43034J40596L0691J1178
13129A396462L3537O2747Q8343M4576q9932j03415o3771m3932R262k6872k3760
$$ plain form
13204 5628865 5352407 5161335 5038398 4749078 4489268 4197774 3919167 3807843 3687588
13195 3687588 3626471 3580693 3490899 3328794 3295972 3239978 3110384 3007818 2961196 2985432 2848256
13184 2848256 2683707 2520471 2441334 2428466 2345479 2263363 2308525 2219219 2106794 2046652 1970958
13173 1970958 1918304 1869298 1823261 1855205 1890316 1868778 1821747 1835981 1842043 1748816 1689444
13162 1689444 1676096 1644628 1593968 1580318 1621660 1671639 1730178 1684383 1611083 1545493 1512249
13151 1512249 1359203 1287589 1285728 1320090 1178714 1086862 1149140 1168761 1152583 1141597 1150162
13140 1150162 1164960 1052616 1050205 1068652 1111645 1092409 1070963 1213997 1354593 1385284 1396462
13129 1396462 1429999 1492746 1581089 1625665 1535733 1432318 1368547 1324615 1333877 1307005 1283245
13118A283245K7864l1371r6521o0560K5443P1234p0703q2975M9174O3602r1630
13107A086802n1306L73l1724j7853n5130j36460L4777O9665L4031n574m8969M6118
13095I24750P8781j7578j42214k9040K4137j10711P2212k6879k3803O14R219k3765
13083G35723j0334j689k5459J1824R362j23217n806O823r9746m2433q2499P643
13071C80192j0879j7813J85269K1276r7224J7803K8736K0345N9109o5099l8184
13060D83531M7070M3303k6060O0648J3895o6950k4464O3975O3996o4436n5580
13049E38928M7120J6429m0108R600o0935k1093j33224J4509K2541j50696N900
13038B48971O4365M5610R798L5604K3700j35691K8183j5508n708P7723L8189k9871
$$ plain form
13118 1283245 1311109 1279738 1183217 1122657 1148100 1219334 1148631 1065656 1114830 1178432 1086802
13107 1086802 1035496 1035869 1004145 986292 931162 794702 829479 899144 933175 927601 878632 924750
13095 924750 1003531 985953 843739 814699 838836 728125 800337 773458 749655 750269 759488 735723
13083 735723 725389 723700 698241 710065 719427 596210 590404 597227 497481 455048 372549 380192
13071 380192 369313 351500 536769 558045 460821 478624 507360 527705 586814 521715 483531
13060 483531 530601 573904 547844 608492 622387 555437 530973 594948 658944 594508 538928
13049 538928 586048 602477 562369 571969 511034 489941 356717 371226 393767 243071 248971
13038 248971 313336 358946 368744 404348 428048 292357 320540 305032 299324 377047 415236 385365
13026C85365j23642L5057J36114Q0131J2559j7228n6323k4720o0617M2205m4952
13015C63949o7655J35404O4578k4205J5419M2455k2447k8211O046M5107Q5542
13004F15982j8856j5318p8316q369j08195M8016O6747M2099j08018o8965J4589
12993C81396o5208L0056p6447o674O1165k2880J13115K0108K267l236r5335r9333
12981B38994k6923l2102K7888J56597J34377K4225j0651k1285m1291m2920L68
12970D07277p1864k8372J9816J7253J3392J06416j6750j0981q1549m3480M0459
12959C51617o578M0908l9846n8355n4816J3208j892k1927l8413O9347J9412k1299
12947B51366p2188l5208R5013O6805J03934K2457l7578o2797k0277N5659n0348
$$ plain form
13026 385365 261723 296780 432894 513025 525584 508356 452033 427313 366696 408901 363949
13015 363949 296294 431698 496276 472071 487490 529945 507498 479287 485333 530440 615982
13004 615982 597126 581808 503492 495123 386928 434944 501691 543790 435772 366807 381396
12993 381396 316188 346244 269797 263123 324288 301408 414523 434631 436898 433662 338327 238994
12981 238994 212071 179969 207857 364454 498831 523056 512405 491120 449829 406909 407277
12970 407277 335413 307041 326857 344110 357502 463918 447168 436187 354638 311158 351617
12959 351617 345039 385947 346101 287746 232930 246138 244246 222319 183906 253253 272665 251366
12947 251366 179178 143970 238983 305788 409722 432179 394601 331804 311527 367186 316838
12936C16838j42819J6645N7280J1145Q007P8502j0067M2272K9653j2682R6970
12925D91744l8091l7573q0880J686N9985k669q7986q4416r5834O1637J99614Q4920
12913D72137o2145p1968l8987J13084K2559n4743k4469j6038J4615N0197j28690
12902B75552K9593J34737j3176p1060J02661Q47n6211o3927q0538L1797l411j7824
12890B69040K0869j004k9045K250J1529J4261M1906L3406r6j32494j18881N894
12878A17635K5580r3559N8597J4208J5339n6303K4775O4906K2997M8697N1583
12867B94455K2162O7513j49443M030R7666k2806O0225p7036j17145k3541J12406
12856B68486Q1914j39503P8859R6771j0804o1883l0501n9600R5002K0643n9510
$$ plain form
12936 316838 174019 190664 247944 259089 267096 345598 335531 377803 407456 394774 491744
12925 491744 453653 416080 335200 336886 396871 394202 306216 221800 125966 187603 387217 472137
12913 472137 409992 338024 299037 412121 434680 379937 355468 339430 354045 404242 275552
12902 275552 305145 439882 426706 355646 458307 459154 402943 339016 258478 290275 286864 269040
12890 269040 289909 288905 259860 262110 273639 287900 329806 363212 363116 230622 111741 117635
12878 117635 143215 49656 108253 122461 137800 81497 106272 171178 194175 242872 294455
12867 294455 316617 384130 234687 238717 336383 313577 373802 296766 179621 156080 268486
12856 268486 350400 210897 289756 386527 375723 313840 283339 223739 318741 339384 279874
12845B79874M2709O3092j04519j2323n9509M2795J0872m8223m1530N8751J32215
12834C64204r7304k0171N9205O1316m4171m4327Q1114J7459N6908p9237j06012
12823B48984k2085J6671P1664J00548n350k7723m5488K8530l970j9625J3069J02000
12811D57225Q8323N8499M0268Q8989P9914J31955K22168J37048J82353J45238
12801A631980M9441J03516K7067p114J1491k3127j6857j7512j66639p1847j0158
12790A510241j07363j67512j43654q4990k07841l3741k1969p3409p0003l3886
12780E65873K0092o7347j129J22202R0302n9971m9245q3885M2920m4163J8175
12769E53824K8452j03885j34376l4586J3484M5368m5708L7011P7507m218m1486
$$ plain form
12845 279874 322583 385675 281156 268833 209324 252119 262991 214768 173238 231989 364204
12834 364204 266900 246729 305934 367250 323079 278752 359866 377325 434233 354996 248984
12823 248984 226899 243570 315234 415782 410432 382709 337221 365751 361781 342156 355225 457225
12811 457225 545548 604047 644315 733304 813218 945173 1167341 1304389 1486742 1631980
12801 1631980 1681421 1784937 1812004 1804890 1816381 1793254 1776397 1758885 1592246 1520399 1510241
12790 1510241 1402878 1235366 1091712 1006722 798881 765140 743171 669762 599759 565873
12780 565873 585965 518618 517489 639691 729993 670022 620777 536892 579812 535649 553824
12769 553824 582276 478391 344015 309429 322913 368281 322573 359584 437091 432873 391387
12758C91387L5142K5378m4449k3755j56656M9280j2875K7186j1550j2900J6846
12747B83034l1744n1032K282k2559m5271p929O6203J08635J45189p6718j03190
12736B66900k7368k4903P0166N4110j1327O069p9425o094J6885R314j7257m3558
12724B13512k2928K6089J38133N7756J2352k5720L674j08798k5791j3200n3308
12713B01771n2838m5103M9478O1420j4187M2284N1004r344j5170n8589J6858j1862
12701B15722j09129j00478L2864J88256O0083N7777K8772p7892j40057m7444O304
12690A14778M1965R1103N1406l2152P9869l84M0871k2735p9006o4455Q4803o546
12678B99517p0022l0609O0659j05152j36667l7950J94303J01655n216J3235o3057
$$ plain form
12758 391387 426529 451907 407458 383703 227047 276327 263452 290638 279088 266188 283034
12747 283034 251290 200258 202540 179981 134710 126781 192984 301619 446808 370090 266900
12736 266900 239532 214629 284795 338905 327578 333647 254222 248128 265013 274327 257070 213512
12724 213512 190584 216673 354806 412562 424914 399194 402868 294070 268279 255079 201771
12713 201771 148933 103830 153308 214728 200541 242825 293829 284485 269315 210726 227584 215722
12701 215722 106593 6115 38979 227235 287318 345095 373867 295975 155918 108474 114778
12690 114778 156743 247846 299252 267100 346969 346585 387456 364721 285715 221260 306063 299517
12678 299517 229495 198886 259545 154393 17726 -20224 174079 275734 270518 283753 220696
12667B20696k7749m6877M0480J66146L8606l1080n4349o8667M1881L0342M9729
12656C59158Q4422Q100r688n9896j2158J7485j5779M6468L9518j2356J8773m1224
12644D22823J57n6292o7376K5752J7835m2269Q8823J20354p1371j12654l101M1449
12632C64130J7889J4048l8938L8384Q7792o322L5494P7193k4204o1460J5092N456
12620E24554L5638M2718j10224j16984P3209L2248l9337P93J6955o75l3038k9331
12608C96526j09337j14603n138P9860P000O013J04525Q1413n3640J5923j1095
12597C97447N2978R3878j0951j40682o1055o3358J3914R4964L1675q9929n6487
12586B62394N9495K1435N9644L777k5377K7725j12931n583N186j8033M0502K1709
$$ plain form
12667 220696 192947 146070 186550 352696 391302 360222 305873 237206 279087 309429 359158
12656 359158 443580 451680 441992 382096 369938 387423 371644 418112 457630 445274 464047 422823
12644 422823 422980 366688 299312 325064 342899 300630 389453 509807 438436 325782 322681 364130
12632 364130 382019 396067 357129 395513 483305 476983 512477 589670 565466 504006 519098 524554
12620 524554 560192 602910 492686 375702 448911 481159 441822 442615 459570 458895 425857 396526
12608 396526 287189 172586 167448 247308 254308 260321 364846 446259 392619 408542 397447
12597 397447 450425 544303 533352 392670 331615 268257 282171 377135 408810 318881 262394
12586 262394 321889 343324 402968 406745 381368 409093 296162 290579 295765 277732 318234 339943
12574C39943N1959M7200J15720P2971j05651o8701p4939o1698J2490j2140Q3017
12563D00171K7183n4537o807M6080p2722l5566P4902Q8535L0430J7109K4821m5394
12551D94205n5961n4447n8466N4426M5924L8448M80o9336o6598M9661J6492M0079
12539D34907L9109Q6598L0096j43547o2892k4829m2010J49265J00645L5316l8600
12528E64058k1530N5486l0802j1904M4126k554j22301j91313j01347N7519R9494
12517C38932N4242P4759N6566n703j2761j04926l2624L2676p9840k7571Q9156
12506C82906P5822K3106l458J6326P449m5478n356m1216j4111j0047k3813j00417
12494B61713j0828O0555J83167M1917l2331j5829R5041K9785L158m7102l2743
$$ plain form
12574 339943 391902 439102 554822 627793 522142 453441 378502 316804 329294 317154 400171
12563 400171 427354 372817 366010 412090 339368 303802 378704 467239 497669 514778 539599 494205
12551 494205 438244 383797 325331 379757 425681 464129 464609 395273 328675 378336 394828 434907
12539 434907 474016 560614 590710 447163 384271 359442 317432 466697 567342 602658 564058
12528 564058 542528 598014 567212 555308 599434 596880 474579 283266 181919 239438 338932
12517 338932 393174 467933 524499 518796 506035 401109 368485 401161 321321 293750 382906
12506 382906 458728 481834 478376 494702 502151 456673 451317 410101 395990 385943 362130 261713
12494 261713 250885 311440 494607 536524 504193 488364 583405 613190 616348 569246 536503
12483E36503K2333j20386O0629R4589J15506N6054l7500j3570L9334q1381m955
12472F67156k2442J32976Q2621n6642M056j58308q5492j9960J2482L3665k7125
12461E62987L2365N0526o5092N7647n2068n6517k2551m7286J80315J19118M0318
12450G99762j90872o2026J17955J02781O1695j19255M5331k8232j08955J3125
12440F31309J4110K246j4896P0404p6565n3777O5728j08262r4339J21073J68797
12429G25828M1499j695n8690k0071K8786q2396L0084Q0221J7066j11002j32750
12418E16880L1247R9528L0978n7340O4199N6927J03548O5569P1238l3630l9064
12407I10080j01249M4697M1673m2141R5303k9637j85323Q27J45473J26521p3015
$$ plain form
12483 536503 558836 438450 499079 593668 709174 765228 727728 714158 753492 672111 667156
12472 667156 644714 777690 860311 803669 807725 649417 563925 543965 556447 590112 562987
12461 562987 595352 645878 580786 638433 586365 529848 507297 460011 640326 759444 799762
12450 799762 608890 546864 664819 767600 829295 710040 755371 727139 618184 631309
12440 631309 645419 647665 632769 703173 626608 572831 638559 530297 435958 557031 725828
12429 725828 767327 765632 706942 686871 715657 633261 663345 743566 760632 649630 516880
12418 516880 548127 647655 678633 621293 685492 742419 845967 911536 982774 949144 910080
12407 910080 808831 853528 895201 853060 948363 918726 733403 734230 879703 1006224 933209
12396I33209J2472n1167P095M4827o2636m5716R808n5772p8446R5635Q9546j5952
12384H82903N4138j158n537p6442j9503l9444j754J5576l9322J0853P4519O3148
12372I17977J50362q180n4067J5860l764J6533O9428N2209o9483p1744q1664m6074
12360H87393K556K9366K9184P2880n9271j0850O6212L7904K1275Q3420O714j57313
12348A009470p0991K0627N5996J2639O1082j0308P2378K0085m0383q2798K3362
12337A071159P9451K163m2830N6756l3064j2215Q3657j8245j05400N7160P542
12326A146134n354J8978L2262J4397L6222N6211o3652l6685O9464J74115M7847
12315A489939m1214K2645l4309o3510k966j5310n6924K8706l0665k2028n5149
$$ plain form
12396 933209 945681 894514 901609 946436 883800 838084 847892 792120 713674 809309 898855 882903
12384 882903 937041 935883 930346 853904 834401 794957 793203 808779 769457 780310 854829 917977
12372 917977 1068339 1060159 1006092 1021952 1018188 1034721 1104149 1156358 1086875 1015131 933467 887393
12360 887393 889949 919315 948499 1021379 962108 951258 1017470 1055374 1076649 1160069 1166783 1009470
12348 1009470 938479 959106 1015102 1027741 1088823 1078515 1150893 1170978 1130595 1047797 1071159
12337 1071159 1150610 1152773 1109943 1166699 1133635 1121420 1205077 1186832 1081432 1138592 1146134
12326 1146134 1140780 1159758 1192020 1206417 1242639 1298850 1235198 1198513 1267977 1442092 1489939
12315 1489939 1448725 1471370 1437061 1373551 1370585 1355275 1298351 1327057 1296392 1274364 1219215
12304A219215l8993M4758Q9811P0819M4475J6427k5688m7018P751J03213l68R1932
12292A576334Q0522j59950N1831j0963n7417M5112J53926K2098q4221P547j0179
12281A614640q1460j5192K166R4422L5207J85688J09718N1113n1236j05187l0661
12270A809218O0331Q7146Q6283K9082q673n9064L3036n5987p4508N3055l6920
12259A922999q6384o5114J4688J28245P4862J4242R817n3996J2727L5750J11827
12248B119663o88m7363m8525P6372K2505p2426Q277p090j2961p450Q9455Q6945
12236B206714J34410J8950j04527K9544N0265P2333K5358j11303m4009n116l0099
12225B242520K3741P7740R2246K7735N9383M7244J01469J00340N9021l1108r4427
$$ plain form
12304 1219215 1180222 1224980 1314791 1385610 1430085 1446512 1420824 1373806 1381557 1484770 1484402 1576334
12292 1576334 1656856 1496906 1548737 1537774 1480357 1525469 1679395 1701493 1617272 1624819 1614640
12281 1614640 1533180 1517988 1520154 1614576 1649783 1835471 1945189 1996302 1945066 1839879 1809218
12270 1809218 1869549 1956695 2042978 2072060 2063387 2004323 2037359 1981372 1906864 1959919 1922999
12259 1922999 1836615 1771501 1786189 1914434 1989296 2003538 2013355 1959359 1972086 2007836 2119663
12248 2119663 2118975 2071612 2023087 2099459 2121964 2049538 2057815 2050725 2037764 2030314 2119769 2206714
12236 2206714 2341124 2360074 2255547 2285091 2335356 2407689 2433047 2321744 2277735 2272619 2242520
12225 2242520 2266261 2344001 2436247 2463982 2523365 2570609 2672078 2772418 2831439 2800331 2705904
12214B705904N7230O9081p0131k4639P9401R9374L8645p9999j09968p2878J82596
12203B874616N3058n6066k3990P1150N6650J7285J07092Q536k9704J1932P6046
12192C166605K6502o4951j4570P8836P2909R0458p327L0992O3486J5816L1201
12181C489957M0286M8231M5446O811l1591J0120m5979M9447J64095J32067J1163
12170C920053l2091k1408l4117P205J9704J48587J05759k460n802O5541J33630
12159D304601P9546K1640m6102L7085P6711M4096J1541o652J35007M0396r967
12148D687902Q3424L4296J09183Q3810L9719O3566J1364l8792N7589J38299K4290
12137E294650L4904K8390K1577k5511J40916K21888O1667O8901Q8295R4374N7637
$$ plain form
12214 2705904 2763134 2832215 2762084 2737445 2816846 2916220 2954865 2874866 2764898 2692020 2874616
12203 2874616 2927674 2871608 2847618 2918768 2975418 2992703 3099795 3108331 3078627 3090559 3166605
12192 3166605 3193107 3128156 3113586 3192422 3265331 3355789 3348462 3379454 3442940 3458756 3489957
12181 3489957 3530243 3578474 3623920 3630731 3599140 3609260 3563281 3612728 3776823 3908890 3920053
12170 3920053 3887962 3866554 3832437 3839642 3859346 4007933 4113692 4111232 4105430 4170971 4304601
12159 4304601 4384147 4405787 4359685 4396770 4473481 4517577 4529118 4522466 4657473 4697869 4687902
12148 4687902 4771326 4805622 4914805 4998615 5038334 5101900 5113264 5074472 5132061 5270360 5294650
12137 5294650 5329554 5357944 5379521 5354010 5494926 5716814 5778481 5847382 5935677 6030051 6087688
12126F087688J34360J74001R502k5559K6503k5066j0688J07680P4644J32507P1329
12115F756901R4500J15164q605J45567J11289J47452J11982J03340J09383J34873
12105G821846J00377K8478O4036O7875O5959R7220J53334K00935J42149J54054
12095H896263L8047O4703K82421J94189J15373K19988J58478J48453Q0044K08029
12085A0405988J92126R8221J95462K40801K21050L13477J96362J82066J48000
12076A2193553J09308K39606L49701K61937K01654K67133L28356K97970J99566
12067A4448784L20771L55549L95601K98768K94380K14052K83475L48928L53794
12058A7314102L12574L73630L86704L91763L64377L68368L45361M44250M99122
$$ plain form
12126 6087688 6222048 6396049 6405551 6379992 6406495 6381429 6370741 6478421 6553065 6685572 6756901
12115 6756901 6851401 6966565 6957960 7103527 7214816 7362268 7474250 7577590 7686973 7821846
12105 7821846 7922223 7950701 8014737 8082612 8148571 8245791 8399125 8600060 8742209 8896263
12095 8896263 8934310 8999013 9281434 9475623 9590996 9810984 9969462 10117915 10197959 10405988
12085 10405988 10598114 10696335 10891797 11132598 11353648 11667125 11863487 12045553 12193553
12076 12193553 12302861 12542467 12892168 13154105 13355759 13622892 13951248 14249218 14448784
12067 14448784 14769555 15125104 15520705 15819473 16113853 16327905 16611380 16960308 17314102
12058 17314102 17626676 18000306 18387010 18778773 19143150 19511518 19856879 20301129 20800251
12049B0800251N40454N14021M08278M57682N31564N28173N98495O24785N85362
12040B5589065O52409O29306O52195P68033P45316O75659P39298Q19030P90627
12031C2060938Q85317J051009J024515J030148R82697J114144J146225J182122
12023D0477115J160836J205968J273295J327264J516776J660000J486273J601496
12015E1709023J761230J867208J871816K076114K175178K199795K355913K572743
12007F8589020K577626K708061L080595L171183L232808L335734L543854L848375
11999I4087256M046670M288163M491123M666216N177401N529805N765470O049638
11991A34101742O385675O733285P111639P590074P913981Q366835Q953701R431319
$$ plain form
12049 20800251 21340705 21854726 22263004 22720686 23252250 23780423 24378918 25003703 25589065
12040 25589065 26241474 26870780 27522975 28291008 29036324 29711983 30451281 31270311 32060938
12031 32060938 32946255 33997264 35021779 36051927 37034624 38148768 39294993 40477115
12023 40477115 41637951 42843919 44117214 45444478 46961254 48621254 50107527 51709023
12015 51709023 53470253 55337461 57209277 59285391 61460569 63660364 66016277 68589020
12007 68589020 71166646 73874707 76955302 80126485 83359293 86695027 90238881 94087256
11999 94087256 98133926 102422089 106913212 111579428 116756829 122286634 128052104 134101742
11991 134101742 140487417 147220702 154332341 161922415 169836396 178203231 187156932 196588251
11983A96588251R720467J0134244J0654687J0938639J1367520J1656725J1831702
11976B72892235J2069702J1989331J1849590J1563669J1213677J0724958J0054020
11969C52357182R096305P874751O634740N220977L916268K357931N59330j003801
11961C87013683k542502l932086n300784o397441p434681q452312r200299r787743
11953C33965835j0247437j0337346j0532830j0569204j0595063j0500414j0290460
11946B60893081j0144958r966325r613970r231111q936435q683114q368411p998059
11938A87950698p557917p385639p058911o755527o431002o116546n848184n553025
11930A35243947n356452n109073m815995m621114m498026m259710m158097l884747
$$ plain form
11983 196588251 206308718 216442962 227097649 238036288 249403808 261060533 272892235
11976 272892235 284961937 296951268 308800858 320364527 331578204 342303162 352357182
11969 352357182 361453487 369328238 375962978 381183955 385100223 387458154 388017484 387013683
11961 387013683 384471181 380539095 375238311 368840870 361406189 352953877 343753578 333965835
11953 333965835 323718398 313381052 302848222 292279018 281683955 271183541 260893081
11946 260893081 250748123 240781798 231167828 221936717 213000282 204317168 195948757 187950698
11938 187950698 180392781 173007142 165948231 159192704 152761702 146645156 140796972 135243947
11930 135243947 129887495 124778422 119962427 115341313 110843287 106583577 102425480 98540733
11922I8540733l613075l426565l398147l273074k899902k855786k797588k560252
11914G3716344k575591k333168k244020k218056k096538k070253j958404j928470
11906E6291844j773125j611414j609245j550620j385460j419491j399069j425879
11898D4117541j243265j112727j148230j185985j063693r49058r27476r97161
11890C5489946q95219q58074r27027q71042o62499o68803o67473p75647o71433
11881B8492729n06528p25221o87366o03838o09990o63039m97052n01741m93673
11872B3204281m68928m58311m88596n60851m79700k52636k70817l53293l41037
11863A9530112l71978m36043k59301k87469m08234l26363j90419k75581k95655
$$ plain form
11922 98540733 94927658 91501093 88102946 84829872 81929970 79074184 76276596 73716344
11914 73716344 71140753 68807585 66563565 64345509 62248971 60178718 58220314 56291844
11906 56291844 54518719 52907305 51298060 49747440 48361980 46942489 45543420 44117541
11898 44117541 42874276 41761549 40613319 39427334 38363641 37414583 36487107 35489946
11890 35489946 34594727 33736653 32809626 31938584 31276085 30607282 29939809 29164162 28492729
11881 28492729 27986201 27260980 26573614 25969776 25359786 24696747 24199695 23697954 23204281
11872 23204281 22735353 22277042 21788446 21227595 20747895 20495259 20224442 19871149 19530112
11863 19530112 19158134 18722091 18462790 18175321 17767087 17440724 17250305 16974724 16679069
11854A6679069k94860j96247k82093k95976l58705k14672k39287l15745j39842
11845A4341642j32903k71353j57343o7884j83124j45914k69466k20719j42659
11836A2750277k38869p1758o4608j59137k05247j50963j51600k42627j76738j20784
11826A1167946j42311p3701r6041j20432j01973j82252j83495k05344j23904j90048
11816I748445k60367j17419j15490q9267j68772n3783p0929q1188o0657q2169
11806H648404n6214m3803j62466k59599j40681j29004q5134o6120m2386r0932
11796G572065j51744j32001j8574n0802l1525p188q8536q6803j16479n7586m9194
11785F781633m6817j43322j52985n3192R568j06596k77172l6717K4988J7456p3569
$$ plain form
11854 16679069 16384209 16187962 15905869 15609893 15251188 15036516 14797229 14481484 14341642
11845 14341642 14208739 13937386 13780043 13712159 13529035 13383121 13113655 12892936 12750277
11836 12750277 12511408 12439650 12375042 12215905 12010658 11859695 11708095 11465468 11288730 11167946
11826 11167946 11025635 10951934 10855893 10735461 10633488 10451236 10267741 10062397 9938493 9748445
11816 9748445 9488078 9370659 9255169 9165902 8997130 8943347 8872418 8791230 8730573 8648404
11806 8648404 8592190 8548387 8385921 8126322 7985641 7856637 7771503 7705383 7662997 7572065
11796 7572065 7420321 7288320 7269746 7218944 7187419 7180231 7091695 7004892 6888413 6830827 6781633
11785 6781633 6734816 6591494 6438509 6385317 6394885 6288289 6011117 5974400 5999388 6016844 5943275
11774E943275o2304l6315j25739J2866P309p9620j23346j22788k03545m4806k3969
11763E141018j15601l2688n3057k0002J2907M1102m0275j20399r1157l2063l4293
11752D655492J4953q7454o4527j17102k9179K5837k2181r1939j32565O3889q0321
11741D134903K307j2463M3721k4008j41727j62361j20556J2921K5684K3311N3396
11730C835128o7782o4352k4381l6361J5332k694M9152J0174K6057M604p5064o3020
11718C606793N3923k0447m8181l363p4366l0961o0139p1284J5328n2319p8438
11707C236546K5351l8710L044K15638J7896q0285K8326k1058q6141j50541j58384
11696B991682j4822L8805l6469m4189K8108j4410k4859o9827j8769J7839J3912
$$ plain form
11774 5943275 5880971 5844656 5718917 5731783 5739092 5659472 5536126 5413338 5209793 5164987 5141018
11763 5141018 5025417 4992729 4939672 4919670 4932577 4973679 4933404 4813005 4721848 4689785 4655492
11752 4655492 4670445 4582991 4518464 4401362 4372183 4398020 4375839 4283900 4151335 4215224 4134903
11741 4134903 4137210 4124747 4168468 4144460 4002733 3840372 3719816 3732737 3758421 3781732 3835128
11730 3835128 3767346 3702994 3678613 3642252 3657584 3654890 3704042 3714216 3740273 3744877 3669813 3606793
11718 3606793 3660716 3640269 3592088 3588725 3514359 3483398 3423259 3351975 3367303 3314984 3236546
11707 3236546 3261897 3223187 3226231 3441869 3459765 3379480 3407806 3386748 3300607 3150066 2991682
11696 2991682 2976860 3015665 2979196 2935007 2963115 2948705 2923846 2854019 2835250 2853089 2867001
11685B867001k0904q3148k3755L6495L1741r54L0258j44267j12133O501j0846
11674B575989J05679M3215J696M7717q9114j15823j7468j20724q2795J4751O901
11663B370024L481Q1681J8562q3141L4018p9222o7810N0524m1879K4517l6455
11652B274300j14309n6392q8472l0422K0267P6660O1382K548l7629K1526n7814
11641B071645M1671M4978j08845p819l3537o1613q8088j407L7871N4187L6580
11630A985623j852q3690j5343k1078R690J035k1294Q1923n3705n9954o1571n8530
11618A701254k7114K6756M4201K0474j7515O6494J23734n0467j28725n9737m095
11607A695260j0948j69587j29480L6614L0434K06588O6495m0540p9768k3132l2413
$$ plain form
11685 2867001 2846097 2762949 2739194 2775689 2807430 2806476 2836734 2692467 2580334 2586835 2575989
11674 2575989 2681668 2724883 2726579 2774296 2685182 2569359 2551891 2431167 2348372 2363123 2370024
11663 2370024 2373505 2455186 2473748 2390607 2424625 2345403 2277593 2328117 2286238 2310755 2274300
11652 2274300 2159991 2103599 2015127 1984705 2004972 2081632 2143014 2145562 2107933 2129459 2071645
11641 2071645 2113316 2158294 2049449 2041630 2008093 1946480 1858392 1856985 1894856 1949043 1985623
11630 1985623 1983771 1900081 1884738 1863660 1873350 1874385 1853091 1935014 1881309 1821355 1759784 1701254
11618 1701254 1674140 1700896 1745097 1765571 1748056 1814550 1938284 1887817 1759092 1699355 1695260
11607 1695260 1684312 1514725 1385245 1421859 1452293 1658881 1725376 1684836 1605068 1581936 1549523
11596A549523l4613J23716J136q7909m7653n7851J5413K9306L6907o1253j10242
11585A356480N740K5325R5459K719l0126k3509O904M6829j3739J5566J6809k4647
11573A479810R963R340O3591o8444M3667L335p8114Q229J13802n2559K3341Q243
11561A564204p402M2670m9158o7766q047M362j06271n85j9107j00936o661j1653
11549A233650l3788L2710L2156J06247P745q0582r966n3066r2852o4831N2464
11538A129887J21104M6819j13286m8288o8862M1750J26157J72714m0817j01196
11528A265982m9162Q1972P3888L1541q6290m0153o9793J5643O0012j0965r4231
11517A178444j33998o7297m3499L5688L3568m0009k7830K3502J08862K9668r0897
$$ plain form
11596 1549523 1514910 1638626 1639762 1551853 1504200 1446349 1461762 1491068 1527975 1466722 1356480
11585 1356480 1362220 1387545 1483004 1485723 1455597 1432088 1438992 1485821 1472082 1487648 1504457 1479810
11573 1479810 1489773 1499113 1562704 1494260 1537927 1541262 1463148 1471377 1585179 1532620 1555961 1564204
11561 1564204 1556802 1599472 1550314 1482548 1474501 1478863 1372592 1372007 1352900 1251964 1245303 1233650
11549 1233650 1199862 1232572 1264728 1370975 1378720 1298138 1288172 1235106 1142254 1077423 1129887
11538 1129887 1250991 1297810 1184524 1136236 1067374 1109124 1235281 1407995 1367178 1265982
11528 1265982 1216820 1298792 1372680 1404221 1317931 1277778 1207985 1223628 1283640 1272675 1178444
11517 1178444 1044446 977149 933650 969338 1002906 962897 935067 958569 1067431 1097099 1006202
11506A006202p0628p707M3897N964Q824P9315K3550p6784k0628J6171J8358J656
11494A028190r2549m2891j7564J9810n911m9965r92N760j2850J9729K5485Q0721
11482I56973l7838n219J20444j0760J66j1418J906j25037n8024p0017J5246J21662
11470H98084O298R3959M5503l9651J9416L5777L5939j35623j21237p8151N5881
11459H16195J06782J30826r1475m3031R3477l8246l4996K9976O4897n8913o1305
11448I14187L2121k6371O8559O61r8322k5811j3208J7592K98r6135n3767K8658
11436G48462M502N797K6316R7705O3653p7249o5427j8366N8142K100P3472N4853
11424I73960l0008l6821r6932j7607r53J6498L7758M4364J6520k5034N5803o1282
$$ plain form
11506 1006202 935574 927867 971764 977728 986552 1065867 1089417 1012633 992005 1008176 1026534 1028190
11494 1028190 935641 892750 875186 894996 889085 839120 838128 843888 831038 850767 876252 956973
11482 956973 919135 913916 1034360 1023600 1023766 1012348 1014254 889217 831193 761176 776422 898084
11470 898084 904382 998341 1043844 1004193 1023609 1059386 1095325 959702 838465 760314 816195
11459 816195 922977 1053803 962328 919297 1012774 974528 939532 969508 1034405 975492 914187
11448 914187 946308 919937 988496 989157 890835 865024 851816 869408 869706 773571 719804 748462
11436 748462 752964 758761 785077 882782 946435 869186 803759 785393 843535 845635 919107 973960
11424 973960 943952 907131 810199 792592 791639 808137 845895 890259 906779 881745 937548 876266
11412H76266r1253o0065O2324P7786P9833k796q2435n6194K0885J08083Q898j21839
11400H19493q4694m5183J51490O7815j30027k8416n7772j8554J01716n6587j04568
11389F14713M7810R5244j2596j34829o2479J28736J18772P9438r6969j35014M3645
11378F86471R6246O5421k8961j45552j0944O8391m3203j7213r0312n0891r456
11367E19997J8160J30533q8507o605m7904J5610K797L8207J4786K5786j7212l8442
11355E67206P9504j1932l0095k9219K448J28386P1830n2768j28080R819j36158
11344D70941o166J15198J4104N4651J3592l2825j0330k2444j14952K0641J04883
11333F07293J06561n435m1874q1006M9711M4446j05629O4660Q2076L4960l844
$$ plain form
11412 876266 785013 724948 787272 865058 944891 942095 859660 803466 824351 932434 941332 819493
11400 819493 734799 689616 841106 908921 778894 750478 692706 674152 775868 719281 614713
11389 614713 662523 757767 745171 610342 547863 676599 795371 874809 777840 642826 686471
11378 686471 782717 848138 819177 673625 662681 731072 687869 670656 580344 529453 519997
11367 519997 538157 668690 580183 573578 525674 541284 544081 582288 597074 622860 605648 567206
11355 567206 646710 634778 604683 575464 577912 706298 778128 725360 597280 607099 470941
11344 470941 464775 579973 594077 648728 662320 629495 619165 596721 481769 502410 607293
11333 607293 713854 708419 666545 585539 635250 679696 574067 638727 720803 755763 751919
11322G51919q9778q434O528J4697r3530l8501q5884m6799m8583K738M4686J13287
11310E22346Q5175j3425P8606n02o8720o5733P6988J00497k61j31234m3165jJ128
11297E41699L1257l5603n5179L8200J8890O3539M1951q428m8119n2019r69J65430
11285G00649O5456n6118j18452j23682k1868p3155m1284N9074L7139N9374j7710
11274D69423R344p2491k3451N3187O5182J04484J54p9546j1590j1698R060Q7127
11262E99185j5251L8576N9286P333j0850J0785o3141r6788j656j798n0644L970
11250D79007J5463j6546l1316N5786P3721J6917l5041q9287L451P57j11138J9273
11238C81047R0586k2403N4023P4083k2768r7485J7495j8263n7346n673r506j8708
$$ plain form
11322 751919 662141 653707 660235 674932 581402 542901 457017 410218 361635 364373 409059 522346
11310 522346 607521 594096 672702 672200 603480 537747 614735 715232 714971 583737 540572 540571 541699
11297 541699 572956 537353 482174 520374 539264 602803 644754 636326 588207 536188 535219 700649
11285 700649 766105 709987 591535 467853 445985 372830 331546 390620 427759 487133 469423
11274 469423 478767 406276 382825 436012 501194 605678 605832 526286 514696 502998 512058 599185
11262 599185 583934 622510 681796 689129 678279 689064 625923 529135 527479 525681 475037 479007
11250 479007 494470 477924 446608 502394 576115 593032 557991 468704 472155 472912 361774 381047
11238 381047 471633 449230 503253 577336 554568 457083 474578 456315 398969 393296 383790 365082
11226C65082J3595j2551J9792q725o6317N9000Q9708l5343M8312m0662n7023N3018
11214D27886N4134J08347K8188n8397P6507L5965k5500j65747j9855P1608o5235
11203D67901o8507K4210O5073K03666q3299j07358j1526m8165j21202q6440P8762
11192C13115J72108O1556l4679j16218j04176j71833J7873J52162O3384o3670
11182B89622q9416j6839M9128J8361J36005J33213q445m0040O3506O8724j31836
11171D71983q1311K5096Q237o827L1239J6804L6497n2597K2554j3523q7303n3834
11159C17015J4174p001n5720Q449m8815Q2632L1127J2868l9634l5239n1504L4603
11147B62955N0217M4635P7602k1676N9364m6666q1927K2497M3568M0854j20358
$$ plain form
11226 365082 378677 366126 385918 377193 310876 369876 459584 424241 472553 431891 374868 427886
11214 427886 482020 590367 618555 560158 636665 672630 647130 481383 461528 533136 467901
11203 467901 399394 423604 488677 692343 609044 501686 490160 441995 320793 234353 313115
11192 313115 485223 546779 512100 395882 291706 119873 137746 289908 353292 289622
11182 289622 200206 183367 232495 250856 386861 520074 511629 471589 535095 603819 471983
11171 471983 390672 415768 424005 417178 448417 465221 501718 449121 471675 458152 370849 317015
11159 317015 331189 324188 268468 276917 228102 310734 341861 354729 315095 279856 228352 262955
11147 262955 313172 357807 435409 413733 473097 426431 344504 367001 410569 451423 331065
11136C31065p7222m0949J1016J25288J29652J8021o1778L9135r47j92798o2202
11125B18281Q0030J43847o915r4790M4724J5936k445k2166L7941M2208m1481m6789
11113C68381j759n1912j3224M2325M7712j7915n9200o8958J28805M8617o4197
11102C58675K1113J07197o9540n6344p7179K0905J13760O329O8615k0550N201
11091D78182l0032j18388J641K9988K4517L9000p4824k6535m7638M6193N4127
11080C76231p4700k9553J6924L636K044R7806k7005j57277n1852L2641J0067o5396
11068A33566J2997J6621k1083m7801J9946K1917M1582M5179q0028l5890K5301
11057A32307L60n8112R1209J34857N937Q7072J05722K7836j15498M9930N6267
$$ plain form
11136 331065 253843 212894 223910 349198 478850 496871 435093 474228 473281 280483 218281
11125 218281 298311 442158 435243 340453 385177 401113 398668 376502 414443 456651 415170 368381
11113 368381 366622 314710 301486 343811 391523 373608 314408 245450 374255 422872 358675
11102 358675 379788 486985 417445 361101 283922 304827 418587 424916 493531 472981 478182
11091 478182 448150 329762 331403 361391 385908 424908 350084 323549 275911 322104 376231
11080 376231 301531 271978 288902 292538 294582 392388 365383 208106 156254 188895 198962 133566
11068 133566 146563 163184 142101 94300 114246 136163 177745 222924 142896 107006 132307
11057 132307 132667 74555 165764 300621 306558 393630 499352 527188 411690 461620 517887
11046E17887n7552j0506J4903k7313n3624N4028L4143J50981K185P9176J37207
11035H41515Q5018P9684O220j21039q0792K8121l2189k5288m416J31473J29016
11024A037323R6296L7150q6002k7582l1303l7332m2755k2104j08249N8703K0444
11013H94589N7745J04679J8369m3270l4770m9220j74760j05815r9012q0066L2656
11002E21125J71169l305k3997k7735p132p1143j8157M3962J6971N9692n8750J8942
10990F21642l453o2868j61371m5214J24193l5221o6883O2968K8150n3194m6820
10979C61929K2997k5880m8767o8927m500M9690l9543N9424O9832l9006m925J7921
10967C50245L3976L2163Q570M5345o8285q4583j06972J04706k7964n4315k2761
$$ plain form
11046 517887 460335 449829 464732 437419 383795 437823 471966 622947 625132 704308 841515
11035 841515 926533 1006217 1012437 891398 810606 838727 806538 781250 776834 908307 1037323
11024 1037323 1133619 1170769 1084767 1057185 1025882 988550 945795 923691 815442 874145 894589
11013 894589 952334 1057013 1075382 1032112 997342 948122 773362 667547 568535 488469 521125
11002 521125 692294 688989 664992 637257 630125 558982 540825 584787 601758 661450 602700 621642
10990 621642 618189 555321 393950 348736 472929 437708 370825 433793 461943 408749 361929
10979 361929 384926 359046 310279 241352 236852 286542 246999 306423 376255 337249 332324 350245
10967 350245 384221 416384 424954 470299 402014 317431 210459 315165 287201 232886 210125
10956B10125m6557K3817J12390k9471j2594K3850l1183o4396L4663P2751n659
10945B87736j41107n4637L9475Q4568M2645P5115Q0840N1618k3039J03445j94039
10934C52620j58134k4803J27N423N6590Q7212K8498o3928j3975o4306Q3786M4989
10922C34099j3996r3001n619n6819k1121M0285O4184K07O394l2838q865o4530
10910A48380j1849J7658P2859q1727p1076j2010K1885J03838O1011j6463l1023
10899B01483P8641M3236n4385r2060J9224q6975K5912O5208m795N944P4910J5316
10887B91659K2034P2951j07587p3500q5917j3851N9936q5222l4352J12785R59
10876A59895l360O9313Q8853J6092r8308j08814O9402J8761l7325P645K6055j13731
$$ plain form
10956 210125 163568 187385 299775 270304 257710 281560 250377 185981 220644 293395 287736
10945 287736 146629 91992 131467 216035 258680 333795 414635 466253 443214 546659 352620
10934 352620 194486 169683 169810 175233 231823 319035 347533 283605 269630 205324 289110 334099
10922 334099 320103 227102 221483 164664 143543 183828 248012 248219 254613 221775 212910 148380
10910 148380 136531 154189 227048 145321 74245 62235 84120 187958 248969 232506 201483
10899 201483 280124 323360 268975 176915 196139 109164 135076 200284 195489 201433 276343 291659
10887 291659 313693 386644 279057 205557 119640 105789 165725 80503 46151 158936 159895
10876 159895 156535 225848 314701 330793 232485 123671 193073 211834 174509 182154 208209 94478
10864I4478l1985M4566l5393J36445N6014m3968k3060N6002j05749p2015k2143
10853E3192J8031N1201J08903P3053m5191Q4600K2090j32972n6654K2455k0559
10842A78149K5139l3100o8747J08060O2058J8929l3211N3808K0062p6272j07738
10831A47137n8299Q0239O1503K5495N905l5576O760J9217J60670k9952k7575m3622
10819C11902o7941o3808m4693n4741J5596j0756j8252J24699o4766p8160Q5762
10808A34842P5472J08258o3018l1138n2795l2085l9067k3883n3086R272L7514
10797G0286k9830Q839q047k883K9157K2197J02305N3705m4323p3252m643p0213
10785E3298r466Q4764J35019K2100q7793j0336k3862N4001o20k1395j09221j10018
$$ plain form
10864 94478 62493 107059 71666 208111 264125 220157 197097 253099 147350 75335 53192
10853 53192 71223 122424 231327 304380 259189 343789 365879 232907 176253 198708 178149
10842 178149 203288 170188 101441 209501 271559 290488 257277 311085 331147 254875 147137
10831 147137 88838 169077 230580 256075 261980 226404 233164 252381 413051 383099 355524 311902
10819 311902 243961 180153 135460 80719 96315 85559 67307 192006 127240 49080 134842
10808 134842 210314 318572 255554 224416 171621 139536 100469 76586 23500 32772 70286
10797 70286 40456 49295 41248 38365 67522 89719 192024 245729 201406 128154 123511 53298
10785 53298 43832 128596 263615 285715 197922 187586 163724 217725 217105 195710 86489 -23529
10773b3529Q721Q2156O4340J07174L9877J8021n9455k9185K0378J36430P4518
10762D39446l4783o8763K5994k6011j01383m8209k815K4999M2358m9165M3694
10751B45362M2347N1233o0299K5733J2510m0839q088k7698O5364J3369N7316r9177
10739B77133j93851r2101O203l3099L3856Q0121K2431o4841p5366j1686P4103
10728B2903P4682J51694k340m4052J039p8746k063M3719m0230L8222q2453J06375
10716A88750J00576o6800o4842J8803L003j5857j37502k8913j3198l3681M8314
10705a347P6028J31991j1376M571m4534K3826K9429M4984O3808r9958P6599l0024
10693B63997j0399p5965l4756P0981L3084l0890k7096P8249M4435J27621M4540
$$ plain form
10773 -23529 -14808 67348 131688 238862 278739 296760 237305 208120 228498 364928 439446
10762 439446 404663 335900 361894 335883 234500 186291 183476 208475 250833 201668 245362
10751 245362 287709 338942 278643 304376 316886 276047 267959 240261 305625 318994 376310 277133
10739 277133 83282 -8819 -2616 -35715 -1859 78262 100693 35852 -39514 -51200 22903
10728 22903 97585 249279 246939 202887 203926 125180 123117 166836 126606 164828 82375 188750
10716 188750 289326 222526 157684 176487 179490 163633 26131 -2782 -15980 -49661 -1347
10705 -1347 74681 206672 195296 199867 155333 179159 208588 253572 317380 217422 294021 263997
10693 263997 253598 177633 142877 213858 246942 216052 188956 267205 311640 439261 483801
10682D83801o7149j05338j5272J70308O6566j17759l0597n7288k7686O3581m5307
10671C17860J02774O1592q3631r587Q1206O8809k4995N578J8165O5708J339l5742
10659E69076N9423q210l5248L7553N3223J67643J5404j43144p6117j16416J23766
10648F46953J53598J99092J21045L7110J8189N3355P9692O6313r767J32527K86831
10637A784938K86475K58730J22018J62342L00616M60521M61097L55461M08423
10628D600621L53084O44390R13820J167154J607992K125673K816962L694320N024227
10619B2948243O174517P136540P276837N784267L013155K62584j107847r33218
10611E0555078M68792K571803N326191Q483495J1764029J4193585J3893263R749209
$$ plain form
10682 483801 416652 311314 296042 466350 532916 415157 384560 327272 299586 363167 317860
10671 317860 420634 482226 398595 389008 470214 539023 514028 519606 537771 603479 604818 569076
10659 569076 628499 620289 585041 622594 675817 843460 858864 715720 639603 523187 646953
10648 646953 800551 999643 1120688 1157798 1175987 1229342 1309034 1375347 1365580 1498107 1784938
10637 1784938 2071413 2330143 2452161 2614503 2915119 3375640 3836737 4192198 4600621
10628 4600621 4953705 5598095 6511915 7679069 9287061 11412734 14229696 17924016 22948243
10619 22948243 29122760 36259300 43536137 49320404 52333559 52596143 51488296 50555078
10611 50555078 51023870 53595673 58921864 67405359 79169388 93362973 107256236 117005445
10603A17005445K494930m410568p404777o430147l332487P77421N420501J0279064
10595A14399382J4809562J7536274J6007735Q787657k625660j2442099j5863360
10588A40609491j4212438j0241003n649987j182116L028330O537733Q269874O799714
10580A33959598J607620o253559j2325772j4083320j2303703r147664o024443
10573G5428757l426539j246849M67459R55299J60967k063847n111002p237602
10565E7926643p873620p170591n995852m905078l790235l085712k560841k081833
10557B0462881j886016j531636j306228j263245j215612j163363j075282q84018
10549A0137481p78968p91698p09125o69646n84431m25267k91619l57835m32423
$$ plain form
10603 117005445 119500375 115089807 107685030 101254883 97922396 98699817 104120318 114399382
10595 114399382 129208944 146745218 162752953 171540610 168914950 156472851 140609491
10588 140609491 126397053 116156050 110506063 109323947 112352277 118890010 127159884 133959598
10580 133959598 135567218 129313659 116987887 102904567 90600864 81453200 75428757
10573 75428757 72002218 70755369 71222828 72178127 72339094 70275247 65164245 57926643
10565 57926643 50053023 42882432 36886580 31981502 28191267 25105555 22544714 20462881
10557 20462881 18576865 17045229 15739001 14475756 13260144 12096781 11021499 10137481
10549 10137481 9358513 8566815 7857690 7188044 6603613 6178346 5886727 5528892 5096469
10540E096469k48756l52616l81166k91408j87115j17338k21531k23188k92387
10531B780964r2891o4606j01522o1036j4824j54578j42016l755Q452j05386j68418
10520A880384m6932n2095k1501Q1319p1196r4675r6953L1970r4431m0653k6053
10509A449184l8835k546o4843r546Q5516o9608O6472k7409r535K9657q1598n1295
10497A275614r7056p4558j1111j20169j38281j03342m02N7709K5526J06780K08921
10486A129631q3565j38385n0404M8151J2497j15370j1822J4184M24Q2287Q1045
10475I68673P9301l5586J2759l576j00814p8487n6568J2825J40713j6765J14586
10464A037061J27782O9948p1969n0878L9096q3756j32947K7919Q0810J7408Q698
$$ plain form
10540 5096469 4847713 4495097 4113931 3822523 3635408 3518070 3296539 3073351 2780964
10531 2780964 2688073 2623467 2521945 2460909 2446085 2291507 2149491 2145736 2154188 2048802 1880384
10520 1880384 1833452 1781357 1759856 1841175 1769979 1675304 1578351 1610321 1515890 1475237 1449184
10509 1449184 1410349 1407803 1342960 1333414 1418930 1349322 1415794 1388385 1378850 1408507 1326909 1275614
10497 1275614 1178558 1104000 1092889 972720 834439 731097 730695 788404 813930 920710 1129631
10486 1129631 1046066 907681 857277 905428 917925 802555 790733 804917 805341 887628 968673
10475 968673 1047974 1012388 1025147 1021571 920757 842270 785702 798527 939240 922475 1037061
10464 1037061 1164843 1234791 1162822 1111944 1151040 1067284 934337 962256 1043066 1060474 1069172
10453A069172N691L9922k4531j45335r8861m0117M0m4428O6682o0457k5037p710
10441G35031N1826R4986p2064j1685J6328q7555n5424L3915l933o6483p7249Q5687
10429F43380N8703k6070M9902K6225j06001L164L2160o6796j19953k4410m3374
10418D26930J8248O7349l9839p3932J2375L9521n3782k2783M5720j2351j09157
10407B98299M0529k1951m1377M4699Q7393p794L0937n099j5822M3430M9508j1176
10395D91576q6526M7330L6650o9932J1487r2194p4578O8004R7950k2844K8152
10384D35075k690o8637P1283k6635L4661l6994j1367O2055m1922j31759K1203
10373C04273M5530R4237k343O287j3265o9157q0538J1440Q9668N4869m1382L14
$$ plain form
10453 1069172 1074863 1114785 1090254 944919 846058 805941 805981 761553 828235 767778 742741 735031
10441 735031 786857 881843 809779 798094 814422 726867 671443 705358 701425 634942 557693 643380
10429 643380 702083 676013 725915 752140 646139 649303 681463 614667 494714 470304 426930
10418 426930 445178 512527 472688 398756 411131 450652 396870 374087 419807 407456 298299
10407 298299 338828 316877 275500 320199 407592 399798 430735 425636 409814 453244 502752 491576
10395 491576 405050 452380 489030 419098 430585 338391 263813 331817 429767 406923 435075
10384 435075 432385 363748 435031 408396 443057 406063 394696 456751 414829 283070 304273
10373 304273 349803 444040 441697 447984 434719 365562 285024 296464 386132 441001 399619 399933
10361C99933j8154j3399l4464q2267k1498J82017M6973l8863k3994k3142l4841
10350C38301N8150J9377n8679o0776P8462R685l6037r439m5684K111P4724J35737
10338E05932j7402n2751P464K2065p7651k4734k1849m1962J5419M3341k3122n8971
10326B75779O338K1107j4971k8215N680l5567l2203r952l695O929M7283M3273
10314B81786k9389R0513p3931l7710k523P3936M0342j06627K1269k9106J33344
10303C61904J00449n5227j34010q6306k61Q3810j3059r6678K0300L2014O6925
10292B79861J85653l0018j60915p1588O089j2178L2460j16234j04696k350M8316
10281E4400J4789J13662J50881k6517m4403o3123M148o1955J441J28770N6432
$$ plain form
10361 399933 381779 368380 333916 251649 230151 412168 459141 420278 396284 373142 338301
10350 338301 396451 415828 357149 296373 374835 384520 348483 339044 293360 295471 370195 505932
10338 505932 488530 435779 443243 465308 387657 362923 341074 299112 314531 357872 334750 275779
10326 275779 282117 303224 288253 260038 265718 230151 197948 187996 184301 191230 238513 281786
10314 281786 252397 342910 268979 231269 228746 302682 343024 236397 257666 228560 361904
10303 361904 462353 407126 273116 186810 186549 270359 257300 160622 180922 212936 279861
10292 279861 465514 435496 274581 202993 209082 196904 229364 113130 8434 6084 54400
10281 54400 69189 182851 333732 307215 262812 199689 203837 141882 143323 272093 328525
10270C28525o8195q900N727M9843k1897j18379q2216P3003k6373q7331P0040L2401
10258A46248r6966Q4871P8586m2655p885o372l673J3308m0016L8471J19230M9801
10246C32948k175m3825n0550j8437K8954N2515r7196k6783L0686J5317k2639K8379
10234B27194K3553J18581M6855j31682l9177R2693k9566n4758O5024L3726l5689
10223C16754p8614P3091K7870L4740k3333n2755k7749L1592O1989P5786k1062
10212D18309o9976l7302J4735n3642r6631J9467J02336l7023m1192J7465L9361
10201B75907k3755r905k1552l5634J2506p398P3079P9165K4833K6799j14053p2120
10189B07872M5117Q4996M4736M1151l0447m3529K0429k0737O915k8199J12021
$$ plain form
10270 328525 260330 251430 257157 307000 285103 166724 84508 157511 131138 43807 113847 146248
10258 146248 49282 134153 212739 170084 162199 155827 152154 165462 125446 163917 283147 332948
10246 332948 330773 286948 236398 217961 246915 299430 202234 175451 206137 221454 198815 227194
10234 227194 250747 369328 416183 284501 245324 338017 308451 253693 318717 352443 316754
10223 316754 238140 311231 339101 373841 350508 297753 270004 301596 363585 439371 418309
10212 418309 348333 311031 325766 272124 175493 194960 297296 260273 219081 236546 275907
10201 275907 252152 242247 220695 185061 197567 190169 263248 342413 367246 394045 279992 207872
10189 207872 252989 337985 382721 423872 393425 349896 370325 349588 356503 328304 440325
10178D40325J53311n558j3912M356q2350L870J00236K7146R7156o6095M7102j1378
10166F94209j6864J0166J1735k250R9308O0185r1107L7022J17801J95467P4477
10155A190149k9496j60613j28963o7638J9758k039j01327N2994N7324k4849L0731
10144H36031O2587O2358p4250j9212j709j10429j00463j12041J13582M0217M6179
10133G42850j9704K3770N3445o6264j32935P040R815j63987j06369m5345Q1669
10122C83985l7881O2431n1649n6339N2449N6788K2446o5451q1725R202K5000l6780
10110B82476m2892l8082j5794K4086J6271n4975n8940k039J19662J07027j8410
10099C18390m4483k7268r9973q3301k5929M7872L3377m1462K8749Q3306J58820
$$ plain form
10178 440325 593636 588078 574166 578522 496172 500042 600278 627424 724580 658485 705587 694209
10166 694209 677345 687511 699246 696996 796304 856489 765382 802404 920205 1115672 1190149
10155 1190149 1160653 1000040 871077 803439 823197 821158 719831 772825 830149 805300 836031
10144 836031 898618 960976 886726 867514 865805 755376 654913 542872 656454 696671 742850
10133 742850 723146 746916 800361 734097 601162 608202 618017 454030 347661 302316 383985
10122 383985 346104 408535 356886 300547 352996 409784 432230 366779 285054 294256 319256 282476
10110 282476 239584 201502 185708 209794 226065 171090 112150 110111 229773 336800 318390
10099 318390 273907 246639 146666 63365 37436 85308 118685 77223 105972 189278 348098
10088C48098k0696n5771j8662p3476l6667m4815n9918M5905J5669L4112M0449
10077A74228O5874J0986l5056l8520k7760L81o6480q696L8982R9304o3767K3618
10065A73094J5905q2487K3701N1656k1393K2080J8819l0591o1767N3581J31120
10054B93718k3594o3056n7036o5729P6480R3803p9480o3400j9962O1171j694j57927
10042f706m9132P6339l8349J4910J33080Q9061K2026p463N2665J1224P672p5084
10030B30243n205q4242r2130M1131J26461J0976m3750O3832M9360j09769m6382
10019A40525k3196j4944O7192J7711J9021L8879k1047p0465J4645J12879j04238
10008A76962j21891K4157J02031m7482j9635m1238j11196P9749M9345k9188j02503
$$ plain form
10088 348098 327402 271631 252969 179493 142826 98011 38093 83998 99667 133779 174228
10077 174228 240102 251088 216032 177512 149752 150133 83653 74957 113939 213243 149476 173094
10065 173094 188999 106512 130213 181869 160476 182556 201375 170784 109017 162598 293718
10054 293718 270124 207068 150032 84303 160783 254586 175106 111706 91744 152915 151221 -6706
10042 -6706 -55838 20501 -17848 -2938 130142 219203 241229 233766 286431 297655 305327 230243
10030 230243 225038 140796 48666 89797 216258 227234 183484 247316 296676 186907 140525
10019 140525 117329 102385 169577 187288 206309 245188 224141 153676 168321 281200 176962
10008 176962 55071 79228 181259 133777 114142 72904 -38292 41457 90802 61614 -40889
9997d0889L0459J09966k8451k8580M5155n8705l6821M2650J9640o832M6908L2483
9985A26983o307J09091J14730k6001K3482Q627m5757o3973k5283R4012O7302m0726
9973C36180k8787r5563j24825k0004O1825K440n8010p2552j10042L8760J55334
9962H4756R9657Q584l9090r4141J31325N7570P735J16344n5801k0199p5927n5198
9950A65615N4787R0627o6824l9626M0534p7931j9655J0211J5698M3951o4244N805
9938A58948j00697j5266J12011M2411o2189q205L2431K966K0467L6954O2957K3706
9926C06494K4942j28232l0361R5788m8531j03265j06983N218M4362J19551J00575
9915B79558J1727l051q5549l1697M6230l8137k0168J2437k3999j5581m1446O2089
$$ plain form
9997 -40889 -10430 99536 71085 42505 87660 28955 -7866 34784 54424 47592 94500 126983
9985 126983 120676 229767 344497 318496 341978 350605 304848 240875 215592 309604 376906 336180
9973 336180 307393 211830 87005 67001 128826 131266 73256 704 -109338 -70578 84756
9962 84756 184413 192997 153907 59766 191091 248661 256396 372740 316939 296740 220813 165615
9950 165615 220402 311029 244205 204579 245113 167182 147527 157738 173436 217387 153143 158948
9938 158948 58251 42985 154996 197407 135218 127013 159444 162410 182877 219831 282788 306494
9926 306494 331436 203204 172843 268631 220100 116835 9852 15070 59432 178983 279558
9915 279558 291285 288234 202685 170988 217218 179081 158913 171350 147351 131770 90324 152413
9903A52413P9680O3133K0781p3035l3984p0029L2173K4619l1788p9038l3814L9059
9891I0170M271L131O2636l4847r1581n0863M5508Q0147L2774m6325j6672N1642
9879A29991q208m5936l9333o234J27535m575p1421J15760K4689J5925o7760k9617
9867A40816j15535J0713n8387J29815N2538L372n1205k7049K2412p441k5470p3472
9855A107P4745J31961J1704O1853q608N2484j1709l5903N3030m3266M1028J1707
9843C40133J743j49995l3123J05208p6928R177k2340N5753M6857N2259p5820m1295
9831B11629q2129k2666J48139l9134j07901j59041n7234Q2717J62738L2650N6857
9820B26625K4180r9334L1077L0063J662k2796l6804o3179l025k8084o0040O6249
$$ plain form
9903 152413 232093 295226 316007 242972 208988 138959 171132 195751 163963 84925 51111 90170
9891 90170 94441 97572 160208 125361 33780 -17083 28425 108572 141346 95021 78349 129991
9879 129991 121783 75847 36514 30280 157815 153240 81819 197579 222268 238193 170433 140816
9867 140816 25281 35994 -22393 107422 159960 163332 112127 85078 107490 100049 74579 1107
9855 1107 75852 207813 219517 281370 272762 325246 313537 277634 330664 287398 328426 340133
9843 340133 341876 191881 158758 263966 187038 196215 173875 229628 276485 328744 252924 211629
9831 211629 129500 106834 254973 215839 107938 -51103 -108337 -25620 137118 169768 226625
9820 226625 250805 151471 182548 212611 214273 191477 154673 91494 88469 60385 345 66594
9808F6594R8124o133J8289n547J6684k4250J1809n5214N7154m5094j8763m5022
9796F8631j37294M9299M5262m874K4670O229O9165J419R4289p1045K1988j0716
9784A57023p5477P1700L9469p3589M1223l6310N0799M0353o5951q5837m6812K1629
9772C8220J11068m5336o0403j689m3452l4111m0888n1924M2866R9327Q1891Q346
9760A03915M1331n2246k2211M7936m2750J34525k8469p021L4992q5002j20960
9749D040k5576m3190J15324M6719r415Q3515l7329m0633k5204r404K8122L0664
9737A17633J2118M9776P7282j05703o1660J5609m5111M063n3689j3838j6697N204
9725a5013J22611j36l1945J7836J7808P103J18373j00244j16126P026m2897M838
$$ plain form
9808 66594 164718 158585 176874 171327 188011 163761 175570 120356 177510 132416 113653 68631
9796 68631 -68663 -19364 25898 21024 45694 51923 121088 122507 216796 145751 167739 157023
9784 157023 81546 153246 192715 119126 160349 124039 174838 215191 149240 63403 16591 38220
9772 38220 149288 103952 43549 41860 -1592 -35703 -76591 -128515 -85649 13678 95569 103915
9760 103915 145246 93000 70789 118725 75975 210500 182031 175010 210002 125000 4040
9749 4040 -21536 -64726 50598 97317 87902 171417 134088 93455 68251 58847 86969 117633
9737 117633 129751 179527 256809 151106 89446 105055 59944 64007 10318 -3520 -20217 -15013
9725 -15013 107598 107462 75517 93353 111161 118264 236637 136393 20267 27293 -15604 -10766
9713a0766j3947m6243P6932l120j38454m8230L3522J33802N7003k8880p9723R244
9701e8860l2003n518L5620L2946p5439j06062n2272J52394J48792l7722m2792
9690d0916k0536l8198j1117R1370q967J8014K7598O8766k1623K1437l4969M5973
9678I6832O0050j9182p573R2249R7744j19205r7139M773N5632O4084L7336q1354
9666A84247P241n37K4957r2743j04826J4710O3253Q7572P1251J81397K6968J60702
9654F24192M05124L87554L65579K70123k76323m81212m04556k98088j25538o3986
9644D02869j921O9184n3271m7672j09348m1935J8687K9332O979k3827o8127m0340
9632A40610L176p7987j6021p33M4001M0367Q2564J7980R8586n2739j38914k9881
$$ plain form
9713 -10766 -24713 -70956 5976 2856 -135598 -183828 -150306 -16504 40499 11619 -68104 -58860
9701 -58860 -90863 -96381 -60761 -27815 -103254 -209316 -261588 -109194 39598 1876 -40916
9690 -40916 -61452 -99650 -110767 -19397 -28364 -10350 17248 86014 64391 85828 50859 96832
9678 96832 156882 137700 130127 222376 320120 200915 103776 108549 164181 228265 265601 184247
9666 184247 191488 190951 215908 123165 18339 33049 96302 183874 255125 436522 463490 624192
9654 624192 1029316 1416870 1782449 2052572 1776249 1295037 890481 592393 466855 402869
9644 402869 400948 470132 416861 369189 259841 217906 236593 265925 272904 249077 180950 140610
9632 140610 143786 65799 49778 49045 93046 133413 215977 233957 332543 279804 140890 111009
9620A11009P4081j1649j3272J63060o3154q9963o3408p1140j32496K1150k0300
9609i6082P5760O7355L5194L6934J2302k5057p3525l3060K1537M2588O9060k8033
9597A04973j20754k4249J03321L7715j4491l760j09568R5185j5893R7806j8357
9586A31928k4925K9004n5959N8373K6520p0439L2355R0269n5711q2368n5708j28376
9574a05037K8443Q4162o8609l4688N0930P7548K1182K1031J8018L2141o0712m9486
9562A4923R678M7890P1760J5076o7795O0186o8223j02235n4527p010Q1008K5859
9550B6590J8241J4389J6482k3627l6603j2003j8291L3005K2622J30144o9441o3935
9538C7573O5107N347R943j1150M8612r369j0863l9615k8702J33650m3106j15649
$$ plain form
9620 111009 185090 173441 160169 323229 260075 170112 106704 35564 -96932 -75782 -96082
9609 -96082 -20322 47033 82227 119161 131463 106406 32881 -179 21358 63946 133006 104973
9597 104973 -15781 -40030 63291 101006 86515 82755 -26813 68372 52479 150285 131928
9586 131928 107003 136007 80048 138421 164941 94502 126857 217126 161415 79047 23339 -105037
9574 -105037 -76594 7568 -61041 -95729 -44799 32749 53931 74962 92980 125121 64409 14923
9562 14923 24601 72491 144251 159327 91532 151718 83495 -18740 -73267 -80277 731 26590
9550 26590 44831 59220 75702 52075 15472 3469 -14822 18183 40805 170949 101508 37573
9538 37573 102680 108027 117970 106820 155432 146063 135200 95585 66883 200533 157427 41778
9526D1778k5332Q1820Q0677j2406j4514L0371M2238J0520J7251m7767j06399r498
9514H8739J4315n5210Q3650l7477L0109K0485l1901K066j18612n5573J913o5472
9502a22968p6223R4169J18519k9622q1903o494J32443Q2132l3612j01172K5894
9491A163P2245R6841P1340l9015j11400j03712L3596P8489m7046J6997K6415p3207
9479B2706r4491j65374K4698J78117n147n885L0176M4266K3863j1196p1048o6859
9467i6174Q8670J07314J6258k4905K314P6201K9285n5031N0058j6658o3437J9767
9455A33662J2201j7478j00659k6473O304J07334L7045N3193l5056j5557p4011
9444H0505q6721N6338N8549K7983q174k6959j70767Q32J9582K744N109p4724k5735
$$ plain form
9526 41778 16446 98266 178943 166537 152023 182394 224632 235152 252403 204636 98237 88739
9514 88739 103054 47844 131494 94017 124126 144611 112710 114776 -3836 -59409 -57496 -122968
9502 -122968 -199191 -105022 13497 -16125 -98028 -104522 27921 110053 76441 -24731 1163
9491 1163 73408 170249 241589 202574 91174 -12538 21058 99547 52501 69498 95913 22706
9479 22706 -71785 -237159 -212461 -34344 -39491 -45376 -15200 29066 52929 41733 -29315 -96174
9467 -96174 -7504 99810 116068 91163 93477 169678 198963 143932 193990 177332 113895 133662
9455 133662 145863 128385 27726 1253 7557 114891 151936 205129 170073 154516 80505
9444 80505 -6216 50122 108671 136654 128480 101521 -69246 -68414 -48832 -46088 -40979 -115703 -141438
9431a41438N0502L9106J17819Q3599l0424r6634o747K9156k3267L2381o444m3854
9419C755O0194L2526L0448J7340r7193l8214M203K6051N1612M3283Q0039L8902
9407B52946k0425o4719n0666l4507M4028R1659J0802j1707r5644l5352N8456M4606
9395A89477j4946o4377m7304k5597J40m1983j002P5152L188q828o5900k0756j2735
9382c5471j9433o4463l6839K7486N3259J23039M6598p209J3840J9892j8392r0052
9370A2255o0941K8182J554Q9894L5927J09822J15842P450o5092j2756j12782O7413
9358B16768J8187l3514p1671o7052l5030l5975M9136J02016M243k9695j9952L1682
9346A29143l6997J4677O7594l7405J5593q345j05498n0277l9348K4463O4800l7153
$$ plain form
9431 -141438 -90936 -51830 65989 149588 119164 22530 15783 44939 21672 54053 47609 3755
9419 3755 63949 96475 126923 144263 47070 8856 13059 39110 90722 134005 214044 252946
9407 252946 232521 167802 117136 82629 126657 218316 229118 217411 121767 86415 144871 189477
9395 189477 174531 110154 62850 37253 37393 -4590 -5592 69560 72748 63920 -1980 -22736 -35471
9382 -35471 -54904 -119367 -156206 -128720 -75461 47578 94176 86967 100807 120699 102307 12255
9370 12255 -48686 -20504 -18950 70944 106871 216693 332535 339985 274893 262137 149355 216768
9358 216768 234955 201441 129770 62718 27688 -8287 40849 142865 147108 117413 97461 129143
9346 129143 92146 106823 174417 137012 152605 144260 38762 -11515 -50863 -26400 38400 1247
9334A247J0743O2904p33N6897m137J1803o9183J3727J3599n6215j05348l2622
9322i7318J02063n3663O9997m0451p7966J21190k0183k8239N1689O9832J4404
9311A11355l9711j34943O683P6700O004O3553K4884q8572L0210L8852p6445m7207
9299b8637j1341j3163L1362m458P5080N2975J6175j23601k9937J17242R8767j27023
9287E3441j20211p0537l666N2558Q6231L4090K9208O6556k4003n2786O1842M6954
9275A59677k4483N4695O41j21149l7678R5958K0150j2094O025J583r7766q7068
9263d1509N6339M6591N6926j5682j10103N9215J5370K179n1748K7932L0239J07894
9251A83643m8646q824L1391J07517j02742m8355J6512m8181r639M5685O684j1412
$$ plain form
9334 1247 11990 74894 74161 131058 126921 138724 69541 83268 96867 40652 -64696 -97318
9322 -97318 4745 -48918 21079 -19372 -97338 23852 3669 -24570 27119 96951 111355
9311 111355 71644 -63299 -56616 20084 26088 89641 114525 25953 56163 95015 18570 -28637
9299 -28637 -39978 -53141 -21779 -26237 48843 101818 117993 -5608 -35545 81697 180464 53441
9287 53441 -66770 -137307 -140973 -88415 -2184 31906 61114 127670 103667 50881 112723 159677
9275 159677 135194 189889 190530 69381 31703 127661 147811 135717 141742 143325 45559 -41509
9263 -41509 14830 61421 118347 102665 -7438 51777 67147 69326 17578 45510 75749 183643
9251 183643 134997 126173 157564 265081 162339 113984 130496 82315 72676 118361 125045 113633
9239A13633l1610K4993P0611m8277j71515n8582J40503k9928k3565P8238m5077
9228A9424r1281n7419O8278M6004K2141L5080L0591j3394J5062N7379O69j20994
9216A1540n7936Q8570k2454K0211P2075M6249m848O0143m8710j34308J449O1338
9204I3319P525j4546l2206K6800r4757n9626p0806N0842J15577J1248k2083l2450
9192b1163j0854P1570n3496j8855p838J9836M0687K0498j3931P2592j1282o395
9180H1369k7894r969N173p0700l8354k214J8889r0155L4482K4652J7114Q1726
9168B4119J5271j8561R6780N7007J1451j9506j04492j2623J5293O2098J82l6525
9156I0494k8410k535N0668j3360L5778J5790r3801j785o8285k7692p933Q4106
$$ plain form
9239 113633 82023 107016 177627 129350 -42165 -100747 39756 9828 -13737 64501 19424
9228 19424 -71857 -129276 -60998 -14994 7147 42227 72818 59424 74486 131865 132534 11540
9216 11540 -46396 42174 19720 39931 112006 158255 153407 213550 164840 30532 31981 93319
9204 93319 100844 86298 54092 80892 -13865 -73491 -144297 -93455 22122 33370 11287 -21163
9192 -21163 -32017 39553 -13943 -32798 -40636 -20800 19887 40385 26454 99046 87764 81369
9180 81369 53475 43506 48679 -22021 -60375 -62589 -43700 -133855 -99373 -74721 -57607 24119
9168 24119 39390 20829 117609 174616 186067 166561 62069 49446 64739 126837 127019 90494
9156 90494 62084 59549 110217 96857 132635 148425 54624 52839 -15446 -43138 -51071 33035
9144C3035J22088p0859j06476K5471L976J2337J37106O1970k6820L1182J3640
9133B36650r5711q3513l219L0153o0823Q2126P5607p2198J0324n9789j6659N2730
9121I5678Q182l5094L1863q6927j11301L676R3610K1511L3093m2433p4182M4597
9109a7727K9215k56M348P571j768J31561M8876m8271l9331m5546j10756k0603
9097f2687m7977O5408J56037K8007m4112p3884k8409l5695L8789q0736M8801M3870
9085G412J1020l8616o9795J5773k0669q4738N4211J28335N476L0641P9936O5879
9073A84865K6838j14232q6001O8847j33752j33720P8369J44405k375j6523O57
9062A7378r546L9123O9627L0329l5401j7104j2088j36219k6184M0534N8555R3304
$$ plain form
9144 33035 155123 84264 -22212 3259 7235 19572 156678 218648 191828 223010 236650
9133 236650 140939 57426 54207 84360 23537 105663 181270 109072 119396 59607 42948 95678
9121 95678 103860 68766 100629 13702 -97599 -93923 -313 21198 54291 11858 -62324 -17727
9109 -17727 11488 11232 15580 23151 21383 152944 201820 153549 114218 68672 -42084 -62687
9097 -62687 -110664 -45256 110781 138788 94676 20792 -7617 -43312 -4523 -85259 -36458 7412
9085 7412 18432 -20184 -89979 -74206 -94875 -179613 -125402 2933 8409 39050 118986 184865
9073 184865 211703 97471 11470 80317 -53435 -187155 -108786 35619 33244 16721 17378
9062 17378 7832 46955 116582 146911 111510 94406 82318 -53901 -80085 -39551 19004 112308
9050A12308J167n4821q0721K2397j3414m2862l2103O4594N1843N5914k6555n4505
9038C242j19068p4743M1913J61433P9930q0113j82273m1255K5437P2075L5439
9027g7983J7603r252N4877M0467P9853o5177N3498N9730n5651j08079Q621J0946
9015I453L355q738R042L7451k3605K5811N3601k1162q1484o1938N0540l1306p4903
9002a13883J29828Q5482k6305K7714q237j1720J9245Q767K6207J3510p4029m8575
8990B8004N7246n5592r2624o9834P2516M6067q2981L337j7213K929P3646O2402
8978B7903l0981N1158M0056J0657p5538p1641k2296O9137O404R189m4434r50M2101
8965A0765P817j4100J01772J38015K3816p2271j06779j41956o2277K6590Q343
$$ plain form
9050 112308 113475 58654 -22067 330 -13084 -55946 -88049 -23455 28388 84302 57747 3242
9038 3242 -115826 -190569 -148656 12777 92707 12594 -169679 -210934 -185497 -113422 -77983
9027 -77983 -60380 -69632 -14755 25712 105565 40388 93886 153616 97965 -10114 -1493 9453
9015 9453 12808 4070 13112 50563 26958 52769 106370 85208 3724 -58214 -7674 -38980 -113883
9002 -113883 15945 101427 75122 102836 94599 82879 102124 110891 137098 150608 76579 28004
8990 28004 85250 29658 -62966 -132800 -60284 -14217 -97198 -93861 -111074 -108145 -34499 27903
8978 27903 -3078 48080 88136 98793 23255 -48386 -70682 -1545 4859 14048 -30386 -31336 10765
8965 10765 18582 4482 106254 244269 268085 195814 89035 -52921 -115198 -88608 -80265
8954h0265J6281J17093J8976j14509n0705Q6974J22982j28476L1344J6697m3431
8943g039k5538L1144L4351Q3337M8237o8306j5782p770L5223M3190n0337O8890
8931A69600J0008j65962P5535Q862j8509N6214O8313j41583l875r4758N3680j8986
8919a461M2105J02874K064n6112q7619o5827p9956L6946O0547L921J33070J03872
8907A94424k3294M6764J7933p1459q2952j81607k94M9680R702q573O0516R5279
8895A06119P047j02442j21468n1357P7972J44692P6143k7497k1278J4432R920
8884A12283J02674K9078Q8507q8737j28906r1781n2645K7022M3946o756j2516
8873B2169j7495K4139j2428J0548o3975n7265J07736J10824r2936j26987K1047
$$ plain form
8954 -80265 -63984 53109 72085 -42424 -93129 -6155 116827 -11649 19695 36392 -7039
8943 -7039 -32577 -1433 32918 116255 164492 96186 80404 72634 107857 151047 100710 169600
8931 169600 179608 13646 89181 98043 79534 135748 204061 62478 58603 -36155 17525 -1461
8919 -1461 40644 143518 145582 89470 1851 -63976 -143932 -106986 -46439 -42518 90552 194424
8907 194424 171130 217894 235827 164368 81416 -100191 -100485 -50805 -41103 -49676 10840 106119
8895 106119 113166 10724 -110744 -162101 -84129 60563 136706 109209 87931 102363 112283
8884 112283 214957 244035 332542 243805 114899 23118 -29527 -2505 41441 34685 22169
8873 22169 4674 28813 16385 26933 -37042 -94307 13429 124253 31317 -95670 -74623
8862g4623J17517l0011n0511k3455R3859Q9875n52r933j04175o5170J9048j8362
8850e6493q93j3269R7492K6827j10610L3817K2563K3936n9587J1474J34541K9542
8838A39340r9574n5068J63604J43069k2720p7511j21468j22847M90l825N7003
8827D93l818P8794J33965p333l0144q8702j51213L0368l4017j7981N8001O7423
8815C5836J2829n5940O9703K2290j44316l6751J01756O5651N1486M741J2249m4705
8803I4829n9132r4423n7772J8703Q8264O3508m9623j1530Q7621l8229q8955n9392
8791a06131Q9014j9510p0809L8564r0023m4494P2340N6922p230n8325P3261N8814
8779g607J19680J3385p9189j38749p8172O6329J02743j6628j02340K2129J01711
$$ plain form
8862 -74623 42894 12883 -37628 -61083 32776 122651 122099 112166 7991 -57179 -38131 -56493
8850 -56493 -57386 -70655 26837 53664 -56946 -23129 -566 23370 -36217 -24743 109798 139340
8838 139340 39766 -15302 148302 291371 268651 191140 69672 -53175 -52685 -56510 493
8827 493 -3325 75469 209434 202101 171957 83255 -67958 -37590 -71607 -89588 -31587 35836
8815 35836 48665 -7275 62428 84718 -59598 -96349 5407 71058 122544 127285 139534 94829
8803 94829 35697 -58726 -116498 -97795 -9531 53977 4354 -7176 80445 42216 -46739 -106131
8791 -106131 -17117 -36627 -107436 -68872 -158895 -203389 -131049 -74127 -81357 -139682 -66421 -7607
8779 -7607 112073 125458 46269 -92480 -170652 -104323 -1580 -18208 -120548 -98419 3292
8768C292O8635L53L9123k99k2927O39j5521j32312R26M0955k3466n3741p3917
8755a68260L5391J0978R7909J00343M6071k4050p2033m2963Q4220n9838L8153
8744D5921J4238J1957K7220L0175L8205m6569j06037l4k1556r4604J513J3928
8732h5643M7753R7846k3520o4089m7656P1146M017K0620n7858l9651K08809Q0899
8720B12673l6864k2086M777m0616k8752N5829J8502o9546k2575J09368O3590o8433
8708A75867j45646o1356N0409K6991J4886k2218L3547n6832n2322k8967p5756
8697a41397O8234J64812N7871o7071O598o113j07773l6861L5278R3614L7726q260
8685I6658p2945M5913J7932m1791n450R3157R7091Q564m9977j58999K3681j4562
$$ plain form
8768 3292 71927 72280 111403 111104 88177 88816 73295 -59017 -58091 -17136 -40602 -94343 -168260
8755 -168260 -132869 -121891 -23982 76361 122432 98382 26349 -16614 67606 7768 45921
8744 45921 60159 72116 99336 129511 167716 121147 15110 15076 -6480 -101084 -99571 -85643
8732 -85643 -37890 59956 36436 -27653 -75309 -4163 -146 20474 -37384 -77035 131774 212673
8720 212673 175809 153723 158500 117884 89132 144961 163463 93917 71342 180710 244300 175867
8708 175867 30221 -31135 19274 46265 61151 38933 72480 15648 -36674 -65641 -141397
8697 -141397 -73163 91649 149520 82449 89047 82934 -24839 -61700 -26422 67192 104918 96658
8685 96658 23713 69626 87558 45767 40317 133474 230565 239129 189152 30153 53834 39272
8673C9272k2156O0553J03029k5852p9285q5442o3534O8285K3170P561R4292L5715
8661A55608l7775j28920P545L7888n679L7357j2107K4685l9191m4234P5458O0597
8649A31232J580L3969P3710j34435o4757Q7773L1994o0160P2612l6625j04668
8638C2225q0340l2019O9458o7070j1523N6658J32865P6974O133j39225m3283q5083
8626h4230q1672j5291J1827N5062M6270p9470N3787j2407m8460J24700M445O3791
8614C8352N8762j1123q8439n0131m7636k3146J17852O6210j4463M9454j3898k2326
8602E9468M5287P8405R625J2045j14687j37939m401L9530k7402N004Q6660K4342
8590G5937J4736l0800n6075L4192j6487L0411o035r5256K8149J45826J7823j4823
$$ plain form
8673 39272 17116 77669 180698 154846 75561 -9881 -73415 -5130 18040 25601 119893 155608
8661 155608 117833 -11087 -3542 34346 28667 66024 53917 78602 39411 -4823 70635 131232
8649 131232 132812 166781 240491 106056 41299 129072 161066 100906 173518 136893 32225
8638 32225 -48115 -80134 -10676 -77746 -89269 -32611 100254 177228 183361 44136 853 -84230
8626 -84230 -165902 -181193 -169366 -114304 -68034 -147504 -93717 -106124 -154584 -29884 -25439 38352
8614 38352 97114 85991 -2448 -52579 -100215 -123361 -5509 60701 46238 95692 81794 59468
8602 59468 104755 183160 192785 204830 90143 -47796 -52197 -12667 -40069 -35065 51595 75937
8590 75937 90673 59873 3798 37990 21503 51914 45879 -49377 -21228 124598 142421 127598
8578A27598O6171j50231j17165r894J35152J45132J7570N446M1945L7000P0493
8567C69217j19723j21211m4485J1210p792k2582k3338O5328R2396m1708j08790
8556D8522Q0556n6168M607N5638m9421m4769l6279l5490l4739O7887M0821o8287
8544b7122o9554K2044M8927p179j01117o3559J42544P9809R226p3205m0322N3113
8532b6395o133P9897J03744N63k2356L1262j17209r5811o2435o600o3546J17962
8520f7057K01336Q940J8118m9390j9767n5353j55379j832O3864O1030P159K5308
8508C6977l4059l1886r7562j5447J8989N3408R1985L018j1882L1748P3192O1943
8496A80424j61109K541L0251L6356R3534Q1272j0050l7513p8186l7747j3754L3070
$$ plain form
8578 127598 193769 43538 -73627 -83521 51631 196763 214333 219779 261724 298724 369217
8567 369217 249494 128283 83798 95008 87216 64634 41296 106624 199020 157312 48522
8556 48522 129078 72910 77517 133155 83734 38965 2686 -32804 -67543 344 41165 -27122
8544 -27122 -96676 -74632 -25705 -32884 -134001 -197560 -55016 24793 34019 -39186 -79508 -26395
8532 -26395 -32528 47369 151113 151676 129320 160582 43373 -52438 -114873 -121473 -185019 -67057
8520 -67057 134279 143219 161337 111947 92180 36827 -118552 -120384 -56520 4510 11669 36977
8508 36977 2918 -28968 -126530 -141977 -122988 -69580 22405 25423 13541 45289 118481 180424
8496 180424 19315 21856 52107 88463 181997 263269 253219 215706 137520 99773 86019 119089
8484A19089p0795J471J02260P9835o3694q9930K8339n5726J7253k8903l3013K3040
8472B9226n0216p8503J8722j3853L9825J22611J43830k5480q28j5052j37532o6773
8460c4023J17953Q6038p0280n0012j1676M6036k6335o9855L050n2152Q2285k5943
8448d914j30799N2267K51475R8608p4420k0232j1406n9950Q4839J07082j2463
8437B80087q6420o6245m6519N4536L2880n4396K2939k2251j976m3606j15985L8147
8425h809N4541j11060j3748O7963j28920j4768J65172P5234L2830K3387O5352
8414B07174j94063j55003M2602N8684k3607J19154M5190L5805k5498j29959n8421
8403g7942J13386K7664n622l8268K1542n1108J0158M1334o9337m3175K7071J98084
$$ plain form
8484 119089 48294 49765 152025 231860 168166 78236 106575 50849 68102 39199 6186 29226
8472 29226 -20990 -99493 -80771 -94624 -54799 67812 211642 186162 185334 170282 32750 -34023
8460 -34023 83930 169968 99688 49676 38000 84036 57701 -12154 -9104 -61256 21029 -4914
8448 -4914 -135713 -83446 168029 266637 192217 171985 160579 100629 185468 292550 280087
8437 280087 193667 127422 80903 135439 168319 113923 136862 114611 112635 69029 -46956 -8809
8425 -8809 45732 -65328 -79076 -11113 -140033 -154801 10371 85605 118435 141822 207174
8414 207174 13111 -141892 -99290 -40606 -64213 54941 100131 135936 110438 -19521 -77942
8403 -77942 35444 63108 57486 19218 40760 -10348 -190 41144 -28193 -71368 -44297 153787
8391A53787O4854q3789q2841l6216n7458N3427M6255k208j12812j4265q052l022
8379h2340M8866J51762R7287o7420m0119m6443j08327J14233Q3583Q51k2498Q1674
8367B11109p7105p1479M2040k9337M186p0860k1336L141O2638o8761n4156N2867
8355a7053M4958r449j08876l735K2974k425M5424k158J6964O9029q7337K749K1273
8342g662M41J52124o064k0865M7367J15220J52538J95j52400m1955p1909j201
8330A65829l4940L8572P372j97539o1567R123P8962Q5167o0529j1890J4684K3836
8318E7080l2332m4931Q0473K0379n4387m4156L0035O0264j7776P494m9079p4331
8306f1267N0760J13795P6074o1775q7348O7181P5126q3427L0523L9072Q1307J60554
$$ plain form
8391 153787 218641 134852 52011 15795 -41663 11764 58019 55811 -57001 -71266 -79318 -82340
8379 -82340 -33474 118288 215575 148155 108036 61593 -46734 67499 151082 151933 129435 211109
8367 211109 134004 62525 104565 75228 79414 8554 -12782 -9641 52997 -15764 -69920 -17053
8355 -17053 27905 18456 -90420 -94155 -71181 -73606 -28182 -30340 -13376 55653 -31684 -28935 -7662
8342 -7662 -7221 144903 138839 117974 165341 280561 433099 433294 280894 238939 167030 165829
8330 165829 130889 169461 176833 -20706 -82273 -73150 5812 90979 30450 18560 33244 57080
8318 57080 24748 -20183 60290 80669 26282 -17874 12161 72425 54649 62143 13064 -61267
8306 -61267 -10507 103288 179362 117587 30239 97420 172546 89119 119642 158714 240021 400575
8294D00575J92373J42117R9947j22140j97353j62877j16922p3338N6733O061L5503
8283B60679l0408j26254j4158N1269o6003l647J27970N8595K33j07620j00104
8272E0552k5605k0511K4394O8082K4512P45k7973N1499k6081p7029l5196N931
8260A3320l9722J9444J17855P4174k5040j9320K056K2109o2895L8310J62473J08091
8248D10855r4708p1219r8988q6920m1514j58091M3645Q3772L669L7764k2905k3240
8236a7880q3763J6869J28699J3008r8398K5935Q7433Q606l9640q4539l1581O6938
8224h313O278j32393N8709K4852n1984J9297J21860J31410o9697j6604J6564M1881
8212A41860M4610o0529j9071N9511K6909L9051r5129n7088K426N696L3609J5400
$$ plain form
8294 400575 592948 735065 835012 712872 515519 352642 235720 162382 219115 225176 260679
8283 260679 230271 104017 89859 141128 75125 71478 199448 258043 258276 150656 50552
8272 50552 24947 4436 28830 96912 121424 122169 94196 145695 119614 42585 7389 13320
8260 13320 -26402 -6958 110897 185071 160031 140711 142767 164876 101981 140291 302764 410855
8248 410855 316147 244928 145940 59020 17506 -140585 -96940 -13168 -9499 28265 5360 -17880
8236 -17880 -101643 -84774 43925 56933 -41465 -15530 71903 80509 40869 -43670 -75251 -8313
8224 -8313 -2035 -134428 -75719 -50867 -102851 -83554 38306 169716 100019 83415 99979 141860
8212 141860 186470 125941 106870 166381 193290 232341 137212 80124 82550 88246 121855 137255
8200A37255n4565l5705n9341M9583l2979l2026J8100Q119p0774n819j6064j7265
8188a11481K9302J6822Q9r947p6633r4413M8529K7311l9379L3374O7799J3967
8176i4660J31319M2256r2155j9182l7972o6998p3764L0833R8900J0819l21L5119
8164c5806n5625M5447p1611r3527M9857M3933Q6456O2292Q047J5181J7073N3464
8152A25181k6476j2073j4349J7687Q166o9460j22564O1580J41731N6272N2074
8141B17769o9642k2285j4198N1591m1106j14990m0392l9619J08129J42456k3256
8130A54457j28170l5858J21534K813m0875m3421j6832o1415k8204N3722J7970
8119d279n5376K698j4491P0594J39119K0355m3877j60225l0774J00930P3698N000
$$ plain form
8200 137255 82690 46985 -12356 37227 4248 -27778 -9678 -1559 -72333 -78152 -94216 -111481
8188 -111481 -82179 -65357 -65268 -75215 -151848 -246261 -197732 -170421 -209800 -176426 -108627 -94660
8176 -94660 36659 78915 -13240 -32422 -70394 -137392 -211156 -180323 -81423 -70604 -70925 -35806
8164 -35806 -91431 -45984 -117595 -211122 -161265 -117332 -30876 31416 39463 54644 71717 125181
8152 125181 98705 86632 72283 89970 98136 28676 -93888 -32308 109423 165695 217769
8141 217769 148127 125842 111644 163235 122129 7139 -33253 -72872 35257 177713 154457
8130 154457 26287 -9571 111963 114776 73901 30480 13648 -47767 -75971 -22249 -4279
8119 -4279 -59655 -56957 -71448 -854 138265 158620 114743 -45482 -76256 24674 98372 103372
8107A03372n0219j980k9310J3801K7475N1388j5311j123j956J9079l4400P2776
8095A53592k2652j3454m9578J7074J06298Q3665p3956m8352j3698o9629j06294
8084c6984r0360Q2040J05009M1050R2108J9197j4462n0301j9578K401K7667l0072
8072A27715m6618Q0743j8996j08301n3019r53M1324N6932R1481j20055L6703J5704
8060A02660n6724p4942m8000P50P5776L7589m0682k5052N5040J08183p0359p0139
8048e900K4321n0375r239J9540o0329L790M3583p6435P639L9327N047l076j41442
8035b03549p97L8460J66986J4166q3847L0581N9520J3317n6591p4624O230n0584
8023a40732O6873N73m8021R8348Q2423q90n850p9217L6129n5247J430L8860k4141
$$ plain form
8107 103372 53153 51173 21863 35664 63139 114527 99216 98093 96137 115216 80816 153592
8095 153592 130940 117486 67908 84982 191280 274945 200989 152637 138939 69310 -36984
8084 -36984 -127344 -45304 59705 100755 192863 212060 197598 147297 127719 130120 157787 127715
8072 127715 81097 161840 142844 34543 -18476 -19429 21895 78827 170308 50253 86956 102660
8060 102660 45936 -29006 -77006 -76256 -480 37109 -3573 -28625 26415 134598 64239 -5900
8048 -5900 18421 -31954 -41193 -21653 -81982 -78192 -34609 -111044 -103405 -64078 -59031 -62107 -203549
8035 -203549 -204346 -165886 1100 15266 -68581 -38000 21520 34837 -21754 -96378 -90148 -140732
8023 -140732 -73859 -73286 -121307 -22959 59464 58574 52724 -26493 9636 -45611 -44181 -5321 -29462
8010b9462l9913m414j6518l5973L8870L7011L2608K4069k0204j06659l4752L2499
7998a22838Q1966L1658n881P1398k095k3210J2061L1064R940O225J30728p1607
7986A49409r9191n7586j5017l5289o830L4613J02635l6232K5647r356O66q3034
7974b9565N3678m786q4146q9433R3080R3109J538m8547q438o3713j17154O9031
7962a35346J62576P9277O050j0238o2285p3077K9295K0458M2755L4568m3069k8177
7950B2787r8495n2599K6099k245j1256J11507Q3084J656L2276O0743p6829q0852
7938A5876M4288R4855l6790j04820o2234M5500q0913J3504Q4190j7531O4145J43846
7926B03916R0805K1160l6720n176k372q7474j49043M2867L9616q6795M0181l5502
$$ plain form
8010 -29462 -69375 -73789 -90307 -126280 -87410 -50399 -17791 6278 -13926 -120585 -155337 -122838
7998 -122838 -40872 -9214 -15095 56303 54208 30998 43059 74123 84063 90288 221016 149409
7986 149409 50218 -7368 -22385 -57674 -64504 -29891 72744 36512 62159 52803 53469 -29565
7974 -29565 24113 19327 -64819 -154252 -61172 31937 33475 -15072 -23510 -87223 -204377 -135346
7962 -135346 27230 106507 112557 102319 40034 -33043 -3748 16710 59465 94033 50964 22787
7950 22787 -75708 -128307 -102208 -104453 -115709 -4202 78882 80538 112814 173557 96728 15876
7938 15876 60164 155019 118229 13409 -48825 -3325 -84238 -70734 13456 -4075 60070 203916
7926 203916 294721 315881 279161 273985 271613 184139 35096 77963 117579 30784 70965 35463
7914C5463M1912K8490j04335p8110Q2327p17K247J00792O3886j9301p3741j0550
7902F8363K7531q7909p2444j4159O1268n159r565K2878L5534J15105K2471r0938
7890G2976p5647N1340k7283j09685l7968o7419j9485J35078R1244o0715p5145
7879a22709m1823N4263l1842N9333M1997J51825R9686k3709j74237j16425J14455
7868A0814P1729J1362L0985J04855k5409p7061L8770p4751q3961p187o9341p3170
7856a42365L0693J7575N6302K0675L6368J250o1951J2151P4062L9084k9661k652
7844E1531N695P0302K17j6377P018o6523o4103L0633n2105q7876L8772N4379N1338
7831B2901R322o1918J25525J1187O4032o153q3019l88j0993P8400K2821n0975
$$ plain form
7914 35463 77375 105865 1530 -76580 5747 5030 7277 108069 171955 152654 78913 68363
7902 68363 95894 7985 -64459 -78618 -17350 -22509 -32074 -9196 26338 141443 163914 72976
7890 72976 -2671 48669 21386 -88299 -126267 -193686 -213171 -78093 13151 -47564 -122709
7879 -122709 -164532 -110269 -142111 -82778 -40781 111044 210730 187021 12784 -103641 10814
7868 10814 82543 93905 124890 229745 204336 127275 166045 91294 7333 146 -69195 -142365
7856 -142365 -111672 -94097 -37795 -17120 19248 20498 -41453 -29302 44760 83844 54183 51531
7844 51531 57226 127528 127745 111368 118386 51863 -12240 18393 -33712 -121588 -82816 -28437 22901
7831 22901 32223 -29695 95830 107017 171049 164896 81877 81489 70496 148896 171717 120742
7819A20742j01866k2409k2456n629j4382M2374K4094K709P963L1886m92l5369
7807B7165j13080r3707O3559Q4705R8375J1299j85534p5255J13591J20376P1970
7796A23464n1090m3358O2463j18105j83668M1442J74307N1467j1286n2079j08864
7785a15307l4402k7457k356K03561M3743j08336k8172o2790L348K7520J51817
7774E1169l9102j1287Q3571m5747m4382K3573M513O4464k6827l4089p894J7728
7762C5690j46747m770J22727P0593j12933k3262J05402J7352m972N50o333J07564
7750A60861K473j9442j26759L8771K4241P530q8394r461k1385k1393L1709Q6721
7738F5472j746N803j7511o8885j1143K0055o475n5487l8590N5248J32100j04958
$$ plain form
7819 120742 18876 -3533 -25989 -31618 -46000 -3626 20468 23177 31140 63026 62534 27165
7807 27165 -85915 -179622 -116063 -31358 67017 78316 -107218 -182473 -68882 51494 123464
7796 123464 72374 29016 91479 -26626 -210294 -168852 5455 56922 45636 -6443 -115307
7785 -115307 -149709 -177166 -179522 24039 67782 -40554 -68726 -131516 -128168 -100648 51169
7774 51169 12067 780 84351 38604 -5778 17795 22308 86772 59945 25856 17962 35690
7762 35690 -111057 -115827 6900 77493 -35440 -58702 46700 64052 59080 59630 53297 160861
7750 160861 163334 143892 17133 55904 80145 87675 -719 -10180 -31565 -52958 -21249 65472
7738 65472 63726 69529 52018 -16867 -28010 -7955 -14430 -69917 -108507 -53259 78841 -26117
7726b6117n3377n6762N0275J2725J2097O4648r3578j5647P3257K2097J5532O71
7714E821k4079j27396p5965J09754Q8192M2006L4978l5564P1006r1850L7798K737
7702C7438k0938M3843J5050l2435j9304j2712j8017k1353k3461P3257J7384o8720
7690b9968m3978k1380j12160J278J37220J40085J36091q7809p7793P2225p3223
7679D0588j1729J4602P9099j4431Q9211Q2830R956q7367k42678j28650O0394J23279
7667A5104P4617l1946j00315P5647l0536j13972r114m793K0324j668M9437K2641
7655c4574l8991N276P9157L0589n1175N315N5153n8601n8115p920o0429r463O8127
7642g5651N7239J09618o1475k5081j00350k8085J06599J08964j9193j5377j8500
$$ plain form
7726 -26117 -79494 -136256 -85981 -73256 -61159 3489 -90089 -105736 -32479 -10382 5150 5821
7714 5821 -18258 -145654 -221619 -111865 -23673 18333 53311 17747 88753 -3097 34701 37438
7702 37438 16500 60343 75393 42958 23654 10942 -7075 -28428 -51889 21368 38752 -29968
7690 -29968 -73946 -95326 -207486 -206208 -68988 71097 207188 119379 41586 113811 40588
7679 40588 28859 43461 122560 108129 197340 280170 290126 202759 -39919 -168569 -108175 15104
7667 15104 89721 57775 -42540 33107 2571 -111401 -120515 -125308 -104984 -106652 -57215 -34574
7655 -34574 -73565 -68289 10868 41457 -9718 -4403 50750 -7851 -65966 -73886 -134315 -143778 -75651
7642 -75651 -18412 91206 29731 4650 -95700 -123785 -17186 91778 72585 57208 38708
7631C8708m8765o627J02547O1234o294J6977K4604n2769l9190o7069l8933m0420
7619e5997l9095K0155J2800l3947Q2240Q8430L05Q204o893k366n593J14457j6566
7606A66134J257N7105l7865q8115j0650j7069q9971q2269O6823m9705K0077l9392
7594a03640L9346L5717J5294r5019O1246M5410l6439N3503N752n5571p4471O0229
7582d8643l4293J46422J06214L7913p4869r1719P175n6847n7531N3243J5303N8694
7570F1062j2694p9918M3719P1247r536q8326n0229O9913q669j08372j6963n66
7558a29332j3653M9102K3448n3466j18349R4819O4506M5998n8565l5056J28513
7547b035J23225j9880j46949l4501O4061J06491j1668m6802m8922J813l6752O486
$$ plain form
7631 38708 -10057 -16684 85863 147097 140803 157780 182384 129615 90425 23356 -15577 -55997
7619 -55997 -95092 -74937 -62137 -96084 -13844 74586 74891 83095 76202 73836 68243 182700 166134
7606 166134 167391 224496 186631 98516 87866 70797 -19174 -101443 -34620 -84325 -64248 -103640
7594 -103640 -64294 -28577 -13283 -108302 -47056 -1646 -38085 15418 21170 -34401 -108872 -48643
7582 -48643 -82936 63486 169700 207613 132744 41025 48200 -8647 -66178 -12935 2368 61062
7570 61062 48368 -31550 12169 83416 73880 -14446 -64675 5238 -3431 -111803 -128766 -129332
7558 -129332 -142985 -93883 -70435 -123901 -242250 -147431 -82925 -36927 -95492 -130548 -2035
7547 -2035 121190 101310 -45639 -80140 -16079 90412 78744 31942 -16980 -15167 -51919 -45433
7535d5433J6851n1229j00372M0783J09638M011R18l0569J1591M0135p4395k2307
7523a00378M5235o555L1757R4910k360L9343p7300M3937j3131l0876j19859r1428
7511a86705M619J53491P3280m8897k5116K0064p489r3317m0554j8559Q1825N1328
7499c6030N53o098J6861N9868J4666M2899k88k1770j3314l2310n68j34073q6913
7486a96517l4042N8175R4672k8781r285n1577M705k8682k8416N9981J35475K9660
7474E368o3208J1637o578n20k0204M7936O2060M4253q6495m8210l148k6145k1232
7461a04486J09258L7005o6712j701L9302r3554j2765L4063o0963k7367l4513o552
7449a88985M270n3899J15877R5009N4947L3562k492J6887l5881o0559n9744r097
$$ plain form
7535 -45433 -28582 -79811 -180183 -139400 -29762 -25751 -24833 -55402 -43811 -3676 -78071 -100378
7523 -100378 -55143 -61698 -29941 64969 62609 101952 24652 68589 55458 24582 -95277 -186705
7511 -186705 -182086 -28595 44685 -4212 -29328 -9264 -16753 -110070 -150624 -169183 -87358 -36030
7499 -36030 -35477 -41575 -24714 35154 49820 92719 92431 70661 57347 25037 24469 -109604 -196517
7486 -196517 -230559 -172384 -77712 -106493 -115778 -167355 -162650 -191332 -219748 -159767 -24292 5368
7474 5368 -57840 -46203 -52781 -53301 -73505 -25569 36491 80744 -5751 -53961 -57109 -83254 -104486
7461 -104486 4772 41777 -24935 -26636 12666 -80888 -93653 -59590 -120553 -147920 -182433 -188985
7449 -188985 -184715 -238614 -122737 -27728 27219 60781 58289 75176 39295 -21264 -81008 -90105
7437i0105J0245q24p749K9497m6841N8041L0998j05783m8031N016L5445J16989
7425a3102J9632N771R8777M0177m8535n77l965J4821p6816j54604o7595p9511
7413b65527l1871Q5863O8857l5153n706O9850R8244L3324q0094Q0389J94127j02288
7401A10015m0874L5497k3249j04921J7551L1736j3456k6149k0489j288L675N8197
7389B6245N4411m0262Q923r6346j20341Q6303P5360J2063J6251J8369M0450M2717
7377A24143l1974Q3414r6547j91724j14576L7341O5244J63987O1706j8630L778
7366H6162p9512k0126j0128q8496M8718N5073j9031k267k1006o9796o8270N0312
7354a38367J12638J887q913o7842O7873j7365l9993R1648L8395M8514p3773j4674
$$ plain form
7437 -90105 -79860 -80684 -88433 -58936 -105777 -47736 -16738 -122521 -170552 -165536 -130091 -13102
7425 -13102 6530 12301 111078 151255 102720 102143 98178 112999 36183 -118421 -186016 -265527
7413 -265527 -297398 -211535 -142678 -177831 -183537 -113687 -15443 17881 -62213 18176 212303 110015
7401 110015 69141 104638 81389 -23532 -5981 25755 12299 -13850 -34339 -35627 -31952 26245
7389 26245 80656 40394 49317 -47029 -167370 -81067 -5707 6356 22607 40976 81426 124143
7377 124143 92169 175583 79036 -112688 -227264 -189923 -124679 39308 101014 82384 86162
7366 86162 6650 -13476 -23604 -112100 -63382 -8309 -27340 -29607 -50613 -120409 -188679 -138367
7354 -138367 -25729 -23842 -32755 -100597 -32724 -50089 -90082 1566 39961 88475 14702 28
7342B8K0o0186l2159J11269j3788K8628k8250p1734j2149M0071K9154l0379j0964
7329e0439J4919J1895k9671l5118J3062N2042o3622O4819J4397M6584k5879j27793
7317a14804k8152K4650R5485J0223j1800N2874N6485m2228j42419j6403K4798
7306i1291k6295r118K2515R7794J4594K5615R9410n0508j3189k3318N952L2073
7294H4234J267j45927j02898N195R4596J16252k2742l7744K0052K0404K3110N1759
7282A07558K7688n8380o7545n673l8117p0470O7166P8566J1084p6360Q703k9459
7270d5239p2449k3326J4121P4963L1943r6941l2579P1651R7026M6948M3531k4630
7258H5019k7551j03479M1350n2863p8289K4014Q0796R8188j3163J4918O060N1688
$$ plain form
7342 28 48 -60138 -92297 18972 5184 33812 5562 -66172 -78321 -38250 -9096 -39475 -50439
7329 -50439 -35520 -23625 -53296 -88414 -75352 -23310 -86932 -22113 -7716 38868 12989 -114804
7317 -114804 -142956 -118306 -22821 -12598 -24398 28476 84961 42733 -99686 -116089 -91291
7306 -91291 -117586 -126704 -104189 -6395 8199 33814 133224 82716 69527 46209 52161 84234
7294 84234 85501 -60426 -163324 -158129 -63533 52719 29977 -7767 12285 32689 55799 107558
7282 107558 135246 76866 9321 3648 -34469 -104939 -37773 40793 51877 -24483 -15780 -45239
7270 -45239 -117688 -141014 -126893 -51930 -19987 -116928 -149507 -77856 19170 66118 109649 85019
7258 85019 57468 -46011 -4661 -57524 -135813 -111799 -31003 67185 54022 68940 75000 126688
7246A26688J1237N1609j72763k45513J0699J5390m3023N1629O8585O4187m4450
7235a05725j7125P1416O8614O8878J16416j5587j44928j56791j37132O1176L4285
7224a56503M2030Q5813j2900P345M4229k2012o5053j32520N0894J17802K6391
7213a4484j11j819M929L5136J22122j2329m2466q2006K8015j1740J26427n0659
7201A01015o6906K5940o226j929K2511l7015K790l2298n4474J5569L3645r0104
7189h7482Q182R892m3795l7478N1170l745Q9100J9499k6743P9066m1352p5396
7177e9082O4956O8455J5221N253k0123r3058n1799m4141m1508l766J76934P5119
7165I2461k5844l630p2812j10311J03489P3269O5163r0209j01312l8787K2946
$$ plain form
7246 126688 137925 189534 16771 -228742 -218043 -202653 -245676 -194047 -125462 -61275 -105725
7235 -105725 -122850 -51434 17180 86058 202474 186887 41959 -114832 -251964 -190788 -156503
7224 -156503 -114473 -28660 -41560 -34215 10014 -11998 -77051 -209571 -158677 -40875 -14484
7213 -14484 -14595 -16414 -11485 23651 145773 133444 90978 8972 36987 25247 151674 101015
7201 101015 34109 60049 53823 51894 74405 37390 40180 7882 -46592 -31023 2622 -87482
7189 -87482 -79300 -69408 -113203 -150681 -99511 -103256 -14156 5343 -21400 57666 16314 -59082
7177 -59082 5874 74329 89550 94803 74680 -18378 -70177 -114318 -155826 -159592 17342 92461
7165 92461 66617 62987 -9825 -120136 -16647 56622 121785 31576 -69736 -108523 -85577
7154h5577J595j0641O9358R5238M360k6259M071p4710o1461k9218L489M0861P2853
7141C959k1238J17055N6647n9506q7364m0443Q371J58895J88309J16136q0548
7130C60273k31772k2498j01846k6166k272n4996j3959K3236p9637k2157K2680
7119a49114k3413Q904M2487O8844K5224k8990K441N6570n0862l7965p6849P0281
7107i2442q743m0244j5293J792M1211M6830j6351o1341N2884L1821k7042L2514
7095e4404n6202o5871l5568L3778J08733K2603j781j1423N1858O0138O4092J3775
7083A29728p5176L5959J3992J0391k7471k9667o9531j6090J2230j1680J9438Q4081
7071G6204l3739j33402n2080P060Q143K5790k0975O8114J19638K5966j636j8607
$$ plain form
7154 -85577 -83982 -94623 -25265 69973 74333 48074 52145 -22565 -84026 -113244 -109755 -68894 3959
7141 3959 -17279 99776 156423 96917 9553 -30890 -22519 136376 324685 440821 360273
7130 360273 128501 106003 4157 -22009 -24281 -79277 -93236 -70000 -149637 -171794 -149114
7119 -149114 -172527 -163623 -121136 -52292 -27068 -56058 -53617 2953 -47909 -85874 -162723 -92442
7107 -92442 -101185 -141429 -156722 -154930 -113719 -66889 -83240 -144581 -91697 -59876 -86918 -54404
7095 -54404 -110606 -176477 -212045 -178267 -69534 -46931 -48712 -60135 -8277 51861 115953 129728
7083 129728 54552 90511 104503 114894 87423 57756 -11775 -27865 -15635 -27315 -7877 76204
7071 76204 42465 -90937 -143017 -135957 -127814 -102024 -122999 -54885 64753 90719 89083 70476
7059G0476k6228l2538p3254K0448k940N5037J6624J2057P0241L3839o2921n8123
7047B2718k8468O5296r893j02345k1536L7929j05686j12109J008P6729J90786
7036A4429J78253P918j16583r7048P5486j44191r2671P8426R3020J7755J55684
7025A70478J0723L128o3092j7949l3612p0348J3675J10457M2330n5829J7758k2303
7013A05416l3593L3865J6179j747O3583L3861p6525n9937Q207P516m3358m9095
7001D372k0147J7748Q7621K2434L3817n3804q2495Q7716M3260J7801R3715m809
6989B47229j5578k2914o0850k9164N6751o5519p8374q8199m3718K7289O8687p704
6977a2064r1653m2817J20590Q6754m5518m7758K1104L7665P4973j3238l8688j20661
$$ plain form
7059 70476 44248 11710 -61544 -41096 -44036 11001 27625 39682 109923 143762 80841 22718
7047 22718 -5750 59546 49653 -52692 -74228 -36299 -141985 -254094 -253086 -176357 14429
7036 14429 192682 200600 84017 -13031 62455 -81736 -174407 -95981 -2961 14794 170478
7025 170478 181201 184329 121237 103288 69676 -672 13003 123460 165790 109961 127719 105416
7013 105416 71823 105688 121867 120120 183703 217564 141039 81102 89309 96825 53467 4372
7001 4372 -15775 1973 89594 112028 145845 92041 9546 97262 140522 158323 252038 247229
6989 247229 231651 208737 147887 118723 175474 109955 31581 -56618 -100336 -73047 -4360 -12064
6977 -12064 -103717 -146534 -25944 60810 15292 -32466 -11362 26303 101276 88038 49350 -71311
6965g1311M5169Q8216m8930p9448P0380P1664j29574k353R632k0372K9228R253
6953b8446L4390P0982p4916j03046j3229P2999P3251o6297K3026O417L634k9119
6941c0354P421m9379J7691k6806n2569J18807J1281r2932p9525O0595M2492M3027
6929c0251Q5567n1078j29106m9389P078L5117P0573Q9768m1716J5299j34701l262
6917a36101O8972q399P6240K6767j5060m5664P5722k5936k8125q195J0899L8307
6905B9427N427p7881K4531Q2288J3613P66j16775o2086N489p432L5737M7320m7610
6892f7186J9415L9080j17603j7635J29552J57858O9994n9013j10926n3467R0537
6881H0606M3721Q0813o8261K4547k2431j2066L1143M7490J0802j37478O417r1855
$$ plain form
6965 -71311 -26142 62074 13144 -66304 4076 75740 -53834 -56187 -46555 -66927 -37699 -28446
6953 -28446 5944 76926 2010 -101036 -114265 -41266 31985 -34312 -11286 -4869 -1235 -30354
6941 -30354 -22933 -72312 -54621 -81427 -133996 -15189 -3908 -96840 -176365 -115770 -73278 -30251
6929 -30251 55316 4238 -124868 -174257 -167179 -132062 -61489 28279 -13437 1862 -132839 -136101
6917 -136101 -67129 -75528 712 27479 12419 -33245 42477 16541 -11584 -19779 -8880 29427
6905 29427 34854 -43027 -18496 63792 77405 78171 -38604 -100690 -95201 -102633 -66896 -19576 -67186
6892 -67186 -47771 -8691 -126294 -143929 -14377 143481 213475 154462 43536 -9931 80606
6881 80606 124327 205140 136879 161426 138995 126929 158072 205562 216364 78886 85303 -6552
6869f552m8695m6192P0272J4965j1724R5303P329k873n837R19o6460k2387o1982
6856h3914r900Q2077j3860m4194l1229n587o4800L0004Q9927K5958J81m7522J30292
6843E7433Q6428j25809p8378p1947j4635J6465N4179J40727N4495m3230K143J2098
6831H9969o1598j0738k8855Q8991l0308K7112N8287J3498j16030o4978k2995M4954
6819a2691P8168J9128r2756J2436m1476r9198M8399N0353L86j05468j46K1414
6807a21451J9388O3834K7587L0361O1236l9110j01560k3420l7791J2077p52K4476
6795h5125J7763m2766p5222Q4916P0202K7859O656j22929R1304j4277m8748o0849
6783a51216l3073J09323O8250p3592K7483q679o7862o9774o9988L1704K3970L0920
$$ plain form
6869 -6552 -55247 -101439 -31167 -16202 -27926 67377 74706 71833 65996 66915 455 -21932 -83914
6856 -83914 -93814 -11737 -25597 -69791 -101020 -106607 -171407 -141403 -51476 -25518 -25337 -72859 57433
6843 57433 143861 18052 -60326 -132273 -146908 -130443 -76264 64463 118958 75728 77871 89969
6831 89969 28371 17633 -11222 77769 47461 74573 132860 146358 30328 -34650 -57645 -12691
6819 -12691 65477 84605 -8151 4285 -37191 -136389 -87990 -37637 -37251 -142719 -142865 -121451
6807 -121451 -102063 -38229 -10642 19719 80955 41845 -59715 -83135 -120926 -108849 -109601 -85125
6795 -85125 -67362 -110128 -185350 -100434 -30232 -2373 4283 -118646 -27342 -41619 -90367 -151216
6783 -151216 -184289 -74966 -6716 -80308 -52825 -61504 -129366 -199140 -269128 -237424 -213454 -182534
6771a82534P8862j7127k039q7116M3031J19745L4781p078M686P4681L0429m0513
6759D9808m7612O3409l3903n382l3829p5110O8619L9320J1780j9957L3109N4487
6747A04739j9442o5231m9304n2213M2780j2979k6031Q4137N725m881J5568n631
6735A7237L690O7973L0760m6675l5385p5073K2193j0860k8907o2271o8563K3526
6723a62355M110k3504Q9668L0413K6622N4000p9196l0951N8337N780l5672J5903
6711d6845N0610r5166j0445K0803J6249J1528R4492L5930r2567m0122j3137O3000
6699e670J18656o4598o1425m7971n2181l9716P0434k1485j0740N4792R265j01364
6687a52003j5608J33595J63961r1294j56158n1254K4551Q5985P4194L5890Q1987
$$ plain form
6771 -182534 -103672 -120799 -122838 -209954 -166923 -47178 -12397 -19475 -14789 59892 90321 49808
6759 49808 2196 65605 31702 26320 -7509 -82619 -14000 25320 37100 17143 50252 104739
6747 104739 85297 20066 -29238 -81451 -38671 -51650 -77681 6456 12181 7300 22868 17237
6735 17237 20927 88900 119660 72985 37600 -37473 -15280 -26140 -55047 -117318 -185881 -162355
6723 -162355 -158245 -181749 -92081 -61668 -35046 18954 -60242 -91193 -32856 -27076 -62748 -46845
6711 -46845 3765 -91401 -101846 -81043 -64794 -53266 41226 77156 -15411 -55533 -68670 -5670
6699 -5670 112986 48388 -13037 -61008 -113189 -152905 -82471 -103956 -114696 -59904 -50639 -152003
6687 -152003 -167611 -34016 129945 38651 -117507 -168761 -144210 -58225 15969 51859 133846
6676A33846N9730m5757l279J2984r5953p3048l8939l3528O638k3848L1454Q4751
6664A5051k3780k5687M7388P0225l4778J0536J72826j9834r6827o539l3781J1995
6652H6795j7835l9891k9697J4246N5405J22186M3210J95527J31015J06576K61127
6641I28664L34100L73590L98537P766l94631k30222j90082r6571N2216O5940J67832
6630A417139K22275L22184N64424P30177R26159J307938J722746K491898M460067
6621A4165007P952734J3068557J6435970J3223511m610793j7622614j3246693
6614B9365679p859702m588634k924673k049121j561826j221900q82161n71866
6606G705796l97821k53459l83322o01324o34395n14620m47440j87941K1352R3651
$$ plain form
6676 133846 193576 147819 144540 157524 61571 -11477 -50416 -83944 -77306 -101154 -69700 15051
6664 15051 -8729 -34416 12972 83197 48419 58955 231781 211947 115120 108581 74800 86795
6652 86795 68960 29069 -628 13618 69023 191209 234419 429946 560961 667537 928664
6641 928664 1262764 1636354 2034891 2042657 1648026 1417804 1227722 1131151 1183367 1249307 1417139
6630 1417139 1639414 1961598 2526022 3256199 4182358 5490296 7213042 9704940 14165007
6621 14165007 22117741 35186298 51622268 64845779 60234986 42612372 29365679
6614 29365679 21505977 16917343 13992670 11943549 10381723 9159823 8277662 7705796
6606 7705796 7307975 7054516 6671194 6069870 5435475 4920855 4473415 4285474 4306826 4400477
6596D400477j65485n85357n50300m17326l75752k26936j75871j65328j50972j47149
6586A440001r9428r2411j9709n7275j42491j39742j3437j0503l1334r8999m1829
6575F92843m4922j36874o5477J6660n9598o4815o2046k1035l6616J2912J08692
6564C39724j540J9729j3709o9528l2768K6980N729k9643J6263O0377O3743k0194
6552C65163m6586n2547o8040p7630p277O0781K4626o2954J31590l0763j22024
6541A14339l4335O5037K5071j1876J0998n9251n3856J06008R2855q6626q7972
6530H0392j3880M5179R4628m5112j16973O1695K3122L1513j28847j5597Q9639
6519A05759l466o0568j3112J0506l3133M3097R5174N8429p0652j3681k1567K952
$$ plain form
6596 4400477 4234992 3649635 3099335 2682009 2306257 2079321 1903450 1738122 1587150 1440001
6586 1440001 1340573 1248162 1228453 1171178 1028687 888945 875508 865005 833671 734672 692843
6575 692843 647921 511047 445570 462230 402632 337817 275771 254736 218120 231032 339724
6564 339724 338184 357913 344204 274676 241908 268888 274617 244974 261237 321614 385357 365163
6552 365163 318577 266030 197990 120360 113083 173864 198490 135536 267126 236363 114339
6541 114339 80004 145041 170112 158236 169234 109983 56127 162135 254990 168364 80392
6530 80392 66512 111691 206319 161207 44234 105929 129051 160564 31717 16120 105759
6519 105759 102293 41725 28613 39119 5986 49083 144257 202686 132034 118353 96786 99738
$$ [...]
##END NTUPLES=NMR SPECTRUM
##END=
