##TITLE=Analysis number 313983
Compound Code mo 07002
Project Code adrs
Chemist Name spectrum
##JCAMPDX= 6.0         $$ Bruker NMR JCAMP-DX V2.0
##DATA TYPE= NMR SPECTRUM
##DATA CLASS= NTUPLES
##ORIGIN= Bruker BioSpin GmbH
##OWNER= NMR
$$ XWIN-NMR		Version 3.5
$$ Fri Sep 30 12:13:02 2005 GMT Daylight Time (UT+1h)  MAYBRIDGE\NMR@NMR_250MHZ
##.OBSERVE FREQUENCY= 250.131544655141
##.OBSERVE NUCLEUS= ^1H
##.ACQUISITION MODE= SIMULTANEOUS (DQD)
##.ACQUISITION SCHEME= undefined
##.AVERAGES= 16
##.DIGITISER RES= 18
##SPECTROMETER/DATA SYSTEM= dpx250
##.PULSE SEQUENCE= zg30
##.SOLVENT NAME= CDCl3
##.SHIFT REFERENCE= (INTERNAL, CDCl3, 0, 16.522)
##AUDIT TRAIL= $$ (NUMBER, WHEN, WHO, WHERE, WHAT)
$$ ##TITLE= Audit trail, XWIN-NMR		Version 3.5
$$ ##JCAMPDX= 5.01
$$ ##ORIGIN= Bruker BioSpin GmbH
$$ ##OWNER= NMR
$$ C:\u/data/dgb/nmr/ADRS/10080/pdata/1/auditp.txt
$$ ##AUDIT TRAIL=  $$ (NUMBER, WHEN, WHO, WHERE, WHAT)
(   1,<2005-09-30 12:12:46.54 +100>,<MAYBRIDGE\NMR>,<NMR_250MHZ>,
      <created by zg, POWCHK disabled, PULCHK disabled
       configuration hash MD5:
       62 19 C7 07 E1 42 D1 B7 37 6C 3D D0 77 39 F9 E6
       data hash MD5: 64K
       55 03 5E EF CD 66 0C 0D DE 56 FE B3 54 E2 05 29>)
(   2,<2005-09-30 12:12:56.66 +100>,<MAYBRIDGE\NMR>,<NMR_250MHZ>,
      <Start of raw data processing
       ef LB = 0.3 FT_mod = 6 PKNL = 1 SI = 32K 
       data hash MD5: 32K
       29 3D E3 1D 33 89 04 E3 6C F5 19 54 09 C4 93 D8>)
(   3,<2005-09-30 12:12:58.30 +100>,<MAYBRIDGE\NMR>,<NMR_250MHZ>,
      <apk 
       data hash MD5: 32K
       61 65 94 B5 7C 72 CD 28 9E 1E A4 69 89 E9 F6 11>)
(   4,<2005-09-30 12:12:58.95 +100>,<MAYBRIDGE\NMR>,<NMR_250MHZ>,
      <abs ABSG = 5 
       data hash MD5: 32K
       79 33 D7 65 24 7B F8 1C C2 1E 2F 52 EB F0 78 23>)
$$ ##END=
$$ 
$$ hash MD5
$$ CC 3E 3A FE B7 6F 35 95 C2 EE 73 B2 6F 5E 97 C2
##$RELAX= 
##$RELAX= 
##$RELAX= 
##$RELAX= 
##$RELAX= 
##$RELAX= 
##$RELAX= 
$$ Bruker specific parameters
$$ --------------------------
##$DU= <C:\u>
##$EXPNO= 10080
##$NAME= <ADRS>
##$PROCNO= 1
##$TYPE= <nmr>
##$USER= <dgb>
##$AMP= (0..31)
100 100 100 100 100 100 100 100 100 100 100 100 100 100 100 100 100 100 
100 100 100 100 100 100 100 100 100 100 100 100 100 100 
##$AQSEQ= 0
##$AQ_mod= 3
##$AUNM= <au_zg>
##$AUTOPOS= <34 >
##$BF1= 250.13
##$BF2= 250.13
##$BF3= 250.13
##$BF4= 250.13
##$BF5= 500.13
##$BF6= 500.13
##$BF7= 500.13
##$BF8= 500.13
##$BYTORDA= 1
##$CFDGTYP= 0
##$CFRGTYP= 5
##$CHEMSTR= <none>
##$CNST= (0..31)
1 1 145 1 1 1 1 1 1 1 1 1 1 1 1 1 1 1 1 1 1 1 1 1 1 1 1 1 1 1 1 1 
##$CPDPRG= <>
##$CPDPRG1= <>
##$CPDPRG2= <>
##$CPDPRG3= <>
##$CPDPRG4= <mlev>
##$CPDPRG5= <mlev>
##$CPDPRG6= <mlev>
##$CPDPRG7= <mlev>
##$CPDPRG8= <mlev>
##$CPDPRGB= <>
##$CPDPRGT= <>
##$D= (0..31)
0 1 0 0 0 0 0 0 0 0.06 0 0 0 0 0 0 0.0002 0 0 0 0 0 0 0 0 0 0 0 0 0 0 
0 
##$DATE= 1128078765
##$DBL= (0..7)
120 120 120 120 120 120 120 120 
##$DBP= (0..7)
150 150 150 150 150 150 150 150 
##$DBP07= 0
##$DBPNAM0= <>
##$DBPNAM1= <>
##$DBPNAM2= <>
$$ [...]
##$SUBNAM7= <"">
##$SUBNAM8= <"">
##$SUBNAM9= <"">
##$SW= 20.6930455092707
##$SWIBOX= (0..15)
0 0 3 0 0 0 0 0 0 0 0 0 0 0 0 0 
##$SW_h= 5175.983436853
##$TD= 65536
##$TD0= 1
##$TE= 295.16
##$TE2= 300
##$TE3= 300
##$TEG= 300
##$TL= (0..7)
0 120 120 120 120 120 120 120 
##$TP= (0..7)
150 150 150 150 150 150 150 150 
##$TP07= 0
##$TPNAME0= <>
##$TPNAME1= <>
##$TPNAME2= <>
##$TPNAME3= <>
##$TPNAME4= <>
##$TPNAME5= <>
##$TPNAME6= <>
##$TPNAME7= <>
##$TPOAL= (0..7)
0.5 0.5 0.5 0.5 0.5 0.5 0.5 0.5 
##$TPOFFS= (0..7)
0 0 0 0 0 0 0 0 
##$TUNHIN= 0
##$TUNHOUT= 0
##$TUNXOUT= 0
##$USERA1= <user>
##$USERA2= <user>
##$USERA3= <user>
##$USERA4= <user>
##$USERA5= <user>
##$V9= 5
##$VALIST= <valist>
##$VCLIST= <CCCCCCCCCCCCCCC>
##$VD= 0
##$VDLIST= <DDDDDDDDDDDDDDD>
##$VPLIST= <PPPPPPPPPPPPPPP>
##$VTLIST= <TTTTTTTTTTTTTTT>
##$WBST= 1024
##$WBSW= 4
##$XGAIN= (0..3)
0 0 0 0 
##$XL= 0
##$YL= 0
##$YMAX_a= 535549
##$YMIN_a= -447944
##$ZGOPTNS= <>
##$ZL1= 120
##$ZL2= 120
##$ZL3= 120
##$ZL4= 120
##$ABSF1= 16.522
##$ABSF2= -4.171173
##$ABSG= 5
##$ABSL= 3
##$ALPHA= 0
##$AQORDER= 0
##$ASSFAC= 0
##$ASSFACI= 0
##$ASSFACX= 0
##$ASSWID= 0
##$AUNMP= <proc_1d>
##$AZFE= 0.1
##$AZFW= 0.1
##$BCFW= 0
##$BC_mod= 0
##$BYTORDP= 0
##$COROFFS= 0
##$CY= 12.5
##$DATMOD= 1
##$DC= 0
##$DFILT= <>
##$DTYPP= 0
##$F1P= 14.0000005364418
##$F2P= -0.99999901652339
##$FCOR= 0.5
##$FTSIZE= 32768
##$FT_mod= 6
##$GAMMA= 0
##$GB= 0
##$INTBC= 1
##$INTSCL= 1
##$ISEN= 128
##$LB= 0.3
##$LEV0= 0
##$LPBIN= 0
##$MAXI= 10000
##$MC2= 0
##$MEAN= 0
##$ME_mod= 0
##$MI= 0
##$NCOEF= 0
##$NC_proc= -4
##$NLEV= 6
##$NOISF1= 0
##$NOISF2= 0
##$NSP= 0
##$NTH_PI= 0
##$NZP= 0
##$OFFSET= 16.522
##$PC= 1
##$PHC0= -62.37754
##$PHC1= -2.108161
##$PH_mod= 1
##$PKNL= yes
##$PPARMOD= 0
##$PSCAL= 4
##$PSIGN= 0
##$REVERSE= no
##$SF= 250.13
##$SI= 32768
##$SIGF1= 0
##$SIGF2= 0
##$SINO= 400
##$SIOLD= 32768
##$SREGLST= <1H.CDCl3>
##$SSB= 0
##$STSI= 32768
##$STSR= 0
##$SW_p= 5175.98343685301
##$SYMM= 0
##$S_DEV= 0
##$TDeff= 65536
##$TDoff= 0
##$TI= <Analysis number 999999
Compound Code 99
Book Reference 9
Project Code 9>
##$TILT= no
##$TM1= 0
##$TM2= 0
##$TOPLEV= 0
##$USERP1= <user>
##$USERP2= <user>
##$USERP3= <user>
##$USERP4= <user>
##$USERP5= <user>
##$WDW= 1
##$XDIM= 32768
##$YMAX_p= 421456104
##$YMIN_p= -149201
$$ End of Bruker specific parameters
$$ ---------------------------------
##NTUPLES= NMR SPECTRUM
##VAR_NAME=  FREQUENCY,     SPECTRUM/REAL,   SPECTRUM/IMAG
##SYMBOL=    X,             R,               I
##VAR_TYPE=  INDEPENDENT,   DEPENDENT,       DEPENDENT
##VAR_FORM=  AFFN,          ASDF,            ASDF
##VAR_DIM=   32768,         32768,           32768
##UNITS=     HZ,            ARBITRARY UNITS, ARBITRARY UNITS
##FACTOR=    0.157963299565203, 1,           1
##FIRST=     4132.6476996994, 0,             0
##LAST=      -1043.33573715361, 0,           0
##MIN=       -1043.33573715361, -149201,     0
##MAX=       4132.6476996994, 421456104,     0
$$ Real data points
##PAGE= N=1
##DATA TABLE= (X++(R..R)), XYDATA
$$ [...]
25732A1983m445n3411o230M3852J5634j3863J513J5363j1407p861O8L389K2485
25719A7070P908L6596J6074J7574p7089j8641K397R381J3230N15N203k1605R297
25706A7910p634l5491j8381K3559m92N580L5807K3162J6156l4942l0036j3543
25694a8345j7745P477J5143L083R306j0357J9497K0893P636k6349o097o83j158
25681B301K5921J1240k1002J2468m941l1209K1817j1789o0J7480k739n9163j7768
25668e7444J8136K5106k3764l025L4840k030o165K7316J0146J1160j0756p258
25656A6262j3217l368k3468k3460j3408J8467M8460K6086l3804J422M8135j2820
25644C5287j9390r137k0698l928N461o212l7259k1693j5612k1002J6040K3034
$$ y = [11983, 7538, -45873, -52103, -8251, 7383, -6480, -4967, 10396, -1011, -8872, -8804, -5415, 17070, 24978, 61574, 77648, 95222, 18133, -508, 1889, 11270, 24500, 25015, 30218, 8613, 17910, 10276, -25215, -43596, -20037, -20529, -14949, 20858, 44020, 60176, 25234, -4802, -18345, -36090, -28613, -13470, -10387, -1081, -11438, 8059, 28952, 36588, 10239, 4142, 3459, 2301, 28222, 39462, 18460, 30928, 25987, -5222, 16595, 4806, 4746, 22226, 19487, -39676, -57444, -39308, -14202, -37966, -40991, -6151, -8181, -14346, 12970, 23116, 34276, 23520, 16262, 3045, -323, -23791, -47251, -60659, -42192, 6268, 32354, -1450, -28, 48107, 35287, 15897, 6760, -13938, -17866, -12405, -18617, -55876, -77569, -93181, -114183, -98143, -75109]
25632g5109O3826N3530J4072j4811j2982N488o195K9601J1881m2169k3795K417
25620E754l1137M839p860K0729K8402J5124j1535j1189J5621l4536l6544p352
25608d9684N2589J8234k6212k1791J7746K2535q218O202L5157L0283n6510j8217
25596B114M980j8580k1916m0414K1243L3458j9734k1424j0796J5200N96L6761
25584a8512L3067L4511J6251j4473n0051K471L0934j5023j1325k797j3888k1541
25572c0376p979k4249J6553K4460M9353J5509j1060R4J7395J3273m1396j5758
25560E819N185K8292K9774j6837l1262n1578j1265L1069o806l7509J978K1712
25548c1428j8819J7247J5667n789l536J0065L2879O396J5896j3818n374J6345
$$ y = [-75109, -11283, 42247, 56319, 41508, 28526, 34014, 27819, 57420, 69301, 27132, 3337, 5754, -25383, -20544, -28404, -7675, 20727, 35851, 24316, 13127, 28748, -5788, -42332, -49684, 2905, 21139, -5073, -26864, -9118, 13417, 5199, 11401, 46558, 76841, 20331, 2114, 7094, -11486, -33402, -73816, -52573, -19115, -38849, -60273, -71069, -55869, -55273, -18512, 14555, 49066, 65317, 50844, 793, 3264, 34198, 19175, 7850, 5053, -8835, -30376, -38355, -62604, -46051, -21591, 27762, 43271, 32211, 32305, 49700, 62973, 21577, 5819, 11004, 39296, 69070, 52233, 20971, -30607, -41872, -10803, -17609, -55118, -53140, -31428, -50247, -33000, -17333, -23122, -26658, -16593, 16286, 22682, 38578, 24760, 19386, 35731]
25536C5731J5817k0894l7426j9499j3900J9827J338n204j0110r455j1741J8850
25524c6666K4874L4396J5056j2282k6909L94q252Q22l1930J1486K8179j5524r917
25511b6273J2081K0902J63j3471l8591k923J5775K1461j4295J9926J6970n709
25499F016j6324K1540K1572K24P960M956k177l3577j6009J782j1148k5686k748
25486d3619R663L0820n330O551l7197k3429N9192K2500K360k2353j9117m28k8176
25473d8563M509J0648M3634L67k9843J176l425m985J5231m7562j4495K5748L9232
25460h328l3123L1091M0369n833k9653j673k942k1453K1958L1043N6156o544O407
25447G7475r325j0122K3145K7018k181m1553N618p513N113j5148r438q488j5452
$$ y = [35731, 51548, 30654, -6772, -26271, -40171, -20344, -19006, -24210, -34320, -43775, -55516, -36666, -11792, 22604, 37660, 25378, -1531, -1137, -9389, -8567, -40497, -29011, -832, -16356, -26273, -14192, 6710, 6873, -6598, -45189, -48112, -32337, -10876, -25171, -5245, 11725, 6016, -10308, 11232, 32804, 33028, 40988, 45944, 43767, 10190, -5819, -4037, -15185, -40871, -43619, -33956, -3136, -8466, -1915, -39112, -62541, -3349, 19151, 21511, -842, -19959, -20387, -48563, -44054, -33406, 10228, 10595, -19248, -18072, -21497, -26482, -11251, -58813, -73308, -47560, -8328, -41451, -10360, 30009, 24176, -5477, -7150, -10092, -31545, -9587, 21456, 77612, 71068, 77475, 68150, 58028, 81173, 108191, 106010, 64457, 70075, 62562, 67675, 52527, 43089, 34601, 19149]
25434A9149J861n226j0586l047L3993O1684M1568j1726m3234l8946k0363J724
25422B6851J7352P404k3837m2141J9910N0748j211j2537m1530j3994k5728m740
25410d3453m700m51K5875L3721J1889n485m0465R854J6168J4400N528j9288J1907
25397A5500R600m5012q715L8835K8617O270m9795j3523L3641j7795k4199k796
25385b9372J7349K8703j3059j4053L9375j5717o35K9675l0187m6937l0582j3558
25373g8998L194L3095J0451J353L2879L2476J1928k5913m0224p711O742K0418
25361c10J0269j7587l457J7021J77O848k0595r952k771j3612J7900J6174J6460
25348A6565l6610m9109N8728L5685k9246n3063j1497J9701L2593J8593q191j8389
$$ y = [19149, 21010, 15784, 5198, 2151, 36144, 97828, 139396, 127670, 84436, 45490, 25127, 26851, 44203, 51607, 27770, -14371, 5539, 56287, 55076, 42539, 1009, -12985, -38713, -43453, -48153, -48604, -22729, 10992, 22881, 17396, -23069, -13215, 2953, 17353, 22881, 3593, 15500, 25100, -19912, -28627, 10208, 38825, 45095, -4700, -18223, 15418, -2377, -26576, -29372, -12023, 16680, 3621, -10432, 28943, 13226, 12591, 42266, 12079, -34858, -65440, -78998, -75804, -42709, -32258, -30905, 1974, 34450, 46378, 20465, -19759, -27470, -20728, -310, 9959, -7628, -11085, 5936, 6113, 12961, -7634, -17586, -20357, -33969, -16069, 105, 16565, -20045, -69154, -10426, 25259, -3987, -57050, -68547, -48846, -16253, 2340, -5851, -24240]
25336b4240Q773M7434k8557p573M636P058Q020J2691k6740l4477j2170J5824K1148
25323h173L023L447m048m056j1594J8046L5653l0209k5233L5523J7265R011j7999
25310B0656j6025l5128j879L8483r100m5786j622J9551L371L1255J3301m872k2792
25297a0587k7049j4274P205j811K9515K5970J9573L766N18j3362m0646J995M102
25284a5085M274L8294k4725l0916Q302N706J3673K6534k9952l3783J8763J3914
25272e001J9756K522O293J9966j3467n60r947K823k5815K6343J9060n368j2307
25259B4298p382J308K5051k1521j1028j4275L694J1134j2414K5126J6425J8570
25247E8986j0096j4847l599R36j9417J3904j0299K2495L475k9447Q361p546k9780
$$ y = [-24240, -15467, 31967, 3410, -4163, 473, 7531, 15551, 28242, 1502, -32975, -45145, -29321, -8173, -5150, -1703, -5751, -9807, -21401, -3355, 32298, 2089, -23144, 12379, 29644, 38655, 20656, 4631, -30497, -32376, 6107, -2993, -48779, -50401, -30850, -27479, 3776, 17077, 12205, -10587, -37636, -51910, -44705, -46516, -17001, 8969, 28542, 32308, 32826, 19464, -21182, -19187, -15085, -10811, 27483, 2758, -28158, -19856, -14150, -477, 26057, -3895, -37678, -18915, -5001, 14755, 17277, 23570, 43536, 30069, 29509, 19562, 22385, -3430, 22913, 41973, 36605, 24298, 16916, 18224, 43275, 21754, 10726, -3549, 145, 11279, -1135, 23991, 40416, 58986, 48890, 34043, 30444, 31380, 11963, 25867, 15568, 38063, 41538, 12091, 20452, 12906, -16874]
25234a6874K0223M856n2267L524K8504N3732K3862L2541n923m7886j1151J997
25222C5138L165k4038k1726j3076j12j7643J2692L0780M270J250k037j948M249
25209A0964M618K549M4863k683k2333j6446l6318l0761J4922J6223j2051q872
25197c5325j4201O054M3191k7937l9663L217J8938N240K2146K1748j2020Q466
25185a46K3718K7308R902m2388j0829k2888k5371K5941K0660J1298j2387K9846
25173C4664L650J0702k3959l9238p099J5627k163K439r274l1186P631K2563n252
25160b0895m415l1507q834K4344L5927J278K3809j5146p0J3633q141L253P902
25147B1138K5431K6519M843o966m4984k0992K3673o609l416J9925K7590J0340
$$ y = [-16874, 3349, 8205, -44062, -40538, -12034, 41698, 65560, 98101, 92178, 44292, 33141, 35138, 38303, 14265, -7461, -20537, -20649, -38292, -25600, 5180, 9450, 10700, 8663, 6715, 10964, 15582, 18131, 62994, 60311, 37978, 21532, -14786, -45547, -30625, -14402, -26453, -35325, -49526, -43472, -281, -28218, -67881, -64664, -45726, -40486, -18340, 3408, -8612, -146, 23572, 50880, 60782, 18394, 7565, -15323, -40694, -14753, 5907, 17205, 4818, 34664, 38314, 49016, 25057, -14181, -21280, -5653, -7816, -5377, -14651, -45837, -38206, -15643, -20895, -25310, -56817, -65651, -41307, -5380, -4102, 19707, 4561, 4491, 18124, 9983, 13236, 21138, 46569, 73088, 77931, 70965, 25981, 4989, 28662, 22053, 18637, 38562, 66152, 76492]
25135G6492k4491l4090j7162K1411J358J5294j0943n0806l312K1511k9758K6451
25123h045J5225j4867P090k6781j7343J2494K7043j4094l0568j2198K5846K0530
25111a5668O1704O970q216q894j7434o195k2758k4310j3057L0841J6892k3665
25099b3790M941R587k8809m8630J4168M8238K1174N059j5558J1302l914l78k0611
25086b7221K4945N527k3374k1921J815L650j7515K2241J4411P165j8062k4661
25074e3000j9111J6572K0791n038P436J5779r235K2407J4465o252p834j4619K757
25061a4882j0667L2305J676j3729m731J075J5661M4771K7369m4632l5409J2621
25049A1428J6051L2551j9306J314k322k8936j2301K2771J4017q734l2195l0999
$$ y = [76492, 52001, 17911, 749, 22160, 23518, 38812, 27869, -22937, -26249, -4738, -34496, -8045, 7180, -7687, -597, -27378, -44721, -32227, -5184, -19278, -49846, -62044, -36198, -15668, 46036, 53006, 44790, 35896, 18462, 12267, -10491, -34801, -47858, -17017, -125, -23790, -18849, -9262, -38071, -86701, -72533, -24295, -3121, 1938, -13620, -2318, -6232, -6610, -27221, -2276, 3251, -20123, -42044, -40229, -36579, -54094, -31853, -17442, -10277, -28339, -53000, -72111, -55539, -34748, -39786, -32350, -16571, -25806, -3399, 11066, 4814, -3020, -17639, -14882, -25549, 6756, 8432, -5297, -10028, -8953, 6708, 51479, 78848, 34216, -1193, 11428, 27479, 60030, 40724, 42038, 39716, 10780, -1521, 21250, 35267, 26533, -5662, -36661]
25037c6661M6909l974k4407J0549R564M308j7031p900J8142K3770k734K856p563
25024A5828k4100K0761L0682p147j5368Q22M0798p911j6190j5034k1376k2878
25012b1113k510n0023J749O6269K9729L3814k030n9843l1506l0303N024K6056
25000c4687R444q417r919r614P413J0040l7763J8456K8615Q709o485K2482o759
24987h485L1652j1238J0473J2927j8875j5930J3246p573J6204K4524l0969m9256
24975c3300j9825k8699J2282L8259J0149K5138M9724M298o789k6130L435k2578
24963E964j9013j653j7154J0280O1676J0313j7220L846j260l295p116o390O178
24950B5156p835r372Q425n46q099l5117j2472J7518K7010K068J1464O325J1884
$$ y = [-36661, 10248, 6274, -18133, -7584, 1980, 6288, -10743, -18643, -501, 23269, 20535, 23391, 15828, -8272, 12489, 43171, 36024, 20656, 21478, 62276, 54365, 38175, 23141, 1765, -21113, -23623, -73646, -71897, -5628, 24101, 57915, 55885, -3958, -35464, -65767, -60743, -34687, -25243, -33660, -43579, -53193, -45780, -35740, -73503, -55047, -26432, -17723, -24208, -1726, -8485, 23167, 11929, 22402, 35329, 16454, 524, 13770, 6197, 22401, 46925, 15956, -33300, -53125, -81824, -69542, -31283, -21134, 4004, 53728, 58026, 51237, 25107, 28542, 5964, -13049, -14702, -31856, -21576, 40100, 50413, 33193, 37039, 35779, 32484, 25368, 18978, 25156, 17321, 7949, 16374, 15828, 7729, -27388, -39860, -22342, 4668, 6736, 18200, 24525, 36409]
24937C6409l055J0730l7895n7759k0928O5855L0011J510k5228J499j9352J3756
24925d447o089O78J9990K155M2061J9702l757p204J3430q653k9239k3808l5340
24912b0521k2027Q391M7865K2062N24l857k3963k4618l2298K4619J4997m881P25
24899a2982j220m7314P782L0961K4646j4628n946j1084N995j2260j7130J3666
24887c9514J5496J2998r712J5542P527L747K0886K2544K2976k387k6253k8130
24875A5720j6362j4541j1888Q578L7305L602L006k256N048K1726q007j3395N581
24862C4117M921l3070k8502J2074M608K216k9666k018J2695m460O128O020j3713
24849b8650j4175k0219K2359J6231K5607J2838k1565j3305j7444k9540J520R36
$$ y = [36409, 33354, 44084, 6189, -51570, -72498, -6643, 23368, 24878, -350, 1149, -18203, -4447, -10536, -9858, 10132, 12287, 54348, 74050, 70293, 63089, 76519, 67866, 38627, 14819, -20521, -42548, -34157, 13708, 35770, 36294, 32437, 8474, -16144, -48442, -23823, -8826, -13707, -12982, -14202, -61516, -53734, -22773, 1873, -12755, -18701, -29785, -23790, -36050, -53180, -39514, -24018, -11020, -20732, -5190, 2337, 6084, 26970, 49514, 72490, 70103, 43850, 15720, -642, -15183, -27071, -18493, 18812, 22414, 25420, 23164, 28212, 49938, 41931, 28536, 34117, 39038, 5968, -22534, -10460, -5852, -3636, -33302, -35320, -22625, -27085, -20957, -14937, -28650, -42825, -63044, -40685, -24454, 1153, 13991, -7574, -20879, -38323, -67863, -66343, -65407]
24837f5407J7785N7233k3879j8418q303M1677J7033j5945j8081K4398J029r180
24825e8k5223l5259j3666M7512M642l6567k562J3874N9112L2928l3429m2776Q9
24812c1383L9106r73m3821j6333O342N1259L26p639K796j400k6780J0247p23l5388
24798e4364k6197O6563L0891n876k5334k0903K4943P6k5468J5850J6325K4776
24786B1282N801p572j1173k68J1392j6886m4906J5829q405L4189K4249O610J7751
24773D7893k024k5348J698q749l0174j3672k3355j7689O980J3587r802J8796M6314
24760D455p714j8150k2549K884M5040M2106n831l4737j3322j3783P495M0381L474
24747B9749k6633M514o160K9532k9180j0184k7886m907j5233L489m851K0505P881
$$ y = [-65407, -47622, 9611, -14268, -32686, -40989, 688, 17721, 1776, -16305, 8093, 9122, -58, -25281, -60540, -74206, -26694, -22052, -58619, -61181, -47307, 11805, 44733, 11304, -31472, -31383, 7723, 6750, -37071, -53404, -47062, 4197, 4523, -3116, -320, -1720, -28500, -18253, -18976, -54364, -80561, -13998, 16893, 11017, -14317, -35220, -10277, -10201, -35669, -19819, -3494, 21282, 27083, 19511, 8338, 8070, 19462, 2576, -42330, -26501, -34906, -717, 23532, 30142, 47893, 45869, 20521, 22219, 13470, -16704, -30376, -53731, -71420, -64440, -50853, -60655, -41859, 4455, -3259, -21409, -43958, -41074, 3966, 46072, 40241, 5504, -7818, -21601, -14106, 26275, 29749, 3116, 7630, 1470, 31002, 1822, -8362, -36248, -41155, -56388, -52899, -57750, -37245, -29364]
24734b9364Q104O741M2064j4501q032m466n328P999k1741l2398p747J0947j0316
24721e8038K3801L0414J86K107J0004r777j3417j2894L5422J0237l1751j2050
24709b5756k5134o394K2975J2232L5204o363k6751J469l6814l5761J1725M0661
24697c8707j6965j5952N7000M7097j0003Q817K1817Q189j0356M350l6243m4135
24685b5091j8106K5119J6537l508J0823L60k5339l3022J7175L9955K9886J0079
24673D4868o6810n22J8073j3483K527K3597j6178j0248m6340O756J7867k328L2290
24660i931q546r612l6344p774K7102p269m35Q688n277N2942M0039j3545k4958
24647E080j2052j8699k9748K1861K1231o836K1782K9558j4707q883J2373j0631
$$ y = [-29364, -21260, -14519, 27545, 13044, 5012, 546, -4782, 3217, -18524, -50922, -58669, -47722, -58038, -34237, -3823, -3637, -1530, 8474, -1303, -14720, -27614, 7808, 18045, -13706, -25756, -50890, -57284, -34309, -22077, 13127, 6764, -19987, -18518, -55332, -91093, -79368, -38707, -55672, -71624, -14624, 32473, 22470, 31287, 53104, 61293, 50937, 55287, 19044, -25091, -43197, -18078, -1541, -5049, 5774, 6134, -19205, -52227, -35052, 4903, 34789, 44868, -21942, -22464, -4391, -17874, -15347, 8250, -7928, -18176, -64516, -57760, -39893, -42221, -9931, -18477, -28089, -64433, -72207, -45105, -52374, -52809, -44121, -49398, 3544, 43583, 30038, 5080, -6972, -25671, -55419, -33558, -12327, -19163, 2619, 32177, 17470, 8587, 20960, 10329]
24635A0329l4981n662p222L4360K1179j8435J8401J1977o283r903j5381l4178
24623c5799J9985M365J3605j078k4466l7648j2962K2331J3201j3470M378J157
24611d6401J7867J4798M2322J3313m0758j9607K8954M9802m794m3306l374l800
24599E016k6167J9522J3985P207L0251k2830J8095j92l747q475l7103K03k387
24586f622J383R776n185J1822j5949L144j5774r625M4263J2088j7404L7159L651
24573E2727n5271k9119L4286M109K4443j4424n632K3654M3683k8332j2206k5820
24561A2098k1372J8171l5729l8989K6098M0575K1088L439j2866j6380m1402J4424
24549c0845L1431J571j0621l5608l2Q012J6279j6768P108l824N733K1755M221
$$ y = [10329, -24652, -30314, -37536, -3176, 18003, -432, 17969, 29946, 23663, 13760, -1621, -35799, -15814, -11449, 2156, 1078, -23388, -61036, -73998, -51667, -38466, -51936, -47558, -46401, -28534, -13736, 28586, 41899, 1141, -18466, 10488, 60290, 55496, 12190, 8816, 5016, -21151, -1629, 12356, 19563, 49814, 26984, 45079, 44887, 41140, 32665, -4438, -4235, -6622, -5239, 4537, -648, 11174, -4775, -1631, -17405, -27030, 17233, 29321, 11917, 49076, 52727, -2544, -31663, 2623, 6732, 31175, 16751, 11119, 34773, 78456, 50124, 37918, 12098, -9274, 8897, -26832, -65821, -39723, 852, 21940, 25379, 12513, -3867, -45269, -30845, 586, 2157, -8464, -44072, -44104, -36092, -19813, -36581, -29473, -33297, -27564, -5809, -1588]
24536a588l2292j9714N644k2348l7557J7777K5721Q766n750j846J9217r180L2712
24523b0438J9847k1986k5331K1142l442j2156k521L9422M1447p334n6673l1868
24511e9891L6843j1503l5765L9602J6640j3777k517L3655J3083j782l1628L086
24499a3954j2622j3345K607n649J7759O714j1150L365M1265O31k0477p699p03
24486a3258K6778p66k2254j0999J7040M5411J7984m8720j6593K1598j0726p530
24474b035n9895l2446O2558N6141R442l7360K6378M2956k3881j0021r46o984M949
24461B8856p577k833k5447r032J2948J6155J5756o2345l8659K2998o553m515L5769
24448b4479m421j9763K5778L497j7398n531L574J7636K3929q843j2364k4093J650
$$ y = [-1588, -33880, -53594, -47950, -70298, -107855, -90078, -64357, -55591, -61341, -63187, -43970, -53150, -20438, -591, -22577, -47908, -26766, -30208, -42364, -44885, -5463, 35984, 28650, -28023, -59891, -23048, -34551, -70316, -30714, -14074, -27851, -30368, 3287, 16370, 14588, -17040, -13954, -26576, -39921, -37314, -42963, -25204, -18490, -29640, -26275, 14990, 15621, -4856, -12555, -13258, 13520, 12754, -9500, -20499, -3459, 41952, 59936, 11216, -5377, 16221, 5495, -2035, -61930, -94376, -31818, 24323, 33765, -3595, 22783, 65739, 41858, 31837, 30891, 23907, 28856, 21279, 18446, -7001, -16033, -3085, 13070, 28826, -33519, -72178, -49180, -55733, -60248, -24479, -28900, -48663, -22885, -19388, -36786, -42317, -38743, -21107, 2822, -6021, -18385, -42478, -40828]
24435d0828J8480M4084l433k238N100j3743m4358j0098K0132O4140o664J3032
24423D3606l85o820K829Q858P696j0882o231j0431j6597R610k3063k1960J4269
24410i501J8644K5430l1134q488J1386N931J0532j124K2293q4424l8459M2895
24398c6019J1532N421j818J2887k1874j9907p145K2429l1330K3152N2136J092
24386A0556j4110K9465l0470l3127K7971K236N541L2402J3988n814l3189P580
24374A3029m321P483k1330k4428k4461k340L2517K0523K6731J8399n675L048j2207
24361B6968J4950J9970k0540n2992k2948J7395k492o322N43J5763P339l0746j737
24348c4849L4007m8316k7569L895M2311M1313L5084l589J1831k0309j2128L3131
$$ y = [-40828, -22348, 21736, 18303, 16065, 21165, 7422, -36936, -47034, -26902, 37238, 30574, 43606, 43221, 36401, 39230, 48088, 55784, 44902, 38671, 28240, 11643, 21253, -1810, -23770, -9501, 9143, 34573, 3439, -5049, 6337, 12268, 22800, 21676, 43969, -40455, -78914, -36019, -24487, -19066, -20884, -7997, -29871, -49778, -56923, -34494, -65824, -42672, 9464, 10556, -3554, 25911, -4559, -37686, -9715, -7479, -1938, 30464, 44452, 38638, 5449, 13029, 8708, 16191, -5139, -29567, -54028, -56368, -23851, -3328, 23403, 41802, 36127, 39175, 26968, 41918, 61888, 41348, -11644, -34592, -17197, -19689, -26011, -25468, -9705, -2366, -33112, -34849, -842, -49158, -76727, -72832, -30521, 10792, 45876, 42287, 54118, 33809, 21681, 54812]
24336E4812P487n4084j5313K2156o937o225l8739M6300l86j8881k5395l5131L4155
24323c6181j4529j0545K693j1187k1171J5139M2329K2766J8097l0606J3245J1279
24311A329M771l449j2462k5125J3423K6579M045J478J0732K489k3654M768J5960
24298B0884J4575j5839k7666j900k3206k3210K1880L0929j6348n580j4057K4552
24286a4986O608J0894J9563K5656k695j4308k5031o1867P961L3974L3904j5297
24274D376m25M2692O879n6389l3676p309J6137L0843K220k9489M3898j5647K2089
24261B6199K6228q628j1709J4468n832m3054j1561r851M530N0053j5445k6723
24249a1325n345k3007J4762L7525J520o057Q071K3162J3160j0958q594n3785j9499
$$ y = [54812, 62299, 8215, -7098, 15058, 8121, 1896, -36843, 9457, 9071, -9810, -35205, -70336, -36181, -50710, -61255, -58562, -69749, -90920, -75781, -33452, -10686, 7411, -23195, -9950, 1329, 6100, 2651, -9811, -34936, -21513, 5066, 9111, 10589, 21321, 23810, 156, 4924, 20884, 35459, 19620, -8046, -9946, -33152, -56362, -34482, -3553, -19901, -25481, -39538, -14986, -8378, 2516, 22079, 47735, 45040, 30732, 5701, -56166, -48205, -14231, 19673, 4376, 3951, 46643, 53522, -2867, -36543, -43852, -27715, 3128, 5348, -24141, 19757, 4110, 26199, 52427, 43799, 32090, 46558, 40726, -2328, -13889, -23740, -19210, 30843, 15398, -11325, -16670, -39677, -24915, 12610, 14130, 8073, 16144, 39306, 52466, 41508, 32914, -20871, -40370]
24236d0370m537J4327M1570P3467n978j0186k1593m511k7378l2017L1430J9753
24224C3977q979j9792N0360j2052l5370J4296K368n059j2500r775l0195N116q522
24211c6127J954L0763J6151j2411l0307L954n870P553N1003j7802O476L5154m865
24198D5626l3473k3500l778n175J917R189J2072J2049r860M206K0765j7965J4397
24185B6470J8772M280p945k7321L189k2313l4176M646K5703L0410J2469j1930
24173B2254l5N70j734N2232J322l3318k8279k7327K690N793l6245j4902J5355
24160d1624P553L3356J6723q38j8865m4269K93N060K6456L8699K0405J4238n495
24147E1692m3736j3384k615K9056j074J0182k0276j9031k5705m822l648Q73J9053
$$ y = [-40370, -44907, -30580, 10990, 84457, 78479, 68293, 46700, 42189, 14811, -17206, 14224, 33977, 24998, 5206, 55566, 43514, 8144, 22440, 24808, 19749, 7249, -2526, -32721, -27605, -36127, -34173, -3410, 12741, 330, -29977, -26023, -31893, -24340, 26663, 8861, 15337, 50491, 45626, 12153, -11347, -15125, -20300, -18383, -9194, 2878, 14927, 5067, 9273, 30038, 12073, 26470, 45242, 49522, 41577, 14256, 17445, -4868, -39044, -34398, -8695, 21715, 34184, 22254, 22219, 22789, 21055, 73287, 74609, 41291, 13012, -14315, -11625, -5832, -42077, -56979, -41624, -34071, -715, 16008, 15170, -3695, -47964, -47671, -42611, -16155, 22544, 42949, 57187, 51692, 7956, -5428, -8043, 21013, 19939, 30121, 9845, -9186, -34891, -39713, -43361, -42488, -23435]
24134b3435J371k2540j3835q17M4525M5390k1655j6605p60j5316K317J2090r241
24121a8511k2828L711L9223P148J769J6904O157j8872n8892j7457q15J0644N373
24108d6446P612k6023l3518P53P249M4677M0231K244K725p3j3379o89l282k4297
24094d2216j3402K9495J9655K8601k575O78O008r245j2736M719M193J0877K5787
24081D9839j4323l0244Q585K3413K2851j2614p193R440k6907n4420p602N467K6994
24068f714j2038J0349J0171Q157k7654Q936O633R026k7945Q59K6945j2811l3244
24055c9330K7503J8111J9336j6085m654L762j6789q384n4327J1781M5811R589
24043c676l0301n163L7812J3938k5111o264R142J5844p251l709O158j5201o5559
$$ y = [-23435, -22064, -44604, -58439, -59256, -14731, 30659, 9004, -7601, -8361, -23677, -21360, -9270, -18511, -41339, -37628, 1595, 8743, 10512, 27416, 33573, 14701, -44191, -61648, -62463, -51819, -46446, -38834, -64857, -98375, -97622, -90373, -45696, -5465, -3221, -496, -569, -13948, -14637, -17919, -42216, -55618, -26123, -6468, 22133, 19558, 20236, 26244, 16999, 4263, 8982, 13175, 24052, 49839, 35516, 5272, 13857, 37270, 60121, 47507, 40314, 49754, 22847, -31573, -39175, -33708, -6714, -18752, -8403, 1768, 9925, -17729, -8793, -2160, 6866, -21079, -20220, 6725, -6086, -39330, -11827, 6284, 25620, 9535, 4881, 8643, -8146, -16530, -70857, -59076, -13265, -3676, -33977, -39140, -1328, 12610, -12501, -18765, -9623, 6221, -1030, -4739, 1419, -13782, -79341]
24030g9341K1362K7936k263j0297J8033K1138k4393m8873m060N8296J9610L662
24018H10l446o2363k5125K7316M0891j1733m2856j4554J1331K3419J209j5597
24006g0698K8651J0387J0431k0375J5022K8842J0431j7236L1660J7644k3866j1289
23994I604m1797l5400P496Q331L8926J1841Q831P324P749j6640J2285l293p007
23981H250K5130R813K2053j2757k5525R050j5036l1496j0752K3308N739k1297
23969a3520r95j914m9980J5925L8597K9081j4208m6166k6499J183K6794q719k4790
23956g5211L4339R1010n43j818L226l9102k5463R016Q850j996R068j6075m1593
23943d6292j8704k1564j4396M5005Q220J8469m764m812M3833J5984m429k843J6316
$$ y = [-79341, -57979, -30043, -32306, -42603, -24570, -3432, -27825, -76698, -80758, -22462, -2852, 810, -2636, -64999, -90124, -62808, -21917, -33650, -76506, -91060, -79729, -56310, -55101, -70698, -42047, -31660, -21229, -41604, -26582, 2260, 12691, -4545, 27115, 44759, 20893, 9604, -32193, -67593, -60097, -51766, -12840, -999, 7832, 15156, 22905, 6265, 18550, 15257, 8250, 33380, 43193, 65246, 52489, 26964, 36014, 20978, -10518, -21270, 2038, 7777, -13520, -14515, -16429, -66409, -50484, -11887, 17194, 2986, -43180, -69679, -68496, -41702, -50421, -75211, -40872, 50138, 49595, 47777, 51003, 11901, -13562, -4546, 4304, 2308, 11376, -4699, -46292, -64996, -86560, -100956, -55951, -47731, -29262, -34026, -38838, 4995, 20979, 16550, 13707, 30023]
23930C0023Q085J3923j9560k274l6332j6127Q5j4873j1250J0711O430N7086J2445
23917C8372k9524j9676L668r332J3292J6526L197l3629L5031K5845n1210L174
23905d266P297J1395J241m178R029N17k9239l8403k971N1281M6750N7893l435
23892A02911l3810j4335k8834O383J0906l216M797K4587p236k4442P600j4182
23880C1129j6555K7164J275j8161K5424M0023r114n8948j2092j2469l4138l4264
23868g0726L1270j7047j7185j2840L2052M1663L1776J8389m4130n398J6269M2762
23856D6855p921l1388J9617R295j9078m0491k2776J3290K7649L2236j1473k6146
23844a0331K9659j5670L0585j9724m1704L6574j7036k3100j0535l561J2472K6863
$$ y = [30023, 38108, 52031, 32471, 30197, -6135, -22262, -22177, -37050, -48300, -37589, -31159, 25927, 38372, 8848, -10828, -7160, -16492, -3200, 13326, 16523, -17106, 17925, 43770, -7440, -4266, 3031, 14426, 15667, 11489, 20518, 21035, -8204, -46607, -49578, 1703, 48453, 106346, 102911, 69101, 54766, 25932, 32315, 43221, 40005, 44802, 69389, 62153, 37711, 45311, 31129, 14574, 41738, 43013, 24852, 50276, 90299, 81185, 22237, 10145, -2324, -36462, -70726, -39456, -56503, -73688, -86528, -54476, -12813, 18963, 37352, -6778, -12176, 4093, 46855, 38934, 7546, 27163, 36458, 17380, -23111, -45887, -32597, -4948, 27288, 15815, -10331, 19328, 3658, 34243, 14519, -27185, 9389, -7647, -30747, -41282, -44843, -32371, -5508]
23832e508l963k0721J0060M3104K9212j7794N21L712m1876l6614K2750J7075o611
23819f653j6111k8336N069R836L3338Q749l5618k4189Q524L5200K8651k2166j5630
23806a9336m0094K086j5366j2614J9521j2815n1619K4061J8565K3186M2151K4514
23794B240j0568P11K8678k9205l1937L2908O688K4520L337l7353l6688j6616J4028
23781d9257K5860L1757L1529k1999j3861j5131j4278N991j777L4983J0591q167
23769A6241k2311q655J2398J4309K4756j1977k1641O864J2105l824l5733j493
23757a8961K2277M837K413n610L9168L7460n2525l9421j5114j1179j528J2926
23745b5257j6496k190N667m500p481J9833j0382O031L882J4979k6394j2625L2032
$$ y = [-5508, -9471, -30192, -20132, 22972, 52184, 34390, 34911, 38623, -3253, -39867, -17117, -42, -6653, -22764, -51100, -46031, -36195, -2857, 5892, -29726, -53915, -45391, -10191, 18460, -3706, -19336, -59430, -57344, -72710, -85324, -65803, -78618, -130237, -106176, -87611, -64425, -22274, 2240, -8328, -7617, 21061, -8144, -40081, -7173, -485, 24035, 27372, -9981, -46669, -63285, -49257, -23397, 8360, 39889, 17890, 4029, -11102, -25380, -19389, -21166, 13817, 24408, 16241, -6070, -14725, -2327, 11982, 36738, 24761, 3120, 9984, 22089, 18265, -17468, -18961, 3316, 8153, 10566, 4956, 44124, 81584, 29059, -10362, -25476, -36655, -38183, -25257, -41753, -43943, -38276, -42776, -50257, -30424, -40806, -34775, -30893, -15914, -42308, -54933, -22901]
23732b2901J6811J8620l9245j0552J8647J0839J5333j0726p231J4589k7571M967
23720a8420j4426j3356Q669L6285K0016j0797j5124j1400K1787o434k0535o7724
23708i1459O5069M1793j6356l0213k2913j1572J6324N5661l928j883p6L431K5232
23695B9110o640k6953k354l7123k0450L6650K9806J5075O249J329j3990l3750
23683b3041j9823l9351L0542r40q905J4671J1653Q726J1078K6042Q114j2205j0626
23670d065o70l2805j1692K7911L990r839O192K158K9197M292j2580Q42l674J8478
23656A7735J8757k6156r152k1281J6690N598k7762L1461J3978n018L0375j6955
23644B8270m1445j0149K036K9293l129M689J8344k3610O015J0514l0191k2873
$$ y = [-22901, -6090, 12530, -26715, -37267, -18620, -7781, 7552, -3174, -10405, 4184, -23387, -18420, -32846, -46202, -37533, -1248, 18768, 7971, -7153, -18553, 3234, -3200, -23735, -91459, -26390, 15403, -953, -31166, -54079, -65651, -49327, 6334, 2406, 523, 447, 3878, 29110, 22470, -4483, -6837, -43960, -64410, -27760, 2046, 17121, 23370, 24699, 10709, -23041, -42864, -82215, -51673, -52613, -61518, -46847, -35194, -26468, -15390, 10652, 18766, 6561, -4065, -4735, -37540, -49232, -21321, -17331, -27170, -20978, -18820, 10377, 14669, 2089, 2931, -743, 17735, 36492, 10336, 1184, -20097, -3407, 2191, -25571, 5890, 19868, 14850, 45225, 28270, -13175, -23324, -21288, 8005, 4876, 9565, 27909, 4299, 10314, 20828, -9363, -32236]
23632c2236L243N5846J6210q035k9815l0864n259J4109J4406L3797M404P937p256
23619C6487o280j670j6225k3376J6959M10P453J175k2049L599P127J3091M608
23606B1309N245j695l446N958j2677k2846j6309m3161K3165M1250j1374l8930
23594e3511K2062L6679K5801k0110r709q466k9881J459L5642k9639k6694J7393
23582c8974L764K0413J5304l706K772j78k377K166J7453P25j7124M392Q153J5470
23568B8253O212J3957k050j7118n6216k6123K0532j2810p820j7716K2352O738
23556d1809j2296J7996J2404M44J821O3422J0780J2635j065j678l9007m9833k8076
23543e4262J6091J0373k4512R451J4407J9501m104k2893k8059J7898Q78m4445
$$ y = [-32236, -28993, 26853, 43063, 35028, 5213, -25651, -30910, -16801, -2395, 31402, 35806, 43743, 36487, 30207, 28537, 12312, -11064, 5895, 6305, 13758, 14933, -7116, -3517, 3610, 16701, 21309, 26554, 24859, 21413, 27371, 14694, -8152, -24461, -67622, -44457, -3207, -14581, -53511, -31449, 5230, 31031, 10921, 1212, -7254, -37135, -35676, -34, -29673, -56367, -38974, -35210, -14797, 507, -3199, -427, -605, -2982, -816, 16637, 17362, 238, 4630, 12783, 28253, 34465, 48422, 46372, 29254, -26962, -53085, -32553, -45363, -53183, -70899, -48547, -41809, -54105, -36109, -23705, -23261, -21440, 41982, 52762, 65397, 64332, 62654, 23647, -26186, -54262, -38171, -27798, -52310, -42859, -28452, -8951, -13055, -35948, -64007, -46109, -45231, -89676]
23531h9676K1777K1301R308L2104n873K467M1724l8373n3345r711o81j706K8214
23518d2470J2459k0631j2527o157l272L81K2050p361K3387K2979N203p745n343
23505a9047M648M2617P537j5650L83M949j1285l478j9603k6274L8510L800k1072
23492a3965l0881j8416k2681j8791K7293O1075N0230K0466j2583m1297k8274n293
23480c3117J438K3270m764J7462j0045k6124L006k1943P032K074K453J9656o237
23467b5839j3345M9811M4314p2241m8066R313N1148J1047R980L5884J7551k2481
23455D7076l2821j5937m3421j2724j1477K203K746K5993K1772J4185J8900J4450
23443C0945j4328j8847K3658J9044o871m6871k6909j0944k9K1254m817K966J7930
$$ y = [-89676, -67899, -46598, -37290, -5186, -11059, -8592, 33132, -5241, -58586, -68297, -68978, -70684, -42470, -30011, -50642, -63169, -69326, -72598, -72217, -50167, -57528, -34141, -11162, -5959, -13704, -19047, -14399, 28218, 35755, 20105, 20488, 25437, 14152, 10674, -8929, -35203, 3307, 7107, -13965, -44846, -63262, -85943, -104734, -77441, -16366, 33864, 54330, 41747, 450, -27824, -33117, -31679, -8409, -13173, 4289, -5756, -31880, -28874, -50817, -43785, -41711, -39258, -19602, -25839, -39184, 10627, 54941, -17300, -65366, -56053, -4905, 6142, 16122, 52006, 69557, 47076, 14255, -1682, -45103, -57827, -69304, -67101, -64355, -38362, -16590, -2405, 16495, 30945, 16617, -2230, 21428, 40472, 33601, -13270, -40179, -51123, -51152, -29898, -34715, -31749, -13819]
23430a3819j245M2609L686j7243J1101K6764j5849k7668l7263n847j2777O914
23418d0637K7123L6264k1432j0145k5660J0459O735l7441L7532J854l6196r009
23406f0553J1110P353O371L4477k7389l0352K469N7913M2431J8858k9892J6970
23394D9766j0870m0544j9009L1636k673j2225k4993O4276K1779n1879k5513K304
23382a7945r224j004l544J6003k3634r88O063K1846L8699j1094Q901J8003J50
23369D2232j436m1664k6427k996q202j1544N048N187J2048K0338O965K186j2652
23356a0917K0363R380k2590J983j5964k8500P763j6148k7360M0072J0403q06O000
23343b6321K1685K7553k2826j7750K0478J0038K707j8466J0551L3290N602l9368
$$ y = [-13819, -15064, 27545, 31231, 13988, 25089, 51853, 36004, 8336, -28927, -34774, -47551, -40637, -13514, 22750, 1318, -8827, -34487, -24028, -17293, -54734, -17202, -15348, -51544, -60553, -49443, -42090, -35719, -1242, -28631, -58983, -56514, 1399, 43830, 62688, 32796, 49766, 38896, -1648, -20657, 10979, 8306, -3919, -28912, 35364, 57143, 5264, -20249, -17945, -27169, -28173, -31717, -15714, -39348, -40336, -34273, -12427, 26272, 15178, 24079, 42082, 42232, 40796, -868, -27295, -30291, -38493, -50037, -44989, -39802, -27754, -7416, -451, 1735, -10917, 9446, 18826, -3764, -1781, -17745, -46245, -38482, -54630, -81990, -41918, -31515, -32321, -26321, -4636, 22917, 91, -17659, 2819, 12857, 15564, -2902, 7649, 40939, 46541, 7173]
23331G173N389J1228O75j8829l7484J1144p084k3011j1352L079P124R025M1127
23318a796K2312l9296k0064k8638L450J5754K8817J1115j602n896K4950R362j3384
23305E084o750K1383j5727O807J5401j319l4982j2599J4997O0034J4711j2935
23293E4105n2135l651J5762l3824j9369k2204J7407L3336K7992K625J6523r91
23281C5576M182j8251l142J4522P617j2780l2655j2949k3931j7381q916K7451
23269d0657M8852J5516L873M762k3102m9269J8470J5621O663j9044q326N1625
23257B4984Q011n4542n455q495J6172j647J2447m8076k837k378K3247j7367m9805
23244a05741M1749N6707r057r859k5412k545K6833M167l937N340M2239J3222k1909
$$ y = [7173, 12562, 23790, 24465, 5636, -31848, -20704, -27788, -50799, -62151, -59072, -51948, -42923, -1796, 20516, -18780, -38844, -67482, -64032, -48278, -19461, -8346, -9948, -15844, 9106, 18468, 5084, -1666, 19717, 3990, 10797, 26198, 24879, -10103, -22702, -7705, 52329, 67040, 54105, 1970, -1681, 14081, -19743, -39112, -61316, -43909, -10573, 17419, 20044, 36567, 35576, 39758, 21507, 18365, 32887, 40504, 27724, -4931, -17880, -41811, -59192, -68108, -40657, 8195, 23711, 27584, 32346, 9244, -40025, -21555, -5934, 729, -18315, -26641, 24984, 32995, -21547, -27002, -35497, -19325, -20972, -8525, -56601, -59438, -61816, -38569, -55936, -105741, -63992, -7285, -16342, -26201, -51613, -54158, -27325, -23158, -27095, -21755, 20484, 33706, 11797]
23231A1797k0628J0557j365k8822l7185J9987J217k5001j5248j466L4032P381
23219d4744J294p210J7562K415J7864N5753j4559Q73k8313l3591O950k414l4708
23206f2828K8027J2490j2123k3127K7626j2845p129j1699J9101L3966K541j5661
23194b1661k1563K4782N9379L0810m9825k0766O583j6203n286P896r600J0631
23182d823q291j7172Q988Q612n161k85k550k2094J6981P954j991J7214K1860j2242
23168G000l7666n48K1244L187m0304j3418K803K7590J619Q673J6443O973p43J599
23154D452P685r791M452l4120j2562L7463K6467J1021R779l0303j8327r238L396
23141i626j7668m0482J6654J9115J8233L0934M274N652j8945p864J9238L167N650
$$ y = [11797, -8831, 1726, 361, -28461, -65646, -45659, -44442, -69443, -84691, -86157, -52125, -44744, -43450, -50660, -33098, -30683, -12819, 42934, 28375, 29248, 935, -32656, -25706, -28120, -62828, -34801, -22311, -34434, -57561, -29935, -42780, -49909, -61608, -42507, -8541, -6000, -21661, -43224, -18442, 40937, 71747, 21922, 1156, 7739, -8464, -13750, -5854, -15454, -4823, -13114, -30286, -21298, -12686, -17847, -18132, -20682, -42776, -25795, -17841, -19832, -2618, 19242, 7000, -30666, -31214, -9970, -6783, -47087, -60505, -57702, -30112, -28493, -19820, -3377, 3596, 2853, 4452, 12137, 2346, 6798, -27322, -39884, -2421, 24046, 35067, 44846, 14543, -3784, -13022, -9626, -27294, -67776, -51122, -32007, -13774, 17160, 21434, 27086, 8141, 277, 19515, 22682, 28332]
23128B8332Q098l0633l571K8588M0477j0655m7599n3950K7584L2174l0273j4645
23116b6073N1816M3606l6521l3622r02J6884L3872j2248l3390L0169j860j9534
23104A2197J970j348j4152k2783J3839K817J7911r773l9411j0377J7121J8966
23092a3023M8930k7024j5515m5299K5816K3515j6763j074R176k0024m4610J4096
23080f1799L5431J9736j0755P5213P96l5839k7548l8693K4983O1382k4728J1529
23068B9708l2053K0681L7833j7760j0537m723L4025N714l1660m1088l4424J0012
23056c4272L0503K5147N534k1250k0585K8982p673K1194q566j0877J9737k4364
23044C510l1016L154J0107m903K2112R402j552j8734k0577m228o388J7570O505
$$ y = [28332, 36430, 5797, 2226, 30814, 71291, 60636, 13037, -40913, -13329, 18845, -11428, -26073, 25743, 69349, 32828, -794, -1696, 15188, 49060, 36812, 3422, 33591, 31731, 12197, 14167, 12819, -1333, -24116, -10277, -7460, 10451, 678, -38733, -49110, -31989, -13023, 35907, 8883, -6632, -51931, -26115, -2600, -19363, -20437, -11261, -31285, -75895, -61799, -26368, -6632, -17387, 57826, 58622, 22783, -4765, -43458, -18475, 42907, 18179, 29708, -2345, 18336, 56169, 38409, 27872, 23149, 57174, 62888, 31228, -9860, -44284, -34272, -3769, 21378, 26912, 5662, -14923, 14059, 6386, 27580, 19014, 8137, 27874, 3510, -27506, -24352, -14245, -19148, 2964, 12366, 10814, -7920, -28497, -32725, -39113, -21543, -15038]
23031a5038O489K481Q183k1945Q910K9189J6139q767O360J5440l0619m3544j7001
23018d3723j6032K0040J1578L587J8788K4714N161J0954L0421L588p895M333q501
23005E7013l5189l4270P748n668J8787n467k784k908R529j5631j6752k495L0874
22992B787M3979k5337l8764l7678L5644J3257J5902j6896k652l6855J3764k0674
22980e3523j6343J6232N164p785q040J6802J4401k0823k5898k64J7498k3479J5659
22967g0399P5567J7735j1622j403j474j0726k6773M245j2612L3868L2992Q123
22955C7521n826m1036j0500l8678M921J9923J5575K9724p047K6110O913Q250m0929
22942D921j4337J0965O187q500k2090l9727q663O0129L1547l6284k5574k2272
$$ y = [-15038, -8549, -6068, 2115, -19830, -10920, 18269, 34408, 25641, 32001, 47441, 16822, -26722, -43723, -59755, -39715, -28137, -24550, -5762, 18952, 24113, 35067, 65488, 69076, 61181, 65514, 57013, 21824, -12446, -4698, -10366, 8421, 2954, 170, -2738, 6791, -8840, -25592, -28087, 2787, 46766, 21429, -17335, -55013, -19369, -6112, 9790, -7106, -9758, -46613, -32849, -53523, -69866, -53634, -48470, -56255, -64295, -47493, -33092, -53915, -79813, -80077, -62579, -86058, -70399, 5168, 22903, 11281, 9878, 8404, -2322, -29095, -24850, -37462, -3594, 29398, 37521, 31695, -9341, -19841, -58519, -53598, -33675, -18100, 11624, 4577, 30687, 37600, 45850, 4921, -9416, 1549, 7736, -764, -22854, -62581, -71244, -11115, 20432, -15852, -41426, -63698]
22930f3698N0179L4481K4293j914k811J9821l2961l4154m639j6673p266J4164
22918b1178l8792k734K8794K4837K550K2691O691k7634k2012N96M024J7132O797
22905A762j4179m2460r633K1633J4853M1666O941k1471q766K2990J661j7187l364
22892e554L8301N288m2976o15J4793L1182j319q930m185O603j3830j460j2448
22879D850l2632n9468L021M3483K7972J9263K0217R155J1907j826j9889k8698
22867b645j1301j0396K1534K4863J0183r785k2701j1098K4618R894N775k6592
22855B349l3392K0339K5726l4212k0394k0644j8228k780N917L0876J956n268M0474
22842g281J7435l6394P892k564J2023j0549j2123K7623L5281J2646j7272l0250
$$ y = [-63698, -13519, 20962, 45255, 43341, 40530, 60351, 27390, -6764, -11403, -28076, -35342, -21178, -59970, -62704, -33910, -9073, -6523, 16168, 22859, -4775, -26787, -26191, -22167, -5035, 1762, -12417, -54877, -64510, -42877, -28024, 13642, 20583, -888, -9654, 13336, 14997, -2190, -5554, 32747, 38035, -4941, -5556, 9237, 40419, 39100, 30170, 25985, 32588, 18758, 17298, 4850, -27782, -87250, -84229, -40746, -12774, 6489, 26706, 35861, 47768, 45942, 26053, -2645, -13946, -24342, -2808, 22055, 32238, 22453, -248, -11346, 13272, 23166, 28941, 2349, -31043, -10704, 15022, -19190, -39584, -60228, -78456, -81236, -75319, -44443, -42487, -47755, -7281, 10154, -26240, -18348, -20912, -8889, -19438, -31561, -3938, 31343, 43989, 26717, -3533]
22830c533J0772l4451L048K723p078R829O257J2562j0527j5056j8933L3330N6105
22817D5048J5594J550k5924j7056j5616p1174l0405L7159m731L9873J1705j3373
22805b7350m801k1409L1347J8377l0351L347M958j3630J1294L2322J0639q627
22793F116L89j1446k0871K975J1601J384j2756k1262j991J3726J2719J2010m230
22780a1636K30J3594J0897K3791J5314k7106k8701j4010J8923L0113j1869j2047
22768G493J763K6649l1495p753K2282J9712m3959j0021j7519K1789p160j210M94
22755a8935M5172J8660m1695j9217J6987L782K5309J7705P052J0977N147J6440
22743H7384l0583o972J0030k7022k6962k7439M459J7850l2038k875J7244L2697
$$ y = [-3533, 7239, -27212, -24164, -21441, -28519, -18690, -12433, 129, -10398, -25454, -44387, -11057, 45048, 60642, 62192, 36268, 19212, 3596, -67578, -97983, -60824, -65555, -25682, -13977, -27350, -32151, -53560, -22213, -3836, -34187, -30840, -25882, -39512, -28218, 4104, 14743, 6116, 6505, -4941, -25812, -22837, -11236, -9852, -22608, -43870, -45861, -32135, -19416, -7406, -11636, -11406, 2188, 13085, 36876, 52190, 25084, -3617, -17627, 1296, 31409, 19540, 7493, 9256, 35905, 4410, -3343, 18939, 38651, -5308, -15329, -32848, -11059, -18219, -19429, -18935, 26237, 44897, 3202, -16015, 972, 4754, 30063, 47768, 54820, 65797, 70944, 87384, 56801, 49829, 59859, 32837, 5875, -21564, -17105, 745, -31293, -34168, -16924, 15773]
22731A5773j606L1646k9451j3615K402j1408O029k1505M725l036n1622J7942K6585
22718b7141J6532J860J0189j6508k1540j1616k1000K8689J4909K8860k1328k505
22706b0599p711L8469K2746j3875n607K4081j9362R667k9547m5313L3476J9342
22694E767k6831l835k0049m786N2356k387n5248k5699K6899P767J1353K5495j3479
22681b2677J4862j0635J3621r535l3405j3514L4865N0684p299l6111j5203Q028
22669b6319J9474m701J057J6763J5173L172n391j1971j315k711J3107L1584J657
22656D9579j6386k042k041k5945k3695k6257j8194K8703J7737k1376l9005J9831
22644e9091P406o152M2245J3775k5041R271K5244j016J5767l211N066M402J7043
$$ y = [15773, 14167, 45813, 16362, 2747, 5149, -6259, -230, -21735, -17010, -20046, -71668, -53726, -27141, -10609, -8749, 1440, -15068, -36608, -48224, -69224, -40535, -25626, 3234, -18094, -20599, -28310, 10159, 32905, 19030, 13423, 37504, 18142, 27809, -1738, -47051, -13575, 5767, -21064, -24899, -44948, -49734, 2622, 235, -55013, -80712, -53813, -46046, -34693, -9198, -22677, -7815, -18450, -4829, -14364, -47769, -61283, -26418, 24266, 16967, -19144, -34347, -26319, -6845, -11546, -10489, 6274, 21447, 24619, 19228, 7257, 5942, 3231, 16338, 47922, 49579, 33193, 31151, 29110, 3165, -20530, -46787, -64981, -36278, -18541, -39917, -78922, -59091, -51685, -57837, -15592, -1817, -26858, -17587, 7657, 6641, 22408, 19197, 24263, 28665, 45708]
22631D5708p160j1469L5885j1242n3323j4412J1040O342j9671n081M3047N3711
22619G3375l7837l768K0436m940l5788q389m1290k6449L4994M942k1378j9289
22607f5381k2206L3936N0036k0982J619j5486m143Q621j6387K2792N781J1733
22595a0067K5219J0848m4882j657M5558M0071n0863n4748M288k3224l5823L3669
22583f1611L0825k716J4709K5708K5965Q442j0240l0615L320j0036m642j9701
22571c0592m1780K1348J414K2588L709J5831K9002R385l0587R8K3513l1774m1079
22558d8924O73M9343J3965p391J025K1068O470l3463J3908O7746j5779m4165n0738
22545b6262j7531j002j1475O249m272K8506N4202n892r72j5987O457l266L5349
$$ y = [45708, 38548, 27079, 62964, 51722, -1601, -16013, -4973, 1369, -18302, -23383, 19664, 73375, 35538, 31770, 52206, 47266, 11478, 3089, -38201, -64650, -29656, -24714, -46092, -65381, -87587, -53651, -3615, -24597, -22978, -38464, -42607, -33986, -50373, -27581, -21800, -10067, 15152, 26000, -18882, -20539, 25019, 65090, 14227, -40521, -36233, -59457, -95280, -61611, -30786, -33502, -18793, 6915, 32880, 41322, 31082, 467, 3787, -6249, -10891, -30592, -72372, -51024, -49610, -27022, -23313, -7482, 21520, 30905, 318, 416, 23929, -7845, -48924, -48251, 1092, 15057, 7666, 8691, 29759, 36229, 2766, 16674, 84420, 68641, 24476, -26262, -43793, -44795, -56270, -50021, -54293, -25787, 28415, 22523, 21551, 5564, 12021, 8755, 44104]
22532D4104k3246p0124q696K3821M0857p34k1511R751k4495q040j9156P424P490
22519d2555M877k381J8037L5904K1342k5289O454J0777l014k1687j0501L2645
22507B4609j9868L073J6129O741N967j6948M0281L9308l6510j5597p624m2952
22495c391k2739J6032k5000l2448J3804j3414K3887M8423K1946q226o1564L649
22483c9041O764L0379Q246q535R091j8210n184J182r761N635Q334k816k3722m1502
22469g9140j4450L2551M1363k156j3550k029K1016N0623J8310K299j8934l3429
22457B474j3133j0916j0557J003K1860j7861l4490J7523R917J1662L1686l818
22445E350N542K5884k5887k1814k9138J5153N069j6808K7207K8088n0226r856
$$ y = [44104, 20858, -49266, -57962, -34141, 6716, 5982, -15529, -5778, -30273, -38313, -57469, -50045, -42555, -37678, -40059, -22022, 13882, 35224, 9935, 16389, 27166, 24152, 2465, -8036, 24609, 4741, 7814, 23943, 30684, 36651, 19703, 59984, 99292, 62782, 47185, 39561, -3391, -26130, -10098, -35098, -67546, -53742, -67156, -43269, 5154, 27100, 18874, -42690, -39041, -32277, -1898, 6348, -2187, 6904, -11306, -16490, -15308, -25069, -19434, -11100, -13916, -37638, -79140, -93590, -61039, -19676, -21832, -35382, -37411, -16395, 34228, 52538, 54837, 35903, 2474, -10659, -21575, -32132, -31129, -9269, -27130, -61620, -44097, -34180, -22518, 9168, 5350, 10892, 36776, 10889, -10925, -40063, -24910, -19841, -36649, -9442, 18646, -31580, -41436]
22433d1436J7284l2624l5780J3962J2543M1639M4606M214J082j2281j4884n295
22421f970j4679j7171P33J4299n604l78M2721J3673j4445L4664K5081l567O831
22408G5188J0090j7846m1267m0809l4006J2068j173J3630J0033l1131J5340L4163
22396D280p325K9417J3426j7644j2690j8808m0746j1106K0948K0185Q186l76K3730
22383A1477L0329J9940J0431l5159R575p144n827R889k1635l6833J1895L9259
22371C6197J9699k592m205m4269j6144K3349k3825k0663J1964L6365L855k2257
22359b526o276j1391m859L400L8606L0830n48L601j8726j3234k145k7774J0743
22346b99k5659m022Q030J7837J8674k6546k4379j1136J5364k783K4807k4569k6865
$$ y = [-41436, -24152, -56776, -92556, -78594, -66051, -24412, 20194, 24408, 25490, 13209, -1675, -6970, -21649, -38820, -38087, -23788, -29392, -29770, 12951, 26624, 12179, 46843, 71924, 68357, 75188, 85278, 67432, 26165, -14644, -48650, -36582, -37755, -24125, -14092, -45223, -29883, 4280, -3045, 26372, 39798, 22154, 9464, -9344, -50090, -61196, -40248, -20063, -11877, -12253, 11477, 41806, 61746, 72177, 37018, 46593, 39449, 33622, 43511, 21876, -14957, -3062, 36197, 55896, 53304, 49099, 4830, -11314, 12035, -11790, -32453, -20489, 15876, 19731, -2526, -8802, -20193, -25052, -21652, 16954, 47784, 47236, 50837, 32111, 18877, 16732, -11042, -299, -25958, -29980, -21950, -4113, 14561, -11985, -36364, -47500, -32136, -34919, -10112, -34681, -61546]
22333f1546Q85K5971J9701p968M933R225J9465J3273J1031q151j1788J1793m935
22320B1889J78J0725N782k0943j0416k3225J7059p767j3308l173O720J6858j8669
22307a8290J9422J2160J7140J0552l5450p499K8483K9269m9768m5327l2850m063
22295g6221K4776R068j0802L1957m354n7425P581J6917J608p671j1146K2987k274
22282e4999r410M042J4482k483p507J1091K982L9311j1444n0330J3085L2605L3888
22269A5313K3879K3848k0990j8409J0604k538j8967j2622k3393q747n721P191
22257c0552L0225j980j0925k5109k2488L0158k4949j7390M3558l9045K0167L1282
22245a7048j2298K0406K4346O149j1705J8907K0763k2700l3496M068O108m8258
$$ y = [-61546, -60661, -34690, -14989, -22957, -18024, -8799, 10666, 23939, 34970, 26819, 15031, 26824, 21889, 22067, 32792, 38574, 17631, 7215, -16010, 1049, -6718, -20026, -23199, -16479, 379, -18290, 1132, 13292, 30432, 40984, 5534, -1965, 26518, 55787, 6019, -39308, -72158, -76221, -51445, -42377, -53179, -21222, -25576, -83001, -75420, -58503, -56895, -64566, -75712, -52725, -54999, -64409, -60367, -45885, -48368, -55875, -44784, -41802, -2491, -13935, -64265, -51180, -18575, 15313, 39192, 63040, 42050, 23641, 34245, 31707, 12740, 118, -23275, -32022, -37743, -30552, -327, -2307, -13232, -38341, -60829, -30671, -55620, -73010, -29452, -68497, -48330, -17048, -29346, -8940, 15406, 21555, 9850, 28757, 49520, 26820, -6676, -2608, 3500, -44758]
22233d4758k556M6670J5845L3848J7316k6962J2608k3947o7479n7322k0757K7668
22221h9826N1042K067K2029J94L486K3363k2685O972j1354o103K5574K2880k5025
22208B614m5867o731O11L5801J2806j6755k8704k0030L0191n699K3876K216k0426
22195c6097m5934j7371M0875L3829J59K0910N3315l395l3957j2323J8448j1990
22183F469J119N716p648l2778J0019K6277j6870j7902J6099R36M677m370O4J2004
22169C812J9993J7322M755K4802j0133k9962j8522k400K4802l3635K3383J6548
22157D0765j0572J1757J1774n820n595L2776J0061m9488m1684k9531N694r820
22145c9683J382J777m798R193M5713k7923j3814j636q013N755J5669M1054O547
$$ y = [-44758, -47314, -644, 15201, 49049, 66365, 39403, 52011, 28064, -39415, -96737, -117494, -89826, -38784, -36717, -14688, -14494, -11008, 12355, -10330, -3358, -14712, -20815, 4759, 27639, 2614, -43253, -49984, -49373, -13572, -766, -17521, -46225, -66255, -36064, -41763, -17887, -15671, -36097, -82031, -99402, -58527, -24698, -24539, -3629, 49686, 46291, 12334, 11, 18459, 6469, 7588, 13304, 5656, -27122, -17103, 9174, -7696, -25598, -9499, -8563, -3886, -8256, -8192, 3812, 23805, 41127, 45882, 70684, 60551, 30589, 12067, 9667, 34469, 834, 24217, 40765, 30193, 41950, 53724, 47904, 42309, 75085, 85146, 35658, -6026, -35557, -29863, -39683, -38301, -36524, -41322, -32129, 13584, -14339, -28153, -29789, -37802, -32047, -16378, 24676, 31223]
22132C1223K5918l0567m7358j375L2963j4576n205J8844k6914m109k6068k7682
22120g4906J0362P1852M3943K4337l1785n8582k2184N0233N1207j2241k3057n357
22108B3822l1674L683L2725M4367O380j9924J2705o621k2203k4828L735r212l049
22095I906k444J5111P403k8790k6773m592K2518K1659j9798k1084J8998K1771
22083A3885Q612P414k7203j4240k6718K2665K545m764Q668n006k6002j6209k04
22070e6557K1668P075J5016J560M238J0473o6L4887L1191k2164k2087m4955k1465
22057d1186J6996K4525M1279P925k2117j1016Q540j251K0743J2235J2167l0341
22045C8499l4462l1580k7581j0991P335M6353L9940j7900j9463J2388P287n4975
$$ y = [31223, 57141, 26574, -20784, -22159, 10804, -3772, -8977, 9867, -17047, -21156, -47224, -74906, -64544, 7308, 51251, 75588, 43803, -14779, -36963, 13270, 64477, 52236, 29179, 23822, -7852, -4169, 28556, 72923, 79303, 59379, 72084, 65463, 43260, 18432, 22167, 12955, 9906, 7462, 22573, 29976, 1186, -25587, -30179, -7661, 13998, -5800, -26884, -7886, 13885, 22497, 29911, 2708, -11532, -38250, -15585, -13040, -17804, -9136, -14142, -40144, -56353, -56557, -34889, -27814, -12798, -11238, -7000, 3473, 3407, 38294, 69485, 47321, 25234, -19721, -41186, -24190, 335, 41614, 49539, 27422, 16406, 24946, 23695, 44438, 56673, 68840, 38499, 4037, -27543, -55124, -66115, -58780, -12427, 27513, 9613, -9850, 2538, 9825, -45150]
22033d5150r800N866M363J7211J7855j3886K2138N334j9884J6328J3013k6046
22021a2658K0103J1545j0907p954k3073J6026P886k8904Q930Q0157Q018n0757
22009A8412j1385m438R21J1685j4777J495j6913q279J8248m231j0739j1695J8285
21996a3411O024L7114M743J1526n2767n503J4397J4830j8049L983k2087o190K118
21983b3272n8848O964M8308Q168J3602J2274Q833j1462J4432j4237J4959K4822
21971D4543m3132l3934M296L3882n517l602L1987M705K664j9281L659R384K7696
21958E7350R584J0836j5595m7027l5691k9398j883K1377M1139k1700K6966J4281
21946C0239k2077L1542j587j2639j8922k0442O112L2455J3188k0473m1266k1592
$$ y = [-45150, -54950, -49084, -44721, -27510, -9655, -23541, -1403, 3931, -15953, 375, 13388, -12658, 7445, 18990, 8083, 129, -22944, -6918, 968, -27936, -19006, 61151, 69169, 18412, 7027, 2589, 3510, 15195, 418, 1913, -15000, -23279, -5031, -9262, -20001, -31696, -13411, -7387, 29727, 34470, 45996, -6771, -12274, 2123, 16953, -1096, 2887, -19200, -25390, -23272, -82120, -75156, -26848, -18680, -5078, 7196, 16029, 4567, 18999, 4762, 19721, 44543, 1411, -32523, -28227, 5655, 138, -3464, 28523, 33228, 35892, 16611, 20270, 29654, 57350, 66934, 77770, 62175, 15148, -20543, -49941, -51824, -30447, 10692, -11008, 15958, 30239, 8162, 39704, 38117, 25478, 6556, -13886, -7774, 24681, 37869, 17396, -23870, -45462]
21934d5462L4702J4629k9367l026J6918K7717r238N4286J3214m0033N67j9728
21922A5179j2498l0411j1928K0525q112m090J1954J8636J9960l4351j6195j776
21910c3107R954p711J2408N3599R457k6288p1167m2794J9363R306J2439J2954
21898d1587p421j6977J952J8820N560O1018L8821q148k9122k1031l4522J3170
21886a9467J5614Q532m8017k3078N783M922O140L3688j3865J812K1838r847J5730
21873b15K2711L0116n159m2357m597k140N893j3476l535k8720j677O772O046L4795
21859D457m384j1150L5001J18j9349L4040J7684l7864l0759l4602j5525L2452
21847b9881M1820K2934m387k3679J8183J7089l2189k8335k9407M6587M8512K2789
$$ y = [-45462, -10760, 3869, -25498, -28524, -11606, 16111, 6873, 61159, 74373, 34340, 34907, 15179, 2681, -27730, -39658, -19133, -27245, -31335, -19381, -745, 19215, -15136, -31331, -33107, -23153, -30864, -18456, 35143, 44600, 18312, -52855, -95649, -76286, -66980, -54541, -41587, -49008, -65985, -64033, -45213, -39653, 21365, 60186, 52038, 22916, 1885, -32637, -19467, -3853, 4679, -43338, -66416, -60633, -55711, -49571, -15883, -29748, -27936, -6098, -15945, -215, 22496, 52612, 47453, 5096, 499, -1641, 4252, -9224, -12759, -41479, -43156, -36384, -30338, 4457, 73, -11077, 23924, 24042, 4693, 38733, 56417, 18553, -12206, -46808, -62333, -29881, 11939, 34873, 30486, 6807, 24990, 42079, 9890, -18445, -47852, -1265, 47247, 70036]
21835G0036r802k075M14l3608k4212k3458j753p212N21M5473J1486J7187l9013
21822C984l3968K2470K6132j9127j641R328k4057l6261J8362K4630J0248K6544
21810B6644R051j2147J2134J5553l0950p978j2344k4250K8070J7120j0035k5038
21798a4170L741k3174q522Q082M4607J1111J6837j5884m9549R632K7064R282j4998
21785D059k0111M757N871J1301J667k3693K0134K183N386J6290m4474m443K3699
21772B626Q65k7277K7603M0054Q464l8503J2762J6999n1194r636K6835p25r551
21759f78k7707J3713j1655L1896J2234J4080j4366K4073k7426j7589L9599K8844
21747F5018m5942j7587q673K1775k338N25l155J3320o252k4864J9292L890m9440
$$ y = [70036, 60234, 58159, 58573, 24965, 753, -22705, -24458, -31670, -31149, 14324, 25810, 42997, 3984, -29984, -7514, 18618, -509, -2150, 7178, -16879, -53140, -34778, -10148, 100, 26644, 35695, 23548, 35682, 51235, 20285, 12307, -37, -24287, 3783, 20903, 10868, -14170, -10429, -33603, -42125, -34043, 10564, 21675, 38512, 22628, -26921, -17289, 9775, 19057, 4059, -16052, -11295, -5424, 5877, 7544, -16149, 3985, 6168, 11554, 27844, -16630, -21073, 2626, 3491, -23786, 3817, 43871, 52335, 13832, 26594, 43593, -7601, -17237, 9598, 8873, -678, -28385, -14672, -26327, 5569, 17803, 31883, 17517, 41590, 14164, -3425, 36174, 65018, 19076, 1489, -7184, 14591, 12253, 12778, 9623, 22943, 16691, -8173, 11119, 15009, -34431]
21734c4431m2544r070K5128N4221J4246l405n905o168j7052m009M1234J8622O211
21721C7078k5833k996L3847J7435n746k2707l9386l0949k0115J0008K9341J6148
21709c875j6487Q846P319j5664j8768J1276m70J0852j7441N0812R080q420k7442
21696a0382j4502M918J0269j2222K4093K4758L22j7434J5907k920O131K824l9262
21683g500j1248N2862N053L728m2176k8593Q879L848K4545L0954k8692p637k2802
21670a8779j055O4276q38j9851J5884j8827P088J4692L0901j7577m4986k2984
21658a2056Q662K6925j9693q445j0492j6163k374K8315J5596K72L6637k7690m9984
21645c0490J7718K0364k7658O98n810J402J5820j715l675K544R136L2589K0452
$$ y = [-34431, -76975, -86045, -60917, -6696, 7550, 4145, -1760, -7928, -24980, -28989, 12245, 30867, 37078, 11245, 8249, 42096, 59531, 53785, 31078, -8308, -39257, -59372, -49364, -20023, -3875, -20362, -11516, -4197, -19861, -38629, -27353, -27823, -16971, -34412, 16400, 25480, 17060, -10382, -24884, -19966, -9697, -21919, 2174, 26932, 27254, 9820, 25727, 22807, 28938, 31762, -7500, -18748, 34114, 39167, 42895, 719, -27874, -18995, -15147, 9398, 40352, 11660, 4023, -18779, -19834, 44442, 43604, 23753, 39637, 20810, 27898, 42590, 73491, 55914, 10928, -12056, -3394, 23531, 3838, -4607, -15099, -31262, -33636, -5321, 10275, 10547, 47184, 19494, -30490, -12772, 7592, -20066, -19368, -25178, -23776, -7956, -9671, -13346, -10802, -1666, 30923, 51375]
21632E1375n947k4819K9093l3496k8260q304J3462l383l669J3787J1217R790n3194
21619c2348k9555j6177O328N0642K4277J2503j7882k6661K2309N7017k999k039
21607D5415j1774p830p111K4639j7776k8814J1547p472k9324P700P357M421J1892
21594B870l4409q272M0376l618k5382Q40N3615J9965J2550k7943j0794n1755j4474
21581d6431N005Q499K110J423L5421L1844m3999j7494K9368k7702m908J9909k4938
21568c1893N0973K0735k2326J7093r255R137J4567K8562j4751l5456l6774k9674
21556c9062m613M721j9035K8917L229L0226j5837K6758O6344j5743j0650J2277
21544F7532J8094k6515k0983j0405p884k871R470q522j4627m2415j016M1731L9793
$$ y = [51375, 45428, 20609, 49702, 16206, -12054, -20358, -6896, -10279, -13948, -161, 11056, 20846, -32348, -61903, -78080, -71752, -21110, 3167, 15670, -2212, -28873, -6564, 50453, 47454, 45415, 33641, 25811, 18700, 43339, 25563, -3251, 8296, 824, -28500, -20800, -13443, -9022, 2870, -31539, -39811, 565, -3053, -28435, -27595, 26020, 45985, 58535, 30592, 19798, -31957, -46431, -41426, -32927, -30817, -29394, 6027, 37871, -6128, -23622, 5746, -21956, -26864, -6955, -31893, 19080, 39815, 17489, 34582, 25327, 34464, 49031, 77593, 62842, 27386, -9388, -39062, -43675, -38954, -57989, -29072, -25843, 4383, -11454, 15304, 81648, 65905, 55255, 67532, 85626, 59111, 38128, 27723, 19839, 16968, 26438, 17916, 3289, -39126, -40142, 1589, 41382]
21531D1382J9340j5918j3142j3873n9j6385K3377J7989K8884j4426j8190n1734
21519a2755k6169M7840k352j5537q488k4041Q3P010M4076k0858l962N6854J8328
21506F0029k7964k0071l0359N336J9296k1380j1438J907P1536p86l0563k1640
21494f097k0522K9778j2667j5120N195l165p091N743N05Q639J8018M8633m8164
21481C685n855j8497N949j620k3947N101J6397L1537L4646K709r792R880l0427
21468A9766k5393K776r319j8254J1429J8598J4770j0849L1699R599l3431k4114
21456a2723n263J0673r750L2791J4135j8553j9636l9636Q01J9784K3346P300j4457
21443a1188M4168L4912m0537l7259K6608L6435l5742k5999j2734L3815M1172j416
$$ y = [41382, 60722, 44804, 31662, 17789, 17730, 1345, 24722, 42711, 71595, 57169, 38979, -12755, -38924, 8916, 6564, -8973, -17461, -41502, -41419, -34409, 9667, -11191, -15153, 41701, 60029, 32065, 11994, -18365, -13029, 6267, -15113, -26551, -24644, 46892, 46106, 15543, -6097, -26619, 3159, -9508, -24628, -19433, -22598, -29689, -23946, -23441, -14802, 3216, 51849, 3685, -2170, -20667, -14718, -16338, -40285, -35184, -18787, 12750, 47396, 50105, 40313, 50193, 19766, -5627, -2851, -12170, -30424, -18995, -397, 14373, 3524, 35223, 44822, 11391, -12723, -17986, -7313, -17063, 15728, 29863, 11310, -8326, -47962, -47161, -27377, -4031, 3269, -11188, 32980, 67892, 27355, -9904, 16704, 53139, 17397, -8602, -21336, 12479, 53651, 52235]
21431E2235L844j073M559m2430l7531M443J649J4590L103M5223K6328m9265l2828
21418g153j2442l6620K3175J5622J3486j503j8602J432k6722o998L7257q79J5783
21405d164N2410l4056k8778k6367J6316J8840J453L7845N3633l279l3185o688
21393D3980j0206l5150k3870j8209k1590J9498N7224J5266K8384q8m6404l7657
21381b8822j5434q45P162j8783l1686J3778l788L6087K270j5407n347M9558L0167
21368A8910n24J3907J1548l047J828j9266M0583J1150k0126p1570l4317J365p9
21355d9638L4556L0168Q502j5342k244q145J2770j5690k4923j0173J2696m4165
21343g1628p590L4282K1176j186K5202j3871k8777K0650K0072J5253l3542j8475
$$ y = [52235, 56079, 55006, 59565, 17135, -20396, -15953, -14304, 286, 3389, 48612, 74940, 25675, -7153, -19595, -56215, -33040, -17418, -3932, -5435, -24037, -22605, -49327, -56325, -19068, -19947, -4164, 48246, 14190, -14588, -40955, -24639, -5799, -4346, 33499, 87132, 83853, 50668, 43980, 33774, -1376, -25246, -43455, -65045, -45547, 11677, 26943, 55327, 55239, 8835, -28822, -44256, -45101, -37939, -56722, -88408, -74630, -78418, -42331, -40061, -55468, -60815, -11257, 18910, 18386, 32293, 43841, 40794, 42622, 23356, 63939, 75089, 54963, -16607, -50924, -49559, -49638, -15082, 15086, 23588, 8246, 6002, -2143, 10627, -5063, -29986, -40159, -27463, -71628, -79218, -44936, -23760, -24946, 256, -13615, -42392, -21742, -1670, 13583, -19959, -38434]
21331c8434K3420k1514J3955L1791q818Q636j0165K0790l5062j1547K0124m0947
21319d7771p085M2251K7841J784j5782j9106j0943J1368K2410K3463J6043j955
21307D2518R723l0626l6375K4019k4427R686J7389j5648m9542j0735k608L218
21295f3408L496o253K0006J7090K8684J7817p474J8489J8950p409K8474k8493
21283C9969k8622j5975N021K8442q488k338j631K2144L4845j5655n3858L6375
21271D0229K0082k3852j7862k9285J9547J8031J2685l3596j7095P249p159J7649
21259F623J2460j2163k323K1500J6414o674n1257k5462q845R582M349j8109q532
21246f2437K3527j2203l2022q090l6422N25K5544L6857R708J800J1598j790r090
$$ y = [-38434, -15014, -36528, -22573, 9218, 400, 9036, -1129, 19661, -15401, -26948, -6824, -47771, -54856, -12605, 15236, 17020, 1238, -17868, -28811, -17443, 4967, 28430, 44473, 42518, 52241, 21615, -14760, 9259, -15168, -5482, 11907, -3741, -53283, -64018, -66626, -63408, -59912, -66165, -46159, -29069, -385, 17432, 9958, 28447, 47397, 39988, 68462, 39969, 11347, -4628, 393, 28835, 20347, 18009, 16378, 38522, 73367, 57712, 3854, 40229, 60311, 36459, 18597, -10688, 8859, 26890, 39575, 5979, -11116, -3867, -11026, 6623, 19083, 6920, 4597, 26097, 42511, 35837, -15420, -40882, -49727, -40145, -35796, -53905, -62437, -38910, -51113, -83135, -91225, -127647, -127122, -101578, -64721, -55013, -53213, -41615, -43405, -52495]
21233e2495j7523L5687L1181j8339J4098J3963Q98o8536l1010M3887L4582K8531
21221A4924p505m0420J4703L0679R653L653r15m997j7106j8532l2804j9311q968
21208g6946K6219J0163L819j8912L9274k615k8453P583O971l6458j855M399N5280
21195a1531L4002N557L81K2767J4820l0906l6732K1642M724j3909j9990j4347
21183b3522J700q54K1921K6041J5210k4040o2479K7424J3475J745J2758k3635
21171a4256J7783K0072L2985m989o6120k1341l7457m035L9016k9849l1515M9260
21159e0446N2022M905j1641J1849j0874J3884M610J9793R640j2117l0785l9840
21147c9000k8716j3757K0742L0736P608M872O112J9408j225j8916j2371K8938
$$ y = [-52495, -70018, -34331, -3150, -21489, -7391, 6572, 7470, -61066, -92076, -48189, -13607, 14924, 7419, -33001, -18298, 12381, 22034, 25687, 24772, 19775, 2669, -15863, -48667, -67978, -76946, -50727, -40564, -36745, -55657, -16383, -18998, -47451, -39868, -32897, -69355, -71210, -66811, -11531, 22471, 28028, 28409, 51176, 65996, 35090, -1642, 20000, 24724, 10815, -9175, -23522, -21822, -22676, -755, 25286, 40496, 16456, -46023, -18599, -5124, -3379, 9379, -14256, 3527, 23599, 56584, 51595, -14525, -35866, -73323, -77358, -38342, -68191, -99706, -50446, 1576, 6481, -5160, 6689, -4185, 9699, 14309, 34102, 43742, 31625, 840, -39000, -67716, -81473, -60731, -29995, -22387, -17515, -11403, 8005, 6780, -12136, -24507, 4431]
21135D431O105j3652l840j8506L2471N072l5732J060L509k4031l3957Q866M7729
21122b0475J7482j9435k677N6113n609j5481l0829p140j2435J1833K4228L275
21110a150J618L134J7878K411j3695m4990l0596K2469k046j102J0077o277j3262
21097e5531j4300M4630M3792j2610j4669J0909P498j9817K6131M978n922q739
21085F350k0635J5410L5Q352j066J6598K0616K3536k0803n3357M242J9712k2553
21072c563k3112j9160k0063m146K4117M4501m789J4659K9766j6257M0641J8051
21060H0645j2139N626L0562n7723n0315n242n520J2088k9754j3641J6266L8106
21048H959J5285p92m0481r689k0104N42K1379J9547k357N781J4623J360n690L7788
$$ y = [4431, 10536, -3116, -6956, -25462, 7009, 12081, -23651, -22591, -19082, -43113, -77070, -68204, -20475, -2993, -22428, -25105, 31008, 25399, 9918, -20911, -28051, -40486, -28653, -4425, -1150, 468, 3602, 21480, 23891, 10196, -34794, -65390, -42921, -44967, -46069, -35992, -42269, -55531, -69831, -25201, 18591, 5981, -8688, 2221, 9719, -10098, 16033, 21011, 15089, 6350, -14285, 1125, 1160, 9512, 8446, 25044, 45660, 69196, 48393, -4964, -722, 18990, -3563, -26675, -45835, -65898, -70044, -45927, -1426, -6215, 8444, 38210, 21953, 62594, 80645, 68506, 74132, 104694, 46971, -3344, -8586, -14106, -2018, -31772, -45413, -29147, 8959, 24244, 23452, -17029, -26718, -46822, -46280, -24901, -5354, -7711, -1930, 12693, 14053, 8363, 46151]
21034D6151O6779k832k9653l581p190j7473n134J3653j9734j4543L714r551l9411
21021a8805k638L0036K2303j7326j5630M3796K7670j4068k3297J8731k8921k2380
21009e29j4044k8190j8851K0619K7128K9484k4447l6387J8002M312k7448j1511
20997f1862J5273L6285K0439J2638m339m4772J2957j0075N431q89J8561K6698
20985B6345L973l5317m1629K922O4154O498j2820K0561j190k6314m408k027j5112
20972a4364k8926L4426J3662J5985L9566k3739l3560m5252O011O3286n699M47
20960B1843k0141j9865l0678J0209j581j343k896J5658L7741J7824o002j9907
20948H62j2423k0619k8344L8110K1303L3558j089m4058j7990M9271J8907j0074
$$ y = [46151, 112930, 110098, 80445, 76864, 69674, 52201, 47067, 60720, 40986, 26443, 30157, 20606, -18805, -21443, 8593, 30896, 13570, -2060, 41736, 69406, 55338, 32041, 50772, 21851, -529, -14573, -42763, -61614, -40995, -13867, 15617, -8830, -45217, -27215, -22903, -50351, -61862, -46589, -10304, 10135, 22773, 18434, -26338, -13381, -23456, -18025, -18914, -353, 26345, 30318, -4999, -46628, -43706, 20448, 26946, 14126, 34687, 33497, 7183, 2775, 748, -14364, -43290, -8864, 4798, 20783, 60349, 36610, 3050, -42202, -36191, 27095, 21396, 21843, 1702, -18163, -48841, -38632, -40213, -41556, -44452, -28794, 8947, 26771, 20769, 862, -11561, -32180, -60524, -22414, -1111, 32447, 31358, -12700, -30690, 18581, 37488, 27414]
20936B7414k3177J1879N526j2277j3477L2733M0907R343j6029O2m3280J853m551
20923A6926j4256j4721r534J6491J7439K1776l1137k1755J0816j067n459J3744
20911g37M457O435J6524K1806R937k1574k8021J1459R931j6972j253p77J0286
20898B1501q26R613l408l1606k2947Q216J6438p623m399j4152N598J9000J3165
20885H570J6160m393M434k5920p199M0766L6524J649l3455q217j9215j1842K3349
20872B1211J0116j3055o455j6318n892l951J3173Q572J4409l340p184j595J2962
20859B2653N2328N829j9124k1173k6438l8888N917N5553k0955Q155L8101L976
20847F5934l0260j0275k4471Q630j0959j5680L4839J3391K5746J5l6282m2760
$$ y = [27414, 4237, 16116, 21642, 9365, -4112, 28621, 69528, 78871, 62842, 62904, 19624, 21477, 16926, 2670, -12051, -21585, -5094, 12345, 34121, 2984, -18771, -7955, -9022, -14481, -737, 3720, 10155, 26679, 48485, 58422, 36848, 8827, 20286, 30217, 13245, 11992, 11215, 21501, 20675, 30288, 26880, -4726, -27673, -19457, -3019, -10642, -15041, -29193, -23595, -4595, 8570, 24730, 20337, 24771, -1149, -8348, 32418, 68942, 70591, 37136, 28919, 9704, -2138, 21211, 31327, 18272, 11817, -4501, -10393, -14344, -1171, 7401, 21810, 18470, 11286, 9691, 22653, 74981, 80810, 61686, 40513, 14075, -24813, -18896, 36657, 15702, 23857, 61958, 65934, 35674, 25399, 928, 9558, -1401, -17081, 17758, 31149, 56895, 56910, 20628, -22132]
20835b2132J8982p988Q627K0517K9380K0987O841n81L4224q288l3405k9220m785
20822C3159K0069P964l9227r683q456j0944O009J2042j2884l9041k2560n035N2066
20809a6521J1248J933J2514K0450k059l0224j2405K8164O653j4844k1763J4283
20797b571J5823k929K267N941j2080j3228o357j3491k4270K7827N2748J2328J5718
20784E7726o776n3882m1331j8373R372K9237K0626Q475j5360j6070m25L15O953
20771a9513K4642K9131L3742l3689Q420K7251M006j9906m3361L2239p31Q141p242
20758D3130k781K997j5150K0567k8892K748P34q352J054L3668P168J0360n2922
20745A4329k8621J3425P202j5076K286j1256N455l151K3639J5663K6668j2859
$$ y = [-22132, -3150, -11138, -2511, 18006, 47386, 68373, 75214, 74633, 108857, 100569, 67164, 37944, 33159, 53228, 61192, 21965, 12282, 3826, -7118, -1109, 10933, -1951, -40992, -63552, -68587, -16521, -5273, -3340, 9174, 29624, 27565, -2659, -15064, 13100, 19753, 4909, -16854, -2571, 13252, 10323, 12590, 18531, 6451, -6777, -13134, -26625, -50895, -23068, 29680, 42008, 57726, 50950, -2932, -44263, -62636, -53264, -24027, -3401, 5074, -10286, -26356, -26781, -26466, -19513, 5129, 34260, 68002, 34313, 42733, 69984, 73990, 54084, 10723, 42962, 42231, 50372, 43130, 40349, 43346, 28196, 48763, 19871, 22619, 23353, 15001, 16055, 49723, 56891, 67251, 14329, -14292, -867, 6335, -8741, -6455, -17711, -12256, -15407, 8232, 23895, 50563, 37704]
20733C7704K3j3835l4372P949k3770K7448l907J9855N741k7907j6649K0461M2824
20720D1565M352J7878l3326r380m689J1373p885j8372K6351Q117n72j0562m258
20707B0592O92l2655J6914K5900M716J2236j3376n936J7595j8441K247k0267J0672
20694B0889k576k7258r453J8535J0485O77N33p679R251J1678j3930M825K2976
20681C8953J9186o444r225O97j0779k6221o685K6204K5022j7151m0241j4047J7765
20668b966j8051R836j564o903k883J683J8718J3961k2194l4K9166j3379m7943
20655d2553N464J0243N94O412K1608Q129J634j253J5828L6778L317k6013K0361
20642F0549K6688Q110p634k912k0542k6687J9254k1482R015N0769l3875J6212
$$ y = [37704, 37727, 23892, -10480, -2531, -26301, 1147, -2760, 17095, 22836, -5071, -21720, -1259, 41565, 45917, 63795, 30469, 21089, 16400, 27773, 19888, 1516, 27867, 35984, 35412, 24850, 20592, 21284, -11371, 5543, 31443, 36159, 48395, 35019, 29083, 46678, 28237, 30484, 10217, 20889, 18313, -8945, -18398, 137, 10622, 11299, 11832, 4153, 13404, 25082, 11152, 15977, 38953, 58139, 51695, 42470, 43167, 32388, 6167, -518, 25686, 50708, 33557, -6684, -20731, -2966, -21017, -11181, -12745, -19648, -22531, -20848, -2130, 11831, -10363, -10397, 18769, 5390, -42553, -37089, -26846, -26252, -19840, 1768, 9897, 11531, 10278, 26106, 62884, 66201, 40188, 60549, 87237, 95347, 87713, 84801, 64259, 37572, 56826, 35344, 44359, 95128, 61253, 77465]
20630G7465j2365j115L9634K6190l9486O063J8679J6708j5487j2300l1732m4068
20618B8186k0112j2801O059j4407J0480Q799K5100K2794L9161N680n1377n9044
20606a1482j4221j0836N059O9405M5448n2374l1424J2381L1089L2139l458k5188
20594D6538j7068n8374J8083J5237M7881K8702L5871q188m0033M004k9009l2448
20582A1196j81K8077K1086j1284k9545m7051K5771L8298l6087k0130K8984J3793
20570B2927o889k7823j075J4333K0269p656k968p186K0232j6630K2966M1169j0144
20557F1525l1502k907k9105Q488M2232n205K8710o75J0457J6654Q648p783k6090
20544G3447J7046K4377n661l094p956J506M0997k132l4735j3592j4370k6423L0952
$$ y = [77465, 65100, 63985, 103619, 129809, 90323, 96386, 115065, 131773, 116286, 103986, 72254, 28186, 8074, -4727, 1332, -13075, -2595, 6204, 31304, 54098, 93259, 98939, 47562, -11482, -25703, -36539, -31480, 37925, 83373, 30999, -425, 11956, 43045, 75184, 71726, 46538, 29470, -28904, -10821, 4416, 52297, 80999, 116870, 108682, 68649, 72653, 43644, 11196, 11015, 39092, 60178, 48894, 19349, -27702, -1931, 36367, 280, -19850, 9134, 22927, 16038, -11785, -12860, 1473, 21742, 14086, 11118, 3932, 24164, 7534, 30500, 71669, 61525, 30023, 27116, -1989, 6499, 48731, 43526, 72236, 71561, 82018, 98672, 107320, 99537, 73447, 90493, 114870, 109209, 106115, 98159, 99665, 140662, 138530, 103795, 90203, 75833, 49410, 80362]
20531H0362K9329K739R275j1605k5275k5800k0643J6009j6113J994j774j4810
20519B3688N852o581R983r099K0211J4093m2866r240J65K1997J3168M0130L35
20506H1836J2402k8704n0384r994k845q360p325k9080j615K6741K8344N029K95
20493A6340j1814j6310k062K9687J6179j071j3291q729K0500J0838j3952r604
20481A6711j2702J1380K6865k322k7610j1036N874k551J9255K1526k2824l3302
20469a0736K2068K1315J921j6789P755J3868K5957L592j2754M9408J5402J54j8811
20456A02350j0203p27L142L8786p743k0918k5820l0520j4612K3312k6256j4401
20444A6390K0517o375n0271j7010J6100L2047N0109k7433k1273p230J4971J320
$$ y = [80362, 109691, 112430, 121705, 110100, 84825, 59025, 38382, 54391, 38278, 40272, 38498, 23688, 29540, 22959, 32942, 23843, 44054, 58147, 15281, 6041, 6206, 28203, 41371, 81501, 81836, 94238, 65534, 15150, 5156, 2311, -6049, -13374, -42454, -44069, -17328, 11016, 16045, 16340, 4526, -11784, -13846, 15841, 32020, 30949, 17658, 8929, 29429, 40267, 26315, 16711, 4009, 15389, 42254, 39932, 12322, 1286, 7160, 4609, 23864, 45390, 22566, -10736, 11332, 32647, 34568, 17779, 25534, 39402, 65359, 68951, 56197, 105605, 121007, 121161, 102350, 92147, 91420, 94562, 133348, 125605, 104687, 78867, 48347, 33735, 57047, 30791, 16390, 36907, 30532, -19739, -36749, -20649, 11398, 61507, 34074, 12801, 5571, 20542, 21862]
20432B1862K1575K0176j1546l2246j6793M4550N4419j2474k3391m464r417L8630
20420I0881j3487j7558N3804l5228j2720K1787P076L9682j9913q514l1302n929
20408F8579K968K4008q624j3165P466L9936J3318j4388J0780J9862j014M426J538
20395A55690j2265J5248j2827o013p396J901L9541K7340J3359N5952R0282J40301
20383E01113J56138J75282K02335J97616K50623K61318J73474J62154R1449J3578
20373B185080m0004r1826j62231j57588j37868q5628j1936K3412J05835J61819
20363A789065J59260J13340P6749Q8040J41j07087j29793j25095k63744k90973
20353A309903k63766k05551j47389j65957j11548p8837l1273k2441j7812j2121
$$ y = [21862, 43437, 63613, 52067, 19821, 3028, 47578, 101997, 89523, 66132, 61668, 52251, 90881, 77394, 59836, 113640, 78412, 65692, 87479, 94555, 134237, 114324, 105810, 74508, 68579, 71547, 95555, 86931, 73766, 81232, 121168, 134486, 120098, 130878, 150740, 149726, 154152, 155690, 143425, 158673, 145846, 139833, 132437, 134338, 173879, 201219, 214578, 270530, 360812, 501113, 657251, 832533, 1034868, 1232484, 1483107, 1744425, 1917899, 2080053, 2171502, 2185080, 2145076, 2053250, 1891019, 1733431, 1595563, 1509935, 1497999, 1521411, 1627246, 1789065, 1948325, 2061665, 2138414, 2226454, 2226595, 2119508, 1989715, 1864620, 1600876, 1309903, 1046137, 840586, 693197, 527240, 415692, 336855, 305582, 283141, 265329, 253208]
20343B53208j4710j0854l0479l5827O532j1130k2666m2535j4845K1367n363K876
20331I5574K5791P556J0241P559Q635k7951j4887o140N7965j8205l4114n0169
20319F1855m0197j3170L0688J4605L0197K1080J7663J9480J5235K5676j8305l4051
20307A30756R190K1267l97J2581L2604M5343J8480m5119J3285j55n0444n3485
20295A33906l1174m4490L2170K5675J9349k4849q512K5464J9454l629l467n8534
20283H1363K2775K5509m1126K4036j7431k9878j462k5409l2356J8088m618j8076
20271A415J3261k7527j0365L0214K0630R992K8738Q606J1188J0423j8746l7031
20259D0798J6327L1661K4178M7358m4844l3719j2266J22j7333L156q286J7831
$$ y = [253208, 238498, 227644, 197165, 161338, 167870, 156740, 134074, 91539, 76694, 98061, 92698, 95574, 121365, 128921, 139162, 146721, 155356, 127405, 112518, 106378, 164343, 146138, 112024, 61855, 21658, 8488, 39176, 53781, 83978, 105058, 122721, 142201, 157436, 183112, 164807, 130756, 139946, 161213, 160816, 173397, 206001, 251344, 269824, 224705, 237990, 237835, 187391, 133906, 102732, 58242, 90412, 116087, 135436, 110587, 102075, 127539, 146993, 143364, 139897, 81363, 104138, 129647, 88521, 112557, 95126, 65248, 63786, 38377, 6021, 24109, 19491, 1415, 14676, -12851, -23216, 6998, 27628, 37620, 66358, 74964, 86152, 96575, 77829, 40798, 57125, 88786, 112964, 160322, 115478, 81759, 69493, 69615, 52282, 55438, 47152, 64983]
20247F4983j2266j4747j2158J7032j2456j6146j3475R738j1906J5202r166N635
20235A0270L5614j1757k0182J7947J7679k3631k5179N4863P0886M1244l2674l1493
20223A03587o431k0571K533n774J8245L6490J827K1305K0134L4964J9890J0618
20211B36817N4168Q1235J05994J02816O302J2321M6179o2048l8560j3178k1546
20200E10500j6867o3753n7350j4816j7698J1053K0031L7095N4953N6253Q0232
20189E99633R3431O5006M328m4812m0915q9923j15143j04500o4434m5622l1150
20178B25899k6570l0056N046k8732o5742n968J6740J8233j1825K0187M1327L0221
20166A88760j6852n836K1106R866n2470n3722j363K4817j0805p563J0235o202
$$ y = [64983, 52717, 37970, 25812, 42844, 30388, 14242, 767, 10505, -1401, 13801, 4635, 10270, 45884, 34127, 13945, 31892, 49571, 25940, 761, 55624, 126510, 167754, 135080, 103587, 97156, 76585, 79118, 73344, 91589, 128079, 129906, 151211, 171345, 206309, 226199, 236817, 290985, 372220, 478214, 581030, 587332, 599653, 645832, 583784, 545224, 532046, 510500, 493633, 429880, 372530, 357714, 340016, 351069, 371100, 408195, 463148, 519401, 599633, 693064, 758070, 762398, 717586, 676671, 586748, 471605, 367105, 302671, 257049, 225899, 199329, 169273, 174319, 145587, 79845, 73877, 90617, 108850, 97025, 117212, 158539, 188760, 171908, 166072, 187178, 197044, 144574, 90852, 89489, 114306, 103501, 95938, 106173, 99971]
20154I9971r575Q520R277m613n495N1932P19K3921K3379K9563n751j4051K871
20141B10668j5850J9060q562k7063j9700L9502K3650L623k8228n0679J2033K8875
20129A87329L2284q93m9320l809N0927J0850j229k3478M1705M1107K7908P0161
20117C83542J18325J16816J30804J76101J98178J25531R112k549J0153n7025j62069
20106A046919j38549j06846n8824K3301P0462Q6023R2024J37848K11833J84556
20096A548747M6221J718m6306j04685k10595j83004j24876j51095j40492r5723
20086E39910l0466n0878n0079m065N3834Q620J0915m179j0752J1362q147k3765
20074D42310J1372l509j4800k0083k1924k2904K3287L8562L3628M3033O4397Q7066
$$ y = [99971, 90396, 98916, 108193, 103580, 98085, 150017, 150736, 174657, 198036, 227599, 221848, 207797, 210668, 194818, 213878, 205316, 178253, 158553, 198055, 221705, 225328, 197100, 146421, 158454, 187329, 219613, 218720, 169400, 165591, 216518, 227368, 226139, 202661, 244366, 285473, 313381, 383542, 501867, 618683, 749487, 925588, 1123766, 1249297, 1258409, 1255860, 1266013, 1208988, 1046919, 908370, 801524, 742700, 766001, 836463, 922486, 1014510, 1152358, 1364191, 1548747, 1594968, 1596686, 1550380, 1445695, 1235100, 1052096, 927220, 776125, 635633, 539910, 509444, 458566, 408487, 404422, 458256, 466876, 477791, 473612, 462860, 474222, 466075, 442310, 453682, 450173, 435373, 415290, 393366, 370462, 393749, 432311, 465939, 508972, 573369, 660435]
20062F60435J58272J21623J75936J73274J03948L7133K4030K5551q1640j66644
20052A231918j68545j44370r1413l863M9302J08848J24681J51849K34236J49909
20042A642552M3834j667N018r4146j93320k08128j91953j74469j48388j09845
20032E69488l7599r267j3229l8314n928O0895L592M6634L5014J6432j3645k9116
20020E84957j2334m0826l5961n4825o5256J520J5405J9595L4725O3389M5303L0371
20008E86063m966k5738J137n8929o7294m3525j8668q4014j9481J3773k1801l8053
19996B18504J0650N355k605k0702K3684L194J1839j0309J4691J9298k5210J867
19984B50256k9456K4308N415o741P518R631o007l0558l9274K0493J8765j4442
$$ y = [660435, 818707, 940330, 1116266, 1289540, 1393488, 1430621, 1454651, 1480202, 1398562, 1231918, 1063373, 919003, 827590, 823727, 873029, 981877, 1106558, 1258407, 1492643, 1642552, 1686386, 1684719, 1689737, 1595591, 1402271, 1194143, 1002190, 827721, 679333, 569488, 531889, 522622, 509393, 471079, 465151, 526046, 529638, 576272, 611286, 627718, 614073, 584957, 572623, 531797, 495836, 441011, 375755, 377275, 392680, 412275, 447000, 510389, 555692, 586063, 581097, 555359, 556496, 497567, 430273, 386748, 368080, 284066, 264585, 278358, 256557, 218504, 229154, 234509, 231904, 211202, 234886, 238080, 249919, 239610, 254301, 273599, 248389, 250256, 220800, 245108, 250523, 243782, 251300, 260931, 254924, 224366, 185092, 205585, 224350, 209908]
19972B09908l5297o2231j8997j1955m3578j6471n8414m8601J4294M192P45K7731
19960c8674M7351M9350M8127K3373K076l6060l4212O462L4063j5312k0984j9003
19948D6557K7601L8673J6176L1408M6863L8154J8429O913M0185K5030L5014L0132
19936D01135K5815J1285p3727l6883L1096m302j3123N3809q07k6839R794N5402
19924D32655R279M0550K8775k5168L2989M5472L2110K5253N4091P6671N6719r188
19912H00208o188k4787R80M8296O4455K2401K1811K8111R966L4706M4641j4573
19900A030027J863j9256J3997L6246L0696N4327P6559P0584M3996N6382O48K4582
19888A420651M6379k1297p011O4942M0552K5476M9011P7157N7052J3743O6537
$$ y = [209908, 174611, 112380, 93383, 81428, 37850, 21379, -37035, -85636, -71342, -67150, -66405, -38674, 8677, 58027, 106154, 129527, 131603, 95543, 61331, 67793, 101856, 86544, 65560, 46557, 74158, 112831, 129007, 160415, 207278, 245432, 263861, 270774, 310959, 335989, 371003, 401135, 426950, 438235, 364508, 327625, 358721, 354419, 341296, 395105, 394298, 367459, 377253, 432655, 441934, 482484, 511259, 486091, 519080, 564552, 596662, 621915, 676006, 752677, 809396, 800208, 794020, 769233, 770213, 818509, 882964, 905365, 927176, 955287, 965253, 999959, 1044600, 1030027, 1031890, 1012634, 1026631, 1062877, 1093573, 1147900, 1224459, 1295043, 1339039, 1395421, 1396069, 1420651, 1467030, 1445733, 1438722, 1503664, 1544216, 1569692, 1618703, 1695860, 1752912, 1766655, 1833192]
19877A833192Q1895J01691N6143M3783J25022J59331J43734J79886K22215K79345
19867C226237K66543L37969M44828M52666L84289M01539M30067L81746L50277
19858F676161L94322N42941O32978P43641Q25748R85028J091650J170217J371153
19849A4433839J520493J720919K008397K568885L530408N181996P782308J2427363
19841E1174608K0169103K8499099L0701065L2742679M2635667N1542072M5565742
19834C03030035K9934474K8005038J7723517n30077j5745926j6026039k3313272
19827C23077750l4327459k6072458o458113K073771N146838K1490260L9926659
19820C24857248L8570823K2510688K1998233J3519112n845484k5114672k7911588
$$ y = [1833192, 1915087, 2016778, 2072921, 2116704, 2241726, 2401057, 2544791, 2724677, 2946892, 3226237, 3492780, 3830749, 4275577, 4728243, 5112532, 5514071, 5944138, 6325884, 6676161, 7070483, 7613424, 8246402, 8990043, 9815791, 10800819, 11892469, 13062686, 14433839, 15954332, 17675251, 19683648, 22252533, 25782941, 30964937, 38747245, 51174608, 71343711, 99842810, 130543875, 163286554, 205922221, 257464293, 303030035, 332964509, 360969547, 378693064, 378162987, 362417061, 346391022, 323077750, 288750291, 262677833, 256219720, 258293491, 263440329, 284930589, 324857248, 363428071, 385938759, 407936992, 421456104, 415610620, 390495948, 362584360]
19813C62584360l7497317n3731955n4209610m3062712l5311044l3215466k7554797
19806G8001459j8924820j1969869p917290n731515m477427l595663l046645k575413
19798A9762817k082836j867163j670369j300405r17171p57559p63841p13373m85486
19789I204614m40482n68421o09859n90348n32407n74805n72218m32527l63030
19780D520517l32174k81621j90628j83452j58363j94453j59936j47723j37530
19771B734637j24077r9824q7263m0442l5805o3981j9618k7517P090P135n5878
19760B194457j14681o6673j02182j41357r1460k7673l5779m6810m3369j9784l2300
19749A472389n6682n7453k6659n4437j8497M425L414l3470m4008r5632n3599O475
$$ y = [362584360, 325087043, 271355088, 217145478, 174082766, 138771722, 105556256, 78001459, 59076639, 47106770, 39189480, 33457965, 28980538, 25384875, 22338230, 19762817, 17679981, 15812818, 14142449, 12842044, 11924873, 11167314, 10403473, 9690100, 9204614, 8764132, 8195711, 7585852, 6995504, 6463097, 5888292, 5316074, 4883547, 4520517, 4188343, 3906722, 3716094, 3532642, 3374279, 3179826, 3019890, 2872167, 2734637, 2610560, 2510736, 2423473, 2383031, 2347226, 2283245, 2263627, 2236110, 2243200, 2250335, 2194457, 2079776, 2013103, 1910921, 1769564, 1678104, 1650431, 1614652, 1567842, 1524473, 1504689, 1472389, 1415707, 1358254, 1331595, 1277158, 1258661, 1263086, 1266500, 1233030, 1189022, 1093390, 1039791, 1046266]
19737A046266l576j6055l4779k0516K1997m2550K3581K6675J0043k8629m6528
19726I35929n1523p2358k3332n121k157L0543L408K9197j3096j4041l3372k5004
19714G59073j7054k382K7313J6774p83L5733M0229P585l8416n1824k2346j0305
19702G43597q963O0692P7802J6461J140L4145J9884K6996J5532J4485k051K7085
19690A026805L7613k7547q2565j1740Q234q163K1308L7151J6130k39j2252k403
19678A002332n3046l4367o9037p0403n5351J2125l6388n5807k050j5365K8826
19667F51469k2425l9077N0209K6170l5188p93l6370k7127K9841J5218o5321o3020
19655D83586m2888m6748M954p899n8024R496M6533L332j7582K6766j4641n2282
$$ y = [1046266, 1042690, 1026635, 991856, 971340, 993337, 950787, 974368, 1001043, 1011086, 982457, 935929, 884406, 812048, 788716, 783595, 781438, 811981, 815389, 844586, 831490, 817449, 784077, 759073, 742019, 739637, 766950, 783724, 782941, 818674, 858903, 866488, 828072, 776248, 753902, 743597, 734634, 795326, 873128, 889589, 890729, 924874, 944758, 971754, 987286, 1001771, 999720, 1026805, 1064418, 1036871, 954306, 942566, 950800, 942637, 963945, 1001096, 1017226, 1016987, 1004735, 1002332, 949286, 914919, 845882, 775479, 720128, 732253, 695865, 640058, 638008, 622643, 651469, 629044, 589967, 640176, 666346, 631158, 630365, 593995, 566868, 596709, 611927, 546606, 483586, 440698, 393950, 398904, 391005, 332981, 342477, 389010, 392342, 374760, 401526, 386885, 334603]
19643C34603O64K095J0150O2275M3992J0733J9659J2212J5614K016l0337L864
19631D87540J4927J537j7894K631K21P875P1861P2265N5940Q4290N3126K1643
19619H55962Q4322N2060n396K5942O7891M1542L1767K9959Q3366J34251K00603
19608A602269J69563K25840L13357K64357P5884M5725J20322j0279j21190m9814
19598B636034M112J00018J86615L28450M16791M96099N95419O33094N88993M00492
19588F386117M01980M30221L25493L68934P13867J101784J638597K499557L801736
19579A7668286N795722R431571J5641024K3651580K6956797K5379979L3628383
19572A58153342M1048094J9069743j385077L858697m119056l0104227l4267872
$$ y = [334603, 335267, 337362, 347512, 409787, 453779, 464512, 484171, 496383, 511997, 514013, 483676, 487540, 502467, 504004, 486110, 488741, 488962, 496837, 568698, 640963, 696903, 781193, 834319, 855962, 940284, 992344, 986948, 1012890, 1080781, 1122323, 1154090, 1184049, 1267415, 1401666, 1602269, 1771832, 1997672, 2311029, 2575386, 2651270, 2696995, 2817317, 2807038, 2685848, 2636034, 2640146, 2740164, 2926779, 3255229, 3672020, 4168119, 4763538, 5396632, 5985625, 6386117, 6788097, 7218318, 7543811, 7912745, 8626612, 9728396, 11366993, 13866550, 17668286, 23464008, 32895579, 48536603, 72188183, 99144980, 124524959, 158153342, 199201436, 218271179, 216886102, 220744799, 216625743, 186521516, 152253644]
19565A52253644k4521192k1180335j6717884m773953Q720913J5843429J7406895
19558A27031517K5875982L2595742J4625378k369309J291994o530520k8949233
19551A63571551l2875373k5706738k4290386k2481391j6388573j0429547o625378
19544B4774165m259020k771349j755175r60401k79949L50407R37091J554274K000994
19535A9591037J371836p2198r47181j163096r51995k60781Q42941K421589M548968
19526B5381120O504659O972843Q777767J5480197K5615686L1089048K9520982
19519A49342302L8210432M8486806K5232519j150770L469911l080765l3713461
19512B26796974m1350521l0246372k5450690k0426222o694281R898148J9377793
$$ y = [152253644, 127732452, 106552117, 89834233, 85060280, 93781193, 109624622, 127031517, 152907499, 185503241, 200128619, 197759310, 199051304, 192520784, 163571551, 130696178, 104989440, 80699054, 58217663, 41829090, 31399543, 24774165, 20515145, 17743796, 15988621, 15028220, 14748271, 15098678, 16035769, 17590043, 19591037, 20962873, 20890675, 19943494, 18780398, 17828403, 17567622, 18410563, 20832152, 25381120, 31885779, 38858622, 47636389, 63116586, 88732272, 119821320, 149342302, 187552734, 236039540, 261272059, 260121289, 263591200, 260510435, 226796974, 185446453, 155200081, 129749391, 109323169, 102628888, 112527036, 131904829]
19505A31904829K1133005L0608356M0297289K0435213k548467P90799o289097
19498B36331927l4152764m1311834l2520178l0089928k8249675k0933199j3246093
19491C5828256q439008n553697l699110k569499j851507j342252r13150p65233
19483A0694800q34690p23487o22168p51752q10712n93138n71377n60604m05689
19474D821183k86166j62474j50652j20889j6439m3046j54265j32666j15435k65196
19464C373955l55731k51260j93887k43418k04767j80575j41130j02566p7148o9113
19454A554360n5525o7962m3368q0169k9737L422k2193m8405j5115R649K2981j2439
19442A215499r004J4541K157J9399K5350J4530L984k6666k6483m2804q3875j1114
$$ y = [131904829, 153037834, 183646190, 223943479, 244378692, 241830225, 242621024, 236331927, 202179163, 160867329, 128347151, 98257223, 70007548, 49074349, 35828256, 27389248, 21835551, 18136441, 15566942, 13715435, 12373183, 11460033, 10694800, 9860110, 9136623, 8514455, 7762703, 6951991, 6358853, 5787476, 5226872, 4821183, 4535017, 4372543, 4221891, 4101002, 4084563, 4041517, 3887252, 3754586, 3639151, 3373955, 3018224, 2766964, 2573077, 2329659, 2124892, 1944317, 1803187, 1700621, 1623473, 1554360, 1498835, 1430873, 1387505, 1307336, 1277599, 1281021, 1258828, 1210423, 1195308, 1204957, 1227938, 1215499, 1206495, 1221036, 1223193, 1242592, 1267942, 1282472, 1286456, 1259790, 1233307, 1190503, 1106628, 1095514]
19430A095514n0154m4K7451L8525R168j6300K0176N1568j6865n7027n7563o0198
19418I84251o8656o2478m7428j6933k4229n008l2703n9713n977P187j0696k9130
19406F28487Q477k7401p221R407N699l2125J337k6737J9083J2198k4281k8773
19394E38150O192O707o835R440J7260K5147M9827Q1590N7405J1434l3465j0068
19382G52784n3034p5407o2184l5983k5071N2258N8367n809j2240K7834k5560q912
19370E87043K4215J9403k0764o6768o6245p1062n7490l5899j2279J2027K1589
19359C33770k402j7094j5905k1300k614J4543K1498j76j8038l0775j9657J4745
19347B56595J9777P882m394O494K18k6986j2549q004m3588l9785Q112L8377o553
$$ y = [1095514, 1045360, 1045316, 1072767, 1111292, 1120460, 1104160, 1124336, 1175904, 1159039, 1102012, 1044449, 984251, 915595, 853117, 805689, 788756, 764527, 759519, 726816, 667103, 661126, 668313, 657617, 628487, 636964, 609563, 602342, 611749, 617448, 585323, 586660, 559923, 579006, 591204, 566923, 538150, 544342, 551049, 544214, 553654, 570914, 596061, 645888, 727478, 784883, 796317, 762852, 752784, 699750, 624343, 562159, 526176, 501105, 553363, 611730, 605921, 593681, 621515, 595955, 587043, 611258, 630661, 609897, 543129, 476884, 405822, 348332, 312433, 300154, 312181, 333770, 331368, 314274, 298369, 277069, 274455, 288998, 310496, 310320, 292282, 261507, 241850, 256595, 276372, 284254, 279860, 286354, 286572, 259586, 247037, 239033, 195445, 155660, 163772, 202149, 195596]
19334A95596J0205L874r711P114m9872n2804l9976j7448Q565K3954L792o992J3391
19321H9688O6182O3631K3633L2039k336k7487l5640l6775m5374J5148K7934M456
19309A75099O854M7722l058J8211J1952N3188N4377o327m789M7201j8184M714
19297C86960M2805K9818J0794O3007N5883J25218J92400J97138J93817K68905
19287A566745L41117K93909K15212J47714J03179k669r4616p7684j39611k15799
19277B137497j40794m5524j8729J1264N7116J28311J58545J41535J11829L2259
19267B573309o8851j26615j43149k16682l27298k61887k14963k13426j88378j10824
19257G01236m6377m9049m9218l6003j0369M517l9134o387O936l985k6633n271
$$ y = [195596, 205801, 209675, 199964, 207078, 157206, 104402, 64426, 46978, 55543, 79497, 83289, 76297, 89688, 155870, 219501, 243134, 275173, 272837, 245350, 209710, 172935, 127561, 142709, 170643, 175099, 181953, 229675, 226617, 244828, 256780, 309968, 364345, 358018, 353229, 400430, 382246, 386960, 429765, 459583, 470377, 533384, 589267, 714485, 906885, 1104023, 1297840, 1566745, 1907862, 2201771, 2416983, 2564697, 2667876, 2665207, 2570591, 2492907, 2353296, 2137497, 1996703, 1951179, 1932450, 1943714, 2000830, 2129141, 2287686, 2429221, 2541050, 2573309, 2504458, 2377843, 2234694, 2018012, 1690714, 1428827, 1213864, 1000438, 812060, 701236, 654859, 605810, 556592, 520589, 510220, 514737, 475603, 469216, 476152, 472167, 445534, 440263]
19245D40263n503k3565r824k8442p984O8988L1594J354L0906j8379j5946J1954
19233D75416Q576l2572N74j5540J3691J8756K7443J3142p641j6157j1732L5043
19221E08999K2673R681k2103n3792k7711J1015j4788p6956J3669K9924l3735J5794
19209C82670K6630k1606j1810M093K3537L388j0420K1458M6982K2382J1020L2501
19197E30825L8603N2038L872m1481m7294n8974q4128n0754m3670m805N711j2037
19185B87906k0406L0601l788J297J3784Q316L422q439Q14l5867J5960K0238J0518
19172C24356p068m7542n4029j673L1814P793p034P218J7105L6499l2993n2294
19160B22152k3296L8492k0211j3272q536k6515N3065N7139K2626M190m0707j161
$$ y = [440263, 434760, 411195, 401371, 372929, 364945, 433933, 465527, 466881, 497787, 479408, 463462, 475416, 483992, 451420, 451994, 436454, 450145, 468901, 496344, 509486, 501845, 485688, 473956, 508999, 531672, 541353, 519250, 465458, 437747, 448762, 433974, 357018, 370687, 400611, 366876, 382670, 409300, 387694, 375884, 379977, 403514, 406902, 396482, 417940, 464922, 487304, 498324, 530825, 569428, 621466, 625338, 583857, 536563, 477589, 393461, 342707, 299037, 294232, 299943, 287906, 267500, 298101, 294313, 295610, 309394, 317710, 321132, 312693, 313507, 277640, 293600, 313838, 324356, 317288, 269746, 215717, 214044, 245858, 253651, 246617, 253835, 270940, 307439, 274446, 222152, 198856, 237348, 217137, 203865, 195329, 168814, 221879, 279018, 301644, 305834, 265127, 263966]
19148B63966J358M9722N560j7555L2078M2255J9329K0992p2679p3097j5071J098
19136B57956m4406k9399J2190K2002R887J2231L9720N6633K2322P826R58K6660
19124C94580K3017m1178k3J4004L7154J6076R139l5106n7649o6574q222j3874
19112B71344l300J654R665k2813k540l25J0603J5925m742L850P650J3742K6893
19099C27606R379k42j127K0619O058K3285p42j3825J127j929l1053o7645l0548
19086B40963L9243j8903L0414O5375O4078M6874M3484L3189L5901K9722L9948
19075F50288M248L0176M1644q713N3837K439j3799M2821M9690l836L6227M7130
19063I32152J8111L0881L5652N8840R1316O4900M1588O8542O8974K8161j685K4771
$$ y = [263966, 265324, 315046, 320606, 303051, 335129, 377384, 396713, 417705, 345026, 271929, 256858, 257956, 213550, 184151, 196341, 218343, 228230, 240461, 280181, 336814, 359136, 366962, 367920, 394580, 417597, 376419, 376396, 390400, 427554, 443630, 452769, 417663, 360014, 293440, 285218, 271344, 268044, 269698, 279363, 256550, 254010, 253685, 264288, 280213, 275471, 279321, 286971, 300713, 327606, 336985, 336743, 335616, 356235, 362293, 385578, 384836, 371011, 372138, 370209, 339156, 271511, 240963, 280206, 261303, 291717, 357092, 421170, 468044, 511528, 544717, 580618, 610340, 650288, 654536, 684712, 726356, 717643, 771480, 773919, 760120, 802941, 852631, 848795, 885022, 932152, 950263, 981144, 1016796, 1075636, 1166952, 1231852, 1273440, 1341982, 1410956, 1439117, 1437432, 1462203]
19051A462203M2643K3407M5481O4124J41741J61784K34582L33621L80319L43533
19041C233438M04017M26193L37580L00340L19671K66386K58530K81250K86389
19032F113794K17798L25235M80079O40466O33375O85039P77575R50086J087534
19023A1910981J262919J691635K244150L181432M645187O992489J0907012J7680358
19015F0516163K7155132L4057022L4937029M0914126N3186860N9170730M2528334
19008C52465396K7069960K4256024J1929730p652280k5763894k8498976m3006514
19001C10799446n5034457n1178429l9528745l4391667l4093560k7735748j8391737
18994E0445103j1388927p172646m711242l111191j850129p46079M1887j687o54163
$$ y = [1462203, 1504846, 1528253, 1573734, 1637858, 1779599, 1941383, 2175965, 2509586, 2889905, 3233438, 3637455, 4063648, 4401228, 4701568, 5021239, 5287625, 5546155, 5827405, 6113794, 6331592, 6656827, 7136906, 7777372, 8410747, 9095786, 9873361, 10823447, 11910981, 13173900, 14865535, 17109685, 20291117, 24936304, 31928793, 42835805, 60516163, 87671295, 121728317, 156665346, 197579472, 250766332, 309937062, 352465396, 379535356, 403791380, 415721110, 408068830, 382304936, 353805960, 310799446, 255764989, 204586560, 165057815, 130666148, 96572588, 68836840, 50445103, 39056176, 31883530, 27172288, 24061097, 22210968, 21464889, 21506776, 21505089, 20850926]
18985B0850926j123959j190490j231952r99342m03885N04572J535587K070190
18977B0011647O79259j615085k229500j643652r26563m40408j33028J50853M77710
18968A4331233R04049J393843K104815L375661N331496Q404054J3684347K1404933
18960G0934431K7627140K8599507L2920280M3044794M9224738L6892059K2717349
18953C11960298K0474125J1106438m568002k0893040k3350993l4598816m5561071
18946B14568939m3163459l3442263k8524730k8613590k3736046j5803337r794823
18939C1490691o320845m345413l157324k448418j937942j480113j225421j033899
18931I541316q12437o86650o14447n25860l49860k36298k16733k56931k22171
$$ y = [20850926, 19726967, 18536477, 17304525, 16305183, 15901298, 16405870, 17941457, 20011647, 20690906, 19075821, 16846321, 15202669, 14276106, 13835698, 13702670, 13853523, 14331233, 15235282, 16629125, 18733940, 22109601, 27441097, 35845151, 49529498, 70934431, 98561571, 127161078, 160081358, 203126152, 252350890, 289242949, 311960298, 332434423, 343540861, 338972859, 318079819, 294728826, 260130010, 214568939, 171405480, 137963217, 109438487, 80824897, 57088851, 41285514, 31490691, 25169846, 20824433, 17667109, 15218691, 13280749, 11800636, 10575215, 9541316, 8728879, 8042229, 7427782, 6901922, 6552062, 6315764, 6099031, 5842100, 5619929]
18922E619929k13364k52299l29431l30491l50209m00354m00274k91266k39159
18913B813082k73495k62899j92991j45076j38124j39009j41032o4288l5956n0016
18903A370196K8440j9575j4419K103O608J4245M1395J6347K6687K3231K9897J2331
18891A537486j5887m4611r850n2022r6294q9703p7374j31706l5203l434j8088
18880I63314k6647j89j7741k0047O290M1726L3027m848l7724m9188k5310q684
18868H53979m8575r0000n4646l7531k0881O5J7770j0706j2917k593j8460n802
18856E69703N608j5204L10J8709k9161j3752R294O0j6415l0657k5668l1685M251
18843D45393K2581J7957O7182M8314P8980K6889K3398M2993J7547O23j0358n2287
$$ y = [5619929, 5406565, 5154266, 4824835, 4494344, 4144135, 3743781, 3343507, 3052241, 2813082, 2539587, 2276688, 2083697, 1938621, 1800497, 1661488, 1520456, 1456168, 1420212, 1370196, 1398636, 1379061, 1364642, 1366745, 1373353, 1387598, 1428993, 1445340, 1472027, 1495258, 1525155, 1537486, 1521599, 1476988, 1467138, 1415116, 1318822, 1229119, 1151745, 1020039, 984836, 981402, 963314, 936667, 936478, 918737, 898690, 904980, 946706, 979733, 974885, 937161, 887973, 862663, 853979, 805404, 715404, 660758, 623227, 602346, 602411, 620181, 609475, 596558, 593965, 575505, 569703, 575311, 560107, 560417, 579126, 549965, 536213, 545507, 545567, 529152, 498495, 472827, 441142, 445393, 467974, 485931, 553113, 601427, 680407, 707296, 730694, 773687, 791234, 791857, 781499, 729212]
18831G29212p2123k0041m1509o7520l7127Q540q213J537K1813J319k9170m8347
18819D38371m9634l3211q0149k5955j1207l8847m4736m5170j3460j0773K6125
18808A11354O2955O7310M6782N2928K3134r710m616J0592K2160j6769q589L802
18796C61333p6280l5565j3841J8446k2398k3993J1616j5732r763l8895r466q234
18784A37228j905p330J2717p123k6064l0954j7220K9153k614L4253n759o043j1325
18771I7014J3693K5440J8053j9499R095O0067J02943J54379M6746q3568j27674
18760B96689q8266n426j6893o585N6882Q8708O7202P3877R9967J6847l9954j4037
18748E29011K0840J8550n0200n5045k8046l2134j7232l2178n2402m2166r454m1434
$$ y = [729212, 657089, 637048, 595539, 528019, 490892, 499432, 491219, 492756, 514569, 515888, 486718, 438371, 388737, 355526, 275377, 249422, 238215, 199368, 154632, 109462, 96002, 85229, 111354, 174309, 241619, 288401, 341329, 364463, 354753, 350137, 360729, 382889, 366120, 357531, 361333, 285053, 249488, 235647, 254093, 231695, 207702, 219318, 203586, 193823, 154928, 145462, 137228, 135323, 127993, 140710, 133587, 107523, 76569, 59349, 88502, 85888, 120141, 114382, 108339, 97014, 110707, 136147, 154200, 134701, 143796, 203863, 306806, 461185, 507931, 424363, 296689, 208423, 202997, 186104, 179519, 236401, 325109, 392311, 466188, 566155, 583002, 543048, 529011, 549851, 568401, 518201, 463156, 435110, 402976, 385744, 353566, 301164, 258998, 249544, 208110]
18736B08110k8520o855l8722k1908j5230m8824J8680m063K0646R996j7343l1463
18724D4504j4191J0974O026k4721M787J7364K3985J0452K0183J142o563M6127
18712A40069L3823j8949j6328N5167Q7812O8384P397J7454L4839M102L6692K7455
18700D77917J3866k9133j4982M1249l2123o0447n1935m3331l4306n748k0236m4605
18688A96186o6042l8626m3262o7628o34M3820K1197K6425K6350P990R475J4703
18676A29954j1358l2633j2869J0913J8317j9682k7194M5698n417j6680l2479j1740
18664C4830J485K957n252N0342M5439L6957l7338J7547M6350K5199K8507M9334
18652B96357L8760O1516l323N224L039k9076n6093j8622q306j9189o242l7462
$$ y = [208110, 179590, 172735, 134013, 112105, 96875, 48051, 66731, 62668, 83314, 93310, 75967, 44504, 30313, 41287, 47313, 22592, 27379, 44743, 68728, 79180, 99363, 100505, 93942, 140069, 173892, 154943, 138615, 193782, 281594, 349978, 357375, 374829, 409668, 413770, 450462, 477917, 491783, 462650, 447668, 488917, 456794, 396347, 344412, 301081, 266775, 261027, 240791, 196186, 130144, 91518, 48256, -19372, -20006, 23814, 45011, 71436, 97786, 105776, 115251, 129954, 118596, 85963, 73094, 84007, 102324, 82642, 55448, 101146, 95729, 79049, 46570, 34830, 36315, 39272, 34020, 84362, 129801, 166758, 129420, 146967, 193317, 218516, 247023, 296357, 335117, 396633, 393310, 398534, 401573, 372497, 316404, 297782, 289476, 270287, 264045, 226583]
18640B26583l7594n3985J0603J5854j2776m7060l0226o164m5135l1687L1019N0233
18628F9665q873l1606p693j9283j1954J2254j3336J5284K722j4793L7476M2720
18616G2583l6897l8233K9291r873n513K4914j4825P453L6379o78j6401n2890k6377
18603c1067J0303K6546L94K9802K6001j6275k6493L515R571o899m2493m0895L9424
18590a8566j776j2473M0272l66K4469k3946j3349l2117J0818M6870K1499p978
18578C3357J9590J5040J5225K5202J4816O616O618k7834r5106j3822L6927M384
18566D1013J8394K9534l4092J4727P996j5045j4068J3658L7557L426m46n6851
18554D5803m7596K5490K73l119L0606l701o040J2714k0845j3485J082l320l733
$$ y = [226583, 188989, 135004, 145607, 161461, 148685, 101625, 71399, 65235, 20100, -11587, 19432, 69665, 60792, 29186, 21493, 2210, -9744, 2510, -10826, 4458, 7180, -7613, 29863, 72583, 35686, -2547, 26744, 16871, 11358, 36272, 21447, 28900, 65279, 64601, 48200, -4690, -31067, -20764, 5782, 6176, 35978, 61979, 45704, 19211, 22726, 32297, 25398, -17095, -57990, -18566, -20342, -32815, 7457, 7091, 31560, 7614, -5735, -37852, -27034, 19836, 41335, 33357, 52947, 67987, 83212, 108414, 123230, 129846, 136464, 108630, 13524, -298, 36629, 41013, 59407, 88941, 54849, 69576, 77572, 62527, 48459, 62117, 99674, 103100, 102654, 45803, -1793, 23697, 23970, 20851, 51457, 47756, 41716, 54430, 33585, 20100, 21182, 17862, 14129]
18541A4129k0948o8906k4324j7148j0108J1206K3395J0641K565n779j1289K7217
18529f9349k850P998N051J1482K9409j3985l2857K1126K5289j0828K6851L5829
18517C3166J1117o322J3542M1484K6183j0437j2068k5519K252J9919j9345k2589
18505E1383k5001l25K4125J6773K3397j6733o461K0411Q962k388k5645j2259j7426
18492C8813J6021q568p4836L983k550p088m4055k6848N1152N2057j6102l3323
18480e1344K2881K6570J3264K1071K4575Q672J8525k1174k4801K6830L8381K0161
18468A23611O2481M5572P9520J57547J88890K01249K57546K75049K47373J77932
18458A816770J17375J01546R4503j9272r9376j70832k64574k50767k83783k27572
$$ y = [14129, -6819, -75725, -100049, -117197, -127305, -116099, -92704, -82063, -79498, -85277, -96566, -69349, -72199, -64201, -59150, -47668, -18259, -32244, -65101, -43975, -18686, -29514, -2663, 33166, 44283, 37961, 51503, 92987, 119170, 108733, 96665, 71146, 73398, 93317, 73972, 51383, 26382, 26057, 50182, 66955, 90352, 73619, 67158, 87569, 96531, 94143, 68498, 56239, 38813, 54834, 46266, -28570, -24587, -27137, -34225, -78280, -105128, -53976, -1919, -18021, -51344, -28463, -1893, 11371, 32442, 57017, 65689, 84214, 63040, 38239, 65069, 103450, 123611, 186092, 231664, 311184, 468731, 657621, 858870, 1116416, 1391465, 1638838, 1816770, 1934145, 2035691, 2130194, 2110922, 2011546, 1840714, 1576140, 1325373, 1041590, 814018]
18448H14018j89724j50859j31005r2475n3974k6810k7073k2699l9122j0091j7318
18437E2868p328L3534p328m2778J1869Q805K1793M4649k7135k4292m827J2919
18425G2749o670n372N5429n184K3467N313K9893N0886J11429J50173J09592O7382
18413F59087L2254J00221J08475J02827J64574J63320K24225L87160M00990K71212
18403B614345j7949j81773k30471k39416k01421k31746k22157k68358k13904j62192
18393F44958j54425j57035p1718o5984m7053n481M452P21k445l3846n0126k003
18381F0015m979M800J3410o326n5886n4740k98J3440J0950k059K0912J4089K4976
18368C8304K2214q000n921J8894l9909k3096j0610J4023o114q507K4840J5341
$$ y = [814018, 624294, 473435, 342430, 249955, 195981, 169171, 142098, 119399, 80277, 70186, 52868, 45540, 79074, 71746, 28968, 40837, 49642, 71435, 116084, 88949, 64657, 59830, 72749, 66079, 60707, 116136, 110952, 134419, 139732, 169625, 220511, 331940, 482113, 591705, 659087, 691341, 791562, 900037, 1002864, 1167438, 1330758, 1554983, 1942143, 2343133, 2614345, 2596396, 2414623, 2184152, 1944736, 1743315, 1511569, 1289412, 1021054, 807150, 644958, 490533, 333498, 261780, 195796, 148743, 143262, 147714, 148435, 145990, 112144, 62018, 60015, 55036, 59836, 73246, 66920, 11034, -43706, -44004, -30564, -19614, -21673, -761, 13328, 38304, 60518, 52518, 46597, 65491, 25582, 2486, -8124, 5899, -215, -8722, 16118, 31459]
18356C1459J490j0144J6887K2173k3634J0810l7222j3409J2284k2360Q716R686
18344F736J6001k9697r665J4666J9426K1989J8675l3348L5247L4047k8483r213
18332E6381L8541j0869j6477J0489r762J5824n0377l7749L7675K0289K2858p966
18320F8857K2697J4198l5771j3810M725J646j1548P317J2357j4285k6640L1786
18308F1529M076J671J6765p796l7817Q648J176j0316k3534j4856N436L5127L3175
18295G3284M4523K2975n5520j1884m850j8850j987j7567k4093R073L62j6404k5454
18282b6392K2443J9108k339q217q773P105J8521J2607J0104J6306l095p916j5491
18269C3971k5590j5829K55l1051j0058Q636K5787J4502L9641K8124J984j7650
$$ y = [31459, 32949, 22805, 39692, 61865, 38231, 49041, 11819, -1590, 10694, -11666, -2950, 6736, 22737, -6960, -16625, -1959, 17467, 39456, 58131, 24783, 60030, 94077, 65594, 56381, 94922, 84053, 67576, 78065, 68303, 84127, 33750, -3999, 33676, 53965, 76823, 68857, 91554, 105752, 69981, 56171, 60896, 62542, 50994, 58311, 70668, 56383, 29743, 61529, 65605, 67276, 84041, 76245, 38428, 47076, 48252, 37936, 14402, -454, 4982, 40109, 73284, 117807, 140782, 85262, 73378, 68528, 49678, 47691, 30124, 6031, 15104, 15466, -938, -26392, -3949, 15159, 12820, 4603, -4170, 2935, 21456, 34063, 44167, 60473, 57378, 49462, 33971, 8381, -7448, -7193, -38244, -48302, -39666, -13879, 623, 40264, 68388, 70372, 52722]
18257E2722k1928J1719J8483k9236l6440m0484k387K5062J5571J7231L965l295
18245A0983k4806l9118J1097M4444r06j815R28k0617r535k848J8267m144J7351
18232g19j1992j6418L2133K1577m0063J0045N654L8797j7465k6206k0694K8652
18220C301M8018L548j4721L580k3435m322j5855p195m517l0100K3004J2268k519
18207h945J621J2952k3315K2270L2892Q514M056J8785O380l9860j8404L6934l6956
18194A6924O176L8802l582m1485o229J2743J8904k6506j5067m493n855j4837j4546
18181c9051J8671P454J3661o926R52M7044M131l6972k379L3444J7841j69k8534
18168B9167n5339k9979J6774K6859J4255J0762K0178q239l0954k0315n001K9713
$$ y = [52722, 30794, 42513, 60996, 31760, -4680, -45164, -47551, -22489, -6918, 10313, 14278, 10983, -13823, -52941, -41844, 2600, 1694, -121, 807, -19810, -29345, -32193, -13926, -18070, -719, -12711, -29129, 3004, 24581, -15482, -5437, 217, 39014, 21549, -4657, -25351, 3301, 51319, 54867, 40146, 43726, 20291, 15969, 114, -7081, -11598, -41698, -18694, -6426, -8945, -7324, 5628, -17687, 4583, 37475, 45989, 50045, 68830, 75210, 35350, 16946, 53880, 16924, 23100, 61902, 58320, 16835, 10606, 23349, 42253, 15747, 680, -3813, -9668, -24505, -39051, -20380, -12926, 735, -6191, -5239, 41805, 45936, 8964, 6585, 40029, 57870, 57701, 29167, -26172, -56151, -39377, -12518, 1737, 12499, 32677, 24438, -6516, -26831, -31832, -2119]
18156b119P2737K9212J6920q150j9996n5528j340K6786J7490j4871J1706L779
18144G6626K9953J9494k0811m573j4639R213K8390K1058K8743J903K3864L7225
18132B36446K1654k0661j4362M1378N3412N0937N9835M4273K1422L1682P4503
18121F00519K8309O0280J11494R7603J51580K39492L00395L72200M65770O96516
18111C124158J125527J761276L072522N842090J1754187K3089492L2301520O185996
18103H8256768k7429159k7374194j4706334o958338l713268k238482j470593j018914
18095C347486p07439n20150l73374k28915j73174j96414j59372j41103j38508
18086G09037j38874q6647n2466o9307l2076l6298K0394N0686k6266k1432k8256
$$ y = [-2119, 70618, 99830, 116750, 108600, 88604, 33076, 31736, 58522, 76012, 61141, 72847, 76626, 106579, 126073, 105262, 100689, 86050, 95263, 123653, 144711, 173454, 175357, 199221, 236446, 258100, 237439, 223077, 264455, 317867, 368804, 428639, 472912, 494334, 526016, 600519, 628828, 689108, 800602, 898205, 1049785, 1289277, 1589672, 1961872, 2427642, 3124158, 4249685, 6010961, 9083483, 14925573, 26679760, 49769252, 82070772, 88256768, 60827609, 33453415, 18747081, 11788743, 8075475, 5836993, 4366400, 3347486, 2640047, 2119897, 1746523, 1517608, 1344434, 1148020, 988648, 847545, 709037, 570163, 483516, 431050, 361743, 329667, 293369, 313763, 364449, 338183, 316751, 288495]
18075B88495j7782l0652j2832K0276l0752l5633o5399p845L1041P524j6392j2785
18063A17264k178l073l0597P676m7692j8775J0864L082j4584K4071j4820l13M089
18050C5014K4449L0511j9395o9062j2630J4329K5822J2423j7737P526L4610J6385
18038H2245k3997j5122l578p028J5838N391M387l5887m8550M672L6692k8842k5099
18025c8878J0292K0238K614o303l3278o586L9740n41j2527J7448K3n1437M472
18012e4723J1141j5012K7479J4620o68L1998R685J2253j2752o419L7659r237P119
17999E3143r707n5554k0255K6661l4867k1177K7795L2440K9853k948m5583k0955
17987d1154J3135K5444J2518O511M518n631n7830k4264N1983J7129N140L1319
$$ y = [288495, 270713, 240061, 227229, 247505, 216753, 181120, 115721, 107876, 138917, 146441, 130049, 117264, 115086, 112013, 81416, 89092, 41400, 22625, 33489, 36571, 21987, 46058, 31238, 30925, 35014, 59463, 89974, 70579, 1517, -11113, 3216, 29038, 41461, 23724, 31250, 65860, 82245, 58248, 43126, 39548, 32520, 48358, 53749, 58136, 22249, -26301, -21629, 15063, -13779, -38878, -28586, -8348, -5734, -12037, -45315, -51901, -12161, -12702, -25229, -7781, -7758, -59195, -54723, -43582, -58594, -31115, -16495, -17163, 14835, 24520, 36773, 24021, 17602, 55261, 46024, 53143, 43436, -12118, -32373, -5712, -40579, -61756, -33961, -1521, 28332, 25384, -20199, -41154, -28019, -2575, 9943, 16454, 20972, 15341, -42489, -66753, -14770, 2359, 7499, 38818]
17975C8818N1920M1699j2092j8116j2227K1520Q825r607M717M182k4524M27k7457
17962F8085p3089j1116K6965J9658j8542j0181M586K324N0471K7017l98k0752
17950F5028k2776k412l6399J9704j5167j6627J5909k1698n0156k22M0144J1653
17938a3019l019K7135l1297J8118P599j5544k2848J1036m592j515k542K5540p606
17925a2554j3253P594M1377j3685m2354M5835L3931K6198m6772l5864n5820l0252
17913i5619M499L6047M8978J5060N625k9203o158j280K9121N843J5860K1155j6384
17900C3544R547J1536j6737m1621n051K1481k8277K3871j298k8747O871M2077
17888B7196J0385n8882N049K328j8732L3812L5772k4120j926K4046R678m947q484
$$ y = [38818, 90738, 132437, 120345, 102229, 90002, 111522, 120347, 110740, 115457, 119639, 95115, 95542, 68085, -5004, -16120, 10845, 30503, 11961, 1780, 6366, 8690, 59161, 86178, 85780, 65028, 42252, 39840, 3441, 23145, 7978, -8649, 7260, -14438, -64594, -64816, -24672, -13019, -16038, 11097, -20200, -2082, 5517, -10027, -32875, -21839, -26431, -27946, -30488, -4948, -12554, -25807, -18213, 23164, 9479, -32875, 12960, 46891, 73089, 26317, -9547, -65367, -95619, -91120, -55073, -6095, 8965, 14590, -14613, -20771, -22051, 7070, 12913, 28773, 49928, 33544, 43091, 54627, 37890, -3731, -8782, 12699, -15578, 8293, 6995, -21752, -14881, 27196, 37581, -21301, -16252, -13924, -32656, 1156, 36928, 12808, 10882, 34928, 44606, 39659, 31175]
17875C1175j0837J579J823J716l1393o655p143p027k9597J2912L1928P470j7507
17862b1556o97l9121J2285L2745o207r532N0188l2638k2463K9677K3077K565M6829
17849F5152P221k3033K7518k0380n5502j3577L5001L9428Q039J5287m3607k5200
17837A6347k5893j1275J3618L625k9004j8738L086J4906K026m0675r479L685q465
17824h6236J4122J4642j6282J9330N4189M6391l636n428j8280K916l6112k886
17812a7270O295j3160m5105M2500L3434j3576k9061j6627R988L42J2285J3490
17800a6465l823J5527k918K4399P706r512J4730m3083L061k1544k6366j5196J8985
17787e4499J3539K494k3547J7567J7947J5979P294l4610j5775L3934J1244l634
$$ y = [31175, 20338, 21917, 23740, 25456, -5937, -12592, -19735, -26762, -56359, -43447, -11519, -4049, -21556, -22253, -61374, -49089, -16344, -22551, -32083, 18105, -14533, -36996, -7319, 15758, 18323, 65152, 72373, 49340, 76858, 56478, 976, -12601, 22400, 61828, 69867, 85154, 41547, 16347, -9546, -20821, -7203, -3578, -32582, -51320, -48234, -33328, -31302, -71977, -81456, -77771, -86236, -72114, -57472, -73754, -54424, -235, 46156, 42520, 37092, 18812, 21728, -14384, -17270, -10975, -24135, -69240, -26740, 6694, -6882, -35943, -52570, -42582, -42240, -29955, -16465, -20288, -4761, -7679, 16720, 24426, 14914, 29644, -13439, -10378, -31922, -58288, -73484, -54499, -40960, -38466, -62013, -44446, -26499, -10520, -3226, -37836, -53611, -19677, -8433, -12067]
17775a2067J8167l093m6139j946K1733k790p268j2700p982o105m742m752K3391
17762d6293J0771k2511J0309M1574R805J3200K4409m3560k4080k2259j8918j0041
17750g7594N1625O0902n564P508l409j5523j0862m1404k7171M613K8106k5490
17738e4263o40M5694j6645J5680L0385J408k3489J2893j8677j2357j668M172K3608
17725F101L7158k8124J6280J2061m3996j5779J92J2074J890l035M6914m8246n3263
17712e9773k1247M0855L6283M730j888J632O737k713O284K8354N530j6764m112
17699B3908r984J841J9003m4808O043K7388K5583l3648n2840K0361M9343K2405
17687E4595j5671K681j7582J2935k0642k3812j0780N1408J1936m0002j8409R172
$$ y = [-12067, 6100, 3007, -43132, -45078, -23345, -26135, -33403, -46103, -54085, -60190, -64932, -69684, -46293, -35522, -58033, -47724, -6150, 3655, 16855, 41264, -2296, -26376, -48635, -67553, -77594, -25969, 34933, 29369, 36877, 33468, 17945, 7083, -34321, -61492, -56879, -28773, -54263, -54903, -9209, -25854, -10174, 20211, 21619, -1870, 11023, -7654, -20011, -21679, -17507, 6101, 43259, 15135, 31415, 43476, -520, -16299, -16107, -4033, -2143, -5178, 41736, -6510, -59773, -81020, -40165, -3882, 848, -1040, 592, 7329, 4616, 10900, 39254, 44784, 28020, 23908, 13924, 15765, 34768, -10040, -3997, 23391, 48974, 15326, -37514, -17153, 32190, 54595, 38924, 41605, 24023, 36958, 16316, -7496, -18276, 33132, 45068, 5066, -13343, -4171]
17675d171l5013l1014J0460O5832K1529j3154O993J7295K831Q946k3240j5711
17663A1583J1857k5015k630J9547K2829L758k2094j0072K186M2033J399k6249
17651B9132K3006j2939N333k4001r990J9841l7255l6273L922J7928L1410k736
17639G378j5013J2773P612k5075K9162k869l1498L6512L0340L253l0966m3649
17627b2040n605J1256j3145j337J1415l1144J7876L2064k614K5286L0457J2384
17615F4853J5976J094l1193k2268j4832P901J2305J943J7133K5482J0268j9457
17603F9205l3095k5743Q189j5744p897j0500j911O717N843J0229K3262L142L924
17590C5621k0713j3882j92M999K2253l4836j9689J6088J464m2005j2228J4747
$$ y = [-4171, -39184, -70198, -59738, 6094, 27623, 14469, 21462, 38757, 41588, 50534, 27294, 11583, 23440, -1575, -4205, 15342, 38171, 41929, 19835, 9763, 11949, 53982, 55381, 29132, 52138, 39199, 44532, 20531, 10541, 30382, -6873, -43146, -39224, -21296, 10114, 7378, -7635, 5138, 12750, -12325, 16837, 13968, -17530, 18982, 49322, 52575, 21609, -22040, -27645, -16389, -29534, -30871, -19456, -50600, -32724, -660, -3274, 22012, 52469, 64853, 80829, 81923, 50730, 28462, 13630, 21531, 33836, 35779, 52912, 78394, 88662, 69205, 36110, 10367, 18556, 2812, -5085, -15585, -17496, -10779, -4936, 5293, 28555, 31697, 35621, 14908, 1026, 834, 5833, 28086, -6750, -26439, -10351, -8887, -50892, -63120, -48373]
17578d8373L8477N804l3622K8753J0480J5451r26J3408L9714j6876k4774l5935
17566h419j4933L8935N094L4350J9053j4424k0115j5038l8430l0948k8208p207
17554h0290K5280J4994J4772q205j1889k9084L0320K7224L6024K7496l4415l3184
17542b0957L9624K2025k2935n7982J0915K2856j9982o020L7083L7342J3941k1997
17530C3913j3957K3621m203j9149K45m12m4756j6755M4861P05q625j4149K644
17517a6017j6038K7149O39n1634k4937J6612q86M0434M2178k3650k1971j1195
17505c9316k560j4027k6249j3138j2028K5027K3708K864J5371l0568K6866m330
17493d8380o288N8153N2008r10l5541m533K337n924J5401j3791L715L2369K7161
$$ y = [-48373, -9896, -4092, -37714, -8961, 1519, 16970, 16044, 29452, 69166, 52290, 27516, -8419, -23352, 15583, 20677, 55027, 74080, 59656, 39541, 24503, -13927, -44875, -73083, -80290, -55010, -40016, -25244, -33449, -45338, -74422, -44102, -16878, 19146, 46642, 12227, -20957, 18667, 40692, 17757, -40225, -29310, -6454, -26436, -32456, 4627, 41969, 55910, 33913, 19956, 43577, 39374, 20225, 20470, 20058, -24698, -41453, 3408, 4113, -4512, -18661, -16017, -32055, -4906, -4267, -55901, -80838, -64226, -65112, -24678, 17500, -6150, -28121, -39316, -41876, -55903, -82152, -95290, -107318, -82291, -58583, -55719, -40348, -70916, -44050, -48380, -54668, 3485, 55493, 54583, 19042, 14509, 16846, 10922, 26323, 12532, 16247, 48616, 75777]
17480G5777k6259O751o008m5154j3843K6170P712k9362k0138p914p658R764L5803
17467E641M644n2099j7375j0304P937k3627P862J3261l3968o396O050O2692R957
17454b5725J740K4173L2549j0494q434P772k087m5914m7598j6526P1524l282J3101
17441i201O6411J39998J77673J45349m8786j40070j25114q9444l7218l0875q689
17430D0034j0717J4061K225j9733k1918l5992l5525M4904M7742J4056j4068l8025
17418a2956j729O541j6839J2388K1119p462k5663J2002M0049J7905k4179j0098
17406A1078n849m961K2635M373k6403l2224r998j4667L0858J4429K6208P094r385
17393A3188p581k6773K0277K2348q553n4311J5902J4205O2329n426j5690K093
$$ y = [75777, 49518, 56269, 50261, 5107, -8736, 17434, 25146, -4216, -24354, -32268, -39926, -30162, 5641, 10285, -41814, -59189, -69493, -61556, -85183, -77321, -64060, -98028, -104424, -98374, -35682, -25725, -23985, 188, 32737, 22243, 13809, 21581, 19494, -26420, -74018, -90544, -19020, -22302, -9201, 57210, 197208, 374881, 520230, 471444, 331374, 206260, 116816, 79598, 48723, 40034, 29317, 43378, 45603, 25870, 3952, -32040, -67565, -22661, 25081, 39137, 25069, -12956, -14685, -8144, -24983, -12595, 8524, 1062, -24601, -12599, 27450, 45355, 21176, 11078, 5229, 268, 22903, 27276, 873, -31351, -41349, -56016, -25158, -10729, 15479, 22573, 13188, 5607, -21166, -889, 21459, 12906, -41405, -25503, -11298, 51031, 45605, 29915, 32008]
17381C2008k0841j4870j8538J944J3698J6214L885j7435k7739J2230K5439j2496
17369f501J8818N453L3148K2251k0525n0793j7841n4762N725N504p174L4215M5377
17356A2895j2731N478k2471k9829M6485k559l3216k6518j7745K0554R137K057
17344d8463O714q495J0423K4304J4554p861l960N636J5509n4m4446P908K1281
17331f950j5482r50J5287P393o116K692J1315j817k4141q311j4186o887L0542
17318a7611J1521p1276J7769P9408j0711k0802k3260k9931l508j557k5276m404
17306i9638l021K4464L510K0552K3872q015J1733j2027L834j7380j9075N626J4161
17293e1404K1049M8337J342r885J7236j5128k0531J4313M038j7388j9092j1002
$$ y = [32008, 11167, -3703, -22241, -20297, -6599, 9615, 13500, -3935, -31674, -19444, 5995, -6501, 12317, 17770, 50918, 73169, 52644, 1851, -15990, -70752, -65027, -59523, -66697, -32482, 12895, 164, 5642, -16829, -46658, -173, -2732, -35948, -62466, -80211, -59657, -50520, -48463, -41749, -50244, -39821, -15517, -963, -8824, -12784, -7148, 8361, 8307, -36139, -28231, -6950, -22432, -23382, -8095, -702, -6818, -4126, 7189, 5372, -18769, -27080, -41266, -48153, -17611, -6090, -77366, -59597, 19811, 9100, -11702, -34962, -64893, -68401, -69958, -95234, -99638, -102659, -78195, -74685, -54133, -30261, -38276, -26543, -38570, -34736, -52116, -71191, -65565, -51404, -30355, 17982, 19324, 9439, 26675, 11547, -8984, 5329, 9367, -8021, -27113, -38115]
17281c8115J7607J0932p494j9923L654l71j144J6098K740P36M8466J8033k1494
17268B9725k0038k382k639q248J2k0810o216p710L024L2788J8897k712L607Q976
17254B6274k3499o2856j0148L2193L7722L518l8563n1110r362K6136J8360J6834
17242c4501L6353k654n266j0392m862q5j666k290J8453o52l9767k4133L5817L6208
17228E63K7117k04K0428m250j4245l9145k0245k4808q766K4973L8739j6641r755
17215b6239j0363L6325R847j8062j2794R110J8964K4912J3559j9391n762l3685
17203a3579k7438q497L4874j2797l0391k6626J5120R078K037j5160j4553L1163
17191e6769M1928P094r613R124J6653L744k3438M008j8165j2120K4473J5640K9910
$$ y = [-38115, -20508, -9576, -17070, -36993, -33339, -33710, -34854, -18756, -16016, -15280, 33186, 51219, 29725, 9687, 7305, 4666, -3582, -3570, -24380, -30596, -38306, -35282, -2494, 16403, 13691, 17298, 26274, 2775, -60081, -70229, -38036, -314, 3204, -35359, -86469, -95831, -69695, -51335, -34501, 1852, -802, -6068, -16460, -21322, -21407, -23073, -25363, -6910, -7562, -47329, -71462, -35645, 563, 27680, 27476, 47904, 43654, 29409, -9736, -29981, -54789, -63555, -38582, 157, -16484, -26239, -36602, -277, 9570, -8492, -21286, -12176, 6788, 31700, 45259, 25868, 20106, -13579, -41017, -49514, -14640, -27437, -57828, -84454, -69334, -60256, -58219, -73379, -87932, -56769, -14841, -7747, -17360, -8236, 8417, 12161, -11277, -7269, -25434, -37554, -13081, 2559, 32469]
17178C2469j4990O113L7691J2947K503j4048Q71k4801J5699L2909j7532m0850
17166B8981j5729q953L8297K8390o048j2394q304k6731j9086j2242j3678N240
17154b2257K1066j054J6350J026l0250K0483N403J9747L7754k6645l4786n4658
17142d7821r521J4698m4790j2351N0323M7223L7443p463j8742j0895L15M552n765
17129b794P519J1079K589K0465K656R708M501J6121k1193k9109J9050R930k6469
17116B4053k4215j0168j2816J2263K2645l2417j2623J1676Q709Q272L5899p733
17104B3545l687j97l349K6520j6579k7526j7205j4763K7067j4425L0563K7168
17092C7132j880j3591n3324j7324M7584r513k9070O674J7758J4409M486L2877
$$ y = [32469, 17479, 23592, 61283, 74230, 76733, 62685, 63556, 38755, 54454, 87363, 69831, 28981, 13252, 4299, 42596, 70986, 64938, 52544, 44240, 17509, -1577, -13819, -27497, -22257, -1191, -2245, 14105, 15131, -15119, 5364, 10767, 30514, 68268, 41623, 6837, -47821, -57342, -42644, -87434, -99785, -49462, -2239, 35204, 27741, 8999, -1896, -1581, 2971, -2794, 4725, 15804, 18393, 38858, 41514, 51222, 55723, 71844, 50651, 21542, 40592, 50522, 24053, -162, -10330, -23146, -10883, 11762, -20655, -33278, -21602, -12893, -4621, 31278, 23545, 19858, 19661, 16312, 42832, 26253, -1273, -18478, -33241, -6174, -20599, 9964, 37132, 35252, 21661, -31663, -48987, -1403, -10916, -39986, -33312, -15554, -1145, 3341, 36218]
17080C6218K1524m2883k4761j6217Q92j3051M747K4279j1342k5387J4857L4955
17068C831O703j113K0952J989L8035L2160n560j4185k952j2794J6848J2164n246
17055I0832k6313J1912L549k4876n492L866L439j7534j2400n2616j7124M2939
17043A82L7714p417r234J6603N332k0053j2989q019l6771K1809K2683J3039k2913
17030c4k8133J7528K1554j8411j1465J4624k72P893J6430Q560n3654q039K2311
17017a1108m5613O530L1848m720q966k1765M3154M4574K6400l2901m6639p4j7208
17004c6488j1377j5350R603L2257J4441L4650k7659q147J9432j9120r635k0922
16992c8315j0737J2118J0894k2455j0578Q117L5038L6080k5293o809o180J0336
$$ y = [36218, 57742, 14859, -9902, -26119, -25227, -38278, -33531, -9252, -20594, -45981, -31124, 3831, 10534, 9421, 30373, 32362, 70397, 102557, 96997, 82812, 79860, 67066, 83914, 96078, 90832, 64519, 76431, 79980, 55104, 49612, 53478, 56917, 39383, 26983, -25633, -42757, 182, 37896, 30479, 21245, 37848, 43180, 23127, 10138, 2119, -34652, -12843, 9840, 22879, -34, -28167, -10639, 10915, -7496, -18961, -4337, -4609, 3284, 19714, 28274, -25380, -33419, -11108, -56721, -50191, -18343, -23063, -32029, -53794, -10640, 33934, 60334, 27433, -19206, -19280, -36488, -47865, -63215, -53612, -21355, -6914, 27736, 77, -8070, 11362, -7758, -17393, -38315, -49052, -36934, -26040, -48495, -59073, -50956, -15918, 20162, -5131, -11940, -18120, -7784]
16980g784K5360k7124l6391q219Q690M966j3390J7069J6504q042k5743K2539K4654
16967f911K2757j1615Q916L0773O847n9141l4815L4356o426j3137l62r628J6711
16954b1675j6332k4482L724J2129J6494L6132J7506k2740k6518N8432j7565n2237
16942c7132k518N627j4761k6735j712n401L2574p576j7934K1658L5376O385q201
16929b0350j7325k0458P722K4062Q266J743k4019j2637r966K1143J6078J672q110
16916c2179R90K6421j5238l809L8692l7076m0206J1793O976K2239L1377k1271
16904a1291j9763J3452K7777K1292j9252n2310K177K4203L851n558p869K464q465
16891b9292J8147M682m0790o442J5003j4446J273J7219J6880J2266J5629J6072
$$ y = [-7784, 17576, -9548, -45939, -54158, -45468, -40502, -53892, -36823, -20319, -28361, -54104, -31565, -6911, 15846, 4231, 13147, 43920, 50767, -8374, -43189, -8833, -15259, -28396, -28758, -38386, -21675, -38007, -62489, -58765, -46636, -30142, 5990, 23496, 756, -25762, 32670, 15105, -37132, -39650, -34023, -48784, -75519, -77231, -82632, -50058, -57634, -75568, -53910, -18534, -12149, -20350, -37675, -58133, -50411, -26349, -18083, -16340, -40359, -52996, -62962, -41819, -25741, -24069, -32179, -31189, -4768, -20006, -23815, 14877, -22199, -62405, -50612, -43636, -21397, 9980, -11291, -31054, -17602, 10175, 31467, 12215, -40095, -37918, -13715, -9864, -15422, -23291, -20827, -29292, -11145, -6463, -47253, -53695, -38692, -53138, -51865, -34646, -17766, -5500, 10129, 26201]
16879B6201j7533j8136m8895m0541L1026L6412q290J0380L5535r860k0810l211
16867b7722k2471l3971o448j6686J2186J8881M1682J0541n278q674J6280K5448
16855C768R035K7714k4533j1589k8190j3303l0259K7796k700L1739J1489J59k0578
16842a9452k4238r934K8320R825L5983J6589j8420p29J7799J8183l5560k0085
16830a719M262L682o317k760k3195j2223L422r248j685j387M419J1592o642k9589
16816f7388J7275j2818j8673J4110J0469k3114j7681N61L6246L2307N338M792
16804a8576q178k992L189K4946M0748m1613m6941l0122M2420J5291J3027K0042
16792A1241J5383r766j5475j9625J6418J9017k9538K314j535n739o465j2531K2686
$$ y = [26201, 8668, -9468, -58363, -98904, -67878, -31466, -39756, -29376, 6159, -3701, -24511, -27722, -50193, -84164, -90612, -107298, -95112, -76231, -34549, -24008, -29286, -37960, -21680, 3768, 12803, 40517, 15984, 4395, -23795, -37098, -67357, -39561, -42261, -10522, 967, 1126, -19452, -43690, -53624, -25304, -15479, 20504, 37093, 18673, 17944, 35743, 53926, 18366, -1719, 2543, 6225, -92, -2852, -26047, -38270, -34848, -44096, -45781, -47168, -42749, -31157, -37799, -67388, -50113, -62931, -81604, -67494, -57025, -80139, -97820, -97259, -61013, -28706, -23368, -18576, -26754, -29746, -26557, -1611, 39137, -2476, -49417, -79539, -37119, -21828, -8801, 11241, 26624, 16858, 1383, -18242, -1824, 17193, -12345, -10031, -11566, -17305, -23770, -36301, -13615]
16779a3615J4912J4775J2429P819O525k3356K5825k621j1314n4346J665N2836
16767C1534nk8730R225N4266m234l0851l0955k4376N821K2860j268J966J1397
16754A6650J712l1778l5229N093k2495n567o477k2699K3605M1990L9287K7509
16742C1601l0436J747L6113j1900j9630j7704p077l242r824o556M394J6465q161
16729b4210j8394J1741J7337L091n2690r387J4907l806L1060M5052m0586k3410
16717d9295j4506N4894n07J4628J1069k2676O62K7782Q807k5577j6277k5347J4878
16704b1465r682J339L0658o3477k0546J3630J8697k1102r66L1546j0834K95j5210
16691f7117N686J3965n57J1249J2200O671O001Q221K0210K04J1926Q36n483m78
$$ y = [-13615, 1297, 16072, 28501, 36320, 42845, 19489, 45314, 42693, 31379, -22967, -21302, 31534, 31529, 2799, 12024, 66290, 62056, 31205, 250, -24126, -18305, 4555, 3287, 5253, 16650, 18362, -13416, -48645, -43552, -66047, -71614, -78091, -100790, -77185, -35195, 4092, 31601, 1165, 2912, 39025, 27125, 7495, -10209, -17286, -20528, -30352, -36908, -32514, -16049, -24210, -42604, -30863, -13526, -10435, -63125, -72512, -57605, -61411, -30351, 14701, -25885, -49295, -63801, -8907, -9414, 5214, 16283, -6393, -5731, 22051, 30858, 5281, -10996, -36343, -21465, -31147, -29808, 850, -62627, -83173, -69543, -50846, -71948, -72914, -41368, -52202, -51907, -67117, -61431, -47466, -48023, -36774, -24574, -17903, -11902, -3681, 16529, 16733, 28659, 29495, 24012, 23534]
16677B3534J2063L398j3897J2083l917j1569J4163J8430k8105J2673L0610R571
16665G9037k9246l4568m3907k7489k64K0798L5480K5644R579O755j3784l032r759
16652A5244J2440O303L129Q782j3141M224l042J7648J8065l5848j9343L874l1434
16639a3099J6915k5277N924j980o5340R889J6787j8423J4446K6592L8017O328
16627A0779j8247r493n3326j9468j1344J9842J4449N4511J7934j3076P26K3983
16615A7270k785k8719j7033K6774R850J9837j0469J7096P412l717m987p143o943
16602A6443J0624l2077r207j4541l4952L3478K819j822J7236J3208J8592J9334
16590C9135Q301m5526k8753L9827J8662M2286J4598m0068Q857j427l1976p174
$$ y = [23534, 35597, 38995, 25098, 37181, 33264, 21695, 35858, 54288, 26183, 38856, 69466, 79037, 49791, 15223, -28684, -56173, -56437, -35639, -159, 25485, 35064, 41819, 28035, 25003, 15244, 27684, 33987, 37116, 45898, 32757, 36981, 33939, 51587, 69652, 33804, 14461, 18335, -13099, 3816, -21461, -15537, -17517, -82857, -72968, -56181, -74604, -60158, -33566, 4451, 10779, -7468, -16961, -70287, -89755, -101099, -81257, -66808, -12297, 5637, -7439, -6713, 17270, 14485, -14234, -31267, -4493, 5357, 25194, 14725, 31821, 39233, 35516, 30529, 23386, 16443, 27067, -5010, -14217, -28758, -63710, -30232, -27413, -29235, -11999, 1209, 19801, 39135, 47436, 1910, -26843, 12984, 31646, 73932, 88530, 48462, 57319, 55892, 23916, 16742]
16578A6742J781r759k717k0434N956N9029K4904o4667l494M1972j8130j7587K3148
16565C6744j998k3361q669J4220j3960q794J9216k4880m5895r14J6836K691K8999
16552i765K2150J207J5815l5971k1093L7811l504L675O657j6051k6801K1124K5170
16539B0424j4446r698L997n429j3226m527j8067K9449r038j6185j0618j3115j7911
16526g8390J9462O6768l958k5238J6066L105q051j0479j3885L768Q281K0956J6018
16513A4423j5675j9716j9730Q742P226j3489j4925K9735M3127k2216l5795K006
16501c6287L7770J8080L8158r265K2063k31o7733k8705r352j977L0291R125K048
16488C985n561m3580j32J2069P468j5983J5200K2651O272m131K0488r383J9530
$$ y = [16742, 18523, 8764, 6047, -14387, -8431, 50598, 75502, 10835, 7341, 49313, 31183, 13596, 36744, 34746, 11385, 2716, 16936, 2976, -5818, 13398, -11482, -57377, -58291, -41455, -38764, -9765, 12385, 13592, 29407, -6564, -27657, 10154, 6650, 10325, 16982, 931, -25870, -4746, 20424, 5978, -3720, 277, -5152, -18378, -22905, -40972, -11523, -20561, -36746, -47364, -60479, -78390, -58928, 7840, 3882, -21356, -5290, -2185, -10236, -20715, -34600, -30832, -22551, -1595, 14423, -1252, -20968, -40698, -31956, -24730, -38219, -53144, -23409, 19718, -2498, -38293, -36287, 1483, 19563, 57721, 48456, 70519, 70288, 2555, -26150, -35502, -37479, -7188, 1937, 3985, -1576, -45156, -45288, -33219, -25751, -41734, -26534, -3883, 2389, -1742, 18746, 9363, 28893]
16475B8893O137j8468N25R280l4531K694L0134j49l3386K4951k2763m1470R52
16462d7201j294O4944J3095o4858m6072L5885K8062k2163K565J4572J9797L161
16450D93K1766k9802j0479j539j6531L311K4410O934O380o832J8772k2075o711
16437a1903J5087k9981j5638L7699L9150p893J8921q997J1283q400r754j5033
16425A4541m0514j1109j7098j4458L6862N6074q405N06j4688k3916m181K4146
16413b240J0857J3758n729j7778J2817L4945j1937J2119n186K693O065l3935o084
16400A0365k3562q715k920M5275K0448n933l8575j7316J0689J2904j489n6361
16388e5190l5003L2388J6113K0538M3496N108R614L16l0555j9081J286Q934J0909
$$ y = [28893, 35030, 16562, 17087, 26367, -8164, -5470, 24664, 24515, -8871, 16080, -6683, -48153, -47201, -48495, 16449, 29544, -35314, -81386, -45501, -17439, -39602, -37037, -22465, -2668, 493, 22259, -7543, -18022, -19561, -36092, -32781, -8371, -1437, 4943, -1889, 16883, -5192, -11903, 3184, -26797, -42435, -4736, 34414, 26521, 45442, 36445, 47728, 39328, 29574, 14541, -25973, -37082, -54180, -68638, -31776, 24298, 15893, 16399, 1711, -22205, -26386, -2240, 8617, 22375, 16646, -1132, 11685, 46630, 34693, 46812, 41626, 44319, 50384, 16449, 10365, -13197, -21912, -24832, 20443, 40891, 34958, -3617, -20933, -10244, 2660, 1171, -55190, -90193, -57805, -41692, -21154, 22342, 27450, 37064, 37380, 6825, -12256, -10970, -2036, 8873]
16375H873L8206n670K1435l370m5919l1965o428J9695j1768P925n316J1899J4195
16362A1792j0323j3064P391l9660m973J4478J2762j0702q244J0075j944J1128
16350b1284J3469j2968j2132K1446J2160j4236J025P63j3820j4235J5986L4923
16338A1097l2678n8251j1157K3291N2050L6689n325r690J4673R357k0713M613
16326A3956j668j7962j5171j5809J3573M2434J6082l3121J101J0677J0915M138
16314B9145P694L449J15k0156p913K6242J9920l64j3049n1m4990j2647j8083o611
16300c7299k402j4209N140Q717n839P508K3385m407r498l1551J4682K439l227
16287d6561J4273l989l399L1600L3233k4533j6276N434P041M064K7349k540j133
$$ y = [8873, 47079, 41409, 62844, 59474, 13555, -18410, -24838, -5143, -16911, -8986, -14302, -2403, 11792, 1469, -11595, -4204, -43864, -48837, -34359, -21597, -32299, -40543, -30468, -32412, -21284, -7815, -20783, -32915, -11469, 691, -13545, -12520, -11757, -25577, -39812, -23826, 11097, -21581, -79832, -90989, -67698, -15648, 21041, 15716, 6026, 20699, 30056, 9343, 13956, 12288, -5674, -20845, -36654, -23081, 19353, 35435, 2314, 3415, 14092, 25007, 29145, 36839, 40288, 40403, 20247, 12334, 38576, 58496, 58132, 45083, 45032, 42, -12605, -30688, -37299, -39701, -53910, -48770, -40053, -45892, -38384, -14999, -19406, -28904, -60455, -45773, -43334, -46561, -32288, -36277, -39676, -8076, 25157, 624, -15652, -10218, -3177, 887, 28236, 25696, 24563]
16274B4563K6230R206o0307m1447j4341Q725M4500L6365j8308k9754q259j0107
16262c2934M0731L897l1909P802l575J7061k9464k9275R146J8450k5348M174L5141
16249a6103l067K3774M785O519j5747j1534l173p913k4618k01K1026M5258N35
16236A9541O591j8041j6542J294n127J7586J1398R313N542l476m6337l9469K0163
16223c7564N4019l590j3787J3190rJ8466o810k3303K3842p445l5896J826M7642
16210C0581J1812O130r61l1862M409r818r340K5044L4688p885l0601R12k4710
16197a601K3200q079j9812J2481J6292k354j9833m3739q421K9876p268J1444L0581
16184A2767J2415j3391l3676J867P862k521J9767j4206K090J2990J6079L065K9334
$$ y = [24563, 50793, 59999, -308, -41755, -56096, -47371, -2871, 33494, 15186, -14568, -22827, -32934, 7797, 11694, -20215, -12413, -15988, 1073, -28391, -57666, -48520, -30070, -55418, -51244, -16103, -19170, 4604, 9389, 15908, 161, -11373, -14546, -22459, -47077, -47278, -26252, 19006, 19541, 26132, 8091, -8451, -7157, -12284, 5302, 16700, 26013, 31555, 28079, -18258, -57727, -37564, 16455, 12865, -922, 12268, 12259, 30725, 23915, 612, 24454, 17009, -18887, -17061, 30581, 42393, 48523, 47562, 15700, 20109, 10291, 951, 25995, 60683, 52798, 22197, 23109, -1601, 21599, 13520, -6292, 6189, 22481, 20127, 294, -43445, -51866, -21990, -29258, -17814, 12767, 25182, 11791, -21885, -20018, -12156, -14677, 5090, -9116, -7026, 5964, 22043, 25108, 54442]
16171E4442j6368k7052q103L1465K0166L1724l6569k8950k860M0291R591l0158
16159C7619L044l861m4248k7500K3080R702J9590q955m719M996M2113O176o1656
16146d619j8335j6726J0389M3346K7175k8541k1139j9389j6317k6919n438N328
16134g1185M722J0500p405j8483k2481M0379K2896J3068J0835L1187k6911j4752
16122b7630l2092k5737L2312j5551m496O0644L2653j4077n559O214j5781j1001
16110b0101J0200l16N323Q228j9270j843O074K9377n061k6902r038K8906M1515
16097D7092M705l3109l1078L0184K7719k7288R194J7691j7340m850l471Q635K4198
16084E2282L0846J7494o6325m1198j0450m4154p162P612j8940K0488J8724J0074
$$ y = [54442, 38074, 11022, 2919, 34384, 54550, 86274, 49705, 20755, 17895, 58186, 67777, 37619, 40663, 36802, -7446, -34946, -11866, -2164, 17426, 8471, 3752, 8748, 50861, 57037, -4619, -22954, -39680, -29291, 14055, 41230, 12689, -8450, -27839, -44156, -71075, -76513, -71185, -66463, -55963, -63368, -81851, -104332, -63953, -41057, -27989, -17154, 14033, -12878, -27630, -59722, -85459, -53147, -68698, -73194, -12550, 20103, 6026, 467, 6681, -9100, -20101, -9901, -10217, -4894, 3334, -15936, -17779, -11705, 17672, 12611, -14291, -23329, 5577, 47092, 51797, 18688, -12390, 17794, 45513, 18225, 27419, 45110, 27770, 22920, 19449, 28084, 52282, 83128, 100622, 34297, -6901, -17351, -61505, -68667, -61055, -79995, -59507, -40783, -30709]
16072c0709J6768j3176K6470J5188q590j3106k8146k4293J9279M9744k5604P122
16060i053L7732l490n396k6193l2451L9337J0904J0796L1702M438Q671j4176l2262
16047B0559q327J4605j2518m865k7841N420J9876q951O694K0416R173o147k1717
16034F377m404l7389N241Q438j7117k1628M580n133J3937Q2021K9748J0324j9885
16021E5110r897j6973O385k0891l9733n6863J6909Q623K0813O760k8063j3733
16009g1553L847O669K5223M626O375k0211J1421M611l5951k7732L8158J8109j9398
15996e5806K0051o838j3348J4269j2385J8421N2411M0641k6760l0306j0291M8518
15984C8577r025j9584K7063j1887j9196k0197p553J3430J0680q880k8476O007
$$ y = [-30709, -13941, -27117, -647, 14541, 5951, -7155, -35301, -59594, -40315, 9429, -16175, -9053, 28679, 25189, 19793, -6400, -38851, 486, 11390, 22186, 53888, 58326, 66997, 52821, 20559, 12232, 26837, 14319, 9454, -18387, -12967, 6909, -2042, 4652, 25068, 34241, 28094, 6377, 1973, -35416, -30175, -21737, -38854, -60482, -55902, -61035, -47098, 34923, 64671, 74995, 55110, 45213, 28240, 34625, 13734, -25999, -82862, -65953, -57330, -36517, -29757, -57820, -71553, -67706, -61037, -35814, -31188, -24813, -45024, -33603, -28992, -64943, -92675, -54517, -36408, -55806, -35755, -42593, -55941, -41672, -54057, -35636, 16775, 57416, 30656, 350, -9941, 38577, 29552, 9968, 37031, 25144, 5948, -14249, -21802, -8372, 2308, -6572, -35048, -29041]
15972b9041k0470Q16M8907N3355J1628k0445l7039k3010j9324k1109M6256J0177
15960G01o1148j090J5298o743l0223j9309l6769L8345K4550J6319K7665R757J1791
15947a0856o611l0546r34K5223J6227K4317K2904m389j6252l0354j345l1604k6318
15934g0538r719J8054Q292L1074m726J7497J628k9917k099J7083J0125p079p829
15921b8154m623J2568k3136L922J4495j8217J0237l475M4209K7875P163K422n8155
15908a2869N751K3324M3124l570k6900m7085m5013m2087j026L1999k424l98K3390
15895e3784L8054Q470J2629l411M909j7519m4908m373J797J2950L6413j5415J1436
15882a2752Q016Q824L4649k4695k6055J1786M104J2143J423k2779O640M293n626
$$ y = [-29041, -49511, -48695, 212, 53567, 65195, 44750, 7711, -15299, -34623, -55732, -9476, 701, -60447, -61537, -46239, -52982, -83205, -102514, -139283, -100938, -76388, -60069, -32404, -22647, -10856, -17467, -48013, -48947, -23724, -7497, 16820, 39724, 35335, 19083, -11271, -12616, -44220, -70538, -80257, -62203, -53911, -22837, -27563, -10066, -8438, -38355, -40454, -23371, -13246, -20325, -28154, -32777, -20209, -43345, -39423, -24928, -43145, -32908, -36383, 7826, 35701, 42864, 45286, -12869, -7118, 16206, 59330, 55760, 28860, -18225, -63238, -105325, -106351, -74352, -76776, -77174, -53784, -15730, -7260, 5369, 1958, 6867, -10652, -55560, -59933, -58136, -45186, -8773, -24188, -12752, -4736, 4088, 38737, 14042, -12013, -227, 3877, 16020, 17443, -5336, 1304, 5597, -29]
15869b9k1701k3494K0616k012j2693L3942L6197q89J468j2873L0056j1594k004
15856C4990l3724l1794j3703K98M459j2545K7897m3154k2514K0601L0433J7721
15844b1035k0623j916J4254j0535j8356M1473O662N588m8451l5885Q630L4123
15832d6071J5240J4401K0881L9801j7522l4854k9360j3790K1618L1565R842L002
15820A4753k8340J7424J7970M434j8237j8392m139K7297L1473j6960m1160l9562
15808e3439n336M0913J103k4635K9900L1625J6832q117O434j5463k4386j0465
15796a5034R825L123L773L603Q851j7741j8097l9032K9247M5099K696j7203J0317
15783I427O391n977j2816k6239k0776j1789p248l1004K2448P0062L30m1780j7506
$$ y = [-29, -21730, -45224, -24608, -26620, -39313, -5371, 30826, 29937, 31405, 18532, 48588, 36994, 34990, 1266, -30528, -44231, -43933, -39474, -52019, -24122, -67276, -89790, -69189, -38756, -21035, -41658, -43574, -29320, -39855, -58211, -16738, -10076, -4488, -52939, -88824, -80194, -46071, -30831, -16430, 4451, 44252, 26730, -8124, -37484, -51274, -29656, 1909, 11751, 14753, -13587, 3837, 21807, 26241, 8004, -10388, -14527, 12770, 44243, 27283, -13877, -53439, -58775, -17862, -16759, -41394, -11494, 20131, 36963, 28846, 35280, 19817, -4569, -15034, -5209, -2086, 1687, 5290, 14141, -3600, -21697, -60729, -31482, 13617, 16313, -890, 9427, 15818, 9841, -2975, -29214, -49990, -61779, -69027, -100031, -77583, -7521, -7191, -48971, -66477]
15770f6477L3138J0072K161k992j6717m150K6531j2705j8422k5913j7542J4658
15758g8358J1435M813L8614J5977J065k5493O226J1710K4191j6781O673M1052
15746D1124j7732j0701j2516K878M1854m138l7547j7616m4425K245k3422j870
15734h1866R799M5879N321Q735n150l7050K2917K0038L2815L0256K3808j7251
15722E8251n1666o5782N830L6949J4512J3540l9394j449Q253q170l0289K4554
15710c4861N7048j14k5992l7171P040K6200q656J1487m814l1708K8257k475O547
15697i212r967j7275K8199M1516o432l1546L8693N5744j7953l7658k5053k1369
15685a2313j945L5336J8123k3795m855o119m1774Q950J707J861L8683k4922l4426
$$ y = [-66477, -33339, -23267, -21106, -24098, -40815, -44965, -18434, -31139, -49561, -75474, -93016, -78358, -66923, -62110, -23496, -7519, -6454, -31947, -25721, -14011, 10180, -6601, 72, 41124, 23392, 12691, 175, 3053, 44907, 40769, 3222, -14394, -58819, -56574, -79996, -81866, -72067, -26188, -20867, -12132, -17282, -54332, -31415, -11377, 21438, 51694, 75502, 58251, 6585, -59197, -53367, -16418, -1906, 11634, -27760, -29209, -20956, -29126, -59415, -34861, 22187, 22073, -3919, -41090, -34050, -7850, -16506, -5019, -9833, -41541, -13284, -15759, -9212, -19179, -36454, -8255, 33261, 26829, -4717, 33976, 89720, 71767, 34109, 9056, -12313, -14258, 21078, 39201, 15406, 10551, 4432, -37342, -28392, -26685, -24824, 13859, -11063, -45489]
15672d5489j3568L9501J7733k6762j3286M540J5611J8719j504m570K9270J7491
15660C7686j2401n958k9116J2785K1748K2962J0978Q934L1686o5414o3968k1431
15648e1509J7570J3266J3555Q855j9210m7360r997P880O380j5550m397J7324L1321
15635c1872M480j434k3510k5404J8787J4366P153j3260J4118j827K2467K0274
15623D338l391m038j364k6877J1727k3387o520M797j2817L604j5077J8974K3955
15610b6076m0749O851P1119J9591j7365k8071j7466j8244j1363j5970M349L1897
15598d1497Q347J3550J5867n612L113K802K1992j3824L864J2381j2713j5502J7875
15585A0643m1880q706J4170N373m0684J4611K3323j71m2084j4135M5064Q747K7495
$$ y = [-45489, -59057, -19556, -1823, -28585, -41871, -37331, -21720, -3001, -4505, -9075, 20195, 37686, 25285, 19327, -9789, 2996, 24744, 47706, 58684, 67618, 99304, 33890, -30078, -51509, -33939, -20673, -7118, 1737, -17473, -64833, -74830, -66950, -60570, -76120, -80517, -63193, -31872, -27392, -28826, -52336, -77740, -58953, -44587, -37434, -50694, -36576, -38403, -15936, 4338, 947, -3091, -4455, -31332, -19605, -42992, -49512, -44715, -57532, -53928, -69005, -50031, -26076, -66825, -59974, 11145, 30736, 13371, -14700, -32166, -50410, -61773, -77743, -73394, -41497, -33150, -19600, -3733, -9345, -6232, -3430, 18562, 4738, 8602, 20983, 8270, -7232, 10643, -31237, -39943, -25773, -20400, -61084, -46473, -23150, -23321, -65405, -79540, -34476, -25729, 1766]
15572A766j583j8511j8705K4250R93J2273q039j4737M3204j3035j1287P599M5962
15559E0150J6905k7511m2034n4991P818J0033K1207O561O8302O269o0486j9875
15547a7652j5650J7724j8755J0933J7777J9103K141j8983J7135K1091O800J0670
15535E2334k6367m851M688J3269O085k3584j2051J5122O597J6803J194k9977j2247
15522G015J7794o295l5078j92k1368j0943j5798L5001N0753k1718p211J6740q469
15509B31j2137k1639K2754M439l1498j1327J4996J1071q986Q93L9019n38n09K2794
15495B9563L0747k4010l3501k637l3503J9172K1151j554m4003l0646J5196L493
15483e0532j8670j1254o947L6817L7814O301K55l1132j2736L1107j4821P583J0755
$$ y = [1766, 183, -18328, -37033, -12783, -11790, 483, -7556, -22293, 20911, 7876, -3411, 4188, 50150, 67055, 39544, -2490, -57481, -49663, -39630, -18423, -11862, 56440, 62709, 2223, -17652, -33302, -15578, -34333, -23400, -5623, 13480, 15621, -3362, 13773, 34864, 41664, 52334, 25967, 21116, 25804, 39073, 45158, 21574, 9523, 24645, 31242, 48045, 49239, 19262, 7015, 24809, 18514, -16564, -16756, -38124, -49067, -64865, -29864, 20889, -829, -8040, 8700, 231, -11906, -33545, -10791, -6352, -37850, -49177, -34181, -23110, -32096, -31203, 7816, 7278, 6769, 29563, 60310, 36300, 2799, 162, -33341, -14169, 6982, 5428, -38575, -69221, -54025, -50532, -69202, -80456, -87403, -50586, -12772, -6471, -6216, -37348, -50084, -18977, -33798, -26215, -15460]
15470a5460r406K9759L561J5652P740L04k7526K7828q84o917J882m4309k1799
15457c9575L5029j0925k6907O8030N3702l0423m3451m378J4330L3068p338k3980
15445A7182n4305j6549J4408J5513L1734k0160l0943J1547O2438q624m0485j2601
15433c0845K8298L777m396j9555R357K9249K2809k0897k7850L4514L2125m6072
15421A0514o2937l6M8531l590j662r592n233L014k4953o562J1522K7170J1292
15408b522k2524J6082j9271n144J4287M223K6744o00l5070L2144J8389k0699k4594
15395a8555R819j0912K231J1422J3618Q86k3233l2394l962J0781J7233J9849P589
15382D372l1003j7607j20J5687L5718L812Q791L0293P763n1082n904J3128K2299
$$ y = [-15460, -24866, 4893, 8454, 24106, 31846, 32150, 4624, 32452, 31568, 24651, 26533, -17776, -39575, -4546, -15471, -42378, 25652, 79354, 48931, 5480, 1102, 15432, 48500, 41162, 17182, -37123, -53672, -39264, -23751, 7983, -12177, -43120, -31573, 30865, 22241, -18244, -30845, -2547, 1230, -3166, -22721, -13364, 15885, 38694, 17797, -10053, 24461, 56586, 10514, -52423, -52459, -3928, -7518, -9180, -18772, -24005, -20991, -45944, -52506, -40984, -13814, -2522, -25046, -8964, -28235, -33379, -19092, -14869, 11875, 11275, -23795, 8349, 26738, 6039, -18555, -8736, -19648, -17417, -5995, 7623, 8509, -14724, -47118, -51080, -40299, -23066, -3217, 4372, -26631, -44238, -44358, -28671, 7047, 10859, 19650, 49943, 57706, 6624, 720, 13848, 36147]
15369C6147k0820m6727M258J8141L7029j1488k7183k3413l0751P439J0493K4510
15357b2365K0396l3975n968L381L5549J822l3448j4947J4255O444l2561k6440
15345h7857p184J616L4415J8714n407J2825J0020J3818K6271k0629o512Q58J8009
15332H957L3246M159j2760k5421k4253o881j9894j0532M4888j5l2940j0363J9802
15319c2007m5n248K2503j700r639j2581L824j9749j734L3966J5552L8408K390
15306C3940k610k5700m363J1149j945k0106j8079K4836l1575N205L5047J0649
15294A6448j4271j2953k3614l2175m090P688J391M2137J6942N299J5850K420O683
15281B7755j4988J3312k0596l2526l2519j9599L4470Q2131K1004q75k7520m6832
$$ y = [36147, 15327, -31400, -27142, -9001, 28028, 16540, -10643, -34056, -64807, -57368, -46875, -22365, -1969, -35944, -41912, -38531, -2982, -1160, -34608, -49555, -35300, -28856, -61417, -87857, -95041, -93425, -59010, -40296, -45703, -32878, -22858, -9040, 17231, -3398, -9910, -9052, 8957, 42203, 46362, 33602, 8181, -16072, -22953, -42847, -53379, -8491, -8506, -41446, -51809, -32007, -32052, -37300, -14797, -16497, -26136, -38717, -34893, -54642, -56376, -22410, -6858, 31550, 33940, 31330, 5630, 1267, 12416, 10471, -9635, -27714, -2878, -34453, -29248, 5799, 16448, 2177, -10776, -34390, -66565, -70655, -62967, -61576, -19439, -2497, 2802, 18652, 21072, 27755, 12767, 26079, 5483, -27043, -59562, -79161, -44691, 37440, 58444, 57569, 30049, -16783]
15269a6783l108l4903k3942o359K7146K8044J7031J1919M84q060j9353j7488j8272
15256f3644J3918M2055L2376K8895r441m09j6280l3481j1246O684N8196K184o207
15243D3600j2829k744p026K93l6953j357L7951K9163o253k8147k2264q854n0860
15230f6280j0515P7201K0817r215L324j6398j624J1888l9058K523j0697K423L6939
15217A328J9530q555m1305m4004K8144L3141q703q833k2402N8763N0292k8160
15205B9236l4770r918j4150j1335m05J9427J201K1484L3251L5728j0613m6236
15193A2900j684l5221k4479J2096L5939K7584q157l3441J7877M304J881J9152
15181B8751M6951J8120n1966n6318J9053P325K2935j7716o085j3149j0298j8126
$$ y = [-16783, -19891, -54794, -78736, -85095, -57949, -29905, -12874, -955, -471, -8531, -27884, -45372, -63644, -49726, -7671, 24705, 53600, 44159, 43750, 27470, -6011, -17257, -10573, 47623, 49807, 43600, 30771, 28027, 21001, 21294, -15659, -17016, 20935, 50098, 43845, 15698, -6566, -15420, -66280, -76795, 406, 21223, 12008, 15332, -1066, -2690, 9198, -29860, -27337, -38034, -35611, 1328, 20858, 12303, -29002, -73006, -44862, -11721, -20424, -29257, -51659, 7104, 57396, 29236, -5534, -15452, -29602, -40937, -41342, -21915, -20714, 770, 34021, 69749, 59136, 12900, 11216, -24005, -48484, -36388, -449, 27135, 18978, -14463, 3414, 7718, 9599, 28751, 75702, 93822, 41856, -14462, 4591, 11916, 34851, 17135, 11050, -2099, -12397, -30523]
15169c0523K9406L9871K5137M235j3265k3298K6484K1412r716m8230l6510j1392
15157b6389J9493l1414J176j5649J0603K752j4349K9416J0730j348n923L7155
15145A6253M1384l7017k1175j4012p858R987K7446K969m3302L3761J035m4562
15133c5091j1698K9570L4720K8397j3650j4540j7316k2621j0271j5846l127K0027
15121c1446J8471L8575l467p614L0988p385m1756k646j3174j3885O770K9921J118
15108D470o316L0060L5596n3939k5426P94K3572j1324l4970J0139K0629J5715
15096I000l7066O953M8222K278k5527j1870k8693j1240K9463N2359K4689N994
15084F4562N141o0352n9522O15L4256J4878k1009J7236K2432j708J8493j2313
$$ y = [-30523, -1117, 38754, 63891, 68126, 54861, 31563, 58047, 79459, 69743, 21513, -14997, -26389, -6896, -38310, -37134, -52783, -42180, -39428, -53777, -24361, -13631, -14979, -20902, 16253, 57637, 20620, -555, -14567, -22425, -12438, 15008, 17977, -25325, 8436, 9471, -35091, -46789, -17219, 17501, 45898, 32248, 17708, 392, -22229, -32500, -48346, -51473, -31446, -12975, 25600, 22133, 14519, 45507, 38122, -3634, -6280, -19454, -33339, -26569, 3352, 4470, -1846, 28214, 63810, 9871, -15555, -14761, 8811, -2513, -37483, -27344, -6715, 9000, -28066, -21113, 27109, 29387, 3860, -8010, -36703, -47943, -18480, 33879, 58568, 64562, 69703, 9351, -50171, -49556, -15300, -422, -21431, -4195, 18237, 16529, 35022, 22709]
15072B2709k2546J9758J9906j0675j6565K1601j4323k1882l2596n162J7033N755
15060a6987J3624l2597Q347K0526k307K507j5065R675k2486k8665J2804R366L880
15047c7378K3766p191L1147l2991j9698L515K477j8137Q053J0034J1054j0945
15035c6294J0776M8635o693m0200k9548J7031M5509K8512J0811n4706o0349R543
15023e6973K4327J2856J4366l3199j027L2568j1021J1730J5386L7246P997q334
15011D5922O825j0186j7364K1019J784j4040J5380n0000m8663K4699J9742J0864
14999E982J8655Q461p727k6098j8280J8106j3856n977K569K7686K2058j6154k0031
14986d606q225J7284K0842N4553j02k8697m954k613k6669J2678o696J9603p871
$$ y = [22709, 163, 19921, 39827, 29152, 12587, 34188, 19865, -2017, -34613, -39775, -22742, -16987, -3363, -35960, -27613, -7087, -9394, -6887, -21952, -12277, -34763, -63428, -50624, -41258, -37378, -13612, -20803, 10344, -22647, -42345, -38830, -36353, -54490, -46437, -36403, -25349, -36294, -25518, 23117, 16424, -23776, -53324, -36293, 9216, 37728, 48539, -6167, -66516, -56973, -32646, -19790, -5424, -38623, -39650, -7082, -18103, -6373, 9013, 46259, 54256, 45922, 52747, 42561, 25197, 46216, 48000, 33960, 49340, -660, -49323, -24624, -4882, 5982, 24637, 33098, 25371, -727, -19007, -901, -14757, -20734, -18165, 9521, 31579, 15425, -4606, -12831, 4453, 25295, 79848, 79746, 51049, 46095, 43482, 16813, 29491, 22795, 42398, 34527]
14973C4527J847m153K7802J1924j5179k5541m8836R319N9092J6430k1574p123
14961C8535M8609j6422k5625k3258k3452k7441n335L99N729J6491L277L0391P596
14948B9494K875P499j0068L0k3454n509l5473l0854J2638O6211l3920k3134L371
14935d0294N384k4277k058J9554K5092K9527J9446J1746o653n1673l4387j6388
14923f4981o881j98R42N880J0034N547J192J2160k245k579q938k1519K1182N0132
14909b72j3765j3740n4454j5673M4930M6811K0185N749j0022j1610P006j3878
14897h733j0752n9753J8931N9445j456P91M0656m9396k1096O787J94k875K8348
14884A091j1150j9046k968j9230k9146Q73j1848N8513L2931p837J5845j3965r599
$$ y = [34527, 36374, 32221, 60023, 71947, 56768, 31227, -17609, -8290, 50802, 67232, 45658, 38535, 87144, 70722, 45097, 21839, -1613, -29054, -34389, -33990, -28261, -11770, -8493, 21898, 29494, 32369, 39868, 29800, 29830, 6376, 867, -34606, -65460, -52822, 13389, -20531, -43665, -40294, -34910, -59187, -61245, -41691, -16599, 12928, 32374, 44120, 37467, -14206, -48593, -64981, -71862, -72060, -71118, -65238, -55204, -49657, -48465, -36305, -38550, -41129, -50067, -71586, -50404, -272, -14037, -27777, -82231, -97904, -52974, -6163, 14022, 19771, 9749, -1861, 5145, -8733, -19485, -79238, -60307, -862, -2318, -1527, 39129, -10267, -31363, -24576, -24382, -27257, 1091, -10059, -29105, -32073, -51303, -80449, -79576, -91424, -32911, 20, -7817, 8028, -5937, -15536]
14871a5536j2959q306O722m063O415k187L314p486p455J1996L8693K8418n643
14858C1923j5334l9456J8101k1052l62J2763j3543k7438J0861K2050R791j8635
14846c0331l3028P031K5294N278p385j902L650K1796O313J2467m563l3841k9617
14833e8838L447K2455J653J1682R294l5583j4569K8430K9442n715j8978k0626
14821d7906N2259K0530k4438k6336Q086k52l7793j5054M3914J9683j3441j6229
14809c6977l1572J8609N9235N5359j9245j7730J414o416M6165J1526m0199m4286
14797d117j3868J1365J1387O068q52Q642j317m2413l7246q748k283N533r735P821
14783f9763J035m998j1503K0254L2602J1103K6053m3733l8744J3870j8054J0209
$$ y = [-15536, -28495, -36801, -30079, -34142, -27727, -29914, -26600, -34086, -41541, -29545, 9148, 37566, 31923, 16589, -22867, -4766, -25818, -26180, -13417, -26960, -54398, -43537, -21487, -11696, -30331, -63359, -56328, -31034, -25756, -33141, -35043, -31393, -9597, -3284, 9183, 4620, -29221, -58838, -55391, -32936, -31283, -19601, -10307, -45890, -60459, -32029, -2587, -8302, -27280, -47906, 4353, 24883, 445, -25891, -17805, -18057, -55850, -70904, -26990, -7307, -20748, -36977, -68549, -49940, 9295, 64654, 45409, 27679, 29093, 22677, 68842, 80368, 40169, -4117, -17985, -6620, 4767, 10835, 9983, 18625, 17308, -25105, -62351, -71099, -73382, -67849, -77584, -69763, -68728, -73726, -85229, -64975, -32373, -21270, 4783, -38950, -77694, -63824, -81878, -71669]
14771g1669L6249J8748O303M26p374L5704J2805l4967N054M0554J622j5542J5550
14758D3463j4089j8118m0176k6040p448J5521j5479J0766L7922k624J6447k1591
14746b1446R206K2572J0029M609l3446p475L737m2597J5159N5970J3598j9315
14734A0601L0583o430K0026k682k370m849r24K6425K0287k6728k5442m5090k1983
14721b8576J2212k232L936O36K2106N639m301k5906n800j1269J3463J2314K0913
14708A3135j47j2853K3144j9393j8087M2692L084M989j2389L208J0005P163j464
14695D3087k1905k9744p766o020j4974J1303k6579k533L406M3455J5347l737k1665
14682a8325k7251M0233M1743j8384l3918J7072K3455n1245m0j69j8126O836J133
$$ y = [-71669, -35420, -16672, -10369, -9943, -17317, 18387, 31192, -3775, 1279, 41833, 43455, 27913, 43463, 29374, 11256, -28920, -54960, -62408, -46887, -62366, -51600, -13678, -16302, 145, -21446, -12240, 10332, 20361, 24970, -8476, -15951, -12214, -54811, -39652, 16318, 29916, 10601, 41184, 34754, 54780, 52098, 49728, 44879, 43955, 70380, 90667, 63939, 38497, -6593, -28576, -16364, -18596, -14660, -14024, 8082, 13721, 9420, -16486, -22286, -33555, -20092, -7778, 13135, 12988, 135, 23279, 3886, -14201, 28491, 31575, 36564, 24175, 27383, 37388, 44551, 43087, 21182, -8562, -16328, -22348, -37322, -26019, -52598, -55131, -51725, -8270, 7077, 3340, -18325, -45576, -5343, 36400, 18016, -15902, 1170, 24625, -26620, -26660, -26829, -44955, -38119, -36986]
14669c6986J159Q4J1898J2957n322p646J8791K1537P601p493M2807J6139l3054
14656D2472n4810m3733J0993L6699L1392j5161J6883M655m0353j5603j078k6706
14644e4350L5430L440J6608k3049j6978o6977r269K1165o90M5522M4923n357L9899
14631C0317j760l1847P10J6591k1916l573N205J1274Q790j502q665j5571J0158
14618a789J5981L3940l1267k6319K7541p147k5032n439K196m294k7690j1032m138
14605f4489K2810P488r04L249J9981K0590J0502O775k0352l4516M8N6606L9825
14592F7613p313j4025m517j616L155L0497k8176n9073J9674J2959q804l8244Q857
14579a9013j2048l829n06M8751K1069j4305R924n227j026m5066l8626O659P2882
$$ y = [-36986, -35827, -35743, -23845, -10888, -16210, -23856, -5065, 16472, 24073, 16580, 59387, 75526, 42472, -12338, -56071, -45078, -8379, 23013, 7852, 24735, 29390, -10963, -26566, -27644, -54350, -18920, -15480, 1128, -21921, -38899, -105876, -115145, -93980, -94670, -49148, -4225, -9582, 30317, 28557, -3290, -2580, 14011, -7905, -11478, -6273, 5001, 13791, 12289, 3624, -11947, -1789, 14192, 48132, 16865, -9454, 18087, 10940, -14092, -19531, -17335, -21629, -49319, -60351, -64489, -41679, -34191, -35095, -31846, -11865, 8725, 19227, 26002, 5650, -28866, -28818, 27788, 67613, 60300, 46275, 41758, 40142, 43297, 73794, 45618, -13455, 6219, 19178, 10374, -27870, -19013, -31061, -34890, -35396, 13355, 34424, 20119, 30043, 24816, 23790, -21276, -59902, -53243, 19639]
14566A9639N3943p228n0105l3758K242K5584K9199K573J0316n988m4929k3094
14554b1606J1592L1581j0035l1621l5669J4121P908J5158j0091K5539K3574M23
14542B0874k1086j2941r869m211m30L4764M1382J2753l2605o340n166J604r17
14529A7812o254J0876m701m6012j0477L849l362j243K1989l131j5186N0986P246
14516B2392M5142k6746m9880m0295N058J2861l0058q010l932M4764M1653J0198
14504B3147k6203k3979L4193K9570q677n2893m2871q19K9353K5604J2354L3436
14492C2215M4504L5373j8004o8451n4686p162L218j8925M0256K7323k7651o767
14480a8757J2708J65j4062M909L1376K7208N607j3437J1781n159m6612j7800J9779
$$ y = [19639, 73582, 66354, 16249, -17509, -15267, 10317, 39516, 42089, 52405, 46417, 1488, -21606, -10014, 21567, 11532, -20089, -55758, -41637, -33729, -18571, -28662, -3123, 20451, 20874, -212, -13153, -23022, -27233, -27663, 7101, 48483, 61236, 28631, 22291, 17125, 18729, 17812, 11558, 22434, 17733, -28279, -38756, -34907, -38269, -39512, -17523, -20654, -35840, 15146, 22392, 67534, 40788, -9092, -49387, -44329, -31468, -61526, -69536, -73468, -28704, 12949, 23147, -3056, -27035, 7158, 36728, 28051, -24842, -67713, -68532, -39179, -13575, -1221, 32215, 76719, 112092, 94088, 25637, -29049, -36211, -32993, -51918, -11662, 15661, -11990, -18757, -6049, -5884, -19946, -15037, 16339, 43547, 49154, 35717, 47498, 42339, -4273, -22073, -2294]
14467b294L0306k9513j0935j0374K9984l9949O402M6797J0751k7004o334j3867
14455a6030j0793r063j4911K1969N6250O702J0229M6742j2518l5029k4917R41
14443A9572J1525l0526J99p855o62k6291L179Q833j2180J6003J6159M657k5851
14430b3238J6218j1993j4119L124K3975J4148J336M753q171l2343n016k5172K8402
14417b8096L0071L8746k8178n7703O353l5112K9414L0341k2175m0459M2358J9501
14405a4939P714J7401j80k3722j5655k2372j4086J3140J2857K4892J8113J728
14393D891K0877m126m4709l0119j5658M1841mj3758j7988K6273K7184J419k0808
14380b4685m644n106L855J5880L390m239l453M8505k0776k9682k2257M220M671
$$ y = [-2294, 28012, -1501, -12436, -22810, 7174, -32775, -26373, 20424, 31175, 4171, -2163, -16030, -26823, -35886, -50797, -28828, 27422, 34124, 44353, 91095, 78577, 43548, 18631, 19572, 31097, 571, 770, -7085, -7747, -34038, -30859, -22026, -34206, -18203, -2044, 2613, -23238, -7020, -19013, -33132, -30008, -6033, 8115, 9451, 14204, 6033, -26310, -31326, -56498, -28096, 1975, 40721, 12543, -45160, -38807, -73919, -44505, -14164, -36339, -76798, -34440, -14939, -7225, 10176, 9996, -13726, -29381, -51753, -65839, -52699, -39842, -14950, 3163, 4891, 25768, 21642, -23067, -53186, -68844, -27003, -27007, -40765, -58753, -32480, -5296, -3877, -24685, -29329, -34435, -30580, -14700, -11310, -15549, -19002, 29503, 8727, -20955, -43212, -38992, -34321]
14367c4321Q855K663L346j3512k9131K9975K370n499O60J8121K985J7157K0185
14354B3854J6020p776J4001R676n0627l1752K5314j3662j7918K386K7998J2006
14342I520r996k2885k2608K1252M7450l2558m40K5051J6902j9992j187K944M20
14329A3873K4313p523q579k1254J0670Q936l322j3599P132j4200J010J1166p354
14316A269j4688r171j5997j5098o138J4791K9198M3233j8422K727J4948L7080
14304F3732j0124j0581k2637j9349L7446J8359L980j8605j5028n9639R593L4962
14292A2109k0839J073J2167m8738N772M1625J7187j4381N152M5886J2016n0919
14280A8110m461J5217J6661k058m3936k262p654J538L7499j6521p1296N559L3734
$$ y = [-34321, -25466, -22803, -19457, -32969, -62100, -32125, -29755, -35254, -34594, -16473, -13488, 3669, 23854, 39874, 32098, 46099, 55775, 5148, -26604, -1290, -14952, -32870, -30484, -2486, 9520, -476, -23361, -45969, -24717, 22733, -9825, -10265, 14786, 31688, 11696, 10509, 13453, 13873, 38186, 30663, 22084, 830, 11500, 20436, 17114, 3515, 10647, -3553, -2543, 8623, 1269, -13419, -22590, -38587, -53685, -59823, -45032, -15834, 27399, 8977, 11704, 26652, 63732, 53608, 43027, 20390, 1041, 38487, 56846, 60826, 42221, 27193, -32446, -22853, 12109, -8730, -7657, 4510, -44228, -38456, 3169, 20356, 5975, 11127, 57013, 69029, 18110, 13649, 28866, 45527, 43469, -467, -2729, -10383, -8845, 28654, 12133, -59163, -53604, -19870]
14267a9870N0869J1636k5419j0009J3405J8657M976k0905K235q348k2375m7499
14255e2647n681l4845j8415L0843O6758p727k2102L1222K2883M059p584L1938
14243C8702J6206j2099j0774q874L0720J4295m371l8164j3216j8775p436P238
14231f548M042L5974P0330m1570n1282K6321N644k4706L2705j2016j1438J3147
14219D0603J2706m7447j5880l818k2793k1579J0929j6923N0275J6345o156k3423
14207b7161j902Q348O946j0373J8229r780k0508k5197J8106J3220l8767l843K0292
14194e2390j0805J9486J9077N1052J9923j3013j1291j4797k1150R843P791k284
14182A442K3613K465J7322R585k0200m8285k4181K0517m674J7078J6226J6091
$$ y = [-19870, 30999, 42635, 17216, 7207, 20612, 39269, 44245, 23340, 25575, 17227, -5148, -52647, -58328, -93173, -111588, -80745, -13987, -21714, -43816, -12594, 10289, 14348, 6764, 38702, 54908, 42809, 32035, 23161, 53881, 68176, 63805, 25641, 12425, -6350, -13786, -6548, -2506, 33468, 103798, 62228, 10946, 37267, 42911, 18205, 50910, 38894, 27456, 40603, 53309, 5862, -10018, -13836, -36629, -58208, -47279, -64202, -13927, 2418, -3738, -27161, -29063, -20715, -13769, -24142, -5913, -15693, -36201, -61398, -43292, -30072, -68839, -72682, -52390, -63195, -43709, -24632, 26420, 46343, 33330, 22039, 7242, -13908, -4065, 3726, 1442, 25055, 27520, 44842, 54427, 34227, -14058, -38239, -17722, -22396, -5318, 10908, 26999]
14170B6999j1964K6268L531J1422l8714j6797l6332J9113M6061j167J5749J0843
14158E5012m2864j5517K7926J0578j6468j2030m195j6247k8383O872Q946j5027
14146d1397p150J7625L8021J0810m4465k0609L0751P482l9572k3432L717j433
14134f9652j1037O195N063J0531L3091j0044k4600K9064l623K535N565K4142J6399
14121A3629K793j6025k3751j5126J9291L2570R386p927k4654k4641j9664n538
14109e9657j487J184K0177q955O678K4664r64J9304k9223k9978j0977J6140L1662
14096b1432R244o486j386m5661q036J7069Q852l705j6699N962M6421K7630j7233
14083e460k3342j4297j4869R151K9736K5458l08l0604j4539k4008J8420N965k215
$$ y = [26999, 15035, 41303, 44834, 56256, 17542, 745, -35587, -16474, 29587, 28420, 44169, 55012, 12148, -3369, 24557, 35135, 18667, 6637, 2442, -13805, -42188, -35316, -26370, -41397, -48547, -30922, 7099, 17909, -26556, -47165, -16414, -8932, -48504, -71936, -68219, -69652, -80689, -74494, -69431, -58900, -25809, -35853, -60453, -31389, -35012, -32477, -26912, -2770, 13629, 16422, 397, -23354, -38480, -19189, 13381, 22767, 14840, -9814, -34455, -54119, -59657, -61144, -59960, -39783, -48738, -42060, -17396, -18360, 944, -28279, -58257, -69234, -53094, -21432, -12188, -18674, -20060, -65721, -73757, -56688, -47836, -51541, -68240, -62278, -15857, 11773, -5460, -28802, -43099, -57968, -48817, -19081, 6377, 6069, -24535, -39074, -63082, -44662, -38697, -40912]
14070d0912k3879l1763m3073N3149N9679j3845k0643k136K3431J6336L2955J7468
$$ y = [-40912, -64791, -96554, -139627, -86478, -26799, -40644, -61287, -63423, -39992, -23656, 9299, 26767]
$$ [...]
##END NTUPLES=NMR SPECTRUM
##END=
