##TITLE=Analysis number 316905
Compound Code mo 07004
Book Reference 428/194
Project Code adrs
Chemist Name janep
##JCAMPDX= 6.0         $$ Bruker NMR JCAMP-DX V2.0
##DATA TYPE= NMR SPECTRUM
##DATA CLASS= NTUPLES
##ORIGIN= Bruker BioSpin GmbH
##OWNER= nmr
$$ XWIN-NMR		Version 3.5
$$ Wed Feb  1 08:56:43 2006 GMT Standard Time (UT+0h)  MAYBRIDGE\nmr@NMR_250MHZ
##.OBSERVE FREQUENCY= 250.131544655141
##.OBSERVE NUCLEUS= ^1H
##.ACQUISITION MODE= SIMULTANEOUS (DQD)
##.ACQUISITION SCHEME= undefined
##.AVERAGES= 16
##.DIGITISER RES= 18
##SPECTROMETER/DATA SYSTEM= dpx250
##.PULSE SEQUENCE= zg30
##.SOLVENT NAME= DMSO
##.SHIFT REFERENCE= (INTERNAL, DMSO, 0, 16.522)
##AUDIT TRAIL= $$ (NUMBER, WHEN, WHO, WHERE, WHAT)
$$ ##TITLE= Audit trail, XWIN-NMR		Version 3.5
$$ ##JCAMPDX= 5.01
$$ ##ORIGIN= Bruker BioSpin GmbH
$$ ##OWNER= nmr
$$ C:\u/data/dgb/nmr/ADRS/15450/pdata/1/auditp.txt
$$ ##AUDIT TRAIL=  $$ (NUMBER, WHEN, WHO, WHERE, WHAT)
(   1,<2006-02-01 08:56:08.41 +000>,<MAYBRIDGE\nmr>,<NMR_250MHZ>,
      <created by zg, POWCHK disabled, PULCHK disabled
       configuration hash MD5:
       84 BC 41 DB A1 6E 1D 46 DA 25 12 A5 C1 ED C5 3A
       data hash MD5: 64K
       8B 6D E6 83 EA 13 64 2E D8 F6 17 03 5D 96 04 D1>)
(   2,<2006-02-01 08:56:24.16 +000>,<MAYBRIDGE\nmr>,<NMR_250MHZ>,
      <Start of raw data processing
       ef LB = 0.3 FT_mod = 6 PKNL = 1 SI = 32K 
       data hash MD5: 32K
       F3 79 00 76 8F 23 10 2F 30 E5 29 D9 91 12 37 97>)
(   3,<2006-02-01 08:56:27.29 +000>,<MAYBRIDGE\nmr>,<NMR_250MHZ>,
      <apk 
       data hash MD5: 32K
       0B 52 E8 BE 71 98 9E B9 1F 2A 16 90 D5 4B C1 93>)
(   4,<2006-02-01 08:56:28.45 +000>,<MAYBRIDGE\nmr>,<NMR_250MHZ>,
      <abs ABSG = 5 
       data hash MD5: 32K
       77 79 66 39 07 F1 74 46 55 90 8C D4 8C FE 6E 72>)
$$ ##END=
$$ 
$$ hash MD5
$$ A9 C7 EF 56 8A 89 E0 CA 7C A6 91 75 2D B5 FF AD
##$RELAX= 
##$RELAX= 
##$RELAX= 
##$RELAX= 
##$RELAX= 
##$RELAX= 
##$RELAX= 
$$ Bruker specific parameters
$$ --------------------------
##$DU= <C:\u>
##$EXPNO= 15450
##$NAME= <ADRS>
##$PROCNO= 1
##$TYPE= <nmr>
##$USER= <dgb>
##$AMP= (0..31)
100 100 100 100 100 100 100 100 100 100 100 100 100 100 100 100 100 100 
100 100 100 100 100 100 100 100 100 100 100 100 100 100 
##$AQSEQ= 0
##$AQ_mod= 3
##$AUNM= <au_zg>
##$AUTOPOS= <53 >
##$BF1= 250.13
##$BF2= 250.13
##$BF3= 250.13
##$BF4= 250.13
##$BF5= 500.13
##$BF6= 500.13
##$BF7= 500.13
##$BF8= 500.13
##$BYTORDA= 1
##$CFDGTYP= 0
##$CFRGTYP= 5
##$CHEMSTR= <none>
##$CNST= (0..31)
1 1 145 1 1 1 1 1 1 1 1 1 1 1 1 1 1 1 1 1 1 1 1 1 1 1 1 1 1 1 1 1 
##$CPDPRG= <>
##$CPDPRG1= <>
##$CPDPRG2= <>
##$CPDPRG3= <>
##$CPDPRG4= <mlev>
##$CPDPRG5= <mlev>
##$CPDPRG6= <mlev>
##$CPDPRG7= <mlev>
##$CPDPRG8= <mlev>
##$CPDPRGB= <>
##$CPDPRGT= <>
##$D= (0..31)
0 1 0 0 0 0 0 0 0 0.06 0 0 0 0 0 0 0.0002 0 0 0 0 0 0 0 0 0 0 0 0 0 0 
0 
##$DATE= 1138784166
##$DBL= (0..7)
120 120 120 120 120 120 120 120 
##$DBP= (0..7)
150 150 150 150 150 150 150 150 
##$DBP07= 0
##$DBPNAM0= <>
##$DBPNAM1= <>
$$ [...]
##$SUBNAM7= <"">
##$SUBNAM8= <"">
##$SUBNAM9= <"">
##$SW= 20.6930455092707
##$SWIBOX= (0..15)
0 0 3 0 0 0 0 0 0 0 0 0 0 0 0 0 
##$SW_h= 5175.983436853
##$TD= 65536
##$TD0= 1
##$TE= 293.16
##$TE2= 300
##$TE3= 300
##$TEG= 300
##$TL= (0..7)
0 120 120 120 120 120 120 120 
##$TP= (0..7)
150 150 150 150 150 150 150 150 
##$TP07= 0
##$TPNAME0= <>
##$TPNAME1= <>
##$TPNAME2= <>
##$TPNAME3= <>
##$TPNAME4= <>
##$TPNAME5= <>
##$TPNAME6= <>
##$TPNAME7= <>
##$TPOAL= (0..7)
0.5 0.5 0.5 0.5 0.5 0.5 0.5 0.5 
##$TPOFFS= (0..7)
0 0 0 0 0 0 0 0 
##$TUNHIN= 0
##$TUNHOUT= 0
##$TUNXOUT= 0
##$USERA1= <user>
##$USERA2= <user>
##$USERA3= <user>
##$USERA4= <user>
##$USERA5= <user>
##$V9= 5
##$VALIST= <valist>
##$VCLIST= <CCCCCCCCCCCCCCC>
##$VD= 0
##$VDLIST= <DDDDDDDDDDDDDDD>
##$VPLIST= <PPPPPPPPPPPPPPP>
##$VTLIST= <TTTTTTTTTTTTTTT>
##$WBST= 1024
##$WBSW= 4
##$XGAIN= (0..3)
0 0 0 0 
##$XL= 0
##$YL= 0
##$YMAX_a= 478110
##$YMIN_a= -442301
##$ZGOPTNS= <>
##$ZL1= 120
##$ZL2= 120
##$ZL3= 120
##$ZL4= 120
##$ABSF1= 16.522
##$ABSF2= -4.171173
##$ABSG= 5
##$ABSL= 3
##$ALPHA= 0
##$AQORDER= 0
##$ASSFAC= 0
##$ASSFACI= 0
##$ASSFACX= 0
##$ASSWID= 0
##$AUNMP= <proc_1d>
##$AZFE= 0.1
##$AZFW= 0.1
##$BCFW= 0
##$BC_mod= 0
##$BYTORDP= 0
##$COROFFS= 0
##$CY= 12.5
##$DATMOD= 1
##$DC= 0
##$DFILT= <>
##$DTYPP= 0
##$F1P= 14.0000005364418
##$F2P= -0.99999901652339
##$FCOR= 0.5
##$FTSIZE= 32768
##$FT_mod= 6
##$GAMMA= 0
##$GB= 0
##$INTBC= 1
##$INTSCL= 1
##$ISEN= 128
##$LB= 0.3
##$LEV0= 0
##$LPBIN= 0
##$MAXI= 10000
##$MC2= 0
##$MEAN= 0
##$ME_mod= 0
##$MI= 0
##$NCOEF= 0
##$NC_proc= -4
##$NLEV= 6
##$NOISF1= 0
##$NOISF2= 0
##$NSP= 0
##$NTH_PI= 0
##$NZP= 0
##$OFFSET= 16.522
##$PC= 1
##$PHC0= 91.09023
##$PHC1= 5.895389
##$PH_mod= 1
##$PKNL= yes
##$PPARMOD= 0
##$PSCAL= 4
##$PSIGN= 0
##$REVERSE= no
##$SF= 250.13
##$SI= 32768
##$SIGF1= 0
##$SIGF2= 0
##$SINO= 400
##$SIOLD= 32768
##$SREGLST= <1H.DMSO>
##$SSB= 0
##$STSI= 32768
##$STSR= 0
##$SW_p= 5175.98343685301
##$SYMM= 0
##$S_DEV= 0
##$TDeff= 65536
##$TDoff= 0
##$TI= <Analysis number 999999
Compound Code 99
Book Reference 9
Project Code 9>
##$TILT= no
##$TM1= 0
##$TM2= 0
##$TOPLEV= 0
##$USERP1= <user>
##$USERP2= <user>
##$USERP3= <user>
##$USERP4= <user>
##$USERP5= <user>
##$WDW= 1
##$XDIM= 32768
##$YMAX_p= 320744073
##$YMIN_p= -112271
$$ End of Bruker specific parameters
$$ ---------------------------------
##NTUPLES= NMR SPECTRUM
##VAR_NAME=  FREQUENCY,     SPECTRUM/REAL,   SPECTRUM/IMAG
##SYMBOL=    X,             R,               I
##VAR_TYPE=  INDEPENDENT,   DEPENDENT,       DEPENDENT
##VAR_FORM=  AFFN,          ASDF,            ASDF
##VAR_DIM=   32768,         32768,           32768
##UNITS=     HZ,            ARBITRARY UNITS, ARBITRARY UNITS
##FACTOR=    0.157963299565203, 1,           1
##FIRST=     4132.6476996994, 0,             0
##LAST=      -1043.33573715361, 0,           0
##MIN=       -1043.33573715361, -112271,     0
##MAX=       4132.6476996994, 320744073,     0
$$ Real data points
##PAGE= N=1
##DATA TABLE= (X++(R..R)), XYDATA
$$ [...]
25205i549n235k3049K8380J8690M513j3390J725n793k2454k0317J6082K2435k693
25192a0655K6437n463l2839J304J7601j313J145j149o239R482J1983l270j6658
25179i634J2463Q954m144n464J6406m741q285n6905l779N0016J2258k406J1467
25166A6206K294J1979N879j4872j8904N676j7135j799J3295k991m073l723q734
25153a6902j1428j3778J8273p001m766l334j0649l982O857n698J987J3762J7535
25140a9124N790j9746k1119K7859K9548K6607k2002k4957o824k8492k7273K5001
25128e4732K2118J6746J8383J55m9600K608Q426J6586k2423R457K6971J4373R308
25115A8376J0118r857l0414K2785J4605l2026m405M324k7837N593L1651J8113
$$ y = [-9549, -14784, -37833, -9453, 9237, 13750, 360, 2085, -3708, -26162, -46479, -30397, -7962, -10655, 15782, 10319, -22520, -21216, -3615, -4928, -3783, -4932, -11171, -1689, 10294, 7024, -9634, 2829, 11783, 7639, 2175, 18581, 13840, 5555, -51350, -55129, -5113, 7145, 4739, 16206, 18500, 30479, 36358, 21486, 2582, 8258, -8877, -10676, 2619, -372, -4445, -8168, -16902, -28330, -42108, -23835, -30836, -35602, -38936, -49585, -53567, -46710, -52408, -50421, -36659, -19124, -13334, -33080, -54199, -26340, 3208, 29815, 7813, -17144, -23968, -52460, -79733, -54732, -32614, -15868, 2515, 2670, -46930, -44322, -35896, -19310, -41733, -32276, -5305, 9068, 18376, 28494, 18637, -11777, 11008, 25613, -6413, -10818, -6494, -34331, -28738, 2913, 21026]
25103B1026j9416j677K5363J1344p33j8002K247K0825j4092k8475j8513K616R163
25090h324M776q459J637l974K911J2700j8435k3003K144J6717j5438o151J2291
25077c0608O343N018j4887N774K5145j1533n388K3018J4924O789N534J2579L089
25064D5797r520J174j2831N092k3653k1435k0871k5090J4354J0919N865l375k9123
25051f2697j3431K0561J3400L4805J0348L866l3818j2410M07M990J2387l4955
25039e6547j5858J3368J8992K9510L2715M0382j629k4153j0225l8472Q62k910
25027a3965k712Q934O638m6244l059p717K2147J4354K1058J4568j6511J9318q487
25014H322k2988O103L7396J8446j8502k3862q515j5501K7800N466m574J4254j6677
$$ y = [21026, 1610, -67, 25296, 36640, 35907, 17905, 20152, 40977, 26885, -1590, -20103, -17487, -8324, -3548, -12007, -10370, -14344, -11433, 1267, -17168, -40171, -38027, -21310, -36748, -42899, -30608, -24265, -19247, -34134, -28360, -3215, -14748, -20136, 2882, 17806, 24595, 30129, 42708, 45797, 36277, 37451, 24620, 29712, 6059, -15376, -36247, -61337, -46983, -36064, -30199, -33574, -62697, -76128, -55567, -42167, -7362, 2986, 6852, -26966, -39376, -38969, -33979, -21592, -56547, -72405, -59037, -40045, -10535, 22180, 62562, 60933, 36780, 26555, -11917, -11055, -13965, -16677, -7743, -1105, -47349, -50408, -58125, -35978, -21624, -566, 14002, -2509, 16809, 8322, -14666, -8563, 28833, 47279, 28777, 4915, -3600, -19101, 8699, 14165, 9591, 23845, 7168]
25001G168j3174P574K2546m0l7126m099k3349l942K054R292M864R522k417P549
24987a3578O299l1184o301K3179J5643P188p556N460J3986k2755O018K1163R75
24974A8537k0115k5573J55J4787J5208Q122j5021j0255J6936k644m107j0900p482
24961b2352L028p27J0528K1154n719N289j5297j2364o796j2499j349p66j1724
24948d9594J6447M8447K0428o182J153M860n53k8927r200J0453j0831j3085j6497
24935c3081k795L0727M174m364j3181j999J8649P229l468L804j1727J6857J8624
24922B9449j7936j8183m888l6886J6306L6483k583M320k8142o114L9843K8538
24910D0207j3697k5469p821J9915L249j4276k1625N238O479J120J3896J39j9200
$$ y = [7168, -6006, 1568, 24114, 24074, -13052, -17151, -40500, -44442, -42388, -33096, -28232, -18710, -21127, -13578, -7279, -38463, -44764, -21585, -5942, 1246, -6310, -850, 13136, -9619, -3601, 17562, 18537, -1578, -27151, -26996, -12209, 2999, 11121, -3900, -14155, 2781, 137, -3970, -14870, -22352, -19324, -20051, -9523, 11631, 5912, 11201, -4096, -16460, -23256, -35755, -37104, -37870, -49594, -33147, 15300, 35728, 29546, 30699, 35559, 35006, 6079, -3121, 7332, -3499, -16584, -33081, -35876, -5149, -975, -5339, -18520, -20519, -1870, 5359, 1891, 5695, -6032, 10825, 29449, 11513, -6670, -11558, -48444, -32138, 4345, 1762, 6082, -22060, -28174, 11669, 40207, 26510, 1041, -6780, 13135, 16384, 2108, -19517, -14279, -7800, -6680, 7216, 7355, -11845]
24897a1845p450J0435J3471M828j6482K5314R85N484j2461p123l359m908j1380
24884a4491L011j1785p944K370l102n068K049J5279r053J8460K2134J8966k9741
24871A085k9159m511J9859J0630P743M092j5053l236Q023L3437M288m1456l1312
24858c5570J2237K219K8796J9484k5313n508J3583m906j2633J0866Q715P536J6825
24845C6331n534k1650j1358k1726k778J6115j9901j3505J3206R399o818J5346
24833a2873j4212j0778j0976l024L693K0277m492K672J4760O098K1063m532k585
24820E091n137k1693L8J3248J297K829j7809j0221O236J0707J3401k8407k8493
24807e8913K3419K3748R355J7091n849p51J8968K7469l563j0459r655j9986r79
$$ y = [-11845, -19295, -8860, 4611, 9439, -7043, 18271, 19256, 24740, 12279, 5156, 1797, -3111, -14491, -11480, -23265, -31209, -28839, -31941, -37009, -34960, -19681, -28734, -10274, 11860, 30826, 1085, -28074, -32585, -12726, -2096, 5647, 9739, -5314, -8550, -527, 32910, 37198, -4258, -35570, -23333, -21114, 7682, 27166, 1853, -3655, 9928, 5022, -7611, 3255, 11970, 19506, 36331, 30797, 9147, -2211, -23937, -26715, -10600, -30501, -44006, -30800, -21401, -28219, -12873, -27085, -37863, -48839, -51863, -48170, -27893, -32385, -29713, -14953, -8855, 12208, 7676, 5091, -46, -21739, -21701, -8453, -7156, -4327, -22136, -32357, -26121, -15414, -2013, -30420, -58913, -35494, -11746, -2391, 14700, 8851, 8100, 27068, 54537, 50974, 40515, 30860, 10874, 9895]
24794I895k8160k2754J5298k0850M838J947J0758J008k7783P40M2416J1579j1547
24781a2615J3639J1470J2175J5663k2851j1895j5189L13J9589N631l0499j0264
24769b4833M2667R314n1727r693N939j0852j0599K3005J8670P979J6272O125j0634
24756A1633j3839N96J529K2507m365k7666j5655j6664M61L3387M5726j9693m2908
24743b4951r098L8314J9121J5022k2153j2590J6646J6359o402k8568j2141J7428
24731F987J9680k4332j9871K2397j123j4615k6647j2479J0607J5030M1731J4211
24719C1576l4157j8441j4007M169p79J4738J801j9884R476J5669j2289p983k537
24706c2648Q189R64j0827n825k363J0857l031K6692M598k83k0056q744J2395K2054
$$ y = [9895, -18265, -41019, -25721, -46571, -41733, -39786, -29028, -28020, -55803, -55063, -12647, -1068, -12615, 1024, 12494, 24669, 40332, 17481, 5586, -9603, -9290, 10299, 15930, -14569, -24833, 17834, 27148, -24579, -34272, -28333, -39185, -49784, -26779, -8109, -130, 16142, 22267, 11633, -2206, -1610, -81, 22426, 18061, -9605, -25260, -41924, -41463, -8076, 37650, 17957, -24951, -34049, 4265, 23386, 38408, 16255, 3665, 20311, 36670, 30268, 1700, -10441, 6987, 26667, 2335, -17536, 4861, 3738, -10877, -37524, -50003, -39396, -24366, 17365, 31576, -2581, -21022, -35029, -30860, -31639, -16901, -15100, -34984, -25508, -9839, -22128, -30111, -32648, -24459, -23495, -34322, -40147, -42510, -31653, -34684, -7992, -3394, -3677, -23733, -32477, -20082, 1972]
24692A972J7690m0748K916r881j6005K363J8878J447K4333Q718k543l594M59k8929
24678b2924O502J8321J1072R479L2703l852l19J0807N159M73k1990o126J5634
24665E4939n807j0782k8052j8254j7748j3079K3229J3959R427Q948o010J1363
24653B2133J3260K9485K0331k1098k0874j0772K105j0129j1054o285p701K0041
24641A9442j0540J531K1716R893k8891j8192J459J5449j1427k0037J026q993p76
24628b8340L909K2937Q023m751k307m1796J3131K3131J3946N235j3535M677k555
24615A705j627J9829j6899K4415K7035k3207k7756L247K2495o660q859K1220k3055
24602A1883k5308j2393K2471L6160m64p071m838j1415j3070q344k716j2064J9451
$$ y = [1972, 19662, -21086, -18170, -28051, -44056, -41693, -22815, -21368, 2965, 11683, 9140, 5546, 6005, -22924, -16422, 1899, 12971, 22450, 55153, 51301, 50982, 61789, 66948, 67421, 45431, 39305, 54939, 49132, 38350, 10298, -7956, -25704, -38783, -15554, -1595, 7832, 16780, 10770, 22133, 35393, 64878, 85209, 64111, 43237, 32465, 34570, 24441, 13387, 7102, -599, 19442, 8902, 10433, 32149, 42042, 13151, -5041, -3582, 11867, 440, -19597, -18571, -27564, -28340, -24431, -1494, 6529, 1778, -529, -42325, -29194, -6063, 7883, 13118, -417, 4260, 1705, 78, 19907, 3008, 27423, 54458, 31251, 3495, 6742, 29237, 22577, 13718, 34938, 11883, -13425, -25818, -3347, 32813, 32349, 25278, 20440, 9025, -4045, -12389, -15105, -27169, -7718]
24589g718K788q368k7330l6959J3591K5116L1327J0918j6241m579J3689K6031
24577B2265K2863l941j1744k3590r527J0631J581q77P683L400n141l296l5638
24564b5331o189m813N176O773p888k4186J0619L695Q010K9664R003L443k333J5558
24550B1201p98k2755k2514p462J2824j956j0325p882j3300O055K0827J0001N791
24537a0293m914R541J6744p481j0965r109k8306O385K4705O422K4742l425L556
24524A7602L301j4831r615m686o506J1461J8127L1244j0909j2280j265l5894k9852
24511d4103p712J8979L0124O678n080q067Q091J5450K158k93K1617L119j1040
24498B9921j722k3550Q613J7807j6581j3088p941j80N70P448K8067K1189j7730
$$ y = [-7718, -4930, -13298, -40628, -77587, -63996, -38880, -7553, 3365, -12876, -17455, -3766, 22265, 45128, 41187, 29443, 5853, -3674, 6957, 8538, 7661, 15344, 18744, 13603, 10307, -25331, -31520, -36333, -31157, -24384, -32272, -56458, -45839, -42144, -34134, -4470, 4533, 7976, 5643, 21201, 20403, -2352, -24866, -32328, -19504, -21460, -31785, -39667, -52967, -46912, -26085, -16084, -10293, -15207, -5666, 11078, 3597, -7368, -16477, -44783, -38398, -13693, -7271, 17471, 14046, 17602, 20903, 6072, -3543, -8229, -14735, -3274, 14853, 46097, 35188, 22908, 21643, -14251, -44103, -51815, -32836, -2712, 3966, -1114, -9181, -1090, 14360, 16518, 16225, 37842, 40961, 29921, 28199, 4649, 13262, 31069, 14488, 1400, -6541, -6721, -6151, 1297, 29364, 50553, 32823]
24485C2823J2271K4645j3011k3667j4129R442j2178o006P853k877j0829l748k4260
24472b3671j2127P221R703L9707R739r854k3193R633J4360j1863J463J9852j9492
24459A1478j0720j3283J0504j5067o172l0518p924K5015l278J41K321k892K1029
24446a9366M0264J9540j2862n950k6720k3451j6726K1013J9421o80M531j9415
24434b0401j4999O312j633p62r829P325p84J0063L1698K21j8257M751L278J4101
24420A1084q426J6355j2087O073J8710j5681m547j1701l0023K6541K8747k0062
24408D983n967k713j7167l79j7199O354k3031J3954K7097R245N306Q546r365L400
24394C064O653j182n894r092k2216J8504j0222j9896o626J8204n884j9995o108
$$ y = [32823, 45094, 69739, 56728, 33061, 18932, 28374, 16196, 10190, 18043, 15166, 4337, 589, -23671, -35798, -28577, -18874, 20833, 30572, 20718, -2475, 7158, 21518, 9655, 11118, 30970, 11478, 758, -12525, -2021, -17088, -23260, -53778, -61702, -36687, -39965, -39824, -37503, -40395, -19366, 20898, 40438, 27576, 21626, -5094, -28545, -45271, -24258, -4837, -5517, -986, -20401, -35400, -29088, -30721, -31483, -41312, -33987, -34771, -24708, 6990, 7211, -11046, -6295, -3017, 11084, 2658, 19013, 6926, 12999, 31709, 16028, 11481, -220, -30243, -3702, 25045, 4983, -984, -3697, -20864, -21243, -38442, -32088, -55119, -41165, -14068, -4823, 483, 9029, -336, 3064, 9717, 8535, 2641, -6451, -28667, -10163, -20385, -40281, -46907, -28703, -34587, -54582, -60690]
24381f0690K1030l411j5679J2064K7476M3802j2892l5619r715K0593M0597O095
24369C3651j5090o276l0000m4038j0267L0712N7018J137k7431J2501j192j9374
24357a8649j132p378Q110J7957J7r147R396j1022K6735q35P04M13k1498p079j1598
24342b5006Q29J8296m022K6524L1462J4373k5114J999j753O119m456l8893j2776
24329a2418k805J2272P079K2768K5936O5l439n974o965L79q317j1674k9379O6
24315a2406P957N83k2825J8176N0308K1775k2400k8098O369J2719P248O645O707
24302E2758Q247q001o98k5246k4974K149L2781k3962J817J4126k2358k8406J7723
24289d044J2979P705r547m899J1169j0912l1105O667l872P534L793l4j6322j0269
$$ y = [-60690, -39660, -43071, -58750, -46686, -19210, 24592, 11700, -23919, -33634, -13041, 27556, 33651, 18561, 12285, -17715, -61753, -72020, -41308, 15710, 16847, -10584, 1917, 725, -18649, -19781, -27159, -19049, -1092, -1075, -10222, -826, -11848, 14887, 14052, 14756, 15169, -6329, -13408, -25006, -24177, -5881, -9903, 16621, 48083, 62456, 37342, 39341, 37588, 43707, 39251, 358, -12418, -15223, -2951, 4128, 26896, 52832, 52897, 49458, 43484, 36519, 36898, 28581, 16907, -12472, -12406, -4449, -3866, -26691, -8515, 41793, 63568, 41168, 13070, 19439, 32158, 39406, 46051, 52758, 61005, 53004, 52306, 27060, 2086, 4235, 37016, 13054, 14871, 28997, 6639, -21767, -4044, 8935, 16640, 7093, 2194, 13363, 2451, -28654, -21987, -25859, -18325, -14532, -14566, -30888, -41157]
24275d1157J7169J0039L5819j2063J775j5394k3881o664j6729j1169J5402L039
24263d3814j5655K2333L3908j6676m18K1425j7299k2220p17J5962J4431p075O981
24250h834K5405j5566j9235J3736J6347j3440K1296L387r943J5585J7727J1063
24238E7528j5547k5893k2529j7159k689j588k0604J0395J2983K1349J7253J2303
24226B5802Q991J739K269R862M928k2466l245k4863o074k0409N78M1560K153J3592
24212C4417j433l2194k4969l898j157r978m3150k9909L4185K3082M674J2480L867
24199c3983j4894J7588K2135K8372K226k8564k8221N470M494n857M078J9512n613
24186a3257l1481R150J6539J357m166j3441P283K8023K2827m0540k9234K0067
$$ y = [-41157, -23988, -13949, 21870, 9807, 11582, -3812, -27693, -34357, -51086, -62255, -46853, -43814, -59469, -37136, -3228, -19904, -20322, 1103, -16196, -38416, -39133, -23171, -8740, -15815, -8834, 16571, 1005, -18230, -4494, 11853, -1587, 19709, 23096, 13153, 28738, 46465, 57528, 41981, 16088, -6441, -23600, -26289, -27877, -48481, -38086, -25103, -3754, 13499, 25802, 34793, 36532, 38801, 48663, 53591, 31125, 27880, 3017, -3057, -23466, -22888, 18672, 20825, 34417, 32984, 790, -24179, -28077, -29234, -39212, -82362, -112271, -78086, -55004, -50330, -37850, -33983, -48877, -31289, -9154, 19218, 21444, -7120, -35341, -29871, -25377, -31234, -27156, -7644, -13257, -44738, -35588, -19049, -17692, -21858, -35299, -28016, 7, 22834, -17706, -46940, -26873]
24174b6873O6O329N665M532l716k443N168O466J7696r603j3386m71M447j3271
24160a9394j2658j509K1496r36N443p250O370K3186J7857J9049M675j051k3594
24147C1684q903l988j0690l749J6159Q59J4785K502k6228n466M332K449m216k1169
24133a1639k4787K560K1891k422k5246p800J6717P347J0957J9813N454L499n536
24120A0808n465k3813j8266j3204J4574Q680N80j874k695J5021L0349o393j333
24107F969k154J7004J6359j8236k8563p799j747J3494K1194j3307j6458r536j1557
24094c4337L912J5643J344k0025N928N8631m281l2266j8140J4299Q574j0117j0580
24081b1415J508J0548J2954K93J7036j1184m721J7953l341k1626j5956j7911L8370
$$ y = [-26873, -26807, -20478, -14813, -10281, -13997, -16440, -11272, -4806, 12890, 3287, -10099, -10570, -6123, -19394, -32052, -33561, -12065, -13001, -7558, -14808, -8438, 14748, 32605, 51654, 56329, 55278, 31684, 22781, 18793, 8103, 4354, 20513, 21372, 36157, 38659, 12431, 6965, 11297, 13746, 9530, -11639, -36426, -33866, -11975, -14397, -39643, -47443, -30726, -23379, -12422, 7391, 12845, 16344, 10808, 5343, -18470, -36736, -49940, -35366, -26686, -26106, -27980, -30675, -15654, 14695, 8302, 6969, 4815, 21819, 38178, 19942, -8621, -16420, -18167, -4673, 16521, 3214, -13244, -22780, -34337, -30425, -14782, -13438, -33463, -27535, 31096, 26815, -5451, -23591, -9292, -718, -10835, -21415, -19907, -9359, 3595, 3888, 20924, 9740, 5019, 22972, 19631, -1995, -17951, -35862, 2508]
24068B508M1044J9827j956m849m4527j0213O456k2299P130j5263n816m104L9478
24055G416K2598o590j0792j895p460M608J2469O445n602j0610j3476k1092P848
24042a6133K4209J3553j0564L565j281j2540k7371J5996R206j3883O286J5549
24030F592n01K629k885k7145R336N131J1419K5209J851l2474k4231M507J3539
24017g023J3605j1190j803j6331j7336J4666K8094K9120j1592K4413N088j0342
24005C9369o021l0842k323j5414O902P981J6761J1797j3179k7187j1866r119p608
23992d0749r586j5496K1455M8896Q507J5988M981n8613q152J4781r900j4399J7193
23979b5094J6566J0413l064J5324o47k1389P982k492k8538j7600K2108J7201j0099
$$ y = [2508, 43552, 63379, 61423, 56574, 12047, 1834, 8290, -14009, -6879, -22142, -27958, -32062, 7416, 30014, 23424, 12632, 10737, 3277, 7885, 20354, 26799, 21197, 10587, -2889, -23981, -16133, 8076, 21629, 11065, 14630, 13349, 809, -26562, -10566, -1360, -15243, -8957, 6592, 6091, 8720, 5835, -21310, -11974, -6843, 4576, 29785, 31636, -838, -25069, -20562, -7023, 6582, -4608, -6411, -22742, -40078, -25412, 2682, 31802, 20210, 44623, 49711, 39369, 33348, 2506, 183, -15231, -8329, -348, 16413, 28210, 15031, -12156, -24022, -33141, -40749, -50335, -65831, -44376, 4520, 13027, 29015, 33996, -24617, -32769, -17988, -27888, -42287, -25094, -8528, 1885, -1179, 14145, 13498, -7891, 91, -2401, -30939, -48539, -26431, -9230, -19329]
23966a9329n174k5765N475J8905J5157L070K589p03M28j228R71N085K4430n355
23952A8556n6220N04K4730j0470m6017J3480K1037J4076L2560j6343j9754l2351
23940e6212j1761P178k029J1965J9589M4244l625o154j4439L135j5217P88k6908
23927d9446j7644J0606J2254K1669L7377o032K2108J0261n984l729n0239l9632
23915e8431O719k2137J3636O078K533K521J819NK978L019K6428O277n937n128
23901a9620K4107P657o890k2336J219m044m864o947R008J8801K1775j3428j1358
23888f920P639j8223J3612J696N556l692k3940q863J7482Q594N147p606J694m295
23874a2119J4600K0881o696k2753J1142q41j6775j1852l0138k994L0490R741R28
$$ y = [-19329, -24503, -50268, -44793, -25888, -10731, -7661, -5072, -5775, -5347, -6575, -5604, -519, 23911, 18556, -37664, -37160, -12430, -22900, -68917, -55437, -34400, -20324, 12236, -4107, -23861, -56212, -67973, -60795, -62824, -50859, -31270, 12974, 9349, 3195, -11244, -8109, -23326, -22538, -49446, -67090, -56484, -44230, -22561, 14816, 8784, 30892, 41153, 35169, 31440, -18799, -58431, -51712, -73849, -60213, -54135, -51602, -49081, -47262, -47257, -44279, -41260, -14832, -8555, -14492, -19620, 4487, 12144, 5254, -17082, -15863, -19907, -24771, -31718, -22710, -3909, 17866, 4438, -6920, 719, -17504, -3892, -2196, 3360, -332, -24272, -33135, -15653, -7059, -1912, -9518, -7824, -12119, 2481, 23362, 16666, -6087, 5055, 4214, -12561, -24413, -54551, -57545, -27055, -17314, -16386]
23861a6386q09k2464j044n012j8478J3642L4460J3357k883l538R939K6228J0602
23848C7614k1296k3831K9712n077k5372j1458J7089N594j3136J476J2003j0410
23836g092J1999J0229j5689m2358p044L6717k848j0702J8259K7321j1855L526
23824A0463R651j0892j2927M475J7945n59k1928j5130O431o491n290n203P306
23811b2149r55J5683K3640J3775k6980k1797o715l056K835j66L5812P275j0201
23798G001j6051k057O029J5721J0137k9009m528J0368k1305J5920J6600P886l2867
23785a6155k8169J3026O776J6079K5841J1467k6886l3757j2964J9759K8194j3390
23773a0179q247L495r525j3158J9836j5598k9628N523L6784L9146K452l0714j1589
$$ y = [-16386, -17195, -39659, -40703, -45715, -64193, -50551, -16091, -2734, -5617, -9155, 784, 27012, 37614, 16318, -7513, 22199, 17122, -8250, -19708, -2619, 2975, -10161, -8685, 3318, -7092, 4907, 15136, -553, -42911, -49955, -13238, -16086, -26788, -8529, 18792, 6937, 10463, 20114, 9222, -3705, 770, 18715, 18156, -3772, -18902, -12471, -18962, -24252, -29455, -22149, -23104, -7421, 16219, 29994, 3014, -18783, -25498, -28554, -25719, -25885, 9927, 17202, 7001, -9050, -11107, -5078, 10643, 20780, -8229, -12757, -2389, -23694, -7774, 8826, 16712, -16155, -44324, -31298, -24522, -8443, 17398, 28865, 1979, -31778, -44742, -24983, 3211, -10179, -18426, -14931, -24456, -37614, -17778, -33376, -63004, -57481, -20697, 18449, 20901, -9813, -21402]
23760b1402K2087J3128k520l5752j2815n074M2799J1128j3136n298o781N910J2878
23747E152J5818o881q387j5930k0093o494m155J6814Q824J4071R799j7114k316
23734a0892p024j3122P567j9488q926J5810K1230R902r114R114M6204j463j0574
23721B9224r542k9627k0231K0982J0551r839O808n077k0156M7P617J8899r207
23708i551R708O181p223O010L358o094k8260j9233J0301Q898j7611J5402L4791
23695F677O699j6495J0637q479j0239j348j7218K478Q719k644o717J3078r531
23682b4383P561j122o746K67J2209K1833j9600K141j9355k961N033m957Q066j1133
23668c3147j8374K6090l001L1570j144j3393k1368k449J4106O159j1938L0164
$$ y = [-21402, 685, 13813, 11293, -24459, -37274, -42348, 451, 11579, -1557, -6855, -13636, -7726, 5152, 20970, 14089, 5702, -10228, -30321, -36815, -40970, -24156, -15332, -1261, 8538, -8576, -10892, -17916, -31038, -23471, -42959, -51885, -36075, -14845, -4943, -14057, -4943, 41261, 39798, 29224, 19682, -9945, -30176, -9194, 1357, -8482, -1674, -6751, -26907, -26860, -19243, -344, -9551, 157, 6338, -885, 5125, 8483, 2389, -25871, -45104, -34803, -25905, -43516, -28114, 6677, 13376, -3119, 7518, -961, -11200, -12548, -29766, -27288, -18569, -21213, -27930, -14852, -24383, -16822, -17944, -24690, -24423, -12214, 9619, -9981, -7840, -27195, -30156, -25123, -30080, -22014, -33147, -51521, -25431, -28432, 3138, 1994, -11399, -32767, -35216, -21110, -14951, -26889, 3275]
23656C275K4145J1511Q790J87j6335m5316k2189m580J2287K061M9O420p305j7718
23642d4718Q743r278r732K7395J1646J7713J6427p330n392l2113J0315Q399j8128
23629b6053J1571Q807N175L704k399K2704j049L957k6387k3542J7599l859K1419
23616A1647M427j2290N424L874L658r303j7969j4887k2203l081K6973p085n99
23603c1414J3894M853J8553j4301k8027N93P519L939o899K3140o162l264k453
23590b0029P212r737k205N3005L3660k996l5129j344Q896k392k0485j7703o723
23577a5970L777P716j2953j7000j9551K14K4154J8024k2398J1642k022k691k447
23564b9505n072O169k135J933P299o676M363K282k5177J4738K0381K4277M507
$$ y = [3275, 27420, 38931, 47721, 47908, 31573, -13743, -35932, -40512, -28225, -26164, -26115, -19695, -27000, -44718, -35975, -45253, -54985, -27590, -15944, 1769, 18196, 10866, 5474, -26639, -16324, -7925, -26053, -14482, -5675, -500, 3204, 805, 23509, 22460, 26417, 30, -23512, -5913, -9772, 11647, 16074, 3784, 9208, 13082, 16740, 7437, -10532, -25419, -47622, -50703, -23730, -30815, -31414, -17520, -12667, 5886, -8415, -36442, -35849, -28330, -24391, -31290, -8150, -14312, -17576, -20029, -12817, -22554, -24759, 28246, 61906, 58910, 23781, 22437, 31333, 28941, 8456, -9247, -15970, -12193, -4477, -17430, -34430, -53981, -53767, -29613, -11589, -33987, -22345, -24367, -27058, -29505, -34577, -28408, -30543, -28610, -21311, -27987, -23624, -21342, -46519, -31781, -11400, 12877, 17384]
23551A7384l7930r83K3105J0085O41O400k981j032P372R788j8093l0430J2341
23538d333j8416k1436l691J0965K0325j3877l5288K366L8597J4209K452K7864
23526A9737k2148Q25j2119M400j2035p354J024L2140J5922j2445k5241j763L032
23513a6025J6456r540j46J3999m355J2819J47k4228j7332K8069q76j0547J4769
23500C210j9604l2812Q87K5897K0147L2908m3638j6981K2357j1501l822q572j4376
23487d5900J3875K1117j0034o143k271k0091k5270j441L7152J7101j5297L038
23475c4164J7320L1882J9240K85k3115Q482J758m7284l1225k375K7261m808J5435
23462b1308j0409p683O346J2250M760n184p648J7746j467J0491J0856o865K885
$$ y = [17384, -20546, -21529, 1576, 11661, 12302, 18702, 15721, 14689, 22061, 31849, 13756, -16674, -4333, -22749, -44185, -47876, -36911, -16586, -30463, -65751, -63385, -24788, -10579, -8127, 19737, -2411, -1586, -13705, -9305, -21340, -28694, -27670, 4470, 20392, 7947, -17294, -19057, -16025, 431, -9109, -9255, 4744, 389, 13208, 13355, -10873, -28205, -136, -1012, -11559, 3210, -16394, -49206, -48319, -22422, -2275, 30633, -13005, -29986, -7629, -19130, -22952, -31524, -45900, -32025, -10908, -20942, -27085, -29356, -49447, -74717, -76158, -39006, -21905, -37202, -34164, -16844, 15038, 34278, 34563, 11448, 19930, 21688, -25596, -56821, -59196, -31935, -36743, -21308, -31717, -39400, -33054, -20804, -16044, -21228, -28876, -11130, -12597, -2106, 8750, 1885, 4770]
23449D770J3335p101j1410k4266k0705J8358j0572k977J3568R510J4965R065q331
23436a791j5689L853k820r75k550K226K7494J0216l490j2606N203j5987k7266
23423c4182r634j5043K4833K2584J2517J1607p895j2265j9873j2002L599P380
23411b8374K395k773k9701q532P011O3750L0862O436j7153n6695J3078N3583L422
23398C7309l932j6261j0091j407j8318k8139o53r226J577K7428k6946P695R828
23385c1136P738n362q043o591L045K6469M3370k3395n1345J5955K568j4992P247
23372c4472L107M987P712j6305q663O053k6338O292K2639P14o56J5625k653j195
23358b3153o574k673Q121M521j4553k3290L0621j0149j0214K331J4298j8963J3775
$$ y = [4770, 18105, 11004, -406, -24672, -45377, -27019, -37591, -40568, -27000, -17490, -2525, 6540, -1791, -17480, -13627, -16447, -17422, -19972, -17746, 9748, 19964, 16474, 3868, 9071, -6916, -34182, -43816, -58859, -34026, -11442, 1075, 12682, 4787, -7478, -27351, -39353, -35754, -28374, -25979, -28752, -58453, -66985, -59974, 3776, 34638, 41074, 23921, -32774, -19696, 33887, 37309, 33377, 17116, 7025, 5618, -12700, -40839, -41492, -50718, -49141, -21713, -48659, -40964, -31136, -23398, -28760, -36803, -43394, -40349, -13880, 29490, 6095, -45250, -29295, -26727, -41719, -34472, -31365, -26378, -18666, -34971, -43634, -37581, -63919, -57627, -34988, -34274, -34930, -19305, -21958, -23153, -29727, -32400, -24279, -19758, -34311, -57601, -26980, -37129, -47343, -45012, -30714, -49677, -35902]
23345c5902J3298J8666J6113J915n893p056k5734m526n078k3220K1473j206j9817
23332e6967k2424K5391M3441k7036r037K3713K392N935L0196p380o845l1238j0772
23319d0631k7550K3266M0890K849K5L996k1183l6943J3059L0075o46K03O522k502
23305h570n165K2843j6288j9088J1880k5429J548O887N702K0459L034q778j9126
23292c0091j735J5023J4367j1237k2947q295J9125m580J0790O781j6402j0404
23280c9605R376J1079j4424j9676M2974O80j0323L0025L8755j2624k6506n525
23268D206n974r163k955j1812Q206J0990J7820O809p208l7860l7243J269M1354
23255b1561J5637J5449J7939K42o871m162P700K600j6871k589p992j8355m8j6931
$$ y = [-35902, -22604, -3938, 12175, 14090, 8197, 1141, -24593, -29119, -34197, -57417, -35944, -37150, -56967, -79391, -54000, -10559, -37595, -46632, -22919, -20527, -14592, 15604, 8224, 1379, -29859, -40631, -68181, -44915, -4025, -1176, -1151, 2845, -18338, -55281, -42222, -12147, -12793, -12590, -6068, -8570, -13735, 9108, -7180, -26268, -14388, -39817, -38269, -31382, -25680, -5221, -2187, -10965, -30091, -31826, -16803, -2436, -13673, -36620, -44915, -25790, -30370, -19580, -12799, -29201, -39605, -30229, -19150, -33574, -53250, -10276, -9596, -19919, 10106, 48861, 36237, 9731, 4206, -1768, -10931, -13886, -25698, -17492, -6502, 11318, 18127, 10919, -26941, -64184, -62915, -21561, -5924, 9525, 27464, 27706, 20835, 16673, 24373, 26973, 10102, 7513, -479, -18834, -18882, -35813]
23241c5813L508K1292J559J0746K0154J5033O235l7213j0433j2403L992J2894
23229d49p777l6436J2867J6178J8055j5881J6710P797R239k9889J4983J7146j1425
23216A1118j9159l4342p308K8941M590k0577J5786M614m659J2448j664q112j52
23203a8476r098K0293n113j2830J20J0169L177n169J7219J3516J1402J271J2947
23190C9428J5258j9930l3160r989J6156J2232j2848k8778L4337K3988j5993k9709
23178i008m196q079K686J3166j0485K674J5168j2087k7064p642k336O227J1710
23165b9266r01J0581o447q544q611j5457Q618J3681J1325p787j3223l2035N29
23152g7537M0908J9001j8711J8287l61J2563j2359J2764k331j0709k7788j328
$$ y = [-35813, -32305, -11013, -9454, 1292, 21446, 36479, 42714, 5501, -4932, -17335, -13343, -449, -8226, -44662, -31795, -15617, 2438, -13443, 3267, 11064, 20303, -9586, 5397, 22543, 11118, -8041, -42383, -49691, -20750, -16160, -36737, -20951, -16337, -20996, -8548, -10212, -18324, -18476, -27574, -7281, -12394, -25224, -25104, -14935, -11758, -16927, 292, 13808, 25210, 26481, 39428, 54686, 34756, 1596, -8393, 7763, 19995, 7147, -21631, 12706, 36694, 20701, -9008, -13204, -21283, -18597, -5431, -15916, -13242, 1926, -10161, -37225, -44867, -47203, -40976, -29266, -30167, -19586, -26033, -34577, -43188, -58645, -50027, -36346, -25021, -32808, -46031, -78066, -77537, -36629, -17628, -36339, -18052, -18413, -5850, -18209, -5445, -7776, -18485, -46273, -47601]
23140d7601Q828J4005J506j0100p627L398J5197K531k0019J0052j4454M850J1156
23127b8278J2520L564j6079n294L082k072P443J650O987L4259J6287j7054q353
23114H662N07j179o670M590J3126k2473j0458j8357P519q353n521K284k1451O881
23100e0893J5832J2867k597R834j803J2878k8213k1138J5933K4191m1971j3423
23088f8503J2934R004n882K9337K9857j5516k964R717Q659q603j761k2839j0558
23075c7118o877K2929N776l2732l2408L0139J6475J3682J6626J264l6849j8292
23063e7385J1601K7418J4691j245P022J6715P361l0887l1777K1321K4734K442
23051A2011l4115j2493J6518J5944r470n723K099q911q376j7823n69n408n828
$$ y = [-47601, -38773, -24768, -23262, -33362, -40989, -37591, -22394, -19863, -39882, -29830, -44284, -39434, -28278, -15758, -12194, -28273, -33567, -30485, -32557, -25114, -23464, -16477, 17782, 34069, 17015, 8662, 9169, 7990, 1320, 5910, 19036, -3437, -13895, -32252, -24733, -33086, -38607, -36323, -57774, -50893, -35061, -22194, -24791, -14957, -16760, -3882, -32095, -53233, -37300, -13109, -55080, -68503, -55569, -46565, -52447, -23110, 6747, -8769, -11733, -2016, 6643, -1960, -3721, -26560, -37118, -43995, -21066, -15290, -48022, -80430, -50291, -33816, -20134, -3508, -2244, -39093, -57385, -45784, -18366, -3675, -4920, 2102, 18817, 26178, -4709, -36486, -15165, 9569, 12011, -22104, -34597, -18079, -2135, -11605, -17328, -15229, -24140, -32516, -50339, -50908, -56316, -62144]
23038f2144J3858j590K3662M5159j0363j5917k7371q750K8084j099O069J2162
23026A760P029k1853l198j6685k059K628j6897P501M315J771j8062K8312j1200
23013c6638p954j141k1711L4543K9217L2642k042l112o1751k2660J8070K5239
23001a7298L875k9946l6350j5769M8243K2844k1003O138l478J4989Q057j3829
22989c3527p448K4262m889j0492P691J100M010J6262K4669n365J476J1722j3449
22976A6022k4825k3140j5817J874M6470O259J8294J8404o944J752k0718k7275
22964i644M776P564j7170j290k788j4568K389J6680k4150k3724J3108L1517J8457
22951A157J734J718R91k192J7665j898j0007N466P588r404j4037j5503o74k0690
$$ y = [-62144, -48286, -49876, -26214, 18945, 8582, -7335, -34706, -43456, -15372, -16471, -10402, 1760, 8789, -13064, -16262, -32947, -35006, -32378, -49275, -41774, -37459, -35688, -53750, -25438, -36638, -44592, -45733, -67444, -32901, -3684, 28958, 26916, 23804, -37947, -60607, -42537, -17298, -13423, -43369, -79719, -95488, -47245, -24401, -45404, -39266, -42744, -27755, -19698, -33527, -40975, -16713, -21602, -32094, -24403, -23303, -19293, -3031, 21638, 16273, 17749, 29471, 16022, -8803, -31943, -47760, -45886, 584, 6843, 25137, 43541, 36597, 38349, 17631, -9644, -4868, 2696, -14474, -15764, -18552, -33120, -30731, -14051, -38201, -61925, -48817, -17300, 1157, 2891, 4609, 5600, 3408, 21073, 19175, 9168, 14634, 22222, 12818, -1219, -16722, -17396, -38086]
22937c8086l519J6590K3657K0736k0704k4864j5642k486L630Q968M583J044K254
22924b3839Q552N516o104n277J4179K050J7382K2716j7053k5012j2745j2364O445
22911b5554J9870J2223N634p474p860J5323j1968m4163j1374K8028J3340J9502
22899E527L5384k523k842j3175j1622J447j0733K611n975R343K4318n811j1164
22886A4785j7273k7179K250J9607J766J804l903k5324k8851J003J3885L3783L2617
22873A8970K656J7017j1563J3460O223k3102m0788p69k9923q067R082M990J0401
22860c1413J5339j0397J9087k4124J9010j1324l311P573j3143j0722J1526K3854
22848h045o486J2304k6290k5861K6146J3291l674J4498P749k514j6186k269j961
$$ y = [-38086, -41605, -25015, -1358, 19378, -1326, -26190, -41832, -44318, -40688, -31720, -27137, -26093, -23839, -15287, -9771, -15875, -21152, -6973, -4923, 12459, 35175, 18122, -6890, -19635, -31999, -25554, -5684, 6539, 12173, 4699, -3161, 12162, 194, -43969, -55343, -27315, -13975, 5527, 40911, 38388, 35546, 22371, 10749, 12196, 1463, 4074, -1901, 7442, 31760, 25949, 14785, -2488, -29667, -27417, -7810, -6044, -4240, -8143, -33467, -62318, -61315, -47430, -13647, 18970, 21626, 38643, 27080, 40540, 46763, 23661, -17127, -17896, -47819, -55886, -46804, -41814, -31413, -16074, -26471, -7384, -31508, -12498, -23822, -27133, -19560, -32703, -43425, -31899, -8045, -14531, -2227, -28517, -54378, -28232, -14941, -18615, -4117, 3632, 1118, -15068, -17337, -19298]
22835a9298j1612J9268J9654J0178j9583p023J2632l927J767j0294o601o005R754
22822a1090J9298M345j2255j5581J5741L0569r608j9119r925P294j5513m860J1972
22809h732J1981p941l9688j5218OR701m146L2271J8390j792r212J8571j1185j8359
22795b5353k2668k46k129j0956j5066K7584J2707l3263m440K3147Q910J1785J4197
22782a5791L112K0291L750r295o498k7544l68L1119J1688k3105m460o481J2843
22769a0739K2892J8349j1831j1839J5457j6294k649J3833K755j7791j0488j2261
22757b0606j1640J405J3952P675J2877J6405l5154r971J4946L214j0436k9378
22745d6711m2094K1123K0164J1621L525K5976K8802o264j4372j44j4158K919k5731
$$ y = [-19298, -30910, -11642, 8012, 18190, -1393, -8416, 4216, 289, 2056, -8238, -14839, -20844, -11090, 8208, 12553, 298, -15283, 458, 31027, 21419, 2300, -7625, -331, -15844, -20704, -8732, 3249, -4692, -44380, -59598, -59592, -49891, -54037, -21766, -3376, -5168, -14380, 4191, -6994, -25353, -48021, -48267, -50396, -61352, -76418, -48834, -36127, -69390, -73830, -50683, -41773, -29988, -15791, -12679, 7612, 11362, 2067, -4431, -31975, -32343, -1224, 10464, -12641, -17101, -23582, -10739, 12153, 30502, 18671, 6832, 22289, 5995, 3346, 17179, 19934, 2143, -8345, -20606, -32246, -30841, -16889, -9214, 3663, 20068, -15086, -25057, -10111, -6897, -17333, -46711, -88805, -67682, -47518, -35897, -32372, -6396, 22406, 16142, 1770, 1626, -12532, -9613, -35344]
22732c5344N580k9618Q783K0612M4239J8626j7291k9899J0464P476J8035k5273
22720c610M127K1889l405J588j952k2951J0875P416O344L090l5210j0748j0169
22707c2716j0854k6865J6906J3935J2769J5903k0609j2925k063L207M0162L8656
22695C5506j0366l2178m3827O232M7138K3339k9704k0668j9906j0906J7314K0858
22683a7168j5305J1746n984j2898K6022J1788Q086q940k1976k442K0519m0541
22671d7093l5217L1226K8613K4490J8012k531J5403l9223m099q438J1354J2604
22659E101n659j3934j0765j3338j550K04L3969L1295J84k8255K0274Q229j0226
22646A5529j2211J6431n310j613j2710j2527q65j7669J0261K4864j9587m405K390
$$ y = [-35344, -29764, -59382, -50599, -29987, 14252, 32878, 15587, -14312, -3848, 3628, 21663, -3610, 517, 22406, 19001, 20589, 18637, -4314, 6561, 13977, 20321, 23411, -11799, -22547, -32716, -43570, -70435, -53529, -39594, -26825, -10922, -31531, -44456, -46519, -43312, -3150, 35506, 25140, -7038, -50865, -44633, 2505, 25844, -3860, -24528, -44434, -55340, -38026, -17168, -32473, -20727, -26711, -39609, -13587, -1799, 6287, -2653, -24629, -27071, -6552, -47093, -82310, -51084, -22471, 2019, 20031, 17500, 32903, -6320, -10419, -18857, -7503, 5101, -558, -14492, -25257, -38595, -40145, -39941, -5972, 25323, 25507, -2748, 17526, 25755, 15529, 3318, 19749, 14439, 12826, 116, -12411, -13276, -30945, -20684, 4180, -15407, -19812, -17422]
22633a7422l156n822O1986K5133l8180l0451M665O655j5673o333J5702j5775j65
22620a8836J7919K633k6774J1849j613n441r24M468k688L086N05j5195K911R216
22606a8884M852k153p496K544J717m8838m89N5565O184k0091l64L8799K2486j2092
22592B1740p201J4283L33k4966N472l0417J276L3108J3954o831j5244q916j6228
22579a9637l656J0943q310o794J8202m334k7681p891r862o640J0481N231N567
22566d4381j1643j8027L988K5571L1873k229k4383j1970l585j543J771J5431J8598
22553b0529M1883J56o957n852j6080n597p716J2918Q685N64J2083J2387J4627
22540D0572k1130o197j9878k0731l042J1856j2191j554K9479j3679q434K5654
$$ y = [-17422, -20578, -26400, 35586, 60719, 22539, -7912, -3247, 3408, -12265, -18598, -2896, -18671, -18836, -917, 1716, -25058, -13209, -14822, -20263, -21187, -16719, -19407, -16321, -15816, -31011, -28100, -18884, -14032, -16185, -23681, -21137, -19420, -68258, -68747, -13182, -6998, -27089, -27453, 11346, 33832, 21740, 14539, 28822, 29155, 4189, 9661, -20756, -19480, 13628, 27582, 20751, 5507, -3409, -19637, -23293, -12350, -20660, -27454, -9252, -13586, -41267, -49158, -59020, -65660, -55179, -49948, -44381, -56024, -74051, -70063, -44492, -12619, -14848, -39231, -51201, -54786, -56329, -54558, -39127, -20529, 21354, 21510, 14553, 8701, -7379, -12976, -20692, -7774, 911, 1475, 13558, 25945, 40572, 19442, 13245, -6633, -27364, -30406, -18550, -30741, -32295, -2816, -16495, -24929, 725]
22528G25p261j1382O603K2225j5470p913N499L323j0444L366J5563k1375j497
22515a8038N215K4283k0235k2562L3580K3901k5631j3197j4191L966L1622j367
22503G346j2508j9292m741J0320l867j4049r840J4471L7183O291q890Q636k5013
22490a3953k125L0206p712J0547N26j8060k3646m098J5452J1561k3063l0373K3722
22477c1016Q920K6084l222Q949K4930k3384k6216J8791K8167K7165n2339l5339
22465b8510q114J2504k0445j7795K540J4264L8297J3345j1627L330k387n555j3917
22452b4070j4518L5770Q164k351l141N63l7994k3521L6463K8328j1468j1656J160
22439a8271J928J9640N129N64N262O798j5856J5238K257k2248K2134k68l5500
$$ y = [725, -6536, -17918, -11315, 10910, -4560, -12473, -6974, -3651, -14095, -10729, 4834, -16541, -18038, -12823, 11460, -8775, -31337, 2243, 26144, 513, -12684, -26875, -22909, 8713, 7346, -5162, -24454, -29195, -18875, -22742, -36791, -46631, -32160, 5023, 11314, 2424, 11060, -13953, -16078, 14128, 6416, 16963, 17489, -571, -24217, -28315, -12863, -1302, -24365, -54738, -31016, -22096, 3988, 766, 9715, 34645, 11261, -14955, 3836, 32003, 59168, 6829, -28510, -36624, -24120, -44565, -62360, -59820, -45556, -7259, 6086, -5541, -2211, -4598, -10153, -24070, -38588, -2818, 5346, 2995, -146, 417, -37577, -61098, -24635, 3693, -7775, -19431, -18271, -16343, 3297, 8426, 8990, 14252, 21050, 5194, 20432, 22689, 441, 22575, 22307, -13193]
22426a3193j1364J2069k6360j924J780J9075J6831k5630p139p630J2244J033j7155
22413d7363J6199j3090o678R911K3155M4603M1125j2860k7854j5842k3050k2335
22401c4079j451J4875m104L0450J4354j1480j2685k4511j2618Q160n534J9060
22389a9563j3669N491J8438j2320q167j7344J0027L0546J4278k7938m814J4482
22377a0553K197O179l7411O045J3243j3336n52n780n104J7006L2643l581k0745
22364a9749n613K5106j9929k1724O555M0592m846j4151K04Q458Q619K564m148
22351A938l056k8039P847J5703J3197q214j8091K0014l341k7774r580K0858P298
22338a1240j8842J5502L2455J421n842L3241k464m5577o557O508L089N136K826
$$ y = [-13193, -24557, -12488, -38848, -40772, -38992, -19917, -3086, -28716, -35855, -43485, -31241, -30208, -47363, -31164, -44254, -50932, -41021, -17866, 26737, 67862, 55002, 27148, 11306, -11744, -34079, -35530, -20655, -24759, 5691, 20045, 8565, -4120, -28631, -41249, -33089, -38623, -19563, -33232, -27741, -9303, -21623, -29790, -47134, -37107, -6561, 7717, -20221, -25035, -10553, -8356, -2177, -39588, -33543, -20300, -33636, -34188, -39968, -45072, -28066, 4577, 996, -19749, -25362, -256, -20185, -41909, -35354, 5238, 392, -13759, -13555, -5097, 3522, 6086, 1938, -1118, -29157, -21310, -5607, 7590, -624, -18715, 1299, -2042, -29816, -39396, -18538, -11240, -30082, -14580, 17875, 19296, 13454, 46695, 44231, -1346, -7903, -1395, 1694, 6830, 9656]
22325I656p722j777K1356P678N781p457J4523j308k1217l111J6829K8308N559
22312F7098j4059K138K478j0236l1422j0662j9797j4501J4988K5264P627l4139
22300a5223q328J5823L211k2734J2745n157j7623M774o928J1131j1597r894J9834
22287b9966j5639J9789J9930J7100q651P10k108j3584k0766k5162j2807o538J9525
22274e8167L0918L990K5008M608O132R674K255j2682j5435k0015j1663Q536j0618
22261c7459J5834J2824K1281k9156j1259k8316J6399K4701J7203L2382J6395k6467
22249B4362k062j3932k8272RJ3246k1217l1803k3805J6196K2527R098K9217J6046
22236I610J0236j0868O923j7282l7736M813j0511l0198K6692K3902K4531K3784
$$ y = [9656, 1934, 157, 21513, 29191, 34972, 27515, 42038, 40730, 19513, 16402, 33231, 61539, 67098, 53039, 55177, 57655, 47419, 15997, 5335, -14462, -28963, -13975, 11289, 18916, -15223, -23551, -7728, -4517, -27251, -14506, -19663, -37286, -32512, -39440, -28309, -39906, -49800, -29966, -45605, -25816, -5886, 11214, 2563, 3273, 1165, -12419, -33185, -58347, -71154, -77692, -58167, -27249, -23259, 1749, 6357, 12489, 22163, 24418, 11736, -3699, -23714, -35377, -26841, -37459, -21625, -8801, 12480, -16676, -27935, -56251, -39852, -15151, 2052, 34434, 50829, 24362, 22300, 8368, -19904, -19895, -6649, -27866, -59669, -83474, -67278, -44751, -35653, -6436, 9610, 19846, 8978, 15901, -1381, -39117, -34304, -44815, -75013, -48321, -24419, 112, 23896]
22224B3896j5105k379j8343m4707j8939L235L0731J0599j3020o877L9360R897
22212a652k7459j5226K5824L8932n290l5891Q205N388M991j678J5472j987k1290
22199a1661l367L1540j3960j7055o651P273j4180l0441j9289J4055J6352J4215
22187c3169L0254j2598p653J8965M08N36j6692n4952k3219K8763J8510J5180R379
22174b6288M683K848L030J0924R907L0507j3468k1953j1465q104M0740J281l2637
22161i995Q656j2880l5022J1279Q861L2580R539N517o100k2798J2474l341j1416
22148a2646K6682q210L918k7032k7281J7918l769J3172j4010j9414l172J4522
22136c9322K4878K8534P400j6381l1179k1138J3548K0928O06M1377R078j9996
$$ y = [23896, 8791, 6412, -11931, -56638, -75577, -72342, -41611, -31012, -44032, -50909, -11549, -1652, -29111, -44337, -18513, 20419, 15129, -20762, -12557, -7169, -2178, -3856, 11616, 9629, -11661, -15028, 16512, 2552, -14503, -21154, -13881, -28061, -58502, -77791, -63736, -47384, -33169, -2915, -15513, -23166, -4201, -3793, -3257, -19949, -74901, -98120, -69357, -50847, -35667, -26288, -21605, -18757, -15727, -4803, 5104, 35611, 22143, 190, -11275, -19379, 21361, 22642, -9995, -1339, -14219, -49241, -37962, -29101, 3479, 13018, 18535, 12435, -10363, 2111, -1230, -12646, 14036, 5826, 9744, -17288, -44569, -26651, -30420, -17248, -31258, -50672, -53844, -39322, -14444, 14090, 21490, 5109, -26070, -47208, -33660, -12732, -12126, 29251, 38329, 18333]
22124A8333l2016p336J4576M116K0327n700J2850k8768k8266J1498q589j8785
22112d7760M352J5913P633J7468J4941j0047k2355r547P355J8131Q212j2536j7387
22099b5627l208K3976J6420j1248o534j9293j8225k408K349J0471p872L7876K7715
22086B4392k6299o112N417P297J0871r285j4225J2267L566q552m1663o058L3230
22073a5154N352J016P105j8980J5922J7548j6120m732k7490L441k2260n920K3094
22060c7178K9141J3636K0930O028l2294j0704J1236o995j3812j647J0598Q543
22048b518M889Q812j423J8712N555j0941k5656P529m981k3200k4933P709k699
22035d3145P99m053k943Q180N035O240m041Q629J7305j0533k3900l6774o835M3933
$$ y = [18333, -13683, -21019, -6443, -2327, 18000, 12300, 25150, -3618, -31884, -20386, -28975, -47760, -43408, -27495, -19862, -2394, 12547, 2500, -19855, -29402, -22047, -3916, 4296, -8240, -25627, -28835, -4859, 11561, 313, -6221, -25514, -43739, -46147, -43798, -33327, -41199, -3323, 24392, -1907, -8019, -2602, 4695, 15566, 6281, -7944, 4323, 7889, -663, -42326, -48384, -15154, -9802, -8786, -1681, -20661, -4739, 12809, -3311, -8043, -35533, -32092, -54352, -60272, -37178, -8037, 5599, 26529, 32557, 263, -10441, 795, -6200, -20012, -21659, -11061, -2518, 2371, 11183, 9760, 28472, 34027, 23086, -2570, 4959, -22, -23222, -48155, -40446, -43145, -42346, -46399, -49342, -41162, -36127, -29887, -33928, -25299, -7994, -18527, -42427, -79201, -86036, -42103]
22021d2103K3762m527m008J4033K9992J4091j1476j4712j842j0383K4734k1883
22009d322L528q68q729r559j864M035p772L986Q048j7148Q578J8967n885J3518
21995D513j5711K0620J2847Q333K062n180l7795j3384L0243m425j8124j5786j5595
21982d7382j4986K0786O101K5958J9372o664m066j533m782J926k137j469K94L5065
21968B6483K3250k3178k6084k03l612J319P751R053j8931k688K6554K0488l1724
21955H478k292l115m772j1301J6314M667l1035l0945k889P811j4463J6713J7889
21942b8940K3321M109j4200Q401K376o748j7504K384P275J908j4260O079L2409
21929F610q497l6196J4295O609p168j47J5487J1334l471j2473k3668k4935j116
$$ y = [-42103, -18341, -22868, -26876, -12843, 17149, 31240, 19764, 5052, 3210, -7173, 17561, -4322, -794, -1662, -10391, -19950, -21814, -17779, -25551, -21565, -13517, -30665, -22087, -3120, -9005, 4513, -11198, 9422, 22269, 30602, 32664, 27484, -10311, -23695, 6548, 2123, -16001, -31787, -47382, -62368, -41582, -35481, -9523, 9849, 3185, -881, -2414, -7196, -5270, -7407, -8876, -8582, 26483, 49733, 26555, 471, 268, -3344, -2025, 5726, 14779, -4152, -6840, 19714, 40202, 8478, 6186, 3071, -1701, -13002, 3312, 7979, -23056, -54001, -56890, -49079, -63542, -46829, -28940, -5619, -1510, -15710, -7309, -4933, -11681, -29185, -26801, -19526, -17618, -31878, -25799, 6610, -1887, -38083, -23788, -17179, -24347, -24494, -9007, 2327, -1144, -13617, -37285, -62220, -63336]
21916f3336J2492L7409J5148R59m4832j5579J810K4532M2864m964j4443j97R288
21903A151j1260j1656L494q90j7093j2339J3338k9910K554J4806K2850N300p483
21890b7138j5079R746q548M459P641j266j2162J3645K061p291o658O4J0771K0980
21876h775K8084J6631J8711l6347m3135l268N698l3372L6472K7776J2001K19j0586
21863A0109K950j0309j4589k9411j0657O881L0079J0318N374j4908p68K6736m733
21850G072l1925k1530R895N474J9391J1490M077O568m807k2051k4521K4193K5230
21837H556q287p714k0808P452J4578K148Q77k03J1942k8106k0321j3021j8059
21824g0966J3861J3158M0981l501j6947P526J5188L280K4148N404p482k6101Q44
$$ y = [-63336, -50844, -13435, 1713, 2672, -42160, -57739, -55929, -31397, 11467, 6503, -7940, -8137, 1151, -10109, -21765, -18271, -19161, -36254, -48593, -35255, -65165, -62611, -47805, -24955, -19655, -27138, -42217, -32471, -41019, -36560, -28919, -30185, -42347, -28702, -26641, -33932, -40590, -40526, -29755, -8775, 19309, 35940, 54651, 18304, -24831, -28099, -22401, -55773, -19301, 8475, 20476, 20695, 10109, 13059, 2750, -11839, -41250, -51907, -45026, -14947, -4629, 745, -14163, -14931, 11805, 7072, -24853, -46383, -36488, -31014, -11623, -133, 3944, 10512, 5705, -16346, -40867, -16674, 8556, 269, -7445, -28253, -20801, -6223, -4075, -3198, -3401, 8541, -19565, -39886, -52907, -70966, -57105, -43947, -2966, -6467, -23414, -15888, -700, 2580, 26728, 32132, 24650, -1451, -607]
21811f07m499J9036k5962l1259p064K8617J018o073J3653K1700K2190k6911l8407
21798c4568J2723K0087R233J5868p849k5054l101K7072J7762k2330k9687j6622
21786c6466j0956J9739J6772K267K6175J2725M710j7076k411q75k23j8016K286
21773a349L712k0976J0694Q697L2688k1434j7676Q125M948j0846k5587k0276o114
21760e5394R169J5379L460j2302J945J6849R309j7673q380j8754j4273R442M9304
21747a1919J0731j5439r713J9043l296j029j1278j828J0420Q612j8461K244o991
21734b8904k96J2790p524m17K3842k972J9109J8323k921l2187P812l836j3516
21721a0697N595l473N834J6115o27j0282l6128j4971O978J1036Q613J3784j1989
$$ y = [-607, -5106, 13930, -12032, -43291, -50355, -21738, -20720, -26793, -13140, 8560, 30750, 3839, -34568, -21845, -1758, 7475, 23343, 15494, -9560, -12661, 14411, 32173, 9843, -19844, -36466, -47422, -27683, -10911, -8644, 17531, 30256, 34966, 17890, 15479, 14604, 14381, -3635, -1349, 2363, -18613, -7919, 778, 33466, 12032, -5644, 2481, 7429, -3417, -29004, -49280, -55394, -46225, -30846, -27386, -39688, -37743, -20894, -11585, -29258, -37638, -56392, -70665, -61223, -11919, -1188, -16627, -26340, -7297, -10593, -11622, -22900, -24728, -14308, -5696, -24157, -21913, -28904, -29200, -16410, -23934, -24351, -509, -3481, 15628, 33951, 31030, -1157, 6655, 2819, -10697, -5102, -8575, -2741, 13374, 12747, 2465, -33663, -48634, -41656, -30620, -22007, -8223, -20212]
21708b0212q513j4651q987K5885K9231Q367q495N781J2124o516k9105P887J7080
21695I876J3539m083j8161R146L260J040j4499p394J4208M2527J4102j2092k4315
21682B7154n2068L876L8954K4568l839j9831K176J6383m590j3593J1079j805j0524
21669A7940k15L33l408j3397j0169M964O172J0122k5537J0371K2545K8740J4361
21656F2822j4281m6273k4480k8047M753K1101K8221K775k3438j6579O102K8517
21644A193P655L3304j4420j3237j2758k205n517j7740o000j1180J6232N139k245
21631b1779J492n791J0222K2843m280q292p05n42J3872J6450j7554k2540Q845
21618g759K4429k9199j1252J643J6893J2027k6320J055L892P402K627O217o041
$$ y = [-20212, -28725, -43376, -52363, -26478, 2753, 11120, 2625, 8406, 20530, 14014, -15091, -7204, 9876, 23415, 19332, 1171, 10317, 13577, 14617, 118, -7276, 6932, 49459, 63561, 51469, 27154, -24914, -21038, 17916, 42484, 38645, 18814, 20990, 37373, 32783, 19190, 30269, 28464, 17940, 17725, 18058, 14650, 1253, -8916, -3952, 2220, 12342, -13195, -2824, 19721, 48461, 62822, 48541, 2268, -22212, -50259, -45506, -24405, 3816, 6591, -16847, -33426, -27324, 1193, 8848, 42152, 27732, 14495, 1737, -468, -5985, -23725, -29725, -40905, -24673, -19534, -21779, -20287, -26078, -15856, 6987, 2707, -5585, -6290, -6832, 7040, 23490, 5936, -16604, -7759, 16670, -12529, -23781, -22138, -5245, 6782, -19538, -18483, -14591, -7189, -4562, 1655, -4386]
21605d386k0241O964J4026K2138M588J148j0014r263j0432M71j9468J606K2247
21592f16l88r582m248R955R884J576l0505Q578J3776K135k6484J3776K6144r742
21578D259j1627J2430q341j0327o475k3580J7171L3364k6178j7908M977j1733
21566d3968K281M0988K0174k0736N842K7978P234j2483m1988n991K8776R618n366
21553A2359J4207k4974n159J120r058j5360k6778J2950R681j9783L179J0790n527
21540d2353K3212K3168k1152J6256K2272j9805j1898K1197K3521q016p197l010
21528A6195n777j5126j4480j4350M514K6574P950J6928J0742O99o855j4837L777
21515A5954Q555n353J608J4225L11n5673j5104j552P286R565M726k1285n081L2898
$$ y = [-4386, -24627, -17663, -3637, 18501, 23089, 24237, 14223, 4960, -5472, -5001, -24469, -22863, -616, -1004, -10586, -14834, -4879, 5005, 6581, -23924, -15346, -1570, 565, -25919, -12143, 14001, 4259, -7368, 5062, -3279, -13606, -20081, -43661, -26490, 6874, -19304, -37212, -32235, -43968, -41687, -699, 19475, -1261, 4581, 32559, 39793, 27310, -14678, -20669, 8107, 17725, 12359, 26566, 1592, -3567, -2447, -11505, -26865, -53643, -40693, -31012, -50795, -47616, -36826, -42353, -19141, 4027, -17125, -869, 21403, 1598, -10300, 10897, 34418, 26402, 19205, 16195, 10418, -4708, -19188, -33538, -29024, -2450, 5500, 22428, 33170, 33869, 27014, 12177, 15954, 24509, 19156, 20764, 34989, 35300, -20373, -35477, -37029, -29743, -20178, -15452, -36737, -41818, -8920]
21501h920K4008l139l1036j581P202J5134P021k0404J5701Q827j0488P615J9548
21488B9488o233J092k4594l4673J4874o246K1826r926Q576j1636p672N777k1365
21475d0712k4564J7033J4738Q309J6733k5031m090k4736j0998L4314K2538k2370
21463c8836K6186J754l408P552j1096J1306R905j4763K780J4955N661J2111j651
21450B2456k014J0109o721n1303j7402M280M970l740O581J5309R946j2248k6264
21437d6041J6663J4292o457O126o048n403k3807j1550L793K5262K9006q265j2650
21424b5079m684o672L7625J3458p377m732j0213m677N430J192l8984m139L0818
21411a8034J2172L293P499k154r744j1058J2056P36j3641k6186K4902J4724J4980
$$ y = [-8920, 15088, 11949, -19087, -20668, -13466, 1668, 8689, -11715, 3986, 12813, 2325, 9940, 29488, 23255, 24347, -247, -34920, -20046, -26292, -4466, -14392, -5816, -17452, -25124, -19347, -40712, -65276, -48243, -33505, -25196, -8463, -33494, -37584, -62320, -73318, -39004, -16466, -38836, -12650, -10896, -14304, -6752, -17848, -6542, 3363, -11400, -8620, 6335, 11996, 24107, 22456, 20442, 30551, 23830, -27473, -44875, -40595, -35625, -39365, -32784, -17475, -7529, -19777, -46041, -29378, -15086, -21543, -15417, -21465, -26868, -50675, -62225, -58432, -33170, -4164, -12429, -25079, -29763, -36435, 1190, 14648, 7271, 2539, -7674, -12351, -6921, -5729, -44713, -48852, -18034, -5862, -2569, 4930, 2776, -6968, -18026, -5970, -5234, -18875, -45061, -20159, -5435, 9545]
21398I545j0615K2149k652K2608K1086l2626m0916j7469k7652J0470L5810j926
21386a2188l732k916J0991P385k368J1012J0616J0971R973j1181l8457N47K1547
21373A2200k8637j9746K21q86j7508K2333K8701j0339k4506R274L7267M528l708
21360I194l92j1196j3715j245J9875k4178j8797Q313J428K7936n274j8300N094
21347b1257Q758K6502j6584R690K4113k432l0498j0362j1463j1141j4961r211
21335e8846K7525K5727L2644J8596K2810J7665j9939l5891j3952j8777k3461L120
21323b2779k7273M183J0664J129j1557o331J7006J5444j6208m608M346N07L768
21310c1709Q311K594K6603J5115m1889j3879K5334m140q275q299K2646K9348J0862
$$ y = [9545, -1070, 21079, 18427, 41035, 62121, 29495, -11421, -28890, -56542, -46072, -10262, -12188, -15920, -18836, -7845, -460, -2828, 8184, 18800, 29771, 39744, 28563, -9894, -9347, 12200, -16437, -36183, -35962, -36848, -54356, -32023, -3322, -13661, -38167, -28893, 8374, 12902, 9194, 8802, -2394, -16109, -17354, 2521, -21657, -40454, -32141, -30713, -2777, -8051, -26351, -21257, -12499, 14003, -2581, 7109, 31222, 28790, -1708, -12070, -23533, -34674, -49635, -58846, -31321, -5594, 27050, 45646, 68456, 86121, 66182, 30291, 16339, -2438, -25899, -22779, -50052, -45869, -35205, -34076, -45633, -51964, -34958, -19514, -35722, -40330, -35984, -35477, -31709, -23398, -20804, 5799, 20914, -20975, -34854, -9520, -13660, -21935, -30234, -7588, 21760, 32622]
21297C2622p449J2833m934l9137L653J2263j1414R849K695o967j3739J208j9262
21284b7779j1811N903k6402m601L6886J9440J671O634K6703j9999k5713j6178
21272c5246o048J3158j5280K3438L6306O679K186n907M206K5405P703k1065j4746
21259B0789j1990n103J7354l360k7604j9293L0330L3976K436j5058p909J1382
21247B5950k0773l3871j533j3950q086J0848P283j6428J340l974L5398K036K662
21234a3098J7869J8343J0936j4533j1109l071O060r871J4036J4853k2210k9255
21222b1050j5474L303J6045L5013J1187k5022j0622j1638j737j3433j1178j2562
21210e7168J5115l48N156J2457K8930m822K1561J1116j28k6719J2201j8957j2204
$$ y = [32622, 25173, 38006, 33072, -6065, -2412, 9851, -1563, 8286, 10981, 4014, -9725, -8517, -27779, -39590, -33687, -60089, -64690, -27804, -8364, -6693, -59, 26644, 6645, -19068, -35246, -41294, -28136, -43416, -19978, 16328, 23007, 25193, 19286, 23492, 48897, 56600, 35535, 20789, 8799, 3696, 21050, 17690, -9914, -29207, 1123, 35099, 37535, 22477, 14568, 25950, 5177, -28694, -30227, -44177, -52263, -41415, -34132, -50560, -49220, -53194, -17796, -15760, -13098, 4771, 23114, 34050, 19517, 8408, 5337, 11397, 1526, 15562, 30415, 8205, -21050, -36524, -33221, -17176, 17837, 29024, 4002, -6620, -18258, -19995, -33428, -44606, -57168, -42053, -42401, -37245, -24788, 4142, -680, 20881, 31997, 31869, 5150, 17351, -1606, -13810]
21197a3810O90m931M860R61p764l0680j1827r126O559L6758K5436j5495P153M66
21183a0750j1112r327K6961K5152j5240j0292m398q561l679Q123J8688l245j8477
21170a6157N251j8817J778M014R731R12Q929J1840j246K9077j0334k7710q722
21157a1454k2948r112J6365k8864M927K8988L24l960K3761L066p248j0860J3321
21144c694K269k208M105J8999m732k3573q549K533J5166K6477J338n846k0089
21131B196J008L3574j5159j8783r296K3374j4333r542k7134Q847O949o109Q805
21118a5603N5721K0901m242j3865j7530p0o32l0212k2579j6105J4813L9601p697
21105B501k0914O044j8J4145q696l2440K0428j543K0203K6482N412k199k5013
$$ y = [-13810, -13120, -18051, -13191, -12230, -19994, -50674, -62501, -71627, -65068, -28310, -2874, -18369, -11216, -10750, -21862, -31189, -4228, 20924, 5684, -4608, -9006, -17567, -21246, -13123, 5565, 2320, -16157, -10906, -29723, -27945, -23931, -14200, -13288, -4359, 7481, 6235, 35312, 24978, -2732, -11454, -34402, -43514, -27149, -56013, -51086, -22098, -21774, -25734, -1973, 1093, -6155, -17015, -3694, -1425, -3633, 472, 19471, 14739, -8834, -17383, -14850, 316, 26793, 28131, 22285, 2196, 3204, 36778, 21619, 2836, -6460, 16914, 2581, -6961, -34095, -25248, -18299, -24408, -15603, 40118, 61019, 56777, 42912, 25382, 25312, 24680, -5532, -28111, -44216, -29403, 10198, 2501, -18413, -12369, -12387, 1758, -6938, -39378, -18950, -20493, -290, 26192, 31604, 29405, 4392]
21092D392j7159o959J6169n694J6980R011k842K0611k8232j9636j5574j614K4761
21079e786J1669k1934l317j1439k1985N507K3692r556j899J1303M0178r443p841
21066h51j3845J3238J2669l6394j908J1321M077P359J5836J0071k381m912J2731
21053B7011k3668J858j0366R114k164j4804j151n071j5805P062N183k310r087
21040c4198R810k912q60r633P295K6284N534p218m8045k0878K9271J4974j2461
21027d3037R075J0104j0338o743j2437J2105J0351Q197P985n196J5574j0198N238
21014i320j4909O899J4014R835k8364n676J8285K9639m47j5336k2026l879N666
21001a5619K9977k6516k6443Q927j0528j2482j643n077J3924N024K2350J8285
$$ y = [4392, -12767, -19726, -3557, -9251, 7729, 16740, 13898, 34509, 6277, -13359, -28933, -30547, -5786, 5883, -16051, -19368, -30807, -52792, -47285, -23593, -33149, -35048, -23745, 16433, 6990, -851, -14696, -1458, 11211, -25183, -27091, -15770, -11693, -4334, 11502, 21573, 19192, 14280, 27011, 3343, 5201, -5165, 3949, 1785, -13019, -14170, -19241, -35046, -27984, -22801, -25111, -34198, -24388, -27300, -28160, -37793, -30498, -4214, 1320, -5898, -53943, -74821, -45550, -30576, -43037, -33962, -23858, -34196, -40939, -53376, -41271, -30920, -22723, -14738, -19934, -4360, -14558, -9320, -24229, -17330, -3316, 6519, -21845, -27521, -9236, 20403, 19956, 4620, -17406, -21285, -15619, 14358, -12158, -38601, -29674, -40202, -52684, -54327, -59404, -45480, -40456, -18106, 179]
20989A79q799N041J731J7323J715k1340J291K2265j1184j530q050k6389j3617
20976d1364p2L150J3026J4214O903j7975p063j0053J8329L681k211j3934J5577
20963a7792j2954P251J0656J7421k1506j9558K6502K2267K801r191p819P903P93
20950F774K3498k1047l786j2855L946j267j526J7303Q560k908l2085J8783k273
20937A117j0132l054j1936j0567j1818k1717Q462J6501J9038Q896m7829j7460
20925h0499Q336n414K7596L3758j1005j1428J9900K5453J2564j1266o113k62J9757
20912B1377p701J802P735R167r955j5008l7520j5954J4391k5283J3403J2897N04
20899c0145j2033K810J4273R912L1653L1570L208k9512l0789j7697J212j4863
$$ y = [179, -8620, -3579, -1848, 15475, 17190, -4150, -2859, 19406, 8222, 6692, -1358, -27747, -41364, -41436, -38286, -25260, -11046, -4143, -22118, -29181, -39234, -20905, -17224, -19435, -33369, -17792, -30746, -23495, -12839, 4582, -16924, -36482, -9980, 12287, 15088, 5897, -1922, 5981, 6774, 30272, 9225, 5439, -7416, -3470, -4737, -6263, 11040, 19600, 16692, -15393, 3390, 1117, -9015, -12069, -24005, -34572, -46390, -68107, -59645, -43144, -24106, -15210, -63039, -80499, -72163, -77577, -49981, -16223, -27228, -38656, -18756, 6697, 19261, 7995, 1882, 1620, 21377, 13676, 15478, 23213, 32380, 22425, 7417, -30103, -46057, -31666, -56949, -43546, -30649, -30145, -42178, -39368, -25095, -15183, 16470, 48040, 51248, 21736, -9053, -26750, -25538, -40401]
20887d0401j0709Q574L0789Q296l3873l986K4660o276J3379J4817P386j6758j9997
20874b4099K967J2106K866j1155k0676j0008M720M362J4530J5194O398J3437j3192
20861b550n113N743k7970j7051J2332K9208j3849l2244Q942J3854Q009j4958k882
20848c8529K3090k4984l5239J3528K1610K9015K053j6307P790R478J5310m8152
20836d1337j7112R447K2594n782j3135J1785J0831r745K9512Q396l885j949j4491
20823a4871J5730L1721j7716j2143L740o93j4311J0201J7891k5088k8724L850
20811c0413O657K1302J2721K6850J5032p750m3570J250J3041j8410l1325j3396
20799d8011p054J5358Q746J1810j8082J2056n234l944J0906K7118J7201m0160
$$ y = [-40401, -51110, -42536, -11747, -3451, -37324, -41310, -16650, -22926, -9547, 5270, 12656, -4102, -24099, -21132, -9026, -6160, -17315, -37991, -47999, -43279, -38917, -24387, -9193, -2795, 10642, -2550, -7663, -1920, -29890, -46941, -34609, -5401, -19250, -51494, -42552, -28698, -20689, -35647, -38529, -15439, -40423, -75662, -62134, -40524, -11509, -9456, -25763, -17973, -8495, 6815, -41337, -58449, -49002, -26408, -32190, -45325, -33540, -22709, -32454, -2942, 5454, 1569, -380, -14871, 859, 32580, 14864, 2721, 6461, 5768, -8543, 1658, 19549, -5539, -34263, -30413, -23756, -2454, 10267, 37117, 52149, 44399, 829, 2079, 15120, -3290, -34615, -48011, -55065, -39707, -30961, -19151, -37233, -25177, -30411, -34355, -23449, 3669, 20870, -19290]
20787a9290j348j021k1805L608J3795J5326J8161J4450j1536K3387l5470l7820
20775c9563L896J336K5510R584k2646k3743K1503K6680N251k0218L992M13M0L1813
20761B3848J6403O727q307l1964k9755J537l928j5036k4381p542L8079J4826j6987
20748c6480K533P610J625N110J8963O380l7784L0989K0931J0359K1879j6765N310
20735D0660j0179j2782j3934P1K4520n329j8636M02J1033J2702j8366J467j4323
20722b694K543N849l0j853N90j4007j697j5464J0327J0596j2934j4899M7534j8392
20708d531k5940K0437r916N834O863k708k4149K623j3909J1690K183J3000J1488
20695g035k3579l2144m542L4747L1626J1757l19J7849J846J4878j388P82k5591
$$ y = [-19290, -20638, -21659, -43464, -39856, -26061, -10735, 7426, 21876, 10340, 33727, -1743, -39563, -35667, -34331, -8821, 763, -21883, -45626, -24123, 2557, 7808, -12410, -8418, -8005, -7965, 23848, 40251, 46978, 38671, 6707, -23048, -21511, -25439, -40475, -64856, -72398, -34319, -19493, -36480, -33947, -26337, -24712, -19602, -639, 5741, -32043, -1054, 19877, 30236, 52115, 35350, 40660, 30481, 17699, 3765, 3836, 28356, 23027, 4391, 4793, 15826, 28528, 10162, 11629, -2694, -151, 5698, 5668, 3815, 4405, -9602, -11299, -26763, -16436, -5840, -18774, -33673, 13861, -4531, -30471, -10034, -19950, -14116, -7253, -9961, -34110, -31487, -45396, -33706, -31523, -18523, -7035, -30614, -62758, -67300, -32553, -927, 10830, 10511, 28360, 30206, 45084, 43696, 44478, 18887]
20682A8887j2964K4013J0009R18l4707j4860j9601J1087j2161o400j1176j3797
20670f0752J9127K35Q607m524K5268P350k762J4001J8305O494J0258K3008j351
20657F3264m0288j4911K5394J8538j8544l9743J5940R443q789j1114o563m959
20645a2332K7100n977O617k2234l3470j506J7771L195k7212O471J8514Q342j4284
20632b9005J261K545L1740J727j6277n096J2401o422j0508Q902m510p837K907
20619a8172R191O091r743k008P72n601M831M299J9624R953J5897K161M082j4977
20605B6400p264j7172R835q821j0879j9604n273L4747R881j4789r96J0201k2555
20592a6289k007j184q587L646k6236j4407J8831K0355J9684J3241M536j1123j7926
$$ y = [18887, 5923, 29936, 39945, 40863, 6156, -8704, -28305, -17218, -29379, -35779, -46955, -60752, -41625, -41390, -32783, -37307, -12039, -4689, -7451, 6550, 24855, 31349, 41607, 64615, 63264, 22976, 8065, 33459, 51997, 33453, -6290, 9650, 19093, 10304, -810, -7373, -12332, 14768, 8791, 15408, -6826, -40296, -41802, -24031, -20836, -48048, -41577, -23063, -14721, -29005, -27744, -25199, 6541, 8268, -8009, -13105, -704, -7126, -17634, -8732, -13242, -21079, -18172, -8981, -2890, -12633, -14641, -13869, -19470, -14639, -10340, 9284, 19237, 35134, 37295, 41377, 26400, 19136, 1964, 11799, 2978, -7901, -27505, -32778, 1969, 11850, -2939, -3935, 6266, -16289, -18296, -19480, -28067, -24421, -50657, -65064, -46233, -25878, -6194, 7047, 11583, 460, -17466]
20579a7466J4868J9991p310J1642k907K1540k1121l0164k1213k7793o967k0011
20567h6911O787J7203j593J7502K7474O726J1325L137J0005L358j0183J6093J0580
20554C1503k5166o627J736k350j9641l894N194J4556L2777J4969n991k8292j7136
20541h362N511N241k4364O54k1246p148K5319L4467K00l0564J0686L866k360r381
20527a7481j775q828m759K1126P368k819p913R258j136j106J3644J2668o869r94
20513A0384j9799j6525K1226J3475M422l3542k8648P563J5122J0663M569k3899
20501c4989m794J0581Q496Q580J6172j8330k4201j3753J5724K5704n415M272K0017
20488H064K7759K960m7906J0448J9693k27j6151L450Q58j4367K2230K2925l3892
$$ y = [-17466, -2598, 17393, 10083, 21725, 18818, 40358, 19237, -10927, -32140, -59933, -66900, -86911, -80124, -62921, -64514, -47012, -19538, -12812, -1487, 1650, 11655, 15013, 4830, 20923, 31503, 6337, -290, 1446, -904, -20545, -24439, -19245, -4689, 28088, 43057, 37066, 8774, -8362, -2851, 2390, -21974, -21320, -42566, -49714, -24395, 10072, 10272, -20292, -9606, -5740, -8100, -17481, -19256, -28084, -32843, -11717, -4349, -7168, -15081, -5823, -6959, -8065, 5579, 18247, 11378, 10384, -9415, -25940, -4714, 8761, 13183, -20359, -49007, -41444, -26322, -15659, -11090, -34989, -39783, -29202, -20706, -12126, 4046, -14284, -38485, -52238, -36514, -10810, -16225, -11953, 8064, 35823, 38783, -9123, 1325, 21018, 20791, 4640, 8090, 8948, -5419, 16811, 39736, 5844]
20475E844j7430J81J8223J188J7047K750M886m366J39m428m632n872P782J5037
20461C6349k5392q298j8044k9602m33L8704K9684j0965k648Q19P905J7109l215
20448C1973J0106m708j1853O203J2678Q722l8811r281K9420L0277J6380K960R407
20435I3473k4522k1679l0461j9728K2547k6668j5199L50K9831R902k4734j4121
20423b1009M682K0961K0513l0450j6997J8706R481j1326k435K761K800J075L1542
20410C0304J1104j1381k0194j0775k4224N438K2498J0826P203p280k0189k6376
20398c3046J7885P714J6126K640O306L0189M232l7886k4404J0598j2091k1084
20386c2821K8524K9658o191J1411Q27k1681J0610J5734j2576N580o741q24L948
$$ y = [5844, -11586, -11405, 6818, 8006, 25053, 27803, 32689, 28323, 28462, 24034, 19402, 13530, 21312, 36349, 10957, 2659, -15385, -44987, -45420, -6716, 22968, 12003, 9355, 10174, 18079, 35188, 31973, 42079, 37371, 25518, 31721, 44399, 53121, 14310, 5029, 34449, 64726, 81106, 84066, 93473, 68951, 47272, 16811, -2917, 19630, -7038, -22237, -21887, 7944, 17846, -6888, -21009, -16327, 4634, 25147, -5303, -22300, -3594, 5887, -5439, -7874, -5113, -2313, -1238, 30304, 41408, 30027, 9833, -942, -25166, -19728, 2770, 13596, 20799, 13519, -6670, -33046, -15161, -7447, 8679, 11319, 17625, 47814, 52046, 14160, -10244, 354, -11737, -32821, -4297, 25361, 19170, 30581, 31408, 9727, 20337, 36071, 23495, 29075, 22334, 21510, 25458]
20373B5458M961j7275j3123R370K1729k311J9183j3369l2608k8862j6398O545
20361c6700J8258l015j5692j8270M1211M3634j616k3626q315l954K4915K6893
20349D3723k7987l1006j8151q233O077K4592J9258j179n568j5175O262m862n637
20336a7886n18J6160P088j6852m141K3794j718j2374J9879J0074j904O979j7692
20323A0889j4454M193j9920o5R677k387L3366o856K283N321K5128O965j2566l3173
20309H401N040L3040J0936l4266k3973l435Q501L279J6801j4758k885p322J1286
20296A0645K2848P950p463J3687O052k0145L289N66k8911j3019L4102J1411k1743
20283A9269j0788N806J558N360M420P071l2718k0064R372q125j2013M544K6784
$$ y = [25458, 30419, 13144, 21, 9391, 31120, 28809, 47992, 34623, 2015, -26847, -43245, -36700, -18442, -21457, -37149, -55419, -14208, 29426, 27810, 4184, -4131, -8085, 16830, 43723, 15736, -15270, -33421, -41654, -35577, -10985, 8273, 7094, 1526, -13649, -7387, -12249, -17886, -18404, -2244, 4844, -12008, -16149, 7645, 5927, -6447, 13432, 23506, 21602, 28581, 10889, -3565, 628, -19292, -19357, -9680, -12067, 21299, 14443, 16726, 22047, 47175, 54140, 41574, 8401, 13441, 46481, 57417, 23151, -822, -4257, 4244, 7523, 24324, 9566, 6681, -641, 10645, 33493, 41443, 33980, 47667, 53719, 33574, 36863, 37429, 8518, -4501, 29601, 41012, 19269, 8481, 14287, 15845, 21205, 25625, 32696, -22, -20086, -10714, -18839, -30852, -26308, 476]
20270D76L7691m531L608K213K122J0507q276M0q965k3530j8436J1677L2561J0988
20256D8145l800K120j0071m445J519k66J9415k2335j0469J1769j5322k0251o7
20243d058j166j9552K74L8320O090j0328J7097r838P675n446r04j6502J0116J4232
20229B6010J5565L640O929J2466j955K304r944j4693J388j4044J974k838O443
20216C3245J8957J4700m782j7609O453J9079j5454k1809l7440M4896N564j9044
20204B6756N928J29K574l396j7824N724k063j3060L173N076N480j4651m894j1773
20190a2821O240n559n985J1130j5812J3425J8472J1654o779L80q079O191J1310
20177B3767k4381K255j2377q473O635K0781J0506j5614K473J5009J3824m5976
$$ y = [476, 38167, 33636, 37244, 39457, 41579, 52086, 43810, 43850, 34885, 11355, -7081, 4596, 37157, 48145, 44345, 46465, 36394, 31949, 33468, 33202, 52617, 30282, 19813, 31582, 16260, -3991, -4058, -5224, -24776, -24502, 13818, 19908, 9580, 26677, 16839, 24514, 19068, 18164, 1662, 11778, 26010, 41575, 45215, 52144, 64610, 62655, 64959, 55015, 40322, 41710, 27666, 29640, 26802, 33245, 52202, 66902, 62120, 44511, 50964, 70043, 54589, 32780, -4660, 40236, 45800, 26756, 32684, 32813, 35387, 31991, 14167, 19891, 17828, 4768, 7941, 13017, 18497, 3846, -1048, -12821, -6581, -12140, -18125, -6995, -22807, -9382, 9090, 20744, 13965, 14345, 6266, 12457, 23767, -614, 1641, -10736, -19209, -12574, 8207, 18713, 3099, 5572, 20581, 34405, -11571]
20165a1571j7652K1965K2326r13k5257j33K4322J3748j1467J5064J2396K3584
20153F6412j8498o1011J8346P402J62p690o721O047L3352M044m7220l494L2514
20140B3645N735J0673J4382j3526l1129r106o791J4157L1534o127J6587J9046
20128F9080k7613l4354J7194M473k8038j9277j2367N346K7322J8827J2828L0034
20116F3455m820l4797j3662M285k4212K323K2528J8599r266j6615j1092k3513
20104b6787k0732p326L2879P059q926J7012L2980K6524J150l1900l0822j2127
20092b1016j0227j53j6574J6160J8193j9732j1448M973K3859J5802K612o662k2578
20079b6791k9030L6986j557j4224N499K0049J5935L9781N908k1010j0712k2274
$$ y = [-11571, -29223, -7258, 15068, 14155, -11102, -11235, 13087, 26835, 15368, 30432, 42828, 66412, 47914, -13097, 5249, 12651, 12813, 5123, -1598, 4449, 37801, 41845, -5375, -8869, 23645, 29380, 40053, 54435, 40909, 9780, 674, -6117, 8040, 39574, 33447, 50034, 69080, 41467, 7113, 24307, 28780, 742, -18535, -30902, -25556, 1766, 20593, 33421, 63455, 58635, 23838, 10176, 14461, -9751, -7428, 15100, 33699, 24433, 7818, -3274, -26787, -47519, -54845, -21966, -14907, -23833, -6821, 26159, 52683, 53833, 21933, -8889, -21016, -31243, -31396, -47970, -31810, -13617, -33349, -44797, -39824, -15965, -163, 2449, -4213, -26791, -55821, -18835, -20392, -34616, -29117, -9068, 6867, 46648, 52556, 31546, 20834, -1440]
20067a440J6356K63k3188J0592K1207k805J5458k768m351M3538O639L656k1252
20054F1905L466k6441j9523n050p656J4024J8213R02J2822P712n396j6871m972
20041C3135J9685K7872r864J797J6170k814j4257m62P210J2473k5169k2191k8007
20028A5578J0561K3452K5974K374k4504q573J053J2367p67K3465K0832k8290k0569
20015E2953j1059J3648K3227j4099l4868O104J5493k425k38p607K995J0176r125
20002D5175j1842K2829q59k4599o366J2933q87J5451k81m0369k7551J2494J9719
19989A5847L504K369R311R897j433K9893n477J3157J9748k4240k6343n179N753
19976D6807J927J963K8629M3815J5057P018J5367K5646q138R970K5909M3164R0572
$$ y = [-1440, 14916, 15179, -8009, 2583, 23790, 20985, 36443, 33675, 29324, 72862, 79501, 83157, 61905, 65371, 38930, 19407, 14357, 6701, 20725, 38938, 39840, 52662, 60374, 54978, 38107, 33135, 52820, 80692, 70828, 72625, 88795, 85981, 71724, 71262, 78472, 90945, 65776, 43585, 15578, 26139, 49591, 75565, 77939, 53435, 44862, 45915, 58282, 57515, 80980, 101812, 73522, 52953, 41894, 55542, 78769, 64670, 29802, 35906, 51399, 48974, 48736, 41129, 44124, 54300, 45175, 33333, 56162, 55303, 30704, 24338, 37271, 36384, 51835, 51554, 11185, -16366, -3872, 15847, 19351, 21720, 31031, 40928, 39495, 69388, 63911, 77068, 96816, 72576, 46233, 41054, 46807, 48734, 50697, 79326, 123141, 138198, 145216, 160583, 186229, 178091, 188061, 213970, 257134, 347706]
19963C47706Q0699M7772L0247j9160O684j4988m4272q534K1134O0898Q0545J9195
19951F07926l91j0236n6447l3760O082M9720N0158M9572o809K889k4933n8717
19939E75054m3474l2357K5102L4485P143J7852j6083p4068q3892o6898n6984o3317
19927B22563j0300o000k3644m3472P558o160j2232k0086J040J9274J0374q319
19915A30596k7729j0162j8291j2550l820j0852K0687k417J670R569L6193J881
19903A14775l878j1922K547J2255L163k0739l4161r842K5859j5201j3775N308
19891E4389M6016j0945l0654l3864n614L4677Q655j5037j903K8092J1431J1580
19879I6823r28l998P334l493K3737J719r2J11l7940j6450j318K9758P401k3402
$$ y = [347706, 428405, 476177, 506424, 487264, 493948, 478960, 434688, 426154, 447288, 508186, 588731, 607926, 607535, 597299, 540852, 507092, 513174, 562894, 613052, 662624, 655815, 658704, 633771, 575054, 531580, 499223, 524325, 558810, 565953, 583805, 567722, 493654, 409762, 342864, 285880, 222563, 212263, 206263, 182619, 139147, 146705, 140545, 128313, 108227, 109267, 128541, 138915, 130596, 102867, 92705, 74414, 61864, 58044, 47192, 67879, 65462, 67132, 76701, 112894, 114775, 110897, 98975, 101522, 113777, 116940, 96201, 62040, 52198, 78057, 62856, 49081, 54389, 100405, 89460, 58806, 24942, 19328, 54005, 62660, 47623, 45720, 73812, 85243, 96823, 95895, 91897, 99231, 95738, 119475, 121194, 121102, 121213, 83273, 66823, 65505, 95263, 102664, 79262]
19865G9262m965J3318k100k902j427J1725k023Q535J4578K127j0589j0352j3326
19852H1861J6238J028R020J6576j7009j3098n9923l5926J8696J487j9688J6854
19840A6116J183J2625L9787L0338R395l891j4927L4607K184q830J421J2817k0025
19827A12800J189O818J1769n790k0862Q33K1575M8855J9903k0042K267J7833K5295
19814B22443J7229L8530O7673N3826O7748Q6224J05177N1278o203n304o6123n5359
19802E77139k5424j8797j6042K0455L5000N4844P2066O0903L6185J7239j5498
19791G98070k6129n3808m0955l2541m8084m7626n5112p4445j05263n9894j1899
19780B42314j4828l920J3339K5003k4379j0984m821Q877N728l085K2349R778p10
$$ y = [79262, 74297, 87615, 85515, 82613, 81186, 92911, 90888, 99423, 114001, 116128, 105539, 95187, 81861, 98099, 99127, 108147, 124723, 107714, 94616, 34693, -1233, 17463, 18950, -738, 16116, 17299, 29924, 69711, 100049, 109444, 105553, 90626, 125233, 127417, 118587, 120008, 132825, 112800, 113989, 120807, 132576, 126786, 105924, 106757, 128332, 177187, 197090, 177048, 179315, 197148, 222443, 239672, 278202, 345875, 399701, 467449, 553673, 658850, 710128, 703925, 698621, 632498, 577139, 551715, 532918, 516876, 537331, 572331, 627175, 699241, 760144, 796329, 813568, 798070, 771941, 718133, 677178, 644637, 596553, 548927, 493815, 419370, 314107, 254213, 242314, 227486, 223566, 236905, 261908, 237529, 226545, 221724, 230601, 236329, 233244, 255593, 265371, 264661]
19767B64661K1714M7121K9354L0476n233l4133p817L6004L8599K4723L7617O1217
19755E44303L0923Q5896R3739J17405J10777J6978n650k67m4352j2414l1251k8469
19743H77618j4018P331j2568j8106q663m1035r9596r2099p5394m3877k4444k6794
19731D28355j7749k2717l1721n9081m0791j6009J797j4269r789l3266n742j7221
19719A61797o666j6572J9040M7315n631k620j4677J628M133L654n870J7974n19
19706B02986j366j38j0329j964k0571j7936j5904K5553K1295m692r833k4939m319
19693A37843J4587m048J5483J5759k881p162k1242J0663J1193N254k7514k1584
19681A26351J0070K7136j3773k9727J0094j3383o623K0104M2365J7983J1561O14
$$ y = [264661, 286375, 333496, 362850, 393326, 388093, 353960, 346143, 382147, 420746, 445469, 483086, 544303, 575226, 661122, 754861, 872266, 983043, 1000021, 994371, 994104, 949752, 937338, 906087, 877618, 863600, 870931, 858363, 840257, 831594, 790559, 690963, 598864, 523470, 479593, 455149, 428355, 410606, 387889, 356168, 297087, 256296, 240287, 242084, 227815, 218026, 184760, 179018, 161797, 155131, 138559, 157599, 204914, 199283, 196663, 181986, 183614, 187747, 191401, 185531, 203505, 202986, 201620, 201482, 191153, 189189, 168618, 150682, 134778, 160331, 181626, 176934, 167101, 142162, 137843, 152430, 148382, 163865, 179624, 176743, 169581, 148339, 159002, 170195, 175449, 147935, 126351, 136421, 163557, 149784, 120057, 130151, 116768, 110145, 130249, 172614, 190597, 202158, 202772]
19669B02772r532k0434j8501L690j5296j5582K8428J3549k470j5247j4881K4311
19657A60807J9849k5333m517M013r244j7596N834M0296J5560M769J1514J6511
19645B22463j7840p193L0701O149J2659p686o246Q274J7670J7740N597K506m409
19632B80385m585Q934K5875K3773J8747L3102K3312j7966n395k9075j8046O173
19620C45234K0061n893k011J7013J0453J1171K1228N3835J7107K0979M1995Q1356
19608F32528O7702O5387K9941J0812j6130m0988l5925O12J2058K2344N7032M1523
19596H46896N4634O6487J1103n8146q4115n5701p3147o5274l8451k805J2262J3285
19584F27028J2580k5904k4782o9225m8898j3878k9625q821k8349l5625j1877J8769
$$ y = [202772, 193240, 172806, 154305, 157995, 142699, 127117, 155545, 169094, 166624, 151377, 136496, 160807, 180656, 155323, 150806, 154819, 145575, 127979, 133813, 174109, 189669, 194438, 205952, 222463, 204623, 197430, 228131, 234280, 246939, 239253, 233007, 241281, 258951, 276691, 282288, 284794, 280385, 275800, 284734, 310609, 334382, 353129, 386231, 409543, 391577, 386182, 357107, 339061, 345234, 365295, 359402, 357391, 374404, 384857, 396028, 417256, 471091, 488198, 509177, 551172, 632528, 700230, 765617, 795558, 806370, 790240, 749252, 713327, 713939, 725997, 748341, 805373, 846896, 901530, 968017, 979120, 920974, 836859, 781158, 708011, 642737, 604286, 601481, 613743, 627028, 639608, 613704, 588922, 519697, 470799, 456921, 427296, 418475, 390126, 354501, 342624, 361393]
19572C61393L961L0530K5793J1889J318q714r485J8756L0896O1682M2982P0464
19560F41465M7286K1652K7995M1628M7860M1258K5764K7027J04234J01257O3137
19549A190563M2990K8325m66n4291n2634l3860k8307j3158l754Q80L647k1901
19537A058034l4887p1036j06260j13638q9759p4898o9726m0164p0608k1843L0005
19526C95220j0138l9892Q42r929j8507K3665K5512l9299l5639N378L086J4246
19514C14545j0292j2988J3940L0188J0940r810L0673j0674j3506J0771J3438M0606
19502D07831N7508L1456J5796O183L6889L5951J8962o190m369J8792k4548m200
19490E90061p259P801K7116M175J3595K1703l1381k0442j2561p296M269L658j5019
$$ y = [361393, 365354, 395884, 421677, 433566, 434884, 426170, 416685, 435441, 466337, 528019, 571001, 641465, 688751, 710403, 738398, 780026, 827886, 869144, 894908, 921935, 1026169, 1127426, 1190563, 1233553, 1261878, 1261412, 1207121, 1154487, 1120627, 1092320, 1079162, 1075408, 1076288, 1079935, 1058034, 1023147, 952111, 845851, 732213, 642454, 567556, 497830, 457666, 387058, 365215, 395220, 385082, 345190, 346032, 336103, 317596, 341261, 366773, 327474, 291835, 297213, 300299, 314545, 304253, 291265, 305205, 335393, 346333, 336523, 367196, 356522, 343016, 353787, 367225, 407831, 465339, 496795, 512591, 518774, 555663, 591614, 610576, 604386, 600017, 618809, 594261, 590061, 582802, 590603, 617719, 621894, 635489, 657192, 625811, 605369, 592808, 585512, 589781, 593439, 578420]
19477E78420j0983k2542j6299O212J3491P766j484J6766q5j214J3544J4531j883
19464E96240K9187L2835N891k862k0967k9013J6180J3206J2599P986R313M0321
19452G10916K4093j9178o9765n5766j1296m720P476M2878K6270K4353L6185N9870
19440G71316L8913M9865K4477L3985J9709J7950K3817K7689L313M389J4678L6571
19428A066672N785L2474L3907M2162O1662N3229L7778L7419L4546P3430N3564
19417A532628M6392O9504O5503O6263O1660Q7358J17904Q4413J11745J31192J52177
19406B526739J69893J40052J55813J73998J46017J55385K07681L02889L56136
19397D334603L62312L71985L91202M48491N47650O84270Q13108R14518J035211
$$ y = [578420, 567437, 544895, 528596, 534808, 548299, 556065, 554581, 571347, 571262, 570048, 583592, 598123, 596240, 625427, 658262, 664153, 661291, 640324, 611311, 627491, 640697, 653296, 661282, 670595, 710916, 735009, 715831, 646066, 590300, 579004, 574284, 581760, 624638, 650908, 675261, 711446, 771316, 810229, 860094, 884571, 918556, 938265, 956215, 980032, 1007721, 1011034, 1015423, 1030101, 1066672, 1072457, 1104931, 1138838, 1181000, 1242662, 1295891, 1333669, 1371088, 1405634, 1479064, 1532628, 1579020, 1648524, 1714027, 1780290, 1841950, 1929308, 2047212, 2131625, 2243370, 2374562, 2526739, 2696632, 2836684, 2992497, 3166495, 3312512, 3467897, 3675578, 3978467, 4334603, 4696915, 5068900, 5460102, 5908593, 6456243, 7140513, 7953621, 8868139, 9903350]
19388I903350J192681J428761J767829K347510L259307M783906P236740J1090745
19380D3010829J6423002K0723617J8725985R713226k086348j2473525j3367100
19373H0669686o533991J603980R428176J5227903J4651906O479889m914516j5122857
19365A01490176j6513307r133387N39470J0399039J8395179J8153631Q446251
19358A31777052m997581j7985414j9342411j0831002j264344P476956J4343810
19351I9177066J4777172O310603o470523j9374198k3936381j8875227j2492053
19344C9116459q071578n399850l792245k877653k212110j774229j450339j193781
19336A2344674j004556q42331p03009n75787m54640m25596l92907l73311l12827
$$ y = [9903350, 11096031, 12524792, 14292621, 16640131, 19899438, 24683344, 31920084, 43010829, 59433831, 80157448, 98883433, 108596659, 106510311, 94036786, 80669686, 74135695, 75739675, 85167851, 100395754, 115047660, 121527549, 116613033, 101490176, 84976869, 75843482, 76382952, 86781991, 105177170, 123330801, 131777052, 126779471, 108794057, 89451646, 78620644, 77356300, 84833256, 99177066, 113954238, 120264841, 113794318, 94420120, 70483739, 51608512, 39116459, 31044881, 25645031, 21852786, 18975133, 16763023, 14988794, 13538455, 12344674, 11340118, 10497787, 9794778, 9218991, 8764351, 8338755, 7945848, 7572537, 7259710]
19327G259710k33115j81214j12346n9196l6037n4385L125N1661J15594K34095
19317F987892K82254L35435K99617K81486L10265M21357N47016P47597J108405
19308A1321324J516818K096986K859311L583184L888514L436043K447047J368397
19300C2517624R87965J824215L661366O426846J0430815J6267956K4038867L0798985
19292A26954639K9960454K0208711O649024o942728j4001667j5793934j7605020
19285A29429479j9790079j7837428j1818007n761817j365008N86656l31777l354010
19277F9758009o861537r100764r050790p433283n570393m032436k932506k068550
19269B2707750j404184r55275o06857l22037j20718R8735L32009M63186N25086
$$ y = [7259710, 7026595, 6845381, 6733035, 6673839, 6637802, 6583417, 6586542, 6638203, 6753797, 6987892, 7270146, 7605581, 7905198, 8186684, 8496949, 8918306, 9465322, 10212919, 11321324, 12838142, 14935128, 17794439, 21377623, 25266137, 28702180, 31149227, 32517624, 33505589, 35329804, 38991170, 45418016, 55848831, 72116787, 96155654, 126954639, 156915093, 177123804, 183772828, 176830100, 162828433, 147034499, 129429479, 109639400, 91801972, 79983965, 74222148, 72857140, 73443796, 73112019, 69758009, 62896472, 53795708, 44744918, 37311635, 31741242, 27708806, 24776300, 22707750, 21303566, 20348291, 19741434, 19419397, 19298679, 19397414, 19729423, 20192609, 20717695]
19260B0717695O29588Q76331J295209K030265L073668M414449O203446Q414370
19252D7655021J0553508J1598552J0352984O754504K347264q82427j050349J910040
19244H9239097P160252J4326071K3771015L4452970M2495585M4506450M0089976
19237B96041416K4702657j324k4654791m5637313n4094302m6123802l2388298
19230A17844243k0914674j2771821p155720l656705k661988m007363o459454q595110
19222E1621408q947219p473931n663806m227458l176770k405871j808775j389932
19214A6527646j100547r96421r54329r38663r70621j017043r30617p94133o82664
19205H142608n67684m72538m24887l92506l70577l42624l29095l17150k93675
$$ y = [20717695, 21347283, 22223614, 23518823, 25549088, 28622756, 33037205, 39240651, 47655021, 58208529, 69807081, 80160065, 86914569, 89261833, 88379406, 87329057, 89239097, 96399349, 110725420, 134496435, 168949405, 211444990, 255951440, 296041416, 320744073, 320742749, 296087958, 250450645, 196356343, 150232541, 117844243, 96929569, 84157748, 77002028, 73345323, 70683335, 66675972, 60216518, 51621408, 42674189, 35200258, 29536452, 25308994, 22132224, 19726353, 17917578, 16527646, 15427099, 14430678, 13476349, 12537686, 11567065, 10550022, 9619405, 8825272, 8142608, 7574924, 7102386, 6677499, 6284993, 5914416, 5571792, 5242697, 4925547, 4631872]
19196D631872k70882k43333k42599k34510k34955k22147j85995j57707j29843
19187B709901n7036m1868m0605l4048l5622o1825n4181q9162q4920n9515q8084
19176B063035o1942m3973q686l1880l5081j4704J1506j175m1380k1620q936J6262
19164A821426L1777q275m796J5043Q46J39K0436R151j1263Q129K9385M857j9923
19151A896932K6468N2008L5475K1304J4066J3993k4567M1224L7287L5059N4979
19140B204228P9306P2636P9333P9510Q3159O0054J08739J06257J18478R5392J07314
19129C194406J00956R7449J15753J66644K04963K21564K53837K61237L07844L13764
19119E238417L39440M35545M78988N62734O42181P42875Q33275Q95211R09057
$$ y = [4631872, 4360990, 4117657, 3875058, 3640548, 3405593, 3183446, 2997451, 2839744, 2709901, 2652865, 2610997, 2570392, 2536344, 2500722, 2438897, 2384716, 2295554, 2210634, 2151119, 2063035, 2001093, 1957120, 1948434, 1916554, 1881473, 1866769, 1878275, 1877100, 1835720, 1814100, 1805164, 1821426, 1853203, 1844928, 1840132, 1855175, 1856021, 1856160, 1876596, 1885747, 1874484, 1882613, 1911998, 1916855, 1896932, 1923400, 1975408, 2010883, 2032187, 2046253, 2060246, 2035679, 2076903, 2114190, 2149249, 2204228, 2283534, 2356170, 2435503, 2515013, 2598172, 2658226, 2766965, 2873222, 2991700, 3087092, 3194406, 3295362, 3392811, 3508564, 3675208, 3880171, 4101735, 4355572, 4616809, 4924653, 5238417, 5577857, 6013402, 6492390, 7055124, 7697305, 8440180, 9273455, 10168666, 11077723]
19110A1077723R30732R79673J122583J357308J807358K399500L149735M241766
19102B7066378N625984P116974Q078006P722507N980481L843646K772802M164354
19094G2371132Q230320J4432160K2799113L3439333M4087347M7983053L9441989
19087B82784447K1105823k139373k3555497l4725323l8886845l8815900l1629841
19080A34137491k1593746j3024033o523654j828137P67396O07105k257683o509975
19072H3774764j0177198j1499288j0434567q308585o215186m619951l419160k515825
19064B6585004j902433j495461j148025r11502o96962n22621l28596j04958J39610
19055A9614056L66391O50207J122399J818025K765540M063645N664277P406146
$$ y = [11077723, 12008455, 12988128, 14110711, 15468019, 17275377, 19674877, 22824612, 27066378, 32692362, 39809336, 47887342, 55609849, 61590330, 65433976, 68206778, 72371132, 80601452, 95033612, 117832725, 151272058, 195359405, 243342458, 282784447, 303890270, 301750897, 278195400, 243470077, 204583232, 165767332, 134137491, 112543745, 99519712, 92996058, 91167921, 91935317, 92542422, 90284739, 83774764, 73597566, 62098278, 51663711, 43355126, 37139940, 32519989, 29100829, 26585004, 24682571, 23187110, 22039085, 21127583, 20430621, 19908000, 19579404, 19474446, 19614056, 19980447, 20630654, 21753053, 23571078, 26336618, 30400263, 36064540, 43470686]
19047D3470686Q602885Q288517N985467K629535k42458p79681J667510O457864
19039G6080325J2569950J8062738J9803573J7929674J5342201J1834990O371054
19032A77994505l485979j6773939k8791224l0403556k3231808j5577271j0140727
19025D9590001o383822l763961k047835j296895j577074k549241l630830m107547
19017B4232796l756511k999721k258674j688616j248766r93347q33063p15027
19009I739071o56613o44131o47546o23773n57953m75248m20278l60682l07336
19000E045511l02019k76627j95274j88825j76306j60722j70269j45016j20659
18991C309794j07076j16574r7740j11801o9965l6646q752P3373Q1384N8412K5778
$$ y = [43470686, 52073571, 60362088, 66347555, 68977090, 68734632, 67954951, 69622461, 76080325, 88650275, 106713013, 126516586, 144446260, 159788461, 171623451, 177994505, 174508526, 157734587, 128943363, 98539807, 75307999, 59730728, 49590001, 43206179, 39442218, 37394383, 36097488, 34520414, 31971173, 28340343, 24232796, 20476285, 17476564, 15217890, 13529274, 12280508, 11287161, 10454098, 9739071, 9082458, 8438327, 7790781, 7167008, 6609055, 6133807, 5713529, 5352847, 5045511, 4743492, 4466865, 4271591, 4082766, 3906460, 3745738, 3575469, 3430453, 3309794, 3202718, 3086144, 2988404, 2876603, 2806638, 2769992, 2761240, 2834613, 2915997, 2974409, 3000187]
18980C000187o5104j86980j87416j88146k00525j79740j57992o2743m0902n4997
18970A675642l5578j1085P141j3473n8052n0949m5666n3682m4614j8311j460J2901
18958A362814k5839m0849o3857k9822o739j5437j937L64Q6629N5218K9091l732
18946A345904l2895l4526n7104k9872k4918K4242K5121p175K6467L2563O2153
18935A329960O7127P4188J14199J18414J14548N9599M309m9969p4287j22414j42143
18924A493531j34207j44470j11059q4139n4758q515K144N072j0982j9790P930
18913I40757j6277k333o8221m9796j1750L748J770k4845l429J4297K962j8449
18901G68434j5875q365J5118k947k9698l650K4223N128O167K0913m6415k7526
$$ y = [3000187, 2935083, 2748103, 2560687, 2372541, 2172016, 1992276, 1834284, 1771541, 1730639, 1675642, 1640064, 1628979, 1636120, 1622647, 1564595, 1513646, 1467980, 1414298, 1369684, 1351373, 1349913, 1362814, 1336975, 1296126, 1232269, 1202447, 1195708, 1180271, 1178334, 1178698, 1265327, 1320545, 1349636, 1345904, 1313009, 1278483, 1221379, 1191507, 1166589, 1190831, 1215952, 1208777, 1235244, 1267807, 1329960, 1397087, 1471275, 1585474, 1703888, 1818436, 1878035, 1882344, 1832375, 1758088, 1635674, 1493531, 1359324, 1214854, 1103795, 1019656, 964898, 956383, 958527, 963599, 952617, 932827, 940757, 924480, 922147, 853926, 804130, 792380, 796128, 797898, 773053, 769624, 783921, 786883, 768434, 752559, 744194, 759312, 756365, 726667, 723017, 747240, 752368, 758535, 779448, 733033, 705507]
18889G05507R690J9230j7947K5809M0836O1654M2617L2432K4138j1894j0650j7602
18877I03820j0746N092k7321l0628q587L0139K3954j2812j3520J7017L6822o775
18865I06455k0470J0371K4602L6489K1884K8273N5260j1427K3648K2456L0949
18854A128490L6030N7099P3450O2095O3079P9152J17304J13301O0326N132l0214
18843A765244j5230K4126L9568P2330J10697J06598J13218J54449K37533K28252
18833B836785K62101K81035L69387M46963N07695N33361N48240O49245Q57980
18824G292792J245689J864732K861964M468171P093397J1119693J4591457J2421574
18816F2959469M737837m698753j3522331j3580593q996586n337609l175105j825121
$$ y = [705507, 715197, 734427, 716480, 742289, 783125, 844779, 887396, 919828, 943966, 932072, 921422, 903820, 893074, 898166, 870845, 840217, 831630, 861769, 885723, 872911, 859391, 876408, 913230, 906455, 885985, 896356, 920958, 957447, 979331, 1007604, 1062864, 1051437, 1075085, 1097541, 1128490, 1164520, 1221619, 1295069, 1357164, 1420243, 1499395, 1616699, 1730000, 1790326, 1795458, 1765244, 1750014, 1774140, 1813708, 1886038, 1996735, 2103333, 2216551, 2371000, 2608533, 2836785, 3098886, 3379921, 3749308, 4196271, 4703966, 5237327, 5785567, 6434812, 7292792, 8538481, 10403213, 13265177, 17733348, 24826745, 35946438, 50537895, 62959469, 67697306, 62998553, 49476222, 35895629, 26899043, 21561434, 18386329, 16561208]
18808A6561208r52007k68262L67228J091436K050382L508538N781182R144826
18800C7284531J2218084J0915756M715687l004081j0464034j0842885o579890
18793C4243168k825285P5957K720846N792562J0028211J6481248K5221457L1606017
18785A23344181K5700920Q489462j2384450l0330087l0394777k0706631j2656418
18778E1062200p653896m534897k469314q32704Q37864K828515N427378R211584
18770E3876730J5033550K3252500L0057014K5763295R296586j1038129k9978283
18763A16263263l1978126k2558082j4410182r275626o064603m013815k595328
18756B5367501j694701j202552r16727p02524k95754L65281J118233J885837K889152
$$ y = [16561208, 15609201, 15340939, 15708167, 16799603, 18849985, 22358523, 28139705, 37284531, 49502615, 60418371, 65134058, 62129977, 51665943, 40823058, 34243168, 31417883, 31493840, 34214686, 40007248, 50035459, 66516707, 91738164, 123344181, 149045101, 157534563, 145150113, 114820026, 84425249, 63718618, 51062200, 43408304, 38873407, 36404093, 35571389, 36409253, 39237768, 44665146, 53876730, 68910280, 92162780, 122219794, 147983089, 157279675, 146241546, 116263263, 84285137, 61727055, 47316873, 38041247, 31976644, 27962829, 25367501, 23672800, 22470248, 21553521, 20850997, 20555243, 20920524, 22038757, 23924594, 26813746]
18747B6813746M204714N986567Q698107J3017434J9617979K6895387K8356753
18740A33590687J9008340L493404j3437604k1322356j5558906m973388N738040
18733A06538217J5368210J9566515J2927327j435694j7963508k8680358k6622742
18726G9697967j8986999j2591345q465607n937954m333404l257145k523273j833932
18718B1768308j189015n47228J00044Q68562J760567K870444M589249P204206
18710C7425137J0388553J1682090Q198839J481864n975237j0307453q180576l417123
18702D1296094J218888N537847Q110459O090421J62785o810365j2171792j1568366
18694C1865971p911935n005868l276579k324951j748164j391842j126204r11213
$$ y = [26813746, 31018460, 37005027, 45703134, 58720568, 78338547, 105233934, 133590687, 152599027, 156092431, 142654827, 121332471, 105773565, 100800177, 106538217, 121906427, 141472942, 154400269, 152964575, 135001067, 106320709, 79697967, 60710968, 48119623, 39654016, 33716062, 29382658, 26125513, 23602240, 21768308, 20579293, 20032065, 20132109, 21000671, 22761238, 25631682, 30220931, 37425137, 47813690, 59495780, 67694619, 69176483, 63201246, 52893793, 44713217, 41296094, 42514982, 48052829, 56163288, 62253709, 62416494, 55606129, 43434337, 31865971, 23954036, 18948168, 15671589, 13346638, 11598474, 10206632, 9080428, 8169215]
18686H169215p50446o65340n63872m15867l49344k99653k67160k76507k79114
18677D301912k69105k31403k00699j74561j78208j63165j75681k00405j55059
18668B553626j33162j30294j38251p7076o9486m7888l6106n3197p9474m8030m7498
18657A693164o4090r4219o4569l0860n1262j4969m7295n9912m9849o8905m0769
18646A106465J3033L5275n130r409j179l1218l7900m8280m8696l2357m0146L83
18634I00841J8950K1899J6481n508O786O7137N8519m0348q5129j14462j12019
18623G33147n4702j8867j1324J6944K9346O711M5658n584k5826J4390O1449J9994
18611H11336N2965P2724K597p7621p7868n8182m5939k4707j8148j4658J3068j2852
$$ y = [8169215, 7418769, 6753429, 6189557, 5773690, 5424346, 5124693, 4857533, 4581026, 4301912, 4032807, 3801404, 3600705, 3426144, 3247936, 3084771, 2909090, 2708685, 2553626, 2420464, 2290170, 2151919, 2074843, 2005357, 1957469, 1921363, 1868166, 1788692, 1740662, 1693164, 1629074, 1534855, 1470286, 1439426, 1388164, 1373195, 1325900, 1265988, 1216139, 1147234, 1106465, 1119498, 1154773, 1149643, 1140234, 1139055, 1107837, 1069937, 1021657, 972961, 940604, 900458, 900841, 919791, 941690, 958171, 952663, 959449, 1026586, 1085105, 1044757, 959628, 845166, 733147, 678445, 659578, 648254, 665198, 694544, 701255, 746913, 741329, 715503, 729893, 791342, 811336, 864301, 937025, 939622, 862001, 784133, 725951, 680012, 655305, 637157, 622499, 635567, 622715]
18599F22715q034l782J9269K14K0462O452J6812M2370L3533L1215P6253R4961
18587I52440O8540O3586N9956O5848M0713K8432L2849J7266m1693M007O789K3527
18575A322260K5773q419n9886o1336r0545j21966q6050n7168o3278o9649m5663
18564F84073m5195o45R722n179j3655O914J43o72J7849L3562N4187J4267m8561
18551G06810q1892n6226m5254J1385J7818K8480L1174J4644N640j3679m376K656
18539F17180L9182N2745L3313N7961M7208P1174n92k2544K7040J3793l0316l6184
18527H69960n2516n4597k2475J0768M635L6931L7861J2734K9347M2565M2746k7237
18515I30722o9837p5453r7820p8410q9937n3770m2801k4380k0528j2237r693l1744
$$ y = [622715, 614681, 610899, 630168, 630382, 650844, 657296, 674108, 716478, 750011, 781226, 857479, 952440, 1020980, 1084566, 1144522, 1210370, 1251083, 1279515, 1312364, 1329630, 1287937, 1291944, 1298733, 1322260, 1348033, 1339614, 1279728, 1218392, 1127847, 1005881, 919831, 862663, 799385, 729736, 684073, 638878, 638233, 647955, 642776, 629121, 636035, 636178, 635506, 653355, 686917, 741104, 755371, 706810, 624918, 568692, 523438, 534823, 552641, 581121, 612295, 626939, 632579, 618900, 614524, 617180, 656362, 709107, 742420, 800381, 847589, 918763, 918171, 895627, 922667, 936460, 906144, 869960, 817444, 762847, 740372, 751140, 755775, 792706, 830567, 843301, 872648, 915213, 957959, 930722, 860885, 785432, 687612, 609202, 519265, 465495, 422694, 398314, 377786, 365549, 355856, 324112]
18503C24112m2044k0230J6058p037k8940p311J355J1544J6976K5232P887k0568
18491B77034l2452l1100l7703j1654L3078N2955K2615L659k3968l2073j5457K4369
18479B29303J9102p85J9639K54p13k3541l3881q740J5905J9810j5544J0150Q247
18466B39206j8686n8634m1189J4661K0694Q82j4988N50J5597J5591m1832k2512
18454A09340r34J2320K9077J2306J7091n022l2004J045J7098K9941R261k7524
18442A71995m2661Q231J2901L9609K1130k5215l0546k179K437J589r44J986M033
18429A62366k845m334m0760k2K5531q562L988J7626j0297k2840J7842j178n559
18416A30956m3711l3188M480J0255L6204K6979J8102O216J6108O989j2269k1730
$$ y = [324112, 282068, 261838, 277896, 270859, 241919, 234608, 235963, 247507, 264483, 289715, 297602, 277034, 244582, 213482, 175779, 164125, 197203, 250158, 272773, 276432, 252464, 220391, 204934, 229303, 248405, 247620, 267259, 267513, 266800, 243259, 209378, 200638, 216543, 236353, 220809, 230959, 239206, 220520, 161886, 120697, 135358, 156052, 156934, 141946, 142496, 158093, 173684, 131852, 109340, 108406, 120726, 149803, 162109, 179200, 174178, 142174, 143219, 160317, 190258, 199519, 171995, 129334, 137565, 150466, 190075, 211205, 185990, 155444, 153265, 155702, 157291, 156347, 158333, 162366, 159521, 155187, 114427, 114405, 139936, 131374, 135362, 152988, 142691, 119851, 137693, 136515, 130956, 87245, 54057, 58537, 68792, 104996, 131975, 150077, 156293, 172401, 179390, 167121, 145391]
18404A45391q668K8943m448k7091M429K1620j7252m322J3611n815k6142j36j2668
18391A07452n366J0506p000k6146r737k0313m8356n789K7790N0499K2771k6932
18379F9379n653J9845j9038j2899K6701q659j5156J383J7799L2391J948m1681
18367F6360j830J6210M138J47n907j5314l646N470J8336j1170J747J2769P479
18354I4789j3690j8961J3934r026J5389K2828K2801J726N329k6675j7262q195
18342H2987j5110j4087j6515L030K0451K9381J4997k0308L678j5573k2241j023
18330D9667L8791J0089j0764k1407l2292j169M629k742M314j0294K290K0851J8762
18317G0725K4428J2334M816j5776n431j065j4625k2516j1324R149j840j9333K197
$$ y = [145391, 136723, 165666, 161218, 134127, 138556, 160176, 142924, 138602, 152213, 146398, 120256, 120120, 107452, 102086, 112592, 105592, 79446, 69709, 49396, 1040, -4749, 23041, 73540, 96311, 69379, 63726, 83571, 64533, 51634, 78335, 69676, 54520, 55903, 73702, 106093, 108041, 66360, 64530, 80740, 84878, 85025, 79118, 63804, 60158, 65628, 83964, 72794, 74541, 87310, 94789, 81099, 62138, 76072, 67046, 82435, 105263, 128064, 129790, 135119, 108444, 91182, 82987, 67877, 53790, 37275, 40305, 60756, 90137, 105134, 84826, 88504, 72931, 50690, 49667, 88458, 98547, 87783, 66376, 34084, 32915, 37544, 34802, 39116, 28822, 31112, 51963, 70725, 95153, 107487, 112303, 96527, 91096, 90031, 75406, 52890, 41566, 50715, 48875, 29542, 31739]
18304C1739K4658N574O964q629K966N303j6962k2563k1254L1756K9314P416O231
18291H2513j3019M772J4320J8775j0635J4626P692j848l400J2697k280k8779m193
18278I1241q896j2315k6242k4712L1909J5219J4668k0202M156l818K906K8398
18266I2312j6596M25J6568Q809L270j7639M1876L4235j4884m2292l1832j2072
18254F2180l7666M702L1326j516n734J3177k276l3272R784j9245K6230L2912J5640
18241I6242j574r44m129j8228K4150M691o845O749P86m335k0907R275J4516P907
18227A07354j3848K4651M5538M5187K780J9744J6275k1206M4908O5963P1076P8217
18215D86639J29386J11586J09278Q3403M4320N127n6684j12029o0070m4331l8777
$$ y = [31739, 56397, 61971, 68935, 60306, 63272, 68575, 51613, 29050, 7796, 39552, 68866, 76282, 82513, 69494, 74266, 88586, 107361, 96726, 111352, 119044, 117196, 113796, 126493, 124213, 95434, 91241, 82345, 70030, 43788, 19076, 50985, 66204, 80872, 60670, 64826, 61008, 63914, 92312, 75716, 76141, 92709, 101518, 104788, 87149, 129025, 163260, 148376, 106084, 74252, 62180, 24514, 29216, 60542, 59026, 53292, 66469, 64193, 30921, 40705, 21460, 47690, 80602, 96242, 94668, 93724, 89595, 71367, 95517, 100208, 93363, 100112, 100898, 96563, 75656, 84931, 99447, 107354, 93506, 118157, 163695, 208882, 211662, 231406, 247681, 226475, 271383, 337346, 408422, 486639, 616025, 727611, 836889, 920292, 964612, 969739, 913055, 801026, 740956, 696625, 657848]
18204F57848K6241L7954K001J8311j0688k6198m041k3162L113R294K0493k8007
18192F83159k5100l8401o8822o5598n3618p110K4664J7678P7121Q0004O9291P5012
18180G68280O7232M1097j575m1229l5814n7843m3188q660K5719J5049K1795k5638
18168G25225k3736l9799k9476j4110j7764j4185m6007k1194l6854p4873m9391
18157C57836k7295p0118k0994o452r186j5857n1223j9430j4349N394K060J4564
18145A44950j8988j1744K8350j891k4567j7019R818Q738j835M008P96m4014j8629
18132E7973K1808K829j451o384m1689l4756J9717N0224q062J1182K3242k2853
18120G1780k8924P55K3576o784j7052k790j3362K3K035L4854J8514l482K938J4247
$$ y = [657848, 684089, 722043, 724044, 742355, 731667, 705469, 701428, 678266, 681379, 690673, 711166, 683159, 658059, 619658, 550836, 485238, 431620, 424510, 449174, 466852, 543973, 623977, 693268, 768280, 835512, 876609, 875034, 833805, 797991, 740148, 696960, 688300, 714019, 729068, 750863, 725225, 701489, 661690, 632214, 618104, 600340, 586155, 540148, 518954, 482100, 407227, 357836, 330541, 260423, 239429, 232977, 223791, 207934, 156711, 137281, 122932, 128326, 130386, 144950, 125962, 114218, 142568, 140677, 116110, 99091, 108909, 117647, 115812, 119820, 120616, 76602, 57973, 79781, 82610, 81159, 74775, 33086, -1670, 18047, 68271, 60209, 71391, 94633, 71780, 42856, 43611, 67187, 60403, 43351, 40561, 27199, 27222, 29257, 64111, 82625, 79143, 82081, 96328]
18106I6328K204l2036M777l556J796j1430J654J1873j3581m9725m628J5222m696
18093A4202J2120J4967M211Q145M201K1549j7795m1989k1648L271J6633N2429
18081G0296n861l438J3097k3257l2348j7360j1792o064N63J6224R813Q017M5999
18068F3889L1398J902j730m2980m494R706p319J119Q841q89p456K1718L1437k0479
18054H4663j8635J538j6290o653M1982j0586k8403m324P446J8451N756o361o561
18041F2023M476j145r114j214J4156k3346J1170K2258K4102K7798R6262J17343
18029C44769Q8469K3273m0878r2696p5063m7784n1628n4469k8337j5298J247J8109
18017F9714K727k0771j9198l073K8136L5962L9668M4937M3146M3201N3892P2247
$$ y = [96328, 98532, 66496, 71273, 67717, 69513, 58083, 59737, 71610, 58029, 8304, 3676, 18898, 14202, 26322, 41289, 45500, 53645, 57846, 79395, 61600, 19611, -2037, 1234, 17867, 70296, 64435, 60997, 74094, 50837, 18489, 1129, -10663, -16727, -16164, 60, 9873, 17890, 63889, 95287, 97189, 95459, 52479, 47985, 57691, 50372, 51491, 60332, 59443, 51987, 73705, 105142, 84663, 66028, 67566, 51276, 44623, 86605, 76019, 47616, 43292, 50738, 69189, 74945, 68584, 62023, 66499, 65354, 56240, 55026, 69182, 45836, 57006, 79264, 103366, 131164, 227426, 344769, 433238, 456511, 415633, 322937, 247874, 200090, 148462, 93993, 65656, 50358, 51605, 69714, 72441, 51670, 32472, 29399, 57535, 93497, 133165, 178102, 221248, 264449, 318341, 390588]
18005C90588L0975j3124n0889l8095m1987k1579J6173P1326L0852L2842j8562
17994C88520n2612p0370o7701l4542l0704k0214k3944k1311J6545K2973j5874
17983I0766j8049Q351j5660k5657M3936N8702L6876K7037N5015M6976K6246j8603
17971C15936o7491n4516m8250p9869n815j1649k8430J4653K9425J8656J927r214
17959G5363k3396j4797k057j8738n63K405J6646J1326N096Q462J4740K3438j1751
17946H6174l1470l4835j9485O662Q448J6555J3607J4901R094j5801j6147j6333
17934B1370L412J5448J3954P804r151m516K7631K3736l4191l3623k1192M131j0318
17921D495K0792J4062j612j7766k2097k4112K3578J8650r347O821k747k048J0400
$$ y = [390588, 421563, 408439, 357550, 319455, 277468, 255889, 272062, 343388, 374240, 407082, 388520, 335908, 265538, 197837, 163295, 132591, 112377, 88433, 67122, 83667, 106640, 90766, 72717, 81068, 65408, 39751, 83687, 142389, 179265, 206302, 261317, 308293, 334539, 315936, 248445, 193929, 145679, 65810, 59995, 48346, 19916, 34569, 63994, 82650, 84577, 75363, 51967, 37170, 35113, 16375, 15812, 18217, 34863, 46189, 51285, 59747, 74487, 97925, 86174, 54704, 19869, 384, 7046, 15494, 32049, 45656, 60557, 69651, 53850, 37703, 21370, 24782, 40230, 54184, 61988, 52837, 48321, 75952, 99688, 65497, 31874, 10682, 14813, 4495, 25287, 39349, 37737, 19971, -2126, -26238, -2660, 15990, 6643, 13464, 10717, 8669, 19069]
17908A9069R828J3257M027L744r398k2833J2539J9071p813j4276n808o527m958
17895I922K899J1276J9764R109K3046l305l1098k7432K7050Q729M661l9306J2238
17882B7553J2883j1226j0720l0282J3110K0459J2610l182j1698j7400N893n05
17870G495k4270L5874K0422o885Q385j4065m591l613j3860k7076q00N346K2264
17857D626l007N073Q628l7541o264O188L0502K8323P959l3119l0805j5581j7380
17844e2398J2963K899J2239J8121o448p402J5100Q114J756R920K6770o61j1423
17831B9550q559m748r787j2536j7257J9701J7515J6779j4992K985n256J032j877
17818A2550l438m110n325R661L660k8364j8592J7825L0946j1205j6518l003J5238
$$ y = [19069, 28897, 42154, 46181, 49925, 40527, 17694, 30233, 49304, 41491, 27215, 21407, 14880, 9922, 12821, 24097, 43861, 52970, 76016, 72711, 41613, 14181, 41231, 49960, 54621, 15315, 27553, 40436, 29210, 18490, -11792, 1318, 21777, 34387, 31205, 19507, 2107, 8000, 7495, -16775, 19099, 39521, 32636, 41021, 26956, 22365, 18752, 4892, -22184, -22984, -17638, 4626, 1619, 6692, 15320, -22221, -28485, -22297, 8205, 36528, 44487, 11368, -19437, -35018, -52398, -39435, -36536, -24297, -6176, -12624, -20026, -4926, 3188, 4944, 14864, 41634, 40973, 29550, 20991, 16243, 6456, -6080, -23337, -3636, 13879, 30658, 15666, 18651, 13395, 14427, 12550, 9112, 5002, -323, 9338, 12998, -15366, -33958, -16133, 14813, 3608, -12910, -15913, -675]
17805f75j460J1821K7702k9730r958L4759K0811l0079l0949N804p11l023R798
17792D110J0215M297M038J8022K4617Q234p704k0367j1611k5349M915J8939J9262
17779E1618k765j0104M161k877k0669j3065Q952J4149J1236Q811j3742n587J4071
17766D4189J083k5317j2769O712K5240K965K522k1720q777j0910M5755N59n3453
17753c921j7886K5424q753O07J0804j9111k1067j3615K1872L1127K1906J472m770
17740B4089J4651M737R599j6700j0703J1119P267k4113k1212P293R841j3281L0162
17727C2749J9166j0095j3055J8N735k4243k1257j4807K9397M0477J7550k6535
17715C5100j2389K051j1885K4251p803j2666L195k5949q027l752L9289N824M25
$$ y = [-675, -2135, 9686, 37388, 7658, -2300, 32459, 53270, 23191, -7758, -1954, -2665, -5688, 4110, 14325, 18622, 22660, 40682, 65299, 73533, 65829, 45462, 33851, 8502, 13417, 32356, 51618, 48853, 38749, 42910, 40033, 19364, 6299, 15251, 29400, 40636, 49447, 35705, 30118, 44189, 45272, 19955, 7186, 13898, 39138, 42103, 44625, 22905, 14128, 3218, 48973, 49532, -3921, -21807, 3617, -5136, -4529, 6275, -12836, -33903, -47518, -25646, 5481, 27387, 28859, 24089, 38740, 43477, 53076, 36376, 25673, 36792, 44059, 19946, -1266, 6027, 15868, 2587, 32749, 51915, 41820, 28765, 28783, 34518, 10275, -10982, -25789, 3608, 44085, 61635, 35100, 22711, 24762, 12877, 37128, 29325, 16659, 19854, -6095, -14122, -17874, 21415, 27239, 27664]
17702B7664L888J0595k2742l7265L84L2666J2779R009n375J9104q558j0813q877
17689B2459k6194n502J3911m445r923J0061o502j9103K5089k64J1664l774k43
17676G234J546j4527r832J0110m915j3551n335J4048L9735K1101q928j3938j142
17663B1606P450p782j8122L4345K3902l917P423k3410L530J0429j8594m663R138
17650D1335M3453p337m8994n6676M93k914M291j3555Q124L3734L0987j051J6527
17637D8417K2595n069j9033n314m414m836j032j4100j2693J7274r62n371M342
17624A9804J7652j9634p976J0169K4136K6149j2490l4424j4357N41o077J025K8934
17611C3452K3603P527q315l6638k9744J3947K3866J1550l545j6559m5581j6761
$$ y = [27664, 31552, 42147, 19405, -17860, -17476, 15190, 27969, 36978, 31603, 50707, 42149, 31336, 22459, -3735, -9237, 4674, 229, -9694, 367, -6135, -25238, -149, -413, 11251, 7477, 7234, 8780, -5747, -15579, -5469, -10384, -23935, -29270, -15222, 24513, 45614, 36686, 22748, 21606, 29056, 21274, 3152, 37497, 61399, 57482, 64905, 41495, 45025, 55454, 36860, 32197, 41335, 84788, 77451, 28457, -28219, -27726, -30640, -26349, -39904, -31780, 1954, 32941, 31890, 48417, 71012, 65943, 46910, 41596, 37182, 32346, 31314, 17214, 4521, 21795, 20833, 15462, 19804, 37456, 17822, 9846, 20015, 44151, 70300, 57810, 23386, 9029, 9570, 3493, 4518, 33452, 57055, 64582, 56267, 19629, -10115, 3832, 27698, 39248, 35703, 19144, -26437, -43198]
17599d3198K2954K1942N248J0769m5257q189P193J1095L0227M536j3107j0749
17587f536r644Q772l761k9178l079r230L37K0002m595R6J6674J6441J4394J2397
17573B3090Q946j8288j6951L2129O303k9942q466J9243o555j3713j0483K5783
17561A1096Q777Q816L748m302P07L3581j0495k3943l1978N804J5131j9544l3157
17548c5759J5119J63j5653L395J8091M7367M629j744j5691n812j6984K3191P291
17535B7603j4642j8874j502L006J1836l78n554k371K7813j3033m0459k1559P365
17522d0749J8075K8806L8033K3987l1698k5487k4710J4810K0388r774J03R122
17510B0906K8169M462k0119j0497J0949K2524K5441o923k7899N700j4431Q335
$$ y = [-43198, -20244, 1698, 6946, 17715, -27542, -35731, -28538, -17443, 12784, 17320, 4213, -6536, -16180, -7408, -11169, -40347, -43426, -52656, -52319, -32317, -36912, -36816, -20142, -3701, 10693, 23090, 32036, 13748, -3203, 28926, 35229, 5287, -3179, 16064, 9509, -4204, -14687, 11096, 19873, 28689, 32437, 28135, 28842, 62423, 51928, 27985, -3993, 1811, 16942, -2602, -35759, -20640, -20477, -36130, -32735, -14644, 32723, 37352, 35608, 19917, 14105, -2879, 20312, 27603, 12961, -5913, -7415, -4409, 7427, 7049, 1495, -876, 26937, 13904, -26555, -48114, -40749, -22674, 6132, 44165, 68152, 36454, 10967, -13743, 1067, 21455, 11681, 11784, 20906, 49075, 53537, 33418, 22921, 33870, 56394, 81835, 74912, 47013, 52713, 38282, 46617]
17498D6617o592M077j5139m0685k3458k741K335J1701K3267l390O175J1994K4491
17485C8652k5029m0663J246J201j3460L5229K6393K55p533j0166k6706j3009R471
17472b4119M2354O217j8380q148j289Q350K7695K9498j9002l2886l4684q003J3004
17459a9393J9119J2448j7840n259m032q668k9883K6609L3762Q132k2601j5742
17447b3348K2742j2215j6446J0518J8350K3820L923J8128k096l8339j3113l1602
17435c9678M871q150J2940L290K7943L0495n960j886J7414J0707K640m3030r860
17422A736L710q903p830K1880J3592M257j7140k9008J4989J9558k8221K4385K0912
17409C3917k4383k9039k7282l108N7215o419r577K5090K4194J1533N255j4219
$$ y = [46617, 40025, 44102, 28963, -11722, -35180, -37921, -35586, -23885, -618, -4008, 2167, 14161, 38652, 13623, -27040, -25794, -24593, -38053, -2824, 23569, 23824, 16291, 6125, -20581, -33590, -24119, 18235, 24452, 6072, -2076, -3365, 4985, 32680, 62178, 43176, 10290, -24394, -32397, -19393, -274, 12174, -5666, -10925, -14957, -23625, -53508, -26899, 6863, 14995, -7606, -23348, -606, -12821, -29267, -18749, -399, 23421, 27344, 45472, 43376, 5037, -8076, -39678, -34807, -42957, -30017, -26727, 1216, 31711, 25751, 23865, 41279, 51986, 54626, 11596, 1736, 5446, -3457, -11287, 10593, 24185, 28442, 11302, -17706, -2717, 16841, -11380, 13005, 33917, 9534, -19505, -46787, -49895, 7320, 901, -8676, 16414, 40608, 52141, 57396, 43177]
17397D3177m901j7911k7805L680M870L6154O997k8416k9191M217Q855o033J9820
17384A3513k622j2806J0221L147j930J5455m913o405K454L058M273j0123k0116
17371f794l314k180j6823l752k7817o903J4560L7148J2565J1514J2044k0756p653
17358h161N475K0234J4634q666L0153J0574o506J611J0756q491%J1002k5676k5335
17344B1604j0347p871k5994J3527J4825M99l018N962k3511j4311K6801O698p244
17331b380j3099K2292J4614o977J1654j7302k4797K2555J7052J5489j047k2245
17319A5809l169p477j0334k993J4808K6173O196k1594j9539q243K616j4923J8669
17306d001K321K1007p016O074J7570M754k6652l3862K1203J0615J4339o259N163
$$ y = [43177, 38276, 20365, -7440, -3760, 1110, 37264, 44261, 15845, -13346, -9129, -274, -6307, 13513, 10891, -1915, 8306, 11453, 9523, 24978, 20065, 13660, 16114, 19172, 23445, 13322, -6794, -10108, -12288, -29111, -32863, -60680, -67583, -53023, -15875, -3310, 8204, 20248, -508, -8161, -2686, 17548, 32182, 23516, 53669, 64243, 57737, 59348, 70104, 61613, 61613, 72615, 46939, 21604, 11257, 3386, -22608, -9081, 5744, 6243, 3225, 9187, -14324, -28635, -1834, 4864, -2380, -15479, 6813, 21427, 14450, 26104, 8802, -15995, 6560, 23612, 39101, 38054, 15809, 12640, 5163, -5171, -8164, 6644, 32817, 39013, 17419, -2120, -10363, -7747, -22670, -4001, -1680, 19327, 12311, 18385, 35955, 40709, 14057, -19805, 1398, 12013, 26352, 20093, 25256]
17293B5256J0413k0117l1517K535r622o212J6424Q892k5229J1195k2337J9118
17281b1201L8632K328k0811j798r910R736L033K099K6333Q892j6812l603K1018
17268C7936J9026n232j6161J251j151K5246K8460j1320l5860q074m023j5784o966
17255G348J1896K0423j0458j816k2804l7865j7450k21J7039J5572O278Q353k368
17242f073J3696m639j4692L985Q062J4939q047n6458j2890L778J9750J2092p46
17229b7243J8489J3247j4566j3983J972J135K510J9943j316j3269J75J649J5817
17216D560K8457K9941j9281l0838j2146k0656j0528M536J9510K0112R552K2943
17204D6162q646q572r373l150L0451j6947j2261J6501l128j5122j8275j644o417
$$ y = [25256, 35669, 15552, -15965, -13430, -23052, -29264, -12840, -3948, -29177, -17982, -40319, -21201, 17431, 19759, -1052, -2850, -12760, -3024, 9, 2108, 28441, 37333, 20521, 16918, 37936, 56962, 51730, 35569, 36820, 35669, 60915, 89375, 78055, 42195, 34121, 30098, 14314, 7348, 19244, 39667, 29209, 27393, 4589, -33276, -50726, -50947, -33908, -18336, -12058, -3705, -6073, 7623, 2984, -11708, -7723, 339, 15278, 7231, -49227, -62117, -58339, -38589, -26497, -27243, -8754, 4493, -10073, -24056, -22084, -20949, -18439, 1504, 188, -13081, -12906, -11257, 4560, 33017, 62958, 43677, 12839, 693, -19963, -30491, -25955, -6445, 13667, 23219, 46162, 37516, 28944, 19571, 16421, 46872, 29925, 17664, 34165, 31037, 15915, -2360, -4004, -10421]
17191a0421J1316P288j7620o976L0665M370o340J0970M398l4756l3040k5483L3627
17178c2002N3421j5368l5241j3232J0584n87P475J5083L7361o160m901J3706K636
17165C2775L958M988k1369k5799j2760O739j0840p246j813J2992j2936k446L674
17152c0083J6740K4491p622j6409J9294J1552K38n833p059m392k5356J397r077
17139c2119j4767M0687J9378j1088L0526J7137j5706n84l1219k791j2939j5577
17127b9062J223J8519M9125R381k3872p500j5072J1180j2859J0710J5097M446
17115C1316k2654j5231j9383J8377K4693L9912o295p8327j1734L2121L6235J7561
17103D6591j0606k6680p503j0474o190L2831O584j3845j3427M449j5585o102j0228
$$ y = [-10421, 895, 8183, -9437, -16413, 14252, 18622, 12282, 23252, 27650, -7106, -40146, -65629, -32002, 21419, 6051, -29190, -42422, -31838, -32425, -24950, -9867, 27494, 21334, 16433, 30139, 32775, 36733, 41721, 20352, -5447, -18207, -11468, -22308, -29554, -31367, -18375, -31311, -33757, -30083, -13343, 11148, 3526, -12883, 6411, 17963, 18201, 12368, 5309, 917, -24439, -23042, -32119, -46886, -6199, 13179, 2091, 32617, 49754, 34048, 33464, 2245, -546, -13485, -29062, -27839, -9320, 39805, 49186, 25314, 17814, 2742, 13922, 1063, 11773, 26870, 31316, 8662, -6569, -25952, -7575, 17118, 57030, 50735, -27592, -39326, -7205, 29030, 46591, 35985, 9305, 1802, -8672, -14862, 17969, 24553, 10708, -2719, 1730, -13855, -19957, -30185]
17090c0185J0573o497k2083J2521L6449J0896J3917J4643j700j6610j0740q227
17078B957M383K968m176k2912j1549j4078p8P109J029J6383J2465M526J5077J8467
17064C2571l8993j4281J6596J1960k0172k3217k7199j258J2796K6273K0883J8913
17052A4872Q647k5033o934n112j3794K9610k58m364o84R329Q36N143N060n797
17038A1521J6838J4003J415j1033j6635r717K4798J241j8706K107K7612J01k8040
17025A5505o537Q053k0073j2022P781O388n166k721K3961j0125j8477O214Q42
17012f377p721l030J7533j2736M013L383k0062l553J1125m605M97k6608J3722
16999c4419K3734K6773J5828l648k0534k4896j7065J0465P976j2749o425P407
$$ y = [-30185, -19612, -26109, -48192, -35671, 778, 11674, 25591, 40234, 38534, 21924, 11184, 2957, 7340, 10308, 6132, -16780, -28329, -42407, -42485, -35376, -34347, -17964, -5499, -973, 14104, 32571, -6422, -20703, -4107, 7853, -12319, -35536, -62735, -63993, -51197, -24924, -4041, 14872, 23519, -1514, -8448, -13560, -27354, 2256, 1998, -2366, -3050, 6279, 7115, 12258, 17318, 11521, 28359, 42362, 43777, 32744, 16109, 6392, 31190, 32431, 13725, 15832, 43444, 43545, 15505, 8968, 17021, -3052, -15074, -7293, -905, -6071, -8792, 15169, 5044, -13433, -7219, -6377, -14098, -17128, 405, -12331, -8318, -4935, -24997, -28550, -17425, -22030, -21533, -48141, -34419, -10685, 16088, 31916, 28268, 7734, -17162, -34227, -23762, -15786, -28535, -34960, -27553]
16987b7553P318j9867j4542j852J9318L4815K116k9542J0493m242k8408N131K5843
16974b0972P855j0980j841p200j0814j0214L0730j325r340J998K8165q079m0854
16961e2871q06O6194m11J5914M774j5371j85J5931j3211j1594l7950k7750m448
16948f1784K2245K5310K3963R93J8443K1808k9733n844j1687K590k0945r347j0614
16935c4602j814J4332J2452J0545L393K6417J0003k3739m4922p888r958N830J2645
16922b7306J37K1883j1022N287k803j9211j811j1004J2966K2526J2000j0538q067
16909a6963J5815Q429j310k1677j1451p41M887K484J2528n395j2072J2050J0719
16896b697n537j723J4119j7093k8129L8402J2136j104o903q637P824M902j7666
$$ y = [-27553, -20235, -40102, -54644, -56496, -37178, -2363, -247, -29789, -19296, -23538, -51946, -46815, -20972, -13117, -24097, -25938, -33138, -43952, -54166, -23436, -24761, -34101, -32103, -3938, -12017, -52871, -53677, 12517, 12106, 28020, 32794, 17423, 17238, 33169, 19958, 8364, -29586, -57336, -61784, -39539, -14229, 9734, 10727, 29170, 50978, 21245, 15401, 3714, 6304, -14641, -23988, -34602, -36416, -22084, -9632, 913, 4306, 30723, 40726, 16987, -27935, -35823, -45781, -39951, -27306, -27169, -5286, -16308, -11021, -13824, -33035, -34846, -45850, -32884, -10358, 1642, -8896, -16963, -1148, 7281, 5971, -15706, -27157, -27898, -23011, -20527, -7999, -13394, -25466, -13416, -2697, -8234, -9957, 4162, -12931, -41060, -2658, 9478, 8374, 1471, -7166, 658, 5560, -12106]
16883a2106q466J9172N12L395N927K5965j3853j6567K5021J4202K196m70J2416
16870E7344j9153k9422l1014j4391l013J2358Q696O529Q267J9050N991O0j3249
16857H053k670L5809n920l3400j8960J2584J1413J0949M758q031k685L255q579
16844F576j3112q817l411j1760M520J7964K3497j991N077k0751r111j9961P394
16831b3886n67J6208j540k6539J79K6151P934J5195J6136m805k7378l0587j5696
16818d9195R716J7210q442o627J5827R035k0698J6512K8159J7779P584k902l0040
16805C918q825N394J2404J0076J6949j0056k232m529k1660p067K9580K219r149
16792A7022k663L704k839l2551R308j9619k8005L079J6213M810J6874J1467l0837
$$ y = [-12106, -20572, -1400, -888, 2507, 8434, 34399, 20546, 3979, 29000, 43202, 45398, 44928, 57344, 38191, 8769, -22245, -36636, -39649, -27291, -18595, -12066, -3799, 15251, 21242, 21302, 8053, 5383, 41192, 35272, 1872, -17088, -4504, 6909, 17858, 22616, 14585, 11900, 15155, 6576, -6536, -15353, -18764, -30524, -26004, -8040, 15457, 13466, 18543, -2208, -11319, -31280, -23886, -24453, -8245, -9785, -36324, -36145, -9994, -2060, 13135, 29271, 24466, -2912, -33499, -49195, -39479, -22269, -30711, -37338, -21511, -12476, -33174, -16662, 11497, 29276, 36860, 33958, 3918, -4907, 487, 12891, 22967, 39916, 29860, 27628, 23099, 1439, -5628, 23952, 26171, 17022, 14359, 18063, 15224, -17327, -8019, -27638, -55643, -52564, -36351, -31541, -14667, -3200, -34037]
16779c4037q947l528O322Q663q44K59K5818J7507K9570r934q489p995o913M03
16765G855K4748k2398j3537J371J8047J7725K0268j1004K72J800l405k328J2827
16752E2241j9246k4825J55N746n700J331O361j71J9293J871l2348r820L896m41
16738a657Q86k0419j1042j8787K6283q629m513J8635J0036p390r280K017J2103
16725a1757Q467n444j6518k6712k916Q643L2964L0117K1650j5957p778l055J956
16712A3660k316P278n357j2841J3393r414k899J4320L1545K3018P445k3041j3329
16699D1462j6155l8404J6943M465k1583J9298J3408K4098k5216j2092p020l459
16687d255M01J9488L030J3840K798M425l6366j0217N7270j623j2227k9441p958
$$ y = [-34037, -42984, -46512, -40190, -31527, -32371, -32112, -6294, 11213, 40783, 30849, 22360, 14365, 7452, 7855, 32603, 10205, -3332, -1961, 16086, 33811, 54079, 43075, 43347, 45147, 41742, 39414, 52241, 32995, 8170, 8325, 14071, 8371, 9702, 16063, 15892, 35185, 37056, 4708, -5112, -1216, -1657, -771, -21190, -32232, -51019, -24736, -33365, -37878, -19243, -9207, -16597, -25877, -23860, -11757, -3290, -8734, -25252, -51964, -54880, -46237, -13273, 16844, 38494, 22537, 14759, 11704, 13660, 11344, 18622, 13265, 424, 13817, 4403, 1504, 15824, 47369, 70387, 77832, 54791, 41462, 25307, -13097, 3846, 8311, -13272, 6026, 19434, 43532, 18316, 6224, -796, -4255, -3854, 15634, 18664, 32504, 35302, 39727, 3361, -6856, 50414, 48791, 36564, 7123, -835]
16674h35K9151K2328j0482j9744J7021o180k5122J800K4928R834K5699j3017n3212
16661B169m58M978l72Q811k1766n875J7721N321k0623J7962j8731p788L1415P742
16647B0506M304k905k20j1454n520l23j0710j5448r439K0083j146J7614r636k6772
16633c1066j7160K4265L8253J3650j8852m971J8731J3666J9915l8655m2283Q562
16621a5945L3458N88k3084p419m176q033N337K7474P609q214J4821k0502m749
16608b835O43r99L0509M540k2272n625J3220j5632L79O250j6309q219j6359q701
16594d1410L3592q449J3518J7311M737l1103K460j585m674k0156l2957j939L1234
16581c9421L4563N908J6095J537O517O727j175M347k11k5295j0327q299K2713
$$ y = [-835, 28316, 50644, 40162, 20418, 37439, 31259, 6137, 7937, 32865, 42699, 68398, 55381, 2169, 1711, 6689, 6317, 15128, -6638, -12513, 5208, 10529, -10094, 7868, -10863, -18651, 12764, 20506, 24810, 21905, 21685, 10231, 4711, 4388, -6322, -21770, -31209, -11126, -12272, 5342, -4294, -31066, -48226, -23961, 14292, 27942, 9090, 4119, 22850, 36516, 56431, 17776, -24507, -15945, 17513, 18101, -4983, -12402, -16578, -24611, -19274, 8200, 15809, 7595, 22416, 1914, -2835, -2192, -3191, 27318, 31858, 9586, 3961, 17181, 1549, 1928, 8178, -8131, -16350, -32709, -41410, -7818, -16267, -2749, 14562, 19299, -11804, -9344, -10929, -15603, -35759, -68716, -70655, -39421, -4858, 1050, 17145, 18682, 25199, 31926, 30751, 35098, 34887, 9592, -735, -9034, 13679]
16568A3679j5272q234J47j715J49N173j8747o324j501m754L9232O495j624R294
16554A5998j9324j382Q172J7461j5555J4880M790j0984P61R659j4374K409k2512
16541a0001j8027P507J6735l496P59N93J3864J577m2921p303K3399J8699J6449
16528A7834J4049J239J450Q631k029j5421k9352o691l596J0475J1211L640k997
16515H443J506o030K0479R400n0845k1943o272Q507J1357P562R099k7443q234
16502d4414L2666N768j6419Q131J0484o45p420L190J2978m768O458K88K0321p784
16488A8834j8935r874j5749P25J0473L5146J9021n298o933L715k1201j881R819
16475A7862R164J8551n433k6776l1071j1422L279J6022R437l671k528J4493J3197
$$ y = [13679, -1593, -9827, -9680, -11395, -11246, -6073, -24820, -31144, -32645, -37399, 1833, 8328, 6704, 15998, -3326, -4708, 3464, 20925, 5370, 20250, 25040, 14056, 14817, 24476, 10102, 12511, -10001, -28028, -20521, -3786, -7282, -6523, -5930, 7934, 9511, -33410, -40713, -17314, 1385, 17834, 31883, 33122, 34572, 43203, 41174, 25753, -3599, -10290, -13886, -3411, 7800, 11440, 8443, 9949, 3919, 24398, 33798, -17047, -38990, -45262, -36755, -25398, -17836, -8737, -36180, -44414, -11748, -5980, -22399, -14268, -3784, -4429, -11849, -8659, 4319, -449, 6009, 6297, 26618, 18834, -101, -9975, -25724, -24999, -14526, 20620, 39641, 34343, 27410, 31125, 9924, 8043, 17862, 27026, 45577, 40144, 13368, -17703, -29125, -25846, -9824, -387, -4058, -6586, 7907, 21104]
16462B1104k2470l2594r743J2687J7373k895k6153J8697L3191P92o631Q889j143
16449A1104q476j6978K5838N152J0933j5021j3011n492n596J524r328o21M0924
16436B0952K6557O511j2905l2611N506M724K2027R1j2099m369P402O593j3293
16423B5086r231o373k2393J1345K5229J4476N314n519m1283l1248n424L8505K4316
16410B2800M01k2814k894N943m617L723q045k926K36K8534j1533J4032L003j6387
16396I456K1552J4398k5235k0778j6999j7483q869J7966K5540r653oj0977l4791
16383e5879P200K9413j9796J5288K1421j5677j6435j6114L1313J9660K3334j6583
16371G145k3261k037l1459j1239J2761j597J9651L7596o60n368j3838J1860K2775
$$ y = [21104, -1366, -33960, -43703, -31016, -13643, -16538, -42691, -23994, 9197, 9989, 3358, 12247, 11104, 2628, -14350, 11488, 16640, 27573, 12552, -459, -5951, -11547, -10023, -19351, -19972, 20952, 47509, 54020, 41115, 8504, 14010, 18734, 40761, 40852, 28753, 24384, 31786, 38379, 25086, 15855, 9482, -12911, -1566, 23663, 38139, 43453, 37934, -3349, -34597, -40021, -1516, 22800, 23201, 387, -2507, 3436, -1181, 2542, -5503, -8429, -8193, 20341, 8808, 22840, 25843, 9456, 31008, 45406, 20171, -607, -17606, -35089, -43958, -25992, -452, -10105, -10111, -21088, -55879, -48679, -19266, -39062, -23774, -2353, -18030, -34465, -50579, -19266, 394, 23728, 7145, -16116, -18153, -49612, -60851, -48090, -49687, -30036, 7560, 6900, 1532, -12306, -446, 22329]
16358B2329L861q131k7087L421k1893n828J3244J4575j370j8529l830K5150j7761
16345b1849J1276j2083q981l980L7554K6739O140J344k4811k7025k673N276P259
16332e814k930o395K553J0445p237k2251r186R484K3927o110l4831o165J4446
16319d0064K7515K04P878K3993J7123m42k645j3207q294P934j1782k7400O963
16306a2224J3902J5140j2486k3207j0392O512l340l232M054M440Q249N757j0311
16293a7138L275j4835J1965J8251P338j8819p776j9917J281J4451O853o023n274
16280b6368n772O620l474O88J0941Q074L515r945N853j755m622l525L4119O280
16266B0629q992P486k1247j1423m739M371P150M378l44Q862j323r476j0163k726
$$ y = [22329, 26190, 18059, -9028, -5607, -27500, -33328, -20084, -5509, -6879, -25408, -29238, -4088, -21849, -10573, -22656, -31637, -35617, 1937, 28676, 34816, 36160, 11349, -15676, -18349, -13073, -5814, -8744, -15139, -12586, -2141, -9378, -31629, -40815, -31331, -7404, -13514, -48345, -54510, -40064, -12549, -12345, -4467, 19526, 36649, 36207, 33562, 20355, 12061, 19995, 8213, -19187, -12224, 1678, 16818, 4332, -18875, -29267, -22755, -26095, -29327, -25273, -20833, -12584, -6827, -17138, -13863, -28698, -16733, 1518, 8856, -9963, -17739, -37656, -36375, -21924, -15071, -21094, -26368, -32140, -25520, -28994, -28306, -17365, -9291, -5776, -15721, -9868, -11623, -16245, -19770, 14349, 20629, 11637, 19123, -2124, -13547, -18286, -13915, -6765, -2387, -2731, 6131, 4808, -4668, -14831, -17557]
16252a7557K3164J7197k0501J3035j290o551k294j9017j4220J348K2450o394n356
16239a5986N251M0923Q108k3865o915j4787J3503J0707j4331k8617j584K8307
16227G14K4451m66k0001q116M289Q471Q967k268O814N654m477O127K4777l282
16213E1654l8291m051Q034K696j1414N938r850j6943P94R464J2869M60j0562k9733
16199b8935l389N0656M796j8402j4138j4344O174K2760R631J2430j4386j5641
16187b788o996O562J3416M919J3763k3042l5214k644N842K1077K3282p802J2506
16174B2881k2285P688K0547q274j6849m245p788o790j2655M879K563M326n195
16161b1197j3418N921j2596Q129K4092Q404L5515J2775J239j1026O346j4100k5447
$$ y = [-17557, 5607, 22804, 2303, 15338, 14048, 7497, 5203, -13814, -28034, -26686, -4236, -10630, -15986, -10735, 30188, 38296, 14431, 7516, -7271, 6232, 16939, 2608, -26009, -27593, 714, 25165, 24699, 4698, -3418, 871, 9342, 18309, 16041, 22855, 28509, 24032, 30159, 54936, 51654, 13363, 9312, 17346, 20042, 8628, 14566, 4716, -12227, -11433, -1969, 10900, 11360, 798, -28935, -32324, 18332, 23128, 4726, -9412, -23756, -17582, 5178, 14809, 27239, 12853, -2788, -9784, -3222, 10194, 15113, 28876, 5834, -29380, -32024, -26182, -5105, 18177, 10375, 22881, 596, 8284, 28831, 20557, 3708, -537, -8325, -15115, -27770, -22891, -20328, -16002, -21197, -34615, -28694, -41290, -33161, -9069, -665, 34850, 47625, 48864, 37838, 44184, 30084, 4637]
16148D637j9692L442q093l934K5526O58j8838Q652J8688P581p5q871j2070k6936
16134b9325P384J1747m485j3769R171K4562L2304J0648J959R546j8765j1603j1511
16121A7863O273k9357n801n338k184P259J2675n368n176J2980M008J4447J2899
16108C5180r888k1434M76l0571Q59K7849K870k3537J316L7312j4587l3103j0941
16095c8199P248M798k0848J3502K3358J9306l1005p966j765n322j4701j4482J1096
16082e4980L1187J9689J312K6067J276j6807K915Q217j8522j8419P128J8057P033
16069A4153P995K0929o176l1563l4626j8479M598k0649j1607k035K6978N9J6531
16056c3892R728j6904J08J0521Q193L6111K947j8090q94P364l0662R734J2008
$$ y = [4637, -15055, -11613, -19706, -23640, 1886, 2544, -16294, -7642, 11046, 18627, 18552, 9681, -2389, -29325, -21941, -10194, -14679, -28448, -19277, 5285, 37589, 48237, 50196, 59742, 40977, 29374, 17863, 24136, -5221, -11022, -16360, -18544, -11285, 1390, -3978, -9154, 3826, 7834, 22281, 35180, 25292, 3858, 4334, -26237, -25378, 2471, 5341, -18196, -16880, 20432, 5845, -27258, -38199, -30951, -26153, -47001, -33499, -10141, 9165, -21840, -29806, -31571, -36893, -51594, -66076, -54980, -23793, -4104, -2792, 23275, 24551, 7744, 10659, 18876, 354, -18065, -10937, 7120, 14153, 22148, 43077, 36901, 5338, -29288, -47767, -43169, -63818, -75425, -77460, -50482, -50423, -33892, -24164, -41068, -40960, -30439, -22246, 13865, 16812, -1278, -2172, 5192, -25470, -15736, -3728]
16043c728K0474P488J3232N937q922o266m650j4016j503P572P637n823l2048k3050
16029c7666j2654n091n89r749M1530L7685J5735m1607j8586K6283k2083P394o928
16016b6326k50n200P486N231q513p978K389J0531J2155M000r272Q672O400o290
16002f965p205K376l999j6891L373p567j8370J2377M3585L33M425q598j012K0842
15988A6704m1445l6410J4198O525J2301K4785J7472j0086L840J5749j8725O769
15976A1677J0193n628K2905q777k4890l0563J4690K5390k2301k0901J0425p635
15964b5415Q034j9254k1214J3046J7270K0824O171k4761Rj3798j1726L685J9735
15951b7394J8354K0197J31m954k0742J1420N638O732L459j7809j082j1522M2341
$$ y = [-3728, 16746, 24234, 37466, 43403, 34481, 28215, 23565, 9549, 8046, 15618, 23255, 17432, -14616, -37666, -50320, -55411, -56000, -65749, -24219, 13466, 29201, -12406, -30992, -4709, -26792, -19398, -26326, -26576, -31776, -24290, -19059, -27572, -35550, -33161, -22630, -10475, -6475, -15747, -7075, -675, -6965, -14170, -11794, -15793, -32684, -29311, -36878, -55248, -42871, 714, 1047, 5472, -3126, -4138, 16704, -24741, -61151, -46953, -40428, -28127, -3342, 14130, 4044, 7884, 23633, 4908, 11677, 21870, 16242, 39147, 30370, 5480, -25083, -10393, 14997, -7304, -28205, -17780, -25415, -17381, -36635, -57849, -44803, -27533, -6709, -538, -25299, -25290, -39088, -50814, -47129, -27394, -9040, 11157, 11288, 6334, -14408, -2988, 2650, 9382, 12841, -4968, -6050, -17572, 24769]
15938B4769J4012l0084l878j7066p4p806L503j1856K6543q654k2948m331K0255
15925a7615J6313L469J2330O431o390l3521k6391j0468J8392N711j9450M724k4323
15912g0788M937M1725J8722k1067l0287N2L4036J2249j5137O262J6029J6445j9577
15899f399k0276l446k729L4304K8808j3577m79P806L9732o357l3346k8147j4617
15886a8723K3271N728n718j2128q731L195j494k0298j5782O797K1979j1569j9912
15873e3385m96J8596M6064J3649j9462q656R083m98j4688j1188J8598O63j7820
15860a9540r109J8348j0192J9992J2460o55n207O690J3928n916k1870j069m089
15847f229K8265l748k3784k1463r802m478L2630J9800j0357k6246q377J6340J4686
$$ y = [24769, 38781, 8697, 4819, -12247, -12321, -20127, -16624, -28480, -1937, -10591, -33539, -37870, -17615, -1302, 2167, 14497, 20928, 14538, -18983, -45374, -55842, -37450, -31739, -51189, -46465, -70788, -65851, -24126, -5404, -26471, -56758, -56706, -22670, -10421, -25558, -19296, -3267, 13178, -6399, -26675, -30121, -32850, 1454, 30262, 16685, 16206, 24012, 63744, 57387, 24041, -4106, -18723, 4548, 10276, 4558, -7570, -16301, -13106, -14600, -34898, -50680, -43883, -21904, -33473, -53385, -53881, -35285, 10779, 24428, 4966, -3690, 5393, 4895, -9793, -20981, -2383, -1720, -19540, -28649, -10301, -20493, -501, 11959, 11304, 6097, 12787, 26715, 20799, -1071, -2140, -6229, 22036, 18288, -5496, -26959, -36761, -41239, -8609, 11191, 834, -25412, -33789, -17449, -2763]
15834b763j1962m24K249j8689r069J167j3557J5947J8108J4695J6581j1339k5498
15821b4554K3182L6638K290j6915l447j2608l2602P977L6209J7156j3098j7370
15809B858j4555K103M821J7114n629j153j4760j341J7815L9316K3340j1548l3327
15796B5054j2765m103K767l7782J1718j38l5622j1722R81K6783k5196r084L8132
15783c0977J0064J1241K3852n516k283Q051k5912O501L6392K8721k9300k0967
15771I867J2807p658k0195K77j3182j979K2921J0609L776J904J8444J2223k7854
15758B1960j9137j7381j8053L904k0048k5652L2067L6115K0214k3221m2753j9803
15746g1788K0298L0255J8060j6179N47j7713L1889J0497l0147k5926Q296K195
$$ y = [-2763, -14725, -15149, -12900, -31589, -40658, -39491, -53048, -37101, -18993, -4298, 12283, 944, -24554, -1372, 35266, 37556, 20641, 17194, 4586, -28016, -20039, 16170, 33326, 20228, 2858, -11697, -9594, -4773, 12341, 6712, 5559, -9201, -10542, 7273, 46589, 69929, 58381, 25054, 12289, 8186, 10953, -26829, -15111, -15249, -50871, -62593, -61612, -34829, -60025, -69109, -30977, -20913, -9672, 14180, 8664, 6381, 14432, -11480, -4979, 31413, 60134, 30834, 9867, 22674, 15016, -5179, -4902, -18084, -20063, 2858, 13467, 17243, 19147, 37591, 49814, 21960, 2823, -14558, -32611, -28707, -48755, -74407, -42340, -6225, 13989, -9232, -51985, -71788, -51490, -21235, -3175, -19354, -18807, -36520, -4631, 5866, -24281, -50207, -41911, -39716]
15734c9716N185L3891K6426j0176l6797j5659j2364J1068K3869K7831K0735l3061
15722A232o554P433k2074p60K3206J3j6811k445L4713L9302j3113j0149j2457
15709B1536o336j1923j3201o978r391L862P843q724R736K6350J5135j0949k7752
15696a0792k9946L469p722r205p07j0811K0215L7838q782J7458J9387o354o215
15683G833j0100J3329m141r80q878m177j1889J5722j518j2716j2646K59J5843
15670a4059L6710K0889j8744l2021O554m647N699j2443r873j1623Q625L1588j219
15657E436M7597J7476j2503k9021k3080J5943k848k830o562L536j0699j5934j7458
15644c0947n99K9014J0637J0089m223p046J1020N74m725J3920R45M832k6339j7625
$$ y = [-39716, -34531, -640, 25786, 15610, -21187, -36846, -49210, -38142, -14273, 13558, 34293, 1232, -5322, 2111, -19963, -20723, 2483, 2496, -14315, -16760, 17953, 57255, 44142, 33993, 21536, 15200, 3277, -9924, -16902, -26293, -22431, -14588, -23312, -13576, 12774, 27909, 16960, -10792, -40738, -37269, -44991, -54196, -54903, -65714, -45499, -7661, -16443, 1015, 20402, 14048, 7833, -2267, 11062, 6921, 5941, -2937, -7114, -19003, -3281, -4799, -17515, -30161, -29902, -14059, 22651, 43540, 24796, -7225, -671, -5318, 381, -12062, -21935, -33558, -24933, 6655, 5436, 53033, 70509, 58006, 28985, 5905, 21848, 19000, 16170, 9608, 13144, 2445, -13489, -30947, -31546, -2532, 8105, 18194, 13971, 6925, 17945, 18519, 13794, 27714, 28659, 33491, 7152, -10473]
15630a0473J435J7258l698j355j1880p074o509M978j13J4393J7164k0437K749
15617c562J7169J3339j5281l0577J156n303L740L575Q114L255J8945j083k1858
15604h371k1884P802J2529j3474r432J9662j2251p650J9577q325k609P258m299
15591b1467j5034R334K440J8902Q389j0531L137O785M523p92l2074J3713P848
15578d827m849j6214J7666J5696M362l507N281q719j2100r63p135L427L891R927
15564A936J746J5048P700m1255k7478p772J3735j1020o14L984j6685J5061J5122
15551c0492L923q174K2868J9363J0484M249m928L17J5722Q684l4089K315r095
15538A147M322l958J375J7474L1663j166J1743j4096Q001M976J7R507j8661m6312
$$ y = [-10473, -9038, 8220, 4522, 3167, -8713, -15787, -22296, -17318, -17431, -3038, 14126, -6311, -3562, 13607, 26946, 11665, -18912, -17756, -23059, -19319, -15744, -7630, -4375, 14570, 13487, -8371, -30255, -22453, -9924, -23398, -32830, -13168, -25419, -33069, -13492, -21817, -24426, -17168, -21467, -36501, -27167, -24727, -5825, 2564, -7967, -4830, 1955, 6478, 5686, -26388, -12675, -4827, -9676, -25890, -8224, 7472, 11834, 8327, 13608, 4889, -7211, -8174, -15309, -11882, -7991, 1936, 3682, 18730, 26430, -14825, -42303, -50075, -36340, -47360, -47974, -43990, -60675, -45614, -30492, -26569, -34743, -11875, 7488, 17972, 22221, 17293, 17610, 33332, 42016, 7927, 10242, 1147, 5469, 1511, 2886, 20360, 52023, 50857, 62600, 48504, 56505, 61481, 61498, 71005, 52344, 6032]
15524F032j8766r065J103L027L0272L651M450N16k7587j3265R552K0860J0609
15511B1389n88J1697j7232q307j1255p669k9022K0134K2874o965Q373j2108j1558
15498b0237K0343L2493K595l0298j7692l4820P076L5918L5547J761l740Q06l416
15485B6336k5126o124m797j2703k6821R02K8135J1867K0845J0097l2664l7401
15473d7454r966J6437J7287L3181L7729O024J0813J521j8056r329k1295o84K2379
15460C8587o1l1j5190j0485k3290j5229j2525J674J00K5797M566j5218O429J9391
15446D515J1886P446J8133k8771k0836M886j3436Q018j0095j7920J086j5316M6857
15433c547K0896k1903k1751N167L7519K7201j5188l0432K447k6587k6632L243
$$ y = [6032, -12734, -21799, -20696, -17669, 12603, 16254, 20704, 21220, -6367, -19632, -10080, 10780, 21389, 20801, 32498, 15266, 6959, -4296, -11965, -40987, -20853, 2021, -4944, 3429, -8679, -20237, 106, 32599, 35194, 4896, -12796, -47616, -40540, -4622, 30925, 32686, 28946, 29752, 26336, 1210, -4914, -9711, -22414, -49235, -48333, -20198, -8331, 12514, 22611, -10053, -47454, -57420, -40983, -23696, 9485, 47214, 53238, 64051, 65572, 47516, 38187, 16892, 16208, 38587, 38526, 38495, 23305, 12820, -10470, -25699, -38224, -36550, -36450, -10653, -6087, -21305, -14876, 4515, 16401, 23847, 41980, 13209, -7627, -2741, -16177, -8159, -18254, -36174, -35088, -50404, -3547, 17349, -4554, -26305, -21138, 16381, 43582, 28394, -2038, 409, -26178, -52810, -49567]
15421d9567K5774Q258j3865K0J6888K6335J5169l061M760j9534p358L667j6277
15408h791j1135r090J0746J8078J9363K983l0452j1222K7267n253J2026J6236
15396C0756N387P039k2156m0587j7250P546J3829j723l879m315k933k5716K935
15383e1067K4358J2052M317L729k3100r228R784J3050J7403J283K305q302k2838
15370b6254Q945R137K9397Q989P068j4586m1867j2531K0031P742r136k793J1498
15357d360P028j539k9369N444J0705j7504P249p632J5144K4957J9670K2284j6459
15344C5618j1014M798j1666p262o72K5762K6433k3179l6850k4455L557Q038J1783
15331H91j8259p686j4345K3783k629K579K1381j1755k1607M925K0039L018M18
$$ y = [-49567, -23793, -15535, -29400, -29380, -12492, 13843, 29012, 25951, 30711, 11177, 3819, 7486, -8791, -19926, -29016, -18270, -192, 19171, 22154, -8298, -19520, 7747, 2494, 14520, 30756, 36143, 43182, 21026, -19561, -36811, -29265, -15436, -17159, -21038, -25353, -28286, -54002, -51067, -26709, -14657, -10340, -6611, -29711, -38939, -29155, -16105, 1298, 2581, 4886, -3416, -26254, -17309, -8172, 21225, 30214, 37282, 22696, -19171, -31702, -11671, -3929, -13065, -15858, -4360, 2668, 1129, -28240, -22796, -12091, -29595, -22346, -29978, -14834, 10123, 29793, 52077, 35618, 24604, 29402, 17736, 10474, 9802, 35564, 61997, 38818, 1968, -22487, -18930, -10892, 891, -17368, -25054, -39399, -15616, -18245, -15666, 5715, -6040, -27647, -22722, -2683, 335, 753]
15318G53J0731J7170j7430J7697J7349M78N553j5433j0543n270j2344j7073j1207
15305a9569L1100J5444q922k268J3123k0055o736l0379O098L949k0705k1239k382
15292f2541J8912p811p193K2205J8862O571m003l3656k3045P753J8302l192J3311
15279c5525K2085J4172J7504K0296j1454J2604j2476j3665J6161k2027k2929j2721
15267b7975l448P420J615N793R307k0374j2836q668J3623K3826P069l261n217
15254a3126j140n90J0521P293r075P618l124J7040J3322p082k3575j6035Q219
15241i734o86k369J3088Q194l096l5142J115K236j1705J7943r577k4009K9992
15228b3750L2776O833j656K992O289R97l3292p522j1450J379l999K8990R355j7013
$$ y = [753, 11484, 28654, 11224, 28921, 46270, 46748, 52301, 36868, 26325, 21055, 8711, -8362, -19569, 11531, 26975, 18053, 15785, 28908, 8853, 2117, -28262, -22164, -18215, -38920, -60159, -62541, -43629, -51440, -58633, -36428, -17566, -10995, -14998, -48654, -71699, -63946, -45644, -48836, -35525, -13440, 732, 18236, 38532, 27078, 39682, 27206, 13541, 29702, 7675, -15254, -27975, -31423, -24003, -22388, -16595, -7288, -27662, -40498, -49166, -35543, -11717, -4648, -7909, -13126, -14266, -14856, -4335, 2958, -6117, 1501, -1623, 15417, 28739, 21657, -1918, -17953, -9734, -10420, -12789, 299, 8493, 5397, -29745, -28630, -26394, -38099, -20156, -29733, -53742, -23750, 9026, 15859, 14203, 17195, 23484, 24481, -8811, -16333, -27783, -26404, -30403, -1413, 7942, -9071]
15214i071J1539L0375Q061k0885l4246j6938K387J486K4797L2750k739k6059R801
15201A1258J8728o858j8408q38K646R64J8621j3369m0155n027n336Jl618O325
15187c5066R155Q200J0227m0611j8096N656L2132K6920k0069j4272p761L2758
15175a0827J9004L877n482q046J0317J8020j946k868R370j4885j0193j9950k8477
15162d2086p572K9690J7261P578k729j2088n300K22L481j9782O531L6973J8701
15149C0880j8896K4070j229l8425l5349L639K3584j6956l582j0260J9126j9433
15137d2831p182L63j0117J6606K8104L415j0664j1425k6768R039L6681q009j1386
15124c4174J3390J3150K3252j8782k6021J5484K7835j1137k2236n267L2949J8067
$$ y = [-9071, 2468, 32843, 40904, 20019, -14227, -31165, -28778, -27292, -2495, 30255, 27516, 1457, 11258, 29986, 23128, 4720, 3882, 6528, 7492, 26113, 12744, -27411, -32438, -37774, -37773, -41391, -35066, -25911, -17711, -7484, -48095, -66191, -60535, -28403, -1483, -21552, -35824, -43585, -10827, 8177, 12054, 6572, -1474, 8843, 26863, 24917, 22049, 31419, 16534, 6341, -13609, -42086, -49658, -19968, -2707, 4871, 2142, -9946, -15246, -15024, -11543, -31325, -24794, 12179, 30880, 11984, 36054, 34825, -3600, -38949, -35310, -11726, -28682, -32264, -42524, -23398, -42831, -50013, -49650, -59767, -43161, -15057, -11642, -22306, -33731, -60499, -51460, -14779, -22788, -34174, -20784, -7634, 15618, -3164, -29185, -13701, 14134, 2997, -19239, -24506, 8443, 26510]
15112B6510j2589o139N97q581K0508R036J4159j7618q121j5635o529K2438L809
15099B1845q030J0017M105J523q099l6890o647J0153J5594J6225j086k4818k797
15086h905P701R641Q173Q855J9207j1357Q683J4566J3979o066n324j0062L5554
15073H4645k880k2678r575p588l135R68l6639l5167J9540R085j861L484N543K9174
15059C2916P30k3912L320r361j0489J9531K882k7941N357n160k2527J8005L9358
15046B2709K4060l3973k1310J1579n458o853k9854L9L3150J4546J367k4818N7
15033a4759j9314j0355R467Q168n615J5804p984j937j083J0467N957m634J7153
15020A335J2885L042j4626j6129j6039J3354m720N55m093j9121j6426M2013N377
$$ y = [26510, 13921, 7782, 8379, -202, 20306, 29342, 43501, 25883, 17762, 2127, -4402, 18036, 21845, 13815, 23832, 27937, 29460, 21361, -15529, -22176, -12023, 3571, 19796, 18710, -6108, -8905, -1204, 8437, 16610, 25465, 44672, 33315, 41998, 56564, 70543, 64477, 59153, 49091, 84645, 81765, 59087, 49512, 41924, 38789, 39757, 3118, -32049, -12509, -3424, -5285, -1801, 3742, 32916, 33646, 9734, 13054, 3693, -6796, 12735, 15617, -12324, -6967, -12127, -34654, -16649, 22709, 46769, 12796, -8514, 3065, -2393, -9246, -39100, -39061, -5911, 8635, 10002, -14816, -14759, -34073, -44428, -34961, -26793, -32408, -16604, -24588, -26525, -27608, -17141, -11184, -15818, 1335, 14220, 17262, 2636, -13493, -29532, -16178, -20898, -20343, -24436, -43557, -59983, -17970, -12593]
15007a2593K004L4617K0492k1362o416L835O241j5049k871Q860j7175j6151K5208
14994I640j1955O585J1157J8474l1702l6718k591m642M181J9327J685k3605K5646
14981a4518N4570J9783k1374n8658l8159J1521J6168n632p79j1351j9987O385
14969f2031L7836M6322j671k2477k6390N761K3269Q496K3492K2110k285j2880
14957C9552k1422k9776j0891J3385J8323k6340m486J932k3271k4274J74O698K4376
14944c6020J0495J75K8374J7449q946N18R402J5402J4791j9195P23P511p71l3061
14930F847k2895m725K2357M810J7287p600l562j2137k7256j3287k452J7449l601
14917b8765L2856j2123o133k2584P531O826p433J8176R830k4576j7156k945J1332
$$ y = [-12593, -10589, 24028, 44520, 23158, 16742, 20577, 26818, 11769, 8898, 17758, 583, -15568, 9640, -2315, 4270, 15427, 33901, 2199, -34519, -37110, -41752, -37571, -18244, -16559, -40164, -14518, 40052, 59835, 38461, -20197, -58356, -46835, -30667, -36299, -37078, -48429, -68416, -62031, -24195, 22127, 20456, -2021, -28411, -22650, 619, 9115, 32607, 54717, 52432, 39552, 18130, -11646, -22537, -9152, 9171, -17169, -21655, -19723, -42994, -67268, -67094, -60396, -36020, -25525, -25350, 3024, 20473, 11527, 12045, 21447, 36849, 51640, 32445, 33168, 40679, 39908, 6847, -16048, -20773, 1584, 6394, 23681, 16081, 12519, 382, -26874, -40161, -42613, -25164, -28765, 4091, -8032, -14165, -36749, -29218, -22392, -29825, -11649, -1819, -26395, -43551, -46496, -35164]
14904c5164j7136J8402J9028K3492R763Q678l7964j5923r926m611k408K2074K8772
14891G077J1398J3533J0432j630k3580r856k5290l0495M12P354L7116n06M679
14878F44J0042Q382K7542J7006j8618q327l522q456n1424j6874N937N3466K6402
14865D2200k2596J0561k0516l2561j8881K244M119M822J798K538l584k373Q033
14852b4196J6027r528R89L84j8486j1228M61J1702l3746J134K4704Q629o315q26
14838d0295J8702J202P215L175l224j4074k9304K1391J7910j1044j5569j1544
14826e5459K4445K1443K643k447k7061q878L0067K3931R838k886j5929j9696M269
14813a5720n313j0840j6832M3397J8130j7858m950q939R877J6103j515o77q582
$$ y = [-35164, -52300, -33898, -14870, 8622, 18385, 27063, -10901, -26824, -36750, -41361, -43769, -21695, 7077, 18475, 32008, 42440, 40810, 17230, 7374, -17916, -48411, -47999, -40645, -3529, -4035, 644, 10686, 19068, 46610, 63616, 44998, 36671, 33149, 24693, -26731, -43605, -37668, 15798, 42200, 19604, 30165, 9649, -22912, -41793, -39549, -35430, -30608, -28810, -26272, -29856, -32229, -24196, -8169, -17697, -16708, -16324, -34810, -46038, -45577, -33875, -67621, -66487, -41783, -33154, -39469, -40295, -21593, -20391, -13176, -10001, -13225, -27299, -56603, -35212, -17302, -28346, -43915, -55459, -31014, -9571, -6928, -9375, -36436, -45314, -15247, 8684, 18522, 15636, -293, -19989, -15720, -21033, -31873, -48705, -5308, 12822, -5036, -9986, -18925, -9048, 7055, 5540, 4863, -3719]
14800c719J7502O135L754o461J2645l7306k7310J6728m298M506K468J6096j6089
14787a5349O32J7248O540n524J792j4056J0183Q623q482r968r461J4083p792j2037
14773b3568j7487K2648J4591l415J8293k942n16j064J0936J2539q411R45k9331
14760f782j6845K4508L8789K4803j4177j7509j8688o478k1820k1418M380O505
14748b4732j1529l132J3992m461k537j1298J5K7707P623K602j1704J5679L52o094
14734g517o142o307J4282J3128j0878R573M790j1838O016l733Q488m930J558q47
14720E643K447J0372n540J4863j502k6889o733J4217N726p219J232j856p416J5191
14706A2536q949k4332n929J2385M664J8473j1719j3272K0706k0271J6001J8450
$$ y = [-3719, 13783, 19918, 23672, 17211, 29856, -7450, -34760, -18032, -22330, -17824, -15356, 740, -15349, -14717, 2531, 9071, 3547, 5339, -8717, 1466, 10089, 1607, -8361, -17822, -3739, -11531, -23568, -41055, -18407, -3816, -7231, 11062, 8120, 7604, 6540, 17476, 30015, 21604, 22549, -6782, -23627, 881, 39670, 64473, 50296, 32787, 14099, 7621, -14199, -35617, -31237, -24732, -36261, -39393, -25401, -29862, -32399, -43697, -43682, -15975, -8352, -5750, -17454, -1775, -1423, -7517, -13659, -19966, -5684, 7444, -3434, 6139, 10929, -909, 5107, 1374, 9862, 4932, 6490, 5643, 8090, 18462, 12922, 27785, 26283, -606, -7339, 6878, 12604, 5385, 6617, 4761, -2655, 12536, 3587, -20745, -26674, -14289, -9625, 8848, -2871, -16143, 4563, -15708, 293, 18743]
14694A8743p35K4230o685j1655P038O261j6753n395o82Q518J25q44l8957j9981
14680c6772J5014L4624O1m721l988J3615q053j9895j9491L196J8012N544J2379
14667I525R432j4282n256k491k1509j2187o590L4749L7101r625j3718l039k5848
14654b3738k5628Q342K4447K9135J8486k4118m0193J3813M2990J2459j3892k8704
14642f601j9502R63M015L3030j032j4461P405P430j8731j1053L396Q558k2502
14629b9085K267q154J6848P692J9967P343m0196K1880K3795j3477j2166L134l214
14616c366l7357j605L0718J2076K914k3082l6191J9431M1308J1911K8377l615
14604D1519J8166n257n865N858k0767j1524Q370j0622R50q744R183J6899P468
$$ y = [18743, 18008, 42238, 35553, 23898, 30936, 37197, 20444, 15049, 14367, 22885, 23010, 22166, -16791, -36772, -21758, 12866, 12927, 8206, 4218, 17833, 9780, -10115, -29606, -26410, -8398, -2854, 9525, 18957, 4675, -581, -3072, -24581, -36768, -43358, -8609, 28492, 18867, 5149, 2110, -23738, -49366, -41024, -16577, 12558, 31044, 6926, -33267, -19454, 23536, 35995, 22103, -6601, -26103, -25140, -21125, 11905, 10873, -3588, 3817, 11247, -7484, -18537, -15141, -6583, -29085, -26818, -34972, -18124, -10432, 9535, 16878, -23318, -1438, 22357, 8880, -3286, -152, -3366, -40723, -42328, -11610, 466, 3380, -19702, -55893, -36462, 4846, 16757, 45134, 41519, 59685, 54428, 48563, 54421, 33654, 22130, 30500, 19878, 20828, 12084, 21267, 38166, 45634]
14591D5634m1136k2840J5914J3895q247K213O287p337k468j903j7616J5834J0192
14578H422l4929k2675K8862J9301K757j708r05k571k1966j4857q11J3894N0029
14565B2843P212j7907j4934J6567l911j8697R666k455k0455r154R715n547J7821
14552i236J0896j0080o435j0551J9242J7811q490l5618l624m284k2934L998K9186
14539c0119j2324J6394M5988J9881r215j3544j011k5L8409J4620l3806j0634K157
14526B6771N150n927k17Q305k6217J2966P369j1035J483R830j7864n28p367m11
14512B308L7695p123k2520k5034L44l004J1169N026J1801p535J6889K2802l1822
14499A0996k0175l876J1615J3780j3312J4824q775o830j2574k925k24J7941J6187
$$ y = [45634, 4498, -18342, -2428, 11467, 3220, 5433, 11720, 4383, 1915, 12, -17604, -1770, 8422, -26507, -49182, -20320, -1019, 1738, 30, -875, -3446, -25412, -40269, -41080, -27186, 22843, 30055, 12148, -2786, 13781, 9870, -8827, 839, -1616, -22071, -31225, -21510, -27057, -9236, 1660, -8420, -14855, -25406, -6164, 11647, 3157, -32461, -36085, -40369, -63303, -59305, -30119, -42443, -26049, 19939, 39820, 30605, 17061, 16050, 16025, 54434, 69054, 35248, 24614, 26771, 31921, 25994, 25777, 34082, 7865, 20831, 28200, 17165, 18648, 28478, 10614, 10086, 2719, 2308, 40003, 32880, 10360, -14674, -14330, -17334, -6165, -1139, 10662, 3127, 20016, 42818, 10996, -9179, -13055, -1440, 12340, -972, 13852, 5077, -1753, -14327, -17252, -17476, 465, 16652]
14486A6652J8092M699j6149K03J7078m904l0588l3223k4311K8291P727M360j5182
14473b7255j5442P904K313K1242J6908J305N264p35j931o547k4307j8096R198
14460c0179j5338n071M843K5037Q475k0956q190K345j3710J6086L2032o136k1016
14447c1778j0718q158K7978N124k3882L317J7545j0924J1413K1466j146P365j8178
14434a0576j6460P414k56p229k8631N569N488j6776R195J1305O541K4565J0224
14421C73n536o297K3313N268q451k1102k5555r761J1855L4388j0728o314l120
14408b1667l7504J207K5718O054J7689J1991j5320J439r426Q12J6428L36N1580
14395D9337P335j2528j7627j2221k116r849Q906k3961l009K8525L1790j8733k7667
$$ y = [16652, 34744, 39443, 23294, 23497, 40575, 35671, 5083, -28140, -52451, -24160, -16433, -12073, -27255, -42697, -34793, -32480, -11238, 5670, 6975, 12239, 11504, 9573, 3026, -21281, -39377, -30179, -45517, -50588, -45745, -20708, -12233, -33189, -41379, -39034, -52744, -36658, -4626, -10762, -31778, -42496, -50654, -22676, -17552, -41434, -38117, -20572, -31496, -20083, 1383, 237, 7602, -10576, -27036, -19622, -19878, -27107, -55738, -50169, -44681, -61457, -52262, -40957, -34416, -9851, 373, -5163, -11460, 11853, 17121, 8670, -12432, -37987, -47748, -35893, -1505, -12233, -18547, -21667, -59171, -57964, -32246, -26192, -8503, 3488, -11832, -10393, -19819, -19007, -2579, -2243, 49337, 56672, 44144, 26517, 14296, 12180, 2331, 11237, -12724, -15733, 12792, 44582, 25849, -1818]
14382a818L3953K049j1919j6336p031O280J7361M956j1325m2337k2992l334M111
14369d8382j326m423Q890j0124j6472K9820J7732P391k740j5648K1726J8220j8208
14356a3544j0146M1864K4706l4959l3181j0812k1124Q682k489N308K5541J3347
14344f807n199j0704p94r378J1119J5765P009m479L4696m771n692L2407M745k9756
14330B8161l779m769J2189J261p212j2555k069J5550P46n612J7255o579l7060
14317d473k2400K6132K2698L210n660N629n040l076j58K2252j1228l183K202j3923
14303A2982K6911L2970k6301l6019k980k9876j3023K9878J1441n638l7873K4527
14291a3001J7975N781j4510j1332n534L1835Q29J850P021J3002k7171j8631M204
$$ y = [-1818, 32135, 34184, 22265, 5929, -1102, 5178, 22539, 27495, 16170, -26167, -49159, -52493, -48382, -49708, -54131, -45241, -55365, -71837, -42017, -24285, -16894, -19634, -35282, -13556, 4664, -13544, -23690, 18174, 42880, 7921, -25260, -36072, -57196, -48514, -51003, -45695, -20154, -6807, -12006, -22710, -23504, -32882, -21763, -5998, 1011, -3468, 31228, 26457, 20765, 53172, 57917, 28161, 24382, 19613, 31802, 33063, 25851, 13296, 11227, 26777, 27523, 21911, 39166, 32587, -4473, -26873, -741, 21957, 25167, 19507, 25136, 20096, 17020, 16862, 39114, 27886, 24703, 26905, 12982, 39893, 72863, 46562, 10543, 7563, -22313, -35336, -5458, 5983, 345, -37528, -13001, 4974, 10755, -3755, -15087, -20621, 11214, 12043, 13893, 20914, 33916, 6745, -11886, -7682]
14278g682J4543P551j631j4882l0419j4641n519K6931j311Q531j1819n888J7825
14265a8411K8616K586J483P23k2362j8147J578K5922q02n111O931J7308L744J2192
14251C6250l2922j5765O494K8212j1424l0174J2O633J2932L1989L927l4243m038
14238b117J1642K9415J276k020q539l5634K0171R903o701k8454N025O928o060
14225e165L942R601K0727J2989j7307l0869j0794K2614K5153N433j0987k5639
14213c02k8478j1253K1198K066R515M629J5603j7649j8009j932j1046q120k3649
14200f7427O134K2191p780j7841j67J6601K7144L9501j4205k7441J0544K4671
14188A1925N699j733j4506k7163J3739O437p680J8931l335k9051j1914n015J9209
$$ y = [-7682, 6861, 14412, 12781, -2101, -32520, -47161, -52680, -25749, -27060, -18529, -30348, -36236, -18411, 10205, 12791, 14274, 14997, -7365, -25512, -23934, 1988, 1186, -3925, 3006, 20314, 24058, 36250, 3328, -12437, -5943, 22269, 10845, -19329, -19317, -12684, 248, 32237, 36164, 1921, -2117, 9525, 38940, 40216, 38196, 29657, -5977, 14194, 24097, 17396, -11058, -6033, 895, -5165, -1223, 8378, 29105, 42094, 24787, -6082, -16876, 5738, 30891, 36324, 25337, -302, -28780, -40033, -18835, -16769, -7254, -2625, 12978, -4671, -22680, -24612, -35658, -43778, -67427, -61293, -39102, -46882, -64723, -64890, -48289, -21145, 18356, 4151, -23290, -12746, 11925, 17624, 15891, 1385, -25778, -12039, -5602, -13282, 5649, 2314, -26737, -38651, -43666, -24457]
14175b4457K9468J6089j2035k086p707k9397K061j399j7032m520l869L5284J8257
14162a343K178r10J7054J1139O479K357K865j2322l2139k3057J4082J7726o351
14149b242j938P097K651j6219k4173J3456L1719M482J0610n67k8898m085j7335
14136b5442J127K1392J7706L005k258j9114k7486J5954J5570j218O566o393o489
14123g080L2748M670j9157J8535M3443j1701m8944n2297k0151k4153J0591J4466
14111e9030K7632K4152k352j5891O934N726J5957k4272k615K7926K5483j8022
14099A1628m0335K7795K2828K757j9502j8332N303m054L271j1319o129J2314j0258
14086b4033k5035m317M379j5146N670K2732J6224Q654j6404O671K0590M873j5808
$$ y = [-24457, 5011, 21100, 9065, 6979, -728, -30125, -28064, -29463, -46495, -51015, -54884, -19600, -1343, 835, -75, 16979, 28118, 34597, 36954, 39819, 27497, -4642, -27699, -13617, 4109, -2242, -4180, 2917, 5568, -10651, -34824, -21368, 10351, 14833, 25443, 24876, -4022, -8107, -25442, -24315, -2923, 14783, 17788, 15530, -3584, -31070, -15116, 454, -764, 5802, -591, -7080, 25668, 30338, 11181, 29716, 73159, 61458, 12514, -39783, -59934, -84087, -73496, -59030, -31398, -7246, -9598, -25489, -18555, -12829, 3128, -21144, -23759, 4167, 29650, 11628, -28707, -912, 21916, 24673, 5171, -13161, -7858, -11912, -8641, -19960, -26089, -13775, -24033, -49068, -53385, -49006, -64152, -58482, -35750, -19526, -10872, -27276, -20605, -15, 4858, -10950]
14073a0950k691J8726L5236p287l4974j9930J3377J024J018j6304K3622N664J4813
14060B1344p736k2572R516L6226K2979P5R835J3490l8407k4144l548k3050m625
14047a0617l215k772k3590m546K6125M6240q289l1652k0906K510L222R827r891
14034b7554K0808J1351k8746J3686J9985K6914k5639j2154j9056J5465l894k3513
14022c2347M086r374K6591M6264j5151k9830k416J2203K2222j0541j9065o606
14010a3964K549l466J2844J5620j8771k867J2901j1489j1313L0084J0867q968
13998A4027j7838M723K025m124j251L118M63K4J4227j5145j8042j7574j854K3240
13984a3981K5200q070Q386k2037p255J7801j8574J6772L8822k3265l831k0224
$$ y = [-10950, -13641, 5085, 40321, 33034, -1940, -21870, -8493, -7469, -6451, -22755, 867, 6531, 21344, 13608, -8964, 552, 36778, 59757, 59832, 69667, 83157, 44750, 20606, 17058, -5992, -10617, -13832, -16604, -40194, -44740, -18615, 27625, 19336, -12316, -33222, -30712, -27490, -17663, -27554, -6746, 4605, -24141, -10455, 9530, 36444, 10805, -1349, -20405, -4940, -8834, -32347, -28261, -37635, -11044, 35220, 20069, -9761, -12177, 26, 22248, 11707, -7358, -13964, -11415, -14881, -2037, 13583, -5188, -8055, 4846, -6643, -17956, 12128, 22995, 14027, -3811, 912, 2937, -1187, -2438, 680, 1143, 1167, 15394, 249, -17793, -35367, -37221, -13981, 11219, 3149, 11535, -10502, -17757, 44, -18530, -1758, 37064, 13799, 9968, -10256]
13972a0256j2185Q954L549j1547J1759p85J2816o628k2167n558J6842L764K9734
13959A8292M3945o582j4084l0277K053K0430M834k6709l1250r697K0955K7385
13947A9295q915L019L6310J0660m6903m538j7673o121l951J954K0020J5493k3920
13934e270M89J0033j3718J6439K6421K2600N329j7875j5033q790k876p487k4609
13921a4347m3072R713K8574L1468k459K4063K696l504j495k5700j4268J1010k251
13908D28K723j525J6087O565k6566r594K871J7982P086j496j8203m211J0086m900
13894b667k1049j068L1941J3863j3800j6747k6262j7891l121J9873n855k638j4455
13881e9876LL6563K216q361l861P346M1419P350k4479j8928K0426L8356N22j6575
$$ y = [-10256, -22441, -13487, -9938, -21485, -9726, -10511, 2305, -4323, -26490, -32048, -15206, -11442, 18292, 62237, 55655, 41571, 11294, 13347, 33777, 38611, 11902, -19348, -29045, -8090, 19295, 10380, 13399, 49709, 60369, 13466, 8928, -8745, -14866, -18817, -16863, 3157, 18650, -5270, -4781, 5252, -8466, 7973, 34394, 56994, 62323, 44448, 29415, 20625, 17749, 10262, -14347, -57419, -47706, -19132, 12336, 9877, 33940, 36636, 33132, 31637, 5937, -8331, 2679, 428, 3151, 1626, 17713, 24278, -2288, -11882, -9011, 8971, 16057, 14561, -3642, -7853, 2233, -2667, -23716, -24784, 7157, 21020, 7220, -9527, -35789, -53680, -56801, -36928, -42783, -45421, -59876, -59873, -23310, -21094, -29455, -33316, -25970, 15449, 22799, -1680, -20608, -182, 38174, 38696, 22121]
13867B2121L231q54K775k9201p015J0069O93j5679R394r17L822l4296r319O248
13853c8928J3748J3210Q431o484K446o908L435l200k7005J6284J3275N494J0269
13840D067K3839q566P381o02k9958O41m87P743r222p773j2982q948k795k7707
13826f5369L82J6888J2304L2024K5973J1267m6394j9630n216J0558J2725j7390
13814c1878m700j4373Q218J2559J7663R236j0915k7351p652K4032K3148J4267
13802A2254R708K0391J8466p106j9733K780J803q934j1118l6587K842Q856N638
13789g40J2637J4035k443q534k8969J416M8432l154j8147L504j5070r453j5905
13776b2391Q91N173j1344N038L0518K8676j4700k603M147j9314l7143j3774P063
$$ y = [22121, 25352, 24498, 27273, -1928, -8943, 1126, 1819, -13860, -4466, -5383, -1561, -35857, -45176, -38928, -25180, -11970, -3539, -10023, -7577, -14485, -11050, -14250, -41255, -24971, -11696, -6202, 4067, 27906, 19340, 26721, 26119, -3839, -3198, -3685, 4058, -5164, -12937, -25919, -34867, -37662, -65369, -64987, -48099, -35795, -3771, 22202, 33469, -12925, -32555, -37771, -27213, -14488, -31878, -36578, -50951, -42733, -30174, -12511, -3275, -14190, -41541, -49193, -25161, -2013, 12254, 21962, 42353, 60819, 53713, 33980, 36760, 38563, 29629, 18511, -18076, -15234, -6378, -740, 11897, 25932, 23489, 14955, -14014, -12598, 35834, 32680, 14533, 18037, 2967, -6486, -22391, -21500, -16327, -27671, -22633, 7885, 36561, 21861, 19258, 23405, 4091, -33052, -46826, -39763]
13763c9763J4040K977K1550J426k749j963M777O891j5876q526K8229O313j0208
13750G118j9709J788n593j88Q118O829n271J967R966n41J0219k891N962l32j1647
13735E795J6559J2685k002l4648j4564K9668K8293J4380m053j3504q087J3813
13723D4335j0660q278K9925J7975p384j9508l1403J71l351l5094J8818J0569j3446
13710g331q830p867J162n555j0989j2793J4503K0351J0525J7154R098L1467m235
13697D6660m2582R822R584n478j2554j2753J9501J224L733Q957k9330j2730j7125
13684c3071J1877L4468j5367l0389M69J9131j224Q49P531O156p290R735L062n502
13670D35q656J538P441l304J6410L768k5302m4J4851R068k604P843k5313M357
$$ y = [-39763, -25723, -22746, -1196, 230, -2519, -4482, 295, 7186, -8690, -17216, 11013, 17326, 7118, -12591, -10803, -16396, -16584, -8466, -1637, -6908, -4941, 5025, 4484, 14703, 11812, 17774, 17442, 5795, 22354, 35039, 33037, -1611, -16175, 13493, 41786, 56166, 52113, 38609, 30522, 44335, 33675, 25397, 55322, 73297, 65913, 46405, 15002, 15173, 11822, -23272, -4454, 6115, -7331, -16161, -24028, -22866, -28421, -39410, -52203, -37700, -17349, -6824, 10330, 19428, 50895, 46660, 4078, 13900, 23484, 18006, 5452, -7301, 12200, 13424, 17157, 26114, -3216, -15946, -33071, -21194, 13274, -2093, -32482, -32013, -12882, -14106, -13257, -5726, 430, -6860, 2875, 5937, 435, -8221, -6683, 758, -2546, 13864, 17632, -7670, -7714, 7137, 16205, 13601, 21444, -3869, 488]
13656D88K1592J6797l099j3992n507l51k0056J2542K577j0246K457R840j6750
13643c708j0065k5557m126L9705J9805k9108j4993r571O492K4447J768k0307j9514
13630d4732K410P990M3553J2715M888P292m024j8281j3319M779K2301j3441j6718
13617d587J980J9010p14m7305K1658J0147K090l465j5961N107J8240p961p372
13604i133M058N155r430K440J5723l900J6997j7061j2634J2568J3162M460j5360
13591G045J21J7082J134m2896k998K4122P602k5505j4223R385R664K4642j2898
13578B277j3130N854O875N511M744K1740J0378M226j241j5413N346j914k3891
13565A1362N503Q257J9424M2778K130m0071k1553M744K170l0895R483M4243j0037
$$ y = [488, 22080, 38877, 35778, 21786, 16279, 15928, -4128, 8414, 10991, 745, 3202, 13042, -3708, -13773, -39330, -43456, -3751, 16054, -13054, -28047, -37618, -31126, -6679, -4911, -25218, -44732, -42322, -34332, 9221, 21936, 26824, 34116, 30092, 11811, -1508, 3271, 25572, 12131, -4587, -2607, 16403, 15689, -31616, -9958, 189, 2279, -1186, -17147, -12040, 6200, -1761, -9133, -5075, 80, -9350, -6910, 8813, 4913, 21910, 4849, -7785, 4783, 17945, 22405, 7045, 7166, 24248, 25382, -17514, -20512, 3610, 11212, -14293, -28516, -19131, -9467, 15175, 2277, -10853, -4999, 1876, 7387, 12131, 33871, 44249, 48475, 47234, 31821, 37167, 35253, 11362, 16865, 25122, 44546, 87324, 89454, 49383, 27830, 32574, 34744, 3849, 13332, 57575, 47538]
13552D7538l0286J822j592j7088k1363K686J1917J3622k1387J2970R560r074j8036
13539a8711J3258K0168L763l2476J419K9102K8092P202m018j8685J0001K7558
13527F6673m978r541Q185o827j1868K283O119J0053j2263k3500j1217L8434J579
13514E3132m483j0713q282l0245l689J824j8128j411j2009J3289K1936J8129K6940
13501D6290K765N787J8975j5785j6646j8360l0619j9528K5140j4050Q209J6218
13489H396K0935K0230K3009M0413L8115N39k9838j6522l3024m4913m9535K7992
13477E797n648j0842L9866j7526m8724J1559J0288j4649L454J5430r774J823j4963
13464c3909j4646P494L0009L7169Q01m0689j910j7748K3813q512J848J0399M56
$$ y = [47538, 17252, 19074, 17482, 394, -20969, -18283, -6366, 7256, -14131, -1161, 8399, -675, -18711, -5453, 14715, 18478, -13998, -12579, 16523, 44615, 51817, 47799, 29114, 39115, 66673, 61695, 52154, 60339, 53512, 41644, 43927, 50046, 60099, 47836, 24336, 13119, 51553, 53132, 48649, 37936, 29654, -591, -4280, -2456, -20584, -21995, -34004, -20715, 1221, 19350, 46290, 49055, 54842, 73817, 58032, 41386, 23026, -7593, -27121, -1981, -16031, -7822, 8396, 29331, 49561, 72570, 112983, 151098, 151637, 121799, 105277, 72253, 27340, -22195, 5797, 149, -10693, 29173, 11647, -37077, -25518, -15230, -29879, -26425, -10995, -20769, -18946, -33909, -48555, -41061, -11052, 26117, 26918, -13771, -15681, -33429, -9616, -18128, -16280, -5881, -5425]
13451e425M47n397J7489J7052j22J7583j3493j2815J3416k584k505J4865L321
13438D1832K5476J3318N807j1143l5346j9537k2087k959J7019O927k0603J486
13426A90L2553j6403J5007L9409n3m6581j1666O019L44j1535J713k2470j439L1854
13412A6942M2552L1213J507j5047l9393j2396J4806m990l5979m854L2422J8711
13400D5494j8771k234J6505n827l1459r527J4517K8321J3781J3114K5108k7346
13388F1676k6468p813n566J608n47l3650j0437L838q57K8947M570j9669J2641
13375H273P191K0445k913j4407j1554j2464l09J7817j5049j1339J3316J0796L6138
13362D5941P91k9652r548j3387J4002P211j054l256j5802J1916M370K233j1050
$$ y = [-5425, -4978, -10375, 7114, 24166, 24044, 41627, 28134, 15319, 28735, 26151, 23646, 38511, 41832, 67308, 80626, 86433, 75290, 39944, 20407, -1680, -4639, 12380, 19307, -1296, 190, 32743, 16340, 31347, 70756, 70703, 24122, 12456, 18475, 18819, 7284, 8997, -13473, -14912, 16942, 59494, 90707, 92214, 77167, 37774, 25378, 40184, 35194, -785, -5639, 26783, 45494, 26723, 24489, 40994, 35167, 3708, -5819, 8698, 37019, 50800, 63914, 89022, 61676, 35208, 27395, 21829, 23437, 22890, -10760, -21197, -17359, -18216, 10731, 15301, -4368, 8273, 15464, 35909, 32996, 18589, 7035, -5429, -5738, 12079, -2970, -14309, -993, 9803, 45941, 46732, 17080, 7532, -5855, 8147, 15358, 14304, 11048, -4754, 7162, 11532, 13765, 2715]
$$ [...]
##END NTUPLES=NMR SPECTRUM
##END=
