##TITLE=Analysis number 313982
Compound Code mo 07005
Project Code adrs
Chemist Name spectrum
##JCAMPDX= 6.0         $$ Bruker NMR JCAMP-DX V2.0
##DATA TYPE= NMR SPECTRUM
##DATA CLASS= NTUPLES
##ORIGIN= Bruker BioSpin GmbH
##OWNER= NMR
$$ XWIN-NMR		Version 3.5
$$ Fri Sep 30 12:05:56 2005 GMT Daylight Time (UT+1h)  MAYBRIDGE\NMR@NMR_250MHZ
##.OBSERVE FREQUENCY= 250.131544655141
##.OBSERVE NUCLEUS= ^1H
##.ACQUISITION MODE= SIMULTANEOUS (DQD)
##.ACQUISITION SCHEME= undefined
##.AVERAGES= 16
##.DIGITISER RES= 18
##SPECTROMETER/DATA SYSTEM= dpx250
##.PULSE SEQUENCE= zg30
##.SOLVENT NAME= CDCl3
##.SHIFT REFERENCE= (INTERNAL, CDCl3, 0, 16.522)
##AUDIT TRAIL= $$ (NUMBER, WHEN, WHO, WHERE, WHAT)
$$ ##TITLE= Audit trail, XWIN-NMR		Version 3.5
$$ ##JCAMPDX= 5.01
$$ ##ORIGIN= Bruker BioSpin GmbH
$$ ##OWNER= NMR
$$ C:\u/data/dgb/nmr/ADRS/10070/pdata/1/auditp.txt
$$ ##AUDIT TRAIL=  $$ (NUMBER, WHEN, WHO, WHERE, WHAT)
(   1,<2005-09-30 12:05:36.79 +100>,<MAYBRIDGE\NMR>,<NMR_250MHZ>,
      <created by zg, POWCHK disabled, PULCHK disabled
       configuration hash MD5:
       62 19 C7 07 E1 42 D1 B7 37 6C 3D D0 77 39 F9 E6
       data hash MD5: 64K
       E0 69 D1 80 FA 40 E8 E5 A8 89 EC 12 91 E3 6E 25>)
(   2,<2005-09-30 12:05:49.49 +100>,<MAYBRIDGE\NMR>,<NMR_250MHZ>,
      <Start of raw data processing
       ef LB = 0.3 FT_mod = 6 PKNL = 1 SI = 32K 
       data hash MD5: 32K
       47 08 A7 BB 94 E3 D8 E7 A2 77 48 D3 E4 C2 FC DA>)
(   3,<2005-09-30 12:05:51.16 +100>,<MAYBRIDGE\NMR>,<NMR_250MHZ>,
      <apk 
       data hash MD5: 32K
       C4 72 09 5B DD 81 7B AC 25 07 64 9E 6D B8 58 E1>)
(   4,<2005-09-30 12:05:51.93 +100>,<MAYBRIDGE\NMR>,<NMR_250MHZ>,
      <abs ABSG = 5 
       data hash MD5: 32K
       63 FE 7D 4F 45 96 7D 88 73 05 82 AD 9A C7 7E AE>)
$$ ##END=
$$ 
$$ hash MD5
$$ 90 6A 26 6B E1 8F 71 B6 60 67 8A 3E 10 12 EF 92
##$RELAX= 
##$RELAX= 
##$RELAX= 
##$RELAX= 
##$RELAX= 
##$RELAX= 
##$RELAX= 
$$ Bruker specific parameters
$$ --------------------------
##$DU= <C:\u>
##$EXPNO= 10070
##$NAME= <ADRS>
##$PROCNO= 1
##$TYPE= <nmr>
##$USER= <dgb>
##$AMP= (0..31)
100 100 100 100 100 100 100 100 100 100 100 100 100 100 100 100 100 100 
100 100 100 100 100 100 100 100 100 100 100 100 100 100 
##$AQSEQ= 0
##$AQ_mod= 3
##$AUNM= <au_zg>
##$AUTOPOS= <33 >
##$BF1= 250.13
##$BF2= 250.13
##$BF3= 250.13
##$BF4= 250.13
##$BF5= 500.13
##$BF6= 500.13
##$BF7= 500.13
##$BF8= 500.13
##$BYTORDA= 1
##$CFDGTYP= 0
##$CFRGTYP= 5
##$CHEMSTR= <none>
##$CNST= (0..31)
1 1 145 1 1 1 1 1 1 1 1 1 1 1 1 1 1 1 1 1 1 1 1 1 1 1 1 1 1 1 1 1 
##$CPDPRG= <>
##$CPDPRG1= <>
##$CPDPRG2= <>
##$CPDPRG3= <>
##$CPDPRG4= <mlev>
##$CPDPRG5= <mlev>
##$CPDPRG6= <mlev>
##$CPDPRG7= <mlev>
##$CPDPRG8= <mlev>
##$CPDPRGB= <>
##$CPDPRGT= <>
##$D= (0..31)
0 1 0 0 0 0 0 0 0 0.06 0 0 0 0 0 0 0.0002 0 0 0 0 0 0 0 0 0 0 0 0 0 0 
0 
##$DATE= 1128078335
##$DBL= (0..7)
120 120 120 120 120 120 120 120 
##$DBP= (0..7)
150 150 150 150 150 150 150 150 
##$DBP07= 0
##$DBPNAM0= <>
##$DBPNAM1= <>
##$DBPNAM2= <>
$$ [...]
##$SUBNAM7= <"">
##$SUBNAM8= <"">
##$SUBNAM9= <"">
##$SW= 20.6930455092707
##$SWIBOX= (0..15)
0 0 3 0 0 0 0 0 0 0 0 0 0 0 0 0 
##$SW_h= 5175.983436853
##$TD= 65536
##$TD0= 1
##$TE= 295.16
##$TE2= 300
##$TE3= 300
##$TEG= 300
##$TL= (0..7)
0 120 120 120 120 120 120 120 
##$TP= (0..7)
150 150 150 150 150 150 150 150 
##$TP07= 0
##$TPNAME0= <>
##$TPNAME1= <>
##$TPNAME2= <>
##$TPNAME3= <>
##$TPNAME4= <>
##$TPNAME5= <>
##$TPNAME6= <>
##$TPNAME7= <>
##$TPOAL= (0..7)
0.5 0.5 0.5 0.5 0.5 0.5 0.5 0.5 
##$TPOFFS= (0..7)
0 0 0 0 0 0 0 0 
##$TUNHIN= 0
##$TUNHOUT= 0
##$TUNXOUT= 0
##$USERA1= <user>
##$USERA2= <user>
##$USERA3= <user>
##$USERA4= <user>
##$USERA5= <user>
##$V9= 5
##$VALIST= <valist>
##$VCLIST= <CCCCCCCCCCCCCCC>
##$VD= 0
##$VDLIST= <DDDDDDDDDDDDDDD>
##$VPLIST= <PPPPPPPPPPPPPPP>
##$VTLIST= <TTTTTTTTTTTTTTT>
##$WBST= 1024
##$WBSW= 4
##$XGAIN= (0..3)
0 0 0 0 
##$XL= 0
##$YL= 0
##$YMAX_a= 449426
##$YMIN_a= -333259
##$ZGOPTNS= <>
##$ZL1= 120
##$ZL2= 120
##$ZL3= 120
##$ZL4= 120
##$ABSF1= 16.522
##$ABSF2= -4.171173
##$ABSG= 5
##$ABSL= 3
##$ALPHA= 0
##$AQORDER= 0
##$ASSFAC= 0
##$ASSFACI= 0
##$ASSFACX= 0
##$ASSWID= 0
##$AUNMP= <proc_1d>
##$AZFE= 0.1
##$AZFW= 0.1
##$BCFW= 0
##$BC_mod= 0
##$BYTORDP= 0
##$COROFFS= 0
##$CY= 12.5
##$DATMOD= 1
##$DC= 0
##$DFILT= <>
##$DTYPP= 0
##$F1P= 14.0000005364418
##$F2P= -0.99999901652339
##$FCOR= 0.5
##$FTSIZE= 32768
##$FT_mod= 6
##$GAMMA= 0
##$GB= 0
##$INTBC= 1
##$INTSCL= 1
##$ISEN= 128
##$LB= 0.3
##$LEV0= 0
##$LPBIN= 0
##$MAXI= 10000
##$MC2= 0
##$MEAN= 0
##$ME_mod= 0
##$MI= 0
##$NCOEF= 0
##$NC_proc= -4
##$NLEV= 6
##$NOISF1= 0
##$NOISF2= 0
##$NSP= 0
##$NTH_PI= 0
##$NZP= 0
##$OFFSET= 16.522
##$PC= 1
##$PHC0= -62.78566
##$PHC1= 12.83121
##$PH_mod= 1
##$PKNL= yes
##$PPARMOD= 0
##$PSCAL= 4
##$PSIGN= 0
##$REVERSE= no
##$SF= 250.13
##$SI= 32768
##$SIGF1= 0
##$SIGF2= 0
##$SINO= 400
##$SIOLD= 32768
##$SREGLST= <1H.CDCl3>
##$SSB= 0
##$STSI= 32768
##$STSR= 0
##$SW_p= 5175.98343685301
##$SYMM= 0
##$S_DEV= 0
##$TDeff= 65536
##$TDoff= 0
##$TI= <Analysis number 999999
Compound Code 99
Book Reference 9
Project Code 9>
##$TILT= no
##$TM1= 0
##$TM2= 0
##$TOPLEV= 0
##$USERP1= <user>
##$USERP2= <user>
##$USERP3= <user>
##$USERP4= <user>
##$USERP5= <user>
##$WDW= 1
##$XDIM= 32768
##$YMAX_p= 309566793
##$YMIN_p= -457438
$$ End of Bruker specific parameters
$$ ---------------------------------
##NTUPLES= NMR SPECTRUM
##VAR_NAME=  FREQUENCY,     SPECTRUM/REAL,   SPECTRUM/IMAG
##SYMBOL=    X,             R,               I
##VAR_TYPE=  INDEPENDENT,   DEPENDENT,       DEPENDENT
##VAR_FORM=  AFFN,          ASDF,            ASDF
##VAR_DIM=   32768,         32768,           32768
##UNITS=     HZ,            ARBITRARY UNITS, ARBITRARY UNITS
##FACTOR=    0.157963299565203, 1,           1
##FIRST=     4132.6476996994, 0,             0
##LAST=      -1043.33573715361, 0,           0
##MIN=       -1043.33573715361, -457438,     0
##MAX=       4132.6476996994, 309566793,     0
$$ Real data points
##PAGE= N=1
##DATA TABLE= (X++(R..R)), XYDATA
$$ [...]
23942B4387P2840K3929k485m3066j6199p4779l7333l0958O7765P612K253j1635
23930a7669L5968j0227K7298Q646l7185r3429L4510O2653Q88P7301R9991M6638
23918B35383q2936m3189J3903n9329q9101K8295r601p362N3353N7488O82J8207
23906A15793j3462j04960k2892k5344q8921J6269K4495O6130L6896m729O278l394
23894B159q6395K5067M4323R0190o3151J2493J8069m844J032K9284J4152k7904
23882E4475l0439O1300l2555J6204l9719j21207k1613N7692m9499r686N5409O0744
23870A106R891J02818N8610o2675n4064m2126j01522n0060K9702J49199J4392
23859E5271J0568L0656n7411m1916q636k0594R691N485K8889M6064j1151O068
$$ plain form
23942 24387 97227 121156 118671 75605 59406 -15373 -52706 -83664 -15899 -8287 -6034 -17669
23930 -17669 18299 8072 35370 44016 6831 -86598 -52088 10565 11453 88754 188745 235383
23918 235383 152447 109258 123161 63832 -25269 3026 -6575 -13937 39416 96904 97586 115793
23906 115793 102331 -2629 -25521 -50865 -139786 -123517 -99022 -32892 4004 -725 5553 2159
23894 2159 -84236 -59169 -14846 75344 12193 24686 42755 37911 38943 68227 82379 54475
23882 54475 24036 85336 52781 68985 29266 -91941 -113554 -55862 -105361 -115047 -59638 1106
23870 1106 10997 113815 172425 109750 55686 13560 -87962 -138022 -108320 40879 55271
23859 55271 65839 96495 39084 -2832 -11468 -32062 -22371 -16886 12003 58067 46916 52984
23847E2984K6391M2392p4417l2385l9628l7427K5219L2789j1991J2735L0791K6318
23835E3771j887o6426p7704M2132O647J2054l7085L6719k8248p9548j4066k2230
23823a75871J03996J18066m1354j3715j5712k9546L6300m7998N9688L2211L7967
23812F4032M3065L2323K7231p0194l3334M085l2438L5304K3984k7892o1144J2426
23800A7448J6317k4611j6984m894K667L1209j2521k5489r9016j1400j6840N0503
23788i3611K0139M5237o2911r976k0953K3543J5388J8009Q9918J200n5985k4752
23776e4754k327n6208L2060N5596K0834L6745L8932M3651r8170o3542j86r012
23764e6381o4819K3350M3021k5254J32471P6798k8252M862P34J0475j6121K8700
$$ plain form
23847 52984 79375 121767 47350 14965 -24663 -62090 -36871 -4082 -16073 -3338 27453 53771
23835 53771 51884 -14542 -92246 -50114 -43467 -31413 -68498 -31779 -60027 -139575 -153641 -175871
23823 -175871 -71875 46191 4837 -8878 -24590 -54136 -17836 -65834 -6146 26065 64032
23812 64032 107097 139420 166651 96457 63123 67208 34770 70074 94058 66166 5022 17448
23800 17448 33765 9154 -7830 -12724 -10057 21152 8631 -16858 -115874 -127274 -144114 -93611
23788 -93611 -73472 -28235 -91146 -101122 -122075 -98532 -83144 -65135 24783 25983 -30002 -54754
23776 -54754 -57081 -113289 -81229 -25633 -4799 31946 70878 114529 16359 -47183 -47369 -56381
23764 -56381 -121200 -97850 -54829 -80083 52388 129186 100934 105796 106530 117005 100884 129584
23752A29584K2305k4192j6790n3093N5134N2339K1364K6361r7509l1179r1299
23741f975q4614J4162R3795M6827l5916q7096l5934l2905P5171N5988L4605l7446
23729c38o307o5276l4796Q2884P9882P4455k4980l5255n7372o5275L4703k1729
23717c9404n2857R8975M2088K9499r5536j5535P7413J4675l6371j917J1146n7995
23705b5819J745O08j4744L8243J2643J705J9372m5718q3059n0481P2803L6856
23693c5846k4390k0849k5924K7381O7220Q0671o446j71718r5234J62743J01876
23682E9484Q925O605k4271k0188O361J41563n3076j4349m8089L225M6926m7193
23670F5923n7977l616K7570N196O9767R4673n6538q8626N0318n0533l5673m3455
$$ plain form
23752 129584 151889 127697 110907 57814 112948 165287 186651 213012 115503 84324 -6975
23741 -6975 -91589 -77427 16368 63195 27279 -59817 -95751 -128656 -53485 2503 37108 -338
23729 -338 -6645 -71921 -106717 -23833 56049 130504 105524 70269 12897 -52378 -17675 -39404
23717 -39404 -92261 6714 48802 78301 -17235 -32770 44643 59318 22947 21030 32176 -25819
23705 -25819 -24074 -23466 -38210 33 12676 14381 33753 -11965 -95024 -145505 -72702 -35846
23693 -35846 -60236 -81085 -107009 -79628 -12408 68263 61817 -109901 -205135 -42392 59484
23682 59484 68409 75014 50743 30555 36916 178479 125403 111054 62965 66190 113116 65923
23670 65923 7946 4330 31900 37096 106863 201536 144998 56372 106690 56157 20484 -22971
23658b2971p5679M7239N7597N6643n5648o8766q6690Q121J27144K8142J2017m1885
23646a4736r2981R277k0217n8062M7417L4250P801O0467l1782M7728p280o2765
23634h0883N4597J12178j5746j06857l255N6696m844L973J1185k5758l5708m5096
23622g9518J80k3712n0085j746O3802M7067L8821m9806q4434l7619M6416P9475
23610e1159j1845n049K6099j4366N4992K9707m2253k0661J9447L8054K1022o7541
23598b3553K2900O344J3210j0844J2134O738j8843o7750n9910l3864n236M242
23586a54432p639p475k5255P1775O1702j1641q60o7798j6053M2261m317O7028
23574e2704n5709l5011N3213O4829J2169p2498l892K1798L3250Q5985R342K3225
$$ plain form
23658 -22971 -98650 -51411 6186 62829 7181 -61585 -148275 -140154 -13010 15132 27149 -14736
23646 -14736 -107717 -98440 -118657 -176719 -129302 -95052 -87251 -26784 -58566 -10838 -18118 -80883
23634 -80883 -26286 85892 70146 -36711 -39966 16730 11886 15859 27044 1286 -34422 -79518
23622 -79518 -79338 -103050 -153135 -154881 -91079 -44012 -5191 -54997 -139431 -177050 -130634 -51159
23610 -51159 -63004 -68053 -41954 -56320 -1328 28379 -13874 -34535 -15088 22966 43988 -23553
23598 -23553 -653 5691 18901 8057 20191 26929 8086 -59664 -119574 -153438 -158674 -154432
23586 -154432 -162071 -169546 -194801 -123026 -61324 -72965 -73825 -141623 -157676 -115415 -119732 -52704
23574 -52704 -108413 -143424 -90211 -25382 -13213 -85711 -89603 -67805 -34555 51430 60772 83997
23562H3997o652q1329k6623P3297L5626k1085l0250j8040J2705J6223q7121k9301
23550g8553J7370K6349M6219l4405L097M2891L6595L2581q9053j5651L2829k3900
23538c631m6253m6637J3561P6426O4318o7499j8421M7911m0769K0572n6915N2778
23526d559P5246K6092J3266q9236P571P8560K5701k6331j3211j2584k6430Q518
23514F2603K5111j4530k240Q738O75L3965M9486o2234l2710m292j7151k3583q7253
23501f3415M0278N643K5851J28219L5898j30364p0773k7495l9962j5393R392k3837
23489a25958L3883j347Q5563J2227O1000j2207m7651j9181J0765P9520Q8544j3819
23477A51339k1706o8874k6517j11884p1847L8025n793j569K9231O0915k077r539
$$ plain form
23562 83997 77345 -3984 -30607 42690 78316 57231 26981 8941 21646 37869 -49252 -78553
23550 -78553 -61183 -34834 11385 -23020 -19923 22968 59563 92144 3091 -12560 20269 -3631
23538 -3631 -49884 -96521 -82960 -6534 57784 -9715 -28136 19775 -20994 -422 -57337 -4559
23526 -4559 70687 96779 110045 20809 28380 106940 132641 106310 93099 80515 54085 62603
23514 62603 87714 73184 70944 79682 80357 114322 163808 101574 68864 64572 47421 23838 -63415
23501 -63415 -23137 -17494 8357 136576 172474 42110 -28663 -56158 -96120 -111513 -102121 -125958
23489 -125958 -92075 -93422 -7859 4368 65368 53161 5510 -13671 -2906 76614 165158 151339
23477 151339 129633 60759 34242 -77642 -149489 -111464 -117257 -118826 -89595 -28680 -30757 -40296
23465d0296O83o0316L1814R0994o5824J4654J8080K9347m196L4249j6967n1313
23453a9091j0119J874l9088L0335N0118r9243o8222K7945M6787J2622J512J6881
23441d7689o2818k619J6164j6477M8739R9267M3241K2372k9793o1606j23577l250
23429a18046p7955k7108J4842P5813J04274O0974N9225J15892k9000j50959l7918
23418i966R751j6258R240P883r2165M7769N3932o323q4296J4454j289n5535L6093
23405h6710k4481j8324Q2891J0725J03400M2114n1911j2587j7399L4084K2291
23394H4093m3177K4176J1014p3790p1201O572M6295k3614L4544j796P0923j4752
23382D9287q3602k9342M3811L3227r0197n0155K8074l0163P8285K3518R384q758
$$ plain form
23465 -40296 -39613 -99929 -68115 22879 -42945 -28291 -10211 19136 14940 49189 32222 -19091
23453 -19091 -29210 -27336 -66424 -36089 14029 -85214 -153436 -125491 -78704 -66082 -64570 -47689
23441 -47689 -110507 -113126 -96962 -113439 -64700 34567 77808 100180 70387 8781 -114796 -118046
23429 -118046 -196001 -223109 -208267 -132454 -28180 32794 92019 207911 178911 27952 -9966
23418 -9966 -215 -16473 -7233 650 -91515 -43746 10186 3863 -80433 -65979 -67268 -122803 -86710
23405 -86710 -111191 -129515 -46624 -35899 67501 109615 57704 45117 27718 61802 84093
23394 84093 40916 65092 76106 2316 -68885 -62313 -16018 -39632 -5088 -6884 64039 49287
23382 49287 -34315 -63657 -19846 13381 -76816 -126971 -98897 -129060 -50775 -27257 -17873 -26631
23370b6631o9785k3260R129M887K1963K4101R924l7126L776M8095l8169n656K1870
23357e6882j8651K74J14678k2636k6808O5150L4349N9691Q612j09664j06698J0852
23345d7733P2902M1112q6211j25544L5442N9792J0884R725J32L387o553J0880
23333b1785j2997j00758L1805K5670j1496J4575j2641Q0957L0171L7753n9887
23322A367r9946N6756M2055M089l831O9295O5810m2001n7223n8908r283l4302
23310f6122J9267M1005L7733L7901r9646n5372N8483J9406J2001K1783q8393l8405
23298a00359Q0456N7743m0008l9402N3096O0361j38523j8843l0440O4201J08030
23287E6312p8974m3375J4238K0118R504o8681N3367N0270p3331k3438O3395Q2544
$$ plain form
23370 -26631 -96416 -119676 -110547 -105660 -83697 -59596 -49672 -86798 -83022 -34927 -73096 -78752 -56882
23357 -56882 -75533 -75259 39419 16783 -10025 55125 89474 149165 157777 48113 -58585 -47733
23345 -47733 25169 66281 -19930 -145474 -110032 -50240 -39356 -29631 -29499 -26112 -32665 -21785
23333 -21785 -34782 -135540 -103735 -78065 -89561 -74986 -87627 -6670 23501 61254 1367
23322 1367 -98579 -41823 232 4321 490 69785 135595 93594 36371 -22537 -31820 -66122
23310 -66122 -46855 -5850 31883 69784 -29862 -85234 -26751 -7345 4656 26439 -61954 -100359
23298 -100359 -19903 37840 -2168 -41570 11526 71887 -66636 -85479 -115919 -51718 56312
23287 56312 -22662 -66037 -51799 -31681 -22177 -90858 -37491 12779 -60552 -83990 -20595 61949
23275F1949L2279l0128p0643j6275J1780J9313o5273j6905L9452K8809o4772r8057
23263a68471J3461J3059O7342R0234K7686j1530K8542P212p1927o2612Q2917O9073
23251H4986p1657l3022j8416N9600Q3973m2854M563k5476j16084k0697Q150J4323
23239g2611m2377L3875Q9240M0157n876K1653L1993L9217n5621r2881k0094M6602
23227A3277K5174l8257m5820o0221J0109R4230k3385p5745P81L4850R5268O5075
23215I5336r6661q1151N44M6912J07207L1523n2021l9859L7591l681o4595J4983
23203c872P6193Q331n6279q3831R264O2155Q20J0252m6624o0902L9526L5577k038
23190a1428l8337p2295N9120P1317l0809j14372r411Q6002O7698j5195k3189K3656
$$ plain form
23275 61949 94228 64100 -6543 -22818 -11038 8275 -56998 -73903 -34451 -5642 -70414 -168471
23263 -168471 -155010 -141951 -74609 15625 43311 31781 60323 67535 -4392 -67004 15913 84986
23251 84986 13329 -19693 -38109 21491 105464 62610 67173 41697 -74387 -95084 -86934 -72611
23239 -72611 -114988 -81113 8127 48284 42408 64061 96054 135271 79650 -13231 -33325 13277
23227 13277 38451 194 -45626 -105847 -95738 -1508 -24893 -100638 -99857 -65007 30261 95336
23215 95336 -1325 -82476 -81932 -35020 72187 103710 51689 11830 49421 45740 -18855 -3872
23203 -3872 72321 80652 24373 -59458 -50194 11961 12781 23033 -23591 -84493 -44967 -9390 -11428
23190 -11428 -49765 -122060 -62940 8377 -22432 -136804 -146215 -60213 7485 -7710 -30899 -7243
23178g243J10788R30j22962K1514J3259j1117l1854m9797J00743k1721j8175j4114
23166b9749O8985K3262q0762L4476J2821k3933m8704j1701k3519n2112k0017L8107
23154a12846M5348J316J7093K8244l4506p4243j8363L298J6176M4974O4470k5315
23142d4354n941N34m6922P715k0747L7400l0350M5447J37158o294j0108o1152
23130B386m7737j2971m6559n5771Q0672j3544j7422J4816J5599m6128k8048Q0761
23118g3946L449J1078M1937J5226Q282k19M9291K4865N0551p488q8870j3836p626
23105A2694j9889l5387n0477o282O5514Q6636L1035p377n8741r914n1990K7076
23093a7102R2838K7063l5713l9676m8232j9172M9790l0356K3729J1323n0753M947
$$ plain form
23178 -7243 103545 104475 -18487 3027 16286 5169 -26685 -76482 24261 2540 -15635 -29749
23166 -29749 39236 62498 -18264 16212 29033 5100 -43604 -55305 -78824 -130936 -150953 -112846
23154 -112846 -67498 -66182 -49089 -20845 -55351 -129594 -147957 -144659 -128483 -83509 -19039 -44354
23142 -44354 -50295 -49761 -96683 -88968 -109715 -72315 -102665 -57218 79940 73646 63538 2386
23130 2386 -45351 -58322 -104881 -160652 -79980 -93524 -110946 -96130 -80531 -126659 -154707 -73946
23118 -73946 -70497 -59419 -17482 -2256 6026 5807 55098 79963 130514 123026 34156 20320 12694
23105 12694 -7195 -42582 -93059 -99341 -33827 52809 83844 76467 17726 7812 -44178 -17102
23093 -17102 75736 102799 67086 27410 -20822 -39994 9796 -20560 3169 14492 -36261 -31314
23081c1314O7859K8194L4996n0848k9609L4837N193J1932l9920l5438q853j1119
23069b4090M6039R0029o4171k0121l5031n6539L4214Q3366j6565O131M6480k822
23057H6920j0856J1711j5594m4806M6558M9037J8608p7899r5637o9233O8254P8944
23045D6007J0701J3288n5794j11250o1596M2636L6713j8935M7403N8534K9703
23034C7410M152L569r380m3457l5131K9148O2072j9684J4474J3678j7614O762
23022D5999o1035J524L7053O0500m5087p3550j6540O934l6023M7452N0313J2270
23010B9810l8555j4047k9133n4459M4587L5566l7270J52308Q9841K3064p8595
22999A23117o1446m515J9488J1143m7169r0792L0049O2534j0247L4893m0413k0917
$$ plain form
23081 -31314 36545 64739 99735 48887 19278 54115 59308 71240 31320 -4118 -12971 -24090
23069 -24090 21949 111978 47807 27686 -7345 -63884 -29670 53696 37131 43262 89742 86920
23057 86920 76064 87775 72181 27375 73933 122970 141578 63679 -31958 -101191 -32937 46007
23045 46007 56708 69996 14202 -97048 -158644 -116008 -79295 -98230 -50827 7707 37410
23034 37410 41562 45131 35751 -7706 -42837 -13689 48383 28699 43173 56851 39237 45999
23022 45999 -15036 -13512 23541 84041 38954 -34596 -51136 -44202 -80225 -32773 17540 29810
23010 29810 -8745 -22792 -51925 -106384 -61797 -26231 -63501 88807 178648 201712 123117
22999 123117 61671 57156 76644 87787 40618 -50174 -20125 42409 32162 67055 26642 5725
22987E725j7097o6250k3154J6304J1113L5419O1596O6105K4760k0522j8167r1995
22975a6163m3361J9172J663L893J3533K4956Q5359K9516j2945l0659j07173k8352
22963f0561J2891O2930q2351K4186O2644O32L7100J0412n1321j4740Q8180K3069
22951A13071m8576p1791r03p3336j3201J4202q1363n413J55066J9185j05556m2467
22939a41082L8127N4430L6904l238M5034P6662L0953n1648P2665M1545j1888m1862
22927A46602n7499J8229K7194m3569k4004J7317m1156J6041J5P7400J3209r4504
22915E5275p7582j9990j2696J4717M1557r4009n267J02814J719n886P932q836
22903b52M347N5839O0132o3314j03919K851M3166m2509M4226j4861p0751n3695
$$ plain form
22987 5725 -11372 -77622 -100776 -84472 -73359 -37940 23656 89761 114521 93999 75832 -16163
22975 -16163 -59524 -40352 -38689 -34796 -21263 3693 89052 118568 105623 74964 -32209 -60561
22963 -60561 -47670 15260 -67091 -42905 19739 20371 57471 67883 16562 1822 90002 113071
22951 113071 64495 -7296 -8199 -81535 -94736 -80534 -161897 -167310 -12244 6941 -98615 -141082
22939 -141082 -102955 -48525 -11621 -14859 30175 106837 137790 86142 158807 200352 188464 146602
22927 146602 89103 107332 134526 90957 66953 84270 43114 59155 59170 136570 149779 55275
22915 55275 -22307 -42297 -54993 -40276 1281 -92728 -97995 4819 6538 652 8584 -252
22903 -252 4095 59934 120066 56752 -47167 -44316 -1150 -43659 567 -14294 -85045 -138740
22891a38740P4003J15399J145j793p8540J2612N2269k5095K7488m1356l9560L2099
22879a0069q4415N8003M6884M353q6139j8592j813L1530O5860K8188l5141J234
22867a17k3513n3318k1266J25355m0540j09117j103K7497O6713N2426J413O384
22855C0814j9915q06P205l831O824J8282M937K4122O1025O600j6500j6714j4517
22842H7526j01843J5507R3167Q1727q7462r0203p170J7515p686J8286K7905o7542
22830b0273m070O3436J6989R7654M43n9556k9035p3522n3592l6789j0748P4901
22818c4162J09158O226N4410o1083j10524k0912J557P701q9016K6941K2991K3858
22806f2855k161n6640J2417L1086Q150N65J4623L8875J1461L0382J16844M971
$$ plain form
22891 -138740 -64737 50662 51807 50014 -28526 -15914 36355 11260 38748 -2608 -42168 -10069
22879 -10069 -94484 -36481 10403 14756 -71383 -89975 -91788 -60258 5602 33790 -1351 -117
22867 -117 -23630 -76948 -98214 27141 -13399 -122516 -123619 -96122 -29409 23017 24430 30814
22855 30814 10899 10093 17298 13467 20291 38573 43510 67632 128657 135257 118757 102043 87526
22842 87526 -14317 1190 94357 176084 88622 -1581 -8751 8764 1078 19364 47269 -20273
22830 -20273 -24343 39093 56082 153736 154179 94623 65588 -7934 -61526 -98315 -109063 -34162
22818 -34162 74996 81222 135632 74549 -35975 -56887 -55330 -47629 -136645 -109704 -86713 -62855
22806 -62855 -65016 -121656 -109239 -78153 -70003 -69438 -54815 -15940 -4479 25903 142747 147718
22794A47718n9781o0665M477j4245j4131J5185P6815r1571M0068q4143m5346o7940
22782a53559j4463Q5287M7372N619L2995J3479j668l7251M8015J1624k4736l2598
22770a9884q1240j6518j693k2934J1080L3827N0056n7005j0393r864L9445J35419
22758E0296K7580k3454m6543p892m6089N3384L6855N4805k5062n5679L4026M1218
22746I3445p1793p2671O9971k9563q854N3038K3745j2170l0765O2482K7063j30450
22734b6522o1293P6285J3014l6195j2931L1696j7108m1504k1149P0000J34678
22723A08971N4951r1839r6569k2285k2921J3700N8066K794j8020M8375n653J9766
22711D9336m1176q4975o161n2704P280Q2302Q3317k0475o1035m1351k1365J707
$$ plain form
22794 147718 87937 27272 31749 17504 3373 18558 95373 3802 43870 -40273 -85619 -153559
22782 -153559 -168022 -82735 -35363 -29744 3251 16730 15062 -22189 25826 37450 12714 -19884
22770 -19884 -101124 -117642 -119335 -142269 -131189 -97362 -47306 -104311 -114704 -124568 -85123 50296
22758 50296 77876 54422 7879 -13 -46102 7282 44137 98942 73880 18201 52227 93445
22746 93445 21652 -51019 18952 -10611 -19465 33573 57318 45148 14383 76865 103928 -26522
22734 -26522 -87815 -11530 1484 -34711 -47642 -15946 -33054 -74558 -95707 -25707 108971
22723 108971 163922 72083 -24486 -46771 -69692 -55992 2074 4868 -13152 35223 29570 49336
22711 49336 8160 -76815 -82976 -135680 -128400 -46098 37219 16744 -44291 -85642 -107007 -105300
22699a05300L4848K1530Q0784j112J5225M5525J1543m057p6648r4088J4250L1706
22687b5794L7374L0644L4172j3467r3608o8873n5923p6141L6826K1315m5029P1376
22675a47128R0852K3926j1632m4640K5506N638j4686O3178M7983j21919p8275
22664a61197L1712j2257R396P1047P4608j0728p8884K4082R8615N5156m1373j07340
22652d7163l5972R0737P5847q5467p4815P0169P4158p1484J3214M9694N4167K5626
22640A38711n4600p9148o4153K108k208n5009J3344M4744o04j4717J0556m83q975
22627g0434K0775o5725P01J3756N5845J9914K0722m20L3987n7093k2882L3448
22615a7406O3973O1024j0330l9433k8452j2450l1418L6958j5097Q646m7404k3625
$$ plain form
22699 -105300 -70452 -48922 31862 30750 45975 91500 103043 98986 22338 -71750 -57500 -25794
22687 -25794 11580 42224 76396 62929 -30679 -99552 -155475 -231616 -194790 -173475 -218504 -147128
22675 -147128 -56276 -32350 -43982 -88622 -63116 -57478 -72164 -8986 38997 -82922 -161197
22664 -161197 -129485 -141742 -132346 -61299 13309 2581 -76303 -52221 46394 101550 60177 -47163
22652 -47163 -83135 7602 83449 -2018 -76833 -6664 67494 -3990 9224 58918 113085 138711
22640 138711 84111 4963 -59190 -57082 -59290 -114299 -100955 -56211 -56815 -71532 -60976 -61459 -70434
22627 -70434 -49659 -115384 -114683 -100927 -45082 -25168 -4446 -4866 29121 -27972 -50854 -17406
22615 -17406 46567 107591 97261 57828 29376 16926 -14492 22466 7369 16015 -31389 -55014
22603e5014k3910L1144K6996r0614l0350M8487J45571n9456q9137k9284J2593
22592a12974J3583K875J4514P5645O1481m6462q5569N3337M7873P809j9891j4191
22580a970J5107K6621k8630n0773J7020p3094M1525O6183J1157j498o0453j1883
22568e0688j806m016K1323n430M83K7084N8248o2672r3813j0820J4262J30712
22556B2867J25175l5063r2469m9739P2121O923j5492p1537K741L5479j4757m4271
22544e8022L2270M5860J3712L7112k3071o2892j41J8715o1016R6198R3q6472M6185
22531a469O0831j08565R453R0165k1007k5363l6314J1694J5915o394M9893J13620
22519A52459k4711j30392l03M3643N5322K9707n3133n7555l0257O277K3704n4546
$$ plain form
22603 -55014 -78924 -47780 -20784 -111398 -141748 -93261 52310 -7146 -96283 -125567 -112974
22592 -112974 -99391 -96516 -82002 -6357 55124 8662 -76907 -23570 24303 32112 12221 -1970
22580 -1970 13137 39758 11128 -39645 -22625 -95719 -54194 11989 23146 21648 -38805 -50688
22568 -50688 -52494 -56510 -35187 -40617 -40134 -13050 45198 -17474 -111287 -122107 -107845 22867
22556 22867 148042 112979 20510 -29229 42892 49815 34323 -37214 -34473 1006 -13751 -58022
22544 -58022 -25752 20108 33820 70932 47861 -15031 -15172 3543 -57473 38725 38818 -47654 -1469
22531 -1469 59362 -49203 -39750 50415 29408 4045 -32269 -20575 -4660 -11054 38839 152459
22519 152459 127748 -2644 -2947 40696 96018 125725 72592 15037 -15220 -8943 14761 -39785
22507c9785l8757J4975J21366Q7688p6806j14383n18N8303J1306l5125J9460K875
22495A0599N508O5080M1625p1771Q460N9717p1437p7832k0894J5444l27m9504
22483h5332K265R8823L877n4748n5557m5954L1817J10376P3013N2160k9425n2235
22471D9080m169J7616n298j01689r8244p028K8646L6271N1839j9918K116n2222
22459a03000l6044J3129L4751n4790R196N4781j2268O9416K3580m4688J8144M2749
22447A4956J07013J3370o9489j00012K8233r493n1039M3936k2399L9423J03546
22436I8045j8166O344l6806J6324n1315r6303P537J15869R9704o6849j376L4005
22424A07013q6524k2761m061l6692n8273N4295j9122L7718Q550o061O235r57n746
$$ plain form
22507 -39785 -78542 -63567 57799 145487 68681 -45702 -46220 12083 23389 -11736 7724 10599
22495 10599 16107 81187 122812 51041 59501 119218 47781 -30051 -50945 -35501 -35828 -85332
22483 -85332 -83067 15756 19633 -35115 -90672 -136626 -104809 5567 78580 130740 101315 49080
22471 49080 44911 62527 57229 -44460 -142704 -149732 -121086 -84815 -32976 -52894 -50778 -103000
22459 -103000 -139044 -125915 -91164 -145954 -136758 -81977 -94245 -24829 -1249 -45937 -27793 14956
22447 14956 121969 135339 65850 -34162 -5929 -15422 -66461 -22525 -44924 -5501 98045
22436 98045 79879 86223 49417 65741 14426 -81877 -74340 41529 141233 74384 73008 107013
22424 107013 20489 -2272 -6333 -43025 -101298 -47003 -66125 -28407 -19857 -25918 -19683 -20640 -26386
22411b6386O1714P4185N4218k8930o4013l940p423j5354K685p9303j6732L2932
22399a6347O6557M5841l6527l1611n2474K7803k521L559K0194k0269O027j8028
22387g796j10124K1562L3990P4936R2621k5624o7301m2668m3811j3568J6048O9600
22375b135R376k0332n323p6777n1379R9248r685m5386L0095L8409K132j4216k6756
22362g2729M8845J8930M2606O9411J13187k360j25386m7181j28447j3041Q8087
22351h078j4567Q234j9674J3363M5707L38o241l6811p6886m7934J12736j8498
22339d8311p1329l0536l9380M0359P8417J7335k3518j7189P4918J1757n7398J1676
22327e3199K8374n3432l360J8815l444J4317K684k5421M1098L5876K9190P6373
$$ plain form
22411 -26386 35328 109513 163731 134801 70788 66848 59425 44071 46756 -32547 -49279 -16347
22399 -16347 50210 96051 59524 27913 -24561 3242 721 4280 24474 4205 10232 -7796
22387 -7796 -117920 -96358 -62368 12568 105189 79565 12264 -30404 -74215 -87783 -71735 -2135
22375 -2135 7241 -13091 -18414 -95191 -146570 -47322 -57007 -102393 -72298 -33889 -31757 -45973 -72729
22362 -72729 -23884 -4954 37652 107063 220250 217890 92504 45323 -83124 -96165 -8078
22351 -8078 -22645 -14411 -34085 -20722 24985 25323 19082 -17729 -94615 -142549 -29813 -48311
22339 -48311 -119640 -150176 -189556 -149197 -70780 -53445 -76963 -94152 -19234 -7477 -64875 -53199
22327 -53199 -24825 -78257 -81617 -62802 -66246 -51929 -49245 -74666 -33568 2308 31498 107871
22315A07871o2242n1250k4445J7912l1321m3113l4080J2032N3513L0053O2811
22304C7741j0666L105L387L339K628P3361l1433q463K7488L3494o7082p8992N3228
22291D1135N1563j09642l3011n784p916O4341J1235j20568L1654J2411j4838P0587
22279h833J9551q0706N23O5351O0834o4745k1870O3307O8847N8118m4954j08615
22267F808p4077l3268j8417K4814O8563J8223k7744J291m7300N8427O3982M2750
22255H4052J6920o1571J2198R503L5675L464K0159l8896q1626m6664N8994M1005
22243E3213l3241j2115l2370J5055M9978L5713K4333Q497l9018K0363J1500r7161
22231D747j213M455L1919j3259m0617n5299k3852J6264K2656k7159K6043L5390
$$ plain form
22315 107871 45629 -5621 -30066 -12154 -43475 -86588 -120668 -108636 -55123 -25070 37741
22304 37741 27075 30180 33567 36906 39534 112895 81462 72999 100487 133981 66899 -12093 41135
22291 41135 92698 -16944 -49955 -55739 -63655 686 11921 -108647 -76993 -64582 -79420 -8833
22279 -8833 10718 -69988 -69465 -4114 56720 -8025 -29895 33412 102259 160377 115423 6808
22267 6808 -67269 -100537 -118954 -94140 -25577 -7354 -35098 -33807 -81107 -22680 41302 84052
22255 84052 100972 39401 51599 61102 96777 100241 120400 81504 -122 -46786 12208 53213
22243 53213 19972 7857 -24513 -9458 40520 76233 100566 109063 70045 90408 101908 4747
22231 4747 3534 7989 39908 26649 -13968 -69267 -93119 -76855 -54199 -81358 -55315 -19925
22219a9925P3314L4643l1254k3514n4870P7102K6270m6883p1000K2592J6914Q6986
22207I0375j3602J5365q6257j12984k9129O8453R3598L3157k4034l7373n3123
22196e5554L3923K3054M638n2015N9958K6085l2643L7345r144j0399J4779k6357
22184A3670J1270K5215k5609j18260M0582Q6473N5683l0072J3454m9303j04705
22173h1602m3729J4810j5279j2844l2351N8846J09903k0508n250j01608N0896
22162g8716N5062o5619k3581J40523J71497J3275n7634N765k2804l7790n3783
22151D6195M9030j2879o3629o3136m6715K3378K1790L6794k5873K2666j8177l761
22139c4317J4539L1102P0024N8950J0943k9639m9011R519j604j5954J1395N515
$$ plain form
22219 -19925 53389 88032 56778 33264 -21606 55496 81766 34883 -36117 -13525 3389 90375
22207 90375 76773 92138 5881 -107103 -136232 -67779 25819 58976 34942 -2431 -55554
22196 -55554 -21631 1423 6061 -45954 14004 40089 7446 44791 35647 25248 40027 13670
22184 13670 24940 50155 24546 -93714 -53132 33341 89024 58952 72406 23103 -81602
22173 -81602 -125331 -110521 -125800 -138644 -170995 -112149 -2246 -22754 -28004 -129612 -78716
22162 -78716 -23654 -89273 -112854 27669 199166 212441 154807 160572 137768 99978 46195
22151 46195 95225 82346 18717 -44419 -91134 -67756 -45966 -9172 -35045 -12379 -30556 -34317
22139 -34317 -19778 11324 81348 140298 151241 121602 72591 82110 80506 64552 75947 81462
22127H1462O154n3591l1396l0877j32745k4713J60657O1207j0562m5253j1557
22116c1214m3068o0521K3027j1281M3027N2109J567L9559j3958N0507p7519m7568
22104g5333M4335n0260j212j4490o826J24048K1402K427M2267l1276J2378p7846
22092a0386j9627L7460J6457L7659r056p106M0038L7859R733m7926r391L0959
22080A06673K9469J4300m6377m5153l127j6624n6101j13397k5441J31327P1766
22069D7315M0520J6916n6919r906Q8538n8077J5919o861o9686n2144P0449Q5067
22057A11131J1188J7144J587j6943n0745n390O209K3046k7710j22566q9047m8118
22045a90214N7962R448l9795J7O1822J01989k885r3715n240L0790j2079P848L0885
$$ plain form
22127 81462 87616 34025 2629 -28248 -160993 -185706 -25049 36158 25596 -19657 -31214
22116 -31214 -74282 -134803 -111776 -123057 -80030 -27921 -26354 13205 -753 49754 -27765 -75333
22104 -75333 -30998 -81258 -82470 -96960 -103786 20262 41664 44091 86358 55082 67460 -10386
22092 -10386 -30013 7447 23904 61563 52507 45401 85439 123298 133031 85105 75714 106673
22080 106673 136142 150442 104065 58912 55785 39161 -16940 -130337 -155778 -24451 47315
22069 47315 87835 104751 47832 37926 126464 68387 84306 77445 7759 -44385 26064 111131
22057 111131 122319 139463 141050 124107 73362 67972 74181 97227 69517 -53049 -142096 -190214
22045 -190214 -132252 -122804 -162599 -162582 -100760 1229 -1656 -95371 -100611 -69821 -81900 -74052 -43167
22032d3167P946l0139P5135K0299r2459p2430j5183L4321j057J04434M5706L7319
22020G0725R1165K3118k3197j4063j05053m0595k3530p2926m9014M4520M3192
22009e5658L7638M5837q1782j1617L5760j292J13830j4116l1973q276k3453j9971
21997a5073Q9710L239k7946q5668j8797P2480N9726L9523p626K138j7736j67o9656
21984B4147r9662L9760L8825M2732J5042o2507k4658O3962M8898l667k6303n7325
21972g56K7482J9243N584q828j4734L535j1734j8579j4022n5584J6791R9786Q7969
21959A36153Q615j08862j1869q4841m0772K4126O511K4365N3652K5520R498J4007
21947E6103l5491l1653L6812L3421N3813q850p1049p2300K9070M5047j7983p811
$$ plain form
22032 -43167 -35221 -65360 9775 30074 -62385 -134815 -149998 -115677 -116734 -12300 33406 70725
22020 70725 161890 185008 161811 147748 42695 2100 -21430 -94356 -143370 -98850 -55658
22009 -55658 -18020 27817 -53965 -65582 -29822 -31114 82716 68600 36627 28351 4898 -15073
21997 -15073 74637 77876 49930 -35738 -54535 17945 77671 117194 109568 111706 93970 93803 24147
21984 24147 -75515 -35755 3070 45802 60844 -1663 -26321 37641 86539 82872 56569 -756
21972 -756 26726 45969 51553 42725 27991 31526 19792 1213 -12809 -68393 -51602 48184 136153
21959 136153 144768 35906 24037 -60804 -101576 -77450 -70939 -46574 7078 32598 42096 56103
21947 56103 20612 -11041 25771 59192 113005 104155 33106 -39194 -10124 34923 16940 9129
21935I129J0308p5663M5378J113R558l1624J0475J33622k8623j09385q374L8175
21923D089L502k414Q380J3581k8051j7482k865k6789M7952Q359n4747P4168K5339
21910E3022k1973l0036M9158n9906l5279L3192m2901M4227J27300L2739n2915
21899I6628l4769j2687N0335q372q3786K9545O3964O3202k5532k4681l1413j6581
21887F5853J3952j4435l5020l9491o8936k707N377Q589N7928P427Q708L3765j6037
21874B4973q6814O4369K6662j17218J12607N3296K8188l60q5817o1135j5571K2421
21862c4399o9543m9154J01238J27040k4560m8530J2740p926N3781K8031k4804
21851F3914p6955k9203n0449M5793m3838m3414P9292K8174n9752j2392L5552q8518
$$ plain form
21935 9129 19437 -56226 -10848 -9735 -177 -31801 -21326 112296 83673 -25712 -34086 4089
21923 4089 7591 5177 13557 27138 -913 -18395 -21260 -48049 -97 8262 -46485 27683 53022
21910 53022 31049 1013 50171 -9735 -45014 -11822 -54723 -10496 116804 149543 96628
21899 96628 61859 49172 99507 91135 7349 36894 100858 164060 138528 113847 82434 65853
21887 65853 79805 65370 30350 -9141 -78077 -80784 -75407 -66818 -8890 -1463 7245 41010 24973
21874 24973 -61841 2528 29190 -88028 24579 77875 106063 105703 19886 -41249 -56820 -34399
21862 -34399 -103942 -153096 -51858 75182 50622 2092 14832 6906 60687 88718 63914
21851 63914 -13041 -42244 -92693 -46900 -90738 -134152 -54860 -26686 -86438 -98830 -63278 -151796
21839a51796n1326L4082P2716P1144O1783M341n229p5811J906r5364o969N0289
21827i0234M7071J6764r922o4710O257L0896m0987o270J3839P7955K1141l7027
21815c5227J1535L4609p0348k0256N8638p6149k3098J6599O9313P2821J2566k9001
21803B2002K7398j1819K958j4333P127J5622N0642K5434n5582l9925J2222M1206
21791H2952L9721k2024M1875l2050k2592J5370j6905J4661m8163o5565o9615M6749
21779c5586K1552r381M2539p30l0552j2336r057Q3858L8921o430m5959l0158l4372
21766b7691Q9628N2732j04038l8390J1274j1397R7661K5736j04815l9816k5210
21755g4326m4516J09123M4161n5492N210M1362K3655J578K3763P414n1737k8290
$$ plain form
21839 -151796 -203122 -169040 -96324 -25180 36603 40944 35715 -40096 -38190 -133554 -140523 -90234
21827 -90234 -43163 -26399 -36321 -101031 -94774 -63878 -104865 -111135 -97296 -19341 1800 -35227
21815 -35227 -23692 10917 -59431 -79687 -21049 -97198 -120296 -103697 -34384 38437 51003 22002
21803 22002 49400 37581 40539 26206 33333 48955 99597 125031 69449 29524 41746 82952
21791 82952 122673 100649 142524 110474 87882 103252 86347 101008 52845 -12720 -82335 -35586
21779 -35586 -14034 -23415 19124 18394 -12158 -24494 -33551 50307 89228 82798 36839 6681 -27691
21766 -27691 61937 114669 10631 -27759 -16485 -27882 69779 95515 -9300 -49116 -74326
21755 -74326 -118842 -9719 34442 -21050 -15840 25522 49177 50755 74518 81932 30195 1905
21743A905M158n577j0442k475J089j0075L2893J4897m1864m0259R397M4835J36120
21730A34602l3949o586K193l3961J7545l220o3238K9822M7435o4478m7203M1361
21718B0323J0097o9893o36Q2106L6126J010o3437N537J4811L8505Q7985R4537
21706B57071k8100p5416j44378k5354R2099R9364j28868M7124n004n6823O432
21695C8147j8194L5846J0555k4913j18290k8626K8472M2868J20408K3235k5577
21684H3931l7514o1115o6379l837m2479l5655M8187N8392q413k461Q0007K641
21672A5305q080K7566J6897n2805r9993m855L6442Q8144M1090M4371M310p6288
21660C2104l0385l0029j06303K3377J34291N5074l3682o0127j6004j6726k9555
$$ plain form
21743 1905 6063 486 -9956 -12431 -11342 -21417 11476 26373 -15491 -55750 -46353 -1518 134602
21730 134602 100653 94067 96260 62299 79844 76624 13386 43208 90643 26165 -21038 20323
21718 20323 30420 -39473 -40109 41997 78123 79133 15696 21233 36044 74549 162534 257071
21706 257071 228971 153555 9177 -16177 75922 175286 46418 93542 88538 31715 38147
21695 38147 19953 55799 66354 41441 -76849 -105475 -77003 -34135 86273 109508 83931
21684 83931 46417 -14698 -81077 -84914 -127393 -163048 -114861 -56469 -64882 -67343 12664 15305
21672 15305 7225 34791 51688 -1117 -101110 -105965 -69523 18621 59711 104082 108392 32104
21660 32104 1719 -28310 -134613 -111236 23055 78129 44447 -15680 -31684 -48410 -77965
21649g7965L1780L4252L000O357j8699l8930p9077l2994o0746n139k3891J12884
21637a49168L0679p295J9296J9046k2882L8090Q2338q6358n0046m2646j2596J05204
21625g6338P5513r371L5487k2226k6125N6803Q43k4649j27219K8986J06260N1469
21613F9433j8498K1906r3728j01672J19126N1082K2450k3356L3299L8158k8529
21602H9671o8723l3469j037J3183p2544m5568l9217J9150N3719P8652M9182l6419
21590F580n2576L1595p515k2808O5315L0468n6188q5280L0473N7080M5683l2676
21578A0151k5873K679P719m726m1164O3686M8182m3716L0334j4847k7714j8429
21566a3718N8747l7786j5866Q864n6358O2795k7806P622M9021k9727O683k1757
$$ plain form
21649 -77965 -46185 -11933 -8933 -2576 -21275 -60205 -139282 -172276 -233022 -238161 -262052 -149168
21637 -149168 -118489 -125784 -106488 -87442 -110324 -72234 10104 -76254 -126300 -168946 -181542 -76338
21625 -76338 -825 -10196 25291 3065 -23060 33743 34586 9937 -117282 -88296 17964 69433
21613 69433 50935 72841 -20887 -122559 -3433 47649 70099 46743 80042 118200 89671
21602 89671 20948 -12521 -13558 -375 -72919 -118487 -157704 -138554 -84835 -6183 42999 6580
21590 6580 -45996 -14401 -21916 -44724 20591 51059 -5129 -90409 -59936 -2856 42827 10151
21578 10151 -15722 -13043 -5324 -10050 -51214 12472 60654 16938 47272 32425 4711 -13718
21566 -13718 45029 7243 -8623 241 -56117 6678 -21128 -13506 35515 5788 12471 -9286
21554i286m2679l2499J337j6941L5695j32021M559J29056N9037L9573k5166n0672
21542d0007R4689J8998k3307o1028j35L8046J3036M9432M5621m3594l0939J5174
21530G5986K100m4407j4961K0877K0235O80O8081l8408K9149k4353J7203k2134
21518I0048j0874k1928M12K7572k5333n9063N012k6171N8586R8339k0443n2137
21506F4020k9968j43023o3034K0102o4941K5785J08230J34590N4289j01019p0143
21495f5112n252O9952J19044m3766j27892n5272K0301L419J2388R6033l4569l3457
21483d4183J2647n136M3332J0112l177m3722n6315p996Q8652N4739N8759K3986
21471A31698o4943J676O511l7246m1479p8020k1046N4375P0399K0293K9379m1975
$$ plain form
21554 -9286 -51965 -84464 -83127 -100068 -64373 -196394 -191835 -62779 -3742 35831 10665 -40007
21542 -40007 54682 73680 50373 -10655 -10790 27256 40292 89724 135345 91751 60812 75986
21530 75986 78086 33679 18718 39595 59830 60510 128591 90183 119332 94979 112182 90048
21518 90048 79174 57246 57658 85230 59897 834 5846 -20325 38261 136600 116157 64020
21506 64020 34052 -108971 -172005 -151903 -216844 -191059 -82829 51761 106050 5031 -65112
21495 -65112 -70364 -412 118632 74866 -53026 -108298 -87997 -84578 -72190 23843 -10726 -44183
21483 -44183 -31536 -36672 6660 16772 13595 -30127 -86442 -94438 -5786 48953 107712 131698
21471 131698 66755 68431 74942 37696 -3783 -81803 -102849 -48474 21925 42218 71597 29622
21459B9622o1871j03440m0214N4431K8027j5978o2739r190N4616Q1213J2684L3373
21447E34M0790m5193p0232L1479N8520M5846n847k3995K4504n3456o332L3037
21435B9655m9494j31499L4455K5944j05151J7807Q9260O5252k4168k4394N2829
21424a9504M8520J1373p345n5394M771n0943n8943P4990Q8792o7608Q440J6052
21412f799p6473l7701Q5152J955K8735M5799L353l0258N5767o4653n948P5097
21400G4026J7806J5556L1403r6028n0755P1254J06027n9946r4383n6120J0534
21389c0626K9749k4496o5122J5361O3978L2558Q7429p8014k1762J132j2382l0262
21377c2457k9485k493k3914K7832K9058J54311N4097L790j5685o6836M7962m965
$$ plain form
21459 29622 -32249 -135689 -175903 -121472 -93445 -109423 -172162 -181352 -126736 -45523 -32839 534
21447 534 41324 -3869 -74101 -42622 15898 61744 55897 31902 56406 2950 -3382 29655
21435 29655 -19839 -151338 -116883 -90939 -196090 -178283 -89023 -23771 -47939 -72333 -19504
21424 -19504 29016 40389 33044 -22350 -17579 -68522 -127465 -52475 36317 -31291 -22851 -6799
21412 -6799 -83272 -120973 -35821 -33866 -5131 40668 44021 13763 69530 4877 -1071 74026
21400 74026 91832 107388 138791 42763 -7992 63262 169289 109343 14960 -41160 -30626
21389 -30626 -877 -25373 -90495 -75134 -11156 21402 108831 30817 9055 10187 -2195 -32457
21377 -32457 -61942 -64435 -88349 -60517 -31459 122852 176949 180739 165054 98218 146180 141215
21365A41215p6616J5900m9876l3934l9108n4042q6330k39R1668O7541j0085N8664
21353B4758Q970k3192O0930m618K7821O4921j9474n4857L6206m4270o3233q604
21341E358j8712P307L6927K3395j3342m1791N5747J3226n2260j0319N715m557
21329F694J939j3773k6372L1367L2882O2796m8277p308R683R249M9287J4947L4628
21316A57742l3953j00392j02483n286J10553J08593j9549o0161r041k9666j7862
21305a505K2223J8293J5499M5194O0492k4290j0535M14m8942k1948K817o721j8090
21292C2901N936J5989M3980k1101K851k8807M1939j06553p62J2373K687n759M2683
21279C8357o0521n7214M2091O6982p867J7159m5006q1466P551N3032K6617n8757
$$ plain form
21365 141215 64599 80499 30623 -3311 -42419 -96461 -182791 -183030 -91362 -23821 -33906 24758
21353 24758 33728 10536 71466 66848 94669 159590 140116 85259 121465 77195 13962 5358
21341 5358 -13354 -6047 30880 54275 40933 -858 54889 68115 15855 5536 11251 6694
21329 6694 8633 -5140 -31512 -145 32737 95533 47256 39948 49631 58880 108167 123114 157742
21316 157742 123789 23397 -79086 -84372 26181 134774 115225 55064 46023 16357 -1505
21305 -1505 20718 39011 54510 99704 160196 135906 125371 125785 76843 54895 57712 50991 32901
21292 32901 38837 54826 98806 77705 80556 51749 93688 -12865 -13627 -1254 1433 -4326 38357
21279 38357 -22164 -79378 -37287 29695 21828 38987 -6019 -87485 -79934 -26902 -285 -59042
21267e9042o7479j8674P6982l1506Q7491J12199K9802n3311L4533m0983l6118
21256C3894j71l794J09157L3981q5676q7526o5455l1438n9038J07409m2275j5406
21244a06338L5612o55L8875J6281l1324m786m1346J4718Q3507K4228j6542j28789
21232a16559n5641L3642J61721N3583l4353P760O9753j0382p695m8495K6495J7356
21220I7185M3495K5250n972m6285j5643r584M2138p7896j05458q2112J26742J15597
21208A07457m3254k5702K8780O0853r479l0554J9454o3725J8721l5037o2642J03884
21196F8756N4285J8243j8035j02329o2900j0037o6723j9031O6076J09177J2701
21185E0183q4099q1112N7189M6986J4025n9234m597M5381J6632L6210p3372m94
$$ plain form
21267 -59042 -126521 -145195 -68213 -99719 -12228 99971 129773 76462 110995 70012 33894
21256 33894 33723 29929 139086 173067 87391 -135 -65590 -97028 -156066 -48657 -90932 -106338
21244 -106338 -70726 -71381 -32506 -16225 -47549 -52335 -93681 -78963 4544 28772 12230 -116559
21232 -116559 -172200 -138558 23163 76746 42393 50153 119906 109524 101829 53334 79829 97185
21220 97185 140680 165930 159958 113673 98030 88446 130584 52688 -52770 -134882 -8140 107457
21208 107457 64203 38501 67281 128134 118655 88101 107555 43830 62551 27514 -35128 68756
21196 68756 123041 141284 123249 20920 -41980 -52017 -118740 -137771 -71695 37482 50183
21185 50183 -33916 -115028 -57839 -10853 3172 -56062 -60659 -15278 1354 37564 -35808 -36302
21173c6302R1016L3104N919k1703o3533O917N2740L5646j446n7175j2882K610
21161C4911o1424m5766M7304m5516P904P5872K6434m5317J16110P8486l6491j9804
21149A32703N8098j8722r1102n2591K7672L2869j5322N1293K1494j1513O9956
21138B04835k0914n3220J787l5825l9819q5483O508O2371n7404j4705O3326J2251
21126D3708M8322k295j894o1989p2934K617K5641K6939N3067K690k3986M0014
21114G9900Q17O9144L743O4112k2453n6673j05091o8434l2919k6816K7211N8366
21102i093l9833J6073M1374k8535K0022K6599j4954l4963l6729L2057M700K5222
21090A940j3658J7899N2401K6300L6731l2947m850m5173j6548m8920k6589P6250
$$ plain form
21173 -36302 54714 87818 93737 72034 8501 15418 68158 103804 102358 45183 32301 34911
21161 34911 -26513 -72279 -24975 -70491 -62587 13285 39719 -5598 110512 188998 152507 132703
21149 132703 190801 172079 80977 28386 56058 88927 73605 124898 146392 134879 204835
21138 204835 183921 130701 132488 96663 56844 -28639 -22131 40240 -17164 -31869 31457 43708
21126 43708 92030 89735 87841 25852 -47082 -44465 -18824 8115 61182 63872 39886 79900
21114 79900 80717 149861 153604 217716 195263 138590 33499 -34935 -67854 -94670 -67459 -9093
21102 -9093 -48926 -32853 8521 -20014 8 26607 11653 -23310 -60039 -27982 -23282 1940
21090 1940 -11718 6181 58582 84882 121613 88666 83816 38643 22095 -26825 -53414 22836
21078B2836Q7555n8023o794N5322Q768p8214j8494N5154R40r416m159o9280J962
21065a1843O5951M8456j43731j18537J8423J9812K9969K9555M737n9071k8786
21054a45065Q7545M1514L7810m2214J3077O0563L5898j01951k3459J53150K0911
21043A37779n8558n7724o9478k727N2891k2255k7931K6076J0499J6552O225k7658
21031a6309K9057P4566L6820p4962m6193n1252L7579M5311R712K2956l7570m589
21019B5126o0176l9863Q1155P2992l0069m0880L4598J18737l5136k0956L885j22
21007A09291l011p4244j876K3372J7181p9321K7108O6638J2459K0831l4353M4230
20995A28305Q226n6231j9657o9881R918J2883o280K1382k5497n7155j9847j7253
$$ plain form
21078 22836 110391 52368 45574 100896 109664 31450 12956 68110 69050 59634 55475 -13805 -11843
21065 -11843 54108 102564 -41167 -159704 -141281 -121469 -91500 -61945 -57208 -116279 -145065
21054 -145065 -57520 -16006 21804 -20410 -7333 53230 89128 -12823 -36282 116868 137779
21043 137779 79221 21497 -47981 -50708 2183 -20072 -48003 -21927 -11428 5124 11349 -16309
21031 -16309 12748 87314 124134 49172 2979 -48273 -10694 34617 44329 67285 29715 25126
21019 25126 -35050 -74913 6242 79234 49165 8285 42883 161620 126484 105528 109413 109291
21007 109291 106280 32036 30160 53532 70713 -8608 18500 85138 97597 118428 84075 128305
20995 128305 136531 80300 60643 -9238 680 13563 7283 28665 3168 -53987 -73834 -91087
20983i1087j00147L0131Q1937Q577n3292L1304k9254J1863N6370Q9196m1888k918
20971i208Q8800r55n1916j9172l3486o4255n7987L6097J5301j8752J00289L9100
20959B3856q8198Q763N971j0838J898K6738N6588M4604o7732n6216J5452N1630
20947A2516K2882m570k6223K1154j1213j6749J6200J6668L0188k2205n5684R1647
20935G4611L688k965o7741k6025Q9530J5155l8232j3373k4665O848r5330j0602
20923h9101N1160L7429J7184j4298J6739J287Q0881n015l5667n2348l0607n1229
20911g3585j3478O1614N3095j2107k8994l3658K250M7574J6642j849M8327k6309
20899C9522l5607o6963o1334J4978l1324R5517O0781L0206j12401j3855K119j7236
$$ plain form
20983 -91087 -191234 -161103 -79166 -70589 -123881 -92577 -121831 -109968 -53598 35598 -6290 -9208
20971 -9208 79592 78637 26721 7549 -25937 -90192 -148179 -112082 -96781 -115533 -15244 23856
20959 23856 -64342 -55579 -49608 -60446 -58548 -31810 24778 69382 1650 -54566 -39114 12516
20947 12516 35398 30828 4605 25759 14546 -2203 13997 30665 60853 38648 -17036 74611
20935 74611 78299 75334 7593 -18432 71098 86253 48021 34648 9983 16831 -78499 -89101
20923 -89101 -37941 -512 16672 2374 19113 20400 101281 96266 60599 8251 -22356 -73585
20911 -73585 -87063 -25449 27646 15539 -13455 -47113 -44863 2711 19353 17504 65831 39522
20899 39522 3915 -63048 -124382 -109404 -140728 -45211 15570 45776 -66625 -80480 -78361 -95597
20887i5597J7076N4386R7222j8410o8874M866P862l0522J0852R62N4989J9285
20875E4097O3484p5843n7105k114J7914J1741P0255j44713r3899J7335P3277N5227
20863a0344k3205k4934N1845Q0668k7031l8535q7387Q5363R3305N5454r669o0319
20851H5211n6291j2817J4793J629L4087l7853l4937J4853R092j9474L432N0682
20839E2407L0993p3556q2361K3314L3664n7355K6259K6802j6582J8263L52m9256
20827f7056J09457K273r9358K377J8213j9318L7389P2361j9556K9955l8023J8854
20815D7568m4594j14301R035M6740l0924l0221M072K8481P6296k729m4378k5856
20803h0811M9373N3470L3343J6663m476m4439l5876n175j243P5716K1826M1914
$$ plain form
20887 -95597 -78521 -24135 73087 54677 -14197 -9331 -1469 -31991 -21139 -20177 34812 54097
20875 54097 117581 41738 -15367 -17481 433 12174 82429 -62284 -156183 -138848 -65571 -10344
20863 -10344 -33549 -58483 -6638 74030 46999 8464 -78923 6440 99745 155199 145530 85211
20851 85211 28920 16103 30896 32525 66612 28759 -6178 8675 17767 -1707 1725 52407
20839 52407 83400 9844 -72517 -49203 -15539 -72894 -46635 -19833 -36415 -18152 -17800 -67056
20827 -67056 42401 44674 -54684 -52307 -34094 -53412 -16023 56338 36782 66737 28714 47568
20815 47568 2974 -111327 -102292 -55552 -86476 -116697 -112625 -84144 -7848 -10577 -54955 -80811
20803 -80811 -31438 22032 55375 72038 67562 23123 -12753 -17928 -19171 56545 78371 120285
20791A20285k6308P4366Q0801l3184p6598n7316j03875J13792R7374n2657q5939
20780E0741N6656j0679j0264m0960m4567n4443N3117M4070r516n1074K1200o449
20768b168m3080p2278k503M7482N2300o450L1858K797J5770j5204r6819l6633
20756a24928J00107O2973m1859k4155L1059N4784o2109L7166l2204k2040K0695
20745e11m7637N2600O0892L5368M2799j9194k5540k812k5287o0426R7001J03885
20733B11138l1310m2267p0557K8243O3616k6509l2939L2536k9071j7098p7150
20722H632o7045J4432l3890n828N2028O8156j6918r010l4750L4370k7334O270
20710a0887p444N3310J03660K7964j31575r4547O1358K0843o1805j8059q148P3582
$$ plain form
20791 120285 93977 168343 249144 215960 139362 82046 -21829 91963 189337 136680 50741
20780 50741 107397 96718 86454 45494 927 -53516 -399 43671 34155 -16919 4281 -2168
20768 -2168 -45248 -117526 -120029 -72547 -20247 -26697 5161 7958 23728 8524 -88295 -124928
20756 -124928 -24821 38152 -3707 -27862 3197 57981 -4128 33038 834 -21206 -511
20745 -511 -48148 4452 65344 100712 143511 124317 98777 95965 70678 10252 107253 211138
20733 211138 179828 137561 67004 95247 158863 132354 99415 131951 102880 85782 8632
20722 8632 -58413 -43981 -77871 -83699 -31671 36485 19567 10557 -24193 10177 -17157 -10887
20710 -10887 -18331 34979 138639 166603 35028 -59519 1839 22682 -39123 -57182 -65330 8252
20698H252J8339o5378j610N7293j717l0582L0305Q820K0397r5762m6642L7759
20686f0526L1042P210j18715M141M0427j492K2791R5776P384n1231J1629L8442
20674B6878M1327M8438k2594j37448L7991j0963n2738l2518l2371M3604N0273
20663d0121Q3444J0808m1467N9683q1210k6944j2639J3839J4512p75L2698L4825
20651D6653p3998J0024J19666N5717q3968j06974Q6966K1862r240m1763m3586
20640a8641r0318l3829M2565K4280O9113o198j0196N5986L537M0672K0291p701
20628H9561p773k3713o841p0101K51M6307J552p4202M671K5877k1412p2887J17247
20615H537J23033P1368L1707q2779j28665o139l2067o881r593P8591P0325Q19
$$ plain form
20698 8252 26591 -38787 -40397 16896 15179 -15403 14902 23722 44119 -51643 -98285 -60526
20686 -60526 -29484 -22274 -140989 -136848 -96421 -97913 -75122 20654 28038 -23193 -11564 26878
20674 26878 68205 116643 94049 -43399 -5408 -16371 -69109 -101627 -133998 -90394 -40121
20663 -40121 43323 54131 12664 72347 -8863 -35807 -48446 -34607 -20095 -20870 11828 46653
20651 46653 -27345 -17321 102345 158062 74094 -32880 54086 75948 66708 24945 -18641
20640 -18641 -108959 -142788 -100223 -75943 -6830 -13028 -23224 32762 36299 76971 97262 89561
20628 89561 81788 58075 51234 -18867 -18616 27691 29243 -44959 -40288 -14411 -35823 -108710 8537
20615 8537 131570 202938 234645 151866 23201 17062 -15005 -21886 -31479 47112 117437 118256
20603A18256j0885N2430j4287o8899N8258L1832M551k0773j1570j03672l0894
20592D347Q6133L0315L309n3146q3160l0110O347Q7695J2045p377j46J9528k0201
20579E5579l6616k595L0578L0100q2328N988P0340O2266K2071k1013k9299M2667
20567A47738N7960q6523p9884l7165M8029J5029m6601N2256j0298p9850Q2466
20556F3157Q8155m6744l2915K5918K491l8554J6798k4425q8676j6676L8701R4711
20544H1941M2640N34l1806m9461j4527R0368j516k0070K8895p4730l8914P3011
20532H6365O162j8271O7672k8475l5739p0852K9027N4074N5429k1384o0439j3537
20520E0032l9042L8959J4815K4429j1684J6364N5020P7400N9088p7967k6865o2532
$$ plain form
20603 118256 107371 159801 145514 76615 134873 166705 171256 150483 138913 35241 4347
20592 4347 90480 120795 124104 70958 -12202 -42312 -35965 51730 63775 56398 56252 75780 55579
20579 55579 18963 16368 46946 77046 -5282 706 71046 133312 155383 134370 105071 147738
20567 147738 205698 119175 39291 2126 50155 65184 18583 70839 60541 -19309 63157
20556 63157 151312 104568 71653 97571 100062 61508 78306 53881 -34795 -51471 -12770 81941
20544 81941 124581 125115 93309 43848 29321 119689 118173 98103 126998 52268 13354 86365
20532 86365 92527 74256 141928 113453 77714 6862 35889 89963 145392 124008 63569 50032
20520 50032 10990 49949 64764 89193 77509 93873 148893 226293 285381 207414 180549 118017
20508A18017r089M8214Q05N9204J8823L5071J0066K7529J6570N6222L7204p1536
20496C47100o0524j0807K1460l1921N2312L7296M0461P1513K9340m9956O7503
20485E13777m9832j61735r8333l5776r052j1950m041j07033l8158L9143k9623
20474G387M6687J19514J3032j12437j00484j54857L61J7856Q6703P8415o2283
20463f0106l2487J5900J8347n6011J3326P7663o6591j05141j8181J1007J04089
20452i8185Q7534n4713m0135p4077m2456J25770k1830M0230O4924K5503J2568
20441B5133q7697j1251L2188J38862n3826p4688M6282J8396P2848L4092r667p1381
20429E9291j9656R3489m0291o4571n3579P3727K0985K3930p856L0385N450M226
$$ plain form
20508 118017 108928 157142 157947 217151 235974 271045 281111 308640 325210 381432 418636 347100
20496 347100 286576 275769 297229 265308 317620 354916 395377 466890 496230 446274 513777
20485 513777 463945 302210 203877 168101 159049 147099 143058 36025 -2133 37010 7387
20474 7387 54074 173588 186620 74183 -26301 -181158 -180797 -162941 -76238 2177 -60106
20463 -60106 -92593 -76693 -58346 -114357 -101031 -23368 -89959 -195100 -213281 -202274 -98185
20452 -98185 -10651 -65364 -105499 -179576 -222032 -96262 -118092 -77862 -12938 12565 25133
20441 25133 -62564 -73815 -41627 97235 43409 -31279 15003 33399 106247 140339 130672 59291
20429 59291 39635 133124 92833 28262 -25317 48410 69395 93325 85469 115854 121304 125530
20417A25530L8369N888m2360l5298j0238q9407q0832R2190L8786m0946M8238M2288
20405I2208K0895K3814n2838K1295j01835l163j7396P868P4229N2806N4486o8375
20393A03994o5080j7490m0702K9948J5563J2685o3369M8445J124r500n1849l2380
20381f8611k203K4585O0836M7207m8734J215j3563j0928k6396k21O1979M5327
20369G0493r9126q7452P3607K7786K8583l668l8015j456K6332N0991N0701P538
20357A06314n7227l3244m4861n1243o547O880N510K1994j2955J9309O5891Q3106
20345A02927N6313n1974q8392j2196j4758k7156P6229L9551l1320m9863k7586
20334b8225J6672P9879L1058K6623n1234n103K9251l8364J4109N8689k8812j28719
$$ plain form
20417 125530 163899 169787 127427 92129 81891 -7516 -88348 3842 42628 1682 49920 92208
20405 92208 113103 136917 84079 105374 3539 376 -17020 -9152 65077 117883 172369 103994
20393 103994 38914 21424 -19278 10670 26233 38918 -24451 23994 25118 15618 -36231 -68611
20381 -68611 -70814 -46229 14607 61814 13080 14295 732 -10196 -36592 -36813 25166 70493
20369 70493 -28633 -116085 -42478 -14692 13891 10223 -27792 -29248 -2916 48075 98776 106314
20357 106314 49087 15843 -29018 -80261 -86808 -79928 -74418 -52424 -65379 -46070 19821 102927
20345 102927 159240 107266 18874 6678 -8080 -35236 40993 80544 49224 -639 -28225
20334 -28225 -11553 68326 99384 126007 74773 69670 98921 60557 74666 133355 104543 -24176
20322b4176l4867N8272J6896q3160q0766K5586J10950N8045j4760l7230J253o8008
20310g1965M2587n626n0295O8932K1503m0277j8379J0955l0281M4423N3072m9333
20298b4684J9277J02471N9186q2174o6324l4411k3471J7744O0863L6084K8818
20287I3379K0197m7418K9624k4245k2579L5940J3050n6874j9629m2760k7704M2556
20275f463M9094k2421p17R418J3263J5334J9876m8846n9785K4554R0381n1309
20263C2379J0060O9445N9601n291J8120M7931j5045l5659N5768k8878n4815n3529
20251A00087l4747l9710m4347k9017l8825q268K6050n7121O3604L2356j1688M7673
20239F047L3157O2921j3120P928M2996o6843o8352J0054O39m9589J20340N5069
$$ plain form
20322 -24176 -59043 -771 16125 -67035 -147801 -122215 -11265 46780 32020 -5210 -3957 -71965
20310 -71965 -29378 -35004 -85299 -16367 5136 -35141 -53520 -42565 -72846 -28423 24649 -24684
20298 -24684 -5407 97064 156250 74076 7752 -26659 -50130 -32386 28477 64561 93379
20287 93379 113576 66158 95782 71537 48958 84898 97948 41074 21445 -21315 -49019 -6463
20275 -6463 42631 20210 19493 28911 42174 57508 77384 28538 -31247 -6693 83688 32379
20263 32379 42439 111884 171485 166194 184314 232245 217200 181541 237309 208431 153616 100087
20251 100087 65340 25630 -18717 -47734 -86559 -94827 -68777 -125898 -62294 -29938 -41626 6047
20239 6047 39204 102125 89005 96933 139929 73086 4734 14788 15427 -34162 86178 141247
20227A41247p2135m7420k5010J9386n4623J1763L4963O0289K6448l6197o0521
20216a810J33212j2210n3026Q2244J6406m2877L3634l6232o8083l5789K1498K2051
20204E9018M4434L3482l4200M4381l2718p2511L4883j37594k7740M734J04931
20193B1100M8757p16k2058L3661N6006o7956n1647n2314N178k5478p0313J8753
20181a07027K3335Q2546N5767n3023M1199k8665m2776J9510p3952O4795N7553
20170C9262o7302J3244O1044K0033J2100M616P0965Q9987K5504m4332m6183o3212
20158A15726m9097N882k8355J3423Q952R911j2835j4878Q9781L7993p8591o7042
20146C0870m9211m4670q16K6605L4889k2681J3328L8696M4871m6791j066N5537
$$ plain form
20227 141247 69112 21692 -3318 16068 -38555 -26792 8171 68460 94908 58711 -1810
20216 -1810 131402 119192 66166 148410 164816 121939 155573 119341 51258 15469 36967 59018
20204 59018 103452 136934 102734 147115 114397 41886 76769 -60825 -88565 -83831 21100
20193 21100 69857 69141 47083 80744 136750 68794 17147 -35167 -29989 -55467 -125780 -107027
20181 -107027 -83692 -1146 54621 1598 42797 14132 -28644 -9134 -83086 -18291 39262
20170 39262 -28040 -14796 46248 66281 78381 82997 153962 243949 269453 225121 178938 115726
20158 115726 66629 72511 44156 57579 66531 76442 63607 48729 138510 176503 97912 30870
20146 30870 -18341 -63011 -63827 -37222 -2333 -25014 -11686 27010 71881 25090 24024 79561
20134G9561M9928j837l2866R502q8592j8344M9689n5868N7379k8817M3664J33942
20122A97341k5648j01690k2802q0800N9732m9951l4663N8023K2647l9046n1798
20111f8655N9982K4014Q6025q9922p6558k2305J9791K1980K53J7484J4156m1910
20099e5665j6735J09450J06438K6305J7616n875m0979j12538k2305Q0049k697
20088H3064j7864j9992j14867k2463M5322K1288N4862P1812l2861k7888j2662
20077B7751J6394Q0265l0936l3890J2161k3994N6622r298m400O3320O5463m5952
20065A73506l9805N3199N9113j491q3397r002l9814L3533N484r649o3333J0770
20053H9114P3793m1126l7910l1248J1363K4822n274j5076p1061l11k5436M504
$$ plain form
20134 79561 129489 127652 94786 104288 15696 -2648 47041 -8827 48552 19735 63399 197341
20122 197341 171693 70003 47201 -33599 26133 -23818 -58481 -458 22189 -16857 -68655
20111 -68655 -8673 15341 101366 11444 -65114 -87419 -67628 -45648 -45395 -27911 -13755 -55665
20099 -55665 -72400 37050 143488 169793 187409 181534 140555 28017 5712 85761 83064
20088 83064 65200 45208 -69659 -92122 -46800 -25512 29350 101162 68301 40413 27751
20077 27751 44145 124410 93474 59584 71745 47751 104373 95075 90675 153995 219458 173506
20065 173506 133701 186900 246013 244522 161125 152123 112309 145842 151326 141677 78344 89114
20053 89114 162907 121781 83871 52623 63986 88808 83534 68458 -2603 -2914 -28350 -23846
20041b3846M0191M8320k778o7156j41768p8987P7493R9641R8174J19954M3080
20030B12318q7716n9533K1481L2996J4077P9513l3557r1110J8943J09776J69129
20019C86317P2337N6329P8606J07547N3059Q430r4876j02726j11592J8735J7287
20008D89453j08377o7240L6906L6074O7098J91334J75529J9963j48878q2046L1456
19997F41272q6511k5938j8483j14955j21213o679P7837j6545o9380r1520j656
19986A66229Q3939m2712n8425J4224k1369j0510P4505L9751N28l3756j20759j1785
19974G9860J8537R0808J53068N4834k005m9049Q897K5414p209m6006M9225N7422
19962D33796J23612P3229R3617J6382m9904J9626r8665o4305J0710L4215M3330
$$ plain form
20041 -23846 16345 64665 61887 -5269 -147037 -226024 -148531 -48890 49284 169238 212318
20030 212318 124602 65069 86550 119546 133623 213136 179579 88469 107412 217188 386317
20019 386317 458654 514983 593589 701136 754195 762625 667749 565023 453431 472166 489453
20008 489453 381076 313836 350742 386816 453914 645248 820777 840740 691862 609816 641272
19997 641272 554761 528823 510340 395385 274172 267493 345330 328785 259405 167885 166229
19986 166229 250168 207456 149031 163255 141886 131376 205881 245632 246160 212404 91645 79860
19974 79860 98397 189205 342273 397107 395102 346053 354950 380364 373155 327149 376374 433796
19962 433796 557408 630637 724254 740636 690732 710358 611693 547388 558098 592313 635643
19951F35643n5435k3182q006K4781N012J28523j575p1821r6523l9290p4188j08171
19939C15768l2289o1902n9724P6500J44518k8816l9776q1037J5792J8627k8461
19928B39200J1734O9791k6592p4834l5596J0778j9370l3389n0699r8868j9292
19917b7137r378m3221J01825J42546N495o7490l0949M4300j5840j22976r323L8162
19905F014N6804J3586K0204O6752N4369M3372j4198p3384j01939k9535N7447M4615
19893A44107l1098k0188J0000M7074P79m7325j6542J04357N1026n5626m9881j0411
19881A26272P5569o000r187o3883q8395K7114Q1326P629j3849r7367p6290R4585
19869E7524M9139M698J1549M4755j01145r7255p5095N8977O0944q5980J2060K6599
$$ plain form
19951 635643 580208 557026 549020 573801 578813 707336 705761 633940 537417 498127 423939 315768
19939 315768 283479 221577 161853 238353 382871 354055 314279 233242 249034 267661 239200
19928 239200 250934 320725 294133 219299 183703 194481 175111 141722 91023 -7845 -27137
19917 -27137 -36515 -79736 22089 164635 170130 102640 71691 115991 100151 -22825 -32148 6014
19905 6014 62818 76404 96608 163360 217729 261101 246903 173519 71580 42045 99492 144107
19893 144107 113009 92821 102821 149895 150674 103349 86807 191164 242190 186564 136683 126272
19881 126272 201841 195841 186654 122771 34376 61490 142816 150445 136596 39229 -37061 57524
19869 57524 106663 111361 122910 167665 66520 -30735 -105830 -46853 14091 -71889 -59829 -33230
19857c3230J4955J13013Q9079J9527l2404m0364L9384l7264j2454J1234l1681
19846I9795p4058L6871J9124R375n24K1208L4578o5919r863r21n9347L1085K4241
19833F5645P1064K7117l3420K0329p3504J0383n7470l6177K0440J18196K9595
19822A62198n3016P5729l8587k3887l232p59L1580P1429j9053l6113j78378m7771
19810e9860J18840J43746L1177j2175k4856M8164r199m3115p5054p0853q966N4965
19798I2814N4185j0461P0545J37271J3861j08162j7021O6086J8253M5875K1075
19787C84321N8473k1391p2060K1460m2921j01732J9674M1376p5863p825J9919
19776B23431M695j440J21524L2642l8931n4722o3121k6706m4847l3595k2061K4378
$$ plain form
19857 -33230 -18275 94738 183817 203344 170940 130576 169960 132696 120242 131476 99795
19846 99795 25737 62608 81732 91107 90583 111791 146369 80450 70587 69666 10319 41404 65645
19833 65645 136709 163826 130406 150735 77231 87614 30144 -6033 14407 132603 162198
19822 162198 109182 184911 146324 122437 119205 118446 150026 221455 202402 166289 -12089 -59860
19810 -59860 58980 202726 233903 221728 196872 245036 235837 192722 117668 46815 37849 92814
19798 92814 146999 136538 207083 344354 358215 250053 233032 299118 317371 363246 384321
19787 384321 442794 421403 349343 370803 327882 226150 245824 287200 211337 203512 223431
19776 223431 228126 226686 348210 380852 341921 287199 224078 197372 152525 118930 96869 121247
19764A21247J9555m4166j06777K3114J6847L4081l287K0933J45423k7899J0600
19753B09671J2293P1541L5021r0645o0723J16353j6773J057L8798r3747n5844
19742A67002Q8166P9701P1997N2420p9876j2938J31698J21984m9280j41904n6044
19731C72926k7261L5344O056l9377K1745l608L545q5924O757J1031j2020K1951
19719C11165Q5811j4790l6688q7693k3780j2564l7726M0397p4481r6212l115m9
19707E0275j4174N7890Q5652R6030K1718k5093p1272n960n3823Q9903L1807J2690
19695B75643l6614q1972n5758K5621L384M1876k5413L7173l804P8372R0111Q0999
19683D29618m7595o6835r1706K5256P8831n2383m1561p2543r9O4367m0090o7341
$$ plain form
19764 121247 140802 96636 -10141 12973 29820 63901 60614 81547 226970 199071 209671
19753 209671 221964 293505 328526 237881 177158 293511 276738 277795 316593 222846 167002
19742 167002 255168 334869 406866 459286 379410 366472 498170 620154 570874 428970 372926
19731 372926 345665 381009 387065 347688 369433 365825 369370 283446 290203 301234 289214 311165
19719 311165 396976 382186 345498 257805 234025 221461 183735 224132 149651 53439 50324 50275
19707 50275 36101 93991 179643 275673 297391 272298 201026 195066 141243 231146 262953 275643
19695 275643 239029 157057 101299 126920 130304 172180 146767 183940 180136 258508 348619 429618
19683 429618 382023 315188 223482 248738 327569 275186 233625 161082 160983 225350 185260 117919
19671A17919n1127n308J13320J53222j5070N0990P2401J7578l9392r3470K2207
19660C43270r828j03630l9697l105N8476N5763K5434j0630n8069n1630l8892J991
19648A69453J7930L692L7086k9866K4205l9088q5463p2855o0661m414L6798n1360
19636e4543q023r236M5060O3808J59374l4355N4887J37369O4498L3608j0203m9265
19624C92979j1870R4597L7001k9533n1759q570m702j8637L1597Q8558M6206o1298
19612E04569K9898L0614M2474O1498n6826r7483q2858O9992l9431j16923j23272
19601B22252J2744J19893M887j218N879j410L612K3564k1722n5016p949k4847
19589B80669J0353j7301J14601L9822p0109n7205l7001N8513j2135r4890M4689
$$ plain form
19671 117919 66792 61484 174804 328026 312956 363946 436347 453925 414533 321063 343270
19660 343270 333442 229812 190115 187010 245486 301249 326683 316053 257984 206354 167462 169453
19648 169453 187383 191075 228161 198295 222500 183412 97949 25094 -35567 -39981 -3183 -54543
19636 -54543 -62566 -71802 -26742 37066 196440 162085 216972 354341 418839 452447 442244 392979
19624 392979 381109 475706 512707 483174 431415 422845 418143 399506 431103 519661 565867 504569
19612 504569 534467 565081 607555 669053 612227 514744 431886 501878 462447 345524 222252
19601 222252 234996 354889 359776 358558 364437 363027 366639 390203 368481 313465 305516 280669
19589 280669 291022 273721 388322 428144 358035 300830 263829 322342 310207 215317 260006
19578B60006J17779J71736R3336j4742M5045Q2575M7817m8646n054J9153J5168
19567G84173j8155p8104O7806L8196m7531N3112j216O5712M5774O9071R2554j5149
19555A056243m5994Q9325L0146j18421n4426k9900o121r7998r1795k5738R6127
19544H01448J36061J34535k3188p7892J23475o87K8218J01114l9418j20452k8504
19533A034710O9658P1800L7800J4482n3639Q821L5501P9891N7846L9545K2025
19522A418440R3400R3719J64724R0175J16690K4823R7498J00737R5396J24844
19512B420446J28613J26219O1628J14996K64786K15354K76065M92234O16899N68410
19502E285650M47443L56932M67337O20500Q54035J147767J500346K453496L931802
$$ plain form
19578 260006 377785 549521 642857 628115 673160 755735 803552 754906 749852 769005 784173
19567 784173 766018 687914 755720 793916 746385 799497 798281 863993 909767 978838 1071392 1056243
19555 1056243 1010249 1099574 1129720 1011299 956873 926973 920852 822854 731059 705321 801448
19544 801448 937509 1072044 1048856 970964 1094439 1093752 1121970 1223084 1183666 1063214 1034710
19533 1034710 1104368 1176168 1213968 1228450 1174811 1183632 1219133 1299024 1356870 1396415 1418440
19522 1418440 1511840 1605559 1770283 1860458 1977148 2001971 2099469 2200206 2295602 2420446
19512 2420446 2549059 2675278 2736906 2851902 3116688 3332042 3608107 4100341 4717240 5285650
19502 5285650 5733093 6090025 6557362 7177862 8031897 9179664 10680010 13133506 17065308
19493A7065308N158507L880989J62050r55071m48979m96946k00201J307984L357788
19484B8831429N706107R105435J4742814K4849591L9390300M4836696J8401301
19477A85863673n252488l362778j1255370k6178767k8442797k1730872j6812914
19470G2827687j2005927n988995M75204N879767O251216j573089q262565q272007
19462D9331291p980011q497614p243690n082097l222486j756513q37140l79328
19454A4332412k51762m04648m12716k78679q6755K02530M51552N97830N59467
19445A4709231M40971Q42255J333407J921697K837377M167664O138037R208132
19437D1598771J3182713J3533506N051560l365652l791043k942670k680256N98759
$$ plain form
19493 17065308 22223815 26104804 26266854 25311783 24862804 24365858 24165657 25473641 28831429
19484 28831429 34537536 43642971 58385785 83235376 122625676 167462372 185863673
19477 185863673 180611185 177248407 165993037 139814270 111371473 89640601 72827687
19470 72827687 60821760 54832765 55307969 61187736 67438952 65865863 57603298 49331291
19462 49331291 41351280 32853666 25609976 20527879 17305393 15548880 14711740 14332412
19454 14332412 14080650 13676002 13263286 12984607 12897852 13100382 13551934 14149764 14709231
19445 14709231 15150202 15992457 17325864 19247561 22084938 26252602 32390639 41598771
19437 41598771 54781484 68314990 73366550 70000898 66209855 63267185 60586929 61185688
19429F1185688O720219J4699298K4666524L1630183L2594087L4467951L5389073
19422B41353023P096225l5617180l9080633l2172988l4111886l1103177k0882575
19415E5480809j2995013p772104m093472j203512J577348L498495J538687l441920
19407C2589318m755534m055895m250605m181022k983349j970049j437839q35208
19399H119817o11395p03371q30290p49689o48470n99336m95844l11439k86460
19390B883523k28767j65550j6612J0545j40860k06016j35778j39263m0592j00438
19380A720192j30005p3696N3128m0044r3032j25187q5865m9139l3343N1807L8066
19369A232882q6776P0157J71989J31583J47835J66200J9005j9745m4927j35965
$$ plain form
19429 61185688 67905907 82605205 107271729 138901912 171495999 205963950 241353023
19422 241353023 248449248 212832068 173751435 141578447 107466561 76363384 55480809
19415 55480809 42485796 34713692 30620220 29416708 30994056 34492551 36031238 32589318
19407 32589318 27833784 23777889 19527284 15346262 12362913 10392864 8955025 8119817
19399 8119817 7508422 6805051 5974761 5225072 4576602 3977266 3481422 3169983 2883523
19390 2883523 2654756 2489206 2472594 2483139 2342279 2136263 2000485 1861222 1820630 1720192
19380 1720192 1590187 1516491 1569619 1529575 1436543 1311356 1225491 1176352 1143009 1194816 1232882
19369 1232882 1146106 1216263 1388252 1519835 1667670 1833870 1852875 1833130 1788203 1652238
19359A652238k16040j33695o2433n1583m8297O1456j5153p0485p4356n51J3177
19348A054278m7281j64600j54187j18050k0900O8143n2819O936n69j1625m1713
19337E17613q3698l1064K7413m0180r2798R194P6489p5381j7900q6065p6069l28
19325A27226R1036J54851K34072J85386J27909k1789l6438L2992q1132k7844J2305
19314G98574K7002K38341J90940J15084J99364K36158P9411j70521k62990j84575
19304A266788k02912j98125j25721p3988J0123O6086K6156n6157l8383j14794
19294E59073r3871l3794j15104n8619j20618j22105k9325R7263L6827k8606L3690
19283A24811j5601M4709L8921J71987J9243K6587p1960o5609j6861L4210N5839
$$ plain form
19359 1652238 1436198 1302503 1240070 1188487 1140190 1201646 1186493 1116008 1041652 1041101 1054278
19348 1054278 1006997 842397 688210 570160 549260 617403 564584 571520 570951 559326 517613
19337 517613 433915 402851 430264 390084 297286 306480 382969 307588 289688 203623 127554 127226
19325 127226 218262 373113 607185 792571 920480 898691 862253 895245 814113 786269 798574
19314 798574 825576 1063917 1254857 1369941 1569305 1805463 1884874 1714353 1451363 1266788
19304 1266788 1063876 865751 740030 666042 676165 742251 768407 712250 673867 559073
19294 559073 465202 431408 316304 257685 137067 14962 -14363 82900 119727 91121 124811
19283 124811 109210 153919 192840 364827 384070 410657 338697 273088 256227 290437 346276
19272C46276P278J0964L0030q0103l2429J40299J40209j2501L837M6217J1526
19261F11603o7446q0360k598o3991N539N0809M0697l5415j984j19928k7007r470
19249C00449k2668L0777J3221J7010Q806l2620K5952m369m7273q8316j1382M3767
19237B33354N130k1522j7258l3681r4219K8695K8941R6972R0823J5645o6935J14305
19225C80250P6182k5180n2938l7033J3052Q8282J629J2363p693O3611N815j0343
19213E07997n7015L8915L7537l1889r5346P2186L1410j8136o0217j28809l8096
19202B58537J6618k2183j2563o9220m3822M4172O8941R4155N2221O4946p376k2501
19190D21925o7644l4051n2697k051o056j3134j0419r2489n1413L4759J00671J5830
$$ plain form
19272 346276 353554 364518 394548 314445 282016 422315 562524 550023 553860 600077 611603
19261 611603 544157 463797 461199 397208 402747 453556 494253 458838 456854 336926 309919 300449
19249 300449 277781 308558 321779 338789 347595 314975 340927 336558 289285 200969 189587 233354
19237 233354 238484 216962 199704 166023 71804 100499 129440 226412 317235 332880 265945 380250
19225 380250 456432 431252 378314 341281 354333 442615 444244 456607 448914 512525 518340 507997
19213 507997 450982 489897 527434 495545 400199 472385 503795 485659 425442 296633 258537
19202 258537 275155 252972 240409 171189 127367 171539 240480 334635 386856 451802 444426 421925
19190 421925 354281 320230 267533 265482 259426 246292 235873 143384 91971 126730 227401 243231
19178B43231k7905k1517j8908m4054Q904R150L2625N7425l5421J2273j0716M9211
19166B54298M9231L538N5901Q3527J43264k3935n7536j04790r453k6696k1383
19155C45966k7326J2473m45o5426l1208M9281K9289n6838M6512R0705k6159J6555
19143C83379o2150r1906K1498L9234M4979m9060l5441O08L1688N9579l3374Q865
19131C17899o5219R6120J29173M638M913K9714J18916J79664L8635l8223o4114
19120G52116n2792N7363j7841q9883q3978l7407j10634o8226N6055P0657L00571
19109G76001L28513K05703J14231J93444N0096o6026j50648j69409k33704j58116
19099H90085p4476k209J2679n591n2197m3760l5060j4724J02442P4909j9723J15068
$$ plain form
19178 243231 215326 193809 174901 130847 139751 148901 181526 238951 203530 215803 205087 254298
19166 254298 303529 307067 362968 446495 589759 565824 508288 403498 394045 367349 345966
19155 345966 318640 331113 330668 265242 234034 283315 312604 255766 302278 392983 366824 383379
19143 383379 321229 229323 250821 290055 335034 285974 250533 251141 282829 342408 309034 317899
19131 317899 252680 348800 477973 482611 487524 517238 636154 815818 854453 816230 752116
19120 752116 699324 756687 738846 648963 564985 527578 416944 348718 404773 475430 776001
19109 776001 1104514 1310217 1424448 1617892 1667988 1601962 1451314 1281905 1048201 890085
19099 890085 815609 813400 826079 820488 768291 724531 689471 674747 777189 852098 832375 947443
19087I47443l1744m3133J5750o5442R428O9317O9711J29536K4600m0561o6962
19076A017943J1684R3478k1443o6825j02858q3793k4266Q3315O1180Q9430J86703
19065A244548R396J4891o6977p8823q0361k8155M1651j9866r1187q5403R0113
19054I49827L10125K97965J66695J2707r7621j30432p4985j27970j15428o8475
19044A122408o7261L3467k1040n0563k5585m3552K6367K4088l6097O3507J0597
19033A036336R1650J47564P8571O949N7918L3080J53675J13744l2558l6104L0033
19022A680858N7210o8008j6195k9290N6636J44502r122L5148j5203K7580J30135
19011A994251O8054m2503K538K009l4356p7976k4806L6910L6914n453J17846P8471
$$ plain form
19087 947443 915699 872566 888316 822874 832302 901619 971330 1100866 1125466 1084905 1017943
19076 1017943 1029627 1123105 1101662 1034837 931979 848186 823920 907235 968415 1057845 1244548
19065 1244548 1253944 1268835 1201858 1123035 1042674 1014519 1056170 1036304 945117 859714 949827
19054 949827 1259952 1557917 1724612 1737319 1639698 1509266 1434281 1306311 1190883 1122408
19044 1122408 1055147 1088614 1067574 1017011 991426 947874 974241 998329 962232 1025739 1036336
19033 1036336 1127986 1275550 1354121 1361070 1418988 1452068 1605743 1719487 1686929 1650825 1680858
19022 1680858 1738068 1670060 1653865 1624575 1681211 1825713 1816591 1851739 1836536 1864116 1994251
19011 1994251 2062305 2019802 2022340 2024349 1989993 1912017 1887211 1924121 1961035 1955582 2073428 2151899
18999B151899J05369O9034L1344L2626J1230L8570J13600J45578J22185J41924
18989B963359J95600K92527L58931M86061M36952L05071L35759L74043K52491
18980F000794J02050K90678N82688P53415Q21627J088322J494025K103928L230146
18971A6467673M931331O933275O570890J727657j454924j095490q32869o64434
18963C2583109J009338L705825O836025J1251287J8802905L1702551M9548664
18956A55439704N4836490K3274349m997846o648261j7864917l5809090l6443400
18949A31787029k7447177k1280625j5325301p839629l89580N787408Q253572J961648
18941G5507345p278046r543396r149456r718834r117937o695664m322012k595219
$$ plain form
18999 2151899 2257268 2326302 2357646 2390272 2401502 2440072 2553672 2699250 2821435 2963359
18989 2963359 3158959 3451486 3810417 4296478 4733430 5038501 5374260 5748303 6000794
18980 6000794 6102844 6393522 6976210 7729625 8551252 9639574 11133599 13237527 16467673
18971 16467673 21399004 28332279 34903169 36630826 35175902 34080412 33247543 32583109
18963 32583109 33592447 37298272 44134297 55385584 74188489 105891040 155439704
18956 155439704 210276194 233550543 228552697 221904436 204039519 168230429 131787029
18949 131787029 104339852 83059227 67733926 59894297 59504717 65292125 73545697 75507345
18941 75507345 68229299 58685903 49536447 39817613 30699676 24004012 19682000 17086781
18933A7086781j627749j113305o53410l61476p8114M4727J40906K02681J99174
18924A3840215R5783O1231K30314O83284J101860J755252K349252L345047M918756
18915B8380994P721013J1493260J3379410P833034j186034l777925l152577l027470
18907E7663705q15099M836232J2881124K1307292K3949100K1555099K4454416
18900A65831869K8364720N744110k9260058l1708709k5426128k7166911k5029804
18893F1349089j6836535j0379342o342258l469509j278972O57955K280439J887835
18885B7868702j514166l482967l208335l075421l302546k730936j843089j320389
18877G390853q90074n64667m02997k64069k46208l02211k73672k81863m15428
$$ plain form
18933 17086781 15459032 14345727 13692317 13330841 13252727 13297454 13438360 13641041 13840215
18924 13840215 13935998 13997229 14227543 14910827 16012687 17767939 20117191 23462238 28380994
18915 28380994 36102007 47595267 60974677 68807711 67621677 63843752 60691175 57663705
18907 57663705 56848606 61684838 74565962 95873254 119822354 141377453 165831869
18900 165831869 194196589 199940699 170680641 138971932 113545804 86378893 61349089
18893 61349089 44512554 34133212 27790954 24321445 23042473 23700428 25980867 27868702
18885 27868702 26354536 22871569 19663234 16587813 13285267 10554331 8711242 7390853
18877 7390853 6500779 5936112 5533115 5269046 5022838 4720627 4446955 4165092 3749664
18868C749664l31469k63355k42197j85726j92854q9702l6775q1702r6846j20741
18858B108297j73844j98159j01627j4157k6941o5395n8561j20696k5760j2168
18848A310989k7726m8208n9643o5862m2527l6021q0050m2951l897P1017K6448
18837A001569m7008J0639j7102M0159j8727k7515P0543k2460J6879P0805K1042
18826A098824J7011k2591J00734j5407K143J71922L96031L56965L24248K37083
18816B666963l2955k64834l03068l06236k27962j97262j75047r0341o6669j20967
18806H81622o6984n3024k3433R7597K69870L83253L86413K36303Q2150Q2502K2169
18795B298438k68858k86323j73328k07444j65481r5532J894Q2924L3223l7231
$$ plain form
18868 3749664 3418195 3154840 2912643 2726917 2534063 2444361 2407586 2325884 2229038 2108297
18858 2108297 1934453 1736294 1634667 1620510 1593569 1528174 1469613 1348917 1323157 1310989
18848 1310989 1283263 1235055 1175412 1109550 1067023 1031002 950952 908001 904104 975121 1001569
18837 1001569 954561 965200 948098 988257 969530 942015 1012558 990098 1006977 1077782 1098824
18826 1098824 1115835 1093244 1193978 1178571 1180714 1352636 1748667 2105632 2429880 2666963
18816 2666963 2634008 2369174 2066106 1759870 1531908 1334646 1159599 1069258 1002589 881622
18806 881622 814638 761614 738181 835778 1105648 1488901 1875314 2111617 2193767 2276269 2298438
18795 2298438 2029580 1743257 1569929 1362485 1197004 1101472 1103366 1186290 1219513 1182282
18785A182282j32410r2027o9051p963j04604n2962M0071M2982j29824r2107j5394
18774E68993K7199l9766p733m8114J004O606l0036P1716J52482J49341K03174
18763A054866K07372J8409o4123o4063p0432k7275l2100j9918n8630k4617N9080
18752I78569N2592P2331J19395K33417K19165J36106O3232K02197J65439m5233
18742B197210k59064j28038j18855k46390k74557j60870o2976m5604m5674K9067
18732H84249P6995P1880O7473R5884l6172j51730p4686n7081q3110k0495j4058
18721G59149m1180m1425j8690n9192q9683M784M6422P7280L1660P6591J86306
18710I32022P5567N885P6048M8056O3861M8718O7169P5142N3049Q635J15505j04998
$$ plain form
18785 1182282 1049872 957845 888794 880831 776227 723265 763336 806318 676494 584387 568993
18774 568993 596192 556426 548693 500579 501583 508189 478153 549869 702351 851692 1054866
18763 1054866 1262238 1280647 1216524 1152461 1082029 1054754 1022654 1002736 944106 919489 978569
18752 978569 1031161 1103492 1222887 1456304 1675469 1811575 1874807 2077004 2242443 2197210
18742 2197210 1938146 1810108 1691253 1444863 1170306 1009436 946460 900856 855182 884249
18732 884249 961244 1033124 1100597 1196481 1160309 1008579 933893 876812 793702 773207 759149
18721 759149 717969 676544 657854 598662 508979 513763 560185 637465 669125 745716 932022
18710 932022 1007589 1013474 1089522 1137578 1201439 1250157 1317326 1392468 1445517 1454152 1569657 1464659
18698A464659j29973m9467l1429N7220M8401Q9166N520N3837o7860j9120p2714
18687A348240j01045j82358j37133q6186j10109n8347J0412M1099J42052J52032
18677A018657J62773J74367M6058l1022j5938n9696j3172r668j6367L4572J1120
18666A301684N913R2920N4381j0423J16201J9738N383k0159J3091J00846J28518
18655A808093Q5450N0590Q1782K3807j5549O2553K62923J95173J54010J05205
18645B814037J07519R3732J35846J8661J49746L52960L59805L21108M34774N70398
18635E358586N46501N73166P63233J104049J714627K507731K640311J245834k96782
18626A6157256k79444j52695l6270N77692J549625K684623M374517P282541J2221879
$$ plain form
18698 1464659 1334686 1285219 1253790 1311010 1359411 1448577 1454097 1507934 1440074 1420954 1348240
18687 1348240 1247195 1064837 927704 841518 731409 673062 683474 724573 866625 1018657
18677 1018657 1181430 1355797 1401855 1370833 1354895 1295199 1282027 1272359 1255992 1290564 1301684
18666 1301684 1307597 1400517 1454898 1444475 1560676 1580414 1585797 1565638 1578729 1679575 1808093
18655 1808093 1893543 1944133 2025915 2049722 2034173 2096726 2359649 2554822 2708832 2814037
18645 2814037 2921556 3015288 3151134 3169795 3319541 3672501 4032306 4353414 4788188 5358586
18635 5358586 5905087 6478253 7241486 8345535 10060162 12567893 15208204 16454038 16157256
18626 16157256 15877812 15725117 15688847 16266539 17816164 20500787 24875304 32157845 44379724
18617D4379724K0016782K7995578K0253443r26593l096088K399553n549655j7734404
18609H7738340j6978794j2100342j0385324q597513m778430p39855L111205O475300
18601D3744587O088197l93705n524901n656015n684261o102899n071260l581533
18593A7818210k305499j394911r12346n84776l90933j61314j0829J77627K10106
18584A2445335K75416N81035R21222J369974K095900L012170M458436O756315
18576C1915803J0305255J3860197J2505472L655188l280211m105931m394210m707493
18568E5754070k373755J659683O057365J1742230K0459917L3671508M9926936
18561A76897954N7019686M6611950K8238494P98709l0579359m7469656m6231577
$$ plain form
18617 44379724 64396506 92392084 112645527 111718934 108622846 111022399 105472744 87738340
18609 87738340 70759546 58659204 48273880 39676367 34897937 34158082 37269287 43744587
18601 43744587 49832784 49439079 43914178 38258163 32573902 26471003 21399743 17818210
18593 17818210 15512711 14117800 13205454 12620678 12229745 12068431 12057602 12235229 12445335
18584 12445335 12720751 13301786 14223008 15592982 17688882 20701052 25159488 31915803
18576 31915803 42221058 56081255 68586727 72241915 68961704 64855773 60461563 55754070
18568 55754070 53380315 55039998 61097363 72839593 93299510 126971018 176897954
18561 176897954 233917640 280529590 308768084 309566793 278987434 231517778 185286201
18554A85286201m2247776l6773090k7132971j7013180r588953m131617Q01440
18547D9200054M936862M065826l487234p605136o703571o766172p091685n828220
18539B0720724m027953k620686j858949j328582q59835o58286n43510k29430j3131
18530H580362P1464K0516j82018k19955l17457n06299m58483k84066j07687q5219
18520F511158m776P5931J36870J69188L12237L77195N43294O36197P40245P67905
18510A0265444Q63587Q96274R77096J167915J610790K411310L510266N389518
18502B7092200Q271431J0937723Q085555Q1988k220804q04720n59694M53902M016249
18493E5353830Q842423J5435126K5612698M0653506N6968112N7231729L6615441
$$ plain form
18554 185286201 143038425 106265335 79132364 62119184 52530231 48398614 49200054
18547 49200054 54136916 58202742 54715508 47110372 40406801 33640629 26548944 20720724
18539 20720724 16692771 14072085 12213136 10884554 10024719 9366433 8822923 8593493 8580362
18530 8580362 8651826 8672342 8490324 8270369 7952912 7446613 6988130 6704064 6596377 6511158
18520 6511158 6506382 6582313 6719183 6888371 7200608 7577803 8121097 8757294 9497539 10265444
18510 10265444 11129031 12025305 13002401 14170316 15781106 18192416 21702682 27092200
18502 27092200 35363631 46301354 54386909 54468897 52248093 51443373 50883679 51337581 55353830
18493 55353830 64196253 79631379 105244077 145897583 202865695 260097424 296712865
18486B96712865J2353546j1081421l6700104m8900587m4668127l8522599l1670788
18479I7522785k1762095j2911718p041895k617679J802138O446119Q778043L470000
18471G3685698o169042q937457q356214q893989q580558o416437m204031k824627
18463A9303343k022704j540146j148323p91810n20868m43008l23949j10268J3454
18454A2415721J60859M80760P07902J265861K080143L320981N422162Q309527
18446C4163916R942722N979151j486027l445092k736225l069487k518422J19849
18438C6950385M083271R114917J4981374J6055967Q926498Q707264J7384666J3718590
18430A29922932j1228901k1511726j5369998j4744360j6378794j2608416q206574
$$ plain form
18486 296712865 309066411 297984990 261284886 212384299 167716172 129193573 97522785
18479 97522785 75760690 62848972 55807077 53189398 54991536 61437655 70215698 73685698
18471 73685698 67516656 58579199 50222985 41328996 32748438 26332001 22127970 19303343
18463 19303343 17280639 15740493 14592170 13800360 13279492 12836484 12512535 12402267 12415721
18454 12415721 12576580 13057340 13765242 15031103 17111246 20432227 25854389 34163916
18446 34163916 44106638 50085789 48599762 45154670 42418445 39348958 36830536 36950385
18438 36950385 41033656 50148573 65129947 81185914 90112412 98819676 116204342 129922932
18430 129922932 118694031 97182305 81812307 67067947 50689153 38080737 29874163
18423B9874163n543907l480340k015401j083435o3657O87076k82985k010793k024154
18414A4056567j637808j767946j712222j391322j040774o41073l74018m55342
18406E036062m45729l31054j18284P0345R3839J34351J65983Q7931j30978l01453
18396D261013l37381l23998k99390j90359j58232j77881j38989j06435J4390P7037
18386B619775K46086Q8546j18795j68851j41627k22127r762r884o4439K7256M9642
18375B295820P2536K30087J64631Q2835p2741j36998r437O0494N2353J28964K90947
18364C159491K97304L29216N07662Q11729Q19921N37171J11206l23200q76513
18355E373987r84940q27465p51289n53008k82720k37341n4999O7168J02686J46792
$$ plain form
18423 29874163 24330256 20849916 18834515 17751080 17687423 18374499 18091514 16080721 14056567
18414 14056567 12418759 10650813 8938591 7547269 6506495 5865422 5491404 5036062
18406 5036062 4590333 4259279 4140995 4211340 4305179 4439530 4605513 4693444 4562466 4261013
18396 4261013 3923632 3599634 3300244 3109885 2951653 2773772 2634783 2528348 2542738 2619775
18386 2619775 2865861 2954407 2835612 2666761 2525134 2303007 2293245 2283361 2218922 2246178 2295820
18375 2295820 2368356 2598443 2763074 2845909 2773168 2636170 2626733 2687227 2739580 2868544 3159491
18364 3159491 3456795 3786011 4293673 5105402 5925323 6462494 6573700 6250500 5373987
18355 5373987 4389047 3561582 2810293 2257285 1974565 1737224 1682225 1749393 1852079 1998871
18345A998871K71641J43753j63425k69968k67101k51704j88767j91424j71233
18336I10643j60137o9447m1600O549J09260J04695J32794O8556m179k8911l5455
18325I92768m827m31L4453R9773j0335L4181K40355J01858M0802q1295j07120
18314A340182n9734j64884j21782N065J45035J94165L00835K17213P3792J89427
18304B119314L43696J70836k44286n05356l12480j73771k25098k88158j21390
18295G63307N4499J41771Q7662O5621J38861J80077R6134L9978j6972J9323J06000
18284A676261k2916J6926J53218K63180K53009K77504K57246M66167P58288J098524
18274E197407J317357J687676K885115M894240R073415J6094815J5434983m832664
$$ plain form
18345 1998871 2270512 2414265 2250840 1980872 1713771 1462067 1273300 1081876 910643
18336 910643 750506 681059 639459 646008 755268 859963 992757 1061313 1057134 1028223 992768
18325 992768 987941 987510 1021963 1121736 1111401 1145582 1385937 1487795 1528597 1447302 1340182
18314 1340182 1280448 1115564 993782 998847 1143882 1338047 1638882 1856095 1929887 2119314
18304 2119314 2463010 2633846 2389560 1884204 1571724 1397953 1172855 884697 763307
18295 763307 817806 959577 1047239 1112860 1251721 1431798 1527932 1567910 1550938 1570261 1676261
18284 1676261 1653345 1670271 1823489 2086669 2339678 2617182 2874428 3340595 4098883 5197407
18274 5197407 6514764 8202440 11087555 15981795 25055210 41150025 56585008 51752344
18266E1752344j0930360n619686o909132r643685o759911l745620k094735j282215
18258D767000r36347o54778n39377m07650k36276k27710k01023p2949j01129l6075
18248A353686l01J356O30J9629L928o5390q5630k4540J3210q5505r6333M4292
18236A079032K2969M932j03993J8097L2580L2998J44429J7310J8213l1682n5293
18225A179592j91824l9103p8333p8496l8349j2624p5350m6372J0829p6418n9023
18214D94529K6778n6287j3508l1278L2912j7840j08141l4282N6872P855M1832
18203C99442n602k6662Q672j44277m7071J9514K3940k644Q1974O6841M6047M1685
18191D61859j03682l8898J18706J35973m9924j19433n8072j6873k3703Q2813J53565
$$ plain form
18266 51752344 40821984 35202298 28293166 18649481 11889570 8143950 6049215 4767000
18258 4767000 3830653 3175875 2636498 2228848 1992572 1764862 1563839 1490890 1389761 1353686
18248 1353686 1353385 1354741 1355371 1375000 1378928 1313538 1227908 1203368 1216578 1131073 1034740 1079032
18236 1079032 1102001 1106933 1002940 1021037 1053617 1086615 1231044 1248354 1266567 1234885 1179592
18225 1179592 987768 948665 870332 791836 753487 740863 665513 619141 629970 553552 494529
18214 494529 521307 465020 451512 420234 453146 435306 327165 292883 349755 357610 399442
18203 399442 393840 367178 375850 231573 184502 204016 227956 225312 307286 374127 420174 461859
18191 461859 358177 319279 437985 573958 524034 404601 346529 329656 305953 388766 542331
18180E42331O3328n8610o4240p077O4182Q03J28083o7013j76472j3341L0121n1715
18168C90380j8440j0602k9995j09961N7710P0279O3493L6156K568J100N8261m7307
18156D63642M5250j344j27090k5852n847o7593K1907N9910J31725m4587o7392
18145C82729P4042J06074Q9139l1270k9655J4234K4267J0212O7272J13755o2410
18134G58389O4253J41382l3027k4461j4501O7482R9952N8012J30731J63500K25606
18123A637318L84703K89612L36510K74275L84820N02498N89304P28897J001369
18114F129306J380674J934986K716940L898906N365065Q266336J4559482K6517886
18106G0769581M3275178L3031694j6276117k5234306j5060693j9846156k4025667
$$ plain form
18180 542331 605659 547049 482809 475732 539914 540717 668800 601787 425315 411974 442095 390380
18168 390380 371940 361338 331343 221382 279092 349371 412864 449020 451588 452688 510949 463642
18156 463642 508892 507548 380458 354606 348759 281166 303073 362983 494708 450121 382729
18145 382729 456771 562845 651984 620714 591059 605293 629560 639772 707044 820799 758389
18134 758389 822642 964024 930997 906536 892035 959517 1059469 1117481 1248212 1411712 1637318
18123 1637318 2022021 2311633 2648143 2922418 3307238 3809736 4399040 5127937 6129306
18114 6129306 7509980 9444966 12161906 16060812 21425877 29692213 44251695 70769581
18106 70769581 114044759 147076453 130800336 105566030 90505337 70659181 46633514
18099D6633514j6218943r426446n782862l630836k405421j651032j210248r39314
18091E368412n98137n65456m04345l97204m06439l14917k51589k81951j27472
18082B020902r1953q4831k28291k64951j58166j22206q1656p5180o993q6289j11567
18071G08819p0029r219P3253k7655p9351p7330o3944n8995K8023Q687p857L7555
18059D61957Q2172L2539J8046L6119o8130O3303Q659j6377l1614j7159P4696J03274
18047G47485N2701Q842J9578M5829J2821p8084r8441p2064J7444n1743r2871L1480
18035E42977J7906l8054L168N9287m4766k9528o9846m5814j02296k9333K0378
18024B84079k9769p1874j03431r5128Q1550J01466O8727O4170k4970P881l342
$$ plain form
18099 46633514 30414571 20988125 15205263 11574427 9169006 7517974 6307726 5368412
18091 5368412 4770275 4204819 3800474 3403270 2996831 2681914 2430325 2148374 2020902
18082 2020902 1928949 1844118 1615827 1350876 1192710 1070504 988848 913668 906675 820386 708819
18071 708819 638790 629571 702824 675169 595818 518488 454544 395549 423572 432259 424402 461957
18059 461957 544129 576668 594714 630833 562703 626006 634665 618288 586674 569515 644211 747485
18047 747485 800186 809028 828606 874435 887256 809172 710731 638667 656111 604368 511497 542977
18035 542977 560883 522829 525997 585284 540518 510990 441144 395330 293034 263701 284079
18024 284079 254310 182436 79005 -16123 65427 166893 235620 299790 274820 282701 279359
18013B79359o1589p3826n0204J00320L6372n5720M5537l7759J9026P4185k1678
18002B54023l5288l8745M5448j2603j2991m0753K1954O030o9406L4300R976m8256
17990A13689o0655L6145J7851j002P6930P9904j07021r094P9382J429p5316O9471
17978B21713P34K878j284j5604J6281l4733O5343J43108P6099K7025R143N1651
17966E62354N0572P2816J17152n5997k10731o1321k9056q7J6991J33215J38584
17955G34492k7323j19883r6255j05782j53609L5645J67156O6765k8801j04506
17945C67899m6601o9913l849k3943L6132R8686M6892q0092j35216J1096p195K6651
17933B20547M1140J5385P158l880j3543r823k4919j1538j08999K1408Q4114O0932
$$ plain form
18013 279359 217770 143944 93740 194060 230432 174712 220249 182490 201516 275701 254023
18002 254023 218735 179990 225438 212835 199844 159091 181045 187075 117669 151969 161945 113689
17990 113689 53034 89179 107030 106028 182958 262862 155841 146747 226129 227558 152242 221713
17978 221713 222447 225325 224041 208437 224718 189985 255328 398436 474535 501560 510703 562354
17966 562354 612926 685742 802894 746897 536166 474845 445789 445702 462693 595908 734492
17955 734492 707169 587286 491031 385249 231640 267285 434441 501206 472405 367899
17945 367899 321298 251385 247536 223593 259725 358411 405303 325211 189995 201091 193896 220547
17933 220547 261687 277072 284230 280350 266807 256984 232065 220527 111528 132936 217050 277982
17921B77982J32688J46633J15361M8667p8422J4533q659m556K5409j10096j02267
17910D57273p784n6823m9875o9984l5480O970l9604K8057Q9835J30458K07992
17899F61035L4213p1530Q581m4549o3237j13353j7404n5908j16932n4223j7432
17888A49261p712o6043J6196M0839K7838k2043k9912n6554l9503j3147M7425M7321
17876I3966m727m0167r1966L0832P2744J15882J7164m8832j5685o6836m4306k915
17864A5154j5209n1634L2223M7180K7203J2956K5j4641K0359l3274K3140L3738
17852I7220n912n8322J10727k9830q0675M6903L9649n5485k7519k9910n3953j6331
17840f3438K8107K7174Q878k1494M131L7916k0091j036l5533O4851n4218N1046
$$ plain form
17921 277982 410670 557303 672664 721331 642909 657442 648783 644227 669636 559540 457273
17910 457273 449489 392666 342791 272807 237327 244297 204693 232750 322585 453043 661035
17899 661035 695248 623718 632299 587750 524513 411160 393756 337848 220916 166693 149261
17888 149261 141549 75506 91702 132541 160379 138336 108424 51870 12367 -780 46645 93966
17876 93966 89239 49072 -42894 -12062 60682 176564 193728 144896 129211 62375 18069 15154
17864 15154 -55 -51689 -19466 27714 54917 67873 67898 53257 73616 40342 63482 97220
17852 97220 91308 32986 143713 113883 33208 80111 119760 64275 36756 6846 -47107 -63438
17840 -63438 -35331 -8157 721 -20773 -16642 21274 1183 147 -35386 29465 -24753 26293
17828B6293J63183n653j02033m8535J0066M0329j18150r9617L8629P298o945N6981
17816c8154K6000l8924Q3555K6996N2742P9780m4269k9151l3999j05097p8918
17805i9439J0133J08574r553n915N7931J5296L0078J2285j6130l2799K4613n9712
17793C5362m9046N2243l1493N6012l216m6393l9765o1019L9384N1621k0128R2977
17781G6539Q5005j10575n6229M7064l9323J622J6154j021j47222N047n9211J109
17769a81041Q5410J02662n4055j265M2844j826O6064J0790k0006R895m9358L1324
17757D1438o9596R216M9171o1029J9665N8930r477m3030n8568J7360O4551j2588
17745F043k772O7743J3869J8144q7449r2942o3914l4893k3662N4548M4744R89
$$ plain form
17828 26293 189476 183823 81790 33255 43321 83650 -34500 -134117 -95488 -88190 -95135 -38154
17816 -38154 -12154 -51078 32477 59473 112215 191995 147726 118575 84576 -20521 -99439
17805 -99439 -89306 19268 9715 3800 61731 77027 107105 119390 103260 70461 95074 35362
17793 35362 -13684 38559 7066 63078 59862 13469 -26296 -87315 -47931 3690 -16438 76539
17781 76539 161544 50969 -5260 41804 2481 4103 20257 19236 -127986 -122939 -182150 -181041
17769 -181041 -95631 7031 -47024 -48289 -5445 -7271 58793 69583 49577 59472 10114 41438
17757 41438 -28158 -18942 30229 -30800 -11135 47795 38318 -4712 -63280 -45920 18631 6043
17745 6043 3271 71014 84883 103027 15578 -77364 -141278 -176171 -199833 -145285 -100541 -99552
17733i9552m0000J23112Q8208L9571j20052r2717j816M4572K228J30897K8618
17722A03069k2555K1825L6987j02599p0359J18988L4131l7482k2111J4144N6191
17711A30229L55r3711K0772l4874q1566L1878K7465m0166N7486Q0845k4550r4256
17699b0093k1797K5858M1483l838k9276m8634j4013m3759L6313L8753m7908j12394
17687a99305l316P9253J3000O6996J24639L9139j00854l7785l2558M9346J6334
17676A4889j2329K5700j6956m4834m9194l2892n0786j2958r067N2981J41316R8498
17664A04368m904m4492M5562J6671l3300R721Q738p155m5946J1434o885l5480
17652A8332O055m8643P704l3184l472L4006Q0666N7694k0717n8651r7046q080
$$ plain form
17733 -99552 -139552 -16440 71768 111339 -8713 -101430 -103246 -58674 -56446 74451 103069
17722 103069 80514 102339 139326 36727 -33632 85356 119487 82005 59894 74038 130229
17711 130229 130584 36873 57645 22771 -58795 -26917 548 -39618 17868 98713 74163 -20093
17699 -20093 -41890 -16032 25451 21613 -7663 -56297 -70310 -114069 -77756 -39003 -86911 -199305
17687 -199305 -202621 -123368 -110368 -43372 81267 120406 19552 -18233 -50791 -1445 14889
17676 14889 2560 28260 11304 -33530 -82724 -115616 -166402 -179360 -188427 -135446 5870 104368
17664 104368 99464 54972 100534 117205 83905 93626 102364 95209 49263 60697 53812 18332
17652 18332 24387 -24256 -16552 -49736 -53208 -19202 61464 119158 98441 39790 -57256 -65336
17640f5336J0108L2636J01222l1580l0317k6511l1192j6362K8087J5776Q4610
17629G1141K7807L0662j8529n4173M2497K3749n5381j216n4970o1452K2886l459
17617c0438l6392m0879l4283R1185J34714M0287m5822k0251n9073L719K2281n7657
17605c2609k3156N5515N8194j1402J841J2855l5090L0608p750l5165o4073K9190
17593b1042j5834K0184J7645k187M311N8322M2333J5660o120r0482o5083Q0401
17581C8108K8497P503J1867n2032J7350j7264q8703M9070J1537k89M7114L9319
17569I2077j11683n4816L8437l2920o3121P2637N0115M3349O8585M5095j20982
17558B6773n5307l8145o8452M9924O7984J9152L679N0305k5705L5354q4203L9605
$$ plain form
17640 -65336 -55228 -22592 78630 47050 16733 -9778 -40970 -57332 -29245 -13469 71141
17629 71141 98948 129610 111081 56908 99405 123154 67773 66557 11587 -49865 -26979 -30438
17617 -30438 -66830 -107709 -141992 -50807 83907 124194 78372 58121 -952 2767 25048 -32609
17605 -32609 -55765 -250 57944 46542 48383 61238 26148 56756 49006 13841 -50232 -21042
17593 -21042 -36876 -16692 953 -1234 3077 61399 103732 119392 113272 22790 -42293 38108
17581 38108 66605 74108 85975 33943 51293 34029 -54674 -5604 5933 5644 52758 92077
17569 92077 -19606 -74422 -35985 -68905 -132026 -59389 -9274 34075 102660 147755 26773
17558 26773 -28534 -66679 -135131 -85207 -17223 1929 5608 55913 30208 65562 -18641 20964
17546B0964m1501m9157r760l3788L0861j6128L618O5256M992l8612J3051k832
17534e3036L1813K421j9214O7103m862q49j8989l2039o8038J8729K6268m1477
17522i2170M7084K6945n3000L126L1468n637l114Q2011J02175k66l0841n6138
17510E1643L7518J4112l158m8716j15817L7910N542P2959N2015j2508j6359m0533
17498C4608k0141k8137O4442jl8760J1314N5679N2554q9345r194P102K8974Q656
17485G7751j7141j1366M3325M0265R063K5789n1793k1395m3777j5906j9827p86
17473A4202L785K8318r042P053M033o9512n8666J8721J7674N3482R0041K7581
17461A27670M0557O3402m4379j8874L1619p8654m6942J6591k2444j20813n5160
$$ plain form
17546 20964 -20537 -69694 -79454 -113242 -82381 -98509 -94891 -29635 -24643 -63255 -50204 -53036
17534 -53036 -21223 -18802 -38016 29087 24225 23376 4387 -27652 -95690 -76961 -50693 -92170
17522 -92170 -45086 -18141 -71141 -68015 -36547 -42184 -45298 36713 138888 138622 107781 51643
17510 51643 89161 103273 100115 51399 -64418 -26508 -20966 51993 104008 91500 75141 34608
17498 34608 14467 -13670 50772 50771 12011 23325 79004 131558 42213 33019 40121 69095 77751
17485 77751 60610 49244 92569 132834 141897 167686 115893 94498 50721 34815 14988 14202
17473 14202 17987 46305 37263 44316 48349 -21163 -79829 -61108 -43434 10048 100089 127670
17461 127670 168227 231629 187250 168376 199995 121341 74399 90990 68546 -52267 -107427
17450a07427N5458J1207j9338L5544M7599J09613P8968J7540J04637J56810J19597
17439F10208J09610L0819j37818j29485j20426j52350n3295j1764O046j5296n9194
17428G7055o2770j4105J5239k7662p6977q8169K1967P4488L7729j2327O7734k6670
17416a4468j2599r972K2209k1513j26697k2341Q5553J27030Q3902k2094l9784
17405D9226j2485m0834n3865M5449R8780M605m4726K5988m931l2391K6866J7749
17393G9431K0961K5894p19k7308m3762m1721l9755k4197M1521M6583K3940j9538
17381D1330o039k370O2281O2555k9695n5998j13082q5109l3019Q3909J22909p8169
17369c0497j24900N5799J61993P330p1044p0461K8626j0829n925m684L95kJ1891
$$ plain form
17450 -107427 -51969 -40762 -60100 -24556 23043 132656 211624 229164 333801 490611 610208
17439 610208 719818 750637 612819 483334 362908 210558 157263 145499 151545 136249 77055
17428 77055 14285 180 15419 -12243 -89220 -177389 -155422 -80934 -43205 -55532 12202 -14468
17416 -14468 -27067 -37039 -14830 -36343 -163040 -185381 -99828 27202 111104 89010 49226
17405 49226 36741 -4093 -57958 -12509 86271 90876 46150 72138 67207 34816 61682 79431
17393 79431 100392 126286 125567 98259 54497 12776 -26979 -51176 -9655 36928 60868 41330
17381 41330 35291 32921 95202 157757 128062 72064 -41018 -126127 -159146 -75237 47672 -30497
17369 -30497 -155397 -99598 62395 69725 -1319 -71780 -43154 -53983 -59908 -64592 -64197 -64199 -52308
17356e2308R5944M0144m3729J5196M0592n1210m7292K6238J3396j2645p1664O569
17344d0769l0502j24218o0463J59968J32480L0292j171J4137k1397K3299R0987
17333A72643L2585p6053o7665N094k0753j7385M746L4614J0080o372k1204m9937
17321C93N3966K5888r905o5200L500M5808k1626j16471N756O0691O0291P2012
17309A15103l4609l1701p485l8378K9236N9610n105K788L3404n4978l6652o0196
17297b8963M1427l1588J4090n5302o3301N3295P0916Q8308J878j19851L3201M4495
17285D8605m5748p375M7972m1385J760j8669o0534R5347R2654P5201n5243p1969
17273F0616J2808l183n6144J5353l0752q8030q145k0575K6070L8040j5945j2203
$$ plain form
17356 -52308 43636 83780 40051 55247 95839 44629 -2663 23575 36971 24326 -47338 -40769
17344 -40769 -71271 -195489 -255952 -95984 36496 66788 65617 79754 58357 81656 172643
17333 172643 205228 129175 61510 66604 45851 28466 33212 67826 77906 71534 50330 393
17321 393 54359 80247 70342 5142 8642 54450 32824 -83647 -77891 -17200 43091 115103
17309 115103 80494 48793 41308 2930 32166 91776 86671 89459 122863 67885 31233 -28963
17297 -28963 12464 -19124 -5034 -60336 -123637 -70342 574 88882 90760 -29091 4110 48605
17285 48605 2857 -4518 43454 2069 3829 -14840 -75374 19973 112627 187828 132585 60616
17273 60616 73424 70241 14097 29450 -1302 -89332 -97477 -118052 -91982 -53942 -69887 -82090
17261h2090O5887m352O0524K2625m6527k2419N6871n281p6037j28660P1491J1038
17249g6930K8399J5444J9456o0178k7243J23526j09010k8811p606N5560J24732
17238E7339N147j14686o8625o1304j0698R8934K6350R95j2685P0665k450p1103
17226h2121K5368J3713L275j5282Q160O6222n4916q670m6057j394r824L3346J4261
17213e3919N2766Q780k8262m899l3579K6833K9107M7311N920r8675j4762M8051
17201a5328N0009o4011K603N4528p543M6668R143M9988N6801r1270m8453J2889
17189E6024k0966q3373k8220l6180J8358O4554o816n408O4060P803q1560l8496
17177i0220M942p5594k2619K5664Q584P3574Q9387Q5154P560q2158k6613m4162
$$ plain form
17261 -82090 -16203 -20555 39969 62594 16067 -6352 50519 45238 -30799 -159459 -87968 -76930
17249 -76930 -48531 -33087 -13631 -73809 -101052 22474 -86536 -115347 -122953 -67393 57339
17238 57339 62486 -52200 -120825 -182129 -192827 -93893 -67543 -66548 -79233 -8568 -11018 -82121
17226 -82121 -56753 -43040 -39765 -55047 -46887 19335 -35581 -44251 -90308 -91702 -101526 -68180 -53919
17213 -53919 -1153 7627 -20635 -25534 -59113 -32280 -3173 44138 50058 -48617 -63379 -15328
17201 -15328 34681 -29330 -26727 27801 20258 66926 76069 126057 182858 91588 43135 56024
17189 56024 35058 -48315 -76535 -112715 -94357 -29803 -36619 -42027 22033 29836 -51724 -90220
17177 -90220 -85278 -160872 -183491 -157827 -149243 -75669 13718 98872 106432 24274 -2339 -46501
17165d6501O887N9090K5342k6021k2081n0901O9864K8204n0488l0785q270L9038
17153f622l1395o6466K567N2402J0458j7442Q4840J7822M7606q5173p2655M8974
17141a5084P412p6119k9143O1586J39997Q2617k2189j33050k0618M0108J2378
17130D7895m3514J06380N6325p5363j19923o0600N3758K7427k9830N7195L9630
17119E9380N486l1582q4728P5376M9002l257j5871k9174o8341L9147M2034l5037
17107B435k0992M2495J649l1458p5413p1538p68M6709k5769k7376k4308J2998
17095a71336J7068J40388N0702l6786o5915q4580l0152j0154L4973J5184N225
17084a35383n6891k3312N9861N9054L6541R1222k4878K91K0121O0530N7761o3760
$$ plain form
17165 -46501 -39614 19476 44818 18797 -3284 -54185 15679 43883 -6605 -37390 -45660 -6622
17153 -6622 -38017 -104483 -101916 -49514 -39056 -56498 28342 46164 93770 8597 -64058 -15084
17141 -15084 -7672 -83791 -112934 -51348 88649 171266 149077 16027 -4591 35517 47895
17130 47895 4381 110761 167086 91723 -28200 -88800 -35042 -7615 -37445 19750 59380
17119 59380 64866 33284 -51444 23932 72934 69677 53806 24632 -43709 -4562 37472 2435
17107 2435 -18557 23938 25587 -5871 -81284 -152822 -153590 -106881 -132650 -160026 -184334 -171336
17095 -171336 -154268 -13880 36822 36 -65879 -150459 -180611 -190765 -155792 -140608 -135383
17084 -135383 -192274 -215586 -155725 -96671 -60130 31092 6214 6505 26626 87156 144917 81157
17072H1157q5606n1394o8153K497M1890L6545p7454k278J06646J01364M4687p4005
17060E5896r4295M4530k409m0812r677p491N0899R764n5292K0984K188n839n4148
17047h5702Q034K3678O614m7198r3243L1921M6570N2405n3599k1028O7365M2127
17035b2056N3199K3035r0508m2686M8440M915M1217L4735p3177n4004O9225P7487
17023F9822p4483l5370M9767P6107p3483k8545M9122l7541m5386l2481o774l1287
17011a20532M0320K4747M0075k9418n6337l1364n7609R1749P7357j3526L4540
17000Bo6539o3910J2934J06432J7069M39P0445R1082n596n2948r6268l1952J4080
16987d730N8473q4603m3421n7479o909O5635k2906m2126O9053K3073L8197j145
$$ plain form
17072 81157 -4449 -55843 -123996 -121499 -79609 -43064 -120518 -122796 -16150 85214 129901 55896
17060 55896 -38399 6131 3722 -37090 -46767 -54258 -3359 6405 -48887 -27903 -25715 -31554 -85702
17047 -85702 -77668 -53990 -47376 -94574 -187817 -155896 -109326 -56921 -110520 -131548 -64183 -22056
17035 -22056 31143 54178 -36330 -79016 -30576 -25661 15556 50291 -22886 -76890 -7665 69822
17023 69822 -4661 -40031 9736 85843 12360 -16185 32937 -4604 -49990 -82471 -89245 -120532
17011 -120532 -80212 -55465 -15390 -44808 -101145 -132509 -190118 -98369 -21012 -34538 2
17000 2 -66537 -130447 -117513 -11081 5988 6427 76872 167954 162358 109410 13142 -18810 -4730
16987 -4730 53743 -30860 -74281 -131760 -138669 -73034 -95940 -138066 -69013 -45940 -7743 -8888
16975h888K4670K5746k6213j2917m1134j00970L6245P8804j9450l3089l3984m068
16963a15248j1351K0295P6982M0018K3379j1791m8630n7987p4675L743q800L8122
16951a25943L3745N1490j9456o2387J03837R2276R378j6423m8429Q362N8905J3393
16939I8748k487q0062l2144J6895M7056k9702j9898m0908n1048R3986l946j8982
16927b2492m0529p5620l6754M5319J7379J1000Q6376J06181M2713l5310o5975
16916C2288l8862l9210j8034O880M8379j9701K5221k5570k9797Q1516Q3587m1798
16904F4899j1998j3393n6962n199k7717Q992L8263k0782p3404j9647L5441O1796
16892a9711N8550n1043o6909m3769K2265r1201m3403P9316M7028N207M438N7636
$$ plain form
16975 -8888 15782 41528 15315 2398 -38736 -139706 -103461 -24657 -44107 -77196 -111180 -115248
16963 -115248 -126599 -106304 -29322 10696 34075 22284 -26346 -84333 -159008 -155265 -164065 -125943
16951 -125943 -92198 -40708 -60164 -122551 -18714 73562 82940 66517 18088 26450 85355 98748
16939 98748 96261 16199 -15945 950 48006 18304 -1594 -42502 -93550 436 -3510 -22492
16927 -22492 -63021 -138641 -175395 -130076 -112697 -101697 -15321 90860 133573 98263 32288
16916 32288 -6574 -45784 -63818 -56938 -8559 -28260 -3039 -28609 -58406 23110 106697 64899
16904 64899 52901 39508 -17454 -22653 -50370 -41378 -3115 -23897 -97301 -116948 -81507 -19711
16892 -19711 38839 -12204 -79113 -122882 -100617 -191818 -235221 -155905 -108877 -103670 -99232 -41596
16880d1596J4375k8325R0448J17959k5047j91141p7251J7654J13253K2265p2931
16869f0337q0400O791J2238J2624J8764l1425L6824P3820J531M0864j33459l5377
16857a37542J52873N7195l6616p9660j21533p28O1598N2128J4199J3671l25o8027
16845i2767n6043N5386l469O817J7541m0333q612P208M0969Q0330O2718N5567
16833A25312o5485n1729m5255K0261J25608Q3349m7491j2425r375L6582m0474
16822A18878j06939p094Q9104K0718m4797k5206P4004M7275p8035l7486k6505
16811B3917o884m8651k4659J0180N5790k552O377l9188R8802l1228j02211L8721
16799b1586N9008K107J5970j3798L86L714j7017m8248j1156j4910q362l9781R00
$$ plain form
16880 -41596 -27221 -55546 34902 152861 127814 -63327 -140578 -122924 -9671 12594 -60337
16869 -60337 -140737 -133946 -121708 -109084 -90320 -121745 -84921 -11101 -9570 31294 -102165 -137542
16857 -137542 15331 72526 35910 -43750 -165283 -166011 -104413 -52285 -38086 -24415 -24740 -92767
16845 -92767 -148810 -93424 -96893 -90076 -72535 -112868 -121480 -114272 -73303 7027 69745 125312
16833 125312 59827 8098 -37157 -16896 108712 192061 144570 132145 122770 159352 118878
16822 118878 11939 4845 93949 114667 69870 44664 118668 165943 87908 50422 23917
16811 23917 17033 -31618 -56277 -46097 9693 7141 13518 -25670 73132 41904 -60307 -21586
16799 -21586 37422 39529 55499 41701 42087 45801 28784 -19464 -30620 -45530 -53892 -93673 -92773
16786i2773n0790P2642R0621p142j5875m4249R5915J05484k8635o275j25172l5498
16774d1747j3389N6512L6528k1876M998O718M0786K7125R140N2007j3191n1009
16762I2602l6880l9837l8792m1788J560k7521O32O4021j7422L6783L1389r117
16750A5630J31j9902K3625M4031l0966q0014J0568K1892m0660J815M9279p3714
16738g8285m6080M0004Q7737O5131M571p291L1900k9302j14954k3450K4714P0777
16726B5472m1401p4775n7929J25347N4354m5131n0005L603K1105l2700j3688N8032
16714b7716Q9718J5302j7707J496n6564l1548N2494q457n763q0766l2237P4694
16702b7054O2844l5130L702n7402j3216K4249l0201r964j3607M227K3342L9712
$$ plain form
16786 -92773 -143563 -70921 19700 12558 -3317 -47566 48349 153833 125198 118923 -6249 -41747
16774 -41747 -55136 1376 37904 16028 21026 27744 68530 95655 104795 156802 143611 92602
16762 92602 55722 15885 -22907 -64695 -63135 -90656 -90024 -26003 -43425 -6642 24747 15630
16750 15630 15761 -4141 19484 63515 32549 -47465 -36897 -15005 -55665 -53850 -4571 -78285
16738 -78285 -124365 -84361 3376 68507 73078 65787 97687 68385 -46569 -70019 -45305 25472
16726 25472 -15929 -90704 -148633 -23286 31068 -14063 -64068 -60465 -39360 -72060 -85748 -27716
16714 -27716 62002 77304 59597 61093 4529 -27019 25475 17018 11255 -69511 -101748 -27054
16702 -27054 35790 660 4362 -53040 -66256 -42007 -72208 -82172 -95779 -91552 -68210 -28498
16690b8498P2772k9552M490r1770k8959J8192J51450P4259m1850q7828r9220O08
16678h5906P2830P2510L24k5072R8125L6493j25473n3066K4023K3790j840j01379
16666f4641j5188m2537k6400K7449k3625N2959O4272M0628P079l9093L6560j17160
16654i9697k4276K5198j6145N845r8293p151L0360J8969L5263j0312K2956N1453
16642f5830L1760K9373m1439k6903j0799j8112k1473J7021K8202l2965m2512J2623
16630a41054k0966N3293N9845M1705K9987k2329l2612j16122m8460L886M3984
16619a48843l4259m9978R0793N2569P374K4397l8951K4301M0405J544n3450j3663
16607i7761k5335k2875N4632P2945J2683M6084J1685k4364L3876L0859Q259n3932
$$ plain form
16690 -28498 44274 14722 19212 -72558 -101517 -83325 68125 142384 100534 12706 -86514 -85906
16678 -85906 -13076 59434 59758 34686 132811 169304 43831 -9235 14788 38578 36738 -64641
16666 -64641 -79829 -122366 -148766 -121317 -144942 -91983 -27711 12917 19996 -19097 17463 -99697
16654 -99697 -123973 -98775 -114920 -109075 -207368 -214519 -184159 -165190 -129927 -140239 -117283 -65830
16642 -65830 -34070 -4697 -46136 -73039 -83838 -101950 -123423 -106402 -78200 -111165 -153677 -141054
16630 -141054 -162020 -108727 -48882 -7177 22810 481 -32131 -148253 -196713 -192827 -148843
16619 -148843 -183102 -233080 -142287 -89718 -82344 -57947 -96898 -72597 -32192 -30648 -84098 -97761
16607 -97761 -123096 -145971 -91339 -18394 -5711 40373 52058 27694 61570 92429 100688 46756
16595D6756m9442m9169M0916l491L0L1626j6837L7394J6560n7508j5999n184k074
16582b6422L9162Q3835J2709o2818l5656Q621j8065M7274L2762l1366l3105o5048
16570d8117k8092L5371m1993K7450K5869J3940K1954Q402J7679p2265J2282j8998
16558d6518L0063l0931J9363l1259m5238k0142j5061M9701P6755L2774Q127j2988
16546A4646O6900k7691l9535k0168k8443M8277k0532L0620k5880o3121k7494L1889
16534f0532M1751J9761l5979N825n2535P648Q9769Q5687q8206p1190K4166k8251
16522f2086j1969O4436L5662J8832q1013j8545K2272O0747L0169k4960l0163J4373
16510A7755K832k1410k9543J3744j6328M2969N8882J616K9883Q5148o5218o8262
$$ plain form
16595 46756 -2686 -51855 -10939 -14430 -14400 17226 389 37783 54343 -3165 -19164 -24348 -26422
16582 -26422 12740 96575 109284 46466 10810 19431 1366 48640 81402 50036 16931 -48117
16570 -48117 -76209 -40838 -82831 -55381 -29512 -15572 6382 14784 32463 -39802 -27520 -46518
16558 -46518 -16455 -47386 -28023 -59282 -104520 -124662 -139723 -90022 -13267 19507 27634 14646
16546 14646 81546 53855 14320 -5848 -34291 13986 -6546 24074 -1806 -64927 -92421 -60532
16534 -60532 -18781 980 -34999 -29174 -81709 -74061 15708 101395 13189 -58001 -33835 -62086
16522 -62086 -74055 -9619 26043 44875 -36138 -54683 -32411 28336 58505 33545 3382 17755
16510 17755 20587 -823 -30366 -16622 -32950 10019 68901 70517 100400 185548 120330 52068
16498E2068o8865M7949J5331m2419o9000l8346q197R737K625N3877K6566J3343
16486e331Q9818n9938m4975m3617l952M0246o3925N632K9227N0722M3944n1856
16474a4005k2237m2674O2241M8895M743j7868n2871m5610M3053L980n1757j7472
16462a01582R515o0771l5772M0442J16056J20305j0267L6966k0738p3557o1624
16451d1027K9165r163n3311l5688j457L8470Q3675M4475K3188P650n1137l6232
16439a392R2192o29m3820m2686k7400L9737m0116o0781j23323l8993R1612J19275
16427c6324O8164n5592l5988N5356M399k5985N8089o2185o0417k9749N3522P998
16415e8712k5575M0551O1637M7195K3397p2034k5598J18292n509j07605l526K3837
$$ plain form
16498 52068 -16797 31152 46483 4064 -64936 -103282 -111479 -101742 -99117 -45240 -18674 -5331
16486 -5331 84487 24549 -20426 -64043 -67995 -27749 -91674 -86042 -56815 -6093 37851 -14005
16474 -14005 -36242 -78916 -16675 32220 36963 19095 -33776 -79386 -36333 -32353 -84110 -101582
16462 -101582 -92067 -152838 -188610 -148168 -32112 88193 77926 114892 94154 20597 -41027
16451 -41027 -11862 -21025 -74336 -110024 -111481 -73011 10664 55139 78327 85977 34840 -1392
16439 -1392 90800 90171 46351 3665 -23735 16002 -24114 -84895 -208218 -247211 -155599 -36324
16427 -36324 31840 -23752 -59740 -4384 15 -25970 32119 -30066 -90483 -120232 -66710 -58712
16415 -58712 -84287 -43736 17901 65096 88493 16459 -9139 109153 103644 -3961 -7487 16350
16403A6350l553j8996l0769l9266P4476P8312r9688K6706J656n6132K4102K9516
16391B714L3100j0842l9107n2573L0155L3815J4262q7970m189M1818O1505k5996
16379c308n986J8567O243M7738o652r886l825K5353J013j09221j54213R7733J07127
16366A0683L9690j21078J6139Q3397K9763R476q9058j19716M9193R0551K2310
16355B1350Q117K7054K2728k1161m3773N3695N1150n3396j5636j2961P1818K9322
16343A38307n8271l3161M9625K5061o4069N314L8844q4770l2941J2635n0519Q1441
16331B7496M1994m5991n3929P530J09372q4642r4446j0967l333J02547j2164l9220
16319e5753R863K7781q633j1732O125N6559K9715J8263M6277m7348J3811p2311
$$ plain form
16403 16350 12797 -6199 -36968 -76234 -1758 76554 -23134 3572 5228 -50904 -26802 2714
16391 2714 35814 24972 -14135 -66708 -36553 -2738 11524 -76446 -80635 -38817 22688 -3308
16379 -3308 -9294 9273 15516 63254 56602 46716 42891 68244 69257 -39964 -194177 -96444 10683
16366 10683 50373 -70705 -54566 28831 58594 68070 -20988 -140704 -91511 -960 21350
16355 21350 29467 56521 79249 58088 14315 68010 119160 65764 50128 37167 108985 138307
16343 138307 80036 46875 96500 121561 57492 62806 101650 16880 -16061 -3426 -53945 27496
16331 27496 69490 23499 -30430 -22900 86472 1830 -92616 -103583 -106916 -4369 -16533 -55753
16319 -55753 -45890 -18109 -26742 -38474 -32349 24210 53925 72188 118465 71117 84928 12617
16307A2617N2583P2774k9398L8585O614q0896j1712K6750m2500M5640p1569r5085
16295g5597k5481j6927k0035m70o4539Q5086N5511J8806J00748K9656R653k2327
16283G4084n5889k1058K2372q5252j00415R0000J13625l368j05110k0481L959
16272h7533M900P1768P057m133n0589j23541k9012L0142L1242P1198J9795P5715
16260A7009p2475n8476O2093N7202k4296L7121K5636k7439m604o862L8440R0331
16248A33680q231K4161j2623n3291K4725o3211M4971J8366k9346J594K4205o9450
16236C5550k9851J7700M3032n2957q2779j7654J20647J2465L50m0288j1967L2311
16224B6559L5191N6865J3446k2916k3864j12569k5862K3045Q3122l9634q8586
$$ plain form
16307 12617 65200 137974 108576 147161 153775 72879 61167 87917 45417 91057 19488 -75597
16295 -75597 -101078 -118005 -138040 -138510 -203049 -117963 -62452 -43646 57102 86758 96411 74084
16283 74084 18195 -2863 19509 -65743 -166158 -76158 37467 34099 -71011 -91492 -87533
16272 -87533 -82633 -10865 -3808 -7941 -58530 -182071 -211083 -180941 -149699 -78501 -58706 17009
16260 17009 -55466 -113942 -51849 5353 -18943 18178 43814 16375 11771 4909 43349 133680
16248 133680 125449 149610 136987 83696 108421 45210 90181 108547 79201 80795 105000 35550
16236 35550 5699 23399 66431 13474 -69305 -86959 33688 46153 46503 6215 -5752 26559
16224 26559 61750 118615 132061 109145 85281 -27288 -53150 -30105 53017 13383 -75203
16213g5203n5993L3519q8696J2628j2192N178l4874j4859O4974N7895L1702M2569
16201c3352L7429q837o64M58j0923M117R075Q471n5746M712M4749l5137o3997
16188i9645N137M8413o9395M0398P9606J9614k7086j5714j9241N4098P5775K8703
16176A20663l9274L8776k7642m6790n1086L8704J3397j25474o8185M6305L8896
16165f1710l1356n6342J4781R1764N5485p5342l9028P2407J00605j1092q5674
16154b5502m509J662k5347p327L8444O8102k3859n9304j5034M9333j3692K0131
16142C098J02472R575o6763m586J7726j0805n143l3792q5850p580O9035L2162
16130A9549N1676N9236L6092n1272p958l4666n1580P950K9483M0507m6407K2032
$$ plain form
16213 -75203 -131196 -97677 -186373 -173745 -185937 -180759 -215633 -230492 -165518 -107623 -75921 -33352
16201 -33352 4077 -4760 -5424 -4966 -15889 -11772 -2697 5774 -49972 -45260 -511 -35648 -99645
16188 -99645 -94508 -46095 -115490 -75092 4514 24128 -2958 -18672 -37913 16185 91960 120663
16176 120663 81389 120165 92523 45733 -5353 33351 46748 -78726 -146911 -100606 -61710
16165 -61710 -93066 -149408 -134627 -42863 12622 -62720 -101748 -29341 71264 60172 -25502
16154 -25502 -30011 -28349 -53696 -61023 -22579 45523 21664 -37640 -52674 -3341 -17033 3098
16142 3098 105570 115145 48382 43796 61522 50717 45574 11782 -74068 -81648 -12613 19549
16130 19549 71225 130461 166553 115281 107323 72657 21077 29027 58510 99017 52610 74642
16118G4642J4647J1431o7030k2133k3050N088r243r8695K0911R5269p025J8041
16106A2853N4195J2148L9141j35141p82Q4108j13805l660O0459Q3333k3643j23178
16094e3972l219J07335J6076K9502o446J01116k0258q5519j3615J9453p7007l2792
16082a9346L1639j730O5878k0807L8391l5119j6688j3322m8153k1526J7498j0816
16070c4101R3502Q106q7085j1610p9956o3736Q8673P1433o1406l481j835M203
16058g7293J6250k988o0429M1951J9085L0587o935J302m3036k1078M7159J3216
16046d2209N5396J08045n393j0928M2111L6105K7549o2574r0537k4208Q0401K4740
16034A38498M6070q0502j26381k7452J70Q7848Q292m1402n9593j271L1483N6164
$$ plain form
16118 74642 89289 100720 33690 11557 -11493 -6405 -15648 -114343 -93432 1837 -5188 12853
16106 12853 67048 79196 118337 -16804 -17586 66522 -47283 -50943 9516 92849 69206 -53972
16094 -53972 -57191 50144 66220 95722 89276 190392 170134 84615 71000 90453 13446 -19346
16082 -19346 12293 10563 76441 55634 94025 58906 42218 28896 -19257 -40783 -23285 -34101
16070 -34101 59401 67507 -19578 -31188 -111144 -174880 -86207 -14774 -76180 -79661 -81496 -77293
16058 -77293 -61043 -64031 -124460 -82509 -63424 -32837 -39772 -38470 -81506 -102584 -55425 -42209
16046 -42209 13187 121232 115839 104911 147022 183127 210676 148102 57565 33357 113758 138498
16034 138498 184568 104066 -22315 -49767 -49597 38251 46543 5141 -54452 -55723 -24240 31924
16022C1924K5959l1090m4413K0923m2120R4806O9828l8030n8214l1086J4880K6645
16010D0012j3059K861K5229o8463k9177j2162k1949N2175O3688l9809k8981J0301
15998a9334O005m2570L654j15407o9430N7494J21378N9869J7768l4337j00069
15987a14979k0961l9445r294k045K7727R520P3969M2264J03585K7957J1186j0937
15975I8547n4227K7735q1276j54189J2061J67106P8409n9148M3387q521m5248
15964B4636J3025l18P09J6838p9714J797N574L3722L9779m1293p6697J3885r3351
15951a41408l3602K7676K2277m6201n7582m1556K6574Q9902J50882N1030Q382
15940E6374r545l3317J18j0081j2756o38P9735J13023L3282r2789q2824j9160
$$ plain form
16022 31924 57883 26793 -17620 3303 -38817 55989 125817 87787 29573 -1513 13367 40012
16010 40012 26953 29814 55043 -13420 -42597 -54759 -76708 -24533 39155 -654 -29635 -19334
15998 -19334 -13329 -55899 -52245 -167652 -237082 -179588 -58210 1659 19427 -14910 -114979
15987 -114979 -135940 -175385 -184679 -186724 -158997 -149477 -75508 -33244 70341 98298 109484 98547
15975 98547 44320 72055 -9221 -163410 -151349 15757 94166 35018 78405 69884 24636
15964 24636 37661 37343 38052 54890 -24824 -23027 -17453 16269 56048 14755 -61942 -48057 -141408
15951 -141408 -175010 -147334 -125057 -171258 -228840 -270396 -243822 -153920 -3038 47992 56374
15940 56374 46829 13512 13630 3549 -9207 -9845 69890 182913 216195 123406 40582 21422
15928B1422L8108j1241p1685k4852J4732M0924L0812n6914P5670L9627n1875Q871
15916E3599n0652l2708n7828M8767N5295j20139n5384Q4323J33751R7126k066
15905A54084k0075r3269p8406M009J0105L5998q2968P426J1780j8918n0251O419
15893a14066J1542o588P4471J29186N0232l8453K7545l1647j02740l8167n1750
15882i0435k0599L1826M7176L7913j9998P6811p4692k5416R835k6695n218j0955
15870g0447L5000o4879l3461O1210N8832k7339o991J1459p011m9898j0762K9902
15858g4385M8406P6791Q5552j21421p1324M0012j8046k8054P0164O3733J139m0029
15846C2538j8920k2570j1388L1226o044n227L215R0011m4279K7207L9800p2657
$$ plain form
15928 21422 59530 48289 -23396 -48248 -33516 7408 38220 -18694 56976 96603 44728 53599
15916 53599 2947 -29761 -87589 -38822 16473 -103666 -159050 -74727 59024 156150 154084
15905 154084 134009 40740 -37666 -33657 -23552 12446 -70522 -63096 -51316 -70234 -120485 -114066
15893 -114066 -102524 -109112 -34641 94545 144777 106324 133869 102222 -518 -38685 -90435
15882 -90435 -111034 -79208 -32032 5881 -14117 62694 -11998 -37414 -27579 -54274 -59492 -70447
15870 -70447 -35447 -100326 -133787 -72577 -13745 -41084 -48075 -36616 -43627 -93525 -104287 -74385
15858 -74385 -25979 50812 136364 14943 -56381 -16369 -34415 -62469 7695 71428 72567 32538
15846 32538 13618 -8952 -20340 10886 4842 -385 2830 92841 48562 75769 115569 42912
15834D2912j5348k0499r7022K0245j08513q4245L8729Q4005R6020M9272l327j6353
15822a4124J06685L6759r9530o4718j6757k1190R975R9395P7330k0515m7224k0517
15810B5569o1504r373K2222J02690N0230O4679k2372j9801l0572k1508n961o851
15798H7448r507l055j21013r6901M7823P4745K9243l0708r565l1087j8029R8057
15786A7451k723p0322n9477j0847L1437J7805J4082k8643J9601J5397m3981n545
15774a05765J4303P1968N8296K6494J4462m9959n4485p3756m0778J4886l5359
15763a59693J2254Q8753J8953l4901q0973L6119Q434n0586M0198P1636l7777l3745
15751a21328N418Q2812K134k3091K41L3453j1686J3751k5790l5576O2240k2571
$$ plain form
15834 42912 27564 7065 -89957 -69712 -178225 -262470 -223741 -139736 -43716 5556 2229 -14124
15822 -14124 92561 129320 29790 -34928 -51685 -72875 -62900 36495 113825 93310 46086 25569
15810 25569 -35935 -45308 -23086 79604 129834 194513 172141 152340 121768 100260 94299 87448
15798 87448 77941 74886 -46127 -143028 -95205 -20460 8783 -21925 -31490 -62577 -80606 17451
15786 17451 14728 -55594 -115071 -125918 -94481 -76676 -62594 -91237 -71636 -56239 -100220 -105765
15774 -105765 -91462 -19494 38802 65296 79758 29799 -24686 -98442 -139220 -124334 -159693
15763 -159693 -147439 -58686 -39733 -74634 -155607 -119488 -111054 -161640 -121442 -49806 -87583 -121328
15751 -121328 -115910 -33098 -30964 -54055 -53814 -20361 -32047 -18296 -44086 -79662 -17422 -39993
15739c9993p0335k3887M0191J16678j6687k5487p348j15860O1990Q3060K1843
15728B4165N1339J6232K8742j3451j6729l8404j20904n3834M8506J7727P395P9599
15716C0383J70116j4905j20442l8093j5239m0174l9367n1337Q2113M7331L3904
15705D4290j5459q9531M3465J19860L1867l5748r4233n8459M7755m483l8128M0913
15693g891R3052N3999q0270k0511O1964l3013l692m9503L4030Q1547O808m9048
15681H7472o7795n7623J5788J2254p205o835M087K1595l4822p4861m073P421n1333
15668a55930Q6507J18753N1339L8841m2388m2356l5360L6433J8067o010K3549
15657I1445q6998j8865m3264q615R7715J1796j4869k3504j2296P3345r674o7386
$$ plain form
15739 -39993 -110328 -134215 -94024 22654 5967 -19520 -26868 -142728 -80738 2322 24165
15728 24165 75504 91736 120478 107027 90298 51894 -69010 -122844 -74338 -56611 -49216 30383
15716 30383 200499 185594 65152 27059 11820 -28354 -67721 -119058 -36945 10386 44290
15705 44290 28831 -60700 -17235 102625 134492 98744 4511 -53948 -6193 -10676 -48804 -7891
15693 -7891 85161 139160 58890 38379 100343 67330 63638 14135 48165 129712 136520 87472
15681 87472 19677 -37946 -22158 -9904 -17109 -23944 -19857 1738 -33084 -107945 -112018 -104597 -155930
15668 -155930 -69423 49330 100669 139510 97122 54766 19406 55839 73906 67896 91445
15657 91445 4447 -14418 -57682 -66297 31418 43214 28345 4841 -7455 65890 56216 -11170
15645a1170J8012o2060L3940M7392r105j02588m6546O0006O6189P791n1021J9190
15633b9970q120p0384L7303N3180J0861N0309K1172k6366n4084j497N1629J9126
15621E3159j5545N394k1976j5617j6976j2272r7592N1508q746n9615Q8108P3548
15609B3378k9682N6004l1677q5909K5133r881J9441j5028M4876k6684j965k001
15597c3995P2880N4764p5375l9596k6510J5046P4679O3090n0827r577J9471k3666
15585D0384J2922j2389K402j6871L5643L0774J0297j8206o8153l8553M7356k2184
15573C422l7684o5046j8568j916n096J24847M7868l1921k6498Q1436j5247M0127
15561I5724M4284l0013k6614j20840k733L5317N5916k5368L778R468O5882Q8813
$$ plain form
15645 -11170 6842 -55218 -21278 26114 17009 -85579 -132125 -72119 -5930 1861 -49160 -29970
15633 -29970 -38090 -108474 -71171 -17991 -7130 43179 64351 37985 -16099 -17596 34033 53159
15621 53159 37614 43008 21032 5415 -11561 -23833 -121425 -69917 -78663 -138278 -50170 23378
15609 23378 -6304 49700 18023 -67886 -42753 -52634 -33193 -48221 -3345 -30029 -31994 -33995
15597 -33995 38885 93649 18274 -21322 -47832 -32786 41893 104983 54156 44579 64050 40384
15585 40384 53306 40917 43319 26448 62091 92865 103162 84956 16803 -21750 25606 3422
15573 3422 -34262 -99308 -117876 -119792 -124888 -41 47827 15906 -10592 70844 55597 95724
15561 95724 140008 109995 83381 -37459 -40192 -4875 51041 25673 29451 38919 104801 193614
15549A93614p6195q1338r0296N1828j9059j02460N9459K1353M5N0854j6443n8573
15537f7211l0232j0764O8827Q6551J28835j28573r0903r7027o8545M1845P0283
15526i6914L5712L9599J6929n8401J02812O3205J8660p7208l4653K1594p9069
15515d7734R419L4822k2423q2183L2455Q8002k5526K8309K1268o5494n597K5802
15503h880O7534Q5572r659l3271p6329m1807l879k2436M7656J25705K1148k2993
15491A28361q642n8169k2006n8999j1419n5466p964P5427P7794M102k1271r4890
15479e3142l509Q0522j4321o0282O8056J7983j37927p9402J9605M7630J0958J3042
15467i0787R4230j859j12416J2506J19166m2131q9701L6609J9096N781L9106m6814
$$ plain form
15549 193614 117419 36081 -54215 -2387 -21446 -123906 -64447 -43094 -43049 7805 -8638 -67211
15537 -67211 -97443 -108207 -39380 47171 176006 47433 -43470 -140497 -209042 -167197 -96914
15526 -96914 -61202 -21603 -4674 -63075 39737 102942 121602 44394 9741 31335 -47734
15515 -47734 -38315 -3493 -25916 -108099 -75644 12358 -13168 15141 36409 -29085 -34682 -8880
15503 -8880 58654 144226 134567 101296 24967 -16840 -20719 -43155 4501 130206 151354 128361
15491 128361 119719 61550 39544 -19455 -30874 -86340 -94304 -18877 58917 63019 41748 -53142
15479 -53142 -56651 23871 9550 -50732 17324 35307 -102620 -182022 -162417 -114787 -103829 -90787
15467 -90787 3443 1584 -110832 -98326 20840 -21291 -110992 -74383 -55287 -49506 -10400 -57214
15455e7214p5809p4337K4786Q5083L1125K1685K8386n898j0412l6269L7657O6069
15443C4852L653j8029N4619R0804P2294l1854j17777r1057L1811L7236q0537r6470
15431a10455J00799O1938Q7855M8871J604l7670j5495p784p6723r3932K0590O6378
15419D5976j094K0728j1280l8270K3825L636R3699J6016q1844l3532j1467l495
15407B2898n5252k7180P3849L6416k7284k4740K9069Q0325L1747p2520j14639
15396d7311M14J1325N2648j1424K4986L7257O2647k2104q2157L0506M791K3559
15384H5137L9815m5909j6356k6305j4035M3470q4429J824j2429p1614k4525L1265
15372i4091L1620N3255O2911q395j9407k4136k1421j24081K0744K4969P4420P629
$$ plain form
15455 -57214 -133023 -207360 -182574 -97491 -66366 -44681 -16295 -22193 -32605 -68874 -31217 34852
15443 34852 38505 20476 75095 165899 238193 206339 88562 -2495 29316 66552 -13985 -110455
15431 -110455 -9656 52282 140137 189008 190612 152942 137447 129663 52940 -40992 -20402 45976
15419 45976 44882 65610 54330 16060 39885 43521 137220 153236 71392 37860 26393 22898
15407 22898 -32354 -59534 14315 50731 23447 -1293 27776 108101 139848 67328 -47311
15396 -47311 -46897 -35572 17076 5652 30638 67895 130542 108438 26281 56787 61578 85137
15384 85137 124952 79043 62687 36382 22347 65817 -18612 -16788 -29217 -100831 -125356 -94091
15372 -94091 -62471 -9216 53695 45300 25893 1757 -19664 -143745 -123001 -98032 -23612 -15983
15360a5983N1160j7800p4486j2962Q410k2153Q143j1110K1586L8978L2779k5985
15348a9423o9622M0226J6104J4794J06082M5223m6935n0203k5515j2056q9057
15337i0382l1123N6113P4525l7069L4543J06701l5267o0803m8925l2909K0167
15326d4429M9303k0279L1755l2315k3356K1196L2049P1509J26538k4125j41098
15315D6748k5660l3528j1026L1519l1863o388k5230r2232Q9282N4047N261J0068
15303A0998L94K6993p6152n7110J3053j149j5897k1873m0232m083K5438N1728
15291h7892J40M411O2210L6862K5977O7805m9492j7599J9995q691k8687J3519
15279C8558R1011K7247N4476m2955n9080j17317J8710j596j01326n8525M589K5327
$$ plain form
15360 -15983 35177 17377 -57109 -70071 -61661 -83814 -75671 -86781 -65195 -26217 6562 -19423
15348 -19423 -89045 -48819 -32715 -17921 88161 133384 86449 36246 10731 -1325 -90382
15337 -90382 -121505 -65392 9133 -27936 6607 113308 78041 17238 -31687 -64596 -44429
15326 -44429 4874 -15405 16350 -15965 -39321 -18125 13924 85433 211971 187846 46748
15315 46748 21088 -12440 -23466 8053 -23810 -30198 -55428 -147660 -58378 -4331 930 10998
15303 10998 11392 38385 -37767 -94877 -81824 -82973 -98870 -120743 -160975 -165058 -139620 -87892
15291 -87892 -87752 -83341 -21131 15731 41708 109513 60021 42422 62417 53726 25039 38558
15279 38558 129569 156816 211292 168337 109257 -8060 10650 9054 -92272 -150797 -146208 -120881
15267a20881P4113K6525r035j0548j8019k3700k59M4679j8647k8134l4447j5520
15255a33873L1629L7806k873l3430M3658N045J5444p9630o1181L6174j6109k5743
15243a83083l838j2385Q4794K7625Q156l373Q3785L6568J3616j675K9635n701
15231G4124m3428o5429J2974M6959M3857K5070l2517q1915J8585j2920p178p202
15219b9020N0347J8448q6443o0438J8041L8839L0376l8574K4869R7413K0621M5153
15207A29632k5317l8398N6262o5312m7092J2697N3688k0940k558N1617o5894l1438
15195F947j0901M8098L7789K2647j717l5889p5569n3757l6942m0509K1625K5159
15183i3019r75N6801N6556M8887l5156l8296l4847o5595n9822N3113K0303Q452
$$ plain form
15267 -120881 -46768 -20243 -29278 -39826 -57845 -81545 -81804 -37125 -55772 -83906 -118353 -133873
15255 -133873 -102244 -64438 -67311 -100741 -57083 -52038 -36594 -116224 -177405 -141231 -157340 -183083
15243 -183083 -186921 -199306 -114512 -86887 -78731 -82104 1681 38249 51865 50190 79825 74124
15231 74124 30696 -34733 -21759 25200 69057 94127 61610 -20305 -1720 -14640 -21818 -29020
15219 -29020 21327 39775 -46668 -107106 -89065 -50226 -19850 -58424 -33555 63858 84479 129632
15207 129632 104315 65917 122179 56867 9775 22472 76160 55220 52662 104279 38385 6947
15195 6947 -3954 44144 81933 104580 102863 66974 -8595 -62352 -99294 -139803 -118178 -93019
15183 -93019 -93994 -37193 19363 68250 33094 -5202 -40049 -105644 -165466 -112353 -92050 -83598
15171h3598J2921M9961j0566L8722l6448o1157m290M4778J4041r010m3260L0494
15159e7412K1932L7950M4196l3705q414m7126L2537j4080k5101j2911l6103k9561
15147a27798J5005m1950J8158N6979L1205M8606J6800p8777L746P4851l2154j4407
15135b9736l4319J2511J66574l002j04369j996N932L9727m5374N3182M0674J9122
15123A18926j09945l8199M1049P6409L5314r2431m3532m6434O6669L9265M96j7164
15111C0423r5069n159L6521K5924M1331Q214L8868p3810J0621Q1486o5988p3742
15099d0380j1973L3048N7378M8406j06018j5878L3677k8117l1065M3666M3682
15088B6426j7123N2169L8782N634p0078j3151M5741J8543p8366R341O1549J9533
$$ plain form
15171 -83598 -70677 -20716 -31282 7440 -29008 -90165 -94455 -49677 -35636 -44646 -87906 -57412
15159 -57412 -35480 2470 46666 12961 4547 -42579 -10042 -24122 -49223 -62134 -98237 -127798
15147 -127798 -112793 -154743 -136585 -79606 -48401 205 17005 -61772 -58026 16825 -15329 -29736
15135 -29736 -64055 -51544 115030 112028 7659 5663 11595 51322 5948 59130 99804 118926
15123 118926 8981 -29218 11831 88240 123554 31123 -12409 -58843 7826 47091 47587 30423
15111 30423 -64646 -69805 -33284 -7360 33971 42185 81053 7243 17864 99350 33362 -40380
15099 -40380 -52353 -19305 38073 86479 -19539 -35417 -1740 -29857 -60922 -17256 26426
15088 26426 9303 61472 100254 105888 35810 22659 68400 86943 8577 17918 79467 99000
15076I9000k9097o4705l1177O3857M9785n0493k9732j3954k1377J4736L972J0034
15064H49k496M8796L2525J9476n0187P2025j8247j00377m5244N0683J7670J3014
15052C8487o456o0303n1413M7099L841r706j9420M1169O2455m1778j5403Q9680
15040G8252p873q8078Q469l26o1899N6446L475M7265M8690l942Q1188k4280j18164
15027A9223j9901q3297n4883k506O7308P2675R4560J8133K0525J0358q0844l9771
15015B1580M8102m590j12642l5093j7312m312j4593L1927Q5033N9724L367l1542
15003B9649l2327K5313j1523l3975M5977k8328P3614M5149j5253j0313l3189j7861
14991C6933r1076k7276J52985Q3021m7152j1000j3577K1687m3696p0454J3074
$$ plain form
15076 99000 69903 5198 -25979 37878 87663 37170 7438 -6516 -27893 -13157 -9185 849
15064 849 -1647 47149 79674 99150 48963 120988 102741 2364 -42880 7803 25473 38487
15052 38487 32031 -28272 -79685 -32586 -28745 -38451 -57871 -16702 45753 3975 -11428 78252
15040 78252 70379 -17699 -9230 -9556 -71455 -15009 -11534 35731 84421 80479 161667 137387 19223
15027 19223 -678 -83975 -138858 -141364 -74056 -1381 93179 111312 131837 142195 61351 21580
15015 21580 69682 65092 -47550 -82643 -99955 -104267 -118860 -86933 -1900 57824 61191 29649
15003 29649 -2678 22635 11112 -22863 23114 -5214 68400 113549 98296 87983 54794 36933
14991 36933 -54143 -81419 71566 154587 107435 96435 82858 104545 60849 -9605 3469
14980C469n2254j8492N6738N7721M0923m5224K8478l6235k4452j6079j7285K9912
14968G220J9730o4015n8231L5080O5482K0266n904Q8551Q8001j4296n3037k906
14956A25941K2299L4909Q876m4982m8803K5232k5791m874o4776m940j497L103
14944B4697K2634N1422q3283J4070L9959q026k5057K0591q182p6152L2433k1083
14932a5977k6931J00202j4765j4976N6781n9767m7558n4941p7173P0873Q5849
14921A617M8823P908L8919M2235L0602J8320n3670o5349q0323m7182N2621P2603
14909F7124l8325o9799K4123j1689k7542Q4792Q6474o745l3717m2389p7073l6451
14897h1217M727N9140M8619O607j6110L729m0429j318o6890l8288M5621M1102
$$ plain form
14980 3469 -48785 -67277 -10539 47182 88105 42881 71359 35124 10672 -5407 -22692 7220
14968 7220 26950 -37065 -95296 -60216 5266 25532 19628 108179 196180 181884 128847 125941
14956 125941 148240 183149 192025 147043 98240 123472 97681 92807 28031 23091 21594 24697
14944 24697 47331 98753 15470 29540 69499 61473 36416 57007 48825 -27327 5106 -15977
14932 -15977 -42908 57294 42529 27553 84334 24567 -22991 -77932 -155105 -84232 1617
14921 1617 50440 58348 97267 139502 170104 188424 134754 69405 -10918 -58100 -5479 67124
14909 67124 28799 -41000 -16877 -28566 -56108 28684 115158 108413 74696 32307 -44766 -81217
14897 -81217 -76490 -17350 31269 37876 21766 25495 -14934 -16252 -83142 -121430 -75809 -34707
14885c4707K1869O9387J3763k9574j4457l5674k0120j8821l4617J4667l0145L2097
14873f6332P2205P8843N9412K6492k3577o5925L2019j1601n1701q8145M4287J06794
14861A12771Q2884m2206j7999Q1699p1039j30934P653M6323l4084Q8291k4569
14850I8790l281j1662J4839k1212n5055p3005J1050P2800m7663n8608N6537p1564
14838h8034n9763M4321P4276J0171L1943k0080q557K550J2722n1526O8836N2052
14826F8911l1607j0162N998P4121J01655L9918r4169l7421j06106r7319Q3761
14815b420J38973m1262q9714K2577j1268M6291N4798r4688r248M476m5094L4282
14803G703L9673J09537J4784q6074l0876K4751k918l5611k0812o3542k3452J05922
$$ plain form
14885 -34707 -12838 56549 70312 40738 26281 -9393 -29513 -48334 -82951 -68284 -98429 -66332
14873 -66332 5873 84716 144128 170620 147043 81118 113137 101536 49835 -38310 5977 112771
14861 112771 195655 153449 135450 217149 146110 15176 22829 69152 35068 123359 98790
14850 98790 95509 83847 98686 77474 22419 -50586 -39536 33264 -14399 -73007 -16470 -88034
14838 -88034 -147797 -103476 -29200 -19029 12914 -7166 -15723 -13173 -451 -51977 16859 68911
14826 68911 37304 27142 33140 107261 208916 248834 154665 117244 11138 -86181 -2420
14815 -2420 136553 95291 5577 28154 16886 63177 117975 23287 14039 18515 -26579 7703
14803 7703 47376 156913 171697 85623 54747 79498 76580 40969 20157 -43385 -66837 39085
14791C9085J9651M8178p7957o3457N2886R446M1363N6545M5098j28581l7827R3167
14779I7597k9980M52o4826n5978O0651Q5760n9950j40610k5861P3496L7505J1640
14767a0104N3126J3114L6172N0602k4543m8727P12k0036j2965K8454J1471n0895
14755B6381K7830O896K375k1251N0401k7684j66207m6058J50119J03887m8475
14744E8214q6599L4961N5655K0497k7293j8103O1219m6599m8685J5718n0039k9008
14732f0062O4745O6575K148l1601K7098R2422j4702r2643l9110K2330P9707J4175
14720A31082l8796K402K6612p1494j19897j39744P3323L9804N579M7934J41748
14709I8553J058m7311k5683n7029j0228J0248j1122j48660k2392K8569j0661n690
$$ plain form
14791 39085 58736 106914 28957 -34500 18386 27832 69195 125740 170838 42257 4430 97597
14779 97597 67617 68069 3243 -52735 7916 93676 33726 -106884 -132745 -59249 -21744 -10104
14767 -10104 43022 56136 92308 142910 118367 69640 70352 50316 37351 65805 77276 26381
14755 26381 54211 61107 63482 42231 92632 64948 -101259 -147317 2802 106689 58214
14744 58214 -28385 6576 62231 82728 55435 37332 98551 51952 3267 18985 -31054 -60062
14732 -60062 4683 71258 73406 41805 68903 161325 146623 53980 14870 37200 116907 131082
14720 131082 92286 94688 121300 49806 -70091 -209835 -136512 -96708 -91129 -43195 98553
14709 98553 99611 52300 26617 -30412 -40640 -30392 -41514 -190174 -212566 -183997 -194658 -200348
14697b00348Q3970J27015l058p0255n5618J3691R0004l2851m5800N9661L8336
14686D747J2030n7802j061n24L1455o58L1751l6080k5223P3038P0310p070k5089
14673F9824R818K3252m1417k1251l7302M241K3992J1787O9263l6649J0796N2372
14661A38726k9933N3776l2223n3665k2592o1472L6878j246n2951j8021O4912k110
14649B0079k6169m0835n6686m7869Q2559N516n5370l7005P3068k3367j6305K2854
14637i9530k943J02554Q5451M0398m7750r0427m441M7797K3499o8471m1902J19940
14625F4175J9502j14729k1659O0430Q5378j082n8061O585m0645j05132k8568L7746
14613i6060J8685q0602P5631R3143J4100l9315N2538P553M703L6607n8707n5528
$$ plain form
14697 -200348 -116378 10637 7579 -62676 -118294 -104603 -14599 -47450 -93250 -33589 4747
14686 4747 16777 -41025 -42086 -42610 -11155 -11813 19938 -16142 -41365 31673 101983 94913 69824
14673 69824 79642 102894 61477 40226 2924 7165 31157 42944 112207 75558 86354 138726
14661 138726 108793 162569 130346 76681 54089 -7383 29495 28249 -24702 -42723 22189 20079
14649 20079 -6090 -46925 -103611 -151480 -68921 -63405 -118775 -155780 -82712 -106079 -122384 -99530
14637 -99530 -102473 81 85532 125930 78180 -12247 -16688 31109 54608 -13863 -55765 64175
14625 64175 83677 -31052 -52711 7719 93097 92015 33954 40539 -106 -105238 -133806 -96060
14613 -96060 -77375 -157977 -82346 10797 24897 -14418 38120 45673 50376 86983 28276 -27252
14601b7252K4185k181j15278J8941J4752L9591O9755l6609k6970j0772N1086l0681
14589c1433K9260o449m4166m6157l5495N4923R455K0480N0213N1201n6014n4848
14577e9030j307p101o9823K0705Q5497Q6281M9404o0730q4145P347K9165q710
14565a2447m626k1363j3846L1126L5532l873o4126l1816n549N8210J8567k4518
14553c8729K2903M5283l7269p501L3878j0599K0058q7053k1785M534o275R2684
14541A0129L6640N7108k8516q0829k6717J8585K9580m1608j7926r3323J9656n311
14529a22532j4701K7719Q1678N3718r996M420j8441O9958K0103m2878j1531Q169
14517D5686j5862m0148n0491m4791K7029O3177O2802m6808k7846O1778p9414L0779
$$ plain form
14601 -27252 -3067 -5248 -120526 -101585 -86833 -47242 22513 -14096 -41066 -51838 -752 -31433
14589 -31433 -2173 -8622 -52788 -98945 -134440 -79517 -70062 -49582 631 51832 -4182 -59030
14577 -59030 -60337 -67438 -137261 -116556 -31059 55222 104626 43896 -40249 -32902 -3737 -12447
14565 -12447 -17073 -38436 -52282 -21156 14376 10503 -53623 -85439 -90988 -32778 -14211 -38729
14553 -38729 -15826 29457 -7812 -15313 18565 7966 28024 -59029 -80814 -76280 -82555 10129
14541 10129 46769 103877 75361 -5468 -32185 -13600 15980 -25628 -43554 -136877 -117221 -122532
14529 -122532 -137233 -109514 -27836 25882 15886 20306 1865 71823 91926 49048 37517 45686
14517 45686 29824 -10324 -60815 -105606 -78577 -15400 47402 594 -27252 34526 -44888 -14109
14505a4109Q2207m910j12461n3096L6420Q448N8564N2209q078n2563k3394M108
14493b6655N2751J5348J7201K2731K8109P2885j2676r3097r1715o1196k4571L7731
14481f3154j6174j05486N989N5798O2170N9416k1532K0374P1304K5582j0448n6004
14469B7835L399j9378l6062o9772J6829M467m0916n627l0023Q8914r498L9141
14457c0691k095l2965L4484J600J0583O6473K8759p1175M2044J0667M6962k2007
14445H2639l0203J5431J4084K9515L13m0266p0947m0080J1808k5659J09287j0728
14433D5194l0752K5545J8148N7219k0003j09458k7170J8962K5615L8728O1840
14422A03868n8618j9174P1j1474N904R0267k675j0001J4072k4839L3665k2518
$$ plain form
14505 -14109 68098 63188 -49273 -102369 -65949 -57501 1063 53272 45194 -7369 -30763 -26655
14493 -26655 26096 41444 58645 81376 109485 182370 169694 76597 -15118 -76314 -100885 -63154
14481 -63154 -79328 -184814 -178825 -123027 -60857 -1441 -22973 -2599 68705 94287 83839 27835
14469 27835 31234 11856 -24206 -93978 -77149 -72682 -113598 -119225 -149248 -60334 -69832 -30691
14457 -30691 -32786 -65751 -31267 -29667 -19084 47389 76148 4973 47017 57684 104646 82639
14445 82639 52436 67867 81951 111466 111779 71513 566 -39514 -27706 -53365 55922 45194
14433 45194 14442 39987 58135 115354 95351 -14107 -41277 -22315 3300 42028 103868
14422 103868 45250 26076 26147 14673 20577 110844 108169 98168 112240 87401 121066 98548
14410I8548p1527l9611O4248N0505N4953j24528k0670M4260O263L4871O479n2879
14398E0912j02476J2433J28280K7307O8506j733j03478n0453J4625n573n7267
14387a8917m7122j1905M4199M3992q8791l277Q586J1001N0528l4632k248P4306
14375B5720p3065k6444Q21l1017O169n3313L6479k2937k5439m3566K2587J56876
14363b7129M1090J622K9171l0914P6045O4925M779n486p9860o5108k4969p277
14351b3111J8127L0153J26584p357l9052l8218l7070L0880K8980J5553K2974l0603
14339I7840o2884q1051j290J6932j9525P9942M575O34n2765K158P3224o9832K5715
14326A3673j6859j7071K8466m576L0798n8650p8012p3422J7958K9487J01083L6616
$$ plain form
14410 98548 27021 -12590 51658 102163 157116 32588 11918 56178 62441 97312 103791 50912
14398 50912 -51564 -39131 89149 116456 184962 183229 79751 29298 43923 38350 -18917
14387 -18917 -66039 -77944 -33745 10247 -78544 -81821 -73235 -62234 -11706 -46338 -48586 25720
14375 25720 -47345 -73789 -72968 -103985 -97816 -151129 -114650 -137587 -163026 -206592 -184005 -27129
14363 -27129 13961 15583 44754 13840 89885 154810 159589 154103 74243 9135 -15834 -23111
14351 -23111 -4984 25169 151753 144396 105344 67126 30056 60936 89916 105469 128443 97840
14339 97840 34956 -46095 -47385 -30453 -49978 29964 34539 35173 -17592 -15434 57790 -12042 13673
14326 13673 -3186 -20257 8209 3633 34431 -24219 -102231 -175653 -157695 -128208 -27125 9491
14314I491o7871m2350M6190j6727k66L1834k5343o0l06m251R378j3612n8627J03667
14300b8853M7210Q9495j7093k2725q5950J5341K8756q2616K6321k369J9140N7287
14288D3944m107J9456k949j4716m8535j7236j4415P3569Q5448o4593m1509Q3598
14276I7955J8493k1344n2090m1335M1216l939k7469J1371l4270o6928l6110p238
14264a21688k3851J5037p851L565M9918O017P4831J03016L4696K694r1048k9466
14252A5870o2201j3045N0059P81n4513l697R6331l8007K9237l4674l6182k4170
14240g4211L0438P5794N6610p1188k9571j6145o6855M7634j4047M5647L5094K5178
14228D4378o3677k2828J12387Q0759K3056r9769l2167M3517n7845k2236L0285
$$ plain form
14314 9491 -58380 -100730 -54540 -71267 -71533 -39699 -65042 -65102 -65408 -69659 -60281 -73893 -132520 -28853
14300 -28853 18357 107852 90759 68034 -17916 -2575 26181 -56435 -30114 -32483 -13343 43944
14288 43944 39837 59293 56344 41628 -6907 -24143 -38558 35011 120459 55866 14357 97955
14276 97955 116448 95104 43014 1679 42895 38956 11487 22858 -11412 -78340 -114450 -121688
14264 -121688 -145539 -130502 -138353 -134788 -84870 -78853 -4022 98994 133690 136384 45336 15870
14252 15870 -46331 -59376 -9317 -8536 -63049 -66746 29585 -8422 20815 -13859 -50041 -74211
14240 -74211 -43773 32021 88631 17443 -12128 -28273 -95128 -47494 -61541 -15894 19200 44378
14228 44378 -19299 -42127 70260 151019 174075 74306 42139 85656 27811 5575 35860
14217C5860o491o120K901l3133o6958L4911R0649N5296k9395r7844j77001l3797
14205b31122R5405N6745j7076N4163l9086O8427Q2956J6569p9532j2411p2576
14194g7538m7989k2550j4153K8137R1198M4624m7902j10439L0994J05929M3624
14183B3935k7124l8523Q646k9997J471K8798L6707O4390O6245r0142q3049J47241
14171A08598J13235n4687j00477n3233l4027j4065p6947k5511K9494N2606K8396
14160b6618n0994k4033M8381J1979L0285j7518n6845O8750m5863J6487R4389J3136
14148F1536o6968j09299M3119j4857p7536R0426J13065j697K4816M8382j4034
14137I6953L4550J6828m823N8268L6124k05k6305m0047N875J5395K9412N854r9763
$$ plain form
14217 35860 29369 23249 26150 -6983 -73941 -39030 51619 106915 77520 -20324 -197325 -231122
14205 -231122 -135717 -78972 -96048 -41885 -80971 -12544 70412 86981 7449 -4962 -77538
14194 -77538 -125527 -148077 -162230 -134093 -42895 1729 -46173 -156612 -125618 -19689 23935
14183 23935 -3189 -41712 -33066 -63063 -61592 -32794 3913 68303 134548 44406 -38643 108598
14171 108598 221833 167146 66669 13436 -20591 -34656 -111603 -137114 -107620 -55014 -26618
14160 -26618 -77612 -101645 -53264 -41285 -11000 -28518 -85363 -16613 -62476 -45989 48400 61536
14148 61536 -5432 -114731 -71612 -86469 -164005 -73579 39486 37789 62605 110987 96953
14137 96953 131503 148331 143508 201776 237900 237695 211390 171343 177218 192613 222025 227879 128116
14124A28116k5595N7753K0279k4137r7728l1468O3298J9005n5786m3012n9155
14113d8430P7694L7513J3468O3090L4844m5296K2416j43484k0979J5486K6484
14102C2806j7191L4284L8814l3447p4610M1847O5818Mn8762R785O2840m7742j26257
14089g1811m2784J52628m1228l0311n0199N9289l03o2245R1562L9494q3607p10
14077d0225J6010L3558O319Q4190O3736j8658p9999r7161j4623L1848O9701J3372
14065F8068p3226p2626K160L9520o7015m9346K667M6246K045M4752J0314L7844
14053h597M9955L9531n4079k8157N2936L6411o1190m4212n925O0991j0322N0498
14041G7840J6662J330m0851P2805L6954M0645n2682o1723m824R5386m3664o7477
$$ plain form
14124 128116 102521 160274 180553 156416 58688 27220 90518 109523 53737 10725 -48430
14113 -48430 29264 66777 80245 143335 178179 132883 155299 11815 -9164 6322 32806
14102 32806 15615 49899 88713 55266 -19344 22503 88321 88325 29563 39348 102188 54446 -71811
14089 -71811 -114595 38033 -3195 -33506 -83705 -24416 -24719 -86964 4598 44092 -39515 -40225
14077 -40225 -24215 9343 15662 99852 163588 144930 64931 -32230 -46853 -15005 54696 68068
14065 68068 -5158 -77784 -75624 -36104 -103119 -152465 -149798 -103552 -101507 -56755 -46441 -8597
14053 -8597 41358 80889 26810 -1347 51589 88000 26810 -17402 -23327 37664 27342 77840
14041 77840 94502 95832 54981 127786 164740 205385 152703 90980 86156 181542 137878 70401
14029G0401j29412j2239p315J00578K6853n0756O2014M7041p5388p4763K9090
14018a3896J0489k2657o6769l0856O3317J06509M4599j1213r0996n7859o1037
14007a30369J15249J66161p907j15482M5557n1199j0328O7261J6010k7187n0612
13996A7154j1894l0795n8354l3248Q6975L0464L4687K397m4350M904j9858O0926
13984C9008K5346q7280k6737N9237j8845J1021L1642L5583r452L1035P2879O8344
13972B31781n548k4015j03949m3045j01462o6866N0777M4789p57J2039j0278R0470
13960G3936K4072o6318K8998L6600k4645j31548J0776l5052m4781P1897N746l514
13948e3833M1378N2287M0821L2952K8838L60K8376j9368m2927o4268k8689P238
$$ plain form
14029 70401 -59011 -71250 -78565 22013 48866 -1890 60124 107165 31777 -42986 -13896
14018 -13896 -3407 -26064 -92833 -123689 -60372 46137 90736 79523 -11473 -69332 -130369
14007 -130369 -15120 151041 143134 27652 73209 22010 11682 78943 94953 67766 17154
13996 17154 5260 -25535 -83889 -117137 -30162 302 34989 37386 -6964 -2060 -21918 39008
13984 39008 64354 -22926 -49663 9574 -9271 1750 33392 68975 59523 90558 163437 231781
13972 231781 226233 202218 98269 55224 -46238 -113104 -62327 -17538 -18295 -6256 -16534 73936
13960 73936 98008 31690 60688 97288 72643 -58905 -48129 -83181 -127962 -56065 -50319 -53833
13948 -53833 -12455 39832 80653 113605 142443 142803 171179 151811 108884 44616 15927 23165
13936B3165l690n7693J1338L5765M401j0508J9281J7027K8137Q281n0408M3900
13924F8996R95l9273l8070j9851o241p348K8813O9257k1044l1067O7332M1443
13912A13942k7518n1309l361K4093J4523M8918N871j03808r5063O889J09129Q452
13900E0758o7035L3067N866k814Q1203J1412l4211L4656k8829j835K738m7636
13888C7340j09190k9249n8064n547M2278O5446R1704R8061m9783L002m5156p7285
13876c6443K9906M4564j0940k6818J373L3587P6704P8277j4761p603j2844p1583
13864H3419n2843N6808M4001r652l6072n4525k9365M0000m5764k588l637o5641
13852g5859M1214K0938k981j6329j7152M3318J07542J7866o4148J6899P9868j5660
$$ plain form
13936 23165 19475 -38218 -26880 8885 13286 2778 22059 39086 67223 75504 25096 68996
13924 68996 69991 30718 -7352 -27203 -33444 -40792 -11979 57278 36234 5167 72499 113942
13912 113942 86424 35115 31754 55847 70370 119288 125159 21351 -73712 -66823 42306 50758
13900 50758 -16277 16790 22656 19842 101045 112457 78246 112902 84073 82238 84976 37340
13888 37340 -71850 -101099 -159163 -164710 -122432 -56986 34718 132779 82996 85998 40842 -36443
13876 -36443 -6537 38027 27087 269 1642 35229 111933 190210 175449 167846 155002 83419
13864 83419 30576 87384 131385 121733 85661 31136 1771 41771 -3993 -6581 -10218 -75859
13852 -75859 -34645 -13707 -16688 -33017 -50169 -6851 100691 118557 54409 71308 151176 135516
13840A35516l9144j658q260k2274j9489J6249M2899q6993n2323q721L9921P6580
13828G2303p336n6204j05834n6536k4006k89P3296J04545K5847l440l360p6054
13816e7068o1099L2938j2463J0382n7006J0109P7393K4577K8556P5989N0954l9340
13804H3922n9823n2935K7368K6997k4832K4115m1277k4966n8336M1104m6206J3152
13792i1717M0186j5054L5992l4905L9088L3742j1789L1052m5076K7290K4973m4257
13780a0475l8432J2594k6495Q3599L6652j4849o0561K6420R7516m6506r1071j4337
13768d5945K0719P9159o9042k3172l5615L2707j7193K5321L4478J9723J36k0461
13756H15m019l045m628R139M4954l38K5407L1122n4916j09801k6245J6070M5596
$$ plain form
13840 135516 96372 94714 86454 64180 44691 60940 103839 16846 -35477 -44198 -4277 72303
13828 72303 64967 8763 -97071 -153607 -177613 -177902 -104606 -61 25786 22346 18986 -57068
13816 -57068 -118167 -85229 -97692 -87310 -144316 -134207 -56814 -32237 -3681 72308 123262 83922
13804 83922 24099 -28836 -1468 25529 697 24812 -16465 -41431 -99767 -58663 -104869 -91717
13792 -91717 -51531 -66585 -30593 -65498 -26410 7332 -4457 26595 -18481 8809 33782 -10475
13780 -10475 -48907 -36313 -62808 20791 57443 42594 -17967 8453 105969 59463 -31608 -45945
13768 -45945 -25226 53933 -15109 -38281 -73896 -41189 -58382 -33061 1417 21140 21276 815
13756 815 -3204 -6249 -10877 -1738 43216 42878 68285 99407 44491 -65310 -91555 -75485 -29889
13743b9889P0961k63L8582Q9764l1446o6957j03300j21711K1108L3158K6438q506
13731h2061P024P9273j5949o6945k7018j1831M2317Q0334k2709j21515j7185j7281
13719a73546R2283O7207k064q3664K008N4562N9984P3076j1415k0845J628l7585
13707B1629K3106M047r2131k9749j9441K5751p9551m0680K4655J08818K4634J5893
13695a3019n990q735L6682K5724J0417n9804l0425O6624R148m9738l5255L731
13683e0640N2309l1171K997P4976J02515j2584m1181r9947L7187L4959q0698J5183
13671C905O9553L353j7227l8519o5735m4153J2023l3691Q302j1590K4975j4301
13659a03105j7297K5650J512k2830Q9239M0996L5960j6415J3109L7334n140j5973
$$ plain form
13743 -29889 41072 40809 79391 169155 137709 70752 -32548 -154259 -133151 -99993 -73555 -82061
13731 -82061 -75037 4236 -11713 -78658 -105676 -117507 -75190 5144 -17565 -139080 -156265 -173546
13719 -173546 -81263 -14056 -16120 -99784 -97776 -43214 16770 89846 78431 57586 59214 21629
13707 21629 44735 48782 -43349 -73098 -92539 -66788 -146339 -187019 -162364 -53546 -28912 -13019
13695 -13019 -19009 -27744 8938 34662 45079 -14725 -45150 21474 30622 -19116 -54371 -50640
13683 -50640 1669 -29502 -26505 48471 150986 138402 97221 -2726 34461 69420 -11278 3905
13671 3905 73458 76811 59584 21065 -44670 -88823 -76800 -110491 -102189 -113779 -88804 -103105
13659 -103105 -120402 -94752 -93240 -116070 -26831 14165 50125 33710 46819 84153 79013 63040
13647F3040j25969k5372Q5655J12132K6892N9027j2366n5887m6119q7932l0443
13636c7342j9422M4993J5527n5669o674P4308j0186o1430N598P6448K9977j7247
13624C8881J925n8401J4695J5088N7202o2635n4869o466l3722P0074P7640l569
13612E5843L9902L633p0188K898L0777N1025P9308j11044o5470n5696o8585k0371
13600a27968K8953J19813l0980q8926J24579J55023j5407r4033r3782j6019K4620
13589a4127k34J3732N2493o621O586n0576n591L7910K4398q9360L4113J10969
13577A13692o4608j27655q595M6373K7405R098M2026l9675M5072O3612M2334n1322
13565I7757l5014J579m8213n7316j2611l585K5254J9301J9013p3619M6184M435
$$ plain form
13647 63040 -62929 -88301 -2646 109486 136378 195405 183039 127152 81033 -6899 -37342
13636 -37342 -56764 -11771 3756 -51913 -58587 15721 5535 -55895 -50297 26151 56128 38881
13624 38881 40806 -17595 -2900 12188 69390 6755 -48114 -54580 -88302 -18228 59412 55843
13612 55843 95745 99378 29190 32088 62865 113890 193198 82154 16684 -39012 -107597 -127968
13600 -127968 -99015 20798 -10182 -99108 25471 180494 165087 71054 -22728 -38747 -14127
13589 -14127 -14361 -629 51864 45243 51829 1253 -4338 33572 57970 -31390 2723 113692
13577 113692 49084 -78571 -87166 -40793 -13388 -4290 37736 -1939 43133 106745 149079 97757
13565 97757 62743 64322 16109 -41207 -53818 -57403 -32149 -12848 6165 -67454 -21270 -16835
13553a6835j6187k3408J254N4327K0312n838J4104M9147K879r4950p5967j03312
13541a94474M3993J8056L2089K525L6669J60536O5496o4058n5904n1284J2956
13530F600L406l4661o5969p4104L0461j6066O9495J5094n7177O7808j4145Q7549
13518A8291K0986K9813n7116m2116L1238M4781L2680n4471Q5954j05092j7874
13507a2926n714n93o711Q1166O6780K8510k2223n7160J3797J5769L2800K3619
13495A57114p9047M984m7992m5272l572l7307j1584K241M6440K731q39L7698l6568
13482a0973p645m772K921j4492K006N6186j6112k2734J0238J9324J3273j53642
13470a26422n4710M8929n5742L3050Q7029q415R5089N0662K9111r9845r1333M9234
$$ plain form
13553 -16835 -33022 -56430 -55176 -849 19463 13625 27729 76876 79755 -15195 -91162 -194474
13541 -194474 -150481 -132425 -100336 -97811 -61142 99394 164890 100832 44928 -6356 6600
13530 6600 10006 -24655 -90624 -164728 -134267 -150333 -80838 -65744 -122921 -55113 -69258 18291
13518 18291 39277 69090 11974 -30142 1096 45877 78557 24086 110040 4948 -12926
13507 -12926 -18640 -19233 -25944 55222 122002 150512 128289 71129 84926 100695 133495 157114
13495 157114 78067 83051 35059 -10213 -13785 -51092 -62676 -60435 -13995 -11264 -12103 25595 -10973
13482 -10973 -18618 -23390 -20469 -34961 -32955 23231 7119 -15615 -5377 13947 27220 -126422
13470 -126422 -181132 -132203 -187945 -154895 -67866 -76281 18808 69470 98581 -1264 -92597 -43363
13458d3363j6620p2393M6031R7124n0268j895N3516j9071J8467j1749m6332k0425
13446f6978L6961P194p9963J4893L6370K8906l242O7041J7158j04954j15435k7820
13434a89869J03588L8395o985M8411o3761r2687J3945J00384m0834K5866N0389
13423a3158L8147L6380p6489M988K9040k489R0958n5258j18378L4529N6188m312
13411B0146J0450n068M887l531l8145K175O6515N283L9031Q056k6670n6316p0697
13398d3884o1080K2712K2458M6630Q9398O849q7048j45209p2782N5572J15343
13387e1041j9780o0632m7422K6365L5357J2011J4089J06P6754q0889m0926P1492
13375f4516P8394N3510L9671j9686J3969j5747k3864K6908Q0425m1551l1895K0121
$$ plain form
13458 -43363 -59983 -132376 -86345 10779 -39489 -41384 12132 -6939 11528 -221 -46553 -66978
13446 -66978 -30017 -22823 -102786 -87893 -51523 -22617 -25859 41182 58340 -46614 -162049 -189869
13434 -189869 -86281 -47886 -54871 -6460 -70221 -162908 -148963 -48579 -89413 -63547 -13158
13423 -13158 24989 61369 -15120 -10132 18908 16419 107377 52119 -66259 -31730 24458 20146
13411 20146 30596 25528 30415 26884 -11261 -9086 57429 62712 101743 109799 83129 26813 -43884
13398 -43884 -104964 -82252 -59794 -13164 76234 83083 -3965 -149174 -221956 -166384 -51041
13387 -51041 -70821 -131453 -178875 -152510 -117153 -105142 -91053 -90947 -14193 -95082 -136008 -64516
13375 -64516 13878 67388 107059 87373 101342 85595 61731 88639 169064 127513 95618 115739
13363A15739K0314k9576k2362K3819m6628J5582L0081q1635n1671j7551j1580
13352e5468L5801N7214O848k1654L7628j9605o0709N0390k2724K1103j5125m6289
13340c2590M4711m5022J12395L6434j0542k4448p9256M1195p4702o8246J8938
13329h1133M4020M691O19K6126J0066j505L536k7809j27988m4104N8896R1631
13317d2954m1341K4095O8151N718J343j8008K2085M6813J0762p024j4834P519
13305F2325j0448p1569K2301P4217n2804k9481J5942j6952J8084j597o4679N133
13293d9528K1734O5452l5814J3657J42P6215K9038j0558j0280j821l0551q6956
13281a9270j6961J1380q7463l6909N6914J15565N7187j7224O2026R0723l9538
$$ plain form
13363 115739 136053 106477 84115 107934 61306 76888 106969 25334 -26337 -43888 -55468
13352 -55468 -19667 37547 44395 22741 60369 40764 -19945 30445 7721 28824 13699 -32590
13340 -32590 12121 -32901 79494 115928 105386 80938 1682 42877 -31825 -100071 -81133
13329 -81133 -37113 -32422 -31803 -5677 4389 2884 6420 -21389 -149377 -193481 -134585 -42954
13317 -42954 -84295 -60200 7951 13669 15012 -2996 19089 65902 76664 69640 54806 62325
13305 62325 51877 -19692 2609 76826 24022 -5459 10483 -6469 11615 10018 -54661 -49528
13293 -49528 -27794 37658 1844 15501 15643 91858 120896 110338 100058 98237 67686 -19270
13281 -19270 -36231 -24851 -112314 -149223 -92309 23256 80443 63219 125245 215968 176430
13270A76430r2159j31074L1123P8467K4589l3602l753k3400o6715K1277Q407N569
13258d841K4664P0976K1616n8237p164m8956o7724J04905L3932J3073p8638n6943
13246e3337N1374M8110J8000m8607j14052l2154O5086J65739j8089r2654J0936
13235C52N2241O1543o0485p0945R6929R538N535K8318M4536N4236q8482j73043
13223c9727K83k183o2274j0704J7211p942N4884L1534m387O3427P4721J6663o2962
13210F8544l0949m539O608n908K7168l3845n5179n1385J8314J4674L9217q2936
13198i0216J7843M3545O4265p4434n6554R514K3394r967p5L226o902M2856J661
13185c1844N1109q512m8031j9372P48q127R0452P6418N9253j10573n5509J468
$$ plain form
13270 176430 84271 -46803 -15680 62787 87376 53774 50021 26621 -40094 -18817 -10410 -4841
13258 -4841 19823 90799 112415 54178 47014 -1942 -69666 35239 69171 82244 3606 -53337
13246 -53337 -1963 46147 64147 15540 -98512 -130666 -65580 100159 82070 -10584 352
13235 352 52593 114136 53651 -17294 79635 89173 94708 123026 167562 221798 133316 -39727
13223 -39727 -39444 -41627 -103901 -114605 -97394 -105336 -50452 -18918 -23305 40122 114843 131506 68544
13210 68544 37595 33056 39664 33756 60924 27079 -28100 -79485 -61171 -46497 -7280 -90216
13198 -90216 -72373 -28828 35437 -38997 -95551 -86037 -62643 -72610 -72685 -69459 -76361 -33505 -31844
13185 -31844 19265 10753 -37278 -56650 -55902 -64029 26423 102841 162094 51521 -3988 -2520
13173b520m5562l8244k8021N2513R9791l7366J0748j4569m5825K5991P5089n6187
13161d162k4188k5887Q618K2534M6577Q0630K4302N300p1513k8042L199m6203
13149h835o3390m6360l162R4528K2872M8709L593p5562M2598j4099N4895n218
13137E0569o1904L706m3242m078Q0827L1598K4463m0228l3448L3120O6395j07530
13125B48j39267J0972O2151L863k0030M5280p7760n2740O9537J2250M5200O708
13113c3588J03999N2283R763m858j189M4928K8948l0914o2295L6088j21153q0498
13101e8486J2807P9769k7478n1933P5385l5714n6557L5925K4900j4180m9438j0049
13089g5049L5291k1708N1306k2978n2633J01092P964l3046K7427J1812K03l288
$$ plain form
13173 -2520 -48082 -86326 -114347 -61834 37957 591 11339 -3230 -49055 -23064 52025 -4162
13161 -4162 -28350 -54237 -45619 -23085 23492 104122 128424 133724 62211 34169 37368 -8835
13149 -8835 -72225 -118585 -121747 -27219 -4347 44362 47955 -27607 14991 892 55787 50569
13137 50569 -11335 -7629 -50871 -54949 25878 57476 81939 41711 8263 41383 107778 248
13125 248 -139019 -128047 -65896 -62033 -82063 -36783 -114543 -167283 -97746 -85496 -40296 -33588
13113 -33588 70411 122694 132457 127599 126410 171338 200286 169372 107077 143165 22012 -58486
13101 -58486 -45679 34090 6612 -45321 30064 -5650 -62207 -26282 -1382 -15562 -65000 -75049
13089 -75049 -39758 -61466 -10160 -33138 -85771 15321 23285 -9761 17666 29478 29681 26393
13077B6393J3551j4598o4282l395K8516m8875o903Q6294N6975O5683l9170m4194
13065E5995N8010J9007q1449M3882l7281l9023J9372j0723J4761J4560l304K5376
13053G9183Q6292q507p7399M9987l8075o0496l1286n2338l7162k5432j40641q3316
13041c39190Q0028J47266L7357L7075q190j7456l9697k471j0795j8502J5696M3942
13029g4937J7469J7850n6464k3529L1401n6740k0703R7725q5810N12Q9892L3195
13017c0139J8794J1887j1937j5923l5591L446O2622K6953O1033j6786r7322k9477
13005e2440l8487L2246J47443o799j45142m5540l6052O9552Q9057M6598n0076
12994A0360j4105k0210P2560M5202k7956o4222L7545M6455l4636n5996M3531j2429
$$ plain form
13077 26393 39944 25346 -38936 -42331 -13815 -62690 -69593 16701 73676 139359 100189 55995
13065 55995 114005 133012 51563 95445 58164 19141 38513 27790 42551 57111 53807 79183
13053 79183 165475 156968 79569 129556 91481 30985 -301 -52639 -89801 -115233 -255874 -339190
13041 -339190 -259162 -111896 -74539 -37464 -45654 -63110 -102807 -105278 -116073 -134575 -118879 -74937
13029 -74937 -57468 -39618 -96082 -119611 -88210 -144950 -165653 -67928 -153738 -153226 -63334 -30139
13017 -30139 -11345 542 -11395 -27318 -62909 -59463 3159 30112 91145 74359 -22963 -52440
13005 -52440 -90927 -58681 88762 81963 -63179 -108719 -144771 -75219 13838 60436 10360
12994 10360 -3745 -23955 48605 93807 65851 1629 39174 85629 50993 -5003 38528 26099
12982B6099q4502K5238n8925J5491J26283L9585K1050M2205R603j7497p2181j47955
12970g5506j20950L1184P7794Q2450L9741J8210L4832j00278m6471J8834k2962
12959f3122P7768J7607k5610K3515k7789K7149M2830O0415o0182n7720L3367N0822
12947I9050P8273m4224o7798l5084O69n774L1296K77k7465K1639l2202m2034q7238
12934a10615j9480j3972O0902L2948M3036R0m1555M81M4866k5051L5379k1706
12922a4677j17383J4468P9118N0927k0367J6714J15054l8644j00586j4667M2197
12911A2154J41682L2847l8261j8691l6075l1485r3835p8115p842k3387M0311M9534
12899e1163L6907N1941j2305K2326K7239m6383k4291q498m8655j8005P1742K2230
$$ plain form
12982 26099 -58403 -33165 -92090 -76599 49684 89269 110319 152524 162127 144630 72449 -75506
12970 -75506 -196456 -165272 -87478 -5028 34713 52923 87755 -12523 -58994 -40160 -63122
12959 -63122 14646 32253 6643 30158 2369 29518 72348 132763 72581 14861 48228 99050
12947 99050 177323 133099 65301 30217 30886 25112 56408 56685 29220 50859 18657 -23377 -110615
12934 -110615 -130095 -144067 -83165 -50217 -7181 -7091 -48646 -48165 -3299 -28350 7029 -14677
12922 -14677 -132060 -117592 -38474 12453 -7914 8800 123854 85210 -15376 -30043 12154
12911 12154 153836 186683 148422 129731 93656 62171 -31664 -109779 -117621 -141008 -100697 -51163
12899 -51163 -14256 37685 25380 47706 74945 28562 4271 -4227 -52882 -70887 855 23085
12887B3085j17306q3705M7865J14103M6832O4370o9492j3006n5683p378J4729
12876c5586j2134k5540l1908O7128Q6133o5721p4518P7924j6196J1542M5566J5990
$$ plain form
12887 23085 -94221 -177926 -130061 -15958 30874 95244 25752 12746 -42937 -50315 -35586
12876 -35586 -47720 -73260 -105168 -38040 48093 -17628 -92146 -14222 -30418 -18876 26690 42680
$$ [...]
##END NTUPLES=NMR SPECTRUM
##END=
