##TITLE=Analysis number 313985
Compound Code mo 07015
Project Code adrs
Chemist Name spectrum
##JCAMPDX= 6.0         $$ Bruker NMR JCAMP-DX V2.0
##DATA TYPE= NMR SPECTRUM
##DATA CLASS= NTUPLES
##ORIGIN= Bruker BioSpin GmbH
##OWNER= NMR
$$ XWIN-NMR		Version 3.5
$$ Fri Sep 30 12:27:56 2005 GMT Daylight Time (UT+1h)  MAYBRIDGE\NMR@NMR_250MHZ
##.OBSERVE FREQUENCY= 250.131544655141
##.OBSERVE NUCLEUS= ^1H
##.ACQUISITION MODE= SIMULTANEOUS (DQD)
##.ACQUISITION SCHEME= undefined
##.AVERAGES= 16
##.DIGITISER RES= 18
##SPECTROMETER/DATA SYSTEM= dpx250
##.PULSE SEQUENCE= zg30
##.SOLVENT NAME= CDCl3
##.SHIFT REFERENCE= (INTERNAL, CDCl3, 0, 16.522)
##AUDIT TRAIL= $$ (NUMBER, WHEN, WHO, WHERE, WHAT)
$$ ##TITLE= Audit trail, XWIN-NMR		Version 3.5
$$ ##JCAMPDX= 5.01
$$ ##ORIGIN= Bruker BioSpin GmbH
$$ ##OWNER= NMR
$$ C:\u/data/dgb/nmr/ADRS/10100/pdata/1/auditp.txt
$$ ##AUDIT TRAIL=  $$ (NUMBER, WHEN, WHO, WHERE, WHAT)
(   1,<2005-09-30 12:27:39.02 +100>,<MAYBRIDGE\NMR>,<NMR_250MHZ>,
      <created by zg, POWCHK disabled, PULCHK disabled
       configuration hash MD5:
       62 19 C7 07 E1 42 D1 B7 37 6C 3D D0 77 39 F9 E6
       data hash MD5: 64K
       B2 79 E6 BB 71 D3 EB 97 11 58 60 D6 1F B5 51 FD>)
(   2,<2005-09-30 12:27:49.57 +100>,<MAYBRIDGE\NMR>,<NMR_250MHZ>,
      <Start of raw data processing
       ef LB = 0.3 FT_mod = 6 PKNL = 1 SI = 32K 
       data hash MD5: 32K
       DC AA 0F DF C0 BF 84 70 77 39 02 96 1B 19 1A 07>)
(   3,<2005-09-30 12:27:51.21 +100>,<MAYBRIDGE\NMR>,<NMR_250MHZ>,
      <apk 
       data hash MD5: 32K
       8A BF FB 0C AD 67 07 F7 00 CD 43 46 9D 76 4C F3>)
(   4,<2005-09-30 12:27:51.91 +100>,<MAYBRIDGE\NMR>,<NMR_250MHZ>,
      <abs ABSG = 5 
       data hash MD5: 32K
       CC AA 02 AA 5A 1D B7 0B 63 86 32 10 E1 85 7C 54>)
$$ ##END=
$$ 
$$ hash MD5
$$ C3 0F 8F DF 6D 19 D4 7E 40 38 C0 76 BF E7 F2 05
##$RELAX= 
##$RELAX= 
##$RELAX= 
##$RELAX= 
##$RELAX= 
##$RELAX= 
##$RELAX= 
$$ Bruker specific parameters
$$ --------------------------
##$DU= <C:\u>
##$EXPNO= 10100
##$NAME= <ADRS>
##$PROCNO= 1
##$TYPE= <nmr>
##$USER= <dgb>
##$AMP= (0..31)
100 100 100 100 100 100 100 100 100 100 100 100 100 100 100 100 100 100 
100 100 100 100 100 100 100 100 100 100 100 100 100 100 
##$AQSEQ= 0
##$AQ_mod= 3
##$AUNM= <au_zg>
##$AUTOPOS= <36 >
##$BF1= 250.13
##$BF2= 250.13
##$BF3= 250.13
##$BF4= 250.13
##$BF5= 500.13
##$BF6= 500.13
##$BF7= 500.13
##$BF8= 500.13
##$BYTORDA= 1
##$CFDGTYP= 0
##$CFRGTYP= 5
##$CHEMSTR= <none>
##$CNST= (0..31)
1 1 145 1 1 1 1 1 1 1 1 1 1 1 1 1 1 1 1 1 1 1 1 1 1 1 1 1 1 1 1 1 
##$CPDPRG= <>
##$CPDPRG1= <>
##$CPDPRG2= <>
##$CPDPRG3= <>
##$CPDPRG4= <mlev>
##$CPDPRG5= <mlev>
##$CPDPRG6= <mlev>
##$CPDPRG7= <mlev>
##$CPDPRG8= <mlev>
##$CPDPRGB= <>
##$CPDPRGT= <>
##$D= (0..31)
0 1 0 0 0 0 0 0 0 0.06 0 0 0 0 0 0 0.0002 0 0 0 0 0 0 0 0 0 0 0 0 0 0 
0 
##$DATE= 1128079658
##$DBL= (0..7)
120 120 120 120 120 120 120 120 
##$DBP= (0..7)
150 150 150 150 150 150 150 150 
##$DBP07= 0
##$DBPNAM0= <>
##$DBPNAM1= <>
##$DBPNAM2= <>
$$ [...]
##$SUBNAM7= <"">
##$SUBNAM8= <"">
##$SUBNAM9= <"">
##$SW= 20.6930455092707
##$SWIBOX= (0..15)
0 0 3 0 0 0 0 0 0 0 0 0 0 0 0 0 
##$SW_h= 5175.983436853
##$TD= 65536
##$TD0= 1
##$TE= 295.16
##$TE2= 300
##$TE3= 300
##$TEG= 300
##$TL= (0..7)
0 120 120 120 120 120 120 120 
##$TP= (0..7)
150 150 150 150 150 150 150 150 
##$TP07= 0
##$TPNAME0= <>
##$TPNAME1= <>
##$TPNAME2= <>
##$TPNAME3= <>
##$TPNAME4= <>
##$TPNAME5= <>
##$TPNAME6= <>
##$TPNAME7= <>
##$TPOAL= (0..7)
0.5 0.5 0.5 0.5 0.5 0.5 0.5 0.5 
##$TPOFFS= (0..7)
0 0 0 0 0 0 0 0 
##$TUNHIN= 0
##$TUNHOUT= 0
##$TUNXOUT= 0
##$USERA1= <user>
##$USERA2= <user>
##$USERA3= <user>
##$USERA4= <user>
##$USERA5= <user>
##$V9= 5
##$VALIST= <valist>
##$VCLIST= <CCCCCCCCCCCCCCC>
##$VD= 0
##$VDLIST= <DDDDDDDDDDDDDDD>
##$VPLIST= <PPPPPPPPPPPPPPP>
##$VTLIST= <TTTTTTTTTTTTTTT>
##$WBST= 1024
##$WBSW= 4
##$XGAIN= (0..3)
0 0 0 0 
##$XL= 0
##$YL= 0
##$YMAX_a= 475920
##$YMIN_a= -332703
##$ZGOPTNS= <>
##$ZL1= 120
##$ZL2= 120
##$ZL3= 120
##$ZL4= 120
##$ABSF1= 16.522
##$ABSF2= -4.171173
##$ABSG= 5
##$ABSL= 3
##$ALPHA= 0
##$AQORDER= 0
##$ASSFAC= 0
##$ASSFACI= 0
##$ASSFACX= 0
##$ASSWID= 0
##$AUNMP= <proc_1d>
##$AZFE= 0.1
##$AZFW= 0.1
##$BCFW= 0
##$BC_mod= 0
##$BYTORDP= 0
##$COROFFS= 0
##$CY= 12.5
##$DATMOD= 1
##$DC= 0
##$DFILT= <>
##$DTYPP= 0
##$F1P= 14.0000005364418
##$F2P= -0.99999901652339
##$FCOR= 0.5
##$FTSIZE= 32768
##$FT_mod= 6
##$GAMMA= 0
##$GB= 0
##$INTBC= 1
##$INTSCL= 1
##$ISEN= 128
##$LB= 0.3
##$LEV0= 0
##$LPBIN= 0
##$MAXI= 10000
##$MC2= 0
##$MEAN= 0
##$ME_mod= 0
##$MI= 0
##$NCOEF= 0
##$NC_proc= -4
##$NLEV= 6
##$NOISF1= 0
##$NOISF2= 0
##$NSP= 0
##$NTH_PI= 0
##$NZP= 0
##$OFFSET= 16.522
##$PC= 1
##$PHC0= -65.46555
##$PHC1= 5.033734
##$PH_mod= 1
##$PKNL= yes
##$PPARMOD= 0
##$PSCAL= 4
##$PSIGN= 0
##$REVERSE= no
##$SF= 250.13
##$SI= 32768
##$SIGF1= 0
##$SIGF2= 0
##$SINO= 400
##$SIOLD= 32768
##$SREGLST= <1H.CDCl3>
##$SSB= 0
##$STSI= 32768
##$STSR= 0
##$SW_p= 5175.98343685301
##$SYMM= 0
##$S_DEV= 0
##$TDeff= 65536
##$TDoff= 0
##$TI= <Analysis number 999999
Compound Code 99
Book Reference 9
Project Code 9>
##$TILT= no
##$TM1= 0
##$TM2= 0
##$TOPLEV= 0
##$USERP1= <user>
##$USERP2= <user>
##$USERP3= <user>
##$USERP4= <user>
##$USERP5= <user>
##$WDW= 1
##$XDIM= 32768
##$YMAX_p= 303386430
##$YMIN_p= -109247
$$ End of Bruker specific parameters
$$ ---------------------------------
##NTUPLES= NMR SPECTRUM
##VAR_NAME=  FREQUENCY,     SPECTRUM/REAL,   SPECTRUM/IMAG
##SYMBOL=    X,             R,               I
##VAR_TYPE=  INDEPENDENT,   DEPENDENT,       DEPENDENT
##VAR_FORM=  AFFN,          ASDF,            ASDF
##VAR_DIM=   32768,         32768,           32768
##UNITS=     HZ,            ARBITRARY UNITS, ARBITRARY UNITS
##FACTOR=    0.157963299565203, 1,           1
##FIRST=     4132.6476996994, 0,             0
##LAST=      -1043.33573715361, 0,           0
##MIN=       -1043.33573715361, -109247,     0
##MAX=       4132.6476996994, 303386430,     0
$$ Real data points
##PAGE= N=1
##DATA TABLE= (X++(R..R)), XYDATA
$$ [...]
23714D1577m785j2859l4247j2094L1462J7360J491j1226j6952Q200j6962l0553
$$ 41577 36792 23933 -10314 -22408 9054 26414 27905 16679 -273 7927 -9035 -39588
23702c9588P763K5614j1070j1652L000K5672j5341j438J8522j0022j1441l270
$$ -39588 -31825 -6211 -17281 -28933 -25933 -261 -15602 -17040 1482 -8540 -19981 -23251
23690b3251j3570K3871J614j3991M368O623k898k177j6050K112J2717J4403J303
$$ -23251 -36821 -12950 -11336 -25327 -20959 -14336 -17234 -19411 -35461 -33349 -20632 -6229 -4926
23677d926N842l724j8342j4737k841N443K2735K6460o410m0303J3525K7192K6810
$$ -4926 916 -2808 -21150 -35887 -38728 -33285 -10550 15910 9500 -30803 -17278 9914 36724
23664C6724m505j828m590m795p715k1009l3925Q068M5351L412m0181L201J4018
$$ 36724 32219 30391 25801 21006 13291 -7718 -41643 -33575 11776 15188 -24993 -21792 -7774
23651g774j4010K678J5256K576j507j0432k5015p527j546J111J232J8260K6232
$$ -7774 -21784 -19106 -3850 -1274 -2781 -13213 -38228 -45755 -47301 -46190 -44958 -26698 -466
23638d66j4596l881M132J5887J1128j0356l6111J0309J6491l688J4581J8117j0322
$$ -466 -15062 -18943 -14811 1076 12204 1848 -34263 -23954 -7463 -11151 3430 21547 11225
23625A1225m937J7076Q643J7754n7l1267l9494j0979k775P108O713J7079M963
$$ 11225 6288 23364 32007 49761 49704 18437 -21057 -32036 -34811 -27703 -20990 -3911 1052
23612A052m076J6635J3590j3597j6237j484J2429J4843j3920q975J1311M990l233
$$ 1052 -3024 13611 27201 13604 -2633 -4117 8312 23155 9235 260 11571 16561 13328
23599A3328Q175m771l9776K0200K277k0313j3278j7070j8491N791P777J7050K5699
$$ 13328 21503 16732 -23044 -2844 -567 -20880 -34158 -51228 -69719 -63928 -56151 -39101 -13402
23586a3402O921J2337l0148n494M248N533j4616r377K1484P157L293M31j2093
$$ -13402 -6481 5856 -24292 -29786 -25538 -20005 -34621 -43998 -22514 -15357 -12064 -11633 -23726
23573b3726j7722K6788j7362l1056M092M7225M8617K0344m81j9681r291r435k1647
$$ -23726 -41448 -14660 -32022 -63078 -58986 -11761 36856 57200 56719 37038 27747 18312 -3335
23560c335k8936L1188j242m090k5002m715l729J8225R615K5679J3294j0951l1143
$$ -3335 -32271 -1083 -2325 -6415 -31417 -36132 -39861 -21636 -12021 13658 26952 16001 -15142
23547a5142n002O467L4984O88k592N914q165j7466j0458O034m044K761j5211O18
$$ -15142 -20144 -13677 21307 21995 19403 25317 17152 -314 -10772 -4738 -8782 -6021 -21232 -20614
23533b0614j3329P332Q281J2419k4199K139Q993Q38j565n009q845q530L0641K4492
$$ -20614 -33943 -26611 -18330 -5911 -30110 -27971 -18978 -18140 -19705 -24714 -33559 -42089 -11448 13044
23519A3044k8767P694J0166j4336Q840J4529k0553L115R922L6028l123m4116l402
$$ 13044 -15723 -8029 2137 -12199 -3359 11170 -9383 -6268 3654 39682 36559 -7557 -10959
23506a0959J3201q583K312k29k7064j0207J3042J3581L403k7660P321O946J6135
$$ -10959 2242 -6341 -4029 -4258 -31322 -41529 -28487 -14906 -11503 -39163 -31842 -24896 -8761
23493h761J6152L960r143j0724L1636J0883j0776p268l0523j5782J0337K0746
$$ -8761 7391 11351 2208 -8516 23120 34003 23227 15959 -14564 -30346 -20009 737
23481G37j7665j2764J019j946j9481J3361J3214J1738k079j5384j3798M496p843
$$ 737 -16928 -29692 -28673 -30619 -50100 -36739 -23525 -11787 -13866 -29250 -43048 -38552 -46395
23468d6395L647J9321n617n383Q732q910k3332P627q441k3267J9622J9434K9435
$$ -46395 -42748 -23427 -29044 -34427 -25695 -34605 -57937 -50310 -58751 -82018 -62396 -42962 -13527
23455a3527L312n601O809m369K0521j464q198J1583L2816o205J5047r492q562
$$ -13527 -10215 -15816 -9007 -13376 7145 5681 -2517 9066 41882 35677 50724 41232 32670
23442C2670k380l3470K092l4811J5806J4858j1943j0353J5027R615o562K5717
$$ 32670 30290 -3180 -1088 -35899 -20093 -5235 -17178 -27531 -12504 -2889 -9451 16266
23430A6266K1990j7686m087j0658j9546k547O0n423J2517l680J793L4011O458
$$ 16266 38256 20570 16483 5825 -13721 -16268 -16208 -21631 -9114 -12794 -11001 23010 29468
23417B9468j7580o774o723j1303l048n949P094Q966j7868N909L0063K1171J7268
$$ 29468 11888 5114 -1609 -12912 -15960 -21909 -14815 -5849 -23717 -17808 12255 33426 50694
23404E0694q535P909P617j5608j5793k3031j5643P869k607O020j2515j3663l5510
$$ 50694 42159 50068 57685 42077 26284 3253 -12390 -4521 -7128 -1108 -13623 -27286 -62796
23391f2796l544j734K2264J8234L7462O504j0444q172k0872k8105J2968O2495
$$ -62796 -66340 -68074 -45810 -27576 9886 16390 5946 -2226 -23098 -51203 -38235 24260
23379B4260J8057l1024k7100o533J3795K4443j9902r8J402j0722k6224m223R423
$$ 24260 42317 11293 -15807 -22340 -8545 15898 -4004 -4102 -2700 -13422 -39646 -43869 -34446
23366c4446K8743J6983l3080j5163j2285J7700L3693o85q492P896L6417k716j772
$$ -34446 -5703 11280 -21800 -36963 -49248 -31548 2145 1460 -7032 864 37281 34565 32793
23353C2793O60K958j1857j9280J7656O253j0217j1885j1871l1763j437J1031M0789
$$ 32793 33453 36411 24554 5274 22930 29183 18966 7081 -4790 -36553 -37990 -26959 13830
23340A3830r376k446K0775k6039j0440N075M6094J5410l46J76n371l0412l1902
$$ 13830 4454 2008 22783 -3256 -13696 -8621 37473 52883 52537 52713 47342 16930 -14972
23327a4972k2342Q846K302J2117R47j3189Q85m396J2748K9222L645m9723j7917
$$ -14972 -37314 -28468 -26166 -14049 -13102 -26291 -25406 -29802 -17054 12168 15813 -33910 -51827
23314e1827O745K6936K1148K0495K482j0175m5758l0921M1080K4176l4721p593
$$ -51827 -45082 -18146 3002 23497 25979 15804 -29954 -60875 -19795 4381 -30340 -37933
23302c7933p42L3024J3196J149l503j0892J3758R942j4356j8793J4920P086M314
$$ -37933 -38675 -5651 7545 8694 5191 -5701 8057 17999 3643 -15150 -230 6856 11170
23289A1170P022k6005k2870K510o544K0736L300J3349K228j4171J6301K0313K3355
$$ 11170 18192 -7813 -30683 -28173 -34717 -13981 -10681 2668 4896 -9275 7026 27339 50694
23276E0694j2456j2919j6046J6543K2108j8682j5821j3867j4220j4229K3115o301
$$ 50694 38238 25319 9273 25816 47924 29242 13421 -446 -14666 -28895 -5780 -12081
23264a2081n74L2738K5378l438m789Q236j5720k3337J5780K4616l774r267N765
$$ -12081 -12655 20083 45461 42023 37234 45470 29750 6413 22193 46809 43035 33768 39533
23251C9533J2342j2733k4267k2068J1732j6598j4551J0263J0247J5942k3240q63
$$ 39533 51875 39142 14875 -7193 4539 -12059 -26610 -16347 -6100 9842 -13398 -14261
23239a4261M780j385J5295N464J1269J5133k0397l5654j8254k621J7621L603m424
$$ -14261 -9481 -10866 4429 9893 21162 36295 15898 -19756 -38010 -40631 -23010 -19407 -23831
23226b3831O761N464J9395J5847j5081k0169n658o1j5005J3842K0009M2140j2364
$$ -23831 -17070 -11606 7789 23636 8555 -11614 -17272 -17333 -32338 -18496 1513 43653 31289
23213C1289k7484m788j3893M581J0856j8113n016j8029j5860o098J7864J0435
$$ 31289 3805 -983 -14876 -10295 561 -17552 -22568 -40597 -56457 -62555 -44691 -34256
23201c4256N790N640m197k0527r557j651J3880J3068K6957p26N767Q631j6433
$$ -34256 -28466 -22826 -27023 -47550 -57107 -58758 -44878 -31810 -4853 -5579 188 8819 -7614
23188g614q452k993j0978M658K4229K0644L561l8276j0888J2532J6285k2234l6670
$$ -7614 -16066 -19059 -30037 -25379 -1150 19494 23055 -15221 -26109 -13577 2708 -19526 -56196
23175e6196r303J9148K4868j252j1892j4029j612O675K9416K5010j8155j8065
$$ -56196 -65499 -46351 -21483 -22735 -34627 -48656 -50268 -43593 -14177 10833 -7322 -25387
23163b5387J8187J5207L727k324J6302j2543k8268L4498J1940J172k8202j2295
$$ -25387 -7200 8007 11734 9410 25712 13169 -15099 19399 31339 32511 4309 -7986
23151g986K2318J7584K031m595P316r090j2358J4226p409j1258j3279n0488k2379
$$ -7986 14332 31916 33947 29352 36668 27578 15220 29446 22037 10779 -2500 -52988 -75367
23138g5367J0210J9225L1036j6214k5372J1446L8633J4900Q081m884k1822j3570
$$ -75367 -65157 -45932 -14896 -31110 -56482 -45036 -6403 8497 16578 11694 -10128 -23698
23126b3698N425J8563R445J9031l1098P081j7885j9282Q123K5740J0151M818k342
$$ -23698 -18273 290 9735 28766 -2332 4749 -13136 -32418 -24295 1445 11596 16414 14072
23113A4072L932m518k6607k621k4247k6178k2237q99K0805N936L7582K1059j8454
$$ 14072 18004 13486 -13121 -15742 -39989 -66167 -88404 -89303 -68498 -62562 -24980 -3921 -22375
23100b2375j5288N011J2351j330O080q874J858L4073o889j6044N647J2825k197
$$ -22375 -37663 -32652 -20301 -21631 -15551 -24425 -22567 11506 4617 -11427 -5780 7045 4848
23087D848K0591M227j1417P044j7536P138K7549j5154j5333j8195j7833K0725
$$ 4848 25439 29666 18249 25293 7757 14895 42444 27290 11957 -6238 -24071 -3346
23075c346K5621J1089M233j376k0905k0965R820j4822J4467J7452n422m639J9294
$$ -3346 22275 33364 37597 36221 15316 -5649 4171 -10651 3816 21268 15846 11207 30501
23062C0501j6154j9321q960J0096P958L6543J9906j5520j352k432L60p781j9177
$$ 30501 14347 -4974 -13934 -3838 4120 40663 60569 45049 43697 41265 41625 33844 14667
23049A4667O109o415p028K160o897j689k8314p031R319k2748J8307N652R170K5031
$$ 14667 20776 14361 7333 9493 2596 907 -27407 -34438 -25119 -47867 -29560 -23908 -14738 10293
23035A0293n483J0535K4169O856P217j5888l9355k0689J3729Q247J9901K1384
$$ 10293 4810 15345 39514 46370 53587 37699 -1656 -22345 -8616 -369 19532 40916
23023D0916k1946k3618M846l903n495j0348P881j3576l868K0524J6969K653k3579
$$ 40916 18970 -4648 198 -3705 -9200 -19548 -11667 -25243 -29111 -8587 8382 11035 -12544
23010a2544l8337Q281K0824R82j9036m866K6841j1597M06J8548R834N880r203
$$ -12544 -50881 -42600 -21776 -20794 -39830 -44696 -17855 -29452 -29046 -10498 -664 5216 -3987
22997c987R023J178K7366J8443o11j0566m76Q956j2680j3329j9532j1694r178
$$ -3987 5036 6214 33580 52023 51412 40846 40370 49326 36646 23317 3785 -7909 -17087
22984a7087p532K4311K2893k4442J354K2965K1977j6569r507j2059r674l6817
$$ -17087 -24619 -308 22585 -1857 -503 22462 44439 27870 18363 6304 -3370 -40187
22972d0187k1312K0880l59j257M2851m80P451J0923l8903j9630n199K3191P215
$$ -40187 -61499 -40619 -40978 -42235 616 136 7587 18510 -20393 -40023 -45222 -22031 -14816
22959a4816n502m919Q265p861k0426m875o908l825M478l524J2416L1768k04L413
$$ -14816 -20318 -25237 -16972 -24833 -45259 -50134 -57042 -60867 -56389 -59913 -47497 -15729 -15933 -12520
22945a2520J1123M610j540r083R876j8571K244J7268Q822R472j6815l8777J6958
$$ -12520 -1397 3213 1673 -7410 2466 -16105 -13861 3407 12229 21701 4886 -33891 -16933
22932a6933K6995k345k3347n378j0924n529N76l9775k021L6006M5623K9960J6738
$$ -16933 10062 7717 -15630 -21008 -31932 -37461 -36885 -76660 -78681 -42675 2948 32908 49646
22919D9646j4260k9601p005j048j6221J0563K2157k1575k9741j5352K320J0925
$$ 49646 35386 5785 -1220 -2268 -18489 -7926 14231 -7344 -37085 -52437 -50117 -39192
22907c9192J6826J0688O901J7359Q538p584q53j6355j2720M086K3261j649k4542
$$ -39192 -22366 -11678 -4777 12582 21120 13536 12683 -3672 -16392 -12306 10955 9306 -15236
22894a5236L164J5552j1200J2226Q987q128j2151K7785J2555l7775l538k047J7821
$$ -15236 -12072 3480 -7720 4506 13493 5365 -6786 20999 33554 -4221 -7759 -9806 8015
22881H015Q873r632Q663K0817L2561p125j8421m6179j1404K8677k22j0628j0194
$$ 8015 16888 7256 15919 36736 69297 62172 43751 -2428 -13832 14845 14623 3995 -6199
22868f199J1096K060K1830l769L716J4374l0986P507R429l299j3663j3974P425
$$ -6199 4897 6957 28787 25018 28734 43108 12122 19629 29058 25759 12096 -1878 5547
22855E547J1300n929j7232l536J7441L569j8743j1426Q756J9886K624k3488p6
$$ 5547 16847 10918 -6314 -9850 7591 11160 -7583 -19009 -10253 9633 12257 -11231 -11307
22842a1307l499j3940M854R192J9471P745j0330q560O858M3110M6732m306J2996
$$ -11307 -14806 -28746 -23892 -14700 4771 12516 2186 -6374 484 43594 90326 86020 99016
22829I9016j9775l0774r495k049k3946j8779M000o293j1552j260k5868j2944M201
$$ 99016 79241 48467 38972 36923 12977 -5802 -1802 -8095 -19647 -20907 -46775 -59719 -55518
22816e5518J0740M758J5747K9727J0874o7k0423p652J4113J2096j0213J2942Q651
$$ -55518 -44778 -40020 -24273 5454 16328 16261 -4162 -11814 2299 14395 4182 17124 25775
22803B5775j269J54j5209J254l1519M840K6490J5053J3109J760l084l7035k9990
$$ 25775 24506 24660 9451 10705 -20814 -15974 10516 25569 38678 40438 37354 319 -29671
22790b9671J6885j100J5553K5020N773k1926j7160P496o130l0962J188K4396n388
$$ -29671 -12786 -13886 1667 26687 32460 10534 -6626 870 -5260 -36222 -35034 -10638 -16026
22777a6026j8680M808J8257J4030n579j1568R399J0718j3107k0997j4030M8901
$$ -16026 -34706 -29898 -11641 2389 -3190 -14758 -5359 5359 -7748 -28745 -42775 6126
22765F126M186p831j7660J0145j5346m0155j6744J3987L5044K8442o828m8307
$$ 6126 10312 2481 -15179 -5034 -20380 -60535 -77279 -63292 -28248 194 -6634 -54941
22753e4941J1059K0782Q64M606J0875O146J3935J0108j9764j2073Q195L491l3746
$$ -54941 -43882 -23100 -22236 -17630 -6755 -609 13326 23434 3670 -8403 -208 3283 -30463
22740c0463N885O202l0637J8405J3277o341k5096O368M678L712j6766J0998K6327
$$ -30463 -24578 -18376 -49013 -30608 -17331 -23672 -48768 -42400 -37722 -34010 -50776 -39778 -13451
22727a3451R851j3120r819j2698n16J215J1585k5339J1107J0223J856M9068J3817
$$ -13451 -3600 -16720 -26539 -39237 -39753 -38538 -26953 -52292 -41185 -30962 -29106 19962 33779
22714C3779l9018m5478R736K3941j0668j4083K1536K547J0891Q385K2472j5137
$$ 33779 -5239 -50717 -40981 -17040 -27708 -41791 -20255 -17708 -6817 1568 24040 8903
22702H903r348j7325J0595j973j004q52K0802M290r677K026L019P905n504k3338
$$ 8903 -445 -17770 -7175 -9148 -10152 -11004 9798 14088 4411 6437 9456 17361 11857 -11481
22688a1481j3977l261l1871J2230L0816n735O699J1513K0931j3567l5284k883
$$ -11481 -25458 -28719 -60590 -48360 -17544 -23279 -16580 -5067 15864 2297 -32987 -35870
22676c5870K5332M500n712J4981Q97K2084m808k8375J6109j3801k5766J2114J8108
$$ -35870 -10538 -6038 -11750 3231 4128 26212 21404 -6971 9138 -4663 -30429 -18315 -207
22663b07L314k560o333k7470N004R809k893r047j4925L0197Q046n794K4855j9421
$$ -207 3107 547 -5786 -33256 -28252 -18443 -21336 -30383 -45308 -15111 -7065 -12859 11996 -7425
22649g425j0158k1382K8751J8941j0198j010j6339k0326j6868K7013J2451K0255
$$ -7425 -17583 -38965 -10214 8727 -1471 -2481 -18820 -39146 -56014 -29001 -16550 3705
22637C705j2889k4632j1150L1381o158Q341L9755j4200l7681j0067K0189J6743
$$ 3705 -9184 -33816 -44966 -13585 -19743 -11402 28353 14153 -23528 -33595 -13406 3337
22625C337J6173p12j7350n992j2495Q812K1784q921k1755j9362P052J6204J0424
$$ 3337 19510 18798 1448 -4544 -17039 -8227 13557 4636 -17119 -36481 -29429 -13225 -2801
22612b801j0721p107M2224K3619n284l0790n002l6913j4193M508J4656K3355K552
$$ -2801 -13522 -20629 21595 45214 39930 9140 4138 -32775 -46968 -42460 -27804 -4449 -1897
22599a897K283k266l2470J302J6574K3695L6880J7990l2537k3089P084J9879l6153
$$ -1897 386 -1880 -34350 -33048 -16474 7221 44101 62091 29554 6465 13549 33428 -2725
22586b725K290J1352q823P259j629n944J5774o45j4751j2995k1177p625K8188
$$ -2725 -435 10917 2094 9353 7724 1780 17554 16909 2158 -10837 -32014 -39639 -11451
22573a1451J9308l3331N213P447M714O658N02P834o714j0585j9855J3335J6984
$$ -11451 7857 -25474 -20261 -12814 -8100 -1442 -940 6894 180 -10405 -30260 -16925 59
22560E9k6600j6966K1917K586j4093j6902q722k712J8352L3386q041k2108m48
$$ 59 -26541 -43507 -21590 -19004 -33097 -49999 -58721 -61433 -43081 -9695 -17736 -39844 -40292
22547d0292R108l15R058N409q120q700P890P67J4128l367j2453r415M362j1035
$$ -40292 -31184 -31499 -22441 -17032 -25152 -33852 -25962 -25195 -11067 -14434 -26887 -36302 -31940 -42975
22533d2975k152M2271J8109J2113k6458l1038N04J0148J6913o879o630n297l782
$$ -42975 -45127 -2856 15253 27366 908 -30130 -29626 -19478 -2565 -9444 -16074 -21371 -25153
22520b5153P040O722j6036k1457o34J1401j9992k2388K7086K5744j69J1693J9262
$$ -25153 -18113 -11391 -27427 -48884 -49518 -38117 -58109 -80497 -53411 -27667 -27836 -16143 3119
22507C119j3536l5564k166R893K5040L6162N948k5333R333J2030K094j4819k4151
$$ 3119 -10417 -45981 -48147 -38254 -13214 22948 28896 3563 12896 24926 27020 12201 -11950
22494a1950K8065o100k7110n244L061N734j3708P22k708L439J3266q985P691n470
$$ -11950 16115 10015 -17095 -22339 -19278 -13544 -27252 -26530 -29238 -25799 -12533 -21518 -13827 -19297
22480a9297j3148L6953M5283J70l2714Q264K0553j8383l7753q061J078n698j035
$$ -19297 -32445 4508 49791 49961 17247 25511 46064 27681 -10072 -18133 -17055 -22753 -23788
22467b3788K983J9593N763J290J6033j5510J4109j4848m1159o788K4290K248M140
$$ -23788 -20805 -1212 4551 5841 21874 6364 20473 5625 -35534 -42322 -18032 -15784 -11644
22454a1644j2964j7824J990J6645L494l129P878j844J5973o170J776P434J2395
$$ -11644 -24608 -42432 -40442 -23797 -20303 -23432 -15554 -17398 -1425 -7595 -5819 1615 14010
22441A4010K4193o874j9191j762q912k503m908m710l811J0322J8188k909l046
$$ 14010 38203 31329 12138 10376 1464 -1039 -5947 -10657 -14468 -4146 14042 11133 8087
22428H087R235j0139k0953k0828K3303K0548K1025K717r508j8752k4632j0161
$$ 8087 17322 7183 -13770 -34598 -11295 9253 30278 32995 23487 4735 -19897 -30058
22416c0058n779K6343R518j871J3523J1598m0081M860J9500J8844M589j0755j4640
$$ -30058 -35837 -9494 24 -1847 11676 23274 -16807 -11947 7553 26397 30986 20231 5591
22403E591k2537J5785K5017p343j2326j0204o9j1465j8745J5605O394J8347L3809
$$ 5591 -16946 -1161 23856 16513 4187 -6017 -6086 -17551 -36296 -20691 -14297 4050 37859
22390C7859k5495j1905j6176J0264K6002k880j0947j5679k3320j0818P41j066
$$ 37859 12364 459 -15717 -5453 20549 17669 6722 -8957 -32277 -43095 -42354 -43420
22378d3420j0123j765K0872K0461l9161n502N828L3690r515K2336K9597L0427
$$ -43420 -53543 -55308 -34436 -13975 -53136 -58638 -52810 -19120 -28635 -6299 23298 53725
22366E3725k763k6919k2309K0014q806j5524J0315j5021j3213o584J3933J1556
$$ 53725 50962 24043 1734 21748 12942 -2582 7733 -7288 -20501 -27085 -13152 -1596
22354a596o992J1146j1688j3749J5899m213J5145j7481K585R235k6208j0751o14
$$ -1596 -8588 2558 -9130 -22879 -6980 -11193 3952 -13529 -10944 -1709 -27917 -38668 -39282
22341c9282K0213l512k6120M657K1950J0486j509m163J7790m173J2405k193Q373
$$ -39282 -19069 -22581 -48701 -44044 -22094 -11608 -13117 -17280 510 -3663 8742 6549 14922
22328A4922M707J4562k2370k7695J6062k43k0685j4231O566N84p810K225Q341
$$ 14922 19629 34191 11821 -15874 188 -55 -20740 -34971 -28405 -27821 -35631 -33406 -25065
22315b5065J1382J0640O739M211J968J4455k2659J0404J8910j8440J867P768K996
$$ -25065 -13683 -3043 3696 7907 9875 24330 1671 12075 30985 12545 14412 22180 25176
22302B5176m754j2376n52p800k7874l474k79m488o650J7876K8691l923j1173K0703
$$ 25176 20422 8046 7494 -306 -28180 -31654 -31933 -36421 -43071 -25195 3496 -427 -11600 9103
22288I103j822l0829j5609J8835N664l0360M999J3487n274j2640J0589P217K2893
$$ 9103 7281 -23548 -39157 -20322 -14658 -45018 -40019 -26532 -31806 -44446 -33857 -26640 -3747
22275c747r24j8243N097J9856J3799K145j3589j3245j443j4675q360Q227J7290
$$ -3747 -4671 -22914 -17817 2039 15838 17983 4394 -8851 -10294 -24969 -33329 -25102 -7812
22262g812Q647p772O076K6405J3592K228Q219r25l2979k9298K6P27j0124q03K7204
$$ -7812 835 -6937 -861 25544 39136 41364 49583 48658 15679 -13619 -13593 -12866 -22990 -23793 3411
22247C411J1517k0504l1127n395M464R836L462L001k2222Q354J5476K1880R27
$$ 3411 14928 -5576 -36703 -42098 -37634 -27798 -24336 -21335 -43557 -35203 -19727 2153 3080
22234C080l00Q915j2265r505j2013l934M591J3382o497Q206O126l8659J1051Q116
$$ 3080 2780 11695 -570 -10075 -22088 -26022 -21431 -8049 -14546 -6340 -214 -38873 -27822 -19706
22220a9706J0079J867L4551N323j3511L704j4388p647J2390j170N582j1130J6468
$$ -19706 -9627 -7760 26791 32114 18603 22307 7919 272 12662 11492 17074 5944 22412
22207B2412l707k3823K260K831K689K388k34Q297k5477l0822O869K189Q436J5950
$$ 22412 18705 -5118 -2858 -27 2662 5050 4816 13113 -12364 -43186 -36317 -34128 -25692 -9742
22193i742M0048J3720l2594l2751j3970J4064J8680j0832K4987K2922k6988l2193
$$ -9742 30306 44026 11432 -21319 -35289 -21225 -2545 -13377 11610 34532 7544 -24649
22181b4649k762J5906J2215L5332P735k6815k7413l795j3221k0753k198J8642
$$ -24649 -27411 -11505 710 36042 43777 16962 -10451 -14246 -27467 -48220 -50418 -31776
22169c1776J4304q63k3910l650n349J8571K3270J9404J9468j8070n099J6604K3754
$$ -31776 -17472 -18335 -42245 -45895 -51244 -32673 -9403 10001 29469 11399 6300 22904 46658
22156D6658R933r722l1980R01J9324k1644M387J2373l0602k0022O943M204l84
$$ 46658 56591 46869 14889 15790 35114 13470 17857 30230 -372 -20394 -13451 -9247 -9631
22143i631j228Q521j4243j1266j3663J5776J0203k3223J9321K7049j1855o407
$$ -9631 -10859 -2338 -16581 -27847 -41510 -25734 -15531 -38754 -19433 7616 -4239 -10646
22131a0646J8141n2M655k9623j5382q33n002p301L7443K6099J0277j1654j6015
$$ -10646 7495 7443 12098 -17525 -32907 -33740 -38742 -46043 -8600 17499 27776 16122 107
22118A07J8066j9437M571p128j0546l2827k9843K2177L1626K4658M98J1819P570
$$ 107 18173 -1264 3307 -3821 -14367 -47194 -77037 -54860 -23234 1424 1922 13741 21311
22105B1311q488p988q453l1166l4192K0020L9467K2923J5239j5399o313K5619
$$ 21311 12823 4835 -3618 -34784 -68976 -48956 -9489 13434 28673 13274 6961 32580
22093C2580J2532k528j5579k0757r985K661M79R641q916l771k0408k3638J5010
$$ 32580 45112 42584 27005 6248 -3737 -1076 -597 9044 128 -3643 -24051 -47689 -32679
22080c2679J4065J443n679K2359J1717j2509j1915r843K7671K2255k2856k3789
$$ -32679 -18614 -17171 -22850 -491 11226 -1283 -13198 -23041 4630 26885 4029 -19760
22068a9760q033k9718J133K5576J9121O134j7069m701L595J3767J7362J1618l2211
$$ -19760 -27793 -57511 -56378 -30802 -11681 -5547 -22616 -27317 -23722 -9955 7407 19025 -13186
22055a3186k7514n357K4385L4876j4004l9194J0531j5087O550J5753QJ0392K7297
$$ -13186 -40700 -46057 -21672 13204 -800 -39994 -29463 -44550 -38000 -22247 -22239 -11847 15450
22042A5450n77n694J9219K9330R600j900o4586L687J5262R271r530j5830m0841
$$ 15450 14873 9179 28398 57728 67328 65428 842 4529 19791 29062 19532 3702 -37139
22029c7139l7120j2367L1606J5529K1892J9885p053j631K999M563k3598l601j1181
$$ -37139 -74259 -86626 -55020 -39491 -17599 2286 -4767 -6398 -3399 1164 -22434 -26035 -37216
22016c7216J5708Q042k5269j3714m463J3408J6804P229K8840J8345m192r648O432
$$ -37216 -21508 -13466 -38735 -52449 -56912 -43504 -26700 -19471 9369 27714 23522 13874 20306
22003B0306J461K861k2810j0446J9977J7320k0448m195J5839q462k8712J4198
$$ 20306 21767 24628 1818 -8628 11349 28669 8221 4026 19865 11403 -17309 -3111
21991c111J9973k1272k3611j37K5964k324q686l4786j9515R837O864N909j2441
$$ -3111 16862 -4410 -28021 -28158 -2194 -4518 -13204 -47990 -67505 -57668 -50804 -44895 -57336
21978e7336J0179L422P106K508j6998J5757J178K6154K3321j5840R985n940M197
$$ -57336 -47157 -43735 -36629 -34121 -51119 -35362 -34184 -8030 15291 -549 9436 3496 7693
21965G693j2704m732K163K4601J4600j5603j5020N424J807Q296q736k1892l631
$$ 7693 -5011 -9743 -7580 17021 31621 16018 998 6422 8229 16525 7789 -14103 -17734
21952a7734J5870K974k8360l4027R231K2929J0916k839K442J4970L1012J6823
$$ -17734 -1864 1110 -27250 -61277 -52046 -29117 -18201 -21040 -18598 -3628 27384 44207
21940D4207j1868k289j7437j7014J6234n39J8243l615o633J0700j8476j5354j9879
$$ 44207 32339 30050 12613 -4401 11833 11294 29537 25922 19289 29989 11513 -3841 -23720
21927b3720p102j2395P971K1945K2026J982r581J1422K0029l656k2471j7129J7787
$$ -23720 -30822 -43217 -35246 -13301 8725 10707 1126 12548 32577 28921 6450 -10679 7108
21914G108P927n606q232R930k664l556j1458l3522k3814J5187K4403J72Q544K2271
$$ 7108 15035 9429 1197 11127 8463 4907 -6551 -40073 -63887 -48700 -24297 -24125 -15581 6690
21900F690K375q734J2826N096j2326l156J548R247K3686N641Rk2977M280M262
$$ 6690 9065 331 13157 18253 5927 2771 4319 13566 37252 42893 42902 19925 24205 28467
21886B8467k6540p738J9878R451o918P693J1898l9151k3803J0191j4704j1304
$$ 28467 1927 -5811 14067 23518 16600 24293 36191 -2960 -26763 -16572 -31276 -42580
21874d2580J3272J4544L084q951n853K346N324L26J271j3072n219K419o077O654
$$ -42580 -29308 -14764 -11680 -20631 -26484 -24138 -18814 -18488 -17217 -30289 -35508 -33089 -39166 -32512
21860c2512J7286K8041K9711m790j919M963j5452j2759J4530k0694L721n373j9586
$$ -32512 -15226 12815 42526 37736 35817 40780 25328 12569 27099 6405 10126 4753 -14833
21847a4833o271K1425K5658j7544l8054l951J9112K360P200m709k4518J5136r212
$$ -14833 -21104 321 25979 8435 -29619 -33570 -14458 -12098 -4898 -9607 -34125 -18989 -28201
21834b8201j7821K195L7687L9581L673j7902k7157J4257M082o200j739K2833n574
$$ -28201 -46022 -43827 -6140 33441 37114 19212 -7945 6312 10394 4194 2455 25288 19714
21821A9714r640k1298J883J4431Q547k1563j4003q931K066M363j8818K235J3180
$$ 19714 10074 -11224 -9341 5090 13637 -7926 -21929 -30860 -28794 -24431 -43249 -41014 -27834
21808b7834J0250K1456J1804m950j6004N074P442J1676q565j353N548j2525k1820
$$ -27834 -17584 3872 15676 10726 -5278 -204 7238 18914 10349 8996 14544 2019 -19801
21795a9801j331Q066K729K2560P266j3124j0794J5138j6512k2499N165K2773k605
$$ -19801 -21132 -13066 -10337 12223 19489 6365 -4429 10709 -5803 -28302 -23137 -364 -2969
21782b969K6272k545j7786Q489j504l3153l4043j890J4258J419j0251O236o74
$$ -2969 23303 20758 2972 11461 9957 -23196 -57239 -59129 -44871 -43452 -53703 -47467 -48141
21769d8141P238L3323L0331M845k8266J55L993l413j0502P78O740n90K262n973
$$ -48141 -40903 -7580 22751 27596 -670 -515 3478 65 -10437 -9659 -2919 -3509 -1247 -7220
21755g220j6164k738L143J5168K0237j254j2530r072N335j6312m702K6269J8038
$$ -7220 -23384 -26122 -22979 -7811 12426 11172 -1358 -10430 -5095 -21407 -26109 160 18198
21742A8198r409j9615l7014O966M343J7771l1309k7687q753j183J0258L7057P118
$$ 18198 8789 -10826 -47840 -40874 -36531 -18760 -50069 -77756 -86509 -87692 -77434 -40377 -33259
21729c3259o136J8957L82K0732P787P684n972k4501l088m257P142k0179j2087
$$ -33259 -39395 -20438 -20056 676 8463 16147 10175 -14326 -17414 -21671 -14529 -34708 -46795
21716d6795o282n997L6933L930l420m061O610O873J7191J6344L449j4638r428
$$ -46795 -53077 -59074 -22141 -18211 -21631 -25692 -19082 -12209 4982 21326 24775 10137 709
21703G09L2881J1762k1936j6228O684l2522j5096L690J8807J495J8370J4683l543
$$ 709 33590 45352 23416 7188 13872 -18650 -33746 -30056 -11249 -9754 8616 23299 19756
21690A9756k0458j197k735o353J4278N127O96j5514k941P438j366j9476n837J3984
$$ 19756 -702 -1899 -4634 -10987 3291 8418 9114 -6400 -9341 -1903 -3269 -22745 -28582 -14598
21676a4598J9937J2285k698r547J35K8799j4165j4472k249K051L119L3759L09
$$ -14598 5339 17624 14926 5379 5514 34313 20148 5676 3427 5478 8597 42356 42665
21663D2665k1544R73k4169j1231N099N047K939r686K450j72l1090N304L4990l52
$$ 42665 21121 22094 -2075 -13306 -8207 -3160 -221 -9907 -7457 -7629 -38719 -33415 1575 1223
21649A223k750J3018J3085N69j1814R37l125k3572k6078L409k3606K6774K8948
$$ 1223 -1527 11491 24576 25145 13331 14268 11143 -12429 -38507 -35098 -58704 -31930 -2982
21636b982P644J5756N389l4749k762J2498K7051k2781k0839k0722m530J6661M3602
$$ -2982 4662 20418 25807 -8942 -11704 794 27845 5064 -15775 -36497 -41027 -24366 19236
21623A9236K607k8753l0184K9136n066j6505O355J3845P432J2185J0062j690M239
$$ 19236 21843 -6910 -37094 -7958 -13024 -29529 -23174 -9329 -1897 10288 20350 18660 22899
21610B2899k6443k3240k4592n374K6744J4452l3618j5925K2294K0646R563Q813
$$ 22899 -3544 -26784 -51376 -56750 -30006 -15554 -49172 -65097 -42803 -22157 -12594 -3781
21598c781j5108j1802Q260J796J1226K1638K0864O694k6264p37M383j3871o063
$$ -3781 -18889 -30691 -22431 -20635 -9409 12229 33093 39787 13523 12786 17169 3298 -2765
21585b765J8415N3375K7467j9077k5142j2661m3074l5658N516M596r066k8188
$$ -2765 15650 69025 96492 77415 52273 39612 -3462 -39120 -33604 -29008 -38074 -66262
21573f6262j3525J3248M5207L346m8712J923L8880K6686N651j6597m0023l725
$$ -66262 -79787 -66539 -21332 -17986 -66698 -64775 -25895 791 6442 -10155 -50178 -53903
21561e3903j163m322J5596K5271J9380K550J3342K8049j4909o1080j458l304M031
$$ -53903 -55066 -59388 -43792 -18521 859 3409 16751 44800 29891 -31189 -32647 -35951 -31920
21548c1920J6999J3829K4867n082j1578K4432J9256j5555r405j0381j7154r666
$$ -31920 -14921 -1092 23775 18693 7115 31547 50803 35248 25843 15462 -1692 -11358
21536a1358j9428k2764P331L3917J20J0404K5265K299l7390J9341j0927j3479
$$ -11358 -30786 -53550 -46219 -12302 -12182 -1778 23487 25786 -11604 7737 -3190 -16669
21524a6669M210J9657R739R715J7786j6716l1287j5539Q070m687J5182j8653m823
$$ -16669 -12459 7198 16937 26652 44438 27722 -3565 -19104 -11034 -15721 -539 -19192 -24015
21511b4015J1427m982M544J2138m286K250J8910n305k1061P839J0181l461m506
$$ -24015 -12588 -17570 -13026 -888 -5174 -2924 15986 10681 -10380 -2541 7640 4179 -327
21498c27J2041J6244j0413K927j8004p227j600K308L511j0912P627J3524l425
$$ -327 11714 27958 17545 20472 2468 -4759 -6359 -4051 -540 -11452 -3825 9699 6274
21485F274J1368J3733K4442l4700M451J377q981K695j9947m872M295Q1Q848K0506
$$ 6274 17642 31375 55817 21117 25568 26945 17964 20659 712 -4160 135 216 9064 29570
21471B9570K5845k1812l5200j6025k0637K8802L7773M242j757j4324l552m2003
$$ 29570 55415 33603 -1597 -17622 -38259 -9457 28316 32558 30801 16477 12925 -29078
21459b9078k4996K1383L8685K2518j9979j8630j3788L353m590O108Q928L842K4475
$$ -29078 -54074 -32691 5994 28512 8533 -10097 -23885 -20532 -25122 -19014 -10086 -6244 18231
21446A8231J6088k4671j0719J2464K4086k0875p198l269k3177k9681Q590L0872
$$ 18231 34319 9648 -1071 11393 35479 14604 7406 4137 -19040 -48721 -40131 -9259
21434i259j9791l995j6551P143J1818j1690Q712J5703J1347J0631J356j6780L937
$$ -9259 -29050 -33045 -49596 -42453 -30635 -42325 -33613 -17910 -6563 4068 5424 -11356 -7419
21421g419q206R974K7283k0879j9018j7973k7905J3055K0106K7112K0091o144
$$ -7419 -15625 -5651 21632 753 -18265 -36238 -64143 -51088 -30982 -3870 16221 10077
21409A0077l691j0135m108L4157J4942j0335k0772P384k1609N062m230k4914j2196
$$ 10077 6386 -3749 -7857 26300 41242 30907 10135 17519 -4090 972 -3258 -28172 -40368
21396d0368J0448L4110M4005o906l4729l0454N687L1996K1867j1700o393J0178
$$ -40368 -29920 4190 48195 41289 6560 -23894 -18207 13789 35656 23956 17563 27741
21384B7741J9936j8249k5571m836j9936j8221j3321J4059J6596M047K1213q503
$$ 27741 47677 29428 3857 -979 -20915 -39136 -52457 -38398 -21802 -17755 3458 -5045
21372e045O051Q136l635J1592J0730N103j7128p509j0519Q912J0375j3443K0785
$$ -5045 1006 9142 5507 17099 27829 32932 15804 8295 -2224 6688 17063 3620 24405
21359B4405O799r479k6066r5L470n929k9164k2328J1033J3198J780J0922K005
$$ 24405 31204 21725 -4341 -4436 -966 -6895 -36059 -58387 -47354 -34156 -32376 -21454 -19449
21346a9449o289l776k249M3622K0667n688n291m545q352j163R345J4783j2203
$$ -19449 -25738 -29514 -31763 11859 32526 26838 21547 17002 8650 7487 16832 31615 19412
21333A9412j3320j0094J2468J2787j0507l042k3134q979N217J7751K3071k6616
$$ 19412 6092 -4002 8466 21253 10746 7704 -15430 -24409 -19192 -1441 21630 -4986
21321d986M179Q728j612K3620k1414l001L218k9562r482J2923M065p170r907j3857
$$ -4986 -807 7921 6309 29929 8515 5514 8732 -20830 -30312 -17389 -13324 -20494 -30401 -44258
21307d4258J739l453L6606J4087j2558j176N53K0070J1823p342q134N952O86k9695
$$ -44258 -42519 -45972 -9366 4721 -7837 -9013 -8460 11610 23433 16091 7957 13909 14595 -15100
21293a5100r122q891q832K0133J4458J5533J1197N138J820k6887j1432J1510j9457
$$ -15100 -24222 -33113 -41945 -21812 -7354 8179 19376 24514 26334 -553 -11985 -475 -19932
21280a9932j8769q35j1713R546M8972j2043m1216J6147K5581M240K4017M4785
$$ -19932 -38701 -39536 -51249 -41703 7269 -4774 -45990 -29843 -4262 -22 23995 68780
21268F8780K710k2250m795o523j2411j1787J1493m411k0893J874j765j5358P739
$$ 68780 71490 49240 44445 37922 25511 13724 25217 20806 -87 1787 22 -15336 -7597
21255g597N497l221K5973N513k670q106N404r653k302J4890K2258m571j1197j1184
$$ -7597 -2100 -5321 20652 26165 23495 15389 20793 11140 8838 23728 45986 41415 30218 19034
21241A9034K100n438k0184L993J7900Q362j5354k9860R572r305j3649J4352k6719
$$ 19034 21134 15696 -4488 -495 17405 25767 10413 -19447 -9875 -19180 -32829 -18477 -45196
21228d5196J3384Q193K1584o086j4227M894J1688J2854k1037j1074J129l837J7454
$$ -45196 -31812 -23619 -2035 -8121 -22348 -17454 -5766 7088 -13949 -25023 -23894 -27731 -10277
21215a0277J7999r816j3415Q131n717k4512N456P675K8656J4676n948J4957J7844
$$ -10277 7722 -2094 -15509 -7378 -13095 -37607 -32151 -24476 4180 18856 12908 27865 45709
21202D5709k6873k4231J4267K0131q587j6991Q402o14j6071k4263j6528J8416
$$ 45709 18836 -5395 8872 29003 20416 3425 11827 11213 -4858 -29121 -45649 -27233
21190b7233M0531P436m089r671Q510J258K733J2391k6876k4029L119K9553L795
$$ -27233 13298 20734 16645 6974 15484 16742 19475 31866 4990 -19039 -15920 13633 17428
21177A7428m566j1398n471Q614N523l072K387n719j2775k0145J8092m201k6236
$$ 17428 12862 1464 -4007 4607 10130 7058 9445 3726 -9049 -29194 -11102 -15303 -41539
21164d1539k5563k620Q650K384J6927J8256Q9Q666R782j0240j0031J2402J1004
$$ -41539 -67102 -69722 -61072 -58688 -41761 -23505 -23416 -14750 -4968 -15208 -25239 -12837 -1833
21151a833j5409l0379k2284J0328J7145K5714J7142K4715N938l8723L810P047
$$ -1833 -17242 -47621 -69905 -59577 -42432 -16718 424 25139 31077 -7646 -3836 3211
21139C211J2060J618j5013L94m807K6549J1048k1369k2639l0556j1114Q637K5991
$$ 3211 15271 16889 1876 2270 -2537 24012 35060 13691 -8948 -39504 -50618 -41981 -15990
21126a5990j835l1116J0887K7946J6774J7366o683k3145J8178j7860q478m164
$$ -15990 -17825 -48941 -38054 -10108 6666 24032 17349 -5796 12382 -5478 -13956 -18120
21114a8120L364j084j3692r339J924k77Q374J0531K308J7559n48j3274j2965J8769
$$ -18120 -14756 -15840 -29532 -38871 -36947 -37224 -28850 -18319 -16011 1548 1000 -12274 -25239 -6470
21100f470K3808r048n893k4755j3768L0424K4728q865l2984o186K2187L9221P085
$$ -6470 17338 8290 2397 -22358 -36126 -5702 19026 10161 -22823 -29009 -6822 32399 39484
21087C9484r80l3344k6354J6257K0097J7980j3436P667j6470k8100N239M328K5672
$$ 39484 38504 5160 -21194 -4937 15160 33140 19704 27371 10901 -17199 -11960 -7632 18040
21074A8040J2257j1724k0581m364m1721J1051K2881J7802j3129k8106k068K6616
$$ 18040 30297 18573 -2008 -6372 -48093 -37042 -14161 3641 -9488 -37594 -39662 -13046
21062a3046N992l831J5652J1802k9003o504R152M015m725n599K2328J5103R018
$$ -13046 -7054 -10885 4767 16569 -12434 -18938 -9786 -5771 -10496 -16095 6233 21336 30354
21049C0354j5713K110K2307n685q538k4402M455K917j0069K708O152k5091j8192
$$ 30354 14641 16751 39058 33373 24835 433 4888 7805 -2264 444 6596 -18495 -36687
21036c6687j9371J9935Q161j5982j521p677k6921o86J0083M62J2491M7616R867
$$ -36687 -56058 -36123 -27962 -43944 -45465 -53142 -80063 -80749 -70666 -70204 -57713 -10097 -230
21023b30o483j995n697q051k008j576R625J3010M504k530j7394q585K5833K6956
$$ -230 -6713 -8708 -14405 -22456 -24464 -26040 -16415 -3405 1099 -1431 -18825 -27410 -1577 25379
21009B5379J7050j4802o383l9862m1218J1259K6541K5957J5320N32k4840l5471
$$ 25379 42429 27627 21244 -18618 -59836 -48577 -22036 3921 19241 19773 -5067 -40538
20997d0538j1869J180K339J4693Q277K0971L1557Q326j5055j3777j8650n431K0624
$$ -40538 -52407 -51227 -48888 -34195 -25918 -4947 26610 34936 19881 6104 -12546 -17977 2647
20984B647J7797L5075k6482m8417p898R661K6882P430J2084p985n221m483k4374
$$ 2647 20444 55519 29037 -19380 -27278 -17617 9265 16695 28779 20794 15573 11090 -13284
20971a3284k1775J409K469J5269Q907K2983J8489j4264M82N065k7258J799J016
$$ -13284 -35059 -33650 -31181 -15912 -7005 15978 34467 20203 20685 25750 -1508 291 1307
20958A307J1096K7009o966k3208l0156j4453M758o453l399J2835j3429L0228O080
$$ 1307 12403 39412 32446 9238 -20918 -35371 -30613 -37066 -40465 -27630 -41059 -10831 -4751
20945d751j6146J8625J7375l9333R678K3037J600J5518k4828l3056K557q559q396
$$ -4751 -20897 -2272 15103 -24230 -14552 8485 10085 25603 775 -32281 -29724 -38283 -46679
20932d6679q150j895J9813L4868M7091N292k5918k2339J442R859J9901L548m1674
$$ -46679 -54829 -56724 -36911 -2043 45048 50340 24422 2083 3525 13384 33285 36833 -4841
20919d841R572j5601l4844L395K7743J890p048r999m277K4536J0399K1435O565
$$ -4841 4731 -10870 -45714 -42319 -14576 -12686 -19734 -29733 -34010 -9474 925 22360 28925
20906B8925j3091m080q443L63K8520M181j0579k592m212q340j9398q403O737J2577
$$ 28925 15834 11754 3311 3674 32194 36375 25796 23204 18992 10652 -8746 -17149 -10412 2165
20892B165K3958p360j1986K7541j2210j5372P992j1195n548o119K055j0265k7875
$$ 2165 26123 18763 6777 34318 22108 6736 14728 3533 -2015 -8134 -6079 -16344 -44219
20879d4219J2309K1880K815Q86K504n205k1274j5255o437K2626J1434l32M118
$$ -44219 -31910 -10030 -7215 -6329 -3825 -9030 -30304 -45559 -51996 -29370 -17936 -18268 -14150
20866a4150J8971l545N395O965O68m201l0961r721J4705j4044j3682K1700L552
$$ -14150 4821 1276 6671 13636 14304 10103 -20858 -30579 -15874 -29918 -43600 -21900 -18348
20853a8348J6569J7914k1135j6174J3713K5122P564K1507K687j023l837j9893
$$ -18348 -1779 16135 -5000 -21174 -7461 17661 25225 46732 49419 48396 44559 24666
20841B4666o635Q161j0913p857o542j4459L1191K5507l6541j6329j9151j9348
$$ 24666 18031 26192 15279 7422 880 -13579 17612 43119 6578 -9751 -28902 -48250
20829d8250P831J1426K7532j250r274k4340j8068J3048M2189L7383j1451P722
$$ -48250 -40419 -28993 -1461 -2711 -11985 -36325 -54393 -41345 844 38227 26776 34498
20817C4498q769k3840L011r655r563J7368L366M027q176j5125j6463k3907L5883
$$ 34498 25729 1889 4900 -4755 -14318 3050 6416 10443 2267 -12858 -29321 -53228 -17345
20804a7345J0635J6977K598k547l455K0934J6606k220k8157m202J4594k2792k1703
$$ -17345 -6710 10267 12865 10318 6863 27797 44403 42183 14026 9824 24418 1626 -20077
20791b0077J9495J0558k6332j980N366j2366P546L3476J9636J0229j5549k8218
$$ -20077 -582 9976 -16356 -18336 -12970 -25336 -17790 15686 35322 45551 30002 1784
20779A784o52K4695k506r702N013K3383J345k5661j2493r634K7901j603j3327
$$ 1784 1132 25827 23321 13619 18632 42015 43360 17699 5206 -4428 23473 21870 8543
20766H543j6790p347r040k440K8140K2101J3964j5435q110m485J269K1331n347
$$ 8543 -8247 -15594 -24634 -27074 1066 23167 37131 21696 13586 9101 10370 31701 26354
20753B6354K746j536K8509P289l6760k60M309k9431j4016L3842K3405k3444R552
$$ 26354 29100 27564 56073 63362 26602 26342 30651 1220 -12796 21046 44451 21007 30559
20740C0559q585j047P241P159j8077j8754J4894j5558J015l847j3741J6923O875
$$ 30559 21974 20927 28168 35327 17250 -1504 13390 -2168 -1153 -5000 -18741 -1818 5057
20727E057j122j8971J5000J5089J0919l6177k1210J6053J2829J2369K3028J6552
$$ 5057 3935 -15036 -36 15053 25972 -10205 -31415 -15362 -2533 9836 32864 49416
20715D9416j2237k420p854j3282O62L6352r057M782j4626q636o927j7570j1148
$$ 49416 37179 34759 26905 13623 14285 50637 41580 46362 31736 23100 16173 -1397 -12545
20702a2545R376k9142J890L2483Q595j7861J1588O060J4569j3256j2516J9371
$$ -12545 -3169 -32311 -30421 2062 10657 -7204 4384 10444 25013 11757 -759 18612
20690A8612J5936p956k0237k0968j5329K8237K4033O523J6818K2667o247k7298
$$ 18612 34548 26592 6355 -14613 -29942 -1705 22328 28851 45669 68336 62089 34791
20678C4791k043M558k6511K48Q664J019k0763K622k258j1754J7111P475K146K5163
$$ 34791 32748 37306 10795 11043 19707 20726 -37 2585 327 -11427 5684 13159 15305 40468
20664D0468p128k1039K0778j4214k3178K1458M396k1643N637Q188l0574R585J8988
$$ 40468 33340 12301 33079 18865 -4313 17145 21541 -102 5535 13723 -16851 -7266 11722
20651A1722j51K5289j5766J6018J8268l3053l3603r408J0283J2075p407K42M828
$$ 11722 11571 36860 21094 37112 55380 22327 -11276 -20684 -10401 1674 -5733 -5491 -663
20638f63O918J7935M5206r117l5912j1328k790K963k688j7447l939K346Q126J1437
$$ -663 6255 24190 69396 60279 24367 13039 10249 13212 10524 -6923 -10862 -8516 -390 11047
20624A1047J9639R427j8452Q045j1207l557j1173j6275j8474K6426J5038J511
$$ 11047 30686 40113 21661 29706 18499 14942 3769 -12506 -30980 -4554 10484 11995
20612A1995J230j3064p880K4818j6780j4448l471K0313J6112j2845l7585j0910
$$ 11995 13225 161 -7719 17099 319 -14129 -17600 2713 18825 5980 -31605 -42515
20600d2515J2176J7668J3439K819k6034k4903o742J3540J1159L5186k845J3868
$$ -42515 -30339 -12671 768 3587 -22447 -47350 -54092 -40552 -29393 5793 2948 16816
20588A6816r873j5451M527L195j1914L0463L4277j0812l2291k2943q173R029o096
$$ 16816 6943 -8508 -3981 -786 -12700 17763 52040 41228 8937 -14006 -22179 -13150 -19246
20575a9246j6701J6249n456k4042n918J0353M0835J3813P395L835j0537j4536
$$ -19246 -35947 -19698 -25154 -49196 -55114 -44761 -3926 9887 17282 21117 10580 -3956
20563c956j1436P720O523k5013L76Q093l475Q969N620j1812L392K6769R186P163
$$ -3956 -15392 -7672 -1149 -26162 -25786 -17693 -21168 -12199 -6579 -18391 -14999 11770 20956 28119
20549B8119r064j1985J2697j3718k094K2506J8053N23q928j640j8659m1289q3
$$ 28119 19055 7070 19767 6049 3955 26461 44514 45037 36109 34469 15810 -25479 -25562
20536b5562M442K3501n405j9073K3429J8384J531o509k8950Q065J6285K5951N935
$$ -25562 -21120 2381 -3024 -22097 1332 19716 21247 14738 -14212 -6147 10138 36089 42024
20523D2024k754J3670o552k5130N149J067n868J338j5753j9381J5704N1966j9854
$$ 42024 39270 52940 46388 21258 26407 27474 21606 22944 7191 -12190 3514 55480 35626
20510C5626k0596j2053O063J1730O807J0670k106k8852j2975J9900K1770l2065
$$ 35626 15030 2977 9040 20770 27577 38247 36141 7289 -5686 14214 35984 3919
20498C919m859J2891J7037K2132N587n213q068k1779l7038k6811M281J7327q100
$$ 3919 -940 11951 28988 51120 56707 51494 43426 21647 -15391 -42202 -37921 -20594 -28694
20485b8694j6043L4872K4515j3591J2676J0030n540N756k5628j7137o335K914
$$ -28694 -44737 -9865 14650 1059 13735 23765 18225 23981 -1647 -18784 -25119 -22205
20473b2205R732K5635K1757J5386K4706k1070l8621R1K2842K079q304k252k3778
$$ -22205 -12473 13162 34919 50305 75011 53941 15320 15411 38253 40332 32028 29776 5998
20460E998k5155J1751K9176J0447k8183k4974j2981K2544J4883p65p653J4512
$$ 5998 -19157 -7406 21770 32217 4034 -20940 -33921 -11377 3506 2741 -4912 9600
20448I600N837P88J3377K573N589N464m142N499J265P107m0367J0628L2895P220
$$ 9600 15437 16225 29602 32175 37764 43228 39086 44585 45850 52957 12590 23218 56113 63333
20434F3333p183j536k5895J3383K8648k5497p479j2739j3586J3791k547n156j2866
$$ 63333 56150 54614 28719 42102 70750 45253 37774 25035 11449 25240 22693 17537 4671
20421D671j1521j2558Q244Q670J5168K3972l4929R442L4519j6367j8227L8320
$$ 4671 -6850 -19408 -11164 -2494 12674 36646 1717 11159 45678 29311 11084 49404
20409D9404j3195j1454K4410J1630J5023r501J5995n909k3052j3545J852j5747
$$ 49404 36209 24755 49165 60795 75818 66317 82312 76403 53351 39806 41658 25911
20397B5911l9045P151Q545J6712K526n33l014M278j287M117J1523J9876K5751
$$ 25911 -13134 -5983 2562 19274 21800 21267 18253 22531 21244 25361 36884 56760 82511
20384H2511o483j9223l0898j3462K8054N3031K5335j5086l8938l0466q469P667
$$ 82511 76028 56805 25907 12445 40499 93530 118865 103779 64841 34375 25906 33573
20372C3573K2834j1073q541j4500L3412M306n678l734j4787l8214q992J9762K9094
$$ 33573 56407 45334 36793 22293 55705 60011 54333 50599 35812 -2402 -11394 8368 37462
20359C7462K0514J338k6116q750O154r056k2193n900K7197L3464J511j2599J769
$$ 37462 57976 59314 33198 24448 30602 21546 -647 -6547 20650 54114 55625 43026 44795
20346D4795o280k7643N007L584j3978K0035m876J2103J0798K424M532K3924L9674
$$ 44795 38515 10872 15879 19463 5485 25520 20644 32747 43545 45969 50501 74425 114099
20333A14099L8992j4902k9744k4554p530q489l8863k8085M772j827L0516L7125
$$ 114099 153091 138189 108445 83891 76361 67872 29009 924 5696 3869 34385 71510
20321G1510j8783N227l1734l076J6657J2303j4598k5376k3218M321q714m482R894
$$ 71510 52727 57954 26220 23144 39801 52104 37506 12130 -11088 -6767 -15481 -19963 -10069
20308a0069j6111j7307K2946L535N249n279m030J7344K5305m538k5609k112P88
$$ -10069 -26180 -43487 -20541 -17006 -11757 -17036 -21066 -3722 21583 17045 -8564 -10676 -9888
20295i888N829J2446K1349J8356l0638k2797l54M1709K4722k3317r281J2645j0691
$$ -9888 -4059 8387 29736 48092 17454 -5343 -5697 36012 60734 37417 28136 40781 30090
20282C0090k529m618j6550J9187N943J1243N562k3080j0173k595q974K8581o773
$$ 30090 27561 22943 6393 25580 31523 42766 48328 25248 15075 12480 3506 32087 25314
20269B5314l1786j8470j5050J5993J6995k3938J1894L0594m464R997j1277j3624
$$ 25314 -6472 -24942 -39992 -23999 -7004 -30942 -19048 11546 7082 17079 5802 -7822
20257g822K8835N3983J5503l1309k4288j0223o499K0808K5212j1645k9941j1140
$$ -7822 21013 74996 90499 59190 34902 24679 18180 38988 64200 52555 22614 11474
20245A1474j7423q281N893M599J2839m320J9476j5635k0040L963J7915o920N855
$$ 11474 -5949 -14230 -8337 -3738 9101 4781 24257 8622 -11418 -7455 10460 3540 9395
20232I395N839L3720n00j6837Q717j41r020N663j0825j3903q006L566M3003k048
$$ 9395 15234 48954 48454 31617 40334 40193 31173 36836 26011 12108 4102 7668 50671 48623
20218D8623r970K49O92J1571k1989j2576K6288p70j0315j7190k4382k5800j0230
$$ 48623 38653 38902 39594 51165 29176 16600 42888 42118 31803 14613 -9769 -35569 -45799
20205d5799L3880K3434p763N350M578j3549K65J0836M136j8002M721k2673L555
$$ -45799 -11919 11515 3752 9102 13680 131 396 11232 15368 -2634 2087 -20586 -17031
20192a7031P123j362L3321j0509j9729r365n260P428m896L4884K0256J6233J2777
$$ -17031 -9908 -11270 22051 11542 -8187 -17552 -22812 -15384 -20280 14604 34860 51093 63870
20179F3870j4989j3694M240r10l186N435p970k401p508K782M685k91J154j784
$$ 63870 48881 35187 39427 38517 35331 40766 32796 30395 22887 25669 30354 30063 31217 29433
20165B9433j2172m781K3220j7048j4921L0334L0935r293j5182J2909O712p669
$$ 29433 17261 12480 35700 18652 3731 34065 65000 55707 40525 53434 60146 52477
20153E2477m3904J2132K8051j9732r049L2366J8949q936Q712p988j2875K1736
$$ 52477 8573 20705 48756 29024 19975 52341 71290 62354 71066 63078 50203 71939
20141G1939q491l896J3193r979j4496j5015k3215K2962K7268l731j4090r978L301
$$ 71939 63448 59552 72745 62766 48270 33255 10040 33002 60270 56539 42449 32471 35772
20128C5772J0640o850P646N543j1223k0287j8672R941L1419K6202J2229j8302
$$ 35772 46412 39562 47208 52751 41528 21241 2569 12510 43929 70131 82360 64058
20116F4058l8817m337R740N198K8592M886K0136j5969j2827K77l2481j6570j5766
$$ 64058 25241 20904 30644 35842 64434 69320 89456 73487 60660 60937 28456 11886 -3880
20103c880j2630K1791L5421K0873K448l324k5211O066J8151J5198J3728n532j0517
$$ -3880 -16510 5281 40702 61575 64023 60699 35488 41554 59705 74903 88631 83099 72582
20090G2582J1888j4095j8862j2420j7415l9089J142K5695R56k4260J2608K8445
$$ 72582 84470 70375 51513 39093 21678 -17411 -16269 9426 10382 -13878 -1270 27175
20078B7175L303J149J1982K1209o172l9164N398n227l8593j2193J5518P885L0024
$$ 27175 30478 31627 43609 64818 58646 19482 24880 19653 -18940 -31133 -15615 -7730 22294
20065B2294J7154j110j3454K1085J6680o124k2455J823K1852l27r287k2886j9319
$$ 22294 39448 38338 24884 45969 62649 56525 34070 35893 57745 57418 48131 25245 5926
20052E926k86L1602O630N047K083J4272P088R413l3520J208l706K708n633m556
$$ 5926 5640 37242 43872 48919 51002 65274 72362 81775 48255 49463 45757 48465 42832 38276
20038C8276J111j374m504N526K012o20j7075J4712K1683J3644k4747m70r565j142
$$ 38276 39387 38013 33509 39035 41047 40427 23352 38064 59747 73391 48644 48174 38609 37467
20024C7467n39r284J1063K5100p09q356J9129K5763J2820J6457J1125M283p413
$$ 37467 36928 27644 38707 63807 63098 54742 73871 99634 112454 128911 140036 144319 136906
20011A36906k7688q428J0001O2679L6754R613N0984J13395J39169J55920J36066
$$ 136906 109218 100790 110791 173470 210224 219837 270821 384216 523385 679305 815371
20000H15371N5971n1711j24189q0023r2612p3440m4860j7325m2697m658L4916
$$ 815371 871342 819631 695442 615419 522807 449367 404507 387182 344485 339827 374743
19989C74743N3023J11485J69565J23263N924m2812n4246o2706l0978j195q2781
$$ 374743 427766 539251 708816 832079 838003 795191 740945 678239 647261 646066 563285
19978E63285q7520p6209r5055r5992n0573j3830Q023K2791n961l9276p467J1007
$$ 563285 475765 399556 304501 208509 157936 144106 152129 174920 168959 129683 122216 133223
19966A33223j6206K2849r017J98K5225O57K1181K9557L7800N6719k961j2490m097
$$ 133223 117017 139866 130849 131047 156272 156929 178110 207667 245467 302186 299225 286735 282638
19953B82638Q754l3931j2452j8349J5734P9185J01173J22853J43246J83256J01693
$$ 282638 291392 257461 245009 226660 242394 321579 422752 545605 688851 872107 973800
19942I73800l350q8186r2573n4661m2536j0673M8216M8970k6682k4069J2635L2023
$$ 973800 970450 882264 789691 735030 692494 681821 730037 779007 752325 728256 740891 772914
19930G72914q876n6193p6733j10398j06782r8840m4792n3806k0160k0497N41R522
$$ 772914 764038 707845 631112 520714 413932 315092 270300 216494 196334 175837 176378 185900
19918A85900k0971m5913j041K2694J1470j9245k2161j3744p259l928J626M057
$$ 185900 164929 119016 117975 140669 152139 132894 110733 96989 89730 85802 87428 91485
19906I1485j2708J0507K080q142k8210j7114j3304k616J6685J4557r876r396J087
$$ 91485 78777 89284 91364 83222 55012 37898 24594 21978 38663 53220 43344 33948 35035
19893C5035j3371j1211J8117J3870K1723J6056j0512j2215J0745P726J6962J769
$$ 35035 21664 10453 28570 42440 64163 80219 69707 57492 68237 75963 92925 94694
19881I4694j1836l1049j7385P844j5746j6261k4628k0943L0231M2296J5621J095
$$ 94694 82858 51809 34424 42268 26522 10261 -14367 -35310 -5079 37217 52838 53933
19869E3933O334K6154j4856l1389K180L250j8998J520j4403j6785K00N2346K0530
$$ 53933 60267 86421 71565 40176 42356 45606 26608 28128 13725 -3060 -2860 49486 70016
19856G0016j6183l069j8686j5871k1063j628K0614K4538J2400J0836k5033k6390
$$ 70016 53833 50764 32078 16207 -4856 -6484 14130 38668 51068 61904 36871 10481
19844A0481R323L88J5562K320M67j776Q027M9611L0050k4135k2987k5872j5491
$$ 10481 19804 20192 35754 38074 38541 36765 44792 94403 124453 100318 77331 51459 35968
19831C5968j1388J2097P357L080K0574r866M770j9350j0526k87J893J986K4762
$$ 35968 24580 36677 44034 47114 67688 57822 62592 43242 32716 32429 34322 36308 61070
19818F1070R563k2439l3621j3009J1960J5975J4460j5618L459L0650J3217j3691
$$ 61070 70633 48194 14573 1564 13524 29499 43959 28341 31800 62450 75667 61976
19806F1976l0806K8172J097j9884k9698R553M474q637K1901K6980k6230o232J3157
$$ 61976 31170 59342 60439 40555 10857 20410 24884 16247 38148 65128 38898 32666 45823
19793D5823k005J7152K1388J5740q095k581m915m3973k2798M088L899j575J8526
$$ 45823 43818 60970 82358 98098 90003 87422 82507 38534 15736 19824 23723 22148 40674
19780D0674J4071J149N185M1688J0980p455l939j3198o4820k0436L5720K4500
$$ 40674 54745 55894 61079 102767 113747 106292 102353 89155 24335 3899 39619 64119
19768F4119J8260J2613Q905k472M669k3542k4117J6097L426n650K335o803L997
$$ 64119 82379 94992 103897 101425 106094 82552 58435 74532 77958 72308 74643 67840 71837
19755G1837l118k5446m599K2360j4804r405k927M692M8648J3730J0768J5267J1066
$$ 71837 68719 43273 38674 61034 46230 36825 33898 38590 87238 100968 111736 127003 138069
19742A38069j099j4043j3846L5345J4908k5049j3902K228P729n905P414j5973
$$ 138069 136970 122927 109081 144426 159334 134285 120383 122611 130340 124435 131849 115876
19730A15876Q111K203K0101R207o964R496O734l3676J8022J9360m410K4000J6710
$$ 115876 123987 126190 146291 155498 148534 158030 164764 131088 149110 168470 164060 188060 204770
19717B04770J1944J6204O865l5389k7523k9869j0620j1467l819J0588J9929J5452
$$ 204770 216714 232918 239783 204394 176871 147002 136382 124915 121096 131684 151613 167065
19705A67065J66l937J1114k8457j5367L6520J1988j6596l4442k0830K7985J0897
$$ 167065 167231 163294 174408 145951 130584 167104 179092 162496 128054 107224 135209 146106
19693A46106j640j3972j8185l601J3011q660N553J6646L408K3665P958k6397P516
$$ 146106 144466 130494 112309 108708 121719 113059 118612 135258 138666 162331 170289 143892 151408
19680A51408R469P407j0308l897n007j9941J3175L4723J7963J4599J1460J2322
$$ 151408 160877 168284 157976 154079 149072 129131 142306 177029 194992 209591 221051 233373
19668B33373K370m673O910J0996j3771L9088N0285Q106j2274k1989o359j0183
$$ 233373 235743 231070 237980 248976 235205 274293 324578 332684 320410 298421 292062 281879
19656B81879M562o625k0814q777k417k3368j9712k2530j1794k494k0467k9059
$$ 281879 286441 279816 259002 250225 247808 224440 204728 182198 170404 167910 147443 118384
19644A18384r532R722J355m3148J9170j5740q810K6637K5708K4945K1736r62p619
$$ 118384 108852 118574 119929 76781 95951 80211 71401 98038 123746 148691 170427 169465 161846
19631A61846m152K1675O626l101P185m527K067K7637J9567J1367J9949J9559L995
$$ 161846 157694 179369 185995 182894 190079 185552 187619 215256 234823 246190 266139 285698 289693
19618B89693j54Q136J6982J291j5769j7936r365j570l472J1847L811J8672k997
$$ 289693 289539 297675 314657 315948 300179 282243 272878 271308 267836 279683 283494 302166 299169
19605B99169j1715j0169j9964j3465J8822J9926L8948J4052j7228k7344j3761
$$ 299169 287454 277285 257321 243856 262678 282604 321552 335604 318376 291032 277271
19594B77271l4785n6221j0128j6124J411L8932J4773L8432K9967M9449K9301L0635
$$ 277271 242486 186265 176137 160013 161424 200356 215129 253561 283528 332977 362278 392913
19582C92913q733l1448q894M754J7307k520K3081L6300P060n789q628O532J9789
$$ 392913 384180 352732 343838 348592 365899 363379 386460 422760 429820 424031 415403 421935 441724
19569D41724k8187k6033n030P949K0096L9988J7340Q21k0969K9324m198k2484
$$ 441724 413537 387504 382474 390423 410519 450507 467847 468668 447699 477023 472825 450341
19557D50341L268k350L2212J9145o934J0739j4827K1796J166j506L3008K2683
$$ 450341 453609 451259 483471 502616 495682 506421 491594 513390 514556 513050 546058 568741
19545E68741J7978K3938N196K1300p43J2733J3284m108m480K0227K8139K7521
$$ 568741 586719 610657 615853 637153 636410 649143 662427 658319 653839 674066 702205 729726
19533G29726O1465N4975M4859M2690L8185j5558l2181k2186M072J6222L8316L1954
$$ 729726 791191 846166 891025 933715 971900 956342 924161 901975 906047 922269 960585 992539
19521I92539M283J2117L6203K3711L0764J6793L9891M1694J6628J1687M5548M5431
$$ 992539 996822 1008939 1045142 1068853 1099617 1116410 1156301 1197995 1214623 1226310 1271858 1317289
19509A317289R5845J18232R2919R3216Q3846Q8778N6331J02646J10269J23001
$$ 1317289 1413134 1531366 1624285 1717501 1801347 1890125 1946456 2049102 2159371 2282372
19499B282372J62593J87123J62125J72218J99874K23264K47090K80271L63236
$$ 2282372 2444965 2632088 2794213 2966431 3166305 3389569 3636659 3916930 4280166
19490D280166M95244O87734P86769P61399N98975N90870P38737R90314J438447
$$ 4280166 4775410 5463144 6249913 7011312 7610287 8201157 8939894 9930208 11368655
19481A1368655K073044L174217M750102O177446N455056R98948j095897p84044
$$ 11368655 13441699 16615916 21366018 27543464 32998520 33997468 32901571 32117527
19473C2117527p62590J6557J957745M225206P103947J1233161J8042168K9368028
$$ 32117527 31354937 31371494 33329239 37554445 44658392 55891553 73933721 103301749
19465A03301749M3561739N3798714L1625394p054636r708398j8066840l3429596
$$ 103301749 146863488 200662202 232287596 225232960 215524562 197457722 164028126
19458A64028126l5608124k7455871k0349626j3676470n995779J527081P242564
$$ 164028126 128420002 100964131 80614505 66938035 60942256 62469337 69711901
19451F9711901Q739413Q58702r597900j1389696j1079234j0873989q482637n454637
$$ 69711901 78451314 79310016 69712116 58322420 47243186 36369197 27886560 22431923
19443B2431923l281562j817399q08070j68640p9121l05820l98782k85635o3206
$$ 22431923 19150361 17332962 16524892 16356252 16277131 15971311 15572529 15286894 15223688
19434A5223688L77252Q66329J046752Q83983P73767R24848J469949K347372L662831
$$ 15223688 15600940 16467269 17514021 18398004 19171771 20096619 21566568 23913940 27576771
19425B7576771N476306P845295J1305005J5370202J6863624Q932027l072078n906257
$$ 27576771 33053077 40898372 52203377 67573579 84437203 93369230 90297152 84390895
19417H4390895n321647m247177M33536Q115978J7505812K8547085L8381051M0741931
$$ 84390895 79069248 74822071 75255607 83371585 100877397 129424482 167805533 208547464
19409B08547464M0524007L8083668J6231291m0245801n3926359m5897370m5173862
$$ 208547464 249071471 287155139 303386430 263140629 209214270 163316900 118143038
19402A18143038l7218859k3028385j3363459p663246l827239p68587K035395M248057
$$ 118143038 80924179 57895794 44532335 36869089 33041850 32273263 34308658 38556715
19394C8556715L673696k549259o030656n640521n716849n230549l539310k207409
$$ 38556715 42230411 39681152 33650496 28009975 22293126 17062577 13523267 11315858
19386A1315858j415958r32446o80826p83261r19780q08218o96862o24043n23584
$$ 11315858 9899900 8967454 8286628 7503367 6583587 5775369 5078507 4454464 3930880
19377C930880m10254l28569k38356j92013j60230j09176p2853j05548j10438j29010
$$ 3930880 3520626 3192057 2953701 2761688 2601458 2492282 2419429 2313881 2203443 2074433
19367B074433j01565j00167q9110q4871m1222m3635p4297o2155k5836K507L243
$$ 2074433 1972868 1872701 1783591 1698720 1657498 1613863 1539566 1477411 1451575 1454082 1457325
19356A457325k6832n6319n1983m6489o1563p5557p3629q5605q9830o8318o3989
$$ 1457325 1430493 1374174 1322191 1275702 1214139 1138582 1064953 979348 889518 821200 757211
19345G57211l4979J713k5741k7789j0209j0902J6947k37J0730K1810J3552J9182
$$ 757211 722232 723945 698204 670415 660206 649304 666251 666014 676744 698554 712106 731288
19333G31288k0260j6797l9881j8003j899j2055k8320k5258j3263J783J4500O428
$$ 731288 711028 694231 654350 636347 634448 622393 594073 568815 555552 557335 571835 578263
19321E78263r421m9875m1277j3453p770m451l1468j6321K1857L8807o496j0550
$$ 578263 568842 518967 477690 464237 456467 452016 420548 404227 426084 464891 458395 447845
19309D47845L15j4102R493r529J630J9154k2566l9177o1481k5597l7J8180p691
$$ 447845 448160 434058 443551 434022 435652 454806 432240 393063 331582 305985 305948 324128 316437
19296C16437j2312n028M0567Q486p890O140O940k4792k7616l3802j9204L0985
$$ 316437 304125 299097 339664 348150 340260 346400 353340 328548 300932 267130 247926 278911
19284B78911K8574L355M1277M7887M1843L880m1078j7662l2803l1004j0430l4665
$$ 278911 307485 310840 352117 400004 441847 445727 404649 386987 354184 323180 312750 278085
19272B78085N849l657j4657J3135j0764M852J5113j2347l0104r136l348q416l2627
$$ 278085 283934 280277 265620 278755 267991 272843 287956 275609 245505 236369 233021 224605 191978
19259A91978k6641K1917K1634j5817J2412j8861j9823O919O882n247J2450J7897
$$ 191978 165337 187254 208888 193071 205483 186622 166799 173718 180600 175353 187803 205700
19247B05700M93l990L874M3389J2804K623Q798N243N099l117j5558J725L329j706
$$ 205700 206193 202203 206077 249466 262270 264893 273691 278934 284033 280916 265358 267083 270412 268706
19233B68706J5879J9242J855J8771J7005K5921J8375K0764K1150j1232M7444P250
$$ 268706 284585 303827 305682 324453 341458 367379 385754 406518 427668 416436 463880 471130
19221D71130j4741m546k2256M370j2892J2531O8696O3083M5490J8473N805j6313
$$ 471130 456389 451843 429587 433957 421065 433596 502292 565375 610865 629338 635143 618830
19209F18830m2443j3331m986k4282J8384M0284k518l8284j1111M7348P5678M1673
$$ 618830 576387 563056 558070 533788 552172 592456 589938 551654 540543 587891 663569 705242
19197G05242l525k1065j9325p264j352P88L8425K8486M2973n780o8078o5758q376
$$ 705242 701717 680652 661327 654063 652711 653499 691924 720410 763383 757603 689525 623767 615391
19184F15391k8360K0280O3899M2543j5470l7524m0164m9550k4294K6504N1976
$$ 615391 587031 607311 671210 713753 698283 660759 620595 571045 546751 573255 625231
19173F25231O6787P2227K8463K8743N0636J2246J8655L7884J1289o8525n4299
$$ 625231 692018 764245 792708 821451 872087 884333 902988 940872 952161 883636 829337
19162H29337j5573K6266O1122J18423K34724K91627J00429n4431o6495r6908j63828
$$ 829337 813764 840030 901152 1019575 1254299 1545926 1646355 1591924 1525429 1428521 1264693
19151A264693j14702q6927p1729o7426k7905P685K1627Q133Q858J8496q46k9639
$$ 1264693 1149991 1063064 991335 923909 896004 903689 925316 933449 942307 960803 959957 930318
19139I30318n0175j8433k587j0866j1338j2456n83o384k6355q5772q8290m1366
$$ 930318 880143 861710 859123 848257 836919 824463 823880 817496 791141 705369 617079 575713
19127E75713j2574J2009K2988p747l7748j0088L9421L0300L3902N2869K7325K4410
$$ 575713 563139 575148 598136 590389 552641 542553 581974 612274 646176 699045 726370 750780
19115G50780M5330O7051j3689m0402k6283J9061J7953L9623N852R569N4696J35609
$$ 750780 796110 863161 849472 809070 782787 801848 819801 859424 865276 874845 929541 1065150
19103A065150J80353J93846K30949J35981j02338j85231k01926j81530j65459
$$ 1065150 1245503 1439349 1670298 1806279 1703941 1518710 1316784 1135254 969795
19094I69795j15423q9999n8706j5773M0541K7511J8713J3828L2901k1400m2350
$$ 969795 854372 764373 705667 689894 730435 757946 776659 790487 823388 801988 759638
19083G59638k1324j598l3392k2499J3439r192k8399m1089q8611o4773m3470n0070
$$ 759638 738314 736716 703324 680825 694264 685072 656673 615584 526973 462200 418730 368660
19071C68660l4933O675M6287J6152J4746M897K9535N8007K0466p965j3368j5488
$$ 368660 333727 340402 386689 402841 417587 422484 452019 510026 530492 522527 509159 493671
19059D93671M13r419N980J7238J3781j9997k7709R42J1904J8639K7872K0549K8261
$$ 493671 494084 484665 490645 507883 521664 501667 473958 474900 486804 505443 533315 553864 582125
19046E82125L6647J0312k4546l54m114m309O465K951J4674M2666L1411J6060M1670
$$ 582125 618772 629084 604538 604184 600070 595761 602226 605177 619851 662517 693928 709988 751658
19033G51658L0651K0084N38l166J1395J3006O435N804q252m3951J467L8677P618
$$ 751658 782309 802393 802931 799765 811160 824166 830601 836405 828153 784202 785669 824346 831964
19020H31964n640o324k3385J9068J0554L1422L8738K7386L3294N8967Q3223O1342
$$ 831964 826324 820000 796615 815683 826237 857659 896397 923783 957077 1016044 1099267 1160609
19008A160609K8437M0790K2516j4322l4360n1709O756L2535Q337J1304K9949N1529
$$ 1160609 1189046 1229836 1252352 1238030 1203670 1151961 1158717 1191252 1199589 1210893 1240842 1292371
18996A292371N1180J2410N4273K2760o321L4558L0359L2056J06064J06163J26805
$$ 1292371 1343551 1355961 1410234 1432994 1426673 1461231 1491590 1523646 1629710 1735873 1862678
18985A862678J06898J31063J04614R9255Q7787Q9798J01798J43317J71687K31856
$$ 1862678 1969576 2100639 2205253 2304508 2392295 2482093 2583891 2727208 2898895 3130751
18975C130751K72603L71813M86797O45933P02909O08225N08057M17517L16152
$$ 3130751 3403354 3775167 4261964 4907897 5610806 6219031 6727088 7144605 7460757
18966G460757L19231M11604O03957Q36698J097565J453460J950913K810387M222671
$$ 7460757 7779988 8191592 8795549 9632247 10729812 12183272 14134185 16944572 21167243
18957B1167243O052996P787105P434379L759987k03092j542011j322694m71178
$$ 21167243 27220239 35007344 42441723 46201710 45998618 44456607 43133913 42662735
18949D2662735J498268M512659Q491578J4277037K3462562L6993744N2592089
$$ 42662735 44161003 48673662 57165240 71442277 94904839 131898583 184490672
18942A84490672N8077346L6185299L932292j5200046k7044272m0574882m3922911
$$ 184490672 242568018 278753317 282685609 267485563 240441291 199866409 155943498
18935A55943498l5995041k6337940j7587768q574236n9227O459680Q927861M313234
$$ 155943498 119948457 93610517 76022749 67448513 67389286 73848966 82776827 87090061
18927H7090061m818043j1232373j2774156j2538042j0935419q022420n202211
$$ 87090061 82272018 71039645 58265489 45727447 34792028 26769608 21567397
18920B1567397l234962j929312j097899n22383j06308K27140M04629N42959O23850
$$ 21567397 18332435 16403123 15305224 14782841 14676533 14903673 15308302 15851261 16475111
18911A6475111N72745M08230L11719M35563P56887J275178K065704L011273M229371
$$ 16475111 17047856 17456086 17767805 18203368 18960255 20235433 22301137 25312410 29541781
18902B9541781O265642R335544J2895462J4635939J0669465K344155l853356n301706
$$ 29541781 35807423 45142967 58038429 72674368 83343833 85687988 81834632 76532926
18894G6532926m506068j126090N491311J4284134K3285912K8339182K8719869
$$ 76532926 72026858 70900768 76392079 90676213 113962125 142301307 171021176
18887A71021176K8083616K6448091Q249163k1961738l9477763l8378486l5103934
$$ 171021176 199104792 225552883 233802046 211840308 172362545 133984059 98880125
18880I8880125k9664678k0288466j2021741o880622l608031j177893R12034K463282
$$ 98880125 69215447 48926981 36905240 30024618 26416587 25238694 26150728 28614010
18872B8614010K399464j05246l043238m222247m274993m056991l285430k265944
$$ 28614010 31013474 30908228 27864990 23642743 19367750 15310759 12025329 9759385
18864I759385j527903j071434p23475m64086l04831j76161j60072j74059k72091
$$ 9759385 8231482 7160048 6436573 5972487 5667656 5491495 5331423 5157364 4885273
18855D885273l89284m70281m42672l82970l12504k02749j53886j48730j15979
$$ 4885273 4495989 4025708 3583036 3200066 2887562 2684813 2530927 2382197 2266218
18846B266218j20855r8421p0444r0229o3948p9522p9021m9392n7946o7927r656
$$ 2266218 2145363 2046942 1976498 1886269 1822321 1742799 1663778 1614386 1556440 1488513 1478857
18835A478857l9005l9630o3674o5175p2138n5788m5072l8484K178j9400k7373
$$ 1478857 1439852 1400222 1336548 1271373 1199235 1143447 1098375 1059891 1062069 1042669 1015296
18824A015296j3801j2839P792J2370o240J655K7428n792L5968Q9754P8470P6935
$$ 1015296 1001495 988656 996448 1008818 1002578 1004233 1031661 1025869 1061837 1151591 1230061 1306996
18812A306996R7862O9360L9051J2125k2252m0905j5685k6785j7978l3393m6790
$$ 1306996 1404858 1474218 1513269 1525394 1503142 1462237 1446552 1419767 1401789 1368396 1321606
18801A321606o5936j28719j41771q2182n4674p2975l4541M584K7753K9052J2740
$$ 1321606 1255670 1126951 985180 902998 848324 775349 740808 745392 773145 802197 814937
18790H14937j4210m874j3490j2614J5391L671j828j589J7410L129k8414j0639
$$ 814937 800727 795853 782363 769749 785140 788811 786983 785394 802804 805933 777519 766880
18778G66880N246Q443k2995O65Q449J9076M9809K0372J5744P4539P4933J4089
$$ 766880 772126 780569 757574 758239 766688 785764 835573 855945 871689 946228 1021161 1035250
18766A035250M436J0309N8087O1096L7935p341j79K496j4388m83K885j4760j6031
$$ 1035250 1039686 1049995 1108082 1169178 1207113 1199772 1199593 1202089 1187701 1187218 1190103 1175343 1159312
18753A159312M574o567j4129k2331P4L9170P2750O7785O9214O2761P9273P9928
$$ 1159312 1163886 1157319 1143190 1120859 1120933 1160103 1232853 1300638 1369852 1432613 1511886 1591814
18741A591814K8678J00586J35343J62533K59391K69369K16227J81203J53344R7134
$$ 1591814 1620492 1721078 1856421 2018954 2278345 2547714 2763941 2945144 3098488 3195622
18731C195622M8244Q9506J46175K74039M15295N66380Q11102J184964J696568
$$ 3195622 3243866 3333372 3479547 3753586 4168881 4735261 5546363 6731327 8427895
18722H427895K189643K121631O43367p04149q92746q65429p38315k10680L64906
$$ 8427895 10617538 12739169 13382536 12678387 11785641 10920212 10181897 9971217 10336123
18713A0336123P55619J018785J295504J721335K301836L176504M580880O899903
$$ 10336123 11091742 12110527 13406031 15127366 17429202 20605706 25186586 32086489
18705C2086489J0871765J6883567K3630920K5933523J2316974k990538p682393
$$ 32086489 42958254 59841821 83472741 109406264 121723238 118732700 111050307
18698A11050307j3830565j9465889j7372091j2921497r226197n469810j816207
$$ 111050307 97219742 77753853 60381762 47460265 38234068 32764258 30948051
18691C0948051J362542M387382O840124P036608K146218m226448o266626o456964
$$ 30948051 32310593 36697975 43538099 50574707 52720925 48494477 42227851 35770887
18683C5770887o290270m759321k735283j164910j88321N07155J158583J910621
$$ 35770887 29480617 24721296 21986013 20821103 20632782 21139937 22298520 24209141
18675B4209141K923514M439326P018137J1338213J7710306K4686989K6557443
$$ 24209141 27132655 31571981 38590118 49928331 67638637 92325626 118883069
18668A18883069J1202265l652086p522912j3498793j8084942j4355657q214826
$$ 118883069 130085334 126433248 118910336 105411543 87326601 72970944 64756118
18661F4756118k604529K451568M399731J661848J65075J340517J360831j584292
$$ 64756118 62151589 64603157 69002888 70664736 70829811 72170328 73531159 71946867
18653G1946867m538771l548530n50366L591404R885707J7101078K0942392K1179756
$$ 71946867 67408096 63859566 63309200 66900604 76786311 93887389 114829781 136009537
18645A36009537J7901812O98196k2002566k5418338k3370434k2146795j6816601
$$ 136009537 153911349 154609545 132606979 107188641 83818207 61671412 44854811
18638D4854811j0306916n984214l461871j920426r53670j73049O35087J667352
$$ 44854811 34547895 28563681 25101810 23181384 22227714 22054665 22689752 24357104
18630B4357104L248421N475311Q130804J0111063Q531152J300568m552421n610193
$$ 24357104 27605525 33080836 41211640 51322703 59853855 61154423 56602002 50991809
18622E0991809n776534m895216k243743J047106M610915Q990534J4475099K0130914
$$ 50991809 45215275 40320059 38076316 39123422 43734337 52724871 67199970 87330884
18614H7330884K2296393K1420244J6920584j368488k2420983k5013096k3234394
$$ 87330884 109627277 131047521 147968105 146599617 124178634 99165538 75931144
18607G5931144k1846260j6493332j0276441o187990l854480k508478j731711j163403
$$ 75931144 54084884 37591552 27315111 21127121 17272641 14764163 13032452 11869049
18599A1869049q16484m80151M597O91529J478133K223187K150327K10199j862292
$$ 11869049 11052565 10572414 10577011 11268540 12746673 14969860 17120187 17330386 15468094
18590A5468094k265732k346487k302782j791969j237366q39419n37852l26489
$$ 15468094 13202362 10855875 8553093 6761124 5523758 4684339 4146487 3819998
18582C819998k21357j05754n4455k6282p6248j43273j79556j50764j50639k22845
$$ 3819998 3598641 3492887 3438432 3412150 3335902 3192629 3013073 2862309 2711670 2488825
18572B488825j93243j71766j48656p6117o9319j04994r1490o3706r1640p2605
$$ 2488825 2295582 2123816 1975160 1899043 1829724 1724730 1633240 1569534 1477894 1405289
18562A405289k7318k9713k5432l0197l3464l8694l0935o8190k3512l2164k7559
$$ 1405289 1377971 1348258 1322826 1292629 1259165 1220471 1189536 1121346 1097834 1065670 1038111
18551A038111j6989l6877l7561J607k085j457J578J9474M9913J11325J03409J14382
$$ 1038111 1021122 984245 946684 948291 946206 944749 946327 965801 1015714 1127039 1230448 1344830
18539A344830P1855r485o6470q7092n7798m6243o1423o6092m0351n5061k9909
$$ 1344830 1416685 1407200 1340730 1253638 1195840 1149597 1088174 1022082 981731 926670 896761
18528H96761l486J2118N0045P6502O3970M2237M0192Q733p772k9777l0009M505
$$ 896761 893275 905393 955438 1031940 1095910 1138147 1178339 1187072 1179300 1149523 1119514 1124019
18516A124019j5190l0425n2901r1180j11381j01528r8315m9001k5441j1973j9507
$$ 1124019 1108829 1078404 1025503 934323 822942 721414 623099 574098 548657 536684 517177
18505E17177l2632j2626j931j5538j7139J9807K6809m078j3606n914L099M747
$$ 517177 484545 471919 469988 454450 437311 457118 483927 479849 466243 460329 463428 468175
18493D68175P664n1928l2076j7306K1146K7495L1047L2096L8816J8985L4905L1336
$$ 468175 475839 423911 391835 374529 395675 423170 454217 486313 525129 544114 579019 610355
18481F10355L6521m400l6958n1541l6198l3970j9544J3475L570K0762L2640o146
$$ 610355 646876 642476 605518 553977 517779 483809 464265 477740 481310 502072 534712 528566
18469E28566p992p694n32o605K2053J0730m7490l6702k2646p1646m4795o838K009
$$ 528566 520574 512880 512348 505743 527796 538526 491036 454334 431688 360042 315247 308409 310418
18456C10418k2319k0383J57l244n718k362J5656J6405N0149j7183j8271N145K1950
$$ 310418 288099 267716 267873 264629 258911 256549 272205 288610 338759 321576 303305 308450 330400
18443C30400L55j3875j6304N949J7769J9439K9589M5940K0241n241N2868N7775
$$ 330400 330755 316880 300576 306525 324294 343733 373322 419262 439503 434262 487130 544905
18431E44905O3905R7285J08035Q7807N312k4825j4303l9129J626P0529P1270L3813
$$ 544905 608810 706095 814130 901937 907249 882424 868121 828992 830618 901147 972417 1006230
18419A006230L1825N2390J0950l179o6780j09281j59522j39196j10733p3475j9876
$$ 1006230 1038055 1090445 1101395 1098216 1031436 922155 762633 623437 512704 439229 419353
18408D19353o011j3446J4249O014Q727J4735l1397j0387Q943k6103m5056m1554
$$ 419353 413342 399896 414145 420159 428886 443621 412224 401837 410780 384677 339621 298067
18396B98067k1281L1316j1913k5710n593M3368K2645j7613k0399O866L5855J8434
$$ 298067 276786 308102 296189 270479 264886 308254 330899 313286 292887 299753 335608 354042
18384C54042L4150N3727O7186N1842N1629P3737O8161J1884l566K5132O6717R1050
$$ 354042 388192 441919 509105 560947 612576 686313 754474 766358 762792 787924 854641 945691
18372I45691O1514M5335l6145j23594j37266j12535q1064n3172o756K7049L6794
$$ 945691 1007205 1052540 1016395 892801 755535 643000 561936 508764 502008 529057 565851
18361E65851Q9266Q2913O8738K6520p385n6037j16604j07118n6219r9553o1548
$$ 565851 655117 738030 806768 833288 825903 769866 653262 546144 489925 390372 328824
18350C28824l5722l2907k7386P131L0552j7423m8215O84J5646K4179j0797j5586
$$ 328824 293102 260195 232809 239940 270492 253069 204854 205538 221184 245363 234566 218980
18338B18980K926k0507j3019J497k103K0290L6098K3055M0454Q431j7886k7432
$$ 218980 221906 201399 188380 189877 187774 208064 244162 267217 307671 316102 298216 270784
18326B70784j6146j0041l310Q848q264p567j2871m093J262o827K7790o932k2512
$$ 270784 254638 244597 241287 250135 241871 234304 221433 217340 218602 211775 239565 232633 210121
18313B10121r651O545O775k497m846k245J0712o003j4926k0943p98K2211J5536
$$ 210121 200470 207015 213790 211293 206447 204202 214914 208911 193985 173042 172244 194455 209991
18300B09991j7295j248J4991M175o427p3j3401j873j07J3982M1515L6889o605
$$ 209991 192696 191448 206439 210614 204187 204114 190713 188840 188733 202715 244230 281119 274514
18287B74514K3044L5246L6124Q796J0490L7288L4196J0771L1954O7436M2416J4628
$$ 274514 297558 332804 368928 377724 388214 425502 459698 470469 502423 569859 612275 626903
18275F26903L9681J27696J31300J30827J79818K49552L77813O35804J164418J858842
$$ 626903 666584 794280 925580 1056407 1236225 1485777 1863590 2499394 3663812 5522654
18265E522654K627653J630566j882335j557894j258854j669608j269775p06553
$$ 5522654 8150307 9780873 7898538 6340644 5081790 3412182 2142407 1435854
18257A435854l88257k06316j18629q9860r3105l5525m0690n3599m7401R425P656
$$ 1435854 1047597 841281 722652 632792 539687 504162 463472 409873 362472 371897 379553
18246C79553k0347k1749m675q056j0940K0543p246L919n236J0335K0367m020l8235
$$ 379553 359206 337457 332782 324726 313786 334329 327083 331002 325766 336101 356468 352448 314213
18233C14213j6421n480l639k0212Q265K6158R597J6603M443j7747r766r769M1816
$$ 314213 297792 292312 288673 268461 276726 302884 312481 329084 333527 315780 306014 296245 338061
18220C38061L5150o270k1040J7137K1181L6957m110J7726q761J717K0569j3678
$$ 338061 373211 366941 345901 363038 384219 421176 417066 434792 426031 427748 448317 434639
18208D34639r832J0662L3096J4075Q161o319r113j8710o1568l9720K3580L7723
$$ 434639 424807 435469 468565 482640 490801 484482 475369 456659 395091 355371 378951 416674
18196D16674J2431J4843M9169N7381J8260k7543j2962J35k502r181m2011l4001
$$ 416674 429105 443948 493117 550498 568758 541215 528253 528388 525886 516705 474694 440693
18184D40693p358n93K9179J6991o3K1251J3541l794J909K9345K6618K7511J0721
$$ 440693 433335 432742 461921 478912 478849 500100 513641 509847 511756 541101 567719 595230 605951
18171F05951L1800M0891M33J3307k2053k5711L7830O0047L8828L5510j2108J9355
$$ 605951 637751 678642 679075 692382 670329 644618 682448 742495 781323 816833 804725 824080
18159H24080K6418L438J6818M1132M8347L0325P051k4106l126k3681P502O3774
$$ 824080 850498 853936 870754 911886 960233 990558 997609 973503 970377 946696 954198 1017972
18147A017972J21478J04406J9525n8307n2208m8987l8396n688K0218J4965K9495
$$ 1017972 1139450 1243856 1263381 1205074 1152866 1103879 1065483 1059795 1080013 1094978 1124473
18136A124473Q3229N3091P7844O4252M3418J16294N7503K3691P258M5220M4622
$$ 1124473 1207702 1260793 1338637 1402889 1446307 1562601 1620104 1643795 1651053 1696273 1740895
18125A740895K7189J9789Q2622J30600J69496J59917J65996K53306K98774L77869
$$ 1740895 1768084 1787873 1870495 2001095 2170591 2330508 2496504 2749810 3048584 3426453
18115C426453M41413N19015O24499P74723R38716J291981J916912L164982N704622
$$ 3426453 3867866 4386881 5011380 5786103 6724819 8016800 9933712 13098694 18803316
18106A8803316R395393J3383992J0802293p036733q943218o550478q282072p048554
$$ 18803316 28198709 41582701 52384994 45348261 36405043 29854565 21572493 14523939
18098A4523939l655727j661190n96566M7724N14644J002138J630387K369151K664822
$$ 14523939 10868212 9207022 8610456 8658180 9172824 10174962 11805349 14174500 16839322
18089A6839322J140450r68487j267983j180094j190103p13807j3844N30254R74662
$$ 16839322 17979772 17011285 15743302 14563208 13373105 12659298 12645454 13175708 14150370
18080A4150370J419806J932769K688045L766482N387506Q005665J2730798K0011510
$$ 14150370 15570176 17502945 20190990 23957472 29344978 37350643 50081441 70092951
18072G0092951K8368420L1947942J5667094m097039j1481040j8907466k4325099
$$ 70092951 98461371 130409313 146076407 141979368 130498328 111590862 87265763
18065H7265763k1167555j5757204j1134383o833523l175394k30990K334263M582661
$$ 87265763 66098208 50341004 39206621 32373098 29197704 28966714 31300977 35883638
18057C5883638N668300L106810k758588n486756n782448n927434n204177l636598
$$ 35883638 41551938 44658748 41900160 36413404 30630956 24703522 19499345 15862747
18049A5862747k279357j364350p67484m20563j72745J39712M80863P51111R98626
$$ 15862747 13583390 12219040 11451556 11030993 10858248 10997960 11478823 12229934 13228560
18040A3228560J353227J983794K789456L357736K637404N20727k5169O00649J430893
$$ 13228560 14581787 16565581 19355037 22712773 25350177 25870904 25845735 26446384 27877277
18031B7877277L034329N414699P602371P654349L465300n03424p48913R5944K008387
$$ 27877277 30911606 36326305 43928676 51583025 55048325 54544901 53795988 53891932 55900319
18022E5900319O040642J2284655K1358853L3042728M3908789M0002897J8761651
$$ 55900319 61940961 74225616 95584469 128627197 172535986 212538883 231300534
18015B31300534P913422j323739k2403321m1138885l8009326l1465134k6524585
$$ 231300534 239213956 237890217 215486896 174348011 136338685 104873551 78348966
18008G8348966j8373193j0088559m007598L95032L169190K895072j869807n736326
$$ 78348966 59975773 49887214 45879616 46274648 49443838 52338910 50469103 44732777
18000D4732777o140689n954625n259308l411910j496810k85477o15726j879090
$$ 44732777 38592088 32637463 27378155 23966245 22469435 22183958 21568232 19689142
17992A9689142k093532j906011j808811j477258j026040o55976l89165j20132
$$ 19689142 17595610 15689599 13880788 12403530 11377490 10721514 10332349 10212217
17984A0212217O9544K34754N47326Q97527J387706K145641L315564M970288O726956
$$ 10212217 10281761 10516515 11063841 11961368 13349074 15494715 18810279 23780567 30507523
17975C0507523P363527M226156j252909l211630l292486l125964j723526N87270
$$ 30507523 37871050 42097206 40844297 37632667 34340181 31214217 29490691 30077961
17967C0077961L205901O492671J0613828J5140227J7758174J7921325J6450998
$$ 30077961 33283862 39776533 50390361 65530588 83288762 101210087 117661085
17960A17661085P788411j3684838k1551867j9441531j8937812j6085050j0582005
$$ 117661085 125449496 111764658 90212791 70771260 51833448 35748398 25166393
17953B5166393o402078l933453k525216j714922j220327q13499m62191j10895
$$ 25166393 18764315 14830862 12305646 10590724 9370397 8556898 8094707 7983812
17945G983812K59297P44411J231120J606987J137894o25904j586385j566829j631414
$$ 7983812 8243109 8987520 10218640 11825627 12963521 12337617 10751232 9184403 7552989
17936G552989j542602j197505q79058o45307m27188l42757k39159j70183j57900
$$ 7552989 6010387 4812882 3933824 3288517 2861329 2518572 2279413 2109230 1951330
17927A951330j24765j13716j02223q5628m8669p4180m5226p9725m3997k0277m6721
$$ 1951330 1826565 1712849 1610626 1524998 1476329 1402149 1356923 1277198 1233201 1212924 1166203
17916A166203m3686n3937m6284n1551K738k245j217J6169L520O99j3596m8727
$$ 1166203 1122517 1068580 1022296 970745 973483 971238 970021 986190 989710 990409 976813 928086
17904I28086r2786m1778n7153n1352l0401m2421o9594o0110k8679j1163j1351
$$ 928086 835300 793522 736369 685017 654616 612195 542601 482491 453812 442649 431298
17893D31298R098o243J6104K9483M9769J5842P011l206k0966j7797j3986l1939
$$ 431298 440396 434153 450257 479740 529509 545351 552362 549156 528190 510393 496407 464468
17881D64468K0378n883k7216l811N794J8230K144l4574k928l7385l2694n623j0975
$$ 464468 484846 478963 451747 447936 453730 471960 474104 439530 436602 399217 366523 360900 349925
17868C49925j3504l5948k5749j1330J3749J1451p467N529Q434j14p899o428n529
$$ 349925 336421 300473 274724 263394 277143 288594 281127 286656 295090 294976 287077 280649 275120
17855B75120R147o391o790O087Q737j7419j5262J7650K7036K1841j7697l3404
$$ 275120 284267 277876 271086 277173 285910 268491 253229 270879 297915 319756 302059 268655
17843B68655k0456k0133M436j9282j2172R206J1408K5971J0018n068K583o216
$$ 268655 248199 228066 232502 213220 201048 210254 221662 247633 257651 252583 255166 248950
17831B48950J6086k3704j0604J5167J149l050l9296j0544l0646n5284k5506Q309
$$ 248950 265036 241332 230728 245895 247044 243994 204698 194154 163508 108224 82718 91027
17819I1027L5729J2049L023J92O122l1718j2065K5149k2978k5496j0972J5116
$$ 91027 126756 138805 141828 142020 148142 116424 104359 129508 106530 81034 70062 85178
17807H5178J1321J1572Q619L206R76R190j1645J5658K052K0021J0988m163J9323
$$ 85178 96499 108071 116690 119896 120872 130062 118417 134075 136127 156148 167136 162973 182296
17794A82296j7934j8607r788j843q617R189j245j5609m200J7571N648Q178p910
$$ 182296 164362 145755 135967 134124 125507 134696 133451 117842 113642 131213 136861 145039 137129
17781A37129j4946L0595l495n262j1108L6626L4676j0946j3156J8676k4925j8352
$$ 137129 122183 152778 149283 144021 132913 169539 204215 193269 180113 198789 173864 155512
17769A55512m7617l4990q700K9554L880j4236j5471L9886J9400O707j0894r99
$$ 155512 107895 72905 64205 93759 97639 83403 67932 107818 127218 133925 123031 122032
17757A22032K8707L218k725J4453R081l07k8468l4348k1164n383O489j320j684
$$ 122032 150739 153957 151232 165685 174766 174459 145991 111643 90479 85096 91585 90265 88581
17744H8581q603O56O105J2364J2990J504k9888l2959k414J3606K1356K3836M427
$$ 88581 79978 80634 86739 99103 112093 113597 83709 50750 48336 61942 83298 107134 111561
17731A11561j640J599K6701K1251q803j3009r727J0929K0671K4671j5394j8926
$$ 111561 109921 111520 138221 159472 150669 137660 127933 138862 159533 184204 168810 149884
17719A49884J7605q420J848k2366l896m856m5656j6339L2504K0994j8852L6474
$$ 149884 167489 159069 160917 138551 134655 129799 84143 67804 100308 121302 102450 138924
17707A38924L021k6196j3027r802j781J8776O6555N0336r267l8672k2241J103
$$ 138924 141945 115749 102722 92920 91139 109915 176470 226806 217539 178867 156626 157729
17695A57729o130j7004j6309M011j3557j991J4977M821O486j7596n170j420n516
$$ 157729 151599 134595 118286 122297 108740 106749 121726 126547 133033 115437 110267 108847 103331
17682A03331J5174J8210k068k504j4905j9346p130j1258j5216j2055K9943L2007
$$ 103331 118505 136715 134647 132143 117238 97892 90762 79504 64288 52233 82176 114183
17670A14183k7603k8918K2102N935L948j6741J3970J4784p097L10M77p143k1068
$$ 114183 86580 57662 79764 85699 89647 72906 86876 101660 94563 94873 95350 88207 67139
17657F7139p902l670J7893J7520L634M639L0382L211m06k601j571l0871K2028
$$ 67139 59237 55567 73460 90980 94614 99253 129635 132846 132440 129839 128268 97397 119425
17644A19425J5832o860l0091l3924r314o256K0256N140p87M1307J798k563J037
$$ 119425 135257 128397 98306 64382 55068 48812 69068 74208 73421 114728 116526 113963 115000
17631A15000J3514j928J8258m528m5014j3251J1005l608j6543J847l148p803j4784
$$ 115000 128514 126586 144844 140316 95302 82051 93056 89448 72905 74752 71604 63801 49017
17618D9017K7569J5636o949l6237j4108R429J2843o763J7854P527J1363j0628
$$ 49017 76586 92222 85273 49036 34928 44357 57200 50437 68291 75818 87181 76553
17606G6553m612k5238J3086P005K285j6820l3919k4834K3419J5064o742M104K506
$$ 76553 71941 46703 59789 66794 69079 52259 18340 -6494 16925 31989 25247 29351 31857
17593C1857J8462K4435k3959k0274J1649L6468M350Q409J8505O636j2188l5808
$$ 31857 50319 74754 50795 30521 42170 78638 82988 91397 109902 116538 104350 68542
17581F8542J1168J967n312l854M386K3786L9947l6580j5486O811k894K2198J5901
$$ 68542 79710 81677 76365 72511 76897 100683 140630 104050 88564 95375 92481 114679 130580
17568A30580o0P983N770R287L098K2552L4959L1267J1837K2499N2112O5159Q910
$$ 130580 130520 138503 144273 153560 156658 179210 214169 245436 257273 279772 331884 397043 405953
17555D05953j4974j7823J1747j5732K2948L2297l7961m5309J0595J699N325r041
$$ 405953 390979 373156 384903 369171 392119 424416 386455 341146 351741 353440 358765 349724
17543C49724k5061J0507L7426k329n0027j8459o8421k7420k9967j3346j5164j218
$$ 349724 324663 335170 372596 370267 320240 301781 233360 205940 175973 162627 147463 146245
17531A46245n957o496Q516j3119R166K2045j132J450k5259k9716J1536J3835L0008
$$ 146245 140288 133792 142308 129189 138355 160400 159268 160718 135459 105743 117279 131114 161122
17518A61122l127K2493l458O032j4309K4437K2349K4704N1428M0053O2845Q5203
$$ 161122 157995 180488 177030 183062 168753 193190 215539 240243 291671 331724 394569 479772
17506D79772M5207M6961O6920K3933k45q45L807K3893K2175j2781m4705o6405
$$ 479772 524979 571940 638860 662793 662548 661703 665510 689403 711578 698797 654092 587687
17494E87687m0821l672l9441l4864k8528N671j7184L8907J2701l1411j1714J8455
$$ 587687 546866 543194 503753 468889 440361 446032 428848 467755 480456 449045 437331 455786
17482D55786R368N662l4040o9481n4421m4139l0787j4793K7236N865l2723l0395
$$ 455786 465154 470816 436776 367295 312874 268735 237948 223155 250391 256256 223533 193138
17470A93138l5346l8062m935q715k4825j6057l2740L346J6558L3806J3533J2375
$$ 193138 157792 119730 114795 106080 81255 65198 32458 35804 52362 86168 99701 112076
17458A12076j0831J6203L7384N1579N7066K2962R620k877J3686J3571j073L8910
$$ 112076 101245 117448 154832 206411 263477 286439 296059 293182 306868 320439 319366 358276
17446C58276J5526j5380K1507k857l5145r023K2270K8820M7557R165p1789o8304
$$ 358276 373802 358422 379929 377072 341927 332904 355174 383994 431551 440716 368927 300623
17434C00623n4629m5389m524K9838L5675L5851q090j1807k4212m0301l4286j8551
$$ 300623 245994 200605 196081 225919 261594 297445 289355 277548 253336 213035 178749 160198
17422A60198l4396m0155m9883j5340N854J4341M593J1709J1834r337J692R00k2836
$$ 160198 125802 85647 35764 20424 26278 40619 45212 56921 68755 59418 61110 62010 39174
17409C9174J0000P191k5722j0090N880L787L1736j2339k3755M085l0833k5045
$$ 39174 49174 56365 30643 20553 26433 30220 61956 49617 25862 29947 -886 -25931
17397b5931K3162J8132j1874j1289j2226r59P487K47j8156l2729n694Q203J9300
$$ -25931 -2769 15363 3489 -7800 -20026 -20985 -13498 -13251 -31407 -64136 -69830 -61627 -42327
17384d2327K5967J7231k0386j3472M8854L956j2124m730J218k1889K672J2692
$$ -42327 -16360 871 -19515 -32987 15867 19823 7699 2969 4187 -17702 -15030 -2338
17372b338j1204k1576K2851J0416K1613J1743p716l6543J4321J3746j7110K1858
$$ -2338 -13542 -35118 -12267 -1851 19762 31505 23789 -12754 1567 15313 -1797 20061
17360B0061p430r280R979J3910P974k3237n674m825r748k5707N098j2148N954
$$ 20061 12631 3351 13330 27240 35214 11977 6303 1478 -8270 -33977 -28879 -41027 -35073
17347c5073J3762j4259J5903K2302P513j0114N391J6614M182p861j9497n309R072
$$ -35073 -21311 -35570 -19667 2635 10148 34 5425 22039 26221 18360 -1137 -6446 2626
17334B626N554J0584J0085n772k0623j9210N905J7719K57j6544r523p808K919
$$ 2626 8180 18764 28849 23077 2454 -16756 -10851 6868 7125 -9419 -18942 -26750 -23831
17321b3831N859L8219K951k9690o033k51m862R208p290J0327J5098l301j0944
$$ -23831 -17972 20247 23198 -6492 -12525 -12776 -17638 -8430 -15720 -5393 9705 6404 -4540
17308d540K1041K1161l778j1863k1269R862K956r601J7046o487j2278J8683K6987
$$ -4540 16501 37662 33884 22021 752 10614 13570 3969 21015 14528 2250 20933 47920
17295D7920K040j8060k3675j4291K5008j1726l9141J61J1490k9088n372M3044
$$ 47920 49960 31900 8225 -6066 18942 7216 -31925 -31764 -20274 -49362 -54734 -11690
17283a1690j3923m47J5145q33j4692m518L3551N5M567J4816r558j2158k4678j0409
$$ -11690 -25613 -26060 -10915 -11748 -26440 -30958 2593 2648 7215 22031 12473 315 -24363 -34772
17269c4772K0934K8701L1477L472l3270r370J6646j0454L990p698O339J2990N84
$$ -34772 -13838 14863 46340 49812 16542 7172 23818 13364 17354 9656 15995 28985 29569
17256B9569k1231j2041J8461L8531k3939m106q645M744o849j3117O177J976j2208
$$ 29569 8338 -3703 14758 53289 29350 25244 16599 21343 14494 1377 7554 9530 -2678
17243b678j5401l658L8013L0441L987k3398j3564M8586j1333j6193j602L93J822
$$ -2678 -18079 -21737 16276 46717 50704 27306 13742 62328 50995 34802 33200 33593 35415
17230C5415k202k4696k3789n020J345K4548K533n281J3937K007k1483O52j0011
$$ 35415 33213 8517 -15272 -20292 -18947 5601 8134 2853 16790 18797 -2686 -2034 -12045
17217a2045K2628L2167j9501j7298k8645l4808M2640L1134r391k1474L635Q289
$$ -12045 10583 42750 23249 5951 -22694 -57502 -14862 16272 6881 -14593 -10958 -2669
17205b669k0270j4619j4282j3612K5521L7470J3388m928J1762m04p953n688J2437
$$ -2669 -22939 -37558 -51840 -65452 -39931 -2461 10927 5999 17761 17357 9404 3716 16153
17192A6153J7031j9114j9044J06L761K2703K3070j0761k8031k8857L386L0897
$$ 16153 33184 14070 -4974 -4868 -1107 21596 44666 33905 5874 -22983 -19597 11300
17180A1300j4524J1466M3122R9j5100k3919n169m830N074K3691R526J2169j3555
$$ 11300 -3224 8242 51364 51463 36363 12444 7275 2445 7519 31210 40736 52905 39350
17167C9350J506Q942j8619j1599J2694K3465o482o746N674J2504o677m0493p848
$$ 39350 40856 49798 31179 19580 32274 55739 49257 42511 48185 60689 54012 13519 5671
17154E671j0192Q529r556j3686l016K7225J5724K138k3883k874J952j4668j9998
$$ 5671 -4521 4008 -5548 -19234 -22250 4975 20699 22837 -1046 -3920 -1968 -16636 -36634
17141c6634k917L4080Q089l4828l620K2573p169K223L0396r601k0322q328J1417
$$ -36634 -39551 -5471 2618 -32210 -35830 -13257 -20426 -18203 12193 2592 -17730 -26058 -14641
17128a4641K46r564Q171k99J0210K3200j5562j4298j0485n73K0014n199Q340J1344
$$ -14641 -14395 -23959 -15788 -16087 -5877 17323 1761 -12537 -23022 -23595 -3581 -8780 -440 10904
17114A0904n31k760Q034k269P660k3768p438L1368J373j6517Q695O368q45P537
$$ 10904 10373 7613 15647 13378 21038 -2730 -10168 21200 22573 6056 14751 21119 20274 27811
17100B7811j5977j7049l1010L7760J6333p402L4509J8892k6447k7153k1807j551
$$ 27811 11834 -5215 -36225 1535 17868 10466 44975 63867 37420 10267 -11540 -13091
17088a3091M8186K1156j0860j1955P290k1338j8054J2746j450N970N544l594l745
$$ -13091 35095 56251 45391 33436 40726 19388 1334 14080 12630 18600 24144 20550 16805
17075A6805k6199K8688K0683k8013j2393k926J9683J75r55J4506J4999j793j492
$$ 16805 -9394 19294 39977 11964 -429 -3355 16328 16503 15548 30054 45053 43260 41768
17062D1768m327j2259k8707K817M2887o043m608J0465j348j0597k4733J2662r935
$$ 41768 37441 25182 -3525 -708 42179 36136 31528 41993 40645 30048 5315 17977 8042
17049H042l0993O502J9294K170N470j989j598k039j6952k6891P921J8481J7125
$$ 8042 -22951 -16449 2845 5015 10485 8496 6898 4859 -12093 -38984 -31063 -12582 4543
17036D543O144n410j6757J950M871j5415Q050K2808K915j5155k185k9684J132
$$ 4543 10687 5277 -11480 -9530 -4659 -20074 -12024 10784 13699 -1456 -3641 -33325 -32193
17023c2193O268j0254Q927J3561M309L102M2935J7600k4257n003j0898K953Q587
$$ -32193 -25925 -36179 -27252 -13691 -9382 -6280 36655 54255 29998 24995 14097 17050 25637
17010B5637o023M298Q942j5691j4901j148M763k1693N968O383J9926L4120j6768
$$ 25637 19614 23912 32854 17163 2262 1114 5877 -15816 -9848 -3465 16461 50581 33813
16997C3813q405p734k5804J9690q835l329r984J6548j0859k480J7610J5951r618
$$ 33813 25408 17674 -8130 11560 2725 -604 -10588 5960 -4899 -7379 10231 26182 16564
16984A6564n270j4257j890q960M415r305J1405R795L817j5170l21P643J8703o688
$$ 16564 11294 -2963 -4853 -13813 -9398 -18703 -7298 2497 6314 -8856 -9177 -1534 17169 10481
16970A0481k8565J673J6060K352J0044K200K9359r580l4370J4454j5047j2101
$$ 10481 -18084 -16411 -351 2001 12045 14245 43604 34024 -346 14108 -939 -13040
16958a3040j8747q299K4979J7386m0739K1566K3629K845m814J3874P640m939k06
$$ -13040 -31787 -40086 -15107 2279 -38460 -16894 6735 9580 4766 18640 26280 21341 21135
16945B1135k283o90J5425k0787k910L631J1980j978k1893p670R938J0819N699
$$ 21135 18852 18162 33587 12800 9890 13521 25501 23523 1630 -6040 3898 14717 20416
16932B0416k6738P170K4680J5474k2889N296O716J3704j5000j0804J1103k3807
$$ 20416 -6322 848 25528 41002 18113 23409 30125 43829 28829 18025 29128 5321
16920E321O009J6788j2033j6876l546J3493Q419j2168j1476j0281k462n630k012
$$ 5321 11330 28118 16085 -791 -4337 9156 17575 5407 -6069 -16350 -18812 -24442 -26454
16907b6454j5255p874J9294J7951K8089J8032K632k5785L320R087l647j9486l0787
$$ -26454 -41709 -49583 -30289 -12338 15751 33783 36415 10630 13950 23037 19390 -96 -30883
16894c0883j9477p359P493M0280Q155q799r324L0914K6108J3665j0420l5460k1754
$$ -30883 -50360 -57719 -50226 -9946 -1791 -10590 -19914 11000 37108 50773 40353 4893 -16861
16881a6861j2326l914Q268J72m588r127J7296J8111K9182M304q862k0268k0174
$$ -16861 -29187 -33101 -24833 -24661 -29249 -38376 -21080 -2969 26213 30517 21655 1387 -18787
16868a8787J3258J6551P117k3647L674K5452N575l5260q957j1619q847K1162J1749
$$ -18787 -5529 11022 18139 -5508 -1834 23618 29193 -6067 -15024 -26643 -35490 -14328 -2579
16855b579q6k7405K64O697K3972J7080L1351j319k0276j5664J4035j2700k8815
$$ -2579 -2665 -30070 -29806 -23109 863 17943 49294 47975 27699 12035 26070 13370 -15445
16842a5445l665j7818J868P433q21j3706p51K2384L6578O471J6330J0835j0220
$$ -15445 -19110 -36928 -35060 -27627 -28448 -42154 -42905 -20521 16057 22528 38858 49693 39473
16829C9473k7754n7987j0906K1620m294Q270K6490n567j1057O420J4793K1709
$$ 39473 11719 -46268 -57174 -35554 -39848 -31578 -5088 -10655 -21712 -15292 -499 21210
16817B1210j0352k4252l2522q884K7849k6012j263K4278J6213J0771J3090k2157
$$ 21210 10858 -13394 -45916 -54800 -26951 -52963 -54226 -29948 -13735 -2964 10126 -12031
16805a2031k743Q499Q973M098J2060M417j0516j0058j5332J1681J7155K7210m131
$$ -12031 -14774 -6275 2698 6796 18856 23273 12757 2699 -12633 -952 16203 43413 39282
16792C9282j1834l6320k7130K1908R040j0698J7582j372k3247O578L5619k4520
$$ 39282 27448 -8872 -36002 -14094 -5054 -15752 1830 458 -22789 -16211 19408 -5112
16780e112Q825J9934J4885n825l6364l306K5222K3231j6353r031J8247q259J380
$$ -5112 3713 23647 38532 32707 -3657 -6963 18259 41490 25137 16106 34353 26094 27474
16767B7474K6631o619k6796l293l6700j4389J0257M2457N815r638k1870k4960
$$ 27474 54105 47486 20690 17397 -19303 -33692 -23435 19022 24837 15199 -6671 -31631
16755c1631j785J14J9549o349k6635j3408K1524R730K6793J3577n058m135J821
$$ -31631 -33416 -33302 -13753 -20102 -46737 -60145 -38621 -28891 -2098 11479 6421 2286 4107
16742D107j7021k338J2594L582o18p380k5251l956J3221N579j6366j1796j430
$$ 4107 -12914 -15252 -2658 924 306 -7074 -32325 -36281 -23060 -17481 -33847 -45643 -47073
16729d7073p827J9043K7727J0586k4154j817R716L127m506K6343M713N336l126
$$ -47073 -54900 -35857 -8130 2456 -21698 -23515 -13799 -10672 -15178 11165 15878 21214 18088
16716A8088j9184l877j0383L1575j6890q097r634l044K7443J5726m869n060j1225
$$ 18088 -1096 -4973 -15356 16219 -671 -8768 -18402 -21446 5997 21723 16854 11794 569
16703E69k6525L6420O732j466k5838l4772J3165J5047j8718j6955J8798J1800
$$ 569 -25956 10464 17196 15730 -10108 -44880 -31715 -16668 -35386 -52341 -33543 -21743
16691b1743J8111m395r836j8237R721j5453K3249J8083J1496O836k6607j6110
$$ -21743 -3632 -8027 -17863 -36100 -26379 -41832 -18583 -500 10996 17832 -8775 -24885
16679b4885L3584K121q099J4583Q223j3555k728q729k3605J2703J1407j767k6501
$$ -24885 8699 10820 2721 17304 25527 11972 9244 515 -23090 -10387 1020 -747 -27248
16666b7248J4586l1581n151K1053P961J5004J5622M286L006P305p717j9522j4539
$$ -27248 -12662 -44243 -49394 -28341 -20380 -5376 10246 14532 17538 24843 17126 -2396 -16935
16653a6935Q344l151j2911K0361J7047R534m9426K136K4242L104J4767j9449j8542
$$ -16935 -8591 -11742 -24653 -4292 12755 22289 -27137 -25001 -759 2345 17112 -2337 -20879
16640b0879k188K6125j285p269Q217J5521l458J339M002k6832k5808j4L025j0603
$$ -20879 -23067 3058 1773 -5496 2721 18242 14784 16123 20125 -6707 -32515 -32529 -29504 -40107
16626d0107K4351J9012J6751K7317K4260M472n585m8553k9549j4560r274L0447
$$ -40107 -15756 3256 20007 47324 71584 76056 70471 21918 -7631 -22191 -31465 -1018
16614a018J0467k7000O535M270o702J5514L8151N953r544P149j8022l9203k426
$$ -1018 9449 -17551 -11016 -6746 -13448 2066 40217 46170 36626 43775 25753 -13450 -15876
16601a5876O367L1325J6090l000k6937l973j9541p391J0736l294J2654O986j7058
$$ -15876 -9509 21816 37906 34906 7969 3996 -15545 -22936 -12200 -15494 -2840 4146 -12912
16588a2912q253k2106N973J4484R669l222o142J3452J6948o32p049J8543n16l60
$$ -12912 -21165 -43271 -37298 -22814 -13145 -16367 -22509 -9057 7891 7259 210 18753 18237 17877
16574A7877L571K939m7115k1607J8324M975J670M237K5147o247l070L539o026
$$ 17877 21448 24387 -22728 -44335 -26011 -21036 -19366 -15129 10018 3771 701 4240 -1786
16561a786k3724m808L9764J338l9433j3792Q588j752J0986k075J4033M251J7105
$$ -1786 -25510 -30318 9446 10784 -28649 -42441 -33853 -35605 -24619 -26694 -12661 -8410 8695
16548H695q120j9731j0045R539Q715j5335p585p035j2747j0772k0943O529M5029
$$ 8695 575 -19156 -29201 -19662 -10947 -26282 -33867 -40902 -53649 -64421 -85364 -78835 -33806
16535c3806M7162L3174l0770L742O105o924l4480m204k8835J1387N138O871j8058
$$ -33806 13356 46530 15760 19502 25607 18683 -15797 -20001 -48836 -37449 -32311 -25440 -43498
16522d3498Q600L4512J1156r172j775J5167J5476j32O143J10L255l4730l3718
$$ -43498 -34898 -386 10770 1598 -177 14990 30466 30334 36477 36587 39842 5112 -28606
16509b8606K735M003q685J5737p785J3532M093M131r190k79p478P341L8883r632
$$ -28606 -25871 -21868 -30553 -14816 -22601 -9069 -4976 -845 -10035 -10314 -17792 -10451 28432 18800
16495A8800k2927J2843r772j1634J25Q836O48K522n056J2481M147j3154J1149
$$ 18800 -4127 8716 -1056 -12690 -12565 -3729 -3081 -559 -5615 6866 11013 -2141 9008
16482I008j4892j7635k1926J8922J2585J1879K9507O190j0525k8000j765j974
$$ 9008 -5884 -23519 -45445 -26523 -13938 -2059 27448 33638 23113 -4887 -6652 -8626
16470h626J9447N98j6429r097L2821K534m612R796J3132P782k4859J4618k4545
$$ -8626 10821 11419 -5010 -14107 18714 21248 16636 26432 39564 47346 22487 37105 12560
16457A2560k7469j7339J0373j0685K084O569r150j0760J9782L3241K0488m121
$$ 12560 -14909 -32248 -21875 -32560 -30476 -23907 -33057 -43817 -24035 9206 29694 25573
16445B5573j6931P995L799k1671k9152j9774k237K1305j126P77K3698K1624j2304
$$ 25573 8642 16637 20436 -1235 -30387 -50161 -52398 -31093 -32219 -31442 -7744 13880 1576
16432A576J853m754j0033Q105j888J1569J302K9R452L952q427l3670j752J4318
$$ 1576 3429 -1325 -11358 -3253 -5141 6428 7730 7759 17211 21163 12736 -20934 -22686 -8368
16418h368L428J2295J1276j5451L23K9912J2327p950j6386J4701M477k2730j8024
$$ -8368 -4940 7355 18631 3180 3503 33415 45742 37792 21406 36107 40584 17854 -170
16405a70m539k5151j2179J1279k933o356P175M9461o660k6967J1514J7313M001
$$ -170 -4709 -29860 -42039 -30760 -33693 -40049 -32874 16587 9927 -17040 -5526 11787 15788
16392A5788q325K451j280j0853O834K7063j0434k0467J9168j5540j6159p970p357
$$ 15788 7463 9914 8634 -2219 4615 31678 21244 777 19945 4405 -11754 -19724 -27081
16379b7081o574J1802p928J0975j3962J1872M1713Q815k6885K793R735k5944P916
$$ -27081 -33655 -21853 -29781 -18806 -32768 -20896 20817 29632 2747 5540 15275 -10669 -2753
16366b753k455n031J6767P887l2743K9751L0798m940k5569P468m346k0872q217
$$ -2753 -5208 -10239 6528 14415 -18328 11423 42221 37281 11712 19180 14834 -6038 -14255
16353a4255m597l575n221j9573j2912j850k065K5037L1278M6808J5371p733r605
$$ -14255 -18852 -22427 -27648 -47221 -60133 -61983 -64048 -39011 -7733 39075 54446 46713 37108
16340C7108p297Q610K221k6605l325m271J192J654L637J1486O137p750q536J203
$$ 37108 29811 38421 40642 14037 10712 6441 7633 9287 12924 24410 30547 22797 14261 15464
16326A5464k0887k3563k1903J4243m529m362l494K2902L2850K1193j3180j4244
$$ 15464 -5423 -28986 -50889 -36646 -41175 -45537 -49031 -26129 6721 27914 14734 490
16314D90J3004k1462k0345K3102J1197j6652J2249K331l566j8634j0890O619J3527
$$ 490 13494 -7968 -28313 -5211 5986 -10666 1583 3914 348 -18286 -29176 -22557 -9030
16301i030J2232K2203p892J6011k3656k3103Q75m774l51L146M255J2010K7834
$$ -9030 3202 25405 17513 33524 9868 -13235 -12360 -17134 -17485 -14339 -10084 1926 29760
16288B9760r383J619k6076j4021R089n265M070l665j926J1208J5201K7536J9832
$$ 29760 20377 21996 -4080 -18101 -9012 -14277 -10207 -13872 -15798 -4590 10611 38147 57979
16275E7979n396l3857l4296k0446K168j1346l230J8241J629J7594J4889j2547
$$ 57979 52583 18726 -15570 -36016 -33848 -45194 -48424 -30183 -28554 -10960 3929 -8618
16263h618L77K0947n600m9995q956J9346M944J4347r239J3058L7167J6771k3226
$$ -8618 -8241 12706 7106 -42889 -51845 -32499 -27555 -13208 -22447 -9389 27778 44549 21323
16250B1323k4096j3164m726j4524J1987O695n267j2966j1597J5103J3387K7303
$$ 21323 -2773 -15937 -20663 -35187 -23200 -16505 -21772 -34738 -46335 -31232 -17845 9458
16238I458j433l802j6922l47K7765L826j4269k8772J648P096j585O050J7299K3994
$$ 9458 8025 4223 -12699 -13046 14719 18545 4276 -24496 -22848 -15752 -17337 -11287 6012 30006
16224C0006J3052j3636k1739k64J335k650n948P83P626j5826k004M33N908K9462
$$ 30006 43058 29422 7683 7419 8754 6104 156 939 8565 -7261 -9265 -8832 -2924 26538
16210B6538J805j3365N239k3093p519J972J6649k1700q433r927j8305J1608M1479
$$ 26538 28343 14978 20217 -2876 -10395 -8423 8226 -13474 -21907 -31834 -50139 -38531 2948
16197B948j764p404p644J5361K979j653M700j2775j4327J6540J5338Q578K3974
$$ 2948 1184 -6220 -13864 1497 4476 2823 7523 -5252 -19579 -3039 12299 20877 44851
16184D4851n922l9457l2144p132M813o459l554K2476K1426P428k311R21j1776
$$ 44851 38929 -528 -32672 -39804 -34991 -41450 -45004 -22528 -1102 6326 4015 4936 -6840
16171f840j1917P142j1735K5706j0211j6372O856q120j8859N457L5534J2924R719
$$ -6840 -18757 -11615 -23350 2356 -7855 -24227 -17371 -25491 -44350 -38893 -3359 9565 19284
16158A9284J2358k2948j4009J4616M699j5493k1037q307K1536J4342K6664k489
$$ 19284 31642 8694 -5315 9301 14000 -1493 -22530 -30837 -9301 5041 31705 29216
16146B9216j4832k2059q158Q924J1695o816l4500K0951J6260Q281K3449k38L617
$$ 29216 14384 -7675 -15833 -6909 4786 -2030 -36530 -15579 681 8962 32411 32173 35790
16133C5790J3602k4156j5262r470l3725j6703p291J1624j564L719P346J9717R413
$$ 35790 49392 25236 9974 504 -33221 -49924 -57215 -45591 -47155 -43436 -36090 -16373 -6960
16120f960L943j5783r564N74O258K3386K2995J2981q99p772p494n356k6229n535
$$ -6960 -3017 -18800 -28364 -27790 -21532 1854 24849 37830 36931 29159 21665 16309 -9920 -15455
16106a5455k1575J6822J9157l654o155j6754N610J140r425K7502J509j4725J7488
$$ -15455 -37030 -20208 -1051 -4705 -10860 -27614 -22004 -20864 -30289 -2787 -1278 -16003 1485
16093A485J4429j7321K0496k0219j0348j440L25j3559m557n214J8111M581P066
$$ 1485 15914 -1407 19089 -1130 -11478 -12918 -12593 -26152 -30709 -35923 -17812 -13231 -6165
16080f165K6163q480k5424M285J2249K3960J0611p557l3208j2176j347j3935K0119
$$ -6165 19998 11518 -13906 -9621 2628 26588 37199 29642 -3566 -15742 -17089 -31024 -10905
16067a0905L532j1119K1019K552p485L538l2493J0004L7435j8945j5564L5036
$$ -10905 -7373 -18492 2527 5079 -2406 1132 -31361 -21357 16078 -2867 -18431 16605
16055A6605j762k0803R296K5432o65L843o673j7385j1976k325j0370j7991m738
$$ 16605 14843 -5960 3336 28768 28103 31946 25273 7888 -4088 -6413 -16783 -34774 -39512
16042c9512J7634J9962J066L933P034Q956j5132J2388l629l034k6688K135n106
$$ -39512 -21878 -1916 -850 3083 10117 19073 3941 16329 12700 9666 -17022 -14887 -19993
16029a9993N708L4886j5056n266R239Q180O473m710j7052k6401K3287k520j6215
$$ -19993 -14285 20601 5545 279 9518 17698 24171 19461 2409 -23992 -705 -3225 -19440
16016a9440q645K382K457K8776J7620N170L00P34R629k8798o2933j3239K4273
$$ -19440 -28085 -25703 -23246 5530 23150 28320 28620 29354 38983 10185 -52748 -65987 -41714
16003d1714N6755L5615k4815m0960L838K8799J1719j3868K013m707k0002k3611
$$ -41714 15041 50656 25841 -15119 -11281 17518 29237 15369 17382 12675 -7327 -30938
15991c0938m560r089L1080M4295J1024l9617r235J736j4870J7678J9159K3164
$$ -30938 -35498 -44587 -13507 30788 41812 2195 -7040 -5304 -20174 -2496 16663 39827
15979C9827J2958j9983l0389k889j3910n359n586o779J9109J1941n419p000j5759
$$ 39827 52785 32802 2413 -476 -14386 -19745 -25331 -32110 -13001 -1060 -6479 -13479 -29238
15966b9238K2164O41q456j6861R327J4120k888k5465J7573N57m0004L0389J3849
$$ -29238 -7074 -6433 -14889 -31750 -22423 -8303 -11191 -36656 -19083 -18526 -58530 -28141 -14292
15953a4292J2087J6206J3928q191k4021J8264J513j5878n543J7458k0822j1882
$$ -14292 -2205 14001 27929 19738 -4283 13981 15494 -384 -5927 11531 -9291 -21173
15941b1173j1149J920K2014K721j7269P103j8734J9450J8309J9357r110r764r909
$$ -21173 -32322 -30402 -8388 -5667 -22936 -15833 -34567 -15117 3192 22549 13439 3675 -6234
15928f234K982j5298n840P632O442N880K1390q553j2418J9332m933l047k2032
$$ -6234 -3252 -18550 -24390 -16758 -10316 -4436 16954 8401 -4017 15315 10382 7335 -14697
15915a4697J4355K8627Q956O108k2139J2091L188k1139j3500N711N222l082q803
$$ -14697 -342 28285 37241 43349 21210 33301 36489 15350 1850 7561 12783 9701 898
15902H98r445J3519K1340k8786o437J2588J514j4878q792J2906J8938j9680k4380
$$ 898 -8547 4972 26312 -2474 -8911 3677 5191 -9687 -18479 -5573 13365 -6315 -30695
15889c0695k847J6530j6439R408L1368j56k8013j8468J6607J7562J1605p77K2606
$$ -30695 -33542 -17012 -33451 -24043 7325 7169 -20844 -39312 -22705 -5143 6462 5685 28291
15876B8291l452K0974j2187r264p322j9764r179O239l1330p735J5062J0206K240
$$ 28291 24839 45813 33626 24362 17040 -2724 -11903 -5664 -36994 -44729 -29667 -19461 -17221
15863a7221J202r913J1673J9850N146K1324o228j1640J4827Q918k6719j0145K012
$$ -17221 -16019 -25932 -14259 5591 10737 32061 25833 14193 29020 37938 11219 1074 3086
15850C086l074L3125J1200l7133J6394O025n218j5523j0690q161k1845L0868J5456
$$ 3086 12 33137 44337 7204 23598 29623 24405 8882 -1808 -9969 -31814 -946 14510
15837A4510k3013k715n291R258p41R234K3409J9668k761l797j3690k3416j2700
$$ 14510 -8503 -11218 -16509 -7251 -7992 1242 24651 44319 41558 37761 24071 655 -12045
15824a2045j1453K920J3920Q248j9931k6937p647O365j47p608R849n910J5928
$$ -12045 -23498 -20578 -6658 1590 -18341 -45278 -52925 -46560 -46707 -54315 -44466 -50376 -34448
15811c4448L7812j5601n570J0976J3623M36O54J9N021q308j5186P577l942J6348
$$ -34448 3364 -12237 -17807 -6831 6792 7228 7882 7901 12922 4614 -10572 -2995 -6937 9411
15797I411J6126O649M248R298N377k8836k8297j1579R840K297r121J5939K0196
$$ 9411 25537 32186 36434 45732 51109 22273 -6024 -17603 -7763 -5466 -14587 1352 21548
15784B1548j5964o553J9181j0495m4j7742j1834l922L200O800P174Q852j900N939
$$ 21548 5584 -969 18212 7717 7673 -10069 -21903 -25825 -22625 -15825 -8651 201 -1699 4240
15770D240k4108n756J5062K5950Q268l2105k2211O980Q962J7470J3508k3464K2071
$$ 4240 -19868 -25624 -10562 15388 23656 -8449 -30660 -23680 -14718 2752 16260 -7204 14867
15757A4867j4283p89J3647p071J5655J8031j6853j988j0344k6689k5826j4608
$$ 14867 584 -205 13442 6371 22026 40057 23204 21216 10872 -15817 -41643 -56251
15745e6251K595J0831J0055M4736J2844m916k4479j0534Q648J2097q284j8381
$$ -56251 -53656 -42825 -32770 11966 24810 19894 -4585 -15119 -6471 5626 -2658 -21039
15733b1039n617m757N08K4621J4360l230l325j9660J678N674j1785K7334o015
$$ -21039 -26656 -31413 -30905 -6284 8076 4846 1521 -18139 -16461 -10787 -22572 4762 -1253
15720a253j251j2451j6841K3963M662k050j3726J8223j6571k795j1118k9967J8070
$$ -1253 -2504 -14955 -31796 -7833 -3171 -5221 -18947 -724 -17295 -20090 -31208 -61175 -43105
15707d3105M7560j493R180o810n973M35j304M947q9q575l4305p67j1148R506J3721
$$ -43105 4455 2962 12142 5332 -641 -206 -1510 3437 3348 -5227 -39532 -40299 -51447 -41941 -28220
15692b8220J3021r562r74N059l1059J034M3543K3193j347L978q240l7015j643
$$ -28220 -15199 -24761 -25735 -20676 -51735 -50701 -7158 16035 14688 18666 10426 -26589 -28232
15679b8232K0996L2196K6044J2080l3635j9575P461l654K277j2648j3071J4648
$$ -28232 -7236 24960 51004 63084 29449 9874 17335 13681 15958 3310 -9761 4887
15667D887M725p586J1440K1973j0880M796q067l2621n543K0114K546j4820p873
$$ 4887 9612 2026 13466 35439 24559 29355 21288 -11333 -16876 3238 5784 -9036 -16909
15654a6909K7648k083l20j0079k8648o214L3748K2126K1253p139j3019j6384r385
$$ -16909 10739 8656 8336 -1743 -30391 -36605 -2857 19269 40522 33383 20364 3980 -5405
15641e405L3680L1331j1392k0112q812l468j905J0486j3949m1707j5801M8031
$$ -5405 28275 59606 48214 28102 19290 15822 13917 24403 10454 -31253 -47054 977
15629I77K9125j4636N330J1961J509k3949k4320p834L859k93J5134J9419J9937
$$ 977 30102 15466 20796 32757 34266 10317 -14003 -21837 -17978 -18271 -3137 16282 36219
15616C6219k366j4500n635J8687L102k2420k4440j4660J168M767q639K7222J1856
$$ 36219 33853 19353 13718 32405 35507 13087 -11353 -26013 -24845 -20078 -28717 -1495 10361
15603A0361J9579m300j5033Q890m0397J7465L7639P134J5061o419r889k0362K3086
$$ 10361 29940 25640 10607 19497 -20900 -3435 34204 41338 56399 49980 40091 19729 42815
15590D2815j5817l2277j5256K4219o745j677J142R58P259j106r35l2273J2275
$$ 42815 26998 -5279 -20535 3684 -3061 -4738 -3596 -2638 4621 3515 2580 -29693 -17418
15577a7418K2173J2800j0915J281j1462k259J7219m654O288j0419q1q675K6138
$$ -17418 4755 17555 6640 7921 -3541 -5800 11419 6765 13053 2634 2553 -6122 20016
15564B0016J4825j7548k7458N597k0914k3224Q387K3972L6212K2472K457n0307
$$ 20016 34841 17293 -10165 -4568 -25482 -48706 -40319 -16347 19865 42337 44794 -5513
15552e513j8935J9058r20N521L87n867l919n905K501L60J8780Q698k1590N346
$$ -5513 -24448 -5390 -6310 -789 -402 -6269 -10188 -16093 -13592 -13232 5548 14246 -7344 -1998
15538a998J5899j8093Q146K5551M991q696k4954Q350r868o361r31p334R506J0845
$$ -1998 13901 -4192 3954 29505 34496 25800 846 9196 -672 -7033 -7964 -15298 -5792 5053
15524E053j1878L599q62k4633L701M884j0445j4496m489q815K8177M2763K4206
$$ 5053 -6825 -3226 -4088 -28721 -25020 -20136 -30581 -45077 -49566 -58381 -30204 12559 36765
15511C6765j404k3673J7799k772l9010P219L8573J2906k5754J8908k202k7655
$$ 36765 35361 11688 29487 26715 -12295 -5076 33497 46403 20649 39557 37355 9700
15499I700l2187J6337k289k029m370J1220J8903P72K22L556K0585M802j7642l5418
$$ 9700 -22487 -6150 -8439 -10468 -14838 -3618 15285 16057 16279 19835 40420 45222 27580 -7838
15485g838r46j8313J2669K244k839k0489r234J3919K2285m519M270J5573J1736
$$ -7838 -8784 -27097 -14428 -12184 -15023 -35512 -44746 -30827 -8542 -13061 -8791 6782 18518
15472A8518j4540P387J1138j6183l5990j8967J5691p991J9063J607O442L6757
$$ 18518 3978 11365 22503 6320 -29670 -48637 -32946 -40937 -21874 -20267 -13825 22932
15460B2932J6167j1037J0732O74J7175k2937j4519j7035q556k085J0160o934N294
$$ 22932 39099 28062 38794 39468 56643 33706 19187 2152 -6404 -8489 1671 -5263 31
15447C1n968K5785j77J8686k5127l6681K849J3900J3016l5975j6075J6374P267
$$ 31 -5937 19848 19671 38357 13230 -23451 -20602 -6702 6314 -29661 -45736 -29362 -22095
15434b2095j1673R056M558l952K0076M3363P404j9231r473K112O636j5585l0393
$$ -22095 -33768 -24712 -20154 -24106 -4030 39333 46737 27506 18033 20145 26781 11196 -19197
15421a9197k9315L781J6128J0209K8797J7042o027j7762m223p089P08O631J9941
$$ -19197 -48512 -44731 -28603 -18394 10403 27445 21418 3656 -567 -7656 -6948 -317 19624
15408A9624k4606N07j8033J255J7299j0555j5635j15K4935J6476q74K1927N27
$$ 19624 -4982 -4475 -22508 -21253 -3954 -14509 -30144 -30259 -5324 11152 10278 32205 32732
15395C2732m391j7715o679J4720K876K936j9596l3395j935J3405j4158o12K0891
$$ 32732 28341 10626 3947 18667 21543 24479 4883 -28512 -30447 -17042 -31200 -31812 -10921
15382a0921J5897K5819m572n893J4531K4605j4400j0685j8803j943J6894j3708
$$ -10921 4976 30795 26223 20330 34861 59466 45066 34381 15578 13635 30529 16821
15370A6821j8592n254n915J0077o61J313K2621l609J1488K5389o332K2156K3861
$$ 16821 -1771 -7025 -12940 -2863 -3524 -2211 20410 16801 28289 53678 47346 69502 93363
15357I3363j9127l1724l8898q472M805j1249M448J0787p081M787N472j7443k1213
$$ 93363 74236 42512 3614 -4858 -53 -11302 -6854 3933 -3148 1639 7111 -10332 -31545
15344c1545J8925J1609L158l6k6866J2981L0558p983k8017j1256J9605L48o74
$$ -31545 -12620 -1011 2147 2111 -24755 -11774 18784 10801 -17216 -28472 -8867 -8519 -9193
15331i193j920K435m55j1683Q408j9940j3860P834j4491L504L6215M3218K2898
$$ -9193 -11113 -8678 -9133 -20816 -12408 -32348 -46208 -38374 -52865 -49361 -13146 30072 52970
15318E2970o249j7422m414q42j5581J177r217j7753M329J6800O720r049L061j2019
$$ 52970 46721 29299 24885 24043 8462 9639 422 -17331 -13002 3798 10518 1469 4530 -7489
15304g489n824j3974K4755j219L678M281J039l439L105J3958j5007j114N560j223
$$ -7489 -13313 -27287 -2532 -3751 -73 4208 5247 1808 4913 18871 3864 2750 8310 7087
15290G087k6262j312J0943J7472j7209k2375J1992K7127K8455j3446m671l1723
$$ 7087 -19175 -20487 -9544 7928 -9281 -31656 -19664 7463 35918 22472 17801 -13922
15278a3922k8800q872P941M105K0869K2244L2862M673j315p475j9258l3624k1349
$$ -13922 -42722 -51594 -43653 -39548 -18679 3565 36427 41100 39785 32310 13052 -20572 -41921
15265d1921J4747Q406o389J4556L3930J6663j3471O077R841j6174k2202l728J5281
$$ -41921 -27174 -18768 -25157 -10601 23329 39992 26521 32598 42439 26265 4063 335 15616
15252A5616J929J758J1075J3482j6648j070j7051q241P397k082j2168K556K508
$$ 15616 17545 19303 30378 43860 27212 26142 9091 850 8247 6165 -6003 -3447 -939
15239i39k4095l0598j177K0744J4263J568N383M460k288k806j9883j1441K0298
$$ -939 -25034 -55632 -56809 -36065 -21802 -20234 -14851 -10391 -12679 -15485 -35368 -46809 -26511
15226b6511J260k2383K783J4298N135J3734o928Q992k0684J884L4302K896n0456
$$ -26511 -25251 -47634 -44851 -30553 -25418 -11684 -18612 -9620 -30304 -28420 5882 8778 -41678
15213d1678r09N769M2278K1689R364P800k7446k0036k499R133J3839j8004J40
$$ -41678 -42587 -36818 5460 27149 36513 44313 16867 -3169 -5668 3465 17304 -700 -560
15200e60j0363L850J0984j9017j1299O759j4878j4535R959q182k059L0907J4012
$$ -560 -10923 -7073 3911 -15106 -26405 -19646 -34524 -49059 -39100 -47282 -49341 -18434 -4422
15187d422R332J6542n854j3255L364L242J87K2983K535k81k1592j5998k457O866
$$ -4422 4910 21452 15598 2343 5707 8949 9136 32119 34654 34373 12781 -3217 -5674 1192
15173A192K428k1039Q204J0135K0867p114k8662L661L573K0697o87O4k1026l8934
$$ 1192 3620 -17419 -9215 920 21787 14673 -13989 -10328 -6755 13942 13255 13319 -7707 -46641
15159d6641K1473J8301p246L626L828k305M311j3311k2277M305J293N254l467
$$ -46641 -25168 -6867 -14113 -10487 -6659 -8964 -4653 -17964 -40241 -35936 -34643 -29389 -32856
15146c2856J3002K4975j0901J3665J0312j2979j045p970q192O309j2299n608R543
$$ -32856 -19854 5121 -5780 7885 18197 5218 4173 -3797 -11989 -5680 -17979 -23587 -14044
15133a4044K4484K9813J6182j0715l0622N319o469j8327J6272K002q776l158R081
$$ -14044 10440 40253 56435 45720 15098 20417 13948 -4379 11893 13895 5119 1961 11042
15120A1042j174k0054J5001L0994j126j3384k5304k420K223J4379O683J022R682
$$ 11042 9868 -10186 4815 35809 34683 21299 -4005 -6425 -4202 10177 16860 17882 27564
15107B7564N240P953m408O981P179j087k2477Q775J0752k1388k2757m923J7785
$$ 27564 32804 40757 36349 43330 50509 49422 26945 35720 46472 25084 2327 -2596 15189
15094A5189l022j9854J7813P165k029j569o160j0098j4877J9840R474j0054J9922
$$ 15189 12167 -7687 10126 17291 15262 13693 7533 -2565 -17442 2398 11872 1818 21740
15081B1740J7644N050j288j3698l2550R174J4856R382j7892o329J7042n365K2911
$$ 21740 39384 44434 43146 29448 -3102 6072 20928 30310 12418 6089 23131 17766 40677
15068D0677N45k1623P898k7565l0032P575j0087L998J2781r346j7260l465J6886
$$ 40677 41222 19599 27497 -68 -30100 -22525 -32612 -28614 -15833 -25179 -42439 -45904 -29018
15055b9018N857L958N216L580o358K0503J0073j2694j2395r773N835j8137k284
$$ -29018 -23161 -19203 -13987 -10407 -16765 3738 13811 1117 -11278 -21051 -15216 -33353 -35637
15042c5637K9637J434l829j5887k0870R702J2608k4728K7849j77p462J5050P259
$$ -35637 -6000 -4566 -8395 -24282 -45152 -35450 -22842 -47570 -19721 -19898 -27360 -12310 -5051
15029e051m427k289K403K7194K0447k6508J9700J2888K675j453l1407k2024J7244
$$ -5051 -9478 -11767 -9364 17830 38277 11769 31469 44357 47032 45579 14172 -7852 9392
15016I392j706r460K1825k0551Q378J3540j9977J7896j8411j4233N750P507q422
$$ 9392 7686 -1774 20051 -500 7878 21418 1441 19337 926 -13307 -7557 -50 -8472
15003h472Q644K2967K297j4507k4172J2608M0994j8028k9011j3388K5824K5766
$$ -8472 172 23139 25436 10929 -13243 -635 40359 22331 -6680 -20068 5756 31522
14991C1522l122j5022k9104N425L2902J1493k6825j8577j3829K6134r964J346
$$ 31522 28400 13378 -15726 -10301 22601 34094 7269 -11308 -25137 997 -8967 -7621
14979g621J82M864j1762k6420K9038J6657j0087k0034j9466M284K9961M976J436
$$ -7621 -7439 -2575 -14337 -40757 -11719 4938 -5149 -25183 -44649 -40365 -10404 -5428 -3992
14966c992M560k5403p302R673J35J6606K4912K9810k0745k5081M241O342j4929
$$ -3992 568 -24835 -32137 -22464 -22329 -5723 19189 48999 28254 3173 7414 13756 -1173
14953a173l615J0765K077K3174J8575l8461k159M438k1855k7501J7530K8217j439
$$ -1173 -4788 5977 8054 31228 49803 11342 9183 13621 -8234 -35735 -18205 10012 8573
14940H573j628M80l0184j8941P236K5700m619K415m151p155r995K9238K3223Q230
$$ 8573 6945 7425 -22759 -41700 -34464 -8764 -13383 -10968 -15119 -22274 -32269 -3031 20192 28422
14926B8422o359j971K1966j2197j9143o818r018Q034L9752O816o345J676j0085
$$ 28422 22063 20092 42058 29861 10718 3900 -5118 2916 42668 49484 43139 44815 34730
14913C4730j7603N688J3743M064p830O62n085o274l2297k948J1019P434N891K3427
$$ 34730 17127 22815 36558 40622 32792 33454 28369 22095 -10202 -13150 -2131 5303 11194 34621
14899C4621k155m3232j6795K7921M967j7565R178L5162Q789q715j0470j8562n051
$$ 34621 32466 -10766 -27561 360 5327 -12238 -3060 32102 40891 32176 21706 3144 -1907
14886a907J2577m019r048L413K5n956J4337J3211m722j2622m505l490R687K140
$$ -1907 10670 6651 -2397 1016 1041 -4915 9422 22633 17911 5289 784 -2706 6981 9121
14872I121K0648k106J2175L950l1841j9787Q320k91K488j6981J267q890K847k15
$$ 9121 29769 27663 39838 43788 11947 -7840 480 189 2677 -14304 -13037 -21927 -19080 -19295
14858a9295n953J1741L1437R941l5839j6879J4675K4932O495M866k488k4855l0561
$$ -19295 -25248 -13507 17930 27871 -7968 -24847 -10172 14760 21255 26121 23633 -1222 -31783
14845c1783k1151P771J1694N875k1398j9468N719L0297O0944N0271p126m7095
$$ -31783 -52934 -45163 -33469 -27594 -48992 -68460 -62741 -32444 28500 78771 71645 24550
14833B4550l5792Q127j965J2015k018k1753j6734k5153l601O083O946q804Q910
$$ 24550 -11242 -3115 -5080 6935 4917 -16836 -33570 -58723 -62324 -56241 -49295 -58099 -49189
14820d9189L4878K5631k4803M475K83j9403k9668p923K1387K3828K3090J9992
$$ -49189 -14311 11320 -13483 -9008 -8725 -28128 -57796 -65719 -44332 -20504 2586 22578
14808B2578n213k0513n741j255k3033n111J3436M531m463J3570L75r706J8432
$$ 22578 17365 -3148 -8889 -10144 -33177 -38288 -24852 -20321 -24784 -11214 -10839 -20545 -2113
14795b113K4434K72m092o52q044j764j6391N387r978j0190j4448j4866k378j4884
$$ -2113 22321 22593 18501 17849 9805 8041 -8350 -2963 -12941 -23131 -37579 -52445 -54823 -69707
14781f9707K707K0226O939J8931L0824J3763j8889J723J5671L935j1629k8762
$$ -69707 -67000 -46774 -39835 -20904 9920 23683 4794 6517 22188 26123 14494 -14268
14769a4268r664K0480M889p745M397j1664N628n950k4739n695n868J4962J2653
$$ -14268 -23932 -3452 1437 -6308 -1911 -13575 -7947 -13897 -38636 -44331 -50199 -35237 -22584
14756b2584N872J2167J3604n547k8372M862J1011l6370P162M0740q724k78j611
$$ -22584 -16712 -4545 9059 3512 -24860 -19998 -8987 -45357 -38195 2545 -6179 -6457 -8068
14743h068R918k0628O839J2803P106j5345P15q268K0308J1639J3588n887j9427
$$ -8068 1850 -18778 -11939 864 7970 -7375 -6660 -14928 5380 17019 30607 24720 5293
14730E293k2688m744J9874M674j8839J359O983M690j1540M461L0081J9409j284
$$ 5293 -17395 -22139 -2265 2409 -16430 -15071 -8088 -3398 -14938 -10477 19604 39013 37729
14717C7729q497r523l1124q978J3422J0451K6968J9351o620R009L935j6663l5525
$$ 37729 29232 19709 -11415 -20393 -6971 3480 30448 49799 43179 52188 56123 39460 3935
14704C935k7693o090j213k53J7873K4807J0571P266j0561J556O785k4090o369
$$ 3935 -23758 -29848 -31061 -31314 -13441 11366 21937 29203 18642 20198 26983 2893 -3476
14691c476J7486Q053l179p781n057j0773j0323J4270J0983k836k2118j0193K1158
$$ -3476 14010 22063 18884 11103 6046 -4727 -15050 -780 10203 7367 -14751 -24944 -3786
14678c786J1784K1078L325j6576Q866M4599J5987o459o767j7989j7173o792n941
$$ -3786 7998 29076 32401 15825 24691 69290 85277 78818 72051 54062 36889 30097 24156
14665B4156j0685P957l513J0704K3266K7521l926N395l6147k8902P814n851Q752
$$ 24156 13471 21428 17915 28619 51885 79406 75480 80875 44728 15826 23640 17789 26541
14652B6541K0311m170j7951l416K10l0853Q528L8124p289J6346J1356j7020L995
$$ 26541 46852 42682 24731 21315 21525 -9328 -800 37324 30035 46381 57737 40717 44712
14639D4712k3975k4266Q088J0059j128j3201k4530k994M2978L2185j4591j3953
$$ 44712 20737 -3529 4559 14618 13490 289 -24241 -27235 15743 47928 33337 19384
14627A9384j5126j5229j1156L6707J1295J334j0268j5847J2156k6325k7999L2081
$$ 19384 4258 -10971 -22127 14580 25875 27209 16941 1094 13250 -13075 -41074 -8993
14615h993K2400J861k4222k9431L7539j5367p760J5447J6755J2772l511l516K4288
$$ -8993 13407 15268 -8954 -38385 -846 -16213 -23973 -8526 8229 21001 17490 13974 38262
14602C8262n211k5810N056K5973J1857l4896m901J5920j3787k0291n450J3860
$$ 38262 33051 7241 12297 38270 50127 15231 10330 26250 12463 -7828 -13278 582
14590E82J3748j0455n14K154p906N391J2803j5677j7700R714k7150N538L4182
$$ 582 14330 3875 3361 5515 -2391 3000 15803 126 -17574 -7860 -35010 -29472 4710
14577D710J4450J111J1823J205j2618l346j1461j0113N548J2499K0837J5913O435
$$ 4710 19160 20271 32094 33299 20681 17335 5874 -4239 1309 13808 34645 50558 56993
14564E6993k2934k3249k5066j4896P176N913L859K902r082k3906J9810M4150O422
$$ 56993 34059 10810 -14256 -29152 -21976 -16063 -12204 -9302 -18384 -42290 -22480 21670 28092
14551B8092k2218k5276j7246M237n55J7223n476m286k7783j0315L184Q748P478
$$ 28092 5874 -19402 -36648 -32411 -32966 -15743 -21219 -25505 -53288 -63603 -60419 -51671 -44193
14538d4193J2380M743m3675J0387L1732K7358J2446j3212k0176j3508J1282q834
$$ -44193 -31813 -27070 -70745 -60358 -28626 -1268 11178 -2034 -22210 -35718 -24436 -33270
14526c3270K2483J0774l133J1675j345m693J1003J3235P584q089n659l242j7258
$$ -33270 -10787 -13 -3146 8529 7184 2491 13494 26729 34313 26224 20565 17323 65
14513F5M681J5224M724K762q227k0129J7345Q494j5907J0810K1330L470j054j2746
$$ 65 4746 19970 24694 27456 19229 -900 16445 24939 9032 19842 41172 44642 43588 30842
14499C0842J284K73p34j7265R498K5664k16m5450j2820r36J2722J8495J9790O619
$$ 30842 32126 32399 31665 14400 23898 49562 49346 3896 -8924 -9860 2862 21357 41147 47766
14485D7766l5339j523j1727j7061j702L7203J9669j6307j2084j538K6123j7880
$$ 47766 12427 10904 -823 -17884 -19586 17617 37286 20979 8895 7357 33480 15600
14473A5600J029K0646N128P519J1481n632k4856l0449j349J7214j0458j0605m111
$$ 15600 16629 37275 42403 49922 61403 55771 30915 466 -883 16331 5873 -4732 -8843
14460h843O525L2847j4792M02k0943j4415J0156M163J0518Q209k693P686l549
$$ -8843 -2318 30529 15737 16139 -4804 -19219 -9063 -4900 5618 13827 11134 18820 15271
14447A5271J2264J928m351J5013J7730l0147k3017j3244j1885j63M29n215L4278
$$ 15271 27535 29463 25112 40125 57855 27708 4691 -8553 -20438 -20601 -20172 -25387 8891
14434H891K722o622N551J267k3045J1967J8855j646N367k1503J1339J1987j0880
$$ 8891 11613 4991 10542 11809 -11236 731 19586 17940 23307 1804 13143 25130 14250
14421A4250j2035j4131m555j103J9080m549j937J6004Q685j2093J6474j5517k5881
$$ 14250 2215 -11916 -16471 -17574 1506 -3043 -4980 11024 19709 7616 24090 8573 -17308
14408a7308O184j944m039j0101J500J818q666J3545K7253n904l4394j557J8918
$$ -17308 -11124 -13068 -17107 -27208 -25708 -23890 -32556 -19011 8242 2338 -32056 -33613 -14695
14395a4695L8831l254j5920K0516J4303k84k2244K710n629l0280m5319j1510K1084
$$ -14695 24136 20882 4962 25478 39781 39497 17253 19963 14334 -15946 -61265 -72775 -51691
14382e1691K8767J9614L586j9663j6278J0219K1039K0945p060l5877l126j8564
$$ -51691 -22924 -3310 276 -19387 -35665 -25446 -4407 16538 9478 -26399 -29525 -48089
14370d8089P170J4061K4742K5012k1813J0182J3343q138j1634j2257l0180J5386
$$ -48089 -40919 -26858 -2116 22896 1083 11265 24608 16470 4836 -7421 -37601 -22215
14358b2215L0067Q652O606n3692q978K9708R637j8627j2665J6838J7114l4290
$$ -22215 7852 16504 23110 -30582 -39560 -9852 -215 -18842 -31507 -14669 2445 -31845
14346c1845q420K157J4359J031J968K772r090J8274J4924o372l5920j2209O349
$$ -31845 -40265 -38108 -23749 -22718 -20750 -17978 -27068 -8794 6130 -242 -36162 -48371 -42022
14333d2022j2399j0193J3954J5158k76j9659J3332L1785o053l6484r808Q402M518
$$ -42022 -54421 -64614 -50660 -35502 -35778 -55437 -42105 -10320 -16373 -52857 -62665 -54263 -49745
14320d9745K1601J5356N931m885o862o431J0221N163J5882J7509N775K1006J58
$$ -49745 -28144 -12788 -6857 -11742 -18604 -25035 -14814 -9651 6231 23740 29515 50521 50679
14307E0679j8449l6172J153m983N25N590j4051o149K1038l451j8240M2506J3965
$$ 50679 32230 -3942 -2789 -7772 -7247 -1657 -15708 -21857 -819 -4270 -22510 19996 33961
14294C3961L486j8152K745j3494J5745J4882l4518j1138R580J0412J7650J6471
$$ 33961 37447 19295 22040 8546 24291 39173 4655 -6483 3097 13509 31159 47630
14282D7630j163o781k892j9093M817K5788Q663j6909q914p402j2911n561K3355
$$ 47630 46467 39686 36794 17701 22518 48306 56969 40060 31146 23744 10833 5272 28627
14269B8627N76k1105p001K4835q737N575j5795J1251K3333n071K543j6938l2605
$$ 28627 29203 8098 1097 25932 17195 22770 6975 18226 41559 36488 39031 22093 -10512
14256a0512k2187q723K9294p693j9114K1575K1226N567j2233J4209J89k8678r130
$$ -10512 -32699 -41422 -12128 -19821 -38935 -17360 3866 9433 -2800 11409 11598 -17080 -26210
14243b6210J986m854R559j7678j1118J332P041O291K6933K5537j6540j3145j6706
$$ -26210 -24224 -29078 -19519 -37197 -48315 -46983 -39942 -33651 -6718 18819 2279 -10866 -27572
14230b7572R28J5702N12j2896j3203K4520J5865M773j65M094K0701L1312l1994
$$ -27572 -26644 -10942 -10430 -23326 -36529 -12009 3856 8629 8464 12558 33259 64571 32577
14217C2577Q66o420o691J3837P112o885j4711j497m381J0874J7992p721k7816
$$ 32577 33443 27023 20332 34169 41281 34396 19685 18188 13807 24681 42673 34952 7136
14204G136o833J7596J9423j690k9650k0435n000M63J404o983P68l956o672R235
$$ 7136 303 17899 37322 35632 5982 -14453 -19453 -18990 -17586 -24569 -23801 -27757 -34429 -25194
14190b5194J8619k060p509j8958K0317K6865J9395j5076j988J6250j1798k2655
$$ -25194 -6575 -8635 -16144 -35102 -14785 12080 31475 16399 14411 30661 18863 -3792
14178c792j2941N476K8481J8333n851k3502r587P464O864k326p408J555M524j4768
$$ -3792 -16733 -11257 17224 35557 29706 6204 -3383 4081 10945 8619 1211 2766 7290 -7478
14164g478J7574j1931o896q730P021K1061J2417k0208q373J5395j2786j4908L648
$$ -7478 10096 -1835 -8731 -17461 -10440 10621 23038 2830 -5543 9852 -2934 -17842 -14194
14151a4194j4741o517J2947L1646p717k5066m876Q205n845j638R935M671K305
$$ -14194 -28935 -35452 -22505 9141 1424 -23642 -28518 -20313 -26158 -27796 -17861 -13190 -10885
14138a0885K1583K900K8426n292l0793j1882J9051k969k4154O894R372K435J2302
$$ -10885 10698 13598 42024 36732 5939 -5943 13108 10139 -14015 -7121 2251 4686 16988
14125A6988j0205n256L6482J4541J0018M592j0393Q909q060L55l667k5029k3631
$$ 16988 6783 1527 38009 52550 62568 67160 56767 65676 57616 57971 54304 29275 5644
14112E644p165j0405M902J0411J196j4137l1690k4915L7659N9911n094J5432M219
$$ 5644 -1521 -11926 -7024 3387 4583 -9554 -41244 -66159 -28500 31411 26317 41749 45968
14099D5968p027j4188k1007K4893J3592j5541o640K0064q227o059p847k1078J4405
$$ 45968 38941 24753 3746 28639 42231 26690 20050 40114 31887 25828 17981 -3097 11308
14086A1308K1070J1794J20k7315j1659m28L0542R17j3260J3989N556J7089l1210
$$ 11308 32378 44172 44292 16977 5318 4890 35432 36349 23089 37078 42634 59723 28513
14073B8513j5060K3023J0369j0244l2340k6074J1194R917j7379r058j6112o878
$$ 28513 13453 36476 46845 36601 4261 -21813 -10619 -702 -18081 -27139 -43251 -50129
14061e0129K1787K2606o167O099j6076j3684K9511K1990j4886k3402L3175R984
$$ -50129 -28342 -5736 -11903 -5804 -21880 -35564 -6053 15937 1051 -22351 10824 20808
14049B0808l477K588r12j4678k6534K62M467j3718J3181K9133L622k2953j4212
$$ 20808 17331 19919 19007 4329 -22205 -21943 -17476 -31194 -18013 11120 14742 -8211 -22423
14036b2423l607R972J226l7739r176j134J5180K6900K6837R755n626J3896j7899
$$ -22423 -26030 -16058 -14832 -52571 -61747 -62881 -47701 -20801 6036 15791 10165 24061 6162
14023F162N452j3004k1792O002O33K3496O442p893J3569N851M225p649k1806j3385
$$ 6162 11614 -1390 -23182 -17180 -16547 6949 13391 5498 19067 24918 29143 21494 -312 -13697
14009a3697o493K0187P946Q82J1772j835L187L10J5658o396m0145k6778R164r87
$$ -13697 -20190 -3 7943 8825 20597 18762 21949 22259 37917 31521 -8624 -35402 -26238 -27225
13995b7225j9697P729K346P94L4548P185j2374j4002k650J2019n061K5211O040
$$ -27225 -46922 -39193 -36847 -36053 -1505 5680 -6694 -20696 -23346 -11327 -16388 8823 14863
13982A4863m446k003j6030N265j0815J5386r58q44O58M849L135k7810J2340K4522
$$ 14863 10417 8414 -7616 -2351 -13166 2220 1262 418 1076 5925 9060 -18750 -6410 18112
13968A8112O340k1136k8132K47R045R655K1797M419m5401j7577K6581l1813L2619
$$ 18112 24452 3316 -24816 -24569 -15524 -5869 15928 20347 -25054 -42631 -16050 -47863 -15244
13955a5244N3994R039l368m262J0769o935j8941j0830J934r381l953p264j954
$$ -15244 38750 47789 44421 40159 50928 43993 25052 14222 16156 6775 2822 -4442 -6396
13942f396r902J5760j3885N04N711N001L5115K526m3833o791j3503J5273J9338
$$ -6396 -16298 -538 -14423 -13919 -8208 -3207 31908 34434 -9399 -16190 -29693 -14420 4918
13929D918J5915J3094Q204j213K656j3113J669o866k5799M019R397p379p904k6238
$$ 4918 20833 33927 42131 40918 43574 30461 32130 25264 -535 3484 12881 5502 -2402 -28640
13915b8640k000J1797q048R999N073j32L1871o832k7710J4009L202J7045J4328
$$ -28640 -30640 -18843 -26891 -16892 -11819 -11951 19920 13088 -14622 -613 2589 19634 33962
13902C3962j1985N039r744l1192j2207L648J2609J3535M6925J3300j4307r141
$$ 33962 21977 27016 17272 -13920 -26127 -22479 -9870 3665 50590 63890 49583 40442
13890D0442j5157j1160j3484l7591r820L849M709K5429K3513j2779J4005n124
$$ 40442 25285 14125 641 -36950 -46770 -42921 -38212 -12783 10730 -2049 11956 6832
13878F832M29R082j645J199J7126n514j6367j1931L547k7976L3547L3542O297
$$ 6832 7261 16343 14698 15897 33023 27509 11142 -789 2758 -25218 8329 41871 48168
13865D8168K808J4461j4797l2496j6037J18n159L4694J4026p305j5506k299O068
$$ 48168 50976 65437 50640 18144 2107 2225 -2934 31760 45786 38481 22975 20676 26744
13852B6744j5558J3745J5181J7506m0527m1247j2000l63k3328j838N0019J2643
$$ 26744 11186 24931 40112 57618 17091 -24156 -36156 -36519 -59847 -61685 -11666 977
13840I77J5935j7137n1799J7816J5903J8033K5138l049j4732R420q944r194R585
$$ 977 16912 -225 -52024 -34208 -18305 -272 24866 21817 7085 16505 7561 -1633 7952
13827G952j324j544J7181Q358j4153k3060k4641L947L0301J8429J2118P069l5216
$$ 7952 6628 5084 22265 30623 16470 -6590 -31231 -27284 3017 21446 33564 40633 5417
13814E417K9514P022p984l6786j0804k1406j5929L2771m164l8934o897k994K3284
$$ 5417 34931 41953 33969 -2817 -13621 -35027 -50956 -18185 -22349 -61283 -68180 -71174 -47890
13801d7890K4603J4238J7810N830m0769J3821J9914j1802k3145J5651R929J1188
$$ -47890 -23287 -9049 8761 14591 -26178 -12357 7557 -4245 -27390 -11739 -1810 9378
13789I378P192j3504R973K6247j6406K14L1721j2673Q592J737j9000j3477M807
$$ 9378 16570 3066 13039 39286 22880 23094 54815 42142 50734 52471 33471 19994 24801
13776B4801j6466p622J2398k4407L027J6272j3210k2616K8011m193J879j2540
$$ 24801 8335 713 13111 -11296 -8269 8003 -5207 -27823 188 -4005 -2126 -14666
13764a4666k537k261k235L1221M737j3246K0511J2788J0729k91m0176o00O067
$$ -14666 -17203 -19464 -21699 9522 14259 1013 21524 34312 45041 44750 4574 3974 10041
13751A0041k9942p778J3315O908J2947K7046L791j7443p483J7057r096k2654L812
$$ 10041 -19901 -27679 -14364 -7456 5491 32537 36328 18885 11402 28459 19363 -3291 521
13738E21L6233r143R84j1753M267m025J6693K0115R975j1453l2966k1479J1154
$$ 521 36754 27611 28595 16842 21109 17084 33777 53892 63867 52414 19448 -2031 9123
13725I123J9695l6109l1075J2412L1881R653l552j8840Q57J3471K1068l786l7344
$$ 9123 28818 -7291 -38366 -25954 5927 15580 12028 -6812 -5955 7516 28584 24798 -12546
13712a2546J3922l135K355M496l988n311k1820K646K0104m450r335m511J2484
$$ -12546 1376 -1759 596 5092 1104 -4207 -26027 -23381 -3277 -7727 -17062 -21573 -9089
13699i089J8946M673P187j5330j5922j0891J6366R825J2667j1781K0840J1682
$$ -9089 9857 14530 21717 6387 -9535 -20426 -4060 5765 18432 6651 27491 39173
13687C9173n010N009j3021M031j99j8043l2351M606k1409k5243K9204j2910K2071
$$ 39173 34163 39172 26151 30182 29983 11940 -20411 -15805 -37214 -62457 -33253 -46163 -24092
13674b4092L7305L0831K3257k626l1892j5455o892J9203N311l0995p362P110j407
$$ -24092 13213 44044 67301 64675 32783 17328 10436 29639 34950 3955 -3407 3703 2296
13661B296k0788j6155L9473J3544k2037J859k1387K0502m203J8718k1354q430
$$ 2296 -18492 -34647 4826 18370 -3667 -1808 -23195 -2693 -6896 11822 -9532 -17962
13649a7962J6697K6245J5955j0351j1391K1095l026k0078l628j8778j7856j1718
$$ -17962 -1265 24980 40935 30584 19193 40288 37262 17184 13556 -5222 -23078 -34796
13637c4796p825J1392M397J7278J8749j0483j904K2815j3670k8620o878L690R45
$$ -34796 -42621 -31229 -26832 -9554 9195 -1288 -3192 19623 5953 -22667 -29545 -25855 -24910
13624b4910j0255j4417M958j622J6744M3378K0774J2385L7731J4775j4335k1709
$$ -24910 -35165 -49582 -44624 -46246 -29502 13876 34650 47035 84766 99541 85206 63497
13612F3497j1795j0002k1659p069P600j6895k0430j1563R344Q806j2839j6356
$$ 63497 51702 41700 20041 12972 20572 3677 -16753 -28316 -18972 -10166 -23005 -39361
13600c9361J4462K2969J0897k0030q999J4870j3277L702J3850K1939J8751J202
$$ -39361 -24899 -1930 8967 -11063 -20062 -5192 -18469 -14767 -917 21022 39773 40975
13588D0975J360j915k693j9827J342Q697J4599j2163n234p628k5709j0156n150
$$ 40975 42335 40420 37727 17900 19242 27939 42538 30375 25141 17513 -8196 -18352 -23502
13575b3502j4031n843P542j5675j6602K5281j185j1927J2024O339j9446R686J4968
$$ -23502 -37533 -43376 -35834 -51509 -68111 -42830 -44015 -55942 -43918 -37579 -57025 -47339 -32371
13562c2371R856j678Q477J4987R308J1839k210r05Q356L807m406j1893q923k6429
$$ -32371 -22515 -24193 -15716 -729 8579 20418 18208 17303 25659 29466 25060 13167 4244 -22185
13548b2185k7403K8474M2473k601l1634J7120j4615j8804N777j8033J495P434
$$ -22185 -49588 -21114 21359 18758 -12876 4244 -10371 -29175 -23398 -41431 -39936 -32502
13536c2502J1343J6348q514J6392K1568l0025n658K0967N235j4084J9912j919
$$ -32502 -21159 -4811 -13325 3067 24635 -5390 -11048 9919 15154 1070 20982 19063
13524A9063j5625k1309j8414K2496K4015m527j1594o399k0328j5268K3964M375
$$ 19063 3438 -17871 -36285 -13789 10226 5699 -5895 -12294 -32622 -47890 -23926 -19551
13512a9551j991M645J7938J6259J3450R759j1005j266k366l5272j392l215J3222
$$ -19551 -21542 -16897 1041 17300 30750 40509 29504 28238 25872 -9400 -10792 -14007 -785
13499g85q838L931P692K1446J3576j0311m0368k4616l2685Q166M3177J20J360
$$ -785 -9623 -5692 2000 23446 37022 26711 -13657 -38273 -70958 -62792 -19615 -19495 -18135
13486a8135r478o632K2978J9671m105Q766P670J0216j3119k151j2581J7666J0487
$$ -18135 -27613 -34245 -11267 8404 4299 13065 20735 30951 17832 15681 3100 20766 31253
13473C1253j4482J5287K6837j2989k749j0994j1065O190P211k2250M861j671j5334
$$ 31253 16771 32058 58895 45906 43157 32163 21098 27288 34499 12249 17110 15439 105
13460A05m567k1045q880j6543j0188K7099k457R653j7121Q789K1017P280k1015
$$ 105 -4462 -25507 -34387 -50930 -61118 -34019 -36476 -26823 -43944 -35155 -14138 -6858 -27873
13447b7873k2739J9688j909n600j2881r528j5352K3437K9087p028j416J4236J011
$$ -27873 -50612 -30924 -32833 -38433 -51314 -60842 -76194 -52757 -23670 -30698 -32114 -17878 -16867
13434a6867M097J4424J9605J1630q505k7310j8742k9589Q572M2004O585m910q176
$$ -16867 -12770 1654 21259 32889 24384 -2926 -21668 -51257 -42685 -681 5904 994 -7182
13421g182N37K0575p043j6270k6643j9373K9238J4574l2195J5912M8988J816j8715
$$ -7182 -6645 13930 6887 -9383 -36026 -55399 -26161 -11587 -43782 -27870 21118 22934 4219
13408D219K158q655J3958J0109o432R99M821k0556l6434K8164L6688l5954o339
$$ 4219 6377 -2278 11680 21789 15357 16356 21177 621 -35813 -7649 29039 -6915 -13254
13395a3254j171J4383j2268k1470j012J1987J7185J0748k723R996K953N07J804
$$ -13254 -14425 -42 -12310 -33780 -34792 -22805 -5620 5128 2405 12401 15354 15861 17665
13382A7665m862j7500m747O234J8147k2523N587J8390j1185L639j1127J7021j322
$$ 17665 12803 -4697 -9444 -3210 14937 -7586 -1999 16391 5206 8845 -2282 14739 13417
13369A3417j6707J509j2063J709O765r400J3425j060J0677J257j895q861L1507
$$ 13417 -3290 -1781 -13844 -12135 -5370 -14770 -1345 -2405 8272 9529 7634 -1227 30280
13356C0280J4086k7599p164k5182j4057K3666L7477R001L684j3425j3738N39L9137
$$ 30280 44366 16767 9603 -15579 -29636 -5970 31507 40508 44192 30767 17029 17568 56705
13343E6705k590k6211N584o61m593J1020j1675q343r733n765J4632Q986j693k6130
$$ 56705 54115 27904 33488 32827 28234 39254 27579 19236 9503 3738 18370 27356 25663 -467
13329d67J2381K6519j9424l1222R299J1603K1900n198j1035L1545j1115k2922
$$ -467 11914 38433 19009 -12213 -2914 8689 30589 25391 14356 45901 34786 11864
13317A1864q563J5227n678k083J3519j0614J8364O128j7539l6188j1972j920L1619
$$ 11864 3301 18528 12850 10767 24286 13672 32036 38164 20625 -15563 -27535 -29455 2164
13304B164K5018o029p655L2757l2536l3533J0668J4360k5844Q67K7834j4469l3342
$$ 2164 27182 21153 13498 46255 13719 -19814 -9146 5214 -20630 -19763 8071 -6398 -39740
13291c9740l5948K71K2786J6856j0785J0774L0780Q149l699L456m594j9705l8176
$$ -39740 -75688 -75417 -52631 -35775 -46560 -35786 -5006 3143 -556 2900 -1694 -21399 -59575
13278e9575P359K1197J630M209j0031k52L4159L5887R171m775j6128j7949k3398
$$ -59575 -52216 -31019 -29389 -25180 -35211 -35463 -1304 34583 43754 38979 22851 4902 -18496
13265a8496J1877k3428j0814j0977p010J171q400L5871K0254o36J9971j6776j3317
$$ -18496 -6619 -30047 -40861 -51838 -58848 -57677 -66077 -30206 -9952 -10588 9383 -7393 -20710
13252b0710J0982K7211J1299j9544j6284j572j4035r895K9854J2335m0655r056
$$ -20710 -9728 17483 28782 9238 -7046 -8618 -22653 -32548 -2694 9641 -31014 -40070
13240d0070q905j153J8626Q089Q257K9665j9504k3416N653L924J1650o187j5693
$$ -40070 -48975 -50128 -31502 -23413 -15156 14509 -4995 -28411 -22758 -18834 -7184 -13371 -29064
13227b9064p756R516o941J5503J3304J7151M3317K1008M657m3829l5136O963o324
$$ -29064 -36820 -27304 -34245 -18742 -5438 11713 55030 76038 80695 36866 1730 8693 2369
13214B369j8882J4642j484j2563o438K866K2646l164k3116L201J4493k283l371
$$ 2369 -16513 -1871 -3355 -15918 -22356 -19490 3156 -8 -23124 -19923 -5430 -7713 -11084
13201a1084J8590J7168k5346j8125K820j3869K388j8825N989L0194N479j4043
$$ -11084 7506 24674 -672 -18797 -15977 -29846 -27458 -46283 -40294 -10100 -4621 -18664
13189a8664j4217L7873J1302L402j3401k9405J2835O327j181j2271Q967K3378
$$ -18664 -32881 4992 16294 19696 6295 -23110 -10275 -3948 -5129 -17400 -8433 14945
13177A4945N566j1296j6024j0803K5394J5813K25k370k654k22l4827m1195J2098
$$ 14945 20511 9215 -6809 -17612 7782 23595 23820 21450 18796 18574 -16253 -57448 -45350
13164d5350K1944q702K5572L4300j2941N03Q423O976n6112m5106L834K4915J1240
$$ -45350 -23406 -32108 -6536 27764 14823 15326 23749 30725 -25387 -70493 -66659 -41744 -30504
13151c0504m959j1163k139K6466K7914n73K2303j5069j7670k2406R762j707L0676
$$ -30504 -35463 -46626 -48765 -22299 5615 5042 27345 12276 -5394 -27800 -18038 -19745 10931
13138A0931L477j1412k9089l204j519J5108j9968j3376K8110k039l054K6038R168
$$ 10931 14408 2996 -26093 -29297 -30816 -15708 -35676 -49052 -20942 -22981 -26035 3 9171
13125I171o629M094j7071k2003K2363J2620M589j5953j9763r826J6709J5492l0357
$$ 9171 2542 6636 -10435 -32438 -10075 2545 7134 -8819 -28582 -38408 -21699 -6207 -36564
13112c6564o896j418J9769K0015k9504K975K1205n00l983J3418K7347q311j1753
$$ -36564 -43460 -44878 -25109 -5094 -34598 -31623 -10418 -10918 -14901 -1483 25864 17553 5800
13099E800J0982M194R30q544j4361R96M688J1147j305k6223j2697J5450J0568
$$ 5800 16782 20976 21906 13362 -999 -3 4685 15832 14527 -11696 -24393 -8943 1625
13086A625o744R79K7780k2729j6668J2654j9679M403k2665P236Q806M1100j8213
$$ 1625 -5119 -4140 23640 911 -15757 -3103 -22782 -18379 -41044 -33808 -25002 16098 -2115
13073b115k3976p718J8056j7886p920R35p69r353L680K4428K292K0988Q772o353
$$ -2115 -26091 -33809 -15753 -33639 -41559 -40624 -41393 -50746 -47066 -22638 -20346 642 9414 3061
13059C061k5065L002M620k8333K1369J9520K8582k6730k0984J5385J9526m681
$$ 3061 -22004 -19002 -14382 -42715 -21346 -1826 26756 26 -20958 -5573 13953 9272
13047I272j9098N356K5793K887l5253j1900p675J1073L5910M5446L054m7027p667
$$ 9272 -9826 -4470 21323 24210 -11043 -22943 -30618 -19545 16365 61811 64865 17838 10171
13034A0171q366l247j2831L4589K997k9724k999r755k350j9854n698l182O276
$$ 10171 1805 -1442 -14273 20316 23313 -6411 -9410 -19165 -21515 -41369 -47067 -50249 -43973
13021d3973J3453K1137j5394K1524L0588j6367p036R925j8127l288J87K2603J9910
$$ -43973 -30520 -9383 -24777 -3253 27335 10968 3932 13857 -4270 -7558 -7371 15232 35142
13008C5142j495k8892m1049j6493K6100k357K0109K1483K12L108j0002k9275l7450
$$ 35142 33647 4755 -36294 -52787 -26687 -29044 -8935 12548 12760 15868 5866 -23409 -60859
12995f0859J3807L084K6514J4906l7160j7503K1816J9936Q020J6754k7067j8231
$$ -60859 -47052 -43968 -17454 -2548 -39708 -57211 -35395 -15459 -7439 9315 -17752 -35983
12983c5983J179J2352L0955O113q775J0514n405j698o014K239R533J5026k1887
$$ -35983 -34804 -22452 8503 14616 5841 16355 10950 9252 3238 5477 15010 30036 8149
12970H149N519J7413O792j4613n672j239j7711P688m056j7003n5j253Q92j4305
$$ 8149 13668 31081 37873 23260 17588 16349 -1362 6326 2270 -14733 -14788 -16041 -15149 -29454
12956b9454J9736J8373J1510K4392j0472J0885N386k5624j0212J5602K6158j3053
$$ -29454 -9718 8655 20165 44557 34085 44970 50356 24732 14520 30122 56280 43227
12944D3227J4839k541j1694k2673k4338k4625P710K1674k820J6765o31q187J6811
$$ 43227 58066 55525 43831 21158 -3180 -27805 -20095 1579 -1241 15524 14893 6706 23517
12931B3517M2540p852k1430k578j7952n116l0360J2284k832j2160n661P283N759
$$ 23517 66057 58205 36775 34197 16245 11129 -19231 -6947 -9779 -21939 -27600 -20317 -14558
12918a4558o791K0320L0373l753j4736p156K3402J7611J572j8638P249Q00j3268
$$ -14558 -21349 -1029 29344 25591 10855 3699 27101 44712 46284 27646 34895 35695 22427
12905B2427j3222k9280k8934J2365j1329o458K7809J6124K521L6737j6152p108
$$ 22427 9205 -20075 -49009 -36644 -47973 -54431 -26622 -10498 -7977 28760 12608 5500
12893E500J4722l1388n533K3047P630j8940K667K4977j9941k7124O36J7719l556
$$ 5500 20222 -11166 -16699 6348 13978 -4962 -2295 22682 2741 -24383 -23747 -6028 -9584
12880i584M214p180K8396J0000j0771k1728j3517K9021M745o367O145m1624j1463
$$ -9584 -5370 -12550 15846 25846 15075 -6653 -20170 8851 13596 7229 13374 -28250 -39713
12867c9713J9762L4500J6896p273j9042O07l322q91J2357Q413k79K677n110k4216
$$ -39713 -19951 14549 31445 24172 5130 5737 2415 1524 13881 22294 22015 24692 19582 -4634
12853d634j2292M367p580k6383J3505L2066r320k0355j8971o69j3684J9525j1592
$$ -4634 -16926 -12559 -20139 -46522 -33017 -951 -10271 -30626 -49597 -50266 -63950 -44425 -56017
12840e6017k6189L041K8614o914K8222j10Q895J4769K2001N405r18j1537R586
$$ -56017 -82206 -79165 -50551 -57465 -29243 -29353 -20458 -5689 16312 21717 20799 9262 18848
12827A8848J8240J387k2376j8602o285J5383o933q76J6527j6088k6751o084m879
$$ 18848 37088 38475 16099 -2503 -8788 6595 -338 -1214 15313 -775 -27526 -33610 -38489
12814c8489R551o250L3635n81j7053k2476R962J7734m385q982N704L0603J3369
$$ -38489 -28938 -35188 -1553 -2134 -19187 -41663 -31701 -13967 -18352 -27334 -21630 8973 22342
12801B2342n138L4479J1523l4501r023M701k3772n066L698l149l561q247L869
$$ 22342 17204 51683 63206 28705 19682 24383 611 -4455 -757 -3906 -7467 -15714 -11845
12788a1845k627l37J917M32r722m113r058q612J9843R160L1772J1204j9257l2118
$$ -11845 -14472 -14809 -12892 -12460 -22182 -26295 -35353 -43965 -24122 -14962 16810 28014 8757 -23361
12774b3361Q163N013J2263m491Q421J4980J7852j0788m934o851J062q602j968
$$ -23361 -15198 -10185 2078 -2413 6008 20988 38840 28052 23118 16267 17329 8727 6759
12761F759k25p547n394J269J4742L3015K4718K3439j3408j282K3491L087k6767
$$ 6759 6534 -1013 -6407 -5138 9604 42619 67337 90776 77368 76086 99577 102664 75897
12748G5897n093j2153j1873p263k942J3872k7221M325J166l5739j4507J29j9768
$$ 75897 70804 58651 46778 39515 36573 50445 23224 27549 28715 -7024 -21531 -21402 -41170
12735d1170L518Q466m948k199K3741J8034o182J3709m086Q654k6274r06P00j5249
$$ -41170 -37652 -29186 -34134 -36333 -12592 5442 -740 12969 8883 17537 -8737 -9643 -8943 -24192
12721b4192k4113K1389J5658L363L562j8736J1451o56k1826L0173K4482l3239
$$ -24192 -48305 -26916 -11258 -7895 -4333 -23069 -11618 -12274 -34100 -3927 20555 -12684
12709a2684p98p474O417J3718J0751p938Q444P12k7595j5494O35j037o106J8991
$$ -12684 -13482 -20956 -14539 -821 9930 1992 10436 11148 -16447 -31941 -31306 -32343 -38449 -19458
12695a9458L509J8626J1376p251k6222L368M609M65J1631k8650j1974K9392J5217
$$ -19458 -15949 2677 14053 6802 -19420 -16052 -11443 -10978 653 -27997 -39971 -10579 4638
12682D638J6466k9064o06K6171k4098J8142J4330l6329p749j2496k2076N162J2211
$$ 4638 21104 -7960 -8566 17605 -6493 11649 25979 -10350 -18099 -30595 -52671 -47509 -35298
12669c5298K7080L1255k1611m7939j8642J3515J3535L1962O456o41j4722j085
$$ -35298 -8218 23037 1426 -46513 -65155 -51640 -38105 -6143 313 -328 -15050 -16135
12657a6135k0399j9976K4723K8280O249j7512k2092L2056N148j0006k2265J6209
$$ -16135 -36534 -56510 -31787 -3507 2742 -14770 -36862 -4806 342 -9664 -31929 -15720
12645a5720J0292k2439o561K0515J2392k1990j3244K9417J1420J2964R678k2261
$$ -15720 -5428 -27867 -34428 -13913 -1521 -23511 -36755 -7338 4082 17046 26724 4463
12633D463J7052j871k1207j2937J3825J8217L310M339j5550n192k052k9657J6222
$$ 4463 21515 19644 -1563 -14500 -675 17542 20852 25191 9641 4449 2397 -27260 -11038
12620a1038K6489n655P542J2563j5743k4956Q467J900N96j4706n965K6899K4750
$$ -11038 15451 9796 17338 29901 14158 -10798 -2331 -431 165 -14541 -20506 6393 31143
12607C1143p577k1292k6017k6016L8150K405k1614J7844K2329j9512N8J3711j984
$$ 31143 23566 2274 -23743 -49759 -11609 -9204 -30818 -12974 9355 -10157 -10099 3612 1628
12594A628J0376J44M509n19m272k0046j0962R402M300k631K7827p167k8842o80
$$ 1628 12004 12148 16657 16138 11866 -8180 -19142 -9740 -5440 -8071 19756 12589 -16253 -16933
12580a6933j65N010o273O270M338M908K1165k5116n318J5610K1130j0539J6521
$$ -16933 -17098 -12088 -18361 -12091 -7753 -2845 18320 -6796 -12114 3496 24626 14087 30608
12567C0608K16j8713l5196m99L3145k9271n798N648P198L8930P366l645k2680
$$ 30608 30824 12111 -23085 -23584 9561 -19710 -25508 -19860 -12662 26268 33634 29989 7309
12554G309j9666k0468R840m546n013j7302N779M908j902r206K3060J6883K1055
$$ 7309 -12357 -32825 -22985 -27531 -32544 -49846 -44067 -39159 -41061 -50267 -27207 -10324 10731
12541A0731J0883K111N419J1462j2563l9327k0489j7806J5472L295R769r91Q832
$$ 10731 21614 23725 29144 40606 28043 -11284 -31773 -49579 -34107 -30812 -21043 -22034 -13202
12528a3202R042Q342j6447j8236J9363J0843J428j4852r69Q175M3k1202j2405
$$ -13202 -4160 4182 -12265 -30501 -11138 -295 1133 -13719 -14688 -6513 -6470 -27672 -40077
12515d0077M345J4088Q742J571L4391j7267J2703N107l7591k0654L903K2714K4421
$$ -40077 -35732 -21644 -12902 -11331 23060 5793 18496 23603 -13988 -34642 -30739 -8025 16396
12502A6396j4542o132j4155k3047J4337K348n1357j447P4107L2942r74l4280J4737
$$ 16396 1854 -4278 -18433 -41480 -27143 -24795 -76152 -77599 -3492 29450 28476 -5804 8933
12489H933N930r371J557R633j1872k2833J4706P020j6341m969j1182J8292r260
$$ 8933 14863 5492 7049 16682 4810 -18023 -3317 3703 -12638 -17607 -28789 -10497 -19757
12476a9757n76J01p172j5525J9228J4821M416n263J1093J2747l0774M052M2936
$$ -19757 -20333 -20232 -27404 -42929 -23701 -8880 -4464 -9727 1366 14113 -16661 -12609 30327
12463C0327J0557J2341R968j8820N622J1744m913k6747k7335l195J2652j1849
$$ 30327 40884 53225 63193 44373 49995 61739 56826 30079 2744 -451 12201 352
12451C52p03L2904j984j3375m674l5130o579j4110j9692R070J3424J3718Q798
$$ 352 -351 32553 30569 17194 12520 -22610 -29189 -43299 -62991 -53921 -40497 -26779 -17981
12438a7981k101J073J5860k903o699Q019k989M212j1302J2387J2953J5642J011
$$ -17981 -20082 -19009 -3149 -6052 -12751 -4732 -7721 -3509 -14811 -2424 10529 26171 27182
12425B7182j238J1661K6235j1203k7770j1317k526j0704j1349P863l8022J834
$$ 27182 25944 37605 63840 52637 24867 13550 11024 320 -11029 -3166 -41188 -39354
12413c9354L3940J1862n289j9215J5214K0926k6163k961Q106l926j3538j0508
$$ -39354 -5414 6448 1159 -18056 -2842 18084 -8079 -11040 -2934 -6860 -20398 -30906
12401c0906j2390K5733L8790M3791N981l1265j8711j2843J0246J2030J1978l6488
$$ -30906 -43296 -17563 21227 65018 70999 39734 21023 8180 18426 30456 42434 5946
12389E946l672J3316K7850k1362j7807l856R649O001r637Q419J2392J2300J3722
$$ 5946 2274 15590 43440 22078 4271 415 10064 16065 6428 14847 27239 39539 53261
12376E3261K0552j9756m415J3093M960j9856k8676J1158L727M818q849j2278k57
$$ 53261 73813 54057 49642 62735 67695 47839 19163 30321 34048 38866 30017 17739 17482
12363A7482L06p87M092k920m6830O46L047n592J8187M0234R569j9417n198j989
$$ 17482 17788 17001 21093 18173 -28657 -28011 -24964 -30556 -12369 27865 37434 18017 12819 10830
12349A0830l0558n150J018p17j0976L534n147j2809K1854K0651J4837J6903M333
$$ 10830 -19728 -24878 -23860 -24577 -35553 -32019 -37166 -49975 -28121 -7470 7367 24270 28603
12336B8603j5626j2113l3328k4286Q213r766j805R937l135J1706j258J293K4159
$$ 28603 12977 864 -32464 -56750 -48537 -58303 -60108 -50171 -53306 -41600 -42858 -41565 -17406
12323a7406J918J4145p868j4111K2590J4708P406k5308l2343k1156L1405L0642
$$ -17406 -15488 -1343 -9211 -23322 -732 13976 21382 -3926 -36269 -57425 -26020 4622
12311D622l0601K970L753j3679J2997J0565K0502m126j544j4132J1772J9089l1351
$$ 4622 -25979 -23009 -19256 -32935 -19938 -9373 11129 7003 5459 -8673 3099 22188 -9163
12298i163k5839O849R944N724J6777N029k5313P787Q123j5809r910k1017K921
$$ -9163 -35002 -28153 -18209 -12485 4292 9321 -15992 -8205 -82 -15891 -25801 -46818 -43897
12285d3897J5633p993k2546l8680K2628N3430L4417P099R558O526l9733q44Q805
$$ -43897 -28264 -36257 -58803 -97483 -74855 -21425 12992 20091 29649 36175 -3558 -4402 4403
12272D403j3368j799J680J8903j175J6825j6353k6174k5978O259j344k2699Q441
$$ 4403 -8965 -10764 -9084 9819 8644 25469 9116 -17058 -43036 -36777 -38121 -60820 -52379
12259e2379J9799J0893J2316K8316K9393j0696k6323j4279m323J952J1974Q761
$$ -52379 -32580 -21687 -9371 18945 48338 37642 11319 -2960 -7283 -5331 6643 15404
12247A5404m899J1969l746N080J6945j2918k9997J1176J5322Q992j0526k995M2
$$ 15404 10505 22474 18728 23808 40753 27835 -2162 9014 24336 33328 22802 19807 19849
12234A9849j55j396Q590j2411J6431k6961m5471J0228J7858K142L748m760K5421
$$ 19849 19694 18298 26888 14477 30908 3947 -41524 -31296 -13438 -11296 -7548 -12308 13113
12221A3113K0429l428k0191J8739K1785j6768j9664n54l26j2333P646K9469J2422
$$ 13113 33542 30114 9923 28662 50447 33679 14015 13461 13135 802 8448 37917 50339
12208E0339j5479m1603k6174J9942j750Q681J774J2062J6578M211J856O271o62
$$ 50339 34860 -6743 -32917 -12975 -14725 -6044 -4270 7792 24370 28581 30437 36708 36046
12195C6046k2393j9723J0262J3945k3045K803J9972o419k0745m0465l3197P163
$$ 36046 13653 -6070 4192 18137 -4908 -2105 17867 11448 -9297 -49762 -82959 -75796
12183g5796l014P723K1941J9423O91m23n057k5589o193K3580L0952j6140J3114
$$ -75796 -78810 -71087 -49146 -29723 -29032 -29455 -34512 -60101 -66294 -42714 -11762 -27902 -14788
12170a4788J401Q079L6330J5826q614j1277p587k7069k3650j5675J7925L3380
$$ -14788 -13387 -5308 31022 46848 38234 26957 19370 -7699 -31349 -47024 -29099 4281
12158D281m863j841J1443q53m741P145M602k2916k280K0780Q947q494J461l6135
$$ 4281 -582 -2423 9020 8167 3426 10571 15173 -7743 -10023 10757 19704 11210 12671 -23464
12144b3464p330J8892M739k05K825J2181O48k831j1008k561K2011j8352l466K425
$$ -23464 -30794 -11902 -7163 -7368 -4543 7638 8286 5455 -5553 -8114 13897 -4455 -7921 -5496
12130e496J3453J515j1365k3434j3944j2497O628L8617L4690J5185n176j9233
$$ -5496 7957 9472 -1893 -25327 -39271 -51768 -45140 -6523 28167 43352 38176 18943
12118A8943j943j5152m15J3041j0643m66O960O131j825l075j340l698m268p660
$$ 18943 17000 1848 1433 14474 3831 3365 10325 16456 14631 11556 10216 6518 2250 -5410
12104e410N915l38k3838P083K9092n105j2124p333k0022J2063K714L938j0409
$$ -5410 505 167 -23671 -16588 12504 7399 -4725 -12058 -32080 -20017 -17303 -13365 -23774
12091b3774q568L1345Q421l0488O589J5982n108l463k374j2772m522n930K2848
$$ -23774 -32342 -997 7424 -23064 -16475 -493 -5601 -9064 -11438 -24210 -28732 -34662 -11814
12078a1814J7140l570J769K2715J424J1379P431L500k5706r430l0484J0537L5140
$$ -11814 5326 1756 3525 26240 27664 39043 46474 49974 24268 14838 -15646 -5109 30031
12065C0031l0200j197J1765P158k37l149k5445p353l441k515j1805k090Q921J1118
$$ 30031 -169 -1366 10399 17557 17320 14171 -11274 -18627 -22068 -24583 -36388 -38478 -29557 -18439
12051a8439J6120k8219k444R435j5787p019j9718J9177K2906j77J4047K2979K517
$$ -18439 -2319 -30538 -32982 -23547 -39334 -46353 -66071 -46894 -23988 -24165 -10118 12861 15378
12038A5378k0336j4467l64N698J5353j0934k9412n095J3851K683j9171l1184M95
$$ 15378 -4958 -19425 -19789 -14091 1262 -9672 -39084 -44179 -30328 -27645 -46816 -78000 -77505
12025g7505K7666L3717Q626j6601j7275k218L550Q974m629N256p374P940J8728
$$ -77505 -49839 -16122 -7496 -24097 -41372 -43590 -40040 -31066 -35695 -30439 -37813 -29873 -11145
12012a1145M037J7866j1419j493j689P765J2864r06J9596l1047j0661o78j7056
$$ -11145 -7108 10758 -661 -2154 -3843 3922 16786 15880 35476 4429 -6232 -6910 -23966
11999b3966j9841K2486K8358l7072l1358J2033K8456J2948K3476o072k1155N511
$$ -23966 -43807 -21321 7037 -30035 -61393 -49360 -20904 -7956 15520 9448 -11707 -6196
11987f196j5659J5209J344j2138J5533l0500m695K2850J4805J1801L319j2869
$$ -6196 -21855 -6646 -5302 -17440 -1907 -32407 -37102 -14252 553 12354 15673 2804
11975B804j3750q389Q167j2938j0166J1247r93l1180j1964j4428K0296M838M2046
$$ 2804 -10946 -19335 -11168 -24106 -34272 -23025 -24018 -55198 -67162 -81590 -61294 -56456 -14410
11962a4410Q927r996j423J8858q666j7314j5955J4448q45J8225j739L706l095
$$ -14410 -5483 -15479 -16902 1956 -6710 -24024 -39979 -25531 -26376 -8151 -9890 -6184 -9279
11949i279l4816K6117L9201K3647j4853m8220k5484K5398J4533L247k0983l899
$$ -9279 -44095 -17978 21223 44870 30017 -18203 -43687 -18289 -3756 -509 -21492 -25391
11937b5391R578K6652J6026j5992j1067o854Q222o478P462K653l048m835j9361
$$ -25391 -15813 10839 26865 10873 -194 -7048 1174 -5304 2158 4811 1763 -3072 -22433
$$ [...]
##END NTUPLES=NMR SPECTRUM
##END=
