##TITLE=Analysis number 318003
Compound Code mo 07019
Book Reference b
Project Code adrs
Chemist Name spectrum
##JCAMPDX= 6.0         $$ Bruker NMR JCAMP-DX V2.0
##DATA TYPE= NMR SPECTRUM
##DATA CLASS= NTUPLES
##ORIGIN= Bruker BioSpin GmbH
##OWNER= nmr
$$ XWIN-NMR		Version 3.5
$$ Fri Mar 10 11:05:36 2006 GMT Standard Time (UT+0h)  MAYBRIDGE\nmr@NMR_250MHZ
##.OBSERVE FREQUENCY= 250.131544655141
##.OBSERVE NUCLEUS= ^1H
##.ACQUISITION MODE= SIMULTANEOUS (DQD)
##.ACQUISITION SCHEME= undefined
##.AVERAGES= 16
##.DIGITISER RES= 18
##SPECTROMETER/DATA SYSTEM= dpx250
##.PULSE SEQUENCE= zg30
##.SOLVENT NAME= CDCl3
##.SHIFT REFERENCE= (INTERNAL, CDCl3, 0, 16.522)
##AUDIT TRAIL= $$ (NUMBER, WHEN, WHO, WHERE, WHAT)
$$ ##TITLE= Audit trail, XWIN-NMR		Version 3.5
$$ ##JCAMPDX= 5.01
$$ ##ORIGIN= Bruker BioSpin GmbH
$$ ##OWNER= nmr
$$ C:\u/data/dgb/nmr/ADRS/490/pdata/1/auditp.txt
$$ ##AUDIT TRAIL=  $$ (NUMBER, WHEN, WHO, WHERE, WHAT)
(   1,<2006-03-10 11:05:16.81 +000>,<MAYBRIDGE\nmr>,<NMR_250MHZ>,
      <created by zg, POWCHK disabled, PULCHK disabled
       configuration hash MD5:
       84 BC 41 DB A1 6E 1D 46 DA 25 12 A5 C1 ED C5 3A
       data hash MD5: 64K
       3B FA DD 87 F7 36 0A EA 73 C0 D4 FA 36 54 3E D5>)
(   2,<2006-03-10 11:05:29.05 +000>,<MAYBRIDGE\nmr>,<NMR_250MHZ>,
      <Start of raw data processing
       ef LB = 0.3 FT_mod = 6 PKNL = 1 SI = 32K 
       data hash MD5: 32K
       24 3C BF 45 BD 04 C7 03 44 A3 1E 30 05 F8 72 CD>)
(   3,<2006-03-10 11:05:30.59 +000>,<MAYBRIDGE\nmr>,<NMR_250MHZ>,
      <apk 
       data hash MD5: 32K
       E2 87 EF 81 8A 62 76 01 63 88 05 F6 7B 72 86 B5>)
(   4,<2006-03-10 11:05:31.42 +000>,<MAYBRIDGE\nmr>,<NMR_250MHZ>,
      <abs ABSG = 5 
       data hash MD5: 32K
       AE 9A 5A 16 C8 24 1A D6 7E B5 7C 7C 90 C5 BB 21>)
$$ ##END=
$$ 
$$ hash MD5
$$ 98 CB CA 1A 0B 18 C2 92 B9 4E 55 E2 A2 01 18 D4
##$RELAX= 
##$RELAX= 
##$RELAX= 
##$RELAX= 
##$RELAX= 
##$RELAX= 
##$RELAX= 
$$ Bruker specific parameters
$$ --------------------------
##$DU= <C:\u>
##$EXPNO= 490
##$NAME= <ADRS>
##$PROCNO= 1
##$TYPE= <nmr>
##$USER= <dgb>
##$AMP= (0..31)
100 100 100 100 100 100 100 100 100 100 100 100 100 100 100 100 100 100 
100 100 100 100 100 100 100 100 100 100 100 100 100 100 
##$AQSEQ= 0
##$AQ_mod= 3
##$AUNM= <au_zg>
##$AUTOPOS= <20 >
##$BF1= 250.13
##$BF2= 250.13
##$BF3= 250.13
##$BF4= 250.13
##$BF5= 500.13
##$BF6= 500.13
##$BF7= 500.13
##$BF8= 500.13
##$BYTORDA= 1
##$CFDGTYP= 0
##$CFRGTYP= 5
##$CHEMSTR= <none>
##$CNST= (0..31)
1 1 145 1 1 1 1 1 1 1 1 1 1 1 1 1 1 1 1 1 1 1 1 1 1 1 1 1 1 1 1 1 
##$CPDPRG= <>
##$CPDPRG1= <>
##$CPDPRG2= <>
##$CPDPRG3= <>
##$CPDPRG4= <mlev>
##$CPDPRG5= <mlev>
##$CPDPRG6= <mlev>
##$CPDPRG7= <mlev>
##$CPDPRG8= <mlev>
##$CPDPRGB= <>
##$CPDPRGT= <>
##$D= (0..31)
0 1 0 0 0 0 0 0 0 0.06 0 0 0 0 0 0 0.0002 0 0 0 0 0 0 0 0 0 0 0 0 0 0 
0 
##$DATE= 1141988715
##$DBL= (0..7)
120 120 120 120 120 120 120 120 
##$DBP= (0..7)
150 150 150 150 150 150 150 150 
##$DBP07= 0
##$DBPNAM0= <>
##$DBPNAM1= <>
$$ [...]
##$SUBNAM7= <"">
##$SUBNAM8= <"">
##$SUBNAM9= <"">
##$SW= 20.6930455092707
##$SWIBOX= (0..15)
0 0 3 0 0 0 0 0 0 0 0 0 0 0 0 0 
##$SW_h= 5175.983436853
##$TD= 65536
##$TD0= 1
##$TE= 294.16
##$TE2= 300
##$TE3= 300
##$TEG= 300
##$TL= (0..7)
0 120 120 120 120 120 120 120 
##$TP= (0..7)
150 150 150 150 150 150 150 150 
##$TP07= 0
##$TPNAME0= <>
##$TPNAME1= <>
##$TPNAME2= <>
##$TPNAME3= <>
##$TPNAME4= <>
##$TPNAME5= <>
##$TPNAME6= <>
##$TPNAME7= <>
##$TPOAL= (0..7)
0.5 0.5 0.5 0.5 0.5 0.5 0.5 0.5 
##$TPOFFS= (0..7)
0 0 0 0 0 0 0 0 
##$TUNHIN= 0
##$TUNHOUT= 0
##$TUNXOUT= 0
##$USERA1= <user>
##$USERA2= <user>
##$USERA3= <user>
##$USERA4= <user>
##$USERA5= <user>
##$V9= 5
##$VALIST= <valist>
##$VCLIST= <CCCCCCCCCCCCCCC>
##$VD= 0
##$VDLIST= <DDDDDDDDDDDDDDD>
##$VPLIST= <PPPPPPPPPPPPPPP>
##$VTLIST= <TTTTTTTTTTTTTTT>
##$WBST= 1024
##$WBSW= 4
##$XGAIN= (0..3)
0 0 0 0 
##$XL= 0
##$YL= 0
##$YMAX_a= 334349
##$YMIN_a= -384665
##$ZGOPTNS= <>
##$ZL1= 120
##$ZL2= 120
##$ZL3= 120
##$ZL4= 120
##$ABSF1= 16.522
##$ABSF2= -4.171173
##$ABSG= 5
##$ABSL= 3
##$ALPHA= 0
##$AQORDER= 0
##$ASSFAC= 0
##$ASSFACI= 0
##$ASSFACX= 0
##$ASSWID= 0
##$AUNMP= <proc_1d>
##$AZFE= 0.1
##$AZFW= 0.1
##$BCFW= 0
##$BC_mod= 0
##$BYTORDP= 0
##$COROFFS= 0
##$CY= 12.5
##$DATMOD= 1
##$DC= 0
##$DFILT= <>
##$DTYPP= 0
##$F1P= 14.0000005364418
##$F2P= -0.99999901652339
##$FCOR= 0.5
##$FTSIZE= 32768
##$FT_mod= 6
##$GAMMA= 0
##$GB= 0
##$INTBC= 1
##$INTSCL= 1
##$ISEN= 128
##$LB= 0.3
##$LEV0= 0
##$LPBIN= 0
##$MAXI= 10000
##$MC2= 0
##$MEAN= 0
##$ME_mod= 0
##$MI= 0
##$NCOEF= 0
##$NC_proc= -4
##$NLEV= 6
##$NOISF1= 0
##$NOISF2= 0
##$NSP= 0
##$NTH_PI= 0
##$NZP= 0
##$OFFSET= 16.522
##$PC= 1
##$PHC0= 175.6568
##$PHC1= 9.008208
##$PH_mod= 1
##$PKNL= yes
##$PPARMOD= 0
##$PSCAL= 4
##$PSIGN= 0
##$REVERSE= no
##$SF= 250.13
##$SI= 32768
##$SIGF1= 0
##$SIGF2= 0
##$SINO= 400
##$SIOLD= 32768
##$SREGLST= <1H.CDCl3>
##$SSB= 0
##$STSI= 32768
##$STSR= 0
##$SW_p= 5175.98343685301
##$SYMM= 0
##$S_DEV= 0
##$TDeff= 65536
##$TDoff= 0
##$TI= <Analysis number 999999
Compound Code 99
Book Reference 9
Project Code 9>
##$TILT= no
##$TM1= 0
##$TM2= 0
##$TOPLEV= 0
##$USERP1= <user>
##$USERP2= <user>
##$USERP3= <user>
##$USERP4= <user>
##$USERP5= <user>
##$WDW= 1
##$XDIM= 32768
##$YMAX_p= 315118217
##$YMIN_p= -439731
$$ End of Bruker specific parameters
$$ ---------------------------------
##NTUPLES= NMR SPECTRUM
##VAR_NAME=  FREQUENCY,     SPECTRUM/REAL,   SPECTRUM/IMAG
##SYMBOL=    X,             R,               I
##VAR_TYPE=  INDEPENDENT,   DEPENDENT,       DEPENDENT
##VAR_FORM=  AFFN,          ASDF,            ASDF
##VAR_DIM=   32768,         32768,           32768
##UNITS=     HZ,            ARBITRARY UNITS, ARBITRARY UNITS
##FACTOR=    0.157963299565203, 1,           1
##FIRST=     4132.6476996994, 0,             0
##LAST=      -1043.33573715361, 0,           0
##MIN=       -1043.33573715361, -439731,     0
##MAX=       4132.6476996994, 315118217,     0
$$ Real data points
##PAGE= N=1
##DATA TABLE= (X++(R..R)), XYDATA
$$ [...]
23901h3365k9473P1378K4403R9391l8319N8760p2643j14164m1542P4275O0797
23890I498o8789j5059o7775l7580R2427J38249J782p7851p1846j7457P2448R310
23878c2643n1264J6684r475j6452N7170J897r4177k0448J77736N8153m7736p5946
23866c6501Q5466O3666j06563q1227p1515n2082J66738P9367n9093M5662l2008
23855A910n562J2011n3742L7774K7429m9616K1234k1437q278k8001q2068Q5180
23843f3166J81999o0958r5811m3277p131R4836Q4072k4594j09655Q248k6214j43580
23831b05231k4263R2438P6283K0541J16003l2447l6318K6357N5802n5938j18691
23820h5464l1073l924O7680L1224L9933k3080O6112J06052M0587J1756k6048m4420
$$ y = [-83365, -112838, -41460, -17057, 82334, 44015, 102775, 30132, -84032, -125574, -51299, 9498, -59291, -74350, -142125, -179705, -87278, 50971, 52753, -25098, -96944, -114401, -41953, -32643, -83907, -67223, -76698, -93150, -35980, -34083, -128260, -148708, 29028, 87181, 39445, -36501, 48965, 112631, 6068, -75159, -146674, -198756, -32018, 47349, -11744, 33918, 1910, -3652, 8359, -45383, -7609, 19820, -29796, -8562, -29999, -38277, -66278, -148346, -63166, 118833, 57875, -37936, -81213, -88344, 6492, 90564, 65970, -43685, -35437, -61651, -205231, -229494, -137056, -60773, -40232, 75771, 43324, 7006, 33363, 89165, 33227, -85464, -116537, -120461, -52781, -21557, 18376, -4704, 61408, 167460, 208047, 219803, 193755, 149335]
23808A49335j54015l7117O4343j935j30183M308N9392J00326N9074j5864n7941
23797C9723l7343J21309R7817p2736r7732r7610p6593K7987m4221J15386M3283
23786A9270n6993J9608P6003j163j10257m65n991j2665o3922j23915J0522J13038
23774a36930J38731j4662q612J1948L8151j8267r7694P10R2814j02281K14P2168
23762b3710j20048Q7933K9313r2327K4948L2994k3548j4559K3890Q2801K3869
23751C1556j0401K4095J9248m4095r4535j13614K3887L8094j21227P9982L9742
23740a27268L703o364Q4366L1404j39k0530j11532J3210J21078J16382p9826M5705
23728G0189N6276l9072K2863L0983l742O9426j1362p4618k03487P8605Q3269k8579
$$ y = [149335, -4680, -41797, 22546, 20611, -109572, -105264, -45872, 54454, 113528, 97664, 39723, 2380, 123689, 221506, 148770, 51038, -46572, -123165, -95178, -139399, -24013, 19270, -37723, -18115, 57888, 56725, -53532, -53997, -59988, -72653, -136575, -260490, -249968, -136930, 1801, -12861, -21473, -9525, 28626, 10359, -87335, -86625, 6189, -96092, -95878, -23710, -143758, -55825, -26512, -118839, -93891, -60897, -84445, -99004, -75114, 7687, 31556, 21155, 45250, 64498, 20403, -74132, -187746, -163859, -125765, -246992, -167010, -127268, -123565, -129929, -45563, -14159, -14298, -34828, -146360, -133150, -12072, 104310, 24484, 70189, 126465, 87393, 110256, 141239, 137497, 206923, 195561, 120943, -82544, -3939, 79330, 50751]
23716E0751N4548k6580q9075m0134n7713m259J8547K3651l4213K9983l957q9558
23704a68009q0275L5564J71365K3357m7980n9126L7298r2580l7927P3064J7916
23693a27333p576N9689M871K9859R5919P9090o8219p2068p2095p4834K1752j06245
23681b37190o1938J49615J49393k5486k8535m8518m8985M7745m0294K4720O2430
23670e7043M5605K0199L720K4705K7517M2098o1107L3275l6790j1905O2232k2856
23658F9650j64638n7764J00351j8591j03K3609K6785m9274j19668K5737R9479
23647f4427M7326j9343l0563k4810J5184M8135O9000q1906o0304P0607p256n5784
23635i4141M599r94J08896j4010j6876N6897k3034o5613r369m9157l1481j1096
$$ y = [50751, 105299, 78719, -10356, -50490, -108203, -112462, -93915, -70264, -104477, -74494, -78451, -168009, -248284, -212720, -41355, -17998, -65978, -125104, -87806, -180386, -218313, -145249, -127333, -134909, -75220, -70349, -40490, 55429, 134519, 66300, -5768, -77863, -152697, -130945, -237190, -299128, -149513, -120, -25606, -54141, -102659, -151644, -103899, -144193, -119473, -57043, -11438, 8761, 12481, 37186, 64703, 106801, 45694, 78969, 42179, 30274, 92506, 69650, -94988, -152752, -52401, -70992, -71095, -47486, -20701, -69975, -189643, -163906, -64427, -17101, -36444, -67007, -91817, -76633, -28498, 40502, -41404, -101708, -31101, -38357, -94141, -89542, -90536, 18360, 4350, -12526, 44371, 21337, -44276, -53645, -102802, -134283, -145379]
23623a45379l2024Q6666O2395l4522M4127J36610J8076J8220O0046j04246j05834
23612D135R1628l4760L085P145j26240J8004k9295l356k0213Q0852j6418k2909
23600d8342J59103N353j14912p1517K1514k7185n7816q311O7134Q204K1918j6187
23588f1044J24770M8579Q697l6172n5843n2836n0750R4566j7232n0063Q0532Q7965
23576A21169Q2198l7015j31388n3353P4184O2291K0515q3315j3178p5363m9544
23565h2799m6179P8532P0583J14457O2143r572o4039q4772j02020P7553L3937
23554D7824p795m978k7551J1879M5294o860j63603j54749Q9725J52631J0973J8613
23542A1403k703J7948M047J4262o4107Q609o547j0752M8484M8749K8637p9839
$$ y = [-145379, -177403, -90737, -28342, -62864, -18737, 117873, 135949, 154169, 214215, 109969, 4135, 95763, 61003, 64088, 71233, -55007, -37003, -66298, -69654, -89867, -9015, -25433, -48342, 110761, 116114, 1202, -70315, -48801, -75986, -133802, -142113, -74979, -66775, -44857, -61044, 63726, 112305, 121002, 84830, 28987, -23849, -74599, 19967, 2735, -47328, 33204, 121169, 203367, 166352, 34964, -18389, 55795, 118086, 138601, 55286, 42108, -33255, -82799, -128978, -50446, 20137, 134594, 196737, 187165, 123126, 38354, -63666, 13887, 47824, 40029, 35051, 7500, 19379, 64673, 57813, -105790, -260539, -170814, -18183, -7210, 11403, 8700, 26648, 30695, 44957, -19150, -10541, -17088, -27840, 20644, 69393, 98030, 18191]
23530A8191j12721n9601k3482Q9321L9542k5606l219k3446P482Q5048m3282J9966
23518c1807j9055m1456R2109N2572r2322j00462p3153M7843O3398N072n890n8464
23506a61615k1439Q8538J9972P6049K8592q5663p4458N9909J4877r1678R8614
23495d8302O1061r2698p0410l852j23477J3918R8976Q0230O0333P6067n6088P3530
23483F9288j06102k8143n1500j0919L6624P6046O4211K0053j51605k5373R1278
23472a6142n934O7077l359K8108N2956n7928q738q1670j40340j16034N8888J09652
23460a13464P2523q005O1984k2884j80202n1553j8832J15257M6868R5454R1387
23449H8533Q6955o4938j03025L9399J1912j754m4426J3697m9306m5168j07402
$$ y = [18191, -94530, -154131, -177613, -88292, -48750, -74356, -77575, -101021, -93539, -8491, -51773, -31807, -50862, -92318, -209, 52363, -39959, -140421, -213574, -165731, -102333, -97261, -103151, -161615, -183054, -94516, -74544, 1505, 30097, -55566, -130024, -70115, -55238, -146916, -48302, 12759, -79939, -150349, -154201, -277678, -263760, -164784, -84554, -24221, 51846, -4242, 69288, -36814, -64957, -116457, -127376, -90752, -14706, 49505, 69558, -82047, -107420, -16142, -22076, 45001, 41642, 69750, 122706, 64778, 56040, -25630, -165970, -282004, -223116, -113464, -40941, -48946, 13038, -9846, -190048, -241601, -260433, -145176, -98308, -2854, 88533, 175488, 110550, 7525, 46924, 58836, 57082, 12656, 26353, -22953, -68121, -175523]
23438a75523M9499j2344O3165J60279j4206k3690n2248j03842j8252K664Q301
23427a16197J7550L9122k153o932j04491p0246P6383J02831J19814m9888K6606
23416C2399j03868Q652O3962j2764K8482l1866O7768O829K387M7978j189M4467
23404A53237m8041o5113J9063j56325o8261P1812O0252l7730M5832J19555N1900
23393A46181j53112j14203m6706M8735M5095J36788M2976k092J771K0414m4491
23382H1356N1376k5801m9019J0130j1680l8957l0069O392O7079p6231j21046q737
23370a45207J39218N2829r1421r1638k0812L1804L8138R6183J2658O686n0411
23359b1973r8761P5333l0354Q7122J29662n3313o1701n7943k1086n0921K0037
$$ y = [-175523, -126024, -138368, -75203, 85076, 70870, 47180, -5068, -108910, -127162, -124498, -116197, -98647, -59525, -61678, -68610, -173101, -243347, -166964, -64133, 55681, 5793, 32399, -71469, -62817, 1145, -11619, 16863, -15003, 52765, 59594, 61981, 109959, 108770, 153237, 105196, 40083, 59146, -97179, -165440, -93628, -33376, -71106, -25274, 94281, 146181, -6931, -121134, -167840, -119105, -74010, 62778, 105754, 103662, 105433, 125847, 81356, 132732, 106931, 57912, 68042, 56362, 17405, -12664, -6272, 60807, -15424, -136470, -145207, -5989, 46840, -44581, -136219, -157031, -125227, -87089, 9094, 21752, 28438, -21973, -120734, -45401, -75755, 11367, 141029, 87716, 26015, -31928, -53014, -103935, -83898]
23348h3898M4198j7450M8235l046n8219K3904J52565o7003J3037jr2766o7255
23336a07699N3136J3733J56419o265o4331p9051q7602K6678L5962j0487j0418
23325g9925o7413j9412J25720O0710m5945L1131n6693p3726M1971l5016o3242
23314a81840J5284Q9322J27898L9393k1231m7317K074M7360j2480J3158m4044
23303B7577N96K1007P7670O819j4680J7117p6381j449K2392j05351j2459J9604
23291a7538k1647O2106j08660q4437M0569R1602o8028N0343L2279J18413K6608
23280A21610j3936m4411M2510j480n7460P000J5201K7471K3773p826o4078j8182
23268C0192J0903P3939q0424o0619k6201k5789r4389j6653Q5433Q8766N1553j9122
$$ y = [-83898, -39700, -57150, -8915, -11961, -70180, -46276, 106289, 39286, 52323, 52322, -40444, -107699, -54563, -40830, 115589, 109324, 44993, -34058, -121660, -94982, -59020, -69507, -79925, -147338, -166750, -41030, 19680, -26265, 4866, -51827, -125553, -83582, -118598, -181840, -166556, -77234, 50664, 90057, 68826, 21509, 23583, 70943, 58463, 71621, 27577, 28173, 49180, 126850, 133669, 118989, 136106, 59725, 58276, 80668, -24683, -37142, -17538, -39185, 22921, -85739, -170176, -129607, -38005, -106033, -55690, -23411, 95002, 121610, 107674, 63263, 105773, 104293, 46833, 53833, 69034, 96505, 120278, 112452, 48374, 30192, 41095, 115034, 34610, -26009, -52210, -77999, -172388, -189041, -103608, -14842, 36711, 17589]
23256A7589K083M1900n9383l4951n8449N3736P8815r6246n3577l362m2706m788
23244a59339k289M1725O5341p3052q6251M8749J29348O0191M1944m5971j09886
23233h9490O5420N6835l1268l0149o6979j320M7133K2026N9665L0543R166N940
23221G7522J9375m580r733J5946L2894M104r2524l6073K8230J8774r758o8921
23209b4744p2062j5824r3567j02833O4226J15879L0544n4039p2473k8636r135
23198b62664L4321N3866J66375Q5593j3828m9345p7075k0059j0836L4918J4243
23187d4491N4968M2162j9732o8385N7789M3237P5868P463q0516j15031n3006N1909
23175d7765N8394q0755j1261O3781M4575p4366n0783n3998R1691J03103j11208
$$ y = [17589, 19672, 61572, 2189, -32762, -91211, -37475, 41340, -54906, -108483, -111845, -154551, -159339, -161628, -119903, -54562, -127614, -213865, -165116, -35768, 24423, 66367, 20396, -89490, -24070, 32765, 1497, -28652, -95631, -96951, -49818, -27792, 31873, 62416, 71582, 77522, 96897, 92317, 82584, 98530, 131424, 135528, 43004, 6931, 35161, 53935, 44177, -24744, -96806, -112630, -206197, -309030, -244804, -128925, -98381, -152420, -224893, -253529, -262664, -228343, -174477, -8102, 77491, 63663, 14318, -62757, -82816, -93652, -58734, -44491, 10477, 52639, 32907, -35478, 22311, 65548, 141416, 148879, 68363, -46668, -99674, -47765, 10629, -70126, -81387, -17606, 26969, -47397, -98180, -152178, -60487, 42616, -68592]
23164f8592K246J0859p181m5536m0165j6757M1268K4783N7735M2277M282R183
23152A4402k8898p9481R2025O1631o3429n4521o7287j6435p9877M5093J7741k6314
23140a85350M1069L10R0995M6349J2125M7644J6495o8244j20940J32161Q1555
23129I4169M408r4750N2441q0461n3582M5491l5079r3673l8372M0943K1144P2752
23117f4569J0068J02738N6676q9972m2885R379M5873n4171R0267K4930j29460
23106d1126m5468K012p440l7601j09804K1789J30488L9867M883J6522r6056p6342
23094a98276M628J48922Q4378K2796j20622o7828J37594K9527k8265p884o957
23083a987N0515O0516M7862j81578p4651M9244M875Q961K9279k5724m9779N7297
$$ y = [-68592, -66346, -55487, -62668, -108204, -148369, -165126, -123858, -99075, -41340, 937, 5219, 14402, -14496, -93977, -1952, 59679, -3750, -58271, -125558, -141993, -221870, -176777, -159036, -185350, -144281, -143971, -52976, -6627, 5498, 53142, 69637, 1393, -119547, 12614, 94169, 98577, 3827, 56268, -24193, -77775, -32284, -67363, -161036, -199408, -158465, -137321, -64569, -54501, 48237, 104913, 14941, -27944, -18565, 27308, -26863, 63404, 88334, -41126, -86594, -84582, -92022, -129623, -239427, -217638, -87150, -47283, -42400, -25878, -121934, -198276, -193648, -44726, 39652, 62448, -58174, -126002, 11592, 41119, 12854, 4970, -1987, 48528, 109044, 156906, -24672, -99323, -50079, -45204, -36243, -6964, -32688, -82467, -25170]
23071b5170p9360l2698j7610M3820P1737L2940N393k0862M8179O6594l1035p2840
23059a0912p8337L3942R95n7669K4757O8217J34101N2548n460o7175o6778l9573
23047a1344M2795J7245j3893j25161j39646j8377o7861l3624J05631M6183L1703
23036a66349l148j3627q3177m3789K17703N3701O7625M6513q6204p3885J01135
23025A6498n6573L9873N2434q5481N7760M4785l65Q826p0151k1991L5658j5060
23013F213m4064L9477j56300o498K3278J1780j8892R3119N9998R7603P6931j06168
23001G6477p8089j2413l7115m5863L6770N6260p9801p0609L9960P9372O9164M5588
22989G9701n3000j04267k8093L1409p5698J04009N1096p3508l4193N352n0734
$$ y = [-25170, -104530, -137228, -154838, -111018, -39281, -6341, -948, -21810, 26369, 92963, 61928, -10912, -89249, -55307, -54312, -111981, -87224, -19007, 115094, 167642, 162182, 95007, 28229, -11344, 31451, 48696, 34803, -90358, -230004, -248381, -316242, -349866, -244235, -198052, -166349, -169497, -183124, -266301, -310090, -92387, -38686, 28939, 75452, -10752, -84637, 16498, -40075, -202, 52232, -33249, 24511, 69296, 68931, 77757, 7606, -14385, 21273, 6213, -37851, 1626, -154674, -161172, -137894, -126114, -145006, -51887, 8111, 105714, 182645, 76477, -1612, -14025, -51140, -97003, -60233, -3973, -83774, -154383, -114423, -35051, 34113, 79701, 26701, -77566, -105659, -74250, -149948, -45939, 5157, -68351, -102544, -97192, -147926]
22978a47926R7176j21295k1449J48590L0532j4282j5932m8333j6329Q9926J808
22967a7514Q743j0244Q085q489q0360M261O372M3021J0299q5758R4602O9330n7639
22954a5291m6620j1170j57352O4516J84778P5320k9139j31519m8024L7068m7092
22943a24525j35758L9884J50532J76433O073k3593m9510j20257N3972P6456k7215
22932B2492m3345l0478P4789o0062j10980n6398j9365O9303j9N6033Q2835j14490
22920a29685j11011K5813P8366R0666n7525o5850N8528P3223L3505n7746m8462
22909a10178N6634J35688q93j7042r2276l0636L7558r1963m846j6311J8108J42006
22897B5849L5866p3043j8646l0854k1144m7038J9617J5963j6137Q0940J6381p94
$$ y = [-147926, -50750, -172045, -193494, -44904, -14372, -28654, -44586, -92919, -109248, -19322, -17514, -8771, -19015, -10930, -19419, -99779, -95518, -89146, -46125, -35826, -121584, -26982, 42348, -15291, -61911, -73081, -230433, -165917, 18861, 94181, 65042, -66477, -114501, -77433, -124525, -260283, -220399, -69867, 106566, 112639, 89046, 39536, -80721, -26749, 49707, 22492, -20853, -51331, 23458, -36604, -147584, -203982, -223347, -154044, -154063, -98030, -15195, -129685, -240696, -214883, -136517, -45851, -103376, -169226, -110698, -37475, -3970, -61716, -110178, -53544, 82144, 81251, 64209, -28067, -58703, -21145, -113108, -117954, -134265, -116157, 25849, 61715, -11328, -29974, -60828, -81972, -129010, -109393, -93430, -109567, -28627, -12246, -13040]
22885a3040r1271P7873J14443n4557k864J9272m2062q5919r0252P5409M2538R386
22873d1044J01339k291M3321m5794p846N0858k9720j4472Q343l1495n736q3112
22861e7649p7914J1167j6877N6194q4187j21277J31774J09535J5546k0493M3327
22850a0854m2366J3718n8650Q0002J9736P9139m8959p4284P2683L9001O859M8832
22838A24857j406p3578n8050L1157k49j7676M8848n4092k9282N5394P5395l9203
22826F2115o1662L712J19771l0680p2898J18278O4931K9317r8957j06320j38881
22815a11274k0160J5902J11735J06077l2735m2044r8426M5412n851p0546N2757
22804d9153j02561j9579o7687k4129Q4947P2474K4460O4305m693N5221L5681j8765
$$ y = [-13040, -104311, -26438, 88005, 33448, 30584, 49856, 7794, -78125, -168377, -92968, -50430, -41044, 60295, 58004, 101325, 55531, 47685, 98543, 68823, 54351, 62694, 31199, 25463, -57649, -135563, -124396, -141273, -85079, -169266, -290543, -158769, -49234, -33688, -54181, -10854, -53220, -39502, -98152, -18150, 1586, 80725, 31766, -42518, 30165, 69166, 76025, 124857, 123451, 49873, -8177, 22980, 22731, 5055, 53903, -189, -29471, 25923, 101318, 62115, 453, 4165, 123936, 93256, 20358, 138636, 203567, 232884, 133927, 27607, -111274, -131434, -115532, -3797, 102280, 69545, 27501, -70925, -25513, -31364, -101910, -49153, -151714, -171293, -238980, -263109, -178162, -105688, -81228, -16923, -21616, 33605, 69286, 50521]
22792E0521j29240k8350P8002n4221K3846q515J4760k3248n7246K3900O6115M7797
22780D121O4554n2084o2177j02176J9461j9250l2044J7536k428M9835J16108M6175
22768D7631k3926O746J176J9305P0030J52105l8897j44160q9918k4273M2380o2832
22756d4633P17N5721n770q9219j8107J00657K077J8862O3275L3928L1458k0417
22744A28549j09034J8260J4398l6074p2073j45242m6698j2407J04035J43637m2957
22733e5606j2258p3031K585Q1507Q8051N502k7909O280M9725J4307n2875j24259
22721i7981l198R1709L3579L6974P4144o8485j11676l0952J20599M2848J159p0131
22709A8589k2731l2945L5640K0193k9048R943K8172J43412k5008m5679j07269
$$ y = [50521, -78719, -107069, -29067, -83288, -59442, -67957, -53197, -76445, -133691, -109791, -43676, 4121, 68675, 16591, -45586, -147762, -128301, -147551, -179595, -162059, -164487, -114652, 1456, 47631, 23705, 30451, 31627, 50932, 120962, 273067, 234170, 90010, 92, -24181, 18199, -44633, -43916, 11805, 6035, -83184, -101291, -634, 1443, 20305, 83580, 117508, 148966, 128549, 19515, 37775, 52173, 16099, -55974, -201216, -247914, -260321, -156286, -12649, -55606, -67864, -140895, -138310, -56803, 31248, 36750, 8841, 15121, 64846, 79153, 26278, -97981, -101179, -9470, 24109, 61083, 135227, 66742, -44934, -75886, 44713, 87561, 88720, 18589, -4142, -37087, -1447, 18746, -10302, -359, 27813, 171225, 146217, 100538, -6731]
22698f731p2286p3632M200l2542N2313k6468o615J51598L79l3687q078l688o91
22685e5928Q2093j8420k1291j0320p8987l1728K4510R2242j4212K4919m9451p8925
22673a35498Q4669J33320L8307o0033n0301k1971n260L5696N1034j2487j13199
22662e5723j9057O7148k3559M7260J40395P638k9117j2597m6057q3692J18984
22651A11623P9054n5417r1241j30832N953P2322L7752j17948n3605P7916M5469
22640a8954P3497l1586p4430O2597Q418k4764N3085o55o1426m8765K5488L3274
22628d221k5386p3599L481R1671k1915o8119o0089J20719K5278Q2588k73j29741
22616e9606j0203k3044l3753L3539M4567p6623M446J04739k4476j19856L9469
$$ y = [-6731, -79017, -152649, -148449, -180991, -128678, -155146, -161761, -10163, -9784, -43471, -51549, -55237, -55928, 26165, 7745, -13546, -23866, -102853, -134581, -110071, -17829, -32041, -7122, -56573, -135498, -50829, 82491, 120798, 60765, 10464, -11507, -16767, 18929, 69963, 57476, -55723, -74780, -7632, -31191, 16069, 156464, 164102, 134985, 122388, 76331, -7361, 111623, 190677, 135260, 44019, -86813, -80860, -8538, 29214, -88734, -142339, -64423, -18954, 54543, 22957, -51473, 11124, 19542, -5222, 47863, 47208, -14218, -62983, -37495, -4221, -29607, -103206, -99725, -8054, -29969, -98088, -158177, -37458, -12180, 70408, 70135, -59606, -69809, -92853, -126606, -93067, -48500, -125123, -120677, -15938, -40414, -160270, -120801]
22605a20801J93059J5063L758M8515l6441j3923l7552O139K2944k803j30108o197
22593e8347N0913Q801p812k1630L5908Q6384k1619K6597L7932q5414q879q0191
22581c7357r9872m5606L7995M2598J2104Q160P5915k5200r0510r2684q6173M5597
22569b55033J08087O9473k5729m3986j0777J5409Q2328m0406n3886K4702k9940
22558a59758L4104J54516K3301p7049k2068l8012M1229N1685N0735R4743J2469
22547A65895j14518k8152k7167p9098m4233m1613R8720J30521m2844m5785N3537
22536B5263o574k6984J9056k784J1514p2732k0925k4351r1541J9926L9283n586
22524a36435P7621M9002K7631J04691J4685j8439l9939o0065M72l2036l6947P281
$$ y = [-120801, 72258, 87321, 91079, 139594, 103153, 89230, 51678, 57817, 80761, 77958, -52150, -58347, -7434, 1367, -6445, -28075, 7833, 94217, 72598, 99195, 137127, 51713, 42834, -37357, -137229, -182835, -144840, -102242, -90138, -81978, -6063, -31263, -121773, -214457, -300630, -255033, -146946, -77473, -103202, -147188, -157965, -142556, -60228, -100634, -154520, -129818, -159758, -125654, 28862, 52163, -24886, -46954, -84966, -43737, 7948, 58683, 153426, 165895, 51377, 23225, -3942, -83040, -127273, -168886, -70166, 60355, 17511, -28274, 25263, 18689, -8295, 10761, 7977, 19491, -53241, -74166, -98517, -190058, -170132, -130849, -136435, -58814, -9812, 17819, 122510, 137195, 118756, 78817, 18752, 19224, -12812, -49759, -42478]
22512d2478L4022O4206P9673k2528k8988N7113M5530j01616j17238l6479J6809
22501e1974k3109L9632P2699l559p391L2313j13099m2558J2154O830J2849J8489
22489d6724j1256l7407L7686l1661M0871l3508N933M6679P795L1389L6846J32000
22477A78643m5045q5211k4790L5685J70152M2247K7881k7584j68116p3574l9814
22466i526j31529L9745O0530N6921P704p0101r0495M2030J48661L0897O9939K8669
22454A83445j2897L569o704k7413r2490l0370k743K4400J34034L3043m5360k1709
22442A38805O5262N8460n7769K0707M794j33196n7479P3159k4288q2032K2498
22431B8921j5707k937q608N9476M7424k6006j04314p7668q466N4767N6669J9787
$$ y = [-42478, -8456, 55750, 135423, 112895, 83907, 141020, 186550, 84934, -32304, -68783, -51974, -75083, -35451, 37248, 33689, 26298, 58611, -54488, -97046, -84892, -78062, -65213, -46724, -57980, -95387, -57701, -89362, -48491, -81999, -76066, -29387, -21592, 9797, 46643, 178643, 133598, 48387, 23597, 59282, 229434, 271681, 299562, 271978, 103862, 30288, -9526, -141055, -101310, -40780, 16141, 23845, -46256, -136751, -94721, 53940, 84837, 154776, 183445, 170548, 174117, 167413, 140000, 47510, 17140, 14397, 38797, 172831, 205874, 160514, 138805, 204067, 262527, 204758, 225465, 230259, 97063, 39584, 112743, 88455, 6423, 28921, 13214, 10277, 1669, 61145, 108569, 82563, -21751, -99419, -107885, -53118, 3551, 23338]
22419B3338P0029m3403o1491n7058Q5480J0840J793J0546k890q091J169n9030
22407b8768k5934n5180N5432N4545L923m1445j336n120L9958O4293L7062p0323
22395B7107r3295l2204N504J3656J67480Q5467m5614o6152J7142k0692m7038p535
22383C826j12754k9563k1705J33712R8905M0331q1163j6338J9861j4754j6099
22372D259k846n364n1156O6647O8025N2575o4656l3835m5588k6685P3967M0581
22360G5924M1317O9056j1115l7883p3099N4128J7344q8743N2765l8142M0334m2432
22348E9454j7729K3765N2788p3946o4268L2397p4296J0066N6010k038j21264o1883
22336a80944k9164M4058J01684O6199Q9764L4526j8887M7774l4507j22597m7584
$$ y = [23338, 93367, 49964, -11527, -68585, 16895, 27735, 29528, 40074, 37184, 29093, 30262, -28768, -54702, -109882, -54450, 95, 4018, -37427, -38763, -43883, -3925, 60368, 97430, 27107, -66188, -98392, -92888, -79232, 88248, 173715, 128101, 61949, 79091, 58399, 11361, 3826, -108928, -138491, -160196, -26484, 72421, 112752, 31589, 15251, 35112, 20358, 4259, 1413, -3951, -55107, 11540, 79565, 132140, 67484, 33649, -11939, -38624, 35343, 75924, 117241, 186297, 175182, 137299, 64200, 118328, 135672, 46929, 99694, 61552, 101886, 59454, 41725, 65490, 118278, 44332, -19936, 12461, -61835, -51769, 4241, 2203, -119061, -180944, -210108, -166050, -64366, 1833, 91597, 126123, 107236, 155010, 120503, -2094, -49678]
22325d9678l9002r5647j1849J04036J08343j6643o0330N5655L6965p958k5638
22314a746M0947M7554p830K8496j17658l1135J38880j4304j22026R2927O9386
22303A23491j0309q5935n7490m3678L7466n7625M5420N2714J7298r2649j9786
22292i1083m2435N9353l7137N0060N2233j02614j5335P2756K6296L8692P315O8266
22280H6367o811q7378j06341k5769N2410L1191j8628J8846P7914k7216p1870L0521
22268d6764P7174j337q4120M4731J8942j0383K2720J4527O5635M2429k8881q5706
22256B8967o1196R8158R0154k5361o540n540j4441p4977M437J973N1314n4008
22244C2940l2462J8832Q6921k1473l2167L6278j46470p4403k0941O4201M3369
$$ y = [-49678, -88680, -184327, -196176, -92140, 16203, -440, -60770, -5115, 31850, 23892, -1746, 39201, 86755, 78925, 107421, -10237, -41372, 97508, 83204, -38822, 54105, 123491, 113182, 27247, -30243, -73921, -36455, -94080, -48660, 4054, 21352, -71297, -91083, -133518, -74165, -111302, -61242, -9009, -111623, -126958, -54202, -27906, 10786, 18101, 86367, 79556, -7822, -114163, -139932, -87522, -56331, -74959, -56113, 21801, -5415, -77285, -46764, 30410, 29073, -55047, -10316, 8626, -1757, 20963, 35490, 101125, 143554, 114673, 28967, -32229, 65929, 156083, 130722, 124182, 118642, 104201, 29224, 33661, 35634, 86948, 32940, 478, 19310, 106231, 84758, 52591, 88869, -57601, -132004, -152945, -88744, -45375]
22233d5375p847o8459k2502M1885K7811Q969J2521K0502J9442j09140q7774K9017
22221a80950L9665O6869q4236o4573J21245L716n0774R3288L3494n2792n7971
22210a33019R4858O5543O0520J4122M8498l5441j17106q9716K3264L7751J7222
22199a3504L3177n3274l4178k4011J7390Q3108L3123p3632M9085P7352n0943m7327
22187c634o7998o2173K0613j1596j4991n8153L8727P3186l2705J35155J28263
22176A44694J0634m7486n9222j25821p4339n5774L3436R292M5965M2733J6612
22165e9276n4603r5333K6719K00006P5765l7836J6672n7195o7117N3401J31616
22154A32819N205n9908k277j60999o1750J44511K78m0045R1080J2633J6143j35040
$$ y = [-45375, -53222, -121681, -144183, -102298, -74487, -65518, -52997, -32495, -13053, -122193, -209967, -180950, -141285, -74416, -158652, -223225, -101980, -98264, -149038, -55750, -22256, -75048, -133019, -38161, 27382, 87902, 102024, 150522, 115081, -2025, -91741, -68477, -30726, -13504, 19673, -33601, -67779, -91790, -74400, 8708, 41831, -31801, 17284, 94636, 43693, -3634, -71632, -133805, -113192, -124788, -139779, -197932, -159205, -86019, -118724, 16431, 144694, 155328, 107842, 48620, -77201, -151540, -207314, -173878, -164586, -118621, -75888, -59276, -113879, -209212, -182493, 17513, 93278, 55442, 72114, 14919, -52198, 1203, 132819, 138024, 78116, 75839, -85160, -146910, -2399, -2121, -42166, 48914, 61547, 77690, -57350]
22142e7350o6748Q5828M4481N2693N7450o9201q8210j2263j4264R3860N4413J24
22130H0813l6454O9141N3863j07392j37792K7236K3532p3784j2631L6426M7722
22119b9320O3226k9284k6218K2219L6421J5924l4170n2620m7816k9284O9813j3572
22107e4681k9163n4198P4164J12387L1001l8398k0385n9097j26546R325K13174
22096E7583M3867k824l4450q2J7147N349o6048q2422j3565L3276j9287q8481p6249
22083b26186J10892J32090L9887p1966k0329K6158L7728m6201n4924r6019L5070
22072a33800Q4918L7661p4223M0304m7733K3523P8696l8252k3205k9383J5207
22061f6287N5619m5597o8608Q9226Q4616l7066O886O2112p5833N0477J4494K8991
$$ y = [-57350, -124098, -38270, 6211, 58904, 116354, 47153, -41057, -53320, -67584, 26276, 80689, 80813, 44359, 113500, 167363, 59971, -77821, -50585, -27053, -100837, -113468, -77042, -29320, 33906, 4622, -21596, 623, 37044, 52968, 18798, -33822, -81638, -110922, -41109, -54681, -83844, -138042, -63878, 48509, 79510, 41112, 20727, -38370, -164916, -155591, 57583, 101450, 98626, 64176, 64094, 81241, 86590, 20542, -61880, -75445, -42169, -61456, -149937, -226186, -115294, 16796, 56683, -15283, -35612, -9454, 28274, -17927, -72851, -168870, -133800, -48882, -11221, -85444, -45140, -92873, -69350, 9346, -28906, -52111, -81494, -66287, -10668, -56265, -124873, -35647, 48969, 11903, 18789, 80901, 5068, 55545, 70039, 99030]
22049I9030M5913n4489p9996p3187O2497l3610m5665K567J05944o2927K1321K7538
22037A4936p348L305l9236m9826L1849O125L7197n6431p1817P3287J00343J1325
22025E3709j7994J33853n6107j27303N661q625o1722M1685n3303J31105Q6999
22014A27958j44494p1184M3026L3637J7794n8497m7247J6403R8000N3248M833
22003G3477P3804n6328j73922j03168m9018r5631p9333M1605O0183J09055J06932
21992i2344k4430q0492P161n4823J20319N3238N7670m006l994J05995n711j05129
21980b6546p7479L235L3988O531q03K8527O7830j45460L629J26432n938m7044
21968c3098l4537J35462J536L8786j5606j15409j36827P1537m9289K7383J39328
$$ y = [99030, 144943, 90454, 10458, -62729, -232, -33842, -79507, -76940, 29004, -33923, -12602, 14936, 7588, 10893, -28343, -78169, -46320, -40195, -2998, -59429, -131246, -57959, 42384, 53709, 35715, 169568, 113461, -13842, -8181, -16806, -78528, -36843, -90146, 40959, 127958, -16536, -87720, -44694, -11057, 6737, -51760, -99007, -82604, 15396, 68644, 73477, 147281, 90953, -82969, -186137, -235155, -330786, -410119, -368514, -308331, -199276, -92344, -116774, -197266, -190105, -244928, -124609, -71371, -13701, -17707, -21701, 84294, 78583, -26546, -104025, -100790, -66802, -60271, -61074, -32547, 35283, -110177, -106548, 19884, 13946, -33098, -67635, 67827, 69363, 108149, 92543, -22866, -159693, -88156, -137445, -110062, 29266]
21957B9266M0732o0190m4660L1367j8825p738N3340m3762L8053M4111j083M3084
21945A03695K6242N8571o2508j23510K0746p666o0376J8884J00084J708p4385
21934A485k4829k586N0652L4615j30804o3097P2301J42460J30563q4273k8657
21923I7830J6930R020L2506j7541p6191j15493k9428j5829k6002l5299L114J50776
21911e607k8169M9454l6482P664O127J6981N9492m6196j09017K300L0349n973
21899e9077j4592j12891J05287J17187J20432K2967K6542K1507j30555r1763J6642
21888B1686k3959M1726J1087j247o692j09925r4386O8771R8045k1869O1353P144
21876E1734Q611p4054l8769J45414M4134o9743j14641L5526J12486j11390n1938
$$ y = [29266, 69998, 9808, -34852, -3485, -22310, -30048, 23292, -20470, 17583, 61694, 60611, 103695, 129937, 188508, 126000, 2490, 23236, 15570, -44806, -25922, 74162, 75870, 1485, -23344, -25930, 24722, 59337, -71467, -134564, -62263, 80197, 210760, 126487, 97830, 114760, 123780, 156286, 138745, 62554, -52939, -82367, -98196, -124198, -159497, -156383, -5607, -33776, 15678, -20804, -13140, -7013, 9968, 69460, 23264, -85753, -83453, -53104, -59077, -73669, -186560, -81273, 35914, 156346, 179313, 205855, 227362, 96807, 5044, 21686, -2273, 39453, 50540, 49293, 42601, -67324, -161710, -92939, 5106, -16763, 44590, 51734, 60345, -13709, -52478, 92936, 137070, 67327, -47314, -11788, 100698, -10692, -62630]
21865f2630n3002r1247P3636N4475L114O9692m7649p019l5315k2694R713j2485
21853a21411j0109J0104P4423Q7394J482j311k7999n6322p4857L3202N8732q6099
21841a12771l9455L130N1233J6546R0237L6839k9308q619k7483q522O6625n7458
21829a9006K8773K8676K3967O273K2467j13198r7134J3907Q8299L0867K4577o3723
21817b5255M3784K3799o0154m6378L2720O3814R6930J9489n7734n8250K2808p5379
21805a9806L989O8719M2808O674l1198J313M3495r1928j08828K098m747j6488
21793a03899J2935M2037p7235o1254K7303O4217M4492M4639P638O2317k3566L2213
21781G1837M8474l7693K6562M1897r207p9532q3384M5280O3796N3764L7835j01080
$$ y = [-62630, -115632, -206879, -133243, -78768, -75654, -5962, -53611, -60630, -95945, -118639, -108926, -121411, -131520, -121416, -46993, 40401, 41883, 40572, 12573, -43749, -118606, -85404, -26672, -112771, -152226, -149096, -97863, -81317, 8920, 45759, 16451, 7832, -19651, -28173, 38452, -19006, 9767, 38443, 62410, 68683, 91150, -22048, -119182, -105275, -16976, 13891, 38468, -25255, 18529, 42328, -17826, -64204, -31484, 32330, 129260, 148749, 91015, 32765, 55573, -19806, -15817, 52902, 95710, 102384, 71186, 72499, 115994, 24066, -84762, -82664, -87411, -103899, -90964, -48927, -126162, -187416, -160113, -95896, -51404, -6765, 873, 63190, 39624, 71837, 120311, 82618, 109180, 151077, 141870, 62338, -21046, 24234, 88030, 141794, 179629, 78549]
21769G8549k8301K9109J74q7697j19566k0709P0717P6290L6474m4484m0711n0871
21757a01026l4311n809N4168J03514J2231r9795j29105Q189Q2688O866J2958o2960
21745a52392j0666O0136N0932l1520j0610J9671N4402K1122q9187L2856J01599
21734D6343L8773j06668o4796K2959j5615l4647n8350P357Q0133M7008m3028L3436
21722d7095P7117K9976o9909N0075M6627j44501n179N2171j6401m1977l4863q3367
21710a87326Q0517M8881N3645n0647n7707R5647K2134k6076L0174o999O4626r3419
21698b6550l4326j9519J8801L3542L5995n5965n3348J1357J36760J143j58144
21687a10254p1163O9185P2517k5090K8012Q1094m6055k1930J5188k8754o2213
$$ y = [78549, 50248, 79357, 79531, -8166, -127732, -148441, -77724, -1434, 35040, -9444, -50155, -101026, -135337, -141146, -86978, 16536, 28767, -71028, -200133, -191944, -109256, -102390, -89432, -152392, -163058, -102922, -51990, -83510, -94120, -74449, -20047, 1075, -88112, -55256, 46343, 85116, -21552, -86348, -63389, -79004, -113651, -172001, -164644, -84511, -37503, -80531, -47095, 30022, 59998, -9911, 40164, 86791, -57710, -62889, -10718, -27119, -69096, -103959, -187326, -106809, -57928, -4283, -54930, -112637, -16990, 5144, -20932, 9242, 2243, 66869, -26550, -60876, -80395, -61594, -28052, 7943, -48022, -101370, -90013, 46747, 47890, -110254, -181417, -112232, -39715, -64805, -36793, 44301, -1754, -23684, -8496, -37250, -99463]
21676i9463j22737p284L2305K1039K7443J11064L0408m0056K8790J43342O740
21665A31591j5081Q5533q6546k14892n6054O1046q189l0344j626L2311J5898k2254
21653a08607j2001o9853o749m0194L1890L0226J14873M036n4458P8282N6924O3709
21641H8078J2259m7691k7949k8316m35o2634K298J9173j1121l0682J5378J5745
21629e5897J2538P8868N4964l4455j12349M8764P0022j9662l2197P2534K8348
21618A11478m7147K796L5417l6487p5059l4748n3534j2151K8446q3864l6461K87
21606b01027J35243M5639j36186j15091K7717L9560L3442L8326L198m2778l5779
21595b07736L9683m5710q3457J8300J00647R9973k8988J2440K6704m3736j0926
$$ y = [-99463, -222200, -229484, -197179, -176140, -148697, -37633, -7225, -47281, -18491, 124851, 131591, 116510, 202043, 115497, -99395, -155449, -94403, -102592, -132936, -134562, -102251, -86353, -108607, -120608, -190461, -197210, -237404, -205514, -175288, -60415, -56379, -110837, -32555, 24369, 88078, 100337, 52646, 24697, -3619, -4054, -66688, -64390, -45217, -56338, -87020, -71642, -55897, -43359, 35509, 90473, 56018, -56331, -7567, 62455, 42793, 10596, 83130, 111478, 64331, 67127, 102544, 66057, -9002, -43750, -97284, -109435, -80989, -164853, -201314, -201027, -65784, -20145, -156331, -271422, -243705, -204145, -170703, -132377, -129179, -171957, -207736, -168053, -213763, -297220, -278920, -178273, -78300, -107288, -94848, -68144, -111880, -122806]
21584a22806O1526m4506j6770Q741R2216K4141L9769K1561O5678K3690r5973n1373
21572E894q929L5488m1768p0164L8290k2172M5033J3136q1714l6757N4746P9392
21560A0475p021N0091o0412j2925Q6386k2905O8329L1928q2163n4512j22477k1977
21548a37183Q5252O8516q1644j18584m1443n0763K7013K8037O1588J32255j5468
21537d2424J1688M2947L529l937j7152p590J2579K8031n854J9269l2426k4591
21525a5931K0963K0531r7075O0590O1948j28442N4840O7502o8505K9802N0611
21514E6834k0158k9897n703q2249r2591Q3979l7985q2622k369P7679L9371l8251
21502a33962l362j78J06617k3890k0022P415M2744N3132k790n8123q6065M9374
$$ y = [-122806, -61280, -105786, -122556, -113815, -21599, 2542, 42311, 63872, 129550, 153240, 57267, 5894, -3035, 32453, -9315, -79479, -41189, -63361, -18328, -5192, -86906, -123663, -68917, 10475, 3454, 53545, -6867, -19792, 66594, 43689, 112018, 143946, 61783, 7271, -115206, -137183, -51931, 16585, -65059, -183643, -225086, -275849, -248836, -220799, -159211, -26956, -42424, -30736, 12211, 15740, 11803, -5349, -12939, -360, 27671, 21817, 41086, 8660, -15931, 5032, 25563, -71512, -10922, 51026, -77416, -22576, 44926, -23579, 6223, 56834, 36676, 6779, 1076, -81173, -173764, -89785, -127770, -210392, -212761, -135082, -95711, -133962, -137324, -137502, -30885, -54775, -74797, -67382, -24638, 28494, 25704, -32419, -118484, -69110]
21490f9110J08652K2206j4214m0170R286P0003K5764q4555M4988R0827N2777n8069
21478A58385n9948l0179L4839L5778q9631J0759K1205K7267q3149J0323Q434j4251
21466B9832r102J9802m5210O2764K2283L2973j50019l0020J06663J02822M8248
21455A91036r3402m774q6412P261R4448n4738j2717Q075J1871K7781n5779r9316
21443f6666R074K3200M8754p042J09978L0237l1343M2234p3889j77495L8859O1772
21431G673k9338m5384K8062k0397N5539J65745k6687j30169R566k7837j3480K3677
21419c030k9630q6186j8986J04405N7148M393L741P9695J5149m6177j42541j3924
21407g5943k2403l9426j7067n027J45736J00952J9773j46721o7091j4791P3806
$$ y = [-69110, 39542, 61748, 47534, 7364, 16650, 86653, 112417, 27862, 72850, 163677, 216454, 158385, 98437, 68258, 103097, 138875, 49244, 60003, 81208, 108475, 25326, 35649, 44083, 29832, 20730, 40532, -4678, 58086, 80369, 113342, -36677, -66697, 39966, 142788, 191036, 97634, 92860, 6448, 13709, 108157, 53419, 40702, 48777, 60648, 88429, 32650, -66666, -57592, -34392, 14362, 7320, 117298, 147535, 116192, 158426, 84537, -92958, -54099, 7673, -21665, -67049, -38987, -59384, -3845, 161900, 135213, 5044, 14610, -13227, -26707, -3030, -32660, -118846, -137832, -33427, 23721, 28114, 31855, 111550, 126699, 80522, -62019, -75943, -98346, -137772, -154839, -159866, -14130, 86822, 106595, -40126, -107217, -122008, -48202]
21396d8202L3638N4244Q5669k9398o3226n4128o6738L4565R902J5616K4265Q464
21384D671q677j32291k1396R55Q9655J26057j14522p2924L5611J63006l3260n8024
21372b1139J37712J6709q4614j56339N920M2683p8309J7702M230J37426R166m7217
21360a6070R4783Q2823r446j772k0839N7438p9827j03064o4201k1978m4915P1330
21348e5738Q2752o9472O8204L7345J6003J3392O4994o1945j35385J7065M7083
21337B4298N6958P4497n5501j68043m7290J33000r095q6197K3060r179L8895n8506
21325h3103O5674j3117j8387P8203l0148j22406j5022M6480J7452l6056Q4237
21314b6193J17933L1221j09001j92832m6915J3617Q5284n2109J7901J84232M7497
$$ y = [-48202, -14564, 39680, 125349, 95951, 32725, -21403, -88141, -53576, -43674, -28058, -3793, 4671, -4006, -136297, -157693, -156738, -67083, 58974, -55548, -128472, -92861, 70145, 36885, -21139, 116573, 133282, 48668, -107671, -101751, -59068, -137377, -119675, -115445, 21981, 31147, -16070, 78713, 161536, 152090, 150318, 129479, 186917, 107090, 4026, -60175, -82153, -127068, -55738, 27014, -42458, 25746, 63091, 79094, 92486, 157480, 95535, -39850, -22785, 24298, 81256, 155753, 100252, -67791, -115081, 17919, 8824, -77373, -54313, -63492, -24597, -83103, -17429, -30546, -48933, 29270, -878, -123284, -138306, -91826, -74374, -110430, -26193, 91740, 122961, 13960, -178872, -225787, -212170, -126886, -178995, -161094, 23138, 70635]
21303G0635R6679r5177j57808l4571N6K1903n2412m5842q45O3067N1409R2760
21291I854n1491p6786q42j5036J6733J41094K7312k3349j6005O4720K5163o4073
21279C7294q7699N3099J0537O2366o4879o7868l4188O9099j7456j28174m7530
21268b15399O0983N6257m010k5208P2305N0202P1102J4461l8723j475J0461Q6026
21256A36982O4180j8345j13145n4379j44020J5606J76234p1730o4162n8501K8931
21245a02349K3636j4710M7606K4007M6390J8748n3979K541M5731q9803r2067N8686
21233h5563M854p1935q0535M8548P4195P8351P636o4633L9861O5572N4015o6872
21221C494k9294n26m3585k9938K7754J6756M0491j3471K1769N5856l20P914K7480
$$ y = [70635, 167314, 72137, -85671, -120242, -120186, -98283, -150695, -196537, -197382, -134315, -82906, 9854, -41637, -118423, -119265, -134301, -117568, 23526, 50838, 27489, 11484, 76204, 101367, 37294, -50405, 2694, 13231, 75597, 10718, -57150, -91338, -22239, -39695, -167869, -215399, -154416, -98159, -102169, -127377, -55072, -4870, 66232, 80693, 41970, 40495, 50956, 136982, 201162, 182817, 69672, 15293, -128727, -113121, 63113, -8617, -72779, -131280, -102349, -78713, -93423, -45817, -21810, 24580, 43328, -10651, -8110, 37621, -52182, -144249, -85563, -80709, -152644, -233179, -184631, -110436, -32085, -24449, -89082, -49221, 16351, 70366, 3494, -25800, -26326, -69911, -99849, -72095, -55339, -14848, -28319, -6550, 49306, 48986, 56900, 84380]
21208H4380m4457k5945K1592l9140o4097O0118l4422q1415p7056K0506J57579
21197b2357Q3733j9503m4914q637R057P5741O6032j38579O0221Q9708q4951r560
21185E5991O335m5800Q3926O4249j7655j09576j28713n1620l5771j7276P0280
21174a25630O3783J77194l9651m7955l8777q9103J16478P7748r3955j89336j2600
21163b01804J9088L4155J0653m1050P9460J43206k8109j01704q0305m8297J01422
21152a13285J08134N8876o0063m5945j01026J0872K1993q6165J10447J21713O6834
21141I2385K9533k0619n9390P4604m2158j14513j8569m10l8039j7180k9517r776
21129a53649N5813L6619Q3393L0242L2916L9851j2423n4112q5923o9435J0135
$$ y = [84380, 39923, 13978, 35570, -3570, -67667, -7549, -41971, -123386, -200442, -179936, -22357, 61376, 41873, -3041, -11678, -2621, 73120, 139152, 573, 60794, 150502, 65551, 55991, 62326, 16526, 100452, 164701, 147046, 37470, -91243, -142863, -178634, -195910, -125630, -61847, 115347, 75696, 27741, -11036, -100139, 16339, 94087, 132, -189204, -201804, -182716, -148561, -137908, -178958, -99498, 43708, 15599, -86105, -166410, -214707, -113285, -5151, 53725, -6338, -52283, -153309, -142437, -120444, -206609, -96162, 25551, 92385, 121918, 101299, 41909, 116513, 74355, -40158, -58727, -59137, -97176, -114356, -143873, -153649, -97836, -61217, 22176, 52418, 85334, 125185, 112762, 58650, -27273, -96708, -86573]
21118h6573l7174J21210N9436J9279r3575K0515j9442J30480K0254k8777J7608
21107A23241j0960L9667j15982l5433Q5756K0754m2041n5205m1874K4418L8007
21096C0348L410l9619n5382l2399P7059p0689p005J6039n762L8604q421N3693
21084a24K5013O6259M9663J8707j19684n4195L3064O8441j9449R224r645j5065
21072E2209K2911n0960J3969n0272m36R1564J09366k4695l4836l4638k4799K3020
21060I2403n357q903k3194n3084J5166O7668M6999P4143q0105o2044j8610L9545
21048H4627k7085q7707m5678n8791J0033m4893M8349J7473L6507j0028n5064M8614
21036h3643J93183p3680j19415m1369R790L7946Q3702l2000R72L2861p2504p9146
$$ y = [-86573, -123747, -2537, 56899, 76178, -17397, 3118, -16324, 114156, 134410, 105633, 123241, 112281, 151948, 35966, 533, 86289, 107043, 65002, 9797, -32077, -7659, 30348, 33758, -5861, -61243, -93642, -16583, -87272, -94277, -78238, -84000, -45396, -53817, -124, 24889, 91148, 140811, 159518, 39834, -14361, 18703, 87144, 67695, 76919, 67274, 52209, 75120, 24160, 38129, -12143, -12579, 78985, 188351, 163656, 128820, 94182, 69383, 92403, 87046, 78143, 54949, 1865, 17031, 84699, 131698, 205841, 125736, 63692, 45082, 84627, 57542, -30165, -75843, -134634, -124601, -169494, -121145, -103672, -67165, -77193, -132257, -83643, 109540, 35860, -83555, -124924, -115134, -77188, 6514, -25486, -24514, 8347, -64157, -143303]
21024a43303K7851L952O7381o5829m5803Q753P3257K3801p1164J4181L4847O737
21012f5339L7035J0925J7730j0881j33085N7621N0261Q8811J1907j02308o992
21001d4315l76j7326J23062L9790O357K2536l9584k3769K713k432M607L9557K1716
20988A32536r4755o0773n661J6634M9037O9686N8017l3260j0798k5662r5391k4320
20976b4710n025j06855o8521K643P8643k3291k0106J46546k4277J5909P0957j409
20964D0504j29272j30955K9755J40960L196L6130j37363K0177N8442J653j3135
20953g9908J4504P515O6887Q4585L8538n1485M7707K6105l9823l7502K7019n8196
20941D5946K7708J4564j02530m0080R0700j5735K2122l2320j02415o9579K8097
$$ y = [-143303, -115452, -111500, -44119, -109948, -155751, -146998, -73741, -49940, -121104, -106923, -72076, -65339, -28304, -17379, 351, -10530, -143615, -85994, -35733, 53078, 64985, -37323, -44315, -44691, -62017, 61045, 100835, 107192, 129728, 90144, 66375, 69088, 66656, 71263, 110820, 132536, 37781, -22992, -28653, -12019, 37018, 106704, 164721, 131461, 120663, 95001, -390, -24710, -29735, -136590, -205111, -202468, -123825, -147116, -167222, -20676, -44953, -29044, 41913, 40504, -88768, -219723, -189968, -49008, -45812, -9682, -147045, -126868, -68426, -66773, -79908, -65404, -57889, 8998, 93583, 132121, 80636, 128343, 154448, 114625, 77123, 104142, 45946, 73654, 88218, -14312, -54392, 36308, 20573, 42695, 10375, -92040, -161619, -133522]
20930a33522P2500j6902m1690m5413R1778L9714J18897N4506M3858j10896l5901
20919C6929P456o5752L3695J02129M4397l6205M9937m3094j26942q4380n156K5193
20907f1793M6419J8701k9261J0787L1040N1314K6053p5302r0712j4187J03022
20896A6081O8334n6066o0561k4822M0792j5999l4035m8045o994N7213R373K4688
20884c0041P7262o8580j07232M5874l897L1928J25175N6447q2705L2319J25454
20873B02004q7226j11368N185k0439o6349m2955P6796J14920M5888k2422Q4611
20862A78645O3112p7578k4270j95937j18730k6637M8337l9408p2376J19440J00327
20851d5075N0629J7300q5561J6438m2147q6919M5562Q2838M8930M2695N5200n296
$$ y = [-133522, -61022, -77924, -119614, -165027, -73249, -33535, 85362, 139868, 183726, 72830, 36929, 44385, -21367, 12328, 114457, 158854, 122649, 172586, 129492, 2550, -81830, -86986, -61793, -15374, 3327, -25934, -15147, 15893, 67207, 93260, 17958, -72754, -86941, 16081, 84415, 28349, -32212, -57034, -16242, -32241, -66276, -114321, -121315, -64102, -54729, -30041, 47221, -21359, -128591, -82717, -86614, -54686, 70489, 126936, 44231, 76550, 202004, 114778, 3410, 8595, -11844, -78193, -121148, -44352, 70568, 116456, 94034, 178645, 241757, 164179, 139909, -56028, -174758, -201395, -153058, -192466, -264842, -145402, -45075, 5554, 22854, -62707, -46269, -88416, -175335, -129773, -46935, 1995, 44690, 99890, 94594]
20839I4594o9720r2458N6475R0004K3237J1581O2397K7110n7608j36013L9343
20828D8942N9470J3216N5419J4802r4107j10963L6724K7482j207L8699q7124M418
20816E771o4041L9311J39504n4132o0524L6598K4783n0637r1464p1050R1014L2368
20804b2499J7473M8410P545r7957p5311N9538J19646Q3104m7687r0048p9515k6077
20792a03378J37340J6475K9223r3645j7658l4867J1192j6410l0078N3930M4062
20781c814m0817k0742J0730M1121K1641k0823p9846J10510O7121k254K1897o6624
20769C8100j5715L7022K801k5404j1275P168K478q1601R2083j0451n4017p0213
20757h9024p1512l9396M278J03903R6028J09066J12870o7840j00539o2712j3990
$$ y = [94594, 24874, -67584, -11109, 78895, 102132, 113713, 176110, 203220, 145612, 9599, 48942, 108412, 121628, 177047, 191849, 97742, -13221, 23503, 50985, 49778, 88477, 1353, 5771, -58270, -18959, 120545, 66413, 5889, 42487, 67270, 16633, -74831, -145881, -54867, -22499, -5026, 43384, 50929, -47028, -122339, -62801, 56845, 139949, 92262, 2214, -77301, -103378, 33962, 50437, 79660, -13985, -31643, -66510, -55318, -71728, -101806, -47876, -3814, -44631, -65373, -54643, -13522, 8119, -12704, -92550, 17960, 85081, 82827, 104724, 38100, 22385, 59407, 62208, 36804, 25529, 32697, 35175, -46426, 45657, 35206, -18811, -89024, -160536, -199932, -195654, -91751, 4277, 113343, 226213, 158373, 57834, -4878, -18868]
20746a8868P0817j0012k3988p3874O8133Q3805m2549m9030j44038J2738N284r4580
20734b16162j0907N1810K4135l3528l4972Q6446K4177k658P9491L3359Q4706N6168
20722A42065l901m2930j17193r4361P413o2892j8920L9966L5284P0069K9817J143
20710a4440J0444l2823p004R1192l8887j17831n4847J5536J00033P1202m4534
20699b1959j7544l5320L3239L5151J01461J6414j2769m1385o3289k1808N8845
20688C1036m485n9475k4404o8882j3586J00797J97907J16285l7024j62411o0238
20677A5520L1581M41k5555k2448O6429o8124o721L5228l7699Q5627N3589j40453
20665a2585j3982P3707K2210O8340J05483j3836p1819J1139n8717l3011j14722
$$ y = [-18868, 51949, 41937, 17949, -55925, 12208, 96013, 53464, 4434, -139604, -126866, -121582, -216162, -227069, -175259, -151124, -184652, -219624, -133178, -109001, -111659, -32168, 1191, 85897, 142065, 138164, 95234, -21959, -116320, -108907, -171799, -190719, -150753, -115469, -45400, -15583, -14440, -3996, -36819, -43823, 47369, 8482, -109349, -164196, -148660, -48627, 22575, -21959, -39503, -74823, -41584, -6433, 95028, 111442, 98673, 57288, -6001, -27809, 31036, 26551, -32924, -57328, -126210, -139796, -38999, 158908, 275193, 238169, 75758, 15520, 47101, 47542, 21987, -461, 65968, -2156, -8877, 26351, -11348, 74279, 127868, -12585, -26567, 47140, 69350, 137690, 243173, 229337, 157518, 168657, 109940, 76929, -37793]
20654c7793K171L8109j0912K7362J35126j01209J220O1799r094Q8660O370j13772
20642H8037n9122j3455K2092J7738Q3527N0183j1180l4939K1075L8431l208m1895
20630A57284j12371n1630j80q5131m9826N32n6528K5595P3131P5258J06049L120
20618H5303L4217o3026n3316K3725J44842K5146r0788n0572N1433O0235k8130
20607A39069j3689L8790L3355o6678m2735j15234n7609K3183R816q7684K7416
20596a12000j2179M9907j4619L3421O185L1844J6994k7516K0867o3307q0812K7576
20584a23639J11861l8651j2123j238K9402m9428O3l3166J092M6621J1647N5039
20572b520P2563K4332l3004O633L0392K3331m3867j8723k2219l2128J7186j9107
$$ y = [-37793, -35622, 2487, -8425, 18937, 154063, 52854, 54074, 115873, 106779, 195439, 201809, 88037, 28915, 15460, 37552, 55290, 138817, 189000, 177820, 142881, 163956, 202387, 199179, 157284, 44913, -6717, -6897, -92028, -141854, -141322, -197850, -172255, -99124, -23866, 82183, 85303, 119520, 56494, 3178, 26903, 171745, 196891, 106103, 55531, 106964, 167199, 139069, 125380, 164170, 197525, 130847, 88112, -27122, -84731, -61548, -51732, -139416, -112000, -124179, -74272, -88891, -55470, -49285, -17441, -447, -27963, -7096, -70403, -151215, -123639, -11778, -50429, -62552, -63790, -34388, -83816, -83753, -116919, -115827, -69206, -57559, -2520, 70043, 94375, 61371, 68004, 98396, 121727, 77860, 59137, 36918, 4790, 21976, 2869]
20560B869o2106L0209J59784O3691n7065k65514J332P9323k219N418J09338Q9526
20548A54586j3305k03776Q500J07395L8191m6462n837j6611j704K0630j1653n5777
20536b5823J2722J9629O0943R5607Q1611J5590l3091j9874l5810r4136M110j1167
20524G0311j4666o0434o5940J22956M4176k6043r9240m5926M3020m2585O105K1107
20512d7159Q560Q7182n6719k7746Q2073N9087O0222j744N5174j40468j27476m1522
20500i0536k8681O5374P7438o2133O7177p42M8586o2279j02300K8754O3130N715
20488I503J09569l1788j10747P3551J0658k5469O095K7996M4441K623m4915j7017
20476E4500R0151J3737l8277n723M323j13318j11869K0360P566j36387o5393J42350
$$ y = [2869, -59237, -29028, 130756, 194447, 137382, -128132, -126800, -47477, -49696, -44278, 65060, 154586, 141281, -62495, -53995, 53400, 91591, 45129, 39292, 22681, 20977, 41607, 29954, -25823, -13101, 6528, 67471, 163078, 244689, 260279, 227188, 207314, 171504, 77368, 81478, 70311, 55645, -4789, -70729, 52227, 96403, 70360, -28880, -74806, -31786, -74371, -68266, -47159, -38599, 48583, -8136, -35882, 46191, 105278, 165500, 163756, 218930, 78462, -49014, -90536, -119217, -53843, 23595, -38538, 28639, 27897, 76483, 14204, -88096, -59342, 3788, 9503, 119072, 87284, -23463, 50088, 60746, 35277, 41372, 69368, 113809, 116432, 71517, 54500, 144651, 158388, 120111, 114388, 118711, 5393, -106476, -86116, -78550, -214937, -280330, -137980]
20464a37980J22350R8133l653p4053o4364l3427L185K2785J691M896m1389r983
20452a11809k0835l324J13122J64788j9854L8616K0444j5583m7344j09939r4320
20441h6038m8757k4377k7132N7374N0508L6445J70366M8846o1478m713N1471j02653
20429E9862n7375n123R6074j45779n6522J61061R7519Q719o630m7690k9320L3761
20417A08557L6275o1281m826O3521L6560m5998o8094q4910j836p755N9385R2707
20405A22305l225k8961M2282K3804r7490O401o2207J8041J595j22130K2351N5868
20393b1366P1398R5793m9965j8168O3908l4022K7758q3166q2716N1180q4826L9810
20381b4382o5768k9572O3272o4073N1212O2894J9720o753K8002k0176Q405J0624
$$ y = [-137980, -15630, 82503, 78850, 4797, -59567, -92994, -89809, -67024, -65333, -60437, -101826, -111809, -132644, -135968, -22846, 141942, 122088, 160704, 181148, 165565, 118221, 8282, -86038, -134795, -159172, -186304, -128930, -78422, -41977, 128389, 177235, 115757, 111044, 162515, 59862, 2487, -2636, 93438, -52341, -108863, 52198, 149717, 158436, 151806, 104116, 74796, 108557, 144832, 83551, 78725, 142246, 178806, 132808, 64714, -20196, -22032, -29787, 29598, 122305, 119080, 90119, 132401, 156205, 58715, 65116, 2909, 20950, 22545, -99585, -77234, -21366, 50032, 145825, 95860, 77692, 141600, 107578, 135336, 52170, -30546, 20634, -64192, -24382, -90150, -119722, -56450, -120523, -69311, -6417, 13303, 6550, 34552, 14376, 22781, 33405]
20369C3405K1240p2927k5541j6710j0155K4354N9903L5791j01770p9556O3744
20358f8222J6894j481N9491P617j44164n8108R365L2425j3795L7438J56237L6732
20346G0429m4047m721N6337Q3233P2227n5442r1822J7480P7385N3799r737q6110
20334A39011K6957n6458j5700j4415J9107j0692j1903j2786j17494j30817m7021
20323b32211N9882J12550M1668n5531p119P6590K2916j52061R335K8590N5747
20312c9644J32989m1028j0106P0145M1941q3387M5405j8743q8988m8761J7095
20301b3082Q0758m5938K9376K1217m2394L7396N6314n0055p4117L934L3524J7291
20289D4224o2855l8529J28509P1913J216L320p9605l3747L3307J27267J9854p3080
$$ y = [33405, 54645, -18282, -43823, -60533, -70688, -46334, 13569, 49360, -52410, -131966, -68222, -51328, -52809, 6682, 14299, -129865, -187973, -178608, -146183, -159978, -122540, 33697, 70429, 26382, 21661, 77998, 161231, 233458, 178016, 86194, 103674, 181059, 234858, 225121, 139011, 165968, 109510, 93810, 79395, 98502, 87810, 75907, 63121, -54373, -185190, -232211, -172329, -59779, -18111, -73642, -80761, -4171, 18745, -133316, -123981, -95391, -39644, 93345, 52317, 42211, 112356, 154297, 70910, 116315, 97572, 8584, -40177, -23082, 57676, 11738, 41114, 62331, 19937, 57333, 113647, 63592, -10525, -6591, 26933, 44224, -18631, -57160, 71349, 143262, 144478, 147798, 68193, 34446, 67753, 195020, 214874, 141794]
20277A41794q4175K6058k747L0776j1415J4729n3318l2892k9102K0914N8439k396
20265G6665J5942K4007o6403o4299k0905P1759K11243k7880l7777l6556k2361
20254A23435l8935q870K6727J0013m0593n2414l2253J5198N0493J9632N6564j7658
20242A11339O5785O022O4667p383m6998p1333p9717J6257p4770j11462P4935O5516
20230A2858p1487K1258J34589O4830J7907o3314k5236j0983P3527M0074j03192
20219I0831r3737j06163o289P6017o1548m122O3839J11993k6891L0440R815k2328
20207F1857o3548L835K5486P2255n7871J1920J6851o5060K1279p3693Q381N6042
20195A7734J00617m5723k9874J31288p5497l4682n2092R23O1642M7950k1863M2737
$$ y = [141794, 57619, 83677, 80930, 111706, 100291, 115020, 61702, 28810, -292, 20622, 79061, 76665, 92607, 116614, 50211, -14088, -34993, 36766, 248009, 220129, 182352, 145796, 123435, 84500, 75630, 102357, 112370, 71777, 19363, -12890, 2308, 52801, 72433, 128997, 111339, 177124, 183146, 247813, 240430, 193432, 122099, 42382, 58639, -16131, -127593, -52658, 12858, -58629, -37371, 97218, 162048, 179955, 116641, 91405, 80422, 153949, 194023, 90831, -2906, -109069, -115358, -39341, -100889, -105011, -41172, 70821, 43930, 74370, 84185, 61857, -1691, 2144, 27630, 99885, 42014, 53934, 70785, 5725, 27004, -46689, -38308, 17734, 118351, 72628, 42754, 174042, 98545, 63863, 11771, 12694, 74336, 122286, 100423, 143160]
20183A43160K3359m1861r2641M300O0687R2815l9948q9611j1600r1041J1330n9052
20171i0103o8554K1006J69194J26758P5823l78j22765o3459L9011K2815M6686
20160A56034L6557j53449j26437J6973J8518L7362k0440Q1690o2967r112M1076
20149A5805L740r2153O3404J02575m8744l7291L2946j3704J228R873n61N4762
20137I1880J8678l0502k7690q3612N4737o5011n4337k6939k7343L6659O6462L7336
20125i682J05399j5182j23841J02674J06530P1778M8104j01374q9042N7128K1590
20114A74082j23149n6263J4260N7K2849J60506p2009L5502l8796m9691K5733k382
20102I0699q5859O6735K6153L573k3015j19550q4220P63o6499J559J81615N6530
$$ y = [143160, 166519, 124658, 32017, 36317, 97004, 189819, 149871, 60260, 48660, -42381, -31051, -90103, -158657, -137651, 31543, 158301, 234124, 233746, 110981, 47522, 86533, 109348, 156034, 192591, 39142, -87295, -70322, -51804, -14442, -34882, 46808, -16159, -25271, 15805, 19545, -72608, -9204, 93371, 44627, 7336, 40282, 26578, 27806, 37679, 37118, 91880, 110558, 80056, 52366, -31246, 23491, -41520, -95857, -122796, -150139, -113480, -47018, -9682, 95717, 80535, -43306, 59368, 165898, 237676, 285780, 184406, 95364, 152492, 174082, 50933, -5330, 8930, 8987, 31836, 192342, 120333, 155835, 117039, 67348, 93081, 90699, 4840, 71575, 97728, 101301, 78286, -41264, -125484, -124721, -191220, -189661, -8046, 48484]
20090D8484r3004J5650J76431j3409L3152l078o8521m6187K0204K048n4959M8989
20078F5800r543j19104N0901O7561O5511o7491j02496K5612J8316j8197J1808
20067a1322n0419J855J90105p742k6330K6991m2114M3543L6136o7868Q736J8960
20055A20531l4018l3260J27065J05950r0186p6767p2691k1784o8521k2245J09302
20044D3376K2031k3521n8459r7249r435Q3086J61070L9051m3608k8546n192j8438
20032F4166J427n8073r6377O6817N0721P395O1411O638k7643q908k0067L5411
20020H2918R342o4590l655O7503N7054N95k9855L871j4766n0422j3248n5338M7780
20007C7189K4723N6582K5820J2571M8755J0602m0560j05486q779R77n8618J1152
$$ y = [48484, -44520, -28870, 147561, 134152, 167304, 164226, 95705, 49518, 69722, 71770, 16811, 65800, 56257, -62847, -11946, 55615, 121126, 53635, -48861, -23249, -4933, -23130, -11322, -61741, -59886, 130219, 122477, 96147, 123138, 81024, 124567, 160703, 92835, 101571, 120531, 86513, 53253, 180318, 286268, 196082, 119315, 46624, 24840, -43681, -65926, 43376, 65407, 41886, -16573, -113822, -123257, -40171, 120899, 159950, 116342, 87796, 82604, 64166, 65593, 7520, -88857, -22040, 28681, 36076, 97487, 104125, 76482, 67574, 47507, 82918, 92260, 27670, 24015, 91518, 148572, 149167, 119312, 123183, 108417, 57995, 44747, -10591, 37189, 61912, 118494, 144314, 156885, 205640, 216242, 175682, 70196, 61417, 62394, 3776, 14928]
19995A4928P0047M638J6561j2572j9092o3941m1784P4755K870q9363o7173J3263
19983i6863J08288O5249p1028O7378P911r0070p4379P0757J11088Q3904l0896
19972A51339m1115p8648Q2989K465j30786L6988J05445m248m321k0016k5703K2864
19960I7253J8284Q090Q7448J14906M1137r6891j07516j59371R02J24734j18658
19949A0318L1377P0759J38936N8832j20368q6327q374j9701l3306L9560Q1374
19938A63080r22r9306P560N5551J17681k86o4580K3361j5783j1809m7452q7544
19926C9551J297l9374l1852J1874O1451O0389m4540k1858m0017J0449P9267P7975
19914A64612L4921K535L1349R6107k498k8657n2809j49433r7489p5988K7754M1238
$$ y = [14928, 84975, 89613, 106174, 93602, 74510, 10569, -31215, 43540, 46410, -42953, -110126, -96863, 11425, 76674, 5646, 73024, 80935, -9135, -83514, -12757, 98331, 182235, 151339, 110224, 31576, 114565, 117030, -13756, 23232, 128677, 124429, 120108, 100092, 74389, 97253, 115537, 123627, 211075, 325981, 367118, 270227, 162711, 3340, 4242, 128976, 10318, 41695, 112454, 251390, 310222, 189854, 103527, 95153, 75452, 42146, 81706, 163080, 162158, 62852, 70412, 125963, 243644, 243358, 178778, 202139, 186356, 174547, 127095, 39551, 40848, 1474, -30378, -18504, 42947, 103336, 58796, 36938, -3079, 7370, 86637, 164612, 199533, 202068, 233417, 329524, 327026, 298369, 245560, 96127, -1362, -77350, -49596, -8358]
19902h358n05R4717K11384L1470N7990k3564n5531M6265l8954k7135l6774K9112
19890B80117O5831L1050k1990n7029J1090N3952k1429L2798J32921J36761n8242
19879E85830k3036J5620L4992P6103O6903n4282p78l3516J9126R7020J07884L2920
19867I24786j03944N8132K848m9981n758J69494P344L841o6937q2411j3650P222
19855H50986l4654J5865J231N3524j7246p8910n9831O0371J054j02141q5584j5347
19843E89318Q373J05562j14968j02171n820J17753j9182l2238m303J8800J7509
19832E78633j00634o8242l1424n0572k9238N6844l5651r4114m2886J9798N1712
19821B54226L0898q0576p7951O614l7143J24292L5793j6197J3466O0065N447n3260
$$ y = [-8358, -8863, 85854, 297238, 328708, 386698, 363134, 307603, 353868, 314914, 287779, 251005, 280117, 345948, 376998, 355008, 297979, 309069, 363021, 341592, 374390, 507311, 644072, 585830, 562794, 578414, 613406, 689509, 756412, 702130, 701352, 667836, 686962, 783982, 891866, 924786, 820842, 878974, 881822, 831841, 826083, 995577, 1002921, 1006762, 939825, 857414, 843764, 850986, 816332, 832197, 833428, 886952, 869706, 790796, 730965, 791336, 792390, 690249, 604665, 589318, 597691, 703253, 588285, 486114, 480294, 598047, 578865, 546627, 542324, 561124, 578633, 477999, 409757, 378333, 327761, 298523, 355367, 319716, 225602, 182716, 202514, 254226, 285124, 204548, 126597, 133211, 96068, 220360, 256153, 239956, 253422, 313487, 318934, 265674]
19809B65674R200n6378K0643J5350m1995L9214m4923j7450o7677l9243K6078L0288
19797A38781l411P6314Q3925P216l2479j6863k5017r087K1391m3974n5513k3486
19785A17797m751n1307n18K6708n0229k1898l2729N1594L7072l2275R4711J12779
19773B46954j01339j14407M1985L3743K3733j1521r2856o3203O1270J79411N047
19762B08817n7243j6389o2757L6777q236J1317R854k8974N1698M775o325o5562
19750G7752j11851R9179J4220l3434l318J12844N1514O8780q2830o7409k9059
19739I6388P207P2363k3124J9702M9350l4159J4405n6720k72998L966J08815k004
19727a6809J00905m4009J9201J4805M9763N0944m3060j44640j3984L5986l9614
$$ y = [265674, 274874, 218496, 239139, 254489, 212494, 251708, 206785, 189335, 121658, 82415, 108493, 138781, 135370, 211684, 295609, 302825, 270346, 253483, 228466, 219379, 240770, 196796, 141283, 117797, 113046, 61739, 61221, 87929, 37700, 15802, -16927, 34667, 71739, 39464, 134175, 246954, 145615, 31208, 73193, 106936, 130669, 119148, 26292, -36911, 24359, 203770, 208817, 151574, 135185, 72428, 109205, 100969, 112286, 122140, 93166, 144864, 149639, 143314, 77752, -34099, 65080, 79300, 45866, 42548, 155392, 206906, 275686, 192856, 125447, 96388, 103595, 175958, 152834, 172536, 221886, 187727, 202132, 145412, -127586, -123620, -14805, -16809, 84096, 40087, 59288, 74093, 123856, 174800, 131740, -12900, -26884, 9102, -30512]
19716c0512K853Q2240K7867k2704O8712Q5422p9308J9871P740J5661J7421o9282
19704A25981M3449K199O9772M0911m9358J8891K5294m2042n2940k552J2266O1495
19692B53366J024n8605N785j7918l5410R3687N649o8089K2998L5615j5267j13741
19680A09094o8797k9988Q4803R865L5387l7832M3676J24167r7475j06837j91205
19669a25142l1641N8568J01431J60995J4371q1613o3154m0513M4040O6740l7371
19658F6711L9987o0439o4371O9139J02526o5347k9726p341O870J49344J05232
19647C12585o3581p7622N3002n5678k1505Q3952O448M8836j9972r6248q4804n7314
19635B8099j0944O4719J07632M0647J5573j0873O2577j6206m4555M1871j4010
$$ y = [-30512, -27659, 54581, 82448, 59744, 128456, 213878, 134570, 154441, 162181, 177842, 195263, 125981, 169430, 171629, 241401, 282312, 232954, 251845, 277139, 235097, 182157, 179605, 191871, 253366, 254390, 195785, 201570, 183652, 148242, 241929, 247578, 179489, 202487, 238102, 222835, 109094, 40297, 10309, 95112, 104977, 140364, 102532, 146208, 270375, 172900, 66063, -125142, -156783, -98215, 3216, 164211, 178582, 96969, 33815, -6698, 37342, 104082, 66711, 106698, 46259, -18112, 51027, 153553, 88206, 58480, 51139, 58009, 207353, 312585, 249004, 171382, 224384, 168706, 147201, 231153, 237601, 286437, 266465, 170217, 85413, 28099, 17155, 81874, 189506, 230153, 245726, 234853, 297430, 281224, 236669, 278540, 264530]
19624B64530j3027L6497J04053j24388k2450M5877j8604J06106K5338P0511K7254
19613E01697L068j7733k5942J32397M6599Q4444L1168r1778J19376J04370j7452
19602H70214r4687n6838j50573k4158N0064J9591M5861K9205P8075K4658j63693
19591F27719j09041N1528Q3030n2205n5227o8559K8529r4395j02725J55617j121
19580D63150M016l9865K5212l5729j39485L2543M6838K841j9533j0279Q1536M7164
19568D58409J45733P1419p6238o313Q485j8349k9746Q6933J39795Q0378O3708
19557I24214K6106k1321o3010q5199m7890r5356r4849l9280O5516Q5149N5086
19546G09166k0443p019Q4641j19101j49721r9294j38843J8370m1930O747k0105
$$ y = [264530, 251503, 288000, 392053, 267665, 245215, 291092, 272488, 378594, 403932, 474443, 501697, 504765, 487032, 461090, 593487, 640086, 724530, 755698, 663920, 783296, 887666, 870214, 775527, 718689, 568116, 543958, 594022, 613613, 659474, 688679, 766754, 791412, 627719, 518678, 570206, 653236, 601031, 545804, 477245, 505774, 411379, 308654, 464271, 463150, 467166, 427301, 452513, 416784, 277299, 309842, 356680, 359521, 339988, 329709, 411245, 458409, 604142, 675561, 599323, 593010, 601495, 583146, 553400, 640333, 780128, 860506, 924214, 950320, 928999, 865989, 780790, 732900, 637544, 542695, 503415, 568931, 654080, 709166, 688723, 681704, 766345, 647244, 497523, 398229, 259386, 277756, 235826, 242573, 222468]
19535B22468P8317q634j32321K0938Q8390l6791K1062l2411p5457L0080Q0579
19524B56220l4320j38284K5418j6792J0338o5096m1592J46150N1444p2231L4044
19513A55299K2158J31822R0086l8504j04710r712m8676j5074j0356L8278R7198
19502C07809J3961J2572K7953q996j31433o8822Q0795j5653M0811n2138j42878
19491F3981M984M2462J0939l7333O999P6359L589L3534J06399p271j36395j22405
19479D5842Q2018J8649M1571K4011J14635O7672m4434j33984p2471K5697O888
19468A76094O5768P390k227q126J17000o2026o2084p7654J0394N8853r850l0853
19456A82679N0239N6519P1918Q2368q2437r4639o6597j0153N0366o254R7183K1055
$$ y = [222468, 300785, 292151, 159830, 180768, 269158, 232367, 253429, 221018, 145561, 175641, 256220, 221900, 83616, 109034, 92242, 102580, 37484, -4108, 142042, 193486, 121255, 155299, 177457, 309279, 399365, 360861, 256151, 246439, 197763, 182689, 172333, 210611, 307809, 321770, 334342, 362295, 353299, 221866, 153044, 233839, 218186, 258997, 206859, 63981, 68965, 111427, 122366, 85033, 92032, 168391, 171980, 205514, 311913, 304642, 168247, 45842, 127860, 146509, 188080, 212091, 326726, 394398, 349964, 215980, 143509, 169206, 176094, 241862, 249252, 247025, 238899, 355899, 293873, 231789, 154135, 164529, 223382, 213532, 182679, 232918, 289437, 361355, 443723, 361286, 266647, 200050, 189897, 240263, 234009, 331192, 352247]
19444C52247j1857N6995M2025L2078n0480j39269l7834n1116L6367M6793o7044
19433B08905Q8851k4781k8178L728l0987L4978j4094L1303J432j23842r1150O303
19421F2468M9273O3005o0622J14760Q8922P9983P1799l9069k2762q5491p8167
19410B44099L2909m5919j03394R9891R3411l5710l332n1532o6708N6674O3942
19399B84331K1196m6461n6368o3559L2846J55905O636r3561k6968r332O0669j9370
19387B45964O5287K1757q4363j08289n1572L1848m5996K3646j1934J57136J44594
19376C88078p1813p6544n6227o1820o7603J07663R7432P8154J14041k5789r8373
19365C27199q9311K2896P821M5152O4980J01387N5198J5614m2936m9279j30724
$$ y = [352247, 340390, 397385, 439410, 471488, 421008, 281739, 243905, 192789, 229156, 275949, 208905, 297756, 272975, 244797, 248525, 217538, 252516, 238422, 269725, 271157, 147315, 56165, 62468, 111741, 174746, 114124, 228884, 317806, 397789, 469588, 430519, 407757, 322266, 244099, 277008, 231089, 127695, 227586, 320997, 285287, 281955, 230423, 163715, 220389, 284331, 305527, 259066, 202698, 139139, 171985, 327890, 334526, 240965, 213997, 204665, 265334, 245964, 311251, 333008, 248645, 140356, 88784, 120632, 74636, 98282, 86348, 243484, 388078, 316265, 239721, 183494, 121674, 54071, 161734, 259166, 337320, 451361, 425572, 327199, 237888, 260784, 268605, 313757, 378737, 480124, 535322, 550936, 508000, 458721, 327997]
19354C27997p3839N2476Q7791p5517k5359J1101J6298P5848n5366J7098l926L1385
19342C85987o76r939k7032l4726R919Q2281K4830k7272k2855l9363p6117L3065
19330B98102Q0958R7768K7619p7158j5287k9911q0898k8288j331l6834K9034j9709
19318B44065k7903l0648K6712J41432P9296m8422K3540l1383m8055j3555j0361
19307C04718Q1199J04969l7925r8190l4164j4655j0019O4452n4587r639R8693
19296C94852J0249O1890O4369M8644q8210j7944K353l8382p3079o0034m6616R9522
19284C57614R8870P2122q7471r0896J08763r95k7028Q2969L3752l4282J5666k7401
19272E01683N0214R374q9269M4931Q0727j09628j19713J0884J29657R7793o2557
$$ y = [327997, 254158, 306634, 394425, 318908, 293549, 304650, 320948, 396796, 341430, 358528, 354602, 385987, 385311, 375372, 348340, 313614, 323533, 405814, 430644, 403372, 380517, 341154, 265037, 298102, 379060, 476828, 504447, 427289, 412002, 382091, 301193, 272905, 271574, 234740, 263774, 244065, 216162, 185514, 212226, 353658, 432954, 384532, 408072, 376689, 328634, 315079, 304718, 385917, 490886, 452961, 354771, 320607, 305952, 295933, 360385, 305798, 296159, 394852, 405101, 466991, 531360, 580004, 491794, 473850, 476203, 437821, 364742, 304708, 258092, 357614, 456484, 528606, 441135, 350239, 459002, 458007, 430979, 513948, 547700, 513418, 529084, 501683, 551897, 561271, 472002, 516933, 597660, 488032, 368319, 379203, 508860, 606653, 544096]
19261E44096j35831J7775Q9548j03926p9286o20m4311j7958J03822N6213M9701
19250D79223L565k9386o0942k1066L3522N1172k6949J8347K7830m5115O7724L4216
19238E32141J05779M1945q196q1707j0006k5175k9954J38245O4360j3998j58763
19227E54671J1470j8477j20395o816N7815R386K9544R4871O5875l9252N56L5715
19215F74963r9753j11178j2163O4488J41072k1671K4158n877m5421k2958L2771
19204F18431Q1804j2299l1101J7430k6642L1582O1437m797r4574N4391N6061R2929
19192H44652O3172N7800k1912j1349J38171o2544m7462K203l2644L7259J25278
19181A092624M8773J0666K4621P9349L7717O1153O9807o9885j00502O5995n8174
$$ y = [544096, 408265, 426040, 515588, 411662, 332376, 331756, 287445, 269487, 373309, 429522, 479223, 482788, 453402, 392460, 371394, 404916, 456088, 429139, 447486, 475316, 430201, 497925, 532141, 637920, 679865, 671669, 589962, 579956, 554781, 524827, 663072, 727432, 713434, 554671, 566141, 547664, 427269, 420453, 478268, 487654, 517198, 612069, 677944, 638692, 639248, 674963, 575210, 464032, 451869, 516357, 657429, 635758, 659916, 654039, 608618, 585660, 618431, 700235, 687936, 656835, 674265, 647623, 679205, 740642, 735845, 641271, 695662, 751723, 844652, 907824, 965624, 943712, 932363, 1070534, 1007990, 960528, 962731, 930087, 967346, 1092624, 1141397, 1152063, 1176684, 1256033, 1293750, 1354903, 1424710, 1354825, 1254323, 1320318, 1262144]
19170A262144j5539N8088J0760Q3514P9216n0684m5260Q2069K87787L09172J68967
19159B230234P1189J54501K57934J78093J50935L5958j74218j15898j51260j04853
19149B532615r8925Q2922K10875K86683M20711M9914m9683O2766l3784j52736
19139C311358K3103J86761J68360J24596K24339K15392K74296M09812N52485N91423
19129F081925P70409J003667J669022K388892K724135K142835N06487m70348r20222
19120A5896802j256870j075081n58634k5899L53748P28508J282992J966300K878099
19111B0189965M139046N935512R229085J5989822K7405727L5349744J8552444
19104A36791345o152447j3526532j8848783j8423542j0279306k30485J0974902
$$ y = [1262144, 1246605, 1304693, 1315453, 1398967, 1478183, 1427499, 1382239, 1464308, 1752095, 2061267, 2230234, 2301423, 2455924, 2713858, 2891951, 3042886, 3078844, 2904626, 2788728, 2637468, 2532615, 2433690, 2516612, 2727487, 3014170, 3434881, 3484795, 3435112, 3497878, 3464094, 3311358, 3334461, 3521222, 3689582, 3814178, 4038517, 4253909, 4528205, 4938017, 5490502, 6081925, 6852334, 7856001, 9525023, 11913915, 14638050, 16780885, 17287372, 16817024, 15896802, 14639932, 13564851, 13006217, 12980318, 13334066, 14062574, 15345566, 17311866, 20189965, 24329011, 30264523, 39493608, 55483430, 82889157, 118238901, 136791345, 130638898, 117112366, 98263583, 79840041, 69560735, 69330250, 80305152]
19097H0305152K4445595L1125507J7030895j682310r847726j3517873j8420392
19090A09438848j8102813j3061911q421277k369510N338196P778537j070717n242393
19082G4286960m924414l922398M97466J312449l932306n447166n813297n289087
19074D6768207k141872K113143O577004P782825K637951j807498l274082l787279
19066E4868399j817262K590325R195696J6721322J9010975J2277730Q349729R547337
19058A30744251N768845M61416m389282j1261518j1876283r502768q958871q218793
19050H2766997l825736J634567J0376491K2118667K7493812K5560108J5431384
19043A81556290j3786944k5852369k7016118k5909769j8277859j0819750o560503
$$ y = [80305152, 104750747, 135876254, 152907149, 151224839, 141377113, 127859240, 109438848, 91336035, 78274124, 69852847, 67483337, 72821533, 80600070, 79529353, 74286960, 69362546, 65440148, 65937614, 67250063, 63317757, 57870591, 52057294, 46768207, 44626335, 46739478, 53316482, 61099307, 63737258, 61929760, 58655678, 54868399, 53051137, 55641462, 64837158, 81558480, 100569455, 112847185, 121196914, 130744251, 136513096, 136974512, 132585230, 121323712, 109447429, 99944661, 90985790, 82766997, 78941261, 80575828, 90952319, 113070986, 140564798, 166124906, 181556290, 167769346, 141916977, 114900859, 88991090, 70713231, 59893481, 53332978]
19036E3332978l505274m008134o204587n678229n167714m583520l409372k539069
19028A8237079k043972j627235j263419j085027r34229q14231p00799m87318l80153
19019H900696k76620j28334J79058L14898j91054p12894q00396q97396q13949
19010E574009n40670k96885k77478k60632j45433j82762j30988P299J16873K22684
19000D086017M87035M38259J91279k04545n45567n24448o67687n79404l14116
18991B366823j78715p9229j395R6863P6848j8524q4567o5552j31859j53439K398
18980A829652J78202K67180J09341K7099k07871k35873l4717L4926k56564j34643
18970A576732j73507j24974j1179Q2058l6397j2304j7570r2287l2828L1386N2848
$$ y = [53332978, 49827704, 45819570, 39614983, 33936754, 28769040, 24185520, 20776148, 18237079, 16193107, 14565872, 13302453, 12217426, 11283197, 10468966, 9768167, 9280849, 8900696, 8624076, 8495742, 8674800, 8989698, 8798644, 8085750, 7285354, 6387958, 5574009, 5033339, 4736454, 4458976, 4198344, 4052911, 3870149, 3739161, 3746460, 3863333, 4086017, 4573052, 5011311, 5202590, 4998045, 4452478, 3928030, 3260343, 2680939, 2366823, 2188108, 2108879, 2107484, 2204347, 2281195, 2262671, 2178104, 2112552, 1980693, 1827254, 1829652, 2007854, 2275034, 2384375, 2411474, 2203603, 1967730, 1933013, 1967939, 1711375, 1576732, 1403225, 1278251, 1267072, 1349130, 1312733, 1300429, 1282859, 1190572, 1157744, 1189130, 1241978]
18959A241978K7403l0276j07377j37599k1446q5878K1138N5466o9033K2589p7936
18948H39029l1906J14159M6349J6866P4553j02196o8486j7006p1551N8301L6929
18937H95041j07995r0696q8748L6135O449m5886j7433N975O8620k1241J1583J5171
18925F66975O819q3917n872M5547l2333j20073k5778n8729m6499r2486N6532L6513
18913C46699m8851q6298p1828N4833R3563M8807m581L2385J60869n4545r2406
18902C78647O5195M4589J19553k7125j39975j0150m3441O7384J4342k3793O4357
18891E09583J3793n1285K3988j63287Q86l8041j28189j9401J07646M9410N2831
18880C57934N3959P6271l0041j18934n2673k4873m2462o1297m9965l3138j5591
$$ y = [1241978, 1269381, 1239105, 1131728, 994129, 972683, 886805, 907943, 963409, 894376, 916965, 839029, 807123, 921282, 967631, 984497, 1059050, 956854, 888368, 871362, 799811, 858112, 895041, 787046, 696350, 607602, 643737, 650186, 604300, 586867, 592842, 661462, 640221, 651804, 666975, 673794, 589877, 584005, 629552, 597219, 477146, 451368, 392639, 346140, 253654, 310186, 346699, 297848, 211550, 139722, 194555, 288118, 336925, 332344, 364729, 525598, 471053, 378647, 443842, 488431, 607984, 580859, 440884, 430734, 387293, 454677, 469019, 445226, 509583, 523376, 472091, 496079, 332792, 333678, 295637, 167448, 148047, 255693, 305103, 357934, 411893, 488164, 458123, 339189, 286516, 261643, 219181, 157884, 107919, 74781, 59190]
18869E9190P5249J90092k8443n3657o4695o9401K9597p494j39016j0587J39540
18858A20375J0022O7602j4799P782N9544L8622L4201j51503l6830O4645m7087
18847A52574j59747n2181k0937P1839J06588N362m3027L7141j1024j4732J7499
18836H9355j6191K8104j3927m7034k895K8225K6647L0619N3787M801L4038j3139
18824B02390o1683j20544n7679P2176J56117J85018r990m4123j1454P234J368
18813C18830O6731k5690l5398K8958p4941O238O4018J4401p3948p8979j06822
18802A03398K5921O7414P146P381K6721N3444M2632J08545O2546q690k932M323
18790D97849l1678j36774N2025J00346q0403j55497n8578m8784J55888J04559
$$ y = [59190, 134439, 324531, 296088, 242431, 177736, 108335, 137932, 130438, -8578, -19165, 120375, 130397, 197999, 183200, 190982, 250526, 289148, 323349, 171846, 135016, 199661, 152574, -7173, -59354, -80291, -8452, 98136, 103498, 60471, 97612, 86588, 71856, 89355, 73164, 101268, 87341, 40307, 37412, 65637, 92284, 122903, 176690, 181491, 215529, 202390, 140707, 20163, -37516, 34660, 190777, 375795, 365805, 321682, 310228, 317462, 318830, 385561, 359871, 324473, 353431, 278490, 284728, 348746, 363147, 289199, 210220, 103398, 129319, 196733, 203879, 211260, 237981, 291425, 334057, 442602, 505148, 496458, 493526, 497849, 466171, 329397, 381422, 481768, 401365, 245868, 187290, 138506, 294394, 398953]
18780C98953k8382q0949L7321m5L2468o2971p9748M3610R8086R4015N3350o1618
18768D44090j8881M4730O3878Q3668K92799J77298q7309n1016j52458j62781o0616
18757E73402q1612j9343l253K2178j7722J6004n8139m0764m125P1879J08987o810
18745E60682j7007j8075j13569p6141N5809l330k5098M5536P648j28858L0091
18734C17688K2061m1967R6769J3762L9563K749j6673J30073K4005j04234j67638
18723C16158O8801J45808J1762J9582o1010j15490J3443L9841O01j01560k2237
18712C15699J3398l6841l5685J08672O7560m1257J412O746K4606O6033R686k9134
18700D70895L8496j25748o9315j17840N1172J85226R5728L4564r4548j05750L645
$$ y = [398953, 370571, 289622, 326943, 326898, 359366, 296395, 216647, 260257, 358343, 452358, 505708, 444090, 425209, 469939, 533817, 617485, 910284, 1087582, 1000273, 949257, 796799, 634018, 573402, 491790, 472447, 469194, 491372, 473650, 489654, 431515, 390751, 386626, 458505, 567492, 560682, 543675, 525600, 412031, 335890, 391699, 388369, 363271, 408807, 416455, 287597, 317688, 339749, 297782, 394551, 408313, 447876, 450625, 433952, 564025, 588030, 483796, 316158, 384959, 530767, 542529, 562111, 501101, 385611, 399054, 438895, 439496, 337936, 315699, 329097, 292256, 256571, 365243, 432803, 391546, 392958, 399704, 424310, 490343, 500029, 470895, 509391, 383643, 314328, 196488, 247660, 432886, 528614, 563178, 468630, 362880, 366525]
18689C66525J40030k7173M2114p4892J4709M2649q7313j49126N2809N859J23175
18678D49366L8321L6329N0541j5484O9718J3476p105p0232k0274o701n1353O8272
18666E54874O258n8197K8307M7660l30k188j5319J2001L8818o5227J5765J77353
18654G39775L1867N4039m113N1704N1391l360j42878j61114L5545O6739K327J3269
18642G35191L8167J14690O4639N9307p1337o9791L7024J192j62273k2082J19077
18631H43804r638k8250P3338m2847L176j1275o7481L2430Q3574J6672l1538K8359
18619H90324M9374O2867Q6304j32241j13618J30513R9452n7392P6152N1755K6516
18608A170006j0714L1316J34447Q0765n3773J20510k7913j652L8328J76543J96664
$$ y = [366525, 506555, 479382, 521496, 446604, 461313, 503962, 416649, 267523, 320332, 326191, 449366, 487687, 524016, 574557, 559073, 628791, 642267, 635162, 564930, 544656, 537955, 486602, 554874, 561132, 502935, 531242, 578902, 578572, 576384, 561065, 573066, 611884, 546657, 562422, 739775, 771642, 825681, 821568, 873272, 924663, 921303, 778425, 617311, 652856, 719595, 721922, 735191, 773358, 888048, 952687, 1011994, 940657, 870866, 907890, 909082, 746809, 724727, 843804, 834166, 805916, 879254, 836407, 839583, 828308, 760827, 793257, 876831, 893503, 861965, 890324, 939698, 1002565, 1088869, 956628, 843010, 973523, 1072975, 1015583, 1091735, 1143490, 1170006, 1159292, 1190608, 1325055, 1405820, 1352047, 1472557, 1444644, 1442992, 1481320, 1657863, 1854527]
18597A854527J41352J95027J82536J64204J65277Q8224o6931N0336k5133j93210
18587B556209j37720j47618j59777p6206M7154J50733M2258J7092R6984J37663
18577B526772K59307K52295K40408J08846K27806O26271R76348N85302k9668j08492
18567E665195k08016r8361J45115P22642J370536K252447L034086J338673p32217
18558A3490100j041694j660229j678935q69896m958O16687J511523K924637L067129
18549A6354364O13928j183351j785291k235562k021425j423785q10690l78094
18541G130094q3476n5022m1776L446O7106J64875J26944K44007M41820L31132
18531H329150N16013P43957Q07756Q11765Q16309R79123J007245Q30069J034462
$$ y = [1854527, 1995879, 2190906, 2373442, 2537646, 2702923, 2791147, 2724216, 2774552, 2749419, 2556209, 2418489, 2270871, 2111094, 2034888, 2082042, 2232775, 2275033, 2292125, 2389109, 2526772, 2786079, 3038374, 3278782, 3387628, 3615434, 4241705, 5218053, 5803355, 5773687, 5665195, 5457179, 5358818, 5503933, 6226575, 7597111, 9849558, 12883644, 14222317, 13490100, 12448406, 10788177, 9109242, 8239346, 8234388, 8851075, 10362598, 13287235, 16354364, 16968292, 15784941, 13999650, 11764088, 9742663, 8318878, 7508188, 7130094, 7046618, 6991596, 6949820, 6953266, 7020372, 7185247, 7312191, 7556198, 7998018, 8329150, 8845163, 9589120, 10396876, 11208641, 12024950, 13004073, 14011318, 14841387, 15875849]
18522A5875849J853441L264357O007040Q925648O656895k60548k559268l393811
18514C6369603l215940m44715L867547P943785P538157M964188J673684n268868
18506E3427441p533479p145791o188395m180981k149608n94873N34841J420245
18498B7589400K944677N107504P323909Q141339P072313P541308N086089J054433
18490G1860972L422314R331058J5810543J3396583J703377j936953k436786K34188
18482A11385296R977430K5309676M0419356M2363559L5236990L2183047J8242863
18475C15118217n773311k3006296k8217736k6224488k9719536l0490811k2991037
18468A48695002j6074527p137156L173314N489572k076045m536514j974294j087293
$$ y = [15875849, 17729290, 20993647, 27000687, 35926335, 42583230, 42322682, 39763414, 36369603, 33153663, 32708948, 36576495, 44520280, 52058437, 57022625, 58696309, 53427441, 45893962, 38748171, 32559776, 28378795, 26229187, 25634314, 26169155, 27589400, 30534077, 35641581, 42965490, 51106829, 58179142, 65720450, 70806539, 71860972, 75283286, 84614344, 100424887, 113821470, 115524847, 113587894, 111151108, 111385296, 121362726, 146672402, 187091758, 229455317, 264692307, 296875354, 315118217, 309344906, 286338610, 258120874, 231896386, 202176850, 171686039, 148695002, 132620475, 125483319, 128656633, 134146205, 132070160, 127533646, 125559352, 124472059]
18460A24472059o965104j1366031r162463o455163l746730o790199q897856p972354
18452F3116159q375619p172530m702568k523665q0027K413907N222349P229131
18444E5127137P915082J0565969J0733501K944568k349686k280391K1136O528787
18436H9206103J1890686J0981348Q912480J1382483J1747126K041532J01970N373867
18428A51637595m47426j6772939k1471487k1397331k1361530j6832277j0900730
18421D2453875o731433l902562j657544q550Q398q94275o62710m59944J44833
18412B8290088P32769l09883j134389n99684N73209K164407J185780j734702k508434
18403B6659161k811562k793069j526077J72889K207064N350530Q530398N617353
$$ y = [124472059, 117506955, 106140924, 96978461, 90523298, 86776568, 79986369, 71088513, 63116159, 54740540, 47568010, 42865442, 40341777, 40261750, 42675657, 47898006, 55127137, 63042219, 73608188, 84341689, 87286257, 84936571, 82656180, 82677316, 89206103, 101096789, 112078137, 120990617, 132373100, 144120226, 146161758, 146263728, 151637595, 151190169, 134417230, 112945743, 91548412, 70186882, 53354605, 42453875, 35722442, 31819880, 30162336, 30153786, 30162184, 29267909, 28605199, 28145255, 28290088, 29022857, 28712974, 27578585, 26978901, 27552110, 29716517, 30902297, 29167595, 26659161, 23847599, 21054530, 19528453, 19701342, 21908406, 27258936, 35789334, 41406687]
18395D1406687j467712k511325l313766m958747n017127l264582k351803j004812
18387A7516813J020589K139006K48944j735178j938325k266755j946546r73707
18379A2064841K79644J770647L523891M785048M222383J283746k954451m142129
18371B0833620m435684m157783k980779j793936j279532q69561o05577n60648
18363D150120l72007l31075l34871k33897k11595j55303j15720r7744j15591m2765
18353B139552K225r0688j35686n585N458L6673O9462P0380q4186k41828k79366
18342A486411j69865o6623r5228j62034o1967j01570j03441L1854n1910n1619
18332F54008n3334K9429Q1567n8470r0296K9324l978m7716k2271o2706K2745Q9424
$$ y = [41406687, 39938975, 37427650, 34113884, 29155137, 24138010, 20873428, 18521625, 17516813, 18537402, 20676408, 20925352, 19190174, 17251849, 14985094, 13038548, 12064841, 12344485, 14115132, 17639023, 22424071, 26646454, 27930200, 24975749, 20833620, 16397936, 12240153, 9259374, 7465438, 6185906, 5316345, 4710768, 4150120, 3778113, 3447038, 3112167, 2878270, 2666675, 2511372, 2395652, 2297908, 2182317, 2139552, 2141777, 2051089, 1915403, 1909818, 1915276, 1951949, 2021411, 2091791, 2007605, 1765777, 1486411, 1316546, 1249923, 1154695, 992661, 930694, 829124, 725683, 757537, 705627, 654008, 600674, 630103, 711670, 653200, 562904, 592228, 588250, 540534, 518263, 455557, 478302, 567726]
18320E67726N8285m5228j56894P0485L2653m3599k6116J75552Q4263l4876o3985
18309F18266M330m5378l7340j07857j89245l1459K4314M9461M8559j18421p1089
18298A44141k2852P6250O256N8496J10034n6399j36991K8241M8985J1475n8685
18287B08951m9395r8567o2895m728n271r1731O2587P8939P2819J18020M6402K5510
18275C00641L8533j0399m3599k9257o2M4461L3997q9150j09888k1286M8877M2269
18263B05137o39j02456p0004o5702j770n4455Q6582K9958Q6682N8369K7393n1691
18251A47404M068R980L9322P9468j10568K8145p4429q6262L8018K2976M7430j2088
18239A33464j0504J3574K7684n214R7029Q5293r6796j14178R82J2683r1136m6079
$$ y = [567726, 626011, 580783, 423889, 494374, 527027, 483428, 457312, 632864, 717127, 682251, 618266, 622596, 577218, 539878, 432021, 242776, 211317, 235631, 285092, 333651, 215230, 144141, 121289, 197539, 203795, 262291, 372325, 315926, 178935, 207176, 256161, 267636, 208951, 159556, 60989, -1906, -6634, -11905, -103636, -41049, 37890, 110709, 228729, 275131, 300641, 339174, 328775, 285176, 255919, 255857, 300318, 334315, 245165, 135277, 113991, 162868, 205137, 204498, 102042, 32038, -33664, -35434, -89889, -3307, 26651, 113333, 171702, 199095, 147404, 151472, 161452, 200774, 280242, 169674, 197819, 123390, 37128, 75146, 98122, 145552, 133464, 122960, 136534, 164218, 159004, 256033, 341326, 244530, 130352, 131334, 144017, 52881, 6802]
18227F802M1950P560p7677n3106r5174K5777J44300R4813L533M606O5627J25698
18215B94709J59271Q4578n0139r7836l6822J4908N685R547r4732n1053k0617m7554
18203A69945Q0638j88r1746j1449K716P006l3568m4834j4298J01937m7517M6599
18191A65241J6817M784j11279j04106K7959K9273p111M2889J8978k9128j5332
18180C8985J44830M3784K5433M888j6427J6963n6529m8299l1509Q6220J6104m0024
18168A84419j419K4775m0584m1398M7616O4095k308J2659M976m8350l4434Q2197
18156B52244P7236N863k7627o4744l33P2694P5096O2149J53774R5739j20648k2397
18144E59046R5494M5856M2433J6517M373J9624J38385R5744K3467N4852L4112
$$ y = [6802, 48752, 56312, -21365, -74471, -169645, -143868, 432, 95245, 98778, 103384, 169011, 294709, 453980, 538558, 488419, 390583, 353761, 368669, 374354, 383901, 289169, 238116, 217499, 169945, 250583, 250395, 158649, 147200, 149916, 156922, 123354, 78520, 64222, 166159, 118642, 165241, 182058, 186842, 75563, -28543, -584, 28689, 21578, 64467, 83445, 54317, 38985, 183815, 227599, 253032, 257920, 241493, 258456, 201927, 153628, 122119, 208339, 224443, 184419, 183000, 207775, 167191, 125793, 173409, 237504, 235196, 247855, 252831, 204481, 170047, 252244, 329480, 335343, 307716, 242972, 242639, 315333, 390429, 452578, 606352, 702091, 581443, 559046, 654540, 700396, 742829, 759346, 763719, 783343, 921728, 1017472, 1040939, 1095791, 1129903]
18133A129903n9627L3297J33726L1185Q6320J20402J28719J80698J73545K50824
18123B208992L32153K73257L05572L77770L43587N20143O14321O33832P45956
18114F355583J083226J375815K093428L053928M774845P576542J3321147K6215770
18106F5850284M5637970L9098560q922450j9468088k4767153l1169713k3412002
18099D2847408j3508721p629626m679854l128514k145464j660611j275220r69692
18091G849706p55884q59631q00037m97858m58633l46067k39248m07075l60271
18082C125002k68752l86725k83072j27274k11592j94793j48416n6386p1645p5700
18072A300647j25926j05591l6721N861j49222o3457N0459n6703J4657m1290n6278
$$ y = [1129903, 1070276, 1103573, 1237299, 1268484, 1354804, 1475206, 1603925, 1784623, 1958168, 2208992, 2541145, 2814402, 3119974, 3497744, 3841331, 4361474, 4975795, 5609627, 6355583, 7438809, 8814624, 10908052, 13961980, 18736825, 26313367, 39634514, 65850284, 111488254, 150586814, 141664364, 122196276, 97429123, 66259410, 42847408, 29338687, 21709061, 17029207, 13900693, 11755229, 10094618, 8819398, 7849706, 7093822, 6234191, 5434154, 4936296, 4477663, 4131596, 3892348, 3485273, 3125002, 2856250, 2469525, 2186453, 2059179, 1847587, 1652794, 1504378, 1447992, 1376347, 1300647, 1174721, 1069130, 1032409, 1038270, 889048, 825591, 876050, 819347, 834004, 792714, 736436]
18061G36436n4152l4239k5089L9145m2705j27428K7217n7131j10362m2158R8391
18050D07925J2401n6860m0200l2939p032k316n4297P1752j9305P221O3856j9482
18038C30724M8407p535j94852o2314L5835J21774J12015j05526q8196O6681O6329
18027C23342J4249L5934k8634o2680J5608l5376j5255j01403m3972J184L516l9684
18015F6829o650p8752Q0016l4483l7241o9394L9153J03657J2833P7127J0105p0671
18003I2529l9314l448O7241K7406Q5136j6519o696J07359M8419j4046q202m5772
17991B94093K6523M5675m9473J16273J10455J80287P4366l1973Q2470k920r780
17980H35996K2248j39375o1707J7507k7982k7733k5081r9241k4671J01196o183
$$ y = [736436, 682284, 648045, 622956, 662101, 619396, 491968, 519185, 462054, 351692, 309534, 407925, 420326, 363466, 323266, 290327, 283295, 280979, 226682, 298434, 279129, 286350, 350206, 330724, 379131, 371596, 176744, 114430, 150265, 272039, 384054, 278528, 190332, 257013, 323342, 337591, 373525, 344891, 282211, 297819, 262443, 247188, 145785, 101813, 102997, 106513, 66829, 60179, -18573, 61443, 26960, -10281, -79675, -40522, 63135, 75968, 153095, 163200, 92529, 53215, 49767, 117008, 144414, 229550, 213031, 206335, 313694, 362113, 348067, 339865, 294093, 320616, 366291, 316818, 433091, 543546, 723833, 798199, 766226, 848696, 845776, 835996, 858244, 718869, 657162, 674669, 646687, 618954, 593873, 494632, 469961, 571157, 564974]
17969E64974q3770P6143J0665k7821r7219o7740m696p1105j03050j08348j05967
17958a7934m6213N5354J795o9060O4722P0252P541R0573M138n5613m9201P5077
17946A31431j4849R678K5732r734J87967P7106M481o623K507Q4616O8583j14109
17934D46786l5213N2529p03L8621J84655J6743J9089j5760M20L1862Q6895p8502
17922G47422j59098l2114p1966P0298j05518n9638r483p2922n3547j0044N3903
17911B97293L585K333K1407j3815m3302J641m7808M950n7040m4879j9071O4101
17899A69395k769k8817l1041j34307N1177Q1650k7361m6459M4635k7921L9894
17888H8076j58302n9682K42377J50671j0349K2618k8260m6491L8926J8184m4913
$$ y = [564974, 481204, 557347, 568012, 540191, 442972, 375232, 370536, 299431, 196381, 88033, -17934, -64147, -8793, -6998, -76058, -11336, 58916, 66457, 157030, 161168, 105555, 56354, 131431, 116582, 126260, 151992, 142258, 330225, 407331, 411812, 405189, 407696, 492312, 560895, 446786, 411573, 464102, 463399, 502020, 686675, 703418, 722507, 706747, 707167, 739029, 825924, 747422, 588324, 556210, 484244, 554542, 449024, 389386, 379903, 306981, 253434, 243390, 297293, 300878, 303211, 324618, 310803, 267501, 269142, 221334, 226284, 169244, 124365, 105294, 169395, 166626, 137809, 106768, -27539, 23638, 105288, 77927, 31468, 76103, 48182, 88076, -70226, -129908, 112469, 263140, 252791, 275409, 247149, 200658, 239584, 257768, 212855]
17877B12855l7252j20722l8273J8606j8531K3425J40228R8872R2289o4628r2377
17866B14492k5768q5422r3164q8196n719J35929O151j12047P3069J07117m2990
17855H3452j06451r6453k1294Q6909Q1885J04564M5733K897j24830p9077k8660
17844e1325J29464m2093j5364q2941r099J6860k1454K3211L9957n6301n1610J9414
17832a01281m3311M4880Q9849M7623m4317j6121q412K1036J8732M1519k1653m525
17820B4019P8664r617q6442j25980q894Q1616Q4769q2329q8113N5827p450j1120
17808i5050N6259N61r421J943R7322j3589j2209m003o8737o983L9486o8268p6588
17795a59277p7932K0592O0514j7344n1070K0982k3231K3749j0140N6840J8071
$$ y = [212855, 175603, 54881, 16608, 35214, 16683, 40108, 180336, 279208, 371497, 306869, 214492, 188724, 103302, 10138, -78058, -83777, 52152, 58303, -53744, 19325, 126442, 83452, -22999, -119452, -140746, -53837, 28048, 132612, 178345, 181242, 56412, -22665, -51325, 78139, 36046, 20682, -62259, -71358, -54498, -75952, -52741, -12784, -69085, -120695, -101281, -144592, -99712, -9863, 37760, -6557, -22678, -31090, -10054, 8678, 50197, 28544, 24019, 102683, 93066, 6624, -119356, -128250, -46634, 38135, -44194, -132307, -76480, -83930, -95050, -38791, -38230, -47651, -45708, 51614, 38025, 25816, 21813, -46924, -53907, -14421, -82689, -159277, -237209, -216617, -156103, -173447, -224517, -203535, -226766, -203017, -213157, -156317, -138246]
17784a38246N279k4483J8258O4288l8740j13633N2213L3211q442J7562M7141K6222
17772e9370p0725J8732j1259M7730P9311J8776m7735l9948L334Q94M6346L0683
17760A6769j17122j54727J7738J6977L1939K8555r777j631R5797J39894K2978
17749H7390r2668l3409K1601k0995L616o1750P7199j05482n2457j7220R0924J74244
17737G0993p588r1452j4417N5555m6535p2160m6583R187q478J45729Q5057j7952
17725F1356r667j5118L047J02385n3330l4164m2903L9648l4611n6199j7666M1980
17713a5242j1995o6657k1853j3362J39514k3802n7593N2756j1155r782L0366L855
17701d950J7115N2506P650r6980p8913r5384j5205O8293K9738J04258j095m7117
$$ y = [-138246, -132967, -157450, -139192, -74904, -113644, -227277, -175064, -141853, -150295, -132733, -85592, -59370, -130095, -111363, -122622, -74892, 4419, 23195, -24540, -64488, -61154, -60260, -13914, 16769, -100353, -255080, -237342, -220365, -188426, -159871, -169648, -171279, -75482, 64412, 87390, -5278, -38687, -17086, -38081, -34465, -96215, -19016, -124498, -176955, -194175, -103251, 70993, 63405, -28047, -42464, 13091, -33444, -105604, -152187, -143000, -151478, -5749, 79308, 61356, 51689, 36571, 39618, 142003, 88673, 54509, 11606, 51254, 16643, -39556, -57222, -15242, -27237, -93894, -115747, -129109, 10405, -13397, -70990, -18234, -29389, -39171, -8805, -4950, 12165, 64671, 72321, -24659, -103572, -198956, -214161, -145868, -116130, -11872, -12967, -60084]
17689f0084K6491K5018N8098q998o5510m2471k98r0101l1799J8685K9469K292
17677a39208K7612O1885l2098N6263Q2687p1878r2327j4331J7137m7017n0113
17666b01388j3266n9346N7707J16357R6499j3236m2686K2760j1018j35l8185P2064
17654a3873J07537q5943n6378o6197K1770L4382M6133p9081q5111J5512l9725
17643b00974o7734k2662M7570L9465P1482J40741p092K4106m9736M8681k3106
17632G41j04974K0944R042k4112r0062o7696J4172N0516R3332O9347M9853j836
17620A9267r332O3042O3008r6224r2978M8747J14706Q229j35038J2918n8313q8170
17608a50138J8114N9537K3994j30436L7182P2522q1021l859J3336J35451L5430
$$ y = [-60084, -33593, -8575, 49523, 40525, -24985, -67456, -67754, -157855, -189654, -170969, -141500, -139208, -111596, -49711, -81809, -25546, 57141, -14737, -107064, -121395, -104258, -151275, -201388, -214654, -274000, -216293, -99936, -3437, -16673, -59359, -36599, -47617, -47752, -85937, -13873, 93664, 7721, -48657, -114854, -93084, -58702, -12569, -91650, -176761, -161249, -200974, -268708, -291370, -243800, -204335, -132853, 7888, 796, 24902, -24834, 23847, 741, -104233, -83289, -74247, -98359, -188421, -256117, -241945, -191429, -98097, -28750, 21103, 19267, 9935, 72977, 135985, 39761, -53217, -4470, 110236, 118465, -16573, -3655, -61968, -150138, -132024, -72487, -48493, -178929, -141747, -69225, -150246, -154105, -140769, -5318, 30112]
17597C0112K8003J2072k5891j97108j31320P6255M1083J33974J1708k3563L7087
17586g588j0956Q0171l8844k3444M3611j69877m7464l6757Q7610J93496J40278
17575B10236n7434p2875m4418l2036j39520o2034L0636K7981l1877J3080J7043
17564a41218N5973P4461L5122q4543m8902J2520j726N1217P1746J2392l3046m903
17552i07J9022r7908m8385k4902O6672P4074J1360j2248n5231k0039O2587N750
17540b0155M2823j28753o9451O6132J31900M132O8137q0261j71563m136j6376
17529a77571N3293m3655o3827P1256O9401Q5746K2756q7337M5828J23116P3543
17518A72549m2728n2053p4089K2112k760p8960k464P5791N2739M2713J8292o4215
$$ y = [30112, 58115, 70187, 44296, -152812, -284132, -207877, -166794, -32820, -21112, -44675, -7588, -18544, 61627, 22783, -661, 42950, -126927, -174391, -211148, -123538, 69958, 210236, 152802, 79927, 35509, 3473, -136047, -198081, -167445, -139464, -171341, -158261, -141218, -85245, -10784, 24338, -60205, -109107, -96587, -98313, -47096, 24650, 37042, 3996, -907, 18115, -79793, -128178, -153080, -86408, -12334, -974, -13222, -68453, -88492, -25905, -20155, 22668, -106085, -175536, -109404, 22496, 26628, 94765, 14504, -157059, -161195, -177571, -124278, -167933, -231760, -160504, -91103, -5357, 17399, -69938, -24110, 99006, 172549, 129821, 77768, 3679, 25791, 23031, -55929, -58393, 17398, 70137, 112850, 131142, 66927]
17506F6927J6725l7559k933m1537n0259J204L0998J6023n7016k4395M3093O4290
17494B5561l531j01902l051J753P497L421L2803M9856J02769j0933r0372m3460
17482b9589j1474p4889J17160Q8858M8890R996r5628p0491K6073P7954o359L2965
17470A13466j2729j35503j11665k1260J60883o4106r0386q3996J94206O2055r3768
17459h2803L966m2889p441J04719J3414m3715J8305m6488r7168L5861R3208m18
17447e1449K3594q0363L5154M8830J4393P4726J54726J83718K55497Q4311j04704
17436F38433j04976k52004j22428j56057l7245q26j31181L3468o5516q2653J25526
17425a55459J10360n3588j3971O8575P7861P4633o7732o7188k011j6254n942N9483
$$ y = [66927, 83652, 46093, 43160, 1623, -48636, -47432, -16434, -411, -57427, -81822, -38729, 25561, 22030, -79872, -82923, -81170, -73673, -70252, -37449, 12407, 115176, 104243, 13871, -29589, -41063, -115952, 1208, 90066, 138956, 148952, 53324, -17167, 8906, 86860, 80501, 113466, 100737, -34766, -146431, -167691, -6808, -70914, -161300, -245296, -51090, 10965, -82803, -78837, -121726, -129167, -24448, -11034, -54749, -36444, -82932, -180100, -144239, -51031, -51449, -27855, -108218, -73064, -24234, -9841, 64885, 219611, 403329, 658826, 743137, 638433, 533457, 281453, 159025, 2968, -34277, -35103, -166284, -132816, -198332, -280985, -155459, -45099, -98687, -112658, -44083, 33778, 108411, 40679, -26509, -28520, -44774, -50716, 8767]
17413H767q309J44j2794M6659N5616j1295j57078k6118R9824K3428k1987P939
17401D796o3741m3231n969P7008M1531q5503j04841Q7411N8375O3309J1456j7889
17389B2712J8980J6459k7006n3907l041M0518J20356n4397j79603j00559J1609
17378a87879J9641N0605l3798j0913J12713J9750j9826j4781K8434k599l0094
17367f8747L9552n7787Q9239M3243K7815O861n7489o1602k0191Q2246L5414l7019
17355B1535r129K978J29415m8925j23983l2174q2946N1148P9678M987p0521m4949
17343a22886K2995p2792l7536K7206R0695R5790j09034n6110M2972K9667R3790
17332D757J0680r4334m8752L9320K3817J9455O690K9568J2751J53073j8166n4451
$$ y = [8767, 458, 602, -12192, 34467, 90083, 78788, -78290, -104408, -4584, 18844, -3143, 4796, -58945, -102176, -108145, -31137, 10394, -75109, -179950, -92539, -34164, 29145, 40601, 22712, 41692, 58151, 31145, -22762, -25803, 14715, 135071, 80674, -98929, -199488, -187879, -168238, -117633, -151431, -162344, -49631, -29881, -49707, -64488, -36054, -38653, -68747, -29195, -86982, 2257, 45500, 73315, 80176, 22687, -38915, -59106, 23140, 58554, 21535, 12406, 15384, 144799, 95874, -28109, -60283, -143229, -92081, -12403, -7416, -77937, -122886, -99891, -172683, -210219, -183013, -92318, 3472, -105562, -161672, -118700, -89033, 4757, 15437, -78897, -127649, -88329, -64512, -45057, -38367, -8799, 3952, 157025, 138859, 84408]
17320H4408r1620j7255K8193J9789n0996o8953n881J3710K4971M8923p4798j03505
17308a93014O2106R0502J11665J0783j48938o6661k8434N5968K9065j280M8502
17297b9736L8027q5820j6329K0551J64659Q980n8077r3769J1219J5064L8167N0924
17285F3860L5531j5545r951R804m0891p2523m7493q3939Q5526O4574J7440l9021
17273c2628j8822j3977R192J5646K1028L7731J9058R5510j20148n0496r1479k1247
17261a50632O217n6798J4023Q843M4416J575K1963P9972p0503j39084K6017N4370
17249a59621M3926J4333m1753J0238O5352J01343J6106r7552m830L2808J0099
17238i551m0114j16967K3747M1472J60507R1541o2676j14830l276n8711J4641
$$ y = [84408, -7212, -24467, 3726, 23515, -27481, -96434, -102315, -88605, -63634, -14711, -89509, -193014, -130908, -40406, 71259, 82042, -66896, -133557, -161991, -106023, -76958, -78238, -29736, 8291, -77529, -93858, -73307, 91352, 100332, 42255, -51514, -40295, -25231, 12936, 63860, 99391, 83846, 73895, 83699, 42808, -29715, -77208, -161147, -75621, -11047, 6393, -32628, -51450, -65427, -56235, -40589, -19561, 18170, 37228, 132738, 12590, -37906, -129385, -150632, -144415, -201213, -187190, -178347, -133931, -132356, -110393, -30421, -100924, -240008, -213991, -159621, -115695, -101362, -143115, -132877, -67525, 33818, 49924, -47628, -52458, -19650, -9551, -49665, -166632, -142885, -101413, 59094, 150635, 87959, -26871, -30147, -88858, -74217]
17227g4217n4Q9506k0321j29055K4673R2411j2520o1713J6367J753K6135p2738
17215a19773J0595J17715K855J8068n4935N1672Q2562j64586q8362J03938O8630
17204B8379m5268N9407l1048j10819n5468j5868J04098J09940l1250n8895O4439
17193A7647J50894M4920j50603j05148l0820O8820l3607k166J14995M816j07043
17182b7295p3583P3928K0001r9601j5031Q2088k3739m8931P0552q11L330p408
17170d6500r2719J15333Q5726r2355j2175J7786m927j2810j52340k6306Q5701
17159a35586m773O3280R137O6886L4665o625J6261o6358k4307r2171q5957Q5347
17147a40201J71745L6771Q261r4224r1951N647N2956J7269M2535P5831l1040q2690
$$ y = [-74217, -74271, 15235, -5086, -134141, -109468, -17057, -29577, -91290, -74923, -73170, -47035, -119773, -109178, 8537, 11392, 29460, -25475, 26197, 108759, -55827, -144189, -40251, 28379, -16889, 42518, 11470, -99349, -154817, -170685, -66587, 43353, 12103, -46792, 17647, 168541, 213461, 62858, -42290, -73110, -4290, -37897, -40063, 74932, 79748, -27295, -100878, -26950, -6949, -106550, -121581, -39493, -63232, -112163, -41611, -42422, -39092, -46500, -139219, -23886, 61840, -30515, -42690, -24904, -29831, -42641, -194981, -221287, -135586, -140359, -77079, -67942, -1056, 33609, 26984, 43245, -23113, -47420, -139591, -225548, -140201, 31544, 68315, 76576, -17648, -109599, -103952, -50996, -33727, 8808, 84639, 53599, -29091]
17135b9091m189R0670p4974m0685J4811M5442l8412q0042j02944J1076N2569J04556
17123e1213N3348J9333p243n5554q2379K1620L3131J1445R4795n6657k3514p612
17111e0500o5142j0641J61072Q4855p2813o2229r087p1786L8650l1749K1653J04948
17099C7231p0123N5756L4740n8327K5579Q931o6166j3591O2185K9279l0256k7951
17087a2713l4134n4821O7699J0379L0026j6151j3034k8688p9398l1544J42273
17076b0106J20179q784P1317O6135j80805j52125K4144M8038p6103n8641P629
17065a59122J36065Q9607o1203j5974P3690j2431l2233j9589j0400J9165N5715
17054F3290L2222k408r1231L9671j0836m0778j15379q2212J6549Q3275J4861K7897
$$ y = [-29091, -33280, 57390, -17584, -58269, -43458, 1984, -36428, -116470, -219414, -208338, -155769, -51213, 2135, 21468, 14225, -41329, -123708, -102088, -68957, -57512, 37283, -19374, -42888, -50500, -115642, -126283, 34789, 119644, 46831, -15398, -24485, -96271, -57621, -89370, -67717, 37231, -32892, 22864, 57604, -723, 24856, 33787, -32379, -45970, 16215, 45494, 15238, -12713, -46847, -101668, -33969, -23590, 6436, -9715, -22749, -51437, -130835, -162379, -20106, 100073, 91289, 162606, 228741, 47936, -104189, -80045, -32007, -108110, -166751, -159122, -23057, 66550, 5347, -10627, 63063, 50632, 18399, -1190, -11590, 7575, 63290, 95512, 93104, 1873, 41544, 30708, -10070, -125449, -207661, -191112, -107837, -92976, -65079]
17042f5079K4757M8641o683r4462Q612P3894k4125n9703m7011J48060J53035n7139
17030A02797r2316j3508M8404Q925p2994k1446P7644N8224j25000j41870k7500
17019a98640J64774J34062L3632r1663k1764Q3658M1113k4580L1830j00833q9454
17008c7865q6638k1947N1818K2819M5097L6564R097M0076M0791K456p9817l5209
16996a2758P5085M7724r2031k3128j1097n0423j42352j12365j6211J93362K5421
16985a18773n2268O0126J41866Q6300q0297q4557j02250N4367J08698k6020P618
16974e190O7619j8001j34444j40768j819O2153J37358P9616l4726j4046p9765
16963h2013o5234J06781j9149L3067K5620K6943j06179j24007o323J12199N4134
$$ y = [-65079, -40322, 8319, 1636, -92826, -84214, -10320, -34445, -94148, -141159, 6901, 159936, 102797, 10481, -3027, 45377, 54302, -18692, -40138, 37506, 95730, -29270, -171140, -198640, -33866, 100196, 133828, 42165, 20401, 104059, 145172, 120592, 152422, 51589, -37865, -124503, -146450, -94632, -71813, -26716, 9848, 18945, 59021, 99812, 102268, 22451, -12758, 62327, 110051, 18020, -5108, -16205, -66628, -208980, -321345, -337556, -144194, -118773, -171041, -110915, 30951, 117251, 36954, -47603, -149853, -95486, 13212, -12808, -5190, 62429, 44428, -90016, -230784, -232603, -170450, -33092, 46524, 11798, -2248, -82013, -147247, -40466, -59615, -26548, -928, 26015, -80164, -204171, -210494, -98295, -44161]
16952d4161o1885o7783K1195l7849J02030O3113j0188K3873J7602J5109l7590
16941a6534o1554L1925K9566j8270m6916L0177m5075j47320r2780l100P1269L9548
16929b29064N3856O6483m0870j2172R5228R8623N2421k9860l0335P052q5567m4442
16917i8647K2202J1258P993p8671K5850O0166O3098m3900m248M3311m0834K8374
16905d048O1875O4924p5760N0030K3006n7480l2609M9032M9726k3855k2535R9219
16893A81525N2294j10928n0309J0438k4248q5076k2331J27779J21513m0109r467
16882A51081j3038n3757p4172O115J4873j30396k5014N4575P4427r2914O2784
16871b5436M6193j8518O0578j3914k2024q788L4245l4008p8504p9343n3943l5671
$$ y = [-44161, -106046, -173829, -152634, -190483, -88453, -25340, -35528, -11655, 5947, 21056, -16534, -78088, -46163, -16597, -34867, -81783, -51606, -96681, -244001, -336781, -339881, -268612, -229064, -175208, -108725, -149595, -161767, -66539, 32084, 84505, 54645, 24310, 31362, -54205, -98647, -76445, -65187, -57194, -135865, -110015, -49849, 13249, -30651, -34899, 8412, -32422, -4048, 57827, 122751, 46991, 97021, 120027, 62547, 29938, 78970, 128696, 104841, 82306, 181525, 233819, 122891, 72582, 83020, 58772, -26304, -48635, 79144, 200657, 160548, 151081, 138043, 84286, 10114, 16229, 31102, -99294, -124308, -69733, 4694, -88220, -25436, 20757, 2239, 62817, 48903, 26879, 18091, 52336, 18328, -60176, -139519, -193462, -229133]
16859b29133k9865K9645N2038L3714k2335M0146L2737Q4110Q4304L6273j862o7416
16847D2356m2074p8658n1077N4412K7743K0232q8547j3147Q8597M1556m3983j7346
16835e9936L5178J24043j5019j20901l3694J08520J00107k5161o5208j12779k010
16824f6860J39444L9471m4255m5084j5332R81R3259O2913m5812J563L4284p877
16812A46695o3734J31869M5123q4054j02120p5351l7159N9444L8250j08050M2974
16801f113l091o2319n1186J134M1147l4500L9017O5590n8260l0015m9844R5888
16789e2552J09975M2190r2316l1123R652O6581n0411j64500j3370j9138N2173
16778a42839K4836Q449J55563J14649j04917K903q150j04872j13309k8375M4266
$$ y = [-229133, -258998, -229353, -177315, -143601, -165936, -125790, -93053, -8943, 75361, 111634, 109772, 42356, 282, -78376, -129453, -75041, -47298, -27066, -115613, -128760, -40163, 1393, -42590, -59936, -24758, 99285, 84266, -36635, -70329, 38191, 138298, 113137, 47929, -64850, -66860, 72584, 112055, 67800, 22716, 7384, 8365, 101624, 164537, 118725, 120288, 154572, 146695, 82961, 214830, 259953, 175899, 73779, -1572, -38731, 20713, 58963, -49087, -6113, -9204, -71523, -122709, -121575, -80428, -114928, -75911, -10321, -68581, -98596, -148440, -52552, 57423, 99613, 7297, -23826, -14174, 52407, 1996, -162504, -175874, -195012, -142839, -118003, -109554, 46009, 160658, 55741, 58644, 50494, -54378, -167687, -196062, -151796]
16767a51796N991Q8599J13628M7127o257L2405N7896L8912o6608j46926q9565
16756g6594Q39J13503K17557M1004j32097q3429l784m8668k3716L6231k560l9093
16744h07r7524n0065N1726P2002L3923J2125r4558o0434r8157M8398K7254P132
16732a48985J03547N3298o996K1652k4380m1695L5703l3039j5649Q2894r2181
16721f5831r0027O793J07447J06376m3614J02075m3114p6077j10563n1551l8141
16710a96227J09919Q5655M4947k6493Q448N7348K7294q2841l7016P8624o8051
16699A607K9508J35944K86n6595r5858J9410m6507r0199o0654l968J66470R7990
16687I7434l292n468j50217q1860R8115M7841O8983Q9201j21496q4629R2752L5009
$$ y = [-151796, -145805, -57206, 56422, 103549, 97292, 129697, 187593, 226505, 159897, 12971, -76594, -75755, 37748, 255305, 296309, 164212, 80783, 76999, 28331, 4615, 40846, 38286, -807, -98331, -148396, -96670, -24668, 9255, 21380, -73178, -133612, -231769, -183371, -156117, -148985, -45438, 7860, 864, 22516, -1864, -43559, -7856, -40895, -56544, 26350, -65831, -155858, -149065, -41618, 64758, 21144, 123219, 80105, 4028, -106535, -158086, -196227, -86308, -653, 44294, 17801, 26249, 83597, 110891, 28050, -8966, 69658, 1607, 31115, 167059, 167345, 110750, 14892, 34302, -12205, -102404, -163058, -167026, -556, 97434, 94142, 88674, -61543, -143403, -45288, 2553, 71536, 160737, 39241, -45388, 47364, 82373]
16675H2373k2009o0664J6186p313Q5131J0722L392J25197J6789l690j5723j16894
16663A13497q3606k0208p8568r0726M4004L7098M1380N4627m2951L091Q947j9911
16651c3326K1525o9569R9267J35684l6663J1194o2764k0909O7426J5493n1189
16640G6169j26997j05804R1554J04594M1252r0029P8313L1775j22769P992J5440
16629A490J2377q823q3840N266o0669r2014L0655J2386p656J20564l0425j21684
16617b22373l274J01846Q497p8256N5821M3346M7725J7871k7207r6243j07970
16606b60217Q4739J36406N4849p0860j19J191Q824Q5537o525l5467m6771j37377
16594a85790j6280N2103P9175K0127k7862K5885N8595L0618j936n2747k8520l9127
$$ y = [82373, 60364, -300, 15886, 8573, 93704, 104426, 107818, 233015, 249804, 246114, 230391, 113497, 29891, 9683, -68885, -159611, -115607, -78509, -37129, 17498, -25453, -22362, -13415, -33326, -11801, -81370, 17897, 153581, 116918, 128112, 65348, 44439, 111865, 127358, 76169, -50828, -156632, -65078, 39516, 80768, -9261, 69052, 100827, -21942, -13950, 1490, 13867, 5044, -78796, -73530, -134199, -226213, -195558, -183172, -190828, -70264, -100689, -222373, -225647, -123801, -115304, -193560, -137739, -94393, -46668, -28797, -56004, -152247, -260217, -175478, -39072, 15777, -55083, -55202, -54011, -45187, 40350, 33825, -1642, -48413, -185790, -202070, -149967, -70792, -50665, -78527, -52642, 5953, 36571, 34635, -18112, -46632, -85759]
16582h5759M9962N6179J2209N757k4589o5340O4421j5126j18014r524r990K9601
16570a10213J07890O1941L312M3170J7442j5899k5090p0957p9227p4157j0943
16559a52731J0956K7717J6875M1055P9622K892l9404m3139J179N4127r390j626
16547a1867L182r5826k7779P7501N1217M8561r074j00722m0590k2615J7239o448
16535a17221m6905M1583Q7030l6793K2925R7554O0087l5826J2367j25870l2768
16524g3837j00658m0021k0994P0950Q1065M2858O8179O3855r664o1655r9471j2427
16512i1820M3423Q3188j6914M0461O3935m0707l6012o6327O258M8691j566q9752
16500e7142j12476L7624J07500J9870m0920n1839o5520N6192q1576l0514M4150
$$ y = [-85759, -35797, 20382, 32591, 38348, 13759, -51581, 12840, -2286, -120300, -129824, -139814, -110213, -2323, 59618, 62930, 106100, 123542, 107643, 82553, 11596, -67631, -141788, -152731, -141775, -114058, -97183, -56128, 23494, 26386, -13018, -56157, -54978, -851, -10241, -11867, -8685, -104511, -132290, -54789, -3572, 44989, 35915, -64807, -105397, -128012, -110773, -117221, -164126, -122543, -35513, -72306, -49381, 48173, 108260, 72434, 84801, -41069, -73837, -174495, -214516, -235510, -164560, -83495, -40637, 27542, 91397, 81733, 20078, -79393, -91820, -48397, 34791, 17877, 58338, 122273, 81566, 45554, -20773, -14515, 34176, 32610, -57142, -169618, -131994, -24494, -4624, -45544, -97383, -162903, -106711, -188287, -218801, -174651]
16489a74651M1040M3132J5871R5094K52l206l8831j24731P3938K2415j7114l6061
16477a02852J31613J05164K9879n5062j29541r5843Q5315J41195o4705j59808
16467a14645j10985J3318J32144J5701r1183r211R9109Q7948J3724N1278j13737
16456b6539r6459O3114J6136J19972N8194j7882j36847q0188p855Q1156J00822
16445G3624J28797m1000q3106O9801J6181p3058m5799m2834M2233N3501k0709
16434G7631p5559j40156j2730N026l6760q766J21181K8850o8860K2492M5839O7743
16422B5931p3016N197J3346j38901K9403J88811Q125m2046J03125n0788q1295
16411a2108q1439q0779N8770J13344R6294K88k5039j11478j77161L3717Q8140
$$ y = [-174651, -133611, -90479, -74608, 20486, 20738, 17532, -21299, -146030, -72092, -49677, -66791, -102852, 28761, 133925, 163804, 108742, -20799, -116642, -31327, 109868, 45163, -114645, -225630, -212312, -80168, -64467, -155650, -164861, -65752, 22196, 35920, 87198, -26539, -122998, -59884, -43748, 76224, 134418, 116536, -20311, -100499, -108354, -27198, 73624, 202421, 161421, 78315, 148116, 164297, 91239, 45440, 2606, 44839, 98340, 77631, 2072, -138084, -150814, -145788, -182548, -191314, -70133, -41283, -110143, -87651, -41812, 25931, -47085, -41888, -28542, -167443, -138040, 50771, 58896, 16850, 119975, 69187, -12108, -93547, -174326, -115556, -2212, 94082, 94370, 69331, -42147, -219308, -185591, -97451]
16400i7451k4550L9903M1445K2115m4883q6718J06218P1644m1965n6592o5459
16389a36293P6650J79700P349l4456j23460l6892l2J0010o3109k015M7431O4985
16377a0132q818L2587N2442j10328j2047L1847q566J45853K0161p9859J0321o0773
16365B688m7737M2968m5729p3089L4934r463n0056r26k4034M6797Q4781O737l1091
16352f3220P8483k6520J6255o0296n2746K8137j6947L1694P6064m0894l7494L985
16340f3499J7304Q4328M1059K0851K6589P036l9185p3079p5801m2882R2278L4353
16328B9352k5316J51984L9023j94983k4246Q0538K4005N5567l9871j7382k9558
16317D9113p4273q399J070O33K0784L8951o4656Q328l8135j02373l8987L0068
$$ y = [-97451, -122001, -82098, -40653, -18538, -63421, -150139, -43921, 27723, -14242, -70834, -136293, -59643, 120057, 127406, 92950, -30510, -67402, -67434, -57424, -120533, -122548, -75117, -10132, -18950, 13637, 66079, -44249, -56296, -24449, -33015, 112838, 132999, 53140, 63461, 2688, -45049, -2081, -47810, -120899, -85965, -95428, -145484, -146410, -170444, -123647, -38866, -32129, -63220, 15263, -11257, 4998, -55298, -108044, -79907, -96854, -65160, 10904, -29990, -67484, -63499, -46195, 38133, 79192, 100043, 126632, 133668, 94483, 21404, -54397, -97279, -5001, 29352, 4036, 156020, 195043, 60, -24186, 56352, 80357, 135924, 96053, 78671, 49113, -25160, -33559, -32489, -31856, -11072, 27879, -36777, -28449, -66584, -168957, -207944, -177876]
16305a77876J62281O1446o2126K9970Q9571K2915o4632r1278M2070l8755O691
16294a9723j7489r0626o5915L1266N3971J01044P9030J2012j0133j25530o459
16283e8552K9688J9006p5674n3188L0386j09810M5069m0966M636J42444M2340
16272b4621p56j23543n0996m6396Q3580J78288P3278O022k0706P6799j00759k7110
16260B3080p2286j6930M9170Q3429o5086q9889O7741O1382m7857l7870J5874k7830
16248e7072m4726L3080M1462M0460P3715o8591M5690O9567k7311j8786J9881m9409
16236E7960m9404q9186K7972N6754q2490M8385J17509j8223k0933J6814O2379
16225A27537k3943n3681J5918K0067o2387j2241N839J03676q7407r3604J9032
$$ y = [-177876, -15595, 45851, -16275, 13695, 103266, 126181, 61549, -29729, 12341, -26414, -19723, -37212, -127838, -193753, -162487, -108516, -7472, 71558, 83570, 73437, -52093, -58552, -28864, -9858, -85532, -138720, -108334, -218144, -173075, -214041, -209405, -66961, -24621, -25377, -148920, -199916, -246312, -162732, 15556, 88834, 94856, 74150, 150949, 50190, 23080, -49206, -66136, -16966, 66463, 1377, -88512, -20771, 40611, -7246, -45116, -29242, -57072, -101798, -68718, -27256, 13204, 86919, 18328, 64018, 133585, 106274, 87488, 107369, 57960, 8556, -80630, -52658, 4096, -78394, -30009, 87500, 69277, 48344, 65158, 127537, 103594, 49913, 65831, 85898, 23511, 11270, 17109, 120785, 33378, -60226, -41194]
16214d1194n9839j3139N2852P0267K4273J5766l8731O811N7193j0404j07420P8791
16202C5226K3467m1656M3323J67731k2833N879j41678j23865P0765J00264j24898
16191h275J8486l053k6265o787m2185K7437J57394L0690p9562m3050M36m6803
16179b1537j20965j4850J22468O6343N9569p8976p6676j9484L0619R8466P2448
16168A17425l685o3895J9730J06398k3134M3255q9809j27913O3780K5500R557
16157G7209q5905o9690P970q799L2906O1930k2577l0113o4105r5912Q8428R8331
16145a0327o5014n7802K0208J45737Q1781M0175r3628n7321J3718q3156J748q5452
16133a49333n6222j7322R5306M9113j00490K9374K00437o515r0727m8691R6463
$$ y = [-41194, -101033, -114172, -61320, 8947, 33220, 48986, 10255, 17066, 74259, 63855, -43565, 35226, 58693, 17037, 60360, 228091, 205258, 211137, 69459, -54406, 16359, 116623, -8275, 10211, 7158, -19107, -25894, -68079, -40642, 116752, 147442, 67880, 24830, 25266, -21537, -142502, -157352, -34884, 31459, 91028, 12052, -64624, -84108, -53489, 44977, 117425, 113740, 49845, 69575, 175973, 152839, 196094, 106285, -21628, 42152, 67652, 77209, -8696, -78386, -70416, -79215, -46309, 15621, -6956, -37069, -101174, -197086, -108658, -10327, -75341, -133143, -112935, 32802, 114583, 154758, 61130, 3809, 17527, -65629, -63881, -149333, -205555, -222877, -127571, -78458, -178948, -149574, 50863, 44348, -46379, -95070, 1393]
16122A393J0404L3383L5120p1751n1813o4173J02045M0504J18691r389p0637M0268
16110A14045K4805O2094O5452q3225j04135n4020P373L6443L3444j10672j23271
16099a31667O5932o4951r2113J35692J58010R2994J0688L4341n8447k7843n9485
16088F3151O608J10714O1848L9845l4924j95518j32975r7710R231M2240j7161
16077a44651J18600Q6516p5314m5884Q4455L7171q1950q082J1392o8206o2148
16066a48101R3565l2186m3384J51361K05080K5644j36254n3680K4167k2902l9058
16055B4252L0953O8264j5584j07266j68813M4742k27N3978l3241J6850L5888N2896
16043B692M7372O5170k1157j2051Q1066K920p0977p2928m7864K5988k8707j8019
$$ y = [1393, 11797, 45180, 80300, 8549, -43264, -107437, -5392, 35112, 153803, 144414, 73777, 114045, 138850, 200944, 266396, 183171, 79036, 25016, 32389, 68832, 102276, -8396, -131667, -65735, -130686, -222799, -87107, 70903, 163897, 174585, 208926, 150479, 122636, 63151, 69759, 180473, 242321, 282166, 247242, 51724, -81251, -178961, -169730, -127490, -144651, -26051, 60465, -14849, -60733, 23722, 60893, -21057, -29139, -17747, -85953, -148101, -54536, -86722, -130106, 21255, 226335, 251979, 115725, 62045, 86212, 63310, 24252, 55205, 123469, 107885, 619, -168194, -123452, -123679, -69701, -102942, -86092, -50204, 2692, 50064, 115234, 94077, 82026, 163092, 166012, 95035, 22107, -25757, 231, -28476, -46495]
16031d6495m8055P5375Q9657P7561K3328n3865j708p9091J31292m1699p466L323
16019A22157L4626n4602q2333n23k2761J1686O0545k5098p2760M5539j0532J2183
16007A8127l6059n895P6869k84p3038o1179j7670l88r709O893q3236j2281k0182
15994b18032l7541J54838O6990p941j453J6899q5702P0351K12806J6325j62846
15983B4694q2063M9481P06P278J668q39o9347O5128N3224n1268q1130k5239J82138
15970G4431N1137k9297m9583l1541M2161N5518j10864p2803K6250m3573k3409
15959a11573N7346P4894J4743J52328J64829n6115j04837j05604l9670m7701K5698
15948B4338M7124O1329P3424r2854l2665Q4390r267m4785K1356L7140Q201M513
$$ y = [-46495, -94550, -19175, 70482, 148043, 171371, 117506, 115798, 36707, 167999, 126300, 118834, 122157, 156783, 102181, 19848, 19325, -3436, 8250, 68795, 43697, -29063, 16476, 5944, 18127, -17932, -23827, 53042, 52758, -20280, -81459, -99129, -99517, -109226, -102333, -185569, -197850, -218032, -255573, -100735, -33745, -41686, -43139, -26240, -111942, -41591, 171215, 187540, 24694, -57369, -7888, -7182, 96, 1764, 925, -68422, -3294, 49930, -1338, -82468, -107707, 74431, 125568, 96271, 46688, 15147, 57308, 112826, 1962, -70841, -44591, -88164, -111573, -54227, 20667, 35410, 187738, 352567, 296452, 191615, 86011, 46341, -1360, 24338, 71462, 132791, 206215, 113361, 80696, 165086, 155819, 111034, 132390, 169530, 177731, 182244]
15936A82244l4339o9769j08162M0215L540K3828j8678Q9260j0991l8904l0854
15925B7390M997K8146L6998P4296l8012o939j03688n2902L326L2724k7743K6561
15913E154M6020n6565n2337P5216R9671J51471P0688j03635j13669k3382n3113
15902D5519j34945j11425Q5784L5156J11697l2527r6277K1153P8543j3652P5822
15891F4848R6154M4721o3157P521l5771p4604k6274O7342q9863n6689k4246m8252
15879a38270O6607K8930n5447M5683K1485J79223O6321P8621K2894m6941r8452
15868A70654q8444j09597Q4447M1250J6060n9841j5055m6692j31375M4421O5058
15857b9114k0043k417o8415q102O0871J07522N0117r19r649j17065o0869q1871
$$ y = [182244, 147905, 78136, -30026, 10189, 13729, 37557, 18879, 108139, 97148, 58244, 27390, 32387, 60533, 97531, 171827, 133815, 126876, 23188, -29714, -26388, 6336, -21407, 5154, 51174, -5391, -57728, 17488, 117159, 268630, 339318, 235683, 122014, 98632, 45519, -89426, -200851, -115067, -79911, 31786, -741, -97018, -75865, 2678, -10974, 64848, 161002, 205723, 142566, 150087, 114316, 39712, 13438, 80780, -9083, -65772, -90018, -138270, -71663, -42733, -98180, -52497, -31012, 148211, 214532, 293153, 316047, 269106, 170654, 82210, -27387, 57060, 98310, 114370, 54529, 39474, -7218, -138593, -94172, -29114, -49157, -51574, -119989, -128091, -67220, 40302, 90419, 89500, 79851, -37214, -98083, -179954]
15845a79954O3836J48143m7163o8792Q4998k17j00891q8593J49261j0221O5687
15834A6094l7340L322R163k6902P2586J24264P3348Q0080J070p3681n7289j24281
15822F0434n2611P178m3157P342Q3678K7631l4265n7888p6935J3262J03139J3607
15810E1415J3254L0290J00621m8716n8277k7066r4632K1068J18487N3218m9331
15799A10331N6446o717j42709o9263j7445m2257o1717j0626j8188Q8363J45372
15788C1590O4530m4018j18409P233J10466J8551p2517l2334o520j20273r4364
15777b56065J26200J11400m067J4576l7823j3150j6415O5021j35017j31191O4626
15766b11905K16848P8409O0536J9490P6980n373K1770k495r902q9849J1038O0507
$$ y = [-179954, -116118, 32025, -15138, -83930, 1068, 851, -100040, -188633, -39372, -49593, 16094, -21246, -17924, -8761, -35663, 36923, 161187, 234535, 314615, 315685, 242004, 184715, 60434, 7823, 15001, -28156, -20814, 62864, 90495, 56230, -1658, -78593, -65331, 37808, 51415, 64669, 94959, 195580, 146864, 88587, 61521, -33111, -12043, 106444, 159662, 110331, 166777, 160060, 17351, -51912, -69357, -111614, -173331, -183957, -202145, -113782, 31590, 96120, 52102, -66307, -59074, 51392, 69943, -2574, -34908, -41428, -161701, -256065, -129865, -18465, -22532, -7956, -45779, -58929, -75344, -10323, -145340, -276531, -211905, 4943, 83352, 143888, 163378, 240358, 234985, 256755, 254260, 244358, 154509, 165547, 226054]
15754B26054k4251j01437J8578J22846O7776n4328k10679k7132j01629N8183P4805
15743D8786o3232j11253l7817J2181J14518Q1866j3734L3421J23610p4252k8875
15732H5219j8347p6460J9981O7830J00497j4599l5367j2690J0613k1561q833o9283
15720B7000l3425J7186N7374N5170j3895j00066N7524M9632J26646k7821j20448
15709I4877m4706M4714Q6194Q5586l6606k4309k7068j3297l8401p4431m6340K8107
15697C4320J01891M3140o2763l4207M9569L7155L3270R9977k5920j34034p2194
15686G0204p8732O6012N07q046j7176p8945M3873o7674l9706J13828Q598J592
15674A4335l4224N2124P4343J1628L6082O081j40996J06812K18223r3799j8136
$$ y = [226054, 201803, 100366, 118944, 241790, 309566, 255238, 44559, 17427, -84202, -26019, 48786, -14446, -125699, -163516, -151335, -36817, 45049, 31315, 64736, 188346, 114094, 85219, 66872, -9588, 10393, 78223, 178720, 164121, 128754, 116064, 126677, 105116, 96283, 27000, -6425, 10761, 68135, 123305, 109410, 9344, 66868, 116500, 243146, 215325, 94877, 50171, 94885, 181079, 266665, 230059, 205750, 178682, 165385, 126984, 52553, 6213, 34320, 136211, 179351, 116588, 82381, 131950, 169105, 202375, 302352, 276432, 142398, 70204, -8528, 57484, 57991, 49945, 32769, -46176, -2303, -69977, -109683, 4145, 12743, 14335, -19889, 32235, 106578, 118206, 154288, 160369, 19373, 126185, 344408, 250609, 232473]
15663B32473k5338o7305N2543q654K6859r3339l3048j5838J35392k4178r1982
15652H7585j7535m6365P9541M9314K7758k14492j16282L9239J16680L9126K0758
15641F5327k7697q706R751J3725p9649l9013k5293K1132K06250J19471m5201m1481
15629A68616K9708j3293n2417m8386q61o4885l1703j7814L9261l604P8300N2045
15617A34967K3445l1314l2350l5917k6633Q6810J12987j7554l2103j4067K5739
15606A94010K0322J037O705P3760n3175j30665q6567r600L8974N7261n1742K6553
15594H6873L3316p791J0652J4885j9587n7741j06352p3036O2816J73174N4342
15583A71551r0101K4080P8868J2023j16903J1799O4524j0764n0434M189Q2820
$$ y = [232473, 207135, 139830, 192373, 183719, 210578, 117239, 84191, 68353, 203745, 179567, 87585, 70050, 23685, 103226, 152540, 180298, -34194, -150476, -111237, 5443, 44569, 65327, 37630, 28924, 38675, 52400, -27249, -66262, -91555, -70423, 135827, 255298, 210097, 168616, 198324, 185031, 132614, 84228, 83367, 18482, -13221, -31035, 8226, 4622, 82922, 134967, 158412, 127098, 94748, 58831, 32198, 119008, 231995, 214441, 182338, 168271, 194010, 214332, 215369, 222074, 295834, 242659, 111994, 25427, 15827, 54801, 112062, 60320, 86873, 120189, 112398, 123050, 137935, 118348, 60607, -45745, -118781, -55965, 117209, 171551, 81450, 105530, 184398, 196421, 79518, 91317, 155841, 145077, 94643, 98832, 181652]
15572A81652L6394o3392K787O2136m7655m1742Q0979o623j16392n1968K2197N266
15560F3639P1322L5130j06014K0835P6210j7359k1395j9515n9824O150J41318
15549A90497L1938k8245m2729l968j10487L8044N3392O160J09101N6046N00j04046
15537A96203j10848o6368M2723L8537n845n0126j05396p0085m9743J7984O2680
15526a00284J35526L7602K2703N4776K2374M4883l747p766p1610l7777O9708m8151
15514A18237q889J3345J2857L3243L8044J4961l0940N2834R006j02446r3386L6743
15502I3609J6864J6691r2141L6948R210n3676P4419n4380k8406J33030L7666M033
15490A93867K4940l5221L6305R6253J6898p1573j1591j3500p2753m0872k6858
$$ y = [181652, 218046, 154654, 157441, 219577, 171922, 130180, 211159, 204536, 88144, 36176, 58373, 63639, 134961, 170091, 64077, 84912, 161122, 143763, 122368, 102853, 43029, 49179, 190497, 222435, 194190, 151461, 147493, 37006, 75050, 128442, 134602, 243703, 299749, 300249, 196203, 85355, 18987, 61710, 100247, 94402, 44276, -61120, -131205, -180948, -162964, -100284, 35242, 72844, 95547, 150323, 172697, 217580, 213833, 206067, 134457, 96680, 166388, 118237, 109348, 122693, 135550, 168793, 206837, 221798, 190858, 243692, 252698, 150252, 56866, 93609, 110473, 127164, 35023, 71971, 81181, 27505, 101924, 47544, 19138, 152168, 189834, 193867, 218807, 183586, 219891, 316144, 333042, 261469, 249878, 236378, 163625, 122753, 95895]
15479I5895j0374O8251J1105l0899n1188O540R7349P3323p1416m0054J0990R5784
15467B55306N4504j00149q7898P6752l0908j8123K0077L863J4112q6357p1249
15456B9930n97R7530J21161l4429M5712K0048M8669l2161N5685j05537k1964l9148
15444A84899n6919L5257M3979K9600m7516j02053Q3628J63700p1671k05250m9639
15433H015o233p3344J56515P8583M3502l2832p4599r1456J4718L6603k8671O5229
15421I6030J36039P1111l2230m9983K0751N902Q028P4697r3324k4815o2529O1197
15409B10874P7391K7601n0589q6173m7411J5015O9626k2871j4320R8957n2873
15398B25227j13609L0045J18325K4697L6695m5772q8981m5623P8715P011j39943
$$ y = [95895, 85521, 153772, 164877, 133978, 82790, 89330, 186679, 260002, 188586, 148532, 159522, 255306, 309810, 209661, 121763, 198515, 167607, 149484, 169561, 173424, 187536, 101179, 29930, 29333, 126863, 248024, 213595, 259307, 279355, 328024, 295863, 351548, 246011, 224047, 184899, 127980, 163237, 207216, 236816, 189300, 87247, 170875, 334575, 262904, 57654, 8015, 1782, -71562, 84953, 163536, 207038, 174206, 99607, 8151, 22869, 59472, 30801, 96030, 232069, 303180, 270950, 220967, 241718, 247620, 255648, 330345, 237021, 212206, 149677, 210874, 288265, 315866, 265277, 179104, 131693, 146708, 216334, 193463, 179143, 278100, 225227, 111618, 141663, 259988, 284685, 321380, 275608, 186627, 141004, 219719, 226730, 86787]
15387H6787o0875J02284P9782K077M88q5017P585n879K3805K6969R392K8505k8061
15374A87842p728P9997k2515k5231J61842j5402r8761J5881M1409o7520l7684
15363B12130K9891l804j2689k4230j31452O7748P446q296m0340j1823p929j42349
15351f5697k2487J71105J18263J26200n2049k3138K3152m8687J577K0400o6004
15340A82635p1050j1632Q4005l4023r2720L9597J01203L4761O0838J07351l0898
15329C70067k8986L6314K6997o9395n5557J74r564L5972q5204k7126Q7347m6250
15317B34789j43075J9314J74634K1161j17150M1989q392K3262l4447P2445K3979
15306C08509Q4038l2028j09647L7266l9864p6386m5661o5541J25590J00118L8024
$$ y = [86787, 25912, 128196, 207978, 210055, 210543, 125526, 133111, 127232, 151037, 178006, 187398, 215903, 187842, 180114, 260111, 237596, 212365, 374207, 358805, 260044, 275925, 317334, 249814, 212130, 242021, 238217, 225528, 201298, 69846, 137594, 145040, 136744, 96404, 84581, 76652, -65697, -88184, 82921, 201184, 327384, 275335, 252197, 275349, 226662, 228239, 248639, 182635, 111585, 99953, 183958, 149935, 57215, 96812, 198015, 232776, 293614, 400965, 370067, 341081, 377395, 404392, 334997, 279440, 279614, 270050, 306022, 220818, 193692, 281039, 234789, 91714, 111028, 285662, 306823, 189673, 231662, 223270, 246532, 212085, 284530, 308509, 392547, 360519, 250872, 288138, 248274, 171888, 126227, 60686, 186276, 286394, 324418]
15295C24418J94J4278j12999p7287R7809J8866j75197r202P5051n131l1279Q9161
15283B08682J09928L12j39799n0603L0758J13623J55358j4975o8150N5043l4340
15272C65837j20303j7036M9628k5934j1516n1859N4282p818n2796Q9003O2248
15261C33736J1973M842L2725M5340N2462o8987j83660q4605L8516Q4650M3725
15250C10717K5673O6672M6487j28343k3869j09545R679J25795J24479L830j83690
15239B67885q5116N3425n4604l4158P1813N9481j08525l0603O5577K6615J11966
15228C43756J32377m3765p5675k7707M7491J45471L4357r829j4841m5309l0573
15217D55753m6922Q841M9711K5914j5903q8886n6151P3269O5201k3100m8810n8570
$$ y = [324418, 324612, 338890, 225891, 148604, 246413, 265279, 90082, 80880, 155931, 150800, 119521, 208682, 318610, 318922, 179123, 128520, 159278, 272901, 428259, 413284, 345134, 400177, 365837, 245534, 228498, 278126, 252192, 240676, 188817, 243099, 235281, 182485, 271488, 333736, 345709, 350551, 383276, 428616, 481078, 412091, 228431, 143826, 182342, 266992, 310717, 336390, 403062, 449549, 321206, 297337, 187792, 197471, 323266, 447745, 451575, 267885, 182769, 236194, 181590, 147432, 219245, 278726, 170201, 139598, 205175, 231790, 343756, 476133, 432368, 356693, 328986, 376477, 521948, 556305, 546476, 531635, 486326, 455753, 408831, 417672, 467383, 493297, 477394, 388508, 332357, 405626, 470827, 447727, 398917, 340347]
15205C40347j7722L3285L0445l9128J1357N9813J127J234J0243l2662l5931j01584
15193B60824o8275J7085R4819O0434J0804j4960j7030r6087M0327K03318J063
15182D92322r5845J0700L573p2237M0122J12324l2574o9309l8954P860j3549K2628
15170C67061N8500J3957J9901j4727q1463l5743N885m5808N8317K3613k4638k2510
15158C22345K9063R3150Q0692j2312N4394j6283p3347o7551m9884K2034J32898
15147E15199K8164m9268J5528L7593J8854L0308o7631j7165l3567J1391o45K5729
15135E14490Q300k5695L7487l0752o7589K4525M4964J19828Q1387R513l3688j06127
15123E76643l0776L114l5737r906J0267k0225M898j08260K7312J34021n766m8495
$$ y = [340347, 322625, 355910, 386355, 347227, 358584, 418397, 419524, 420758, 431001, 398339, 362408, 260824, 192549, 209634, 304453, 364887, 375691, 360731, 343701, 247614, 287941, 491259, 492322, 396477, 407177, 410750, 338513, 378635, 490959, 458385, 389076, 350122, 357982, 344433, 367061, 425561, 439518, 459419, 444692, 363229, 327486, 333371, 287563, 345880, 369493, 344855, 322345, 351408, 444558, 525250, 512938, 567332, 551049, 477702, 410151, 360267, 382301, 515199, 543363, 494095, 509623, 547216, 566070, 596378, 528747, 511582, 478015, 489406, 488761, 514490, 522790, 497095, 534582, 503830, 436241, 460766, 505730, 625558, 706945, 716458, 682770, 576643, 545867, 548981, 513244, 503338, 513605, 493380, 498278, 390018, 417330, 551351, 545585, 497090]
15111D97090M5738K7724k22623m9222N8159P5690J41304M7442P2729N3287j4733
15100G32585n2690j0102j0189k1410m2938j61367l7065Q0462P5290l2385N8277
15089E78468J02414j6555m5622J650o0258m9276j6136J15710L6616q5543q757
15078E52711O3295K8677P081J15047O422j07394p4081l1431j7406O6366P9895
15067F89182J2359p0107o6173p962J17657J409o316J9244R1503j25401k8518K6383
15055F53260m560O6161N1565j1651O055j21996m3234P024O2072R5790l0853j03877
15043F25756Q1472J19619k3706n3492j23235J8176J9568l7965k4453Q0789M144
15032F86673r382O1570J7561K9162O7462p7598j8609K6080P1314j7096k7258j48340
$$ y = [497090, 542828, 570552, 347929, 298707, 356866, 432556, 573860, 621302, 694031, 747318, 732585, 679895, 669793, 659604, 638194, 595256, 433889, 396824, 477286, 552576, 520191, 578468, 680882, 664327, 618705, 620355, 560097, 510821, 494685, 610395, 647011, 561468, 552711, 616006, 644683, 651764, 766811, 773233, 665839, 591758, 560327, 542921, 609287, 689182, 701541, 631434, 565261, 557299, 674956, 676365, 670049, 689293, 780796, 655395, 626877, 653260, 648700, 714861, 766426, 754775, 760830, 638834, 595600, 602624, 664696, 760486, 729633, 625756, 707228, 826847, 803141, 749649, 626414, 644590, 664158, 626193, 601740, 682529, 686673, 677291, 738861, 756422, 785584, 853046, 775448, 756839, 782919, 854233, 837137, 809879, 661539]
15020F61539M3897J59987j9528M080Q9776N5839n1938o669l4942L451L2168p032
15008I30628j15764r7442L3909R0860O3692o674L8077k6443o0012l6420N961R63
14996H21335J5741N3761P3625k0302m4695m9351Q3859J43344q8608m9322M958
14985I44345J5616J07990n3266n7340k0140J5558O3398p881K3374O2032K4276
14974A117962J3853r986k3608P095m1658N7789M4079N51R4594j7710M3887M7268
14962A334116M3709L842m3367m5926o2717q023p7k7098N8021Q6156L7314p896
14950A368054k0432l3214L7119J39864J33207n4383O716O063K06739M87970M06473
14939B684176J78716j09667j05703k21507k16515j55707p0769p0992j60818j32386
$$ y = [661539, 705436, 865423, 845895, 849975, 939751, 995590, 943652, 936983, 902041, 905492, 937660, 930628, 814864, 717422, 751331, 842191, 905883, 899209, 937286, 910843, 850831, 814411, 820372, 821335, 837076, 890837, 964462, 944160, 899465, 850114, 933973, 1077317, 988709, 939387, 944345, 959961, 1067951, 1014685, 957345, 937205, 952763, 1016161, 1008280, 1031654, 1093686, 1117962, 1131815, 1121829, 1098221, 1105316, 1063658, 1121447, 1165526, 1166077, 1260671, 1242961, 1286848, 1334116, 1377825, 1381667, 1338300, 1292374, 1229657, 1221634, 1221557, 1194459, 1252480, 1338636, 1375950, 1368054, 1347622, 1314408, 1351527, 1491391, 1624598, 1570215, 1576931, 1582994, 1789733, 2277703, 2684176, 2862892, 2753225, 2647522, 2426015, 2209500, 2053793, 1983024, 1912032, 1751214, 1618828]
14929A618828n6006P24P2421O2718m3101l852j9058K4757L9796l8547L8298K528
14917A699506j45796O8588j1706n0788K1549J32781N9281l9273J9770J25026R4058
14906A972996m3596j5874L0326K4131j9498m5734N35p746j6642R450j31309K5710
14894A782749J36077J49844j37377j16985O2447P2620o3052L0650M6079O5993
14884B029045Q9324J02511N558J06842J2005j11700n2188J8238j1758k6074P5066
14873B236869J14036Q5557J0963o6778n1968r375P590M640J39485J14725O725
14862B592469q0774q2603k9981n080J5216M3984P5838Q4417J16292R9821k6715
14851B802884m4466k2902r626K3712J67430J42968j24564l6238O6268M2939N7354
$$ y = [1618828, 1562822, 1563546, 1635967, 1698685, 1655584, 1651732, 1632674, 1657431, 1697227, 1658680, 1696978, 1699506, 1553710, 1622298, 1610592, 1559804, 1581353, 1714134, 1773415, 1734142, 1753912, 1878938, 1972996, 1929400, 1913526, 1943852, 1967983, 1948485, 1902751, 1903286, 1895540, 1878898, 1888348, 1757039, 1782749, 1918826, 2068670, 1931293, 1814308, 1876755, 1949375, 1886323, 1916973, 1963052, 2029045, 2118369, 2220880, 2226438, 2333280, 2345285, 2233585, 2181397, 2199635, 2187877, 2161803, 2236869, 2350905, 2436462, 2447425, 2380647, 2328679, 2319304, 2326894, 2331534, 2471019, 2585744, 2592469, 2511695, 2429092, 2399111, 2394031, 2409247, 2453231, 2529069, 2613486, 2729778, 2829599, 2802884, 2758418, 2735516, 2725890, 2749602, 2917032, 3060000, 2935436, 2899198, 2965466, 3008405, 3065759]
14840C065759Q8041Q8120K4848R1443P0654O6220K7254L3995L3727K9544k2365
14829C597240J24069R1670K5222o3805o5965M1934J03139R3064O3883Q5384J0703
14818D106538L2413P100M7289R0812J62227J07875J05807j7515M3530r439j4075
14807D662562J18734J01152j2263k7751J01660N5346J49925J58886R1443O0487
14797E460181P8254O1507l3954M6299N7261J00144P8318J50398R8184J37957J61919
14786F396468O2655L5559l3981J18169R9747Q8390J33137J82936J86721P2956
14776G342757J22464J79879J23317J42518Q0910J34782J09951J47580J62195J07118
14766H653471R5248J09068K47841K85624K42084K28861L1915J82505M37207K68568
$$ y = [3065759, 3153800, 3241920, 3266768, 3358211, 3428865, 3495085, 3522339, 3556334, 3590061, 3619605, 3597240, 3721309, 3812979, 3838201, 3774396, 3708431, 3750365, 3853504, 3946568, 4010451, 4095835, 4106538, 4138951, 4146051, 4193340, 4284152, 4446379, 4554254, 4660061, 4642546, 4686076, 4676637, 4662562, 4781296, 4882448, 4870185, 4842434, 4944094, 4999440, 5149365, 5308251, 5399694, 5460181, 5538435, 5599942, 5565988, 5612287, 5669548, 5769692, 5848010, 5998408, 6096592, 6234549, 6396468, 6459123, 6494682, 6460701, 6578870, 6678617, 6767007, 6900144, 7083080, 7269801, 7342757, 7465221, 7645100, 7768417, 7910935, 7991845, 8126627, 8236578, 8384158, 8546353, 8653471, 8748719, 8857787, 9105628, 9391252, 9633336, 9862197, 9894112, 10076617, 10513824, 10782392]
14756A0782392Q6185K16278J47922J72961J92992J65139K20975J35631K27960
14747A2348435J86304K22923L79031L92795L68387K37542K01637M40787L57997
14738A5135838K57733K78963L82636L28784L71167M21289M23166M26191M23060
14729A8448827M56654M71731M62786N38680N48053M59732M70955M83893O28117
14720B2969428N77609O07051O30412P02372O71090P25661P72107P18972Q11159
14711B9185861Q22287R14003Q60846Q06956Q09118Q67859R69802J017718R92664
14702C7247114Q57199J051798J068107J009998J074018J189203J204752J054461
14694D5756650J139272J159292J167939J230810J227844J203585J171717J133151
$$ y = [10782392, 10868577, 11084855, 11232777, 11405738, 11598730, 11763869, 11984844, 12120475, 12348435, 12534739, 12757662, 13136693, 13529488, 13897875, 14135417, 14337054, 14777841, 15135838, 15393571, 15672534, 16055170, 16383954, 16755121, 17176410, 17599576, 18025767, 18448827, 18905481, 19377212, 19839998, 20378678, 20926731, 21386463, 21857418, 22341311, 22969428, 23547037, 24154088, 24784500, 25486872, 26157962, 26883623, 27655730, 28374702, 29185861, 30008148, 30922151, 31782997, 32589953, 33399071, 34266930, 35236732, 36254450, 37247114, 38104313, 39156111, 40224218, 41234216, 42308234, 43497437, 44702189, 45756650, 46895922, 48055214, 49223153, 50453963, 51681807, 52885392, 54057109, 55190260]
14686E5190260J153414J080342J162370J146507J075052R72944J021699R42624
14678F3745212Q45615Q05360O86624O13834N48071M19185K20556J79294K50345
14669F8314096K0052j22002j34626j95113k67501l66103n08779n83308o29755
14660F5526961p14645p46460r19642r59985q72914j048563j058456j146811j174944
14651E6884541j084723j150879j199806j159713j127503j200661j263281j175446
14643D7522529j089433j101062j106434j064079j017240r97803j078425j011770
14635C9056283j185148j117194r65215r14396q83159q30795q49285p42189q33850
14626C0735052r33256q40397o99487p22527o43473o73413p07622p12786p19245
$$ y = [55190260, 56343674, 57424016, 58586386, 59732893, 60807945, 61780889, 62802588, 63745212, 64590827, 65396187, 66082811, 66696645, 67244716, 67663901, 67884457, 68063751, 68314096, 68334148, 68212146, 68077520, 67882407, 67614906, 67248803, 66740024, 66156716, 65526961, 64812316, 64065856, 63146214, 62186229, 61313315, 60264752, 59206296, 58059485, 56884541, 55799818, 54648939, 53449133, 52289420, 51161917, 49961256, 48697975, 47522529, 46433096, 45332034, 44225600, 43161521, 42144281, 41146478, 40068053, 39056283, 37871135, 36753941, 35788726, 34874330, 33991171, 33160376, 32311091, 31568902, 30735052, 29801796, 28961399, 28261912, 27539385, 26895912, 26222499, 25514877, 24802091, 24082846]
14617B4082846p10459o04189n27273n87030n77064m62671l76159n12750n36368
14608A9188883m89714l38623m18483l81588l46155m94026l69388m45133m26939
14599A5478834l06014j93457k76280l18210l10564l07327m14899l60015k40156
14590A2751912k66805k58817j23283j44289j76690k77726k17217k97080k03980
14581A0786025l40715k31067j15099j14824j70632k33880j98684j99363k25848
14572H955913k18671q9414j16846j86250k23839l0771j82424k56137j29589o2271
14562G459701k1995j35095n7857j00060q6040j32636j94612j05475l2476j63169
14552F430286j68939r2145o9577l4251r7513r5191j01556l4401n5647j22695j08716
$$ y = [24082846, 23372387, 22768198, 22240925, 21653895, 21076831, 20614160, 20238001, 19725251, 19188883, 18699169, 18360546, 17942063, 17560475, 17214320, 16720294, 16350906, 15905773, 15478834, 15172820, 14979363, 14703083, 14384873, 14074309, 13766982, 13352083, 12992068, 12751912, 12485107, 12226290, 12103007, 11958718, 11782028, 11504302, 11287085, 10990005, 10786025, 10445310, 10214243, 10099144, 9984320, 9813688, 9579808, 9381124, 9181761, 8955913, 8737242, 8647828, 8530982, 8344732, 8120893, 8090122, 7907698, 7651561, 7521972, 7459701, 7437706, 7302611, 7244754, 7144694, 7058654, 6926018, 6731406, 6625931, 6593455, 6430286, 6261347, 6169202, 6099625, 6065374, 5967861, 5872670, 5771114, 5736713, 5681066, 5558371, 5449655]
14541E449655j19873o2877j07369o7121o8526O7945j00369j37957j39812j40134
14531D573562l865r450j10348m5897j25356o6648n0665o2791q900n622o9691o7750
14519C946579k5522M3838J0427j79140J7864j0804j34202j09656j15002j5123
14509C429259Q266P578M5909k5457n9263k03924j76231k5943J64206O0698K3776
14498C248874p3502j13792j25282Q6385N2160n5029n0835m0290l7979L9392j922
14487B928180j04772j24699j14915p9267n4650o26M6426K4600l7756j5126m2871
14476B424524M7865O4455j10154m0243k1516r4854m9191O5162l8422j09869r7902
14465B039855O0664R5654J1006k03743m5622J28852j7471q1513r91j9811r1995
$$ y = [5449655, 5329782, 5266905, 5159536, 5092415, 5023889, 5091834, 4991465, 4853508, 4713696, 4573562, 4569697, 4560247, 4449899, 4404002, 4278646, 4211998, 4161333, 4098542, 4089642, 4084020, 4014329, 3946579, 3921057, 3964895, 3975322, 3796182, 3814046, 3803242, 3669040, 3559384, 3444382, 3429259, 3437525, 3445103, 3491012, 3465555, 3406292, 3202368, 3026137, 3000194, 3164400, 3225098, 3248874, 3175372, 3061580, 2936298, 3022683, 3074843, 3019814, 2968979, 2928689, 2890710, 2930102, 2928180, 2823408, 2698709, 2583794, 2504527, 2449877, 2449251, 2495677, 2520277, 2482521, 2467395, 2424524, 2472389, 2536844, 2426690, 2386447, 2364931, 2270077, 2220886, 2286048, 2247626, 2137757, 2039855, 2100519, 2196173, 2207179, 2003436, 1957814, 2086666, 2069195, 1987682, 1986691, 1966880, 1874885]
14454A874885l9159J08032P4663l5245J3994j8897l8626j57006n5429l1084r7813
14443A598315j2458J69746J37083Q5020j09493j19836n832P6841j3286m3497p4085
14432A688518P8265m8852j52100Q9734R3683j27096n2854p7479q4955J24195J8506
14421A549565k2866o785O005m3668m662l0615N8083J9595m2327n9196P2805J29123
14409A625057r4380r2465j8283O3096M7478O6810J20879J55303K23931L43604
14399B441030K39223J4262j00006j37644k52164l69800j19680k13162j31629j37202
14389A233228j520r0794M4208O0146L9873N307m5447P8172O2740r2215j0825p2887
14377A209986j50235l814M7137m2673j10977M393J17311R2759l1297m2711R871
$$ y = [1874885, 1835726, 1943758, 2018421, 1983176, 1997170, 1978273, 1939647, 1782641, 1727212, 1696128, 1598315, 1585857, 1755603, 1892686, 1977706, 1868213, 1748377, 1742545, 1819386, 1806100, 1762603, 1688518, 1766783, 1717931, 1565831, 1655565, 1749248, 1622152, 1569298, 1491819, 1406864, 1531059, 1549565, 1526699, 1519914, 1525919, 1482251, 1477589, 1446974, 1505057, 1524652, 1482325, 1423129, 1495934, 1625057, 1530677, 1438212, 1419929, 1483025, 1530503, 1597313, 1718192, 1873495, 2097426, 2441030, 2680253, 2694515, 2594509, 2456865, 2204701, 1834901, 1715221, 1502059, 1370430, 1233228, 1231708, 1140914, 1185122, 1245268, 1285141, 1290448, 1245001, 1323173, 1385913, 1293698, 1282873, 1209986, 1059751, 1055937, 1103074, 1060401, 949424, 953817, 1071128, 1163887, 1132590, 1089879, 1099750]
14366A099750r690r2349m5385q5083O422J6827k6614L3995N5209n5958m7143p4427
14354G75554r868N0512O7859o714K8265m3389j9481O7263R5005j1539j150L2835
14342A025152n6872j13162l3564P0866K9127K4201j14897j75466q4932J40823
14332G11276J08737J07170K7091q8196j2379K7948o177l5797N730Q041J6963L8658
14320I09065j8217o1136q5060k5036p1620j8917n683J6712M418K7537O5950M2942
14308G80955k2546o6280o282J3822M7054q26R541N1219j35399o4971K9712L3252
14296F69251k879p6285r4656J3817J59958L069L3314K4950N0205k9782j55074
14285E95888m8389O1379J37877l1981j3668n715Q0335j19171q7918o379Q799O0986
$$ y = [1099750, 1090060, 997711, 952326, 867243, 873665, 890492, 863878, 897873, 953082, 897124, 849981, 775554, 765686, 816198, 884057, 877343, 905608, 862219, 842738, 910001, 1005006, 993467, 992317, 1025152, 968280, 855118, 821554, 892420, 921547, 945748, 830851, 655385, 570453, 711276, 820013, 927183, 954274, 866078, 853699, 881647, 875470, 839673, 845403, 853444, 870407, 909065, 890848, 829712, 744652, 719616, 647996, 629079, 623396, 640108, 644526, 672063, 738013, 780955, 758409, 692129, 685847, 699669, 746723, 745897, 755438, 806657, 671258, 606287, 635999, 669251, 666372, 590087, 495431, 509248, 669206, 672275, 705589, 730539, 780744, 750962, 595888, 547499, 608878, 746755, 714774, 701106, 695391, 775726, 656555, 568637, 562258, 571057, 632043]
14273F32043J5095k9526n2312K8886O5078l9663o6039q5307N5286K4412M3161
14262E91114O5929l5850L9666r60j26483o3193r990j6050o2721P4179J45369k9234
14250E71776j9211q8749J8246O0339l8621m9447p7043o382M9002K2940M8125J27475
14238F18450P179j57958r8521j7844R5951M7687J0489O1012p521p1234o8404J08517
14226E27803O7197L985o1261N258L2690J7251m7050p7044J3465o6520m2728J644
14214C74690p2774o2633Q3530Q1253n9436j4558K0212p7016Q8719J3048K4031
14203C99066l488P457J27655o2415o6496j4691m7463j5248O0790Q7270n6203n3617
14191C62617j668Q3853J8677O7052O9183O7816l264m1178j44415r9022m1556J2966
$$ y = [632043, 647138, 617612, 565300, 594186, 659264, 619601, 553562, 468255, 523541, 547953, 591114, 657043, 621193, 660859, 659899, 533416, 470223, 460233, 444183, 381462, 455641, 601010, 571776, 552565, 463816, 482062, 542401, 503780, 454333, 377290, 370908, 419910, 442850, 490975, 618450, 625629, 467671, 369150, 351306, 447257, 494944, 505433, 566445, 558924, 487690, 419286, 527803, 595000, 598985, 537724, 542982, 575672, 592923, 545873, 468829, 482294, 415774, 373046, 374690, 301916, 239283, 322813, 404066, 344630, 330072, 350284, 273268, 361987, 375035, 399066, 395578, 403035, 530690, 468275, 401779, 387088, 339625, 324377, 385167, 472437, 416234, 362617, 360949, 444802, 463479, 530531, 599714, 667530, 664266, 623088, 478673, 379651, 338095, 351061]
14179C51061o6846k7383Q984k1723K76Q8154K1294r6681j03673K6238R6826O4160
14167C40687o9657k3396N3176o952l6499o6332r7028Q1906Q0806M8636J2006M8773
14155C66126J5335k0959M104k0172P5485K7343o0226Q717r090j16509L3154P3949
14143C77257R1612j37626j28395L5222L3325N8757l6027j7446M1205L4631J4920
14132C67435r5740k009k8686l7972L6244P896P7176N2726O865n9324L1618q3273
14120B72956q705K3655J3687L0172k0521k8149r50n9235o0965l7075l8963L8444
14108A24351K182L6793l5244L389J10912N3886k144j8965J6776r149O5808J18291
14096D66886l4743J0329J4751r489r1195r4532j5491k2731m9838m831J5925p9321
$$ y = [351061, 284215, 256832, 265816, 244093, 244369, 332523, 353817, 257136, 153463, 179701, 276527, 340687, 271030, 247634, 300810, 293858, 257359, 191027, 93999, 175905, 256711, 305347, 317353, 366126, 381461, 360502, 364606, 344434, 419919, 447262, 387036, 395753, 386663, 270154, 303308, 377257, 468869, 331243, 202848, 238070, 271395, 330152, 294125, 276679, 317884, 352515, 367435, 271695, 269686, 241000, 203028, 239272, 247168, 324344, 377070, 383935, 324611, 356229, 272956, 264251, 287906, 301593, 331765, 311244, 283095, 282145, 222910, 161945, 124870, 85907, 124351, 126533, 163326, 128082, 131471, 242383, 296269, 294125, 275160, 291936, 282787, 348595, 466886, 432143, 442472, 457223, 447734, 356539, 262007, 246516, 223785, 173947, 169116, 185041, 105720]
14084A05720O1435j1774p760J24914P0566K3609o8349j9561M7247o5768j20486
14073A39793l8152J00173p374J145J2081N6896n5361j6650M4881m1668j7878L234
14061A81120K5514J0781j0454O4888k2719m4948K4078R773j7746k4927m1200O861
14049A61021J06809J7485m8668p1527M0052K3760M2064J1878L7415k5038j38316
14038A56935o4443L53L0993K7015L9057K6458N8K2420m3809l4287O9116Q6882
14026C16748R8638o8588p6355n4084l933P4114q0501m2086n1434m2002J73321
14015B43838N0296J8699L9975J08124l0963j6100n1397r1098j08941k8218O6639
14004B00854O1943k6213m7114q4012K9248m1006K2979J2835l194O5496L5777l0394
$$ y = [105720, 167155, 155381, 147621, 272535, 343101, 366710, 298361, 278800, 326047, 260279, 139793, 101641, 201814, 194440, 195585, 207666, 264562, 209201, 192551, 237432, 195764, 177886, 181120, 206634, 217415, 206961, 271849, 249130, 204182, 228260, 238033, 220287, 195360, 154160, 161021, 267830, 285315, 236647, 165120, 205172, 228932, 270996, 282874, 320289, 295251, 156935, 92492, 92845, 123838, 150853, 189910, 216368, 216426, 238846, 195037, 160750, 229866, 316748, 415386, 346798, 270443, 216359, 212426, 286540, 206039, 163953, 112519, 70517, 243838, 294134, 312833, 352808, 460932, 429969, 413869, 362472, 271374, 162433, 134215, 200854, 262797, 236584, 189470, 105458, 134706, 93700, 116679, 129514, 126320, 191816, 227593, 197199]
13992A97199k8597o083n719j1988q1597m9586R5248J31680m3691k3018n5599Q6676
13980B04925p6614p1192n1327l309k5176M0755K0521O081J34236k2179K3176m365
13968A75532K9339N2339j4586L960J5941J6123K0402r809j5735p1740M768m4720
13956A61814J2923J9565L3595K7422j940l402K4093l1503o3711j9431o0504L2896
13944A31817k9273K6444P8386Q4145N8246m2874j45749q7034K7272k0364j9162
13933F1854N7640k491M2495k9026L105j8722J05468l3315m5162m4435M7942L4598
13921A79951n0764k4805p080O8785K0550j6906Q7592k3317n9312j37875o3698
13910b6879J6781O2317K9273m8642o5117R2926Q4858k3463m8006P2046L3686l9585
$$ y = [197199, 168602, 162519, 156800, 144812, 63215, 13629, 108877, 240557, 196866, 173848, 118249, 204925, 128311, 57119, 5792, 2483, -22693, 18062, 38583, 44664, 178900, 156721, 179897, 175532, 204871, 257210, 242624, 246584, 262525, 278648, 299050, 289241, 273506, 201766, 206534, 161814, 174737, 194302, 227897, 255319, 253379, 249977, 274070, 242567, 178856, 159425, 98921, 131817, 102544, 128988, 207374, 291519, 349765, 306891, 161142, 74108, 101380, 81016, 61854, 119494, 117003, 159498, 130472, 133577, 114855, 220323, 187008, 141846, 97411, 145353, 179951, 129187, 104382, 97302, 166087, 186637, 169731, 257323, 234006, 174694, 36819, -26879, -10098, 52219, 81492, 32850, -32267, 60659, 145517, 122054, 74048, 146094, 179780, 140195]
13898A40195Q982K0222q2129k9403J1370M7778p79o5258L9866P6484M1804O9887
13886B79019n8152l88J1245o2161k4889p4519n0323K8491Q036j9662p5052O8828
13874C0473R6752m8421Q610M0034o980l7690q4841l0856j0734R2261l0061l8641
13862b0094k644o5881L3462R8076M8306j7614P6771M3722p0930l6463l7556L2706
13850H1861N3504J5390m7522n0455L940M6600o3641r4351P6137L5409l2719k583
13838B1570L3048L0563k2691O1593m6565j07569L6367N2171r370r526N311k114
13826D2788n9380L0778J06857R0598J12779o4936k4561n4595p3680r582j05493
13815h427j4021J4475J77050M0962r7445O7183M5820p7630R5804Q7645j42298
$$ y = [140195, 149177, 169399, 87270, 57867, 69237, 117015, 116236, 50978, 90844, 167328, 209132, 279019, 220867, 220479, 231724, 169563, 144674, 70155, 19832, 48323, 56359, 36697, -38355, 30473, 127225, 78804, 87414, 127448, 120468, 82778, -2063, -32919, -43653, 48608, 18547, -20094, -22738, -88619, -55157, 42919, 91225, 73611, 150382, 194104, 123174, 86711, 49155, 81861, 135365, 150755, 103233, 52778, 56718, 103318, 39677, -54674, 21463, 56872, 24153, 21570, 54618, 85181, 62490, 124083, 77518, -30051, 6316, 58487, 49117, 39591, 44902, 42788, -16592, 14186, 121043, 211641, 324420, 259484, 234923, 180328, 106648, 97066, -8427, -22448, -7973, 169077, 210039, 112594, 179777, 225597, 147967, 243771, 331416, 189118]
13804A89118j40893l8888Q0340J9694p2388j01796p1710M2481R673K3164m9809
13793a11014k2057R4024J39961O5384P2557j04323p0575m7176m4252p7651L1330
13782g3792O2471J7161M5234j0795l3013L3830P7911o9829k7337L5549P1506K836
13770A31732p265j7057p8490j7575K2883R6902J30377K4827j26656j02905l4897
13759B1876P3784P5997j1324R4350J29997q0470k28728r5531Q9819O2872l4221
13748I8421j07969j2186R8672R4713r1546J7509q929j29393m921K8270P5866J4520
13736G3027k7513q3943K2487R4812j5890j13837j7851J29055Q9259L1401L6197
13725B17204O7731n8822l6096Q986j35341J1735L102o7860k8027j6174J03785
$$ y = [189118, 48225, 9337, 89677, 109371, 36983, -64813, -136523, -94042, -84369, -61205, -111014, -133071, -39047, 100914, 166298, 238855, 134532, 63957, 16781, -27471, -105122, -73792, -11321, 5840, 51074, 40279, 7266, 41096, 119007, 49178, 21841, 57390, 128896, 131732, 124467, 107410, 28920, 11345, 34228, 131130, 261507, 286334, 159678, 56773, 21876, 95660, 171657, 160333, 254683, 384680, 304210, 75482, -20049, 69770, 132642, 98421, -9548, -21734, 76938, 171651, 80105, 97614, 88685, -40708, -45629, -17359, 58507, 73027, 45514, -38429, -15942, 78870, 62980, -50857, -68708, 60347, 149606, 181007, 217204, 284935, 226113, 190017, 199003, 63662, 75397, 78499, 10639, -17388, -33562, 70223]
13714G0223Q4578N0967o0876l4468K807j3958Q7624o286r7830j72896p3661J00179
13702f3597Q2398M148j5508k9893J4841K0664J24804j3605p9237m8685N0680K5498
13690G2508m6893N3407L78N4283o2772m4999l374Q2677m7887r978P4259k7635
13678I3974k1463j6586m4430m1410O5301J16332k5298k5312L5431N4138j66782
13667B3895P8900Q5049n7697n9789O7358r383m4789P4489k6092R312l6648p3035
13655C1570O7454k6478n9246N7227Q7727m1987K319o0600n3233P4724O9612j37904
13643A1185j1869j8997L0946m8431L2754J01998O7703J49646L3306p4407k1587
13632B52247R1304r649j09094p4352L833r4219j38585n4925o733J03777Q6873
$$ y = [70223, 154801, 205768, 144892, 110424, 113231, 99273, 186897, 180611, 82781, -90115, -163776, -63597, 18801, 22949, 7441, -22452, -7611, 13053, 137857, 124252, 45015, -3670, 47010, 72508, 25615, 79022, 79400, 133683, 70911, 25912, 22538, 105215, 57328, 47350, 121609, 93974, 72511, 55925, 11495, -29915, 35386, 151718, 126420, 101108, 136539, 190677, 23895, 102795, 187844, 130147, 70358, 137716, 128333, 83544, 158033, 131941, 141253, 104605, 31570, 99024, 72546, 13300, 70527, 158254, 116267, 118586, 57986, 4753, 79477, 149089, 11185, -684, -19681, 11265, -37166, -4412, 97586, 165289, 314935, 348241, 273834, 252247, 343551, 333902, 224808, 150456, 154289, 60070, -78515, -133440, -140173, -36396, 50477]
13621E0477O1714j14253n7876j4272J7522M2953k026k9698j2659n6147N618p25
13609a09372M9551K467l863K5720o227P8909J46512P6662j49586j00087k5419
13598a4733O0300P3440O0914n4478j20357j0463n0354P7159k3561o4179J6052
13587e0260J27960Q3532l9559O9893j3705M0641K4008n6600K1304n3346p8352
13576G5516J3209l3560q7367k5410J5546M1471M6955M9607M4123k7121j71140
13565e8171r9817L1774N3643J06589N3741j25985q9465J4650R5692J11625J1966
13554A06242o1297Q9560L9897L2161j8129Q0011R8324n2171j40476o5603r2446
13543A6073K3465R1329j28946r9136O138n10m934P5779o876q5580k309m2180m8920
$$ y = [50477, 112191, -2062, -59938, -74210, -56688, -13735, -15761, -45459, -58118, -114265, -108647, -109372, -59821, -57354, -61217, -35497, -41724, 37185, 183697, 260359, 110773, 10686, -14733, 45567, 119007, 179921, 125443, 5086, -5377, -55731, 21428, -2133, -66312, -50260, 77700, 161232, 121673, 191566, 177861, 218502, 242510, 185910, 207214, 153868, 75516, 88725, 55165, -32202, -57612, -42066, -595, 46360, 95967, 140090, 112969, -58171, -157988, -126214, -72571, 34018, 87759, -38226, -127691, -113041, -17349, 94276, 106242, 44945, 134505, 174402, 206563, 188434, 268445, 366769, 314598, 174122, 108519, 16073, 39538, 130867, 1921, -97215, -91077, -91587, -96521, -20742, -27618, -113198, -115507, -157687, -206607]
13530b06607k3303P4466l0105J19140o953m2809K0139O7705L5768K8986J4291
13519E0718o520J5475j172p9382q614K4680l8270J03889J598k4668j9272p5499
13507e7037k8930N2190K1988o298j6902m0353m9021o6449K6413j9882J564J19662
13495f3055P6878j9473p4237k2218J7200L0142L4896K7235j9263j9200o0805o1825
13483a53725N5639J06969M7401K0483n2741m2343p3218J9223P5974L4978p7170
13472c8530j02413k0240j5618o112J33686O3495k2543P1937P762q7022l2075O3793
13460A6120Q9016Q65j5551J9206L7411l5638o36j8538j0170p4964O1025M3363
13448A11509q0359l4863L7110n0334n324J23840M5571N2445j4878q3953p328J3160
$$ y = [-206607, -229910, -155444, -185549, -66409, -73362, -116171, -96032, -28327, 7441, 36427, 50718, 44198, 59673, 58501, -20881, -29495, -4815, -43085, 60804, 62402, 37734, 18462, -57037, -85967, -33777, -11789, -18087, -34989, -75342, -124363, -190812, -164399, -184281, -182717, -63055, 13823, -5650, -79887, -102105, -84905, -54763, -19867, 7368, -11895, -31095, -91900, -153725, -98086, 8883, 56284, 76767, 24026, -18317, -91535, -72312, 3662, 38640, -38530, -140943, -161183, -176801, -182913, -49227, 14268, -8275, 63662, 71424, -15598, -47673, 16120, 105136, 106001, 90450, 109656, 147067, 111429, 110793, 92255, 82085, 7121, 68146, 111509, 31150, -3713, 33397, -16937, -22261, 101579, 147150, 199595, 184717, 100764, 93436, 106596]
13436A06596m5931j45857r1853L676P0100J23025J69027P069j53471k6847R6133
13425A11667k5649P0695k083m1726j38505M7862L5938L9288j5945L3558R403M7749
13413A72252n2349m9402l1602k4797M484q0328j0637M9300p7534O057R9517K9807
13401C4768o407R186N5294p5679l9472J7703M2295k4468j11541k2886K5541K8736
13389f6930L5875j743J19634J0051J0463j5735J35139J9079o8697r6170j1854
13378F9112o0249o5131J7531M29l7652Q391K7003J03678P5845P811K2379o1195
13366A07952q6620J1352J9726o4146J27133m4520p8328L7798R632l5304l7725
13355c3050R0464Q4208K501j14100q27O2763k4218K2553N2157K3819p5020o0314
$$ y = [106596, 60665, -85192, -177045, -173369, -103269, 19756, 188783, 195852, 42381, 15534, 111667, 86018, 156713, 154630, 112904, -25601, 22261, 58199, 97487, 81542, 115100, 124503, 172252, 119903, 70501, 38899, 14102, 18586, -61742, -72379, -23079, -100613, -94556, 4961, 34768, 28361, 37547, 92841, 17162, -22310, -4607, 37688, 13220, -98321, -121207, -95666, -66930, -31055, -32798, 86836, 96887, 107350, 91615, 226754, 245833, 177136, 80966, 69112, 8863, -56268, -38737, -38308, -75960, -67569, -40566, 63112, 138957, 146768, 169147, 107952, 21332, 32684, 52410, -11736, 115397, 70877, -7451, 30347, 39979, 4675, -33050, 57414, 141622, 144123, 30023, 29196, 91959, 67741, 90294, 142451, 166270, 91250, 30936]
13343C0936r9989K6611O6194K2208p5064l8336J48704J03254k3353j19133l3698
13332H334n0163Q9691n6073j33646p9907J3487M3762R9541J47198J03724K1229
13321B07177j27528o2789l7083n8172k0165M5928R0893Q9587N750J016J6383j37048
13309A3949o0016J18035l9940M3136K9043R782N0849j1826q7910r1733k0712M20
13297d6923Q3315m0746J21183J6927J7023k7246j28107j8947M439M6395j24917
13286i7604l66J9630R293k6100Q0467P8469o2630p6323J01157J3981j41894j16406
13274b18326N9827J37088O239K2838K7260p0575k4436M9314m0050l6281N6417
13263c0685n2534l7201L3623R4416P702M8517N3369l1656l6592k875P521O8900
$$ y = [30936, -69053, -42442, 23752, 45960, -29104, -67440, 81264, 184518, 161165, 42032, 8334, -41829, 47862, -8211, -141857, -221764, -208277, -164515, -64974, 82224, 185948, 207177, 79649, 16860, -20223, -78395, -98560, -52632, 38261, 127848, 133598, 134614, 150997, 13949, -46067, 71968, 32028, 75164, 104207, 113989, 164838, 153012, 65102, -26631, -47343, -46923, 36392, -4354, 116829, 133756, 150779, 123533, -4574, -23521, -19082, 27313, -97604, -97970, -78340, -69047, -95147, -14680, 63789, 1159, -75164, 25993, 39974, -101920, -218326, -158499, -21411, -15172, 7666, 34926, -35649, -60085, -10771, -50821, -87102, -30685, -83219, -120420, -86797, 7619, 15321, 63838, 117207, 85551, 48959, 46084, 53605, 122505]
13251A22505R594r8743m5373O2144J8145j6903P4638N3225J9338M1614q4795j72490
13239a7101N3088N6707k7629o0786j67645q3495R1863O9152p6784J1876O5383
13228h5371J06262M5579K0151o1347K6899j36333n0487Q6295N4282j2401L9445
13217C2974m7305L7179j059l2592J401K2178m970o3667k8076l7318K1339L8156
13205f1760K6059m8432o2887n5121N5475J00621O001M5245j0422L3352k9588J1107
13193I650j1125R960K4772j0035n61Q075n0967p1677O4994O9793N5246n1930j04938
13180e8743K2622L1708n2147Q386M6623R0317O4197m8323l9325o2981J5339k43
13168A7430N061J23014N539o5955q4588M792p5900P152K4352K5528K531M8270
$$ y = [122505, 132099, 33356, -12017, 50127, 68272, 51369, 126007, 179232, 198570, 240184, 155389, -17101, 35987, 92694, 65065, 4279, -163366, -246861, -154998, -85846, -162630, -150754, -85371, 20891, 66470, 86621, 25274, 52173, -84160, -134647, -48352, 5930, -6471, 32974, -14331, 22848, 21789, -10803, -9402, 12776, 7806, -55861, -83937, -121255, -99916, -61760, -35701, -84133, -147020, -202141, -146666, -46045, -40044, 5201, -5221, 28131, -1457, 9650, -1475, 8485, 33257, 23222, 22661, 30736, -20231, -91908, -26914, 42879, 98125, 46195, -58743, -36121, -4413, -56560, -48174, -1551, 88766, 152963, 104640, 65315, 2334, 17673, 17430, 22491, 145505, 151044, 85089, 501, 5293, -70607, -63455, -39103, -13575, -11044, 37226]
13156C7226M6779j72504j02613Q323j7446J3082M222O3025N7826O8603j5877Q0218
13144G0864n0089p5504j5259Q8267m9449o6977L0485M5912m903M4681n4898n1634
13132h8504M633o5663m4715P4241J74815o1097j4138O6484k4736o1382o4955k12
13120a05229M9886Q6886k5467q1210J18359J53199J2916m1684p0232l6091k6217
13109C5116J03066O5427r8054O1106Q3178m1478j35492K9282M971j0559j49733
$$ y = [37226, 84005, -88499, -191112, -182789, -200235, -187153, -182931, -119906, -62080, 6523, -9354, 70864, 20775, -54729, -69988, 18279, -31170, -98147, -67662, -21750, -26653, 18028, -36870, -88504, -83871, -149534, -194249, -120008, 54807, -6290, -20428, 46056, 21320, -40062, -105017, -105229, -55343, 31543, 6076, -75134, 43225, 196424, 209340, 167656, 97424, 61333, 35116, 138182, 203609, 105555, 166661, 249839, 208361, 72869, 102151, 107122, 96563, -53170]
$$ [...]
##END NTUPLES=NMR SPECTRUM
##END=
