##TITLE=Analysis number 315543
Compound Code mo 07027
Project Code adrs
Chemist Name stores
##JCAMPDX= 6.0         $$ Bruker NMR JCAMP-DX V2.0
##DATA TYPE= NMR SPECTRUM
##DATA CLASS= NTUPLES
##ORIGIN= Bruker BioSpin GmbH
##OWNER= NMR
$$ XWIN-NMR		Version 3.5
$$ Wed Nov 23 10:38:29 2005 GMT Standard Time (UT+0h)  MAYBRIDGE\NMR@NMR_250MHZ
##.OBSERVE FREQUENCY= 250.131544655141
##.OBSERVE NUCLEUS= ^1H
##.ACQUISITION MODE= SIMULTANEOUS (DQD)
##.ACQUISITION SCHEME= undefined
##.AVERAGES= 16
##.DIGITISER RES= 18
##SPECTROMETER/DATA SYSTEM= dpx250
##.PULSE SEQUENCE= zg30
##.SOLVENT NAME= CDCl3
##.SHIFT REFERENCE= (INTERNAL, CDCl3, 0, 16.522)
##AUDIT TRAIL= $$ (NUMBER, WHEN, WHO, WHERE, WHAT)
$$ ##TITLE= Audit trail, XWIN-NMR		Version 3.5
$$ ##JCAMPDX= 5.01
$$ ##ORIGIN= Bruker BioSpin GmbH
$$ ##OWNER= NMR
$$ C:\u/data/dgb/nmr/ADRS/12880/pdata/1/auditp.txt
$$ ##AUDIT TRAIL=  $$ (NUMBER, WHEN, WHO, WHERE, WHAT)
(   1,<2005-11-23 10:37:56.55 +000>,<MAYBRIDGE\NMR>,<NMR_250MHZ>,
      <created by zg, POWCHK disabled, PULCHK disabled
       configuration hash MD5:
       62 19 C7 07 E1 42 D1 B7 37 6C 3D D0 77 39 F9 E6
       data hash MD5: 64K
       A3 43 4E 0F 6B 2A 5C A5 AE C4 9C 03 11 9A C4 E4>)
(   2,<2005-11-23 10:38:11.00 +000>,<MAYBRIDGE\NMR>,<NMR_250MHZ>,
      <Start of raw data processing
       ef LB = 0.3 FT_mod = 6 PKNL = 1 SI = 32K 
       data hash MD5: 32K
       5D 43 79 20 A5 34 03 1E 47 34 E2 DC 21 F9 68 B0>)
(   3,<2005-11-23 10:38:14.49 +000>,<MAYBRIDGE\NMR>,<NMR_250MHZ>,
      <apk 
       data hash MD5: 32K
       F4 3C 93 45 38 52 C0 70 58 2A 78 C6 37 9F D3 6A>)
(   4,<2005-11-23 10:38:15.92 +000>,<MAYBRIDGE\NMR>,<NMR_250MHZ>,
      <abs ABSG = 5 
       data hash MD5: 32K
       DA 81 1A 33 33 0B 8A 8F D8 EC 9A 5A A4 11 FE D6>)
$$ ##END=
$$ 
$$ hash MD5
$$ 8D 7E AE 82 CF 3A 25 59 61 8F AB DA 6D FC 0B B5
##$RELAX= 
##$RELAX= 
##$RELAX= 
##$RELAX= 
##$RELAX= 
##$RELAX= 
##$RELAX= 
$$ Bruker specific parameters
$$ --------------------------
##$DU= <C:\u>
##$EXPNO= 12880
##$NAME= <ADRS>
##$PROCNO= 1
##$TYPE= <nmr>
##$USER= <dgb>
##$AMP= (0..31)
100 100 100 100 100 100 100 100 100 100 100 100 100 100 100 100 100 100 
100 100 100 100 100 100 100 100 100 100 100 100 100 100 
##$AQSEQ= 0
##$AQ_mod= 3
##$AUNM= <au_zg>
##$AUTOPOS= <9 >
##$BF1= 250.13
##$BF2= 250.13
##$BF3= 250.13
##$BF4= 250.13
##$BF5= 500.13
##$BF6= 500.13
##$BF7= 500.13
##$BF8= 500.13
##$BYTORDA= 1
##$CFDGTYP= 0
##$CFRGTYP= 5
##$CHEMSTR= <none>
##$CNST= (0..31)
1 1 145 1 1 1 1 1 1 1 1 1 1 1 1 1 1 1 1 1 1 1 1 1 1 1 1 1 1 1 1 1 
##$CPDPRG= <>
##$CPDPRG1= <>
##$CPDPRG2= <>
##$CPDPRG3= <>
##$CPDPRG4= <mlev>
##$CPDPRG5= <mlev>
##$CPDPRG6= <mlev>
##$CPDPRG7= <mlev>
##$CPDPRG8= <mlev>
##$CPDPRGB= <>
##$CPDPRGT= <>
##$D= (0..31)
0 1 0 0 0 0 0 0 0 0.06 0 0 0 0 0 0 0.0002 0 0 0 0 0 0 0 0 0 0 0 0 0 0 
0 
##$DATE= 1132742275
##$DBL= (0..7)
120 120 120 120 120 120 120 120 
##$DBP= (0..7)
150 150 150 150 150 150 150 150 
##$DBP07= 0
##$DBPNAM0= <>
##$DBPNAM1= <>
##$DBPNAM2= <>
$$ [...]
##$SUBNAM7= <"">
##$SUBNAM8= <"">
##$SUBNAM9= <"">
##$SW= 20.6930455092707
##$SWIBOX= (0..15)
0 0 3 0 0 0 0 0 0 0 0 0 0 0 0 0 
##$SW_h= 5175.983436853
##$TD= 65536
##$TD0= 1
##$TE= 294.16
##$TE2= 300
##$TE3= 300
##$TEG= 300
##$TL= (0..7)
0 120 120 120 120 120 120 120 
##$TP= (0..7)
150 150 150 150 150 150 150 150 
##$TP07= 0
##$TPNAME0= <>
##$TPNAME1= <>
##$TPNAME2= <>
##$TPNAME3= <>
##$TPNAME4= <>
##$TPNAME5= <>
##$TPNAME6= <>
##$TPNAME7= <>
##$TPOAL= (0..7)
0.5 0.5 0.5 0.5 0.5 0.5 0.5 0.5 
##$TPOFFS= (0..7)
0 0 0 0 0 0 0 0 
##$TUNHIN= 0
##$TUNHOUT= 0
##$TUNXOUT= 0
##$USERA1= <user>
##$USERA2= <user>
##$USERA3= <user>
##$USERA4= <user>
##$USERA5= <user>
##$V9= 5
##$VALIST= <valist>
##$VCLIST= <CCCCCCCCCCCCCCC>
##$VD= 0
##$VDLIST= <DDDDDDDDDDDDDDD>
##$VPLIST= <PPPPPPPPPPPPPPP>
##$VTLIST= <TTTTTTTTTTTTTTT>
##$WBST= 1024
##$WBSW= 4
##$XGAIN= (0..3)
0 0 0 0 
##$XL= 0
##$YL= 0
##$YMAX_a= 626075
##$YMIN_a= -533289
##$ZGOPTNS= <>
##$ZL1= 120
##$ZL2= 120
##$ZL3= 120
##$ZL4= 120
##$ABSF1= 16.522
##$ABSF2= -4.171173
##$ABSG= 5
##$ABSL= 3
##$ALPHA= 0
##$AQORDER= 0
##$ASSFAC= 0
##$ASSFACI= 0
##$ASSFACX= 0
##$ASSWID= 0
##$AUNMP= <proc_1d>
##$AZFE= 0.1
##$AZFW= 0.1
##$BCFW= 0
##$BC_mod= 0
##$BYTORDP= 0
##$COROFFS= 0
##$CY= 12.5
##$DATMOD= 1
##$DC= 0
##$DFILT= <>
##$DTYPP= 0
##$F1P= 14.0000005364418
##$F2P= -0.99999901652339
##$FCOR= 0.5
##$FTSIZE= 32768
##$FT_mod= 6
##$GAMMA= 0
##$GB= 0
##$INTBC= 1
##$INTSCL= 1
##$ISEN= 128
##$LB= 0.3
##$LEV0= 0
##$LPBIN= 0
##$MAXI= 10000
##$MC2= 0
##$MEAN= 0
##$ME_mod= 0
##$MI= 0
##$NCOEF= 0
##$NC_proc= -3
##$NLEV= 6
##$NOISF1= 0
##$NOISF2= 0
##$NSP= 0
##$NTH_PI= 0
##$NZP= 0
##$OFFSET= 16.522
##$PC= 1
##$PHC0= 81.23184
##$PHC1= 7.014197
##$PH_mod= 1
##$PKNL= yes
##$PPARMOD= 0
##$PSCAL= 4
##$PSIGN= 0
##$REVERSE= no
##$SF= 250.13
##$SI= 32768
##$SIGF1= 0
##$SIGF2= 0
##$SINO= 400
##$SIOLD= 32768
##$SREGLST= <1H.CDCl3>
##$SSB= 0
##$STSI= 32768
##$STSR= 0
##$SW_p= 5175.98343685301
##$SYMM= 0
##$S_DEV= 0
##$TDeff= 65536
##$TDoff= 0
##$TI= <Analysis number 999999
Compound Code 99
Book Reference 9
Project Code 9>
##$TILT= no
##$TM1= 0
##$TM2= 0
##$TOPLEV= 0
##$USERP1= <user>
##$USERP2= <user>
##$USERP3= <user>
##$USERP4= <user>
##$USERP5= <user>
##$WDW= 1
##$XDIM= 32768
##$YMAX_p= 389079666
##$YMIN_p= -516983
$$ End of Bruker specific parameters
$$ ---------------------------------
##NTUPLES= NMR SPECTRUM
##VAR_NAME=  FREQUENCY,     SPECTRUM/REAL,   SPECTRUM/IMAG
##SYMBOL=    X,             R,               I
##VAR_TYPE=  INDEPENDENT,   DEPENDENT,       DEPENDENT
##VAR_FORM=  AFFN,          ASDF,            ASDF
##VAR_DIM=   32768,         32768,           32768
##UNITS=     HZ,            ARBITRARY UNITS, ARBITRARY UNITS
##FACTOR=    0.157963299565203, 1,           1
##FIRST=     4132.6476996994, 0,             0
##LAST=      -1043.33573715361, 0,           0
##MIN=       -1043.33573715361, -516983,     0
##MAX=       4132.6476996994, 389079666,     0
$$ Real data points
##PAGE= N=1
##DATA TABLE= (X++(R..R)), XYDATA
$$ [...]
15715c4882m942j0398L4924N259l7881k4602J9170K0976J0401q083j9612%L8837
$$ -34882 -39824 -50222 -15298 -10039 -47920 -72522 -53352 -32376 -21975 -30058 -49670 -49670 -10833
15702a0833J4295o526P515j5640r024J7794n798o265l4547J2008K3330K0712N719
$$ -10833 3462 -3064 4451 -11189 -20213 -2419 -8217 -14482 -49029 -37021 -13691 7021 12740
15689A2740p787q207k1682j0524m869l776M608K5738P925J7043J2465j2477j5857
$$ 12740 4953 -3254 -24936 -35460 -40329 -44105 -39497 -13759 -5834 11209 23674 11197 -4660
15676d660k0640j0303L855J2807L2920K2586K4093k0267m1738r420j79j0084l37
$$ -4660 -25300 -35603 -31748 -18941 13979 36565 60658 40391 -1347 -10767 -10946 -21030 -21367
15663b1367R461K0482J1388m591j2249k0628p777J1066M635j4289J5059K5775
$$ -21367 -11906 8576 19964 15373 3124 -17504 -25281 -14215 -9580 -23869 -8810 16965
15651A6965L778k812l221O526L749M329J974m2531k6757J9172J1974k596J1559
$$ 16965 20743 17931 14710 21236 24985 29314 31288 -11243 -38000 -18828 -6854 -9450 2109
15638B109q817J711k7328O241J9682K5734r13J6182J7460L409l0571m2416k2410
$$ 2109 -6708 -4997 -32325 -26084 -6402 19332 18419 34601 52061 55470 24899 -17517 -39927
15625c9927j351J7658K7716J5651k4253k4026N659J6754r504j0965J1304J4354
$$ -39927 -41278 -23620 4096 19747 -4506 -28532 -22873 -6119 -15623 -26588 -15284 -930
15613i30J6825M418m831p277J5463k184j9966k2749j5307K6254J525P434K5037
$$ -930 15895 20313 15482 8205 23668 21484 1518 -21231 -36538 -10284 -8759 -1325 23712
15600B3712R741j2658P311j4406r051k1829M01j2883J8j688j3563q947K5174o801
$$ 23712 33453 20795 28106 13700 4649 -17180 -16779 -29662 -29644 -31332 -44895 -53842 -28668 -35469
15586c5469j1745J4799K0875J2702n340m8759j1254J550M0948k258J1891L4336
$$ -35469 -47214 -32415 -11540 1162 -4178 -52937 -64191 -62641 -21693 -23951 -12060 22276
15574B2276l063k0568k9730J0933R178M835J9597J1124N036k2449k6141k0148
$$ 22276 19213 -1355 -31085 -20152 -10974 -6139 13458 24582 29618 7169 -18972 -39120
15562c9120P06m585N685M043j4352m448K823J738K4270R397j6545J2737J6656
$$ -39120 -38414 -42999 -37314 -33271 -47623 -52071 -49248 -47510 -23240 -13843 -30388 -17651 -995
15549i95j4560J3446m975j8562j1567m337K6813o206o195R410q223j8702j5908
$$ -995 -15555 -2109 -7084 -25646 -37213 -41550 -14737 -20943 -27138 -17728 -25951 -44653 -60561
15536f0561J3723Q194J0136J8904J127J8566K0586q723k3713J4722J7221j5421
$$ -60561 -46838 -38644 -28508 -9604 -8477 10089 30675 21952 -1761 12961 30182 14761
15524A4761k7166J0038r804j7303J3842K0199M279j0754l167K242j2066Q835J127
$$ 14761 -12405 -2367 -12171 -29474 -15632 4567 8846 -1908 -5075 -2833 -14899 -6064 -4937
15511d937J040j0335k0557K4955K2372j2687j0303J6408K1410q174m495j7114
$$ -4937 -3897 -14232 -34789 -9834 12538 -149 -10452 5956 27366 19192 14697 -2417
15499b417j1285N925j0368r129J278N352k67q266K8206J6678k2836J29K3810N797
$$ -2417 -13702 -7777 -18145 -27274 -25996 -20644 -20911 -29177 -971 15707 -7129 -7000 16810 22607
15485B2607j3652J6093K1085n12k5746j4537J130k200J4952l9917P508K6649N810
$$ 22607 8955 25048 46133 45621 19875 5338 6468 4268 19220 -20697 -13189 13460 19270
15472A9270O000k2462K989M275Q156J0611l515M534L460j8622p921k1048j7859
$$ 19270 25270 2808 5797 10072 18228 28839 25324 29858 33318 14696 6775 -14273 -32132
15459c2132K388K5285k9105k8671J8020O582P251J2699l777m962N570M971K2649
$$ -32132 -29744 -4459 -33564 -62235 -44215 -37633 -30382 -17683 -21460 -26422 -20852 -15881 6768
15446F768K394j7457l223n502p286m971L3260K733j4444L092o451K0824j4203
$$ 6768 9162 -8295 -11518 -17020 -24306 -29277 3983 6716 -7728 -4636 -11087 9737 -4466
15433d466l0592J853J7073j1699j065Q081p698O258L6387J0763R93k6001K564
$$ -4466 -35058 -33205 -16132 -27831 -28896 -20815 -28513 -22255 14132 24895 25888 -113 2451
15420B451N207r409j1351o78j8029J250N262J6035N20j8242m827L499q97J0226
$$ 2451 7658 -1751 -13102 -13780 -31809 -30559 -25297 -9262 -8742 -26984 -31811 -28312 -29209 -18983
15406a8983J4160j8098j067K8136R533l4736k0720R469K8497J6335M34J8515k341
$$ -18983 -4823 -22921 -23988 4148 13681 -21055 -41775 -32306 -3809 12526 12960 31475 29134
15393B9134l1827L549p552m840K5399L209m4408m273Q993R069j1737O240J9593
$$ 29134 -2693 856 -6696 -11536 13863 17072 -27336 -31609 -22616 -13547 -25284 -19044 549
15380E49j1021m0633J897L1574o174K105m992M4j818L373n897k6190J7867K6762
$$ 549 -10472 -51105 -49208 -17634 -23808 -21703 -26695 -26651 -28469 -25096 -30993 -57183 -39316 -12554
15366a2554j1085k3307j697O086L6875J6818j8971k0688R04J3424m999m796j7512
$$ -12554 -23639 -46946 -48643 -42557 -5682 11136 -7835 -28523 -27619 -14195 -19194 -23990 -41502
15353d1502j3009K6374K4723q993j4230J3402J4921l112j415Q861j5827j4642
$$ -41502 -54511 -28137 -3414 -12407 -26637 -13235 1686 -1426 -2841 6020 -9807 -24449
15341b4449k5334J3794P146j8228m998R299K951j1689O031K9079J4564L372r654
$$ -24449 -49783 -35989 -28843 -47071 -52069 -42770 -39819 -51508 -45477 -16398 -1834 1538 -8116
15328h116j4738J265R854K2412J6974m627j7507k324j3506Q587Q437J4171K322
$$ -8116 -22854 -21589 -11735 10677 27651 23024 5517 3193 -10313 -1726 6711 20882 23204
15315B3204m327k9018J225J5906P33k4465k5006k373K0237K5834o617k9527j8378
$$ 23204 18877 -10141 -8916 6990 7723 -16742 -41748 -44121 -23884 1950 -4667 -34194 -52572
15302e2572j1277N564L73K4588K7020K1021R566k0740k6397Q818K4138O94l2454
$$ -52572 -63849 -58285 -57912 -33324 -6304 14717 24283 3543 -22854 -14036 10102 10796 -21658
15289b1658j6857p806J5702M5654J7398J380J2332j2133N2j1450j713J9267L052
$$ -21658 -38515 -46321 -30619 15035 32433 33813 46145 34012 34064 22614 20901 40168 43220
15276D3220j8639k1994j7885N923j3895n266J1134m750J3603J2688J8669m013
$$ 43220 24581 2587 -15298 -9375 -23270 -28536 -17402 -22152 -8549 4139 22808 18795
15264A8795j4849r572K0091j0186j9155q992L348K472J8278q627n088j1238j1115
$$ 18795 3946 -5626 14465 4279 -14876 -23868 -20520 -18048 230 -8397 -13485 -24723 -35838
15251c5838R077j3131Q019L6743j280j7745J2251j4657q294m997j2806J2042K78
$$ -35838 -26761 -39892 -31873 4870 3590 -14155 -1904 -16561 -24855 -29852 -42658 -30616 -30338
15238c0338K7816K3579j4299j6105j6525N238l397J2327j1613m740K5671K877
$$ -30338 -2522 21057 6758 -9347 -25872 -20634 -24031 -11704 -23317 -28057 -2386 491
15226D91n401o142J011P715L4419R398l5136j8135N663r915m839l353m150N043
$$ 491 -4910 -11052 -10041 -2326 32093 41491 6355 -11780 -6117 -16032 -20871 -24224 -28374 -23331
15212b3331J6802O740j3523k5725o150P132J485J2736K3866J5459j0274n397N745
$$ -23331 -6529 211 -13312 -39037 -45187 -38055 -36570 -23834 32 15491 5217 -180 5565
15199E565j081l6900j2088J921L049P762K403K2821J6449N851n811j5532j7241
$$ 5565 4484 -32416 -44504 -42583 -39534 -31772 -29369 -6548 9901 15752 9941 -5591 -22832
15186b2832m088M273J5613O549q437J0180k550n903j48r874Q434J9310R144J6757
$$ -22832 -26920 -22647 -7034 -485 -8922 1258 -1292 -7195 -7343 -17217 -8783 10527 19671 36428
15172C6428J2771j5533q473M601m177j7753P267j4977J2324j2017l204n802k0100
$$ 36428 49199 33666 25193 29794 25617 7864 15131 154 12478 461 -2743 -8545 -28645
15159b8645q613m722K7587J0285K08k4396r157J1795K0378J7480j5729K113j9195
$$ -28645 -37258 -41980 -14393 -4108 -3900 -28296 -37453 -25658 -5280 12200 -3529 -1416 -20611
15146b0611J614J8670J6248R96n359J3715J746j2946j8158j3920j7016k337J5602
$$ -20611 -18997 -327 15921 16917 11558 25273 27019 14073 -4085 -18005 -35021 -37358 -21756
15133b1756R1q185J0341J209J3230j772o810j6917N017K6426k986N815r041q505
$$ -21756 -21665 -29850 -19509 -18300 -5070 -6842 -13652 -30569 -25552 874 -2112 3703 -5338 -13843
15119a3843P957j7385l5583k2797L0085K3592K7453Q031n466k3320j37J0754L585
$$ -13843 -5886 -23271 -58854 -81651 -51566 -27974 -521 7510 2044 -21276 -21413 -10659 -7074
15106g074l719k1565O055L0013j995j9334J693J3273p974k3470j2758K0565l747
$$ -7074 -10793 -32358 -26303 3710 1715 -17619 -15926 -2653 -10627 -34097 -46855 -26290 -30037
15093c0037J0190N27J25m388j9584J8187K1835k2601j3034J4104k950J227L0000
$$ -30037 -19847 -19320 -19195 -23583 -43167 -24980 -3145 -25746 -38780 -24676 -27626 -26399 3601
15080C601J3203k2366k882k8459k3744O455J0544L1589L6329j1606q886O936j5985
$$ 3601 16804 -5562 -8444 -36903 -60647 -54192 -43648 -12059 24270 12664 3778 10714 -5271
15067e271j3525L746K4084J9226m159j4575M520L5j1615j2014K621J3064Q614
$$ -5271 -18796 -15050 9034 28260 24101 9526 14046 14081 2466 -9548 -6927 6137 14751
15054A4751n476k1464k5184l078L0108L6239Q203k1653j9941O298p176m352M847
$$ 14751 9275 -12189 -37373 -40451 -10343 25896 34099 12446 -7495 -1197 -8373 -12725 -7878
15041g878M098q307j2007J3686q512j6759k793O875K8779K750j0676J2545j4661
$$ -7878 -3780 -12087 -24094 -10408 -18920 -35679 -38472 -31597 -2818 -68 -10744 1801 -12860
15028a2860m036K646K1108J4168j6996j6590Q246K2076M27R993r162j4135M546
$$ -12860 -16896 -14250 6858 21026 4030 -12560 -4314 17762 18189 28182 19020 4885 9431
15015I431l2481R526N062J1287j8693R735L0725R10k8637J328J1888j2255O134
$$ 9431 -23050 -13524 -8462 2825 -15868 -6133 24592 25502 -3135 -1807 10081 -2174 3960
15002C960m815O572J0755j1146J5150K2804k3034k8646j1303P369Q993M40l0412
$$ 3960 -855 5717 16472 5326 20476 43280 20246 -8400 -19703 -12334 -3341 -2901 -33313
14989c3313L19P345J0465k427j6816k3398l787K5608K5533N649J0870l741Q29
$$ -33313 -32994 -25649 -15184 -17611 -34427 -57825 -61612 -36004 -10471 -4822 6048 2307 3136
14976C136j4278j6331P740K0727P418k1885n433j5662J3520R110j8887M276K689
$$ 3136 -11142 -27473 -19733 994 8412 -13473 -18906 -34568 -21048 -11938 -30825 -26549 -23860
14963b3860Q915M855M053K1762J2381j1213j9965j190M070j3654J0013Q123n515
$$ -23860 -14945 -10090 -6037 15725 28106 16893 -3072 -4262 -192 -13846 -3833 4290 -1225
14950a225k6818j961K0119L88j6105L208l459R148K6023L597j5686l0680j0685
$$ -1225 -28043 -30004 -9885 -9497 -25602 -22394 -25853 -16705 9318 12915 -2771 -33451 -44136
14937d4136m11M5408M1112J6709k8351k3408q011k374J0940m745j9296J9536L0123
$$ -44136 -44547 861 41973 58682 30331 6923 -1088 -3462 7478 2733 -16563 2973 33096
14924C3096j8178k1214J6680K8549j8694j2795L829R078j3536l944P507n552r507
$$ 33096 14918 -6296 10384 38933 20239 7444 11273 20351 6815 2871 10378 4826 -4681
14911d681l837K2176K1553q702j1804j7166k187j4746n270L0543K3889R085k791
$$ -4681 -8518 13658 35211 26509 14705 -2461 -4648 -19394 -24664 5879 29768 38853 36062
14898C6062k867K123o946r062q223l0806M848J6466L530o684j3089j664o969J2422
$$ 36062 33195 35318 28372 19310 11087 -19719 -14871 1595 5125 -1559 -14648 -16312 -23281 -10859
14884a0859K4946L945o111l274k5210q855q071j9801R453L3107J7678n133j1693
$$ -10859 14087 18032 11921 8647 -16563 -25418 -33489 -53290 -43837 -10730 6948 1815 -9878
14871i878o340K0968J0689J6367P532k0050j1015J4750K1432j0243k0754p395
$$ -9878 -16218 4750 15439 31806 39338 19288 8273 23023 44455 34212 13458 6063
14859F063j0706m677k168j2379J6159J6508k693k1361l23J6837Q557j4084j3316
$$ 6063 -4643 -9320 -11488 -23867 -7708 8800 6107 -15254 -15577 1260 9817 -4267 -17583
14846a7583J011j2654m487K352j277O192k688K84q789k087P437J1456K1090n373
$$ -17583 -16572 -29226 -33713 -31361 -32638 -26446 -29134 -28850 -37639 -39726 -32289 -20833 257 -5116
14832e116M251J572j0259J0061q824j1804K4374K6205J2002K694j0099M893j4019
$$ -5116 -865 707 -9552 509 -8315 -20119 4255 30460 42462 45156 35057 39950 25931
14819B5931j3255j7937j4663J5252O122j2221n322j3413J9084M576k4936p711
$$ 25931 12676 -5261 -19924 -4672 1450 -10771 -16093 -29506 -10422 -5846 -30782 -38493
14807c8493l209K083J418J962Q363J3422M517M315j1254M642K625P397j6441l1239
$$ -38493 -41702 -39619 -38201 -36239 -27876 -14454 -9937 -5622 -16876 -12234 -9609 -2212 -18653 -49892
14793d9892J7537J6105j0117J3690j884J5114l540J1735l685j5737j3647o020
$$ -49892 -32355 -16250 -26367 -12677 -14561 553 -2987 8748 5063 -10674 -24321 -30341
14781c0341r295J9403q781J6956J1934J5384J6814J57j7958k1383O470J2032M865
$$ -30341 -39636 -20233 -29014 -12058 -124 15260 32074 32231 14273 -7110 -640 11392 16257
14768A6257J31o499n837j9657l686J5685K1326J5029k3096l957L311O60k0123
$$ 16257 16388 9889 4052 -15605 -19291 -3606 17720 32749 9653 5696 9007 9667 -10456
14755a0456l5802l847K5616J4056K1714R122L756m660J0982j189n800m036k3670
$$ -10456 -46258 -50105 -24489 -10433 11281 20403 24159 19499 30481 29292 23492 19456 -4214
14742d214P421J3559J3526j8245p72p09P009M620k5928k0097m102R993P770K9821
$$ -4214 3207 16766 30292 12047 11275 10566 17575 22195 -3733 -23830 -27932 -17939 -10169 19652
14728A9652o456q559j4762j7385L906J1469M143l517J4000j1004m898j123J4655
$$ 19652 13196 4637 -10125 -27510 -23604 -12135 -7992 -11509 2491 -8513 -13411 -14534 121
14715A21J3006k3776J3157R584n994L824l847O67j0059M111J1734K0499K1259
$$ 121 13127 -10649 2508 12092 6098 9922 6075 6742 -3317 794 12528 33027 54286
14702E4286j1710l5186j5835J7653L360n516j292J0751l145J5687O546j6601l8454
$$ 54286 42576 7390 -8445 9208 12568 7052 5760 16511 13366 29053 35599 18998 -19456
14689a9456j2614O209J8386K3597J3162r816l4282j4600n408N399J7547J8351
$$ -19456 -32070 -25861 -7475 16122 29284 19468 -14814 -29414 -34822 -29423 -11876 6475
14677F475o921L887J2959Q11m380k2359P57J91k481L6988O674j8037j0915Q429
$$ 6475 -446 3441 16400 17211 12831 -9528 -8771 -8580 -11061 25927 32601 14564 3649 12078
14663A2078Q98l473k5714j0926R449J2598j865j3112k4409J6912J179k2613K4271
$$ 12078 12976 9503 -16211 -27137 -17688 -5090 -6955 -20067 -44476 -27564 -26385 -48998 -24727
14650b4727K3598m76K1802k1859o327K7822j849J3802J1818k5564k9516p202K9435
$$ -24727 -1129 -1605 20197 -1662 -7989 19833 17984 31786 43604 18040 -11476 -18678 10757
14637A0757l304j0959j0199K6101J2037Q105j9871k7284m231K7431l958J3302
$$ 10757 7453 -3506 -13705 12396 24433 32538 12667 -14617 -18848 8583 4625 17927
14625A7927j2462k2326J312R159r538P840N174m250j5817J2969J8151O649p137
$$ 17927 5465 -16861 -15549 -6390 -15928 -8088 -2914 -7164 -22981 -10012 8139 14788 7651
14612G651k8308K283J1037Q630J400J391q597J4933J1908j1547m051Q065J2325
$$ 7651 -20657 -18374 -7337 1293 2693 4084 -4513 10420 22328 10781 6730 14795 27120
14599B7120J0729J56n630l5474j1931q213R563r230k71J262J4407r523q783J7485
$$ 27120 37849 38005 32375 -3099 -15030 -23243 -13680 -22910 -23181 -21919 -7512 -17035 -25818 -8333
14585h333R873J9932l986J6697P811o712J151r216J1656k494k4279k7167p018
$$ -8333 1540 21472 17486 34183 41994 35282 36433 27217 38873 36379 12100 -15067 -22085
14572b2085J2064K0715M402j7005J272Q918K1839n457N494k19j0716m053o662
$$ -22085 -10021 10694 15096 -1909 -637 8281 30120 24663 30157 29938 19222 15169 8507
14559H507q785K344J1111N658r045J741j937q959q641J4439J163J7126J3444J6032
$$ 8507 -278 2066 13177 18835 9790 11531 9594 635 -8006 6433 7596 24722 38166 54198
14545E4198O056j9751P083N82J614j0287k2872p598k033K125m942o166j2596j6523
$$ 54198 60254 40503 47586 48168 49782 39495 16623 9025 6992 9117 4175 -1991 -14587 -31110
14531c1110P570K4716R035M245m0882j0186J1573J3662J3515J029J3663j9233
$$ -31110 -23540 1176 10211 14456 -26426 -36612 -25039 -11377 2138 3167 16830 -2403
14519b403j6044R680K0388K5845j2406J726M03K797K313j6988q639K981m235j6014
$$ -2403 -18447 -8767 11621 37466 25060 26786 27189 29986 32299 15311 6672 9653 5418 -10596
14505a0596q153J0940l477j6180K330L2479J1687J500j568Q76o545j6595L478
$$ -10596 -18749 -7809 -11286 -27466 -25136 7343 19030 20530 18962 19838 13293 -3302 176
14492A76k758j1843J9745J2309O445j9061k7910k1047K866K142J3860K0065P309
$$ 176 -2582 -14425 5320 17629 24074 5013 -22897 -43944 -41078 -38936 -25076 -5011 2298
14479B298P795o453j9542K6369M1117k5746j8540J1018J4544j8184J166N141j7799
$$ 2298 10093 3640 -15902 10467 51584 25838 7298 18316 32860 14676 15842 20983 3184
14466C184j4661k956q998J3446J675j3492k836L5868L4542J4300k1485l7138j6007
$$ 3184 -11477 -14433 -23431 -9985 -8310 -21802 -24638 11230 45772 60072 38587 1449 -14558
14453a4558o396N862J2748J9097K4153j240n268p726m511k2919k4995K5172L0212
$$ -14558 -20954 -15092 -2344 16753 40906 39666 34398 26672 22161 -758 -25753 -581 29631
14440B9631K9086J442k4346l915j8938j4139K0757Q828k5388j3712L3146K8909
$$ 29631 58717 60159 35813 31898 12960 -1179 19578 28406 3018 -10694 22452 51361
14428E1361k638L106m187n3440k4356J6505M890J1435R752J4678m680r710P921
$$ 51361 48723 51829 47642 -5798 -30154 -13649 -8759 2676 12428 27106 22426 12716 20637
14415B0637J2178j8833k8914J3803N879L891j1297m346J0259J2636J5471J2309
$$ 20637 32815 13982 -14932 -1129 4750 8641 -2656 -7002 3257 15893 31364 43673
14403D3673m379J4982r193l9926k7494J6994K3248J4044l554m717j0668j3353
$$ 43673 39294 54276 45083 5157 -22337 -5343 17905 31949 28395 23678 13010 -343
14391c43n309J1131J1534j2560k0001n318L0530J0028J0677J534j5173k9282k637
$$ -343 -5652 5479 17013 4453 -15548 -20866 9664 19692 30369 31903 16730 -12552 -15189
14378a5189J7204J0814m032j99j9480J1365L0523O159j8329m205m131m854J151
$$ -15189 2015 12829 8797 8598 -10882 483 31006 37165 18836 14631 10500 5646 6797
14365F797K138L630N211J0830J4030l787j3326l554L478N188O111N783k486M791
$$ 6797 8935 12565 17776 28606 42636 38849 25523 21969 25447 30635 36746 42529 40043 44834
14351D4834p486K5005J9176l517l0833l7397O910K0021J0811j8992k7837R84L1213
$$ 44834 37348 62353 81529 78012 47179 9782 16692 36713 47524 28532 695 1679 32892
14338C2892K1148r162j8266j2903L2937n61J2948R746l9273l947j2668k131J2445
$$ 32892 54040 44878 26612 13709 46646 46085 59033 68779 29506 25559 12891 10760 23205
14325B3205j6708j6889n06K9904K8208J8179J497k5433p436m189R972J5300j7016
$$ 23205 6497 -10392 -10898 19006 47214 65393 66890 41457 34021 29832 39804 55104 38088
14312C8088j2384J2275M203R883q196m0270j9240n34J882K2660J5805K0530J3527
$$ 38088 25704 37979 42182 52065 43869 3599 -15641 -16175 -14293 8367 24172 44702 58229
14299E8229k0843k120p694j1802q550j5316P173m869j4174n265L6217L8466K1605
$$ 58229 37386 35266 27572 15770 7220 -8096 -923 -5792 -19966 -25231 10986 49452 71057
14286G1057K038j5173j0596j9069m317q217j7907J233M004k040K4088n884J496
$$ 71057 73095 57922 47326 28257 23940 15723 -2184 -951 3053 1013 25101 19217 20713
14273B0713Q171L4742J1262j1560j6759l8743j0681O403n263J6921P035O170k5417
$$ 20713 28884 63626 74888 63328 46569 7826 -2855 3548 -1715 15206 22241 28411 2994
14260B994O219K6570q245J3648J4045o691k5454j0174K1327N039K31K2257L064
$$ 2994 9213 35783 27538 41186 55231 48540 23086 12912 34239 39278 39509 61766 64830
14247F4830M500k5646L971M261j4894j5351o479l757j1333J1140K4849p884n513
$$ 64830 69330 43684 47655 51916 37022 21671 15192 11435 102 11242 36091 28207 22694
14234B2694Q450K957N077k4691o256j3887o740K1577J6024n18L3669J9345k2752
$$ 22694 31144 34101 39178 14487 8231 -5656 -12396 9181 25205 24687 58356 77701 54949
14221E4949l2878j1661k518N472K2772K8507M15n214j5554j2447O356J3333j0047
$$ 54949 22071 10410 7892 13364 36136 64643 65058 59844 44290 31843 38199 51532 41485
14208D1485j2708O309J1676k384l406J104j2242J178J5247Q108L278P13L169J103
$$ 41485 28777 35086 46762 44378 40972 42076 29834 31012 46259 54367 57645 58358 61527 62630
14194F2630J1184j7513j983J6289L3368N5385J8516K9831L3946N9362Q2661J13841
$$ 62630 73814 56301 54318 70607 103975 159360 177876 207707 241653 301015 383676 497517
14182D97517J82322K69258L54230K64604J064j68692j86970k23318k12853j70976
$$ 497517 679839 949097 1303327 1567931 1568995 1400303 1213333 990015 777162 606186
14172F06186j56365j47972p7005l1110l0073j1462l4203p157J6230J3020O159
$$ 606186 449821 301849 224844 193734 163661 152199 117996 110839 127069 140089 146248
14161A46248j6765l2702j4670p583q374O696P415k8968j1659J5093N850p06m761
$$ 146248 129483 96781 82111 74528 66154 72850 80265 51297 39638 54731 60581 59875 55114
14148E5114L203J1243m526l3855j3165k545O051j4751J4190K1107J0500J3300
$$ 55114 58317 69560 65034 31179 18014 15469 21520 6769 20959 42066 52566 65866
14136F5866K771j9480j4218n78P123Q300k3769j6913Q99n3K2264j287p019o439
$$ 65866 68637 49157 34939 34361 41484 49784 26015 9102 10001 9948 32212 30925 23906 17467
14122A7467Q617o59r914J2881J9326O712p710j8468j0839j3417K4873o156j3752
$$ 17467 26084 25425 15511 28392 47718 54430 46720 28252 17413 3996 28869 22713 8961
14109H961k0392j420J9322J3526n612j5667J6110L3469K9707j4460k4650j4421
$$ 8961 -11431 -12851 6471 19997 14385 -1282 14828 48297 78004 63544 38894 24473
14097B4473j6728K618j0300J3911O462J6736J4716m156j1942J0364j777j0786
$$ 24473 7745 10363 63 13974 20436 37172 51888 47732 35790 46154 44377 33591
14085C3591J4986J4083j9094O856j8332l0551m931J0418P216K7210P031M796O43
$$ 33591 48577 62660 43566 50422 32090 1539 -3392 7026 14242 41452 48483 53279 53922
14072E3922j8968r083l5084k900K4031J7993J6979j9041p770l329J5388j395R337
$$ 53922 34954 25871 -9213 -12113 11918 29911 46890 27849 20079 16750 32138 30743 40080
14059D0080Q591j3049J8670L334n648p951m525q276n750j4844M028p148J7266
$$ 40080 48671 35622 54292 57626 51978 44027 39502 31226 25476 10632 14660 7512 24778
14046B4778O752m616j7485k3388K0405m199j9917N670j970J127L471P274Q444
$$ 24778 31530 26914 9429 -13959 6446 2247 -17670 -12000 -13970 -12843 -9372 -2098 6346
14033F346r181j9466K739l253p507l9970j7813k9202l6299J3365O4800P0943Q7691
$$ 6346 -2835 -22301 -19562 -22815 -30322 -70292 -88105 -117307 -153606 -140241 -75441 -4498 83193
14020H3193L8239l213J166J2614j1358k1537l834k6016j5926n548O46K5905n686
$$ 83193 121432 118219 119385 131999 120641 99104 95270 69254 53328 47780 48426 74331 68645
14007F8645n281J8756J3155l220k2639j8703R270O644J8131L73m163J147j047
$$ 68645 63364 82120 95275 92055 69416 50713 59983 66627 84758 85131 80968 82115 81068
13994H1068J1790j0162R620K1341J6611j2258j8240j9974j0290K149J3502M943
$$ 81068 92858 82696 92316 113657 130268 118010 99770 79796 69506 71655 85157 90100
13982I0100M27J4425j862J1208Q574j0049q721Q989j8063p900L6530L7694K5696
$$ 90100 90527 104952 103090 114298 122872 112823 104102 113091 95028 87128 123658 161352 187048
13969A87048M6925R078p212L6245R172l0028l1405k7191l9117j2701k4653l6829
$$ 187048 233973 243051 235839 272084 281256 251228 219823 192632 153515 140814 116161 79332
13957G9332k1677j2922j114L063p780Q888K8691O343j1638r04M851K1478k667
$$ 79332 57655 44733 43619 46682 38902 47790 76481 82824 71186 70282 75133 96611 93944
13944I3944j3316j4318L8349K3483K9978m4594j8244J451m020j8747j245p285
$$ 93944 80628 66310 104659 128142 158120 113526 95282 96733 92713 73966 72721 65436
13932F5436j8m065n344k2823M746o289M359K9877l684q046n787K6174L3794J7238
$$ 65436 65418 61353 56009 33186 37932 31643 36002 65879 62195 54149 48362 74536 108330 125568
13918A25568K070j7495m020P351N571l441n010l639P268J1237J1042k8486r031
$$ 125568 127638 110143 106123 113474 119045 115604 110594 106955 114223 125460 136502 108016 98985
13905I8985k2359l0398O698q549n884j1696k2444j6429J8673J0047j174p336p263
$$ 98985 76626 46228 52926 44377 38493 26797 4353 -12076 6597 16644 15470 8134 871
13892H71R205m623J3199K811m816l3461J044J0480J4060M202n118j5141j0613
$$ 871 10076 5453 18652 21463 16647 -16814 -15770 -5290 8770 12972 7854 -7287 -17900
13879a7900k0347l687j0579l6589k0462k4433M880k6407k4235K3859J19828K34177
$$ -17900 -38247 -41934 -52513 -89102 -109564 -133997 -129117 -155524 -179759 -155900 -36072 198105
13867A98105J97968J02608O4262P7943K7323l049j3191k4563m8438l0172k4643
$$ 198105 396073 498681 562943 640886 668209 665160 651969 627406 578968 548796 524153
13856E24153k7407k621j3294j6734j6201q506k2717j802P704j8217j6349j9216
$$ 524153 496746 494125 480831 464097 447896 439390 416673 414871 422575 404358 388009 368793
13844C68793j776k0910r2522j50128k07592n6177J74432J63267N682k7109N9384
$$ 368793 367017 346107 253585 103457 -104135 -160312 14120 177387 183069 155960 215344
13833B15344P4151M1327J436O230j9173k8348k1817o762J8382L3244J4478J925
$$ 215344 289495 330822 332258 338488 319315 290967 269150 262388 280770 314014 328492 330417
13821C30417J806j5056J3517J8626j0776k5079n475M206K6950J2000K1061j1476
$$ 330417 332223 317167 330684 349310 338534 313455 307980 312186 339136 351136 372197 360721
13809C60721k6062m4070k5126M1522N4794J199j4507J3116l1842k8081K9769J8999
$$ 360721 334659 290589 265463 306985 361779 362978 348471 361587 329745 301664 331433 350432
13797C50432L2866J1848n24J3198j0250J4440J0758n148L7702j0154j6665J6588
$$ 350432 383298 395146 394622 407820 397570 412010 422768 417620 455322 445168 428503 445091
13785D45091P171n905J1786K8519K6485K1614O7723N0078K4736m204j1753J4572
$$ 445091 452262 446357 458143 486662 513147 534761 602484 652562 677298 673094 661341 675913
13773F75913L743L6810N8707K7312J4793J1872J5179n694L3795N4199M5348M7624
$$ 675913 679656 716466 775173 802485 817278 829150 844329 838635 872430 926629 971977 1019601
13761A019601L6604Q502J8070L4117M2202M8050N4414P7402N8467L5603M3728
$$ 1019601 1056205 1064707 1082777 1116894 1159096 1207146 1261560 1338962 1397429 1433032 1476760
13750A476760N1171K9103N874J4302N6356O1997Q2736J25899J92836K07291K02020
$$ 1476760 1527931 1557034 1562908 1577210 1633566 1695563 1778299 1904198 2097034 2304325 2506345
13739B506345K00542K55394K87303L09886L37172L54892M42247N26643O45148
$$ 2506345 2706887 2962281 3249584 3559470 3896642 4251534 4693781 5220424 5865572
13730E865572P86384R59672J221578J495825J820015K299949K884504L281621
$$ 5865572 6651956 7611628 8833206 10329031 12149046 14448995 17333499 20615120
13722B0615120L629462M312480N480077P392173J0770188J7108106K8768715M8692507
$$ 20615120 24244582 28557062 34037139 41429312 52199500 69307606 98076321 146768828
13714A46768828P2407303P3735688K8665799k7843856m5539038m1538941m2194718
$$ 146768828 219176131 292911819 321577618 293733762 248194724 206655783 164461065
13707A64461065m2454419l6165227k5993022j6475571j0049073o293503m199563
$$ 164461065 122006646 85841419 59848397 43372826 33323753 27030250 22830687
13700B2830687l159741k615711k062517j644848j378335j230125j111523r66185
$$ 22830687 19670946 17055235 14992718 13347870 11969535 10739410 9627887 8661702
13692H661702q26155p13861o58007o02865n34894m24271l58282l39248l07555
$$ 8661702 7835547 7121686 6463679 5860814 5325920 4901649 4543367 4204119 3896564
13683C896564k60312k43159k28903k29063j85564k03636k09289k19622j86531
$$ 3896564 3636252 3393093 3164190 2935127 2749563 2545927 2336638 2117016 1930485
13674A930485j71155j38967j26521j05939q9910r0833p8723l8765o4784r8410
$$ 1930485 1759330 1620363 1493842 1387903 1297993 1207160 1128437 1089672 1024888 926478
13664I26478n6872l0344o1360n4140j8238k7928q5898o3779m1004o8583l6725
$$ 926478 869606 839262 777902 723762 705524 677596 591698 527919 486915 418332 381607
13653C81607l163N549k7315k0123l9372l1258J066k3267l6106k0803K2987Q302
$$ 381607 378444 383993 356678 336555 297183 265925 266991 243724 207618 186815 209802 218104
13641B18104K0251J4101K6347j2491k1605n963J9654j7036l6071o748j5071l2814
$$ 218104 238355 252456 278803 266312 244707 238744 258398 241362 205291 198543 183472 150658
13629A50658p515m274J7759m745k9639j09j9553m210J2302l0439j8104m250q206
$$ 150658 143143 138869 156628 151883 122244 122135 102582 98372 110674 80235 62131 57881 49675
13616D9675j3651k1606K1348J5771j1601k3172j1778L4142M417O086j2359l4326
$$ 49675 36024 14418 35766 51537 39936 16764 4986 39128 43545 49631 37272 2946
13604B946r700k808l042J2542J7844L3090M050k5297j3101m716J3108O850P737
$$ 2946 -6754 -9562 -12604 -62 17782 50872 54922 29625 16524 11808 24916 31766 39503
13591C9503l692j1664j684r583j4515O1150J10398M4229m1664o4026m2973k500
$$ 39503 35811 24147 22463 12880 -1635 59515 169913 214142 172478 108452 65479 62979
13579F2979j0797m4412n8278l0991l017k9897l0200l6019j6759j1579m1868n6656
$$ 62979 52182 7770 -50508 -81499 -84516 -114413 -144613 -180632 -197391 -208970 -250838 -307494
13567c07494k5868j7239l4930p909l8916j5126m29r020l6582k3470J23981K29112
$$ -307494 -333362 -350601 -385531 -393440 -432356 -447482 -447911 -456931 -493513 -516983 -393002 -163890
13555a63890K13999J18685O9298M9731L1111o786k0474j9369n981k2101n2456
$$ -163890 50109 168794 238092 287823 318934 312148 291674 272305 266324 244223 191767
13544A91767J655l28j0119j1651k1763K7293J6227q625j1236P919N153Q139j8675
$$ 191767 193422 193094 182975 171324 149561 176854 193081 184456 173220 181139 186292 194431 175756
13531A75756l7896k3691k1690M586N502j1962L5722L7389K0566P903l6528n0156
$$ 175756 137860 114169 92479 97065 102567 90605 126327 163716 184282 192185 155657 105501
13519A05501j1561j0915k3018k4734j9788l1723k3462J8745J1921R702p838q474
$$ 105501 93940 83025 60007 35273 15485 -16238 -39700 -20955 -9034 668 -7170 -15644
13507a5644J1979M607m273K107J121O329n941j5553R955p441P317K7795j796k0972
$$ -15644 -3665 942 -3331 -1224 -103 6226 285 -15268 -5313 -12754 -5437 22358 20562 -410
13493d10k4183R998K7132K541J3415k400p237j6018L626j203R380p669j0095O270
$$ -410 -24593 -14595 12537 15078 28493 26093 18856 2838 6464 5261 14641 6972 -3123 3147
13479C147l38M109J75k353p468j3001l716J2446K0179j4925K1057L3421N284p000
$$ 3147 2809 6918 7093 4740 -2728 -15729 -19445 -6999 13180 -1745 19312 52733 58017 51017
13465E1017l6066m2589j4015m279J3138J1149L4405P935p822J1963k768m040r324
$$ 51017 14951 -27638 -41653 -45932 -32794 -21645 12760 20695 12873 24836 22068 18028 8704
13452H704j4383J0562L556n828l2045k0228K507Q157J3148M037l360J030J2724
$$ 8704 -5679 4883 8439 2611 -29434 -49662 -47155 -38998 -25850 -21813 -25173 -24143 -11419
13439a1419Q628k949j1354j5406K0202O561p778J3562j2605j2813o314Q662K2072
$$ -11419 -2791 -5740 -17094 -32500 -12298 -5737 -13515 47 -12558 -25371 -31685 -23023 -951
13426i51R532j0591m628j2349J847N060O051j7997j4268k810J416K2758J5663
$$ -951 8581 -2010 -6638 -18987 -17140 -12080 -6029 -24026 -38294 -41104 -39688 -16930 -1267
13413a267M742n763n304l2412m6269j3170J611J1736j494J355L5154K9304P3703
$$ -1267 3475 -2288 -7592 -40004 -86273 -99443 -97832 -86096 -87590 -86235 -51081 -21777 51926
13400E1926N9107j447q144L4602J130p693j6558j5942j5624l2383q369k495J146
$$ 51926 111033 109586 101442 136044 137174 129481 112923 96981 81357 48974 40605 38110 39256
13387C9256R809J489o916j0587m53R238K041M265l323l2288j0197P310j119k0670
$$ 39256 49065 50554 43638 33051 32598 41836 43877 48142 44819 12531 2334 9644 8525 -12145
13373a2145j7242k4823L9242J5334j031m577Q95J221j2095q531K1103K1619j3966
$$ -12145 -29387 -54210 -14968 366 -665 -5242 -4347 -3126 -15221 -23752 -2649 18970 5004
13360E004J2472N297m173j3475k113Q510p865r461K5917J5406n649m867m2R646
$$ 5004 17476 22773 18600 5125 3012 11522 3657 -5804 20113 35519 29870 25003 24961 34607
13346C4607N587k7442l121M681j7412j8999M306J5905j5342J2807r995J1331P500
$$ 34607 40194 12752 9631 14312 -3100 -22099 -17793 -1888 -17230 -4423 -14418 -3087 4413
13333D413q010j2551K7975M6626k396l3443l2755j9837o169j2725L316P491K1085
$$ 4413 -3597 -16148 11827 58453 56057 22614 -10141 -29978 -36147 -48872 -45556 -38065 -16980
13320a6980K3334J9025K3329j1628k9444k6932r667K9243Q272J8201Q731l2686
$$ -16980 6354 25379 48708 37080 7636 -19296 -28963 280 8552 26753 35484 2798
13308B798k0499M990J3814q737n190J2572J9932m028j6126l19J4472j4689l3065
$$ 2798 -17701 -12711 1103 -7634 -12824 -252 19680 15652 -474 -793 13679 -1010 -34075
13295c4075L930j268Q826J3112L0162R531q255M656L205m117k3814O668J6821
$$ -34075 -30145 -31413 -22587 -9475 20687 30218 21963 26619 29824 25707 1893 8561 25382
13282B5382K963r003j6455J0247K2641k2593N671Q157j096l9096k9967J2722k137
$$ 25382 28345 19342 2887 13134 35775 13182 18853 27010 25914 -13182 -43149 -30427 -32564
13269c2564m836L3218L719J7309j839j1958n332l879k722o89N023J5045j0327
$$ -32564 -37400 -4182 -463 16846 15007 3049 -2283 -6162 -8884 -9573 -4550 10495 168
13256A68Q610K5964J6600J5306L6208j63j5783K5821O833K7558N7691Q2029Q2973
$$ 168 8778 34742 51342 66648 102856 102693 86910 112731 119564 147122 204813 286842 369815
13243C69815J26636K32063L20624L57884J87344n6942j86701k03120k11519k32744
$$ 369815 496451 728514 1049138 1407022 1594366 1537424 1350723 1147603 936084 703340
13233G03340j92454j32023o6771p0988m8218j5734m760l4866k7701k4424k8067
$$ 703340 510886 378863 312092 241104 192886 177152 172392 137526 109825 85401 57334
13222E7334m2409j6431J4825L7535J5612q816J983j694k3541k4202j9906k1908
$$ 57334 14925 -1506 13319 50854 66466 57650 59633 57939 34398 10196 -9710 -31618
13210c1618J7691J2384L907O409K3040n792l5951J045K673j962j7225K1032J2672
$$ -31618 -13927 -1543 2364 8773 31813 26021 -9930 -8885 -6212 -8174 -25399 -4367 8305
13197H305l367k6253j0067k950K73J4712K280n106o05q43k9527j3951L1232q086
$$ 8305 4938 -21315 -31382 -34332 -34059 -19347 -17067 -22173 -22778 -23621 -53148 -67099 -35867 -43953
13183d3953o549K7283J4672K404K6203J2963j6556k888j1637J379j495O236K1105
$$ -43953 -50502 -23219 -8547 -6143 20060 33023 16467 13579 1942 3321 1826 8062 29167
13170B9167m302k4995n258k6611k7819J9482K1719j238L962M700n91k827q713
$$ 29167 24865 -130 -5388 -31999 -59818 -40336 -18617 -19855 -15893 -11193 -11784 -14611 -23324
13157b3324J7028j7725M700P58k017J4242k1014k1461Q806K596J5685P8J5757
$$ -23324 -6296 -24021 -19321 -18563 -20580 -6338 -27352 -48813 -40007 -37411 -21726 -21648 -5891
13144e891M639r324J1573j344l3499o389K4929J5103m566Q366N20O490r073l0679
$$ -5891 -1252 -10576 997 -347 -33846 -40235 -15306 -203 -4769 3597 4117 10607 1534 -29145
13130b9145M937O656K581L276j1538J0934J8776R78n433j5507J595m00J9461K2996
$$ -29145 -24208 -17552 -14971 -11695 -23233 -12299 6477 7455 2022 -13485 -11890 -12290 7171 30167
13116C0167q683l499q943K0475J9350m852j0456j727J2362N235M066L256k994
$$ 30167 21484 17985 9042 29517 48867 44015 33559 31832 44194 49429 53495 56751 53757
13103E3757m867j7930j8395M784J8352j6986j8384k471R5J0724J8149Q936j6283
$$ 53757 48890 30960 12565 17349 35701 18715 331 -2140 -2045 8679 26828 35764 19481
13090A9481k4257K0622m837r044L311O339j363J198J0474n436p435J712K3587
$$ 19481 -4776 15846 11009 1965 5276 11615 10252 11450 21924 16488 9053 10765 34352
13077C4352m721j679J455m860K1096K8958Q211J1422J7520K2312M242L272j2132
$$ 34352 29631 27952 29407 24547 45643 74601 82812 94234 111754 134066 138308 141580 129448
13064A29448J7755K4832j268j0525m467L081P734j6550j4244j1669p991K757O966
$$ 129448 147203 172035 170767 160242 155775 158856 166590 150040 135796 124127 116136 118893 125859
13051A25859k3878j1139J0869N21j6069n315Q816j5405j9208l0899K6677L1228
$$ 125859 101981 90842 101711 102232 86163 80848 89664 74259 55051 24152 50829 82057
13039H2057K665J1089K6937L9027J8959m290K4393K9011J4794J6305J1162q423
$$ 82057 84722 95811 122748 161775 180734 176444 200837 229848 244642 260947 272109 263686
13027B63686J5165J6382J2970M5792M1228k873l2464j3106L063J4663J0950n132
$$ 263686 278851 295233 308203 353995 395223 392350 359886 346780 349843 364506 375456 370324
13015C70324l0842m4311l1191k2417m408p28k0594n022r652j1767n288j3394j1727
$$ 370324 339482 295171 263980 241563 237155 236427 215833 210811 201159 189392 184104 170710 158983
13002A58983k0424r620K2635L1179P008K3800K5418R183J9755L6011J944J3410
$$ 158983 138559 128939 151574 182753 189761 213561 238979 248162 267917 303928 305872 319282
12990C19282K8862M4757M9630K1896J715K2576K9061K1231p472j2081k2k5159
$$ 319282 348144 392901 442531 464427 466142 488718 517779 539010 531538 519457 519435 494276
12978D94276n0891l5889k9482l6896m2475l4100n335L150j7008j1496l420q542
$$ 494276 443385 407496 378014 341118 298643 264543 259208 262358 245350 233854 230434 221892
12966B21892j5608j2912l6734M576j4658J467K5726J0911K3878J943M608J9960
$$ 221892 206284 193372 156638 161214 146556 148023 173749 184660 208538 210481 215089 235049
12954B35049K8341m383J9331K4774K3360K6926J3620J6868J1735j4726l210J5698
$$ 235049 263390 259007 278338 303112 326472 353398 367018 383886 395621 380895 377685 393383
12942C93383m381l7697k1767l7386j7384j7449j2765j9808k7503l1631N074o974
$$ 393383 389002 351305 329538 292152 274768 257319 244554 224746 197243 165612 170686 163712
12930A63712o900k558n860j0704j8323n433j859m119J227r633P710K4026K6143
$$ 163712 156812 154254 148394 137690 119367 113934 112075 107956 109183 99550 107260 131286 157429
12917A57429K236j6853j1390J8431M216k7796K5671K1575j2859j5333j5394J7786
$$ 157429 159665 142812 131422 149853 154069 126273 151944 173519 160660 145327 129933 147719
12905A47719J2718k2230j1314L1633p986k3862k4551M142K716j2411r39j8198
$$ 147719 160437 138207 126893 158526 150540 126678 102127 106269 108985 96574 95635 77437
12893G7437j7829l751k684n310p078m883r401n13J8530J5902l4458r058j8553
$$ 77437 59608 55857 53173 47863 40785 35902 26501 25988 44518 60420 25962 16904 -1649
12880a649r499J6216j522J178l996j4605Q541J5930M257J0378j0261J9034L600
$$ -1649 -11148 5068 3546 4724 728 -13877 -5336 10594 14851 25229 14968 34002 37602
12867C7602N315j1098R282n173j5285j9640j2031J2338j2458J0652M283j4012
$$ 37602 42917 31819 41101 35928 20643 1003 -11028 1310 -11148 -496 3787 -10225
12855a0225K2356j0743k4547j2958M902L4617K960j5133m565j138L5N605R750
$$ -10225 12131 1388 -23159 -36117 -31215 3402 6362 -8771 -13336 -14474 -14439 -8834 916
12842I16J8264k3432m1571J8165K0808j7132l861J5362J3311J3020M037j7544
$$ 916 19180 -4252 -45823 -27658 -6850 -23982 -27843 -12481 830 13850 17887 343
12830C43j8679J1946O431L592J1087O953j3126j7593k845L77P315J0882O718j1207
$$ 343 -18336 -6390 41 3633 14720 21673 8547 -9046 -11891 -11514 -4199 6683 13401 2194
12816B194k3627O448Q251j0366l010n063j2867J2889K3122J0N724l859k2651r107
$$ 2194 -21433 -14985 -6734 -17100 -20110 -25173 -38040 -25151 -2029 -2019 3705 -154 -22805 -31912
12802c1912K9310J5228l975k0422k5458l705P832L197J2776K3574J0350m082o614
$$ -31912 -2602 12626 8651 -11771 -37229 -40934 -33102 -29905 -17129 6445 16795 12713 6099
12789F099q507o436R0r884p458p207M49q199Q478J3704J1870J2886K961Q40l388
$$ 6099 -2408 -8844 -8754 -18638 -26096 -33303 -32854 -41053 -32575 -18871 -7001 5885 8846 9686 6298
12774F298j9839m669m861J7934J4221r932M659J6759R965j0072k8151M02J726
$$ 6298 -13541 -18210 -23071 -5137 9084 -848 3811 20570 30535 20463 -7688 -7286 -5560
12761e560K169J0069Q812m959j7217j1200L2353J5201j0623P92q884J175J5253
$$ -5560 -3391 6678 15490 10531 -6686 -17886 14467 29668 19045 19837 10953 12128 27381
12748B7381J5751n775p010j3485P705n463k2997m044M149k1556N390K4927N552
$$ 27381 43132 37357 30347 16862 24567 19104 -3893 -7937 -3788 -25344 -19954 4973 10525
12735A0525J1871L979J0312M78j4972L170N13k1604k1150q340r457m255P511N972
$$ 10525 22396 26375 36687 37165 22193 25363 25876 4272 -16878 -25218 -34675 -38930 -31419 -25447
12721b5447J5395J1283o202j1926J6475j6066j2086r409k710R429l60N331K3537
$$ -25447 -10052 1231 -4971 -16897 -422 -16488 -28574 -37983 -40693 -31264 -31624 -26293 -2756
12708b756Q928j651k653k129j4432R598o90j3630J2134Rm761K4140j7786l8456
$$ -2756 6172 4521 1868 -261 -14693 -5095 -5785 -19415 -7281 -7272 -12033 12107 -5679 -44135
12694d4135j4365r227K897K5471J1966j2977j2897L2615J64N857O625l2126j9736
$$ -44135 -58500 -67727 -64830 -39359 -27393 -40370 -53267 -20652 -20488 -14631 -8006 -40132 -59868
12681e9868J9506K2904q905K9543o567k0794j3526n725J8677N812J6844o548k656
$$ -59868 -40362 -17458 -26363 3180 -3387 -24181 -37707 -43432 -24755 -18943 -2099 -8647 -11303
12668a1303k0042m440J176J0585j8100m391J4190J4694L5241P003K415k0957R983
$$ -11303 -31345 -35785 -34609 -24024 -42124 -46515 -32325 -17631 17610 24613 27028 6071 16054
12655A6054O68q905J0480M901l196q220k5521n824k368l247N871K5417J739l3541
$$ 16054 16722 7817 18297 23198 20002 11782 -13739 -19563 -21931 -25178 -19307 6110 7849 -25692
12641b5692j6762O731j4497J226j9245M918L783K7794K3483R068j759J4380j3026
$$ -25692 -42454 -35723 -50220 -48994 -68239 -63321 -59538 -31744 -8261 807 -952 13428 402
12628D02L84J575Q303p290q651L7029j1436k1033J1089L114q711o423j606M36
$$ 402 786 2361 10664 3374 -5277 31752 20316 -717 10372 13486 4775 -1648 -3254 -2818
12614b818N005o605j4546n272M0301L882j148k3279K3941K2222k3080K304N412
$$ -2818 2187 -4418 -18964 -24236 16065 19947 18799 -4480 19461 41683 18603 20907 26319
12601B6319j726j2322Q43J1914k078q482j1417n861m265j1837J5603K5920K4642
$$ 26319 24593 12271 13114 25028 22950 14468 3051 -2810 -7075 -18912 -3309 22611 47253
12588D7253r586j5987l366N114q55j7000j1922J24n47R479J3154k6682k4870j586
$$ 47253 37667 21680 18314 23428 22573 5573 -6349 -6225 -6772 2707 15861 -10821 -35691 -37277
12574c7277J599Q294r18p05K469J9339L351p712l1178j9248M178Q324K0737J9307
$$ -37277 -35678 -27384 -28302 -29007 -26538 -7199 -3848 -11560 -42738 -61986 -57808 -49484 -28747 -9440
12560i440J8768R351O544j9375m652j85j5105k1224J9309k720J1721P9j099J5968
$$ -9440 9328 18679 25223 5848 1196 1011 -14094 -35318 -16009 -18729 -7008 -6929 -8028 7940
12546G940J265O253r237m934J0788m769l3343j7134Q642J3908J7731L7841K844
$$ 7940 9205 15458 6221 1287 12075 7306 -26037 -43171 -34529 -20621 -2890 34951 37795
12533C7795k9040J1435L0720J0956k0145k1802p60r599j6567J0234J3121K983
$$ 37795 8755 20190 50910 61866 41721 19919 19159 9560 -7007 3227 16348 19331
12521A9331J9773k097j9794j7323K9395j0772j2380J1539K3185l2119o13R708
$$ 19331 39104 37007 17213 -110 29285 18513 6133 17672 40857 8738 8125 17833
12509A7833j9221j4480k3693j8193L1520Kq859J7989J1040r340q150n031j5171
$$ 17833 -1388 -15868 -39561 -57754 -26234 -26232 -35091 -17102 -6062 -15402 -23552 -28583 -43754
12496d3754p969J4844K3854J8109j2404k9070J6724J012R036O47j2765p38R040
$$ -43754 -51723 -36879 -13025 5084 -7320 -36390 -19666 -18654 -9618 -8971 -21736 -22474 -13434
12483a3434K979k0170j1418K3764J1834q458n266K3740M441j1774j3643K88q030
$$ -13434 -10455 -30625 -42043 -18279 -6445 -14903 -20169 3571 8012 -3762 -17405 -17117 -25147
12470b5147L243j408j6937J576J9352q604k343J1093j3248j0881k50K5794J5529
$$ -25147 -21904 -23312 -40249 -38673 -19321 -27925 -30268 -19175 -32423 -43304 -43554 -17760 -2231
12457b231J3788J2536j3597m2668L58L9248O303j0760J4490J8009j2455l1814
$$ -2231 11557 24093 10496 -32172 -31814 7434 13737 2977 17467 35476 23021 -8793
12445h793q228k2177M07j9579J4344R035J7757J3247L811K598J937p217j7604
$$ -8793 -17021 -39198 -38791 -58370 -44026 -34991 -17234 -3987 -176 2422 4359 -2858 -20462
12432b0462O059Q487j4382p141L458J4106l589r095O791K5065M291j4331j4668
$$ -20462 -14403 -5916 -20298 -27439 -23981 -9875 -13464 -22559 -15768 9297 13588 -743 -15411
12419a5411j5033J728J870P654l635k4135o562L8269M2272J0589o770k4171l9206
$$ -15411 -30444 -28716 -26846 -19192 -22827 -46962 -53524 -15255 27017 37606 30836 6665 -32541
12406c2541k4374J0781K9528N872j3103r187O59J2158J0147J4971j0083M121j0608
$$ -32541 -56915 -46134 -16606 -10734 -23837 -33024 -32365 -20207 -10060 4911 -5172 -1051 -11659
12393a1659k3552K969J9736K9951j584N034k599j6351L834J2447p65p425p644
$$ -11659 -35211 -32242 -12506 17445 15861 20895 18296 1945 5779 18226 17461 10036 2392
12380B392p821k0771N426J864J0364J722N79P731j370l439J4273J2547j9527j9058
$$ 2392 -5429 -26200 -20774 -18910 -8546 -6824 -6245 1486 116 -3323 10950 23497 3970 -15088
12366a5088R056j4579q272l451J8034L3063K3284j977j3517J8621J6775k9141
$$ -15088 -6032 -20611 -28883 -32334 -14300 18763 42047 40070 26553 45174 61949 32808
12354C2808k7495n170p330Q388J3120M336j4096Q945K548J0005r96j3226j0907
$$ 32808 5313 143 -7187 1201 14321 18657 4561 13506 16054 26059 25063 11837 930
12341I30L890J9565q520k7794j7258R901J7153j3831j554K8066Q049j4150k830
$$ 930 4820 24385 15865 -11929 -29187 -19286 -2133 -15964 -17518 10548 18597 4447 1617
12328A617n374N086K7271m051j1739Q360l692n889j3059r182o970L439j5254O176
$$ 1617 -3757 1329 28600 24549 12810 21170 17478 11589 -1470 -10652 -17622 -14183 -29437 -23261
12314b3261R012J0502J0259k1906j3144K142k1367K3377J5833K652J640Q391j9734
$$ -23261 -14249 -3747 6512 -15394 -28538 -26396 -47763 -24386 -8553 -5901 -4261 4130 -15604
12301a5604r446Q69K4817Q840J2691L0K1977J3779k1596m7711j1286K30J4054
$$ -15604 -25050 -24181 636 9476 22167 22197 44174 57953 36357 -11354 -22640 -22410 -8356
12288h356J7358p4j2659k5092N286K0633J866j0763r10J4344L1168J7201j1718
$$ -8356 9002 8928 -3731 -28823 -23537 -2904 -1038 -11801 -12711 1633 32801 50002 38284
12275C8284k6739l222L38R18j3494j460J8039q254j1412N599j6047k0363l520
$$ 38284 11545 8323 8661 9579 -3915 -5375 12664 4410 -7002 -1403 -17450 -37813 -41333
12262d1333k7526m399J8496J8764J8923j4999j9521o427J2773L1771K7507K8183
$$ -41333 -68859 -73258 -54762 -35998 -17075 -32074 -51595 -58022 -45249 -13478 14029 42212
12250D2212j8216n622j9272M079M563O976n49j4192K7948k5164l6607P489L2310
$$ 42212 23996 18374 -898 3181 7744 14720 14171 -21 27927 2763 -33844 -26355 5955
12237E955j0j9449j296j6251R343O712M938n538k0459o378K846k004j8005K473
$$ 5955 5945 -13504 -14800 -31051 -21708 -14996 -10058 -15596 -36055 -42433 -39587 -41591 -59596 -57123
12223e7123L6890J6212O941O194M975M254N17J4168j0522J511l548k868j5195
$$ -57123 -20233 -4021 2920 9114 14089 18343 18860 33028 22506 24017 20469 17601 2406
12210B406n286l7947j3536R998O730J9873K9359j2461m8084J2111J8868M017j1662
$$ 2406 -2880 -40827 -54363 -44365 -37635 -17762 11597 -864 -48948 -36837 -17969 -13952 -25614
12197b5614J5636J6470j118p193J1621q702k2006J2883Q736p526K1365J8904j7912
$$ -25614 -9978 6492 5374 -1819 9802 1100 -20906 -8023 713 -6813 14552 33456 15544
12184A5544j5936P896K2263j9257k320M001k085O059k3531R556L6732J882j5236
$$ 15544 -392 7504 29767 10510 8190 12191 10106 16165 -7366 2190 38922 40804 25568
12171B5568r321J7030N992n470j2618l936j545J3074j5091q808J4084l122k116
$$ 25568 16247 33277 39269 33799 21181 17245 15700 28774 13683 4875 18959 15837 13721
12158A3721J6764J7360P518Q885k2536l3581k1290Q008J0834P834J112K1401j0335
$$ 13721 30485 47845 55363 64248 41712 8131 -13159 -5151 5683 13517 14629 36030 25695
12145B5695J2289k3059j9779J0046j2125k7285P334J1386L935k2045j2621J5966
$$ 25695 37984 14925 -4854 5192 -6933 -34218 -26884 -15498 -11563 -33608 -46229 -30263
12133c0263L728J5218j978k0897q67K575l510j3035J1282N035K3615J0548N129
$$ -30263 -26535 -11317 -13295 -34192 -35059 -32484 -35994 -49029 -37747 -32712 -9097 1451 6580
12120F580k056p12M609P084q156k1255J9316j0653j5039K4941r5j0657j2313j9024
$$ 6580 4524 3812 8421 15505 7349 -13906 5410 -5243 -20282 4659 4564 -6093 -18406 -37430
12106c7430j108L4996k64l1717j0868p677O778J7332Q00K0347J1735l13J1007
$$ -37430 -38538 -3542 -3806 -35523 -46391 -54068 -47290 -29958 -29158 -8811 2924 2611 13618
12093A3618n797K589K0771j1129r758k9075n094J7039J1767P723N62j8434j1153
$$ 13618 7821 10410 31181 20052 10294 -18781 -23875 -6836 4931 12654 13216 -5218 -16371
12080a6371J1870L5313J9201j5860l8614K02K9995K09j3298j9651m673O917K577
$$ -16371 -4501 30812 50013 34153 -4461 -4259 25736 25945 12647 -7004 -11677 -4760 -2183
12067b183o584q453L405L2310p263p219K2930N759j3152m849j8365m265l692J1772
$$ -2183 -8767 -17220 -13815 18495 11232 4013 26943 32702 19550 14701 -3664 -7929 -11621 151
12053A51K4055j3007M636J5603j845j8408k0791O034m063P574L575o416j7114
$$ 151 24206 11199 15835 31438 29593 11185 -9606 -3572 -7635 -61 3514 -2902 -20016
12040b0016l584M749o364J2443r227J2806J2144J682J1946n585r591J3235K4817
$$ -20016 -23600 -18851 -25215 -12772 -21999 -9193 2951 4633 16579 10994 1403 14638 39455
12027C9455J8469k4067l4892N569J3759k555R908j4795j9636K7948P167k4862
$$ 39455 57924 33857 -1035 4534 18293 15738 25646 10851 -8785 19163 26330 1468
12015A468k5332K2109q294k2083k2135M1585L6158K5855k131j4865o363p303p298
$$ 1468 -23864 -1755 -10049 -32132 -54267 -12682 23476 49331 47200 32335 25972 18669 11371
12002A1371q381r235p827o554K3815L1516o382m293q602K8243k083k5003p627
$$ 11371 2990 -6245 -14072 -20626 3189 34705 28323 24030 15428 43671 41588 16585 8958
11989H958R099m118j9998K8022J8835j4003j9945k5914J3040J4553K1857q518
$$ 8958 18057 13939 -6059 21963 40798 26795 6850 -19064 -6024 8529 30386 21868
11977B1868r15M250Q464K1585J1664n008l9566n696J0886L750k0009r798q066
$$ 21868 20953 25203 33667 55252 66916 61908 22342 16646 27532 31282 11273 1475 -6591
11964f591p512K89K599K4539K118o458L775j0869k0713J1354l850L684n706j7199
$$ -6591 -14103 -13814 -11215 13324 15442 8984 12759 1890 -18823 -7469 -11319 -7635 -13341 -30540
11950c0540K832J9046r653K2365K2632J5851k6566k3514J4642R990j2470J6676
$$ -30540 -27708 -8662 -18315 4050 26682 42533 15967 -7547 7095 17085 4615 21291
11938B1291J0399J7050k4955j5846k5381j6773N452M211J4711O688r485J8065
$$ 21291 31690 48740 23785 7939 -17442 -34215 -28763 -24552 -9841 -3153 -12638 5427
11926E427p044k7420J4090J3680J6237o386j2130J5474J6582N411K376n884L217
$$ 5427 -1617 -29037 -14947 -1267 14970 8584 -3546 11928 28510 33921 36297 30413 33630
11913C3630J8225n863j4378k6011J0257Q823l755j0959j0675L179p04L640J6396
$$ 33630 51855 45992 31614 5603 15860 24683 20928 9969 -706 2473 1769 5409 21805
11900B1805j5612j3350j7306J0789J5846N675K197J1513Q818J2908n595P90J8070
$$ 21805 6193 -7157 -24463 -13674 2172 7847 10044 21557 30375 43283 37688 38478 56548
11887E6548j8639k5445j6839k285Q360Q182J7035J4338K299k5280n087o140j2407
$$ 56548 37909 12464 -4375 -6660 1700 9882 26917 41255 43554 18274 13187 7047 -5360
11874e360n155J7373M5470q884j6470j767j0566l592j265j1778j0410l416J7800
$$ -5360 -10515 6858 52328 43444 26974 25207 14641 11049 9784 -1994 -12404 -15820 1980
11861A980L0438K1557j3723k6935j0559Q482K6802k40j5976k1755o849L6195J8629
$$ 1980 32418 53975 40252 13317 2758 11240 38042 37802 21826 71 -6778 29417 48046
11848D8046N470r290J452l4549l2836K5573K0196P428L392j3367j1277m094J0419
$$ 48046 53516 44226 45678 11129 -21707 3866 24062 31490 34882 21515 10238 6144 16563
11835A6563r06k4651k5079J1588J3016K7496J0669j2131r640l293j2097j9148
$$ 16563 15657 -8994 -34073 -22485 -9469 18027 28696 16565 6925 3632 -8465 -27613
11823b7613J2695n237j0829J3649K6623L876J6312j6373k1380M54l131K0826q0
$$ -27613 -14918 -20155 -30984 -17335 9288 13164 29476 13103 -8277 -7823 -10954 9872 9792
11810I792k2740L555p8n871M825O18q767j9293J1942N249O393K4414p577k340
$$ 9792 -12948 -9393 -9471 -15342 -10517 -9899 -18666 -37959 -26017 -20768 -14375 10039 2462 122
11796A22M0209K0228l0627m167N381p060k9003m067L091k727J0229K7416J1149
$$ 122 40331 60559 29932 25765 31146 24086 -4917 -8984 -5893 -8620 1609 29025 40174
11783D0174M401k7617k5792k4741k312J2488K8642K242q127j8746j240m333n009
$$ 40174 44575 16958 -8834 -33575 -35887 -23399 5243 7485 -642 -19388 -20628 -24961 -29970
11770b9970Q056L7731L4043k1601k0277m662j8576r170L3222O855p537J8915p504
$$ -29970 -21914 15817 49860 28259 7982 3320 -15256 -24426 8796 15651 8114 27029 19525
11757A9525j6611k1453j796J0513K562R98j0171k731J0593L2836K545j3702J1296
$$ 19525 2914 -18539 -20335 -9822 -7260 -6262 -16433 -19164 -8571 24265 26810 13108 24404
11744B4404J4398j2578j8565J9209J1264j3029l3922j2384j1947L723J185K5579
$$ 24404 38802 26224 7659 26868 38132 25103 -8819 -21203 -33150 -29427 -28242 -2663
11732b663K9193j0766k452p233Q653J4375m565P727p711j2721q056j3122R060
$$ -2663 26530 15764 13312 6079 14732 29107 24542 32269 24558 11837 3781 -9341 -281
11719b81N691p084N726j9423j2869m854J1186L4176N360n317j7791k3916L2431
$$ -281 5410 -1674 4052 -15371 -28240 -33094 -21908 12268 17628 12311 -5480 -29396 3035
11706C035J0086r369q682J3044Q240k537m15M756r24j3984K68p453k346k387R016
$$ 3035 13121 3752 -4930 8114 16354 13817 13402 18158 17234 3250 3518 -3935 -6281 -8668 348
11691C48K5402M051j6046j8534l3891q040J7242k435m942n329K3973J3205j2187
$$ 348 25750 29801 13755 -4779 -38670 -46710 -29468 -31903 -36845 -42174 -18201 -4996 -17183
11678a7183J419J9199k1136j33J5766J5140n562L795K5725M587l2227j2368J9247
$$ -17183 -15764 3435 -17701 -17834 -2068 13072 7510 11305 37030 41617 9390 -2978 16269
11665A6269K2503p651k1845j8800k0008r033j0068K6670M1980m603j9484L183
$$ 16269 38772 31121 9276 -9524 -29532 -38565 -48633 -21963 20017 15414 -4070 -887
11653h87l15L96N498j4740l802J1204N768k1480j6506q653J4235J3913j2070k0030
$$ -887 -1202 -806 4692 -10048 -13850 -2646 3122 -18358 -34864 -43517 -29282 -15369 -27439 -47469
11639d7469m392K0723N08N030K8924o394k3011P458K9900J6881j0401m058L569
$$ -47469 -51861 -31138 -30630 -25600 3324 -3070 -26081 -18623 11277 28158 17757 13699 17268
11626A7268j5696j321k223K990K3617N160o885j3280q490P594j2846P929J1679
$$ 17268 1572 251 -1972 1018 24635 29795 22910 9630 1140 8734 -4112 3817 15496
11613A5496J509K8594p943k0744J2044J8720J0032k9888j599J5037k009l874m700
$$ 15496 17005 45599 37656 16912 28956 47676 57708 27820 26221 41258 39249 35375 30675
11600C0675J6772k5977k6784J0571o709Q468J6773o22k2230j9255J0493N237J1118
$$ 30675 47447 21470 -5314 5257 -1452 7016 23789 23167 937 -18318 -7825 -2588 8530
11587H530J1422K744j5200k5781J0645M789N571R635k1758K4039K6620n450j1102
$$ 8530 19952 22696 7496 -18285 -7640 -2851 2720 12355 -9403 14636 41256 35806 24704
11574B4704j554j5630k4760o89N314n801J6951j7644K7531K8696J1666N814k800
$$ 24704 23150 7520 -17240 -17929 -12615 -18416 -1465 -19109 8422 37118 48784 54598 51798
11561E1798m1009j4079j4989J4284q81p381J1913K5103J1731j4227M395j8324
$$ 51798 10789 -3290 -18279 -3995 -4876 -12257 -344 24759 36490 22263 26658 8334
11549H334r671J3479m973J2550J1789K157k7822j8438J4056r235l608M2952j4216
$$ 8334 -1337 12142 7169 19719 31508 33665 5843 -12595 1461 -7774 -11382 31570 17354
11536A7354k0533M328j3902k468n370k606J5731L1537L461N115k071j4519K2332
$$ 17354 -3179 1149 -12753 -15221 -20591 -23197 -7466 24071 27532 32647 30576 16057 38389
11523C8389M478k9289p904J8111o354J1023J1195m301j0146j0080k3606O185j2122
$$ 38389 42867 13578 5674 23785 17431 28454 39649 35348 25202 15122 -8484 -2299 -14421
11510a4421J8103K2049j7867r290J0306o268L8452J0954j2248r474O280j670Q574
$$ -14421 3682 25731 7864 -1426 8880 2612 41064 52018 39770 30296 36576 34906 43480
11497D3480j0364l242j1799j584J6466J7807r301l548k289j0384J8996K93j9431
$$ 43480 33116 29874 18075 16491 32957 50764 41463 37915 35626 25242 44238 44531 25100
11484B5100p047K57j6357J2106O606N765q928j4363k6710l330K5718K0439n344
$$ 25100 18053 18310 1953 14059 20665 26430 17502 3139 -23571 -26901 -1183 19256 13912
11471A3912j500J933J3732l0854k4250j2270J3563K0488J7313L521j5790k0932
$$ 13912 12412 14345 28077 -2777 -27027 -39297 -25734 -5246 12067 15588 -202 -21134
11459b1134O307J6460j0717P481k1126O63k449j4523j16J3394L266J7229K1519
$$ -21134 -14827 1633 -9084 -1603 -22729 -22066 -24515 -39038 -39154 -25760 -22494 -5265 16254
11446A6254l456O224J3200O597k0320k9483K1655O896j245J0185p273j3546P812
$$ 16254 12798 19022 32222 38819 18499 -10984 10671 17567 16322 26507 19234 5688 13500
11433A3500j2692j3656j3742Q370J7083J9246O522j8286J00P932k7101k0685N911
$$ 13500 808 -12848 -26590 -18220 -1137 18109 24631 6345 6445 14377 -12724 -33409 -27498
11420b7498J1339J7809L6704P635j3754k0958j6209R966N627k9499p797m331L1807
$$ -27498 -16159 1650 38354 45989 32235 11277 -4932 5034 10661 -18838 -26635 -30966 841
11407H41J1748k6904J7678P350O093J2211Q619P118j3927J329p097j6770J9065
$$ 841 12589 -14315 3363 10713 16806 29017 37636 44754 30827 32156 25059 8289 27354
11394B7354R395J4748J1263l4367j1417K480K5993p53m5153J4310j1191k2319
$$ 27354 36749 51497 62760 28393 16976 19456 45449 44696 -457 13853 2662 -19657
11382a9657J3048J7061j2409J7717J9985R675o15k7492l216J1620L743K250j0304
$$ -19657 -6609 10452 -1957 15760 35745 45420 44805 17313 14097 25717 29460 31710 21406
11369B1406q862r042K6352J0313k0476l9734J6262q545j0350K7459K0520n053
$$ 21406 12544 3502 29854 40167 19691 -20043 -3781 -12326 -22676 4783 25303 20250
11357B0250J5558M67m0782L24J3801j7225n208J1493n639q47J2519K3207K608
$$ 20250 35808 36275 -4507 -4183 9618 -7607 -12815 -1322 -6961 -7808 4711 27918 30526
11344C0526q104j9928j6422k860N852J663k744J8936J1836M166k0452j1540L6044
$$ 30526 22422 2494 -13928 -16788 -10936 -9273 -12017 6919 18755 22921 2469 -9071 26973
11331B6973K025j5091j1461k741k5033j8018K1227J4408k1589J8822J4369O087
$$ 26973 28998 13907 2446 -295 -25328 -43346 -22119 -7711 -29300 -10478 3891 9978
11319I978L05O805n552K1196m269m147r188j4414j0319L393j3180l998M4545k364
$$ 9978 10283 17088 11536 32732 28463 24316 15128 714 -9605 -6212 -19392 -23390 21155 18791
11305A8791K6144j916p956K0251N481j1551j4228p441K138j4211j9210N575K7651
$$ 18791 44935 43019 35063 55314 60795 49244 35016 27575 29713 15502 -3708 1867 29518
11292B9518j83m253j9159j3083L1107L0277P84l1504j871K1180R521j68j5257
$$ 29518 29335 25082 5923 -7160 23947 54224 55008 23504 21633 42813 52334 52166 36909
11279C6909J900j89p436o568j1436j5554j5611J9764J066k215J9167r285j7134
$$ 36909 38809 38620 31184 24616 13180 -2374 -17985 1779 2845 630 19797 10512 -6622
11266f622m185J4510R075Q76L622L886k657K5658K803j089R255j2926r46J016
$$ -6622 -10807 3703 12778 13654 17276 21162 18505 44163 46966 45877 55132 42206 41260 42276
11252D2276p389Q48j0507r011q613p532J1880L718M90n493L023j6258R338J3366
$$ 42276 34887 35735 25228 16217 7604 72 11952 15670 16160 10667 13690 -2568 6770 20136
11238B0136J0313j0356j2370O650R793k391J1657J6926p809k9285n040J4400K7107
$$ 20136 30449 20093 7723 14373 24166 21775 33432 50358 42549 13264 8224 22624 49731
11225D9731j2272l4046K669J5129N563k7947k2335M017Q647K2053j490O08J9740
$$ 49731 37459 3413 6082 21211 26774 -1173 -23508 -19491 -10844 11209 9719 10327 30067
11212C0067K629p046l0521l447J1123J6813R509k1739k36L029j1097l508M39m069
$$ 30067 32696 25650 -4871 -8318 2805 19618 29127 7388 7152 10181 -916 -4424 -3985 -8054
11198h054m868L030K0216J1419Q552j1670O140j0498p37J0048K397j3491j2461
$$ -8054 -12922 -9892 10324 21743 30295 18625 24765 14267 13530 23578 25975 12484 23
11185B3m956N4207K04k7723k0828r034M176n448Q029J893L4670J8457j9025j2101
$$ 23 -4933 49274 49478 21755 927 -8107 -3931 -9379 -1350 543 35213 53670 34645 22544
11171B2544j0932j7862N744N993n707j0501j4025L196K4052L088o910K0495K4627
$$ 22544 11612 -6250 -506 5487 -220 -10721 -24746 -21550 2502 5590 -1320 19175 43802
11158D3802j1403k0806N352J9907N937N838p594k2145o229K087l731j2967J2397
$$ 43802 32399 11593 16945 36852 42789 48627 41033 18888 12659 14746 11015 -1952 10445
11145A0445m772k0474j3523J8104J3659J5248q300O617k3207J3369K7539R390
$$ 10445 5673 -14801 -28324 -10220 3439 18687 10387 17004 -6203 7166 34705 44095
11133D4095N738r376j8697j7459q735J536K0576J1584K444k301K388K829r347
$$ 44095 49833 40457 21760 4301 -4434 -2898 17678 29262 31706 29405 31793 34622 25275
11120B5275l0048l243l860R407K1933J736J519o59o026j1244l423l23K8995O267
$$ 25275 -4773 -8016 -11876 -2469 19464 21200 22719 22060 16034 4790 1367 1044 30039 36306
11106C6306P305k5802J11J5314L33l1540j7092o622M157J3111q278l0944J6331
$$ 36306 43611 17809 17920 33234 33567 2027 -15065 -21687 -17530 -4419 -12697 -43641 -27310
11093b7310L1015K2245K6276J9245k3530l1258r214J064J0416J2574q643p005
$$ -27310 3705 25950 52226 71471 47941 16683 7469 8533 18949 31523 22880 15875
11081A5875n90q59K741J6435J1015Q432k2176j1447J336j6428N333K1616k3491
$$ 15875 15285 14426 17167 33602 44617 53049 30873 19426 20762 4334 9667 31283 7792
11068G792j3578J9921J9023J2415O191j3594j0617J596O865R570l572k238J8868
$$ 7792 -5786 14135 33158 45573 51764 38170 27553 29149 36014 45584 42012 39774 58642
11055E8642j1637l4305j9975O031p742J3739R890L2471m660k8008j1649N797K2508
$$ 58642 47005 12700 -7275 -1244 -8986 4753 14643 47114 42454 14446 2797 8594 31102
11042C1102K4518P560j0266j6417n529m377P044R996J6535O278P529j1933j3789
$$ 31102 55620 63180 52914 36497 30968 26591 33635 43631 60166 66444 73973 62040 48251
11029D8251l503j3508J9213k726k3307O943j5767M70K8462Q727j8272j0487m185
$$ 48251 44748 31240 50453 47727 24420 31363 15596 16066 44528 53255 34983 24496 20311
11016B0311J7192J5399j1536k2012j0351J1000K2974k5088j0150K5940o608P455
$$ 20311 37503 52902 41366 19354 9003 20003 42977 17889 7739 33679 27071 34526
11004C4526m350r381K2694j6800J0967J6703j8054j7811J5253j470p157m48l536
$$ 34526 30176 20795 43489 26689 37656 54359 36305 18494 33747 32277 25120 24672 21136
10991B1136L066j0777J0419M314j306j0838j8610k4551r275M3174L5124Q424K605
$$ 21136 24202 13425 23844 28158 26852 16014 -2596 -27147 -36422 6752 41876 50300 52905
10978E2905j8622J3713J9134J0717k0800m080M835k3125j8100J2347J45R365p615
$$ 52905 34283 47996 67130 77847 57047 52967 57802 34677 16577 28924 29069 38434 30819
10965C0819J09j3630k672J3521L4508J1180j3893r188j7083j9943O068O586K4685
$$ 30819 30928 17298 14626 28147 62655 73835 59942 50754 33671 13728 19796 26382 51067
10952E1067n243k2392L270O78J918K5501P652p689m451R60j6863j9187M800J0874
$$ 51067 45824 23432 26702 27380 29298 54799 62451 54762 50311 51271 34408 15221 20021 30895
10938C0895J7217J0022Q796J720l5523l4580K4126L1866j932J243k014j0698n753
$$ 30895 48112 58134 66930 68650 33127 -1453 22673 54539 52607 53850 51836 41138 35385
10925C5385J6258q539k6715l683P558o599l915P095K2402N273p508M376m387k7803
$$ 35385 51643 43104 16389 12706 20264 13665 9750 16845 39247 44520 37012 41388 37001 9198
10911I198l1k0611M678K8142Q397J2992j411j0290l0830J2700Q20j933J9465K1868
$$ 9198 9167 -11444 -6766 21376 29773 42765 41354 31064 234 12934 13754 11821 31286 53154
10897E3154l79l742P705j4055k0k6705r967n276M517K2726o78o685l691J2101
$$ 53154 52775 49033 56738 42683 42663 15958 5991 715 5232 27958 27280 20595 16904 29005
10883B9005J0943J809m410j4091L066N999M043l261K0709p162l436k5223l742
$$ 29005 39948 41757 37347 23256 26322 32321 36364 33103 53812 46650 43214 17991 14249
10870A4249J2566J7390j5142J3534O180n009n691n996j6091M840K3134n460j0019
$$ 14249 26815 44205 29063 42597 48777 43768 38077 32081 15990 20830 43964 38504 28485
10857B8485n421O598J269L728L8787J7914k318k1675l3197J5112K9762j7629K822
$$ 28485 23064 29662 30931 34659 73446 91360 89042 67367 34170 49282 79044 61415 64237
10844F4237K7993k7069q209j9841K581K3934J3405J1443o139j2250l52n845R947
$$ 64237 92230 65161 56952 37111 39692 63626 77031 88474 82335 70085 69733 63888 73835
10831G3835K3493J8272j5192k1342r086j5027n002m473n343J0545j5971N614M397
$$ 73835 97328 115600 100408 79066 69980 54953 49951 45478 40135 50680 34709 40323 44720
10818D4720l0457m923L9965J9595j8360k7531K3672J6229k528j5715j214O771
$$ 44720 14263 9340 49305 68900 50540 23009 46681 62910 60382 44667 43453 50224
10806E0224l038J46j0423o131m444k575j1775J0877K7155L686n843j1787r242
$$ 50224 47186 47332 36909 30778 26334 23759 11984 22861 50016 53702 47859 36072 26830
10793B6830j4939L6692K741M275j3059m966K981l37q504R662Q199K2432O304N136
$$ 26830 11891 48583 51324 55599 42540 37574 40555 40218 31714 41376 49575 72007 78311 83447
10779H3447n477j0876l4262Q659O101j3370j5285M324Q997K1250L334r423P010
$$ 83447 77970 67094 32832 41491 47592 34222 18937 23261 32258 53508 56842 47419 54429
10766E4429J0288J1589K3333n648k0872k6747j282j1380O631J5556K7765p420
$$ 54429 64717 76306 99639 93991 73119 46372 45090 33710 40341 55897 83662 76242
10754G6242j4266K176J3576J3993p392J357K0230J4173j0639K867q843k6952j345
$$ 76242 61976 64152 77728 91721 84329 85686 105916 120089 109450 112317 103474 76522 75177
10741G5177n489K2692j4079j4011j7946j5112P016n60j1162J771P91L017L125
$$ 75177 69688 92380 78301 64290 46344 31232 38248 37688 26526 28297 29088 32105 35230
10728C5230O304M0112K39m0104j7402q849l433L6181L6095J6560k115j2390J0134
$$ 35230 41534 81646 81885 41781 24379 15530 12097 48278 84373 100933 98818 86428 96562
10715I6562K1155J7440j1742K7770K6288L4852M3853K3020O0262O7111Q0328J27687
$$ 96562 117717 135157 123415 151185 177473 212325 256178 279198 339460 406571 486899 614586
10703F14586J76783K33701L25721L37493K81471J22532j1572j90710k70852k59726
$$ 614586 791369 1025070 1350791 1688284 1969755 2092287 2080715 1890005 1619153 1359427
10693A359427k49603k43365k08950j65048j32616q3606k9986k4759l0664k9342
$$ 1359427 1109824 866459 657509 492461 359845 276239 246253 221494 190830 161488
10683A61488J552L023k8642k6137L375k054J0636J0665L477p827N345j73q222
$$ 161488 163040 166063 137421 111284 114659 112605 123241 133906 137383 129556 134901 134728 126506
10670A26506p043r363j1386j6258K7310K8618j0626j8865n107o090J3434J210
$$ 126506 119463 110100 98714 82456 109766 138384 127758 108893 103786 97696 111130 112340
10658A12340j2004o279j6407j3165Q130J4544J6333k3310k8117n708L212O048
$$ 112340 100336 94057 77650 64485 72615 87159 103492 80182 52065 46357 49569 55617
10646E5617j6292K5036K9265p92j3575k5466l321O555l0214k9131j6904R504J1722
$$ 55617 39325 64361 93626 92834 79259 53793 50472 57027 26813 -2318 -19222 -9718 2004
10633B004K0223K1554J720j1744n65l770J2339K5651j4815k537O521o237j0332
$$ 2004 22227 43781 45501 33757 33192 29422 41761 67412 52597 50060 56581 50344 40012
10620D0012k3727r236M357q231J534L258k2843m324M763J2210r707j9110l2567
$$ 40012 16285 7049 11406 3175 4709 7967 -14876 -19200 -14437 -2227 -11934 -31044 -63611
10607f3611k3438n015r509j3736L1256O3997L9162N1246P2856M6652Q057l0962
$$ -63611 -87049 -92064 -101573 -115309 -84053 -20056 19106 70352 143208 189860 197917 166955
10595A66955j1157K7116n773q379O828j4127k5456k1864J2581K0602M795r836
$$ 166955 155798 182914 177141 168762 175590 161463 136007 114143 126724 147326 152121 142285
10583A42285q257j1623l290m669j4998L721l177P321J3191m773J3369K0651l365
$$ 142285 134028 122405 119115 114446 99448 103169 99992 107313 120504 115731 129100 149751 146386
10570A46386j2824k3177k7442R791L1611p461n340J9811K6348l57k7386m213J7401
$$ 146386 133562 110385 82943 92734 124345 116884 111544 131355 157703 157346 129960 125747 143148
10557A43148J0853J2483n29r483J9591K8264L9348L9844L1074P661J6989K4526
$$ 143148 154001 166484 165955 156472 176063 204327 243675 283519 314593 322254 339243 363769
10545C63769K4410J3540K217j3051l1911m1287o3232m7795n8002k1389j879j9373
$$ 363769 388179 401719 403936 390885 358974 317687 254455 206660 148658 127269 125390 106017
10533A06017J6809P204K9733K9462J1433p385o182J3825k120j8244k7936k838
$$ 106017 122826 130030 159763 189225 200658 193273 187091 200916 198796 180552 152616 149778
10521A49778j6080L48P2m14K4134j1086m608j1241K389O242j2229J876l675j5415
$$ 149778 133698 134046 134118 133704 157838 146752 142144 130903 133292 139534 127305 129181 125506 110091
10507A10091J0216N106R206L235M960K1344p868J3289K5192K5068m398j6467k1251
$$ 110091 120307 125413 134619 137854 142814 164158 156290 169579 194771 219839 215441 198974 177723
10494A77723j4801J973o385j349m324J0134j2214k3607J360K146j2548l7721m3827
$$ 177723 162922 164895 158510 157161 152837 162971 150757 127150 128510 130656 118108 80387 36560
10481C6560l0192j705J675n958K784K5319J509Q126K7180r867r807J5642J7829
$$ 36560 6368 4663 6338 380 3164 28483 29992 38118 65298 55431 45624 61266 79095
10468G9095P015j0795k605R544Q56k0321J480L927j0869k5844m2967l910l017
$$ 79095 86110 75315 72710 82254 83110 62789 64269 68196 57327 31483 -11484 -15394 -18411
10455a8411m6078j7995k4871m9806l2327N4251J19092J80848K01266K10715J86135
$$ -18411 -64489 -82484 -107355 -157161 -189488 -135237 -16145 164703 365969 576684 762819
10444G62819J20382O2777K6680P26l4400m3237k8971q780j9580k3550k5653j7638
$$ 762819 883201 945978 972658 973384 938984 895747 866776 857996 838416 814866 789213 771575
10432G71575k3643j8129m1695l1482l8753j8330K2449M253l7735o3022r0279j28413
$$ 771575 747932 729803 688108 656626 617873 599543 621992 626245 588510 525488 435209 306796
10420C06796j46432j30481o7682K3659R0429J07820P0824L5807N8879P3041N2562
$$ 306796 160364 29883 -37799 -14140 76289 184109 254933 290740 349619 422660 475222
10409D75222j549j6444n72j0394j9130J0168J7617N280j3409k3105j3198K7649
$$ 475222 473673 457229 456657 446263 427133 437301 454918 460198 446789 423684 410486 438135
10397D38135j7746R285J5356R367J3648L586K0272l31K6524J728j544N060q296
$$ 438135 420389 429674 445030 454397 468045 471631 491903 491572 518096 519824 518280 523340 515044
10384E15044K6096O548j4934k32J1499K2815q873j2766J3385J8915J7214K8442
$$ 515044 541140 547688 532754 532522 544021 566836 557963 545197 558582 577497 594711 623153
10372F23153M543j1215l189J8790R983q018K8857P834K0563M4152K7993L0802
$$ 623153 627696 616481 613292 632082 642065 634047 662904 670738 691301 735453 763446 794248
10360G94248N5099L0187L8092N8560N7186L0360J2417J1587K0413M2169K5323
$$ 794248 849347 879534 917626 976186 1033372 1063732 1076149 1087736 1108149 1150318 1175641
10349A175641L4841L8659J8376L9347L4902M5828N5149O6056N2828L8096L9753
$$ 1175641 1210482 1249141 1267517 1306864 1341766 1387594 1442743 1508799 1561627 1599723 1639476
10338A639476N1636P4128O8420O2168P8051Q2878R6566O5621Q4842J01365R7584
$$ 1639476 1691112 1765240 1833660 1895828 1973879 2056757 2153323 2218944 2303786 2405151 2502735
10327B502735P4299P2803J06978J61737J87749K53196L16570L14254L75092M93396
$$ 2502735 2577034 2649837 2756815 2918552 3106301 3359497 3676067 3990321 4365413 4858809
10317D858809O10812P36513Q42145R05566Q50064P91886P51153P97259J001927
$$ 4858809 5469621 6206134 7048279 7953845 8803909 9595795 10346948 11144207 12146134
10308A2146134J272389J633653K115608K736402L488747M349558N409442O670927
$$ 12146134 13418523 15052176 17167784 19904186 23392933 27742491 33151933 39822860
10300C9822860Q349987J1004891J5601751K3486568L5626933N0926118O4145369
$$ 39822860 48172847 59177738 74779489 98266057 133892990 184819108 248964477
10293B48964477O6262802N1084316K2768071r426997l6405196n0900793n4611067
$$ 248964477 315227279 366311595 389079666 379652669 343247473 292346680 237735613
10286B37735613n2018540m5225372l6113039k6683440j8572969j2613917q698446
$$ 237735613 185717073 140491701 104378662 77695222 59122253 46508336 37809890
10279C7809890o178216m560925l450994k711702k176576j734068j407863j140800
$$ 37809890 31631674 27070749 23619755 20908053 18731477 16997409 15589546 14448746
10271A4448746r07264p59931p39098q02227q70218r06498q73689q24090p17252
$$ 14448746 13541482 12781551 12042453 11240226 10370008 9463510 8589821 7765731 7048479
10262G048479o44505n71968m71048m16635l71526l56504l23524l16660l06927
$$ 7048479 6403974 5832006 5360958 4944323 4572797 4216293 3892769 3576109 3269182
10253C269182k79312k48790j77814j59371j56804j49578j46434j21376r5225j07798
$$ 3269182 2989870 2741080 2563266 2403895 2247091 2097513 1951079 1829703 1734478 1626680
10243A626680j01240j20484j04056p0370n6986m5963m1108p1898q9155n8933n2852
$$ 1626680 1525440 1404956 1300900 1230530 1173544 1127581 1086473 1014575 925420 866487 813635
10232H13635n1204m1054m0939m2031k5391k4546k4813j8623k8236K218O074o148
$$ 813635 762431 721377 680438 638407 613016 588470 563657 545034 516798 519016 525090 518942
10220E18942O038P073k2366r438k0638p080j7784k6285j3143j6582k9830j9636
$$ 518942 524980 532053 509687 500249 479611 472531 454747 428462 415319 398737 368907 349271
10208C49271k0828K989k1447P028j0793o757J395K561k1933l2208j4926j6249
$$ 349271 328443 331432 309985 317013 306220 299463 300858 303419 281486 249278 234352 218103
10196B18103j7963L090L440J788m640j4558l0806j6446r927l160J1690K5848J8332
$$ 218103 200140 203230 206670 208458 203818 189260 158454 142008 132081 128921 140611 166459 184791
10183A84791J4008j526k4600j4964l402K5335L7882L8572K1666N73l4628k1057
$$ 184791 198799 197273 172673 157709 154307 179642 217524 256096 277762 278335 243707 222650
10171B22650k329J9929L4247P3036P7460J00496J28991J70653K04689K20422J23813
$$ 222650 220321 240250 274497 347533 424993 525489 654480 825133 1029822 1250244 1374057
10160A374057O4837O6303R510n1858n3410m3311o9200j22398j59356j83887j95370
$$ 1374057 1438894 1505197 1514707 1462849 1409439 1366128 1296928 1174530 1015174 831287 635917
10149F35917k02498j96152j70219j41955r6915p8528n9615l2979n6937n1854k6749
$$ 635917 433419 237267 67048 -74907 -171822 -250350 -309965 -342944 -399881 -451735 -478484
10138d78484K8494Q4471J17887J86399J95740J62814J50477R1073K0986j4584
$$ -478484 -449990 -365519 -247632 -61233 134507 297321 447798 538871 559857 545273
10128E45273j9378m0439l8354j1040q974m0286m7938l7293j7984J7041q045j6370
$$ 545273 525895 485456 447102 436062 427088 386802 338864 301571 283587 300628 292583 276213
10116B76213j853Q777L67k2468j0745r508J2928K147K6531k668j4911j1500K54
$$ 276213 274360 283137 283504 261036 250291 240783 253711 255858 282389 279721 264810 253310 253564
10103B53564J5488M385m022l4812k7023l0639k3161J906j9715l0445l3108j1967
$$ 253564 269052 273437 269415 234603 207580 176941 153780 155686 135971 105526 72418 60451
10091F0451r01j9292q759J7121K3587k457O231j206k4858j3822K5840K7220k5556
$$ 60451 59550 40258 31499 48620 72207 69750 75981 74775 49917 36095 61935 89155 63599
10078F3599l7237p73j5455j2066j5658L227M797j5168j7693J9938J1110J9986
$$ 63599 26362 25589 10134 -1932 -17590 -14363 -9566 -24734 -42427 -22489 -11379 8607
10066H607J7456L907L3796L0902J7715K971M682L7808M2306j4103l5012j0069
$$ 8607 26063 29970 63766 94668 112383 115354 120036 157844 200150 186047 151035 140966
10054A40966Q046J4581l462o387K6895J9399J3753K8545J0165J3387j1799l7005
$$ 140966 149012 163593 160131 153744 180639 200038 213791 242336 252501 265888 254089 217084
10042B17084j5412k3893l9487l6002P38P390n5J1104q795j9016K051O949Q965
$$ 217084 201672 177779 138292 102290 103028 110418 110363 121467 112672 93656 95707 102656 111621
10029A11621M470p432K974j291R807Q034j9195l676J0245K8900J1216K2668K0810
$$ 111621 116091 108659 111633 110342 120149 128183 108988 105312 115557 144457 155673 178341 199151
10016A99151K0676K899j5422L672j1670q339K5038K9229R746j8577n71P423j5385
$$ 199151 219827 222726 207304 210976 199306 190967 216005 245234 254980 236403 235832 243255 227870
10003B27870J0158j084j8672k8626m5467k3609j4857l2990l899O223p680l567
$$ 227870 238028 236944 218272 189646 144179 120570 105713 72723 68824 75047 67367 63800
9991F3800N826j3149j2720j775l0420j1892L0916j0877K1634K1039L5736Q6184
$$ 63800 69626 56477 43757 41982 11562 -330 30586 19709 41343 62382 98118 184302
9979A84302O4879M1288J4728k6419j1249m675j6754m1968k3329p008l791O172
$$ 184302 249181 290469 305197 278778 267529 262854 246100 204132 180803 173795 170004 176176
9967A76176K4880m906j209N485K0474P93J180j0608j4953J7769K7113j7144l1342
$$ 176176 201056 196150 194941 200426 220900 221693 222873 212265 197312 215081 242194 225050 193708
9954A93708j1705m0942m857K7077m696m2854j4759K3748j2654k8973k4142j6995
$$ 193708 182003 141061 136204 163281 158585 115731 100972 124720 112066 83093 58951 41956
9942D1956N3K886J5948m830j4336J5324K5516M697k1159j3660p416k9764m484
$$ 41956 42009 44895 60843 56013 41677 57001 82517 87214 66055 52395 44979 15215 10731
9929A0731q257M545P491k0259j3476l186k1039J0420j3811n0320j4764r636J1032
$$ 10731 2474 7019 14510 -5749 -19225 -22411 -43450 -33030 -46841 -97161 -111925 -121561 -110529
9916a10529K7282L3293N5762Q7456R3636P8421R0752Q5628N8927O9663P1896J08904
$$ -110529 -83247 -49954 5808 93264 186900 265321 356073 441701 500628 570291 642187 751091
9904G51091J06456L9339j0004j9355j2671l4607p744L576r226j8084K743j4619
$$ 751091 857547 896886 886882 867527 854856 820249 812505 816081 806855 788771 791514 776895
9892G76895L272P385M1667P41j1848k9521k3171L6768J36132K13164K67054L18547
$$ 776895 780167 787552 829219 829960 818112 788591 765420 802188 938320 1151484 1418538 1737085
9880A737085K82025K03409P9428j02851j97489k51656k39235k26418k18478j47881
$$ 1737085 2019110 2222519 2301947 2199096 2001607 1749951 1510716 1284298 1065820 917939
9870I17939r8735o9534n2909n7046o2819k2862l851m3549k3055M675J1811J7421
$$ 917939 819204 749670 696761 639715 576896 554034 550183 506634 483579 488254 500065 517486
9858E17486J0661j2820j437r035j846J4514K4393J3915K090n870l595j1316O553
$$ 517486 528147 515327 513890 504855 503009 517523 541916 555831 557921 552051 548456 537140 543693
9845E43693k2838q596N333N711J2696k243J9036K5282Q763J1932J1599o218j3433
$$ 543693 520855 512259 517592 523303 535999 533756 552792 578074 586837 598769 610368 604150 590717
9832E90717j039J2804K8987K2724J9034N1316J5028L0126M2135M6118M7699L5838
$$ 590717 589678 602482 631469 654193 673227 724543 739571 769697 811832 857950 905649 941487
9820I41487M1055O0684L7783M7660K4606J2894K1236K1546M5974L8287L5334L4807
$$ 941487 982542 1043226 1081009 1128669 1153275 1166169 1187405 1208951 1254925 1293212 1328546 1363353
9808A363353L5521L6604L2444M7776N9636P3190O8676O9555M5938K5351R6958
$$ 1363353 1398874 1435478 1467922 1515698 1575334 1648524 1717200 1786755 1832693 1858044 1955002
9797A955002J04104O7449N1568Q2269R6980J09034J05007J03510J32148J63613
$$ 1955002 2059106 2126555 2178123 2260392 2357372 2466406 2571413 2674923 2807071 2970684
9787B970684J68643K10999K54296K87540L36856M30385N24861O20008O71237P31812
$$ 2970684 3139327 3350326 3604622 3892162 4229018 4659403 5184264 5804272 6475509 7207321
9777G207321Q03258R04604J024970J195836J420419J679067J895585K206961K580427
$$ 7207321 8010579 8915183 9940153 11135989 12556408 14235475 16131060 18338021 20918448
9768B0918448L142654L938714N058905O681048R237703J3284660J9405220K7185180
$$ 20918448 24061102 27999816 33058721 39739769 48977472 62262132 81667352 108852532
9760A08852532L4368537L6944785L2195539K2475466J2267484N300316M282560
$$ 108852532 143221069 180165854 212361393 234836859 247104343 252404659 256687219
9753B56687219N433532K814900n152441j5487839k5583869l1824757l2803685
$$ 256687219 262120751 264935651 259783210 244295371 218711502 186886745 154083060
9746A54083060l0687784k6879056k2057106j6986864j2348420q609283n982277
$$ 154083060 123395276 96516220 74459114 57472250 45123830 36514547 30532270
9739C0532270m196736l066109k377754j980174j736063j518399j364631j222161
$$ 30532270 26335534 23269425 20891671 18911497 17175434 15657035 14292404 13070243
9731A3070243j071954r70595q75142q15250q04473p79048o76864o22932n58911
$$ 13070243 11998289 11027694 10152552 9337302 8532829 7753781 7076917 6453985 5895074
9722E895074m98283m51611l88712l67398l08469k74104k75617k54961k09728k08249
$$ 5895074 5396791 4945180 4556468 4189070 3880601 3606497 3330880 3075919 2866191 2657942
9712B657942j89776j68781j74859j57907j12377j06885j29380j23260p2835p6495
$$ 2657942 2468166 2299385 2124526 1966619 1854242 1747357 1617977 1494717 1421882 1345387
9702A345387r0536p4827p8974o4807n4028n0855m4062k6231q6535o0577l4554
$$ 1345387 1254851 1180024 1101050 1036243 982215 931360 887298 861067 774532 713955 679401
9691F79401k3480k3645l0503l9338k8973q204j6586J2795R127j3134k5613l8438
$$ 679401 655921 632276 601773 562435 533462 525258 508672 521467 530594 517460 491847 453409
9679D53409k8877K2808J6519j5607j7464l6965m1029j9584j920p77j1197j2642
$$ 453409 424532 447340 463859 448252 430788 393823 352794 333210 331290 330513 319316 306674
9667C06674k7546k0386l9253j4426L71j5863M740p604k2448k5728j1269J4628
$$ 306674 279128 258742 219489 205063 205434 189571 194311 186707 164259 138531 127262 141890
9655A41890j0185J2444P16R45n21P246m793r514r162j7743j0265J7584m28l44
$$ 141890 131705 144149 144865 145810 145289 152535 147742 138228 129066 111323 101058 118642 118214 117870
9641A17870j2718j6066R992o893j4361j4606L870J5829o817Q889J4623K7942L3618
$$ 117870 105152 89086 99078 92185 77824 63218 67088 82917 76100 84989 99612 127554 161172
9628A61172K0677J625k1458m696l6k7765j8728o876l2617m5810n1012o3830l7577
$$ 161172 181849 183474 162016 157320 157284 129519 110791 103915 71298 25488 -25524 -89354 -126931
9615a26931m0099j9757j2557l2887m1669k5775l3916p2416n5085m3841K504j916
$$ -126931 -167030 -186787 -199344 -232231 -273900 -299675 -333591 -406007 -461092 -504933 -502429 -504345
9603e04345K2907N9391Q1922P5947P0189Q2388O4316Q3590R4470R0982N6352M1545
$$ -504345 -481438 -422047 -340125 -264178 -193989 -111601 -47285 36305 130775 221757 278109 319654
9591C19654M5910K0149K0994m701j6802k9471p623K403m878l0291l2614o449j5038
$$ 319654 365564 385713 406707 402006 385204 355733 348110 350513 345635 315344 282730 276281 261243
9578B61243l3276m988J8313m222k1349J699q819J3448Q637N049L978q811n8628
$$ 261243 227967 222979 241292 237070 215721 217420 208601 222049 230686 235735 239713 230902 172274
9565A72274k2849L3550Q502l5375j6360j8218m712j1492j2936j6193n107J313
$$ 172274 149425 182975 191477 156102 139742 121524 116812 105320 92384 76191 71084 72397
9553G2397K98j3953j2263j9274j2888O876J3357P443m420R639p252J7457O083
$$ 72397 72695 58742 46479 27205 14317 21193 34550 41993 37573 47212 39960 57417 63500
9540F3500p673j8332J6384J8653j5008k8861M0400K7853K000K922n191j765j5795
$$ 63500 55827 37495 53879 72532 57524 28663 69063 96916 98916 101838 96647 94882 79087
9527G9087l726o402q019j0943q561j972K2200q420q960j3519J378J3565J1287
$$ 79087 75361 68959 60940 49997 41436 39464 61664 53244 44284 30765 32143 45708 56995
9514E6995l440j1306J4627O076Q277j0460j5153j0851J6804K3543k2412k0278
$$ 56995 53555 42249 56876 62952 71229 60769 45616 34765 51569 75112 52700 32422
9502C2422L500j7794r454p926j443j3701j6406L754o179r233J5525P559k2537
$$ 32422 35922 18128 8674 748 -695 -14396 -30802 -27048 -33227 -42460 -26935 -19376 -41913
9489d1913q480L544l891M971P721K580j1523M179K0873R449k2381n47J0219q749
$$ -41913 -50393 -46849 -50740 -45769 -38048 -35468 -46991 -42812 -21939 -12490 -34871 -35418 -25199 -33948
9475c3948O860J5197M167M211O95J3651L4793R075k0898k6823o710K2409Q793
$$ -33948 -27088 -11891 -7724 -3513 -2818 10833 45626 54701 33803 6980 270 22679 31472
9462C1472o102j075k2486r364N746j0394n281k2410n011J7673R345p13J8734M241
$$ 31472 25370 24295 1809 -7555 -1809 -12203 -17484 -39894 -44905 -27232 -17887 -18600 134 4375
9448D375Q72m634K1166K6677J4382k3205N601M3343J4786J7084K5522K4271M519
$$ 4375 5247 613 21779 48456 62838 39633 45234 88577 103363 120447 145969 170240 174759
9435A74759j3981k6683j8737R45J1916K2773p83k6270m0093l0342j2473J8566
$$ 174759 160778 134095 115358 116303 128219 150992 150209 123939 83846 53504 41031 59597
9423E9597K5913J6249J221l6126Q263r438r488P87j9594j473j0945j369m351j7558
$$ 59597 85510 101759 102980 66854 75117 65679 56191 56978 37384 35911 24966 23597 19246 1688
9409A688k622M249L1641J7260r278k6942O770N900j5305m750j6724j5343J9123
$$ 1688 -934 3315 34956 52216 42938 15996 22766 28666 13361 8611 -8113 -23456 -4333
9396d333l646J4524J185J4750K2910k765M961M13N774K845j659j2670J7184J0589
$$ -4333 -7979 6545 7730 22480 45390 42625 47586 47999 53773 56618 54959 42289 59473 70062
9382G0062k7340k1173N714J4699J8518j6120n884K929J933l769L194J4439K0505
$$ 70062 42722 21549 27263 41962 60480 44360 38476 41405 43338 39569 42763 57202 77707
9369G7707K650r493j823J1740R527n518m347j344J7854M1113K4783K0403M6338
$$ 77707 80357 70864 69041 80781 90308 84790 80443 79099 96953 138066 162849 183252 229590
9356B29590L6670N1980R3405J38629J55928J52783J87926J44293J05138O1962
$$ 229590 266260 318240 411645 550274 706202 858985 1046911 1191204 1296342 1358304
9346A358304L2796J7507J0803J8096k4537j15268j61489j88161j72542j30095
$$ 1358304 1391100 1408607 1419410 1437506 1412969 1297701 1136212 948051 775509 645414
9336F45414j12435j22565p6389n5603o3856l2623m5275p262J5j9501p431j2166
$$ 645414 532979 410414 334025 278422 214566 181943 136668 129406 129421 109920 102489 90323
9324I0323P963j0154n415o115p650o335j6508N23j8882O063o986K2350R687r901
$$ 90323 98286 88132 82717 76602 68952 62617 46109 46632 27750 33813 26827 49177 58864 48963
9310D8963j0085j5832J3682l1381O029J2249Q561K561J3918L8326M576k5287N762
$$ 48963 38878 23046 36728 5347 11376 23625 32186 34747 48665 86991 91567 66280 72042
9297G2042k2330j7934r96n351j0618n045K351r79P127K8136j5540L5534K2230
$$ 72042 49712 31778 30782 25431 14813 9768 12119 11140 18267 46403 30863 66397 88627
9284H8627j5669q788j5528k6423O677P088K193N518p517m80q674p496K0599J6902
$$ 88627 72958 64170 48642 22219 28896 35984 38177 43695 36178 35698 27024 19528 40127 57029
9270E7029M218J2206Q980j5159j8807m372O782K632k973K349J8323j6172k605
$$ 57029 61247 73453 82433 67274 48467 44095 50877 53509 50536 52885 71208 55036 52431
9257E2431N718L778j3490l415L6751J2300m626j3991j6595j7361K2259p192o046
$$ 52431 58149 61927 48437 45022 81773 94073 89447 75456 58861 41500 63759 56567 50521
9244E0521Q185P197J1264O99m227J8528o202o744J8869L912J7041L7615K8692
$$ 50521 58706 65903 77167 77866 73639 92167 85965 79221 98090 102002 119043 156658 185350
9231A85350k2834j7418O100K4226L104J489L894J1397K4832L206Q177L3264O8598
$$ 185350 162516 145098 151198 175424 178528 180017 183911 195308 220140 223346 231523 264787 333385
9218C33385M5520J7062J8309J8588K0537M2467K5882N7331O9143J03692Q6419
$$ 333385 378905 395967 414276 432864 453401 495868 521750 579081 648224 751916 838335
9207H38335J00344J39842J40924J83252K02121K40043L03852L70663M13746N10855
$$ 838335 938679 1078521 1219445 1402697 1604818 1844861 2148713 2519376 2933122 3443977
9197C443977O11136P41976P79896P09742N44692K63186m9323l32750n25540o14259
$$ 3443977 4055113 4797089 5576985 6286727 6831419 7094605 7045282 6712532 6186992 5572733
9187E572733o56826o32361o10024n54949m69312l76478k87287k39312k25301j95995
$$ 5572733 4915907 4283546 3673522 3118573 2649261 2272783 1985496 1746184 1520883 1324888
9177A324888j35330j18320j23054r7234n1816n2112p0677n0597m6409m5572k8880
$$ 1324888 1189558 1071238 948184 850950 799134 747022 676345 625748 579339 533767 504887
9166E04887l7163l9787m0012k4869k2942j0130k087l3073j3391n099j8686k4586
$$ 504887 467724 427937 387925 363056 340114 329984 327897 294824 281433 276334 257648 233062
9154B33062k1623j8964k7849M424Q568m642k3633l4930l1970O642r990j0388P058
$$ 233062 211439 192475 164626 169050 177618 172976 149343 114413 82443 89085 79095 68707 75765
9141G5765P988J424j5805q611K2661k241P463k979o824R062j2875j5530k2006
$$ 75765 83753 85177 69372 60761 83422 81181 88644 85665 78841 87903 75028 59498 37492
9128C7492j1539p967Q1J889Q57l251J7222K5343J3048K4309J560r610L886j7014
$$ 37492 25953 17986 18067 19956 20813 17562 34784 60127 73175 97484 99044 89434 93320 76306
9114G6306l1666p000J8564k557j3675j0455j4730J2392Q694Q427O028J0624j5232
$$ 76306 44640 37640 56204 53647 39972 29517 14787 27179 35873 44300 50328 60952 45720
9101D5720j3668J2873j6189r748r506j5594K601J9132j4535j1731K4440J08r278
$$ 45720 32052 44925 28736 18988 9482 -6112 -3511 15621 1086 -10645 13795 13903 4625
9088D625K3497L5818j8010l6045j5550J0582K156j8541J8087J8162J2367m271
$$ 4625 28122 63940 45930 9885 -5665 4917 7073 -11468 6619 24781 37148 32877
9076C2877k0898O951P03P456m24N507P147K947K1643q442j7042j0165j1368j7405
$$ 32877 11979 18930 19633 27089 26665 32172 39319 42266 63909 55467 38425 28260 16892 -513
9062e13m661J494k451L864K127O116j4477n476J5966K8516r455n224n508L0879
$$ -513 -5174 -3680 -6131 -2267 -140 5976 -8501 -13977 1989 30505 21050 15826 10318 41197
9048D1197K7587p713k2903k0615k5331j0659J2756k085o514J7505K0213m698N653
$$ 41197 68784 61071 38168 17553 -7778 -18437 -5681 -7766 -14280 3225 23438 18740 24393
9035B4393L1256J6579k0044j3170j5797m201o464J1905K557m467K2441J0576j5752
$$ 24393 55649 72228 52184 39014 23217 19016 12552 24457 27014 22547 44988 55564 39812
9022C9812j4648j4045M346J9411J257O765L34k2237p924K6758L894k0419k4536
$$ 39812 25164 11119 15465 34876 36133 42898 43232 20995 13071 39829 43723 23304 -1232
9009a232m758L487O643J8806m860k6315k3016L396K5177P574J346j5920J2399
$$ -1232 -5990 -2503 4140 22946 18086 -8229 -31245 -27849 -2672 4902 6248 -9672 2727
8996B727M766R290J3628j982q761n533J7035J371n459M00M60j4072k0647J2220
$$ 2727 7493 16783 30411 28429 19668 14135 31170 32541 27082 27482 27942 13870 -6777 5443
8982E443J700Q488J2718L729m746M247j1799K44K3727N983j376Q648q015m1975
$$ 5443 7143 15631 28349 32078 27332 31579 19780 20024 43751 49734 48358 57006 48991 7016
8968G016j5673o270J7016J0441o568j0882j653M278r212M647J460j493n574k822
$$ 7016 -8657 -14927 2089 12530 5962 -4920 -6573 -2295 -11507 -6860 -5400 -6893 -12467 -15289
8954a5289k3828J1430Q88L10J495K0382L860n828p129Q565j1949J2211k716M163
$$ -15289 -39117 -27687 -26799 -26489 -24994 -4612 -752 -6580 -13709 -5144 -17093 -4882 -7598 -3435
8940c435L111p463l0432K373J9906J5421K7487J1769P965O009L897j3813k2482
$$ -3435 -324 -7787 -38219 -35846 -15940 -519 26968 38737 46702 52711 56608 42795 20313
8927B0313j9285k4347k3584J6166N651J0106J8829K0234n85j1168o207j0360J479
$$ 20313 1028 -23319 -46903 -30737 -25086 -14980 3849 24083 23498 12330 6123 -4237 -2758
8914b758O367j6901K041o127K8059K9025p899r791l164r394R581j4789o363j7529
$$ -2758 3609 -13292 -11251 -17378 10681 39706 31807 22016 18852 9458 19039 4250 -2113 -19642
8900a9642J0415o778J5054M0053J973m192p339J9866O623o624J722j1599k4501
$$ -19642 -9227 -16005 -951 39102 41075 36883 29544 49410 56033 49409 51131 39532 15031
8887A5031P427J729j7730l577J4889K0446o481J4304k0966l4811N598o863o74
$$ 15031 22458 24187 6457 2880 17769 38215 31734 46038 25072 -9739 -4141 -11004 -11678
8874a1678J4127K0865q642l540k3019j9565J6891J5561M758k3742j4174K3818
$$ -11678 2449 23314 14672 11132 -11887 -31452 -14561 1000 5758 -17984 -32158 -8340
8862h340J2716L5244j025j8744K987J2677J5759l437k3754j3093J4483M463m623
$$ -8340 4376 39620 38595 19851 22838 35515 51274 47837 24083 10990 25473 29936 25313
8849B5313J0587k0332m603q65Q566J3044J2980J1199l981j3558k6440q976R039
$$ 25313 35900 15568 10965 10100 18666 31710 44690 55889 51908 38350 11910 2934 11973
8836A1973K5529N328r470k0754k6724r110J4628M1506N413n572n729l0033j0531
$$ 11973 37502 42830 33360 12606 -14118 -23228 -8600 32906 38319 32747 27018 -3015 -13546
8823a3546J9510J1476l230N299j9131r20L2137J9174m904l4999O99K1750K1799
$$ -13546 5964 17440 14210 19509 378 -542 31595 50769 45865 10866 11565 33315 55114
8810E5114n53j0832n869j943j0767k635j34Q079L557j9391J671J1657m792M013
$$ 55114 54561 43729 37860 35917 25150 22515 22381 30460 34017 14626 16297 27954 23162 27175
8796B7175M374K621R697P922K6233j5402l3804k1252o201J9710K6517J3876K375
$$ 27175 31549 34170 43867 51789 78022 62620 28816 7564 1363 21073 47590 61466 63841
8783F3841P31k4619J1704q288q708J8914K6752J7527p761k1949q556l1212j8026
$$ 63841 64572 39953 51657 43369 34661 53575 80327 97854 90093 68144 59588 28376 10350
8770A0350K1223L6135j508J3606L2738O404j4754k5625J772J1679L328j7869J293
$$ 10350 31573 67708 66200 79806 112544 118948 104194 78569 80341 92020 95348 77479 78772
8757G8772J5787j0351l5310J895L4168O1088R417k151N066k590K1224j616j1630
$$ 78772 94559 84208 48898 50793 84961 146049 155466 153315 158381 155791 177015 175399 163769
8744A63769J7210J0476K985J3427J4210R620N897K8362J9313p303M05J7636N0525
$$ 163769 180979 191455 194440 207867 222077 231697 237594 265956 285269 277966 278371 296007 346532
8731C46532M3888l891m277K1927K9018K0850K5164J3191K3829O128O556k454J4890
$$ 346532 390420 386529 382252 404179 433197 454047 479211 492402 516231 522359 528915 526461 541351
8718E41351K9571J3892J0506l908j0207K1060J6145N860J3988j116K0882K5266
$$ 541351 570922 584814 595320 591412 581205 602265 618410 624270 638258 637142 658024 683290
8706F83290P231j9171j5768j4435k0443K345J0106l6681k2038j1297r138J4606
$$ 683290 690521 671350 655582 641147 620704 623049 633155 596474 574436 563139 554001 568607
8694E68607j3588k6275p082j552p341l8715k3247r773k7744k699k6838n9796j4434
$$ 568607 555019 528744 521662 520110 512769 474054 450807 441034 413290 410591 383753 323957 309523
8681C09523Q619j0797l301j2213j013j1643o517j0188j0351k6575k1308k1534
$$ 309523 318142 307345 304044 291831 290818 279175 272658 262470 252119 225544 204236 182702
8669A82702k7385n725o693j6558q560L584J2445Q211n415l053j5619J4950M923
$$ 182702 155317 149592 142899 126341 117781 121365 133810 142021 136606 133553 117934 132884 137807
8656A37807o111r2J3339r932j4310o660o029M0j1282O568K452O351j0801J5332
$$ 137807 131696 131604 144943 135011 120701 114041 108012 108052 96770 103338 105790 112141 101340 116672
8642A16672q915k7232k7435J016J7363O497J4474n539j6961j8933j2093N080L0202
$$ 116672 107757 80525 53090 54106 71469 77966 92440 86901 69940 51007 38914 43994 74196
8629G4196P524l1808k343l832n028j0150J803k69J6970N1150j632k2830j597K05
$$ 74196 81720 49912 47569 43737 38709 28559 30362 30093 47063 98213 96581 73751 72154 72359
8615G2359l038k0672j2840n615K4715j5863j0514M401M592K4770K123J1840K8308
$$ 72359 69321 48649 35809 30194 54909 39046 28532 32933 37525 62295 64418 76258 104566
8602A04566k5297j6495k827j9875n904J8509R271n752j4832K66K6653P563j0944
$$ 104566 79269 62774 59947 40072 34168 52677 61948 56196 41364 41630 68283 75846 64902
8589F4902J5383K5183M948M327R622P855J0569j6941r629l2090q321J2477L1345
$$ 64902 80285 105468 110416 114743 124365 132220 142789 125848 116219 84129 75808 88285 119630
8576A19630j068J3149p032N092K547j9161k1168J2459J9806J2984j1789k861K5602
$$ 119630 118562 131711 124679 129771 132318 113157 91989 104448 124254 137238 125449 122588 148190
8563A48190K4524k54M3631M0759K8852K7485L1404M7235K1383O1473P4057Q9609
$$ 148190 172714 172460 216091 256850 285702 313187 344591 391826 413209 474682 548739 638348
8551F38348J03336R6604J18008J38436J99681K55062L29947M97150Q02394J437294
$$ 638348 741684 838288 956296 1094732 1294413 1549475 1879422 2376572 3178966 4616260
8541D616260K628531M055599L705354L74260k362043k184482j849975k057654
$$ 4616260 7244791 11300390 15005744 15380004 13017961 10833479 8983504 6925850
8533F925850j991915j543166j024465o09409l55501k26069j65909r8155l8257
$$ 6925850 4933935 3390769 2366304 1756895 1401394 1175325 1009416 911261 873004
8524H73004N233q245l0850o5064m3095m559j0421k1973K9952N1364M6358O4388
$$ 873004 878237 869992 839142 774078 730983 726424 716003 694030 723982 775346 821704 886092
8512H86092O8336Q5879J13047J65459J66818K23236L24444N27501R01337J621494
$$ 886092 954428 1040307 1153354 1318813 1485631 1708867 2033311 2560812 3462149 5083643
8502E083643K895125M128649L119824n02220k504371k042532j852896k067816
$$ 5083643 7978768 12107417 15227241 14725021 12220650 10178118 8325222 6257406
8494F257406j877436j408296q85494n34905l65043k06603j18756q5839l7670m0039
$$ 6257406 4379970 2971674 2086180 1551275 1186232 979629 860873 775034 737364 697325
8484F97325n3053m0857o0551o2696o0152o7731m2704k4936l1611l1649j6049l969
$$ 697325 644272 603415 542864 480168 420016 352285 309581 284645 253034 221385 205336 201367
8472B01367J126l2440n589M025j1984n729k8762k2031j6409o83j5075j4586L730
$$ 201367 202493 170053 164464 168489 156505 150776 122014 99983 83574 82891 67816 53230 56960
8459E6960k879l623J6526q619l124j9630p893M670l161o679K3404j8067k3415
$$ 56960 54081 50458 66984 58365 55241 35611 27718 32388 29227 22548 45952 27885 4470
8446D470p799l080J6967J4882K0192O88k335N636L820J407k8418r923N265J353
$$ 4470 -3329 -6409 10558 25440 45632 46320 43985 49621 53441 54848 26430 16507 21772 23125
8432B3125l488q735j2459j7346p542K7465L4478j0660l3679N43J9306J3302N33
$$ 23125 19637 10902 -1557 -18903 -26445 1020 35498 24838 -8841 -8298 11008 24310 24843
8419B4843M149j9592k2380l76K890j2403N082J6982K7867L271k0873N675N411
$$ 24843 28992 9400 -12980 -13356 -10466 -22869 -17787 -805 27062 30333 9460 15135 20546
8406B0546j0177k3959J899n241p959o327j5311J4461J7628p405n576J1597L195
$$ 20546 10369 -13590 -11691 -16932 -24891 -31218 -46529 -32068 -14440 -21845 -27421 -15824 -12629
8393a2629j9320J3573J8184O84p497J0093K653j1300j1211k499K591K2226R793
$$ -12629 -31949 -18376 -192 492 -7005 3088 5741 -5559 -16770 -19269 -16678 5548 15341
8380A5341n165N893J3666J864j5785j9877j0875J8513p399j9233J1814J083O665
$$ 15341 10176 16069 29735 31599 15814 -4063 -14938 3575 -3824 -23057 -11243 -10160 -3495
8367c495O452j0479j6830j5113P366J1179J6095K031l4062k2234k059J5180J5902
$$ -3495 2957 -7522 -24352 -39465 -32099 -20920 -4825 -2794 -36856 -59090 -61149 -45969 -30067
8354c0067j1702j3171J0629K6968K1111j098k0157k3218j2982N083K0478J1193
$$ -30067 -41769 -54940 -44311 -17343 3768 2670 -17487 -40705 -53687 -48604 -28126 -16933
8342a6933J9911J7309Q033q866J754l619j3465K710N703J8691q316j4171j28o93
$$ -16933 2978 20287 28320 19454 21208 17589 4124 6834 12537 31228 22912 8741 8613 7920
8328G920l2907k4542J4286K6808p884j2784L0141K8617o167R455k5162l2368k9897
$$ 7920 -24987 -49529 -35243 -8435 -16319 -29103 1038 29655 23488 32943 7781 -24587 -54484
8315e4484R564J5020K909P273M387L024k792J7611K714l187P375l253J550j3925
$$ -54484 -44920 -29900 -26991 -19718 -15331 -12307 -15099 2512 5226 2039 9414 6161 7711 -6214
8301f214R93K2866J1890j4630j361M552K1484k8072l5480j4586r898P352l66K5206
$$ -6214 -5221 17645 29535 14905 13544 18096 39580 11508 -23972 -38558 -48456 -41104 -41470 -16264
8287a6264p244k014K4134j3258k5610m013J2983K0647J8220Q455m135j0482k3598
$$ -16264 -23508 -25522 -1388 -14646 -40256 -44269 -31286 -10639 7581 16036 11901 1419 -22179
8274b2179j2734K991N422J6687k0979q49M862Q108j5694p816J6479J1181K4928
$$ -22179 -34913 -31922 -26500 -9813 -30792 -31641 -26779 -18671 -34365 -42181 -25702 -14521 10407
8261A0407N619P276j5612j5583j8240m83J0501p041j8673L516J9107J1981J6686
$$ 10407 16026 23302 7690 -7893 -26133 -26616 -16115 -23156 -41829 -38313 -19206 -7225 9461
8248I461r36k2424j8512J8652K7236J676l2207j5193J1155k0555O546K1211j5447
$$ 9461 8525 -13899 -32411 -13759 13477 15153 -17054 -32247 -21092 -41647 -35101 -13890 -29337
8235b9337l6568j732M804M878K3921k838j2282P458K1546K2291K5846o317r298
$$ -29337 -65905 -67637 -62833 -57955 -34034 -36872 -49154 -41696 -20150 2141 27987 21670 12372
8222A2372n467J1448L262j2516J0818j7319n482J752J458j8179J3422J3063L792
$$ 12372 6905 18353 21615 9099 19917 2598 -2884 -1132 326 -17853 -4431 8632 12424
8209A2424K4986k8187j1007M72K306J1307Q394O37K884l6857j992N993K9529P908
$$ 12424 37410 9223 -1784 -1312 994 12301 20695 21332 24216 -12641 -14633 -8640 20889 28797
8195B8797l2151q38O967j6079j1233m512K3931J9095j9564n7O2K4680m40J2631
$$ 28797 -3354 -4192 2775 -13304 -24537 -29049 -5118 13977 -5587 -5644 -5582 19098 18658 31289
8181C1289j7207p278k024j0098j0023J2411q548K0319P493j9480j4497o087j5651
$$ 31289 14082 6804 4780 -5318 -15341 -2930 -11478 8841 16334 -3146 -17643 -23730 -39381
8168c9381N234L1147J3033p044n458j3580p983J8122K5045m235m413j7471K8685
$$ -39381 -34147 -3000 10033 2989 -2469 -16049 -24032 -5910 19135 14900 10487 -6984 21701
8155B1701J0630j653m814m541N2k4211j0681O320J3851J289j6830p452L2014K8953
$$ 21701 32331 30678 25864 21323 21375 -2836 -13517 -7197 6654 7943 -8887 -16339 15675 44628
8141D4628Q391K8611j3507j8468O037J2409p359l2693j1245j0374J4500J0313
$$ 44628 53019 81630 68123 49655 55692 68101 60742 28049 16804 6430 20930 31243
8129C1243j4793J944J6034q645j900p892n0817k9897J9702J9751K0566J1852P142
$$ 31243 16450 18394 34428 25783 23883 15991 -34826 -64723 -45021 -25270 -4704 7148 14290
8116A4290m556k7034q001J4396O389r904m520p03R192o340q60K0354K0670R401
$$ 14290 9734 -17300 -25301 -10905 -4516 -14420 -18940 -19643 -10451 -16791 -17651 2703 23373 32774
8102C2774l586J7615J1359R450j0277l1197l7854R367J5061N839N306n2l7647
$$ 32774 29188 46803 58162 67612 57335 26138 -11716 -2349 12712 18551 23857 23805 -13842
8089a3842q342K948k377q546M444J3648P926J8386K4722J4320m193j6471j0281
$$ -13842 -22184 -19236 -21613 -30159 -25715 -12067 -4141 14245 38967 53287 49094 32623 22342
8076B2342j569j2687k2021j473Q159K3211P582r7k9774j7565K488J3313J1909
$$ 22342 20773 8086 -13935 -15408 -7249 15962 23544 23447 -6327 -23892 -21404 -8091 3818
8063C818J3777N645j2787j2782J0466K1324n869Q287j0468N153J1031K725k1934
$$ 3818 17595 23240 10453 -2329 8137 29461 23592 31879 21411 26564 37595 40320 18386
8050A8386j2656k4026m577M135J8201P93q043j3225p587K9140R246j1131m089
$$ 18386 5730 -18296 -22873 -18738 -537 256 -7787 -21012 -28599 541 9787 -1344 -5433
8037e433o617J696J5078J3554n236k4441n202P203L1539o986J4524J3464J6455
$$ -5433 -12050 -10354 4724 18278 13042 -11399 -16601 -9398 22141 15155 29679 43143 59598
8024E9598M299j9607j6967j6913J1837O029j2561Q229q272q460j4391j466k6157
$$ 59598 63897 44290 27323 10410 22247 28276 15715 23944 15672 7212 -7179 -8645 -34802
8011c4802j6408L4249M4074l961J590p640m171J9727J15j4033j2668l591J1569
$$ -34802 -51210 -16961 27113 23152 24742 17102 12931 32658 32773 18740 6072 2481 14050
7998A4050P296k519m53M90P907j6204N848J9676L886K950P47K144q080p044k5111
$$ 14050 21346 18827 18374 18864 26771 10567 16415 36091 39977 42927 43674 45818 37738 30694 5583
7983E583j5171q094J0659K0717L204r352m455m00k6635k089K6107K254q064P070
$$ 5583 -9588 -17682 -7023 13694 16898 7546 3091 2691 -23944 -26033 74 2328 -5736 1334
7969A334j685j4217j2526J8142K269P907o646K37P732l440l190K5961M307j6690
$$ 1334 -351 -14568 -27094 -8952 -6683 1224 -5422 -5185 2547 -893 -4083 21878 26185 9495
7955I495m728J0341r404p703O111Q414P98j1855P647N850n613k950p730r859N645
$$ 9495 4767 15108 5704 -1999 4112 12526 13324 1469 9116 14966 9353 6403 -1327 -11186 -5541
7940e541j74k757J2881O548p646r565j6081k0238p420L1466L4972l179l5212K969
$$ -5541 -5715 -8472 4409 10957 3311 -6254 -22335 -42573 -49993 -18527 16445 13266 -21946 -18977
7926a8977n355Q80J4851M583p938j9003k630K3863J3007K189L595R398N41J0467
$$ -18977 -24332 -23452 -8601 -4018 -11956 -30959 -33589 -9726 3281 5470 9065 18463 19004 29471
7912B9471O976R242k3170o312n104J7493K0987k2727k8577j078K5534Q902j0035
$$ 29471 36447 45689 22519 16207 11103 28596 49583 26856 -1721 -2799 22735 31637 21602
7899B1602J5230j4634J5327J4516j5952j3708k8092R463J9917p83J679J5099k6358
$$ 21602 36832 22198 37525 52041 36089 22381 -5711 3752 23669 22886 24565 39664 13306
7886A3306j0530j0789Q328R655k7399o915L113K8125K4506p617M759J4551r959
$$ 13306 2776 -8013 315 9970 -17429 -24344 -21231 6894 31400 23783 28542 43093 33134
7873C3134k570j1895j5689j1700r721j8042P87R961Q280K877L105m032p614L727
$$ 33134 30564 18669 2980 -8720 -18441 -36483 -35696 -25735 -17455 -14578 -11473 -15505 -23119 -19392
7859a9392M758j7501j7170P996J7391k19M074n601J1665Q356K460M970K0090K3715
$$ -19392 -14634 -32135 -49305 -41309 -23918 -24137 -20063 -25664 -13999 -5643 -3183 1787 21877 45592
7845D5592j7135l788j4730M743K2010J048l6285l1062j383J8513J8145Q499p089
$$ 45592 28457 24669 9939 14682 36692 37740 1455 -29607 -30990 -12477 5668 14167 7078
7832G078Q3K652m674O257j2100o228N626J9285r240l896p036j0871n597m102R760
$$ 7078 7161 9813 5139 11396 -704 -6932 -1306 17979 8739 4843 -2193 -13064 -18661 -22763 -13003
7817a3003L0649j2778n492j3580j4151r790K0267n65j2147p532m227M900K7962
$$ -13003 17646 4868 -624 -14204 -28355 -38145 -17878 -18443 -30590 -38122 -42349 -37449 -9487
7804i487K3163J5598l2147j9629M455N488j129k7798J5748J8334K327P151r739
$$ -9487 13676 29274 -2873 -22502 -18047 -12559 -13688 -41486 -25738 -7404 -5077 2074 -7665
7791g665q657j5391o917M256j5322o385O667K1256K1322q226j8537p572j950q015
$$ -7665 -16322 -31713 -38630 -34374 -49696 -56081 -49414 -28158 -6836 -15062 -33599 -41171 -43121 -51136
7777e1136J7280l666J2302r582j7467K1461J8919M31k0272J992Q561k508o518
$$ -51136 -33856 -37522 -25220 -34802 -52269 -30808 -11889 -11458 -31730 -29738 -21177 -23685 -30203
7764c0203J0589J9546J0356j3761j8355p121O578J1487R938j7168k4444N79J4451
$$ -30203 -19614 -68 10288 -3473 -21828 -28949 -22371 -10884 -946 -18114 -42558 -41979 -27528
7751b7528J8215J6323j9630l5640n345l036L452J6583R024J7576o399J051m84
$$ -27528 -9313 7010 -12620 -48260 -53605 -56641 -53189 -36606 -27582 -10006 -16405 -15354 -15838
7738a5838K2330J6989l0724j9496J3969J0088j8332l1652R762K263R178J0205
$$ -15838 6492 23481 -7243 -26739 -12770 -2682 -21014 -52666 -42904 -40641 -31463 -21258
7726b1258j5453M869K3733k2858m49J5041j4248k2828m115J5314J3032J7391O430
$$ -21258 -36711 -31842 -8109 -30967 -31416 -16375 -30623 -53451 -57566 -42252 -29220 -11829 -5399
7713e399L199j7013J3708P745p934r514J1343j513L366J1164j7786Kp59j52K050
$$ -5399 -2200 -19213 -5505 2240 -5694 -15208 -3865 -5378 -2012 9152 -8634 -8632 -9391 -9543 -7493
7698g493J643n11J5752J343n491Q3J0287j9095k9131r89K2723n649n622J6328
$$ -7493 -5850 -6361 9391 10734 5243 5326 15613 -3482 -32613 -33602 -10879 -16528 -22150 -5822
7684e822N700p094n999j1663J6071J5977j3331j1609l663K1911p518k5427K549
$$ -5822 -122 -7216 -13215 -24878 -8807 7170 -6161 -17770 -21433 478 -7040 -32467 -29918
7671b9918J3906j883j1892k4244j1052K939J5235J2639L665J1125P332K142j0270
$$ -29918 -16012 -17895 -29787 -54031 -65083 -62144 -46909 -34270 -30605 -19480 -12148 -10006 -20276
7658b0276K1679J2887m831q224J120l21o073j0587J0935J1659k4568k3357q240
$$ -20276 1403 14290 9459 1235 2355 2034 -4039 -14626 -3691 7968 -16600 -39957 -48197
7645d8197K5521J1251Q494K7380k727j0549l4969k0086J0946O888O701P935K932
$$ -48197 -22676 -11425 -2931 24449 21722 11173 -23796 -43882 -32936 -26048 -19347 -11412 -8480
7632h480R870J1201j2544K1601L5062k4326m6438j0679J9117J0791j3043j3458
$$ -8480 1390 12591 47 21648 56710 32384 -14054 -24733 -5616 5175 -7868 -21326
7620b1326P394J1368Q323N819O79j7862k1751j564K7833K1157q941P43j4649k0948
$$ -21326 -13932 -2564 5759 11578 12257 -5605 -27356 -28920 -1087 20070 11129 11872 -2777 -23725
7606b3725m25N124K248Q820O760O610r059n558r468J480q221K7767J8076p427
$$ -23725 -24150 -19026 -16778 -7958 -1198 5412 -3647 -9205 -18673 -17193 -25414 2353 20429 13002
7592A3002j1079J0207K658O116N896j2111q472J3433M297l2800j2711j574L9111
$$ 13002 1923 12130 14788 20904 26800 14689 6217 19650 23947 -8853 -21564 -23138 15973
7579A5973J3917k5311k6937m750J6818J0690J1251J1488l51j7905L695K747k2575
$$ 15973 29890 4579 -22358 -27108 -10290 400 11651 23139 22788 4883 8578 11325 -11250
7566a1250n367K5336Q746J3371L144j5814k5239m434K0087M327k7248j3852r381
$$ -11250 -16617 8719 17465 30836 33980 18166 -7073 -11507 8580 12907 -14341 -28193 -37574
7553c7574K726K2315j699J1621P602O70m117J1643P769L002j884J4906o109m147
$$ -37574 -34848 -12533 -14232 -2611 4991 5661 1544 13187 20956 23958 22074 36980 30871 26724
7539B6724J8463O904l4965l1725j7035J4796P769R684k3899j3911J8071o317m0685
$$ 26724 45187 52091 17126 -14599 -31634 -16838 -9069 615 -23284 -37195 -19124 -25441 -66126
7526f6126k620J4013K49J2789J1822J1602J0584J8014J0640p832p851j6567p556
$$ -66126 -68746 -54733 -54484 -41695 -29873 -18271 -7687 10327 20967 13135 5284 -11283 -18839
7513a8839k2825j6721J7363J6804q040K850J5746J4541M86m041l18o354Q252N891
$$ -18839 -41664 -58385 -41022 -24218 -32258 -29408 -13662 879 1365 -2676 -2994 -9348 -1096 4795
7499D795q190o31J0839q050K472J8407k1142K143J0914P021j740j0701P276J2496
$$ 4795 -3395 -4026 6813 -1237 1235 19642 -1500 643 11557 18578 16838 6137 13413 25909
7485B5909o09k676j6289l6938k0499L9172J9395l540j086J704k0990j7334n573
$$ 25909 25300 22624 6335 -30603 -51102 -11930 7465 3925 2839 4543 -16447 -33781 -39354
7472c9354K2108J163j3665j4869k598l216Q56k50J3423L3201l207j5839p11l912
$$ -39354 -17246 -16083 -29748 -44617 -47215 -50431 -49575 -49825 -36402 -3201 -6408 -22247 -22958 -26870
7458b6870K3665L700k3855j088K4054j6289j8071R747M3368n8n139n681j5371
$$ -26870 -3205 495 -23360 -24448 -394 -16683 -34754 -25007 18361 18303 13164 7483 -7888
7445g888O450Q234K5350J0097O681r681k0557k9065l842L56Q040K7825K9263q983
$$ -7888 -1438 6796 32146 42243 48924 39243 18686 -10379 -14221 -13865 -5825 22000 51263 42280
7431D2280k7227j527M193j1499j5808l0510k3498K7711L7434N843j1737k6507
$$ 42280 15053 13526 17719 6220 -9588 -40098 -63596 -35885 1549 7392 -4345 -30852
7419c0852k232J0681K0341r59p088j6717k2938k1858R322J3161K7539K3545l189
$$ -30852 -33084 -22403 -2062 -3021 -10109 -26826 -49764 -71622 -62300 -49139 -21600 1945 -1244
7406a244k0487j5L6986K5495R186l6124j2806O553J5272p98n032j6777n552Q575
$$ -1244 -21731 -21746 15240 40735 49921 13797 991 7544 22816 22018 16986 209 -5343 3232
7392C232J3514j0993k5078j1478K2060n955J4021k6919j6097K8586R709r96k6293
$$ 3232 16746 5753 -19325 -30803 -8743 -14698 -677 -27596 -43693 -15107 -5398 -6394 -32687
7379c2687l993J6252K0535J6263k0714q278o175J01j3970j0792q973J616L4811
$$ -32687 -36680 -20428 107 16370 -4344 -12622 -18797 -18696 -32666 -43458 -52431 -50815 -16004
7366a6004K0110n70K2906r534k7710K157p890j998K3173K1715L008k5551J5124
$$ -16004 4106 3536 26442 16908 -10802 -8645 -16535 -18533 4640 26355 29363 3812 18936
7353A8936m032k399k5407k343j3434r645j9046K5969M0031l589J3651j055J381
$$ 18936 14904 12505 -12902 -15245 -28679 -38324 -57370 -31401 8630 5041 18692 17637 19018
7340A9018j0151k7098l882j5490m543K701L8615J5057l163J5687K497J2661n438
$$ 19018 8867 -18231 -22113 -37603 -42146 -39445 -830 14227 11064 26751 29248 41909 36471
7327C6471K144k946q514N000N461m81j9609K112N957k9467P476K855j6927m357
$$ 36471 38615 35669 27155 32155 37616 37135 17526 19638 25595 -3872 3604 6459 -10468 -14825
7313a4825J3740J8497k668L111n337o919L495l0099K197R422r231j174J7452J9256
$$ -14825 -1085 17412 14744 17855 12518 5599 9094 -21005 -18808 -9386 -18617 -19791 -2339 16917
7299A6917J2461O907j3389m489j5381j2856k285J2288J1172L178K7101o301k3093
$$ 16917 29378 36285 22896 18407 3026 -9830 -12115 173 11345 14523 41624 35323 12230
7286A2230j8236L710J6280L0910n178q644j9318j7680q164p492O894N109n443
$$ 12230 -6006 -2296 13984 44894 39716 31072 11754 -5926 -14090 -21582 -14688 -9579 -15022
7273a5022J4411K381J2026k075Q896O012j2673J186j3981J18P876j2213j1653
$$ -15022 -611 1770 13796 11721 20617 26629 13956 15142 1161 1279 9155 -3058 -14711
7260a4711J5833J5317J0297q130p088n938J3179J0706N344l160j7580j9154j702
$$ -14711 1122 16439 26736 18606 11518 5580 18759 29465 34809 31649 14069 -5085 -6787
7247f787J2785n715m3347k0277L4710P379j7385j5512j7000n440J2794K1555n67
$$ -6787 5998 283 -43064 -63341 -28631 -21252 -38637 -54149 -71149 -76589 -63795 -42240 -42807
7234d2807J1423L586L87j178K2216J0693P31Q20k854j4951J0953J1572O574r097
$$ -42807 -31384 -27798 -27411 -28589 -6373 4320 5051 5871 3017 -11934 -981 10591 17165 8068
7220H068n200j1350j5408j91J0405O251L3823K5651k0303j5578n945K3467j4625
$$ 8068 2868 -8482 -23890 -24081 -13676 -7425 26398 52049 31746 16168 10223 33690 19065
7207A9065k6386N337M160O072J04j1342j3155L693K0880j025r078o612L023j4244
$$ 19065 -7321 -1984 2176 8248 8352 -2990 -16145 -12452 8428 7403 -1675 -8287 -5264 -19508
7193a9508k5670R075J3228P400j4778N88p379J0259K2468K2767O047j439k2405
$$ -19508 -45178 -36103 -22875 -15475 -30253 -29665 -37044 -26785 -4317 18450 24497 23058 653
7180F53j5616p948K5937J2405J06q402j9525O625L088j5773o915P395l221j0829
$$ 653 -14963 -22911 3026 15431 15537 7135 -12390 -5765 -2677 -18450 -25365 -17970 -21191 -32020
7166c2020J53j0223k50l876p321J1921J0680j27J8387J1158j413j4579k1061J2732
$$ -32020 -31867 -42090 -42340 -46216 -53537 -41616 -30936 -31063 -12676 -1518 -2931 -17510 -38571 -25839
7152b5839l896j4461J6273Q531J6730l7028k4629K7542K8658j670q480n42k367
$$ -25839 -29735 -44196 -27923 -19392 -2662 -39690 -64319 -36777 -8119 -9789 -18269 -18811 -21178
7139b1178o063N487K4055j4353j6848l128r785k144L1034M9849J0494l1295k2090
$$ -21178 -27241 -21754 2301 -12052 -28900 -32028 -41813 -43957 -12923 36926 47420 16125 -5965
7126e965o867J4127k4758J1653O984J2268n378J981j0919k2347n410K629J9297
$$ -5965 -12832 1295 -23463 -11810 -4826 7442 2064 4045 -6874 -29221 -34631 -32002 -12705
7113a2705N591j813j0089j7223l836L552N162l712o197K4057M9084J5073O659
$$ -12705 -7114 -8927 -19016 -36239 -40075 -36523 -31361 -35073 -41270 -17213 31871 46944 53603
7100E3603j6905j6565j5707J6093o045m373J966j955P92p227P324J4599J5287
$$ 53603 36698 20133 4426 20519 14474 10101 12067 10112 10904 3677 11001 25600 40887
7087D0887j5795k4246j2696m646j603K0318J9078P861O997Q529l0047j3084J3583
$$ 40887 25092 846 -11850 -16496 -18099 2219 21297 29158 36155 44684 14637 1553 15136
7074A5136o030k7622k1135J9166K8087R63o451j3497Q112J0643J5381o717j7991
$$ 15136 9106 -18516 -39651 -20485 7602 8565 2114 -11383 -3271 7372 22753 16036 -1955
7061a955l3958L85j1497m024J1914J962K2698O098L544j5398j8042J5475q275
$$ -1955 -35913 -35528 -47025 -51049 -39135 -37173 -14475 -8377 -4833 -20231 -38273 -22798 -31073
7048c1073N632J8509j2461o941Q481r692J482m160J9967j3641j2000J996L2149
$$ -31073 -25441 -6932 -19393 -26334 -17853 -27545 -26063 -30223 -10256 -23897 -35897 -33901 -1752
7035a752J7998n554P460K7072J39j3850k5818r589j6761l33N961j4860o987Q06
$$ -1752 16246 10692 18152 45224 45363 31513 5695 -3894 -20655 -20988 -15027 -29887 -36874 -36068
7021c6068j6855j858P192Q764l617J1096N740j8163k329K5003J6709j4768j9458
$$ -36068 -52923 -54781 -47589 -38825 -42442 -31346 -25606 -43769 -46098 -21095 -4386 -19154 -38612
7008c8612P594Q697J146j2024L610N74m100J4198J3192J6166J4351j6194N340
$$ -38612 -31018 -22321 -21175 -33199 -29589 -29015 -33115 -18917 -5725 10441 24792 8598 13938
6995A3938K6321j4907r598j3397k3100O665J5933j2439r004p078q595J3853L0397
$$ 13938 40259 25352 15754 2357 -20743 -14078 1855 -10584 -19588 -26666 -35261 -21408 8989
6982H989J8490j031m306r778j5828k0426O178p276J3545J6714n307L888n201J328
$$ 8989 27479 26448 22142 12364 -3464 -23890 -17712 -24988 -11443 5271 -36 3852 -1349 -21
6968b1j813j1040j0442j6762J021j951n911k499Q197K2359k572k0594j0373j8283
$$ -21 -1834 -12874 -23316 -40078 -39057 -41008 -46919 -49418 -41221 -18862 -21434 -42028 -52401 -70684
6954g0684J0602L7992J6990M302k3070j9012j1304p087J9565P537J4187M3760
$$ -70684 -60082 -22090 -5100 -798 -23868 -42880 -54184 -61271 -41706 -34169 -19982 23778
6942B3778o49k0542k769J4992N997j8785j0965j5926j693p820J0745L6995K551
$$ 23778 23129 2587 -182 14810 20807 2022 -8943 -24869 -26562 -34382 -23637 13358 15909
6929A5909R080l6482m7012j914K6833O077j691k050O656L0781K693j308Q02M695
$$ 15909 24989 -11493 -58505 -60419 -33586 -27509 -29200 -31250 -24594 6187 8880 7572 8374 13069
6915A3069j2822M25R634j382J4098n902K7894K3306j098k0878j1250j9280J2676
$$ 13069 247 672 10306 8924 23022 17120 45014 68320 67222 46344 35094 15814 28490
6902B8490j998m3812l125M913M449J8382O794j4925j486P546j2167L144K671R540
$$ 28490 26492 -17320 -20445 -15532 -11083 7299 14093 -832 -2318 5228 -6939 -3795 -1124 8416
6888H416J0739L597Q07j0043M565q768o335j6275j063J443j2567L297N407k5324
$$ 8416 19155 22752 23559 13516 18081 9313 2978 -13297 -14360 -12917 -25484 -22187 -16780 -42104
6874d2104J4058L1741K3779J2534j0760j3892J077j2977k7156k0448q216L5865
$$ -42104 -28046 3695 27474 40008 29248 15356 16433 3456 -23700 -44148 -52364 -16499
6862a6499K7172p614k5158J449K4758K7935j399N240j3080j7887m268j3305j2332
$$ -16499 10673 3059 -22099 -20650 4108 32043 30644 35884 22804 4917 649 -12656 -24988
6849b4988R739J14j5368L566K3274p512j1758o978l320J5909O87M919K4482j375
$$ -24988 -15249 -15135 -30503 -26937 -3663 -11175 -22933 -29911 -33231 -17322 -16635 -11716 12766 11391
6835A1391K9582J7476j5127l2039r825J453K9347J6713j7788l1369j0236K860
$$ 11391 40973 58449 43322 11283 1458 2911 32258 48971 31183 -186 -10422 -7562
6823g562K589p964p039j4070J6731K7153J0324N648j5357k754k3355P525J3624
$$ -7562 -4973 -12937 -19976 -34046 -17315 9838 20162 25810 10453 7699 -15656 -8131 5493
6810E493N696L090J8938l697j2673l9349j8364M615K2153K989r679k281j2649
$$ 5493 11189 14279 33217 29520 16847 -22502 -40866 -36251 -14098 -11109 -20788 -23069 -35718
6797c5718r209K3512J3176Q641M630O06P437J6990k4144K107K591J8578O390j3632
$$ -35718 -44927 -21415 -8239 402 5032 5638 13075 30065 5921 8028 10619 29197 35587 21955
6783B1955p003J305o889k4056J592J9816j9843n362K831J5879j2946l5272K248
$$ 21955 14952 16257 9368 -14688 -13096 6720 -13123 -18485 -15654 225 -12721 -47993 -45745
6770d5745O601l250L132J06L3334J8861N254j7577m397J5376J9728j3974k4774
$$ -45745 -39144 -42394 -39262 -39156 -5822 13039 18293 716 -3681 11695 31423 17449 -7325
6757g325N263l677j7070j2949J5260K8598J532R454J2110k7137j6434M608J0372
$$ -7325 -2062 -5739 -22809 -35758 -20498 8100 9632 19086 31196 4059 -12375 -7767 2605
6744B605k014l000O644L340Jn77P090O958m650j306j0017K8058J4445j7458p655
$$ 2605 591 -2409 4235 7575 7576 6999 14089 21047 16397 15091 5074 33132 47577 30119 22464
6729B2464q661k2655q509N510K130P307J3964K2607M721j4235J5862J5330k5115
$$ 22464 13803 -8852 -17361 -11851 -9721 -2414 11550 34157 38878 24643 40505 55835 30720
6716C0720l1519N441R139r489K594J6114J660j2797j9996k0676K0145O805Q637
$$ 30720 -799 4642 13781 4292 6886 23000 24660 11863 -8133 -28809 -8664 -1859 6778
6703F778j4839L925J0045j0028m713k919J1176j2944J9852j201j8116j1038J8031
$$ 6778 -8061 -4136 5909 -4119 -8832 -11751 -575 -13519 6333 5132 -12984 -24022 -5991
6690e991k55L547j2696k7379P615J4594J1018K3494k620J470J2671n157K366N770
$$ -5991 -6246 -2699 -15395 -42774 -35159 -20565 -9547 13947 11327 12797 25468 20311 22677 28447
6676B8447k7900j1653O230L723J0053J4978m344l2003m321p287o606j1697K142
$$ 28447 547 -11106 -4876 -1153 8900 23878 19534 -12469 -16790 -24077 -30683 -42380 -40238
6663d0238K1670J5477j1642j0342j1758K8066J3217L754k7437R621Q793l3169
$$ -40238 -18568 -3091 -14733 -25075 -36833 -8767 4450 8204 -19233 -9612 -819 -33988
6651c3988K0179K2059q203J2950J0978K4188k0949l8623j3510P85K3505R130j4472
$$ -33988 -13809 8250 47 12997 23975 48163 27214 -11409 -24919 -24134 -629 8501 -5971
6638e971k8660J824J2273J9854N952l182n417l714P036j096K3030J446n005j7402
$$ -5971 -34631 -32807 -20534 -680 5272 2090 -3327 -7041 -5 -1101 21929 23375 18370 968
6624I68j6175m663K0001j358k8002K126M3200k3485p246M361q5K7115L539n01
$$ 968 -15207 -19870 131 -1227 -29229 -27103 16097 -7388 -14634 -10273 -10358 16757 20296 19795
6610A9795j2043J2593P979k0001R220k282N032j1309p096j709J4016K4497j141
$$ 19795 7752 20345 28324 8323 17543 15261 20293 8984 1888 179 14195 38692 37551
6597C7551k6810k0647Q828K18Q01J1325r429K130J3215k1335j6129J2406K2819
$$ 37551 10741 -9906 -1078 -860 -59 11266 1837 3967 17182 -4153 -20282 -7876 14943
6584A4943L0534o157k3494k0510k3903J0896k51L855P086J8722N925r798K2469
$$ 14943 45477 39320 15826 -4684 -28587 -17691 -17942 -14087 -7001 11721 17646 7848 30317
6571C0317k8099j3758J2240J5256p061J3319P644k653K789j973k1962l702j3802
$$ 30317 2218 -11540 700 15956 8895 22214 29858 27205 29994 28021 6059 2357 -11445
6558a1445J1039P933l377M610L5910N003m158j9187k5898O023L043M995k504o411
$$ -11445 -406 7527 4150 8760 44670 49673 45515 26328 430 6453 9496 14491 11987 5576
6544E576q075K1683J8383M550k8827j5922o421J2748j5949K8599J0985j4512O969
$$ 5576 -2499 19184 37567 42117 13290 -2632 -9053 3695 -12254 16345 27330 12818 19787
6531A9787K3503j823O172J0699r078l5523j7211J1236Q840l6475j2052J6209k090
$$ 19787 43290 41467 47639 58338 49260 13737 -3474 7762 16602 -19873 -31925 -15716 -17806
6518a7806l449q92r924m44m98J0160J5017K723J9444L660k9095j8345J101J6761
$$ -17806 -21255 -22147 -32071 -32515 -33013 -22853 -7836 -5113 14331 17991 -11104 -29449 -28348 -11587
6504a1587k3241j2687L643K0648Q789J1087j3205j9181j3221j4081O092n442J6672
$$ -11587 -34828 -47515 -43872 -23224 -14435 -3348 -16553 -35734 -48955 -63036 -56944 -62386 -45714
6491d5714L8042K6052j2659j9360O28O433l8490n235K6874K4748J1813P99q542
$$ -45714 -7672 18380 5721 -13639 -13011 -6578 -45068 -50303 -23429 1319 13132 13931 5389
6478E389r99j1716k3346O025J0899M068l934K357K3002M042j243j8618j1298k119
$$ 5389 4390 -7326 -30672 -24647 -13748 -9680 -13614 -11257 11745 15787 14544 -4074 -15372 -17491
6464a7491J3255N719l356q783J6506R64r024K795O888j1735k810j0859K489r501
$$ -17491 -4236 1483 -1873 -10656 5850 6814 -2210 585 7473 -4262 -7072 -17931 -15442 -24943
6450b4943P429J1645r589j4541q635j5175J942J7199R526N829l561o020j9278
$$ -24943 -17514 -5869 -15458 -29999 -38634 -53809 -51867 -34668 -25142 -19313 -22874 -28894 -48172
6437d8172o749J7298K2731O795Q388j068j6170R024J5709N274J5583m103j4771
$$ -48172 -54921 -37623 -14892 -8097 291 -777 -16947 -7923 7786 13060 28643 24540 9769
6424I769j4766j6797J1544j6987R897R437j3103N186K807j7161M308J2206J9461
$$ 9769 -4997 -21794 -10250 -27237 -17340 -7903 -21006 -15820 -13013 -30174 -25866 -13660 5801
6411E801J3347J927j1394j0303j1748j8182O787K5528J5164l640j0557j3530L325
$$ 5801 19148 21075 9681 -622 -12370 -30552 -23765 1763 16927 13287 2730 -10800 -7475
6398g475P297L884l101K78j4288j2573J1968P94J3595J7064K791k586q571Q89
$$ -7475 -178 3706 605 883 -13405 -25978 -14010 -13216 379 17443 20234 17648 9077 9966
6384I966j4721n956J2589L3J435J3274k424j4111q376m312K2788J809j456L768
$$ 9966 -4755 -10711 1878 1911 3346 16620 14196 85 -8291 -12603 10185 11994 10538 14306
6370A4306n897J4868j300k8616j867P438j8975o64K1284P655L610m198j2418J4437
$$ 14306 8409 23277 21977 -6639 -8506 -1068 -20043 -20707 577 8232 11842 7644 -4774 9663
6356I663K0919J3576L5o853l093l968j8036m7810j969j668k3718J8138K6335q648
$$ 9663 30582 44158 44193 37340 34247 30279 12243 -35567 -37536 -39204 -62922 -44784 -18449 -27097
6342b7097k1547P518q25K1042K2391Q153K337j5705p57K5182N159J8622q214j1452
$$ -27097 -48644 -41126 -41951 -20909 1482 9635 11972 -3733 -4490 20692 25851 44473 36259 24807
6328B4807j0679n11k6704j2437J2293K874K4442K723j2356k1252J1352P590j545
$$ 24807 14128 13617 -13087 -25524 -13231 -10357 14085 16808 4452 -16800 -5448 2142 597
6315E97J0216J4678k6818k0708J2218m366j6245J356K580N079L0076J2910j9741
$$ 597 10813 25491 -1327 -22035 -9817 -14183 -30428 -29072 -26492 -21413 8663 21573 1832
6302A832j7296o381N829l9280q524J9746J4886J4224l451j1184K743J6091N106
$$ 1832 -15464 -21845 -16016 -55296 -63820 -44074 -29188 -14964 -18415 -29599 -26856 -10765 -5659
6289e659k1716j6239k7N500o383K7847L2131J1183Q09j7899m809j3189j638j82
$$ -5659 -27375 -43614 -43641 -38141 -44524 -16677 15454 26637 27446 9547 4738 -8451 -10089 -10271
6275a0271L856J1016K2425N000O64K08j8076M183K265P997Q56j3964M618L882
$$ -10271 -6415 4601 27026 32026 32690 32898 14822 19005 21270 29267 30123 16159 20777 24659
6261B4659j068r970k5064j1235P45K216J0637j7068l3K0507J7053n937R797j1904
$$ 24659 23591 13621 -11443 -22678 -21933 -19717 -9080 -26148 -26181 -5674 11379 5442 15239 3335
6247C335q009J2143q411M868J2830m05Q545j3608k9213j2356J3152K0757J0430
$$ 3335 -4674 7469 -942 3926 16756 16351 24896 11288 -17925 -30281 -17129 3628 14058
6234A4058m710k4782l8481p040L2091K1250N236o730J4081J7952j293j0128l6757
$$ 14058 9348 -15434 -53915 -60955 -28864 -7614 -2378 -9108 4973 22925 21632 11504 -25253
6221b5253l839j0169O812J1233m752r799L377J4525Q546K7152l3433j2842p248
$$ -25253 -29092 -39261 -32449 -21216 -25968 -35767 -32390 -17865 -9319 17833 -15600 -28442 -35690
6208c5690P151j7570J7910L2584L877k0444l734J0766J7056n181k2779m949K3759
$$ -35690 -28539 -46109 -28199 4385 8262 -12182 -15916 -5150 11906 6725 -16054 -21003 2756
6195B756L3676O548j4182n273o961j5821j3820j927J8175j0999n230q589J0267
$$ 2756 36432 42980 28798 23525 16564 743 -13077 -15004 3171 -7828 -13058 -21647 -11380
6182a1380J7007k6856r519J9046J7549K0413k2840J1809n547n669J2736J449k0016
$$ -11380 5627 -21229 -30748 -11702 5847 26260 3420 15229 9682 4013 16749 18198 -1818
6169a818o298P162K3053n312k3893P930j3814O104L0599l257j8803j0695N67M454
$$ -1818 -8116 -954 22099 16787 -7106 824 -12990 -6886 23713 20456 1653 -9042 -8475 -4021
6155d021J0434J0407j6903M507J6338n461k6730j4031J0794J1756J374j0137N109
$$ -4021 6413 16820 -83 4424 20762 15301 -11429 -25460 -14666 -2910 -1536 -11673 -6564
6142f564k94J3303M646j0779k4566l674M550K08R978K2530j0471Pp19l651Q969
$$ -6564 -6858 6445 11091 312 -24254 -27928 -23378 -23170 -13192 9338 -1133 -1126 -1845 -5496 3473
6127C473j3987k0221M135J7603j0582J4352J5372q532J004K432j7955l834K826
$$ 3473 -10514 -30735 -26600 -8997 -19579 -5227 10145 1613 2617 5049 -12906 -16740 -13914
6114a3914J0919j7228j8269J4638J2910R810J5914p530J864R943k405O976k1049
$$ -13914 -2995 -20223 -38492 -23854 -10944 -1134 14780 7250 9114 19057 16652 23628 2579
6101B579k830j3487J6057J3277K9112K2217K2806l1298j7485L150j5408k6557
$$ 2579 -251 -13738 2319 15596 44708 66925 89731 58433 40948 44098 28690 2133
6089B133m775K3977J9329l7938K672Q805j4683M908M451j2484k308j004j730j7732
$$ 2133 -2642 21335 40664 2726 5398 14203 -480 4428 8879 -3605 -5913 -6917 -8647 -26379
6075b6379K9256R194l3519j6229J8040P889k0735J7235M361j8553j4108K1025
$$ -26379 2877 12071 -21448 -37677 -19637 -11748 -32483 -15248 -10887 -29440 -43548 -22523
6063b2523L4299P106k6566q585Q300O722M388k230j3288J2488J7809r49n030R52
$$ -22523 11776 18882 -7684 -16269 -7969 -1247 3141 911 -12377 111 17920 16971 11941 12893
6049A2893l048q594l927j201j4697J3588J3184O42K484k967P179J2639k2403L901
$$ 12893 9845 1251 -2676 -3877 -18574 -4986 8198 8840 11324 8357 15536 28175 5772 9673
6035I673j5695l752r08P953m801P359r052j5478n903K518N683k414j4376m113
$$ 9673 -6022 -9774 -10682 -2729 -7530 -171 -9223 -24701 -30604 -28086 -22403 -24817 -39193 -43306
6021d3306j6751J872K7110K2587P795j203N636j2313j2201L073J1771j1178n809
$$ -43306 -60057 -58185 -31075 -8488 -693 -1896 3740 -8573 -20774 -17701 -5930 -17108 -22917
6008b2917Q87K090j6833P38J7703P019Q888N160m866J2394j4841l0302k279o740
$$ -22917 -22030 -19940 -36773 -36035 -18332 -11313 -2425 2735 -2131 10263 -4578 -34880 -37159 -43899
5994d3899K067R165Q52K629K5462N527p879L1577J362o918K927n848j0831j3831
$$ -43899 -41832 -32667 -31815 -29186 -3724 1803 -6076 25501 26863 19945 22872 17024 6193 -7638
5980g638m715K7622K7025m494N353j5668l1054j989j8040J0931J3056J5626l104
$$ -7638 -12353 15269 42294 37800 43153 27485 -3569 -5558 -23598 -12667 389 16015 12911
5967A2911J5713Q131q570k1058k0642J1569j5595j427K2301K421Q508j1543q506
$$ 12911 28624 36755 28185 7127 -13515 -1946 -17541 -18968 3333 5754 14262 2719 -5787
5954e787L901K192J1378n484k888n268j2308j680J9489J6934j0631j9514j8483
$$ -5787 -1886 306 11684 6200 3312 -1956 -14264 -15944 3545 20479 9848 -9666 -28149
5941b8149N03J0896J2892J2735K0290N155J7775m4277j7144n079n404L654J7405
$$ -28149 -27646 -16750 -3858 8877 29167 34322 52097 7820 -9324 -14403 -19807 -16153 1252
5928A252l370k759P196J1508j0080j9232k4125m293M1762J1140P154j459j281
$$ 1252 -2118 -4877 2319 13827 3747 -15485 -39610 -43903 -2141 8999 16153 14694 13413
5915A3413p836j4070j7594J2367K116J3588J3840J4428k1071k8082J8422L0190
$$ 13413 5577 -8493 -26087 -13720 -11604 1984 15824 30252 9181 -18901 -479 29711
5903B9711R937k4701j3110l170J331k2747j3138n805l786J9051j760J8140K6382
$$ 29711 39648 14947 1837 -1333 -2 -22749 -35887 -41692 -45478 -26427 -28187 -10047 16335
5890A6335M711j4621j0602m345j3430p328J2568j802j1479m227k0779J8210J6197
$$ 16335 21046 6425 -4177 -8522 -21952 -29280 -16712 -18514 -29993 -34220 -54999 -36789 -20592
5877b0592J9284O064M484k1426j2196k769k502J4408K5997m545k9353p827j569
$$ -20592 -1308 4756 9240 -12186 -24382 -27151 -29653 -15245 10752 6207 -23146 -30973 -32542
5864c2542K432n46N314k9935M335K1761K0867K7690R942l3963k8669R243K111
$$ -32542 -30110 -30656 -25342 -55277 -50942 -29181 -8314 19376 29318 -4645 -33314 -24071 -21960
5851b1960l131J5320J8889l095j1533j625j6838L991J601m302J9831P650j6465
$$ -21960 -25091 -9771 9118 6023 -5510 -7135 -23973 -19982 -18381 -22683 -2852 4798 -11667
5838a1667J4391O795Q272K072j0457k4278j1214j685J8161o368k76p699l322J7140
$$ -11667 2724 9519 17791 19863 9406 -14872 -26086 -27771 -9610 -15978 -16254 -23953 -27275 -10135
5824a0135j739j721O657j4102R51K7181J1398k626j5539k1990k3120k780L8529
$$ -10135 -11874 -13595 -6938 -21040 -20089 7092 18490 15864 325 -21665 -44785 -47565 -9036
5811i036M7443M567k9653j2l722k4259P157J3120P305l183k6539J0648Q742q484
$$ -9036 38407 42974 13321 13309 9587 -14672 -7515 5605 12910 9727 -16812 -6164 2578 -5906
5797e906R10P207k465j9912k3230O008j601J4416J9657J1652k1792m401J7395
$$ -5906 -4996 2211 -254 -20166 -43396 -37388 -38989 -24573 -4916 6736 -15056 -19457 -2062
5784b062J4526q52k2234o646o20m978J3093J8962l606R265j1165M197r72N113
$$ -2062 12464 11612 -10622 -17268 -17888 -22866 -9773 9189 5583 14848 3683 7880 6908 12021
5770A2021j351J5595l050p677m186l157o029J025L3197J8633L179j4095k2250
$$ 12021 10670 26265 23215 15538 11352 8195 2166 3191 36388 55021 58200 44105 21855
5757B1855n31j7730J0137K8873m164k271J878l7078j5382J5026J1175M198q543
$$ 21855 21324 3594 13731 42604 38440 36169 38047 969 -14413 613 11788 15986 7443
5744G443J5426j6823q680M222J3457o970j4368K1126O627p583Q332j6204J061
$$ 7443 22869 6046 -2634 1588 15045 8075 -6293 14833 21460 13877 22209 6005 7066
5731G066j791k2907k5133L850K4767k786k4791l64J5703q566J1039O048r117J0373
$$ 7066 5275 -17632 -42765 -38915 -14148 -16934 -41725 -42089 -26386 -34952 -23913 -17865 -26982 -16609
5717a6609J4508J6130J5509o835j8198k209j0965j2420K0403O516j1316J2015
$$ -16609 -2101 14029 29538 22703 4505 2296 -8669 -21089 -686 5830 -5486 6529
5705F529K4303K2727k6301j7046j2703P58k3957N989K9778K0446j6853j6299P197
$$ 6529 30832 53559 27258 10212 -2491 -1733 -25690 -19701 10077 30523 13670 -2629 4568
5692D568L650m955M572k0598O575J3105J0980N931p181j990n147j4416k683o418
$$ 4568 8218 3263 7835 -12763 -6188 6917 17897 23828 16647 14657 9510 -4906 -7589 -14007
5678a4007o135k65K2004m416k2194O071J6169J0382J3024J1000M337K0024R645
$$ -14007 -20142 -20407 1597 -2819 -25013 -18942 -2773 7609 20633 31633 35970 55994 65639
5665F5639j4977m5205k6839O388j4503k2467J275K3330M319l436p888k269N26
$$ 65639 50662 5457 -21382 -14994 -29497 -51964 -50689 -27359 -23040 -26476 -34364 -36633 -36107
5652c6107J4206K6616J07R388L30m512J9142K2877m272k0105k0440j0020n837
$$ -36107 -21901 4715 4822 14210 14540 10028 29170 52047 47775 27670 7230 -2790 -8627
5639h627k9451J1790J3833O239n341k8519j4664J5088L8740L8174m869j9881J052
$$ -8627 -38078 -26288 -12455 -6216 -11557 -40076 -54740 -39652 -912 37262 32393 12512 13564
5626A3564j0856M840P023r254J2005R32j8451j0645o952N968N327J6940n140L136
$$ 13564 2708 7548 14571 5317 17322 18254 -197 -10842 -17794 -11826 -6499 10441 5301 8437
5612H437j3227l548K037P632r713n006N177n830r464J4737J2986k1954r698O839
$$ 8437 -4790 -8338 -6301 1331 -8382 -13388 -8211 -14041 -23505 -8768 4218 -17736 -27434 -20595
5598b0595N0609J064k2270o287k4442J1906O384R822J2240K0195j4714P860j0758
$$ -20595 30014 31078 8808 2521 -21921 -10015 -3631 6191 18431 38626 23912 31772 21014
5585B1014j0623j797k7318l829j2945J1886J6048J4392o246M275K533O989j631
$$ 21014 10391 8594 -18724 -22553 -35498 -23612 -7564 6828 582 4857 7390 14379 12748
5572A2748L777j7438K8416P844k1638q425o588K047o628k4209K3167J1135q435
$$ 12748 16525 -913 27503 35347 13709 5284 -1304 743 -5885 -30094 -6927 4208 -4227
5559d227J1999N288J3595p337l3445k7003K4131J9838L255n441O965R854k625
$$ -4227 7772 13060 26655 19318 -14127 -41130 -16999 2839 6094 653 7618 17472 14847
5546A4847j8401O838j2504j2013j1793K972n677K418J2557L590J137J7447R050
$$ 14847 -3554 3284 -9220 -21233 -33026 -30054 -35731 -33313 -20756 -17166 -16029 1418 10468
5533A0468r008J1027Q512m269j6242p808j7412q030Q148K3271J9590N656k7115
$$ 10468 1460 12487 20999 16730 488 -7320 -24732 -32762 -24614 -1343 18247 23903 -3212
5520c212J2175N952k1316m843J890P240Q190j0259j5703M754J0041N444J0406
$$ -3212 8963 14915 -6401 -11244 -9354 -2114 6076 -4183 -19886 -15132 -5091 353 10759
5507A0759j0088O179R888o233J0903m340r47P08L634N78L588k0717r190J7132
$$ 10759 671 6850 16738 10505 21408 17068 16121 16829 20463 21041 24629 3912 -5278 11854
5493A1854J1706R029j3578l1167N200Q496p965j5561J7655k648k449Q173P941
$$ 11854 23560 32589 19011 -12156 -6956 1540 -6425 -21986 -4331 -6979 -9428 -1255 6686
5480F686J0808j1189K963q221q459Q427L412j1665J3562O665M980j1164k8312
$$ 6686 17494 6305 9268 1047 -7412 1015 4427 -7238 6324 12989 17969 6805 -21507
5467b1507r291j1145j0830M199L755J4523j0304K638Q643Q023K6244j0469j7235
$$ -21507 -30798 -41943 -52773 -48574 -44819 -30296 -40600 -37962 -29319 -21296 4948 -5521 -22756
5454b2756l217J2282K2640Q476j6855j011P955j2754k1465r080J3937r35J9166
$$ -22756 -25973 -13691 8949 17425 570 -441 7514 -5240 -26705 -35785 -21848 -22783 -3617
5441c617P535n725J4188m978m7996K645K4703P008j9409j552J8191J3803o262
$$ -3617 3918 -1807 12381 7403 -40593 -37948 -13245 -6237 -25646 -27198 -9007 4796 -1466
5428a466j0247j8375q250j1815J2657K8685J361j6807r899K2364K0964n669k488
$$ -1466 -11713 -30088 -38338 -50153 -37496 -8811 -7450 -24257 -34156 -11792 9172 3503 1015
5415A015K6670M696k3087m263N348J4957n543q692o741p745k4192K6009J8236
$$ 1015 27685 32381 9294 5031 10379 25336 19793 11101 4360 -3385 -27577 -1568 16668
5402A6668j1277r145j5821K1874M02m404n834J8826K2415j3997l1087L376m716
$$ 16668 5391 -3754 -19575 2299 2701 -1703 -7537 11289 33704 19707 -11380 -8004 -12720
5389a2720j2443K3043J9139K7652q545J613J0667l804l5593p905K801m767J4471
$$ -12720 -25163 -2120 17019 44671 36126 37739 48406 44602 9009 1104 3905 -862 13609
5376A3609J2179J3907m381R329J770k3619j5679J5744J9642N536q267j4303l8011
$$ 13609 25788 39695 35314 44643 46413 22794 7115 22859 42501 48037 39770 25467 -12544
5363a2544m4513k264P09m00K8190J6804J2124k3431L725k2456j6868J4624Q11
$$ -12544 -57057 -59321 -58612 -59012 -30822 -14018 -1894 -25325 -21600 -44056 -60924 -46300 -45489
5350d5489J4889J3096q169J991j047J954Q085K057n372J6751Q565j711p455k8307
$$ -45489 -30600 -17504 -25673 -23682 -24729 -22775 -14690 -12633 -18005 -1254 7311 5600 -1855 -30162
5336c0162J069J6164J4723j0606P42P735q328J96j3553J611K2406p633k2605N147
$$ -30162 -29093 -12929 1794 -8812 -8070 -335 -8663 -8467 -22020 -20409 1997 -5636 -28241 -23094
5322b3094o250j7303J2059K8890K1632k681j5226J0525P112j1245J2624J701m120
$$ -23094 -29344 -46647 -34588 -5698 15934 13253 -1973 8552 15664 4419 17043 18744 14624
5309A4624M899M631K8049q055k6386q23n667k0380M24J315r997O687k99j802J2394
$$ 14624 19523 24154 52203 44148 17762 16939 11272 -9108 -8684 -7369 -17366 -10679 -10978 -12780 -386
5294c86j1158k1588J3055r564J9294J4638o446o883k1508j4091N708J3710j6369
$$ -386 -11544 -33132 -20077 -29641 -10347 4291 -2155 -9038 -30546 -44637 -38929 -25219 -41588
5281d1588J4787J6331K0823J4744R770J14q518j3571M346K2184R106p692k5248
$$ -41588 -26801 -10470 10353 25097 34867 34981 26463 12892 17238 39422 48528 40836 15588
5268A5588l3404J6684K0654k2975N236l43R045R263o074k5792o235J6673J2288
$$ 15588 -17816 -1132 19522 -3453 1783 1440 10485 19748 13674 -12118 -18353 -1680 10608
5255A0608K341R634L863m394J174r480K996J3797k4089k5099N707J0843J8213
$$ 10608 12949 22583 26446 22052 23226 13746 16742 30539 6450 -18649 -12942 -2099 16114
5242A6114J3635o72j1605j018J6025j6134j2213r952q657j1552j3171J3732j3970
$$ 16114 29749 29077 17472 16454 32479 16345 4132 -5820 -14477 -26029 -39200 -25468 -39438
5229c9438l311K3604o179j5537N481l435K2655K6532r787m530J4622R164k133
$$ -39438 -42749 -19145 -25324 -40861 -35380 -38815 -16160 10372 585 -3945 10677 19841 17708
5216A7708k8955j4278J0477j0589j13M504J3408J1421p822j9385L973J1857j2532
$$ 17708 -11247 -25525 -15048 -25637 -25750 -21246 -7838 3583 -4239 -23624 -19651 -7794 -20326
5203b0326p053J860J0511J2038N808K307k0152o163J5924P326M877k3432P020
$$ -20326 -27379 -25519 -15008 -2970 2838 5145 -15007 -21170 -5246 2080 6957 -16475 -9455
5190i455L149M806j8583n141L570J6530J312n551J1819J2440j5372p205m693p398
$$ -9455 -6306 -1500 -20083 -25224 -21654 -5124 -3812 -9363 2456 14896 -476 -7681 -12374 -19772
5176a9772m435p761K2920J720j1921K7478K061j024J4264J1034O013k0694j6130
$$ -19772 -24207 -31968 -9048 -7328 -19249 8229 10290 9266 23530 34564 40577 19883 3753
5163C753r008o415K7080P525n143n484J8235j0087l1351p797K4865K0519p030
$$ 3753 -5255 -11670 15410 22935 17792 12308 30543 20456 -10895 -18692 6173 26692 19662
5150A9662j998k009O084K056M313o639m714m721J684j0308j8141J2448j801m159
$$ 19662 17664 15655 21739 23795 28108 21469 16755 12034 13718 3410 -14731 -2283 -4084 -8243
5136h243L4572R128M747j8376l8578k3101L966K5392J3415m312L5j0488p337j9571
$$ -8243 26329 35457 40204 21828 -16750 -39851 -35885 -10493 2922 -1390 -1355 -11843 -19180 -38751
5122c8751J5049j3410R924R94k9656l6249J9053L7697O37J6686K3626O653P016
$$ -38751 -23702 -37112 -27188 -26194 -55850 -92099 -73046 -35349 -34712 -18026 5600 12253 19269
5109A9269j1353k3726p483K0005K0276j0659n379N845k472n057q549k968J1801
$$ 19269 7916 -15810 -23293 -3288 16988 6329 950 6795 4323 -734 -9283 -12251 -450
5096d50r205l619K5197J2018M023p292l4405j8661K681K3274L062o328J7694J4997
$$ -450 -9655 -13274 11923 23941 27964 20672 -13733 -32394 -29713 -6439 -3377 -9705 7989 22986
5082B2986J884J3959j5879l38J3596m810j4340j420j2699O865k0167O75R081j4535
$$ 22986 24870 38829 22950 22612 36208 31398 17058 15638 2939 9804 -10363 -9688 -607 -15142
5068a5142k0060P397M0366K6535J1404k8415l3372j793K1079j502j0293L776Q464
$$ -15142 -35202 -27805 12561 39096 50500 22085 -11287 -13080 7999 6497 -3796 -20 8444
5055H444q961j4317k2503K3669K8629O767j4460k7631J0060J4925k978K296K425
$$ 8444 -517 -14834 -37337 -13668 14961 21728 7268 -20363 -10303 4622 1644 3940 6365
5042F365K2924p248l243k1631K225M439K661p6K274k2897j1541Q33R75R946l451
$$ 6365 29289 22041 18798 -2833 -608 3831 6492 6416 8690 -14207 -25748 -24915 -23940 -13994 -17445
5027a7445l19J7375r936j1166m104M362J5905k0176J4815P783j7726l782O543
$$ -17445 -17764 -389 -10325 -21491 -25595 -21233 -5328 -25504 -10689 -2906 -20632 -24414 -17871
5014a7871R303m140n157j3763K4591J8573j2843k2907J3659j823p914O411n606
$$ -17871 -8568 -12708 -17865 -31628 -7037 11536 -1307 -24214 -10555 -12378 -20292 -13881 -19487
5001a9487o123l690p796j6426j3061P476J6692J6446K028J1974j3013j6840Q900
$$ -19487 -25610 -29300 -37096 -53522 -66583 -59107 -42415 -25969 -23941 -11967 -24980 -41820 -32920
4988c2920P844J8148p105k571j7873q525J6168q805m148L4666l06J560k952R387
$$ -32920 -25076 -6928 -14033 -16604 -34477 -43002 -26834 -35639 -39787 -5121 -5427 -3867 -6819 2568
4974B568J1283j6270k0373Q315q478m66L1135L834j4354o937o012j4417p565J321
$$ 2568 13851 -2419 -22792 -14477 -22955 -23421 7714 11548 -2806 -9743 -15755 -30172 -37737 -36416
4960c6416J3677J0926K664N457K754Q388q809j8517k1683j165J9627K3300J0119
$$ -36416 -22739 -11813 -9149 -3692 -938 7450 -1359 -19876 -41559 -42724 -23097 203 10322
4947A0322J893j5424Q559J4732O707J7444m612l4235k6937l347J944M788K2444
$$ 10322 12215 -3209 5350 20082 26789 44233 39621 5386 -21551 -24898 -22954 -18166 4278
4934D278R943Q802j8649k951J0531J6218j0975j0122j3692J154l306J270J0410
$$ 4278 14221 23023 4374 1423 11954 28172 17197 7075 -6617 -5463 -8769 -7499 2911
4921B911j528j5320k0641J8394K4734o355j0399O151J4805j6118p822m301L957
$$ 2911 1383 -13937 -34578 -16184 8550 2195 -8204 -2053 12752 -3366 -11188 -15489 -11532
4908a1532M4p251M52j1754J3868J263n457J770P512m661k1288K403L1585L511
$$ -11532 -11488 -18739 -18287 -30041 -16173 -14910 -20367 -18597 -11085 -15746 -37034 -34631 -3046 465
4894D65j7394k123J051k455K9801J780l1056K708K3284r854k3018K6430Q127j8239
$$ 465 -16929 -19052 -18001 -20456 9345 11125 -19931 -17223 6061 -3793 -26811 -381 7746 -10493
4880a0493j1532j4808J15K6615k485k813P901N717j4946j4240J4188K3097J3883
$$ -10493 -22025 -36833 -36718 -10103 -12588 -15401 -7500 -1783 -16729 -30969 -16781 6316 20199
4867B0199K772q124j2693J6589J9688K478j6653k2251j2360L22J162l033J3128
$$ 20199 22971 14847 2154 18743 38431 40909 24256 2005 -10355 -10033 -8871 -11904 1224
4854A224k643J6008l301j2648j5747j0174R322J8867k03q069j0449J6526J4363
$$ 1224 -1419 14589 11288 -1360 -17107 -27281 -17959 908 705 -7364 -17813 -1287 13076
4841A3076m649k504j773j4988j872m291j79K5589Q650j044n62M872j5464j7895
$$ 13076 8427 5923 4150 -10838 -12710 -17001 -17180 8409 17059 16015 15453 20325 4861 -13034
4827a3034l363N758o302J0570J0098K359l3183q989J8705L9475k4995j7943R23
$$ -13034 -16397 -10639 -16941 -6371 3727 6086 -27097 -36086 -17381 22094 -2901 -20844 -19921
4814a9921R901m723j7333J5972L6761n498j8476o359m244k535J5281q796j4483
$$ -19921 -10020 -14743 -32076 -16104 20657 15159 -3317 -9676 -13920 -16455 -1174 -9970 -24453
4801b4453L841P563J4512J7845l8715j1863m065o367J9207K1549r823k3927n199
$$ -24453 -20612 -13049 1463 19308 -19407 -31270 -35335 -41702 -22495 -946 -10769 -34696 -39895
4788c9895j6928Q244K0373M487J0602K9645P40k4293j9437j0737j1490P411M677
$$ -39895 -56823 -48579 -28206 -23719 -13117 16528 17268 -7025 -26462 -37199 -48689 -41278 -36601
4775c6601Q950K218M664J5201J0405o322R168J0758Q78j9271L258K3808k9960
$$ -36601 -27651 -25433 -20769 -5568 4837 -1485 7683 18441 19319 48 3306 27114 -2846
4762b846k0216p586J2734K8395R974R181R271j6132j2344m479K2624M374J372
$$ -2846 -23062 -30648 -17914 10481 20455 29636 38907 22775 10431 5952 28576 32950 34322
4749C4322j9434j4639J1105Q564l382j5481L4451K0117p466l4324r435J1654M096
$$ 34322 14888 249 11354 19918 16536 1055 35506 55623 48157 13833 4398 16052 20148
4736B0148J8105J6602Q555q965l7163j7464m573r248L571j5063j241J2018n367
$$ 20148 38253 54855 63410 54445 17282 -182 -4755 -14003 -10432 -25495 -26736 -14718 -20085
4723b0085K4030K0056J510P22k0508j5448J7822O550l812j4603j1734J4229p603
$$ -20085 3945 24001 25511 26233 5725 -9723 8099 14649 10837 -3766 -15500 -1271 -8874
4710h874J7186j519n019r614k0087j897q739Q837J5758K3016q078j2954P983q831
$$ -8874 8312 6793 1774 -7840 -27927 -29824 -38563 -29726 -13968 9048 970 -11984 -4001 -12832
4696a2832q946K1650N030R97j0872m198n610L133M898j3667p31P691Q670l678
$$ -12832 -21778 -128 4902 5899 -4973 -9171 -14781 -11648 -6750 -20417 -21148 -13457 -4787 -8465
4682h465j0212j0605Q969K539P360n959j2939j0731p79J2815P569N444k56K251
$$ -8465 -18677 -29282 -20313 -17774 -10414 -16373 -29312 -40043 -40822 -28007 -20438 -14994 -15250 -12999
4668a2999J1280j5679j1249R871m412N423K1089p543m448L577J7495k4840P310
$$ -12999 -1719 -17398 -28647 -18776 -23188 -17765 3324 -4219 -8667 -5090 12405 -12435 -5125
4655e125j61k345k535K928M879j2709j2182K6046P763L355j1552q932j0582J6480
$$ -5125 -5286 -7631 -10166 -7238 -2359 -15068 -27250 -1204 6559 9914 -1638 -10570 -21152 -4672
4641d672K0522J6635j6152l5251q926J4089L1763M353j3240Q226o36k0232m436
$$ -4672 15850 32485 16333 -18918 -27844 -13755 18008 22361 9121 17347 16711 -3521 -7957
4628g957J4J6969J8591M015p386k5649M418K052k3764j0698M736K1423J6316j1251
$$ -7957 -7943 9026 27617 31632 24246 -1403 3015 5067 -18697 -29395 -24659 -3236 13080 1829
4614A829k5650j8874J7288K1594k7K326M493q504J2382j2655L083J3550K218p20
$$ 1829 -23821 -42695 -25407 -3813 -3840 -1514 2979 -5525 6857 -5798 -2715 10835 13053 12333
4600A2333J150j8361j7342l847J904j9662J6573P854J3396R254K1065K1401l213
$$ 12333 13483 -4878 -22220 -26067 -24163 -43825 -27252 -19398 -6002 3252 24317 45718 42505
4587D2505l6589J1403J3959R207o081j7456P522J8109j864j0130j7333j8691R626
$$ 42505 5916 17319 31278 40485 34404 16948 24470 42579 40715 30585 13252 -5439 4187
4574D187N75J5101K1892k7132l5445J2464K7735o099J014k250l784p559j7186
$$ 4187 4762 19863 41755 14623 -20822 -8358 19377 13278 14292 12042 8258 699 -16487
4561a6487j763J091J826O283k40n889J3118K5068p640k3938p48n142L613K8792
$$ -16487 -18250 -17159 -15333 -9050 -9290 -15179 -2061 23007 15367 -8571 -9319 -14461 -10848 17944
4547A7944L31j3776L637n164j1210j9561j1602Q020J2336K573J0234L5474r014
$$ 17944 18275 4499 8136 2972 -8238 -27799 -39401 -31381 -19045 -16472 -6238 29236 20222
4534B0222j1632l5626j5967m402J8032j743Q630m667K4421J2657j5876k4203j1763
$$ 20222 8590 -27036 -43003 -47405 -29373 -31116 -22486 -27153 -2732 9925 -5951 -30154 -41917
4521d1917q013M065M620J7216J0547j1608j4750Q256J4912K5425N462j6184J029
$$ -41917 -49930 -45865 -41245 -24029 -13482 -25090 -39840 -31584 -16672 8753 14215 -1969 -940
4508i40m069L941M564k773j4919j2359J9712j542K285J8585o177K713j4310p667
$$ -940 -5009 -1068 3496 723 -14196 -26555 -6843 -8385 -6100 12485 6308 9021 -5289 -12956
4494a2956K971O380j9785l057K3043J0753L664j895j3879Q671L872p994K504o538
$$ -12956 -9985 -3605 -23390 -26447 -3404 7349 11013 9118 -4761 3910 7782 -212 2292 -4246
4480d246r803J2613N23L919P159j2820K781J0439p333q246o734l8710k549K4441
$$ -4246 -14049 -1436 -913 3006 10165 -2655 126 10565 3232 -5014 -11748 -50458 -53007 -28566
4466b8566J8237j0622N576R751l572J29J2362J0793R72k4152K199J0963j2491
$$ -28566 -10329 -20951 -15375 -5624 -9196 -9067 3295 14088 15060 -9092 -6893 4070 -8421
4453h421j8280J5965K8580J7409m052q795k0473m379j342K0234j4242j6055j59
$$ -8421 -26701 -10736 17844 35253 31201 22406 1933 -2446 -3788 16446 2204 -13851 -14010
4440a4010N695P830m451j2438k467p666m402J5841J4104J8433J3277K70j0569
$$ -14010 -8315 -485 -4936 -17374 -19841 -27507 -31909 -16068 -1964 16469 29746 30016 19447
4427A9447M588J797k0202m3R688k0762l492P105J8687j6094n439K6890J98K61
$$ 19447 24035 25832 5630 5587 15275 -5487 -8979 -1874 16813 719 -4720 22170 22368 22629
4413B2629P564j2279L963j0852N634L462m845k9709o641K9547l663j9559O148
$$ 22629 30193 17914 21877 11025 16659 20121 15276 -14433 -21074 8473 4810 -14749 -8601
4400h601J9224M765j448k571J2085j9187j6668O588m546J7968M202k0538J670
$$ -8601 10623 15388 13940 11369 23454 4267 -12401 -5813 -10359 7609 11811 -8727 -7057
4387g057K1691j3253m705j2968n215j5253j951j2603J2453P240K3607o965J2720
$$ -7057 14634 1381 -3324 -16292 -21507 -36760 -38711 -51314 -38861 -31621 -8014 -14979 -2259
4374b259L1396j366j2342j4813j5531p44L848P824j6275k4016J8448Q038J851
$$ -2259 29137 27771 15429 616 -14915 -15659 -11811 -3987 -20262 -44278 -25830 -17792 -15941
4361a5941J5300p378k25J7153J6475P827k2935j0466k0500K1916J6316l5286p88
$$ -15941 -641 -8019 -8244 8909 25384 33211 10276 -190 -20690 1226 17542 -17744 -18532
4348a8532J3687K452j411o991r098k4120J0624J6520o594j0685J0932J451o515
$$ -18532 -4845 -2393 -3804 -10795 -19893 -44013 -33389 -16869 -23463 -34148 -23216 -21765 -28280
4335b8280Q801J1226J7437M25J6984j1343q302m912l8765p579L0243J3543p793
$$ -28280 -19479 -8253 9184 9609 26593 15250 6948 2036 -36729 -44308 -14065 -522 -8315
4322h315L339j003N245J3751p38j7599p105j3580O846Q993J6609p871J0166J0804
$$ -8315 -4976 -5979 -734 13017 12279 -5320 -12425 -26005 -19159 -10166 6443 -1428 8738 19542
4308A9542J0013J010r64K450Q126K20j7836j5981j5600j4106k713J1871O584K648
$$ 19542 29555 30565 29601 32051 40177 40397 22561 6580 -9020 -23126 -25839 -13968 -7384 -4736
4294d736j163q94J8991j1160P539J3694j4845j761Q943m1604R095p413P889P113
$$ -4736 -5899 -6793 12198 1038 8577 22271 7426 5665 14608 -26996 -17901 -25314 -17425 -10312
4280a0312J942r606J9783M184K786r234N540N755j9194j5705O693k4176J7816
$$ -10312 -8370 -17976 1807 5991 8777 -457 5083 10838 -8356 -24061 -17368 -41544 -23728
4267b3728K3435q904J8582K8366j1706p584j2132k1948L606K165k0934P798Q131
$$ -23728 -293 -9197 9385 37751 26045 18461 6329 -15619 -12013 -9848 -30782 -22984 -14853
4254a4853j0852m553K0568r929K760N281k505j4103q135K1459J8164R01k0103
$$ -14853 -25705 -30258 -9690 -19619 -16859 -11578 -14083 -28186 -36321 -14862 3302 4203 -15900
4241a5900j198N8K247J0106q309L0994J5508j3519j281k7071R622O379k638k58
$$ -15900 -17098 -17040 -14793 -4687 -12996 17998 33506 19987 18706 -8365 1257 7636 4998 4740
4227D740j2868J5406L2212p929k3460k0323r61R105o079J0745r050K049k59l699
$$ 4740 -8128 7278 39490 31561 8101 -12222 -13183 -4078 -10157 588 -8462 -6413 -6672 -10371
4213a0371j3496N268K331M589j6561q410J392J8266K5299j3469o715m408O527
$$ -10371 -23867 -18599 -16268 -11679 -28240 -36650 -35258 -16992 8307 -5162 -11877 -16285 -9758
4200i758J6602l201r079j7413m447J9428M297J2169J2239j5819o399L620J5230
$$ -9758 6844 3643 -5436 -22849 -27296 -7868 -3571 8598 20837 5018 -1381 2239 17469
4187A7469j3628r647k067K6163J7831J723j8827n683j1346n872J2356j1527J424
$$ 17469 3841 -5806 -7873 18290 36121 37844 19017 13334 1988 -3884 8472 -3055 -1631
4174a631L2772J9961Q863j3315j9014L811j0744r627l0101J0107k0206j5324O543
$$ -1631 31141 51102 59965 46650 27636 31447 20703 11076 -19025 -8918 -29124 -44448 -37905
4161c7905J4320K9310J9384K991q852k4799p739j5376J2323J6866k6783j6324
$$ -37905 -23585 5725 25109 28100 19248 -5551 -13290 -28666 -16343 523 -26260 -42584
4149d2584j2575j0140O866J9704P675P135j3243m513L0561K3700J3348k3564k3813
$$ -42584 -55159 -65299 -58433 -38729 -31054 -23919 -37162 -41675 -11114 12586 25934 2370 -21443
4136b1443Q134m512q930K42R270K731K2660K5192j4309k0619r420K0378N951J8589
$$ -21443 -13309 -17821 -26751 -26509 -17239 -14508 8152 33344 19035 -1584 -11004 9374 15325 33914
4122C3914k9925j4030j151N472j876P536J5151k303k9424K961J1239K7388j0616
$$ 33914 3989 -10041 -11192 -5720 -7596 -60 15091 12788 -16636 -13675 -2436 24952 14336
4109A4336l4474n956p925J4444J6788N170j0957k0516J0965K0176k6050k27q242
$$ 14336 -20138 -26094 -34019 -19575 -2787 2383 -8574 -29090 -18125 2051 -23999 -24226 -32468
4096c2468j7587O768L1584J6293j1400k0218q185J5976q382j7615K7877K1141
$$ -32468 -50055 -43287 -11703 4590 -6810 -27028 -35213 -19237 -27619 -45234 -17357 3784
4084C784K4991K0560j0467j1025j1146j1215P030p85k003o745j0305R677j552
$$ 3784 28775 49335 38868 27843 16697 5482 12512 11727 9724 2979 -7326 2351 799
4071G99K749l074K9584o005k3819k1095n838r144P080J1822J217J6987J4941L672
$$ 799 3548 474 30058 24053 234 -20861 -26699 -35843 -28763 -16941 -15724 1263 16204 19876
4057A9876k314j4426j6063J0124J7978M09J2855J593l538k3542k516L166q719
$$ 19876 17562 3136 -12927 -2803 15175 15584 28439 30032 26494 2952 436 3602 -5117
4044e117j9789J430J0481j742R460R963J1027N137m975l0759o858J24m75J6460
$$ -5117 -24906 -23476 -12995 -14737 -5277 4686 15713 20850 15875 -14884 -21742 -21618 -22093 -5633
4030e633J1193N397k0857j6230j456N38J7526K1076j954l708R404J3145J7433
$$ -5633 5560 10957 -9900 -26130 -27586 -27048 -9522 11554 9600 5892 15296 28441 45874
4017D5874k2624l4634K2193j748j3717J1048K020m554l4515k2380K4591L7926
$$ 45874 23250 -11384 10809 9061 -4656 6392 8412 3858 -30657 -53037 -28446 9480
4005I480L0198r481k8396l588K38Q519o882j854l597j556P20K068J6931j2624
$$ 9480 39678 30197 1801 -1787 -1549 6970 88 -1766 -5363 -6919 -6199 -4131 12800 176
3991A76q247q13J703O782j0036P051r798L046J849J8507L0959k7280k5344o392
$$ 176 -8071 -8884 -7181 -399 -10435 -3384 -13182 -10136 -8287 10220 41179 13899 -11445 -17837
3977a7837o980J039R497R836J7373k349k6632j2873K3274K2346J2822m230L857
$$ -17837 -24817 -23778 -14281 -4445 12928 10579 -16053 -28926 -5652 16694 29516 25286 29143
3964B9143P365k05m102q562j6100K2840J0137l4453m86J688l838P756l65k6248
$$ 29143 36508 36303 32201 23639 7539 30379 40516 6063 5577 7265 3427 11183 10818 -15430
3950a5430o48k655p71R166K948Q061q751J813K2591j47p240j2654J7625l838k1703
$$ -15430 -16078 -18733 -19504 -10338 -7390 671 -8080 -6267 16324 16177 8937 -3717 13908 10070 -11633
3935a1633N412K408l511Q740J6746r304J4242q836k3773p013K137N292J5829Q648
$$ -11633 -6221 -3813 -7324 1416 18162 8858 23100 14264 -9509 -16522 -14385 -9093 6736 15384
3921A5384P138J06J1614O558l572k9895j5029j3706Q069J0240J907J7456O582
$$ 15384 22522 22628 34242 40800 37228 7333 -7696 -21402 -13333 -3093 -1186 16270 22852
3908B2852P394k3093J0157K258j880p276O950P746J8223O82n699K170p933q762
$$ 22852 30246 7153 17310 19568 17688 10412 17362 25108 43331 44013 38314 40484 32551 23789
3894B3789j8122o698q502J7648o703k2796M995J2406K1417j3236o250J7560j7521
$$ 23789 5667 -1031 -9533 8115 1412 -21384 -16389 -3983 17434 4198 -2052 15508 -2013
3881b013p755m830J5074J9788K3726L59K7245K3091k0847k8340j2267R607M404
$$ -2013 -9768 -14598 476 20264 43990 44349 71594 94685 73838 45498 33231 42838 47242
3868D7242J1273j0373k8230j5025k334P973Q985j4593j688P116L4075j4436N703
$$ 47242 58515 48142 19912 4887 2553 10526 19511 4918 3230 10346 44421 29985 35688
3855C5688j2344P763k5307j4056J6367j4818l753R5K0020j1025j4848k453j5356
$$ 35688 23344 31107 5800 -8256 8111 -6707 -10460 -10365 9655 -1370 -16218 -18671 -34027
3842c4027N341n086P254Q589J2925J2685j4476j1078P17J3701K8264J1050j585
$$ -34027 -28686 -33772 -26518 -17929 -5004 7681 -6795 -17873 -17156 -3455 24809 35859 34274
3829C4274O157R591J755l6867j4944j2289r821K1777K1949o392n382p30j5069
$$ 34274 40431 50022 51777 14910 -34 -12323 -22144 -367 21582 15190 9808 9078 -5991
3816e991m037P311K111n767k497p284R646Q188J6529J3763j7698l7635n078K4916
$$ -5991 -10028 -2717 -606 -6373 -8870 -16154 -6508 1680 18209 31972 14274 -23361 -28439 -3523
3802c523J381j4325q26Q509N059o505K132P460O620j7734j7632Q744k014K0214
$$ -3523 -2142 -16467 -17293 -8784 -3725 -10230 -8098 -638 5982 -11752 -29384 -20640 -22654 -2440
3788b440L859p820R313j5158r588M966j0462j6803J1981Q267K2705L528k2140
$$ -2440 1419 -6401 2912 -12246 -21834 -16868 -27330 -44133 -32152 -23885 -1180 2348 -19792
3775a9792j7160m664Q035K734r341L044J4431J7574K4113o41j9109r469o029M81
$$ -19792 -36952 -41616 -33581 -30847 -40188 -37144 -22713 -5139 18974 18333 -776 -10245 -16274 -15793
3761a5793M517J332q911j1531K9167J2475K766j1663J6303O306n238j4230k415
$$ -15793 -11276 -9944 -18855 -30386 -1219 11256 14022 2359 18662 24968 19730 5500 3085
3748C085m338P017J7957J3228j2184k9644M287L0125J1866K2056J0162n934L437
$$ 3085 -1253 5764 23721 36949 24765 -4879 -592 29533 41399 63455 73617 67683 71120
3735G1120j2124k3332k5287o584r22j8116m416q070M238J5566R943M001P771J208
$$ 71120 58996 35664 10377 3793 2871 -15245 -19661 -27731 -23493 -7927 2016 6017 13788 14996
3721A4996j4762O424O711O335j1898m934L678J5949K299k4022k8482l1092M045
$$ 14996 234 6658 13369 19704 7806 2872 6550 22499 24798 776 -27706 -58798 -54753
3708e4753J8948M985J0703J4538J4055L260p063J204j3628m266q342J0057j2214
$$ -54753 -35805 -30820 -20117 -5579 8476 11736 4673 5877 -7751 -12017 -20359 -10302 -22516
3695b2516l533J1057J5835J4794j0358L0037K2895j3245j5098j236j155j0940
$$ -22516 -26049 -14992 843 15637 5279 35316 58211 44966 29868 28632 27477 16537
3683A6537j3910R862N551m431j0098j7148r602J8098K1788p928K3204R122k4480
$$ 16537 2627 12489 18040 13609 3511 -13637 -23239 -5141 16647 8719 31923 41045 16565
3670A6565L119m981n729P002J6033k691j989j1765P630J5848l655k8645j5586
$$ 16565 19684 14703 8974 15976 32009 29318 27329 15564 23194 39042 35387 6742 -8844
3657h844l766o231m226J915m085K3431m020l47l169m808l947q647j104k6562j5686
$$ -8844 -12610 -18841 -23067 -21152 -25237 -1806 -5826 -6173 -9342 -14150 -18097 -26744 -27848 -54410 -70096
3642g0096K1790M0314L989m15J2013k3855j7195K1932m653q740J5450R593J4965
$$ -70096 -48306 -7992 -4003 -4418 7595 -16260 -33455 -11523 -16176 -24916 -9466 127 15092
3629A5092R306J3606k2532j5004J1694k3035j180R242l605l200L337J3953J81
$$ 15092 24398 38004 15472 468 12162 -10873 -12053 -2811 -6416 -9616 -6279 7674 7855
3616G855j224M723M242j68j1518p486K0651J6996J2175j0003m343j2475j958o370
$$ 7855 6631 11354 15596 15428 3910 -3576 17075 34071 46246 36243 31900 19425 17467 11097
3602A1097m525j2566m226J866j0410j7504J041m331m366L1876J1609k104k3000
$$ 11097 6572 -5994 -10220 -8354 -18764 -36268 -35227 -39558 -43924 -12048 -439 -2543 -25543
3589b5543q866J0109J7849K1396j0760J1733O774L304k802q462q244j1013K211
$$ -25543 -34409 -24300 -6451 14945 4185 15918 22692 25996 23194 14732 6488 -4525 -2314
3576b314j6764L663K1417R140j4380j4466j0966m831L4817J762l9782J061m903
$$ -2314 -19078 -15415 6002 15142 762 -13704 -24670 -29501 5316 7078 -32704 -31643 -36546
3563c6546j1780Q104R560K2425K1138k6561k1949j6566J7021K046J5009J160m842
$$ -36546 -48326 -40222 -30662 -8237 12901 -13660 -35609 -52175 -35154 -33108 -18099 -16939 -21781
3550b1781J0665j8787Q894P399L1m343O138j1255L694P586l087j5775J8897L3000
$$ -21781 -11116 -29903 -21009 -13610 -13579 -17922 -11784 -23039 -19345 -11759 -14846 -30621 -11724 21276
3536B1276l483j8918j5922k1013n296K0583L8734J958j3882J9783K7150j6012
$$ 21276 17793 -1125 -17047 -38060 -43356 -22773 15961 17919 4037 23820 50970 34958
3524C4958l18L555k3304l4194J653J3607k903r478j1175J1726J6900Q771k2915
$$ 34958 34640 38195 14891 -19303 -17650 -4043 -6946 -16424 -27599 -15873 1027 9798 -13117
$$ [...]
##END NTUPLES=NMR SPECTRUM
##END=
