##TITLE=Analysis number 318001
Compound Code mo 07030
Project Code adrs
Chemist Name spectrum
##JCAMPDX= 6.0         $$ Bruker NMR JCAMP-DX V2.0
##DATA TYPE= NMR SPECTRUM
##DATA CLASS= NTUPLES
##ORIGIN= Bruker BioSpin GmbH
##OWNER= nmr
$$ XWIN-NMR		Version 3.5
$$ Fri Mar 10 10:51:21 2006 GMT Standard Time (UT+0h)  MAYBRIDGE\nmr@NMR_250MHZ
##.OBSERVE FREQUENCY= 250.131544655141
##.OBSERVE NUCLEUS= ^1H
##.ACQUISITION MODE= SIMULTANEOUS (DQD)
##.ACQUISITION SCHEME= undefined
##.AVERAGES= 16
##.DIGITISER RES= 18
##SPECTROMETER/DATA SYSTEM= dpx250
##.PULSE SEQUENCE= zg30
##.SOLVENT NAME= CDCl3
##.SHIFT REFERENCE= (INTERNAL, CDCl3, 0, 16.522)
##AUDIT TRAIL= $$ (NUMBER, WHEN, WHO, WHERE, WHAT)
$$ ##TITLE= Audit trail, XWIN-NMR		Version 3.5
$$ ##JCAMPDX= 5.01
$$ ##ORIGIN= Bruker BioSpin GmbH
$$ ##OWNER= nmr
$$ C:\u/data/dgb/nmr/ADRS/470/pdata/1/auditp.txt
$$ ##AUDIT TRAIL=  $$ (NUMBER, WHEN, WHO, WHERE, WHAT)
(   1,<2006-03-10 10:50:49.58 +000>,<MAYBRIDGE\nmr>,<NMR_250MHZ>,
      <created by zg, POWCHK disabled, PULCHK disabled
       configuration hash MD5:
       84 BC 41 DB A1 6E 1D 46 DA 25 12 A5 C1 ED C5 3A
       data hash MD5: 64K
       23 1A CB 71 D7 8D 63 19 F7 2C 82 B3 2B 31 2B 81>)
(   2,<2006-03-10 10:51:04.50 +000>,<MAYBRIDGE\nmr>,<NMR_250MHZ>,
      <Start of raw data processing
       ef LB = 0.3 FT_mod = 6 PKNL = 1 SI = 32K 
       data hash MD5: 32K
       C3 A8 BA B6 13 72 7E C5 80 B2 A8 75 C2 BE 78 68>)
(   3,<2006-03-10 10:51:06.16 +000>,<MAYBRIDGE\nmr>,<NMR_250MHZ>,
      <apk 
       data hash MD5: 32K
       4F 7F 97 6A 46 76 A7 8C 2F 7B 83 1D 4B 53 90 2D>)
(   4,<2006-03-10 10:51:07.33 +000>,<MAYBRIDGE\nmr>,<NMR_250MHZ>,
      <abs ABSG = 5 
       data hash MD5: 32K
       43 DC 8B F5 B3 B8 96 FD 64 81 01 56 79 C6 F4 5D>)
$$ ##END=
$$ 
$$ hash MD5
$$ 06 07 FF CA CC 2B C1 56 9F 4A 4B C4 72 D5 83 3F
##$RELAX= 
##$RELAX= 
##$RELAX= 
##$RELAX= 
##$RELAX= 
##$RELAX= 
##$RELAX= 
$$ Bruker specific parameters
$$ --------------------------
##$DU= <C:\u>
##$EXPNO= 470
##$NAME= <ADRS>
##$PROCNO= 1
##$TYPE= <nmr>
##$USER= <dgb>
##$AMP= (0..31)
100 100 100 100 100 100 100 100 100 100 100 100 100 100 100 100 100 100 
100 100 100 100 100 100 100 100 100 100 100 100 100 100 
##$AQSEQ= 0
##$AQ_mod= 3
##$AUNM= <au_zg>
##$AUTOPOS= <18 >
##$BF1= 250.13
##$BF2= 250.13
##$BF3= 250.13
##$BF4= 250.13
##$BF5= 500.13
##$BF6= 500.13
##$BF7= 500.13
##$BF8= 500.13
##$BYTORDA= 1
##$CFDGTYP= 0
##$CFRGTYP= 5
##$CHEMSTR= <none>
##$CNST= (0..31)
1 1 145 1 1 1 1 1 1 1 1 1 1 1 1 1 1 1 1 1 1 1 1 1 1 1 1 1 1 1 1 1 
##$CPDPRG= <>
##$CPDPRG1= <>
##$CPDPRG2= <>
##$CPDPRG3= <>
##$CPDPRG4= <mlev>
##$CPDPRG5= <mlev>
##$CPDPRG6= <mlev>
##$CPDPRG7= <mlev>
##$CPDPRG8= <mlev>
##$CPDPRGB= <>
##$CPDPRGT= <>
##$D= (0..31)
0 1 0 0 0 0 0 0 0 0.06 0 0 0 0 0 0 0.0002 0 0 0 0 0 0 0 0 0 0 0 0 0 0 
0 
##$DATE= 1141987848
##$DBL= (0..7)
120 120 120 120 120 120 120 120 
##$DBP= (0..7)
150 150 150 150 150 150 150 150 
##$DBP07= 0
##$DBPNAM0= <>
##$DBPNAM1= <>
##$DBPNAM2= <>
$$ [...]
##$SUBNAM7= <"">
##$SUBNAM8= <"">
##$SUBNAM9= <"">
##$SW= 20.6930455092707
##$SWIBOX= (0..15)
0 0 3 0 0 0 0 0 0 0 0 0 0 0 0 0 
##$SW_h= 5175.983436853
##$TD= 65536
##$TD0= 1
##$TE= 294.16
##$TE2= 300
##$TE3= 300
##$TEG= 300
##$TL= (0..7)
0 120 120 120 120 120 120 120 
##$TP= (0..7)
150 150 150 150 150 150 150 150 
##$TP07= 0
##$TPNAME0= <>
##$TPNAME1= <>
##$TPNAME2= <>
##$TPNAME3= <>
##$TPNAME4= <>
##$TPNAME5= <>
##$TPNAME6= <>
##$TPNAME7= <>
##$TPOAL= (0..7)
0.5 0.5 0.5 0.5 0.5 0.5 0.5 0.5 
##$TPOFFS= (0..7)
0 0 0 0 0 0 0 0 
##$TUNHIN= 0
##$TUNHOUT= 0
##$TUNXOUT= 0
##$USERA1= <user>
##$USERA2= <user>
##$USERA3= <user>
##$USERA4= <user>
##$USERA5= <user>
##$V9= 5
##$VALIST= <valist>
##$VCLIST= <CCCCCCCCCCCCCCC>
##$VD= 0
##$VDLIST= <DDDDDDDDDDDDDDD>
##$VPLIST= <PPPPPPPPPPPPPPP>
##$VTLIST= <TTTTTTTTTTTTTTT>
##$WBST= 1024
##$WBSW= 4
##$XGAIN= (0..3)
0 0 0 0 
##$XL= 0
##$YL= 0
##$YMAX_a= 320494
##$YMIN_a= -405723
##$ZGOPTNS= <>
##$ZL1= 120
##$ZL2= 120
##$ZL3= 120
##$ZL4= 120
##$ABSF1= 16.522
##$ABSF2= -4.171173
##$ABSG= 5
##$ABSL= 3
##$ALPHA= 0
##$AQORDER= 0
##$ASSFAC= 0
##$ASSFACI= 0
##$ASSFACX= 0
##$ASSWID= 0
##$AUNMP= <proc_1d>
##$AZFE= 0.1
##$AZFW= 0.1
##$BCFW= 0
##$BC_mod= 0
##$BYTORDP= 0
##$COROFFS= 0
##$CY= 12.5
##$DATMOD= 1
##$DC= 0
##$DFILT= <>
##$DTYPP= 0
##$F1P= 14.0000005364418
##$F2P= -0.99999901652339
##$FCOR= 0.5
##$FTSIZE= 32768
##$FT_mod= 6
##$GAMMA= 0
##$GB= 0
##$INTBC= 1
##$INTSCL= 1
##$ISEN= 128
##$LB= 0.3
##$LEV0= 0
##$LPBIN= 0
##$MAXI= 10000
##$MC2= 0
##$MEAN= 0
##$ME_mod= 0
##$MI= 0
##$NCOEF= 0
##$NC_proc= -4
##$NLEV= 6
##$NOISF1= 0
##$NOISF2= 0
##$NSP= 0
##$NTH_PI= 0
##$NZP= 0
##$OFFSET= 16.522
##$PC= 1
##$PHC0= 179.992
##$PHC1= -0.003729899
##$PH_mod= 1
##$PKNL= yes
##$PPARMOD= 0
##$PSCAL= 4
##$PSIGN= 0
##$REVERSE= no
##$SF= 250.13
##$SI= 32768
##$SIGF1= 0
##$SIGF2= 0
##$SINO= 400
##$SIOLD= 32768
##$SREGLST= <1H.CDCl3>
##$SSB= 0
##$STSI= 32768
##$STSR= 0
##$SW_p= 5175.98343685301
##$SYMM= 0
##$S_DEV= 0
##$TDeff= 65536
##$TDoff= 0
##$TI= <Analysis number 999999
Compound Code 99
Book Reference 9
Project Code 9>
##$TILT= no
##$TM1= 0
##$TM2= 0
##$TOPLEV= 0
##$USERP1= <user>
##$USERP2= <user>
##$USERP3= <user>
##$USERP4= <user>
##$USERP5= <user>
##$WDW= 1
##$XDIM= 32768
##$YMAX_p= 304028483
##$YMIN_p= -371567
$$ End of Bruker specific parameters
$$ ---------------------------------
##NTUPLES= NMR SPECTRUM
##VAR_NAME=  FREQUENCY,     SPECTRUM/REAL,   SPECTRUM/IMAG
##SYMBOL=    X,             R,               I
##VAR_TYPE=  INDEPENDENT,   DEPENDENT,       DEPENDENT
##VAR_FORM=  AFFN,          ASDF,            ASDF
##VAR_DIM=   32768,         32768,           32768
##UNITS=     HZ,            ARBITRARY UNITS, ARBITRARY UNITS
##FACTOR=    0.157963299565203, 1,           1
##FIRST=     4132.6476996994, 0,             0
##LAST=      -1043.33573715361, 0,           0
##MIN=       -1043.33573715361, -371567,     0
##MAX=       4132.6476996994, 304028483,     0
$$ Real data points
##PAGE= N=1
##DATA TABLE= (X++(R..R)), XYDATA
$$ [...]
$$ plain form
24743 63074 123054 27795 -19075 24843 88394 22485 8459 6253 8353 -16119 -85676 -39931
24731 -39931 42446 59952 13217 70540 -9995 -36775 12398 92563 73489 50914 -13787 -34952
24719 -34952 -115191 -121109 -106242 -118099 -147443 -87311 -168167 -155219 -67663 -1 51037 2323
24707 2323 15438 71064 241014 272124 173797 11606 -156763 -132721 26010 17301 70558
24696 70558 37714 -95694 -168485 -153822 -116178 16149 106761 119853 69428 49694 -50081
24685 -50081 -66194 -136824 -162620 -142166 -137517 -49867 35347 76846 21022 -44738 -20903 -54648
24673 -54648 -12989 7580 63560 -18269 -19248 86381 112164 67277 8984 7530 35368 95276
24661 95276 87046 -60037 -97458 -63298 115480 276510 217497 217362 179550 165053 139546 144859
$$ packed form
24743F3074N9980r5259m6870M3918O3551o5909j4026k206K100k4472o9557M5745
24731c9931Q2377J7506m6735N7323q0535k6780M9173Q0165j9074k2575o4701k1165
24719c4952q0239n918J4867j1857k9344O0132q0856J2948Q7556O7662N1038m8714
24707B323J3115N5626J69950L1110r8327j62191j68369K4042J58731q709N3257
24696G0558l2844j33408p2791J4663L7644J32327R0612J3092n0425j9734r9775
24685e0081j6113p0630k5796K0454M649Q7650Q5214M1499n5824o5760K3835l3745
24673e4648M1659K0569N5980q1829r79J05629K5783m4887n8293j454K7838N9908
24661I5276q230j47083l7421L4160J78778J61030n9013j35l7812j4497k5507N313
$$ plain form
24649 144859 45563 110080 188491 119076 150818 81048 -44168 17597 16958 -17768 8599 68853
24637 68853 123065 192441 57201 -91479 -96580 -57223 54791 61517 -31945 -42779 11256
24626 11256 92380 118426 10268 -11186 -53587 -53358 16797 64273 69546 31146 55540 112065
24614 112065 29355 -93791 -44456 -3419 -57938 -24341 -87642 -54329 -56841 -108149 -110815 -161206
24602 -161206 -198991 -63776 -4000 8096 24940 -57141 9287 15938 107067 110806 69523 -28978
24590 -28978 68345 181720 124943 84762 22548 62579 157157 201027 150819 4106 -85964
24579 -85964 -70848 -23617 32195 50358 24534 -25377 -64069 -25256 -57308 1447 41967 -42059
24567 -42059 -87286 -96288 -47890 -20929 -54889 -43849 -77655 -125224 -72262 -105940 -43964 -47797
$$ packed form
24649A44859r9296O4517P8411o9415L1742o9770j25216O1765o39l4726K6367O0254
24637F8853N4212O9376j35240j48680n101L9357J12014O726r3462j0834N4035
24626A1256Q1124K6046j08158k1454m2401K29P0155M7476N273l8400K4394N6525
24614A12065q2710j23146M9335M1037n4519L3597o3301L3313k512n1308k666n0391
24602a61206l7785J35215N9776J2096J6844q2081O6428O651R1129L739m1283r8501
24590b8978R7323J13375n6777m0181o2214M0031R4578M3870n0208j46713r0070
24579h5964J5116M7231N5812J8163k5824m9911l8692L8813l2052N8755M0520q4026
24567d2059m5227r002M8398K6961l3960J1040l3806m7569N2962l3678O1976l833
$$ plain form
24555 -47797 -88397 -158534 -177996 -134545 -29754 58275 25454 -80924 -97197 -53791 20455
24544 20455 48131 67554 -50796 -14452 101847 65293 37831 -9867 -17613 -57248 -79816
24533 -79816 -10490 -8362 23584 127504 58129 3250 25292 27924 91897 86441 49675 91600
24521 91600 99145 106532 147193 94850 29385 47995 -18077 17390 125222 16650 -71715 -86328
24509 -86328 6604 6890 -69532 -79180 -16216 58106 12929 -18937 -81458 -93119 19117 91901
24497 91901 53855 54794 85039 141362 139933 80525 -41368 -78643 -98726 -63590 -52150 -19473
24485 -19473 -103969 -156795 -83739 -37048 -105596 -500 -36346 -135717 -126371 -128504 -166071 -71832
24473 -71832 -58338 -80465 4530 62191 72357 84635 206448 293401 155731 171639 196771
$$ packed form
24555d7797m0600p0137j9462M3451J04791Q8029l2821j06378j6273M3406P4246
24544B0455K7676J9423j18350L6344J16299l6554k7462m7698p746l9635k2568
24533g9816O9326K128L1946J03920o9375n4879K2042K632O3973n456l6766M1925
24521I1600P545P387M0661n2343o5465J8610o6072L5467J07832j08572q8365j4613
24509h6328R2932K86p6422r648O2964P4322m5177l1866o2521j1661J12236P2784
24497I1901l8046R39L0245N6323j429n9408j21893l7275k0083L5136J1440L2677
24485a9473q4496n2826P3056M6691o8548J05096l5846r9371R346k133l7567R4239
24473g1832J3494k2127Q4995N7661J0166J2278J21813Q6953j37670J5908K5132
$$ plain form
24462 196771 192234 219139 163509 135114 166119 100910 47666 5359 9216 68526 69796 21703
24450 21703 -38126 -101815 -112749 -103241 -38304 63789 198982 236667 222181 117635 53487
24439 53487 49461 76402 50666 -26676 -83761 -30909 17242 19367 -75701 -76298 -10151 -15776 12719
24426 12719 -27169 -139027 -103184 -56464 11414 3380 -47888 -15282 -46332 -64726 -120043 -102538
24414 -102538 -154308 -203350 -115307 83369 190485 162803 28894 -79753 -24185 3210 -76898
24403 -76898 -261 53853 23287 30260 -27906 -38293 -36245 61065 91166 59009 418 -55941
24391 -55941 22351 40886 -2641 -32426 -70448 -115525 -166443 -175528 -154189 -86711 11134 86188
24379 86188 42916 -88765 -28714 -25732 -82808 -23637 4149 -25718 37509 19145 -83089
$$ packed form
24462A96771m537K6905n5630k8395L1005o5209n3244m2307L857N9310J270m8093
24450B1703n9829o3689j0934R508O4937J02093J35193L7685j4486j04546o4148
24439E3487m026K6941k5736p7342n7085N2852M8151K125r5068n97O6147n625K8495
24426A2719l9888j11858L5843M6720O7878q034n1268L2606l1050j8394n5317J7505
24414a02538n1770m9042Q8043J98676J07116k7682j33909j08647N5568K7395q0108
24403g6898P6637N4114l0566O973n8166j0387K048R7310L0101l2157n8591n6359
24391e5941P8292J8535m3527k9785l8022m5077n0918r085K1339O7478R7845P5054
24379H6188m3272j31681O0051K982n7076N9171K7786k9867O3227j8364j02234
$$ plain form
24368 -83089 -111983 -36650 1773 -67629 -138315 -109191 -126238 -74521 -94632 -179953 -190951 -94809
24356 -94809 5115 -129857 -147501 -110568 -78469 -148785 -130984 -76554 2116 -31811 -64797
24345 -64797 -133935 -158981 -149473 -167384 -144831 -77513 -123585 -100320 -12371 40005 106959 71213
24333 71213 -16199 -26869 -42290 69129 129135 33807 -81675 -78863 -125977 -169884 -194567
24322 -194567 -143288 -109088 -72698 -43732 -53678 -68554 -12865 13362 12129 -88389 -27521 37260
24310 37260 16924 41638 51847 47881 61551 105134 136751 129356 17103 -47577 -44650 12307
24298 12307 19618 1695 66814 91087 75666 25961 -29593 -42083 -78867 -78352 -120902 -76163
24286 -76163 16720 -54230 -127238 -152315 -206261 -202440 -56993 -24557 -53988 -24778 -45879 -54303
$$ packed form
24368h3089k8894P5333L8423o9402p0686K9124j7047N1717k0111q5321j0998R6142
24356i4809R9924j34972j7644L6933L2099p0316J7801N4430P8670l3927l2986
24345f4797o9138k5046R508j7911K2553O7318m6072K3265Q7949N2376O6954l5746
24333G1213q7412j0670j5421J11419O0006r5328j15482K812m7114m3907k4683
24322a94567N1279L4200L6390K8966r946j4876N5689K6227j233j00518O0868O4781
24310C7260k0336K4714J0209l966J3670M3583L1617p395j12253o4680K927N6957
24298A2307P311j7923O5119K4273j5421m9705n5554j2490l6784N15m2550M4739
24286g6163R2883p0950p3008k5077n3946L821J45447L2436k9431K9210k1101q424
$$ plain form
24274 -54303 -110760 -44025 -140231 -241961 -197157 -97932 -64534 -29361 90840 71947 47770
24263 47770 -66808 -64447 -39453 -93156 -78907 81886 168971 187447 101850 90603 45347
24252 45347 30206 -44322 -19583 36419 81358 162665 176668 76217 -30042 -3733 -42127
24241 -42127 -179724 -125785 -21548 -52968 -92718 -81988 -13233 -111568 -90927 46557 76678
24230 76678 111515 155989 225152 276996 233833 151743 195482 163834 140635 86683 63560 80753
24218 80753 39679 36122 57911 113120 179329 214657 220082 79283 24508 -15021 -55534 -93780
24206 -93780 -183743 -118012 -121947 9460 25555 -23793 -64952 -129527 -158585 -106480 -40569 49305
24194 49305 58433 -18313 -35170 72246 -240 -102355 -129747 -39750 57515 66574 473 -26406
$$ packed form
24274e4303n6457O6735r6206j01730M4804R9225L3398L5173J20201j8893k4177
24263D7770j14578K361K4994n3703J4249J60793Q7085J8476q5597j1247m5256
24252D5347j5141p4528K4739N6002M4939Q1307J4003j00451j06259K6309l8394
24241d2127j37597N3939J04237l1420l9750J0730O8755r8335K0641J37484L0121
24230G6678L4837M4474O9163N1844m3163q2090M3739l1648k3199n3952k3123J7193
24218H0753m1074l557K1789N5209O6209L5328N425j40799n4775l9529m0513l8246
24206i3780q9963O5731l935J31407J6095m9348m1159o4575k9058N2105O5911Q9874
24194D9305R128p6746j6857J07416p2486j02115k7392Q9997R7265R059o6101k6879
$$ plain form
24182 -26406 39265 56193 -81351 -189441 -141242 -80237 -42635 20289 24786 -8304 16942
24171 16942 75664 78268 11720 14215 112691 229462 88168 -40489 -30642 -45240 -52448 2701
24159 2701 54053 76201 18042 84028 150762 20516 106761 217091 99965 -29667 51253
24148 51253 109488 43025 -38117 1228 -68990 -26657 -34845 -85741 -158725 -175072 -167827 -132637
24136 -132637 -2790 19626 -42269 -78055 -46044 -84832 -103184 -144909 -132590 -31766 -58164
24125 -58164 7534 -46736 -53105 -38352 -60339 -71835 -31856 17222 -19563 -268 -29898 -45716
24113 -45716 -77179 5423 31222 -75990 -106095 -21972 163783 312022 337313 172847 118067
24102 118067 122802 56771 -2444 -46618 8560 -4887 -30685 78 -14615 -643 85459 126760
$$ packed form
24182b6406O5671J6928j37544j08090M8199O1005L7602O2924M497l3090K5246
24171A6942N8722K604o6548K495R8476J16771j41294j28657R847j4598p208N5149
24159B701N1352K2148n8159O5986O6734j30246Q6245J10330j17126j29632Q0920
24148E1253N8235o6463q1142L9345p0218M2333q188n0896p2984j6347P245L5190
24136a32637J29847K2416o1895l5786L2011l8788j8352m1725J2319J00824k6398
24125e8164O5698n4270o369J4753k1987j1496L9979M9078l6785J9295k9630j5818
24113d5716l1463Q2602K5799j07212l0105Q4123J85755J48239K5291j64466n4780
24102A18067M735o6031n9215m4174N5178j3447k5798L0763j4693J3972Q6102M1301
$$ plain form
24090 126760 12162 -12534 -27251 -139296 -138547 -11602 -62378 928 88623 47835 -58937
24079 -58937 -103957 -46622 -17587 -26024 57761 52490 33675 122816 135601 43219 -150244 -164259
24067 -164259 -125892 -142736 -134618 -19592 -40040 -33618 -9308 52277 9669 -65591 -69939 -34680
24055 -34680 7574 -11850 44072 95041 2900 -25021 -51748 -5581 7287 60084 135703 96846
24043 96846 14407 -43629 -80343 -402 94048 126160 180039 81340 -61487 -4584 -32343
24032 -32343 -52311 -55586 -102589 -49910 11719 30563 -17323 47804 81574 104926 92655 24638
24020 24638 -43934 -134423 -128151 -105241 -108080 -91147 -57886 -26473 8596 94918 186452 205247
24008 205247 263287 143879 45571 -84795 -91701 -107525 -62431 -62685 -166258 -213796 -163114
$$ packed form
24090A26760j14598k4696j4717j12045P49J26945n0776O3306Q7695m0788j06772
24079e8937m5020N7335K9035q437Q3785n271j8815Q9141J2785r2382j93463j4015
24067a64259L8367j6844Q118J15026k0448O422K4310O1585m2608p5260m348L5259
24055c4680M2254j9424N5922N0969r2141k7921k6727M6167J2868N2797P5619l8857
24043I6846q2439n8036l6714P9941R4450L2112N3879r8699j42827N6903k7759
24032c2343j9968l275m7003N2679O1629J8844m7886O5127L3770K3352j2271o8017
24020B4638o8572r0489O272K2910k839J6933L3261L1413L5069Q6322R1534J8795
24008B05247N8040j19408r8308j30366o906j5824M5094k54j03573m7538N0682
$$ plain form
23997 -163114 -413 108444 71934 105395 26471 -46068 -95621 -42656 -30944 27797 -12231
23986 -12231 -54274 -64715 -49168 -116699 -101278 -32749 5133 -37186 -14322 16278 -25620 -35731
23974 -35731 -52989 -82509 -121758 -126703 -135003 -120095 -56937 -11790 11867 -80782 -136868 -48435
23962 -48435 25517 114682 53974 27373 -30878 -81070 -126605 -14649 -3186 -61185 108
23951 108 170381 161298 6679 -52065 18141 31579 -47287 -119537 -105423 51020 101297 16507
23939 16507 -44307 18681 96474 20909 -6333 17868 -18406 -60908 -40500 -47459 -5690 -58270
23927 -58270 -55303 -69164 -100191 55073 97937 11900 -30624 -53491 -65225 -45380 26003 37849
23915 37849 91538 157427 167017 -47199 -85806 -37759 -87829 -61002 -87646 -105428 -98846 -83102
$$ packed form
23997a63114J62701J08857l6510L3461p8924p2539m9553N2965J1712N8741m0028
23986a2231m2043j0441J5547o7531J5421O8529L7882m2319K2864L0600m1898j0111
23974c5731j7258k9520l9249m945q300J4908O3158M5147K3657r2649n6086Q8433
23962d8435P3952Q9165o0708k6601n8251n0192m5535J11956J1463n7999O1293
23951A08J70273r083j54619n8744P0206J3438p8866p2250J4114J56443N0277q4790
23939A6507o0814O2988P7793p5565k7242K4201l6274m2502K0408o959M1769n2580
23927e8270K967j3861l1027J55264M2864q6037m2524k2867j1734J9845P1383J1846
23915C7849N3689O5889R590k14216l8607M8047n0070K6827k6644j7782O582J5744
$$ plain form
23903 -83102 -142091 -206804 -160734 -126406 -177452 -105713 42372 60120 149021 166351 104306
23892 104306 97738 148692 56288 -62886 -15671 2863 -28348 -4449 61090 25986 -28334
23881 -28334 -30253 -21940 47266 -9093 -104925 -70126 -9245 20633 9793 -10531 -91790 -89497
23869 -89497 -77862 -125426 -140545 -144222 -148471 -153821 -112887 -18131 66898 62154 45032 73073
23857 73073 -22319 756 15850 39843 146554 162162 173192 177562 206939 218850 94153
23846 94153 13065 12021 23097 26774 -16272 -5003 49826 66082 9805 -60509 -62759 17567
23834 17567 20183 -77339 -139577 -120184 -144581 -113274 -105787 -31005 -95258 -74450 -91874 -157202
23822 -157202 417 75816 27780 146998 178559 145778 125349 -22155 -5098 25761 -59204
$$ packed form
23903h3102n8989o4713M6070L4328n1046P1739J48085J7748Q8901J7330o2045
23892A04306o568N0954r2404j19174M7215J8534l1211K3899O5539l5104n4320
23881b8334j919Q313O9206n6359r5832L4799O0881K9878j0840k0324q1259K293
23869h9497J1635m7564j5119l677m249n350M0934R4756Q5029m744j7122K8041
23857G3073r5392K3075J5094K3993J06711J5608J1030M370K9377J1911j24697
23846I4153q1088j044J1076L677m3046J1269N4829J6256n6277p0314k250Q0326
23834A7567K616r7522o2238J9393k4397L1307P487P4782o4253K0808j7424o5328
23822a57202J57619P5399m8036J19218L1561l2781k0429j47504J7057L0859q4965
$$ plain form
23811 -59204 25229 53501 43347 -70996 -101975 -81695 -7317 34573 128392 87467 101988
23800 101988 89088 -12031 17237 36462 -2405 -57818 -75151 -40096 -186495 -175198 -85361
23789 -85361 -85080 -40292 -6572 59372 97777 70855 101084 50487 22590 -54119 -112895 -132089
23777 -132089 -166509 -113263 111122 167971 52740 -112163 -108457 -80465 -3277 2799 18894
23766 18894 -45837 -151633 -107882 -55147 -139716 -148707 -68467 -15143 41287 82783 30581 -131128
23754 -131128 -98357 -55331 9930 106208 182365 141558 89919 -37871 -79404 -70729 -66949 -71497
23742 -71497 -108187 -35734 50173 145194 217520 173761 -36814 -147562 -158833 -106140 -128927
23731 -128927 -73226 3935 -2939 -77034 -39692 71105 19588 -38208 25035 61681 103737
$$ packed form
23811e9204Q4433K8272j0154j14343l0979K0280P4378M1890R3819m0925J4521
23800A01988j2900j01119K9268J9225l8867n5413j7333L5055j46399J1297Q9837
23789h5361K81M4788L3720O5944L8405k6922L0229n0597k7897p6709n8776j9194
23777a32089l4420N3246K24385N6849j15231j64903L706K7992P7188O076J6095
23766A8894o4731j05796M3751N2735q4569q991Q0240N3324N6430M1496n2202j61709
23754a31128L2771M3026O5261R6278P6157m0807n1639j27790m1533Q675L780m548
23742g1497l6690P2453Q5907R5021P2326m3759k10575j10748j1271N2693k2787
23731a28927N5701P7161o874p4095L7342J10797n1517n7796O3243L6646M2056
$$ plain form
23720 103737 146180 22434 10632 116895 157196 180375 171905 58567 -50712 -81478 -68117
23709 -68117 90166 140109 35321 -51587 7449 72952 88704 125698 24989 -84694 -115720
23698 -115720 -133175 -192260 -83313 18659 -1419 -72741 -36931 17916 -4756 -5342 -12271 -30442
23686 -30442 -49346 -135759 -153016 -126283 -32955 -24387 -37629 -32197 12082 11277 -31869 -93150
23674 -93150 -44970 26911 41462 -12636 21057 -55935 -73193 -16317 -57994 -30374 -88889 -135270
23662 -135270 -91131 -123902 -68443 -24954 -27884 -74755 -97530 -84346 2304 25946 -17450 -48347
23650 -48347 -121979 -91848 -117953 -74396 -118693 -143858 -96136 43607 -26673 -61452 -24566
23639 -24566 -1698 -29990 -17499 -50471 -62196 -103112 -106826 -98732 -130952 -69289 -7924 -47893
$$ packed form
23720A03737M2443j23746j1802J06263M0301K3179q470j13338j09279l0766J3361
23709f8117J58283M9943j04788q6908N9036O5503J5752L6994j00709j09683l1026
23698a15720j7455n9085J08947J01972k0078p1322L5810N4847k2672n86o929j8171
23686c0442j8904q6413j7257K6733R3328Q568j3242N432M4279q05m3146o1281
23674i3150M8180P1881J4551n4098L3693p6992j7258N6876m1677K7620n8515m6381
23662a35270M4139l2771N5459M3489k930m6871k2775J3184Q6650K3642m3396l0897
23650d8347p3632L0131k6105M3557m4297k5165M7722J39743p0280l4779L6886
23639b4566K2868k8292J2491l2972j1725m0916l714Q094l2220O1663O1365l9969
$$ plain form
23627 -47893 -104497 -77628 -98234 -94509 -89945 -42606 26787 96889 141663 64889 -23801 -7265
23615 -7265 110577 130386 163895 176305 124346 112469 93177 10889 -24126 29177 27265 -9058
23603 -9058 40944 137118 172491 24872 -60887 -13324 107682 89587 42719 -20482 -72698
23592 -72698 -57907 -12770 67199 109211 56035 3963 17254 -59864 -62860 -49332 -54081 33383
23580 33383 35058 -6666 154658 134300 86836 127125 31746 10311 -70786 -123596 -114468 -56995
23568 -56995 -12378 -12243 71617 62429 22364 -19463 -42653 -7124 -55666 -76508 -84572 -96544
23556 -96544 -109896 -135718 -189394 -164408 -148161 -135439 -57927 4340 -4154 -44424 -101933 -147896
23544 -147896 -161323 -199232 -239425 -149638 -171746 -158585 -107011 -90237 -209998 -199226 -158364
$$ packed form
23627d7893n6604K6869k0606L725M564M7339O9393P0102M4774p6774q8690J6536
23615g265J17842J9809L3509J2410n1959j1877j9292q2288l5015N3303j912l6323
23603i058N0002R6174L5373j47619q5759M7563J21006j8095m6868o3201n2216
23592g2698J4791M5137P9969M2012n3176n2072J3291p7118k996J3528m749Q7464
23580C3383J675m1724J61324k0358m7464M0289r5379k1435q1097n2810R128N7473
23568e6995M4617J35Q3860r188m0065m1827k3190L5529m8542k0842q064j1972
23556i6544j3352k5822n3676K4986J6247J2722P7512O2267q494m0270n7509m5963
23544a47896j3427l7909m0193Q9787k2108J3161N1574J6774j19761J0772M0862
$$ plain form
23533 -158364 -116978 -129688 -101785 -54169 -23404 73223 98903 113613 145005 159364 171230
23522 171230 77948 -48947 -70819 -76525 26093 -3444 -7994 83968 176754 189070 144228
23511 144228 75974 32322 90461 37718 -41887 -56711 -47927 -52172 -185903 -211688 -187102 -93797
23499 -93797 -2405 174945 237871 72606 -47061 -45371 12635 97223 103490 73349 -9862
23488 -9862 -69812 -35723 29237 33015 20662 30768 78131 52177 75043 108699 99311 84838
23476 84838 216557 304608 187310 31143 -96736 -74784 5336 12323 8597 31155 -40380
23465 -40380 34036 43788 50254 19383 458 -51308 -32900 31225 76258 85145 56195 17500
23453 17500 23563 78158 198493 130012 23511 -114833 -125701 -99864 -130318 -91537 -164947
$$ packed form
23533a58364M1386j2710K7903M7616L0765R6627K5680J4710L1392J4359J1866
23522A71230r3282j26895k1872n706J02618k9537m550R1962R2786J2316m4842
23511A44228o8254m3652N8139n2743p9605j4824Q784m245j33731k5785K4586R3305
23499i3797R1392J77350O2926j65265j19667J690N8006Q4588O267l0141q3211
23488i862n9950L4089O4960L778j2353J0106M7363k5954K2866L3656r388j4473
23476H4838J31719Q8051j17298j56167j27879K1952Q0120O987l726K2558p1535
23465d0380P4416R752O466l0871j8925n1766J8408O4125M5033Q887k8950l8695
23453A7500O063N4595J20335o8481j06501j38344j0868K5837l0454L8781p3410
$$ plain form
23442 -164947 -117625 7524 24370 -53525 -15103 68672 -2815 -146188 -159753 -24646 84288
23431 84288 156242 191927 187527 83910 5325 -35844 -45770 -101076 -192690 -163518 -140740 -153730
23419 -153730 -128677 -114855 2671 133739 171132 139254 98093 31980 72798 119503 81886
23408 81886 10862 65301 -7814 -61465 -107838 -85281 -27606 -44747 -19240 -46660 -4863 -39941
23396 -39941 10120 15338 -87734 -96500 -66515 80268 126780 88834 -79969 -87827 -367 32783
23384 32783 74739 22318 7006 4738 -137518 -159149 -25949 70404 122408 61165 -21141
23373 -21141 -45466 -20695 -65261 -95361 -42624 42769 20130 -50965 -33857 -59456 -68341 43135
23361 43135 42118 2418 52805 -10609 -157446 -114650 -79483 -42164 69891 81519 67705
$$ packed form
23442a64947M7322J25149J6846p7895L8422Q3775p1487j43373j3565J35107J08934
23431H4288P1954L5685m400j03617p8585m1169r926n5306r1614K9172K2778j2990
23419a53730K5053J3822J17526J31068L7393l1878m1161o6113M0818M6705l7617
23408H1886p1024N4439p3115n3651m6373K2557N7675j7141K5507k7420M1797l5078
23396c9941N0061N218j03072q766K9985J46783M6512l7946j68803p858Q7460L3150
23384C2783M1956n2421j5312k268j42256k1631J33200R6353N2004o1243q2306
23373b1141k4325K4771m4566l0100N2737Q5393k2639p1095J7108k5599q885J11476
23361D3135j017l9700N0387o3414j46837M2796L5167L7319J12055J1628j3814
$$ plain form
23350 67705 43929 107372 115075 71308 -106986 -18317 193902 262343 158711 60613 51261
23339 51261 105242 114508 213937 114133 103329 95318 108643 153107 133836 39658 73652 15853
23327 15853 77553 137797 164172 211838 251598 263175 172457 133199 54466 2139 -52765 -1311
23315 -1311 -63508 -48019 -131740 -139948 -194517 -47633 48490 -3874 98767 107584 113455 184063
23303 184063 141946 139810 103284 -19768 -12128 132405 198405 144634 96595 177851 196678
23292 196678 121544 157260 183634 60665 -25583 -67528 -182376 -239262 -126616 13102 88038
23281 88038 60308 25637 11824 20820 58429 97232 98627 73060 111470 56267 61828 119270
23269 119270 205783 145986 151638 153947 83937 3632 -12929 -22070 -110255 4354 2216 80851
$$ packed form
23350F7705k3776O3443P703m3767j78294Q8669K12219O8441j03632r8098r352
23339E1261N3981R266R9429r9804j0804q011J3325M4464j9271r4178L3994n7799
23327A5853O1700O0244K6375M7666L9760J1577r0718l9258p8733n2327n4904N1454
23315a311o2197J5489q3721q208n4569J46884R6123n2364J02641Q817N871P0608
23303A84063m2117k136l6526j23052P640J44533O6000n3771m8039Q1256J8827
23292A96678p5134L5716K6374j22969q6248m1945j14848n6886J12646J39718P4936
23281H8038k7730l4671j3813Q996L7609L8803J395k5567L8410n5203N561N7442
23269A19270Q6513n9797N652K309p0010q0305j6561r141q8185J14609k138P8635
$$ plain form
23257 80851 107944 87011 118870 111499 85098 32764 -70829 7549 57224 49322 39962 58959
23245 58959 20068 11243 -53834 -50111 -17070 -97090 -73069 -12943 38223 46294 22446 20766
23233 20766 54271 -77534 -193262 -206827 -178159 -93417 -114553 -126008 -203859 -155563 -46847
23222 -46847 76753 69256 64367 81529 17221 -80545 -67615 -99053 -92082 7289 51294 70952
23210 70952 8044 10529 55083 84268 3820 -59080 -3090 63917 84698 45800 18379 -6086
23198 -6086 -4945 13882 52839 45212 100933 61110 30557 -102907 -60730 -20501 -87362 -216983
23186 -216983 -171877 -8956 26589 -66411 -98220 -71997 16612 55768 78871 156832 304142
23175 304142 239448 89218 88730 58476 49491 52924 41936 26525 -27526 -29952 59841 125061
$$ packed form
23257H0851K7093k0933L1859p371k6401n2334j03593P8378M9675p902r360J8997
23245E8959l8891q825o5077L723L3041q0020K4021O0126N1166Q071k3848j680
23233B0766L3505j31805j15728j3565K8668Q4742k1136j1455p7851M8296J08716
23222d6847J23600p497m889J7162o4308r7766J2930l1438O971R9371M4005J9658
23210G0952o2908K485M4554K9185q0448o2900N5990O7007K0781l8898k7421k4465
23198f086J141J8827L8957p627N5721l9823l0553j33464M2177M0229o6861j29621
23186b16983M5106J62921L5545r3000l1809K6223Q8609L9156K3103P7961J47310
23175C04142o4694j50230m88l0254q985L433j0988j5411n4051k426Q9793O5220
$$ plain form
23163 125061 141838 129042 36717 -16999 -11757 10744 62150 -18637 -5413 -31104 -33932 -57742
23151 -57742 -1099 105788 184810 190005 150646 69045 -37707 -114285 -126618 -128279 -151065 -105188
23139 -105188 -45146 5453 -60677 -32002 4446 4368 -74687 -51246 -73449 -125877 -122008 -135749
23127 -135749 -61580 -130861 -62097 14698 72184 27228 -21889 -19556 -56373 -14138 65687 5108
23115 5108 -90570 -64076 -41931 -49033 -21999 -28191 -138703 -130565 -23649 -75262 -68257 37910
23103 37910 110863 87281 -56317 -11157 12442 -62770 -76015 -84221 -58557 -14443 53916 102873
23091 102873 83518 89563 81965 10605 46920 87701 53412 49441 27103 -56604 -169700 -190866
23079 -190866 -183765 -75139 -75501 -130325 -61481 23490 3395 -97574 -131763 27894 83685
$$ packed form
23163A25061J6777j2796r2325n3716N242K2501N1406q0787J3224k5691k828k3810
23151e7742N6643J06887P9022N195l9359q1601j06752p6578j2333j661k2786M5877
23139a05188O0042N0599o6130K8675L6448p8p9055K3441k2203n2428L869j3741
23127a35749P4169o9281O8764P6795N7486m4956m9117K333l6817M2235P9825o0579
23115E108r5678K6494K2145p102K7034o192j10512Q138J06916n1613P005J06167
23103C7910P2953k3582j43598M5160K3599p5212j3245q206K5664M4114O8359M8957
23091A02873j9355O045p598p1360L6315M0781l4289l971k2338q3707j13096k1166
23079a90866P101J08626l62n4824O8844Q4971k0095j00969l4189J59657N5791
$$ plain form
23068 83685 97825 41324 -42949 -116055 -155156 -169321 -256567 -169796 -210328 -272300 -212046 -209688
23056 -209688 -123996 -6831 4112 -36919 27779 47452 26760 24154 60646 54356 63657 82428
23044 82428 -25706 -36858 -19137 44734 -16986 -25920 -12570 -76463 -131043 -111333 -94746 -148758
23032 -148758 -174181 -215461 -200190 -115872 -106807 -169462 -160848 -36001 -11246 -22339 -7248 46795
23020 46795 54856 140205 131481 34178 81604 31863 30726 20097 -38920 -69657 -39575 -12525
23008 -12525 35853 121695 64066 -6592 -47220 -61270 -120217 -79234 -11622 11379 -51603 84799
22996 84799 133253 100025 134918 159118 64357 17020 -8248 -80814 -61541 -33491 90096
22985 90096 61583 44796 13042 103090 70923 -9099 -4305 12244 -115175 -199055 -332464
$$ packed form
23068H3685J4140n6501q4273p3106l9101j4165q7246Q6771m0532o1972O0254K358
23056b09688Q5692J17165J0943m1031O4698J9673k0692k606L6492o290R301J8771
23044H2428j08134j1152J7721O3871o1720q934J3350o3893n4580J9710J6587n4012
23032a48758k5423m1280J5271Q4318R065o2655Q614J24847K4755j1093J5091N4043
23020D6795Q061Q5349q724r7303M7426m9741j137j0629n9017l0737L0082K7050
23008a2525M8378Q5842n7629p0658m0628j4050n8947M0983O7612K3001o2982J36402
22996H4799M8454l3228L4893K4200r4761m7337k5268p2566J9273K8050J23587
22985I0096k8513j6787l1754R0048l2167q0022M794J6549j27419q3880j33409
$$ plain form
22974 -332464 -310465 -189898 -79764 -29033 52045 45925 -98769 -163681 -174445 -103119 -42943
22963 -42943 77780 49268 -108936 -267365 -200767 -90984 -12766 19347 17752 131844 137625
22952 137625 37706 128594 153498 100400 166421 138889 10803 12912 29908 92687 194118
22941 194118 221884 170118 197395 202511 91704 22414 -21677 -30940 34379 44455 6868 -71005
22929 -71005 -26834 -16141 -61297 -109737 -80562 -77580 -110354 -48308 -19866 -95288 -95774 -117729
22917 -117729 -52260 -39651 30210 -3161 -111877 -191614 -74679 85379 245129 195825 64612
22906 64612 59755 118735 64610 58127 -31073 -165284 -152075 -123801 -58631 33786 57368 39106
22894 39106 26779 83450 113117 50938 -25411 46175 27157 -54408 -19554 5437 186079
$$ packed form
22974c32464K1999J20567J10134N0731Q1078o120j44694o4912j0764P1326O0176
22963d2943J20723k8512j58204j58429O6598J09783P8218L2113j595J14092N781
22952A37625r9919R0888K4904n3098O6021k7532j28086K109J6996O2779J01431
22941A94118K7766n1766K7277N116j10807o9290m4091r263O5319J0076l7587p7873
22929g1005M4171J0693m5156m8440K9175K982l2774O2046K8442p5422m86k1955
22917a17729O5469J2609O9861l3371j08716p9737J16935J60058J59750m9304j31213
22906F4612m857N8980n4125o483q9200j34211J3209K8274O5170R2417K3582j8262
22894C9106j2327N6671K9667o2179p6349P1586j9018q1565L4854K4991J80642
$$ plain form
22883 186079 238040 166733 100048 44375 108072 102847 -24128 -27162 19463 99729 178690 226803
22871 226803 201944 191816 191702 188663 177501 60333 -23262 -66855 -41480 -13510 26433 36320
22859 36320 -80311 -140406 -62738 71027 117036 72924 32830 -13272 -47880 68392 16194
22848 16194 -92646 -80362 -1024 103914 142904 104089 48387 -39490 -104480 -5756 83584
22837 83584 138110 167822 129393 66745 69737 114134 3717 -19408 -33141 -8703 -28823 -32004
22825 -32004 25894 39437 -81640 -34929 112854 89712 2612 -41231 -52444 -47485 25166
22814 25166 42651 21136 141216 216610 134509 32144 78115 72871 135387 211204 232612
22803 232612 147881 99699 29123 8091 -19564 -61362 -13207 101470 51550 14220 -22044
$$ packed form
22883A86079N1961p1307o6685n5673O3697n225j26975l034M6625Q0266P8961M8113
22871B26803k4859j0128j14l039j1162j17168q3595m3593K5375K7970L9943R887
22859C6320j16631o0095P7668J33765M6009m4112m0094m6102l4608J16272n2198
22848A6194j08840J2284P9338J04938L8990l8815n5702q7877o4990R8724Q9340
22837H3584N4526K9712l8429o2648K992M4397j10417k3125j3733K4438k0120l181
22825c2004N7898J3543j21077M6711J47783k3142q7100m3843j1213M959P2651
22814B5166J7485k1515J20080P5394q2101j02365M5971n244O2516P5817K1408
22803B32612q4731m8182p0576k1032k7655m1798M8155J14677m9920l7330l6264
$$ plain form
22792 -22044 -21919 -11214 -103012 -64555 -18294 -13367 28445 109945 177207 164480 32533 -71421
22780 -71421 -138626 -85722 -76703 -163189 -118297 27318 32883 1303 60819 74912 82304 -14012
22768 -14012 -30878 -121869 -220798 -170279 -9342 157047 187460 83563 15704 3016 22322
22757 22322 -27437 -81918 -92503 -77202 -66952 -19931 2464 -74447 -102718 -79290 81730
22746 81730 53969 20489 -45664 -50605 -106825 -51433 2523 12305 10804 36581 68349 42190
22734 42190 -46089 -82911 -52245 -152182 -50414 -77549 -90457 -43065 50381 69715 -11039
22723 -11039 142465 234209 150066 78453 103440 40051 85172 46317 63520 155051 167271
22712 167271 88393 34788 110932 236878 232450 168770 103113 67402 71819 104773 28302 -22260
$$ packed form
22792b2044J25J0705r1798L8457M6261M927M1812Q1500O7262j2727j31947j03954
22780g1421o7205N2904R019q6486M4892J45615N565l1580N9516J4093P392r6316
22768a4012j6866r0991r8929N0519J60937J66389L0413j03897o7859j2688J9306
22757B2322m9759n4481j0585J5301J0250M7021K2395p6911k8271K3428J61020
22746H1730k7761l3480o6153m941n6220N5392N3956R782j501K5777L1768k6159
22734D2190q8279l6822L0666r9937J01768k7135j2908M7392R3446J9334q0754
22723a1039J53504R1744q4143p1613K4987o3389M5121l8855J7203R1531J2220
22712A67271p8878n3605P6144J25946m428o3680o5657l5711M417L2954p6471n0562
$$ plain form
22700 -22260 415 -19739 -14960 -59980 -37718 -83636 -55877 -7137 -81187 -131720 -131741 -97431
22688 -97431 -65301 -44513 106306 218102 142139 22422 7039 -116575 -80212 -30146 2466
22677 2466 73086 117947 183869 173386 168919 125871 99179 25935 -15194 -21971 46426 33672
22665 33672 -48456 -80121 4616 86717 175542 244722 157354 -21987 24593 108330 161799
22654 161799 184447 123457 114281 80965 168166 178067 115292 80352 28968 38658 85362 123965
22642 123965 76299 929 -18248 -47120 -168285 -176737 -148502 -184465 -208724 -176083 -145160
22631 -145160 -95904 -117421 -174008 -52036 71323 71876 -25766 -15572 -30168 -19128 32786
22620 32786 10223 -144024 -173276 -74388 10725 31698 -45807 -75444 -135706 -105315 -65426
$$ packed form
22700b2260K2675k0154M779m5020K2262m5918K7759M8740p4050n0533k1L4310
22688i7431L2130K0788J50819J11796p5963j19717j5383j23614L6363N0066L2612
22677B466P0620M4861O5922j0483m467m3048k6692p3244m1129o777O8397j2754
22665C3672q2128l1665Q4737Q2101Q8825O9180q7368j79341M6580Q3737N3469
22654A61799K2648o0990r176l3316Q7201R901o2775l4940n1384R690M6704L8603
22642A23965m7666p5370j9177k8872j21165q452K8235l5963k4259L2641L0923
22631a45160M9256k1517n6587J21972J23359N53r7642J0194j4596J1040N1914
22620C2786k2563j54247k9252R8888Q5113K0973p7505k9637o0262L0391L9889
$$ plain form
22609 -65426 -77358 -20251 -13060 18562 -86215 -169619 -51841 80633 70706 129296 118339
22598 118339 146140 87599 -27299 -8130 -50777 -86139 -113983 -153247 -85884 65728 112392
22587 112392 118625 91676 130593 129142 94523 92892 111984 85491 -74193 -78993 -33615 -176121
22575 -176121 -173148 -76364 -37882 13164 -26704 -31507 -62079 -68499 84840 92139 45704 -15608
22563 -15608 13713 -21732 -72099 -45372 81751 89162 30452 34407 64380 13225 -5815 6997
22551 6997 40240 89462 122029 106349 36500 -144642 -184118 -75098 -37569 -37325 -207984 -248145
22539 -248145 -152692 -98042 -27825 -38746 29525 83312 72398 -22969 -145522 -41362 22507
22528 22507 47631 17046 -3776 -43492 -84443 7419 -27007 -78542 16848 -4963 -62848 -61085
$$ packed form
22609f5426j1932N7107P191L1622j04777q3404J17778J32474r927N8590j0957
22598A18339K7801n8541j14898J9169m2647l5362k7844l9264O7363J51612M6664
22587A12392O233k6949L8917j451l4619j631J9092k6493j59684m800M5378j42506
22575a76121K973R6784L8482N1046l9868m803l0572o420J53339P299m6435o1312
22563a5608K9321l5445n0367K6727J27123P411n8710L955K9973n1155j9040J2812
22551F997L3243M9222L2567j5680o9849j81142l9476J09020L7529K44j70659m0161
22539b48145R5453N4650P0217j0921O8271N3787j0914r5367j22553J04160O3869
22528B2507K5124l0585k0822l9716m0951R1862l4426n1535R5390k1811n7885J763
$$ plain form
22516 -61085 -79392 33455 156111 201920 192923 44303 -59510 34257 137464 32141 -3303
22505 -3303 110316 137591 162440 89518 -7504 -71337 -108640 -157339 -250714 -314540 -170808
22494 -170808 -53977 56737 90594 29912 -20265 -34522 -112690 -60562 87707 137109 92846
22483 92846 92327 27854 76650 106159 112127 24618 -59697 -72210 -95833 -94662 -91954 -202446
22471 -202446 -162460 14683 52921 -165722 -262274 -170830 -48270 55100 -51980 -173932
22461 -173932 -70108 -19901 -2152 90783 103184 26870 25046 121838 44456 -40906 -21721
22450 -21721 121097 208366 211954 120356 49535 122621 180015 99419 -58543 18171 175147
22439 175147 204846 193286 174671 106833 73041 60007 131027 250196 167305 123314 107477
$$ packed form
22516f1085j8307J12847J22656M5809q997j48620j03813R3767J03207j05323l5444
22505c303J13619K7275K4849p2922r7022o3833l7303m8699r3375o3826J43732
22494a70808J16831J10714L3857o0682n0177j4257p8168N2128J48269M9402m4263
22483I2846n19o4473M8796K9509N968q7509q4315j2513k3623J171K708j10492
22471b02446L9986J77143L8238k18643r6552R1444J22560J03370j07080j21952
22461a73932J03824N0207J7749R2935J2401p6314j824R6792p7382q5362J9185
22450b1721J42818Q7269L588r1598p0821P3086N7394q0596j57962P6714J56976
22439A75147K9699j1560j8615o7838l3792j3034P1020J19169q2891m3991j5837
$$ plain form
22428 107477 112252 82724 68762 147824 54161 -83242 -33354 -81459 -107328 -61051 -106067
22417 -106067 -174014 -197515 -121739 -81911 -70459 -46568 -12787 38685 11532 -57278 -47616 -5253
22405 -5253 -62959 -8460 37907 90680 113968 92809 96186 93132 -50379 -51893 -128881 -123632
22393 -123632 -161387 -89891 5059 46873 80578 182876 89120 52076 69355 63693 74858
22382 74858 85525 64199 148816 185419 124081 -21313 -136436 -57661 -59119 -106522 -7006
22371 -7006 -36128 -56909 -69838 -38297 94147 59347 2464 63019 214800 294493 282378
22360 282378 154302 56603 1337 -96477 -67823 -77862 -110808 -17557 152935 168964 83198
22349 83198 96962 68458 -34131 27822 29108 21548 20449 93612 70336 46111 12938 -49269
$$ packed form
22428A07477M775k9528j3962P9062r3663j37403M9888m8105k5869M6277m5016
22417a06067o7947k3501P5776L9828J1452K3891L3781N1472k7153o8810R662M2363
22405e253n7706N4499M6367N2773K3288k1159L377l054j43511j514p6988N249
22393a23632l7755P1496R4950M1814L3705J02298r3756l7044J7279n662J1165
22382G4858J0667k1326Q4617L6603o1338j45394j15123P8775j458m7403R9516
22371g006k9122k0781j2929L1541J32444l4800n6883O0555J51781P9693j2115
22360B82378j28076r7699n5266r7814K8654j0039l2946R3251J70492J6029q5766
22349H3198J3764k8504j02589O1953J286p560j099P3163k3276k4225l3173o2207
$$ plain form
22337 -49269 -36449 29811 62547 98091 45995 69745 32311 -24352 -36177 -86106 -150886 -181149
22325 -181149 -95552 -17472 -53691 -7260 28861 61765 65286 -25351 -42158 -103126 -132112 -94194
22313 -94194 -103940 -146868 -112291 -14343 11256 -50005 -51203 80446 82323 -61042 -78260 -101749
22301 -101749 -201763 -146675 -164214 -85827 82199 198476 83828 -26594 -129801 -119003
22291 -119003 -48288 -348 60774 8037 -55890 -166663 -96315 -16866 66693 99737 62181
22280 62181 -64170 -83673 -2522 156600 133342 162456 163720 74379 -144637 -244953 -250370
22269 -250370 -143641 -1592 -52345 -81473 -13159 4327 20667 50479 52530 -57539 -100257
22258 -100257 -77335 -59852 -58716 -155493 -227411 -242200 -370479 -337274 -137517 -30121 54418
$$ packed form
22337d9269J2820O6260L2736L5544n2096K3750l7434n6663j1825m9929o4780l0263
22325a81149Q5597P8080l6219M6431L6121L2904L521r0637j6807o0968k8986L7918
22313i4194r746m2928L4577R7948K5599o1261j198J31649J877j43365j7218k3489
22301a01749j00014N5088j7539P8387J68026J16277j14648j10422j03207J0798
22291a19003P0715M7940O1122n2737o3927j10773P0348P9449Q3559L3044l7556
22280F2181j26351j9503Q1151J59122k3258K9114J264q9341k19016j00316n417
22269b50370J06729J42049n0753k9128O8314J7486J6340K9812K051j10069m2718
22258a00257K2922J7483J136r6777p1918j4789j28279L3205J99757J07396Q4539
$$ plain form
22247 54418 90006 -1822 -49908 -12366 8655 -67924 -73425 -10450 4113 -102267 2877
22236 2877 97455 120015 44611 -95089 -108246 -107230 -32268 -12211 -4886 -36483 -78570 -137712
22224 -137712 -86276 -18180 -41127 -155066 -228337 -317351 -195173 -132845 -12859 56530 95654
22213 95654 9082 -59452 26691 51516 -58450 -187257 -243770 -130347 -142717 -69458 52323
22202 52323 86067 118133 82016 45971 15333 -58611 -164493 -121778 -29910 75653 100516
22191 100516 5553 -116380 -111781 -10804 -94510 -139742 -95401 88022 93228 71740 4633
22180 4633 -145476 -231487 -218549 -79307 -25149 17273 33422 -55552 -144203 -154803 -113587
22169 -113587 -155358 -169903 -35108 4367 23787 23145 -105313 -160909 -174538 -104114 -161543
$$ packed form
22247E4418L5588r1828m8086L7542K1021p6579n501O2975J4563j06380J05144
22236B877R4578K2560p5404j39700j3157J016P4962K0057P325l1597m2087n9142
22224a37712N1436O8096k2947j13939p3271q9014J22178O2328J19986O9389L9124
22213I5654q6572o8534Q6143K4825j09966j28807n6513J13423j2370P3259J21781
22202E2323L3744L2066l6117l6045l0638p3944j05882M2715R1868J05563K4863
22191A00516r4963j21933M599J00977q3706m5232M4341J83423N206k1488o7107
22180D633j50109q6011J2938J39242N4158M2422J6149q8974q8651j0600M1216
22169a13587m1771j4545J34795L9475J9420o42j28458n5596j3629P0424n7429
$$ plain form
22158 -161543 -130909 -122751 -131284 -128787 -77437 -46662 18100 -96282 -205091 -155678 -127621 -107939
22146 -107939 -191938 -172609 -100585 -18740 -132 -56523 26154 63839 11623 32166 106432
22135 106432 57826 19277 -2335 46834 -16712 -33235 -46940 -9555 619 -14501 -50934
22124 -50934 -29177 -13712 48869 82225 133109 116429 96711 65300 136999 70360 37448 51515
22112 51515 81712 100532 142647 108248 122242 101551 53999 68398 166833 73449 13138 -32125
22100 -32125 -65118 -20732 78412 122089 18147 -5118 -9355 -11837 -37724 -72689 -125835 -146629
22088 -146629 -110260 -55415 61183 21705 37186 92609 116705 130383 88926 51184 58470
22077 58470 -15773 -2109 38804 23249 42922 90300 74383 -25956 -42220 -39338 -187376
$$ packed form
22158a61543L0634Q158q533K497N1350L0775O4762j14382j08809M9413K8057J9682
22146a07939q3999J9329P2024Q1845J8608n6391Q2677L7685n2216K0543P4266
22135A06432m8606l8549k1612M9169o3546j6523j3705L7385J0174j5120l6433
22124e0934K1757J5465O2581L3356N0884j6680j9718l1411P1699o6639l2912J4067
22112E1515L0197J8820M2115l4399J3994k0691m7552J4399R8435r3384o0311m5263
22100c2125l2993M4386R9144M3677j03942k3265m237k482k5887l4965n3146k0794
22088a46629L6369N4845J16598l9478J5481N5423K4096J3678m1457l7742P286
22077E8470p4243J3664M0913j5555J9673M7378j5917j00339j6264K882j48038
$$ plain form
22066 -187376 -204343 -138329 4818 122267 16187 -117452 -90300 -57269 -64942 -142994 -104133
22055 -104133 -29633 -74729 -68432 20543 95639 176219 123814 77131 98316 163873 168348 132654
22043 132654 69442 -50057 -20634 14303 -86606 -163068 -83815 39640 96866 125400 132650
22032 132650 181192 179027 118066 -7680 7677 -28258 -85349 88724 154911 -32449 -30970
22021 -30970 38067 90483 -3382 -61596 -84094 -68305 -63107 4580 -9414 -118935 -61206 52384
22009 52384 -46308 -186905 -171695 -182800 -283056 -209749 -49024 -8896 -58199 -25986 -26553
21998 -26553 -2578 127892 157817 24439 -7 64569 21199 67427 155496 93215 24338
21987 24338 -35423 -43661 -118693 -166213 -182332 -175685 -111044 -98093 11426 69463 72041 116049
$$ packed form
22066a87376j6967O6014J43147J17449j06080j33639K7152L3031p673p8052L8861
22055a04133P4500m5096O297Q8975P5096Q0580n2405m6683K1185O5557M475l5694
22043A32654o3212j19499K9423L4937j00909p6462P9253J23455N7226K8534P250
22032A32650M8542k165o0961j25746J5357l5935n7091J74073O6187j87360J479
22021c0970O9037N2416r3865n8214k2498J5789N198O7687j3994j09521N7729J13590
22009E2384r8692j40597J5210j1105j00256P3307J60725M0128m9303L2213n67
21998b6553K3975J30470K9925j33378k4446O4576m3370M6228Q8069o2281o8877
21987B4338n9761q238p5032m7520j6119O647O4641J2951J09519N8037K578M4008
$$ plain form
21975 116049 94574 112547 70536 -9317 -131809 -196102 -170672 -64012 -82379 -117468 -43884
21964 -43884 65632 -42889 -19005 -49065 -14994 30861 48437 27820 31451 3170 -109130
21953 -109130 -112598 -82219 -10744 82036 40896 -46722 -34812 -24145 24402 -124429 -165199
21942 -165199 -157879 -170805 -163769 -188233 -128898 -131600 -65618 -37911 -201376 -266592 -139676 -64630
21930 -64630 -102219 -82990 -19114 -11554 -16068 30124 69514 27831 -16291 -55468 -139886 -89511
21918 -89511 -51541 92156 182519 172357 176283 97217 -10452 -79447 -47810 -11235 3200
21907 3200 -52765 -61576 -46038 -58339 32426 41801 12128 66846 53905 -37565 45047 723
21895 723 -4647 57236 51177 -6690 67835 14745 -54586 -35896 -38074 -10392 -229 42772 40050
$$ packed form
21975A16049k1475J7973m2011p9853j22492o4293K5430J06660j8367l5089P3584
21964d3884J09516j08521K3884l0060L4071M5855J7576k0617L631k8281j12300
21953a09130l468L0379P1475R2780m1140q7618J1910J0667M8547j48831m0770
21942a65199P320j2926P036k4464N9335k702O5982K7707j63465o5216J26916P5046
21930f4630l7589J9229O3876P560m514M6192L9390m1683m4122l9177q4418N0375
21918h9511L7970J43697R0363j0162L926p9066j07669o8995L1637L6575J4435
21907C200n5965q811J5538j2301R0765R375k9673N4718j2941r1470Q2612m4324
21895G23n370O1883o059n7867P4525n3090o9331J8690k178K7682J0163M3001k722
$$ plain form
21882 40050 47082 52565 69097 92234 29898 -73413 -93109 -90362 -6138 71769 30564 -3910
21870 -3910 -49972 -32203 -3910 -22157 -22890 14443 -24255 -110150 -116791 -143706 -227316 -167287
21858 -167287 -7587 -3604 -53971 41551 74145 -39477 -107824 -51437 47464 -50635 -110956
21847 -110956 -91467 -59608 -25421 -55515 -137457 -115273 -135780 -6615 54053 -44754 -20883
21836 -20883 6483 2622 -6042 2376 -24985 -18679 -110953 -152527 -67330 17184 -33149 -37540 44896
21823 44896 -61468 -105198 -3549 51212 68326 36122 25595 9780 -60256 -93270 15474
21812 15474 34728 64107 204646 237467 142591 148423 168332 97314 -30742 -88198 -100498
21801 -100498 -98850 -155332 -73959 8928 100968 154890 -33113 -193054 -101047 -88114 -112045
$$ packed form
21882D0050P032N483J6532K3137o2336j03311j9696K747Q4224P7907m1205l4474
21870c910m6062J7769K8293j8247p33L7333l8698q5895o641k6915q3610O0029
21858a67287J59700L983n0367R5522L2594j13622o8347N6387R8901r8099o0321
21847a10956J9489L1859L4187l0094q1942K2184k0507J29165O0668r8807K3871
21836b0883K7366l861q664Q418k7361O306r2274m1574Q5197Q4514n0333m391Q2436
21823D4896j06364m3730J01649N4761J7114l2204j0527j5815p0036l3014J08744
21812A5474J9254K9379J40539L2821r4876N832J9909p1018j28056n7456j2300
21801a00498J648n6482Q1373Q2887R2040N3922j88003j59941R2007J2933k3931
$$ plain form
21790 -112045 -82839 -17932 -21311 29457 2462 -26816 -18963 -70765 -59691 -84446 -5307 -40210
21778 -40210 -124258 -126099 -68299 -57597 -65676 -33663 11718 29411 18835 -88178 -191848 -215636
21766 -215636 -194906 -206297 -111045 -138716 -145204 -101181 -58118 -69427 -98272 -133694 -133996 -47699
21754 -47699 28246 55795 86408 21131 -1671 139505 220528 169495 61332 60814 -23421 -100545
21742 -100545 -111049 -55232 -59433 -65242 -98967 -146154 -128322 -141777 -155241 -125425 -179785 -227433
21730 -227433 -171717 -205053 -57985 33882 182828 166432 -19781 -93176 -108500 -166904 -123978
21719 -123978 -109310 -64881 9854 4607 53562 37309 -85 -85285 -121999 -103706 -116128 -100035
21707 -100035 -25851 -38323 -92730 -37383 31417 -38163 -2174 -5410 44707 39964 37886 82669
$$ packed form
21790a12045K9206O4907l379N0768k6995k9278P853n1802J1074k4755P9139l4903
21778d0210q4048j841N7800J0702q079L2013M5381J7693j0576j07013j03670k3788
21766b15636K0730j1391R5252k7671o488M4023M3063j1309k8845l5422l02Q6297
21754d7699P5945K7549L0613o5277k2802J41176Q1023n1033j08163n18q4235p7124
21742a00545j0504N5817m201n809l3725m7187J7832j3455j3464K9816n4360m7648
21730b27433N5716l3336J47068R1867J48946j6396j86213p3395j5324n8404M2926
21719a23978J4668M4429P4735n247M8955j6253l7394q5200l6714J8293j2422J6093
21707a00035P4184j2472n4407N5347O8800o9580L5989l236N0117m743k078M4783
$$ plain form
21695 82669 27633 -56101 -76820 -62953 -8969 8520 98328 132650 82830 -52868 -90838
21684 -90838 -30683 -15092 106553 77610 -52363 -186429 -279490 -213844 -54278 -54189 -20779
21673 -20779 96733 129784 51369 26182 -32968 -147745 -201206 -190332 -94271 3781 -27580
21662 -27580 -151794 -162737 -75090 -10041 -72858 -60827 -19229 -54626 81348 37152 15920
21651 15920 61093 114120 64273 2394 -10620 -18573 -112044 -125841 -65079 -2046 79960 27535
21639 27535 36309 125421 124442 93701 155189 153110 98803 13918 -36415 47812 115513 -11096
21627 -11096 -89025 -104115 -66957 -30182 -50686 -116090 -136151 -58596 -97039 -167314 -104473 -79928
21615 -79928 -78459 -28170 17302 25128 -5205 -89028 -103968 -97921 47915 98227 -64130 -134315
$$ packed form
21695H2669n5036q3734k0719J3867N3984J7489Q9808L4322m9820j35698l7970
21684i0838O0155J5591J21645k8943j29973j34066r3061O5646J59566Q9L3410
21673b0779J17512L3051p8415k5187n9150j14777n3461J0874R6061R8052l1361
21662b7580j24214j0943Q7647O5049o2817J2031M1598l5397J35974m4196k1232
21651A5920M5173N3027m9847o1879j3014p953r3471j3797O0762O3033Q2006n2425
21639B7535Q774Q9112r79l0741O1488k079n4307q4885n0333Q4227O7701j26609
21627a1096p7929j5090L7158L6775k0504o5404k0061P7555l8443p0275O2841K4545
21615g9928J469N0289M5472P826l0333q3823j4940O047J45836N0312j62357p0185
$$ plain form
21603 -134315 -52898 8061 19150 100827 34667 -32017 -74381 -47503 16515 66180 15361
21592 15361 -43604 -28788 -57528 106 64272 121111 56576 3021 -52851 -5238 81182 25969
21580 25969 -25008 -16413 22049 -709 -23108 -15762 -4388 10213 31597 80541 50434 63095
21568 63095 82325 13381 42072 119421 112118 116158 59502 17942 8265 -24642 -76018 -162898
21556 -162898 -101514 -10394 -38113 -42037 48928 136447 170811 105881 38362 -14241 -120007
21545 -120007 -139489 26111 73835 13926 23995 38754 4498 -82122 -144703 -36417 29886
21534 29886 103702 74847 62060 -6106 -57349 20528 78207 171759 255949 316992 190619
21523 190619 63072 -3063 -4541 43657 46860 58732 45575 -14554 -15148 9670 21295 -9853
$$ packed form
21603a34315Q1417O0959J1089Q1677o6160o6684m2364K6878O4018M9665n0819
21592A5361n8965J4816k8740N7634O4166N6839o4535n3555n5872M7613Q6420n5213
21580B5969n0977Q595L8462k2758k2399P346J1374J4601K1384M8944l0107J2661
21568F3095J9230o8944K8691P7349p303M040n6656m1560r677l2907n1376q6880
21556a62898O1384R1120k7719l924R0965Q7519L4364o4930o7519n2603j05766
21545a20007j9482J65600M7724n9909J0069J4759l4256q6620o2581J08286O6303
21534B9886P3816k8855j2787o8166n1243P7877N7679R3552Q4190O1043j26373
21523A90619j27547o6135j478M8198L203J1872j3157o0129n94K4818J1625l1148
$$ plain form
21511 -9853 -83089 -50504 22806 -25251 -91556 -120314 -64181 144621 123120 109335 99168 79935
21499 79935 26747 48992 57152 -11073 -17511 -17748 2680 -45965 -60606 -5610 16824 33915
21487 33915 153819 129495 84532 75831 40530 53753 28750 21477 70659 68797 118332 38499
21475 38499 -6605 -42583 -67099 -110694 -20658 530 130675 95523 14133 -4144 93861
21464 93861 80867 -12711 -133603 -129048 -45112 59850 74587 -18406 -88910 -33179 -7212
21453 -7212 9168 -50396 1675 56510 86113 89088 78719 25354 -32324 -19203 -28405 -17665
21441 -17665 -38663 54913 90646 92100 58540 86341 23732 -32880 -11565 -31432 21896 -7101
21429 -7101 -89249 -117928 -93146 18584 90125 79707 77847 20760 58239 62012 56370 12312
$$ packed form
21511i853p3236L2585P3310m8057o6305k8758N6133K08802k1501j3785j0167j9233
21499G9935n3188K2245Q160o8225o438k37K0428m8645j4641N4996K2434J7091
21487C3915J19904k4324m4963q701l5301J3223k5003p273M9182j862M9535p9833
21475C8499m5104l5978k4516m3595R0036K1188J30145l5152q1390j8277R8005
21464I3861j2994r3578j20892M555Q3936J04962J4737r2993p0504N5731K5967
21453g212J6380n9564N2071N4835K9603K975j0369n3365n7678J3121r202J0740
21441a7665k0998R3576L5733J454l3560K7801o2609n6612K1315j9867N3328k8997
21429g101q2148k8679K4782J11730P1541j0418j860n7087L7479L773n642m4058
$$ plain form
21417 12312 934 82387 103388 40297 33151 -52173 -140579 -174200 -97385 -126252 -135598 3359
21405 3359 123741 76768 43521 3442 -24011 -33632 -170439 -162645 -84700 -135525 -40678 -82601
21393 -82601 -241738 -255335 -283429 -177145 -66858 72981 89406 34219 -44635 -12069 94074
21382 94074 118162 152027 75841 830 20768 56443 141295 131714 41258 -58743 -57805 50132
21370 50132 63010 79203 12559 -6605 150627 182789 191543 170687 171755 202684 241088 78654
21358 78654 -31619 -44151 -6144 8843 23617 -87289 -32228 -52960 -25804 -24975 -51149 -79117
21346 -79117 -35912 24518 -74885 -117902 -225259 -185677 -181734 -129930 -114267 -112247 -34792 89765
21334 89765 197765 169121 215446 229187 137204 49485 36417 25647 -51168 -104768 -137465
$$ packed form
21417A2312j1378Q1453K1001o3091p146q5324q8406l3621P6815k8867r346J38957
21405C359J20382m6973l3247m0079k7453r621j36807P794P7945n0825R4847m1923
21393h2601j59137j3597k8094J06284J10287J39839J6425n5187p8854L2566J06143
21382I4074K4088L3865p6186p5011J9938L5675Q4852r581r0456j00001R38J07937
21370E0132J2878J6193o6644j9164J57232L2162Q754k0856J068L0929L8404j62434
21358G8654j10273j2532L8007J4987J4774j10906N5061k0732K7156Q29k6174k7968
21346g9117M3205O0430r9403m3017j07357L9582L943N1804J5663K020P7455J24557
21334H9765J08000k8644M6325J3741r1983q7719j3068j0770p6815n3600l2697
$$ plain form
21323 -137465 -84450 -16586 11506 18003 -55563 61384 18618 -75786 -100611 -11290 21846
21312 21846 -1344 34253 -33319 -38710 61651 -14198 -69604 -6750 10575 44269 -7981 -67702
21300 -67702 -59903 28324 -42555 -89727 -63512 -150572 -105481 -3876 20324 53469 76810 233931
21288 233931 257412 163760 71701 -46154 -49001 184 42341 34851 38658 51526 14718 1272
21276 1272 18711 79269 136898 151541 122400 -22314 -78577 -116495 -179285 -151097 -79866 -10525
21264 -10525 75929 89542 6423 -47411 -35239 -67805 -46699 -63877 44018 53066 23746 10010
21252 10010 -43420 94529 90649 66713 43542 15115 58952 -14425 -32084 103414 105191 127356
21240 127356 150553 70791 62680 27953 -22420 -45642 -63390 -91364 -129683 -62304 -17080 -47972
$$ packed form
21323a37465N3015O7864K8092O497p3566J16947m2766r4404k4825Q9321L3136
21312B1846k3190L5597o7572n391J00361p5849n5406O2854J7325L3694n2250n9721
21300f7702P799Q8227p0879m7172K6215q7060M5091J01605K4200L3145K3341J57121
21288B33931K3481r3652r2059j17855k847M9185M2157p490L807J2868l6808j3446
21276A272J7439O0558N7629J4643k9141j44714n6263l7918o2790K8188P1231O9341
21264a0525Q6454J3613q3119n3834J2172l2566K1106j7178J07895R048k9320j3736
21252A0010n3430J37949l880k3936k3171k8427M3837p3377j7659J35498J777K2165
21240A27356K3197p9762q111l4727n0373k3222j7748k7974l8319O7379M5224l0892
$$ plain form
21228 -47972 -81877 -104935 -89031 -101550 -46250 -23790 14066 -7588 10504 -40522 -43702 15151
21216 15151 24739 -32975 62110 133195 80718 -60770 -164157 -160494 -90564 -8615 115647
21205 115647 169357 124611 49328 -49274 -114340 -127878 -58753 -28974 -153739 -225564 -72864
21194 -72864 -47869 -65826 -89108 -67117 -22190 -49372 -160601 -126911 -22531 59525 85269
21183 85269 32861 4910 55873 76030 44647 43138 10234 -96021 8642 140130 70179
21172 70179 -19610 -51842 -92142 -149961 -49124 22728 7918 -22981 -34238 -32208 -18255 33348
21160 33348 26154 -7657 25921 -40195 -73155 -152033 -102091 -5284 43736 57312 64098 16612
21148 16612 -46102 7792 215343 222503 169965 61734 14776 14958 51240 51878 30937 -40136
$$ packed form
21228d7972l3905k3058J5904j2519N5300K2460L7856k1654J8092n1026l180N8853
21216A5151R588n7714R5085P1085n2477j41488j03387L663O9930Q1949J24262
21205A15647N3710m4746p5283r8602o5066j3538O9125K9779j24765p1825J52700
21194g2864K4995j7957k3282K1991M4927k7182j11229L3690J04380Q2056K5744
21183H5269n2408k7951N0963K0157l1383j509l2904j06255J04663J31488o9951
21172G0179q9789l2232m0300n7819J00837P1852j4810l0899j1257K030J3953N1603
21160C3348p194l3811L3578o6116l2960p8878M9942R6807M9020J3576O786m7486
21148A6612o2714N3894K07551P160n2538j08231m6958J82L6282O38k0941p1073
$$ plain form
21136 -40136 -121549 -60684 -69135 -85331 -53688 -109511 9396 71076 10751 -20436 -72201 -69123
21124 -69123 45367 121934 142784 97772 77966 92350 189127 163759 151447 124466 63962
21113 63962 46549 46220 -70755 -30662 83553 115144 107743 114262 139525 142881 197999 165861
21101 165861 54723 -60499 -87219 -70294 -212071 -160199 -47339 -47160 -140522 -201104 -182679
21090 -182679 -53605 37227 54556 94139 72700 25148 -1578 32844 -6995 16536 11917
21079 11917 -98249 -195179 -227244 -179945 -67163 15115 55526 85529 28346 -93806 -56164
21068 -56164 -99033 -159932 -123647 -140808 -70904 50100 43701 -37550 -43834 16034 -23025 -43882
21056 -43882 -30917 37183 55649 64749 -141635 -256698 -241557 -220291 -125671 -114234 -93772
$$ packed form
21136d0136q1413O0865q451j6196L1643n5823J18907O1680o0325l1187n1765L078
21124f9123J14490P6567K0850m5012j9806J4384R6777k5368j2312k6981o0504
21113F3962j7413l29j16975M0093J14215L1591p401O519K5263L356N5118l2138
21101A65861j11138j15222k6720J6925j41777N1872J12860J79r3362o0582J8425
21090a82679J29074R0832J7329L9583k1439m7552k6726L4422l9839K3531m619
21079A1917j10166r6930l2065M7299J12782Q2278M0411L0003n7183j22152L7642
21068e6164m2869o0899L6285j7161O9904J21004o399q1251o284N9868l9059k0857
21056d3882J2965O8100J8466R100k06384j15063J5141K1266R4620J1437K0462
$$ plain form
21045 -93772 -70595 -17414 -28751 45273 106720 46656 -49892 25850 24380 -3701 -16330 48733
21033 48733 169444 4196 -103563 -138062 -181066 -257057 -221338 -158441 -60270 -10221 -86278
21022 -86278 -37511 -5816 -176354 -205095 -110551 -63124 -83884 -79489 -32244 -114085 -248306
21011 -248306 -222330 -107113 -59051 -57444 -42566 -34014 -78832 -151851 -192095 -131713 -111443 -134615
20999 -134615 -38280 -177475 -227888 -100688 27154 83514 53793 51747 42277 -17458 2919
20988 2919 7696 -116609 -157754 -72770 -24411 16398 -44336 -105569 -147276 -67110 15114 64418
20976 64418 36290 -72215 -110538 -62087 -124555 -123480 -201437 -163588 -96402 -49888 29471 13317
20964 13317 15595 31204 51066 20216 -52852 -79994 -86116 -37717 -66692 -113953 -95054 -73046
$$ packed form
21045i3772K3177N3181j1337P4024O1447o0064r6548P5742j470k8081j2629O5063
21033D8733J20711j65248j07759l4499m3004p5991L5719O2897R8171N0049p6057
21022h6278M8767L1695j70538k8741R4544M7427k0760M395M7245q1841j34221
21011b48306K5976J15217M8062J607J4878Q552m4818p3019m0244O0382K0270k3172
20999a34615R6335j39195n0413J27200J27842N6360k9721k046r470n9735K0377
20988B919M777j24305m1145Q4984M8359M0809o0734o1233m1707Q0166Q2224M9304
20976F4418k8128j08505l8323M8451o2468J075p7957L7849O7186M6514P9359j6154
20964A3317K278J5609J9862l0850p3068k7142o122M8399k8975m7261J8899K2008
$$ plain form
20952 -73046 -144404 -95907 -93103 -129484 5678 135671 81290 -75569 -183139 -148440 -96257
20941 -96257 -6356 -39107 -137462 -146607 -89120 -149411 -155025 -173008 -56261 -75671 20930 53836
20929 53836 10134 5024 -19202 -96793 -106168 17107 92523 84170 3800 -136258 -190572 -143013
20917 -143013 -44241 27756 88458 84251 -24809 -92807 -36562 -1540 -55538 -64163 -62790 -159773
20905 -159773 -203401 -152298 -126690 -68785 -173596 -222292 -203921 -92636 -96893 -74653 -15447
20894 -15447 -31871 -61368 -26809 -61425 -18362 134085 154286 68448 -60655 -82813 -96653
20883 -96653 -100194 -31151 -66136 -83471 -17185 -37477 -76668 -48747 -79515 43521 83128 15024
20871 15024 21484 -59260 -101549 -142103 -237172 -207362 -154689 -128300 -30808 -35254 -51569 31678
$$ packed form
20952g3046p1358M8497K804l6381J35162J29993n4381j56859j07570L4699N2183
20941i6257Q9901l2751r8355r145N7487o0291n614j7983J16747j9410R6601L2906
20929E3836m3702n110k4226p7591r375J23275P5416q353q0370j40058n4314M7559
20917a43013R8772P1997O0702m207j09060o7998N6245L5022n3998q625J373r6983
20905a59773m3628N1103K5608N7905j04811m8696J8371J11285m257K2240N9206
20894a5447j6424k9497L4559l4616M3063J52447K0201q5838j29103k2158j3840
20883i6653l541O9043l4985j7335O6286k0292l9191K7921l0768J23036L9607o8104
20871A5024O460q0744m2289m0554r5069K9810N2673K6389R7492m446j6315Q3247
$$ plain form
20859 31678 16807 58351 -34049 -81701 -7439 -81568 -99127 -117681 -107250 -103351 -134057 -194370
20847 -194370 -25331 29797 -99096 -149350 -148052 -118900 -28828 -52719 -102129 -39786 3916
20836 3916 60658 90691 100138 -1563 -76796 -104679 -50934 -64244 -100815 -47215 -78553 -154859
20824 -154859 -80953 52284 47641 88404 180506 212336 103490 -21241 -176675 -188811 -28255
20813 -28255 13915 -49591 21249 88011 -43999 -64106 65865 63533 44379 34436 77448 24816
20801 24816 -109502 -101952 -90665 -59377 12922 100763 21854 -158942 -188277 -23033 -10853
20790 -10853 -82715 -130607 -219657 -213768 -161987 -222885 -45812 43058 49798 -59072 -33173 -24022
20778 -24022 -53595 -27081 -69200 -93093 3000 109243 62133 57853 42281 -47955 -112441 -151496
$$ packed form
20859C1678j4871M1544r2400m7652P4262p4129j7559j8554J0431L899l0706o0313
20847a94370J69039N5128j28893n0254J298K9152R0072k3891m9410O2343M3702
20836C916N6742L0033R447j01701p5233k7883N3745j3310l6571N3600l1338p6306
20824a54859P3906J33237m643M0763R2102L1830j08846j24731j55434j2136J60556
20813b8255M2170o3506P0840O6762j32010k0107J29971k332j9154r943M3012n2632
20801B4816j34318P550J1287L1288P2299Q7841p8909j80796k9335J65244J2180
20790a0853p1862m7892q9050N889N1781o0898J77073Q8870O740j08870K5899R151
20778b4022k9573K6514m2119k3893R6093J06243m7110m280j5572r0236o4486l9055
$$ plain form
20766 -151496 -133732 -187697 -247501 -180019 -144236 -11915 79003 7943 -110822 -99022 -31010
20755 -31010 6566 2753 42002 -10920 -87381 -141995 -31754 111596 221151 238790 124568
20744 124568 -2921 -85762 -145756 -122153 -86263 -72383 1529 165486 149858 -41640 -226755
20733 -226755 -57705 88770 123018 82318 108403 195793 76570 -72857 -99581 51138
20723 51138 178108 167390 62006 143418 177255 45079 12456 44767 43772 -62052 -143824
20712 -143824 -37153 6379 59007 164331 205844 177100 77304 25178 11847 25666 4023
20701 4023 6395 11887 -7095 25474 84525 73401 85031 42350 -28573 -67007 -70939 -40817
20689 -40817 -37092 -39054 -25543 -31439 -26627 -67737 -139570 -245376 -239558 -99414 -3414 -3447 -2803
$$ packed form
20766a51496J7764n3965n9804O7482L5783J32321R0918p1060j18765J1800O8012
20755c1010L7576l813L9249n2922p6461n4614J10241J43350J09555J7639j14222
20744A24568j27489q2841n9994K3603L5890J3880P3912J63957j5628j91498j85115
20733b26755J69050J46475L4248m0700K6085Q7390j19223j49427k6724J50719
20723E1138J26970j0718j05384Q1412L3837j32176l2623L2311r95j05824q1772
20712a43824J06671M3532N2628J05324M1513k8744r9796n2126j3331J3819k1643
20701D023K372N492j8982L2569N9051j1124J1630m2681p0923l8434l932L0122
20689d0817L725j962J3511n896M812m1110p1833j05806N818J40144R6000l3O44
$$ plain form
20676 -2803 -14792 -23277 49736 73300 62201 50421 -120930 -190072 -105634 -3925 4684 2883
20664 2883 -66714 -64197 -6539 -13036 -41764 -105363 -87293 -55653 15784 50791 79956 65434
20652 65434 -2335 -57795 48041 103134 125020 185727 176103 141943 111823 69172 57960 42715
20640 42715 112031 73968 68832 151164 48102 -182119 -210516 -129280 -171586 -18165 57088
20629 57088 15017 -59811 -113704 -111640 -83743 -15796 -114645 5201 8137 -62296 -114906 -116992
20617 -116992 5820 38843 98489 104385 160604 84089 41726 132618 83175 -4610 -8903 -1420
20605 -1420 89343 35246 54594 27449 -33898 21480 71305 90546 19100 -47508 -163059 -244294
20593 -244294 -239752 -151944 -96935 -62502 -9155 41825 26810 36969 54734 105314 72456 81855
$$ packed form
20676b803j1989q485P3013K3564j1099j1780j71351o9142Q4438J01709Q609j801
20664B883o9597K517N7658o497k8728o3599J8070L1640P1437L5007K9165j4522
20652F5434o7769n5460J05836N5093K1886O0707r624l4160l0120m2651j1212j5245
20640D2715O9316l8063n136Q2332j03062k30221k8397Q1236m2306J53421P5253
20629E7088m2071p4828n3893K064K7897O7947r8849J19846K936p0433n2610k086
20617a16992J22812L3023N9646N896N6219p6515m2363R0892m9443q7785m293P483
20605a420R0763n4097J9348k7145o1347N5378M9825J9241p1446o6608j15551q1235
20593b44294M542Q7808N5009L4433N3347N0980j5015J0159J7765N0580l2858R399
$$ plain form
20581 81855 33142 -6676 -21807 -28650 -22491 -88263 -87512 55352 122864 40311 -28691 91678
20569 91678 72798 28846 14483 77005 78763 830 -29491 -77076 70526 105518 26120 63961
20557 63961 111198 168123 102316 30714 -18230 -60241 -108052 -84322 -10182 -65754 -156402 -112543
20545 -112543 -23176 49361 -12297 -41204 -6194 -57638 -20911 -74928 -89374 -28585 -101786
20534 -101786 -71222 -42724 -2777 -39498 -55132 -31348 56671 35192 83022 103010 150659
20523 150659 130608 34600 -87676 -6926 79537 38431 -112300 -155925 -104441 -162617 -128422
20512 -128422 -104123 -117145 -130788 -66939 17035 6063 -10493 -31060 -51307 37074 41222 75141
20500 75141 159172 167540 87444 13053 28998 903 -56531 21152 51396 21174 45721 47844
$$ packed form
20581H1855m8713l9818j5131o843O159o5772P51J42864O7512q2553o9002J20369
20569I1678j8880m3952j4363O2522J758p7933l0321m7585J47602L4992p9398L7841
20557F3961M7237N6925o5807p1602m8944m2011m7811K3730P4140n5572r0648M3859
20545a12543Q9367P2537o1658k8907L5010n1444L6727n4017j4446O0789p3201
20534a01786L0564K8498L9947l6721j5634K3784Q8019k1479M7830J9988M7649
20523A50659k0051r6008j22276Q0750Q6463m1106j50731m3625N1484n8176L4195
20512a28422K4299j3022j3643O3849Q3974j0972j6556k0567k0247Q8381M148L3919
20500G5141Q4031Q368q0096p4391J5945k8095n7434P7683L0244l0222K4547K123
$$ plain form
20488 47844 28817 -68075 -23463 78173 28865 -96883 -163048 7356 120342 44765 31623
20477 31623 33939 20313 -65945 -91049 -139353 -168683 -39065 82392 135219 57599 -75236
20466 -75236 -181836 -204941 -29101 9808 55744 43364 29572 165114 188983 41624 -45863
20455 -45863 -78673 16878 61023 163518 111388 64147 99086 160226 70529 47042 -23830
20444 -23830 -27086 -122544 -102575 -16818 96773 93481 65011 109600 71577 52291 51420 36390
20432 36390 -41296 72738 145363 -65386 -159168 -157207 -153851 -121504 -17487 98618 86914
20421 86914 -17816 -138211 -144711 -42062 70686 86908 -55608 -26673 -6617 22259 61956
20410 61956 47696 48077 92982 -28137 -92266 -111377 -62021 33573 -9633 -83148 -48804 -119553
$$ packed form
20488D7844j9027r6892M4612J01636m9308j25748o6165J70404J12986p5577j3142
20477C1623K316j3626q6258k5104m8304k9330J29618J21457N2827p7620j32835
20466g5236j06600k3105J75840L8909M5936j2380j3792J35542K3869j47359q7487
20455d5863l2810R5551M4145J02495n2130m7241L4939O1140q9697k3487p0872
20444b3830l256r5458J9969Q5757J13591l292k8470M4589l8023j9286q71j5030
20432C6390p7686J14034P2625k10749r3782J961L356L2347J04017J16105j1704
20421H6914j04730j20395o500J02649J12748J6222j42516K8935K0056K8876L9697
20410F1956j4260L81M4905j21119o4129j9111M9356R5594m3206p3515L4344p0749
$$ plain form
20398 -119553 -170596 -133450 -97079 -108844 4355 117541 110669 68980 -1224 -146499 -149594
20387 -149594 -59540 50908 65959 179681 254886 210417 154371 166240 100869 -3100 62669
20376 62669 51698 23865 37320 48386 42573 -16243 -49202 -69982 40346 115485 6196
20365 6196 16009 55961 115224 116307 106106 108439 177267 181607 175179 154919 113280 34396 32487
20352 32487 -7241 -27498 -34050 -126508 -75689 83667 85738 26666 -37863 5259 79467 152250
20340 152250 56272 -2420 48635 -46363 -32037 -15366 4056 26597 59315 -6495 -10136 90020
20328 90020 88608 42838 43920 67925 109924 111193 5974 -9997 -35542 -30763 34120 2137
20316 2137 -82772 -131581 -238325 -202966 -165670 -165960 -144168 -101189 -34812 24169 100663 -54080
$$ packed form
20398a19553n1043L7146L6371j1765J13199J13186o872m1689p0204j45275l095
20387a49594R0054J10448J5051J13722P5205m4469n6046J1869o5371j03969O5769
20376F2669j0971k7833J3455J1066n813n8816l2959k0780J10328P5139j09289
20365F196R813L9952N9263J083j0201K333O8828M340o428k0260m1639p8884j909
20352C2487l9728k0257o552r2458N0819J59356K071n9072o4529M3122P4208P2783
20340A52250r5978n8692N1055r4998J4326J6671J9422K2541L2718o5810l641J00156
20328I0020j412m5770J082K4005M1999J269j05219j5971k5545M779O4883l1983
20316B137q4909m8809j06744L5359L7296k90K1792M2979O6377N8981P6494j54743
$$ plain form
20304 -54080 -176903 -146794 -146274 -181036 -175219 -42640 -29992 -147463 -245086 -285507 -215159 -122907
20292 -122907 -74011 -54704 -68255 -177514 -175223 -123055 -106783 -64135 35540 -14533 84953
20281 84953 85622 40540 41939 59124 34011 -37221 22567 76009 40941 -4437 -35157 -16057
20269 -16057 -41655 20822 45533 -11227 1712 18250 -22955 1689 22034 -2724 -23809 12825
20257 12825 -10244 -42120 -71118 -23529 53615 10996 -43194 34406 37732 57555 144056 216402
20245 216402 60454 -54133 -139120 -76916 -127375 -203334 -158604 3531 43003 20027 31273
20234 31273 80865 167298 113417 15988 94512 131005 150491 107515 20535 15451 -23132 -34982
20222 -34982 -79642 -51175 68704 187962 132555 14210 -44263 -102526 8950 153635 134737
$$ packed form
20304e4080j22823L0109N20l4762N817J32579J2648j17471r7623m0421P0348R2252
20292a22907M8896J9307j3551j09259K291N2168J6272M2648R9675n0073R9486
20281H4953O69m5082J399J7185k5113p1232N9788N3442l5068m5378l0720J9100
20269a6057k5598O2477K4711n6760J2939J6538m1205K4644K0345k4758k1085L6634
20257A2825k3069l1876k8998M7589P7144m2619n4190P7600L326J9823Q6501P2346
20245B16402j55948j14587q4987O2204n0459p5959M4730J62135L9472k2976J1246
20234C1273M9592Q6433n3881r7429P8524L6493J9486m2976q6980n084l8583j1850
20222c4982m4660K8467J19879J19258n5407j18345n8473n8263J11476J44685j8898
$$ plain form
20211 134737 -57215 -117735 -7380 79648 115813 127983 36112 -66041 -70412 -91544 -38519
20200 -38519 -27825 -40445 -46735 -14079 73297 65781 28541 140312 138259 112439 92867 35169
20188 35169 27682 119595 159703 230686 206010 58496 -5847 51906 -3007 9645 -115203
20177 -115203 -97993 4721 -15770 -25432 59586 43618 -16461 -51355 -18660 65480 145160
20166 145160 252644 240379 177507 106551 -93289 -191495 -137677 -39168 58190 131060 98634
20155 98634 -7677 -71572 -132505 -92592 -16217 -1939 -6255 -60984 -87156 -46591 -85166 -55697
20143 -55697 -52790 -75959 -134112 -106741 -62143 -127702 30191 98647 156748 119909 15012
20132 15012 -42479 -118998 -84673 4673 52858 55563 -17273 -153990 -132322 -38534 24847 50990
$$ packed form
20211A34737j91952o0520J10355Q7028L6165J2170r1871j02153m371k1132N3025
20200c8519J0694j2620o290L2656Q7376p516l7240J11771k053k5820j9572n7698
20188C5169p487R1913M0108P0983k4676j47514o4343N7753n4913J2652j24848
20177a15203J7210J02714k0491r662Q5018j5968o0079l4894L2695Q4140P9680
20166A45160J07484j2265o2872p0956j99840r8206N3818R8509R7358P2870l2426
20155I8634j06311o3895o0933L9913P6375J4278m316n4729k6172M0565l8575K9469
20143e5697K907k3169n8153K7371M4598o5559J57893O8456N8101l6839j04897
20132A5012n7491p6519L4325Q9346M8185K705p2836j36717K1668R3788O3381K6143
$$ plain form
20120 50990 -11840 -40504 -66270 -25420 -41811 -24277 74511 -3414 77495 170423 184001 115319
20108 115319 108287 201483 193080 74344 -46798 -122632 -103756 -160626 -188836 -159517 -70940
20097 -70940 4751 16320 -774 35901 65622 45222 31801 -32679 -57216 -55282 26623 64945
20085 64945 63971 -26560 45039 93210 313 -117834 -121557 -81089 7284 -66643 -98278 -36999
20073 -36999 -109784 -141246 -80545 -27041 22385 29653 2877 12607 -27062 -62238 -5497 39529
20061 39529 -102430 -206346 -158285 2944 93588 39374 21932 25207 -13887 82007 124712
20050 124712 34278 -22879 -18525 -1865 1479 117373 141450 149788 73606 113138 99180 -44044
20038 -44044 -56164 -48142 -70513 -100902 -180117 -119399 -6677 -37989 -38916 27642 33705 87710
$$ packed form
20120E0990o2830k8664k5766M0850j6391J7534R8788p7925Q0909R2928J3578o8682
20108A15319p032R3196q403j18736j21142p5834J8876n6870k8210K9319Q8577
20097g0940P5691J1569j7094L6675K9721k0400j3421o4480k4537J934Q1905L8322
20085F4945r74r0531P1599M8171r2897j18147l723M0468Q8373p3927l1635O1279
20073c6999p2785l1462O0701N3504M9426P268k6776R730l9669l5176N6741M5026
20061C9529j41959j03916M8061J61229R0644n4214j7442L275l9094R5894M2705
20050A24712r0434n7157M354J6660L344J15894K4077Q338p6182L9532j3958j43224
20038d4044j2120Q022k2371l0389p9215O0718J12722l1312r27O6558O063N4005
$$ plain form
20026 87710 61194 66123 123538 108327 47888 6369 -25832 93610 74417 132178 181450 163686
20014 163686 85878 23733 27157 42654 -5760 -23578 -20925 32239 133915 90497 50428 -26974
20002 -26974 -48303 29886 52929 11980 -72247 -66726 -59718 -25556 -39632 -70988 -92018 -113851
19990 -113851 -69641 18441 109386 188362 180377 143022 192404 184465 67581 44586 7509 62745
19978 62745 32081 -92954 -54229 -73979 -76849 -109458 -70068 -41530 -52260 -32139 -21258 -124965
19966 -124965 -67374 -31109 -83157 -54776 -75081 -45331 59090 60334 3037 19943 21555 -132354
19954 -132354 -179258 -120251 -150708 -63127 90534 147052 139306 224003 108163 -85869 -107627
19943 -107627 -48868 -2878 -104657 -131994 -156546 -145546 -67563 9456 4659 37783 19415
$$ packed form
20026H7710k6516M929N7415j5211o0439m1519l2201J19442j9193N7761M9272j7764
20014A63686p7808o2145L424J5497m8414j7818K653N3164J01676m3418m0069p7402
20002b6974k1329P8189K3043m0949q4227N521P008L4162j4076l1356k1030k1833
19990a13851M4210Q8082R0945P8976p985l7355M9382p939j16884k2995l7077N5236
19978F2745l0664j25035L8725j9750k870l2609L9390K8538j0730K0121J0881j03707
19966a24965N7591L6265n2048K8381k0305K9750J04421J244n7297J6906J612j53909
19954a32354m6904N9007l0457Q7581J53661N6518p746Q4697j15840j94032k1758
19943a07627N8759M5990j01779k7337k4552J1000P7983P7019m797L3124j8368
$$ plain form
19932 19415 -65560 -97684 -70634 -49486 -85523 -42660 -66767 13546 -36735 -51626 69075
19921 69075 42972 5346 -57178 -103504 48279 128023 61322 4192 -17554 -16078 -15616 -20743
19909 -20743 -65787 -76909 -5316 54326 24424 9463 31661 101916 188061 239101 227417 126727
19897 126727 31928 20002 90182 54193 44694 100561 81913 86010 85602 108544 61590 53840
19885 53840 -22118 -48261 -134336 -112041 -142768 -128657 406 28690 -7118 -45115 -18495
19874 -18495 35218 14159 -48880 -88731 -41842 -72522 -98671 -108385 -124077 -46034 -30542 -44442
19862 -44442 -24256 70187 89078 106634 165217 55877 -36303 -50118 21019 40574 -41580
19851 -41580 -30978 -27838 -586 1296 40486 -5979 33792 -3910 -76355 -65414 11140 123271
$$ packed form
19932A9415q4975l2124K7050K1148l6037M2863k4107Q0313n0281j4891J20701
19921F9075k6103l7626o2524m6326J51783P9744o6701n7130k1746J476M62n127
19909b0743m5044j1122P1593N9642k9902j4961K2198P0255Q6145N1040j1684j00690
19897A26727r4799j1926P0180l5989r499N5867j8648M097m08K2942m6954p750
19885E3840p5958k6143q6075K2295l0727J4111J29063K8284l5808l7997K6620
19874a8495N3713k1059o3039l9851M6889l0680k6149r714j5692P8043J5492j3900
19862d4442K0186R4443J8891J7556N8583j09340r2180j3815P1137J9555q2154
19851d1580J0602L140K7252J882L9190m6465L9771l7702p2445J0941P6554J12131
$$ plain form
19839 123271 142696 127165 110809 -7201 -45412 -19599 -62387 -172255 -168508 -54723 7848
19828 7848 -80552 -75874 -54392 -59234 -47792 -9063 -122672 -88948 -98654 -45230 64794 87028
19816 87028 171836 150403 226395 279421 208653 303304 438702 495400 513454 381318 307365
19805 307365 210010 185735 205046 250243 261700 371567 447499 447823 496118 492649 571846 706741
19793 706741 605563 433729 293851 323915 337520 481755 536968 580917 564713 447645
19783 447645 231688 11710 -5200 -70159 6262 33749 -26731 -104721 -82422 -33137 -37413
19772 -37413 -45147 -64710 -133060 -193501 -105067 79256 70386 94088 135556 243484 327872 277069
19760 277069 142772 134301 81404 34831 24629 28892 74090 222722 479466 593788 519854
$$ packed form
19839A23271J9425j5531j6356j18010l8211K5813m2788j09868L747J13785O2571
19828G848q8400M678K1482m842J1442L8729j13609L3724r706N3424J10024K2234
19816H7028Q4808k1433P5992N3026p0768R4651J35398N6698J8054j32136p3953
19805C07365r7355k4275J9311M5197J1457J09867P5932L24M8295l469P9197J34895
19793G06741j01178j71834j39878L0064J3605J44235N5213M3949j6204j17068
19783D47645k15957k19978j6910o4959P6421K7487o0480p7990K2299M9285m276
19772c7413p734j9563o8350o0441Q8434J84323q870K3702M1468J07928Q4388n0803
19760B77069j34297q471n2897m6573j0202M263M5198J48632K56744J14322p3934
$$ plain form
19749 519854 460609 358414 299865 355938 375410 499518 634439 537415 317642 124129
19739 124129 144043 248228 350677 424020 478166 507593 407088 310331 263903 117496 65185
19728 65185 100882 143464 218600 278951 246807 118952 96053 114929 136352 167275 142832
19717 142832 63857 77783 59291 90090 82441 76445 7183 34797 6098 -29400 45035 4610
19705 4610 -77510 -95741 -38157 -22000 -27350 -44008 27190 53108 36486 -68784 -76491 2272
19693 2272 -26547 -60592 -63278 -120935 -46804 -7969 746 -22275 62623 122881 101999 28254
19681 28254 27224 122140 144779 154171 108450 -83417 -124402 -141498 -57338 -8698 -48508 37294
19669 37294 31935 25799 38231 -1577 -57411 -53438 43330 132785 93049 51311 100134 111379
$$ packed form
19749E19854n9245j02195n8549N6073J9472J24108J34921r7024k19773j93513
19739A24129J9914J04185J02449P3343N4146K9427j00505r6757m6428j46407n2311
19728F5185L5697M2582P5136O0351l2144j27855k2899J8876K1423L0923k4443
19717A42832p8975J3926j8492L0799p649n996o9262K7614k8699l5498P4435m0425
19705D610q2120j8231N7584J6157n350j6658P1198K5918j6622j05270p707P8763
19693B272k8819l4045k686n7657P4131L8835Q715k3021Q4898O0258k0882p3745
19681B8254j030R4916K2639R392m5721j91867m0985j7096Q4160M8640l9810Q5802
19669C7294n359o136J2432l9808n5834L973R6768Q9455l9736m1738M8823J1245
$$ plain form
19657 111379 3649 -20506 -9878 52358 57860 130896 211898 188290 126143 14957 -76486
19646 -76486 -44242 41765 105757 118950 -5019 -15410 -50765 -85831 -28548 10380 45764
19635 45764 174776 178880 197278 161525 158544 167977 111730 117498 93078 184391 189692 106705
19623 106705 14078 25675 51936 161022 171147 153988 72281 -71751 -48520 24336 96198
19612 96198 93787 22062 84224 64438 32862 51516 45019 72745 48335 34359 14309 10399
19600 10399 15474 78043 134724 105232 -23 -21328 -17788 -137046 -174631 -111233 -13997 -8545
19588 -8545 -65155 44259 34520 -40338 -66419 24219 -45583 -37501 -16147 12800 28470 -6084
19576 -6084 -97731 -58676 -49020 390 75410 190810 278800 297510 295553 277673 263268 151247
$$ packed form
19657A11379j07730k4155J0628O2236N502P3036Q1002k3608o2147j11186r1443
19646g6486L2244Q6007O3992J3193j23969j0391l5355l5066N7283L8928L5384
19635D5764J29012M104J8398l5753k981R433n6247N768k4420R1313N301q2987
19623A06705r2627J1597K6261J09086J0125j7159q1707j44032K3231P2856P1862
19612I6198k411p1725O2162j9786l1576J8654o497K7726k4410j3976k0050l910
19600A0399N075O2569N6681k9492j05255k1305L540j19258l7585O3398R7236N452
19588h545n6610J09414r739p4858k6081R0638o9802Q082K1354K8947J5670l4554
19576f084r1647L9055R656M9410P5020J15400Q7990J8710j957j7880j4405j12021
$$ plain form
19564 151247 74538 49695 104676 109371 127084 162973 75935 41529 96401 161014 155937 170479
19552 170479 174552 181536 144601 146531 121660 50559 3944 -102375 -112153 -136399 -109304 -6679
19540 -6679 3244 -17701 -35617 -71785 -18314 54177 106756 100808 108242 89283 29965 65945
19528 65945 202983 220510 212238 242968 294500 239234 216309 349579 384666 372181 233677
19517 233677 111677 30836 74458 54437 87955 71944 80636 74243 105899 89369 62194 37276
19505 37276 5537 32398 108380 123131 157891 76870 -14403 -51631 -100477 -59884 61716
19494 61716 129712 152313 152548 25814 -126938 -87699 -46002 -5804 20157 -8618 -77803 -11012
19482 -11012 12045 -6782 30603 59810 95772 155395 68824 13141 -31551 31266 50618 -49700
$$ packed form
19564A51247p6709k4843N4981M695J7713L5889q7038l4406N4872O4613n077J4542
19552A70479M073O984l6935J930k4871p1101m6615j06319r778k4246K7095J02625
19540f679R923k0945j7916l6168N3471P2491N2579n948P434j8959n9318L5980
19528F5945J37038J7527q272L0730N1532n5266k2925J33270L5087j2485j38504
19517B33677j22000q0841M3622k0021L3518j6011Q692o393L1656j6530k7175k4918
19505C7276l1739K6861P5982J4751L4760q1021r1273l7228m8846M0593J21600
19494F1716O7996K2601K35j26734j52752L9239M1697M0198K5961k8775o9185O6791
19482a1012K3057j8827L7385K9207L5962N9623q6571n5683m4692O2817J9352j00318
$$ plain form
19470 -49700 -43464 86940 1654 92546 276142 280137 171624 151258 187516 304662 210854
19459 210854 241449 347061 347929 225196 147599 91596 77831 72658 96341 204808 216428
19448 216428 138065 112349 182684 145054 168855 302431 323174 297391 219699 193442 172066
19437 172066 147311 157151 186145 151062 217324 292233 231957 165173 200115 185860 214658 173182
19425 173182 184652 229269 246672 216943 225805 254366 205726 217506 309401 274860 179877 20770
19413 20770 -23888 -15543 2255 29969 160124 277418 254734 340204 288342 221417 185264
19402 185264 257113 328522 369016 397113 308848 286982 319816 141936 16639 45242 -2725
19391 -2725 10767 118655 85405 56144 124091 254219 317017 260783 183512 148949 73486
$$ packed form
19470d9700O236J30404q5286R0892J83596L995j08513k0366L6258J17146r3808
19459B10854L0595J05612Q68j22733p7597n6003j3765n173K3683J08467J1620
19448B16428p8363k5716P0335l7630K3801J33576K0743k5783p7692k6257k1376
19437A72066k4755R840K8994l5083O6262P4909o0276o6784L4942j4255K8798m1476
19425A73182J1470M4617J7403k9729Q862K8561m8640J1780R1895l4541r4983j59107
19413B0770m4658Q345J7798K7714J30155J17294k2684Q5470n1862o6925l6153
19402A85264P1849P1409M0494K8097q8265k1866L2834j77880j25297K8603m7967
19391b725J3492J07888l3250k9261O7947J30128O2798n6234p7271l4563p5463
$$ plain form
19380 73486 -28179 88153 92618 71423 54947 4831 48472 215526 268845 276261 231092
19369 231092 184075 195726 218045 192870 165320 167954 83169 149980 347765 449088 325768
19358 325768 191038 232005 276551 312656 355394 436034 475450 487512 414120 316614 259361
19347 259361 236822 192422 257757 336136 365967 323386 302877 309719 328136 312204 312290 345621
19335 345621 418249 415653 400677 349726 314186 252611 285598 348206 377078 354882 346400 451833
19323 451833 527043 560376 528067 613866 722798 641771 545783 484724 500718 601060 604216
19312 604216 596039 708289 600950 676541 814911 984741 1181279 1310213 1657160 2131366
19302 2131366 2705576 3211981 3562341 3532414 3458527 3522071 3893684 4606723 5970554 8694787
$$ packed form
19380G3486j01665J16332M465k1195j6476n0116M3641J67054N3319P416m5169
19369B31092m7017J1651K2319k5175k7550K634q4785O6811J97785J01323j23320
19358C25768j34730M0967M4546L6105M2738Q0640L9416J2062p3392r7506n7253
19347B59361k2539m4400O5335P8379K9831m2581k0509O842J8417j5932Q6L3331
19335C45621P2628k596j4976n0951l5540o1575L2987O2608K8872k2196q482J05433
19323D51833P5210L3333l2309Q5799J08932q1027r5988o1059J5994J00342L156
19312F04216q177J12250j07339P5591J38370J69830J96538J28934L46947M74206
19302B131366N74210N06405L50360k9927p3887O3544L71613P13039J363831K724233
$$ plain form
19292 8694787 13667443 20677024 24359750 23273869 18765949 13581496 10493525 9102739
19284 9102739 8804184 9076913 9542357 10506778 12184517 14844313 18976732 25004679 34239274
19275 34239274 50060949 80645363 140094011 214723388 249921092 257815264 217278155
19268 217278155 161594389 112832633 74872824 53554974 42584019 37403597 36054553
19261 36054553 38706591 46631774 61848457 76795785 77651565 67178777 49387981 33651113
19253 33651113 24035862 18437585 14992103 12910724 11540037 10605981 10015455 9604069
19245 9604069 9434086 9501359 9597878 9674416 9415278 9053047 8646394 8328352 8172853 8535798
19235 8535798 9137361 10034725 11537400 14026320 18254468 25803321 39695517 60527571
$$ packed form
19292H694787M972656P009581L682726j085881m507920n184453l087971j390786
19284I102739k98555K72729M65444R64421J677739K659796M132419O027947R234595
19275C4239274J5821675L0584414N9448648P4629377L5197704P894172m0537109
19268B17278155n5683766m8761756l7959809k1317850j0970955n180422j349044
19261C6054553K652038P925183J5216683J4947328Q55780j0472788j7790796j5736868
19253C3651113r615251n598277l445482k081379j370687r34056n90526m11386
19245I604069j69983O7273R6519P6538k59138l62231m06653l18042j55499L62945
19235H535798O01563Q97364J502675K488920M228148P548853J3892196K0832054
$$ plain form
19227 60527571 75855906 76067931 65376642 49348868 38291578 33642836 33674802 37455687
19219 37455687 45635956 61030370 91685130 144883827 203763664 265364741 291085515
19212 291085515 253413583 193786915 123283596 77118098 52531668 38910064 30681810
19205 30681810 25268340 21423150 18613008 16647433 15135042 14085366 13732072 14468107
19197 14468107 16987056 22329557 29296643 31125553 27980605 21439894 14760031 10696984
19189 10696984 8467548 7196027 6490045 6207465 5990260 5734985 5188169 4531332 3778989
19180 3778989 3095960 2705647 2499327 2424029 2361750 2170947 1991416 1847753 1748613 1715898
19170 1715898 1631914 1487635 1357987 1251765 1143199 1012119 916986 916487 882212 781148
$$ packed form
19227F0527571J5328335K12025j0691289j6027774j1057290m648742L1966L780885
19219C7455687Q180269J5394414L0654760N3198697N8879837O1601077K5720774
19212B91085515l7671932n9626668p0503319m6165498k4586430j3621604q228254
19205C0681810n413470l845190k810142j965575j512391j049676l53294P36035
19197A4468107K518949N342501O967086J828910l144948o540711o679863m063047
19189A0696984k229436j271521p05982k82580k17205k55275n46816o56837p52343
19180C778989o83029l90313k06320p5298o2279j90803j79531j43663r9140l2715
19170A715898q3984j44279j29648j06222j08566j31080r5133m99l4275j01064
$$ plain form
19160 781148 789993 772202 831315 868403 761596 763312 744337 712707 681235 555123 641707
19149 641707 708554 530494 408625 581339 646707 544995 434450 397905 284263 288788
19139 288788 367080 407772 518486 615580 564039 402186 392343 362412 289919 309525 289915
19128 289915 304160 224359 137067 123284 222889 321465 362086 370681 291487 253698 211959 237413
19116 237413 198376 156760 162842 140692 49872 127950 197586 210645 246309 220502 207977 254386
19104 254386 102866 73315 177967 195576 93173 67504 146792 317899 252374 255580 348950
19093 348950 391048 421770 506256 527816 457552 362418 267206 174222 61808 -36329 37501
19082 37501 88342 33889 20061 -23122 -83299 -23859 492 -14207 35568 103214 173568 186112
$$ packed form
19160G81148Q845j7791N9113L7088j06807J716j8975l1630l1472j26112Q6584
19149F41707O6847j78060j21869J72714O5368j01712j10545l6545j13642M525
19139B88788P8292M0692J10714R7094n1541j61853r843k9931p2493J9606j9610
19128B89915J4245p9801q7292j3783R9605R8576M0621Q595p9194l7789m1739K5454
19116B37413l9037m1616O082k2150r0820P8078O9636J3059L5664k5807j2525M6409
19104B54386j51520k9551J04652J7609j02403k5669P9288J71107o5525L206R3370
19093C48950M2098L0722Q4486K1560p0264r5134r5212r2984j12414r8137P3830
19082C7501N0841n4453j3828m3183o0177N9440K4351j4699M9775O7646P0354J2544
$$ plain form
19070 186112 127959 87158 25016 55612 83388 111529 171969 147592 3906 -85757 3163
19059 3163 93781 127845 50189 -41820 -38760 24392 136545 88981 -16409 -8110 82880 140213
19047 140213 110129 87773 137087 158916 185107 173055 203559 249003 168641 108198 69457
19036 69457 -15046 58125 77621 65544 50126 97271 176716 208676 195973 203427 76965 12541
19024 12541 -17563 16571 -59458 -47435 28461 -4804 31187 91866 154503 253514 262890 375554
19012 375554 419585 362870 414952 332495 246783 232158 300717 248135 201532 206717 229052 230620
19000 230620 213048 117383 74103 68647 47491 208194 335857 347589 264686 324483 354767
18989 354767 291954 294894 290716 306090 372452 303914 301888 161336 179957 231688 245661 153577
$$ packed form
19070A86112n8153m0801o2142L0596K7776K8141O0440k4377j43686q9663Q8920
19059C163R0618L4064p7656r2009L060O3152J12153m7564j05390Q299R0990N7333
19047A40213l0084k2356M9314K1829K6191j2052L0504M5444q0362o0443l8741
19036F9457q4503P3171J9496j2077j5418M7145P9445L1960j2703P454j26462o4424
19024A2541l0104L4134p6029J2023P5896l3265L5991O0679O2637R9011R376J12664
19012C75554M4031n6715N2082q2457q5712j4625O8559n2582m6603N185K2335J568
19000B30620j7572r5665m3280n456k1156J60703J27663J1732q2903N9797L0284
18989C54767o2813K940m178J5374O6362o8538k026j40552J8621N1731J3973r2084
$$ plain form
18977 153577 164468 156112 145408 189068 228163 231117 295447 374988 482374 560609 628370 597340
18965 597340 410270 268628 256344 284041 253168 242148 300024 329798 270377 148268 154983
18954 154983 193347 186272 150452 144780 67396 -47587 -50755 86464 109405 -32733 -33042 108959
18942 108959 120869 147876 150841 125785 194126 201581 224602 278447 310916 404493 479493 556396
18930 556396 471574 485589 586533 671604 676391 667694 774748 949682 969777 802793 626476
18919 626476 591745 618385 458681 273367 226555 361896 493917 537683 370257 337831
18909 337831 245758 228528 219399 88829 -31068 38004 177089 206498 216763 123388 179312
18898 179312 108320 9084 -97 -34805 -27981 15488 63566 55341 119166 265559 330342 338967
$$ packed form
18977A53577J0891q356j0704M3660L9095K954O4330P9541J07386P8235O7761l1030
18965E97340j87070j41642j2284K7697l0873j1020N7876K9774n9421j22109O715
18954A54983L8364p075l5820n672p7384j14983l168J37219K2941j42138l09J42001
18942A08959J1910K7007K965k5056O8341P455K3021N3845L2469R3577P5000P6903
18930E56396q4822J4015J00944Q5071M787q697J07054J74934K0095j66984j76317
18919F26476l4731K6640j59704j85314m6812J35341J32021M3766j67426l2426
18909C37831r2073j7230r129j30570j19897O9072J39085K9409J0265r3375N5924
18898A79312p0992r9236r181l4708O824M3469M8078q225O3825J46393O4783Q625
$$ plain form
18886 338967 289969 188216 73296 -32839 63333 99048 75743 142469 337351 446106
18876 446106 477050 373700 250684 212628 270513 253527 178760 155985 181745 277677 337158
18865 337158 295083 278869 218346 330530 400131 335641 240844 183977 80386 -12858 6752
18854 6752 -20621 -30573 -29637 39189 99596 21516 -218 -6598 11779 -56177 -55138 69196 48205
18841 48205 -21844 -67478 -134408 -91384 -81646 41659 90271 65415 26136 58173 32472 128624
18829 128624 293225 241980 249923 277605 274717 264537 132461 61095 25673 -2429 67487
18818 67487 186248 178659 154677 190274 180134 182237 193556 96571 42034 64153 150679 113568
18806 113568 106144 91418 77242 76578 150349 279943 150775 64816 80388 -24717 -17575 78823
$$ packed form
18886C38967m8998j01753j14920j06135R6172L5715k3305O6726J94882J08755
18876D46106L0944j03350j23016l8056N7885j6986p4767k2775K5760R5932N9481
18865C37158m2075j6214o0523J12184O9601o4490r4797n6867j03591r3244J9610
18854F752k7373r952R36O8826O0407p8080k1734o380J8377o7956J039J24334k0991
18841D8205p0049m5634o6930M3024R738J23305M8612k4856l9279L2037k5701R6152
18829A28624J64601n1245P943K7682k888j0180j32076p1366l5422k8102O9916
18818F7487J18761p589k3982L5597j0140K103J1319r6985n4537K2119Q6526l7111
18806A13568p424j4726j4176o64P3771J29594j29168q5959J5572j05105P142R6398
$$ plain form
18794 78823 82466 50924 53958 84595 91931 94861 81732 109128 161527 61831 4632 -58953
18782 -58953 -141147 -44267 118881 118384 18282 36337 136562 178148 62347 136281 306281
18771 306281 319289 240706 94649 -6913 100611 255364 507881 900382 1091131 1026443
18761 1026443 796256 524107 392347 362854 313145 327701 388181 413916 423796 321717 346483
18750 346483 389172 385414 347563 376890 423371 563642 732113 720217 606810 543398 475934
18739 475934 486649 500777 577920 695245 700706 635952 639397 610845 537219 516818 590795 663235
18727 663235 656945 636435 585486 449463 236367 171620 239413 171126 127993 204812 346621
18716 346621 541304 654520 677670 543040 311817 183614 128284 120498 124608 223991 223483
$$ packed form
18794G8823L643l1542L034L0637P336K930j3129K7396N2399r9696n7199o3585
18782e8953q2194R6880J63148m97j00102J8055J00225M1586j15801P3934J70000
18771C06281J3008p8583j46057j01562J07524J54753K52517L92501J90749o4688
18761A026443k30187k72149j31760k9493m9709J4556O0480K5735R880j02079K4766
18750C46483M2689l758l7851K9327M6481J40271J68471j1896j13407o3412o7464
18739D75934J0715J4128P7143J17325N461o4754L445k8552p3626k0401P3977P2440
18727F63235o290k0510n0949j36023k13096o4747O7793o8287m3133P6819J41809
18716C46621J94683J13216K3150j34630k31223j28203n5330p786M110R9383n08
$$ plain form
18705 223483 305313 292890 240432 291665 342484 347427 397766 388302 367569 273180 144614 164115
18693 164115 301995 477366 536198 550288 533384 546895 591580 810674 884292 797506 837759
18682 837759 856206 838504 745402 588756 389387 344593 411606 486087 563957 603125 688888
18671 688888 814092 922597 1001029 977694 890608 790847 689985 744062 698715 622472 721066
18660 721066 749504 694154 597292 443652 406480 328308 292296 267151 218326 215843 308630
18649 308630 467579 521535 563857 475226 477836 381191 243464 183646 111176 48932 28909
18638 28909 34606 63944 101981 129194 69176 60860 57419 38471 134132 170236 183392 145914
18626 145914 125157 138845 90194 144778 356602 549198 586263 569382 584105 530815 414125
$$ packed form
18705B23483Q1830j2423n2458N1233N0819M943N0339r464k0733r4389j28566J9501
18693A64115J37880J75371N8832J4090j6904J3511M4685K19094P3618q6786M0253
18682H37759J8447j7702r3102j56646j99369m4794O7013P4481P7870L9168Q5763
18671F88888J25204J08505P8432k3335q7086r9761j00862N4077m5347p6243R8594
18660G21066K8438n5350r6862j53640l7172p8172l6012k5145m8825k483R2787
18649C08630J58949N3956M2322q8631K610r6645j37727n9818p2470o2244k0023
18638B8909N697K9338L8037K7213o0018q316l441j8948R5661L6104J3156l7478
18626A45914k0757J3688m8651N4584K11824J92596L7065j6881J4723n3290j16690
$$ plain form
18615 414125 404717 548898 662111 727659 733063 672755 611559 496160 458311 447662 448159 340972
18603 340972 250936 227160 296378 345618 351162 374619 337920 362781 234784 118564 73673
18592 73673 103251 152070 141669 218593 266729 246817 268989 246815 192501 155665 117174 127038
18580 127038 230486 307253 304564 324827 385219 279270 168653 133214 38442 38018 226316
18569 226316 256503 230092 243394 312907 341093 406137 412804 354319 258313 280324 357571 328098
18557 328098 392409 315655 280078 284128 223247 270743 359321 419218 458814 516117 543583 418112
18545 418112 331373 315732 234794 173951 269948 315572 238102 337901 362805 272967 221771
18534 221771 178238 196365 292386 291783 335445 442622 379764 370723 367386 387816 369532 415966
$$ packed form
18615D14125r408J44181J13213O5548N404o0308o1196j15399l7849j0649M97j07187
18603C40972r0036k3776O9218M9240N544K3457l6699K4861j27997j16220m4891
18592G3673K9578M8819j0401P6924M8136j9912K2172k2174n4314l6836l8491R864
18580A27038J03448P6767k689K0263O0392j05949j10617l5439r4772m24J88298
18569B26316L0187k6411J3302O9513K8186O5044O667n8485r6006K2011P7247k9473
18557C28098O4311p6754l5577M050o0881M7496Q8578N9897L9596N7303K7466j25471
18545D18112q6739j5641q0938o0843R5997M5624p7470R9799K4904q9838n1196
18534B21771m3533J8127R6021o03M3662J07177o2858r041l337K0430j8284M6434
$$ plain form
18522 415966 420744 458144 496323 485648 493158 503524 457989 411226 427221 489164 487853 503581
18510 503581 543832 505377 493079 560576 552909 679543 763636 793600 915164 1083670 1223591
18499 1223591 1312915 1330136 1426712 1401468 1256703 1152812 1108939 1169699 1315551 1527872
18489 1527872 1638923 1902389 2335647 2902177 3844906 5570723 8311679 11138086 11888464
18480 11888464 11045374 9206062 7788367 7501978 8088692 9654977 12602824 18301252
18472 18301252 28721131 41553735 49348620 53942526 56539258 60676570 66699967 66048776
18464 66048776 62808579 54636175 43542292 33612413 24775245 19367007 17088612 17447420
18456 17447420 20561165 26615137 32271244 32353504 28127803 21241983 15380026 11924213
$$ packed form
18522D15966M778L7400L8179j0675P510J0366m5535m6763J5995O1943j311J5728
18510E03581M0251l8455j2298O7497p667J26634Q4093K9964J21564J68506J39921
18499A223591Q9324J7221R6576k5244j44765j03891m3873O0760J45852K12321
18489A527872J11051K63466M33258N66530R42729J725817K740956K826407P50378
18480A1888464q43090j839312j417695k86389N86714J566285K947847N698428
18472A8301252J0419879J2832604P794885M593906K596732M137312O023397o51191
18464F6048776l240197q172404j1093883r929879q837168n408238k278395L58808
18456A7447420L113745O053972N656107Q2260m225701o885820n861957l455813
$$ plain form
18448 11924213 10012785 8838064 7986265 7451974 7185194 7106544 7116289 7538696 8419049
18439 8419049 10221008 13306545 16604691 17753707 17373237 15966284 15312440 16393744
18431 16393744 19665096 26172139 35097872 41068196 42867242 43171539 46750245 59999781
18423 59999781 83400245 107419748 130786681 144965608 147372936 144841951 142127507
18416 142127507 136110442 124227222 111155603 98681098 96745814 99926588 99835796 94340829
18408 94340829 78819291 61385893 45510100 34172471 27737287 24694866 24451356 26358715
18400 26358715 26814122 24688699 20925154 16634880 13647463 12083966 11289526 10799621
18392 10799621 10575269 10614905 10893436 11328212 11660205 12001280 12493855 13274814 14783183
$$ packed form
18448A1924213j911428j174721q51799n34291k66780p8650R745M22407Q80353
18439H419049J801959L085537L298146J149016l80470j406953o53844J081304
18431A6393744L271352O507043Q925733N970324J799046L04297L578706J3249536
18423E9999781K3400464K4019503K3366933J4178927K407328k530985k714444
18416A42127507o017065j1883220j3071619j2474505j935284L180774r0792n494967
18408I4340829j5521538j7433398j5875793j1337629o435184l042421k43510J907359
18400B6358715M55407k125423l763545m290274k987417j563497p94440m89905
18392A0799621k24352L9636K78531M34776L31993L41075M92575P80959J508369
$$ plain form
18383 14783183 17530578 22780932 32117923 44603430 51924628 50912457 44328522 36747819
18375 36747819 33805041 37213954 47641718 61148451 72684814 88152374 107532378
18368 107532378 122366439 129369118 128677175 118165819 97533515 74276091 51229033
18361 51229033 35182630 25760325 20110009 16574996 14262413 12960414 12678895 13582420
18353 13582420 16044799 19547611 20606422 18705756 14845607 10828986 8291537 6728782
18345 6728782 5912291 5325070 4840665 4484418 4333257 4347230 4211199 4049434 3865743 3603106
18335 3603106 3486130 3404387 3234595 2978124 2699742 2482488 2296298 2116610 1935479 1849153
18325 1849153 1912120 1816816 1763635 1885036 1955119 1816797 1563564 1398541 1294239 1290281
$$ packed form
18383A4783183K747395N250354R336991J2485507P321198j012171o583935p580703
18375C6747819k942778L408913J0427764J3506733J1536363J5467560J9380004
18368A07532378J4834061P002679o91943j0511356k0632304k3257424k3047058
18361E1229033j6046403r422305n650316l535013k312583j301999k81519R03525
18353A3582420K462379L502812J058811j900666l860149m016621k537449j562755
18345F728782q16491n87221m84405l56247j51161J3973j36031j61765j83691k62637
18335C603106j16976q1743j69792k56471k78382k17254j86190j79688j81131q6326
18325A849153O2967r5304n3181J21401P0083j38322k53233j65023j04302l958
$$ plain form
18315 1290281 1415006 1453320 1386945 1268252 1094848 983465 884214 712715 617395 626330
18305 626330 676278 715522 848907 944025 878232 829464 859793 812723 734370 885159 1045358
18294 1045358 1023584 995123 843521 750236 810824 729013 670462 620396 555525 624891 722653
18283 722653 665797 581095 454997 346382 372264 530855 597718 558851 569157 537744 458415
18272 458415 385544 342170 490317 586115 554090 518478 524202 531397 557210 564323 468083 408073
18260 408073 415555 491364 480961 444462 529101 582814 560015 505058 511365 551223 625260 745500
18248 745500 645866 563273 503734 510088 631885 775666 746839 669314 706342 717491 749833
18237 749833 702050 630780 691154 672736 756421 679655 649850 585589 604598 670740 614809
$$ packed form
18315A290281J24725L8314o6375j18693j73404j11383r9251j71499r5320Q935
18305F26330M9948L9244J33385R5118o5793m8768L0329m7070p8353J50789J60199
18294A045358k1774k8461j51602r3285O0588q1811n8551n0066o4871O9366R7762
18283G22653n6856q4702j26098j08615K5882J58591O6863l8867J0306l1413p9329
18272D58415p2871m3374J48147R5798l2025l5612N724P195K5813P113r6240o0010
18260D08073P482P5809j0403l6499Q4639N3713k2799n4957O307L9858P4037J20240
18248G45500r9634q2593n9539O354J21797J43781k8827p7525L7028J1149L2342
18237G49833m7783p1270O0374j8418Q3685p6766k9805o4261J9009O6142n5931
$$ plain form
18226 614809 678948 766122 763268 834495 953755 1043024 1113690 1119195 1033850 1083847 1223934
18215 1223934 1439154 1613177 1739244 1855086 1845151 1835149 1834273 2035542 2286038 2596745
18205 2596745 3178424 3810035 4645280 5727392 7282396 9996982 15150853 24045093 32973127
18196 32973127 35778327 34110845 29357101 27208457 31170264 43192571 61729557 71630295
18188 71630295 67807015 55084988 40044009 31976966 31440421 37304150 43883541 42822633
18180 42822633 36267597 26078873 17746393 12951638 10262382 8513528 7372099 6486054
18172 6486054 5949002 5376393 4894584 4564041 4416410 4425630 4628579 4923482 5124983 5192509
18162 5192509 5360328 5592905 5956599 6562383 7641976 9494363 13003730 19300991 26569052
$$ packed form
18226F14809O4139Q7174k854P1227J19260Q9269P0666N505q5345M9997J40087
18215A223934K15220J74023J26067J15842r935j0002q76K01269K50496L10707
18205B596745N81679O31611Q35245J082112J555004K714586N153871Q894240Q928034
18196C2973127K805200j667482m753744k148644L961807J2022307J8536986R900738
18188G1630295l823280j2722027j5040979q067043n36545N863729O579391j060908
18180D2822633o555036j0188724q332480m794755k689256j748854j141429q86045
18172F486054n37052n72609m81809l30543j47631R220K02949K94903K01501O7526
18162E192509J67819K32577L63694O05784J079593J852387L509367O297261P268061
$$ plain form
18153 26569052 29069967 27736253 23997953 21597482 22790754 28326995 38662784 51856392
18145 51856392 65946234 78293741 88548283 94013621 93936372 88771956 74968416 58218386
18137 58218386 42104818 30012954 23396727 20430964 20277695 23174781 27825721 29177871
18129 29177871 26514871 21302424 15700742 11943818 9685476 8229064 7302838 6749008
18121 6749008 6494062 6400300 6570088 6851299 7110935 7490430 8118999 9367694 11101808
18112 11101808 13435858 16934228 22518145 32429274 52625160 97021072 173705335 211043125
18104 211043125 198965629 155094914 97403218 63864608 45086131 35294754 32525509
18097 32525509 36147488 43772346 45771553 41447224 32940485 24483662 20310629 19999796
$$ packed form
18153B6569052K500915j333714l738300k400471J193272N536241J0335789J3193608
18145E1856392J4089842J2347507J0254542N465338p7249n164416j3803540j6750030
18137E8218386j6113568j2091864o616227k965763j53269K897086M650940J352150
18129B9177871k663000n212447n601682l756924k258342j456412r26226n53830
18121F749008k54946r3762J69788K81211K59636L79495O28569J248695J734114
18112A1101808K334050L498370N583917R911129K0195886M4395912P6684263L7337790
18104B11043125j2077496m3870715n7691696l3538610j8778477r791377k769245
18097C2525509L621979P624858J999207m324329q506739q456823m173033l10833
$$ plain form
18089 19999796 22675769 24414472 22555349 18565604 13465030 9755076 7516973 6169719
18081 6169719 5162907 4577824 4269838 4003961 3629972 3214552 2893499 2656092 2419802
18072 2419802 2402865 2470963 2398029 2249009 2010601 1864208 1701458 1685793 1812739 1809202
18062 1809202 1653228 1416040 1265936 1187971 1097004 1062709 1028690 966865 1009913 1067520 1109031
18051 1109031 1109893 1063866 970394 945033 1000359 1050635 1057958 930501 895948 757085 687342
18040 687342 713207 773079 723808 667262 625804 572342 596359 650487 667574 792403 786774
18029 786774 703392 640115 585953 574176 605337 533404 522986 565774 607393 665061 730167
18018 730167 831130 747242 644775 605017 646082 615891 559322 479801 529487 599796 592549
$$ packed form
18089A9999796K675973J738703j859123l989745n100574l709954k238103j347254
18081F169719j006812n85083l07986k65877l73989m15420l21053k37407k36290
18072B419802j6937O8098p2934j49020k38408j46393j62750j5665J26946l537
18062A809202j55974k37188j50104p7965r0967l4295l4019o1825M3048N7607M1511
18051A109031Q62m6027r3472k5361N5326N0276P323j27457l4553j38863o9743
18040F87342K5865N9872m9271n6546m1458n3462K4017N4128J7087J24829n629
18029G86774q3382o3277n4162j1777L1161p1933j0418M2788M1619N7668O5106
18018G30167J00963q3888j02467l9758M1065l0191n6569p9521M9686P0309p247
$$ plain form
18007 592549 636691 701795 750333 814360 666262 629068 584777 535083 526465 537601 622008
17996 622008 691965 682482 730157 809708 755770 688227 706138 730458 731660 665468 598191 653856
17984 653856 782279 911948 976634 985289 813105 560767 506939 513859 446109 455459 502236
17973 502236 604976 716632 773141 831445 915964 917275 790150 704518 736880 825336 744253
17962 744253 734876 720500 694259 662589 614550 551268 624873 641890 678036 630134 686694 686553
17950 686553 652294 721283 737088 872921 936640 996851 1011026 916287 909541 951785 1004395
17939 1004395 1017793 995220 1043939 1130492 1139142 1248169 1323363 1428221 1406128 1410416 1592280
17928 1592280 1745668 1795621 1900807 1969917 1997997 2109797 2386262 2727742 3313991 3881237
$$ packed form
18007E92549M4142O5104M8538O4027j48098l7194m4291m9694q618J1136Q4407
17996F22008O9957r483M7675P9551n3938o7543J7911K4320J202o6192o7277N5665
17984F53856J28423J29669O4686Q655j72184k52338n3828O920o7750R350M6777
17973E02236J02740J11656N6509N8304Q4519J311j27125q5632L2362Q8456q1083
17962G44253r377j4376k6241l1670m8039o3282P3605J7017L6146m7902N6560j41
17950F86553l4259O8989J5805J35833O3719O0211J4175r4739o746M2244N2610
17939A004395J3398k2573M8719Q6553Q650J09027P5194J04858k2093M288J81864
17928A592280J53388M9953J05186O9110K8080J11800K76465L41480N86249N67246
$$ plain form
17918 3881237 4196157 4374165 4571485 4907810 5560150 6472399 7637936 9285520 11962619
17909 11962619 16547205 23432463 30326589 34606789 34665295 31662573 28954355 29006793 33656979
17900 33656979 44788781 62873974 88010160 118792818 136113828 131074868 112096191
17893 112096191 90302996 81744990 92623530 124627342 163998007 184394135 183857453
17886 183857453 166349630 143118524 118571224 93697111 70865000 53963105 44470607
17879 44470607 40972739 42799333 50920549 64004761 73752233 73569251 64131464 50404321
17871 50404321 38551549 31135181 27197334 25502678 25580393 26748599 28495515 31161123
17863 31161123 35235612 41812042 53162536 73991005 114979455 186551105 260729270
$$ packed form
17918C881237L14920J78008J97320L36325O52340R12249J165537J647584K677099
17909A1962619M584586O885258O894126M280200N8506l002722k708218N2438M650186
17900C3656979J1131802J8085193K5136186L0782658J7321010n038960j8978677
17893A12096191k1793195q558006J0878540L2003812L9370665K0396128n36682
17886A83857453j7507823k3231106k4547300k4874113k2832111j6901895r492498
17879D4470607l497868J826594Q121216J3084212R747472j82982r437787j3727143
17871E0404321j1852772p416368l937847j694656P7715J168206J746916K665608
17863C1161123M074489O576430J1350494K0828469M0988450P1571650P4178165
$$ plain form
17856 260729270 300039942 304028483 263407319 209483906 160335724 126915437 114410872
17849 114410872 113694273 113310963 109191833 105373126 110565999 132556422 167279233 194047713
17841 194047713 194598160 177364935 153549842 135613555 127717160 127900344 135064434 133730603
17833 133730603 119290197 97336358 73801609 56443098 44849115 36604228 30768972
17826 30768972 26511091 23305720 20997842 19612689 18901305 18908354 19717222 21834453 25304309
17817 25304309 29001412 32825856 38994974 50903384 67828869 78673643 76823128 65432285
17809 65432285 50941864 40915772 36534915 36312641 39902199 48433210 66073911 100179025
17801 100179025 150118650 202994401 253167352 261103627 223288877 164718421 104743344
$$ packed form
17856B60729270L9310672L988541m0621164n3923413m9148182l3420287j2504565
17849A14410872p16599l83310m119130l818707N192873K1990423L4722811K6768480
17841A94047713N50447j7233225k3815093j7936287p896395J83184P164090j333831
17833A33730603j4440406k1953839k3534749j7358511j1593983q244887n835256
17826C0768972m257881l205371k307878j385153p11384P049Q08868K117231L469856
17817B5304309L697103L824444O169118J1908410J6925485J0844774j850515j1390843
17809F5432285j4490421j0026092m380857k22274L589558Q531011J7640701L4105114
17801A00179025M9939625N2875751N0172951P936275l7814750n8570456n9975077
$$ plain form
17794 104743344 66340870 45811643 34376621 27729280 23541107 20746303 18642088
17787 18642088 16766164 15217458 14096551 13684120 14457470 16866052 21619167 26642716
17779 26642716 27402914 24207503 18637665 13381535 10151491 8177274 7001808 6396295
17771 6396295 6114300 5870308 5548168 4895428 4155445 3529855 3314264 2959367 2718650
17762 2718650 2546990 2377973 2232243 2099425 1983855 1925134 1824010 1785038 1643743 1526688
17752 1526688 1446513 1365420 1363780 1298275 1254879 1137035 995787 981212 1014779 1023027 987424
17741 987424 1007073 909947 863696 783493 728704 821423 908508 842566 804459 747148 698754
17730 698754 724434 681326 689958 644040 561126 562729 685744 671323 527843 563370 534118
$$ packed form
17794A04743344l8402474k0529227j1435022o647341m188173k794804k104215
17787A8642088j875924j548706j120907m12431P73350K408582M753115N023549
17779B6642716P60198l195411n569838n256130l230044j974217j175466o05513
17771F396295k81995k43992l22140o52740p39983o25590k15591l54897k40717
17762B718650j71660j69017j45730j32818j15570n8721j01124l8972j41295j17055
17752A526688q0175q1093j640o5505m3396j17844j41248j4575L3567Q248l5603
17741I87424J9649r7126m6251q0203n4789R2719Q7085o5942l8107n7311m8394
17730F98754K5680m3108Q632m5918q2914J603J23015j4421j43480L5527k9252
$$ plain form
17719 534118 458838 448720 478123 559174 622366 673504 653743 618355 550902 484183 393524
17708 393524 410792 385071 280789 176765 154854 184606 296775 312328 320107 310621 262957
17697 262957 192006 319371 388733 328708 344564 299919 322845 387553 380851 318679 331386
17686 331386 277186 181836 248057 403952 453883 480848 553394 663939 783110 833048 761765
17675 761765 768077 715834 714420 627620 611598 518924 551896 547799 361353 299790 301352 345316
17663 345316 275665 259530 292417 286730 349334 329524 292658 337732 284114 236828 234827 233587
17651 233587 276497 256141 172645 204121 249891 334301 285493 286380 342754 314021 416227 468402
17639 468402 526238 597562 652847 574614 467755 466512 512244 607557 666924 697986 540098
$$ packed form
17719E34118p5280j0118K9403Q1051O3192N1138j9761l5388o7453o6719r0659
17708C93524J7268k5721j04282j04024k1911K9752J12169J5553P779r486m7664
17697B62957p0951J27365O9362o0025J5856m4645K2926O4708o702o2172J2707
17686C31386n4200r5350O6221J55895M9931K6965P2546J10545J19171M9938p1283
17675G61765O312n2243j414q6800j6022r2674L2972m097j86446o1563J562M3964
17663C45316o9651j6135L2887n687O2604j9810l6866M5074n3618m7286k001j240
17651B33587M2910k0356q3496L1476M5770Q4410m8808Q87N6374k8733J02206N2175
17639D68402N7836P1324N5285p8233j06859j243M5732R5313N9367L1062j57888
$$ plain form
17628 540098 376079 352687 395710 444455 516620 474405 517461 569071 438666 406849 423310
17617 423310 370299 255317 156166 219614 277636 220396 148711 50218 149995 169956 64050
17606 64050 49921 76061 95984 186005 281230 283897 262765 168442 169967 232091 339936 403333
17594 403333 313429 265463 281677 320232 223353 171302 222194 338683 369371 388026 421461
17583 421461 405379 428104 399193 274311 272594 388150 331277 255611 164364 125197 144651
17572 144651 103949 89077 82385 124738 106495 189164 128632 60049 111324 33405 -176358
17561 -176358 -255573 -147138 -68642 -23685 1472 -93025 -112912 -63556 -55726 -36853 40563
17550 40563 84400 68779 90443 227885 209179 232481 209988 140692 176454 395973 395910 176494
$$ packed form
17628E40098j64019k3392M3023M8745P2165m2215M3056N1610j30405l1817J6461
17617D23310n3011j14982r9151O3448N8022n7240p1685r8493R9777J9961j05906
17606F4050j4129K6140J9923R0021R5225K667k1132r4323J525O2124J07845O3397
17594D03333q9904m7966J6214L8555r6879n2051N0892J16489L0688J8655L3435
17583D21461j6082K2725k8911j24882j717J15556n6873p5666r1247l9167J9454
17572A44651m0702j4872o692M2353j8243Q2669o0532o8583N1275p7919k09763
17561a76358p9215J08435P8496M4957K5157r4497j9887M9356P830J8873P7416
17550D0563M3837j5621K1664J37442j8706K3302k2493o9296L5762K19519o3k19416
$$ plain form
17538 176494 159065 118605 124428 72218 146043 172701 195997 258153 296797 348821 207304
17527 207304 119765 17577 -23245 -70816 -126124 -141176 -117982 -64360 48810 79593 126522
17516 126522 138775 85695 -7678 -64627 -121366 -91182 -47199 -59222 -72281 -20983 -24486 -45362
17504 -45362 -120069 -209283 -117079 -99243 -102818 -229569 -256951 -147170 -82046 -94832 -147498
17493 -147498 -27669 3952 67919 145461 68462 97734 153004 120072 73987 45738 9510
17482 9510 41390 114578 118572 31427 -88322 -109835 -63364 -125735 -178157 -178508 -140086 -71435
17470 -71435 -70951 -41880 -709 99184 191537 230127 137849 130414 50032 -48191 31210 -24546
17458 -24546 13895 27687 -9050 29724 76759 78834 41697 65530 40330 41959 98985 76567
$$ packed form
17538A76494j7429m0460N823n2210P3825K6658K3296O2156L8644N2024j41517
17527B07304q7539j02188m0822m7571n5308j5052K3194N3622J13170L0783M6929
17516A26522J2253n3080r3373n6949n6739L0184M3983j2023j3059N1298l503k0876
17504d5362p4707q9214R2204J7836l575j26751k7382J09781O5124j2786n2666
17493a47498J19829L1621O3967P7542p6999K9272N5270l2932m6085k8249l6228
17482I510L1880P3188L994q7145j19749k1513M6471o2371n2422l51L8422O8651
17470g1435M84K9071M1171R9893R2353L8590r2278p435q0382r8223P9401n5756
17458b4546L8441J3792l6737L8774M7035K075l7137K3833k5200J629N7026k2418
$$ plain form
17446 76567 66501 44827 41198 38494 184393 342340 784359 1125562 1167110 1038481 717567
17435 717567 472703 375240 311812 223697 135590 62221 -40257 -37452 1437 25239 -995
17424 -995 -70857 -86539 5375 109572 81496 61966 98297 95057 11552 -18197 9884 -16954
17412 -16954 57451 161866 206021 217595 171422 61144 -79226 -79136 -125010 -234742 -238281 -191211
17400 -191211 -135379 -9072 -39062 -67717 -61572 11422 194237 323083 387145 425595 493846
17389 493846 573036 643512 610108 517302 456625 472214 421682 436791 483794 426139 311321
17378 311321 334556 484371 568571 579266 599896 699060 681543 533541 466848 451428 484601
17367 484601 519471 419441 237593 112682 85622 31371 26321 83720 82326 65324 122536
$$ packed form
17446G6567j0066k1674l629k704J45899J57947M42019L41203M1548j28629l20914
17435G17567k44864r7463o3428q8115q8107p3369j02478K805L8889K3802k6234
17424i95o9862j5682R1914J04197k8076j9530L6331l240q3505k9749K8081k6838
17412a6954P4405J04415M4155J1574m6173j10278j40370R0m5874j09732l539M7070
17400a91211N5832J26307k9990k8655O145P2994J82815J28846O4062L8450O8251
17389D93846P9190P0476l3404r2806o0677J5589n0532J5109M7003n7655j14818
17378C11321K3235J49815Q4200J0695K0630R9164j7517j48002o6693j5420L3173
17367D84601L4870j00030j81848j24911k7060n4251n050N7399j394j7002N7212
$$ plain form
17356 122536 160515 194576 244513 255341 219375 204513 210964 203460 212812 180227 216570 202520
17344 202520 186697 179883 345782 542979 615183 635788 722617 810437 986999 1137325 1129486
17333 1129486 937939 781636 792830 856627 892415 922229 905802 881278 881932 941649 971002
17322 971002 906572 1002741 1113814 1101234 879268 620098 472608 448020 467163 459062 448882
17311 448882 441994 448903 494862 424543 297666 348309 296119 153837 232597 200905 85198
17300 85198 73586 57607 41657 58845 121846 57875 -35470 -46868 -62380 -88763 -67665 -47879
17288 -47879 3685 133077 306095 551107 711913 656585 458682 335345 351225 460962
17278 460962 635837 662821 590041 593349 506038 452822 438226 450952 425949 357986 255288
$$ packed form
17356A22536L7979L4061M9937J0828l5966j4862O451p504R352l2585L6343j4050
17344B02520j5823o814J65899J97197P2204K0605Q6829Q7820J76562J50326p839
17333A129486j91547j56303J1194O3797L5788K9814j6427k4524O54N9717K9353
17322I71002o4430R6169J11073j2580k21966k59170j47490k4588J9143q101j0180
17311D48882o888O909M5959p0319j26877N0643n2190j42282P8760l1692j15707
17300H5198j1612j5979j5950J7188O3001o3971r3345j1398j5512k6383K1098J9786
17288d7879N1564J29392J73018K45012J60806n5328j97903j23337J5880J09737
17278D60962J74875K6984p2780L308q7311n3216j4596J2726k5003o7963j02698
$$ plain form
17267 255288 214779 267856 238826 228384 308480 421270 439099 497579 573251 493128 404883
17256 404883 246178 194832 168613 3914 -39907 29650 -369 -26487 46300 114783 -11713
17245 -11713 -47682 -56529 -34223 80283 91904 30023 31116 -4104 32511 84865 14729 -8740
17233 -8740 -6152 6536 -70148 -68300 -50116 5722 32063 47598 86504 131522 57961 -4953
17221 -4953 7562 20627 -47224 -159908 -142467 -66613 -23244 143511 193735 144470 83388
17210 83388 70065 -65890 -69870 -138664 -190518 -29439 169696 152583 92132 -102 -77232
17199 -77232 -78201 -36429 55652 49736 -24061 -7629 36763 67339 94273 51151 1596 -73866
17187 -73866 -72931 1643 16025 -38646 -21990 -20382 7704 112091 63458 17241 -2114 -4215
$$ packed form
17267B55288m0509N3077k9030j0442Q0096J12790J7829N8480P5672q0123q8245
17256D04883j58705n1346k6219j64699m3821O9557l0019k6118P2787O8483j26496
17245a1713l5969q847K2306J14506J1621o1881J093l5220L6615N2354p0136k3469
17233h740K588J2688p6684J848J8184N5838K6341J5535L8906M5018p3561o2914
17221d953J2515J3065o7851j12684J7441P5854M3369J66755N0224m9265o1082
17210H3388j3323j35955l980o8794n1854J61079J99135j7113o0451r2234p7130
17199g7232r69M1772R2081n916p3797J6432M4392L0576K6934m3122m9555p5462
17187g3866R35P4574J4382n4671J6656J608K8086J04387m8633m6217j9355k101
$$ plain form
17175 -4215 -37473 36024 184181 217041 204798 196986 85701 66649 93746 65661 101937 140354
17163 140354 148924 56870 -24234 -40649 -101875 -81238 -182624 -81735 110472 89137 35778
17152 35778 126306 138956 130163 38593 -44957 -168033 -145491 -41458 50309 47107 160358
17141 160358 181714 63050 -5263 -39623 -91070 -70127 -39881 31832 17263 -140273 -166751
17130 -166751 -73741 -58687 -65694 63184 34005 110133 196248 124667 15053 44874 -1030
17119 -1030 -174117 -226349 -206410 -145659 -168377 -80095 -33323 -44984 -68492 -116160 -44984 -40367
17107 -40367 -126184 -38001 78842 61783 112783 170959 133064 65208 115702 16632 -32284
17096 -32284 57553 168218 187928 44194 16491 -107401 -104950 45689 42861 -49957 -96858
$$ packed form
17175d215l3258P3497J48157L2860j2243p812j11285j9052K7097k8085L6276L8417
17163A40354Q570r2054q1104j6415o1226K0637j01386J00889J92207k1335n3359
17152C5778R0528J2650q793r1570q3550j23076K2542J04033R1767l202J13251
17141A60358K1356j18664o8313l4360n1447K0943L0246P1713j4569j57536k6478
17130a66751R3010J5054p007J28878k9179P6128Q6115p1581j09614K9821m5904
17119a030j73087n2232J9939O0751k2718Q8282M6772j1661k3508m7668P1176M617
17107d0367q5817Q8183J16843j7059N1000N8176l7895o7856N0494r9070m8916
17096c2284Q9837J10665J9710j43734k7703j23892K451J50639k828r2818m6901
$$ plain form
17085 -96858 -152793 -208430 -156745 -45492 23644 135495 45322 -87675 -115055 -60935 -58480
17074 -58480 -87413 -47527 -8896 -29033 -87560 -198915 -235471 -101449 -37315 -73235 -48282
17063 -48282 51140 40351 42926 71149 80779 40807 -24157 916 -54524 -24941 -11528 -92384
17051 -92384 -143751 -146627 -120914 80936 -22787 -144425 -101707 -145431 -76281 1960 -10219
17040 -10219 26557 67499 125510 48536 71569 38009 36175 78114 778 -126885 -112083 -66887
17028 -66887 -55261 -4778 15171 81753 60948 -23948 130929 195040 77628 -65937 -85320
17017 -85320 8387 60838 44924 33541 24847 24972 26989 -10617 -18618 15549 -28453 -72033 7768
17004 7768 17467 -42118 110724 266132 163496 75700 27282 101099 23493 99476 138275
$$ packed form
17085i6858n5935n5637N1685J11253O9136J11851r0173j32997k7380N4120K455
17074e8480k8933L9886L8631k0137n8527j11355l6556J34022O4134l5920K4953
17063d8282R9422j0789K575K8223R630l9972o4964K5073n5440K9583J3413q0856
17051i2384n1367k876K5713K01850j03723j21638M2718m3724O9150P8241j2179
17040a0219L6776M0942N8011p6974K3033l3560j834M1939p7336j27663J4802M5196
17028f6887J1626N0483J9949O6582k0805q4896J54877O4111j17412j43565j9383
17017h5320R3707N2451j5914j1383q694J25K017l7606q001L4167m4002m3580P9801
17004G768R699n9585J52842J55408j02636q7796m8418P3817p7606P5983L8799
$$ plain form
16993 138275 51387 -57555 -84748 -33033 81588 74392 4955 7760 26941 -8389 -29917
16982 -29917 -68183 -47092 -11032 70184 40791 -51755 -167358 -205603 -178554 -198069 -117540
16971 -117540 -127617 -195586 -155997 -93640 -11253 30883 36373 49874 109258 67110 -1623 66883
16959 66883 16336 -12595 -9294 -60633 -92047 -79827 -14335 58315 140961 111147 129690 119787
16947 119787 97592 120465 78850 -18252 -61449 -106039 -33151 116944 104538 89642 88843 -13729
16935 -13729 -142568 -152461 -139808 -201453 -243551 -141470 -66167 -58300 -125692 -101608 -18948 7949
16923 7949 77188 76355 42737 46301 18649 17076 -19755 36836 114318 111214 72010 33144 21179
16910 21179 -17499 -56819 -6142 8841 67998 134071 202535 176377 50572 -5646 84584
$$ packed form
16993A38275q6888j08942k7193N1715J14621p196o9437K805J9181l5330k1528
16982b9917l8266K1091L6060Q1216k9393r2546j15603l8245K7049j9515Q0529
16971a17540j0077o7969L9589O2357Q2387M2136N490J3501N9384m2148o8733O8506
16959F6883n0547k8931L301n1339l1414J2220O5492P2650Q2646k9814J8543r903
16947A19787k2195K2873m1615r7102m3197m4590P2888J50095j2406j4896p99j02572
16935a3729j28839r893J2653o1645m2098J02081P5303P867o7392K4084Q2660K6897
16923G949O9239q33l3618L564k7652j573l6831N6591P7482l104l9204l8866j1965
16910B1179l8678l9320N0677J4983N9157O6073O8464k6158j25805n6218R0230
$$ plain form
16899 84584 123788 183693 201345 141231 26865 67354 96875 91148 59358 82751 188667
16888 188667 171724 122179 170022 246311 200273 114408 95838 98854 28795 -6248 -9018 20111
16876 20111 22175 35938 44517 21612 -17203 -116952 -8823 -44587 -101017 -15177 83012 94364
16864 94364 62140 62640 122669 154240 61571 -41958 -86484 -68255 -81677 -99863 41210 77545
16852 77545 71893 -47458 35072 136146 48633 -25909 -115396 -134369 -121633 -149095 -95753
16841 -95753 -193090 -200664 -106100 -98423 -55562 -29866 -74186 -101256 -51084 8684 -6168 -100048
16829 -100048 -94260 -17132 101729 172603 95511 113805 73423 -54608 -68421 -33224 14671
16818 14671 -9082 24063 40929 -38825 22536 12900 19971 -35098 -141738 -114892 -127707 -163533
$$ packed form
16899H4584L9204N9905J7652o0114j14366M0489K9521n727l1790K3393J05916
16888A88667j6943m9545M7843P6289m6038q5865j8570L016p0059l5043k770K9129
16876B0111K064J3763Q579k2905l8815r9749J08129l5764n6430Q5840R8189J1352
16864I4364l2224N00O0029L1571r2669j03529m4526J8229j3422j8186J41073L6335
16852G7545n652j19351Q2530J01074q7513p4542q9487j8973J2736k7462N3342
16841i5753r7337p574R4564P677M2861K5696m4320k7070N0172N9768j4852r3880
16829a00048N788P7128J18861P0874p7092J8294m0382j28031j3813L5197M7895
16818A4671k3753L3145J6866p9754O1361r636P071n5069j06640K6846j2815l5826
$$ plain form
16806 -163533 -136439 -138239 -99798 -104620 20224 25974 37655 9133 17397 -37122 -13718 -83417
16794 -83417 -104810 -31732 58974 88149 33666 -85797 -170343 -111093 -51823 -75074 -89794
16783 -89794 -100990 -101589 -123060 -72155 -100084 -59627 -67632 -33167 2861 -36994 -79090 -116324
16771 -116324 -104091 -77360 -44243 -4943 -37660 -61415 -21382 16517 82884 118039 82776
16760 82776 66811 136821 51108 46153 -2681 -60570 -81144 -56159 -38484 -88557 -69218 55819
16748 55819 1470 -65613 -15287 -17142 49840 43626 121237 98318 41495 84329 81808 26973
16736 26973 -2469 10859 25566 99821 123044 10184 -33563 101836 205169 180139 82609
16725 82609 3922 -818 -30084 -81618 -64712 12965 115112 124689 94380 31022 -86100 -107401
$$ packed form
16806a63533K7094j800L8441m822J24844N750J1681k8522Q264n4519K3404o9699
16794h3417k1393P3078R0706K9175n4483j19463q4546N9250N9270k3251j4720
16783h9794j1196n99k1471N0905k7929M0457q005L4465L6028l9855m2096l7234
16771a16324J2233K6731L3117L9300l2717k3755M0033L7899O6367L5155l5263
16760H2776j5965P0010q5713m955m8834n7889k0574K4985J7675n0073J9339J25037
16748E5819n4349o7083N0326j855O6982o214P7611k2919n6823M2834k521n4835
16736B6973k9442J3328J4707P4255K3223j12860m3747J35399J03333k5030r7530
16725H2609p8687m740k9266n1534J6906P7677J02147R577l0309o3358j17122k1301
$$ plain form
16713 -107401 -105926 -62139 -67487 -114255 -151919 -2501 112022 170436 115499 55396 -14892
16702 -14892 -27914 -122467 -179190 -163250 -118456 -43051 -73747 -129277 -326169 -344249 -165777
16691 -165777 -64399 -49146 -139047 -82540 -38491 -52058 -19166 -14559 -27915 -51369 -25916
16680 -25916 -79576 -49315 -15393 -57363 -109181 -60579 29700 53408 62647 55756 138917 45496
16668 45496 -59967 -40647 -94651 -116379 -100143 -14802 22640 67635 669 -31081 -46910
16657 -46910 -168932 -173585 -77984 55149 58529 30855 108586 83450 26515 -77244 -103473
16646 -103473 -5865 -121932 -163354 -54158 19878 77836 -34376 -82811 -66837 -23494 -48998
16635 -48998 -89233 -85083 -106027 -82511 -7585 13710 -38950 -87319 -156192 -74840 29078 45418
$$ packed form
16713a07401J475M3787n348m6768l7664J49418J14523N8414n4937o0103p0288
16702a4892j3022r4553n6723J5940M4794P5405l0696n5530j96892j8080J78472
16691a65777J01378J5253q9901N6507M4049j3567L2892M607j3356k3454K5453
16680b5916n3660L0261L3922m1970n1818M8602R0279K3708R239o891Q3161r3421
16668D5496j05463J9320n4004k1728J6236Q5341L7442M4995o6966l1750j5829
16657d6910j22022m653R5601J33133L380k7674P7731k5136n6935j03759k6229
16646a03473R7608j16067m1422J09196P4036N7958j12212m8435J5974M3343k5504
16635d8998m0235M150k0944K3516P4926K1295n2660m8369o8873Q1352J03918J6340
$$ plain form
16623 45418 -40477 -17103 21262 24724 -10200 11870 63856 66358 -13775 -116986 -176896 -171992
16611 -171992 -91631 -19684 -79401 -78291 -51324 17925 98539 76865 80584 -40950 -10726 78578
16599 78578 88774 37993 -7730 21319 100364 163014 269099 256122 79566 6535 -24331
16588 -24331 19813 -12931 -75313 -184269 -215109 -82095 -19833 -57972 -129200 -87368 -55293
16577 -55293 -33756 123630 188756 136074 28145 15084 9146 -44051 -59021 -53716 -58989 -61224
16565 -61224 -35111 -71510 -55241 -3812 -48534 -86009 -29736 -22703 -30800 -182449 -230319 -173166
16553 -173166 -154869 -96134 -41060 -60473 -83995 -79932 -61294 57322 131528 106076 135754
16542 135754 181752 127671 51112 -148997 -296983 -305296 -129608 -18979 -47403 33023 56585
$$ packed form
16623D5418q5895K3374L8365L462l4924K2070N1986K502q0133j03211n9910M904
16611a71992Q0361P1947n9717J110K6967O9249Q0614k1674L719j21534L0224Q9304
16599G8578J0196n0781m5723K9049P9045O2650J06085j2977j76556p3031l0866
16588b4331M4144l2744o2382j08956l0840J33014O2262l8139p1228M1832L2075
16577e5293K1537J57386O5126n2682j07929j3061n938n3197j4970N305n273k235
16565f1224K6113l6399J6269N1429m4722l7475N6273P033q097j51649m7870N7153
16553a73166J8297N8735N5074j9413k3522M063J8638J18616P4206k5452K9678
16542A35754M5998n4081p6559k00109j47986q313J75688J10629k8424Q0426K3562
$$ plain form
16531 56585 32780 -92741 -120483 -35596 59713 5273 -19128 11817 11085 -1580 -31201 -75539
16519 -75539 29662 101166 53299 -2845 438 -45924 -42756 46341 30677 -18482 -102355 -93102
16507 -93102 49168 97992 18355 -58008 -153799 -161521 -117046 -97925 -121125 -137339 3785
16496 3785 86735 119019 41812 -19218 -78056 -98343 -141562 23856 151895 76544 60199
16485 60199 80571 51325 7481 -22615 33491 57589 59218 48683 44022 -1703 -60064 -47608
16473 -47608 6774 -52394 -65772 -10468 67313 -38365 -115273 -172664 -166623 -94390 32667
16462 32667 -16020 -22029 -21198 -119225 -106378 -71491 -124855 -247320 -324336 -270599 -130477 -47132
16450 -47132 23965 63552 124445 67368 -42905 -52520 -77456 -15957 -19194 17806 -113285 -200952
$$ packed form
16531E6585k3805j25521k7742Q4887R5309n4440k4401L0945p32j2665k9621m4338
16519g5539J05201P1504m7867n6144L283m6362L168Q9097j5664m9159q3873R253
16507i3102J42270M8824p9637p6363r5791p722M4475J9121k3200j6214J41124
16496C785Q2950L2284p7207o1030n8838k0287m3219J65418J28039p5351j6345
16485F0199K0372k9246m3844l0096N6106K4098J629j0535m661m5725n8361J2456
16473d7608N4382n9168j3378N5304P7781j05678p6908n7391O041P2233J27057
16462C2667m8687o009Q31r8027J2847L4887n3364j22465p7016N3737J40122Q3345
16450d7132P1097L9587O0893n7077j10273r615k4936O1499l237L7000j31091q7667
$$ plain form
16438 -200952 -40432 20179 -95204 -181134 -153511 -203029 -173481 -84239 47323 127601 143039
16427 143039 20815 -22086 6929 -2066 -86051 -196629 -82222 51302 50166 41705 128
16416 128 -81468 -101440 -166915 -146630 -45400 5872 -50601 -105399 -122660 -136277 -47451 -67293
16404 -67293 -100134 -22152 -8532 -42882 58664 187327 156372 198216 93992 -14526 -13310
16393 -13310 -45819 -75313 -72392 -131119 -116804 -14075 -19747 21917 38740 -585 35428 148731
16381 148731 115885 85918 104449 152759 108941 4481 -8859 -31040 -45910 -148237 -157845
16370 -157845 -183558 4956 -8339 -120472 -103592 -27644 8750 -4850 -8911 2275 1733 -34772
16358 -34772 -32554 -13251 53848 141724 176330 71630 86538 139346 126773 171618 50993
$$ packed form
16438b00952J60520O0611j15383q5930K7623m9518K9548Q9242J31562Q0278J5438
16427A43039j22224m2901K9015q995q3985j10578J14407J33524j136q461m1577
16416A28q1596j9972o5475K0285J01230N1272n6473n4798j7261j3617Q8826j9842
16404f7293l2841P7982J3620l4350J01546J28663l0955M1844j04224j08518J216
16393a3310l2509k9494K921n8727J4315J02729n672M1664J6823l9325L6013J13303
16381A48731l2846k9967J8531M8310m3818j04460j3340k2181j4870j02327r608
16370a57845k5713J88514j3295j12133J6880P5948L6394j3600m061J1186n42l6505
16358c4772K218J9303O7099Q7876L4606j04700J4908N2808j2573M4845j20625
$$ plain form
16347 50993 10548 -6775 -53524 -78475 -21395 -12148 -2266 26474 24969 64696 31107 -9975
16335 -9975 48968 60648 -89220 -95397 -79565 -125423 5468 115455 61991 20709 -12888
16324 -12888 -36747 -11365 -83245 -139331 -134619 -47872 36607 56646 19309 -16638 160437 146353
16312 146353 83205 -54017 -158010 -163266 524 -30701 -73274 -24843 -2241 26719 -21934
16301 -21934 6138 -21471 -43489 105646 170147 134612 138715 158885 238169 261217 296458 168468
16289 168468 106025 44749 -68611 -115753 -45392 33028 40250 -5848 45906 51065 33444 -18883
16277 -18883 -60830 55233 97017 -26905 -30841 -4453 -3190 -103268 -34887 -77118 -102700
16266 -102700 -99349 -99047 -88152 -68517 12608 -40676 -95739 -109539 -35497 -115504 -37488 -42112
$$ packed form
16347E0993m0445j7323m6749k4951N7080R247R882K8740j505L9727l3589m1082
16335i975N8943J1680j49868o177J5832m5858J30891J09987n3464m1282l3597
16324a2888k3859K5382p1880n6086M712Q6747Q4479K0039l7337l5947J77075j4084
16312A46353o3148j37222j03993n256J63790l1225m2573M8431K2602K8960m8653
16301b1934K8072k7609k2018J49135O4501l5535M103K0170P9284K3048L5241j27990
16289A68468o2443o1276j13360m7142P0361P8420P222m6098N1754N159j7621n2327
16277a8883m1947J16063M1784j23922l936K6388J263j00078O8381m2231k5582
16266a02700L351L02J0895J9635Q1125n3284n5063j3800P4042q0007P8016m624
$$ plain form
16254 -42112 -68035 -87005 -85360 -88696 -129503 -147947 -190157 -189047 -185260 -180497 -135666 -22256
16242 -22256 -15392 -64090 -179840 -167897 -104486 -52946 -75003 -49826 -55417 12838 130657 81094
16230 81094 12232 -32568 -92720 -160399 -262458 -221170 -54201 -28847 102325 219218 155922
16219 155922 61483 49826 -16306 -4454 -23836 -52010 -117634 -90894 -70401 -62930 28520 8573
16207 8573 -81955 -63673 -52227 -51559 -52822 10369 -51250 -78189 -16632 28694 -19777 -162501
16195 -162501 -45421 119279 263567 302113 322287 200549 86187 139722 131076 14109
16185 14109 -14435 -2721 -11861 3124 -26859 -46183 -19063 -57448 -19189 12316 -44698 -26067
16173 -26067 21248 83216 120251 -7086 -18604 4717 17891 61841 -25472 -46343 -54111 -6441
$$ packed form
16254d2112k5923j8970J645l336m0807j8444m2210J110L787M763M4831J13410
16242b2256O864m8698j15750J1943O3411N1540k2057K5177n591O8255J17819m9563
16230H1094o8862m4800o0152o7679j02059M1288J66969K5354J31172J16893o3296
16219A55922r4439j1657o6132J1852j9382k8174o5624K6740K0493P471R1450j9947
16207H573r0528J8282J1446O68j263O3191o1619k6939O1557M5326m8471j42724
16195a62501J17080J64700J44288L8546K0174j21738j14362N3535q646j16967
16185A4109k8544J1714r140J4985k9983j9324K7120l8385L8259L1505n7014J8631
16173b6067M7315O1968L7035j27337j1518K3321J3174M3950q7313k0871p768M7670
$$ plain form
16161 -6441 -4068 71312 157020 83695 41425 14619 11853 28673 44135 132359 96270 29715
16149 29715 21366 66966 61133 92775 47775 -19306 -68168 -124237 -189685 -181755 -122630 -57702
16137 -57702 66521 90956 73681 88811 129274 172431 132224 49020 104072 137306 138319 73298
16125 73298 90141 193849 119186 -7178 -33177 -47432 -43033 -46603 -63213 -130778 -248471
16114 -248471 -262575 -116434 21540 22176 22117 -46879 -144869 -74206 75284 59824 42529 -22350
16102 -22350 68512 95061 79821 95382 61012 29299 46510 104537 201513 276463 167307
16091 167307 37121 -49299 -47630 -33895 -108904 -106451 -167707 -168017 -43157 58773 69401 101996
16079 101996 90839 77917 58599 162910 113112 99942 67464 113367 161056 148562 91157
$$ packed form
16161f441K373P5380Q5708p3325m2270k6806k766J6820J5462Q8224l6089o6555
16149B9715q349M5600n833L1642m5000o7081m8862n6069o5448P930N9125O4928
16137e7702J24223K4435j7275J5130M0463M3157m0207q3204N5052L3234J013o5021
16125G3298J6843J03708p4663j26364k5999j4255M399l570j6610o7565j17693
16114b48471j4104J46141J37974O36n9o8996r7990P0663J49490j5460j7295o4879
16102b2350R0862K6549j5240J5561l4370l1713J7211N8027R6976P4950j09156
16091A67307j30186q6420J669J3735p5009K453o1256l10J24860J01930J0628L2595
16079A01996j1157j2922j9318J04311m9798j3170l2478M5903M7689j2494n7405
$$ plain form
16068 91157 -29243 -148263 -202360 -134443 -12949 50238 -74946 -105852 -8603 98579 107724
16057 107724 77663 50516 10304 68712 11368 -145120 -145961 -207765 -119532 119662 183265
16046 183265 182977 180026 188033 230671 62811 -111287 -57680 16780 94518 31126 -73148 -75955
16034 -75955 5095 42796 -56124 -153280 -129960 -162321 -212162 -227492 -299833 -306132 -203985 -113625
16022 -113625 -103073 -119298 -87825 43876 132529 41356 5722 -9818 98443 155014 150172
16011 150172 84576 56345 -29724 -96093 -106462 -143354 -127709 -104942 -106983 -91268 -62327 -49078
15999 -49078 -83769 -58430 -30751 35417 19778 -47226 13955 -17706 -112952 -185225 -324891
15988 -324891 -342500 -314923 -250490 -210149 -183932 -58917 23904 -32706 -153152 -138055 -77239
$$ packed form
16068I1157j20400j19020n4097O7917J21494O3187j25184l0906R7249J07182R145
16057A07724l0061k7147m0212N8408n7344j56488q41o1804Q8233K39194O3603
16046A83265k88k951Q007M2638j67860j74098N3607P4460P7738o3392j04274k807
16034g5955Q1050L7701r8920r7156K3320l2361m9841j5330p2341o299J02147R0360
16022a13625J0552j6225L1473J31701Q8653r1173l5634j5540J08261N6571m842
16011A50172o5596k8231q6069o6369j0369l6892J5645K2767k041J5715K8941J3249
15999d9078l4691K5339K7679O6168j5639o7004O1181l1661r5246p2273j39666
15988c24891j7609K7577O4433M0341K6217J25015Q2821n6610j20446J5097O0816
$$ plain form
15977 -77239 -129628 -205427 -167425 -68931 101683 168323 44453 -29490 -104989 -125456 -163013
15966 -163013 -147833 -71094 -35003 15270 58014 -6923 -93907 -69882 -24008 22603 52167
15955 52167 21190 51760 56943 59979 29203 148427 143464 173403 212883 132927 153068 96960
15943 96960 13522 87913 75057 -730 -54796 -31332 1052 52887 41174 51063 62543 33370
15931 33370 36810 22636 -79064 -130525 -131730 -150220 -97943 -54871 30553 26162 23291 19354
15919 19354 -252 -12048 28781 -13667 -132065 -158042 -133666 -55647 -51353 -181554 -118268
15908 -118268 -92824 -75723 33443 60030 55846 2836 -39094 15334 41716 -11 61674
15897 61674 127939 79940 26240 117268 121952 83718 179635 144052 142792 81976 97352 109786
$$ packed form
15977g7239n2389p5799L8002R8494J70614O6640j23870p3943p5499k0467l7557
15966a63013J5180P6739L6091N0273M2744o4937q6984K4025M5874M6611K9564
15955E2167l0977L0570N183L036l0776J19224m963K9939L9480p9956K0141n6108
15943I6960q3438P4391j2856p5787n4066K3464L2384N1835j1713R889J1480k9173
15931C3370L440j4174j01700n1461j205j8490N2277M3072Q5424m391k871l937
15919A9354j9606j1796M0829m2448j18398k5977K4376P8019M294j30201O3286
15908a18268K5444J7101J09166K6587m184n3010m1930N4428K6382m1727O1685
15897F1674O6265m7999n3700R1028M684l8234R5917l5583j260o0816J5376J2434
$$ plain form
15885 109786 65673 42391 -9644 -28124 -32086 -61422 12668 21794 46469 -41060 -43875 3027
15873 3027 -16787 -53879 32801 87339 114877 49892 61095 31438 22079 23759 3181 41171
15861 41171 30384 80748 -5293 -18275 -1913 21399 -7387 -126391 -126518 -189191 -160435 -52276
15849 -52276 -4923 -46452 -50525 33936 38610 21539 42297 31913 86496 71038 87680 26093
15837 26093 108788 163188 98045 137149 146152 -15909 -16579 39603 124853 215376 153337 -15501
15825 -15501 -50366 -8168 63087 32000 -61725 -116566 -159410 -86841 1459 -40018 -73619 -121586
15813 -121586 -177466 -103649 -96311 -76777 -79422 -157003 -151546 -90145 -80214 -44680 -91923 -42086
15801 -42086 -65634 39277 83625 27427 -41694 -38850 30521 106827 118527 123921 -812 -108495
$$ packed form
15885A09786m4113k3282n2035j8480l962k9336P4090R126K4675q7529k815M6902
15873C027j9814l7092Q6680N4538K7538o4985J1203k9657r359J680k0578L7990
15861D1171j0787N0364q6041j2982J6362K3312k8786j19004j27o2673K8756J08159
15849e2276M7353m1529m073Q4461M674j7071K0758j0384N4583j5458J6642o1587
15837B6093Q2695N4400o5143L9104R003j62061o70N6182Q5250R0523o2039j68838
15825a5501l4865M2198P1255l1087r3725n4841m2844P2569Q8300m1477l3601m7967
15813a21586n5880P3817P338J9534k645p7581N457O1401R931L5534m7243M9837
15801d2086k3548J04911M4348n6198o9121K844O9371P6306J1700N394j24733j07683
$$ plain form
15789 -108495 -35262 49851 50964 120044 105509 20862 80927 129833 79899 24172 -84846
15778 -84846 -92968 -56189 -91409 -94848 -53455 -71549 -52257 -24353 -32057 -49580 -80608 -53621
15766 -53621 40022 89446 100838 144468 59305 34012 45434 57154 -22156 -2462 129744
15755 129744 42394 -13719 -5896 51328 84161 95755 127183 122945 21317 76874 121743 188349
15743 188349 110160 -6937 42278 69647 121797 91740 47081 -35030 -162574 -158358 -131186
15732 -131186 -97090 -80137 -98825 -64078 9222 -10670 -82188 -129520 -104842 -141597 -273752
15721 -273752 -229807 -45719 -28810 -2370 -3867 -39345 -56602 29073 43356 18922 25798 126381
15709 126381 76938 -20561 -21782 5287 110028 140480 80601 24944 12544 27289 -30204
$$ packed form
15789a08495P3233Q5113J113O9080j4535q4647O0065M8906m9934n5727j09018
15778h4846q122L6779l5220l439M1393j8094J9292K7904p704j7523l1028K6987
15766e3621R3643M9424J1392M3630q5163k5293J1422J1720p9310J9694J32206
15755A29744q7350n6113P823N7224L2833J1594L1428m238j01628N5557M4869O6606
15743A88349p8189j17097M9215K7369N2150l0057m4659q2111j27544M216K7172
15732a31186L4096J6953j8688L4747P3300j9892p1518m7332K4678l6755j32155
15721b73752M3945J84088J6909K6440j497l5478j7257Q5675J4283k4434O876J00583
15709A26381m9443r7499j221K7069J04741L0452n9879n5657j2400J4745n7493
$$ plain form
15698 -30204 -3065 -67095 -47834 -10044 17868 59944 46504 9391 -5921 39424 50068 45634
15686 45634 -85590 -95771 -69355 -14065 -35100 -22173 29666 3692 -28243 -93035 -58633
15675 -58633 26968 79849 82706 44401 143524 153444 88138 170779 127514 77464 75343 33570
15663 33570 67039 -50362 -41705 21582 -20884 78820 46562 14634 66120 82275 170150 182115
15651 182115 114948 109254 60030 -102502 -57589 3004 81664 69379 44056 -35811 -43310 -23656
15639 -23656 -78299 -52390 -157981 -163318 -93661 -66499 -69746 -92180 -17355 -6280 -36858 28876
15627 28876 43835 30034 2293 45454 74654 94159 25678 -3035 -92733 -114690 -22596 59787
15615 59787 43787 -6935 22230 138069 195731 147745 160543 138929 25386 1795 34520
$$ packed form
15698c0204K7139o4030J9261L7790K7912M2076j3440l7113j5312M5345J0644m434
15686D5634j31224j0181K6416N5290k1035J2927N1839k5974l1935o4792L4402
15675e8633Q5601N2881K857l8305R9123R920o5306Q2641m3265n0050k121m1773
15663C3570L3469j17401Q657O3287m2466R9704l2258l1928N1486J6155Q7875J1965
15651A82115o7167n694m9224j62532M4913O0593P8660j2285k5323p9867p499J9654
15639b3656n4643K5909j05591n337O9657K7162l247k2434P4825J1075l0578O5734
15627B8876J4959j3801k7741M3161K9200J9505o8481k8713q9698k1957R2094Q2383
15615E9787j6000n0722K9165J15839N7662m7986J2798k1614j13543k3591L2725
$$ plain form
15604 34520 53607 60017 91647 -15349 -71993 14546 51170 8340 47104 151592 25629
15593 25629 27119 -45489 -7941 55240 76337 49786 66709 81659 129933 156501 52284 30231
15581 30231 39483 -18112 -7262 29461 72826 109897 135233 89459 65789 109816 54661 -29502
15569 -29502 30661 60617 104929 85706 -6643 -50214 -196531 -196206 -88397 -3859 24009 32809
15557 32809 56946 -29232 -9491 19610 -4628 -10045 -4192 38260 103233 89343 34738 -104505
15545 -104505 -46748 -33407 -93597 -130489 -80060 -106104 -11412 -48497 -75442 -76721 -69147 -97337
15533 -97337 -108184 -88332 104798 195499 143614 40399 -55915 27753 19857 -32808 -31701 -81946
15521 -81946 -92046 -84706 -19503 39885 26269 -4590 -47914 -70066 -4032 34443 60397 -5011
$$ packed form
15604C4520J9087O410L1630j06996n6644Q6539L6624m2830L8764J04488j25963
15593B5629J490p2608L7548O3181K1097k6551J6923J4950M8274K6568j04217k2053
15581C0231R252n7595J0850L6723M3365L7071K5336m5774k3670M4027n5155q4163
15569b9502O0163K9956M4312j9223r2349m3571j46317L25J07809Q4538K7868Q800
15557C2809K4137q6178J9741K9101k4238n417N853M2452O4973j3890n4605j39243
15545a04505N7757J3341o0190l6892N0429k6044R4692l7085k6945j279P574k8190
15533i7337j0847J9852J93130R0701n1885j03215r6314Q3668p896n2665J107n0245
15521h1946j0100P340O5203N9388j3616l0859m3324k2152O6034L8475K5954o5408
$$ plain form
15509 -5011 44414 164458 153868 151413 144910 36291 -159081 -151234 -161248 -97883 -20904 -39579
15497 -39579 -39144 -32788 16305 77602 40261 23055 131939 128480 156714 110441 83742 36337
15485 36337 -66881 -114033 -70547 -42083 94910 222929 128130 67150 19674 -24424 -53044
15474 -53044 -55781 -14974 -52782 9586 40988 -6932 -13536 22684 14435 16942 66212 63116 7073
15461 7073 -74780 4277 46715 18397 93338 84728 104475 81299 137182 144136 52850 -66321
15449 -66321 -29503 -28466 14379 19761 19360 42963 29855 -2667 -22374 18727 110833 245283
15437 245283 204429 279268 231636 113856 85623 211565 236706 141924 60150 72015 142743
15426 142743 168572 41931 -44422 -99821 -67671 -68847 -146460 -168167 -200324 -220535 -115746
$$ packed form
15509e011M9425J20044j0590k455o503j08619j95372P847j0014O3365P6979j8675
15497c9579M35O356M9093O1297l7341j7206J08884l459K8234m6273k6699m7405
15485C6337j03218m7152M3486K8464J36993J28019r4799o0980m7476m4098k8620
15474e3044k737M0807l7808O2368L1402m7920o604L6220q249K507M9270l096n6043
15461G073q1853P9057M2438k8318P4941q610J9747k3176N5883O954r1286j19171
15449f6321L6818J037M2845N382m01K3603j3108l2522j9707M1101R2106J34450
15437B45283m0854P4839m7632j17780k8233J25942K5141r4782q1774J1865P0728
15426A42743K5829j26641q6353n5399L2150j176p7613k1707l2157k0211J04789
$$ plain form
15415 -115746 -50784 -68429 -39510 -13552 12878 -40116 47035 57232 50484 12294 5080 -8314
15403 -8314 -2529 135894 131052 -6998 70346 156611 78662 -50288 -18624 -65137 -109451 -138284
15391 -138284 -128403 -90591 -40156 -162620 -110395 37898 27655 -24350 -119740 -99354 -78112
15380 -78112 69731 137999 159511 70646 31245 -24611 12825 39545 -66900 -25083 14648
15369 14648 13958 -21337 -46286 -111780 -150916 -85449 -47070 -55301 -161523 -68946 38759 71116
15357 71116 -12114 -77100 -60386 -79317 26995 97056 141273 148268 172616 77042 40429 43816
15345 43816 -17054 98391 138524 -39688 -34293 20097 -92801 -142448 -200871 -204874 -83632
15334 -83632 -86892 -133342 -45580 40204 -23462 -92519 -60376 90383 117303 96664 26282 41441
$$ packed form
15415a15746O4962j7645K8919K5958K6430n2994Q7151J0197o748l8190p214j3394
15403h314N785J38423m842j38050P7344Q6265p7949j28950L1664m6513m4314k8833
15391a38284R881L7812N0435j22464N2225J48293j0243n2005r5390K0386K1242
15380g8112J47843O8268K1512q8865l9401n5856L7436K6720j06445M1817L9731
15369A4648o90l5295k4949o5494l9136O5467L8379q231j06222R2577J07705L2357
15357G1116q3230o4986J6714j8931J06312P0061M4217O995K4348r5574l6613L387
15345D3816o0870J15445M0133j78212N395N4390j12898m9647n8423m003J21242
15334h3632l260m6450Q7762Q5784o3666o9057L2143J50759K6920k0639p0382J5159
$$ plain form
15322 41441 -15687 -60021 -50570 -34909 21032 29787 -90700 -85884 -72388 -115694 -65388 -100713
15310 -100713 -206646 -194125 -92822 -85574 -234356 -251544 -135474 -58103 -31435 8336 54563
15299 54563 30327 -29990 -47640 -75582 -96256 -22876 -69509 -82056 -131629 -198845 -185997 -88814
15287 -88814 -89328 -77438 -24238 -18714 -61919 -60363 15841 -38079 -27441 -15102 -91028 -157650
15275 -157650 -103288 18885 82836 -38142 -170060 -128220 40538 111004 19665 -68467 -86204
15264 -86204 -19818 27031 143806 132579 72548 30917 13043 34109 -75354 -86977 16429
15253 16429 -38328 -58951 -58912 -35016 -6141 -42005 -57672 -45578 -105956 -43515 -95770 -64887
15241 -64887 -127673 -137818 21729 53843 72575 52466 57203 106799 140458 129858 171852 128757
$$ packed form
15322D1441n7128m4334R451J5661N5941Q755j20487M816J3496m3306N0306l5325
15310a00713j05933J2521J01303P248j48782j7188J16070P7371K6668L9771M6227
15299E4563k4236o0317j7650k7942k0674P3380m6633j2547m9573o7216J2848R7183
15287h8814n14J1890N3200N524m3205J556P6204n3920J0638J2339p5926o6622
15275a57650N4362J22173O3951j20978j31918M1840J68758P0466r1339q8132j7737
15264h6204O6386M6849J16775j1227o0031m1631j7874K1066j09463j1623J03406
15253A6429n4757k0623L9K3896K8875l5864j5667J2094o0378O2441n2255L0883
15241f4887o2786j0145J59547L2114J8732k0109M737M9596L3659j0600M1994m3095
$$ plain form
15229 128757 -38909 -28357 -108585 -97959 -66152 -65767 -133015 -100537 -78310 -125332 -61445 37966
15217 37966 32032 -91987 -135617 -95406 -129266 -145266 -175226 -135058 -54574 -20677 -27363 -48009
15205 -48009 -17766 -42886 -40349 -107524 -115125 -87162 -111623 -1536 -73860 -66775 -89431 -154205
15193 -154205 -185884 -137061 -47931 13379 90918 113565 40167 -26276 -78706 -911 56419
15182 56419 -9663 -56233 11025 147292 59764 -45341 -25694 57348 110030 59519 70137
15171 70137 83598 109645 81603 59746 -1807 -56149 -73586 -23737 -40900 -28400 53539 153678
15159 153678 177562 106547 72043 105068 95616 116701 133540 153638 56798 -50309 -58990 -90379
15147 -90379 -194476 -158768 -91840 -3142 73073 56173 26198 32317 70483 1081 -133460
$$ packed form
15229A28757j67666J0552q0228J0626L1807L85o7248L2478K2227m7022O3887R9411
15217C7966n934j24019m3630M0211l3860j6000k9960M0168Q0484L3897o686k0646
15205d8009L0243k5120K537o7175p601K7963k4461J10087p2324P085k2656o4774
15193a54205l1679M8823Q9130O1310P7539K2647p3398o6443n2430P7795N7330
15182E6419o6082m6570O7258J36267q7528j05105J9647Q3042N2682n0511J0618
15171G0137J3461K6047k8042k1857o1553n4342j7437M9849j7163J2500Q1939J00139
15159A53678K3884p1015l4504L3025r452K1085J6839K0098r6840j07107q681l1389
15147i0379j04097L5708O6928Q8698P6215j6900k9975O119L8166o9402j34541
$$ plain form
15136 -133460 -210449 -170323 -121691 -39424 -33207 5626 -1419 54394 81137 119657 52107 39904
15124 39904 64732 99811 20020 -31657 -30324 -51378 19721 17138 -30101 -72815 -109006 -101498
15112 -101498 -11405 -5693 -12201 -52227 -14232 -24375 14577 -12230 -9815 24942 112156 67479
15100 67479 51900 64427 42879 70736 120871 77718 110462 -30719 -43348 -24425 -87746
15089 -87746 9169 129283 61720 -22737 34019 51462 -12252 -73304 -180090 -237426 -150974
15078 -150974 -27331 15533 18121 27256 4281 52164 103758 58546 -12702 -34365 -26010 -22403
15066 -22403 -7317 -90843 -58759 -29959 13306 -41278 -55764 -54265 8409 100294 114252 197163
15054 197163 270779 192789 142500 104476 130954 104626 62030 -10570 -89590 -102403 -49320
$$ packed form
15136a33460p6989M0126M8632Q2267O217L8833p045N5813K6743L8520o7550j2203
15124C9904K4828L5079p9791n1677J333k1054P1099k583m7239m2714l6191P508
15112a01498R0093N712o508m0026L7995j0143L8952k6807K415L4757Q7214m4677
15100F7479j5579J2527k1548K7857N0135m3153L2744j41181j2629J8923o3321
15089h7746R6915J20114o7563q4457N6756J7443o3714o1052j06786n7336Q6452
15078a50974J23643M2864K588R135k2975M7883N1594m5212p1248k1663Q355L607
15066b2403J5086q3526L2084K8800M3265n4584j4486J499O2674R1885J3958Q2911
15054A97163P3616p7990n0289l8024K6478k6328m2596p2600p9020j2813N3083
$$ plain form
15043 -49320 -41637 -41550 32465 27509 47363 131293 33327 -94292 -48326 45134 44614 -37576 7629
15030 7629 23587 45181 102231 17358 -128247 -87346 -63810 -158198 -164120 -173730 -134330 -97222
15018 -97222 -47032 -52505 -37513 55907 3865 -33432 -14868 -33958 40047 52876 101506 1603
15006 1603 -29918 -5251 8012 -148458 -291869 -146778 -71026 -19731 -97595 -110068 -61329
14995 -61329 -59313 -25857 -77398 -11745 100863 179812 64686 1850 32355 30291 10440 -90644
14983 -90644 -87035 15454 54051 -19571 -129387 -212221 -233442 -271141 -248991 -243579 -164621 -72388
14971 -72388 91012 101912 -4492 35170 8930 -111526 -23175 53371 -13249 7768 -29201
14960 -29201 -147779 -119234 -86462 -36693 40022 64090 -21985 -45955 -121058 -130318 -37792 8375
$$ packed form
15043d9320P683Q7P4015m956J9854Q3930r7966j27619M5966R3460n20q2190M5205
15030G629J5958K1594N7050q4873j45605M0901K3536r4388n922r610L9400L7108
15018i7222N0190n473J4992R3420n2042l7297J8564j9090P4005J2829M8630r9903
15006A603l1521K4667J3263j56470j43411J45091P5752N1295p7864j2473M8739
14995f1329K016L3456n1541O5653J12608P8949j15126o2836L0505k064j9851j01084
14983i0644L609J02489L8597p3622j09816q2834k1221l7699K2150N412P8958R2233
14971g2388J63400J0900j06404L9662k6240j20456Q8351P6546o6620K1017l6969
14960b9201j18578K8545L2772M9769P6715K4068q6075k3970p5103r260R2526M6167
$$ plain form
14948 8375 -21882 -52898 18544 -7602 -47900 -34844 53586 83541 55211 -41753 -83945 -157152
14936 -157152 -226356 -123593 -109997 -193708 -172835 -156009 -72749 -30152 92486 84845 50350
14925 50350 -56146 -149813 -160966 -185994 -163097 -145037 -42473 51979 27958 74331 113712
14914 113712 145361 164616 85408 71981 -25972 -81240 -103074 -30040 43836 -75066 -104503
14903 -104503 -36281 -18864 12557 -8642 -24718 6193 63756 109348 96851 -73555 -142312
14892 -142312 -16156 79842 150308 182870 183735 145492 45664 113641 78380 122303 161502 135544
14880 135544 95452 61038 59309 105556 153833 59258 34474 -4242 -34133 15127 80446 12588
14868 12588 13913 40277 91627 44525 -102156 -94961 -58188 19996 -48972 -60742 35887 -55526
$$ packed form
14948H375l0257l1016P1442k6146m0298J3056Q8430K9955k8330r6964m2192p3207
14936a57152o9204J02763J3596q3711K0873J6826Q3260M2597J22638p641l4495
14925E0350j06496r3667j1153k5028K2897J8060J02564R4452k4021M6373L9381
14914A13712L1649J9255p9208j3427r7953n5268k1834P3034P3876j18902k9437
14903a04503O8222J7417L1421k1199j6076L0911N7563M5592j2497j70406o8757
14892a42312J26156R5998P0466L2562Q65l8243r9828O7977l5261M3923L9199k5958
14880A35544m0092l4414j729M6247M8277r4575k4784l8716k9891M9260O5319o7858
14868A2588J325K6364N1350m7102j46681P195L6773P8184o8968j1770R6629r1413
$$ plain form
14856 -55526 -97402 -130619 -163563 -94345 10873 104843 88487 84598 192327 144626 73227
14845 73227 19816 28942 -70134 -104756 -70154 -105205 -52863 -109294 -60873 142183 278411
14834 278411 247766 157503 33566 -48170 -60981 -40670 57667 58144 -6025 -36350 20758 -5221
14822 -5221 83343 104717 38606 99789 239106 205586 211318 201191 38182 4291 -89125 -98791
14810 -98791 27921 124457 64176 -105805 -74032 -8949 -2898 -34752 -24013 52208 102536
14799 102536 -12782 9039 148207 78545 57079 65562 37328 -105720 -169533 -116487 -163773
14788 -163773 -124128 -166060 -180025 -163836 -72432 14962 -59339 -122121 -50303 -3218 13793
14777 13793 20225 208198 217901 89376 -25734 -129831 -87364 60640 128382 39040 53882
$$ packed form
14856e5526m1876l3217l2944O9218J05218R3970j6356l889J07729m7701p1399
14845G3227n3411R126r9076l4622L4602l5051N2342n6431M8421K03056J36228
14834B78411l0645r0263j23937q1736j2811K0311R8337M77o4169l0325N7108k5979
14822e221Q8564K1374o6111O1183J39317l3520N732j0127j63009l3891r3416r666
14810i8791J26712R6536o0281j69981L1773O5083O051l1854J0739P6221N0328
14799A02536j15318K1821J39168o9662k1466Q483k8234j43048o3813N3046m7286
14788a63773L9645m1932j3965J6189R1404Q7394p4301o2782P1818M7085J7011
14777A3793O432J87973R703j28525j15110j04097M2467J48004O7742q9342J4842
$$ plain form
14766 53882 -8805 -65051 -32197 13058 83814 58562 18083 70533 56669 30940 -48024 -27815
14754 -27815 -4849 -62856 -150009 -173571 -83552 35555 18125 -41404 -88671 -123923 -19811
14743 -19811 -16304 -58772 -148020 -116972 -2234 -39809 2454 -44588 -169460 -229857 -107611
14732 -107611 71036 147496 91490 -26496 -88027 -133464 -236404 -262302 -124023 -106418 -12996
14721 -12996 -102454 -104329 -114357 -227880 -89979 42718 130022 153455 9001 -94783 -70218
14710 -70218 -14650 -25137 -12514 19782 66617 156277 225353 146466 68917 45542 -54829
14699 -54829 -40106 -63058 -179860 -150647 -3882 -13836 -66538 -101056 -93683 -2942 27537 172920
14687 172920 165941 19486 -72794 -66434 -94122 -29037 34666 86972 40483 -32626 -14753 -2040
$$ packed form
14766E3882o2687n6246L2854M5255P0756k5252m0479N2450j3864k5729p8964K0209
14754b7815K2966n8007q7153k3562R0019J19107j7430n9529m7267l5252J04112
14743a9811L507m2468q9248L1048J14738l7575M2263m7042j24872o0397J22246
14732a07611J78647P6460n6006j17986o1531m5437j02940k5898J38279J7605R3422
14721a2996q9458j875j0028j13523J37901J32697Q7304K3433j44454j03784K4565
14710g0218N5568j0487J2623L2296M6835Q9660O9076p8887p7549k3375j00371
14699e4829J4723k2952j16802K9213J46765r954n2702l4518P373R0741L0479J45383
14687A72920o979j46455r2280O360k7688O5085O3703N2306m6489p3109J7873J2713
$$ plain form
14675 -2040 11231 81347 101965 106158 139357 32837 -1202 -9085 -88593 -63448 23616 61798
14663 61798 53145 82232 65821 -35693 -83891 -68875 -48378 19338 -68842 14653 94933 53260
14651 53260 -20144 -55376 -148114 -157593 -40066 -49977 -34197 -85942 -185584 -201440 -151816 -13385
14639 -13385 162836 151757 228808 240054 120082 45545 39933 104721 50300 60862 67593 -10350
14627 -10350 -102536 14526 107537 188006 202073 167118 97764 96150 145358 33736 -8395
14616 -8395 -22082 21533 35860 162669 276755 253457 107387 69151 90122 98882 33273
14605 33273 -91732 -48266 49266 73920 -64788 -17275 140046 130190 29067 67712 -7278
14594 -7278 -4498 7697 2661 -16093 133471 84447 -14196 -24360 -6315 -40212 -33548 41378
$$ packed form
14675b040J3271P0116K0618M193L3199j06520l4039p883p9508K5145Q7064L8182
14663F1798q653K9087j6411j01514m8198J5016K0497O7716q8180Q3495Q0280m1673
14651E3260p3404l5232r2738r479J17527r911J5780n1745r9642j5856M9624J38431
14639a3385J76221j1079P7051J1246j19972p4537n612O4788n4421J0562O731p7943
14627a0350r2186J17062R3011Q0469J4067l4955o9354j614M9208j11622m2131
14616h395j3687M3615J4327J26809J14086k3298j46070l8236K0971Q760o5609
14605C3273j25005M3466R7532K4654j38708M7513J57321r856j01123L8645p4990
14594g278K780J2195n036j8754J49564m9024r8643j0164J8045l3897O664P4926
$$ plain form
14582 41378 -11698 -66992 -160539 -82370 -37379 -55968 -41604 -52664 -99950 -29809 -36382 -7900
14570 -7900 50195 -53724 -64216 -9851 79812 189875 184564 108194 -14842 -51112 -58154 50561
14558 50561 22869 -14598 -16839 -66453 -107652 -137201 -66490 -14338 -33265 76269 97361 132667
14546 132667 112538 -50554 -197066 -178451 -35270 27446 11950 -13825 5228 -27586 -13524
14535 -13524 73724 78200 -20862 -21474 -16846 -49369 -10478 -13772 -40227 -89137 -147336 -55960 -52975
14522 -52975 -18357 98018 116040 128915 104825 115046 147374 132233 177744 148735 60034
14511 60034 24790 141273 225145 163715 91615 102104 104216 144938 124357 61670 34046 -19391
14499 -19391 -44306 -23211 -31227 -1741 29407 -69008 -12652 -72572 -167239 -100867 16834 -7439
$$ packed form
14582D1378n3076n5294r3547P8169M4991j8589J4364j1060m7286P0141o573K8482
14570g900N8095j03919j0492N4365Q9663J10063n311p6370j23036l6270p042J08715
14558E0561k7692l7467k241m9614m1199k9549P0711N2152j8927J09534K1092L5306
14546A32667k0129j63092j46512J8615J43181O2716j5496k5775J9053l2814J4062
14535a3524Q7248M476r9062o12M628l2523L8891l294k6455m8910n8199R1376K985
14522e2975L4618J16375J8022J2875k4090J0221L2328j5141M5511k9009q8701
14511F0034l5244J16483Q3872o1430p2100J0489K112M0722k0581o2687k7624n3437
14499a9391k4915K1095q016K9486L1148r8415N6356n9920r4667O6372J17701k4273
$$ plain form
14487 -7439 -75449 -7680 -75228 -72709 -105401 -83340 21111 64481 -112979 -124247 -104299 -49117
14475 -49117 4930 67723 -12822 -628 107747 179372 136238 30434 -15689 98899 120126
14464 120126 90072 136889 170424 169575 -12441 -51712 -68055 -51925 -29269 -25916 75066 159392
14452 159392 168477 211744 128740 28371 -76618 -21665 43404 80396 13636 72532 24002
14441 24002 -20938 28971 69399 189744 233153 235504 181818 48937 -65960 -84776 -46527
14430 -46527 -107013 48125 138514 69821 -60572 -106726 -154500 -195459 -91700 -66975 -68829
14419 -68829 11019 46808 -45226 -109313 -1954 22137 3827 46313 -47564 -198468 -126483
14408 -126483 -108276 -76944 -36373 -118210 -166027 -62307 -62793 -39939 -96294 -74774 -81227 -103869
$$ packed form
14487g439o8010O7769o7548K519l2692K2061J04451M3370j77460j1268J9948N5182
14475d9117N4047O2793q0545J2194J08375P1625m3134j05804m6123J14588K1227
14464A20126l0054M6817L3535q49j82016l9271j6343J6130K2656L353J00982Q4326
14452A59392R085M3267q3004j00369j04989N4953O5069L6992o6760N8896m8530
14441B4002m4940M9909M0428J20345M3409K351n3686j32881j14897j8816L8249
14430d6527o0486J55138R0389o8693j30393m6154m7774m0959J03759K4725j854
14419f8829P9848L5789r2034o4087J07359K4091j8310M2486r3877j50904P1985
14408a26483J8207L1332M0571q1837m7817J03720m86K2854n6355K1520o453k2642
$$ plain form
14396 -103869 -105118 -68897 29860 92216 78850 26555 -68826 -131161 -65144 -87236 -65153 -54891
14384 -54891 -61491 12431 -46623 -64009 -59126 -33175 -94163 -253618 -258392 -171022 -115397 -152850
14372 -152850 -77964 105004 190215 243565 133257 -52909 -104614 -90979 -77482 25625 28508
14361 28508 81139 65621 -4921 1833 47632 41195 61388 -63035 -8456 129582 211060 81736
14349 81736 -11816 -138286 -219949 -152672 -188122 -116339 -78368 -65030 3866 -41716 -33868 -2221
14337 -2221 -30486 22429 85728 46322 -37356 50137 67709 76315 78218 53011 105 34372
14325 34372 21029 88467 73664 4187 -8315 2386 -10257 -6563 17562 90464 86388 77732
14313 77732 2383 56775 5606 -8092 52665 157346 144844 123364 24618 -35433 -94298
$$ packed form
14396a03869j249L6221R8757O2356j3366n2295r5381o2335O6017k2092K2083J0262
14384e4891o600P3922n9054j7386M883K5951o0988j59455m774Q7370N5625l7453
14372a52850P4886J82968Q5211N3350j10308j86166n1705J3635J3497J03107K883
14361B8508N2631j5518p0542O754M5799o437K0193j24423N4579J38038Q1478j29324
14349H1736r3552j26470q1663O7277l5450P1783L7971J3338O8896m5582P848L1647
14337b221k8265N2915O3299l9406q3678Q7493J7572Q606J903k5207n2906L4267
14325C4372j3343O7438j4803o9477j2502J0701j2643L694K4125P2902m076q656
14313G7732p5349N4392n1169j3698O0757J04681j2502k1480r8746o0051n8865
$$ plain form
14302 -94298 1552 68592 -93101 -37101 -39392 -68162 -69020 31863 -21086 -136384 -94117 11976
14290 11976 -3206 3701 41998 57585 23537 -73982 -16897 7302 15948 81973 165564 145028
14278 145028 178153 131509 184594 193238 67910 41943 13627 102327 118214 -25798 -48911
14267 -48911 -12100 30964 6497 44904 92413 -10158 -111450 -111842 -155124 -184433 -157865 -162871
14255 -162871 -282553 -221322 -130848 -158543 -114569 -48084 -27163 26189 -71787 -106376 -35957
14244 -35957 -54415 -72128 -27401 11407 64587 -56500 -172124 -164817 -34346 44983 151499
14233 151499 113186 28292 49582 66308 53114 7158 17797 35612 143681 211347 185305
14222 185305 154741 110183 14833 44472 99824 76580 109417 195096 155037 22029 -2385
$$ packed form
14302i4298R5850O7040j61693N6000k291k8770q58J00883n2949j15298M2267J06093
14290A1976j5182O907L8297J5587l4048r7519N7085K4199Q646O6025Q3591k0536
14278A45028L3125m6644N3085Q644j25328k5967k8316Q8700J5887j44012k3113
14267d8911L6811M3064k4467L8407M7509j02571j01292l92m3282k9309K6568n006
14255a62871j19682O1231R0474k7695M3974O6485K0921N3352r7976l4589P0419
14244c5957j8458j7713M4727L8808N3180j21087j15624P307J30471P9329J06516
14233A51499l8313q4894K1290J6726j3194m5956J0639J7815J08069O7666k6042
14222A85305l0564m4558r5350K9639N5352k3244L2837Q5679m0059j33008k4414
$$ plain form
14211 -2385 -17932 -30513 56352 70106 23831 3342 35158 -31280 -59314 -104858 -131605 -115653
14199 -115653 -119716 -108261 -145114 -155131 -114082 -83514 -163283 -170590 -83559 -93907 -86953 -46226
14187 -46226 -86013 -80394 -140685 -246609 -266491 -179437 -63762 22915 63246 855 66575
14176 66575 88711 125638 46426 -15965 -64536 -187430 -194713 -96282 -17728 3765 -131110
14165 -131110 -209601 -145009 -90035 -103800 -116477 -97285 -52952 -96375 -106818 -111312 -65502 -59724
14153 -59724 -89570 -97066 -33726 -28358 -100809 -71130 -25013 -19709 -134970 -68323 -100487 -104752
14141 -104752 -65213 2533 15712 -36086 -63200 98030 139580 125752 87066 187930 242055
14130 242055 172307 179492 92948 -11310 -128772 -57846 40546 153668 144106 32614 60190
$$ packed form
14211b385j5547j2581Q6865J3754m6275k0489L1816o6438k8034m5544k6747J5952
14199a15653m063J1455l6853j0017M1049L0568p9769p307Q7031j0348O954M0727
14187d6226l9787N619o0291j05924j9882Q7054J15675Q6677M0331o2391O5720
14176F6575K2136L6927p9212o2391m8571j22894p283R8431P8554K1493j34875
14165a31110p8491O4592N4974j3765j2677J9192M4333m3423j0443m494M5810N778
14153e9724k9846p496O3340N368p2451K9679M6117N304j15261O6647l2164m265
14141a04752L9539O7746J3179n1798k7114J61230M1550j3828l8686J00864N4125
14130B42055o9748P185q6544j04258j17462P0926R8392J13122r562j11492K7576
$$ plain form
14119 60190 40555 59128 -29104 -96085 -89647 -80316 -149525 -78980 -33696 -31045 -296 -64203
14107 -64203 -42597 -37293 -27224 62728 98652 108768 111478 162529 134532 71567 54586 -20016
14095 -20016 -61441 -5381 -20209 -44635 72064 132806 -11414 -58094 20083 83628 19242
14084 19242 -480 25440 15945 97007 162356 167995 170653 169831 183816 196265 97200 -61114
14072 -61114 37375 161859 175485 159482 157124 173378 68634 24050 29342 46253 12563 -55332
14060 -55332 -99667 -104364 26687 50109 -98355 -154118 -180650 -214641 -218679 -111244 -71115
14049 -71115 -39635 -84305 -47406 28634 77290 87404 76520 193080 161515 63072 14997
14038 14997 -6208 17650 34219 -13757 -78585 -50892 -15177 -55845 -54069 3953 55205 70296
$$ packed form
14119F0190j9635J8573q8232o6981O438R331o9209P0545M5284K651L0749o3907
14107f4203K1606N304J0069Q9952L5924J0116K710N1051k7997o2965j6981p4602
14095b0016m1425N6060j4828k4426J16699O0742j44220m6680P8177O3545o4386
14084A9242j9722K5920r495Q1062O5349N639K658q22J3985J2449r9065j58314
14072f1114R8489J24484J3626j6003k358J6254j04744m4584N292J6911l3690o7895
14060e5332m4335m697J31051K3422j48464n5763k6532l3991m038J07435M0129
14049g1115L1480m4670L6899P6040M8656J0114j0884J16560l1565r8443m8075
14038A4997k1205K3858J6569m7976o4828K7693L5715m0668J776N8022N1252J5091
$$ plain form
14026 70296 125303 183380 152655 97928 -10543 -55594 -114474 -171371 -115905 -31801 -70213
14015 -70213 -36452 64723 94406 62143 27339 -22905 26070 -38124 -82974 -65165 -52350
14004 -52350 -101508 -36934 33688 64356 63608 88187 157834 133362 77807 -16364 -24574 16429
13992 16429 82707 -17661 -113023 -149101 -96579 -44009 6136 139658 234513 230670 84569
13981 84569 -21225 -67477 50635 163132 155979 -23525 -107958 -130800 -68784 -44499 -25544
13970 -25544 31342 96969 109642 106890 52820 -65543 -57129 -51339 -53453 -136301 -161161 -141566
13958 -141566 -85413 13364 100597 80123 -986 -69953 27834 161716 188791 140182 34117
13947 34117 -19504 68868 134744 97923 50883 120794 168725 176073 128281 125431 97437 24200
$$ packed form
14026G0296N5007N8077l0725n4727j08471m5051n8880n6897N5466Q4104l8412
14015g0213L3761J01175K9683l2263l4804n0244M8975o4194m4850J7809J2815
14004e2350m9158O4574P0622L0668p48K4579O9647k4472n5555r4171q210M1003
13992A6429O6278j00368r5362l6078N2522N2570N0145J33522R4855l843j46101
13981H4569j05794m6252J18112J12497p153j79504q4433k2842O2016K4285J8955
13970b5544N6886O5627J2673k752n4070j18363Q414N790k114q2848k4860J9595
13958a41566N6153R8777Q7233k0474q1109o8967R7787J33882K7075m8609j06065
13947C4117n3621Q8372O5876l6821m7040O9911M7931P348m7792k850k7994p3237
$$ plain form
13935 24200 -11941 -50581 -21370 24112 3546 81118 82855 81989 47224 58777 102454 88965
13923 88965 83148 130329 122325 118736 173077 274370 239168 167304 61079 104515 -22689 -126205
13911 -126205 -177273 -151210 -135421 -124379 -9888 48537 -39702 -72402 13595 48297 27517
13900 27517 3743 44047 58781 70640 49686 40300 43933 172871 180654 197999 127536 117063
13888 117063 74557 38663 60722 76329 56341 10704 45110 62559 58198 53639 75111 135418
13876 135418 119163 105424 47440 66997 22151 -26190 -94404 -65812 -31170 -116246 -60093
$$ packed form
13935B4200l6141l8640K9211M5482k0566P7572J737q66l4765J1553M3677j3489
13923H8965n817M7181q004l589N4341J01293l5202p1864j06225M3436j27204j03516
13911a26205n1068K6063J5789J1042J14491N8425q8239l2700Q5997L4702k0780
13900B7517k3774M0304J4734J1859k0954r386L633J28938P783J7345p0463j0473
13888A17063m2506l5894K2059J5607j9988m5637L4406J7449m361m559K1472O0307
13876A35418j6255j3739n7984J9557m4846m8341o8214K8592L4642q5076N6153
$$ [...]
##END NTUPLES=NMR SPECTRUM
##END=
