##TITLE=Analysis number 313984
Compound Code mo 07036
Project Code adrs
Chemist Name spectrum
##JCAMPDX= 6.0         $$ Bruker NMR JCAMP-DX V2.0
##DATA TYPE= NMR SPECTRUM
##DATA CLASS= NTUPLES
##ORIGIN= Bruker BioSpin GmbH
##OWNER= NMR
$$ XWIN-NMR		Version 3.5
$$ Fri Sep 30 12:20:25 2005 GMT Daylight Time (UT+1h)  MAYBRIDGE\NMR@NMR_250MHZ
##.OBSERVE FREQUENCY= 250.131544655141
##.OBSERVE NUCLEUS= ^1H
##.ACQUISITION MODE= SIMULTANEOUS (DQD)
##.ACQUISITION SCHEME= undefined
##.AVERAGES= 16
##.DIGITISER RES= 18
##SPECTROMETER/DATA SYSTEM= dpx250
##.PULSE SEQUENCE= zg30
##.SOLVENT NAME= CDCl3
##.SHIFT REFERENCE= (INTERNAL, CDCl3, 0, 16.522)
##AUDIT TRAIL= $$ (NUMBER, WHEN, WHO, WHERE, WHAT)
$$ ##TITLE= Audit trail, XWIN-NMR		Version 3.5
$$ ##JCAMPDX= 5.01
$$ ##ORIGIN= Bruker BioSpin GmbH
$$ ##OWNER= NMR
$$ C:\u/data/dgb/nmr/ADRS/10090/pdata/1/auditp.txt
$$ ##AUDIT TRAIL=  $$ (NUMBER, WHEN, WHO, WHERE, WHAT)
(   1,<2005-09-30 12:20:07.87 +100>,<MAYBRIDGE\NMR>,<NMR_250MHZ>,
      <created by zg, POWCHK disabled, PULCHK disabled
       configuration hash MD5:
       62 19 C7 07 E1 42 D1 B7 37 6C 3D D0 77 39 F9 E6
       data hash MD5: 64K
       F3 8A 99 A9 4A DD 71 9D CD C7 C2 7B F4 0D 00 F9>)
(   2,<2005-09-30 12:20:19.55 +100>,<MAYBRIDGE\NMR>,<NMR_250MHZ>,
      <Start of raw data processing
       ef LB = 0.3 FT_mod = 6 PKNL = 1 SI = 32K 
       data hash MD5: 32K
       96 67 41 B7 F7 26 64 D5 4C A7 07 96 02 42 CB E7>)
(   3,<2005-09-30 12:20:21.16 +100>,<MAYBRIDGE\NMR>,<NMR_250MHZ>,
      <apk 
       data hash MD5: 32K
       63 92 C9 25 8C 9F 2D F0 64 17 DE F2 E3 41 01 DB>)
(   4,<2005-09-30 12:20:21.85 +100>,<MAYBRIDGE\NMR>,<NMR_250MHZ>,
      <abs ABSG = 5 
       data hash MD5: 32K
       99 33 04 94 DC 74 F4 AC 7D 19 92 12 F5 45 0C B6>)
$$ ##END=
$$ 
$$ hash MD5
$$ A4 4F 68 96 A8 86 B4 48 EC 07 CD 96 31 75 F7 74
##$RELAX= 
##$RELAX= 
##$RELAX= 
##$RELAX= 
##$RELAX= 
##$RELAX= 
##$RELAX= 
$$ Bruker specific parameters
$$ --------------------------
##$DU= <C:\u>
##$EXPNO= 10090
##$NAME= <ADRS>
##$PROCNO= 1
##$TYPE= <nmr>
##$USER= <dgb>
##$AMP= (0..31)
100 100 100 100 100 100 100 100 100 100 100 100 100 100 100 100 100 100 
100 100 100 100 100 100 100 100 100 100 100 100 100 100 
##$AQSEQ= 0
##$AQ_mod= 3
##$AUNM= <au_zg>
##$AUTOPOS= <35 >
##$BF1= 250.13
##$BF2= 250.13
##$BF3= 250.13
##$BF4= 250.13
##$BF5= 500.13
##$BF6= 500.13
##$BF7= 500.13
##$BF8= 500.13
##$BYTORDA= 1
##$CFDGTYP= 0
##$CFRGTYP= 5
##$CHEMSTR= <none>
##$CNST= (0..31)
1 1 145 1 1 1 1 1 1 1 1 1 1 1 1 1 1 1 1 1 1 1 1 1 1 1 1 1 1 1 1 1 
##$CPDPRG= <>
##$CPDPRG1= <>
##$CPDPRG2= <>
##$CPDPRG3= <>
##$CPDPRG4= <mlev>
##$CPDPRG5= <mlev>
##$CPDPRG6= <mlev>
##$CPDPRG7= <mlev>
##$CPDPRG8= <mlev>
##$CPDPRGB= <>
##$CPDPRGT= <>
##$D= (0..31)
0 1 0 0 0 0 0 0 0 0.06 0 0 0 0 0 0 0.0002 0 0 0 0 0 0 0 0 0 0 0 0 0 0 
0 
##$DATE= 1128079207
##$DBL= (0..7)
120 120 120 120 120 120 120 120 
##$DBP= (0..7)
150 150 150 150 150 150 150 150 
##$DBP07= 0
##$DBPNAM0= <>
##$DBPNAM1= <>
##$DBPNAM2= <>
$$ [...]
##$SUBNAM7= <"">
##$SUBNAM8= <"">
##$SUBNAM9= <"">
##$SW= 20.6930455092707
##$SWIBOX= (0..15)
0 0 3 0 0 0 0 0 0 0 0 0 0 0 0 0 
##$SW_h= 5175.983436853
##$TD= 65536
##$TD0= 1
##$TE= 295.16
##$TE2= 300
##$TE3= 300
##$TEG= 300
##$TL= (0..7)
0 120 120 120 120 120 120 120 
##$TP= (0..7)
150 150 150 150 150 150 150 150 
##$TP07= 0
##$TPNAME0= <>
##$TPNAME1= <>
##$TPNAME2= <>
##$TPNAME3= <>
##$TPNAME4= <>
##$TPNAME5= <>
##$TPNAME6= <>
##$TPNAME7= <>
##$TPOAL= (0..7)
0.5 0.5 0.5 0.5 0.5 0.5 0.5 0.5 
##$TPOFFS= (0..7)
0 0 0 0 0 0 0 0 
##$TUNHIN= 0
##$TUNHOUT= 0
##$TUNXOUT= 0
##$USERA1= <user>
##$USERA2= <user>
##$USERA3= <user>
##$USERA4= <user>
##$USERA5= <user>
##$V9= 5
##$VALIST= <valist>
##$VCLIST= <CCCCCCCCCCCCCCC>
##$VD= 0
##$VDLIST= <DDDDDDDDDDDDDDD>
##$VPLIST= <PPPPPPPPPPPPPPP>
##$VTLIST= <TTTTTTTTTTTTTTT>
##$WBST= 1024
##$WBSW= 4
##$XGAIN= (0..3)
0 0 0 0 
##$XL= 0
##$YL= 0
##$YMAX_a= 390359
##$YMIN_a= -286414
##$ZGOPTNS= <>
##$ZL1= 120
##$ZL2= 120
##$ZL3= 120
##$ZL4= 120
##$ABSF1= 16.522
##$ABSF2= -4.171173
##$ABSG= 5
##$ABSL= 3
##$ALPHA= 0
##$AQORDER= 0
##$ASSFAC= 0
##$ASSFACI= 0
##$ASSFACX= 0
##$ASSWID= 0
##$AUNMP= <proc_1d>
##$AZFE= 0.1
##$AZFW= 0.1
##$BCFW= 0
##$BC_mod= 0
##$BYTORDP= 0
##$COROFFS= 0
##$CY= 12.5
##$DATMOD= 1
##$DC= 0
##$DFILT= <>
##$DTYPP= 0
##$F1P= 14.0000005364418
##$F2P= -0.99999901652339
##$FCOR= 0.5
##$FTSIZE= 32768
##$FT_mod= 6
##$GAMMA= 0
##$GB= 0
##$INTBC= 1
##$INTSCL= 1
##$ISEN= 128
##$LB= 0.3
##$LEV0= 0
##$LPBIN= 0
##$MAXI= 10000
##$MC2= 0
##$MEAN= 0
##$ME_mod= 0
##$MI= 0
##$NCOEF= 0
##$NC_proc= -4
##$NLEV= 6
##$NOISF1= 0
##$NOISF2= 0
##$NSP= 0
##$NTH_PI= 0
##$NZP= 0
##$OFFSET= 16.522
##$PC= 1
##$PHC0= -61.7573
##$PHC1= 9.405052
##$PH_mod= 1
##$PKNL= yes
##$PPARMOD= 0
##$PSCAL= 4
##$PSIGN= 0
##$REVERSE= no
##$SF= 250.13
##$SI= 32768
##$SIGF1= 0
##$SIGF2= 0
##$SINO= 400
##$SIOLD= 32768
##$SREGLST= <1H.CDCl3>
##$SSB= 0
##$STSI= 32768
##$STSR= 0
##$SW_p= 5175.98343685301
##$SYMM= 0
##$S_DEV= 0
##$TDeff= 65536
##$TDoff= 0
##$TI= <Analysis number 999999
Compound Code 99
Book Reference 9
Project Code 9>
##$TILT= no
##$TM1= 0
##$TM2= 0
##$TOPLEV= 0
##$USERP1= <user>
##$USERP2= <user>
##$USERP3= <user>
##$USERP4= <user>
##$USERP5= <user>
##$WDW= 1
##$XDIM= 32768
##$YMAX_p= 336507914
##$YMIN_p= -339251
$$ End of Bruker specific parameters
$$ ---------------------------------
##NTUPLES= NMR SPECTRUM
##VAR_NAME=  FREQUENCY,     SPECTRUM/REAL,   SPECTRUM/IMAG
##SYMBOL=    X,             R,               I
##VAR_TYPE=  INDEPENDENT,   DEPENDENT,       DEPENDENT
##VAR_FORM=  AFFN,          ASDF,            ASDF
##VAR_DIM=   32768,         32768,           32768
##UNITS=     HZ,            ARBITRARY UNITS, ARBITRARY UNITS
##FACTOR=    0.157963299565203, 1,           1
##FIRST=     4132.6476996994, 0,             0
##LAST=      -1043.33573715361, 0,           0
##MIN=       -1043.33573715361, -339251,     0
##MAX=       4132.6476996994, 336507914,     0
$$ Real data points
##PAGE= N=1
##DATA TABLE= (X++(R..R)), XYDATA
$$ [...]
26378A3833J7904l5712k9584k6802m883O8609L918q3200q3415J2207Q2697L5381
26366b9047P3298L6024O9761M9685o1972j43659j21751o4141L5203j766K3337
26355a35028M2878J1437M016Q2722j8445k4226P5734Q5078L2132r2315l8159k2171
26343C653r435Q8006O1899P912R006n6042o277K0131M355j984m097p0419M4045
26330I0753O5771r0815l6427q7471l0631L5534P2592L0170n8745L3397J8530r606
26318C3052n7883o6850j1233P3085P2647N8953M4629j8295p4592l9938N4423L6382
26306A04380m0542L3212m8251m1403q0737n7254L2032L6972L3773N7393l9897
26295a0322q1239J03158Q2894k2427K925N7217r2928o6298J8256K140N6219J0173
$$ plain form
26378 13833 31737 -3975 -33559 -60361 -65244 3365 7283 -75917 -159332 -147125 -64428 -29047
26366 -29047 44251 80275 150036 199721 137749 -5910 -127661 -191802 -156599 -158365 -135028
26355 -135028 -92150 -80713 -76697 6025 -12420 -36646 39088 124166 156298 63983 25824 3653
26343 3653 -5782 82224 144123 152035 161041 104999 98722 118853 123208 121224 117127 46708 90753
26330 90753 156524 65709 29282 -58189 -88820 -53286 19306 49476 -9269 24128 42658 33052
26318 33052 -24831 -91681 -102914 -29829 42818 101771 146400 128105 53513 13575 67998 104380
26306 104380 63838 97050 48799 7396 -73341 -130595 -98563 -61591 -27818 29575 -10322
26295 -10322 -91561 11597 94491 72064 74989 132206 39278 -27020 -8764 -6624 49595 59768
26283E9768q7489m5717K3719M7852k2054N4171k0342j3375P8540N2314o9945p4347
26271a6905o249J02272K356p3292j5778N675R1922l7848o8305M5471O1518n3730
26259C7107n5977j1595Q8355L6345l9628j4117J3841M2514L997m5890j025J4658
26247F8585P749j27382n3289J02877K1725j256M3958n856p9990L2248M3539K9604
26235H2512R920r8892p8126K4709Q8162R792n1404j4767m6351K5054K5551N2099
26223B8259l7484r3691N2645N1116m4541L0370l7121J1607K3529K1443P9260J26747
26211B12139P0542p6154n9656l8741n9876Q0780P6669r9190o6212K2176q4210
26200b1733m3279Q791N6349k3315j4626L3158q2760l7224j9664j2776J14086Q6534
$$ plain form
26283 59768 -27721 -73438 -49719 -1867 -23921 30250 9908 -3467 75073 127387 57442 -16905
26271 -16905 -23154 79118 81474 8182 -7596 -1921 90001 52153 -16152 29319 90837 37107
26259 37107 -18870 -30465 57890 94235 54607 40490 54331 96845 100842 54952 53927 68585
26247 68585 76334 -51048 -104337 -1460 20265 19009 62967 57111 -22879 9369 52908 82512
26235 82512 92432 -6460 -84586 -59877 28285 38077 -13327 -28094 -74445 -49391 -23840 28259
26223 28259 -9225 -102916 -50271 845 -43696 -13326 -50447 -38840 -15311 6132 85392 212139
26211 212139 282681 206527 146871 108130 48254 129034 205703 106513 40301 62477 -21733
26200 -21733 -65012 -56221 128 -23187 -37813 -4655 -87415 -124639 -144303 -157079 -42993 43541
26188D3541N3485O323M0758k4052n1420q270l1510q9109Q2047N8104l1657n107
26176D3133J7951J029Q704K5063l7000J1013k0702n253l0157l4629j5395J0312
26164b5931k2947O078P639J0836k9223L9364J9233K2164n5860L0263M8589m2039
26152H166k3013m3436l7930p3880K9274Q8633K3904R9390Q3589o8431l1901n8355
26140c990l6986K4714j108K6651j3776L8694P661J7250m9597j6626P4110K7505
26128I4502o7151P9460j6544j06489m4688j683K7379M1592L6108o7374k8271L2799
26116b0360J1213k0251n5503j2889M992l945J8561M6644K3373J0655j108O580
26104G962J4956K7659p1619l5350O9254j5273K1254M62O3247J756l6947L4945
$$ plain form
26188 43541 97026 103349 144107 120055 68635 60365 28855 -60254 21793 79897 48240 43133
26176 43133 61084 62113 70817 95880 58880 69893 49191 43938 13781 -20848 -36243 -25931
26164 -25931 -48878 -42800 -35161 -24325 -53548 -14184 5049 27213 -28647 1616 50205 8166
26152 8166 -14847 -58283 -96213 -170093 -140819 -52186 -28282 71108 154697 86266 54365 -3990
26140 -3990 -40976 -16262 -17370 9281 -4495 34199 41860 59110 9513 -7113 66997 94502
26128 94502 27351 106811 90267 -16222 -60910 -62593 -35214 6378 42486 -24888 -53159 -20360
26116 -20360 -9147 -29398 -84901 -97790 -92798 -96743 -78182 -31538 -8165 2490 1382 7962
26104 7962 22918 50577 -21042 -56392 12862 -2411 18843 19305 82552 84308 47361 82306
26092H2306n6884q9027K8206L2192K3910p500o529p2101q2417K6680J02596N9764
26080D1196L2001p1869k5264l6048L4045Q4670K3146q2176q4675j4975L9613O2208
26068A872Q6717m8077K5431K2304j02999L4127R475k3606j13798j5012O5997J23344
26056F5775L0506j0598n1660q3988N0993P240K3546K9918k360m0585k1893L28
26044b778K1675j9357m6709J4167J4350K8868j1520J1926P6825q1080r7659o2936
26032a54228N9131P7857j2991k5302m2310M79L0361O669k7541k183O3705R3262
26020F6909J934M5705j16749o1809K64N3165Q0643r02l9629j0800m7391q7977
26008a16637j5908L2445R937j6558j206O4876J15229L6009n6756K1632M9498l3012
$$ plain form
26092 82306 25422 -63605 -35399 -3207 20703 13203 6674 -65427 -147844 -121164 -18568 41196
26080 41196 73197 1328 -23936 -59984 -25939 58731 81877 -299 -84974 -99949 -60336 1872
26068 1872 88589 40512 65943 88247 -14752 19375 28850 5244 -108554 -123566 -57569 65775
26056 65775 96281 85683 34023 -49965 1028 8268 31814 61732 59372 18787 -3106 -2778
26044 -2778 18897 -460 -47169 -33002 -18652 10216 -1304 10622 87447 6367 -91292 -154228
26032 -154228 -95097 -17240 -30231 -55533 -97843 -97364 -67003 -60334 -87875 -90058 -26353 66909
26020 66909 68843 114548 -2201 -64010 -63746 -10581 70062 69160 29531 18731 -28660 -116637
26008 -116637 -132545 -100100 -90163 -106721 -107927 -43051 72178 108187 51431 73063 122561 89549
25996H9549o369k2071N5905L8966l2269r928m5119j7913l8240l4933k2766J2393
25984c2795N552Q5395j3862j7705r1616L5211M637L9655J6266J4557p243O454
25972D4506m3914J9043j8175k0658l4569O8235R9192l9487k3478Q365L8883J1948
25960A09891l5323j28321j3584L4661N761K1353r2855l2315P729J6641J4273N3697
25948c8392n6037l2324O8374R2197K605J6111J7944K6471j01997o369O271J3086
25936G940L8994K9388m1917m27l0027m4519P0874M4200N7004N5332O7127k8484
25924B25485j03617n7422k1719O1617m328p1614P1232j0602o1485k560K8745k3856
25912B9876l4102q668l512m5658L0253k9430o8197O3267K8230l3634O410O139
$$ plain form
25996 89549 83180 61109 117014 155980 123711 113783 68664 50751 12511 -22422 -45188 -32795
25984 -32795 -27243 58152 44290 26585 -65031 -29820 -25183 14472 30738 45295 38052 44506
25972 44506 592 19635 1460 -19198 -53767 14468 113660 74173 50695 59060 97943 109891
25960 109891 74568 -53753 -67337 -32676 -26915 -5562 -98417 -130732 -123003 -106362 -92089 -38392
25948 -38392 -94429 -126753 -58379 33818 36423 52534 70478 96949 -5048 -11417 -5146 7940
25936 7940 46934 76322 34405 33978 3951 -40568 30306 74506 131510 186842 253969 225485
25924 225485 121868 64446 42727 104344 100016 28402 99634 89032 27547 24987 53732 29876
25912 29876 -4226 -12894 -16406 -62064 -31811 -61241 -129438 -66171 -37941 -71575 -65165 -59026
25900e9026r723M1606N9783O598M9975Q324m6074n2604K4344M1638j3493m127
25888D7221k5174n7144L1251L2242q0462m6230n5352j1181O9960P1074O4857K9962
25876G1024l1170Q249N5973k6147o8377l8903j4025n9050K4426M2129L6003J6395
25864A6527k2235p1159N3448K7577o9148l2584M5044L8575N4899K7061o2615j6207
25852a0817o8350R6843L5886k3855m4909k6269P3J0587K3245N3609L6937K99P077
25839I0356O4112j30620l5723L1526O4768l5655m2077K3179k8836k9354O3675
25828C5351m409l7160K5122P361r040K4373l0660n8000m1380L5772K0991j3683
25816d5362m7741M4888L0290J5103K8792q2497o9114l342M3809r900K6384N4740
$$ plain form
25900 -59026 -68749 -27143 32640 39238 89213 97537 51463 -1141 23203 64841 51348 47221
25888 47221 22047 -35097 -3846 28396 -52066 -98296 -153648 -164829 -94869 -23795 41062 71024
25876 71024 39854 48103 104076 77929 9552 -29351 -43376 -102426 -78000 -35871 132 16527
25864 16527 -5708 -76867 -23419 4158 -64990 -97574 -52530 -13955 40944 68005 5390 -10817
25852 -10817 -79167 17676 53562 29707 -15202 -41471 -41398 -30811 -7566 46043 82980 83279 90356
25839 90356 154468 23848 -11875 19651 84419 48764 6687 29866 1030 -28324 35351
25828 35351 30942 -6218 18904 26265 17225 41598 10938 -47062 -88442 -52670 -31679 -45362
25816 -45362 -93103 -48215 -17925 -2822 25970 -56527 -125641 -128983 -85174 -95074 -68690 -13950
25804a3950j2494J2026Q1457Q6174l9504r605L5759j806m1516o2191q1649k1325
25792f8624L0731P5679l2596m8962o8680k926Q5629L2639q613k7174j688J5881
25780a8704J3630n6938j2652J9315P7069N2667o0410l2749L4449K8849k1785O711
25768B9452M1041m2460j4981O36l4685j7692j6961o825q1016k3685l2744L4583
25756a65337J7696J1266l1697M5133n084n3477K4947J78089O8858j5351j0007
25745F5036L7761j3299J5791n1641l6194m9748j15056n864Q8177J29699K9976
25734I4638m872q2708l8507J9735J7924P9029R7905J3501o6889r4532L497L7622
25722G6343n3059m5305r791P6287q479m9375l9399o274N0506O6534M137j8588
$$ plain form
25804 -13950 -26444 -14418 67039 153213 113709 104104 139863 138057 96541 34350 -47299 -68624
25792 -68624 -37893 37786 5190 -43772 -112452 -115378 -29749 2890 -5723 -32897 -34585 -18704
25780 -18704 -5074 -62012 -74664 -55349 21720 74387 13977 -18772 15677 44526 22741 29452
25768 29452 70493 28033 13052 13688 -20997 -38689 -55650 -62475 -143491 -167176 -199920 -165337
25756 -165337 -147641 -136375 -168072 -122939 -128023 -181500 -156553 21536 90394 75043 65036
25745 65036 102797 89498 105289 53648 17454 -32294 -147350 -153214 -65037 64662 94638
25734 94638 89766 7058 -31449 -11714 6210 85239 183144 196645 129756 35224 38721 76343
25722 76343 23284 -22021 -31812 44475 35996 -13379 -52778 -59052 -8546 57988 62125 43537
25710D3537l4636m5852O1135J0669k6010k859l638r968q2707K7659J3562L4876
25698a4232J0860J4347j0019K618p8646n3536O356O037k7948J0360J41290m0396
25686c2909j4998M0334P653k8318k3411J00853J5711k2422O5907J9476j24357
25675C519p0197k2965O0592O2153R451j6684n7725p22p0770J1686Q0001n1831
25663f3492j01352J2231Q4867L9003j7786q6396l8051J4132L4815M8944m2923
25652a16008k4488N2154j1101M9013K8636J2722r40p4963k5506O5252J3448K6293
25640e488P2192O4498k4816n1675p8903m1131q0450l3369q174L7188R5380N9450
25628D702j8231l0186j3961J60148M6111p6111J4357m412k2193m901Q701O237
$$ plain form
25710 43537 8901 -36951 24184 34853 8843 5984 2346 -7622 -90329 -62670 -49108 -14232
25698 -14232 -3372 10975 956 3574 -75072 -128608 -122252 -116215 -144163 -133803 7487 -32909
25686 -32909 -47907 -7573 80 -28238 -51649 49204 64915 42493 108400 127876 3519
25675 3519 -66678 -89643 -29051 33102 42553 25869 -31856 -32578 -103348 -91662 -11661 -63492
25663 -63492 -164844 -152613 -67746 -28743 -46529 -132925 -170976 -156844 -122029 -73085 -116008
25652 -116008 -140496 -88342 -99443 -50430 -21794 -9072 -10012 -84975 -110481 -45229 -31781 -5488
25640 -5488 66704 131202 106386 54711 -24192 -65323 -145773 -179142 -187316 -150128 -54748 4702
25628 4702 -13529 -43715 -57676 102472 148583 72472 86829 82417 60224 55323 64024 70261
25616G0261j7933N715m8046k218M1257L1694P5511j19119n0674J28291Q9901q3829
25604A20811n8892K7151L3288j5882r4633j5431J15762L6754j3341l1321J1496
25593A15762J2173j1712p6993o4772J8305J0463o8910j5889p957O7092O1051O7939
25581A06552j8808m715j0348l186k5137p6998m1424k0309P4294J22339l7808l6462
25569B7990l2881m591M0940J2071N0971l7849m5533k4955K9923Q762j7224K4660
25557C2284l3296M6949k5295O4802M211j08799o4242J30523J04294k8213n750
25546A17468J13363q025j4103p4152l3707k3992j8330r705N2730N5190L0852m5514
25534A42075j24402K3856j7200M2651O9989Q961M728j7946l9408m5507j7015k4556
$$ plain form
25616 70261 52328 58043 9997 7779 49036 80730 156241 37122 -13552 114739 204640 120811
25604 120811 61919 89070 122358 106476 11843 -3588 112174 148928 135587 104266 115762
25593 115762 127935 116223 39230 -25542 -7237 3226 -65684 -81573 -89530 -22438 38613 106552
25581 106552 87744 83029 72681 69495 44358 -32640 -74064 -94373 -20079 102260 64452 27990
25569 27990 -4891 -9482 31458 43529 94500 56651 11118 -13837 16086 24848 7624 32284
25557 32284 -1012 45937 20642 85444 89655 -19144 -83386 47137 151431 123218 117468
25546 117468 230831 222806 208703 134551 100844 76852 58522 48817 101547 156737 187589 142075
25534 142075 17673 41529 24329 66980 136969 145930 150658 132712 93304 47797 30782 6226
25522F226m3575L6394n193J2688O1485l2092J801k6309M4282Q016K7766l8741
25510E2748n5849o0208k3076M4242j0009M5219j9051m9203N1627J9997Q062l4223
25498b9724R4655P5226o386n4221k3423J6913l871L2498n1815k5154K9214l1026
25486B2886o7937J5449O9015K8066l9005L9717j8658K7012l8526j02525N4969
25475i537L3585o8766l9079M6431R7116k1584k5084N5083k8598l153k4749n1206
25463c9541R2852M2512j0207J7744m5524L7098J3999K535j8204r8805j62321j1520
25451a79382P1342O4270j2786l1433J6744j5597J0853M3298O5716p93l0285l430
25439a483j4246j9262J4395k5173L7130k3946n668k4229l6111l6915o6288n206
$$ plain form
25522 6226 -37349 -955 -6148 6540 68025 35933 37734 11425 55707 63723 91489 52748
25510 52748 -3101 -63309 -86385 -42143 -52152 -6933 -25984 -75187 -23560 -3563 4499 -29724
25498 -29724 64931 140157 133771 79550 56127 73040 69169 101667 49852 24698 53912 22886
25486 22886 -45051 -29602 39413 67479 28474 68191 49533 76545 38019 -64506 -9537
25475 -9537 24048 -44718 -83797 -37366 59750 38166 13082 68165 39567 36414 11665 -39541
25463 -39541 53311 95823 85616 103360 57836 94934 108933 111468 93264 -5541 -167862 -179382
25451 -179382 -108040 -43770 -56556 -87989 -71245 -86842 -75989 -32691 33025 32232 1947 -1483
25439 -1483 -15729 -34991 -20596 -45769 -8639 -32585 -38253 -62482 -98593 -135508 -201796 -207002
25427b07002k394P5248P5214Q7654P5644M9380j28103L279O3354o930n5540j37462
25415a07658j0935L1547k1400P302Q6147N5680L6121Q673O415K245Q824m6929
25403E6032n5544K7626K6369o7676j7533J07779l5116m6500k6908l447K5930l8764
25391d7752O765K4605L726K279O638p385j4426J5412p373Q3940R5244L2332o9583
25378A24422j08167q6810O2315N061k5290L491J5104K6879k9366K0299j8071Q825
25366a308J6317j5079l2705Q979N149k8023L9905l4556N5035J28152j3414r7584
25354C0868j01470q538L6722Q1829j0013k0935k6528l3764K0554k867P99K8892
25342d451N7960j0593N898n2736L4027l659j709L3837l5562l3196k4813j9260
$$ plain form
25427 -207002 -209396 -134148 -58934 28720 104364 153744 25641 28920 92274 85344 29804 -107658
25415 -107658 -118593 -87046 -108446 -101144 -14997 40683 76804 85477 91892 94137 102961 56032
25403 56032 488 28114 54483 -13193 -30726 77053 41937 -4563 -31471 -34918 -8988 -47752
25391 -47752 -40987 -16382 -12656 -10377 -3739 -11124 -25550 -10138 -17511 66429 161673 194005 124422
25378 124422 16255 -70555 -8240 -3179 -28469 -24978 -9874 17005 -12361 7938 -10133 -1308
25366 -1308 15009 -70 -32775 -23796 -18647 -46670 -6765 -41321 13714 141866 128452 30868
25354 30868 -70602 -79140 -42418 39411 29398 8463 -18065 -51829 -31275 -34142 -33343 -4451
25342 -4451 53509 42916 48814 -3922 30105 26446 24737 58574 23012 -10184 -34997 -54257
25330e4257K2498l9479q8444j5005K7096R3575n4220J551N5622j7911k9592K5885
25318g2681R7305L987K3331m3968K3490m4078q4296R762p2128M1618O4378P1563
25306A8283O5682j9109p079L0711j0600J6839n135q9588K3510k2406l2547q7607
25294a19046R6978J18704j1459L0419K5243q787r5551o8495R3520l5743l9729
25283a3946L6126O5822n0090n3427k3150J9476M2398M5894N8299l1524j08419
25272a2541P8416q7024k8432J02040M431K1311J795k7116j0961P4680K5277n2633
25260H9243r1924m6998O6239J5325l3544N0684M6824n5298r3629l5186P7717K7070
25248A6523m8871L8998j4673j9876o5623K5855n5637Q8101n9275n3331J9354J2018
$$ plain form
25330 -54257 -31759 -71238 -159682 -174687 -147591 -54016 -108236 -106685 -51063 -68974 -98566 -72681
25318 -72681 24624 28611 51942 7974 31464 -12614 -96910 -87148 -159276 -117658 -53280 18283
25306 18283 83965 64856 57777 88488 77888 94727 89592 4 23514 1108 -31439 -119046
25294 -119046 -22068 96636 85177 115596 140839 132052 36501 -31994 61526 25783 -13946
25283 -13946 22180 88002 37912 -15515 -38665 -19189 23209 69103 127402 95878 -12541
25272 -12541 65875 -21149 -49581 52459 56890 78201 79996 52880 41919 116599 141876 89243
25260 89243 -2681 -49679 16560 31885 -1659 49025 95849 40551 -53078 -88264 -10547 16523
25248 16523 -32348 6650 -8023 -27899 -93522 -67667 -123304 -35203 -94478 -147809 -128455 -116437
25236a16437r0426J7556J44264R0073j8585o9720l6604j7993m945O8155Q9620
25225E4958J6264J7229l8188J1704K569p8440M6094J12349P0576Q46q1594n4291
25213H0076j2891m0501j6815N2221L7971L5919m9857m8670M3827n9767j03378
25202h1865P2238K9741j74546O3433P4488P6368N0841l1129q171l3878l3030p3322
25190f8832l6877J8163N6515O9455J03915q8682r1396l7330M0242M3693K8960
25179C7826J9089N6350K0538j54334j19299J8838M5250J00149K880j7586K3051
25168C2752J2099j2373k2492M087J9710K2326J4806j04029r6611n5678K8817P648
25156a48938M1085M2613R6039l9544R286P046p5778n0192O8075N4510l1131j2032
$$ plain form
25236 -116437 -206863 -189307 -45043 45030 26445 -43275 -79879 -97872 -102817 -34662 54958
25225 54958 71222 88451 50263 61967 64536 -13904 32190 144539 215115 215961 134367 80076
25213 80076 67185 26684 9869 62090 100061 135980 86123 37453 81280 21513 -81865
25202 -81865 -9627 20114 -154432 -90999 -16511 59857 110698 79569 71398 37520 4490 -68832
25190 -68832 -105709 -87546 -31031 38424 142339 53657 -37739 -75069 -34827 8866 37826
25179 37826 56915 113265 133803 -20531 -139830 -120992 -75742 24407 27287 9701 32752
25168 32752 44851 32478 9986 14073 33783 56109 70915 -33114 -129725 -185403 -156586 -148938
25156 -148938 -107853 -65240 30799 -8745 541 7587 -68191 -118383 -50308 4202 -26929 -38961
25144c8961o2645K3614J03821N9738n410l4249r2471K6179L3815J3825Q655o1449
25132b5538L9570K3820M2987o7495p8672l8861Q3639K9450R7575K1355r4780p8876
25120d5826K606R060J587k7303J450p8923l837J07875P5324m1262o6732j04400
25108a70381L8016K5565M6730q102M7602l8447P5798J85598j9447j26994J4579
25097G0517K4427o066k4016P1305m7564r0111K3962K2214n2681o9330K8510J1028
25085c7805k2416O6611k4035m7760N3836J6666P22P7029O4650j6574o4847q8388
25073b2311n0806j0572p2743j2193K4145O593N3355Q6981O4686J9893n0284n1444
25061a4700q8530m4352P245R8358M0126M4960k3877k9454m4036J071K6485L6989
$$ plain form
25144 -38961 -101606 -77992 25829 85567 80157 45908 -46563 -20384 13431 27256 35911 -25538
25132 -25538 14032 37852 80839 13344 -65328 -104189 -20550 8900 106475 127830 33050 -45826
25120 -45826 -43220 -34160 -32573 -59876 -58426 -137349 -141186 -33311 42013 751 -65981 -170381
25108 -170381 -132365 -106800 -60070 -68172 -20570 -59017 16781 202379 182932 55938 70517
25097 70517 94944 88878 64862 136167 88603 -1508 22454 44668 -8013 -77343 -48833 -37805
25085 -37805 -60221 6390 -17645 -65405 -11569 5097 5819 82848 147498 130924 66077 -22311
25073 -22311 -73117 -83689 -156432 -168625 -144480 -137887 -84532 2449 67135 87028 36744 -14700
25061 -14700 -103230 -147582 -140337 -41979 -1853 43107 19230 -10224 -54260 -53189 -26704 10285
25049A0285J852L4903P9303K4546K1391k7606r0713n4103K2061K5240r162L4562
25037G2559N489R987O868p5507m3747K8184k82j6725q529O7564P5408k7799p8489
25024A4981n17j38j5978J1107K7531K6223L1530l4563O5253o2230j14488l3596
25012h4885j7414k5156K7848q446N420P3311O8252r078m5402L0440n0569K845
25000c2834N5179m664J4578J2130o651O6887M6478p8512j13274j0033j6228J4987
24988e1957k8772j6667M9645J4041p2586N323N6694J4249M8295k021j1159M5126
24976E0211n111R004Q6554Q098j14635q4874p5218Q5303J16882j6864n5896o0588
24964e7134J8283K4933Q981m663J01296M9565o8860r4835j2080Q245P360M6668
$$ plain form
25049 10285 12137 47040 126343 150889 172280 144674 53961 -142 21919 47159 37997 72559
25037 72559 78048 88035 94903 19396 -24351 3833 3551 -13174 -21703 45861 121269 93470 14981
25024 14981 14464 14326 -1652 9455 36986 63209 94739 60176 125429 63199 -51289 -84885
25012 -84885 -102299 -127455 -99607 -108053 -102633 -29322 38930 29852 -15550 14890 -35679 -32834
25000 -32834 22345 17681 32259 44389 37738 104625 151103 72591 -40683 -50716 -66944 -51957
24988 -51957 -80729 -97396 -47751 -33710 -106296 -100973 -44279 -30030 18265 16244 5085 50211
24976 50211 45100 54104 140658 148756 34121 -50753 -125971 -40668 76214 59350 3454 -57134
24964 -57134 -38851 -13918 -4937 -9600 91696 141261 72401 -22434 -34514 -26269 -18909 27759
24952B7759n3767J8255J8287o191K7874O350l4295L9297j3308m7709N0704N1640
24940H4896R0888K7477n6604o901J761o3235l4071K6075r282o5510K0066p2005
24928e6445j16027L9040P2027Q1083R335N8125n4799o4192J4541J20984l5961
24917F7711o9950p0928k2947J7746M6903K0396o648m6202j0380K0251j4823j0961
24905g9832M1749Q4652J7685L3747K3411M526M541p4113l5573n6824K8185O1049
24893E3203J14903Q8813r6199j82902r2088l5781L003J2770J02343N2831j2995
24882G901J8922J2528l88p428p2343n8833r377R229O5072P004o0097P0229J20464
24869A02883p2917q6348P9690J3402j15697J666O796M1661O2021q3114p0439M622
$$ plain form
24952 27759 -26008 -7753 10534 4343 32217 38567 4272 43569 30261 -17448 33256 84896
24940 84896 175784 203261 146657 139756 141517 78282 44211 70286 61004 -4506 15560 -56445
24928 -56445 -172472 -133432 -61405 19678 29013 87138 32339 -31853 -17312 103672 67711
24917 67711 -2239 -73167 -96114 -78368 -31465 -11069 -17717 -63919 -74299 -54048 -68871 -79832
24905 -79832 -38083 46569 64254 98001 121412 125938 130479 56366 20793 -36031 -7846 53203
24893 53203 168106 256919 160720 -22182 -114270 -150051 -147048 -134278 -31935 20896 7901
24882 7901 26823 39351 38963 31535 -40808 -99641 -109018 -99789 -34717 -27713 -87810 -17581 102883
24869 102883 29966 -56382 23308 36710 -78987 -77321 -70525 -28864 33157 -49957 -120396 -115774
24857a15774o728q71Q2234K1340M233k7878r859m8853K8643K997p051N2889O3969
24844C9291n2508p729J22406q0964L9703M1670l7174m8968J6290L7555l5279j6180
24832A8113O579p908k2583N1474O3067K2136j71639k7638O0922L0610j1017m8288
24820c6172n4723K3297K2017J3654J7410r3771r349R0626K3477k4375J4182k724
24808a6451L0789K4392o33M3284N0164o4451r8541j3839N8891L336K0581k960
24796C4562J2003O333n1889k3592L6040n3379j2705O7353J3074n1074l3256j3529
24784g0059N8341M3402j06492l2301L9055o846N0118N6438m1422K6833K0382j6583
24772B0866M0931M3383p5937j57189J9715J08645L976k2930j06732R312Q0991
$$ plain form
24857 -115774 -122502 -123373 -41139 -19799 -15566 -43444 -53303 -102156 -73513 -70516 -77567 -24678 39291
24844 39291 -13217 -20946 101460 20496 60199 101869 64695 15727 32017 69572 34293 18113
24832 18113 24692 16784 -5799 45675 108742 130878 -40761 -68399 -7477 23133 12116 -36172
24820 -36172 -90895 -67598 -45581 -31927 -14517 -108288 -117637 -27011 -3534 -27909 -13727 -16451
24808 -16451 14338 38730 38097 81381 131545 67094 -31447 -45286 13605 16941 37522 34562
24796 34562 46565 52898 1009 -22583 13457 -39922 -52627 14726 27800 -23274 -56530 -70059
24784 -70059 -11718 31684 -74808 -107109 -68054 -74900 -24782 31656 -9766 17067 37449 20866
24772 20866 61797 105180 29243 -127946 -108231 414 4390 -18540 -125272 -115960 -34969
24761c4969K7093L3841j324Q166M2946O3882m4920q4594P2322J6811l3810k1148
24749D4296q1979n6660M3286O7182J1407p438L9437n6868m8688M863M3936K1684
24737B4458l6015R6863N2320m6492n3525l0377P4008L0463q2844o516N4125j6330
24725F0138p5371l6010J9615n2793Q709p8031J7134K0769L4007P863j12049l5349
24713b21368L0216K5717J2938L1731k307J19707M2601p4818p6428J2788L3073
24702f6150k9291N3528K6874J2541K0942K933j419Q2346M8192p904m2792j1224
24690H8576p7603l0588m3166R8l9462k9976J66398q021j7490j1643n535k975l7582
24677d8969o2804K8574J7931R2133k0102K0584l3302o0267k7940L6293J47418
$$ plain form
24761 -34969 -7876 25965 24641 32807 75753 139635 94715 10121 82443 99254 65444 44296
24749 44296 -37683 -94343 -51057 16125 27532 20094 59531 2663 -46025 -41162 2774 24458
24737 24458 -11557 85306 137626 91134 37609 7232 81240 111703 28859 22343 76468 60138
24725 60138 -15233 -51243 -31628 -84421 -75712 -153743 -136609 -115840 -81833 -73970 -186019 -221368
24713 -221368 -191152 -165435 -152497 -120766 -123073 -3366 39235 -35583 -112011 -99223 -66150
24702 -66150 -95441 -41913 -15039 -2498 18444 21377 19958 102304 150496 142592 99800 88576
24690 88576 10973 -19615 -62781 -62683 -102145 -132121 34277 26256 8766 -2877 -8412 -11387 -48969
24677 -48969 -111773 -83199 -65268 26865 6763 27347 -5955 -66222 -94162 -57869 89549
24666H9549p4459n6696J385M3472J0984k0393j5208l882p258j170p4722K5020
24654h3378P8181J1677l636M701o6120k1747P7811j4177l2952p9478m1744Q0648
24642i0214J7544K030O1980q9798j6987K403L3204k0912J3437L6601n2904j8859
24630a22475J14145k4002j5037m4061M8919K0610K0168R598j5550m5409j12352
24619a65446L6396N3969R6310j6932p8223j02404m4373L5195O2477J26693O1996
24608F5658k7502L341p2712k1841N7850K0274M9055L4177K4802l6922r3836L3773
24596C6117n2540n4752k3110R5150K7415n103J4246J2314j709q3700O0218J27733
24584A52279l1834q0452r2292q8960J3450J03685L4943o5346J599P7284M4198
$$ plain form
24666 89549 15090 -41606 -40221 3251 14235 -6158 -21366 -25248 -32506 -33676 -108398 -83378
24654 -83378 -5197 6480 2844 7545 -58575 -80322 -2511 -16688 -49640 -129118 -170862 -90214
24642 -90214 -72670 -70640 -8660 -98458 -115445 -113042 -79838 -100750 -87313 -50712 -103616 -122475
24630 -122475 -8330 -32332 -47369 -91430 -42511 -21901 -1733 7865 -7685 -53094 -165446
24619 -165446 -129050 -75081 21229 4297 -73926 -176330 -220703 -185508 -123031 3662 65658
24608 65658 38156 41497 -31215 -53056 4794 25068 74123 108300 133102 96180 2344 36117
24596 36117 -16423 -71175 -94285 865 28280 23177 37423 49737 48028 -35672 24546 152279
24584 152279 120445 39993 -52299 -141259 -127809 -24124 10819 -54527 -52928 24356 68554
24573F8554o7124l3601k4438l261K4256l680P0372m588j5348m8411k616M8409
24561H524O6960l4233o4103l6221R8091k011L6014l7029o436M3704L950o9342
24549G868k8680K2179k5729j07681L0018K933j252l1972o349n017J03676J01914
24537F1908J2636k9746j0650n0346J262j8066o798K4062J0563l8996n6218P9901
24525b0488M1917n048j177o8461j4321N3595n6959q671r90J0334n475j0703m8528
24512a34975R244K0949J550N8401p9254N6667M2406m6025j9524L0309L2062k156
24500c0346l9884k6312J165P1750k4069k6018m7452m2236L1661M6810P4107K4453
24488A3629M7182j7874n1923m4037m2462l0294K7438J1176O087L3302j4580q9811
$$ plain form
24573 68554 1430 -32171 -56609 -59870 -35614 -39294 31078 26490 11142 -37269 -39885 8524
24561 8524 75484 41251 -22852 -59073 39018 37007 73021 35992 29556 73260 77210 7868
24549 7868 -20812 1367 -24362 -132043 -102025 -99092 -100344 -132316 -138665 -143682 -40006 61908
24537 61908 74544 44798 34148 -16198 -14936 -33002 -39800 -15738 -5175 -44171 -100389 -20488
24525 -20488 21429 16381 15204 -53257 -67578 -13983 -70942 -79613 -80603 -70269 -75744 -86447 -134975
24512 -134975 -125731 -104782 -103232 -44831 -124085 -67418 -25012 -71037 -90561 -60252 -28190 -30346
24500 -30346 -70230 -96542 -95377 -23627 -47696 -73714 -121166 -163402 -131741 -84931 -10824 13629
24488 13629 60811 42937 -8986 -53023 -95485 -125779 -98341 -87165 -81078 -47776 -62356 -152167
24476a52167j7277R7613M1038n4703r767M8914L1411o4227K1169O3390M3984O964
24464E6342L274m0575K3378J3269K4344M4861o194J423l524r449m5662K1961k4479
24451E8969l1259n4635n7322o3108J9398L5020R8035O0634l1582m4499l1590r1985
24439a33924R6381J26826k1622l157O8585M526O8005j7321l9228l7756l8293K5342
24427I8364M313n5609r7350k830j3552l7955O8982M4319j6269k1323k0456m074
24415e3440j8682L4851m3817L1260R9177k458o3699o3757M114J30832N4949o1705
24403D7625j00796p3493r792K8769j0092J0485M6768N9305K3392Q1249J1189m4252
24391G0357m094k9537l8041J25772P2439m2058k2686J453n4142j9697K1793p257
$$ plain form
24476 -152167 -169444 -71831 -30793 -85496 -95263 -46349 -14938 -79165 -57996 5394 49378 56342
24464 56342 59616 19041 42419 55688 80032 124893 118699 120122 116598 107149 61487 83448 58969
24451 58969 27710 -26925 -84247 -147355 -127957 -92937 5098 65732 34150 -10349 -41939 -133924
24439 -133924 -37543 89283 67661 64504 133089 137615 205620 188299 149071 111315 73022 98364
24427 98364 102677 47068 -50282 -53112 -66664 -104619 -35637 8682 -7587 -28910 -49366 -53440
24415 -53440 -72122 -37271 -81088 -49828 49349 46891 -16808 -80565 -76451 54381 109330 47625
24403 47625 -53171 -126664 -136456 -107687 -117779 -107294 -60526 -1221 22171 103420 114609 70357
24391 70357 66263 36726 -1315 124457 196896 154838 132152 133605 79463 59766 81559 74302
24379G4302p469l5047p2362q217j2778m9256l14N9877L9302n1612Q8411M1230
24367F6067q158k5006N9458K550N822j09611l717m2196j26281l8674O8752O1406
24355h9588Q8293L7916m2940k6436O8963o1767l7129n0359J0263P061k9933k6013
24343a51669j5244K3190P285j8119P0384J05040J8861j47953n3100N9971K9666
24332g1688l8735M7649J21505j8168M36q202j5182j9086O6506J1951J7824M091
24320I8901K2273k79r4155q4631M6754k2125k0825L0893K531n8334M5261N3550
24308A9814l0452K5191n7327o5516M470o6293j06537M5438M9565M1311M4721R546
24296h6069M0441O2712J5083K0170J4101L2504K641m811J9192k3569J9062j713
$$ plain form
24379 74302 66833 31786 -40576 -48793 -61571 -110827 -111141 -51264 -11962 -63574 24837 66067
24367 66067 57909 32903 92361 94911 100733 -8878 -12595 -54791 -181072 -219746 -150994 -89588
24355 -89588 -1295 36621 -6319 -32755 36208 -25559 -62688 -113047 -102784 -95723 -125656 -151669
24343 -151669 -166913 -143723 -136438 -154557 -84173 20867 39728 -108225 -161325 -101354 -71688
24332 -71688 -110423 -62774 58731 40563 40999 32797 17615 -1471 65035 76986 94810 98901
24320 98901 121174 120895 26740 -57891 -11137 -33262 -54087 -23194 -20663 -78997 -33736 19814
24308 19814 -10638 14553 -42774 -108290 -103820 -170113 -276650 -231212 -181647 -140336 -95615 -86069
24296 -86069 -45628 17084 32167 52337 66438 98942 101583 96772 115964 92395 111457 109744
24284A09744n269O7911k4384p0183o7329k831K2340k5697k882n9246m4462q7448
24272a89736Q6566P6307O3166Q875k1463N447M3659N2622m7056n7274K3298l021
24260D1390m5827q4192q87M6401M1160k1283m9444l9300R0405n0229M56O7917
24248c433K322j321Q6391K4183N4553K9605p8177o0113l0065r2573Q7337L1906
24236E0615n4966O897m2748L5625Q7805M8122k3199k2219J266J6113j782J1660
24224A13189j768o4335l3991k6753p6442m9513J41981L6229l1587P4497l0025
24213E1482k9383L5875M821J7336j02651l6339R1p417k0843J0546M2105K6109
24201h268J6488J4859L1199l6013m642k3460j8198P5508O193l1774j9606O1264
$$ plain form
24284 109744 104475 172386 148002 77819 10490 7659 29999 4302 1420 -57826 -102288 -189736
24272 -189736 -103170 -26863 36303 45178 23715 29162 72821 125443 78387 21113 44411 41390
24260 41390 -4437 -88629 -89516 -43115 -1955 -23238 -72682 -111982 -21577 -71806 -71350 -3433
24248 -3433 -1111 -2432 83959 108142 162695 192300 114123 54010 23945 -68628 18709 50615
24236 50615 -4351 2546 -40202 -4577 83228 131350 108151 85932 87198 103311 101529 113189
24224 113189 111421 47086 13095 -13658 -90100 -139613 2368 38597 7010 81507 51482
24213 51482 22099 57974 62795 80131 -22520 -58859 -58768 -66185 -87028 -76482 -34377 -8268
24201 -8268 8220 23079 54278 18265 13623 -9837 -28035 47473 53666 21892 2286 63550
24189F3550K2733n7666o4360q4211M1988J10475Q63m4575l927J9823P467k2617
24177a0457P236k062J1475O6012j2305q3823L6317L8865l2551M515p9671J3902
24165d2547K7676R115K7266K2207M4172P530l0159p7008K7826q51J1845n4048
24153b6976n4214m974L222O0432n055o880K6708l9648l5253L3274P3181K5017
24141D8834M4248Q2615J6971p2905l4235n1145K53o2915j8201K5261J04512j14278
24129c0985j40677j6078K8885L8072L3536m7087k5280K1588J03786P306l9751
24118f6685N2749J02101j7593n6994j0261j5465j0867M6505M9467j9182j09699
24107e5924m2644M9995m1519j0893L8712k3539j4448R9111J13516j8294q368K8207
$$ plain form
24189 63550 86283 28617 -35743 -119954 -77966 32509 33372 -11203 -15130 4693 12160 -10457
24177 -10457 -3221 -5283 6192 72204 59899 -23924 12393 51258 18707 23222 -56449 -42547
24165 -42547 -14871 -5756 21510 43717 87889 95419 65260 -11748 16078 15227 27072 -26976
24153 -26976 -81190 -86164 -82942 -22510 -27565 -34445 -7737 -47385 -82638 -49364 23817 48834
24141 48834 93082 175697 192668 119763 85528 34383 34636 -28279 -46480 -21219 83293 -30985
24129 -30985 -171662 -187740 -158855 -120783 -87247 -134334 -159614 -138026 -34240 -26934 -66685
24118 -66685 -13936 88165 70572 13578 3317 -12148 -23015 23490 72957 53775 -55924
24107 -55924 -98568 -48573 -90092 -100985 -62273 -85812 -100260 -1149 112367 94073 85705 113912
24095A13912L3065q4323k6257N0449M1236k290m7660q0575p7921O4989J1272K10
24083c893l757k5306o6227L7666M2543M7159Q2350n386m9875J6427M5262j9685
24071I7278j1465l8308m7151L7935O3084K7557q3426p6421o1441K5148J0486N5584
24059a140L5852n8246k5314k636L8197Q8438l608M1192Q615n218m9543j22604
24047e6015j9037k2560o0139N6032R3466n204O508M4574m6702p9971j3581Q010
24035i4619k7200M8922K0053k0739P2967k4736j29787j6836N7598l0299K6211
24024a18465P0446o974J3540L4543M4309O7746o7347n6741M6827n8736M795R0349
24012F4292L2803K0834p2153j07266n4488L3069J5635o434L3711J35136M784j97737
$$ plain form
24095 113912 146977 62654 36397 86846 128082 125792 78132 -2443 -80364 -15375 -4103 -3893
24083 -3893 -7650 -32956 -99183 -61517 -18974 28185 110535 105149 55274 71701 116963 97278
24071 97278 85813 47505 354 38289 101373 128930 45504 -30917 -92358 -67210 -56724 -1140
24059 -1140 34712 -23534 -48848 -51484 -13287 75151 71543 112735 121350 116132 66589 -56015
24047 -56015 -75052 -97612 -157751 -101719 -8253 -13457 -6949 37625 -9077 -89048 -102629 -94619
24035 -94619 -121819 -72897 -52844 -73583 -616 -25352 -155139 -171975 -114377 -144676 -118465
24024 -118465 -48019 -54993 -41453 -6910 37399 105145 37798 -18943 27884 -30852 -26057 64292
24012 64292 97095 117929 45776 -61490 -115978 -82909 -67274 -73708 -39997 95139 99923 -97814
24000i7814o4406N7946L6167K5780Q3919L8239l947m5866j05843N4010R6665M6627
23988A21477r730p6401L7398k4537j3681o8855p9821o6628k5997N4674J19620
23977c2481P8295J3516K7574n2618l2015R019L1358O564P1449l7112J1234J7826
23965A12609J9671n7234j9504N6467M3934p3124p6221q7927L2266O8229Q1474
23954A00640J8513j30358j26394N7530R8651K3641K5076R79L4038O3436J9349
23943A85101p8823q5788o7121K0483N9609M716j07085m4938L8412Q8664J18735
23932A31965N9071j5851l2877n8805l6323n4986K9158j3523J5764K0672j9443
23921B4822l5021n0967N5902l3999n9590k0353P0046M5907M9580R5315J3921o7627
$$ plain form
24000 -97814 -162220 -104274 -68107 -42327 41592 79831 75884 30018 -75825 -21815 74850 121477
23988 121477 111747 35346 72744 48207 34526 -34329 -114150 -180778 -206775 -152101 -32481
23977 -32481 45814 59330 86904 34286 2271 11290 42648 49212 120661 83549 94783 112609
23965 112609 132280 75046 55542 112009 155943 82819 6598 -81329 -49063 19166 100640
23954 100640 119153 -11205 -137599 -80069 18582 42223 67299 68278 102316 165752 185101
23943 185101 106278 20490 -46631 -26148 33461 38177 -68908 -113846 -75434 13230 131965
23932 131965 191036 175185 142308 83503 47180 -7806 21352 7829 23593 44265 24822
23921 24822 -10199 -61166 -5264 -39263 -98853 -119206 -49160 -3253 46327 141642 155563 87936
23909H7936j9622j7737P494l810j7267j7866J9835l5899l3158P8106n9193j01435
23897a12616M3263k994m905p453o4635N8732K2355l847n5485k1669q742q84R2440
23884f6440O4963K1212j05090l1121R0743Q027q9316j5552K9432J8561M0654L8368
23872D441R6147m59o7438o0265M6340m5584J5310J5064M1344M212K7248n4631
23860B1729l7852K0602o358o990Q083J33810l3744k9135Q6289o8222j46906J3177
23848d5517J57827P493J9413K2308J13228L6968k9752j11142p5435r4217m2818
23837d1644P3809M9356J569m7571q494N0628k9313m8660J6466l3935n899P3542
23825D9854n7922j04526o2336k4601J48759J10078M4365k7970n279N2515L7009
$$ plain form
23909 87936 68314 50577 58071 54261 36994 19128 38963 3064 -30094 48012 -11181 -112616
23897 -112616 -69353 -72347 -77252 -84705 -149340 -90608 -68253 -72100 -127585 -149254 -157996 -158880 -66440
23884 -66440 -1477 19735 -85355 -116476 -25733 -17706 -107022 -122574 -93142 -74581 -33927 4441
23872 4441 100588 100129 32691 -27574 18766 -26818 -11508 3556 44900 49112 76360 21729
23860 21729 -16123 4479 -1879 -8869 -786 133024 99280 70145 156434 88212 -58694 -45517
23848 -45517 112310 119803 139216 161524 274752 311720 281968 170826 95391 1174 -41644
23837 -41644 32165 81521 83090 35519 27025 77653 48340 -320 16146 -17789 -23688 49854
23825 49854 -8068 -112594 -174930 -199531 -50772 59306 103671 75701 70422 122937 159946
23814A59946m7588r8936o3008N3768L4879m64n2587O127O218l6433l3906j3793
23802h5777P68j599L6135M3785j0512l4862n35L7161l8922n5128K1590M0007J2722
23789c5167Q2545N120N4874L4182J2874P237j27330q9600j40243L7452J70405
23778A2349P2220m3956k4121N352R0874o3076o3122n1391k5046N0415O5925J9394
23766D5817N1140n6357M5144j6750q8525m6149O0916L0781l1555N811L9494n7212
23754a7445r575k4571m6849M9961j8778l7941m5792o8475J00331J92202P6054
23743A49122M8310p2237J7933q51r5704q5576L3481m2715k2419L1338N6974Q4073
23731A01729J2026j5358o6611m4501k2935o220P6984N1782p3834L370J17898o3318
$$ plain form
23814 159946 112358 13422 -49586 4182 39061 38597 -13990 -7863 -1645 -38078 -71984 -85777
23802 -85777 -85009 -86608 -50473 -6688 -17200 -52062 -52597 -15436 -54358 -109486 -87896 -47889 -35167
23789 -35167 47378 52498 107372 141554 154428 161665 34335 -55265 -195508 -158056 12349
23778 12349 84569 40613 16492 21844 112718 49642 -13480 -64871 -89917 -39502 26423 45817
23766 45817 96957 40600 85744 68994 -19531 -65680 -4764 26017 -5538 273 39767 -17445
23754 -17445 -27020 -51591 -98440 -48479 -67257 -105198 -150990 -219465 -119134 73068 149122
23743 149122 197432 125195 143128 142277 46573 -39003 -5522 -48237 -70656 -39318 17656 101729
23731 101729 113755 98397 31786 -12715 -35650 -41870 35114 86896 13062 16432 134330 71012
23719G1012j06854j5550P1021Q5282o7094o6853Q3715K7911n2146r0922L529K6333
23707c0616k8229k6775q886p4816o6498L0528Q5065J10168L0749o0049L1449K8551
23695B0641j1928j1178n0481n3093r68N6150Q8090o7228n374J9484m6139j07830
23683a69854Q319J44704J16500l5612q6542k339K5516p9657j572r415L7472J1628
23671d0852j6863k2930k3062J7117J7764Q375N986N4494J7540o1689n251L738
23659d5633p5920k3298m1431j02194R430O4935Q8238Q2311P9164n6234o8846N775
23647h3703O8020Q4310M214j7360k8837o1915J8038O7466L7208m4462k1197j3463
23635H319m3230J7157l6102O994O9154n7847K519j1694p5134l1806R8660K6617
$$ plain form
23719 71012 -35842 -51392 19629 104911 37817 -29036 54679 82590 30444 -60478 -56949 -30616
23707 -30616 -58845 -85620 -94506 -169322 -235820 -205292 -120227 -10059 20690 -39359 -7910 20641
23695 20641 8713 -2465 -52946 -106039 -107007 -50857 37233 -29995 -35369 -15885 -62024 -169854
23683 -169854 -161535 -16831 99669 64057 -22485 -24824 692 -78965 -80537 -89952 -52480 -40852
23671 -40852 -57715 -80645 -103707 -86590 -68826 -60451 -54465 29 17569 -44120 -49371 -45633
23659 -45633 -121553 -144851 -186282 -288476 -279046 -214111 -125873 -43562 35602 -20632 -89478 -83703
23647 -83703 -15683 68627 72841 55481 26644 -35271 -17233 50233 87441 42979 21782 8319
23635 8319 -34911 -17754 -53856 -46862 22292 -35555 -33036 -44730 -119864 -151670 -53010 -26393
23623b6393l4456J6375K9053k4821K2520M9691P283k5597l9493q3588p143l0137
23611a46706m7002O268M4908k699o081P7785O5438L0422N6776L286q6531K942
23599a194K6678m0052k1450k8395r096L524p3164K0680J4478O402K0118Q3739
23587B268N054M8708n2603r538P7124M2283p6543J5418M2947m4442L6646N6185
23575A43507q8596l7369j7888n4238r4559N7959K072m1213k8867N9180O672m5633
23563a38973N86M6107q719k0380k2056O0369M9655p708K6714L5042J00779l1522
23551H9894n1014p1873m7745K1586P9338l7569o0358L6844M7420R5516K5857q3026
23539D4870o6755j760Q929k5636m5420L9613k3842M1583M5396J8803L3972K0277
$$ plain form
23623 -26393 -60849 -44474 -15421 -40242 -17722 31969 39252 13655 -25838 -109426 -116569 -146706
23611 -146706 -193708 -187440 -142532 -145231 -151312 -73527 -8089 22333 79109 82395 -4136 -1194
23599 -1194 25484 -14568 -36018 -64413 -73509 -69985 -143149 -122469 -107991 -101589 -81471 2268
23587 2268 7322 56030 3427 -6111 71013 113296 36753 52171 95118 50676 87322 143507
23575 143507 54911 17542 -346 -54584 -149143 -91184 -89112 -130325 -159192 -100012 -93340 -138973
23563 -138973 -138387 -92280 -100999 -121379 -143435 -83066 -33411 -41119 -14405 20637 121416 89894
23551 89894 38880 -32993 -80738 -59152 20186 -17383 -77741 -40897 6523 102039 127896 44870
23539 44870 -21885 -23645 -14716 -40352 -85772 -46159 -70001 -28418 16978 35781 69753 90030
23527I0030p3786n5248M3831P0889o732l7513j1571l1741L9001j6024M3428K9894
23515H4458K9490j5298p5945o7779J2398k6101p603n7917l3765N1169J1826J3135
23503h1932N2217N1426j5662M6150K8493o5314j8295q7181m3412K7428P4043L1245
23491g94L2424K9815n89j5012p658L9694j5817P778J8807J1143r8311J8593N7879
23478G7952m4825l2841K3332R8084P0524p3789j34892j06040N2768O0804j5522
23467b4445j7320j0247P2565k6489l018j8761L627j8601K3514M9847M694J9210
23455E4576K4815l3881k4305k7098K4291n0192m3479m5805J0954J5753J2671K4618
23443e7082m8626J390Q4354J02824J125m8960o7010j5784n831N9696L9906J6622
$$ plain form
23527 90030 16244 -39004 4827 75716 68984 31471 19900 -11841 27160 11136 54564 84458
23515 84458 113948 98650 22705 -45074 -32676 -58777 -66380 -124297 -158062 -106893 -95067 -81932
23503 -81932 -29715 21711 6049 52199 80692 15378 -2917 -90098 -133510 -106082 -32039 -794
23491 -794 31630 61445 60856 45844 38186 77880 62063 69841 88648 99791 1480 20073 77952
23478 77952 33127 286 23618 121702 192226 118437 -16455 -122495 -69727 -8923 -24445
23467 -24445 -41765 -52012 20553 -5936 -8954 -27715 -24088 -42689 -19175 30672 35366 54576
23455 54576 79391 45510 21205 -5893 18398 -31794 -75273 -121078 -110124 -94371 -81700 -57082
23443 -57082 -105708 -104318 -19964 82860 83985 35025 -31985 -47769 -53600 6096 46002 62624
23431F2624K8593m7029j8691l5193n6461J20745L2281p2554K2322J2076K5723
23420G4436o0978m3272J5226J1012L6228j6739j2750p0511o4856K8195N4318N3954
23408D263m2488l9439r1056r1865K0210J28684J52556L5174M5810o1529K7761
23397H8081J0480o0726q1137k3465P4424Q7399m6197r8402l08N6988k3356j6215
23385c2434L0074J990O642n8915P418M0775J7588k8741L249R16P3J4531j5819
23372a2653k386n8236n7344M2647O3477J12720N3645J6922M8449o3150j8217l1427
23360I4447o9297j0247k914j7395O6571N2051j0584j19958k3928J1137Q1605J11667
23348A63155n1445n8219k7644L368n0445j2049j3188j4799R8940J8732p6005K7650
$$ plain form
23431 62624 91217 44188 25497 -9696 -66157 54588 86869 14315 36637 48713 74436
23420 74436 13458 -29814 -14588 -3576 32652 15913 3163 -67348 -132204 -104009 -49691 4263
23408 4263 -38225 -77664 -168720 -260585 -240375 -111691 40865 76039 121849 60320 88081
23397 88081 98561 37835 -43302 -66767 7657 95056 48859 -49543 -49851 7137 -16219 -32434
23385 -32434 -2360 -370 6272 -52643 -45225 -4450 13138 -15603 -12354 -11438 -11365 3166 -12653
23372 -12653 -15039 -73275 -130619 -87972 -24495 88225 141870 158792 207241 144091 125874 94447
23360 94447 25150 14903 11989 -5406 61165 113216 102632 -17326 -41254 -30117 51488 163155
23348 163155 111710 53491 25847 29215 -21230 -33279 -46467 -61266 37674 56406 -19599 8051
23336H051L0790n1362j8118K929K7870K8362J9904k5244M7714j205o979k8509
23324C4203k7319Q0639P3352P2340n614j03497o4528j4538J1922n7384j9856M6049
23312B5769k4805K7693n6951p9856j2781k2687J04028o893J0572k7329q4321J801
23300a45760Q5751P185j5400j6688o525N6539N6079n7040r3934M5581J02664N4263
23288G2715o2603p1672k0526J7630Q7534O0204o1626k4430n9794n2225Q5490R9081
23276F9778L283k0261j04199n8977O0182N9414N553L2661N1522n0169l8157K3199
23264C3829M6739l330q9852m2796M9336p508r084l3725p560j1775l2491P4228
23252c3989J24825L453q2128m8102K701J1125n231q6205J5307J05286K8878k057
$$ plain form
23336 8051 38841 -12521 -30639 -27710 160 28522 48426 23182 70896 69691 62712 34203
23324 34203 6884 87523 160875 233215 227601 124104 59576 45038 56960 -424 -20280 25769
23312 25769 964 28657 -28294 -108150 -120931 -143618 -39590 -46483 -35911 -63240 -147561 -145760
23300 -145760 -60009 -52824 -68224 -84912 -91437 -34898 21181 -35859 -129793 -84212 18452 72715
23288 72715 10112 -61560 -82086 -64456 23078 83282 21656 -2774 -62568 -114793 -29303 69778
23276 69778 73061 52800 -51399 -110376 -50194 9220 14773 47434 98956 48787 10630 33829
23264 33829 80568 77238 -12614 -55410 -6074 -13582 -22666 -56391 -63951 -75726 -108217 -33989
23252 -33989 90836 94289 12161 -35941 -33240 -22115 -27346 -113551 -98244 7042 35920 33863
23240C3863r313q1739j0209J9849j533k3128O4697K5497Q148K8850o980k8039
23228A9963k8623J5657R4488L033p0508m2264j6642K1585J0517J6875J7339l5480
23216E940k3495k0684j8279j7222M2244O4641m5913k5693N8482q82K5924L6375
23204H1438p0752l6717k48n160P5463L6221k2274k8436o1520K9705k0331O0151
23192C7540N8495l9908j04009p396O1106m9432n4670j4800M2153K2696L3629J3259
23180a337j5729m0665Q2892M7775J0474o9890k9230q4291j5773O8319k6519q6048
23168a60022M0183J08484k8441m6929P6719m7116J5928M1201M5480m4008q824
23157g345n450l5837q5447o9059O0854Q3984K8989j4800k2358p0164j433K7341
$$ plain form
23240 33863 24550 -57189 -67398 -47549 -49082 -72210 -7513 17984 26132 54982 48002 19963
23228 19963 -8660 6997 101485 104518 34010 -8254 -24896 -3311 7206 24081 41420 5940
23216 5940 -17555 -38239 -56518 -73740 -31496 33145 -12768 -38461 20021 19139 45063 81438
23204 81438 10686 -26031 -26279 -31439 44024 80245 57971 29535 -31985 -2280 -22611 37540
23192 37540 96035 56127 -47882 -55278 5828 -43604 -98274 -113074 -70921 -48225 -14596 -1337
23180 -1337 -17066 -57731 25161 72936 83410 13520 -15710 -100001 -115774 -47455 -73974 -160022
23168 -160022 -119839 -11355 -39796 -86725 -10006 -57122 -41194 7 45487 1479 -7345
23157 -7345 -12795 -48632 -134079 -203138 -142284 -58300 -29311 -44111 -66469 -136633 -138066 -110725
23145a10725l2767k7115p966R6214J03674O5530l6819j4036n3229r1928j9778
23134a28945p077j8754N5808j01064Q4316P3781J15840o1387n2327M9865Q7850
23123I7906j8856L014k5969L730n2789l736J7350j02932p4339J92045J6678j31856
23111g9754N0835L7069l9819k3388j786n413n8068j8475j5177J2958P994K8835
23099a04189P001k3632k4320N8887k8328m1047O3724k0230R912L7304K2107J03351
23087F0540M1580O045L2214k6009q0095p3503L0583K8383o86M4642j94L021J6519
23074H3040K0041N2804j8348k5099K0785Q329r6260n8082l122j4951l8624J5139
23062e4348R339j00769M2630K787p814O3213P272o4379K5656M5482J8348L7839
$$ plain form
23145 -110725 -143492 -170607 -178573 -82359 21315 86845 50026 35990 -17239 -109167 -128945
23134 -128945 -136022 -154776 -98968 -200032 -115716 -41935 73905 12518 -39809 10056 97906
23123 97906 79050 82064 56095 59825 7036 3300 20650 -82282 -156621 35424 52102 -79754
23111 -79754 -28919 8150 -31669 -55057 -56843 -62256 -120324 -138799 -153976 -141018 -133024 -104189
23099 -104189 -97188 -120820 -145140 -86253 -114581 -155628 -91904 -112134 -102222 -64918 -42811 60540
23087 60540 102120 108165 140379 114370 34275 -39228 -8645 19738 19052 63694 63500 66521 83040
23074 83040 103081 155885 137537 112438 133223 141552 45292 -12790 -15912 -30863 -69487 -54348
23062 -54348 -45009 -145778 -103148 -100361 -108175 -44962 -37690 -102069 -76413 -30931 -12583 25256
23050B5256K6884r2271m4072L1116L9549K9897n24r9701n3685J5890M9175m5713
23038a18199l351K4933K1518K5497L1797j851l3466P3341j624j4837m4687p7425
23026a18354m984J25101o624p6706n6420J06285N5893j0030J1840j09455q6596
23015a70050K7293O6170J8012m3943L3606K2590L3686K804o7037o1093J06099
23004c1863J04344n668j02635p879O5276j4777l8412l0533k539p8292J6706l0610
22992a56882K5314N6360O0742o7913m5848m566O5403L7682Q306K3598n3320o2825
22980a13949K5594Q759l8354J7297O7221O418Q0515m2343n4935j5809L3252k6841
22968e3175m480j8703o3803n0770K132M8473O1221L8328l4943l3533J00512M6523
$$ plain form
23050 25256 52140 -40131 -84203 -53087 -13538 16359 15835 -83866 -137551 -121661 -72486 -118199
23038 -118199 -121550 -96617 -75099 -49602 -17805 -19656 -53122 20219 18595 3758 -40929 -118354
23026 -118354 -123338 1763 -4861 -81567 -137987 -31702 24191 14161 26001 -83454 -170050
23015 -170050 -142757 -76587 -58575 -102518 -68912 -46322 -12636 -9832 -76869 -137962 -31863
23004 -31863 72481 66813 -35822 -43701 21575 6798 -31614 -62147 -64686 -142978 -126272 -156882
22992 -156882 -131568 -75208 -14466 -82379 -128227 -132793 -67390 -29708 -21402 2196 -51124 -113949
22980 -113949 -88355 -79596 -117950 -100653 -33432 -27014 53501 11158 -43777 -59586 -26334 -53175
22968 -53175 -57655 -76358 -140161 -190931 -188799 -140326 -79105 -40777 -75720 -109253 -8741 37782
22956C7782j1018L6796N7997J02138m5469m7246o9220j04760J2747M747J727r776
22944c3555k8961K7299J8522M8279M3690K4884p1730j03599k0579O6747k6048
22933e5051J7569M604J8220l8615Q0791R9778k5056m3523j00647o6878l3330Q0795
22921f1343J33683P4846k221m2127o2430j4428J4781l1836M4059o320j1787j3372
22909B1505k3644N3932m2431k7927L0940Q148l2315p7092k199J09213Q4055k4647
22897G7538j472L4565J1194j27035k0057L5092k2435o0796n0490K6116L7908Q546
22885e1326k624o4703j1476O4672K7802J4129j8154J0900k9701k1400M5273j259
22873c7867m1320j494L7522l077m8120O9138P8390M6836L5845N0781j5911q3210
$$ plain form
22956 37782 26764 63560 121557 223695 178226 130980 61760 -43000 -30253 -25506 -23779 -33555
22944 -33555 -62516 -35217 -16695 31584 75274 100158 28428 -75171 -95750 -29003 -55051
22933 -55051 -37482 -32878 -14658 -53273 27518 127296 102240 58717 -41930 -108808 -142138 -61343
22921 -61343 72340 147186 144965 102838 40408 25980 40761 8925 52984 46664 34877 21505
22909 21505 -2139 51793 9362 -18565 12375 20523 -11792 -88884 -91083 18130 102185 77538
22897 77538 76066 110631 121825 -5210 -25267 9825 -12610 -73406 -123896 -97780 -59872 -51326
22885 -51326 -53950 -118653 -130129 -65457 -37655 -23526 -41680 -30780 -60481 -81881 -36608 -37867
22873 -37867 -79187 -80681 -43159 -46236 -94356 -25218 53172 100008 135853 186634 170723 87513
22861H7513r5057p5864Q5078M9622n5422k6165j157j704J7246J3359m6445j24242
22849a73238q8261L0220Q5302N7631J0597N7959L546L5474n152j1206M1383k3215
22837B1040o8909M9577M2168N6605M6828p0924q5142J3102k6698l5543J9198K8414
22825a0284O1393K1751k2879J6003j1441O1094j7264j04154j6367J7905k7579
22814c1822k067l2985L0373O1449J7246j0211j8896m253k7871p0201N8945j3032
22802d3325p1383j0753K0288j4498O8055P2765K0038j2784l9301L4932M9174j4763
22790E8445j00741m8618M8520Q7013P2537j5708j5924l736l2537m2133k3629j1816
22778b8327k9277p8223n082R7722R0871k7119k5610Q3914L3035M5896p3591j5417
$$ plain form
22861 87513 -7544 -83408 1670 51292 -4130 -30295 -31452 -33156 -15910 -2551 -48996 -173238
22849 -173238 -261499 -231279 -145977 -88346 -77749 -19790 -16244 19230 14078 2872 44255 21040
22837 21040 -47869 1708 43876 100481 147309 76385 -8757 4345 -22353 -57896 -38698 -10284
22825 -10284 51109 72860 49981 65984 54543 115637 98373 -5781 -22148 -4243 -31822
22814 -31822 -33889 -66874 -36501 24948 42194 31983 13087 8834 -19037 -89238 -30293 -43325
22802 -43325 -114708 -125461 -105173 -119671 -51616 21149 41187 28403 -10898 24034 73208 58445
22790 58445 -42296 -90914 -42394 44619 117156 101448 85524 81788 49251 7118 -16511 -28327
22778 -28327 -57604 -135827 -140909 -43187 47684 20565 -5045 78869 111904 157800 84209 68792
22766F8792l7141n3198k5369l3889L8850R6504n6675p1115r203K7010m5020q238
22754a08692N6740O1268L3764P047k0398L5534m6290r405K365m7941r1376N650
22742a21734J34138N0740K6708K5875n6427j01959M3144J33163K3681j37o2074
22731I5118o9112m9475K5974O3090l5834l88n1216P784J7034j3637J203K7915
22719A8456n346q9038k1382Q1338n1965m6335J3048J2102K9585j4302j684L8838
22707c6685Q7910p562k6495n1585q604K0096l4885k7421M1297N8193k6608m7080
22695e9429M3757Q7537J0851L6814j4143j3359j8471L2669J1826j55343K9043
22684h248M0080j425l5698o9041L1216R8525K1265o5817J2293K9895o3401R499
$$ plain form
22766 68792 31651 -21547 -46916 -80805 -41955 54549 -2126 -73241 -82444 -55434 -100454 -108692
22754 -108692 -51952 9316 43080 50127 29729 65263 18973 9568 11933 -36008 -127384 -121734
22742 -121734 12404 63144 89852 115727 59300 -42659 485 133648 157329 157192 95118
22731 95118 26006 -23469 2505 65595 29761 29373 -21843 -14059 2975 -10662 -9459 18456
22719 18456 13110 -75928 -97310 -15972 -67937 -114272 -101224 -89122 -59537 -73839 -75523 -36685
22707 -36685 51225 43663 17168 -34417 -43021 -22925 -57810 -85231 -43934 14259 -12349 -59429
22695 -59429 -15672 71865 82716 119530 105387 92028 73557 106226 118052 -37291 -8248
22684 -8248 31832 30407 -5291 -74332 -43116 55409 76674 10857 23150 53045 -10356 -857
22672h57K7903L9486q5755M6432K201l1104J5043j7758p1848n6338M9959K6788
22660e5848O997K9449Q9831O3295j47417q5395K6252p4470N1097P5852J033l4490
22648e3814J2452r845j1944L9579l0389k9187L0526O5514M8962r9562q1594N3567
22636f5735k8744o8746l2204Q512L4862J07696j5186k1487k6453k3516j2211P1755
22624g1457J0744N8817r182j5580m2828L728M6460O7869O4562q9544p2532K764
22612d6179L9044K5397o1807j9645K3257O3567K2773o8138o2736O901O867Q3136
22600A2437j5775p8623r328J15149L1503m1233p0469j8949L8820M6236m7469N009
22588c2692Q006R55J189J3745K4770K0616j680L3154K5017J1827m2801o2150o1479
$$ plain form
22672 -857 27046 66532 -19223 27209 29410 -1694 13349 -4409 -76257 -132595 -82636 -55848
22660 -55848 -48851 -19402 70429 133724 -13693 -99088 -72836 -147306 -96209 -20357 -19324 -53814
22648 -53814 -41362 -51207 -63151 -23572 -53961 -83148 -52622 12892 61854 -37708 -119302 -65735
22636 -65735 -94479 -163225 -195429 -186917 -152055 -44359 -59545 -81032 -107485 -131001 -143212 -71457
22624 -71457 -60713 -1896 -11078 -26658 -69486 -65758 -19298 48571 113133 23589 -48943 -46179
22612 -46179 -7135 18262 -43545 -63190 -39933 23634 46407 -21731 -84467 -77566 -70699 12437
22600 12437 -3338 -81961 -91289 23860 55363 14130 -56339 -75288 -36468 9768 -37701 -32692
22588 -32692 -24686 -23731 -22542 -8797 15973 36589 34909 68063 93080 104907 62106 -44 -61523
22575f1523j6730M0744j8943M3174j8547m0966N8186R5911j3079p5585Q3636j0319
22563F5959r8343q4394m2595N9603P3136J9550k5502k46m6444q759M0053J9925
22551b8057o8003m534Q530J29573P96r0353j7582R3074L2227N9638P3453k4644
22539A64118j96856n2908l5886n1783J211Q7349L5433N014j9268M2023K8951Q1066
22527H8464l5737o2938k4062K3724O0515J1183J6457o0499m1053k1890l805m3264
22515i2905L5910L9190o478k0172p1512j6L8423m4630N0480m6433M748P2741p4089
22502a14743l1686K8499J04889J01856Q2668M274n4821O186L0451Q0183j964j56178
22490G9614p4986P01P2143j34422q3257O7302K7834L685m0616K2993M860K7831
$$ plain form
22575 -61523 -78253 -37509 -56452 -13278 -31825 -72791 -14605 81306 68227 -7358 76278 65959
22563 65959 -32384 -116778 -159373 -99770 -26634 -7084 -32586 -32832 -79276 -88035 -47982 -28057
22551 -28057 -96060 -100594 -92064 37509 38305 -52048 -69630 23444 55671 115309 188762 164118
22539 164118 -32738 -85646 -121532 -173315 -172104 -84755 -49322 -44308 -63576 -21553 7398 88464
22527 88464 52727 -10211 -34273 -10549 49966 61149 77606 17107 -23946 -45836 -49641 -92905
22515 -92905 -56995 -17805 -24283 -44455 -115967 -115983 -77560 -122190 -71710 -118143 -113395 -40654 -114743
22502 -114743 -146429 -117930 -13041 88815 171483 175757 120936 127122 157573 237756 235792 79614
22490 79614 4628 5329 77472 -56950 -140207 -72905 -45071 -41386 -82002 -59009 -54149 -26318
22478b6318k892L9075n692j0139m934N1668L1531k4587J8664P6371p0644o8372
22466C731R9606l4315l3406j0503o2127J16631Q2496j09906l1277p8597k938r325
22454f9930K3183O6312N0969M4032N991n8330N4010m5514j51820o7568k3415P2424
22442i9656l8215o1289J868N3201O3054L0440K5624L969L2548j143j5778j8430
22430b3807J5119N6915K9373j00187j1705L5191k943o7450K9567o4012k8783L7733
22418i4989O1134Q1217l4433l6419j6077N0727O7882m2459k5017k9733N006Q0821
22406F7660L5191M3481k1976n8429o9878J9911k3789R808O4256J8736l3096n0725
22394A150m1477l7862J7845J07818K5010J9256j9802N2110j7797j4619o1867j079
$$ plain form
22478 -26318 -29210 9865 4173 -5966 -10900 40768 72299 47712 66376 142747 72103 3731
22466 3731 103337 69022 35616 25113 -37014 79617 162113 52207 20930 -57667 -60605 -69930
22454 -69930 -46747 19565 70534 114566 120557 62227 116237 70723 -81097 -148665 -172080 -99656
22442 -99656 -137871 -199160 -197292 -144091 -81037 -50597 -24973 -21004 11544 10401 -5377 -23807
22430 -23807 -8688 48227 77600 -22587 -34292 899 -2044 -69494 -39927 -103939 -132722 -94989
22418 -94989 -33855 47362 12929 -23490 -39567 11160 79042 36583 11566 -18167 -13161 67660
22406 67660 102851 146332 124356 65927 -3951 15960 -7829 1979 66235 84971 51875 1150
22394 1150 -40327 -78189 -60344 47474 72484 91740 71938 124048 106251 91632 29765 28686
22382B8686l0518L6271k1008N000r969l8070J2694M3137J3832k1806p515L6093
22370D6827K453n3068Q7687k8128o9859P048K1810j0062O0704Q670j1995J7006
22358G9093p7321J07216M2281p2283m9027q6070p9857R8466J28048O5537M378
22347A60461n0327R570K6484o0614q9010j1870K2o8846j3533P3789Q2598j6864
22335D1860o868q4786j5862K3423K9315O1036m675L6340l3453o7514N177p8352
22323i4359l4775M3561O3114R1440k4806j9922m0786j3097K2624L2219j2397k4776
22311a1960J7754Q0710l4057p2156n5661Q764L8676L3858k8672O7885K7614M6906
22299A19661m6394K6061P4685N5486N9079r229n9432q0298j19952L846j0777l6685
$$ plain form
22382 28686 -1832 34439 13431 18431 8462 -29608 -16914 26223 40055 18249 10734 46827
22370 46827 49280 -3788 83899 55771 -14088 -7040 14770 4708 65412 74082 62087 79093
22358 79093 1772 108988 151269 78986 29959 -56111 -135968 -37502 90546 156083 160461
22347 160461 110134 119704 146188 85574 -3436 -15306 -15284 -84130 -97663 -23874 58724 41860
22335 41860 34992 -49794 -65656 -42233 -12918 48118 43443 79783 46330 -21184 -16007 -94359
22323 -94359 -129134 -85573 -22459 68981 44175 24253 -16533 -29630 -7006 25213 12816 -11960
22311 -11960 5794 86504 52447 -19709 -75370 -66606 -27930 5928 -22744 45141 72755 119661
22299 119661 73267 99328 174013 229499 288578 279349 219917 139619 19667 23513 12736 -23949
22287b3949J7732N7853m3781k2826L0152P1n4119k8894O8272L3407n7390K1780
22275a692L4621n4175j7509j8462L8503Q6049K0172K0055l7737p8743j1530R3063
22263G2615L4928q6202m8871n6755j4519J07758Q6797q4997l6376M4315p916p0634
22251e9857J1003K6785l3826o5956p371M4783O1131M6128k9655J9779q0916M2539
22239b5433O3148m341p1978M2613J12022k322r7739q187K5043k3248K3451K103
22227C5132l3247K80J3487N127q462O778m8404k6765j0629K242n6190k0724M1031
22214a00344K4561N3051P961r745o6996k3482K01061J71629K05p5225l1122J3461
22202A65015m0845q5462m7726k7667m6759M4708O4489N7284P527l7402m8244k9736
$$ plain form
22287 -23949 -6217 51636 7855 -14971 15181 15252 -38867 -67761 511 33918 -23472 -1692
22275 -1692 32929 -21246 -38755 -57217 -18714 67335 87507 107562 69825 -8918 -20448 72615
22263 72615 107543 21341 -27530 -84285 -98804 8954 95751 10754 -25622 18693 10777 -59857
22251 -59857 -48854 -22069 -55895 -121851 -129222 -84439 -23308 22820 -6835 12944 -67972 -25433
22239 -25433 37715 33374 -38604 4009 116031 113709 15970 7783 32826 9578 33029 35132
22227 35132 1885 2165 15652 20779 12317 19095 -29309 -56074 -66703 -64461 -120651 -141375 -100344
22214 -100344 -75783 -22732 -14771 -24516 -91512 -114994 86067 257696 257901 182676 151554 165015
22202 165015 124170 38708 -9018 -36685 -83444 -38736 25753 83037 90564 53162 4918 -24818
22190b4818J9551l2141k946j8579O6137M5390K5042O606O656J4428P3637m6905
22178A32058l1090r191k2008o5496j32674l7337N6263M5548j1388O4318L541n5809
22166f3265o2242j2469L7180n930n2M271M8495O5813M2302m2840l0790j3769N2403
22153A9107l6649n5838K1487K3163l1748K5534k0870N7907P053j9840m0214P0974
22141B0066Q3452j347K0058K0044j23717m5810L2165l3716M4876J8330J1359n8878
22129a3118p7788M4815Q0067Q0659l7916n6217q0507O0245P7469l1943k2893k5259
22117b386l1476j6119K3276l1461j12091p8731N0257R0008N8766K178K4696J4435
22105h648J7308k1715m783m2191J2879p6574N0680K9971k6638O3001J37173N0152
$$ plain form
22190 -24818 -5267 -37408 -40354 -58933 7204 52594 77636 84242 90898 105326 178963 132058
22178 132058 100968 91777 69769 4273 -128401 -165738 -109475 -63927 -75315 -10997 -7456 -63265
22166 -63265 -125507 -137976 -100796 -106726 -106778 -102507 -54012 11801 54103 11263 -19527 -33296 19107
22153 19107 -17542 -73380 -51893 -28730 -60478 -34944 -55814 2093 9146 -10694 -50908 20066
22141 20066 103518 102171 122229 142273 18556 -27254 4911 -28805 16071 34401 45760 -13118
22129 -13118 -90906 -46091 33976 114635 76719 20502 -60005 240 77709 45766 22873 -2386
22117 -2386 -33862 -49981 -26705 -58166 -170257 -248988 -198731 -108723 -49957 -47779 -23083 -8648
22105 -8648 8660 -13055 -17838 -60029 -47150 -123724 -73044 -43073 -69711 -6710 130463 180615
22093A80615o5520q7025m2591r1937n9839K9870J38306O2107l4884j9438J3884
22082B3548M7132l5902p3336o0536m2822o735N4349M959n839Q9275J00495m2882
22070E1706j29168l0454O8023n4441J8948J39373R2282j0487o4980j12941o1564
22059i3703N2784j7365l6329k846l8920l2781q176M8127Q2875O6634M1958L2099
22047I4357q83j075k7343J3617o6117m165O5851L4595q4838j4061j4116m0428
22035d4606K6966J921o1011j4629N437o2508M4006Q0092j4851l6744Q3603J771
22023I447k9996j3991m2809n8060J6019M6316N7125L2048j9847Q018n218r4855
22011i5803J526N6007N1067N4932K0046k9810J344k3901N727J0754m9475p3435
$$ plain form
22093 180615 115095 28070 -14521 -106458 -166297 -136427 1879 63986 29102 9664 23548
22082 23548 70680 34778 -38558 -99094 -141916 -148651 -94302 -89343 -95182 -5907 94588 51706
22070 51706 -77462 -107916 -39893 -94334 -75386 63987 156269 145782 80802 -32139 -93703
22059 -93703 -40919 -58284 -94613 -97459 -136379 -169160 -177336 -129209 -46334 20300 62258 94357
22047 94357 93474 92399 65056 78673 12556 8391 74242 108837 23999 9938 -4178 -44606
22035 -44606 -17640 -15719 -76730 -91359 -85922 -148430 -104424 -24332 -39183 -75927 7676 9447
22023 9447 -20549 -34540 -77349 -135409 -119390 -73074 -15949 16099 -3748 4270 -948 -95803
22011 -95803 -94277 -38270 12797 67729 87775 57965 59309 35408 41135 51889 2414 -71021
21999g1021Q4250j4385l9115L576M4288l3211q2244m1379N705K6574R7892J12537
21987I3467j0877p3306p2788n7014O936R5182O6824J2967l8627l6556j8690J6962
21975a5520Q5592N744N3175j4207o848p207l4243m2707j20478N5777J36645l8072
21963E7651n7069r340N549M1158o7491N7602N5081j08883r34M9376n0255m9702
21951g7257P5455j0051j8363M2386J1364q5742L5543L7360j4453q0300k0637J3064
21939i1631M9826J61462L7450O215J1423k6695k2931m1690r4906J1078L5644j9712
21927A5533M1410P4219j2648p1316j2337N0379l6384m2731K1316R01P4347J0852
21915A13541m2834j2386M9198j2188k6192r8717k9573J8913L1097L2310O9487
$$ plain form
21999 -71021 13229 -1156 -40271 -36695 7593 -25618 -107862 -149241 -143536 -116962 -19070 93467
21987 93467 82590 9284 -63504 -120518 -113582 -18400 48424 61391 22764 -13792 -32482 -15520
21975 -15520 70072 75816 128991 114784 107936 100729 66486 23779 -96699 -40922 95723 57651
21963 57651 582 -8758 -3209 37949 -29542 28060 83141 -25742 -26676 22700 -27555 -77257
21951 -77257 -1802 -11853 -30216 12170 23534 -62208 -26665 10695 -3758 -84058 -104695 -91631
21939 -91631 -41805 119657 157107 163322 174745 148050 125119 83429 -11477 -399 35245 15533
21927 15533 56943 131162 118514 47198 34861 85240 48856 6125 27441 28342 102689 113541
21915 113541 70707 58321 107519 95331 69139 -29578 -59151 -40238 -9141 23169 92656
21904I2656N5827r7300n2265P950m5046Q985k5245M1877p5670j25183P0631L9618
21892a03165Q924k8662K3459k1681K480K5733J6803L2784P590q0753o4678O6266
21880a14900J06625j7039m1908l3930k7951O4549M8562m3702j19213M8712J17002
21869a3193J9603n1637j11695o699N2757k636Q4269N9053j2940N3262k1068l0799
21857A8277l1593k7844k7671L1282j6406Q206P6656L716p3542o951K7644n6466
21845g4692o1817N9300O8723J2646N3424K4867n7644l1164L8990O9455r4485r9717
21833i2114j1218n1387l8817J5701N8142M7075J6052q3693o3367M3507M7593m0064
21821a52590J6739J4936J143N7494M6338O371l5833P78l9530o5471n2494K5470
$$ plain form
21904 92656 148483 51183 -1082 6868 -38178 -29193 -54438 -12561 -88231 -213414 -142783 -103165
21892 -103165 -94241 -122903 -99444 -121125 -118645 -92912 -76109 -43325 -35735 -116488 -181166 -114900
21880 -114900 -8275 -25314 -67222 -101152 -129103 -64554 -15992 -59694 -178907 -130195 -13193
21869 -13193 6410 -45227 -156922 -163621 -110864 -113500 -29231 29822 16882 70144 49076 18277
21857 18277 -13316 -41160 -68831 -37549 -53955 -45749 30907 34623 -38919 -45870 -18226 -74692
21845 -74692 -136509 -77209 -8486 4160 57584 82451 24807 -6357 32633 102088 7603 -92114
21833 -92114 -103332 -154719 -193536 -177835 -119693 -72618 -56566 -140259 -203626 -160119 -112526 -152590
21821 -152590 -135851 -120915 -119772 -62278 -15940 -9569 -45402 -44624 -84154 -149625 -202119 -176649
21809a76649N8855k8882J4525R756K8516j7259N022m9447j2264L7612j3297L5283
21797a08229N1083L5967J9018K8360N6806J2881p1502m4460Q8373m0754q3422
21786e5879R138P0438R6823L4074l4962n5630p5065r103M3064r103J8913L5565
21774F8273N9775k8347r2628O040N278m7877J9680p066o571p6660n8041j0732
21762a68876K9729O2880L8775m1781R2695N7838o92N1909j5575k9287K202p731
21750G2086L5228n5793o5624k7761M605j9049j2523K2794n0417k9705O4534Q5659
21738B4034L3079r253n65J2270J0494N7402k5790k4754J5611p975n0824l3660
21726F9J31611O7329J1164r8661r8870j22875M040j6448L0759L3963K1304Q29
$$ plain form
21809 -176649 -117794 -146676 -132151 -122395 -93879 -111138 -106116 -155563 -167827 -130215 -143512 -108229
21797 -108229 -57146 -21179 -2161 26199 83005 95886 24384 -20076 68297 27543 -55879
21786 -55879 -46741 23697 120520 154594 119632 64002 -11063 -20166 22898 13795 32708 68273
21774 68273 128048 99701 7073 13113 18391 -29486 -9806 -16872 -23443 -100103 -158144 -168876
21762 -168876 -139147 -76267 -37492 -79273 13422 71260 70568 122477 106902 77615 79817 72086
21750 72086 107314 51521 -14103 -41864 -37259 -56308 -68831 -46037 -96454 -126159 -61625 24034
21738 24034 57113 47860 47295 59565 70059 127461 101671 76917 92528 84553 33729 69
21726 69 131680 199009 210173 111512 12642 -110233 -106193 -122641 -91882 -57919 -36615 -35786
21714c5786J7967K5541o4366L9391j4061m0968O8760K1026K000k4878O859L2819
21702C4304N0259J4132R8804o835p3577o4613p2422k3763K5018k4251n4136n0244
21690a47324k5327J5936L2323k7494N4819J32178M6037K6657r558j5571l563j5113
21678F4000k4680N8653m6236l1344n326K8036n7567j6045J2354O4054K239M7611
21666I5749l3435o921m0260M9681k7557m3958m6516r6801o1171P120J09233J36322
21654D1486K8946k4435j4998o6207j6985N8928n388j6258N8736j6764k966j4304
21642I791K0698J1605Q8715l9031n6886n4465J1468l5295q3894M2003P0603k3498
21630c8186O75M4532J05200L3898j01024M0956L8568K5053m4467n5583j5863j1098
$$ plain form
21714 -35786 -17819 7722 -56644 -17253 -31314 -72282 -3522 17504 19504 -5374 1485 34304
21702 34304 84563 98695 197499 190664 117087 52474 -19948 -43711 -18693 -42944 -97080 -147324
21690 -147324 -172651 -156715 -124392 -151886 -97067 35111 81148 107805 98247 82676 79113 64000
21678 64000 39320 97973 51737 20393 15067 43103 -14464 -30509 -18155 45899 48138 95749
21666 95749 62314 55393 15133 64814 37257 -6701 -53217 -150018 -211189 -204069 -94836 41486
21654 41486 70432 45997 30999 -35208 -52193 6735 1347 -14911 43825 27061 24095 9791
21642 9791 30489 42094 130809 91778 34892 -19573 -8105 -43400 -127294 -85291 -14688 -38186
21630 -38186 -37511 7021 112221 146119 45095 86051 124619 149672 105205 49622 33759 22661
21618B2661J0131M2995P6217r823j25883p0310j01272M6824J00528r800j5786
21607c3518k6534P0785k5778j3837J0125k2754m3768O8483K8326L69J1109j03270
21595h0262q516J9051N9491K4717p082j7442L0768r8213M5284L7955K8961J8528
21583E3240K1415r6312l1214Q5395Q7310j31253J4512N7907J1076p7105j07643
21572a12672l8185K7790Q1717K3620m5649K873P7908m941r8223n161P8712P9339
21560F7128K0931J2392J2078l7564j15759k8104K9665O8748m7921j1526M5331
21549A5399K3542N3770l2425o9902N331j525J9149M4440k8131K1502L8506p6931
21537A2725o942O1960k0675J145j1451P147p682j6543J2827o7778Q2686o2488
$$ plain form
21618 22661 32792 75787 152004 142181 16298 -54012 -155284 -108460 -7932 -17732 -33518
21607 -33518 -60052 10733 -15045 -28882 -18757 -41511 -85279 -16796 11530 11899 23008 -80262
21595 -80262 -88778 -69727 -10236 14481 7399 -10043 20725 -77488 -32204 5751 34712 53240
21583 53240 74655 -21657 -52871 32524 119834 -11419 3093 61000 72076 -5029 -112672
21572 -112672 -150857 -123067 -41350 -17730 -63379 -60506 17402 12461 -85762 -90923 -12211 67128
21560 67128 88059 100451 112529 74965 -40794 -68898 -39233 29515 -18406 -29932 15399
21549 15399 38941 92711 60286 -9616 -4285 -5810 13339 57779 29648 51150 89656 12725
21537 12725 5783 67743 47068 48213 36762 43909 36227 19684 32511 -35267 47419 -15069
21525a5069m0196J8258k8195m2568M7167N5433M273J5238J15998L3485k2750l9767
21513A01307k1311q7237j7558J09230J4706L6423O041j22924j28392p763J75944
21502E8466P6592n7040j9161o0039K4448O4969L6606k6140k4163q5536j37647
21491a48645l6545L6547L4227L7952M6661n3016k5284R156k4889n9846L4201J30492
21479a8989R5839N1297L6347o6821j4691k4185n9299p5994q0246L008j6850L9840
21467a30744l1292P232Q6556M9549O4649K0641K5298J3670K6362m459r9361o5047
21455c6946p0418k1162R2816M2069M4042o36J176j6307m2685q777L5872j8227
21443H17n7479O815L1696n0026N7297P5141N3980K6786p6747o6701O8229N2326
$$ plain form
21525 -15069 -55265 -37007 -65202 -107770 -60603 -5170 -897 14341 130339 163824 141074 101307
21513 101307 79996 -7241 -24799 84431 99137 135560 141601 18677 -109715 -117478 58466
21502 58466 135058 78018 58857 -1182 23266 88235 124841 98701 74538 -10998 -148645
21491 -148645 -185190 -148643 -114416 -76464 -29803 -82819 -108103 -98947 -123836 -183682 -149481 -18989
21479 -18989 76850 128147 164494 97673 82982 58797 -502 -76496 -156742 -153734 -170584 -130744
21467 -130744 -162036 -154804 -68248 -18699 45950 66591 91889 105559 131921 127462 28101 -36946
21455 -36946 -107364 -128526 -35710 6359 50401 49765 50941 34634 -8051 -16828 19044 817
21443 817 -56662 -49847 -18151 -68177 -10880 64261 118241 145027 68280 1579 69808 122134
21431A22134m1011l7090J2399j3649k5230q3048K0946R8732j099m782j2354J9026
21419E4974K6576n3149J5566R2030j7459K170p460p5610r4410K3913L5433P1581
21407G4155L087N2561k6989l0485j7568q939L2487n300j0272n8990J6976Q5614
21395A06337m47J2621Q1809k1171l1893p046N2285M6517J2106J326m7403p684
21383A97357P4820L6018J15698K16029K50874L32390K92174J85733J01274k0485
21373A781882j32872k04660k77391k07524k52880j26055j02363j26870j01481
21364B49786n9956q0866o5431q8339m7900J10897P3343L038K2577k2507p0178
21353B4464o7354P7184Q3499j7713k0125j2819Q6044J089k8997K08j26531l8084
$$ plain form
21431 122134 81123 44033 56432 42783 17553 -65495 -44549 54183 53084 48302 35948 54974
21419 54974 81550 28401 43967 135997 118538 120708 113248 37638 -56772 -32859 2574 74155
21407 74155 77242 129803 102814 72329 54761 45822 78309 73009 62737 3747 20723 106337
21395 106337 105890 118511 200320 179149 147256 140210 192495 239012 251118 252444 205041 197357
21383 197357 272177 308195 423893 639922 890796 1223186 1515360 1701093 1802367 1781882
21373 1781882 1649010 1444350 1166959 959435 706555 580500 478137 351267 249786
21364 249786 189830 108964 43533 -44806 -92706 18191 91534 94572 117149 94642 24464
21353 24464 -42890 34294 117793 100080 79955 67136 153180 154269 125272 125480 -1051 -39135
21341c9135j7718M3739k2680J6915P9412k3685M1300P3621M3991j5844j6254o8057
21329I5605l8547K5459l7296M5373J7634n0909J197J8328O2033N1931j2938q1263
21317I6607k2358N565l5542J9928k9470l6798M5168J13997O1753p8320L8101L5883
21305B14514l2384N4956J9221n1780q8118n3658j3403l0806p3376o613O993N2127
21293b327N8487n017J9738j9396q4282l8591l1002O0229M0242N7026J0895O2060
21281A28062K1954k6838r2616o3690J1061P5897m6372j6361N9738Q6460J9815
21270A57110k258q2286n7232m2525J1688J0314K1197O684L355P677p7491q767
21258e2534O4863j4898r398n505k4011j02699j0658K7610O588q7768R4093K13517
$$ plain form
21341 -39135 -56853 -13114 -35794 -18879 60533 36848 78148 151769 195760 179916 163662 95605
21329 95605 57058 82517 45221 90594 108228 57319 58516 76844 138877 190808 177870 96607
21317 96607 74249 79814 44272 64200 34730 -2068 43100 157097 218850 140530 178631 214514
21305 214514 182130 237086 256307 204527 116409 62751 49348 18542 -54834 -61447 -54454 -2327
21293 -2327 56160 51143 70881 51485 -32797 -71388 -102390 -42161 -1919 55107 66002 128062
21281 128062 150016 123178 30562 -33128 -22067 53830 7458 -8903 50835 137295 157110
21270 157110 154852 72566 15334 -27191 -15503 -5189 16008 22692 26047 33724 -43767 -52534
21258 -52534 12329 -2569 -11967 -17472 -41483 -144182 -154840 -127230 -120642 -208410 -114317 99200
21246I9200k8880n9150K7129K7551o2353l4646P5211R4059l706j9680L8212q5394
21234F7553l2645m1137N72P2196m1218j15679j1949O3041P4980Q6521k7327p8793
21222A6115K8105Q1857l9529q7489J5231N7652p665K6376p138J895J6408L3642
21210A35460J03908j9755j50073o4495o627m0298L812L0064J958k7816k7295l7826
21198i8983j705K8589J43242k6382n6890j4859L6263O2793P147J7350Q0o9861
21186B6784k9063J644R3962n68k8110l6735j4586M7808K5890k4553p7631j8386
21174c3544N2850N9752n5446R572J841N5576N5026l0416o751j9371q035m1707
21162C9347o1005m7293L2415J29847L6823r0607l9445j9410J8779k6024K0221
$$ plain form
21246 99200 70320 11170 38299 65850 3497 -31149 44062 138121 134415 114735 152947 67553
21234 67553 34908 -6229 -5657 66539 25321 -90358 -102307 -39266 35714 122235 94908 16115
21222 16115 44220 126077 86548 -941 14290 71942 64277 90653 83515 85410 101818 135460
21210 135460 239368 219613 69540 5045 -1582 -41880 -38068 -8004 -6046 -33862 -61157 -98983
21198 -98983 -100688 -72099 71143 44761 -12129 -26988 9275 72068 79215 96565 96645 26784
21186 26784 -2279 -635 93327 92759 64649 27914 13328 61136 87026 62473 -15158 -33544
21174 -33544 19306 79058 23612 33184 35025 90601 145627 115211 108460 89089 81054 39347
21162 39347 -21658 -68951 -36536 93311 130134 39527 82 -19328 -549 -26573 -6352
21151f352L1502j4729M3110O2151P978o1280r9961m212J0658K6958O4106M8923
21139A08852k9766j6502k2735o0226K9115M4098k4741J6284M0664N358M4961N0314
21127A85676k3938n1469P2109J6119k4368k9595m9866j52213k7231o866J17320
21116B5678K032k1340M6055L3210q5982o0882J1481L3635P3739k0133K5237j9131
21104D3599j7004n1892N0283Q3058K3759k8496o7875J10576L0705p3125r3828
21093I760n2117M176J37839M6095q1580M6096J26671m1497p8319l4334R625R0283
21081A82698n8563o4273J0342m3712q0371J4300J24288J08559m0155p0187J1704
21070I4630k8854m2243L5362m8978k3434R9232N9243n6084l6555O5563M3695o5345
$$ plain form
21151 -6352 25150 10421 53531 115682 123660 62380 -37581 -41793 -31135 -4177 59929 108852
21139 108852 79086 62584 39849 -20377 8738 52836 28095 44379 85043 90401 135362 185676
21127 185676 161738 110269 182378 198497 174129 144534 94668 -57545 -84776 -91642 25678
21116 25678 27710 6370 52425 85635 -347 -61229 -49748 -16113 57626 37493 62730 43599
21104 43599 26595 -25297 24986 108044 131803 103307 35432 146008 176713 103588 9760
21093 9760 -42357 -38181 99658 145753 64173 110269 236940 195443 117124 82790 92415 182698
21081 182698 124135 59862 70204 26492 -53879 -39579 84709 193268 153113 82926 94630
21070 94630 65776 23533 58895 9917 -13517 85715 144958 88874 52319 117882 161577 96232
21058I6232k1003R932K7847K7148M809j020p2433o1789k4232M1427l8646j3532
21046b5260L7652P3291m1476l9548l591O910k1149r4505p391N3507J24722O3522
21034A26684j2271J0326K1030j27989k0129K0763k8545P8116j4207r7873j1963
21023e6058J14671k0402L6470Q6849K4786m2993m9142n4723p5423r102N010O5439
21011B5382O0540L2771l7326K2662N5209K6018K5141k15p1040q9970L0670q86
20999G8956j0076j0443J400K6922M9604K5604k471L530l9851n1450n5914M0169
20987E5980j952J02970N5262n5749n0939L1782K892M8601L4883L0803N3671p8481
20975B29723j0554K1026M775j7413K7083j7148l0885l5662R3202J15420L7864
$$ plain form
21058 96232 75229 85161 113008 140156 144965 143945 71512 9723 -14509 26918 -11728 -25260
21046 -25260 12392 85683 44207 4659 1068 7978 -13171 -107676 -115067 -61560 63162 126684
21034 126684 114413 124739 145769 17780 -2349 18414 -10131 67985 53778 -44095 -56058
21023 -56058 58613 38211 74681 161530 186316 143323 94181 39458 -35965 -45067 -40057 25382
21011 25382 85922 118693 81367 104029 159238 185256 210397 210182 139142 49172 79842 78956
20999 78956 68880 58437 59837 86759 136363 161967 159496 163026 123175 71725 15811 55980
20987 55980 54028 156998 212260 156511 105572 137354 140246 188847 223730 254533 308204 229723
20975 229723 219169 240195 244970 227557 254640 237492 206607 170945 264147 379567 417431
20964D17431j5754l4384p6776n4822O092L6360M4161j0971j04088j54855J8890
20953G1284O9679J07179R4511K5558j05303j6238J4587k2123q9982K961N3474
20942B05587m134M553n0260N2807J8979p4618N0775Q5454p5040p2459p3339l6860
20930C1445k94l3440N2797Q5046j8737K644M5203P0200l58l8379k102J6957O3232
20917B74214R155Q89o9537J4073k4190q841O3529Q5154M5689n4232m2361o0553
20905B32989n7025m3019l8612L6975m2563p5614L8539J8309L946n6719m3158J33086
20893A07134J5166J6401N1450m5125k5783L6112K5960m4691k5760K2595k5464
20882A07995M9852R3371l7196q2680k2020k168o458k7804k816R4826K4602q5992
$$ plain form
20964 417431 401677 367293 290517 235695 241787 278147 322308 311337 207249 52394 71284
20953 71284 140963 248142 342653 368211 262908 246670 261257 239134 149152 152113 205587
20942 205587 201453 206006 155746 208553 227532 152914 203689 289143 214103 141644 68305 31445
20930 31445 31151 -2289 50508 135554 116817 119461 164664 234864 234506 196127 194025 210982 274214
20917 274214 283369 284258 214721 228794 204604 195763 259292 344446 390135 335903 293542 232989
20905 232989 175964 132945 94333 131308 88745 13131 51670 69979 73925 17206 -25952 107134
20893 107134 122300 138701 190151 145026 119243 155355 181315 136624 110864 133459 107995
20882 107995 157847 251218 214022 131342 109322 107154 100696 72892 70076 164902 189504 103512
20870A03512m290m0203m9756l6430N4715j34L7420M5397N5561Q85j6236j3521
20858A36920R648m6632o057P8787k364J7460N0006o5700Q666N5498N748l8190
20846B03790k7847k4130J78876J63773R1486l1693P0611J15875O9902j06269q7554
20835F16820o5477K2015J0466o0563n0599k6041l5549L839N9179J21943n5766
20824E40267o3000J0437n4378q8359J6932J9960R2321j7678m5590L8972L2936
20813D82820r6952j6042J257n1384O2086Q6291J3618J8008m0491M5454R5542J04242
20801G04449m8943J12720Q7354j08127j68660K4366J7585L7255Q860m2765R4582
20790G18676J01462m1556M2367j7100k5349P7577j7813j4108L7133K1512J10132
$$ plain form
20870 103512 99222 59019 9263 -27167 27548 27414 64834 110231 165792 166677 150441 136920
20858 136920 146568 99936 93879 172666 170302 187762 237768 172068 180734 236232 241980 203790
20846 203790 175943 151813 330689 494462 585948 554255 624866 740741 810643 704374 616820
20835 616820 551343 573358 583824 523261 472662 446621 411072 414911 474090 596033 540267
20824 540267 477267 487704 433326 344967 361899 381859 474180 456502 410912 449884 482820
20813 482820 385868 369826 371083 319699 381785 468076 481694 499702 459211 504665 600207 704449
20801 704449 655506 768226 855580 747453 578793 603159 620744 657999 666859 624094 718676
20790 718676 820138 778582 820949 803849 778500 856077 838264 824156 861289 882801 992933
20779I92933K7872N4695O693l2257N5972J06699J38175J71510K1883O5285J72709
20768A782169J29244J49034K27056M30920M06046J54123J45119P6945n6104j72056
20758C272496j74842j16430j16827L456Q7615R2933P4479K04970K78372K33639
20748C839861J98808J80857P9092m8817J24466J98881K36749K99370M23890M17001
20738E950158M47816N41843P10210P92528R99547J269253J495896J829148K279670
20729A6316069K756699L484387M444555N676876P364446R635775J3122474J8388768
20721H1190049K7008154L9777865N2259489N3802883M1589393K7128012J3752069
20714C36507914q620830l4904157m8545913m8416031m3845681l7634101k9530420
$$ plain form
20779 992933 1020805 1075500 1082193 1049936 1105908 1212607 1350782 1522292 1544175 1609460 1782169
20768 1782169 1911413 2060447 2287503 2718423 3124469 3278592 3423711 3500656 3444552 3272496
20758 3272496 3097654 2981224 2864397 2867853 2955468 3048401 3122880 3327850 3606222 3839861
20748 3839861 4038669 4219526 4298618 4249801 4374267 4573148 4809897 5109267 5533157 5950158
20738 5950158 6397974 6939817 7650027 8442555 9442102 10711355 12207251 14036399 16316069
20729 16316069 19072768 22557155 27001710 32678586 40043032 49678807 62801281 81190049
20721 81190049 108198203 147976068 200235557 254038440 295627833 322755845 336507914
20714 336507914 327887084 292982927 244437014 196020983 152175302 114541201 85010781
20707H5010781k1280943j4691316j0369250p464326n506257m171514l188544k564695
20699A5773936k051931j672910j352908j174123r87586q18982o82413o04634n29204
20690E899245n28602l85550l50507l59913k76223j94395j20881j40603j60366
20681C382205j46983r5581j95295k17766k04455n9089m8174j508J52867J86025
20671B752246J97366N4608N5381J1766k85781l48514l07100l21506k11620j46313
20661A450533j72049q7284p2275j20444p315n433q3502j27095p2644K1113Q8052
20650H11657q2061j80673m0228R545L6850l6345q9907q2168K1490M6097O119K5189
20638D45565n1030j20410q4603L9782o4662K2299L2734M6373m0763O3055J2472
$$ plain form
20707 85010781 63729838 49038522 38669272 31204946 25698689 21527175 18338631 15773936
20699 15773936 13722005 12049095 10696187 9522064 8534478 7715496 7033083 6428449 5899245
20690 5899245 5370643 4985093 4634586 4274673 3998450 3804055 3683174 3542571 3382205
20681 3382205 3235222 3139641 2944346 2726580 2522125 2463036 2414862 2413354 2566221 2752246
20671 2752246 2949612 3004220 3059601 3071367 2785586 2437072 2129972 1808466 1596846 1450533
20661 1450533 1278484 1191200 1118925 998481 991166 985733 902231 775136 702492 723605 811657
20650 811657 729596 548923 508695 518240 555090 518745 428838 346670 368160 414257 420376 445565
20638 445565 394535 274125 189522 229304 164642 186941 219675 266048 225285 288340 300812
20627C00812k3217N8415O0271p7241k1214k8326n5109m2618P283L4956K7425K1163
20615B62600r0203o7887l2671J4088J6589L5453K170Q5969K7123Q718p5564l8804
20603A47581N2355K0990p9188j29001J1891O5675m7656j7584p2230j12818j6145
20592a76130j5150k4283L8097M0441P4518O7372K5969L7608k7854o8927M7848
20581A9509N2919J9111j7695L5268j8079m3267K2714o9254K9316n5283k6522J108
20569e0155K7273P4525Q3614J2186m3593L8897J969O679L8611p09l1542l112k9293
20556A25350p9306o566M0507J14849J6242n9996L2399N5324J8225j14820l7348
20545A04860K5049n0158o2647o7096K2929L30j4786K5184j699P2770L731n5475
$$ plain form
20627 300812 277595 336010 396281 319040 297826 269500 214391 171773 179056 214012 241437 262600
20615 262600 172397 104510 71839 85927 102516 137969 140139 226108 253231 261949 186385 147581
20603 147581 199936 220926 141738 12737 24628 90303 42647 25063 -47167 -159985 -176130
20592 -176130 -191280 -215563 -177466 -137025 -62507 4865 30834 68442 40588 -28339 19509
20581 19509 72428 91539 73844 109112 91033 47766 70480 1226 30542 -24741 -51263 -50155
20569 -50155 -22882 51643 135257 147443 103850 142747 144716 151395 190006 189297 157755 154643 125350
20556 125350 46044 39478 79985 194834 211076 151080 183479 238803 257028 142208 104860
20545 104860 129909 79751 17104 -49992 -27063 -26733 -41519 -16335 -18034 54736 58467 2992
20533B992R3002j5341L807J7040K0293n6894j14171l8303K0970J9257L596K6364
20521a7388j2772K6198n8224J6099J6056j4119k5817l5523K782P5989O5161J7009
20509E5451Q566L6645L5837o2362j9949J0906j16799m531P7163N017L7403n9299
20497D048k1239l5146J0285j8099l2499p64O1983M02n0775M4097L4058J0702j7305
20484a0252P5171P0767q7682q6618J7375L1622n223o9678l5818N1864L1626L3191
20472A6345k0528q5323O0842Q126L728N0170n7214K7662o9991K6653O5554L411
20460B9435N4343k8685o2390l5192Q296o6374K6493O8304P5476m3402K6639R0595
20448A43538j11129j00181L0523P5818l2004o8564J0649P3862m4599L3784l2619
$$ plain form
20533 2992 95994 80653 84460 101500 121793 64899 -49272 -87575 -66605 -47348 -43752 -17388
20521 -17388 -30160 -3962 -62186 -46087 -30031 -44150 -69967 -105490 -102708 -26719 38442 55451
20509 55451 64017 100662 136499 74137 54188 65094 -51705 -56236 20927 25944 63347 4048
20497 4048 -17191 -52337 -42052 -60151 -92650 -93414 -31431 -31029 -81804 -37707 -3649 7053 -10252
20484 -10252 64919 135686 48004 -38614 -21239 10383 5160 -64518 -100336 -48472 -16846 16345
20472 16345 -4183 -89506 -28664 -20538 -16810 33360 -23854 3808 -66183 -39530 26024 29435
20460 29435 83778 55093 -7297 -42489 -34193 -100567 -74074 -5770 69706 26304 52943 143538
20448 143538 32409 -67772 -37249 38569 6565 -61999 -51350 22512 -22087 11697 -20922
20437b0922j02172p2163K4302O2758L5431k8846p5864j0365J14249P7794j0587
20426f385l3155Q5314K6624j8566j01103p1556K4822N6472l1393n0572M526K1359
20414i3613N8296k4359j1354M9575k5011O8358k8489J387n5588m5702l0093M0675
20402i5918L2065P546o673M5043r028o6551K8910q5657J14838N3561k4839l9855
20390d6558q094L3890k2789K2918N779m8927m7988J35562J13326N99k2339r5868
20378A9511l3326L035o4353l3149m1531R616J19693Q5316k5156k8043n4583O4912
20366B1942J1515j01627j2100k5736j4043J00513M4522j6881J6606j8978m7946
20355d2213L2827J5644o6822j9209l2901M8634L7795N1831K2718J0696R034o8825
$$ plain form
20437 -20922 -123094 -195257 -170955 -108197 -72766 -101612 -177476 -187841 -73592 4202 -6385
20426 -6385 -39540 45774 72398 53832 -47271 -118827 -94005 -37533 -68926 -119498 -114972 -93613
20414 -93613 -35317 -59676 -71030 -21455 -46466 21892 -6597 -5210 -60798 -106500 -136593 -95918
20402 -95918 -63853 -56307 -62980 -17937 -26965 -93516 -64606 -150263 -35425 18136 -6703 -46558
20390 -46558 -54652 -20762 -43551 -20633 -14854 -63781 -111769 23793 137119 137718 115379 19511
20378 19511 -13815 -10780 -75133 -108282 -149813 -140197 -20504 64812 39656 11613 -42970 21942
20366 21942 33457 -68170 -80270 -106006 -120049 -19536 24986 8105 24711 5733 -42213
20355 -42213 -9386 6258 -60564 -79773 -112674 -64040 -26245 25586 48304 59000 68034 -791
20343g91j19029n9335P528J13190J2186o4368L9465k1577L9966m3886m7768J09152
20331c5267L8470L3328J7002k4550k5063J595m8801r51J2023n4967J1355p6804
20319a52630q1313O5820K9699N5276j6968l4198j5367K5864M6525Q9800L5475
20308D7983j10866j6577K9312J1296J5059k7175l4573L0718L4421K9628j1047
20297a821O789J5991J2298K0213K5787k8030j1039l9320k1560l6372j3510l6240
20285a06814J7873N0572J3363J6374q5356l8683k1770k9382J9245L1233J36673
20274C328J2549p0926q3435N236R5318Q2396L85m0609j890k6327J5578O6171l8702
20261A9072k4596K1620k1142K4609M2295J664j01976k8090l931L7158J9001m7796
$$ plain form
20343 -791 -119820 -179155 -171627 -58437 -46251 -110619 -71154 -92731 -52765 -96651 -144419 -35267
20331 -35267 3203 36531 53533 28983 3920 5515 -43286 -44237 -32214 -87181 -75826 -152630
20319 -152630 -233943 -168123 -138424 -83148 -100116 -134314 -149681 -123817 -77292 12508 47983
20308 47983 -62883 -79460 -50148 -38852 -23793 -50968 -85541 -54823 -20402 9226 -1821
20297 -1821 4968 20959 33257 53470 79257 51227 40188 868 -20692 -57064 -70574 -106814
20285 -106814 -88941 -38369 -25006 -8632 -93988 -132671 -154441 -183823 -164578 -133345 3328
20274 3328 15877 -55049 -138484 -133248 -37930 44466 44851 4242 2352 -23975 -8397 57774 19072
20261 19072 -5524 16096 -5046 19563 61858 63522 -38454 -66544 -70475 -33317 -14316 -62112
20249f2112j3786l4192o1896P9812N2879J3447M5258K5038K6087M5577m344r7077
20237A4691o7540M4450K9733k310M3597k4771j07356k224M330p4421L288N3693
20225h4840O4313P0705p9803j04063m6215O3286Q9917O6190q2781J1744n3305
20214h4852r564k7686P9271O8745j9542p2807j0227J34386J5705J4597L5322J4454
20202A37802o3147o2832K5405M5875M1746J5424m1310o4060p1858L432p4352l5110
20190a42985P7568K158L2371Q2226M0749O134m9941n6553q586M2524K224l8677
20178a0788o2514j02008O6862L5988m1221K0425M7606K8643k5677j0788k8715
20167h2187j474K0206J6446k6688J2143m3729P202J07711J0283n9366J2285N2416
$$ plain form
20249 -62112 -75898 -110090 -171986 -92174 -39295 -25848 19410 44448 70535 116112 111768 14691
20237 14691 -52849 -8399 21334 19024 62621 37850 -69506 -71730 -67400 -141821 -138533 -84840
20225 -84840 -20527 50178 -29625 -133688 -179903 -116617 -26700 39490 -43291 -31547 -84852
20214 -84852 -94416 -122102 -42831 25914 6372 -66435 -76662 57724 73429 88026 123348 137802
20202 137802 74655 11823 37228 83103 124849 140273 98963 34903 -36955 -33523 -107875 -142985
20190 -142985 -65417 -63259 -30888 51338 92087 98221 48280 -8273 -16859 25665 27889 -10788
20178 -10788 -73302 -175310 -108448 -72460 -113681 -93256 -45650 -17007 -42684 -53472 -82187
20167 -82187 -83661 -63455 -47009 -73697 -61554 -105283 -98081 9630 19913 -39453 -27168 25248
20155B5248p2167L5734K4470o9767o195J6396J101O3835J2536j8839p8181q9821
20143a55650K1552L9808J3417o2797l2507Q2272L4684P725m1665R4440M2220K8195
20131G1694k0876o3814j4129k39O6657K7770q8800o2911j315o115o7659m4150
20119b03887J8711P8974O0686L9861j8682j5286K5993j728O1082R779k6897p6715
20107d8109j9948K4893k4145N0498m207k5669l554O1629l4551J562R9368J6731
20095I4498k2842o0894o3138Q5323j4736P429k2173O2594J17889l0862l200J2840
20083A62728p4305o5441q1365J6709K8037Q1531N7243m9660j19224j2383k008
20072e8138P3084L3854k3624o7331l7484n5933p9748P3135M1063M2798P4893N0072
$$ plain form
20155 25248 -46919 -11185 13285 -56482 -62677 -46281 -45180 18655 31191 12352 -65829 -155650
20143 -155650 -134098 -94290 -80873 -143670 -176177 -93905 -59221 -51496 -93161 1279 43499 71694
20131 71694 50818 -12996 -27125 -27364 39293 67063 -21737 -84648 -85963 -92078 -159737 -203887
20119 -203887 -185176 -106202 -45516 -5655 -24337 -39623 -13630 -15358 45724 55503 28606 -48109
20107 -48109 -68057 -43164 -67309 -16811 -21018 -46687 -50241 11388 -23163 -21601 77767 94498
20095 94498 71656 10762 -52376 32947 18211 25640 3467 66061 183950 153088 149888 162728
20083 162728 88423 22982 -58383 -41674 -13637 67894 125137 75477 -43747 -56130 -58138
20072 -58138 14946 48800 25176 -42155 -79639 -135572 -215320 -142185 -101122 -58324 16569 66641
20060F6641P6592Q913M2691m403j6552R4045J27367K17871J83177K02993L37458
20049A336793K84219R0173L4380j6903j37283k60077k50620l51846j91108j44678
20039C93050r9053q3340N4747m0752j09938j1341J8160n9745j5555k4856o6880
20028d5503j7434j7708K3085K4520P284K9895P0810q2509n1723o8298J3548Q3385
20016c0648J21063O2510j05601j2362M0820j01772j575J1511M0640M3174l0754
20005C7006P562L5776L5754n3493J0070k9013N8187K4438r2573n1527o7296k6396
19993a11505N4856j5354k7556o5518L454j3843L1816J44685j3104j58697K1300
19982a49466J34397J26021o2223o4011M4968o9263n7262N1277K2506J4488n4524
$$ plain form
20060 66641 143233 152146 194837 190434 173882 267927 395294 613165 796342 999335 1336793
20049 1336793 1621012 1711185 1745565 1728662 1591379 1331302 1080682 728836 537728 393050
20039 393050 293997 210657 265404 224652 114714 103373 121533 61788 46233 21377 -45503
20028 -45503 -62937 -80645 -57560 -33040 -25756 4139 74949 -7560 -59283 -127581 -114033 -30648
20016 -30648 90415 152925 47324 34962 75782 -25990 -27565 -16054 24586 67760 37006
20005 37006 44568 80344 116098 62605 72675 43662 101849 126287 33714 -17813 -85109 -111505
19993 -111505 -56649 -72003 -99559 -165077 -161623 -175466 -143650 1035 -12069 -170766 -149466
19982 -149466 -15069 110952 48729 -15282 29686 -39577 -96839 -45562 -23056 -8568 -63092
19971f3092J5953O9197m9719p3152q804O0837Q8374k9061m5028l0241K7429N5067
19959A7760k3956p6728M7002J85123j606o2052n3851R073L6264k6045j8965m2345
19947a0326l9964L1883P8391N7079K2548k6366j17486l5244K9663J66n0467J2027
19935d8096J4196p045K3785L8126J5836p0718m4735j9827L5856N1621o4703j3178
19923h8882J6864m9720l4528L8354J22018K8191m668l5481K2988m8776m2540r508
19911h5688P698R4147K526j9805L194K2594l6401r54M3401m2324o9600K5488Q4870
19898B9146K3444k4159K8718K6511l2484k5525J01674j408n094q423l6725j3129
19886F2546l0816l8038p222K3994o2033J3314P3889K0489n1346l7731L9885q2937
$$ plain form
19971 -63092 -47139 22058 -27661 -100813 -109617 -48780 39594 10533 -34495 -64736 -37307 17760
19959 17760 -6196 -82924 -35922 149201 147595 85543 31692 40765 77029 50984 32019 -10326
19947 -10326 -50290 -18407 59984 117063 139611 113245 -4241 -39485 -9822 -9656 -60123 -48096
19935 -48096 -33900 -40945 -17160 20966 36802 -33916 -78651 -98478 -62622 -11001 -75704 -88882
19923 -88882 -72018 -121738 -156266 -117912 4106 32297 27629 -7852 15136 -33640 -76180 -85688
19911 -85688 -77990 16157 18683 -1122 2072 24666 -11735 -12689 30712 -11612 -81212 -55724 29146
19898 29146 52590 28431 57149 83660 51176 25651 127325 125917 120823 112400 75675 62546
19886 62546 31730 -6308 -13530 10464 -51569 -38255 35634 56123 4777 -32954 6931 -76006
19874g6006J2342M5265L8106k3397j3709O6929J1664k7241o4787j5525L2324J9525
19862E490n220l7790J0156K2725q2841l1892N5202K3082k1973Q0185k6803J6169
19850F490M3038k3906P6484j1130m0811m7383J891l7204L2276o4169l2538k044
19838i9006L3989k0520M6367j710R049n0089N0108N1344R1502o9922l4479n3440
19826d6807j9522J7715K4724N4588L6927K8715j3126m0149k3905k0566L4018n946
19814B6666j9400n6086L1551m082O0315K1351m5652J1718J4484P7436K2986l4449
19802A06838P1233N8796J5181m2447m6028l3363l8148o7651J76K8874k5837N0188
19790G7812J5115k7179o3801K7241L0486k7537o8459l4629M5764o4949J1848O3910
$$ plain form
19874 -76006 -63664 -18399 19707 -3690 -17399 49530 61194 33953 -30834 -46359 -14035 5490
19862 5490 270 -37520 -27364 -4639 -87480 -119372 -64170 -41088 -63061 17124 -9679 6490
19850 6490 49528 25622 102106 90976 50165 2782 4673 -32531 -255 -64424 -96962 -99006
19838 -99006 -65017 -85537 -39170 -40880 -31831 -81920 -31812 19532 111034 41112 6633 -46807
19826 -46807 -66329 -48614 -23890 30698 67625 96340 83214 43065 19160 -1406 32612 26666
19814 26666 7266 -48820 -17269 -21351 38964 60315 14663 26381 40865 118301 141287 106838
19802 106838 178071 236867 252048 209601 163573 130210 92062 24411 24587 53461 27624 77812
19790 77812 92927 65748 1947 29188 59674 32137 -36322 -70951 -25187 -90136 -78288 -14378
19778a4378K5171K0062k3724m8198K867L0982M03l7400k4822J20324l813K5774
19766G3248j912m9927o3162o5571K2340N0720l3908j3713M7878l2485M2760P3918
19754E0186L1422m8109n3487J5739m3092K0794O7010j365j1208r3352m9549j14902
19742b29913O2786P5038L2689J6040m6073r6296K6446L5796j3575J17492k7706
19731d7276k8185k2537R604P0337j8119J8502k962m434L616q7228j5616l4424
19719a58722q6756O3713R8393K1635l8182N7077k2192j9463r717J7624L2126k8983
19707g3447J5226j1082O5369n1226Q150N9540k7873O466n183J03098L2294k1237
19695A00095R237n2908o8106m3934m6810k4083N4721O3112q4347k3855N5151R09
$$ plain form
19778 -14378 10793 30855 7131 -41067 -38200 -7218 -6815 -44215 -69037 51287 47474 73248
19766 73248 71336 21409 -41753 -107324 -84984 -34264 -68172 -81885 -34007 -66492 -23732 50186
19754 50186 81608 33499 -19988 -4249 -47341 -26547 40463 39098 27890 -65462 -115011 -229913
19742 -229913 -167127 -92089 -59400 -43360 -89433 -185729 -159283 -123487 -137062 -19570 -47276
19731 -47276 -75461 -97998 -88394 -18057 -36176 -17674 -20636 -25070 -21454 -108682 -124298 -158722
19719 -158722 -245478 -181765 -83372 -61737 -99919 -42842 -65034 -84497 -94214 -76590 -44464 -73447
19707 -73447 -58221 -69303 -3934 -55160 -47010 12530 -15343 -8877 -14060 89038 121332 100095
19695 100095 109332 56424 -11682 -55616 -102426 -126509 -71788 -8676 -93023 -116878 -61727 -60818
19683f0818K5808J33336J23268m4396j12032k5415m8404j2279L5868M4059J5771
19672G4766m7678m9162L8764l9800K1748r724N1636j4607j7662l6689o8715p4078
19660a71201J2706Q2870N749n736O2881J04278l2890r3113j8713R490n798j2207
19648f1684L6547O3598j2522K5390Q2340R014j16874j12732o388R420P2793N6246
19636D5148m3204q2002O1670L8264j9578L5055q651K3051n0345j3358J7839l2555
19624b8666m3883m1562l0134K6181M2618l551K363O7103K2295Q08q3473j1618
19612h1519q3982o022J30248J14050N5413l1174o3530p9716p6365l9505O4339
19601i7763P7347O6923m9824m8369j8355n404K2686L1673j0583O32P510K801M2684
$$ plain form
19683 -60818 -35010 98326 221594 177198 65166 39751 -8653 -20932 14936 58995 74766
19672 74766 27088 -22074 16690 -23110 -1362 -11086 40550 25943 8281 -28408 -97123 -171201
19660 -171201 -158495 -75625 -69876 -75612 -12731 91547 58657 -34456 -53169 -43679 -49477 -61684
19648 -61684 -25137 38461 25939 51329 133669 142683 25809 -86923 -93311 -83891 -11098 45148
19636 45148 1944 -80058 -18388 19876 298 35353 26702 49753 -592 -13950 3889 -28666
19624 -28666 -72549 -114111 -144245 -118064 -75446 -78997 -76634 -9531 12764 13572 -69901 -81519
19612 -81519 -165501 -171523 -41275 72775 128188 97014 33484 -46232 -122597 -162102 -97763
19601 -97763 -20416 46507 -3317 -51686 -70041 -75445 -52759 -21086 -31669 -31037 -23527 -20726 21958
19588B1958P6704j4623l7345o561o6889K3573m396o8191m6196j4200n6295P4152
19576a18309M8948L965j1317r6944N5992J31921m2831m9457l8916Q2696P456J0181
19564a6615M0749r1703m4795J03465k959m706L1823j3079J2761N6807n3476j36074
19552a17802J6691K031J20017L5661j5218j8175j12764k8500J09159J3627p0980
19541f6253J6980R2548L7721o1497k6864k1551n2176J6096O3214K5326N4450n041
19529G2953l2461m9007m1527J6248M0740P4544m2185o8951m374J2108L7987j7884
19517a809K9322m0178M815O7236N8978o9924L9948M3383m4599n8596o7364l2378
19505g1166L098Q850m4973O7591P2249M201p1963J0287M2902R8706R1249L6567
$$ plain form
19588 21958 98662 84039 46694 40133 -26756 -3183 -7579 -75770 -121966 -136166 -192461 -118309
19576 -118309 -69361 -65396 -76713 -173657 -117665 14256 -28575 -78032 -116948 -34252 -26796 -16615
19564 -16615 24134 -67569 -112364 -8899 -11858 -16564 15259 2180 14941 71748 18272 -117802
19552 -117802 -101111 -99080 20937 56598 41380 23205 -89559 -118059 -8900 4727 -66253
19541 -66253 -49273 43275 80996 19499 -7365 -28916 -81092 -64996 -1782 23544 77994 72953
19529 72953 40492 -8515 -50042 -33794 6946 81490 39305 -29646 -34020 -21912 16075 -1809
19517 -1809 27513 -12665 -7850 59386 118364 48440 88388 131771 87172 28576 -38788 -71166
19505 -71166 -68068 -59218 -104191 -36600 35649 39850 -32113 -21826 21076 119782 211031 247598
19493B47598j21098o8530p1090j46128j0256J05929J01821m3546n4318m2541L6596
19482f5563L440j630K2137l1289O2403Q7376m8199o5079J719q124O1558N7307
19470G6056P540j9171R051p125m914P1670o5928o4830o313J6852J5493N0009p1732
19457F658L411J5428J8430m0172n2628J0359P3777O0599r6252o1789N2738L1194
19445B1753Q5k9211o0769l91n114L8419P993M2119m1243J5326M7653n1725P3941
19432E8836N965o5152j6367J2945M973J4568P0524J9571r3401L4167M1563n2637
19420C5555o1739q4225l9394P6597P619l2862p063J1385L3404j2971L5664P7468
19408C9438m5682L4590N8863O2820o1887o3023n440j5048K352j945R1110j3257
$$ plain form
19493 247598 126500 57970 -13120 -159248 -169504 -63575 38246 -5300 -59618 -102159 -65563
19482 -65563 -62123 -63753 -41616 -72905 -10502 76874 28675 -36404 -34685 -42809 18749 76056
19470 76056 83596 64425 73476 66351 61437 133107 67179 2349 -3964 12888 28381 78390 6658
19457 6658 10069 25497 43927 3755 -48873 -38514 35263 95862 -390 -62179 -9441 21753
19445 21753 21838 -7373 -68142 -68533 -73647 -35228 -27235 14884 -26359 -11033 36620 -15105 58836
19432 58836 64801 -351 -16718 -3773 1200 15768 86292 105863 12462 46629 88192 35555
19420 35555 -26184 -110409 -149803 -73206 -65587 -98449 -105512 -94127 -60723 -73694 -38030 39438
19408 39438 -6244 28346 87209 150029 88142 25119 19679 4631 6983 5038 96148 82891
19396H2891L8086K5301n2542p474L9786p0011n0256J2148J10941k3181j36341
19385c0652l4703K6710J9058N3072M9596n0003q4735k0905Q3012k468r6186M0714
19373d7490M8532J1894j4339m6862P1080K6243j0557n6368P3103R2712m1552l8144
19361F8252N9830j3837j1334j7195L8081q527K0489k4336J389m1599j7333n9486
19349e606n4501k0965j0492O037J10063L4154n3587K0416L581j03631L262R0584
19337A9315M9706k7956l4766P8025M2448Q1838R2531Q2481J39665J68677J58901
19326H50865J4958M4239J44885Q1868j51199k86302k54540j27447j28100p7742
19316A11485L2036L1764k5703j5225R4n7588p9090o702j959M4307N2681j0856
$$ plain form
19396 82891 120977 146278 93736 86262 126048 56037 5781 17929 128870 105689 -30652
19385 -30652 -65355 -38645 -19587 33485 83081 33078 -51657 -72562 10450 7982 -88204 -47490
19373 -47490 1042 12936 -1403 -48265 22815 49058 38501 -17867 55236 147948 106396 68252
19361 68252 128082 114245 102911 85716 123797 115270 135759 111423 112812 71213 53880 -5606
19349 -5606 -60107 -81072 -91564 -85527 24536 58690 5103 25519 29100 -74531 -71269 19315
19337 19315 69021 41065 6299 84324 126772 208610 301141 383622 523287 691964 850865
19326 850865 865823 910062 1054947 1136815 985616 699314 444774 317327 189227 111485
19316 111485 143521 175285 149582 134357 134451 76863 -2227 -8929 -10888 33419 86100 75244
19304G5244n0770l3628n0077K8980k228L8975L0704L826K884M8349k7394l8184
19292B6681k4142L2440L6974k7748L2644p0171k1410K7949j2256L1448K7332K4162
19280H3903P3193M6815O4858N4868J10524Q0152K58878J70344L2928J30693L7966
19269A145122j19007j40758j03464j81051j59423j74728j0022k5463o3764l9350
19259A28092l728P1933J1856j71206l8305Q973O9375l6646m518l9898j0357O6380
19247E1951p6138r2430M6312J21731N2524R173l8463J022l5996K6248P9275j5350
19235A29859m553p8855p0949J7817N7926M7630k0568o1022M8870k847l9795j04939
19223h1426L0936J397o2073p7394M2910J28795O7847O7263J8575K8200m9825l7829
$$ plain form
19304 75244 24474 -9154 -59231 -30251 -32479 6496 37200 41026 43910 92259 64865 26681
19292 26681 2539 34979 71953 44205 76849 6678 -14732 13217 961 32409 59741 83903
19280 83903 157096 203911 268769 323637 434161 514313 773191 943535 976463 1107156 1145122
19269 1145122 1026115 885357 781893 600842 441419 266691 256669 231206 167442 128092
19259 128092 124364 196297 208153 36947 -1358 7615 76990 40344 35826 -4072 -14429 51951
19247 51951 -24187 -116617 -70305 51426 103950 113123 74660 75682 39686 65934 145209 129859
19235 129859 125306 46451 -24498 -6681 51245 98875 78307 17285 66155 63308 23513 -81426
19223 -81426 -50490 -49093 -111166 -188560 -145650 -16855 50992 118255 136830 165030 115205 77376
19211G7376k4110l0145o38O6590J7024M783J4891l6193K5283K1765J7067j4535
19199A39158o7790n9761p93j7854L208m5581l6594M7065P7704M2057O6761L762
19187A51342k0427M7427M1124p2163l3827l4130K9670k6767o4316l1638j7947
19176c1652R839N7838J6731n120p2214k2455J7688P7737K8013n2244q3153N9946
19164I54Q5778l4985K1913k3313O711O2322o371o6880l4159L5318m9759p621N0918
19151D0826k7830m8110k5700j3088L2766P5831J9244q6650L0725J5864Q0429P6789
19139A71096n0713q8684p3826l6983Q916J11173L1680n8151r9384K0475Q9202
19128B4801K3965k5009o2573N7114M1227k5048l1739J15141j555m1944j07243
$$ plain form
19211 77376 53266 23121 22483 89073 106097 110880 125771 89578 114861 136626 153693 139158
19199 139158 71368 11607 10814 -7040 -3832 -49413 -86007 -38942 38762 80819 147580 151342
19187 151342 130915 178342 219466 147303 113476 79346 109016 82249 17933 -13705 -31652
19176 -31652 -21813 36025 52756 47636 -24578 -47033 -29345 48392 76405 24161 -58992 954
19164 954 86732 51747 73660 50347 57058 119380 113009 46129 11970 47288 -2471 -10092 40826
19151 40826 12996 -35114 -60814 -73902 -41136 34695 53939 -32711 -1986 13878 94307 171096
19139 171096 120383 31699 -42127 -79110 -70194 40979 72659 14508 -84876 -64401 24801
19128 24801 48766 23757 -38816 18298 59525 34477 2738 117879 116324 74380 -32863
19117c2863n4433N2520Q4329L6303N9868k5900j6925n6760K5197m663q3904L3564
19105A6333m393r819k3691n7265j3486Q6153N9930k8190l4020J24340K9074p8536
19093F6430q1434N2147p520N6944o7649n9707l6288J4357l234L6927J9810R029
19081a88J9604l160l5169m2709j3533M2821N3222O0609j11442q1053K1215N5705
19069c4078Q0399Q7163l6644k7679R7930N6182K6909O7198r2061q3959K2515k2692
19057A41183J3394q00n7252q5069J2541j3462K2610N7729Q3708j1208o8039p1587
19045B3748M5130j7407j6851J1696K5516l668j15017j08610K6511Q2937P4896
19034B8881J2138R815j0965o6834m0321O6886O1869L3007j9347p8013o704J36956
$$ plain form
19117 -32863 -87296 -34776 49553 85856 145724 119824 102899 46139 71336 66673 -17231 16333
19105 16333 11940 2121 -21570 -78835 -92321 -6168 53762 25572 -8448 115892 144966 66430
19093 66430 -15004 37143 29623 86567 18918 -40789 -77077 -62720 -65954 -29027 -9217 -188
19081 -188 19416 16256 -18913 -61622 -75155 -32334 20888 81497 -29945 -110998 -89783 -34078
19069 -34078 46321 133484 96840 69161 167091 223273 250182 317380 225319 141360 163875 141183
19057 141183 154577 153777 96525 11456 23997 10535 33145 90874 174582 163374 95335 23748
19045 23748 68878 51471 34620 46316 71832 68164 -46853 -155463 -128952 -46015 28881
19034 28881 41019 50834 39869 -26965 -67286 -400 61469 94476 75129 -2884 -9588 127368
19022A27368J03622L7896j8696n6320M1508J2699R212m5963k445L1238o0745j8240
19010A61134p2448N1388M7299M8483k4809k1761k1115o912l1273M7545M2520J1482
18998B31533n437m0903m5436P643r2176l040O6930N094m3196K9711R3219P65k6756
18985A77951m0143p9454r4842N4238l3287P0107M214K8461J8609m1344J0819k957
18973G2372m3431K6844j8661K7046o8023m5007M7444r32n848q244l0092o560K7346
18960b5746l662P6461J03959L5410J1157K0565j4431M9251l5663m2370J8603P007
18948B00541N6674O4197Q774n7903k2092P976k8645o9201m2887N8986J40956K4896
18936C42272p2977l3804J5936K1677O9325M1120J1811M2147L0668j4145q3327
$$ plain form
19022 127368 230990 268886 250190 193870 235378 248077 257289 211326 208881 240119 179374 161134
19010 161134 88686 140074 187373 235856 211047 189286 168171 161259 129986 177531 220051 231533
18998 231533 226096 185193 139757 147400 55224 52184 119114 124208 81012 110723 203942 204707 177951
18985 177951 137808 58354 -36488 17750 -15537 54570 58784 87245 105854 64510 75329 72372
18973 72372 28941 55785 37124 64170 -3853 -48860 -1416 -2348 -8196 -16440 -46532 -53092 -25746
18960 -25746 -29408 47053 151012 186422 197579 218144 203713 252964 217301 174931 193534 200541
18948 200541 257215 321412 330186 272283 250191 258167 229522 160321 117434 176420 317376 342272
18936 342272 269295 235491 251427 273104 342429 383549 395360 437507 468175 454030 370703
18925C70703q7654m9782M1742O975o3706M6739P8811m6786r2502k4523L4692j6427
18913A98282L44K6535k1064J414o0498M1236M0959R688j4815k6500r502P8362
18901B64441K2896j1069r37O2814l2615j30230p7635K8238N7978M9967J70626
18890D04474J12339p0046m3418m8068q7801L3968P9707P0379M6480p5768P833
18879D30079R5053J7452k1037K3993J36085N3042L508l6189p3475j08341n8838
18868D61332J0221Q6395K3784N0357J13003J4793R279L4801k497J0817k9106M8675
18856H31854O9871J54363R4006N3043K02465K60937J37285J88746J59573m6506
18846B105637j53401N5231M1191M1189P9474J88414K60161K66998L77311M07441
$$ plain form
18925 370703 283049 233267 275009 281984 218278 265017 343828 297042 204540 180017 214709 198282
18913 198282 198626 225161 204097 205511 145013 186249 227208 236896 222081 195581 186079 264441
18901 264441 287337 276268 275331 338145 305530 175300 97665 125903 183881 233848 404474
18890 404474 516813 446767 403349 355281 267480 301448 381155 451534 498014 422246 430079
18879 430079 525132 542584 521547 545540 681625 734667 738175 701986 628511 520170 461332
18868 461332 471553 557948 581732 632089 745092 759885 769164 803965 801468 812285 783179 831854
18856 831854 901725 1056088 1150094 1203137 1405602 1666539 1803824 1992570 2152143 2105637
18846 2105637 1952236 2007467 2048658 2089847 2169321 2357735 2617896 2884894 3262205 3669646
18836C669646K25977J27941L17331K12106M1129J538K3046M7375o9228Q6068L17355
18825E000284N02970O59818Q81251J128297J643130K010206K735862L882845N226494
18816B3671157P287803J1419452J9942927L3502729L8802884K5237390J3084777
18809A72949119J5320866L273224k3185312l4874605k9228974k5423138k2769616
18802E6061564j7216355j1205023o978497m473214l106741k174155j602246j272528
18794H032805q87308n90763l56936j67339o8239j25292o8250L1248P1793L1982
18784E903701M0317M5763m5286p7537P2471r3118j96063o2351M646L9116L3216
18773E664875J67221K59181M01086O05294R41330J240227J706822K206245L076433
$$ plain form
18836 3669646 3895623 4023564 4340895 4553001 4594130 4595668 4618714 4666089 4596861 4682929 5000284
18825 5000284 5503254 6163072 7044323 8172620 9815750 11825956 14561818 18444663 23671157
18816 23671157 30958960 42378412 62321339 95824068 134626952 159864342 172949119
18809 172949119 188269985 191543209 168357897 133483292 104254318 78831180 56061564
18802 56061564 38845209 27640186 20661689 16188475 13081734 10907579 9305333 8032805
18794 8032805 7145497 6554734 6197798 6030459 5962220 5836928 5768678 5799926 5871719 5903701
18784 5903701 5944018 5989781 5944495 5866958 5939429 5846311 5650248 5587897 5592543 5631659 5664875
18773 5664875 5832096 6091277 6492363 7097657 8038987 9279214 10986036 13192281 16268714
18764A6268714M318196N569788P419856J1698946K0413780L4633395M2387347
18757A42710022K9192913J4524074J6332061O024869k2631175l8059431l2575014
18750A15518319k7778587k5257307j9553902j2781223p978220n243949l575958
18743A3349173k257790j753960j437960r91252p97790n53007l87966k98474l24700
18734D546274k33296j77714k41701k33696j12072o9327j74151j91183j33918k18674
18724B760542m89759k98018k81478k72379j47460j23573p6075l8285o6430m8440
18714I18645q1746j59517j23963m1040j4279J6401M3886m3438n9456P112N8205
18703E20810k5858L5895N269m1427j06471r4108O2070L3218l0603l5973r0611
$$ plain form
18764 16268714 20586910 26156698 33576554 45275500 65689280 100322675 142710022
18757 142710022 171902935 186427009 202759070 208783939 186152764 148093333 115518319
18750 115518319 87739732 62482425 42928523 30147300 22169080 16925131 13349173
18743 13349173 11091383 9337423 7899463 6908211 6110421 5557414 5169448 4870974 4546274
18734 4546274 4312978 4135264 3893563 3659867 3547795 3478468 3304317 3113134 2979216 2760542
18724 2760542 2270783 1972765 1691287 1418908 1271448 1147875 1071800 1033515 967085 918645
18714 918645 836899 677382 553419 512379 498100 514501 558387 514949 455493 462605 520810
18703 520810 494952 530847 536116 494689 388218 294110 356180 389398 358795 322822 232211
18692B32211l4301N142m154m838m0022j5877p1672q137N4822j8868k8177M4393
18680A10522J05522L9448M2597m8403o2348j5116j4958p4237J3210L3139L8834
18669A68210m705k0843K9841L103j3641N5167Q1891M535L894l5258l5822K6783
18657B63155l3375Q121k1042P862o4752q4762l182O2473N4849O3203K4885q6266
18645A91169r5196l780L9111k2880k0854k3315K6040k2458n1596n0217l2583J9054
18633d7505K4090M3671J6673L1238O247R1659O8474p1828j1341M8156j07586r1882
18621F6P5148J6329K7812n5382J9599P8993j9727j9829k42n942n9613Q0559L4414
18608A72185p2101j5305L1975Q3862K8261k7499o7380R9271P9563k3612q380J8526
$$ plain form
18692 232211 197910 203052 198898 194060 154038 138161 66489 58352 113174 94306 66129 110522
18680 110522 216044 255492 298089 249686 187338 172222 157264 83027 96237 129376 168210
18669 168210 163505 142662 172503 175606 161965 217132 299023 303558 307452 272194 236372 263155
18657 263155 229780 237901 216859 224721 159969 75207 72025 134498 189347 252550 277435 191169
18645 191169 95973 92193 131304 108424 87570 64255 90295 67837 16241 -33976 -66559 -47505
18633 -47505 -23415 20256 36929 68167 74414 166073 234547 162719 151378 199534 91948 66
18621 66 75214 91543 119355 63973 83572 162565 142838 123009 122767 116825 57212 137771 172185
18608 172185 100084 84779 116754 200616 228877 201378 133998 233269 312832 289220 280840 299366
18596B99366J7729K8373M4834n8004l5141K8363P5919J8488n2424r6660j32607
18585A38236l8935K453J2960N937J4228j33K717J7639K1899o3436q12Q0075Q66
18572A93694n1172k0990k6299j03306m4188l9000M5132J0385j6080K0083L1035
18561g06j1229j1222P3554N7989L43L5432q806K8831m8249M0165j9212k9234k6393
18548H1263R3299k0339p0994M8844j5864K4513J14392M9739k6366L3444l7334
18537B74597q1303N9892l6873m3851m4463o3364m3330K8367j933L0199Q1409k9236
18525A30111N278O9379l2384k1955J2594p6248n0574P082o516L3056J0125q0205
18513b57M5069J48120N2381l7070j15202N591L3178q8574p4053L3885K3763K2170
$$ plain form
18596 299366 317095 345468 390302 332298 297157 325520 401439 419927 367503 270843 138236
18585 138236 99301 101754 114714 120651 134879 134746 137463 155102 177001 113565 112753 192828 193694
18572 193694 142522 121532 95233 -8073 -52261 -91261 -46129 -35744 -51824 -31741 -706
18561 -706 -11935 -23157 50397 108386 108729 144161 135355 164186 115937 156102 136890 107656 81263
18548 81263 174562 154223 83229 132073 116209 140722 255114 304853 278487 311931 274597
18537 274597 193294 253186 216313 172462 127999 64635 21305 49672 47739 77938 159347 130111
18525 130111 135389 204768 172384 150429 163023 86775 36201 43283 36767 69823 79948 -257
18513 -257 44812 192932 245313 208243 93041 98632 131810 43236 -30817 3068 26831 49001
18501D9001j10J1489r935Q0371p4293m7881N934L0701j1442o1121Q229O1051J1555
18488E3549J37124J66447n7234j08907k5159P322p5556k8661r9813P027J7271
18477f590J2178J6322M4926J72783P0878r5586K7643L1164j11668l4680Q2203
18466B09573j5351l894L8072J1199j34416r727J80812J17523j2003L9690M2809
18455D64287q3991m2009r6623k7212q526j0509q5557J22338N9592M0728L7154
18444C69672l8449o2303J0716K8352K5237m8874o513J5116J4651K0978j21295
18433B07288O055J5307j7049n287n9348p402R8955P7812P7956N1942J9781l7192
18421D28818k3925N5772N2758l8751J2393o810L6590N4893O2080N859j9154k3976
$$ plain form
18501 49001 48891 60380 50445 130816 56523 8642 14576 45277 33835 -27286 -19057 41994 53549
18488 53549 190673 357120 299886 190979 165820 173142 97586 68925 -30888 -23861 -6590
18477 -6590 5588 21910 66836 239619 310497 214911 242554 273718 162050 127370 209573
18466 209573 194222 190328 228400 239599 105183 95456 276268 393791 381788 421478 464287
18455 464287 380296 338287 241664 214452 205926 195417 109860 232198 291790 332518 369672
18444 369672 331223 268920 279636 307988 333225 284351 277838 292954 307605 328583 207288
18433 207288 213343 228650 211601 206314 146966 139564 238519 316331 394287 446229 466010 428818
18421 428818 404893 460665 513423 474672 487065 480255 516845 571738 633818 639677 620523 596547
18409E96547l7846j7048J22982K1225n9539j5976J2795Q1682R2993P8391N9455
18398I35661P0980J0585q7859l9641O7875J50806k5137j00768j0272J35479M5525
18387A153234L2827J17604M9704P8134L3996J5537L780J06357L7352K318Q1890
18376A712733O0108Q7932J97205J76556J88411K39222M25676N43273O38164O01347
18366D870627O14842O01578M40819K77852M10195N69760Q09326J028301J542653
18357A1165953K193640K845925M007614N483033P461869J0673819J7401846L0202255
18349I1435954M2884591L1591471J0491713J5803492J4237148j8489495l5180691
18342A52774183k7094970k2007269j9280911j2049960k879503O819680K0618675
$$ plain form
18409 596547 558701 541653 664635 685860 626321 610345 623140 704822 797815 876206 935661
18398 935661 1006641 1017226 929367 889726 957601 1108407 1083270 982502 972230 1107709 1153234
18387 1153234 1186061 1303665 1353369 1431503 1465499 1481036 1484816 1591173 1628525 1630843 1712733
18376 1712733 1772841 1860773 2057978 2234534 2422945 2662167 3087843 3631116 4269280 4870627
18366 4870627 5485469 6087047 6527866 6805718 7215913 7785673 8594999 9623300 11165953
18357 11165953 13359593 16205518 20213132 25696165 33158034 43831853 61233699 91435954
18349 91435954 134320545 165912016 176403729 192207221 206444369 187954874 152774183
18342 152774183 125679213 103671944 84391033 72341073 69461570 76281250 96899925
18335I6899925L7890718L7234068J2901562Q624130J6151396r587041l7428458
18328A62686300l4554239k7370162k6019379k1596624j4933965r905797o499436
18321B1806698m341851l076452k287928j617400j174174r05350n81685m39812
18313G382046m61065m87907n25905n98226o42781m37087n56115m90574l50571
18304B831815k69468k06379j79828j57175j76397j41560j14276p1884m4421j2238
18294A458189j21983k7701R6291J34201J76733J14865m5336K7443j69361l00440
18284A342901k21773j42340j78427k3329n4796Q607j15771r0231m8381j20869
18274C55591o0121P4231K1936K0628m3214J6548L276m2611O593p625m6365J9705
$$ plain form
18335 96899925 134790643 172024711 184926273 193550403 209701799 200114758 162686300
18328 162686300 128132061 100761899 74742520 53145896 38211931 28306134 21806698
18321 21806698 17464847 14388395 12100467 10483067 9308893 8403543 7821858 7382046
18313 7382046 6920981 6433074 5907169 5308943 4666162 4229075 3672960 3182386 2831815
18304 2831815 2562347 2355968 2176140 2018965 1842568 1701008 1586732 1514848 1470427 1458189
18294 1458189 1336206 1308505 1404796 1538997 1715730 1830595 1785259 1812702 1643341 1342901
18284 1342901 1121128 978788 800361 777032 722236 730843 615072 524841 476460 355591
18274 355591 295470 369701 391637 412265 369051 385599 388875 346264 352857 345232 298867 318572
18262C18572L7900p5864l6614j3212L4681j8769R527N648m8471k784J1226n6862
18250A64978M0180L9298j5243l1377P6737J48806j323l6235J1041m8284O990J02146
18238D57714Q6033K34079J86901J74236J24815P6708j16279r6882j47511k02290
18228G77524q5114p0137q5668j20053j82204j19697J2598K6968m4225M9114k202
18217A56904J1723O4203L1953m8198j30796k1993k4331k306m7155p758J2921J4139
18205I306M2740J01277k36n130J6627j11j7845O819K9519J1038j9710J999j6858
18192A59435R8876L8188m7866j7282o9806j3286Q7025O6297k87R276J8595l8391
18180B90774j7592q5681J3045j2940m0403J10975J48122O0209j05050j21141q934
$$ plain form
18262 318572 356472 280608 243994 230782 265463 246694 256221 261869 213398 210614 221840 164978
18250 164978 205158 244456 229213 197836 274573 423379 422056 385821 396862 348578 355568 457714
18238 457714 543747 777826 964727 1138963 1263778 1340486 1224207 1127325 979814 777524
18228 777524 692410 622273 536605 416552 234348 114651 127249 154217 109992 159106 156904
18217 156904 168627 232830 264783 216585 85789 63796 39465 37159 -9996 -17754 -4833 9306
18205 9306 52046 153323 153087 147957 164584 164473 146628 153447 182966 194004 174294 176293 159435
18192 159435 258311 296499 248633 231351 161545 148259 235284 301581 301294 310570 329165 290774
18180 290774 273182 187501 200546 187606 147203 258178 406300 466509 361459 240318 231384
18169B31384l7155J1056O6544Q6719m2011l3716r301Q2724Q9490J6502L5434o0865
18157D36805l107J4180M6473O4136j808L6209J10730O8534Q583J12312J05421
18146I98468J84337K9519n0960j9732P510j18602q6747o6693p3565m5973N503
18135G63065J8113R726N2371M8720O9536O2994P6927J13576J02757L9068J43608
18124A500461Q4820K34800L10097J92862L19377M51989M16147N33933R48710J307429
18114F300625J606711J853161K512996L606879M991659P854894J4373486K9298778
18106G2399189N2449456L2806644k4529723k5656155j6205053k2647838k3380212
18099D5236308j5910053r179179n346939l386228k208292j527125j008817o74340
$$ plain form
18169 231384 194229 205285 271829 358548 316537 282821 273520 356244 445734 462236 497670 436805
18157 436805 433698 447878 494351 558487 556679 592888 703618 772152 780735 893047 998468
18146 998468 1182805 1212324 1161364 1141632 1149142 1030540 943793 877100 803535 757562 763065
18135 763065 781178 790904 843275 891995 961531 1024525 1101452 1215028 1317785 1356853 1500461
18124 1500461 1585281 1820081 2130178 2323040 2642417 3094406 3510553 4044486 4993196 6300625
18114 6300625 7907336 9760497 12273493 15880372 20872031 28726925 43100411 72399189
18106 72399189 124848645 157655289 133125566 107469411 91264358 68616520 45236308
18099 45236308 29326255 20147076 14800137 11413909 9205617 7678492 6669675 5995335
18091E995335n33147m73076m80520m69528m25811m25717m30880l97825l49608
18082B009223k73202j98682j88858m3403K7246j2500n7182j7121j9820L6894N8138
18071A320733o0633j43232j11458j33034r9416r2766r3121j6495J46992Q2469
18061H00039K8682J5048K10002L35555M76756M89880L65735J66847J4689o3456
18051B839777j06537k58365k32511k83141j47202j47703j47471j01153j81856
18042A233838k31588j70094j06396j04985q6327o4454j22702o4688k069l2837
18032B47698o2656J0816K2117q7476k4137j0270p0034o0754O727R1993K4366M770
18020I3160J0767M3002K0037j4839j03101M4025J19559P9293M0952O2939K8177
$$ plain form
18091 5995335 5462188 4989112 4508592 4039064 3613253 3187536 2756656 2358831 2009223
18082 2009223 1736021 1537339 1348481 1305078 1332324 1319824 1262642 1245521 1225701 1262595 1320733
18071 1320733 1260100 1116868 1005410 872376 772960 680194 587073 570578 717570 800039
18061 800039 828721 843769 1053771 1389326 1866082 2355962 2721697 2888544 2903233 2839777
18051 2839777 2733240 2474875 2242364 1959223 1812021 1664318 1516847 1415694 1233838
18042 1233838 1002250 832156 725760 620775 534448 469994 347292 282604 280535 247698
18032 247698 185042 195858 217975 130499 106362 96092 26058 -34696 -27969 64024 88390 93160
18020 93160 103927 146929 166966 152127 49026 93051 212610 291903 332855 395794 423971
18009D23971K6335k0838N2902P2570L4582J62022J50071J42848J88876K76725
17999A510064J86056Q3238Q5105J36378J54595K50479K74439K85422K55251K66434
17989C487461M84364M44929K03258J17384J74998Q6861j98042k53014l41064k54244
17979C952891k59233l89051n24422m54822k88596l42663l47649j93451n8314k4562
17969A070128o4021j55508o9465r9469j25332m782J50949J0272j517n5624J4634
17958F70265M5192j305P8150P7080J75141P3759J39086P3142J15017J36152K61520
17947A843199J84854J32437J45022R0183n5391k7434J23532J40839o1770j14516
17937B400955p8010N5697J42898L7806j22036n3231R513j73543l60726l92565
$$ plain form
18009 423971 450306 429468 482370 554940 589522 751544 901615 1044463 1233339 1510064
17999 1510064 1696120 1779358 1864463 2000841 2155436 2405915 2680354 2965776 3221027 3487461
17989 3487461 3971825 4416754 4620012 4737396 4912394 4999255 4801213 4548199 4207135 3952891
17979 3952891 3693658 3304607 2780185 2325363 2036767 1694104 1346455 1153004 1094690 1070128
17969 1070128 1006107 850599 781134 681665 556333 551551 702500 712772 711255 655631 670265
17958 670265 715457 714152 792302 869382 1044523 1118282 1257368 1330510 1445527 1581679 1843199
17947 1843199 2028053 2160490 2305512 2395695 2340304 2312870 2436402 2577241 2515471 2400955
17937 2400955 2322945 2378642 2521540 2559346 2437310 2384079 2393592 2220049 1859323 1466758
17927A466758l13726j77751j88004j81228k8001n9260n5563q6875j19105j1593
17917B45652R220l0161k7678k7325k551j4456k5139O837M8456R317o0122k2001
17905A10049L3548L8924j0766p9802p7089o328L8905L1835K2361l0500P6077M7196
17893A94410O846l0320L5986M220N4318M6673J6756L53l0724m400j0628o0605
17881B22885k1549J5536M607Q7034k1286j40398q2518K1929K9989q8459l5833
17870h063N3047P2194l6717k6129o0829j10221J6782N0012L9678k6956n9454j2098
17858a08754O0293L1989M1474j0573l8311r705J0488J7343R851P67L7652J5798
17846E8312O4488M6245M8918J42903K05460L22239J45696M4391P9985o890k30604
$$ plain form
17927 1466758 1153032 975281 787277 606049 578048 518788 463225 376350 257245 245652
17917 245652 254872 224711 197033 169708 167157 152701 127562 134399 182855 192172 132050 110049
17905 110049 143597 182521 171755 91953 14864 8536 47441 79276 101637 71137 147214 194410
17893 194410 201256 170936 206922 211142 265460 312133 328889 329242 298518 294118 283490 222885
17881 222885 201336 216872 221479 308513 287227 146829 64311 86240 116229 27770 -8063
17870 -8063 44984 117178 80461 54332 -6497 -116718 -99936 -49924 -10246 -37202 -96656 -108754
17858 -108754 -48461 -16472 25002 14429 -23882 -33587 -23099 -5756 4095 4862 42514 58312
17846 58312 122800 169045 217963 360866 566326 888565 1034261 1078652 1158637 1151747 921143
17835I21143j98644j33336p5948l2349l8508N0425N7788J39344J77896J03183
17825I70994L3163R0393M7477j08051k16285j96932j02543j49152q4869l3046
17815B51149q097j707l1179j4549p3899K484o3423o6698k7429k9435K3594j674
17803d0863N5702L0269p7040P0110L8530k3164J02678Q9140j3167j9668o3876
17792A48651L1986j19216q8206J02062R0295M872j4852m8520l5858r167P6279
17781A38326n6215K4299m0208M97K5474p4121l1304L7444J2403J9447L6091m5657
17769D6476m1829K6206k8540k9672l3505r8433R6Q6876J33109O5044n3005r220
17757F3603O4652J0885P8474O5394r9386m2942m5115n2455o6052N9848L3148k1404
$$ plain form
17835 921143 722499 589163 513215 480866 442358 492783 550571 689915 867811 970994
17825 970994 1004157 1094550 1142027 1033976 817691 620759 518216 369064 284195 251149
17815 251149 243052 241345 210166 195617 121718 124202 60779 -5919 -33348 -62783 -39189 -40863
17803 -40863 14839 45108 -31932 38178 76708 53544 156222 245362 232195 212527 148651
17792 148651 180637 61421 -26785 75277 165572 170444 155592 107072 71214 62047 138326
17781 138326 82111 106410 66202 66699 92173 18052 -13252 24192 36595 56042 92133 46476
17769 46476 4647 30853 2313 -27359 -60864 -159297 -159201 -72325 60784 125828 72823 63603
17757 63603 128255 139140 217614 283008 183622 140680 95565 43110 -22942 36906 70054 48650
17745D8650m6606l5392l2670J13297L1784L7043o3856J5305L3341R5465k2801
17734A73560j38360J2307L6223N7747p615k7105n1717o281O1979L4539k2222p135
17722A15920n9442j750K6625J3480L8958m0559K3933R3578m0463q6083r8937P406
17710g334J16129n1558j28501O2655J00003o83k9761j6134k7737n4553m1628J35496
17698E6394J61399O2685j37083j3767J092L3873J9952o9204n5647L1625N3232
17687A44551M6885J7663j4320k7438q5825J6773N1440L0685K652m7630o2596M1598
17675A14438K7512j6874J0500p4806R092L6217k9188k7158N2408J9844j3086o1283
17663D7616o9983K5579m3707n4290K822N7809m033M877K6786L2970o629M8156
$$ plain form
17745 48650 2044 -33348 -66018 47279 79063 116106 52250 67555 100896 196361 173560
17734 173560 35200 47507 83730 141477 133862 106757 55040 48759 110738 145277 123055 115920
17722 115920 56478 54728 81353 94833 133791 93232 117165 210743 170280 84197 -14740 -7334
17710 -7334 108795 57237 -71264 -8609 91394 90711 60950 44816 17079 -37474 -79102 56394
17698 56394 217793 280478 143395 129628 130720 164593 184545 115341 59694 91319 144551
17687 144551 191436 209099 194779 167341 81516 98289 149729 180414 183066 135436 72840 114438
17675 114438 141950 125076 135576 60770 69862 106079 76891 49733 102141 121985 108899 47616
17663 47616 -22367 3212 -40495 -94785 -91963 -34154 -38187 -33310 -6524 26446 19817 67973
17651F7973m3063k0620L7999j9460N8455k9085j01943Q040P9469M4276j5248J20101
17639A86894P4345j05316j63570n1975P3893l207N6817O3503K240P3530P7430
17628B84584o2951p262M0367Q7732K5501l0815J6457l0131r3831m4547j8722p2496
17616I3886l8641J4095N2738J03574k872Q6382J8871l5719m1861J3252j7704k8906
17604B17095M2519n6135R63k2702M1483L7385k5533o8643j1030K1753N1039O8601
17592B96795l5671j26327M1701N9569K7169P093r3099l352M018K2792l0442l0155
17580A40091M2529M6841l9743N797J38279K3490k9418M5686P4387O2469M740j13995
17568D01153m8608n449l4434j4418j0152Q5436N3292n6175L9438R2333M6309M1262
$$ plain form
17651 67973 24910 4290 42289 22829 81284 52199 -49744 -41704 37765 82041 66793 186894
17639 186894 261239 155923 -7647 -59622 14271 11064 67881 131384 133624 207154 284584
17628 284584 221633 214371 254738 342470 367971 337156 353613 323482 229651 185104 166382 93886
17616 93886 55245 69340 122078 225652 222780 309162 328033 292314 250453 263705 246001 217095
17604 217095 259614 203479 204442 181740 223223 260608 235075 166432 155402 177155 228194 296795
17592 296795 261124 134797 176498 236067 263236 270329 177230 173878 177896 200688 170246 140091
17580 140091 182620 229461 189718 195515 333794 357284 327866 373552 447939 510408 515148 401153
17568 401153 352545 347096 312662 298244 288092 373528 426820 370645 410083 502416 548725 589987
17556E89987m653m3509M4761N6995K5404k3408k5495M3051l2513K8466O4179L2802
17544G56067L7566M736J0596Q7402O0084K4669J99516P8954o3541J59108J05886
17533A461043R7748R489J8533j7512l9402j4Q7536K06737J98051K85551L54865
17522B662625L42379K23800L18431L74597L65277J96794L10086N50630O83407
17513F028026R37512J373961J879786K540662L385874M936171Q067802J3963414
17505D3113208K3201637K2754394O428976O884669J2617979o403187k0777494
17498H7820182j5830453j2468446j2067847q493473l376009J711209P993636J7051820
17490F2340619K2687230R662730K808121J1044435Q06729j9621877j8997549j4004016
$$ plain form
17556 589987 585334 541825 586586 643581 668985 645577 620082 663133 630620 659086 723265 756067
17544 756067 793633 798369 808965 896367 956451 981120 1180636 1259590 1196049 1355157 1461043
17533 1461043 1558791 1568280 1586813 1569301 1529899 1529885 1617421 1824158 2022209 2307760 2662625
17522 2662625 3005004 3228804 3547235 3921832 4287109 4483903 4793989 5344619 6028026
17513 6028026 6965538 8339499 10219285 12759947 16145821 21081992 29149794 43113208
17505 43113208 66314845 89069239 95498215 102382884 115000863 108597676 87820182
17498 87820182 71989729 59521283 47453436 38959963 35583954 37295163 45288799 62340619
17490 62340619 85027849 94690579 97498700 108543135 109349864 89727987 70730438 56726422
17482E6726422j4054115j2328027q473613n406876l483238k335582j635773j177898
17474G831300q77058m31749j40432j63262j10537M6210Q923j09173p9677j08355
17464E866190r3595j51857J97726L82080N42176Q87576J255908J578943K093509
17455A2558656K993094M447153O833908J1985251K0517153K1959000O977633N331357
17447I3603205J2041161l425999j8990907j5377772j1751474j1255363q125814
17440C6717037l379027J327533O551064J4519800K1206971J0510160J879416R586089
17432I8919043K726418j7294647j8436545j3280513j2956224j1858081q259493
17425A9559958n261185l446204k322646j477051j044212p66598m30774l43972
$$ plain form
17482 56726422 42672307 30344280 21870667 16463791 12980553 10644971 9009198 7831300
17474 7831300 6954242 6522493 6382061 6218799 6108262 6154472 6163395 6054222 5974545 5866190
17464 5866190 5772595 5620738 5818464 6200544 6742720 7630296 8886204 10465147 12558656
17455 12558656 15551750 19998903 26832811 38818062 59335215 81294215 88271848 93603205
17447 93603205 105644366 102218367 83227460 67849688 56098214 44842851 36717037
17440 36717037 33338010 34665543 41216607 55736407 76943378 87453538 89332954 98919043
17432 98919043 101645461 84350814 65914269 52633756 39677532 27819451 19559958
17425 19559958 14298773 10852569 8529923 7052872 6008660 5242062 4811288 4467316
17417D467316l10100k54277j79780j91307m39886m54794l09994k54612k53525
17408A819041k09337j12043q7189o1539L6430J502q1247N1382O3244j20807k32272
17397A067165j76764p8796j5974r7317j04963p6986n2557m802l2888m6620j08958
17386B70540Q0647L0055k5536o5084p9718j9363m1873o2273n422J11704O6701
17375B60378k8481j40260K2225N6155O4903q846n6362l3739P918N7208k7649J1439
17363A84889L6078r6579l0490l6475m2406Q2915M6895n9917m0695J47217P9177
17352B70609o4489o849M671o4417k6897P1023q88P69P5781O7879l8404p8549j02791
17339A07448Q767R2962N3160p2141q5559o2421r6954J8159J8750m4774m5881j1494
$$ plain form
17417 4467316 4157216 3902939 3723159 3531852 3091966 2637172 2327178 2072566 1819041
17408 1819041 1609704 1497661 1410472 1348933 1385363 1386865 1305618 1357000 1420244 1299437 1067165
17397 1067165 890401 811605 795631 698314 593351 516365 463808 459006 426118 379498 270540
17386 270540 351187 381242 355706 290622 210904 191541 149668 87395 81973 193677 260378
17375 260378 231897 91637 113862 170017 234920 226074 169712 135973 143891 201099 173450 184889
17363 184889 220967 124388 93898 57423 15017 97932 144827 84910 44215 191432 270609
17352 270609 206120 199271 203942 139525 112628 183651 182763 183532 259313 327192 288788 210239 107448
17339 107448 116215 209177 262337 190196 104637 42216 -54738 -36579 -17829 -62603 -108484 -119978
17327a19978k3947P8610K4382k9879K6823j00359q998N9858P600J59410R3596
17316A67118p7723l5944p6288k7547j1018l3465p1865J180j17367K1138J17479
17305a44302O6973L1715L6133K9050m004j00306j7522k3236j7366M3117O5839
17294c3909R4679R1036l2956p3814m1149L39j6794l1733k2195K0047J04920L3093
17282I1564n1199p4684j10842N9410J10242j0163N2980K2295M6069N7218m8709
17271A44181p4958n7463n032l7937p9595k4019J8259N724Q3614q546j1935m9555
17259i7262m7620J362J4015j7008P513l834N6518N937K330m1658o2531P1953M7504
17246f2781l168n3948M9327L0018K3661l6885l1857o5203M5191K3900K406K0479
$$ plain form
17327 -119978 -143925 -65315 -40933 -70812 -43989 -144348 -153346 -93488 -85888 73522 167118
17316 167118 89395 53451 -22837 -50384 -61402 -94867 -166732 -165552 -282919 -261781 -144302
17305 -144302 -77329 -45614 -9481 19569 15565 -84741 -102263 -125499 -142865 -99748 -33909
17294 -33909 60770 151806 118850 45036 3887 4226 -12568 -44301 -66496 -46449 58471 91564
17282 91564 40365 -34319 -145161 -85751 24491 14328 67308 89603 135672 192890 144181
17271 144181 69223 11760 6728 -31209 -110804 -134823 -116564 -110840 -27226 -35772 -47707 -97262
17259 -97262 -144882 -143520 -129505 -146513 -139000 -142834 -86316 -80379 -78049 -119707 -182238 -110285 -62781
17246 -62781 -65949 -119897 -70570 -40552 -16891 -53776 -85633 -150836 -105645 -81745 -79339 -58860
17234e8860K7223k5863j32865L950O8435O7980q421j6243p255K6856j3940r766
17222g8769m7963J9360M2415N4461l3121k6958m506n3023l7751q735L8651M5097
17210i0842J03070N6695N2553p6373m100r8710k9454R9566K3846j3547k3770j5316
17198a6382q212k5208j5964M964N6009O7975p0934J313l9671p4812K2595R1936
17186f391M4582n8765k6104N4339o706k871r4949k3107j4813M471k1054k4504
17174a75872P3456J36563Q806l076k7366J0289m0806o3747n9482R386M3333Q0744
17162g772O0131o5513k2592j8388Q812q993n542O9315M3779M6573J4425l2105
17150H2130k6674M8448o2520j02014j5458L3090p389l1481O8441P79o5416J2048
$$ plain form
17234 -58860 -31637 -57500 -190365 -186415 -117980 -50000 -58421 -74664 -81919 -55063 -69003 -78769
17222 -78769 -126732 -107372 -64957 -10496 -43617 -70575 -75081 -128104 -165855 -174590 -135939 -90842
17210 -90842 12228 68923 121476 45103 41003 -57707 -87161 12405 36251 22704 -1066 -16382
17198 -16382 -24594 -49802 -65766 -60802 -4793 63182 -7752 -6439 -46110 -120922 -98327 -6391
17186 -6391 38191 -20574 -46678 7661 955 -1916 -96865 -119972 -134785 -130314 -151368 -175872
17174 -175872 -102416 34147 42953 39877 12511 22800 -18006 -81753 -141235 -131849 -88516 -7772
17162 -7772 52359 -13154 -35746 -54134 -45322 -54315 -59857 9458 53237 99810 114235 82130
17150 82130 55456 103904 41384 -60630 -76088 -42998 -50387 -81868 -13427 -12648 -78064 -66016
17138f6016N0756P1170L9157q247r2435l4833L7256r4878l50N6341l378n7350
17126a02807j7590M4728j1822N4138j7322n6723P0095Q0404P6800q2546o3046
17115b5691L1834K4780k0024o7240p763O6491n1743K3724J02020O8541P1101l9808
17103A76222j75168r7268P4693m6300l1601M8677l4730m6359J9419K9556l8689
17092a21548r104J1035j404j12161r0215P4884J22166O5610m3309k9964M8695
17081h5315L3246n3771n930O1006J3602O3543k4633P890q2101m9550P1143P7652
17069B6782L7920m0388n5045k8924m5144k3286P5776L3760m560k1113j09573p3239
17057b27034P8397R2034r268p3623k929O8392j6674j16875j5716J39312J8061
$$ plain form
17138 -66016 -15260 55910 95067 86820 -5615 -40448 -3192 -98070 -98420 -42079 -45457 -102807
17126 -102807 -120397 -75669 -87491 -33353 -50675 -107398 -37303 43101 119901 37355 -25691
17115 -25691 6143 30923 10899 -56341 -64104 2387 -49356 -25632 76388 144929 216030 176222
17103 176222 1054 -96214 -21521 -67821 -99422 -50745 -85475 -131834 -112415 -82859 -121548
17092 -121548 -130652 -119617 -121021 -233182 -323397 -248513 -126347 -60737 -104046 -134010 -85315
17081 -85315 -52069 -105840 -111770 -50764 -37162 26381 1748 9638 -72463 -122013 -50870 26782
17069 26782 64702 24314 -30731 -59655 -104799 -128085 -52309 -18549 -23109 -44222 -153795 -227034
17057 -227034 -148637 -56603 -65871 -139494 -142423 -74031 -90705 -207580 -223296 -83984 -65923
17046f5923k5325j0570l97j5504J9181o0442l0382L8662J25541O8324n5555k6608
17034c8998J7472o1627n323j5442J6791K5667L4185L7306j4696J04207k4843m6997
17022B7702k2917k6166Q789K6960O7870Q149j41720j08836m028O1269L7943M6427
17010a8558J4472K2665j6030J8339K3090J464K7546J49679J85941L4445J7440
16999D60493N0087O5660Q1656r0005j67215j56072k4237r4129n1811l0317j7084
16988B7026L3765J71203J88931k2047m2233K3326N6935j34532j91429r4845N230
16977B1330N821M9616M2835l6471k584j2005j20620l4798J41053K9949k2619m8144
16965A3363L4029O0713j6141k3221k1788R333k3898q510O1921m3192k8242L2538
$$ plain form
17046 -65923 -91248 -101818 -102215 -117719 -98538 -158980 -189362 -150700 -25159 43165 -12390 -38998
17034 -38998 -21526 -83153 -88476 -103918 -87127 -61460 -27275 10031 -4665 99542 74699 27702
17022 27702 4785 -21381 -12592 14368 82238 90387 -51333 -160169 -164197 -102928 -64985 -18558
17010 -18558 -4086 18579 2549 20888 43978 45442 72988 222667 408608 443053 460493
16999 460493 510580 576240 657896 567891 400676 244604 220367 126238 74427 44110 27026
16988 27026 60791 231994 420925 398878 356645 379971 436906 302374 110945 16100 21330
16977 21330 27151 76767 119602 83131 80547 68542 -52078 -86876 54177 84126 61507 13363
16965 13363 47392 108105 91964 68743 46955 56288 32390 23880 85801 42609 14367 46905
16953D6905n7169K0714L8108k2089K3633J87432J83670R9520M552J5632l0153
16942E10755o9713p4146k1161r766J7096j8191J1766j3005J8059O4239k5717J6464
16930D06680j0046R2895n9521k31703m926K7469q2116k7461n3215p2335k9598
16919d3877k1573L5029J9281k3971L7913J0422o8300k2767k8943O470P516N0278
16907d2522R1136o4049p0237r9644m0270N8159P6227O5499m7865m8439J1218Q91
16895a09896L8066J11092O3010m4875L732L9437M954o2979n5761l861Q9851r953
16883F2817j04791l9306L4648l7564k5584O0548R1490r4883k9134P1744o2305
16872g2320M9753M3508k4357j1010o5082r2960J9308L1536r0302n5749O2288M7773
$$ plain form
16953 46905 -10264 10450 48558 26469 50102 237534 421204 520724 525276 540908 510755
16942 510755 441042 366896 345735 335969 353065 334874 346640 333635 351694 415933 390216 406680
16930 406680 396634 489529 430008 198305 193379 220848 138732 111271 58056 -14279 -43877
16919 -43877 -65450 -30421 -11140 -35111 2802 13224 -55076 -77843 -106786 -100316 -92800 -42522
16907 -42522 48614 -15435 -85672 -185316 -225586 -167427 -91200 -25701 -73566 -122005 -110787 -109896
16895 -109896 -71830 39262 102272 57397 61129 100566 105520 42541 -13220 -17081 72770 62817
16883 62817 -41974 -81280 -46632 -84196 -109780 -49232 42258 -52625 -81759 -10015 -72320
16872 -72320 -22567 20941 -3416 -14426 -79508 -172468 -153160 -121624 -211926 -267675 -205387 -157614
16860a57614p744m4019L6208O0528M4845K142j5460N5508J5020n6027l7425m7162
16848a51200N3886J57265J01398O0337q2330q5601l3674l020m9030O84l2582n9263
16836a23130L7084L7410r997m0695l044J06293J9028j08822m829Q3620J1807o1646
16824e6921m5019j3481n5220N042O0464O4617L0811j2175l6413j7165k3833O7890
16812c1403l7136r527K6733m7375k7261J1814M6141P8316l9310k3833m4542l4599
16800a31982J2923L9844M1185j1516p0150R587Q821j4823k7922J6480J49914L368
16788B5729J5842l2362o7984J24400M5348k9382j10733j62686j7685J17586N8423
16777c3504j0574m3588J3491O2512M9113m914l3615R343L2913k6754m1217J28592
$$ plain form
16860 -157614 -165358 -209377 -173169 -112641 -67796 -65654 -81114 -25606 -10586 -66613 -104038 -151200
16848 -151200 -97314 59951 161349 221686 139356 53755 20081 17061 -31969 -31285 -63867 -123130
16836 -123130 -86046 -48636 -58633 -99328 -102372 3921 22949 -85873 -90702 -7082 4725 -56921
16824 -56921 -101940 -115421 -170641 -165599 -105135 -40518 -9707 -21882 -58295 -75460 -99293 -31403
16812 -31403 -68539 -78066 -51333 -98708 -125969 -114155 -68014 10302 -29008 -52841 -97383 -131982
16800 -131982 -119059 -79215 -38030 -49546 -119696 -110109 -101288 -116111 -144033 -127553 22361 25729
16788 25729 41571 9209 -58775 65625 110973 81591 -29142 -191828 -209513 -91927 -33504
16777 -33504 -44078 -87666 -74175 -11663 37450 32536 -1079 8264 41177 14423 -26794 101798
16765A01798n8967j01986l5145O2062r46l1410j6086j3373P688k2361p0035Q822
16753a69939M6377P6165R0606m8538m6591J1807r930P6224P7678Q138n4067J4539
16741G2469o205L3488n4200l0564k7356m8596j5972l1286N8763j1595l7069J6360
16729h1763P4206J5353J1014R567K0410p0341j2389M8449M5125j06190M5814L7965
16717C7220J1286m9839j12310L4227R5953J1811N016p2742p6376K3862L0151J6439
16705d5302N5997K4804j12697p2615l8783n226P3519K1477N2908J2861q1889R774
16693a05172J9679l9433o5170J4272L2885L2171m1904k2806L4387O7349N9403
16682a4339N7142L4117q0776n6395k0573L015m9827J0865J062K1940N956M0850
$$ plain form
16765 101798 42831 -59155 -94300 -32238 -33184 -64594 -80680 -94053 -86365 -108726 -178761 -169939
16753 -169939 -123562 -47397 43209 -5329 -51920 -40113 -50043 26181 103859 111997 57930 72469
16741 72469 66264 99752 45552 14988 -12368 -60964 -76936 -108222 -49459 -61054 -98123 -81763
16729 -81763 -7557 7796 18810 28377 48787 -21554 -33943 14506 59631 -46559 -745 37220
16717 37220 48506 -1333 -113643 -79416 16537 28348 33364 -39378 -115754 -91892 -61741 -45302
16705 -45302 10695 35499 -77198 -149813 -188596 -193822 -120303 -98826 -45918 -33057 -114946 -105172
16693 -105172 -85493 -124926 -190096 -175824 -142939 -110768 -152672 -175478 -141091 -73742 -14339
16682 -14339 42803 76920 -3856 -60251 -80824 -77809 -127636 -116771 -115709 -93769 -87813 -46963
16670d6963M1169n6603q213L2025M4601J01427l2150j17725j8309l6386j14458
16659b11585J073K1803j9102k8734R2802O7360K0776L0507m0745j04209n446n0408
16647b25908M2459L5304J7771N9233O8740N5043n2442q8518L7670P4290J4674
16636C8316j9812k7053O299N0592K6512r2065k0066L6797j28551k1592l7530n827
16624a93980J33069N6777J7170n3889l8265N0228J6592j4557N0190L6837o6802
16613f630p9094l1234N4141M5988m7120p0677P4797J22969Q3912L3559j7726K4897
16601A87782l5022p3416J05400J2367k19584o1932K0570N634M7176N8026Q5089
16590A32090K6001m5075r1714l5122j6474k6789p3661j659P708O476Q1964K8177
$$ plain form
16670 -46963 -5794 -62397 -70610 -38585 6016 107443 75293 -42432 -60741 -97127 -211585
16659 -211585 -210512 -188709 -207811 -236545 -143743 -76383 -55607 -25100 -65845 -170054 -175500 -225908
16647 -225908 -183449 -148145 -130374 -71141 -2401 52642 200 -88318 -50648 23642 38316
16636 38316 18504 -8549 -2250 48342 74854 -17211 -37277 -480 -129031 -150623 -188153 -193980
16624 -193980 -60911 -4134 13036 -40853 -79118 -28890 -12298 -26855 23335 60172 -6630
16613 -6630 -85724 -116958 -62817 -16829 -63949 -134626 -59829 63140 147052 180611 162885 187782
16601 187782 152760 79344 184744 197111 -22473 -84405 -63835 -58201 -11025 47001 132090
16590 132090 158091 113016 21302 -13820 -30294 -57083 -130744 -132403 -124695 -118219 -36255 -8078
16578h078N9881k7962k0567m6140J3807J01873L2593L4062m4752j20287m0499
16567f6069K0959M982O0765L8819L5044m2510j38377N444J4760k8687N6593O3521
16555B5244o9656J5873J9231o3225L6765R4618m0857j2235l8235o2013K0488P4787
16543G85J6463M1624J4659l0618j19421M144J5782p1628n717P873j6455l1069
16531a73578J4066j8437K5796J636l903R3206K6602m6694m5685N853M7556J5202
16519e8380k4837m9436M5541L5549n018j163j5808l6299l7355L516j5776q0225
16507b39691n4835O5731M9669J6449L4058N0257N333M989P5240n1935r3623L7148
16495a01210P6168N420j5453O481l989M4142m0421K2755r519K1909m472l833L3186
$$ plain form
16578 -8078 51803 23841 3274 -42866 -29059 72814 105407 139469 94717 -25570 -66069
16567 -66069 -45110 -40128 20637 59456 94500 51990 -86387 -80943 -66183 -94870 -38277 25244
16555 25244 -44412 -28539 -9308 -72533 -35768 58850 17993 5758 -32477 -94490 -74002 785
16543 785 17248 58872 73531 42913 -76508 -72364 -56582 -128210 -133927 -126054 -142509 -173578
16531 -173578 -159512 -177949 -152153 -150517 -154420 -61214 -34612 -81306 -126991 -121138 -73582 -58380
16519 -58380 -83217 -132653 -87112 -51563 -56581 -57744 -73552 -109851 -147206 -143690 -159466 -239691
16507 -239691 -294526 -228795 -179126 -162677 -128619 -78362 -73029 -68040 7200 -44735 -138358 -101210
16495 -101210 -25042 -19622 -35075 -28594 -32583 11559 -28862 -6107 -15626 6283 1811 -2022 31164
16482C1164N890L693o8104q725j2420n965n474j1739J0324Q548J1873R0549j7538
16469C2076k3959L0298j2699n6678p2785m0104q265m0014J4202P4446N0912L2283
16457b0287N2205L709p9878l6007m170O4550K1629J7783L3356l6326K1200J9796
16445E7560n7304K1743J5110j2448l2704n6589o5418M1982L7352O544P350R0920
16433E4098n7419o6127j557O8072M6717p0996O848m1054P667J13488R0080k2817
16421A27000l8905q9821m2476K0823j2477J938m7473k9722P1881R6963K0543l9381
16409C8893m8024l2674k5261L5366q6809q0408O9612J4396M0628L3473K1864o8160
16397h7104J0317k5995k0359j6251l3359J6107k5118K0656M6827j30n9380o788
$$ plain form
16482 31164 37054 40747 -27357 -36082 -48502 -54467 -59941 -71680 -61356 -52808 -40935 49614 32076
16469 32076 8117 38415 25716 -30962 -103747 -143851 -152116 -192130 -177928 -103482 -52570 -20287
16457 -20287 31918 35627 -44251 -80258 -84428 -19878 1751 19534 52890 16564 37764 57560
16445 57560 256 21999 37109 24661 -8043 -64632 -130050 -88068 -50716 -44172 -36822 54098
16433 54098 -3321 -69448 -71005 -2933 43784 -27212 -20364 -61418 -53751 59737 149817 127000
16421 127000 88095 -1726 -44202 -23379 -35856 -33918 -81391 -111113 -39232 57731 78274 38893
16409 38893 -9131 -41805 -67066 -31700 -118509 -198917 -129305 -114909 -74281 -40808 -18944 -87104
16397 -87104 -76787 -102782 -123141 -139392 -172751 -156644 -181762 -161106 -114279 -114409 -173789 -180577
16385a80577J17223j9337j15768N7861L8696m4104K1684J4703p561N7706j9002
16374g8476k2691r813J866L5357L9901K6425Q0619L8300j00810j47001k5729J3950
16362a48102M5182K4662l6178K1547j5277K2626M1771q3142m3395j6212R700N6505
16350a20313M081k6749J07824K3006q023o6322l7899j4411j1285j0046k807l21
16338a63265L2347N0683j1587L7360L7863N1136l3525n125o038j6297L9054J9813
16326C2419O1661R3819l8284q7146o5726l9252M6931L2217p972p846M872k8526
16314b833q9849r872O3746K0469J0261K1827o3840O4955j1459m5580O0804K3707
16302D2336J6448K6429m2709m9654k8965L7839L0974J3797o9957j4028n6859j0198
$$ plain form
16385 -180577 -63354 -82691 -198459 -140598 -101902 -146006 -124322 -109619 -117180 -59474 -78476
16374 -78476 -101167 -110980 -109114 -73757 -33856 -7431 73188 111488 10678 -136323 -162052 -148102
16362 -148102 -102920 -78258 -114436 -92889 -108166 -85540 -43769 -126911 -170306 -186518 -176818 -120313
16350 -120313 -116232 -142981 -35157 -12151 -20174 -86496 -124395 -138806 -150091 -160137 -162944 -163265
16338 -163265 -130918 -80235 -91822 -54462 -16599 34537 1012 -4113 -10151 -26448 12606 32419
16326 32419 94080 187899 149615 62469 -3257 -42509 4422 36639 28667 20821 25693 -2833
16314 -2833 -92682 -102554 -38808 -18339 -8078 13749 -50091 14864 3405 -42175 18629 42336
16302 42336 58784 85213 42504 -7150 -36115 1724 32698 46495 -23462 -37490 -94349 -104547
16290a04547l639k1324n3814O6982m71J9153R1745M7746j03800j2560k7609j2054
16278a14192L7992R7041M5025J1689j4421r7206o3323O9167l9912l5795P2134
16267c1801K441j13031k310J23641K6874K8777m8801p0564m4996k158L6369j7996
16255a13555r2136n4337J7268J12438O490q8634j9360M5871J01939J9932L251
16244f0833J9892m1850N7504J0601l7862j3346M9215J8292M3567k7809j01752
16233h4381n8363R9676P9668J8595n2547o1126M607P7435J0837o9903L4193n953
16221g262O206j073m3639Q5265L6507m9055j3284M92j2923L848K8402J7777o7849
16208a6588l7969l9362n2554j1546N1790J20458L8223L0995o8472o9063p5896
$$ plain form
16290 -104547 -108186 -129510 -183324 -116342 -116813 -97660 -5915 41831 -61969 -74529 -102138 -114192
16278 -114192 -76200 20841 65866 77555 63134 -34072 -97395 -28228 -68140 -103935 -31801
16267 -31801 -29360 -142391 -144701 -21060 5814 34591 -14210 -84774 -129770 -131928 -95559 -113555
16255 -113555 -205691 -260028 -242760 -130322 -123832 -212466 -231826 -185955 -84016 -64084 -60833
16244 -60833 -40941 -82791 -25287 -14686 -52548 -65894 -16679 1613 45180 17371 -84381
16233 -84381 -142744 -43068 36600 55195 2648 -58478 -53871 23564 34401 -35502 -1309 -7262
16221 -7262 -1056 -2129 -45768 39497 76004 26949 13665 14157 1234 5082 33484 51261 -16588
16208 -16588 -54557 -93919 -146473 -158019 -106229 14229 52452 83447 14975 -54088 -129984
16197a29984j3585l9219N2183n8044n065k3542O8097M7864J20986J328k6997K7147
16185B1169M3970N4596o6770k8637j1777q6157J2535l3429J2749L8969K4379r1962
16173a10365L8290Q8193o6011J7432L2752L3769K954j3519j02505m6718m5031
16162a70759L4023P2903J3740J11771J2351m2386l7746p4925l7j0096r3406J1211
16150a73356O277N9273K9092M7567L5480J2344L2934J2482j6907o6836n3769K5147
16138e0272Q5494J2199l9848n2358m8420k3120L8489N8253J1562p2767m2732k6011
16126a49531L2293O7294O38j9336L5040j0113m8393R4032O8268K204K0238J3340
16114A05974j3599P280J6925n0786q8735q1176l5160N9501J09595k0941k6912
$$ plain form
16197 -129984 -143569 -182788 -130605 -188649 -193714 -217256 -149159 -101295 19691 21019 -5978 21169
16185 21169 65139 119735 52965 24328 12551 -73606 -61071 -94500 -81751 -42782 -18403 -110365
16173 -110365 -72075 16118 -49893 -32461 291 34060 37014 23495 -79010 -125728 -170759
16162 -170759 -136736 -63833 -50093 61678 74029 31643 -6103 -81028 -81065 -91161 -184567 -173356
16150 -173356 -167079 -107806 -78714 -31147 4333 16677 49611 62093 45186 -21650 -75419 -50272
16138 -50272 35222 47421 7573 -44785 -93205 -116325 -77836 -19583 -8021 -80788 -123520 -149531
16126 -149531 -117238 -49944 -49306 -68642 -33602 -43715 -92108 1924 70192 72396 92634 105974
16114 105974 92375 99655 116580 65794 -22941 -104117 -139277 -79776 29819 8878 -18034
16103a8034m991l5636o5112Q4901O7774l9746n2603o5419J7881O4286m309N6690
16091E682P8266L8104L189l4143R6113M1504n2530j17268q4846k5253L7033l5930
16079e0079q9084J9317L2459M0317J0849J9238j0370j19331r853Q2844J22259
16068D8566P035p6804J2576n235n1812J5876K9708k2194J1751j00714J05990M9811
16056B4554K9335K0560K2094j38463j07848R026L3230K8874p185k9829M70m675
16044a19857j191J07285L9006j0902m0012O7559O163K2708j0128n9785m331j3911
16032a7396m2533O0722M3085J2143M2371P083l0674n0379M93M2094l7804n3507
16020b4302j05883n5040L508M6236J4295M5117L5795J2713L4666L8357L808j01933
$$ plain form
16103 -18034 -23025 -58661 -123773 -38872 28902 -10844 -63447 -128866 -110985 -46699 -51008 5682
16091 5682 83948 122052 125241 91098 187211 228715 176185 58917 -25929 -51182 -14149 -50079
16079 -50079 -139163 -119846 -87387 -47070 -36221 -16983 -27353 -146684 -156537 -73693 48566
16068 48566 55601 -21203 -8627 -13862 -65674 -49798 -20090 -42284 -30533 -131247 -25257 24554
16056 24554 53889 74449 96543 -41920 -149768 -140742 -107512 -78638 -85823 -115652 -115182 -119857
16044 -119857 -121048 -13763 25243 14341 -25671 41888 48051 70759 60631 846 -3485 -17396
16032 -17396 -59929 793 43878 56021 98392 105475 74801 24422 24915 67009 29205 -24302
16020 -24302 -130185 -185225 -181717 -135481 -121186 -76069 -40274 -27561 7105 45462 49270 -52663
16008e2663K542K7013L9956J6119K9441k4064r751p3806j03273L2497K5774n5062
15996a45277L9984J4746n7077Q705k0722N424M1137J1252m6361M5929j5620k7506
15984a45386N448L1585P9377M5420o529m685j3594M364l1623R2590k655k9461
15972B4851m3944j19090q4795K4980J37416M1498j4793L6595n371J5125j8683
15961f211M2396J8827j20234p8950n3799k4886O1306Q538j9545J11032J6171k2597
15949f7952J3093r343l386K4850L9368J2515m5362l3611m844l5540O432j4658
15937a18438k931O3733j5730L4308q745M2214R8115M686n4270k1687K6637l9588
15925H304m424R1446q6437n2348Q6976j5973k1340r7110n3252O8727k413j4552
$$ plain form
16008 -52663 -50121 -23108 16848 32967 62408 38344 28593 -45213 -148486 -115989 -90215 -145277
15996 -145277 -105293 -90547 -147624 -138919 -159641 -154217 -113080 -101828 -148189 -102260 -117880 -145386
15984 -145386 -139938 -108353 -28976 16444 9915 5230 -8364 -4000 -35623 56967 54312 24851
15972 24851 -19093 -138183 -222978 -197998 -60582 -19084 -33877 2718 -2653 12472 -6211
15961 -6211 36185 55012 -65222 -144172 -197971 -222857 -161551 -153013 -172558 -61526 -45355 -67952
15949 -67952 -54859 -64202 -67588 -42738 -3370 9145 -36217 -69828 -74672 -110212 -103780 -118438
15937 -118438 -121369 -57636 -73366 -39058 -47803 -5589 92526 97212 42942 21255 47892 8304
15925 8304 3880 95326 8889 -43459 43517 27544 6204 -90906 -144158 -75431 -77844 -92396
15913i2396M5968j1978o277n9585j3111M7968k6473m3274m6750K3968m611l9068
15901b25619N2122J24163j6280n8764J01775m2826K4576R8364o8233k1986N581
15890b7127j1466o4853J5947Q6543j564l9505o5376K2125M5518M6115m3145j063
15878c7851O3400l092j5763l2137l1651N0088L3960n2965o7955J3212k4631O4380
15866d1005k2997n854k8853J6654k432N095j5599M3632j5148M1420L866k8687
15854d9908k6275k250O9756K0729j2058l5721j937O3254l0925L9887O5028o780
15842I2800p8211p7875p198P181m5545N355M9204J010j9059n2517l6285L3881
15830a27259k4505K4074O4347J8981m5794n5041L5038M1075l7576M5035R3145
$$ plain form
15913 -92396 -46428 -58406 -64683 -124268 -137379 -89411 -115884 -159158 -205908 -181940 -186551 -225619
15901 -225619 -173497 -49334 -65614 -124378 -22603 -65429 -40853 57511 -10722 -32708 -27127
15890 -27127 -38593 -103446 -87499 -956 -2520 -42025 -107401 -85276 -39758 6357 -36788 -37851
15878 -37851 25549 22457 6694 -25443 -57094 -7006 26954 -26011 -93966 -80754 -105385 -41005
15866 -41005 -64002 -69856 -98709 -82055 -84487 -79392 -94991 -51359 -66507 -25087 -21221 -49908
15854 -49908 -76183 -78433 -8677 12052 -6 -35727 -37664 25590 -5335 34552 99580 92800
15842 92800 14589 -63286 -70484 -63303 -108848 -103493 -54289 -53279 -72338 -124855 -161140 -127259
15830 -127259 -151764 -127690 -63343 -44362 -90156 -145197 -110159 -69084 -106660 -61625 31520
15819C1520l3623o7353K6958l4645o1942m9885J8880K0718n5521O1206J1020J6522
15807a16145n0421K5929M1563K7693m6982m2237j5752M8641L6142M1474P1366
15796B1271M2385l5605L2805r784p2424L4166N0131r1414o5036k9810j2047Q0417
15784e4945Q0365J1943l8929N5043L7114K5907o9977q0626L1367j7282k2942j1108
15772e4070j02930k3966N4719O6318r831j8549J6739p1410N2234L4215J9685K5110
15760a1736n6244M156m8212Q103K6981O1429j6005p2176R7286P1685l6675j0834
15748A7758L1987K3515p1916p0828n7173r941M962O0763M8868P8928K2355r932
15736F9346k5512J0499n8828o2368J0220R392l9511J2574j7646O6746J09013J10585
$$ plain form
15819 31520 -2103 -69456 -42498 -77143 -139085 -188970 -170090 -149372 -204893 -143687 -132667 -116145
15807 -116145 -166566 -140637 -99074 -71381 -118363 -160600 -176352 -127711 -91569 -50095 21271
15796 21271 63656 28051 60856 51072 -21352 12814 62945 -28469 -93505 -123315 -135362 -54945
15784 -54945 25420 37363 -1566 53477 90591 116498 46521 -34105 -2738 -20020 -42962 -54070
15772 -54070 -157000 -180966 -126247 -59929 -69760 -88309 -71570 -142980 -90746 -56531 -36846 -11736
15760 -11736 -67980 -63824 -112036 -103933 -76952 -15523 -31528 -103704 -6418 65267 28592 17758
15748 17758 49745 73260 1344 -69484 -126657 -136598 -131636 -70873 -22005 56923 79278 69346
15736 69346 43834 54333 -4495 -66863 -56643 -47251 -86762 -74188 -91834 -25088 83925 194510
15724A94510j4549r7115j02235m5243N9061N188l5392k6448L7380M8533r8725
15713g5035P0834J03080N0593m2462l8920Q239j8937L6589K8482m8270o7514K1514
15701B8193Q820j6462m5770q327J3463o0035L3038P4279r022M1266M2415o331
15689I5527l2642j3127n7574M9323M4653J3915m4936q2814m4078K3476M5036p261
15677a0502M8805O1386L4015j00504p1298j5599j9657n7514N6299M0451L845l342
15665c3615r233m3039o1876k2102M3377M4594N0184n7642O1315K2300n3057n8907
15653a17701Q152O0637P309M5866M5464N010o7618r5185J194M0694O5043L2046
15641C0911M158L0696K6070J5256j0678M3464J3594n1730n0190m1652k3608J19172
$$ plain form
15724 194510 179961 82846 -19389 -64632 -5571 -383 -35775 -62223 -24843 23690 -75035
15713 -75035 -4201 98879 149472 107010 68090 76329 57392 93981 122463 74193 6679 28193
15701 28193 37013 20551 -25219 -33546 -20083 -80118 -47080 27199 18177 59443 101858 95527
15689 95527 62885 49758 -7816 41507 86160 100075 55139 -27675 -71753 -48277 -3241 -10502
15677 -10502 38303 99689 133704 33200 -38098 -53697 -73354 -130868 -74569 -34118 -30273 -33615
15665 -33615 -42848 -85887 -147763 -169865 -126488 -81894 -31710 -89352 -28037 -5737 -58794 -117701
15653 -117701 -109549 -48912 -41603 4263 49727 54737 -12881 -108066 -106872 -66178 -1135 30911
15641 30911 35069 65765 91835 107091 96413 139877 153471 101741 51551 9899 -13709 105463
15629A05463L3638j32796p3527k7246M6151j62n8217k9243Q2478O3557Q2697J18222
15617B11015K7534r4612r5306n0023l691j2974J2891o3R11L4584l7809q0423j37315
15604b25281L3689O0309M9519J0651L4866P4742L6319L3427N4047k3013n8143
15593H1132n5239p7039o0102K059n2849R3756N8030m6721J1929m885J2169j5186
15581e2946J7316l8568k6636J14966Q5424N521p5947l5562N4621M5296k9179n644
15569E8662o4100q9329K2244M5379L5577M5327r1086j3293K1977N3739j0515k8297
15557a3715k5107m1461M8618K3808m1277q8706Q4583M8305j9443k4603p9144L5893
15545i2249J23637k3101p7382j884Q8042K5957J9143p1743j15762l2073Q3292
$$ plain form
15629 105463 139101 6305 -67222 -94468 -48317 -48479 -106696 -135939 -53461 10096 92793 211015
15617 211015 238549 143937 48631 -1392 -5083 -18057 -5166 -5229 -4318 30266 -7543 -87966 -225281
15604 -225281 -191592 -131283 -81764 -71113 -36247 38495 74814 108241 162288 139275 81132
15593 81132 25893 -51146 -111248 -109189 -162038 -68282 -10252 -56973 -45044 -49929 -37760 -52946
15581 -52946 -35630 -74198 -100834 14132 99556 105077 29130 -6432 48189 93485 64306 58662
15569 58662 -5438 -94767 -72523 -27144 8433 53760 -37326 -50619 -28642 25097 14582 -13715
15557 -13715 -38822 -80283 -31665 -7857 -49134 -137840 -53257 -4952 -24395 -48998 -128142 -92249
15545 -92249 31388 8287 -69095 -70979 17063 43020 62163 -9580 -125342 -157415 -74123
15534g4123J08386Q537k9059J6528m5586j00525N5032O2545J3418n0049p7075
15523a11971j1713M6568P2813J5810k1386K0383q9579p577j6207K5822K3750P430
15511d5857J3167p724k8211P3085K858j0754o0433K5144N1122r2593k9248j1876
15499a21320k5522M7121Q4229l7228n8109J09790K5938l4508M2223M7928q0466
15488G6q9238n9018J04584N5955M4247J8637k5537o4726J5609O9067Q812l1258
15476D7210k4236n3314o5697M4503K9862j4440O7661L4354l5559J00316M0327
15465A70987j06344j32516j28778M3131R7433J4030M6094K9555l0875O7007o5789
15454C935r3691J29099L2136o7888R694j9562K0715m1028L8768L4208m1327q1016
$$ plain form
15534 -74123 34263 42800 13741 30269 -15317 -115842 -60810 1735 15153 -34896 -111971
15523 -111971 -123684 -77116 -4303 11507 -9879 10504 -79075 -86652 -102859 -77037 -53287 -45857
15511 -45857 -32690 -40414 -68625 4460 7318 -3436 -63869 -38725 12397 -80196 -109444 -121320
15499 -121320 -146842 -99721 -15492 -52720 -110829 -1039 24899 -9609 32614 80542 76
15488 76 -89162 -148180 -43596 12359 56606 75243 49706 -15020 589 69656 78468 47210
15476 47210 22974 -30340 -96037 -51534 -21672 -36112 31549 65903 30344 130660 170987
15465 170987 64643 -67873 -196651 -153520 -56087 -42057 4037 33592 2717 69724 3935
15454 3935 -89756 39343 71479 3591 13285 -6277 14438 -26590 12178 46386 5059 -75957
15442g5957O842k7229j1644N2248P4472l2733n1807k2526n5057J4253L5818M8708
15430d4612p1396j08796L8897Q1219L6845n832m041n15L7661O8373k2283r4615
15418h9095j48279m7133l328j663N0196J06687J16872k4134L8411M5750M7765
15407I2049k7838k1916j1458k0720O452K964o1115l4516l6047L498N0102k8329
15395h6874M803N5147K6409n8200R9500O3917J5083n6781P883K7574J02937n3082
15383A48316j61899n9691n8582O3510J12556M7288q944r6L0003k1532J3932j5929
15371H8932j28853j0637l4297o3088L4426K0260J3574P9154p6396o8920k0400
15360a66245Q9358J32809k0075j6146j4522k3333k6768p0051q554M2535m5140
$$ plain form
15442 -75957 -69115 -96344 -107988 -55740 18732 -14001 -65808 -88334 -143391 -129138 -93320 -44612
15430 -44612 -116008 -224804 -185907 -104688 -67843 -73675 -77716 -78231 -40570 27803 5520 -89095
15418 -89095 -237374 -284507 -287835 -289498 -239302 -132615 -15743 -39877 -1466 44284 92049
15407 92049 64211 42295 30837 10117 16569 19533 -41582 -76098 -112145 -108647 -58545 -86874
15395 -86874 -82071 -26924 -515 -58715 40785 104702 119785 63004 70887 98461 201398 148316
15383 148316 -13583 -73274 -131856 -68346 44210 91498 82554 82458 112461 90929 104861 88932
15371 88932 -39921 -50558 -84855 -147943 -113517 -93257 -79683 -529 -76925 -145845 -166245
15360 -166245 -76887 55922 35847 19701 5179 -18154 -44922 -114973 -123527 -80992 -126132
15349a26132m2950M9076P6410m6359r755Q2096K1236o8364l9338K8166N278o5898
15337a36534j8641P6404Q5400M9583m5577J6112J8882j304l8397k9458L2444k1071
15325a2157j1465Q7984K0706J6712m8567p7522k4315L2164J5524p9529j4322K6290
15313f8497Q3681j6082Q713L170m462K1638N3696m8813m0462K8299n8484n1697
15301h9300K1212q5102M5648K821J8938Q7836k023o3361j9438Q859k810r406j5366
15288a01492k4485r9907o0401J5068J02906o878p525L1484J864N0345q342M5734
15276f1629R819K284K3791l7968j7307o4781J9066L5850M3391K2824J9904k9691
$$ plain form
15349 -126132 -169082 -120006 -43596 -89955 -99710 -17614 3622 -64742 -104080 -75914 -70636 -136534
15337 -136534 -155175 -78771 6629 56212 10635 26747 45629 44325 5928 -23530 8914 -12157
15325 -12157 -23622 64362 85068 101780 53213 -24309 -48624 -16460 -936 -80465 -94787 -68497
15313 -68497 15184 -898 7815 10985 6523 28161 81857 33044 -7418 20881 -37603 -89300
15301 -89300 -68088 -153190 -107542 -104721 -85783 2053 30 -63331 -82769 -73910 -76720 -86126 -101492
15288 -101492 -125977 -225884 -286285 -271217 -168311 -175189 -182714 -151230 -149366 -99021 -107363 -61629
15276 -61629 -51810 -49526 -25735 -63703 -81010 -145791 -126725 -90875 -47484 -24660 -4756 -34447
$$ [...]
##END NTUPLES=NMR SPECTRUM
##END=
