##TITLE=Analysis number 314707
Compound Code mo 07044
Book Reference 407/79
Project Code adrs
Chemist Name andyw
##JCAMPDX= 6.0         $$ Bruker NMR JCAMP-DX V2.0
##DATA TYPE= NMR SPECTRUM
##DATA CLASS= NTUPLES
##ORIGIN= Bruker BioSpin GmbH
##OWNER= NMR
$$ XWIN-NMR		Version 3.5
$$ Mon Oct 24 14:54:16 2005 GMT Daylight Time (UT+1h)  MAYBRIDGE\NMR@NMR_250MHZ
##.OBSERVE FREQUENCY= 250.131544655141
##.OBSERVE NUCLEUS= ^1H
##.ACQUISITION MODE= SIMULTANEOUS (DQD)
##.ACQUISITION SCHEME= undefined
##.AVERAGES= 16
##.DIGITISER RES= 18
##SPECTROMETER/DATA SYSTEM= dpx250
##.PULSE SEQUENCE= zg30
##.SOLVENT NAME= DMSO
##.SHIFT REFERENCE= (INTERNAL, DMSO, 0, 16.568)
##AUDIT TRAIL= $$ (NUMBER, WHEN, WHO, WHERE, WHAT)
$$ ##TITLE= Audit trail, XWIN-NMR		Version 3.5
$$ ##JCAMPDX= 5.01
$$ ##ORIGIN= Bruker BioSpin GmbH
$$ ##OWNER= NMR
$$ C:\u/data/dgb/nmr/ADRS/11320/pdata/1/auditp.txt
$$ ##AUDIT TRAIL=  $$ (NUMBER, WHEN, WHO, WHERE, WHAT)
(   1,<2005-10-24 14:53:38.69 +100>,<MAYBRIDGE\NMR>,<NMR_250MHZ>,
      <created by zg, POWCHK disabled, PULCHK disabled
       configuration hash MD5:
       62 19 C7 07 E1 42 D1 B7 37 6C 3D D0 77 39 F9 E6
       data hash MD5: 64K
       9C 4F 2F 14 3E 6E F4 A4 F7 71 F5 B8 DF 6C 5E 01>)
(   2,<2005-10-24 14:53:54.74 +100>,<MAYBRIDGE\NMR>,<NMR_250MHZ>,
      <Start of raw data processing
       ef LB = 0.3 FT_mod = 6 PKNL = 1 SI = 32K 
       data hash MD5: 32K
       6F 25 D8 A2 23 1A FC FE 3F 56 E2 88 65 B4 CD E3>)
(   3,<2005-10-24 14:54:00.57 +100>,<MAYBRIDGE\NMR>,<NMR_250MHZ>,
      <apk 
       data hash MD5: 32K
       4E 59 49 FC 89 FA 79 E2 E7 6B E6 C6 41 D4 7F B9>)
(   4,<2005-10-24 14:54:02.32 +100>,<MAYBRIDGE\NMR>,<NMR_250MHZ>,
      <abs ABSG = 5 
       data hash MD5: 32K
       40 D1 9F F5 DD 2D 23 1B 5B EE 1A 45 06 FE FB 55>)
$$ ##END=
$$ 
$$ hash MD5
$$ E4 15 D8 4A ED EC 41 92 DB BD 7A 60 B6 89 F5 53
##$RELAX= 
##$RELAX= 
##$RELAX= 
##$RELAX= 
##$RELAX= 
##$RELAX= 
##$RELAX= 
$$ Bruker specific parameters
$$ --------------------------
##$DU= <C:\u>
##$EXPNO= 11320
##$NAME= <ADRS>
##$PROCNO= 1
##$TYPE= <nmr>
##$USER= <dgb>
##$AMP= (0..31)
100 100 100 100 100 100 100 100 100 100 100 100 100 100 100 100 100 100 
100 100 100 100 100 100 100 100 100 100 100 100 100 100 
##$AQSEQ= 0
##$AQ_mod= 3
##$AUNM= <au_zg>
##$AUTOPOS= <26 >
##$BF1= 250.13
##$BF2= 250.13
##$BF3= 250.13
##$BF4= 250.13
##$BF5= 500.13
##$BF6= 500.13
##$BF7= 500.13
##$BF8= 500.13
##$BYTORDA= 1
##$CFDGTYP= 0
##$CFRGTYP= 5
##$CHEMSTR= <none>
##$CNST= (0..31)
1 1 145 1 1 1 1 1 1 1 1 1 1 1 1 1 1 1 1 1 1 1 1 1 1 1 1 1 1 1 1 1 
##$CPDPRG= <>
##$CPDPRG1= <>
##$CPDPRG2= <>
##$CPDPRG3= <>
##$CPDPRG4= <mlev>
##$CPDPRG5= <mlev>
##$CPDPRG6= <mlev>
##$CPDPRG7= <mlev>
##$CPDPRG8= <mlev>
##$CPDPRGB= <>
##$CPDPRGT= <>
##$D= (0..31)
0 1 0 0 0 0 0 0 0 0.06 0 0 0 0 0 0 0.0002 0 0 0 0 0 0 0 0 0 0 0 0 0 0 
0 
##$DATE= 1130162016
##$DBL= (0..7)
120 120 120 120 120 120 120 120 
##$DBP= (0..7)
150 150 150 150 150 150 150 150 
##$DBP07= 0
##$DBPNAM0= <>
##$DBPNAM1= <>
$$ [...]
##$SUBNAM7= <"">
##$SUBNAM8= <"">
##$SUBNAM9= <"">
##$SW= 20.6930455092707
##$SWIBOX= (0..15)
0 0 3 0 0 0 0 0 0 0 0 0 0 0 0 0 
##$SW_h= 5175.983436853
##$TD= 65536
##$TD0= 1
##$TE= 296.16
##$TE2= 300
##$TE3= 300
##$TEG= 300
##$TL= (0..7)
0 120 120 120 120 120 120 120 
##$TP= (0..7)
150 150 150 150 150 150 150 150 
##$TP07= 0
##$TPNAME0= <>
##$TPNAME1= <>
##$TPNAME2= <>
##$TPNAME3= <>
##$TPNAME4= <>
##$TPNAME5= <>
##$TPNAME6= <>
##$TPNAME7= <>
##$TPOAL= (0..7)
0.5 0.5 0.5 0.5 0.5 0.5 0.5 0.5 
##$TPOFFS= (0..7)
0 0 0 0 0 0 0 0 
##$TUNHIN= 0
##$TUNHOUT= 0
##$TUNXOUT= 0
##$USERA1= <user>
##$USERA2= <user>
##$USERA3= <user>
##$USERA4= <user>
##$USERA5= <user>
##$V9= 5
##$VALIST= <valist>
##$VCLIST= <CCCCCCCCCCCCCCC>
##$VD= 0
##$VDLIST= <DDDDDDDDDDDDDDD>
##$VPLIST= <PPPPPPPPPPPPPPP>
##$VTLIST= <TTTTTTTTTTTTTTT>
##$WBST= 1024
##$WBSW= 4
##$XGAIN= (0..3)
0 0 0 0 
##$XL= 0
##$YL= 0
##$YMAX_a= 317412
##$YMIN_a= -433261
##$ZGOPTNS= <>
##$ZL1= 120
##$ZL2= 120
##$ZL3= 120
##$ZL4= 120
##$ABSF1= 16.568
##$ABSF2= -4.125174
##$ABSG= 5
##$ABSL= 3
##$ALPHA= 0
##$AQORDER= 0
##$ASSFAC= 0
##$ASSFACI= 0
##$ASSFACX= 0
##$ASSWID= 0
##$AUNMP= <proc_1d>
##$AZFE= 0.1
##$AZFW= 0.1
##$BCFW= 0
##$BC_mod= 0
##$BYTORDP= 0
##$COROFFS= 0
##$CY= 12.5
##$DATMOD= 1
##$DC= 0
##$DFILT= <>
##$DTYPP= 0
##$F1P= 14.0000005364418
##$F2P= -0.99999901652339
##$FCOR= 0.5
##$FTSIZE= 32768
##$FT_mod= 6
##$GAMMA= 0
##$GB= 0
##$INTBC= 1
##$INTSCL= 1
##$ISEN= 128
##$LB= 0.3
##$LEV0= 0
##$LPBIN= 0
##$MAXI= 10000
##$MC2= 0
##$MEAN= 0
##$ME_mod= 0
##$MI= 0
##$NCOEF= 0
##$NC_proc= -6
##$NLEV= 6
##$NOISF1= 0
##$NOISF2= 0
##$NSP= 0
##$NTH_PI= 0
##$NZP= 0
##$OFFSET= 16.568
##$PC= 1
##$PHC0= -82.38409
##$PHC1= 9.503413
##$PH_mod= 1
##$PKNL= yes
##$PPARMOD= 0
##$PSCAL= 4
##$PSIGN= 0
##$REVERSE= no
##$SF= 250.129988493753
##$SI= 32768
##$SIGF1= 0
##$SIGF2= 0
##$SINO= 400
##$SIOLD= 32768
##$SREGLST= <1H.DMSO>
##$SSB= 0
##$STSI= 32768
##$STSR= 0
##$SW_p= 5175.98343685301
##$SYMM= 0
##$S_DEV= 0
##$TDeff= 65536
##$TDoff= 0
##$TI= <Analysis number 999999
Compound Code 99
Book Reference 9
Project Code 9>
##$TILT= no
##$TM1= 0
##$TM2= 0
##$TOPLEV= 0
##$USERP1= <user>
##$USERP2= <user>
##$USERP3= <user>
##$USERP4= <user>
##$USERP5= <user>
##$WDW= 1
##$XDIM= 32768
##$YMAX_p= 449698836
##$YMIN_p= -1082315
$$ End of Bruker specific parameters
$$ ---------------------------------
##NTUPLES= NMR SPECTRUM
##VAR_NAME=  FREQUENCY,     SPECTRUM/REAL,   SPECTRUM/IMAG
##SYMBOL=    X,             R,               I
##VAR_TYPE=  INDEPENDENT,   DEPENDENT,       DEPENDENT
##VAR_FORM=  AFFN,          ASDF,            ASDF
##VAR_DIM=   32768,         32768,           32768
##UNITS=     HZ,            ARBITRARY UNITS, ARBITRARY UNITS
##FACTOR=    0.157963299565203, 1,           1
##FIRST=     4144.1538478319, 0,             0
##LAST=      -1031.82958902111, 0,           0
##MIN=       -1031.82958902111, -1082315,    0
##MAX=       4144.1538478319, 449698836,     0
$$ Real data points
##PAGE= N=1
##DATA TABLE= (X++(R..R)), XYDATA
$$ [...]
17424D1105412l250166l000949k837774k560156k181353k120604j926311j612234
17416B1615865j390324j245112r10951p98529o81230n29032k44228k74678j13665
17407A5428116J79682K68435K14433M41855O58818P51354Q78384J373217K030095
17398B2224389K178715K949950L853807N066365P064815R763422J2967975J6679131
17390H2748569K0673077K3377913K3467217K0107360J4365913Q114181L608922
17383A96463152L04237m459315j1082546j7059736k0401872k0681395j8407901
17376A04674624j4893944j1886772r489612p413899n889708m950570m252984l606312
17368D2290823l071267l246149l030125k942332k798708k475700k224921j947690
$$ plain form
17424 41105412 37855246 34854297 32016523 29456367 27275014 25154410 23228099 21615865
17416 21615865 20225541 18980429 18069478 17270949 16589719 16060687 15816459 15541781 15428116
17407 15428116 15607798 15876233 16090666 16532521 17191339 17942693 18821077 20194294 22224389
17398 22224389 24403104 27353054 31206861 36273226 43338041 53101463 66069438 82748569
17390 82748569 103421646 126799559 150266776 170374136 184740049 192854230 196463152
17383 196463152 196767389 192308074 181225528 164165792 143763920 123082525 104674624
17376 104674624 89780680 77893908 68404296 60990397 55100689 50150119 45897135 42290823
17368 42290823 39219556 35973407 32943282 30000950 27202242 24726542 22501621 20553931
17360B0553931j705720j813398j638578j188084j056279r07768o39660q19331
17352A0785113q49568o25222o85310m81736m78919l42393m09469m79122m48558
17343E984816m32404n78549m05253j76220k64067j81333k06781j42040J081j76135
17333C423115l24392m13762l89548N0686Q039k07379J45412m2312l30006j93197
17323A726656j72813j21402J88003J57042M1179J09556O1949J716p854p291j00440
17312A876301k05479N3029o789k99967j97417L31797o3135o79Q8004m5502q6341
17301A443822k12887k37042K1838J66618J52471q1745j92205r6888l60101J56216
17291G60097J41604j3041j61527P3338j21399j14284k6644R2508Q7181K67715
$$ plain form
17360 20553931 18848211 17034813 15396235 14208151 13151872 12244104 11604444 10785113
17352 10785113 9935545 9310323 8625013 8143277 7664358 7321965 6912496 6433374 5984816
17343 5984816 5552412 4973863 4568610 4392390 4128323 3946990 3740209 3598169 3599250 3423115
17333 3423115 3098723 2684961 2295413 2346099 2354138 2146759 2292171 2249859 1919853 1726656
17323 1726656 1553843 1432441 1620444 1777486 1818665 1928221 1990170 1991886 1984032 1976741 1876301
17312 1876301 1670822 1723851 1717062 1417095 1219678 1551475 1488340 1487661 1575665 1530163 1443822
17301 1443822 1230935 993893 1015731 1182349 1334820 1253075 1060870 963982 603881 760097
17291 760097 901701 888660 727133 800471 679072 564788 538144 630652 717833 985548
17281I85548j71291k83574J01211J02755j0311k63929r8704M0375J87006k7912
17271E61174p1586J23009j37320l17048j64834r67L12735L02544N5368k08972
17261D54103K90m7366j63876K7698K38430K62227j59169o5192p6989J056J76826
17250F48038l5081J65387J94193r2682p4983p7680n8235k23989R8683N7403o380
17239E94674j26828J20953q282q7175Q1845o4951k0804j51127k78982n0600K21817
17228B30540J00462J74385R3143n0781o3397J2314k6580k85956k1740J77236l7891
17217C01735J05622K5918j22416M5060N114R0265n9402l2401j46266l51337O4197
17206g3911L05431q3681k66597J12272p071L34378L52676p625k76177k16118p9767
$$ plain form
17281 985548 814257 530683 631894 734649 724338 460409 361705 402080 589086 561174
17271 561174 489588 612597 475277 158229 -6605 -7572 305163 607707 663075 454103
17261 454103 454393 407027 243151 270849 509279 771506 612337 547145 470156 471212 648038
17250 648038 612957 778344 972537 879855 804872 727192 668957 444968 543651 601054 594674
17239 594674 467846 588799 580517 493342 575187 510236 489432 338305 59323 8723 230540
17228 230540 331002 505387 598530 547749 484352 496666 470086 184130 162390 339626 301735
17217 301735 407357 433275 310859 355919 361033 451298 391896 359495 213229 -138108 -73911
17206 -73911 231520 147839 -118758 -6486 -13557 320821 673497 665872 389695 173577 93810
17195I3810Q9266j21386K6324P9707j65598k75626p5403L60591R9772M5616j10791
17184D6282R8543L84996N6901j78924j05833n3075r2045J39811K66058J72520
17174G35234L1680n7490m5704j35860Q5986l44926k73837J37603L60813J18664
17164F12163n9457j26035k4053p6079O5269Q2969j28157j05871p5011j44250j47427
17153a25939l1154K66305P386q7302k6094o6588J6119K35746K02684j70632k56801
17142c6270N9127J18194K5986n4511J09548K34230M4051K0802j79745m1144k21970
17131G8298j31076j90306j3756l4369N256M3551O4734l6051r2804j729Q1124k5006
17119b52134L05312K00829K56733k5436k43084l0313m0194K7069N8945o7109j05304
$$ plain form
17195 93810 183076 61690 88014 167721 2123 -273503 -348906 11685 111457 157073 46282
17184 46282 144825 529821 586722 407798 301965 248890 156845 296656 562714 735234
17174 735234 766914 709424 663720 527860 613846 268920 -4917 132686 493499 612163
17164 612163 552706 426671 402618 326539 391808 474777 346620 240749 165738 21488 -125939
17153 -125939 -157093 109212 116598 29296 3202 -63386 -47267 188479 391163 220531 -36270
17142 -36270 22857 141051 167037 112526 222074 456304 500355 521157 341412 300268 78298
17131 78298 -52778 -243084 -256840 -291209 -285953 -242402 -177668 -213719 -306523 -308252 -227128 -252134
17119 -252134 53178 254007 510740 485304 242220 211907 171713 198782 257727 190618 85314
17108H5314L8021J80444j85869k38940n6879J09813J81730Q0988M0175m5699L1309
17097B20407n1487P910m0402k509o309R0467O4896k56210N4219n5061n3517J12638
17085H5042p1844Q1712j07811k41706m6431J24603j4246J91149k8203q0492J81524
17074G3297m2745O2368J37495K13833j68594k75133M2901j20783Q2296R4138j1528
17063H7545Q8591M9322j03601J9045P9573k03641q9251p4317R2780q6370o9528
17052b09852K5268R1534J58276j2517k60509J70591N778j43148j97022K08632
17042a62969r6820J0439q3937P7511J7441n5347m3012J92388N7768r2320j0815
17031a89673J67674j085j41841P1898j56247J43313j25411m3454J39044J5410
$$ plain form
17108 85314 123335 303779 117910 -121030 -177909 -68096 113634 194622 234797 189098 220407
17097 220407 168920 176830 136428 133919 127610 218077 282973 26763 80982 25921 -27596 85042
17085 85042 13198 94910 -12901 -254607 -301038 -176435 -190681 468 -27735 -108227 73297
17074 73297 30552 92920 230415 444248 275654 521 43422 -77361 4935 99073 87545
17063 87545 176136 225458 121857 140902 220475 16834 -72417 -146734 -53954 -140324 -209852
17052 -209852 -184584 -93050 65226 52709 -207800 -37209 -31431 -174579 -371601 -162969
17042 -162969 -259789 -249350 -333287 -255776 -238335 -293682 -336694 -144306 -86538 -178858 -189673
17031 -189673 -21999 -23084 -164925 -93027 -249274 -105961 -231372 -274826 -135782 -120372
17021a20372K9310j63004J86032J46708p3925O845l651j55975J47032O0165j25834
17010f6669m738P0424p0188r0646J30420J97260l6672j40870j0846P8528j56838
16999a00835k02233n27n1643K81943L27351l0176j62848o3057j55832j48902K00738
16988a06021K97002J75447k06158j66104k75573j90898q953J53730J67863j4883
16978a74548K08930J53361L797k27731l40368k41267m4225J72942P3633N6396
16968c59080K00844K03583K81777J62454k18379p950n2002k30425l20885N5534
16958b84529J79781K3703k26985m2448K95613M8057J868Q1010k343q4753m147
16947a5173j42377L65386j59524k05603J8123n4737j1688J5813L26819J61585
$$ plain form
17021 -120372 -91062 -254066 -68034 78674 4749 11594 7943 -148032 -1000 59165 -66669
17010 -66669 -71407 -983 -71171 -161817 -31397 165863 129191 -11679 -22525 56003 -100835
16999 -100835 -303068 -303595 -355238 -73295 254056 223880 61032 -2025 -157857 -306759 -106021
16988 -106021 190981 366428 160270 -5834 -281407 -472305 -481258 -327528 -159665 -174548
16978 -174548 34382 187743 191540 -36191 -376559 -617826 -662051 -489109 -415476 -359080
16968 -359080 -158236 45347 327124 489578 271199 263249 211247 -19178 -340063 -284529
16958 -284529 -104748 -81045 -308030 -350478 -54865 -6808 -4940 76070 73727 -11026 -15173
16947 -15173 -157550 207836 48312 -157291 -139168 -193905 -205593 -189780 137039 298624
16937B98624j12595j45619k9229j46771J49603K17999J96062j43235j81775J94257
16927B97321K47702p5836J17205L07280J35571K5530j15797P1304o4778J2330
16917I57832j23704O2011l772k55873k42739k0526l50374r8547l3826Q105J24902
16906B3489K13026O1215M210j70233J87375J55945r6020N4797j49069j45957k53866
16895a15088j0464N8666K059j6719J507J83334K56924p3727j68585O1436L26480
16884E05823k90718k30143l2665j48605j72833J64670K38919j23182r0492m4341
16874b23567J12697L10339J42847n4209K389J66671j26640r2604K65270K63344
16864G66537K22088m2894R1300J0229k9750l24741l28035j5109J20145o9483j16733
$$ plain form
16937 298624 186029 40410 11181 -135590 14013 232012 428074 284839 103064 297321
16927 297321 545023 469187 586392 893672 1029243 1054773 938976 1010280 945502 957832
16917 957832 834128 896139 892367 636494 393755 373229 22855 -75692 -109518 -101413 23489
16906 23489 236515 297730 301940 131707 319082 475027 379007 433804 284735 138778 -115088
16895 -115088 -125552 -66886 -64827 -81546 -80039 103295 360219 286492 117907 179343 505823
16884 505823 215105 -15038 -47703 -196308 -369141 -204471 34448 -88734 -179226 -223567
16874 -223567 -110870 199469 342316 288107 290496 457167 330527 237923 503193 766537
16864 766537 988625 945731 1037031 1047260 1017510 692769 364734 349625 469770 400287 283554
16853B83554J10084j88631k35364J45780J55486j95432p6360N0707m3509J25517
16843A31832M592q026k0312J3014J4092J574R3950j53110r3308P9999Q8698K2704
16831A75699j44767R4538K05019K6212n2938m5179j13036p9420P4771j32751n0302
16820d2154m2052J57542M0122N6098k8594n9292K1770R3337o1067j69688j70476
16809b04454o2331J69400J43303l0661J34456J16246m2570r4898K644J24593N6802
16798C12530K83228K29540j98011m08833n4224j18284j81357j01731j07520j25761
16788d70423J16293L9471J38855Q0133K93809q4489k77197l9336J82923M7487
16778B7526Q9753R746j56119r6701Q1484J79914K3694k23204j53196R0305K01500
$$ plain form
16853 283554 393638 205007 -30357 115423 270909 75477 -883 49824 6315 131832
16843 131832 136424 128398 108086 121100 135192 136766 230716 77606 -15702 64297 152995 175699
16831 175699 30932 125470 330489 356701 303763 258584 145548 66128 140899 8148 -42154
16820 -42154 -84206 73336 113458 169556 140962 81670 103440 196777 135710 -33978 -204454
16809 -204454 -266785 -97385 45918 15257 149713 265959 223389 128491 131135 255728 312530
16798 312530 595758 825298 627287 218454 164230 45946 -135411 -237142 -344662 -470423
16788 -470423 -354130 -314659 -175804 -95671 198138 113649 -163548 -202884 -19961 27526
16778 27526 117279 127025 -29094 -125795 -44311 135603 159297 -63907 -217103 -126798 74702
16767G4702J44614o5215k711k6175J74094l01558j67638L9806R3337J63003K02311
16756C28570o4018j00054j40196n1834j77080M2627J04674k3135J04389L147k27203
16745b00113K943K725j05025L20015j18235M3690K23801j3967O470l19531j58422
16734c15649m4423Q9663K15500P9073N8069r9634j399J76885J99821j12860j04307
16723A40739Q3000m8069n8466l8350k06461l8763K3573J26279J46108q997n4055
16712F6538k85248J9765M2444n1126O0994R7968j00264M7966K00560j69960o6145
16701a36508R0788j53367j10508J85216J69063o0269o2613K28030j96433j87850
16691b34451J77429k3286n0830q274j21407j35384j5459N0403M501L0217n0771
$$ plain form
16767 74702 219316 154101 151390 125215 299309 -2249 -169887 -130081 -36744 126259 328570
16756 328570 264552 164498 24302 -27532 -204612 -161985 -57311 -80446 23943 27090 -200113
16745 -200113 -197170 -194445 -299470 20545 -97690 -54000 169801 155834 162304 -157227 -315649
16734 -315649 -360072 -270409 -54909 24164 82233 -17401 -18800 158085 357906 245046 140739
16723 140739 223739 175670 117204 78854 -127607 -166370 -142797 -16518 129590 120593 66538
16712 66538 -218710 -198945 -156501 -207627 -146633 -48665 -148929 -100963 99597 -70363 -136508
16701 -136508 -45720 -199087 -309595 -124379 44684 -15585 -78198 149832 -46601 -234451
16691 -234451 -57022 -80308 -131138 -139412 -260819 -396203 -411662 -361259 -356758 -326541 -377312
16680c77312K6861K3488n3684J44209M9075o1593q393q99j02618l8732N3425j90962
16668e37135L23654j2223q2522N8945P3268K19809j1562n7911j03003p1417m1015
16657b41112o5145r1514K7865j47545j25355K50217n5415J8934n7431k27941J38744
16646e75698K02864K3156j90434j17422J24838J51712J07553k23920q6562l2944
16636f16857K41096n6200j04275K23753M1982j55908k9052n6388J32318L1032
16626c48499J30628K97876P8424j15649k42899p2058O9089o6669K07655j4694
16616g6796J99443J319O178l5310k94067r4379L6754l7542K07925L80410o4379
16605B29556j17448j99733k37173M8475J55528m1905J22070r6474k23980R8919
$$ plain form
16680 -377312 -350451 -326963 -380647 -236438 -187363 -248956 -257349 -258248 -360866 -399598 -346173 -537135
16668 -537135 -213481 -225704 -308226 -249281 -176013 43796 32234 -25677 -128680 -200097 -241112
16657 -241112 -306257 -397771 -369906 -517451 -642806 -392589 -448004 -429070 -486501 -714442 -575698
16646 -575698 -372834 -349678 -540112 -657534 -532696 -380984 -273431 -497351 -583913 -616857
16636 -616857 -375761 -431961 -536236 -312483 -270501 -426409 -455461 -511849 -379531 -348499
16626 -348499 -217871 80005 158429 42780 -200119 -272177 -203088 -269757 -62102 -76796
16616 -76796 122647 123966 130144 94834 -199233 -293612 -256858 -294400 -86475 293935 229556
16605 229556 112108 -87625 -324798 -276323 -120795 -162700 -40630 -137104 -361084 -262165
16595b62165J63959j31484P6613k8020J12779J47044q9999J55461J39318j18198
16585A65308o2677j03550k48562r7952L9661n3233k64592j28638J44406J53483
16575d56346J61863J06073j34995L02356K11469o0213k65005k14473L6570o6530
16565c79231l3021J26441l4078q89j2717K23223J37773k68159k46589N9456m5536
16554d73327J45191O0853Q2928j7115N4274j82902k19523R0857J69038N8824r4123
16543c25025J64546P1273J80729M4282j40007n5907O2119N1557J28350k48803
16533f6886m1285N6122J16754k7084K1622O1425N4252m1652J39053k0139k50482
16522A700k02277J06589j10361j9001M11J33980J67857j2556M3715M6331M471
$$ plain form
16595 -262165 -98206 -229690 -153077 -181097 -68318 78726 -11273 144188 283506 165308
16585 165308 102631 -919 -249481 -347433 -307772 -361005 -625597 -754235 -609829 -456346
16575 -456346 -294483 -188410 -323405 -21049 190420 130207 -134798 -349271 -312701 -379231
16565 -379231 -412252 -285811 -319889 -320778 -333495 -110272 27501 -240658 -487247 -427791 -473327
16554 -473327 -328136 -267283 -184355 -201470 -147196 -330098 -549621 -458764 -289726 -230902 -325025
16543 -325025 -160479 -89206 91523 135805 -4202 -60109 2010 53567 181917 -66886
16533 -66886 -108171 -52049 64705 37621 59243 120668 174920 133268 272321 252182 1700
16522 1700 -200577 -93988 -204349 -223350 -222939 -88959 78898 66342 110057 156388 160859
16511A60859q6378k57664q122j54570K4412o4880M3957K82568L6696j14751j1127
16500a49000K14349j844j66384k37744p4068k7327J24464L70059L37629j34666
16490B55468k97916k5432k4582j42570Q4426K5128k19117k02222K09700J53728
16480a83389n2135J93986K14305J61125j20416j75447j17497J60241J13895l73769
16470a79101j86202P4595R8536j66305J92064K27995P018Q7940j31654l9057j31402
16459a45573L9214J8334J02634J00584J4174M4160j45036j535L5613j24291J9775
16448d1947M6253r4416J45426p79j04939J07249L46258l0289r1117l04926P5857
16437E2630J25099K1662p996o4973m4192j18138o6645J45436O0735j04745j15781
$$ plain form
16511 160859 74481 -183183 -191305 -345875 -321463 -386343 -342386 -59818 -23122 -137873 -149000
16500 -149000 65349 63505 -102879 -340623 -414691 -442018 -317554 52505 390134 255468
16490 255468 -42448 -67880 -92462 -235032 -150606 -125478 -344595 -546817 -337117 -183389
16480 -183389 -235524 -41538 172767 333892 213476 38029 -79468 80773 194668 -179101
16470 -179101 -365303 -290708 -192172 -358477 -166413 61582 68600 156540 24886 -14171 -145573
16459 -145573 -106359 -88025 14609 115193 129367 173527 28491 26956 62569 -61722 -41947
16448 -41947 4306 -90110 55316 54537 -50402 56847 403105 372816 281699 -23227 52630
16437 52630 177729 199391 191395 126422 82230 -35908 -102553 42883 103618 -1127 -116908
16426a16908K02186J85569j74848L0991M0683L35038J70027j19386k81795k46926
16416B4631k34172j15905K4602j00430P9029J47032J50334R1488K2686j04544
16406a5249j76872n5689P5859J47006J62538l9307l82340k03368J25859J81929
16396a79634j26425p9885J02297P8709K52834n3210m8247P4023K21397N9704l51541
16385d9978j07130l2022J28198q1140j45623k30296J72819J65423j69334L2739
16375c16344p342K32665K09775j63824q2472j14704n0065j00402k2997K02796
16365b12914K20547n2986n1332M8324q5728j99287p5246J54731j170k48769m0325
16354e44155r1671L2023K69610J11939J73344q7756Q0629K03075p2868r9938P7741
$$ plain form
16426 -116908 85278 270847 95999 126990 167673 502711 672738 553352 271557 24631
16416 24631 -209541 -325446 -300844 -401274 -322245 -175213 -24879 66609 89295 -15249
16406 -15249 -192121 -247810 -171951 -24945 137593 98286 -284054 -487422 -361563 -179634
16396 -179634 -306059 -385944 -283647 -204938 47896 -5314 -53561 20462 241859 301563 -49978
16385 -49978 -157108 -189130 -60932 -142072 -287695 -517991 -345172 -179749 -349083 -316344
16375 -316344 -323686 -91021 118754 -45070 -127542 -242246 -292311 -392713 -415710 -212914
16365 -212914 7633 -45353 -96685 -48361 -134089 -333376 -408622 -253891 -255061 -503830 -544155
16354 -544155 -635826 -603803 -334193 -222254 -48910 -136666 -56037 147038 74170 -25768 51973
16343E1973j0327j1890k2767K8486J6976j33797j05240K6945K06630m0280N1906
16332E8615l1032M6993k14779K9159q4922K08844J75005k86220J32936j95650
16322a61051j24935K6866J9077k201j44260R3141K30872m9581j87463L9139L18034
16311E7638n6466l10467j6035K37431l0804j7204P3058j3894j8345P678q1812
16300a69222N277R5891N1263p3958J96181L77952n3773j86308j5758k1156k21318
16289a4929j86470k35673m151K71376k8044k25525r0594l7755Q2075K31844R5882
16278a41964J83746L00518R6159j43214j07813j56237j40265j32875j05616J99955
16268a47606K28553j30488k19357j9355K78607j49131k22345j27820J70759K31017
$$ plain form
16343 51973 41646 29756 6989 35475 52451 -81346 -186586 -159641 46989 6709 58615
16332 58615 27583 74576 -140203 -111044 -195966 12878 187883 -98337 34599 -161051
16322 -161051 -285986 -259120 -240043 -242244 -386504 -293363 -62491 -112072 -299535 -260396 57638
16311 57638 1172 -309295 -325330 -87899 -118703 -135907 -62849 -76743 -95088 -87410 -169222
16300 -169222 -163945 -68054 -16791 -90749 105432 483384 429611 243303 227545 206389 -14929
16289 -14929 -201399 -437072 -441223 -169847 -197891 -423416 -514010 -551765 -469690 -237846 -141964
16278 -141964 41782 342300 438459 295245 187432 31195 -109070 -241945 -347561 -147606
16268 -147606 80947 -49541 -268898 -288253 -9646 -158777 -381122 -508942 -338183 -107166
16258a07166J26820j02003l02001k47958J11637L07639j5721J87969K0833o037
16248b5988l4111k4143J59691o0426j62487l55352K1827L74783M23570m2686o0079
16237B14599l0523k23140M9215L03075k22902k92368j24024J96756L13836j55594
16227B8930k29534j6427J87825j96776k4068N1681O6896J24282j58530q1047K61278
16216A4510M5011j93536j04242J38933J37337R3217M5715k30517k87472k61781
16206f02825p1194L4713K38690j5585p2240K02370K63943R3795j21540J0941O7565
16195B8633j37705J52671J13269r987j00364m2902l0239j15507j64666k4949K0343
16184c11403k4474J71609j00535n9045K2320R8438k41685j73684L64824K08459
$$ plain form
16258 -107166 19654 -82349 -384350 -632308 -520671 -213032 -228753 -40784 -19951 -25988
16248 -25988 -60099 -84242 75449 15023 -147464 -502816 -480989 -106206 317364 274678 214599
16237 214599 184076 -39064 10151 313226 90324 -202044 -326068 -129312 184524 28930
16227 28930 -200604 -217031 -29206 -225982 -250050 -198369 -131473 -7191 -165721 -246768 14510
16216 14510 59521 -134015 -238257 -99324 38013 131230 176945 -53572 -341044 -602825
16206 -602825 -674019 -639306 -400616 -416201 -488441 -286071 -22128 71667 -49873 -38932 28633
16195 28633 -109072 43599 156868 146881 46517 3615 -26624 -142131 -306797 -331746 -311403
16184 -311403 -335877 -164268 -264803 -323848 -301528 -203090 -444775 -618459 -253635 -45176
16174d5176q069k32287L4358j9132Q1107J94149J00960j40546j39094J95249K34462
16163B55981J23733M8502k2464j0220L557p4569r2790k38508j22867m3832J8769
16152a54708o7621j50072p1786O7976O8353K97807J83806k07631k94424j49826
16142d78126M7582M9979K10949M01353n9077k95259k21877R2325J45905J18618
16132A2372k9959j51966k07712L9945J65654Q3842j77927J15481J66361r7940
16122h1849q5434j02632J70046J14408j62860J10222Q46k8178j0061J83296K3264
16111A31068j40639j73485R327Q8858Q6826K86459K14354m56382l20386o5322
16101c39322J96834K83236k27252k61017j41405J01857M3752K6742R5249J5589
$$ plain form
16174 -45176 -53245 -285532 -251174 -270306 -189199 4950 105910 -34636 -173730 21519 255981
16163 255981 379714 428216 405752 395532 399089 324520 231730 -6778 -129645 -173477 -154708
16152 -154708 -222329 -372401 -444187 -376211 -307858 -10051 173755 -33876 -328300 -478126
16142 -478126 -430544 -380565 -169616 231737 172660 -122599 -344476 -252151 -106246 12372
16132 12372 -17587 -169553 -377265 -337320 -171666 -87824 -265751 -150270 16091 -81849
16122 -81849 -167283 -269915 -99869 14539 -148321 -38099 -37253 -65431 -75492 107804 131068
16111 131068 -9571 -183056 -173729 -84871 1955 288414 502768 46386 -274000 -339322
16101 -339322 -142488 140748 -86504 -347521 -488926 -387069 -343317 -316575 -221326 -205737
16091b05737j39581Q8906O3092j34618k5529Q1292K15137L7453j11267m9584J50851
16080b9585J55782K2418j24763l6552Q8349r9830m9438K3974j21438j30754M5793
16069b56044J20886N0061K7271J44304p0443Q7898l6278p2129J2832k6706k08552
16058b26900P9605J39388M8041j51913r2061j54999j58090K1757L06266M3523
16048a45383L3604M8320k43357J08112J07711k23131J10998l938j95087M8300
16038c53851j30611K7747L55427J90994J896q698J71802L5845k36761j85083n7138
16027a88431J27437J21163P1985K18403P2973k22367J13309m4371k32377j10959
16017g3235j57849l33432k7503j3688J49863K09940P9930L04930o7557k33631
$$ plain form
16091 -205737 -345318 -256412 -193320 -327938 -353467 -272175 -57038 -19585 -130852 -180436 -29585
16080 -29585 126197 148615 23852 -12700 75649 -24181 -73619 -49645 -171083 -301837 -256044
16069 -256044 -135158 -85097 -57826 86478 16035 103933 67655 -4474 8358 -18348 -226900
16058 -226900 -147295 -7907 40134 -111779 -203840 -358839 -516929 -495172 -188906 -145383
16048 -145383 -111779 -63459 -306816 -198704 -90993 -314124 -203126 -207064 -402151 -353851
16038 -353851 -484462 -456715 -101288 89706 91602 82904 254706 290551 53790 -131293 -188431
16027 -188431 -60994 60169 132154 350557 423530 201163 314472 270101 37724 -73235
16017 -73235 -231084 -564516 -592019 -605707 -455844 -245904 -165974 138956 71399 -162232
16007a62232l6240r1631j66453j01162J51154K53234K97473J01686k08246j11900
15997g4317j02378r5850J9495K73769P967q4434r4112L52203J63909j43813l29301
15986a06862J00419J65390J57450k65105n5375j31465m6942L5174l6582r8316
15976b82214J15871J44921P8259K9504M5121J2672k86300j24935j2198K593q6100
15965c62806p4983K59381K49108m1359R2703r4278r8536k28696J15282L7994q7120
15954b33310J73469Q6149k9357M5858l388l449j59023j03584j31737J824J76223
15943a80325n8795K62672J12033J35301j27037K241K30244j91082l03807J0026
15933a08529J97310p4974k4603p6505j69622O5158J41104k3193j06923L7341J17688
$$ plain form
16007 -162232 -198472 -290103 -456556 -557718 -406564 -153330 144143 245829 37583 -74317
15997 -74317 -176695 -272545 -253050 20719 28686 -55748 -149860 202343 366252 222439 -106862
15986 -106862 -6443 158947 316397 51292 -4083 -135548 -182490 -147316 -183898 -282214
15976 -282214 -166343 -21422 56837 86341 131462 144134 -142166 -267101 -279299 -276706 -362806
15965 -362806 -437789 -178408 70700 29341 122044 27766 -70770 -299466 -184184 -146190 -233310
15954 -233310 -59841 26308 -3049 42809 39421 35972 -123051 -226635 -358372 -356548 -180325
15943 -180325 -239120 23552 135585 270886 143849 146090 376334 185252 -118555 -108529
15933 -108529 88781 13807 -10796 -87301 -256923 -191765 -50661 -73854 -180777 -143436 -25748
15922b5748J19810j35303M7345o6280J4832N282j2474l4230j23015J4120J83779
15911a1882m7422J59745R0649J86131Q5876j73939j32243o4303j12028J17531
15901I8115J05482q2901N5462P4101l92324m3931o011p6613K93247K23827M8588
15890B97042j76083j97341m8385q6374j515J3542K06663j22580M8010j05210K8752
15879a43479K43171J20828j41769l2095l9344j69208O9305j14901J14290J99457
15869A06255J01600J9417k49980j93216j52563O6653J18251K46295J24769j07141
15859H0340j68532j16553J02443L5771k8779j41532O9173N2881K76651J27885
15849B89748Q6926j09809Q8104J42176o7959l03679n2585R1256P8960r2982o1659
$$ plain form
15922 -25748 94062 -41241 6104 -60176 -45344 -40062 -52536 -86766 -209781 -195661 -11882
15911 -11882 -59304 100441 191090 377221 463097 289158 156915 92612 -19416 98115
15901 98115 203597 120696 176158 250259 -142065 -185996 -192007 -268620 24627 248454 297042
15890 297042 120959 -76382 -124767 -211141 -212656 -199114 7549 -115031 -67021 -172231 -143479
15879 -143479 99692 220520 78751 46656 7312 -161896 -92591 -207492 -93202 106255
15869 106255 207855 227272 -22708 -215924 -368487 -301834 -183583 62712 187481 80340
15859 80340 -88192 -204745 -102302 -66531 -95310 -236842 -167669 -114788 161863 289748
15849 289748 376674 266865 354969 497145 429186 125507 72922 164178 243138 150156 88497
15838H8497k6458K01882j34155k56466j86099J18268K7429J81199p6190O2173
15828H0n4256O0724K09268r5419k8463j48859J32771K85106N0123j62217k69139
15817b0281j11087K1797M3142J27856k2240J26732Q7539k38912k89411J42848
15807a32017J32813J5863n3623j02496m5262P7413p0450r791Q9751j8122j97179
15796c13100K7523j21591n20N383J70856J3564K715j54146N931J59738Q5582R0549
15784b7516k691J2461J48575o5095n044Q6007j59409J03283K38466j90649m04540
15773b66152j1117Q5019J29557L9042j30931m4690j33630k64308M6744M10934
15763a39532J39974J25517K44119j67753k03989j67393N8668L1780j73715J8066
$$ plain form
15838 88497 62039 263921 129766 -126700 -312799 -194531 -167102 14097 -62093 80
15828 80 -54176 6548 215816 120397 91934 -56925 75846 360952 411075 248858 -20281
15817 -20281 -131368 -109571 -66429 61427 39187 165919 253458 14546 -274865 -132017
15807 -132017 796 16659 -36964 -139460 -184722 -107309 -177759 -187550 -97799 -115921 -313100
15796 -313100 -285577 -407168 -407688 -402305 -231449 -217885 -215170 -369316 -363385 -203647 -118065 -27516
15784 -27516 -30207 -17746 130829 65734 60690 146697 -12712 90571 329037 138388 -266152
15773 -266152 -277269 -192250 -62693 -23651 -154582 -199272 -332902 -597210 -550466 -139532
15763 -139532 442 125959 370078 202325 -1664 -169057 -110389 -78609 -252324 -234258
15753b34258Q8396J9039J47069O5362J42392l43252j31107p4290L2795J04803
15743a83051K20776K03308p0135k06130P1500M6475r1930j83332P2107J76991
15733E6579K04020j28359m7989K73674J00298k31931j84124l9286o2930J06679
15723D6631K13155j7830K5219j87635p0494j2552j10491N9656J14068J36110l9035
15712A56802N3003n2700n5318M3802M3819q0679r6487n3193k2966J74307N6331
15701A66721k36183r7737J57175P1049J8056l2630j34496Q0554N287k39750q2861
15690c24815J28141j78768J71066K32706P8831J37207j91244l5439J14222J5025
15680A46932k87158j28406k6357q6943j40273Q5939N61J03607J84448K9155J11472
$$ plain form
15753 -234258 -145862 -126823 20246 85608 228000 -115252 -246359 -320649 -287854 -183051
15743 -183051 37725 241033 170898 -35232 36268 82743 -9187 -192519 -120412 56579
15733 56579 260599 132240 84251 357925 458223 226292 42168 2882 -60048 46631
15723 46631 259786 241956 267175 79540 9046 -3506 -113997 -54341 59727 195837 156802
15712 156802 209805 157105 101787 145589 189408 108729 12242 -40951 -63917 110390 166721
15701 166721 -69462 -167199 -10024 61025 79081 46451 -88045 -7491 -2204 -241954 -324815
15690 -324815 -196674 -375442 -204376 28330 107161 244368 53124 17685 131907 146932
15680 146932 -140226 -268632 -294989 -381932 -522205 -436266 -435705 -332098 -147650 -118495 -7023
15669g023l0473j02081k28863k3909M9128R5210K42146K1725p5304j37383j49800
15658c46627M5456j51657J00789J74784K09355O8524l6427j74428j80621l1697
15648c22549Q3048j8395P934J42429m7994O6233j06103j1077M7510R3526q7824
15637a53262n0884j68234r933j9705L8587K361j12j9751M8549L0101J57564J51973
15625G254K9436m2276J49254o9271j18501M1962Q6579J1550J9124j72323R6088
15614C8876r024p5005j18760j01304J32771J66411J32636K3935L0879j68449j13444
15603f0478j50910n1182J60830K15027n8466j90004o8401K51665K0949j97630
15593a28600O4097R6202j81303j1661k4956k0466J50725N6940J1076j16410j82148
$$ plain form
15669 -7023 -37496 -139577 -368440 -392349 -343221 -248011 -5865 15860 -59444 -196827 -346627
15658 -346627 -301171 -452828 -352039 -177255 32100 100624 64197 -110231 -290852 -322549
15648 -322549 -239501 -257896 -249962 -107533 -155527 -89294 -195397 -206474 -158964 -65438 -153262
15637 -153262 -204146 -372380 -382313 -402018 -363431 -361070 -361182 -380933 -332384 -302283 -144719 7254
15625 7254 36690 -5586 143668 74397 -44104 -2142 84437 95987 115111 -57212 38876
15614 38876 29852 -45153 -163913 -265217 -132446 33965 166601 190536 221415 52966 -60478
15603 -60478 -211388 -262570 -101740 113287 54821 -135183 -203584 48081 69030 -128600
15593 -128600 -64503 31699 -149604 -161265 -186221 -206687 -55962 978 12054 -104356 -286504
15582b86504J38689j439M7743P1600R4766j22360o2142P7755R5228J20432j36986
15571C6782O5351o9613K6379R8321r0567k03163q2268J49818k21792j04391J38152
15560b56991J21952J90845J26415K3092l35419m2669N85q0556R8670q8562L05285
15549F2647L02830j07888j24011j53021k99693j15865l0593k1892O8351J32962
15539b86173J06191J91976J79635K4787P6225l462j44872j3039p6180j89592j87466
15528c21970r129j4522Q532p9910O0283K7810n9307Q5487M5294o4383j80491o3911
15516e66217M0905J21214J68141K92004K270j29408P2269m3465q0801j7531J4148
15505a26471K66494J17979p0369j25278M8623j1175k12315L2662K15274J40060
$$ plain form
15582 -286504 -147815 -149254 -101511 -29911 64855 -57505 -119647 -41892 53336 173768 36782
15571 36782 102133 32520 58899 157220 66653 -136510 -218778 -68960 -290752 -395143 -256991
15560 -256991 -135039 55806 182221 205313 -130106 -172775 -172190 -252746 -154076 -242638 62647
15549 62647 365477 257589 133578 -19443 -319136 -435001 -465594 -487486 -419135 -286173
15539 -286173 -179982 11994 191629 216416 292641 289179 144307 131268 55088 -134504 -321970
15528 -321970 -331099 -345621 -337089 -416999 -356716 -328906 -388213 -302726 -257432 -321815 -502306 -566217
15516 -566217 -525312 -404098 -235957 56047 58317 -71091 1178 -42287 -123088 -140619 -126471
15505 -126471 140023 258002 187633 62355 110978 99803 -112512 -79850 135424 275484
15495B75484k46526r841m3065k94620j54041K99220J15568J08913J33218M1993
15485B26303j33496j24666J21546K33775P6302p5032j64006l1980p0275j9393
15475C9078P106r2625J6127J86983J44102r9331M4290j43129o2544J09567O9746
15464B19370J31168j54881j54377q2615j61759K8579J34931M2213l44802r0375
15454d32548J89616N5861j94671N5609p4719O6446J29116K46810J27277j61911
15444F886p1587J89950K00801J04876k25660k62774N9010K64545k6909l17691
15434g8553j30728l3676n1299J1339K43293Q2177j75983k03385j17079L58234
15424i5660K13157J01572J68133j16384j46112J11402K3598q3574j31742k26422
$$ plain form
15495 275484 28958 19117 -23948 -318568 -472609 -173389 -57821 51092 184310 226303
15485 226303 92807 -31859 89687 323462 399764 324732 160726 128746 58471 39078
15475 39078 46184 -46441 -30314 156669 300771 201440 245730 102601 40057 149624 219370
15464 219370 350538 195657 41280 -41335 -203094 -174515 -39584 2629 -342173 -432548
15454 -432548 -242932 -187071 -381742 -326133 -400852 -334406 -205290 41520 168797 6886
15444 6886 -64701 125249 326050 430926 205266 -57508 1502 266047 239138 -78553
15434 -78553 -209281 -242957 -294256 -282917 -39624 42553 -133430 -336815 -453894 -95660
15424 -95660 117497 219069 387202 270818 124706 236108 259706 176132 44390 -182032
15414a82032m4522J07076p9295q6241R8106K67260j00317O5047M01340N1143k67641
15403B29924k33122K59897R6317j18662k33095j52732J86182L561l01348K2217
15393b40861j03237q3817J10430m1214L0492L79703J29996J03214j36236n29797
15383c81327n2646L53858J87670J20379o4105j29586J51223j39851j68628j18178
15373b41191J20207J621l414p8510q0470J0286n747K67228M3600j72454j20331
15362b59175J76616j32841r3321Q8582J96094J4169r5288M0114J77886p4994j27767
15351h9925o2066M5902l1254P4111J2163N0684M5907K99115n8117j63507O1779
15340A84792r9079P2859j14514l5549J47200J52661J68385l01299K6139J02205
$$ plain form
15414 -182032 -226554 -119478 -198773 -285014 -186908 80352 -19965 45082 446422 497565 229924
15403 229924 -3198 256699 353016 234354 1259 -151473 34709 38270 -263078 -240861
15393 -240861 -344098 -427915 -317485 -358699 -328207 51496 181492 284706 148470 -381327
15383 -381327 -433973 -80115 107555 227934 163829 34243 185466 45615 -123013 -241191
15373 -241191 -120984 -119363 -122777 -201287 -281757 -271471 -277218 -9990 33610 -138844 -259175
15362 -259175 -82559 -215400 -308721 -220139 -24045 -9876 -105164 -65050 112836 37842 -89925
15351 -89925 -151991 -106089 -137343 -63232 -51069 -385 45522 344637 286520 123013 184792
15340 184792 85713 158572 44058 8509 155709 308370 476755 175456 201595 303800
15330C03800j06923j47653M9106j23793L2204K84601Q0044q3819j97041j21939
15320c1413J19451K35844J43682J77398j40086r5277O1118j02420k18368j4825
15310A35104j60337m818J0038L1893j1835o439k19023P8753l0291p9347k96q7473
15298c44071J62008J84454J43362j20770r888m7296p523q961J73937N1358Q9955
15287B66565R574j31315j61186J1343k0854m3964q332J12456n7119K36078j08899
15276A04347k54720n22j5106J03094L34489N7000n0710j14757j75300l03142j8551
15265c33878K06386L56540j0342r7520o5663J90793j64157q3909K41512P9226
15255C18988M4802r9490m58161j97052J40203J34858p4053J7982J56403L475k03027
$$ plain form
15330 303800 196877 49224 98330 -25463 6741 291342 371386 287567 90526 -31413
15320 -31413 88038 323882 467564 644962 504876 409599 470717 368297 149929 135104
15310 135104 -25233 -30051 -20013 11880 45 -6394 -225417 -146664 -176955 -256302 -256598 -344071
15298 -344071 -182063 2391 145753 24983 15095 -32201 -39724 -48685 125252 176610 266565
15287 266565 276139 144824 -16362 -5019 -25873 -69837 -78169 34287 -22832 213246 104347
15276 104347 -150373 -150895 -166001 -62907 271582 328582 277872 163115 -12185 -315327 -333878
15265 -333878 -127492 229048 218706 121186 55523 246316 82159 -1750 239762 318988
15255 318988 363790 264300 -193861 -390913 -250710 -115852 -189905 -171923 -15520 -12045 -215072
15244b15072J25041M33946k9786m98477l3400j44050j99782N758n2770K39568
15234c69024R7457K8249J18614q3742n2427K24838K84574j45624j64285K59364
15224A97994o4153j08411j31394M9472k725J22882M9217j09198k16014J75430
15214c6900N6319r737j17732l20060Q917K05748J73549J66893m4156k04076l64293
15203d85528P8598N3218L9758J21347J68634j73247j1824r2238j48562J47655
15193c02189J28355N9146J2047J32807p9969k72097k1652l5285L4061J33788p9228
15182b90216J81623L71266K32822j2972j39871k4357k51049r2397j99919n6115
15172b81185J27978o2540K19220M921j15197R1863L9075k04746m4349J83598P6677
$$ plain form
15244 -215072 -90031 343915 314129 -184348 -217748 -361798 -561580 -555822 -608592 -369024
15234 -369024 -271567 -243318 -124704 -208446 -260873 -36035 248539 102915 -61370 197994
15224 197994 133841 25430 -105964 -56492 -59217 63665 112882 3684 -212330 -36900
15214 -36900 19419 9682 -108050 -428110 -419193 -213445 -39896 126997 82841 -121235 -485528
15203 -485528 -406930 -353712 -313954 -192607 -23973 -197220 -209044 -301282 -449844 -302189
15193 -302189 -173834 -114688 -102641 30166 -49803 -321900 -343552 -378837 -344776 -210988 -290216
15182 -290216 -108593 262673 495495 482523 342652 318295 67246 -25151 -225070 -281185
15172 -281185 -153207 -215747 3473 8394 -106803 -14940 24135 -180611 -224960 -41362 35315
15161C5315l010q0902O5380R577L7353K42791k18871k10502L7717J02182o7851
15150e0821J43023m7682q445K3351P5009n3948J41363j30573j78234j67431J6945
15139b37443K44941Q7716j6606K83858N197M996J01106j46040k90852J57282J34680
15128C28835M1959P8345j42296l7417j4865k74892q2577J48520M2050K9057r7720
15117A8999K26472J72680k19909l05017K1818P616K860p2225j4204l1064J14552
15106g7422J37281J63957r8631k9990M4727j35740J96332j11307K3725p4339k88804
15095b50211L0495J73072O0999J4530q3068J59544p1125L3515P3523k1093J97331
15084C17512l4127j88329l26860J75J92565p3178L255o0237K9910L05885j14528
$$ plain form
15161 35315 32305 -48597 16783 26360 63713 306504 87633 -122869 -85152 17030 -50821
15150 -50821 92202 44520 36075 59426 134435 80487 221850 91277 -86957 -254388 -237443
15139 -237443 7498 95214 78608 362466 367663 372659 473765 327725 36873 194155 328835
15128 328835 370794 449139 306843 269426 254561 -20331 -102908 45612 87662 116719 18999
15117 18999 245471 418151 198242 -106775 -84957 -77341 -74481 -146706 -160910 -191974 -77422
15106 -77422 59859 223816 125185 95195 139922 4182 200514 89207 112932 38593 -250211
15095 -250211 -219716 -46644 14355 28885 -54183 105361 34236 67751 141274 120181 317512
15084 317512 283385 95056 -231804 -231629 -39064 -112242 -108987 -169224 -139314 166571 52043
15073E2043l6465o8080J10711J12842M0718l34m0657O5366Q035R7643Q384q9651
15061B60555q1136m9084n8434k07124j78478M9635m7978K08437P5516N8777j07348
15050g6662J53420J67427j37830k45014k03396j1239P7087K03822L332L237j0522
15039g6338j921L63913N62j71314L0573k02711j25821O3763N266p5753M6352K19961
15027G6532L70700J2818o8837k1436m00803k81181k7969K52268Q5416J98035R2121
15016B87664k27553O1267K5929Q2937J27828J64541K76150j75405l04246o0677
15006B58435L0890k02438M3598j3263o8635J96215m057j14470l74801k17005J2044
14995d53487J77628J77927J09842j2392J4489o7326j31486n9591P1882J41500
$$ plain form
15073 52043 15578 -52502 58209 171051 211769 211435 170778 236144 244179 341822 350206 260555
15061 260555 179419 130335 71901 -135223 -313701 -264066 -312044 -103607 -28091 30686 -76662
15050 -76662 76758 244185 106355 -138659 -342055 -353294 -276207 -72385 -69053 -65816 -76338
15039 -76338 -78259 285654 286216 114902 145475 -57236 -183057 -119294 -114028 -189781 -143429 76532
15027 76532 447232 460050 391213 369777 -31026 -312207 -340176 -87908 -2492 195543 287664
15016 287664 60111 121378 147307 230244 358072 522613 798763 623358 319112 258435
15006 258435 289325 86887 130485 117222 48587 244802 240745 126275 -248526 -465531 -453487
14995 -453487 -275859 -97932 11910 -482 14007 -53319 -184805 -244396 -172514 -31014
14985c1014J03763O7730J27418R5672n5673j37607r7994K9205n0180r5267k53
14974d4200p2978o5646Q1172J0143j54701J55207p424K5194m7698o8228J90682
14963A523K17934j4542k81814j70571r0001L6903M5336J55215N1927m4473k6024
14952a18587p6349M9413J07925m23J03640k790r5338n3966j02258J0108j9192
14941a97817l6752M3602J90085R2205L0087J36609o0990j67171K456r0142r7669
14930a55497K65410l4080j47906j5109J6711J02023L1599j75174J50168L19973
14920C58118J99320j76983j89583p4024R1108Q8307J4189J88194r9455k45228
14910A53963j65801O5925L5970n7751m5427j5509R5820r4224K06288K32540J91734
$$ plain form
14985 -31014 72749 140479 267897 363569 307896 170289 72295 101500 51320 -43947 -44200
14974 -44200 -117178 -182824 -101652 -91509 -246210 -91003 -98427 -73233 -120931 -189159 1523
14963 1523 219457 204915 -76899 -247470 -337471 -300568 -255232 -100017 -48090 -92563 -118587
14952 -118587 -194936 -145523 -37598 -38021 65619 62829 -32509 -86475 -188733 -178625 -197817
14941 -197817 -234569 -190967 -882 91323 121410 258019 197029 29858 32314 -57828 -155497
14930 -155497 109913 75833 -72073 -87182 -70471 31552 63151 -112023 38145 358118
14920 358118 557438 380455 190872 116848 207956 296263 310452 498646 399191 153963
14910 153963 -11838 54087 90057 32306 -13121 -28630 67190 -27034 179254 411794 603528
14899F03528r7760j61022N5829o2854R0026J10188N1337k93404j40066n2807j56773
14888e3778N9134j07862j53387K9486J18079J78349J90463k4503l5245r8124j73345
14877g0733j06963J22028J97919M1517j69986j24796K88865K29280q1960m3246
14867B81925q3869r678j60305m7856K12775J14117K3348M930l7244K7355k76083
14856D9415q2766M034K72136J89250j28375J8122L5804k68913k26250O6339K14194
14845A42990o0703j31952J30932K43006n9399J04695o720j13069J91343m8597
14835C92526j84260j70970j36181o3908J13308K00797M7520j36087J19255N5784
14825B37784k28513J15883J41360k90861m7593J2407J45220j6492q3878P8583
$$ plain form
14899 603528 505768 344746 400575 337721 427747 537935 589272 295868 155802 102995 -53778
14888 -53778 5356 -102506 -255893 -226407 -108328 70021 260484 235981 200736 102612 -70733
14877 -70733 -177696 -55668 142251 183768 13782 -111014 177851 407131 325171 281925
14867 281925 198056 188378 28073 -19783 192992 307109 330457 335387 298143 325498 49415
14856 49415 -33351 -29317 242819 432069 303694 321816 357620 88707 -137543 -71204 142990
14845 142990 82287 -49665 81267 324273 264874 369569 362849 249780 441123 392526
14835 392526 208266 37296 -98885 -162793 -49485 151312 198832 62745 182000 237784
14825 237784 9271 125154 266514 -24347 -71940 -59533 85687 69195 -14683 63900
14815F3900j25985P4351K68485n1257O4558J09330J30115Q9706j03154k05684
14805C14365m0936L3709j15513j20441k02464K4956P9459L0154j10103J47220
14795D0406L07050J23753j53056j17842k31245k04471j5168K67183J18849N9884
14785A95343L7456j53209k5949R0324L3093l6158Q5483J2117j38652M5676j5807
14774A29717j4484O4030j77380k7068R7197l796L3392p233o0670P5289o2921j80309
14762a34236q4571j21264M1339K08933L18295K10152K66726k80520O483J15527
14752E46864m9736j56220m31083m0882K98070J56047J30409j65128l40886J60035
14742A07490J41979L9643j8651k08098m4008M2099K00344O1710j0464l11183o7362
$$ plain form
14815 63900 -62085 12266 280751 229494 294052 403382 533497 623203 520049 314365
14805 314365 273429 307138 191625 71184 -131280 -106324 -26865 3289 -106814 40406
14795 40406 347456 471209 318153 200311 -30934 -235405 -250573 16610 135459 195343
14785 195343 232799 79590 53641 143965 177058 140900 226383 238500 99848 145524 129717
14774 129717 115233 179263 1883 -25185 72012 68216 101608 94375 33705 108994 46073 -134236
14762 -134236 -218807 -340071 -298732 -89799 228496 438648 705374 424854 431337 546864
14752 546864 497128 340908 -90175 -131057 167013 323060 453469 288341 -52545 107490
14742 107490 249469 289112 270461 62363 18355 60454 260798 322508 312044 861 -66501
14731f6501Q5743q8833J33006k5039J65695J0795k63765n1310q1647J86606j7881
14720a3131R3307J67060P2820j39569M5498M0901J6232m1119n5779J48054K5672
14709C59946M0850r0312j53107j51491J90322L02786O1413j92685l08320j25477
14699f6075N9798M19888K7065k29897j20581M0869p1017k95052J60982J94784
14689A20764K89870P2254k34441J55208L0197mr3924m5137P3244j9668N7004p9376
14677C25991l52439M2018n106J22202J53676J3806J36029J36492J2746j66633
14667D18782k69608P413p2504K21169Q3815Q5748k2273J04215J21909j72037k79487
14656B27142q8191L2278j47290j43021j6998o7615K921J75482M1812l5270J72934
$$ plain form
14731 -66501 19242 -69591 63415 38376 204071 214866 -48899 -100209 -181856 4750 -13131
14720 -13131 80176 247236 320056 180487 225985 266886 283118 241999 186220 334274 359946
14709 359946 400796 310484 157377 5886 196208 498994 560407 367722 59402 -66075
14699 -66075 -6277 413611 440676 210779 90198 131067 60050 -235002 -74020 120764
14689 120764 410634 482888 248447 403655 433852 433848 339924 294787 368031 348363 405367 325991
14677 325991 -26448 15570 10464 132666 286342 300148 436177 572669 585415 418782
14667 418782 149174 156587 84083 305252 389067 474815 452542 556757 678666 506629 227142
14656 227142 138951 171229 23939 -119082 -136080 -203695 -200774 -25292 16520 -18750 154184
14645A54184N8879k42028j09196o7532Q7305O9188P146R1881m3063Q1901q9118
14634d53J00565m2019K33469K34042j47431k62055q9421j03249P7601P6064m7975
14623B9138J07812m4466j0623J16862J12148k30746j31113K94626N0588K5157
14613C19383j9214j79424k19585J23746K03122L6650q8972J29288n7144q2169
14603A65681j16606q0386L64014L6970j22107j86779k57068K6899K62896M1087
14593A34601j01739J02051J37602J23090M7669l27058k22863L654q14J04828L8850
14582C9871J07780O4886l98663k8698J60701q1492p9819o7800J15723M77144K03197
14571E12830k01721j23092L0917K41250j26747L2331R9224l9465j13005p3027
$$ plain form
14645 154184 213063 -28965 -138161 -205693 -118388 -49200 -42054 49827 6764 88665 -453
14634 -453 100112 58093 291562 525604 378173 116118 26697 -76552 1049 77113 29138
14623 29138 136950 92484 81861 198723 310871 80125 -50988 243638 294226 319383
14613 319383 300169 120745 -98840 24906 228028 264678 175706 304994 247850 165681
14603 165681 49075 -31311 332703 369673 247566 60787 -196281 -169382 93514 134601
14593 134601 32862 134913 272515 395605 443274 116216 -106647 -102993 -103807 1021 39871
14582 39871 147651 212537 -186126 -214824 -54123 -135615 -215434 -283234 -167511 309633 512830
14571 512830 311109 188017 218934 460184 333437 365768 464992 425527 312522 239495
14561B39495J9605r5298j14599r3612K93253j035j50112p1256q4448j53054J73663
14550c7398R8944r8200K66545J52860o8699l3761j486k72527K39850j6472j25712
14539A03944R4392K412Q6306L5593m8964q5097J60220P2361j23763M2835R7666
14528D37905J48924k25289o0394J16998Q1114l6068l2444n8400j2842J77853k36474
14517C00883j87803N9237K62641R9398k67616n8650m4981P4724M50373K0554k10845
14506D97915l03153r5054K18132q0700J3846J7060j26026L9146k44378k26488
14496b89700K26200K27233r3611j23777J31014J17418r2398j15627k0543K6430
14486g361p3647o133J90481K55234k1904Q5036j22452j38750l171N4905r5095
$$ plain form
14561 239495 259100 163802 49203 -44409 248844 247809 97697 26441 -58007 -211061 -37398
14550 -37398 61546 -36654 229891 382751 314052 280291 278805 6278 246128 229656 103944
14539 103944 198336 200748 287054 322647 273683 188586 348806 421167 297404 340239 437905
14528 437905 586829 361540 301146 418144 499258 463190 430746 372346 359504 537357 300883
14517 300883 113080 172317 434958 534356 266740 208090 163109 237833 688206 708760 497915
14506 497915 194762 99708 317840 237140 250986 268046 142020 181166 -63212 -289700
14496 -289700 -63500 163733 70122 -53655 77359 194777 102379 -13248 -33791 -7361
14486 -7361 -81008 -87141 103340 358574 336670 421706 299254 160504 157333 212238 117143
14475A17143j86532l1095P2421R1391P8679r5994j0590J24522L1551p5586j59578
14464d3668R6235K26468q8651r7129k0945m9506R8157J77010j0442j70357q614
14453A08558j64022R8239K30039Q6711p4565j95984N062j55463J22516L8418J7389
14442A16898K55007J01037k5766m2473K37876k0121j77763k38768j33448J0222
14432H2701P6834Q5138k73856N8976K05868J09255L5734J29393J39883K8021p9622
14421E98325l60796j77917l49J04418N5356n5057n3814P319M1623N3288j26482
14410H5914M9240J74879J1194j1446j34256o7229N2884o4444r43L57380J47495
14399F00668l1207R4848q133L2966j29050k46977k15016J92013K67262m2577j09917
$$ plain form
14475 117143 -69389 -100484 -28063 63328 142007 46013 35423 159945 191496 115910 -43668
14464 -43668 52567 279035 190384 93255 72310 22804 120961 297971 287529 117172 108558
14453 108558 -55464 42775 272814 359525 284960 88976 94038 -61425 61091 99509 116898
14442 116898 371905 472942 447176 404703 642579 622458 444695 205927 72479 82701
14432 82701 159535 244673 -29183 29793 235661 344916 380650 510043 649926 677947 598325
14421 598325 237529 59612 59263 163681 219037 163980 110166 117485 159108 212396 85914
14410 85914 135154 310033 321227 309781 175525 108296 161180 96736 95793 453173 600668
14399 600668 569461 664309 656176 689142 560092 313115 98099 290112 557374 514797 404880
14388D04880k35990r94j0048j6617P8463R5659J28695M5602J52252k99722r8307
14377B43873o6379j47390N5373K18210J71337j50984Q6162o0661J1539O6428J03322
14366E30830N9483k24579j70193J16781K5387p8690k50452L0142J25792M0576
14356B05077o7518k60063J01097L91733J94663k05023l41310k90833J87294J55453
14346G0570l6772J10972P87k3877K14559P004n7010J55723o7966n8258o1011J52835
14334D07556K52191J1506k11226r2884l7770O103j58844j41471J47997J64690
14324C47848j25312l411J6567K33075P3699k29223q1732N4815P6616q9969k34122
14313C8851j75415K9559O0070Q7384n5740K61754J29442l4024j534j68404j4949
$$ plain form
14388 404880 168890 167896 157848 141231 219694 315353 444048 489650 641902 342180 243873
14377 243873 177494 30104 85477 303687 475024 324040 410202 349541 361080 427508 530830
14366 530830 590313 365734 195541 312322 337709 259019 8567 38709 164501 205077
14356 205077 137559 -122504 -21407 370326 564989 359966 18656 -272177 -84883 70570
14346 70570 33798 144770 145557 121680 336239 343243 286233 441956 373990 315732 254721 407556
14334 407556 659747 671253 460027 367143 329373 335476 176632 35161 183158 347848
14324 347848 222536 219125 235692 468767 542466 313243 231511 286326 362942 272973 38851
14313 38851 -136564 -107005 -46935 40449 -15291 246463 375905 341881 340347 171943 156994
14302A56994K5144J66225j80644j76138Q9390q6410k50513j71416P9013J06177
14292b42178R4390o3798J80255J58379K47716k3289j22177l2417J39098N3946
14282C89925N1204l2061j42574m43655j17577J43530K59024J30807j00030J32881
14272B71474J78401j3696j58771K06310P943N0394j20261j34271q7109p7973R3990
14261B16431J53702r3503L9517M2761q4491L2402l2257Q1098K44455O3717l16240
14250C47592j77536N129j27769n1910N7760K39751J06701k06962q1228O4618k12095
14239c5949j73041J48777L1350K4434J92356L38701N7257j64223R3280L4109p2864
14228D74187j53818M2371j56349n4313R1655J50626K56588O9291j17950k16559
$$ plain form
14302 156994 182138 348363 167719 -8419 80971 -5439 -255952 -427368 -348355 -242178
14292 -242178 -147788 -211586 -31331 127048 374764 351475 229298 196881 335979 389925
14282 389925 441129 409068 266494 -177161 -294738 -151208 107816 238623 138593 271474
14272 271474 449875 436179 277408 483718 491661 542055 421794 287523 200414 122441 216431
14261 216431 370133 276630 316147 358908 274417 306819 274562 355660 600115 663832 347592
14250 347592 170056 175185 47416 -4494 53266 293017 399718 192756 111528 176146 -35949
14239 -35949 -208990 -60213 -28863 -4429 187927 526628 583885 419662 512942 547051 474187
14228 474187 320369 362740 206391 152078 243733 394359 650947 720238 602288 385729
14218C85729j17378R4390q0800L5358N5047M3916K06291j39684l3086k09729k7598
14207B12456M7044J22796m7828l36451j00069K78245J13835j83176j8116K44575
14197C33311J2769j10187q0890K9513j91523K65323o4351l08424j10462K98317
14187G3396K30725L3512n330J76684K29463L7286j43598j90136j19332J5115J95634
14176E33419j04528q6740j69870J12356K22315n0343P2768q4990r7538j20682
14166B26167o6459R546J19489J3982k12399J8686K51209J12175j07967k3011j16113
14155B25305J36472j21457k00847l7342l8748J20177N1760j48786Q5496Q3632
14145A55662O0342J77806J56725k1563j88648k80031k18814q309R2698J88429
$$ plain form
14218 385729 268351 362741 281941 317299 372346 416262 622553 482869 449783 240054 212456
14207 212456 259500 382296 334468 -1983 -102052 176193 290028 106852 88736 333311
14197 333311 346080 235893 155003 184516 -7007 258316 193965 -114459 -224921 73396
14187 73396 304121 337633 332303 508987 738450 775736 632138 442002 322670 337785 533419
14176 533419 428891 342151 172281 284637 506952 456609 529377 444387 346849 226167
14166 226167 159708 169254 288743 302725 90326 109012 360221 472396 364429 341418 225305
14155 225305 361777 240320 39473 2131 -36617 83560 135320 -13466 72030 155662
14145 155662 216004 393810 550535 528972 340324 60293 -158521 -166830 -74132 114297
14135A14297J75487j04041N0544j40134r364J1451n921J37096Q9694l9116R7822
14124C77815Q3732j67339j36553P8854K04707L6045j20194j86602j82272J7538
14114E731J2214j12287q3584J23869K66134J11265N0415j36323K71113J32747
14104F41294j7707j44068P3841o0200l1855o3769j45552O6312K19058k68011j01893
14093A67450m1972L39533L25826j42523j19325J44619J58829K9497l28040n8898
14083D74996j05753k00039O6582J46037J55958l8102R3897J43491j9329j27571
14073E90167J24164l6824k06413P4813l5784L6427J80877j85298n1395k21371
14063B69363N2022Q0785K8419R7139J23118k56869j88543q2140j2805L41496J86832
$$ plain form
14135 114297 289784 185743 236287 96153 86789 98240 92319 229415 319109 279993 377815
14124 377815 461547 294208 157655 236509 441216 477261 357067 170465 -11807 5731
14114 5731 17945 -94342 -177926 -54057 212077 323342 373757 237434 508547 641294
14104 641294 623587 479519 553360 493160 461305 397536 251984 318296 537354 269343 167450
14093 167450 125478 465011 790837 648314 528989 673608 832437 861934 533894 474996
14083 474996 369243 169204 235786 381823 537781 499679 593576 737067 717738 590167
14073 590167 714331 677507 471094 545907 510123 546550 727427 542129 490734 269363
14063 269363 321385 402170 430589 527728 650846 393977 205434 123294 110489 451985 638817
14052F38817j03994n2982j59950K4015k39817j90472J42168J32481K19242M9414
14042D58922M8353p9706k2841K11840j12399j49638j33514l5849j31519l02533
14032b48884j61289K62146L27000J38066M7451j04764j59019J49202M4554O3863
14022C58326k12753r502k0686M9050r0604K40181N9204Q6997k9267p5529j47882
14011B07535Q2201J36165m672O7765K37265J3028N9261j54510q0679j36778k13508
14000B13073Q361R3416M2318j13013K1004k1679j57545k70028j31434J71661L56950
13989B13084P9347l7469n9811Q521J76898P8906r3729q4909o5696J36763K8342
13978C80247m710P6684k04591k50861n3477J23278J01021J06794j33003J05359
$$ plain form
14052 638817 534823 481841 321891 345906 106089 -84383 57785 190266 409508 458922
14042 458922 507275 427569 404728 616568 504169 354531 221017 185168 53649 -248884
14032 -248884 -410173 -148027 178973 317039 364490 259726 100707 249909 294463 358326
14022 358326 145573 136071 115385 164435 73831 314012 373216 460213 430946 355417 207535
14011 207535 289736 425901 421229 488994 726259 739287 798548 644038 563359 426581 213073
14000 213073 221434 314850 357168 244155 265159 243480 85935 -184093 -315527 -143866 213084
13989 213084 292431 254962 195151 203672 380570 459476 365747 280838 215142 351905 380247
13978 380247 375537 452221 247630 -3231 -56708 66570 167591 274385 141382 246741
13968B46741J29113n9069l12458j27844K51868J16981Q8504l1047M0021J7433
13958C60243J51427n5862r8874j03847J54728q9248j85855k49303K11628J71355
13948B66392q0474j3074J69357m5002M3170o1266n0130j31825M5921J70527M998
13937C18594p2001L16558J4913k07618k46692n7100Q4762J41681L5664J10984
13927D39745J94738k17759k30778K80439K9583K5180J59811L2545J602j56478
13917E58628k49691j89443l2273J71500K27530K10514K31500k7781j94337j79778
13907E26369m6537k9067K4914j29078j7096J42171Q2768j18663j29738J17627
13897D23670j39332K03183J40249q8890q1020O2417K06745p9468k29673r3844
$$ plain form
13968 246741 375854 316785 4327 -123517 128351 245332 333836 302789 342810 360243
13958 360243 511670 455808 356934 253087 407815 318567 132712 -116591 95037 266392
13948 266392 185918 172844 342201 297199 340369 279103 228973 97148 143069 313596 318594
13937 318594 246593 563151 578064 370446 123754 66654 151416 293097 328761 439745
13927 439745 634483 416724 185946 466385 495968 521148 680959 713504 715106 558628
13917 558628 308937 119494 87221 258721 486251 696765 928265 900484 706147 526369
13907 526369 479832 450765 475679 346601 329505 471676 554444 435781 306043 423670
13897 423670 284338 487521 627770 538880 457860 520277 727022 647554 417881 324037
13887C24037j53223L1977K8408k51296j2188J57192J40473j44746k53350J61622
13877B8906M02970K05991j33010k6918j13408p9935N7688k7411K05984j3855o9434
13866D37568k53889r3545L2501K14898K03309J37788m0713k88445j71562M7235
13856B25145N4368R545J72733K7163j51664m2016L8653P1205K6629j46643r4804
13845A90314J62268J5278q1335j01392O8713O9546m0200k95451m4495J0328J0316
13834c6110o7260K0507L88750m0113J2138J83483J6471k83473j23165L23061L37440
13823G31729r9671k80903O5050K5931K3698M2480j1910Q408J63403m2429O9776
13812F95562j28548j49086R4676Q7489m0964k53586m442j031J79012J51307m4463
$$ plain form
13887 324037 170814 202791 231199 -20097 -32285 124907 265380 120634 -132716 28906
13877 28906 431876 637867 504857 477939 364531 284596 342284 314873 520857 507002 437568
13866 437568 183679 90134 122635 337533 540842 678630 637917 349472 177910 225145
13856 225145 279513 289058 461791 488954 337290 295274 333927 405132 431761 285118 190314
13845 190314 352582 367860 286525 185133 253846 323392 283192 -12259 -56754 -46426 -36110
13834 -36110 -103370 -82863 305887 265774 277912 461395 477866 194393 71228 394289 731729
13823 731729 632058 351155 416205 442136 465834 508314 496404 504812 668215 625786 695562
13812 695562 567014 417928 512604 600093 559129 305543 301101 300070 479082 630389 585926
13801E85926J84518q5476k13576k09369R8828J54998J30035n9763j2037j95594
13791C78490k06625o5955K38777K13571k52225k15006J94044K79547j3872j97514
13781C53232M7653J80336j51301J28761J76400j63778j63422j71442j88735O9131
13771A16835Q1140R4273L2076K60449Q9241j90951k77942m9871L39800L2927j16065
13760D11912l0584p960L8310J25885q4563J185j70050j54799R8376j21292K49702
13749C56122K02954m1861J41712J28256n7993k10355o5359K5647J4886J13632
13739F07641J5550j61355K2755M4480j52895j63817R2651o0444j88056J3605L81932
13728D52047J29282J32309K1892j2280J23559J7530j22996r6700j39513j27906
$$ plain form
13801 585926 770444 684968 471392 262023 360851 515849 645884 586121 574084 378490
13791 378490 171865 105910 344687 558258 306033 91027 285071 564618 550746 353232
13781 353232 400885 581221 429920 558681 735081 571303 407881 236439 47704 116835
13771 116835 197975 292248 324324 584773 674014 483063 205121 155250 495050 527977 411912
13760 411912 381328 373368 411678 537563 453000 454185 284135 129336 227712 106420 356122
13749 356122 559076 517215 658927 787183 729190 518835 453476 479123 494009 607641
13739 607641 623191 461836 484591 529071 376176 212359 305010 244566 56510 70115 452047
13728 452047 581329 713638 735530 723250 846809 864339 741343 644643 505130 377224
13718C77224j23182J27557J47236R3007j0123K7287k07025L2264M4519P6340N9721
13707F44825q1710J56663P0330j69302k5528L5351j25954R5402p0662j94524q630
13696C26261j30563o6274K1764J28129M44027l308k12520n8868O5557J18384l18832
13685C13757k05984J20652K2237O1547J03408K73937j72499k79523K09273Q312
13675D55117k10808L8797L11007K44535j97524j02335r930l835M1225q961o6190
13664D91098J94903K92856r8039r2796k7612m8371Q0791m5187k71644j16617j9726
13653C39656m4966O1913M3530J08693j53561j15878K2249r542o8572n4493J70520
13642B99549Q6235j49792j3200J85167J75148r807p7200j31816P9893n9213l938
$$ plain form
13718 377224 254042 381599 528835 621842 611719 639006 431981 464245 508764 585104 644825
13707 644825 563115 719778 790108 620806 595278 630629 504675 600077 529415 334891 326261
13696 326261 195698 129424 151188 279317 723344 720036 507516 448648 514205 632589 313757
13685 313757 107773 228425 250662 312209 415617 689554 517055 237532 446805 455117
13675 455117 244309 283106 594113 838648 641124 538789 528859 525024 566249 557288 491098
13664 491098 686001 978857 880818 788022 760410 712039 792830 747643 475999 359382 339656
13653 339656 294690 356603 400133 508826 355265 239387 261636 252094 183522 129029 299549
13642 299549 385784 235992 222792 407959 583107 573300 496100 364284 444177 384964 381026
13631C81026k18158k88180m715J29522L95452K54385r5136j17578j40846l3507
13621B62265o0203o9292o6307J7415K82882K74007R9164M2537j9182K7209j73767
13610F16728O3701L8580r2735o5407Q9417n3818j54574J92907J867n3294j92743
13599C90629j07660K02179o748Q288J32699j56824j00788j75674J68718J69927
13589E24746o7926r0841J53088Q0968j39701j4731O9364J4239l32175P93M2827
13578B40651R6294k2273l2958q333p7410J75759q310j89699Q4398o7099l310j37596
13566E0114J11565L23680P9606n2267K04564K11395j42436K53088O7760k54288
13556H52781j71912R9318j08840k32710k55654N1651P8741J86081L1236J7497
$$ plain form
13631 381026 162868 -125312 -130027 -505 394947 649332 554196 436618 295772 262265
13621 262265 202062 132770 66463 83878 366760 640767 739931 782468 763286 790495 616728
13610 616728 680429 719009 626274 560867 650284 596466 441892 634799 636666 583372 390629
13599 390629 282969 485148 478400 486688 619387 462563 361775 186101 354819 524746
13589 524746 456820 365979 519067 600035 460334 445603 514967 529206 197031 197824 240651
13578 240651 336945 314672 281714 273381 195971 371730 363420 173721 258119 191020 187710 50114
13566 50114 161679 485359 564965 512698 717262 928657 786221 1039309 1107069 852781
13556 852781 680869 780187 671347 438637 182983 234634 313375 499456 530692 548189
13546E48189O8317J51037n8470m4888j31137m4511j22014O4188K61944k10353
13536D82302m50382M3528R9694P7707o57Q1158J95027j34817j56956r8275O874
13525A45203R5086L52433J51138J3337r8825j00512j11949m607k05631K4881O0113
13514C20667K17O7625q4513P0192K05078J8470R309k46759j40277m6414l6754
13503A36841J26063n1991K17353P9229j05163J43177R4473l7892J31727J45544
13493H79361n0695j44366J25930N4496j44290o5817K7721J66594j5457m8910j26073
13482F58494o478l9561q2841o5862n7681K19685j16856L3971q7309o7353l1093
13471C57116K0141J33611Q0761P9226p5342N1973J70668J89889L3067l16327j13142
$$ plain form
13546 548189 616506 767543 709073 664185 533048 488537 366523 430711 692655 482302
13536 482302 31920 75448 175142 252849 252192 333350 528377 393560 236604 138329 145203
13525 145203 240289 592722 743860 757197 658372 557860 445911 441304 235673 260554 320667
13514 320667 320884 388509 303996 374188 579266 597736 607045 360286 220009 173595 136841
13503 136841 262904 210913 428266 507495 402332 545509 639982 602090 733817 879361
13493 879361 828666 684300 810230 864726 720436 654619 682340 848934 833477 784567 658494
13482 658494 652016 612455 529614 463752 406071 625756 508900 542871 455562 388209 357116
13471 357116 377257 510868 591629 670855 595513 647486 818154 1008043 1041110 724783 611641
13460F11641j68383K5436K3318M0206J92935J58786o4468k72581o5511K35847
13450G17226P6045j98313j40264K4681J78220m8056K41171R4548j66899n8095
13440G20264k7426P4203N5980p7929k32414j16545k7893j66788K4234L51511K14616
13429G91813J0761k82389K6808l8553k03865j33195K2121L9832Q6679Q5443l5547
13418C69908J70284O3526P9315l14287k0076K22226J91094k4148o7601O6497l4293
13407G02445q1884K934j02354n8926j84097k38887Q2734L30086K39488J66543
13397H58082L5754o1864J40414o3274j45625J46273p5525k61040j67786K75935
13387F81344J37481J18871r0490L1273L8634K5101p4934j95320r5863n5677L3081
$$ plain form
13460 611641 443258 468694 492012 532218 725153 883939 819471 546890 481379 717226
13450 717226 793271 594958 454694 479375 657595 609539 850710 945258 778359 720264
13440 720264 692838 767041 823021 745092 512678 396133 368240 201452 225686 577197 791813
13429 791813 802574 520185 546993 508440 304575 171380 193501 233333 320012 405455 369908
13418 369908 540192 603718 683033 368746 348670 570896 761990 737842 670241 736738 702445
13407 702445 620561 623495 521141 462215 278118 39231 121965 452051 691539 858082
13397 858082 893836 831972 972386 909112 763487 909760 834235 573195 405409 681344
13387 681344 818825 937696 847206 878479 917113 942214 867280 671960 576097 520420 553501
13376E53501K12495M6658r4750J00202k19468j48221P677K60358O382j32127j6232
13365E76475k1666R6451M9834p1110j21018K7496O698r2511p1999o6193R4610
13354D07067J39716O8138J70559L9395K251j43563j61112J96615K8046j41154
13344F05958k86732p4570M7869Q794l6518R4843q4573J41756K05751R6214n9627
13333F59165l7445k03181n6055K6076M7844J36052j7808j28995o5266J90300j445
13322E49242J92859N7781J07877r7968k67781J3019L25938p3480k14623k57687
13312C35177J99K54277j32199J5129J53358j04999l4619j08224K03977L95792
13302I77868j04289L4559k19381j76619Q4430j4153J56515N1819p7738R4520k02439
$$ plain form
13376 553501 765996 812654 717904 818106 598638 450417 458094 718452 724834 592707 576475
13365 576475 554809 651260 701094 629984 508966 536462 543160 450649 378650 312457 407067
13354 407067 546783 614921 785480 824875 827126 683563 522451 719066 747112 605958
13344 605958 319226 244656 292525 301319 264801 359644 275071 416827 622578 718792 659165
13333 659165 621720 418539 362484 388560 436404 572456 554648 425653 360387 550687 549242
13322 549242 742101 799882 907759 809791 542010 555029 880967 807487 592864 335177
13312 335177 335376 589653 457454 472583 625941 520942 486323 378099 582076 977868
13302 977868 873579 908138 688757 512138 596568 582415 738930 790749 713011 807531 605092
13291F05092J03228K14305j948j14527k00491J44594r409r1245n7000J71703q9966
13280F74336k37787k04683Q9563L50087J33498k53929j48922K63397J85087n7377
13270G93270J36402K25190n9738N9458k32610l90057j2252K39172p5307k23310
13260D60218j16319M0700J96547N0138j1312j30963j47472k69751K35112K24398
13250E31296J51443j42587o2495j36038j56153j35800l6464L36346K89818O2115
13240G01481R3452l2284j63019l13487Q2277q1429m3290P9790M4732L37263r321
13229F96165j63551J02244q6712O1738j8342j04991l8521q451l0055l532j53730
13218B52262J6185K17961K6859j39364L3278J39711K37457j12732j52902P1530
$$ plain form
13291 605092 708320 922625 920677 806150 605659 750253 740844 649599 592599 764302 674336
13280 674336 436549 231866 321429 671516 805014 551085 402163 665560 850647 793270
13270 793270 929672 1154862 1095124 1154582 921972 531915 519663 758835 683528 460218
13260 460218 343899 384599 581146 631284 619972 489009 341537 71786 306898 531296
13250 531296 682739 540152 477657 341619 185466 49666 13202 349548 639366 701481
13240 701481 794933 762649 599630 286143 368420 286991 243701 323491 368223 705486 696165
13229 696165 532614 634858 548146 609884 591542 486551 448030 439579 409524 405992 252262
13218 252262 268447 486408 513267 373903 407181 546892 784349 671617 518715 590245
13208E90245J75089m4867J46953K23507k02005l74819j27321l1410P9053n4402
13198C80023j03034r418R1035R8424J9377R3360R4589M5465J34949j94178k21078
13187D29514J32879k41362k46587K15715R9887j6765j82529J50524K32307K24761
13177G98344P1882k11512j26533n2318Q5991Q0417k18056P2706O0394q7975j00366
13166C72974J2538Q0033K44444j0034k53448J2513K30854j03901j21396R230R5976
13155E69783r9380p1004k9108K07412K10260J19248N5551l17508l28667K85972
13145F02559J01893n0095J08887k313J62440J18840j41760j57123J95051k5509
13135I12870k31474k15764k9318N8703j21171M4702k5916r6133J11917L1051k2255
$$ plain form
13208 590245 765334 720467 867420 1090927 888922 514103 386782 355372 434425 380023
13198 380023 276989 267571 358606 457030 476407 569767 664356 709821 844770 650592 429514
13187 429514 562393 321031 74444 290159 390046 373281 190752 341276 573583 798344
13177 798344 870226 658714 532181 479863 565854 646271 428215 500921 561315 473340 372974
13166 372974 385512 465545 709989 699955 446507 459020 689874 585973 464577 473807 569783
13155 569783 470403 399399 370291 577703 787963 907211 962762 645254 316587 602559
13145 602559 704452 654357 763244 760931 923371 1042211 900451 743328 938379 912870
13135 912870 681396 465632 436314 495017 373846 418548 392632 296499 408416 439467 417212
13124D17212J480l4195L3174Q2309J05517j27002j58087j26668m4103K10788L37011
13113F97436J30098P7175j11976k81330j92188P0913J90874M9052r2500j0993
13103E26561p129J12414J66102k67346p9942N8215K62091J56778n4702j57450
13093G15592k63491r2689j18713l9093J62471J72016j1013j59970q5561J52425
13083D31974J35143J04329j0542l49208l16011O0936J70424L1206J04808Q2934
13073D45993P3339L0811J5186o9792j93832J45429J2429P6048m4257j42679j002
13062C47673J11969J28140R3782J17066J2608j07178L1490j71868j49094j44430
13052B70158L37433o3642j27390N657l9388K69330r0342k55430J93656N1023K42121
$$ plain form
13124 417212 418692 384497 417671 499980 605497 478495 320408 193740 149637 360425 697436
13113 697436 827534 904709 792733 511403 319215 390128 581002 630054 537554 526561
13103 526561 519432 631846 797948 530602 450660 508875 770966 927744 873042 715592
13093 715592 452101 359412 240699 201606 364077 536093 525080 365110 279549 431974
13083 431974 567117 671446 660904 311696 -4315 56621 227045 258251 363059 445993
13073 445993 519332 550143 565329 495537 301705 447134 459563 535611 491354 348675 347673
13062 347673 459642 587782 681564 798630 811238 704060 735550 563682 414588 270158
13052 270158 607591 543949 416559 422216 382828 652158 561816 306386 500042 551065 793186
13041G93186p7454j17299j25083J28803J35038o3571K099O1995p1882J4486J4106
13030F94424O2341J83287J9603j71786l14227r1703M4649o2592J2378K03302P9623
13019F59299J76122J31640J94970k44634j89412M3703n7938J26301P3696J2197
13009I25944m4368j961k17242j30087j09944L0181J07576N8016P8145j38316l72573
12998A85371j34910K52649J91581n1136r452k01956J31434m0600j10631J02976
12988C15326N7091o8964J62567K4159J3987J41972J25257R6440k12697q7132k25550
12977C42456k06773j1628j712O6206k4136J29096K33922K40014o3146q3520J52078
12966G72857r8275J11540m9943k61297j85271K72706J41661j70422j26437N7136
$$ plain form
13041 793186 715732 598433 473350 602153 737191 673620 675719 737714 665832 680318 694424
13030 694424 756765 940052 959655 787869 473642 381939 426588 363996 376374 579676 659299
13019 659299 835421 967061 1162031 917397 727985 771688 713750 840051 913747 925944
13009 925944 881576 879615 662373 532286 422342 452523 560099 618115 696260 557944 185371
12998 185371 50461 303110 494691 443555 434103 232147 363581 322981 212350 315326
12988 315326 372417 303453 466020 490179 504166 646138 771395 867835 655138 568006 342456
12977 342456 135683 124055 122343 188549 164413 293509 527431 767445 704299 620779 772857
12966 772857 674582 786122 736179 474882 289611 562317 703978 533556 407119 464255
12956D64255j75164R0593L17459Q3882r8488m6143j99266K4889R7725p5953j58970
12945C24819p7885o654n7194P5956J60737N1040j5139J48746J96800m6796j07055
12934F47375L8218n2138k8454j86793j22567L06097J07423k31185k17482j8948
12924B41546j2158m6755J21615R5529K9037K4245J34620J47362k02556l0777j4742
12913D86966m7465m7417j30312J54691K30293l4850k00307N4049J35068m785j40374
12902D55557m6760J20733J08932q1161m9094J60258M1181m6673M0301J35066j37623
12891G00717P4477k2174k06296J00945J13918l9839j56630r0526o1055J29077
12881E42614J02749K3484j0985q0204K6798j2915j21733j20582R694J95330J75988
$$ plain form
12956 464255 289091 379684 697143 781025 682537 636394 437128 462017 559742 483789 324819
12945 324819 246934 240280 183086 259042 419779 470819 455680 604426 801226 754430 647375
12934 647375 685593 633455 605001 418208 295641 601738 709161 477976 260494 241546
12924 241546 229388 182633 304248 399777 428814 453059 587679 735041 532485 501708 486966
12913 486966 439501 392084 261772 416463 646756 611906 411599 465648 600716 595931 455557
12902 455557 408797 529530 638462 557301 508207 668465 709646 662973 703274 838340 700717
12891 700717 775194 753020 546724 647669 761587 721748 565118 474592 413537 542614
12881 542614 645363 668847 657862 577658 604456 591541 469808 349226 358920 554250 730238
12870G30238J35677O3237q2357K38035P7347J95177Q0409k70438l19419M480J41931
12859I94317Q2903P3045P6651J06053J38535J18549K8876l3588J73645L81137
12849B140123N3418o1177K84732K6059J20461l4976k5318j51074j05926Q093l32116
12838A922299k70728K41236K64377j28516m11864j84777K35819J79688l4695k1388
12828A791451k78212n0892K80260J49596M21694l5226k73251Q5604J07309j18996
12818B079337J29796J94166J30351K83498J20981j06661l17500L656L57918R6696
12808B972238q0657R2960r7556k04313k5851j18061O2643j2119o943K42702j3449
12797B811594k86551k76553j54135m8233o7407k22755l8112K79356J81260l6840
$$ plain form
12870 730238 865915 929152 846795 1084830 1162177 1357354 1437763 1167325 847906 852386 994317
12859 994317 1077220 1150265 1226916 1332969 1471504 1590053 1618929 1585341 1758986 2140123
12849 2140123 2193541 2132364 2417096 2443155 2563616 2528640 2503322 2352248 2246322 2254415 1922299
12838 1922299 1651571 1892807 2157184 2028668 1616804 1432027 1667846 1847534 1812839 1791451
12828 1791451 1513239 1462347 1742607 1892203 2313897 2278671 2005420 2091024 2198333 2079337
12818 2079337 2209133 2403299 2533650 2817148 2938129 2831468 2513968 2517624 2875542 2972238
12808 2972238 2891581 2984541 2886985 2682672 2656821 2538760 2601403 2589284 2582341 2825043 2811594
12797 2811594 2525043 2248490 2094355 2046122 1978715 1755960 1717848 1997204 2178464 2141624
12787B141624n9074J55411L0827R9616k9789j65298q2450l8889M316l1794m4963
12776A979537j4616p612o1604P6174l8259j84074j45140k86852l18027j02309
12766H97218j1084J90382L35215K5768j39103j36969k66949k36681k106l2782
12756F22909j17938n5593J88765J78495r8472l02500r60J22290k6627K79601k6217
12745G63753j81683M0199R7783j2377J4259J69779n3782n7681r9640J20959N2747
12734H54316K1235l02819P033J49094j23380m615j9149Q1697P1203p1927r2921
12723E69767j82917n2674J98728j14864O7563R423M158j07261l67060K10836K11981
12712D47680J03496O6015M6916j07186J37504k3930k52619o0090R1137J42919
$$ plain form
12787 2141624 2082550 2237961 2268788 2368404 2338615 2173317 2090867 2051978 2056294 2024500 1979537
12776 1979537 1964921 1957309 1895705 1971879 1933620 1749546 1604406 1317554 999527 897218
12766 897218 886134 1076516 1411731 1437499 1298396 1161427 894478 657797 655691 622909
12756 622909 504971 449378 638143 816638 718166 415666 414706 536996 510369 789970 763753
12745 763753 582070 622269 720052 707675 721934 891713 837931 780250 680610 801569 854316
12734 854316 875551 572732 579765 728859 605479 600864 581715 663412 734615 662688 569767
12723 569767 386850 334176 532904 418040 485603 495026 499184 391923 24863 235699 447680
12712 447680 551176 617191 664107 556921 694425 670495 417876 357786 448923 591842
12702E91842P321k73033k93690J41874O0566n6945J78731K50049N617q0034j88903
12691C43395L3849J23277M4429K4435Q0507L1867j46968j78041J57916Q8190r218
12680E93638L01417r0525j01659k66298j21434Q6892J32854r1179J09369K61578
12670H14653J18485j45690j52677J0498N6946Q2607J55835j60631j00921K17812
12660H96917p6419o5666N3104M8215m2527r7532l9684j93084j75181j2371J9403
12649C15175m6665j28472J64678L56862J55248o9328j16773O3696k5067O6796
12639G36150J06278j72767j75852R9712k0784j71669k9829K87160J06141m1990
12629G22550j56448Q2245J4066j61566J36605l7457k45981q8357J82961J81741
$$ plain form
12702 591842 599163 326130 32440 174314 234880 177935 356666 606715 612332 532298 343395
12691 343395 377244 500521 544950 569385 649892 681759 534791 356750 514666 602856 593638
12680 593638 895055 804530 702871 436573 315139 402031 534885 443706 553075 814653
12670 814653 933138 787448 634771 645269 702215 784822 940657 780026 679105 896917
12660 896917 820498 754832 807936 856151 813624 716092 676408 483324 308143 295772 315175
12649 315175 268510 140038 304716 661578 816826 747498 630725 694421 669354 736150
12639 736150 842428 669661 493809 593521 572737 401068 371239 658399 764540 722550
12629 722550 566102 648347 662413 500847 637452 599995 354014 265657 448618 630359
12619F30359J30073J32748j07655j39356k11054o9329N0188L25648L0637l27777
12609D44482r1524m0989O0179P3495J29715J71109R805n3624J33445n8970q7864
12598F89259O7516j96863P6015L3437L5091n4719l9803J12872L3817j41832j24020
12587D90770j7787J09009O9290n5871J26690Q6150L571k0634J16273o4705M0766
12576H83522p421l9467J70770j17096k87503K5507j1459M6910J70137O859N801
12565H46560J23964K28424P174O2321j82160r5740K36339M046k89366j57760J3496
12554G97298K24294Q5029r0767J46481m231k38274j14705L221Q0641N3614L097
12543I45698J37156J86052p4897k7693q3853J67189K75197j04716j35733j5151
$$ plain form
12619 630359 760432 893180 785525 646169 435115 365786 415974 741622 772259 444482
12609 444482 352958 311969 372148 445643 575358 746467 756272 702648 836093 777123 689259
12598 689259 756775 559912 635927 669364 704455 649736 609933 722805 756622 614790 490770
12587 490770 472983 581992 651282 595411 722101 808251 811822 791188 907461 842756 883522
12576 883522 876101 836634 1007404 890308 602805 628312 616853 663763 833900 840759 846560
12565 846560 970524 1198948 1206122 1268443 1086283 990543 1226882 1230928 941562 783802 797298
12554 797298 1021592 1106621 1015854 1162335 1158104 919830 805125 808346 888987 942601 945698
12543 945698 1082854 1268906 1194009 1166316 1082463 1249652 1524849 1420133 1284400 1269249
12533A269249j44997k23664K43262L58415K30601j09438j56887J23987j69494
12524A421034l04432j21802Q059J51773n2373l2203K11855K41588M485o0155j78274
12513A289555k12089J14709o7362K0754O6369N9934K24028L87783P940n2387m8486
12502A790748N955k61888l3883l1842m851K16765l9994J21274M9840m4246J08824
12491A876702J91962P4983M562J42763J39197j16353k33339O4591K06587J23626
12481B475281m857K30272K04393R3933J90638J2856R9962o8641j62197L8400J23409
12470C233449K5895K64028J36166O431K69766R7649J85371L02336J19436K60986
12460D901513J66456J91685L40494K73396p048J90697N48291M90183K02041L66913
$$ plain form
12533 1269249 1124252 900588 1143850 1502265 1732866 1623428 1466541 1590528 1421034
12524 1421034 1116602 994800 1002859 1154632 1102259 1070056 1281911 1523499 1527984 1467829 1289555
12513 1289555 1077466 1192175 1124813 1145567 1211936 1271870 1495898 1883681 1891621 1839234 1790748
12502 1790748 1796703 1534815 1500932 1469090 1464239 1681004 1641010 1762284 1812124 1767878 1876702
12491 1876702 2068664 2143647 2148209 2290972 2430169 2313816 2080477 2145068 2351655 2475281
12481 2475281 2470424 2700696 2905089 2999022 3189660 3202516 3302478 3233837 3071640 3110040 3233449
12470 3233449 3259344 3523372 3659538 3665969 3935735 4033384 4218755 4521091 4640527 4901513
12460 4901513 5067969 5259654 5600148 5873544 5866496 6057193 6605484 7095667 7297708 7664621
12450G664621K40440K33163L74497Q52951P70081Q82678P71666P94617J103616
12441A3688330J367268J247156J592443J698823J930494K578481K808869K919058
12433B9830922L474685M138910N082657N584794O412346P539959R027960J0815738
12425H1907971J2788625J5045396J8197078K1742421K5391902K9229317L1893627
12418B36196337L2597739L0337492K4578937J6279798O407893k771107j0131678
12411C33495411j4797546j6886238j6877780j5264453j3575350j1145147q380477
12404B36568420n938365l676270j663749K38479J932154L583641N088290O507332
12396B42639932P749234R115260J0684014J1622067J2223497J3100852J3416373
$$ plain form
12450 7664621 7905061 8138224 8512721 9365672 10135753 11018431 11790097 12584714 13688330
12441 13688330 15055598 16302754 17895197 19594020 21524514 24102995 26911864 29830922
12433 29830922 33305607 37444517 42527174 48111968 54524314 62064273 71092233 81907971
12425 81907971 94696596 109741992 127939070 149681491 175073393 204302710 236196337
12418 236196337 268794076 299131568 323710505 339990303 346398196 343627089 333495411
12411 333495411 318697865 301811627 284933847 269669394 256094044 244948897 236568420
12404 236568420 230630055 226953785 225290036 225528515 227460669 231044310 236132600 242639932
12396 242639932 250389166 259504426 270188440 281810507 294034004 307134856 320551229
12389C20551229J3573513J3475249J3395461J3541181J3795946J3551446J2788836
12382D14672861J1518286R688219P318849M540972J959649o97704l065748m829912
12374D41105472n863384p121836q338794r718597j1100719j2463140j3586474
12367C72912528j4137452j3680211j3170597j2123528j0712221r207795p927705
12360B91953019o327472m683364k842094m90548K018729M237322O701202Q800757
12352B99367551J1202996J2342759J2054266J0900518Q097070L596737j310977
12345C56250920p273769j3233206j7897442k1173954k2991018k2978583k1759881
12338B28943067j9999700j7996969j6072828j4280198j2670862j1597714j0488054
$$ plain form
12389 320551229 334124742 347599991 360995452 374536633 388332579 401884025 414672861
12382 414672861 426191147 435879366 443198215 447739187 449698836 449001132 445935384 441105472
12374 441105472 435242088 428120252 419781458 410062861 398962142 386499002 372912528
12367 372912528 358775076 345094865 331924268 319800740 309088519 299880724 291953019
12360 291953019 285625547 280942183 278100089 277609541 279628270 283865592 290566794 299367551
12352 299367551 310570547 322913306 334967572 345868090 353965160 357561897 356250920
12345 356250920 348977151 335743945 317846503 296672549 273681531 250702948 228943067
12338 228943067 208943367 190946398 174873570 160593372 147922510 136324796 125836742
12331A25836742r657606q888483q096693p447102o850509o070497o014854n515066
12323F7295932n033906m595963l935250l271243l455809k977894k580539k451785
12315C8993543k418147k539227j893244j595430j701480j654541j346466j112283
12307B4732725j206046j129810j144709q71433q19641p97083q63741p06060p95574
12298A6398628n83065n21383o38246o08060k77615k82691k98413m37848k30374
12289A2520933m68441j84717j64837L0202l43232j99353k77601l81452j06644
12280A0424858j77929j76414j13911k1721j65153l43485l02492m5085j46443j99089
12270H733136Q887j41701k66542p2417K0563n8912k39335k37532p7520l15492
$$ plain form
12331 125836742 116179136 107290653 99193960 91746858 84896349 78825852 72810998 67295932
12323 67295932 62262026 57666063 53730813 50459570 47003761 44025867 41445328 38993543
12315 38993543 36575396 34036169 32142925 30547495 28846015 27191474 25845008 24732725
12307 24732725 23526679 22396869 21252160 20380727 19561086 18764003 17900262 17194202 16398628
12298 16398628 15815563 15294180 14655934 14047874 13770259 13487568 13189155 12751307 12520933
12289 12520933 12052492 11867775 11702938 11733140 11389908 11190555 10912954 10531502 10424858
12280 10424858 10246929 10070515 9956604 9934883 9769730 9426245 9123753 9078668 8932225 8733136
12270 8733136 8742023 8600322 8333780 8261363 8281926 8223014 7983679 7746147 7668627 7353135
12260G353135q9903N0209K40101R6361k01834m66270k98224J23170K32786K59750
12250G299281K2872j21325j15971k62328p1182K9775k4339j02307j41098r7267
12240F416111k58315j25561J55298Q3561k41338Q6214m7875j20187k24155J56401
12230E880154n1948l4367j24519k6919J05502k3453r1584N1681J08010J4583k1158
12219E785982J41875k25181j37227j00459k54444J16026o4871j39448k77938j33449
12209D710866R4129J80424j47157Q2324J09231l0243q3900O7266N53k68708k64303
12198D450482j92896r7779k2760k6115j43543N5663p0177k21755P8549m454k45610
12187C559605p7183K61015j34625q6775l3236J33001L4311r1687J04864K27934
$$ plain form
12260 7353135 7263232 7313441 7553542 7649903 7448069 6981799 6683575 6806745 7039531 7299281
12250 7299281 7322153 7200828 7084857 6822529 6751347 6781122 6756783 6654476 6513378 6416111
12240 6416111 6157796 6032235 6187533 6271094 6029756 6115970 6068095 5947908 5723753 5880154
12230 5880154 5828206 5793839 5669320 5642401 5747903 5724450 5632866 5684547 5792557 5807140 5785982
12219 5785982 5927857 5702676 5565449 5464990 5210546 5326572 5261701 5122253 4844315 4710866
12209 4710866 4804995 4985419 4838262 4920586 5029817 4999574 4915674 4982940 4983493 4714785 4450482
12198 4450482 4257586 4159807 4137047 4110932 3967389 4023052 3952875 3731120 3809669 3805215 3559605
12187 3559605 3482422 3743437 3608812 3522037 3488801 3621802 3656113 3564426 3669290 3897224
12177C897224q4180l04319l8569K469Q5756L1761q901L1398p458k2337l92703
12166C190141j70530k43923k32052N5199K98509j83065n3151k6815K71159Q8317
12156B993789J64584J310m8388L9054j94385j67154J75160M2868N5134j07832
12146B954140M7563L42240j89454k80276j40326j58183q9975r4372J25067J773
12136B518197K90136K16509j50116j21346p5785n2064J16870k51379J94723J68725
12126B854470O4105J07982L1088r2472K6644M409j463M684J25604J12356o7628
12115C169779m12262j85249M3729K29630M29J0187K35532l8232k4269L26604j62794
12104C193084j03296L06983R4995j55106l58611M2363J40111k7721J1456k01355
$$ plain form
12177 3897224 3813044 3508725 3470156 3472625 3558381 3590142 3581241 3612639 3605181 3582844 3190141
12166 3190141 3019611 2775688 2543636 2598835 2897344 2714279 2661128 2634313 2905472 2993789
12156 2993789 3158373 3159683 3111295 3150349 2955964 2788810 2963970 3006838 3061972 2954140
12146 2954140 3001703 3343943 3154489 2874213 2733887 2575704 2485729 2391357 2516424 2518197
12136 2518197 2808333 3024842 2874726 2753380 2677595 2625531 2742401 2491022 2685745 2854470
12126 2854470 2918575 3026557 3057645 2965173 2991817 2996226 2994763 2999447 3125051 3237407 3169779
12115 3169779 2757517 2572268 2615997 2845627 2846056 2856243 3091775 3053543 3029274 3355878 3193084
12104 3193084 3089788 3396771 3491766 3336660 2978049 3020412 3160523 3132802 3144258 2942903
12094B942903k17988J43605L62347P6036l29844j45761j91151k10046J7943M5280
12084B493324j13565j18276J30786J60698j37683j05619P98O5719M6861O7981
12074B491024Q8540J35624n6193K07205n1546l09213k50600n301K40648M5291
12064B535479j07073j4311l4601M4852Q8363l2399m3416L3364J50175p2269p7163
12053B471001r9242N4825J57245J5967M6685m4294j94617J0719j70033l69314
12043A878942m3917J72331J13143J45883J20279k96415o6676r3309P1486J01281
12033B103028N8770P3697j26727p4135J24366P2980j59085l8357J03744r8625
12023B039656j36106m0517j42247P0202J71891J00844J87272j28090k46836j6214
$$ plain form
12094 2942903 2724915 2868520 3230867 3306903 2977059 2831298 2640147 2430101 2448044 2493324
12084 2493324 2379759 2261483 2392269 2552967 2415284 2309665 2310463 2376182 2423043 2491024
12074 2491024 2579564 2715188 2658995 2866200 2814654 2505441 2254841 2249540 2490188 2535479
12064 2535479 2428406 2414095 2379494 2424346 2512709 2480310 2436894 2470258 2620433 2548164 2471001
12053 2471001 2371759 2426584 2583829 2599796 2646481 2602187 2407570 2418289 2248256 1878942
12043 1878942 1835025 2007356 2120499 2266382 2386661 2090246 2023570 1930261 2001747 2103028
12033 2103028 2161798 2235495 2108768 2034633 2158999 2231979 2072894 2034537 2138281 2039656
12023 2039656 1903550 1863033 1720786 1790988 1962879 2063723 2250995 2122905 1876069 1859855
12013A859855l4996k24818l4352J18564R2141m2305J77639K33518j25726j45712
12003A873808R7941j07653l37840r6890K65360J68647j10345p5260j90549j90078
11993A297141J01038L30813J65148Q6615p5475L12932J82983q2202K05814K31141
11983B755948J4957J4607l2828K61654O1586O2752J93731N8692j56896j84118
11973C050085P5812P1086k40442k05550j4039L8804J28563j28582k43906q3646
11963B448185O8367M9187O0227K30406J84990l9475P2842p3763j71343Q7784K53338
11952C170745j28811O1777J99946l8563k23005k7735J84921J01494K37388Q1432
11942C619589J35548Q6708P9718n0009L8908o7887j1085j88783m3965N4850J41682
$$ plain form
12013 1859855 1824859 1600041 1565689 1684253 1776394 1734089 1911728 2145246 2019520 1873808
12003 1873808 1971749 1864096 1526256 1429366 1694726 1863373 1753028 1677768 1487219 1297141
11993 1297141 1398179 1728992 1894140 1980755 1905280 2218212 2401195 2318993 2524807 2755948
11983 2755948 2770905 2785512 2752684 3014338 3075924 3138676 3332407 3391099 3234203 3050085
11973 3050085 3125897 3196983 2956541 2750991 2736952 2775756 2904319 2775737 2531831 2448185
11963 2448185 2516552 2565739 2625966 2856372 3041362 3001887 3074729 3000966 2829623 2917407 3170745
11952 3170745 3041934 3103711 3303657 3265094 3042089 3014354 3199275 3300769 3538157 3619589
11942 3619589 3755137 3841845 3921563 3871554 3910462 3842575 3831490 3642707 3598742 3653592 3795274
11931C795274Q590j98045j63330k50178l97363J18483m8748k5538J49444K80243
11921C268832l6345n1813K2930j03407l38485J02424J34594L25516j79429l52242
11911B792575L410K01343j58776L06425J9576j90032j32583k07458k41752J29484
11901B522212k36385j74723L114Q172l17374k15403j23845j286j9780M5588N2909
11890A543199j86489j87797K37301o7426l77285L74J19887K16378K17941J79693
11880A695776o3864N8703n5716k468r3271m368N0791J45862J1681N7852j05038
11869A695940j53383O0876O107L9346q5381O3044J10707n2790M8547o7785j37940
11858A527288j85573J2454N8855k28149M4313K53808N4126j48445r3290K08112
$$ plain form
11931 3795274 3803864 3605819 3442489 3192311 2794948 2913431 2864683 2839145 2988589 3268832
11921 3268832 3232487 3180674 3203604 3100197 2761712 2864136 2998730 3324246 3144817 2792575
11911 2792575 2795985 2997328 2838552 3144977 3164553 2974521 2841938 2634480 2392728 2522212
11901 2522212 2285827 2111104 2114218 2122390 1805016 1589613 1465768 1464482 1444702 1490290 1543199
11890 1543199 1356710 1168913 1406214 1338788 961503 961877 1081764 1298142 1516083 1695776
11880 1695776 1631912 1690615 1634899 1632431 1539160 1534792 1585583 1731445 1743126 1800978 1695940
11869 1695940 1542557 1603433 1609540 1648886 1563505 1626549 1737256 1684466 1733013 1665228 1527288
11858 1527288 1341715 1354169 1413024 1184875 1229188 1482996 1537122 1388677 1295387 1503499
11848A503499L8065j04566q3678k10714j91302J86999L06356K29089j89107p2661
11838A411980j67129k44950J75769J22525P0335L78086Q8561k01909k61326k77146
11828A094796j046J42112J55002L3410j23183o0514o2679n2373n1722J14836J38056
11817A326695L1986Q512J23483J3148m16884j07400m7108K0889M3682J18009N2693
11806A167705l8555o6383j38443M9383j3814j7194j56750j06802J71687L11447
11796A162281j84892j88136M6808K1178K83488J34321o455j8678j11003r1939
11786A046973J6208J77630K33527r3164K48492M6310k48395k38470r7924k48168
11776H43019k5605J4532p3118Q9569L19219J63697o8080o052k04861j35265j13280
$$ plain form
11848 1503499 1541564 1436998 1353320 1142606 951304 1138303 1444659 1673748 1484641 1411980
11838 1411980 1244851 999901 1175670 1298195 1368530 1746616 1835177 1633268 1371942 1094796
11828 1094796 1093750 1235862 1390864 1424274 1301091 1240577 1177898 1125525 1073803 1188639 1326695
11817 1326695 1358681 1367193 1490676 1503824 1086940 979540 932432 953321 997003 1115012 1167705
11806 1167705 1129150 1062767 924324 973707 959893 942699 785949 679147 850834 1162281
11796 1162281 977389 789253 836061 857239 1140727 1275048 1268593 1249915 1138912 1046973
11786 1046973 1063181 1240811 1474338 1381174 1629666 1675976 1427581 1189111 1091187 843019
11776 843019 817414 831946 758828 848397 1167616 1331313 1263233 1257181 1052320 917055 803775
11765H03775J6843M3312J45115K19399R1032k9427M153m8870r5072o3672p1123
11754A015465p3663J59938J31980j38277o5715J71222m8255o4931n0543R1162
11744A128383n2395m9437m8924m2756j77m58m4403k48923K6301J28427J59649
11733I55287J41607J951m7052k255J587P1229k87670k266j4485l5294j14433j80597
11721D87609l00873p8136K66653M53658L9122r8325O5250K26132k13r6406o9461
11710H95010j45469R2997K13438J9099J21868J08096n2647l0669j64898j17085
11700I39740j0440j03440k565j7955K42648p86J71079O2157l44352j03524K01603
11689A034165J14846j44784n9594J34301Q3386j41474o7580R5310n984j48717
$$ plain form
11765 803775 820618 863930 1009045 1228444 1319476 1290049 1294202 1245332 1150260 1086588 1015465
11754 1015465 941802 1101740 1233720 1095443 1029728 1200950 1152695 1087764 1037221 1128383
11744 1128383 1075988 1026551 977627 934871 934694 934236 889833 640910 667211 795638 955287
11733 955287 1096894 1098845 1051793 1049538 1051125 1122354 834684 832418 817933 782639 668206 487609
11721 487609 186736 108600 375253 828911 868033 769708 834958 1061090 1060877 964471 895010
11710 895010 749541 842538 1055976 1075075 1196943 1305039 1252392 1221723 1056825 939740
11700 939740 929300 825860 823295 805340 1047988 1047202 1218281 1280438 936086 832562 1034165
11689 1034165 1149011 1004227 944633 1078934 1162320 1020846 953266 1048576 1042592 893875
11679H93875K5500P1557K56064k8401j56644j9610n0199j08200O8239J11388J60203
11668A223772j04303q7514j42872l973m817k25721J66826J78796K43775k30446
11658A013523q6388N3904J18402M5002Q1149J3592j21407M9914Q9501P3079j51956
11647A178315R6948K17103L55437l169O5788M79128O37175P48150J990182K682651
11637H447708K845535J977270Q9714j487725k515374k235048j503638j086887
11629D531555l14596p7322n31922l37414j31719j69753m05093m0254m21179l21538
11619A780765k01697j40392O4790J49121q0428q7265R5387K6947k68528q7907
11609A250793j69319J59923K96380K04249k9350L76363M45913K43717L60425N44492
$$ plain form
11679 893875 919375 990932 1246996 1218595 1061951 1042341 992142 883942 952181 1063569 1223772
11668 1223772 1119469 1031955 889083 885110 880293 654572 821398 1000194 1243969 1013523
11658 1013523 927135 981039 1099441 1144443 1225592 1239184 1117777 1167691 1257192 1330271 1178315
11647 1178315 1275263 1492366 1847803 1844634 1910422 2389550 3026725 3774875 5765057 8447708
11637 8447708 11293243 13270513 13360227 11872502 9357128 7122080 5618442 4531555
11629 4531555 4216959 4139637 3607715 3270301 3138582 2968829 2563736 2523482 2102303 1780765
11619 1780765 1579068 1438676 1503466 1652587 1572159 1484894 1580281 1607228 1338700 1250793
11609 1250793 1081474 1241397 1537777 1742026 1712676 2089039 2534952 2778669 3139094 3683586
11599C683586J120904J870736K727225K851928J937475k27923j934716k777820
11591I251395k384486j387192q20903n87072n16981k55406j83859j74032k99814
11582B641650k26560J0163j36033k86639l12888j40059P7267r3884k2287R6484
11572A607214l8583l01173p6638R039N7776j40423r5580o1522o6885J8111J51644
11561A062980R8365L2111n3829J07348Q0139j44495j21574k4872n9951l18343
11551F57879M1815J15126m6202j00499j06740l44653l7900Q9329K7114P5055J34423
11540E04747O45n4833J27830N4822J926k17577l6564J74398k2404j42338k9768
11529C60884l8390j8517Q4744L39068K11972j75814k57814J0860q8113m6240k6760
$$ plain form
11599 3683586 4804490 6675226 9402451 12254379 14191854 13963931 12029215 9251395
11591 9251395 6866909 5479717 4658814 4071742 3554761 3299355 3115496 2941464 2641650
11582 2641650 2415090 2425253 2289220 2002581 1689693 1549634 1626901 1533017 1510730 1607214
11572 1607214 1568631 1267458 1190820 1199859 1257635 1117212 1021632 960110 893225 911336 1062980
11561 1062980 1161345 1193456 1139627 1246975 1327114 1182619 1061045 1036173 976222 657879
11551 657879 699694 814820 768618 668119 561379 216726 178826 268155 295269 370324 504747
11540 504747 505392 450559 578389 633211 635137 417560 380996 555394 532990 390652 360884
11529 360884 322494 303977 388721 727789 939761 763947 506133 516993 428880 382640 355880
11518C55880J95295K3456J33680Q9755j82609N1879j81879j46668j80183J1623
11508A70229L00318L21796R7606j43429m1825r7154K07440O9680q3530k62565
11498E38566j54879J68239o0447J01274L72495P0031j13136k08748J8987k13034
11488E19348M07071l7863k27563l77852j47839O875l0599J67025O0043L06894
11478F45540j0375j50582k05882j6871O9942O1777J96918L2553o4244j63500J74877
11467E70153j2260R4047J10965j85721j67751J22972N9383j6923J43071M310q6461
11456F35785j80598J38640O9840j67522P2677J22151j97866L1428j16787p3453
11446C34295k2233J84964J85806K63376R2873j86207j76374k03835Q3976N6962
$$ plain form
11518 355880 551175 574631 708311 798066 615457 667336 485457 338789 158606 170229
11508 170229 470547 792343 889949 746520 704695 607541 814981 884661 801131 538566
11498 538566 383687 551926 491479 592753 965248 1035279 922143 713395 732382 519348
11488 519348 926419 888556 660993 283141 135302 142177 111578 278603 338646 645540
11478 645540 635165 484583 278701 261830 331772 393549 590467 623020 558776 395276 570153
11467 570153 557893 651940 762905 577184 409433 532405 591788 574865 717936 722246 635785
11456 635785 455187 593827 663667 496145 568822 690973 493107 524535 407748 334295
11446 334295 312062 497026 682832 946208 1039081 852874 676500 472665 556641 613603
11436F13603J43092K540j11035j45507k9631n0848p3221J47340P1793k47707N4662
11425C75081K11701L5037k5945l5056k52117K4767m6926J4854K67728J56029j5649
11414G09504j10074q5525J33185j15526J85024q335l3767j12637j13140m5419
11404D03290k02530j15494J69705J50978J16683O7769J0162J55779J35679r3820
11394G98201l14079P2979Q3460p288r031r9237j55476N4408k2929l13548O576
11383I4036J56897K34720L38967K3243p0091j84140j20431J57739Q5428j36250
11373E80118q1486j84890p6693N9321J15187J76469J17836k8910p0404M8218J11441
11362G66207j01266J84519L8046j75783J49756K7018m0986k13398j07568J57280
$$ plain form
11436 613603 756695 759235 648200 502693 473062 422214 348993 496333 568126 320419 375081
11425 375081 586782 621819 595874 560818 308701 333468 286542 301396 569124 725153 709504
11414 709504 599430 513905 647090 531564 716588 708253 674486 561849 448709 403290
11404 403290 200760 85266 254971 405949 522632 590401 600563 756342 892021 798201
11394 798201 484122 557101 640561 633273 624242 525005 369529 423937 401008 87460 94036
11383 94036 250933 485653 824620 847863 777772 593632 473201 630940 716368 580118
11373 580118 498632 313742 237049 296370 411557 588026 705862 676952 606548 654766 766207
11362 766207 664941 849460 887506 711723 861479 888497 847511 634113 526545 683825
11352F83825p5461O1346j29357k2732K69508n6753k7551J46765N1795j12086l17723
11341D71576j87912K4455L4181k3309j62513p6421o9386J65232K02104K31591
11331F09598J45003o4825k63623P9090j05560K23518J56603r823n5646P2432j26315
11320F60452j77769j52676K8781M3866j78270l4199J39662J86027R3734n8581
11310E51027M83R1582j46225q8131o4547q0524o7939J26908J33589K5174j46190
11299C35207J03294J55358J23598M8371o733j63722k20730r6313K03413N0745
11289E32488m2690k6299j09751Q425L1792j0646J28808o5965k85981l4503K16528
11278C42206L6572j32117j66534m9114K28504M4919J3169J26080O5755j41642
$$ plain form
11352 683825 608364 669710 540353 517621 787129 730376 702825 849590 901385 789299 471576
11341 471576 283664 308119 342300 318991 156478 80057 10671 175903 378007 609598
11331 609598 754601 689776 426153 505243 399683 623201 779804 769981 714335 786767 660452
11320 660452 482683 330007 358788 402654 224384 190185 329847 515874 609608 551027
11310 551027 551510 643092 496867 408736 344189 263665 195726 322634 456223 481397 335207
11299 335207 438501 593859 717457 765828 759095 595373 374643 278330 481743 532488
11289 532488 489798 463499 353748 362173 393965 383319 512127 446162 160181 125678 342206
11278 342206 378778 246661 80127 31013 259517 304436 317605 443685 509440 367798
11268C67798j58930k76108J78130K08319K12784p4452J6448m0902P4460J48714
11258F56261J03065l8483k24182l45294j17033m9420L52007j2049k35284j13883
11248b4295n2091J14766L5949j43610N8196j08346Q6010M48555M2129q9767J52694
11237E20190J1674k34247R9458J16710o3870j61386o0379Q6530j49512r1570M8674
11226A22272J1287k29923N5560q0717n9989J63273J55477J40683O0640N1124P7682
11215D67369k04729L1687j53894j69288q6415J94644J06068L8852L0474k19577
11205C5191j67661K05899L64943K28422r1099o6140o6919R854j3489o6343L6335
11194D08993k2229n9401M9289k81873L2162J92715q2979j69649Q8691Q6846P254
$$ plain form
11268 367798 208868 -67240 110890 319209 531993 457541 473989 433087 507547 656261
11258 656261 759326 720843 496661 151367 34334 -15086 336921 324872 89588 -24295
11248 -24295 -76386 38380 74329 -69281 -11085 -119431 -33421 415134 457263 367496 520190
11237 520190 531864 297617 397075 513785 449915 288529 228150 314680 165168 73598 122272
11226 122272 133559 -96364 -40804 -121521 -181510 -18237 137240 277923 338563 389687 467369
11215 467369 262640 294327 140433 -28855 -115270 79374 185442 224294 254768 35191
11205 35191 -132470 73429 438372 666794 575695 509555 442636 452490 439001 372658 408993
11194 408993 386764 327363 376652 94779 126941 319656 236677 67028 155719 242565 249819
11183B49819o2108r8725o1700l115Q2150J78775L9446k28226j62998P2782K90905
11172B97005J22144J0726O9905K56526J72328k85431m07511n5660K5233k83675
11162g8410j65002O6513K10564K08401N7178j8140k58497j98954J60920K58458
11152B43031q0110P1997P4043o9859J10491r3255j77868J34678L2386j99344l09300
11141b63110l0049J01459J0728k2334Q4895L41708l5444p0318p0553K2183l6672
11130C2493L83722J78617K2163p450j93864k68121P1495N8326l9505m0950k61338
11119f4412r3167l8473m8404j35859o409K5648m6949K18523L40009L0936j33418
11108D8025o2058j34998l5888J82929J46117K61954K29444M7719k15611k26027
$$ plain form
11183 249819 187711 88986 27286 24171 106321 285096 324542 96316 -66682 6100 297005
11172 297005 419149 429875 499780 756306 928634 643203 235692 180032 205265 -78410
11162 -78410 -243412 -176899 33665 242066 299244 281104 22607 -176347 -15427 243031
11152 243031 162921 234918 308961 239102 349593 256338 78470 213148 245534 46190 -263110
11141 -263110 -293159 -191700 -180972 -203306 -118411 223297 187853 117535 46982 69165 32493
11130 32493 416215 594832 616995 609545 415681 147560 219055 277381 237876 196926 -64412
11119 -64412 -157579 -196052 -244456 -380315 -386724 -361076 -408025 -189502 150507 181443 48025
11108 48025 -14033 -149031 -184919 -1990 144127 406081 635525 683244 467633 241606
11098B41606P5987K8360q1763k08723l37743J3848J87233K91083J98014j8480
11088C89422j25210P6562K13421n694k00449P959o4216j85900j74878J07185J66047
11077B04249p354p8270Q0500j35650K0938J26832M8544o0752o3419J61574J11669
11066D08861j82514k33159R5882J57951J7243L0259q4116k0181j09914k6754J3380
11055F6938j3495K9468j22023K02838J13264p7616L8432J55696K7251Q03l2385
11044C89171R7607J58649k18093o2971r9084L03342P0366J53445K44109J00787
11034A137328Q9895L5052p4695M6291l646j20743j75068j84865K49959K25921
11024A225429L01045J44775J60981k40614j17153K12999o2520k37653j13988N2074
$$ plain form
11098 241606 317593 345953 264190 55467 -282276 -268428 -81195 209888 407902 389422
11088 389422 264212 340774 554195 548501 348052 356011 291795 105895 -68983 38202 204249
11077 204249 196895 118625 199125 63475 84413 211245 259789 199037 135618 297192 408861
11066 408861 226347 -6812 89070 247021 264264 294523 210407 190226 80312 53558 66938
11055 66938 53443 82911 -39112 163726 276990 199374 237806 393502 420753 421556 389171
11044 389171 486778 645427 427334 364363 265279 568621 638987 792432 1036541 1137328
11034 1137328 1227223 1262275 1187580 1233871 1230225 1109482 934414 749549 999508 1225429
11024 1225429 1526474 1671249 1832230 1591616 1474463 1687462 1624942 1387289 1273301 1325375
11014A325375j5945Q4989J20505m2044k818Q129k73690k18674O917j33001p9712
11003G80031k8156R6151O1294j69618O4645J63346M4032j19007J38097K9219k67586
10992G92448j61321k60725j73889o1297P941J72208J26324j27484j55407J07852
10982B66650j48414l52222j14946j7752J43214K81735L8290o2749K6405J90203
10972B50414K5163j35987r4146l53321j8865J53344K41227l3606o2163K40897
10962B12957q9594m3917j62464k2978m6817q7413J07159k4650k54561j64166K39113
10951c37331R8409K23372R3361q180J07383K81747J26520j72064k12144J39370
10941C40443n0122k63971j58997N6681o0639p6523p5062O4141O3525n4252O4583
$$ plain form
11014 1325375 1309430 1394419 1514924 1472880 1470062 1478191 1204501 985827 992744 859743 780031
11003 780031 751875 848026 909320 739702 804347 967693 1011725 892718 1030815 1060034 792448
10992 792448 631127 370402 196513 135216 143157 315365 441689 314205 158798 266650
10982 266650 118236 -233986 -348932 -366684 -223470 58265 96555 33806 60211 250414
10972 250414 275577 139590 45444 -307877 -326742 -173398 67829 34223 -27940 212957
10962 212957 123363 79446 -83018 -105996 -152813 -240226 -133067 -157717 -412278 -576444 -337331
10951 -337331 -238922 -15550 77811 69631 177014 458761 585281 413217 201073 340443
10941 340443 290321 26350 -132647 -75966 -136605 -213128 -288190 -224049 -160524 -214776 -150193
10930a50193j70798j07569K68992K09787K02001K5977j56521R1583J43976k51059
10920A06176j33632J6788m196n3836M6924q6521q4352M1350j344J53507J78073
10909A78937k8876l3560J13296q4931N3019N7692r3196n5684l6860J6921j59951
10898g3193j22606O1792p4036p7044O4448J65298L1174R8043J55369r8796j13524
10887A6925J00475R2813j4847l4257o3490k28368n3135j36191m7794m8627o4542
10876d81038J42646J0102P7709Q9928n873p4013k2396N3369o478k63174m2252
10865e21470K36103M11004K93715N1144k38343j11528m5684K25608j12567q9718
10855I8264k21494k15691k4352K59151n7749Q9670N9206N6802R8809L1297K7141
$$ plain form
10930 -150193 -320991 -428560 -159568 50219 252220 278197 121676 213259 357235 106176
10920 106176 -27456 -10668 -14864 -68700 -21776 -108297 -192649 -151299 -152643 864 178937
10909 178937 150061 116501 229797 144866 197885 255577 162381 106697 69837 86758 -73193
10898 -73193 -195799 -134007 -208043 -285087 -220639 -55341 -24167 73876 229245 130449 16925
10887 16925 117400 210213 195366 161109 97619 -130749 -183884 -320075 -367869 -416496 -481038
10876 -481038 -338392 -328290 -250581 -160653 -166526 -240539 -262935 -209566 -216044 -479218 -521470
10865 -521470 -285367 125637 419352 470496 232153 120625 74941 300549 187982 98264
10855 98264 -123230 -338921 -363273 -104122 -161871 -72201 -12995 43807 142616 173913 201054
10844B01054j3428O7959j02078o6973o8938l13809j55977j0786j07545M0454L87903
10833a42164k1900n4842J42817K23390m0917j41494j14407j37224J43978J42058
10823g05L1638k09362N2036j0011J35179K41792M1791Q5846p6826k81828l06109
10812b96559R1415K89856O0569j22907j26496q792j5971j77510k1938q3673j2861
10801d24867J7933k00753n5855L95130R0439J6087M256J5831j87589j00529n7077
10790d86994j11515K13466J16643m5448m9537k7078J57970q3806n401J45014j74240
10779c50926O9629j0598O956L1055J12906j83915q4404J17355j1718J99858M8077
10768e5725J71925j440j19820n4057k52465L2227P849J63550J0302j27463o6758
$$ plain form
10844 201054 187626 255585 153507 86534 17596 -296213 -452190 -462976 -570521 -530067 -142164
10833 -142164 -164064 -218906 -76089 147301 106384 -35110 -149517 -286741 -142763 -705
10823 -705 30933 -178429 -126393 -136404 -1225 240567 282358 368204 291378 9550 -296559
10812 -296559 -205144 84712 145281 22374 -104122 -112914 -128885 -306395 -328333 -412006 -424867
10801 -424867 -406934 -607687 -663542 -268412 -177973 -161886 -157630 -141799 -329388 -429917 -486994
10790 -486994 -598509 -385043 -268400 -313848 -363385 -390463 -232493 -316299 -321700 -176686 -350926
10779 -350926 -281297 -291895 -284939 -253884 -140978 -324893 -409297 -291942 -303660 -103802 -55725
10768 -55725 116200 114760 -5060 -59117 -311582 -279355 -271506 -107956 -97654 -225117 -291875
10757b91875M2990K24390K3581j89270j955p1315j60058O665P6193K56303j08216
10746a92567k93883n6601J56355o1384j33957l4713K00255J25825o9732K49708
10736a10694O7043r3998k33707O1033j12254n9202j11882R414l4713J36641J21273
10725c61046q5709K3052r0557J13058O9690j21303L5929l0439J45051j08505o4008
10714d74787J18834K00605o1419j98413M9210P4109M9462L3520k06743J24080
10704b91542j55316J67343j17060k08723J06753R2408m5698K1301L7113N0155
10694c43266O2287k7964j92009k0069j0594R2522K25510j77498j70126J38339
10684d22868K80798J04977p7340M7199R434j31332L5510j3641k78523o194p269
$$ plain form
10757 -291875 -248885 -24495 -914 -190184 -192139 -263454 -423512 -416847 -340654 -84351 -192567
10746 -192567 -486450 -543051 -386696 -448080 -582037 -616750 -416495 -290670 -360402 -110694
10736 -110694 -43651 -137649 -371356 -310323 -422577 -481779 -593661 -584247 -618960 -482319 -361046
10725 -361046 -446755 -423703 -514260 -401202 -331512 -452815 -416886 -447325 -302274 -410779 -474787
10714 -474787 -355953 -155348 -216767 -415180 -365970 -291861 -242399 -208879 -415622 -291542
10704 -291542 -446858 -279515 -396575 -605298 -498545 -406137 -451835 -430534 -393421 -343266
10694 -343266 -280979 -308943 -500952 -521021 -531615 -439093 -213583 -391081 -561207 -422868
10684 -422868 -142070 -37093 -114433 -67234 -57800 -189132 -153622 -167263 -445786 -451980 -459249
10673d59249n7310k4077M9163j4019m2077j08180k3111l042K03120J16562J32982
10662b29238J48711q7120J67814K32609N7301J4939j32465R988R389o5981k46062
10651a20115J04853P2042n1647j83217J62086J21092J36285N2248r3109k96817
10641i6299q993K18011J53509L23453J54111J19483M91812O62963N44031M63909
10631C025990K12345M89957P70363R20228Q10070J447398K167722K537327L488987
10622A5870387M884771O790069R258845J1562237J3260168J2554046R208512M401186
10614H7790221O2562k145042k209559L71279M347119R929570J5815633K2480559
10606A36442342K6809234K4573085J5170886K625655q334116j3404840j2125145
$$ plain form
10673 -459249 -516559 -540636 -491473 -505492 -547569 -655749 -678860 -681902 -478782 -362220 -229238
10662 -229238 -80527 -167647 167 232776 290077 305016 172551 182539 191928 125947 -120115
10651 -120115 -15262 56780 5133 -178084 -15998 105094 241379 293627 200518 -96299
10641 -96299 -105292 112719 266228 589681 743792 863275 1355087 2018050 2562081 3025990
10631 3025990 3238335 3728292 4498655 5418883 6228953 7676351 9844073 12381400 15870387
10622 15870387 20755158 27545227 36804072 48366309 61626477 74180523 83389035 87790221
10614 87790221 87852783 85707741 83498182 83869461 88216580 98146150 113961783 136442342
10606 136442342 163251576 187824661 202995547 205621202 197287086 183882246 171757101
10599A71757101o418692J353854J0628413K0304502K8999697L3101274K7853511
10592B87579660J2762087o567685k2333432k8526642k5779144j8629578j0075736
10585A88429530j149753P013416J3753906J6159949J1890116J018738j1937543
10578B25178359k1597982k4617967k2073021j6563102j0732887n612706j433009
10571A22547685J632380K331891L01696m043159r025710j2743850j4063622j2874141
10563G4063170j0628536q809304o840483n532019m379148l532768k995049k523470
10555B8822393k305416k106049k008667k014667j833271j516555j376320r74701
10547A4686747j061532j327026j003222q59961q41998j104677m98909m02436l04634
$$ plain form
10599 171757101 165338409 166692263 177320676 197625178 226624875 259726149 287579660
10592 287579660 300341747 293774062 271440630 242913988 217134844 198505266 188429530
10585 188429530 187279777 194293193 208047099 224207048 236097164 237115902 225178359
10578 225178359 203580377 178962410 156889389 140326287 129593400 123980694 122547685
10571 122547685 124180065 126511956 126813652 122770493 113744783 101000933 86937311 74063170
10563 74063170 63434634 54625330 47784847 42252828 37873680 34340912 31345863 28822393
10555 28822393 26516977 24410928 22402261 20387594 18554323 17037768 15661448 14686747
10547 14686747 13625215 12298189 11294967 10435006 9593008 8488331 7989422 7586986 7282352
10538G282352l98012k51568l58467n86232m81993l70886k78590k30835n3042J3966
10528D286693k1698k4298k80523k52942l7126k30654j63957R3451p7046j01939
10518C189961o7931l0617l31866j77488k27108j26886k3637Q1098k28186n240
10508B052100O4214j77845n7763k2165l9196l6901P0634L4667l15591j79945p7930
10497A314279O6946p5751L8762l52307l6036L87544K38330J25878j55270K4619
10487A576994j6403k6774Q7259p4552r407q9229P5718j41155j85025o7274J89341
10476A319493K98673J64684N3725Q6899k13038j10766j42857j45052m4053K31518
10466A499226K4884k23217K7866p6581Q0105j19439L9411n3568j01421p0456J37970
$$ plain form
10538 7282352 6884340 6632772 6274305 5688073 5206080 4835194 4556604 4325769 4272727 4286693
10528 4286693 4264995 4240697 3960174 3707232 3670106 3439452 3275495 3368946 3291900 3189961
10518 3189961 3122030 3091413 2759547 2582059 2354951 2228065 2204428 2285526 2057340 2052100
10508 2052100 2116314 1938469 1880706 1858541 1819345 1782444 1853078 1887745 1572154 1392209 1314279
10497 1314279 1381225 1305474 1344236 991929 955893 1343437 1581767 1707645 1552375 1576994
10487 1576994 1560591 1533817 1621076 1546524 1537117 1447888 1523606 1382451 1197426 1130152 1319493
10476 1319493 1618166 1782850 1836575 1923474 1710436 1599670 1456813 1311761 1267708 1499226
10466 1499226 1524110 1300893 1328759 1252178 1332283 1212844 1252255 1198687 1097266 1026810 1164780
10455A164780J09269p611J21093N5892L6984N0341j37448j78884j77937Q6359
10445A122838N7386O5146l696m422j17833k18125j65388Q8331K18605M4307j49925
10434I37224j55125N2766N8345l01294k62483o4012J67879K68321j15085r1218
10424D95318L8606L9714N8350p2941o3200K95850J84083k05665k6852r2940O6823
10413G17146k74239M5846P8294m7649N65L20266J52946j50968k05201j57569k69080
10402B10357j48484j221J03082Q2495J5553o1978J41392k6871p2486j2853N3286
10391B82272q699K90089J98039K289j67677m03155R446K65455m6069R4011l5052
10380D80949o8998J62832j5444k04366r1812K51546K08295q5391j60211L2211
$$ plain form
10455 1164780 1274049 1266438 1387531 1443423 1480407 1530748 1393300 1214416 1036479 1122838
10445 1122838 1180224 1245370 1241674 1237252 1119419 901294 735906 824237 1042842 1087149 937224
10434 937224 782099 834865 893210 591916 329433 265421 433300 701621 586536 495318
10424 495318 533924 573638 631988 559047 495847 791697 975780 770115 743263 650323 717146
10413 717146 442907 488753 567047 519398 519963 840229 993175 842207 637006 479437 210357
10402 210357 61873 60652 163734 246229 261782 199804 341196 314325 241839 228986 282272
10391 282272 273573 563662 761701 763990 596313 193158 202604 468059 421990 516001 480949
10380 480949 411951 574783 559339 354973 263161 514707 723002 637611 477400 509611
10370E09611j42245r8107J12885M3359L938j996J11530J38163p7416q0074K6164
10359E45812r7792P2999Q8425l7179j45960o7131O4880J3156j15499q9465k2706
10348B09540K15688J26647j01836l0089J12809L89786J895l8480p0873k47737
10338E67350j80744n8975r0146q4277j40037M1341j1574p6565J64148K95960m3546
10327C82935n6720j82817q6519J03116J43972r57K9190K1451j38958k5624O2397
10316B51466j1348l9785q9873j43593P2404M9378O8805k29582J16579J25759k36408
10305f6198j18738K01584J82106L3440l4539q7594o5128J05073J44501J4989l697
10294C05799j26869J94357J0611k51707j19133K12363J3927l6177j88265r8943
$$ plain form
10370 509611 367366 269259 382144 425503 429441 427445 538975 677138 599722 519648 545812
10359 545812 448020 521019 609444 572265 426305 359174 424054 437210 321711 232246 209540
10348 209540 425228 551875 450039 419950 532759 922545 924440 885960 815087 567350
10338 567350 386606 327631 237485 153208 13171 54512 42938 -33627 130521 426481 382935
10327 382935 326215 143398 56879 159995 303967 303010 332200 353651 214693 189069 251466
10316 251466 240118 200333 110460 -33133 39271 88649 157454 -72128 44451 170210 -66198
10305 -66198 -184936 16648 198754 232194 197655 110061 44933 150006 294507 309496 305799
10294 305799 178930 373287 383898 132191 13058 225421 239348 203171 14906 -84037
10284h4037P564P7013J36576J83946j12093N2748L304j86809p9106j5516j44537
10273a60947L2014K08615o9747k5740J10638M8295K0773m9046J42812K7728j61870
10262A23525k34281o8454K34087M46278p827j25457O1010J60049m5291l05499
10252B38140P837J1324j62215j92091J56402J52318j20917j28221j36976M7644
10242a26755M6539K0214p3628J67336r355l27342R3951L8694j6870j06409K28680
10231f4945L604o7724o9682J52187K10270n3542n0790K11105N6445l68401j94438
10220b35911P3772J22453j37828K8601M2354Q3834Q4708j77844m3941N5621l9100
10209a43281k5641k226J34482P2908j44331M0038J08568k4366K3128q3405m20311
$$ plain form
10284 -84037 -76473 540 137116 321062 208969 261717 265021 78212 -894 -16410 -160947
10273 -160947 -128933 79682 9935 -15805 94833 143128 163901 114855 257667 285395 123525
10262 123525 -110756 -179210 54877 501155 493328 367871 428881 588930 543639 238140
10252 238140 245977 257301 95086 -97005 59397 211715 90798 -37423 -174399 -126755
10242 -126755 -80216 -60002 -133630 33706 24351 -302991 -209040 -170346 -187216 -293625 -64945
10231 -64945 -61341 -129065 -198747 -46560 163710 110168 59378 270483 326928 -41473 -235911
10220 -235911 -162139 -39686 -177514 -148913 -106559 -22725 61983 -115861 -159802 -104181 -143281
10209 -143281 -168922 -171148 -36666 36242 -108089 -68051 40517 16151 39279 -44126 -464437
10198d64437J3599K78109O629m64822k07998J54018J35066J18499K31148J00069
10188a00120j12397J81J67460K87297K28929j59971J08786j43530J1865R1842
10178C80342P7667M4553l067r9471O4873p8268j94288j38308m2626L37126M04620
10167G53153J40607j18472k46082j30956J02949J65267J19401J7193J81726K29352
10157A214138L07730J44078j27755l51098k18201n4898M9413N1646k69361j57279
10147E88413K21241J64596L82697J70554J635k31603k08205l20714j0819l54723
10137D03072J0479o4986q8978J23407R9640N9466j46j62763l1349k00500r2605
10126E4737j17180j05060R274J18893P4534L0967J00152Q731K420k4959n0889
$$ plain form
10198 -464437 -450838 -172729 -166100 -630922 -838920 -684902 -549836 -431337 -200189 -100120
10188 -100120 -212517 -212336 -44876 242421 471350 311379 420165 276635 288500 380342
10178 380342 458009 502562 499495 400024 464897 386629 192341 54033 11407 348533 753153
10167 753153 893760 775288 529206 398250 501199 666466 785867 803060 984786 1214138
10157 1214138 1521868 1665946 1538191 1187093 968892 913994 963407 1015053 745692 588413
10147 588413 809654 974250 1356947 1527501 1529136 1297533 1089328 768614 757795 403072
10137 403072 413551 348565 259587 382994 482634 542100 541954 379191 347842 147342 54737
10126 54737 -62443 -167503 -158229 -39336 35198 66165 166317 175048 177468 152509 101620
10115A01620M4999K84530j43717j48952q6755o6790n9665j14998k8419M89407
10105B71260j1083k14288o0345M0488M0066Q1027j73022j06798K5670J73053j44414
10094g8386J25248L9559k24938l6894N2609J20036L8056k37092j76625k26190
10084f04617J30210J25003O495J03433J55342l3887n3224Q808M6559k9894Q6717
10073e9055Q6242k53264j60750j39843J46890J30500k76046J09953K23162J8213
10063a73998J2425q3575K09164J77954r7213j40290j72480M0743J67108j69126
10053b29288j01730J0221K22386J32330O13j95999J45533r7908q4775q1997K16158
10042f4456l3490m8775J06071n0142j93810q306l8374N9766J21309r9995p2936
$$ plain form
10115 101620 146619 431149 287432 138480 51725 -15065 -74730 -189728 -218147 271260
10105 271260 260177 45889 -14456 26032 66098 147125 -25897 -132695 -107025 66028 -78386
10094 -78386 46862 86421 -138517 -175411 -122802 -2766 35290 -201802 -378427 -604617
10084 -604617 -474407 -349404 -342909 -239476 -84134 -118021 -171245 -162437 -115878 -145772 -59055
10073 -59055 27187 -226077 -386827 -526670 -379780 -249280 -525326 -415373 -192211 -173998
10063 -173998 -161573 -245148 -35984 141970 44757 -95533 -268013 -227270 -60162 -229288
10053 -229288 -331018 -320797 -98411 33919 34532 -161467 -15934 -113842 -198617 -280614 -64456
10042 -64456 -97946 -146721 -40650 -90792 -284602 -292908 -331282 -271516 -150207 -250202 -323138
10031c23138R1645l8302j46291j90035J94633L06902k3041j59585J51759K73577
10021A38124j88821j75948j26454j74496j93552L133O1543m3541R4951j163j57079
10010g63303j17470P6814K79895J99719J0400Q6964j09222j03295K0217J53678
10000b65603L3929j05586p2273P3531O6420J97897R4765k69656k22352J20316
9990c48612J79893K4035M4739l3491K2104J05940N5606k27374j80738Q1708n4056
9979c30246j17944J77403n0755j73766l1126O9950Q858k4433J97423J40920M4858
9968h8858r1709k8968J1143N4715M6161l1131J61441P4875o9785k93961l66629
9957f22706J7103L8261N9790L7909j7090J60743n4549J32707Q3839J32398k0454
$$ plain form
10031 -323138 -231493 -269795 -416086 -606121 -411488 -104586 -127627 -287212 -135453 138124
10021 138124 -50697 -226645 -353099 -527595 -721147 -718014 -656471 -700012 -605061 -606224 -763303
10010 -763303 -880773 -803959 -524064 -324345 -313945 -226981 -336203 -439498 -419281 -265603
10000 -265603 -231674 -337260 -409533 -336002 -269582 -71685 23080 -246576 -468928 -348612
9990 -348612 -168719 -144684 -99945 -133436 -111332 -5392 50214 -177160 -357898 -276190 -330246
9979 -330246 -448190 -270787 -321542 -495308 -526434 -456484 -447626 -472059 -274636 -133716 -88858
9968 -88858 -180567 -209535 -198392 -143677 -97516 -128647 32794 107669 37884 -256077 -622706
9957 -622706 -605603 -567342 -507552 -469643 -486733 -325990 -380539 -247832 -163993 -31595 -52049
9946e2049n105k01562k78257q7452L25515K17462j49439P1554J4610j98204j7648
9935c60575K01610K79738K1696N2654J1833j28751j71472o2161J5748P7086O935
9924e5659j93668j12572J76815J07582J0287n9898K6661n8673q0464J46040J0233
9913h3316R8599j445p5196j06313j35580j18298m1816L9263J8805m9051K85690
9902a68658J134N7154J31763o1771r6619j41925l6422l42507p1472N35688q9555
9891b83190k23432J5654k8928m2408l0039R232K32020j45705k7523k278j17101
9880f43698J39118J66146j59283l0754j15596R2923L09079K7594j43105l7366
9870c94942q7150k49550j12379K79039J75982J49696p6415O7239j9494j03976
$$ plain form
9946 -52049 -57154 -258716 -536973 -624425 -298910 -81448 -230887 -159333 -144723 -342927 -360575
9935 -360575 -158965 120773 142469 195123 206956 78205 -93267 -155428 -139680 -62594 -55659
9924 -55659 -249327 -361899 -185084 -77502 -67215 -127113 -100452 -159125 -239589 -93549 -83316
9913 -83316 15283 13838 -61358 -167671 -303251 -421549 -463365 -424102 -405297 -454348 -168658
9902 -168658 -167524 -110370 21393 -40378 -136997 -278922 -315344 -657851 -729323 -193635 -283190
9891 -283190 -506622 -490968 -519896 -562304 -592343 -583111 -351091 -496796 -524319 -526597 -643698
9880 -643698 -504580 -338434 -497717 -528471 -644067 -551144 -242065 -214471 -357576 -394942
9870 -394942 -482092 -731642 -844021 -564982 -389000 -239304 -315719 -248480 -267974 -371950
9860c71950J8796J1793M780j28016R413j8442m5151k16602j87963J3522R6301
9849h13519K19032J98125K3186R1435k26864Q9988j07942k46770l9727J2806N6013
9838g44237j85088R8019L70632J61173j55234j60768p5777J64712N8137J22063
9828c46368O5187r514J08831o0146j64500r7779j30903p3414p3732J84628R1011
9817e06699J91823m4052j71749L378J75650o9555l64374r7760L76864J77280M8975
9806b80219r126o5570J79687j12117j8107L5486l6373N9704O1459p5960n4939
9795c16075L4395m0091L579M7964J98310M0666p4922m53416M0569L31320k4976
9784b12677j6168N6436n4485j12139R4092l0314q0152q9909q5772J62922N0250
$$ plain form
9860 -371950 -353154 -341361 -336581 -464597 -455184 -473626 -518777 -735379 -923342 -909820 -813519
9849 -813519 -594487 -396362 -373176 -281741 -508605 -418617 -526559 -773329 -813056 -800250 -744237
9838 -744237 -929325 -831306 -460674 -299501 -454735 -615503 -691280 -526568 -468431 -346368
9828 -346368 -281181 -290695 -181864 -242010 -406510 -504289 -635192 -708606 -782338 -597710 -506699
9817 -506699 -314876 -358928 -530677 -527299 -351649 -421204 -785578 -883338 -506474 -329194 -280219
9806 -280219 -289345 -354915 -175228 -287345 -305452 -269966 -306339 -246635 -185176 -261136 -316075
9795 -316075 -281680 -321771 -318192 -270228 -71918 -31252 -106174 -559590 -519021 -187701 -212677
9784 -212677 -228845 -172409 -226894 -339033 -244941 -275255 -355407 -445316 -531088 -368166 -317916
9773c17916O3370j9104n5894j34782q0915J32292p8166k35268J65738K63009Q4069
9762b13567m9789j34872j73157j594J01765O4557j8607J8576J44095K19838O7402
9751B4647k58854n4555K2574j4550J73911j31099j37319j14341K55784Q4265l47970
9740d97507j72946K08167K20652j48714O9018k01207k08603L53275Q494o264j25778
9729e01413r8647J84674L31114J3248l71206k31646j52616J15872L29253J33170
9719b48197k40143j44438M8216j16J93680R2080J17296J15521k07436j57566j20464
9708e51567j63724k18022j49002R4008K60330N6359j61075K11504J17657L8560
9698d64972j21861m8114Q000J67487L6444m4569l4223l231O5196J48998L28254
$$ plain form
9773 -317916 -254546 -273650 -329544 -464326 -545241 -412949 -491115 -726383 -560645 -297636 -213567
9762 -213567 -263356 -398228 -571385 -572979 -471214 -406657 -425264 -406688 -262593 -42755 24647
9751 24647 -234207 -288762 -266188 -280738 -106827 -237926 -375245 -489586 -233802 -149537 -497507
9740 -497507 -670453 -462286 -241634 -390348 -321330 -522537 -731140 -377865 -369371 -375635 -501413
9729 -501413 -600060 -415386 -84272 -71024 -442230 -673876 -826492 -710620 -381367 -248197
9719 -248197 -488340 -632778 -584562 -584678 -390998 -298918 -181622 -66101 -273537 -431103 -551567
9708 -551567 -715291 -933313 -1082315 -988307 -727977 -671618 -832693 -621189 -503532 -464972
9698 -464972 -586833 -634947 -626947 -459460 -423016 -467585 -501808 -505039 -439843 -290845 37409
9687C7409J19873l17800l03993j27848O133j5379j06314j3064O3742J55161Q3781
9676d18299P2134M9981K04063o6027k01719n5765n0782p5877j84266R3699R8048
9665e34810J14664N3501R6892Q3464N4938m9895k3472j76439l017l723L8240j5615
9653c65272K5994J8560L87222M63068M38424L46595L42636j545j71647k82456
9643A201579m47062k64335q2397L0941j36159n4968j3048k72405P4077L354J80801
9632B20378J01934j09376k13895j22515J08340J40207Q4345j46848j59357p3632
9622a70419J027L1238J21886J32655O3806r3314J17776N1034Q0047Q7416o4411
9611C58741j70406k4469J23698K7293j03264L1478K41962p2772j40587k2860j10793
$$ plain form
9687 37409 157282 -160518 -464511 -592359 -586226 -601605 -707919 -720983 -657241 -502080 -418299
9676 -418299 -346165 -296184 -92121 -158148 -359867 -415632 -466414 -542291 -726557 -632858 -534810
9665 -534810 -420146 -366645 -269753 -186289 -131351 -181246 -204718 -381157 -384174 -387897 -349657 -365272
9653 -365272 -339278 -320718 66504 529572 967996 1314591 1657227 1655682 1484035 1201579
9643 1201579 754517 490182 407785 438726 302567 247599 234551 -37854 36223 39577 220378
9632 220378 322312 212936 -959 -123474 -15134 125073 209418 62570 -96787 -170419
9622 -170419 -169392 -138154 -16268 116387 180193 86879 204655 255689 335736 423152 358741
9611 358741 188335 163866 287564 314857 211593 243071 485033 412261 271674 248814 138021
9600A38021k112Q168J40566P0751j73170O1174j52330J07866j32552j84248j57517
9589b75383k2572J22380J6156K27488L82249R1372k35469j40110n811j00603M5941
9578A05638L5017j25537k10344J01739O0668L9906J76589r8133j95388j64537
9568b74382K80173j06583j67042k2163P6138J47411J32623n3540j58793K488j01498
9557b45168j91510J09814J64117j0396p0825j16226O9423j7614r9377j64155m3694
9546f15611n2306j7313Q299n3216J41881O9191o982p8162R9274J24106O3881K5077
9534b91881M9378Q2243q0818O5982J2774r7130k29246L2155Q541j05293N2414
9523e00881J23248k92242j70257J36852L64011J47785j63718j274j0899p7881
$$ plain form
9600 138021 135909 144077 284643 355394 182224 243398 91068 198934 66382 -117866 -275383
9589 -275383 -297955 -175575 -159419 68069 450318 541690 306221 166111 160300 59697 105638
9578 105638 140655 15118 -195226 -93487 -32819 7087 183676 85543 -109845 -274382
9568 -274382 5791 -100792 -267834 -289997 -213859 -66448 66175 12635 -146158 -143670 -245168
9557 -245168 -436678 -326864 -162747 -173143 -243968 -360194 -290771 -308385 -407762 -571917 -615611
9546 -615611 -667917 -685230 -676931 -730147 -588266 -519075 -526057 -604219 -504945 -380839 -316958 -291881
9534 -291881 -242503 -160260 -241078 -175096 -162322 -259452 -488698 -456543 -448002 -553295 -500881
9523 -500881 -377633 -669875 -840132 -703280 -339269 -191484 -355202 -356476 -367375 -445256
9513d45256J22179K23400K5484r672j35842k69666J7758J27343J6469n3012J35165
9502b45650m8176q222J33730p2075l9926J74127K6370k69272r8367j0330L19438
9491a38353J07551j21805j46073M7868N5279J32611k24928L5961L5067p1381K9241
9480b58962J02732K24783J78482J6333J01567J05841j77961o6822k00510j60449
9470a34966K8353J04068j00978K82211Q6123R3161N3728o9609J96233j21982k49063
9459A67279J1144p9374R4803J18632O7693k9034o5154L3335O4747j1587l2515
9448C39969J26120P8455M3483K60855J69961K593j5444L6760j30987n4460j52066
9437G05239j01016O5463j75104j58862m0045K57476k4128p8063J147R6680J1783
$$ plain form
9513 -445256 -323077 -99677 -74193 -83865 -219707 -489373 -471615 -344272 -327803 -380815 -245650
9502 -245650 -293826 -302048 -168318 -240393 -280319 -106192 -79822 -349094 -447461 -457791 -138353
9491 -138353 -30802 -152607 -298680 -250812 -195533 -62922 -287850 -251889 -216822 -288203 -258962
9480 -258962 -156230 68553 247035 263368 364935 470776 292815 225993 25483 -134966
9470 -134966 -106613 -2545 -103523 178688 264811 357972 411700 342091 538324 416342 167279
9459 167279 178423 99049 193852 312484 380177 351143 285989 319324 384071 372484 339969
9448 339969 466089 544544 588027 848882 1018843 1021436 1005992 1042752 911765 857305 705239
9437 705239 604223 669686 494582 335720 295675 553151 529023 450960 452107 548787 560570
9426E60570j26112j00720k73068q7996K67217K25905j02083q6349k68114j6130
9416f880Q5671R8516l8748O2474l5138J32347K24794j95993p9122J26060n5162
9405C18819j45546Q5305M4017J72467N5423l7189j62071O5450K38821k52133q7055
9394B96308q1344M3952K0986j98890n2818N1681K01117k43879k43104j03790P5716
9383b34065J33969J28146k16054k94939p0068L1594K12142M9483J22369J1008
9373a26415n4649q0014R5983j92424j00767J04759J90265L2405o4876Q4232k04380
9362c15881k20699M2919J5557k38281J44852L9916N6503J72370j09431k23616
9352f35791J31664r7408K06808K06142O4834k22654j11564N3271j09018j93328
$$ plain form
9426 560570 434458 333738 60670 -27326 239891 465796 363713 277364 9250 -6880
9416 -6880 78791 177307 138559 201033 165895 298242 523036 327043 247921 373981 318819
9405 318819 173273 258578 302595 475062 530485 493296 331225 396675 635496 383363 296308
9394 296308 214964 258916 279902 81012 28194 79875 280992 37113 -205991 -309781 -234065
9383 -234065 -100096 28050 -188004 -482943 -553011 -521417 -309275 -259792 -137423 -126415
9373 -126415 -181064 -261078 -165095 -357519 -458286 -353527 -163262 -130857 -195733 -111501 -315881
9362 -315881 -536580 -493661 -478104 -716385 -571533 -531617 -475114 -302744 -412175 -635791
9352 -635791 -504127 -601535 -394727 -188585 -123751 -346405 -457969 -404698 -513716 -707044
9342g07044L22398M22327O7861k61587k01077O6750j07586j62157k14253k4335
9332g98703r8403K5595K81245K48355J39974j03981o7756J25749J89833N848j25955
9321a78199q8492J21152J63234j29823l07227J03770J7442J18813J67273R0720
9311G8663L81764M72522Q8943J73726M5938P0928M06247P77661N50426O15773
9301C662591J225717J394046J165264J203786J391700R86337M36649k706r2598
9292A1370786m8219k83072o9117n2797J77700N88147P74357J111293J500045J680010
9282A6749133J215479P53299O00095L6401k96383k90533P4943J66685L96687P56753
9272B0162559J013896J301214K044942K508519K942754L170040L515013L735350
$$ plain form
9342 -707044 -384646 37681 105542 -156045 -357122 -290372 -397958 -560115 -774368 -798703
9332 -798703 -897106 -871511 -590266 -341911 -201937 -305918 -373674 -247925 -58092 -52244 -178199
9321 -178199 -266691 -145539 17695 -112128 -419355 -315585 -298143 -179330 -12057 78663
9311 78663 460427 932949 1021892 1195618 1241556 1312484 1718731 2496392 3046818 3662591
9301 3662591 4888308 6282354 7447618 8651404 10043104 11029441 11466090 11463384 11370786
9292 11370786 11322567 11039495 10970378 10917581 11095281 11683428 12457785 13569078 15069123 16749133
9282 16749133 17964612 18717911 19318006 19354407 19058024 18767491 18842434 19009119 19405806 20162559
9272 20162559 21176455 22477669 24522611 27031130 29973884 33143924 36658937 40394287
9264D0394287L598659K979482K322111J686866J037227J42784j51457l46464m2197
9255E1621298j14445J04350P61929R53699J008305J443559J769344J454471J166980
9246F0169490J313749J389911J083678J073115J029011J257250J962798K436740
9238G1715742L053075L011072L182985L088253K468946K211207J726529J602062
9230I2059871J622756K239902K668891K412861K302495K102919J983292K002648
9222A09395635K061387K358521K717841L046503L360676L264325K846542K611050
9214A31662480K219712J399159N00202m52213j406798k119564k499276k673692
9206A26630010k707340k453091j763165j471974j266612q10093k27968Q4685L98881
$$ plain form
9264 40394287 43992946 46972428 49294539 50981405 52018632 52161416 52009959 51663495 51621298
9255 51621298 51506853 51611203 52373132 53326831 54335136 55778695 57548039 59002510 60169490
9246 60169490 61483239 62873150 63956828 65029943 66058954 67316204 69279002 71715742
9238 71715742 74768817 77779889 80962874 84051127 86520073 88731280 90457809 92059871
9230 92059871 93682627 95922529 98591420 101004281 103306776 105409695 107392987 109395635
9222 109395635 111457022 113815543 116533384 119579887 122940563 126204888 129051430 131662480
9214 131662480 133882192 135281351 135781553 135329340 133922542 131802978 129303702 126630010
9206 126630010 123922670 121469579 119706414 118234440 116967828 116157735 115929767 116014452 116413333
9197A16413333J267182K290397K666735K747304L563386L972827M144390M445231
9189A41510785M414433M189552L581805K848015K321421J747174Q68301j85912
9181A61295574j178620k308032l216601m089814m788310m836000m742363m525938
9173A31609896m109809l751429k956420k650572j967655j206910j05655Q79931
9165A15741377J498553J892502K026462J837868R14031L5688q90971j416897j308798
9156A20329815r52914l52267J24490J73087l11137r21679j672268k592071l207032
9147A10618024l325909l185924k642018j590800j307504q82169q99774p66657
9139I6017269p12448j055495j737896k757036l381490l797070m202858m441020
$$ plain form
9197 116413333 117680515 119970912 122637647 125384951 128948337 132921164 137065554 141510785
9189 141510785 145925218 150114770 153696575 156544590 158866011 160613185 161481486 161295574
9181 161295574 160116954 157808922 154592321 150502507 145714197 140878197 136135834 131609896
9173 131609896 127500087 123748658 120792238 118141666 116174011 114967101 114861446 115741377
9165 115741377 117239930 119132432 121158894 122996762 123910793 123946481 123055510 121638613 120329815
9156 120329815 119376901 119024634 119149124 119322211 119011074 118089395 116417127 113825056 110618024
9147 110618024 107292115 104106191 101464173 99873373 98565869 97683700 96783926 96017269
9139 96017269 95304821 94249326 92511430 89754394 86372904 82575834 78372976 73931956
9131G3931956m282311l995135l406653k784870j960536j541431o83879J03666
9123E5380807N92378J173126K057346K668355L561023M554787M865138N181892
9115H0034852N854832O001482O319377O652130O407212N807714N514625M810068
9107A27402292L720765K926389K059456J178791N81150j39821j73967K48355J070116
9098A38873526J618398K184239K949703L362631M010213M384606M254390M468513
9090A66106219M727506M776098M826086M783883M488012M492951M378097M138578
9082B02717430L966492M211152M607988M820811N171412N979930O361119O428098
9074B44264432O381649O544424N892825N312731M453764L453772K669773J749586
$$ plain form
9131 73931956 69649645 65654510 62247857 59462987 57502451 55961020 55277141 55380807
9123 55380807 55973185 57146311 59203657 61872012 65433035 69987822 74852960 80034852
9115 80034852 85889684 91891166 98210543 104862673 111269885 117077599 122592224 127402292
9107 127402292 131123057 134049446 136108902 137287693 137868843 137729022 137555055 137803410 138873526
9098 138873526 140491924 142676163 145625866 148988497 152998710 157383316 161637706 166106219
9090 166106219 170833725 175609823 180435909 185219792 189707804 194200755 198578852 202717430
9082 202717430 206683922 210895074 215503062 220323873 225495285 231475215 237836334 244264432
9074 244264432 250646081 257190505 263083330 268396061 272849825 276303597 278973370 280722956
9066B80722956J680957J383408P03235n8684q33117j576573k666579l200646l533544
9057B72621413l313072k566075k253451k335288k085320k172097k138291k166091
9049B53591728j296723L89133K348112L825349N586983P327265R033124R970143
9041B90775114J0042936R361717Q307658O358377M008649J039592k336571m908910
9033C22648562p103995q658405r491270r404647q585210p818088o642707n764738
9025B59179502n281229m573222l873186l890772l662427k868664k451911k374707
9017B30203384k023721k211121k921886l620976l934010l715222l779151l547086
9009B04450211k448872j638729j235881q82090p37379o06784p74954j116738j872061
$$ plain form
9066 280722956 282403913 283787321 284490556 284431872 283598755 282022182 279355603 276154957 272621413
9057 272621413 269308341 266742266 264488815 262153527 260068207 257896110 255757819 253591728
9049 253591728 252295005 252684138 255032250 258857599 264444582 271771847 280804971 290775114
9041 290775114 300818050 310179767 318487425 324845802 328854451 329894043 327557472 322648562
9033 322648562 315544567 306886162 297394892 287990245 279405035 271586947 264944240 259179502
9025 259179502 253898273 249325051 245451865 241561093 237898666 235030002 232578091 230203384
9017 230203384 228179663 225968542 223046656 219425680 215491670 211776448 207997297 204450211
9009 204450211 202001339 200362610 199126729 198244639 197507260 196900476 196125522 195008784 193136723
9000A93136723k520806k902001l671193m334590m499165m779836n034154n172790
8992A60222188n370834n426362n606729n744939n573340n772032o068614o053774
8984A14605564o000753n685767n390963m818883m477186l861696l163670k285148
8976G8921498j832587j297177p11288k07401Q8409K80550o0069j48795o89642
8967G4343498j309779j825448k005932k227914k169899k285021k745984k919911
8959E6853610l037347l285618k957167k932163k921234k695628k615634k437049
8951C3971770k205366k260508k076476j885511j564008j335307j285291j220515
8943B0138788q08584j080119r15313q76659r60875m82408o03455n78950l89939
$$ plain form
9000 193136723 190615917 187713916 184042723 179708133 175208968 170429132 165394978 160222188
8992 160222188 154851354 149424992 143818263 138073324 132499984 126727952 120659338 114605564
8984 114605564 108604811 102919044 97528081 92709198 88232012 84370316 81206646 78921498
8976 78921498 77088911 75791734 75080446 74873045 74961454 75242004 75181935 75033140 74343498
8967 74343498 73033719 71208271 69202339 66974425 64804526 62519505 59773521 56853610
8959 56853610 53816263 50530645 47573478 44641315 41720081 39024453 36408819 33971770
8951 33971770 31766404 29505896 27429420 25543909 23979901 22644594 21359303 20138788
8943 20138788 19330204 18250085 17334772 16458113 15497238 15014830 14411375 13832425 13442486
8934A3442486n25882l50286n08963o48334l78700j83342k58788n10796l68820
8925I708575n2240q4509j98104n5601l75328k82238O8091j43914j80941j71142
8915H232649r5927k29915k67119j07144k8681m3422l05683J65955K11427N6672
8905G588812k42091k75098m77574k63213R8176J12301K3395j52688n9819k64382
8895F087819j15692r3310J50347j67263K80756n3963l22128j99860M343R2713
8885E663762o6554m43J21873j76804j1560N7085N6859K89016M8081l02732k19992
8874E458591k06219l7414j6536K27328J21883r1743L5883k99223k48834k4429
8864D919287L0099J15887J36146q5002k95858j21043j90010J28591K33044j03519
$$ plain form
8934 13442486 12916604 12566318 12057355 11409021 11030321 10846979 10588191 10077395 9708575
8925 9708575 9656335 9571826 9373722 9318121 8942793 8660555 8728646 8584732 8403791 8232649
8915 8232649 8136722 7906807 7639688 7532544 7503863 7460441 7154758 7320713 7532140 7588812
8905 7588812 7346721 7071623 6594049 6330836 6429012 6541313 6564708 6412020 6352201 6087819
8895 6087819 5972127 5878817 6029164 5861901 6142657 6088694 5766566 5566706 5571049 5663762
8885 5663762 5597208 5596765 5718638 5541834 5530274 5587359 5644218 5933234 5981315 5678583 5458591
8874 5458591 5252372 5214958 5198422 5425750 5547633 5455890 5491773 5192550 4943716 4919287
8864 4919287 4949386 5065273 5201419 5116417 4820559 4699516 4509506 4638097 4871141 4767622
8854D767622J6407K7110q777q6619k88695j06281n4770J62223R2703j86135k98581
8843D036207o0936k419o2809j7611O2671K28371J78294l3269p9373Q3269N9040
8832D391435O2439L0159j22774k2087j62331k10284J70938L4176p8695j7259j418
8821D074299N9215l515j20806q6504p2710Q052k99825N409J79870J09888j30328
8810C723045o9080J03032J29014j51365L040J47541o9353l13934l33501J86481
8800C354920M22319K44696l64833k17393n9547o6482R9956R3883j53736j32618
8790C221165M5875j7092m6539j48847j3112M2950J3699j23067m3083k7715J7287
8779B921521k05167N7641K26407j46767m958J4498J76406K6130l49499J01929
$$ plain form
8854 4767622 4784029 4811139 4802362 4715743 4427048 4320767 4265997 4428220 4520923 4334788 4036207
8843 4036207 3975271 3972852 3910043 3892432 3955103 4183474 4361768 4328499 4249126 4332395 4391435
8832 4391435 4453874 4484033 4361259 4339172 4176841 3966557 4137495 4171671 4092976 4075717 4074299
8821 4074299 4133514 4129999 4009193 3922689 3849979 3858031 3558206 3563615 3743485 3853373 3723045
8810 3723045 3653965 3756997 3886011 3734646 3737686 3885227 3815874 3501940 3168439 3354920
8800 3354920 3777239 4021935 3657102 3439709 3380162 3313680 3413636 3507519 3353783 3221165
8790 3221165 3267040 3249948 3203409 3054562 3041450 3084400 3098099 2975032 2931949 2904234 2921521
8779 2921521 2716354 2773995 3000402 2853635 2848677 2863175 3039581 3065711 2716212 2818141
8769B818141l0919j30690p536J67922j2301k15803j21280K7531J2186J65141O8376
8758B740768j50134j56950k00441k878Q8358J24785j05178p1942P1509J43604
8748B481501K15774k8595m88345j45690Q4054Q69J59940K16351M7416k69018j45997
8737B128260p9196m5467J66502r1307j45606q5239J69819K13292r6933q4600Q0199
8726B129724J28001p2351k23652m599j26313j90433R1563p5485K5703L04200m9812
8715A936546j60634o0604L5806L67905J76769K21043o3570O8934K0901r7364J5874
8704B461606q1885j89810M4105P1152J9349j20707M0049J08396J03223N0675k91245
8693B214908j71532O8484K93420j32474k28652j50104k2864O2374K88978K59386
$$ plain form
8769 2818141 2787222 2656532 2648996 2816918 2804617 2588814 2467534 2495065 2507251 2672392 2740768
8758 2740768 2590634 2433684 2233243 2230365 2318723 2443508 2338330 2266388 2337897 2481501
8748 2481501 2697275 2668680 2180335 2034645 2118699 2119568 2279508 2495859 2543275 2274257 2128260
8737 2128260 2049064 2003597 2170099 2078792 1933186 1847947 2017766 2231058 2134125 2049525 2129724
8726 2129724 2257725 2185374 1961722 1957123 1830810 1640377 1731940 1656455 1682158 1986358 1936546
8715 1936546 1775912 1715308 1751114 2119019 2295788 2516831 2453261 2522195 2543096 2445732 2461606
8704 2461606 2379721 2189911 2234016 2305168 2324517 2203810 2243859 2352255 2455478 2506153 2214908
8693 2214908 2043376 2111860 2405280 2272806 2044154 1894050 1871186 1933560 2222538 2481924
8683B481924p256q5923o172P3584j49357j16294l4045L0375K07818M2945J93483
8672B631082K53325l6345p5625K0601k00436j0845L8912K04765L0606k97873J11452
8661B669619L0488o6557O4451P4387J60732Q3712j05584j19325n2989l4953j23060
8650B580921m6645Q6603K95188J14810o1588J3460O6775q5388j11585J51095Q263
8639C011909J91637R8639O9829l0761j51923r8955j29359Q0075J851K3116R8675
8628C164733J26220K15809k33542l98925k67538Q1770R4313J28000p0002j10251
8618B730587k56813k33965k01235K45159K46564J89903L2120R5869R4321K4674
8608B967184R6861k2772j06211L29650L3598k91877K3212j72941j82872l5886
$$ plain form
8683 2481924 2474668 2388745 2382573 2456157 2306800 2190506 2156461 2186836 2394654 2437599 2631082
8672 2631082 2884407 2848062 2772437 2793038 2592602 2581757 2620669 2825434 2856040 2558167 2669619
8661 2669619 2700107 2633550 2698001 2772388 2933120 3016832 2911248 2791923 2738934 2703981 2580921
8650 2580921 2534276 2620879 2916067 3030877 2969289 2982749 3049524 2964136 2852551 3003646 3011909
8639 3011909 3203546 3302185 3372014 3341253 3189330 3090375 2961016 3041091 3042942 3066058 3164733
8628 3164733 3290953 3506762 3273220 2874295 2606757 2688527 2782840 2910840 2840838 2730587
8618 2730587 2473774 2239809 2038574 2283733 2530297 2720200 2752320 2848189 2942510 2967184
8608 2967184 3064045 3041273 2935062 3264712 3298310 3006433 3029645 2856704 2673832 2637946
8598B637946o7428j6980k6335R3818r4463J8990K71960J2955l8777l871J04107
8587B891922J26356j07128j25587k1363K33516J57498L11R9520J32514J48952
8577C536511L2284o3224j55704J34809K65364j7215o32062n07346j6663J79577
8567B756331o1739j06442r9165j45480j48681j63033o9940q568p7095J5418r5764
8556A795842p8771J4902k631K6812r7332O447j43888j12828N319J92161J19859
8545A725892k13016k57685l9774N1065M1804k02491j09430N0093p7392J47873
8535A116939N7131p9172J03262p4948j8932J79025j992j31085k18484r4987K29503
8524A066260K05208O5537n0409j13679Q0933P2159n0695j19353K03491K9330l35910
$$ plain form
8598 2637946 2570518 2553538 2527203 2621021 2526558 2545548 2817508 2830463 2791686 2787815 2891922
8587 2891922 3018278 2911150 2785563 2764200 2997716 3155214 3155525 3255045 3387559 3536511
8577 3536511 3568795 3505571 3349867 3484676 3750040 3732825 3100763 2593417 2576754 2756331
8567 2756331 2694592 2588150 2488985 2343505 2194824 2031791 1961851 1953283 1876188 1891606 1795842
8556 1795842 1717071 1731973 1729342 1756154 1658822 1665269 1521381 1408553 1413872 1606033 1725892
8545 1725892 1512876 1255191 1215417 1266482 1308286 1105795 996365 1046458 969066 1116939
8535 1116939 1174070 1094898 1198160 1123212 1104280 1283305 1281313 1150228 931744 836757 1066260
8524 1066260 1271468 1337005 1286596 1172917 1253850 1326009 1275314 1155961 1359452 1388782 1052872
8513A052872l18374l25448o0290L82796L44801Q2795R266j57706j38132j15333
8503G57247j06688j23943J77509J23372m913J9629J85886N04m4236n9296J88032
8492A113103m5532J6603Q1277O5525N3843L6282k73909l44135L5526J49475K48481
8481A136539O6191q5377k36266J31128J99121O8788J23960j73523k09569N2274
8471A073266k11060p2319L24811o874m31905k05530J17517J79038L41811M2084
8461A150839k44867J65700K8336j43376k6510j84665r9235o7220J20016M11366
8451A110384M57879p6729Q8766J4250N3152k68686l1611k0541j67738r0114J33665
8440A202677O0362j6269j2091j78528r3085k50198j04377J53234K27306K3440
$$ plain form
8513 1052872 734498 409050 348760 731556 1076357 1159152 1168418 1010712 872580 757247
8503 757247 650559 526616 704125 827497 822584 842213 1028099 1028603 984367 925071 1113103
8492 1113103 1067571 1084174 1165451 1230976 1284819 1321101 1047192 703057 738583 888058 1136539
8481 1136539 1202730 1117353 881087 1012215 1211336 1280124 1404084 1230561 1020992 1073266
8471 1073266 862206 789887 1114698 1107824 675919 470389 587906 766944 1108755 1150839
8461 1150839 905972 1071672 1100008 956632 930122 745457 646222 579002 699018 1110384
8451 1110384 1568263 1491534 1580300 1594550 1647702 1379016 1347405 1326864 1159126 1069012 1202677
8440 1202677 1263039 1246770 1234679 1056151 963066 712868 608491 761725 989031 1012471
8430A012471j26009k16893L6728J46582J65098o8629k48186k8165K31685m0550
8420H64132l39947j65243Q3246J11895J06253K02216j5741j25144k26176k21322
8410B74169L11055o9198J9987R0794j754M893K45281J68636p4391j39131J23068
8399I53409J13029j62013k17638j71706N1098P1550R8819J47703k48648J0793
8389F46396j54092j92460M3687J67329q9574P114Q5693Q0513J3288J81212l48198
8378D40908l20376J48856J23251J35093r237J05615O6201J17129k6009o7482j58200
8367E55749j09739J50722j92199j07506k3024J25557K08575N9488k27020q125
8357D32478O4423J44997k7297j3144M9401J38113K54126J32084k78983j69738
$$ plain form
8430 1012471 886462 669569 706297 852879 1017977 949348 701162 672997 904682 864132
8420 864132 524185 358942 442188 554083 660336 862552 846811 721667 495491 274169
8410 274169 585224 516026 536013 626807 625053 629946 875227 1043863 969472 830341 953409
8399 953409 1066438 904425 686787 515081 566179 637729 736548 884251 635603 646396
8389 646396 492304 299844 343531 510860 421286 428400 514093 594606 607894 789106 440908
8378 440908 120532 269388 392639 527732 518495 624110 690311 807440 781431 713949 555749
8367 555749 446010 596732 404533 297027 274003 399560 608135 667623 440603 432478
8357 432478 496901 641898 614601 601457 650858 788971 1043097 1175181 896198 726460
8347G26460J2119k3104j80823J72127N8485J25132k4479j38382j47604J25411
8337G05342J22483j79337n0666L30853J85499l35939l48771J8690J2511J73038
8327F33703J08592J47818K1348m3296O2548r5427j83195l22239j40891L1307k2200
8316A98068Q4837j01647J91457J09435J47627N7657j14271j1570J83134Q9998
8306H34725Q045j33107j06042j59627M7454j1174K92694k2509o95J3925J15563
8295H79252l03936k85661K38530K54272J19109j32579L4543j42129k56338O1898
8285D66961J42206L23725k9530p0827k12719R2051K79664k82154k43979p1067
8275C94331Q1565j673Q208N6687N4619j83056J854J9128J15015J79569L319J2108
$$ plain form
8347 726460 738579 715475 534652 706779 765264 890396 865917 727535 579931 705342
8337 705342 827825 648488 597822 928675 1114174 778235 429464 448154 460665 633703
8327 633703 742295 890113 911461 868165 930713 835286 652091 329852 188961 220268 198068
8316 198068 282905 181258 372715 482150 629777 687434 573163 561593 744727 834725
8306 834725 842770 709663 603621 443994 491448 480274 772968 750459 749764 763689 879252
8295 879252 575316 289655 528185 782457 901566 768987 803530 661401 405063 466961
8285 466961 609167 932892 903362 832535 619816 711867 991531 709377 465398 394331
8275 394331 475896 474223 482431 539118 593737 410681 412535 431663 546678 726247 729566 741674
8263G41674M9939p1597k34425q0717N3242J18531r472o7379j4519q7109Q8969
8252D87137m6297J68063j37850k28021K96271K91694q7235p9797L5556k06530
8242D92991j30858R2269l4124J06632K85207J54371j02261k96696j89756n2155
8232C25620m3368J61312o4195O495J27791j01029J49404K79014j4417j39708O3518
8221G50437J14449j53277k01046k31946p2652K26534K15682n2887j27794j01090
8211C66410J53609J8866j0918p191P8702j80519j42594K63L15027J11046j24435
8200E78266l9574r0314o2828K14875L51779l1896L6769j5734n74790j04232K51905
8189E14226K82971J24422j09964p7404k25628o1414n5098k9340J59831j94489
$$ plain form
8263 741674 791613 720016 485591 404874 458116 576647 567175 499796 485277 398168 487137
8252 487137 440840 608903 471053 243032 539303 830997 743762 663965 699521 492991
8242 492991 362133 454402 420278 526910 812117 966488 864227 567531 377775 325620
8232 325620 282252 443564 379369 385864 513655 412626 562030 841044 826627 686919 750437
8221 750437 864886 711609 510563 278617 205965 432499 648181 595294 467500 366410
8211 366410 520019 538885 527967 520776 599478 418959 276365 276628 591655 702701 578266
8200 578266 538692 448378 385550 600425 952204 920308 957077 941343 366553 262321 514226
8189 514226 797197 921619 811655 734251 508623 447209 392111 362771 522602 328113
8179C28113J2615O233L2041j12023q1432p6065Q2381L01486J80186q5479j07320
8168D80736j82905K54767m3202k04941o3593k21378L0720L16420l3351k33391
8158I9882j50505j61466K44479R6104K25488J08825J0941p4635r1877O3284J00186
8147D70706J08396j21939n3261r6470j84431j62837o3057K42912J68587K37716
8137E46322J46505m6841m3385L0595m2018q2462N6171p5794k37948j77859q9806
8126a6520K42727P1353J20842k00738k88470P0555M04422K4522j88783m1690K84348
8115D82568J41428k10598j6877q7145j4414m487M8792J08765K2054J56824j48289
8104D78621q5760J80843j06818m0298j41864p3778p9588J21404J93348n2263o5991
$$ plain form
8179 328113 340728 346961 379002 266979 185547 109482 191863 493349 673535 588056 480736
8168 480736 297831 552598 509396 304455 240862 19484 50204 366624 333273 99882
8158 99882 -50623 -212089 32390 128494 353982 462807 473748 399113 307236 370520 470706
8147 470706 579102 457163 403902 307432 123001 -39836 -102893 140019 308606 546322
8137 546322 692827 645986 602601 633196 591178 508716 564887 489093 251145 73286 -16520
8126 -16520 226207 297560 418402 217664 -70806 -251 404171 428693 239910 198220 482568
8115 482568 623996 413398 396521 309376 294962 290475 339267 448032 470086 626910 478621
8104 478621 392861 573704 466886 426588 284724 210946 131358 252762 446110 393847 327856
8093C27856m2366N9535j22249n9965k0743q653K40155J26935k43355m7709K01621
8082D11062J9154N2359k47089j64734J01784n627p0404K08515M7470n7459j63470
8071A31561j3425q0864m6313J12627q5619j81063J09086j7739P9549L4385L0162
8060G2347J42260o2797r5973J81970J74700J98217J33352l8388j75449k71238
8050B59001j31636O5421L11594J56696J9537j9900j83121Q723J40060j80130m14493
8039C1752m5295K08406M4385j48088P8743K02206P1684k3274p959J59731J96879
8028G69170j10225n2125q0711l89318n0162O0959j55315L2812J57998J49602J1218
8017C43903o7591K5032K8056J9620j3179j05606J83551o8548p8991q087R8774
$$ plain form
8093 327856 285490 345025 222776 162811 142068 133415 373570 500505 257150 209441 411062
8082 411062 430216 482575 235486 70752 172536 166909 96505 305020 352490 295031 131561
8071 131561 118136 37272 -9041 103586 17967 -163096 -54010 -71749 7800 42185 72347
8060 72347 214607 151810 55837 237807 412507 610724 744076 705688 530239 259001
8050 259001 127365 192786 504380 661076 680613 660713 477592 486315 626375 446245 31752
8039 31752 -13543 194863 239248 91160 169903 372109 443793 420519 412560 572291 769170
8028 769170 658945 606820 526109 136791 86629 147588 -7727 25085 183083 332685 343903
8017 343903 276312 301344 329400 349020 335841 230235 413786 345238 266247 258160 356934
8006C56934P4630J91402K9531m717k07127j3906n2907q4691j3385r2867K20289
7995D03186P3906p1149Q7121j04248j93983l5789j03913R2909J46224K11106J57907
7984F63277Q4852J71938n4036j99482r4028Q4356K6997K58765m068j47098j03211
7973F88262j07654j22358K01516R7257K4712J40379K8540j18474J89236M37561
7963A458977Q1596o0388K7337L16440K87682R2525L45879N75020J021914J630770
7953E777752K548482M293317P113787R389081Q130166L261113k672132o958618
7945C0882948p756787o017445m109627k416452j375952j367528r48467m41975
7937F448715j46976q8395o3619k47461o68286l85916l79433l02525n01988k31087
$$ plain form
8006 356934 431564 622966 652497 647780 440653 426747 373840 289149 275764 182897 403186
7995 403186 477092 405943 493064 388816 194833 159044 55131 148040 294264 505370 663277
7984 663277 748129 920067 866031 666549 572521 656877 683874 942639 938571 791473 688262
7973 688262 580608 458250 659766 757023 781735 922114 950654 832180 1021416 1458977
7963 1458977 1540573 1480185 1507522 1823962 2111644 2204169 2550048 3125068 4146982 5777752
7953 5777752 8326234 12619551 19733338 29122419 37252585 40513698 37841566 30882948
7945 30882948 23126161 17108716 12999089 10582637 9206685 7839157 6890690 6448715
7937 6448715 6301739 6213344 6149725 5902264 5233978 4848062 4468629 4166104 3664116 3433029
7927C433029j50139m19058k14988J67839j86085j26672k0441P2711J97j4638j14484
7916B427271L0728K23186Q54704Q50417J079459K044627L609073N951180Q253018
7907B5323663Q056728M493527j151213n785515p264993o112612m147531k581737
7899A0830317j779742j601723j037543m94924j82017n4200k16710k57605k90342
7890D915511l38919n36523m09948k91696n35051l92679j62641p3291k42166l79554
7880A553043k85287j33574j70841Q3253J52644J75477m1055j99920o5417J26159
7870A194482n2716k4458k8020j14039J8890m2028j52626o1061j33232k55668J2865
7859C62389K11869J73924j1653l12161p0558M5694j8492J35459p668J2234j5544
$$ plain form
7927 3433029 3282890 2863832 2648844 2816683 2630598 2503926 2483485 2556196 2556393 2541755 2427271
7916 2427271 2457999 2681185 3535889 4386306 5465765 7510392 11119465 17070645 25323663
7907 25323663 33380391 37873918 36722705 30937190 23672197 17559585 13412054 10830317
7899 10830317 9050575 7448852 6411309 5916385 5734368 5680168 5463458 5205853 4915511
7890 4915511 4576592 4040069 3630121 3338425 2803374 2410695 2248054 2174763 1932597 1553043
7880 1553043 1267756 1134182 963341 1046594 1199238 1374715 1333660 1133740 1068323 1194482
7870 1194482 1141766 1117308 1089288 975249 994139 952111 799485 738424 605192 349524 362389
7859 362389 574258 748182 736529 424368 353810 399504 381012 516471 508803 521037 505493
7848E05493L4278J60324j66631j80470r2434m0450K012p9974J78327l4663j55018
7837A30794J28824R8242j46388M09444J42813k67670j02746k2793q1504o7934
7827B21082j43125Q1578j20198Q905J45617K97037p680l59345l23223J59576J45945
7816A06169J09975M44292J20167l48822j34068N6648l4261Q9778L5911M0073o3113
7805D22749m5826j5308N2648J18993L4328j48520J52231j66655k49368p6042L1954
7794A11184K63328Q5500K1116J50176J74475j40958k59609j81312j69442q1413
7784b6955J79074j09249j63033p0476N4182l4288J47131K8476K78740j28056j1320
7773A44226K8278k27190L6597J1184K73805P176j51903n4613K07510M9990n2022
$$ plain form
7848 505493 539771 700095 533464 352994 260560 220110 222122 142148 320475 285812 130794
7837 130794 259618 357860 211472 620916 763729 496059 393313 370520 289016 221082
7827 221082 77957 159535 39337 48242 193859 490896 483216 123871 -199352 -39776 106169
7816 106169 216144 660436 780603 431781 297713 354361 320100 409878 445789 485862 422749
7805 422749 376923 361615 414263 533256 567584 419064 571295 404640 155272 79230 111184
7794 111184 374512 460012 481128 631304 805779 664821 405212 223900 54458 -26955
7784 -26955 152119 42870 -120163 -190639 -136457 -170745 -23614 4862 283602 155546 144226
7773 144226 172504 -54686 -18089 -6905 266900 274076 122173 67560 275070 325060 273038
7762B73038j74834J16761J16708O7164n5566j13675j1707p2606n2135J25466q349
7751B10265M4678J52387j1686L9240j28933j98249j47176K19343J62350j16394
7741B25825m3806M1393J28058k30588l41727l7186K285q5619O7825J49156J16693
7730g691K6306K48976N6027k203j03147J61150r7172j24522L2500Q4408l5210
7719B39422R241j68064p2632k24K89815J18462L4758j42217j37840l7025O1433
7708A95129m3396n7134K8145K0363J9760j14102m0826P5483r9762j81677M0299
7697a57718J80391j42795O8616J90311m7087K44965K9516Q1223r7340p8295j05633
7686A66154L5709j76540P8460L11735P1539j09022j67004j10704K44251k19599
$$ plain form
7762 273038 98204 214965 331673 398837 343271 229596 217889 145283 93148 218614 210265
7751 210265 254943 407330 395644 434884 305951 107702 -39474 179869 342219 225825
7741 225825 182019 223412 351470 120882 -220845 -258031 -255746 -341365 -273540 -124384 -7691
7730 -7691 18615 267591 323618 321415 218268 379418 282246 157724 190224 274632 239422
7719 239422 248663 80599 7967 7743 297558 416020 450778 308561 170721 133696 195129
7708 195129 151733 94599 122744 143107 162867 48765 7939 83422 -16340 -198017 -157718
7697 -157718 22673 -120122 -51506 138805 91718 336683 366199 447422 350082 271787 166154
7686 166154 201863 25323 103783 415518 487057 378035 211031 100327 344578 124979
7676A24979j28483J14440K77857L13722q0000n4740l74844j68400j90703J70696
7666D524J20642p7707P155P5367J20659j74294j26717P4864k2581K71465L60972
7655F34349j99546j20509K01195j42176k44484j15110q2300q4060r658K4126K02547
7644F4374J05067l8078N2289k76874m38871j07713K38029P3729R6835K43460J81401
7633A93648N7880p9125j45456M7286O9811m0440j01983r7329j50203J64359R3953
7622A2401J41251K64061J97620k6425m30206k34607m1183J50614N8178k9155m9088
7611A3461L2040L6230K7990j84070K74040J25758n0307k5324j44783N0901j17374
7600C8562Q8418J60752o7907m8480K07731Q7414j15169N3169j27661l72040l5259
$$ plain form
7676 124979 -3504 110936 388793 702515 622515 567775 192931 24531 -166172 4524
7666 4524 125166 47459 54614 129981 250640 76346 -50371 24493 1912 273377 634349
7655 634349 434803 314294 515489 373313 128829 13719 -68581 -152641 -162299 -138173 64374
7644 64374 169441 131363 183652 -93222 -532093 -639806 -401777 -328048 -231213 12247 193648
7633 193648 251528 172403 26947 74233 144044 103604 1621 -95708 -245911 -81552 12401
7622 12401 153652 417713 615333 588908 158702 -75905 -117088 33526 91704 62549 13461
7611 13461 45501 81731 109721 -74349 199691 325449 275142 249818 105035 155936 38562
7600 38562 126980 287732 219825 171345 379076 466490 351321 404490 276829 -95211 -130470
7589a30470L5295J47065J26907j47838j26544J35209m7840M1255J76741J37513
7579C47293j8653Q2364J01363o0591q7725j15844q5057k49116q6364J8811j62373
7568c15892q5749k47856J47537K96330k6392j9647o587J09926M6502J67451k13939
7557a48316j07682O5122Q5311J63150K11718k51731j84979K61670K08852j4816
7547B88299j34045j21325m8164J28099l7941J6077k45798L07903L51331j24993
7537C79443k46960o9153R3866m0834j9130j29053q2303K4827J42413J56587L01
7526B10004J00251k37794p8646j93611o7808K6412K46608J83271k4779j51811
7516A2097m874K36277Q2888L7390R0900m3667K70J6166N3711p0971L1116l7838
$$ plain form
7589 -130470 -95175 51890 178797 30959 -95585 39624 -8216 33039 209780 347293
7579 347293 328640 411004 512367 451776 364051 248207 163150 -85966 -172330 -153519 -315892
7568 -315892 -401641 -649497 -501960 -205630 -232022 -251669 -258256 -148330 -101828 65623 -148316
7557 -148316 -255998 -190876 -105565 57585 269303 17572 -167407 94263 303115 288299
7547 288299 154254 32929 -15235 112864 74923 91000 -154798 153105 504436 379443
7537 379443 132483 63330 157196 116362 97232 -31821 -114124 -89297 53116 209703 210004
7526 210004 310255 72461 -6185 -199796 -267604 -241192 5416 188687 163908 12097
7516 12097 7223 243500 326388 363778 454678 411011 411281 427447 481158 410187 441303 403465
7504D03465M0643k8612k6301q9767k5473j24281j23420J03519J08006p1989o4393
7493A01397J02855M3693q8352O9447j86661p8085j24289j96311j0129j91552K3785
7482e34202J10307J86462j8323m7992J8462M1581J19668K3433j13290P0671J89395
7471D6172j97110Q8782L68717L25089j58448m40553j06276k4976M3118J88768
7461A33283J09579r7690j18180j6548j56408J82542L02537q8512j65383j21607
7451c6387k04346p8142J63257J84288L40331J63533m1146j15658k82436N8828
$$ plain form
7504 403465 444108 415496 389195 299428 273955 149674 26254 129773 237779 165790 101397
7493 101397 204252 247945 159593 229040 42379 -35706 -159995 -356306 -366435 -557987 -534202
7482 -534202 -423895 -237433 -255756 -303748 -285286 -243705 -124037 -100604 -213894 -143223 46172
7471 46172 -150938 -62156 306561 631650 473202 32649 -73627 -98603 -55485 133283
7461 133283 242862 145172 26992 10444 -145964 36578 339115 250603 85220 -36387
7451 -36387 -240733 -318875 -155618 28670 369001 532534 491388 375730 93294 152122
$$ [...]
##END NTUPLES=NMR SPECTRUM
##END=
