##TITLE=Analysis number 317813
Compound Code mo 07069
Project Code adrs
Chemist Name fudan
##JCAMPDX= 6.0         $$ Bruker NMR JCAMP-DX V2.0
##DATA TYPE= NMR SPECTRUM
##DATA CLASS= NTUPLES
##ORIGIN= Bruker BioSpin GmbH
##OWNER= nmr
$$ XWIN-NMR		Version 3.5
$$ Mon Mar  6 12:03:32 2006 GMT Standard Time (UT+0h)  MAYBRIDGE\nmr@NMR_250MHZ
##.OBSERVE FREQUENCY= 250.131544655141
##.OBSERVE NUCLEUS= ^1H
##.ACQUISITION MODE= SIMULTANEOUS (DQD)
##.ACQUISITION SCHEME= undefined
##.AVERAGES= 16
##.DIGITISER RES= 18
##SPECTROMETER/DATA SYSTEM= dpx250
##.PULSE SEQUENCE= zg30
##.SOLVENT NAME= CDCl3
##.SHIFT REFERENCE= (INTERNAL, CDCl3, 0, 16.522)
##AUDIT TRAIL= $$ (NUMBER, WHEN, WHO, WHERE, WHAT)
$$ ##TITLE= Audit trail, XWIN-NMR		Version 3.5
$$ ##JCAMPDX= 5.01
$$ ##ORIGIN= Bruker BioSpin GmbH
$$ ##OWNER= nmr
$$ C:\u/data/dgb/nmr/ADRS/50/pdata/1/auditp.txt
$$ ##AUDIT TRAIL=  $$ (NUMBER, WHEN, WHO, WHERE, WHAT)
(   1,<2006-03-06 12:02:36.35 +000>,<MAYBRIDGE\nmr>,<NMR_250MHZ>,
      <created by zg, POWCHK disabled, PULCHK disabled
       configuration hash MD5:
       84 BC 41 DB A1 6E 1D 46 DA 25 12 A5 C1 ED C5 3A
       data hash MD5: 64K
       6C 64 81 E9 83 10 2A B4 65 12 AA 5E 01 19 CD EA>)
(   2,<2006-03-06 12:03:04.49 +000>,<MAYBRIDGE\nmr>,<NMR_250MHZ>,
      <Start of raw data processing
       ef LB = 0.3 FT_mod = 6 PKNL = 1 SI = 32K 
       data hash MD5: 32K
       E9 D3 4B 8D 84 85 F8 22 1F 32 3E 9F 67 97 6C 86>)
(   3,<2006-03-06 12:03:07.45 +000>,<MAYBRIDGE\nmr>,<NMR_250MHZ>,
      <apk 
       data hash MD5: 32K
       43 CC F4 5D 18 14 19 5A BE 60 3C 8B C0 17 DC D5>)
(   4,<2006-03-06 12:03:08.88 +000>,<MAYBRIDGE\nmr>,<NMR_250MHZ>,
      <abs ABSG = 5 
       data hash MD5: 32K
       F7 76 97 37 8C 0F B7 D8 DF F5 3F D0 8A D3 A0 9D>)
$$ ##END=
$$ 
$$ hash MD5
$$ 9A 64 7B 44 93 9C 53 EC 32 DC 13 F9 08 96 F5 55
##$RELAX= 
##$RELAX= 
##$RELAX= 
##$RELAX= 
##$RELAX= 
##$RELAX= 
##$RELAX= 
$$ Bruker specific parameters
$$ --------------------------
##$DU= <C:\u>
##$EXPNO= 50
##$NAME= <ADRS>
##$PROCNO= 1
##$TYPE= <nmr>
##$USER= <dgb>
##$AMP= (0..31)
100 100 100 100 100 100 100 100 100 100 100 100 100 100 100 100 100 100 
100 100 100 100 100 100 100 100 100 100 100 100 100 100 
##$AQSEQ= 0
##$AQ_mod= 3
##$AUNM= <au_zg>
##$AUTOPOS= <23 >
##$BF1= 250.13
##$BF2= 250.13
##$BF3= 250.13
##$BF4= 250.13
##$BF5= 500.13
##$BF6= 500.13
##$BF7= 500.13
##$BF8= 500.13
##$BYTORDA= 1
##$CFDGTYP= 0
##$CFRGTYP= 5
##$CHEMSTR= <none>
##$CNST= (0..31)
1 1 145 1 1 1 1 1 1 1 1 1 1 1 1 1 1 1 1 1 1 1 1 1 1 1 1 1 1 1 1 1 
##$CPDPRG= <>
##$CPDPRG1= <>
##$CPDPRG2= <>
##$CPDPRG3= <>
##$CPDPRG4= <mlev>
##$CPDPRG5= <mlev>
##$CPDPRG6= <mlev>
##$CPDPRG7= <mlev>
##$CPDPRG8= <mlev>
##$CPDPRGB= <>
##$CPDPRGT= <>
##$D= (0..31)
0 1 0 0 0 0 0 0 0 0.06 0 0 0 0 0 0 0.0002 0 0 0 0 0 0 0 0 0 0 0 0 0 0 
0 
##$DATE= 1141646545
##$DBL= (0..7)
120 120 120 120 120 120 120 120 
##$DBP= (0..7)
150 150 150 150 150 150 150 150 
##$DBP07= 0
##$DBPNAM0= <>
##$DBPNAM1= <>
##$DBPNAM2= <>
##$DBPNAM3= <>
$$ [...]
##$SUBNAM7= <"">
##$SUBNAM8= <"">
##$SUBNAM9= <"">
##$SW= 20.6930455092707
##$SWIBOX= (0..15)
0 0 3 0 0 0 0 0 0 0 0 0 0 0 0 0 
##$SW_h= 5175.983436853
##$TD= 65536
##$TD0= 1
##$TE= 293.16
##$TE2= 300
##$TE3= 300
##$TEG= 300
##$TL= (0..7)
0 120 120 120 120 120 120 120 
##$TP= (0..7)
150 150 150 150 150 150 150 150 
##$TP07= 0
##$TPNAME0= <>
##$TPNAME1= <>
##$TPNAME2= <>
##$TPNAME3= <>
##$TPNAME4= <>
##$TPNAME5= <>
##$TPNAME6= <>
##$TPNAME7= <>
##$TPOAL= (0..7)
0.5 0.5 0.5 0.5 0.5 0.5 0.5 0.5 
##$TPOFFS= (0..7)
0 0 0 0 0 0 0 0 
##$TUNHIN= 0
##$TUNHOUT= 0
##$TUNXOUT= 0
##$USERA1= <user>
##$USERA2= <user>
##$USERA3= <user>
##$USERA4= <user>
##$USERA5= <user>
##$V9= 5
##$VALIST= <valist>
##$VCLIST= <CCCCCCCCCCCCCCC>
##$VD= 0
##$VDLIST= <DDDDDDDDDDDDDDD>
##$VPLIST= <PPPPPPPPPPPPPPP>
##$VTLIST= <TTTTTTTTTTTTTTT>
##$WBST= 1024
##$WBSW= 4
##$XGAIN= (0..3)
0 0 0 0 
##$XL= 0
##$YL= 0
##$YMAX_a= 424277
##$YMIN_a= -462315
##$ZGOPTNS= <>
##$ZL1= 120
##$ZL2= 120
##$ZL3= 120
##$ZL4= 120
##$ABSF1= 16.522
##$ABSF2= -4.171173
##$ABSG= 5
##$ABSL= 3
##$ALPHA= 0
##$AQORDER= 0
##$ASSFAC= 0
##$ASSFACI= 0
##$ASSFACX= 0
##$ASSWID= 0
##$AUNMP= <proc_1d>
##$AZFE= 0.1
##$AZFW= 0.1
##$BCFW= 0
##$BC_mod= 0
##$BYTORDP= 0
##$COROFFS= 0
##$CY= 12.5
##$DATMOD= 1
##$DC= 0
##$DFILT= <>
##$DTYPP= 0
##$F1P= 14.0000005364418
##$F2P= -0.99999901652339
##$FCOR= 0.5
##$FTSIZE= 32768
##$FT_mod= 6
##$GAMMA= 0
##$GB= 0
##$INTBC= 1
##$INTSCL= 1
##$ISEN= 128
##$LB= 0.3
##$LEV0= 0
##$LPBIN= 0
##$MAXI= 10000
##$MC2= 0
##$MEAN= 0
##$ME_mod= 0
##$MI= 0
##$NCOEF= 0
##$NC_proc= -2
##$NLEV= 6
##$NOISF1= 0
##$NOISF2= 0
##$NSP= 0
##$NTH_PI= 0
##$NZP= 0
##$OFFSET= 16.522
##$PC= 1
##$PHC0= 244.1441
##$PHC1= 8.491503
##$PH_mod= 1
##$PKNL= yes
##$PPARMOD= 0
##$PSCAL= 4
##$PSIGN= 0
##$REVERSE= no
##$SF= 250.13
##$SI= 32768
##$SIGF1= 0
##$SIGF2= 0
##$SINO= 400
##$SIOLD= 32768
##$SREGLST= <1H.CDCl3>
##$SSB= 0
##$STSI= 32768
##$STSR= 0
##$SW_p= 5175.98343685301
##$SYMM= 0
##$S_DEV= 0
##$TDeff= 65536
##$TDoff= 0
##$TI= <Analysis number 999999
Compound Code 99
Book Reference 9
Project Code 9>
##$TILT= no
##$TM1= 0
##$TM2= 0
##$TOPLEV= 0
##$USERP1= <user>
##$USERP2= <user>
##$USERP3= <user>
##$USERP4= <user>
##$USERP5= <user>
##$WDW= 1
##$XDIM= 32768
##$YMAX_p= 356204547
##$YMIN_p= -276429
$$ End of Bruker specific parameters
$$ ---------------------------------
##NTUPLES= NMR SPECTRUM
##VAR_NAME=  FREQUENCY,     SPECTRUM/REAL,   SPECTRUM/IMAG
##SYMBOL=    X,             R,               I
##VAR_TYPE=  INDEPENDENT,   DEPENDENT,       DEPENDENT
##VAR_FORM=  AFFN,          ASDF,            ASDF
##VAR_DIM=   32768,         32768,           32768
##UNITS=     HZ,            ARBITRARY UNITS, ARBITRARY UNITS
##FACTOR=    0.157963299565203, 1,           1
##FIRST=     4132.6476996994, 0,             0
##LAST=      -1043.33573715361, 0,           0
##MIN=       -1043.33573715361, -276429,     0
##MAX=       4132.6476996994, 356204547,     0
$$ Real data points
##PAGE= N=1
##DATA TABLE= (X++(R..R)), XYDATA
$$ [...]
15151d614J027L432k576P589J542j055p4m046p38M904n856o68O8M480K360k627
15135C148q545j164N203K538l170k27J684Q052L112r963J349q73o842L51M598
15120g49l753q10p505j676R709J252o94J2957J258j0949l45J930j0899q444L510
15105a5208M754k922L961Q250J999R45j342j0105m222Q411k353Q006O886j1511
15091d451p869j2471m671J494N40O894J1331j473N990J1047P368K539K666o764
15077A2170j1816J319k474L710k121j2773L90j197Q669J4932J530j7085o982J1739
15063A1N299K441k705r1j373n250r051r937L121J0396J546n75J543N487j471L466
15047B857l577k82J35l51j653p97L671l471N248L690N554l179o950l26J42m620
$$ plain form
15151 -4614 -3587 -155 -2731 4858 6400 5345 5271 1225 487 5391 -465 -1133 -1065 3415 5775 3148
15135 3148 -5397 -6561 -1358 1180 -1990 -2217 -533 7519 10631 668 2017 1144 -5698 -5347 -749
15120 -749 -4502 -5312 -12817 -14493 -4784 -3532 -4226 8731 9989 -960 -1305 625 -10274 -18718 -15208
15105 -15208 -10454 -13376 -9415 -1165 834 1779 437 -9668 -13890 -5479 -7832 174 7060 -4451
15091 -4451 -12320 -24791 -29462 -27968 -27428 -20534 -9203 -10676 -4686 6361 13729 16268 18934 12170
15077 12170 354 1673 -801 2909 788 -11985 -11595 -12792 -4123 10809 12339 -4746 -11728 11
15063 11 5310 7751 5046 4955 3582 -1668 -10719 -20656 -17535 -7139 -5593 -6168 -4625 862 -609 2857
15047 2857 -720 -1002 -867 -1218 -2871 -3668 3 -3468 1780 5470 11024 7845 895 569 711 -3909
15031c909o705k65l911P315Q373n612j0061j0663p476l138J7236K0488R779K506
15017A3957o909m887p555l17j411o74j072j991j297j736k524l444p32O834L009
15002a0749j1561K570J5438J1716n369l600P667m06j7722p072K812J0098l52o035
14988a2565J968M690J276O588K922N562o96m148o262p881J64m29L720Q618j116
14973B411Q628k591O48l75K484L440k591J52n237j5041M122O738N696J399O199
14958A6082m215j7578L46N760n988k601L629p80R821j022N483R441Q24J610k471
14943A8341n205r132n550n436J353J914n56j40n64n388K070N265O131q79M666
14928F890P039p300j4855L801K401j0348L493q72M919J68M029J492q27L28Q98
$$ plain form
15031 -3909 -10614 -10879 -14790 -7475 898 -4714 -14775 -25438 -32914 -36052 -18816 1672 11451 13957
15017 13957 7048 2161 -5394 -5711 -7122 -7796 -8868 -10859 -12156 -13892 -16416 -19860 -20592 -13758 -10749
15002 -10749 -22310 -19740 -4302 7414 2045 -1555 6112 5706 -12016 -19088 -16276 -6178 -6530 -12565
14988 -12565 -10597 -5907 -4631 1957 4879 10441 9745 5597 -665 -8546 -8382 -8811 -5091 3527 2411
14973 2411 11039 8448 9096 8721 11205 14645 12054 12206 6969 -8072 -3950 2788 8484 9883 16082
14958 16082 11867 -5711 -5365 395 -5593 -8194 -4565 -5345 4476 3454 8937 18378 19202 20812 18341
14943 18341 13136 4004 -1546 -6982 -5629 -3715 -4271 -4411 -4975 -10363 -8293 -3028 3103 2224 6890
14928 6890 13929 6629 -8226 -4425 -2024 -12372 -8879 -9751 -4832 -4664 -635 857 30 358 1256
14913A256j522J3645J0540j4294o413L190j321o458l271r571j889N370K942J2673
14899D877J270K326l810j1632m355j357l076R632p079m2N807j0230k003P49J2667
14884f256O909Q43o17P793L918J561m619q350o664m640L65n580J297l703N289
14869a2454L595l179k124r54K273K477m899j024R100Q193M798r078j2623J65M698
14854a1036O297r378l400k300N769Q711P983J212r189j994R314R506n918K139
14840G716J270q133q378j1084J526J2081L195M216j076m656J616Q852L673n23
14826A0295p060o273J804p100k703P138J1345n785k168o65K498P916J998j073
14812A0167n879m546o918J0693M324j71K545O73M701l679m62q435L046m472k57
$$ plain form
14913 1256 -266 13379 23919 9625 3212 6402 5081 -1377 -4648 -14219 -16108 -10738 -7796 4877
14899 4877 6147 8473 4663 -6969 -11324 -12681 -15757 -6125 -13204 -13246 -7439 -17669 -19672 -18923 -6256
14884 -6256 653 1496 879 8672 12590 14151 9532 1182 -5482 -10122 -9757 -15337 -14040 -17743 -12454
14869 -12454 -8859 -12038 -14162 -15116 -12843 -10366 -15265 -16289 -7189 1004 5802 -3276 -15899 -15734 -11036
14854 -11036 -4739 -14117 -17517 -19817 -14048 -5337 2646 3858 -5331 -7325 1989 11495 5577 7716
14840 7716 8986 853 -7525 -18609 -17083 -5002 -1807 2409 1333 -3323 -1707 7145 10818 10295
14826 10295 3235 -3038 -1234 -8334 -11037 -3899 7446 1661 -507 -1172 1326 9242 11240 10167
14812 10167 4288 -258 -7176 3517 7841 7670 10215 10888 15589 11910 11448 3013 6059 1587 1330
14797A330L83o249R11L489n705J085q51n597M189N224p842p05M590m452J441j606
14781a0365R31K1848P239j0561j5332M782M562J2144k929r871j989R2R813O981
14767A7345q796k975K712j645p335M46k082l959J1683J052M050k003j007J20p511
14752I5j0030Q54j203j0199j1265J724J0419J9920N829j15O60n455p273M561J0642
14737I164L399N708m083o456j2240l133N147m478M071K350j1747l657J3930M217
14723B192N571K170P034p758l291p726j451P67m126l022K183L150L221L383O956
14708I253J465L849p767l915k676j085J749J970l135J84Q33j430O121k870K632
14693E178j155J240k658L083l125j742n894n752l8K208N791K123n262N035K316
$$ plain form
14797 1330 1713 -4536 -3625 -136 -5841 -4756 -5607 -11204 -7015 -1791 -9633 -10338 -5748 -10200 -8759 -10365
14781 -10365 -9434 12414 19653 9092 -6240 -1458 3104 15248 12319 2448 459 551 10364 17345
14767 17345 8549 5574 8286 6641 -694 -248 -2330 -6289 5394 6446 10496 8493 7486 7606 95
14752 95 -9935 -9081 -10284 -20483 -31748 -30024 -19605 315 6144 6029 6689 1234 -6039 -1478 9164
14737 9164 12563 18271 14188 7732 -4508 -7641 -2494 -6972 -2901 -551 -12298 -15955 -2025 2192
14723 2192 7763 9933 16967 9209 5918 -1808 -3259 -2492 -6618 -9640 -7457 -4307 -1086 2297 9253
14708 9253 10718 14567 6800 2885 209 -876 873 2843 -292 -108 725 -705 5416 2546 5178
14693 5178 4023 5263 2605 5688 2563 821 -5073 -10825 -10863 -8655 -2864 -741 -6003 -968 1348
14678A348j522L361r304N670j076j1079l846Q69J1196N906l295M710J296o414
14664b180J113O03k90p264j082O833M617k222m698Q698K968j517n242N005J0814
14649A6156Q285o199k038J89n943L160L850o939l263J086N928m486n866P907M126
14634A5953K925k097o900M452o526j146m450o91M364k931r892r065L173N862K893
14619d076P658J1457m419N610j0784m50Q84L744R834k235P283R41q161j553p40
14604A4993l708n229P657l13K280k694o147j0959L737L862M397l422j449n061
14590b056m306J800O97O726L236L15L523m436l030m152m644M333M860j4708r024
14575b0866o755P171Q816J3584N247o194k478J7291R542j0397q326j0687j097
$$ plain form
14678 1348 -174 3187 -6117 -447 -1523 -12602 -16448 -15579 -4383 1523 -1772 2938 4234 -2180
14664 -2180 -1067 -464 -754 -8018 -9100 -2267 2350 128 -4570 4128 7096 5579 337 5342 16156
14649 16156 24441 18242 16204 16393 10450 13610 17460 10521 7258 8344 14272 9786 3920 11827 15953
14634 15953 18878 16781 9881 14333 7807 6661 2211 1520 5884 2953 -6939 -16004 -12831 -6969 -4076
14619 -4076 3582 15039 10620 16230 5446 4996 5880 9624 19458 17223 24506 25447 17286 15733 14993
14604 14993 11285 6056 13713 13400 15680 12986 6839 -4120 -383 3479 7876 4454 3005 -2056
14590 -2056 -6362 -4562 -3865 2861 6097 6412 9935 5499 2469 -1683 -6327 -1994 2866 -11842 -20866
14575 -20866 -27621 -20450 -11634 1950 7197 1003 -1475 15816 25358 14961 6635 -4052 -5149
14562e149J0948M724j477R839M64J014n513m313Q38J982j0021m916Q804N786J058
14547A4068M739J359l929k254m306k281O448K178j2393n445N171Q773Q2n571k755
14532C884o374j54N227O529J357n399Q1j111M786n16r234m616j367L643K965P079
14516F780O171n770j2008l75K602O381L90J1289j1971j5231n538M437N181L487
14502d175O338L159o737J161P597N472J11n518N354N013O015n092m779j102L377
14487A6194J0594r053p287m283p1L188o902j43m250l036M521l165Q214M704O676
14472A5901N980J313n625j0196O31K583l473N03M551O383k986m985q973m377M866
14457B096M475n512n531M484p42Q707N45k93j6995j375M309O350N430P013O322
$$ plain form
14562 -5149 5799 10523 9046 18885 19349 20363 14850 10537 11375 13357 3336 -1580 7224 13010 14068
14547 14068 18807 20166 16237 13983 9677 7396 13844 16022 3629 -1816 3355 12128 12210 6639 3884
14532 3884 -2490 -2644 2583 9112 10469 5070 5151 4040 8826 8310 -924 -5540 -6907 -3264 -299 6780
14516 6780 12951 7181 -4827 -5202 -2600 3781 4171 15460 3489 -11742 -17280 -12843 -7662 -4175
14502 -4175 2163 5322 -1415 -254 7343 12815 12926 7408 12762 17775 23790 18698 13919 12817 16194
14487 16194 26788 17735 10448 6165 6094 9282 2380 2237 -2013 -5049 -528 -3693 4521 9225 15901
14472 15901 21881 23194 17569 7373 8004 10587 7114 7617 12168 18551 15565 10580 1607 -2770 2096
14457 2096 6571 1059 -4472 12 -730 7977 8522 8229 -8766 -10141 -5832 518 5948 12961 19283
14442A9283j356M693q258j2154P785N755k372q870Q14J971j357M877P588M797
14428B3196l141p540r521k437J809J416M068m560J1091L424o067n909k690o050
14414b911m227M515k601j909J437J0010L4O91N843l602O8L962r237r47M313k369
14398C070l297J4418K231p290J851M963k789L303N350n433L698J1156P570m320
14384C4481j4920n799m043J004J435M033l558M86j2992j788M250k471K325n99
14370A844J348p171J041N738r19k075k642j806M562o715J0210J6255q65o37n376
14355A2792p411Oj143n380L406mr55K601k881k096P6J1419K939m928j1743m219
14339g521l743O89Q154k428o372k76l401L12R452R366p087n559N610N260M359
$$ plain form
14442 19283 17927 22620 14362 2208 9993 15748 13376 4506 5320 7291 5934 10811 18399 23196
14428 23196 20055 12515 2994 557 2366 3782 7850 3290 14381 17805 11738 5829 3139 -2911
14414 -2911 -7138 -2623 -5224 -7133 -5696 4314 4348 5039 10882 7280 7348 11310 2073 1126 5439 3070
14398 3070 -227 14191 16422 9132 10983 15946 13157 16460 21810 16377 20075 31231 38801 34481
14384 34481 19561 13762 9719 10723 12158 16191 12633 13119 127 -1661 2589 118 2443 1844
14370 1844 3192 -3979 -2938 2800 1881 -194 -2836 -4642 -80 -6795 3415 19670 18805 18168 12792
14355 12792 5381 5387 4244 -1136 2270 2266 1311 3912 1031 -1065 -989 10430 13369 8441 -3302 -7521
14339 -7521 -11264 -10575 -2421 -4849 -11221 -11497 -14898 -14586 -5134 4232 -2855 -8414 -2804 2456 6815
14324F815K351l753K323J329k065Q946J77n521r312p516k293o84p368m447J3873
14309g145J1220n929q048q93J0615J886l425K044N985k090j305r58O644J538K877
14294A3016N32q810p26K215N669N145j33j628M4o157m284r652n784L388R474P920
14278A0229m38r853J211L470P84Q872M234l948o750r410r839o907R133J1081J490
14263C359N966K786L678M18j0887o847m854o448N982M580M006N072N23K422N964
14248A5720R25p031j4627j195Q773k36J143J0398K82j72q101p236M385L324N158
14233A1510j2024J675J4573j310j8154n009M953J1624L504M241j230j0845l622
14220a14K433p262j7438Q861J1263J330l012k696M280Q588N299o339j691k914
$$ plain form
14324 6815 9166 5413 7736 9065 7000 15946 16123 10602 1290 -6226 -8519 -9203 -16571 -21018 -7145
14309 -7145 4075 -1854 -9902 -10795 -180 1706 -1719 325 6310 4220 2915 1957 8601 10139 13016
14294 13016 13548 4738 4012 6227 11896 17041 16908 15280 15324 9167 4883 -4769 -10553 -7165 2309 10229
14278 10229 9791 -62 1149 4619 5403 14275 18509 14561 7811 -1599 -11438 -18345 -9212 1869 3359
14263 3359 9325 12111 15789 16207 5320 -1527 -6381 -12829 -6847 -2267 1739 6811 7334 9756 15720
14248 15720 16645 9614 -5013 -6208 2565 2329 3472 13870 14152 13980 5879 -1357 3028 6352 11510
14233 11510 -514 1161 15734 14424 -3730 -8739 -3786 7838 11342 15583 14353 3508 -114
14220 -114 2319 -4943 -22381 -13520 -2257 -927 -3939 -6635 -2355 6233 11532 5193 3502 588
14206E88M700Q222l574j1896o599J2112J5200j1981j3133J0720m431O205P029
14193A3162m681O06j622P305L265l09j2389n883J1978o682J297P270r053k284
14179A980Q529l806J3567k818j540L203O492j6524m764L52p952p431k938N319
14165h331L989L401J1021LL855J830M705P019J994l057r913j2156q02N025P924
14150A6507K633J436m337k830q203k413Q570k427l024J458J274l937n50L495M971
14135A2623O627K320N191P19o31J383Q660k393m300m518Q58K759p649n158k256
14120A4235N226M724k661k41J051q825l530P239L196L116Q987K955J4924l287
14106D7109n001p599p323m103J2787L054n632o759j563j864o229o006j0513P850
$$ plain form
14206 588 5288 13510 9936 -1960 -8559 3553 18753 6772 -6361 4359 -72 6133 13162
14193 13162 8481 9087 7465 14770 18035 17726 5337 -546 11432 4750 6047 13317 4264 1980
14179 1980 10509 6703 20270 17452 15912 19115 25607 9083 4319 4671 -3281 -10712 -13650 -8331
14165 -8331 -4342 -941 10080 10083 13938 15768 20473 27492 29486 26429 16516 4360 3558 8583 16507
14150 16507 19140 20576 16239 13409 5206 2793 11363 8936 5912 7370 8644 4707 4157 7652 12623
14135 12623 19250 21570 26761 27480 26849 28232 36892 34499 30199 25681 26539 29298 21649 16491 14235
14120 14235 19461 24185 21524 21283 22334 13509 9979 17218 20414 23530 32517 35472 50396 47109
14106 47109 42108 34509 27186 23083 35870 38924 33292 26533 24970 23106 16877 10871 358 8208
14092H208J771m269J694Q935k28j639J644r285j243K999m073K89N111m955r92
14077C967R856n69j5511m910j086L158Q796J4280M55j2218j59k044M555m359o201
14062a990R11J1676Q074m581L547O213l706J791K909M320K346p720k0681M004
14048G113M977M719p784J720k748p066n884n581K835L950j222L599N25m941m966
14033a0754L059Q662J3106O739n866P338k552J55K148o248l645K622J791n49P751
14018B3757o065n023k795l555j508j446N708J949n370J0938j0789j2998J075K407
14004c715N912M000j271P127k546j1479m700P466J3011p174q634N838O973O353
13990A7161N35l791o667m018J2182J1014L555j694L30m672j0828j1947k096k539
$$ plain form
14092 8208 9979 5710 7404 16339 16111 14472 16116 6831 5588 8587 4514 4803 9914 4959 3967
14077 3967 13823 13254 -2257 -7167 -8253 -5095 3701 17981 18436 6218 6059 4015 8570 4211 -1990
14062 -1990 -1079 10597 18671 14090 17637 23850 20144 21935 24844 29164 31510 23790 3109 7113
14048 7113 12090 16809 9025 10745 7997 931 -4953 -10534 -7699 -3749 -4971 -1372 -847 -5788 -10754
14033 -10754 -7695 967 14073 20812 14946 22284 19732 19887 22035 15787 12142 14764 16555 16006 23757
14018 23757 17692 12669 9874 6319 4811 3365 9073 11022 5652 16590 5801 -7197 -6122 -3715
14004 -3715 2197 6197 4926 12053 9507 -1972 -6672 794 13805 6631 -2003 3835 10808 17161
13990 17161 17696 13905 7238 3220 15402 26416 29971 28277 28607 23935 13107 1160 -936 -3475
13976c475P791N680o00n675J0113R434l30M910Q25j0649j6320m420M185J520M139
13961G128j443m716O692J460P549j037O032L061n320j4134q422K701K794n33R795
13946A1607M244m673K050l67k794Q5q41K200Q696o389o789M59M177p512o055K128
13930B26O175k623M056M968K824J2398O739j652l674m919r027Q11M406p264q959
13915D485M734K789k232m482O289m118l679P217M116k061j122Q980M932L625L787
13900C3260n627k890N00j049j474n12K25j7278o030M720K251K794J3623l142n08
13885A8863Q17Q18j65j813L177o172o297Q151J631j867M90o439k977p098Q202
13870I321J860k784O065L572K240k703Q478j0945o089j024L665o532p69O644M476
$$ plain form
13976 -3475 4316 9996 9396 3721 13834 23268 22938 27848 28673 18024 1704 -2716 1469 2989 7128
13961 7128 5685 969 7661 9121 16670 15633 21665 24726 19406 5272 -3150 -449 2345 1812 11607
13946 11607 15851 11178 13228 12861 10067 10152 9311 11511 20207 13818 7029 7488 11665 4153 -1902 226
13930 226 6401 3778 7834 12802 15626 28024 34763 33111 29437 24518 15491 16302 20708 13444 4485
13915 4485 9219 12008 9776 5294 11583 7465 3786 11003 15119 13058 11936 20916 25848 29473 33260
13900 33260 27633 24743 25243 24194 22720 22208 22433 5155 -875 3845 6096 8890 22513 19371 18863
13885 18863 19680 20498 20333 18520 21697 15525 9228 17379 19010 17143 17633 11194 8217 1119 9321
13870 9321 11181 8397 14462 18034 20274 17571 26049 15104 9015 7991 11656 5124 4355 10999 15475
13855A5475k940l027l273k146K884n103j236J308M241O423J2978p49r893k350
13841A2592m111j113K173J59r965n744l60J4010Q328O2p867p022l987j34j847
13826d826q47K181M065k552J30L85Q653q48k258k555L114Q963O094K792j7502
13811D989l571J509K054k360k704k110n606l80K912O487J6077J0592J5082k202
13797D0769r496Q69n882m702m695j1236J899m83q99o91m45l579Q830K418Q155
13782B0832J711J901K135l53n715L110J7j831Q3M188K026P034O613n170j5346
13767B1235k755R641L876J933k294M496l289n988L513Q536m561K487l348j207
13753C2275J3537J3473N653M4L359l682J2387M866n757m20j98J8327J6844Q780
$$ plain form
13855 15475 12535 9508 6235 4089 6973 1870 634 1942 6183 12606 25584 24835 14942 12592
13841 12592 8481 7368 9541 9700 -265 -6009 -6369 7641 15969 16031 8164 1142 -2845 -2979 -4826
13826 -4826 -5673 -3492 573 -1979 -1849 -1464 7189 6341 4083 1528 4642 13605 19699 22491 4989
13811 4989 1418 2927 4981 2621 -83 -2193 -7799 -8179 -5267 1220 17297 27889 42971 40769
13797 40769 31273 32142 26260 21558 16863 5627 7526 7043 6144 5453 5008 1429 10259 12677 20832
13782 20832 22543 24444 26579 26226 20511 23621 23638 21807 21890 26078 28104 35138 41751 36581 21235
13767 21235 18480 28121 31997 33930 31636 36132 32843 26855 30368 38904 34343 36830 33482 32275
13753 32275 45812 59285 64938 64982 68341 64659 77046 81912 76155 75735 75537 93864 110708 119488
13739A19488Q054J2435J4952J6338L4830L0476M1193O2077Q2724R1361J25350
13728F39278J56230J63827J62504J56864J20459P8239M0492l1401p5762j03047
13718A307683j19173j26681j11618r2818o1116k8128j2416J6978N3754R2363J45187
13707A064015J75603K32104K90530L18446L18427K97566K36611J45545L8941o9838
13697C047950j74134k48571k84282k76431k48804k09786j70576j10328o8625j4213
13687A242200K8473Q9061J51300K22012L02915L82983M58584M91513N01888M43702
13677D314631L26286J74966q209j83986l33424m30438m70322m55288l72313l07446
13667B254457k28182j40081p2154n719P5991J54642K52520L60698M57387N68675
$$ plain form
13739 119488 127542 139977 154929 171267 206097 236573 277766 339843 422567 513928 639278
13728 639278 795508 959335 1121839 1278703 1399162 1477401 1517893 1486492 1410730 1307683
13718 1307683 1188510 1061829 950211 857393 796277 768149 755733 772711 826465 918828 1064015
13707 1064015 1239618 1471722 1762252 2080698 2399125 2696691 2933302 3078847 3117788 3047950
13697 3047950 2873816 2625245 2340963 2064532 1815728 1605942 1435366 1325038 1256413 1242200
13687 1242200 1270673 1359734 1511034 1733046 2035961 2418944 2877528 3369041 3870929 4314631
13677 4314631 4640917 4815883 4807674 4623688 4290264 3859826 3389504 2934216 2561903 2254457
13667 2254457 2026275 1886194 1814040 1808321 1884312 2038954 2291474 2652172 3109559 3678234
13657C678234O48405O68074O00516M66726K77926L8771k15103m36666n67159o37729
13647D521995o43236n69519m76146l85241k85081j90715j02390l0189K9947J09645
13637A979070K06638K93402L75836M38488M80282M67523L89578K45546Q2368j04258
13627D854473k84976m13136m76533n10525m83303m24029l34364k47034j72760
13618A507813j10545p0381k7058M0921R9120J61989K18364K71350L15577L24901
13608B732051L00317K26383J20349n468j40155k48469l12758l40596l44820l18666
13598A668168k69083k03822j51093j07792o1174k9371r230K2883N9225Q8246J13525
13587A120482J24178J43040J29342Q6485L3763r797n7424j18700j64475j74621
$$ plain form
13657 3678234 4326639 4994713 5595229 6061955 6339881 6378652 6163549 5726883 5159724 4521995
13647 4521995 3878759 3309240 2833094 2447853 2162772 1972057 1869667 1839478 1869425 1979070
13637 1979070 2185708 2479110 2854946 3293434 3773716 4241239 4630817 4876363 4958731 4854473
13627 4854473 4569497 4156361 3679828 3169303 2686000 2261971 1927607 1680573 1507813
13618 1507813 1397268 1326887 1299829 1340750 1439870 1601859 1820223 2091573 2407150 2732051
13608 2732051 3032368 3258751 3379100 3373632 3233477 2985008 2672250 2331654 1986834 1668168
13598 1668168 1399085 1195263 1044170 936378 875204 845833 836603 859486 918711 1006957 1120482
13587 1120482 1244660 1387700 1517042 1603527 1637290 1627493 1570069 1451369 1286894 1112273
13577A112273j71224j55253j37218j16702q5984o4653n9576m5430k5786l1233
13567B19214k1980j6049o989r008j0146j5751j6436r456p189n312r236j1410j252
13554G9000j0583j890l63p469n904l893q230O888Q333j034pj0260o607J623q05
13539C8799l106N787k263q81R82N53m329l027n94J588L439O306l982m375p497
13524B7400J1221n723p009O824N286j335j871k583q231k648l158m89k415n480
13510I789R983L547K83j418O523N179p070j8305P897J4415J5230k100k654p997
13496C3302L252o275j273m164j0143k161M608m449l084J0366O942J1657N683o168
13482C8093j2020m835l418o10r15N211J671n796l505N980O376M736K082Q00K787
$$ plain form
13577 1112273 941049 785796 648578 531876 445892 381239 321663 276233 250447 219214
13567 219214 197234 181185 174196 165188 155042 139291 122855 113399 106210 100898 91662 80252 79000
13554 79000 68417 66527 66164 58695 52791 48898 40668 47556 55889 54855 54848 44588 37981 39604 38799
13539 38799 35693 41480 39217 38336 39318 39871 35542 32515 31921 33509 36948 43254 39272 34897 27400
13524 27400 38621 32898 25889 32713 37999 36664 34793 32210 23979 21331 18173 17684 15269 9789
13510 9789 19772 23319 23602 22184 28707 33886 26816 8511 16408 30823 46053 43953 41299 33302
13496 33302 36554 30279 29006 24842 14699 12538 17146 12697 9613 19979 26921 38578 44261 38093
13482 38093 26073 21238 17820 17210 16295 21506 23177 17381 13876 19856 26232 30968 33050 33850 36637
13467C6637p677M732n036j2927j883N904j2009n690J768P702J0070q528n350R70
13453H683J3924J327j5677R642L820K914K971J009K029o168m821l759M140k890
13439A7144j394j100o574n803L936k957M995R2j3603q25Q491R468k970P24n899
13424C725q588N409L117j425J132l957o631n479K033J5871j293J9325j648q982
13410A2609j3038l728O518J1023L020j260N041K480j239K639R23n71k248l880
13396A8289m657J663j192j655j733j389J331k290q137m668J6357j305k070m832
13382C712Q472N507l086O624L849m890l945j035k857n2l682P042O371N473j1420
13367A6083r961o04k827O334K272m554r89l62M514l99p373j60P549K942J025j31
$$ plain form
13467 36637 28960 33692 28656 15729 13846 19750 7741 2051 3819 11521 21591 13063 7713 8683
13453 8683 22607 23934 8257 17899 21719 24633 27604 28613 30642 24474 19653 15894 20034 17144
13439 17144 15750 14650 8076 2273 6209 3252 8247 8339 -5264 -6089 2402 11870 8900 9624 3725
13424 3725 -4863 546 3663 2238 3370 -587 -7218 -12697 -10664 5207 3914 23239 21591 12609
13410 12609 -429 -4157 2361 13384 16404 15144 20185 22665 21426 24065 24988 24417 22169 18289
13396 18289 13632 15295 14103 12448 10715 9326 10657 8367 230 -4438 11919 10614 8544 3712
13382 3712 12184 17691 14605 21229 25078 20188 16243 15208 12351 12299 8617 15659 22030 27503 16083
13367 16083 6122 5518 2691 9025 11297 6743 5754 5392 9906 9507 2134 1974 9523 12465 13490 13359
13351A3359j2086n895J2057M961j451L273p62j463L158l240m468j2408p54J5047
13337I328Q409O825m921j0702m791N802Q789P322P327L607j5676q945o878l343
13323B153Q172M424J4408J000j559q092m739j640n33n065K045L831q814m309o58
13308F24J502Q45O30K813R622J734k317O127r97L345k452J0089k993j118K672
13293C0126r113k406O038m501j9505M309N142L539N57n181M025J319l099K196
13279A3446l931r58O314M9k407J137J172j026K528P773M491r664j0458O599M018
13264A9083M040j483k08O983r36m382p750N33L672J449j2469k538L472P848Q087
13249B5401Q765M36o638P025K417r504k780M396M277j88o660o15k57M555q01O02
$$ plain form
13351 13359 1273 -4622 7435 12396 10945 14218 13456 11993 15151 11911 7443 -4965 -5719 9328
13337 9328 17737 24562 19641 8939 4148 9950 18739 26061 33388 36995 21319 12374 5496 2153
13323 2153 10325 14749 29157 30157 28598 20506 15767 14127 13594 8529 10574 14405 5591 1282 624
13308 624 2126 2971 3601 6414 16036 17770 15453 21580 20583 23928 21476 31565 28572 27454 30126
13293 30126 21013 18607 24645 20144 639 4948 10090 13629 14186 9005 13030 14349 11250 13446
13279 13446 9515 8557 14871 14920 12513 13650 14822 13796 16324 24097 28588 18924 8466 15065 19083
13264 19083 23123 21640 21432 28415 27479 23097 15347 15880 19552 21001 8532 5994 9466 17314 25401
13249 25401 34166 34602 27964 34989 37406 27902 25122 29518 33795 33607 26947 26332 26075 30630 29829 30431
13233C0431r663p069O986P04L302L416K061j806q96j1823k850Q962J3311k127
13219C2939j1147M036O001N114J313M138O590m47o626j8686Q020K816k645K404
13205C3820k795j849J4591M854O945k400l174j2018n800K521J6952P177O443M043
13191F9310j27j6931o554n832o248m530R549K773p490l940j026o379p11P015M335
13176C3214n859j4646n234J3236Q702N771O409R130l812j630K375n385L213n075
13162D0409j918L029J845l056O337R808J0190N482l077m146j2545j6511n489L256
13148C3614R800R4p786J379j253m68q436n363J1128m177m855P660R99k079k230
13133B8027J714J1170K988k979l098Q188L815r261p379l862J2534N715p015K864
$$ plain form
13233 30431 20768 13699 20685 21389 24691 28107 30168 28362 27466 15643 12793 21755 35066 32939
13219 32939 21792 25828 31829 36943 38256 42394 48984 48537 41911 23225 31245 34061 31416 33820
13205 33820 31025 29176 43767 48621 55566 53166 49992 37974 32174 34695 51647 58824 65267 69310
13191 69310 69183 52252 45698 39866 33618 29088 38637 41410 33920 29980 28954 22575 21864 28879 33214
13176 33214 27355 12709 7475 20711 29413 35184 41593 50723 46911 45281 47656 42271 45484 40409
13162 40409 38491 41520 43365 40309 46646 56454 66644 72126 69049 64903 52358 35847 30358 33614
13148 33614 43414 43508 35722 37101 35848 35380 26944 21581 32709 28532 23677 31337 32336 30257 28027
13133 28027 29741 40911 43899 40920 37822 46010 49825 40564 33185 29323 41857 47572 40557 43421
13119D3421p746l666j244R637P963k079P248O674M343M331n2k666r727n871j301
13104D9265n647n460j641N777L254J466n672M114n343r436j2832l664M207L118
13090B1506k572O788K641l729j377P51L664L867J036J261j070O5K6n438k722K054
13074B6751M138L393J50q19r506m199R240J1768p8O430l621q446k522n757j214
13059B5708K86r49K100k474m110k707k738M985j817k421M289P170J5846K106J0087
13044E5361Q206J223m245K225k907j4757O31J1367K716J707O011J203K651q103
13030F3289j670n20O09O169k30L6k411l259j833o051P872M558q032N650K362o57
13014F5882P149L491m997l752J230l445J231R586o631o941q09o575q180L630M964
$$ plain form
13119 43421 35675 32009 30765 40402 48365 46286 53534 60208 64551 68882 68830 66164 56437 50566 49265
13104 49265 43618 38158 36517 42294 45548 47014 41342 45456 40113 30677 17845 14181 18388 21506
13090 21506 18934 25722 28363 24634 23257 24008 27672 31539 32575 33836 32766 32831 32857 27419 24697 26751
13074 26751 30889 34282 34432 33613 24107 19908 29148 40916 40838 47268 43647 35201 32679 26922 25708
13059 25708 25994 25045 27145 24671 20561 17854 15116 20101 18284 15863 20152 27322 43168 45274 55361
13044 55361 63567 64790 60545 62770 59863 45106 45737 57104 59820 61527 67538 68741 71392 63289
13030 63289 61619 61099 61708 67877 67647 67683 65272 62013 60180 54129 62001 66559 58527 64177 66539 65882
13014 65882 73031 76522 71525 67773 69003 65558 66789 76375 69744 62803 61994 55419 47239 50869 55833
12999E5833r668J509O357J414K188J0725l756p560q079j412J6302L005k789o199
12985E7870P361R644l252j1062k469J425L136K682j914n252K185P398J0886P478
12971H6116J733k734o377k391o22l063P91R029J0950O140n790j2033p8J1271J3173
12956A06115P919L897k453m914j211o209k740j542j0404J0356J2771Q633j0451
12943A09767q189q453R17L912q064m483k20o06L780k971M542K492o01M713J0950
12928A07486M31r683K71o82J397J519L814O246k86q012L124P297O960J645k925
12913A18602r199L42m287k6L600N136L695n285J828r525l899l581P80J45l689
12898I4637R159N233j316m517L678r28o37q350L161J520m359O065J4603M378o33
$$ plain form
12999 55833 46165 47674 54031 55445 57633 68358 64602 57042 48963 47551 63853 66858 64069 57870
12985 57870 65231 74875 71623 60561 58092 59517 62653 65335 63421 58169 60354 67752 78638 86116
12971 86116 87849 85115 78738 76347 75725 72662 73453 82482 93432 99572 93782 81749 81671 92942 106115
12956 106115 114034 117931 115478 110564 109353 103144 100404 98862 88458 98814 111585 120218 109767
12943 109767 101578 93125 94042 97954 89890 85407 85187 84581 88361 85390 89932 92424 91823 96536 107486
12928 107486 107917 98234 98505 97823 99220 100739 104553 110799 110513 102501 105625 112922 119882 121527 118602
12913 118602 109403 109745 105458 105432 109032 114168 117863 112578 114406 104881 100982 97401 98181 98326 94637
12898 94637 103796 109029 107713 103196 106874 105946 105309 96959 100120 101640 97281 103346 117949 122327 121694
12883A21694l13J873p581R44O940k044j465p851q757j2657O779P503N158L358
12869A13581k298q422J401J0537J0442K664Q440j99p698k467P487j0102n894q81
12855A16591J2439P722j647L173k04j969n654J795o81p801k729l39P959L084n534
12840A26205r39K539L026k679m00Q933N670q17n440j725J1963N507r127m717M684
12825A42683N142O03M317P726Q70p531p280j017K319N622o724M929J1884R57m90
12810A64010J766M790k510k830o169m079R977l053O70Q614M427o491r576n819
12796A53727k944q439J1529J1135J3234J0961q162p989M747n195l836O0l141k304
12782A63383M921K550J0289J7993L344O873p20p135o92n726p084N50j1408n333
$$ plain form
12883 121694 121381 123254 115673 116617 123557 121513 120048 112197 103440 90783 97562 105065 110223 113581
12869 113581 111283 102861 104262 114799 125241 127905 136345 136146 128448 125981 133468 123366 117472 116591
12855 116591 129030 136752 135105 138278 138074 136105 130451 132246 131565 123764 121035 120696 128655 131739 126205
12840 126205 125266 127805 130831 128152 127752 136685 142355 141538 136098 134373 146336 151843 142716 137999 142683
12825 142683 147825 148428 152745 160471 161341 153810 146530 145513 147832 153454 146730 151659 163543 164500 164010
12810 164010 165776 170566 168056 165226 159057 154978 164955 161902 162572 171186 175613 169122 159546 153727
12796 153727 150783 142344 153873 165008 178242 189203 181041 173052 177799 172604 168768 168828 165687 163383
12782 163383 168304 170854 181143 199136 202480 209353 208633 201498 200806 195080 187996 188546 177138 171805
12768A71805J2989Q549J1866O696r54R22Q721k070P67J147J116P039J2227N402
12754B46222n01k722M010J41L283N870k184j0816k9R096J461J6541J9967N263
12740B95602L446L819n61k657R67M673O753J2326J1779P004J7207K324o129p499
12726C49054j086N109O949K4082P217m497J1046J3419N978O941l407N619J6098
12713D42522J4552Q627j374J467Q685J9517K9204J8279O515K70O341R687J0848
12700E75140N591j030k084P638K1587J4863R605K568N977J8379K1371K3381Q987
12687G11973J0914K6630J8681J1334J8236J2619J1355J9586K3785J9818J9633
12676I04564K6534K7450K4029K0423K4103K7529K7397K9676L0240K8533J7143
$$ plain form
12768 171805 184794 193343 205209 211905 210951 211873 220594 218524 219291 220438 221554 228593 240820 246222
12754 246222 245721 242999 247009 247150 250433 256303 254119 243303 243274 252370 253831 270372 290339 295602
12740 295602 299048 302867 302306 299649 300616 305289 312042 324368 336147 343151 360358 362682 356553 349054
12726 349054 347968 353077 360026 384108 391325 386828 397874 411293 417271 424212 420805 426424 442522
12713 442522 457074 465701 464327 465794 474479 493996 523200 541479 547994 548264 554605 564292 575140
12700 575140 580731 579701 577617 585255 606842 621705 631310 633878 639855 658234 679605 702986 711973
12687 711973 722887 749517 768198 779532 797768 810387 821742 841328 865113 884931 904564
12676 904564 931098 958548 982577 1003000 1027103 1054632 1082029 1111705 1141945 1170478 1187621
12665A187621L6067M2449M3756M0915L6415L9284L8835L5981L9908N3417N4386
12654A649034N5892N1847N2971O0707O4017O5818O8394O7661O5424Q2441Q6185
12643B370391Q9696R4658J04244J10852J13695J19515J20904J29779J30908J45219
12633C529861J59150J63489J76087J80451J86384K01174K05397K18083K35621
12624E255697K45118K60704K76879K80605K99572L23189L38697L36011L52449
12615G968921L57719L69889L70956L86725L96292L91269L96705L83551L75000
12606A1397027L63426L63323L43065L22685K91943K61089K20166J75448J12475
12597A3850647N3757j5262j01354j80561k55364l11594l69357m26086m48887m68234
$$ plain form
12665 1187621 1223688 1266137 1309893 1350808 1387223 1426507 1465342 1501323 1541231 1594648 1649034
12654 1649034 1704926 1756773 1809744 1870451 1934468 2000286 2068680 2136341 2201765 2284206 2370391
12643 2370391 2460087 2554745 2658989 2769841 2883536 3003051 3123955 3253734 3384642 3529861
12633 3529861 3689011 3852500 4028587 4209038 4395422 4596596 4801993 5020076 5255697
12624 5255697 5500815 5761519 6038398 6319003 6618575 6941764 7280461 7616472 7968921
12615 7968921 8326640 8696529 9067485 9454210 9850502 10241771 10638476 11022027 11397027
12606 11397027 11760453 12123776 12466841 12789526 13081469 13342558 13562724 13738172 13850647
12597 13850647 13904404 13889142 13787788 13607227 13351863 13040269 12670912 12244826 11795939 11327705
12587A1327705m56685m44534m27071l78607l41760k98209k38221j99536j50346
12578H392736r3886n0285l0490j4936n972n523l1430m5559p8564j25258j69686
12567G741147k12044k50179k57636k57647k65007k48852k10724j62974j33342
12558E742742p2902k7935J3560M6365O4300Q0946O7720L7622N95l2262n2324q8519
12546E779908j36317j63282j81497j96657j96647j97746j81506j70801j31469
12537D223986q3037m8863K573M8118R5949J29954J46905J68833J93689J92189
12527E070296J66840J45566J21817R9666P5923M0905J9049J0225O18J1493K1095
12516E783493K0109L6120N3030M5546M6190K5657m750l5668o0362j03320j60606
$$ plain form
12587 11327705 10871020 10426486 9999415 9620808 9279048 8980839 8742618 8543082 8392736
12578 8392736 8298850 8248565 8218075 8203139 8197167 8191644 8160214 8114655 8036091 7910833 7741147
12567 7741147 7529103 7278924 7021288 6763641 6498634 6249782 6039058 5876084 5742742
12558 5742742 5669840 5641905 5655465 5701830 5766130 5847076 5914796 5952418 5953013 5920751 5868427 5779908
12546 5779908 5643591 5480309 5298812 5102155 4905508 4707762 4526256 4355455 4223986
12537 4223986 4140949 4092086 4094659 4142777 4238726 4368680 4515585 4684418 4878107 5070296
12527 5070296 5237136 5382702 5504519 5604185 5680108 5721013 5740062 5750287 5750905 5762398 5783493
12516 5783493 5803602 5839722 5892752 5938298 5984488 6010145 6005395 5969727 5909365 5806045 5645439
12505E645439j96293k09457k23616k37551k27489j97346j63662j16862p5218k8945
12495C969000L3014Q2301J30655J59265J87902K09987K05240J98740J77431J47945
12485E501480J04627N4817r83m4977r0560j27209j55315j75598j81436j52950
12475D731896j24507o9300l912M7556R4303J37606J64061J74267J78140J49559
12465E479669J15080O1804q876o4233j08722j55109k10912k41835k51691k59576
12455D355599k26449k04657j72804j22422p0963j8410K3408P3683J18934J58840
12445C914759J77741J86193J97449J72191J35770R7144L7419k0756q6892j47224
12435D663794k15414k52506k79062l01070l07808k94205k76849k59188k28594
$$ plain form
12505 5645439 5449146 5239689 5016073 4778522 4551033 4353687 4190025 4073163 3997945 3969000
12495 3969000 4002014 4084315 4214970 4374235 4562137 4772124 4977364 5176104 5353535 5501480
12485 5501480 5606107 5660924 5659941 5614964 5524404 5397195 5241880 5066282 4884846 4731896
12475 4731896 4607389 4538089 4534177 4581733 4676036 4813642 4977703 5151970 5330110 5479669
12465 5479669 5594749 5656553 5647677 5583444 5474722 5319613 5108701 4866866 4615175 4355599
12455 4355599 4129150 3924493 3751689 3629267 3558304 3539894 3563302 3636985 3755919 3914759
12445 3914759 4092500 4278693 4476142 4648333 4784103 4881247 4918666 4897910 4811018 4663794
12435 4663794 4448380 4195874 3916812 3615742 3307934 3013729 2736880 2477692 2249098
12426B249098k14592j81899j65848j48915j31768j04772r8703q9808q0176o9457
12416I63160n8997m8804m3261m5812m1343l4773l3436l4249k5742k2889k4423
12405E49431k2679j9375k7105k4778k3666q785j5459r090j2503q833n903k0455
12393C50800k1030j2790L342k772L566j337l583p113r647n361k005j966J968j043
12379B91029l824r755k0092J280o213o268l426j761n336k096Oj8192j0536j019
12365B03797O063k225k377K584P480o843R293R346R141N802j4020j7432l849m931
12351B01829j1747m906q768L30L660n744M398r38l933k357M846P107O01j547K92
12336A83123m721q779M171N740M450n130j6787q361N789J701r139j794n563l504
$$ plain form
12426 2249098 2034506 1852607 1686759 1537844 1406076 1301304 1202601 1112793 1032617 963160
12416 963160 904163 855359 812098 766286 724943 690170 656734 622485 596743 573854 549431
12405 549431 526752 507377 480272 455494 431828 423043 407584 398494 385991 377158 371255 350800
12393 350800 329770 316980 320322 317550 321116 319779 316196 309083 299436 294075 292070 290104 292072 291029
12379 291029 287205 277450 257358 258638 252425 246157 242731 240970 235634 233538 233544 215352 204816 203797
12365 203797 209860 207635 205258 207842 215322 208479 217772 227118 236259 242061 228041 210609 206760 201829
12351 201829 190082 185176 176408 176738 180398 174654 179052 178114 174181 171824 176670 183777 184378 182831 183123
12336 183123 178402 169623 173794 179534 183984 178854 162067 153706 159495 161196 152057 150263 144700 141196
12322A41196r24r650m659n17J0574N539p91j0349n550R391Q296j0680j1087P847
12308A28636J6961K273M048M112m254K454m070r717j3037n474L765M588k722q928
12294A18635M050j688L101p09j5793o187o349n643j10Q303Q126q44M941J0849
12280A20682J3693m156o206j6874o480N584L706q17j205L117J270j2161o221j315
12266I2617m339K700J0495q13p453n796J047k37k944p133J443J0092k177j2191
12252G5311j501J0972J721p1n007N29k532K129J4990J633p437r501q804j4195
12238E8237J929q44p123M506J0046Q129K656m67l925p793K69n805p918j902Q815
12223E8810M088j677R189J744k942Q207N960L066m91p21J949p532r584M519q128
$$ plain form
12322 141196 140272 130622 125963 125446 136020 141559 140768 130419 124869 134260 142556 131876 120789 128636
12308 128636 145597 147870 151918 156030 151776 154230 150160 140443 127406 121932 125697 130285 127563 118635
12294 118635 122685 120997 124098 123389 107596 101409 95060 89417 89307 97610 105736 104892 109833 120682
12280 120682 134375 130219 124013 107139 100659 106243 109949 109132 107927 111044 112314 100153 93932 92617
12266 92617 88278 90978 101473 100660 93207 87411 88458 88221 85277 78144 79587 89679 87502 75311
12252 75311 73810 84782 86503 86432 81425 81954 79422 81551 96541 98174 90737 81236 72432 58237
12238 58237 60166 59322 52199 56705 66751 74880 77536 77069 73144 65351 65620 59815 51897 49995 58810
12223 58810 62898 61221 70410 72154 69212 77419 83379 86445 85954 85233 87182 79650 70066 74585 66457
12208F6457k057j79M886M064M755p277R19M71o963M27M156J188n989n501Q760
12193F8117N769l850q61K841K724r426r098r990L872J142M905n24N967l498j5421
12178D2669M681O488m043p515P392O52L088l615O88O841N149q726R177J1668j1012
12163F3582o977J375J843p137k702r478q630O97R983Q964j180l748o139M377J0214
12148E5044K747p940m336N8J550K010M219J852n42m130N805j193k24O982J761
12133F3663p27r065o838k6R765P634n771r04R969N723Q79m235q474L336J561p754
12117E8736j481N469r57J143p003m433k875l366l478J357J3400j286K759J230
12103E9215r386q506L363O341J1113K280m646j214m00L787L627j476j0197r670
$$ plain form
12208 66457 64400 64221 69107 73171 77926 70649 71568 72039 65076 65503 69659 70847 64858 59357 68117
12193 68117 73886 70036 69175 72016 74740 65314 56216 46226 50098 51240 56145 55621 61588 58090 42669
12178 42669 47350 53838 49795 42280 49672 50324 53412 49797 50485 57326 62475 53749 62926 74594 63582
12163 63582 56605 57980 59823 52686 49984 40506 31876 32573 42556 51520 50340 46592 40453 44830 55044
12148 55044 57791 49851 45515 45573 47123 49133 53352 55204 54662 50532 56337 55144 54920 61902 63663
12133 63663 62936 53871 47033 47007 56772 64406 58635 57731 67700 73423 74302 70067 61593 64929 66490 58736
12117 58736 57255 62724 61767 62910 55907 51474 48599 45233 41755 43112 56512 55226 57985 59215
12103 59215 49829 41323 44686 51027 62140 64420 59774 58560 58160 61947 65574 64098 53901 44231
12089D4231l146M326r76K812N058n372j0323L924m32M460M045O273p150J579M012
12074E3321L303l148n783J0176Q83J867Q18J548L589k821n4N544n084r258j2990
12059D1911m000j705l876o574O932J4365J564o291R838J6564rj2616o867N204
12045E4440J596K601L051l926L340N852N455r387k766n37L31p006m268J0134j474
12030E7436J787k637l064K487j852o088j3496L797J0004O649J913p493R899L807
12016F3149R65K312Q665L591O342o448j2435j2763n070P400O691k1m721j144p674
12001D8839o619R615L861k904K673M73Q474M086N722L565l131O84p530Q383J1188
11986H7379P216m821o852k245j0747K935K367j359L110K481R180J986J842J822
$$ plain form
12089 44231 41085 45411 44435 47247 52305 46933 36610 40534 40102 44562 48607 54880 47730 49309 53321
12074 53321 56624 53476 47693 57869 58752 60619 61437 62985 66574 63753 63699 69243 64159 54901 41911
12059 41911 37911 36206 32330 25756 32688 47053 48617 42326 52164 68728 68719 56103 49236 54440
12045 54440 56036 58637 61688 57762 61102 66954 72409 63022 60256 59719 60050 53044 48776 58910 57436
12030 57436 59223 56586 53522 56009 54157 48069 34573 38370 48374 55023 56936 49443 59342 63149
12016 63149 64114 66426 75091 78682 85024 78576 66141 53378 48308 55708 62399 62378 57657 56513 48839
12001 48839 42220 51835 55696 52792 55465 55938 64412 68498 74220 77785 74654 75338 67808 76191 87379
11986 87379 94595 89774 82922 80677 69930 72865 75232 73873 76983 79464 88644 90630 92472 94294
11972I4294K93r642r683M186J7587Q357k304J685k464K898P144K625P462K766
11958A25204J1232O82O10m4R518J4528K263L968J6278Q622J2187Q277J3047K7639
11944B54011J9256K1841K1614K0665L3254L0696L9124N6051P0721P1337Q9225
11933G27795J12546J33912J66559J99877K61457L25530L95622M93539O19778O98110
11923D134725P44254O94215N19555K63036k2762k80426m76124n85049o03492n60363
11913C827569m64465l73638k77183j84906j15186n1630r82O1445J30852K09168
11903B761044L08784M25002N46680O77510P53136P18372N44326L04160K9610k39499
11893F829125m83866o54231p13257o80363o03135m93689l79281k79543j99006
$$ plain form
11972 94294 94587 84945 75262 79448 97035 105392 103088 104773 102309 105207 112351 114976 122438 125204
11958 125204 136436 137118 137728 137684 147202 161730 163993 167961 184239 192861 205048 213325 226372 254011
11944 254011 273267 295108 316722 337387 370641 401337 440461 496512 567233 638570 727795
11933 727795 840341 974253 1140812 1340689 1602146 1927676 2323298 2816837 3436615 4134725
11923 4134725 4878979 5573194 6092749 6355785 6333023 6052597 5576473 4991424 4387932 3827569
11913 3827569 3363104 2989466 2712283 2527377 2412191 2360561 2359579 2421024 2551876 2761044
11903 2761044 3069828 3494830 4041510 4719020 5472156 6190528 6734854 7039014 7068624 6829125
11893 6829125 6345259 5691028 4977771 4297408 3694273 3200584 2821303 2541760 2342754
11884B342754j33157p4304k5490K5771P5917J48985K25692L10844M12107N37298
11874C846417O62192P33995P33095O30308M34851J63849j44494m20944n88224
11865F051045o72431o68860n98656m88155l65197k68779j93381j02303k6086L7851
11855B705048J10387J92015K77939L82392N00338O17171O89332P14617O51399
11846F840638N25497L37575J01813j19761k71610l36709l06627j96126o8958L6380
11836F542112O2204L825j06858k47567l86202m94083n56825n59626n25200m45853
11826C285927l46683k74858k06443j31524p3860j5322K9369R1062J56192K21128
11816B734988L12613M07140M86448N21246M85938L78275J71553l4568k37160m17989
$$ plain form
11884 2342754 2209597 2135293 2109803 2135574 2211491 2360476 2586168 2897012 3309119 3846417
11874 3846417 4508609 5242604 5975699 6606007 7040858 7204707 7060213 6639269 6051045
11865 6051045 5378614 4709754 4111098 3622943 3257746 2988967 2795586 2693283 2667197 2705048
11855 2705048 2815435 3007450 3285389 3667781 4168119 4785290 5474622 6189239 6840638
11846 6840638 7366135 7703710 7805523 7685762 7414152 7077443 6770816 6574690 6505732 6542112
11836 6542112 6604316 6608141 6501283 6253716 5867514 5373431 4816606 4256980 3731780 3285927
11826 3285927 2939244 2664386 2457943 2326419 2252559 2237237 2266606 2357668 2513860 2734988
11816 2734988 3047601 3454741 3941189 4462435 4948373 5326648 5498201 5463633 5226473 4808484
11806D808484n17839n35696n04829m45247l69356k72911k07455j53419r9767m7344
11796A654621q45K7430O4612J16183J65372K40509L44783M53976N49607O03875
11786D220123N93314N10968L61042J28355j20440l54081n22976o01083n90149
11777C625073n23799m19841l03109k17865j45739p8400m0864J6727O6339J27461
11767B105983J89294K66397L46166M46590N21616N53789M96451L58661J59689
11758E444636r2091l27118n11441n94693n94226n58176m66873l68852l02474k40145
11748A388547j89489j55646j23521j02256r4862p2941o0677o2711m9878m0725
11738D35841l6462k4754k0525k5877k2229p177j3387k2014k3313j3869j9222k6258
$$ plain form
11806 4808484 4290645 3754949 3250120 2804873 2435517 2162606 1955151 1801732 1701965 1654621
11796 1654621 1653776 1681206 1745818 1862001 2027373 2267882 2612665 3066641 3616248 4220123
11786 4220123 4813437 5324405 5685447 5813802 5693362 5339281 4816305 4215222 3625073
11777 3625073 3101274 2681433 2378324 2160459 2014720 1936320 1895456 1912183 1978522 2105983
11767 2105983 2295277 2561674 2907840 3354430 3876046 4429835 4926286 5284947 5444636
11758 5444636 5352545 5025427 4513986 3919293 3325067 2766891 2300018 1931166 1628692 1388547
11748 1388547 1199058 1043412 919891 817635 722773 649832 589155 526444 476566 435841
11738 435841 399379 374625 354100 328223 305994 298817 285430 263416 240103 226234 207012 180754
11726A80754k0913r979l45J342p687r663k480m871o803n994o562l094J40R247
11712A13092l635j2787n754j0299m738P734k489q195j49p111l856M523Q16M997
11698G2149j448K789j0001j4766J010N274k94L136N567j2065m838J2114q01j52
11684E7674m93j577q013K393L848O768K693m631q105j921j6787l265K951L877
11670C5412k411J432P079k423n488L330K515j836j085M759k981K306M988o578
11656C9019J25M930n261q301n693J296k436P967l843r83J898n578r2l850J1612
11641C0810M960R10r193m079Q426N285M963o561q789K748j861L381N295l141j151
11626C2003J2757m783K17j432j1694J196L141k083R525j279j120l005j2235j2648
$$ plain form
11726 180754 159841 149862 149517 150859 143172 133509 131029 126158 119355 113361 106799 103705 103845 113092
11712 113092 109457 96670 90916 80617 75879 83613 81124 72929 72780 65669 61813 66336 67152 72149
11698 72149 70701 73490 63489 48723 49733 55007 54713 57849 63416 51351 46513 58627 57826 57674
11684 57674 57181 55604 47591 49984 53832 60600 63293 58662 50557 48636 31849 28584 31535 35412
11670 35412 33001 34433 41512 39089 33601 36931 39446 37610 36525 41284 38303 40609 45597 39019
11656 39019 39144 44074 38813 30512 24819 26115 23679 31646 27803 26820 28718 23140 23048 19198 30810
11641 30810 35770 36680 27487 23408 31834 37119 42082 35521 26732 29480 27619 31000 36295 33154 32003
11626 32003 44760 39977 40194 38762 27068 28264 31405 29322 38847 37568 36448 33443 21208 8560
11612H560m67O501M722L321n89q851P303k566j0315K133O637O468R780R515J196
11597D3348j0776l901K545J818r936o770j879Q603p368o996Q671l927j157J7110
11583B9385k470j1128L76J0072k700q092n834K397L526K013o986j5638k994N507
11569b566J0356o085n358Q82M956Q582o989l586P082N291L936j1505o144n36J1648
11554I964k636o714k689J026p180m160P556N085J0096L710r527p101J225r58J2826
11539A0523J1382O281m29r704l527o198O891Q349m967j2287J383N433K720m385
11525A1465O43j1703o918M990K898j17O361J739k025r192j1319M412J2125N445
11511H804K268M344J0498M74j3483k241l675m26Q394k197q829K721J225Q68q345
$$ plain form
11612 8560 8093 14594 19316 22637 22048 13197 20500 17934 7619 9752 16389 22857 32637 42152 43348
11597 43348 32572 28671 31216 33034 23098 16328 14449 23052 15684 8688 17359 13432 12275 29385
11583 29385 26915 15787 16163 26235 23535 15443 9609 12006 15532 17545 10559 -5079 -8073 -2566
11569 -2566 7790 1705 -3653 -2771 2185 10767 3778 192 7274 12565 16501 4996 -1148 -1684 9964
11554 9964 7328 614 -2075 -1049 -8229 -12389 -4833 252 10348 14058 4531 -2570 -1345 -2303 10523
11539 10523 21905 28186 27757 18053 14526 8328 15219 23568 18601 6314 7697 13130 15850 11465
11525 11465 12108 405 -6513 -1523 1375 1258 7619 9358 7333 -1859 -13178 -8766 3359 8804
11511 8804 11072 15416 25914 26388 12905 10664 6989 6563 14957 12760 3931 6652 7877 8745 400
11496D00o484J0484N483K640l285l472j428Q77N619M175L931k903K147N324Q141
11481C1649J3P463n904l315M68k480l139N385m807j0191n436O108n32p089R984
11466A8177m740j0750j818K764J5000P999J74L071j259j0263J600J0671N419M790
11452D0835P041r66r876j0398k809J446K084j3712k403L635k466M04k806N080
11438A5089J4610m031m113j128m130R627M820p089n823P981P315l774j835J730
11424B9249o39j1392q863L399R392n397j621O618Q8j286q16m021j084k628O331
11409A7330J4425M067q080Q99M756J0202J614n678r74o55r0K546P504k134l952
11394D1780j500m855M857N429q006r036n612p780o722j680K523J0690O524o230
$$ plain form
11496 400 -6084 4400 9883 12523 9238 5766 4338 5215 10834 15009 18940 16037 18184 23508 31649
11481 31649 31662 39125 33221 29906 30374 27894 24755 30140 25333 15142 9706 15814 15282 8193 18177
11466 18177 13437 2687 869 3633 18633 26632 26806 29877 28618 18355 19955 30626 36045 40835
11452 40835 47876 46910 37034 26636 23827 25273 27357 13645 11242 14877 12411 12815 10009 15089
11438 15089 29699 25668 21555 20427 16297 25924 30744 23655 17832 25813 33128 29354 27519 29249
11424 29249 28610 17218 8355 11754 21146 15749 14128 20746 20834 19548 18732 14711 13627 10999 17330
11409 17330 31755 35822 27742 28641 33397 43599 45213 39535 38561 37906 37816 40362 47866 45732 41780
11394 41780 40280 35425 40282 45711 37705 28669 23057 15277 8555 6875 9398 20088 26612 20382
11380B0382r168k114M737O941j0194l513O06R537K037K360L523k688m111L059
11366B1394J0568O68k127p560j1155M981p888k814m78k166L755j380M14j513Q725
11351A3424M112l973M606k768l467J8238O881J77j812L705r85m703M679J037j0921
11336B8230j1531K733M67j42J1179O557j590j3366p336l92L775k221j005K154
11322A7512j23j1058K449Q727R32K566n241J83n764m530j9p34m023j09n352Q212
11306C628O048j294K354M768M26k712O21R81J461l385l258n418o222r22O344O09
11290D029m53O92k322J531J6366j579k321j551k95p327j23J806p231K097K797
11275F116j963j2605m471l543R374Q338J444J1503p956j4452m48k416k550m589
$$ plain form
11380 20382 11214 9100 13837 20778 10584 7071 7677 17214 19251 21611 25134 22446 18335 21394
11366 21394 31962 32630 30503 22943 11788 16769 8881 6067 5589 3423 7178 5798 6212 4699 13424
11351 13424 17536 13563 18169 15401 11934 30172 37053 37230 35418 39123 38138 33435 38114 39151 28230
11336 28230 16699 19432 19899 19757 30936 37493 35903 22537 15201 14809 18584 16363 15358 17512
11322 17512 17389 6331 8780 17507 18439 21005 15764 15947 10183 5653 5634 4900 877 768 -4584 3628
11306 3628 9676 8382 10736 15504 15930 13218 13839 14820 16281 12896 9638 4220 -2002 -2924 3420 4029
11290 4029 3576 4268 1946 3477 19843 18264 15943 14392 14097 6770 6647 8453 1222 3319 6116
11275 6116 4153 -8452 -12923 -16466 -7092 1246 2690 14193 6237 -8215 -8663 -11079 -13629 -18218
11261a8218J0654R722o893N155P559K837n367j812L68j692r14J206o4o07j253
11246F81K030j09j0954j791P280N740N936k428p255R71k434j1533l87J1091O375
11231C213o473k443k498j2252K196K000k60M335K979l671l611m021P830O442P553
11216A319n591o129o78R781J514n817Q30K418J543L874l033r446L442p076m869
11201a7918J3299Q705q70L126J908o771r163K493L043n485j0601P267J0526q22
11187a263J425N360L038l416O0j607j848J858O126Kk225q688l502P009M222J2608
11171A9159J669m035J46k371N44n636r336k616m307M703L666O35M487j432j3685
11156h409q908k814O641Q328Q53P253j774j588m83l499k959R218P051K493R16
$$ plain form
11261 -18218 -7564 2158 -4735 420 7979 10816 5449 3637 4005 2313 1399 2605 2541 1934 681
11246 681 2711 2602 -8352 -10143 -2863 2877 8813 6385 -870 101 -2333 -13866 -14253 -3162 3213
11231 3213 -3260 -5703 -8201 -20453 -18257 -16257 -16517 -12182 -9203 -12874 -16485 -20506 -12676 -6234 1319
11216 1319 -4272 -10401 -11079 -1298 216 -5601 -4771 -2353 -810 3064 31 -9415 -5973 -13049 -17918
11201 -17918 -4619 4086 3216 6342 8250 1479 -7684 -5191 -2148 -7633 -18234 -10967 -441 -1263
11187 -1263 162 5522 8560 5144 5204 3597 1749 3607 9733 9735 7510 -1178 -4680 2329 6551 19159
11171 19159 20828 16793 16939 14568 15112 9476 140 -2476 -6783 -2080 1586 2221 6708 5276 -8409
11156 -8409 -17317 -20131 -13490 -5162 -4309 2944 1170 -418 -901 -4400 -7359 1859 8910 11403 12319
11141A2319K324J682O45q239K613l207K323l326p426K83j680J463P375J2662P84
11126B0595J933L050j630n979p723r123M933p35l247O59k166K817l381l150p426
11111a0573k34P570P346k215J94m094K398l187M202N981K711n686o953L313M45
11096A218q210p661O271J4171o246L63J487K903O033l178j69q05q749m387K324
11081d635O660j2539K456P532l152l742n245J4025Q635l879p894P92l449l47O649
11066A867j519n208K954J3994j542o45O527Q304j807j1796q594o547M346k636
11052b302N487q60j0377O355J136R06K314m392o819r098J5620J1080j8727p096
11038a6773J1145J179J934l306m346J530Q286O581r941o253J273O698K604l211
$$ plain form
11141 12319 14643 16325 16970 8731 11344 8137 10460 7134 -292 -9 -1689 -226 7149 19811 20595
11126 20595 22528 25578 23948 17969 10246 1123 6056 5321 2074 2733 567 3384 3 -3147 -10573
11111 -10573 -10807 -3237 4109 1894 2088 -2006 392 -2795 1407 7388 10099 4413 -2540 773 1218
11096 1218 -6992 -14653 -8382 5789 -457 -94 1393 4296 10329 7151 6982 6177 -2572 -6959 -4635
11081 -4635 2025 -10514 -8058 -526 -3678 -7420 -12665 1360 9995 6116 -1778 -986 -4435 -4782 1867
11066 1867 348 -4860 -1906 12088 10546 9901 16428 24732 22925 11129 2535 -4012 334 -2302
11052 -2302 3185 2325 -8052 -1697 -561 345 2659 -1733 -8552 -17650 -2030 9050 -9677 -16773
11038 -16773 -5628 -4449 -2515 -5821 -10167 -8637 -351 6230 -3711 -9964 -8691 -1993 611 -2600
11024b600P139J2102J4497r056n898M658j1692K601p656j1402q730q817K315J0435
11010a2104K024p132O012J1N441J1683L185n530J015J19P149L131l664j16K180
10995A3404p301r924q79n60J3489l263j6924L151J1874K044k689N011p001j9733
10981a9301m323N515J3590R751n11q287o128N823k658r371L70K254k115J333J984
10966a2074L33L125Q844J963L58J166m033J287j020J1053P54j046N16j5655p315
10951a1744M93P702L749q710R55j853J1007j604M520l173j3486N329J9877q005
10937E057r654k815K122L048k055j0559O138J1378l60j0589q967n229j205R934
10923a3756Q052L164l369M2K013k34M473J698p81K420m151l236R68j352j2981
$$ plain form
11024 -2600 4539 16641 31138 22082 16184 20842 9150 11751 4095 -7307 -16037 -24854 -22539 -12104
11010 -12104 -10080 -17212 -11200 -11189 -5748 5935 9120 3590 4605 4724 11873 15004 11340 11224 13404
10995 13404 6103 -3821 -4700 -5260 8229 4966 -11958 -8807 3067 5111 2422 7433 432 -19301
10981 -19301 -23624 -18109 -4519 5232 4721 -3566 -9694 -3871 -6529 -15900 -15530 -13276 -15391 -14058 -12074
10966 -12074 -11741 -8616 228 2191 2549 3715 -318 969 -51 11002 11756 10710 11226 -4429 -11744
10951 -11744 -11251 -3549 200 -8510 -7555 -9408 1599 -5 4515 1342 -12144 -6815 13062 5057
10937 5057 -4597 -7412 -5290 -2242 -4297 -14856 -8718 2660 2300 -8289 -17256 -22485 -23690 -13756
10923 -13756 -5704 -2540 -5909 -5867 -3854 -4088 385 2083 1302 3722 -429 -3665 -2697 -4049 -17030
10908a7030l254N366P874N641M776R727J580n982m000m36M490L579k117j0165
10894D9q292k78p414K217O912j1139L507O630J360L203L863l502n204R45L413
10879c730Q886o109k631K146N135K820n703K656J1898m934j9063k469M129N170
10865a799l02N820p44p179K566q370l993Q27l372m033J869R076K327O379N698
10850D770M879q018O880n640n372p63q285m039N667L789M537P842J602k506j3961
10835h618k164j579m540r965q747J0525J0543j570k214Q154n92J823M970L940
10821c4J4995m345k534k208N4q671q651n170O854R650r34p194q831n138k004k583
10805b6744Q349O083N659l45n282J912J090n027p258L981J0191N55L4Q930R357
$$ plain form
10908 -17030 -20284 -14918 -7044 -1403 3373 13100 14680 8698 4698 4262 8752 12331 10214 49
10894 49 -8243 -8521 -15935 -13718 -6806 -17945 -14438 -7808 -6448 -3245 618 -2884 -8088 -7143 -3730
10879 -3730 5156 -953 -3584 -1438 3697 6517 814 3470 15368 10434 -8629 -11098 -6969 -1799
10865 -1799 -2101 3719 2975 -4204 -1638 -10008 -14001 -13174 -16546 -20579 -18710 -9634 -7307 -928 4770
10850 4770 9649 1631 8511 2871 -2501 -3264 -11549 -15588 -9921 -6132 -1595 6247 7849 5343 -8618
10835 -8618 -10782 -12361 -16901 -26866 -35613 -25088 -14545 -16115 -18329 -10175 -10767 -8944 -3974 -34
10821 -34 14961 10616 8082 5874 5928 -2743 -11394 -16564 -9710 -60 -994 -8188 -17019 -22157 -24161 -26744
10805 -26744 -18395 -12312 -6653 -6998 -12280 -10368 -9278 -14305 -21563 -17582 -7391 -6836 -6802 2128 11485
10790A1485P921J2521l200j8806j0615l0M128L173k087R3k463k079m54l758N257
10775A086r447j4425J530J3103j684J55O212P598P434n249j335L999l750o576
10761a349R759j464o642L614n49r457K223o103m509Q358L68N05M618K792M941
10746G105n135L386k073q811o962n154N006N237n895m390m0oJ3773M311o98M850
10730D504K433o108l498J358k101L911P99k89N030J178J614p489j0514n532J5367
10715F63R322o377k586J494J1182j0371n30l525q918K174J0348R5M81p564j087
10700e199M423J169N181K066M47q713k522K660J1572p104o653N382l009K59L270
10685C229j943n603j337J221q750m887q23l315J848K250J0057K485L418J971L32
$$ plain form
10790 11485 19406 31927 28727 9921 -694 -724 3404 6577 4490 4583 2120 41 -413 -4171 1086
10775 1086 -8361 -22786 -21256 -8153 -9837 -9682 -3470 4128 11562 6313 4978 8977 5227 -1349
10761 -1349 8410 6946 304 3918 3369 -6088 -3865 -9968 -14477 -6119 -5751 -5246 -628 2164 7105
10746 7105 1970 5356 3283 -5528 -12490 -17644 -12638 -7401 -13296 -17686 -17726 -17732 -3959 352 -346 4504
10730 4504 6937 829 -2669 -1311 -3412 499 1298 1009 6039 7217 8831 1342 -9172 -14704 663
10715 663 9985 3608 1022 2516 13698 3327 2797 -728 -9646 -7472 2876 2971 3452 -4112 -5199
10700 -5199 -776 393 5574 7640 8087 -626 -3148 -488 11084 3980 -2673 2709 -300 -41 3229
10685 3229 1286 -4317 -5654 -4433 -13183 -18070 -18893 -22208 -20360 -18110 -8053 -5568 -2150 -179 153
10670A53o155o096N090O035J9319k485j308J732o202j60k712j0122j933J418J451
10655a975r647j1560K782N285J0468K247q167L577K509M695k054j075l3l913j147
10640h008L880N705L575o000m951n173k405R544K862p811j081L337l131o086m18
10625a6161P754K53l437J3752L7J1270J3011p864j2342q616J664M156Q75j295
10611C057j142m734O655J876r917K672P331L466M78k117P13j387L566o317l105
10596A095M812O10K600n78J111L430l701K661K377k514m494j648m965p483n507
10581a2194Q415J3801P609n104m535k19k078Q561J264j1721l775j878k365J887
10567b332l401o565L60j170K678J0768J1697M819m24l045j0014r668m377m187
$$ plain form
10670 153 -6002 -12098 -7008 -973 18346 15861 14553 16285 10083 9923 7211 -2911 -4844 -3426 -1975
10655 -1975 -11622 -23182 -20400 -15115 -4647 -2400 -10567 -6990 -4481 214 -1840 -2915 -2948 -6861 -8008
10640 -8008 -4128 1577 5152 -848 -5799 -10972 -13377 -3833 -971 -8782 -9863 -6526 -9657 -15743 -16161
10625 -16161 -8407 -8154 -11591 2161 2198 13468 26479 18615 6273 -2343 -679 3477 4352 3057
10611 3057 1915 -2819 3836 5712 -4205 -1533 5798 9264 9742 7625 8338 6951 10517 4200 1095
10596 1095 5907 6517 9117 8539 9650 13080 9379 12040 14417 11903 7409 5761 796 -6687 -12194
10581 -12194 -3779 10022 17631 12527 7992 7773 5695 14256 15520 3799 24 -1854 -4219 -2332
10567 -2332 -5733 -12298 -11938 -13108 -10430 338 12035 16854 16430 13385 3371 -6297 -10674 -14861
10553a4861l802L696M180M491q06m886K751M890J2432l925j474q522J067n554
10539a0323P413J9524l731q840j1138p548L522k332o515O03J3275n463P810M015
10525B72q3N504J5911l146j5822o690k075O79L15l156n591o831q93O520r513m391
10509b8990K154P501J3030J2915m907p970l81Q101L768J024p167l638r133L328
10495a0365J2053M990L880P94q34j387K856K720j740j615K563P324j389q618j1934
10480g02Q892l390n221p882r656N526Q370l112k071O640J2308N626n360n04o747
10465B717Q22o912l847o752p088J4261j816l945p32m637M173J1007m524J1188
10451C915P448l303m749r492n345K307Q020j322m960m43r23k501K868J650P082
$$ plain form
10553 -14861 -18663 -14967 -10787 -6296 -7102 -11988 -9237 -4347 8085 4160 2686 -5836 -4769 -10323
10539 -10323 -2910 16614 12883 4043 -7095 -14643 -11121 -13453 -19968 -19365 -6090 -11553 -3743 272
10525 272 189 5693 21604 18458 2636 -4054 -6129 -5450 -5135 -8291 -13882 -20713 -21606 -15086 -24599 -28990
10509 -28990 -26836 -19335 -6305 6610 1703 -6267 -6648 1453 5221 6245 -922 -4560 -13693 -10365
10495 -10365 1688 6678 10558 11352 10518 9131 11987 14707 12967 11352 13915 21239 19850 11232 -702
10480 -702 8190 4800 -421 -8303 -17959 -12433 -4063 -7175 -9246 -2606 9702 15328 9968 9464 2717
10465 2717 3539 -3373 -7220 -13972 -21060 -6799 -8615 -12560 -13292 -17929 -13756 -2749 -7273 3915
10451 3915 11363 8060 3311 -6181 -11526 -9219 -1199 -2521 -7481 -7924 -8847 -11348 -8480 -6830 252
10436B52K444m071o879q744j881R76J3311J072o209K872J091m736J081K21Q290
10421i10O438m262k449p845K299j704o706j012R619L767R713N071j0908L74L701
10406E186o492q860P437N237P460L511M789q051q706J47l147q83n13l461N762
10391e84N142Q889o55k050p057r605O265N152k930o768p846N336l267M801l312
10376h489K280R321M522l258M005M052L488J696j6996j3266j484R20P380l440
10362i269n545R07L796O462M359q304j536M917J1662J813j1227M964J853n841
10348i89O072O64j2816n750o360L985R230P427k109N515m078j591J083M523o417
10333a611l348N721J636Q888N009o134n559K169o302r016M517O464n734n585J0189
$$ plain form
10436 252 2696 -1375 -8254 -16998 -18879 -17903 -4592 -3520 -9729 -6857 -5766 -10502 -9421 -9200 -910
10421 -910 5528 1266 -1183 -9028 -6729 -8433 -15139 -16151 -6532 -2765 6948 12019 1111 1485 5186
10406 5186 -1306 -10166 -2729 2508 9968 13479 18268 10217 1511 1658 -1489 -2372 -2885 -6346 -584
10391 -584 4558 13447 12792 10742 3685 -5920 345 5497 2567 -4201 -12047 -6711 -9978 -5177 -8489
10376 -8489 -6209 3112 7634 4376 8381 12433 15921 17617 621 -12645 -14129 -13209 -5829 -9269
10362 -9269 -14814 -13907 -10111 -3649 710 -7594 -9130 -4213 7449 9262 -1965 2999 4852 -989
10348 -989 5083 5747 -7069 -12819 -19179 -15194 -5964 1463 -646 4869 791 -800 283 4806 -1611
10333 -1611 -4959 762 2398 11286 16295 10161 4602 6771 469 -8547 -4030 2434 -3300 -8885 1304
10318A304K722k536qj881o808J0103m291l675j124n337n86M571R855L965J342
10303G616n336M439o826l959j668M230N343k379J546j722Q33J0905R997j0087
10289A2932n144r28M165R432p52M833N107q976r839m595k381M115k062n508M44
10274H43K258l736J1O811J336n524L901P969P84j2702K015N786K017l601N330
10259A3498M871M343J004r750l535O512P047r120p132M60L726j0965l266j401
10245c708J825M95J5538P504k047n87O383m476o200K201j494l464p953Q6M29q737
10229d205N042q575p943J0640J58Q024P971m290K145K41j499O675k097k419p442
10214B426J385M398j2555k290J1553J455o546k701L373J0291r98R983J658j675
$$ plain form
10318 1304 4026 1490 1482 -399 -7207 2896 -1395 -5070 -6194 -11531 -12117 -7546 2309 6274 7616
10303 7616 2280 6719 -107 -4066 -5734 -1504 3839 1460 3006 1284 2117 13022 23019 12932
10289 12932 7788 6860 11025 20457 19705 24538 29645 20669 10830 6235 3854 7969 5907 399 843
10274 843 3101 -635 -624 6187 7523 1999 5900 13869 14653 1951 3966 9752 11769 8168 13498
10259 13498 18369 22712 23716 13966 10431 16943 23990 14870 7738 8198 11924 959 -2307 -3708
10245 -3708 -1883 -1388 14150 21654 19607 19020 25403 20927 14727 16928 15434 11970 4017 4103 4532 -4205
10229 -4205 837 -7738 -15681 -5041 -4883 3141 11112 6822 8967 9208 7709 14384 12287 9868 2426
10214 2426 3811 8209 -4346 -6636 4917 6372 -174 -2875 498 10789 9791 19774 21432 19757
10200A9757J730O756R197p081j1462j5423m698N49O161Q029P697O641J368m689
10186B4532m371o386Q81P197j317k866K837P062N358r427k378n72R26j225p870
10171A2381j205j832l764J1598L965j942j430K322k628n176m355M186J0013M922
10157B7055j620m548O907R757o433j8414k1Q698k438m051K339r75L331r830J294
10142A1051N365J0401J369j0024q461Q12Q229J926k198J349J2127P645q621k667
10128B8303L031P418o074j285j512j357R025J1406K397m843M658k098o493r575
10114C3001o561j607j154j812L720O499m006n905O574M316q275k373K399K504
10100B7320R855J2231P718n31m930p687p226r871K650J624j736Q490J0468O115
$$ plain form
10200 19757 21487 28243 37440 30359 18897 3474 -1224 -675 5486 13515 21212 27853 29221 24532
10186 24532 20161 13775 14656 21853 20536 17670 20507 27569 32927 23500 21122 20550 21476 20251 12381
10171 12381 11176 9344 5580 17178 21143 19201 17771 20093 17465 12289 7934 12120 22133 27055
10157 27055 25435 20887 27794 37551 31118 12704 12683 21381 18943 14892 17231 16256 19587 9757 11051
10142 11051 16416 26817 28186 18162 9701 10513 18742 20668 18470 19819 31946 39591 30970 28303
10128 28303 31334 38752 32678 31393 29881 28524 37549 48955 51352 46509 51167 49069 42576 33001
10114 33001 26440 24833 23679 21867 25587 32086 28080 22175 28749 33065 24790 22417 24816 27320
10100 27320 37175 49406 57124 56593 51663 43976 36750 26879 29529 31153 29417 37907 48375 54490
10086E4490j246M013L188m29n764K23n113n849n828q581l112J5255L463n1R996
10071E4655L044o568p980L88m765J530M80O326k30R44O106K716M196q23l293L808
10055F0534k925m594k508P895K2929M5374Q8824P4468k7337k7989l8024o4634
10043A32013l1917j7476j5395j2612j4438j369J0450P062m032l165j041m969J651
10030D4762o937k902R080K326r742j6569o951R974M713J397P01o310j201J0522
10016C2863j961M096J356p943M99o678l66k680l47k292K309Q36P449o440o081
10001A4620J1912R542j0256j0412O423R956L297l992j0226k729L0M170Q919N196
9987C6450j2203j8675p187N03J1910L774m143O475P17r05K562j0819O994Q410
$$ plain form
10086 54490 53244 57257 60445 60016 54252 54475 49362 43513 37685 29104 25992 41247 44710 44659 54655
10071 54655 57699 51131 43151 43539 38774 40304 40784 47110 46880 47824 53930 56646 60842 60019 56726 60534
10055 60534 57609 53015 50507 58402 81331 126705 215529 289997 262660 234671 196647 132013
10043 132013 100096 82620 67225 54613 40175 38806 49256 56318 52286 49121 48080 43111 44762
10030 44762 37825 34923 44003 46329 36587 20018 13067 23041 27754 29151 29852 23542 22341 32863
10016 32863 30902 34998 36354 28411 28910 22232 21866 19186 18839 16547 18856 19692 27141 20701 14620
10001 14620 26532 36074 25818 15406 21829 31785 35082 31090 20864 18135 18165 22335 31254 36450
9987 36450 24247 5572 -1615 -1112 10798 14572 10429 16904 17621 16716 19278 8459 15453 23863
9973B3863Q32N156L78k962K015N314J78n605q646m763J0791L032K301m479o008
9958B1397J0370k15p006j3165o794R30N929R766M688N228j471k19k250O084P51
9943C4023L315k273J4054l447o471N823r053q536L147n31N242K620m09r0n20O220
9927D3114N235J982n502j3953p434R586J1312N393Q496K683j307k384n770j7216
9913C4235k779O117K594J225O13j464J40R420M339j1629l850J630J3185O072j1132
9898D8716j1869K1779J2644J65o639J1602J985Q9l426K140r950j11O58l834K694
9883F6643q910L264L536k686L335P063n255L228m904N050N204N184J111k926P779
9868H6716J2423Q874q317J877k037K943q44j544M051k66n040M333J472Q536R724
$$ plain form
9973 23863 24695 29851 30229 27267 29282 34596 34774 29169 20523 15760 26551 29583 31884 27405 21397
9958 21397 31767 31552 24546 11381 4587 5517 11446 21212 25900 31128 29657 29438 27188 33272 34023
9943 34023 37338 35065 49119 45672 39201 45024 35971 27435 30582 30051 35293 37913 37504 37414 36894 43114
9927 43114 48349 50331 44829 30876 23442 33028 44340 49733 58229 60912 59605 57221 51451 34235
9913 34235 31456 37573 40167 41392 42005 40541 40681 50101 54440 42811 38961 40591 53776 59848 48716
9898 48716 36847 58626 71270 71435 64796 76398 78383 78472 75046 77186 67236 67125 67783 63949 66643
9883 66643 57733 60997 64533 61847 65182 72245 66990 70218 65314 70364 75568 80752 81863 78937 86716
9868 86716 99139 108013 99696 101573 99536 102479 101635 100091 104142 103876 98836 103169 104641 113177 122901
9853A22901M519J0473L2791N5730N1930K2729p903k9423l3578l2515l4741j1412
9841A51501K519j0261m096M416P885J092k168M206o859J182N696O689q45M588
9827A65545R580R378l560M01O340L355j99J5233J7536N568Q122J2023R469J6139
9813B74930J7193K3815K8654K2722K7143M0484L9976N4139O2278P7991P6570Q9405
9801H35300R9028R9101J16524J16385R8218R2612R5875P2742N8975M3980K4374
9790A753114J1101j6450k2041k6022l3747l6563k9899k879J9880M9373Q1040J02677
9778A849584J37719J58612J70224J85469J86042J70967J48557J24810J02904P1430
9768C306318M2941J3161l7608p3518j18448j40178j41404j36370j20392q5230
$$ plain form
9853 122901 127420 137893 170684 226414 278344 301073 293170 263747 230169 197654 162913 151501
9841 151501 154020 143759 139663 144079 151964 153056 150888 155094 148235 149417 155113 161802 160957 165545
9827 165545 175125 184503 180943 181344 187684 191039 190840 206073 223609 229177 237299 249322 258791 274930
9813 274930 292123 315938 344592 367314 394457 434941 474917 529056 591334 669325 745895 835300
9801 835300 934328 1033429 1149953 1266338 1364556 1457168 1553043 1625785 1684760 1728740 1753114
9790 1753114 1764215 1747765 1725724 1699702 1665955 1629392 1599493 1596614 1616494 1665867 1746907 1849584
9778 1849584 1987303 2145915 2316139 2501608 2687650 2858617 3007174 3131984 3234888 3306318
9768 3306318 3349259 3362420 3324812 3251294 3132846 2992668 2851264 2714894 2594502 2509272
9758B509272n5165j5271L2439O7715J07525J38015J48643J41499J28362J09769
9748C312803Q9068O5510M4758J1688k2132n7772r2084j04733j23001j33805j35499
9737B854801j20120p8964n2399j0620L7175P6561J10786J40211J59189J63774
9727C280394J38559J33920J23460Q8155O9834Q5087P1060N9467K8553J1701K1415
9716D111605L2829K2422K5160K6982M2019N1792O3866N7250N8475N7909N4032
9705D604341L2034Q809o699l9015n7081m3040l0861k7056J1495M7943Q2473J12548
9693D695891J49067J87193J92743J94567J84207J59796J11072O3365L4959M805
9683E977665l0933p5463j33080j69848k13246k44083k46888k17521j70497j07651
$$ plain form
9758 2509272 2454107 2438836 2471275 2538990 2646515 2784530 2933173 3074672 3203034 3312803
9748 3312803 3401871 3467381 3512139 3523827 3501695 3443923 3351839 3247106 3124105 2990300 2854801
9737 2854801 2734681 2655717 2603318 2592698 2629873 2706434 2817220 2957431 3116620 3280394
9727 3280394 3418953 3552873 3676333 3764488 3834322 3919409 3990469 4049936 4078489 4090190 4111605
9716 4111605 4144434 4166856 4192016 4218998 4261017 4312809 4376675 4433925 4492400 4550309 4604341
9705 4604341 4636375 4645184 4638485 4599470 4542389 4499349 4468488 4441432 4452927 4500870 4583343 4695891
9693 4695891 4844958 5032151 5224894 5419461 5603668 5763464 5874536 5937901 5972860 5977665
9683 5977665 5946732 5871269 5738189 5568341 5355095 5111012 4864124 4646603 4476106 4368455
9673D368455m4872L1260J06422J71023K15105K37908K35720K20864J77294J29250
9663E848429Q4390L8786j1502n6856r3954j55297k09476k38134k49006k47493
9653D709887k27802j82804j14544m9946L1946Q6705J41136J92728K17960K34946
9643E040212K18071J67260J10221N9142Q240m5917j00279j60646k07601k62300
9633D826403k93181l02437k89511k85121k59365k18666j74812j29783p8556l2360
9623B762611J1847L0869M2090N3025M7518L1638Q122k1887m9267p9054r4077j13216
9611B630219j35342j64498j71338j84376j86100j73131j59861j43395j34099j07311
9601A070768q5469r4409p3383n9015o9924o1313l9720l0421m9116k9554k7740
$$ plain form
9673 4368455 4323583 4354843 4461265 4632288 4847393 5085301 5321021 5541885 5719179 5848429
9663 5848429 5932819 5971605 5960103 5903247 5809293 5653996 5444520 5206386 4957380 4709887
9653 4709887 4482085 4299281 4184737 4134791 4166737 4253442 4394578 4587306 4805266 5040212
9643 5040212 5258283 5425543 5535764 5594906 5603146 5557229 5456950 5296304 5088703 4826403
9633 4826403 4533222 4230785 3941274 3656153 3396788 3178122 3003310 2873527 2794971 2762611
9623 2762611 2774458 2805327 2847417 2900442 2947960 2979598 2987720 2965833 2916566 2837512 2743435 2630219
9611 2630219 2494877 2330379 2159041 1974665 1788565 1615434 1455573 1312178 1178079 1070768
9601 1070768 985299 890890 817507 758492 688568 627255 587535 557114 507998 478444 450704
9590D50704k7441j7297j4180j3099j8163q045j3013p704p396j9743q445j7589
9578B78589q893j0212j3231K599L46n073j2503O064j0721j0620P882Q575m660
9565B28142r046r341J647M155K34j0537j4347j2230l994N756O401P701J1932k009
9551B04464p266L032O557N61r5L648j349m266Q779J1936N147k53K331O046J4383
9536B53655L024m700J0558Q777J1711K1512P476J2246J5348J3633J8997L3365
9524D05602L7434K9054L3550N1939M6424M9737O6032Q3031J04778J33564J54100
9513A195245J80829K11200K27982K60822K81402K95680K69754K08013J38228N4177
9503C323332l8390j17193j78907k11771k18552k12159j76299j60837j17341q6182
$$ plain form
9590 450704 423263 405966 391786 378687 360524 352479 339466 331762 324366 304623 296178 278589
9578 278589 269696 259484 246253 248852 249198 244125 231622 237686 226965 216345 224227 232802 228142
9565 228142 219096 209755 211402 215557 215791 205254 190907 178677 174683 180439 186840 194541 206473 204464
9551 204464 197198 200230 206787 207348 207253 210901 209552 205286 214065 226001 231148 230895 233226 239272 253655
9536 253655 256679 251979 262537 271314 283025 304537 312013 324259 339607 353240 372237 405602
9524 405602 443036 472090 505640 557579 604003 653740 719772 802803 907581 1041145 1195245
9513 1195245 1376074 1587274 1815256 2076078 2357480 2653160 2922914 3130927 3269155 3323332
9503 3323332 3284942 3167749 2988842 2777071 2558519 2346360 2170061 2009224 1891883 1805701
9493A805701m6372j7446J5875N1628Q8058J35800J70538K26406K58530K75815
9483B964533K72888K40981J77637J17532M7609l0935j09129j62722j95307k01537
9473C121550j96088j67420j23998p6835j8567L8577R4763J55389K15605K84826
9463C327802L46277L91647M39675M44339M28677L79356K90063J63517L0180r2858
9453F148675k08178k98163l58128l85572l72686l39348k89267k26566j66060r8287
9443C406420k6133M1983J22992K06226K86178L48296L87069M23489M24685L91104
9433F012309L21201K40571J35791L4741n7874j49837k16539k46451k61233k62209
9423E550470k51362k26763k02500j89538j86527j67841j42781j20453p9385m4742
$$ plain form
9493 1805701 1759329 1741883 1757758 1809386 1897444 2033244 2203782 2430188 2688718 2964533
9483 2964533 3237421 3478402 3656039 3773571 3821180 3790245 3681116 3518394 3323087 3121550
9473 3121550 2925462 2758042 2634044 2557209 2538642 2577219 2671982 2827371 3042976 3327802
9463 3327802 3674079 4065726 4505401 4949740 5378417 5757773 6047836 6211353 6241533 6148675
9453 6148675 5940497 5642334 5284206 4898634 4525948 4186600 3897333 3670767 3504707 3406420
9443 3406420 3380287 3422270 3545262 3751488 4037666 4385962 4773031 5196520 5621205 6012309
9433 6012309 6333510 6574081 6709872 6744613 6686739 6536902 6320363 6073912 5812679 5550470
9423 5550470 5299108 5072345 4869845 4680307 4493780 4325939 4183158 4062705 3983320 3938578
9413C938578O154O7246J10683J23123J10435Q6301L8166j8987o8309j08713j28775
9402D155902j35218j02984o4162m5811k9505j7122r667q430k1085l8900l3797
9391C649221k6013j3232K6173P4564J12903J45353J69217J61928J37873J12721
9381D550708Q7939M3683L9993L5060J0547J5996J0312J0391K319m3573p3042j22545
9369D567788j79300k34823k72579k89940k96648k79435k41814k15515j70511j33392
9359B253831o9434k4676K1637N8339J03763J51531J84610J97921K11303K11603
9349C300428J97221J60429R2758K9756n2869j09527j70891k13969k18594j99175
9339B815567j76410j34267p2458k3229Q404L5976O0647O8540O9275N6028K9166
$$ plain form
9413 3938578 3944732 4011978 4122661 4245784 4356219 4442520 4480686 4461699 4393390 4284677 4155902
9402 4155902 4020684 3917700 3853538 3807727 3778222 3761100 3751433 3743003 3721918 3683018 3649221
9391 3649221 3623208 3609976 3636149 3710713 3823616 3968969 4138186 4300114 4437987 4550708
9381 4550708 4638647 4682330 4722323 4757383 4767930 4783926 4794238 4804629 4806948 4763375 4690333 4567788
9369 4567788 4388488 4153665 3881086 3591146 3294498 3015063 2773249 2557734 2387223 2253831
9359 2253831 2184397 2159721 2181358 2239697 2343460 2494991 2679601 2877522 3088825 3300428
9349 3300428 3497649 3658078 3750836 3780592 3727723 3618196 3447305 3233336 3014742 2815567
9339 2815567 2639157 2504890 2432432 2409203 2417607 2453583 2514230 2582770 2652045 2708073 2737239
9328B737239K7297J7905R043j6849m1495n8941q0031j02677j28536j48867j71708
9317B042380j94815j67169j56757j30240j00870q6527n8442l9154k5452q18K4473
9306A106609N4733P9046R8507J07821J18090J22233J20410Q8460M4911L224n0943
9295A893101r8237j24050j52912j63705j59021j33905j29270j08579r1279p1525
9285F60618n7033m3502m5355m0475k1658j8433k8399k3302j9688j6660j8483j4002
9273C13628j3374j4321n215p457Q23p067r762j5832n959k353J0216q455o139J195
9259B29928l449j1261j6225l388J8193L333k830N796P013Q772J3812Q317R766
9246B67777O959j3642m3744l6886l0020k9171k3240m074J0506L717Q763J2307
$$ plain form
9328 2737239 2764536 2782441 2791484 2774635 2733140 2674199 2594168 2491491 2362955 2214088 2042380
9317 2042380 1847565 1680396 1523639 1393399 1292529 1206002 1147560 1108406 1082954 1082136 1106609
9306 1106609 1161342 1240388 1338895 1446716 1564806 1687039 1807449 1895909 1940820 1944044 1893101
9295 1893101 1794864 1670814 1517902 1354197 1195176 1061271 932001 823422 732143 660618
9285 660618 603585 560083 514728 474253 452595 434162 405763 382461 362773 346113 327630 313628
9273 313628 300254 285933 280718 273261 274084 267017 257255 241423 235464 233111 243327 234872 228733 229928
9259 229928 226479 215218 198993 195605 213798 217131 214301 220097 227110 235882 249694 258011 267777
9246 267777 274736 261094 217350 180464 150444 121273 98033 93959 104465 108182 116945 129252
9234A29252O636J3301J9026J6898O340k129J3920J9522J0916N412k856j631J1873
9221B46480J0597L1357K8682J8565J3354K4385K6895J6548K6378L7904L5185M8374
9209E64704N7484N8289O7945P1906Q0636Q7547R5389J00268J02578O4590L8449
9198A389785J6759m258l5528n9771p4872o8861p4025n6191o8428p4815o6501n7429
9186G65865o0235o1282m7584m3738l9953l2519k8286l0960l8803l2788k5856k7854
9174B96007k6704k7012k1624j6151p306j1013M768k082r161j2638o57J6159R266
9161A91852J1296j268q517j3215j0209j6546k712r38K459N847P013M014P990L913
9147A80979J62P077J0694O546p951p345m551J8788K3085R516k607L9915M5954
$$ plain form
9234 129252 135888 149189 168215 185113 191453 189324 203244 222766 233682 239094 236238 234607 246480
9221 246480 257077 288434 317116 335681 349035 373420 400315 416863 443241 481145 516330 564704
9209 564704 622188 680477 748422 820328 900964 988511 1083900 1184168 1286746 1351336 1389785
9198 1389785 1406544 1402286 1366758 1306987 1232115 1163254 1089229 1033038 964610 889795 823294 765865
9186 765865 705630 644348 596764 553026 513073 480554 452268 421308 382505 349717 323861 296007
9174 296007 269303 242291 220667 204516 197210 186197 190965 188883 179722 167084 166427 182586 191852
9161 191852 203148 201880 193363 180148 169939 153393 150681 149743 152202 158049 165062 169076 177066 180979
9147 180979 181141 188218 198912 205458 197507 190162 185611 204399 227484 237000 234393 274308 320262
9134C20262L9533K2841M825m778j3035k8585k8248k6769l0235k7569o4825r2783
9122G0634p8859n9199l4830p59Q163l464R189K4067K7797K6920K2955O216l159
9109A5671j6612k3907N73R128q388k126m371K301K842j0316o743N102l831K305
9095c8372P764o689k8605n1693p7659o1305j9870L5516M4872O2195P6202M6358
9083a1286J8269N377J6166J2175J0056J2939L326K60J0496L189J05M953M658J7347
9069A08030M701r485k2342k1127l480N510k1358k7367J2066L9205L3607J8914
9057A16874J6450K5066L4793K2996J8689M520J8496J7333o01K479P005k334j3205
9044B68561j9609j0510o365k472q779l308O569K5908J6957P83J832M649J889j0182
$$ plain form
9134 320262 359795 382636 387461 382683 369648 341063 312815 286046 255811 228242 163417 70634
9122 70634 -8225 -67424 -102254 -103013 -94850 -98314 -89125 -65058 -37261 -10341 12614 18830 15671
9109 15671 -941 -24848 -24275 -15147 -23535 -25661 -30032 -27731 -24889 -35205 -41948 -36846 -40677 -38372
9095 -38372 -30608 -37297 -65902 -117595 -195254 -256559 -276429 -240913 -196041 -133846 -57644 -11286
9083 -11286 6983 12360 28526 40701 50757 63696 67022 67282 77778 80967 81072 86025 90683 108030
9069 108030 112731 103246 80904 59777 56297 61807 40449 13082 25148 64353 97960 116874
9057 116874 133324 158390 193183 216179 234868 239388 257884 275217 274616 277095 284100 281766 268561
9044 268561 248952 238442 232077 229605 220826 217518 224087 249995 266952 267735 269567 274216 276105 265923
9030B65923j3869j2224k89J1801J6939O672O027j982J1953J3601K200n202K797
9017C04347Q578J4701K1791M454r036n557j0809p613Q464K5493L8691J6044J4103
9004D23651K0247P924J3459J7814P535p926K607J8011K1499L413Q471K6688Q202
8991E71595N942K5081L2158L7916L4847M8961N5426M6752N9079P5000P7550P2773
8979A143080L9646J5217J2414K4689L7797M7852M4024N1130O1899Q0763J00165
8968A658676J08859J21914J59265J69066J70248J63400J52223J46272J50923J96102
8958C196948K40657K92936L67739M73989O12013P53890Q72433J020737J250417
8949I081759J518361J798355K147071K533318K731235K817250L239903M186062
$$ plain form
9030 265923 252054 239830 239541 251342 268281 274953 280980 278998 290951 304552 306752 301550 304347
9017 304347 312925 327626 349417 353871 344835 339278 328469 320856 329320 354813 393504 409548 423651
9004 423651 443898 451822 465281 483095 490630 482704 485311 503322 524821 528234 536705 563393 571595
8991 571595 577537 602618 634776 672692 707539 756500 811926 858678 917757 992757 1070307 1143080
8979 1143080 1182726 1197943 1210357 1235046 1272843 1320695 1364719 1415849 1477748 1558511 1658676
8968 1658676 1767535 1889449 2048714 2217780 2388028 2551428 2703651 2849923 3000846 3196948
8958 3196948 3437605 3730541 4098280 4572269 5184282 5938172 6810605 7831342 9081759
8949 9081759 10600120 12398475 14545546 17078864 19810099 22627349 25867252 30053314
8941C0053314N820343Q646832J3268110K0663502L3251156N3987878P9869481
8934B45560616Q2117574K8526357k4964408m7108200o3558693o3651405m6612898
8927A10308943l0034709j9251288j2780172q805299o136437m259053l040557k372862
8919B3628566k228170k246862k171949k079267j853972j521813j208486r73819
8911I344228p92687o74419o14923n45808m95732m51843m09008m00863l85132l52733
8901D221080l01066k59615k44140k40636k20616k10908j84237j78858j74316j53488
8891B053200j41144j37394j42557j30976j28068r4199n5547l0316k6151r270j3364
8880A144214k0841l1089l7959l2389k5090k5322l3879m6096m2677k5299j8644
$$ plain form
8941 30053314 35873657 44520489 57788599 78452101 111703257 165691135 245560616
8934 245560616 327678190 356204547 331240139 284131939 220573246 156921841 110308943
8927 110308943 80274234 61022946 48242774 39437475 33301038 29041985 26001428 23628566
8919 23628566 21400396 19153534 16981585 14902318 13048346 11526533 10318047 9344228
8911 9344228 8551541 7877122 7262199 6716391 6220659 5768816 5359808 4958945 4573813 4221080
8901 4221080 3920014 3660399 3416259 3175623 2955007 2744099 2559862 2381004 2206688 2053200
8891 2053200 1912056 1774662 1632105 1501129 1373061 1278862 1223315 1192999 1166848 1157578 1144214
8880 1144214 1123373 1092284 1054325 1021936 996846 971524 937645 891549 848872 823573 804929
8869H04929l5566l3400k3283j6882k7118k8685j8749j1356j5959j1453r818q429
8857E64231O12r923j2520j8855k8179j7270o756J327q773l926j5019k4546j6917
8844D03486m565P096m475r231l639k071k984j5707j9549j9357j1883j7536j2292
8831B87293J72j715J891J1790J1306o143p62o312k7549k8443j7127k6742k2594
8818A75065m58n845P056n833j1370J5780J9707J5703J7377K9000K0812L6086N1373
8805C64453J9025n526j9953k8350k3520j6789j6909k1785j7964j1831j862P165
8793B26154J2842O564p550j2865j129L968Q939P43Q003J5729J6843J5762K0267
8780C14270M5886Q0244Q6064L3011p858l9284o1222o2734m3320k1945j3773j0472
$$ plain form
8869 804929 769363 735963 712680 695798 668680 639995 621246 609890 593931 582478 572660 564231
8857 564231 564843 554920 542400 523545 495366 478096 471340 472667 463894 459968 444949 420403 403486
8844 403486 398921 406017 401542 392311 388672 386601 383617 367910 348361 329004 317121 299585 287293
8831 287293 287465 285750 287641 299431 310737 304594 303832 297520 269971 241528 224401 197659 175065
8818 175065 174607 168762 175818 169985 158615 174395 194102 209805 227182 256182 276994 313080 364453
8805 364453 383478 377952 357999 329649 306129 289340 272431 250646 232682 220851 218989 226154
8793 226154 238996 245560 238010 225145 224016 227984 236923 237666 245669 261398 278241 294003 314270
8780 314270 360156 440400 526464 559475 551617 512333 451111 388377 345057 323112 309339 298867
8768B98867O775j3907k4913q029o76r40j2922r30k095M96n875l579j1415n170
8754B15687O666J0394J9263K0534J8152J2082J1376J4006R964j7371m2767q0908
8742A97078p5485n1302m9518l9268m4339k8920k5918l3546k8932K330K1546M3205
8730a13069K9206K7008L0749K0136P939r86J0149J7532R712P318k962p70M691
8717D6653Q267J4312K2705K5304L1365K5356P878r957j5273k4393j2264j1959
8705A07994k2017k978M861J1047P994n44J2693J7416K428j7541q379M22n70l089
8691A09737q745P600o58k139o831l591N345P84K594K164l914m920L420j0067K715
8676I3494J5128K6231K8201K7836K1402R55j260p162l1061j6835l960m120q579
$$ plain form
8768 298867 305642 291735 266822 258793 258117 257177 244255 243325 241230 241726 235851 232272 220857 215687
8754 215687 222353 232747 252010 272544 290696 302778 314154 328160 338124 320753 277986 197078
8742 197078 121593 70291 20773 -18495 -62834 -91754 -117672 -151218 -180150 -177820 -156274 -113069
8730 -113069 -83863 -56855 -26106 -5970 1969 983 11132 28664 38376 45694 42732 41962 46653
8717 46653 54920 69232 91937 117241 148606 173962 181840 171883 156610 132217 119953 107994
8705 107994 85977 82999 87860 98907 106901 106357 119050 136466 138894 121353 112974 113396 112826 109737
8691 109737 100992 108592 107934 105795 98964 95373 100718 101502 104096 106260 102346 97426 100846 90779 93494
8676 93494 108622 134853 163054 190890 212292 213247 211987 204825 173764 156929 152969 148849 140270
8663A40270r247o989j586Q852J627l038R14l992j4313q321l217L681P664Q823
8649A21128P250J6489K4148O00N727j0139j5896q359j1778P05k116N32j133J1299
8635A38457O447R447J4229J4503K2426J1102R120K480Q808q049j1538n310k7367
8622A84755l4266j6503l373k212j806O000P334J281J2335R084J10Q63j292k073
8608A60237L363P447J3721R311Q746K0651L3813R743p274l419k3054j3488J3777
8595B33574J6112J4699P494j0161m908j0368j3043j9090j4317j1245K359n741
8583A85365j1728j2553j0957p615j5363K779L00J939N377r526n969r777p259J1450
8569A16463P738J0340J666J2351L1471M2755O1791N4137P444j8263k2055l1395
$$ plain form
8663 140270 131023 124034 122448 131300 132927 129889 130803 126811 112498 104177 100960 104641 112305 121128
8649 121128 128378 144867 169015 169615 175342 165203 149307 140948 129170 129875 127759 128291 127158 138457
8635 138457 144904 154351 168580 183083 205509 216611 225731 228211 237019 228970 217432 212122 184755
8622 184755 150489 133986 130613 128401 126595 132595 139929 141210 153545 162629 162739 163602 162310 160237
8608 160237 163600 171047 184768 194079 202825 223476 257289 267032 259758 256339 233285 219797 233574
8595 233574 249686 264385 271879 261718 256810 246442 233399 214309 199992 188747 191106 185365
8583 185365 173637 161084 150127 142512 127149 129928 130228 132167 137544 128018 122049 112272 105013 116463
8569 116463 124201 134541 136207 148558 180029 222784 284575 338712 346156 327893 305838 274443
8557B74443k3428k2992j9956j6365j2203j5330q566o616j6650J050O554N179M659
8544A49779J3603N887J9846L1938M4892L3559M6674P5576Q5245J04923J23128
8533G35050J38869J22097J03907O7756K7631j2307m5035o8198p0320o6975o6462
8522H66013q4993j06251j09322j05896r4248o4869m2752k4724l4012l6049k6849
8511A36048j2922p621l317q549p190j165j746j2392j0317q09q521j3418J2520
8498F0601j567q299N481k538L01L2p383m125j572m166k072L057j401l659J770
8483C4460Q699P473J900p139J477J1115l198j0680j0213k408J04k224L203N162
8469C7731l887k168r7p766l053L445N71K132l022l271p20L958L422O92N246Q663
$$ plain form
8557 274443 251015 228023 208067 191702 179499 164169 155603 148987 132337 133387 139941 145120 149779
8544 149779 163382 169269 189115 221053 265945 299504 346178 421754 506999 611922 735050
8533 735050 873919 996016 1099923 1167679 1195310 1183003 1137968 1069770 999450 932475 866013
8522 866013 781020 674769 565447 459551 365303 300434 257682 232958 198946 162897 136048
8511 136048 123126 115505 112188 103639 96449 95284 93538 81146 70829 70020 61499 48081 60601
8498 60601 59034 50735 56216 53678 53979 54011 46628 42503 40931 36765 34693 37750 36349 32690 34460
8483 34460 43159 50632 52532 45393 46870 57985 54787 44107 33894 31486 31590 29366 32569 37731
8469 37731 33844 31676 31579 23813 20760 24205 24776 26908 23886 20615 19895 23853 27275 27967 33213 41876
8453D1876j585j444l191K953O410n125m093m43P299n563j442J566jm927j144N145
8437C6291M165j487n35O17o996j0813N00M543k211p35r43q775J306N632M693R71
8421B6223n958k527o80K380P479M530j594J576R931J852l557L276J277j3332m070
8406B6806m061n940M101J0505n332j1096k992q504k073Q285K320k259K550R785
8392B2095L152m321Q40J0877l811m57N31J453J2508L399p88K847P485j1755j4894
8377B9161J926R685m160n503K503k794K339l071J459K288o136n146n269K098J0465
8362B9845M624p070o854j729k293L969k230J564k879k357P63j577j0569l757J782
8347A232L89Q907J0442m41o910p510O422R852m795k036J1628l595O65m328j113
$$ plain form
8453 41876 40291 38847 35656 38609 45019 39894 35801 35358 42657 37094 35652 37218 37217 32290 31146 36291
8437 36291 40456 38969 38434 39051 32055 21242 21742 26285 24074 23339 22396 13621 14927 20559 25252 26223
8421 26223 20265 17738 17058 19438 26917 31447 29853 31429 41360 43212 39655 42931 44208 30876 26806
8406 26806 22745 16805 20906 31411 26079 14983 11991 3487 1414 9699 12019 9760 12310 22095
8392 22095 25247 20926 21766 32643 28832 28375 28906 30359 42867 46266 45478 48325 55810 44055 29161
8377 29161 31087 40772 36612 31109 33612 30818 33157 30086 31545 33833 27697 22551 17282 19380 29845
8362 29845 34469 27399 20545 18816 16523 20492 18262 19826 16947 14590 15353 13776 3207 -550 1232
8347 1232 1621 10528 20970 20529 13619 6109 12531 22383 17588 15552 27180 23585 24250 19922 18809
8332A8809J857K222q080o207j1184q55J749R268P046n549o904j0538m77J8130
8318I287J3412m348q736J461J0776j862o900M438J1694k053o099J107o623j1315
8304D239m451M822J278J632k289R3L450q142k816J2189R588m22J217q411L312
8289A5289j646j0392L143J0920j056j0765r0O543o88l292N663K602m42j664k760
8274A1365P54k184j1849R694R780n684k733O665N46p559k968L917N28j981R862
8259A8153k936j0264k173m011M828N352j371J62L564K718j541Q65k541J497O52
8244A2954m023o901o298k422O011N626Q774l709j1236k877N37Q360J825l675L793
8229F739n928J892P121k567K907K189l084J462N487j394r577k784L051K605j739
$$ plain form
8332 18809 20666 22888 14808 8601 -2583 -3438 -1689 7579 14625 9076 2172 -8366 -8843 9287
8318 9287 22699 18351 9615 11076 21852 19990 13090 17528 29222 27169 21070 22177 15554 4239
8304 4239 -212 4610 5888 7520 5231 5324 8774 632 -2184 10005 19593 19171 20388 11977 15289
8289 15289 13643 3251 6394 17314 16258 5493 5403 11946 11258 7966 13629 16231 15789 14125 11365
8274 11365 12119 9935 -1914 7780 17560 11876 9143 15808 16354 8795 5827 9744 10272 8291 18153
8259 18153 15217 4953 2780 -1231 3597 8949 7578 7740 11304 14022 12481 13346 10805 12302 12954
8244 12954 8931 2030 -4268 -6690 -679 4947 13721 10012 -1224 -4101 -3564 4796 6621 2946 6739
8229 6739 811 2703 9824 7257 10164 12353 9269 10731 16218 14824 5247 2463 5514 8119 6380
8214F380l486q094j0677R211J1558N957J37J026o709K060Q87Q785n083J452K795
8199A6199M149j419n039L088j341Q49p833p917j28j3906J520L586K771L957P290
8184E826k31L811K673O63J630o894L546M925q56k604j0039j9652m96Q477O837
8169b384L301R392L465o710L14J575m556m857J2659J1432m574l595o963j460j3322
8154f283J580J2024P414Q793j148j3504L746R263n362n752J323k757j4513K750
8140b426M138l588L319l991j2500Q561J1345l269O342M682O214q764r453J785
8126B395k009P701J0705o415n932L129P98R47K345L59j119j0587N172M10j5386
8111g487p00m140P492M806J1490N687m085n971o525k740M964k423m98J0037p32
$$ plain form
8214 6380 2894 -5200 -15877 -6666 4892 10849 10986 12012 5303 7363 8250 17035 11952 13404 16199
8199 16199 20348 18929 13890 16978 15637 16486 8653 736 608 -13298 -11778 -8192 -5421 -1464 5826
8184 5826 5595 9406 12079 12742 14372 7478 11024 15949 15093 12489 2450 -17202 -17698 -9221 -2384
8169 -2384 917 10309 13774 7064 7378 8953 4397 -460 12199 23631 19057 15462 8499 7039 -6283
8154 -6283 -4703 7321 14735 23528 22380 8876 12622 21885 16523 10771 12094 9337 -5176 -2426
8140 -2426 1712 -1876 1443 -2548 -15048 -6487 4858 1589 7931 12613 18827 10063 610 2395
8126 2395 386 8087 18792 12377 6445 9574 10372 11319 13664 14023 12904 2317 7489 7899 -7487
8111 -7487 -8187 -12327 -4835 -29 11461 17148 13063 7092 567 -2173 2791 368 -130 9907 9175
8096I175n437J066j324p4k036L394k788M808j412O91k477K48r35K483R0n415k23
8079a66N043J3196m039P649J635p64J0907K276j4787N158J168m382l648k401K20
8064A7065k659j1227m108L546R844k302j2909p02J134P824J0361k090q062m813
8050I02N087O804J3875L603J449M079q033k320R724M955l839n519R958J4693m027
8035E1391n815m296J373p226p491j2649k44J5063m797j612R000J3053j05o844
8021C8801J900L46o48n561n505Q565O456R992j232m268K802M555K1001R807J3988
8006A00999K0838L127j751j683m977j9622j2342j0010k674O878K1700K9865L5431
7993A65779L0315k201k5866l5450l6692k2092j3368p055j685l337j1849q720k119
$$ plain form
8096 9175 3738 4804 3480 3406 1370 4764 1976 6784 5372 6063 3586 3834 2899 5382 5472 57 -166
8079 -166 4877 18073 14034 21683 23318 22554 33461 35737 20950 26108 27276 22894 19246 16845 17065
8064 17065 14406 3179 -929 2617 12461 10159 -2750 -3452 -2318 5506 15867 13777 5715 902
8050 902 5989 12793 26668 30271 31720 35799 27766 25446 35170 40125 36286 30767 40725 55418 51391
8035 51391 45576 41280 42653 35427 27936 15287 15043 30106 25309 23697 32697 45750 45645 38801
8021 38801 40701 41047 40399 34838 29333 37898 44354 54346 53114 48846 51648 56203 77204 87011 100999
8006 100999 121837 124964 123213 121530 116553 96931 84589 74579 71905 78783 100483 130348 165779
7993 165779 196094 193893 168027 132577 95885 73793 60425 53370 51685 48348 36499 27779 25660
7980B5660P97j443L559n039l004J0418R228J0336j374p681l096J1624J0503l791
7966E6697J667J3262J3150J7788K3090J4790J4410K0023j913j5557j0308K186
7954A49285M66K1321K5968Q339p465j4566k6042k9053k7506j4531j1526j8306
7942E6384o974q731j2525j994M31j004Q825J444q805o898J5079R57m975j0081
7928B1133j581Q810J3921M364Q493J0644J2122J4977O427O1n415j1275j4184l178
7914F5319l334J115k049K133J061J754n707j0781k1458r410L082q837J390k783
7900A1495P54R465j2413r539J744P674L91N920N357J400j1327j402K345j4171
7886b307j397N234P514M08N98l21m727j353O404J0127J873L323L583l556p267
$$ plain form
7980 25660 26457 25014 28573 23534 20530 30948 40176 50512 49138 41457 38361 49985 60488 56697
7966 56697 58364 71626 84776 102564 125654 140444 154854 174877 172964 157407 147099 149285
7954 149285 149751 171072 197040 205379 197914 183348 157306 128253 100747 86216 74690 56384
7942 56384 49410 40679 28154 26160 26591 25587 34412 35856 27051 20153 35232 36189 31214 21133
7928 21133 19552 28362 42283 46647 55140 65784 77906 92883 99310 99371 93956 82681 68497 65319
7914 65319 61985 63100 61051 63184 64245 65999 60292 49511 28053 18643 21725 12888 14278 11495
7900 11495 12249 21714 9301 -238 1506 9180 9571 15491 20848 22248 10921 9519 11864 -2307
7886 -2307 -3704 1530 9044 9452 10050 9729 5002 3649 10053 20180 22053 25376 28959 25403 18136
7871A8136k298l145N291N489q53r507r613q388o794O507O831j862N748Q716j433
7856A2825l959l805L827M798J774l982L088M750k923l485M301k27j740q25l820
7841A0597p381m005K566j457J933L199J46N685K898o035K79j790n70Q589P745
7826B2399m636r534m326P139j198n805L598R21l711m502J037O34p09N821O500
7811A3628l73J1156N684n681r770j765n497j1990n768P729J0521p3R166k126l466
7796A1375n751l743p13P81K941P18l766j1735%P535l538R26N913m962K526J667
7780A74J1754p616j6554k936o15l354P165J1179J822L001Q530p27L673K290j4662
7765C124M147Q23l507n771n36P110N906j4901r283n314M083O160q771P269J0571
$$ plain form
7871 18136 15838 12693 17984 23473 22620 13113 3500 -4888 -11682 -5175 1656 -206 5542 14258 12825
7856 12825 8866 5061 8888 13686 15460 11478 14566 19316 16393 12908 17209 16982 15242 14417 10597
7841 10597 3216 -789 1777 320 2253 5452 5598 11283 14181 8146 8425 6635 6065 14654 22399
7826 22399 17763 8229 3903 11042 9844 4039 7637 8558 4847 345 1382 2016 1307 7128 13628
7811 13628 13255 24411 30095 24414 14644 12879 7382 -4608 -10376 -2647 7874 7801 16967 14841 11375
7796 11375 5624 1881 1168 1949 4890 5608 1842 -9893 -9893 -2358 -5896 -4970 943 -4019 -1493 174
7780 174 11928 4312 -12242 -15178 -15793 -19147 -11982 -803 1019 4020 12550 11823 15496 17786 3124
7765 3124 7271 8094 4587 -1184 -1720 5390 11296 -3605 -12888 -18202 -14119 -7959 -16730 -9461 1110
7750A110j922l867K261J171L776M519m285r722j17L361J513m069j1302q382M016
7735b1939J596L318J2373J8354P430L43j2448j7091l792O043K33l338k43J202
7721g959k177m692K890L800K786m071J381j304K324M035k598J0495k110q116L000
7706b316N847K145n470n996J239N108J971R294k334n415L587o343j540R060m999
7691C838j233o698L475q553m027M95J4826J0735k10o032l235l872r833P575j147
7676c896K536n560n125j612j164Q412R574N094j715k288m562j4696o347N096R379
7661f874J875L690Q568o567j0088Q4R788K032P562K252j1539R630J0269j0331
7647A0351j8130p023q367M949L179O363k939j804O228R938M639K160l523n29o021
$$ plain form
7750 1110 -812 -4679 -2418 -1247 2529 7048 2763 -6959 -7076 -3715 -2202 -6271 -17573 -25955 -21939
7735 -21939 -20343 -17025 -4652 13702 21132 21475 9027 -8064 -11856 -5813 -5580 -8918 -9161 -7959
7721 -7959 -10136 -14828 -11938 -8138 -5352 -9423 -8042 -9346 -7022 -2987 -5585 4910 2800 -5316 -2316
7706 -2316 3531 5676 206 -5790 -4551 557 2528 11822 9488 4073 7660 1317 -223 8837 3838
7691 3838 2605 -4093 -618 -9171 -13198 -12703 2123 12858 12648 6616 3381 -491 -10324 -2749 -3896
7676 -3896 -1360 -6920 -12045 -13657 -14821 -6409 3165 8259 6544 4256 -306 -15002 -21349 -16253 -6874
7661 -6874 -4999 -1309 7259 692 -9396 -9312 476 2508 10070 12322 783 10413 20682 10351
7647 10351 -7779 -14802 -23169 -18220 -15041 -8678 -11617 -13421 -7193 2745 7384 9544 6021 5492 -529
7632e29M457m201r056J284n887k739K706Q011J6321m292p756jo887K6J0554K291
7616D302p571j802j472j174J2964r327K116M094j719J0217Q805j551K154k608
7602A7428n264p493q371P649J3148P563j3760k988P2k435j953q129r4R468N220
7587A0061J581K827p176o128N462k797j2568K41O341K99M242O122n150q259K191
7572b711L660O955k937n083Q916q73l313K327J225l86n686M569j804l83l927j085
7556e36p799k950J0089J2298Q324n431r261L394O432M540k827m186o61j214N220
7541A5432L660m542r573J822N54j442K310N260m30M505j041L989K66q320p654
7526D796l813N857q768j1972M975Q966L121L174J447M038N490n930j0281q025
$$ plain form
7632 -529 3928 -273 -9329 -8045 -13932 -16671 -13965 -5954 10367 6075 -1681 -1682 -8569 -8543 2011 4302
7616 4302 -3269 -5071 -6543 -7717 5247 -4080 -1964 2130 411 10628 19433 17882 20036 17428
7602 17428 12164 4671 -3700 3949 17097 24660 10900 7912 7984 5549 3596 -4533 -4627 4841 10061
7587 10061 11642 14469 7293 1165 6627 3830 -8738 -8497 -2156 -1857 2385 8507 3357 -4902 -2711
7572 -2711 949 7904 4967 -116 8800 7927 4614 6941 8166 7780 2094 6663 4859 4476 549 -536
7556 -536 -8335 -11285 -1196 11102 19426 13995 4734 8128 14560 19100 16273 12087 11426 10212 15432
7541 15432 19092 14550 4977 6799 7353 5911 8221 13481 13051 17556 16515 20504 20770 12450 4796
7526 4796 983 6840 -1928 -13900 -8925 41 3162 6336 7783 11821 17311 11381 1100 -6925
7512f925M223j066j0988l031p85N287J670J0402n801p303R261J2016P840L078
7498A7878j1376r213L027O275j087o261j617K474Q631J0793q06q715p682r144
7484f823K282k263r78K982K122J2332j361j3670P465P407O744L93o099l240j1712
7469d419k603J2886K362j6347r289K477N956J2366R331m509Q6j1019p492J2530
7455B316L107k260p53n301P854M427J737l70m354n597N392R618n19o045j915J466
7439H803j223j435j302P137J893P242K652q61p259m562k443l208m274L203n053
7424f90m595Q652m990j810O170R355K915j2483l055M38L252m177J941J781j557
7409A147N026L560m238j758L553O08n388j2515Q09J4455j685K756k440r16M483
$$ plain form
7512 -6925 -2702 -3768 -14756 -17787 -18572 -13285 -11615 -1213 -7014 -14317 -5056 6960 14800 17878
7498 17878 6502 -2711 316 6591 5504 -757 -2374 100 8731 19524 18718 10003 2321 -6823
7484 -6823 -4541 -6804 -7782 -4800 -2678 9654 8293 -5377 2088 9495 16239 16632 10533 7293 -4419
7469 -4419 -7022 5864 8226 -8121 -17410 -14933 -8977 3389 12720 8211 8297 -2722 -10214 2316
7455 2316 5423 3163 2410 -2891 4963 9390 11127 10757 6403 806 6198 15816 15297 9252 7337 8803
7439 8803 7580 6145 4843 11980 13873 21115 23767 22906 15647 11085 8642 5434 1160 4363 -690
7424 -690 -5285 3367 -1623 -3433 2737 12092 15007 2524 -531 -93 3159 -1018 923 2704 1147
7409 1147 6173 9733 5495 3737 7290 7898 2510 -10005 -9196 5259 3574 6330 3890 2974 7457
7394G457o737n48N259k595n071K329j207r33J2458m735J076m229J74k066l295
7379b663q265m329J0727P503J460l879L208m294l39q201m849K942K793J036Q835
7364A685K001l3J723p93l608L919O479m994r162o658J282l126q390Q053n31O32
7348a1521l044R156N476P15l009M858l18j320m369OL716M566J0499q98j5108j4321
7332a4916q99O767n43R623O91L903L602k209j5149q227N750L022J0311N742N615
7317A3083j0881J870P498p284q897M122J6105J2820o040n243j2576j4258q831
7304a8512M790N573L602O33Q309R975j0782p544r9P85M804J329m101m016m527
7289i781k986J4912K94J108j855m385q954J616n160O243M301P191Q561J1690p268
$$ plain form
7394 7457 720 172 5431 2836 -2235 94 -1113 -2046 10412 5677 6753 2524 2698 632 -2663
7379 -2663 -10928 -15257 -4530 2973 4433 554 3762 -532 -871 -9072 -13921 -10979 -8186 -7150 1685
7364 1685 3686 3653 5376 4583 975 4894 11373 6379 -2783 -9441 -8159 -11285 -19675 -11622 -12153 -11521
7348 -11521 -14565 -5409 67 782 -2227 2631 2313 993 -3376 -3370 346 4912 15411 14513 -595 -14916
7332 -14916 -15815 -9048 -9591 32 723 4626 8228 6019 -9130 -17357 -11607 -8585 1726 7468 13083
7317 13083 2202 4072 11570 4286 -4611 -489 15616 28436 22396 17153 4577 -9681 -18512
7304 -18512 -13722 -8149 -4547 -3914 4395 14370 3588 -3956 -4055 -3270 1534 2863 -1238 -5254 -9781
7289 -9781 -12767 2145 2439 3547 1692 -2693 -11647 -10031 -15191 -8948 -4647 2544 11105 22795 15527
7274A5527o931l89l042j296K848j742P17p731l451N750o398J78j3161r731Q781
7259b0071J1922m02M75M058R932j0973n901J0865L494M613K590k1528o865J3634
7245d157R912R43n442p75n87L146m513L070N142M416J609p562j3314o001o092
7230b0205M440K804M029k319m758q10N556J996M830q317n155M654l69O210R172
7215A758R732M283m261j742m893M489N937m05r245n103j0620q826J5653m0k586
7200e869pk856P491L479P446K156n10j4611p165N810M689P54J694l785j4170m465
7184a9919r58Q672J0100L19l104n877p088O67N746N657O89K134J081O786N212
7169A0117k855l656K278L83Q95p484J352k913l598K450Q820K752j0788n497K804
$$ plain form
7274 15527 8596 8207 5165 3869 6717 4975 5692 -2039 -5490 260 -6138 -5960 -19121 -28852 -20071
7259 -20071 -8149 -8551 -8076 -4018 5914 -5059 -10960 -95 3399 8012 10602 -10926 -17791 -4157
7245 -4157 5755 6698 1256 481 -106 3040 -1473 1597 6739 11155 12764 5202 -8112 -14113 -20205
7230 -20205 -15765 -12961 -8932 -11251 -16009 -16819 -11263 -9267 -4437 -12754 -17909 -13255 -13624 -7414 1758
7215 1758 11490 15773 11512 9770 4877 9366 15303 14898 5653 550 -10070 -18896 -3243 -3283 -5869
7200 -5869 -5876 -8732 -1241 2238 9684 11840 11330 -3281 -10446 -4636 53 807 2501 -1284 -15454 -19919
7184 -19919 -20877 -12205 -2105 -1786 -4890 -10767 -17855 -17188 -11442 -5785 -5096 -2962 -1881 4905 10117
7169 10117 7262 3606 5884 6267 7162 -322 1030 -1883 -5481 -3031 5789 8541 -2247 -7744 -4940
7154d940N455l882j2689j852J149R645J948n713j917J2851K015m554o21M548M59
7139A902r825j507k805q440P457J743k263o02M108k398N648Q512J0918q535n474
7124a561Q326n600m620J966l18j536j0131J2169J3941n578p136O43N169n455Q83
7109A162P998N674q86o169j056l656j517n917M687O009k1j496k010o553o906m783
7093a5440K678K355P144O484M167r42J515L754M872j1309J278o757o936M148R28
7078b061n01J2736J2127R48j0837j0056J91N64L234q264o868p80P61m94M875O797
7062B372N423N26l20Q52m83p33K665K527r5o173p202j0014o170J636K856m749
7046a7082O488P376l942o579m923J2536R810N629J0803n086j548m131j2167r756
$$ plain form
7154 -4940 515 -3367 -16056 -17908 -16759 -7114 -5166 -10879 -12796 55 2070 -2484 -3105 1443 1902
7139 1902 -7923 -9430 -12235 -20675 -13218 -11475 -13738 -14340 -10232 -12630 -6982 1530 12448 3913 -1561
7124 -1561 6765 1165 -3455 -1489 -1807 -3343 -13474 -1305 12636 7058 -78 565 5734 279 1162
7109 1162 9160 14834 13948 7779 6723 3067 1550 -4367 320 6329 6308 4812 2802 -3751 -10657 -15440
7093 -15440 -12762 -10407 -3263 3221 7388 6446 7961 11715 16587 5278 6556 -201 -7137 -2989 -2061
7078 -2061 -2562 10174 22301 23249 12412 2356 2547 3111 6345 -1919 -8787 -9567 -8806 -9300 -4425 2372
7062 2372 7795 8321 8001 8853 8370 7637 10302 12829 12734 6561 -641 -10655 -16825 -15189 -12333 -17082
7046 -17082 -10594 -3218 -7160 -13739 -18662 -6126 3684 9313 20116 15030 13482 9351 -2816 -12572
7032a2572L316K818K071J1959K755j2863n548Q38L957Q060l951l178q95P65M39
7017b029J2029J0152k71r619Q87p445m421J868N865o126n534l592L871J581l87
7002c171P79J284L209J0806k524o977N64R252Mq907l522P860n745n766j1327K865
6986a1316R856o711l235M745R251O170m781m824M804L940m29o13m242q624O305
6971B96O14J872O452o325l543O991N933j0895j3966j6674O82J1533J8236M681
6957E887j818J270k583m277j2216m996O461M872K842K795J622K387Q061N132m780
6942A0659q228m484J219j1594o521O426N354M097l388n622L807R050N932l657
6928C050q053O2r122l240N788P189j356k030K540R648L296J054r165l064L030
$$ plain form
7032 -12572 -9256 -6438 -4367 7592 10347 -2516 -8064 -7226 -3269 4791 840 -2338 -3233 -2468 -2029
7017 -2029 10000 20152 19881 10262 11149 3704 -717 1151 7016 890 -4644 -8236 -4365 -2784 -3171
7002 -3171 -2392 -1108 2101 12907 10383 3406 3970 13222 13226 4319 797 8657 2912 -2854 -14181 -11316
6986 -11316 -1460 -8171 -11406 -6661 2590 8760 3979 -845 3959 7899 7470 6857 2615 -6009 296
6971 296 910 2782 9234 2909 -634 6357 12290 1395 -12571 -29245 -28563 -17030 1206 5887
6957 5887 4069 5339 2756 -1521 -13737 -18733 -12272 -7400 -4558 -1763 -141 2246 10307 15439 10659
6942 10659 2431 -2053 -834 -12428 -18949 -12523 -7169 -3072 -6460 -12082 -8275 775 6707 3050
6928 3050 -5003 -4941 -14063 -17303 -11515 -4326 -5682 -7712 -5172 4476 7772 8826 -339 -3403 -373
6913c73N733p100n758N120K498J834J4289k622p848m93K228P09r09k087Q32N218
6897A1271M04r278q393j6272l964J4266J6923M022L256k330j1099n740K321p531
6883a2144p56J52L950J557j755l952M176M552N150K848m303q746L299L165J4927
6868A2120Q661q756m18Q603P76j1584j5949Q63M554n236m282q85o128L947l279
6853a6993N938L290o12K000l334M643L43n04q195q352M470K416P527M952J74k594
6837d831J127Q052k262O33n309j2193L891J869j91l371L4k249K285O836k602N906
6821b375K181M842j106O859o380n213J334j985P792N747l134n877m280n684o84
6806g963Q57m351m988q016L425L895k29J665N085l189N381P437j516M267L264
$$ plain form
6913 -373 5360 -1740 -7498 -2378 120 1954 16243 13621 5773 5280 7508 8217 7308 5221 6053 11271
6897 11271 11675 2397 -5996 -22268 -26232 -11966 4957 8979 12235 9905 -1194 -6934 -4613 -12144
6883 -12144 -12900 -12748 -8798 -7241 -8996 -12948 -8772 -4220 930 3778 -525 -9271 -5972 -2807 12120
6868 12120 20781 12025 11607 20210 20986 9402 -6547 -5684 -1130 -6366 -10648 -11533 -17661 -13714 -16993
6853 -16993 -11055 -7765 -8377 -6377 -9711 -5068 -4725 -5229 -13424 -21776 -17306 -14890 -7363 -2411 -2237 -4831
6837 -4831 -3704 4348 2086 2719 -2590 -14783 -10892 -9023 -9214 -12585 -12551 -14800 -12515 -5679 -8281 -2375
6821 -2375 -194 4648 3542 10401 4021 -1192 142 -1843 5949 11696 8562 2685 -1595 -7279 -7963
6806 -7963 -7106 -11457 -16445 -24461 -21036 -17141 -17370 -15705 -10620 -13809 -8428 -991 -2507 1760 5024
6791E024L392l391j1103j1949o077Q173J0300K081o355K002M848j701O575o658
6777d839o279n298l491J927R743M98j0653M132J4052l306m141q227J1795J3152
6763I065L421P06O442L386j1968r082K024j510K557L055l354K005O504j602q405
6748C244m297R310k379m125k308M19l805J5125P453j4224j2673N240L753J231
6734A964P078O104j1287o187l478L524Q910O102m848J461P121k971p988M042J1918
6719B1465Q589J1045l581k813j1334m070m157l313p912j814J812j0398n245L232
6705h494P815Q137l019r400q413J936Q755Q052p072j3129j1270J436J6582J0668
6691B584j344j25L247q747m791O994l491q172k840J1350P094Q172R09j3710q823
$$ plain form
6791 5024 8416 5025 -6078 -18027 -24104 -15931 -5631 -3550 -9905 -7903 -3055 -4756 1819 -4839
6777 -4839 -11118 -16416 -19907 -17980 -8237 -7739 -18392 -14260 -208 -3514 -7655 -15882 -4087 9065
6763 9065 12486 13192 19634 23020 11052 1970 3994 2484 5041 8096 4742 6747 13251 11649 3244
6748 3244 -1053 8257 5878 1753 -555 -136 -3941 11184 18637 4413 -8260 -3020 733 1964
6734 1964 9042 15146 3859 -2328 -5806 -2282 6628 12730 7882 9343 16464 13493 5505 9547 21465
6719 21465 30054 41099 37518 34705 23371 19301 15144 11831 3919 2105 3917 -6481 -11726 -8494
6705 -8494 -679 7458 4439 -4961 -13374 -11438 -2683 5369 -1703 -14832 -26102 -24666 -8084 2584
6691 2584 1240 1115 4362 -4385 -9176 -2182 -5673 -13845 -16685 -5335 1759 9931 10840 -2870 -11693
6676a1693O287J2358m745Q77K208o38r37k676p209m476L133P346J5855k856r765
6661C069J195r9j0001r739K091O724m265N125n44l641K886N004N419O04j735j3607
6645a1514n481q740Q252P515P219J0313p906q058O211O095J681m697l403m63O34
6630b342p832O247Q305L438n094o037L487L728q163q294l244M088N399m873n900
6615a7087L37l08L802J6950K074l771j05N402N512j1373p761M573L777p31r69
6600C22Q68J401M530P362M753l242j749n31M723J364m448L344O574q250n848r344
6584A829m31M260R456K446r642j3505M631k554l936Q664k892j0903n821M902J2682
6569h14o241o64J0480M804j425r02q563j205p363N018O195l48j940M022M138n592
$$ plain form
6676 -11693 -5406 6952 2207 3084 5292 4654 3717 1041 -6168 -10644 -7511 -165 15690 12834 3069
6661 3069 4264 4165 -5836 -15575 -13484 -6760 -11025 -5900 -6444 -10085 -7199 -2195 3224 3828 2093 -11514
6645 -11514 -16995 -25735 -17483 -9968 -2749 7564 -342 -8400 -2189 3906 5587 890 -2513 -2976 -2342
6630 -2342 -10174 -3927 4378 7816 2722 -3315 172 3900 -4263 -12557 -15801 -11713 -6314 -11187 -17087
6615 -17087 -16750 -17058 -13256 3694 5768 1997 1892 7294 12806 1433 -6328 -1755 2022 1291 322
6600 322 1190 2591 7121 14483 19236 15994 14245 13714 18437 19801 15353 18697 25271 17021 11173 1829
6584 1829 1398 5658 15114 17560 7918 -5587 -956 -3510 -7446 1218 -1674 -12577 -18398 -13496 -814
6569 -814 -7055 -7719 2761 7565 6140 5238 -3325 -4530 -11893 -6875 -680 -1028 -2968 1054 5192 -400
6553d00m064k304m747K519n237q140L191M974n8p630q654J2828N187M503N674
6538b358L942N208N273m605k687J329K93K078M036N807j173q287q856o653L161
6523c492N260M307k588k122L007p950j5579m47J639m785J1321P189m116N949Q624
6508F217n01l443K978O55j93l131L807n40q146K370K583k733O095m809J679j09
6492B779j648j467m126j2012l099p906R684M709k256J0445J0826N283M637j0913
6478D936n07N293l073o89M181M80j207j797m583M081L094o787m702m531K342K951
6462e18R194J2228K272r932p002j846q452k505M379N379j58j796k286J217j695
6447a521q454N647P379j1011p544N493K265r194m249K738N085N982L112p83L957
$$ plain form
6553 -400 -4464 -6768 -11515 -8996 -14233 -22373 -19182 -14208 -14266 -21896 -30550 -17722 -12535 -8032 -2358
6538 -2358 1584 6792 12065 7460 4773 6102 6395 8473 12509 18316 17143 8856 0 -6653 -3492
6523 -3492 1768 6075 3487 1365 4372 -3578 -19157 -19604 -17965 -22750 -11429 -4240 -8356 -2407 6217
6508 6217 5716 2273 5251 5906 5713 2582 6389 5849 -2297 73 2656 -77 6018 1209 2888 2779
6492 2779 1131 -336 -4462 -16474 -19573 -27479 -17795 -13086 -15342 -4897 5929 11212 15849 4936
6478 4936 4429 9722 6649 5960 10141 10621 9414 7617 3034 7115 10209 3422 -1280 -5811 -3469 -518
6462 -518 8676 20904 23176 13244 6242 4396 -4056 -6561 -2182 3197 3039 1243 -1043 174 -1521
6447 -1521 -9975 -4328 3051 -7960 -15504 -10011 -7746 -16940 -21189 -18451 -13366 -7384 -4272 -5055 -1098
6432a098j653M490r969l551J128k907l56J0317J0605k19q413j518J0363m374j2005
6417i160j754J148m421J1744n59P027J1617l228j3291n68j57q914n614L786L130
6402i214N692N23J896L422K729n516p104J408l092j029R7j0799Q672l85M064l8
6386h674Q826Q600o150l366l750r212L137J3355P43m124k992L526j3255j0436
6372b3772K214J4385Q764L513l889n139j442L779k590P222N156j222q21m253j0363
6357h458L227N388P9M800m785j016J556N905K36l480L478l926J604m191l036o95
6341c314N267P517k76j714j0152n348K595j319l640K495J3064L521L484j473o030
6326D677N0l478o236k851J3452k770p515k200p1k264N512O006L746Om404j2073
$$ plain form
6432 -1098 -2751 1739 -8230 -11781 -10653 -13560 -13916 -3599 7006 6787 -1626 -3144 7219 2845 -9160
6417 -9160 -10914 -9766 -14187 -2443 -3002 4025 15642 12414 -877 -1445 -1602 -10516 -16130 -12344 -9214
6402 -9214 -3522 -2999 -1103 2319 5048 -468 -7572 -6164 -9256 -10285 -10188 -20987 -12315 -12700 -8636 -8674
6386 -8674 152 8752 2602 -764 -4514 -13726 -10589 2766 3509 -615 -3607 -81 -13336 -23772
6372 -23772 -21558 -7173 1591 5104 1215 -3924 -5366 -1587 -4177 3045 8201 6979 6158 1905 -8458
6357 -8458 -5231 157 236 5036 251 -765 791 6696 6932 3452 6930 3004 4608 417 -2619 -3314
6341 -3314 1953 9470 9194 7480 -2672 -8020 -5425 -6744 -10384 -7889 5175 8696 12180 10707 4677
6326 4677 4727 1249 -4987 -7838 5614 2844 -4671 -6871 -6942 -9206 -3694 2312 6058 6064 1660 -10413
6310a0413q41M682q49M261K663J583O21r71n277J788J0707L427j14m212q411j5363
6294a6719n862N448P914P192K467l993k528L27j475j811R337J948l838M041L781
6279F229q295M210K861K466p5p861l183K490O066m444K825R538K274o591j235
6264G275J442N592j8881n349J3155l31p051L324R718N38K000J358j0762J573L55
6249C956J23j05R1O36o051o25Q341L838l92q039k213n325k15N40o360p505M487
6232a4818J1380J0169p243k91m093J2180q975o2N494M035n980j2471n422l263
6218a9360M096l336L213P998O116J111n456R11N25J231o606k824N390J848N043
6203a00K77l945N053n132l911j057Q586l056o811k289n561j474K332P270O590
$$ plain form
6310 -10413 -11254 -6572 -7421 -3160 -497 1086 1707 736 -4541 -2753 7954 11381 11267 7055 -1356 -16719
6294 -16719 -22581 -17133 -9219 -2027 440 -3553 -6081 -5754 -7229 -9040 297 2245 -1593 2448 6229
6279 6229 -2066 2144 5005 7471 7396 -465 -3648 -1158 4908 464 3289 12827 15101 8510 7275
6264 7275 8717 14309 -4572 -9921 3234 2903 -4148 -824 8894 9432 11432 12790 2028 3601 3956
6249 3956 4079 3974 4065 4701 -1350 -1975 6366 10204 9812 1773 -440 -5765 -5980 -5440 -11800 -19305 -14818
6232 -14818 -3438 6731 -512 -803 -4896 7284 -1691 -1753 3741 7776 1796 -10675 -16097 -19360
6218 -19360 -15264 -18600 -15387 -7389 -1273 -162 -5618 -4707 -4182 -2951 -9557 -12381 -6991 -5143 -100
6203 -100 177 -3768 1285 -3847 -7758 -8815 -229 -3285 -10096 -12385 -17946 -19420 -17088 -9818 -3228
6188c228k650L092n236J472L423n907j046N472J5089J3332n141m111l546j2397
6174a382r351j297M618J1563J0549r379j2808p187j367J714N051J3819M063n196
6160C410m914l75j167n436k014J0K564K31m014M378R011L97l913l487l2J3151
6144G800r112o104p886J0314N402P725K285J673J487r790q234J0442l785M417
6130F634M06j685L510n087n342o901O708L194n512L353K257k973L125k453r55
6115a721Q938K31J995P572n302j6321o1o532o773M093j748k38R522N963K154K678
6099D450n734K051M898L004q533j781L311O097l77n310m540k534n400Q05M305
6084e288Q334J0237j580j1444n800P21j155o103L912J3760O332N647m624j3500
$$ plain form
6188 -3228 -5878 -2786 -8022 -6550 -3127 -9034 -10080 -4608 10481 23813 18672 14561 11015 -1382
6174 -1382 -10733 -12030 -7412 4151 14700 5321 -7487 -14674 -16041 -14327 -9276 4543 8606 3410
6160 3410 -1504 -1879 -3046 -8482 -10496 -10486 -7922 -7691 -11705 -7327 1684 2081 -1832 -5319 -5351 7800
6144 7800 -1312 -7416 -15302 -4988 414 8139 10424 12097 13584 3794 -4440 6002 2217 6634
6130 6634 7040 5355 8865 3778 -1564 -8465 -1757 1437 -4075 -722 1535 -1438 1687 -766 -1721
6115 -1721 7217 7448 9443 17015 11713 -4608 -4669 -11201 -17974 -13881 -15629 -15867 -6345 -382 1772 4450
6099 4450 -1284 767 5665 8669 136 -1645 1666 7763 7386 2076 -2464 -4998 -10398 -9593 -5288
6084 -5288 3046 13283 11703 259 -5541 -4820 -5975 -12078 -8166 5594 11926 17573 12949 -551
6070e51J935L546m590K083Q363q673k130J85L467K442j74l798J1165K41m235J464
6054A0740K937O902j951M374l047j0573l892q647m22M239j062J063K75M612P238
6039A2786k059p584j0318N319J722l263L576K6l325n072n48Q333q52J406K749
6024B896L317J553m480j049P055l707q672J071M499j0462m318M585P034M720k390
6009A652m122j194l10J33q373m47l922j236m417N819J0503M965K860K105N375
5994I391q08m247j2475p71K776k103P138J1650O340p841n782R087L287M52n419
5979A0675j5908j907P599k259o916m693P408O296L394m104R711N268M343n784
5965A3123j1207p092n926n072K156k438P779L741k670j006J1147L727K787k531
$$ plain form
6070 -551 1384 4930 340 2423 10786 2113 -17 168 3635 6077 5903 2105 13270 13511 9276 10740
6054 10740 13677 20579 18628 23002 19955 9382 5490 -3157 -3579 660 -402 661 936 5548 12786
6039 12786 10727 3143 -7175 -1856 -134 -3397 179 205 -3120 -8192 -8740 -407 -1259 147 2896
6024 2896 6213 7766 3286 2237 9292 5585 -3087 -2016 2483 -7979 -12297 -7712 -678 4042 1652
6009 1652 -2470 -3664 -3974 -3841 -12214 -12661 -16583 -17819 -22236 -16417 -5914 -949 1911 4016 9391
5994 9391 8583 4336 -8139 -8910 -6134 -8237 -1099 10551 16891 9050 3268 12355 15642 16094 10675
5979 10675 -5233 -7140 459 -1800 -8716 -13409 -6001 295 3689 -415 9296 14564 18907 13123
5965 13123 1916 -5176 -11102 -16174 -14018 -16456 -8677 -4936 -7606 -8612 2535 6262 9049 6518
5951F518L53j4453r648R624J3123Q961j1969q087J0051r61j1409k848l941n037
5937a9723Q520R412J0022o036m925j46k366o534l487l200J646rJ798J0302m963
5922i689j3290J394J1772J4653N970r952q963j806l018L069l298O455j325j709
5908i737j020q02M188P033j55p849l840R202Q45j515k581j1837Q680N028L600
5893g60L280K114p020K512L019j205m237K739M060j556k704m254q45P98KQ701
5877D644o25m869J3325J0396k356j1013k263m116O676o783o407P440M597q830
5863a84j0325m682Q611m379r206J782P241R060L106j090K661Q483L023p504k242
5848D355o346j5340j899J6845Q478k886o1j1127l651j109m341M873J852L571M859
$$ plain form
5951 6518 6871 -7582 -17230 -7606 5517 14478 2509 -5578 4473 3512 -7897 -10745 -14686 -19723
5937 -19723 -11203 -1791 8231 2195 -2730 -2876 -5242 -11776 -15263 -18463 -16817 -16826 -15028 -4726 -9689
5922 -9689 -22979 -21585 -9813 4840 10810 858 -8105 -9911 -12929 -9860 -13158 -6703 -8028 -9737
5908 -9737 -10757 -11559 -7371 -338 -493 -8342 -12182 -2980 -2135 -3650 -6231 -18068 -9388 -4360 -760
5893 -760 2520 4634 -2386 126 3145 1940 -2297 442 4502 2946 242 -4012 -4857 -4059 -4057 4644
5877 4644 4019 -850 12475 22871 20515 9502 7239 3123 9799 3016 -3391 4049 8646 -184
5863 -184 -10509 -15191 -6580 -10959 -20165 -18383 -11142 -2082 1024 -66 2595 11078 14101 6597 4355
5848 4355 -1991 -17331 -19230 -2385 6093 3207 3146 -7981 -11632 -12741 -17082 -12209 -10357 -6786 -1927
5833a927J802K698N072P096O857n225l683n606j2365k848K42L304o91P795J719
5818D240j677r391N13J0611p366n973Q735l823R04k491L778J945P405J360o612
5803B158J345r6P875q186p730R61J905J1252m23p740k139n063j881k041o27j1269
5787b1699L585O934r5n994j08l760K023K339O527K056M152J847M161M679l818
5772B829K534O459J377o459q990j3131J97J2284l290k042P558k428L922m800J078
5757b902K962N75L799l714q734l355K742L148l806P560M039n151p65L591L950
5742C939m49j1589M065J1025r80L821L177m822j483r09J69K888j0035j371l521
5727f075N396M579J916L342l055j1324M236L981R50j2050R05p486M048J3427J0499
$$ plain form
5833 -1927 -125 2573 7645 14741 21598 16373 12690 7084 -5281 -8129 -7887 -4583 -5274 2521 4240
5818 4240 2563 -6828 -6315 4296 -3070 -9043 -308 -4131 -3227 -5718 -1940 5 7410 8770 2158
5803 2158 3503 3407 11282 3096 -4634 -3673 -1768 9484 9061 1321 -818 -5881 -7762 -9803 -10430 -21699
5787 -21699 -18114 -11180 -11275 -17269 -17377 -21137 -19114 -16775 -10248 -8192 -4040 -2193 1968 6647 2829
5772 2829 5363 11822 13199 6740 -2250 -15381 -15184 -2900 -6190 -8232 -674 -3102 820 -3980 -2902
5757 -2902 60 635 4434 720 -8014 -11369 -8627 -5479 -9285 -1725 2314 -2837 -3602 -11 3939
5742 3939 3490 -8099 -4034 6991 6011 9832 13009 8187 6704 5795 5964 8852 -1183 -2554 -6075
5727 -6075 -679 3900 5816 9158 6103 -5221 -985 2996 3946 -8104 -7199 -14685 -10637 2790 13289
5712A3289J765k003j0137k008j911J0297L354j194j0472p758O844J2002j738O42
5698A0972L318j2608j6276L22M841l171J2769M414j596j560o698k397K770M2J78
5683d680K905L246L222K183K882o158o573K431J977l140n046N544o786O511P085
5668E603K747m313m16l8l318q646n522J3602J393n921j6282J1592Q054l632j0179
5653a5276Q411N397P352j746o802r98l046K515o571p161R03K860Q65O194k741
5638i844l733J3774J2837J574j6872o245Q180J5980K08k796n099M460n564m042
5624B818K333N302l648j3541j0758l217P755j202L583n384K996R357K654J588
5610F36L127N56j3716m492K235M034O872r127j1928q38O276P277M089k027j9M809
$$ plain form
5712 13289 15054 13051 2914 906 -1005 9292 12646 11452 980 -6778 66 12068 10330 10972
5698 10972 14290 1682 -14594 -14272 -9431 -12602 167 4581 2985 1425 -5273 -7670 -4900 -4858 -4680
5683 -4680 -1775 1471 4693 6876 9758 3600 -2973 -542 1435 -1705 -6751 -1207 -7993 -1482 5603
5668 5603 8350 4037 3621 3583 265 -8381 -13903 -301 1092 -4829 -21111 -9519 -1465 -5097 -15276
5653 -15276 -6865 -1468 5884 4138 -2664 -3662 -6708 -4193 -10764 -17925 -17022 -14162 -13297 -7103 -9844
5638 -9844 -13577 197 13034 14608 -2264 -8509 -329 15651 15859 13063 7964 12424 6860 2818
5624 2818 5151 10453 6805 -6736 -17494 -20711 -12956 -14158 -10575 -15959 -12963 -3606 -952 636
5610 636 3763 4319 -9397 -13889 -11654 -7620 -748 -9875 -21803 -22641 -16365 -9088 -4999 -7026 -7045 -2236
5594b236J179R84K190j821o549m522L923N707K670K147J3271N69o453q635l925
5579a501j0171j426P066j160j53l343l575L6n116J155Q989N58K543J3048q055
5564a105r107M22J1474L219M622K403k580m912P16J196m341q611M749N595k427
5549A313P536J55j618n24n413J830K607K745r811L782j517p576N927J651Q40p705
5533e778j0314L3J1555J1582N320l144n290l293L22r455M358J3647J0366n527
5519A4382p209p507q756o516O077L305O25k085Q30n25K437o903K572Q914J2336
5504A1977L378j0005j0050n19j414O112M395j944l864q55J2042M33k475m96K498
5489I213K870n020p037m898m803j911R951l069m81K126M107M142J831L85M448
$$ plain form
5594 -2236 -1057 -73 2117 296 -6253 -10775 -6852 -1145 1525 3672 16943 17512 11059 2424 -1501
5579 -1501 -11672 -13098 -6032 -7192 -7345 -10688 -14263 -14227 -19343 -18188 -9199 -8641 -6098 6950 -1105
5564 -1105 -10212 -9790 1684 4903 9525 11928 9348 4436 5152 6348 2007 -6604 -1855 3740 1313
5549 1313 8849 9004 7386 6862 1449 3279 5886 8631 -1180 2602 1085 -6491 -564 1087 1927 -5778
5533 -5778 -16092 -16059 -4504 7078 12398 9254 3964 671 993 -8462 -4104 9543 19909 14382
5519 14382 7173 -334 -9090 -15606 -9529 -6224 -5599 -7684 -6854 -7379 -4942 -11845 -9273 -359 11977
5504 11977 15355 5350 -4700 -5219 -6633 -521 3874 1930 -1934 -2789 9253 9686 7211 6715 9213
5489 9213 12083 7063 26 -4872 -9675 -11586 -1635 -4704 -5185 -3059 1048 5190 7021 7406 11854
5474A1854p920J090M262L440j1374m875M362q103M177J1842K752o888j0778M90
5460e669M955O97K815j3637K522M943m782P747O727n973m183N083p091O368j934
5445a412m175j513j200j326j672O0O470L732n061j123m92J559M398J590k962J348
5429a779p294q474R48k563R820N381j320k96k410K577k210r381Q824J656O818
5414B97r048l38n782j154L90K260R677J3082p58J610k220j085J848K221J476r65
5398A1511o177j8655j733j755j1347n184J5839J5183k262J645J6719q481k0562
5385a5259j302J4521O09k98O69l929M414j086n914P10P725J855m398q500N75j171
5369a0779L773J871l89K036j3270L658R639P354k324M13j2087p990L700J907K163
$$ plain form
5474 11854 3934 5024 9286 12726 1352 -3523 839 -7264 -3087 8755 11507 4619 -6159 -5669
5460 -5669 -714 -17 2798 -10839 -8317 -3374 -8156 -409 6318 345 -3838 1245 -5846 522 -1412
5445 -1412 -5587 -7100 -8300 -9626 -11298 -11238 -4768 -1036 -6097 -7220 -7712 -6153 -1755 -165 -3127 -1779
5429 -1779 -9073 -17547 -16599 -19162 -9342 -3961 -5281 -5577 -7987 -5410 -7620 -17001 -8177 -6521 297
5414 297 -8751 -9089 -14871 -16025 -15635 -13375 -3698 9384 8626 10236 8016 6931 8779 11000 12476 11511
5398 11511 5334 -13321 -15054 -16809 -28156 -33340 -17501 -2318 -4580 -2935 13784 5303 -15259
5385 -15259 -16561 -2040 -1431 -1729 -1060 -4989 -575 -1661 -7575 -6865 860 2715 -1683 -10183 -9608 -10779
5369 -10779 -7006 -5135 -5524 -3488 -16758 -13100 -3461 3893 1569 1982 -10105 -18095 -14395 -12488 -10325
5354a0325K738k372L560Q737Q50n176J0423M148p258l165K185k01o075k639K588
5339a982K108l383K052q716M179L637K696J351R971K233j5546j2006J177k231
5325a4460J2570J2091p26n281j784j2223l254K114P747J2017k911o424l298r609
5311a3431j00O041J693l216p92L904n53N976n39m529j0965q23M152O532O889J848
5295B087K202R089J772j1797j625L579j740m013o229o506n577O463M902L432O614
5280B653J1567M349k553l180l898q359j141M021J766l881L118J0693o205j2999
5266d049k265O022k653m902n259j032P221M258J0024K599k544J657K400j630q453
5251A394l195K846J3946j956j2715K4n684m580J733l078L739J4986P521n594J190
$$ plain form
5354 -10325 -7587 -9959 -6399 2338 3188 -1988 8435 12583 5325 2160 4345 4144 -1931 -4570 -1982
5339 -1982 126 -3257 -1205 -9921 -5742 -2105 591 1942 11913 14146 -1400 -13406 -12229 -14460
5325 -14460 -1890 10201 9475 4194 2410 -9813 -13067 -10953 -3206 8811 5900 -524 -3822 -13431
5311 -13431 -13531 -7490 -5797 -9013 -9805 -5901 -6454 -478 -1017 -5546 -16511 -17334 -13182 -6650 239 2087
5295 2087 4289 13378 15150 3353 1728 5307 3567 -446 -6675 -13181 -18758 -12295 -7393 -3961 2653
5280 2653 14220 18569 16016 12836 8938 579 -562 3459 5225 1344 4462 15155 8950 -4049
5266 -4049 -6314 -292 -2945 -7847 -13106 -14138 -6917 -2659 7365 9964 7420 9077 11477 9847 1394
5251 1394 -1801 1045 14991 13035 320 344 -5340 -9920 -8187 -11265 -7526 7460 14981 9387 10577
5236A0577l182j0190P032N803n391K42J1692k318l277j299m479M686l345j1859
5222e308n117P712J1036j604l276K889L650L214n584j0988N137m219j791k363
5208f612R168L475P312r279j8355j756R678r068r760J4907J2072J561Q52k551
5194A644K7j417n279P99n512k994J965J1156N605k311l13j765K634M627j337q661
5178a132j0567N86M679J0370J517q542n418J0459O401J0875Q817o478n846R05
5164A6626O991m757l433j126l144m65k190J807J296j656q387p49p48J1754K10
5149A2029j3169m007O740N132n866m088O605P66r940J353M095R267L915n266n064
5134B502j135k402J65P091m838P866J019m784q081J274k710l561J981M626m283
$$ plain form
5236 10577 7395 -2795 4237 10040 4649 4891 16583 14265 10988 9689 5210 9896 6551 -5308
5222 -5308 -10425 -2713 8323 6719 3443 6332 9982 13196 7612 -3376 1761 -2458 -4249 -6612
5208 -6612 2556 6031 13343 4064 -14291 -16047 -6369 -15437 -25197 -10290 1782 3343 4195 1644
5194 1644 1671 254 -5025 -4226 -9738 -12732 -10767 389 5994 3683 3370 1605 4239 8866 7529 -1132
5178 -1132 -11699 -11113 -6434 3936 5453 -3089 -8507 1952 8353 19228 28045 21567 15721 16626
5164 16626 23617 18860 15427 14301 11157 10692 8502 10309 11605 9949 1562 813 65 11819 12029
5149 12029 -1140 -5147 1593 6725 859 -3229 3376 4142 -5798 -4445 -350 8917 12832 7566 2502
5134 2502 1367 -1035 -870 6221 1383 9249 10268 5484 -2597 -1323 -4033 -7594 -5613 -987 -5270
5119e270m161K006O046R396J0190o392j1044k853j068P667j622j0074K170J3m298
5104i294K173L924O911k867o503O504j76R47O450l129k438r473Q650Q376M962
5089A5017p374j937L879J777j792j272j2062k318r595N286M459j458n460K311
5075a0539k603O915O045j0489P096J1911J572j8301j477P142J0262j422l673M956
5061G395J883J4368o297q562k250j871K663j10J186L403J287l240m921J718M907
5046A1559K56j2104Q99j082J890M634J179j1M03j585n421r967l943M92o520K989
5030a6332N690P461j765j2256J081M340J9100L77j4146Q725L147L928n082q746
5016d478j744j910n612l211k385J4463j818j3972O432J4367R889j1449j107l156
$$ plain form
5119 -5270 -9431 -7425 -1379 8017 18207 11815 771 -2082 -3150 4517 2895 -7179 -5009 -4996 -9294
5104 -9294 -7121 -3197 3714 847 -5656 848 672 1619 8069 4940 2502 -6971 1679 10055 15017
5089 15017 7643 5706 9585 11362 9570 8298 -3764 -6082 -15677 -10391 -5932 -7390 -12850 -10539
5075 -10539 -13142 -6227 -182 -10671 -3575 8336 9908 -8393 -9870 -2728 7534 6112 2439 7395
5061 7395 9278 23646 17349 8787 6537 4666 7329 7219 8405 11808 13095 9855 4934 6652 11559
5046 11559 11815 -289 610 -472 1418 6052 7231 7220 7623 6038 617 -9350 -13293 -12801 -19321 -16332
5030 -16332 -10642 -3181 -4946 -17202 -16121 -11781 7319 7696 -6450 2275 5422 9350 4268 -4478
5016 -4478 -6222 -8132 -13744 -16955 -19340 -4877 -6695 -20667 -14235 132 10021 -1428 -2535 -5691
5002e691m001p96L534m864K573M000o091L238k413j544L53j779Q039M10J068p94
4986d758o639k892M396k786l365l834r89N806O362K773Q58Q246Q42k112p05K90
4970A493o142l765J270l412j174q97P221J618K608m274J026O180M109R3m938n087
4954d071N958L696j4726p797L097N513M823Q749m056m513M166P390J2547P33r813
4939A1696p85J984j51q282j630p68j528J3670K79m907K243l853N486K133j0350
4924E237l008l986j051r22j5342K69J2015N363n381k343L751J224K922J057O309
4909F114K778n493k009L676N415r644J0870M20k124J786J336R212J269k243M5
4894B1408K926j632j0740j6339r100k676N797R307j809j5177k862j757J322L427
$$ plain form
5002 -5691 -9692 -10488 -6954 -11818 -9245 -5245 -11336 -8098 -10511 -12055 -11702 -13481 -5442 -5032 -3964 -4758
4986 -4758 -11397 -14289 -9893 -12679 -16044 -19878 -20867 -15061 -8699 -5926 -5068 3178 4020 1908 1203 1493
4970 1493 -4649 -8414 -7144 -10556 -11730 -12627 -5406 -3788 -1180 -5454 -4428 1752 5861 5954 1016 -4071
4954 -4071 1887 5583 -9143 -16940 -13843 -8330 -3507 5242 1186 -3327 839 8229 20776 21509 11696
4939 11696 10911 12895 12744 4462 2832 2064 536 14206 14485 9578 11821 7968 13454 15587 5237
4924 5237 2229 -1757 -2808 -3730 -19072 -18803 -6788 -1425 -6806 -9149 -5398 -4174 -1252 -195 6114
4909 6114 8892 3399 1390 5066 10481 837 11707 12127 10003 11789 13125 22337 23606 21363 21408
4894 21408 24334 22702 11962 -4377 -13477 -16153 -10356 -1049 -2858 -18035 -20897 -22654 -21332 -17905
4880a7905P880o91M666J4156k976j0866q157j430l946J5884P460P393n833j2951
4866g316l473J399j309j669K725K442N920J1653m638j077j389L086K258n494n90
4851B528j891J017m376m222l781p322M420N012J802K320j1165P39Q582P83P470
4836A916M797n645j127l027N352k03O827j155Q640Q544o942r257o183p420L214
4821a669J718o252p174l669K098j910J6092k310l552m591m130l824O852J659R012
4806a650J2400R036r361m150N230m361n877l212L333M282P910J130p354L797J458
4791A2611k538J170j2482k786R266K473p33L921k540q742K362J3982p13K532J980
4776A9763p381q722p09L617M292p890l762P219M972p621J988N69o640K225J035
$$ plain form
4880 -17905 -10025 -10716 -6050 8106 5130 -5736 -13893 -15323 -19269 -3385 4075 11468 5635 -7316
4866 -7316 -10789 -9390 -10699 -12368 -9643 -7201 -1281 10372 5734 4657 3268 6354 8612 3118 2528
4851 2528 637 1654 -2722 -6944 -10725 -18047 -13627 -8615 -6813 -4493 -15658 -14919 -6337 -5554 1916
4836 1916 6713 1068 -59 -3086 2266 2063 8890 7735 16375 24919 17977 8720 2537 -4883 -1669
4821 -1669 49 -6203 -13377 -17046 -14948 -16858 -766 -3076 -6628 -11219 -15349 -19173 -12321 -10662 -1650
4806 -1650 10750 19786 10425 6275 11505 7144 1267 -1945 1388 5670 13580 14710 7356 11153 12611
4791 12611 10073 11243 -1239 -4025 5241 7714 6981 10902 8362 -380 1982 15964 15251 17783 19763
4776 19763 12382 3660 2951 6568 10860 2970 -792 6427 11399 3778 5766 6335 -305 1920 2955
4761B955m739j656k854Q584N953m482n761k164m400K486K449Q79j530j013L625
4746a668k657K940L835j218j486J481j684o331P47k080n274R105O461m91j0370
4731h690j671J0833J3174Q090m532q57L055k231j0802L600o947k658K460K948
4717E772k371m344l377O00M281j91L245K707M38j2098o176m517N202J0459l172
4702c542j680o704n76K810j646k02M223n425j191k892O341O203R554M094r61j0455
4686b049K88n981n101R312P109k359K068j469j3602R054P852L462N173L566K726
4671B0049p519r301j3085K984J2748L493n425R540L324l249p969m021O230j6798
4657h999n659K0067M598J489O02o992m985J034n785Q02K079K05m842P41O105M916
$$ plain form
4761 2955 -1784 -3440 -6294 2290 8243 3761 -2000 -4164 -8564 -6078 -3629 -2750 -4280 -5293 -1668
4746 -1668 -4325 -1385 2450 1232 -254 1227 -457 -6788 -6041 -8121 -13395 -4290 2171 1680 -8690
4731 -8690 -10361 472 13646 21736 17204 16347 19402 17171 6369 9969 3022 364 2824 5772
4717 5772 3401 -943 -4320 -3720 561 370 3615 6322 6760 -5338 -11514 -16031 -10829 -370 -3542
4702 -3542 -5222 -11926 -12502 -9692 -11338 -11540 -7317 -12742 -13933 -16825 -10484 -4281 5273 9367 8406 -2049
4686 -2049 -1761 -7742 -12843 -3531 3578 1219 3287 1818 -11784 -2730 5122 8584 13757 17323 20049
4671 20049 12530 3229 -9856 -6872 5876 9369 3944 13484 16808 13559 5590 1569 7799 -8999
4657 -8999 -14658 5409 10007 11496 12098 5106 121 1155 -4630 -3828 -1749 -1544 -6386 -5645 460 5376
4641E376q47q233k095J977m23k921N3N348j824n32k835P30K044m836l714Q42J804
4624a0086m669N317L821P807R08k543j242O03q35l537j2967J869N193n629j493
4609a7483J9656J1284N711p900r379j1333k822M879N318Q040J1743k025j8418
4596b729m285R2N180O443o024r680q154P514M495R407M300r71M860l954p687n848
4580g041M773J028N01k405P923o86o411j45J03L89o862l503P72M324j78q592N272
4563a0738J407k126P603k852M964R603m016o335J523q850J895J715k41L518J865
4548a065n910o999M961P69j402J36J057m789l205J41j39M800Q632l499j315k941
4532a0768L613R255J923K180O275m473r963j012j548l575J777m590r696M639J0306
$$ plain form
4641 5376 4529 -3704 -5799 -3822 -4245 -7166 -7113 -1765 -3589 -4121 -6956 -6226 -4182 -9018 -12732 -11890 -10086
4624 -10086 -14755 -9438 -5617 2190 3098 555 -687 -84 -919 -4456 -17423 -15554 -10361 -15990 -17483
4609 -17483 2173 13457 19168 11268 1889 -9444 -12266 -7387 -2069 5971 17714 15689 -2729
4596 -2729 -7014 -6922 -1742 4701 -1323 -11003 -19157 -11643 -7148 2259 6559 5588 10448 6494 -1193 -7041
4580 -7041 -2268 -1240 -739 -3144 4779 4093 -2318 -2463 -2360 -1971 -8833 -12336 -11564 -7240 -7418 -16010 -10738
4563 -10738 -9331 -11457 -3854 -6706 -1742 7861 3845 -2490 -967 -9817 -7922 -6207 -6448 -2930 -1065
4548 -1065 -6975 -13974 -9013 -8244 -9646 -9510 -8453 -13242 -16447 -16306 -16445 -11645 -3013 -6512 -7827 -10768
4532 -10768 -7155 2100 4023 6203 12478 8005 -1958 -2970 -4518 -8093 -6316 -10906 -20602 -15963 -5657
4517e657r1j698j0282m587J0250Q738J435J262j528k374M287j3141j3972J1274
4503a6084R193L501L995n817n871k742N115O462m029J757k374K091J1098R194
4489A5489J341Q96L930K731n795p535o233l438r02P146j3880k68M398J117P61
4474b42m01k222L78K030n935l893M170N144Q644l765l443R043m716J095J51o799
4458g61l096o681k48l397n57Q252j1669o465J5840N697k195M163L914m566k596
4443d365n03j96J486P296L091m433k526n071K9k266L254J1579k690p731p906R994
4427i58m842j844M052m724p461K7J2166Q000j0320j2318P47J776J163J889M606
4412h041R106N638m280j725L553l920P03O917q890r96K020N084j0258n158Q155
$$ plain form
4517 -5657 -5748 -7446 -17728 -22315 -12065 -3327 -1892 -630 -2158 -4532 -245 -13386 -27358 -16084
4503 -16084 -6891 -3390 605 -5212 -11083 -13825 -8710 -2248 -6277 -4520 -6894 -4803 6295 15489
4489 15489 16830 17726 21656 24387 18592 11057 4824 1386 484 7630 -6250 -6518 -2120 -1003 -242
4474 -242 -643 -2865 -2487 -457 -6392 -10285 -6115 -971 7673 3908 465 9508 4792 5887 6038 -761
4458 -761 -3857 -10538 -10786 -14183 -14740 -6488 -18157 -24622 -8782 -3085 -5280 -1117 2797 -1769 -4365
4443 -4365 -4868 -5064 -3578 3718 6809 2376 -150 -5221 -5192 -7458 -4204 7375 4685 -3046 -10952 -958
4427 -958 -5800 -7644 -3592 -8316 -15777 -15750 -3584 4416 -5904 -18222 -17475 -15699 -14536 -12647 -8041
4412 -8041 1065 6703 2423 698 4251 331 1034 7951 -939 -1935 85 5169 -5089 -10247 -2092
4397b092M467L006J325K99l258M850l158r428r050J895P359J1685k689k214K396
4382E393q691o038J1211J4152q611l456o38j2428k655J1713Q606K614m097M867
4368A1942L804m981o84k905o419j2530O08O15l636l160J0230o10N184o435r964
4353a8941k335M751J09p86J4884p556m846J7L898q076J805R173J4452k140o099
4338a690n275k555M161J3485j0379J317R13m113K607J600K125L920M319n549o20
4323D266J0216M090l882j509l895m701M732O427R956m446r186o475o271o07L880
4308B595R973m611O93J590j880m101l606M348J154M154N93r404j410J658J244
4293B990N646O024j054m55n013J771L678K823j802j1580m996L747n255j0621m18
$$ plain form
4397 -2092 2375 5381 6706 7005 3747 8597 5439 -3989 -13039 -11144 -3785 7900 5211 2997 5393
4382 5393 -3298 -9336 1875 16027 7416 3960 3322 -9106 -11761 -48 8558 11172 7075 11942
4368 11942 15746 10765 10081 7176 757 -11773 -11165 -10550 -14186 -17346 -7116 -7726 -2542 -8977 -18941
4353 -18941 -21276 -16525 -16416 -17202 -2318 -9874 -14720 -14703 -10805 -18881 -17076 -7903 6549 4409 -1690
4338 -1690 -6965 -9520 -5359 8126 -2253 -936 -23 -4136 -1529 71 2196 6116 10435 4886 4266
4323 4266 14482 18572 14690 13181 9286 4585 9317 15744 25700 21254 12068 5593 -678 -1285 2595
4308 2595 12568 7957 8650 10240 8360 4259 653 5001 6155 10309 10902 1498 88 1746 2990
4293 2990 8636 14660 13606 13151 8138 9909 13587 16410 14608 3028 -1968 1779 -3476 -14097 -14515
4278a4515R05O886N660J488k260J344O04l199K585J4370J3959L399L761l766j3885
4263A7336J39k587k959k059J855N289k563j1148n069P071j723m39Q947K531q573
4248F048j569L935j612m529M212L090l588J434P497j2178j2770n667N352O658
4234c687Q482M801q288l513j817O269K130J237m99m727k127l047q249n341L937
4219a4439M637J0359Q467M771k402k471p50o464N338M149j419o046K675O623m398
4204H630l481P133K440j501l049m45q309K236k22r573n133j551R723J2074n825
4189C147p246P935N329L63n827n479n765Q31j05q13P376J0040p046j0953m005
4174a2218k20J0795M969l7l306J986Q309p62k878L778l942K150M27m428J785j0522
$$ plain form
4278 -14515 -13610 -6724 -1064 424 -1836 -492 112 -3087 -502 13868 27827 31226 34987 31221 17336
4263 17336 17475 14888 11929 9870 11725 17014 14451 3303 -1766 5305 3582 3143 12090 14621 6048
4248 6048 4479 8414 6802 2273 6485 9575 5987 7421 14918 2740 -10030 -15697 -10345 -3687
4234 -3687 4795 9596 1308 -2205 -4022 2247 4377 5614 5115 388 -1739 -4786 -13035 -18376 -14439
4219 -14439 -9802 557 9024 13795 11393 8922 8172 1708 7046 11195 9776 3730 6405 13028 8630
4204 8630 5149 12282 14722 13221 10172 9727 1418 3654 3432 -6141 -11274 -12825 -3102 8972 3147
4189 3147 -4099 3836 9165 9528 3701 -1778 -7543 -6712 -6817 -7630 -254 9786 2740 -8213 -12218
4174 -12218 -12438 -1643 3326 3289 -17 1969 10278 9516 6638 10416 6474 8624 9051 4623 6408 -4114
4158d114L82R870j980p123n121L545M136N972K821q89q76o61N928K918j678n821
4142G309N585L686L59j0319j0346q206O064R62l273j870k139L612O053o749J009
4127h263L895m0N988o409q774M020J1643Q983j014j3383l710L113J323O27O235
4112D234j445O828O989l590p789j4115j0538K617J092L619M816O450M801l894
4098G5k647R791R775J366m773o596J66L684j779k360k939n3l148O249J654P703
4082A6168M377m579m026N583l049j700Q92r280k640m190k616L527l423K017l75
4067c314O200m199l710l228R584K051L580O68J673o751p032r213q185L597R921
4052h358L898O68Q2M911Q058p363o823O968J2007l023q734q184K353J902k678
$$ plain form
4158 -4114 -3732 6138 4158 -2965 -8086 -4541 -405 5567 8388 7499 6623 5962 11890 14808 13130 7309
4142 7309 12894 16580 16939 6620 -3726 -11932 -5868 -4906 -8179 -10049 -12188 -8576 -2523 -9272 -8263
4127 -8263 -4368 -4408 1580 -4829 -13603 -9583 2060 11043 10029 -3354 -7064 -3951 -2628 -2001 4234
4112 4234 2789 9617 16606 13016 5227 -8888 -19426 -16809 -15717 -12098 -7282 -832 3969 75
4098 75 -2572 7219 16994 18360 13587 6991 7157 10841 9062 6702 3763 3710 562 6811 8465 16168
4082 16168 20545 15966 11940 17523 14474 12774 13666 4386 1746 -2444 -5060 -1533 -4956 -2939 -3314
4067 -3314 2886 -1313 -5023 -8251 1333 3384 6964 7632 9305 2554 -4478 -13691 -21876 -18279 -8358
4052 -8358 -4460 -3792 -3710 1201 9259 1896 -4927 2041 14048 11025 2291 -5893 -3540 -1638 -4316
4037d316j332J757K016L71O076J3279k645j4024n140j5804J283N379K354K068
4023h678K638p949p46M609J452J919L271M373l274K753m509R476J4714j00m74
4008A9475o738P052P4m47l189l290r38j5272j0988j402K418J3347J5488l662l722
3993H206j0521J131R0j965L452J1316l362n551o908o494n675L099Q060J862j0555
3978a3815o399o97P103N247J1310M637M04r258o236L428L278p13N4L944M15M54
3962C156R14p69m119k620J284P04j2545k382R419N69J201L872m342m409J344O641
3946b082N287P646k85l949J538l755k24n109O962M371j560P64j0083p536J2159
3931D144J444r658M774Q241j0812j2971o677L261L036J3553Q434o81p002o475
$$ plain form
4037 -4316 -5648 -3891 -1875 -1504 4572 17851 15206 1182 -3958 -19762 -18479 -13100 -10746 -8678
4023 -8678 -6040 -13989 -14735 -10126 -8674 -6755 -3484 889 -2385 368 -4141 5335 20049 19949 19475
4008 19475 12737 19789 19863 19416 16227 12937 11999 -3273 -14261 -15663 -13245 102 15590 11928 8206
3993 8206 -2315 -1184 -1094 -3059 393 11709 8347 2796 -4112 -10606 -16281 -13182 -5122 -3260 -13815
3978 -13815 -20214 -20911 -13808 -8561 2749 7386 7790 -1468 -7704 -4276 -998 -1711 -1657 2287 2702 3156
3962 3156 4070 3301 -818 -3438 -2154 -1450 -13995 -16377 -6958 -6389 -5188 -1316 -5658 -10067 -8723 -2082
3946 -2082 3205 10851 10566 6617 8155 4400 4176 -933 6029 10400 8840 9604 -479 -8015 4144
3931 4144 5588 -4070 704 8945 -1867 -14838 -21515 -18254 -15218 -1665 6769 6088 -914 -7389
3917g389k463n866J3407O252q954j3727N538J0907L995m190J546l781k463l728
3903a0916J2092k031N773Q285r63M22j81m307r382q38n3q152R900K943o519K39
3887c688n189O146J3014K885q619j2001L389J493j593j574j5167K991P557N177
3873e179N421Q079m452k055o29m155o122K366j626r19q803n143N848J3272L447
3858f50o442j039O712j674j648J4887N749q778n577K049j17p925J226J0029q083
3843a281P4R518j359m263l449j760J622N956n17k311m140n800L635O349L203n177
3827C00n670l515N076K835L390N05o137p386M215K551K225O08J243m941M819O361
3811F479p382r47m767r531r68J2061o70k489l015L606N335O655K125p518j938
$$ plain form
3917 -7389 -9852 -15718 -2311 3941 -5013 -18740 -13202 -2295 1700 -2490 -944 -4725 -7188 -10916
3903 -10916 1176 -855 4918 13203 12240 12662 12481 8174 -1208 -2046 -2099 -10251 -351 2592 -3927 -3688
3887 -3688 -8877 -2731 10283 13168 4549 -7452 -4063 -2570 -4163 -5737 -20904 -17913 -10356 -5179
3873 -5179 242 8321 3869 1814 1185 -2970 -9092 -6726 -8352 -9271 -18074 -23217 -17369 -4097 -650
3858 -650 -7092 -8131 -1419 -3093 -4741 10146 15895 7117 1540 3589 3472 -4453 -3227 6802 -1281
3843 -1281 -1207 8311 6952 2689 -760 -2520 -898 5058 4541 2230 -1910 -7710 -4075 2274 5477 300
3827 300 -5370 -8885 -3809 -974 2416 2921 -3216 -10602 -6387 -3836 -1611 -1003 240 -4701 118 6479
3811 6479 -903 -1850 -6617 -16148 -17116 -5055 -5725 -8214 -11229 -7623 -2288 4367 6492 -1026 -2964
3796b964j848N378L574J312j338j4778L150J224K708J1525O38n431q40j657j122
3781d69P706Q2k666m234ko755n060N813o795K121J3673J3409m804q731R039m183
3765H144k792j719j845o762q071O076j830n017N841N010J261l695q005r060N693
3750a6771J1062L679l892j777K36M02J1070r769m108P705J713K318j048p986J785
3735e381M060N851Q291n416r041L913N085M752j071j8566n482m222J941K308j36
3720a3114l29P507J0697O981O49n110l69q502p420K169M893R52N03q144n031J2176
3704a492P784l063m048L059l685M890R590p333j2230N95O659n64P920J857J0173
3689B0112N087j0233o223K277P679J744j8893j7845l002R370J2522J646j0144
$$ plain form
3796 -2964 -4812 566 4140 5452 4114 -10664 -7514 -6290 -3582 7943 8581 3150 2310 653 -469
3781 -469 7237 7319 4653 419 417 -6338 -11398 -5585 -12380 -10259 3414 16823 12019 3288 12327 8144
3765 8144 5352 3633 1788 -4974 -13045 -6969 -8799 -13816 -7975 -2965 -1704 -5399 -13404 -22464 -16771
3750 -16771 -5709 -2030 -5922 -7699 -7463 -7061 4009 -5760 -9868 -2163 -450 1868 820 -7166 -5381
3735 -5381 -1321 4530 12821 7405 -1636 2277 7362 12114 11043 -7523 -13005 -17227 -15286 -12978 -13114
3720 -13114 -13443 -5936 4761 11742 12391 7281 6912 -1590 -9010 -6841 -1948 -996 -493 -8637 -13668 -1492
3704 -1492 6292 3229 -819 2240 -1445 3445 13035 5702 -6528 -5933 726 162 8082 9939 20112
3689 20112 25199 14966 8743 11020 18699 20443 1550 -16295 -19297 -9927 2595 4241 -5903
3676e903j38j080m370k914Q770M459K728Q558K944L675m670o878r918j737J078
3661e396J0518J2975o336j4275j3583o420R273J2279q57K713p890o982O370N979
3647a632m62K064N30K461r06M290n677j334L884L708m410l484P591l462o419J349
3631a909J3457k03q99J515J421j3199m286P279k452p057J728L796J196j4961k05
3616a4779J391J508L031R185J665P343o585j551q935p067R32O719L084k411p907
3601a4377Q298M786l49M543J685L245J381k499Q7n15n58r137k345N103N803R610
3585A4761l750M0j187j0762J899J615k492l129k944j044K804J066l323m345M478
3570f313l102R26K639O769k006p048J852R064n957r445M570M070L530m328l830
$$ plain form
3676 -5903 -6041 -7121 -11491 -14405 -5635 -1176 1552 10110 13054 16729 12059 5181 -4737 -6474 -5396
3661 -5396 5122 18097 11761 -2514 -16097 -22517 -13244 -965 -1822 891 -6999 -13981 -7611 -1632
3647 -1632 -2094 -30 500 2961 2055 6345 668 -666 3218 6926 2516 -968 6623 3161 -3258 -1909
3631 -1909 11548 11345 10446 11961 13382 183 -4103 3176 724 -6333 -4605 -809 387 -14574 -14779
3616 -14779 -13388 -11880 -8849 336 2001 9344 2759 1208 -7727 -14794 -13862 -7143 -4059 -6470 -14377
3601 -14377 -6079 -1293 -1642 2901 4586 7831 9212 6713 6800 6285 5727 -3410 -5755 -652 5151 14761
3585 14761 11011 11051 9864 -898 1001 2616 124 -3005 -5949 -6993 -4189 -3123 -6446 -10791 -6313
3570 -6313 -9415 -8489 -5850 919 -1087 -8135 -6283 2781 -3176 -12621 -8051 -3981 -451 -4779 -8609
3555h609q112K651J3639R122n292k425n42j0170n39J1611j181J824N39o614k814
3540f912l22p164R443J0874L633j1179l462O0m827Q500J5995o091j1667m938M108
3525c949r90O444R41O053N217r46q738o971l300M473k980N335K220J667K46j1645
3509f923n038l813Q589M827j563M81M787P262l702M193l566o30q216j191O470
3494A967r60o617l674k658K609Q37K745k690k212Q361o814k640J4162Q627k516
3479H527j791q532j4535l449J4293J4358Q51K180J4278o826n492l040j4244p396
3465a0818M572J4582P382k35p621l501L141K794q3J675O771j2543p05L7p996j053
3449c601J9072K901q076j1247l587L346j168K732l551q19J0768o75L73Q496m423
$$ plain form
3555 -8609 -16721 -14070 -431 8691 3399 974 432 -9738 -10277 1334 153 1977 2516 -4098 -6912
3540 -6912 -7234 -14398 -4955 5919 9552 -1627 -5089 -5029 -9856 -1356 14639 8548 -3119 -8057 -3949
3525 -3949 -4939 1505 2446 8499 13716 12770 4032 -2939 -6239 -1766 -4746 589 2809 4476 4722 -6923
3509 -6923 -11961 -15774 -7185 -2358 -3921 -3440 1347 8609 4907 9100 5534 4904 -3312 -4503 1967
3494 1967 1007 -5610 -9284 -11942 -9333 -8496 -5751 -8441 -10653 -2292 -9106 -11746 2416 11043 8527
3479 8527 6736 -1796 -16331 -19780 -5487 8871 9722 11902 26180 19354 13862 10822 -3422 -10818
3465 -10818 -6246 8336 15718 15483 7862 4361 7502 10296 10213 11888 18659 6116 5411 5448 -2548 -3601
3449 -3601 15471 18372 10296 -951 -4538 -1192 -2360 372 -3179 -3998 6770 6095 6468 14964 10541
3434A0541o773L74o017k820j25M601Q374k946j756p034o208J986J684j765k161
3419a0045J2429l234j3184N99O991m684L619P692J000m078O759k653r411m57%
3404h657N877Q457j860M661J0508p635j620k426r811j3129n873k440J649P01J0062
3389a1536J2305N802j847L6P316l149m732j4621Q312M349m823n006o374O976j3
3374g005M435K350r09m972l604k207j277K274R797o391J135k284O871p952p137
3359a6876J1565J4158J561l448j1787N993P262O441r746o570J371K085l692J572
3345a11n692j0275q541j873R876J1085Q538M934j795O751ln361K579L185k987
3330A0310Q48m343l593Q93L433k92j4394p252J059J7517J1933k969j2674q516
$$ plain form
3434 10541 3768 4142 -1875 -4695 -4820 -219 8155 5209 3453 -3581 -9789 -7803 -6119 -7884 -10045
3419 -10045 2384 -850 -14034 -13435 -6444 -11128 -7509 183 1183 -2895 3864 1211 -8200 -8657 -8657
3404 -8657 -2780 5677 3817 8478 18986 11351 9731 7305 -2506 -15635 -21508 -23948 -22299 -21598 -11536
3389 -11536 769 6571 4724 4760 12076 8927 4195 -10426 -2114 2235 -2588 -7594 -13968 -6992 -7005
3374 -7005 -2570 -220 -1129 -6101 -9705 -11912 -13189 -10915 -1118 -7509 -6374 -8658 -1787 -9739 -16876
3359 -16876 -5311 8847 10408 6960 -4827 1166 8428 14869 5123 -1447 -76 2009 -1683 -111
3345 -111 -5803 -16078 -24619 -26492 -16616 -5531 3007 7941 6146 12897 12894 7533 10112 13297 10310
3330 10310 11158 6815 3222 4115 7548 7256 -7138 -14390 -13331 4186 16119 13150 476 -8040
3316h040L460M57l601m484L785n986k137N298M673K466P986L400n08K81j336L107
3300H821K284n594L191M35j0039k533p681J0630M418p302J910j039Q19m55M899
3285B764o516l400N003O634J697j0294q971L735N371j732M26l191n707j524K150
3270a3555P393J516j820j522J525Q053j540Q194n420r024M157P793N204q289l870
3255a205J670m29R68l294N035M126o084j657l640R984K754L87O304Q75j4714j1183
3239a0103J323l323m819R567P08J375Q526L836M387m227o365r628Q448R072K266
3224A1043J3873q036n123j250p286l271O637P239M2o936n888o128j524J2346J1395
3209A7133o930r973l965L616M329n327j0236K319n281O980R149Q294N070m574
$$ plain form
3316 -8040 -4580 -4123 -7724 -12208 -8423 -14409 -16546 -11248 -6575 -4109 3877 7277 6769 7050 5714 8821
3300 8821 11105 5511 8702 9137 -902 -3435 -11116 -486 3932 -3370 -1460 -2499 -1680 -2135 2764
3285 2764 -3752 -7152 -2149 4485 6182 -4112 -13083 -9348 -3977 -5709 -5283 -8474 -14181 -15705 -13555
3270 -13555 -6162 -4646 -6466 -7988 -6463 1590 50 8244 2824 -6200 -2043 5750 10954 2665 -1205
3255 -1205 465 36 1004 -2290 2745 6871 787 -870 -4510 5474 8228 8615 14919 15794 1080 -10103
3239 -10103 -8780 -12103 -16922 -7355 -6647 -5272 3254 7090 11477 7250 885 -8743 -295 8777 11043
3224 11043 24916 16880 11757 10507 3221 -50 6587 13826 13868 6932 1044 -5084 -6608 5738 17133
3209 17133 10203 230 -3735 -119 4210 -1117 -11353 -9034 -14315 -7335 1814 10108 15178 10604
3195A0604l43r88k991j7184l357J6892M085k363Q741k740p139o035m392l166O663
3180c713l068p080k854k149O167j292N483J753n35j32N481j311o947K957M751
3165b489l597j568m042N434J6380k326j3624L196K748Q416n962p530l085J45L412
3150d492j32K162N925q195n428O198Q612o305j699o490q608J3919L048j86J904
3135B33J407N222J738L563m939r344q497K57P199O828k366J725n778k885r24O035
3119e26o925l558j018K239j400J85Q139M530O83m759m136J176p479K024M779J110
3103d936k187p3r67M888k055M373J150k405J3020P074m568M733k841j2391n193
3088b378M799o431n789J1630L982k405O148r560R393k22m709L48M770j4815k757
$$ plain form
3195 10604 10261 9273 6282 -10902 -14259 2633 6718 4355 13096 10356 3217 -2818 -7210 -10376 -3713
3180 -3713 -6781 -13861 -16715 -18864 -12697 -13989 -8506 -6753 -7288 -7420 -1939 -3250 -10197 -7240 -2489
3165 -2489 -6086 -7654 -11696 -6262 10118 7792 -5832 -2636 112 8528 2566 -4964 -8049 -7904 -4492
3150 -4492 -4624 -2462 3463 -4732 -10160 -3962 4650 -1655 -3354 -9844 -18452 -4533 -1485 -1671 233
3135 233 1640 6862 8600 12163 7224 -2120 -10617 -10360 -3161 3667 1301 3026 -2752 -5637 -6561 -526
3119 -526 -7451 -11009 -12027 -9788 -11188 -11003 -2864 1666 2349 -2410 -6546 -5370 -12849 -10825 -6046 -4936
3103 -4936 -7123 -7196 -8163 -3275 -5330 -957 193 -2212 10808 17882 13314 18047 15206 2815 -2378
3088 -2378 2421 -4010 -9799 1831 5813 3408 9556 -4 9389 9167 4458 4806 9576 -5239 -7996
3073g996l927Q133k915m188L027J2383R177o950j626o350J15N566J265K93m783
3058A224o742j2417j316p604k869J0380O327L803L323M422N951R33J246p92K835
3043H704l066o562m237L031l514j137l170l089P173l198K517M144K090p44l04
3028a362L768l19l185L64j0640N043J1897l098m200N425j118O627K227o637l182
3013A610L275r714j1997K359J892M961K255P320l829K346R58N62m77m899j852
2998e230Q08p55L479L69k675L538J845l757J886o182K237O102Q652j071j0772
2983a526n323j00K236J928J62M100L883Q95N607J05o593r991P827P622jK565n485
2966G911k88m23M511k010P08p560q459m214L870o940J1153P334J671N485q040
$$ plain form
3073 -7996 -11923 -3790 -6705 -10893 -7866 4517 13694 6744 5118 -1232 -1117 4449 5714 6007 1224
3058 1224 -5518 -17935 -19251 -26855 -29724 -19344 -13017 -9214 -5891 -1469 4482 5415 6661 5869 8704
3043 8704 5638 -924 -5161 -2130 -5644 -6781 -9951 -13040 -5867 -9065 -6548 -2404 -314 -1058 -1362
3028 -1362 2406 2087 -1098 -734 -11374 -6331 5566 2468 -1732 3693 2575 9202 11429 4792 1610
3013 1610 4885 -4829 -16826 -14467 -12575 -7614 -5359 1961 -1868 478 1436 1998 1521 -3378 -5230
2998 -5230 -4422 -5177 -1698 -1329 -4004 -466 1379 -2378 -492 -6674 -4437 1665 10317 9246 -1526
2983 -1526 -6849 -6949 -4713 -2785 -2623 1477 5360 6255 11862 11967 5374 -4617 3210 10832 10831 13396 7911
2966 7911 7623 7200 11711 9701 10409 2849 -5610 -9824 -5954 -12894 -1741 5593 7264 12749 4709
2951D709q755k229l439N66R527j1278n561J1533O256J1477j754L160N342l179
2937A6375l698k703j027m094O26j265j3103k846J0469m044N557J600L172p037
2923b018OL539K77J130n02N853o781j414p92j1470L458K042O466N851K923l571
2907D997m99Q106R26q680K566M917J938m63o199P224J546j5023n030R397M23r483
2891c337J601M979J124K419m445l099m46J770l345n961J702K088P59l515n86P274
2875a018M298j890M31O09m56o236m58k063N836J303J797k74L160o038p431k111
2859a0541M590k943K285J598k227j726j1P38Q037M907J256m212j3212l807l20
2844a5588O793k399J206j001J0436K134k142j374n503K764n820K211Q650p652
$$ plain form
2951 4709 -4046 -6275 -9714 -9148 379 -10899 -16460 -4927 1329 12806 11052 14212 19554 16375
2937 16375 12677 9974 8947 4853 5479 4214 -8889 -11735 -1266 -5310 247 1847 5019 -2018
2923 -2018 -2012 1527 1804 2934 2432 8285 1504 90 -702 -12172 -8714 -6672 -206 5645 8568 4997
2907 4997 4498 12604 13530 4850 7416 12333 14271 13808 7609 14833 16379 1356 -3674 5723 6146 -3337
2891 -3337 -1736 3243 4367 6786 2341 -758 -1204 566 -2779 -8740 -7038 -4950 -4191 -7706 -8292 -1018
2875 -1018 3280 1390 1821 2430 1974 -4262 -4720 -6783 -947 356 2153 1879 5039 -999 -8430 -10541
2859 -10541 -5951 -8894 -6609 -5011 -7238 -8964 -8975 -8237 -200 4707 5963 1751 -11461 -15268 -15588
2844 -15588 -8795 -11194 -9988 -10989 -553 1581 -561 -1935 -7438 -4674 -10494 -8283 367 -7285
2830g285N41Q439m281J666N370n237q589j090k116j552N63L731P76P993J3847
2815A2776j331r268k753j221l139k431l745l603J0992J0546L636M938j0047n28
2801D822k522m337p467l182J2617M127L946O641k298n926q840P018j55p402N676
2786B718L896K25o583k464m826J777R373N827r82l146M68M16k432j030J240n341
2770h64N696q41j195K873m059j571l553J238L688R73j585l692n292P49M891K148
2754c96K721M136o649p304O964K363q891j0334J112R749J057N850K14l990l356
2739f754L387J758m580m508O341L385J2076P034p295j6863J309P657m1j676N888
2724G118Q821M004n156m838M642l586k861q351m315K840O931K007M638p933o981
$$ plain form
2830 -7285 -6744 1695 -2586 -920 4450 -787 -9376 -10466 -12582 -14134 -13571 -9840 -9064 -1071 12776
2815 12776 11445 2177 -576 -1797 -4936 -7367 -11112 -14715 -3723 6823 10459 15397 5350 4822
2801 4822 2300 -2037 -9504 -12686 -69 4058 8004 14645 12347 6421 -2419 4599 4444 -2958 2718
2786 2718 6614 6839 256 -2208 -7034 -5257 4116 9943 8961 5815 6283 6699 4267 3237 4477 -864
2770 -864 4832 3991 2796 5669 1610 39 -3514 -2276 1412 2385 800 -2892 -8184 -7435 -2544 -396
2754 -396 2325 6461 -188 -7492 -528 1835 -7056 -17390 -16278 -6529 -5472 378 592 -3398 -6754
2739 -6754 -3367 -1609 -6189 -10697 -4356 -971 11105 18139 10844 -6019 -4710 2947 2906 1230 7118
2724 7118 15939 19943 14787 9949 14591 11005 8144 -207 -4522 -1682 5249 7256 11894 3961 -3020
2709c020N091j108r946o356l77N649M345J484j8M893K108m147O845j508o876K368
2693e73P415m622n97k016l747J126L396j5453m144J388J481j032Q930Q269k508
2678b687k521o398M640M930J355k186Q781n739k895n56n625K909K228o24l435
2663g823j4015k261J375j483Q374R560p48M492O002p485j385j750J503K642J884
2648a118N323K267K866j965j0035p332K336J738L954M360m165p17M196k18o143
2633d653l739Q74J3045J5573Oj2749p151j0054J3254M494j3102m812J983l042
2619a0073q21L032L636k905Q574N990p012P93Q148k17p975j287n236P785R517
2604A1949L267n33n055j0481P089L449L313M748r63j0647p552L286q826r573K70
$$ plain form
2709 -3020 2071 963 -8983 -15339 -15716 -10067 -5722 -4238 -4256 637 2745 -1402 5443 3935 -2941 -573
2693 -573 6842 2220 1623 -393 -4140 -3014 382 -15071 -19215 -17827 -16346 -17378 -8448 -179 -2687
2678 -2687 -5208 -11606 -6966 -2036 -681 -2867 5914 175 -2720 -3276 -8901 -5992 -3764 -4388 -7823
2663 -7823 -21838 -24099 -22724 -24207 -15833 -6273 -7021 -2529 3473 -4012 -5397 -7147 -5644 -3002 -1118
2648 -1118 4205 6472 9338 7373 -2662 -9994 -7658 -5920 -1966 2394 -1771 -2488 1708 1490 -4653
2633 -4653 -8392 -7518 5527 21100 21106 8357 1206 -8848 4406 8900 -4202 -9014 -7031 -10073
2619 -10073 -10894 -7862 -4226 -7131 1443 7433 421 1214 9362 9145 1170 -117 -5353 2432 11949
2604 11949 15216 14683 9628 -853 6236 9685 12998 17746 16783 6136 -1416 1870 -6956 -16529 -16259
2589a6259J1742P68K185N67j101k195k873k572J0237O589N018n181M401n720k425
2574C181p431r474o372L536P850J4054N313J050J020j117q337j6061l989N234
2560a1543N054N311L568r780l690l486R864P80J675J062M970K524q8j613k510
2545B098L330l239n539q129j212k238M009J0375O06N07Q714M247r483p785l731
2530g470N112K361j048M662m25N031m264O04j1653l099Q748m580l964q16Q085
2515b716J2243J332k846l183R16p95j127L563M041J145K614j475j054q588j1832
2500g762J844J8446l34r384o313P787p17o529k81J098Q361n096L520J403J075
2485G118N081J085M806n632l50p259L3J948l057K234j766Qn324R32m688j0170
$$ plain form
2589 -16259 -4517 -3749 -1564 -997 -2098 -4293 -7166 -9738 499 7088 12106 6925 11326 5606 3181
2574 3181 -4250 -13724 -20096 -16560 -8710 5344 10657 11707 12727 11610 3273 -12788 -16777 -11543
2560 -11543 -6489 -1178 2390 -7390 -11080 -14566 -4702 -3922 -2247 -1185 3785 6309 6221 4608 2098
2545 2098 5428 2189 -3350 -11479 -12691 -14929 -10920 -545 61 568 9282 13529 4046 -3739 -7470
2530 -7470 -2358 3 -1045 3617 3192 8223 3959 4563 -7090 -10189 -1441 -6021 -9985 -10801 -2716
2515 -2716 9527 10859 8013 4830 5746 4951 3824 7387 11428 12573 15187 13712 12658 4070 -7762
2500 -7762 -5918 12528 12194 2810 -3503 4284 3567 -2962 -3243 -2145 6216 1120 4640 6043 7118
2485 7118 12199 13284 18090 12458 12108 4849 4882 6830 3773 6007 4241 4249 -1075 -143 -4831 -15001
2469a5001L312J1646N404K171M938L997m459r567J161M474o428J1096M118j1105
2455E757j930J312m440k724n830Q47L603n912q2O467K998r211m271M776N999M083
2439A442R00L695k826j434M280r242m401l302k484Q408R000l517P33q393j2743
2424a9884J029J8503M758m100J705k763o016N994R444n617k561J217j112K346
2410B943J55L666L634l522r519m778J451P451N683k516N296j184M031K718J174
2395A6683p40L873M784K729p215J472n402j2225M121P082K209k517o696k835L231
2380H554J837K563L058J0608p240n425l927m473m079o227k890j245J2545N707
2366I366M650m762k587l70j5056o304P795m22K10l256q36N302J468m61K000J1983
$$ plain form
2469 -15001 -11689 -43 5361 7532 12470 16467 12008 2441 3602 8076 1648 12744 16862 5757
2455 5757 3827 5139 699 -2025 -7855 -7008 -3405 -9317 -9399 -2932 66 -9145 -13416 -8640 -2641 1442
2439 1442 2342 6037 3211 1777 6057 -3185 -7586 -10888 -13372 -4964 4036 519 1252 -7141 -19884
2424 -19884 -18855 -352 4406 306 2011 -752 -6768 -774 8670 3053 492 1709 597 2943
2410 2943 3098 6764 10398 6876 -2643 -7421 -5970 1481 7164 4648 9944 8760 12791 15509 16683
2395 16683 15943 19816 24600 27329 20114 21586 16184 3959 8080 15162 17371 14854 8158 5323 8554
2380 8554 10391 12954 16012 26620 19380 13955 10028 5555 1476 -4751 -7641 -8886 3659 9366
2366 9366 14016 9254 6667 6297 -8759 -15063 -7268 -7690 -7480 -10736 -11572 -6270 -4802 -5263 -3263 8720
2350H720J41o274j1937M766M720p255o428m228O708J5211R125N94j3430r911m750
2335a4228L209n56J1174l246j0943N075K926K912J0015L258l04r150K528r267
2321f597J072p123N80K84O930N404O18M695k770o053L427R420M749L739j2290
2306F085n885L167O031o09o979n096J473K239j228O860J3887o253l377k080N553
2291A3788J3569M702j5466r489N392O378k893m643l16k103l906L78l791l290q387
2276a0077o247J0206M559Q01M733K925K850k004m452R701L244J953m569J425L537
2261A8585j0982M116J280j0833O01j092R416O642p445j3698j882N879O722J277
2247H586j261K145r001j4377l74Q738J508o678l423J3081k539q296K74l400O412
$$ plain form
2350 8720 8861 2587 -9350 -4584 136 -7119 -13547 -17775 -11067 4144 13269 13863 433 -9478 -14228
2335 -14228 -11019 -11575 -401 -3647 -14590 -9515 -6589 -3677 6338 9596 9292 142 2670 -6597
2321 -6597 -5525 -12648 -12068 -11784 -4854 550 1168 5863 3093 -2960 467 9887 14636 18375 6085
2306 6085 200 3367 9398 8789 1810 -3286 -1813 426 -802 6058 19945 13692 10315 8235 13788
2291 13788 27357 32059 16593 7104 12496 18874 15981 11338 11022 8919 5013 5391 1600 -1690 -10077
2276 -10077 -16324 -6118 -1559 -758 3975 6900 9750 7746 3294 12995 16239 18192 13623 15048 18585
2261 18585 7603 11719 12999 2166 2767 1675 11091 17733 10288 -3410 -5292 587 7309 8586
2247 8586 7325 9470 469 -13908 -14282 -5544 -4036 -10714 -14137 -1056 -3595 -11891 -11617 -15017 -8605
2232h605P556P717O985k82l371k095k937J47p872l400l793R139N983J64M727K357
2216A2420l297m793M244m709J101L551m038P652l20m523l740q709J4013N031j6163
2201b280M268k545j227M209m144l074Q893j239m306J536O643M235n868m071J70
2186A200n637N583L509n744M447L796P637m249l044O838L016p949Q08P180R154
2171B6545j835j1398j5667k772P995R126o067n866p909Q771Q583O488J361l52
2157A7003L46K818J241q051P029j516K818O809m493o752k817m975M137j0048j1798
2142h249Q37L853k71L534j057l530R71N900J527J483m798O309q0M582L281m265
2126A0027q271k922j573M053Q038l482r243k463K55O50N620P882j202l147r074
$$ plain form
2232 -8605 -1049 6668 13653 13371 10000 7905 4968 5115 -2757 -6157 -9950 -811 5172 5336 10063 12420
2216 12420 9123 4330 8574 3865 4966 8517 4479 12131 11811 7288 3548 -5161 8852 13883 -2280
2201 -2280 1988 -557 -1784 2425 -1719 -4793 4100 2861 -1445 91 6734 10969 5101 1030 1200
2186 1200 -4437 1146 4655 -1089 3358 7154 14791 10542 7498 14336 17352 9403 10211 17391 26545
2171 26545 24710 13312 -2355 -5127 2868 11994 5927 61 -7848 923 9506 15994 17355 17003
2157 17003 17349 20167 21408 13357 20386 18870 21688 28497 24004 17252 14435 9460 13597 3549 -8249
2142 -8249 -7412 -3559 -3830 -296 -1353 -4883 -3912 1988 3515 4998 200 6509 6429 11011 14292 10027
2126 10027 1756 -1166 -2739 1314 9352 5870 -3373 -5836 -5581 -4931 689 8571 7369 4222 -4852
2111d852J143O000J1072l147n164M013Q38j892j716m90n78q389l866r34j2565
2096b0527n72J0833R932q87K651q53Q05k562j3002J849J4783q858o424M613N784
2081b435j0954L947O097k093L279R803J1737q22m656j0603J433n676l675J730
$$ plain form
2111 -4852 -3709 2291 13363 10216 5052 9065 9903 8011 6295 5805 5227 -3162 -7028 -7962 -20527
2096 -20527 -21099 -10266 -334 -1221 1430 577 1382 -1180 -14182 -12333 2450 -6408 -12832 -8219 -2435
2081 -2435 -13389 -9442 -3345 -5438 -2159 7644 19381 18559 13903 3300 4733 -943 -4618 -2888
$$ [...]
##END NTUPLES=NMR SPECTRUM
##END=
