##TITLE=Analysis number 318648
Compound Code mo 07101
Project Code adrs
Chemist Name vekton
##JCAMPDX= 6.0         $$ Bruker NMR JCAMP-DX V2.0
##DATA TYPE= NMR SPECTRUM
##DATA CLASS= NTUPLES
##ORIGIN= Bruker BioSpin GmbH
##OWNER= nmr
$$ XWIN-NMR		Version 3.5
$$ Fri Apr  7 08:27:30 2006 GMT Daylight Time (UT+1h)  MAYBRIDGE\nmr@NMR_250MHZ
##.OBSERVE FREQUENCY= 250.131544655141
##.OBSERVE NUCLEUS= ^1H
##.ACQUISITION MODE= SIMULTANEOUS (DQD)
##.ACQUISITION SCHEME= undefined
##.AVERAGES= 16
##.DIGITISER RES= 18
##SPECTROMETER/DATA SYSTEM= dpx250
##.PULSE SEQUENCE= zg30
##.SOLVENT NAME= DMSO
##.SHIFT REFERENCE= (INTERNAL, DMSO, 0, 16.522)
##AUDIT TRAIL= $$ (NUMBER, WHEN, WHO, WHERE, WHAT)
$$ ##TITLE= Audit trail, XWIN-NMR		Version 3.5
$$ ##JCAMPDX= 5.01
$$ ##ORIGIN= Bruker BioSpin GmbH
$$ ##OWNER= nmr
$$ C:\u/data/dgb/nmr/ADRS/2320/pdata/1/auditp.txt
$$ ##AUDIT TRAIL=  $$ (NUMBER, WHEN, WHO, WHERE, WHAT)
(   1,<2006-04-07 08:27:03.72 +100>,<MAYBRIDGE\nmr>,<NMR_250MHZ>,
      <created by zg, POWCHK disabled, PULCHK disabled
       configuration hash MD5:
       84 BC 41 DB A1 6E 1D 46 DA 25 12 A5 C1 ED C5 3A
       data hash MD5: 64K
       5F FD E4 61 A9 76 87 17 82 AE 05 17 3E 24 08 C4>)
(   2,<2006-04-07 08:27:20.50 +100>,<MAYBRIDGE\nmr>,<NMR_250MHZ>,
      <Start of raw data processing
       ef LB = 0.3 FT_mod = 6 PKNL = 1 SI = 32K 
       data hash MD5: 32K
       AB 6F 41 A0 4E FE 30 FF 54 A1 44 2E 77 A7 44 EB>)
(   3,<2006-04-07 08:27:22.12 +100>,<MAYBRIDGE\nmr>,<NMR_250MHZ>,
      <apk 
       data hash MD5: 32K
       F0 38 6A 23 3A A7 1E FB AF 17 02 6D 27 FD 0E E1>)
(   4,<2006-04-07 08:27:22.90 +100>,<MAYBRIDGE\nmr>,<NMR_250MHZ>,
      <abs ABSG = 5 
       data hash MD5: 32K
       A0 B5 C9 EC CE 71 84 A2 42 7B 39 D7 4A 72 D4 FA>)
$$ ##END=
$$ 
$$ hash MD5
$$ C1 08 4B EC 5C B2 DF 85 C5 69 23 48 D1 16 C9 FD
##$RELAX= 
##$RELAX= 
##$RELAX= 
##$RELAX= 
##$RELAX= 
##$RELAX= 
##$RELAX= 
$$ Bruker specific parameters
$$ --------------------------
##$DU= <C:\u>
##$EXPNO= 2320
##$NAME= <ADRS>
##$PROCNO= 1
##$TYPE= <nmr>
##$USER= <dgb>
##$AMP= (0..31)
100 100 100 100 100 100 100 100 100 100 100 100 100 100 100 100 100 100 
100 100 100 100 100 100 100 100 100 100 100 100 100 100 
##$AQSEQ= 0
##$AQ_mod= 3
##$AUNM= <au_zg>
##$AUTOPOS= <45 >
##$BF1= 250.13
##$BF2= 250.13
##$BF3= 250.13
##$BF4= 250.13
##$BF5= 500.13
##$BF6= 500.13
##$BF7= 500.13
##$BF8= 500.13
##$BYTORDA= 1
##$CFDGTYP= 0
##$CFRGTYP= 5
##$CHEMSTR= <none>
##$CNST= (0..31)
1 1 145 1 1 1 1 1 1 1 1 1 1 1 1 1 1 1 1 1 1 1 1 1 1 1 1 1 1 1 1 1 
##$CPDPRG= <>
##$CPDPRG1= <>
##$CPDPRG2= <>
##$CPDPRG3= <>
##$CPDPRG4= <mlev>
##$CPDPRG5= <mlev>
##$CPDPRG6= <mlev>
##$CPDPRG7= <mlev>
##$CPDPRG8= <mlev>
##$CPDPRGB= <>
##$CPDPRGT= <>
##$D= (0..31)
0 1 0 0 0 0 0 0 0 0.06 0 0 0 0 0 0 0.0002 0 0 0 0 0 0 0 0 0 0 0 0 0 0 
0 
##$DATE= 1144394822
##$DBL= (0..7)
120 120 120 120 120 120 120 120 
##$DBP= (0..7)
150 150 150 150 150 150 150 150 
##$DBP07= 0
##$DBPNAM0= <>
##$DBPNAM1= <>
##$DBPNAM2= <>
##$DBPNAM3= <>
$$ [...]
##$SUBNAM7= <"">
##$SUBNAM8= <"">
##$SUBNAM9= <"">
##$SW= 20.6930455092707
##$SWIBOX= (0..15)
0 0 3 0 0 0 0 0 0 0 0 0 0 0 0 0 
##$SW_h= 5175.983436853
##$TD= 65536
##$TD0= 1
##$TE= 294.16
##$TE2= 300
##$TE3= 300
##$TEG= 300
##$TL= (0..7)
0 120 120 120 120 120 120 120 
##$TP= (0..7)
150 150 150 150 150 150 150 150 
##$TP07= 0
##$TPNAME0= <>
##$TPNAME1= <>
##$TPNAME2= <>
##$TPNAME3= <>
##$TPNAME4= <>
##$TPNAME5= <>
##$TPNAME6= <>
##$TPNAME7= <>
##$TPOAL= (0..7)
0.5 0.5 0.5 0.5 0.5 0.5 0.5 0.5 
##$TPOFFS= (0..7)
0 0 0 0 0 0 0 0 
##$TUNHIN= 0
##$TUNHOUT= 0
##$TUNXOUT= 0
##$USERA1= <user>
##$USERA2= <user>
##$USERA3= <user>
##$USERA4= <user>
##$USERA5= <user>
##$V9= 5
##$VALIST= <valist>
##$VCLIST= <CCCCCCCCCCCCCCC>
##$VD= 0
##$VDLIST= <DDDDDDDDDDDDDDD>
##$VPLIST= <PPPPPPPPPPPPPPP>
##$VTLIST= <TTTTTTTTTTTTTTT>
##$WBST= 1024
##$WBSW= 4
##$XGAIN= (0..3)
0 0 0 0 
##$XL= 0
##$YL= 0
##$YMAX_a= 434072
##$YMIN_a= -602776
##$ZGOPTNS= <>
##$ZL1= 120
##$ZL2= 120
##$ZL3= 120
##$ZL4= 120
##$ABSF1= 16.522
##$ABSF2= -4.171173
##$ABSG= 5
##$ABSL= 3
##$ALPHA= 0
##$AQORDER= 0
##$ASSFAC= 0
##$ASSFACI= 0
##$ASSFACX= 0
##$ASSWID= 0
##$AUNMP= <proc_1d>
##$AZFE= 0.1
##$AZFW= 0.1
##$BCFW= 0
##$BC_mod= 0
##$BYTORDP= 0
##$COROFFS= 0
##$CY= 12.5
##$DATMOD= 1
##$DC= 0
##$DFILT= <>
##$DTYPP= 0
##$F1P= 14.0000005364418
##$F2P= -0.99999901652339
##$FCOR= 0.5
##$FTSIZE= 32768
##$FT_mod= 6
##$GAMMA= 0
##$GB= 0
##$INTBC= 1
##$INTSCL= 1
##$ISEN= 128
##$LB= 0.3
##$LEV0= 0
##$LPBIN= 0
##$MAXI= 10000
##$MC2= 0
##$MEAN= 0
##$ME_mod= 0
##$MI= 0
##$NCOEF= 0
##$NC_proc= -3
##$NLEV= 6
##$NOISF1= 0
##$NOISF2= 0
##$NSP= 0
##$NTH_PI= 0
##$NZP= 0
##$OFFSET= 16.522
##$PC= 1
##$PHC0= 161.9182
##$PHC1= 12.57962
##$PH_mod= 1
##$PKNL= yes
##$PPARMOD= 0
##$PSCAL= 4
##$PSIGN= 0
##$REVERSE= no
##$SF= 250.13
##$SI= 32768
##$SIGF1= 0
##$SIGF2= 0
##$SINO= 400
##$SIOLD= 32768
##$SREGLST= <1H.DMSO>
##$SSB= 0
##$STSI= 32768
##$STSR= 0
##$SW_p= 5175.98343685301
##$SYMM= 0
##$S_DEV= 0
##$TDeff= 65536
##$TDoff= 0
##$TI= <Analysis number 999999
Compound Code 99
Book Reference 9
Project Code 9>
##$TILT= no
##$TM1= 0
##$TM2= 0
##$TOPLEV= 0
##$USERP1= <user>
##$USERP2= <user>
##$USERP3= <user>
##$USERP4= <user>
##$USERP5= <user>
##$WDW= 1
##$XDIM= 32768
##$YMAX_p= 279880245
##$YMIN_p= -174928
$$ End of Bruker specific parameters
$$ ---------------------------------
##NTUPLES= NMR SPECTRUM
##VAR_NAME=  FREQUENCY,     SPECTRUM/REAL,   SPECTRUM/IMAG
##SYMBOL=    X,             R,               I
##VAR_TYPE=  INDEPENDENT,   DEPENDENT,       DEPENDENT
##VAR_FORM=  AFFN,          ASDF,            ASDF
##VAR_DIM=   32768,         32768,           32768
##UNITS=     HZ,            ARBITRARY UNITS, ARBITRARY UNITS
##FACTOR=    0.157963299565203, 1,           1
##FIRST=     4132.6476996994, 0,             0
##LAST=      -1043.33573715361, 0,           0
##MIN=       -1043.33573715361, -174928,     0
##MAX=       4132.6476996994, 279880245,     0
$$ Real data points
##PAGE= N=1
##DATA TABLE= (X++(R..R)), XYDATA
$$ [...]
$$ plain form
18042 889993 877494 937829 990931 1012275 1032301 1005120 1019042 1043857 1051652 1112678 1153755 1246371
18030 1246371 1349465 1452643 1563501 1681050 1875964 2096882 2436831 2838825 3365404
18021 3365404 4112089 5142181 6571266 8365344 10529707 12907772 15238055 17404104
18013 17404104 18914775 19212455 18347201 16666495 14314211 11648010 9342277 7608046
18005 7608046 6366157 5536837 4958577 4548346 4221869 3933098 3738003 3577969 3462922
17996 3462922 3353731 3282098 3257201 3251158 3242304 3214250 3211004 3240101 3230998 3265763 3299814 3302294
17984 3302294 3345378 3398429 3521535 3629087 3840743 4145648 4428250 4853966 5413371 6087574
17974 6087574 6925468 8109372 9742301 11980283 14950201 18651095 22925301 27649653
$$ packed form
18042H89993j2499O0335N3102K1344K0026k7181J3922K4815P795O1026M1077R2616
18030A246371J03094J03178J10858J17549J94914K20918L39949M01994N26579
18021C365404P46685J030092J429085J794078K164363K378065K330283K166049
18013A7404104J510671K97680q65254j680706k352284k666201k305733j734231
18005G608046j241889q29320n78260m10231l26477k88771j95095j60034j15047
17996C462922j09191p1633k4897o043q854k8054l246K9097r103L4765L4051K480
17984C302294M3084N3051J23106J07552K11656L04905K82602M25716N59405O74203
17974F087574Q37894J183904J632929K237982K969918L700894M274206M724352
$$ plain form
17966 27649653 32522302 36675387 39441898 40792167 40455595 37953329 33924509 29376981
17958 29376981 24698424 20263696 16629235 13861774 11817956 10402612 9317608 8451570
17950 8451570 7795060 7254691 6856862 6533405 6255452 6027494 5833675 5609597 5447564
17941 5447564 5355157 5291595 5182721 5068394 5009542 4989388 4979061 4931196 4894580 4935843 4950386
17930 4950386 4989745 5058774 5178229 5324097 5565635 5865592 6316190 6936747 7857202 9163178
17920 9163178 11005734 13459028 16408763 19497630 22573620 25391116 27194363 27304205
17912 27304205 25971413 23498219 20083630 16378293 13253646 10912752 9221130 8012254
17904 8012254 7155616 6514355 5975252 5497892 5147285 4852528 4563789 4316584 4164934
$$ packed form
17966B7649653M872649M153085K766511J350269l36572k502266m028820m547528
17958B9376981m678557m434728l634461k767461k043818j415344j085004q66038
17950H451570o56510n40369l97829l23457k77953k27958j93819k24078j62033
17941E447564r2407o3562j08874j14327n8852k0154j0327m7865l6616M1263J4543
17930D950386L9359O9029J19455J45868K41538K99957M50598O20557R20455J305976
17920I163178J842556K453294K949735L088867L075990K817496J803247J09842
17912B7304205j332792k473194l414589l705337l124647k340894j691622j208876
17904H012254q56638o41261n39103m77360l50607k94757k88739k47205j51650
$$ plain form
17895 4164934 4024112 3866555 3676351 3506981 3425067 3347932 3301804 3254414 3224956 3197876
17885 3197876 3116269 3029358 2958839 2895781 2764006 2636532 2534302 2423918 2368598 2348303
17875 2348303 2294127 2203636 2165928 2075054 2011841 1904616 1864608 1868743 1854167 1820020 1831533
17864 1831533 1792692 1694747 1652396 1570762 1477991 1462759 1461066 1425262 1417272 1430534 1441489 1450902
17852 1450902 1396297 1379758 1361784 1337854 1335371 1313833 1271294 1225919 1239485 1259665 1230364
17841 1230364 1192269 1169097 1143128 1064228 1031286 1090304 1079428 1086609 1101457 1082900 1043046
17830 1043046 1035323 1025613 945822 910751 883889 852180 805823 785522 790352 792331 805628 810317
17818 810317 803324 718363 669714 670707 666789 640023 691417 722275 696727 666281 649335 635956
$$ packed form
17895D164934j40822j57557j90204j69370q1914p7135m6128m7390k9458k7080
17885C197876q1607q6911p0519o3058j31775j27474j02230j10384n5320k0295
17875B348303n4176r0491l7708r0874o3213j07225m0008M135j4576l4147J1513
17864A831533l8841r7945m2351q1634r2771j5232j693l5804p990J3262J0955R413
17852A450902n4605j6539j7974k3930k483k1538m2539m5375J3566K0180k9301
17841A230364l8095k3172k5969p8900l2942N9018j0876P181J4848j8557l9854
17830A043046p723r710p9791l5071k6862l1709m6357k0301M830J979J3297M689
17818H10317o993q4961m8649R93l918k6766N1394L0858k5548l0446j6946j3379
$$ plain form
17806 635956 624017 675522 706423 661938 677713 689173 672099 625232 628787 693548 726115 715323
17794 715323 695467 718457 705750 676066 646473 626379 591152 548981 556444 595961 619781 613945
17782 613945 582471 523806 484255 469718 510220 577297 588751 550090 532778 518331 538904
17771 538904 554152 518426 495446 535805 507085 450418 410860 365277 361100 389814 383110 376137
17759 376137 409987 420071 449717 490008 488341 509945 512903 494602 482112 457807 438217 421669
17747 421669 402991 444169 440919 432173 441092 470266 483698 499080 461813 417765 422779 433671
17735 433671 473318 500804 524761 469086 460057 452437 465456 450140 437059 451134 460033 449600
17723 449600 407949 367439 393428 396312 383057 375370 362278 349750 376012 420322 446266 503718
$$ packed form
17806F35956j1939N1505L0901m4485J5775J1460j7074m6867L555O4761L2567j0792
17794G15323j9856K2990j2707k9684k9593k0094l5227m2171P463L9517K3820n836
17782F13945l1474n8665l9551j4537M0502O7077J1454l8661j7312j4447K0573
17771E38904J5248l5726k2980M0359k8720n6667l9558m5583m177K8714o704o973
17759C76137L3850J0084K9646M0291j667K1604K958j8301j2490k4305j9590j6548
17747D21669j8678M1178l250q746Q919K9174J3432J5382l7267m4048N014J0892
17735D33671L9647K7486K3957n5675r029p620J3019j5316j3081J4075Q899j0433
17723D49600m1651m0510K5989K884j3255p687j3092j2528K6262M4310K5944N7452
$$ plain form
17711 503718 492188 427393 449716 494655 525728 470687 452472 449297 441454 478560 462029 458283
17699 458283 476372 511371 512366 526577 549007 610756 645765 615548 598323 608669 674419 642295
17687 642295 587830 606200 588046 597726 627764 625601 620009 643965 635186 619168 651171 685424
17675 685424 648265 593689 539461 536481 528104 545526 557176 585312 571893 549557 481485 459667
17663 459667 453594 437570 464691 507495 519893 482776 475341 497231 497908 510348 498790 482025
17651 482025 466230 520777 582097 592999 570915 532501 535030 497904 471153 492763 512760 532356
17639 532356 571647 594930 557527 509967 524911 558256 646938 658845 633248 620796 646805
17628 646805 673058 683567 703970 712821 680939 712167 730343 771707 763810 773940 786417 836179
$$ packed form
17711E03718j1530o4795K2323M4939L1073n5041j8215l175p843L7106j6531l746
17699D58283J8089L4999R95J4211K2430O1749L5009l0217j7225J0346O5750l2124
17687F42295n4465J8370j8154R680L0038k163n592K3956q779j6018L2003L4253
17675F85424l7159n4576n4228k980q377J7422J1650K8136j3419k2336o8072k1818
17663D59667o073j6024K7121M2804J2398l7117p435K1890O77J2440j1558j6765
17651D82025j5795N4547O1320J0902k2084l8414K529l7126k6751K1610J9997J9596
17639E32356L9291K3283l7403m7560J4944L3345Q8682J1907k5597j2452K6009
17628F46805K6253J0509K0403Q851l1882L1228J8176M1364p897J0130J2477M9762
$$ plain form
17616 836179 887067 869558 886616 937236 955531 976806 998218 1028047 1097920 1180895 1218956
17605 1218956 1312681 1395972 1429207 1487054 1574455 1746186 1899982 2054057 2236658 2405110
17595 2405110 2644140 2879878 3151012 3454574 3852038 4372035 5016799 5951592 7145831
17586 7145831 8801440 10961724 13511997 16275051 19256313 22260766 24492415 25539634
17578 25539634 25876944 25706905 24909103 24348851 25009598 26956243 29840695 33599930 37760720
17569 37760720 41075871 42974496 44080714 44255423 42558223 39565169 36615595 33980796
17561 33980796 31428540 29672660 29319631 29963219 31121895 32700091 34012188 33634536
17553 33634536 31555152 28746671 25341063 21450890 17940732 15312034 13420112 11978931
$$ packed form
17616H36179N0888j7509J7058N0620J8295K1275K1412K9829O9873Q2975L8061
17605A218956R3725Q3291L3235N7847Q7401J71731J53796J54075J82601J68452
17595B405110K39030K35738K71134L03562L97464N19997O44764R34793J194239
17586G145831J655609K160284K550273K763054K981262L004453K231649J047219
17578B5539634L37310j70039p97802n60252O60747J946645K884452L759235M160790
17569C7760720L315151J898625J106218J74709j697200k993054k949574k634799
17561C3980796k552256j755880l53029O43588J158676J578196J312097l77652
17553C3634536k079384k808481l405608l890173l510158k628698j891922j441181
$$ plain form
17545 11978931 10953324 10113055 9385109 8822060 8326719 7918149 7597022 7298094 6990736
17536 6990736 6704011 6474089 6233147 5977746 5714014 5473306 5305306 5139953 4945149
17527 4945149 4783068 4645436 4540500 4421589 4314719 4229357 4133590 3987939 3860015 3750052
17517 3750052 3627360 3487884 3370566 3350419 3263208 3158426 3074433 3026914 2975020 2966048 2964706
17506 2964706 2901425 2853879 2767790 2688598 2603352 2530283 2505947 2509790 2470270 2469554 2478130 2451263
17494 2451263 2423613 2387031 2338725 2298463 2274508 2287716 2260956 2189405 2121279 2090985 2058076
17483 2058076 2004814 1950408 1920265 1915497 1924685 1894056 1889501 1856376 1880787 1908890 1927032 1914274
17471 1914274 1928484 1955604 1963538 1922627 1908117 1899669 1925657 1936481 1919617 1908644 1920409 1952712
$$ packed form
17545A1978931j025607q40269p27946n63049m95341m08570l21127k98928l07358
17536F990736k86725k29922k40942k55401k63732k40708j68000j65353j94804
17527D945149j62081j37632j04936j18911j06870q5362r5767j45651j27924j09963
17517C750052j22692j39476j17318k0147q7211j04782q3993m7519n1894q972j342
17506B964706o3281m7546q6089p9192q5246p3069k4336L843l9520p16Q576k6867
17494B451263k7650l6582m8306m0262k3955J3208k6760p1551o8126l0294l2909
17483B058076n3262n4406l0143m768R188l0629m555l3125K4411K8103J8142j2758
17471A914274J4210K7120P934m0911j4510q448K5988J0824j6864j0973J1765L2303
$$ plain form
17459 1952712 2055668 2100212 2129882 2209320 2273054 2291377 2305597 2344697 2458075 2539861 2570360
17448 2570360 2693818 2862583 3005349 3153812 3388064 3690332 4064598 4460949 4916162
17439 4916162 5540897 6412972 7695744 9449907 11655019 13963979 16046981 18167197
17431 18167197 20467685 22203854 22940356 23494845 24327417 25521037 27345186 29240830
17423 29240830 29454741 27971177 26601784 25885969 25066237 23929648 22870359 22039634 21521802
17414 21521802 21253710 20403800 18107929 15177292 12687742 10950150 9759347 8904646
17406 8904646 8283634 7779046 7421355 7127361 6881380 6688120 6497805 6372387 6307411 6276962
17396 6276962 6276059 6342452 6458209 6653101 6898763 7328789 8036084 9066523 10565080 12496064
$$ packed form
17459A952712J02956M4544K9670P9438O3734J8323J4220L9100J13378Q1786L0499
17448B570360J23458J68765J42766J48463K34252L02268L74266L96351M55213
17439D916162O24735Q72075J282772J754163K205112K308960K083002K120216
17431A8167197K300488J736169P36502N54489Q32572J193620J824149J895644
17423B9240830K13911j483564j369393p15815q19732j136589j059289q30725n17832
17414B1521802k68092q49910k295871k930637k489550j737592j190803q54701
17406H904646o21012n04588l57691k93994k45981j93260j90315j25418o4976l0449
17396F276962r03O6393J15757J94892K45662M30026P07295J030439J498557J930984
$$ plain form
17386 12496064 14436061 16136838 17883766 19851510 21158918 21373452 21401104 21821589 22722239
17377 22722239 24300783 25694766 25706938 24649184 23892552 23564933 22725506 21365379 20159848
17368 20159848 19287069 18725645 18402274 17538864 15445851 12899622 10847191 9414136 8395000
17359 8395000 7643628 7079344 6609109 6227828 5932259 5683030 5470867 5295842 5097230
17350 5097230 4870274 4701552 4532039 4328185 4160946 4018370 3913085 3808702 3688407
17341 3688407 3589268 3502726 3410706 3325540 3272305 3197467 3068423 2941600 2867851 2807125 2758245
17330 2758245 2718264 2648044 2601561 2529870 2538097 2567997 2521182 2470602 2428219 2351602 2304122
17319 2304122 2258099 2219515 2240893 2259994 2253608 2215413 2184836 2140305 2133729 2113200 2078413 2056081
$$ packed form
17386A2496064J939997J700777J746928J967744J307408K14534K7652M20485R00650
17377B2722239J578544J393983J2172j057754p56632l27619q39427j360127j205531
17368B0159848q72779n61424l23371q63410k093013k546229k052431j433055j019136
17359H395000p51372n64284m70235l81281k95569k49229k12163j75025j98612
17350E097230k26956j68722j69513k03854j67239j42576j05285j04383j20295
17341C688407r9139q6542r2020q5166n3235p4838j29044j26823p3749o0726m8880
17330B758245l9981p0220m6483p1691Q227K9900m6815n0580m2383p6617m7480
17319B304122m6023l8584K1378J9101o386l8195l0577m4531o576k0529l4787k2332
$$ plain form
17307 2056081 2023000 1959524 1930084 1939405 1923167 1922922 1887670 1871634 1880068 1862618 1855073 1851122
17295 1851122 1859615 1859391 1845933 1810693 1773601 1765555 1752337 1761443 1760953 1804529 1818454 1828329 1882004
17282 1882004 1888850 1872727 1863154 1904300 1963136 2020844 2077333 2158461 2249004 2405996 2563129
17271 2563129 2726132 2912053 3097839 3357888 3695537 4143621 4669443 5415177 6460842
17262 6460842 7908315 9845585 12145955 14370135 16350637 18392935 20249530 21069078
17254 21069078 20956783 20755308 20670634 20899016 21495537 21637824 20559365 19182143 18640162
17245 18640162 18979348 19635304 20412100 21481182 22299200 22162450 21447699 20682136 20047627
17236 20047627 19690086 19396943 18257079 15901040 13265645 11167097 9645292 8592206
$$ packed form
17307B056081l3081o3476k9440R321j6238k45l5252j6036Q434j7450p545l951
17295A851122Q493k24j3458l5240l7092q046j3218R106m90M3576J3925R875N3675
17282A882004O846j6123r573M1146N8836N7708N6489Q1128R0543J56992J57133
17271B563129J63003J85921J85786K60049L37649M48084N25822P45734J045665
17262F460842J447473J937270K300370K224180J980502K042298J856595Q19548
17254B1069078j12295k01475q4674K28382N96521J42287j078459j377222n41981
17245A8640162L39186O55956P76796J069082Q18018j36750p14751p65563o34509
17236B0047627l57541k93143j139864k356039k635395k098548j521805j053086
$$ plain form
17228 8592206 7850991 7304700 6858614 6523584 6347576 6186251 5999306 5919360 5842536 5730814
17218 5730814 5715496 5805275 5987415 6244852 6539587 7030859 7851927 9040906 10703573
17209 10703573 12676616 14569153 16214786 17988480 19658374 20300195 19938053 19444179
17201 19444179 19183039 19256008 19584643 19582141 18769776 17709404 17290820 17642529 18232859 18920497
17191 18920497 19847311 20690844 20525592 19540826 18564307 17850029 17447017 17183647 16358610
17182 16358610 14428644 12094070 10145518 8743710 7769247 7026987 6456655 6001458 5645238
17173 5645238 5366841 5131558 4861745 4652588 4448560 4268775 4124600 3930578 3781761
17164 3781761 3675145 3557513 3466990 3364526 3238762 3126708 3031533 2931213 2863187 2788776
$$ packed form
17228H592206p41215n46291m46086l35030j76008j61325j86945p9946p6824j11722
17218E730814j5318Q9779J82140K57437K94735M91272Q21068J188979J662667
17209A0703573J973043J892537J645633J773694J669894O41821l62142m93874
17201A9444179k61140P2969L28635k502q12365j060372m18584L51709N90330O87638
17191A8920497R26814Q43533j65252r84766r76519p14278m03012k63370q25037
17182A6358610j929966k334574j948552j401808r74463p42260n70332m55197l56220
17173E645238k78397k35283k69813k09157k04028j79785j44175j94022j48817
17164C781761j06616j17632r0523j02464j25764j12054r5175j00320o8026p4411
$$ plain form
17154 2788776 2702749 2600154 2522636 2440397 2376959 2333815 2278317 2237460 2147020 2115226 2082501
17143 2082501 2051939 1984338 1927186 1875815 1854014 1807819 1757531 1754006 1725036 1677795 1689414
17132 1689414 1658086 1676220 1653044 1609890 1568190 1546942 1551611 1521777 1471618 1436786 1421691
17121 1421691 1371780 1364931 1276310 1225098 1222628 1228656 1229651 1214910 1245033 1261451 1201649 1138884
17109 1138884 1058602 990134 977539 969773 927276 879130 893501 926532 857751 803838 830027
17098 830027 869623 878251 823470 795845 771804 739485 711397 741472 766894 727888 713037 721074
17086 721074 726200 723692 752715 754881 708721 718901 754811 745894 748897 756000 772871 810171 766218
17073 766218 764283 745388 761462 776532 728852 728662 759298 728176 733415 758154 769139 731075
$$ packed form
17154B788776q6027j02595p7518q2239o3438m3144n5498m0857r0440l1794l2725
17143B082501l0562o7601n7152n1371k1801m6195n0288l525k8970m7241J1619
17132A689414l1328J8134k3176m3154m1700k1248M669k9834n0159l4832j5095
17121A421691m9911o849q8621n1212k470O028R95j4741L0123J6418n9802o2765
17109A138884q0282o8468j2595p766m2497m8146J4371L3031o8781n3913K6189
17098H30027L9596Q628n4781k7625k4041l2319k8088L0075K5422l9006j4851Q037
17086G21074N126k508K9023K166m6160J0180L5910q917L003P103J6871L7300m3953
17073G66218j935j8895J6074J5070m7680j90L0636l1122N239K4739J0985l8064
$$ plain form
17061 731075 711571 678396 669293 658728 620934 555577 512974 569852 613733 587648 537192 546823
17049 546823 531523 481751 431633 418110 442902 436804 399024 324761 341760 347060 352085 354469
17037 354469 330118 324055 367073 346255 339945 344226 307910 308822 338280 349326 320297 300894
17025 300894 284156 332673 332944 277872 244840 261876 266392 245210 208332 232183 229865 178995
17013 178995 122203 139856 127010 135798 187688 225134 217152 130142 115531 140620 142355 132000
17001 132000 150244 190512 200245 171773 193794 201892 191903 166766 148541 132613 103249 130829
16989 130829 145165 126099 133080 131583 95337 92127 78954 50133 73539 91346 79446 134044
16977 134044 168138 174248 116153 69659 67408 58244 83275 84392 58423 61311 10837 -21910
$$ packed form
17061G31075j9504l3175r103j0565l7794o5357m2603N6878M3881k6085n0456R631
17049E46823j5300m9772n0118j3523K4792o098l7780p4263J6999N300N025K384
17037C54469k4351o063M3018k0818o310M281l6316R12K9458J1046k9029j9403
17025C00894j6738M8517K71n5072l3032J7036M516k1182l6878K3851k318n0870
17013A78995n6792J7653j2846Q788N1890L7446p982q7010j4611K5089J735j0355
17001A32000J8244M0268R733k8472K2021Q098r989k5137j8225j5928k9364K7580
16989A30829J4336j9066O981j497l6246l210j3173k8821K3406J7807j1900N4598
16977A34044L4094O110n8095m6494k251r164K5031J117k5969K888n0474l2747
$$ plain form
16965 -21910 14520 54291 62078 32419 50298 86940 123333 136242 129253 70278 38902 39596
16953 39596 81246 94460 79138 57515 42703 38309 45788 49887 105754 93768 70310 59807
16941 59807 70163 53847 75978 108613 100717 46045 20696 21908 43784 66082 70358 50516
16929 50516 39668 27418 3253 31148 32464 -19611 13229 26779 45430 92377 105481 113041
16917 113041 105301 106190 99625 99614 77140 87107 120404 121149 103275 101100 81509 79617 93658 83587
16903 83587 92082 120744 121936 99825 73163 64919 58302 67498 64890 42663 55492 67626 42833
16890 42833 4479 -55403 -55194 -31859 -15792 -1908 1962 -785 11737 34522 30374 9894 -10814
16877 -10814 -2262 -18223 18752 47953 38281 70154 114556 119213 108876 84880 88603 108396
$$ packed form
16965b1910L6430L9771P787k9659J7879L6642L6393J2909o989n8975l1376O94
16953C9596M1650J3214j5322k1623j4812m394P479M099N5867j1986k3458j0503
16941E9807J0356j6316K2131L2635p896n4672k5349J212K1876K2298M276j9842
16929E0516j0848j2250k4165K7895J316n2075L2840J3550J8651M6947J3104P560
16917A13041p740Q89o565j1k2474R967L3297P45j7874k175j9591j892J4041j0071
16903H3587Q495K8662J192k2111k6662q244o617R196k608k2227J2829J2134k4793
16890D2833l8354n9882K09K3335J6067J3884L870k747J2522K2785m148k0480k0708
16877a0814Q552j5961L6975K9201r672L1873M4402M657j0337k3996L723J9793
$$ plain form
16865 108396 112068 77546 70861 60478 95282 139339 138594 156444 146818 146323 109056 75405 45070
16852 45070 21209 13204 54468 49142 39799 39291 46168 44543 12099 -17145 5139 -32327 -86370
16839 -86370 -44268 5715 -22044 -37071 -59751 -39628 42115 69943 87754 80743 61038 64479
16827 64479 45322 47366 63040 21712 -40378 -77667 -61578 -52191 -13511 -24846 -41133 -27594
16815 -27594 17419 3551 20123 -5874 -4990 -16591 -16025 30444 17068 47020 32732 -55805
16803 -55805 -127772 -161069 -130004 -119587 -102796 -66857 -72655 -88112 -98373 -55656 -10754 -16561
16791 -16561 -12494 -23352 -48925 -71365 -21632 -2552 -20493 -26382 7447 7554 -15214 -30841
16779 -30841 -24597 -25780 -9855 -46454 -67557 -43932 -65910 -102660 -14936 26404 10736 -9500
$$ packed form
16865A08396L672l4522o685j0383L4804M4057p45J7850r626m95l7267l3651l0335
16852D5070k3861q005M1264n326r343n08O877j625l2444k9244K2284l7466n4043
16839h6370M2102M9983k7759j5027k2680K0123Q1743K7828J7811p011j9705L441
16827F4479j9157K044J5674m1328o2090l7289J6089R387L8680j1335j6287J3539
16815b7594M5013j3868J6572k5997Q84j1601N66M6469j3376K9952j4288q8537
16803e5805p1967l3297L1065J0417J6791L5939n798j5457j0261M2717M4902n807
16791a6561M067j0858k5573k2440M9733J9080j7941n889L3829J07k2768j5627
16779c0841O244j183J5925l6599k1103K3625k1978l6750Q7724M1340j5668k0236
$$ plain form
16767 -9500 5058 3694 24721 32907 27638 38985 61959 55601 33140 55075 40782 42652 -7496
16754 -7496 21166 54391 41024 51203 55541 76500 119178 117874 55673 60001 92924 103172
16742 103172 101538 88089 84793 68255 37206 49247 49312 26139 34447 74768 85181 24992 -1051
16729 -1051 9895 11360 14411 24200 4211 14119 -3206 -21401 -26962 28181 65906 3297 -4152
16716 -4152 13169 -13581 11037 15858 42189 34778 9693 -1967 14573 8767 9880 -2464 -12508
16703 -12508 -3886 11833 22077 57478 67832 39352 25667 54369 86176 93363 63940 4977
16691 4977 -12047 -12523 19768 13746 -16681 28307 71353 69758 62796 46360 11591 -37899 -14130
16678 -14130 -37784 -41973 -49451 -45557 -31444 -3664 17295 29966 11124 35944 13731 -25895
$$ packed form
16767i500J4558j364K1027Q186n269J1347K2974o358k2461K1935j4293J870n0148
16754g496K8662L3225j3367J0179M338K0959M2678j304o2201M328L2923J0248
16742A03172j634j3449l296j6538l1049J2041O5k3173Q308M0321J0413o0189k6043
16729a051J0946J465L051R789j9989R908j7325j8195n561N5143L7725o2609p449
16716d152J7321k6750K4618M821K6331p411k5085j1660J6540n806J113j2344j0044
16703a2508Q622J5719J0244L5401J0354k8480j3685K8702L1807P187k9423n8963
16691D977j7024m76L2291o022l0427M4988M3046j595o962j6436l4769m9490K3769
16678a4130k3654m189p478L894J4113K7780K0959J2671j8842K4820k2213l9626
$$ plain form
16666 -25895 2863 8277 -20997 -38546 -51638 -1468 30908 7096 32127 -31931 -62796 -36917
16654 -36917 -13260 -26793 -26030 -27849 13503 26374 15351 19496 41540 18550 -13971 -20806 -14184
16641 -14184 13318 25432 -15738 -19397 -43215 -47794 -44482 -33143 -43236 -48026 -38558 -34202 -50101
16628 -50101 -63439 -70502 -118841 -103106 -33450 -25022 -39616 -22208 -29555 -30312 -51635 -37977 -26175
16615 -26175 -16205 -5736 -15949 2539 12123 11442 -34944 -36703 -25504 -23455 1619 -10274 -5748
16602 -5748 -5381 -62713 -57270 -16358 6807 -22714 -15871 -43126 -67954 -23080 10796 1582 -14619
16589 -14619 -24021 -14881 -8562 -33210 -58156 -27793 -11570 -6335 -59755 -110056 -55870 -78007
16577 -78007 -122597 -100974 -73263 -89153 -78978 -66115 -49562 -52963 -100529 -39180 -12293 -18445
$$ packed form
16666b5895K8758N414k9274j7549j3092N0170L2376k3812K5031o4058l0865K5879
16654c6917K3657j3533P63j819M1352J2871j1023M145K2044k2990l2521o835O622
16641a4184K7502J2114m1170l659k3818m579L312J1339j0093m790R468M356j5899
16628e0101j3338p063m8339J5735O9656Q428j4594J7408p347p57k1323J3658J1802
16615b6175R970J0469j0213J8488R584o81m6386j759J1199K049K5074j1893M526
16602e748L67n7332N443M0912K3165k9521O843k7255k4828M4874L3876r214j6201
16589a4619r402R140O319k4648k4946L0363J6223N235n3420n0301N4186k2137
16577g8007m4590K1623K7711j5890J0175J2863J6553l401m7566O1349K6887o152
$$ plain form
16565 -18445 -36909 -65134 -103144 -99552 -46044 -44210 -35391 -54674 -45446 -46764 -28107 -24667 -53748
16552 -53748 -92734 -125471 -98304 -50650 -21740 24538 60649 53509 21830 19563 -29047 -44040
16540 -44040 -27556 -9624 -18097 -14810 -21682 -4018 9687 -17187 -31764 -32552 -24922 -23847 -88399
16527 -88399 -86702 -96559 -146366 -115375 -95150 -96629 -99034 -73498 -41221 -22964 -31930 -12550 7955
16514 7955 -2513 -8453 -74244 -101202 -69296 -23470 -34803 -59426 -55608 -55658 -86511 -98608 -75845
16501 -75845 -58818 -99620 -118094 -103010 -141778 -140925 -119051 -110355 -116434 -108956 -88734 -81930 -68475
16488 -68475 -49594 -36898 -36672 -99821 -117283 -124800 -96914 -41577 -34784 -40422 -70268 -55158 -41796
16475 -41796 -55085 -18185 -11202 -21281 -39203 -31749 -25709 -31190 -3622 -39882 -65548 -53031
$$ packed form
16565a8445j8464k8225l8010L592N3508J834Q819j9283R228j318J8657L440k9081
16552e3748l8986l2737K7167M7654K8910M6278L6111p140l1679k267m8610j4993
16540d4040J6484J7932q473L287o872J7664J3705k6874j4577p88P630J075o4552
16527h8399J697r857m9807L0991K0225j479k405K5536L2277J8257q966J9380K0505
16514G955j0468n940o5791k6958L1906M5826j1333k4623L818n0l0853j2097K2763
16501g5845J7027m0802j8474J5084l8768Q53K1874Q696o079P478K0222O804J3455
16488f8475J8881J2696K26o3149j7462p517K7886N5337O793n638k9846J5110J3362
16475d1796j3289L6900O983j0079j7922P454O040n481K7568l6260k5666J2517
$$ plain form
16463 -53031 -37647 -30841 -6559 -12196 -33840 8088 36635 -18393 -87798 -78244 -36503 -58314
16451 -58314 -99572 -64668 -42271 -64818 -79886 -54827 -92480 -113795 -79591 -48614 -7213 681
16439 681 -6231 -34216 -65579 -37980 -35014 -19632 -1712 -10095 -11988 -12552 -42662 -40844 -75494
16426 -75494 -97600 -86712 -82152 -66503 -81659 -66989 -24271 -24173 -75015 -53989 -41666 -52512
16414 -52512 -62872 -15919 753 2736 27134 34320 9376 25454 36228 -1907 -33822 -55204
16402 -55204 -47543 -24411 -21925 9360 682 9105 -5401 -59292 -92850 -109857 -81351 -60040
16390 -60040 -43969 -17011 -33192 -73316 -124731 -118656 -57612 -46244 -35811 -48109 -87908 -42480
16378 -42480 -36038 -59481 -79710 -92553 -42933 -30717 -18365 21760 10504 -50268 -98073 -98373
$$ packed form
16463e3031J5384O806K4282n637k1644M1928K8547n5028o9405R554M1741k1811
16451e8314m1258L4904K2397k2547j5068K5059l7653k1315L4204L0977M1401P894
16439F81o912k7985l1363K7599K966J5382J7920q383j893n64l0110J818l4650
16426g5494k2106J0888M560J5649j5156J4670M2718R8n0842K1026J2323j0846
16414e2512j0360M6953J6672J983K4398P186k4944J6078J0774l8135l1915k1382
16402e5204P661K3132K486L1285q678Q423j4506n3891l3558j7007K8506K1311
16390f0040J6071K6958j6181m0124n1415O075O1044J1368J0433j2298l9799M5428
16378d2480O442k3443k0229j2843M9620J2216J2352M0125j1256o0772m7805l00
$$ plain form
16366 -98373 -57547 -51474 -67582 -40632 12623 8875 -13545 5213 13906 27111 34036 32468 -7361
16353 -7361 -32848 -38969 -2914 41051 49195 63442 13035 -27465 -79379 -103032 -45729 -3629
16341 -3629 -522 -48262 -83251 -82751 -80656 -52984 -48063 -77386 -122239 -103646 -44051 17621 33390
16328 33390 5554 2628 29735 21883 -12412 3136 3066 -4498 -30515 114 -11517 -26425 -6896
16315 -6896 -5304 -33672 -62439 -71861 -57111 -23309 -46697 -52545 -33718 -28970 -9542 -19415 -33747
16302 -33747 -25726 -48555 -59481 -81500 -48786 -71178 -87474 -75875 -58108 -19169 -41657 -54203
16290 -54203 -12039 6240 -14421 -17364 9665 5849 -30381 -57602 -37629 -16760 -20534 -32812
16278 -32812 -32972 -20888 -15328 -13767 -43209 -34992 -53542 -43406 -33285 -40657 -42247 -97134 -132639
$$ packed form
16366i8373M0826O073j6108K6950N3255l748k2420J8758Q693J3205O925j568l9829
16353g361k5487o121L6055M3965Q144J4247n0407m0500n1914k3653N7303M2100
16341c629L107m7740l4989N00K095K7672M921k9323m4853J8593N9595O1672J5769
16328C3390k7836k926K7107p852l4295J5548p0p564k6017L0629j1631j4908J9529
16315f896J592k8368k8767r422J4750L3802k3388n848J8827M748J9428r873j4332
16302c3747Q021k2829j0926k2019L2714k2392j6296J1599J7767L8939k2488j2546
16290e4203M2164J8279k0661k943K7029l816l6230k7221J9973K0869l774j2278
16278c2812j60J2084N560J561k9442Q217j8550J0136J0121p372j590n4887l5505
$$ plain form
16265 -132639 -76031 -63061 -83541 -83016 -63800 -53289 -37902 -38516 -45233 -73855 -110222 -108393 -59473
16252 -59473 -9264 -30003 -71579 -69913 -36393 -49459 -36446 -20035 -49534 -40499 -29708 -59965
16240 -59965 -84355 -128274 -73039 -72838 -70368 -80856 -93523 -116541 -148357 -112994 -65568 -29218
16228 -29218 -34363 -32114 -2678 -18242 -41462 -42336 -23881 -29329 -20017 23960 14150 -11012 -34966
16215 -34966 -85769 -57408 12330 9449 -58632 -88849 -95300 -91518 -62101 -52981 -47627 -48985 -69726
16202 -69726 -62081 -72669 -101491 -147672 -131221 -87031 -92206 -92837 -104599 -98098 -55797 -42893 -30470
16189 -30470 -37221 -54819 -64441 -75975 -46033 -39008 -21469 -13180 -26465 -26022 -38858 -52004 -57467
16176 -57467 -83248 -105692 -97061 -66989 -52733 -30826 -56017 -86707 -56266 -29745 -35709 -50031
$$ packed form
16265a32639N6608J2970k0480N25J9216J0511J5387o14o717k8622l6367J829M8920
16252e9473N0209k0739m1576J666L3520j3066J3013J6411k9499R035J0791l0257
16240e9965k4390m3919N5235K01K470j0488j2667k3018l1816L5363M7426L6350
16228b9218n145K249K9436j5564k3220q74J8455n448R312M3977r810k5162k3954
16215c4966n0803K8361O9738k881o8081l0217o451L782K9417R120N354j358k0741
16202f9726P645j0588k8822m6181J6451M4190n175o31j1762O501M2301J2904J2423
16189c0470o751j7598r622j1534K9942P025J7539Q289j3285M43j2836j3146n463
16176e7467k5781k2444Q631L0072J4256K1907k5191l0690L0441K6521n964j4322
$$ plain form
16164 -50031 -146482 -160906 -113886 -75410 -81512 -104093 -87917 -58378 -71026 -58192 -32427 -54361
16152 -54361 -68053 -49643 -12753 -29638 -43523 -6794 -15092 -1201 26896 -4114 -35178 1974
16140 1974 34552 42946 73438 54915 33722 -19383 -84017 -89005 -81838 -84086 -80133 -36726 -27883
16127 -27883 -5492 26307 3239 -8643 -15245 -2446 -27909 -30618 -48473 -77945 -110774 -109946
16115 -109946 -78486 -57148 -16251 -313 23952 -2490 -13408 25516 2092 -51558 -50784 -36146
16103 -36146 -46083 -75956 -59906 -33731 -62851 -79460 -42879 -60007 -51046 -34720 -27407 1033
16091 1033 -3109 -31326 -7709 15466 41621 53377 19870 29065 -27773 -39127 -24088 -23371 1253
16078 1253 4095 8646 46698 37007 6863 -8479 27409 42244 34235 20662 6486 14603 -14989
$$ packed form
16164e0031r6451j4424M7020L8476o102k2581J6176K9539j2648J2834K5765k1934
16152e4361j3692J8410L6890j6885j3885L6729q298J3891K8097l1010l1064L7152
16140A974L2578Q394L0492j8523k1193n3105o4634m988P167k248L953M3407Q843
16127b7883K2391L1799k3068j1882o602J2799k5463k709j7855k9472l2829Q28
16115a09946L1460K1338M0897J5938K4265k6442j0918L8924k3424n3650P74J4638
16103c6146r937k9873J6050K6175k9120j6609L6581j7128Q961J6326P313K8440
16091A033m142k8217K3617K3175K6155J1756l3507R195n6838j1354J5039P17K4624
16078A253K842M551L8052r691l0144j5342L5888J4835q009j3573j4176Q117k9592
$$ plain form
16065 -14989 -53810 -5719 -37561 -91376 -76438 -51187 -42300 -58499 -91971 -70083 -62683 -40623
16053 -40623 -70305 -87984 -78573 -66375 -62516 -78592 -57447 -52728 -34116 -7887 -5727 -11846 14047
16040 14047 45349 37716 26620 -15775 -45555 -104634 -129353 -108114 -90345 -45320 -3215 14860
16028 14860 -228 -58204 -81018 -46485 -8655 -26870 -18542 -17072 -27155 -28529 -37152 -43886 -27785
16015 -27785 -49782 -61112 -50040 -54660 -46853 -80332 -52094 -14899 4599 -23223 -47425 -49140
16003 -49140 -6014 -17188 -60972 -48670 -16408 -26277 -21904 -42078 -32033 -7107 -707 28857
15991 28857 12755 10499 -14553 2067 -19984 -45964 -33067 -24645 -35239 -49225 11491 79653
15979 79653 65826 39559 -23852 -61449 -37101 19997 36721 6585 -47837 -79784 -77230 -64235
$$ packed form
16065a4989l8821M8091l1842n3815J4938K5251Q887j6199l3472K1888P400K2060
16053d0623k9682j7679R411J2198L859j6076K1145M719J8612K6229K160o119K5893
16040A4047L1302p633j1096m2395k9780n9079k4719K1239J7769M5025M2105J8075
16028A4860j5088n7976k2814L4533L7830j8215Q328J470j0083j374q623o734J6101
16015b7785k1997j1330J1072m620P807l3479K8238L7195J9498k7822k4202j715
16003d9140M3126j1174m3784J2302L2262r869M373k0174J0045K4926O400K9564
15991B8857j6102k256k5052J6620k2051k5980J2897Q422j0594j3986O0716O8162
15979G9653j3827k6267o3411l7597K4348N7098J6724l0136n4422l1947K554J2995
$$ plain form
15967 -64235 -24302 9427 -23830 -19872 16838 43477 30891 -10056 -51515 -71264 -57936 -18751
15955 -18751 -5386 -10847 -18775 -16992 -11590 -12724 3727 -4764 -16652 -44495 -30216 -6027 28110
15942 28110 60157 70021 53889 -14986 9669 29851 -10722 -28112 -33479 -12320 -17003 -44045
15930 -44045 -49900 -52976 -22826 6254 18178 29688 40183 32493 48513 28698 2463 -31603
15918 -31603 -10535 -14663 -27182 -35942 -30300 -31620 -47096 -59940 -27585 5886 -16771 6631
15906 6631 19848 39587 24607 -20909 -14229 -55975 -45008 -52168 -44816 -33277 3091 29645
15894 29645 18087 729 19092 48638 36928 1766 9926 39519 67809 57888 44515 41012
15882 41012 18717 -677 -35464 -55056 -13980 10362 5741 -23534 -27556 -8485 -47299 -82724
$$ packed form
15967f4235L9933L3729l3257L958L6710K6639j2586m0947m1459j9749J3328L9185
15955a8751J3365n461p928J783N402j134J6451q491j1888k7843J4279K4189L4137
15942B8110L2047R864j6132o8875K4655K0182m0573j7390n367K1159m683k7042
15930d4045n855l076L0150K9080J1924J1510J0495p690J6020j9815k6235l4066
15918c1603K1068m128j2519q760N642j320j5476j2844L2355L3471k2657K3402
15906F631J3217J9739j4980m5516O680m1746J0967p160P352J1539L6368K6554
15894B9645j1558j7358J8363K9546j1710l5162Q160K9593K8290r921j3373l503
15882D1012k2295j9394l4787j9592M1076K4342m621k9275m022J9071l8814l5425
$$ plain form
15870 -82724 -60989 -17065 34531 40340 32278 -1186 -71410 -47920 -38397 -12893 9363 23363
15858 23363 35317 19486 -58321 -91673 -31978 13510 19653 32077 39090 45379 27897 31726
15846 31726 -6924 -40981 -20244 -2375 9658 17603 18058 3737 -8135 27364 72430 97214
15834 97214 58065 8728 -29193 -25365 -17775 5299 18445 8006 -26041 -18071 -26896 -32906 -13087
15821 -13087 -20305 -58016 -59274 -43357 -37125 -18144 -947 -11085 -5979 13341 4346 37740 57805
15808 57805 55920 12439 -10848 -1645 171 -21299 -30750 -26519 -47699 -21079 -4882 11347 35729
15795 35729 63863 115988 68205 16415 7916 -4809 -40851 -78488 -68989 -47924 -55494 -76807
15783 -76807 -87575 -60094 -20711 7445 17302 39381 41648 -616 -63833 -56839 -54010 -45567 2456
$$ packed form
15870h2724K1735M3924N1596N809q062l3464p0224K3490R523K5504K2256J4000
15858B3363J1954j5831p7807l3352N9695M5488O143J2424P013O289j7482L829
15846C1726l8650l4057K0737J7869J2033P945M55j4321j1872L5499M5066K4784
15834I7214l9149m9337l7921L828P590K3074J3146j0439l4047P970q825o010J9819
15821a3087p218l7711j258J5917O232J8981J7197j0138N106J9320q995L3394K0065
15808E7805j885m3481k3287R203J816k1470r451M231k1180K6620J6197J6229K4382
15795C5729K8134N2125m7783n1790q499j2725l6042l7637R499K1065p570k1313
15783g6807j0768K7481L9383K8156R857K2079K267m2264o3217O994K829Q443M8023
$$ plain form
15770 2456 -10649 -1551 4062 -1753 6292 -11827 -27366 -27326 -59850 -68688 -57047 -22297 -26525 -48382
15756 -48382 21978 1148 9365 44002 26175 67005 75553 13985 -85404 -121450 -87642 -45146
15744 -45146 -30972 -35903 -28498 13577 2648 -27294 -39249 -47501 -62074 -7292 33812 67833
15732 67833 58644 55612 39988 20609 12460 -9410 7377 -23540 -2954 19673 33839 -9092
15720 -9092 -37843 -7201 1124 17150 19555 6648 -11415 -32434 -3266 67065 96153 92287
15708 92287 90816 49900 56237 71303 64168 19789 11003 -23696 -3678 31592 30405 50943 101084
15695 101084 115172 77060 51234 36868 43611 49524 38763 22144 9033 -20318 -21474 -17878
15683 -17878 -15074 1725 1161 15869 25359 28522 18652 32331 43589 38765 49052 48508 35783
$$ packed form
15770B456j3105R098N613n815Q045j8119j5539M0l2524q838J1641L4750m228k1857
15756d8382P0360k0830Q217L4637j7827M0830Q548o1568r9389l6046L3808M2496
15744d5146J4174m931P405M2075j0929k9942j1955q252j4573N4782M1104L4021
15732F7833r189l032j5624j9379q149k1870J6787l0917K0586K2627J4166m2931
15720i092k8751L0642Q325J6026K405j2907j8063k1019K9168P0331K9088l866
15708I2287j471m0916O337J5066p135m4379q786l4699K0018L5270j187K0538N0141
15695A01084J4088l8112k5826j4366O743N913j0761j6619j3111k9351j156L596
15683a7878K804J6799n64J4708R490L163r870J3679J1258m824J0287n44j2725
$$ plain form
15670 35783 40794 30600 5311 -13320 -12154 -31550 -23723 49463 79361 81331 23062 40763
15658 40763 71845 76531 53498 35651 37254 1462 6024 1647 -15999 -10417 16868 10002 14316
15645 14316 37179 -1732 -33079 -27577 -1493 34779 35243 56269 91654 67890 60546 76735
15633 76735 94904 83899 39273 16670 38067 77482 65283 29700 11996 10382 32932 53869
15621 53869 46888 41165 70417 72107 70276 44150 33529 79393 84483 60241 72557 76840 46981
15608 46981 50226 41336 39872 7886 -15330 -13582 -2857 -26696 -40424 -58783 -45986 13787
15596 13787 35976 36656 63882 53603 45528 53944 3473 -46062 -27639 3789 191 -1550 -5464
15583 -5464 23102 44658 34794 74380 131522 92715 40880 32181 71109 67738 48009 49947 64951
$$ packed form
15670C5783N011j0194k5289j8631J166j9396P827P3186K9898J970n8269J7701
15658D0763L1082M686k3033j7847J603l5792M562m377j7646N582K7285o866M314
15645A4316K2863l8911l1347N502K6084L6272M64K1026L5385k3764p344J6189
15633G6735J8169j1005m4626k2603K1397L9415j2199l5583j7704j614K2550K0937
15621E3869o981n723K9252J690j831k6126j0621M5864N090k4242J2316M283k9859
15608D6981L245q890j464l1986k3216J748J0725k3839j3728j8359J2797N9773
15596A3787K2189O80K7226j0279q075Q416n0471m9535J8423L1428l598j741l914
15583e464K8566K1556r864L9586N7142l8807n1835q699L8928l371j9729J938J5004
$$ plain form
15570 64951 48280 37564 40224 20420 67535 88449 55109 20182 51466 87890 52040 23570
15558 23570 52933 86978 76125 38940 24542 18631 75646 86257 82779 77424 77481 52545 12750
15545 12750 -15671 3124 58038 84098 68561 62316 51229 56215 73593 56024 47148 89354
15533 89354 131455 110729 95430 57537 4051 12933 53250 45019 40708 20429 4673 28165
15521 28165 59607 79806 126358 141952 93569 99519 90792 76458 62308 58120 79870 75712
15509 75712 91882 101197 135782 117401 122989 97499 104308 113455 117087 86472 3656 -41941 -3480
15496 -3480 22760 52166 38955 39968 65449 35769 10259 59589 134572 152318 118848 123127
15484 123127 145489 140280 87427 97801 100428 60397 38445 82782 94202 80480 114437 150188
$$ packed form
15570F4951j6671j0716K660j9804M7115K0914l3340l4927L1284L6424l5850k8470
15558B3570K9363L4045j0853l7185j4398n911N7015J0611l478n355N7k4936l9795
15545A2750k8421J8795N4914K6060j5537o245j1087M986J7378j7569q876M2206
15533H9354M2101k0726j5299l7893n3486Q882M0317q231m311k0279j5756K3492
15521B8165L1442K0199M6552J5594m8383N950q727j4334j4150m188K1750m158
15509G5712J6170R315L4585j8381N588k5490O809R147L632l0615q2816m5597L8461
15496c480K6240K9406j3211J013K5481k9680k5510M9330P4983J7746l3470M279
15484A23127K2362n209n2853J0374K627m0031k1952M4337J1420j3722L3957L5751
$$ plain form
15472 150188 202400 199405 146514 109147 92185 99124 52744 8064 5058 23753 41835 53425
15460 53425 68881 38569 38410 79086 58930 43922 61270 99718 139207 115697 81203 66604
15448 66604 79406 83804 77098 78937 66965 77393 75572 101980 96187 75614 82843 76093 101932
15435 101932 76308 57730 92655 97747 112256 164995 151455 111634 119608 113976 104992 104459 140506
15422 140506 150018 116302 110196 112480 93954 66048 75856 68254 43591 38721 58162 108244 137171
15409 137171 165551 153186 144118 126933 139128 149646 128884 107046 86051 98469 124497 72290
15397 72290 54979 89233 93488 86880 113787 116145 130162 159563 152483 105440 132360 160794
15385 160794 148938 125262 129296 141947 121357 96107 95972 149310 186366 198888 179726 140929
$$ packed form
15472A50188N2212k995n2891l7367j6962O939m6380m4680l006J8695J8082J1590
15460E3425J5456l0312j59M0676k0156j5008J7348L8448L9489k3510l4494j4599
15448F6604J2802M398o706J839j1972J0428j821K6408n793k0573P229o750K5839
15435A01932k5624j8578L4925N092J4509N2739j3540l9821P974n632q984n33L6047
15422A40506R512l3716o106K284j8526k7906R808p602k4663m870J9441N0082K8927
15409A37171K8380j2365r068j7185J2195J0518k0762k1838k0995J2418K6028n2207
15397G2290j7311L4254M255o608K6907K358J4017K9401p080m7043K6920K8434
15385A60794j1856k3676M034J2651k0590k5250j35N3338L7056J2522j9162l8797
$$ plain form
15373 140929 109404 80285 98012 129122 178685 184798 171477 164773 191246 238676 276804 268275
15361 268275 240915 195048 159063 194911 222086 231308 250687 246942 278868 275373 288834 317490
15349 317490 347885 322591 349233 359792 360738 366331 386612 378442 399015 373871 362915 339975
15337 339975 316481 295006 291262 314762 279159 316552 367217 316526 317735 304703 260213 298221
15325 298221 343017 319984 300555 306314 338100 347363 315815 311282 319652 337393 331358 310828
15313 310828 272379 291106 311866 306556 280629 307720 286029 254633 252322 220434 246493 264338
15301 264338 246451 240598 282255 302545 327523 291962 311007 287237 286477 292690 309284 344047
15289 344047 360172 329930 285470 273433 292424 302964 315945 266176 250967 271486 285614
$$ packed form
15373A40929l1525k9119J7727L1110M9563O113j3321o704K6473M7430L8128q529
15361B68275k7360m5867l5985L5848K7175R222J9379l745L1926l495J3461K8656
15349C17490L0395k5294K6642J0559R46N593K0281q170K0573k5144j0956k2940
15337C39975k3494k1475l744K3500l5603L7393N0665n0691J209j3032m4490L8008
15325B98221M4796k3033j9429N759L1786R263l1548m533Q370J7741o035k0530
15313C10828l8449J8727K0760n310k5927K7091k1691l1396k311l1888K6059J7845
15301B64338j7887n853M1657K0290K4978l5561J9045k3770p60O213J6594L4763
15289C44047J6125l0242m4460j2037J8991J0540J2981m9769j5209K0519J4128
$$ plain form
15278 285614 308689 315151 284668 286180 264611 270263 337908 408179 388446 355183 352795 375184
15266 375184 374066 350494 365599 347449 343912 342055 370831 368077 369769 404070 421401 432286
15254 432286 388373 387529 388229 369949 365569 394024 469485 522276 502832 495269 486975 461412 502380
15241 502380 556926 569197 544315 539409 551962 596503 611902 570500 553805 568273 540756 569967
15229 569967 605510 651163 645154 663736 706919 771351 762267 790873 770325 750253 785533 837574
15217 837574 842991 850455 888611 924875 968508 973508 953610 976033 975696 983385 985221 1021026 1071557
15204 1071557 1126804 1136860 1145850 1158810 1162195 1166283 1192528 1217866 1227437 1232541 1235417 1224067
15192 1224067 1249284 1276330 1271696 1293618 1330867 1316697 1328503 1340936 1332476 1383992 1413472 1415169
$$ packed form
15278B85614K3075O462l0483J512k1569N652O7645P0271j9733l3263k388K2389
15266C75184j118k3572J5105j8150l537j857K8776k754J692L4301J7331J0885
15254D32286m3913q44P00j8280m380K8455P5461N2791j9444p563q294k5563M0968
15241E02380N4546J2271k4882m906J2553M4541J5399m1402j6695J4468k7517K9211
15229E69967L5543M5653o009J8582M3183O4432r084K8606k0548k0072L5280N2041
15217H37574N417P464L8156L6264M3633N000j9898K2423l37P689J836L5805N0531
15204A071557N5247J0056Q990J2960L385M088K6245K5338R571N104K876j1350
15192A224067K5217K7046m634K1922L7249j4170J1806J2433q460N1516K9480J697
$$ plain form
15180 1415169 1426775 1408250 1419305 1449571 1493395 1540801 1537998 1558721 1567288 1573843 1594456 1604945
15168 1604945 1647290 1688285 1720653 1745345 1760679 1805057 1857697 1859249 1897484 1928944 1943832
15157 1943832 1967886 2022846 2045103 2073715 2129314 2178141 2260372 2299661 2325372 2367374 2477081
15146 2477081 2579371 2659834 2748651 2823443 2927911 2990657 3059220 3131471 3249628 3366932
15136 3366932 3465502 3556816 3683827 3770511 3882634 4035743 4143743 4275270 4429183 4605192
15126 4605192 4783798 4977684 5163591 5363108 5631058 5892442 6153192 6464821 6756407
15117 6756407 7043743 7406057 7804906 8204336 8586160 9027566 9594417 10157333 10722778
15108 10722778 11342662 12045669 12814830 13642338 14510252 15455271 16505039 17648330 18961465
$$ packed form
15180A415169J1606j8525J1055L0266M3824M7406k803K0723Q567O555K0613J0489
15168A604945M2345M0995L2368K4692J5334M4378N2640J552L8235L1460J4888
15157A943832K4054N4960K2257K8612N5599M8827Q2231L9289K5711M2002J09707
15146B477081J02290Q0463Q8817P4792J04468O2746O8563P2251J18157J17304
15136C366932R8570R1314J27011Q6684J12123J53109J08000J31527J53913J76009
15126D605192J78606J93886J85907J99517K67950K61384K60750L11629K91586
15117F756407K87336L62314L98849L99430L81824M41406N66851N62916N65445
15108A0722778O19884P03007P69161Q27508Q67914R45019J049768J143291J313135
$$ plain form
15099 18961465 20418198 21976449 23626305 25489905 27518690 29720363 32089147 34698734
15091 34698734 37499683 40422429 43510479 46659473 49774150 52803349 55659168 58135521
15083 58135521 60178480 61690208 62590071 62812420 62354994 61286260 59650324 57572652
15075 57572652 55211793 52631332 49884994 47209115 44565029 42039355 39648303 37397647
15067 37397647 35304200 33357151 31584601 29979230 28436520 26995713 25651571 24434619
15059 24434619 23367368 22363868 21448213 20600804 19851635 19094566 18397891 17717981 17084405
15050 17084405 16505556 15987021 15445184 14889922 14353724 13849884 13354555 12902391 12495626
15041 12495626 12070860 11661088 11274568 10917890 10561346 10247051 9950331 9694993 9437918
$$ packed form
15099A8961465J456733J558251J649856J863600K028785K201673K368784K609587
15091C4698734K800949K922746L088050L148994L114677L029199K855819K476353
15083E8135521K042959J511728Q99863K22349m57426j068734j635936k077672
15075E7572652k360859k580461k746338k675879k644086k525674k391052k250656
15067C7397647k093447j947049j772550j605371j542710j440807j344142j216952
15059B4434619j067251j003500r15655q47409p49169p57069o96675o79910o33576
15050A7084405n78849n18535n41837n55262n36198n03840m95329m52164m06765
15041A2495626m24766m09772l86520l56678l56544l14295k96720k55338k57075
$$ plain form
15032 9437918 9137840 8879579 8621604 8415671 8211907 7979086 7779031 7620055 7466601
15023 7466601 7275800 7111030 6918692 6744439 6554005 6370539 6221455 6083477 5941764
15014 5941764 5838548 5706132 5630501 5531765 5377110 5242412 5115125 5009043 4890937 4812307
15004 4812307 4732265 4618870 4512491 4421387 4310708 4263296 4188318 4061678 4004234 3947512
14994 3947512 3887414 3796039 3673783 3585272 3500072 3443205 3394620 3364625 3351431 3303199 3221647
14983 3221647 3142803 3119470 3111904 3053086 2982733 2925423 2889334 2817676 2770391 2723189 2755370
14972 2755370 2718393 2678594 2606190 2558509 2540826 2540502 2544915 2512879 2479844 2434963 2387314 2359398
14960 2359398 2323236 2295849 2283203 2261216 2230932 2206546 2204676 2182499 2123465 2098155 2078261
$$ packed form
15032I437918l00078k58261k57975k05933k03764k32821k00055j58976j53454
15023G466601j90801j64770j92338j74253j90434j83466j49084j37978j41713
15014E941764j03216j32416p5631r8736j54655j34698j27287j06082j18106p8630
15004D812307q0042j13395j06379r1104j10679m7412p4978j26640n7444n6722
14994C947512o0098r1375j22256q8511q5200n6867m8585k9995j3194m8232q1552
14983C221647p8844k3333p566n8818p0353n7310l6089p1658m7285m7202L2181
14972B755370l6977l9799p2404m7681j7683l24M413l2036l3035m4881m7649k7916
14960B359398l6162k7387j2646k1987l0284k4386j870k2177n9034k5310j9894
$$ plain form
14949 2078261 2070096 2003683 1924010 1912690 1929140 1895781 1848589 1827135 1778894 1710450 1697369
14938 1697369 1688049 1627398 1602246 1602518 1613195 1603325 1606830 1567078 1494461 1448670 1447963 1388787 1364236
14925 1364236 1328726 1297587 1283301 1273696 1279536 1290711 1298068 1263013 1214780 1152585 1125729 1132203
14913 1132203 1168014 1198355 1175241 1148744 1128402 1101207 1095932 1079640 1071890 1066344 1041880 962595
14901 962595 935419 980585 1021303 1019614 967036 939358 892875 907531 900016 890845 882086 866510
14889 866510 865667 856905 809958 778786 766028 733450 763081 774973 772738 752699 770146 765113
14877 765113 727447 729256 732947 686802 629161 627123 678693 648570 613210 632570 629365 583189
14865 583189 600546 617910 600470 554727 545114 535724 506548 537425 564407 553201 522744 487365
$$ packed form
14949B078261q165o6413p9673j1320J6450l3359m7192k1454m8241o8444j3081
14938A697369r320o0651k5152K72J0677r870L505l9752p2617m5791p07n9176k4551
14925A364236l5510l1139j4286r605N840J1175P357l5055m8233o2195k6856O474
14913A132203L5811L0341k3114k6497k0342k7195n275j6292p750n546k4464p9285
14901I62595k7176M5166M0718j689n2578k7678m6483J4656p515r171q759j5576
14889H66510q43q762m6947l1172j2758l2578K9631J1892k235k0039J7447n033
14877G65113l7666J809L691m6145n7641k038N1570l0123l5360J9360l205m6176
14865E83189J7357J7364j7440m5743r613r390k9176L0877K6982j1206l0457l5379
$$ plain form
14853 487365 489193 475181 471464 467911 430576 407032 425758 419786 413445 401993 407042 383518 382288
14840 382288 407316 433794 441552 417472 415104 412160 389970 407638 435651 426002 405101 398671
14828 398671 403563 406246 382035 373228 400976 381595 398450 418264 403518 457729 522082 506908
14816 506908 513408 515898 501590 467350 439345 449327 438793 418722 407896 391502 379715 324609
14804 324609 270419 271733 290457 296862 339667 371977 366437 396656 387207 361962 353641 325858
14792 325858 321937 296944 290088 289795 246407 219565 219236 246095 229820 209590 243560 206471 178871
14779 178871 138772 141195 186228 243110 260346 201547 175425 189132 211782 230956 230022 208056
14767 208056 202815 208735 235712 218810 187224 197425 221164 222950 174133 161114 192048 194119
$$ packed form
14853D87365J828j4012l717l553l7335k3544J8726n972o341j1452N049k3524j230
14840C82288K5028K6478P758k4080k368k944k2190J7668K8013r649k0901o430
14828C98671M892K683k4211q807K7748j9381J6855J9814j4746N4211O4353j5174
14816E06908O500K490j4308l4240k8005R982j0534k0071j0826j6394j1787n5106
14804C24609n4190J314J8724O405M2805L2310n540L0219r449k5245q321k7783
14792C25858l921k4993o856k93m3388k6842l29K6859j6275k0230L3970l7089k7600
14779A78871m0099K423M5033N6882J7236n8799k6122J3707K2650J9174r34k1966
14767B08056n241N920K6977j6902l1586J0201K3739J786m8817j3019L0934K071
$$ plain form
14755 194119 187148 190068 182170 152170 118940 110158 133563 164620 171757 135993 162389 250220
14743 250220 210618 162649 144861 113462 111501 150595 119515 85995 101894 113208 75376 73731
14731 73731 83095 117968 104560 74346 102542 110194 93744 72442 78035 65752 100358 113325
14719 113325 96985 66065 83253 90974 90808 105359 118349 150585 127013 85910 83034 81547
14707 81547 93006 105522 114263 78071 63649 75545 55728 56510 32312 22552 59693 53965 91280
14694 91280 105544 121931 155206 122621 66063 36308 -15643 -18996 17983 109059 121878 99010
14682 99010 109674 120031 114336 63852 31506 34183 53557 98815 109020 64873 37247 50515
14670 50515 100175 50425 2771 20139 43595 30463 18086 33486 5652 16 24132 43940
$$ packed form
14755A94119o971K920p898l0000l3230q782K3405L1057P137l5764K6396Q7831
14743B50220l9602m7969j7788l1399j961L9094l1080l3520J5899J1314l7832j645
14731G3731R364L4873j3408l0214K8196P652j6450k1302N593j2283L4606J2967
14719A13325j6340l0920J7188P721j66J4551J2990L2236k3572m1103k876j487
14707H1547J1459J2516Q741l6192j4422J1896j9817P82k4198r760L7141n728L7315
14694I1280J4264J6387L3275l2585n6558k9755n1951l353L6979R1076J2819k2868
14682I9010J0664J0357n695n0484l2346K677J9374M5258J0205m4147k7626J3268
14670E0515M9660m9750m7654J7368K3456j3132j2377J5400k7834n636K4116J9808
$$ plain form
14658 43940 59826 28170 9687 16851 2525 1112 5159 47217 42917 35134 39919 23334 -22167
14645 -22167 -62891 -15746 14770 -26019 -24583 26569 79687 68899 88754 102884 68141 21193
14633 21193 11951 28912 49777 72956 77859 95085 63855 88748 69697 34519 17574 -22377
14621 -22377 -17507 13031 62851 87797 96595 96433 104532 99175 71533 28868 -9417 -39044 11525
14608 11525 37647 50286 36487 28831 9955 50524 87844 67666 7674 -3878 -8390 -22332
14596 -22332 -14616 37635 94042 102083 61715 33079 47263 87234 94231 50424 30425 60289
14584 60289 79266 52743 87278 134009 96022 77641 60993 55249 18033 -786 -15563 -21096
14572 -21096 -18473 -36231 -14455 -4262 -6700 7702 18484 10322 1804 -6454 25597 64529 24076
$$ packed form
14658D3940J5886l1656j8483P164j4326j413M047M2058m300p783M785j6585m5501
14645b2167m0724M7145L0516m0789J436N1152N3118j0788J9855J4130l4743m6948
14633B1193r242J6961K0865K3179M903J7226l1230K4893j9051l5178j6945l9951
14621b2377M870L0538M9820K4946Q798j62Q099n357k7642m2665l8285k9627N0569
14608A1525K6122J2639j3799p656j8876M0569L7320k0178n9992j1552m512j3942
14596b2332P716N2251N6407Q041m0368k8636J4184L9971O997m3807j9999K9864
14584F0289J8977k6523L4535M6731l7987j8381j6648n744l7216j8819j4777n533
14572b1096K623j7758K1776J0193k438J4402J0782q162q518q258L2051L8932m0453
$$ plain form
14559 24076 -2012 -2294 -10728 -24040 19038 53211 74179 70801 77521 73186 55927 83432 56122
14546 56122 71070 96364 93067 81159 53312 -4589 -24359 -2672 11148 46971 18206 9200
14534 9200 -7444 -30984 -19443 -14914 12130 5309 -35178 -23415 29971 22966 12233 -44245
14522 -44245 -76993 -89114 -58476 -34806 11038 12700 -6642 -5508 -3605 1754 40634 60362
14510 60362 73038 54822 70326 70491 73525 83889 66701 22478 5899 -6517 15142 25146
14498 25146 14288 -5204 -13301 -4129 3920 12617 47567 -2469 -46519 -42518 -71241 -58818 11772
14485 11772 53555 26463 -39117 -15574 18384 37398 32155 41645 18822 14484 33888 38744
14473 38744 -20092 330 42669 18152 -41159 -86841 -70942 -44896 -6517 -18522 -44642 -54104
$$ packed form
14559B4076k6088k82q434j3312M3078L4173K0968l378O720m335j7259K7505k7310
14546E6122J4948K5294l297j1908k7847n7901j9770K1687J3820L5823k8765r006
14534I200j6644k3540J1541M529K7044o821m0487J1763N3386p005j0733n6478
14522d4245l2748j2121L0638K3670M5844J662j9342J134J903N359L8880J9728
14510F0362J2676j8216J5504J65L034J0364j7188m4223j6579j2416K1659J0004
14498B5146j0858j9492q097R172Q049Q697L4950n0036m4050M001k8723J2423P0590
14485A1772M1783k7092o5580K3543L3958J9014n243R490k2823m338J9404M856
14473C8744n8836K0422M2339k4517n9311m5682J5899K6046L8379j2005k6120r462
$$ plain form
14461 -54104 -42790 5612 28994 2054 -6409 -6509 -6033 -15912 -13789 -33865 -51881 -39500 13565
14448 13565 54841 22962 27811 56271 68956 56098 37893 19163 2442 21388 20874 40110
14436 40110 32292 22787 -28490 -36415 -22153 2287 15410 20309 1128 -23330 -28315 -10444 -10920
14423 -10920 -10031 -8602 -18019 -62877 -100399 -107679 -79042 -57614 -63997 -85000 -72880 -47511 -10100
14410 -10100 -2704 -15385 -3623 -11724 -20291 -12147 -11232 -27036 -13603 -22872 -99133 -64944 -84475
14397 -84475 -76451 -75638 -94528 -56747 -44082 -51512 -80908 -88181 -41763 -39798 -33612 7861 20311
14384 20311 -19054 -67537 -58817 -33517 -11945 29793 86623 40873 8103 -29604 -31433 -26308
14372 -26308 -16220 -22846 -71015 -74125 -54543 -804 6535 14439 -4898 -57840 -93074 -78511
$$ packed form
14461e4104J1314M8402K3382k6940q463j00M76r879K123k0076j8016J2381N3065
14448A3565M1276l1879M849K8460J2685j2858j8205j8730j6721J8946n14J9236
14436D0110p818r505n1277p925J4262K4440J3123M899j9181k4458m985J7871m76
14423a0920Q89J429r417m4858l7522p280K8637K1428o383k1003J2120K5369L7411
14410a0100P396j2681J1762q101q567Q144R15j5804J3433r269p6261L4189j9531
14397h4475Q024Q13j8890L7781J2665p430k9396p273M6418J965O186M1473J2450
14384B0311l9365m8483Q720K5300K1572M1738N6830m5750l2770l7707j829N125
14372b6308J0088o626m8169l110J9582N3739P339P904j9337n2942l5234J4563
$$ plain form
14360 -78511 -78837 -92932 -75299 -37053 -38944 -41456 -36525 -5069 -21516 -60150 -104057 -69503 -51007
14347 -51007 -18539 4498 9701 50838 59309 57260 51665 13224 -44176 -72376 -58701 -39635
14335 -39635 -35952 -33276 -37952 -4691 38865 -9170 -42228 -11702 8767 1297 -12022 16920
14323 16920 -1798 -31379 -59748 -56470 -24918 -32344 -38967 -8833 -18714 -60526 -77612 -79354 -70131
14310 -70131 -48009 -14750 -11789 1141 22044 21138 -24497 5118 26719 -7483 -50760 -25594
14298 -25594 1648 -25142 -11498 10955 22325 55683 15778 -27840 -82813 -50238 -27629 -42448
14286 -42448 -66874 -53982 -61569 -62846 -58711 -50887 -68148 -86403 -102838 -72371 2105 21451
14274 21451 9742 -18400 -3460 -1083 -32413 -42909 -66782 -40981 -30775 -59406 -87107 -86234
$$ packed form
14360g8511l26j4095J7633L8246j891k512M931L1456j6447l8634m3907L4554J8496
14347e1007L2468K3037N203M1137Q471k049n595l8441n7400k8200J3675J9066
14335c9635L683K676m676L3261M3556m8035l3058L0526K0469p470j3319K8942
14323A6920j8718k9581k8369L278L1552p426o623L0134r881m1812j7086j742R223
14310g0131K2122L3259K961J2930K0903r06m5635K9615K1601l4202m3277K5166
14298b5594K7242k6790J3644K2453J1370L3358l9905m3618n4973L2575K2609j4819
14286d2448k4426J2892p587j277M135P824j7261j8255j6435L0467P4476J9346
14274B1451j1709k8142J4940K377l1330j0496k3873K5801J0206k8631k7701Q73
$$ plain form
14262 -86234 -70625 -87152 -56523 -28622 -17427 -1167 40290 45352 28136 13761 -11004 -7011
14250 -7011 -26194 -58906 -88169 -70860 -16550 11214 -9077 -51028 -34094 -12247 -9481 -22455
14238 -22455 -9275 15529 1130 -29272 -28263 -10639 33845 13560 22555 19873 26153 8900
14226 8900 14562 -38651 -78705 -63627 -32803 -11581 -23157 -5346 10918 40941 50460 8695
14214 8695 -2897 2458 11228 -50912 -63273 -24056 -23974 -13358 31516 19875 -1198 -12054 -28259
14201 -28259 18299 22455 -11632 -10513 -32098 -92122 -113567 -104240 -44544 15661 -14429 -31265
14189 -31265 -16682 21990 29428 -2396 -68147 -46393 4651 11885 14294 24192 47347 53166 -10913
14176 -10913 -12699 -6574 -3655 11461 26121 45944 36121 19126 29941 31378 14384 -40124 -101556
$$ packed form
14262h6234J5609j6527L0629K7901J1195J6260M1457N062j7216j4375k4765L993
14250g011j9183l2712k9263J7309N4310K7764k0291m1951J6934K1847K766j2974
14238b2455J3180K4804j4399l0402J009J7624M4484k0285Q995k682O280j7253
14226H900N662n3213m0054J5078L0824K1222j1576J7811J6264L0023R519m1765
14214H695j1592N355Q770o2140j2361L9217Q2J0616M4874j1641k1073j0856j6205
14201b8259M6558M156l4087J119k1585o0024k1445R327N9696O0205l0090j6836
14189c1265J4583L8672P438l1824o5751K1754N1044P234K409R898K3155N819o4079
14176a0913j786O125K919J5116J4660J9823r823j6995J0815J437j6994n4508o1432
$$ plain form
14163 -101556 -102385 -90110 -34151 14668 56107 45857 25789 -17104 -65417 -43971 -1040 7868
14151 7868 3191 23920 45646 84253 92548 41861 11643 -19779 -20609 -8053 -4029 -6520 -13345
14138 -13345 -1322 18183 6720 21512 25122 -4624 -49225 -27867 -14530 -4704 4939 -36034
14126 -36034 -88709 -109380 -85220 4663 25098 8841 -26672 -24133 -1414 -8057 -27413 -8998
14114 -8998 -16288 -32358 -56350 -14172 34993 32068 10711 10216 4976 45357 26478 31605 -384
14101 -384 -1791 17872 -14323 -31434 -36499 -21326 -49590 -57432 -51070 -33000 -23730 304 -18142
14088 -18142 -30824 -58928 -70663 -55882 15193 39068 -7017 -22847 -29260 -35815 17643 46265
14076 46265 20204 13687 30897 36366 54176 42330 42514 56088 31416 -30248 -34735 -600 1539
$$ packed form
14163a01556q29J2275N5959M8819M1439j0250k0068m2893m8313K1446M2931Q908
14151G868m677K0729K1726L8607Q295n0687l0218l1422q30J2556M024k491o825
14138a3345J2023J9505j1463J4792L610k9746m4601K1358J3337R826R643m0973
14126c6034n2675k0671K4160Q9883K0435j6257l5513K539K2719o643j9356J8415
14114h998p290j6070k3992M2178M9165k925k1357m95n240M0381j8879N127l1989
14101c84j407J9663l2195j7111n065J5173k8264p842O362J8070R270K4034j8446
14088a8142j2682k8104j1735J4781P1075K3875m6085j5830o413o555N3458K8622
14076D6265k6061o517J7210N469J7810j1846J84J3574k4672o1664m487L4135K139
$$ plain form
14063 1539 -19264 -30198 -28757 -32804 -10659 33957 24760 36533 8716 -36798 -81972 -82528 -44841
14050 -44841 -43824 -81277 -119103 -108853 -87225 -37799 -33543 -22843 -41670 -43041 -38313 -36364 -44420
14037 -44420 -32317 -16804 -24647 -50868 -61938 -74502 -78622 -62563 -52108 -98800 -79975 -103118
14025 -103118 -107297 -79501 -18022 25895 5792 -25047 -21617 -24051 -34001 -2523 423 -8096 7598
14012 7598 -3837 -51215 -74293 -89401 -82343 -63373 -31483 -21281 -15287 16190 48834 40688
14000 40688 47758 37916 81773 94764 60914 22360 16446 -5119 46097 76931 64407 51552
13988 51552 8608 15247 8153 5956 -10514 -4982 -17815 -43179 -40192 -20431 -24000 -19765 -30180
13975 -30180 -30065 -38555 -58542 -56138 -55604 -42147 -45551 -51195 -20455 11895 1560 -62458 -54070
$$ packed form
14063A539k0803j0934J441m047K2145M4616r197J1773k7817m5514m5174n56L7687
14050d4841J017l7453l7826J0250K1628M9426M256J0700j8827j371M728J949q056
14037d4420J2103J5513p843k6221j1070j2564m120J6059J0455m6692J8825k3143
14025a03118m179K7796O1479M3917k0103l0839L430k434r950L1478K946q519J5694
14012G598j1435m7378k3078j5108P058J8970L1890J0202N994L1477L2644q146
14000D0688P070r842M3857J2991l3850l8554n914k1565N1216L0834j2524j2855
13988E1552m2944O639p094k197j6470N532j2833k5364K987J9761l569M235j0415
13975c0180J15q490j9987K404N34J3457l404n644L0740L2350j0335o4018Q388
$$ plain form
13962 -54070 -32943 -44459 -97525 -84516 -92907 -99296 -95723 -88686 -128121 -127455 -128067 -64306 -59065
13949 -59065 -102951 -100861 -124843 -142186 -85404 -43603 -27854 -3798 -9616 20312 67745 33202
13937 33202 -19909 -66416 -53542 -33237 -29617 -5498 35454 -2515 -37780 -6391 -4132 -16135
13925 -16135 20958 28641 -13541 -32414 -468 10400 -33641 -44000 -26903 6830 33334 32092
13913 32092 5866 -11562 -44224 -66152 -58636 -21613 1015 11520 35856 -14095 -59363 -94933
13901 -94933 -106181 -87528 -76628 -69678 -28993 15400 7634 -28123 -25538 10305 23753 29608
13889 29608 44017 43547 23826 31478 12339 -21565 -22531 -32524 -9991 -6645 -7919 -26820 -4513
13876 -4513 -5608 -32584 -39654 -36028 -38105 -37985 -23480 -36396 -41502 -17414 32424 43079 42922 6680
$$ packed form
13962e4070K1127j1516n3066J3009q391o389L573P037l9435O66o12O3761N241
13949e9065m3886K090k3982j7343N6782M1801J5749K4056n818K9928M7433l4543
13937C3202n3111m6507J2874K0305L620K4119M0952l7969l5265L1389K259j2003
13925a6135L7093P683m2182j8873L1946J0868m4041j0359J7097L3733K6504j242
13913C2092k6226j7428l2662k1928P516L7023K2628J0505K4336m9951m5268l5570
13901i4933j1248J8653J0900O950M0685M4393p766l5757K585L5843J3448N855
13889B9608J4409m70j9721P652j9139l3904r66r993K2533L346j274j8901K2307
13876d513j095k6976p070L626k077J20J4505j2916n106K4088M9838J0655j57l6242
$$ plain form
13862 6680 6969 1682 13708 48156 46056 19153 5433 -53512 -81801 -44570 17190 22079 -8538
13849 -8538 -972 26337 32562 25680 -10114 -20861 -45395 -47857 -73633 -59970 -49404 -50817 -26729
13836 -26729 -16249 12530 24229 32907 10148 -8964 3150 30707 5395 -26215 -37945 -3054
13824 -3054 24030 28403 13184 20509 51588 65030 46707 24201 25396 9108 -14040 -8525 -35037
13811 -35037 -39788 -34097 -50316 -81657 -84911 -30604 9699 33049 -1012 -50812 -75089 -41797
13799 -41797 -4829 26257 56801 33200 6952 -12357 -16097 -5635 -37564 -42526 -56879 -22878
13787 -22878 -51749 -92948 -123553 -106676 -77826 -84715 -71866 -20456 4477 -1094 -8773 -30809
13775 -30809 -54488 -23537 17583 -26372 -71640 -69851 -35282 1828 3431 25978 2885 -77823
$$ packed form
13862F680K89n287J2026L4448k100k6903j3720n8945k8289L7231O1760M889l0617
13849h538P566K7309O225o882l5794j0747k4534k462k5776J3663J0566j413K4088
13836b6729J0480K8779J1699Q678k2759j9112J2114K7557k5312l1610j1730L4891
13824c054K7084M373j5219P325L1079J3442j8323k2506J195j6288k3148N515k6512
13811c5037m751N691j6219l1341l254N4307M0303K3350l4061m9800k4277L3292
13799d1797L6968L1086L0544k3601k6248j9309l740J0462l1929m962j4353L4001
13787b2878k8871m1199l0605J6877K8850o889J2849N1410K4933n571p679k2036
13775c0809k3679L0951M1120m3955m5268J789L4569L7110J603K2547k3093q0708
$$ plain form
13763 -77823 -78165 -26639 -66465 -109990 -112419 -135503 -98573 -94433 -77003 -20020 -32306 -40991 -33294
13750 -33294 -43940 -28775 -29698 -36587 -35220 -71200 -89672 -47386 -14763 21307 -21412 -37885
13738 -37885 -60083 -50224 -3885 -12887 -67714 -82772 -65388 -60070 -62897 -21736 -30657 -43801 -66032
13725 -66032 -39262 -7631 -12470 24061 19400 -45457 -47590 -55050 -46295 -17083 -32084 -49444 -14509
13712 -14509 -2619 -34879 -33214 -34793 -22334 8551 22780 2238 3125 40178 73086 9388
13700 9388 -14891 -64986 -40074 -57726 -86590 -42171 -26872 -8011 -16943 -14138 18788 -10717
13688 -10717 -81436 -154590 -123582 -85059 -93159 -115871 -75326 -15962 -38672 -35794 -8542 10534
13676 10534 28393 42544 38569 15085 17224 52285 49369 13335 -21011 -11148 -30202 -31427 2770
$$ packed form
13763g7823l42N1526l9826m3525k429k3084L6930M140J7430N6983j2286q685P697
13750c3294j0646J5165r23o889J367l5980j8472M2286L2623L6070m2719j6473
13738c7885k2198R859M6339r002n4827j5058J7384N318k827M1161q921j3144k2231
13725f6032K6770L1631m839L6531m661o4857k133p460Q755K9212j5001j7360L4935
13712a4509J1890l2260J665j579J2459L0885J4229k0542Q87L7053L2908o3698
13700I388k4279n0095K4912j7652k8864M4419J5299J8861q932K805L2926k9505
13688a0717p0719p3154L1008L8523q100k2712M0545N9364k2710K878K7252J9076
13676A0534J7859J4151l975k3484K139L5061k916l6034l4346R863j9054j225L4197
$$ plain form
13663 2770 -7237 -36800 -20728 -6801 5605 4579 33690 45780 45148 4816 -7327 -16750 -35131
13650 -35131 -67752 -72411 -37969 -7142 -32401 -34995 -30496 -48723 -29231 -53466 -60758 -73881
13638 -73881 -51496 -12446 32069 6513 -14553 -26670 -40212 -17778 5687 -44705 -71152 -64550
13626 -64550 -60328 -54053 -51637 -51443 -56715 -62630 -53808 -77589 -63665 -35400 -55893 -78311 -56596
13613 -56596 -67821 -39409 34755 18121 15113 -23726 678 49342 25651 -12630 -31608 -49402
13601 -49402 -17158 -9167 -17323 21256 20076 10646 26706 28739 -5949 -11945 -3247 16711 50981
13588 50981 50928 64007 101079 126642 110687 78972 37213 -3815 -10088 3594 43379 7744
13576 7744 -21770 6198 48378 22625 -18299 -38831 -11635 -25185 -14673 -4589 43681 45401
$$ packed form
13663B770j0007k9563J6072J3927J2406j026K9111J2090o32m0332j2143r423j8381
13650c5131l2621m659L4442L0827k5259k594M499j8227J9492k4235p292j3123
13638g3881K2385L9050M4515k5556k1066j2117j3542K2434K3465n0392k6447O602
13626f4550M222O275K416J94n272n915Q822k3781J3924K8265k0493k2418K1715
13613e6596j1225K8412P4164j6634l008l8839K4404M8664k3691l8281j8978j7794
13601d9402L2244P991q156L8579j180r430J6060K033l4688n996Q698J9958L4270
13588E0981n3J3079L7072K5563j5955l1715m1759m1028o273J3682L9785l5635
13576G744k9514K7968M2180k5753m0924k0532K7196j3550J0512J0084M8270J720
$$ plain form
13564 45401 60209 70051 70092 146542 190323 197771 216666 259592 324365 344263 317476 270340 220152
13551 220152 171174 92709 54845 50050 71256 90418 80956 73829 84000 111581 111113 114824 69966
13538 69966 79908 107181 130070 139953 133516 186542 222498 245357 246212 216315 213737 203507 211879
13525 211879 158765 150551 140676 151435 159314 176563 164398 146991 116608 65060 51019 101587
13513 101587 96989 84611 66976 37212 32660 31896 39289 27105 -3068 -34441 -21868 -11199
13501 -11199 10317 15912 12710 -5729 1702 -1645 -4618 -32101 -22765 -9866 24912 52494 54921
13488 54921 -12029 -61187 -4406 15132 -25210 -20460 -30119 3178 -1664 -32718 21703 46168
13476 46168 12143 -25767 -38766 -54308 -44027 -56131 -39584 -17211 -21206 -29279 -29861 -38698 28565
$$ packed form
13564D5401J4808R842M1P6450M3781P448J8895M2926O4773J9898k6787m7136n0188
13551B20152m8978p8465l7864m795K1206J9162r462p127J0171K7581m68L711m4858
13538F9966R942K7273K2889R883o437N3026L5956K2859Q55k9897k578j0230Q372
13525B11879n3114q214r875J0759P879J7249j2165j7407l0383n1548j4041N0568
13513A01587m598j2378j7635k9764m552p64P393j2184l0173l1373J2573J0669
13501a1199K1516N595l202j8439P431l347k973k7483R336J2899L4778K7582K427
13488E4921o6950m9158N6781J9538m0342M750r659L3297m842l1054N4421K4465
13476D6168l4025l7910j2999j5542J0281j2104J6547K2373l995q073n82q837O7263
$$ plain form
13463 28565 36725 7452 -26936 7779 77434 52040 42188 22768 -20271 -7436 -10404 -35707
13451 -35707 -47587 -26840 -4732 28449 48055 -7931 21799 29168 -18742 -55128 -65446 -56494
13439 -56494 -1513 5087 -46509 -68198 -87667 -58733 -42410 -56534 -63424 -39243 -31952 -36573
13427 -36573 -38058 -38213 -37823 -29545 -19262 -20943 -19882 -36476 -56257 -52427 -25236 -19148 -28292 -50106
13413 -50106 -9955 23842 39895 56780 18847 20611 61102 48517 57101 24698 4642 -4629
13401 -4629 -22021 -36939 8185 21755 30101 12886 -6194 17477 -1759 -10853 4423 12400
13389 12400 8940 -17297 -48903 -12286 31058 19637 -48933 -37043 -5823 -24844 -44086 -5366
13377 -5366 -13544 -31705 24003 43658 27821 13424 -10130 -15018 -9701 14923 17201 35288 9912
$$ packed form
13463B8565Q160k9273l4388L4715O9655k5394r852j9420m3039J2835k968k5303
13451c5707j1880K0747K2108L3181J9606n5986K9730P369m7910l6386j0318Q952
13439e6494N4981O600n1596k1689j9469K8934J6323j4124o890K4181P291m621
13427c6573j485j55L90Q278J0283j681J061j6594j9781L830K7191O088r144k1814
13413e0106M0151L3797J6053J6885l7933J764M0491j2585Q584l2403k0056r271
13401d629j7392j4918M5124J3570Q346j7215j9080K3671j9236r094J5276P977
13389A2400l460k6237l1606L6617M3344j1421o8570J1890L1220j9021j9242L8720
13377e366q178j8161N5708J9655j5837j4397k3554m888N317K4624K278J8087k5376
$$ plain form
13364 9912 -50717 -20619 -445 -30686 -24520 4374 -17459 -15942 4389 319 -13415 62921
13352 62921 54186 26560 -17915 -41437 -36578 -65409 -81822 -90416 -81083 -57821 -42669 -56018
13340 -56018 -73553 -33451 -35274 -44053 -60259 -69878 -78039 -74947 -91749 -100823 -89050 -21210 -22262
13327 -22262 -18439 -22020 -10134 -10975 -46613 -74537 -26362 28420 43750 11390 -14903 13835
13315 13835 23348 -14916 17336 30906 34985 54933 53744 62260 55155 39538 25647 -8646 -14623
13302 -14623 -54715 -11250 12281 -17280 -32091 -66020 -80476 -23084 12349 16595 12531 40619
13290 40619 5889 -32958 -53553 -47023 -40704 -52180 -32666 -43820 -31071 -25649 -48904 -45183
13278 -45183 -23574 21887 52773 23414 -3884 5304 -20058 -35580 -33630 -39510 -41207 -25332
$$ packed form
13364I912o0629L0098K0174l0241O166K8894k1833J517K0331m070j3734P6336
13352F2921q735k7626m4475k3522M859k8831j6413q594R333K3262J5152j3349
13340e6018j7535M0102j823q779j6206r619q161L092j6802r074J1773O7840j052
13327b2262L823l581J1886q41l5638k7924M8175N4782J5330l2360k6293K8738
13315A3835R513l8264L2252J3570M079J9948j189Q516p105j5617j3891l4293n977
13302a4623m0092M3465K3531k9561j4811l3929j4456N7392L5433M246m064K8088
13290D0619l4730l8847k0595O530O319j1476J9514j1154J2749N422k3255L721
13278d5183K1609M5461L0886k9359k7298R188k5362j5522J950n880j697J5875
$$ plain form
13266 -25332 20001 50902 41900 12919 23414 57461 51304 -2933 -44369 -3702 21909 6865
13254 6865 -13916 18780 20661 1593 46610 91374 87692 64654 40369 45909 32542 23848 39317
13241 39317 36544 48970 7546 9266 7456 45817 62596 56463 27500 -41606 -67872 -40727
13229 -40727 12802 1974 -23307 -44027 -36778 -27618 -52020 20229 6014 -47834 -47103 12554
13217 12554 24627 6958 -24623 -46034 -62517 -73240 -64534 -33077 -20 20095 29538 8592
13205 8592 -17420 26520 34938 1398 -33099 -41361 -28902 -6050 35607 18037 19204 -5465
13193 -5465 15259 28731 -22285 -10307 -14246 -17975 -35192 -32160 -33821 -75406 -125486 -116074 -93304
13180 -93304 -88173 -37082 -3046 -27401 -85294 -65545 -39940 -34920 -33877 -11656 404 5520
$$ packed form
13266b5332M5333L0901r002k8981J0495L4047o157n4237m1436M0667K5611j5044
13254F865k0781L2696J881j9068M5017M4764l682k3038k4285N540j3367q694J5469
13241C9317k773J2426m1424J720j810L8361J6779o133k8963o9106k6266K7145
13229d0727N3529j0828k5281k0720P249R160k4402P2249j4215n3848P31N9657
13217A2554J2073j7669l1581k1411j6483j0723Q706L1457L3057K0115R443k0946
13205H592k6012M3940Q418l3540l4497q262J2459K2852M1657j7570J167k4669
13193e465K0724J3472n1016J1978l939l729j7217L032j661m1585n0080R412K2770
13180i3304N131N1091L4036k4355n7893J9749K5605N020J043K2221J2060N116
$$ plain form
13168 5520 17395 21962 33228 63600 28470 14980 54422 53137 29533 2755 21933 28142
13156 28142 10155 12499 33419 20979 41319 15593 64901 70178 34239 3975 11702 -12587
13144 -12587 7838 35981 11844 40783 67704 41345 9230 11541 -1244 -11706 -6325 19844
13132 19844 80266 83893 29371 -2818 -37029 -21081 25237 8800 48551 67191 33097 17209
13120 17209 1018 -3026 -15393 -50373 -20807 -11086 -27620 11991 42429 14259 -15988 -39845
13108 -39845 -30091 24790 62934 62154 21288 11642 45557 21954 16420 6409 5143 -26257 -30579
13095 -30579 -26700 -29868 -32775 -29088 -30175 -28783 -29617 -18369 -13388 -17386 -47262 -64634 -94257 -48234
13081 -48234 -24762 -73484 -77691 -54892 -87179 -68015 -56888 -15232 -4871 18898 5688 48098
$$ packed form
13168E520J1875M567J1266L0372l5130j3490L9442j285k3604k6778J9178O209
13156B8142j7987K344K0920j2440K0340k5726M9308N277l5939l0264P727k4289
13144a2587K0425K8143k4137K8939K6921k6359l2115K311j2785j0462N381K6169
13132A9844O0422L627n4522l2189l4211J5948M6318j6437L9751J8640l4094j5888
13120A7209j6191m044j2367l4980K9566R721j6534L9611L0438k8170l0247k3857
13108c9845R754N4881L8144p80m0866r646L3915k3603n534j0011j266l1400m322
13095c0579L879l168k907L687j087J392q34J1248M981l998k9876j7372k9623M6023
13081d8234K3472m8722m207K2799l2287J9164J1127M1656J0361K3769j3210M2410
$$ plain form
13069 48098 52828 -29642 -72927 -16424 24996 3842 19526 192 -24720 -20861 -10235 -3247
13057 -3247 15580 23777 -1623 2457 -788 14978 42194 -2678 -74681 -46439 32180 52659
13045 52659 -2192 -11525 -16333 -46568 -79225 -66658 -64077 -26649 -40948 -46913 -34213 1551
13033 1551 61416 59723 20835 26956 31091 54515 81476 124049 119788 104918 78253 37413 31384
13020 31384 60881 56133 60996 34468 33701 43635 32568 -26241 -16923 -14877 7086 23250 47311
13007 47311 99020 67836 730 19029 28740 -21489 -66191 -91091 -32479 -27239 -66244 -60075
12995 -60075 -30868 -9140 -3185 -31854 -27963 -39821 -13255 -685 2574 47531 -4995 -16506
12983 -16506 44849 32991 36484 48230 19091 -13251 -24008 -55113 -68422 -87029 -80920 -39390
$$ packed form
13069D8098M730q2470m3285N6503M1420k1154J5684j9334k4912L859J0626O988
13057c247J8827Q197k5400M080l245J5766K7216m4872p2003K8242P8619K0479
13045E2659n4851r333m808l0235l2657J2567K581L7428j4299n965J2700L5764
13033A551N9865j693l8888O121M135K3424K6961M2573m261j4870k6665m0840o029
13020C1384K9497m748M863k6528p67R934j1067n8809R318K046K1963J6164K4061
13007D7311N1709l1184o7106J8299R711n0229m4702k4900N8612N240l9005O169
12995f0075K9207K1728N955k8669L891j1858K6566J2570L259M4957n2526j1511
12983a6506O1355j1858L493J1746k9139l2342j0757l1105j3309j8607O109M1530
$$ plain form
12971 -39390 3249 28138 19317 -18037 -32098 8836 -316 58301 94427 81785 60575 46819
12959 46819 33493 11676 34282 70794 81984 40077 36911 32186 44042 39200 42864 72018
12947 72018 83073 88648 101239 69810 43194 8456 -11907 34224 106565 122325 116473 121711
12935 121711 134360 129382 123117 132222 187348 260892 304061 383909 522705 676345 790225
12924 790225 933135 1113330 1237646 1297527 1286429 1154538 988568 824136 665062 525129
12914 525129 468728 421103 363845 313586 271387 250268 232299 223096 196055 135514 145697 141625
12902 141625 140140 161691 177178 176436 103841 90960 81821 54342 31353 35620 70834 92486
12890 92486 57975 37652 50930 46400 28204 75323 102304 90776 55707 42784 82214 63620
$$ packed form
12971c9390M2639K4889q821l7354j4061M0934r152N8617L6126j2642k1210j3756
12959D6819j3326k1817K2606L6512J1190m1907l166m725J1856m842L664K9154
12947G2018J1055N575J2591l1429k6616l4738k0363M6131P2341J5760n852N238
12935A21711J2649m978o265R105N5126P3544M3169P9848J38796J53640J13880
12924G90225J42910J80195J24316N9881j1098j31891j65970j64432j59074j39933
12914E25129n6401m7625n7258n0259m2199k1119j7969r203k7041o0541J0183m072
12902A41625j485K1551J5487p42p2595j2881r139k7479k2989M267L5214K1652
12890I2486l4511k0323J3278m530j8196M7119K6981j1528l5069j2923L9430j8594
$$ plain form
12878 63620 51680 81970 93546 86982 36487 -1533 34039 33062 -2523 5532 18605 41431
12866 41431 57042 35112 11483 10227 48261 60225 81904 72274 85446 93146 62416 50968
12854 50968 53994 23380 42483 60630 74324 87192 70008 58778 26822 54383 96598 60266
12842 60266 63828 96529 118695 137714 126311 108642 36468 250 -1693 -43700 -10953 44076
12830 44076 63618 35529 2169 -16196 -17479 -26778 -44256 -12022 14348 28562 5057 5235
12818 5235 5875 10455 14839 38190 14974 18154 35906 101743 158341 145006 94838 60834 25539
12805 25539 43975 69316 89687 68398 29930 35495 31755 22941 57073 83369 139447 140108 121981
12792 121981 123777 152017 130035 101829 135807 192904 206508 141940 111928 96347 65883 52285
$$ packed form
12878F3620j1940L0290J1576o564n0495l8020L5572r77l5585Q055J3073K2826
12866D1431J5611k1930k3629j256L8034J1964K1679r630J3172P700l0730j1448
12854E0968L026l0614J9103J8147J3694J2868j7184j1230l1956K7561M2215l6332
12842F0266L562L2701K2166J9019j1403j7669p2174l6218j943m2007L2747N5029
12830D4076J9542k8089l3360j8365j283r299j7478L2234K6370J4214k3505J78
12818E235O40M580M384K3351k3216L180J7752O5837N6598j3335n0168l4004l5295
12805B5539J8436K5341K0371k1289l8468N565l740q814L4132K6296N6078O61j8127
12792A21981J796K8240k1982k8206L3978N7097J3604o4568l0012j5581l0464j3598
$$ plain form
12780 52285 23079 -13321 -6999 39887 93074 86183 99978 95377 84858 88058 56521 54746 30330
12767 30330 587 3464 28996 63486 34513 1223 4146 9765 9318 21083 45626 53813 61100
12754 61100 66670 72814 88203 91963 72709 51791 67797 104422 79841 61713 59690 91599
12742 91599 127972 125788 104360 81134 83958 139447 187656 197047 185615 157404 158438 136101
12730 136101 136625 214769 219020 183489 126335 117545 122978 163986 194081 199944 214259 222776 205015
12717 205015 227266 244399 226298 228593 246683 298370 321264 387539 456128 538168 613802 703087
12705 703087 745624 776826 751495 691080 560115 522823 475602 375225 376431 360784 332176
12694 332176 294206 267111 253240 236790 226913 210373 180074 190120 196936 191591 184773 176773
$$ packed form
12780E2285k9206l6400O322M6886N3187o891J3795m601j0519L200l1537j775k4416
12767C0330k9743K877K5532L4490k8973l3290K923N619m47J1765K4543Q187P287
12754F1100N570O144J5389L760j9254k0918J6006L6625k4581j8128k023L1909
12742I1599L6373k184k1428k3226K824N5489M8209R391j1432k8211J034k2337
12730A36101N24P8144M251l5531n7154q790N433M1008L0095N863J4315Q517j7761
12717B05015K2251J7133j8101K295J8090N1687K2894O6275O8589Q2040P5634Q9285
12705G03087M2537L1202k5331o0415j30965l7292m7221j00377J206j5647k8608
12694C32176l7970k7095j3871j6450r877j6540l0299J0046O816n345o818q000
$$ plain form
12682 176773 155756 188343 196564 225663 241150 212829 182986 162980 147272 101188 77563 96101
12670 96101 128611 139350 103511 78861 120404 130708 130795 109819 104413 86688 71045 96558
12658 96558 132801 125439 129800 141032 186493 251330 230433 186749 158369 175589 147260 116241
12646 116241 98257 89600 121783 192961 236649 209875 170466 247454 262137 238533 242223 203215
12634 203215 208277 245244 242419 246872 273017 297102 282852 290003 343331 341585 332696 345239 388077
12621 388077 387863 373677 350054 412272 449428 495939 485219 477036 525076 611004 656157 680594
12609 680594 715305 766158 830426 881419 904172 990228 1074869 1071886 1081274 1070597 1073678 1075347
12597 1075347 1080607 1127350 1171574 1180411 1161521 1196603 1252326 1285551 1297889 1252318 1177288 1108966
$$ packed form
12682A76773k1017L2587Q221K9099J5487k8321k9843k0006j5708m6084k3625J8538
12670I6101L2510J0739l5839k4650M1543J0304Q7k0976n406j7725j5643K5513
12658I6558L6243p362M361J1232M5461O4837k0897m3684k8380J7220k8329l1019
12646A16241j7984q657L2183P1178M3688k6774l9409P6988J4683k3604L690l9008
12634B03215N062L6967k825M453K6145K4085j4250P151N3328j746q889J2543M2838
12621C88077k14j4186k3623O2218L7156M6511j0720q183M8040Q5928M5153K4437
12609F80594L4711N0853O4268N0993K2753Q6056Q4641k983R388j0677L081J669
12597A075347N260M6743M4224Q837j8890L5082N5723L3225J2338m5571p5030o8322
$$ plain form
12585 1108966 1078092 995535 912295 852802 841276 875944 905139 948522 958327 1002727 1023881
12574 1023881 1034257 1026451 988797 977896 983395 975204 960735 952921 956352 919652 891740 864574
12562 864574 890265 924673 950870 980217 992229 970916 970090 988856 997156 993905 1054340 1082548
12550 1082548 1107908 1118177 1105417 1085353 1089139 1116407 1092644 1035320 1042247 1114658 1150728 1210551
12538 1210551 1256075 1278955 1319616 1368247 1420595 1450482 1467201 1502122 1512396 1576864 1625770
12527 1625770 1653033 1684534 1733805 1810020 1859489 1904344 1977699 2071753 2154073 2256450 2358760
12516 2358760 2487287 2603456 2749424 2883667 3022045 3144633 3305333 3491200 3681108
12507 3681108 3899810 4166677 4429828 4743013 5079978 5464599 5951610 6467999 7067827
$$ packed form
12585A108966l0874q2557q3240n9493j1526L4668K9195M3383R805M4400K1154
12574A023881J0376p806l7654j0901N499q191j4469p814L431l6700k7912k7166
12562H64574K5691L4408K6197K9347J2012k1313q26J8766Q300l251O0435K8208
12550A082548K5360J0269j2760k0064L786K7268k3763n7324O927P2411L6070N9823
12538A210551M5524K2880M0661M8631N2348K9887J6719L4921J0274O4468M8906
12527A625770K7263L1501M9271P6215M9469M4855P3355R4054Q2320J02377J02310
12516B358760J28527J16169J45968J34243J38378J22588J60700J85867J89908
12507C681108K18702K66867K63151L13185L36965L84621M87011N16389N99828
$$ plain form
12498 7067827 7741573 8465298 9320164 10290361 11548192 13037935 14830430 17004626 19633158
12489 19633158 22864349 26974268 32198149 38941718 47960058 60500193 78387041 103917873
12481 103917873 137339227 173915212 209692429 244025447 271155670 279880245 267556552
12474 267556552 239137154 195553020 151095767 117473528 94718118 79308316 68420238
12467 68420238 60272741 53900233 48748671 44459869 40861644 37819759 35227951 33013863
12459 33013863 31065719 29283836 27596234 26011694 24526750 23209651 22086394 21154984
12451 21154984 20308123 19566678 18967095 18370971 17851684 17346545 16863594 16482016 16148259
12442 16148259 15756504 15337597 14798897 14220767 13697650 13279931 12887152 12461287 12164706
$$ packed form
12498G067827O73746P23725Q54866R70197J257831J489743J792495K174196K628532
12489A9633158L231191M109919N223881O743569R018340J2540135J7886848K5530832
12481A03917873L3421354L6575985L5777217L4333018K7130223Q724575j2323693
12474B67556552k8419398m3584134m4457253l3622239k2755410j5409802j0888078
12467F8420238q147497o372508n151562m288802l598225l041885k591808k214088
12459C3013863j948144j781883j687602j584540j484944j317099j123257r31410
12451B1154984q46861p41445n99583n96124n19287n05139m82951l81578l33757
12442A6148259l91755m18907n38700n78130n23117m17719l92779m25865k96581
$$ plain form
12433 12164706 11942955 11691323 11444490 11162672 10861759 10604397 10304498 9967242 9632493
12424 9632493 9295596 8993592 8734641 8514400 8320955 8127644 7958208 7825140 7685547
12415 7685547 7536311 7362975 7174011 7024744 6836299 6618887 6496270 6381736 6294377 6198130
12405 6198130 6084692 5967867 5874612 5808835 5661057 5514917 5385742 5281727 5203015 5137718
12395 5137718 5077280 4990456 4843408 4747398 4662286 4588209 4542589 4454844 4353522 4304507 4262342
12384 4262342 4138240 3982889 3907879 3798687 3689718 3570112 3489808 3471810 3470719 3425196
12374 3425196 3363351 3306764 3224003 3134899 3114740 3097190 3049970 3055740 3094157 3132925 3137749 3132687
12362 3132687 3156475 3158817 3121440 3109634 3086671 3073857 3100171 3098882 3076523 3041171 3024789 3002243
$$ packed form
12433A2164706k21751k51632k46833k81818l00913k57362k99899l37256l34749
12424I632493l36897l02004k58951k20241j93445j93311j69436j33068j39593
12415G685547j49236j73336j88964j49267j88445k17412j22617j14534q7359r6247
12405F198130j13438j16825r3255o5777j47778j46140j29175j04015p8712o5297
12395E137718o0438q6824j47048r6010q5112p4077m5620q7745j01322m9015m2165
12384D262342j24102j55351p5010j09192j08969j19606q0304j7998j091m5523
12374C425196o1845n6587q2761q9104k0159j7550m7220N770L8417L8768M824n062
12362C132687K3788K342l7377j1806k2963j2814K6314j289k2359l5352j6382k2546
$$ plain form
12350 3002243 2970340 2942493 2903503 2860372 2837019 2803851 2762850 2634372 2527604 2482274 2375646
12339 2375646 2274957 2257798 2286592 2267080 2214598 2167834 2083743 2064130 2039564 1984464 1949343
12328 1949343 1892396 1853515 1797123 1773199 1804303 1806968 1763546 1702552 1669008 1688733 1662818
12317 1662818 1634447 1603911 1575622 1558768 1540033 1502543 1477123 1402660 1388413 1396354 1365189
12306 1365189 1299751 1293398 1316729 1262995 1237923 1222680 1264176 1271247 1236555 1201321 1169639 1136437
12294 1136437 1123436 1133423 1118305 1095233 1118517 1098517 1053731 1050339 1041853 1033176 1066695 1122842
12282 1122842 1118097 1057055 947852 895920 874339 872644 834380 818124 815982 828698 834111 799934
12270 799934 823346 811598 793117 766644 737465 728363 728382 720685 723731 682959 653062 668944 637485
$$ packed form
12350C002243l1903k7847l8990m3131k3353l3168m1001j28478j06768m5330j06628
12339B375646j00689j7159K8794j9512n2482m6764q4091j9613k4566n5100l5121
12328A949343n6947l8881n6392k3924L1104K665m3422o0994l3544J9725k5915
12317A662818k8371l0536k8289j6854j8735l7490k5420p4463j4247P941l1165
12306A365189o5438o353K3331n3734k5072j5243M1496P071l4692l5234l1682l3202
12294A136437j3001R987j5118k3072K3284k0000m4786l392q486q677L3519N6147
12282A122842m745o1042j09203n1932k1581j695l8264j6256k142J2716N413l4177
12270G99934K3412j1748j8481k6473k9179r102J9p697L046m0772k9897J5882l1459
$$ plain form
12257 637485 602786 622075 648040 639157 664588 669984 657478 604150 592254 599658 604573 606425
12245 606425 580123 541625 493289 462017 485212 485218 475412 481287 445961 453775 429498 394411 413470
12232 413470 459233 485924 468201 432620 426782 455273 470705 452044 439421 400634 419501 407485
12220 407485 378196 357896 351931 379453 360561 313547 334433 350718 364292 331887 313722 315071
12208 315071 351385 364908 364542 362279 396080 358812 315812 328095 324325 310067 297095 268979
12196 268979 260920 236688 291448 320992 338969 351860 342011 354334 336067 349435 345431 331709
12184 331709 352777 381778 331765 308736 283023 259519 281055 254674 231107 230369 247848 247528
12172 247528 207035 249573 270593 263880 201264 167287 170580 127022 90216 153414 179231 163991
$$ packed form
12257F37485l4699J9289K5965q883K5431N396j2506n3328j1896P404M915J852
12245F06425k6302l8498m8336l1272K3195Or806N875l5326P814k4277l5087J9059
12232D13470M5763K6691j7723l5581n838K8491J5432j8661j2623l8787J8867j2016
12220D07485k9289k0300n965K7522j8892m7014K0886J6285J3574l2405j8165J349
12208C15071L6314J3523l66k263L3801l7268m3000J2283l770j4258j2972k8116
12196B68979q059k4232N4760K9544J7977J2891r849J2323j8267J3368m004j3722
12184C31709K1068K9001n0013k3029k5713k3504K1536k6381k3567p38J7479l20
12172B47528m0493M2538K1020o713o2616l3977L293m3558l6806O3198K5817j5240
$$ plain form
12160 163991 202829 211290 202617 157063 130608 109801 95096 105011 169686 224031 222941 216165
12148 216165 186203 184469 191741 179221 186836 176140 187470 173782 144635 127424 97951 111599
12136 111599 141206 165626 178598 153664 158251 209289 207974 205428 193602 184667 202565 226776
12124 226776 215700 186928 163586 145523 148635 192810 194343 220013 239313 213662 229751 236252
12112 236252 285999 263125 169606 154169 164877 170805 191241 180281 205129 217193 218577 186093
12100 186093 150153 170506 188759 201989 216757 200205 147409 149330 178747 188148 193235 203815
12088 203815 204313 250804 237677 239281 272213 295542 322790 326993 365065 327812 276334 268713
12076 268713 286878 293356 316545 308354 258280 258085 303953 316198 380064 373938 384232 441826
$$ packed form
12160A63991L8838Q461q673m5554k6455k0807j4705R915O4675N4345j090o776
12148B16165k9962j734P272j2520P615j0696J1330j3688k9147j7211k9473J3648
12136A11599K9607K4420J2972k4934M587N1038j315k546j1826q935J7898K4211
12124B26776j1076k8772k3342j8063L112M4175J533K5670J9300k5651J6089O501
12112B36252M9747k2874r3519j5437J0708N928K0436j0960K4848J2064J384l2484
12100A86093l5940K0353J8253J3230J4768j6552n2796J921K9417R401N087J0580
12088B03815M98M6491j3127J604L2932K3329K7248M203L8072l7253n1478p621
12076B68713J8165O478K3189q191n0074j95M5868J2245O3866o126J0294N7594
$$ plain form
12064 441826 457571 422142 365601 347670 366634 424489 416005 406057 426523 402402 373089 373104
12052 373104 368111 385428 416220 411067 451434 470562 492030 468918 422774 431339 404462 422268
12040 422268 479194 518105 517537 552559 584485 621722 663866 699394 729670 781142 917725 1096714
12028 1096714 1244936 1384394 1558168 1659196 1708253 1664416 1526154 1365815 1131955 954924
12018 954924 842673 712021 617957 540315 476701 470831 485359 486116 482914 449199 469078 513621
12006 513621 486210 466073 451344 411532 438441 471564 476863 474078 484454 459479 446654 451350
11994 451350 432917 426407 450451 497329 539537 522696 505841 491304 497450 501586 503182 519005
11982 519005 555341 572316 561874 595617 608104 609373 622124 648271 646504 697362 745862 792562
$$ packed form
12064D41826J5745l5429n6541j7931J8964N7855q484r948K0466k4121k9313J5
12052C73104m993J7317L0792n153M0367J9128K1468k3112m6144Q565k6877J7806
12040D22268N6926L8911n68L5022L1926L7237M2144L5528L0276N1472J36583J78989
12028A096714J48222J39458J73774J01028M9057m3837j38262j60339k33860j77031
12018I54924j12251j30652r4064p7642o3614n870J4528P57l202l3715J9879M4543
12006E13621k7411k0137j4729l9812K6909L3123N299k785J0376k4975j2825M696
11994D51350j8433o510K4044M6878M2208j6841j6855j4537O146M136J596J5823
11982E19005L6336J6975j0442L3743J2487J269J2751K6147j767N0858M8500M6700
$$ plain form
11970 792562 871363 900852 928745 989561 1043500 1082484 1151470 1193663 1277044 1363483 1512556
11959 1512556 1628591 1715761 1851811 1968311 2160098 2320991 2499230 2781837 3114576 3499365
11949 3499365 3987757 4518732 5181090 5992732 6987943 8263801 9939855 12183440 15345153
11940 15345153 19811437 26238058 35362842 46825956 58055064 66797242 74410439 80696057
11932 80696057 79020126 66531880 50962958 38607352 30184957 24495639 20594172 17779355
11924 17779355 15658541 14014121 12707758 11671969 10776352 10033431 9399789 8840854 8322857
11915 8322857 7842671 7380623 6987437 6573490 6190070 5857327 5648059 5473610 5333097
11906 5333097 5219164 5124555 5015061 4867745 4787414 4739807 4726968 4691184 4592338 4397741
$$ packed form
11970G92562P8801K9489K7893O0816N3939L8984O8986M2193Q3381Q6439J49073
11959A512556J16035Q7170J36050J16500J91787J60893J78239K82607L32739L84789
11949C499365M88392N30975O62358Q11642R95211J275858J676054K243585L161713
11940A5345153M466284O426621R124784J1463114J1229108Q742178P613197O285618
11932H0696057j675931j2488246j5568922j2355606q422395n689318l901467k814817
11924A7779355k120814j644420j306363j035789q95617p42921o33642n58935n17997
11915H322857m80186m62048l93186m13947l83420l32743k09268j74449j40513
11906E333097j13933r4609j09494j47316q0331m7607j2839l5784r8846j94597
$$ plain form
11896 4397741 4201436 4062511 3937065 3827406 3720781 3588027 3432131 3323739 3257081 3192865
11886 3192865 3119612 3018874 2920605 2810566 2665039 2534946 2423712 2368485 2330084 2237740
11876 2237740 2166407 2094432 2065474 2046542 1998145 2021383 2003896 1906998 1822636 1827103 1798353
11865 1798353 1737104 1737748 1754706 1729662 1676200 1630077 1585220 1542149 1518806 1462580 1449234 1423262
11853 1423262 1408470 1405547 1390100 1302857 1277299 1282336 1273854 1253445 1164055 1108795 1089187 1097040
11841 1097040 1045937 986411 953633 954794 953659 906008 899349 859866 877952 881952 854185 830174
11829 830174 804756 822116 835145 838755 841697 860841 893099 864326 873473 925802 934250 905953
11817 905953 882636 807957 760897 791277 816499 810972 799225 775831 749542 732157 761375 824905
$$ packed form
11896D397741j96305j38925j25446j09659j06625j32754j55896j08392o6658o4216
11886C192865p3253j00738r8269j10039j45527j30093j11234n5227l8401r2344
11876B237740p1333p1975k8958j8932m8397K3238j7487r6898q4362M467k8750
11865A798353o1249O44J6958k5044n3462m6123m4857m3071k3343n6226j3346k5972
11853A423262j4792k923j5447q7243k5558N037q482k0409q9390n5260j9608P853
11841A097040n1103n9526l2778J161j135m7651o659l9483J8086M000k7767k4011
11829H30174k5418J7360J3029L610K942J9144L2258k8773R147N2329Q448k8297
11817I05953k3317p4679m7060L0380K5222n527j1747k3394k6289j7385K9218O3530
$$ plain form
11805 824905 812684 784846 747975 749203 734488 721738 731262 696665 672617 618381 555155 547306
11793 547306 585993 540096 545240 553490 567738 582454 550553 558246 565631 527113 493656 490157
11781 490157 488621 462649 451400 485158 479569 490266 483615 506545 467731 411810 408818 428598
11769 428598 425423 420192 414782 382131 331881 344047 371768 367149 354122 313044 284050 275404
11757 275404 286804 336403 349774 327968 330737 337548 340815 351397 371322 387108 382276 348949
11745 348949 319078 286861 277514 286601 281782 262867 306193 282843 234170 253027 283062 258329
11733 258329 235834 242558 232996 238902 193471 158424 121594 146237 167550 151130 160796 193055
11721 193055 196621 181720 161456 194476 232997 256423 257110 251827 243276 217949 208885 225994 270609
$$ packed form
11805H24905j2221k7838l6871J228j4715j2750R524l4597k4048n4236o3226p849
11793E47306L8687m5897N144Q250J4248J4716l1901P693P385l8518l3457l499
11781D90157j536k5972j1249L3758n589J0697o651K2930l8814n5921k992J9780
11769D28598l175n231n410l2651n0250J2166K7721m619j3027m1078k8994q646
11757B75404J1400M9599J3371k1806K769O811L267J0582J9925J5786m832l3327
11745C48949k9871l2217r347R087m819j8915M3326k3350m8673J8857L0035k4733
11733B58329k2495O724r562N906m5431l5047l6830K4643K1313j6420R666L2259
11721A93055L566j4901k0264L3020L8521K3426O87n283q551k5327r064J7109M4615
$$ plain form
11708 270609 309993 318088 314336 319891 359342 360823 314849 310918 293323 245944 203790 243360
11696 243360 294587 259919 205589 213807 227564 204172 220355 251431 250758 240914 245566 249969 232242
11683 232242 206189 214426 196159 174497 168036 141874 134834 139773 128421 96072 104705 132987
11671 132987 130128 88357 54115 61978 105576 116322 137143 109464 68562 61319 77927 101763
11659 101763 92427 105893 134531 130846 83973 41510 44381 71443 72918 80177 63940 86550
11647 86550 107477 89773 92001 109666 89776 52269 3759 -5905 -11408 802 29571 39997
11635 39997 69964 82395 49337 66591 45360 7542 29023 53021 21340 10599 4937 -3399
11623 -3399 1458 26890 54970 84638 108897 109311 99661 90270 41375 15926 2828 -10512 -12027
$$ packed form
11708B70609L9384Q095l752N555L9451J481m5974l931j7595m7379m2154L9570
11696B43360N1227l4668n4330Q218J3757k3392J6183L1076o73r844M652M403j7727
11683B32242k6053Q237j8267k1662o461k6162p040M939j1352l2349Q633K8282
11671A32987k859m1771l4242P863M3598J0746K0821k7679m0902p243J6608K3836
11659A01763r336J3466K8638l685m6873m2463K871K7062J475P259j6237K2610
11647H6550K0927j7704K228J7665j9890l7507m8510r664n503J2210K8769J0426
11635C9997K9967J2431l3058J7254k1231l7818K1481K3998l1681j0741n662q336
11623c399M857K5432K8080K9668K4259M14r650r391m8895k5449j3098j3340j515
$$ plain form
11610 -12027 -23664 5838 34005 32033 12479 21549 60466 54209 48060 44152 73480 90978 61789
11597 61789 60280 48467 37948 57861 88090 97384 69491 65219 57501 26522 61409 68597 49219
11584 49219 23987 47555 49584 70306 59230 15080 21280 64501 1194 4133 -13959 -24826
11572 -24826 -9469 5255 3463 19726 11675 24229 35570 31244 39687 3808 -6826 -15507 -14663
11559 -14663 20216 4063 -3585 21799 25679 33145 30039 33737 27418 40988 31891 28412 48274
11546 48274 23829 -8289 2499 -10572 -32364 -20544 5247 8001 3028 6350 22333 28931
11534 28931 -29016 -49041 -27514 15254 45489 47274 8965 -3167 21948 27949 21180 32122
11522 32122 9929 50593 67389 60213 56701 22898 -2175 40256 27037 -23974 -41645 -58197
$$ packed form
11610a2027j1637K9502K8167j972j9554R070L8917o257o149l908K9328J7498k9189
11597F1789j509j1813j0519J9913L0229R294k7893m272p718l0979L4887P188j9378
11584D9219k5232K3568K029K0722j1076m4150O200M3221o3307K939j8092j0867
11572b4826J5357J4724j792J6263q051J2554J1341m326Q443l5879j0634q681Q44
11559a4663L4879j6153p648K5384L880P466l106L698o319J3570r097l479J9862
11546D8274k4445l2118J0788j3071k1792J1820K5791K754m973L322J5983O598
11534B8931n7947k0025K1527M2768L0235J785l8309j2132K5115O001o769J0942
11522C2122k2193M0664J6796p176l512l3803k5073M2431j3219n1011j7671j6552
$$ plain form
11510 -58197 -77922 -55411 -52234 -27289 -6756 16480 19988 -1930 18614 12235 16093 10178 3858
11497 3858 6014 -13613 -18369 -29098 -2218 15695 35936 55286 23558 7879 9534 23776
11485 23776 1623 -69853 -84400 -57492 -33116 -1293 8012 1224 -10950 15892 53569 46657
11473 46657 -2764 -14881 -3166 38768 75915 82761 57595 51326 44379 75479 63785 29409
11461 29409 14450 49094 66361 26512 47926 30934 35291 36261 10023 -23119 -29451 -6069
11449 -6069 7426 24274 -12498 12803 15096 -11734 -19639 -62715 -88292 -68632 -11783 -2524
11437 -2524 47029 35687 14079 36830 30668 25700 12801 -24700 2897 22800 26504 -9065
11425 -9065 24462 39160 32363 9629 -18286 -42663 -40981 -49215 -10986 15424 16796 22356 31498
$$ packed form
11510e8197j9725K2511L177K4945K0533K3236L508k1918K0544o379L858n915o320
11497C858K156j9627m756j0729K6880J7913K0241J9350l1728j5679J655J4242
11485B3776k2153p1476j4547K6908K4376L1823R305o788j2174K6842L7677o912
11473D6657m9421j2117J1715M1934L7147O846k5166o269o947L1100j1694l4376
11461B9409j4959L4644J7267l9849K1414j6992M357R70k6238l3142o332K3382
11449f069J3495J6848l6772K5301K293k6830p905m3076k5577J9660N6849R259
11437b524M9553j1342k1608K2751o162m968j2899l7501K7597J9903L704l5569
11425i065L3527J4698o797k2734k7915k4377J682q234L8229K6410J372N560R142
$$ plain form
11412 31498 10856 -21458 -24116 8143 8676 17678 51342 39320 64120 79201 96773 88538 64413
11399 64413 80460 72814 24459 -19139 -28590 -31340 -11265 20745 59107 50706 3485 6964 11608
11386 11608 -11472 -20106 -2707 27660 26755 28788 30780 9833 -12215 -25457 -29456 -14660 -10459
11373 -10459 -46355 -60080 -72646 -75582 -91137 -79852 -64089 -48454 -49098 -59393 -26876 -5514
11361 -5514 -18632 -21745 28932 53158 20591 -16743 -53155 -60461 -36030 -67509 -105318 -73888
11349 -73888 -33230 14573 42312 44131 15603 33414 8216 -19066 -35256 -3388 -18551 -50954
11337 -50954 -80139 -44405 -14397 -59364 -49283 -40571 -50799 -38095 -5753 -5246 163 25588
11325 25588 57698 37233 32849 32153 30546 26705 41597 137046 170039 152505 109204 81935 78897
$$ packed form
11412C1498k0642l2314k658L2259N33R002L3664j2022K4800J5081J7572q235k4125
11399F4413J6047p646m8355m3598r451k750K0075L2010L8362q401m7221L479M644
11386A1608k3080q634J7399L0367r05K033J992k0947k2048j3242l999J4796M201
11373a0459l5896j3725j2566k936j5555J1285J5763J5635o44j0295L2517K1362
11361e514j3118l113N0677K4226l2567l7334l6412p306K4431l1479l7809L1430
11349g3888M0658M7803K7739J819k8528J7811k5198k7282j6190L1868j5163l2403
11337e0954k9185L5734L0008m4967J0081Q712j0228J2704L2342N07N409K5425
11325B5588L2110k0465m384o96j607l841J4892R5449L2993j7534m3301k7269l038
$$ plain form
11312 78897 38922 7024 -67094 -88856 -104856 -60922 -24795 -776 -14585 -24617 -49826 -45161
11300 -45161 9422 3876 -3041 -28282 -8509 -20014 10572 8993 -23094 4825 5970 5251 36993
11287 36993 39226 23235 -14461 10225 15171 -12591 20144 22369 15239 2895 2098 -10380 -28770
11274 -28770 -59082 -71719 -28407 -40138 -49950 -58032 -67330 -24755 -3344 -21692 -30494 -42601
11262 -42601 -34748 -22152 -18240 -25416 21966 29945 -10313 -10575 -22285 -22533 -50281 -52130 -2026
11249 -2026 -7949 -34860 -86551 -89161 -94246 -101301 -94318 -166422 -133828 -99946 -105893 -98198 -92746
11236 -92746 -116600 -111381 -69697 -32003 -15154 -9953 -14354 703 3301 -3168 591 -25670 -37167
11223 -37167 -77205 -58313 -30625 -24279 -37772 -27153 -17392 -218 31433 55564 41435 20776
$$ packed form
11312G8897l9975l1898p4118k1762j6000M3934L6127K4019j3809j0032k5209M665
11300d5161N4583n546o917k5241J9773j1505L0586j579l2087K7919J145p19L1742
11287C6993K233j5991l7696K4686M946k7762L2735K225p130j2344p97j2478j8390
11274b8770l0312j2637M3312j1731r812q082r298M2575K1411j8348q802j2107
11262d2601P853J2596L912p176M7382P979m0258k62j1710k48k7748j849N0104
11249b026n923k6911n1691k610n085p055O983p2104L2594L3882n947P695N452
11236i2746k3854N219M1684L7694J6849N201m401J5057K598o469L759k6261j1497
11223c7167m0038J8892K7688O346j3493J0619R761J7174L1651K4131j4129k0659
$$ plain form
11211 20776 -21336 -22625 -37526 -51283 257 -9450 -29534 -15994 27367 74153 67588 48080
11199 48080 79317 76412 42698 42263 48182 4993 -1549 -51062 -31481 25570 28866 35946 59236
11186 59236 85106 63412 30963 57773 51746 -5942 1236 5438 16150 37833 58975 65011
11174 65011 78846 63441 44902 2512 -16905 -20830 -22231 -14485 -28958 -47096 -43130 -518
11162 -518 21632 48675 33957 -47732 -55315 -30540 -22790 -48250 -25476 -13089 13419 41508
11150 41508 36830 18693 -19829 -21749 -12382 1471 12827 14425 58241 107422 89507 56083
11138 56083 37368 26848 14791 36160 69157 23057 1936 -15855 -2024 54058 67354 56526
11126 56526 44078 37558 18537 -43550 -75953 -65338 -41291 5048 41072 25990 12337 41842
$$ packed form
11211B0776m2112j289j4901j3757N1540r707k0084J3540M3361M6786o565j9508
11199D8080L1237k905l3714m35N919m3189o542m9513J9581N7051L296P080K3290
11186E9236K5870k1694l2449K6810o027n7688P178M202J0712K1683K1142O036
11174F5011J3835j5405j8539m2390j9417l925j401P746j4473j8138L966M2612
11162e18K2150K7043j4718q1689p583K4775P750k5460K2774J2387K6508K8089
11150D1508m678j8137l8522j920R367J3853J1356J598M3816M9181j7915l3424
11138E6083j8715j0520j2057K1369L2997m6100k1121j7791J3831N6082J3296j0828
11126E6526j2448o520j9021o2087l2403J0615K4047M6339L6024j5082j3653K9505
$$ plain form
11114 41842 77640 77119 67479 58781 51969 40416 13435 -16852 -28616 -15694 1318 -26100 -13194
11101 -13194 2746 4320 -5430 -41286 -7132 256 7755 30 13690 -4119 -39930 -51180 -23240
11088 -23240 43018 46464 -615 3916 12380 -23930 -41289 -23706 -18085 -19409 -39460 -55263 -41834
11075 -41834 8921 52288 19501 -26649 -55848 -28125 -4797 33285 15358 40333 35261 30227
11063 30227 -21042 -39868 1826 11543 -2782 -50242 -43874 -25296 -9758 14457 57129 44530
11051 44530 50510 54170 46023 52458 49110 40849 81897 108622 61629 42530 56508 49004 23343
11038 23343 29529 63886 82450 110876 126460 155584 168793 189900 173038 182908 194563 184159
11026 184159 183984 182464 213782 221096 212417 245894 262650 314180 344508 312098 279501 277927 293035
$$ packed form
11114D1842L5798n21r640q698o812j1553k6981l0287j1764J2922J7012k7418J2906
11101a3194J5940J574r750l5856L4154P388P499p725J3660j7809l5811j1250K7940
11088b3240O6258L446m7079M531Q464l6310j7359J7583N621j324k0051j5803J3429
11075d1834N0755M3367l2787m6150k9199K7723K3328L8082j7927K4975n072n034
11063C0227n1269j8826M1694R717j4325m7460O368J8578J5538K4215M2672j2599
11051D4530N980L660q147O435l348q261M1048K6725m6993j9099J3978p504k5661
11038B3343O186L4357J8564K8426J5584K9124J3209K1107j6862R870J1655j0404
11026A84159j75j520L1318P314q679L3477J6756N1530L0328l2410l2597j574J5108
$$ plain form
11013 293035 280978 232909 194663 246161 256057 260922 280220 252537 229082 165069 122517 127029
11001 127029 116705 88740 117025 160056 145890 129959 110915 75422 62016 45217 94143
10990 94143 116093 129380 76272 72484 103859 94247 74365 52565 68340 97799 69524 62880
10978 62880 69032 42152 39514 42002 33993 12105 -31966 -45319 -41201 -41218 11879 69957 83648
10965 83648 84733 28909 -30157 -5379 16757 17078 32933 9469 24071 54297 33942 31246
10953 31246 6190 -16598 46724 61268 71545 57734 57014 52388 52029 32195 53802 71918 87004
10940 87004 117649 79135 6998 -25800 -44235 20714 48675 20992 22372 38764 6517 -31394
10928 -31394 -3895 -6451 -33139 -49929 -58142 -30994 30657 36001 4666 30383 70507 53366
$$ packed form
11013B93035j2057m8069l8246N1498R896M865J9298k7683k3455o4013m2552M512
11001A27029j0324k7965K8285M3031j4166j5931j9044l5493j3406j6799M8926
10990I4143K1950J3287n3108l788L1375r612j9882k1800J5775K9459k8275o644
10978F2880O152k6880k638K488q009k1888m4071j3353M118j7N3097N8078J3691
10965H3648J085n5824n9066K4778K2136L21J5855k3464J4602L0226k0355k696
10953C1246k5056k2788O3322J4544J0277j3811p20m626l59j9834K1607J8116J5086
10940H7004L0645l8514p2137l2798j8435O4949K7961k7683J380J6392l2247l7911
10928c1394K7499k556k6688j6790q213K7148O1651N344l1335K5717M0124j7141
$$ plain form
10916 53366 40645 41273 38617 42834 26531 -5835 6570 37536 84178 91752 38372 36742 40200
10903 40200 815 -16394 -1650 27678 27450 48891 31976 43634 49145 19668 -5324 -2728
10891 -2728 -7703 -52821 -63445 -38538 -55771 -63731 -83000 -69345 -24526 -12457 5801 -16223
10879 -16223 -21251 -28017 -22321 -39479 5340 -17834 -36394 -19511 -22551 -63327 -59225 -47214 -29272
10866 -29272 -6138 26773 6078 20709 38033 25495 -9633 -1243 1912 33434 40746 34064
10854 34064 12341 11942 57264 49984 41024 36592 -18348 -49533 -36837 155 2402 -31234 -60199
10841 -60199 -56011 -57260 -65300 -29325 -16785 19616 63000 21460 -44751 -43255 17680 16015 10383
10828 10383 -12834 -28958 -6375 -9470 -3960 -19699 -14915 24874 60315 53725 80218 97112
$$ packed form
10916E3366j2721O28k656M217j6303l2366J2405L0966M6642P574n3380j630L458
10903D0200l9385j7209J4744K9328k28K1441j6915J1658N511k9477k4992K596
10891b728m975m5118j0624K4907j7233p960j9269J3655M4819J2069J8258k2024
10879a6223n028o766N696j7158M4819k3174j8560J6883l040m0776M102J2011J7942
10866b9272K3134L2911k0695J4631J7324j2538l5128Q390L155L1522P312o682
10854C4064k1723l99M5322p280q960m432n4940l1185J2696L6992K247l3636k8965
10841f0199M188j249q040L5975J2540L6401M3384m1540o6211J496O0935j665n632
10828A0383k3217j6124K2583l095N510j5739M784L9789L5441o590K6493J6894
$$ plain form
10816 97112 57833 66586 60048 27929 30802 44704 42384 60749 94001 53093 23320 20804 -1535
10803 -1535 16248 34120 34728 16111 -9131 2456 46904 52827 57588 85982 103030 83051 63911
10790 63911 35213 67187 74277 42375 33104 32219 -8715 9889 -3355 -22565 -65702 -42167
10778 -42167 -25310 -52858 2675 37256 35326 35456 69833 56594 30068 12342 27006 2152
10766 2152 18077 15179 23912 -1912 54251 57210 36327 -1084 -23542 555 26785 66034
10754 66034 35584 -2998 -28388 1247 -10933 -15756 39393 37691 66605 115846 130550 105714
10742 105714 103280 89998 122644 119163 129677 89058 91884 122905 105639 106102 142730 174926
10730 174926 164044 197531 245038 234945 251322 289918 304097 296123 305095 287712 281169 323582
$$ packed form
10816I7112l9279Q753o538l2119K873J3902k320J8365L3252m0908k9773k516k2339
10803a535J7783J7872O08j8617k5242J1587M4448N923M761K8394J7048j9979j9140
10790F3911k8698L1974P090l1902r271q85m0934J8604j3244j9210m3137K3535
10778d2167J6857k7548N5533L4581j930J30L4377j3239k6526j7726J4664k4854
10766B152J5925k898Q733k5824N6163K959k0883l7411k2458K4097K6230L9249
10754F6034l0450l8582k5390K9635j2180m823N5149j702K8914M9241J4704k4836
10742A05714k434j3282L2646l481J0514m0619K826L1021j7266M63L6628L2196
10730A74926j0882L3487M7507j0093J6377L8596J4179p974Q972j7383o543M2413
$$ plain form
10718 323582 302142 327384 376165 381570 404327 378509 358203 383955 378748 362035 367703 370728
10706 370728 396178 409048 412928 402471 419866 423956 432644 422107 405998 353547 348388 390393
10694 390393 386777 377309 400986 392279 357218 383691 391704 323270 296002 278623 285500 320840
10682 320840 368063 411754 418430 332299 250270 269784 324945 376590 385618 361806 325114 358019
10670 358019 378015 331660 351466 374057 407428 373447 325625 364059 357080 392679 429516 466233
10658 466233 527223 551453 593612 603253 612573 647863 692307 723325 787397 788118 735296 679035
10646 679035 669190 664165 695772 758363 784271 797191 817231 892301 942568 951102 1024001 1151029
10634 1151029 1255312 1389841 1571967 1729237 1861812 1997311 2152474 2341181 2556950
$$ packed form
10718C23582k1440K5242M8781N405K2757k5818k0306K5752n207j6713N668L025
10706C70728K5450J2870L880j0457J7395M090Q688j0537j6109n2451n159M2005
10694C90393l616r468K3677q707l5061K6473Q013o8434k7268j7379O877L5340
10682C20840M7223M3691O676q6131q2029J9514N5161N1645R028k3812l6692L2905
10670C58019J9996m6355J9806K2591L3371l3981m7822L8434o979L5599L6837L6717
10658D66233O0990K4230M2159R641R320L5290M4444L1018O4072P21n2822n6261
10646F79035r845n025L1607O2591K5908J2920K0040P5070N0267Q534P2899J27028
10634A151029J04283J34529J82126J57270J32575J35499J55163J88707K15769
$$ plain form
10625 2556950 2793948 3082048 3528599 4097795 4825358 5836772 7082428 8562002 10331425
10616 10331425 12204299 13976711 15649381 17053628 18027745 18466559 18610404 18839976 19566166
10607 19566166 21055453 23369159 26357096 29646712 32757186 35464359 37519800 38359605
10599 38359605 37635255 36100801 34885738 34731424 35858456 38330421 41755097 45440482
10591 45440482 48768775 51346267 52759340 52113311 49117437 45036423 41393290 38910122
10583 38910122 37856303 38048490 39066524 40311562 41326831 41940159 41711542 40016255
10575 40016255 36890221 33224862 29900957 27525890 26056342 25246692 24914938 24746169
10567 24746169 24525033 24071386 23145243 21654803 19696191 17592125 15674394 14060956
$$ packed form
10625B556950K36998K88100M46551N69196P27563J011414J245656J479574J769423
10616A0331425J872874J772412J672670J404247R74117M38814J43845K29572P26190
10607A9566166J489287K313706K987937L289616L110474K707173K055441Q39805
10599C8359605p24350j534454j215063j54314J127032K471965L424676L685385
10591D5440482L328293K577492J413073o46029k995874m081014l643133k483168
10583C8910122j053819J92187J018034J245038J015269O13328k28617j695287
10575D0016255l126034l665359l323905k375067j469548q09650l31754j68769
10567B4746169k21136m53647r26143j490440j958612k104066j917731j613438
$$ plain form
10559 14060956 12724678 11691413 10825758 10156678 9598798 9092624 8659572 8249284 7919304
10550 7919304 7589747 7299453 7070926 6869861 6635703 6415173 6209443 6014753 5847793
10541 5847793 5711310 5580309 5374529 5218144 5083742 4904617 4763666 4669574 4596202 4488229
10531 4488229 4353377 4246787 4135206 4073648 4017186 3888248 3779824 3667777 3596239 3538008
10521 3538008 3463922 3391824 3301344 3180522 3099057 3050014 3008283 2945319 2892709 2855041 2804642
10510 2804642 2761003 2691305 2577049 2548973 2519809 2497329 2452676 2426043 2361177 2335985 2297299
10499 2297299 2234036 2183304 2149196 2138999 2093270 2030182 2001222 1988050 1957341 1951401 1971968
10488 1971968 1958761 1911339 1801733 1765256 1732366 1711085 1704393 1691954 1717948 1753828 1774064
$$ packed form
10559A4060956j336278j033265q65655o69080n57880n06174m33052m10288l29980
10550G919304l29557k90294k28527k01065k34158k20530k05730j94690j66960
10541E847793j36483j31001k05780j56385j34402j79125j40951r4092p3372j07973
10531D488229j34852j06590j11581o1558n6462j28938j08424j12047p1538n8231
10521C538008p4086p2098r0480j20822q1465m9043m1731o2964n2610l7668n0399
10510B804642m3639o9698j14256k8076k9164k2480m4653k6633o4866k5192l8686
10499B297299o3263n0732l4108j0197m5729o3088k8960j3172l0709n940K0567
10488A971968j3207m7422j09606l6477l2890k1281o692j2439K5994L5880K0236
$$ plain form
10477 1774064 1692749 1639522 1618799 1587250 1540534 1533997 1541185 1507680 1478364 1427082 1402060 1420094
10465 1420094 1449386 1434244 1403015 1361414 1338964 1310651 1312557 1314868 1287054 1249713 1269425 1320817
10453 1320817 1358004 1331315 1268567 1216785 1215328 1173445 1180386 1172731 1155603 1116504 1082937 1081771
10441 1081771 1094291 1065596 1058061 1016615 995464 992266 900081 889282 901013 895961 871470 845743
10429 845743 823519 760430 754758 807932 828714 820827 798343 788250 699637 692030 733176 706213
10417 706213 691626 677718 656351 653848 644640 624598 629041 651400 693734 698686 633676 605614
10405 605614 550219 557033 586558 540309 519014 542396 537046 529551 489060 451223 447609 455844
10393 455844 493847 549301 497324 447068 481732 453459 383945 384689 382743 325665 345791 388487
$$ packed form
10477A774064q1315n3227k0723l1549m6716o537P188l3505k9316n1282k5022J8034
10465A420094K9292j5142l1229m1601k2450k8313J906K311k7814l7341J9712N1392
10453A320817L7187k6689o2748n1782j457m1883O941p655j7128l9099l3567j166
10441A081771J2520k8695p535m1446k1151l198r2185j0799J1731n052k4491k5727
10429H45743k2224o3089n672N3174K0782p887k2484j0093q8613p607M1146k6963
10417G06213j4587j3908k1367k503r208k0042M443K2359M2334M952o5010k8062
10405F05614n5395O814K9525m6249k1295K3382n350p495m0491l7837l614Q235
10393D55844L8003N5454n1977n0256L4664k8273o9514P44j946n7078K0126M2696
$$ plain form
10381 388487 411928 402302 400766 443850 437498 409854 426109 406320 364400 334057 343942 346001
10369 346001 377536 352731 327540 347449 352576 363576 329586 349529 342363 329777 314944 304983
10357 304983 329385 343323 348489 328997 313904 321749 309806 304337 252988 212640 234394 270796
10345 270796 249564 258067 234316 225319 216599 264715 293423 257477 239860 237215 307603 315651
10333 315651 276018 281676 245433 260407 248353 232260 254105 264335 216922 196640 193988 178243
10321 178243 136632 112277 140394 133999 143272 200366 208455 141877 136786 140076 148475 148286 146405
10308 146405 201154 233098 218299 208634 163394 140033 143629 212408 200341 172769 160136 154697
10296 154697 154060 125760 98955 81348 62357 63253 73899 91507 86261 95391 125296 128007 168789
$$ packed form
10381C88487K3441r626j536M3084o352k7644J6255j9789m1920l0343R885K059
10369C46001L1535k4805k5191J9909N127J1000l3990J9943p166j2586j4833r961
10357C04983K4402J3938N166j9492j5093P845j1943n469n1349m0348K1754L6402
10345B70796k1232Q503k3751q997q720M8116K8708l5946j7617k645P0388Q048
10333C15651l9633N658l6243J4974j2054j6093K1845J0230m7413k0282k652j5745
10321A78243m1611k4355K8117o395R273N7094Q089o6578n091L290Q399j89j881
10308A46405N4749L1944j4799r665m5240k3361L596O8779j2067k7572j2633n439
10296A54697o37k8300k6805j7607j8991Q96J0646J7608n246R130K9905K711M0782
$$ plain form
10283 168789 149984 102299 118584 70822 81777 122027 122120 127907 131136 132652 88037 41100 66213
10270 66213 110877 98423 94791 66604 65432 56580 50602 71070 90937 80731 61845 71098 68480
10257 68480 17066 20835 35460 42033 51536 58033 64674 60982 88133 73216 41435 60505 58251
10244 58251 51836 30214 19818 32239 9472 17777 40847 61256 53597 45933 53676 32373 75884
10231 75884 63543 27403 53706 33946 3860 28871 89472 68594 53260 58891 106347 106290
10219 106290 126321 99373 60339 37918 60392 82721 78996 75556 63871 82647 61584 89136
10207 89136 86546 67875 61192 61338 46705 41908 25922 1377 25953 36080 36909 41193 -10510
10194 -10510 -20900 14238 52117 72908 43737 -7919 -191 19963 42880 4497 -12771 47506
$$ packed form
10283A68789j8805m7685J6285m7762J0955M0250R3N787L229J516m4615m6937K5113
10270F6213M4664j2454l632k8187j172q852n978K0468J9867j0206j8886R253k618
10257F8480n1414L769J4625O573R503O497O641l692K7151j4917l1781J9070k254
10244E8251o415k1622j0396J2421k2767Q305K3070K0409p659p664P743k1303M3511
10231G5884j2341l6140K6303j9760l0086K5011O0601k0878j5334N631M7456n7
10219A06290K0031k6948l9034k2421K2474K2329l725l440j1685J8776k1063K7552
10207H9136k590j8671o683J46j4633m797j5986k4545K4576J0127Q29M284n1703
10194a0510j0390L5138L7879K0791k9171n1656P728K0154K2917l8383j7268O0277
$$ plain form
10182 47506 82004 105343 122179 145089 140725 162267 120404 118932 104920 137394 130752 168172
10170 168172 232763 225781 199527 240324 251328 234173 226310 227081 256790 279446 246996 265374
10158 265374 249081 238585 250348 246859 226289 282143 306168 294000 270404 253239 263862 217179
10146 217179 185327 200757 274451 287186 246494 249312 245279 237511 206731 224284 215592 186923
10134 186923 130994 140607 185138 242844 232642 267454 263278 231211 161078 142347 122886 121815
10122 121815 97873 103144 67965 51652 101825 125663 117871 102998 91787 78814 69305 66171
10110 66171 58964 59310 36995 104668 174188 171759 150215 115159 120440 79329 71407 46509 -547
10097 -547 53085 73838 77362 64776 58974 19645 42925 31213 43250 63817 54449 44668 49944
$$ packed form
10182D7506L4498K3339J6836K2910m364K1542m1863j472j4012L2474o642L7420
10170A68172O4591o982k6254M0797J1004j7155p863P71K9709K2656l2450J8378
10158B65374j6293j0496J1763l489k0570N5854K4025j2168k3596j7165J0623m6683
10146B17179l1852J5430P3694J2735m0692K818m033p768l0780J7553q692k8669
10134A86923n5929R613M4531N7706j0202L4812m176l2067p0133j8731j9461j071
10122A21815k3942N271l5179j6313N0173K3838p792j4873j1211j2973r509l134
10110F6171p207L46k2315O7673O9520k429k1544l5056N281m1111p922k4898m7056
10097e47N3632K0753L524j2586n802l9329K3280j1712J2037K0567r368r781N276
$$ plain form
10084 49944 41835 34187 37337 66600 38928 41861 69427 69633 34124 16927 5195 21265 36118
10071 36118 14689 26465 82096 85050 80755 -4780 -79717 -84348 -70818 -32284 -18856 -9140
10059 -9140 13339 35446 57143 33567 34305 85986 103062 38300 -966 -26853 -12929 19752
10047 19752 27547 39339 51905 30059 24477 22997 30763 41268 39314 47400 75284 84016 43347
10034 43347 13179 29508 2683 -30632 -4584 -17860 10490 35195 45959 63065 54949 81882
10022 81882 71239 32982 -2078 -18474 -2329 12518 -15693 3134 28049 32844 22187 24701
10010 24701 28214 31188 19791 -18678 -275 -8724 15627 55376 20579 6392 20527 16123
9998 16123 9972 36000 10952 3844 129 -25541 -42294 -52619 -71408 -44516 10752 42859
$$ packed form
10084D9944q109p648L150K9263k7672K933K7566K06l5509j7197j1732J6070J4853
10071C6118k1429J1776N5631K954m295q5535p4937m631J3530L8534J3428R716
10059i140K2479K2107K1697k3576P38N1681J7076o4762l9266k5887J3924L2681
10047A9752P795J1792J2566k1846n582j480P766J0505j954Q086K7884Q732m0669
10034D3347l0168J6329k6825l3315K6048j3276K8350K4705J0764J7106q116K6933
10022H1882j0643l8257l5060j6396J6145J4847k8211J8827K4915M795j0657K514
10010B4701L513K974j1397l8469J8403q449K4351L9749l4797j4187J4135m404
9998A6123o151K6028k5048p108l715k5670j6753j0325j8789K6892N5268L2107
$$ plain form
9986 42859 25179 69 1374 -18421 -31586 -22621 -35053 4414 51904 17066 -17349 -15789
9974 -15789 61278 88730 49493 15888 -21295 -18318 -44047 -51194 -75276 -48181 -50966 -37579
9962 -37579 -21413 49859 76091 42041 22540 68225 112366 79820 29029 21933 -8864 12550
9950 12550 31235 6412 -12541 -25049 -11518 22920 51805 30442 30234 25861 -927 -45005
9938 -45005 -39410 -43891 -8082 26242 40290 8345 13131 34013 103366 90101 86002 81949 75307
9925 75307 45047 27306 -11254 -20505 -801 3127 -19472 -11116 1794 22974 28577 -17416 -15035
9912 -15035 22170 14550 -7929 -2299 -1103 12994 -5529 -2918 16071 17590 28354 -15272 -16958
9899 -16958 544 -34818 -25323 3453 -16037 -11107 -7834 -37547 -41385 -17045 11604 -8736 -32148
$$ packed form
9986D2859j7680k5110J305j9795j3165Q965j2432L9467M7490l4838l4415J560
9974a5789P7067K7452l9237l3605l7183K977k5729p147k4082K7095k785J3387
9962c7579J6166P1272K6232l4050j9501M5685M4141l2546n0791p096l0797K1414
9950A2550J8685k4823j8953j2508J3531L4438K8885k1363k08m373k6788m4078
9938d5005N595m481L5809L4324J4048l1945M786K0882O9353j3265m099m053o642
9925G5307l0260j7741l8560r251J9704L928k2599Q356J2910K1180N603m5993K381
9912a5035L7205p620k2479N630J196J4097j8523K611J8989J519J0764m3626j686
9899a6958J7502l5362R495K8776j9490M930L273k9713l838K4340K8649k0340k3412
$$ plain form
9886 -32148 -255 -8559 -35272 -29859 -8223 23483 54214 38930 35176 45830 67686 51002
9874 51002 60749 61424 30670 -41964 -29525 114 -9773 -28302 -77831 -43226 -7353 12349 1221
9861 1221 -40977 -59802 -60160 -12363 46115 68285 50512 20268 32100 19537 42259 26324
9849 26324 9332 19747 33705 13964 -7239 -63346 -113557 -105758 -45275 -4618 22616 -11856
9837 -11856 -9976 4337 167 6781 29380 35229 -30691 -23482 26409 36186 48869 33441 -42532
9824 -42532 -51244 -42973 -17285 -24446 -40793 7266 11598 30011 35593 11795 -7210 24853 36384
9811 36384 10676 -21854 4756 10741 -2813 5295 -17831 -8281 -30674 -45267 -23608 12363
9799 12363 -9872 -41877 -18041 8118 2888 12499 -23210 -24914 -30676 -31996 -6880 12399 -1262
$$ packed form
9886c2148L1893q304k6713N413K1636L1706L0731j5284l754J0654K1856j6684
9874E1002R747O75l0754p2634J2439K9639r887j8529m9529L4605L5873J9702j1128
9861A221m2198j8825l58M7797N8478K2170j7773l0244J1832j2563K2722j5935
9849B6324j6992J0415J3958j9741k1203n6107n0211P799O0483M0657K7234l4472
9837a1856J880J4313m170O614K2599N849o5920P209M9891R777J2683j5428p5973
9824d2532q712Q271K5688p161j6347M8059M332J8413N582k3798j9005L2063J1531
9811C6384k5708l2530K6610N985j3554Q108k3126R550k2393j4593K1659L5971
9799A2363k2235l2005K3836K6159n230R611l5709j704n762j320K5116J9279j3661
$$ plain form
9786 -1262 -34326 -58391 -90588 -57947 -5584 7122 -14118 -16274 -7660 -25723 -45324 -69827
9774 -69827 -28004 -2593 54659 59455 23901 -3091 -4295 50276 55082 8445 -31985 -39311 -27007
9761 -27007 -8164 5260 -20292 -37514 -14242 14028 12696 -10839 -14871 12254 20242 9030
9749 9030 -29193 -31253 -30425 -24915 -17949 -6812 9498 26272 53885 61971 42310 44417 29430
9736 29430 -3104 -38289 44 32153 34990 18801 23321 14108 -17514 -31113 -37098 -5100 9532
9723 9532 12067 -4047 3334 -239 23775 21507 -148 -5342 -12809 -17774 9032 29003 27842 29732
9709 29732 16994 30153 50573 98130 62417 20475 -14337 49332 52121 66548 80045 99014
9697 99014 81052 64642 67496 45698 6275 -5011 -17881 -3102 14806 6142 -5389 16393
$$ packed form
9786a262l3064k4065l2197L2641N2363J2706k1240k156Q614j8063j9601k4503
9774f9827M1823K5411N7252M796l5554k6992j204N4571M806m6637m0430p326J2304
9761b7007J8843J3424k5552j7222K3272K8270j332k3535m032K7125P988j1212
9749I030l8223k060Q28N510O966J1137J6310J6774K7613Q086j9661K107j4987
9736B9430l2534l5185L8333L2109K837j6189M520r213l1622j3599n985L1998J4632
9723I532K535j6114P381l573K4014k268k1655n194p467m965K6806J9971j161J890
9709B9732j2738J3159K0420M7557l5713m1942l4812O3669K789J4427J3497J8969
9697I9014j7962j6410K854k1798l9423j1286j2870J4779J7908q664j1531K1782
$$ plain form
9685 16393 -9974 -58141 -41171 32316 70897 48546 28689 16923 -3056 -12110 -39004 -58158
9673 -58158 -12364 182 22468 -16602 5396 29107 21247 13583 26229 27225 35924 5865 -11997
9660 -11997 -17379 -39885 -34383 -22753 12700 31650 17771 304 -22324 -11737 -21483 8043
9648 8043 10752 -5100 -36509 -30784 13196 13860 -4800 -9543 -41930 -55438 -41612 5318 9878
9635 9878 14988 19829 23680 -14386 -13721 15703 35299 56610 86394 38392 11929 25305 -3031
9622 -3031 -21959 333 14329 9260 -40855 -59799 -28506 -7705 -427 -11954 -14095 2373 -8670
9609 -8670 4846 19982 53525 52594 62137 31480 38243 38513 -8320 -27571 -47993 -48926 -49594 -50246
9595 -50246 -40959 -16754 22370 -2317 -9780 12689 -27161 -13726 6060 -8019 -1037 4119 39073
$$ packed form
9685A6393k6367m8167J6970P3487L8581k2351j9857j1766j9979r054k6894j9154
9673e8158M5794J2546K2286l9070K1998K3711p860p664J2646R96Q699l0059j7862
9660a1997n382k2506N502J1630L5453J8950j3879j7467k2628J0587r746K9526
9648H043K709j5852l1409N725M3980O64j8660m743l2387j3508J3826M6930M560
9635I878N110M841L851l8066O65K9424J9596K1311K9784m8002k6463J3376k8336
9622c031j8928K2292J3996n069n0115j8944L1293K0801P278j1527k141J6468j1043
9609h670J3516J5136L3543r31R543l0657O763K70m6833j9251k0422r33o68o52
9595e0246R287K4205L9124k4687p463K2469l9850J3435J9786j4079O982N156L4954
$$ plain form
9582 39073 16631 -13347 -5752 -7734 8694 7295 18249 22399 -7406 -28235 -16640 -13427 -7446
9569 -7446 -887 -37132 -44497 -11842 11617 21631 31382 49200 38113 29727 32545 20808 3097
9556 3097 11095 15573 28944 16898 21637 465 20767 51385 40064 77894 40204 24664 41386
9543 41386 29900 15497 -11548 -10762 26918 101059 125233 68489 23051 40867 81871 71622
9531 71622 4947 -63599 -48119 -34761 -63752 -96270 -114945 -72289 -70432 -63222 -40863 -59976
9519 -59976 -50776 -19728 10176 -23155 -31367 -28262 -32451 -24074 -32954 -30203 10752 19770 13355 7166
9505 7166 -17302 -10837 21913 57008 57934 9633 -27807 -34963 3911 40572 30863 52489 48563
9492 48563 -21941 -10997 10923 5961 45631 45345 25564 49363 54436 37999 53189 81197 86284
$$ packed form
9582C9073k2442k9978P595j982J6428j399J0954M150k9805k0829J1595L213N981
9569g446O559l6245p365L2655K3459J0014R751J7818j1087q386K818j1737j7711
9556C097P998M478J3371j2046M739k1172K0302L0618j1321L7830l7690j5540J6722
9543D1386j1486j4403k7045P86L7680P4141K4174n6744m5438J7816M1004j0249
9531G1622o6675o8546J5480J3358k8991l2518j8675M2656J857P210K2359j9113
9519e9976R200L1048K9904l3331q212L105m189Q377q880K751M0955R018o415o189
9505G166k4468O465L2750L5095R26m8301l7440p156L8874L6661r709K1626l926
9492D8563p0504J0944K1920m962L9670k86j9781K3799N073j6437J5190K8008N087
$$ plain form
9479 86284 99044 94198 99009 97219 33817 44069 76280 54365 11005 -13469 -36069 -47303
9467 -47303 -36213 -47920 -49721 -34192 -27031 12619 36477 -1608 13046 7913 37557 34970 68697
9454 68697 117641 104404 68517 57129 41280 41513 39408 39752 47857 34571 19468 -10717 -6271
9441 -6271 28967 26837 -638 -14861 -54217 -48082 -24463 -35261 -25899 -20717 -30318 -12601 42401
9428 42401 63300 14663 -5057 -57867 -101182 -72722 3211 34475 7896 -10703 -7334 22262
9416 22262 35257 49717 6799 -12870 773 -7137 2681 648 7134 12963 25846 21720 -18415
9403 -18415 -11247 15657 11279 43116 48332 57273 84018 78574 97423 74255 49883 36916 16989
9390 16989 -5829 -42815 -39840 -10196 19222 13625 -14273 -8437 22456 -11556 -40349 -68934
$$ packed form
9479H6284J2760m846M811j790o3402J0252L2211k1915m3360k4474k2600j1234
9467d7303J1090j1707j801J5529P161L9650K3858l8085J4654n133K9644k587L3727
9454F8697M8944j3237l5887j1388j5849K33k105L44Q105j3286j5103l0185M446
9441f271L5238k130k7475j4223l9356O135K3619j0798R362N182r601J7717N5002
9428D2401K0899m8637j9720n2810m3315K8460P5933L1264k6579j8599L369K9596
9416B2262J2995J4460m2918j9669J3643p910R818k033O486N829J2883m126m0135
9403a8415P168K6904m378L1837N216Q941K6745n444J8849k3168k4372j2967j9927
9390A6989k2818l6986K975K9644K9418n597k7898N836L0893l4012k8793k8585
$$ plain form
9378 -68934 -62236 -71606 -56356 -30213 -6279 -7079 -46333 -28663 -20292 -30981 -45544 -13942 49333
9365 49333 25815 22247 48777 26276 -3402 5555 -22908 -30813 -15764 -17815 -29539 -7944 -4663
9352 -4663 12776 -2105 -31564 -98115 -88020 -8863 13909 469 4946 7503 -1960 -20482 -6888
9339 -6888 -579 9305 45674 51223 49064 30612 -12971 -19749 -19648 4508 4808 -43438 -2239 22627
9325 22627 14212 31238 53868 20448 14675 38319 32273 -13902 -6280 -11835 31117 49363 18611
9312 18611 -4180 -3091 -55361 -97677 -79964 -49554 -46179 -59171 -43980 -21292 -51801 -42331
9300 -42331 -32949 -34358 -19054 -32532 -30289 -35829 -53059 -7489 21547 -1317 -24076 -23905 17118
9287 17118 8078 11462 33912 41820 51692 19192 -28606 -43496 -63716 -41236 -7058 -6445 977
$$ packed form
9378f8934O698r370J5250K6143K3934q00l9254J7670Q371j0689j4563L1602O3275
9365D9333k3518l568K6530k2501k9678Q957k8463p905J5049k051j1724K1595L281
9352d663J7439j4881k9459o6551J0095P9157K2772j3440M477K557r463j8522J3594
9339f888O309R884L6369N549k159j8452m3583o778J01K4156L00m8246M1199K4866
9325B2627q415J7026K2630l3420n773K3644o046m6175P622n555M2952J8246l0752
9312A8611k2791J089n2270m2316J7713L0410L375j2992J5191K2688l0509R470
9300d2331R382j409J5304j3478K243n540j7230M5570K9036k2864k2759J71M1023
9287A7118r040L384K2450P908R872l2500m7798j4890k0220K2480L4178O13P422
$$ plain form
9274 977 49037 18159 -42800 -49560 -43505 20945 54442 40864 16431 -18270 -32934 -59982 -85104
9261 -85104 -44087 -10912 10263 -9671 7421 1066 4290 23729 21188 49045 33914 27127 48370
9248 48370 46804 33258 45539 56334 48208 41192 20107 739 5522 45165 72884 44658 5054
9235 5054 1188 9537 18438 -10274 14611 8918 -20404 -6362 -2971 13634 22234 -3933 17150
9222 17150 35872 39144 50735 33896 15136 -5633 -29009 -3781 -6445 -10374 -16539 -2119 579
9209 579 27065 58571 63015 74425 50105 43207 32040 -52842 -34959 1515 7269 11621 25777
9196 25777 15923 5119 35684 25856 29657 78767 82038 74501 57392 75773 51388 58423 72887
9183 72887 58062 7093 -1316 -37715 -15600 -34499 -73065 -108088 -80897 -56862 -74519 -62673
$$ packed form
9274I77M8060l0878o0959o760O055O4450L3497j3578k4433l4701j4664k7048k5122
9261h5104M1017L3175K1175j9934J7092o355L224J9439k541K7857j5131o787K1243
9248D8370j566j3546J2281J0795q126p016k1085j9368M783L9643K7719k8226l9604
9235E054l866Q349Q901k8712K4885n693k9322J4042L391J6605Q600k6167K1083
9222A7150J8722L272J1591j6839j8760k0769k3376K5228k664l929o165J4420K698
9209E79K6486L1506M444J1410k4320o898j1167q4882J7883L6474N754M352J4156
9196B5777r854j0804L0565r828L801M9110L271p537j7109J8381k4385P035J4464
9183G2887j4825n0969q409l6399K2115j8899l8566l5023K7191K4035j7657J1846
$$ plain form
9171 -62673 -55516 -59415 -96475 -98095 -95308 -44889 -10823 -39974 -45021 -63715 -41890 -18066 -26563
9158 -26563 31616 9637 -6462 12719 10080 19453 -14119 -40136 -30984 -5928 -22119 -51444
9146 -51444 -26322 -39812 -67836 -38040 -43385 -70778 -64433 -42215 -38471 19341 50710 56724 37072
9133 37072 -3426 -12249 3603 21610 44836 72410 80952 61540 53801 39408 21041 15595 23125
9120 23125 15320 3409 -48268 -74634 -19163 3404 -11139 12306 28153 11036 7771 -10780
9108 -10780 11225 43108 75438 38112 37428 27263 22169 57381 11286 -107 -15100 -37971
9096 -37971 -39485 -657 34119 45165 71161 78370 63869 48414 21209 13677 -26611 -22477 -27844
9083 -27844 10079 36826 18035 -6999 -10187 22561 452 -28760 5476 12130 13243 -848
$$ packed form
9171f2673P157l899l7060j620K787N0419L4066k9151n047j8694K1825K3824q497
9158b6563N8179k1979j6099J9181k639R373l3572k6017R152K5056j6191k9325
9146e1444K5122j3490k8024K9796n345k7393O345K2218L744N7812L1369O014j9652
9133C7072m0498q823J5852J8007K3226K7574Q542j9412p739j4393j8367n446P530
9120B3125p805j1911n1677k6366N5471K2567j4543K3445J5847j7117l265j8551
9108a0780K2005L1883L2330l7326o84j0165n094L5212m6095j1393j4993k2871
9096c7971j514L8828L4776J1046K5996P209j4501j5455k7205p532m0288M134n367
9083b7844L7923K6747j8791k5034l188L2748k2109k9212L4236O654J113j4091
$$ plain form
9071 -848 -94 25589 20315 44556 77655 70902 15082 -44602 -50031 -54939 -10488 23015 22268 9132
9057 9132 4502 33691 40397 22852 27723 30521 17077 8705 16311 16805 27165 7983 -5164 15877
9043 15877 28707 31340 35334 19037 7432 9457 18851 36708 50388 22306 -46088 -44601 -46847
9030 -46847 -32400 -30888 -50998 -47010 -40906 49 36648 17806 -21380 -23465 -25048 -43129 -37560
9017 -37560 -17044 -13077 -29983 -8956 7451 1955 9448 10262 -16423 -45037 -75025 -45196 -22895
9004 -22895 26563 7684 -13106 -24245 -42158 -4032 28480 50902 21518 -10171 -37482 -61955
8992 -61955 -45525 -32827 -4596 9418 8289 -33317 -92897 -89631 -25810 21984 18002 19136 40045
8979 40045 20082 23872 -16761 -53408 -16530 29386 35417 39037 12037 14217 43162 41435 46953
$$ packed form
9071h48P54K5683n274K4241L3099o753n5820n9684n429m908M4451L3503p47j3136
9057I132m630K9189O706j7545M871K798j3444q372P606M94J0360j9182j3147K1041
9043A5877J2830K633L994j6297j1605K025R394J7857J3680k8082o8394J487k246
9030d6847J4447J512k0110L988O104M0955L6599j8842l9186k085j583j8081N569
9017c7560K0516L967j6906K1027J6407n496P493Q14k6685k8614k9988K9829K2301
9004b2895M9458j8879k0790j1139j7913L8126L2512K2422k9384l1689k7311k4473
8992f1955J6430J2698K8231J4014j129m1606n9580L266O3821M7794l982J134K0909
8979D0045j9963L790m0633l6647L6878M5916O031L620k7000K180K8945j727N518
$$ plain form
8966 46953 29407 21109 -6410 14936 10601 36242 29961 -14373 -37778 -25289 -2808 -698 -14724
8953 -14724 -51222 -19842 16585 50658 25203 28262 -2124 -2841 4318 4748 -1943 -4957 -28943
8940 -28943 -2375 -19530 -11271 27335 19970 55464 58894 56683 59966 76967 49028 10569 10450
8927 10450 58595 75507 29204 24488 65009 43101 35784 16288 21945 1670 7010 14395 3813
8914 3813 28179 79198 85783 55516 32742 14094 -8832 7556 10357 6449 -3868 -14752 -4630
8901 -4630 46231 41154 21244 1516 -12174 25162 41868 12149 -17759 -70480 -59326 -20252
8889 -20252 13845 16142 22491 -9552 -58416 -61818 -38700 -35831 -25173 -50280 -92231 -104420 -94071
8876 -94071 -99458 -69987 -23393 -45300 -31975 -40844 -34223 26413 55164 67974 25649 -11284
$$ packed form
8966D6953j7546q298k7519K1346m335K5641o281m4334k3405J2489K2481K110j4026
8953a4724l6498L1380L6427L4073k5455L059l0386p17P159M30o691l014k3986
8940b8943K6568j7155Q259L8606p365L5494L430k211L283J7001k7939l8459j19
8927A0450M8145J6912m6303m716M0521k1908p317j9496N657k0275N340P385j0582
8914C813K4366N1019O585l0267k2774j8648k2926J6388K801l908j0317j0884J0122
8901d630N0861n077j9910j9728j3690L7336J6706k9719k9908n2721J1154L9074
8889b0252L4097K297O349l2043m8864l402K3118K869J0658k5107m1951j2189J0349
8876i4071n387K9471M6594k1907J3325q869O621O0636K8751J2810m2325l6933
$$ plain form
8864 -11284 -26995 -20040 -56305 -41620 -43366 -48957 -32351 -38948 -53601 -49860 6924 40630 35210
8851 35210 1985 2422 14672 37946 64204 66602 44166 31873 22495 29323 55575 26769 37035
8838 37035 22521 -4351 41462 49039 23891 -8827 -8087 -32466 -9269 33573 -4690 13389
8826 13389 -7829 -30231 -27651 -52642 -28322 17104 57662 43693 25978 3454 -46556 -32780
8814 -32780 -34941 -44055 -7230 -15522 1356 28855 20082 16134 5969 -36725 -23982 -26612 18855
8801 18855 -25438 -52903 -31858 -39668 -8707 -2954 -22369 -15806 -13216 15569 39757 49009 19795
8788 19795 33112 53225 70968 99141 42205 -7731 15836 28880 -11329 -13407 -28556 -63175
8776 -63175 -81687 -61290 -72015 -42624 -30101 -14134 -4458 -10189 33312 91796 75594 60644
$$ packed form
8864a1284j5711O955l6265J4685j746n591J6606o597j4653L741N6784L3706n420
8851C5210l3225M37J2250K3274K6258K398k2436j2293r378O828K6252k8806J0266
8838C7035j4514k6872M5813P577k5148l2718P40k4379K3197M2842l8263J8079
8826A3389k1218k2402K580k4991K4320M5426M0558j3969j7715k2524n0010J3776
8814c2780k161r114L6825q292J6878K7499q773l948j0165m2694J2743k630M5467
8801A8855m4293k7465K1045p810L0961N753j9415O563K590K8785K4188R252k9214
8788A9795J3317K0113J7743K8173n6936m9936K3567J3044m0209k078j5149l4619
8776f3175j8512K0397j0725K9391J2523J5967R676n731M3501N8484j6202j4950
$$ plain form
8764 60644 33782 19954 46768 59707 4639 -59824 -80854 -66438 -23047 14617 -6140 17622
8752 17622 2830 -24568 -42060 -5611 33643 55660 67228 60480 52173 23539 42758 60628
8740 60628 54514 53651 31706 21596 53079 73023 44669 12011 56 6608 -9081 -8563 9475
8727 9475 17636 22612 73838 68019 14353 -44779 -23472 -15628 -8355 -27129 -14222 10885 -4863
8714 -4863 -37947 -22343 -20283 -36059 -43452 -7143 41984 43075 -7892 -6447 28726 38734 26624
8701 26624 -23699 -48934 -54643 -42804 -20821 -14430 -10435 39734 64105 42828 10523 9841 41660
8688 41660 5543 466 2142 18465 630 -1932 -3361 -36105 -16140 -44934 -73777 -87386 -40214
8675 -40214 -13284 -56452 -75254 -29300 -2212 13823 14548 -2104 8261 -1512 1711 -64 60744
$$ packed form
8764F0644k6862j3828K6814J2939n5068o4463k1030J4416M3391L7664k0757K3762
8752A7622j4792k7398j7492L6449L9254K2017J1568o748q307k8634J9219J7870
8740F0628o114q63k1945j0110L1483J9944k8354l2658j1955O552j5689N18J8038
8727I475Q161M976N1226n819n3666n9132K1307P844P273j8774J2907K5107j5748
8714d863l3084J5604K060j5776p393L6309M9127J091n0967J445L5173J0008j2110
8701B6624n0323k5235n709J1839K1983O391L995N0169K4371k1277l2305o82L1819
8688D1660l6117n077J676J6323j7835k562j429l2744J9965k8794k8843j3609M7172
8675d0214K6930m3168j8802M5954K7088J6035P25j6652J0365r773L223j775O0808
$$ plain form
8662 60744 97434 100928 72595 68555 39960 74037 75321 75905 53712 68093 54599 7696 -2384
8649 -2384 6570 22190 13400 -6755 -24859 -63056 -79180 -63831 -66412 -30725 -32957 -40727 -39443
8636 -39443 -55780 -37355 50031 64443 30924 34546 8343 -6382 -6290 -807 9127 1986 -20917
8623 -20917 -17362 35788 25746 27105 38804 -6628 -65699 -70003 -29713 -11286 5454 19886
8611 19886 21239 20866 12760 10103 42439 29020 -14596 -40023 -36761 -26819 -29392 17366 33469
8598 33469 48607 30791 34477 49020 7004 -34740 -54029 -12811 27371 3345 -395 34066
8586 34066 36343 12571 17627 16938 18952 53354 57632 29572 21212 26207 23951 25176 15039 -7476
8572 -7476 -16768 1095 -35253 -74513 -51615 -66915 -59146 -58907 -61600 -49089 -41557 -49608 -5729
$$ packed form
8662F0744L6690L494k8333m040k8595L4077J284N84k2193J4381j3494m6903j0080
8649b384Q954J5620q790k0155j8104l8197j6124J5349k581L5687k232p770J284
8636c9443j6337J8425Q7386J4412l3519L622k6203j4725R2N483R934p141k2903
8623b0917L555N3150j0042J359J1699m5432n9071m304M0290J8427J6740J4432
8611A9886J353l73q106k657L2336j3419m3616k5427L262R942k573M6758J6103
8598C3469J5138j7816L686J4543m2016m1744j9289M1218M0182k4026l740L4461
8586C4066K277k3772N056o89K014L4402M278k8060q360M995k256J225j0137k2515
8572g476r292J7863l6348l9260K2898j5300P769K39k693J2511P532q051M3879
$$ plain form
8559 -5729 48216 69337 26656 -24133 -31986 -19106 -42042 -25231 -19112 -15559 -1436 -27514 -40935
8546 -40935 -19237 -16993 12588 7147 36588 25868 -2951 -13519 -21372 -8303 5993 -639 8554
8533 8554 -14106 -54931 -61548 -61059 -54439 -39634 -5382 18503 12903 69399 67743 42507 24398
8520 24398 46994 22016 -997 -7268 -11418 -8466 13974 18548 13818 27406 -5898 -45270 -63109
8507 -63109 -58126 -28550 -13169 -15890 14193 34470 19471 48939 37646 -2309 24084 44113
8495 44113 51122 50937 23398 26329 6919 -21276 22478 48909 34915 25807 28031 60520 23533
8482 23533 14438 -9460 -28019 -40537 -39032 -86062 -93981 -59616 -52840 -27420 -46157 -90116 -90255
8469 -90255 -37577 -3757 -21471 -40599 -21252 -4273 9683 17628 10064 -29506 -42054 -20267
$$ packed form
8559e729N3945K1121m2681n0789p853J2880k2936J6811O119L553J4123k6078j3421
8546d0935K1698K244K9581n441K9441j0720k8819j0568p853J3069J4296o632R193
8533H554k2660m0825o617M89O620J4805L4252K3885n600N6496j656k5236j8109
8520B4398K2596k4978k3013o271m150K952K2440M574m730J3588l3304l9372j7839
8507f3109M983K9576J5381k721L0083K0277j4999K9468j1293l9955K6393K0029
8495D4113P009j85k7539K931j9410k8195M3754K6431j3994r108K224L2489l6987
8482B3533r095k3898j8559j2518J505m7030p919L4365O776K5420j8737m3959j39
8469i0255N2678L3820j7714j9128J9347J6979J3956P945p564l9570j2548K1787
$$ plain form
8457 -20267 6330 57328 59598 87874 72181 34452 5081 -39861 -76396 -42943 -624 41367
8445 41367 46009 26499 -369 17055 44894 59046 48348 40317 66544 71700 75856 57220 36873
8432 36873 897 -10702 -14310 15870 -4356 11932 44931 39311 -3410 -15251 19989 56797
8420 56797 46214 36038 10595 24620 43347 49656 22532 -24134 -22624 -46398 -43832 -60976
8408 -60976 -89074 -131839 -94039 -62913 -27757 -25961 -10276 -4834 37665 69596 55330 22996
8396 22996 52736 52001 31227 -7840 -17230 -25019 -12510 -9338 25121 24713 19566 -17829 -28060
8383 -28060 -2135 69085 91231 99136 85457 72934 51923 70624 64751 75483 46009 -1512
8371 -1512 8561 20555 10248 11228 -30317 -39947 -42216 -31545 -3223 -20301 -26949 -33118 12892
$$ packed form
8457b0267K6597N0998K270K8276j5693l7729k9371m4942l6535L3453M2319M1991
8445D1367M642j9510k6868J7424K7839J4152j0698q031K6227N156M156j8636k0347
8432C6873l5976j1599l608L0180k0226J6288L2999n620m2721j1841L5240L6808
8420E6797j0583j0176k5443J4025J8727O309k7124m6666J510k3774K566j7144
8408f0976k8098m2765L7800L1126L5156J796J5685N442M2499L1931j4266l2334
8396B2996K9740p35k0774l9067r390p789J2509L172L4459m08n147l7395j0231
8383b8060K5925P1220K2146P905j3679j2523k1011J8701n873J0732k9474m7521
8371a512J0073J1994j0307R80m1545r630k269J0671K8322j7078o648o169M6010
$$ plain form
8358 12892 28799 12663 13261 13248 -11736 -48623 -80627 -70914 -48832 -21865 14765 34972 72552
8345 72552 127144 216815 272958 301613 330298 338376 285093 192701 156885 123765 70796 87535
8333 87535 58145 52210 76167 88207 72398 67830 99372 84772 97895 130520 127584 129711 128773
8320 128773 140481 154350 108932 70116 27517 2786 23577 32546 62299 39427 29242 61492
8308 61492 92702 108754 145296 181071 172730 181881 261893 357869 494365 598092 671534 769324
8296 769324 831511 854681 773870 737162 851407 1038641 1181783 1286594 1438876 1548566
8286 1548566 1401136 1049461 740858 565038 440782 335988 308496 324000 316365 221407
8276 221407 216820 228724 255000 268090 286428 283675 248830 228695 237865 230357 183311 158019
$$ packed form
8358A2892J5907j6136N98j3k4984l6887l2004R713K2082K6967L6630K0207L7580
8345G2552N4592Q9671N6143K8655K8685Q078n3283r2392l5816l3120n2969J6739
8333H7535k9390n935K3957J2040j5809m568L1542j4600J3123L2625k936K127r38
8320A28773J1708J3869m5418l8816m2599k4731K0791Q969K9753k2872j0185L2250
8308F1492L1210J6052L6542L5775q341R151Q0012R5976J36496J03727P3442R7790
8296G69324O2187K3170q0811l6708J14245J87234J43142J04811J52282J09690
8286A548566j47430l51675l08603j75820j24256j04794k7492J5504p635r4958
8276B21407m587J1904K6276J3090J8338k753l4845k0135R170p508m7046k5292
$$ plain form
8264 158019 170425 191769 190302 209570 258024 317752 398431 484871 549357 650427 764896
8253 764896 961968 1219475 1367647 1460359 1539784 1544762 1321705 997587 753337 580772
8243 580772 477898 407859 349070 343069 304630 289843 293964 278932 240875 209665 189614 196763
8231 196763 160337 166384 186037 201678 175965 169512 161555 150607 167166 182130 200187 140663
8219 140663 74104 52602 78268 58374 75511 133229 145590 113457 63195 32670 23970 66045
8207 66045 57876 66866 53135 55408 20653 13292 54150 92534 100876 82457 85248 71841 73775
8194 73775 87124 76023 75067 58057 53255 66728 77052 30279 22355 50100 64954 63021 8055
8181 8055 -3162 5005 44318 28306 9399 -11310 -26535 -24539 -50068 -50142 7112 40391 88700
$$ packed form
8264A58019J2406K1344j467J9268M8454N9728Q0679Q6440O4486J01070J14469
8253G64896J97072K57507J48172R2712P9425M978k23057l24118k44250j72565
8243E80772j02874p0039n8789o001l8439j4787M121j5032l8057l1210k0051P149
8231A96763l6426O047J9653J5641k5713o453p957j0948J6559J4964J8057n9524
8219A40663o6559k1502K5666j9894J7137N7718J2361l2133n0262l0525q700M2075
8207F6045q169Q990j3731K273l4755p361M0858L8384Q342j8419K791j3407J934
8194G3775J3349j1101r56j7010m802J3473J0324m6773p924K7745J4854j933n4966
8181H055j1217Q167L9313j6012j8907k0709j5225J996k5529p4N7254L3279M8309
$$ plain form
8168 88700 130577 123329 92606 93510 112162 93777 25697 36600 63801 67570 68450 17006 -15489
8155 -15489 -11159 19 23225 33867 37316 36302 21940 34169 36615 40889 25669 1031 -4008
8142 -4008 -27443 -18076 6135 4828 13793 25628 31618 49822 26765 14050 -2712 -36924 -58694
8129 -58694 -67659 -29045 20668 27961 77589 87034 44159 -18993 -52571 -6409 -1277 9035 27549
8116 27549 42741 50966 15592 -50968 -46944 4159 20744 5107 4568 31049 18660 -14285 -27502
8103 -27502 -56474 -125853 -124506 -73316 -20692 16218 -311 8939 27840 11779 -19784 -21374
8091 -21374 -12509 -34907 -5968 31361 4207 -4941 -24660 -25843 32052 38286 -5484 23472 14880
8078 14880 17997 29069 33544 19122 17969 30006 26856 36855 38948 8496 -281 -28405 -34435
$$ packed form
8168H8700M1877p248l0723R04J8652j8385o8080J0903K7201L769Q80n1444l2495
8155a5489M330J1178K3206J0642L449j014j4362J2229K446M274j5220k4638n039
8142d008k3435R367K4211j307Q965J1835N990J8204k3057j2715j6762l4212k1770
8129e8694q965L8614M9713P293M9628R445m2875o3152l3578M6162N132J0312J8514
8116B7549J5192Q225l5374o6560M024N1103J6585j5637n39K6481j2389l2945j3217
8103b7502k8972o9379J347N1190N2624L6910j6529R250J8901j6061l1563j590
8091b1374Q865k2398K8939L7329k7154r148j9719j183N7895O234m3770K8956q592
8078A4880L117J1072M475j4422j153J2037l150R999K093l0452q777k8124o030
$$ plain form
8065 -34435 -20275 -3282 -471 12396 58748 76280 7807 -28386 18614 10287 10005 49501 46328
8052 46328 40942 -6238 561 43759 36124 9558 -7150 -4774 -43182 -56396 -55011 13365 49525
8039 49525 29254 28488 61180 49033 88641 92924 54223 22513 31179 66117 21839 -21448 3135
8026 3135 -1688 -8318 -2310 15119 7041 -8024 20886 14934 24110 14245 25353 69742 106088
8013 106088 114926 67853 25731 51764 46766 9157 59513 87443 84760 112533 97841 49011
8001 49011 36803 27844 33434 62067 54951 35038 19788 5418 -11972 620 19647 -20717
7989 -20717 -15473 7736 -9503 -16070 12037 10316 3995 16384 28958 9126 -7070 -11790 -1819
7976 -1819 -3900 26834 61864 102784 117688 58760 36306 -43 -13630 -8386 -30261 -48103
$$ packed form
8065c4435J4160J6993K811J2867M6352J7532o8473l6193M7000q327k82L9496l173
8052D6328n386m7180O799M3198p635k6566j6708K376l8408j3214J385O8376L6160
8039D9525k0271p66L2692j2147L9608M283l8701l1710Q666L4938m4278m3287K4583
8026C135m823o630O008J7429q078j5065K8910n952R176r865J1108M4389L6346
8013A06088Q838m7073m2122K6033m998l7609N0356K7930k683K7773j4692m8830
8001D9011j2208q959N590K8633p116j9913j5250j4370j7390J2592J9027m0364
7989b0717N244K3209j7239o567K8107j721o321J2389J2574j9832j6196m720R971
7976a819k081L0734L5030M0920J4904n8928k2454l6349j3587N244k1875j7842
$$ plain form
7964 -48103 -41186 -20659 21939 19557 8839 -16311 -10065 14545 -20674 -49982 -32185 -21303
7952 -21303 13037 50437 60484 70418 58323 20360 6258 2848 -9009 29963 25960 4453
7940 4453 10161 16233 47726 73157 68041 23821 15469 5069 32008 41476 10507 -6598 14680
7927 14680 -12601 -28884 -39300 -19403 46411 54261 30360 46001 76966 53311 56267 26732
7915 26732 -2273 -34018 -30804 -44096 -53983 -36121 -52046 -56873 -91802 -50951 -17723 -5287
7903 -5287 30416 32027 36619 25830 12187 -467 9219 25445 43445 36816 -5887 -3925 3166
7890 3166 -22864 -67882 -84500 -57334 -23299 -18142 17818 22536 -19902 -36171 -38507 -24705 -21425
7877 -21425 -26664 -22438 -1184 30954 21712 -20866 -10499 13492 19539 -15176 -50800 -38699 19452
$$ packed form
7964d8103O917K0527M2598k382j0718k5150O246K4610l5219k9308J7797J0882
7952b1303L4340L7400J0047R934j2095l7963j4102l410j1857L8972m003k1507
7940D453N708O072L1493K5431n116m4220q352j0400K6939R468l0969j7105K1278
7927A4680k7281j6283j0416J9897O5814P850k3901J5641L0965k3655K956k9535
7915B6732k9005l1745L214j3292r887J7862j5925m827l4929M0851L3228J2436
7903e287L5703J611M592j0789j3643j2654R686J6226J8000o629m2703J962P091
7890C166k6030m5018j6618K7166L4035N157L5960M718m2438j6269k336J3802L280
7877b1425n239M226K1254L2138r242m2578J0367K3991O047l4715l5624J2101N8151
$$ plain form
7864 19452 29158 66849 77290 67101 40812 61846 111539 100122 71436 57781 46540 25160
7852 25160 40969 78125 41862 22280 -2145 -16168 -11153 891 -39360 -40960 -7443 -1215
7840 -1215 16892 68075 62240 74568 57183 57090 47840 31218 -3755 -6686 19039 43162 80126
7827 80126 92446 22909 -6755 -20190 -75338 -76783 -62338 -45260 -20696 -4516 -17559 -36483
7815 -36483 -35887 -26749 19863 388 11291 30867 22426 34946 52436 44726 50263 45142 30250
7802 30250 41602 68373 50594 26077 -27220 -51392 17539 47903 68715 91662 67820 -9717
7790 -9717 -88219 -116909 -93931 -64325 -77101 -55046 -45654 10208 49873 65823 93837 55159
7778 55159 -39071 -19652 -7590 -59657 -70423 -33316 -39092 -4251 20847 7349 12752 22446
$$ packed form
7864A9452R706L7691J0441j0189k6289K1034M9693j1417k8686j3655j1241k1380
7852B5160J5809L7156l6263j9582k4425j4023N015J2044m0251j600L3517O228
7840a215J8107N1183n835J2328j7385r3r250j6622l4973k931K5725K4123L6964
7827H0126J2320o9537k9664j3435n5148j445J4445J7078K4564J6180j3043j8924
7815c6483N96R138M6612j9475J0903J9576q441J2520J7490p710N537n121j4892
7802C0250J1352K6771j7779k4517n3297k4172O8931L0364K0812K2947k3842p7537
7790i717p8502k8690K2978K9606j2776K2055R392N5862L9665J5950K8014l8678
7778E5159r4230J9419J2062n2067j0766L7107n776L4841K5098j3498N403R694
$$ plain form
7766 22446 -2335 9870 52786 27285 -23497 -10650 33480 32574 32507 1898 -11882 -6214 30916
7753 30916 23713 703 -27277 -46902 -51996 -69392 -85677 -46085 31020 29775 -5963 -65443
7741 -65443 -99110 -81026 -42761 -12054 -28515 -36830 10729 42436 35438 -13929 -37620 -92978
7729 -92978 -102174 -65619 -38942 4083 26772 10738 8870 -8845 -32892 -35809 -4283 -28454
7717 -28454 -48644 -75231 -38285 -18260 -9811 -12092 -15174 -27423 -50372 -38387 25879 59773
7705 59773 65689 83717 86855 110399 103045 72390 11366 2258 -30884 -80305 -46326 -23028 -5572
7692 -5572 833 -18880 -29496 -58270 -92692 -56316 -74651 -70462 -42467 26802 67936 52247
7680 52247 41090 57091 53626 5907 -8226 -13373 -40003 -69022 -59329 -79072 -63709 -24633
$$ packed form
7766B2446k4781J2205M2916k5501n0782J2847M4130r06o7l0609j3780N668L7130
7753C0916p203k3010k7980j9625n094j7396j6285L9592P7105j245l5738n9480
7741f5443l3667J8084L8265L0707j6461q315M7559L1707o998m9367k3691n5358
7729i2978r196L6555K6677M3025K2689j6034j868j7715k4047k917L1526k4171
7717b8454k0190k6587L6946K0025Q449k281l082j2249k2949J1985O4266L3894
7705E9773N916J8028L138K3544p354l0655o1024r108l3142m9421L3979K3298J7456
7692e572O405j9713j0616k8774l4422L6376j8335M189K7995O9269M1134j5689
7680E2247j1157J6001l465m7719j4133n147k6630k9019R693j9743J5363L9076
$$ plain form
7668 -24633 -2856 5204 20960 21461 13909 5991 -16052 -33933 -44732 -13010 20407 6659 -16982
7655 -16982 8259 -20966 -24774 -25730 -3049 -7945 -15277 13838 29729 -10290 13728 17249 -8376
7642 -8376 -50170 -24339 14585 -13037 -3630 39092 82254 90245 66076 55601 81247 46422
7630 46422 38272 41024 34012 1245 40329 67707 87431 65903 20285 -34216 -55281 -107874
7618 -107874 -83064 -48093 -54510 -34114 3721 854 -27578 -20236 4892 -4197 -5787 28341 27311
7605 27311 15885 1083 2572 39524 25432 27313 24775 -6562 12484 528 -6126 2594 10726
7592 10726 33496 12623 -17756 -18762 -11548 -17584 -55451 -64615 -44522 -35115 -39093 -17656 -23554
7579 -23554 -47815 -65982 -39609 -12645 23491 28595 -8150 16389 10226 5188 13780 12815 -17346
$$ packed form
7668b4633K1777Q060J5756N01p552p918k2043j7881j0799L1722L3417j3748k3641
7655a6982K5241k9225l808r56K2681m896p332K9115J5891m0019K4018L521k5625
7642h376m1794K5831L8924k7622R407M2722M3162P991k4169j0475K5646l4825
7630D6422q150K752p012l2767L9084K7378J9724k1528m5618n4501k1065n2593
7618a07874K4810L4971o417K0396L7835k867k8432P342K5128r089j590L4128j030
7605B7311j1426j4802J489L6952j4092J881k538l1337J9046j1956o654Q720Q132
7592A0726K2770k0873l0379j006P214o036l7867r164K0093R407l978K1437n898
7579b3554k4261j8167K6373K6964L6136N104l6745K4539o163n038Q592r65l0161
$$ plain form
7566 -17346 -4847 24065 22680 17963 -8581 -7181 -23154 -60284 -59945 -50464 -39191 -30119 -79118
7553 -79118 -99894 -121912 -106809 -44136 25674 45775 22637 51379 56001 22806 19509 61587
7541 61587 57707 33085 60513 77394 94866 50630 27679 31433 14541 19059 29615 11483
7529 11483 -19402 -39794 -37762 10234 76828 117898 109582 52592 23819 -6117 -42743 -40458
7517 -40458 9019 50627 57244 11778 -80541 -94181 -86614 -72510 -80897 -74862 -57288 -18563 -5165
7504 -5165 19060 35607 23949 6526 6612 -9720 24364 27131 -19904 -5511 1990 -19678 -77219
7491 -77219 -33751 25748 29396 3583 1388 13498 817 -26171 -17959 -1541 26664 34820 10261
7478 10261 39043 49496 52652 51044 821 -5913 7240 6825 30475 26132 -51835 -50645 -42257
$$ packed form
7566a7346J2499K8912j385m717k6544J400j5973l7130L39R481J1273R072m8999
7553g9118k0776k2018J5103O2673O9810K0101k3138K8742M622l3195l297M2078
7541F1587l880k4622K7428J6881J7472m4236k2951L754j6892M518J0556j8132
7529A1483l0885k0392K032M7996O6594M1070q316n6990k8773k9936l6626K285
7517d0458M9477M1608O617m5466r2319j3640P567J4104q387O035J7574L8725J3398
7504e165K4225J6547j1658j7423Q6j6332L4084K767m7035J4393P501k1668n7541
7491g7219M3468N9499L648k5813k195J2110j2681k6988Q212J6418K8205Q156k4559
7478A0261K8782J0453L156j608n0223o734J3153m15K3650m343p7967J190Q388
$$ plain form
7465 -42257 -67503 -70881 -60067 -49418 -82980 -63659 -52733 -55051 -49656 -63329 -91430 -32187
7453 -32187 35017 35603 22846 16590 -25741 15102 21682 -11910 -33521 -54368 -27021 -19233 -18478
7440 -18478 -33229 -38716 -24749 -36972 -17979 -11625 18529 32515 28253 32517 31157 12580 -51806
7427 -51806 -89139 -93471 -108256 -92854 -41652 -36311 -27301 -7922 8344 5786 -13543 9499 -2275
7414 -2275 -49934 -91674 -90000 -76885 -70504 -90029 -60863 -84060 -69781 -84883 -66516 -22651
7402 -22651 -22675 2250 8576 15647 -23018 -23386 -14035 -46617 -68696 -96943 -114000 -88030 -93674 -116290
7388 -116290 -70226 -51070 -26115 9476 38363 30743 -10614 -8071 5989 -22654 -46048 -49770
7376 -49770 -57538 -56597 -23720 -29330 -46123 -29387 -12580 -14009 -12350 12644 51704 26921 -8395
$$ packed form
7465d2257k5246l378J0814J0649l3562J9321J0926k318N395j3673k8101N9243
7453c2187O7204N86j2757o256m2331M0843O580l3592k1611k0847K7347P788P55
7440a8478j4751n487J3967j2223J8993O354L0154J3986m262M264j360j8577o4386
7427e1806l7333m332j4785J5402N1202N341R010J9379J6266k558j9329K3042j1774
7414b275m7659m1740J674J3115O381j9525K9166k3197J4279j5102J8367M3865
7402b2651k4K4925O326P071l8665l68R351l2582k2079k8247j7057K5970n644k2616
7388a16290M6064J9156K4955L5591K8887p620m1357K543J4060k8643k3394l722
7376d9770p768R41L2877n610j6793J6736J6807j429J659K4994L9060k4783l5316
$$ plain form
7363 -8395 -5755 -34019 -15619 16310 -13114 -17876 -25203 -58367 -96749 -113130 -90925 -66024 -50438
7350 -50438 -61181 -24706 -8747 -58326 -57608 -7953 21069 5533 -2687 -31073 -46692 -8731
7338 -8731 -5232 11115 8611 -24595 -59189 -18506 9460 35664 7091 -2373 -6386 -3812 -14851
7325 -14851 -2641 24705 48297 48042 6464 -6490 -28991 -31314 -36164 -26008 -28880 -13969 -27693
7312 -27693 -21148 7637 1787 -6550 6865 34721 32337 12255 12567 36464 8909 -20043 -79365
7299 -79365 -60449 -11422 2843 27337 51701 106164 125235 72022 28603 -10133 3080 5422
7287 5422 -9464 -19252 41362 33338 28462 59108 7239 1501 -15861 404 -6567 -59602 -53821
7274 -53821 2880 25300 14854 -7164 20163 5747 -9934 -22090 -5758 20590 11576 -4793
$$ packed form
7363h395K640k8264J8400L1929k9424m762p327l3164l8382j6381K2205K4901J5586
7350e0438j0743L6475J5959m9579P18M9655K9022j5536q220k8386j5619L7961
7338h731L499J6347k504l3206l4594M0683K7966K6204k8573r464m013K574j1039
7325a4851J2210K7346K3592k55m1578j2954k2501k323m850J0156k872J4911j3724
7312b7693O545K8785n850q337J3415K7856k384k0082L12K3897k7555k8952n9322
7299g9365J8916M9027J4265K4494K4364N4463J9071n3213m3419l8736J3213K342
7287E422j4886r788O0614q024m876L0646n1869n738j7362J6265o971n3035N781
7274e3821N6701K2420j0446k2018K7327j4416j5681j2156J6332K6348r014j6369
$$ plain form
7262 -4793 -28379 -37594 -28463 -37655 19330 75291 31507 -22356 11377 21743 15574 46572 52210
7249 52210 34376 20753 20938 22335 45026 40059 46793 -149 -13526 -48742 -60927 -65589 -73939
7236 -73939 -63144 -32573 -34912 -74014 -55593 -25472 -53538 -74524 -75922 -57056 -61104 -88570
7224 -88570 -106434 -101688 -76366 -14972 1010 14651 -19921 -46180 -78691 -52186 -21047 -26107
7212 -26107 -24293 -9625 -13699 -11615 -49691 -39231 -20061 -2361 -10349 -79715 -128708 -132580 -99729
7199 -99729 -32926 1222 -63532 -80071 -53522 -62723 -27443 6083 -12413 -11109 17381 18198 -6844
7186 -6844 -80 -3531 -18174 -20815 15514 32686 67937 102273 74765 41005 29593 35085 50389
7173 50389 8726 -8799 29297 56597 59245 17344 -23946 -24604 -18138 -20315 5071 21644 41920
$$ packed form
7262d793k3586r215R131r192N6985N5961m3784n3863L3733J0366o169L0998N638
7249E2210j7834j3623J85J397K2691m967O734m6942j3377l5216j2185m662q350
7236g3939J0795L0571k339l9102J8421L0121k8066k0986j398J8866m048k7466
7224h8570j7864M746K5322O1394J5982J3641l4572k6259l2511K6505L1139n060
7212b6107J814J4668m074K084l8076J0460J9170J7700p988o9366m8993l872L2851
7199i9729O6803L4148o4754j6539K6549r201L5280L3526j8496J304K8490Q17k5042
7186f844O764l451j4643k641L6329J7172L5251L4336k7508l3760j1412N492J5304
7173E0389m1663j7525L8096K7300K648m1901m1290o58O466k177K5386J6573K0276
$$ plain form
7160 41920 21436 -318 29946 32014 -4058 -32190 -41834 -82151 -79126 -30843 -37743 -29991 -3342
7147 -3342 -13926 2730 40756 52242 3644 -40916 5822 13851 20461 9581 -33430 -52422
7135 -52422 -82404 -34557 -420 -30781 -40085 -14764 918 12351 -7809 -45246 -70679 -68307
7123 -68307 -31843 -12620 -26595 -31601 -9628 -11969 -39114 -62339 -88770 -78639 -56089 -39956
7111 -39956 10422 10510 -1619 -2710 8299 75157 74535 10635 -11878 -17321 -29428 -70189 -92633
7098 -92633 -11354 -1752 -47487 -26752 -26934 -30701 -36552 1003 60427 62343 49353 54562 38206
7085 38206 27711 9599 -39672 -53695 -63769 -66273 -42098 -8376 -20796 7503 -2473 -3675
7073 -3675 -2372 -9196 -24359 -34310 -31335 -27396 22395 46911 21762 -1998 30969 67969 76125
$$ packed form
7160D1920k0484k1754L0264K068l6072k8132r644m0317L025M8283o900P752K6649
7147c342j0584J6656L8026J1486m8598m4560M6738Q029O610j0880m3011j8992
7135e2422k9982M7847L4137l0361r304K5321J5682J1433k0160l7437k5433K372
7123f8307L6464J9223j3975n006K1973k341k7145k3225k6431J0131K2550J6133
7111c9956N0378Q8j2129j091J1009O6858o22o3900k2513n443j2107m0761k2444
7098i2633Q1279R602m5735K0735j82l767n851L7555N9424J916j2990N209j6356
7085C8206j0495j8112m9271j4023j0074k504K4175L3722j2420K8299r976j202
7073c675J303o824j5163r951K975L939M9791K4516k5149k3760L2967L7000Q156
$$ plain form
7060 76125 47716 30223 -15595 -72634 -44447 -876 -53065 -78598 -11588 9577 -23280 -64071
7048 -64071 -83085 -70958 -47021 -8317 22498 47980 -2274 -26727 -32004 -72912 -74270 -68649
7036 -68649 -58459 -27539 -40080 -19705 17653 17928 18747 -26666 -36570 15522 87814 60577 20688
7023 20688 5895 7890 -27615 -57747 -63890 -46259 -53715 -31722 -70666 -117409 -114657 -80410 -75349
7010 -75349 -89898 -65097 -65590 -54633 -14512 23991 32697 40095 49956 63756 34646 -15664 -36465
6997 -36465 -31998 -18292 -16888 -52470 -10948 -31473 -24819 39645 56313 29295 27905 51124 79764
6984 79764 85251 54200 36162 -7984 -58190 -71881 -38055 -16428 12734 59744 97582 53451
6972 53451 39886 -9565 -6380 27163 7119 -7191 36983 15335 -28390 -52209 -61393 -32524
$$ packed form
7060G6125k8409j7493m5818n7039K8187M3571n2189k5533O7010K1165l2857m0791
7048f4071j9014J2127K3937L8704L0815K5482n0254k4453n277m0908j358N621
7036f8649J0190L0920j2541K0375L7358K75Q19m5413r904N2092P2292k7237l9889
7023B0688j4793J995l5505l0132o143J7631p456K1993l8944m6743K752L4247N061
7010g5349j4549K4801m93J0957M0121L8503Q706P398R861J3800k9110n0310k0801
6997c6465M467J3706J404l5582M1522k0525O654O4464J6668k7018j390K3219K8640
6984G9764N487l1051j8038m4146n0206j3691L3826K1627K9162M7010L7838m4131
6972E3451j3565m9451L185L3543k0044j4310M4174k1648m3725k3819r184K8869
$$ plain form
6960 -32524 -38111 -16022 -842 20259 -20511 -98323 -38385 16827 47868 28995 -1667 26977
6948 26977 31131 2842 297 16199 32469 21802 13467 -6123 -45111 -34250 -22922 -39123
6936 -39123 -58360 -15775 -25117 -35215 -13913 -365 3153 -40241 -48717 -19086 4754 -35132
6924 -35132 -28426 -25887 -51233 -28651 -2211 -29732 -45494 -33321 -61552 -55667 -19379 53141
6912 53141 39125 -9782 40321 82583 47160 18689 -5514 10547 8565 -21461 -70821 -78325
6900 -78325 -71068 -63546 -49333 -43034 11876 57186 41296 -13063 -45332 -22794 -7366 -29075
6888 -29075 -12897 -1546 -31705 -10743 266 2298 45960 33629 46607 54225 123 1565
6876 1565 8726 -26254 -42393 14111 64077 55682 30588 -17566 -32845 -48742 -22347 -11446
$$ packed form
6960c2524n587K2089J5180K1101m0770p7812N9938N5212L1041j8873l0662K8644
6948B6977M154k8289k545J5902J6270j0667q335j9590l8988J0861J1328j6201
6936c9123j9237M2585r342j0098K1302J3548L518m3394q476K9631K3840l9886
6924c5132O706K539k5346K2582K6440k7521j5762J2173k8231N885L6288P2520
6912E3141j4016m8907N0103M2262l5423k8471k4203J6061j982l0026m9360p504
6900g8325P257P522J4213O299N4910M5310j5890n4359l2269K2538J5428k1709
6888b9075J6178J1351l0159K0962J1009K032M3662j2331J2978P618n4102J442
6876A565P161l4980j6139N6504M9966q395k5094m8154j5279j5897K6395J0901
$$ plain form
6864 -11446 15753 34177 24406 -4559 -30670 10190 39015 17023 -7004 -1711 22766 46320
6852 46320 2573 -14679 17122 28010 -10497 -24071 -27360 -85430 -108804 -82694 -41012 -27583
6840 -27583 -21194 -10643 4282 -5342 -2445 3084 -1249 4719 30887 9268 -51953 -80287 -6916
6827 -6916 41953 28712 22248 -12856 -10958 11383 -14455 6478 14990 25740 -3499 -6987 -8883
6814 -8883 -243 -22303 -4370 -29999 -38852 -4294 41046 37469 16761 31231 16231 -7828 -19319
6801 -19319 -17964 -30318 22853 64947 44575 213 24133 52367 59032 16687 36567 41429
6789 41429 27872 21329 18036 23350 12289 3041 -12010 50896 62734 25777 2839 -41927 -72749
6776 -72749 -37340 17752 37064 -5325 -1121 -3978 -22157 2887 9735 42192 56491 11523
$$ packed form
6864a1446K7199J8424r771k8965k6111M0860K8825k1992k4027N293K4477K3554
6852D6320m3747j7252L1801J0888l8507j3574l289n8070k3374K6110M1682J3429
6840b7583O389J0551J4925r624K897N529m333N968K6168k1619o1221k8334P3371
6827f916M8869j3241o464l5104J898K2341k5838K0933Q512J0750k9239l488j896
6814h883Q640k2060J7933k5629q853L4558M5340l577k0708J4470j5000k4059j1491
6801a9319J355j2354N3171M2094k0372m4362K3920K8234O665m2345J9880M862
6789D1429j3557o543l293N314j1061r248j5051O2906J1838l6957k2938m4766l0822
6776g2749L5409N5092J9312m2389M204k857j8179K5044O848L2457J4299m4968
$$ plain form
6764 11523 -1283 10394 53064 56557 80445 32692 26252 11943 28065 -415 -12782 -39897
6752 -39897 -54022 -59254 -68237 -62210 -42603 -65913 -62108 -29364 -23083 -41110 -36332 -7949 11667
6739 11667 4093 -36973 -40119 -20589 -686 15974 6692 3067 -459 20584 23155 1394 -11205
6726 -11205 -6450 -32914 -15323 -16357 -15005 -5250 5084 2384 -14486 3655 -16926 7135 1390
6713 1390 12630 29541 29309 7773 -11970 -22028 -19139 45174 97281 53973 -8806 -39654 -7994
6700 -7994 3425 -21342 -18439 16695 -10684 -20760 -34235 -50112 -41447 -68139 -47821 -21596
6688 -21596 -12017 -18021 30629 23566 19731 18504 12317 19510 32473 33479 12935 -12877 -17768 -16845
6674 -16845 -27397 -38778 -40585 -31284 -87366 -90806 -49303 -16685 17964 29807 31287 35188 8743
$$ packed form
6764A1523j2806J1677M2670L493K3888m7753o440j4309J6122k8480j2367k7115
6752c9897j4125n232q983O027J9607k3310L805L2744O281j8027M778K8383J9616
6739A1667p574m1066l146J9530J9903J6660r282l625l526K1043K571k1761j2599
6726a1205M755k6464J7591j034J352R755J0334k700j6870J8141k0581K4061n745
6713A390J1240J6911k32k1536j9743j0058K889O4313N2107m3308o2779l0848L1660
6700g994J1419k4767K903L5134k7379j0076j3475j5877Q665k6692K0318K6225
6688b1596R579o004M8650p063l835j227o187P193J2963J006k0544k5812m891R23
6674a6845j0552j1381j807R301n6082l440M1503L2618L4649J1843J480L901k6445
$$ [...]
##END NTUPLES=NMR SPECTRUM
##END=
