##TITLE=Analysis number 315617
Compound Code mo 07103
Project Code adrs
Chemist Name vekton
##JCAMPDX= 6.0         $$ Bruker NMR JCAMP-DX V2.0
##DATA TYPE= NMR SPECTRUM
##DATA CLASS= NTUPLES
##ORIGIN= Bruker BioSpin GmbH
##OWNER= NMR
$$ XWIN-NMR		Version 3.5
$$ Thu Nov 24 15:46:24 2005 GMT Standard Time (UT+0h)  MAYBRIDGE\NMR@NMR_250MHZ
##.OBSERVE FREQUENCY= 250.131544655141
##.OBSERVE NUCLEUS= ^1H
##.ACQUISITION MODE= SIMULTANEOUS (DQD)
##.ACQUISITION SCHEME= undefined
##.AVERAGES= 16
##.DIGITISER RES= 18
##SPECTROMETER/DATA SYSTEM= dpx250
##.PULSE SEQUENCE= zg30
##.SOLVENT NAME= DMSO
##.SHIFT REFERENCE= (INTERNAL, DMSO, 0, 16.522)
##AUDIT TRAIL= $$ (NUMBER, WHEN, WHO, WHERE, WHAT)
$$ ##TITLE= Audit trail, XWIN-NMR		Version 3.5
$$ ##JCAMPDX= 5.01
$$ ##ORIGIN= Bruker BioSpin GmbH
$$ ##OWNER= NMR
$$ C:\u/data/dgb/nmr/ADRS/12990/pdata/1/auditp.txt
$$ ##AUDIT TRAIL=  $$ (NUMBER, WHEN, WHO, WHERE, WHAT)
(   1,<2005-11-24 15:45:22.49 +000>,<MAYBRIDGE\NMR>,<NMR_250MHZ>,
      <created by zg, POWCHK disabled, PULCHK disabled
       configuration hash MD5:
       62 19 C7 07 E1 42 D1 B7 37 6C 3D D0 77 39 F9 E6
       data hash MD5: 64K
       E3 A4 75 CE A4 95 1E 2B 4B 01 0F 5B D3 FF 88 35>)
(   2,<2005-11-24 15:45:42.01 +000>,<MAYBRIDGE\NMR>,<NMR_250MHZ>,
      <Start of raw data processing
       ef LB = 0.3 FT_mod = 6 PKNL = 1 SI = 32K 
       data hash MD5: 32K
       5F 7C 41 ED 9A EF 2C CD FD F9 22 3F 49 68 1F 6E>)
(   3,<2005-11-24 15:45:47.15 +000>,<MAYBRIDGE\NMR>,<NMR_250MHZ>,
      <apk 
       data hash MD5: 32K
       20 04 D8 93 38 72 0E 1E BE 92 9A 1F 3B 49 7B F3>)
(   4,<2005-11-24 15:45:49.07 +000>,<MAYBRIDGE\NMR>,<NMR_250MHZ>,
      <abs ABSG = 5 
       data hash MD5: 32K
       44 86 E9 05 20 6F 50 15 BD A8 3C D0 6A 62 D8 35>)
$$ ##END=
$$ 
$$ hash MD5
$$ 8A 63 19 FA 7A 92 5C 73 04 FF 3D 3C 26 E0 7F D1
##$RELAX= 
##$RELAX= 
##$RELAX= 
##$RELAX= 
##$RELAX= 
##$RELAX= 
##$RELAX= 
$$ Bruker specific parameters
$$ --------------------------
##$DU= <C:\u>
##$EXPNO= 12990
##$NAME= <ADRS>
##$PROCNO= 1
##$TYPE= <nmr>
##$USER= <dgb>
##$AMP= (0..31)
100 100 100 100 100 100 100 100 100 100 100 100 100 100 100 100 100 100 
100 100 100 100 100 100 100 100 100 100 100 100 100 100 
##$AQSEQ= 0
##$AQ_mod= 3
##$AUNM= <au_zg>
##$AUTOPOS= <45 >
##$BF1= 250.13
##$BF2= 250.13
##$BF3= 250.13
##$BF4= 250.13
##$BF5= 500.13
##$BF6= 500.13
##$BF7= 500.13
##$BF8= 500.13
##$BYTORDA= 1
##$CFDGTYP= 0
##$CFRGTYP= 5
##$CHEMSTR= <none>
##$CNST= (0..31)
1 1 145 1 1 1 1 1 1 1 1 1 1 1 1 1 1 1 1 1 1 1 1 1 1 1 1 1 1 1 1 1 
##$CPDPRG= <>
##$CPDPRG1= <>
##$CPDPRG2= <>
##$CPDPRG3= <>
##$CPDPRG4= <mlev>
##$CPDPRG5= <mlev>
##$CPDPRG6= <mlev>
##$CPDPRG7= <mlev>
##$CPDPRG8= <mlev>
##$CPDPRGB= <>
##$CPDPRGT= <>
##$D= (0..31)
0 1 0 0 0 0 0 0 0 0.06 0 0 0 0 0 0 0.0002 0 0 0 0 0 0 0 0 0 0 0 0 0 0 
0 
##$DATE= 1132847119
##$DBL= (0..7)
120 120 120 120 120 120 120 120 
##$DBP= (0..7)
150 150 150 150 150 150 150 150 
##$DBP07= 0
##$DBPNAM0= <>
##$DBPNAM1= <>
##$DBPNAM2= <>
$$ [...]
##$SUBNAM7= <"">
##$SUBNAM8= <"">
##$SUBNAM9= <"">
##$SW= 20.6930455092707
##$SWIBOX= (0..15)
0 0 3 0 0 0 0 0 0 0 0 0 0 0 0 0 
##$SW_h= 5175.983436853
##$TD= 65536
##$TD0= 1
##$TE= 294.16
##$TE2= 300
##$TE3= 300
##$TEG= 300
##$TL= (0..7)
0 120 120 120 120 120 120 120 
##$TP= (0..7)
150 150 150 150 150 150 150 150 
##$TP07= 0
##$TPNAME0= <>
##$TPNAME1= <>
##$TPNAME2= <>
##$TPNAME3= <>
##$TPNAME4= <>
##$TPNAME5= <>
##$TPNAME6= <>
##$TPNAME7= <>
##$TPOAL= (0..7)
0.5 0.5 0.5 0.5 0.5 0.5 0.5 0.5 
##$TPOFFS= (0..7)
0 0 0 0 0 0 0 0 
##$TUNHIN= 0
##$TUNHOUT= 0
##$TUNXOUT= 0
##$USERA1= <user>
##$USERA2= <user>
##$USERA3= <user>
##$USERA4= <user>
##$USERA5= <user>
##$V9= 5
##$VALIST= <valist>
##$VCLIST= <CCCCCCCCCCCCCCC>
##$VD= 0
##$VDLIST= <DDDDDDDDDDDDDDD>
##$VPLIST= <PPPPPPPPPPPPPPP>
##$VTLIST= <TTTTTTTTTTTTTTT>
##$WBST= 1024
##$WBSW= 4
##$XGAIN= (0..3)
0 0 0 0 
##$XL= 0
##$YL= 0
##$YMAX_a= 612310
##$YMIN_a= -454166
##$ZGOPTNS= <>
##$ZL1= 120
##$ZL2= 120
##$ZL3= 120
##$ZL4= 120
##$ABSF1= 16.522
##$ABSF2= -4.171173
##$ABSG= 5
##$ABSL= 3
##$ALPHA= 0
##$AQORDER= 0
##$ASSFAC= 0
##$ASSFACI= 0
##$ASSFACX= 0
##$ASSWID= 0
##$AUNMP= <proc_1d>
##$AZFE= 0.1
##$AZFW= 0.1
##$BCFW= 0
##$BC_mod= 0
##$BYTORDP= 0
##$COROFFS= 0
##$CY= 12.5
##$DATMOD= 1
##$DC= 0
##$DFILT= <>
##$DTYPP= 0
##$F1P= 14.0000005364418
##$F2P= -0.99999901652339
##$FCOR= 0.5
##$FTSIZE= 32768
##$FT_mod= 6
##$GAMMA= 0
##$GB= 0
##$INTBC= 1
##$INTSCL= 1
##$ISEN= 128
##$LB= 0.3
##$LEV0= 0
##$LPBIN= 0
##$MAXI= 10000
##$MC2= 0
##$MEAN= 0
##$ME_mod= 0
##$MI= 0
##$NCOEF= 0
##$NC_proc= -4
##$NLEV= 6
##$NOISF1= 0
##$NOISF2= 0
##$NSP= 0
##$NTH_PI= 0
##$NZP= 0
##$OFFSET= 16.522
##$PC= 1
##$PHC0= 71.03609
##$PHC1= 7.165285
##$PH_mod= 1
##$PKNL= yes
##$PPARMOD= 0
##$PSCAL= 4
##$PSIGN= 0
##$REVERSE= no
##$SF= 250.13
##$SI= 32768
##$SIGF1= 0
##$SIGF2= 0
##$SINO= 400
##$SIOLD= 32768
##$SREGLST= <1H.DMSO>
##$SSB= 0
##$STSI= 32768
##$STSR= 0
##$SW_p= 5175.98343685301
##$SYMM= 0
##$S_DEV= 0
##$TDeff= 65536
##$TDoff= 0
##$TI= <Analysis number 999999
Compound Code 99
Book Reference 9
Project Code 9>
##$TILT= no
##$TM1= 0
##$TM2= 0
##$TOPLEV= 0
##$USERP1= <user>
##$USERP2= <user>
##$USERP3= <user>
##$USERP4= <user>
##$USERP5= <user>
##$WDW= 1
##$XDIM= 32768
##$YMAX_p= 426165405
##$YMIN_p= -447113
$$ End of Bruker specific parameters
$$ ---------------------------------
##NTUPLES= NMR SPECTRUM
##VAR_NAME=  FREQUENCY,     SPECTRUM/REAL,   SPECTRUM/IMAG
##SYMBOL=    X,             R,               I
##VAR_TYPE=  INDEPENDENT,   DEPENDENT,       DEPENDENT
##VAR_FORM=  AFFN,          ASDF,            ASDF
##VAR_DIM=   32768,         32768,           32768
##UNITS=     HZ,            ARBITRARY UNITS, ARBITRARY UNITS
##FACTOR=    0.157963299565203, 1,           1
##FIRST=     4132.6476996994, 0,             0
##LAST=      -1043.33573715361, 0,           0
##MIN=       -1043.33573715361, -447113,     0
##MAX=       4132.6476996994, 426165405,     0
$$ Real data points
##PAGE= N=1
##DATA TABLE= (X++(R..R)), XYDATA
$$ [...]
19518C461250n0619k7871l8702p3929n8293n6867k7081m5317q1167p0555o7708
19507B863141n5659j7079o4136l5423k9215j1121o1628m7246r408k9857n2170
19496B450199m8581L838l0267n8668O761j226k5345q9016n4332m9352j3205J359
19484B092165k4107k4282j6014o1955j9323J3899o042m8738m1177J2351J3359
19473A890136k7785n0200j1637j0961l7415k6760r52J981n8605o512l0362o0826
19461A570102m8752j68k44N36j0670l253k192j1310n5162m5367o7284k8597R549
19448A307188j0472J2673j0071l8495l487k6624j1272N859j7996N734J3282j3790
19436A212529j5165j5993l6576O828j0519l4541p296o705R261L3925k8370p1037
$$ y = [3461250, 3410631, 3382760, 3344058, 3270129, 3211836, 3154969, 3127888, 3082571, 3001404, 2930849, 2863141, 2807482, 2790403, 2726267, 2690844, 2661629, 2650508, 2588880, 2541634, 2532226, 2502369, 2450199, 2401618, 2405456, 2375189, 2316521, 2323282, 2322056, 2296711, 2207695, 2153363, 2104011, 2090806, 2092165, 2068058, 2043776, 2027762, 1965807, 1946484, 1960383, 1954341, 1905603, 1864426, 1876777, 1890136, 1862351, 1812151, 1800514, 1789553, 1752138, 1725378, 1724426, 1726407, 1667802, 1661290, 1630928, 1570102, 1521350, 1521182, 1520938, 1521474, 1510804, 1507551, 1505359, 1494049, 1438887, 1393520, 1326236, 1297639, 1307188, 1296716, 1309389, 1299318, 1260823, 1257336, 1230712, 1219440, 1225299, 1207303, 1213037, 1226319, 1212529, 1197364, 1181371, 1144795, 1151623, 1141104, 1106563, 1099267, 1092562, 1101823, 1135748, 1107378, 1036341]
19424A036341j9823m0305r673J7474j5092R082k096K3043K49n078l8090m272j5300
19411I36460p022J7600r296k5962j6652K6583L577k5908k2461J608N263k5231
19399H58559j9429j2259J864K4204K4528m5082l8479m015j800J377P261j4223
19387G82506l1794m5682O789p554K644J7176j7167m5539P723L1410L3232j6363
19375G17381j6605l4257L08J6294q768j9129k4074K5205J4706l1914J781K6543
19363F67471k686l4322l7768M383p547J0540l7555J3659K4286j3051j4384l2167
19351E40859j0140l1345O975J5844o955J068j4108l1079o4337m6613K5158M2016
19339D27343r78K3933K5378k5026m1014o889J265L1960N849M416K4202j3368J303
$$ y = [1036341, 1016518, 976213, 966540, 984014, 968922, 978004, 975908, 998951, 999200, 994122, 956032, 951760, 936460, 929438, 947038, 937742, 911780, 895128, 921711, 925288, 899380, 876919, 878527, 883790, 858559, 839130, 826871, 828735, 852939, 877467, 832385, 793906, 789891, 788091, 789468, 796729, 782506, 750712, 705030, 711819, 704265, 706909, 724085, 706918, 661379, 669102, 700512, 733744, 717381, 700776, 666519, 666827, 683121, 674353, 655224, 631150, 656355, 671061, 639147, 640928, 667471, 664785, 630463, 592695, 597078, 589531, 600071, 562516, 576175, 600461, 587410, 573026, 540859, 530719, 499374, 506349, 522193, 515238, 516306, 502198, 471119, 406782, 360169, 385327, 427343, 426365, 450298, 475676, 450650, 409636, 402747, 404012, 435972, 441821, 446237, 470439, 457071, 458374]
19326D58374J1472O324n961l6069j6542m276M0464M1092P590k5698j8487J822
19314D60105k655j4235k3738n9958J3040L0132k272J2006L4965k9443j2813M580
19302D09714r802j1507L4360P262P30q378k1645J7342m82J8802J5533l1279k4912
19289C95738J4216L1765J3234j256r254l9792p976P915N651k6772j9744k2141
19277C41584N748j5681K3089K5425K39J738m133l4628J517K2471j4270j6306K3267
19264C60060j4248n154O122J0648J7611r837r054K797l4672k4823K456K0743l8889
19251B83760p581l2237n829K9722J2477J0395p013J0733L1207K5566j9668J7205
19239C48737m64O064K7766j6466m8272l5540m948J1186j4761l324J9072j1551
$$ y = [458374, 469846, 476170, 470209, 434140, 417598, 413322, 453786, 494878, 502468, 476770, 458283, 460105, 457450, 443215, 419477, 359519, 372559, 402691, 400419, 412425, 447390, 417947, 405134, 409714, 399912, 388405, 422765, 430027, 430757, 422379, 400734, 418076, 417594, 436396, 451929, 420650, 395738, 409954, 441719, 454953, 453697, 444443, 404651, 396675, 404590, 410241, 383469, 363725, 341584, 347332, 331651, 354740, 380165, 380404, 382142, 378009, 343381, 344898, 367369, 353099, 336793, 360060, 345812, 340658, 346780, 357428, 375039, 365202, 356148, 358945, 324273, 299450, 301906, 322649, 283760, 276179, 243942, 238113, 267835, 280312, 290707, 283694, 294427, 325634, 351200, 331532, 348737, 348273, 354337, 382103, 365637, 317365, 281825, 276877, 288063, 273302, 269978, 289050, 277499]
19227B77499Q891J5083J1589j5918j9234O653L5663P865r68j1471l6163j1751
19215B67738O167j9795l2662J3823M0346k0575j3372M6393l171k0390J4057L1151
19203C09710Q169N364k5526J3527J0830m2359L580L7356J1903p908l3810k3009
19191B67827l6868J4865J4151j7961l1987r413N5920K6742K705J6079J6492j5882
19179C02670j4917k1409j1182m7225j3770j636j290J3240K8966O222j4457J5061
19167B40273j2438l8001j7714P338P485J5896k950o324j0117J3578M3985J5488
19155B56499k2189j260j86j5140k2536k8425k6513L0073N0718k5360p752k098
19143A85831j3279l6094L2415L4341k334k4524l3904m9827J9029l868k6331n53
$$ y = [277499, 286390, 301473, 313062, 297144, 277910, 284563, 320226, 328091, 327123, 315652, 279489, 267738, 273905, 254110, 221448, 235271, 275617, 255042, 241670, 288063, 284892, 264502, 278559, 309710, 317879, 323243, 297717, 311244, 322074, 279715, 283295, 320651, 332554, 324646, 290836, 267827, 230959, 245824, 259975, 242014, 210027, 200614, 256534, 283276, 285981, 302060, 318552, 302670, 287753, 266344, 255162, 207937, 194167, 192531, 191241, 204481, 233447, 239669, 225212, 240273, 227835, 189834, 172120, 179458, 186943, 202839, 199889, 193565, 183448, 197026, 241011, 256499, 234310, 233050, 232864, 217724, 195188, 166763, 140250, 170323, 221041, 195681, 187929, 185831, 172552, 136458, 168873, 203214, 200880, 176356, 142452, 92625, 111654, 107786, 81455, 80902]
19131H0902L8464K1638J9329J1407J3249r64L971k8239O098L7162J4738k3107
19119A94648j5622l0159P566J3532K904N864j3187N15K7921r07p102Q345r248
19106A85070L730k5036k2577k1870L2751O570k5933q398K3463L8278K5172j7803
19094A93417n764K2711l1758j4498j1247j2103O63q523J1747L6463J0899R960
19082B01967n0600k1365P13k0383j4785K2149J7696r982l9471M0114o875l1913
19070H7265N2002K4278k5624r758K1428L1150J876k1581P75k501m9418k6066J9725
19057A03551M3491j5214j6785L3330K3473k113j7444l206k8938m797n348j7295
19045I2705L7161J3769n123k0562J1372N2217J4612j7843j568n3452j9228P810
$$ y = [80902, 119366, 141004, 160333, 171740, 184989, 184025, 187996, 159757, 165855, 203017, 217755, 194648, 179026, 148867, 156433, 169965, 172869, 178733, 165546, 166061, 193982, 193075, 185973, 194318, 185070, 188800, 163764, 141187, 119317, 152068, 158638, 132705, 124307, 147770, 186048, 211220, 193417, 187653, 210364, 178606, 164108, 152861, 140758, 141421, 132898, 144645, 181108, 192007, 201967, 151367, 130002, 130715, 110332, 95547, 117696, 135392, 125410, 85939, 126053, 119178, 87265, 139267, 163545, 137921, 128163, 149591, 180741, 182617, 161036, 161811, 159310, 109892, 83826, 103551, 147042, 131828, 115043, 148373, 171846, 169733, 152289, 149083, 120145, 115348, 110000, 92705, 129866, 143635, 138512, 117950, 129322, 181539, 196151, 178308, 176740, 123288, 104060, 111870]
19033A11870J2665k1852j3597K7612M715J6000j2311p333k7557m6207J2838K1921
19021G8764M8566l687l612j4517J1052J1297J0276k2722L1217K289m101q158k7903
19008A08761j9628O38J5432L1056q655k8911j3478R572K9365M653J1660K2090
18996A62555J0737q952n2459m1594k220L3566K3045n433n068J5820p246Q392j9742
18983A11401J4443p235n149j4762k0124M715J3834K350j2777K5315J9837J441
18971A33289Q626n436l1456m465O113O166J8991j4556K497j8467m814J9714n877
18958A10325k0631p243K7363J6961P267n57K6143L8328j5093l5671j1622k7799
18946A07771j0079k5500k5818l236K6629L1035M619l4045n32M135j7606m999Q702
$$ y = [111870, 124535, 102683, 89086, 116698, 121413, 137413, 125102, 117769, 90212, 44005, 56843, 78764, 127330, 123643, 120031, 105514, 116566, 127863, 138139, 115417, 146634, 148923, 144822, 136664, 108761, 89133, 89771, 105203, 136259, 127604, 98693, 85215, 94787, 124152, 128805, 140465, 162555, 173292, 164340, 111881, 70287, 68067, 101633, 124678, 119245, 114177, 129997, 122751, 131143, 111401, 125844, 118609, 113460, 98698, 78574, 83289, 97123, 99473, 86696, 112011, 131848, 133289, 141915, 136479, 105023, 100558, 106671, 112837, 131828, 117272, 119769, 101302, 96488, 116202, 110325, 89694, 82451, 109814, 126775, 134042, 133485, 159628, 197956, 182863, 147192, 135570, 107771, 97692, 72192, 46374, 43138, 69767, 100802, 105421, 71376, 70844, 74979, 57373, 52374, 61076]
18933F1076L4822k096k1178L9330j7840m0789J9395L6045J3823m0564J1631L5274
18921A28929K0954p588j819k5907k6021m973M5965J7559J921j8266l5157j3745
18909H1852r278m937l8609J4549N2248r61n248J6469M5830k3077q060k7021l2114
18896F1643L6540R955J1587j9653J0110R006j9932N210J1854R389M852k1546l4731
18883G4284m346k0563l188L5481J846K2499l0470j562L4739K2053k2903l6561
18871G1309j4408J7728M1232l809k8116j522M3860L2999j2924N3931J8388q098
18859B10570k2777q451K88Q516L1432J2598N0902R6411K7495j4070n5131l0083
18847C07700M1920J01767L2873J3702M5661L4929k1704r949J6718p649k8498K7658
$$ y = [61076, 95898, 93802, 72624, 111954, 94114, 53325, 72720, 108765, 122588, 82024, 93655, 128929, 149883, 142295, 140476, 114569, 88548, 83575, 129540, 147099, 149020, 130754, 95597, 81852, 72574, 67637, 29028, 43577, 95825, 94864, 89616, 106085, 151915, 128838, 120778, 93757, 61643, 98183, 108138, 119725, 100072, 110182, 119188, 99256, 104466, 116320, 125709, 130561, 109015, 74284, 69938, 49375, 46187, 81668, 83514, 106013, 75543, 73981, 108720, 130773, 107870, 71309, 56901, 74629, 115861, 112052, 83936, 82414, 126274, 159273, 146349, 200280, 218668, 210570, 187793, 179342, 179630, 188146, 219578, 232176, 283078, 379489, 406984, 392914, 337783, 307700, 349620, 451387, 484260, 497962, 543623, 578552, 556848, 546899, 563617, 555968, 527470, 555128]
18835E55128M6409J1147K9508L8847M323o261q429j3437o862K0338m29K1297r807
18822F81772m0747q636l3367j2014l0820j6889m573k3035o0597m7249m6015n239
18810C52591N2048M2086L4998J3315J8454K6041K9466O049j2312J422O204j0826
18798E59536K6861j883o744J2553N0717L168J3599K6709O4661P1236O8937L7756
18786I27106M5233J8108j1063k0172M932J4274L3908L8651J168J7002J6379n9182
18774A026344j20812j09069j09123r8208k6436j8755k0665k2324p6516l8780j7751
18763C67905m0085j3791P339k6701l6098k5180k5137j3344J7806K5463j3003k0293
18751B04881m4620l887J0590K1889M5827j867J1418p395J9927M0883N8949N1005
$$ y = [555128, 601537, 612684, 642192, 681039, 685362, 679101, 670672, 657235, 650373, 670711, 670282, 691579, 681772, 641025, 632389, 599022, 587008, 556188, 539299, 534726, 511691, 451094, 403845, 357830, 352591, 404639, 446725, 481723, 495038, 513492, 539533, 568999, 575048, 562736, 564158, 570362, 559536, 586397, 584514, 577770, 590323, 641040, 644208, 657807, 684516, 749177, 820413, 889350, 927106, 972339, 990447, 979384, 959212, 964144, 978418, 1012326, 1050977, 1052145, 1069147, 1085526, 1026344, 905532, 796463, 687340, 589132, 562696, 543941, 523276, 500952, 424436, 385656, 367905, 327820, 314029, 321368, 294667, 258569, 233389, 208252, 194908, 212714, 238177, 225174, 204881, 160261, 156374, 166964, 188853, 234680, 232813, 244231, 236836, 256763, 297646, 356595, 407600]
18739D07600K5405k6793n4681K791L8029K5736J4701k1886J9465k1279j9513K0047
18727D09622N3665N3495N6657N9065j0765o5684p7910j00810n0815m1938r560
18716B75022k1982p2724l8666Q774j1801L2228K9036L2416Q916k013M159k0263
18704B23102L902k8606l2685m611k476N048k563k1374O762K8581N5237Q3760J6191
18691C30268n0367k9738l0922j8747L1694N3096M1610K0087m802K655L5165m2606
18679C37393l9995n2313k6174j5426M335M474j5562J4653N0461K5298L5696j82
18667C22658n2082l5917n0729j2123l2481l7333o980J1884J2956N13P772O0949
18655A89087N9746N4730K8704l1537n9209l3600k2527j0530M299O099l1346O721
$$ y = [407600, 433005, 406212, 351531, 354322, 392351, 418087, 432788, 410902, 430367, 409088, 389575, 409622, 463287, 516782, 573439, 632504, 621739, 556055, 478145, 377335, 326520, 284582, 275022, 253040, 180316, 141650, 150424, 138623, 170851, 199887, 232303, 241219, 239206, 243365, 223102, 227004, 198398, 165713, 161102, 158626, 163674, 161111, 139737, 146499, 175080, 230317, 314077, 330268, 279901, 250163, 219241, 200494, 232188, 285284, 326894, 346981, 342179, 344834, 379999, 337393, 297398, 245085, 218911, 203485, 207820, 212294, 196732, 211385, 261846, 287144, 322840, 322658, 270576, 234659, 183930, 171807, 139326, 101993, 95013, 106897, 119853, 120366, 128138, 189087, 248833, 303563, 332267, 300730, 241521, 207921, 185394, 174864, 179163, 185262, 153916, 160637]
18643A60637M0048J0447M1341M7629K5980p639m0792k7582l8467j4697k5136L4068
18631B05837Q916l0865k5375k119L8788K0723k053K9339L948j2561p394K1676
18619B48860K7577K0843L2702K6469j1766k998J9583l799o8866m2975j1923l2138
18607B01569r732J785o550M5229L2691P536l466L0119n2487R738J1651j3229l3240
18594B21614r431P206q071l841l2473K0704L1284k0307L1121K8829M254K8087
18582B98976K6275j1831l2949O898M0130J4272J6467j1316l7920m5826J8733L3210
18570C15119j2367k4483j8463j1197J2212L5549L1945N296j1197J228R803K0089
18558C53534J6204j8686n581k7811m7169j096j0922j2111J6824p983k1752Q582
$$ y = [160637, 200685, 211132, 252473, 300102, 326082, 318443, 277651, 250069, 211602, 196905, 171769, 205837, 214753, 183888, 158513, 156394, 195182, 215905, 213852, 243191, 247139, 234578, 227184, 248860, 276437, 297280, 329982, 356451, 344685, 341687, 361270, 357471, 288605, 245630, 233707, 201569, 191837, 193622, 187072, 232301, 264992, 272528, 269062, 299181, 246694, 256432, 268083, 254854, 221614, 212183, 219389, 211318, 207477, 175004, 195708, 226992, 206685, 237806, 266635, 270889, 298976, 325251, 313420, 280471, 287369, 327499, 341771, 358238, 346922, 309002, 263176, 281909, 315119, 302752, 278269, 259806, 248609, 260821, 296370, 328315, 333611, 322414, 323642, 333445, 353534, 369738, 351052, 345471, 317660, 270491, 269395, 258473, 246362, 263186, 255203, 233451, 242033]
18546B42033K0544J5143J1170J8453J3932n2945m052k3283J2174M3756J2949j3567
18534B96307l1474n783m047o864k8208J8396M8099L8866j4356k0917l0516j9498
18522B40005L3049j6930j5893k6270j8145L3650M4917K2950O912k4678J5154M1224
18510C35945k4775j3913O099k5297K9054m296M3767J7280m17p339J725J6828J3347
18497C88008K6751L284m469o2020p0619o0757j265K5279J8296o1708l8150j8651
18485A43979M1326J6096K2261K3915j4919L349n810J9739o886p58j7937R85J6825
18472B42165L9334K8344j443L3439J1223K4493k5081j4448j0212J3604J1435J329
18460C54182L4403K1106p158J533k1861l2564J4773M345m765k2252O545L2280
$$ y = [242033, 262577, 277720, 288890, 307343, 321275, 268330, 264278, 240995, 253169, 296925, 309874, 296307, 264833, 259050, 255003, 248139, 219931, 238327, 286426, 325292, 310936, 290019, 259503, 240005, 273054, 256124, 240231, 213961, 195816, 229466, 274383, 297333, 304245, 279567, 294721, 335945, 311170, 297257, 303356, 278059, 307113, 302817, 346584, 363864, 363447, 356108, 357833, 374661, 388008, 414759, 418043, 413574, 351554, 280935, 220178, 218913, 244192, 262488, 200780, 162630, 143979, 185305, 201401, 223662, 247577, 232658, 236007, 230197, 249936, 243050, 242292, 224355, 225340, 242165, 281499, 309843, 308400, 341839, 353062, 377555, 352474, 338026, 327814, 341418, 352853, 354182, 388585, 409691, 402533, 404066, 382205, 349641, 364414, 368759, 363994, 341742, 348287, 380567]
18448C80567P438J9629O1335M3911N5077n744m6616j9113L9071L6135j1201P630
18436E68119K3236l9471l000k9477n7783q1333n2658l0284M4280j1706j3751j3577
18424C02595N2185N7198K1968J4938j0546k8786k7948q1056j8210K6699j7615
18413B91422o1134L3626M8242N6851P6728O2318Q420J4908j3960p021L4658M5278
18401E90336L0249m9145n9726j8472L8589M4473l1787l5813n0109l5520K5180
18390D48255M8366j8288M8590P6962P1484J2054O785P6336R5546K9237O6159R7753
18378A059239R9267J04561J23962R8866J35668J64490K47221L02034M00840N42304
18368C278452P80492J087771J301176J397527J217662Q21298M63352J30289p2233
$$ y = [380567, 388005, 407634, 468969, 512880, 567957, 562213, 515597, 496484, 535555, 571690, 560489, 568119, 591355, 551884, 548884, 519407, 461624, 380291, 327633, 297349, 341629, 329923, 316172, 302595, 354780, 411978, 433946, 448884, 438338, 409552, 381604, 300548, 282338, 309037, 291422, 230288, 263914, 312156, 369007, 445735, 508053, 516473, 531381, 517421, 510400, 545058, 590336, 620585, 571440, 511714, 493242, 531831, 576304, 544517, 508704, 458595, 423075, 448255, 496621, 478333, 526923, 603885, 675369, 687423, 694208, 770544, 866090, 895327, 961486, 1059239, 1158506, 1263067, 1387029, 1485895, 1621563, 1786053, 2033274, 2335308, 2736148, 3278452, 4058944, 5146715, 6447891, 7845418, 9063080, 9884378, 10347730, 10478019, 10405786]
18359A0405786j710K37858K09379M4571j1601L33679R92541J619871K042029K267554
18349A8139957K377835K565278K831990K582348R94546j026310k219084k410636
18341B3835924k144841j505359p16742j75691j98049m50696k35120M44561J012694
18332A9866681J420181J743222K023974K058370J502412J099859J574648K853703
18324C4143050M258626N609112P111560R502724J3178781J8060453K1756028J8642087
18316A32262421P611895j616294m8101J1401248K3695583L2372007L8562455L3705206
18308B77946420R772652j7499945l0328269l4092354l5366256l0529839j8602580
18301A21299829n962201M235240J0240990J3385532J7009463J9050130J4475841
$$ y = [10405786, 10404076, 10641934, 10851313, 10895884, 10884283, 11217962, 12210503, 13830374, 15872403, 18139957, 20517792, 23083070, 25915060, 28497408, 29491954, 28465644, 26246560, 23835924, 21691083, 20185724, 19468982, 19293291, 19095242, 18644546, 18409426, 18853987, 19866681, 21286862, 23030084, 25054058, 27112428, 28614840, 29714699, 31289347, 34143050, 38401676, 44010788, 51122348, 60625072, 73803853, 91864306, 113620334, 132262421, 139874316, 138258022, 138209921, 149611169, 173306752, 205678759, 244241214, 277946420, 287719072, 270219127, 239890858, 205798504, 170432248, 139902409, 121299829, 115337628, 119572868, 129813858, 143199390, 160208853, 179258983, 193734824]
18294A93734824N860747m410096j5532964k2620264k2742727j8916373j4167853
18287A01205294q774280m203578k717696k968728j793879K509246P733117Q672643
18279I9662139P631699J1869826K1500807K3026088J0051542j588318J150665
18272A73304448R575272J0730326K695756j3452067l0429117l6458359k9818859
18265H6147400j9695714j2198874p502477m564314k903053k001736j014586P36367
18257C7003013K992211M071800J457261l291741n962989n003516k701306j299280
18249B7265453j282306j916694k064830j447802p47658k36150J06693N81665J373963
18240B1632334K704161M725775O572922N489943N80481m224798n343864l417872
$$ y = [193734824, 199595571, 195185475, 179652511, 157032247, 134289520, 115373147, 101205294, 92431014, 88227436, 85509740, 82541012, 80747133, 83256379, 90989496, 99662139, 107293838, 119163664, 140664471, 163690559, 173742101, 172153783, 173304448, 182879720, 193610046, 196305802, 182853735, 152424618, 115966259, 86147400, 66451686, 54252812, 46750335, 42186021, 39282968, 37281232, 36266646, 37003013, 39995224, 44067024, 45524285, 42232544, 36269555, 31266039, 28564733, 27265453, 25983147, 24066453, 22001623, 20553821, 19806163, 19570013, 19676706, 20258371, 21632334, 24336495, 29062270, 35635192, 41125135, 41705616, 37480818, 32136954, 28719082]
18232B8719082q64015J591242M341982O998845O710088K878352p50126P721N062920
18223E4696091J1365858J4100765J1307918J428960j0050855j5870739j4356740
18216E2621258j0533584p005626l862662j347111L08125J217056K055465L216338
18208C6669259M285340N050075N676292N009245J836201j272532k668336m390362
18200E0195182o310697o522867n089689l924942l062345j642896L09877K301593
18192B6253216L784912M205667K627725m18163k828831l045587j583117j156285
18184B7839537k476300l331069k557116j514243j270062j273795p53593L41354
18176A5004713J755327L323503M746678M959038K726939o42171k269216j249463
$$ y = [28719082, 27855067, 29446309, 33788291, 40787136, 47497224, 50375576, 49625450, 49633171, 54696091, 66061949, 80162714, 91470632, 92899592, 82848737, 66977998, 52621258, 42087674, 35082048, 31219386, 29872275, 30180400, 31397456, 33452921, 36669259, 40954599, 46004674, 51680966, 56690211, 58526412, 57253880, 54585544, 50195182, 43884485, 37361618, 32271929, 28346987, 25284642, 23641746, 23951623, 26253216, 30038128, 34243795, 36871520, 36453357, 33624526, 30578939, 28995822, 27839537, 25363237, 22032168, 19475052, 17960809, 16690747, 15416952, 14663359, 15004713, 16760040, 20083543, 24830221, 29789259, 32516198, 31874027, 29604811, 28355348]
18168B8355348R77551K910475M011777L318137R65413j842177m031487m843686
18160B9821351m018973k837881k774703l077927k658424j706978j257875j263127
18152A0225463j294404j102052p85501n00690k30545L0147K72555N63221J037960
18143H216154J798885K708519L326978K715064Q8933k459751l200168k470901
18135A0723713j394829l94734N83620J363927J301468L5396j237046j508421q49378
18126H623716J5444O28863Q08757K15062o90141j240272j293340j044173o91584
18117E332332l56382K3231L86517O73631P58129N42116n7312p03016j088298j087175
18107D423773r83193p17173m81064k45834k07402j52854j05124o5949p3934n3934
$$ y = [28355348, 29332899, 32243374, 36255151, 39573288, 40538701, 38696524, 34665037, 29821351, 25802378, 22964497, 20189794, 17111867, 14453443, 12746465, 11488590, 10225463, 8931059, 7829007, 7043506, 6542816, 6312271, 6342418, 6614973, 7178194, 8216154, 10015039, 12723558, 16050536, 18765600, 18854533, 16394782, 13194614, 10723713, 9328884, 8934150, 9517770, 10881697, 12183165, 12218561, 10981515, 9473094, 8623716, 8639160, 9268023, 10076780, 10291842, 9601701, 8361429, 7068089, 6023916, 5332332, 4975950, 4999181, 5385698, 6059329, 6817458, 7359574, 7302262, 6599246, 5510948, 4423773, 3440580, 2723407, 2242343, 1996509, 1789107, 1636253, 1531129, 1465180, 1391246, 1337312]
18097A337312n0894k6696r747j3893P909M4066J4717l2155J1408J4191N7617K7777
18085A381612j17779j84285j46354r7163j08849r0782m5544k0163k32j9303l9079
18074E12079j6689K2853J180o49K1010K3308n75J6796l866J1743j7279m1521l8966
18061D89424j3290k3524r71k8736j3138L9720O741o503m3281m3084J0911K7757
18049D02026k5585J249J245L041K4088k9845j8733J1837r770j1723p2466m6843
18037B28521p667K0809K5445k4947R88k2492r071r5k3740K588M4954J6601M872
18024B56766K3678j3520k4104l0490j0864J0863j043p136j8808j4141R499m566
18012A76134n5370n6892M384L8222k2699L556K9302j9235q331m2131n8036j9075
$$ y = [1337312, 1286418, 1259722, 1249975, 1236082, 1243991, 1288057, 1302774, 1270619, 1282027, 1296218, 1353835, 1381612, 1263833, 1079548, 933194, 836031, 727182, 636400, 590856, 570693, 570461, 551158, 512079, 495390, 518243, 519423, 518774, 539784, 563092, 562517, 579313, 575447, 587190, 569911, 528390, 489424, 476134, 452610, 451639, 422903, 409765, 449485, 456226, 449723, 406442, 363358, 374269, 402026, 376441, 377690, 378935, 381976, 406064, 376219, 357486, 369323, 359553, 347830, 275364, 228521, 220854, 241663, 267108, 242161, 243149, 220657, 211586, 211491, 187751, 190339, 235293, 251894, 256766, 280444, 266924, 242820, 212330, 201466, 212329, 211286, 204150, 185342, 171201, 180700, 176134, 120764, 63872, 68256, 106478, 83779, 87335, 116637, 97402, 89071, 46940, -11096, -30171]
18000c0171J8345M4945N3268N7135K5267l3265R476R742m096m011m9126m5138
17988E2371j7814k0816K1992N9791L1454p264N7K972k0068l4291L085k4348j9807
17975B7314J4492L7320J2112R978j6068Q635j3624l4981k4531m1454J8410q8L3435
17962C0950P984J8410M2228N4212M5026J4003K2501J371m4781m1494L259k3880
17950A29789l3152q962M728j1804j241N5271m445j4980k9869j612K7600M7202
17938A58525K7573j8773k9538l7783j3475J7617j4791j644k334K0149M6210l961
17926A47775J2150l2610m563l9159K62K5721m365j4994J0292o261P75M329l3612
17913F5740j6858K3285J8463k6469j929J5956k7099j3035J1835L8762q712M779
$$ y = [-30171, -11826, 33119, 86387, 143522, 168789, 135524, 145000, 154742, 150646, 146635, 97509, 52371, 34557, 13741, 35733, 95524, 126978, 119714, 119771, 122743, 102675, 68384, 71469, 47121, 27314, 41806, 79126, 91238, 101216, 85148, 93783, 80159, 45178, 20647, -20807, -2397, -2485, 30950, 38934, 57344, 99572, 153784, 198810, 212813, 235314, 236685, 191904, 150410, 153669, 129789, 96637, 87675, 92403, 80599, 79358, 134629, 130184, 115204, 85335, 83723, 111323, 158525, 186098, 167325, 137787, 100004, 86529, 104146, 89355, 87711, 85377, 105526, 151736, 147775, 159925, 127315, 122752, 83593, 83855, 109576, 105211, 90217, 100509, 94248, 95023, 99352, 65740, 48882, 72167, 90630, 64161, 62232, 78188, 51089, 38054, 49889, 88651, 79939, 84718]
17901H4718l4144q471L0011J8184J4254l2351k8019l617k4368j638L3156J6820
17889F4535J3379J0739L7896k9313n7060j1439m843r577J1280K4363j0535K6484
17877F5909J0377l8737j4300L4367M2161Q860j3920O328m482l855K5077k939J6760
17864A31606m0347j4007J5568K477j966L826J819m921q179l531J5975j7461M6366
17851A27225O739k38O2186M6218K4267N759M2101M3196O2436J4896L7926P4564
17839E47275M4874O2886L6876k538J7976K7934q704n9182m8110l6461J3997J6043
17827F12866r008j8064j9589k9931k7286L641L0116N3131L0208J5755K9474j9626
17815F51687j114P403J119j7451k3738n0112m41k6674J8611L3456k1780J2398
$$ y = [84718, 50574, 42103, 72114, 90298, 104552, 72201, 44182, 40565, 16197, 14559, 47715, 64535, 77914, 88653, 126549, 97236, 40176, 28737, 23894, 14317, 25597, 49960, 39425, 65909, 76286, 37549, 23249, 57616, 99777, 108637, 94717, 101045, 96563, 92708, 117785, 114846, 131606, 91259, 77252, 92820, 95297, 93331, 97157, 98976, 94055, 85876, 82345, 98320, 80859, 127225, 133964, 133726, 195912, 242130, 266397, 272156, 314257, 357453, 419889, 434785, 472711, 547275, 592149, 655035, 691911, 689373, 707349, 735283, 726579, 667397, 619287, 582826, 596823, 612866, 603858, 585794, 566205, 536274, 508988, 512629, 542745, 595876, 626084, 641839, 671313, 651687, 650573, 657976, 659095, 641644, 617906, 567794, 567353, 540679, 559290, 592746, 570966, 583364]
17803E83364J5922l1770m1329m1768o848j2515l1110Q718J4350M8203K211L52
17791E07780O425K3980J5824p866M344M5091L892k061L5829Q0140O441j3316m4358
17778F62145j6599N429J0928j0821N3362Q9434L8747L969m4497m6663n9277n4738
17766F31419m6716K4350L1136k5819l8014n4625l6237j0783j3119j0083K5914
17755D77423l7721j2882r232n6318o5907m5161k2694J5382P984k9204j9637J2767
17743B14800q065j8556o8136q588N593r092Q471J4287K5416M3246o616J0189K9957
17730B32906R711j869M5216L4873K849Q3J3417J4551j7325o506m8997m9024j283
17717B28602l723q119J9003J7443M8065M5245M4300P2193N064m2435m4104j2047
$$ y = [583364, 599286, 567516, 526187, 484419, 477571, 465056, 433946, 442664, 457014, 505217, 507428, 507780, 514205, 538185, 554009, 546143, 550487, 595578, 599470, 597409, 633238, 713378, 719819, 706503, 662145, 645546, 650975, 661903, 651082, 704444, 793878, 832625, 836594, 792097, 745434, 686157, 631419, 584703, 609053, 640189, 614370, 576356, 521731, 485494, 474711, 461592, 451509, 477423, 439702, 426820, 417588, 361270, 295363, 250202, 227508, 242890, 250874, 221670, 202033, 214800, 206735, 188179, 120043, 111455, 117048, 107956, 116427, 130714, 156130, 199376, 192760, 202949, 232906, 242617, 240748, 285964, 320837, 323686, 323769, 337186, 351737, 334412, 327906, 278909, 229885, 228602, 224879, 216760, 235763, 253206, 301271, 346516, 390816, 463009, 468073, 425638, 381534, 369487]
17705C69487m1947l0979K7269l7662n7429J1091k254J2686L1973j556m4190m0238
17693A96251k792o9521j9785K0142K659L8491P2736J6075O967k0421l3389l6242
17681A71171k6763j7929J1335r672K1585J112J3974J0601J1927R276J0451N504
17669B12572J2388J0163P180M0922m550j67n541L433m906q1786o4640J5116j6841
17656A23343j5722J8965K6673Q261L3166J237j7081j6849J2621O765J6230R772
17644B07381j5018l1683j1750o612k0306n5615j7728K4352N9707J8947L1138M9645
17632B32458j1838k4932K033l4723n1692l9032O468m578j0782K0788J6223j5811
17620H4582Q7J176L027l7138k2887K6340J9176J4443K8099J4113p559q552l1081
$$ y = [369487, 327540, 296561, 323830, 286168, 228739, 239830, 237576, 250262, 282235, 280679, 236489, 196251, 193459, 123938, 104153, 124295, 126954, 165445, 238181, 254256, 261223, 240802, 207413, 171171, 144408, 126479, 137814, 128142, 149727, 150839, 164813, 175414, 187341, 196617, 207068, 212572, 224960, 235123, 242303, 283225, 278675, 278508, 272967, 276400, 271494, 189708, 125068, 140184, 123343, 107621, 126586, 153259, 161520, 194686, 195923, 178842, 161993, 174614, 181379, 197609, 207381, 192363, 160680, 148930, 142318, 122012, 66397, 48669, 73021, 132728, 151675, 182813, 232458, 220620, 195688, 197721, 162998, 111306, 72274, 78742, 74164, 63382, 84170, 100393, 84582, 84669, 85845, 88872, 51734, 28847, 55187, 74363, 88806, 116905, 131018, 123459, 114907, 83826]
17607H3826k5626N281o420J267K1497O907k7615j5821j5900m298K7797l0419L7370
17594E7846K7963k2543l6856k6016k4889L1589k7684J8191M0782O823n111m0536
17582d41K3591j3901j0932k1053j1356L692R377K2603M5409R22p589M219K1870
17569F6411L301k3645j1585K3002J1483k770q604j4807J0499k8601j9932l3069
17557b8317L614K6105L1924L105j3359j235J1370l255j6271q373J4954P929N0103
17544G8294K9318j1997k9179m507L275l5473j1957K466m470J2694k6862K954K6512
17531C1068J2492j9071j7585J2503J3510k0363l6298n8293J5233O8935M4993j4995
17519C2129m3102m1162K5199O491j4153j4365K4107J5363l6267K8984N3243M1166
$$ y = [83826, 58200, 63481, 57061, 58328, 79825, 86732, 59117, 43296, 27396, 23098, 50895, 20476, 57846, 85809, 63266, 26410, 394, -24495, 7094, -20590, -2399, 38383, 45206, 40095, -441, 23150, 9249, -1683, -22736, -34092, -30400, -21023, 1580, 46989, 47911, 40322, 44541, 66411, 69712, 46067, 34482, 57484, 68967, 66197, 57593, 42786, 53285, 24684, 4752, -28317, -24703, 1402, 33326, 36431, 23072, 21837, 33207, 29952, 13681, 5308, 20262, 28191, 78294, 107612, 95615, 66436, 61929, 65204, 29731, 17774, 20240, 15770, 28464, 1602, 4556, 31068, 43560, 24489, 6904, 19407, 32917, 12554, -23744, -82037, -66804, 2131, 47124, 32129, -10973, -52135, -26936, -20445, -34598, -48963, -24856, -9493, -45760, -16776, 36467, 77633]
17507G7633k9626m1536k782J7301J1544J4098j2410J7170J5420J177k9212m6087
17495g310J263L3575K916J5933K823p032j3541k3575J6892L7636q339p857p981
17482C5403l0868J3861j704j51J793J6758j7703J2930j7557K3444o105L072n621
17469B7552q996P805j8182j0379m897k834K4489N0909j2183j5885l9321n296J117
17456f101J4578j22j0947N247M9717J1237j4865l3611k1014J7050k8476j1440
17444b8747o354J5752J2002j8631k9168j1297l337K8101N9861K020J7280L2305
17432F9787n284m1895k238P264l947M4512l1898m6639q790M322K3932j3760K0307
17419A5673j651J1145M261q043L6645q041m2995L3943L1363M9703J0042l6240
$$ y = [77633, 48007, 6471, 3689, 20990, 32534, 46632, 34222, 51392, 66812, 67989, 38777, -7310, -6047, 27528, 30444, 46377, 49200, 42168, 28627, 5052, 21944, 59580, 51241, 43384, 35403, 4535, 18396, 16692, 16541, 18334, 35092, 17389, 30319, 12762, 36206, 30101, 33173, 27552, 18556, 26361, 8179, -2200, -7097, -9931, 14558, 65467, 53284, 37399, -1922, -7218, -6101, 8477, 8355, -2592, 2655, 52372, 63609, 48744, 15133, -5881, 11169, -17307, -28747, -35101, -19349, -7347, -25978, -55146, -66443, -69780, -41679, 18182, 20202, 37482, 69787, 64503, 22608, 20370, 27634, 23687, 68199, 36301, -10338, -19128, -14806, 9126, -4634, 15673, 14022, 25167, 29428, 21385, 58030, 49989, 6994, 40937, 72300, 122003, 132045, 95805]
17407I5805k7652l9336j1544L9838J5628o29j6480j0235J0519P165m960j2893
17395D5226m3684k546m262J8514J8254o898M430r186J8055K1195L574n2210l5634
17382b5172K0256K6289L7484L2326k0392j7680J1590L2815m9454p7800k073J002
17370c0809K8967O7301J3109j7251j8113m3904l1087l059N4660J5680j701J1417
17358D5210k1979k322K3277j2828r965k2030m2538L6289M3745q167L997R019L914
17345D5622K293k8964j3697Q786N3857K2341j4630k2277M766j1120q439l0140
17333H398Q404R460L850N741j4757l9831q363J0721n373q696K0101L6846J2066
17320C8567l0529l5210l5018K3169P999N928L4490J2671J1735L3420L9170R424
$$ y = [95805, 68153, 28817, 17273, 57111, 72739, 72110, 55630, 45395, 55914, 63079, 58119, 45226, 1542, -1004, -5266, 13248, 31502, 24604, 29034, 19848, 37903, 59098, 62672, 10462, -25172, -4916, 21373, 58857, 91183, 70791, 53111, 64701, 97516, 48062, -29738, -31811, -30809, -1842, 65459, 78568, 61317, 43204, -700, -31787, -34846, 19814, 35494, 33793, 45210, 23231, 20909, 44186, 31358, 21393, -637, -43175, -6886, 36859, 28692, 32689, 41708, 45622, 47915, 18951, 5254, 14040, 67897, 90238, 75608, 53331, 58097, 46977, 38538, 8398, 16802, 26262, 30112, 35853, 21096, -18735, -27098, -16377, -21750, -30446, -10345, 26501, 38567, 8038, -27172, -62190, -39021, -31022, -25094, 9396, 22067, 33802, 67222, 106392, 115816]
17308A15816n670m6695k1123K432r848l4604r011k9535r653L8905K4042K5895
17296D0951r617l3601k3499j7592K3465N786m825j9808k1256j9156R199N0231
17284a9722N8286R879K4846j3998m4603j3366Q857L2868K9560K2915j9233j8171
17272E8118J1792j3108r583k1089j4152k4430m0436J8106J7833K9142J3872Q860
17260C4925j013r941l6356l4400N3667J8823k5183k9873q281j6749N385J2205
17248c6791q224J2758J4860K1636J7253l7335n993L259J8464K9539j9885j6022
17236f481n516k959K3755r933l5261J0390J0475K6623M833l0799k5690M745M3403
17223G585N0272j7676L861j2090J2293L763J2387q566j0736m2423m0078l8073
$$ y = [115816, 110146, 63451, 42328, 44760, 34912, 308, -8703, -38238, -47891, -8986, 15056, 40951, 31334, -2267, -25766, -43358, -19893, -14107, -18932, -38740, -59996, -79152, -69953, -19722, 38564, 48443, 73289, 59291, 14688, 1322, 10179, 43047, 72607, 95522, 76289, 58118, 69910, 56802, 47219, 26130, 11978, -12452, -52888, -34782, -16949, 12193, 26065, 34925, 33912, 23971, -12385, -46785, 6882, 25705, 522, -29351, -37632, -54381, -48996, -36791, -45015, -32257, -17397, 4239, 21492, -15843, -21836, -18577, -113, 29426, 9541, -6481, -11997, -14956, 8799, -1134, -36395, -26005, -15530, 11093, 15926, -14873, -40563, -35818, 7585, 57857, 40181, 44042, 31952, 44245, 48008, 60395, 51829, 41093, -1330, -41408, -79481]
17211g9481Q768J4148N6007L912K168J2854R073k8726j0633P5459r968m3274K755
17198A3062l3985j0705p307j6183j4472J8221J4736j4746j9353k5502J2636J7241
17186f6357j1107l3482N1327R1300L0467O14M49l0412n7102N937q423l1386k9948
17173h8123j0585J6129J6606p250l746M1627L7123k0080K6679O049k2436l0024
17161c8031N674L5345Q983J089m3034Q238n266K8132J2179L4870L332j9222m939
17148B7350K846K6164K9012L151j5059k8469Q758j774j1116j6368j9968j5744
17136a1217O252P927K2036l791K8191J712n3723j9647j6429j8292J3554M3477
17124E0j862m3449J4847L853r501K4807k1976n073L9927J3543L562k8632p044
$$ y = [-79481, -70713, -56565, -558, 3354, 5522, 18376, 27449, -1277, -11910, 63549, 53581, 10307, 13062, -20923, -31628, -38935, -55118, -69590, -51369, -36633, -51379, -70732, -96234, -83598, -66357, -77464, -110946, -59619, 31681, 62148, 62762, 63211, 32799, -24303, -18366, -26789, -58175, -88123, -98708, -82579, -65973, -73223, -76969, -35342, 1781, -18299, 8380, 14429, -8007, -38031, -32357, 2988, 11971, 13060, -29974, -21736, -27002, 1130, 13309, 48179, 51511, 32289, 27350, 30196, 56360, 85372, 88523, 73464, 44995, 53753, 51979, 40863, 24495, 4527, -11217, -4965, 2962, 24998, 21207, 49398, 51110, -2613, -22260, -38689, -56981, -43427, 50, -1812, -45261, -30414, -26561, -36062, -11255, -33231, -38304, 1623, 15166, 18728, -9904, -16948]
17111a6948Q234K3926K5986j415N321L6865k674k1249m6552o4076j0410J8704
17099d4288J4719m882m914K0267J4561r392j4064j82J2377Q090M1529k1090l5608
17086b2877j377J6765N846k2908k57K4158J5326r327j3193k5746K9119L7530k738
17073C0321l0678j7296k9682j5245P159J0750k345j3388J8940J7139N370M5550
17061B6595p789j6122k8701r996J0838P096k6432K9881j6492m332K6192J162M029
17048d071L5732N5087k6559m6135o6699N0j3976j5619N3767O872J3931K2905k965
17035A2320R970J6715L5929J124m1555l6841o469k2853M206K3606j8713K3194
17023F33J9529K8030J6822J1998k6701l7923l598j6750l380K0864J2739O591J6366
$$ y = [-16948, -8714, 15212, 41198, 39783, 45104, 81969, 79295, 58046, 11494, -52582, -62992, -44288, -29569, -34451, -39365, -19098, -4537, -13929, -27993, -28175, -15798, -7708, 33821, 12731, -22877, -24254, -7489, -1643, -24551, -24808, -650, 14676, 5349, -7844, -33590, -4471, 33059, 30321, -357, -17653, -47335, -62580, -55421, -44671, -47016, -60404, -41464, -24325, -18955, 26595, 18806, 2684, -26017, -36013, -25175, -18079, -44511, -14630, -31122, -35454, -9262, -8100, -4071, 31661, 86748, 60189, 14054, -52645, -52595, -66571, -82190, -28423, -21551, -7620, 15285, 12320, 22290, 39005, 74934, 76058, 34503, -2338, -8807, -31660, -27454, -3848, -22561, 633, 20162, 48192, 65014, 77012, 50311, 12388, 8790, -7960, -11340, 9524, 22263, 28854, 45220]
17010D5220J8483K7059K0299m0188k2146K1444j4572K3633J2112p734j3614j7733
16998E2263k7040r313J1774j1147j0866J8788M2295k2969n1524J704K2349l2375
16986a6061j9257m135L9062J9201K372n6J5703p90j2769R978m5633j8410K1656
16973i139O5J3744j1433P856O489q320o860J9670M2739n223m1929j391l0885J3309
16959a1308J9644N456j0090j4677j5590M161r033j5210J3281K2495M0154j8987
16947A0296p071n441L676k7043M49k082k726M5320L0862o873k1712j6728L8718
16934C9645p021l5553l5070n066p006K7385O353K6812k5897k7317j8155J4315
16922d6575R622M8488M5751J8105j1369n5304j0088M7532P148o191k2887J7193
$$ y = [45220, 63703, 90762, 111061, 70873, 48727, 70171, 55599, 79232, 91344, 83610, 69996, 52263, 25223, 15910, 27684, 16537, 5671, 24459, 66754, 43785, -7739, -6035, 16314, -16061, -35318, -39453, -391, 18810, 21182, 21126, 36829, 36039, 23270, 33248, -12385, -30795, -9139, -9074, 4670, -6763, 1093, 7582, -738, -7598, 12072, 54811, 49588, 7659, 6268, -24617, -11308, 8336, 13792, 3702, -10975, -26565, -22404, -31437, -46647, -33366, -10871, 29283, 10296, 3225, -2216, 1460, -25583, -25134, -27216, -29942, 15378, 46240, 39367, 17655, 927, 39645, 32624, -2929, -37999, -43065, -50071, -22686, -16333, 10479, -15418, -42735, -60890, -46575, -36953, 11535, 57286, 75391, 64022, 8718, -1370, 46162, 53310, 47119, 24232, 41425]
16910D1425j5137J9402K0636r504j8768j4438k11k0405k0572k1973n511q808k4356
16897g8220k0076N0134L5347p718L622j6900Q698J500J2048J0364j678K1638m896
16884A3863p824J2764j4889m4600O119j5378J8925o011K1331R076n792j3603L5806
16871I787L5914J31l0441j5524K3001J7263m47j1078k4788J2206j8670J201K423
16858I78j2992K6574L2188l7320m2739J0122M5756M0156J5738m4959k6979J6077
16846B2600k6403l1992Q907K3268k3034J762N1143j4254j1800L254j2219N706
16834c062Q262k2638k1841k8364J3097M0481K5167K26j2486k1992K1293J6280
16822A4423n0295J1419K8465M0809L0329k0746j1197l2779k5126o632L6951l3032
$$ y = [41425, 26288, 45690, 66326, 56822, 38054, 23616, 23405, 3000, -17572, -39545, -45056, -53864, -78220, -98296, -48162, -12815, -20533, -16911, -33811, -25113, -23613, -11565, -1201, -2879, 18759, 13863, 6039, 18803, 3914, -40686, -34567, -49945, -31020, -37031, -15700, -6624, -12416, -26019, 9787, 45701, 45832, 15391, -133, 22868, 40131, 39684, 28606, 3818, 16024, -2646, -1445, 978, -12014, 14560, 46748, 9428, -33311, -23189, 22567, 62723, 78461, 33502, 6523, 22600, -3803, -35795, -26888, -3620, -26654, -24892, 26251, 11997, 197, 3451, -8768, -3062, 5200, -17438, -39279, -67643, -54546, -14065, 11102, 11328, -1158, -23150, -1857, 14423, -35872, -24453, 4012, 44821, 75150, 54404, 43207, 10428, -14698, -21330, 15621, -17411]
16810a7411k3161L7064K9078j9915k6345r61K5968j4839l8346j3883K7617J0417
16798b4717J038Q864J9259J6481m324m8925K0166O911N854l265l3450P008R902
16785a9198M932O479J7105P276k4175k278l594m945j3422J9535K5139M2334l4320
16772B0868j6756J8349K9601L4k085j5262k6865L83k9349o175K9733J2723l22
16759A4877J5703l1630J0211R517L00m890j3533j3975J4568M388L1167K6315l2704
16746C0314j8963Q967l959k8877n1202k845L0795j2108m879K7729K8274L6589
16734C9835L6p3512l3500J1531L7617K4975K6396j183k9832l2055k3863J8751
16722c4804M7037j2267l8444J6970M1919J1463l913n237j9200N773K0782k4632
$$ y = [-17411, -40572, -3508, 25570, 5655, -20690, -21651, 4317, -10522, -48868, -62751, -35134, -24717, -23679, -14815, 4444, 20925, 16601, -32324, -12158, -5247, 607, -2658, -36108, -29100, -19198, -14266, -7787, 9318, 16594, -7581, -9859, -13453, -18398, -31820, -12285, 12854, 55188, 20868, 4112, 22461, 52062, 52096, 50011, 34749, 7884, 8267, -21082, -27257, 2476, 15199, 14877, 30580, -1050, 9161, 18678, 18978, 14088, 555, -13420, 1148, 5536, 36703, 63018, 30314, 11351, 20318, 16359, -12518, -63720, -66565, -35770, -47878, -52757, -25028, 3246, 39835, 39871, -33641, -67141, -55610, -17993, 6982, 33378, 32195, 2363, -29692, -53555, -34804, 12233, -34, -38478, -21508, 20411, 31874, 27961, 22724, 3524, 9297, 30079, 5447]
16710E447l9622K421q309L980N653n479j1845L9809J8334k1015j8959k4450j2798
16697f6833J732K0886Q296J4015K6137K3443J1346q514P005J6268J112j6181m601
16684C4111j061R459j6428m4897r602K781K7380j3421J6037j6968m0680J7867
16672c5422O254K4868k584k2256L8375J3044j8594m3445K4083l273J0632K1056
16660A2738k2305O491k636K3010r870k1113j3839J2065L1346m689L343k3242L17
16647h384K9555J1444K806k0258l8161R405J5303J5866P537k5001l7230J6012
16635b1106K2040K4880l623j1922Q866J970j3012k7792j5131m682J920J9355K5521
16622G284J9928J6494l2510n815o229j1408K278r395Q078K0445q930j1590k220
$$ y = [5447, -34175, -31754, -40063, -36083, -30430, -35909, -47754, -7945, 10389, -10626, -29585, -54035, -66833, -65101, -44215, -35919, -21904, 4233, 27676, 39022, 30508, 37513, 53781, 54893, 38712, 34111, 33050, 42509, 26081, -18816, -28418, -25637, 1743, -11678, 4359, -12609, -53289, -35422, -29168, -4300, -6884, -29140, 9235, 22279, 3685, -39760, -15677, -18950, -8318, 12738, -9567, -3076, -5712, 17298, 7428, -13685, -27524, -15459, 15887, 11198, 14541, -8701, -8384, 21171, 32615, 35421, 15163, -22998, -13593, 1710, 17576, 25113, 112, -37118, -21106, 934, 25814, 22191, 10269, 19135, 21105, 8093, -19699, -34830, -39512, -37592, -18237, 7284, 27212, 43706, 11196, 5381, -848, -12256, -9978, -19373, -11295, 9150, 220, -11370, -13590]
16609a3590j6900M506J6998q297L447K3872R585p122k5834Q50L0179L52P275N94
16595B5915R759L1727j3219j8958J3887j1240J512k686l057k998p475k5936O775
16582D006k9564n5563l9557L5305P4848O0176k7949p1774J4288N2498n378k7140
16570a5804R11P94K1161k2920R337J50J6324L0990M713J5486l4396n4002J4534
16557a2722P326m292l3272K1400M940j4166j8698L1994j2730j4875K2734K6243
16545C882l5087n492j644N483K5841K829p741n012l5207M5088P73r219L230N87
16531a1689J499J035l4880k7469o495K5872J0625n89N207j2918m497J5420j8575
16518e7454P755J8910J9117M699J5373N693n34j7568j1333O388P647n692o769
$$ y = [-13590, -30490, -25984, -8986, -17283, -13836, 10036, 19621, 12499, -13335, -12485, 17694, 18046, 25321, 25915, 35674, 67401, 54182, 35224, 49111, 37871, 39383, 36697, 33640, 30642, 23167, -2769, 4006, -25558, -81121, -120678, -85373, -10525, 49651, 21702, -50072, -35784, 16714, 11336, -15804, -14893, -14099, 7062, -15858, -6521, -6371, 9953, 40943, 45656, 61142, 26746, -27256, -12722, -5396, -9688, -42960, -21560, -16620, -30786, -49484, -17490, -30220, -45095, -22361, 3882, -31205, -36697, -38341, -32858, -7017, -4188, -11929, -16941, -52148, -7060, -6287, -15506, -12276, -11689, -10190, -9155, -44035, -71504, -77999, -52127, -41502, -42091, -36884, -49802, -54299, -38879, -57454, -49699, -30789, -11672, -6973, 8400, 14093, 13559, -4009, -15342, -8954, -1307, -6999, -13768]
16505a3768P568n978l4487j5813R941M7378j4925j5375J1182J3206r631O877K4222
16492A0397l031k1191J2392J6782J928l4872k1373M5120J0870j9713j4903J3677
16480c917k5387q266K0404J0684j4601j1676J8547K6161l1362k0829J7247K4342
16468A347m606j7307J6066J2591m808q340J2339j8168L8240j1407o5214J3342
16456c5925M4015l2903j6836O35J2533K1757P886K584j3810R726J22l3080J0951
16443b2345M6882L166j5009J538m3740r557L8169K0894l7282k0558J0411M4035
16431A6604N701m3488k0652J8796O456J2629Q764j1693l5885k2245L9123L4304
16419H414k4343o484J3196k9649k5239o20J650n967j4663K4709J4677M4390j113
$$ y = [-13768, -6200, -12178, -46665, -62478, -52537, -5159, -20084, -35459, -24277, -11071, -20702, -13825, 10397, 7366, -13825, -1433, 15349, 17277, -17595, -38968, 6152, 17022, -2691, -17594, -3917, -29304, -37570, -17166, -6482, -21083, -32759, -14212, 11949, -19413, -40242, -22995, 1347, -3259, -20566, -4500, 8091, 3283, -5057, 7282, -10886, 27354, 15947, -49267, -35925, 8090, -24813, -41649, -41014, -28481, -6724, 1162, 3746, -10064, -338, -216, -33296, -22345, 24537, 27703, 12694, 14232, -29508, -39065, -896, 19998, -17284, -37842, -27431, 16604, 22305, -21183, -41835, -23039, -16583, -3954, 4810, -6883, -42768, -65013, -25890, 8414, -15929, -22413, -9217, -38866, -64105, -64725, -63075, -69042, -83705, -58996, -44319, 71, -1042]
16406a042j7092J1053L8080R870k8783l3884j3381K424k7731J1896M0463J8090
16394I963R413j3395l1240k1232K3248j5313l4205O906J9600o824J3542L6783
16382b754k234l065j146K3172K8906J3487l8244k4261j1516k4085n141M4780j2250
16369a4351k6720j803M2737K2882j6342J814m645J635j2575J0739K2013J1190
16357C6574r606j8919n465K8880J1871k7983j2489P024J1320J1773p232l80l0908
16344e540r442J1097M2191o110l2852K1917p795k7474j5861L9303M550K8597l712
16331C8869n7185K1784K5756j7757Q037J604J9718K8999j3848l1053m676k9120
16319h872m308k4934r069K7191P099j1967J9091J4654K3986O569k1234m9010k349
$$ y = [-1042, -18134, -7081, 30999, 40869, 12086, -21798, -35179, -32755, -60486, -48590, -8127, 9963, 19376, 5981, -25259, -46491, -23243, -38556, -72761, -65855, -46255, -53079, -39537, -2754, -4988, -8053, -9199, 13973, 42879, 56366, 18122, -6139, -17655, -41740, -46881, -2101, -14351, -41071, -42874, -137, 22745, 6403, 8217, 3572, 5207, -7368, 3371, 25384, 36574, 26968, 8049, 2584, 31464, 43335, 15352, 2863, 9887, 21207, 32980, 25748, 25368, -5540, -14982, -3885, 38306, 32196, -656, 21261, 13466, -14008, -29869, 9434, 13984, 42581, 38869, -18316, 3468, 29224, 11467, 19504, 21108, 40826, 69825, 55977, 24924, 20248, -8872, -13180, -38114, -47183, -19992, -12893, -24860, -5769, 8885, 32871, 39440, 18206, -30804, -33153]
16306c3153p026Q731Q776J7162J1016J0270k3536k4954k6687R94J4353q072K7029
16293b5097O113O346o728J6912K2276k14l5123j3334J9346K0372k2244K1130q815
16280I40j5273k0025k0679M713J2313O8658N1949n514j158k6069o2703k5736K035
16267c6549J2924j2939k5178J1171J9501J6392K797p084O010N5603M4940K085
16255H9673k4308l2372n5873P668k4599J6417K3563L215l3654r902Q843p230j763
16242d0322l1252L573K2882j4340k1307M9395P438J5968J5407P465J1521m171
16230B2257j2510J8134L2913q597k4778J0541j6933K6640K5566J800r157k6763
16218C9113q854J422n8771n5271L2175N1195L6415q906j9178j0108N773k708o591
$$ y = [-33153, -40179, -31448, -22672, -5510, 5506, 15776, -7760, -32714, -59401, -58407, -44054, -52126, -25097, -18984, -12638, -19366, -2454, 19822, 19608, -15515, -28849, -9503, 10869, -11375, 9755, 940, -14333, -34358, -55037, -50324, -38011, 30647, 82596, 77082, 75924, 49855, -12848, -38584, -36549, -23625, -36564, -61742, -50571, -31070, -14678, -11881, -18965, -12955, 42648, 87588, 89673, 65365, 32993, -22880, -15212, -39811, -23394, 169, 3384, -30270, -40172, -31329, -38559, -40322, -71574, -68001, -45119, -59459, -80766, -31371, -23933, -7965, 7442, 14907, 26428, 22257, 9747, 27881, 60794, 52197, 27419, 37960, 21027, 47667, 73233, 75033, 65876, 39113, 30259, 31681, -27090, -82361, -50186, 1009, 37424, 28518, 9340, -768, 5005, 2297, -4294]
16205d294j4493k1632K1185J3976j2518p631M1261j1338o546K7405N366O122m589
16192C2274J2119j0939k2963j3588n283j4729k7788L4840L8248P090j5061j6197
16180a977N808J7634K0477k010k3843j7185o0624j3650K5969r769k7435L0970
16168e5635L8517j6707K2162k9220M133j4025m618J3129q590m302J9585M531k037
16155c3077J5743j9007J3645K4013j9382k3894L1983K6941J299J5473o866m2285
16143a5414k883Q915J951K1523L1306K0258k1929j0389J8455r694j0191k4026
16131G882o756r25r71o374j5299k7445R682J1808j7250o305J1151L0803L4761
16118B4762M363k3498j7580q075l583j749J785M542J3206J1162R297J360k0117
$$ y = [-4294, -18787, -40419, -19234, -5258, -17776, -25407, 15854, 4516, -2030, 25375, 30741, 36863, 32274, 44393, 33454, 10491, -3097, -8380, -23109, -50897, -16057, 22191, 29281, 14220, -1977, 3831, 21465, 41942, 39932, 16089, -1096, -61720, -75370, -49401, -59170, -86605, -55635, -17118, -33825, -11663, -40883, -36750, -50775, -55393, -42264, -50854, -55156, -35571, -31040, -33077, -17334, -36341, -22696, 1317, -18065, -41959, -9976, 16965, 18264, 33737, 26871, -15414, -18297, -9382, -7431, 14092, 45398, 65656, 43727, 33338, 51793, 42099, 31908, 7882, 1126, 201, -770, -7144, -22443, -49888, -40206, -28398, -45648, -51953, -40802, -9999, 24762, 29125, 5627, -11953, -20028, -23611, -25360, -23575, -19033, -5827, 5335, 14632, 15992, -4125]
16105d125l2789J9476P638j2216l2032r921O372K6142p358k1144o375J0209O755
16092d9368K4591P559p972k7074J9865j268l4136K972J5317L5288p852j9061J1324
16079b9815j6805K6371P032l316J0961j4649j9359P053J5336R661k4488K8106
16067c912m178j308k8697j1236J7710R734o443m849k2677l862q454j0646K3490
16054e5328M6003L5173m829k1019k9923k1354j7126J6212M331J1132r633k1200
16042f7561L973l822M8158o322j617J3111k2233n366J4080L4700m574j0969p687
16029a6129m3200J408K3330l7820J6331O8851N413l1188l8439j2303n397m451
16017g3594K7968J646m1035j3628M5149M3201l6813l885K2704J2773K7711k961
$$ y = [-4125, -36914, -17438, -9800, -22016, -54048, -63969, -57597, -31455, -38813, -59957, -66332, -56123, -49368, -24777, -17218, -25190, -52264, -32399, -33667, -67803, -64831, -49514, -14226, -22078, -41139, -29815, -46620, -20249, -13217, -16533, -5572, -20221, -39580, -32527, -17191, -7530, -32018, -3912, -8090, -9398, -38095, -49331, -31621, -21887, -28330, -33179, -55856, -59718, -68172, -78818, -55328, -9325, 25848, 21019, 0, -29923, -51277, -68403, -52191, -47860, -36728, -46361, -67561, -63588, -67410, -19252, -25574, -27191, -14080, -36313, -41679, -27599, 7101, 2527, -8442, -16129, -59329, -57921, -34591, -72411, -56080, 12771, 18184, -13004, -51443, -63746, -69143, -73594, -45626, -43980, -85015, -98643, -53494, -10293, -47106, -50991, -28287, -15514, 12197, 9236]
16005I236J8624k7212k4339J3749o874n0289j059R738O588L3901K7199p001l4718
15992c2457K0956K4616n307j3735q100L316n006j1442J6218L4410j7505j3889
15980g925K8726J8647p211j9163L270j0048j2360j1066k9743j7332k8774L263
15968h9716K5266K8360K9929j2404k9576k7511J1042j1278L318j3523m104L0821
15956e9376J6277L1422L753Q029r833R790L4329J2263n6976k8501P727L2025K9519
15943C0448p399k9808p061K3438j5333j1889n877J7456J3065k7568m6570j2437
15931g9535L5407J0461j9354J539O994M915J8039j9629k1985L460k76J7927j1087
15918e3124O946m171j6464M0952L4566J7851K7252k9102j2379r956j7328k949
$$ y = [9236, 27860, 648, -23691, -9942, -16816, -67105, -68164, -58426, -51838, -17937, 9262, 2261, -32457, -11501, 13115, 7808, -5927, -14027, -10711, -15717, -27159, -10941, 23469, 5964, -7925, 20801, 39448, 32237, 13074, 16344, 6296, -6064, -17130, -46873, -64205, -92979, -89716, -64450, -36090, -6161, -18565, -48141, -75652, -64610, -75888, -72570, -86093, -90197, -59376, -43099, -11677, -7924, 105, -9728, 62, 34391, 46654, -10322, -38823, -31096, 929, 30448, 23049, -6759, -13820, 9618, -5715, -17604, -23481, -6025, 7040, -20528, -67098, -79535, -44128, -33667, -53021, -51482, -44488, -39573, -21534, -41163, -63148, -59688, -59964, -42037, -53124, -46178, -50349, -66813, -25861, 8705, 26556, 53808, 24706, 12327, 2371, -14957, -17906]
15906a7906M169j508n9741k538j1174l2577J9425M2354p790Q236q465j110k0750
15893h9375o295K0321M4620P985j6870k4799j3979J7587N4432J6733k5805j1720
15881b7165l618N639L6800q007j5539j0319r636J6799J7876J0514L4713K2684
15869G0741l8323m1018k6811j0333l327j298J3610M0122M7324K3347k0135k5997
15857B7902k3715j933k1758l474j823M999n6995k080N6759J6040j2126R687J5081
15844F564k5383J8830j8032l16n572J638k0263M083K8154J0977K1378J9373k4323
15831A7108k2980j0568l1464O035K648J6495N5583j8757k7627K2789K8687j0556
15819B7393k8643J1616q049k1522K209J2742q614k4828K256J9960j328l9669l2334
$$ y = [-17906, -13737, -15245, -74986, -77524, -88698, -121275, -101850, -59496, -67286, -59050, -67515, -68625, -89375, -95670, -75349, -30729, -22744, -39614, -64413, -78392, -60805, -6373, 10360, -15445, -27165, -30783, -25144, 11656, 3649, -11890, -22209, -31845, -15046, 2830, 13344, 48057, 70741, 32418, -8600, -35411, -45744, -49071, -50369, -36759, 3363, 50687, 74034, 53899, 27902, 4187, 2254, -19504, -22978, -24801, -19802, -76797, -78877, -22118, -6078, -18204, -8517, 6564, -18819, 11, -18021, -18337, -23909, -22271, -42534, -38451, -10297, 680, 22058, 41431, 17108, -5872, -16440, -47904, -41869, -39221, -22726, 32857, 14100, -13527, 9262, 37949, 27393, -1250, 10366, 2317, -19205, -16996, -4254, -12868, -37696, -35440, -15480, -16808, -56477, -88811]
15806h8811L581K5928M9572L9074j2983l6570j1436L853k2406L545K2183P837
15794a6633k530p917R092j9923O383j1178M36j1804P338r586j7849J6669M5312
15781a2190M5721n8854m7481L1665J4112J3231k3784j3499k1406L26K6851J8596
15769b6712J4355K2181J4374l7786o753P242K5545J083j3674m7465j1754K806
15757e6558P048M525P973P474L8289P451K0598q473M3766j0671k1622J5488L056
15744E8344l8209l3702R859j2663q477K7064j6873L3194J8607O257k577r701O068
15731C7191l7673m5572J3223k348K2721J6411r082k6975n890j3008L0565k5632
15719d6069P66j1112k4798P0447J2893m9576k3750k2780n80K5433M7478j2359
$$ y = [-88811, -85230, -59302, -9730, 29344, 16361, -20209, -31645, -27792, -50198, -46653, -24470, -16633, -19163, -27080, -17988, -37911, -31528, -42706, -42270, -54074, -46736, -56322, -74171, -57502, -12190, 33531, -25323, -72804, -41139, -27027, -13796, -37580, -51079, -72485, -72159, -45308, -26712, -12357, 9824, 24198, -13588, -20341, -13099, 12446, 13529, -145, -47610, -59364, -56558, -49510, -44985, -37012, -29538, 8751, 16202, 36800, 28327, 72093, 61422, 39800, 55288, 58344, 20135, -13567, -3708, -16371, -24848, 2216, -14657, 18537, 37144, 43401, 40824, 31123, 37191, -482, -46054, -32831, -35179, -12458, 3953, -5129, -32104, -37994, -51002, -20437, -46069, -45303, -56415, -81213, -10766, 2127, -47449, -71199, -93979, -94559, -69126, -21648, -34007]
15707c4007J2490Q92m9860n810L2082m7144k975M4572O7366M1150k1508l2336
15695D912J2821l623o301J6455J029l466R703m3922n4251K8218K2201m875j5073
15682c6172N498m479o325o784J2641j2844J5675j2267J7314n318l9035L5731K0434
15669a5931m075J0341j5964Q236J1043L4554J4852p653k3759J8224n868l8546
15657a4546J776O563M98J9634l449J9384l155m232J439J0726l3086l1855K0038
15644a0265k3509j9251Q47J2801L4741P775l5013m1515j4136N063L2669K7661
15632b2132K0373l5427n9834L5109Q2543N25k3165n809k3595K70M664K9569K402
15619E493J1440o180l751k3591J4862L1085L5124P380k8421R617j6685k5830j5337
$$ y = [-34007, -21517, -20625, -70485, -76295, -44213, -91357, -94332, -49760, 17606, 58756, 37248, 4912, 17733, 14110, 7809, 24264, 25293, 21827, 31530, -12392, -66643, -38425, -16224, -21099, -36172, -30674, -35153, -41478, -48262, -35621, -48465, -32790, -45057, -27743, -33061, -72096, -36365, -15931, -20006, -9665, -25629, -17393, -6350, 28204, 43056, 35403, 11644, 29868, 24000, -14546, -12770, -6207, -5709, 13925, 10476, 29860, 26705, 22473, 23912, 34638, 1552, -30303, -10265, -33774, -53025, -52178, -39377, -4636, 3139, -31874, -73389, -87525, -82462, -49793, -22132, -1759, -37186, -97020, -61911, 20632, 21157, -2008, -7817, -31412, -31142, -26478, 3091, 5493, 16933, 10753, 7002, -16589, -1727, 29358, 64482, 71862, 43441, 53058, 36373, 10543, -4794]
15606d794k677J9854k1424j7835R156k717k5558m417K8991J6158J0297o64j9246
15593a4876k1720l2178P613L7878J4555Q938k3377l7470p226K1614N911k5527
15581f5865k8506O092j0378K6048j8457l1905K783K4809n223J6405J2345K1679
15569e0173M184K9300K0631j7662j3774K6732K0020M8546R566j7888j6075k3512
15557A9895j3833K3976L581o336m0101m3255K749L1173L0017M5015j5086m8493
15545a0698J0421L882L387P420k796J2593J1569j8088J2961j6687l8771k3474
15533d8281m7738J917K5161M4234K5102k3741l025k9086j9939K6267L017K0813
15521b5299K3994K677J531R521o825k3666J4836m261p451k9362K5081L4005L319
$$ y = [-4794, -7471, 12383, -9041, -26876, -17720, -20437, -45995, -50412, -21421, -5263, 5034, 4370, -14876, -36596, -68774, -61161, -23283, -8728, 210, -23167, -60637, -67863, -46249, -40338, -65865, -94371, -88279, -98657, -72609, -91066, -122971, -120188, -95379, -100602, -84197, -71852, -50173, -45989, -16689, 3942, -13720, -27494, -762, 19258, 67804, 77370, 59482, 43407, 19895, 6062, 30038, 33619, 27283, -12818, -56073, -53324, -22151, 7866, 52881, 37795, -10698, -277, 3605, 6992, 14412, 11616, 24209, 35778, 17690, 30651, 13964, -24807, -48281, -96019, -94102, -68941, -24707, 395, -23346, -26371, -55457, -75396, -49129, -46112, -25299, -1305, 1372, 2903, 12424, 5599, -18067, -3231, -7492, -14943, -44305, -19224, 14781, 18100]
15508A8100r883K086J9816k8224j5749L4012K3203j796N57r978j0725p246j2908
15495A265K1555j8287l1074k2161N782l010k7147P623J8805K5509K2412J7952
15483A9224o181L660o3156k0013K6167N8412j5847l6524l1617O130K100j7771
15471g5416r466k4323Q310J7151M2252J6801j2295q491L2636J8787J2531k6537
15459h060m1177J5838N8035L881m2214r237K62J2382J1618k4529m528n437K857
15446c0309M308L1356l3550k2985J9942J9796j6899l681J9392n854m0145J5643
15434d2986J4902J9990R629k2198l5785J5785K9658n694l9879j6701L7201k595
15422c8673j1496J1907P701K666K2544P69N665K2710M1378K7146K1575j7015n0316
$$ y = [18100, 8217, 10303, 30119, 1895, -13854, 20158, 43361, 41565, 42122, 32144, 21419, 14173, 1265, 22820, 4533, -26541, -48702, -42920, -45930, -73077, -65454, -46649, -21140, 1272, 19224, 13043, 16703, -46453, -66466, -40299, 18113, 2266, -34258, -65875, -59745, -57645, -75416, -84882, -109205, -100895, -83744, -41492, -24691, -36986, -45477, -12841, 5946, 18477, -8060, -49237, -33399, 24636, 28517, -13697, -22934, -22672, -10290, 1328, -23201, -27729, -33166, -30309, -26001, 5355, -28195, -51180, -31238, -11442, -28341, -32022, -12630, -18484, -58629, -42986, -28084, -8094, 1535, -20663, -56448, -40663, -11005, -16699, -56578, -73279, -36078, -38673, -50169, -38262, -30561, -27895, -5351, -4582, 1083, 23793, 65171, 92317, 113892, 96877, 46561]
15409D6561n7586j8765j464J5640J8117L4195J4516m511M107K191j02j5120l0143
15396G636k3517j9424n881K1415j2540q335n947L4427M8263m4521l5059m6664
15384i0147Q351O6074L7204K4076j5210j4138m3941P081K5299O08J6868K0953
15372D3078j9576n1745k0960J6234k5455L9772M2654K2148P551Q285n5418j7766
15360a1198L1908J3981n658J4005R56r066j9182Q108n4392l7711l097L0278J9544
15347b1524k8251J4034N2538p195k0850p212K2369K0405j3946l9953R091k6518
15335d7012o980O0040K3733j1418k7548K030M082m1558n710M1583K4619p254O710
15322A5317l0944l8942J222O522M1507J9931j1193l201k4082m036N12j5284J8057
$$ y = [46561, -11025, -29790, -31254, -15614, 2503, 36698, 51214, 46703, 50810, 53001, 52899, 37779, 7636, -15881, -35305, -41186, -19771, -32311, -40646, -46593, -12166, 36097, -8424, -43483, -90147, -81796, -15722, 21482, 45558, 30348, 16210, -27731, -20650, 4649, 5257, 22125, 43078, 23502, -28243, -49203, -32969, -58424, -18652, 24002, 46150, 53701, 61986, 6568, -11198, 20710, 34691, 29033, 43038, 43994, 34928, 15746, 23854, -30538, -68249, -71346, -41068, -21524, -49775, -35741, 16797, 9602, -11248, -18460, 3909, 24314, 10368, -29585, -20494, -47012, -53992, 6048, 29781, 18363, -9185, -7155, -3073, -44631, -50341, -8758, 15861, 8607, 15317, -15627, -54569, -53347, -46825, -5318, 14613, 3420, 219, -23863, -27899, -27387, -42671, -24614]
15309b4614K6691q945K1707J7200k5836o180R598j449k8198K5204K9871J2760
15297D7809k7063j7313L1834K1515m6266k1564Q013j4594j471Q180J5786J8453
15285B3319n0612l0254J9473J9446K5736L8203j6798n4758j0922J6494J506l7313
15273e6480J3581K1136J6319l574N177k9043k994M4057J1179N931k8311k3530
15261b6552K1182Q675l9676m474P472J4244K4080q62j3369j8142K5939J3413j6916
15248d986j4417Q829k3206J6642Q652j2264j1061j2141M5097J7924l3390m1586
15236e5907J1328J608j2732J2280j6914j5478j6448J8611N5559N231J6980K8395
15224C2513r833k7024N668r505k4482j1468k815J771K680J2332L0232J9609M412
$$ y = [-24614, 2077, -6868, 14839, 32039, 6203, 23, 9621, 8172, -20026, 5178, 35049, 47809, 20746, 3433, 35267, 56782, 10516, -11048, -3035, -17629, -19100, -10920, 4866, 23319, -27293, -57547, -38074, -18628, 7108, 45311, 28513, -26245, -37167, -20673, -19167, -56480, -42899, -21763, -5444, -9018, -3841, -32884, -35878, 8179, 19358, 25289, -3022, -26552, -5370, 3305, -36371, -40845, -33373, -19129, 4951, 4089, -9280, -27422, -1483, 11930, -4986, -19403, -10574, -33780, -17138, -8486, -20750, -31811, -43952, 1145, 19069, -14321, -55907, -44579, -42971, -55703, -43423, -60337, -75815, -92263, -73652, -18093, -12862, 4118, 32513, 22680, -4344, 1324, -8181, -32663, -44131, -46946, -45175, -42495, -30163, 69, 19678, 24090]
15211B4090n883j7878j9531K0184J5069l7301J3930J5356n1902n2222L1880K6194
15199c8014M0337J5754k8367m4507M2112L3896N84K334L0932K3300J3608r394
15187H2575j9315j8975J7487J865n9438m284j2206M5849J3889j9489m1983j5127
15175b9152j2509j4973m771K0167N4J3869K3603n026m034k128M8q358j7661k283
15161d3154L944J3524k0091j0688L7347M7155o571l842r190m02j4980l0365j2766
15148e0079M4764L9602p559k6043n9125r086q976J2351j6008O606J2620L566P805
15135d9562J8180N409N500j6572p187j0689N4167J2788k6400L164L4060k8744
15123e886l9572j0222K1722L6305K4755n308K088r465J5915m5087r065K4798K304
$$ y = [24090, 18207, 329, -19202, 982, 16051, -21250, -7320, 8036, -43866, -96088, -64208, -38014, 2323, 18077, -10290, -54797, -12685, 21211, 21795, 24129, 55061, 78361, 91969, 82575, 63260, 44285, 61772, 63637, 4199, -85, -12291, 33558, 47447, 27958, -14025, -29152, -41661, -56634, -61405, -41238, -41184, -27315, -3712, -8738, -12772, -14900, -14852, -23210, -40871, -43154, -39210, -25686, -45777, -56465, -19118, 28037, 21466, 17624, 8434, 8032, -6948, -37313, -50079, -5315, 34287, 26728, 685, -58440, -67526, -76502, -64151, -80159, -73553, -60933, -57367, -49562, -31382, -25973, -20473, -37045, -44232, -54921, -754, 12034, -14366, -11202, 22858, -5886, -45458, -55680, -33958, 2347, 27102, 21794, 23882, 14417, 30332, -14755, -23820, 978, 3282]
15110C282J8283R246L977j5166K9885N5056k2574l8280j7040j6654l029r652k1011
15097b3677Q804J8779p509q14R500q265j6973L5656j4532m3706N617K6802k5848
15084c6166j9599p466m178n389L1672p929P38R260q268m916J0163J7777k6556
15071e0857j4635p868J913N24j9243K1136K0800K2693R12j8895O535j6575K695
15058e0865J2999K3550q18K082j0976m5621l0560K7145K6746P186L6900L7984
15046C5752K0275o1636k8388K5731Q578K2473j3591j8854j0438j9139k8030j0071
15034g7338J0128M135L3972L5004N8236K1476l2024k9456j7705j9382K6051l1236
15022a8139M840K2007k5805J1188J0962k0882m2728m439L1420K8422K3274J1092
$$ y = [3282, 21565, 30811, 34788, 19622, 49507, 104563, 81989, 43709, 26669, 10015, 6986, -2666, -23677, -14873, 3906, -3603, -4417, 5083, -3182, -20155, 15501, 969, -42737, -37120, -10318, -36166, -55765, -63231, -67409, -72798, -41126, -49055, -48317, -39057, -47325, -52241, -42078, -24301, -50857, -65492, -73360, -71447, -70923, -90166, -69030, -48230, -25537, -24625, -43520, -36985, -53560, -50865, -37866, -14316, -15134, -13052, -24028, -69649, -100209, -73064, -46318, -39132, -2232, 35752, 56027, -5609, -33997, -8266, 312, 22785, 9194, -9660, -20098, -39237, -67267, -77338, -67210, -63075, -29103, 5901, 64137, 85613, 53589, 24133, 6428, -12954, 13097, -18139, -13299, 8708, -17097, -5909, 5053, -15829, -58557, -62996, -31576, -3154, 20120, 31212]
15010C1212k9289m457k3672j8848K2434K2774j0560J9508k7711l724j1356R199
14998b4490M0128K0855k0085P370j0263O633O371q906p228n5127k2707p52J9508
14985d8693K9460J395k052j2422p124q535k6498J9257L9340K5648n986j480J1893
14972A4203l0706k1315O701k3234J3088J1253K6680q298J0948J3914K952p312
14960H874r818O233K407L260k5556P407M709N779n1384j9402j0300M7185O3828
14947C3222k05k1335L5327j4550j6332o219k4569K9039K2580m912k0826j7931
14935f711J247J7389L8456P8j9546K657m894m1735k1965Q129M4092j8046o515
14922g364Q784J8390q288l9780k014p351J3755O432j7096k3220M511o314J7723
$$ y = [31212, 1923, -2534, -26206, -45054, -22620, 154, -10406, 9102, -18609, -22333, -33689, -24490, 15638, 36493, 16408, 23778, 13515, 20148, 26519, 17613, 10385, -44742, -67449, -68201, -48693, -19233, -17838, -19890, -32312, -39436, -47971, -74469, -55212, -15872, 9776, 3790, 2310, 14203, -16503, -37818, -31117, -54351, -41263, -30010, -3330, -11628, -680, 13234, 16186, 8874, -944, 5289, 7696, 10956, -14600, -7193, -2484, 3295, -48089, -67491, -77791, -30606, 33222, 33017, 11682, 47009, 32459, 16127, 9908, -14661, 14378, 36958, 32046, 11220, -6711, -5464, 11925, 50381, 50459, 30913, 33570, 28676, -13059, -35024, -26895, 17197, -849, -7364, 1420, 19810, 11522, -28258, -30272, -37623, -23868, -17436, -34532, -57752, -53241, -59555, -41832]
14909d1832L7476j9852L911K9209j3984j8039P153o57K150P94K4295L2615m058
14896C9181m6199k7131m461J9978J1262Q166n903j0213p298J346j502k889l342
14883b9005r722l2183K5487N4228j3971l1094J9500K7422J9018p269M976K6608
14871E3995l400k8442j4259j9493R635L871j6702J3229N7J3977j902k3214l3295
14858d5943p935K1457O3015J0974m8949j3278l87K6497J1051l0813o722R316L325
14845h392P516o240l0525k227m070n9980j6366O4669L3031J0508N1963k7684j6725
14832d522K3041j6448j8406p816M8301J1039p9538J1483J0950q094K543N4183
14820B6716L6008J1245l506P497k769m9410k9771j9478J0942K6628J1625l2851
$$ y = [-41832, -4356, -24208, -20297, 8912, -5072, -23111, -15958, -16615, -14465, -13671, 10624, 43239, 39181, -7018, -34149, -38610, -18632, -7370, 796, -5107, -15320, -22618, -21272, -22774, -25663, -29005, -38727, -70910, -45423, 8805, -5166, -36260, -16760, 10662, 29680, 22411, 27387, 53995, 50595, 22153, 7894, -11599, -1964, 1907, -14795, -1566, -1509, 12468, 10566, -12648, -45943, -53878, -32421, 30594, 41568, -7381, -20659, -21046, 5451, 16502, -14311, -21033, -11717, -8392, -876, -7116, -37641, -39868, -43938, -103918, -120284, -55615, -22584, -12076, 39887, 12203, -4522, 18519, 2071, -16335, -24151, 24150, 35189, -44349, -32866, -21916, -30010, -27467, 26716, 62724, 73969, 70463, 77960, 75191, 25781, -3990, -23468, -12526, 14102, 25727, -7124]
14808g124m802M2182N443k8821m4123j4592L7430j5628K701J6227K2501j4468
14796c074K2030j4443j7604k5500J0437J075K600k4014j3313j2864k729j2399
14784h9798l694L3835K3011J7481j3978J5682n724j938L56J9947k364M366P325
14771D507o350N781p67p801k9026K489M173L694K0530k0752l541q288K5783J6504
14757F936Q238k3672J5741N864k8098n324k177L8000l750j8789l0512l0696J6076
14744e2163K492r080o275J4388M9289Q091J9490m724k6819k1158j6354J0534Q268
14731b4021J5949L2574l9715j2978K2772p088k7450p635k7882P856j428J0887
14719e8159j8017J1136k692j7726k112L5468L3623j5613k0614K8272K3397j5302
$$ y = [-7124, -11926, 30256, 35699, 6878, -37245, -51837, -14407, -30035, -27334, -11107, 11394, -3074, 18956, 4513, -13091, -38591, -28154, -27079, -24479, -48493, -61806, -74670, -77399, -89798, -93492, -59657, -36646, -19165, -33143, -17461, -23185, -25123, -24767, -4820, -7184, -2818, 4507, -1843, 3938, 3171, -4630, -33656, -31167, -26994, -23300, -2770, -23522, -27063, -35351, -9568, 6936, 15174, -8498, 7243, 13107, -14991, -20315, -22492, 15508, 11758, -7031, -37543, -68239, -52163, -49671, -58751, -65026, -50638, -1349, 6742, 26232, 21508, -5311, -26469, -42823, -32289, -24021, -8072, 24502, -15213, -28191, -5419, -12507, -39957, -47592, -75474, -67618, -69046, -58159, -76176, -65040, -67732, -85458, -87570, -52102, -18479, -34092, -54706, -26434, -3037, -18339]
14707a8339L86j6429l62K2321Q169j663K033j8394l4921o625L0678K8338L8714
14694C3906j1909l1786m4057l3622J6985J9398K1k4775K789K3159L20k3991J2646
14681f0916K5566K2553K4073k13P522p739l0993L468j4070Q640J223J9954k875
14668c807p337j6882k544R601p898l051K6242J2532J7083l0144O172L1425J831
14655C3223n059m556j572l5740k7466J267k1473j1039P816M2450J614R04L7852
14642A8221P74p906J0672k8561j9432k0896J5745N929K4173k0815m0593l4673
14630i7362J8317J0457M07K6653K6228M142N133L8752j873p333J0647m839r897
14617A9432k2873j5166J1264k2221j8003J1443l224M768n371k9341O457J9611
$$ y = [-18339, -17953, -34382, -34744, -12423, -4254, -5917, -3884, -22278, -57199, -63824, -33146, -4808, 33906, 21997, -9789, -53846, -87468, -70483, -51085, -51064, -75839, -73050, -49891, -49571, -73562, -60916, -35350, -12797, 11276, 11063, 18585, 10846, -20147, -16679, -30749, -22109, -20886, -932, -3807, -11144, -28026, -30570, -20969, -28867, -31918, -5676, 6856, 23939, -6205, -33, 31392, 33223, 28164, 23608, 22036, -13704, -41170, -39903, -61376, -72415, -64599, -22149, -20535, -19631, 18221, 18995, 11089, 21761, -6800, -26232, -47128, -31383, -25454, -1281, -22096, -62689, -97362, -79045, -68588, -68181, -41528, -15300, -11158, -6025, 32727, 30854, 23521, 34168, 29329, 19432, -3441, -18607, -7343, -29564, -47567, -36124, -39348, -34580, -39951, -69292, -62835, -43224]
14605d3224l873J5018J5415J5515m727p371o25j0033O455k7950J7138N536J0113
14592a2613k4232J2666n869J7000P384l467O106k739J9316r066l633O678K9907
14579C7438K9648j3829o970K5328k393J368O366p3433m1538L886l1954o9301L5556
14566i9828J03557K9123l2247l827n887l7744K4179R401K2873Q788j0983j3885
14554f480j970j1920J3227k4225L688O580k621l0564n491J4918l6893j2774J455
14541i3070P251k8445J6454L9609J0408R801j440l7397J9721M1531J0187L2943
14529B7553K8556J9074k7604n6739o518Q108L0193j5030l8984k2440K6727J6227
14517a0877q002o8544j9896M2777J31j5891J7117K2943J0999J1036l5974K173
$$ y = [-43224, -47097, -32079, -16664, -1149, -5876, -13247, -13872, -23905, -17450, -45400, -28262, -22726, -12613, -36845, -24179, -30048, -13048, -5664, -9131, -3025, -5764, 13552, 4486, 853, 7531, 37438, 67086, 53257, 46287, 71615, 69222, 70590, 76956, 3523, -38015, -34129, -66083, -135384, -99828, 3729, 32852, 605, -3222, -9109, -46853, -22674, -13273, 9600, 18388, 7405, -6480, -8450, -20370, -7143, -31368, -27680, -21100, -23721, -54285, -59776, -44858, -81751, -94525, -93070, -85819, -114264, -97810, -58201, -47793, -37992, -39432, -76829, -57108, -15577, -5390, 27553, 56109, 75183, 47579, -9160, -15678, -7570, 22623, 7593, -31391, -53831, -27104, -10877, -18879, -87423, -107319, -64542, -64411, -80302, -63185, -40242, -29243, -18207, -54181, -52008]
14505e2008K7148L5551j7442R736L290o2074n417L4106m752k5722N7903k622L971
14492A668k1576R731M5773N116l823p153j4298k902J8206l3320l8373J7135L4844
14479A1028K8373k954j6993j0285R117j9344k300j5261l4584N889q804L662J4444
14466c8012M5446Q495K158k5848j8252L0914J0229l3401j8885J2566L0178J6918
14454B2506m7974n248N2725j9860j870J0956l940J507K6752R850j9326Q264j9287
14441A5055l3712k4316j3770Q650J5382n744L3492L8252o4595m4436K0926j2036
14429f6852j002p573J0434M9181M33j278O947m847l6148j5023M168K2439J9491
14416a9630P111P638m3807N562M3595J9914l1168k6552M225L8384J3639j2524
$$ y = [-52008, -24860, 10691, -6751, 2985, 6275, -55799, -61216, -27110, -31862, -57584, 319, -2303, 1668, -19908, -10177, 35596, 40712, 36889, 29736, 15438, 12536, 30742, -2578, -40951, -23816, 11028, 39401, 36447, 19454, 9169, 18286, -1058, -3358, -18619, -53203, -47314, -56118, -52456, -38012, 7434, 15929, 18087, -7761, -26013, 4901, 15130, -18271, -37156, -24590, 5588, 22506, -25468, -30716, 22009, 2149, 279, 11235, 7295, 8802, 35554, 45404, 26078, 34342, 15055, -18657, -42973, -56743, -48093, -32711, -38455, -4963, 33289, -31306, -75742, -54816, -66852, -67854, -75427, -64993, -15812, -15379, -16657, -9710, -14557, -50705, -65728, -61560, -39121, -19630, -12519, -4881, -48688, -43126, 469, 20383, -10785, -37337, -33112, 5272, 18911, 6387]
14404F387m4719n0807J4772M1202p504k1291K4863k0916K489J3241m010j7422
14392f3715J2557J9889J4282K0165J1407L169j9965m827j8397L445J6776l1005
14380c6219O384K8108p715p494k8560O487K4305K6469k8589n5163p002M3515L3048
14367b426k8140o195M3444J7632j4401l7746m1786k5406L278L1669O4578l7773
14355c3272l1237L2690K2644j9877p309N0950O293k2760m7409r205J3993l205
14343d7704l1506n00J4545J1621M0488K0603l2074k2246n123J6741J523l159M158
14330c2633q294k1301L6682L1839L42j2237l689k884n529O493J9666k3693q894
14317b4132j3528p784L1510L3503J3860k371L373J8553j8473m2523J6966K9319
$$ y = [6387, -38332, -89139, -74367, -33165, -40669, -61960, -37097, -58013, -55524, -42283, -46293, -63715, -51158, -31269, -16987, 3178, 14585, 17754, -2211, -7038, -25435, -21990, -5214, -36219, -29835, -1727, -9442, -16936, -45496, -39009, -14704, 11765, -16824, -71987, -78989, -35474, -2426, -30566, -36761, 6683, 24315, 9914, -27832, -69618, -95024, -91746, -60077, 4501, -33272, -64509, -31819, -9175, -29052, -36361, 14589, 20882, -1878, -49287, -58492, -44499, -47704, -79210, -79710, -65165, -53544, -13056, 7547, -24527, -46773, -51896, -35155, -33632, -36791, -32633, -40927, -62228, -25546, 6293, 6635, -5602, -9291, -12175, -17704, -11211, 8455, -15238, -24132, -37660, -45444, -13934, 19569, 33429, 31058, 34431, 52984, 34511, -8012, 8954, 38273]
14305C8273O891k2383O008k1633k9761J3991q578p883L449L5567N194k0939m8670
14292e0474n837K799L091J5283M696K7127L3526J0641l7588k5459K3986K0683
14280B2474o470j4147J9481p701K1767J0725j0981J6274j5605J024K7764l4080
14268C0525k8945j0151k7380K2010j8158K5800K4208P191J98k5443j822M3330
14256D1363M4888j770q894l295M6214L4170k2906J7004n244n1K8610P9579P2713
14243C22381O5701O4760R9069J52327J89185K08397K59530K32247J81179Q6432
14233A861208J2056m1954j22807j79882k27071k77591k31855j52773q2613q4024
14223D72694m1847n9066l0543j5810j6058n0106k0644l1744l515q3362l4109M7539
$$ y = [38273, 45164, 22781, 28789, 7156, -22605, -8614, -17192, -25075, -21626, 13941, 19135, -1804, -50474, -56311, -53512, -50421, -35138, -30442, -3315, 30211, 40852, 3264, -22195, 1791, 22474, 16004, 1857, 21338, 13637, 35404, 46129, 35148, 51422, 35817, 36841, 64605, 30525, 1580, -8571, -35951, -13941, -32099, -6299, 17909, 25100, 25298, -145, -1967, 41363, 86251, 84481, 75587, 72292, 118506, 152676, 129770, 146774, 141530, 141479, 170089, 249668, 322381, 388082, 452842, 551911, 704238, 893423, 1101820, 1361350, 1593597, 1774776, 1861208, 1873264, 1831310, 1708503, 1528621, 1301550, 1023959, 792104, 639331, 556718, 472694, 430847, 371781, 341238, 325428, 309370, 259264, 238620, 206876, 203361, 119999, 85890, 133429]
14211A33429K2679k3725o6175J95K8305J7297l371j5121K420m28m6910m2997K1795
14198B7393m41J5728k3152K3195Q543L00R230K6815j4701P907j8401m0959l4919
14185a3462N8855K9184r845k4802j0842j681J3648j255j8449l9674J9052K7226
14173B7955J1710j3097j0582J5670m773j4735P724J5581j3416n737K8034N821
14161E0155J4239m1049k1564J063k1289J029j1354k4770J7161K8905r533J7271
14149B64M853j9153l5142k822J6267R49q942q14K3225K6765k110R016k999N344
14135A4701Q118k5087L3707p839k5621j4070k2311l986J3235M3512K570K924j1586
14122H267k5859L540m380K7820L412k2564L1101R099k2155J220l630R115M4474
$$ y = [133429, 156108, 132383, 66208, 66403, 94708, 112005, 108634, 93513, 95933, 95505, 48595, 5598, 27393, 26952, 42680, 19528, 42723, 51266, 51566, 60796, 87611, 72910, 80817, 62416, 21457, -13462, 45393, 74577, 64732, 39930, 29088, 27407, 41055, 39800, 21351, -18323, 729, 27955, 39665, 26568, 15986, 31656, 26883, 12148, 19872, 35453, 22037, 16300, 44334, 50155, 64394, 23345, 1781, 2844, -18445, -17416, -28770, -53540, -36379, -7474, -17007, 264, 5117, -14036, -49178, -52000, -35733, -34784, -43726, -44540, -21315, 5450, 3340, 12356, 9357, 14701, 22819, -2268, 31439, 23600, -2021, -16091, -38402, -42388, -29153, 14359, 16929, 19853, 8267, -17592, -14052, -18432, 9388, 12800, -9764, 21337, 30436, 8281, 9501, 5871, 14986, 59460]
14109E9460J8333O671j0275l1417k4719m815j8683L0427J1743J163M1350M2855
14097A22093J2208N6999K9252Q943O697P124p432l9811j4290r550j9869k5495
14085A26869m3643k9452k3422M227M9942p024n0583k7872Q226R4P39j354K5209
14072C1956R392J2968J5231O76P033r487k7045J0642K4522L6437j8316K5099m030
14059A15078j0943J5202J4025J4982j8136m478j739L3315L2592l4262n9505J7388
14047A13519J8058L6441J1057j8202k0194j9067k8371j5899q002j0002K1050M3118
14035A23506N1799n050m0102m3408j8630K7043L9973j0969k6068j828L8316L484
14023A38066o601j3135o568J1473k0006r823J1997l099N98M798N655j0831j8494
$$ y = [59460, 77793, 84464, 74189, 42772, 18053, 13238, -5445, 24982, 36725, 37888, 79238, 122093, 134301, 191300, 220552, 229495, 236192, 243316, 235884, 196073, 181783, 172233, 152364, 126869, 83226, 53774, 30352, 34579, 84521, 77497, 26914, -958, 7268, 7362, 8101, 6747, 31956, 41348, 54316, 69547, 70223, 77256, 67769, 40724, 51366, 75888, 112325, 94009, 119108, 115078, 104135, 119337, 133362, 148344, 130208, 125730, 123991, 157306, 189898, 155636, 96131, 113519, 131577, 168018, 179075, 160873, 140679, 121612, 93241, 77342, 69340, 59338, 80388, 123506, 175305, 170255, 130153, 86745, 68115, 95158, 135131, 124162, 98094, 96266, 134582, 138066, 131465, 118330, 111762, 123235, 103229, 93406, 105403, 102304, 102902, 107700, 113355, 102524, 84030]
14010H4030j0333K5083n880l1364l5619K1693K4844K1205j8229j4705J589n8891
13998C423l708P997P884L633M889k3683k647M3885K3351o565L2908M9433j3047
13985A27753m4906j6049L2856N0183L8728L6198L6389P304l1779K4021P096m4465
13973B23329o4063o8211J759L596n366m0030j2229o1k3266l693j857K9354J9298
13960E8560m764l082M7117j7829n3069j8362O0674M5786q172K029m4100k1997
13948D2791K8325j2936j6064M17L6185J7323l6015Q054Q1923N3412P398j830M999
13935B13982k5145k0717J9438o277j087j3356J7748J3344L7757O8171K9938N1387
13923C85183J9282L7517N8536N0221L1609j3161p42k7477k1657k2508l1151j04596
$$ y = [84030, 73697, 98780, 92900, 61536, 25917, 47610, 72454, 93659, 75430, 60725, 62314, 3423, -285, 7712, 15596, 19229, 24118, 435, -2212, 41673, 65024, 58459, 91367, 140800, 127753, 82847, 66798, 99654, 149837, 188565, 224763, 261152, 268456, 236677, 260698, 267794, 223329, 159266, 91055, 92814, 96410, 91044, 51014, 38785, 38724, 15458, 11765, 9908, 39262, 58560, 53796, 50714, 97831, 80002, 26933, 8571, 69245, 115031, 106859, 108888, 64788, 42791, 71116, 58180, 42116, 42533, 78718, 96041, 60026, 68080, 150003, 203415, 210813, 208983, 213982, 188837, 168120, 187558, 181281, 180194, 166838, 184586, 197930, 235687, 303858, 333796, 385183, 404465, 441982, 500518, 550739, 582348, 569187, 568445, 540968, 519311, 496803, 465652, 361056]
13911C61056j20892j22299q2184l4609k8471l3632j1100K272J6135L0867K3740
13900H83O538r577j5073j9327l8658M1741P0522L4336L7781K3535J5468L9808
13888A87977l565q6734J0078N5966L8101L0989j7269p055K6799K8019j8754j8765
13876B25787M4095L7421L0118K7695L1515N750m4490l7484L3728J3489L6017m358
13864C99283J9405n206J0773J1013Q2036M3613J9264N5118L4546l5580l8014L3194
13852F29445J0936j0963j6473L0393J1545K0353O8394N9401L6947O2523O0732
13841I63233Q7274J01002O9706O3369Q6529N8841M9152Q4961J04841N4472M1620
13830A765000M5776Q4691J04376J24128J15607J21917J22993J66949J95119J80027
$$ y = [361056, 240164, 117865, 35681, 1072, -27399, -61031, -72131, -69859, -53724, -22857, 883, 7421, -2156, -17229, -36556, -75214, -33473, 37049, 71385, 109166, 132701, 148169, 187977, 184412, 97678, 107756, 163722, 201823, 232812, 215543, 208488, 235287, 263306, 244552, 225787, 269882, 307303, 337421, 365116, 396631, 402381, 357891, 320407, 354135, 367624, 403641, 399283, 418688, 413482, 424255, 435268, 517304, 560917, 580181, 635299, 669845, 634265, 596251, 629445, 640381, 629418, 612945, 643338, 654883, 675236, 743630, 803031, 839978, 902501, 963233, 1050507, 1151509, 1221215, 1284584, 1371113, 1429954, 1479106, 1564067, 1668908, 1723380, 1765000, 1810776, 1895467, 1999843, 2123971, 2239578, 2361495, 2484488, 2651437, 2846556, 3026583]
13820C026583K22732K21948K62056K95737L60587M11800M59174N60439O01548
13811F422604O76407P82051R41749J058922J300276J652791K043949K408454K824401
13802B0111604L220400L761628M286113N077545O311598Q359677J1648739J6849656
13794G9626960K4461176L4055321M3191586M9814631N4752124N6641001M9787437
13787C92330236L1062885K772284k8964226n4680336o6273046o3103804n1109543
13780A62034450l7158873k5569600j7540219j2250339q860101o668923n429945
13773D8556450m836213m599030m407165m158282l761038l287321k795829k353249
13765A8358323j921794j663431j438612j229418j095200r48108q58208p28542
$$ y = [3026583, 3249315, 3471263, 3733319, 4029056, 4389643, 4801443, 5260617, 5821056, 6422604, 7099011, 7881062, 8822811, 9881733, 11182009, 12834800, 14878749, 17287203, 20111604, 23332004, 27093632, 31379745, 36457290, 42768888, 51128565, 62777304, 79626960, 104088136, 138143457, 181335043, 231149674, 285901798, 342542799, 392330236, 423393121, 426165405, 397201179, 342520843, 276247797, 213143993, 162034450, 124875577, 99305977, 81765758, 69515419, 60655318, 53986395, 48556450, 43720237, 39121207, 34714042, 30555760, 26794722, 23507401, 20711572, 18358323, 16436529, 14773098, 13334486, 12105068, 11009868, 10061760, 9203552, 8475010]
13757H475010o31702n55001n02934m48243m52894l71591k82792k45891k58622
13748D725340k56965k76541k28569j83267j90056j92243j67710j49562j20933
13739B959494q3184o1421k366o3596j34578j15365q4011r4474j16318q1955m9271
13728B072955n2807q6268j22257r0170m7335l8075r3097p3308m5734l7059j0993
13717A375852l0806m7945n1197l4125k8923m2333m0735m2251Q307P4n870j2762
13705A047286j6329J2129N2008l6571o6159k1217n985j9249p9028m8143K3454
13694H42196j1930k9163k4045l8821j9736k480L7318k0126l8989l5960k867L4606
13682F90003L9636j2660Q368J4218n1509J7883L6497O814p479r782o247K7081
$$ y = [8475010, 7843308, 7288307, 6785373, 6337130, 5884236, 5512645, 5229853, 4983962, 4725340, 4468375, 4191834, 3963265, 3779998, 3589942, 3397699, 3229989, 3080427, 2959494, 2876310, 2814889, 2812523, 2748927, 2614349, 2498984, 2414973, 2320499, 2204181, 2122226, 2072955, 2020148, 1933880, 1811623, 1721453, 1674118, 1636043, 1542946, 1469638, 1423904, 1386845, 1375852, 1345046, 1297101, 1245904, 1211779, 1182856, 1140523, 1099788, 1057537, 1065844, 1065918, 1060048, 1047286, 1030957, 1043086, 1095094, 1058523, 992364, 971147, 965162, 945913, 866885, 818742, 842196, 830266, 801103, 777058, 738237, 718501, 716021, 753339, 733213, 694224, 658264, 655397, 690003, 729639, 716979, 725347, 739565, 688056, 705939, 742436, 749250, 741771, 731989, 725742, 752823]
13670G52823N4727M2858J1510r288J1357J3913J8935l9401o1165n3391p0647o5365
13658F06866l7616m8930p7957r0245o4126J3331K5401l6342J2180J7508J9685
13647C39755K3422k050Q104K3916L0194R088l1238n3494m8004j7329k0200J7106
13635B79270O684J7131j3981O3715M9634J285l1391n6588r169L06l22n996J653
13622C02231k6545R454K7618M335P266k6440j1657j7780j0499j4692J0846L5869
13610B90006O998M6563n1007m635j7188k7413J5868k9561l3276m1017j372n7723
13598I6243p5603l431J26L68N568K8855O4002K0916J4553L1876J1203M6022j3777
13585B26921l7638K1727k2353q158P479j1836K3285N1812J339l4506j4659j143
$$ y = [752823, 807550, 850408, 861918, 852630, 863987, 877900, 896835, 857434, 796269, 742878, 672231, 606866, 569250, 520320, 442363, 352118, 287992, 301323, 326724, 290382, 302562, 320070, 339755, 363177, 361127, 369231, 393147, 423341, 432429, 401191, 347697, 299693, 282364, 262164, 279270, 285954, 303085, 289104, 352819, 402453, 403738, 372347, 315759, 306590, 306896, 306574, 300578, 302231, 275686, 285140, 312758, 317093, 324359, 297919, 286262, 268482, 257983, 243291, 254137, 290006, 297004, 343567, 292560, 287925, 270737, 243324, 259192, 229631, 196355, 155338, 153966, 96243, 20640, 17209, 17335, 17703, 23271, 52126, 116128, 137044, 151597, 183473, 194676, 240698, 226921, 189283, 211010, 188657, 180499, 187978, 176142, 199427, 251239, 252578, 218072, 203413, 202270]
13573B02270O250j1475l3362j5680L2374J614j2493l2381p812k254J8443j7590
13561A27904o775J3142K378l2325k4682L1231J4324m698o862k3660K0963m1309
13549F9631l4681N145L8186L3156L1827P905p546L259r862L8281K4614l3974j9577
13536A46364k8475o782L0320K1568l9782j1908N8865K9136m0516k8806P716J16
13524A37816M927j0132J0535j5593p5539l2753L6836L754J7147o051J7045j5998
13512G1994K1243J3709M174j2424N036o032k6660l051K9569J9107j4970p285k746
13499I1664m0197j2803k0149J0953J5476k4309l6763J9071J1607M0301j0627m6620
13487b396k4641M703l4306p6236l8402o032k4680m2255O1558O0492K2641N6072
$$ y = [202270, 208520, 197045, 163683, 148003, 180377, 181991, 169498, 137117, 129305, 127051, 145494, 127904, 121129, 134271, 136649, 104324, 79642, 110873, 125197, 120499, 113637, 89977, 110940, 69631, 34950, 40095, 78281, 111437, 143264, 151169, 143623, 146882, 137020, 175301, 199915, 165941, 146364, 117889, 111107, 141427, 162995, 123213, 111305, 170170, 199306, 158790, 129984, 137700, 137816, 142743, 132611, 143146, 127553, 52014, 19261, 56097, 59851, 76998, 70947, 87992, 71994, 93237, 106946, 111120, 98696, 103732, 97700, 71040, 67989, 97558, 116665, 101695, 94410, 91664, 51467, 38664, 18515, 29468, 44944, 20635, -16128, 2943, 14550, 54851, 44224, -2396, -27037, -22334, -56640, -132876, -171278, -177310, -201990, -244245, -182687, -122195, -99554, -43482]
13475d3482J6537L8277J9603l966p481j1670L1236N111j4932R109M012J5267k2012
13462C5609l6002K3815J3523j4359N528j0083M1330K5803j2928m0928k4455l488
13450C365p80L3772J2674q80j2510l972L4445k918j6098M730K7048L73p560j6568
13436E5121N545l6924p535L5314L5734k5922k2955j6499M942L8286J2550k6686
13424E0971K3656K7890J5352J4384j8569j3953l5765j6539N781m507k1408l1667
13412d374j4109J1705L301k3950j0641J9665K1144L1916M2907J451k084M262j3378
13399F7815j7517n231j2992P90k579J3462M925j6638j1497M0312J9824p408j1329
13386F1937l9329k9890L8274M4392J5201j250k7041l391k6294r829J0446K0423
$$ y = [-43482, -26945, 11332, 30935, 26969, 19488, 7818, 39054, 44165, 29233, 38342, 42354, 57621, 35609, -393, 23422, 36945, 22586, 28114, 18031, 59361, 85164, 72236, 31308, 6853, 3365, 2585, 36357, 49031, 48151, 35641, 31669, 66114, 63196, 47098, 51828, 78876, 79249, 71689, 55121, 60666, 23742, 16207, 51521, 87255, 61333, 38378, 21879, 26821, 65107, 77657, 50971, 74627, 102517, 117869, 132253, 113684, 99731, 63966, 47427, 53208, 48701, 27293, -4374, -18483, -6778, -3477, -27427, -38068, -18403, 2741, 34657, 77564, 79015, 76931, 81193, 67815, 50298, 45067, 32075, 32865, 30286, 43748, 48673, 32035, 20538, 60850, 80674, 73266, 61937, 22608, -7282, 30992, 75384, 90585, 89335, 62294, 58903, 32609, 22780, 33226, 53649]
13374E3649j3177J4823J894J895p100j8999l037N1472O362K306M042J4914m7517
13361F1527k194m2330J1355r17p09j2671O882L9694K3875o593J1120M3779M6451
13348A79269K7378J8671M5344L2531K9077O4697R6054J14633J34836J84070K24223
13337A150783K42517K29519K39540J66759Q4056o1860k07459k60343k87089k66592
13327A029831j67279j79217j27983o4209j5385k4323n0943m3375l9015l2509l7797
13316B47796n5961p223j3290l5144k4803K01j4500J1622J1102p215m0797j3198
13304E8590J2534R560O990k6598k9303j17n94M850l9526J1452O622M942j2693
13291F709k1399K0511K1384k8679q692N089K8537l0035K059j6651R167p284k8890
$$ y = [53649, 40472, 55295, 57189, 59084, 51984, 32985, 29948, 81420, 87782, 90088, 94130, 109044, 61527, 59333, 17003, 28358, 27441, 26732, 14061, 20943, 60637, 84512, 77919, 89039, 132818, 179269, 206647, 225318, 270662, 303193, 332270, 396967, 493021, 607654, 742490, 926560, 1150783, 1393300, 1622819, 1862359, 2029118, 2113174, 2051314, 1843855, 1583512, 1296423, 1029831, 862552, 683335, 555352, 491143, 475758, 451435, 400492, 357117, 318102, 285593, 247796, 191835, 184612, 171322, 136178, 111375, 111576, 97076, 108698, 119800, 112585, 71788, 58590, 71124, 80684, 87674, 61076, 31773, 31656, 31062, 35912, -3614, 7838, 14460, 19402, 6709, -14690, 5821, 27205, -1474, -10166, -5077, 23460, -6575, -4516, -21167, -12000, -19284, -48174]
13278d8174m869L1444L6086O503K0167P881l2563K7427J4020q238p2543m6735
13266f9594J2656M0802L9301l250m877K3213K281k835j0280l9113N280J1702K5793
13253C1079P527N066n086J0773o08n33p206J2930j4090j7784Q467J5262J2108
13240E7905k602K1308m8358K900J5599j3512l5007m4891q248P930L1659N8572
13228D3255j2724j2994q90K588K2288j5379k0622J5620O405p093P477l0267l4757
13215c7093J863N474J890K868J4186P881m547o193J6133J6167M80m977n077J035
13201A0090j1054n79J6726j1425j5703k8675M2266L0094r285l4588K044K0431
13189A0342m992J6484Q289m2626p669P661Q340L3441J7547j3103J5319J4749Q486
$$ y = [-48174, -53043, -21599, 14487, 20990, 41157, 49038, 16475, 43902, 57922, 49684, -22859, -69594, -56938, -16136, 23165, 19915, 15038, 38251, 40532, 37697, 27417, -11696, -6416, 5286, 31079, 38606, 43672, 38586, 49359, 48751, 48218, 41012, 53942, 39852, 22068, 30535, 45797, 57905, 55303, 76611, 28253, 31153, 46752, 33240, -1767, -46658, -54906, -46976, -15317, 43255, 30531, 17537, 16647, 19235, 41523, 26144, 5522, 21142, 27547, 20454, 27931, -2336, -37093, -35230, -29756, -27866, -24998, -10812, -2931, -7478, -13671, 2462, 18629, 19109, 14132, 9055, 10090, -964, -1543, 15183, 3758, -11945, -40620, 1646, 31740, 22455, -12133, -10089, 10342, 5350, 21834, 30123, -12503, -20172, -12511, -4171, 29270, 46817, 33714, 49033, 63782, 72268]
13176G2268L2190j1886j7786j3902J4220L5134o251m6664l1524l452N5488J3315
13164I1150r705l7339J4146K8276K008k9481K5567L5076j9843k4973l454Q647
13152H0075j1350K0451j0857n0814k6030R454J3731N344K0790k762j6559M8034
13140G9507L3477r485k9694j5930l3663o417N387l1453K5508M3560J0324j8203
13128E2918j4385K668L21L7786j3748j6536m6386k2188j4349j8705R677K8376
13116a4551J0262j6052L3042J9361l6186K626J9217j2109j4753R105J441J6621
13104A8024K851n243k991k218P150Q397L918O73k9707j7878M769K1053K1911l667
13090B7042j9504k5260J5881j90j6844o540r682J766M7082k1517j3439O307L3172
$$ y = [72268, 104458, 92572, 74786, 60884, 75104, 110238, 103987, 57323, 25799, 22347, 77835, 91150, 81445, 44106, 58252, 86528, 88536, 59055, 84622, 119698, 99855, 74882, 71428, 80075, 68725, 89176, 78319, 27505, 1475, 10929, 24660, 30004, 50794, 48032, 31473, 79507, 112984, 103499, 73805, 57875, 24212, 17795, 23182, -8271, 17237, 60797, 71121, 52918, 38533, 41201, 41522, 79308, 65560, 49024, 2638, -19550, -33899, -52604, -42927, -14551, -4289, -20341, 12701, 32062, -4124, -1498, 17719, 5610, -9143, -38, 1403, 18024, 20875, 15632, 12641, 10423, 17573, 25970, 29888, 30561, 854, -17024, -12255, 8798, 30709, 27042, 7538, -17722, -1841, -2031, -18875, -25415, -35097, -33331, 13751, -7766, -21205, -14898, 18274]
13077A8274J3340R466K3207J1265J7011j3101l8340k4096j0329j835k649j6995
13065a4782m0547M757M6145O5008k2238l995j2271P859j2000K8816j726m2025
13053C001r712M872K3391j3084k8541l0973j5337L080J7368K4363J698J2Q083
13040a1779Q662j1212N425K3475K4073J853K66k5182j5342m040k5677r664M0696
13027A554J9652L705p361K3854J5970j3585j183m2359o707k8306l9791K4395J1652
13014c8510K6291K4782K3400J1493Q491J0239k8167l652J7667M861l3087l1658
13002g850K9638O40q168J4746l7364j9462M4077N4188l730q527j0121o980l2030
12989I057O416K9933k4434q236k527J6438L8348k0277k8847q802k5806j125l1798
$$ y = [18274, 31614, 41080, 64287, 75552, 92563, 79462, 41122, 17026, 6697, 4862, 2213, -14782, -55329, -50572, -4427, 60581, 38343, 34348, 22077, 29936, 17936, 46752, 45026, 3001, -6711, -1839, 21552, 8468, -20073, -51046, -66383, -63303, -45935, -21572, -19874, -19862, -11779, -3117, -14329, -8904, 14571, 38644, 40497, 40763, 15581, 239, -3801, -29478, -39142, 1554, 21206, 24911, 17550, 41404, 57374, 43789, 42606, 247, -6460, -34766, -74557, -50162, -38510, -12219, 12563, 35963, 47456, 55947, 66186, 38019, 34367, 52034, 56895, 23808, -7850, 21788, 22428, 14260, 29006, -8358, -27820, 16257, 70445, 66715, 58188, 48067, 41087, 9057, 15473, 45406, 20972, 12736, 10209, 26647, 64995, 44718, 15871, 7069, -18737, -19862, -51660]
12976e1660r944n433K6412r47K1861J4282J5139o589K4546J5011P601j3852j7476
12963A8951k499K5776K1527l1286j0022J883k3770K5534L2639l5420n0394L5179
12951H098K1614j208R772j6871J1370J4974K3965M5402j2317j564k2041j9422
12939F1772K1655j5441k1910k7286j2404l1242k7985J4794M4570q066M699j094
12927B062p943o034l397K4432K8637o11l803L402K4789J6358k6186j5765j0571
12914B5370j7602L2297J9804p861n474J4599q245m0399k1279j8846J7201J9604
12902I169K6598k6266k8875j3746M1225M5247L9811K0998l8636m9518j6631J850
12890A1226J5705j060J5929J9218k5279J2863K2979k2293J1862j6960J7542R641
$$ y = [-51660, -61604, -67037, -40625, -41572, -19711, -5429, 9710, 3121, 27667, 42678, 50279, 36427, 18951, 16452, 42228, 63755, 32469, 22447, 24330, 560, 26094, 58733, 23313, -27081, 8098, 29712, 28504, 38276, 21405, 32775, 47749, 71714, 117116, 104799, 103235, 81194, 61772, 83427, 67986, 46076, 18790, 6386, -24856, -52841, -38047, 6523, -1543, 3156, 2062, -5881, -11915, -15312, 9120, 37757, 37146, 33343, 36745, 61534, 77892, 51706, 35941, 25370, 7768, 40065, 59869, 52008, 46534, 61133, 52888, 12489, -8790, -27636, -10435, 9169, 35767, 9501, -19374, -33120, 8105, 53352, 93163, 114161, 75525, 26007, 9376, 11226, 26931, 25871, 41800, 61018, 35739, 48602, 71581, 49288, 61150, 44190, 61732, 71373]
12878G1373R577L7736J6098j5715N6004P6462M5736L7380O6210L2589J2575j5889
12866D30136k9083j1302l1333o3601k5277J1531R648m6673n3178k1292M3925j374
12854B12127j0137k005k4596J4181n138j655J3215K6821q661K579K604O6144O2068
12841C47547O7415N6413Q7151N8863O8028N7407J058N550o92k8751p7419l2091
12829F10479n2818j15478k3795k5938n2205n5884m1197k8861j3683J3895K1973
12818B36488J437p998j5918P46J3899j7390K1359J3790k2312p945p394N5252L4067
12805B98081J6370L5932O9654M5699k392m6798k1709o632j6131j7153m9567m9474
12793B55880l0377l4364o6251m2567J3506K2923r753J4749p022L0958R321k1685
$$ y = [71373, 80950, 118686, 134784, 119069, 175073, 251535, 297271, 334651, 400861, 433450, 446025, 430136, 401053, 389751, 358418, 294817, 269540, 281071, 290719, 244046, 190868, 169576, 213501, 212127, 201990, 199985, 175389, 189570, 184432, 182777, 195992, 222813, 214152, 216731, 219335, 285479, 347547, 414962, 471375, 558526, 617389, 685417, 742824, 743882, 749432, 748740, 719989, 642570, 610479, 557661, 442183, 418388, 392450, 340245, 284361, 243164, 214303, 200620, 214515, 236488, 237925, 229927, 214009, 214755, 228654, 211264, 232623, 246413, 224101, 216156, 208762, 264014, 298081, 314451, 350383, 420037, 465736, 463344, 416546, 394837, 388205, 372074, 354921, 305354, 255880, 225503, 191139, 124888, 82321, 95827, 118750, 108997, 123746, 116724, 147682, 157003, 135318]
12781A35318m4079j5493j3071j0978L192k3768j2602o279Q144M2354L2034N356
12769A00128J7933o1860p4235R004M1095J1545K2684J7380j4448k3100n851N54
12757D0829l0489L0324J9321k1080k9485q007P749k2865J255J9553M490j0543
12745A052j7348P607P3015j1248n3526j9473K2924L2115L4179j9331l1010J1964
12733C0920K5749k1450N482J8121j662k3479J3237L0094K6622O490P719j0030
12721A07813R93m0052J3300R248N609j0246Q194l0612J6146M012K5656r823k1842
12708G8396K1184K5287k3199l3340k3418L2563N0155N654l1610p141j2760k2533
12696E9238J0414j0709j9061N0033K2634L9899J3412k399m8157j751J6122j2814
$$ y = [135318, 91239, 75746, 62675, 51697, 54889, 31121, 18519, 12240, 20384, 62738, 94772, 100128, 118061, 56201, -18034, -9030, 32065, 43610, 66294, 83674, 69226, 46126, 40275, 40829, 10340, 40664, 59985, 38905, 9420, 1413, 9162, -13703, -12448, 7105, 11595, 1052, -16296, -8689, 64326, 53078, -448, -19921, 3003, 35118, 69297, 49966, 18956, 30920, 56669, 35219, 40701, 58822, 57160, 33681, 46918, 77012, 103634, 110124, 117843, 107813, 108806, 68754, 82054, 91302, 96911, 86665, 94859, 64247, 80393, 84405, 110061, 100238, 78396, 99580, 124867, 101668, 68328, 44910, 77473, 127628, 133282, 101672, 94531, 81771, 59238, 69652, 58943, 39882, 89915, 112549, 152448, 165860, 163461, 115304, 113553, 129675, 116861]
12684A16861n197k1199l991L005K2234M70M248j1193R02J5780K3406O524K9050
12671A80900K3040l3486n6889k4307M981J9969J426k9152j4293j5042j9068N6529
12659I4608P3418J9248l2469m191K962n528L600J8672o809K5539P758l4146K4348
12646A87010M506m3871j5112j8771j3829K2885P761l3188j3235K3941J9682j9246
12634A08533r820j1627J6806M4107K3834K8945k3510l0236q446l2300K439K3750
12622A32475o800O322j2668K8311J1829J1854o299j505J0990N076K1671k634J0042
12609B08664K3814P843k5541p505n7005k0478k1285j9539k9088k9314M1766M7317
12597A19649j8975l4920L1997K2887L1864L2341l1855K125K5201M1182r283l8684
$$ y = [116861, 111664, 90465, 86474, 89479, 111713, 112183, 116431, 105238, 106140, 121920, 145326, 151850, 180900, 203940, 170454, 113565, 89258, 94239, 114208, 115634, 86482, 72189, 57147, 38079, 94608, 168026, 187274, 154805, 150614, 153576, 148048, 151648, 170320, 163511, 189050, 196808, 162662, 187010, 191516, 147645, 132533, 113762, 99933, 122818, 130579, 97391, 84156, 108097, 127779, 108533, 98713, 87086, 103892, 147999, 171833, 200778, 177268, 147032, 138586, 106286, 108725, 132475, 125675, 131997, 119329, 147640, 159469, 171323, 165024, 163519, 174509, 179585, 201256, 198622, 208664, 232478, 240321, 214780, 207275, 150270, 129792, 108507, 88968, 59880, 30566, 72332, 119649, 100674, 65754, 97751, 120638, 152502, 184843, 152988, 155113, 180314, 221496, 212213, 173529]
12585A73529J6237k764r302o338M616k002J0076K3371M825O870J7624j1135Q326
12572B33933K7481k2084k4258k6050j2615j9300n656J5920M476j8422j6957p874
12560A28594M476L6665j8091L5757N2897R372Q806m380k2907R90J7948K5431K5382
12547C00940m621j5791J1883k9174K000L2800J993j3630J291j5061j634j3846
12535B57150k9199k2866K6129J9135M1793R004m0898k5718m59N4015M6141L2804
12523C67031J42j2938K847L9865P90j9857J104j4557J7065L8971K5263j6442r759
12510D19525m4767k4676j8840p5529K216R299n942j8300Q407J0087L0087L1483
12498C23050Q35o207J8379O5237J8819m214J8630K4788l27K4478J5459N8574K5921
$$ y = [173529, 189766, 187002, 177700, 171362, 175978, 173976, 184052, 207423, 212248, 219118, 236742, 225607, 233933, 261414, 239330, 215072, 189022, 176407, 157107, 151451, 167371, 171847, 153425, 136468, 128594, 133070, 169735, 151644, 187401, 240298, 249670, 258476, 254096, 231189, 232179, 250127, 275558, 300940, 296319, 280528, 292411, 263237, 265237, 298037, 300030, 286400, 287691, 272630, 270996, 257150, 227951, 205085, 231214, 250349, 292142, 301146, 260248, 234530, 234071, 288086, 334227, 367031, 367173, 354235, 357082, 396947, 397737, 377880, 378984, 364427, 381492, 420463, 445726, 429284, 419525, 374758, 350082, 331242, 255713, 257929, 267228, 261286, 242986, 251393, 261480, 291567, 323050, 323885, 317678, 336057, 401294, 420113, 415899, 434529, 459317, 458990, 483468, 498927, 557501, 583422]
12485E83422Q067m3423j8392L2164K8782K6979K7323l7250m0939l552Q372l0296
12473E41257m3159M7333N4156J4594J5566M6212M7409N0662O0373M1441K5985
12462I01829M4723N4384N0155Q5684J06800Q5944M0316O3533P4169L1415P5862
12451A614814J39130Q9554O5536J21691J48276J24965J70481K01741J85492K09394
12441C071074K73289L16612L81114M07715M14691N27626O06223P27487R41582
12432G667413J132459J368556J688311K080708K554092L245908M195453N418207
12424B9351107O972778Q899023J0829401J1913943J0956898P051623J021069m919611
12416H2076231q647617r749533r038305p549922n897316m432895l214075k212497
$$ y = [583422, 591489, 548066, 529674, 561838, 590620, 617599, 644922, 607672, 566733, 563181, 571553, 541257, 498098, 545431, 599587, 614181, 629747, 675959, 723368, 774030, 834403, 875844, 901829, 946552, 1000936, 1051091, 1136775, 1243575, 1329519, 1369835, 1433368, 1507537, 1538952, 1614814, 1753944, 1843498, 1909034, 2030725, 2179001, 2303966, 2474447, 2676188, 2861680, 3071074, 3344363, 3660975, 4042089, 4449804, 4864495, 5392121, 5998344, 6725831, 7667413, 8799872, 10168428, 11856739, 13937447, 16491539, 19737447, 23932900, 29351107, 36323885, 45222908, 56052309, 67966252, 78923150, 85974773, 86995842, 82076231, 73428614, 63679081, 54640776, 47090854, 41193538, 36760643, 33546568, 31334071]
12408C1334071j273920n17895m5352j21840o13016j090940j102915p28396j16972
12399B5722825N81315J268764K016602K906179L894986N289433P177182R687481
12391E8544767J2890764J6594760J9695975J9921483J5549325P940830O05091
12384A51742995m085304o010283o832636q875008j2610441j5708961j5829954
12377H1790408j3576507j0600098q054300o076084m598459l493813k666188j945276
12369C0779683j305054o58580L0135O65233J187799J251194Q22846L63938M14475
12360C3551669J023324K024608L344057M965596O859690Q924316J0964979J2158517
12352H3816756J1018477O583936m61068p454723j1798001j2886692j1765285r806524
$$ y = [31334071, 30060151, 29542256, 29496904, 29375064, 28762048, 27671108, 26568193, 25839797, 25722825, 26304140, 27572904, 29589506, 32495685, 36390671, 41680104, 48857286, 58544767, 71435531, 88030291, 107726266, 127647749, 143197074, 151137904, 151742995, 147657691, 141647408, 134814772, 125939764, 113329323, 97620362, 81790408, 68213901, 57613803, 49559503, 43483419, 38884960, 35391147, 32724959, 30779683, 29474629, 28816049, 28846184, 29511417, 30699216, 31950410, 32773256, 33137194, 33551669, 34574993, 36599601, 39943658, 44909254, 51768944, 60693260, 71658239, 83816756, 94835233, 101419169, 100958101, 93503378, 81705377, 68818685, 57053400, 47246876]
12344D7246876p798776o068876m782509l864853l146285k634426k192501j838893
12336A4919757j567609j287593j147197j037878q68862p51891p00332o07136n37398
12327F413861m54991m31819m30227l73754k93108k47929k26115k11650k31364
12318C512904k23187j23686j16838j49456j28303j04061r8942j18767j02334o4192
12308B283138j32765r4175m1644p3807o7994p3724o3144n0852j9266j1101n2511
12297A602155R911l7438m5047j5506j1533o9017l4457o6299p2660j9366k9432
12286A211311q983m8017o6888j8571J7713L6989R073l5793l7629m4857k3931l0184
12274I60233N285J1145J9872K502L0319J5414m6208m4246R767K3652j2315o11
$$ y = [47246876, 39448100, 33379224, 28596715, 24731862, 21585577, 18951151, 16758650, 14919757, 13352148, 12064555, 10917358, 9879480, 9010618, 8258727, 7558395, 6951259, 6413861, 5958870, 5527051, 5096824, 4723070, 4429962, 4182033, 3955918, 3744268, 3512904, 3289717, 3166031, 3049193, 2899737, 2771434, 2667373, 2568431, 2449664, 2347330, 2283138, 2150373, 2056198, 2014554, 1940747, 1872753, 1799029, 1735885, 1685033, 1665767, 1654666, 1602155, 1612066, 1574628, 1529581, 1514075, 1502542, 1433525, 1399068, 1332769, 1260109, 1240743, 1211311, 1202328, 1154311, 1087423, 1068852, 1086565, 1123554, 1132627, 1096834, 1059205, 1014348, 990417, 960233, 965518, 976663, 996535, 999037, 1029356, 1044770, 998562, 954316, 964083, 987735, 975420, 974809]
12262I74809j4064k7000q7971j3483J9529j1886m2104o3725j5909l8088l5098
12251F45010j289j9279k0794m0577J4197O4602K0047n1951j7907J8350L0940N4115
12239F95464j3955p872k146P766K828N5513K5609j5080k9561n6288j0968m2018
12227F09292m2974j4980j1684J7542l0489o3490K7355L3951k8370l6470l8487
12216D21196q922j7698O241L4583J2991l830J5135J2932j3593k5408l285j7004
12204D13338m136J5234J1284k1274L5703Q989p1985p8588j8024k2980J0366R600
12192B87527K1599j1964k6292k5469J3360j3940j0039K651N5199L8942J6713k6542
12180C21745j2699M510L5248Q998k1349l1636o802K582q884J7347j5407p762K1379
$$ y = [974809, 960745, 933745, 845774, 832291, 851820, 839934, 797830, 734105, 718196, 680108, 645010, 643721, 624442, 603648, 563071, 577268, 641870, 661917, 609966, 592059, 610409, 641349, 695464, 681509, 673637, 671491, 679257, 682085, 737598, 763207, 748127, 718566, 662278, 651310, 609292, 566318, 551338, 539654, 557196, 526707, 463217, 490572, 524523, 496153, 459683, 421196, 412274, 394576, 400817, 435400, 448391, 444561, 459696, 472628, 459035, 433627, 430342, 413338, 409202, 424436, 435720, 414446, 450149, 459138, 387153, 308565, 290541, 267561, 277927, 287527, 309126, 297162, 270870, 245401, 258761, 244821, 234782, 237433, 292632, 331574, 348287, 321745, 309046, 313556, 348804, 357802, 336453, 304817, 298015, 300597, 291713, 309060, 293653, 285891, 307270]
12167C07270j7659j7924L6114p214R128J089r228k8567j5106k337K0213J0551
12155B86330p824K4414K292J868k2302K8451Q906q410l7440n488M1280J4302N451
12142C31830j2833m4323J3736K8845J7599k8613j4941J5232K3221K9033p7j7922
12130C40787K169m062k6030n1030p40J5483R346k6483J9449J3000k4493J4020
12118B81416L7048m525n9970l3301o911m139j3260K6955M8055K870l662j6839
12106B53737K2280O1373N4825K243j4882k3886P161L3082K9604J3664k3840k2198
12094C93163N883O068L6299J1988l0017K8501J8779l5371m9876l5070o333k6984
12082C17030k646K6625l3132k256N995k4531K1760K6185L0010O895l5612J613
$$ y = [307270, 289611, 271687, 307801, 300587, 309715, 310804, 301576, 273009, 257903, 255566, 275779, 286330, 278506, 302920, 305212, 307080, 284778, 313229, 322135, 313725, 276285, 270797, 312077, 326379, 331830, 318997, 274674, 288410, 317255, 334854, 306241, 291300, 306532, 329753, 358786, 358709, 340787, 342956, 338894, 312864, 261834, 261094, 276577, 285923, 259440, 278889, 291889, 267396, 281416, 318464, 313939, 253969, 220668, 213757, 209618, 196358, 223313, 271368, 274238, 270576, 253737, 276017, 337390, 392215, 394458, 379576, 355690, 362851, 395933, 425537, 439201, 415361, 393163, 399046, 405114, 441413, 453401, 423384, 451885, 470664, 435293, 385417, 350347, 344014, 317030, 314384, 341009, 307877, 305621, 311616, 287085, 308845, 335030, 365040, 371935, 336323, 337936]
12070C37936O4544O2136K9323M076j4509J0931K5090L7794k2434o744J2124k2238
12058E18029r176L7070K5745J4136K0909K0167l7746k7728J0004j68R784J4895
12046E95921K3911K6465M008L4133M0292J1880L5106M1241K7392K3233k1816L3930
12034H75696J3240J0329K076J6660N9975P5796J7687J3077L0381L4596M7415O1368
12022A258296M0161j7480N2225O5016N4928N5077N2757O8812O2612P5307N1912
12011A819623O7730P7248R3685J09286P4807J15385Q2284P2361J23612J11712
12001B747733J10513J58546J73841J63907K05392K53772K32002K37411K30811
11992D513928K77387L20308L36819L86180M40718M73602M74156M65473N48620
$$ y = [337936, 402480, 464616, 493939, 498015, 483506, 494437, 519527, 557321, 534887, 528143, 540267, 518029, 508853, 545923, 571668, 585804, 606713, 626880, 589134, 561406, 571410, 571242, 581026, 595921, 619832, 646297, 650305, 684438, 724730, 736610, 771716, 812957, 840349, 863582, 841766, 875696, 888936, 899265, 901341, 918001, 977976, 1053772, 1071459, 1084536, 1114917, 1149513, 1196928, 1258296, 1298457, 1280977, 1333202, 1398218, 1453146, 1508223, 1560980, 1629792, 1692404, 1767711, 1819623, 1887353, 1964601, 2058286, 2167572, 2242379, 2357764, 2440048, 2512409, 2636021, 2747733, 2858246, 3016792, 3190633, 3354540, 3559932, 3813704, 4045706, 4283117, 4513928, 4791315, 5111623, 5448442, 5834622, 6275340, 6748942, 7223098, 7688571, 8237191]
11983H237191O58571P51919Q87207R27486J059113J201750J295978J501497J658793
11974A8179505J893299K076926K262549K517358K744825K865909K938621K850117
11966C8329109K580273K205966J608733Q78907J38353o64032j415614k024224
11958D1637471k428538k627730k679122k673954k553892k396724k177609j980860
11950B2119042j815313j673380j512907j347458j245522j129845r65519q75985
11942A1553113q08783p57634o74837n86733n19476m64434m36695l54993l22560
11933F626968k93047k31662k23443k41441k05276k60457k77626k42911k14496
11924D436609k17397k19848j66392j91696k18911j77002j66536j58703j45197
$$ y = [8237191, 8895762, 9647681, 10534888, 11462374, 12521487, 13723237, 15019215, 16520712, 18179505, 20072804, 22149730, 24412279, 26929637, 29674462, 32540371, 35478992, 38329109, 40909382, 43115348, 44724081, 45602988, 45741341, 45077309, 43661695, 41637471, 39208933, 36581203, 33902081, 31228127, 28674235, 26277511, 24099902, 22119042, 20303729, 18630349, 17117442, 15769984, 14524462, 13394617, 12429098, 11553113, 10744330, 9986696, 9311859, 8725126, 8205650, 7741216, 7304521, 6949528, 6626968, 6333921, 6102259, 5878816, 5637375, 5432099, 5171642, 4894016, 4651105, 4436609, 4219212, 3999364, 3832972, 3641276, 3422365, 3245363, 3078827, 2920124, 2774927]
11915B774927j24597j16758j32115p1410l2944j5606j22240j05737j9628k5680
11905B008212j05904p0321o1724m1442j776j2867p398J4941J7068k1597k2846
11894A694346K0947l705n0225r0371q9122r0333p1441p4029n8321o2301q2940
11883A042505q996L7156m6838m8007l5465l7561m4784k0991k1115k790j5725l3746
11871G63643K29l0697k7855j5498j2175k0355j77L2659k6605j2809j1942l0911
11859F07507K161R762k6219j2605K4337M081m998N749k0239L1775K3023j8346
11847F25988R06o952j0299J1329q056q160k4150k3009O1326Q634L2224M6761O0881
11834G67423K5622M858K6172m809k3328m1539n0887n0353l8993j593M688j9568
$$ y = [2774927, 2650330, 2533572, 2401457, 2330047, 2297103, 2281497, 2159257, 2053520, 2033892, 2008212, 1902308, 1831987, 1770263, 1728821, 1727045, 1714178, 1706780, 1721721, 1738789, 1717192, 1694346, 1715293, 1711588, 1661363, 1570992, 1481870, 1391537, 1320096, 1246067, 1187746, 1125445, 1042505, 1033509, 1070665, 1023827, 975820, 940355, 902794, 858010, 837019, 815904, 813114, 797389, 763643, 763872, 733175, 705320, 689822, 677647, 657292, 657115, 689774, 663169, 650360, 638418, 607507, 609668, 619430, 593211, 580606, 604943, 609024, 604026, 609775, 589536, 621311, 644334, 625988, 626894, 619942, 609643, 620972, 612916, 604756, 580606, 557597, 618923, 627557, 659781, 706542, 767423, 793045, 797903, 824075, 819266, 795938, 754399, 703512, 653159, 614166, 612573, 617261, 597693]
11822E97693j5451j7064m2401o778K1375Q559k5858o1180J2138K4987L2075K8853
11810E56948l8138k7750J9756O765L6482K7551j7718L5697O1221L4326O9365L7959
11798H02464M2449O0983M3863l5623m1964o3502j06945m2957j827m8207r3945
11787E14789k1311O731m7297j3497k1664j521q170l7363O128j7322J2988R19L788
11774C77198J2734L1773P365P728J5023M895J2225p811L7448J632J7954J9351
11762E37515j866l3730j6520l1882k4943j5915m7733l4751L3784n026j1538r064
11750C38331n6738l0850j320k1316l4041l1745K034O4672K7037j7826m4460m1565
11738A52213J7308l981k2398M914M0693L6929l690n570J971j0382j4076J8781
$$ y = [597693, 582242, 565178, 522777, 515999, 537374, 545933, 520075, 458895, 471033, 496020, 528095, 556948, 518810, 491060, 510816, 517581, 554063, 581614, 563896, 599593, 660814, 695140, 764505, 802464, 844913, 905896, 949759, 914136, 872172, 808670, 701725, 658768, 656941, 608734, 514789, 493478, 500209, 452912, 439415, 417751, 416230, 408060, 370697, 376825, 359503, 372491, 373410, 377198, 389932, 421705, 429070, 436798, 451821, 456716, 468941, 461130, 498578, 500210, 518164, 537515, 535649, 501919, 485399, 453517, 428574, 412659, 364926, 330175, 363959, 358933, 347395, 338331, 281593, 250743, 249423, 228107, 194066, 162321, 164355, 229027, 256064, 238238, 193778, 152213, 169521, 165540, 143142, 148056, 188749, 225678, 221988, 216418, 218389, 208007, 193931, 212712]
11726B12712j617j5380k5744l0926M101K1746J9409m2440l501K9922j5423q46
11714A52013k0777j2717j328J4194l440J2018J6765J4802j0092l3288k1541N881
11702A12490K1073L4273J3072Q31J2362m6860k7892k0156L5893O7698r819J3720
11690B06685L1431P636l3399j5301m8773k1245J5529J4652j2226J8931K5576L1167
11678B20663k1166p186j5128l0199m751j2163j4500K2008l0887j1170l978k9276
11666F2267J5825j0741j5892L3770O0925L6597P675M720K5960j4556M132N1687
11654B62369M4359q231m1985m3172n239k700p461k4507j2108M2965j1732k0688
11642A71870L1387o947k0821J4197M310j893j5992L5437J6448J8298k6876N604
$$ y = [212712, 211095, 195715, 169971, 139045, 143146, 164892, 184301, 141861, 138360, 168282, 152859, 152013, 131236, 118519, 117191, 131385, 127945, 139963, 156728, 171530, 161438, 128150, 106609, 112490, 133563, 167836, 180908, 181739, 194101, 147241, 119349, 99193, 135086, 202784, 192965, 206685, 238116, 245752, 212353, 197052, 148279, 127034, 142563, 157215, 144989, 163920, 189496, 220663, 199497, 192311, 177183, 146984, 142233, 130070, 115570, 137578, 106691, 95521, 91543, 62267, 78092, 67351, 51459, 85229, 146154, 182751, 190426, 195146, 221106, 206550, 210682, 262369, 306728, 298497, 256512, 213340, 208101, 205401, 197940, 173433, 161325, 204290, 192558, 171870, 203257, 196310, 175489, 189686, 193996, 192103, 176111, 211548, 227996, 246294, 219418, 225022]
11630B25022k4697k8603l37o080o149K6244P5082k564n0700k5951N941J8895k367
11617B03736J0866P434K6552J3913J4764l7309m9484l1123j6376k3910J0678L5473
11605A65214K9800l800k9968N3833O322m3286q132M3319L3824l082J59K0780j8218
11592B46765k1813k3972o1374R25J4882j5427k7885J0150J8093N2367O516j7478
11580A81749k9461p419J5135J2311L1073M059j6469l0435j5144j2492L3865K0796
11568A87568r591p229j2951q759J1917K6297J2426q825l2290l176K2979r19K4205
11555B01652J4359m3144K5837o741J3132l437k7012J0270M2528K1056K2922Q31
11543B72253J5695k1930k7684J4185r079J975J8369Q293p969k2831N1548j0691
$$ y = [225022, 200325, 171722, 171385, 165305, 159156, 185400, 260482, 257918, 207218, 181267, 187208, 206103, 203736, 214602, 222036, 248588, 262501, 277265, 239956, 190472, 159349, 142973, 119063, 129741, 165214, 195014, 191214, 161246, 215079, 221401, 178115, 169983, 213302, 247126, 244044, 244203, 264983, 246765, 224952, 200980, 139606, 140531, 155413, 139986, 112101, 122251, 140344, 192711, 199227, 181749, 152288, 144869, 160004, 172315, 203388, 207447, 190978, 160543, 145399, 132907, 166772, 187568, 177977, 170748, 157797, 149038, 160955, 187252, 199678, 190853, 158563, 155387, 178366, 177447, 201652, 216011, 172867, 198704, 191963, 205095, 201658, 174646, 184916, 227444, 248500, 271422, 272253, 287948, 266018, 238334, 252519, 243440, 245415, 263784, 272077, 264108, 241277, 292825, 282134]
11531B82134r362j4276K3209r175K5726K2928J3650J7781j0349P826n761K7051
11519C71382j023J8517J3939j6425o872j2321K7145L8043J2505m2412l5714K9606
11507C96370p264p688K4831K5200J9043J8915m556k0866j9524k7513j8334K8147
11495D06761l0658n5366k8476k3769J721J6700K4300L7199J9151M2428J2634n7
11483D22568J9557K6146k251O578Q839k0388J0455K804o4618n0207l7578l422
11471C18483l1513k1541K7160L3048L4459R625k553j31n242j3906n707M1940J7796
11458D01918k0530N1507L5180N2972J2761K2798J4247j4939J2070K7482K0419
11447F15885L1174j2893J0406N6199J8705j1985j7319Q703M7141o435J7598L3336
$$ y = [282134, 272772, 258496, 281705, 272530, 298256, 321184, 334834, 352615, 342266, 350092, 344331, 371382, 370359, 388876, 402815, 386390, 379518, 367197, 394342, 432385, 444890, 402478, 366764, 396370, 389106, 381418, 406249, 431449, 450492, 469407, 464851, 443985, 424461, 396948, 378614, 406761, 376103, 320737, 292261, 268492, 270213, 286913, 311213, 348412, 367563, 409991, 422625, 422568, 442125, 468271, 466020, 472598, 481437, 461049, 471504, 474308, 409690, 359483, 321905, 318483, 286970, 265429, 292589, 325637, 360096, 369721, 367168, 367037, 361795, 347889, 342182, 384122, 401918, 381388, 432895, 468075, 521047, 533808, 556606, 570853, 555914, 567984, 595466, 615885, 647059, 634166, 644572, 700771, 719476, 707491, 690172, 698875, 746016, 739581, 757179, 790515]
11435G90515N6258K7379L8047K6005N4719N8191L5109M6416K7793M4783N2103
11424A257318L8427R6757J00015L0170J01261J41788J34236J25991J15486J06773
11414B248222J08764J73837K03756K41903J89885K04477K56657L28578L49695
11405D305774L97157M33666M84655N18785O42095P93599R25778J155616J443515
11396A1100640J781436K182753K640014L384602M277380N467006P031976Q960107
11388D6825914J1113731J2807214J3066310J0576872M967357k214974q229895
11381H8912529j1209119j1333685r832262p804534n869912m220168k881502j647766
11373C4113581p92397m81765q40102j453034j785921j587127r71220l29068L17528
$$ y = [790515, 846773, 874152, 912199, 938204, 992923, 1051114, 1086223, 1132639, 1160432, 1205215, 1257318, 1295745, 1392502, 1492517, 1522687, 1623948, 1765736, 1899972, 2025963, 2141449, 2248222, 2356986, 2530823, 2734579, 2976482, 3166367, 3370844, 3627501, 3956079, 4305774, 4702931, 5136597, 5621252, 6140037, 6782132, 7575731, 8501509, 9657125, 11100640, 12882076, 15064829, 17704843, 21089445, 25366825, 30833831, 37865807, 46825914, 57939645, 70746859, 83813169, 94390041, 99357398, 97142424, 88912529, 77703410, 66369725, 56537463, 48732929, 42863017, 38642849, 35761347, 34113581, 33321184, 32839419, 31999317, 30546283, 28760362, 27173235, 26202015, 25872947, 26190475]
11364B6190475R90590J714919K525334L571233M951237O709036R020819J1736225
11356F7409868J4376116J5824278J5096837J2624612J0275599Q740467O496036
11349A50843813K205071m232362j1391300j6809942j8621161j7122455j4081417
11342G0790247j0982579q397494o427807m918868l761705k857342k110404j414215
11334B9919833p58041j58596M05256O02673L26533k17157n16726k54655N13242
11325B9862362J421951K502731L737898N114414O766376Q503333R845518R985574
11317G7740157P924602L251930k863870q135831j0852765j0974730r603334p833373
11309C8652786o251367m865048l789781l021984k452528k057003j762160j462504
$$ y = [26190475, 27181065, 28895984, 31421318, 34992551, 39943788, 46652824, 55673643, 67409868, 81785984, 97610262, 112707099, 125331711, 135607310, 144347777, 150843813, 153048884, 148816522, 137425222, 120615280, 101994119, 84871664, 70790247, 59807668, 51410174, 44982367, 40063499, 36301794, 33444452, 31334048, 29919833, 29161792, 29003196, 29408452, 30011125, 30337658, 30120501, 29603775, 29349120, 29862362, 31284313, 33787044, 37524942, 42639356, 49405732, 57909065, 67754583, 77740157, 85664759, 88916689, 86052819, 77916988, 67064223, 56089493, 46486159, 38652786, 32401419, 27536371, 23746590, 20724606, 18272078, 16215075, 14452915, 12990411]
11301A2990411j305217j116905r49890q39788p30978o60182n80325n53710m53328
11292E800088l75206k94042l36622l36031k52865k17586k41777k12108k08534
11283C325317j91552j31162j19486r9755j00799q6933o9356p5475j13103q7594
11273B250102o7277j05329j23091m3835k6979r011m5854k8044m0075p0371n1275
11262A638961m0166n4621n6535l0700l7633m8872m6710k3722q247m4374o7006
11251A180375J2124j9701m9128k6025k0438n168R469P508m8168j7491j215j0905
11239A011237j2399k4774k6721R35n449q8P642k3024k5111J9575K111k3253k7369
11226H73312L894j9082l4214k6006m9761j3752J6998p515O517n3008m6225j9810
$$ y = [12990411, 11685194, 10568289, 9618399, 8778611, 8047633, 7387451, 6807126, 6253416, 5800088, 5424882, 5130840, 4794218, 4458187, 4205322, 3987736, 3745959, 3533851, 3325317, 3133765, 3002603, 2883117, 2783362, 2682563, 2595630, 2526274, 2450799, 2337696, 2250102, 2182825, 2077496, 1954405, 1910570, 1883591, 1874580, 1828726, 1800682, 1760607, 1690236, 1638961, 1598795, 1544174, 1487639, 1456939, 1419306, 1370434, 1323724, 1300002, 1291755, 1247381, 1180375, 1192499, 1172798, 1123670, 1097645, 1077207, 1072039, 1081508, 1089016, 1040848, 1023357, 1022142, 1011237, 998838, 974064, 947343, 948278, 942829, 942741, 950383, 927359, 902248, 921823, 923934, 900681, 873312, 877206, 858124, 823910, 797904, 748143, 734391, 751389, 743874, 750391, 697383, 651158, 631348]
11214F31348m5927m5630K0381M4524K1540l513j6856J0203J1874k1428k8568l1638
11202E46310j5322N9557M1972J8784J5558k340m2262j6593l8241j6212J4382J1089
11190E76682k6449l2165l1806m6959k717k355j7218k0808n4860m5186K6131M0486
11178C62776L8524q398K3341N547p91k1487o377o423J477n552n277J6373k5680
11165C68053l7517o5308j5516J2723n920j2702m3326P55J1830J925L2409r531
11153B37875J7815L1114j0975k877m4563J6983j7978q569L4398L0907r80K1214
11141C04364n163R00J640J2875K2974k595l3373j4596J933N890K5963M286Q828
11128C33926J6340K3143j8155k3216l7327j6372l5596k2635M100N9049P190j2917
$$ y = [631348, 585421, 539791, 560172, 604696, 626236, 622723, 605867, 616070, 627944, 606516, 577948, 546310, 530988, 590545, 632517, 651301, 666859, 664519, 622257, 605664, 567423, 551211, 565593, 576682, 550233, 518068, 486262, 439303, 436586, 434231, 417013, 396205, 341345, 296159, 322290, 362776, 401300, 392902, 416243, 421790, 420999, 399512, 393135, 386712, 388189, 382637, 377360, 393733, 368053, 330536, 265228, 249712, 262435, 256515, 243813, 200487, 201242, 213072, 214997, 247406, 237875, 255690, 286804, 275829, 272952, 228389, 245372, 227394, 218825, 253223, 284130, 283150, 304364, 299201, 300101, 301741, 314616, 337590, 334995, 301622, 287026, 288959, 294849, 320812, 325098, 333926, 350266, 373409, 355254, 332038, 294711, 278339, 242743, 220108, 224208, 283257, 290447, 277530]
11116B77530j7059p209Q351J1564L6131k773j8479j8466M276N817j3698l4415
11104B31570J6745J1566K3246K4684m325k7536p173J0596K0424J3677K8435n911
11092C35998J1761L1386l5242n5132r691l0396k6408k9383q962J0901J35K1114
11080B16081n93R437m3926k6296j4694j7282M977L0593P1381p234m5269j1520
11068A65655J4320l0575m3331J1274M7146J2705N0207J0636q154l1194N570K6224
11056B30483j1813k7850L4330l5600l6449K097j1219j8639j1197n2405l1357n649
11044B4732J4063k574Q293J9944J6505j798N3840M1895Q055n1974j8682L3308
11032A45607L7886j8731K4049L4664k8241n623M8327L4829M1930J940k5115m5752
$$ y = [277530, 260471, 253262, 261613, 273177, 309308, 306535, 288056, 269590, 273866, 279683, 265985, 231570, 248315, 259881, 283127, 307811, 303486, 275950, 268777, 279373, 299797, 313474, 341909, 335998, 347759, 379145, 343903, 288771, 279080, 248684, 222276, 192893, 183931, 194832, 194967, 216081, 215488, 224925, 180999, 154703, 140009, 122727, 127704, 158297, 229678, 222444, 177175, 165655, 179975, 149400, 106069, 117343, 164489, 177194, 227401, 238037, 229883, 198689, 204259, 230483, 218670, 190820, 225150, 189550, 153101, 155198, 143979, 125340, 114143, 61738, 30381, 24732, 38795, 36221, 44514, 64458, 80963, 79165, 133005, 174900, 182955, 130981, 112299, 145607, 183493, 164762, 188811, 223475, 195234, 189611, 237938, 272767, 314697, 316637, 291522, 245770]
11020B45770K2592K1894j8946k3795M7301O1556O5806L6285l2566n3050p4280
11009B98567l6126l7612k3498k618K0312L3145M4414K5044N259k7099n7414j109
10997B41265k7252l6196j0373P464N262M2295N4840k3311j5438j0112j1006o225
10985B11213j0308k7884j9758j7637q53k2624o088k3506l592K2305q937L273k925
10972I2679l5268j0704Q139j0722M2351J9217j6104L275n576J6812K1160O163
10960A31422r983l510j6937n0102j3804P5414J7518r975M0133j622j5919M2522
10948A85157J1259k5555J0900K6616p552l8499q921O7132J5732J1185J6965K0446
10936B84865J0331L3533M1844J6145M1156O8694K9871j4406R066o3073p7193k0666
$$ y = [245770, 268362, 290256, 271310, 247515, 294816, 356372, 422178, 458463, 425897, 372847, 298567, 262441, 224829, 201331, 198713, 219025, 252170, 296584, 321628, 326887, 299788, 242374, 241265, 214013, 177817, 167444, 174908, 180170, 222465, 277305, 253994, 238556, 228444, 217438, 211213, 200905, 173021, 153263, 135626, 134773, 112149, 106061, 82555, 78963, 101268, 92331, 95604, 92679, 57411, 46707, 54846, 44124, 86475, 105692, 89588, 92863, 87287, 104099, 125259, 131422, 121439, 117929, 100992, 50890, 37086, 112500, 130018, 120043, 160176, 158554, 142635, 185157, 196416, 170861, 181761, 208377, 200825, 162326, 153405, 220537, 236269, 247454, 264419, 284865, 295196, 328729, 370573, 386718, 427874, 496568, 526439, 512033, 521099, 458026, 380833, 360167]
10924C60167l8132j037K1703l2502J3894Q036n5388l5649k4972J7547N2392j7427
10912B68632l650J440L7718J9126j3709j8775J3021K1941P1235P8826N0895O8641
10900E95341O4935L4873P0428L8938j0871q089j9523k0703n7334j06432q9330
10889D92233o1199k7422j3500j8227K2642J940l2787o3919m1173K4366q419O553
10877B81088K4763o021k2719n893j9186j050J1322J9619J9830K4328L7954L4615
10865C98650J3237L3786K8638J5333k389j5766o5451p4828p5968j3169L6574M995
10853B83642m7977k3878k3173j7209j9909L326J552l3825l2221K0731K6373K345
10841A39777N696l480k8151k4584J0891l655k4762J3986j2114J4864J9546l9680
$$ y = [360167, 322035, 320998, 342701, 310199, 324093, 332129, 276741, 241092, 216120, 233667, 286059, 268632, 264982, 266422, 304140, 323266, 309557, 290782, 303803, 325744, 396979, 475805, 526700, 595341, 660276, 695149, 765577, 804515, 793644, 785555, 766032, 745329, 687995, 581563, 492233, 431034, 403612, 390112, 371885, 394527, 396467, 363680, 299761, 258588, 282954, 274535, 281088, 305851, 299830, 277111, 271218, 252032, 250982, 262304, 281923, 301753, 326081, 364035, 398650, 411887, 445673, 474311, 489644, 487255, 471489, 406038, 331210, 255242, 242073, 278647, 283642, 235665, 211787, 188614, 171405, 151496, 154822, 156374, 122549, 90328, 111059, 137432, 139777, 145473, 141993, 113842, 89258, 100149, 96494, 71732, 85718, 73604, 88468, 108014, 68334]
10829F8334j9216K8614M3764L3537m396P795l0121l6342o545R989j9605j8033
10817E7775M7515K5737R896j3874j3819O492o727l6740k8652k1854J1279j9527
10805A7501o080L1030P9043J9941q323j9427k1016l9676r063j8075O461J3778
10793D6094O7217J0347n3177j7398p359L2634L7076O300R807R406M409l3519K0325
10780A32162J8597n3548l668K2154p052j8557M31J2289l2762J0084j5621J9076
10768H3585K1498K9901j0981k3883k0762o374r759j1140J3403j5885R642j4730
10756D4515l2291q319M5983K4580J7968K2073j8557l4314j8088N9703J8190k8355
10744I3088k5548k5808k3286k7472K2101J7377q225J390N4573K2959R05j3995
$$ y = [68334, 49118, 77732, 121496, 155033, 150637, 158432, 128311, 91969, 85424, 95413, 75808, 57775, 105290, 131027, 140923, 127049, 113230, 119722, 112995, 76255, 47603, 25749, 37028, 17501, 11421, 42451, 121494, 141435, 133112, 113685, 92669, 52993, 43930, 25855, 32316, 46094, 113311, 123658, 70481, 53083, 45724, 78358, 115434, 121734, 131541, 140947, 145356, 111837, 132162, 150759, 97211, 93543, 115697, 108645, 90088, 90519, 102808, 70046, 80130, 64509, 83585, 105083, 134984, 124003, 100120, 79358, 72984, 63225, 52085, 65488, 49603, 59245, 44515, 12224, 3905, 49888, 74468, 92436, 114509, 95952, 61638, 43550, 103253, 121443, 93088, 67540, 41732, 18446, -9026, 13075, 30452, 22227, 23617, 78190, 101149, 102054, 88059]
10732H8059M765k4544k2661M765J0017J5557j2989J0810J7012K0413l616K073
10720A09661j2893n3560R26K5958j9143K828k4553j3053M584J4909N0061K2413
10708A08138m3545k5352p070j6677J2109L6561l3433K1944L9133r738K433L722
10696H8225k6932m450n5257J920J596j4759L712M4777M0623j3535l8449k6187
10684A284j1396J8995k0707k4918R43K1574J5500N959K3755j9226j7117L7213
10672C1859N0068J3926j9296m7230J3160O0938L7769k6424j9935o521L8202K0380
10660A46896J3611k3282k2502q270J4397k0242j5235J4421K3844j1018J449j3949
10648A00120j1902j5389j2189K9933Q8786P440l3070r402L5135J2778q983K4834
$$ y = [88059, 92824, 68280, 45619, 50384, 60401, 75958, 62969, 73779, 90791, 111204, 107588, 109661, 96768, 43208, 44134, 70092, 50949, 53777, 29224, 16171, 20755, 35664, 85725, 108138, 64593, 39241, 32171, 15494, 27603, 64164, 30731, 52675, 91808, 82070, 84503, 88225, 61293, 56843, 1586, 3506, 5102, -9657, -5945, 38832, 79455, 65920, 27471, 1284, -10112, 8883, -11824, -36742, -35799, -14225, 1275, 7234, 30989, 11763, -5354, 31859, 81927, 95853, 76557, 29327, 42487, 103425, 141194, 114770, 94835, 88314, 126516, 146896, 160507, 137225, 114723, 106453, 120850, 100608, 85373, 99794, 123638, 112620, 114069, 100120, 88218, 72829, 60640, 90573, 179359, 186799, 153729, 144327, 179462, 192240, 183257, 208091]
10636B08091P592j7876M1660P7130N4173K4690K9109K5738K3029N3037Q4550Q1392
10624F92315J26063J23352J32443J80721K30682K26864J62703J60540K06035L05324
10614B547042M47683O78177R19979J329416J761543K295001K541612K295747J448622
10605A6264822L11925n34049p73872m67033J91570J020302K060350L302575M566181
10596B5942771N313309M579348K017595j172155l104984l230064k223690p87627
10588B7334503Q09329K459953M259153N964862O675115M983525P78268l782958
10580D9481750o187891o079567m628122k831742j129074M83938J992829L150615
10572C4252736L406087J929680j032811l945893n219437m774408l583894k379616
$$ y = [208091, 215683, 197807, 239467, 316597, 370770, 395460, 424569, 450307, 473336, 526373, 610923, 692315, 818378, 941730, 1074173, 1254894, 1485576, 1712440, 1875143, 2035683, 2241718, 2547042, 2994725, 3672902, 4592881, 5922297, 7683840, 9978841, 12520453, 14816200, 16264822, 16576747, 16042698, 15268826, 14801793, 14993363, 16013665, 18074015, 21376590, 25942771, 31256080, 35835428, 37853023, 36680868, 33575884, 30345820, 28122130, 27334503, 28143832, 30603785, 34862938, 40827800, 47502915, 52486440, 53264708, 49481750, 43293859, 37214292, 32586170, 29754428, 28625354, 29109292, 31102121, 34252736, 37658823, 39588503, 38555692, 34609799, 29390362, 24615954, 21032060, 18652444]
10564A8652444j273228m05006K74973P48314O88696k6651j145569k198767k654452
10555A2660754k489118k000116j479062j140116q23251o50095m85647m47792l72407
10546B773150k55336k32520k12857j95059j61008k06984j10340j11135j14622
10537A173289q1909p8291n2046p0293p5950k9875m4548l1490m3510m2924m0539
10526E81914l8428j4769r15j9974k879j1224l4079k9280o208m529J7816j0322
10514D27123k2800P37l3217m5048r819J4173L6898r13j6225l4025r657j8533j7302
10501B71392j7750K5716N4816j0003l6562j8322j2285k270P885m440j9704Q631
10489B47104n0487K485Q990K1778J5190k4190k16K9543J2782j7139j8981k2617
$$ y = [18652444, 17379216, 16974210, 17249183, 17997497, 18686193, 18659542, 17513973, 15315206, 12660754, 10171636, 8171520, 6692458, 5552342, 4729091, 4078996, 3593349, 3145557, 2773150, 2517814, 2285294, 2072437, 1877378, 1716370, 1509386, 1399046, 1287911, 1173289, 1091380, 1013089, 961043, 890750, 814800, 784925, 740377, 708887, 665377, 622453, 581914, 543486, 528717, 527802, 507828, 504949, 493725, 459646, 430366, 424158, 419629, 437445, 427123, 404323, 405060, 371843, 326795, 316976, 331149, 368047, 367134, 350909, 316884, 307227, 288694, 271392, 253642, 279358, 334174, 324171, 287609, 269287, 257002, 254732, 262617, 258177, 238473, 247104, 196617, 199102, 208092, 229870, 245060, 220870, 220654, 250197, 262979, 245840, 226859, 204242]
10477B04242k3558L2018j6083J0198J2492J4784j7326J4912j6497j3480L651j7553
10465A87800L6049q098n545k1866m2761j3719J2956M6882L2133j1401r208j94
10453B03028M423l2843l4604K7374K466k9064m3491j3040R176K4218L9999L1867
10441A89509k2700j2034k1102o122J6503k581k3571J4626j8204n995j88N085n758
10428A07468P886J2773J4819n935l9160l186J8682o610j5851j527k3974k1779
10416D3606J7112M4635p288l6970k6337J7449K5563R89J0132J761j6226O066n39
10403G9953j5393j6797K3081R714J2379J175k5703j5490L2087M979l1685k791
10391E5509j7777m880K4862k1145k8158L2767J2754J5048J685j7217j9773j5938
$$ y = [204242, 180684, 212702, 196619, 206817, 219309, 234093, 216767, 231679, 215182, 201702, 205353, 187800, 223849, 215751, 210206, 188340, 145579, 131860, 144816, 191698, 223831, 212430, 203222, 203028, 207451, 174608, 140004, 167378, 169844, 140780, 97289, 84249, 93425, 117643, 157642, 189509, 166809, 154775, 133673, 127551, 144054, 141473, 117902, 132528, 114324, 108329, 108141, 113226, 107468, 115354, 128127, 142946, 137011, 97851, 94665, 113347, 106737, 90886, 89359, 65385, 43606, 60718, 105353, 98065, 61095, 34758, 52207, 77770, 78759, 88891, 90652, 74426, 80492, 79953, 64560, 47763, 70844, 80558, 92937, 94112, 68409, 52919, 85006, 89985, 58300, 55509, 37732, 32852, 57714, 36569, 8411, 41178, 53932, 68980, 70665, 53448, 33675, 17737]
10379A7737J1909M6511N2241K1444j2296l8434l2129o883k2159k1035L7545L5860
10367I0311m123j1569m944R832k9775L441J9986k5467l5057m929K8573M6369L1991
10354A14639m3653l2611j5675K3816k356J8085L252k2987l485q821L1444J2618
10342G4266k5942r625l0019K9083K5339J2926Q838j2311M604K694n3J1434k1115
10329G0119m1857m4493L974K3371K3492o532l0854K2242J3794n564J8276L5068
10317H1036P872j3888m3192j9829n630N2318R433k4146K8351k604k4797k5392
10305A9532l3986M4477N642n515N429l2052K626J9038j0633N540K3856j9484k1892
10292B578J7344L0520M0387L1383M090j7759j7775j7991k745j8801o972K2988
$$ y = [17737, 29646, 76157, 128398, 149842, 137546, 99112, 66983, 60100, 37941, 16906, 54451, 90311, 86188, 74619, 69675, 79507, 49732, 53173, 73159, 47692, 12635, 7706, 36279, 82648, 114639, 70986, 38375, 22700, 46516, 44160, 62245, 65497, 42510, 39025, 30204, 61648, 74266, 48324, 38699, 8680, 37763, 63102, 76028, 84866, 72555, 77159, 79853, 79800, 91234, 70119, 28262, -16231, -12257, 11114, 34606, 28074, -2780, 19462, 33256, 27692, 45968, 81036, 88908, 75020, 31828, 11999, 6369, 58687, 68120, 43974, 72325, 69721, 44924, 19532, -14454, 30023, 35665, 30150, 35579, 3527, 6153, 25191, 14558, 20098, 43954, 24470, 2578, 19922, 50442, 90829, 122212, 126302, 108543, 90768, 72777, 70032, 51231, 44259, 67247]
10280F7247j4934j2680k970J017k6093j2279n981l806l305K5643L2228m565l6460
10267C062l9561O32M4447Q120l2499j5408K5562P083k4884j0502M3181M985Q234
10254B2452J5515J6375r578p357J8733k0062j2529n578K851L529l9284L9654L9194
10241F3915JJ2616k3626l3714n793J2715L0488N22k3731k5117m4442j2297l943
10228e2406J5733O738N737M4724M999m382K6675J2168j791k2141L328L1697l3653
10215C7426K2480L9567j0309j116L5719K806p093J9075r063m1592K349r324m9
10202H0876k0114J1187j4624m5060j2237p69K3288M5608J1719r626j5785J5168
10190F9631K2391k0266j0336q873k1239j6779q44R503K1523M779j7962k5984M0296
$$ y = [67247, 52313, 39633, 36663, 37680, 11587, -692, -6673, -10479, -13784, 11859, 44087, 39522, 3062, -36499, -35867, 8580, 16700, -15799, -31207, -5645, 1438, -23446, -33948, 9233, 14218, 22452, 37967, 54342, 44764, 37407, 56140, 36078, 23549, 17971, 20822, 24351, -14933, 24721, 63915, 63916, 76532, 52906, 19192, 13399, 26114, 56602, 57124, 33393, 8276, -36166, -48463, -52406, -36673, -29935, -24198, 20526, 25525, 21143, 47818, 59986, 58195, 36054, 39382, 71079, 37426, 59906, 99473, 89164, 88048, 123767, 126573, 119480, 138555, 129492, 87900, 90249, 80925, 80876, 60762, 71949, 57325, 12265, 28, -741, 22547, 68155, 79874, 70248, 54463, 69631, 92022, 71756, 61420, 52547, 31308, 14529, 13685, 23188, 44711, 49490, 31528, 5544, 45840]
10177D5840Q769K136J4957K0786Q870L8398J4613q252L611j6420K6537K4297p634
10164A76508N4205J2954o2198l1736O550J1187K2611L7385k2235l6408m0518k4247
10152A04058K3689K5920J4059L6198P4785N1133J9688j5698j9436p0313q4430
10141A59653k2210j6126p714L0762P0741M8258L8060j3779J6810k6326n5412n0094
10129A72623l3807l4395k8885j1590K5912m591R558M562p00R059j9621o222j3911
10116F7992j0255l3537K0068r598N11J420K340J1170o996l7320k3632j4491k0383
10103e2711L2441Q7210L0363k6188k5344l0551k666k9561n2452L3341M0591M7439
10091E1912K0579k8034l5194J5668j0765J6969J0880J910l272k4863J3526q094
$$ y = [45840, 54609, 56745, 71702, 92488, 101358, 139756, 154369, 146117, 149728, 133308, 159845, 184142, 176508, 230713, 243667, 181469, 149733, 156283, 167470, 190081, 227466, 205231, 168823, 128305, 104058, 127747, 153667, 167726, 203924, 278709, 329842, 349530, 333832, 314396, 244083, 159653, 137443, 121317, 113603, 144365, 215106, 263364, 301424, 287645, 304455, 278129, 222717, 172623, 138816, 104421, 75536, 63946, 89858, 85267, 94825, 99387, 98687, 107746, 88125, 81903, 67992, 57737, 24200, 44268, 34670, 35181, 36601, 38941, 50111, 43115, 5795, -17837, -32328, -52711, -20270, 66940, 97303, 71115, 45771, 15220, 12554, -17007, -69459, -36118, 4473, 51912, 72491, 44457, 9263, 24931, 14166, 31135, 42015, 43925, 40653, 15790, 29316, 21222]
10079B1222k6855K6424k4510M675k4492M6781M0415j1179M5383k0535j8589l6818
10067B1922K0388M1101n8124o2677K1301J2771R905j6503J0345j5914R892k5860
10055c1453M810J9239P165R719K2377J8894k3676r989L388Q633N455J0970q751
10042C6781j0973l676j2514j0847K3380L1909k9453j1063k5702q060j4152K2191
10030a2179O1552L4574O51Q264o282m2719O027l0727j7115j1102J8413J6105L5123
10017F0585L2673m767J1317l1496l0301l0420k8126K4036K7123J0478K6526N650
10005G3278j2789l1865k9336K2795J1469K0235J5186m0187n5011j6780N1316L2155
9993D0466n0076P934J4171K7061K5921j3044O590J5002J1218l5150l1916J1452
$$ y = [21222, -5633, 20791, -3719, 956, -23536, 23245, 63660, 52481, 97864, 77329, 58740, 21922, 42310, 83411, 25287, -37390, -16089, -3318, 6587, -9916, 429, -15485, -5593, -31453, -26643, -7404, -239, 9480, 31857, 50751, 27075, 17086, 20474, 29107, 34562, 45532, 36781, 25808, 22132, 9618, -1229, 22151, 54060, 24607, 13544, -12158, -20218, -34370, -12179, 49373, 83947, 84598, 92862, 86580, 43861, 49888, 19161, 2046, -9056, 9357, 25462, 60585, 93258, 88491, 99808, 68312, 38011, 7591, -20535, 3501, 30624, 41102, 67628, 73278, 60489, 28624, -712, 22083, 33552, 53787, 68973, 28786, -26225, -43005, 8311, 40466, -9610, -1676, 12495, 39556, 65477, 52433, 59023, 74025, 85243, 50093, 18177, 29629]
9981B9629j3657k660j740J4251o47k5921o956k4022R340K8482j671R11M625J7418
9967B7382k6802N6266L7822K328M1204n459O80o878q392K124J935m0020m0327
9954D1863k9152K292j3067N2091k36R14J754J1540Q103m797N3351q147q737p935
9940I9837k426Q062j9613k2707j5673O575J4237k2522k3302q160K3076q000k2300
9927G084P772N7500l5369o1962j5102L2064P2748L0567j2657j7911k1422O6728
9915A10040M7759l6112n3327l5276J7504J5262l1381J3011P442j9288k4115j3692
9903b173k8621j2108Q389J5550K0513M510J5556J9403j768j2063j2792L6521M642
9890E5559Lj011n851k0027k762j0002k2514l954J3224o635j0013j3742l2991l4195
$$ y = [29629, 15972, 13312, 11572, 25823, 25176, -745, -7701, -31723, -22383, 6099, 4428, 5339, 9964, 27382, 580, 56846, 94668, 96996, 138200, 132741, 133421, 126543, 118151, 120275, 122210, 82190, 41863, 12711, 15003, 1936, 54027, 53791, 54705, 56459, 67999, 76102, 71305, 124656, 116509, 107772, 99837, 97411, 105473, 85860, 63153, 47480, 54055, 68292, 45770, 22468, 14308, 37384, 29384, 7084, 14856, 72356, 36987, -24975, -40077, -8013, 64735, 95302, 82645, 64734, 43312, 110040, 157799, 121687, 68360, 33084, 50588, 65850, 34469, 47480, 54922, 35634, 11519, -2173, -30794, -42902, -34513, -18963, 1550, 6060, 21616, 41019, 39251, 27188, 14396, 50917, 55559, 55562, 54551, 48700, 28673, 25911, 15909, -6605, -10559, 2665, -3970, -13983, -27725, -60716, -94911]
9876i4911k906K8648O2641J0029L3661o238j9063j816k854j697o469r080J8195
9863H140P319m880J9996q591k8630j5613M414M226J9715J9875L3093k810k5168
9850C1086j0546J7484m350j9236l116K472p71l3438Q132L8827K1513K4253n53
9837G1757l6579M895j2071k9175L9059J3821j5216l5448j9848J5448q338k0142
9825c1837K2387J4747K752J993J2603K4040j972L839j7527K5764J3292j742l6793
9812C1546o938n693L3985J4289j8535k6966j8813K0804J729l1587l933J7076m317
9799B647l4440J0497m8154j8450K4849J6752K5949K5941K7155j358k26j899Q900
9786C8163j8556m4330j7123R713K2925j3428J8458J2708M891N64m709J3642R362
$$ y = [-94911, -97817, -69169, -6528, 3501, 37162, 30924, 11861, 10045, 7191, 5494, -975, -10055, 8140, 15459, 10579, 30575, 21984, -6646, -22259, -17845, -13619, 6096, 25971, 59064, 56254, 31086, 20540, 38024, 33674, 14438, 11322, 13794, 13023, -20415, -12283, 26544, 48057, 72310, 71757, 35178, 40073, 28002, -1173, 37886, 51707, 36491, 1043, -18805, -3357, -11695, -31837, -9450, 5297, 8049, 10042, 22645, 46685, 44713, 48552, 31025, 56789, 70081, 68339, 31546, 24608, 18915, 52900, 67189, 48654, 21688, 2875, 23679, 25408, -6179, -10112, 6964, 2647, -31793, -21296, -69450, -87900, -63051, -46299, -20350, 5591, 32746, 31388, 31162, 29263, 38163, 19607, -24723, -41846, -32133, -9208, -22636, -4178, 8530, 13421, 13985, 9276, 22918, 32280]
9773C2280K401K953k5361k4865R315M0551M487j1329j9567o470K534k506j256
9760C167k0686J298J7913K2491q528J1799L3327J2074l1032N764R355j2216l7219
9747G507j4283l810k1960J9893J7860k3721j2595Q04K6251K1340Q633l0748k3771
9734b8600J4967q515j1267P1110K2007J9360L905l0921k7911N5K7944J9495j3197
9721E8432j7540j9698k5205K3776K1063j1623k813J8010J3282j562O193P852l548
9708F6619k4582m280l39j9571P30J4810l5878J9647J759L896q574p042k1685k0792
9694c5282K8785Q386j1480Q470J2909j4717k3820J5708j4347j5912o066n46J7269
9681c0643J5390m1343l6682J7737M1789J0930M0100K4225K0008r371K5308j8596
$$ y = [32280, 34681, 37634, 12273, -12592, -3277, 37274, 41761, 30432, 10865, 4395, 6929, 4423, 3167, -17519, -16221, 1692, 24183, 15655, 27454, 60781, 72855, 41823, 47587, 56942, 44726, 7507, -6776, -10586, -32546, -12653, 5207, -18514, -31109, -30305, -4054, 17286, 25919, -4829, -28600, -13633, -22148, -33415, 37695, 59702, 79062, 82967, 52046, 24135, 24190, 52134, 71629, 58432, 40892, 21194, -4011, 19765, 40828, 29205, 26392, 44402, 57684, 56122, 62315, 70167, 66619, 42037, 37757, 37418, 17847, 18577, 33387, -2491, 17156, 18915, 22811, 14237, 7195, -14490, -35282, -6497, 1889, -9591, -1121, 11788, -2929, -26749, -11041, -25388, -41300, -47366, -47912, -30643, -15253, -56596, -93278, -75541, -33752, -22822, 17278, 41503, 61511, 52140, 77448, 58852]
9669E8852l6906j2902Q778p264k0761o69L6785R683l320l241l0334p564J9643
9656A0780O543J7781L3479L4756J746r383o3046k4495M1368J5843k4655Q6668
9644A27385O9866L1553J2246n8927q0827n3249J2102k451K9571M876m6935p847
9632C7363K1825N52n1492n2525N4261O4451k3488k0828L127K1284j1204k6961
9620A6365k6218k128J0019K6985Q718L703m2335N385J7169Q118j2661K7266j885
9607C8501j7994p869o6271k8139J6721L8410J1481o019J343L5734K3253k6945
9595A2206K4879j0681l3715k0608N74K9581M257L680J7416J7946Q895l8158j6103
9582A69j039P350J2447J2723j0357k2488K0596J1626m881j0928P429J7655K105
$$ y = [58852, 21946, 9044, 17822, 10558, -10203, -10872, 25913, 35596, 32276, 29035, -1299, -8863, 10780, 17323, 35104, 68583, 103339, 105085, 95702, 32656, 8161, 49529, 65372, 40717, 127385, 197251, 228804, 241050, 182123, 101296, 48047, 60149, 57698, 87269, 92145, 45210, 37363, 59188, 59740, 8248, -44277, 9984, 74435, 50947, 30119, 33246, 54530, 43326, 16365, -9853, -11981, -1962, 25023, 33741, 37444, -4891, 494, 17663, 25781, 13120, 40386, 38501, 20507, 12638, -53633, -81772, -65051, -26641, -15160, -21179, -19836, 15898, 39151, 12206, 37085, 26404, -7311, -27919, -27345, 2236, 6493, 10173, 27589, 45535, 54430, 16272, 169, -870, 6480, 18927, 31650, 21293, -1195, 19401, 31027, 26146, 15218, 22647, 40302, 42407]
9569D2407l2989l8966j2129J7401K3783L0869J3813k6797l852K912l168J9594
9557C2878K9989j3199l4908n808l9173R308k9626L861n504L0300J3872K4101q831
9544G260j8169J8334L3198l4453m5719P07K8067O084L4149l0992q582J8712r595
9531i99J9218J2774k26l7982k5979J8556J4163j4724k883J9619J5410M1676P024
9518F5647l5956k923Q658M247j8745j9384p383o024L2074P924L893l2208j0255
9505a0435J5022J3781M546J2719L536l8458J4969J0159J5415J8166o534k4149
9493B8737P507J4664M576L34k5162j0853p798p165J9249J1270j4625l1403j4891
9480b5560Q369k9473j0154J340J612L3388K8639k6598J3197q31k4877k6602K6448
$$ y = [42407, 9418, -29548, -41677, -24276, -493, 30376, 44189, 17392, 13540, 16452, 13284, 32878, 62867, 49668, 14760, 8952, -30221, -20913, -50539, -46678, -52182, -21882, -8010, 16091, 7260, -10909, 7425, 40623, 6170, -39549, -38842, -10775, -4691, 29458, -1534, -10116, 8596, -999, 18219, 30993, 30767, -7215, -33194, -14638, -475, -15199, -18082, 1537, 16947, 58623, 65647, 29691, 26768, 35426, 39673, 20928, 1544, -5839, -11863, 20211, 28135, 32028, -180, -10435, 4587, 18368, 22914, 35633, 39169, 711, 15680, 25839, 41254, 59420, 52886, 28737, 36244, 50908, 55484, 55818, 30656, 19803, 12005, 4840, 24089, 35359, 20734, -10669, -25560, -17191, -46664, -56818, -55478, -53866, -20478, 8161, -18437, -5240, -6071, -30948, -57550, -31102]
9467c1102O0160K3025l3575l1884q328l5539J6525K316p266L4769K2029l9467
9455b8337J1458R878K1624L003k4135k2293l2422K1664M8193j844o159L910m8991
9442d4451j2848L5216j888J3939L368L6627L3063m290j7083l045K4400K859P926
9429G3793j3413l8636j9013K3221K3719J7525k4845k3738J6891L9142j3024K4252
9417H5874l1113o669m5719o488L1716L6444l1848k4480O332l2801K4766M6466
9405E2480J319k913j5380P565q645O358l1698J3241L2953l9655m3108j88Q459
9392a9212l1003k0939j7851K0332N014K5382M5953J3695J8550j8134j7923j8948
9380a5084q291J6280M0210Q258j2103j8696r355O38n382J3097J0011j3536p731
$$ y = [-31102, 29058, 52083, 18508, -13376, -21704, -57243, -40718, -38402, -45668, -10899, 11130, -28337, -16879, -7001, 14623, 17626, -6509, -28802, -61224, -39560, 8633, 6789, 630, 4540, -44451, -57299, -22083, -23971, -10032, -6664, 29963, 63026, 58736, 41653, 38608, 63008, 65867, 73793, 60380, 21744, 2731, 25952, 49671, 67196, 42351, 18613, 35504, 74646, 61622, 85874, 54761, 48092, 2373, -4115, 27601, 64045, 32197, 7717, 14049, -18752, 6014, 52480, 53799, 50886, 35506, 43071, 34426, 40784, 9086, 22327, 55280, 15625, -27483, -27671, -19212, -50215, -71154, -89005, -68673, -63659, -38277, 7676, 21371, 39921, 21787, 3864, -15084, -23375, -7095, 33115, 41373, 29270, 10574, 1219, 1857, -3525, 9572, 19583, 6047, -1684]
9367a684J6652J4280j3977k256M7282q421m2404J7088k3334m8675j4136M5305
9355a4280o734l748L0899J4869q794J1781L0494k0062k3767k7977K3514K0255
9343B6450N998K0358J3364n1515n7181J9470j4332L5941K7366k9656j9726L384
9331b0079m053J991K2501J1346o162m805n313l877j229K0724j3733l3793J2507
9318b3975K3323q940L1413l461k2464Q780l299k4418q680L5343J2244k7946J7314
9305E234M4528J3149k649m8737R664K8564k6283j0366j7290R859j4879k1919K972
9292b8153k3558j7802L2021K2193J3221J3988J9308L5862M0705j223J128N298
9280A12988q748j9728l4261j8124P444l8182j9595N61k0043k176o684L8368q30
$$ y = [-1684, 14968, 29248, 15271, 13015, 60297, 51876, 9472, 26560, 3226, -45449, -59585, -14280, -21014, -24762, 6137, 21006, 12212, 23993, 54487, 34425, 10658, -17319, 6195, 26450, 32448, 52806, 66170, 14655, -42526, -23056, -37388, -1447, 25919, -3737, -23463, -20079, -24132, -22141, 360, 11706, 5544, 739, -4574, -8451, -9680, 11044, -2689, -36482, -23975, -652, -9592, 21821, 18360, -4104, 4676, 1377, -23041, -31721, 3622, 15866, -12080, 5234, 49762, 62911, 60262, 11525, 21189, 49753, 23470, 13104, -4186, 5673, -9206, -31125, -28153, -51711, -69513, -37492, -15299, -2078, 11910, 31218, 67080, 107785, 106562, 107690, 112988, 104240, 84512, 50251, 32127, 39571, 1389, -18206, -17645, -37688, -39864, -46548, -8180, -9010]
9267i010K8692K7418K3642j1089l4756k3902J6104Q285l11K1487O333k6484J1749
9254C8158K1844l7692j9046R210l4457r983j3083K8197K7404k3216k4426P203
9242b9887M2293K5308m1293q350m126k2652J5942J7434l8486k4464K5451K3482
9230a9348J1427j279q496J774J5777K6867K2905m650k2289O389M797j9424k7339
9217a2889j094R650J0367K1216j2148K585j8433Q340O169l3793R608K6586j9005
9204b841r820R829R107r62K6331N572k7148R471l516l4132k7349l5769J7218N8708
9190e301J5031M0205J424l04l4967j3504J2772k8380j746j2218L524K0643J807
9177a014r315p34J1174N992l3931Q918L9858j9953m1905J4715K914K8899J5014
$$ y = [-9010, 19682, 47100, 70742, 59653, 24897, 995, 17099, 25384, 25073, 46560, 52893, 26409, 38158, 60002, 22310, 3264, 12474, -21983, -31966, -45049, -16852, 10552, -12664, -37090, -29887, 12406, 37714, -3579, -11929, -16055, -38707, -22765, -5331, -43817, -68281, -42830, -19348, -7921, -9200, -17696, -15922, -145, 26722, 49627, 44977, 22688, 29077, 33874, 14450, -12889, -13983, -4333, 6034, 27250, 15102, 17687, -746, 7594, 13763, -20030, -10422, 16164, -2841, -12661, -2832, 6275, 5313, 31644, 37216, 10068, 19539, 16023, -18109, -45458, -81227, -64009, -5301, 9730, 49935, 51359, 51055, 16088, 2584, 15356, -13024, -14770, -26988, -23464, -2821, -1014, -10329, -11063, 111, 6103, -27828, -18910, 20948, 995, -40910, -26195, -23281, 5618, 20632]
9164B0632J7987K314M4618j3477m1588L27J3794K4566j1794q028m2969j4865l6
9151h519k4930L2827M4485J1317K7680k1901p4305m4171L9861L2588L189j7873
9139B48j288J5768j6844k8776J450R317j1072j917K4219P0K7892k036P351n342
9125A9040L2266n663l8000J7617L0267k3577m5552J5L5437o741m5314J1806L1694
9112A3295N567m876K5892J6062Q008n2088m7554q18o123J0811M8794L4369m288
9099D7051l8866j3606J7498J1329J1298k4419m4712L3928o219j2666J2231J7993
9087A0840l080j9787j9988K9700o92j8926K9015j848l8461k5294P512R099K3253
9074a8657K5111K0750K9053j68l4183l2609j8871j139J8951L4083J9813J1795
$$ y = [20632, 38619, 40933, 85551, 72074, 30486, 30813, 44607, 69173, 57379, 49351, 6382, -8483, -8519, -33449, -622, 43863, 55180, 82860, 60959, -13346, -57517, -17656, 14932, 18121, 248, -1040, 14728, -2116, -30892, -29442, -20125, -31197, -33114, -8895, -8825, 19067, 17031, 24382, 19040, 51306, 45643, 7643, 25260, 55527, 31950, -13602, -13587, 21850, 15109, -30205, -18399, 13295, 18862, 13986, 39878, 55940, 63948, 11860, -35694, -36512, -42635, -31824, 16970, 51339, 47051, 8185, -5421, 12077, 23406, 34704, 10285, -34427, -499, -6718, -19384, -7153, 10840, 7760, -12027, -32015, -2315, -3007, -21933, 7082, 5234, -33227, -58521, -51009, -41910, -18657, 6454, 27204, 56257, 56089, 21906, -10703, -29574, -30713, -11762, 22321, 42134, 53929]
9062E3929J1977j8403n707j6452J7475P310K2324j1258o3180k7970n554j4798
9050e0307K3179R503j1540j0044J4864r73j3355J3673K1535k7990j852J3650j5320
9037c4977k7600K5091j9440j9037j9177K5532J5787J7404k785j3705K9465O2233
9025C8791K1688p469j391m076k0248N041J1282r925l016q244m0846J1914J1421
9012D922R506K8300j439k7816k0380k5224K8673J317l2968M1445N7000j405k5237
8999C6694q465O95k0772j9791k3377n392m8341k881K5764N690K4139K6232r688
8986a9493N971O995L2817K602j1239K7807M028K553J6296k0104m2348J3961k5348
8973e502M384Q439j4971K3862K1358l9127r525P88k2116o49p540J1676k217M9160
$$ y = [53929, 65906, 47503, 41796, 25344, 42819, 50129, 72453, 61195, -1985, -29955, -35509, -50307, -27128, -17625, -29165, -39209, -24345, -25318, -38673, -25000, -3465, -31455, -33307, -19657, -34977, -62577, -37486, -56926, -75963, -95140, -69608, -53821, -36417, -39202, -52907, -23442, 38791, 60479, 53010, 51619, 47543, 27295, 32336, 43618, 33693, 30677, 22433, -18413, -6499, 4922, 14428, 42728, 41289, 13473, -6907, -32131, -3458, -2141, -35109, 6336, 63336, 61931, 36694, 28229, 28924, 8152, -11639, -35016, -40408, -88749, -91630, -65866, -60176, -36037, -9805, -19493, -13522, -6527, 26290, 28892, 17653, 45460, 49488, 52041, 68337, 48233, 5885, 19846, -5502, -1118, 7321, -7650, 16212, 37570, -1557, -11082, -10294, -32410, -33059, -40599, -28923, -31140, 18020]
8959A8020L0639k9522O557k7474n154K4277j6827R954J7290j0248R090J3887j8767
8946B1722K7013J0210J1101P996k3988j4699K111J0548k6213K3722j732j7688
8934C0103j6888l8314J7638K8703p670K8713L557k2244m873J1102O5m841j5778
8921I273l0991L3171m5804k2442l174L1581j8335p123L2508L4507J6979m597j6699
8908H854j6512N749n6J1756O092r89K0143K1185J655k6818j5839n8059N030n592
8894d3401j2920m1681L213L0868L5805L4726K416J6476J6201l304J1762K341k0030
8881C2472l3515k8354k7308K31M9858K7781J2653k2899m0779o986N293L3320J9243
8868B1010k1155K5717K2262k7801k7083J6126j2242r993J5502L6974K6212m192
$$ y = [18020, 48659, 19137, 25694, -1780, -6934, 17343, 516, 10470, 27760, 17512, 26602, 40489, 21722, 48735, 58945, 70046, 78042, 54054, 39355, 41466, 52014, 25801, 49523, 47791, 30103, 13215, -25099, -7461, 21242, 13572, 42285, 45842, 23598, 18725, 29827, 29892, 25051, 9273, -21718, 11453, -34351, -56793, -59967, -28386, -46721, -53844, -21336, 13171, 30150, 25553, 8854, -7658, -1909, -1965, 9791, 15883, 14894, 35037, 56222, 57877, 31059, 15220, -42839, -37809, -43401, -56321, -98002, -94789, -63921, -28116, 6610, 9026, 25502, 41703, 38399, 50161, 52502, 32472, -1043, -29397, -56705, -56474, -6616, 21165, 33818, 10919, -29860, -36846, -31553, 1767, 21010, -145, 25572, 47834, 20033, -7050, 9076, -3166, -13159, 2343, 39317, 65529, 61337]
8856F1337l8143j712J4094L3026j5930n8784K1625L0367l8640P214L0878m0024
8844E308K2532R726l0236p111m827j3044L1944J3954k8903P287M481j1047J1126
8831A1190p482J5422N1440K7319p5860m4294k6723r895J1808K3490J2919J7689
8819G023J2985N3226k494m9370j3827q687m800J2534k5663l2202J0034K1533J9344
8806c64r294k5235p3L2199M6891j9673J823J6315j852k1800k4737J216K702p3
8792a955m4216j6957l5454L508L6431M3852K6716k119k9179k0245j8419O972J687
8779d9378k9132J202M8177J9165K770l7676j5210O90l490K4414J3717J1896K865
8766i990J5000N0129k2327j1999o734J752M014k9112o2203r534L0237J4988J3117
$$ y = [61337, 23194, 21482, 35576, 68602, 52672, -6112, 15513, 45880, 7240, 14454, 45332, 5308, 27840, 37566, 7330, 219, -4608, -17652, 14292, 28246, -657, 6630, 11111, 64, 11190, 3708, 19130, 70570, 97889, 22029, -22265, -48988, -58883, -47075, -23585, -10666, 7023, 20008, 73234, 70740, 21370, 7543, -1144, -5944, 6590, -19073, -51275, -41241, -19708, -364, -9658, -34893, -34966, -2767, 44124, 24451, 26274, 42589, 40737, 18937, -5800, -4584, -1882, -1955, -46171, -63128, -98582, -95074, -58643, -14791, 11925, 9806, -19373, -39618, -58037, -51065, -49378, -78510, -77308, -29131, -9966, -7196, -44872, -60082, -59392, -62882, -38468, -24751, -12855, -9990, 5010, 55139, 32812, 20813, 14079, 15831, 19845, -9267, -71470, -81004, -50767, -35779, -22662]
8753b2662j349l3292j3114M8531K7692k7352n86R764R418m673K5903K7753n6715
8740a0682m0611M838j0598P063M5263J9380k3630j5417n969N643k2869j0853j1310
8727f9752j8837K2627L054J7015L4129K5135M517j9975p92K568L337K5982K756
8714C1764j864p214J8292L3843l7346n9210r775J6508K853K4606L4335r413m5848
8701h469p790K653N3901L8707K125j1192J7396j4197k5676o943o525k4452L3829
8688D3367M1113j4696m2762n529L513L4974L433l4033l2628M707L7471J1539j9109
8675C1360j7349k148q052R403R352j5151m64K3375J7643l566j5246j4909j5529
8662a281J2342j5811K6525l662k7115J333O679J447K2337k7766j6665N109m027
$$ y = [-22662, -24011, -57303, -70417, -21886, 5806, -21546, -22132, -12368, -2950, -7623, 18280, 46033, -10682, -51293, -46455, -57053, -49990, -4727, 14653, -8977, -24394, -30363, -24720, -47589, -58442, -69752, -88589, -65962, -62908, -45893, -11764, 13371, 17888, -2087, -2879, -311, 3026, 29008, 31764, 29900, 22686, 40978, 74821, 37475, -21735, -31510, -15002, -12149, 12457, 46792, 37379, -8469, -16259, -13606, 40295, 79002, 81127, 69935, 87331, 73134, 47458, 40515, 33990, 9538, 43367, 84480, 69784, 27022, 21493, 25006, 59980, 63413, 29380, -3248, 1459, 38930, 50469, 31360, 14011, 11863, 3811, 13214, 22566, 7415, 6951, 30326, 47969, 44403, 29157, 14248, -1281, 11061, -4750, 21775, 18113, -9002, -7669, -990, 457, 22794, -4972, -21637, -16528, -20555]
8649b0555K0494J4746L9973J2759l3696l7888M373K7509K00j6312K1309J5665
8637D8577N56J7856O293o096K9730p840J3704K5941o3125l5573L3582N726m2322
8624B7009m3920Q544k147N865L5322Q693j0677k1442j996j501O312J1981J3880
8611C5923K4524k4707j1998J7036r801k7144o538m0998K3662J2444p160m087L6196
8598A7352J9885k779r147K3937k9835l9079q888J4193K3396k1267k166p602L6059
8585A4059K8531M7221m8662k2729K652k65K5003K0852m3529m9673K0274K1832
8573A5566J5798K4564J9824r975j5477k4572j0970M614N402N176o961j2665p534
8560B790K3121J4789k0513J601K2078K58j4137k8802l3202J1350K3627O017L737
$$ y = [-20555, -61, 14685, 54658, 67417, 33721, -4167, 206, 27715, 27915, 11603, 32912, 48577, 49133, 66989, 73282, 67186, 96916, 89076, 102780, 128721, 65596, 30023, 63605, 69331, 27009, -16911, -8367, -10514, -4649, 30673, 39366, 28689, 7247, 5251, 3750, 10062, 22043, 35923, 60447, 35740, 23742, 40778, 30977, 3833, -2705, -43703, -20041, -7597, -14757, -18844, 17352, 37237, 34458, 25311, 49248, 19413, -19666, -28554, -14361, 9035, -12232, -14398, -22000, 14059, 42590, 89811, 41149, 18420, 21072, 20807, 45810, 66662, 23133, -26540, -6266, 15566, 31364, 55928, 75752, 65777, 50300, 25728, 14758, 19372, 24774, 29950, 22989, 10324, 2790, 25911, 40700, 20187, 21788, 43866, 44124, 29987, 1185, -32017, -20667, 2960, 8977, 12714]
8547A2714O645K518N321r817l2920o744m4151r334K4004j3563J2522M1187j6445
8534b8063k0547J6132M0257K0526l6702l0852J8628o111j6056L4125Q281M893
8522D511J0979K4191K8770l9855k0274K996R097m4296q349L053J7984j1096j6744
8509c9033k5069j9757M217J9479O4164L4244M528k6111L0130j9682m7441k984
8497b3315P807J905l2915k9637J1993M6060K5566J7002k9328m8796J8144M0654
8485E140K9319L7954j2184n648j4060k2237j3124O107m73J4071K9296L2365M0270
8472A26796j5436r0837n5542P687K8671J0865r779k81j2548k6270O381J9446K0242
8459I395J179l195K2268J6176J1434j2738J9732R042l4757j4676j7055j3368n771
$$ y = [12714, 19359, 21877, 27198, 17381, -15539, -22283, -66434, -75768, -51764, -65327, -52805, -11618, -28063, -48610, -32478, 7779, 28305, -8397, -39249, -20621, -26732, -42788, -8663, -382, 4511, 15490, 39681, 68451, 28596, 8322, 11318, 20415, -23881, -32230, -29177, -11193, -22289, -39033, -64102, -83859, -79642, -60163, 4001, 38245, 42773, 16662, 46792, 27110, -20331, -23315, -15508, -13603, -46518, -76155, -64162, -18102, 7464, 24466, -4862, -53658, -35514, 5140, 34459, 72413, 60229, 54581, 40521, 18284, 5160, 11267, 10794, 24865, 54161, 86526, 126796, 111360, 20523, -35019, -27332, 1339, 12204, 2425, 2144, -10404, -36674, -30293, -10847, 9395, 10574, 7379, 29647, 45823, 57257, 44519, 64251, 73293, 38536, 23860, 6805, -6563, -12334]
8446a2334J9445P047l1420j7800K3146K8311K8517J8661j4297Q998j0541o5335
8434a7602k7676L66M0714r430M061L0222k4973N6555K2506j3283p102l4027j7695
8421B636L0941K5926j8444K2663m1139J756J6223O65j5216j1016J4971K0094K2084
8408G2144O697p124m993L1848j7368n1712l6453m3645K2315J7216k1880K6885
8396f070k5049P721K0242n555K404K8891L913j3511j5915k930M5534l616m0226
8383d167k5117P738K3844J9516J0298MK9876J753j2167m1852p223K0124j5417
8370G210j5094J3525Q297O179J1139L836J3227l4511m4675J034K3557k353j7420
8357b6049l1852N603n39Q916K7282J5759N443r07M863J0159J2026m3053k2242
$$ y = [-12334, 7111, 14158, -17262, -35062, -11916, 16395, 44912, 63573, 49276, 58274, 47733, -17602, -45278, -44912, -4198, -13628, -9567, 20655, -4318, 52237, 74743, 61460, 54358, 20331, 2636, 33577, 59503, 41059, 63722, 22583, 24339, 40562, 41227, 26011, 14995, 29966, 50060, 72144, 78841, 71717, 66724, 98572, 81204, 29492, -6961, -50606, -28291, -11075, -32955, -6070, -31119, -23398, -3156, -8711, -6307, 22584, 26497, 12986, -2929, -5859, 39675, 36059, -4167, -29284, -21546, 2298, 21814, 32112, 32116, 61992, 63745, 51578, 9726, 2503, 22627, 7210, -7884, 5641, 13938, 20117, 31256, 35092, 48319, 13808, -30867, -29833, -6276, -8629, -26049, -57901, -52298, -52837, -43921, -16639, -880, 4563, 3656, 8519, 18678, 30704, -12349, -34591]
8344c4591l3425K1150J2206k279l771p983k2207J6111N9103M0136m337k4485K0942
8331C6570J3184m8888l214K3322Q789m696m557Q68L130j9394n5348r4N0102J4998
8317A4772K2287J6300q012j8469l3050L2215o753l1538j4417R256J7508r225k1362
8304c0488j1520J2803K547K2762J5364r043R917q876J336p128k2588k859J7762
8291a0011P648p790k2680l2658R146L1545K8670L9421M3994J2257J7216J7948
8279A34706J8916P0112J26433K50093L26953J28490j84372l53426k15187q2986
8269B19732l2144n4379p2300k7252n761m189M533L1860k5944L181K4512m790n209
8256E1850j2667j3735J0621M461j4521j9553K826J2864l1351N44J5678J4606M1053
$$ y = [-34591, -68016, -46866, -34660, -36939, -40710, -48693, -70900, -54789, 4314, 44450, 40113, 15628, 36570, 49754, 866, -2348, 20974, 29763, 25067, 20510, 21378, 24508, 5114, -50234, -50328, -226, 14772, 37059, 53359, 45347, 26878, -6172, 26043, 19290, -12248, -26665, -17409, 99, -9126, -30488, -42008, -29205, -26658, -3896, 11468, 2425, 12342, 3466, 4802, -2326, -24914, -27773, -10011, -2363, -10153, -32833, -65491, -56345, -24800, 3870, 43291, 87285, 99542, 116758, 134706, 153622, 223734, 350167, 600260, 927213, 1055703, 871331, 517905, 302718, 219732, 187588, 133209, 60909, 33657, 27896, 23707, 28240, 60100, 34156, 37337, 61849, 57059, 51850, 39183, 25448, 36069, 40530, 26009, 6456, 9282, 22146, -9205, -8661, 7017, 21623, 62676]
8243F2676L4819J953N424L9844J61200J76995K48336J96201k5848k67169k71980
8232C62451j50867j19147k0221k2294k3616j8089J4938M2549Q430l457j4237k9232
8220B7208k2766q839K257R721k4418K0922O882m6658k376N1465L7495N25m402
8207D7016l4840k5108p3012K4372M3021M2693k552j3440l9578k0750P183K3899
8195b1096K801m4317m4182M6971P0625L6434j6133l0277r885J0969K4324K9942
8183E6176M084k4988L655j7647m3158j62L9M526M2775j0486l0954O524J1693J1042
8169A3119J1730k3657j6466K6185J4720k681k5128j6964L5126L4142l4646m6361
8157c0881j1836K1104J3064j4532j0431J6473K8422k467k3215L856O423K8193
$$ y = [62676, 97495, 99448, 104872, 144716, 305916, 482911, 731247, 927448, 901600, 634431, 362451, 211584, 92437, 72216, 49922, 26306, 8217, 23155, 65704, 74134, 70677, 56440, 27208, 4442, -4397, -2140, 7581, -16837, 4085, 10967, -35691, -38067, 13398, 50893, 51418, 47016, 12176, -12932, -85944, -61572, -18551, 24142, 21590, 8150, -31428, -52178, -44995, -21096, -18295, -62612, -106794, -59823, 10802, 47236, 31103, 826, -9059, 1910, 26234, 56176, 60260, 35272, 38927, 21280, -21878, -22040, -22001, -17475, 25300, 14814, -16140, -9616, 2077, 13119, 24849, 1192, -15274, 10911, 25631, 22950, -2178, -19142, 15984, 50126, 15480, -30881, -42717, -21613, -8549, -23081, -33512, -17039, 11383, 8916, -14299, -10443, -4020, 24173]
8145B4173M0977j0966n1521J1244l2419k5133L4529M6564J2241j635J4785J9680
8133H2519k6707m4071j9821M856K6011K3854R935j1110J2551k7086j8478K052
$$ y = [24173, 65150, 54184, 2663, 13907, -18512, -43645, -9116, 37448, 49689, 48054, 62839, 82519, 55812, 11741, -8080, -3224, 22787, 46641, 56576, 45466, 58017, 30931, 12453, 14505]
$$ [...]
##END NTUPLES=NMR SPECTRUM
##END=
