##TITLE=Analysis number 316443
Compound Code mo 07111
Project Code adrs
Chemist Name vekton
##JCAMPDX= 6.0         $$ Bruker NMR JCAMP-DX V2.0
##DATA TYPE= NMR SPECTRUM
##DATA CLASS= NTUPLES
##ORIGIN= Bruker BioSpin GmbH
##OWNER= nmr
$$ XWIN-NMR		Version 3.5
$$ Mon Jan 16 09:22:35 2006 GMT Standard Time (UT+0h)  MAYBRIDGE\nmr@NMR_250MHZ
##.OBSERVE FREQUENCY= 250.131544655141
##.OBSERVE NUCLEUS= ^1H
##.ACQUISITION MODE= SIMULTANEOUS (DQD)
##.ACQUISITION SCHEME= undefined
##.AVERAGES= 16
##.DIGITISER RES= 18
##SPECTROMETER/DATA SYSTEM= dpx250
##.PULSE SEQUENCE= zg30
##.SOLVENT NAME= CDCl3
##.SHIFT REFERENCE= (INTERNAL, CDCl3, 0, 16.522)
##AUDIT TRAIL= $$ (NUMBER, WHEN, WHO, WHERE, WHAT)
$$ ##TITLE= Audit trail, XWIN-NMR		Version 3.5
$$ ##JCAMPDX= 5.01
$$ ##ORIGIN= Bruker BioSpin GmbH
$$ ##OWNER= nmr
$$ C:\u/data/dgb/nmr/ADRS/14630/pdata/1/auditp.txt
$$ ##AUDIT TRAIL=  $$ (NUMBER, WHEN, WHO, WHERE, WHAT)
(   1,<2006-01-16 09:21:47.07 +000>,<MAYBRIDGE\nmr>,<NMR_250MHZ>,
      <created by zg, POWCHK disabled, PULCHK disabled
       configuration hash MD5:
       62 19 C7 07 E1 42 D1 B7 37 6C 3D D0 77 39 F9 E6
       data hash MD5: 64K
       7F A4 87 B1 2B 61 6D 73 B1 5D 98 B2 9B C4 84 2B>)
(   2,<2006-01-16 09:22:13.87 +000>,<MAYBRIDGE\nmr>,<NMR_250MHZ>,
      <Start of raw data processing
       ef LB = 0.3 FT_mod = 6 PKNL = 1 SI = 32K 
       data hash MD5: 32K
       D3 5A 83 40 25 E0 A2 BE D3 0C 7C EF A7 25 ED D4>)
(   3,<2006-01-16 09:22:16.37 +000>,<MAYBRIDGE\nmr>,<NMR_250MHZ>,
      <apk 
       data hash MD5: 32K
       DD 2D A9 AF ED D8 A3 04 94 6A D9 35 46 10 6E 74>)
(   4,<2006-01-16 09:22:17.48 +000>,<MAYBRIDGE\nmr>,<NMR_250MHZ>,
      <abs ABSG = 5 
       data hash MD5: 32K
       31 4C 7F 14 C9 78 CD 5E 8D F3 8F 8A 8F 51 93 81>)
$$ ##END=
$$ 
$$ hash MD5
$$ 30 2D B9 C6 6B B5 92 AA 9D 42 B9 16 15 7D A4 D5
##$RELAX= 
##$RELAX= 
##$RELAX= 
##$RELAX= 
##$RELAX= 
##$RELAX= 
##$RELAX= 
$$ Bruker specific parameters
$$ --------------------------
##$DU= <C:\u>
##$EXPNO= 14630
##$NAME= <ADRS>
##$PROCNO= 1
##$TYPE= <nmr>
##$USER= <dgb>
##$AMP= (0..31)
100 100 100 100 100 100 100 100 100 100 100 100 100 100 100 100 100 100 
100 100 100 100 100 100 100 100 100 100 100 100 100 100 
##$AQSEQ= 0
##$AQ_mod= 3
##$AUNM= <au_zg>
##$AUTOPOS= <7 >
##$BF1= 250.13
##$BF2= 250.13
##$BF3= 250.13
##$BF4= 250.13
##$BF5= 500.13
##$BF6= 500.13
##$BF7= 500.13
##$BF8= 500.13
##$BYTORDA= 1
##$CFDGTYP= 0
##$CFRGTYP= 5
##$CHEMSTR= <none>
##$CNST= (0..31)
1 1 145 1 1 1 1 1 1 1 1 1 1 1 1 1 1 1 1 1 1 1 1 1 1 1 1 1 1 1 1 1 
##$CPDPRG= <>
##$CPDPRG1= <>
##$CPDPRG2= <>
##$CPDPRG3= <>
##$CPDPRG4= <mlev>
##$CPDPRG5= <mlev>
##$CPDPRG6= <mlev>
##$CPDPRG7= <mlev>
##$CPDPRG8= <mlev>
##$CPDPRGB= <>
##$CPDPRGT= <>
##$D= (0..31)
0 1 0 0 0 0 0 0 0 0.06 0 0 0 0 0 0 0.0002 0 0 0 0 0 0 0 0 0 0 0 0 0 0 
0 
##$DATE= 1137403304
##$DBL= (0..7)
120 120 120 120 120 120 120 120 
##$DBP= (0..7)
150 150 150 150 150 150 150 150 
##$DBP07= 0
##$DBPNAM0= <>
##$DBPNAM1= <>
##$DBPNAM2= <>
$$ [...]
##$SUBNAM7= <"">
##$SUBNAM8= <"">
##$SUBNAM9= <"">
##$SW= 20.6930455092707
##$SWIBOX= (0..15)
0 0 3 0 0 0 0 0 0 0 0 0 0 0 0 0 
##$SW_h= 5175.983436853
##$TD= 65536
##$TD0= 1
##$TE= 294.16
##$TE2= 300
##$TE3= 300
##$TEG= 300
##$TL= (0..7)
0 120 120 120 120 120 120 120 
##$TP= (0..7)
150 150 150 150 150 150 150 150 
##$TP07= 0
##$TPNAME0= <>
##$TPNAME1= <>
##$TPNAME2= <>
##$TPNAME3= <>
##$TPNAME4= <>
##$TPNAME5= <>
##$TPNAME6= <>
##$TPNAME7= <>
##$TPOAL= (0..7)
0.5 0.5 0.5 0.5 0.5 0.5 0.5 0.5 
##$TPOFFS= (0..7)
0 0 0 0 0 0 0 0 
##$TUNHIN= 0
##$TUNHOUT= 0
##$TUNXOUT= 0
##$USERA1= <user>
##$USERA2= <user>
##$USERA3= <user>
##$USERA4= <user>
##$USERA5= <user>
##$V9= 5
##$VALIST= <valist>
##$VCLIST= <CCCCCCCCCCCCCCC>
##$VD= 0
##$VDLIST= <DDDDDDDDDDDDDDD>
##$VPLIST= <PPPPPPPPPPPPPPP>
##$VTLIST= <TTTTTTTTTTTTTTT>
##$WBST= 1024
##$WBSW= 4
##$XGAIN= (0..3)
0 0 0 0 
##$XL= 0
##$YL= 0
##$YMAX_a= 595680
##$YMIN_a= -353255
##$ZGOPTNS= <>
##$ZL1= 120
##$ZL2= 120
##$ZL3= 120
##$ZL4= 120
##$ABSF1= 16.522
##$ABSF2= -4.171173
##$ABSG= 5
##$ABSL= 3
##$ALPHA= 0
##$AQORDER= 0
##$ASSFAC= 0
##$ASSFACI= 0
##$ASSFACX= 0
##$ASSWID= 0
##$AUNMP= <proc_1d>
##$AZFE= 0.1
##$AZFW= 0.1
##$BCFW= 0
##$BC_mod= 0
##$BYTORDP= 0
##$COROFFS= 0
##$CY= 12.5
##$DATMOD= 1
##$DC= 0
##$DFILT= <>
##$DTYPP= 0
##$F1P= 14.0000005364418
##$F2P= -0.99999901652339
##$FCOR= 0.5
##$FTSIZE= 32768
##$FT_mod= 6
##$GAMMA= 0
##$GB= 0
##$INTBC= 1
##$INTSCL= 1
##$ISEN= 128
##$LB= 0.3
##$LEV0= 0
##$LPBIN= 0
##$MAXI= 10000
##$MC2= 0
##$MEAN= 0
##$ME_mod= 0
##$MI= 0
##$NCOEF= 0
##$NC_proc= -5
##$NLEV= 6
##$NOISF1= 0
##$NOISF2= 0
##$NSP= 0
##$NTH_PI= 0
##$NZP= 0
##$OFFSET= 16.522
##$PC= 1
##$PHC0= 82.94735
##$PHC1= 7.021409
##$PH_mod= 1
##$PKNL= yes
##$PPARMOD= 0
##$PSCAL= 4
##$PSIGN= 0
##$REVERSE= no
##$SF= 250.13
##$SI= 32768
##$SIGF1= 0
##$SIGF2= 0
##$SINO= 400
##$SIOLD= 32768
##$SREGLST= <1H.CDCl3>
##$SSB= 0
##$STSI= 32768
##$STSR= 0
##$SW_p= 5175.98343685301
##$SYMM= 0
##$S_DEV= 0
##$TDeff= 65536
##$TDoff= 0
##$TI= <Analysis number 999999
Compound Code 99
Book Reference 9
Project Code 9>
##$TILT= no
##$TM1= 0
##$TM2= 0
##$TOPLEV= 0
##$USERP1= <user>
##$USERP2= <user>
##$USERP3= <user>
##$USERP4= <user>
##$USERP5= <user>
##$WDW= 1
##$XDIM= 32768
##$YMAX_p= 362727382
##$YMIN_p= -539335
$$ End of Bruker specific parameters
$$ ---------------------------------
##NTUPLES= NMR SPECTRUM
##VAR_NAME=  FREQUENCY,     SPECTRUM/REAL,   SPECTRUM/IMAG
##SYMBOL=    X,             R,               I
##VAR_TYPE=  INDEPENDENT,   DEPENDENT,       DEPENDENT
##VAR_FORM=  AFFN,          ASDF,            ASDF
##VAR_DIM=   32768,         32768,           32768
##UNITS=     HZ,            ARBITRARY UNITS, ARBITRARY UNITS
##FACTOR=    0.157963299565203, 1,           1
##FIRST=     4132.6476996994, 0,             0
##LAST=      -1043.33573715361, 0,           0
##MIN=       -1043.33573715361, -539335,     0
##MAX=       4132.6476996994, 362727382,     0
$$ Real data points
##PAGE= N=1
##DATA TABLE= (X++(R..R)), XYDATA
$$ [...]
16622f8767n2419m1484M2178R1554M6113p1551m9245Q905R3374j6149m4751L6268
16610b5974M9841K8585n3716J2537N3249l1151r3141L0546K4828K7429Q2909r9226
16598F716m8067k5375R523J6088O927P610m6294R5016q595j38638J27163K5522
16586B7596j17010p3832R3145K00354J0275q321q5490n9654P8586Q7815l3059
16575A20405j8500k7564k5582J2555R7280K7309J5753P8072l7266j37436M3128
16564A48154M4592k4815p8520p6223l1101r0381o6343O3781J07584J23942n4969
16553F5701l4542j8359Q6509O2808r1269j22221Q5214O8955j07979J1714j9270
16542a2739K4744L3292M4590j03627P5914J36943m4445q0580o6033j08700Q5283
$$ y = [-68767, -121186, -162670, -120492, -28938, 17175, -54376, -103621, -94716, -1342, -17491, -62242, -25974, 23867, 52452, -1264, 11273, 64522, 33371, -59770, -29224, -4396, 23033, 105942, 6716, -41351, -66726, -57203, -41115, -34188, -26578, -72872, 22144, 13549, -125089, 2074, 27596, -89414, -163246, -70101, 130253, 140528, 132207, 46717, -12937, 65649, 153464, 120405, 101905, 74341, 48759, 61314, 158594, 185903, 201656, 279728, 242462, 105026, 148154, 192746, 167931, 89411, 13188, -17913, -108294, -174637, -110856, -3272, 120670, 65701, 31159, 12800, 99309, 162117, 70848, -51373, 33841, 102796, -5183, 6531, -12739, 12005, 45297, 89887, -13740, 62174, 199117, 154672, 74092, 8059, -100641, -15358]
16531a5358L2305o1690N2939J49565O1356p1942j53159n0511N3802K8146P1928
16520I7381l1585l0393K4306R0635J5131m5818r4973N0040L2169j08332K8626
16509B7187n3467K4347O074M222L2207Q149N0631j28406n3402N6985m3809N7927
16497a1355M3796r9353j6749J50566K5770j40459q1223k8866k6777P2926J47054
16486C5330j9950j31428j0613O1432M5667j367O2391r0799j00114L4206j0632
16475a25877j5814Q1062M2942R0494J2910J3869O0547o0707j30348J6146q1850
16464i6626j0974P1648R8971p9950K907O9792M9672j22705j28210j1155R7690
16453e8940J25561m5143J9746m6516J2161P4089Q5005n3290q2115j76261P6717
$$ y = [-15358, 16947, -44743, 8196, 157761, 219117, 147175, -5984, -56495, -2693, 25453, 97381, 65796, 35403, 59709, 150344, 165475, 119657, 24684, 74724, 106893, -1439, 27187, -26280, -1933, 4141, 8363, 40570, 48719, 99350, -29056, -82458, -25473, -69282, -11355, 32441, -66912, -83661, 66905, 92675, -47784, -129007, -157873, -184650, -111724, 35330, 15380, -116048, -126661, -65229, -19562, -20929, 41462, -49337, -149451, -115245, -125877, -141691, -60629, -17687, 72807, 85717, 99586, 160133, 99426, -30922, -14776, -96626, -107600, -35952, 63019, -16931, -14024, 55768, 105440, -17265, -145475, -156630, -58940, 66621, 21478, 41224, -5292, 6869, 80958, 165963, 112673, 30558, -145703, -68986]
16442f8986J33131n6132j03008l995L4305J13115J80680o2711j48747o5387N9909
16431A2174J35320N6083J917j537l0983q0768q6402j09478l4779K07727R800j19042
16419c9968r8256M6588j8117k6425L2148N6717M6314M8489k8225J30745K2476
16408A72486k9038q2026l1542l3387l8287M4060O9795J2243m9269k1810M4357
16397E7582O1704L8351j35272r1584l7114R3219K6499R7948N7785J8073P505j93251
16385A445j7666l8875J1707r820N4060K7031J00572k7490j4455J14555K8092j34710
16373I4446r1498m6747J4636R078P7568N2559J3133j264o9855N5370m1046K2580
16361H8960J42572K3334m2630k0079m0522o2694P1076J4088m4053K2939k3281
$$ y = [-68986, 64145, 8013, -94995, -98990, -64685, 48430, 229110, 166399, 17652, -47735, 12174, 147494, 203577, 205494, 203957, 172974, 92206, 5804, -103674, -138453, 69274, 79074, -39968, -138224, -91636, -109753, -136178, -104030, -47313, -999, 47490, 19265, 150010, 172486, 143448, 61422, 29880, -3507, -41794, 2266, 72061, 84304, 35035, 13225, 57582, 119286, 157637, 22365, -69219, -106333, -13114, 13385, 111333, 169118, 187191, 194696, 1445, -16221, -55096, -43389, -53209, 851, 27882, 128454, 100964, 86509, 201064, 229156, 94446, 2948, -43799, -29163, -20085, 57483, 110042, 123175, 121911, 52056, 107426, 66380, 88960, 231532, 254866, 212236, 192157, 151635, 88941, 160017, 174105, 130052, 152991, 129710]
16350A29710j46754p8361J05308R2958J3899J15187J8953k3548q2122j75177K1791
16339h156P9772N462K5622n9021l9330L3941M8514L7333k350j9991O609j04109
16327D296M7030j36004q243O4512J7883P0046Q2474k7948p6708m1787j06368N7456
16315e3361K6597n4029n9053m7695p4375P2414K17236m055N6260o6562J045J15626
16303A30048J17161j03394j09813o6727K6364k3203j04174j00933j5841N6272
16293a94240N3607R2184j6766j08927R2657M779J55705Q4394p2455J04769K0280
16282B15987j21046J0908o2242p4851M5044L8367M8566M9029P0951K0131j26253
16271A14591k12556p1310j9685J04837J39711k7873r6279k1512q4258o8780l9380
$$ y = [129710, -17044, -95405, 9903, 102861, 116760, 231947, 250900, 227352, 145230, -29947, -8156, 71616, 77078, 102700, 43679, 4349, 38290, 86804, 124137, 121787, 101796, 108405, 4296, 51326, -84678, -92921, -28409, -10526, 59520, 141994, 114046, 37338, -4449, -110817, -53361, -26764, -80793, -139846, -187541, -261916, -189502, 27734, 23679, 79939, 13377, 14422, 130048, 247209, 143815, 34002, -32725, -6361, -29564, -133738, -234671, -250512, -194240, -140633, -48449, -65215, -174142, -81485, -76706, 78999, 163393, 90938, 195707, 215987, 94941, 105849, 43607, -31244, 13800, 52167, 100733, 149762, 220713, 240844, 114591, -97965, -169275, -188960, -84123, 55588, 27715, -68564, -90076, -174334, -243114, -282494]
16260b82494Q6753Q8122P7814j1771m5392j3379M5436j5108n5160Q838r4965m2804
16248b54110j6116O3492J68105L2035Q3672p3649P8229J22347p9274n3415O4839
16237A36155N3483k8958j9589L5414j5758n9269n9396j9447j432j0807K3384n836
16225B7944m909M59q1349J04010J24650k1266j55440j05584P666k9166O4950J37615
16213F9580M9045p6222P8813N2123M9633M3998k6693j68407m8566N2567j14208
16202c8337l3757K7557N1612J23296J42584m707j79711j97242M4111J7011q5m2910
16190i0578p9975m5180j6129J306O4507R5008O347p1477j1413P0223M9305l4083
16178f2139n6456j33925k7323K09972J47083n4976q7974n6474J41780m1716j33972
$$ y = [-282494, -195741, -107619, -29805, -41576, -86968, -100347, -54911, -70019, -125179, -116341, -211306, -254110, -270226, -206734, -38629, -6594, 77078, 3429, 81658, 204005, 124731, 71316, 136155, 189638, 160680, 141091, 176505, 160747, 101478, 42082, 22635, 21203, 10396, 33780, 27944, 23035, 23494, -57855, 46155, 170805, 149539, -5901, -111485, -103819, -132985, -68035, 69580, 118625, 42403, 121216, 173339, 222972, 266970, 240277, 71870, 23304, 75871, -38337, -72094, -44537, 7075, 130371, 272955, 268248, 88537, -108705, -64594, -47583, -47668, -90578, -170553, -215733, -231862, -230556, -166049, -71041, -64694, -136171, -147584, -77361, -28056, -62139, -118595, -252520, -279843, -69871, 77212, 22236, -65738, -122212, 19568, -22148, -156120]
16167a56120J02489J51116o7807m7478L2701O0797J19477K3749q7334r6336l1433
16156C821M4000M0940o2370m1833L020j11367n8385J0492N7273J6N2633m2974
16144a04734k4271o1511n5786j06137k3711K11648M2446r7047l8393J49737O0158
16133d7601J74971R7240j10304o7250P9799M5037k8021p3127J47327R124j34534
16122I2661j21209M3894Q5231J2751K6446j95265j46053K2840J6651Q5879j017
16111g7191k4764N4167K1865j1643Q9823J26735J8957p4325p3214j648n6633m4698
16099e2569p1764q8088j9320J48293k3742m623L3990M1306P3662K2711j16809
16088e6953r2770q1821j5128l979l1043P8226K9977k2163J2600n051J16741M9331
$$ y = [-156120, -53631, 97485, 29678, -17800, 14901, 75698, 195175, 218924, 131590, 35254, 3821, 47821, 88761, 26391, -15442, -12422, -123789, -182174, -171682, -114409, -114393, -61760, -104734, -129005, -190516, -246302, -352439, -376150, -164502, -122056, -219103, -257496, -107759, -47601, 127370, 224610, 114306, 47056, 126855, 171892, 143871, 70744, 218071, 227195, 92661, -28548, 15346, 100577, 113328, 139774, -55491, -201544, -178704, -162053, -76174, -77191, -101955, -47788, -25923, -37566, 52257, 178992, 197949, 123624, 50410, 48762, -7871, -52569, -124333, -212421, -231741, -83448, -107190, -111813, -77823, -36517, 37145, 59856, -56953, -149723, -231544, -246672, -250651, -281694, -203468, -173491, -195654, -183054, -188105, -71364, -22033]
16076b2033J3958j5982j50241k11768l3131J36294J43139Q6610K1734N4723J9137
16065D2440k4263K2304O808K191l6328J7283P0077k4577j6888p9270N9818k7401
16053A2194o611n2909J22583K9164j05024j77373r806K9900n8370P4527M6885
16042i4840M4817l1274K0303R8545J89575Q211p2883N2257n8211j61725j53333
16031a58558l2952P6706k1288n6657n5416Q1330M7340P3770P7298p007m8531q3982
16019a07947O171L1138J01662m1752N7898L2047n2422r652R921P5108O5819N8528
16007B26519p616j16591j04758l0733R3511J7399l4697p9230J4586r8998j0686
15996a31294j012k5991k9960m2557J43079m789O4175J17613r200M2747q9139j39952
$$ y = [-22033, -8075, -24057, -174298, -386066, -419197, -282903, -139764, -53154, -31420, 23303, 42440, 18177, 40481, 47289, 49480, 13152, 30435, 100512, 75935, 59047, -20223, 39595, 12194, 5583, -47326, 75257, 104421, -603, -177976, -187782, -157882, -216252, -141725, -94840, -50023, -81297, -60994, 37551, 227126, 235337, 162454, 214711, 156500, -5225, -158558, -191510, -114804, -136092, -192749, -248165, -166835, -119495, -45725, 31573, 24566, -23965, -107947, -101776, -70638, 31024, -10728, 47170, 79217, 26795, 17143, 27064, 102172, 167991, 226519, 218903, 102312, -2446, -33179, 60332, 77731, 43034, -36196, -21610, -120608, -131294, -132306, -158297, -188257, -230814, -87735, -92524, -28349, 89264, 80064, 122811, 33672, -106280]
15984a06280j6011J44080K19999p4591j0321O347m3110o0410N1486J01638n8392
15973A54435r5210J1324R2979r2114M0537q5576j72679o295J16296n001M2556
15962A252M7876m8480m5888m4593J7502m8626J03190J09381J433p7137j6670k6476
15950b7236O5564R6924o1371l7958j7443q0746q1432O6380P8158n4088M7015k8236
15938c4469j8098l2823Q768j7073k1300O081K5540j27835l5490M4514J5463J24678
15926f2044J3508K0834J6248p9818M0899p601k6445j4322n6778P271m9319O818
15914a90749J28732J15650m9969J11969M6947o3598r4029n2094M4709n3117q6213
15903a41762M4825R7220O2157Q5492m8091k1304P432m8193j13994J8166l7403
$$ y = [-106280, -122291, 21789, 241788, 167197, 156876, 163223, 120113, 59703, 111189, 212827, 154435, 59225, 70549, 163528, 71414, 111951, 26375, -146304, -152599, -36303, -41304, 1252, 49128, 648, -45240, -89833, -72331, -120957, -17767, 91614, 93047, 15910, -760, -27236, 38328, 135252, 73881, 35923, 18480, -62266, -143698, -77318, 840, -53248, -6233, -34469, -52567, -85390, -76622, -93695, -114995, -108914, -83374, -211209, -246699, -202185, -186722, -62044, -48536, -27702, -11454, -91272, -50373, -57974, -84419, -98741, -155519, -148248, -197567, -190749, -62017, 53633, 3664, 115633, 162580, 98982, 4953, -47141, -2432, -55549, -141762, -96937, 283, 62440, 147932, 99841, 78537, 85969, 37776, -76218, -58052, -95455]
15892i5455L5877J52614P9131l2186m0804o1258o4862j118n2788J0975j02354
15881a72228m6255Q5102R6164M7850K6743j3175l9057L0002j41326p1753Q4742
15870a13191L5311p5500j4937J1193j2179Q3431l2846m9249L2399J20225M4272
15859B8929p7547n7268k5961l6442j9046M7803Q9722p113M2275l8793M808j6958
15847f5591N913O2040J7808j48865k1160J1726J01563k5897k8458R1525L9818
15836D0422r5982p9232m8662j21198l3741J76743J04032m5182O3987k3950m498
15825f7261K8814M7525R1711Q366P042J1661j18440p4982o905J15055Q3298L1436
15813A57320N7155j8328k5824r1328K6004j10246p3659J19005J24190J09627k1296
$$ y = [-95455, -59578, 93036, 172167, 139981, 99177, 37919, -26943, -28061, -80849, -69874, -172228, -218483, -133381, -37217, 10633, 37376, 24201, -14856, 15146, -126180, -197933, -113191, -77880, -153380, -168317, -157124, -169303, -85872, -118718, -167967, -135568, -15343, 28929, -48618, -105886, -131847, -168289, -187335, -139532, -49810, -56923, -14648, -53441, -48633, -65591, -59678, 2362, 20170, -128695, -149855, -138129, -36566, -62463, -90921, 604, 40422, -55560, -134792, -183454, -304652, -338393, -161650, -57618, -102800, -38813, -62763, -67261, -38447, 9078, 100789, 109155, 116197, 127858, 9418, -65564, -72469, 42586, 125884, 157320, 214475, 196147, 170323, 78995, 104999, -5247, -78906, 40099, 164289, 273916, 252620]
15802B52620j22268N1086N2509o6231n2331k1996l9253r5922o093L7866j6437
15791b6450q1829J1621M6400L3322J0199L6953l079k0133p3572l2512n5147o1779
15779b16006L4436M1643J27383J03139K9170L558k412o3023q769l7334m4560q3562
15767a16337K7015m9500L8936N6229q61o9913m0859M1802R6524J4828J01462J70984
15755B70310l1208k25095n0373P5885p4668M4734o9304j37046l138J2741k3261
15744b10423K0062l0376O1169Q7497r670j7438j2188K6469l4332l2724L1319j3850
15732a34485k3537P9358R8675j959k7023P5831K0943r6039K5982j5297l4296J650
15720c0197j6673O8338k5897j01927J11402J09885l5425j24674j35664R923J02702
$$ y = [252620, 130352, 181438, 233947, 167716, 115385, 93389, 54136, -41786, -47879, -10013, -26450, -108279, -96658, -50258, -16936, -6737, 30216, 27137, 7004, -66568, -99080, -154227, -216006, -181570, -139927, -12544, 90595, 119765, 123323, 120911, 57888, 49119, 11785, -32775, -116337, -89322, -138822, -99886, -43657, -44518, -114431, -155290, -113488, -16964, -2136, 99326, 270310, 239102, 14007, -36366, 39519, -35149, 9585, -59719, -196765, -199903, -187162, -210423, -190361, -220737, -159568, -72071, -81741, -99179, -111367, -84898, -119230, -151954, -120635, -134485, -158022, -78664, 20011, 18052, -8971, 66860, 87803, -8236, 17746, 2449, -31847, -30197, -46870, 21468, -4429, -106356, 5046, 114931, 79506, -45168, -180832, -170909, -68207]
15709f8207J32937m5644r5698r191M0999K7636O2976K6845j8169P2626K6072m6333
15697A06849l721r795K3680o9609r6180m7361P7295k3176l1790k596l5851P3437
15685c8818p8q8627J3518N3987P7485p4486r5826n7587L0407R5934J6511J5867
15673e1713R936K9141J09196o6594p6266k7893O8154p7160J9102J24502q2059
15662b1654n1823P8709M2706l7314m4911m3659J59336J14745n9536l842L1109
15651A63866n5996o9621M1008m8976j31551M9772j11409m9828j816P7970J09751
15640b6830R239l7986J7644j1488j40914n1430N5184J29274M8906L3421R7902
15629A22922J0246l1416j55095o9666m9263k1773K4681J32540j7372j01361R7371
$$ y = [-68207, 64730, 19086, -76612, -85803, -44804, -17168, 45808, 72653, 54484, 127110, 153182, 106849, 103128, 93333, 117013, 47404, -48776, -96137, -18842, -42018, -73808, -76404, -112255, -38818, -38896, -127523, -114005, -60018, 17467, -57019, -152845, -210432, -180025, -84091, -67580, -51713, -41777, -12636, 96560, 29966, -46300, -74193, -6039, -83199, -64097, 60405, -21654, -73477, 5232, 47938, 10624, -34287, -77946, 81390, 196135, 136599, 132757, 163866, 107870, 38249, 79257, 30281, -101270, -51498, -162907, -212735, -214551, -136581, -26830, -17591, -55577, -37933, -49421, -190335, -241765, -186581, -57307, -8401, 25020, 122922, 133168, 101752, -53343, -123009, -172272, -194045, -169364, -36824, -54196, -155557, -58186]
15618e8186L6382J9264J04789k1695j19215j9084J3349j7451J4327l3653M9479
15607c1694j8887J5904P6315o9918J00032J13621j58852j53745k1819P7165p700
15596g9578M0273J17m5835j20331O9104O6302R4530n8467p3275O781J4954L6654
15584d8771M1493n8951r4359J08721P8363J05516j8286k18773n7707K6577k864
15573a39041M8068n370J5289j74596m0971O3852K0030J2659O0162L3073O5372
15562d1473j6454K29j7596q7897R2835j8281o0263L0391j585q032J21904L2521
15550B6299q3602o1207o4613K475P797O3897O2919K7902k2170k3501l3536k5051
15538a22391o868J12817Q0602k6467m6379J29584m2509j7817o5349l9318K6497
$$ y = [-58186, -21804, -2540, 102249, 80554, -38661, -57745, -44396, -61847, -47520, -81173, -31694, -50581, -34677, 41638, -28280, 71752, 185373, 26521, -127224, -149043, -71878, -79578, -39305, -39188, -85023, -205354, -136250, -69948, 24582, -33885, -107160, -100379, -85425, -48771, -7278, -66229, -160588, -51867, 26496, 132012, 113726, -105047, -162754, -136177, -139041, -90973, -96343, -81054, -255650, -296621, -232769, -212739, -200080, -139918, -106845, -41473, -57927, -57698, -75294, -163191, -70356, -88637, -148900, -118509, -120094, -128126, -6222, 26299, -57303, -118510, -183123, -180648, -172851, -108954, -46035, -18133, -40303, -63804, -97340, -122391, -129259, -16442, 64160, 37693, -8686, 120898, 78389, 60572, -4777, -44095, -17598]
15527a7598m8348O685J9408P3202j11677l1429Q6653l597J5733N4447p702j26723
15515i0946L846O9768m9658o600j4871R239j3782J8802L1956N3458k7065K7628
15503A1775K9078J03864R517j60815p6407l7566M300l0419R9682Q4965R9263P2595
15491B09832q5621j89277j02270m7468J02030M0189k6555K4220J19359l5587j10388
15480a01536K2763O3837J11476L6434q7660o0732j06874n0643l66M5169J07671
15469b0461J5604p3581n4339Q8904j242Q0857J26095p0235j04079l6364P3042
15458B4201N4008j50319k3018M7637M2528j1958l4458j2140K1690M3590J70086
15447A71847n2508j23613k6330j24136N359J29495q1119p9227J43595P0953m6077
$$ y = [-17598, -65946, -59261, -39853, 33349, -78328, -109757, -23104, -26701, -10968, 43479, 35777, -90946, -87100, -17332, -66990, -73590, -88461, -79222, -93004, -74202, -42246, 11212, -15853, 11775, 40853, 144717, 154234, -6581, -82988, -120554, -116254, -146673, -46991, 37974, 137237, 209832, 124211, -65066, -167336, -214804, -112774, -72585, -99140, -74920, 44439, 8852, -101536, -78773, -14936, 96540, 132974, 45314, -15418, -122292, -172935, -173301, -128132, -20461, -4857, -78438, -132777, -43873, -45115, 35742, 161837, 91602, -12477, -48841, 24201, 78209, -72110, -95128, -47491, -4963, -16921, -51379, -63519, -41829, 1761, 171847, 119339, -4274, -30604, -154740, -149381, -19886, -101005, -180232, -36637, 34316, -11761]
15436a1761j30716k7006R1185K6658q3766n4308R8461j2642K3008L9560l9270
15425h0597p1978J4739j9329O8249k27p303P245j80119r4282M2749J12785N0018
15413a58050O7885q661K6265J54839K3126l5259j60245k9136K18311J31896m4899
15402A86072K2463q588m2952n8657j19664L625J0686Q170J1665o0215Q321N6972
15390A7898Q0628o6123j31705k5429O658j7420N8935n484m8278k7297J09511Q1644
15378C3538J55171p8120j91857m2302J48123J17561o4159j30197m8832j3488P24
15367a13838j0160L698N8294J06948O4003m210R086l8473m996O8514k8986J2663
15355A22543P261m0037J261o7343p3153P4250l9086j9125K178L700m4372R1342
$$ y = [-11761, -142477, -169483, -78298, -51640, -135406, -189714, -91253, -103895, -80887, -41327, -80597, -152575, -137836, -157165, -88916, -89143, -96446, -89201, -269320, -363602, -320853, -208068, -158050, -90165, -98826, -72561, 82278, 105404, 70145, -90100, -119236, 99075, 230971, 186072, 208535, 199947, 156995, 98338, -21326, -17701, -7015, 1155, 12820, -47395, -39074, 17898, 98526, 32403, -99302, -124731, -118073, -135493, -76558, -82042, -130320, -157617, -48106, 33538, 188709, 110589, -81268, -123570, 24553, 142114, 77955, -52242, -101074, -114562, -113838, -123998, -120300, -62006, 44942, 108945, 104735, 113821, 75348, 70352, 138866, 109880, 122543, 129804, 89767, 91028, 23685, -49468, 24782, -14304, -33429, -31251, -27551, -71923, 19419]
15343A9419N5188k9835q5100j01369p992J62009Q0138r5145l0159L56l4943L1584
15331c5849Q695l8569O4610Q6900j284m8900j31159p4844J27479O6414o6674m3344
15319h6525M8399k9883p2099Q8231k2153K8300J02490Q2846k4845j4165Q167J0528
15307A19291j16012P26k20O0044j0082n5526M7872r993P9450M0320p6770j39299
15295f0199J09276j0624n35j06988j8159J63514M0443m1872k9634J971O5941k2050
15283I1084k4974m9947J5782L5729m1911O225m7471m6406m3369l949J03423L7235
15271C1451k5915N8033K907o7427J8918K0347M459q6531p1281k7757n5527J79253
15259a9070J34589L2774j77473j16482j0696K5261j9282K9820n1930J15385Q1587
$$ y = [19419, 74607, 44772, -40328, -141697, -149689, 12320, 92458, -2687, -32846, -32490, -67433, -35849, -27154, -65723, -1113, 85787, 84503, 35603, -95556, -170400, -42921, 23493, -43181, -86525, -38126, -68009, -140108, -51877, -74030, -45730, 56760, 139606, 114761, 100596, 108763, 119291, 3279, 4005, 3785, 63829, 53747, -1779, 46093, 36100, 115550, 155870, 79100, -60199, 49077, 38453, 37918, -69070, -87229, 76285, 116728, 74856, 45222, 47193, 113134, 91084, 66110, 16163, 31945, 67674, 25763, 31988, -15483, -61889, -105258, -109207, -5784, 31451, 5536, 63569, 66476, -951, 17967, 38314, 42773, -43758, -115039, -142796, -198323, -19070, 115519, 148293, -29180, -145662, -156358, -131097, -150379, -120559, -172489, -57104, 24483]
15248B4483J08444m4273r9187n3249j915q8744R9783m346j03885J10915N6734
15237D760j42356j03239J6398J47790J95341P9797r25k1603j77478j27103j02399
15226b31017N5356J18624K9974r3692K7719J7624M4461Q7033n1470j46333L7274
15215a04447J83032J41452j35789j5494R989j75146j0525L2240l897P1568R0806
15204H3789q3622j62676l4781J03627L5833P6547q6273n5126K1971L1248L9331
15193c0132q0461p3437L3763Q9713J9961p0673n7218j5971O6217j5687n2610L0492
15181a56043N5827k4009P5122K11740M4702j35979j8458P5466l2377M1740K2430
15170A60161j7748o2783l2966j31753p6404L2168K442n7719J2808Q2799J13692
$$ y = [24483, 132927, 88654, -10533, -63782, -65697, -154441, -54658, -59004, -162889, -51974, 4760, -137596, -240835, -224437, -76647, 118694, 198491, 197566, 175963, -1515, -128618, -231017, -175661, -57037, -27063, -120755, -93036, -75412, -30951, 56082, 4612, -141721, -104447, 78585, 220037, 84248, 68754, 78743, -96403, -106928, -74688, -78585, -7017, 83789, 167, -162509, -197290, -93663, -57830, 18717, -67556, -122682, -100711, -69463, -30132, -110593, -184030, -150267, -60554, -40593, -111266, -168484, -184455, -118238, -133925, -186535, -156043, -100216, -124225, -49103, 162637, 207339, 71360, 52902, 128368, 95991, 137731, 160161, 142413, 79630, 46664, -85089, -161493, -129325, -126883, -184602, -171794, -88995, 24697]
15159B4697N7190j51185p3028N2374m2173J07193j0427J9194K7503J4744o3687
15148c7605K9795N450M5213l3191k5809k9028k7815j767O2639N3650q1386j38419
15136a78273J7444R1164K4603J20093K9078j03774j5060J23431n5404k2788O8576
15125I9090K1494l6981n5438M6176J85158M123p2610q6502M3140o7678j57348
15114g7376L6455j3875P8327L7210O1637p9267l9373j0156j9335j13668P2208
15103f7213q580k3218p264O9687K0382l6737j07580P2912M6501R8071J94512k9475
15091B21998j64549j28906K4192k2860o3888J2250N49n3441k692m4810M299J14810
15079a03048n1712p2514K2985k7876k620L1232l9454m3370L0380J91690J74655
$$ y = [24697, 81887, -69298, -142326, -89952, -132125, -24932, -35359, -16165, 11338, 26082, -37605, -7810, -2360, 42853, 9662, -16147, -45175, -72990, -74757, -12118, 41532, -39854, -178273, -160829, -69665, -45062, 75031, 104109, 335, -14725, 108706, 53302, 30514, 99090, 120584, 83603, 28165, 74341, 259499, 263622, 191012, 104510, 147650, 79972, -77376, -40921, -54796, 23531, 60741, 122378, 43111, 3738, -6418, -25753, -139421, -67213, -75793, -99011, -106275, -36588, -16206, -52943, -160523, -87611, -41110, 56961, 251473, 221998, 57449, -71457, -47265, -70125, -134013, -121763, -121214, -174655, -177347, -222157, -217858, -103048, -154760, -227274, -204289, -232165, -234785, -203553, -243007, -286377, -255997, -64307, 110348]
15068A10348k6716o1293o2165m4869J671R4591J64574L6043l7432j08525r8520
15057c2293k7749Q0339q2512p4674N482L6576K6684m9418j14732J5173P2732o8533
15045b12925m1474M0108j00291k4475R6285J14953P702L0594l7762j36589p3286
15034c37160Q026J430m0171J53598J58732J01397m8862j69815K45669K67306l8202
15023C01948j17442j16475q1678J972K1293l6761R9393j5160m0473k2046N4167
15012D8738J33817Q4841o2095m6962O2432k4575k07725p8174K3336j49233m0229
15001b55829m2014N9905L8051l5133M0953m2284q9434k5944J94933Q1191J24269
14990D8664P873m2205Q086l1847j792N0860R746k8531J01009R688j6994J06798
$$ y = [110348, 83632, 22339, -39826, -84695, -83024, 11567, 176141, 212184, 174752, 66227, -32293, -60042, 20297, -62215, -136889, -131407, -94831, -68147, -117565, -232297, -217124, -144392, -212925, -254399, -214291, -314582, -339057, -242772, -127819, -120117, -89523, -127285, -263874, -337160, -329134, -327704, -367875, -214277, -55545, 45852, -3010, -172825, 72844, 340150, 301948, 184506, 68031, -13647, -11675, 9618, -27143, 72250, 57090, 16617, -5429, 48738, 182555, 267396, 205301, 158339, 220771, 196196, -11529, -89703, -66367, -215600, -255829, -297843, -237938, -199887, -235020, -194067, -236351, -325785, -351729, -156796, -75605, 48664, 56537, 14332, 22418, -9429, -11221, 39639, 49385, 20854, 121863, 131551, 114557, 221355]
14978B21355l0471k11280k7725k8979n0185M3450J09150k0868J0411N1482K5499
14967I1839l8893k9074N565K0546l1073k839p5665j3342M2915L1480j02728N9305
14955d1964J21221J72036k5088M4557q8828j40995r9541R5764Q8080J3054j40299
14944b003p9361q3190p9323n3455J49107J78386J7646r6760k6036k4229M6824
14933e2394Q2615P6066j04193j1384n3369l00Q1308m0525n8954l9477l6568K3784
14921a33391J11048n0552J6728N1448q167j18877p3241O144K9442k2947N9756
14910a32609J19832K6348L3947N559K8655L623J1834o7316j7222L603q849R8052
14898A05457L8386q8019j12116n9600K5505J9367J13348P010J7539K6993j47828
$$ y = [221355, 190884, -20396, -48121, -77100, -127285, -83835, 25315, 4447, 14858, 66340, 91839, 52946, 23872, 29437, 49983, 18910, 16071, -59594, -72936, -30021, 1459, -101269, -41964, 79257, 251293, 226205, 270762, 181934, 40939, -58602, 37162, 125242, 138296, -2003, -81364, -164554, -243877, -297332, -148225, 30161, 47807, -48953, -74989, -99218, -52394, 30221, 106287, 2094, -9290, -62659, -62959, 18349, -22176, -81130, -120607, -157175, -133391, -22343, -72895, -56167, -4719, -12886, -131763, -205004, -198860, -169418, -192365, -132609, -12777, 13571, 47518, 53077, 81732, 85355, 97189, 29873, 12651, 16254, 7405, 105457, 143843, 55824, -56292, -115892, -90387, -71020, 42328, 49338, 66877, 93870, -53958]
14887e3958r5149k2636J4051J69776m5395l751R2151O034q2954n3841M7698O8563
14875D0589n1102L950o780l5105k1250J67239J01873m7345n1726P0038m3164j38133
14863a0916r3482P3963J93827l994j50646j20940o2310N991J8944M9474L057Q8286
14851h746K2922j0374P072j23125p4925K5082J6108M0226J87528K04855j03756
14840A82867j46167j08472K4839m1359L3508J50350L6544j20122j68679k2272
14830a78963J23700J7950J8819P9453Q3370r3714r9630l58L0293Q0749O2073k3542
14818A00200r0537j39858m8633m7379Q5319P8107l0883n0484R6007K4668j0694
14807c4167Q6827J3093J9961j22851m1143P8239l1208m2157O9965J0890L2041
$$ y = [-53958, -149107, -171743, -157692, 12084, -33311, -37062, 55089, 61123, -21831, -75672, -27974, 40589, -10513, -6563, -13343, -48448, -69698, 97541, 199414, 152069, 100343, 170381, 127217, -10916, -104398, -30435, 163392, 159398, 8752, -112188, -174498, -168507, -149563, -100089, -97032, -8746, 14176, 3802, 10874, -112251, -187176, -162094, -145986, -105760, 81768, 286623, 182867, 36700, -71772, -46933, -88292, -54784, 95566, 132110, 11988, -156691, -178963, -55263, -37313, -18494, 60959, 144329, 50615, -49015, -49373, -19080, 61669, 123742, 100200, 9663, -130195, -178828, -226207, -140888, -62781, -93664, -144148, -48141, -23473, -34167, 52660, 65753, 85714, -37137, -78280, -41, -31249, -73406, -3441, 7449, 39490]
14796C9490J9208R978k6428j75233l8623j254o2965K5895J0651P4026N3597q456
14784h0114K0591l6909J487N9086k055K8083l5447m8123J24693P2195k00083j30510
14772b27106K1817N7736O5345Q1115m3069L311n3408L0387J34978N8566Q4417
14761B14089q405l8255o8789j04002n9413k6530M578L5541O4234J77097K1636
14750B11781j05472j53092K8422p9422p3704J18794k696m2659O3308N5560k7080
14739f260O3166L0273N3379l835j07207j46876n7187J9043P2863o5293k1271O3988
14727a05217k2635k6432N725N1247m6450L1515J4420j4806R8365K4225m5412m9665
14715h5120L3072m3069L3985k9551N3145Q8007K0976l5909L2384N6328Q1500j41585
$$ y = [39490, 58698, 68676, 42248, -132985, -171608, -172862, -235827, -209932, -199281, -125255, -71658, -80114, -59523, -96432, -94945, -35859, -37914, -9831, -45278, -93401, 31292, 103487, -96596, -227106, -205289, -147553, -82208, -1093, -44162, -40851, -94259, -63872, 71106, 129672, 214089, 205684, 167429, 98640, -5362, -64775, -91305, -86727, -51186, 13048, 190145, 211781, 106309, -46783, -18361, -97783, -171487, -52693, -55389, -98048, -34740, 20820, -6260, 56906, 87179, 140558, 136723, 29516, -117360, -174547, -155504, -82641, -147934, -169205, -105217, -127852, -154284, -148559, -97312, -143762, -112247, -97827, -112633, -14268, 9957, -35455, -85120, -52048, -95117, -61132, -90683, -37538, 50469, 71445, 35536, 67920, 124248, 205748, 64163]
14703F4163q4086M4898r8403m4931p203J21045L3279n0544r3137j3773j6142L2559
14691a12275N6923O0070p955j10831q8327N8963J49563N3195j74783l4043p2141
14680b21641J03736l8583R803k9482n7207p665K2576J78431J27556o1068J25091
14669A51547J07901k7522p5011j21209p8285J3040Q7802Q7645o2672M5176O3329
14658A91741M9400M8581j77115k7492m3856k0885j12536J01994Q0440k7512l2752
14647C0008j4411M6784j1744N5866j7261j4608P9498k074l9267l573M2737J1715
14635A63670n8711k7084K258l5758j2363N1387O4567O1246l7332r5672j9838l5509
14623B0861L6840L7543p7557p4282M9279O7667J2469r9707m0939m9685M5732m3483
$$ y = [64163, -19923, 24975, -73428, -118359, -125562, -4517, 28762, -21782, -114919, -128692, -144834, -112275, -55352, 4718, -3237, -114068, -202395, -143432, 6131, 59326, -115457, -149500, -221641, -117905, -156488, -146685, -176167, -233374, -241039, -218463, -40032, 87524, 26456, 151547, 259448, 231926, 156915, 35706, -42579, -29539, 58263, 145908, 83236, 128412, 191741, 241141, 289722, 112607, 85115, 41259, 20374, -92162, 9832, 90272, 62760, 30008, 15597, 62381, 50637, 106503, 89242, 74634, 154132, 152058, 112791, 109218, 151955, 163670, 104959, 77875, 80133, 44375, 32012, 83399, 147966, 209212, 171880, 76208, 56370, 20861, 57701, 95244, 17687, -56595, -7316, 60351, 72820, -26887, -67826, -117511, -71779, -115262]
14611a15262K6714P3307R9224m8408j69784r4528P4883L1834Q8186j9209j39301
14600a92344j932J9247J14811J44247j76361o1147k4077n2613J13671q912j9838
14589a45248k845o048n8764P6630J67913J59039J08751l5039n8821j61795r5100
14578e1327o8573r0060k5598M5403R1707L8929O6772n2812j15016p4683J42393
14567i2865N0057M429k4321k0284J6580J3401R609j07115j16873M0089J00023
14556a27270J45753O7117l7874j42511q861o098m5244q810R4173O1412L3396n2909
14544b7726M8093J15146K7823o765j30812k8859j13414M369l0632P38q388j06747
14532b57174n8388K08545M34P5036J18328o4969l5222O5643M2450j774q5403M257
$$ y = [-115262, -88548, -15241, 83983, 35575, -134209, -228737, -153854, -122020, -33834, -53043, -192344, -194276, -175029, -60218, 84029, -92332, -153479, -177556, -230169, -116498, -125410, -145248, -148093, -154141, -212905, -136275, 31638, 190677, 299428, 264389, 205568, 43773, -51327, -119900, -209960, -235558, -190155, -98448, -59519, 7253, -45559, -160575, -235258, -92865, -42808, -38379, -62700, -82984, -66404, -53003, -43394, -150509, -267382, -227293, -127270, 18483, 85600, 47726, -94785, -103646, -109744, -154988, -163798, -69625, -8213, 25183, -27726, 20367, 135513, 163336, 156571, 25759, -3100, -116514, -112145, -142777, -142039, -150427, -257174, -315562, -107017, -106583, -31547, 86781, 21812, -13410, 52233, 94683, 92909, 7506, 11763]
14520A1763n2637N306K2932R57N2993P7953j58873j03806J877Q4064R3390M8464
14508H4383j21354Q662l4730m2805L090L3166K7615O8316j109r5842N321n3198
14496a18485M3149J5182K426l3990k2162P2617P8388j3068L2815j8197K7396k2180
14484D3891l7213l0850N1069q1070K0058k2421n4170l5489L0815K2940J6209j3544
14472h9775L8611M789N3897m6931o441L6637N690n9558j10737N38J09426J5344
14460d8510p855k4999L2991O0191N7291P1427r7768j00204Q5973K6487q4585P0141
14448D0580l8315n3362m7020l5944o0896J4259J61087J42522J35069n0157j05136
14437A02687J2109k5739m7617p6154M4529k0657K8830M7891J7746O2371p7945
$$ y = [11763, -40874, -35568, -12636, -11679, 41314, 119267, -39606, -143412, -141535, -57471, 35919, 84383, -36971, -28309, -63039, -105844, -102754, -69588, -41973, 26343, 25234, -70608, -65287, -118485, -75336, -60154, -57728, -91718, -113880, -41263, 37125, 24057, 56872, 38675, 66071, 43891, 6678, -24172, 26897, -54173, -34115, -56536, -110706, -146195, -115380, -92440, -76231, -89775, -51164, -46375, 7522, -39409, -45850, -9213, -3523, -63081, -173818, -173280, -63854, -48510, -56365, -81364, -48373, 11818, 69109, 140536, 42768, -57436, 28537, 55024, -29561, 40580, 2265, -51097, -98117, -134061, -194957, -180698, -19611, 122911, 257980, 207823, 102687, 114796, 89057, 41440, -34714, 9815, -10842, 17988, 65879, 83625, 145996, 68051]
14426F8051r3106j00429r7589k4920P172k0008J22508J96239J15625r4287j14740
14415c5484j43765L1601J10308L6065R0795p8233n8402m729j09623J9265J36863
14404e339J7652r8596r5976J14837J79744P0888n0422j30399q6047L7853J23533
14393G7728j16433j99125o7053J14889P8732L6049m8462j6223K6752P4617N7224
14382A8695K5645j26620j08878m7360J5968L3088j1349L0747r642Q908r9897L1686
14370b39009O6441L2051q994J13112R0498Q1864j28827L2313Q5730j9396j44393
14359c8610J8593L77j01457L4042r339r0385J08794K1152k12423K44P4859p968
14347b02121j2784L5701j1380J11795m8136o1971J79942J55809l6610p1218L7467
$$ y = [68051, -25055, -125484, -223073, -247993, -240821, -260829, -138321, 57918, 173543, 79256, -35484, -179249, -147648, -37340, -1275, 89520, 11287, -47115, -51844, -161467, -142202, -5339, 12313, -86283, -182259, -67422, 112322, 183210, 132788, 2389, -83658, -45805, 77728, -38705, -237830, -304883, -189994, -111262, -75213, -123675, -139898, -113146, -38529, 18695, 44340, -82280, -191158, -238518, -222550, -189462, -200811, -170064, -179706, -170798, -270695, -239009, -172568, -140517, -149511, -36399, 54099, 135963, 7136, 39449, 125179, 105783, -38610, -20017, -19640, -121097, -87055, -96394, -186779, -77985, -56833, -269256, -269012, -194153, -202121, -214905, -179204, -190584, -78789, -126925, -188896, -8954, 146855, 110245, 39027, 76494]
14336G6494k230n3695m8496k5298n3292N1543J28261J6204l4039p532m3514p223
14324b817P9769J1311J08565m7991p5615J4299J89J60j19235K4051J93736L4736
14312B21158l4943j56369j44255k5405O931P2213Q1100l0262j3553N5555K58r7211
14300f4783o359q1936l3788J35811J08147O4918q531O9228j8926r3813o5522p2498
14288f8052Q647k6154K9102K4922L9128j0663R5344o9040j15795L8235L6612j6887
14276c4601L6385O5265p7294m9272o1323m5641n9562L6410M0795q02M0326j2119
14264a21433m5116k344l7440j5943L074P9135J83670k949j2271j31958q2705o391
14252a92671o786l298k8506J4874R7799M8984R9270n8753j52459n777Q0443R0119
$$ y = [76494, 74264, 20569, -27927, -53225, -106517, -54974, 73287, 89491, 55452, 47920, 4406, -2817, 76952, 88263, 196828, 148837, 73222, 87521, 87710, 87870, -31365, -7314, 186422, 221158, 186215, 29846, -114409, -139814, -132883, -60670, 20430, -9832, -23385, 32170, 32428, -64783, -71142, -153078, -186866, -51055, 57092, 122010, 113479, 182707, 163781, 69968, 4446, -68052, -59405, -85559, -56457, -31535, 7593, -3070, 92274, 23234, -92561, -54326, -17714, -34601, 1784, 67049, -10245, -59517, -120840, -166481, -226043, -189633, -148838, -149640, -109314, -121433, -166549, -168893, -206333, -222276, -219202, -140067, 43603, 40654, 28383, -103575, -186280, -192671, -199457, -202755, -231261, -216387, -118588, -69604, 29666, -29087, -181546, -187323, -106880, -16761]
14240a6761J216K9116M2409N6441r227j7180o9925q1043R4208L9741k5975L6876
14228G9896r8041j05753j03847P033O6133J85092L5096r7939J1310L314o6626
14217h4332J625N3780N9684l6569r351n3122K3089j28003J0255m9048j02714J4287
14205c00419J24979Q1383N0778o2579K1544J13402K0881J04111O0531q8442Q182
14194A34351K4730j1194n6867j34098l5832M908J10306l1202l6911k542M9865
14183A5514m4571j5784L6855Q8979j30423n5406O9392J08697n3481o3792M2742
14172a278k8196l9602K0819L7953j4365l3573j7168m0602o5605J783k5598K4600
14160a80832P0833P0559R5296N3451q5892n9371k5955p9223M5087n3740m1706
$$ y = [-16761, -15545, 13571, 55980, 112421, 103194, 86014, 16089, -64954, 29254, 68995, 43020, 79896, -18145, -123898, -227745, -220712, -154579, 30513, 65609, -32330, -21020, -17706, -84332, -82707, -28927, 30757, -5812, -15163, -68285, -45196, -173199, -162944, -211992, -314706, -300419, -175440, -94057, -43279, -105858, -84314, 29088, 49969, 154080, 214611, 126169, 134351, 159081, 147887, 91020, -43078, -78910, -74002, 36304, 5102, -31809, -34351, 15514, -29057, -44841, -7986, 80993, -49430, -104836, -35444, 73253, 19772, -44020, -1278, -29474, -69076, -48257, -10304, -24669, -58242, -75410, -116012, -181617, -179834, -205432, -180832, -109999, -39440, 55856, 109307, 23415, -35956, -61911, -141134, -96047, -149787, -191493]
14149a91493Q5088J5308O3509J20513O2998q3164p3197q6811J37300j8014O155
14138C8192j4704j08475p0315k7427r6370P5245J63161M730M8627k7713j15147
14127a30196Q0457Q9784J6606o1865j01530o210O5965o734j172J00567M9911n3412
14115D2171j850j83386K3775P8893N6631n5548j34570k6931M1743N5388M2278
14104f1406j7287l4870P0911K1519Q4646l9056m6818n8304j6890l3504L7135J4262
14092g9662L1926j5068N0893P8587M8469P2275j7664L2594p0604o0276r351J8136
14080H0255J31924M7931r0451p5739K2940l6902q2043o1437l2794k6849O2747
14069f0418J15665K3593P6420k5108M2795o976j02460m4035K3460l8793R729N0065
$$ y = [-191493, -106405, -91097, -27588, 92925, 155923, 72759, -438, -87249, 50051, 32037, 38192, 23488, -84987, -155302, -182729, -279099, -203854, -40693, -35963, 12664, -15049, -130196, -49739, 40045, 56651, -5214, -106744, -112954, -46989, -53723, -54895, 45672, 95583, 42171, 40321, -143065, -119290, -40397, 16234, -39314, -173884, -200815, -159072, -103684, -61406, -78693, -113563, -42652, -21133, 63513, 24457, -22361, -80665, -97555, -131059, -93924, -79662, -47736, -62804, -11911, 66676, 115145, 187420, 169756, 202350, 131746, 71470, 62119, 80255, 212179, 260110, 169659, 93920, 116860, 79958, -2085, -63522, -96316, -123165, -60418, 55247, 78840, 155260, 130152, 172947, 165971, 63511, 19476, 42936, 4143, 13872, 63937]
14057F3937J0656L0965k94l3220j3524k2728o087m192k3464o7034n9884K0622
14045a04247J33699J6710N4430k3917q6823n8226N7600P9545m0977n3957M2518
14034A6355j00768l1105L6841J67038K4367M7498n7933j22338k06192M5082J18249
14023f2906l1116m6414n0117J21221M7897p6663n907J04786k5613l4337k247J7399
14011d4017J02916M3498Q861K8992m5891j04964p6504R1590k8458m7338J5471
14000e5844k7921L6590K3134k8385k7337m8815O3199R0292n351k4898P4766J1845
13988H1275r0491q120L0932J0098n4620Q5856J04308k5624l8679k9207j40013
13977g4285J4763N9796l3088N6100O5614m4010l7956m0708J4854K0922K456J9011
$$ y = [63937, 74593, 105558, 105264, 72044, 58520, 35792, 29705, 25513, 2049, -64985, -124869, -104247, 29452, 46162, 100592, 76675, -10148, -68374, -10774, 68771, 27794, -26163, 16355, -84413, -115518, -78677, 88361, 112728, 160226, 102293, -20045, -226237, -181155, -62906, -94022, -140436, -190553, -69332, -21435, -98098, -104005, 781, -24832, -59169, -61416, -44017, 58899, 102397, 111258, 140250, 94359, -10605, -87109, 4481, -23977, -71315, -55844, -83765, -47175, -24041, -52426, -79763, -128578, -65379, 24913, 19562, -5336, 69430, 81275, -9216, -17336, 13596, 23694, -30926, 54930, 159238, 133614, 94935, 65728, -74285, -59522, 274, -32814, 23286, 88900, 44890, 6934, -33774, -18920, 2002, 4458, 23469]
13965B3469L0760N9479j35577p2501p3507n8797K4623N8665Q7263N4507J0297
13954H681J6212k4442n9418P2697l2149P2929L4137j09967r2430R3040J08853
13943H8143O1203j74641j08142K3713M7304j8452R639N7761L1273L0790l6313
13932A2278N2914R4493o3538m0859p6798j33510j45765j170L4365O3659K6837
13921a77094L9418j6396o5373P4397N2937k2137m5354q4506L4032Q8323m4339
13910a66092j3597K0308R3410M814m5532j2123o7918M2297J36998j5664k2213
13899d5312J9752r585P2491O1959J09842L1973j15700n9529m8495q8860L2800
13888c8664J7722Q4880k8964p0351o2752O8567j9377K2435K8003J46837K7192
$$ y = [23469, 54229, 113708, -21869, -94370, -167877, -226674, -202051, -143386, -56123, -1616, 8681, 24893, 451, -58967, 13730, -18419, 54510, 88647, -21320, -113750, -20710, 88143, 149346, -25295, -133437, -109724, -62420, -80872, -71233, -13472, 17801, 48591, 12278, 65192, 159685, 96147, 55288, -21510, -155020, -300785, -301955, -267590, -203931, -177094, -137676, -154072, -219445, -145048, -92111, -114248, -159602, -244108, -210076, -121753, -166092, -179689, -159381, -65971, -61157, -106689, -118812, -186730, -144433, -7435, -23099, -45312, -25560, -35145, 37346, 99305, 209147, 241120, 125420, 65891, 17396, -71464, -38664, -20942, 63938, 34974, -35377, -98129, -29562, -48939, -26504, 1499, 148336, 175528]
13877A75528n4192k9563m3945j71625j4216N657n8918l7426J28850J9915p7842
13866a57777K6436M7958L0242k5724k5006P1078p840J87380k3845j51461p5181
13855a03740R9221m1978j4659M8876n9524J11750Q4288p7121p1482j9257j08658
13844a52284m8650J03439K7587P1285o1574l3719M6783k6104m2342J079K8671
13833h5829n900l1111P0902M5427m4555l4862M7059k511P3951M1867j33882j05263
13821a64707O5453R3279P8178j61267j00141K3838j1785R481J21278j9956J1274
13810e5075Q4733J32717J7045M072l8706q795k2708j32033o9964J14709K1215
13799D7210r5037K330n6083m5292J22712k4492k5425r1241J519Q340j8310Q6908
$$ y = [175528, 121336, 91773, 47828, -123797, -138013, -132356, -191274, -228700, -99850, -79935, -157777, -131341, -83383, -53141, -78865, -103871, -32793, -40633, 146747, 122902, -28559, -103740, -4519, -46497, -61156, -12280, -71804, 39946, 124234, 47113, -24369, -43626, -152284, -200934, -97495, -69908, 1377, -60197, -93916, -47133, -73237, -115579, -114500, -85829, -91729, -122840, -51938, -6511, -51066, -85928, -38869, -41380, 32571, 74438, -59444, -164707, -99254, -5975, 72203, -89064, -189205, -165367, -177152, -167671, -46393, -66349, -55075, 29658, 162375, 179420, 183492, 144786, 135991, 113283, -18750, -88714, 25995, 47210, -47827, -45497, -101580, -146872, -24160, -48652, -74077, -165318, -163799, -155459, -173769, -86861]
13787h6861P2481P684l2915N381k8239j28710Q4712K9412L8265j7737j05002M2093
13775a19436J09932k7419r5734L6273K7682J3601J3505m816o6885j8706L2594
13764i9409q824M5172L1473l6270P9173j763L9180L137N2510n0234j23937k0177
13752h9969J02493k6658n9341N5986P0578K3045q9358o310J03033J56090j21946
13741A17643j66971n7184O4068j20725P4330J62182m2366m0764q6083o2829M5170
13730a13529P264R913N5353L3346j916n5008J2860P1667L874o2624N2939K4897
13718C9036M1997j16344k4033O0111J08485n1519M8334L6608p6781r9386n7501
13707i0993K2585l386k2364Q9184q6439o9074J780M3261J32828J40995P3745q5709
$$ y = [-86861, -14380, -6696, -39611, -34230, -62469, -191179, -106467, -77055, -38790, -56527, -161529, -119436, -9504, -36923, -132657, -96384, -68702, -55101, -41596, -46412, -113297, -132003, -99409, -108233, -63061, -31588, -67858, 11315, 9552, 48732, 51869, 104379, 54145, -69792, -89969, 12524, -14134, -73475, -17489, 53089, 76134, -13224, -19534, 83499, 239589, 117643, -49328, -106512, -42444, -163169, -88839, 73343, 30977, -9787, -95870, -158699, -113529, -106265, -96352, -40999, -7653, -9569, -64577, -51717, 19950, 23824, -38800, 14139, 39036, 81033, -35311, -59344, 767, 109252, 57733, 106067, 142675, 65894, -33492, -90993, -68408, -71794, -94158, -4974, -91413, -160487, -158707, -115446, 17382, 158377, 232122, 146413]
13695A46413j5558K25r3439R6990O8564k0550J6070l9220o8133k1385L6441R8964
13683B05382m2085j06849j06459R5344N5528Q0718j1895j78405j20144P5443J12961
13672E9539R1347j30325j80371j7442O8868k6825R620K9166J03016K2036j563
13661B7066q906M4430k3262O4677l8178O0152p5902q7628J28421O0374K7886l9182
13649A39948o1263n6453n1593o6141j4444J689N8565n0242k0115M3019M1392k7280
13637f2918N9720R4610R3777q8162j41695M0035N2091N8705K4117j8603M2089
13626A53766r066J3688j5710Q6776O2302Q8198j28941K8609k9934k9436m1632
13615A78620o9572j59426j52511J6613J13663P5251o5240K8124J09290k5267N1921
$$ y = [146413, 130855, 131080, 37641, 134631, 203195, 182645, 198715, 159495, 91362, 69977, 106418, 205382, 163297, 56448, -50011, 45333, 100861, 181579, 169684, -8721, -128865, -53422, 59539, 150886, 20561, -159810, -177252, -108384, -135209, -125589, -96423, 6593, 28629, 27066, 18160, 62590, 39328, 104005, 65827, 125979, 50077, -37551, 90870, 151244, 179130, 139948, 78685, 22232, -29361, -95502, -109946, -108257, -49692, -99934, -120049, -77030, -35638, -62918, -3198, 91412, 185189, 97027, -44668, -4633, 47458, 106163, 130280, 111677, 153766, 144700, 158388, 142678, 229454, 291756, 379954, 251013, 279622, 249688, 220252, 178620, 109048, -50378, -202889, -186276, -72613, 2638, -62602, -34478, 74812, 49545, 101466]
13604A01466K8334q8168L0946N0902j8485j702j6709O2165l0884l4951K4657K2399
13592A29970j7815l856n1769q7363L2670L1139l2046j1J01767N4624j57198j17852
13580a17740j8544l6324M9574L4251M6641J8266j5247M4344J6308o1940k7667
13569f8078j5947J11863p0547q7800P9342J69954Q2987J1893j29065o7215Q0470
13558I7857j50608p4200r59L3939R4312L6761m6880L7594M0898O1207N358o3470
13546G1809j1303O482J13010j00786j15686P572J33485M8276K9649q5669j2878
13535H3961K07358k354j50605J994l5978o0452P111J6438k1682p5008L4163N2274
13523E7220K406j15863k4014O0429L7951q1208J3382K4235q6002R7179J13832
$$ y = [101466, 129800, 41632, 72578, 123480, 104995, 103293, 86584, 148749, 117865, 82914, 107571, 129970, 112155, 108299, 56530, -30833, 1837, 32976, 930, 919, 102686, 157310, 112, -117740, -136284, -172608, -123034, -88783, -42142, -23876, -39123, 5221, 21529, -40411, -68078, -84025, 27838, -42709, -130509, -51167, 118787, 201774, 213667, 84602, 17387, 97857, -52751, -126951, -127910, -93971, 341, 37102, -9778, 27816, 68714, 129921, 135279, 71809, 60506, 66988, 179998, 79212, -36474, -28902, 104583, 152859, 182508, 96839, 83961, 291319, 288965, 138360, 140354, 104376, 43924, 51035, 67473, 45791, -29217, 4946, 57220, 59626, -56237, -80251, -19822, 18129, -63079, -49697, -25462, -111464, -14285, 99547]
13512I9547O1126p5035p5151N4976q6759k8841p088o5060L1542k668L4660o150
13500f4901J01498M7383m3810J29385L9788m1102j06520J9201m710o8160J4720
13489B2772O5195M3782j74022N022r9333j00201P2169J99713N2071l3283j4814
13478C9071P357l599p977L3237J12237J4371j06411p6849J38336m0634L6879J8382
13466A64400L3665L0230m9469p1239K4630j1845k7096r9251q9598Q957N5854k3867
13454e4629n1932R8036J92492j6120n886L3542k5675k0801J2246M6744k4707N6180
13442B39490r7964p2078K8209O4131l8082l9111M055o1368r6601M109K6842o723
13430d5091l0867J19008K6441K0069p0996O2753N7941J0872o9586J545j01708
$$ y = [99547, 160673, 85638, 10487, 65463, -21296, -50137, -57225, -122285, -90743, -93411, -58751, -64901, 36597, 83980, 40170, 169555, 209343, 168241, 61721, 80922, 76212, 8052, 22772, 87967, 131749, -42273, -37251, -136584, -236785, -164616, 35097, 87168, 53885, 39071, 46428, 42829, 34852, 68089, 180326, 194697, 88286, 11437, 149773, 109139, 146018, 164400, 198065, 228295, 178826, 107587, 132217, 120372, 93276, -5975, -95573, -86616, -30762, -54629, -106561, -8525, 183967, 167847, 161961, 195503, 169828, 149027, 161273, 208017, 183310, 239490, 141526, 69448, 97657, 161788, 123706, 84595, 88650, 27282, -69319, -65210, -38368, -45091, -75958, 43050, 69491, 89560, 18564, 81317, 139258, 150130, 80544, 82089, -19619]
13419a9619n2972J54853L8787j24638l1211P9565J66J8485m3972k2590L2937k1340
13407H451m163L1649J17835N7602m8154p3134p9680k264J55247Q026J053q062
13395A64406o9641l5885P3199M7995o1002K7807l4720P352m4779R9265o8241O3483
13383A69239k256l4923k7223l3300J3531J0948q5243m2566N9759l5970j65926
13372a73930K9555O4871J2130J9425J41343Q5170m0238j5263j03167m136J59371
13361A75131M3569j5563p7472p9569o3291N8481l2928l5007R608p4241O4734M2005
13349A5457J08748j0799N4884N1574m0792o7538j654j7529M7605J53198m6554
13338B46600M2622l6716l5135k6813J9599j10891q336N1915k0352L760J6975l066
$$ y = [-19619, -72591, 82262, 121049, -3589, -34800, 44765, 44931, 63416, 19444, -3146, 29791, 8451, 4288, 35937, 153772, 211374, 163220, 90086, 10406, 8142, 163389, 171415, 172468, 164406, 94765, 58880, 132079, 180074, 119072, 146879, 112159, 119511, 74732, 173997, 105756, 169239, 166983, 132060, 104837, 71537, 85068, 96016, 10773, -31793, 27966, -8004, -173930, -144375, -79504, -67374, -47949, 93394, 178564, 138326, 123063, 19896, 15760, 175131, 218700, 203137, 125665, 46096, -17195, 41286, 8358, -26649, -17041, -91282, -26548, 15457, 124205, 113406, 168290, 219864, 179072, 111534, 109880, 92351, 139956, 293154, 246600, 289222, 252506, 217371, 190558, 210157, 99266, 90930, 142845, 122493, 126253, 143228, 140162]
13326A40162K2478K9827L383j28725j22675L7087M3824J7600J00821m3495m2753
13315E7534R5467N2851O5106L213q3694j12238L4999R4456q792p6499m5510N910
13303H2803j02595L4096M5115L8538L9979p6816j6219N2661O6839o8389R0717
13292A86729R5854k1695o2076p2487k7136O914o6567l0760N4566P8270j28912
13281A2700o474J43369J04677n4491O728K3762j4962J6533n0009l0004N8023r6949
13269A12903L3440R0215N9657k454m2323N3055m7387j56437k6795J37023J98953
13258D09850j03463N0034L2180O3269L6152l4032O2710n7998m5671Q7995J7003
13247E18029j44795j77892n1432J21510K08425N5050r0826l6685J3929p0620j8709
$$ y = [140162, 162640, 192467, 195850, 67125, -55550, -18463, 25361, 42961, 143782, 100287, 57534, 153001, 205852, 270958, 274171, 190477, 78239, 113238, 207694, 198902, 122403, 76893, 82803, -19792, 14304, 59419, 97957, 137936, 61120, 44901, 97562, 164401, 96012, 186729, 282583, 260888, 198812, 126325, 99189, 106103, 39536, 8776, 63342, 141612, 12700, 6226, 149595, 254272, 199781, 206509, 230271, 215309, 231842, 181833, 151829, 209852, 112903, 146343, 236558, 296215, 293761, 251438, 304493, 257106, 100669, 73874, 210897, 409850, 306387, 356421, 388601, 451870, 488022, 453990, 516700, 458702, 413031, 501026, 518029, 373234, 195342, 143910, 265420, 473845, 528895, 438069, 401384, 415313, 344693, 325984]
13236C25984O0026J1834P7885K2694k9988j7228M7667k2615j34408j84801N237
13225A62287J42674J15457j8963L9034N0402N3578n431P8073j6459l7574L1842
13214E94920J00117M0874j42785M179J01528p257n7744O4614p107k5303l0801
13203F35235L1580k7411j58919J0475K02694M7038o3734j6658O7567j03256r178
13192F15433N1063K5656K8208M8471K0036N0860j5187J0772k4463L0787J39275
13181I80911l5926l4996L0876l361p3795L7875L8961P4631j5423O1172K6771J20269
13169A207965J06168L3020j5692K6264J1067R4921K23132J40554J0607O5063J8638
13158A921707K4925o9265O5630J30659J52830J76571Q5842L2789R7797J43653
$$ y = [325984, 386010, 397844, 475729, 498423, 468435, 451207, 498874, 476259, 341851, 157050, 162287, 304961, 420418, 401455, 440489, 490891, 544469, 539038, 617111, 600652, 563078, 594920, 695037, 735911, 593126, 597305, 698833, 691576, 633832, 698446, 691339, 666036, 635235, 666815, 639404, 480485, 490960, 693654, 740692, 676958, 660300, 727867, 624611, 615433, 666496, 692152, 720360, 768831, 788867, 839727, 824540, 835312, 810849, 841636, 980911, 944985, 909989, 940865, 937504, 863709, 901584, 940545, 1015176, 999753, 1060925, 1087696, 1207965, 1314133, 1347153, 1331461, 1357725, 1368792, 1463713, 1686845, 1827399, 1838006, 1903069, 1921707, 1946632, 1877367, 1942997, 2073656, 2226486, 2403057, 2488899, 2521688, 2619485, 2763138]
13148B763138P1608K15265J40662K7061p63q890j9817p218j7632n9329Q7327L0067
13136C221479o791j11887j13078m1441o1122o1279j35506j6893m3989o4660j74035
13125B390798o0074k9328l1658r3736j35962j22206m0615O281p2906j5679l921
13114A790994o9726m1167j85088j02706k2265K359M9308l5045j61399m4907l6621
13103A143737j12722J25110J28492r151N307K4325L5393j4137j21911q944J55108
13092A350607k3871j6562R0228J7560N1137k4353o7935m0936P5182j6886l158
13081A391013R6192R2563J19168L1313J02685K79729J19837J43826M9072N0334
13071B475732j42067k64847j92118q1674n3971j00398j84430j22484m5205M9773
$$ y = [2763138, 2834746, 3050011, 3190673, 3217734, 3216971, 3208081, 3188264, 3181046, 3163414, 3104085, 3191412, 3221479, 3214688, 3102801, 2989723, 2948282, 2887160, 2825881, 2690375, 2673482, 2629493, 2564833, 2390798, 2330724, 2301396, 2269738, 2176002, 2040040, 1917834, 1877219, 1883500, 1810594, 1794915, 1790994, 1721268, 1680101, 1495013, 1392307, 1370042, 1372401, 1421709, 1386664, 1225265, 1180358, 1143737, 1031015, 1156125, 1284617, 1275466, 1280773, 1305098, 1340491, 1326354, 1204443, 1195499, 1350607, 1326736, 1310174, 1400402, 1417962, 1469099, 1444746, 1376811, 1335875, 1411057, 1394171, 1391013, 1487205, 1579768, 1698936, 1730249, 1832934, 2112663, 2232500, 2376326, 2425398, 2475732, 2333665, 2068818, 1876700, 1795026, 1741055, 1640657, 1456227, 1333743, 1288538, 1338311]
13061A338311M5908j20235l2071Q5830R1776L1557o5701L9027L9108p7112j17736
13050A258662M3792K6736J0979N3697M7544O8900K6032n6597q8801j66178k8804
13039A195962J30148O4206K1688L3273J14605j3549J1610m897k0028R9036J6656
13028A648710n4005K74L9001j36651M2641J24428R7606l3948Q9044P283o7257
13017A757126j10041j26845J31588R2349j9759J52448M5637j11410m6755P4020
13007A838358J73147J72546j13684j01541j34998j0478M0559Q2840J54613O2892
12997B164254P6748O7623k8546p393L6096L490n3139o9183L6092n8394l6500n8697
12985B072451P473K28191J42204j2323j574N9247M5954L1709R8282O958l0437
$$ y = [1338311, 1384219, 1263984, 1231913, 1317743, 1409519, 1441076, 1375375, 1414402, 1453510, 1376398, 1258662, 1302454, 1329190, 1340169, 1393866, 1441410, 1510310, 1536342, 1479745, 1390944, 1224766, 1195962, 1326110, 1390316, 1412004, 1445277, 1559882, 1546333, 1557943, 1553046, 1533018, 1632054, 1648710, 1594705, 1594979, 1633980, 1497329, 1539970, 1664398, 1762004, 1728056, 1817100, 1824383, 1757126, 1647085, 1520240, 1651828, 1744177, 1724418, 1876866, 1922503, 1811093, 1764338, 1838358, 2011505, 2184051, 2070367, 1968826, 1833828, 1823350, 1863909, 1946749, 2101362, 2164254, 2241002, 2308625, 2280079, 2272686, 2308782, 2312272, 2259133, 2189950, 2226042, 2167648, 2131148, 2072451, 2079924, 2308115, 2450319, 2437996, 2436422, 2495669, 2541623, 2573332, 2671614, 2678572, 2648135]
12974B648135K2109O377J44755N5260J58725N3490k33495j549J93844N8965M6679
12963C153295M8306L0732o1845k5065M4804J3342O2940L2808r765P5666R0372
12952C455590j6317l052J51683J34522l5399q3858k9314J15147J02882Q1886R2730
12941C966500J710p591J18565J42578K34392O6024o7247O0294J01228O5167J05556
12930D787176Q8728J4721J35371R4059O9569P0672O0151J08097o7767J22578K82952
12919E766307J11267P6938J39003K00019N2114K0070J52609J10225K61698J94490
12909G084740N9194K46028K16716J32558K33576K17306R1482J45106K32205K16346
12899H875257J30420J99822K65363L63414K48792L22675K29953K28737M22448
$$ y = [2648135, 2670244, 2676621, 2821376, 2876636, 3035361, 3088851, 2855356, 2853807, 3047651, 3106616, 3153295, 3201601, 3232333, 3170488, 3145423, 3190227, 3203569, 3266509, 3299317, 3289552, 3365218, 3455590, 3439273, 3436221, 3587904, 3722426, 3687027, 3603169, 3573855, 3689002, 3791884, 3873770, 3966500, 3968210, 3960619, 4079184, 4221762, 4456154, 4522178, 4454931, 4515225, 4616453, 4681620, 4787176, 4875904, 4890625, 5025996, 5120055, 5189624, 5260296, 5320447, 5428544, 5360777, 5483355, 5766307, 5877574, 5954512, 6093515, 6293534, 6345648, 6365718, 6518327, 6628552, 6890250, 7084740, 7143934, 7389962, 7606678, 7739236, 7972812, 8190118, 8281600, 8426706, 8658911, 8875257, 9005677, 9205499, 9470862, 9834276, 10083068, 10405743, 10635696, 10864433, 11286881]
12890A1286881L88590M08184J46105L43603L86626M02769M27018N11566L13749
12881A4615091L99037M61630M53981L94466M94854N41256O48944O54038N61368
12872A9224665N81984O24018O88931P13933O84897Q25963R01116P99500R52281
12863B5997288R96489J034004J122020J196818J117791J239173J386067J517889
12855C5607539J503701J653471J633211J715183J998185K116644K234730K216693
12847E0679357K330996K637227K755814K936268L053461L315194L547082L595377
12839G4850776L789732L892932M165611M337713M400951M621035M879556N006180
12831A09944486N166639N150530N089671N194136M975324M742378M425568M014629
$$ y = [11286881, 11675471, 12083655, 12229760, 12573363, 12959989, 13362758, 13789776, 14301342, 14615091, 15014128, 15475758, 15929739, 16324205, 16819059, 17360315, 18009259, 18663297, 19224665, 19806649, 20430667, 21119598, 21833531, 22518428, 23344391, 24245507, 25045007, 25997288, 26993777, 28027781, 29149801, 30346619, 31464410, 32703583, 34089650, 35607539, 37111240, 38764711, 40397922, 42113105, 44111290, 46227934, 48462664, 50679357, 53010353, 55647580, 58403394, 61339662, 64393123, 67708317, 71255399, 74850776, 78640508, 82533440, 86699051, 91036764, 95437715, 100058750, 104938306, 109944486, 115111125, 120261655, 125351326, 130545462, 135520786, 140263164, 144688732, 148703361]
12823A48703361L633076L096750K359264J577876J068587K64725o65447j448128
12815A58590064k194726k863982l456792l956083m252260m654191m911379n102880
12807A27197771n190441n298433n139923n103830m998546m743739m437316m409293
12799H7876250m356569m058578l862059l715414l499818l396965l278336k880145
12791E8828366k656309k522343k366635k321039k194939k037265j889213j763079
12783D1077544j830991j736153j592540j469009j429971j322342j273424j085945
12775B9337169j059226j058761r76856q26903q72758q57309q46242p90886p45046
12766B1303182p29532p41225p68330n47241m68393n50843m02835m04349m87196
$$ y = [148703361, 152336437, 155433187, 157792451, 159370327, 160438914, 160703639, 160038192, 158590064, 156395338, 153531356, 150074564, 146118481, 141866221, 137212030, 132300651, 127197771, 122007330, 116708897, 111568974, 106465144, 101466598, 96722859, 92285543, 87876250, 83519681, 79461103, 75599044, 71883630, 68383812, 64986847, 61708511, 58828366, 56172057, 53649714, 51283079, 48962040, 46767101, 44729836, 42840623, 41077544, 39246553, 37510400, 35917860, 34448851, 33018880, 31696538, 30423114, 29337169, 28277943, 27219182, 26242326, 25415423, 24542665, 23685356, 22839114, 22048228, 21303182, 20573650, 19832425, 19064095, 18516854, 18048461, 17497618, 17094783, 16690434, 16203238]
12757A6203238m38246m61476l80616n49920n08683m47000k45111l27092k99061
12748A2546033l25718l27464k67410m19180k30304j70290j78695k74710l14046
12739A0038216l54826l99049j70608j63277k45433j19781m2991j55340j48728
12730H238183l52712k44641j13308j11220j58846j58574j62031l326q8526q9363
12720F755636j34462j20459k59930k02651j5894r1027j28911r7514j75396j36796
12710E392596m8649p5390M1138l1657k6524j18292k26175o9871J5025l4851p8787
12699D738563j12200r9428j52854j11331J9020m4755q0225o875m7736k19113j43014
12688C740052L7367O0620m8099m8005o0000M0175k1798o9751o7793r5096j26587
$$ y = [16203238, 15764992, 15303516, 14922900, 14372980, 13864297, 13417297, 13172186, 12845094, 12546033, 12220315, 11892851, 11625441, 11206261, 10975957, 10805667, 10626972, 10352262, 10038216, 9683390, 9284341, 9113733, 8950456, 8705023, 8585242, 8542251, 8386911, 8238183, 7885471, 7640830, 7527522, 7416302, 7257456, 7098882, 6936851, 6933525, 6844999, 6755636, 6621174, 6500715, 6240785, 6038134, 6022240, 5931213, 5802302, 5704788, 5529392, 5392596, 5343947, 5268557, 5309695, 5278038, 5251514, 5133222, 4907047, 4837176, 4852201, 4817350, 4738563, 4626363, 4526935, 4374081, 4262750, 4281770, 4237015, 4156790, 4149915, 4102179, 3883066, 3740052, 3777419, 3838039, 3789940, 3741935, 3681935, 3722110, 3700312, 3630561, 3562768, 3467672, 3341085]
12677C341085o5609o3676l902Q3170o9804m8139m9115k4750r5688j06069r1877
12666B805626l7917r986K834q0579j52582L5673j110r485l3110m8075N7595k583
12654B526301n7773o1925o3764j8389J08212R5496l5376q3299j19566n0662k0049
12643B219206j18866j6229J06542p8625k1819m3679r954J3344P798n7064K0464
12632B021118p5082j02174j08327p0033O1332J53761O6787j81435J2949K5110
12622A804006o3041l9728J0888j1994M3975M4515Q7973j36527k5295j96181j37787
12611A380804P7312N5954j09361q4838K13482P5785r2124l0442l1289J89322n8328
12600A586277L2558p9797j27395J282J23894N569n9001l3046j25096r5976N2740
$$ y = [3341085, 3275476, 3211800, 3207898, 3291068, 3221264, 3173125, 3124010, 3099260, 3003572, 2897503, 2805626, 2767709, 2757723, 2760557, 2679978, 2527396, 2563069, 2561959, 2552474, 2519364, 2471289, 2528884, 2526301, 2468528, 2406603, 2342839, 2324450, 2432662, 2528158, 2492782, 2409483, 2289917, 2239255, 2219206, 2100340, 2084111, 2190653, 2112028, 2090209, 2046530, 2036576, 2049920, 2057718, 2000654, 2021118, 1946036, 1843862, 1735535, 1665502, 1726834, 1880595, 1947382, 1765947, 1778896, 1804006, 1740965, 1701237, 1712125, 1700131, 1744106, 1788621, 1876594, 1740067, 1714772, 1518591, 1380804, 1458116, 1514070, 1404709, 1319871, 1533353, 1609138, 1517014, 1486572, 1455283, 1644605, 1586277, 1618835, 1539038, 1411643, 1412925, 1536819, 1542388, 1483387, 1450341, 1325245, 1229269, 1282009]
12589A282009J74089R0056J14848j2633l1966j72948j01044r0667P849K9204n0577
12578A238220k8250j2055q3299N1577N802N9922k7141o4710p616J79664J51427
12567A463541K63728J75009K10793K03164K93619K18742K30425J53586K01476
12558C414083j3154j36701k70884l93391k58744k25390j10997j87237j52291j92846
12548A472448J06637J27521j02374j04081j63O0232l6171P649J89578k9661O7979
12537A759594j7928N4518Q0175P8812K18963R1571l6600k6571l4772k832m4273
12526B120657j21777q6478q6637r8262k3904J31695j2669q2362J9838O2800j33300
12515A689601k28290m704r101k7045j05544j47189p4761M5157M0207R4517k2251
$$ y = [1282009, 1456098, 1546154, 1661002, 1648369, 1616403, 1443455, 1342411, 1251744, 1259593, 1288797, 1238220, 1209970, 1197915, 1114616, 1166193, 1171995, 1231917, 1204776, 1140066, 1132450, 1312114, 1463541, 1727269, 1902278, 2113071, 2316235, 2609854, 2828596, 3059021, 3212607, 3414083, 3400929, 3264228, 2993344, 2599953, 2341209, 2115819, 2004822, 1817585, 1665294, 1472448, 1579085, 1706606, 1604232, 1500151, 1499988, 1560220, 1524049, 1531698, 1721276, 1691615, 1759594, 1741666, 1796184, 1876359, 1955171, 2174134, 2265705, 2229105, 2202534, 2167762, 2164930, 2120657, 1998880, 1912402, 1825765, 1727503, 1703599, 1835294, 1822625, 1740263, 1760101, 1822901, 1689601, 1461311, 1456607, 1447506, 1420461, 1314917, 1167728, 1092967, 1138124, 1178331, 1272848, 1250597]
12504A250597K7367N7816P5544K94596K48392K36472K30291m3150j63535k83861
12494A930529k45768k40951k32301M3306k2950j29125k3754q7922j94409l2099
12484G64556l3103L6554J14132P5141l7711j64970k5799K2659k7034m4067n6036
12473F24322o7864R574k3454j5140J4324k141p2518j13778K8855J1585L1497j7083
12461D08179o71K7694m4722j8046K1461J1193q825J43415J20594n2723q3030Q9356
12449F13875p1663M3656l3115p0655J7829K0095J16542L2344j2124J946m5131
12438F13599l9472j82557j58789J27269K11634k2696j84999R9719k276r5983n5987
12427C09462J3342P1587J29959o5364j21739k2677m3256l5508m3807r1907L2018
$$ y = [1250597, 1277964, 1335780, 1411324, 1705920, 1954312, 2190784, 2421075, 2377925, 2214390, 1930529, 1684761, 1443810, 1211509, 1254815, 1231865, 1102740, 1078986, 991064, 796655, 764556, 731453, 768007, 882139, 957280, 919569, 754599, 728800, 751459, 724425, 680358, 624322, 556458, 566032, 542578, 527438, 541762, 539621, 467103, 353325, 382180, 393765, 425262, 408179, 407508, 435202, 390480, 372434, 393895, 405088, 396263, 539678, 660272, 607549, 524519, 613875, 542212, 585868, 552753, 482098, 499927, 520022, 636564, 668908, 656784, 658730, 613599, 574127, 391570, 232781, 360050, 571684, 548988, 363989, 463708, 461432, 365449, 309462, 322804, 394391, 524350, 458986, 337247, 314570, 271314, 235806, 191999, 100092, 132110]
12416A32110Q4879J09300L0991J18698J8862j607m6127n4872j64188l2486J5900
12405B11460j6946J06945k7621L1221J3748N1662j1174m1008K8027N3532p3450
12394C26396q7302m2867j9098P2702R5568O034P5336j14382k2368M358P352K9217
12382C30946J8305N2320K9241P1091J5408l3540j07712R362j7707M9919M9623
12371D67256O8307p1630j24279l5470Q1823n1071K9514r7888j2414m449o6233
12360A83466K7480Q4695N469l4730k0218j07104K91J41558R7817j09359j2122
12349B57243K7982M6863N8942K3691j58906o8403J09453K4302m9153k2573J545
12338B50986Q7850j1799n466p7186J1875p3753K4149R2663K1808n6301j20677
$$ y = [132110, 216989, 326289, 357280, 475978, 494840, 493233, 447106, 392234, 228046, 195560, 211460, 194514, 301459, 273838, 305059, 318807, 370469, 359295, 318287, 346314, 399846, 326396, 239094, 196227, 177129, 249831, 345399, 351433, 426769, 312387, 290019, 294377, 301729, 330946, 349251, 401571, 430812, 501903, 517311, 483771, 376059, 385421, 367714, 417633, 467256, 535563, 463933, 339654, 304184, 386007, 334936, 364450, 266562, 254148, 249699, 183466, 210946, 295641, 301110, 266380, 246162, 139058, 139349, 280907, 378724, 269365, 257243, 285225, 332088, 391030, 414721, 255815, 187412, 296865, 321167, 272014, 249441, 250986, 338836, 327037, 321571, 244385, 256260, 182507, 206656, 299319, 321127, 264826, 144149]
12327A44149k4991J48968Q4539p348k0676j97279m6538o6808K3905Q5467M8108
12316A71496n5253n200R4393M849L5582P0677Q186j9963n3489p8356r832M824
12304A67914o2551O8984J11217j09703r7565n777R1560O0908Q7978J3832O4507
12293C91304j00727j01026n677j0639K4764m274k2494M2643J3265j31641J3533
12282A09031K18619J29850q5745K241j28995j11714l4667k6539k9389N1778N3494
12271A47964K2331Q532k3032J2147N8671j7155j7157k1425N9596J62187p0137
12260C22522k39251K040l6712k3119N14O1054m36O5896m6024Q5078M0078l2190
12248A99450j65214L05J17010q4194m3091O5477N4942o2901q1939j01293M6662
$$ y = [144149, 119158, 268126, 352665, 345317, 324641, 127362, 80824, 14016, 37921, 123388, 171496, 116243, 111043, 205436, 210285, 245867, 316544, 324730, 304767, 251278, 172922, 163090, 167914, 105363, 174347, 285564, 175861, 78296, 72519, 164079, 224987, 312965, 326797, 391304, 290577, 189551, 183874, 173235, 197999, 193725, 171231, 213874, 227139, 95498, 109031, 327650, 457500, 371755, 373996, 245001, 133287, 98620, 72081, 42692, 94470, 147964, 170295, 178827, 155795, 167942, 226613, 209458, 192301, 170876, 230472, 392659, 322522, 83271, 85311, 48599, 25480, 25994, 87048, 86612, 152508, 106484, 191562, 231640, 199450, 34236, 34541, 151551, 67357, 24266, 89743, 144685, 81784, -155, -101448, -54786]
12237e4786N7358Q0686M6868J32631L0808j59810N613O8350J0282l8779R561n1688
12225A37094l9626L109l0007Q180j8729L1172p5747Q5354J18066q0560l1277m8281
12213E8748P438N4255j0302K2697J54433N3872o3405j27887p1646r34R8668l9910
12201A36027l7073J31431O2379k3215j53692M7491K29988j23872j58047r7451
12191A3966r804O7679J6540q193N4710P2034M1297m444M444L3892k6103K4116
12179B80134J09816J3580l3821r1475q3595J02520j1471K8524k4579l9512j33684
12168A16437m1484q5761k1441J01045m0519M7542j8241n6161O59k1224M5997n8715
12156c1866j38768R4036J43407k8589j43151p9981p482l964O3604M1648J19044
$$ y = [-54786, 2572, 83258, 130126, 262757, 293565, 133755, 139368, 207718, 218000, 179221, 188782, 137094, 97468, 100577, 70570, 78750, 60021, 91193, 15446, 100800, 218866, 138306, 107029, 58748, 66186, 120441, 110139, 132836, 287269, 341141, 277736, 149849, 78203, 77269, 175937, 136027, 98954, 230385, 292764, 269549, 115857, 163348, 393336, 269464, 111417, 13966, 4162, 71841, 88381, 80188, 134898, 206932, 248229, 243785, 248229, 282121, 256018, 280134, 389950, 403530, 369709, 278234, 194639, 297159, 285688, 314212, 289633, 250121, 116437, 74953, -10808, -32249, 68796, 28277, 75819, 57578, 1417, 2076, -19148, 26849, -31866, -170634, -76598, 66809, 38220, -104931, -184912, -192394, -196358, -132754, -91106, 27938]
12145B7938L6649L5415P8229R6907n1593N664j2468o2855l5990P4317j3433m8427
12133A30353P620J19400l2760j61181j41377n4458O8853m0898J33313m0914L4666
12122B2617R7896J70786O5213l3319n7168j65161l1345J08864K2904K9371p58
12111B29900J9884p8390p5661m0274J20094P9439M7625n5195l0411n5121l8434
12100A23456M5379K7913m5949n5530q3397j2603p0221P5680O2785J69770n3900
12089A83383r3098l7365R5361n26q9140o8078j4992k6679M6486O4783J1814K8284
12077A00233l4625n2417J1758K6525J4085J27522o1311m8662m851q7203j19092
12066a28038o3824O7309K78713L9576j129L805o5020P2704J8245k19373q4482
$$ y = [27938, 64587, 100002, 178231, 275138, 223545, 229209, 216741, 153886, 117896, 192213, 178780, 130353, 137973, 257373, 224613, 63432, -77945, -132403, -63550, -104448, 28865, -12049, 22617, 120513, 291299, 356512, 323193, 266025, 100864, 69519, 178383, 201287, 230658, 229900, 249784, 171394, 95733, 55459, 175553, 254992, 302617, 247422, 217011, 161890, 123456, 168835, 196748, 150799, 95269, 11872, -731, -70952, 4728, 67513, 237283, 183383, 90285, 52920, 148281, 147755, 58615, -9463, -24455, -51134, -4648, 60135, 71949, 100233, 65608, 13191, 24949, 51474, 65559, 193081, 131770, 83108, 78257, -8946, -128038, -191862, -124553, 154160, 193736, 192607, 196412, 131392, 204096, 222341, 2968, -81514]
12055h1514P1207K7859J08758O1413Q3513j09010j16092j16382O1081N3896J4019
12044E8748j34084n4100Q3138J31578j139N9506l4076M2844l545N6261N114q2582
12032A27663J23268R6677j8639j76432p6169J2538M5330p110p2083l4015M181
12021B5209l7385J32350P1071j14208p3729m5081L8300R217M6262L8240j01330
12010a1084J5017M3993J13585J4629p3272j69472n7466J69206R0787o2699j7345
11999E5879p3718J0676P1855n7426p6844J9134J7460K0201j3694o2797J6803R3486
11987B1015O7054K7045P9001J8448o9861L367o6159J6000P3083k7085k7813j46298
11975c2203p8358P3825P3509P2686r4461q8959L8478r826M9339L1084P7077n1325
$$ y = [-81514, -10307, 17552, 126310, 187723, 271236, 162226, 46134, -70248, -9167, 44729, 58748, -75336, -129436, -46298, 85280, 84141, 143647, 109571, 152415, 148870, 205131, 210245, 127663, 250931, 347608, 328969, 152537, 76368, 88906, 134236, 127126, 55043, 21028, 25209, -12176, 120174, 191245, 77037, 3308, -41773, -3473, 5744, 52006, 90246, -11084, 3933, 47926, 161511, 176140, 102868, -66604, -124070, 45136, 135923, 73224, 55879, -17839, -7163, 64692, 7266, -69578, -50444, -32984, -12783, -26477, -89274, -72471, 21015, 88069, 115114, 194115, 212563, 142702, 146069, 79910, 95910, 168993, 141908, 114095, -32203, -110561, -36736, 36773, 109459, 14998, -73961, -35483, -45309, 4030, 35114, 112191, 60866]
11963F0866J0047O7293Q0588M7261k9010l3299n5764J7015j6972M4355P925P6162
11951B76467j0230j32934q0449K4816L3261l7408N7412M5729p4141p5773j1884
11940A4866M458N8851j0316m8612P7515P102j22892j25221r6483L7962J56672
11929d6098N4571O404o689j3298m2029p3735r6127M399R4089R5208R7966K7722
11917A02383k6314l9950L0701m4934r4739J62855K37954M8594k8369k38238j82127
11906g2184o5383K754l4204k8002O9919j7002L5991J86608J55962m0117j1371
11895A82971J25664O1200r1493j38905j79478L2840N4982n1068n3951M9718P0869
11884F3349n141k8416J03289L8563r6092j49749j44364j1120j4482K93645J26006
$$ y = [60866, 70913, 138206, 218794, 266055, 237045, 203746, 147982, 164997, 148025, 192380, 200305, 276467, 266237, 133303, 52854, 77670, 110931, 73523, 130935, 176664, 102523, 26750, 14866, 19324, 78175, 67859, 19247, 96762, 103864, -19028, -144249, -240732, -202770, -46098, 8473, 14877, 8188, -5110, -47139, -120874, -217001, -212602, -118513, -23305, 74661, 102383, 76069, 36119, 66820, 21886, -72853, 90002, 327956, 376550, 348181, 109943, -72184, -137567, -134813, -169017, -197019, -127100, -144102, -108111, 78497, 234459, 194342, 182971, 308635, 369835, 278342, 139437, -40041, -7201, 47781, -3287, -57238, -7520, 63349, 58208, 29792, 133081, 171644, 75552, -74197, -218561, -229681, -244163, 49482, 175488]
11873A75488J7600j67980j2425J93820O8273j43176k02862p7387N0100J6922O329
11862g5298J13140L0555N0269l7471l0074l4258j6288j03168k02217J27849J52896
11851b4065P8807n4481j16365q1283K1603J64894O3121N3152O0274l0967j80455
11840d5765l9118L94l7461O6193M1213J33702K13006m4324j40925p8750j07334
11829c9169k9786R1486R9904m5848q5541m6722j94328Q3071O8845Q2095R3610
11818G7617N6409L8351L9210l3939J9011N3828J23294J14016J4494k7628L0385
11807E05048O7718k59J42609K41732J78678K17672J37411l5205L3906J67516q6079
11796A570747j23524m4510j29512k16834k13394J7668l8154j11452k3710O986
$$ y = [175488, 193088, 25108, 12683, 206503, 274776, 131600, -71262, -148649, -98549, -81627, -75298, 37842, 68397, 118666, 81195, 51121, 16863, 575, -102593, -304810, -176961, -24065, 54742, 261, -116104, -197387, -175784, -10890, 52231, 105383, 165657, 134690, -45765, -84883, -84489, -121950, -55757, -14544, 119158, 332164, 287840, 146915, 68165, -39169, -68955, 22531, 122435, 76587, -8954, -55676, -250004, -166933, -98088, -15993, 77617, 134026, 172377, 211587, 177648, 196659, 250487, 373781, 487797, 502291, 474663, 505048, 572766, 572507, 715116, 956848, 1135526, 1353198, 1490609, 1455404, 1489310, 1656826, 1570747, 1447223, 1402713, 1273201, 1056367, 842973, 860641, 822487, 711035, 687325, 694311]
11786F94311l5607l5855m5299k531M4556P4367M3502J1673Q8921l949N6391J5669
11774I06149J26622J21533J65643O4321J39930J59389n3349M8394j8749P5478
11764A735361Q4275J3883L513r126n2181K3707k1414k03692j61670j26307L7218
11753A323567j61610k61428m2453m0945j24369M4833J6545L6366J20956r6371
11743H15091j59N8152j25104n3958k44J4250K7759o7025M8726J35860K07964J51368
11731A212680P2378J39595J79594O264j25335k2084j24877j86915j47442j99458
11721H04400m3382j6388q7180j34798n2363K2697n2569p5271j97124j11702R4260
11710A50580P125N5650o345o1600o3343q2622N495J10384L0693J10043P6949p822
$$ y = [694311, 658704, 622849, 577550, 575019, 619575, 693942, 737444, 749117, 838038, 834089, 890480, 906149, 1032771, 1154304, 1319947, 1384268, 1524198, 1683587, 1630238, 1678632, 1659883, 1735361, 1819636, 1833519, 1837032, 1827906, 1775725, 1799432, 1778018, 1574326, 1412656, 1286349, 1323567, 1161957, 900529, 858076, 817131, 692762, 737595, 754140, 790506, 911462, 815091, 814932, 873084, 747980, 694022, 693778, 708028, 735787, 668762, 717488, 853348, 1061312, 1212680, 1285058, 1424653, 1604247, 1610511, 1485176, 1463092, 1338215, 1151300, 1003858, 804400, 761018, 744630, 657450, 522652, 470289, 492986, 440417, 365146, 168022, 56320, 150580, 157705, 213355, 207010, 145410, 82067, -555, 4940, 115324, 146017, 256060, 333009, 325187]
11698C25187j52615J02219n3520q0871l4364K4552j3614L3896J9579K6439L003
11687A99891p3789p0211k6127N5639J39441l1140l4648J3403j44009m4404P3317
11676E7363K3276N7238R8957j33539k9999j762q2607Q5491J08794J9359p0816
11665A31755j29650J808L0879K168l0235L4731Q2765K4771j2338k4439K1241j04780
11653B8676Q1745O1657L2516q8382o4375k1405m6769l7496j2912J9865p0712J9433
11641i8159K294O1182J3275l5522r2726l6117M4034J14260P2861N2289J23073
11630B20744L7977j14147k9675j35050j81777K9603J95910J19281J953k7831L7243
11619A54231P2968m308K1303r1851m8671L2121k1813L0528J7638k1017J01066
$$ y = [325187, 172572, 274791, 221271, 140400, 106036, 130588, 116974, 150870, 170449, 196888, 199891, 126102, 55891, 29764, 85403, 224844, 193704, 159056, 172459, 28450, -15954, 57363, 80639, 137877, 236834, 103295, 73296, 71534, -11073, 74418, 183212, 202571, 131755, 2105, 3913, 34792, 36960, 6725, 41456, 124221, 148992, 136654, 112215, 133456, 28676, 110421, 172078, 204594, 116212, 51837, 30432, -16337, -53833, -66745, -46880, -117592, -98159, -95865, -34683, -21408, -56930, -149656, -185773, -141739, -27479, 45382, 97671, 220744, 258721, 144574, 114899, -20151, -201928, -172325, 23585, 142866, 144819, 116988, 154231, 227199, 222891, 244194, 152343, 103672, 135793, 113980, 144508, 162146, 141129, 242195]
11608B42195n6004p3824J8895l5242L2730l2232J3300r4082o9881K1938M0995
11597H788l7664l1912J18188L22763Q7298j43166k2863R317j01727j9826M5051
11586B34247K9283L3249k1097m5565O6471m2873q8412J04721Q8965L8327l7046
11575C60270n61R9217O6624j62027n2558j00972j16070M8773O7581K447P1689
11564B84413Q287K4005O9542L4950q4223r0807l2409k7801K5609J6051N3888M1921
11552C23426M4640Q5645o4253J25791o7507j53160L6858K9541N9656P366o505
11541D21498R0772P0718K4833n0711J8834j8991O0202r907J2262q4273o6680o4387
11529D04170m2126J6480L0029j4121L3542K5224N6833J35385l0626j10220m813
$$ y = [242195, 186191, 112367, 131262, 96020, 128750, 96518, 109818, 15736, -54145, -32207, 8788, -28876, -60788, 57400, 380163, 467461, 324295, 301432, 310749, 209022, 189196, 234247, 263530, 296779, 275682, 230117, 296588, 253715, 165303, 270024, 358989, 397316, 360270, 359709, 458926, 525550, 363523, 310965, 209993, 93923, 142696, 210277, 212724, 284413, 292700, 316705, 386247, 421197, 336974, 246167, 213758, 185957, 211566, 227617, 281505, 323426, 368066, 453711, 389458, 515249, 447742, 294582, 331440, 360981, 420637, 428003, 421498, 512270, 582988, 607821, 557110, 575944, 556953, 617155, 607248, 619510, 535237, 468557, 404170, 362044, 378524, 408553, 394432, 427974, 453198, 510031, 645416, 614790, 504570, 499757]
11518D99757M4406J51278j06700j03196J6452J34109J24828j01044m3213K10424
11508H27101Q5865R3341j0941k8131K360N9409k2778J7603j11185Q0728J0828
11497A004200Q1780K0540j8266R5168K2745j9745K6485N6303N7959J837l8257
11486A290749p7864r1486K31988j6446j10899j26061J555J44595J05337J6072
11476A367540K9033J8254m4456Q5906L2663J8487l1568K0757L3788R0602j33006
11465A488000k17110o9073J28976R0283J15015N7546q6608r3799l266R9142M7175
11454A556281r8657k2968l8836L3603Q2599l060n1115L1939L7664o239J18618
11443A639829j2677l676P5814J09187K1268R5708p1778J14870J00076O6375K3972
$$ y = [499757, 544163, 695441, 588741, 485545, 501997, 636106, 760934, 659890, 616677, 827101, 912966, 1006307, 995366, 967235, 969595, 1029004, 1006226, 1023829, 912644, 993372, 1004200, 1085980, 1106520, 1088254, 1183422, 1206167, 1186422, 1212907, 1269210, 1327169, 1329006, 1290749, 1212885, 1121399, 1353387, 1336941, 1226042, 1099981, 1101536, 1246131, 1351468, 1367540, 1396573, 1414827, 1370371, 1456277, 1488940, 1507427, 1475859, 1496616, 1530404, 1621006, 1488000, 1270890, 1201817, 1330793, 1421076, 1536091, 1593637, 1507029, 1413230, 1409964, 1509106, 1556281, 1457624, 1434656, 1395820, 1429423, 1512022, 1508962, 1457847, 1489786, 1527450, 1521211, 1639829, 1627152, 1623476, 1699290, 1808477, 1829745, 1925453, 1853675, 1968545, 2068621, 2134996, 2158968]
11432B158968m920L0514k027J814J44938Q2700M1158K1819j9606Q0792R4867J22631
11420B753648o5163Q5966J51533N2496J35299J34477O0925J30281J60096P1347
11410C670905K78796K60315K48177K18243K72219K81648K98751M21268N61848
11401F512170M03290M77546M85884O46126N90242M84561L26339L30186M10753
11392A0667097M89019O37709P50122Q51172R57414J074598J230262J497642J838877
11383A9993912K150261K538767K909711L257238L751261M422468N382440O349905
11375E0755963P556076R094263J1073203J3418828J6582398K0320412K4453333
11368A53254476K8824526L2593438L3377386K8900045J8478451M523884r093989
$$ y = [2158968, 2154048, 2184562, 2182535, 2184349, 2329287, 2411987, 2453145, 2474964, 2455358, 2536150, 2631017, 2753648, 2688485, 2774451, 2925984, 2978480, 3113779, 3248256, 3309181, 3439462, 3599558, 3670905, 3949701, 4210016, 4458193, 4676436, 4948655, 5230303, 5529054, 5950322, 6512170, 6915460, 7393006, 7878890, 8525016, 9115258, 9599819, 9926158, 10256344, 10667097, 11156116, 11793825, 12543947, 13395119, 14352533, 15427131, 16657393, 18155035, 19993912, 22144173, 24682940, 27592651, 30849889, 34601150, 39023618, 44406058, 50755963, 58312039, 67406302, 78479505, 91898333, 108480731, 128801143, 153254476, 182079002, 214672440, 248049826, 276949871, 295428322, 299952206, 290858217]
11361B90858217j9357893k5529437k7455094k6209394k3071840j8874451j4586343
11354A35773765j0801086p543333m793195k544379q56295O02447J933441L265558
11346A15036923M729833O279546P733151R592678J1722321J3939563J6306684
11339A85340699J8578965K0464068K1403893K1045901J9684083J8459955J7548965
11332C22526529J6193248J3391019Q530616K085970m709363j0454467j4334511
11325C33229041j5900879j6157171j5932684j6061053j6601456j7374764j7655767
11318B17545267j7417516j6354913j4929690j3005839j0931846r029151p281344
11311A28594968n627044m247975k999937j547880l47290R87485K870287M857456
$$ y = [290858217, 271500324, 245970887, 218515793, 192306399, 169234559, 150360108, 135773765, 124972679, 117429346, 112636151, 110091772, 109235477, 109837924, 111771365, 115036923, 119766756, 126046302, 133779453, 143372131, 155094452, 169034015, 185340699, 203919664, 224383732, 245787625, 266833526, 286517609, 304977564, 322526529, 338719777, 352110796, 360641412, 362727382, 358018019, 347563552, 333229041, 317328162, 301170991, 285238307, 269177254, 252575798, 235201034, 217545267, 200127751, 183772838, 168843148, 155837309, 144905463, 135876312, 128594968, 122967924, 118719949, 115720012, 114172132, 113824842, 114812327, 117682614, 122540070]
11303A22540070P320782J0539190J4456076J8837506K3728799K7881747K9724103
11296B55028273K8804893K4122668J4361513P2458j5700238k8727720l5874996
11289B42086851l7024101l4046639k9063883k3777679j9069997j5069459j1988192
11282G2046901r527064p770816o563604n268525m435565l792119l319152k895436
11274B8474620k358161k134023k019713j565221j231983j038632r02003q16672
11266A6408212n47861m16811l18223k03908l3484j9572k30553j52905o217o6768
11256A4411910r5516k54891k27909l10752n45261m81562m34879m77932o23497
11247A0959711n47262m68029m92195n08728m53119l84882m44310m05510j30238
$$ y = [122540070, 129860852, 140400042, 154856118, 173693624, 197422423, 225304170, 255028273, 283833166, 307955834, 322317347, 322389805, 306689567, 277961847, 242086851, 205062750, 171016111, 141952228, 118174549, 99104552, 84035093, 72046901, 62519837, 54749021, 48185417, 42916892, 38481327, 34689208, 31370056, 28474620, 26116459, 23982436, 21962723, 20397502, 19165519, 18126887, 17224884, 16408212, 15860351, 15443540, 15125317, 14921409, 14887925, 14868353, 14637800, 14484895, 14478678, 14411910, 14316394, 14061503, 13833594, 13522842, 12977581, 12496019, 12061140, 11583208, 10959711, 10412449, 9944420, 9452225, 8943497, 8490378, 8105496, 7661186, 7255676, 7125438]
11238G125438j98154l90387k14487j27919j73926o9634j41818N9167R1967J48153
11228F108400J44999J24316J65239K73979L88654L62005M95582N02922M16564
11219H982660P4895k53944l98875o07197p37329o80325o46457m85521m26095m21216
11209D400596k59375k15425j79730q2319k05770k92790j31215m6487j06331j31788
11199B749366q266n3642j9606p866l6189j55012j8754k7839j1493K858r8798K9746
11187B344505p5942j05484n5077j8710J10021M1014K6342o4741l4420L2851K6054
11176B226413L9374O3641M314K2574K6946M8612M3120q5395j68583j11080j25207
11165A984729j00939j79578k0703O4160n5808N6235J1142j73462m6575K9679o7694
$$ y = [7125438, 6927284, 6536897, 6322410, 6194491, 6020565, 5950931, 5809113, 5868280, 5960247, 6108400, 6253399, 6377715, 6542954, 6816933, 7205587, 7567592, 8063174, 8566096, 8982660, 9057555, 8803611, 8404736, 7797539, 7060210, 6379885, 5733428, 5247907, 4821812, 4400596, 4141221, 3925796, 3746066, 3663747, 3457977, 3165187, 3033972, 2987485, 2881154, 2749366, 2741100, 2687458, 2667852, 2659986, 2623797, 2468785, 2450031, 2422192, 2410699, 2413557, 2314759, 2344505, 2268563, 2163079, 2108002, 2089292, 2199313, 2240327, 2266669, 2201928, 2167508, 2200359, 2226413, 2265787, 2329428, 2333742, 2356316, 2383262, 2431874, 2474994, 2389599, 2221016, 2109936, 1984729, 1883790, 1704212, 1683509, 1747669, 1691861, 1748096, 1759238, 1585776, 1539201, 1568880, 1501186]
11154A501186j21330q4027n5737j8820m634M003j498L7091L4415q7479L9938P178
11142A250286o4045j45869N4688O9811J7847o896q6022l9391l1112O4046O446
11131A089789k653l6923k9146M6859r270j22022L1887J07572j7487r5177r4558
11120H68871M038l8834o643J26247R413r7774K8405q1332K1611k3926m890J08747
11108I13933k1071P4316J894r926Q1100N9847r4007j05754j29355q5553J1932
11097F97356j0815L627o2086j24499j23174N661O9494n3512M2959m1895k5345
11086C77771O3122J22988R8611J08868J9201j76167p4211J9627O7504j0312j9773
11075E97229N1878K4460P3959j641L3535N5389o2104o5284N7036o2124j31402
$$ y = [1501186, 1379856, 1295829, 1240092, 1221272, 1216638, 1220641, 1219143, 1256234, 1290649, 1203170, 1243108, 1250286, 1186241, 1040372, 1095060, 1164871, 1182718, 1175822, 1089800, 1050409, 1019297, 1083343, 1089789, 1087136, 1050213, 1021067, 1067926, 1058656, 936634, 968521, 1076093, 1058606, 963429, 868871, 872909, 834075, 827432, 953679, 963092, 865318, 893723, 812391, 834002, 810076, 805186, 913933, 892862, 967178, 969072, 959146, 1040246, 1100093, 1006086, 900332, 770977, 685424, 697356, 686541, 690168, 628082, 503583, 380409, 386070, 455564, 402052, 445011, 403116, 377771, 440893, 563881, 662492, 771360, 790561, 614394, 540183, 559810, 627314, 617002, 597229, 649107, 673567, 747526, 745885, 779420, 834809, 772705, 707421, 764457, 702333, 570931]
11064E70931J36209J0179l8717N8912L2495j4544N596p4878P6370J15952o6428
11053H12077q434O0659n1283k4486k3863P5310k294j23480j42150l4190P4321
11042F12187k7997J29054N7452M754r3737m5110q6873m2142N6449J36775j5564
11031F85248O8564J14434p6683k8686J22655p3327j41642r4923p729J2746J21909
11020G02566k3451l9375r2707o4751n7750R8228J13529P7547J5745n5708J00063
11009G73936K9245n733j32880j11200j23596n1150P1942j7874m5663O2010p2703
10998C76334j7833j8994K9776M9094J18263M9071j00658J5448J20074Q880L3150
10987F62605k0954J9042m9590J7209p2488j5004n8351j7047L4497n9933k9006
$$ y = [570931, 707140, 717319, 678602, 737514, 770009, 755465, 761061, 686183, 762553, 878505, 812077, 803643, 864302, 813019, 788533, 764670, 839980, 837686, 714206, 572056, 537866, 612187, 584190, 713244, 770696, 775450, 681713, 636603, 549730, 507588, 564037, 700812, 685248, 753812, 868246, 791563, 762877, 885532, 812205, 670563, 575640, 567911, 580657, 702566, 679115, 639740, 547033, 482282, 424532, 522760, 636289, 713836, 729581, 673873, 773936, 803181, 797448, 664568, 553368, 429772, 378622, 450564, 432690, 387027, 449037, 376334, 358501, 339507, 369283, 418377, 536640, 585711, 485053, 500501, 620575, 629455, 662605, 641651, 660693, 611103, 628312, 555824, 540820, 482469, 465422, 499919, 439986, 410980]
10976D10980j21290k7615J87867K0127L2032M1648L5253J15050Q56k7328j61204
10965E06376p1240r556k2370k5901m6160o6169K2513j8225m3737n9313J9020P1209
10953B56447Q058L8736N3179q2265p0506K1459Q1357R6624J6632m2998q6040n4328
10941B36355L9312L3538K2661M8856l6719O9363J31261K757M7828J82988K1700
10930G99900j5705Q9990L5413J19669K18351P9746J28544P1656P46K732R3773
10919A624815L0093q1510k92830j46237r5561j64415j87446O983J04367n7797
10909G40462K592J9961J3045J12934M2633N267j08771P1217J08654R5499N4570
10898A158063M4892Q1280J18438J19463M6860J13525J17211J11221R9088O4708
$$ y = [410980, 289690, 262075, 449942, 470069, 502101, 543749, 579002, 694052, 694908, 667580, 506376, 435136, 425580, 403210, 377309, 331149, 264980, 287493, 269268, 225531, 166218, 185238, 256447, 264505, 303241, 356420, 274155, 203649, 225108, 306465, 403089, 419721, 376723, 290683, 236355, 275667, 309205, 331866, 380722, 344003, 413366, 544627, 547384, 595212, 778200, 799900, 784195, 874185, 909598, 1029267, 1247618, 1327364, 1455908, 1527564, 1528310, 1531042, 1624815, 1654908, 1573398, 1280568, 1134331, 1038770, 874355, 686909, 693892, 798259, 740462, 743054, 763015, 776060, 888994, 931627, 936894, 828123, 899340, 1007994, 1103493, 1158063, 1202955, 1284235, 1402673, 1522136, 1568996, 1682521, 1799732, 1910953, 2010041, 2074749]
10888B074749J0222J84817r8441k08606o9882r2556j86199j42549l6153j06413
10878A328989j72986j26076J48762Q3307j47302j14815j33152R898n321k22133
10868F49171q3624J18983N9445R8195J54576J01626j56002O7157M0314j3832j3618
10857A022391K91687K98816J38529Q8273L4625L3882p139j49958r9819j76036
10847A475251j40262l08887j54779j82872k17536q3703l1808r471k8527Q8674
10837D06080J10769n0978m6482j00953j11412M2125J25267m7296j37549N5225
10827B44796Q4645j05401l5948P843M6646O3834j748l3357M9393k598j40403j42097
10815C5605l285J7789J33768J01429Q2347J14974P9873j28762j10460m1034k7308
$$ y = [2074749, 2084971, 2269788, 2171347, 1962741, 1892859, 1800303, 1614104, 1471555, 1435402, 1328989, 1156003, 1029927, 1178689, 1261996, 1114694, 999879, 866727, 876625, 871304, 649171, 565547, 684530, 743975, 842170, 996746, 1098372, 942370, 1009527, 1049841, 1036009, 1022391, 1314078, 1612894, 1751423, 1839696, 1874321, 1908203, 1901064, 1751106, 1651287, 1475251, 1334989, 1026102, 871323, 688451, 470915, 387212, 355404, 345933, 317406, 406080, 516849, 465871, 419389, 318436, 207024, 249149, 374416, 327120, 189571, 244796, 329441, 224040, 188092, 195935, 242581, 306415, 304667, 271310, 320703, 318105, 177702, 35605, 32320, 50109, 183877, 285306, 367653, 482627, 562500, 433738, 323278, 282244, 254936]
10804B54936M8854j1485j12494p2059O7552J94102J06483p8100n3665K9320m0879
10793C32565l4762J13880n0788k1899L1043m9108M5629L3277q765j12197j99163
10782G9712J5507n814M7607L9747Q8323J2341q7138o3125J0606n6626n9951O0694
10770H1883P9353p5277R3986P6205m381q6054k5434M2209j021k9916n6186J2793
10758A08160K5595J17760k3607n4727k6339l7571M4582M5347n3284p258L2202
10747A70860J31129k9187l2611q0081o9150N4226k5982p2341L7084O0411K2156
10736A66514j02127k7980j43045m3651J53825L5454r2945j04821J4194r5726o6268
10725c06576k2553J31713P4126O3216M295o8798l4027M2104P9881J56441J57813
$$ y = [254936, 303790, 292305, 179811, 107752, 175304, 369406, 475889, 397789, 344124, 373444, 332565, 297803, 411683, 360895, 338996, 370039, 320931, 366560, 399837, 391072, 278875, 79712, 95219, 89405, 137012, 176759, 265082, 277423, 190285, 127160, 137766, 81140, 21189, 81883, 161236, 85959, 179945, 256150, 251769, 165715, 140281, 182490, 181469, 151553, 95367, 108160, 133755, 251515, 227908, 173181, 146842, 109271, 153853, 199200, 145916, 138658, 170860, 301989, 272802, 240191, 160110, 90960, 145186, 119204, 46863, 83947, 144358, 166514, 64387, 36407, -106638, -150289, 3536, 38990, -53955, -158776, -144582, -240308, -306576, -329129, -197416, -123290, -60074, -55779, -124577, -158604, -116500, -36619, 119822, 277635]
10714B77635n8445o4990j46010j02170K5992J40537k1250j19843l1651j4674J31622
10703A6753Q3209k7449m1439j02286P4519P4613k3473J5130o6380n178J03447
10692A01466k3045J8818k2744J44546J6480K9785o4336m3470r6994k6104l7553
10681c151o214n188J3759J57796R4425L1807M437r5716p0615L781K2172m235L2363
10668A75421j26508m6868n7398m459Q6882N8687J13793r510o6013n6484o7721
10657a78k4534K6671J3835L3395J1426p7738p9842L8188K37483K9828p97o232
10645B01505n8l2849j1123n8992N6753M082O3732n3438J05990n2633R645K6756
10633B59370j19867k27798K1877J26042O2335j21657r3339O2363q4435l7022J91877
$$ y = [277635, 219190, 154200, 8190, -93980, -67988, 72549, 51299, -68544, -100195, -114869, 16753, 99962, 72513, 31074, -71212, 3307, 77920, 54447, 69577, 3197, -1981, 101466, 78421, 97239, 74495, 219041, 235521, 265306, 200970, 157500, 60506, 34402, -3151, -9365, -14553, -794, 157002, 251427, 283234, 287671, 191955, 121340, 125121, 147293, 143058, 175421, 48913, 2045, -55353, -59812, 27070, 85757, 199550, 190040, 124027, 67543, -178, -24712, 1959, 15794, 49189, 60615, -17123, -96965, -58777, 178706, 208534, 207737, 201505, 201447, 168598, 157475, 98483, 155236, 159318, 223050, 169612, 275602, 222969, 232614, 259370, 139503, -88295, -66418, 59624, 121959, 302, -93037, -30674, -115109, -152131, 39746]
10622C9746J92575N2428K1764r389r4827j25127P6934j6354m9882L4958j52711
10611b9885l2576P0704l3528r6135M5400J36704N0431j00863R2423k7432k9384
10600D5859J400j38212P118R8747J9113p0579N1539K9728K2048j36887j0751m2294
10588a23171J0958J93543J13030r6232r5765m1391o7579o18J8128k5108O8644
10577d5561N8404J26174O7121k4813j28826r0495j5598j5789p6677J737K4969
10566a19354L397O5125O2468m5747k7489O7605K6414n8440q8100O9014L4961P4797
10554F4651N3624Q8285K0519j54356k7643o3608q4817J2485q4015J2730R2880
10543f9265j1106P721P8844n0394j8509n4749J5675K03m0879o5124Q9468L961
$$ y = [39746, 232321, 284749, 306513, 297124, 202297, 77170, 154104, 137750, 87868, 122826, -29885, -62461, 8243, -25285, -121420, -76020, 60684, 111115, 10252, 102675, 75243, 45859, 47259, -90953, -83835, 14912, 34025, -36554, 14985, 44713, 66761, -70126, -80877, -123171, -112213, 81330, 194360, 98128, 2363, -39028, -106607, -107225, -89097, -114205, -45561, 12843, 139017, 206138, 181325, 52499, -37996, -53594, -69383, -146060, -144323, -119354, -115957, -50832, 11636, -34111, -61600, 6005, 32419, -26021, -114121, -45107, -10146, 64651, 118275, 206560, 227079, 72723, 45080, -18528, -103345, -90860, -174875, -162145, -69265, -80371, -72650, 6194, -44200, -62709, -117458, -101783, -101580, -142459, -207583, -118115, -114154]
10531a14154N3307J54522Q8106p1487k07013Q4599J62442K3072Q7088j10940j15222
10520C4320k1513N7173P7025q20o6696r0563l0677P2028j6385N002l363N9235
10508G4766Q2206l5308j3560p7486j7582q2764q7974m4636J39543N9394l4605
10497c8006J4785o3591j0146R0690O9795M3967K646Q206p9105r055O7510L4074
10485A31770p2509P735J77992J13157j51451j27453j62347j8284M8215P3456J92394
10474B12675m508k1004l7481P685l6291j6240k3180n8533Q7046k302o744o2456
10462C8667K1631J06165p0003m5014J7811q2289l0166J0155N3886o843j19282
10451a05282j43318j60Q6908K06505J17164m8885j37913q3735r154J03727J9678
$$ y = [-114154, -60847, 93675, 181781, 110294, -96719, -12120, 150322, 173394, 260482, 149542, 34320, 12807, 69980, 147005, 146185, 79489, -11074, -41751, 30277, 13892, 18894, 15531, 74766, 156972, 121664, 108104, 30618, 13036, -69728, -157702, -202338, -62795, -3401, -38006, -23221, -86812, -96958, -6268, 63527, 107494, 110140, 118346, 39241, 30186, 97696, 131770, 59261, 66996, 244988, 358145, 206694, 79241, -83106, -101390, -53175, 20281, 212675, 208167, 187163, 149682, 157367, 121076, 104836, 81656, 23123, 110169, 107867, 101123, 38667, 60298, 166463, 96460, 51446, 69257, -13032, -43198, -33043, 20843, 14000, -105282, -248600, -248760, -161852, 44653, 161817, 112932, -24981, -108716, -117870, -14143, 5535]
10440E535J05095Q5043l7482o8902k5883N648n4442n8220J0308J550M6585O0940
10428G5775O9657J13449L8423L6332k7632k21476j17335l9380p3096l9925q2446
10417b67654k8365J35185J02830J6444N6425j02288N5559l97N1282L0892L2916
10406H2829l0696j16079j6118P8994P8948j8102j03135N8531j21918m6895J1023
10395a42618M5253Q6575Q0236j0658p400o5013k1943K7400k190j06135q5217L161
10383a98549O2661K4092J07749N4749m3155o8231J753j416L0844r55j50386J00594
10371h0250J1629n2764j04938j67629J4389J82341N1453K9195k764J41269j5921
10360F010j02018k9910K9983J7873o1734j48422J00851J18174r5472J6720N7127
$$ y = [5535, 110630, 195673, 158191, 89289, 63406, 69054, 14612, -43608, -33300, -31750, 14835, 75775, 145432, 258881, 297304, 333636, 306004, 84528, -32807, -72187, -145283, -185208, -267654, -296019, -160834, -58004, -41560, 14865, -87423, -31864, -32261, 19021, 49913, 82829, 52133, -63946, -80064, -1070, 77878, 59776, -43359, 15172, -106746, -153641, -142618, -97365, -10790, 69446, 58788, 51388, -13625, -35568, -8168, -10358, -116493, -201710, -198549, -135888, -111796, -4047, 50702, 7547, -60684, -58931, -60347, -29503, -30458, -180844, -80250, -68621, -121385, -226323, -393952, -379563, -197222, -145769, -116574, -119338, 21931, 6010, -96008, -125918, -95935, -78062, -139796, -288218, -187367, -69193, -164665, -147945, -90818]
10349i0818n5806l6956k1923K1091j18525R7628L0240j8870N7351M9453k5777
10338a12912M6741P6428j3640p3051j9572L8845J6106o4402K6857J64767J04861
10327A91028J8367m3705L0719r512j3306K6754q852n7475r5458M447M2436k1800
10315F3643j8302l9939p987o7871N3634M2458R0244k517j23132j7319L7261k0792
10303a0619n2607j1936Q2324j04133j39271R6809J81352l6536q2984j2138m383
10292i4122Q5056J50536O8916k0341q0317j08640m1251p8656Q364Q7489J9434
10281c532O3799P6120r3393j59743j2393j6177J54856J48572L9149j13354j12593
10270b8689l8023o0638k4071m6806Q366J5925j9182J01044p53O3938O7470l7787
$$ y = [-90818, -146624, -183580, -205503, -184412, -302937, -205309, -175069, -193939, -136588, -87135, -112912, -66171, 10257, -3383, -76434, -96006, -57161, -41055, -105457, -78600, 86167, 191028, 209395, 165690, 196409, 186897, 173591, 200345, 191493, 134018, 38560, 43007, 85443, 63643, 45341, 5402, -2585, -70456, -16822, 25636, 115880, 113363, -9769, -27088, 10173, -10619, -63226, -75162, 7162, -96971, -236242, -139433, 41919, 5383, -77601, -89739, -94122, -9066, 141470, 210386, 190045, 109728, 1088, -40163, -118819, -110455, -22966, -3532, 60267, 136387, 42994, -116749, -129142, -145319, 9537, 158109, 197258, 83904, -28689, -66712, -127350, -151421, -198227, -189861, -173936, -193118, -92074, -92827, -28889, 38581, 794]
10258G94L5914m275j90130n1818M2903P078P7746l3328Q8231J22083p3281q9857
10246f7940m5328Q6226o0736o2040O8768Q1939m212L9512J9756P7470o3487j80153
10234a10225l9978O8393J22414M3778K9898m9395N7207p6219j13757J279R7665
10223C1060P4689N3266j2608m7887L5591k462J0180r9491m2842j31529M0160J06848
10211A4975n6016n5001O3858l3815M9559M3714R0531q8196j7957J42612J30075
10200B84339o7914j87246l0808o5813l0827N009K3293R7108O1935L9336L8915
10189A67327j0745j38976j31323j15060M1788N9017L7955P3742J60855O4308j46479
10178F2409j05256o0364j08732p6857J23312J32768J23522N875M9148j1197M0557
$$ y = [794, 36708, 32433, -157697, -209515, -166612, -159534, -81788, -115116, -26885, 95198, 21917, -67940, -113268, -27042, -87778, -149818, -81050, 889, -3323, 36189, 55945, 133415, 69928, -110225, -150203, -81810, 40604, 84382, 114280, 64885, 122092, 45873, -67884, -66605, 31060, 105749, 159015, 146407, 98520, 134111, 131649, 141829, 42338, -504, -132033, -91873, 14975, -41041, -96042, -32184, -65999, -16440, 27274, 117805, 29609, 11652, 154264, 284339, 216425, 29179, -1629, -67442, -98269, -93260, -69967, 27141, 89076, 128412, 167327, 156582, 17606, -113717, -228777, -186989, -127972, -90017, -16275, 144580, 208888, 62409, -42847, -103211, -211943, -288800, -165488, -32720, 90802, 96677, 145825, 134628, 175185]
10167A75185j29606j23827k3759m5219K6801K7558k285m6463J9711O9798K1623
10156c0483m3400J0415m1685K3712P956J4737J30438N271k8695j8069m1160m2248
10144e3211m7147J06830M5794j66738m0349J9813O7546L1133k3476R867M5462
10133d476q5132j09977o5516K9919N3008K314J05231k3909k3630J8253q0017o4451
10121b48383P014P7695J61156J2583J46L9584j78710L005J52389N24J6475j611
10109D1867k1817N1082M3056J3955q0561J974m2644L9692J39846L1900l0096q2660
10097A05594m9269l7727j6450r0177o1038n1479Q7393k760O2644L4123o7642J09350
10085B2562K66247Q7873j45881k04118j30556l4731R129k5914K09541L6045j45397
$$ y = [175185, 45579, -78248, -102007, -147226, -120425, -92867, -95152, -141615, -121904, -52106, -30483, -73883, -63468, -105153, -81441, -73485, -58748, 71690, 76961, 48266, 30197, -10963, -53211, -100358, 6472, 52266, -114472, -154821, -135008, -67462, -36329, -59805, -49938, -4476, -89608, -199585, -265101, -235182, -182174, -179860, -74629, -98538, -122168, -103915, -183932, -248383, -241369, -163674, -2518, 10065, 10211, 49795, -128915, -125910, 26479, 27003, 43478, 41867, 20050, 71132, 114188, 128143, 47582, 49556, 6912, 46604, 186450, 218350, 188254, 105594, 56325, 18598, 2148, -88029, -149067, -200546, -113153, -115913, -53269, -19146, -86788, 22562, 288809, 376682, 230801, 26683, -103873, -138604, -129475, -155389, 54152, 90197, -55200]
10074e5200l7537M7173K1753l9641n0055P8254M7269r5270K7752R8871K2574o1192
10062D751j2741M9817L6755j2901m6435j21490j32495J5047R4979P8094N0343
10051C724O690l5540Q803O6447P6933Q8084k5334j46257m3183n726Q9445n8831
10039B5255p3101j30078K3774O3819N9994L7090R3472j2871o9099o8017N3483
10028C721M1953p6978o6627k2617N7093J92169j03750j93252q2645P8731O7022
10017a05180K814L1608k655M9550J029N8167p2837p9349n6656O1921n48k8942
10005a41078j342J64414m4751m8837o1897M033l6094P4642L8436L0998j3160k3177
9993e7813J25928O0346L3080m6473p6041n1232n3254q227l673L5714l6350n5718
$$ y = [-55200, -92737, -45564, -23811, -63452, -113507, -35253, 12016, -83254, -55502, 43369, 65943, 4751, -7990, 41827, 78582, 65681, 19246, -102244, -234739, -219692, -124713, -46619, 3724, 10414, -25126, -16323, 50124, 127057, 215141, 189807, 43550, 367, -5359, 84086, 25255, -47846, -177924, -154150, -90331, -30337, 6753, 100225, 87354, 18255, -49762, 3721, 45674, -31304, -97931, -120548, -63455, 128714, 24964, -168288, -250933, -172202, -105180, -102366, -70758, -73413, -23863, -22834, 35333, -37504, -116853, -173509, -111588, -112136, -141078, -142420, 21994, -22757, -71594, -133491, -129458, -165552, -90910, -52474, -21476, -34636, -57813, 68115, 128461, 161541, 115068, 39027, -12205, -65459, -73686, -77359, -41645, -77995, -133713]
9981a33713Q1297L0861q2352O1490N4425J8728N2131R0749k2626q3676m1221J1433
9969C7526P7489N0038j26523j04861o8461R0001l8545O13L1189O3479M7977r7366
9957c7444K5574Q5296P0609K7413Q3591k7823j63527J611q9353Q8881j11228j38620
9945a85020J051n2541P1449q1686k2704J44550N0814Q6962j1007k0868J02045
9934H3045J8707j18269N692J337j1819p5863j00115M781O6457P6902K5633j5275
9922c8787M4288L7994j3629j75585r5284J30716K1715p7876r2910O6262J1439
9911a81657R9013M7607j8703o4536J5243K1396J19102K8271o4173P599k144o619
9899C99p1494n0325L2956K8655J1551j2796J11382R763R8387n5392O037m2592
$$ y = [-133713, -52416, -21555, -103907, -42417, 12008, 30736, 82867, 173616, 150990, 67314, 26093, 37526, 115015, 165053, 38530, -66331, -134792, -44791, -83336, -82723, -51534, 11945, 59922, -37444, -11870, 73426, 144035, 171448, 255039, 227216, 63689, 65300, -24053, 64828, -46400, -185020, -183969, -236510, -165061, -246747, -269451, -124901, -74087, 12875, 1868, -19000, 83045, 101752, -16517, -10825, -9488, -21307, -97170, -197285, -192504, -126047, -49145, -23512, -38787, 5501, 43495, 29866, -145719, -241003, -110287, -88572, -166448, -259358, -193096, -181657, -82644, -35037, -53740, -118276, -103033, -81637, 37465, 65736, 1563, 9162, 7018, 399, -71095, -121420, -88464, -59809, -48258, -61054, 50328, 60091, 158478, 103086, 109123, 66531]
9887F6531q8118p156j0076k6952j11387j3229R4132m219j2230J36062N0247j84193
9875a10588j34487k4638J16630Q2288k317L2469P9121K5466r4298p0262N552L8901
9863e6163J7106L0886J23134r3848Q7120n4817m3930M4644P1156N0602k2082n1382
9851A02426j34799n9832l8611J35403L1064j9570k9929m6497L6536L7229q7071
9840g3651k2220L5422O9838M9896J0126r2923l0391k9167j17377p8512P6226R7176
9828a05557l619K7683P1427L6293r5108p1398m5538J02351J41264j41269L868
9817g9603J32658m0208p9517j65617l07048L5088J46749M0827Q771p5964J90329
9806a93535R6356p4555M7783O0390j3030o2254j8912M9345J55657l3663l8967
$$ y = [66531, -21587, -28743, -38819, -65771, -177158, -190387, -96255, -100474, -112704, 23358, 73605, -110588, -245075, -269713, -153083, -70795, -73112, -40643, 38478, 63944, -30354, -100616, -95064, -56163, -39057, -8171, 114963, 21115, 108235, 53418, 9488, 54132, 125288, 175890, 153808, 102426, -32373, -92205, -130816, 4587, 35651, 16081, -13848, -60345, -23809, 13420, -73651, -95871, -60449, 9389, 59285, 69411, -23512, -53903, -83070, -200447, -278959, -202733, -105557, -109176, -81493, -10066, 26227, -68881, -140279, -185817, -83466, 57798, -83471, -79603, 53055, 12847, -66670, -232287, -539335, -504247, -357498, -316671, -307900, -383864, -193535, -97179, -171734, -123951, -63561, -76591, -138845, -157757, -108412, 47245, 13582, -25385]
9795b5385o2459m2905l8264R0328K2122j3303L2599L2545K7350m1018l3989M312
9783d8067K2468J0774l2552K7683O2748l581q7808P6886J8463n8929K8335k4272
9771g852l8244L9904R745M1271P535O894m1692q1962n9815M609Q7153J1156j09859
9758a31157N9870Q8024J8264q0264m9499l7967p3199P825N9446J72506M9218N7618
9746A40685o0217l2553J7799m8395j24435q8762P4288l5292J23917P6532j07490
9735f3923p8601L6645J17610J93656n0868j18148k0659o667N301l8563j41664
9724a65881p2941J18181J09981q0462o9463J0190J8569J62113O999m8994r297
9713b1005L5834q4756r8043n0547J23146K8507r5253J06656K3341R9508J59152
$$ y = [-25385, -87844, -130749, -169013, -78685, -56563, -69866, -37267, -4722, 22628, -18390, -52379, -48067, -25599, -14825, -47377, -19694, 43054, 39473, -48335, 28551, 47014, -11915, 16420, -7852, -46096, -6192, 3553, 44824, 52359, 59253, 17561, -64401, -124216, -119607, -32454, -21298, -131157, -71287, 16737, 35001, -45263, -94762, -132729, -205928, -198103, -138657, 33849, 83067, 140685, 80468, 47915, 65714, 17319, -107116, -195878, -121590, -156882, -32965, 43567, -63923, -142524, -105879, 11731, 205387, 154519, 36371, 15712, 9045, 14346, -24217, -165881, -238822, -120641, -10660, -91122, -160585, -150395, -131826, 30287, 37286, -11708, -21005, 14829, -69927, -167970, -218517, -95371, -66864, -162117, -55461, -32120, 67388, 226540]
9702B26540L5207m9637n9641j7214N5809m3914j55365j37572l2290J6543L7355
9691a24179L0999j68741o6634O6748J16815j1930K7945L4828j1307K2053J09211
9680B5808O8858j9466K5259N7529P7411J15836J11152j14832j21634l3299J02841
9669B95463o2193j03938J9455J7025L0881l275N9027j00103k6427J4330M6762
9658A87007j8500k1810l7582M3077J76745L2455N0991J83370M5379o1937K0904
9647F00099j04502Q7711K3450j8234J9066L3432J11250P9562j5957N0164J17069
9636I83110j5986q0373P230k0944n3557l6544O663N690r8768r0789j1006j9437
9624E75289n9432M2866N3567L9534J06398j7141N2030j8997m7480J3343K3161
$$ y = [226540, 261747, 212110, 152469, 135255, 191064, 147150, -8215, -145787, -178077, -161534, -124179, -93180, -261921, -328555, -261807, -144992, -156922, -128977, -94149, -105456, -83403, 25808, 94666, 75200, 100459, 157988, 235399, 351235, 462387, 347555, 225921, 192622, 295463, 233270, 129332, 148787, 165812, 196693, 193418, 252445, 152342, 125915, 140245, 187007, 168507, 146697, 109115, 152192, 328937, 361392, 412383, 595753, 641132, 579195, 600099, 495597, 583308, 606758, 588524, 607590, 641022, 752272, 831834, 815877, 866041, 983110, 967124, 886751, 893981, 873037, 819480, 782936, 789599, 795289, 696521, 605732, 594726, 575289, 515857, 558723, 612290, 651824, 758222, 741081, 793111, 774114, 726634, 739977, 763138]
9613G63138n8173K8155N0421N3674R0225m8177R8802J40114Q5920n999L5544N8948
9601A292592P2522K6916o7131O009j48004j20967J8331q5411O1797K8964M1320
9590A126938l1894j41946p0833l1659O5255m5359j03823O1666L2765n590l3249
9579H22271K0288L5433p6561j46809k4994P7932P7675q1408L3792K2672M1766
9568H02057K752M7521N9863j9613Q7499K7171L8399o5115j23775j26901L8221
9557G68079j03819j01780J5423M2417n5006j14409p3548q0531j6510j9616J06034
9546C66734L4426p0180j48716j06749K8225R0067j8510J04807O4819r5603o4418
9535A84902j39205L0970L8194K7795Q9110J70793R8347k4305n8037m5051L0903
$$ y = [763138, 704965, 733120, 783541, 837215, 927440, 879263, 978065, 1118179, 1204099, 1198100, 1233644, 1292592, 1365114, 1392030, 1324899, 1330908, 1182904, 1061937, 1080268, 994857, 1056654, 1085618, 1126938, 1095044, 953098, 882265, 850606, 915861, 870502, 766679, 828345, 861110, 855520, 822271, 842559, 877992, 801431, 654622, 629628, 707560, 785235, 703827, 737619, 760291, 802057, 804809, 852330, 912193, 892580, 980079, 1007250, 1045649, 980534, 856759, 729858, 768079, 664260, 562480, 577903, 620320, 565314, 450905, 377357, 296826, 280316, 260700, 366734, 401160, 330980, 182264, 75515, 103740, 193807, 175297, 280104, 344923, 249320, 184902, 45697, 76667, 114861, 142656, 231766, 402559, 500906, 476601, 418564, 373513, 404416]
9524D04416n4782j02554j1727L5616m1859m8652j47783r8438J7709o9722n7647
9513a75423N8029o8544j05444M1506Q9853Q4378J38107j3810K9739J3336l7582
9502E4145j34974o0381K1963J2581l2314P4339J31067P513p2609o0970M9993Q9928
9490H0281J8154l4678N8085K3433k1545n4840q4608R6764R059M9111Q7841R1357
9478C18414j9241j312k2888o0408l2818k1020k146o1078j7715N3280q0757R321
9466F1632Q1145L3107o1887K771J38546Q9370m9158m9230m217M8922J27183j3482
9454D04702o5679j21333P3147O7367L0585k8084M0568M5131q9378j15264o1815
9443A79947m2673m517R5357L5752k2515j55441j9947R7181m1605N8468m1793p7394
$$ y = [404416, 349634, 247080, 235353, 270969, 229110, 180458, 32675, -65763, -48054, -117776, -175423, -117394, -185938, -291382, -249876, -160023, -75645, 62462, 48652, 78391, 91727, 54145, -80829, -141210, -119247, -106666, -138980, -64641, 66426, 73939, 1330, -59640, -9647, 80281, 98435, 63757, 121842, 145275, 123730, 68890, -15718, 81046, 90105, 139216, 227057, 318414, 299173, 297861, 274973, 214565, 181747, 160727, 158581, 97503, 79788, 133068, 52311, 61632, 142777, 175884, 113997, 116768, 255314, 344684, 295526, 246296, 242079, 291001, 418184, 404702, 339023, 217690, 290837, 358204, 388789, 360705, 401273, 446404, 357026, 241762, 179947, 137274, 132757, 228114, 263866, 241351, 85910, 65963, 163144, 121539, 180007, 138214, 60820]
9431F0820M918N2542O5741N1412r8828m2850L2825n4524L1975J37653J7428o4819
9419A94293j1208o3420P5413N1603J27522k2912q0330J4795L6267l3448o7945
9408B20630j0296O9852R7333O6875R4761O298L3327J1253n5420K5908N1988r9349
9396E13160r8788j13377K086K3560k6005O9301K1022R1197L4008m88q2504O4317
9384D97489R1719o1695m4174Q9164K8822M1946o3845r2151L920O048j714k2955
9372D72574p4456L3054Q1522J5661M559m159J6841N3834R6748O8872L8255K9336
9360H32641L9696r0087j33604J12702J8162m3379M3708J03651R695n6101L0198
9349H67282N1737k7004l6892J21449J26466r696j54658n7927J23905P0221J4861
$$ y = [60820, 65738, 118280, 184021, 235433, 136605, 93755, 126580, 72056, 104031, 241684, 259112, 194293, 183085, 119665, 195078, 246681, 374203, 351291, 270961, 285756, 322023, 288575, 220630, 210334, 280186, 377519, 444394, 539155, 545453, 578780, 590033, 534613, 560521, 612509, 513160, 414372, 300995, 303081, 326641, 300636, 369937, 390959, 482156, 516164, 515676, 433172, 497489, 589208, 527513, 483339, 572503, 601325, 643271, 579426, 487275, 491195, 497243, 495529, 472574, 398118, 431172, 512694, 528355, 532914, 528755, 545596, 599430, 696178, 765050, 803305, 832641, 872337, 782250, 648646, 761348, 779510, 736131, 779839, 883490, 893185, 837084, 867282, 919019, 892015, 855123, 976572, 1103038, 1093342, 938684, 880757, 1004662, 1074883, 1089744]
9338A089744k3678j23692N0358J17366p6510j9863M3711l3969N2746n9798J30212
9327A146627J66345q805j9497m2013k2960Q2528J14327K456K9256J4681O1376
9316A524321J42283O4026M521P8081j5212P766j9863J50306K4659Q8256J40014
9305B189158K28132J10415Q5289K08511P1229J54956J46253J48827O0262J79940
9295C582972J70839J99041M01522M54965L37653M55847N47112O22202P01366R21558
9285H395077R48246J118371J507762J743550K044809K687082L348856L844075
9277B5637828M431046N247718O081055O925424P330873O960995N442847K719145
9269G0776931q53179l947142n762545o249256n661544m626089l533889k533215
$$ y = [1089744, 1066066, 942374, 992732, 1110098, 1033588, 1013725, 1057436, 1023467, 1076213, 1016415, 1146627, 1312972, 1304167, 1284670, 1242657, 1219697, 1302225, 1416552, 1419008, 1448264, 1462945, 1524321, 1666604, 1730630, 1735151, 1813232, 1798020, 1805786, 1785923, 1936229, 1960888, 2049144, 2189158, 2417290, 2527705, 2612994, 2821505, 2892734, 3047690, 3193943, 3342770, 3403032, 3582972, 3753811, 3952852, 4354374, 4809339, 5146992, 5602839, 6149951, 6772153, 7473519, 8395077, 9343323, 10461694, 11969456, 13713006, 15757815, 18444897, 21793753, 25637828, 30068874, 35316592, 41397647, 48323071, 55653944, 62614939, 68057786, 70776931, 69923752, 65976610, 60214065, 53964809, 48303265, 43677176, 40143287, 37610072]
9261C7610072j666308q74451r2282M56206P39202J057224J608548K257162L072290
9252D4167663L912447M673595N592992O256208P046048P877813Q405635Q732149
9244I6664550Q424373Q001779P430384P086645O832212O352736N706222N078657
9236A51577558M447163L517332K108674K86975j618502l015384m050936m529374
9228A48723506m741213m672830m355715l914665l169204k422653j444778o38536
9220A23363912k01950o0046J0395O05814J729733K660625L548413M135686M872986
9211A40665568N541419O384634P052069P949749Q725051R101469R567801J0588429
9203B05576189J1434762J2066843J1974276J0630916P968635M562117O71660l383895
$$ y = [37610072, 35943764, 35069313, 34977031, 35433237, 36172439, 37229663, 38838211, 41095373, 44167663, 48080110, 52753705, 58346697, 64602905, 71648953, 79526766, 87932401, 96664550, 105088923, 113090702, 120521086, 127607731, 134439943, 140792679, 146498901, 151577558, 156024721, 159542053, 161650727, 161937702, 160319200, 157303816, 153252880, 148723506, 143982293, 139309463, 134953748, 131039083, 127869879, 125447226, 124002448, 123363912, 123161962, 123101916, 123112311, 123718125, 125447858, 128108483, 131656896, 135792582, 140665568, 146206987, 152591621, 159643690, 167593439, 176318490, 185419959, 194987760, 205576189, 217010951, 229077794, 241052070, 251682986, 259651621, 264213738, 264885398, 261501503]
9195B61501503p487222j1240481j4196015j5614409j5448812j3899731j1667812
9188A71947021r118259o716892m650180l183641k560959k355955k294644k077075
9180A38989416j719194j068101k18130P24481J815858K876751L977146M867212
9172A50245439N472640N902447O381910O798383P222185P127103O787559N553783
9164B01491449L781986J469536j082660l695328o327078q254352r361082r832118
9156A68190353r588296q984357q104095p116124o088174n459517n220355n210713
9148A12418722n437468n465156n130529m861168m308898m072411m063405m096408
9140G4983279m008453l816755l226177k419619j298227J13198J690342L490116
$$ y = [261501503, 254014281, 242773800, 228577785, 212963376, 197514564, 183614833, 171947021, 162828762, 156111870, 151461690, 148278049, 145717090, 143361135, 141066491, 138989416, 137270222, 136202121, 135983991, 136708472, 138524330, 141401081, 145378227, 150245439, 155718079, 161620526, 168002436, 174800819, 182023004, 189150107, 195937666, 201491449, 205273435, 206742971, 205660311, 201964983, 195637905, 187383553, 178022471, 168190353, 158602057, 149617700, 141513605, 134397481, 128309307, 122849790, 117629435, 112418722, 106981254, 101516098, 96385569, 91524401, 87215503, 83143092, 79079687, 74983279, 70974826, 67158071, 63931894, 61512275, 60214048, 60327246, 62017588, 65507704]
9132F5507704N546175P557361Q773275Q617614O761564L379483o92859m679049
9124A00771268p979906j0284824j0946052j0516297r493722q216473o661442n201353
9116C1471199m257616l413890k682397k147428j856186j737039j531284j337499
9108A2507860j138766r24294p02527n13942n11736m06116m47041m59377m49225
9099F954836k96251k82667j69843j86773k05267k64176k25294r7635j04869j65230
9089D956831j98861j84545l4117n8452j16061m8252J2855o1331p5327m5502m3942
9078D103296l9705k5507j04917m2376Q5791o6997p4822m155l305m8735q0304m6077
9066C652187r11k5192L9176M0235R4013J38694n1156N5104l0049j33186N9233
$$ y = [65507704, 71053879, 78611240, 87384515, 96002129, 102763693, 106143176, 105450317, 100771268, 92791362, 82506538, 71560486, 61044189, 51550467, 43333994, 36672552, 31471199, 27213583, 23799693, 21117296, 18969868, 17113682, 15376643, 13845359, 12507860, 11369094, 10444800, 9742273, 9228331, 8716595, 8310479, 7863438, 7404061, 6954836, 6658585, 6375918, 6206075, 6019302, 5814035, 5549859, 5324565, 5226930, 5122061, 4956831, 4757970, 4573425, 4539308, 4480856, 4364795, 4316543, 4329398, 4268067, 4192740, 4147238, 4103296, 4063591, 4038084, 3933167, 3890791, 3976582, 3909585, 3834763, 3830608, 3827303, 3778568, 3698264, 3652187, 3651276, 3626084, 3665260, 3705495, 3799508, 3938202, 3887046, 3942150, 3912101, 3778915, 3838148]
9055C838148j8962K297J06273P3165M4920N0167J80256K4781j43693q5280N7210
9044D129282j5638j42936j48153q5784q9591J1778K5979J92654J362j4494o7986
9033C796473j01453o9164k6515j28203m6238Q0951M0528j798j09064o128M1051
9022C470440l4001n1632l6663k6936J8319j8212j6869r33O4195m874k1594J6398
9010C357638r2000m7101n9893O7758J24402K3912n4946O1048p276j1675J3243
8999C375110p3553r8606m6380p2180m63j13168j87213m2830p3860j4944O638j0665
8987B647886j11746j26670r4064l3118l4709m7416j7641m5773J05859P1281o9290
8976B244599q5735j04463j6038R3175o5243j24094J4961J49087l0206j4827J23048
$$ y = [3838148, 3819186, 3821483, 3927756, 4000921, 4045841, 4096008, 4276264, 4301045, 4157352, 4072072, 4129282, 4113644, 3970708, 3822555, 3736771, 3647180, 3658958, 3684937, 3877591, 3878953, 3864459, 3796473, 3695020, 3625856, 3599341, 3471138, 3424900, 3505851, 3546379, 3544581, 3435517, 3429389, 3470440, 3436439, 3384807, 3348144, 3321208, 3339527, 3321315, 3304446, 3303513, 3367708, 3362834, 3341240, 3357638, 3265638, 3218537, 3158644, 3226402, 3350804, 3374716, 3319770, 3380818, 3373542, 3361867, 3375110, 3301557, 3202951, 3156571, 3084391, 3083928, 2970760, 2783547, 2740717, 2666857, 2651913, 2658551, 2647886, 2536140, 2409470, 2315406, 2282288, 2247579, 2200163, 2182522, 2136749, 2242608, 2313889, 2244599, 2158864, 2054401, 2038363, 2131538, 2066295, 1942201, 1957162, 2106249, 2076043, 2061216, 2184264]
8965B184264M6227O5260M0008N7234p5062j78921m057P1479Q3283M4730J3870
8954B348315J12532R0885P10O0082J30923K95332O6184J54903L02283K51387J66808
8943C980344J65978J86496K17120M67408M69164N57430N54868N96249P21685R24589
8933H841331R99766J107964J356682J559213K043090K533171L087140L877291
8925B5405648M739221N708947O415166O168182N202770L996829K229931M59271
8917F0325965j381376l592714n045634n501546n145466m057788l123203k216457
8909C0261781j274532m82020J57312Q96198J703102K395224L441485M369906N123039
8900D6591495N286591M477492K785021O26248j262244k257900k175851j393516
$$ y = [2184264, 2230491, 2295751, 2335759, 2392993, 2317931, 2139010, 2134953, 2206432, 2289715, 2334445, 2348315, 2460847, 2551732, 2552442, 2612524, 2743447, 3038779, 3104963, 3259866, 3562149, 3813536, 3980344, 4146322, 4332818, 4549938, 5017346, 5486510, 6043940, 6598808, 7195057, 7916742, 8841331, 9841097, 10949061, 12305743, 13864956, 15908046, 18441217, 21528357, 25405648, 30144869, 35853816, 42268982, 48437164, 53639934, 57636763, 59866694, 60325965, 58944589, 55351875, 50306241, 44804695, 39659229, 35601441, 32478238, 30261781, 28987249, 28505229, 28662541, 29558739, 31261841, 33657065, 37098550, 41468456, 46591495, 51878086, 56355578, 59140599, 59766847, 58504603, 56246703, 54070852, 52677336]
8892E2677336j79539J040443K442456L907520N132328O584918P934227Q888545
8884H8428234R346602Q627304O321191K880879q59416l858779n576695n675532
8876I9633788m838815l504419j459517J31966P11963L17218o79962j773200k629030
8867H5909992l242741l590545l821660m012260l826717l384083k611345j714362
8859E9706279j030740j92700P88990J586984K761119M070648N506607P224456
8851H0421643R279192J1628003J3375923J3580712J1430797O540284M01303n257616
8843A41400241r330101j1299538j1396677j0116357q474888o597927n037697l703684
8835G5443372k375348j483924r89014q88036j064124r54823m49971n9772M17706
$$ y = [52677336, 52497797, 53538240, 55980696, 59888216, 65020544, 71605462, 79539689, 88428234, 97774836, 106402140, 112723331, 115604210, 114744794, 110886015, 105309320, 99633788, 94794973, 91290554, 89831037, 89963003, 90674966, 90992184, 90312222, 88539022, 85909992, 82667251, 79076706, 75255046, 71242786, 67416069, 64031986, 61420641, 59706279, 58675539, 58482839, 59271829, 60858813, 63619932, 67690580, 73197187, 80421643, 89700835, 101328838, 114704761, 128285473, 139716270, 146256554, 146657857, 141400241, 132070140, 120770602, 109373925, 99257568, 90782680, 84184753, 79147056, 75443372, 73068024, 71584100, 70595086, 69707050, 68642926, 67688103, 67238132, 67178360, 67596066]
8826F7596066N33472N70115j20510j517630l036073l791633l564910k802781j788676
8817E2077440n49007Q03794J841394K649874L091624K866215K206465Q48111j88267
8808F5647643q12374q34432p39870n86838q27743j206791j894460k160138k039450
8799E4545547j603503j205868j393450k388286l481336m175959m641108m445990
8791C1210047l922824l295020k674308j927958j306000r18831o43051l36177k36424
8782A5949454l4424L38037P04576J166755J729595K217482K102996J342903J50962
8773B5668336r11697j321468q59910k05908L85604K90620l73916j662720k620422
8764A8388519k888551k690253k218166j615498j030978q03823m90889m41216n03338
$$ y = [67596066, 68129538, 68699653, 68579143, 67061513, 64025440, 60233807, 56668897, 53866116, 52077440, 51528433, 52332227, 54173621, 56823495, 59915119, 62781334, 64987799, 65835910, 65647643, 64835269, 64000837, 63260967, 62674129, 61846386, 60639595, 58745135, 56584997, 54545547, 52942044, 51736176, 50342726, 47954440, 44473104, 40297145, 35656037, 31210047, 27287223, 23992203, 21317895, 19389937, 18083937, 17165106, 16522055, 16185878, 15949454, 15915030, 16253067, 16957643, 18124398, 19853993, 22071475, 24174471, 25517374, 25668336, 24756639, 23435171, 22575261, 22369353, 22754957, 23045577, 22671661, 21008941, 18388519, 15499968, 12809715, 10591549, 8976051, 7945073, 7141250, 6650361, 6209145, 5705807]
8755E705807l76361k81748k94055k78025k35257p9737j90328j06182j75199j42051
8745C546864j99527k47900k42632p842m1834N5959L2751p6530j83807k11778j34266
8734B289458q7881o0968k3798j22795j96967j1076J1865L5813N0223P7850p6626
8723A885098n2967l8183L1444l7763L5314J8572l5602P6285N5522L7145j61861
8712A813004j3334J8704n5365O9398K2398j42744r4634L2765O5583J59321K4409
8701A899505J17815m5231j62720Q1615J24722j25705j15626k0199j55290p62k0017
8690A578107r2637K9088K33580k3702n1337j41824R7374m1252q2739l1057K6870
8679A500471j4784j65524j31276J00925R5226R2902J4968o5303k597m3163j5643
$$ y = [5705807, 5329446, 5047698, 4753643, 4475618, 4240361, 4160624, 3970296, 3864114, 3688915, 3546864, 3347337, 3099437, 2856805, 2848963, 2807129, 2863088, 2895839, 2819309, 2635502, 2423724, 2289458, 2201577, 2140609, 2116811, 1994016, 1797049, 1785973, 1797838, 1833651, 1883874, 1961724, 1885098, 1832131, 1793948, 1825392, 1787629, 1822943, 1841515, 1805913, 1882198, 1937720, 1974865, 1813004, 1799670, 1818374, 1763009, 1832407, 1854805, 1712061, 1617427, 1650192, 1715775, 1875096, 1899505, 2017320, 1972089, 1809369, 1890984, 2015706, 1890001, 1774375, 1754176, 1598886, 1598124, 1578107, 1485470, 1514558, 1748138, 1724436, 1673099, 1531275, 1628649, 1587397, 1504658, 1473601, 1500471, 1485687, 1320163, 1188887, 1289812, 1385038, 1477940, 1492908, 1427605, 1425008, 1381845, 1366202]
8668A366202L7578l6993J63821P8687o5313J46482J33818j8924m9429k13223j54678
8657A388028n4834j40482k05286N4n95J1255R4819m4103l5299k9712r3984R7074
8645I86935R9715k4936l8623k3966j5847N278p2536m2041k6798n9125N6484J33128
8633I77668Q5549j72538j30753M6030M7304j8171j14234j2368p3590m4884M9412
8622F39425L2733J14550N5467q5313k5624j42879j45568J1524J9886J26381J94618
8611G95200m2878j01495o8547k737m7895p7406N3977J20896Q5377j0016j14855
8600E89621j21781j807J43213K29550K17743L1360j22152k85944j36079j11289
8590D32435J14222K25235J8498j99004O8468Q1505l6655p6902l5797l0997M3450
$$ y = [1366202, 1403780, 1366787, 1530608, 1609295, 1543982, 1690464, 1824282, 1805358, 1755929, 1542706, 1388028, 1333194, 1192712, 987426, 987480, 986885, 998140, 1092959, 1048856, 1013557, 983845, 889861, 986935, 1086650, 1061714, 1023091, 999125, 983278, 988556, 916020, 873979, 847181, 788056, 844540, 977668, 1063217, 890679, 759926, 805956, 853260, 835089, 720855, 708487, 634897, 590013, 639425, 672158, 786708, 842175, 756862, 731238, 588359, 442791, 454315, 474201, 600582, 795200, 752322, 650827, 582280, 579543, 531648, 454242, 508219, 629115, 714492, 704476, 589621, 467840, 466033, 609246, 838796, 1056539, 1087899, 965747, 679803, 543724, 432435, 546657, 771892, 790390, 591386, 659854, 741359, 704704, 627802, 592005, 561008, 604458]
8579F04458L9109n5143l740J00032M1426K9455r5694j29516M0450P6729P1878
8568G19444j4368q3877q3308k1636J19790R8566p0552k757J5408M2255n906k6054
8556F87005J05409j4373k852n174J20265r419J61893J41543R3935R5957L44961
8545A719150L80721L62442O42907J151931K190026M038334M101217p11543k719100
8536A1156085l354855k814674j638483q34833n00901l27959j84365o9261n7800
8527A372954r9116m5620R6548K1775j35302o2867K0610j23380m1008J55454R3343
8516A253391m1723r5558j1715J61677K1808m9270R4816P2558K24645K97432K79304
8505B207365M63795P70784J197133K434079M300929L190540j470901k922073l153880
$$ y = [604458, 643567, 588424, 584684, 684716, 726142, 755597, 659903, 530387, 570837, 647566, 719444, 705076, 621199, 537891, 516255, 636045, 734611, 664059, 661302, 676710, 718965, 713059, 687005, 792414, 778041, 775189, 770015, 890280, 880861, 1042754, 1184297, 1278232, 1374189, 1719150, 2099871, 2462313, 3105220, 4257151, 6447177, 10485511, 14586728, 13875185, 11156085, 7801230, 4986556, 3348073, 2513240, 2012339, 1684380, 1500015, 1430754, 1372954, 1273838, 1228218, 1324766, 1346541, 1211239, 1148372, 1168982, 1045602, 1004594, 1160048, 1253391, 1211668, 1116110, 1104395, 1266072, 1287880, 1238610, 1333426, 1405984, 1630629, 1928061, 2207365, 2671160, 3441944, 4639077, 7073156, 11374085, 14564625, 13093724, 10171651, 7017771]
8496G017771k372917j462195p18499n15629m16280j89112j86615j37637Q6386
8487A105273r7282j97299q6588J06521K05177N6093l4456l9822l6220o520k9537
8476I45340P4335J3801r453k2000p5159m3075j3687n9950l9294K5453M05q2713
8464G14003M7993q2792j17685j7022J58237R8977q893o3661j05516j6728J0725
8453F17638P293R4768J16707K2832M9628O187j0156p309Q4569M4781J3258o5020
8441I75176O9968k036J08935o1270j94853r4965J08132K9761j1204j12100j54696
8430F60848n6438N4097k3780q1198M1819j3440J85591O6357j09974p3542l5768
8419F14572n747k824L7709J30224P7205p7364j49367K6455K000r8442J7373n4680
$$ y = [7017771, 4644854, 3182659, 2464160, 1948531, 1532251, 1343139, 1156524, 1018887, 1105273, 1007991, 810692, 724104, 830625, 1035802, 1091895, 1057439, 1017617, 981397, 974877, 945340, 1019675, 1033476, 1024023, 1002023, 926864, 883789, 870102, 810152, 770858, 796311, 796716, 714003, 761996, 679204, 561519, 544497, 702734, 801711, 792818, 729157, 623641, 606913, 617638, 624931, 719699, 836406, 859238, 908866, 915053, 904897, 897588, 982157, 1026938, 1040196, 975176, 1045144, 1043108, 1152043, 1090773, 895920, 800955, 909087, 938848, 927644, 815544, 660848, 604410, 658507, 634727, 553529, 595348, 581908, 767499, 833856, 723882, 650340, 614572, 608825, 606001, 643710, 773934, 851139, 773775, 624408, 650863, 652863, 554421, 571794, 517114]
8407E17114N2274J67695J3544j10402J27734N7826k4222k3841n2257m5650Q6311
8396G66126r6050j01504J7463p7987j0211k7286q4313r810M9302M620m5957o897
8384C77496P9126J16319J415j1685j16418r4907j33118Q8264J14314L8825j10614
8373C49017M026J18418k8210N6904l6572L7978kk7217k4103m6884j9409O316j2272
8360C77990l5556o4680P6115J26846q0209j31003k0600r4013n0568J14274L2257
8349B50853m3747j08761M5482J00510J70754r083J1138k0399l5298j2574J2098
8338C60973k0501q1763q9429K0950k4998K0526j3928m1476L6247R4789L8283q3046
8326B16627p1890m5455J35833N113R371k3114n3687O0665J34317J5767l9644l1649
$$ y = [517114, 569388, 737083, 750627, 640225, 767959, 825785, 801563, 777722, 725465, 679815, 766126, 670076, 568572, 586035, 508048, 497837, 470551, 386238, 376428, 425730, 430350, 384393, 377496, 456622, 572941, 574356, 562671, 446253, 351346, 218228, 306492, 420806, 459631, 349017, 353043, 471461, 443251, 500155, 463583, 501561, 501559, 474342, 450239, 403355, 383946, 390262, 377990, 342434, 277754, 353869, 480715, 400506, 269503, 248903, 154890, 104322, 218596, 250853, 207106, 98345, 143827, 244337, 415091, 406008, 417146, 396747, 361449, 348875, 360973, 340472, 258709, 169280, 190230, 165232, 185758, 171830, 130354, 166601, 261390, 299673, 216627, 144737, 99282, 235115, 240228, 249599, 226485, 172798, 233463, 367780, 383547, 343903, 312254]
8314C12254j12030L5066Q1825J02709r7692L3352m6662k5312J02815K5281l1502
8303C80104J2326k7244j71081k3078J06678l3888m4093J60369J31141k7086o2720
8292D01428j69265j22045M1924L0838L9606M9830Q922j15749k9688m446m2211
8281H9144O0479J4612n3128n8864L0319R1280O8182L95O1006J61679n1875r3892
8269C19337r4590n845n6615J4126Q2087M7428k8686q655L8406o8552o0663J9784
8257A97562q4847J9426Q8490J23139n2611p5466q0450J2548J69305j2614j22295
8246A82187o6576P3953M3452R5920o1696j19869k453M5195l8526Q598l9899m1136
8234G9150Q8962N8796l5547p9638J24326o748q8885k3490M9640j1177n381q362
$$ y = [312254, 200224, 235290, 317115, 419824, 322132, 355484, 308822, 283510, 386325, 411606, 380104, 392430, 365186, 194105, 171027, 277705, 243817, 199724, 360093, 491234, 464148, 401428, 232163, 110118, 152042, 182880, 222486, 272316, 281238, 165489, 135801, 131355, 89144, 149623, 164235, 111107, 52243, 82562, 173842, 242024, 242419, 303425, 465104, 413229, 319337, 224747, 218902, 162287, 176413, 258500, 305928, 277242, 268587, 306993, 238441, 177778, 197562, 112715, 132141, 220631, 343770, 291159, 215693, 135243, 147791, 317096, 304482, 182187, 115611, 189564, 233016, 328936, 267240, 147371, 144918, 190113, 151587, 160185, 120286, 79150, 168112, 226908, 191361, 111723, 236049, 229301, 140416, 116926, 166566, 155389, 150008, 141646]
8222A41646O1590j12821k8659p1095k834Q697J73873J66898L4369p5866l8581
8211B57217j86021k339k4307M2231J32335n1804j0843l524Q9006l4892j04191
8200A02868l9601m7740M5348L5958J1251L8673o5635P1439J6764p6401L3664J44980
8188B71568L9682L6580q8233L5571l3131o9726R7179m6608j91560J45690J65284
8177C62296o6575p7511j49858k2204l0131N9184J3943q7434J08837P674j45914
8166b7693m9789J36919J13756M7426j1248j00666j23027l5063J12852P9504m3195
8155I9776o0809k0575L7170o7600N6411J04221q150N345M6942M6847p8089j23751
8143C7738R299J10289J1036o1253k3726P0484P2898m2676r5478N1578R99r718
$$ y = [141646, 203236, 90415, 61756, -9339, -12173, -3476, 170397, 337295, 371664, 295798, 257217, 71196, 68857, 44550, 86781, 219116, 167312, 156469, 152945, 241951, 207059, 102868, 63267, 15527, 60875, 96833, 108084, 146757, 81122, 152561, 169325, 92924, 126588, 271568, 311250, 347830, 259597, 295168, 262037, 192311, 289490, 242882, 51322, 197012, 362296, 295721, 218210, 68352, 46148, 16017, 75201, 89144, 1710, 110547, 118221, -27693, -77482, 59437, 173193, 220619, 209371, 108705, -14322, -49385, 63467, 142971, 99776, 38967, 18392, 55562, -12038, 44373, 148594, 140444, 145789, 192731, 239578, 161489, 37738, 47037, 157326, 168362, 107109, 83383, 153867, 226765, 184089, 88611, 140189, 141188, 131470]
8131A31470o0074q9135o4958N7060P5847O6318o0370N3498Q8684J9262j17898
8120I9704L4404J71161o6918k15176L5015P6583k408R4771N2007K7943m9691k1963
8108B35432J0591o5291n1653j36721j3576N9621J59786K3419r8162J29426J8757
8097B71629o1548K7077J0667J9998r372J3597J6451K0923r778J566j69426j6908
8085A14876o202M0649J3711R070q8183K2018J32236K4609j67791k3305M4654J6416
8073A32758O0611Q2992l005j76601j73998L228K45951M5112j05456j35417M799
8062a9026N2252K2580l13J12965l4711M0718L2980j8034K1133O4830J55o5852
8050B09677j4727K44n1938K086K5081k0533o4365K2405N7182M6191R414l0768
$$ y = [131470, 71396, -17739, -82697, -25637, 50210, 116528, 56158, 109656, 198340, 217602, 99704, 134108, 305269, 238351, 23175, 58190, 134773, 132365, 227136, 279143, 307086, 257395, 235432, 246023, 180732, 129079, -7642, -21218, 38403, 198189, 221608, 123446, 252872, 271629, 210081, 237158, 247825, 267823, 258451, 272048, 288499, 309422, 299644, 301210, 131784, 114876, 108674, 149323, 163034, 172104, 83921, 105939, 238175, 262784, 94993, 71688, 116342, 132758, 193369, 276361, 273356, 96755, -77243, -74015, 171936, 217048, 111592, -23825, -19026, 33226, 55806, 55493, 168458, 133747, 174465, 207445, 189411, 210544, 275374, 275529, 209677, 194950, 195194, 143256, 145342, 170423, 149890, 85525, 107930, 165112, 211303, 220717, 189949]
8038A89949m9288L562N9389l0745K2885M4723p9494k7392K2741R8374Q407j14526
8026A48585j155k2413m9157l6479j01004L8940P5253J06924N7826n0643k2554
8015A44123m4520K7938Q2109P4230l5382p5227m8476l3799m8671K2325M4267n2363
8003E6554P6605M6297j29280M2264m0550n601P9205j4012k7911J84724O3966l3368
7991B98893n8942P3372J21203J26854k0420o2447k16885m2727J12271m7069j33002
7980A51101P0938l6025j1540P2143p7901p2551k8744J2691K3674J80480k1849
7969B62417j71951m6270M0125R5838M2171O8870Q661k5306l8690q6495r6232L3672
7957H6810R866o6462J0673n322J13825J0159J9735n358p2658j5812J04352M5298
$$ y = [189949, 140661, 144223, 203612, 172867, 195752, 240475, 160981, 133589, 156330, 254704, 263111, 148585, 147430, 125017, 75860, 39381, -61623, -22683, 52570, 159494, 217320, 166677, 144123, 99603, 127541, 209650, 283880, 248498, 173271, 124795, 90996, 42325, 64650, 108917, 56554, 133159, 179456, 50176, 92440, 51890, 46289, 125494, 111482, 83571, 268295, 332261, 298893, 239951, 313323, 434526, 561380, 540960, 478513, 261628, 218901, 331172, 284103, 151101, 222039, 186014, 174474, 246617, 168716, 96165, 67421, 80112, 103786, 284266, 262417, 90466, 44196, 84321, 180159, 222330, 291200, 299861, 274555, 235865, 149370, 53138, 86810, 96676, 30214, 40887, 35565, 149390, 159549, 179284, 173926, 101268, 85456, 189808, 235106]
7945B35106p1931q8329k9529k7538k4856p178l716O7826K00703j09733r2466k0258
7933B8101M874O154j7268m2624k8193J42215O9350j8652m1835j48752l5329O6974
7921a4985k6235Q0756J3690Q4779P40k8571J688N6252L0809l3010j08823l0862
7909B6228O4934J76022P099K4218j740j1586N4720k1324r0122J00019o4840j43966
7897A19662p7308P5310K40j12979N4599Q2025L4958J42174K4957j21211n0670
7886A71757J1186Q7267l7563r3020O5763N8275J29378k4166j74882j40039j8102
7875C5854O9749N8641l0434j2957k3934p055J8192J28644n2860n2090N6830q5592
7863A02988r4149M2176M2259o3664j30623m8262J04072J7077l0833j03213O1776
$$ y = [235106, 163175, 74846, 45317, 17779, -7077, -14255, -17971, 49855, 250558, 140825, 48359, 28101, 32975, 39129, 21861, -20763, -48956, 93259, 162609, 143957, 102122, -46630, -81959, -14985, -41220, 39536, 53226, 138005, 138745, 110174, 111862, 168114, 198923, 165913, 57090, 26228, 91162, 267184, 274283, 298501, 296761, 285175, 339895, 318571, 228449, 328468, 263628, 119662, 42354, 117664, 117904, 4925, 59524, 141549, 176507, 318681, 343638, 222427, 171757, 182943, 270210, 232647, 139627, 205390, 263665, 393043, 368877, 193995, 53956, 35854, 105603, 164244, 133810, 120853, 96919, 89864, 108056, 236700, 183840, 131750, 188580, 102988, 8839, 51015, 93274, 29610, -101013, -149275, -45203, -28126, -58959, -162172, -100396]
7852a00396Q7464j7500L2410Q3964o939R123n7329j9382l1317O9863k003l8984
7840H974J09258L5652q0051k4912k8966j08J06377J71845Q4020k8854j62493k6101
7828A64641M6354L2157O5473p2950j88831n7231M9717P6657O1355j81557P7812
7817G3597R7755o0104j14382j12238p8854J37013K6179J06553O3166P7349n3107
7806A62927j02990P6057Q9963j45057o6405J79179M007k1993k5321K928l7838
7795A15457J03662J45662j89237j49565n4172o2046J34939K32107J1019l8017
7785B49809j7301j7793J0466P835Q359q8202J6229k2080k0908o8420p686j00628
7773e0320j4491L9865M8668j6974R0382K0559n7378Q2631L9186j9080R832k5862
$$ y = [-100396, -12932, -30432, 1978, 85942, 79003, 88126, 30797, 11415, -19902, 49961, 47958, 8974, 118232, 153884, 73833, 48921, 19955, 19847, 126224, 298069, 382089, 353235, 190742, 164641, 210995, 243152, 308625, 235675, 46844, -10387, 39330, 115987, 177342, -4215, 73597, 171352, 111248, -3134, -115372, -194226, -57213, -31034, 75519, 138685, 216034, 162927, 59937, 135994, 225957, 80900, 14495, 193674, 197681, 175688, 150367, 153295, 115457, 219119, 364781, 175544, 25979, -28193, -90239, 44700, 276807, 287826, 249809, 232508, 214715, 225181, 233016, 241375, 153173, 169402, 147322, 126414, 57994, 50308, -50320, -64811, -24946, 23722, 6748, 97130, 117689, 60311, 142942, 182128, 163048, 172880, 147018]
7761A47018K9816J0551j49254k9946Q8133m9102p285p4106L5437k3827q1533R2012
7749a2086J11524K0390O0898N3529p1361j77594o0624n1592n0197K5102K49719
7738I7708J05705J6047l8773L2436j6810p4421K5163l2233n5607j6667J26694
7727A69242J8268o9688N9376P0520m8554p1157m6297L5135l145k4671p6253R9862
7715A12638L9716p5845j7491Q0339r0175M5769j0029j02328m9861k3160J9893
7704g0534n9287q4807K5012M9083J29390J04041N2277J59833N8901j38549j66237
7693E9123j1462J43014l5795O8918m6739j0579j509M6535J09507j0085k45599
7682F5329L2800N9565j4140K3493l6782j03079l1129R3118J2960l3235m3258L3992
$$ y = [147018, 176834, 187385, 38131, 8185, 96318, 47216, 39931, -34175, 1262, -22565, -104098, -12086, 99438, 119828, 180726, 234255, 162894, -14700, -75324, -126916, -177113, -152011, 97708, 203413, 219460, 180687, 213123, 196313, 121892, 147055, 114822, 59215, 42548, 169242, 187510, 117822, 177198, 247718, 199164, 128007, 81710, 116845, 113700, 89029, 12776, 112638, 152354, 76509, 59018, 139357, 49182, 94951, 84922, -17406, -67267, -90427, -70534, -129821, -214628, -189616, -140533, -11143, 92898, 145175, 305008, 363909, 225360, 59123, 47661, 190675, 154880, 223798, 177059, 166480, 164971, 211506, 321013, 310928, 65329, 98129, 157694, 143554, 167047, 130265, 27186, -3943, 89175, 102135, 68900, 25642, 59634]
7670E9634R9500M9865j80101Q301k9949M831j58n5877Q83L7522M9259L1783J2576
7657H8069k4048l901K7117J15839o863o3813n0965R5722r2121j68136m1976J4209
7645a10867Q3303O2123O3037o7616j73171K5593M0874N0060P9641M2720j03967
7634h270n1150P2042J01370P3190j4291k311m0491l6545q4204J08284R707o1651
7622F5680l9355r4612J4279Q4487N961M5475k2877P2019j0444K2321p4592J7384
7610H5726j769o7377O0081l8617j780O6907n4130P5598N181o8003J07007J13920
7598B82744K0212q9747o7389L7536L4146L9623j8069K4964P1069o9795n0721j0569
7586B04004r3047q7044P0633k1227l4581r362R7889J623p5452j08128n7564n0534
$$ y = [59634, 159134, 208999, 28898, 37199, 7250, 12081, 11923, -43954, -43071, -5549, 43710, 75493, 88069, 64021, 60120, 87237, 203076, 196213, 132400, 81435, 177157, 85036, -83100, -125076, -110867, -27564, 34559, 97596, 29980, -143191, -117598, -76724, -26664, 52977, 95697, -8270, -59420, 12622, 113992, 187182, 172891, 170580, 130089, 93544, 9340, 117624, 127331, 65680, 26325, -68287, -54008, 30479, 36440, 81915, 59038, 131057, 120613, 142934, 68342, 85726, 83957, 16580, 76661, 38044, 36264, 103171, 49041, 124639, 129820, 61817, 168824, 282744, 302956, 213209, 145820, 183356, 217502, 257125, 239056, 264020, 335089, 265294, 214573, 204004, 110957, 23913, 94546, 73319, 38738, 29376, 127265, 128888, 53436, -54692, -112256, -162790]
7574a62790Q9942R0719n0117R8187J21116j39211p5335N3339P042p3458m35l6819
7562g7820k7604o1556Q8081J82322J7029j4216M0654j9515o4284j26891O8644
7551D844N9186o6925j096l7210K1890J36418l099n271r8019L9315J70120J05066
7539C25219k5487j57747p0370L7198J52480L499q5095p2281j20964K86K3395O3546
7527G3679p2238p4717j7326L4194K7107m4961M622J04887P3370j9045q3987r628
7515d043m2973q35Q8806j2578Q0907J9453j21482o8545q701m904J06119K2545
7503E3769j42798Q6950J33241N7479J54896m9537r1847Q5385r55j14096J5954
7492A88441J0897M169J17190n4798q3010j12473Q5381O4951J0934m929J46073
$$ y = [-162790, -72848, 17871, -32246, 65941, 187057, 47846, -27489, 25850, 32892, -40566, -41001, -77820, -105424, -166980, -78899, 103423, 120452, 106236, 146890, 127375, 63091, -63800, 4844, 64030, -2895, -3991, -41201, -19311, 117107, 114008, 108737, 10718, 50033, 220153, 325219, 299732, 141985, 71615, 108813, 261293, 264792, 179697, 107416, -13548, -13262, 10133, 73679, 1441, -73276, -90602, -56408, -29301, -74262, -69640, 35247, 108617, 89572, 5585, -4043, -47016, -47851, 40955, 28377, 109284, 128737, 7255, -61290, -69991, -74895, 31224, 53769, -89029, -2079, 131162, 188641, 343537, 294000, 202153, 287538, 286583, 172487, 188441, 199338, 203507, 320697, 265899, 182889, 70416, 155797, 220748, 231682, 226753, 372826]
7481C72826j8822j94862m7934o6429P185k8597m6149N3429K4501N2936M1998N176
7469A55258K3140j7466o2193K0817p684J965J3824j11925N5385M7749K0238o2081
7457G7027J3094l5031N8124l2725j04174Q4193P5510Q703j34081j82049L317Q8863
7445g9229L1958l4407L7967l2395K2972J3076J1650N3683M9321N3295q2177J12040
7433A57754j9995j68017p4383O1516K5789l077j7394j3996Q3702L5171o9032p4737
7421g6699l6262M0573K1620R562l7908p1809J43033Q2874O2213O0392K6669r8085
7409A26173P1761O76k0738q9667l9498r9008L8428Q6286J1446N2001R5722J05710
7397C39292j21507j78471k9388j8107p709J17077p507j47822n4565m576J14607
$$ y = [372826, 354004, 159142, 111208, 44779, 51964, 23367, -22782, 30647, 55148, 108084, 150082, 155258, 178398, 160932, 98739, 119556, 111872, 113837, 127661, 15736, 71121, 118870, 139108, 77027, 90121, 55090, 113214, 80489, -23685, 60508, 136018, 144721, 10640, -171409, -168092, -79229, -47271, -81678, -43711, -76106, -53134, -40058, -28408, 25275, 74596, 127891, 45714, 157754, 137759, -30258, -104641, -43125, -17336, -20413, -37807, -51803, 31899, 67070, -1962, -76699, -112961, -72388, -50768, -41206, -79114, -150923, -7890, 74984, 137197, 197589, 224258, 126173, 197934, 198610, 177872, 88205, 48707, -50301, -11873, 74413, 85859, 137860, 233582, 339292, 217785, 39314, 9926, -8181, -15890, 101187, 93680, -54142, -108707, -113283, 1324]
7386A324m3445L5793L9875o799O1982k3483M6478N5565m1510n4687J01384n2394
7374A20083L8179n7627n1763R023Q214q5553J87328O2295j78104k1249O5479j7004
7362G9301k3796N0988m7684j78061L5954r62o2916M1108J00054K24140J15297
7351C33423j27348o1225n7854p8243j53055r6184J00556J33157J72635M5428P313
7340B18603o7515k4119m4958N4790q490j01897j31326j19423L0360J43133J53137
7329A02295M6357J7201L6466j0496o3638j7265M5565r893j14098m8123Q1767k2594
7317D3544j6894j18545O7562J56734N8021j12605L0097K8612j1425n6730n1216
7306A7155l2801L1287l9392m7115L9337J44750J33013k7278p2812k05j6658n5767
$$ y = [1324, -42121, -6328, 33547, 26748, 88730, 65247, 111725, 167290, 125780, 71093, 172477, 120083, 158262, 100635, 48872, 57895, 66109, -19444, 167884, 230179, 52075, 30826, 96305, 79301, 55505, 106493, 58809, -119252, -83298, -84260, -147176, -106068, -6014, 218126, 333423, 206075, 144850, 86996, 8753, -144302, -240486, -139930, -6773, 165862, 211290, 218603, 151088, 126969, 82011, 136801, 128311, 26414, -104912, -224335, -193975, -50842, 102295, 148652, 165853, 202319, 191823, 128185, 110920, 156485, 146592, 32494, -15629, 66138, 43544, 26650, -91895, -24333, 132401, 190422, 77817, 107914, 136526, 125101, 68371, 17155, -15646, 15641, -23751, -70866, -31529, 113221, 246234, 218956, 146144, 145939, 129281, 73514]
7294G3514N6012Q9496k2072j14859o0375J4351k6316o9576K2270O4344k5944Q395
7282I240j4935j5222l7518M9329q0909k35848k4396J42673O4488O1812J10960
7271B9674N2908n8674q4378k0762O8040N4965m9173j98721L0411N1600j6231l4070
7259a74411N7128Q5645n3448n71j4572O3473R3640m871j42203M1857p5798l6517
7247a60648l6782Q3451n716k7156M1467J38267J05742l1512p1526j11722n9073
7236a35208R6963K9110j3787p6749j00332K8332J26297J0246K2217M1042j3985
7225A4146N8513J08902R0495M6681n6173j04290m0551P8909k0689j00927m344
7214G0672n0923l0476q8815O5177O0276P3680m9739r3381o8925J7430N7231p7793
$$ y = [73514, 129526, 219022, 196950, 82091, 21716, 36067, 9751, -59825, -37555, 26789, 845, 9240, -5695, -20917, -58435, -9106, -90015, -325863, -350259, -207586, -143098, -81286, 29674, 82582, 23908, -60470, -81232, -13192, 41773, -7400, -206121, -175710, -124110, -140341, -174411, -117283, -31638, -85086, -85657, -100229, -36756, 56884, 52013, -90190, -48333, -124131, -160648, -197430, -113979, -119695, -146851, -105384, 32883, 138625, 107113, 35587, -76135, -135208, -38245, -9135, -22922, -99671, -200003, -171671, -45374, -35128, -12911, 28131, 14146, 72659, 181561, 272056, 318737, 262564, 158274, 117723, 196632, 175943, 75016, 70672, 19749, -10727, -99542, -34365, 25911, 99591, 49852, -43529, -112454, -95024, -37793, -115586]
7202a15586o1858O8492M4467J2924r522O1200K04936K1527n2937q9464n4072k8165
7190A942N5476N8111o8342k2666M3880j7084N6535j1635R9787n7719j07619K1693
7178E2359m3869K8036J5282j997N5513M4480r2612J10711o6223l4336l4185k0025
7166A3134J9235p7850n0515J80153M7064j36130P1593Q3869K1991n5897q2961
7155C3686M9630J2610R0561J2956j21561j7499L1019l230j7309o0179J1515k8936
7143f737M2599p5992N0619L6047o835K0340j23702k1601K6541M2419k4108k5596
7131f6006q6783m3345p332K3337l3728J54691L7008p4330m1664P8208J13468p3969
7119b0445o4567M8415O7941N8860k2649k9475o7863n7222k5394J2929J107r9436
$$ y = [-115586, -177444, -108952, -64485, -51561, -61083, 117, 205053, 226580, 173643, 84179, 30107, 1942, 57418, 115529, 47187, 24521, 68401, 51317, 107852, 96217, 196004, 138285, 30666, 52359, 8490, 36526, 51808, 49811, 105324, 149804, 57192, 167903, 101680, 67344, 33159, 13134, 32369, -45481, -95996, 84157, 131221, -4909, 66684, 150553, 172544, 116647, 33686, 83316, 95926, 186487, 199443, 77882, 60383, 91402, 88172, 70863, 10684, 22199, -6737, 35862, -40130, 10489, 46536, 39701, 60041, -63661, -85262, -58721, -16302, -40410, -66006, -152789, -196134, -203466, -180129, -213857, -59166, -22158, -96488, -138152, -59944, 53524, -20445, -85012, -36597, 31344, 90204, 67555, 38080, -29783, -87005, -112399, -99470, -98363, -197799]
7107a97799K1735J35668N304l1056M5826O8768m6649l1262M0346M658j29171l7104
7095a50736Q4116M9328l8439K5586L4768j8579q4473o0504k1660L7794M3918l4343
7083a33224j7223J42393R4719j52190n1672J74186m2243j03124M7567M9053Q2978
7072I1220r1773L0449P3285P7029j6923N0338n1101j09681j858n8652O1924N123
7060E9380N2157j88275m6974P7546J31337j8235Q4877J9234l7110j12911M666
7049B5692Q0962p0879o6912L2917Q7810J29828p6095m3672L9548n9753N7881p4520
7037F2807j40039j21645r1541m6106M3210P7401q265j05530J5410J21212R4723
7026i8363J22857J07597N5466j01814q8056l0265O0682J88558M7478p5035l8334
$$ y = [-197799, -176064, -40396, -35092, -66148, -20322, 48446, 1797, -29465, 10881, 15539, -113632, -150736, -66620, -17292, -55731, -30145, 4623, -13956, -98429, -158933, -180593, -142799, -98881, -133224, -150447, -8054, 86665, -65525, -117197, 56989, 14746, -88378, -40811, 8242, 91220, -553, 29896, 103181, 180210, 163287, 213625, 162524, 52843, 50985, -7667, 54257, 59380, 111537, -76738, -123712, -46166, 85171, 66936, 151813, 171047, 133937, 21026, 25692, 106654, 35775, -31137, 1780, 89590, 219418, 143323, 99651, 139199, 79446, 137327, 62807, -77232, -198877, -290418, -336524, -293314, -215913, -224178, -329708, -314298, -193086, -98363, 24494, 132091, 187557, 85743, -2313, -32578, 28104, 216662, 264140, 189105, 150771]
7015A50771M621J319O8421m3229l9964J3018n3182m7421j2457Q940k5173p938
7003A7726n9084m4769J26517P3850j44528l3743J0519J05894O3598l9583k29611
6992a53214k07447l6123R9029N8004P2229K9073J42816O1842k2614M8867K7041
6981A19503l1496J7161M8048j2312j17619j90788K7939J44293K29092l2137l7677
6970A64007J4028l186P3838l5758j48633j49930n4229J05744N4853J2151n6011
6959b3126o6659L1756J13249P1484J3201o2354O4951Q1767k6850p1517l0782r1751
6947C369M1655O9093L7014m7835m4194l7619k1044l0187j19533M0510J52786J0029
6935E4044m6145L9361K3544K4403J07615n2834l0242N7317m4290n6424j56942
$$ y = [150771, 155392, 156711, 225132, 181903, 141939, 154957, 101775, 54354, 41897, 50837, 25664, 17726, -41358, -86127, 40390, 114240, -30288, -64031, -53512, 52382, 115980, 76397, -153214, -360661, -396784, -297755, -239751, -167522, -138449, 4367, 66209, 43595, 92462, 119503, 88007, 105168, 153216, 140904, 23285, -167503, -139564, 4729, 233821, 201684, 164007, 178035, 174849, 248687, 212929, 64296, -85634, -139863, -34119, 20734, 32885, -23126, -89785, -58029, 55220, 126704, 139905, 77551, 142502, 224269, 197419, 125902, 95120, 3369, 45024, 114117, 151131, 103296, 59102, 21483, 439, -29748, -149281, -108771, 44015, 54044, 7899, 47260, 70804, 95207, 202822, 149988, 119746, 177063, 132773, 76349, -80593]
6924h0593j88377J4111P0630K6576M9719K8868J06282J01895N0280l4247o4736
6913H0408j323l1598P985k0926M4437j225l5173k4162j517R6365p4888N1069N2577
6900A42029p8810r1447m5212p066P820R3101L4314L1285k1597k5494q2532m2263
6888h5872o499J05301M9780j41938j798O604m9165L9830L1187K5957j6253m3179
6876h6045R4922N7159j30642k0690O5136k5911J9438j4099K6233n4516o9527J07013
6864c1529J67984J5451J2152k6574K4713o3273J6038L6851n4236j90994l9320
6853a32737J97156J3474n0184O8733Q6712r7919j14817O0151N8596j8433j08830
6842c8098P6394R1734k1696n4517j12660n958P0543K2091j06336k9997O462k5625
$$ y = [-80593, -268970, -254859, -184229, -157653, -107934, -79066, 27216, 129111, 179391, 145144, 80408, 79085, 47487, 55472, 34546, 78983, 77758, 42585, 18423, 16906, 113271, 38383, 89452, 142029, 63219, -28228, -73440, -80506, -72686, 20415, 54729, 86014, 64417, 38923, -43609, -85872, -92371, 12930, 62710, -79228, -81026, -74422, -123587, -83757, -52570, -26613, -42866, -86045, 8877, 66036, -64606, -85296, -20160, -46071, -26633, -40732, -14499, -69015, -138542, -31529, 136455, 151906, 164058, 137484, 162197, 98924, 114962, 151813, 97577, -93417, -132737, 64419, 77893, 27709, 96442, 183154, 85235, -29582, 30569, 89165, 70732, -38098, 38296, 130030, 108334, 53817, -58843, -64801, 5742, 27833, -78503, -108500, -102038, -127663]
6830a27663p0742J4604l2034R3089K050J05487K9818j0911Q2641p3426p7675j1401
6818g6163K9250m0117l4101O7442N7124P1180j3320k0853P506j04848j17099j1957
6806a85956K1127Q1962J17058Q0858m3168l8736J25822m8333j30356l92P9336
6795E9222M4606J4148n142p4515j20808m3641K1938l4442j00262K6985P0978M6772
6783i4161p3548L2864J34692O6811j06637m7938L7246k5950J4460o349n0068P1066
6771d7512L3745n7613j5823N6359l474j0953m3704l23Q765P9425Q9946j9982j26492
6758e7636o7329m6357K01142M4662r1095m6579j12336M7837J18566J94784Q3706
6747B69365j02347o8720o4675l4622m4311j7982K6004j5679J09230k7382j00122
$$ y = [-127663, -198405, -183801, -215835, -122746, -120696, -15209, 14609, 3698, 86339, 12913, -64762, -76163, -46913, -87030, -121131, -53689, 3435, 74615, 61295, 40442, 47948, -56900, -173999, -185956, -164829, -82867, 34191, 115049, 71881, 33145, 158967, 110634, -19722, -20114, 59222, 103828, 117976, 112834, 38319, -82489, -126130, -104192, -138634, -238896, -211911, -140933, -94161, -167709, -134845, -153, 66658, -39979, -87917, -50671, -76621, -62161, -68510, -118578, -47512, -13767, -71380, -87203, -30844, -34318, -45271, -88975, -89298, -80533, -1108, 88838, 68856, -57636, -124965, -171322, 29820, 74482, -16613, -63192, -175528, -127691, -9125, 185659, 269365, 167018, 98298, 33623, -999, -45310, -63292, -37288, -52967, 56263, 28881, -71241]
6736g1241k2868Q146o6878r685K9664N0338j3297P3514J79892p5810M8572J94700
6724C25047J6460q5865N0008k0389j7496l7611l3597o2031p7799o0370l6873R6330
6712E5814J1424m9317K4891O4055k8375q7164j71881o0178M7887K6489l7601K9238
6700a74718J36588J00691P842l5405l2546o0483p5633r3884O6700P2031k9559
6689a18376K4806K567j0941O4438R3943L738l0985m400N7530j1805o7926k5457
6677b2868N825j17801q149J39673R9994J1891r1384o7523K9031K3230Q4388L9112
6665A25419J773l2511p1284r3088Q0479J7769O2483J5927l1534k607r8960q2110
6653a08244r062K7839j31426l7473J26422J21943m9565q8953n3946R8104R4286
$$ y = [-71241, -94109, -85963, -152841, -162526, -132862, -82524, -95821, -22307, 157585, 81775, 130347, 325047, 341507, 255642, 305650, 285261, 267765, 230154, 196557, 134526, 56727, -3643, -40516, 55814, 67238, 17921, 42812, 106867, 78492, -8672, -180553, -240731, -192844, -166355, -203956, -174718, -38130, 62561, 70403, 34998, 2452, -58031, -133664, -227548, -160848, -88817, -118376, -93570, -91003, -101944, -37506, 56437, 60175, 29190, 24790, 82320, 70515, 2589, -22868, -17043, -134844, -142993, -3320, 96674, 108565, 17181, -50342, -21311, 1919, 86307, 125419, 127192, 94681, 23397, -69691, 10788, 28557, 91040, 106967, 75433, 72826, -26134, -108244, -117306, -89467, -220893, -258366, -131944, -10001, -59566, -148519, -202465, -104361, -10075]
6642a0075O2154l1202n3233O4232k977j1751K6016P4451r1372O2460N8138P0845
6630B17686p6983L2846N4791j75846j33215n0794Q5287p293o5146K3494K0088
6619g5085J42594Q1403j8609k5274o708m2257j29574q0720O1730J20176M9587
6608G7263N2093N0370j99854j34081M229O2431M4464l20p0100o728K6715K0004
6596g3514m3034o5117J8429N6358k7075j00509q4085J18019J56441O0676o3383
6585d6794J9844L019J2305L7868L3570q2125m174o9731k521J09344q067o8236
6573f5698n9457J2588P504J3130K3840p5491j00463Q905J48867K5932P5789k9795
6561a4349q2083J19554J6067o3814n8635o2240K4701P9810n4681j1641k9648N17
$$ y = [-10075, 52079, 20877, -32356, 31876, 28899, 17148, 43164, 117615, 26243, 88703, 146841, 217686, 140703, 173549, 228340, 52494, -80721, -131515, -46228, -53521, -118667, -95173, -75085, 67509, 148912, 130303, 105029, 98321, 56064, -73510, -154230, -92500, 27676, 77263, 129356, 179726, -20128, -154209, -149980, -87549, -43085, -43405, -113505, -120233, -93518, -73514, -116548, -181665, -163236, -106878, -133953, -234462, -318547, -200528, -44087, 16589, -46794, -26950, -23931, -11626, 26242, 59812, -22313, -26487, -96218, -98739, 10605, 2538, -65698, -125155, -112567, -105063, -91933, -68093, -143584, -244047, -235142, -86275, -60343, 15446, -14349, -96432, 23122, 39189, -24625, -83260, -145500, -120799, -40989, -95670, -107311, -136959, -136442]
6549a36442Q3708J67523Q3266j4899j39396M1780M2286q8346m5573R2568K929
6538H9404J997j07695n5855r7864n8216K2345J02020q3922j6724Q8013k1142L5900
6526a01739k22M7354P0790q7555n9189R3440K2053O3206j01405m1930J07170J2684
6514B4657p4994l2564j8032j31934r216J66475J51801m8314j32860r6418K7310
6503a74089j4933J5710P5232J7588n7239K4518L680R7588O2395j38937q0246R8454
6491g0279J01767O3293j05257j71540k8140O863N1261L8509K8434j27541j5176
6480b27806Q0237J18276K3446m5038l3713O3360R0689r268O132J1880q6806K206
6468f405j6556p4637k4822J72507R0180q8283o0539n5275j8372M8070m4769J52131
$$ y = [-136442, -52734, 114789, 198055, 183156, 43760, 85540, 127826, 39480, -6093, 86475, 89404, 91401, -16294, -72149, -170013, -228229, -205884, -103864, -187786, -204510, -116497, -137639, -101739, -101961, -54607, 16183, -71372, -130561, -37121, -15068, 48138, -53267, -95197, 11973, 24657, -50337, -82901, -100933, -232867, -242083, -75608, 76193, 27879, -104981, -201399, -174089, -189022, -173312, -98080, -80492, -137731, -113213, -109533, -11945, 50450, -88487, -168733, -70279, 31488, 94781, -10476, -182016, -210156, -203293, -152032, -113523, -85089, -212630, -227806, -147569, -29293, -5847, -50885, -84598, -21238, 69451, 60183, 66315, 78195, -8611, -6405, -22961, -97598, -122420, 50087, 140267, 51984, -8555, -63830, -82202, -34132, -78901, 73230]
6456G3230K5067j79677k8586J10567O0032q2193m921j18780n884J86694J08672
6445A44221o2003q4623L3436Q0586j4831P6173l9583j51054o1761r3876K2565
6434a50750Q0195n2557M4460R4433j9909l9963K2740m0894L9359L733K701M1975
6422B5523j19562p5640J496O3403L436J07767j514n922K1974J2382J35718j13269
6410E5792m3422L9567N6609N8331q370k15088r6928K0010m7087O8772M6863L8302
6398b6649j6261p3750r621R5790Q6948J4814k9375j22835M7661M6454J9726q1287
6386d8385l0539k3400M1164Q2624m3753l8031r758K4532M4585L4818r2822N925
6374e3040N5744R6460K2440J4687j06144q6014j8318j5801O0951k9627k7839K3124
$$ y = [73230, 98297, -81380, -109966, 601, 60633, -21560, -26481, -145261, -151145, 35549, 144221, 82218, -2405, 31031, 111617, 96786, 172959, 133376, -17678, -79439, -173315, -150750, -70555, -123112, -78652, 15781, -4128, -44091, -21351, -62245, -22886, -19153, -16452, 25523, -94039, -169679, -168183, -104780, -101344, 6423, 4909, -1013, 20961, 33343, 169061, 55792, 12370, 51937, 108546, 166877, 158507, -56581, -153509, -133499, -180586, -111814, -64951, -26649, -42910, -116660, -126281, -30491, 56457, 71271, 41896, -80939, -33278, 13176, 32902, -48385, -78924, -102324, -61160, 21464, -22289, -60320, -70078, -45546, -961, 33857, -58965, -53040, 2704, 99164, 121604, 136291, 30147, -55867, -74185, -89986, -29035, -58662, -86501, -63377]
6362f3377J92518j680m6107P904q2518L6472J20761j3020P9967N2171j23701j01027
6350E8363r1833M6693m344K0902J20268l5931n9333M8636j6780o6138j18491j10563
6338b08551m8298N3216P7815K2550J8016J25708n1427o6149L3825K8318o702M1141
6326A9462M9081q8866K0512O7144J1399J8126M682j707j03177k3501l7711N9199
6314e357P7780p2279m6072q327J2821l6564L7708l8527j02142j7781J36399L8600
6302b3741l9505L9979P5907k5441j0329L8871J8370q1194P0937P151R1834m4119
6290A18720K2574N1278n5714j8883P1108M9887r6495n6763N7670J41176L1427
6279C15985j35529o2719k9836J0529j07632n4052K9603j2165J8957L5603M9614
$$ y = [-63377, 129141, 127461, 81354, 89258, 6740, 43212, 163973, 150953, 230920, 283091, 159390, 58363, -33470, 13223, 8879, 29781, 150049, 114118, 54785, 103421, 86641, 20503, -97988, -208551, -256849, -203633, -125818, -103268, -85252, 40456, -10971, -77120, -43295, -14977, -21679, 19462, 68543, -20323, 189, 67333, 78732, 96858, 101540, 99833, -3344, -26845, -64556, -5357, 72423, 144, -45928, -54255, -41434, -77998, -40290, -78817, -180959, -198740, -62341, -23741, -63246, -23267, 52640, 27199, 16870, 55741, 74111, -7083, 63854, 71005, 162839, 118720, 141294, 192572, 136858, 117975, 189083, 238970, 142475, 85712, 143382, 284558, 315985, 180456, 117737, 87901, 98430, -9202, -63254, -33651, -45816, -26859, 8744, 58358]
6268E8358p5228P3504K265j06702O0479J27491l784o9382q146r3509Q6418N7616
6256A09380R6487j3860p1197q4413J5856L9275J28134o6595j68603n2204n2758
6245a20498m6099J4782J04819M4153J2888j5768M183p3612k9532j03242p5933
6234b83859O3503N1896L6358J15336j55065k0126k2911J41119J4283l9693m4281
6223a43440m4862P5858J15221n3598n9497l2522L3597n7708r6377J43480J99588
6212G9740Q0187k8124r6368r9129n253O2941M515P564N5547j22729j34873K0776
6200a75206K1112j8517k9978n1035J02355L1519J1416M9331R4850N9974Q6068
6189A81889p6334n4033k3321p8699p9708r943J65198Q556m6269l6097J22717m0532
$$ y = [58358, -16870, 56634, 58899, -47803, 12676, 140167, 136383, 67001, 58855, -34654, 51764, 109380, 205867, 192007, 120810, 36397, 52253, 91528, 219662, 153067, -15536, -67740, -120498, -166597, -151815, -46996, -2843, 10045, -5723, -1540, -75152, -104684, -207926, -283859, -220356, -168460, -132102, -16766, -171831, -191957, -214868, -73749, -59466, -99159, -143440, -188302, -112444, 2777, -50821, -110318, -142840, -109243, -166951, -263328, -119848, 79740, 159927, 131803, 35435, -63694, -68947, -6006, -1491, 6073, 61620, -61109, -195982, -175206, -154094, -172611, -202589, -253624, -151269, -119750, -108334, -59003, 35847, 95821, 181889, 105555, 51522, 28201, -50498, -130206, -140149, 25049, 33605, -12664, -48761, 73956, 33424]
6177C3424o0969k9081j19740j08977J4022J05228J24513K4002l7165J7003M2644
6166D904J75842J7496j05786j2363O6758o5702l16124j13390P8282J28174k4447
6155a66356j8522J2004K4018k3816M3699R8803j6541k0476Q2383J2589p7990n4193
6143a04398Q9437o3494j5242P7768j0446j2292O6170K6997m1560k5687Q2255K0574
6131I0082K6145k8264O7787l2472q7451j47121j55918j1134J09392J15898l8276
6120i1332K6942R9475N6235M3305k9103j12516q5786J2598O6352J01720j6097
6109G1793k20356Q317K02433O8941p0882n8572K737K5801P7410M2234q2742r3586
6097b6472j0224J10137p4504r4297J530n3362J2135N3780J5691K4263N1314N1198
$$ y = [33424, -27545, -56626, -176366, -285343, -271321, -166093, -41580, -17578, -54743, -37740, 4904, 180746, 198242, 92456, 80093, 146851, 81149, -234975, -348365, -270083, -141909, -166356, -184878, -172874, -148856, -172672, -128973, -30170, -46711, -67187, 15196, 27785, -50205, -104398, -14961, -78455, -93697, -15929, -26375, -38667, 27503, 54500, 12940, -12747, 69508, 90082, 116227, 87963, 155750, 123278, 35827, -111294, -267212, -278346, -168954, -53056, -91332, -64390, 35085, 91320, 134625, 105522, -6994, -92780, -80182, -13830, 87890, 71793, -148563, -140246, 62187, 131128, 60246, 1674, 4411, 30212, 107622, 149856, 67114, -26472, -36696, 73441, -1063, -95360, -93830, -147192, -135057, -81277, -65586, -41323, 9991, 61189]
6085F1189p4927j87719n5440J16425J89518n2312m9644J895k0380Q7212j1612
6074D205J07607J9173k2698m7755l9387O9144Q3984j14602j53853j1562K7480
6063g8264M9546J30099j6429j55181j18586P2707J77309O8869n5745l9406n2652
6052a7733L6902J4978O977J56457J03550l5296j0917k2142o8298L887r9644P2929
$$ y = [61189, -13738, -201457, -256897, -140472, 49046, -3266, -52910, -51015, -71395, 15817, 4205, 111812, 130985, 108287, 60532, 21145, 90289, 174273, 59671, -94182, -105744, -78264, -28718, 101381, 84952, -70229, -188815, -116108, 61201, 130070, 74325, 34919, -17733, 19169, 34147, 41124, 197581, 301131, 265835, 254918, 232776, 164478, 168365, 68721, 141650]
$$ [...]
##END NTUPLES=NMR SPECTRUM
##END=
