##TITLE=Analysis number 316442
Compound Code mo 07112
Project Code adrs
Chemist Name vekton
##JCAMPDX= 6.0         $$ Bruker NMR JCAMP-DX V2.0
##DATA TYPE= NMR SPECTRUM
##DATA CLASS= NTUPLES
##ORIGIN= Bruker BioSpin GmbH
##OWNER= nmr
$$ XWIN-NMR		Version 3.5
$$ Mon Jan 16 09:10:16 2006 GMT Standard Time (UT+0h)  MAYBRIDGE\nmr@NMR_250MHZ
##.OBSERVE FREQUENCY= 250.131544655141
##.OBSERVE NUCLEUS= ^1H
##.ACQUISITION MODE= SIMULTANEOUS (DQD)
##.ACQUISITION SCHEME= undefined
##.AVERAGES= 16
##.DIGITISER RES= 18
##SPECTROMETER/DATA SYSTEM= dpx250
##.PULSE SEQUENCE= zg30
##.SOLVENT NAME= CDCl3
##.SHIFT REFERENCE= (INTERNAL, CDCl3, 0, 16.522)
##AUDIT TRAIL= $$ (NUMBER, WHEN, WHO, WHERE, WHAT)
$$ ##TITLE= Audit trail, XWIN-NMR		Version 3.5
$$ ##JCAMPDX= 5.01
$$ ##ORIGIN= Bruker BioSpin GmbH
$$ ##OWNER= nmr
$$ C:\u/data/dgb/nmr/ADRS/14620/pdata/1/auditp.txt
$$ ##AUDIT TRAIL=  $$ (NUMBER, WHEN, WHO, WHERE, WHAT)
(   1,<2006-01-16 09:09:47.64 +000>,<MAYBRIDGE\nmr>,<NMR_250MHZ>,
      <created by zg, POWCHK disabled, PULCHK disabled
       configuration hash MD5:
       62 19 C7 07 E1 42 D1 B7 37 6C 3D D0 77 39 F9 E6
       data hash MD5: 64K
       0A 5A 47 13 96 D0 9B DA 6B AA 16 6C 45 B7 6C 15>)
(   2,<2006-01-16 09:10:02.39 +000>,<MAYBRIDGE\nmr>,<NMR_250MHZ>,
      <Start of raw data processing
       ef LB = 0.3 FT_mod = 6 PKNL = 1 SI = 32K 
       data hash MD5: 32K
       48 98 91 CC 01 46 D4 EA 34 54 33 91 76 E4 A9 DF>)
(   3,<2006-01-16 09:10:04.39 +000>,<MAYBRIDGE\nmr>,<NMR_250MHZ>,
      <apk 
       data hash MD5: 32K
       FE 24 72 A1 6A DB 8E A5 49 E4 7C 41 96 70 06 97>)
(   4,<2006-01-16 09:10:05.37 +000>,<MAYBRIDGE\nmr>,<NMR_250MHZ>,
      <abs ABSG = 5 
       data hash MD5: 32K
       86 70 FE 6A E7 F2 2C AB 2E 4E F1 2F 05 B8 AE 39>)
$$ ##END=
$$ 
$$ hash MD5
$$ AD AE 8D C8 3F 4B DA B3 9C 96 04 5E C2 C7 04 6D
##$RELAX= 
##$RELAX= 
##$RELAX= 
##$RELAX= 
##$RELAX= 
##$RELAX= 
##$RELAX= 
$$ Bruker specific parameters
$$ --------------------------
##$DU= <C:\u>
##$EXPNO= 14620
##$NAME= <ADRS>
##$PROCNO= 1
##$TYPE= <nmr>
##$USER= <dgb>
##$AMP= (0..31)
100 100 100 100 100 100 100 100 100 100 100 100 100 100 100 100 100 100 
100 100 100 100 100 100 100 100 100 100 100 100 100 100 
##$AQSEQ= 0
##$AQ_mod= 3
##$AUNM= <au_zg>
##$AUTOPOS= <6 >
##$BF1= 250.13
##$BF2= 250.13
##$BF3= 250.13
##$BF4= 250.13
##$BF5= 500.13
##$BF6= 500.13
##$BF7= 500.13
##$BF8= 500.13
##$BYTORDA= 1
##$CFDGTYP= 0
##$CFRGTYP= 5
##$CHEMSTR= <none>
##$CNST= (0..31)
1 1 145 1 1 1 1 1 1 1 1 1 1 1 1 1 1 1 1 1 1 1 1 1 1 1 1 1 1 1 1 1 
##$CPDPRG= <>
##$CPDPRG1= <>
##$CPDPRG2= <>
##$CPDPRG3= <>
##$CPDPRG4= <mlev>
##$CPDPRG5= <mlev>
##$CPDPRG6= <mlev>
##$CPDPRG7= <mlev>
##$CPDPRG8= <mlev>
##$CPDPRGB= <>
##$CPDPRGT= <>
##$D= (0..31)
0 1 0 0 0 0 0 0 0 0.06 0 0 0 0 0 0 0.0002 0 0 0 0 0 0 0 0 0 0 0 0 0 0 
0 
##$DATE= 1137402585
##$DBL= (0..7)
120 120 120 120 120 120 120 120 
##$DBP= (0..7)
150 150 150 150 150 150 150 150 
##$DBP07= 0
##$DBPNAM0= <>
##$DBPNAM1= <>
##$DBPNAM2= <>
$$ [...]
##$SUBNAM7= <"">
##$SUBNAM8= <"">
##$SUBNAM9= <"">
##$SW= 20.6930455092707
##$SWIBOX= (0..15)
0 0 3 0 0 0 0 0 0 0 0 0 0 0 0 0 
##$SW_h= 5175.983436853
##$TD= 65536
##$TD0= 1
##$TE= 294.16
##$TE2= 300
##$TE3= 300
##$TEG= 300
##$TL= (0..7)
0 120 120 120 120 120 120 120 
##$TP= (0..7)
150 150 150 150 150 150 150 150 
##$TP07= 0
##$TPNAME0= <>
##$TPNAME1= <>
##$TPNAME2= <>
##$TPNAME3= <>
##$TPNAME4= <>
##$TPNAME5= <>
##$TPNAME6= <>
##$TPNAME7= <>
##$TPOAL= (0..7)
0.5 0.5 0.5 0.5 0.5 0.5 0.5 0.5 
##$TPOFFS= (0..7)
0 0 0 0 0 0 0 0 
##$TUNHIN= 0
##$TUNHOUT= 0
##$TUNXOUT= 0
##$USERA1= <user>
##$USERA2= <user>
##$USERA3= <user>
##$USERA4= <user>
##$USERA5= <user>
##$V9= 5
##$VALIST= <valist>
##$VCLIST= <CCCCCCCCCCCCCCC>
##$VD= 0
##$VDLIST= <DDDDDDDDDDDDDDD>
##$VPLIST= <PPPPPPPPPPPPPPP>
##$VTLIST= <TTTTTTTTTTTTTTT>
##$WBST= 1024
##$WBSW= 4
##$XGAIN= (0..3)
0 0 0 0 
##$XL= 0
##$YL= 0
##$YMAX_a= 626410
##$YMIN_a= -421656
##$ZGOPTNS= <>
##$ZL1= 120
##$ZL2= 120
##$ZL3= 120
##$ZL4= 120
##$ABSF1= 16.522
##$ABSF2= -4.171173
##$ABSG= 5
##$ABSL= 3
##$ALPHA= 0
##$AQORDER= 0
##$ASSFAC= 0
##$ASSFACI= 0
##$ASSFACX= 0
##$ASSWID= 0
##$AUNMP= <proc_1d>
##$AZFE= 0.1
##$AZFW= 0.1
##$BCFW= 0
##$BC_mod= 0
##$BYTORDP= 0
##$COROFFS= 0
##$CY= 12.5
##$DATMOD= 1
##$DC= 0
##$DFILT= <>
##$DTYPP= 0
##$F1P= 14.0000005364418
##$F2P= -0.99999901652339
##$FCOR= 0.5
##$FTSIZE= 32768
##$FT_mod= 6
##$GAMMA= 0
##$GB= 0
##$INTBC= 1
##$INTSCL= 1
##$ISEN= 128
##$LB= 0.3
##$LEV0= 0
##$LPBIN= 0
##$MAXI= 10000
##$MC2= 0
##$MEAN= 0
##$ME_mod= 0
##$MI= 0
##$NCOEF= 0
##$NC_proc= -5
##$NLEV= 6
##$NOISF1= 0
##$NOISF2= 0
##$NSP= 0
##$NTH_PI= 0
##$NZP= 0
##$OFFSET= 16.522
##$PC= 1
##$PHC0= 81.97311
##$PHC1= 6.349814
##$PH_mod= 1
##$PKNL= yes
##$PPARMOD= 0
##$PSCAL= 4
##$PSIGN= 0
##$REVERSE= no
##$SF= 250.13
##$SI= 32768
##$SIGF1= 0
##$SIGF2= 0
##$SINO= 400
##$SIOLD= 32768
##$SREGLST= <1H.CDCl3>
##$SSB= 0
##$STSI= 32768
##$STSR= 0
##$SW_p= 5175.98343685301
##$SYMM= 0
##$S_DEV= 0
##$TDeff= 65536
##$TDoff= 0
##$TI= <Analysis number 999999
Compound Code 99
Book Reference 9
Project Code 9>
##$TILT= no
##$TM1= 0
##$TM2= 0
##$TOPLEV= 0
##$USERP1= <user>
##$USERP2= <user>
##$USERP3= <user>
##$USERP4= <user>
##$USERP5= <user>
##$WDW= 1
##$XDIM= 32768
##$YMAX_p= 450413410
##$YMIN_p= -530665
$$ End of Bruker specific parameters
$$ ---------------------------------
##NTUPLES= NMR SPECTRUM
##VAR_NAME=  FREQUENCY,     SPECTRUM/REAL,   SPECTRUM/IMAG
##SYMBOL=    X,             R,               I
##VAR_TYPE=  INDEPENDENT,   DEPENDENT,       DEPENDENT
##VAR_FORM=  AFFN,          ASDF,            ASDF
##VAR_DIM=   32768,         32768,           32768
##UNITS=     HZ,            ARBITRARY UNITS, ARBITRARY UNITS
##FACTOR=    0.157963299565203, 1,           1
##FIRST=     4132.6476996994, 0,             0
##LAST=      -1043.33573715361, 0,           0
##MIN=       -1043.33573715361, -530665,     0
##MAX=       4132.6476996994, 450413410,     0
$$ Real data points
##PAGE= N=1
##DATA TABLE= (X++(R..R)), XYDATA
$$ [...]
$$ plain form
17711 119334475 98022580 87924541 89673891 102367646 120506397 132701865 137283838
17704 137283838 132909920 115956221 93070707 69942442 50669409 37275868 28531680
17697 28531680 22564915 18340516 15265964 12741065 10793217 9471617 8753111 8209172
17689 8209172 7592359 7061815 6354768 5621587 5111780 4679506 4268578 3855650 3587980
17680 3587980 3299303 3065991 2862873 2584661 2500462 2440335 2307565 2222034 2140591 1987948
17670 1987948 1854735 1710225 1508831 1454747 1362176 1362394 1458151 1531190 1608546 1582125 1609645
17659 1609645 1493447 1242358 1372836 1503362 1564622 1617708 1720548 1793915 1907525 2070105
17649 2070105 2074188 2050639 2087139 2013848 1784799 1714063 1413299 1234093 1174978 1036542 929591
$$ packed form
17711A19334475k1311895j0098039J749350J2693755J8138751J2195468M581973
17704A37283838m373918j6953699k2885514k3128265j9273033j3393541q744188
17697B8531680n966765m224399l074552k524899j947848j321600p18506n43939
17689H209172o16813n30544p07047p33181n09807m32274m10928m12928k67670
17680C587980k88677k33312k03118k78212q4199o0127j32770q5531q1443j52643
17670A987948j33213j44510k01394n4084r2571K18R5757P3039P7356k6421K7520
17659A609645j16198k51089J30478J30526O1260N3086J02840P3367J13610J62580
17649B070105M083k3549L6500p3291k29049p0736l00764j79206n9115j38436j06951
$$ plain form
17638 929591 981729 960178 1013777 954969 913686 897865 833890 706671 735530 758578 719641
17627 719641 623220 632125 756369 922004 903951 877700 853130 784855 720675 730899 805325
17616 805325 843599 855217 895136 910795 818505 767030 690321 526162 474319 565884 653052
17605 653052 761029 908316 1040841 1035125 968618 1135862 1142246 1095477 1058256 902298 807878
17594 807878 715298 749791 943381 999544 885211 858252 993934 1160554 1213585 1125844 1019176
17583 1019176 1019776 922018 793823 778789 809685 840777 883823 967193 1097051 1223646 1255414
17572 1255414 1164207 1207006 1225398 1309867 1356170 1374628 1226128 1375103 1521941 1517840 1482316
17561 1482316 1537696 1756895 1886859 1835377 1846001 2056292 2305206 2507108 2677670 2847155
$$ packed form
17638I29591N2138k1551N3599n8808m1283j5821o3975j27219K8859K3048l8937
17627G19641r6421Q905J24244J65635j8053k6251k4570o8275o4180J0224P4426
17616H05325L8274J1618L9919J5659r2290n1475p6709j64159n1843R1565Q7168
17605F53052J07977J47287J32525n716o6507J67244O384m6769l7221j55958r4420
17594H07878r2580L4493J93590N6163j14333k6959J35682J66620N3031q7741j06668
17583A019176O00r7758j28195j5034L0896L1092M3046Q3370J29858J26595L1768
17572A255414r1207M2799J8392Q4469M6303J8458j48500J48975J46838m101l5524
17561A482316N5380K19199J29964n1482J0624K10291K48914K01902J70562J69485
$$ plain form
17551 2847155 3011488 3296330 3660953 4006914 4430515 4965628 5334738 5463127 5803493
17542 5803493 6376792 7087774 7816570 8789021 10017602 11489087 13187401 15430525 18543913
17533 18543913 22849425 28950498 37998092 52135506 73322462 96221332 107209147
17526 107209147 104455184 95426548 88846489 92807569 105177954 111162049 103424302 87977225
17518 87977225 71242703 59945341 56489271 60835363 73205006 90061766 99434144
17511 99434144 96661273 87555107 79238762 79154137 87524425 92683617 85963218 71008018
17503 71008018 52931961 37978984 28182588 22036103 18070627 15475049 13811460 12614589
17495 12614589 11756385 11077468 10520993 10077535 10071357 10425882 10923048 11417231 12041828 12806992
$$ packed form
17551B847155J64333K84842L64623L45961M23601N35113L69110J28389L40366
17542E803493N73299P10982P28796R72451J228581J471485J698314K243124L113388
17533A8543913M305512O101073R047594J4137414K1186956K2898870J0987815
17526A07209147k753963r028636o580059L961080J2370385N984095p737747j5447077
17518H7977225j6734522j1297362l456070M346092J2369643J6856760R372378
17511I9434144k772871r106166q316345q4625Q370288N159192o720399j4955200
17503G1008018j8076057j4952977r796396o146485l965476k595578j663589j196871
17495A2614589q58204o78917n56475m43458o178L54525M97166M94183O24597P65164
$$ plain form
17485 12806992 14009448 15887229 18462704 22320041 27702084 35738534 48449403 67470839
17477 67470839 86749478 93844956 89539611 80696689 75285679 79693830 90424791 94409030
17469 94409030 87114787 73501893 59483457 50738987 48722725 53566586 65846197 81025385
17461 81025385 87281348 83100980 73978359 66594383 67510631 75334980 78899917 71817017
17453 71817017 58007884 42315863 29722319 21476816 16248305 12793524 10470016 8953540
17445 8953540 7911614 7199210 6802373 6288735 5579972 4991468 4605518 4178533 3739600
17436 3739600 3454078 3096628 2758052 2631626 2526762 2368992 2293606 2256439 2192717 1937619
17426 1937619 1692763 1531383 1559181 1530502 1448337 1422536 1261856 1128389 1001782 871484
$$ packed form
17485A2806992J202456J877781K575475L857337N382043Q036450J2710869J9021436
17477F7470839J9278639P095478m305345q842922n411010M408151J0730961L984239
17469I4409030p294243j3612894j4018436q744470k016262M843861J2279611J5179188
17461H1025385O255963m180368r122621p383976R16248P824349L564937p082900
17453G1817017j3809133j5692021j2593544q245503n228511l454781k323508j516476
17445H953540j041926p12404l96837n13638p08763n88504l85950m26985m38933
17436C739600k85522l57450l38576j26426j04864j57770p5386l7167o3722k55098
17426A937619k44856j61380K7798k8679q2165k5801j60680j33467j26607j30298
$$ plain form
17416 871484 933733 837545 724354 816885 979365 989156 939590 822652 852618 800139 704650
17405 704650 658667 630523 710093 628574 536018 388928 302807 232314 198780 242823 364480
17394 364480 396602 322988 369393 358593 289158 327756 367810 273059 213641 250198 268455
17383 268455 237278 218850 179385 183065 249937 346746 415607 510992 521171 459893 375330 295709
17371 295709 309261 415459 383706 208305 117655 145666 261576 307224 254364 196656 207361
17360 207361 243832 176614 173524 203688 211061 289013 264472 138427 87379 103765 190640 323005
17348 323005 333830 330032 380423 335392 218027 105874 14587 -1419 -12195 23220 129861
17337 129861 197848 117441 172461 220906 215505 44281 71430 146681 98933 9 116031
$$ packed form
17416H71484O2249r6188j13191R2531J62480R791m9566j16938K9966n2479r5489
17405G04650m5983k8144P9570q1519r2556j47090q6121p0493l3534M4043J21657
17394C64480L2122p3614M6405j0800o9435L8598M0054r4751n9418L6557J8257
17383B68455l1177j8428l9465L680O6872R6809O8861R5385J0179o1278q4563p9621
17371B95709J3552J06198l1753j75401r0650K8011J15910M5648n2860n7708J0705
17360B07361L6471o7218l090L0164P373P7952k4541j26045n1048J6386Q6875J32365
17348C23005J0825l798N0391m5031j17365j12153r1287j6006j0776L5415J06641
17337A29861O7987q0407N5020M8445n401j71224K7149P5251m7748r8924J16022
$$ plain form
17326 116031 330414 380653 538140 726340 693227 561642 500294 437689 354652 498717
17316 498717 657917 721488 688982 663236 707490 730522 675158 555506 569050 539796 525402
17305 525402 590844 494188 493898 364061 365816 259783 166086 153518 148451 97983 101768 127620
17293 127620 156651 151938 112358 179764 152613 83223 126923 217037 286000 263035 198677 182239
17281 182239 279298 450442 475598 363006 414598 607691 730806 873572 993604 950816
17271 950816 929340 975010 1146572 1463337 1682560 1674567 1597099 1422320 1190897 1154724 1169409
17260 1169409 1116409 1162341 1327296 1695550 2142489 2349434 2652527 3443515 4989851 7032722
17250 7032722 8803534 9432512 9009905 7707949 6119925 4677980 3513582 2738471 2198018
$$ packed form
17326A16031K14383N0239J57487J88200l3113j31585o1348o2605q3037J44065
17316D98717J59200O3571l2506k5746M4254K3032n5364j19652J3544k9254j4394
17305E25402O5442r6656k90j29837J755j06033r3697j2568n067n0468L785K5852
17293A27620K9031m713l9580O7406k7151o9390M3700R0114O8963k2965o4358j6438
17281A82239R7059J71144K5156j12592N1592J93093J23115J42766J20032m2788
17271I50816k1476M5670J71562L16765K19223p993p7468j74779k31423l6173J4685
17260A169409n3000M5932J64955L68254M46939K06945L03093P90988J546336K042871
17250G032722J770812O28978m22607j301956j588024j441945j164398p75111n40453
$$ plain form
17241 2198018 2085176 2136351 2292852 2586854 2733353 2801346 2635241 2184613 1561934 1060340
17231 1060340 731118 532772 474118 403782 299655 298057 262395 307756 448994 584533
17221 584533 644370 631269 708999 956294 1115721 1367833 1525419 1513386 1510163 1482281 1513882
17210 1513882 1942790 2431648 3000403 3544921 3649631 3495597 3297111 3118212 3080667 3030364
17200 3030364 3147496 3639344 4386320 5550239 6838801 8161715 9151380 8907703 7615978
17191 7615978 5917569 4271916 3072697 2307716 1838670 1474448 1123120 795448 690667
17182 690667 600915 668504 794840 830076 776861 779315 836056 747950 587116 463138 372625
17171 372625 294267 227400 195288 309174 236601 173152 73741 60640 69832 10115 30779
$$ packed form
17241B198018j12842N1175J56501K94002J46499O7993j66105m50628o22679n01594
17231A060340l29222j98346n8654p0336j04127j598l5662M5361J41238J35539
17221E84533N9837j3101P7730K47295J59427K52112J57586j2033l223k7882L1601
17210A513882M28908M88858N68755N44518J04710j54034j98486j78899l7545n0303
17200C030364J17132M91848P46976J163919J288562J322914R89665k43677j291725
17191G615978j698409j645653j199219p64981m69046l64222l51328l27672j04781
17182F90667q9752O7589J26336L5236n3215K454N6741q8106j60834j23978r0513
17171C72625p8358o6867l2112J13886p2573o3449r9411j3101R192n9717K0664
$$ plain form
17160 30779 54853 23873 113984 46384 -55560 -74180 38303 -45216 -71066 -31530 -132507
17149 -132507 -124095 59250 144520 103696 119769 -1657 -31146 -2973 122437 66005 10975
17138 10975 18580 -111558 -92502 -101997 -146072 -95137 -47234 -10852 166374 260069 202764 77837
17126 77837 -34441 -93624 -138230 7272 109105 111535 105009 80693 3180 -15530 6089
17115 6089 24223 -108 -118693 -218572 -137834 -34178 55577 -3076 -18873 50923 120981
17104 120981 174346 103923 114499 62825 18752 16151 88606 131716 86647 -24784 -20005 -10045
17092 -10045 -48733 -50638 -60281 160929 297202 306046 224869 171645 100064 41540 -38348 87196
17080 87196 185837 156557 195069 197913 -21324 -116418 -19061 -13507 -128091 -189804 -116035 -131426
$$ packed form
17160C0779K4074l0980R0111o7600j01944j8620J12483q3519k5850L9536j00977
17149a32507Q412J83345Q5270m0824J6073j21426k9489K8173J25410n6432n5030
17138A0975P605j30138J9056r495m4075N0935M7903L6382J77226R3695n7305j24927
17126G7837j12278n9183m4606J45502J01833K430o526k4316p7513j8710K1619
17115F089J8134k4331j18585r9879Q0738J03656Q9755n8653j5797O9796P0058
17104A20981N3365p0423J0576n1674m4073k601P2455M3110m5069j11431M779R960
17092a0045l8688j905r643K21210J36273Q844q1177n3224p1581n8524p9888J25544
17080H7196R8641k9280L8512K844k19237r5094R7357N554j14584o1713P3769j5391
$$ plain form
17068 -131426 -152591 16878 90434 120434 238090 166309 24753 -4609 -45026 -107251 -275535
17057 -275535 -280155 -110933 -162147 -235097 -105304 -36239 -90287 -72702 64188 141212 159425
17046 159425 170246 123875 -1377 -30225 -113407 -106457 -44179 2503 -88223 -57463 -44999
17035 -44999 -105092 -137043 -55570 10773 55630 44003 154899 212458 300298 420567 527733
17024 527733 480704 394127 442647 421134 451600 491740 570727 517033 457759 387426 342111
17013 342111 135979 22454 110565 204477 412565 534374 569361 557144 479269 454098 477514
17002 477514 387926 290028 149335 87043 105343 70708 72237 77915 -18121 -69062 -45563 92113
16990 92113 192081 90286 -40264 -33335 52224 162550 100825 50040 36421 171070 160254
$$ packed form
17068a31426k1165J69469P3556L0000J17656p1781j41556k9362m0417o2225j68284
17057b75535m620J69222n1214p2950J29793O9065n4048J7585J36890P7024J8213
17046A59425J0821m6371j25252k8848q3182O950O2278M6682r0726L0760J2464
17035d4999o0093l1951Q1473O6343M4857j1627J10896N7559Q7840J20269J07166
17024E27733m7029q6577M8520k1513L0466M0140P8987n3694n9274p0333m5315
17013C42111k06132j13525Q8111R3912K08088J21809L4987j2217p7875k5171K3416
17002D77514q9588r7898j40693o2292J8300l4635J529N678r6036n0941K3499J37676
16990I2113R9968j01795j30550O929Q5559J10326o1725n0785j3619J34649j0816
$$ plain form
16979 160254 201665 245548 205436 218542 335139 397492 493113 520154 495685 494956 587515 577694
16967 577694 421390 336304 252377 210446 148097 195463 245760 346158 382388 365540 553405
16956 553405 579726 380379 375540 443522 425719 326689 291443 299100 212275 111032 65326
16945 65326 179428 122810 -15461 -47707 -31310 23442 47234 3682 -28459 -8558 -66892
16934 -66892 -107668 -205125 -271037 -145042 -146515 -111921 -127380 -9330 -19280 -27950 24314 21871
16922 21871 -82387 -174813 -145924 -94682 -8462 -84828 -119543 -123985 -183355 -182732 -300391 -278106
16910 -278106 -117871 -18104 -17837 30135 20427 -6947 -33888 -91741 -247740 -147099 -32802
16899 -32802 9033 -100948 -272790 -305987 -193017 -205854 -207749 -253001 -282960 -190300 -153114
$$ packed form
16979A60254M1411M3883m0112J3106J16597O2353R5621K7041k4469p29R2559r821
16967E77694j56304q5086q3927m1931o2349M7366N0297J00398L6230j6848J87865
16956E53405K6321j99347m839O7982j7803r9030l5246P657q6825j01243m5706
16945F5326J14102n6618j38271l2246J6397N4752K3792m3552l2141J9901n8334
16934f6892m0776r7457o5912J25995j473L4594j5459J18050r950q670N2264k443
16922B1871j04258r2426K8889N1242Q6220p6366l4715m442n9370O23j17659K2285
16910b78106J60235R9767K67M7972r708k7374k6941n7853j55999J00641J14297
16899c2802M1835j09981j71842l3197J12970j2837j895m5252k9959R2660L7186
$$ plain form
16888 -153114 -152005 -156909 -200656 -223240 -132651 -146434 -160746 -15815 44454 19043 -8272 -11041
16876 -11041 -31520 -56886 -90281 -34100 -16540 -52113 -32482 -15070 -15484 75733 106501 169626
16864 169626 130911 -10874 -199563 -279544 -170632 -249326 -246463 -219019 -209614 -67832 31689
16853 31689 -2855 100980 242272 163980 53763 -70223 -53924 -33522 22945 -111513 -220369
16842 -220369 -280726 -273891 -215215 -238369 -247902 -71575 32250 80105 83907 64206 2563 -46151
16830 -46151 -2789 53381 14537 -95906 55833 3556 17119 94375 164245 111395 -112553
16819 -112553 -98178 -62851 -147525 -103924 6002 -54797 -155399 -107220 -14377 -9210 -93434
16808 -93434 -136853 -88997 -47372 -73098 -167535 -138158 -60376 -105874 -111378 43743 86841 11129
$$ packed form
16888a53114J109m904m3747k2584R0589j3783j4312J44931O0269k5411k7315k769
16876a1041k0479k5366l3395N6181J7560l5573J9631J7412m14R1217L0768O3125
16864A69626l8715j41785j88689p9981J08912p8694K863K7444R405J41782R9521
16853C1689l4544J03835J41292p8292j10217j23986J6299K0402N6467j34458j08856
16842b20369o0357O835N8676k3154r533J76327J03825M7855L802j9701o1643m8714
16830d6151M3362N6170l8844j10443J51739n2277J3563P7256O9870n2850k23948
16819a12553J4375L5327q4674M3601J09926o0799j00602M8179R2843N167q4224
16808i3434m3419M7856M1625k5726r4437K9377P7782m5498n504J55121M3098p5712
$$ plain form
16796 11129 -91961 -166256 -165041 -85869 -35814 -119769 -100478 -15999 -93958 -183856 -139938 -87689
16784 -87689 -173529 -229680 -180711 -22051 69924 -54564 -145907 -65056 82428 17841 -76584
16773 -76584 -76541 -53178 -108145 -76211 44094 3277 30381 9551 66512 21617 -61131 -111345
16761 -111345 -8868 29011 5415 1202 14401 44612 645 -24191 39345 -33158 -106429
16750 -106429 -133525 -94015 -20180 -53288 -6546 -6424 -47107 23685 -35391 -143593 -34345
16739 -34345 118249 269838 373598 307279 267719 153420 -14415 -188233 -172167 -60335
16729 -60335 34462 29845 32237 15499 42051 -43886 -124025 -73349 -51096 -15895 -42390 3165
16717 3165 34339 128735 232022 85696 -60642 -44029 -31200 -82127 -114425 -98688 -89679
$$ packed form
16796A1129j03090p4295J215P9172N0055q3955J9291Q4479p7959q9898M3918N2249
16784h7689q5840n6151M8969J58660R1975j24488r1343Q0851J47484o4587r4425
16773g6584M3K3363n4967L1934J20305m0817K7104k0830N6961m4895q2748n0214
16761a11345J02477L7879k3596m213J3199L0211m3967k4836O3536p2503p3271
16750a06429k7096L9510P3835l3108M6742J22m0683P0792n9076j08202J09248
16739c4345J52594J51589J03760o6319l9560j14299j67835j73818J6066J11832
16729f0335R4797m617K392j6738K6552q5937q0139N0676K2253L5201k6495M5555
16717C165L1174R4396J03287j46326j46338J6613J2829n0927l2298J5737R009
$$ plain form
16706 -89679 -2455 2816 -85505 -137528 -162977 -152613 -184597 -153036 -255479 -293910 -200953 -106194
16694 -106194 52288 139119 144054 175069 165300 148882 118814 62526 112675 -35933 -136871
16683 -136871 -126457 -100710 -40139 -17712 -126068 -33479 10317 -27093 -7247 -1546 -89611
16672 -89611 -100702 -16761 87210 58825 24971 -91975 -113851 -177343 -192262 -103295 -48649
16661 -48649 -177735 -134608 2034 -59745 -86836 44131 -21847 -59215 -82451 -131244 -101461
16650 -101461 -191794 -253611 -372265 -260725 -181254 -161311 -110620 -57903 -19372 -76338 -130345
16639 -130345 -83862 -25918 -39193 -114040 -88250 -57219 -92912 -45530 12184 -18405 -108608
16628 -108608 -70670 -45244 -2650 53304 20337 110753 238894 259935 268543 149445 53920
$$ packed form
16706h9679Q7224N271q8321n2023k5449J0364l1984L1561j02443l8431R2957R4759
16694a06194J58482Q6831M935L1015r769j6418l0068n6288N0149j48608j00938
16683a36871J0414K5747O0571K2427j08356R2589M3796l7410J9846N701q8065
16672h9611j1091Q3941J03971k8385l3854j16946k1876o3492j4919Q8967N4646
16661d8649j29086M3127J36642o1779k7091J30967o5978l7368k3236m8793K9783
16650a01461r0333o1817j18654J11540P9471J9943N0691N2717L8531n6966n4007
16639a30345M6483N7944j3275p4847K5790L1031l5693M7382N7714l0589r0203
16628a08608L7938K5426M2594N5954l2967R0416J28141K1041Q608j19098r5525
$$ plain form
16617 53920 -34388 -30075 104583 47928 29513 61296 11222 14719 -34524 -38555 152450 219484
16605 219484 243182 165680 88983 82304 39036 -11735 60782 68305 134663 122070 34522 -52952
16593 -52952 -47593 -60163 -152254 -49272 -41829 -74247 55729 148339 102473 78779 64187 48121
16581 48121 -62676 -117817 -152712 -124210 -47696 -39797 -89392 -38768 -10966 97001 45607
16570 45607 -27158 -38702 70838 159173 100928 -3777 56577 139025 118177 -42841 -62953
16559 -62953 39919 131642 18206 -41768 -12669 -50257 -128646 -198142 -241942 -260983 -130799
16548 -130799 -170319 -188242 -188466 -126596 -249278 -413418 -330274 -253443 -311810 -275500 -241331
16537 -241331 -115044 -72610 -58419 -40891 -21866 45125 60712 -54076 -10835 151396 198723
$$ packed form
16617E3920q8308M313J34658n6655j8415L1783n0074L497m9243m031J91005O7034
16605B19484K3698p7502p6697o679m3268n0771P2517P523O6358j2593q7548q7474
16593e2952N359j2570r2091J02982P443l2418J29976R2610m5866k3694j4592j6066
16581D8121j10797n5141l4895K8502P6514P899m9595N0624K7802J07967n1394
16570D5607p2765j1544J09540Q8335n8245j04705O0354Q2448k0848j61018k0112
16559f2953J02872R1723j13436n9974K9099l7588p8389o9496m3800j9041J30184
16548a30799l9520j7923k24O1870j22682j64140Q3144P6831n8367L6310L4169
16537b41331J26287M2434J4191J7528J9025O6991J5587j14788M3241J62231M7327
$$ plain form
16526 198723 213979 186451 78986 77742 85804 3391 -41387 53319 53101 -82958 -90707 5838
16514 5838 45469 64793 80504 70068 -37046 -60085 2582 2570 30516 30713 33756 -75085 -118415
16501 -118415 -115648 -32720 33757 42482 138988 160042 62538 -32297 20885 -62653 -56925 -18673
16489 -18673 -37487 -53868 -125130 -28203 20134 7359 -31660 -58109 -56389 -180236 -149049 -45521
16477 -45521 5289 -40313 -102025 21090 84709 102142 47595 -66730 -70214 10958 135969
16466 135969 164229 92197 44835 -86706 -127296 -257363 -203799 -155103 -39202 -57900 -165042
16455 -165042 -213147 -153887 -216199 -251843 -185442 -20318 118538 23599 -15287 -44309 398
16444 398 2278 111963 145233 66347 -20900 -74860 -39278 14083 -869 16582 106316 179196
$$ packed form
16526A98723J5256k7528j07465j244Q062q2413m4778R4706k18j36059p749R6545
16514E838L9631J9324J5711j0436j07114k3039O2667j2K7946J97L043j08841m3330
16501a18415K767Q2928O6477Q725R6506K1054r7504r4835N3182q3538N728L8252
16489a8673j8814j6381p1262R6927M8337j2775l9019k6449J720j23847L1187J03528
16477d5521N0810m5602o1712J23115O3619J7433n4547j14325l484Q1172J25011
16466A35969K8260p2032m7362j31541m0590j30067N3564M8696J15901j8698j07142
16455a65042m8105N9260o2312l5644O6401J65124J38856r4939l8886k9022M4707
16444C98J880J09685L3270p8886q7247n3960L5582N3361j4952J7451Q9734P2880
$$ plain form
16432 179196 98819 -22864 -20770 -71451 -59894 -376 6900 -143450 -145072 -39921 61331
16421 61331 43157 57716 -2542 -88259 -81168 -49511 -91872 -174540 -71200 4707 -48594 -106525
16409 -106525 -179618 -198016 -159160 -6758 12172 -62927 -41597 -45225 -76397 -44872 -54209 -148521
16397 -148521 -184324 -212316 -215141 -104334 -134590 -196255 -90104 -46265 -21916 -72684 -69170
16386 -69170 17119 60167 68722 -55596 -146630 -189859 -222962 -242053 -232828 -268328 -275460 -217995
16374 -217995 -157662 -85368 -88200 -86099 -146419 -21245 21569 115576 135835 60637 -108426
16363 -108426 -100552 85292 132932 103394 114279 42095 94228 23487 -143687 -169273 -25743
16352 -25743 50044 79089 -54947 -87693 -55011 45702 81840 68445 -20698 -92609 -164103
$$ packed form
16432A79196q0377j21683K094n0681J1557N9518P276j50350j622J05151J01252
16421F1331j8174J4559o0258q5717P091L1657m2361q2668J03340P5907n3301n7931
16409a06525p3093j8398L8856J52402J8930p5099K1330l628l1172L1525r337r4312
16397a48521l5803k7992k825J10807l0256o1665J06151M3839K4349n0768L514
16386f9170Q6289M3048Q555j24318r1034m3229l3103j9091R225l5500p132N7465
16374b17995O0333P2294k832K101o0320J25174M2814R4007K0259p5198j69063
16363a08426P874J85844M7640k9538J0885p2184N2133p0741j67174k5586J43530
16352b5743P5787K9045j34036l2746L2682J00713L6138j3395q9143p1911p1494
$$ plain form
16341 -164103 -160417 -148055 -25212 -24856 -121118 -133074 -82387 12827 23117 71554 128402 137762
16329 137762 109401 186998 250824 130029 -17498 -5819 -36227 -8402 25230 201816 222421
16318 222421 203471 221022 106482 -11252 -64447 -24774 -162379 -236136 -203561 -54201 -2724
16307 -2724 -67468 -133572 -135729 -23849 -45031 -102074 -88746 -63959 -82123 -54892 -95484 -98231
16295 -98231 -98010 19636 -59508 37856 28868 -12753 -131353 -231020 -200066 -122574 -142890 -160929
16283 -160929 -142977 -182154 -160026 -81664 -50174 -50302 -104040 -62360 -41069 -57932 -152220 -272011
16271 -272011 -251749 -160903 -167412 -254278 -217429 -100660 -175397 -209080 -158647 -113487 -104699 -147127
16259 -147127 -42783 -18772 -44777 -67896 -100467 433 2025 -23404 -47400 -61448 -169290
$$ packed form
16341a64103L686J2362J22843L56r6262j1956N0687R5214J0290M8437N6848R360
16329A37762k8361P7597O3826j20795j47527J1679l0408K7825L3632J76586K0605
16318B22421j8950J7551j14540j17734n3195L9673j37605p3757L2575J49360N1477
16307b724o4744o6104k157J11880k1182n7043J3328K4787j8164K7231m0592k747
16295i8231K21J17646p9144R7364q988m1621j18600r9667L0954P7492k0316j8039
16283a60929J7952l9177K2128P8362L1490j28n3738M1680K1291j6863r4288j19791
16271b72011K0262R0846o509q6866L6849J16769p4737l3683N0433M5160Q788m2428
16259a47127J04344K4011k6005k3119l2571J00900J592k5429k3996j4048j07842
$$ plain form
16248 -169290 -205111 -93631 -75341 -46629 48418 -13150 -57189 -124328 -152581 -126593 -195569
16237 -195569 -231780 -249296 -159980 -119236 -111514 -158299 -78690 35821 101733 51130 -52860
16226 -52860 -9549 -11637 -4810 -34051 -46363 21383 105850 123559 23309 -34451 -133329 -156744
16214 -156744 -66722 2402 34780 -90982 -22985 63002 -16943 -84670 -36891 50378 94323
16203 94323 144050 45504 -10634 41775 110028 -5972 -93470 -84723 -54734 -117111 -104633 -85459
16191 -85459 -67758 -20037 37694 7164 -75673 -146845 -50708 22641 -71541 -85094 -82853 -66075
16179 -66075 -64339 -121356 -171873 -238101 -120581 30568 5198 -32945 -53022 -13900 -86128
16168 -86128 -91770 -156867 -26290 83579 153593 119877 77263 -14590 -125557 -151500 -110005
$$ packed form
16248a69290l5821J11480J8290K8712R5047o1568m4039o7139k8253K5988o8976
16237a95569l6211j7516Q9316M0744P722m6785P9609J14511O5912n0603j03990
16226e2860M3311k088O827k9241j2312O7746Q4467J7709j00250n7760r8878k3415
16214a56744R0022O9124L2378j25762O7997Q5987p9945o7727M7779Q7269M3945
16203I4323M9727r8546n6138N2409O8253j16000q7498Q747K9989o2377J2478J9174
16191h5459J7701M7721N7731l0530q2837p1172R6137P3349r4182j3553K241J6778
16179f6075J736n7017n0517o6228J17520J51149k5370l8143k0077L9122p2228
16168h6128n642o5097J30577J09869P0014l3716m2614r1853j10967k5943M1495
$$ plain form
16157 -110005 -6445 12604 -60808 -22025 -98802 -89073 -153348 -167888 -129022 40630 134145
16146 134145 39283 -30214 -21675 -14375 -96525 -123264 -127753 -89903 -125457 -137440 -61031 -203282
16134 -203282 -242944 -209105 -138263 -75220 -69708 17562 -38509 46386 144210 251506 172511
16123 172511 146993 88162 -4399 -30717 -30516 -14666 27757 69991 19312 59920 62988 52076
16111 52076 62297 54306 -58600 -46505 -1602 -48354 -165761 -262711 -256440 -277469 -351262 -254844
16099 -254844 -144487 -1909 -22159 -110343 6795 98849 2694 -56810 -99079 91356 158745
16088 158745 263842 178655 -9232 -182006 -287239 -176284 -109154 -226174 -299062 -182116
16078 -182116 52617 119774 48416 86881 152932 195233 211101 107457 30565 65967 -145310
$$ packed form
16157a10005J03560J9049p3412L8783p6777R729o4275j4540L8866J69652R3515
16146A34145r4862o9497Q539P300q2150k6739m489L7850l5554j1983P6409j42251
16134b03282l9662L3839P0842O3043N512Q7270n6071Q4895R7824J07296p8995
16123A72511k5518n8831r2561k6318K01J5850M2423M2234n0679M0608L068j0912
16111E2076J0221p991j12906J2095M4903m6752j17407r6950O271k1029p3793R6418
16099b54844J10357J42578k0250q8184J17138R2054r6155n9504m2269J90435O7389
16088A58745J05097q5187j87887j72774j05233J10955O7130j17020p2888J16946
16078a82116K34733O7157p1358L8465O6051M2301J5868j03644p6892L5402k11277
$$ plain form
16067 -145310 -218147 -250052 -206929 -49828 -85424 -148434 -225075 -238602 -184970 -109975 -6947
16056 -6947 7742 -72393 -97462 -54392 -73164 -180371 -227074 -140364 -117814 -41594 -35104 -78192
16044 -78192 -22275 28791 30685 60205 8214 48879 97988 43231 -107163 -163277 -116858 -49220
16032 -49220 93804 -3331 -88198 -18625 32167 83266 55574 63546 -46659 -101811 -122979
16021 -122979 -99942 -95657 -74254 -47102 -92122 -120925 20782 86368 68470 41012 -22748
16010 -22748 -125319 -143845 -133079 -165515 -125539 -17206 66478 37848 12911 83012 121564
15999 121564 114397 130358 114366 -8227 -46911 23308 -427 20314 -37666 -84422 -133648
15988 -133648 -357329 -354650 -223547 -122957 -131647 -113641 -130606 -174030 -177282 -125961 -129573 -31673
$$ packed form
16067a45310p2837l1905M3123J57101l5596o3010p6641j3527N3632P4995J03028
16056f947J4689q0135k5069M3070j8772j07207m6703Q6710K2550P6220O490m3088
16044g8192N5917N1066J894K9520n1991M0665M9109n4757j50394n6114M6419O7638
16032d9220J43024r7135q4867O9573N0792N1099k7692P972j10205n5152k1168
16021a22979K3037M285K1403K7152m5020k8803J41707O5586j7898k7458o3760
16010b2748j02571j8526J0766l2436L9976J08333Q3684k8630k4937P0101L8552
15999A21564p167J5961j5992j22593l8684P0219k3735K0741n7980m6756m9226
15988a33648k23681K679J31103J00590q690J8006j6965m3424l252N1321l612R7900
$$ plain form
15976 -31673 -5194 -97222 -94976 -122539 -206886 -275621 -280824 -272955 -239770 -156819 -133891 -149753
15964 -149753 -162333 -110795 -75690 -77222 12161 9758 -16431 15508 -240 -161816 -241408 -274593
15952 -274593 -286959 -198505 -233965 -167686 -173162 -198463 -195734 -160862 -81448 -79952 -89444 -54189
15940 -54189 -66632 -66962 -94437 -181464 -386070 -310761 -116807 33392 38611 -35801 -23150 -21500
15928 -21500 -130179 -235212 -113685 160243 207418 140923 37424 83205 82523 39451 -25932
15917 -25932 -68325 -166496 -224495 -298879 -293203 -232895 -32746 37583 87682 18012 -155523
15906 -155523 -237660 -129366 -55208 -59922 60855 -8816 -3846 62017 -92642 -108379 -73145
15895 -73145 -108686 -119167 -111816 33590 135751 -563 -121290 -150347 -145148 -53581 -11055
$$ packed form
15976c1673K6479r2028K246k7563q4347o8735n203P869L3185Q2951K2928j5862
15964a49753j2580N1538L5105j532Q9383k403k6189L1939j5748j61576p9592l3185
15952b74593j2366Q8454l5460O6279n476k5301K729L4872P9414J496r492L5255
15940e4189j2443l30k7475q7027k04606P5309J93954J50199N219p4412J2651J650
15928b1500j08679j05033J21527K73928M7175o6495j03499M5781o82m3072o5383
15917b5932m2393r8171n7999p4384N676O0308K00149P0329N0099o9670j73535
15906a55523q2137J08294P4158m714J20777o9671M970O5863j54659j5737L5234
15895g3145l5541j0481P351J45406J02161j36314j20727k9057N199R1567M2526
$$ plain form
15884 -11055 -7805 -13737 -43704 34314 147645 110994 30024 -59849 23223 -14820 -29572 -140672
15872 -140672 -184557 -70788 8108 77265 161880 109057 44886 -24619 -134597 -123653 -162624
15861 -162624 -136204 -70586 -55620 -118975 -121812 -181429 -117111 -93220 -60539 -173755 -301882
15850 -301882 -311951 -293114 -270423 -291024 -260178 -117824 -81263 -128692 28709 187120 61164
15839 61164 -47411 -94586 -137152 -167290 -201815 -114679 40007 67886 -70324 -59167 -27399
15828 -27399 -29236 -22315 -27125 -142531 -91214 -18105 -64484 -163004 -158948 -148741 -71249 -52152
15816 -52152 -38867 -169956 -160234 -10012 105578 71948 24950 -77617 -145498 -99649 4255
15805 4255 53149 48921 25542 -54665 -191079 -265831 -144354 -55643 -79864 -98465 -212078
$$ packed form
15884a1055L250n932k9967P8018J13331l6651q0970q9873Q3072l8043j4752j11100
15872a40672m3885J13769P8896O9157Q4615n2823o4171o9505j09978J0944l8971
15861a62624K6420O5618J4966o3355k837n9617O4318K3891L2681j13216j28127
15850c01882j0069J8837K2691k0601L0846J42354L6561m7429J57401J58411j25956
15839F1164j08575m7175m2566l0138l4525Q7136J54686K7879j38210J1157L1768
15828b7399j837O921m810j15406N1317P3109m6379r8520M056J0207P7492J9097
15816e2152J3285j31089R722J50222J15590l3630m6998j02567o7881M5849J03904
15805D255M8894m228k3379q0207j36414p4752J21477Q8711k4221j8601j13613
$$ plain form
15794 -212078 -313646 -299436 -227521 -119582 15920 89503 41718 19477 -1222 -31072 -87527
15783 -87527 -90132 -178093 -181925 -190060 -171481 -95789 -50341 18119 82004 101089 66183 -126997
15771 -126997 -171894 -57345 89235 16000 -71934 67895 293881 351115 313755 218618 153370
15760 153370 120990 76401 24388 12714 70296 66764 -27396 -25208 51813 90077 -23598 -213884
15748 -213884 -276237 -237594 -157798 -116949 -75974 -20648 -65865 -72464 -60788 -68531 -150817 -252344
15736 -252344 -265202 -204972 -109705 -50004 -1840 49769 133091 5172 -177806 -262301 -163880
15725 -163880 -77794 -10108 -60581 -112566 -121725 -126917 -165195 -165238 -35688 -96600 6303 37414
15713 37414 -2379 -33715 -25908 -89365 -102357 -120851 -90844 -149099 -113389 -175582 -220450 -127177
$$ packed form
15794b12078j01568J4210P1915J07939J35502P3583m7785k2241k0699k9850n6455
15783h7527k605q7961l832q135J8579P5692M5448O8460O3885J9085l4906j93180
15771a26997m4897J14549J46580p3235q7934J39829K25986N7234l7360r5137o5248
15760A53370l2380m4589n2013j1674N7582l532r4160K188P7021L8264j13675j90286
15748b13884o2353L8643P9796M0849M0975N5326m5217o599J1676p743q2286j01527
15736b52344j2858O0230R5267N9701M8164N1609Q3322j27919j82978q4495R8421
15725a63880Q6086O7686n0473n1985r159n192l8278m3J29550o0912J02903L1111
15713C7414l9793l1336P807o3457j2992j8494L0007n8255L5710o2193m4868R3273
$$ plain form
15701 -127177 -122231 -190660 -175785 -168647 -123137 -23563 101620 56738 -18174 -145152 -174891
15690 -174891 -231359 -261639 -195268 -71791 53996 -17311 -103197 -133234 -73880 6492 34394
15679 34394 -28666 -96243 -125733 -202862 -233659 -286482 -304198 -132558 -30003 -93057 -56548
15668 -56548 -58269 -83176 -71432 4929 6893 -52209 -134775 -99880 -70294 -46079 -144179 -211305
15656 -211305 -107470 -45317 -81220 26627 71964 17985 22336 5467 29058 84763 122882
15645 122882 197454 200583 -8910 -168448 -129697 -14666 -37846 -91346 27853 121955 75485
15634 75485 113173 20797 -128392 -109075 45620 -9325 -125979 -74291 22902 10510 20269
15623 20269 -4585 -27017 63740 91063 6597 -15172 -55368 -90171 -1882 93915 120935 121457
$$ packed form
15701a27177M946o8429J4875P138M5510R9574J25183m4882p4912j26978k9739
15690a74891n6468l0280O6371J23477J25787p1307q5886l0037N9354Q0372K7902
15679C4394o3060o7577k9490p7129l0797n2823j7716J71640J02555o3054L6509
15668e6548j721k4907J1744P6361J964n9102q2566L4895K9586K4215r8100o7126
15656b11305J03835O2153l5903J07847M5337n3979M351j6869K3591N5705L8119
15645A22882P4572L129k09493j59538L8751J15031k3180n3500J19199R4102m6470
15634G5485L7688r2376j49189J9317J54695n4945j16654N1688R7193j2392R759
15623B0269k4854k2432R0757K7323q4466k1769m0196l4803Q8289R5797K7020N22
$$ plain form
15611 121457 118835 84860 18762 17603 -11467 -57055 -109463 -202235 -318769 -180091 -23656
15600 -23656 -95894 -119834 -21893 88879 120577 136248 36795 -52878 -96045 -179314 -240951
15589 -240951 -200440 -98665 28557 -29761 -191490 -220326 -43745 36020 45525 68120 137099
15578 137099 111505 36389 21645 192391 175396 97248 71775 48740 -34696 -102518 -100472
15567 -100472 -47058 -46394 -46750 3118 38460 -35600 -91685 -214382 -271745 -146330 -56648 -64122
15555 -64122 -110670 -116638 -135658 -63775 1321 57183 120710 -23614 -128372 -43200 -19657
15544 -19657 3569 -12916 -83821 -84628 -76859 -60250 -63981 25861 60526 51887 28394 123177 107620
15531 107620 38876 -118598 -150238 -35725 -52789 -52222 -177914 -190710 -105338 -87211 -175935
$$ packed form
15611A21457k622l3975o6098j159k9070m5588n2408r2772j16534J38678J56435
15600b3656p2238k3940R7941J10772L1698J5671r9453q9673m3167q3269o1637
15589b40951M0511J01775J27222n8318j61729k8836J76581P9765R505K2595O8979
15578A37099k5594p5116j4744J70746j6995p8148k5473k3035q3436o7822K046
15567a00472N3414O64l56M9868L5342p4060n6085j22697n7363J25415Q9682p474
15555f4122m6548n968j9020P1883O5096N5862O3527j44324j04758Q5172K3543
15544a9657K3226j6485p0905q07P769J6609l731Q9842L4665q639k3493R4783j5557
15531A07620o8744j57474l1640J14513j7064N67j25692j2796Q5372J8127q8724
$$ plain form
15520 -175935 -180349 -30722 18593 121670 65984 58735 73984 121264 33049 -20620 -55658
15509 -55658 -6208 20437 13072 -1145 45363 124541 47523 -51601 -5046 50133 57192 4374
15497 4374 -44466 -40537 10565 1713 -38298 -17198 27445 -104388 -136313 -17653 55797 -13555
15485 -13555 -163554 -205478 -269584 -187681 -125243 -114068 -124674 -119848 -109357 -18508 -95304 -144553
15473 -144553 -143392 -134073 -130563 -125189 -165525 -163382 -43871 38814 27342 56543 55979 -74315
15461 -74315 -10045 -70030 -128518 -31398 -46915 -96935 -500 -44046 -111963 -169592 -231348 -199946
15449 -199946 -160367 -43208 75719 61007 73745 -12378 -41330 60156 95673 26690 -84560
15438 -84560 28436 94534 37245 -464 2377 -5963 -84134 -96515 -113585 -186093 -105160 -87034
$$ packed form
15520a75935m414J49627M9315J03077n5686p249J5249M7280q8215n3669l5038
15509e5658M9450K6645p365j4217M6508P9178p7018r9124M6555N5179P059n2818
15497D374m8840L929N1102q852m0011K1100M4643j31833l1925J18660P3450o9352
15485a3555j49999m1924o4106Q1903O2438J1175j0606M826J0491R0849p6796m9249
15473a44553J161R319L510N374m0336K143J19511Q2685j1472K9201n64j30294
15461g4315O4270n9985n8488R7120j5517n0020R6435m3546o7917n7629o1756L1402
15449a99946L9579J17159J18927j4712J2738q6123k8952J01486L5517o8983j11250
15438h4560J12996O6098n7289l7709K841q340p8171j2381j7070p2508Q0933J8126
$$ plain form
15426 -87034 -138697 -137511 -63546 -161643 -164288 -111827 16411 83316 138301 69512 15912 8226
15414 8226 -13892 4052 23800 40566 104796 70610 49603 -33362 -49774 -45005 54801 47689
15402 47689 -53952 -150678 -124622 -90500 48439 122837 -8460 -9125 -5517 27769 -43323 -185910
15390 -185910 -250614 -115560 -3192 43317 5599 74903 2962 55651 35655 -90363 -83166
15379 -83166 -49012 27261 129189 45002 -26486 -39729 -87030 -139140 -82068 -41701 -72081
15368 -72081 -157018 -150317 -137587 -99882 -16641 3173 -17411 -23958 31528 -68794 -196875 -173517
15356 -173517 -152809 -130741 -78522 -12856 23800 81367 11510 30828 127766 142644 135765 159802
15344 159802 136286 87044 139364 140227 96899 86775 151421 79632 -10186 138616 130525 73648
$$ packed form
15426h7034n1663J186P3965r8097k645N2461J28238O6905N4985o8789n3600p686
15414H226k2118J7944J9748J6766O4230l4186k1007q2965j6412M769R9806p112
15402D7689j01641r6726K6056L4122J38939P4398j31297o65L608L3286p1092j42587
15390a85910o4704J35054J12368M6509l7718O9304p1941N2689j9996j26018P197
15379h3166L4154P6273J01928q4187p1488j3243m7301n2110N7072M0367l0380
15368g2081q4937O701J2730L7705Q3241J9814k0584o547N5486j00322j28081K3358
15356a73517K0708K2068N2219O5666L6656N7567o9857J9318R6938J4878o879K4037
15344A59802k3516m9242N2320Q63m3328j0124O4646p1789q9818J48802q091n6877
$$ plain form
15332 73648 119339 203090 199258 59452 28389 65846 54086 -54233 -93989 -49182 -6106
15321 -6106 76187 129244 184768 111863 6408 -110711 -55323 97814 127992 114154 148852
15310 148852 173231 54446 -103059 -186603 -140656 -98593 -51797 17780 -37051 -65076 -138810
15299 -138810 -135013 -101723 -873 41987 127067 -5271 -85122 -196353 -143990 -30084 49746
15288 49746 14609 -31745 -116034 -110718 -98306 -81873 -46877 1245 72680 110542 75931 39713
15276 39713 58618 93916 14940 -22032 -15578 7456 47744 46740 -21351 5325 -41940 -167045
15264 -167045 -173322 -137000 33147 2059 -69373 74874 101146 27061 137 9773 -22516
15253 -22516 30320 32301 22851 2657 86465 68602 47227 101387 -13822 -94655 -90416 -90127
$$ packed form
15332G3648M5691Q3751l832j39806l1063L7457j1760j08319l9756M4807M3076
15321f106Q2293N3057N5524p2905j05455j17119N5388J53137L0178j3838L4698
15310A48852K4379j18785j57505q3544M5947M2063M6796O9577n4831k8025p3734
15299a38810L797L3290J00850M2860Q5080j32338p9851j11231N2363J13906P9830
15288D9746l5137m6354q4289N316J2412J6433L4996M8122P1435L7862l4611l6218
15276C9713J8905L5298p8976l6972O454K3034M0288j004o8091K6676m7265j25105
15264a67045o277L6322J70147l1088p1432J44247K6272p4085k6924R636l2289
15253b2516N2836J981r450k0194Q3808j7863k1375N4160j15209q0833M239K89
$$ plain form
15241 -90127 2318 -17696 -45323 121682 104905 -59510 -183917 -118818 -37566 -266 47144
15230 47144 49174 -45733 -194850 -173346 40953 109063 48983 48584 -43855 -116342 -120814 13455
15218 13455 118400 124577 91478 19128 -58491 39324 70314 51441 95812 79643 112858 25176
15206 25176 -14219 -68328 -102469 -179799 -192425 -208920 -206394 -132246 53787 100977 26990 -22802
15194 -22802 -4478 70738 168929 194216 237697 218551 66208 -76928 -38795 146036 147485
15183 147485 88865 45789 -41256 2633 56297 33867 -15695 19288 72346 46286 38628 -34282
15171 -34282 -19829 -23974 -12354 -29529 -126047 -89400 32024 1197 -684 10935 104007 36409
15159 36409 -69227 -124063 -137600 -134710 -222951 -134002 5335 26925 -46636 19106 42679
$$ packed form
15241i0127R2445k0014k7627J67005j6777j64415j24407O5099Q1252L7300M7410
15230D7144K030r4907j49117K1504K14299O8110o0080l99r2439p2487m472J34269
15218A3455J04945O177l3099p2350p7619R7815L0990j8873M4371j6169L3215q7682
15206B5176l9395n4109l4141p7330j2626j6495K526P4148J86033M7190p3987m9792
15194b2802J8324P5216R8191K5287M3481j9146j52343j43136L8133J84831J449
15183A47485n8620m3076q7045M3889N3664k2430m9562L4983N3058k6060p658p2910
15171c4282J4453m145J1620j7175r6518L6647J21424l0827j881J1619R3072o7598
15159C6409j05636n4836j3537K890q8241Q8949J39337K1590p3561O5742K3573
$$ plain form
15148 42679 -39074 -30233 7662 -111274 -164850 -83394 -81714 -218446 -295618 -234884 -300787 -165836
15136 -165836 -178821 -84959 -53285 -12563 74794 65041 15143 72626 103309 100724 154208 85860
15124 85860 44196 -19387 22394 146324 46222 -67062 -134105 -214158 -130520 -95493 -182421
15113 -182421 -206685 -227430 -116109 -86568 -18722 12434 165337 204859 171136 144388 11437
15102 11437 93149 193109 161346 132633 92241 99019 10061 -33861 -13386 39031 -73672 -137177
15090 -137177 -49470 92508 63010 45344 40813 -89382 -111153 -80473 67071 93577 34285
15079 34285 69834 -72449 -162226 -113009 69569 109475 96859 14254 -64600 -74175 9947
15068 9947 -19594 -33736 -50074 -10579 -16717 37494 46709 65567 -19205 5099 135831 160802
$$ packed form
15148D2679q1753Q841L7895j18936n3576Q1456J680j36732p7172O0734o5903J34951
15136a65836j2985R3862L1674M0722Q7357r753m9898N7483L0683k585N3484o8348
15124H5860m1664o3583M1781J23930j00102j13284o7043q0053Q3638L5027q6928
15113a82421k4264k0745J11321K9541O7846L1156J52903L9522l3723k6748j32951
15102A1437Q1712R9960l1763k8713m0392O778q8958m3922K0475N2417j12703o3505
15090a37177Q7707J41978k9498j7666m531j30195k1771L0680J47544K6506n9292
15079C4285L5549j42283q9777M9217J82578L9906j2616q2605p8854r575Q4122
15068I947k9541j4142j6338L9495o138N4211R215J8858q4772K4304J30732K4971
$$ plain form
15056 160802 158129 12986 6894 77755 124121 45499 -63472 -74659 5626 10065 57142 46274
15044 46274 1150 -116603 -124465 -87011 -107101 -66633 18158 86550 -54683 -101975 -43253
15033 -43253 18048 21057 56092 98787 57534 -59376 -177587 -30333 75975 -4620 -44761
15022 -44761 -86243 -76173 -8448 38344 -54555 3277 92628 76208 9772 102368 161175 186795
15010 186795 108400 14435 -15932 -62522 -30390 118663 205875 224510 202019 76223 139080
14999 139080 208867 161707 84301 161170 126036 211333 305281 219026 122869 34241 -21372
14988 -21372 -61561 23712 9099 7186 -169451 -192670 -68230 57763 102285 158974 169924
14977 169924 103166 -73517 -85246 -58848 -16564 -13393 10957 -11453 -17069 -46562 -168162
$$ packed form
15056A60802k673j45143o092P0861M6366p8622j08971j1187Q0285M439M7077j0868
15044D6274m5124j17753p862L7454k0090M0468Q4791O8392j41233m7292N8722
15033d3253O1301L009L5035M2695m1253j16910j18211J47254J06308q0595m0141
15022d4761m1482J0070O7725M6792r2899N7832Q9351j6420o6436R2596N8807K5620
15010A86795p8395r3965l0367m6590L2132J49053Q7212J8635k2491j25796O2857
14999A39080O9787m7160p7406P6869l5134Q5297R3948q6255r6157q8628n5613
14988b1372m0189Q5273j4613j913j76637k3219J24440J25993M4522N6689J0950
14977A69924o6758j76683j1729K6398M2284L171K4350k2410n616k9493j21600
$$ plain form
14966 -168162 -51148 -89643 -61583 -167240 -242090 -199259 -182470 -145588 -38854 33231 43137
14955 43137 107206 155649 66885 79304 45040 -22902 -83480 -142978 -64821 -7457 54968 125585
14943 125585 51150 8804 28916 8603 -149103 -232406 -176483 -123765 -171754 -226542 -258885
14932 -258885 -250437 -199649 -15200 32315 -29398 55430 173123 168357 183275 87500 53164
14921 53164 23935 29101 -33749 -820 80113 145496 143452 97895 87024 -24053 -101152 -67552
14909 -67552 -5029 -18692 68990 205463 84239 -38650 -90768 -29550 24914 -28057 -110291
14898 -110291 -76207 50397 57561 -147169 -62761 10172 -6178 -59884 7191 22265 3407
14887 3407 18064 94805 14728 -107495 -80630 -127656 -124432 27405 129220 -30374 -139113
$$ packed form
14966a68162J17014l8495K8060j05657p4850M2831J6789L6882J06734P2085R906
14955D3137O4069M8443q8764J2419l4264o7942o0578n9498P8157N7364O2425P0617
14943A25585p4435m2346K0112k0313j57706q3303N5923N2718m7989n4788l2343
14932b58885Q448N0788J84449M7515o1713Q4828J17693m766J4918r5775l4336
14921E3164k9229N166o2850L2929Q0933O5383k044m5557j0871j11077p7099L3600
14909f7552O2523j3663Q7682J36473j21224j22889n2118O1218N4464n2971q2234
14898a10291L4084J26604P164k04730Q4408P2933j6350n3706O7075J5074j8858
14887C407J4657P6741q0077j22223K6865m7026L224J51837J01815j59594j08739
$$ plain form
14876 -139113 -78063 72727 41518 24034 28342 51176 92484 108618 151187 56359 -31826
14865 -31826 -154558 -58490 101524 81008 58149 91150 23943 44317 114413 52788 -62569
14854 -62569 -29699 194150 242354 143740 110268 86787 21276 -56891 -47319 28861 8691 133435
14842 133435 165607 91810 -43110 -141451 -112756 -75658 -46208 14092 90953 25951 -26274
14831 -26274 -16434 -16069 -49338 -124484 -129034 -67144 -96544 -2346 78270 81153 -45607 -58095
14819 -58095 -90120 -63444 -32456 -18221 -148960 -129895 -41816 60136 99871 67774 -46219
14808 -46219 12525 -483 -68949 13169 52445 41803 56877 88085 71816 -52358 -139194
14797 -139194 -55322 21250 119439 174013 91630 -45916 -112330 -45515 26636 54014 -30045
$$ packed form
14876a39113O1050J50790l1209j7484M308K2834M1308J6134M2569r4828q8185
14865c1826j22732R6068J60014k0516k2859L3001o7207K0374P0096o1625j15357
14854f2569L2870K23849M8204r8614l3472k3481o5511p8167R572P6180k0170J24744
14842A33435L2172p3797j34920r8341K8695L7098K9450O0300P6861o5002n2225
14831b6274R840L65l3269p5146m550O1890k9400R4198Q0616K883j26760j2488
14819e8095l2025K6676L0988J4235j30739J9065Q8079J01952L9735l2097j13993
14808d6219N8744j3008o8466Q2118L9276j0642J5074L1208j6269j24174q6836
14797a39194Q3872P6572R8189N4574q2383j37546o6414O6815P2151K7378q4059
$$ plain form
14786 -30045 -152784 -168937 -59984 -72439 -18924 -29664 -4108 72978 72592 -55901 -38153
14775 -38153 -15844 -52024 -45040 -44839 -32303 38058 106992 177489 178991 83637 46528 -8504
14763 -8504 8728 -15568 -72702 -52068 12838 46061 42925 -43195 -125603 -74547 -48974 -202979
14751 -202979 -164874 -147982 -89232 -57807 -137529 -193232 -133651 -104088 -71387 67918 167663
14740 167663 139716 64741 -44324 -47000 -20361 27236 -15770 -3989 18352 -51465 52356
14729 52356 106681 70743 -70661 -40073 62567 66061 11177 42990 89706 -56640 -57843
14718 -57843 -91373 -196418 -144648 -164658 -158354 -154208 -119004 -66991 -9971 53650 6988 5922
14706 5922 24248 -112366 -134410 -71182 21331 53229 141745 208978 220655 252959 222178 170537
$$ packed form
14786c0045j22739j6153J08953j2455N3515j0740K5556P7086l86j28493J7748
14775c8153K2309l6180O984K01J2536P0361O8934P0497J502r5354l7109n5032
14763h504J7232k4296n7134K0634O4906L3223l136q6120q2408N1056K5573j54005
14751b02979L8105J6892N8750L1425p9722n5703N9581K9563L2701J39305R9745
14740A67663k7947p4975j09065k676K6639M7597m3006J1781K2341o9817J03821
14729E2356N4325l5938j41404L0588J02640L494n4884L1813M6716j46346j203
14718e7843l3530j05045N1770k0010O304M146L5204N2013N7020O3621m6662j066
14706E922J8326j36614k2044O3228R2513L1898Q8516O7233J1677L2304l0781n1641
$$ plain form
14694 170537 66044 -6549 -36312 6422 36419 99178 127143 104195 138459 209934 239550
14683 239550 220949 204579 155641 131944 -28888 -38551 -25732 -36720 -126097 -35091 157
14672 157 -31106 -48730 -163979 -157177 -111467 -58313 -90030 -54083 43199 99452 70617 9477
14660 9477 57092 48126 103095 211480 221813 112823 84044 68886 40406 125478 81206 -44284
14648 -44284 -20301 -82609 -163504 -32163 28085 -31049 -66519 -54189 47928 47353 131456 134092
14636 134092 138297 220819 288065 210921 80545 78513 31795 -50037 -165039 -156417 -49556
14625 -49556 34047 22677 -7719 -47671 -23915 58839 23567 23449 31273 -22789 -29414 -9526
14613 -9526 -27140 -83702 -162340 -193369 -148436 14615 111973 188544 179124 81873 131033 52352
$$ packed form
14694A70537j04493p2593k9763M2734K9997O2759K7965k2948L4264P1475K9616
14683B39550j8601j6370m8938k3697j60832r663J2819j0988q9377R1006L5248
14672A57l1263j7624j15249O802M5710N3154l1717L5947R7282N6253k8835o1140
14660I477M7615q966N4969J08385J0333j08990k8779j5158k8480Q5072m4272j25490
14648d4284K3983o2308q0895J31341O0248n9134l5470J2330J02117n75Q4103K636
14636A34092M205Q2522O7246p7144j30376k032m6718q1832j15002Q622J06861
14625d9556Q3603j1370l0396l9952K3756Q2754l5272j18P824n4062o625J9888
14613i526j7614n6562p8638l1029M4933J63051R7358P6571r420r7251M9160p8681
$$ plain form
14601 52352 31645 94969 78229 -1814 -99012 -118430 -101296 -38743 48821 126556 119317 99835
14589 99835 186032 169241 69477 26100 37969 -19657 -10265 -51280 -92104 -41816 71301 171525
14577 171525 165920 137752 78730 42396 62823 -14615 -79758 -122505 -67627 -15065 -22048 -69383
14565 -69383 -82179 109859 251876 151449 -22661 6376 -39579 -727 -76323 -88563 -94550
14554 -94550 -135212 -20223 17618 63983 61599 31651 -76468 -54545 -52806 -12 -24890 24634
14542 24634 180140 114706 117702 178153 126825 10308 58378 153514 218236 332034 220482
14531 220482 56428 84546 167443 184757 77345 -11431 28514 -23404 -5037 10047 59760
14520 59760 22553 -49361 -115716 -199091 -151943 -38996 64403 99795 151176 161757 269502
$$ packed form
14601E2352k0707O3324j6740q0043r7198j9418J7134O2553Q7564P7735p239j9482
14589I9835Q6197j6791r9764m3377J1869n7626R392m1015m0824N0288J13117J00224
14577A71525n605k8168n9022l6334K0427p7438o5143m2747N4878N2562o983m7335
14565f9383j2796J92038J42017j00427j74110K9037m5955L8852p5596j2240n987
14554i4550m0662J14989L7841M6365k384k9948j08119K1923J739N2794k4878M9524
14542B4634J55506o5434K996O0451n1328j16517M8070R5136O4722J13798j11552
14531B20482j64054K8118Q2897J7314j07412q8776L9945n1918J8367J5084M9713
14520E9760l7207p1914o6355q3375M7148J12947J03399L5392N1381J0581J07745
$$ plain form
14509 269502 300232 243048 114683 95189 103239 215864 146390 69674 129848 202843 178704
14498 178704 29814 -31369 -55730 -62157 -59678 -72232 -67475 -35850 -47058 140595 118112 129174
14486 129174 88548 4632 -60867 63280 183469 158797 -20642 -44911 -50548 70574 57936
14475 57936 -103185 -145352 -93376 -79898 6467 93429 131529 81519 100719 137196 345581
14464 345581 335947 200045 207752 174033 171142 78618 18247 76595 70987 -105800 -186937 -188693
14452 -188693 -190664 -110742 -98196 -5374 56144 93915 -44082 -65361 -14508 162402 163719
14441 163719 56163 125661 189921 135176 28869 151998 222680 120663 1651 -12763
14431 -12763 -143111 -85718 -45733 -91601 -135983 -129064 41728 155492 157336 194857 267476
$$ packed form
14509B69502L0730n7184j28365j9494Q050J12625o9474p6716O0174P2995k4139
14498A78704j48890o1183k4361o427K479j2554M757L1625j1208J87653k2483J1062
14486A29174m0626q3916o5499J24147J20189k4672j79439k4269n637J21122j2638
14475E7936j61121m2167N1976J3478Q6365Q6962L8100n0010J9200L6477K08385
14464C45581r634j35902P707l3719k891r2524o0371N8348n608j76787q1137j756
14452a88693j971P9922J2546R2822O1518L7771j37997k1279N0853J76910J317
14441A63719j07556O9498O4260n4745j06307J23129P0682j02017j19012j4414
14431a2763j30348N7393L9985m5868m4382O919J70792J13764J844L7521P2619
$$ plain form
14420 267476 274226 195705 120244 117525 128240 114086 145626 220513 164168 54824 -141041
14409 -141041 -133758 57779 78073 -8505 80486 53333 -3235 -3623 -34957 -66906 -87377 -176682
14397 -176682 -53111 63220 52667 77339 227993 168158 135762 141722 202358 263778 146433
14386 146433 103935 25703 150316 315868 215960 82952 43098 103025 136692 136246 90
14375 90 7273 94470 -77184 -155815 -30262 41360 123689 130093 16067 54065 112560 43871
14363 43871 27196 98890 189642 116572 16206 -30384 106846 94513 19201 113827 48042
14352 48042 -111822 -98033 -9021 4908 29456 36206 90737 153566 162054 136056 185868 163477
14340 163477 114970 -19098 -80928 -39185 192825 187676 89315 89250 241398 145251 27479
$$ packed form
14420B67476O750p8521p5461k719J0715j4154L1540P4887n6345j09344j95865
14409a41041P283J91537K0294q6578Q8991k7153n6568l88l1334l1949k0471q9305
14397a76682J23571J16331j0553K4672J50654n9835l2396N960O0636O1420j17345
14386A46433m2498p8232J24613J65552r9908j33008l9854N9927L3667m46j36156
14375I0P183Q7197j71654p8631J25553P1622Q2329O404j14026L7998N8495o8689
14363D3871j6675P1694R0752p3070j00366m6590J37230j2333p5312R4626o5785
14352D8042j59864J3789Q9012J3929K4548O750N4531O2829Q488k5998M9812k2391
14340A63477m8507j34068o1830M1743K32010n149r8361o5J52148r6147j17772
$$ plain form
14329 27479 111527 107978 116717 135924 144598 17494 -15878 -141563 -134822 -24720 5779 48150
14317 48150 22814 -16478 7239 20973 40014 1300 -4352 -46321 41977 37746 55259 5250
14305 5250 -89408 -118683 23379 40034 576 -69755 -37758 46746 180391 197740 246586
14294 246586 327066 330920 192841 78246 48485 -32558 -71966 -199432 -159028 -38026 26088
14283 26088 49083 217 81564 105200 45919 49691 154493 124278 -5255 -78077 -53029
14272 -53029 30671 11180 4697 -93204 -156400 -107856 -69840 -41904 -10354 -55810 -67496 25283
14260 25283 113385 57607 -1453 24304 78606 99950 45578 -88990 -69301 -4749 109345
14249 109345 134039 187959 187964 60062 49245 112764 96570 -40501 -151923 -158717 28628 -8198
$$ packed form
14329B7479Q4048l549Q739J9207Q674j27104l3372j25685O741J10102L0499M2371
14317D8150k5336l9292K3717J3734J9041l8714n652m1969Q8298m231J7513n0009
14305E250r4658k9275J42062J6655l9458p0331L1997Q4504J33645J7349M8846
14294B46586Q0480L854j38079j14595k9761q1043l9408j27466M0404J21002O4114
14283B6088K2995m8866Q1347K3636n9281L772J04802l0215j29533p2822K5048
14272e3029Q3700j9491o483r7901o3196M8544L8016K7936L1550m5456j1686R2779
14260B5283Q8102n5778n9060K5757N4302K1344n4372j34568J9689O4552J14094
14249A09345K4694N3920Nj27902j0817O3519j6194j37071j11422o794J87345l6826
$$ plain form
14237 -8198 -54528 -56747 43513 50379 -67163 -43829 39537 25801 -108013 -64649 106210
14226 106210 70177 -69961 -105488 -32916 -175978 -185207 -84282 -132593 -336081 -254128 -158672
14215 -158672 -63852 -33710 46814 72223 507 -39059 95063 152722 126648 73992 -9336
14204 -9336 -139885 -100650 7502 70899 204676 190575 27760 -66455 13015 52897 61134
14193 61134 43890 45018 165567 167441 159185 26116 -15124 -21413 -110946 -89342 38203 109643
14181 109643 186707 212026 167842 62941 -6161 76066 117754 85999 26253 5888 52297
14170 52297 15493 64467 119169 74324 154292 173258 128618 98495 130072 24922 -81239
14159 -81239 -69909 31948 55198 88949 116787 93949 128735 129816 27663 -42616 -164160
$$ packed form
14237h198m6330k219J00260O866j17542K3334Q3366j3736j33814M3364J70859
14226A06210l6033j40138l5527P2572j43062r229J00925m8311k03488Q1953R5456
14215a58672R4820L0142Q0524K5409p1716l9566J34122N7659k6074n2656q3328
14204i336j30549L9235J08152O3397J33777j4101j62815r4215P9470L9882Q237
14193F1134j7244J128J20549J874q256j33069m1240o289q9533K1604J27545P1440
14181A09643P7064K5319m4184j04901o9102Q2227M1688l1755n9746k0365M6409
14170E2297l6804M8974N4702m4845P9968J8966m4640l0123L1577j05150j06161
14159h1239J1330J01857K3250L3751K7838k2838L4786J081j02153p0279j21544
$$ plain form
14148 -164160 -167408 -52566 93707 147043 110806 26282 29418 -12333 -133811 -79360 -19936
14137 -19936 10853 43365 53033 173811 141247 104995 67613 72568 74723 127653 256257 350509
14125 350509 254476 142882 -27234 -73068 -5855 136482 255019 293645 300498 241208 94237
14114 94237 47390 24254 39340 51213 149082 212408 311407 232774 124938 179399 161188
14103 161188 154765 160168 52062 5752 11842 10035 14988 93283 -40795 -53683 -11221 22735
14091 22735 16580 52492 -46055 -114268 -19384 147462 249965 277318 236010 275570 182093
14080 182093 87512 149889 143929 58969 20624 3141 36085 -98165 -81611 105354 344856
14069 344856 339631 195978 187481 125699 151844 171366 105719 171157 283374 320203 219853
$$ packed form
14148a64160l248J14842J46273N3336l6237q4524L136m1751j21478N4451N9424
14137a9936L0789L2512R668J20778l2564l6252l7382M955K155N2930J28604R4252
14125C50509r6033j11594j70116m5834O7213J42337J18537L8626O853n9290j46971
14114I4237m6847k3136J5086J1873R7869O3326R8999p8633j07836N4461j8211
14103A61188o423N403j08106m6310O090j807M953P8295j34078j2888M2462L3956
14091B2735o155L5912r8547o8213R4884J66846J02503K7353m1308L9560r3477
14080A82093r4581O2377n960q4960l8345j7483L2944j34250J6554J86965K39502
14069C44856n225j43653q497o1782K6145J9522o5647O5438J12217L6829j00350
$$ plain form
14058 219853 98581 21554 10828 -24578 -44980 57850 152898 193589 227372 171512 140943
14047 140943 104465 44447 170178 174483 137269 109018 81313 164687 249716 223050 113037
14036 113037 51730 43392 -68306 -88446 -78870 -52892 -75262 -5528 143489 165023 176762
14025 176762 167140 122983 147880 156981 71638 127664 92389 208584 235744 109134 106593 77713
14013 77713 63652 219126 261854 192009 99212 61462 128450 138300 331968 304022 235897
14002 235897 227429 128601 50850 53950 120945 190420 -15504 48172 131181 94009 83850 2385
13990 2385 16664 79947 164469 183699 184338 161619 87425 -85017 60266 63594 60813 76873
13978 76873 -31153 -49496 118266 225721 238647 156383 76552 -9845 -58781 -53204 19201
$$ packed form
14058B19853j21272p7027j0726l5406k0402J02830R5048M0691L3783n5860l0569
14047A40943l6478o0018J25731M305l7214k8251k7705Q3374Q5029k6666j10013
14036A13037o1307q338j11698k0140R576K5978k2370O9734J49017K1534J1739
14025A76762r622m4157K4897R101q5343N6026l5275J16195K7160j26610k541k8880
14013G7713j4061J55474M2728o9845r2797l7750O6988R850J93668k7946o8125
14002B35897q468r8828p7751L100O6995O9475k05924O3676Q3009l7172j0159q1465
13990B385J4279O3283Q4522J9230O39k2719p4194j72442J45283L328k781J6060
13978G6873j08026j8343J67762J07455J2926q2264p9831q6397m8936N577P2405
$$ plain form
13967 19201 67302 51164 79191 -39300 -69781 -34290 -5912 -64238 -42181 15623 63140
13956 63140 35569 -4398 140968 128910 90826 78661 173830 322484 348393 357756 393942
13945 393942 237078 205405 173509 162561 207511 110000 155080 135188 156653 100615 88761
13934 88761 -3506 -107110 -113114 -3188 123431 165712 149775 114081 169003 238530 267412
13923 267412 137637 41766 -27792 60725 113307 9998 -27489 -52719 -14522 -142589 -173468
13912 -173468 -21411 38489 60445 108571 199800 154274 111890 63093 774 -74709 -84317
13901 -84317 -51007 -59323 -76603 1468 48133 110387 189011 249052 273256 217016 171896 200238
13889 200238 95282 180570 155448 206171 241689 153155 25771 2825 24581 122605 206721
$$ packed form
13967A9201M8101j6138K8027j18491l0481L5491K8378n8326K2057N7804M7517
13956F3140k7571l9967J45366j2058l8084j2165R5169J48654K5909R363L6186
13945C93942j56864l1673l1896j0948M4950r7511M5080j9892K1465n6038j1854
13934H8761r2267j03604o004J09926J26619M2281j5937l5694N4922O9527K8882
13923B67412j29775r5871o9558Q8517N2582j03309l7487k5230L8197j28067l0879
13912a73468J52057N9900K1956M8126R1229m5526m2384m8797o2319p5483r608
13901h4317L3310q316j7280P8071M6665O2254P8624O0041K4204n6240m5120K8342
13889B00238j04956Q5288k5122N0723L5518q8534j27384k2946K1756R8024Q4116
$$ plain form
13878 206721 283596 238983 165836 150505 104322 85494 178673 319793 206452 181230 187495
13867 187495 124870 139725 187918 166869 99679 111936 135087 64305 141682 131848 112078 190184
13855 190184 232903 140316 37573 153882 207160 171137 73064 -23295 101756 107524 64959
13844 64959 158863 196714 102871 -29394 -99509 -42094 122133 150856 147203 236661 187078
13833 187078 163776 99298 239713 295528 320535 231808 152103 148081 97562 120894 258515
13822 258515 130744 26265 -38138 60299 101725 150388 140627 85926 127925 168221 234363
13811 234363 220384 136393 163701 228168 202018 142902 60063 81884 199546 156717 63256
13800 63256 120725 108861 72672 -55135 -197106 -210809 -41815 45306 82479 112221 99831
$$ packed form
13878B06721P6875m4613p3147j5331m6183j8828R3179J41120j13341k5222O265
13867A87495o2625J4855M8193k1049o7190J2257K3151p0782P7377r834j9770P8106
13855A90184M2719r2587j02743J16309N3278l6023r8073r6359J25051N768m2565
13844F4959R3904L7851r3843j32265p0115N7415J64227K8723l653Q9458m9583
13833A87078k3302o4478J40415N5815K5007q8727p9705m022n0519K3332J37621
13822B58515j27771j04479o4403R8437M1426M8663r761n4701M1999M0296O6142
13811B34363j3979q3991K7308O4467k6150n9116q2839K1821J17662m2829r3461
13800F3256N7469j1864l6189j27807j41971j3703J68994Q7121L7173K9742j2390
$$ plain form
13789 99831 100709 73792 167118 194562 188205 237266 278880 297868 309394 257609 273956 275633
13777 275633 248055 277782 241801 88979 18005 -39448 12182 150203 187428 155138 193992
13766 193992 138515 107456 167296 156726 170739 68513 163274 286552 218224 139249 100427
13755 100427 11942 -49147 -66981 -67074 128361 170264 165382 142791 105638 168861 168217 229104
13743 229104 169622 206680 202156 150265 100025 82598 39057 62603 -7778 20255 102626 111832
13731 111832 120374 125551 159378 158510 230749 202990 92350 162073 220155 15351 33696 104287
13719 104287 82577 118473 150029 283827 394451 270636 173313 94117 152473 287167 189583
13708 189583 83764 57307 78408 17609 23594 34647 50131 57652 124741 161102 193997 221161
$$ packed form
13789I9831Q78k6917R3326K7444o357M9061M1614J8988J1526n1785J6347J677
13777B75633k7578K9727l5981j52822p0974n7453N1630J38021L7225l2290L8854
13766A93992n5477l1059N9840j0570J4013j02226R4761J23278o8328p8975l8822
13755A00427q8485o1089j7834r3J95435M1903m882k2591l7153O3223o44O0887
13743B29104n9482L7058m524n1891n0240j7427m3541K3546p0381K8033Q2371R206
13731A11832Q542N177L3827q68P2239k7759j10640O9723N8082k04804J8345P0591
13719A04287k1710L5896L1556J33798J10624j23815r7323p9196N8356J34694r7584
13708A89583j05819k6457K1101o0799N985J1053J5484P521O7089L6361L2895K7164
$$ plain form
13696 221161 168018 127499 227062 345612 342658 330260 314618 335093 326285 244968 162790 -86
13684 -86 -20096 65375 128934 159226 174302 157647 102292 206063 336544 337609 117426 -43524
13672 -43524 54194 114186 82620 182460 310098 244935 197844 218248 56175 181546 321761
13661 321761 342140 357817 336221 326798 337280 239765 123129 30068 -60723 -84190 213
13650 213 55836 70150 95158 185477 262431 155746 -96811 -108911 80381 65636 9108
13639 9108 -1177 28201 77038 174216 123383 72208 87026 73503 72853 75693 52216 112250
13627 112250 109860 189713 320984 392226 380791 241248 154952 139447 211646 113118 119667
13616 119667 201274 383358 393154 405123 315607 227367 179766 144310 106116 157433 197604
$$ packed form
13696B21161n3143m0519R9563J18550k954j2398j5642K0475q808q1317q2178j62876
13684h6k0010Q5471O3559L0292J5076j6655n5355J03771J30481J065k20183j60950
13672d3524R7718N9992l1566R9840J27638o5163m7091K0404j62073J25371J40215
13661C21761K0379J5677k1596r423J0482r7515j16636r3061r0791k3467Q4403
13650B13N5623J4314K5008R0319P6954j06685k52557j2100J89292j4745n6528
13639I108j0285K9378M8837R7178n0833n1175J4818j3523o50K840k3477O0034
13627A12250k390P9853J31271P1242j1435j39543q6296j5505P2199r8528O549
13616A19667Q1607J82084R796J1969q9516q8240m7601l5456l8194N1317M0171
$$ plain form
13605 197604 254806 241242 262956 177776 132639 181934 211964 142478 244016 360141 247303
13594 247303 243536 211030 148003 155613 200638 284846 326184 212061 74605 115204 154313
13583 154313 174983 310421 260035 241450 218678 178047 94897 166338 191227 159307 178852
13572 178852 110976 100279 123835 246599 280419 210053 151895 94934 18455 289809 358281
13561 358281 338715 303094 227032 168203 108727 86353 201672 274199 277879 169620 131343
13550 131343 184678 208484 153363 254838 429605 429032 431140 351222 247594 359558 408514
13539 408514 392270 418575 426189 251015 125798 223916 267929 293125 408637 427329 411717
13528 411717 391073 342830 300840 202365 156666 236760 195227 222330 320632 221429 198154
$$ packed form
13605A97604N7202j3564K1714q5180m5137M9295L0030o9486J01538J16125j12838
13594B47303l767l2506o3027P610M5025Q4208M1338j14123j37456M0599L9109
13583A54313K0670J35438n0386j8585k2772m0631q3150P1441K4889l1920J9545
13572A78852o7876j0697K3556J22764L3820p0366n8158n6961p6479K71354O8472
13561C58281j9566l5621p6062n8829n9476k2374J15319P2527L680j08259l8277
13550A31343N3335K3806n5121J01475J74767n73K108p9918j03628J11964M8956
13539D08514j6244K6305P614j75174j25217R8118M4013K5196J15512J8692j5612
13528D11717k0644m8243m1990r8475m5699Q0094m1533K7103R8302r9203k3275
$$ plain form
13517 198154 292767 339499 208713 242484 254850 213290 175443 209777 246313 242732 189665
13506 189665 179032 241283 315223 313675 278155 240678 242846 287762 413844 406869 359217 308258
13494 308258 352127 379420 424221 349642 341503 369788 304079 132122 229674 165271 203070
13483 203070 276101 214753 169652 304609 297630 318071 395401 276734 306512 298790 340832
13472 340832 335920 218935 405034 404452 409003 532441 437786 336696 351453 235392 230504
13461 230504 283859 372828 358895 298898 284044 349186 444009 265085 206640 325469 381922
13450 381922 299616 179842 102526 144341 251182 389483 357859 276134 337272 459953 465804
13439 465804 455501 394310 284978 279949 339328 374420 254482 269177 327478 335712 345754
$$ packed form
13517A98154R4613M6732j30786L3771J2366m1560l7847L4334L6536l581n3067
13506A89665j0633O2251P3940j548l5520l7477K168M4916J26082o975m7652n0959
13494C08258M3869K7293M4801p4579q139K8285o5709j71957R7552o4403L7799
13483B03070P3031o1348m5101J34957o979K0441P7330j18667K9778p722M2042
13472C40832m912j16985J86099n82M551J23438r4655j01090J4757j16061m888
13461B30504N3355Q8969j3933n9997j4854O5142R4823j78924n8445J18829N6453
13450C81922q2306j19774p7316M1815J06841J38301l1624q1725O1138J22681N851
13439D65804j0303o1191j09332n029N9379L5092j19938J4695N8301Q234J0042
$$ plain form
13428 345754 414354 563859 581309 421565 404331 320567 364644 423936 316724 293180 349045
13417 349045 486682 539920 480738 396520 291144 301416 335360 389432 347973 384871 390552
13406 390552 397649 472044 633746 642821 574251 396918 374487 402774 364123 298358 347616
13395 347616 431877 446260 432390 406016 448538 417101 434956 474841 562950 488467 424160
13384 424160 334532 356057 294970 249531 210992 322632 430227 404180 374060 305393 212834
13373 212834 255686 378609 470599 391921 308679 173534 173729 294482 342105 443272 494554
13362 494554 404870 404315 420075 473063 479141 464258 502748 590208 680279 694871 701324 661141
13350 661141 663913 687766 656066 625513 530429 404319 363498 492739 587074 474574 430687
$$ packed form
13428C45754O8600J49505J7450j59744j7234q3764M4077N9292j07212k3544N5865
13417C49045J37637N3238n9182q4218j05376J0272L3944N4072m1459L6898N681
13406C90552P097P4395J61702R075o8570j77333k2431K8287l8651o5765M9258
13395C47616Q4261J4383j3870k6374M2522l1437J7855L9885Q8109p4483o4307
13384D24160q9628K1525o1087m5439l8539J11640J07595k6047l0120o8667r2559
13373B12834M2852J22923R1990p8678q3242j35145J95J20753M7623J01167N1282
13362D94554q9684n55J5760N2988O078j4883L8490Q7460R0071J4592O453m0183
13350F61141K772K3853l1700l0553r5084j26110m0821J29241R4335j12500m3887
$$ plain form
13339 430687 490538 496824 552381 597225 576836 453219 377696 406781 394574 501773 494789
13328 494789 488156 562655 506671 473782 447027 500377 572765 647860 670416 614349 470380
13317 470380 418758 482623 526265 638329 704113 785461 740834 680331 778453 672528 716865
13306 716865 862984 804519 715222 550573 497934 480233 473214 492301 638720 833561 924186
13295 924186 829645 887453 870823 928942 941972 951331 951977 916256 904491 808264 784210 918923
13283 918923 1012587 1100641 1205908 1229749 1142533 1039445 967985 986717 994055 1022681 1073929
13272 1073929 1008070 1089681 1193748 1165742 1071337 980198 1071693 1147416 1298186 1404445 1472517
13261 1472517 1579193 1510942 1425850 1543149 1623066 1622293 1690387 1772339 1847882 1908970 1994361
$$ packed form
13339D30687N9851O286N5557M4844k0389j23617p5523K9085j2207J07199o984
13328D94789o633P4499n5984l2889k6755N3350P2388P5095K2556n6067j43969
13317D70380n1622O3865M3642J12064O5784Q1348m4627o0503R8122j05925M4337
13306G16865J46119n8465q9297j64649n2639j7701p019J9087J46419J94841R0625
13295I24186r4541N7808j6630N8119J3030R359O46l5721j1765r6227k4054J34713
13283I18923R3664Q8054J05267K3841q7216j03088p1460J8732P338K8626N1248
13272A073929o5859Q1611J04067k8006r4405r1139R1495P5723J50770J06259O8072
13261A472517J06676o8251q5092J17299P9917p73O8094Q1952P5543O1088Q5391
$$ plain form
13250 1994361 2149046 2260023 2465861 2616914 2642435 2777579 2821181 2977957 3012230 3089861
13240 3089861 3250480 3491787 3654443 3674625 3731325 3862278 3965683 4142553 4383503 4543486
13230 4543486 4558268 4540115 4567328 4482087 4497521 4445926 4326907 4236150 4077322 4190786 4284825
13219 4284825 4081502 3966056 3812363 3612172 3458780 3353672 3253210 3189078 3110441 2948120
13209 2948120 2880553 2793240 2622398 2608104 2522309 2409410 2309412 2294031 2089922 2005002 1978959
13198 1978959 1919324 1947868 1984787 1973114 1934854 1869926 1742724 1603106 1538203 1526235 1560752
13187 1560752 1555564 1655454 1664537 1596957 1660986 1683830 1710581 1571864 1487003 1559699 1476111
13176 1476111 1413093 1533075 1508196 1337056 1335442 1483893 1471279 1433615 1419954 1288730 1269121
$$ packed form
13250A994361J54685J10977K05838J51053K5521J35144M3602J56776L4273P7631
13240C089861J60619K41307J62656K0182N6700J30953J03405J76870K40950J59983
13230D543486J4782j8153K7213q5241J5434n1595j19019r0757j58828J13464R4039
13219D284825k03323j15446j53693k00191j53392j05108j00462o4132p8637j62321
13209B948120o7567q7313j70842j4294q5795j12899r9998j5381k04109q4920k6043
13198A978959n9635K8544L6919j1673l8260o4928j27202j39618o4903j1968L4517
13187A560752n188R9890R083o7580O4029K2844K6751j38717q4861P2696q3588
13176A476111o3018J19982k4879j71140j614J48451j2614l7664j3661j31224j9609
$$ plain form
13165 1269121 1299600 1362936 1395027 1386198 1278221 1353016 1368555 1461950 1467757 1365805 1402595
13154 1402595 1460567 1408625 1440421 1457681 1384525 1473700 1511739 1451715 1358394 1276194 1243719
13143 1243719 1281894 1285186 1385543 1530991 1624332 1640538 1704273 1784819 1969416 2070259 2134100
13132 2134100 2117254 2121563 2289599 2442612 2441131 2332907 2425040 2364176 2289495 2237619 2237786
13121 2237786 2168715 2114397 2096456 2123945 2049725 1912670 1863094 1799132 1760390 1839078 1900233
13110 1900233 1898009 1872130 1833183 1746074 1792788 1915527 1891633 1726752 1639855 1665491 1633001
13099 1633001 1660703 1609382 1573987 1640853 1640752 1700132 1759290 1780770 1725634 1600336 1498616
13088 1498616 1498047 1536931 1523829 1615107 1607520 1659108 1694016 1688109 1666744 1801417 1792876 1844573
$$ packed form
13165A269121L0479O3336L2091q829j07977P4795J5539R3395N807j01952L6790
13154A402595N7972n1942L1796J7260p3156Q9175L8039o0024r3321q2200l2475
13143A243719L8175L292J00357J45448R3341J6206O3735Q0546J84597J00843O3841
13132B134100j6846M309J68036J53013j481j08224R2133o0864p4681n1876J67
13121B237786o9071n4318j7941K7489p4220j37055m9576o3962l8742P8688O1155
13110A900233k224k5879l8947q7109M6714J22739k3894j64881q6897K5636l2490
13099A633001K7702n1321l5395O6866j01N9380N9158K1480n5136j25298j01720
13088A498616n69L8884j3102R1278p587N1588L4908n907k1365J34673q541N1697
$$ plain form
13076 1844573 1858545 1807864 1847718 1786781 1677007 1796008 1951998 2058851 2163582 2110895
13066 2110895 2110888 2050460 2064037 2225209 2227836 2135321 2131829 2098534 2070153 2120477 2308270 2354018
13054 2354018 2254963 2302500 2354980 2444085 2540758 2501938 2525947 2536971 2618424 2580241 2527591
13043 2527591 2478618 2504260 2614021 2588994 2550240 2523770 2613608 2694359 2809322 2900815 2890609
13032 2890609 2786417 2737855 2781397 2919647 3109951 3152495 3203120 3242351 3347162 3422157
13022 3422157 3458712 3613347 3814299 3788236 3856709 4079160 4385082 4729199 5143266 5612211
13012 5612211 5878280 5915977 5755653 5509167 5351381 5083314 4906486 4834970 4781641 4820385
13002 4820385 4777931 4825099 4887608 5056673 5180374 5345503 5480968 5723223 5859673 5950473
$$ packed form
13076A844573J3972n0681L9854o0937j09774J19001J55990J06853J04731n2687
13066B110895po0428J3577J61172K627r2515l492l3295k8381N0324J87793M5748
13054B354018r9055M7537N2480Q9105R6673l8820K4009J1024Q1453l8183n2650
13043B527591m8973K5642J09761k5027l8754k6470Q9838Q0751J14963R1493j0206
13032B890609j04192m8562M3542J38250J90304M2544N0625L9231J04811P4995
13022C422157L6555J54635K00952k6063O8473K22451L05922L44117M14067M68945
13012E612211K66069L7697j60324k46486j57786k68067j76828p1516n3329L8744
13002D820385m2454M7168O2509J69065J23701J65129J35465K42255J36450R0800
$$ plain form
12992 5950473 6093971 6333445 6499961 6632177 6761337 6859944 6991624 7132808 7179330 7301684
12982 7301684 7380067 7377980 7462904 7458170 7492492 7450707 7423132 7412377 7491063 7678827 7809065
12971 7809065 7901498 7987056 8036043 8114829 8167875 8189292 8158645 8367270 8468188 8542314 8605277
12960 8605277 8733162 8955279 9261691 9644951 10001436 10271303 10683622 11176010 11526738
12951 11526738 11846994 11863327 11916529 11958305 11839294 11798768 11774747 11989463 12177456 12366731
12941 12366731 12544724 12790054 13201471 13515690 13712473 14141583 14627456 15009166 15421783
12932 15421783 15847855 16409220 16992242 17557971 18135712 18687711 19173377 19637072 20319387
12923 20319387 20983044 21685748 22529177 23347079 24136753 25077701 26026677 26912427 27842256
$$ packed form
12992E950473J43498K39474J66516J32216J29160R8607J31680J41184M6522J22354
12982G301684P8383k087Q4924m734L4322m1785k7575j0755P8686J87764J30238
12971G809065R2433Q5558M8987P8786N3046K1417l0647K08625J00918P4126O2963
12960H605277J27885K22117L06412L83260L56485K69867M12319M92388L50728
12951A1526738L20256J6333N3202M1776j19011m0526k4021K14716J87993J89275
12941A2366731J77993K45330M11417L14219J96783M29110M85873L81710M12617
12932A5421783M26072N61365N83022N65729N77741N51999M85666M63695O82315
12923B0319387O63657P02704Q43429Q17902P89674R40948R48976Q85750R29829
$$ plain form
12914 27842256 28901901 30083602 31320733 32675054 34065114 35539738 37171873 38853406
12906 38853406 40490620 42258194 44277713 46422753 48552631 50868912 53401860 56077698
12898 56077698 58872212 61937412 65179102 68685471 72408694 76120748 80205967 84680607
12890 84680607 89358483 94173761 99277162 104781913 110543720 116392485 122443300 128728713
12882 128728713 135131845 141590495 148130408 154599684 160792498 166654369 172118423 177086615
12874 177086615 181260007 184515231 186806749 188197088 188438877 187699124 185898026 183187407
12866 183187407 179504725 175030352 169844733 164134349 158019108 151647481 145079898 138525488
12858 138525488 131917057 125435913 119211787 113184510 107331745 101767263 96404248 91413802
$$ packed form
12914B7842256J059645J181701J237131J354321J390060J474624J632135J681533
12906C8853406J637214J767574K019519K145040K129878K316281K532948K675838
12898E6077698K794514L065200L241690L506369L723223L712054M085219M474640
12890H4680607M677876M815278N103401N504751N761807N848765O050815O285413
12882A28728713O403132O458650O539913O469276O192814N861871N464054M968192
12874A77086615M173392L255224K291518J390339K41789p39753j801098k710619
12866A83187407l682682m474373n185619n710384o115241o371627o567583o554410
12858A38525488o608431o481144o224126o027277n852765n564482n363015m990446
$$ plain form
12850 91413802 86622886 81976857 77655841 73720299 70131903 66675717 63373817 60154675
12842 60154675 57240083 54592002 52000103 49607599 47362380 45236377 43207167 41261812
12834 41261812 39472305 37693998 36106093 34737309 33352068 32019397 30732785 29623655
12826 29623655 28521566 27434586 26476043 25660890 24828441 23902175 23000443 22253621 21475488
12817 21475488 20936909 20340812 19711199 19080250 18464232 17980226 17432167 16897518 16349412
12808 16349412 15838514 15414391 14906470 14505862 14182351 13740168 13458935 13196898 12866266
12799 12866266 12604551 12227136 11772286 11436619 11207516 11012358 10703570 10411854 10223431
12790 10223431 10037910 9932588 9709300 9435810 9259255 9123621 8929307 8838874 8692241
$$ packed form
12850I1413802m790916m646029m321016l935542l588396l456186l301900l219142
12842F0154675k914592k648081k591899k392504k245219k126003k029210j945355
12834D1261812j789507j778307j587905j368784j385241j332671j286612j109130
12826B9623655j102089j086980r58543q15153q32449r26266r01732p46822p78133
12817B1475488n38579n96097o29613o30949o16018m84006n48059n34649n48106
12808A6349412n10898m24123n07921m00608l23511m42183k81233k62037l30632
12799A2866266k61715l77415m54850l35667k29103j95158l08788k91716j88423
12790A0223431j85521j05322k23288k73490j76555j35634j94314r0433j46633
$$ plain form
12781 8692241 8559721 8317611 8087684 7935193 7799364 7676152 7613798 7533252 7302249 7187402
12771 7187402 7127804 6848928 6640103 6620964 6435621 6399564 6258371 6193627 6082840 5896736
12761 5896736 5764281 5725138 5729426 5632518 5542650 5529658 5478165 5454221 5334434 5349286 5353827
12750 5353827 5246359 5100114 4991768 4916340 4809717 4826929 4738489 4692456 4669590 4543626
12740 4543626 4481094 4414910 4291692 4145133 4167437 4150943 4050277 3822701 3793887 3836317
12730 3836317 3863884 3859879 3736564 3671095 3632091 3694117 3623948 3504978 3394526 3385384 3455404
12719 3455404 3379930 3417007 3356633 3354730 3299127 3280955 3315009 3342473 3241548 3100204 3163145
12708 3163145 3278563 3299473 3246759 3103820 3131464 3128565 3095196 3092603 3176816 3161891 3118160
$$ packed form
12781H692241j32520k42110k29927j52491j35829j23212o2354q0546k31003j14847
12771G187402n9598k78876k08825j9139j85343l6057j41193o4744j10787j86104
12761E896736j32455l9143M288r6908q9868j2992n1493k3944j19787J4852M541
12750E353827j07468j46245j08346p5428j06623J7212q8440m6033k2866j25964
12740D543626o2532o6184j23218j46559K2304j6494j00666k27576k8814M2430
12730C836317K7567m005j23315o5469l9004O2026p0169j18970j10452r142P0020
12719C455404p5474L7077o0374j903n5603j8172L4054K7464j00925j41344O2941
12708C163145J15418K0910n2714j42939K7644k899l3369k593Q4213j4925m3731
$$ plain form
12697 3118160 3148255 3065116 2998984 2982397 2981644 2975002 2859790 2810010 2968505 2934723 2946262
12686 2946262 2975364 3088003 3133870 3223634 3259526 3163116 3137751 3109005 3027109 3059732 3209616
12675 3209616 3334587 3464250 3571343 3586229 3597289 3528088 3339648 3217183 3148879 3065996
12665 3065996 2984646 3025377 3128249 3124088 3105711 3029265 2966191 3049870 2940789 3005757 2989275
12654 2989275 2919172 2899587 2878480 2954899 2846282 2848140 2961988 3017830 2925789 2871255 2989768
12643 2989768 3053199 3090582 3204152 3322175 3451632 3348662 3260443 3222501 3230346 3348112
12633 3348112 3426951 3410710 3344370 3362757 3418440 3522977 3795775 3845277 3790088 3882716 3958140
12622 3958140 3926304 4036460 4154866 4210077 4326005 4459899 4597478 4694689 4847095 4925513
$$ packed form
12697C118160L0095q3139o6132j6587p53o642j15212m9780J58495l3782J1539
12686B946262K9102J12639M5867Q9764L5892r6410k5365k8746q1896L2623J49884
12675C209616J24971J29663J07093J4886J1060o9201j88440j22465o8304q2883
12665C065996q1350M0731J02872m161j8377p6446o3074Q3679j09081O4968j6482
12654B989275p0103j9585k1107P6419j08617J858J13848N5842r2041n4534J18513
12643B989768O3431L7383J13570J18023J29457j02970q8219l7942P845J17766
12633C348112P8839j6241o6340J8387N5683J04537K72798M9502n5189R2628P5424
12622C958140l1836J10156J18406N5211J15928J33894J37579R7211J52406P8418
$$ plain form
12612 4925513 5040573 5143570 5168144 5092645 5093503 5184495 5375626 5384676 5398873 5474833 5596843
12601 5596843 5657781 5849647 6123785 6405851 6489729 6583036 6980273 7386539 7765090 8137621
12591 8137621 8448869 8771125 9118859 9472623 9899063 10394083 11041546 11775631 12549708
12582 12549708 13236664 14068442 15034064 16110074 17461654 19015434 20860161 22967508
12574 22967508 25413102 28189981 31227933 34651783 38479307 43044992 48715279 55659900
12566 55659900 64459378 75857216 90705686 110176408 136040198 170410507 215344115
12559 215344115 271260178 332803991 386187924 413845606 406967394 370868291 319316217
12552 319316217 266705517 221949192 187736535 163233034 146624422 136488047 131393350
$$ packed form
12612D925513J15060J02997K4574p5499Q58R0992J91131R050J4197P5960J22010
12601E596843O0938J91866K74138K82066Q3878R3307L97237M06266L78551L72531
12591H137621L11248L22256L47734L53764M26440M95020O47463P34085P74077
12582A2549708O86956Q31778R65622J076010J351580J553780J844727K107347
12574B2967508K445594K776879L037952L423850L827524M565685N670287O944621
12566E5659900Q799478J1397838J4848470J9470722K5863790L4370309M4933608
12559B15344115N5916063O1543813N3383933K7657682o878212l6099103n1552074
12552C19316217n2610700m4756325l4212657k4503501j6608612j0136375n094697
$$ plain form
12545 131393350 130741775 134562337 142772457 155575433 173006972 194244116 217828003
12538 217828003 241340820 262521504 279933650 293562766 304674289 315714226 328781713
12531 328781713 345167143 364630180 385261013 403576107 415792905 418734502 411454828
12524 411454828 395649737 374366080 351120811 329472750 311617579 298240514 289128832
12517 289128832 283319349 278524480 271847609 261331768 246110587 227114215 206443507
12510 206443507 186312895 168872188 155489417 146759731 142686254 143580498 149804702 162244478
12502 162244478 182231300 211699931 252148649 303678346 362355915 417072751 450413410
12495 450413410 448274568 410617852 350442836 284201327 224658754 176944464 140641844
$$ packed form
12545A31393350o51575L820562Q210120J2802976J7431539K1237144K3583887
12538B17828003K3512817K1180684J7412146J3629116J1111523J1039937J3067487
12531C28781713J6385430J9463037K0630833J8315094J2216798K941597p279674
12524D11454828j5805091k1283657k3245269k1648061j7855171j3377065r111682
12517B89128832n809483m794869o676871j0515841j5221181j8996372k0670708
12510B06443507k0130612j7440707j3382771q729686m073477Q94244O224204J2439776
12502A62244478J9986822K9468631M0448718N1529697N8677569N4716836L3340659
12495D50413410k138842l7656716o0175016o6241509n9542573m7714290l6302620
$$ plain form
12488 140641844 113339398 92580591 76772146 64589319 55085628 47595322 41756384
12481 41756384 37092863 33156111 29644184 26569217 23922606 21610578 19630730 18043905
12473 18043905 16492427 15195109 14011684 13054906 12324997 11603590 10964849 10521195 9928505
12464 9928505 9279953 8711889 8288099 7943775 7591112 7296906 7008846 6691906 6317576
12455 6317576 6046433 5769216 5472756 5208705 5094065 4906310 4883605 4769427 4531418 4417550
12445 4417550 4300373 4213663 4085722 3918757 3816253 3738164 3731087 3667567 3545082 3624113
12435 3624113 3540780 3438673 3334493 3125814 2964795 2859789 2684203 2576671 2584506 2580602
12425 2580602 2551552 2579137 2598991 2470478 2364286 2330645 2340574 2353401 2291588 2226108 2150497
$$ packed form
12488A40641844k7302446k0758807j5808445j2182827r503691p490306n838938
12481D1756384m663521l936752l511927l074967k646611k312028j979848j586825
12473A8043905j551478j297318j183425r56778p29909p21407o38741m43654n92690
12464I928505o48552n68064m23790l44324l52663k94206k88060l16940l74330
12455F317576k71143k77217k96460k64051j14640j87755k2705j14178k38009j13868
12445D417550j17177q6710j27941j66965j02504p8089p077o3520j22485P9031
12435C624113q3333j02107j04180k08679j61019j05006j75586j07532P835l904
12425B580602k9050K7585J9854j28513j06192l3641R929J2827o1813o5480p5611
$$ plain form
12414 2150497 2121187 2024950 1973451 1963671 1950378 1932156 2057160 2055166 1913734 1816578 1837531
12403 1837531 1888562 2049465 1966327 1842347 1794145 1829026 1895205 1810830 1770885 1706949 1754411
12392 1754411 1749169 1705030 1726535 1735697 1663050 1680971 1786341 1930683 1865202 1919304 2111599
12381 2111599 2139701 2118663 2146953 2167196 2222667 2284004 2110991 1784540 1695592 1596403 1527938
12370 1527938 1376465 1419854 1418578 1392286 1286019 1137007 1183562 1266348 1129763 1067456 1132367
12359 1132367 1134061 1072213 1112855 1183013 1120383 936462 862341 981910 901961 874311 786647
12348 786647 672651 705487 818030 1027937 1076144 978174 864808 784538 786248 810574 739904
12337 739904 683984 657895 623882 778249 840023 817745 800664 805300 931865 873830 910095
$$ packed form
12414B150497k9310r6237n1499r780j3293j8222J25004j994j41432r7156K0953
12403A837531N1031J60903q3138j23980m8202L4881O6179q4375l9945o3936M7462
12392A754411n242m4139K1505R162p2647J7921J05370J44342o5481N4102J92295
12381B111599K8102k1038K8290K0243N5471O1337j73013l26451q8948r9189o8465
12370A527938j51473M3389j276k6292j06267j49012M6555Q2786j36585o2307O4911
12359A132367J694o1848M0642P0158o2630j83921p4121J19569p9949k7650q7664
12348G86647j13996L2836J12543K09907M8207r7970j13366q0270J710K4326p0670
12337G39904n5920k6089l4013J54367O1774k2278j7081M636J26565n8035L6265
$$ plain form
12326 910095 872423 815877 818960 751733 735400 664397 680206 771804 701691 710537 651248 662084
12314 662084 557181 448596 403365 348490 399612 481898 446114 368088 479710 646517 712529
12303 712529 685968 608619 463632 438113 620011 681594 698869 662218 609874 616085 540168
12292 540168 577218 548708 569315 669755 650168 563038 369147 414974 458147 462836 363301
12281 363301 360478 493401 508883 366286 287605 375036 430985 493598 559039 512332 436824
12270 436824 480068 558758 515470 424691 349617 357149 419821 434659 491715 544752 566190 514335
12258 514335 462066 349194 301702 313202 330596 329607 296192 262090 349624 477825 564237
12247 564237 508706 434473 400799 306959 236641 263450 403256 409411 401362 391998 479723 464441
$$ packed form
12326I10095l7672n6546L083o7227j6333p1003J5809R1598p0113Q846n9289J0836
12314F62084j04903j08585m5231n4875N1122Q2286l5784p8026J11622J66807O6012
12303G12529k6561p7349j44987k5519J81898O1583J7275l6651n2344O211p5917
12292E40168L7050k8510K0607J00440j9587q7130j93891M5827M3173M689r9535
12281C63301k823J32923J5482j42597p8681Q7431N5949O2613O5441m6707p5508
12270D36824M3244P8690m3288r0779p5074P532O2672J4838N7056N3037K1438n1855
12258E14335n2269j12872m7492J1500J7394r89l3415l4102Q7534J28201Q6412
12247E64237n5531p4233l3674r3840p0318K6809J39806O155q049r364Q7725j5282
$$ plain form
12235 464441 382468 350331 357065 286046 243882 263769 186808 227165 166020 82725 128434 218314
12223 218314 259326 236523 224383 288901 388301 345943 295228 365528 265971 336350 432958
12212 432958 489981 433802 285036 226501 270901 279049 274494 215193 166467 266502 361116
12201 361116 433814 483129 463220 385924 310085 242052 244821 252888 172149 231233 301838 213979
12189 213979 127222 105725 158428 212647 319277 360630 277230 129043 163330 172432 218408
12178 218408 310912 434690 437590 220059 143880 108525 96127 144787 182238 259067 293466
12167 293466 261558 302025 371877 328777 298425 311760 213803 303384 363219 301370 224119
12156 224119 215021 219839 216671 290347 285550 241705 217325 212598 123239 183499 241558 155934
$$ packed form
12235D64441q1973l2137O734p1019m2164J9887p6961M0357o1145q3295M5709Q9880
12223B18314M1012k2803j2140O4518R9400m2358n0715P0300r9557P0379R6608
12212D32958N7023n6179j48766n8535M4400Q148m555n9301m8726J00035R4614
12201C61116P2698M9315j9909p7296p5839o8033K769Q067q0739N9084P0605q7859
12189B13979q6757k1497N2703N4219J06630M1353q3400j48187L4287R102M5976
12178B18408R2504J23778K900k17531p6179l5355j2398M8660L7451P6829L4399
12167B93466l1908M0467O9852m3100l0352J3335r7957Q9581N9835o1849p7251
12156B24119r098M818l168P3676m797m3845k4380m727q9359O0260N8059q5624
$$ plain form
12144 155934 205828 279529 350032 327333 172872 42986 -98212 -12786 147663 270214
12134 270214 162137 95900 -12170 -4759 40045 144239 212839 201820 350435 467155 506971
12123 506971 490468 491784 490027 497828 444476 342800 375133 379882 293730 271938 232453 240505
12111 240505 374981 394753 331226 322411 303960 373672 425490 528728 826156 957106 925081
12100 925081 963120 1028344 1145261 1366124 1548913 1832390 2117863 2240112 2159770 1955082
12090 1955082 1679275 1565497 1450285 1283882 1113540 1049797 964393 857042 722355 730337
12080 730337 718627 800241 1001584 1139943 1254251 1373315 1502145 1535660 1704313 1816621
12070 1816621 1730096 1812443 1944910 2204215 2371624 2368014 2333035 2217698 2180409 2178694 2159342
$$ packed form
12144A55934M9894P3701P0503k2699j54461j29886j41198Q5426J60449J22551
12134B70214j08077o6237j08070P411M4804J04194O8600j1019J48615J16720L9816
12123E06971j6503J316j757P801n3352j01676L2333M749q6152k1792l9485Q052
12111B40505J34476J9772o3527q815j8451O9712N1818J03238K97428J30950l2025
12100I25081L8039O5224J16917K20863J82789K83477K85473J22249q0342k04688
12090A955082k75807j13778j15212j66403j70342o3743q5404j07351j34687P982
12080G30337j1710Q1614K01343J38359J14308J19064J28830L3515J68653J12308
12070A816621q6525Q2347J32467K59305J67409l610l4979j15337l7289j715j9352
$$ plain form
12059 2159342 2009009 1802853 1661911 1626169 1634428 1682634 1752146 1767915 1649938 1567548 1434613
12048 1434613 1340518 1305999 1225263 1048100 949413 1007853 969626 1071146 1227220 1405887
12038 1405887 1508163 1671576 1901540 2119227 2454735 2660366 2634257 2393891 1929873 1502900
12028 1502900 1186120 981977 857849 687419 552749 482618 585776 603502 495663 358504
12018 358504 260401 297124 387016 414332 425392 380077 335684 269963 85057 111497 199980
12007 199980 238944 282090 249938 229690 335326 244056 275431 226241 143318 117543 228754
11996 228754 326351 365758 377172 451395 230401 132370 208550 311199 318186 281945 239330
11985 239330 244471 408160 337050 229590 247647 326536 317490 286814 272128 266066 178578 -34271
$$ packed form
12059B159342j50333k06156j40942l5742Q259M8206O9512J5769j17977q2390j32935
12048A434613r4095l4519q0736j77163r8687N8440l8227J01520J56074J78667
12038A405887J02276J63413K29964K17687L35508K05631k6109k40366m64018m26973
12028A502900l16780k04143j24128j70430j34670p0131J03158J7726j07839j37159
12018C58504r8103L6723Q9892K7316J1060m5315m4393o5721j84906K6440Q8483
12007A99980L8964M3146l2152k0248J05636r1270L1375m9190q2923k5775J11211
11996B28754R7597L9407J1414P4223k20994r8031P6180J02649O987l6241m2615
11985B39330N141J63689p1110j07460J8057P8889r046l0676j4686o062q7488k12849
$$ plain form
11973 -34271 -98757 -48944 108953 254540 385283 408568 424718 411706 309357 280717 185504
11962 185504 67041 -40515 76125 148408 244370 339423 410022 366396 259276 288886 303128
11951 303128 193161 216239 302207 339628 445337 485648 321249 130841 25328 102221
11941 102221 260080 392920 345586 252451 361986 383274 369084 346462 259926 208891 241054
11930 241054 195378 238227 324405 147458 76575 100267 274674 281428 152856 215307 342116
11919 342116 505598 468846 290686 169591 231482 216266 40935 -140847 -114821 -47777
11909 -47777 40362 304273 283156 239288 219234 211598 225974 193460 157773 184328 132768 242445
11897 242445 253501 173198 268458 220156 170873 146580 117217 193030 359366 411746 383580
$$ packed form
11973c4271o4486M9813J57897J45587J30743K3285J6150j3012j02349k8640r5213
11962A85504j18463j07556J16640P2283R5962R5053P0599m3626j07120K9610J4242
11951C03128j09967K3078Q5968L7421J05709M0311j64399j90408j05513P6893
11941A02221J57859J32840m7334r3135J09535K1288j4190k2622q6536n1035L2163
11930B41054m5676M2849Q6178j76947p0883K3692J74407O754j28572O2451J26809
11919C42116J63482l6752j78160j21095O1891j5216j75331j81782K6026O7044
11909d7777Q8139K63911k1117m3868k0054p636J4376l2514l5687K6555n1560J09677
11897B42445J1056q0303R5260m8302m9283k4293k9363P5813J66336N2380k8166
$$ plain form
11886 383580 267199 236537 315913 360298 402992 328826 331854 392849 320099 287557 180679
11875 180679 109661 175593 224076 193814 250341 264582 192226 245269 380475 387336 519405
11864 519405 468398 422035 402149 480963 486008 478808 426390 294625 438196 479193 368381
11853 368381 163280 -1441 16945 75376 262843 358758 358047 413201 497448 567288 622628
11842 622628 701803 805031 856154 1031629 1120611 1204786 1418486 1659020 1819219 2067542
11832 2067542 2285177 2290007 2124505 2076484 1801271 1497287 1335156 1144652 1044730 1050919
11822 1050919 976306 923525 920096 1027587 1261496 1223525 1189429 1259114 1411842 1555073 1550897
11811 1550897 1620024 1641373 1706397 1726907 1730943 1862021 1910521 1959890 2027053 2090674 2240649
$$ packed form
11886C83580j16381l0662P9376M4385M2694p4166L028O0995p2750l2542j06878
11875A80679p1018O5932M8483l0262N6527J4241p2356N3043J35206O861J32069
11864E19405n1007m6363j9886P8814N045p200n2418j31765J43571M0997j10812
11853C68381k05101j64721J8386N8431J87467R5915p11N5154Q4247O9840N5340
11842F22628P9175J03228N1123J75475Q8982Q4175K13700K40534J60199K48323
11832B067542K17635M830j65502m8021k75213l03984j62131j90504r9922O189
11822A050919p4613n2781l429J07491K33909l7971l4096O9685J52728J43231m176
11811A550897O9127K1349O5024K0510M036J31078M8500M9369O7163O3621J49975
$$ plain form
11800 2240649 2245217 2190259 2113162 1946487 1697436 1625206 1620789 1633976 1567753 1686191 1779572
11789 1779572 1654022 1495078 1236174 1170607 1145164 1045639 983296 892813 884127 815121 845063
11778 845063 948745 1076219 1253357 1424652 1628048 1653400 1747826 1840974 1815746 1753538
11768 1753538 1661124 1491272 1276446 1091731 926123 777134 733089 703455 554072 459261
11758 459261 431774 500337 555310 554523 576566 542051 492042 472584 527010 449900 396487 575228
11746 575228 619145 554180 383507 343660 431468 484822 567582 477419 533733 461468 388073
11735 388073 265581 310743 445066 513595 547226 637984 616895 455809 358190 380629 383300
11724 383300 443714 528070 509141 452541 416659 334209 289684 286762 342801 393884 578227
$$ packed form
11800B240649M568n4958p7097j66675k49051p2230m417J3187o6223J18438R3381
11789A779572j25550j58944k58904o5567k5443r9525o2343r0483q686o9006K9942
11778H45063J03682J27474J77138J71295K03396K5352R4426R3148k5228o2208
11768A753538r2414j69852k14826j84715j65608j48989m4045k9634j49383r4811
11758D59261k7487O8563N4973p87K2043l4515n0009j9458N4426p7110n3413J78741
11746E75228M3917o4965j70673l9847Q7808N3354Q2760r0163N6314p2265p3395
11735C88073j22492M5162J34323O8529L3631R0758k1089j61086r7619K2439K671
11724C83300O0414Q4356j8929n6600l5882q2450m4525k922N6039N1083J84343
$$ plain form
11713 578227 528383 443632 413086 481619 494500 378868 321680 366541 257803 297950 437031
11702 437031 594961 617736 706309 807180 724171 589984 498883 425900 447524 515559 539195
11691 539195 550580 621730 528419 392384 325741 476593 528860 554174 577907 645661 590687
11680 590687 525526 575960 533112 392475 285465 326764 449009 455606 347475 294799 204883
11669 204883 178442 305379 257886 312195 527441 591745 580767 574086 598790 620408 635845
11658 635845 627916 701149 659188 720847 782519 871282 892626 719156 621597 679553 718311
11647 718311 711796 663565 688899 633624 664843 681617 687928 723442 831467 795411 731226 613739
11635 613739 583656 505751 640394 750569 703636 693065 777836 830428 875283 804681 720470
$$ packed form
11713E78227m9844q4751l0546O8533J2881j15632n7188M4861j08738M0147J39081
11702D37031J57930K2775Q8573J00871q3009j34187r1101p2983K1624O8035K3636
11691E39195J1385P1150r3311j36035o6643J50852N2267K5314K3733O7754n4974
11680E90687o5161N0434m2848j40637j07010M1299J22245O597j08131n2676q9916
11669B04883k6441J26937m7493N4309K15246O4304j0978o681K4704K1618J5437
11658F35845p929P3233m1961O1659O1672Q8763K1344j73470r7559N7956L8758
11647G18311o515m8231K5334n5275L1219J6774O311L5514J08025l6056o4185j17487
11635F13739l0083p7905J34643J10175m6933j0571Q4771N2592M4855p0602q4211
$$ plain form
11624 720470 793562 849097 763697 823377 958154 985803 902504 791925 722576 703719 617346
11613 617346 640160 623064 772885 810754 822620 758014 741131 681085 526732 387457 378628
11602 378628 475484 581640 722533 744173 687697 594465 517091 713554 857396 893040 960813
11591 960813 902858 867105 813204 730211 718323 714504 726006 820365 935584 1097116 1078565
11580 1078565 953117 914811 868716 883094 759302 795335 863820 781835 786802 898793 820715
11569 820715 870709 863949 784167 810355 844241 876055 881209 733136 581159 545251 708481
11558 708481 854080 881335 863807 896875 847471 892639 898460 904988 909160 856837 909539 861772
11546 861772 814887 833581 959078 1038622 1013632 913078 929565 1012684 1127724 1123039 953333
$$ packed form
11624G20470P3092N5535q5400N9680J34777K7649q3299j10579o9349j8857q6373
11613F17346K2814j7096J49821L7869J1866o4606j6883o0046j54353j39275q829
11602C78628R6856J06156J40893K1640n6476r3232p7374J96463J43842L5644O7773
11591I60813n7955l5753n3901q2993j1888l819J1502R4359J15219J61532j8551
11580A078565j25448l8306m6095J4378j23792L6033O8485q1985M967J11991p8078
11569H20715M9994o760p9782K6188L3886L1814N154j48073j51977l5908J63230
11558G08481J45599K7255j7528L3068m9404M5168N821O528M172n2323N2702m7767
11546H61772m6885J8694J25497P9544k4990j00554J6487Q3119J15040m685j69706
$$ plain form
11535 953333 932095 1012682 989194 996613 1037787 1101669 1196720 1294636 1363858 1367908 1371830 1376445
11523 1376445 1441606 1418543 1650412 1800868 1853208 1825674 1825278 1983119 2144726 2226885 2387445
11512 2387445 2567077 2662976 2654012 2560553 2406187 2321426 2359260 2236109 2033636 2032818 2048726
11501 2048726 2038893 1964316 1949071 1938394 1950245 2013851 2062362 2090781 2040990 1924670 1834129
11490 1834129 1917726 1853531 1876099 1855197 1988924 2002924 1927828 2066443 2151453 2190019 2266614
11479 2266614 2295984 2286870 2337259 2337015 2300676 2456876 2591844 2698325 2761897 2759321 2710392
11468 2710392 2590836 2656853 2778047 2924352 3072391 3209049 3325192 3354048 3259916 3419193
11458 3419193 3507569 3591170 3579728 3647381 3722175 3826432 3923151 3998093 4090347 4273220 4502813
$$ packed form
11535I53333k1238Q0587k3488P419M1174O3882R5051R7916O9222M050L922M615
11523A376445O5161k3063K31869J50456N2340k7534l96J57841J61607Q2159J60560
11512B387445J79632R5899q964r3459j54366q4761L7834j23151k02473q18J5908
11501B048726r833p4577j5245j0677J1851O3606M8511K8419m9791j16320r0541
11490A834129Q3597o4195K2568k0902J33727J4000p5096J38615Q5010L8566P6595
11479B266614K9370r114N0389k44l6339J56200J34968J06481O3572k576m8929
11468B710392j19556O6017J21194J46305J48039J36658J16143K8856r4132J59277
11458C419193Q8376Q3601j1442O7653P4794J04257R6719P4942R2254J82873K29593
$$ plain form
11447 4502813 4758121 4951054 5051682 5133717 5269615 5434913 5768540 6047776 6166892 6457896
11437 6457896 6793432 7095306 7234487 7444387 7809473 8145531 8502679 8820901 9325744
11428 9325744 9871107 10156452 10733405 11435207 12124825 12821196 13611870 14464285 15437063
11419 15437063 16448723 17659629 19006318 20636646 22440435 24519574 26932937 29605066
11411 29605066 32633939 36302942 40576976 45678554 51759333 59098745 67975731 78962172
11403 78962172 92541197 109430703 130753552 157888395 192154868 234325213 283116304
11396 283116304 332825220 373416298 394541991 391308723 366470324 328322915 285777654
11389 285777654 245674010 211812028 185612100 167042385 155333962 149620664 149559285
$$ packed form
11447D502813K55308J92933J00628Q2035J35898J65298L33627K79236J19116K91004
11437F457896L35536L01874J39181K09900L65086L36058L57148L18222N04843
11428I325744N45363K85345N76953P01802O89618O96371P90674Q52415R72778
11419A5437063J011660J210906J346689J630328J803789K079139K413363K672129
11411B9605066L028873L669003M274034N101578O080779P339412Q876986J0986441
11403G8962172J3579025J6889506K1322849K7134843L4266473M2170345M8791091
11396B83116304M9708916M0591078K1125693l233268k4838399l8147409m2545261
11389B85777654m0103644l3861982k6199928j8569715j1708423n713298o1379
$$ plain form
11382 149559285 154928055 165738084 182218019 203363096 226719834 248656707 264670528
11375 264670528 271913852 270747505 264446179 257523167 254574084 258706735 271904193 294884427
11367 294884427 326686139 363535301 398750547 423542956 430505348 417584002 389459312
11360 389459312 354392310 320609045 293718616 276444146 268762439 268074529 270185791
11353 270185791 269980982 263215410 248636436 227592303 203659006 180658761 161532862
11346 161532862 147666343 139524494 136537057 138438226 144930662 156195480 173063143
11339 173063143 196041538 225008974 259046708 295360781 328008310 349001682 351055969
11332 351055969 331723755 295806490 251712067 207813329 169381055 138429515 114488543
$$ packed form
11382A49559285N368770J0810029J6479935K1145077K3356738K1936873J6013821
11375B64670528P243324j166347o301326o923012k949083M132651J3197458K2980234
11367B94884427L1801712L6849162L5215246K4792409O962392j2921346k8124690
11360C89459312l5067002l3783265k6890429j7274470p681707o87910K111262
11353B70185791k04809o765572j4578974k1044133k3933297k3000245j9125899
11346A61532862j3866519q141849k987437J901169O492436J1264818J6867663
11339A73063143K2978395K8967436L4037734L6314073L2647529K0993372K054287
11332C51055969j9332214l5917265m4094423m3898738l8432274l0951540k3940972
$$ plain form
11325 114488543 96261242 82571786 72232628 64044045 57114322 51154368 45646676
11318 45646676 40603658 36147188 32269519 28983401 26250995 23834725 22006004 20574474
11310 20574474 19489208 18612335 17763484 17210749 16931901 16722542 16504073 16177913 15830342
11301 15830342 15268909 14781690 14263438 13798757 13642046 13558727 13770190 14192970 14655379
11292 14655379 15000365 15245748 15103292 14566221 13829130 13015245 12125740 11407601 10966544
11283 10966544 10608871 10376818 10283182 10107909 9795018 9345878 8844137 8239461 7652884
11274 7652884 7205224 6789537 6422302 6359322 6412275 6437614 6533715 6879342 7328784 7826195
11264 7826195 8472695 9169313 9650219 9998858 9938853 9347402 8518477 7516557 6634487
$$ packed form
11325A14488543j8227301j3689456j0339158q188583o929723n959954n507692
11318D5646676n043018m456470l877669l286118k732406k416270j828721j431530
11310B0574474j085266q76873q48851n52735k78848k09359k18469l26160l47571
11301A5830342n61433m87219n18252m64681j56711q3319K11463M22780M62409
11292A4655379L44986K45383j42456n37071p37091q13885q89505p18139m41057
11283A0966544l57673k32053r3636j75273l12891m49140n01741o04676n86577
11274G652884m47660m15687l67235o2980N2953K5339R6101L45627M49442M97411
11264G826195O46500O96618M80906L48639o0005n91451q28925j001920q82070
$$ plain form
11255 6634487 5796991 5077691 4550601 4139492 3805480 3535887 3225430 2979722 2830157
11246 2830157 2788497 2695675 2673870 2557101 2547273 2579000 2429273 2307975 2321988 2332982 2288365
11235 2288365 2096453 2046263 1894343 1774644 1690307 1672229 1665209 1811373 1864905 1848020 1813426
11224 1813426 1794418 1825201 1853999 1762226 1748849 1808929 1881539 1924264 1922846 1945225 1924783
11213 1924783 1916272 1852678 1613485 1430962 1368873 1391875 1363839 1148545 1086648 1135329 1211031
11202 1211031 1198474 1145613 1160382 1063512 1013925 1156449 1245519 1043104 891453 939375 937058
11191 937058 887129 809329 687175 670332 594549 539261 625325 796798 859930 940286 957232
11180 957232 907152 795679 791250 869157 787321 683376 705206 741947 654447 704468 741953
$$ packed form
11255F634487q37496p19300n27090m11109l34012k69593l10457k45708j49565
11246B830157m1660r2822k1805j16769r828L1727j49727j21298J4013J0994m4617
11235B288365j91912n0190j51920j19699q4337j8078p020J46164N3532j6885l4594
11224A813426j9008L0783K8798r1773j3377O0080P2610M2725j418K2379k0442
11213A924783q511o3594k39193j82523o2089K3002k8036k15294o1897M8681P5702
11202A211031j2557n2861J4769r6870m9587J42524Q9070k02415j51651M7922k317
11191I37058m9929p7800j22154j6843p5783n5288Q6064J71473O3132Q0356J6946
11180I57232n0080j11473m429P7907q1836j03945K1830L6741q7500N0021L7485
$$ plain form
11169 741953 649875 664622 674751 636051 568706 593675 650033 582639 665936 688174 763312
11158 763312 762795 697342 725440 654295 605859 522373 435935 276830 306703 393607 399926 492997
11146 492997 650741 684597 613173 584912 467649 576934 621278 564551 653598 679938 668270
11135 668270 517362 588298 697993 669158 608190 555609 516007 611399 625414 580433 655467
11124 655467 488826 344073 374730 315563 340167 356995 324312 262938 295612 387459 392858
11113 392858 364712 435585 420893 525963 487485 430035 509907 529446 376362 325299 302956
11102 302956 391914 429710 396975 343553 265120 272131 260754 320588 335027 237173 242560 190813
11090 190813 113919 129519 163466 183417 194124 135572 233655 279383 240663 212112 207597 199110
$$ packed form
11169G41953r2078J4747J0129l8700o7345K4969N6358o7394Q3297K2238P5138
11158G63312n17o5453K8098p1145m8436q3486q6438j59105K9873Q6904O319R3071
11146D92997J57744L3856p1424k8261j17263J09285M4344n6727Q9047K6340j1668
11135F68270j50908P0936J09695k8835o0968n2581l9602R5392J4015m4981P5034
11124F55467j66641j44753L0657n9167K4604J6828l2683o1374L2674R1847N399
11113C92858k8146P0873j4692J05070l8478n7450P9872J9539j53084n1063k2343
11102C02956Q8958L7796l2735n3422p8433P011j1377N9834J4439r7854N387n1747
11090A90813p6894J5600L3947J9951J0707n8552R8083M5728l8720k8551m515q487
$$ plain form
11078 199110 223250 252058 279713 195331 133033 189088 201317 248712 169752 190481 248590
11067 248590 340688 275896 195188 196421 292814 260999 224084 186622 165283 123400 178558 152192
11055 152192 46937 168269 212097 164218 128154 125407 58451 150136 217195 239605 215673
11044 215673 162564 65384 -34484 -99858 -57682 103081 194035 113823 25994 132833 249423
11033 249423 294855 325557 264131 225842 229518 261596 401880 327497 268409 218019 235874
11022 235874 197206 207157 250176 148164 91255 162848 225122 377224 346446 296991 299335
11011 299335 249324 324190 443416 384886 328840 279167 246194 217699 293479 311798 260696
11000 260696 191656 182152 264193 383511 339531 142902 124897 214478 118312 63994 127970
$$ packed form
11078A99110K4140K8808K7655q4382o2298N6055J2229M7395p8960K0729N8109
11067B48590R2098o4792q0708J233R6393l1815l6915l7462k1339m1883N5158k6366
11055A52192j05255J21332M3828m7879l6064k747o6956R1685O7059K2410k3932
11044B15673n3109r7180r9868o5374M2176J60763R0954q0212q7829J06839J16590
11033B49423M5432L0702o1426l8289L676L2078J40284p4383n9088n0390J7855
11022B35874l8668R951M3019j02012n6909P1593O2274J52102l0778m9455K344
11011B99335n0011P4866J19226n8530n6046m9673l2973k8495P5780J8319n1102
11000B60696o9040r504Q2041J19318m3980j96629j8005Q9581r6166n4318O3976
$$ plain form
10989 127970 184813 258066 247404 200339 136810 123188 242587 271062 272450 288922 173267
10978 173267 173173 271225 267683 248746 246201 278051 125110 241342 317774 359146 395763 489911
10966 489911 463544 347572 363676 473555 508771 472973 461369 556747 700965 765989 932386
10955 932386 1162054 1448082 1582318 1541228 1593828 1819310 1918551 1937029 2011775 1908356
10945 1908356 1810177 1624706 1261817 991909 917302 888543 842362 873685 894297 862113 1069892
10934 1069892 1315073 1324336 1332579 1413118 1611579 1595097 1404275 1383922 1338538 1362097 1410070
10923 1410070 1459147 1564832 1758688 1968127 2051505 2037004 1974630 1872472 1866250 1736987
10913 1736987 1556168 1559156 1515543 1433376 1454405 1444460 1284661 1244670 1275002 1167814 998945
$$ packed form
10989A27970N6843P3253j0662m7065o3529j3622J19399K8475J388J6472j15655
10978A73267r4R8052l542j8937k545L1850j52941J16232P6432M1372L6617R4148
10966D89911k6367j15972J6104J09879L5216l5798j1604R5378J44218O5024J66397
10955I32386K29668K86028J34236m1090N2600K25482R9241J8478P4746j03419
10945A908356r8179j85471l62889k69908p4607k8759m6181L1323K0612l2184K07779
10934A069892K45181R263Q243Q0539J98461j6482j90822k0353m5384K3559M7973
10923A410070M9077J05685J93856K09439Q3378j4501o2374j02158o222j29263
10913A736987j80819K988m3613q2167K1029r945j59799l9991L0332j07188j68869
$$ plain form
10902 998945 919287 1018264 962427 881305 928334 962211 1043563 1126145 1109056 1138429 1237459
10891 1237459 1367980 1492695 1494802 1499323 1443565 1240103 1108020 1057189 965325 818300 648460
10880 648460 525943 431138 486741 479487 356785 326837 406381 398784 316556 195460 147540
10869 147540 86331 132511 120615 85583 122150 84912 -21353 -64994 -17831 44599 27669
10858 27669 76814 45452 28681 105703 74085 -2483 -68971 -131525 -90117 7011 52433 69677
10846 69677 -26532 -45876 3762 -252 73742 68187 14939 28395 14377 236 37282 173165
10834 173165 166700 109259 48705 -14489 -8068 22553 26277 -2880 -68652 -51853 -136428 -186129
10822 -186129 -117410 -14603 -14887 209 5781 465 137615 228355 201221 181136 116431 -146606
$$ packed form
10902I98945p9658R8977n5837q1122M7029L3877Q1352Q2582j7089K9373R9030
10891A237459J30521J24715K107M521n5758k03462j32083n0831r1864j47025j69840
10880F48460j22517r4805N5603p254j22702k9948P9544p597q2228j21096m7920
10869A47540o1209M6180j1896l5032L6567l7238j06265m3641M7163O2430j6930
10858B7669M9145l1362j6771P7022l1618p6568o6488o2554M1408R7128M5422J7244
10846F9677r6209j9344M9638m014P3994n555n3248J3456j4018j4141L7046J35883
10834A73165o465n7441o0554o3194O421L0621L724k9157o5772J6799q4575m9701
10822a86129O8719J02807k84J5096N572n316J37150R0740k7134k0085o4705k63037
$$ plain form
10810 -146606 -285283 -304198 -215893 -184860 -120669 -54850 -34037 -14206 -8858 -12689 73548 3351
10798 3351 -60248 -82405 -32833 -10132 -40593 -13022 70225 37537 55258 73810 18538 -15187
10786 -15187 57334 -11482 -151483 -288998 -229898 -128740 -102679 -62676 26052 31616 96688
10775 96688 56537 -62191 -118115 -148051 -110605 -6833 16819 19071 87284 83105 -70198
10764 -70198 -62500 3435 41181 13910 6901 -38269 -147536 -54621 10370 22023 -672 8257
10752 8257 26282 47543 60080 21269 -29985 -23689 -16491 -38162 -135701 -158304 -78188 -17677
10740 -17677 24639 41336 96589 15057 9556 55804 5436 23377 106759 59651 98385 84596
10728 84596 102038 97343 7667 -3227 145845 116473 37634 -52189 -7584 44697 70873 -33762
$$ packed form
10810a46606j38677j8915Q8305L1033O4191O5819K0813J9831N348l831Q6237p0197
10798C351o3599k2157M9572K2701l0461K7571Q3247l2688J7721J8552n5272l3725
10786a5187P2521o8816j40001j37515N9100J01158K6061M0003Q8728N564O5072
10775I6688m0151j18728n5924k9936L7446J03772K3652K252O8213m179j53303
10764g0198P698O5935L7746k7271p009m5170j09267R2915O4991J1653k2695Q929
10752H257J8025K1261J2537l8811n1254O296P198k1671r7539k2603Q0116O0511
10740a7677M2316J6697N5253q1532n501M6248n0368J7941Q3382m7108L8734j3789
10728H4596J7442m695q9676j0894J49072k9372p8839q9823M4605N2281K6176j04635
$$ plain form
10716 -33762 -15616 13160 93424 178413 161861 158632 217264 246869 182195 169545 147760 81243
10704 81243 -3913 94004 89167 68715 68143 68154 87315 28136 110967 125156 -130 68683 -34963
10691 -34963 -60461 -78464 -157558 -135570 -96827 -64682 -49976 -68906 -152520 -156819 -89462 -124033
10679 -124033 -171678 -88333 8742 67140 112715 179655 246977 177621 50308 55538 67937
10668 67937 16827 -77204 -146290 -103701 -20896 9151 17965 -58946 -72073 -70940 -24013 49249
10656 49249 129454 169404 155014 130458 100012 -32530 -214954 -184309 -226640 -285669 -226678
10645 -226678 -160120 -14109 -76230 -11753 97748 154284 142414 95352 -73929 -131468 -76535
10634 -76535 82880 69368 63618 113365 304429 318869 125516 60029 121704 88151 1657
$$ packed form
10716c3762J8146K8776Q0264Q4989j6552l229N8632K9605o4674j2650k1785o6517
10704H1243q5156R7917m837k0452n72J1J9161n9179Q2831J4189j25286O8813j03646
10691c4963k5498j8003p9094K1988L8743L2145J4706j8930q3614m299O7357l4571
10679a24033m7645Q3345R7075N8398M5575O6940O7322o9356j27313N230J2399
10668F7937n1110r4031o9086M2589Q2805L0047Q814p6911j3127J133M6927P3262
10656D9249Q0205L9950j4390k4556l0446j32542j82424L0645m2331n9029N8991
10645b26678O6558J46011o2121O4477J09501N6536j1870m7062j69281n7539N4933
10634g6535J59415j3512n750M9747J91064J4440j93353o5487O1675l3553q6494
$$ plain form
10623 1657 -41372 -69113 -78973 -13012 -118626 -185955 -86284 45159 13733 -135193 -171868
10612 -171868 -181297 -209752 -140512 -73640 -71424 -109873 -168237 -6042 155520 142160 64397
10601 64397 -18460 -85082 -100879 -159017 -151467 -132252 -62823 -201 -87800 -61660 -62055 -126296
10589 -126296 -132044 2592 60215 26031 140467 138802 142777 -17398 -10837 -35023 -106740 -199714
10577 -199714 -164668 -97157 -173939 -166811 -167385 -85680 -69196 -158630 -81610 -72842 -51276 24394
10565 24394 94739 -78507 -153809 -109902 -195241 -121512 54910 201654 87396 -20226 64733
10554 64733 168547 114695 109739 -24980 -147658 -54430 17247 -29676 65847 -43742 -92374
10543 -92374 -227817 -289446 -176911 -149204 -108158 -54793 15948 5854 3814 -18178 -5535
$$ packed form
10623A657m3029k7741r860O5961j05614o7329R9671J31443l1426j48926l6675
10612a71868r429k8455O9240O6872K216l8449n8364J62195J61562j3360p7763
10601F4397q2857o6622j5797n8138P550J9215O9429O2622q7599K6140l95o4241
10589a26296n748J34636N7623l4184J14436j665L975j60175O561k4186p1717r2974
10577a99714L5046O7511p6782P128n74Q1705J6484q9434P7020Q768K1566P5670
10565B4394P0345j73246p5302M3907q5339P3729J76422J46744j14258j07622Q4959
10554F4733J03814n3852m956j34719j22678R3228P1677m6923R5523j09589m8632
10543i2374j35443o1629J12535K7707M1046N3365P0741j0094k040k1992J2643
$$ plain form
10532 -5535 -14318 -76275 41080 45669 79792 115024 119722 39040 -34922 -146607 -110535 -185485
10520 -185485 -219930 -211918 -160018 -84982 -44070 -85911 -105313 -105460 -51209 -30169 -19703 51721
10508 51721 111589 137560 99421 -43761 34036 42257 26955 7466 -83518 -51723 -4779 -213
10496 -213 -46425 -55520 -39620 -44925 53146 177651 188687 134497 167278 190325 211499 138637
10484 138637 87111 -1143 -29618 22297 134644 168462 156813 143866 6375 -42255 70701
10473 70701 30543 -78421 -143801 -175092 -123677 -84212 -111223 -128560 -91993 64102 203453
10462 203453 146398 170012 188760 58191 15481 20290 62642 57686 109255 133437 152893 89897
10450 89897 143977 121116 168275 152583 -30566 -161536 -91216 78163 165786 69494 12088
$$ packed form
10532e535q783o1957J17355M589L4123L5232M698q0682p3962j11685L6072p4950
10520a85485l4445Q012N1900P5036M0912m1841j9402j47N4251K1040J0466P1424
10508E1721N9868K5971l8139j43182P7797Q221j5302j9489r0984L1795M6944M566
10496b13m6212r095J5900n305R8071J24505J1036n4190L2781K3047K1174p2862
10484A38637n1526q8254k8475N1915J12347L3818j1649j2947j37491m8630J12956
10473G0701m0158j08964o5380l1291N1415L9465k7011j7337L6567J56095J39351
10462B03453n7055K3614J8748j30569m2710M809M2352m956N1569K4182J9456o2996
10450H9897N4080k2861M7159j5692j83149j30970P0320J69379Q7623r6292n7406
$$ plain form
10439 12088 9270 -61803 -84429 -91517 -72580 -29476 -70639 -44489 30111 80324 98058 98805
10427 98805 52146 64487 57307 -57110 89510 164845 100093 13211 132120 74462 73503 110931
10415 110931 38356 -64658 15626 63463 51729 -40229 -94439 -118402 -190922 -71529 105419
10404 105419 147698 64391 -402 -33004 -97486 -38972 -35018 -8237 -52118 -162160 -59593
10393 -59593 498 -3117 -40215 -167321 -253474 -128409 -27264 -17336 -84601 -101481 -121360
10382 -121360 -115017 -100712 -78672 -7722 27902 139721 141261 47990 143591 123465 73118 61552
10370 61552 -227528 -303478 -179912 -74622 -77696 -153587 -92040 -76868 -79753 -149571 -142586 -63996
10358 -63996 -22292 26909 71459 65672 -3847 -10254 385 -28221 -52324 62551 123885 158556
$$ packed form
10439A2088k818p1073k2626p088J8937M3104m1163K6150P4600N0213J7734P47
10427I8805m6659J2341p180j14417J46620P5335o4752q6882J18909n7658r59L7428
10415A10931p2575j03014Q0284M7837j1734r1958n4210k3963p2520J19393J76948
10404A05419M2279q3307o4793l2602o4482N8514L954K6781m3881j10042J02567
10393e9593O0091l615l7098j27106q6153J25065J01145R928o7265j6880j9879
10382a21360O343J4305K2040P0950L5624J11819J540r3271R5601k0126n0347j1566
10370F1552k89080p5950J23566J05290l074p5891O1547J5172k885o9818O985P8590
10358f3996M1704M9201M4550n787o9519o407J0639k8606k4103J14875O1334L4671
$$ plain form
10346 158556 163762 167420 109596 -30410 -23674 49037 32487 150392 80642 -226222 -277057
10335 -277057 -147557 -171385 -130741 -76000 -41084 -24638 72753 29295 102765 71559 -51668
10324 -51668 -70720 -1817 -49801 -110510 -36417 -100369 -159344 -119796 -90328 -107341 -101785 -117683
10312 -117683 -128875 -12880 133156 -18272 -129571 -43095 -23168 -40129 33208 117922 113823
10301 113823 125221 239068 139909 -19888 -165749 -185012 -5176 63809 30089 43730 34060
10290 34060 33398 33172 -141601 -255122 -275614 -204928 -217838 -195940 -286264 -213674 -142434 -61414
10278 -61414 -33868 -30389 -42192 -86130 -202000 -270149 -215525 -129557 -18188 -126595 -72867
10267 -72867 -46831 5520 37027 53707 6619 -88440 -52729 43115 13958 -113437 -64924
$$ packed form
10346A58556N206L658n7824j40006O736P2711j6550J17905o9750l06864n0835
10335b77057J29500k3828M0644N4741L4916J6446R7391m3458P3470l1206j23227
10324e1668j9052O8903m7984o0709P4093o3952n8975L9548K9468j7013N556j5898
10312a17683j1192J15995J46036j51428j11299Q6476J9927j6961P3337Q4714m099
10301A13823J1398J13847r9159j59797j45861j9263J79836O8985l3720J3641r670
10290C4060o62k26j74773j13521k0492P0686j2910K1898r0324P2590P1240Q1020
10278f1414K7546L479j1803m3938j15870o8149N4624Q5968J11369j08407N3728
10267g2867K6036N2351L1507J6680m7088r5059L5711R5844k9157j27395M8513
$$ plain form
10256 -64924 -160563 -290079 -266586 -264460 -230078 -231482 -215028 -181757 -106874 -241847 -212646 -74109
10244 -74109 -86709 -92384 -229734 -400368 -337306 -178174 -224369 -226966 -161805 -184082 -78048
10233 -78048 22759 23265 100698 -73807 -134490 -185649 -223299 -182646 -169208 -138339 -83142 -130603
10221 -130603 -70539 -54874 -78167 47147 147880 176028 74575 127890 153591 91730 20100
10210 20100 39707 -82968 -132781 522 -40791 -130750 -214503 -147790 -131800 -106597 -45760
10199 -45760 -34281 -135705 -108501 -92396 -105356 -31491 -27290 -17936 -60282 -68096 -122914 -111890
10187 -111890 -84839 -134138 -158487 -59015 -103171 -191314 -43776 79872 62790 -54411 -146720
10176 -146720 -104885 12613 -25307 14425 101646 68943 53959 71413 38476 118531 104595
$$ packed form
10256f4924r5639j29516K3493K126L4382j404J6454L3271P4883j34973K9201J38537
10244g4109j2600n675j37350j70634O3062J59132m6195k597O5161k2277J06034
10233g8048J00807N06P7433j74505o0683n1159l7650M0653J3438L0869N5197m7461
10221a30603O0064J5665k3293J25314J00733K8148j01453N3315K5701o1861p1630
10210B0100J9607j22675m9813J33303m1313q9959q3753O6713J5990K5203O0837
10199d5760J1479j01424K7204J6105j2960P3865M201R354m2346p814n4818J1024
10187a11890K7051m9299k4349R9472m4156q8143J47538J23648j7082j17201r2309
10176a46720M1835J17498l7920L9732Q7221l2703j4984J7454l2937Q0055j3936
$$ plain form
10165 104595 -12276 -99495 -101428 -34125 -17764 -91708 -170866 -164396 -90919 -44618 -6866 -4168
10153 -4168 77638 -11518 -59682 -40146 26594 -77856 -177669 -120178 -144353 -271285 -269077 -219016
10141 -219016 -61427 14195 -14251 -134668 -127392 3467 39537 -53078 -166056 -141584 -62220
10130 -62220 -83278 -202582 -309637 -292134 -183011 -81184 -42816 14419 2160 68865 56608
10119 56608 90034 85434 70972 -32449 -60657 -82213 -68928 -124482 -255594 -208155 -111986
10108 -111986 -134729 -90487 -46748 -85620 -53712 -133276 -135866 -63728 -2247 -80310 -157711 -147927
10096 -147927 -100163 -136042 -152787 -154345 -76471 12526 -4299 206600 377178 324013 226383
10085 226383 83677 161397 67514 57208 58218 -36407 -107568 -117163 15203 18363 34101 -39953
$$ packed form
10165A04595j16871q7219j933O7303J6361p3944p9158O470P3477M6301L7752K698
10153d168Q1806q9156m8164J9536O6740j04450r9813N7491k4175j26932K208N0061
10141b19016J57589P5622k8446j20417P276J30859L6070r2615j12978K4472P9364
10130f2220k1058j19304j07055J7503J09123J01827L8368N7235j2259O6705j2257
10119E6608L3426m600j4462j03421k8208k1556J3285n5554j31112M7439R6169
10108a11986k2743M4242M3739l8872L1908p9564k590P2138O1481p8063p7401R784
10096a47927M7764l5879j6745j558P7874Q8997j6825K10899J70578n3165r7630
10085B26383j42706P7720r3883j0306J010r4625p1161r595J32366L160J5738p4054
$$ plain form
10073 -39953 -98906 -158090 -63155 -10018 73882 17395 20978 124954 25056 -104890 -199084
10062 -199084 -99477 219 123696 121321 224977 256549 210136 82620 -47810 -38937 69137
10051 69137 36615 79168 267744 346763 448678 665723 804074 821032 627746 331842
10041 331842 286261 107095 10003 109471 40585 -53300 -53871 -39109 106547 43788 91366
10030 91366 37623 101930 44162 41586 99899 19443 -25824 -79239 -170142 -51875 -14657 -104938
10018 -104938 -208231 -61135 41382 2623 53541 28873 -69707 -93334 -94268 -176220 -76929
10007 -76929 -41705 -36448 84319 654 -128855 -109008 -30925 -113930 -177671 -98402 -81423
9996 -81423 -19050 83714 87003 15830 90947 119736 16477 -52039 -93370 -111180 -137339 -51505
$$ packed form
10073c9953n8953n9184R4935N3137Q3900n6487L583J03976r9898j29946r4194
10062a99084R9607R9696J23477k375J03656L1572m6413j27516j30430Q873J08074
10051F9137l2522M2553J88576P9019J01915K17045J38351J6958j93286k95904
10041C31842m5581j79166r7092R9468o8886r3885n71J4762J45656o2759M7578
10030I1366n3743O4307n7768k576N8313q0456m5267n3415r0903J18267L7218r0281
10018a04938j03293J47096J02517l8759N0918k4668r8580k3627r34q1952R9291
10007g6929L5224N257J20767q3665j29509J9847P8083q3005o3741P9269J6979
9996h1423O2373J02764L289p1173P5117K8789j03259o8516m1331j7810k6159Q5834
$$ plain form
9984 -51505 6281 -103033 -49053 72660 97814 22015 -35718 -113845 -97729 -56505 1466
9973 1466 -43152 -132305 -134742 -59190 -44035 -102604 -73869 -28472 -59452 -52537 -48238 7398 24968
9960 24968 -18488 -84738 -112208 -71564 37025 36787 -89705 -222358 -209204 -155192 -155676 -137774
9948 -137774 -155652 -155702 -90195 -28816 -32942 1126 126044 165111 83434 -41708 -63077 1035
9936 1035 62128 16814 -86941 -172517 -147277 -122749 -65246 5164 33456 -45693 -46230 18404
9924 18404 79726 30210 -61657 -43883 22582 10778 63280 144620 154543 140393 134753 177837
9912 177837 108402 84627 142772 104317 189918 200276 96482 -22406 -36983 105041 149811
9901 149811 36128 59300 103348 16524 -109616 -136363 -183859 -86338 67520 233181 275205
$$ packed form
9984e1505N7786j09314N3980J21713K5154p5799n7733p8127J6116M1224N7971
9973A466m4618q9153k437P5552J5155n8569K8735M5397l0980O915M299N5636J7570
9960B4968m3456o6250k7470M0644J08589k38j26492j32653J3154N4012m84J7902
9948a37774j7878n0O5507O1379m126L4068J24918L9067q1677j25142k1369O4112
9936A035O1093m5314j03755q5576K5240K4528N7503P0410K8292p9149n37O4634
9924A8404O1322m9516r1867J7774O6465j1804N2502Q1340R923j4150n640M3084
9912A77837o9435k3775N8145l8455Q5601J0358j03794j18888j4577J42024M4770
9901A49811j13683K3172M4048q6824j26140k6747m7496R7521J53858J65661M2024
$$ plain form
9890 275205 239742 186557 256136 231860 150860 -12376 -112438 -46473 1608 -28593 -131216
9879 -131216 -106331 -76939 39547 90233 26834 -23408 15030 153057 134913 76116 -33323
9868 -33323 3378 259567 293797 186287 54966 -99005 -128151 -100723 -142752 -114319 -43413
9857 -43413 -5918 -12434 -33220 79628 137925 89416 48172 100318 106085 149513 129405 -17102
9845 -17102 36349 89267 -31702 -96215 -81944 -117035 -141151 -208717 -147303 -6673 9863
9834 9863 -75080 -65540 -143946 -262681 -288752 -298552 -294508 -85680 -82924 -93592 -138840 -102082
9822 -102082 -61459 -42784 38759 56825 -134140 -149646 -110530 -235575 -279668 -120681 -12185
9811 -12185 26627 72659 121806 133216 158004 151665 -12115 -206886 -196148 -162535 -36043
$$ packed form
9890B75205l5463n3185O9579k4276q1000j63236j00062O5965M8081l0201j02623
9879a31216K4885K9392J16486N0686o3399n0242L8438J38027j8144n8797j09439
9868c3323L6701K56189L4230j07510j31321j53971k9146K7428m2029K8433P0906
9857d3413L7495o516k0786J12848N8297m8509m1244N2146N767M3428k0108j46507
9845a7102N3451N2918j20969o4513J4271l5091k4116o7566O1414J40630J6536
9834I863q4943R540p8406j18735k6071r800M044K08828K756j0668m5248L6758
9822a02082M0623J8675Q1543J8066j90965j5506L9116j25045m4093J58987J08496
9811a2185L8812M6032M9147J1410K4788o339j63780j94771J0738L3613J26492
$$ plain form
9800 -36043 116355 33029 -72868 -86059 132032 113211 50608 107809 149846 99352 84429
9789 84429 22110 80756 90689 59733 -26921 -79918 -240207 -296469 -310226 -199714 -109488 -160723
9777 -160723 -197906 -29512 37302 -2700 13901 85202 45466 -62547 3519 38201 -78475
9766 -78475 -181943 -162195 -132864 -82816 3399 60844 88775 82582 -49261 -115193 -45926 -97326
9754 -97326 -205391 -30487 -76611 -140812 -131912 -160162 -167942 -35653 138684 201372 102704
9743 102704 184 -69834 -139891 -118644 -123671 -218614 -218074 -202305 -138894 16831 36356 26059
9731 26059 62831 37061 117650 215313 227290 117002 55418 38207 117352 104148 53520 77000
9719 77000 -48116 -41292 74792 50891 36150 27074 48922 43231 79831 -46555 -136249 -250156
$$ packed form
9800c6043J52398q3326j05897j3191K18091j8821o2603N7201M2037n0494j4923
9789H4429o2319N8646R933l0956q6654n2997j60289n6262j3757J10512R0226n1235
9777a60723l7183J68394O6814m0002J6601P1301l9736j08013O6066L4682j16676
9766g8475j03468J9748K9331N0048Q6215N7445K7931o193j31843o5932O9267n1400
9754i7326j08065J74904m6124o4201Q900k8250p780J32289J74337O2688r8668
9743A02704j02520p0018p0057K1247n027r4943N40J5769O3411J55725J9525j0297
9731B6059L6772k5770Q0589R7663J1977j10288o1584j7211P9145j3204n0628K3480
9719G7000j25116O824J16084k3901j4741r076K1848n691L6600j26386q9694j13907
$$ plain form
9707 -250156 -131081 -34627 -20219 -77853 4056 22664 -9813 -95205 -43938 77112 58193
9696 58193 -52274 -132992 -126531 -48707 21189 -70430 -135681 -78816 5464 11481 -19789 -61913
9684 -61913 -5726 103019 164411 37553 -5804 4900 -88703 -114520 -141952 -190393 -275563
9673 -275563 -268617 -221075 -200456 -160094 -146012 -150161 -39326 -155386 -171013 -146175 -135287 23816
9661 23816 -19055 -95042 42339 78634 39123 112704 113509 199080 279935 317868 422146 397449
9649 397449 260012 236171 188126 114563 -29927 -150093 -213659 -137608 2375 74678 97882
9638 97882 55899 47908 14254 -99040 -140068 -122668 -23679 78314 86179 92571 136703 107569
9626 107569 148343 104972 -2032 -56387 -112301 -56094 17093 92855 134916 67897 -58251
$$ packed form
9707b50156J19075R6454J4408n7634Q1909J8608l2477q5392N1267J21050j8919
9696E8193j10467q0718O461P7824O9896r1619o5251N6865Q4280O017l1270m2124
9684f1913N6187J08745O1392j26858m3357J0704r3603k5817k7432m8441q5170
9673b75563O946M7542K0619M0362J4082m149J10835j16060j5627K4838J0888J59103
9661B3816m2871p5987J37381L6295l9511P3581Q05Q5571Q0855L7933J04278k4697
9649C97449j37437k3841m8045p3563j44490j20166o3566P6051J39983P2303K3204
9638I7882m1983p991l3654j13294m1028J7400R8989J01993P865O392M4132k9134
9626A07569M0774m3371j07004n4355n5914N6207P3187P5762M2061o7019j26148
$$ plain form
9615 -58251 -99535 -68281 -52490 -113834 -137392 -84595 -82206 -114586 -131542 -146053 -14489 55788
9603 55788 -57368 39197 168454 163792 135188 -40410 -75343 -44536 -13620 60094 108714
9592 108714 45172 109251 63283 66034 103434 135535 194961 175371 117610 182976 21742 -96612
9580 -96612 51582 95922 67707 78362 83530 52939 -110958 -124805 -6359 66945 106016
9569 106016 78233 56646 2992 113500 184337 196562 169770 127705 151378 76060 -54686
9558 -54686 -20566 193266 252273 87578 19486 -33569 -11408 43200 85561 62554 122392
9547 122392 154882 -11491 -48438 7769 133876 221575 291002 194161 127376 21236 -104922
9536 -104922 -229013 -171665 -118064 -84180 -43279 -86336 -50156 -22196 -46286 70813 97734
$$ packed form
9615e8251m1284L1254J5791o1344k3558N2797K389l2380j6956j4511J31564P0277
9603E5788j13156R6565J29257m662k8604j75598l4933L0807L0916P3714M8620
9592A08714o3542O4079m5968K751L7400L2101N9426j9590n7761O5366j61234j18354
9580i6612J48194M4340k8215J0655N168l0591j63897j3847J18446P3304L9071
9569A06016k7783k1587n3654J10508P0837J2225k6792m2065K3673p5318j30746
9558e4686L4120K13832N9007j64695o8092n3055K2161N4608M2361k3007N9838
9547A22392L2490j66373l6947N6207J26107Q7699O9427r6841o6785j06140j26158
9536a04922j24091N7348N3601L3884M0901m3057L6180K7960k4090J17099K6921
$$ plain form
9525 97734 114744 26273 -14944 -9983 -10486 -131196 -273879 -307789 -240508 -99067 29401 13931
9513 13931 147768 225091 201223 121351 69471 53051 82148 114454 27915 28990 -17105 11637
9501 11637 13090 55057 107235 40793 -72388 -98676 -87555 -98652 -14539 116478 216949
9490 216949 275037 229772 297807 214569 159131 148315 217456 224239 241689 267956 270801 143865
9478 143865 92650 191047 177642 112424 47681 31971 110445 140565 193136 222532 123483 11930
9466 11930 -37546 72534 85165 80532 -7545 -43197 18378 125192 74903 -20724 20273 67525
9454 67525 36883 -35335 15419 63444 122618 124991 73704 -28576 -10462 77920 21989 -10311
9442 -10311 87749 134987 27231 18929 68158 -6579 110880 253467 175451 158872 135473
$$ packed form
9525I7734J7010q8471m1217M961n03j20710j42683l3910O7281J41441J28468j5470
9513A3931J33837P7323k3868p9872n1880j6420K9097L2306q6539J075m6095K8742
9501A1637J453M1967N2178o6442j13181k6288J1121j1097Q4113J31017J00471
9490B16949N8088m5265O8035q3238n5438j0816O9141O783J7450K6267K845j26936
9478A43865n1215R8397j3405o5218o4743j5710P8474L0120N2571K9396r9049j11553
9466A1930m9476J10080J2631m633q8077l5652O1575J06814n0289r5627M0997M7252
9454F7525l0642p2218N0754M8025N9174K373n1287j02280J8114Q8382n5931l2300
9442a0311R8060M7238j07756q302M9229p4737J17459J42587p8016j6579k3399
$$ plain form
9431 135473 79939 46465 -6237 60759 20091 11547 89247 -30813 -3113 209909 216134 162680
9419 162680 221536 232063 229358 297413 300912 172963 101690 100218 83956 100047 70785 158159
9407 158159 46478 -61783 -16489 44921 32423 155900 166119 10187 -21361 -8663 137844
9396 137844 295873 220036 110655 200837 197020 241764 292723 157164 108918 137561 184876
9385 184876 228542 195994 75861 27022 64404 215348 251383 172380 117580 105427 42302
9374 42302 14179 157364 322905 290802 195108 147686 147170 7851 -80846 -46363 -134389 -88753
9362 -88753 -42880 40769 125680 168555 7683 -15387 4671 117076 204314 163667 109118
9351 109118 59264 101945 160321 225575 198444 237652 179676 62038 56484 64979 -13994 66366
$$ packed form
9431A35473n5534l3474n2702O6996m0668q544P7700j20060K7700K13022O225n3454
9419A62680N8856J0527k705O8055L499j27949p1273j472j6262J6091k9262Q7374
9407A58159j11681j08261M5294O1410j2498J23477J0219j55932l1548J2698J46507
9396A37844J58029p5837j09381R0182l817M4744N0959j35559m8246K8643M7315
9385A84876M3666l2548j20133m8839L7382J50944L6035p9003n4800j2153o3125
9374D2302k8123J43185J65541l2103r5694m7422n16j39319q8697L4483q8026M5636
9362h8753M5873Q3649Q4911M2875j60872k3070K0058J12405Q7238m0647n4549
9351A09118m9854M2681N8376O5254k7131L9208n7976j17638n554Q495p8973Q0360
$$ plain form
9339 66366 109973 171777 168544 62358 69010 117900 129039 74828 102148 173772 222432 304843
9327 304843 304302 268134 267735 221029 265018 261031 213180 255749 385455 368965 316554 271709
9315 271709 291883 252950 240126 405508 452546 427980 464339 581788 520587 447729 429080
9304 429080 381962 373715 332089 236215 265825 277117 313368 240595 264485 358692 271933 223817
9292 223817 267764 383114 413554 477791 490057 466856 490975 473950 395825 441467 480825
9281 480825 554817 510217 569188 598451 543744 520751 466896 406153 474936 493583 503134 472031
9269 472031 386519 361594 483389 546650 544763 618670 706041 630355 560053 691519 752245
9258 752245 581913 566884 646635 693315 612846 708065 710147 744986 699675 605408 669173 761075
$$ packed form
9339F6366M3607O1804l233j06186O652M8890J1139n4211K7320P1624M8660Q2411
9327C04843n41l6168l99m6706M3989l987m7851M2569J29706j6490n2411m4845
9315B71709K0174l8933j2824J65382M7038k4566L6359J17449o1201p2858j8649
9304D29080m7118q247m1626r5874K9610J1292L6251p2773K3890R4207q6759m8116
9292B23817M3947J15350L0440O4237J2266k3201K4119j7025p8125M5642L9358
9281D80825P3992m4600N8971K9263n4707k2993n3855o0743O8783J8647R551l1103
9269D72031q5512k4925J21795O3261j887P3907Q7371p5686p0302J31466O0726
9258G52245j70332j5029P9751M6680q0469R5219K082L4839m5311r4267O3765R1902
$$ plain form
9246 761075 821107 815700 957058 1147706 1304771 1364390 1390736 1450055 1409767 1318137 1299262
9235 1299262 1329219 1431320 1611289 1648823 1687290 1747694 1823460 1925102 2031068 2121574 2150824
9224 2150824 2387621 2451938 2509854 2633725 2689312 2781237 2819617 3023624 3225344 3288906 3359817
9213 3359817 3542867 3746446 3910966 4135072 4283289 4534396 5008639 5365095 5765745 6261293
9203 6261293 6803251 7366129 8079505 8779137 9446177 10338289 11362582 12574498 14063605
9194 14063605 15707350 17727324 20065429 22829946 26017780 29982657 35034956 41280538
9186 41280538 49302697 59500442 72572784 89252265 109862839 133749273 157813682
9179 157813682 175565300 180672202 171359791 151367332 126598419 102514391 82064134
$$ packed form
9246G61075O0032n407J41358J90648J57065N9619K6346N9319m0288r1630j8875
9235A299262K9957J02101J79969L7534L8467O0404P5766J01642J05966R0506K9250
9224B150824K36797O4317N7916J23871N5587R1925L8380K04007K01720O3562P0911
9213C359817J83050K03579J64520K24106J48217K51107M74243L56456M00650M95548
9203F261293N41958N62878P13376O99632O67040Q92112J024293J211916J489107
9194A4063605J643745K019974K338105K764517L187834L964877N052299O245582
9186D1280538Q022159J0197745J3072342J6679481K0610574K3886434K4064409
9179A57813682J7751618N106902r312411j9992459k4768913k4084028k0450257
$$ plain form
9172 82064134 65814583 53294190 43702362 36273339 30518712 26162347 22660608 19815523
9164 19815523 17411307 15324137 13703708 12322164 11051506 9979500 9160327 8394897
9156 8394897 7485888 6732653 6243886 5940231 5737091 5329313 4813761 4535972 4379090 4143171
9146 4143171 3929068 3749971 3573815 3494870 3292356 3026924 2718220 2673602 2623432 2600741
9136 2600741 2288132 2044137 2042104 2076015 2043715 1928970 1780655 1638812 1671222 1665412 1630457
9125 1630457 1502038 1429465 1429062 1373014 1360097 1303907 1140252 1233829 1340937 1212305 1103358
9114 1103358 1080139 967652 898793 827863 778753 864539 956365 861913 844485 775460 794961
9103 794961 836406 796864 672791 591433 574575 615467 529522 562240 650706 627848 596302
$$ packed form
9172H2064134j6249551j2520393r591828p429023n754627m356365l501739k845085
9164A9815523k404216k087170j620429j381544j270658j072006q19173p65430
9156H394897r09009p53235m88767l03655k03140m07778n15552k77789j56882k35919
9146D143171k14103j79097j76156p8945k02514k65432l08704m4618n0170k2691
9136B600741l12609k43995k033L3911l2300j14745j48315j41843L2410n810l4955
9125A630457j28419p2573m03n6048j2917n6190j63655R3577J07108j28632j08947
9114A103358k3219j12487o8859p0930m9110Q5786R1826r4452j7428o9025J9501
9103G94961M1445l9542j24073q1358j6858M0892q5945L2718Q8466k2858l1546
$$ plain form
9092 596302 513380 489001 487273 441133 370682 526931 565389 473171 338082 291754 370056
9081 370056 355319 344862 257980 309428 404747 315428 178796 333198 402947 473360 435076
9070 435076 384235 429078 413875 479464 488273 415920 357938 376950 462675 385312 232557 145138
9058 145138 107623 22295 34542 134891 211364 262554 221258 233684 188266 236915 394596
9047 394596 487601 389276 410555 441542 247901 130697 96330 -8156 98655 296739 356959
9036 356959 239404 139733 93850 47222 125803 236595 217710 220324 264987 207259 170646
9025 170646 173027 169024 108594 -72936 -97348 -35039 -18486 -33155 -127713 -84622 -33721 16254
9013 16254 16386 19406 31274 114255 37008 -6736 -55394 -37292 -37517 -26537 155960 324647
$$ packed form
9092E96302q2922k4379j728m6140p0451J56249L8458r2218j35089m6328P8302
9081C70056j4737j0457q6882N1448R5319q9319j36632J54402O9749P0413l8284
9070D35076n0841M4843j5203O5589Q809p2353n7982J9012Q5725p7363j52755q7419
9058A45138l7515q5328J2247J00349P6473N1190m1296J2426m5418M8649J57681
9047C94596R3005r8325K1279L0987j93641j17204l4367j04486J06811J98084O0220
9036C56959j17555r9671m5883m6628P8581J10792j8885K614M4663n7728l6613
9025A70646K381m003o0430j81530k4412O2309J6553j4669r4558M3091N0901M9975
9013A6254J32L020J1868Q2981p7247m3744m8658J8102k25J0980J82497J68687
$$ plain form
9001 324647 233915 25440 101346 106905 107104 115982 135212 138443 171764 35524 18127 38041
8989 38041 28382 121379 168652 276690 322695 386896 274175 161141 267993 119027 110961
8978 110961 97421 176195 208333 96948 14443 -36614 50288 123635 100652 151349 138630
8967 138630 -21739 -157891 -128804 -93420 -118539 -43587 102869 121675 84338 125486 173358
8956 173358 142605 168326 206385 98352 18148 5643 -50380 -83727 -67169 98327 102023
8945 102023 72411 175645 324137 226709 187369 167903 227759 251985 220827 148605 108516
8934 108516 162223 216859 203300 113177 131855 121551 96974 182565 253565 232177 265851 252151
8922 252151 122170 70331 10823 7837 10473 3294 207867 375669 209950 215228 272597 194225
$$ packed form
9001C24647r0732k08475P5906N559J99Q878J9230L231L3321j36240j7397J9914
8989C8041r659R2997M7273J08038M6005O4201j12721j13034J06852j48966q066
8978A10961j3540P8774L2138j11385q2505n1057Q6902P3347k2983N0697j2719
8967A38630j60369j36152K9087L5384k5119P4952J46456J8806l7337M1148M7872
8956A73358l0753K5721L8059j08033q0204j2505n6023l3347J6558J65496L696
8945A02023k9612J03234J48492r7428l9340j9466N9856K4226l1158p2222m0089
8934A08516N3707N4636j3559r0123J8678j0304k4577Q5591P1000k1388L3674j3700
8922B52151j29981n1839n9508k986K636p179K04573J67802j65719N278N7369p8372
$$ plain form
8910 194225 234639 253038 84305 67960 195872 232078 271424 399132 336156 196065 151039
8899 151039 34572 -108446 -110824 -100554 65873 139104 180680 97863 -28055 -68094 144676
8888 144676 297646 246468 262085 220080 262695 252377 123676 40923 74149 97842 145086
8877 145086 108071 74500 77845 63459 48264 113522 144269 161987 93258 162799 171916 204945
8865 204945 211814 279311 335537 343133 333446 180297 -291 -58807 -18632 78509 78298 26976
8853 26976 -124024 -90520 122072 293973 305180 320900 324139 260019 190427 167538 71230
8842 71230 33284 9433 -1096 23535 68603 99820 197235 197840 54773 29168 92806 32052
8830 32052 128308 242140 249667 119519 -33530 -150505 -175123 -66743 73944 135271 210979
$$ packed form
8910A94225M0414J8399j68733j6345J27912L6206L9346J27708o2976j40091m5026
8899A51039j16467j43018k378J0270J66427P3231M1576q2817j25918m0039K12770
8888A44676J52970n1178J5617m2005M2615j0318j28701q2753L3226K3693M7244
8877A45086l7015l3571L345j4386j5195O5258L0747J7718o8729O9541R117L3029
8865B04945O869O7497N6226P596r687j53149j80588n8516M0175R7141k11n1322
8853B6976j51000L3504K12592J71901J1207J5720L239o4120o9592k2889r6308
8842G1230l7946k3851j0529K4631M5068L1217R7415O05j43067k5605O3638o0754
8830C2052R6256J13832P527j30148j53049j16975k4618J08380J40687O1327P5708
$$ plain form
8819 210979 185321 73208 49752 71244 126009 38840 41828 158355 196308 199906 221802 172572
8807 172572 76888 95024 145139 250216 338746 304126 278112 380374 363819 328568 238920
8796 238920 248643 179681 254358 312119 238031 199194 57305 10132 -13958 -86013 49036
8785 49036 232249 251670 204835 306329 263211 273326 224053 133704 134526 57508 -20722 -507
8773 -507 1455 51159 77287 141386 304342 222602 143359 179116 164075 50424 6006 33430
8761 33430 -79878 39051 224069 317115 246519 97394 51445 64162 5204 -32483 31012
8750 31012 60176 115263 151018 107787 109552 109983 69658 28315 108699 332095 402577 362733
8738 362733 280339 124987 -30732 -33991 40124 17830 8221 125208 133515 100156 116856 136222
$$ packed form
8819B10979k5658j12113k3456K1492N4765q7169K988J16527L7953L598K1896m9230
8807A72572r5684J8136N0115J05077Q8530l4620k6014J02262j6555l5251q9648
8796B38920R723o8962P4677N7761p4088l8837j41889m7173k4090p2055J35049
8785D9036J83213J9421m6835J01494m3118J0115m9273r0349Q22p7018p8230K0215
8773e07J962M9704K6128O4099J62956q1740p9243L5757j5041j13651m4418K7424
8761C3430j13308J18929J85018R3046p0596j49125m5949J2717n8958l7687O3495
8750C1012K9164N5087L5755m3231J765M31m0325m1343Q0384K23396P0482l9844
8738C62733q2394j55352j55719l259P4115k2294r609J16987Q307l3359J6700J9366
$$ plain form
8726 136222 160555 253801 255485 116539 124268 251216 298734 244926 313438 430332 351944
8715 351944 279184 275757 75566 46201 113030 188806 162288 161549 182428 154676 137521 237776
8703 237776 198746 106902 117336 80053 136883 228166 202842 147657 185609 225689 109293
8692 109293 88550 -14694 20819 86163 192631 143988 142781 102681 86640 88062 63965 105096
8680 105096 89452 3226 6491 169252 250772 306664 393330 188994 13945 -47830 -124288
8669 -124288 -30227 24494 -74638 -129955 -65552 39735 28727 37696 25020 4310 -32127 74331
8657 74331 154062 35475 14138 -70495 -113689 -75090 83975 99891 75813 17957 18514 34793
8645 34793 -59691 -25274 -35915 9269 42321 117499 132251 53311 17562 113304 224246 257287
$$ packed form
8726A36222K4333R3246J684j38946P729J26948M7518n3808O8512J16894p8388
8715C51944p2760l427k00191k9365O6829P5776k6518p39K0879k7752j7155J00255
8703B37776l9030r1844J0434l7283N6830R1283k5324n5185L7952M0080j16396
8692A09293k0743j03244L5513O5344J06468m8643j207m0100j6041J422k4097M1131
8680A05096j5644q6226L265J62761Q1520N5892Q6666k04336j75049o1775p6458
8669a24288R4061N4721r9132n5317O4403J05287j1008Q969j2676k0710l6437J06458
8657G4331P9731j18587k1337q4633m3194L8599J59065J5916k4078n7856N57J6279
8645C4793r4484L4417j0641M5184L3052P5178J4752p8940l5749R5742J10942L3041
$$ plain form
8633 257287 183624 141845 112126 49649 77178 95144 88656 132153 107386 180221 128273 92674
8621 92674 90964 195042 298027 133989 209872 159019 153162 163540 129769 202750 237540 132280
8609 132280 -8491 6377 97578 24265 53090 94159 189048 158205 8085 -114187 4700
8598 4700 60399 88010 157851 151136 133921 269501 228826 291569 327458 360440 507443 619684
8586 619684 589680 512324 476398 379320 278364 216910 275967 276771 168523 94294 130012 188551
8574 188551 172758 90205 196629 191262 100412 66629 44134 -6539 -13367 16170 -15015 -48801
8562 -48801 -32043 131768 184427 166378 103736 72111 75572 161841 154768 142776 209084 178968
8550 178968 168098 190786 240662 304544 235951 128853 141199 131612 279716 464046 626231
$$ packed form
8633B57287p3663m1779k9719o2477K7529J7966o488M3497k4767P2835n1948l5599
8621I2674j710J04078J02985j64038P5883n0853n857J0378l3771P2981L4790j05260
8609A32280j40771J4868R1201p3313K8825M1069R4889l0843j50120j22272J18887
8598D700N5699K7611O9841o715j7215J35580m0675O2743L5889L2982J47003J12241
8586F19684l0004p7356l5926r7078j00956o1454N9057Q04j08248p4229L5718N8539
8574A88551j5793q2553J06424n367r0850l3783k2495n0673o828K9537l1185l3786
8562d8801J6758J63811N2659j8049o2642l1625L461Q6269p073j1992O6308l0116
8550A78968j0870K2688M9876O3882o8593j07098J2346r587J48104J84330J62185
$$ plain form
8539 626231 922986 1236659 1839603 2942193 3887449 3878554 3244940 2251194 1442681 1010071
8529 1010071 660082 468486 311471 231797 246609 330335 345521 276907 339682 426968 348470
8518 348470 379997 341985 174196 216760 226922 226554 112461 -27615 68728 181906 207683
8507 207683 223313 288197 259284 347116 387391 366885 573932 942227 1359060 1949908 3004227
8496 3004227 3782365 3599323 2887215 1929771 1052339 477582 379808 275092 125259 173320
8486 173320 84083 137811 80694 74503 187181 224469 175629 188112 215967 90659 93208 113738
8474 113738 139860 261628 273624 263698 177086 154362 105889 98491 112468 -14757 -58874 -3129
8462 -3129 119093 123119 16557 -113736 -137555 -71271 -950 25946 79239 126151 159771 207342
$$ packed form
8539F26231K96755L13673O02944J102590R45256q895o33614r93746q08513m32610
8529A010071l49989j91596j57015p9674J4812Q3726J5186o8614O2775Q7286p8498
8518C48470L1527l8012j67789M2564J0162l68j14093j40076R6343J13178K5777
8507B07683J5630O4884k8913Q7832M0275k0506K07047L68295M16833N90848J054319
8496C004227P78138j83042p12108r57444q77432n74757r7774j04716j49833M8061
8486A73320q9237N3728n7117o191J12678L7288m8840J2483K7855j25308K549K0530
8474A13738K6122J21768J1996r926q6612k2724m8473p398J3977j27225m4117N5745
8462c129J22222M026j06562j30293k3819O6284P0321K6896N3293M6912L3620M7571
$$ plain form
8450 207342 225233 66011 -31479 -132086 -33150 30065 -84400 -213127 -206758 -18846 37612
8439 37612 -8422 -76818 -25955 -23404 -96341 -99584 -102362 -75584 24044 74659 144797 137620 -1606
8426 -1606 -87618 153356 195760 140243 192729 81784 4439 68716 42990 -56992 -65647 -6399
8414 -6399 128020 134136 161001 206311 61235 -25537 -3196 81251 118412 -29890 -97677 53789
8402 53789 138481 68286 79499 151953 125008 -31186 -31988 -71868 -136183 -74343 -154864 -81735
8390 -81735 81715 52744 -66975 -100068 -31735 12529 148193 185225 238996 168049 19616
8379 19616 -35337 -136547 -275956 -215784 -37498 160661 184501 96005 146633 206290 234252
8368 234252 152914 81161 11645 -24755 -50576 64829 81526 -10852 10487 -137835 -91973
$$ packed form
8450B07342J7891j59222r7490j00607R8936O3215j14465j28727O369J87912N6458
8439C7612m6034o8396N0863K551p2937l243k778K6778R9628N0615P0138p177j39226
8426a606q6012K40974M2404n5517N2486j10945p7345O4277k5726r9982q655N9248
8414f399J34419O116K6865M5310j45076q6772K2341Q4447L7161j48302o7787J51466
8402E3789Q4692p0195J1213P2454k6945j56194q02l9880o4315O1840q0521P3129
8390h1735J63450k8971j19719l3093O8333M4264J35664L7032N3771p0947j48433
8379A9616n4953j01210j39409O0172J78286J98159K3840q8496N0628N9657K7962
8368B34252q1338p1753o9516l6400k5821J15405J6697r2378K1339j48322M5862
$$ plain form
8357 -91973 2742 40548 -27371 -75219 -99175 -137088 -155099 -176865 -247207 -405316 -413343 -244701
8345 -244701 -116294 -149031 -130633 -87127 -147808 -148137 16335 70875 -59152 -61276 -131386 -170052
8333 -170052 -81256 -32017 49144 73188 -80207 -18513 54121 -53586 -39785 70219 109266
8322 109266 47293 -77362 -112502 -33796 -115162 -209478 -30473 -22032 -53788 8969 67785
8311 67785 52806 31951 4121 -12772 -118456 -260765 -144911 37982 61327 -113651 -108367
8300 -108367 -128490 -138618 -110001 -110358 -50354 -80081 -74733 -19730 18154 29137 65708 58891
8288 58891 -40349 -97996 -131889 -181909 -156789 -71428 46806 53604 -8673 40362 7576 -101900
8276 -101900 -146566 -195137 -146121 -149959 -109525 -36821 54719 29811 -69685 -195005 -138059 -136319
$$ packed form
8357i1973R4715L7806o7919m7848k3956l7913j8011k1766p0342j58109q027J68642
8345b44701J28407l2737J8398M3506o0681l29J64472N4540j30027k124p0110l8666
8333a70052Q8796M9239Q1161K4044j53395O1694P2634j07707J3801J10004L9047
8322A09266o1973j24655l5140P8706q1366r4316J79005Q441l1756O2757N8816
8311F7785j4979k0855k7830j6893j05684j42309J15854J82893K3345j74978N284
8300a08367k0123j0128K8617l57O0004k9727N348N5003L7884J0983L6571o817
8288E8891r9240n7647l3893n0020K5120Q5361J18234O798o2277M9035l2786j09476
8276a01900m4666m8571M9016l838M0434P2704R1540k4908r9496j25320N6946J740
$$ plain form
8264 -136319 -100475 -131438 -146371 -143017 -45035 -58534 -66491 10318 -23185 -10170 -1505 84493
8252 84493 129014 74544 49110 53064 -94892 -126104 -151046 -176914 -15943 135137 88269
8241 88269 61714 56961 116244 -46500 -41818 -13106 -135911 -202861 -57793 -66156 -185784 -176245
8229 -176245 -112508 -93303 -144769 -157430 -51476 33657 20600 25082 59357 164000 66529
8218 66529 -51048 35575 176079 164514 163462 172242 220347 275299 279763 294841 328117 329171
8206 329171 101918 141199 196629 -52538 -101761 -42219 45574 74761 7051 41833 -53541
8195 -53541 -73919 -129661 -28998 -23571 -27973 41002 47707 -116131 -149419 -54458 -110686 -208279
8183 -208279 -136101 -107477 -173811 -110930 16371 -16104 -12420 14722 -81907 -5019 83358 140060
$$ packed form
8264a36319L5844l0963j4933L354R7982j3499p957P6809l3503J3015Q665Q5998
8252H4493M4521n4470k5434L954j47956l1212k4942k5868J60971J51080m6868
8241H8269k6555m753N9283j62744M682K8712j22805o6950J45068q363j19628R539
8229a76245O3737J9205n1466j2661J05954Q5133j3057M482L4275J04643r7471
8218F6529j17577Q6623J40504j1565j052Q780M8105N4952M464J5078L3276J054
8206C29171k27253L9281N5430k49167m9223N9542Q7793K9187o7710L4782r5374
8195e3541k0378n5742J00663N427m402O8975O705j63838l3288R4961n6228r7593
8183b08279P2178K8624o6334O2881J27301l2475L684K7142r6629P6888Q8377N6702
$$ plain form
8171 140060 84115 136270 7570 -167748 -233941 -33131 -3521 -115331 -130215 -85037 -86671
8160 -86671 -41948 -82285 -198852 -155766 -76662 -32032 7325 29410 34413 -53902 -54024 -11450
8148 -11450 5758 -100689 147756 242072 110420 -68365 -20748 -56644 -62397 139614 263075
8137 263075 185733 149731 159555 187640 182288 46676 65009 94909 197560 224184 154940 -13634
8125 -13634 -4078 20411 -32490 -3320 109349 153084 48118 93674 145196 56546 -22755 -5303
8113 -5303 36921 44316 -81119 -138477 -92318 -27887 12255 90861 129646 146109 171662 54366
8101 54366 147211 101174 36632 -43765 18753 98913 105149 106221 44156 -32777 -50341 -110589
8089 -110589 -174306 -176420 -205389 -42871 69920 27011 47359 9464 -110183 -104868 -37814
$$ packed form
8171A40060n5945N2155j28700j75318o6193K00810K9610j11810j4884M5178j634
8160h6671M4723m0337j16567M3086P9104M4630L9357K2085N003q8315j22M2574
8148a1450J7208j06447K48445R4316j31652j78785M7617l5896n753K02011J23461
8137B63075p7342l6002R824K8085n352j35612J8333K9900J02651K6624o9244j68574
8125a3634R556K4489n2901K9170J12669M3735j04966M5556N1522q8650p9301J7452
8113e303M2224P395j25435n7358M6159O4431M0142P8606L8785J6463K5553j17296
8101E4366R2845m6037o4542q0397O2518Q0160O236J072o2065p6933j7564o0248
8089a10589o3717k114k8969J62518J12791m2909K0348l7895j19647N315O7054
$$ plain form
8078 -37814 -61276 -30919 12283 -26476 -24741 51079 130704 73289 -10210 -187506 -149737 -87118
8066 -87118 5082 58593 43707 97972 45378 -12870 5802 -41563 -42514 109340 -18311 -99548
8054 -99548 -164540 -98570 -44808 -37621 6225 -3002 38611 129403 150629 108305 60875 -22704
8042 -22704 -44370 -42849 -52811 -55363 -52911 60515 186765 217553 186393 146216 54466 104088
8030 104088 63292 -52695 -82987 -132446 -127106 -96478 -117721 -15115 96719 25183 -35147
8019 -35147 50332 23957 33124 152307 156085 194208 89535 64398 57143 -10535 -144823 -101915
8007 -101915 -111353 -57834 29626 44946 72920 138471 237920 147155 51282 -48411 -104225 -40048
7995 -40048 -4890 -112012 -118738 27725 79217 71174 62425 88264 28627 97862 230339 312268
$$ packed form
8078c7814k3462L0357M3202l8759J735P5820P9625n7415q3499j77296L7769O2619
8066h7118R2200N3511j4886N4265n2594n8248J8672m7365r51J51854j27651q1237
8054i9548o4992O5970N3762P187M3846r227M1613R0792K1226m2324m7430q3579
8042b2704k1666J521r962k552K452J13426J26250L0788l1160m0177r1750M9622
8030A04088m0796j15987l0292m9459N340L0628k1243J02606J11834p1536o0330
8019c5147Q5479k6375R167J19183L778L8123j04673k5137p255o7678j34288M2908
8007a01915r438N3519Q7460J5320K7974O5551R9449r0765r5873r9693n5814O4177
7995d0048L5158j07122o726J46463N1492q043q749K5839n9637O9235J32477Q1929
$$ plain form
7983 312268 322635 297070 76826 -37169 261 73498 108973 70873 116512 252250 371894
7972 371894 224314 23384 -24455 -94061 43086 85629 169503 182906 159121 49137 33216
7961 33216 59333 17360 -66578 -15084 53770 16494 59687 -29532 -36736 -34082 66506 186038
7949 186038 75336 49363 101710 61581 -85482 -98642 -90786 -58069 13919 21344 -2187 -76831
7937 -76831 -112429 -85080 -38726 14426 138383 151182 71562 89815 48490 45388 80717 175939
7925 175939 162422 226400 317173 356645 220580 224847 247919 409557 439297 343150 174102
7914 174102 -3714 -83344 -136519 -94664 64799 134042 196626 179581 66815 88580 80178
7903 80178 10782 -65851 -174512 -194321 -101407 -99867 -158417 -111826 -63423 -59439 -122726 -213947
$$ packed form
7983C12268J0367k5565k20244j13995L7430P3237L5475l8100M5639J35738J19644
7972C71894j47580k00930m7839o9606J37147M2543Q3874J3403k3785j09984j5921
7961C3216K6117m1973q3938N1494O8854l7276M3193q9219p204K654J00588J19532
7949A86038j10702k5973N2347m0129j47063j3160P856L2717P1988P425k3531p4644
7937g6831l5598K7349M6354N3152J23957J2799p9620J8253m1325l102L5329R5222
7925A75939j3517O3978R0773L9472j36065M267K3072J61638K9740r6147j69048
7914A74102j77816p9630n3175M1855J59463O9243O2584j7045j12766K1765q402
7903H0178o9396p6633j08661j9809R2914J540n8550M6591M8403L984o3287r1221
$$ plain form
7891 -213947 -117210 -112558 -152840 -109719 -167199 -263292 -305276 -297074 -240512 -153488 -126584 -4551
7879 -4551 99610 108704 109120 67067 -47087 -184086 -115450 -43418 -145118 -137517 -45105 -34271
7867 -34271 3666 -14365 -58419 -149679 -181771 -117287 5202 33736 -18625 -107659 -66281 -22790
7855 -22790 -90214 -91523 -45439 -24331 51170 23075 -107729 -92419 -202865 -162243 -71098 -23120
7843 -23120 -59469 -87135 -124218 -147900 -167871 -156865 -108664 29189 138189 151126 185559
7832 185559 245220 142510 26986 -70516 -73282 -106445 -150892 -223747 -262688 -251305 -193433
7821 -193433 -196250 -12545 89076 107720 46621 -40379 -94237 -124103 -68256 14154 -2355
7810 -2355 -108993 -153021 -247473 -329552 -276248 -196861 -151576 -42506 -60596 -39977 -60392 -79084
$$ packed form
7891b13947R6737M652m0282M3121n7480r6093m1984Q202N6562Q7024K6904J22033
7879d551J04161R094M16m2053j14154j36999O8636P2032j01700P601R2412J0834
7867c4271L7937j8031m4054r1260l2092O4484J22489K8534n2361q9034M1378M3491
7855b2790o7424j309M6084K1108P5501k8095j30804J5310j10446M0622R1145M7978
7843b3120l6349k7666l7083k3682j9971J1006M8201J37853J09000J2937L4433
7832A85559N9661j02710j15524r7502k766l3163m4447p2855l8941J1383N7872
7821a93433k817J83705J01621J8644o1099q7000n3858k9866N5847Q2410j6509
7810b355j06638m4028r4452q2079N3304P9387M5285J09070j8090K0619k0415j8692
$$ plain form
7798 -79084 -4117 34617 32665 -24499 19802 9508 -28458 -28583 -91366 -92944 -343254 -435273
7786 -435273 -363404 -82353 -28643 83501 7821 -63946 -44758 40451 67091 139628 6034
7775 6034 -89202 14387 233758 274143 217637 224179 115189 -65484 -114436 -83000 -170577
7764 -170577 -207929 -261950 -358761 -285622 -206278 -196225 -155340 -224210 -222305 -219798 -114451 87406
7752 87406 89865 -96868 -151167 -172447 -129119 -59504 96260 63012 -29874 -150540 -184006
7741 -184006 -117605 -66422 15680 -13702 22219 -14980 -98689 -211494 -147025 27528 144007
7730 144007 75069 78793 10701 -54137 -49787 -52441 -51086 17523 103233 6050 -76858 -82035 -111451
7717 -111451 -74871 10836 -32250 -109426 -219017 -207067 -95239 -42470 -43691 39228 -26136
$$ packed form
7798g9084P4967L8734j952n7164M4301j0294l7966j25o2783j578k50310r2019
7786d35273P1869K81051N3710J12144p5680p1767J9188Q5209K6640P2537j33594
7775F034r5236J03589K19371M0385n6506O542j08990j80673m8952L1436q7577
7764a70577l7352n4021r6811P3139P9344J0053M0885o8870J905K507J05347K01857
7752H7406K459j86733n4299k1280M3328O9615J55764l3248r2886j20666l3466
7741a84006O6401N1183Q2102k9382L5921l7199q3709j12805O4469J74553J16479
7730A44007o8938L724o8092o4838M350k654J355O8609Q5710r7183q2908n177k9416
7717a11451L6580Q5707m3086p7176j09591J1950J11828N2769j221Q2919o5364
$$ plain form
7706 -26136 -168769 -214146 -80165 -154328 -299200 -226369 -43303 66148 63768 43792 94211
7695 94211 37172 -100442 -55973 48547 89316 22496 -93979 -28921 24603 -130373 -89195
7684 -89195 -22229 -45244 -77659 -87783 20112 109457 46048 2937 31246 36609 104496 174783
7672 174783 152558 164748 152732 61387 -49273 -62874 -77231 27763 99375 -3743 -54481
7661 -54481 -64587 -106538 -80164 -61927 -75393 -27711 56821 46349 29337 -13264 -46489 -107667
7649 -107667 -96938 -202639 -238943 -120868 -140767 -70377 -142814 -221688 -166403 22117 82971
7638 82971 228363 163710 134744 129091 144355 23324 -84695 -99299 -173245 -138515 -66616
7627 -66616 -9250 192138 213236 174413 226847 189558 8369 -100582 -145289 -187887 -116709
$$ packed form
7706b6136j42633m5377J33981p4163j44872P2831J83066J09451k380j9976N0419
7695I4211n7039j37614M4469J04520M0769o6820j16475O5058N3524j54976M1178
7684h9195O6966k3015l2415j0124J07895Q9345o3409m3111K8309N363O7887P0287
7672A74783k2225J2190j2016r1345j10660j3601j4357J04994P1612j03118n0738
7661e4481j0106m1951K6374J8237j3466M7682Q4532j0472j7012m2601l3225o1178
7649a07667J0729j05701l6304J18075j9899P0390p2437p8874N5285J88520O0854
7638H2971J45392o4653k8966n653J5264j21031j08019j4604p3946L4730P1899
7627f6616N7366K01388K1098l8823N2434l7289j81189j08951m4707m2598P1178
$$ plain form
7616 -116709 -126236 -255365 -336022 -175752 -62912 54440 62210 47884 69713 58971 102188
7605 102188 56296 -22611 -88696 -183658 -271687 -178855 -19888 48885 -4419 -108231 -45917
7594 -45917 -56301 -8507 -38467 -24839 8458 -5809 20701 17070 -10172 -23441 -24982 -60555
7582 -60555 -138850 -102212 -94150 -153643 -110715 -123793 -64182 25024 42279 140009 174402 125364
7570 125364 -24623 -163236 -67879 8842 18233 64429 160197 45540 -66751 21042 10684
7559 10684 -18403 48416 7040 -102057 48525 66513 27223 56060 42197 -5995 71356
7548 71356 101661 161275 216208 143073 103461 57050 -32471 -37113 -67156 -166582 -184985 -93091
7536 -93091 -17246 99344 168359 73784 9284 -25736 10678 67386 214977 164453 10921
$$ packed form
7616a16709r527j29129q0657J60270J12840J17352P770j4326K1829j0742M3217
7605A02188m5892p8907o6085r4962q8029R2832J58967O8773n3304j03812O2314
7594d5917j0384M7794k9960J3628L3297j4267K6510l631k7242j3269j541l5573
7582f0555p8295L6638Q062n9493M2928j3078N9611Q9206J7255R7730L4393m9038
7570A25364j49987j38613R5357P6721R391M6196R5768j14657j12291Q7793j0358
7559A0684k9087O6819m1376j09097J50582J7988l9290K8837j3863m8192P7351
7548G1356L0305N9614N4933p3135l9612m6411q9521m642l0043r9426j8403R1894
7536i3091P5845J16590O9015r4575o4500l5020L6414N6708J47591n0524j53532
$$ plain form
7525 10921 -10026 17525 -12629 11983 -8184 19849 60305 56500 -28636 -91676 -28420 29414
7513 29414 80064 132100 76553 -3668 -91610 -40703 -43068 -66713 66767 229566 207319 168728
7501 168728 72247 74508 84532 173828 176644 54847 67580 -4586 -43230 77625 37421 -98305
7489 -98305 -59322 -29019 48946 188380 57252 -44946 -25921 41496 155714 235712 98550
7478 98550 8462 -21017 -105693 -89669 -139325 -150452 -77094 1168 108891 119954 58733 -21811
7466 -21811 -164110 -204837 -8603 115375 123474 144757 31652 -88626 -216265 -223582 -125865
7455 -125865 -49130 -66029 -33673 -6430 87730 152172 180117 213821 121406 -118183 -59940
7444 -59940 -93846 -178069 -218618 -283989 -204849 -62033 -60648 -85960 -207297 -278117 -291959 -205745
$$ packed form
7525A0921k0947K7551l0154K4612k0167K8033M0456l805q5136o3040O3256N7834
7513B9414N0650N2036n5547q0221q7942N0907k365k3645J33480J62799k2247l8591
7501A68728r6481K261J0024Q9296K816j21797J2733p2166l8644J20855m0204j35726
7489i8305L8983L0303P7965J39434j31128j02198J9025O7417J14218P9998j37162
7478I8550r0088k9479q4676J6024m9656j1127P3358P8262J07723J1063o1221q0544
7466b1811j42299m0727J96234J23978Q099K1283j13105j20278j27639p317R7717
7455a25865P6735j6899L2356K7243R4160O4442K7945L3704r2415k39589N8243
7444e9940l3906q4223m0549o5371P9140J42816J385k5312j21337p0820j3842Q6214
$$ plain form
7432 -205745 -164145 -182044 -235737 -190850 -115928 -134009 -261691 -292244 -281679 -186714 -107460
7421 -107460 -52506 -89767 -176636 -129641 -188196 -210447 -137371 -53700 6946 56839 -55131
7410 -55131 -188563 -193226 -108853 -63006 -31476 -10531 -103490 -157426 -96663 -49609 98207 51832
7398 51832 -98220 -128616 -42194 1739 74757 23798 -20698 -126086 -217675 -147305 -46343
7387 -46343 -82555 -64825 97885 122332 -20732 -154356 -70245 -9583 -88947 -70523 68316
7376 68316 95170 90913 -22206 -127715 -195655 -239833 -198982 -92581 -79727 -62303 -50275
7365 -50275 -36204 -53485 -114302 -52514 -70682 -22303 2313 84233 35222 -127040 -193977 -269906
7353 -269906 -307762 -309485 -224366 -182483 -152645 50417 94423 59958 121344 168739 4867
$$ packed form
7432b05745M1600j7899n3693M4887P4922j8081j27682l0553J0565R4965P9254
7421a07460N4954l7261q6869M6995n8555k2251P3076Q3671O0646M9893j11970
7410e5131j33432m663Q4373M5847L1530K0945r2959n3936O0763M7054J47816m6375
7398E1832j50052l0396Q6422M3933P3018n0959m4496j05388r1589P0370J00962
7387d6343l6212J7730J62710K4447j43064j33624Q4111O0662p9364J8424J38839
7376F8316K6854m257j13119j05509o7940m4178M0851J06401J2854J7424J2028
7365e0275J4071j7281o0817O1788j8168M8379K4616Q1920m9011j62262o6937p5929
7353b69906l7856j723Q5119M1883K9838K03062M4006l4465O1386M7395j63872
$$ plain form
7342 4867 2165 -109 -124918 -99379 -93964 -98208 -12250 117124 140249 74507 64160 25516
7330 25516 18761 42897 79035 36448 72806 54914 -27526 -41375 -36293 -27641 -71505 -33585
7318 -33585 -48697 -132166 -196054 -124846 -24558 -3369 18165 -5011 43598 60322 -21397 -114553
7306 -114553 -78261 -74286 -27536 -72291 -2865 -57977 -79129 -31278 58797 36145 155245 182897
7294 182897 118912 146191 104417 8783 41574 107967 14885 -74472 -145202 -37665 -73590
7283 -73590 -118452 39328 181868 253872 111474 42617 18585 -7011 58379 132459 188771
7272 188771 199430 122849 62477 129983 65798 71187 68585 -41680 -25156 -88656 -46097 73811
7260 73811 136400 -8955 -118783 -42466 -18280 -31878 90889 63408 -18588 -59590 -57585
$$ packed form
7342D867k702k274j24809K5539N415m244Q5958J29374K3125o5742j0347l8644
7330B5516o755K4136L6138m2587L6358j7892q2440j3849N082Q652m3864L7920
7318c3585j5112q3469o3888P1208J00288K1189K1534k3176M8609J6724q1719r3156
7306a14553L6292L975M6750m4755O9426n5112k1152M7851R0075k2652J19100K7652
7294A82897o3985K7279m1774r5634L2791O6393r3082q9357p0730J07537l5925
7283g3590m4862J57780J42540P2004j42398o8857k4032k5596O5390P4080N6312
7272A88771J0659p6581o0372O7506o4185N389k602j10265J6524o3500M2559J19908
7260G3811O2589j45355j09828P6317K4186j3598J22767k7481q1996m1002K005
$$ plain form
7249 -57585 -116299 -67788 28436 83797 82841 172259 60595 37511 -2306 -8269 58683 13544
7237 13544 29286 75723 88484 46933 -21761 -56511 35124 -25472 -118732 -138392 -55106 -48639
7225 -48639 -159802 -195864 -12947 36593 -7064 35700 -2774 -29413 76083 173428 239967
7214 239967 220090 72389 -52274 -167539 -114888 -27344 7339 50413 112111 142025 289772
7203 289772 205231 76358 28668 19304 6364 -35625 -58109 77165 147590 92149 30980
7192 30980 93922 20175 -62176 -63694 12009 12096 21101 42304 19133 -89770 -76254 -28550 -60874
7179 -60874 -17554 -63906 -219948 -200211 -146474 -113674 -192626 -175723 -46770 19850 32997
$$ packed form
7249e7585n8714M8511R6224N5361r56Q9418j11664k3084l9817n963O6952m5139
7237A3544J5742M6437J2761m1551o8694l4750R1635o0596r3260j9660Q3286O467
7225d8639j11163l6062J82917M9540m3657M2764l8474k6639J05496R7345O6539
7214B39967j9877j47701j24663j15265N2651Q7544L4683M3074O1698K9914J47747
7203B89772q4541j28873m7690r364j2940m1989k2484J35274P0425n5441o1169
7192C0980O2942p3747q2351j518P5703Q7R005K1203k3171j08903J3516M7704l2324
7179f0874M3320m6352j56042J9737N3737L2800p8952J6903J28953O6620J3147
$$ [...]
##END NTUPLES=NMR SPECTRUM
##END=
