##TITLE=Analysis number 317444
Compound Code mo 07157
Project Code qc-cat
Chemist Name ddc weighroom
##JCAMPDX= 6.0         $$ Bruker NMR JCAMP-DX V2.0
##DATA TYPE= NMR SPECTRUM
##DATA CLASS= NTUPLES
##ORIGIN= Bruker BioSpin GmbH
##OWNER= nmr
$$ XWIN-NMR		Version 3.5
$$ Mon Feb 20 16:00:07 2006 GMT Standard Time (UT+0h)  MAYBRIDGE\nmr@NMR_250MHZ
##.OBSERVE FREQUENCY= 250.131544655141
##.OBSERVE NUCLEUS= ^1H
##.ACQUISITION MODE= SIMULTANEOUS (DQD)
##.ACQUISITION SCHEME= undefined
##.AVERAGES= 16
##.DIGITISER RES= 18
##SPECTROMETER/DATA SYSTEM= dpx250
##.PULSE SEQUENCE= zg30
##.SOLVENT NAME= CDCl3
##.SHIFT REFERENCE= (INTERNAL, CDCl3, 0, 16.522)
##AUDIT TRAIL= $$ (NUMBER, WHEN, WHO, WHERE, WHAT)
$$ ##TITLE= Audit trail, XWIN-NMR		Version 3.5
$$ ##JCAMPDX= 5.01
$$ ##ORIGIN= Bruker BioSpin GmbH
$$ ##OWNER= nmr
$$ C:\u/data/dgb/nmr/ADRS/16390/pdata/1/auditp.txt
$$ ##AUDIT TRAIL=  $$ (NUMBER, WHEN, WHO, WHERE, WHAT)
(   1,<2006-02-20 15:59:33.37 +000>,<MAYBRIDGE\nmr>,<NMR_250MHZ>,
      <created by zg, POWCHK disabled, PULCHK disabled
       configuration hash MD5:
       84 BC 41 DB A1 6E 1D 46 DA 25 12 A5 C1 ED C5 3A
       data hash MD5: 64K
       BD 4B 30 57 05 73 84 B7 F0 40 A3 D2 C1 81 AA 41>)
(   2,<2006-02-20 15:59:50.18 +000>,<MAYBRIDGE\nmr>,<NMR_250MHZ>,
      <Start of raw data processing
       ef LB = 0.3 FT_mod = 6 PKNL = 1 SI = 32K 
       data hash MD5: 32K
       8F 75 7D C3 CA CB 78 06 A4 77 4C 16 84 1B A5 3E>)
(   3,<2006-02-20 15:59:54.65 +000>,<MAYBRIDGE\nmr>,<NMR_250MHZ>,
      <apk 
       data hash MD5: 32K
       66 53 C9 5F 8B 59 26 B4 01 9A C0 23 20 9C 2D F0>)
(   4,<2006-02-20 15:59:56.09 +000>,<MAYBRIDGE\nmr>,<NMR_250MHZ>,
      <abs ABSG = 5 
       data hash MD5: 32K
       21 1F 7B DF 35 44 72 32 37 0B 3F 07 33 98 24 FA>)
$$ ##END=
$$ 
$$ hash MD5
$$ 87 00 4E FC 4E E9 9F 6F 5E B5 F2 5F 0D D3 8F A7
##$RELAX= 
##$RELAX= 
##$RELAX= 
##$RELAX= 
##$RELAX= 
##$RELAX= 
##$RELAX= 
$$ Bruker specific parameters
$$ --------------------------
##$DU= <C:\u>
##$EXPNO= 16390
##$NAME= <ADRS>
##$PROCNO= 1
##$TYPE= <nmr>
##$USER= <dgb>
##$AMP= (0..31)
100 100 100 100 100 100 100 100 100 100 100 100 100 100 100 100 100 100 
100 100 100 100 100 100 100 100 100 100 100 100 100 100 
##$AQSEQ= 0
##$AQ_mod= 3
##$AUNM= <au_zg>
##$AUTOPOS= <47 >
##$BF1= 250.13
##$BF2= 250.13
##$BF3= 250.13
##$BF4= 250.13
##$BF5= 500.13
##$BF6= 500.13
##$BF7= 500.13
##$BF8= 500.13
##$BYTORDA= 1
##$CFDGTYP= 0
##$CFRGTYP= 5
##$CHEMSTR= <none>
##$CNST= (0..31)
1 1 145 1 1 1 1 1 1 1 1 1 1 1 1 1 1 1 1 1 1 1 1 1 1 1 1 1 1 1 1 1 
##$CPDPRG= <>
##$CPDPRG1= <>
##$CPDPRG2= <>
##$CPDPRG3= <>
##$CPDPRG4= <mlev>
##$CPDPRG5= <mlev>
##$CPDPRG6= <mlev>
##$CPDPRG7= <mlev>
##$CPDPRG8= <mlev>
##$CPDPRGB= <>
##$CPDPRGT= <>
##$D= (0..31)
0 1 0 0 0 0 0 0 0 0.06 0 0 0 0 0 0 0.0002 0 0 0 0 0 0 0 0 0 0 0 0 0 0 
0 
##$DATE= 1140451171
##$DBL= (0..7)
120 120 120 120 120 120 120 120 
##$DBP= (0..7)
150 150 150 150 150 150 150 150 
##$DBP07= 0
##$DBPNAM0= <>
##$DBPNAM1= <>
##$DBPNAM2= <>
$$ [...]
##$SUBNAM7= <"">
##$SUBNAM8= <"">
##$SUBNAM9= <"">
##$SW= 20.6930455092707
##$SWIBOX= (0..15)
0 0 3 0 0 0 0 0 0 0 0 0 0 0 0 0 
##$SW_h= 5175.983436853
##$TD= 65536
##$TD0= 1
##$TE= 294.16
##$TE2= 300
##$TE3= 300
##$TEG= 300
##$TL= (0..7)
0 120 120 120 120 120 120 120 
##$TP= (0..7)
150 150 150 150 150 150 150 150 
##$TP07= 0
##$TPNAME0= <>
##$TPNAME1= <>
##$TPNAME2= <>
##$TPNAME3= <>
##$TPNAME4= <>
##$TPNAME5= <>
##$TPNAME6= <>
##$TPNAME7= <>
##$TPOAL= (0..7)
0.5 0.5 0.5 0.5 0.5 0.5 0.5 0.5 
##$TPOFFS= (0..7)
0 0 0 0 0 0 0 0 
##$TUNHIN= 0
##$TUNHOUT= 0
##$TUNXOUT= 0
##$USERA1= <user>
##$USERA2= <user>
##$USERA3= <user>
##$USERA4= <user>
##$USERA5= <user>
##$V9= 5
##$VALIST= <valist>
##$VCLIST= <CCCCCCCCCCCCCCC>
##$VD= 0
##$VDLIST= <DDDDDDDDDDDDDDD>
##$VPLIST= <PPPPPPPPPPPPPPP>
##$VTLIST= <TTTTTTTTTTTTTTT>
##$WBST= 1024
##$WBSW= 4
##$XGAIN= (0..3)
0 0 0 0 
##$XL= 0
##$YL= 0
##$YMAX_a= 376190
##$YMIN_a= -512456
##$ZGOPTNS= <>
##$ZL1= 120
##$ZL2= 120
##$ZL3= 120
##$ZL4= 120
##$ABSF1= 16.522
##$ABSF2= -4.171173
##$ABSG= 5
##$ABSL= 3
##$ALPHA= 0
##$AQORDER= 0
##$ASSFAC= 0
##$ASSFACI= 0
##$ASSFACX= 0
##$ASSWID= 0
##$AUNMP= <proc_1d>
##$AZFE= 0.1
##$AZFW= 0.1
##$BCFW= 0
##$BC_mod= 0
##$BYTORDP= 0
##$COROFFS= 0
##$CY= 12.5
##$DATMOD= 1
##$DC= 0
##$DFILT= <>
##$DTYPP= 0
##$F1P= 14.0000005364418
##$F2P= -0.99999901652339
##$FCOR= 0.5
##$FTSIZE= 32768
##$FT_mod= 6
##$GAMMA= 0
##$GB= 0
##$INTBC= 1
##$INTSCL= 1
##$ISEN= 128
##$LB= 0.3
##$LEV0= 0
##$LPBIN= 0
##$MAXI= 10000
##$MC2= 0
##$MEAN= 0
##$ME_mod= 0
##$MI= 0
##$NCOEF= 0
##$NC_proc= -5
##$NLEV= 6
##$NOISF1= 0
##$NOISF2= 0
##$NSP= 0
##$NTH_PI= 0
##$NZP= 0
##$OFFSET= 16.522
##$PC= 1
##$PHC0= 239.7172
##$PHC1= 8.364905
##$PH_mod= 1
##$PKNL= yes
##$PPARMOD= 0
##$PSCAL= 4
##$PSIGN= 0
##$REVERSE= no
##$SF= 250.13
##$SI= 32768
##$SIGF1= 0
##$SIGF2= 0
##$SINO= 400
##$SIOLD= 32768
##$SREGLST= <1H.CDCl3>
##$SSB= 0
##$STSI= 32768
##$STSR= 0
##$SW_p= 5175.98343685301
##$SYMM= 0
##$S_DEV= 0
##$TDeff= 65536
##$TDoff= 0
##$TI= <Analysis number 999999
Compound Code 99
Book Reference 9
Project Code 9>
##$TILT= no
##$TM1= 0
##$TM2= 0
##$TOPLEV= 0
##$USERP1= <user>
##$USERP2= <user>
##$USERP3= <user>
##$USERP4= <user>
##$USERP5= <user>
##$WDW= 1
##$XDIM= 32768
##$YMAX_p= 431097578
##$YMIN_p= -212190
$$ End of Bruker specific parameters
$$ ---------------------------------
##NTUPLES= NMR SPECTRUM
##VAR_NAME=  FREQUENCY,     SPECTRUM/REAL,   SPECTRUM/IMAG
##SYMBOL=    X,             R,               I
##VAR_TYPE=  INDEPENDENT,   DEPENDENT,       DEPENDENT
##VAR_FORM=  AFFN,          ASDF,            ASDF
##VAR_DIM=   32768,         32768,           32768
##UNITS=     HZ,            ARBITRARY UNITS, ARBITRARY UNITS
##FACTOR=    0.157963299565203, 1,           1
##FIRST=     4132.6476996994, 0,             0
##LAST=      -1043.33573715361, 0,           0
##MIN=       -1043.33573715361, -212190,     0
##MAX=       4132.6476996994, 431097578,     0
$$ Real data points
##PAGE= N=1
##DATA TABLE= (X++(R..R)), XYDATA
$$ [...]
15790a28396M7776L5977q734K3179L6701n3960j6994M9552Q113j3590o7901K73
15778h8004J0965K6424k428J6621N0592P0862n795l6282k0136M4805j0916l6381
15766B0327K2773j4748l7510r658L1345j1452l5227l1547l2609j3359L494N642
15754a02529L1841P8044J0981m5558J821L4226k5560P110L5023p1884k5558K7151
15742d4892J6170M0472k2753R3087j0008n8702l2550K9829J5010m8308j1488J2763
15730b1370M7266L5484P344j2314Q299L8148L9059k3531J5876L5108p0801r8001
15718E67j8916M8263j4128R552J923l7415p2846j9380L7538N6769J8735j3684
15706c022j5795k3114J7934P2558K6979q237l5888j1329k6506n8200q201J3842
$$ plain form
15790 -128396 -80620 -44643 -53377 -30198 6503 -47457 -64451 -14899 -6786 -20376 -88277 -88004
15778 -88004 -77039 -50615 -53043 -36422 14170 85032 79237 42955 22819 67624 56708 20327
15766 20327 43100 28352 -9158 -18816 12529 1077 -34150 -65697 -98306 -111665 -108171 -102529
15754 -102529 -70688 7356 18337 -27221 -25400 8826 -16734 -9624 25399 -46485 -72043 -44892
15742 -44892 -28722 11750 -11003 82084 72076 13374 -19176 10653 25663 -22645 -34133 -21370
15730 -21370 25896 61380 68724 56410 64709 102857 141916 118385 134261 169369 98568 567
15718 567 -18349 29914 15786 25338 27261 -10154 -83000 -102380 -64842 -8073 10662 -3022
15706 -3022 -18817 -41931 -23997 48561 75540 67303 31415 20086 -6420 -64620 -72821 -58979
15694e8979J0015M3800j4355n5533j3878K4073k3382q872K6685P6048O8379K763
15682G6764k2204L7571l8479n1114n0649Q501l7884n1869M088K4352L8457L2011
15670c0455K5335j1284l0545j5770l4747O393J5359O3211P2928m315m9334k4358
15658a7582N5803M5374j6126p0661p694k0361J292M7932N7759J8835l0151l1469
15646C2951p1190l1288N060J4286p821m537k8217k8033L2734M4831P675j4916
15634d8465K2705N1467k3134q1653r516K3113J7092K4148k359K1925J2074J3074
15622B0471m7219k1728N2709k4763j03045k3169K6573Q008N579L3123k3757j3424
15610a10642K8382M8935L4506n8997m3428K5027M0788L8560L7000l6366m5311
$$ plain form
15694 -58979 -48964 -5164 -19519 -75052 -88930 -64857 -88239 -97111 -70426 5622 74001 76764
15682 76764 54560 92131 53652 2538 -48111 -39610 -77494 -129363 -125275 -100923 -62466 -30455
15670 -30455 -5120 -16404 -46949 -62719 -97466 -91073 -75714 -12503 60425 56110 6776 -17582
15658 -17582 38221 83595 67469 -3192 -10886 -31247 -29955 17977 75736 94571 64420 32951
15646 32951 -38239 -69527 -64467 -50181 -58002 -62539 -90756 -118789 -86055 -41224 -33549 -48465
15634 -48465 -25760 25707 2573 -79080 -88596 -65483 -48391 -24243 -26602 -4677 7397 20471
15622 20471 -26748 -48476 4233 -20530 -123575 -146744 -120171 -112163 -106584 -73461 -97218 -110642
15610 -110642 -82260 -33325 1181 -57816 -101244 -76217 -35429 3131 40131 3765 -41546
15599d1546r857K1818J3721l697q636P988m7206j871O7895R245o342K5775k7476
15586a89m6043K4770j2047l7860l1830K2629k241k0694J2337J2759M3753j9976
15574e4632M3098K6808m8854q0775m5201L9608L2320j1582j392J6959J4069N245
15562f4329L132o409j589m6808j3475M4166J3216L4366Q3M4353m8503m3888n035
15549i0720k2166O1463N6436L2863N8447N1234q999N04M7047J2124n8021j701
15537A38511l3171o4756l6883j2970Q573M8253O5257m1129J6371l0921l0102K1600
15525D8633l580M215R602o5477m7029J6652K1321L7516j3591M110m213n4713k9607
15512g6161L7235L6795R946j3313n1100j779l1590L4808K4305P2144p0134m4461
$$ plain form
15599 -41546 -51403 -29585 -15864 -19561 -28197 -20209 -67415 -69286 -1391 7854 1512 27287 -189
15586 -189 -46232 -21462 -33509 -71369 -103199 -80570 -82811 -103505 -91168 -78409 -34656 -54632
15574 -54632 -11534 15274 -33580 -114355 -159556 -119948 -87628 -99210 -100602 -83643 -69574 -64329
15562 -64329 -61197 -67606 -69195 -116003 -129478 -85312 -72096 -37730 -37647 6706 -41797 -85685 -90720
15549 -90720 -112886 -51423 5013 37876 96323 147557 138558 139062 186109 198233 140212 138511
15537 138511 105340 40584 3701 -9269 -696 47557 112814 71685 88056 57135 27033 48633
15525 48633 45053 49268 58870 -6607 -53636 -36984 -15663 21853 8262 12372 8159 -46554 -76161
15512 -76161 -38926 -2131 7815 -5498 -56598 -58377 -89967 -55159 -30854 41290 -28844 -73305
15500g3305L6137o3215m7040Q694J2656j308r850Q4357K0612l1229J37J5073j1236
15487e9517J9136j275m3607l2741p371O3062R4648L6152o5989m6831k3982j1523
15475g9838N178n834l0078J4523O6371l5833J6244K4981k5411l4320k8963M7136
15463f5844M3020M6992N2942K1540m2437o8823L929J2240M218P8901L7682p1522
15451E2838J5800k1060o6825k6821l1492K1287L7347N8908l4159n5440M9264O431
15439F078K559R3642P745q5342l5788k7362L0671L2719j5722J6352m1527n9593
15427g5568M66L500M2974j5860k3381j113r78K4403j0264R052N9464j6427m5515
15414d9247r713K2255N5227K3331k9270Q256k3770l6527l2141J7765o291k7494
$$ plain form
15500 -73305 -37168 -100383 -147423 -138729 -126073 -127381 -137231 -52874 -32262 -63491 -63354 -48281 -59517
15487 -59517 -40381 -41656 -85263 -118004 -125375 -62313 32335 68487 2498 -44333 -68315 -79838
15475 -79838 -74660 -80494 -110572 -96049 -29678 -65511 -49267 -24286 -49697 -84017 -112980 -65844
15463 -65844 -22824 24168 77110 98650 56213 -12610 -8681 3559 7777 86678 124360 52838
15451 52838 68638 47578 -19247 -46068 -77560 -56273 -18926 39982 5823 -49617 -353 6078
15439 6078 8637 102279 110024 24682 -11106 -38468 -7797 24922 9200 25552 -15975 -75568
15427 -75568 -75102 -71602 -28628 -44488 -67869 -68982 -69960 -45557 -55821 -46769 12695 -3732 -49247
15414 -49247 -58960 -36705 18522 41853 12583 20839 -2931 -39458 -71599 -53834 -60125 -87619
15402h7619j9223l104M3836K4135o4254N91J2783L2830o924k9358k5196Q279j5208
15389a28432M4582N3461L5626k3658l7393L5795K8387J4684l8270q5138p584J8082
15377h9858J1551R0175K5305n8734m7081j763M0650p701k4594Q904j7564N9628
15365a1082l1872M171J8096o103r724K6566L5673N703L2271K9310n5872n1611
15353a4474j5677K8207m3069m6632J7046j9620k506N1984P0122j220j733o1631
15341c9203K622J6643K7366L6908P9044K3820o8834r1905J7062m3642n7809k7820
15329a25748K7141j3988K1975M3051k8862M2818k5281Q283J0032K0306J5955K0110
15317A5792R6646J8685q3231n4833m498l9331j2115P019k9178k6397P8424m764
$$ plain form
15402 -87619 -106842 -109946 -66110 -41975 -106229 -105638 -92855 -60025 -66949 -96307 -121503 -113224 -128432
15389 -128432 -83850 -30389 5237 -18421 -55814 -20019 8368 23052 -15218 -100356 -107940 -89858
15377 -89858 -78307 11868 37173 -21561 -68642 -70405 -29755 -37456 -62050 -53146 -70710 -11082
15365 -11082 -42954 -38783 -20687 -26790 -36514 -9948 25725 31428 63699 93009 37137 -14474
15353 -14474 -30151 -1944 -45013 -91645 -74599 -94219 -96725 -44741 25381 24161 22428 -39203
15341 -39203 -36581 -19938 7428 44336 123380 147200 78366 -13539 3523 -40119 -97928 -125748
15329 -125748 -98607 -112595 -90620 -47569 -76431 -33613 -58894 -50611 -40579 -20273 -4318 15792
15317 15792 112438 131123 47892 -6941 -11439 -50770 -62885 -55866 -85044 -111441 -33017 -37781
15305c7781O818J3635o331M319m714j791j4031l1963k1036N723N279L909L9032
15292c8932j2335K8898k2752l0033k2483k7446L883J1685m459m217j8094O4005
15280g2280m7K4874k969j6663K155m2222q412M1018L8973M6980M294k8437n8475
15267g1211N506j0852K0732L2579J1415n242M1176L2241l6247p4193k2448j6320
15255i2864K9857J8529J3811J4875J6824L289k7681K8005n435J3416o413J5722
15243B1935M8887n2639n5382J9247N3855N072l3560k6328J3483N6133L1866j5439
15231F7130J955M939l7962m1038k6639M1742M2090j7601m0124J53o39p1298p721
15218h5013Q5540j0904p3971j224n065J9354l8775N2115K5310J1321L6663k5750
$$ plain form
15305 -37781 -30963 -17328 -23659 -19340 -24054 -25845 -39876 -71839 -92875 -87152 -81873 -77964 -38932
15292 -38932 -51267 -22369 -45121 -75154 -97637 -125083 -121200 -109515 -113974 -118191 -136285 -72280
15280 -72280 -72327 -47453 -50422 -67085 -64930 -107152 -115564 -74546 -35573 11407 15701 -12736 -71211
15267 -71211 -65705 -76557 -55825 -23246 -11831 -17073 24103 56344 20097 -54096 -76544 -92864
15255 -92864 -63007 -44478 -30667 -15792 1032 4321 -23360 4645 -790 12626 6213 21935
15243 21935 70822 18183 -37199 -17952 35903 40975 7415 -18913 -5430 50703 82569 67130
15231 67130 69085 74024 36062 -4976 -31615 10127 52217 34616 -5508 -5355 -5994 -77292 -85013
15218 -85013 527 -10377 -84348 -85572 -90637 -71283 -110058 -57943 -32633 -21312 15351 -10399
15206a0399j7923J9496j3428L027q504J6522L4448m641n3381l9104N261r308R207
15193f8727J2918K7003l380l613N2515M8163J3114l6674Q61j075m711J9357k6000
15180B9751R262j5310N0755L267l3825p532J2387k4008j2198L306J7860l647n6134
15167b6066L3326K8721J6886k4102k3329k5781P298L3058L0874j0905n3722n548
15155a9290L8707K3032m581l7066L5556P3677j1235o8004K6831m1487o037j9415
15143i312k0677n0362Q824j3536k6717L5386Q3428J7449J8784k3247k4941K1813
15131A6892L6293m3413p471M1424L7565n992l7872p6789k9090M5814J9923J8769
15119A6053k4113m3762J5549K9780L9776M5465j0956m7265l0279K7036M225M7308
$$ plain form
15206 -10399 -28322 -8826 -22254 -19227 -27731 -11209 23239 18598 -34783 -73887 -68626 -77934 -68727
15193 -68727 -55809 -28806 -32186 -35799 16716 64879 77993 41319 42180 41105 36394 55751 29751
15180 29751 39013 23703 74458 77725 43900 36368 48755 24747 12549 15855 33715 30068 -26066
15167 -26066 7260 35981 52867 28765 5436 -20345 -13047 20011 50885 39980 -13742 -19290
15155 -19290 19417 42449 37868 802 36358 110035 98800 30796 57627 16140 10103 -9312
15143 -9312 -29989 -80351 -71527 -85063 -111780 -76394 7034 24483 43267 20020 -4921 16892
15131 16892 53185 9772 2301 43725 81290 75298 37426 -39363 -68453 -22639 -2716 16053
15119 16053 -8060 -51822 -36273 -6493 33283 78748 67792 20527 -9752 17284 21509 68817
15107F8817o1043l2108K4239q607j2426M3106m0565m7437J4443Q3083J1864m1714
15095A652m801K5258l6259J4523l9309m013L1796J05315L4808n3589k9920O212
15083E1673K2888O7610M0509j525o4727l0786k981K4002m9836j3825L3337N9457
15071A35796n141l8456j769J0566k6830n1378N3547M2880n4210k3297m5313k2376
15059b5981R543k683J7191J6251N225k6742j418K6436N9294N1616l9433o4280
15047B5019j7596M5887L3337j4954k44j3760l0419J2855N831L2853m1152k6834
15035A0823m073J3439K4271p503M555R158j8117L5914J8328K3582K6192m3300
15023I3269k5435k0008P9432M7p9612K5240L1588P8471l2157j6293O5199K1154
$$ plain form
15107 68817 7774 -24334 -95 -8702 -21128 21978 -18587 -66024 -51581 31502 43366 1652
15095 1652 -3149 22109 -14150 373 -38936 -42949 -11153 94162 128970 75381 45461 51673
15083 51673 74561 142171 182680 181155 116428 85642 82661 106663 56827 43002 76339 135796
15071 135796 130655 92199 90430 100996 74166 22788 76335 119215 65005 41708 -3605 -25981
15059 -25981 -16438 -19121 -1930 14321 19546 -7196 -8614 17822 77116 128732 89299 25019
15047 25019 7423 53310 86647 71693 71449 57689 27270 40125 45956 78809 37657 10823
15035 10823 6750 20189 44460 36957 41512 50670 32553 68467 86795 110377 136569 93269
15023 93269 67834 47826 127258 127305 47693 72933 104521 182992 150835 134542 199741 220895
15011B20895j6997l1192N556K2731R6753L5313j4015j4952N6272o1N2903J04881
14999E18087J35409Q0108J05824J80280J82567K97009N52699P01060J055251J690358
14989E498652K792550M622230O446143P802367P024130K674586n731304j0163869
14981B0965485o582707l470559j926062j201487q48044o56631o12090p31254o66388
14972D270263o04710n45803l72248l03806l33439k52245k34441j69229j42167
14963A312175j15284o5147q8846j04690j64904j12247n6347J9267j8522r8609
14953E06846l3858j7861n625J6524k0419p4419p2237m501k0286n7965p910L7229
14941B45518Q858K9084n0488m1968p2818J8226J3455L9092J983m8792k8232M9749
$$ plain form
15011 220895 203898 172706 178262 200993 297746 333059 319044 304092 360364 360303 413206 518087
14999 518087 653496 733604 839428 1019708 1202275 1499284 2051983 2753043 3808294 5498652
14989 5498652 8291202 12913432 19359575 27161942 34186072 36860658 31129354 20965485
14981 20965485 14382778 10912219 8986157 7784670 6936626 6279995 5667905 4936651 4270263
14972 4270263 3665553 3119750 2747502 2443696 2110257 1858012 1623571 1454342 1312175
14963 1312175 1196891 1131744 1042898 938208 773304 661057 604710 623977 605455 506846
14953 506846 472988 455127 449502 466026 445607 371188 298951 294450 274164 216199 208289 245518
14941 245518 254376 283460 232972 191004 118186 136412 149867 188959 190942 142150 113918 163667
14929A63667n4404p7825p526j1500N8969r061m5679J5179k3789j7259M3795L2918
14917F7485j4589N3466K5114l2634m2923m3385k1201j8172k9413M3095J5149n3143
14905e1151K9160R069M1033L144M9519K6196L0822j1771m2445Q716N740o3219
14893C4813j7042L0267L2264L720n7885o3911m9926O492L5627l5159j3872L2887
14881f1725M3399k4556j5174N2354K9205Q514R812L5621j1576J7039j33L447k8943
14868E7284M6618r781J3725j4498l3788K078q743l1072J4355j6307K4136q2355
14856c8348m1998j0082J5393K9155M8745L9304K3591J013k7777k4157o4652k1800
14844g1613O2167j3606j5785n9114L415Q8514K8280k7944J3825m51K429j2873
$$ plain form
14929 163667 109263 31438 23912 12412 71381 62320 16641 31820 8031 -9228 34567 67485
14917 67485 52896 106362 131476 98842 55919 12534 -8667 -26839 -56252 -13157 1992 -51151
14905 -51151 -21991 -12922 28111 31255 80774 106970 137792 126021 83576 92292 98032 34813
14893 34813 17771 48038 80302 84022 26137 -37774 -87700 -81208 -45581 -80740 -94612 -61725
14881 -61725 -18326 -42882 -58056 -5702 23503 32017 41829 77450 65874 82913 82780 86227 57284
14868 57284 103902 94121 107846 93348 59560 61638 52895 21823 36178 19871 44007 -38348
14856 -38348 -80346 -90428 -75035 -45880 2865 42169 65760 66773 38996 14839 -49813 -71613
14844 -71613 -9446 -23052 -38837 -97951 -94536 -6022 22258 -5686 8139 7688 10117 -2756
14832b756K6285K4394m9964k0315j0254j6309J5797M1878J2972l8411L4341N9196
14820G6854k0593l0740k0906l0637k2084J8433J7716l770j2458J2302m352n5818
14808g6053L2232M8431J2524n316l1362l2382j1249q806M2841O5143K0908j380
14796E5531j5084k6645k3566j2990j6869l0960p131L2208l3481n7844L5245Q3373
14784a8213R555j2161J3000Q609Q3222L7453q932q2669o1498J3805J56M36P88
14771a6449j9418n864O1615q521l2787j3057j8278J4507K6902j2241j3288K5780
14759a1099N175J890M3784N7426n1444n4343n913j9037J904J8060K130j7608j2257
14746d1332J8301m0018p0445K1530O4303k3595n8784K7797Q709J9019l475m663
$$ plain form
14832 -2756 23529 47923 -2041 -22356 -32610 -48919 -33122 8756 21728 -16683 17658 76854
14820 76854 56261 25521 4615 -26022 -48106 -29673 -11957 -15727 -28185 -15883 -20235 -76053
14808 -76053 -43821 4610 17134 11818 -19544 -51926 -63175 -71981 -29140 36003 56911 55531
14796 55531 40447 13802 -9764 -22754 -39623 -70583 -77714 -45506 -78987 -136831 -101586 -18213
14784 -18213 -8658 -20819 -7819 790 84012 121465 112533 29864 -31634 -17829 -17673 -17237 -16449
14771 -16449 -35867 -41731 19884 11363 -21424 -34481 -52759 -38252 -11350 -23591 -36879 -11099
14759 -11099 -5924 -4034 39750 97176 45732 -8611 -14524 -33561 -31657 -13597 -11467 -29075 -41332
14746 -41332 -23031 -63049 -133494 -111964 -47661 -71256 -130040 -102243 -93534 -74515 -77990 -82653
14734h2653o209L7467j0818K9385K7861J5248K3446k6026l3863k1703N114M1912
14722h39K871n138n1325n507K0140N3048j8895K9756J9025K297N975k4440l7241
14709a0273n8376k8341J1496L5160L7127q585P176n6L091K042J7367j468k9866
14696b3506K3051o198J9048L929M9636K9627l1809n8037n5823j2640J7708J1668
14684c3346J3697n0623j8448K2333L3695k905J5788O2274m4139o7661K0262M1240
14672g833R415N729k9941k5165L2122Q521k8381K1772O8464O9064J3188j6454
14660A20501k2867N1722p569l5912R902l6998k1387j7810l6649O731l956L868
14648I576N3770o3314j8740M4358m631l1499m0360N859k8990j8309Q3588M3042
$$ plain form
14734 -82653 -88862 -51395 -62213 -32828 -4967 10281 33727 7701 -26162 -47865 -42751 -839
14722 -839 2032 -3106 -54431 -59938 -39798 13250 -5645 24111 43136 45433 51408 26968 -10273
14709 -10273 -68649 -96990 -85494 -50334 -13207 -21792 -14616 -14672 -11581 -9539 7828 6360 -23506
14696 -23506 -455 -6653 12395 16324 65960 95587 63778 5741 -50082 -62722 -45014 -33346
14684 -33346 -19649 -70272 -88720 -66387 -32692 -35597 -19809 42465 -1674 -69335 -49073 -7833
14672 -7833 1582 7311 -22630 -47795 -15673 -7152 -35533 -13761 54703 123767 136955 120501
14660 120501 97634 149356 141787 105875 115777 78779 57392 39582 2933 9664 5708 9576
14648 9576 63346 32 -18708 25650 21019 -10480 -50840 -44981 -73971 -92280 -8692 34350
14636C4350p4471m5549L995o666j2760m540L9375M4588Q739K4554N0746K900k6707
14623C8554o4396K0448N2400k3485l865L6782K1486m4898k1782m7146p166L0204
14611a2864m9207j5846j814L7380r497j3992J8490N2618J2793p8821q6869R657
14599a37972M1500L5981J6539L0250J7653J3330L9262P0315Q215L94l969r2166
14587C9332p6782n2320J4688O2630L4207o235p0501j758k1820K5685M0999J7417
14575E542l0692k0453p606J6512L1365P0729J2043n9639n2971O219j7203o9464
14563a15618M2078K8023K2035J4501n0616J3147J6074j8193l3347j5242R88M0948
14551e5222J6446j4588m3253R766M2417M562k6795J5652J6758k4810J9905j5951
$$ plain form
14636 34350 -40121 -85670 -81675 -88341 -101101 -105641 -66266 -21678 -12939 11615 62361 65261 38554
14623 38554 -25842 -5394 47006 23521 19656 56438 77924 33026 11244 -35902 -43068 -12864
14611 -12864 -62071 -77917 -79731 -42351 -51848 -65840 -47350 5268 18061 -60760 -147629 -137972
14599 -137972 -96472 -60491 -43952 -13702 3951 17281 56543 126858 135073 135467 131498 39332
14587 39332 -37450 -89770 -75082 -12452 21755 15520 -54981 -56739 -78559 -52874 -11875 5542
14575 5542 -25150 -45603 -53209 -36697 -5332 65397 77440 17801 -35170 -28951 -46154 -115618
14563 -115618 -73540 -45517 -23482 -8981 -59597 -46450 -30376 -48569 -81916 -97158 -96170 -55222
14551 -55222 -38776 -53364 -96617 -86851 -44434 -39872 -66667 -51015 -34257 -59067 -39162 -55113
14539e5113O1837N8747J4914M0552M90p0520m8400J8870O988m5413m7J7866P789
14526H560l849L7026j9612m1271k7448j4343K9289Q6804M6442q0457r311O130
14514A7960M691N555M46R781L7894l0160j6599j3597o9856j1541o581N5686o424
14501b2745J7371j2450r81k1691k9583Q648L7058N251r156j6748J740O569O863
14488b9854J4156k783l233L9095K4177L0780q968n132J3196m1791j7918K4916
14476C6641p0396L755N2208l223K2245J2854m4196L2714N0342k4329K4982l427
14464I0170K0445N3211l4590n6936r0947R079q819J3530m4839M775o709j1590
14452f3220N3085q011o6003k6507r096R317Q5461O9258O1997O7602k6803p8588
$$ plain form
14539 -55113 6724 65471 80385 120937 121427 50907 2507 21377 28365 -17048 -17095 771 8560
14526 8560 4711 41737 22125 -19146 -46594 -60937 -31648 55156 101598 21141 11830 17960
14514 17960 22651 28206 28652 38433 76327 46167 29568 15971 -53885 -65426 -72007 -16321 -22745
14501 -22745 -5374 -17824 -18805 -40496 -70079 -61431 -24373 -19122 -28278 -45026 -43286 -36717 -29854
14488 -29854 -15698 -18481 -21714 17381 41558 72338 63370 58238 71434 29643 11725 36641
14476 36641 -33755 -30000 22208 18985 41230 54084 9888 42602 92944 68615 93597 90170
14464 90170 110615 163826 129236 72300 -18647 -9568 -18387 -4857 -49696 -44921 -51630 -63220
14452 -63220 -10135 -18146 -84149 -110656 -119752 -110435 -24974 44284 106281 173883 147080 68492
14440F8492j5993l4044j1218O8781N932j7125m7514l619O735M4785K1130M5880
14428A32222k1507n0135j2192K9476K9409K6292N6678r433P503M8841J8206R898
14416B65258m3805q7580l2957q818k5582j2067k2660j4740M7767j4049k6794m330
14404A9643J3245K721p7883l7741M4523J8216M579l5580q921M0991N6185R72L657
14391D4607k153O1641L6461L2051m3986l0385r338l4610N444n4851k3814l6416
14379e5349l6318L7763P1482j5798k3254Q7558M1649M537j8387m8086o5739j0142
14367c0084l3855p158R5969K5047k8374n7864l1708L3371K2265l973l6072l6119
14355h8555j342M0615N0487L9411k7937p58N4801p8951n0041J0500j3304k3007
$$ plain form
14440 68492 52499 18455 7237 76018 81950 64825 17311 13692 20427 65212 86342 132222
14428 132222 110715 60580 48388 77864 107273 133565 190243 180810 188313 237154 255360 265258
14416 265258 221453 133873 100916 92098 66516 54449 31789 17049 64816 50767 23973 19643
14404 19643 32888 35609 -42274 -80015 -35492 -17276 -12697 -48277 -57198 -16207 39978 40950 44607
14391 44607 42454 104095 140556 172607 128621 98236 88898 54288 59732 4881 -18933 -55349
14379 -55349 -91667 -53904 17578 1780 -21474 66084 107733 112270 93883 45797 -19942 -30084
14367 -30084 -63939 -71097 24872 49919 21545 -36319 -68027 -34656 -12391 -16364 -52436 -88555
14355 -88555 -89897 -49282 1205 40616 12679 11921 66722 -12229 -62270 -51770 -65074 -88081
14343h8081L0972Q2347L422K2675O4182k1931o2847K35m9231n3248o1936K4367
14331a09074O3112K7167J0038l5783J851m8856o980l351O7181O2197j3993K5154
14319C8663j461n3520O8469k4363m9311n787M8995p981j6504k298J7740L9210
14307E1852l2926m6434q447L0407L5830j9902o645N678O0499J8204j2979k252
14295G2885m3048o594m0633j1546j8604n091K7067q252k3104J3314L0927k329
14283a5008J3795r443K2232L3641m309p4496j8677m173K9664J2558j308N8745
14271D3221N0849q773J0903L6392M1788l9527o4370j8869l0692J571l5321m6501
14259e9329m487N0437O3260L8178K8658o7261K341K3813M0289J8824n2618l0483
$$ plain form
14343 -88081 -57109 25238 28660 51335 115517 93586 30739 30974 -18257 -71505 -133441 -109074
14331 -109074 -45962 -18795 -8757 -44540 -42689 -91545 -98525 -101876 -34695 27502 13509 38663
14319 38663 37202 -16318 52151 27788 -21523 -27310 21685 13704 -2800 -5098 12642 51852
14307 51852 18926 -27508 -35955 -5548 30282 10380 3735 9413 69912 88116 75137 72885
14295 72885 29837 23243 -17390 -28936 -47540 -52631 -25564 -33816 -56920 -43606 -12679 -15008
14283 -15008 -1213 -10656 11576 45217 40908 -33588 -52265 -56438 -26774 -14216 -15524 43221
14271 43221 94070 85297 96200 132592 174380 134853 70483 51614 20922 22493 -12828 -59329
14259 -59329 -63816 -13379 49881 88059 116717 49456 51797 75610 115899 134723 82105 51622
14247E1622l140J3054n03o721j1819K5305m1013o9213j3469j762K0506K5809p925
14234a9269m8210p476j6404J2314m4461J986P7393Q4878L2140o3802j195K6572
14222C4466j4127k0010k6400m960N1615P095k2990K1994L729m3025K5485L4213
14210D7085q736l61J930r070L7213k1091m0398o7005L2125K2570n301l260j4894
14197b9193o2391L168N4474k777l6155L5154K335k2166O1025O0638m3270j5975
14185D867M6082L7828n8677n716l8337P897k9926j6064L0821j3129l1987L478
14173f2863M1581k916L9885M492J2789L4702l9889M3429J11054p9849q6862k0863
14161e310N0333K2909k390o631l5379l8045r346o5545j8722P7681j5539P9052
$$ plain form
14247 51622 48482 61536 61033 54312 42493 67798 26785 -42428 -55897 -57659 -37153 -11344 -19269
14234 -19269 -67479 -74955 -91359 -79045 -123506 -121520 -44127 40751 72891 9089 7894 34466
14222 34466 20339 329 -26071 -31031 20584 27679 4689 26683 30412 -12613 12872 47085
14210 47085 38349 37988 39918 30848 68061 46970 6572 -60433 -28308 -5738 -11039 -14299 -29193
14197 -29193 -91584 -88416 -33942 -36719 -72874 -37720 -35385 -57551 3474 64112 20842 4867
14185 4867 50949 88777 30100 24384 -13953 -6056 -35982 -52046 -21225 -34354 -66341 -62863
14173 -62863 -21282 -24198 15687 20179 32968 67670 27781 71210 182264 102415 15553 -5310
14161 -5310 45023 67932 65542 58911 23532 -14513 -23859 -89404 -108126 -30445 -45984 33068
14149C3068N0549n0685L318J4238J231k6658R50M4738m0452j0544K2783j341j1450
14136B9745j7730j6283L3619K8475J3833q434k413p423M085L8310K0412j1956
14124A04240L6322K3597O787O6093L3909j9602j1544O1042M5974J9179M2004o678
14112D01323m3956l0757K5138l1231l0980O0734k2042k8182J2008l1197q6432
14101A94426j9865M5677n1275p3898J7973j1564q691j0554J8174m8178R577L7524
14089I9326Q345K0777k2670o1754J4531J6193K6289L662j1830J17n4533l2466
14077E987k1651M3908P0609K0566K4591k6879k7859j3653J4374k0300l3761n7818
14065b1886K6499N130j5639k0173o119P627P9042j0194k106m3453L395j3610K660
$$ plain form
14149 33068 83617 32932 36250 50488 51719 25061 26011 70749 30297 19753 42536 41195 29745
14136 29745 12015 -4268 29351 57826 71659 63225 60812 53389 57474 95784 116196 104240
14124 104240 140562 164159 170946 237039 270948 251346 239802 300844 346818 365997 408001 401323
14112 401323 357367 326610 351748 320517 289537 350271 328229 300047 312055 280858 194426
14101 194426 174561 220238 168963 95065 113038 101474 92783 82229 100403 52225 61802 99326
14089 99326 107671 128448 105778 44024 58555 74748 101037 104699 92869 92986 38453 5987
14077 5987 -15664 28244 98853 119419 144010 117131 89272 75619 89993 69693 35932 -21886
14065 -21886 4613 9743 -5896 -26069 -32188 -24561 54481 44287 42181 -1272 2123 -11487 -8827
14052h827P1026J4398k1529K706l2430o8816m956M557L1194k3494k6746o0818
14040a23735P7012L2782J1636k7728k682K2181L5394O444R036m844J6506K6608
14028G8610J4781m8959o318j3903M424o36k1373q430N1979K9006p419J8933n9157
14015C1538l6538J6036K4451j0590K2435M842k9212m7884R605N3150J6156p687
14003D6302O4057l5858k8341J0217K0324L0320l6872p9568N081L7724N4408o2732
13991B5062l1053K2771K5587M2907K4713J1103q481N36j538L0385J7921l4516
13979A25397n109j559J0670L7737K301k7644n9071p955L7597l5472R798R6226
13967A82916M5568o0656q1448j2287J4354j965K2962M1969j8407J7987J914j6531
$$ plain form
14052 -8827 62199 76597 55068 57774 25344 -43472 -48428 -43871 -12677 -36171 -62917 -123735
14040 -123735 -46723 -13941 -2305 -30033 -32715 -10534 24860 31304 40340 35496 52002 78610
14028 78610 93391 44432 38114 24211 28635 27999 6626 -1804 50175 79181 71762 90695 31538
14015 31538 -5000 11036 35487 24897 47332 52174 22962 -24922 -15317 37833 53989 46302
14003 46302 110359 74501 46160 56377 76701 107021 70149 -9419 -4338 33386 87794 25062
13991 25062 -5991 16780 42367 85274 109987 121090 112609 113145 111607 141992 159913 125397
13979 125397 120288 118729 129399 167136 169437 141793 82722 74767 112364 76892 86690 182916
13967 182916 228484 167828 86380 74093 88447 86482 109444 151413 133006 150993 152907 136376
13955A36376m2856l2606M3291M6310j9948l6560n4173j6778M7284M0266n2020
13944E8586m0706k8036M1051M0465K495l1200L5216K8409m4192n8519k6460O0229
13932C7338O2986Q3834L512l0074k8123P734J2049R314J1591M8004N4280J11730
13920C84175Q9997N4113P7674l460k6194M1213J8017P397K2700M0098M9450J7440
13908G72620M1901Q1116Q837N9689K1574k4931p0120p666o0826n0500m2236k9309
13896G00149j0268o7289o4433k6873l8579o9001j4191p0994m3493p827k6314j6368
13884B44519L5525M005k9480n642j0696J6470N228K5257k0335m3545n7619o3507
13872A00180o412K8109K7982N5279p096l5892m7198M0155J6872L0976n8570l9083
$$ plain form
13955 136376 93520 60914 104205 150515 130567 94007 39834 23056 70340 110606 58586
13944 58586 17880 -10156 30895 71360 73855 42655 77871 106280 62088 3569 -22891 37338
13932 37338 100324 184158 187670 157596 129473 137207 149256 158570 170161 218165 272445 384175
13920 384175 474172 528285 605959 602499 576305 617518 635535 642932 665632 705730 755180 772620
13908 772620 814521 895637 904474 964163 985737 960806 890686 883020 822194 771694 729458 700149
13896 700149 689881 622592 558159 531286 492707 423706 409515 338521 295028 287201 260887 244519
13884 244519 280044 284049 254569 248927 238231 254701 259929 285186 264851 221306 163687 100180
13872 100180 93768 121877 149859 205138 198042 162150 114952 155107 171979 202955 144385 105302
13860A05302L8548J9013l2290K8845O160n7373m4536k8238J8262M5007O1510Q850
13848A69060k2646q95j8777J4648k8551n7383l9172m493r25j1240R65q561L3473
13835B5503K1255K0732L3186P580J0399l3280k52K596k3766m0747k5821K2753
13823B0138K4008n450p3582p576P8878L6221j7176N4831L4902q3k9255j9091K6488
13810A23253m7765m2551n5983P07K0575P3812J1396O947j7255j6149J5803P660
13798H0450r9539m2838J7204O5361o546j2385O7912J2267j3172O5597J9442m5624
13786A08129j0521l0768m6146m615J1977L3991N1893K401n766K8694l2121N1323
13774A58471K2215j6647m9530n0512N17o655J8203K3896k520n9115L9811L6168
$$ plain form
13860 105302 143850 162863 130573 159418 165578 108205 63669 35431 53693 98700 160210 169060
13848 169060 146414 145519 126742 141390 112839 55456 16284 11791 10866 -374 591 -7970 25503
13835 25503 46758 67490 100676 108256 118655 85375 85123 87719 63953 23206 -2615 20138
13823 20138 44146 38696 -34886 -42462 36416 72637 55461 110292 145194 145111 115856 96765 123253
13810 123253 75488 32937 -23046 -22339 -1764 72048 83444 90391 73136 56987 72790 80450
13798 80450 -19089 -61927 -44723 20638 14092 1707 69619 81886 68714 134311 153753 108129
13786 108129 97608 66840 20694 16079 28056 62047 113940 116341 110575 139269 107148 158471
13774 158471 180686 164039 114509 63997 64514 57859 76062 99958 97438 38323 78134 114302
13762A14302j6594O0369L4371k3300l9090K0314L0025n7423K2093N6954l7789
13751A64232L340j7590l5416l4916k804K4561J1793r364n664j0218k1567n3825
13739A2562K9577L9573M425k8280o228M6506P4323N729j03661P764K7805K3692
13727A33787l4549k1198l6731N730J4896j4167K1756k6619K2828J7948O2559l1344
13715A14896N91L8766o0777l8652K8636M0344k056n5439k8092N2365P241K1876
13703A19699l9605k4055K3612K974L4802j3719j8700n309K8573J7558j0995k2583
13691I2252K1874L9966j1056l8760J7246M9895J5100J8838l7985J7557M4661N1012
13679B80600k3900k3897O8929Q8799L7419L4216K4825N1097N1088K2897j6079
$$ plain form
13762 114302 97708 158077 192448 169148 130058 150372 180397 122974 145067 202021 164232
13751 164232 167572 149982 114566 79650 76846 101407 113200 103836 98172 87954 66387 12562
13739 12562 42139 81712 86137 57857 51629 98135 172458 178187 74526 82290 110095 133787
13727 133787 99238 78040 41309 47039 61935 47768 69524 42905 65733 83681 146240 114896
13715 114896 115487 154253 93476 54824 83460 123804 121748 66309 38217 90582 97823 119699
13703 119699 80094 56039 79651 82625 117427 103708 85008 79699 108272 125830 114835 92252
13691 92252 114126 154092 143036 104276 121522 171417 186517 205355 167370 184927 229588 280600
13679 280600 256700 232803 301732 390531 427950 462166 486991 538088 589176 612073 595994
13668E95994L1781K8825L2866l501l7991p8546m2755M53o1503p5266J968J728
13656C94053o3703j6657o4054N294L0414j1175M528j1711K4908M666P593K4829
13644C28985j4195n5787l887N6058N9718N8575j1549N517J4424n636L2880L7750
13632E02853k0459k7043k0475k6268k1320n6504o168j7880l632L7212r903J5304
13620C45717O6150n3242n6790O369k7431j5317k0133k6151l1306R53L6495k2212
13608B03102L2777p202m6814M970m519Q781n5681M770M3860L8891l0184k2575
13596A70176k6958l499P6565L2323j6503N07j0080K8338K5395k2188P43m4611
13584B10208L979P3078L0739p0561k4238M63J6050K6893J5143m309j1454l8350
$$ plain form
13668 595994 627775 656600 689466 685965 647974 569428 526673 527126 465623 390357 392325 394053
13656 394053 330350 313693 249639 254933 285347 274172 278700 266989 291897 296563 304156 328985
13644 328985 314790 259003 255116 311174 370892 429467 417918 423435 437859 432223 465103 502853
13632 502853 482394 455351 434876 408608 387288 330784 324616 306736 303104 340316 330413 345717
13620 345717 411867 358625 301835 308204 280773 265456 245323 219172 187866 188819 225314 203102
13608 203102 235879 228677 181863 186833 182314 191095 135414 140184 184044 222935 192751 170176
13596 170176 143218 139719 216284 248607 232104 232611 222531 250869 276264 254076 254819 210208
13584 210208 214187 287265 318004 247443 223205 223668 239718 266611 281754 277445 265991 227641
13572B27641L9997M8160J1438L5642n2596r9378L1503L3542N1204J348n4021P67
13560B75247K7280m7381l3003L3022n8753l0343K709J9334O1246P420k0526n84
13548B35668n2064j3840K6769L2791L4268J9397o7437m0931j9400m3064k2647
13537H9510J3898M1574j3160J5035P468N4535J0122K1009j5256j1634r197n136
13525A98768K5671m5817l5826k048L8665o4319j1373N8221M8311L0556j3840Q606
13513B35575M659P244l9408p3599j1310l46J5431K2665l9602K8580K5935k8440
13501A47384K6385L2999j6686N920N6130K9908R206Q3864M3591M1225O1524l1035
13489D90415K011M7895K7447J7577Q0192j4277j4035j6903o3132o2795n1496L1973
$$ plain form
13572 227641 267638 315798 327236 362878 310282 210904 242407 275949 327153 328501 274480 275247
13560 275247 302527 255146 222143 255165 196412 166069 168778 188112 249358 256778 236252 235668
13548 235668 183604 169764 196533 229324 263592 282989 215552 174621 155221 112157 89510
13537 89510 103408 144982 131822 146857 154325 208860 218982 239991 224735 213101 203904 198768
13525 198768 224439 178622 142796 140748 179413 115094 103721 161942 210253 240809 226969 235575
13513 235575 240234 247478 208070 134471 123161 122815 138246 160911 121309 149889 175824 147384
13501 147384 173769 206768 190082 196002 252132 282040 291246 375110 418701 459926 521450 490415
13489 490415 492426 540321 567768 585345 665537 651260 637225 620322 557190 494395 442899 474872
13477D74872l8081l6714k6158k5383R732O7365L9432k7962k1361n5909p6544K9031
13465C12320p425o7565K332K1533L787L012m1196j7058j9102r702j9555K2572
13453A83953J1610k7768m0447k086k8483j3452L4923j3659L1933J0213L2720l904
13441A75553K1888j2753n6949M2034q516l7194n3795L2253J9574j7247l0590J1779
13429H6037L1737K6215k4612R418k9530l1674o044M9006O2215J1718K7125M3057
13417B54668n8485l3388J8601j9091k7710K1477J1243R15n0598k986p399o40m8556
13404E8051p488j0842p013J1431M4608J2349j7942J3723J0450p123L4891m408
13392A30687m8782j1915L6023N335J1002J9430m1162l0591N9717j0471k8382j5726
$$ plain form
13477 474872 436791 400077 373919 348536 358268 425633 465065 437103 415742 359833 283289 312320
13465 312320 304895 237330 239662 261195 264982 267994 226798 209740 190638 180936 161381 183953
13453 183953 195563 167795 127348 125262 96779 83327 118250 104591 136524 146737 179457 175553
13441 175553 197441 184688 127739 169773 161257 124063 70268 102521 122095 104848 74258 86037
13429 86037 117774 143989 119377 128795 99265 67591 61547 110553 172768 184486 211611 254668
13417 254668 196183 162795 181396 162305 134595 156072 167315 168230 117632 114646 107247 106607 58051
13404 58051 50563 39721 32708 44139 88747 101096 83154 96877 107327 100204 135095 130687
13392 130687 81905 69990 106013 111348 122350 141780 100618 70027 129744 119273 90891 75165
13380G5165R770N87p928N279K9726j9872k3637k6511J4886O7550M0111k1798k5251
13367A18077N032j4362P391L2401K1613R211O3043m9259p7397L5020R648n8418
13355A02000n180K226L7743n3093M3277J178R139K3161N177l456k5340n8415q269
13342G0148K9914M1374P494M7328m4801p8436j0748k104K4600O2140j6678n186
13330A25045r715l0559m9850K5653K4717K7539K2058r650L625j1114J3226J0426
13318A41401m0150M0782J7231o3381o0834O940R3404R1856m152m3024l3833m8982
13306I7258l2470L5531R859J9619N2887q20o3755L2954R5815n713k7587P803K948
13293B24329l142p0704o7345K1362Q17Q593K0284J7608J4025L3653M03l0963Q073
$$ plain form
13380 75165 84935 85522 77594 82873 112599 92727 69090 42579 57465 125015 165126 143328 118077
13367 118077 123109 108747 116138 148539 170152 179363 242406 193147 115750 150770 160418 102000
13355 102000 96820 99046 136789 83696 126973 128151 137290 160451 165628 162172 136832 78417 70148
13342 70148 100062 141436 148930 196258 151457 73021 62273 60169 84769 146909 130231 125045
13330 125045 115330 84771 34921 60574 85291 112830 134888 125238 128863 117749 130975 141401
13318 141401 101251 142033 159264 95883 35049 41989 135393 227249 223097 180073 146240 97258
13306 97258 64788 100319 110178 129797 182684 181864 118109 151063 246878 241165 213578 221381 224329
13293 224329 221187 150483 83138 104500 105317 113910 134194 151802 165827 199480 199883 168920 176993
13280A76993K3865j8685O261M8636K1377l2322l3698k1235o9929K3358K9767P483
13268A61871Q768K2040N5379k5338o3598q902M7450j1054m754p8053l4742K0449
13256H9516N2795K8931J6463M0150L15k9300q200n3349L269J2457L8146M6791
13244B37984L0096l2692m3364p0O2761j2062k332L6532j7627n4285O308k8377
13232A82872j3172j4695O3321q220m1637m1192J0711K6550p079l3061L3288M3599
13220B01285j8461j4548m4920j2285N9720L1038J8481k2351j10K504L3391k0585
13208B13159k0262M6402J3528p9099m0133L2831J2541J1017N7362O763o3082L5424
13196B26451j4204k5463j5853n1095O1035K9085k012N9643K7374j6831K8090M0728
$$ plain form
13280 176993 200858 182173 188434 237070 258447 226125 192427 171192 101263 124621 154388 161871
13268 161871 170639 192679 248058 222720 159122 150220 197670 186616 181862 103809 69067 89516
13256 89516 142311 171242 187705 227855 228170 198870 190670 137321 140590 153047 191193 237984
13244 237984 268080 235388 192024 191954 254715 242653 240321 276853 259226 204941 211249 182872
13232 182872 169700 155005 218326 210106 168469 127277 137988 164538 157459 124398 157686 201285
13220 201285 182824 168276 123356 111071 170791 201829 220310 197959 197849 200353 233744 213159
13208 213159 192897 239299 252827 173728 133595 166426 178967 189984 247346 254109 191027 226451
13196 226451 212247 186784 170931 119836 180871 209956 207944 267587 294961 278130 306220 346948
13184C46948k5843n5184n2040q567n852l6085O5147m7413o842M3028j7115n875
13172A94307k7796m1927L5628P7610J3123K2045k4031o751m3043k2094M9773K293
13160B29137o290j4086m3502k2277O345K1965q141m9217m7597R316P9933N3544
13148B09130J05172Q4158K1693P0583l4405q835K1100P8377k0449o3965j4317
13137D48242o4189m3077J7747L155j5556J6877J6600r810l2589k3282o3124n3824
13125A97170n831K5470K6567r79Q591l5548n307M8814J2417k955R20K6278j4770
13112B80837n7863J7482K8576M8465p495N533L4144m4370J4444L5435M488J1424
13100C71100N157K4354J5021Q6039N1728J8240j9748p8475j20873k8038j9645
$$ plain form
13184 346948 321105 265921 213881 205314 199462 163377 228524 181111 174269 217297 200182 194307
13172 194307 166511 124584 160212 237822 250945 272990 248959 242208 199165 177071 226844 229137
13160 229137 222847 208761 165259 142982 149327 171292 163151 113934 66337 75653 155586 209130
13148 209130 314302 398460 420153 490736 456331 447496 468596 546973 526524 462559 448242
13137 448242 384053 340976 358723 361878 346322 363199 379799 369989 337400 314118 250994 197170
13125 197170 191339 216809 243376 242397 250988 215440 210133 258947 271364 268409 269329 295607 280837
13112 280837 222974 240456 269032 317497 310002 315535 349679 305309 319753 355188 359676 371100
13100 371100 376257 400611 415632 501671 553399 571639 551891 473416 352543 324505 304860
13089C04860k2668j6808M927J7388L6000l7774l4304p5736k9292Q3650N4361O6156
13077C50760O69j8249n65R641N319r338l4417L758O7175p799k7007j8989k2986
13064B97972k4241J7058K9144l9911k2602J9663K2771m931q106O822L5613R4170
13052D23422L4376Q726q9072k7149r191q9651l2328J7849L2032M2838j8955L5921
13040C28818m389N526j0987K2978k907j0615Q697K7289J451m5964k1734J2455
13028C10618N5872m0150l1651j5406m7925k2536K7959K7703r839l7973M8465J4597
13016B79734J3311Q7802m2386m0079k4467k053l664l1952K468R1590k1603l8543
13004B70158L3003M2436J5161l3816j1771o8310N409O7014K0054l2739r102M0518
$$ plain form
13089 304860 282192 265384 270311 287699 323699 285925 251621 175885 146593 230243 284604 350760
13077 350760 351429 333180 332615 342256 347575 338237 303820 307578 374753 366954 339947 320958 297972
13064 297972 273731 290789 319933 280022 257420 277083 299854 294923 286817 293639 329252 423422
13052 423422 457798 466524 377452 350303 341112 251461 219133 236982 269014 311852 292897 328818
13040 328818 324429 329955 318968 341946 339039 328424 337121 364410 365861 319897 298163 310618
13028 310618 366490 326340 294689 279283 231358 208822 236781 264484 254645 216672 265137 279734
13016 279734 293045 380847 338461 298382 273915 271862 268198 236246 238714 330304 308701 270158
13004 270158 303161 345597 360758 326942 315171 246861 252270 319284 339338 306599 297497 338015
12992C38015R610j1583L5547K5475K5395J7079o080r009l8037P844l8188j7338
12980C38730j4787j6602L7823L6004K4406L0027l1436j1542r786n525R26K9092
12968D07330J7138k0516J0588K5851J00950K4269k0904l7607J7551l0551K4987
12957E19086K2901N464r514n744O2580M1162R340l8749l5596R403K2871J4008
12945F17212n3297k4691o4334k8425J3759J2001J8075j8846N4497K6311J9092
12934E71354K5250m7892l0199N935L2345K1088j1273m028M1690M4948j8098K4226
12922F55346k8629j1760J0091J3211L4250N1785K3903K6765O4066k0743k1061
12911G97224J1954K1215K2480M6416O6053M6402P70L8540M1592o121K5684O9128
$$ plain form
12992 338015 347625 336042 371589 397064 422459 439538 433458 424449 386412 394256 356068 338730
12980 338730 323943 307341 345164 381168 405574 435601 404165 392623 382837 377312 378238 407330
12968 407330 424468 403952 414540 440391 541341 565610 544706 507099 524650 494099 519086
12957 519086 541987 547451 537937 532193 594773 635935 645275 606526 570930 580333 603204 617212
12945 617212 563915 539224 474890 446465 460224 472225 490300 471454 525951 552262 571354
12934 571354 596604 548712 518513 524448 556793 577881 566608 562580 604270 649218 631120 655346
12922 655346 626717 614957 625048 638259 672509 724294 748197 774962 839028 818285 797224
12911 797224 809178 830393 852873 899289 965342 1011744 1012514 1051054 1092646 1086525 1112209 1181337
12899A181337O0188K5782J2377J2206P071P6721O3991L2776K2335l6420k9404
12888A428960K3730M8070O7366R3466L0099l3498l6363k7095l0223l787l5142
12877A525583o0097l5832J7483k0149m2134m6154K4333j0855n5169o014k5957
12866A265038k9460n7037o1061o6500N927L3834l5512n4210l8902l9715m0589
12855H81813L1377Q2225j4872L502q693o4106j3804m3969l3814M3767K5900M325
12843H93651o8329o734N9562L3262l5949j29845r114M0837O52k0704K0731K7069
12831H05089J2339q969K6300J048M1632K780N725n076k7077n1649L2758J1529
12819H46429p592j4820l2978J6075O5317m22L0048j5786o5805j1374n938L6441
$$ plain form
12899 1181337 1241525 1267307 1279684 1291890 1298961 1375682 1439673 1472449 1494784 1458364 1428960
12888 1428960 1452690 1500760 1568126 1661592 1691691 1658193 1621830 1594735 1564512 1560725 1525583
12877 1525583 1465486 1429654 1447137 1426988 1384854 1338700 1363033 1352178 1297009 1290995 1265038
12866 1265038 1235578 1178541 1117480 1050980 1056907 1090741 1055229 1001019 962117 922402 881813
12855 881813 913190 995415 980543 984045 975352 911246 897442 853473 819659 863426 889326 893651
12843 893651 825322 818588 878150 911412 875463 745618 736504 777341 777993 757289 778020 805089
12831 805089 817428 808459 834759 835807 877439 880219 885944 880868 853791 802142 834900 846429
12819 846429 838837 824017 791039 807114 872431 872009 902057 886271 820466 809092 803154 839595
12807H39595k497N8421l3318p229r263j1883n2930P382L5057N0185M9816q172
12795I15164l5534K9796P6450o1548j07457L4117L2269L8122O1918M1096o55k9648
12783I94090p4628l9729j1441M5565j917k5218N0791J7114L0465j7133j2127K4706
12771I80538L4075J789k580L1330N6454j5190Q998M1357N1659m3961j9593M7302
12759A172178O6631o0O0659Q9934J10440R0511J43171J72140K53272K92099L33263
12748B784238M44647N25377L87905K58663P7108r7972k14131l70298m28541l40086
12738C026910k57218k23243j14606r0305j42720r1263l303n9746j55885n1221
12728A837400J3163m307o8372p6903L6825N8715m4640n5306N864k7707n7922j4480
$$ plain form
12807 839595 837098 895519 862201 854972 845709 833826 780896 788278 823335 873520 923336 915164
12795 915164 879630 909426 985876 924328 816871 850988 883257 921379 983297 1024393 1023738 994090
12783 994090 919462 879733 868292 913857 911940 886722 937513 954627 985092 967959 955832 980538
12771 980538 1014613 1016402 1013822 1045152 1101606 1086416 1095414 1136771 1188430 1144469 1124876 1172178
12759 1172178 1238809 1238749 1299408 1389342 1499782 1590293 1733464 1905604 2158876 2450975 2784238
12748 2784238 3228885 3754262 4142167 4400830 4477938 4379966 4165835 3795537 3366996 3026910
12738 3026910 2769692 2546449 2431843 2341538 2198818 2107555 2104252 2044506 1888621 1837400
12728 1837400 1850563 1846256 1777884 1700981 1737806 1796521 1751881 1696575 1702439 1674732 1616810 1602330
12716A602330J707L4109J2878l4672J9118K0793K9247m6531j1823L9311O107o9252
12704A603322M3808J7140k2962Q774J2419L493M0283L2263k5370j5890O2615N3122
12692A813017L7048K8971p508M5278J8011l3823n106M9799j034k1089j9422J3678
12680A917820M3158L5289l3204j2258L2276j7461O023L4677M6582r72P37R155
12668B061822J13Q8700J8684p9004k3105N9676L9001R2419Q5685K7423L988q530
12656B366872K922L0387L6813K0139k261j9801n3443K7745J00562P1952L3121
12645B615008O3817Q4643J09604J09521O7339J28265O9255P0684P1543L6424M914
12634C431017j9752J3942K5216k7100r2756n9731O062J2913J9243K9298M8189
$$ plain form
12716 1602330 1604037 1638146 1651024 1616352 1635470 1656263 1685510 1638979 1627156 1666467 1672574 1603322
12704 1603322 1647130 1664270 1641308 1650082 1662501 1665994 1706277 1738540 1713170 1697280 1759895 1813017
12692 1813017 1850065 1879036 1871528 1916806 1934817 1900994 1895888 1945687 1944653 1923564 1904142 1917820
12680 1917820 1960978 1996267 1963063 1950805 1983081 1965620 1971643 2006320 2052902 2051930 2052667 2061822
12668 2061822 2061935 2150635 2169319 2090315 2067210 2126886 2165887 2258306 2343991 2371414 2375402 2366872
12656 2366872 2369794 2400181 2436994 2457133 2454872 2435071 2381628 2409373 2509935 2581887 2615008
12645 2615008 2678825 2763468 2873072 2982593 3049932 3178197 3247452 3318136 3389679 3426103 3431017
12634 3431017 3411265 3425207 3450423 3423323 3330567 3270836 3276898 3289811 3309054 3338352 3386541
12623C386541p2563q963J9065M5712Q562J9287K5431j0833l3366M7334R0698j3111
12611C503794n107N1586O9591O8414N5361P6904N9808N6982J6832J7106J4753
12600C986024M8444Q3724O7243K8746J9066J07659J29420N1196O6670O4597N1136
12589D703925M6223R1390J21126P6547K0186J3402Q6066J26520Q2825R3425J10386
12578E572021P3299R0590J30815J11449Q7938J05322P0567Q1561Q2625O6831J17102
12567F590120R2795J29827J20492R9515J70001J84609J18965Q9366J91632J81096
12557G968418J65390J74400J39584J49822K17518J29401J04798J70192K00495
12548I420018K01797K80293J91893K00722K18041K22791K56900L11672K76354
$$ plain form
12623 3386541 3313978 3305015 3324080 3369792 3378354 3397641 3423072 3412239 3378873 3426207 3516905 3503794
12611 3503794 3498687 3550273 3619864 3688278 3743639 3820543 3880351 3937333 3954165 3971271 3986024
12600 3986024 4034468 4118192 4185435 4214181 4233247 4340906 4470326 4521522 4588192 4652789 4703925
12589 4703925 4750148 4841538 4962664 5039211 5059397 5072799 5158865 5285385 5368210 5461635 5572021
12578 5572021 5645320 5735910 5866725 5978174 6066112 6171434 6242001 6323562 6406187 6473018 6590120
12567 6590120 6682915 6812742 6933234 7032749 7202750 7387359 7506324 7595690 7787322 7968418
12557 7968418 8133808 8308208 8447792 8597614 8815132 8944533 9049331 9219523 9420018
12548 9420018 9621815 9902108 10094001 10294723 10512764 10735555 10992455 11304127 11580481
12539A1580481J40022K19845K92178L22494K95317L50314L24992L95504L73252
12530A4294399L53180L50898L28319M04238M47122N38828N45445M77819N22459
12521A8262707N81663O34590O12617O10757O56233O71928P32581Q55198Q30381
12512B4448655Q53614Q81932J025143J082072J097605J155369J221228J302369
12504C3067987J322117J393645J569076J658545J670051J834905K043444K095393
12496D6655163K241483K397198K571768K701644K913796L137532L351879L538761
12488F9509224L839474M069392M297242M606181M968708N254223N607847N955968
12480A08108259O158055O562090O809965P094955P307517P568910P729786P810848
$$ plain form
12539 11580481 11720503 11940348 12232526 12555020 12850337 13200651 13525643 13921147 14294399
12530 14294399 14647579 14998477 15326796 15731034 16178156 16716984 17262429 17740248 18262707
12521 18262707 18844370 19478960 20091577 20702334 21358567 22030495 22763076 23618274 24448655
12512 24448655 25302269 26184201 27209344 28291416 29389021 30544390 31765618 33067987
12504 33067987 34390104 35783749 37352825 39011370 40681421 42516326 44559770 46655163
12496 46655163 48896646 51293844 53865612 56567256 59481052 62618584 65970463 69509224
12488 69509224 73348698 77418090 81715332 86321513 91290221 96544444 102152291 108108259
12480 108108259 114266314 120828404 127638369 134733324 142040841 149609751 157339537 165150385
12472A65150385P746728P532535P299136O847231O368652N657190M876547M050901
12464B15529305L012876J957188P88564k66170j322694k427233l289681m124379
12456B09857776m866555n465169o017395o416413o632799o781913o910949o893599
12448A59872984o848982o772097o613361o380319o205783n968078n672338n470482
12440A09941544n287285m994597m783374m568058m310865m110465l902578l692352
12432G4291970l498635l278493l102501k983620k829580k605741k435261k291537
12424E1266602k143208k127872k049428j891638j738074j684172j609884j517083
12416C6505243j517611j318917j248628j236501j211095j133846r81070r58248
$$ plain form
12472 165150385 172897113 180429648 187728784 194576015 200944667 206601857 211478404 215529305
12464 215529305 218542181 220499369 221287933 221021763 219699069 217271836 213982155 209857776
12456 209857776 204991221 199526052 193508657 187092244 180459445 173677532 166766583 159872984
12448 159872984 153024002 146251905 139638544 133258225 127052442 121084364 115412026 109941544
12440 109941544 104654259 99659662 94876288 90308230 85997365 81886900 77984322 74291970
12432 74291970 70793335 67514842 64412341 61428721 58599141 55993400 53558139 51266602
12424 51266602 49123394 46995522 44946094 43054456 41316382 39632210 38022326 36505243
12416 36505243 34987632 33668715 32420087 31183586 29972491 28838645 27857575 26899327
12408B6899327r35431r55966r08658p99332p07031p49515q13723p52814p19263
12399A9557594o71861n20320m88910n09082m73169m70510m77642m34850m18955
12390A5092295m21094m12691l63591k97935k70270k94404k93023k73094k27862
12381A2238331k16722k20544j91108j07111q0266j44413j76125j34292j29706
12372A0838044j64146k01802k55299k23516k20792k27489k69017k67195k08173
12363H800615j87571k53791k37343j55982k44044k25629j73087j66236j55883
12354G001049j38545o4875j01042j59568j05058j07427j56343j44147q1964p9416
12344E862664l7800m9129n4575o7066p9445q5448r6715n3137m8312p6793l8299
$$ plain form
12408 26899327 25963896 25007930 24099272 23299940 22592909 21843394 21029671 20276857 19557594
12399 19557594 18885733 18365413 17876503 17367421 16894252 16423742 15946100 15511250 15092295
12390 15092295 14671201 14258510 13894919 13596984 13326714 13032310 12739287 12466193 12238331
12381 12238331 12021609 11801065 11609957 11502846 11422580 11278167 11102042 10967750 10838044
12372 10838044 10673898 10472096 10216797 9993281 9772489 9545000 9275983 9008788 8800615
12363 8800615 8613044 8359253 8121910 7965928 7721884 7496255 7323168 7156932 7001049
12354 7001049 6862504 6797629 6696587 6537019 6431961 6324534 6168191 6024044 5942080 5862664
12344 5862664 5824864 5775735 5721160 5654094 5574649 5489201 5392486 5339349 5291037 5214244 5175945
12333E175945r0710n9707n1056k5674n2005l8536p0240l1008p0235o6238k8208
12322D592328p4825m7930k5660n3051q0958p2075o315K6456k6123o9082j6939
12311D145826K4270n8364j16534o629m1283l5182K3004n80o5561j3258p1506n6191
12299C728012M2234J12276N6851N8270J18704Q2733R8004J64771J87246J37624
12289D786725J87644J89892K63755J51903J08148N6942J3042o152j06276j33794
12279E511829j54028j61948k16641k23183j76507j59433j31216j28109j70733
12270C990031j57311r8245o5791r1314l7936k7816l7457k8772q672j7398K3411
12259C442730R055j4875N0314j8089P5666J08308J04192O5508J31641K02939J90894
$$ plain form
12333 5175945 5085235 5025528 4974472 4948798 4896793 4858257 4788017 4757009 4686774 4620536 4592328
12322 4592328 4517503 4469573 4443913 4390862 4309904 4237829 4231514 4257970 4231847 4162765 4145826
12311 4145826 4170096 4111732 3995198 3988569 3947286 3912104 3935108 3934528 3868967 3855709 3784203 3728012
12299 3728012 3770246 3882522 3939373 3997643 4116347 4199080 4297084 4461855 4649101 4786725
12289 4786725 4974369 5164261 5428016 5579919 5688067 5745009 5758051 5751899 5645623 5511829
12279 5511829 5357801 5195853 4979212 4756029 4579522 4420089 4288873 4160764 3990031
12270 3990031 3832720 3734475 3668684 3577370 3539434 3511618 3474161 3445389 3436717 3419319 3442730
12259 3442730 3451785 3436910 3487224 3469135 3544801 3653109 3757301 3822809 3954450 4157389 4348283
12248D348283K17395K26294K62713K74333L22528L37950M76888N84708O67124
12239G718216P17353Q07754R70591J111316J227541J391110J719937K072354K479456
12230B0215628L250317M261662N593070P321180R529481J1800540J3889567J5435477
12222I1296922J6076592J5572667J4082257J1424729P727981L290280j507413
12215A57964015n890747r353610j1806320j3165057j3592853j3022237j1819084
12208G9314107j0276936q488730o948504n883318m934039m261232l834859l367229
12200C1319260k925569k713507k503326k240570j853415j728590j607005j369536
12192A4377742j222760j088227r45007p70903p27705o47769n96068n43390l77006
$$ plain form
12248 4348283 4565678 4791972 5054685 5329018 5651546 5989496 6466384 7051092 7718216
12239 7718216 8435569 9243323 10213914 11325230 12552771 13943881 15663818 17736172 20215628
12230 20215628 23465945 27727607 33320677 40641857 50171338 61971878 75861445 91296922
12222 91296922 107373514 122946181 137028438 148453167 156181148 159471428 157964015
12215 157964015 152073268 142719658 130913338 117748281 104155428 91133191 79314107
12208 79314107 69037171 60548441 53599937 47716619 42782580 38521348 34686489 31319260
12200 31319260 28393691 25680184 23176858 20936288 19082873 17354283 15747278 14377742
12192 14377742 13154982 12066755 11121748 10350845 9623140 8975371 8379303 7835913 7458907
12183G458907l64832k94797j78991j11374N200J34261J95103K16618j3347l51029
12173F695719n30212n11352l72952k70147o9036J18445K35366K66347J65905j07659
12163E620424n16021n89830m84092m30043k98137j91380j32268j29999j33243
12154B715411j26642j58014r8411m0438m3837q2568j02526o2681m6803l0448L0099
12143A953142L3061M7088R4477K0094R5751J92417K00680J88475J94192J78257
12133C197634K21151K05653J52688J13264P0349J3504m1788n2933j27961k13852
12123C537709k08134k02729j88356j91021j89883j62847j24745j47794j70333
12114A951867p0204q6701p7797j00225l3111n1803m2444K7578k1847o3791l9878
$$ plain form
12183 7458907 7094075 6799278 6620287 6508913 6514113 6648374 6843477 7060095 7046748 6695719
12173 6695719 6165507 5654155 5281203 5011056 4942020 5060465 5295831 5562178 5728083 5620424
12163 5620424 5104403 4514573 4030481 3600438 3302301 3110921 2978653 2848654 2715411
12154 2715411 2588769 2430755 2332344 2291906 2248069 2165501 2062975 2000294 1953491 1923043 1953142
12143 1953142 1986203 2033291 2127768 2147862 2243613 2436030 2636710 2825185 3019377 3197634
12133 3197634 3418785 3624438 3777126 3890390 3960739 3974243 3932455 3879522 3751561 3537709
12123 3537709 3329575 3126846 2938490 2747469 2557586 2394739 2269994 2122200 1951867
12114 1951867 1881663 1794962 1717165 1616940 1583829 1532026 1489582 1517160 1495313 1431522 1391644
12103A391644n4504P732J2271l4190l2309J6623L728N433K4617n0611n2707M387
12091A242114m5741k6386K5046J4233m7028r587M6059j9688l2513J7666O2925
12080A227100M6851j3238P48N6332L0335R656j5154M4539O2982J6528N3089Q3990
12068A603758M7107O5162L0402J5959Q9140J33339J43281J73281K35842J18963
12058B656234P4890J24222J49004M3387L1976k6749K3248R9966J76963J93657
12048C546798J78526K04062K20528K78926K06209O3380N4583P9239j9123j23855
12038D689273k01086k32395k34659k89150k45012k09968k14167j95879j68578
12029B698379j15911j48653j31587j23192j34119o2735j16046j17154m8314m5023
$$ plain form
12103 1391644 1337140 1344872 1357143 1322953 1290644 1307267 1310995 1316428 1341045 1290434 1237727 1242114
12091 1242114 1196373 1169987 1195033 1209266 1162238 1152651 1198710 1179022 1146509 1164175 1227100
12080 1227100 1273951 1260713 1261461 1317793 1348128 1357784 1342630 1387169 1450151 1466679 1519768 1603758
12068 1603758 1650865 1716027 1746429 1762388 1851528 1984867 2128148 2301429 2537271 2656234
12058 2656234 2731124 2855346 3004350 3047737 3079713 3052964 3076212 3176178 3353141 3546798
12048 3546798 3725324 3929386 4149914 4428840 4635049 4698429 4753012 4832251 4813128 4689273
12038 4689273 4488187 4255792 4021133 3731983 3486971 3277003 3062836 2866957 2698379
12029 2698379 2582468 2433815 2302228 2179036 2044917 1982182 1866136 1748982 1700668 1655645
12019A655645k1435n0043l6486j02322r2910l6002k8898k5172k9027l1974p0116
12008A131260L645j1732j2431j6533r0768j03593J0252J5060j50k0539l5050k0424
11996H48997k4059k0071q381k7790n5196l8071j4140q993K7516L5849j5456m7299
11984F52906o6059o8841k8894K632M3129K237k1426m4453o011O6940K2609l5128
11972E19641m2905K8021k2703k3122J4111K6580M4582M3235j4515m3810J0566
11961E39681L1704j1740K1019J8356J6804o9376j04809k1906k46L4286Q8621L8013
11949E80407j6125l5325k1043o0739K2837K9311M2055J8304j03824q654M0448
11938D87652J02464J3988k9200r8091P573M9580j5128Q845P8893L1143J0353o314
$$ plain form
12019 1655645 1634210 1584167 1547681 1445359 1352449 1316447 1287549 1262377 1233350 1201376 1131260
12008 1131260 1134905 1123173 1110742 1094209 1003441 899848 910100 925160 925010 904471 869421 848997
11996 848997 824938 804867 796486 768696 713500 675429 661289 652296 679812 715661 700205 652906
11984 652906 586847 518006 489112 491744 534873 537110 515684 471231 465220 532160 554769 519641
11972 519641 476736 504757 482054 458932 473043 499623 544205 587440 572925 529115 539681
11961 539681 571385 559645 580664 599020 615824 546448 441639 419733 419487 453773 542394 580407
11949 580407 564282 528957 507914 447175 470012 499323 541378 559682 455858 447204 487652
11938 487652 590116 604104 574904 476813 484386 533966 518838 527683 606576 637719 648072 641758
11926F41758M5389K4435J5275Q1951J33339J14344J87123K61136K71271K78187
11916B054208K91333K07880J43681J67669J09518J2898j03284j99729k27578k39586
11906B217010k47590k33545k01235j47392j87481j04028n9536j2128n5788o8132
11896I00155m2941j03674q1728k7535J03l1663M3100j4775o4566l8343J6128n941
11884E48320n5297j0150K2704p3470m1125M9565k5840k4389K1133m1175J5645
11873C85921O2703r304m0731n3817p74K4671L5844m1933j1462Q156O111M6492
11861D11877p186m339k1247L9014N1698q6512j02080J1225L4185n46o45N2001
11849C77445L7874J6640k1395k5112M5366Q280L1772j1413j7170J24005J26807
$$ plain form
11926 641758 687147 711582 726857 808808 942147 1056491 1243614 1504750 1776021 2054208
11916 2054208 2345541 2553421 2697102 2864771 2974289 2987187 2883903 2684174 2456596 2217010
11906 2217010 1969420 1735875 1534640 1387248 1199767 1095739 1036203 1024075 968287 900155
11896 900155 857214 753540 671812 644277 644380 612717 655817 641042 576476 538133 554261 548320
11884 548320 493023 482873 505577 432107 390982 440547 414707 390318 411451 370276 385921
11873 385921 448624 439320 398589 344772 343998 368669 404513 362580 351118 359274 365385 411877
11861 411877 404691 400352 379105 418119 469817 383305 281225 292450 326635 326089 325444 377445
11849 377445 415319 431959 410564 385452 430818 439098 470870 459457 442287 566292 693099
11838F93099K30763K29274J07038r6229j99656k34557j89699L7708j5782n3344
11828E08615n1367j4857K4251k8991l5696L809n0197l725K0975l135J4912M380
11816C88974k9875n3640j5164Q6150K9699J1938M0182j6441k5992K6859R543m5042
11804D07191k308J13183P2990N2291M1863r564K5368J34724O6745N6431R8157
11793A057071P0992L5803L8830k8037K7166q660J5240K2645p523k8483q4186j16094
11781I94764p3898r8646j22568o3641p3036o0554l5897m0055r847n2011j9448
11770C45163K3453j371k4803r122J3008k7347m2772m1000O359p570L1243k3579
11758B41662j2589j3310K3631j5139n025k631o356J5086Q729J0506M5790K6890
$$ plain form
11838 693099 923862 1153136 1260174 1163945 964289 729732 540033 577741 561959 508615
11828 508615 457248 442391 466642 437651 401955 405764 355567 351842 372817 369682 384594 388974
11816 388974 359099 305459 290295 376445 406144 418082 458264 441823 415831 442690 452233 407191
11804 407191 404883 518066 591056 643347 685210 675646 701014 835738 902483 958914 1057071
11793 1057071 1128063 1163866 1202696 1174659 1201825 1193165 1208405 1231050 1223527 1195044 1110858 994764
11781 994764 920866 822220 699652 636011 562975 502421 466524 426469 416622 364611 345163
11770 345163 368616 367245 342442 333320 346328 318981 276209 235209 241568 233998 265241 241662
11758 241662 229073 215763 239394 224255 219230 216599 210243 225329 234058 244564 290354 317244
11746C17244L389L5217n2216q44L97m530l1571k9230n8459m4720J9332N5587L6068
11733B45664L7125J6320k1890p4013j3761L3731Q1536k2113m7580q8505m5577
11722A00937k6400J4034j8823m1400Q2443J27685K9662j8495K2732j2504k2283
11711B37588l070k5159k9475o224L3401P2087N6977Q877j2225l5052m4737j8914
11699B34074l8970J3948m6819m1385L9016M3579m8657K383M4011L1797L9768P2300
11687C45045q523r4516m9583l4749J3358M9569r225l354J7090P6676M0322l5730
11675C06380o4182Q413L6675N5189j4373o6990k5807q436j6837p163K9271k320
11663B29820j3236j1379j4015l0783L0677O95k1022l6257L4082O3630N5315O134
$$ plain form
11746 317244 320633 355850 303634 302790 303187 298657 267086 237856 179397 134677 154009 209596 245664
11733 245664 282789 299109 277219 203206 189445 223176 304712 282599 235019 146514 100937
11722 100937 74537 88571 69748 28348 110791 238476 268138 249643 272375 259871 237588
11711 237588 234518 209359 179884 173660 207061 279148 336125 345002 332777 297725 252988 234074
11699 234074 195104 209052 162233 120848 159864 203443 154786 157169 201180 232977 272745 345045
11687 345045 336522 242006 192423 157674 171032 220601 211376 208022 225112 301788 342110 306380
11675 306380 242198 250611 287286 342475 328102 261112 235305 226869 210032 202869 232140 229820
11663 229820 216584 205205 191190 160407 191084 191779 170757 134500 168582 232212 287527 293661
11651B93661N852j1155J9788l9113k4266p421k4532J8048K555n8812R489M6828
11639B30922M1990k1753J7651L6932M8886k0799o4570j4058K6042K0516j9447
11628B82312l2250l3381n830M0372M6485J8238j7698j2860K3217M238j0682N56
11616C02717L0388M393Q440k8388k1852l9422L0872N5063M723J0167J1802R69
11604C69872L1375m82n0078l0833K3116J5071k9933j7060J7199j5200O727O5246
11592C85020o708P573p0140l2847j1788N8496Q107m4281j3900N7708k6778k7126
11580B83336k2186p690q142K0323J5728k2173l6442P917R435L9310J3231L8391
11568C31038M4614J9428j2959k2597n1487Q132J0140m8851r637L623K4770l779
$$ plain form
11651 293661 299513 288358 308146 269033 244767 237346 212814 230862 233417 174605 184094 230922
11639 230922 272912 251159 268810 305742 354628 333829 269259 255201 281243 301759 282312
11628 282312 250062 216681 210851 251223 297708 315946 298248 285388 308605 312843 302161 302717
11616 302717 333105 337498 345938 317550 295698 256276 287148 342211 346934 357101 368903 369872
11604 369872 401247 400765 350687 319854 342970 358041 328108 311048 328247 313047 319774 385020
11592 385020 378312 385885 315745 282898 271110 329606 337713 293432 279532 337240 310462 283336
11580 283336 261150 253460 245318 265641 281369 259196 222754 230671 240106 279416 292647 331038
11568 331038 375652 395080 382121 359524 308037 316169 326309 277458 267821 271444 296214 292435
11556B92435J0491L2338M1972n8602k5539K1431L2918l887j3870O1884m464k7105
11544C60002m4781M1006K2399j3561j04109k3992R725k3515j9477M8497K9609
11533B81803k5087o5244j769P6581M2265l302J9466k5301l9253j369P3627M4222
11521C76639m7324p4222m9805R308L7172M1536K6014R416k9795n8036n3010O1602
11509B49495N2852L9706J9912q382l6298r2888j8562l5494J4235K0248K9187L4008
11497B68019M8569K7830K7572k6142J7836M8232j4504J8177L5792q387n209K3610
11485D61395k0162l8355q4432l0144K2136K4357J0198k8253J131L3431J6051J3543
11473C80896o9561k8246r845l9745Q612o220M4492J0652J0927O2887K0444j1594
$$ plain form
11556 292435 302926 335264 377236 318634 293095 314526 347444 343557 329687 391571 387107 360002
11544 360002 315221 356227 378626 365065 260956 236964 246689 223174 203697 252194 281803
11533 281803 256716 191472 189703 266284 308549 305247 324713 299412 260159 258790 332417 376639
11521 376639 329315 255093 205288 214596 251768 293304 319318 328734 298939 240903 187893 249495
11509 249495 302347 342053 361965 353583 317285 224397 205835 170341 184576 204824 234011 268019
11497 268019 316588 344418 371990 345848 363684 411916 397412 415589 451381 442994 437785 461395
11485 461395 441233 402878 318446 288302 310438 334795 344993 316740 317871 351302 367353 380896
11473 380896 311335 283089 273244 233499 242111 235891 280383 291035 301962 364849 385293 373699
11461C73699n6151p4701L6239M4220L6284n008k2929L8086K0124J9597m2395o171
11449C60894K5335M5114L0864p023j5006n467k9646j1606k862J1817K9125K4776
11437D56315k6546k3180o8231q5648L7429K4896J9084l800N442K9568J031K3201
11425C89561j9695N148r35N1739K6767j6083R057O1062P1650M0238o4472o6339
11413D87698J7128M9179M1608L4372n525k7531l6787N6432J6615k689k5765j024
11401F03711J138N1343Q6568m7532k8968L0523J4253J2709M3952Q4537L8741K1101
11389I12076P9612N0781J1715P020P5664L3649J8684Q3695P3093J74592J41608
11378A662189M6787J20153J73790J70546J86054J73068K46126K60871L20903L97296
$$ plain form
11461 373699 317548 242847 279086 323306 359590 354582 331653 369739 389863 409460 367065 360894
11449 360894 386229 431343 462207 455184 440178 434711 405065 393459 390597 402414 431539 456315
11437 456315 429769 406589 338358 252710 290139 315035 334119 330319 335761 365329 366360 389561
11425 389561 369866 375014 374079 425818 452585 436502 445559 506621 578271 618509 554037 487698
11413 487698 504826 554005 595613 629985 624460 596929 560142 616574 633189 630500 604735 603711
11401 603711 604849 656192 742760 695228 666260 696783 711036 723745 767697 852234 890975 912076
11389 912076 991688 1042469 1054184 1061204 1136868 1170517 1189201 1272896 1345989 1520581 1662189
11378 1662189 1708976 1829129 2002919 2173465 2359519 2532587 2778713 3039584 3360487 3757783
11368C757783M31121N40234O02609O88927Q76340J001603J131574J334902J496014
11359A1861107J853336K510665L588561N135277P311292J0146176J3381008J6154082
11351G1941504J6961222J4316886P079754l196514j2159548j5818749j4535456
11344F4589099j1303038q199259n821088m359016l505981k972302k696324k548451
11336B3183640k388405k209829k123634j938255j606874j322286j115513r92361
11328I486483q85007q13946o16557n81334n68738n28365m56494l75846l53904
11319D306292l07746k30612k04707k41586k31023j89360j84750k03089k09308
11310B304111j49740j08025j22014o1216o7838j05101r8230n8491o634l1139j04091
$$ plain form
11368 3757783 4188904 4729138 5331747 6020674 6897014 7898617 9030191 10365093 11861107
11359 11861107 13714443 16225108 19813669 24948946 32260238 42406414 55787422 71941504
11351 71941504 88902726 103219612 110299366 107102852 94943304 79124555 64589099
11344 64589099 53286061 45086802 39265714 34906698 31400717 28428415 25732091 23183640
11336 23183640 20795235 18585406 16461772 14523517 12916643 11594357 10478844 9486483
11328 9486483 8601476 7787530 7170973 6589639 6020901 5492536 5036042 4660196 4306292
11319 4306292 3998546 3767934 3563227 3321641 3090618 2901258 2716508 2513419 2304111
11310 2304111 2154371 2046346 1924332 1863116 1795278 1690177 1591947 1533456 1526822 1495683 1391592
11299A391592r9557n2701m2021j13551p1757k7648k8686l5993k5638n0600q7403
11288G56037p1415P274N0016J3081k6357o3708j1359L1072k4817m5677L1647l008
11276F42786p1546k4687J4256p0383J61l8185j2472l3855J735L2286O1897N5128
11264E57121P2220M3329Q504K3615j9971k5991l5799K9421M2559m0665L4451K3820
11252G12614p3751K3541J08659M828j4340k9286J715m2092n3478k8640k2912L4046
11240F20904L9551m1394n8153l6498N247q595k9819L6560j2780p9912o1287J4739
11228C88563K7891m3225Q0120P4199M3217J3713j1062l0816l8367K904n171K667
11216E04633K6638m4361l1373n049j0303J5437L3215J5005j797L8737L0461M4577
$$ plain form
11299 1391592 1292035 1239334 1197313 1083762 1012005 984357 955671 919678 894040 843440 756037
11288 756037 684622 691896 741912 754993 728636 664928 653569 684641 659824 614147 645794 642786
11276 642786 571240 546553 560809 490426 490587 452402 439930 406075 407810 440096 501993 557121
11264 557121 629341 672670 681174 704789 684818 658827 623028 652449 695008 654343 688794 712614
11252 712614 638863 662404 771063 775891 761551 732265 733980 691888 638410 609770 586858 620904
11240 620904 660455 619061 560908 524410 529657 521062 491243 527803 515023 435111 373824 388563
11228 388563 416454 373229 453349 527548 570765 584478 573416 542600 504233 507137 501966 504633
11216 504633 531271 486910 455537 450488 440185 455622 488837 503842 502045 540782 571243 615820
11204F15820j6946o7907k0870L753J5066P2432J211n4573k494O7943J0387J152
11192F24974j7772n012L8543k8220q8100O6151L4563k1041J00938j3801j4529
11181F76694L6411M086k8333q020r0422q9024j2128k2739N6491j0340K3765K4173
11169E60614o7468O031l7488K209j6849j7433m515l654k2127K4346J00559J1966
11157E36191m1807j7220J2989k1002K4558n195M2334K0753j136o785P4634O6119
11145F84433N1526J34792J40521K04144K55343K72524J95967J12440n0993j08108
11135A892589j74113j57212r5003j01031j29056j02023p5244r8056o6452k6523
11125H67876n1360j0689k6292j2684L5356K7758j4055k6407j9110J7412N1004
$$ plain form
11204 615820 598874 530967 510097 513850 528916 601348 602559 547986 545492 613435 623822 624974
11192 624974 607202 602190 640733 612513 524413 590564 625127 604086 705024 691223 676694
11181 676694 713105 717191 688858 680838 590416 501392 489264 466525 523016 512676 536441 560614
11169 560614 493146 499177 461689 463898 447049 429616 425101 421447 399320 423666 524225 536191
11157 536191 494384 477164 490153 469151 493709 488514 530848 551601 550465 543680 618314 684433
11145 684433 735959 870751 1011272 1215416 1470759 1743283 1939250 2051690 2000697 1892589
11135 1892589 1718476 1561264 1466261 1365230 1236174 1134151 1058907 960851 894399 867876
11125 867876 816516 805827 779535 766851 802207 829965 815910 789503 770393 787805 838809
11114H38809J17608R9659R1935N4198R3489J16157J1880p3799n0697r1020q5809
11103A122410J9003j913q9203K2471K8021J0846j9941n6023q3113m8483n4228
11092H49847m0001k6800l7172L142n3122J7897K6370k3505q0876n412L1907n253
11080F57022n1086j752K2400L210m4437l3074l928J6090K8557m005j3774m8069
11068E27154J2094J477j6916n977K8885L914l5060k9190O4559K1987j8052M0651
11056E95526k7210L4894q763k716K7789K4740n0689j3177L8843K663j3607J0450
11044F18743k4548k7519O1978j0711p9119p3168N7872R9100R287k1728m2234O14
11032E68567K2625J2407m0929j579k2282j1310K972j0966k1107K9606L0401K3164
$$ plain form
11114 838809 956417 1056076 1148011 1202209 1295698 1411855 1423735 1349936 1299239 1208219 1122410
11103 1122410 1141413 1139500 1050297 1072768 1100789 1111635 1091694 1035671 952558 904075 849847
11092 849847 809846 783046 745874 749016 695894 713791 740161 716656 635780 630368 662275 657022
11080 657022 605936 604184 626584 629794 585357 552283 548355 564445 593002 588997 575223 527154
11068 527154 539248 540725 523809 517832 546717 550631 515571 486381 550940 572927 554875 595526
11056 595526 568316 603210 594447 591731 619520 644260 593571 580394 619237 621900 608293 618743
11044 618743 594195 566676 628654 617943 538824 465656 523528 622628 631915 610187 567953 568567
11032 568567 591192 603599 562670 561091 538809 527499 530471 519505 498398 528004 558405 581569
11020E81569k7173l476O1031J140l1579L2167O8178J71469R8009R2595Q4168N5143
11008A183241K6541M1353R5037J61718N7143q5620k2074m8914o1266q8122j70378
10997A088659j39038l4834l4251k9427j990l1645l8504n5516k6651J7491k738
10986G11556r9052l7345J1969q3141J0010K339O0058N4643j3318k1382l1639k4561
10974E40137L2793M2990K1294p2862k0995L1505K2838M108j3844K2307J6755m6734
10962E80292j2864J0520m7136k0798O5870L7939K7207M789p9773o7281k073r094
10950D87598K2919O9924k9061l2415r364l48M3835M6135K4400R623j4577O0345
10938F79014N74J7042m1570K8428l617m7974O146K6506n948j2098M5930K189k9098
$$ plain form
11020 581569 554396 550920 611951 613091 581512 613679 681857 853326 951335 1043930 1128098 1183241
11008 1183241 1209782 1251135 1346172 1507890 1565033 1479413 1457339 1408425 1347159 1259037 1088659
10997 1088659 949621 914787 880536 851109 849119 817474 778970 723454 696803 714294 711556
10986 711556 612504 575159 587128 503987 513997 516336 576394 631037 617719 596337 564698 540137
10974 540137 572930 615920 637214 564352 543357 574862 597700 601808 587964 610271 627026 580292
10962 580292 567428 577948 530812 510014 575884 613823 641030 645819 566046 498765 496692 487598
10950 487598 510517 580441 551380 518965 509601 509253 553088 599223 623623 633246 618669 679014
10938 679014 679588 696630 655060 683488 679871 631897 638043 664549 658601 646503 692433 694622 665524
10925F65524O1665P0094M8623l9055k9915m8982k7322L8091J7678K5438K6115
10914H07954J4344L0216O0122O3650Q5701Q3525L3520j181O8838P8682M1632l6914
10902A330089m6610N502l0737p0215J068K9323k4229M0110L9437M1250K4994o554
10890A333428L831K5918N1510M7651O0383P5235J11496K00709Q7239M3758M5564
10879B086722J66002J23739Q9142P4671N8336O0053J24513Q1945L2081M8449p414
10868B938239m3447k7669K9459n1504p4774q5575j16706j10671m7716j4772m9791
10857B345073p6378p9575o9706j16651j18388j00468p5551l2818n9848m1300p8371
10846A496019n3521r247j0678o0670n0344j4289J6930K5446p7075l2445l2906
$$ plain form
10925 665524 727189 797283 845906 806851 776936 727954 700632 738723 756401 781839 807954
10914 807954 822298 852514 912636 976286 1061987 1145512 1179032 1177851 1246689 1325371 1367003 1330089
10902 1330089 1283479 1288981 1258244 1188029 1189097 1218420 1194191 1234301 1273738 1314988 1339982 1333428
10890 1333428 1337259 1363177 1414687 1462338 1522721 1597956 1709452 1910161 1997400 2041158 2086722
10879 2086722 2252724 2376463 2465605 2540276 2598612 2658665 2783178 2865123 2897204 2945653 2938239
10868 2938239 2894792 2867123 2896582 2845078 2770304 2684729 2568023 2457352 2409636 2394864 2345073
10857 2345073 2268695 2189120 2119414 2002763 1884375 1783907 1708356 1675538 1615690 1574390 1496019
10846 1496019 1442498 1433251 1422573 1361903 1311559 1297270 1314200 1339646 1262571 1230126 1197220
10835A197220O164L8315K2612J5770p7062n9324j3855k8321R31k2115l1204K3914
10823A073045k3039o9856K9335L2249M1957J369K4369L466j2990k1130k6109K4956
10811A077622J3248k8532n0501j595J9038N5523m3042K2664L158p091k4998O227
10799A041721K4354k0016j3521l3600j5525q816J2564L2198k9221O4278m804k4997
10787A024615K9752M638N437q894l7804K4080J3974j3823L3132L9502N91k350
10775A112850j0989j5756O689o379j436J8650L3286N06k8525o673n591K4290J8702
10762A139624N630n641J820L1919m3055l4881Q5302k1864J7795L0198M1368L4551
10750A282766N2639m7445j03017j192N7999Q1259r089Q401l0509R643P3939L0035
$$ plain form
10835 1197220 1203384 1241699 1264311 1280081 1203019 1143695 1129840 1101519 1102450 1080335 1049131 1073045
10823 1073045 1050006 980150 1009485 1041734 1083691 1085060 1109429 1112895 1099905 1078775 1052666 1077622
10811 1077622 1090870 1062338 1011837 1010242 1029280 1084803 1041761 1064425 1067583 1060492 1035494 1041721
10799 1041721 1066075 1046059 1032538 998938 983413 974597 987161 1019359 990138 1054416 1049612 1024615
10787 1024615 1054367 1059005 1064442 1055548 1017744 1041824 1055798 1041975 1075107 1114609 1115200 1112850
10775 1112850 1101861 1086105 1092794 1086415 1084979 1103629 1136915 1137421 1108896 1102223 1096632 1120922 1139624
10762 1139624 1145254 1139613 1141433 1173352 1130297 1095416 1180718 1158854 1176649 1206847 1248215 1282766
10750 1282766 1335405 1287960 1184943 1183751 1241750 1323009 1313920 1322321 1291812 1301455 1375394 1405429
10738A405429K8455q29m5149O6458K0132n8883l5260J60k079O3849m3232P40N6680
10725A456471K6526j407M2461O7345N0333j069k6753n5948p063M6516N8869N916
10713A662197j7770K4317Q4475L4235O4721l4175j74K1897n2351J7968O1748j2143
10701A854945N236M9727j9892Q7M5212N969k889m0064m9348L2335J21769L5729
10689B038816n3086J5526Q2033L8834m3107n1550P056O7414N7713O2184k3458
10678B198375l8070k1681q3446R198Q8092N0704n119p797l3041n7734K8518J27486
10666B255485O0145N5792Q004j5855L9948L6116k0249l6611k7708K8711P5026
10655B458804N1541J7152N6055J01482k1480r6215J3009N7293M8027O1381j1352
$$ plain form
10738 1405429 1433884 1433055 1387906 1454364 1474496 1415613 1380353 1380513 1378434 1442283 1399051 1399791 1456471
10725 1456471 1482997 1481590 1524051 1591396 1641729 1640660 1613907 1557959 1550896 1597412 1656281 1662197
10713 1662197 1644427 1668744 1753219 1787454 1852175 1818000 1817826 1839723 1787372 1805340 1867088 1854945
10701 1854945 1860181 1909908 1890016 1890103 1935315 1941284 1938395 1898331 1848983 1881318 2003087 2038816
10689 2038816 1985730 2001256 2083289 2122123 2079016 2027466 2034522 2101936 2159649 2221833 2198375
10678 2198375 2160305 2138624 2055178 2064376 2152468 2203172 2198053 2190256 2157215 2099481 2127999 2255485
10666 2255485 2315630 2371422 2379426 2363571 2403519 2439635 2419386 2382775 2355067 2383778 2458804
10655 2458804 2510345 2527497 2583552 2685034 2663554 2567339 2580348 2637641 2685668 2747049 2735697
10644B735697J0493o373J7019n702J274o459J8313j1085K1860R2500O4104m8358
10632B883283p0279P2565R6848J9698P292M3488R6712O1839J5449m6775l7760
10621C142360N2968Q4593J2389M133N8135M9469P84l0110j6288O6833L1824K9704
10609C486794k410j000L5064L8772K3001O4569O2542M8213J07677N5812P315O1597
10597C987946J9710L8887J36998J81543J04638N8416K7853N3271N6774O6262J49476
10586D881774P9866J22738J33108J06199Q7918J25062M0098Q5557P9779M4341
10576E786440R7420P4487J23763P9404L6298J00735Q7482R5740R7452O5467J36449
10565F781137J13211J20563J13679Q5587R9170J73112J13384J40712J11446J28225
$$ plain form
10644 2735697 2746190 2739817 2756836 2751134 2752408 2745949 2764262 2753177 2775037 2867537 2931641 2883283
10632 2883283 2813004 2885569 2982417 3002115 3009407 3052895 3149607 3211446 3226895 3180120 3142360
10621 3142360 3195328 3279921 3292310 3296443 3354578 3404047 3404831 3374721 3358433 3425266 3457090 3486794
10609 3486794 3484384 3483384 3518448 3557220 3580221 3644790 3707332 3755545 3863222 3919034 3926349 3987946
10597 3987946 4007656 4046543 4183541 4365084 4469722 4528138 4555991 4609262 4666036 4732298 4881774
10586 4881774 4961640 5084378 5217486 5323685 5411603 5536665 5576763 5662320 5742099 5786440
10576 5786440 5883860 5958347 6082110 6161514 6197812 6298547 6386029 6481769 6579221 6644688 6781137
10565 6781137 6894348 7014911 7128590 7214177 7313347 7486459 7599843 7740555 7852001 7980226
10555G980226J25121J65425J79168K19989J89908J47921J63805J60588J17018
10546I449169J81513J82587J85810J80644K21038J96538J72024J71632K28563
10537A1169518K14067K54916K45250K03469K61705L68184L17802L19747L41938
10528A3696596K61185L05614L36442L40482L65607L58237M14104M69968M66939
10519A7015174N14255N84033N98900O74462P15957P11195P28322P22810O64997
10510B2930105O14707N39652M54102N55160O85291O87447O90327Q20271R18407
10501B8895469R63940J005006J085293J171115J249611J318165J393336J485822
10493C8567757J643809J683313J812648J944024K118820K225563K337706K560005
$$ plain form
10555 7980226 8105347 8270772 8449940 8669929 8859837 9007758 9171563 9332151 9449169
10546 9449169 9630682 9813269 9999079 10179723 10400761 10597299 10769323 10940955 11169518
10537 11169518 11383585 11638501 11883751 12087220 12348925 12717109 13034911 13354658 13696596
10528 13696596 13957781 14263395 14599837 14940319 15305926 15664163 16078267 16548235 17015174
10519 17015174 17529429 18113462 18712362 19386824 20102781 20813976 21542298 22265108 22930105
10510 22930105 23544812 24084464 24538566 25093726 25779017 26466464 27156791 27977062 28895469
10501 28895469 29859409 30864415 31949708 33120823 34370434 35688599 37081935 38567757
10493 38567757 40211566 41894879 43707527 45651551 47770371 49995934 52333640 54893645
10485E4893645K750195K928182L168351L362453L577415L902081M242095M498281
10477H3322698M852270N284519N825973O364651O781360P400191Q051764Q736519
10469A36619945R479693J0381572J1257105J2245005J3349128J4480328J5680600
10462B23493376J6829711J8072142J9204461K0010717K0591017K0775317K0352967
10455C59329708J9207272J7287424J4582941J1106551O977732K605950j733747
10448D29363831n811250r310972j2110454j4360535j5830974j6646729j7134667
10441C38158250j7194636j6965791j6538824j5959819j5302562j4584396j3971879
10434B27640343j3176632j2326124j1604133j0866856j0181351r557041q923925
$$ plain form
10485 54893645 57643840 60572022 63740373 67102826 70680241 74582322 78824417 83322698
10477 83322698 88174968 93459487 99285460 105650111 112431471 119831662 127883426 136619945
10469 136619945 146099638 156481210 167738315 179983320 193332448 207812776 223493376
10462 223493376 240323087 258395229 277599690 297610407 318201424 338976741 359329708
10455 359329708 378536980 395824404 410407345 421513896 428491628 431097578 429363831
10448 429363831 423552581 414241609 402131155 387770620 371939646 355292917 338158250
10441 338158250 320963614 303997823 287458999 271499180 256196618 241612222 227640343
10434 227640343 214463711 202137587 190533454 179666598 169485247 159928206 151004281
10427A51004281q401342p929271p450092o946901o424219o042087n604353n197263
10419I7008753m914363m647687m349990m062398l873403l625046l308618l079245
10411F5148003k922944k825666k676405k511128k267827k161014k139641j986648
10403D5656730j839043j828271j702089j556081j494384j451401j353173j264275
10395C3168013j189875j166868j116678r83604r84600r71946r30666q63100q09568
10386B4151108p67770p19421p05726o83875o94625o16169n44554n82749n54531
10377A8281688n17343m74837m47404m42700m59189m20583m03665l57754l35930
10368A4422283l79315l59873l09930k82129k62693k80275k94146k39251k06574
$$ plain form
10427 151004281 142602939 134673668 127223576 120276675 113852456 107810369 102206016 97008753
10419 97008753 92094390 87446703 83096713 79034315 75160912 71535866 68227248 65148003
10411 65148003 62225059 59399393 56722988 54211860 51944033 49783019 47643378 45656730
10403 45656730 43817687 41989416 40287327 38731246 37236862 35785461 34432288 33168013
10395 33168013 31978138 30811270 29694592 28710988 27726388 26754442 25823776 24960676 24151108
10386 24151108 23383338 22663917 21958191 21274316 20579691 19963522 19418968 18836219 18281688
10377 18281688 17764345 17289508 16842104 16399404 15940215 15519632 15115967 14758213 14422283
10368 14422283 14042968 13683095 13373165 13091036 12828343 12548068 12253922 12014671 11808097
10359A1808097k12940k82583k70390k25141k28625j84508j44172j34014j69952
10350I955772k04571j62764j33683j78184j56087r3301j49109k07302j45733j51117
10340H373921j80524j65814r2840q6012j48390j06384j06346j40265q4075p9601
10330G183670r5041j54363j03039n0148n2990j13316j39641j22633m0693j01427
10320F210379r0654J7617p2097j22855q7167j01672o8915j3742l0086m9311q7719
10309E503778o8905n903J9461r2554j29834l0456l6838p7103m5962k1450q2655
10298D931579j05053n4243k9872l5280j3885m2172n7784r0107p5690m1100r0661
10287D295732p8683j25616l9087p3240r5153o8635m2216l2067n6355m6098O544
$$ plain form
10359 11808097 11595157 11312574 11042184 10817043 10588418 10403910 10259738 10125724 9955772
10350 9955772 9751201 9588437 9454754 9276570 9120483 9027182 8878073 8670771 8525038 8373921
10340 8373921 8193397 8027583 7934743 7848731 7700341 7593957 7487611 7347346 7263271 7183670
10330 7183670 7088629 6934266 6831227 6781079 6728089 6614773 6475132 6352499 6311806 6210379
10320 6210379 6119725 6137342 6065245 5942390 5855223 5753551 5684636 5670894 5640808 5591497 5503778
10309 5503778 5434873 5428970 5448431 5355877 5226043 5195587 5158749 5081646 5035684 5014234 4931579
10298 4931579 4826526 4772283 4742411 4707131 4693246 4651074 4593290 4503183 4427493 4386393 4295732
10287 4295732 4217049 4091433 4052346 3979106 3883953 3815318 3773102 3741035 3684680 3638582 3645126
10276C645126j1709J3814L0679q288o3411r5546m8428n7459p2785o8229q7942
10265C175822p4219l3438p4357n3124J3747l9596m9729l7696o9668p0684K3129
10254B710187o294J0135m5247k6582j5810J3941L5863j42271r3170J4391N9424
10243B514567J3078n5529N485K0019O8310L8025J0618L5603J6883K0058p8114
10232B609003n2386n6653r5437q5178l2184J9097k9607L4551K159k0834n2131
10221B240400R012N5166j8080r835j3523j3281l4567n0991N363J2654K9301l414
10209B208205J7104K6324N8931K2708n3302o6205K3798j6549K5829M3917l6522
10198B254238m1781p913J5942j1418L3619K7544L4899k8782p1750L1925J23508
$$ plain form
10276 3645126 3633417 3647231 3677910 3669622 3606211 3510665 3462237 3404778 3331993 3263764 3175822
10265 3175822 3101603 3068165 2993808 2940684 2954431 2914835 2865106 2827410 2757742 2687058 2710187
10254 2710187 2703893 2714028 2668781 2642199 2626389 2640330 2676193 2533922 2440752 2455143 2514567
10243 2514567 2527645 2472116 2477601 2497620 2565930 2603955 2614573 2650176 2667059 2687117 2609003
10232 2609003 2556617 2499964 2404527 2319349 2287165 2306262 2276655 2311206 2313365 2292531 2240400
10221 2240400 2249412 2304578 2286498 2276663 2263140 2249859 2215292 2164301 2169664 2182318 2211619 2208205
10209 2208205 2225309 2251633 2310564 2333272 2279970 2213765 2237563 2221014 2246843 2290760 2254238
10198 2254238 2212457 2204544 2220486 2209068 2242687 2270231 2305130 2276348 2204598 2236523 2360031
10187B360031j7998o5110J5798L3196l3138r884K2092j9677n2772J7099l3214
10176B216423k581o210K3309j6418J1468J580O3015P028K3952P290m2091J6976
10164B303741M5913j0905m8363k9659M374N5731L754K7448L9344O7419N8760Q812
10152B526369n139P6050m5207k9534R268M3412L3027M1533N8698P3409L6728L6766
10140B855380J09495Q5010R4372J22385J41930J64433K16623K06404K88771L50980
10130D635783N33834Q12478J058203J376542J762329K175742K235185J666180
10122A6256276O14248n85306j496933j596367j094299o16450k44325R1312M01213
10113A1729369O60092Q19661J023404J234235J460207J702828J768416J988857
$$ plain form
10187 2360031 2342033 2276923 2292721 2325917 2292779 2282895 2304987 2285310 2232538 2249637 2216423
10176 2216423 2213842 2207632 2230941 2214523 2225991 2227571 2290586 2297614 2321566 2328856 2286765 2303741
10164 2303741 2349654 2338749 2290386 2260727 2265101 2320832 2324586 2352034 2391378 2458797 2517557 2526369
10152 2526369 2521230 2597280 2552073 2522539 2531807 2575219 2608246 2649779 2708477 2781886 2818614 2855380
10140 2855380 2964875 3049885 3144257 3266642 3408572 3573005 3789628 3996032 4284803 4635783
10130 4635783 5169617 5982095 7040298 8416840 10179169 12354911 14590096 16256276
10122 16256276 16870524 16285218 14788285 13191918 12097619 11481169 11236844 11328156 11729369
10113 11729369 12389461 13209122 14232526 15466761 16926968 18629796 20398212 22387069
10105B2387069K413639L139988M273503N912325Q319996J1814977J6695266K3225122
10097I8181885L1155449L9603070M6128033M7060600L9002581K0663626m373932
10090C17421312k7771617m0710154m1827719l5838292k7892725k0728248j5699156
10083A06953401j2451723j0419487r077598p943295p013991o180863n289383m597536
10075D3979525m086758l724546l397540l064395k754804k478800k111981j885934
10067B0474767j676180j467677j393384j218437j046187r10023p97772p07090
10059A1258017p02986o55025o22680n07048n31217m79205l95589m39065l98910
10050F526292k81271k39582k01389j88252k08447j46419j23639j56784j38696
$$ plain form
10105 22387069 24800708 27940696 32214199 38126524 46446520 58261497 74956763 98181885
10097 98181885 129337334 168940404 215068437 262129037 301131618 321795244 317421312
10090 317421312 289649695 248939541 207111822 171273530 143380805 122652557 106953401
10083 106953401 94501678 84082191 75004593 67061298 60047307 53866444 48577061 43979525
10075 43979525 39892767 36168221 32770681 29706286 26951482 24472682 22360701 20474767
10067 20474767 18798587 17330910 15937526 14719089 13672902 12762879 11965107 11258017
10059 11258017 10555031 9900006 9277326 8770278 8239061 7759856 7364267 6925202 6526292
10050 6526292 6245021 6005439 5804050 5615798 5407351 5260932 5137293 4980509 4841813
10041D841813p7275j36169o3710r630M0847O9406J79756L34548M10187L57269
10031E947042J40452l16596n12268l18539p6523M5648L4970m6808j55340j67410
10021D574628j40241k14962j93872j75814j37020j17726j25630j29234q7997p2144
10011C179988j04101r9808l1524n8298L5119J66539J13522P6187M6892q4631j34868
10000C105017j76498j55304p3873j25530j15867r2262r2366j15974j00281n6180
9990B000882K0749n8224j01378p5193k3622j8406j7484k702k0380m6790n7558
9979A599894m1916L7867N773p8153m0399l9484M9868J0709j0606o1751j7448N9532
9967A473886M0850M1773L8197N3565N3980J3714J1199J42276K60806K93076M69453
$$ plain form
10041 4841813 4764538 4628369 4564659 4555029 4595876 4665282 4845038 5179586 5589773 5947042
10031 5947042 6087494 5770898 5258630 4940091 4863568 4909216 4944186 4897378 4742038 4574628
10021 4574628 4434387 4219425 4025553 3849739 3712719 3594993 3469363 3340129 3252132 3179988
10011 3179988 3075887 2976079 2944555 2886257 2921376 3087915 3201437 3277624 3324516 3239885 3105017
10000 3105017 2928519 2773215 2699342 2573812 2457945 2365683 2273317 2157343 2057062 2000882
9990 2000882 2021631 1963407 1862029 1786836 1763214 1744808 1727324 1724622 1704242 1657452 1599894
9979 1599894 1557978 1595845 1601618 1523465 1483066 1443582 1493450 1504159 1493553 1431802 1414354 1473886
9967 1473886 1514736 1556509 1594706 1648271 1702251 1715965 1727164 1869440 2130246 2423322 2892775
9956B892775N54453M66661L63589K12015q9280l93534m57062m95183l62487k73949
9946B417998j79296j58494r7031r1460o3033k8008M081p8771m9431r9872o4111
9935A512572o5160m5727j05574n9135k4662J9603n4975q5743J0693m210p0134
9924A027548m5823K5227J1828m87l920j0258N0648K2181k5073K3737P5500m104
9912A147004k9867n3003J1196R6598J7685N768O3612R2792N5346J06487Q3527
9901A597145J11098J43764J46924J74410J86064J96474L55328M31036N31228P62087
9891D635558J017222J304505J616304J898098K122721K034789J691980R61846
9883A7283023R4034q88522j552102j815751j761578j513553j220676r91094q28662
$$ plain form
9956 2892775 3447228 3913889 4277478 4489493 4400213 4006679 3549617 3054434 2691947 2417998
9946 2417998 2238702 2080208 1983177 1891717 1828684 1800676 1804757 1725986 1676555 1576683 1512572
9935 1512572 1447412 1401685 1296111 1236976 1212314 1231917 1176942 1091199 1101892 1097682 1027548
9924 1027548 981725 1006952 1018780 1018293 1014373 1004115 1054763 1076944 1051871 1075608 1151108 1147004
9912 1147004 1117137 1064134 1075330 1171928 1189613 1195381 1258993 1351785 1407131 1513618 1597145
9901 1597145 1708243 1852007 1998931 2173341 2359405 2555879 2911207 3342243 3873471 4635558
9891 4635558 5652780 6957285 8573589 10471687 12594408 14629197 16321177 17283023
9883 17283023 17377057 16488535 14936433 13120682 11359104 9845551 8624875 7633781 6805119
9874F805119o69406n91918n32174m89995m96870l93554l13483k49930k34598k41512
9864B591679j24830n1429j64743j72620j37424j73625j45932q6010r0050m3491
9854A401525k0437n7719q340o6104l2018p4934p1837n261L140M651J9150l2655
9842A059161k861K1689K7170L9255J10863J88105K10747K90860K11098L2063j77350
9831B010800l37020k87115j62817m3316o8579r6484o3128o5593j5773l4659m3812
9820G92504m9268m8887j6692P8120L3489M761l2573m1568O5507m0293j0634J9899
9808G54365m0014m3902p567j571P938Q086j3862m6992l971n677k5077n952L5403
9795F11207L6850o7678m3972N1838k0376o159L0645J4189m7958l0753Q258N6265
$$ plain form
9874 6805119 6135713 5543795 5011621 4521626 4024756 3631202 3317719 3067789 2833191 2591679
9864 2591679 2466849 2415420 2250677 2078057 1940633 1767008 1621076 1535066 1445016 1401525
9854 1401525 1381088 1323369 1315029 1248925 1216907 1141973 1070136 1064875 1068015 1072666 1091816 1059161
9842 1059161 1056300 1077989 1105159 1144414 1255277 1443382 1654129 1944989 2156087 2188150 2010800
9831 2010800 1673780 1386665 1223848 1180532 1111953 1015469 952341 886748 870975 836316 792504
9820 792504 743236 694349 677657 755777 789266 794027 761454 719886 785393 745100 734466 754365
9808 754365 714351 670449 662882 661311 669249 677335 663473 616481 612510 606833 581756 575804 611207
9795 611207 648057 580379 536407 588245 567869 561710 592355 606544 558586 527833 536091 592356
9783E92356O5334O3544l2187r6153j1778j2064m285L166J9495K1265l5612j3572
9771E59509P9909K1822p5098j4214J5153N6822L6405j3896n1914p2043K9340Q569
9759E80364j7095K6250M5351j395k7217k3246l5770l789k1250k9612k0618k6366
9747D45607L0234N806L5369k1156l0033l369N4900M9223J8458j7439N5054n5062
9735E67592k4661L834L0669J5098K0420M3088j2404k1134m7914k5135j4326L020
9723E38147N9497M4167q559o2829o710L273k78L4884J19712R2727N3807L2509
9711I00347O289l8271q0622l3028o1193q4815q569P961p609j0803o304j2827j823
9698E68733M557l5801J8231L4293l7657K389o2317l5787N062N2902N0316j0716
$$ plain form
9783 592356 657690 721234 689047 592894 581116 569052 564767 567933 587428 608693 573081 559509
9771 559509 639418 661240 586142 571928 587081 643903 680308 666412 614498 542455 571795 580364
9759 580364 563269 589519 634870 633475 606258 583012 547242 543453 522203 492591 471973 445607
9747 445607 475841 481647 517016 495860 465827 462458 517358 566581 585039 567600 622654 567592
9735 567592 542931 546765 577434 592532 612952 656040 643636 622502 574588 549453 535127 538147
9723 538147 597644 641811 633252 570423 563713 566986 566708 601592 721304 814031 867838 900347
9711 900347 906636 868365 787743 754715 693522 608707 600138 608099 600490 589687 583383 570556 568733
9698 568733 573290 537489 555720 590013 552356 554745 492428 456641 461703 514605 564921 554205
9686E54205l8637j8922J6048j2004L731P3685L2372L5792M2588N0550J0143O1465
9674H11016P3407O1818R0653K12046K12263K05477J86431J03993O8951Q20r9766
9663A927109j99994j86575j38172j41505r0178q3585o9348l9886o8800k1194o5703
9652H22169m4960j5368m2172j1271J769k9299q6734L209J7768o1557l9582j8344
9640D95628N8326m240k9618r064N200k6793L6942K8575J525k3324P835K2422L5542
9627E98956O847J0297k2219k4668o138m5748N448K28K313J9333J6799J1034l1486
9614E40996J7033m4193l2064N0717n460m5304J0208K2847j9412j4155n2032j4446
9602D14735J8251m2338M993Q8714K0948k160l7321j6205K3366J1453p3303K1463
$$ plain form
9686 554205 515568 496646 512694 500690 504421 578106 610478 646270 688858 739408 749551 811016
9674 811016 884423 946241 1036894 1248940 1461203 1666680 1853111 1957104 2026055 2026875 1927109
9663 1927109 1727115 1540540 1402368 1260863 1170685 1087100 1017752 977866 909066 887872 822169
9652 822169 777209 761841 719669 708398 710167 680868 594134 597343 615111 553554 513972 495628
9640 495628 553954 549714 520096 511032 516232 489439 526381 554956 556481 533157 540992 563414 598956
9627 598956 605803 616100 593881 569213 563075 517327 522775 523003 525316 544649 561448 572482 540996
9614 540996 558029 513836 481772 532489 527029 481725 491933 514780 495368 481213 429181 414735
9602 414735 432986 390648 395641 484355 505303 503143 465822 449617 472983 484436 411133 432596
9590D32596N2881O8917N5860j3588k3318N0055K9532K716m3868K710J3846m0553
9578E87786m1193p00N039j624M2780M9549M9710m4116K3441k2638J838j4840l0917
9565F04115m0583L5023L1192L7438J8973N0178k5061n9190l1168q431k9775r909
9553E72802N083M5633J6471m1762l0319J8402O672j0097O62L5348l3067j4373
9541E71455k7089k6292m7388n3360j4534K4342J9905k5692j8390J6775O5133r568
9529D75297j957K2784J4709J3861J6955j4258m8882Q975N0074j4235k6991j5367
9517D80965K6441O3401j0559M144L3463L7023n1334o6133m0570m2775q303l4795
9505C90968j5818L4143N7141q045m282j1364j6144J1257J9519M1200j607K9297
$$ plain form
9590 432596 485477 554394 610254 596666 573348 623403 652935 655651 611783 614493 628339 587786
9578 587786 546593 545893 550932 549308 592088 641637 691347 647231 670672 648034 649872 635032 604115
9565 604115 563532 598555 629747 667185 686158 736336 711275 652085 620917 612486 582711 572802
9553 572802 577885 623518 639989 598227 567908 586310 592982 582885 583547 618895 585828 571455
9541 571455 544366 518074 470686 417326 402792 427134 447039 421347 402957 419732 484865 475297
9529 475297 473340 496124 510833 524694 541649 527391 478509 487484 537558 523323 496332 480965
9517 480965 507406 570807 560248 564392 597855 634878 583544 517411 476841 434066 425763 390968
9505 390968 375150 409293 466434 458389 454107 442743 426599 437856 457375 498575 496968 526265
9493E26265M7048J181l7733j6989P0974n602o8575N938l8552q277M382m200K0153
9480D96013J4745j0480L9944l4847n283J8683j4498L3396M0529M8153K4074m3203
9468F07226l8665J0985K2000j9254j594M311l9981N9856M49O694j0369j1137L0865
9455F21386J6100k1224J8300n77p233m802m200k5065n2851j2919O4900M8225l3336
9442F06704o3918M994j696m5323j5252N167L9305j1488k1406M39M2306L1612k750
9429E68694n3338P568J3065k2572m1288O535K9775L1137k524n8979k3896R504
9417D63681M126m317J5568K0070k0316L5390N5830m4149L6268N3514p7434o1967
9405D76264Q142o344J8505M1416K4713L8253J3360L7486n4426l9472L3539j2517
$$ plain form
9493 526265 573313 574494 536761 519772 590746 585144 516569 522507 483955 475678 480060 475860 496013
9480 496013 510758 500278 540222 505375 500092 518775 504277 537673 578202 626355 650429 607226
9468 607226 568561 579546 601546 582292 580698 585009 545028 604884 605333 612027 601658 590521 621386
9455 621386 637486 616262 634562 633985 626752 621950 617750 592685 539834 526915 591815 640040 606704
9442 606704 542786 547780 546084 500761 485509 490676 529981 518493 497087 497526 539832 571444 568694
9429 568694 515356 522924 535989 513417 472129 478664 508439 539576 537052 478073 454177 463681
9417 463681 467807 463490 479058 499128 478812 514202 570032 525883 562151 615665 538231 476264
9405 476264 484406 478062 496567 537983 562696 600949 614309 651795 597369 557897 591436 578919
9393E78919n710P5284O8817o0908p3392L7408J7495m5734M0376M6137l7534n7797
9381E83361j9996O1813J9746Q906j4779K478L6690J6159j4574l9720J7999j4470
9369F43613q616N5657K0434K1304j6799l6210k5685J2390j302K4182K1088k9678
9357F80378j3498J1160J9008M1331J1653n5012l9601J2024o059K870k9086O314
9345F41482J7797N6932M5533j1878o2936m8113J8720j4707r046k7802J0938L2045
9333F48965J4990L7383L4796K6821k8560l4047Q608k503p4379m5536N2728Q6851
9321G26117O9942K21j4708m4862k9623j5901R582K5750j3912l0604J2439K7413
9309G21854k6007l77J2198J0373K8135l578k4418L0108J8909P2057l1003m9543
$$ plain form
9393 578919 573209 648493 717310 656402 583010 620418 637913 592179 632555 678692 641158 583361
9381 583361 563365 625178 644924 653830 639051 641529 678219 694378 679804 640084 658083 643613
9369 643613 634997 690654 711088 732392 715593 679383 653698 666088 664786 688968 710056 680378
9357 680378 666880 678040 697048 738379 750032 695020 655419 667443 661384 664254 635168 641482
9345 641482 659279 716211 761744 749866 686930 638817 657537 642830 633784 605982 616920 648965
9333 648965 663955 701338 736134 762955 734395 700348 708956 706453 632074 586538 639266 726117
9321 726117 796059 796280 781572 736710 707087 691186 700768 726518 712606 682002 694441 721854
9309 721854 695847 695470 707668 718041 746176 742598 718180 748288 767197 839254 808251 758708
9297G58708J3736j1954k5831J371J820M1708O2412P3257j1748j5485n293l4206
9285H48495k5834o7385j7189M5249j716M1913J9100L2512L7419n3090m6795l250
9273H09429L103J6631O8674j3933l4567k5922L0942O1372J0015k1471M8327l4265
9261I18335o1749R315N3394M7104m116P669j7279l9738R42J5154k5049k2105j116
9248H80761K1061m1675M6095K2980J282Q0904L6221p1230l3520l1762K619K6906
9236I40642L2300L5050N9113N6129p3279m7547r854K2681N140K0165O20J3760
9224A054920N2497k6906k3978p5271M6622l784l0656K8190p1401l9099M3328N3278
9212A007740J1534L0875r980j0727J0186K9520j5425l0546L3663J9001p001J2446
$$ plain form
9297 758708 772444 760490 734659 736030 737850 779558 841970 915227 903479 887994 882701 848495
9285 848495 822661 755276 738087 783336 781620 823533 842633 875145 912564 859474 812679 809429
9273 809429 812532 829163 897837 883904 849337 823415 854357 915729 925744 904273 952600 918335
9261 918335 856586 865901 919295 966399 962283 969952 952673 912935 913877 929031 903982 881877 880761
9248 880761 901822 860147 906242 929222 930504 1011408 1047629 976399 942879 911117 913736 940642
9236 940642 972942 1007992 1067105 1123234 1049955 1002408 992554 1015235 1020375 1040540 1041160 1054920
9224 1054920 1107417 1080511 1056533 981262 1027884 1024100 993444 1021634 950233 911134 954462 1007740
9212 1007740 1019274 1050149 1040169 1029442 1039628 1069148 1053723 1023177 1056840 1075841 1068840 1081286
9200A081286q056J5074q8P7118Q0882m1271j9467Q943j5j397L4151M2919n1990
9187A218089l8082L5818k4268k1818M5216j680J333o515P2786K9780k0818j6962
9175A272879M7766k3720K6088Q793l4372j8506k9526K561J4321O1686L6498K7086
9163A391554n438L0835o151R812j8015L8724m201q6261m6127L04P3584Q6375Q193
9150A473188L7479K7883k7985j0492L797k0705j6637m7878j5890O8610O1474K9560
9138A562404J392L9544m3250k5900L9634N6783k7482n4031r200j3129K1468P8562
9126A626795P6326K9959p931K5149L3541J2841m0256j4986l2979k610M3467J0307
9114A759623j0585m6578k1693K7k0055Q8733Q3070p169J5436k645J7585L9108
$$ plain form
9200 1081286 1073230 1088304 1088216 1165334 1246216 1204945 1185478 1194421 1194406 1193009 1227160 1270079 1218089
9187 1218089 1180007 1215825 1191557 1169739 1214955 1213275 1214608 1208093 1280879 1310659 1289841 1272879
9175 1272879 1320645 1296925 1323013 1331806 1297434 1278928 1249402 1251963 1266284 1327970 1364468 1391554
9163 1391554 1386116 1416951 1410800 1420612 1402597 1441321 1437120 1350859 1304732 1305036 1378620 1464995 1473188
9150 1473188 1510667 1538550 1510565 1500073 1503870 1483165 1466528 1418650 1402760 1471370 1532844 1562404
9138 1562404 1563796 1603340 1560090 1534190 1573824 1630607 1603125 1549094 1539894 1526765 1548233 1626795
9126 1626795 1703121 1733080 1725149 1750298 1783839 1796680 1756424 1741438 1708459 1705849 1749316 1759623
9114 1759623 1749038 1702460 1680767 1680794 1660739 1749472 1832542 1825373 1840809 1838164 1855749 1894857
9102A894857K2105j1221j9424K8698K9993j2315l8266K649O9799M4965K2979k1299
9090B013520l8194q405K2604P6324n782k4436p08l1930L0932L9315M6417R402
9078B129059J1565L4834L2716M0633j4607l3122L0236R2531J0069m458L4571K4864
9066B388891n4266j3438L3734L7926m5394K7111O5665n9041N6028N8795q948Q448
9054B495511P2471J659n543P409J4728K2447N4175L2310P0654M0824j0384j27742
9042B668519q1211O6584P4372P9517l567j1100M2609M2554K5748L5252l855Q225
9030B943647J7729l7373O923L2228L1866K0735O0704K6457N0733Q6292L0568J046
9018C271555K0252N0936K7235p027J2291M3369p711l0388K6787J01950M9258l9291
$$ plain form
9102 1894857 1916962 1905741 1886317 1915015 1945008 1932693 1894427 1897076 1966875 2011840 2034819 2013520
9090 2013520 1975326 1966921 1989525 2065849 2060067 2035631 2034923 2002993 2033925 2073240 2119657 2129059
9078 2129059 2140624 2175458 2208174 2248807 2234200 2201078 2231314 2323845 2333914 2329456 2364027 2388891
9066 2388891 2334625 2321187 2354921 2392847 2347453 2374564 2440229 2381188 2437216 2496011 2487063 2495511
9054 2495511 2567982 2569641 2564098 2571507 2586235 2608682 2662857 2695167 2765821 2806645 2796261 2668519
9042 2668519 2587308 2653892 2728264 2807781 2804214 2793114 2835723 2878277 2904025 2939277 2935422 2943647
9030 2943647 2961376 2924003 2930926 2963154 2995020 3015755 3076459 3102916 3153649 3239941 3270509 3271555
9018 3271555 3291807 3342743 3369978 3362951 3375242 3418611 3410900 3380512 3407299 3509249 3558507 3519216
9006C519216K697P3844L2191N2905K1584k9668O0227M7802K2626M1947L9459P1450
8994C956280K0542o07j3578N8103J13072N1628K1107K8329Q9653J13190K5869
8983D463588J6162r647N2586Q6456K6109L3954K6501O0700K5639N6312N8198M1451
8971D938009P1029L8347N355K8987N5468O9656O199N6583P1445Q1410K0512Q5522
8959E528522P8719M1828M0108Q2156N6850P5824O7625J6865J01288J10070J5524
8948F215379J0847P4407R457R1606R9966R9964P2511K7443J30306J14715M6601
8937F993202J1777R7387J65086N3264n118R7170J23813O8434N7862P5599R5312
8926G833788J18760J07368J07492P4459R2675J47142J16182J16583P2832Q7746
$$ plain form
9006 3519216 3521913 3595757 3627948 3680853 3702437 3672769 3732996 3780798 3803424 3845371 3884830 3956280
8994 3956280 3976822 3976215 3962637 4020740 4133812 4185440 4206547 4234876 4324529 4437719 4463588
8983 4463588 4479750 4470103 4522689 4609145 4635254 4669208 4695709 4756409 4782048 4838360 4896558 4938009
8971 4938009 5009038 5047385 5052740 5081727 5137195 5206851 5213050 5269633 5341078 5422488 5443000 5528522
8959 5528522 5607241 5649069 5689177 5771333 5828183 5904007 5971632 5988497 6089785 6199855 6215379
8948 6215379 6226226 6300633 6310090 6401696 6501662 6601626 6674137 6701580 6831886 6946601 6993202
8937 6993202 7004979 7102366 7267452 7320716 7315598 7412768 7536581 7605015 7662877 7738476 7833788
8926 7833788 7952548 8059916 8167408 8241867 8334542 8481684 8597866 8714449 8787281 8875027
8916H875027R7410J20346J34008P9477O2424R1023J60558J41454J51550J40748
8906A0054025J53131J01586R4581J29067R1260R7719J39753J35141J57481J42668
8896A1296412J82659J93118J42509J44772K05398J83097J50139J63521J83998
8887A2845623J56617J74604J63346J12520K22781K17090J88401J37813J88545
8878A4407340K41740K00176K05887K46340J69673K09193K26641K10904J74015
8869A6291909J92447K85068J93669J79996K92352K34236J98503K77733L04250
8860A8450163K32644K10853K81614L04089L00948K27554K27223K88967K41527
8851B0765582K54598K93799L21873K42967K60059K24564K17708K44848K87064
$$ plain form
8916 8875027 8972437 9092783 9226791 9306268 9368692 9459715 9620273 9761727 9913277 10054025
8906 10054025 10207156 10308742 10403323 10532390 10623650 10721369 10861122 10996263 11153744 11296412
8896 11296412 11479071 11672189 11814698 11959470 12164868 12347965 12498104 12661625 12845623
8887 12845623 13002240 13176844 13340190 13452710 13675491 13892581 14080982 14218795 14407340
8878 14407340 14649080 14849256 15055143 15301483 15471156 15680349 15906990 16117894 16291909
8869 16291909 16484356 16769424 16963093 17143089 17435441 17669677 17868180 18145913 18450163
8860 18450163 18682807 18893660 19175274 19479363 19780311 20007865 20235088 20524055 20765582
8851 20765582 21020180 21313979 21635852 21878819 22138878 22363442 22581150 22825998 23113062
8842B3113062L09017K39026K65869L15134K89497K79330K95439K88269K25392
8833B5620035K53623K46922J88771J76578K25290K53327K45220K43865J04991
8824B7558622J92740K49463J46119J78456K65138K35236K26825J76689J11392
8815B9340680J24062J00550J32822J94839J20971N5341L6907N3080Q9492Q0567
8805C0329311J03273P021J5026n864O5475M3095l3905k2802n7687n8867m3508
8794C0340568r7117j19127r8159q1487o7657j28848p5213j19521j62140j68614
8784B9222685j67719j92083k20811k05589k17139j41634j63260k00681k43787
8775B7469982k56609l18828k29817j98270j78474k67253k54310j96413k44627
$$ plain form
8842 23113062 23422079 23661105 23926974 24242108 24531605 24810935 25106374 25394643 25620035
8833 25620035 25873658 26120580 26309351 26485929 26711219 26964546 27209766 27453631 27558622
8824 27558622 27751362 28000825 28146944 28325400 28590538 28825774 29052599 29229288 29340680
8815 29340680 29464742 29565292 29698114 29892953 30013924 30069265 30106172 30159252 30248744 30329311
8805 30329311 30432584 30439605 30454631 30448767 30514242 30557337 30523432 30500630 30442943 30384076 30340568
8794 30340568 30243451 30124324 30026165 29944678 29877021 29748173 29672960 29553439 29391299 29222685
8784 29222685 29054966 28862883 28642072 28436483 28219344 28077710 27914450 27713769 27469982
8775 27469982 27213373 26894545 26664728 26466458 26287984 26020731 25766421 25570008 25325381
8766B5325381k94684k90454k26086k13497k56800l10218k64837k62539k59805
8757B2946461k62592k57927k39134k40831k75386l61029k89019k31869k48663
8748B0540011k58573k91811k53714k48168k02754k43495k22889k06112l02128
8739A8310367k55718k05949k45246k70160k15523k19011k15469k33627k04402
8730A6245262k31966k80978k48087j64298j55792j95998j77323j61854j91627
8721A4437339k75706k03021j85054j46449j12535j75656j96361j37632j97661
8712A2807264k31727j36267j40540j77304j86355k34278j50183n8994j06687j02581
8702A1282348q8213j72232j39730j45192j65020j10153j62241j39356j21423j37652
$$ plain form
8766 25325381 25030697 24740243 24514157 24300660 24043860 23733642 23468805 23206266 22946461
8757 22946461 22683869 22425942 22186808 21945977 21670591 21309562 21020543 20788674 20540011
8748 20540011 20281438 19989627 19735913 19487745 19284991 19041496 18818607 18612495 18310367
8739 18310367 18054649 17848700 17603454 17333294 17117771 16898760 16683291 16449664 16245262
8730 16245262 16013296 15732318 15484231 15319933 15164141 14968143 14790820 14628966 14437339
8721 14437339 14161633 13958612 13773558 13627109 13514574 13338918 13142557 13004925 12807264
8712 12807264 12575537 12439270 12298730 12121426 11935071 11700793 11550610 11491616 11384929 11282348
8702 11282348 11194135 11021903 10882173 10736981 10571961 10461808 10299567 10160211 10038788 9901136
8692I901136r6080o7134j33951j37013j37979j22778j22882j34124j07579l9249
8682H802367o4631o5129q4283p0403j31607j03510o7949j19841j38690r0899q0921
8671G784504j05531j05797q7297l8532o3131j21898j06080j85106n2801K02r4696
8660F823837p8774m7359p6943p1885k6485p5371p1163r5293l6876p9420k8960
8649F135308k1516p4987j53496k2034p7411p9639p2479p0842J4813J0928j9297
8638E569348j5077m8223n7375l1138O1959j7998l2242m6970q2339n6611j05565
8627E137769p6728r0281q236K278m7426p3172l4568n6186k3403J5957m7753q5566
8615D612685q4701q6700o0872m5869n7355l4696q539k8116j1760m2046n6474N1295
$$ plain form
8692 9901136 9805056 9737922 9603971 9466958 9328979 9206201 9083319 8949195 8841616 8802367
8682 8802367 8737736 8672607 8588324 8517921 8386314 8282804 8214855 8095014 7956324 7865425 7784504
8671 7784504 7678973 7573176 7485879 7447347 7384216 7262318 7156238 6971132 6918331 6918533 6823837
8660 6823837 6745063 6697704 6620761 6548876 6522391 6447020 6375857 6280564 6243688 6164268 6135308
8649 6135308 6113792 6038805 5885309 5863275 5785864 5706225 5633746 5562904 5577717 5588645 5569348
8638 5569348 5554271 5506048 5448673 5417535 5479494 5461496 5429254 5382284 5299945 5243334 5137769
8627 5137769 5061041 4970760 4962524 4964802 4917376 4844204 4809636 4753450 4730047 4746004 4698251 4612685
8615 4612685 4527984 4441284 4380412 4334543 4277188 4242492 4233953 4205837 4194077 4152031 4095557 4146852
8603D146852K8384k5863l5296J973k0141j9064m3214l8567M3404P0125J7944l6801
8591D089736K7636J21449J22153J80650P2258q5961j60923k05215j26597p7802
8581C957384l6944r2844m5189N322l0429n6194m4424q8607o7448j6481k9596j4678
8569C439872j7088j12323l9060n1706j5776n8842n4183k1360K2173J3921m7662
8558C057966q3845j8730M8721O4813Q652l617m1679p1231p2081j9982L452J1395
8546B883834L0J8964K1155J9645j1240m3916p5947p4072k2635o3544q8724j8959
8534B544591l6414l3653n9978o4154M3595n1767k4772k8246k7345J3518N7249
8523B332624K4760K7740J04713M4736Q2739k2387o9892m4259p8746o0587n4009
$$ plain form
8603 4146852 4175236 4149373 4114077 4116050 4095909 4076845 4033631 3995064 4038468 4108593 4126537 4089736
8591 4089736 4117372 4238821 4360974 4541624 4613882 4527921 4366998 4161783 4035186 3957384
8581 3957384 3920440 3827596 3782407 3787729 3757300 3701106 3656682 3568075 3500627 3484146 3454550 3439872
8569 3439872 3422784 3310461 3271401 3219695 3203919 3145077 3090894 3069534 3091707 3105628 3057966
8558 3057966 2974121 2955391 3004112 3068925 3077577 3073960 3032281 2961050 2888969 2868987 2872439 2883834
8546 2883834 2883864 2902828 2923983 2943628 2932388 2888472 2812525 2738453 2715818 2652274 2563550 2544591
8534 2544591 2508177 2474524 2414546 2350392 2393987 2342220 2317448 2289202 2261857 2275375 2332624
8523 2332624 2357384 2385124 2489837 2534573 2617312 2594925 2525033 2480774 2402028 2341441 2287432
8512B287432l3784p856k873j8358o180m5412j111n4397m4634n5957j9103J6115
8500B013882J4376J30o8761l9275j4179j2074N0564M1525l3834m9075m1400j8959
8488A842920j0485j6934Q0829Q415l0385j3814J8775O9980J15264P8975l3417
8477B110123p3552q7878o0326j5800m5153n8501m6023j0687k8963n0581o411M135
8465A630383J9025O318l3812k3590M987j1679k309P773o0830n2782L5312j4385
8453A504411o2703R576m0901l9834l738L2372J2635k2543J8503O1749J8435m3509
8441A444453j2009M923k4570p7425k2473j9273K0606P7609K2448l1029J1714O231
8429A401205j3233J825R247m4194m8101k0564k7203l2521J4992Q6667R021p9913
$$ plain form
8512 2287432 2253648 2245792 2242919 2224561 2218381 2172969 2171858 2117461 2072827 2016870 1997767 2013882
8500 2013882 2028258 2028388 1959627 1920352 1906173 1894099 1944663 1986188 1952354 1903279 1861879 1842920
8488 1842920 1832435 1815501 1896330 1904745 1874360 1860546 1879321 1949301 2064565 2143540 2110123
8477 2110123 2036571 1948693 1888367 1872567 1827414 1768913 1722890 1712203 1683240 1632659 1626248 1630383
8465 1630383 1649408 1655726 1621914 1598324 1603311 1591632 1589323 1597096 1536266 1483484 1518796 1504411
8453 1504411 1441708 1451284 1410383 1370549 1366811 1399183 1411818 1389275 1407778 1469527 1487962 1444453
8441 1444453 1432444 1437367 1412797 1335372 1312899 1293626 1314232 1391841 1414289 1383260 1394974 1401205
8429 1401205 1387972 1389797 1399044 1354850 1306749 1286185 1258982 1226461 1241453 1328120 1337141 1257228
8417A257228M7333L2420k0140l3714J884k4525o9000n7272M7463k1310J8173L0836
8405A209376l7209j2523q3077o3559L4594K5963K4956J2445K8638N9232k4418
8394A174418k4821k6639O181j0922M415L620p2551m6092l1662j4528O5519O3573
8382A090511N0485n240n2425R303j7933o0919j4895l7067K3469J2587k5983L9201
8370A011094N7103l9876m3198O0136O2264l0834j7993n5593P3009Q6825J3031
8359A175968n6832r294N453K0413r772l2182q225j3248o6860l5059j7053O304
8347I59613L609j3292l5914j0416k9161o1411R997J4937o025j3720J259L4680
8335H54156j1410L0018K9911J0240L342j447l1915R4087M3172o6632j4075K3730
$$ plain form
8417 1257228 1304561 1336981 1316841 1283127 1285011 1260486 1191486 1134214 1181677 1160367 1178540 1209376
8405 1209376 1172167 1159644 1076567 1013008 1047602 1073565 1098521 1110966 1139604 1198836 1174418
8394 1174418 1149597 1122958 1129139 1118217 1122632 1126252 1053701 1007609 975947 961419 1026938 1090511
8382 1090511 1140996 1135756 1083331 1092634 1074701 1013782 998887 961820 985289 997876 971893 1011094
8370 1011094 1068197 1028321 985123 1045259 1107523 1076689 1058696 1003103 1076112 1162937 1175968
8359 1175968 1119136 1109842 1115295 1135708 1125936 1093754 1085529 1072281 1005421 970362 953309 959613
8347 959613 963222 949930 914016 903600 874439 813028 823025 837962 831937 818217 819476 854156
8335 854156 842746 872764 902675 912915 916257 914810 882895 976982 1020154 953522 939447 963177
8323I63177n1402N5956M0540N9042K173o4176q6236k6845N2389n873n5208j8532
8311H65005M3871m6772j8344l4143M876m131M790N7734J9042J1754n0215k3560
8299H29907M264J0215l6914M0769O3126J0388P203J0595R2508J16970J30729J70205
8287A449965K21414L69993N43949P20544P12914N25856j7391n12824o60752n91131
8277B762537m31377k85474k10416j20151j13682j27301q5598m3780p0051p6446
8267A198261p7827m6078r305j0841m9808k2364m1574q6200J9692L8688M1731o4164
8255H90211j4004O8316N084k2010P311P0315P8070J04321J21887J95495L17811
8244A822807M37085N36060O72706O66297L51128j64738n76164p42360n97995l68807
$$ plain form
8323 963177 911775 967731 1008271 1067313 1069486 1005310 919074 892229 944618 938745 883537 865005
8311 865005 908876 862104 843760 809617 814493 810362 815152 872886 891928 903682 853467 829907
8299 829907 834171 844386 807472 848241 911367 921755 928958 939553 1032061 1149031 1279760 1449965
8287 1449965 1671379 2041372 2585321 3305865 4018779 4544635 4527244 4014420 3353668 2762537
8277 2762537 2331160 2045686 1835270 1715119 1601437 1474136 1388538 1344758 1274707 1198261
8267 1198261 1120434 1074356 1065051 1054210 1004402 982038 940464 854264 873956 912644 954375 890211
8255 890211 876207 944523 949607 927597 934908 1005223 1083293 1187614 1309501 1504996 1822807
8244 1822807 2259892 2795952 3468658 4134955 4486083 4321345 3745181 3002821 2404826 2036019
8234B036019k45013j21019r1122r3119r2207j15552p3504r4469q2688n6511o428
8223I64387l885m9381k5517o6180k0033j6215l8944j0759m3293o1093n2722k12
8211E76153K3368N536j779J7049j0931k191k9831m0946l849J5898p656j1790J54
8198E29185M6723J0542l8844P4J9592m4446j8779K3864L121l1726J3124J4343
8186E26773j5694j3154J3140J1470R189J2597k899r155n9158O650Q0219L9189
8174E99167n5733K8168J1644m7116m1665m95L0428o348n8569j2549Q79k8203l3454
8161C86154J5941P686L2954M9911P449J8738J0702K0226n7847m0883k0588O1744
8149D92187J4327M5340k0380l5672M00J852m152o295l6517M6092k0394l8021k7987
$$ plain form
8234 2036019 1791006 1669987 1578865 1485746 1393539 1277987 1204483 1110014 1027326 970815 964387
8223 964387 960502 911121 885604 819424 799391 783176 744232 733473 690180 629087 576365 576153
8211 576153 599521 605057 603278 620327 609396 607205 577374 536428 532579 548477 540821 529031 529185
8198 529185 575908 586450 547606 547680 567272 522826 504047 527911 531032 499306 512430 526773
8186 526773 511079 497925 511065 522535 531724 544321 541422 532267 473109 479759 559978 599167
8174 599167 543434 571602 583246 536130 494465 493970 524398 518050 459481 446932 447811 419608 386154
8161 386154 402095 409781 442735 492646 500095 518833 529535 549761 491914 451031 430443 492187
8149 492187 506514 551854 531474 495802 496202 498054 493902 487607 451090 497182 476788 438767 410780
8136D10780M0569M4282m9261l6111J2771K5924k589O679m348k9746k0219M288
8124D03019J6337r444r897O1842O2676o7714o3149k2102J6111j0263N600L6707
8112D19723J6116L2622K7534l3853k7842r181k0260R433J5598n7341N0693M6089
8100D69331p624k9514k486J906K6657N530J4029n8357o7016J0306J16596k0733
8088D58625l3044n785N1612k1871K5290k4259m4342R529L0407K1271N4807q752
8076E13488l6303P269l8407l6955l3869m0188q991J967l661l4707j807M5773L1848
8063C65457L398o601K5263J5317P488m9857N1892p175j649K8341n0417o3194l1504
8050B86759P632L9034j8307n9411J7006K3372L6987k1906M8752O0398k5767N938
$$ plain form
8136 410780 451349 495631 446370 410259 423030 448954 446365 453044 448696 418950 398731 403019
8124 403019 419356 409912 400015 461857 524533 456819 393670 371568 387679 377416 383016 419723
8112 419723 435839 468461 495995 462142 434300 425119 404859 414292 429890 372549 423242 469331
8100 469331 461707 432193 429707 431613 458270 463800 477829 419472 352456 362762 479358 458625
8088 458625 425581 419796 471408 449537 474827 450568 406226 415755 446162 467433 522240 513488
8076 513488 477185 484454 446047 409092 375223 335035 326044 328011 324350 289643 287836 333609 365457
8063 365457 368855 362254 387517 402834 410322 360465 412357 405182 403533 431874 381457 318263 286759
8050 286759 294391 333425 315118 255707 272713 296085 333072 311166 359918 420316 394549 400487
8038D00487j2171J7494K6169k9448M2656K5819J5008m2672j00146J0911L5193
8027C89300j2897j2473J5844J9426l1335o3031J9646M6000j7319M148l631j0150
8015C43528P5524J0434l3397L442N227k3505k5055J4388l1441q536N0039j1791
8003C68857l714M8771O3836K0904l49M043r4439m6996M8214J6802j7352L4684
7991D43261m674J1727L0581Q1494M7476o902n901j4465k6408p818k0957m3551
7979D83863n3775o17M5567J674J3132j0513n9969j8946P3067L9065j9202L6489
7967E29835K6256o1468k8835j3412l0318O420J9936j6776j7213L1696M0700L0131
7955E16952j4544o9819l2680K9611L6647l6992M236m432m4666l3639L7695P114
$$ plain form
8038 400487 388316 405810 431979 402531 445187 471006 486014 443342 343196 354107 389300
8027 389300 376403 363930 379774 399200 367865 304834 324480 370480 353161 357309 353678 343528
8015 343528 419052 429486 396089 399531 404758 381253 356198 370586 339145 330609 380648 368857
8003 368857 365143 413914 477750 498654 498305 502348 407909 360913 409127 425929 408577 443261
7991 443261 438587 450314 480895 562389 609865 602963 597062 582597 556189 548371 527414 483863
7979 483863 430088 429471 475038 476712 489844 479331 419362 400416 473483 512548 493346 529835
7967 529835 556091 494623 465788 452376 422058 428478 448414 431638 414425 446121 486821 516952
7955 516952 502408 432589 399909 429520 466167 429175 433411 428979 384313 350674 388369 395483
7943C95483M0774M2837J4425J7975L0620n7870J7963L2204k9360o6154o140j2699
7931D20058p606j5015m460K5541J12018L8463l7772p2111J7911J9276m3285l6194
7919D16824k4055K8315K2588j2277k8644l1472k8303L605j3603k6166K7173L3660
7907C67645p164J2238k0246l3621O325J9895O0939l7021n9674M13K2161M3348
7895C75238R461P6055l5484p1944j4100k1974l1234o642j2386J1117k1014l0783
7883B26310N3777M6917m4396N5953M7470j6508l6991n5742r616j0784l4187m434
7871B17769K2793j4116j8134k192J8861J1256K4714R2232N602l4995k9042n4810
7859B39938L382n137j1485j9325K6812K2580m3942K5557L5764k852P677L6178
$$ plain form
7943 395483 436257 479094 493519 511494 542114 484244 502207 534411 505051 438897 432757 420058
7931 420058 412452 397437 392977 418518 530536 568999 531227 459116 477027 496303 453018 416824
7919 416824 392769 421084 443672 431395 402751 371279 342976 346581 332978 306812 333985 367645
7907 367645 360481 372719 352473 318852 325177 345072 406011 368990 309316 309729 331890 375238
7895 375238 384699 460754 425270 353326 339226 317252 286018 279376 266990 278107 257093 226310
7883 226310 280087 327004 282608 338561 386031 369523 332532 276790 267174 256390 222203 217769
7871 217769 240562 226446 208312 206120 224981 236237 260951 353183 358785 323790 294748 239938
7859 239938 243320 238183 226698 207373 234185 256765 212823 238380 274144 271292 278969 315147
7847C15147k1283j3322l4946k0521J258J7199l2372J4008L0451q70K0233K1810
7835B96792K7255l3752k8542m0574p8410j2483P1187O0477l3773m9318J6652J6708
7823B12219l0893k5003l5883o863K3696O3550M2737K5699M9806J7336k2510m9233
7811B64658k2663l254P847N865p5958J0711M8721r481p8068j6576K3884N8298
7799B13984j2565l4954K2926N4704M9177l307k3132P618l1957j2977l3248k0105
7787A76164k6129K0603J0541l0706L5114J1815J2315N8341J0076m3832o8278K4141
7775A90165N0841l5116L757r861J0074L238K87L2807n1447n1515K538K2497N328
7762A73593J6368j1379k7445K2559L1171K0791M4l9386j4078J7368L7326j5728
$$ plain form
7847 315147 293864 280542 245596 225075 226333 243532 211160 225168 255619 254749 274982 296792
7835 296792 324047 290295 261753 221179 142769 130286 201473 261950 228177 178859 195511 212219
7823 212219 181326 156323 120440 113577 137273 200823 243560 269259 319065 336401 313891 264658
7811 264658 241995 238741 246588 252453 176495 187206 235927 226446 148378 131802 155686 213984
7799 213984 201419 166465 189391 244095 293272 289965 266833 274451 242494 229517 196269 176164
7787 176164 150035 170638 181179 150473 185587 197402 209717 268058 278134 234302 166024 190165
7775 190165 241006 205890 209647 199786 209860 213098 213385 246192 194745 143230 145768 168265 173593
7762 173593 189961 178582 151137 173696 204867 225658 225702 186316 172238 189606 226932 211204
7750B11204o0219m6749J5055M1527P4934K8640k6858m9783L577r150p7131O5004
7738A70051Q0604j3991k3635R545r629p9962j7525M072K5557K2333L0824J5555
7726B13799n0529J9868N751k9690Q792J5730j5650J019o9005k7850j631M1174
7714A11778K65K7050N8172R343Q653l157l9306l0188R477J0025j7563j5376l1016
7701I8157j1461k622j6430K8975L51Q047L2677n710K5721n0610n7315j0754p81
7688C8245O689L9092N2639l9703K169K4840N6543l433j8033L4366M1980O2592
7676B97986m1738k6967l7608l9452k8057O3646j4464l0469j6137N1756L6683l2128
7664A83051n6104l7639l3802Q295L6603M7438K3697J1913J2962p2497k9689L8489
$$ plain form
7750 211204 150985 104236 119291 160818 235752 264392 237534 187751 191328 182178 105047 170051
7738 170051 250655 236664 213029 222574 212945 132983 115458 119530 145087 167420 198244 213799
7726 213799 163270 183138 188889 159199 167991 183721 168071 169090 100085 72235 70604 111778
7714 111778 112043 139093 197265 206608 215261 212104 172798 142610 152087 162112 144549 129173 98157
7701 98157 86696 84074 67644 96619 96970 105017 137694 131984 157705 107095 49780 39026 38245
7688 38245 44934 84026 136665 96962 99131 123971 180514 177081 159048 193414 235394 297986
7676 297986 256248 229281 191673 152221 124164 187810 173346 142877 126740 178496 215179 183051
7664 183051 126947 89308 55506 63801 100404 147842 171539 183452 196414 123917 94228 132717
7652A32717j0182q382k777j2977K3384K6462K6007Q807m3452o169J4070J3654
7640A61162L06j9680l6428j197L379n946m9451k5446K4716R251L8545M378O1691
7627A65280N6328L1691R620O683m2847o1509j8898L5168p9203n1237L6677P0720
7615A58473J8058j8901R823n2803m7150j2333J1184l017o388Q387J67n931R508
7602F9077L421Q32J6883M710K5462l8058K3175M2435m405j6530j7935P821k187
7589A14701R169L0691K5333m5934k8001j2875l8507L308N7327O527m5153K8261
7577A04847O453O543j6249j4570L6849O6983l81j8380j1189R021J2147j5879j9300
7564A46895q3954k5797O8946J31229M4583k4200k6082n620m3268m0070k1145l708
$$ plain form
7652 132717 122535 114153 111376 98399 121783 148245 174252 183059 139607 133438 147508 161162
7640 161162 161468 141788 105360 104163 107542 101596 52145 26699 51415 60666 99211 103589 165280
7627 165280 221608 253299 262919 269602 226755 165246 146348 181516 102313 51076 87753 158473
7615 158473 176531 157630 167453 114650 67500 55167 66351 63334 56946 65333 65500 59569 69077
7602 69077 72498 73330 90213 94923 120385 82327 105502 147937 143532 127002 109067 116888 114701
7589 114701 123870 154561 179894 133960 105959 93084 54577 57885 115212 121739 76586 104847
7577 104847 111300 117843 101594 87024 123873 190856 190475 172095 160906 169927 182074 166195 146895
7564 146895 62941 37144 106090 237319 281902 257702 231620 226000 182732 142662 121517 117809
7552A17809j4015P851R182k5242j9291m893m9062N3148N4711k9216l5573N4541
7540A19950j9758j8872L5055J6727k2922M213l0793K4786K2435J5286r452k5554
7528A11101j5959J7077J9378k1816J1973J16841O0693J7661k8649l0018L5545
7517B93827n2178p8602p2343k8135J8345K8905K3652K4089Q578j3649J6141L3661
7505B02291j8346m3010n0451J5821J6887p300Q040L7051K0300o8999N593j4442
7493A03435N808M8560K660j4646o2452j1969O0290j7710p6602L611P1744k2939
7481H9790p3450P0125O1502j8005k4802K0182J3454k0216M1037K632j4361o9910
7469G7978k3824r851J6027J7033J3398Q92J6800m8368p1190M8566N3441K6368
$$ plain form
7552 117809 103794 111645 120827 95585 76294 71401 22339 75487 130198 100982 65409 119950
7540 119950 100192 81320 116375 133102 110180 114393 83600 108386 130821 146107 136655 111101
7528 111101 95142 112219 131597 109781 121754 238595 299288 316949 288300 258282 293827
7517 293827 241649 163047 90704 62569 80914 109819 133471 157560 166138 152489 168630 202291
7505 202291 183945 140935 90484 106305 123192 115892 123932 160983 181283 112284 117877 103435
7493 103435 109243 157803 160463 145817 83365 71396 131686 113976 37374 40985 112729 89790
7481 89790 16340 86465 147967 129962 105160 125342 138796 118580 159617 162249 147888 77978
7469 77978 54154 44303 60330 77363 90761 91653 108453 60085 -11105 37461 90902 117270
7457A17270L7797m2668Q773L0518k3218p192p284n5568p234K3035P021K4364L9672
7444A45286j0447j2865N6372O457j987L7326p0426n3801j5025L0130N751m0239
7432G6532m6989K6686J3008k8652M1401o240n0373l84R0669M0535P933q4807p0736
7419H583k8133R1926n377n2987j1197M1093M2614L1622J7462l3455p7835P959
7407C2275L8577o037j5938j1910l9529L0396K8324K0806l0277m2722P578O2782
7395G4325j0052m4461n3811M0041J2325J4814M5137L1391m0189q682k4653q787
7383B7398J1768m521K3165n250K4939j3153J7519k3085n4n5233J6105N6145K640
7370G8383k97J167l2708j0584j240O9216L2805o6m673J3837M770k5997m2168J7387
$$ plain form
7457 117270 155067 112399 121172 151690 128472 121280 113996 58428 51194 74229 81250 105614 145286
7444 145286 134839 121974 178346 184803 182816 220142 149716 95915 80890 111020 116771 76532
7432 76532 29543 56229 69237 40585 81986 75746 25373 24989 115658 156193 164126 79319 8583
7419 8583 -19550 72376 66999 14012 2815 43908 86522 118144 135606 102151 24316 32275
7407 32275 70852 64815 48877 36967 -2562 27834 56158 76964 46687 3965 11543 74325
7395 74325 64273 19812 -33999 6042 18367 33181 78318 109709 69520 60838 36185 27398
7383 27398 39166 34645 57810 52560 77499 64346 81865 58780 58726 3493 19598 75743 78383
7370 78383 78086 79253 46545 35961 34721 103937 136742 136676 132003 145840 150610 124613 82445 99832
7356I9832N2030J139n2110p8023j7365K4335k814o4368n16J9865N2768M1613o6916
7343I470P319N751L1490L9278L2718k802o5348n6162o800N2699K4320K209J4764
7330H8906K4806k2553j0945J6577J2247l0343k0865j189l1953r662j2086L0531
7318C3471P940k1241M4812L5366j0027m1849l7719k9815M9513Q47J9338P711k9509
7305B8838K3250K7212l2163J6738j1847j0477j5669n791K0540J0270r260K7873
7293F9514L737k1162r74l0270p668J2308j5753L1236K9907K823m4450l0097J9899
7280A9050L6884O543l7117n335j56j2341k9546J5775k4153N5140n2702l2731R205
7267e1484O1673N3562J7016L0666k566k3111M2736L8219l8062o5439q3065L1429
$$ plain form
7356 99832 151862 153001 100891 22868 5503 29838 27024 -37344 -37860 -17995 34773 76386 9470
7343 9470 16789 22540 54030 93308 126026 123224 57876 1714 -5086 47613 71933 74142 88906
7330 88906 113712 91159 80214 96791 109038 78695 57830 56641 24688 15026 2940 33471
7318 33471 41411 20170 64982 100348 90321 48472 10753 -19062 30451 31298 50636 58347 28838
7305 28838 52088 79300 47137 63875 52028 41551 25882 20091 40631 50901 41641 69514
7293 69514 73251 52089 51115 20845 13177 25485 9732 40968 70875 73698 29248 -849 19050
7280 19050 55934 62477 25360 20025 19869 7528 -22018 -6243 -30396 24744 -27958 -60689 -51484
7267 -51484 10189 63751 80767 111433 108867 85756 128492 166711 128649 63210 -19855 11574
7255A1574M5134j5604K0845J5379J9375P187l126l0017j8551M9256N0652k1886
7243A30218j05064l5Q471k0656m3339J3705M4367N0205m6317q5561M762Q4243
7231C4999L2132J8662n7168m5928K8718j8271k53j0082j9762M2340L9944j7349
7219B7982J7651J8221K1445K3697l7964Q361N6162M3762R358j749J517k7073m7057
7206A14313n9471n2083j2305l3716J5642J6227O4525J9883l320L5247m8365Q937
7194F5514k0756p4898m8083M4323P4429M5496l2653n0301j2112M8177P7174K2467
7182A38777m6868K3435M8265j4567j2228j04051m9814M9935K8292n25K218M9351
7170A12220M6733k0800n1732k4873L4476l5336l5821K8392j4927l4513j0892K5648
$$ plain form
7255 11574 56708 41104 61949 77328 96703 103890 100764 70747 52196 101452 152104 130218
7243 130218 25154 25119 33590 12934 -30405 -16700 27667 77872 31555 -54006 -49244 34999
7231 34999 67131 85793 28625 -17303 11415 -6856 -7109 -17191 -36953 5387 45331 27982
7219 27982 45633 63854 85299 108996 71032 79393 135555 179317 188675 186926 188443 161370 114313
7206 114313 54842 2759 -9546 -43262 -27620 -11393 53132 73015 69695 104942 56577 65514
7194 65514 44758 -30140 -78223 -33900 40529 86025 53372 3071 -9041 39136 116310 138777
7182 138777 91909 115344 163609 149042 136814 32763 -17051 32884 61176 60651 62869 112220
7170 112220 158953 138153 86421 61548 96024 60688 24867 53259 38332 3819 -7073 18575
7158A8575Q4900l554l1313K4044r837K3322K0798l6370j683J669J799l7793m8742
7145E815P2576L6047p0750r1146J8567N0500L7068R755K4320k3807J4858l4918
7133D8885J1292p053j2094K6326J1617l48l2016L2484M4624p3563o1487J5862
7121D529L6339K2381M1452l2766j189n4328R105N3567J371O200J35l2817R805
7108F3784K489n0851L4689L965K1305J3319l1284K0842n116K8120L6554m8366
7096H9450K881m1643n4182k3000O740P0091J6716M0066J2392M587n7618L8195
7084A04675K6228k4662l0623K6171m3944l6407r725M5079Q20n2962m808L0476
7072C0318J8338N8443M1855j537L6849J7339j7929n6929r8474n4745o335m625
$$ plain form
7158 18575 103475 99921 68608 92652 82815 106137 126935 90565 88882 90551 92350 54557 5815
7145 5815 78391 114438 43688 -47458 -28891 21609 58677 68432 92752 68945 83803 48885
7133 48885 60177 53124 41030 67356 78973 78625 46609 79093 123717 50154 -11333 4529
7121 4529 40868 63249 104701 71935 70746 16418 25523 79090 80461 86661 86796 53979 63784
7108 63784 66273 15422 50111 54076 75381 88700 57416 78258 73142 101262 137816 89450
7096 89450 92331 50688 -3494 -26494 -19754 50337 67053 107119 119511 124098 66480 104675
7084 104675 130903 106241 75618 101789 57845 21438 11713 56792 57612 4650 -158 30318
7072 30318 48656 107099 148954 147417 184266 201605 183676 126747 28273 -26472 -32807 -37432
7060c7432j5184N4020J1983J0184N9581L3771J7232J4874m0760o9279l9113L7886
7048C7763J9410O4321K3217m8831l3474N0359R081K3634k6662o9455q2434p530
7036d0601J09337Q2648o5249j6013K2974K3940K6437L8067j0377n3251o8800L9944
7024H9056j184q5346K5795Q4315J225o8884p967K6932j8521j7950J8452J09489
7012A55412m265o7572m6645N6265L5033n6589j791K0326m487n2529J2949q060
7000C8047Q410N116l5611l5751L2438M1283j623j7090k0665K0098J6692k7277
6988B4067K2660J4369L244N1015O62o3147q009J2661L3965R6280j2175j8879p4478
6975H2235n7385j1968k0136K9646O2042N0751l6837k0091l3834L2594K4545k0937
$$ plain form
7060 -37432 -52616 1404 13387 23571 83152 116923 134155 149029 108269 38990 -123 37763
7048 37763 57173 121494 144711 95880 62406 112765 121846 145480 118818 49363 -33071 -40601
7036 -40601 68736 151384 86135 70122 93096 117036 143473 181540 171163 117912 49112 89056
7024 89056 87872 2526 28321 112636 113861 44977 37010 63942 45421 27471 45923 155412
7012 155412 151147 83575 36930 93195 128228 71639 69848 90174 85687 33158 46107 38047
7000 38047 46457 51573 15962 -19789 12649 53932 52309 35219 14554 34652 51344 24067
6988 24067 46727 61096 64340 115355 116017 52870 44861 57522 91487 187767 175592 156713 82235
6975 82235 24850 12882 -7254 22392 84434 135185 98348 78257 44423 77017 101562 80625
6963H0625n3963J6593k1776k4645L1401L5700J4925l2095k5215J0753K4533j2662
6951D4174K3919L0571j5362j211l9532q1232j243N8047M3101J2032K2306K6937
6939A22507m9317k4615l2518K0352L3719O008n0793m4049j7418J371J4179L245
6927a7329m892m7677L5572M7302N460J9938l243j1241N458J396L5784K0578k1153
6914F5953L7108j8772q8389o300j9416l7790k2542m85M728L0158K3103M6217L3079
6901D6652m398J289j5j3664K5637P197K0559L4076l380l8789o4947n5429n546
6888e0758O6006j3772p363j5902K1696K1873o4925m0862Q9456m0K860j6046M0595
6875C2818k8254l9782L8666P3245O6232l009n7331J5182j4583r064k4940n7893
$$ plain form
6963 80625 26662 43255 21479 -3166 28235 63935 78860 46765 21550 32303 56836 44174
6951 44174 68093 98664 83302 82091 42559 -38673 -39916 18131 61232 73264 95570 122507
6939 122507 73190 48575 16057 36409 70128 76136 25343 -18706 -36124 -34753 -20574 -17329
6927 -17329 -22221 -69898 -34326 12976 18436 38374 35131 23890 29348 30744 66528 87106 65953
6914 65953 103061 84289 -4100 -10400 -29816 -67606 -90148 -90633 -85905 -55747 -32644 13573 46652
6901 46652 42254 43543 43528 29864 55501 62698 83257 117333 113953 75164 10217 -45212 -50758
6888 -50758 15248 1476 -5887 -21789 -93 21780 -43145 -84007 5449 5409 8269 -7777 32818
6875 32818 4564 -35218 3448 76693 142925 139916 82585 97767 83184 74120 49180 -8713
6863h713J5024l7675j2715Q882K0380N9007L8003J7838j996Q263n2852J2096J235
6850F6777n144M8963n080p0775j0891J1534K8003N260k5376K2387M0190n479R693
6837A10062O678m0335l5213n2619J1147k5256M9208k1571R196P6114J4659k5653
6825G6417K7355O492k5833m7031K2350l3450K194l0380n5854M2172P714J3345
6813E491J5222M4259l9988l4445P604k0376J3214Q575K1920n977J007m3459K85
6800b6668J0069K6431k9277N3790M9776q419o6442j0195K9479L805m9298K82O2506
6787D5839K0379J8999o5367J5667K9554k0966j467K2795o701q292j2034n6336
6775a7930K8369M8448k624r716k3132j1157N921r43j8030k5693l1553J8371K9901
$$ plain form
6863 -8713 6311 -31364 -44079 -35197 -14817 44190 82193 100031 98035 106298 53446 65542 66777
6850 66777 61633 110596 105516 34741 23850 35384 63387 68647 43271 65658 105848 100369 110062
6837 110062 116740 76405 41192 -11427 -280 -25536 23672 2101 11297 87411 102070 76417
6825 76417 103772 110264 84431 37400 59750 26300 28494 -1886 -57740 -15568 -7854 5491
6813 5491 20713 64972 24984 -9461 -1857 -22233 -9019 -444 21476 15499 16506 -26953 -26668
6800 -26668 -16599 9832 -19445 34345 84121 75702 9260 -935 28544 32349 -16949 -16667 45839
6787 45839 66218 85217 19850 35517 65071 44105 42638 65433 58732 50440 38406 -17930
6775 -17930 10439 58887 56263 46547 23415 12258 18179 17236 -794 -26487 -58040 -39669 -9768
6762i768J9624K7377K0665k9371O208J7303J0397n417M2982n1826k2051R23j0009
6749A7037q396j7979J0646J3403j2400M0737j8881n8061L523j5049j2118J8692
6737c8846k3313k4322p671L2978O9825K9769M6085O414k3110j6152J489j9773
6725C3373J0128r164k8234J711j7351m0675K4747R2462k6208n2457l7617k1229
6713g0514J4897K5197M1526p837l9156M5510M8656m1723J1342J381N042O712J3600
6700E4633j809j3094j1507K4640L8763l5515n1933j8526K9473j5299p0139l073
6688g3386J3459J8465Q4967N4186l5018k7513P7916n2046n1763r755J4793j672
6676A2633M3785l3448j0322K3989l1762N2217j6714o2931l99M4670J5104j0771
$$ plain form
6762 -9768 9856 37233 57898 28527 34735 52038 62435 57018 100000 48174 26123 27046 17037
6749 17037 8641 -9338 1308 14711 2311 43048 24167 -33894 -30371 -45420 -57538 -38846
6737 -38846 -62159 -86481 -94152 -61174 8651 38420 84505 90919 67809 51657 53146 33373
6725 33373 43501 34337 6103 7814 -9537 -50212 -25465 66997 40789 -11668 -49285 -70514
6713 -70514 -55617 -30420 11106 3269 -35887 9623 58279 16556 27898 29279 34321 41033 54633
6700 54633 52824 39730 28223 52863 91626 56111 4178 -14348 15125 -174 -70313 -73386
6688 -73386 -59927 -41462 43505 97691 62673 35160 113076 61030 9267 -488 14305 12633
6676 12633 56418 22970 12648 36637 4875 57092 40378 -22553 -22952 21718 36822 26051
6664B6051j3797K8912j6953n4667M3269K5236L2865k6215k7413M818N7623N234
6652H4963J705l1784o0203k615r637j5222K8077L6475l1925P5040L9034m9066
6640F4842n3211j7417k9532j4289J4657m0975J9182P4J1368J9520k9827K7601
6628b8007M2978L2350K1918J8654j5211q134j6179L3371p623j8032J0793k6780
6616D0098N0514K8350k2391m9036k7909K7604L1242R527l7697k2620J4716j2048
6604C0350Q466J3818k1799l9211L2813l1405k5740N0669k4633p750K4989J0855
6592B1422n6709K5569M8674l1434j7160N384p6207N248N4570J5119l6931j2364
6580e4819K9003J5649o213N043N5508K1585n4136M238J2197K9059N2445K0629
$$ plain form
6664 26051 12254 41166 24213 -30454 12815 38051 70916 44701 17288 22106 79729 84963
6652 84963 86668 54884 -5319 -7934 -17571 -32793 -4716 31759 -166 74874 113908 64842
6640 64842 11631 -5786 -35318 -49607 -34950 -75925 -56743 -56669 -45301 -25781 -55608 -28007
6628 -28007 14971 47321 69239 87893 72682 64548 48369 81740 74117 56085 66878 40098
6616 40098 90612 118962 96571 47535 19626 47230 78472 87999 50302 27682 42398 30350
6604 30350 38816 52634 30835 -8376 24437 -6968 -32708 17961 -6672 -14422 10567 21422
6592 21422 -35287 -9718 38956 7522 -9638 -4254 -80461 -75213 -20643 -5524 -42455 -54819
6580 -54819 -25816 -10167 -16380 -11337 44171 65756 11620 15858 28055 57114 109559 130188
6568A30188o6422O811k4387k0422M7806q761n5850j9539j0352K6500R364K0739
6556C5675J9327P142r638n3135j0681K5068j6519M963N1185K4715l0764j0067
6544C7271k6480J1687k7275O236l1211O400L1155M9497l6322o6410M5274N5347
6532E5169m9476q7896J3704l472J7372L0734K45K1730M0965K4245O5681Q186m2354
6519I4833n8062m0998J0914O9113l5860p4340Q736K2228j9668r064M7908K8791
6507D4531K2602j0509j4017j3802k80k8418n18L2601L8175J3348L448L1399m6027
6494G2533p3934o110j1318n6638q640M2408J9231O989M6930L3431L1794L4080
6482A30756l5806j7818L6175l6422l9931j1448K5959L0097m5688Q033J293n6600
$$ plain form
6568 130188 63766 70577 46190 25768 73574 64813 8963 -10576 -20928 5572 14936 35675
6556 35675 55002 62144 52506 -629 -11310 13758 -2761 2202 53387 78102 47338 37271
6544 37271 10791 22478 -4797 1439 -29772 -23372 7783 57280 20958 -45452 -178 55169
6532 55169 5693 -82203 -68499 -71971 -54599 -23865 -23620 -1890 39075 63320 129001 137187 94833
6519 94833 36771 -4227 6687 75800 39940 -34400 -25664 -3436 -23104 -32168 15740 44531
6507 44531 67133 56624 42607 28805 28525 107 -411 32190 70365 83713 87161 118560 72533
6494 72533 -1401 -7511 -18829 -75467 -84107 -41699 -22468 -15479 31451 64882 96676 130756
6482 130756 94950 77132 113307 76885 36954 25506 51465 81562 35874 43907 45200 -11400
6470a1400m4124n327M3670M0478j6930Q01l0224l3020J615M699L7767L6495L7789
6457F2289L033l1733k6655J3585L0992N4090M5571k1010m7264k6196k6688k5948
6445D066k0759J7927K0124O7097K9277k02n6920j8126r1870p1478K3150M5304
6433e2410k7518l309o601K9657l786J26395N3929p9122m1308q571L1057l9351
6421b0938n842r496m0193n013K7808L5169J870k5501k6871L7810J9550J4758M3353
6408D6464j3283K8642M1911k2520l3462k4832m8714n1102j2811N4229o843j1775
6396e4096J4812k4691n0139r699L2815R8773J9284j769o8919k8892K9749K7895
6384a4877m1213j0603J4175j1439L0264O1009L4217L9113j9401l2827l7521M7787
$$ plain form
6470 -11400 -55524 -60851 -17181 23297 6367 7168 -23056 -56076 -54461 -49762 -11995 24500 62289
6457 62289 65322 33589 6934 20519 51511 105601 151172 130162 82898 56702 30014 4066
6445 4066 -16693 1234 21358 88455 117732 117530 60610 42484 -49386 -120864 -97714 -52410
6433 -52410 -79928 -83237 -89838 -60181 -63967 62428 116357 37235 -4073 -12644 18413 -20938
6421 -20938 -26780 -36276 -76469 -81482 -53674 -18505 -16635 -42136 -69007 -31197 -11647 3111 46464
6408 46464 33181 61823 103734 81214 47752 22920 -25794 -76896 -89707 -35478 -42321 -54096
6396 -54096 -39284 -63975 -114114 -123813 -90998 7775 27059 25290 -43629 -72521 -42772 -14877
6384 -14877 -56090 -66693 -52518 -63957 -33693 27316 61533 100646 81245 48418 10897 58684
6372E8684O844O2121j4130J9774j4660l828J2283l8871o5872O937L0328P76j6426
6359D3960L3073l4124p0477k3095l2364j8244Q4173N0485R707J8259M7161N160
6347A13674k7912l4037m7465n2591l1129R1861M0062p8969k2761n78K5343K7682
6335C180J1895N663r317k8873k5131J7614K7272L7790J0601K7914o049q0755J3717
6322E521K1647k8392k4786k9865J6798O471m5162K8836L0738p6646q945N1940
6310e1845L3864n838j6045K4889K4893J8898k6857o8250j3904Q2235J7230j4603
6298D667o5447l1144M3512M8244L4223l797m4725l9758k4539j028L9923K1900
6286a7969j2904j9066L2594L2370O2600k4321k0754J0951N0151o0372m1944L722
$$ plain form
6372 58684 65528 127649 113519 133293 118633 114805 127088 88217 22345 29282 59610 60386 43960
6359 43960 77033 42909 -27568 -50663 -83027 -101271 -17098 33387 43094 61353 108514 113674
6347 113674 85762 51725 4260 -48331 -79460 12401 52463 -26506 -49267 -49845 -24502 3180
6335 3180 15075 20738 11421 -17452 -42583 -24969 2303 40093 50694 78608 72559 -8196 5521
6322 5521 27168 -1224 -26010 -55875 -39077 -32606 -77768 -48932 -18194 -94840 -103785 -51845
6310 -51845 -17981 -23819 -39864 -14975 9918 28816 1959 -66291 -80195 2040 19270 4667
6298 4667 -60780 -91924 -48412 -168 34055 30258 -14467 -54225 -78764 -79792 -39869 -17969
6286 -17969 -30873 -49939 -17345 15025 77625 53304 32550 43501 93652 33280 -8664 -4942
6274d942N1014J3406j0546k6573K2682J4033k5857M5880j9691o6519J6961K9009
6262C8857K7293j4834J9401k3598o6786N1089M2179l0981l2859k0415K2244K6172
6250C7762n541k2135L4509J9672o1090R193J4870j3520k0247m2622J7878J2354
6238a8917J2437j4196J7335J9612J6141K5735M9427l2398j6911n673k7960m6925
6226b2293k7015L097L4122M8505M9726Q862K6954k4211k6607p536k2821k7607
6214A3176j8058j9232J6061K5603P52j924M6479q136J7677k4551p732J1838K0408
6201G2361k8076o9573j1268j7493J1003N073R348Q958J4760j7416p756L8585R233
6188A7739k1173m3136m4979L1383J46761K5590m7327k8731K3192O1760k7254K081
$$ plain form
6274 -4942 46072 59478 48932 22359 45041 59074 33217 79097 59406 -7113 9848 38857
6262 38857 66150 51316 70717 47119 -19667 31422 73601 42620 9761 -10654 11590 37762
6250 37762 32221 10086 44595 64267 3177 12370 27240 13720 -6527 -49149 -31271 -18917
6238 -18917 -6480 -20676 -3341 16271 32412 58147 107574 75176 58265 52592 24632 -22293
6226 -22293 -49308 -46211 -12089 36416 86142 95004 121958 97747 71140 63604 40783 13176
6214 13176 -4882 -24114 -8053 17550 18302 16378 62857 54721 72398 47847 40115 51953 72361
6201 72361 44285 -25288 -36556 -54049 -43046 -37973 -28625 -19667 -4907 -22323 -30079 8506 17739
6188 17739 -3434 -46570 -91549 -60166 86595 112185 64858 36127 59319 121079 93825 95906
6176I5906L6315j0705q3362n345J3954l4183l7388l1573j7956K7755J7259P3026
6164D3703Q3868k4957l3364r998j5935r561k0352Q615l2431j0484j1296p025k1835
6151f1052l9654L15J8881k1517N9771M3081J3557k5601R056K7899P0064j9960
6139G4840k6550l3910k1806J0153K0540N8945l368p336k4038l5980k1595l090
6127a3195J4753M8665m6239J3292L0072k7697j4928q713M1722n8339M623N420
6115a0564J3771l6772P263j004K804q228n147R745N5667P770p1012o08m26j7o2222
6100i8980M849J5792K8966M3436J970J8500M7526p782o1874p5159l6149O7962
6088e0943O0137m2890k6670L6831K334L5959P3701l90N002l0045p3210l9970L3137
$$ plain form
6176 95906 132221 121516 38154 32809 46763 12580 -24808 -56381 -74337 -46582 -29323 43703
6164 43703 127571 102614 69250 59252 43317 33756 13404 22019 -10412 -20896 -32192 -39217 -61052
6151 -61052 -100706 -100391 -81510 -103027 -43256 -175 13382 -12219 -3163 24736 94800 74840
6139 74840 48290 14380 -7426 2727 23267 82212 78844 71508 47470 11490 -10105 -13195
6127 -13195 1558 50223 3984 17276 47348 19651 4723 -3990 37732 -20607 -15984 -10564
6115 -10564 3207 -33565 -26302 -27306 -24502 -32730 -37877 -28132 27535 35305 -35707 -36315 -36741 -36758 -98980
6100 -98980 -94131 -78339 -49373 -5937 -3967 14533 62059 54277 -7597 -82756 -118905 -50943
6088 -50943 9194 -33696 -60366 -23535 -21201 14758 88459 88069 93071 63026 -10184 -50154 -17017
6075a7017k2845k7159N611L8197J9004K1822Q417L1022L3520J0824p3328N308
6063C3376n193l2157l8467l4486J4546O3461K1216k5338K6385k8067k7349J9189
6051a2884J9901j2811l413m3366n8367J7839P9406M6610m0639m384k3626k6710
6039f2444K7771J6630J04k0272k4887k7774J7036O3326N2497N922L1453p24K0843
6026I9481N2565k6183k5619J658J5618l5873j05943r7293l5717L0802M4103M666
6014g7735K9205P1175M3680J376K6375j9492m9492o5487l4427J5195K8667M3102
6002A2142N4737j2168k7974n0043r703J04585J579L3159K0793o56n3428J0676
5990H3699L5967k9051p1580j6653l905k21K1100j3748L944K4715k0570R395J6649
$$ plain form
6075 -17017 -39862 -67021 -61410 -23213 -4209 17613 26030 57052 90572 101396 28068 33376
6063 33376 28183 -3974 -42441 -76927 -62381 1080 22296 -3042 23343 -4724 -32073 -12884
6051 -12884 7017 -5794 -9207 -52573 -110940 -93101 -13695 32915 -7724 -12108 -35734 -62444
6039 -62444 -34673 -18043 -17939 -38211 -63098 -90872 -73836 -10510 41987 47909 79362 78638 99481
6026 99481 152046 125863 100244 101902 117520 81647 -24296 -121589 -157306 -126504 -82401 -77735
6014 -77735 -48530 22645 66325 67701 94076 74584 25092 -40395 -74822 -59627 -30960 12142
6002 12142 66879 54711 26737 -23306 -33009 71576 73155 106314 127107 126451 73023 83699
5990 83699 119666 90615 19035 2382 -1523 -1744 19356 5608 9552 34267 13697 23092 39741
5977C9741j8193QK7859l7552k3524M29k7837j1454J4850N5352Q169l4477N3989
5964D7360J1011K1202N0386L3659n9303o8609k916p9189N04m249p3717J902k8717
5951a50676M348J2787O4394O5756j276l253M5101L8093n885k907j4047r515j0014
5938C2906K4489J145J1603j4469N2823k4675J999j1110l3506J7380m194l6718
5926A7673o0866J5891J1631j246P1011K7728o153M7373L0646o4523n3264l863
5914C2038p788J2120L0236o8317k146J7804K5172m8136m1708j633M0343O6652
5902E4637L4373m62j1013p2250o8886k3365J9631k8808M5080L1574K3102L3880
5890C7493m555o1710J2280K4801L4904n912o4491j3045Q129K0188O1096j8540
$$ plain form
5977 39741 21548 21556 49415 11863 -11661 -11232 -39069 -50523 -35673 19679 27848 -6629 47360
5964 47360 58371 79573 129959 163618 104315 35706 32790 -46399 -45895 -50144 -123861 -121959 -150676
5951 -150676 -146328 -133541 -69147 -3391 -4667 -7920 37181 75274 69389 66482 52435 42920 32906
5938 32906 57395 58540 70143 55674 108497 83822 85821 74711 41205 58585 54391 17673
5926 17673 -43193 -27302 -15671 -16917 54094 81822 75669 123042 153688 89165 35901 32038
5914 32038 24250 36370 66606 -1711 -3857 13947 39119 -9017 -50725 -52358 -12015 54637
5902 54637 89010 88548 77535 5285 -63601 -86966 -67335 -96143 -51063 -19489 3613 37493
5890 37493 32938 -28772 -16492 8309 43213 37301 -27190 -40235 -32106 -11918 49178 30638
5878C0638k4512K6458J8593J0280M3852p5184q0441K8567N8213J5959n3320k1172
5866b2069k64N8470o50q8735j5310N3652N054m122R965j3623k054k0828K33K2122
5852a8159j1691m0096J1507J31J884l7915J1907L4067k2694J7943L0018m231k8575
5839e5904N4915K2379J8855j9053l1120M725p1874P502L5425M7199K5985m6445
5827g411n6110p89M4899K572k21j5652K5491l6064l6904N0668j9969n0879L1824
5814f8545M6990O869J9980J6040k5761o1226J9076M1910l1087l7948k161K2767
5802e3096J6797J4194J9183Q217m3492p351l598L0764j3586L0011R720j7646j165
5789a1048K4185J4499j1528L7562p0793p9835K7076L5708k14L0569M689M8065
$$ plain form
5878 30638 6126 32584 51177 61457 105309 30125 -50316 -21749 36464 52423 -897 -22069
5866 -22069 -22333 36137 35487 -53248 -68558 -14906 -9852 -13974 -4009 -17632 -19686 -40514 -40281 -18159
5852 -18159 -29850 -69946 -58439 -58308 -56424 -94339 -82432 -48365 -71059 -53116 -23098 -27329 -55904
5839 -55904 -989 21390 40245 21192 -9928 -5203 -77077 -69575 -34150 13049 39034 -7411
5827 -7411 -63521 -64310 -19411 -16839 -17060 -32712 -7221 -43285 -80189 -29521 -49490 -100369 -68545
5814 -68545 -21555 -14686 5294 21334 -4427 -65653 -46577 -4667 -35754 -73702 -75863 -53096
5802 -53096 -36299 -22105 -2922 5295 -38197 -45548 -49146 -18382 -31968 -1957 7763 -9883 -11048
5789 -11048 13137 27636 16108 53670 -17123 -96958 -69882 -34174 -34388 -3819 870 48935
5777D8935k169L0156l6245M553L2660j4456n1818J2422M327j6055L5008j9146
5765B8172l96L5608m644j3657j9035k6450j1918k0928J8646K213K7516N734J3593
5752C4454j1052L8161L8301J5198k5266o0526O7602M388k0062j8146m774J621
5740E9899o2482j5387J5645L3118j5332N636j1396M793Q360l0626j4O3288L4554
5727I0056k4618m7792j2959j9247j4683j1851M1078O9372N009q5537q7004J6217
5715h1959N5144L816l0916N440M0916K1766q400j4803k9040n4393k8706l8762
5703a59897l124M3653M9094N634k360O7694k5891L0772l3283O664J9602p138K4070
5690A5490R642k2109j6726k7408N8339k5305m5596q777O5323K588J7016K5848
$$ plain form
5777 48935 46766 76922 40677 45230 77890 63434 11616 24038 28365 12310 47318 28172
5765 28172 27776 63384 58740 45083 26048 -402 -12320 -33248 -14602 -12389 15127 20861 34454
5752 34454 23402 61563 99864 115062 89796 29270 96872 101260 81198 63052 58278 59899
5740 59899 -2583 -17970 -2325 30793 15461 21097 9701 14494 22854 -7772 -7786 55502 90056
5727 90056 65438 17646 4687 -14560 -29243 -41094 -16 69356 74365 -11172 -98176 -81959
5715 -81959 -26815 -22999 -53915 -48475 -7559 14207 5807 -8996 -38036 -92429 -121135 -159897
5703 -159897 -163021 -119368 -70274 -64640 -67000 694 -25197 5575 -27708 -21044 -1442 -8580 15490
5690 15490 25132 3023 -13703 -41111 17228 -8077 -53673 -62450 2873 5461 22477 48325
5678D8325K042k501l6750j06180l4422N3668O4985k4461n333j0788j4277N9149
5666f543K3578L6724L1634j8399p3655M030K9089N5947l1340l3201j9774K1843
5654A9933L1997q888K206n222k8695M5797M5905J0620j2957l0650J4108l5627
5642D8527n5942O165J0598o1021P451M7853L754k831k5550l112K4539N0512L1829
5629H2772P395r358m1379k0019J0676k6975l3973m0768k5195l3507J796M7783
5617h0752P111L0521n3614m9661Q5543P7276L7213j1772j6063l0681p4813n786
5605h5478M888J6673L8893Q3478L315j8171o2574k4253L2917J7662R525n0963
5593c4088N402K9549j1482k6573M1698J0042m7665m0241j6482L0861K4954M5045
$$ plain form
5678 48325 50367 47866 11116 -95064 -129486 -75818 -10833 -35294 -40627 -51415 -65692 -6543
5666 -6543 17035 53759 85393 66994 -6661 -2631 26458 82405 51065 17864 -1910 19933
5654 19933 51930 43042 45248 40026 11331 57128 103033 113653 100696 70046 84154 48527
5642 48527 -7415 -1250 9348 -51673 -44222 3631 7385 4554 -20996 -24108 431 50943 82772
5629 82772 90167 80809 39430 19411 30087 3112 -30861 -71629 -96824 -130331 -128535 -80752
5617 -80752 -73641 -43120 -96734 -146395 -60852 16424 53637 41865 25802 -4879 -79692 -85478
5605 -85478 -80590 -63917 -25024 58454 61769 43598 -18976 -43229 -10312 7350 16875 -34088
5593 -34088 -28686 863 -10619 -37192 4506 14548 -33117 -73358 -89840 -58979 -34025 11020
5581A1020j6924j980k1467n6486L5750K1824m0940j0681J4330P6167k2720m6984
5569e9091K8454M4981M5847k7089r6021o7484O7313L3103M6443L0381L464k7549
5557B2752m8572K115J8862N5434L2227r119l7321l0775o3228m1007k4832L8330
5545h5134O5215N5970L316j1771l2478j2212k9339r0083j1105N5302j1484O040
5533i7763J3127L1434Q4096K704l8204K1339J0949N104r117l5435n4947l5962
5521a02675l2367L0237J8453M6675o462r76k8303j3472n974j6860N0366q060n631
5508g5049L1780J5830k9181M243L5454K4745K4692k3860k5551k0754K9733N1383
5496D3465J8300O017J5315P567P014k7117r3500m0392N5858L2156j9784j574m282
$$ plain form
5581 11020 -5904 -7884 -29351 -85837 -50087 -28263 -69203 -79884 -65554 10613 -12107 -59091
5569 -59091 -30637 14344 60191 33102 -62919 -130403 -63090 -29987 16456 46837 50301 22752
5557 22752 -25820 -23705 -4843 50591 82818 73699 36378 5603 -57625 -98632 -123464 -85134
5545 -85134 -19919 36051 39367 27596 -4882 -17094 -46433 -136516 -147621 -92319 -103803 -97763
5533 -97763 -84636 -53202 30894 33598 -4606 16733 27682 32786 23669 -11766 -66713 -102675
5521 -102675 -135042 -104805 -86352 -39677 -46139 -47115 -75418 -88890 -94864 -111724 -61358 -69418 -75049
5508 -75049 -43269 -27439 -56620 -52377 -16923 7822 32514 8654 -16897 -37651 -7918 43465
5496 43465 61765 67782 83097 90664 97678 70561 -22939 -63331 -7473 24683 4899 3325 -957
5483i57O017L1728M7659l6651p889k3611K9995N3682p317J1831k6063j1413L7332
5470A04343O53k4982M691Q3439k5815n0185l0783m0739k3869Q5836L3982m636
5458A11935p1549m6163M0633N1248N376K736L5277n923o6725l7876j9398L2850
5446C2421J6880k286L786j9652N2859K7105k9219j0119K0078R942J1756j5618
5434I7933n4820j2598j8308n1158J9655j171n6679j7791J6702N5819K4370n7959
5422e6005N479M3797l3792j505k5776k458M6564J2321k0530K0446N3547J7157
5410E9245M417o399o0121k7826n646p707M0670j2452K9445K9274q0615l8227R844
5397f6098J9084k6409m611j380N8848L3840k1702j2039R114m494l5109M6872L8282
$$ plain form
5483 -957 5060 36788 84447 47796 39907 16296 46291 99973 92656 104487 78424 67011 104343
5470 104343 104996 80014 84705 168144 142329 92144 61361 20622 -3247 82589 116571 111935
5458 111935 40386 -5777 34856 86104 91480 94216 129493 123570 56845 18969 -429 32421
5446 32421 49301 47015 50801 31149 84008 111113 81894 71775 91853 101795 113551 97933
5434 97933 43113 30515 12207 -38951 -19296 -20467 -77146 -94937 -78235 -22416 1954 -56005
5422 -56005 -50526 -6729 -40521 -42026 -67802 -70260 -23696 -11375 -31905 -11459 42088 59245
5410 59245 63662 57263 -2858 -30684 -36330 -44037 -3367 -15819 13626 42900 -37715 -75942 -66098
5397 -66098 -47014 -73423 -78034 -79414 -20566 13274 -8428 -20467 -11353 -15847 -50956 -4084 34198
5384C4198k245m8722k9790N2700L2627N5723n275K881m6479m8465M2192n5126
5372a5781k3461M0663o360j5494Q91M1133k3926k2268O2059L5722l8741n1184
5360a6747P421j1710J5183J7923m9627p7L455M8735L7529j640k7595l8295Q160
5347g285j173J4799m267l524l1998k230m2503R208K4624K5077K1448L4637N540
5334D2353l1116p544n172Q715r86R267M788q244n1871J2109r350j3968j5381j1834
5320g8234L5424K2879K7036K1179k5740R084m2402j5540M1654m117n7355o1741
5308a27873k7175M4296M0630m3670J6931L9925J0008l7880K3835R6346P3550j7755
5296I1168j4871j250j6264K5948M6361J7453o2549n5039M036K1837k0953m2559
$$ plain form
5384 34198 31953 -16769 -46559 6141 38768 94491 89216 92097 45618 -2847 39345 -15781
5372 -15781 -39242 1421 -4939 -20433 -19542 21591 -2335 -24603 37456 73178 34437 -16747
5360 -16747 -9326 -21036 -5853 12070 -37557 -37634 -34179 14556 52085 50445 22850 -15445 -7285
5347 -7285 -8458 6341 2074 -1450 -33448 -35678 -78181 -68973 -44349 -19272 2176 36813 42353
5334 42353 11237 3693 -1479 7236 6250 15517 20305 12061 -39810 -27701 -37051 -51019 -66400 -78234
5320 -78234 -42810 -19931 7105 28284 2544 11628 -30774 -46314 -4660 -8777 -66132 -127873
5308 -127873 -155048 -110752 -70122 -113792 -96861 -56936 -46928 -84808 -60973 35373 108923 91168
5296 91168 76297 75047 58783 84731 131092 148545 85996 30957 34993 56830 35877 -6682
5284f682m2677k3314K8916N0819L6365l8772L8239j5263o7982O1193O9178k8858
5272F1162k5507J8475l3729m3794j4994J009j3969m8657n2208K4800N7238N6347
5260a3827R073k6023m2300m572J0545p1524M3863J8379L5050N2296J8529j0146
5248A9343j7427l9689p117J5930J9904M392J1236n5536j9271m4060k2589M8752
5236h6132O0545K1216j2189Q738l3229m7725N2582k2703o0269k2923N5446J6759
5224f9884K9760M5082l1816J3416P0948m4673j9643l2963L6463Q5011L3909q8649
5212B6961p0027O4299M44k2689p306r514l6697L4481O4826Q839n4661n42k62J5569
5198A3721l1893j5132m0827l4780J7244j7612j7962j702K9242L2330M9640L3474
$$ plain form
5284 -6682 -49359 -72673 -43757 7062 43427 4655 42894 27631 -40351 20842 90020 61162
5272 61162 35655 54130 20401 -23393 -38387 -37378 -51347 -100004 -152212 -127412 -70174 -13827
5260 -13827 -4754 -30777 -73077 -77649 -67104 -138628 -94765 -76386 -41336 10960 29489 19343
5248 19343 1916 -37773 -44890 -28960 -9056 -4664 6572 -48964 -68235 -112295 -134884 -86132
5236 -86132 -25587 -4371 -16560 -7822 -41051 -88776 -36194 -58897 -119166 -142089 -86643 -69884
5224 -69884 -40124 4958 -26858 -13442 57506 12833 -6810 -39773 -3310 81701 115610 26961
5212 26961 -43066 21233 21677 -1012 -8318 -17832 -54529 -20048 44778 53617 -1044 -1586 -1848 13721
5198 13721 -18172 -33304 -74131 -108911 -91667 -109279 -127241 -128943 -99701 -67371 -17731 15743
5186A5743o5220l8191L8190n354k5811Q470J9333k1126j1735J8682K8042P511
5174c1466l2552k7156M9461J7197P223P55P62N5308M5494L004p7752o3012N0243
5161b491k9603L676K1432N2639K76l7215k8387q6671J5930K5064O9410M3082k2381
5148B4761j1743j8907l379j8259K193l1467j9924P3573K4178J5537l2892j1946
5136h275N0997N587n6845l5420n9805l0433J7287O8880L4406M0017l61p5670o1483
5123a11118n7662j1991M4816L2101R125J9571Q703j6849O554N683N561J3277l8333
5110i0562n4681O426M9517j626N874M244L4135K8362J1761j194j7331L3316j049
5097G192p118M912m5382l5130M175O2960N0520K2021P023n4620o0602j6984M2478
$$ plain form
5186 15743 -49477 -87668 -49478 -54832 -80643 -72173 -52840 -73966 -85701 -67019 -38977 -31466
5174 -31466 -64018 -91174 -41713 -24516 -17293 -16538 -15776 39532 85026 88030 10278 -52734 -2491
5161 -2491 -32094 -28418 -6986 45653 45929 8714 -19673 -106344 -90414 -65350 4060 47142 24761
5148 24761 13018 -5889 -9268 -27527 -25334 -56801 -76725 -3152 21026 36563 3671 -8275
5136 -8275 42722 48309 -8536 -43956 -103761 -134194 -116907 -48027 -13621 26396 26035 -49635 -111118
5123 -111118 -168780 -180771 -135955 -103854 -94729 -75158 -66455 -83304 -76750 -71067 -65506 -52229 -90562
5110 -90562 -145243 -138817 -89300 -90926 -85052 -80808 -46673 -18311 -6550 -7744 -25075 8241 7192
5097 7192 74 4986 -40396 -75526 -71351 -8391 42129 64150 71173 16553 -44049 -61033 -18555
5084a8555L0242p710l1383r621M4917j1750J5333J7257m3387l8133K630l3314
5072h3474K2408R46j4302L160N3767m7870J8683L5044j1013Q600P143k6279L792
5059b9395N8499L6162m3817l312k3028l0826m8275m3788J2802O2631M2196j0921
5047b1072m745j169k2384p924j9160J392N0391J490o572l8545J3524l3623j5952
5034a04349L3312P8327J0680p4445l3773P6711L8906n8608m0704N2145M0775j208
5022A7769J8404K071k4230N651k6044j0881l1094l1614J4018J7980M2829O265
5010A124m0671m788K4686K0431j0170j2787o249K5684l0386k6675k2520J2856
4998f9465L6676L9953K7932M4181R821j4143k7149n0571q8557m9229M6232O7573
$$ plain form
5084 -18555 11687 3977 -27406 -37027 7890 -3860 11473 28730 -14657 -52790 -50160 -83474
5072 -83474 -61066 -60120 -74422 -71262 -17495 -65365 -46682 -11638 -22651 -14051 -6908 -33187 -29395
5059 -29395 29104 65266 21449 18137 -4891 -35717 -83992 -127780 -114978 -52347 -10151 -21072
5047 -21072 -25817 -26986 -49370 -57294 -76454 -75062 -24671 -23181 -29753 -68298 -54774 -88397 -104349
5034 -104349 -71037 7290 17970 -56475 -90248 -13537 25369 -33239 -73943 -21798 18977 17769
5022 17769 36173 38244 14014 19665 -6379 -17260 -48354 -79968 -65950 -47970 -5141 1124
5010 1124 -39547 -44335 -19649 782 -9388 -22175 -28424 -2740 -33126 -59801 -82321 -69465
4998 -69465 -32789 7164 35096 79277 89098 74955 47806 -2765 -91322 -140551 -94319 -26746
4986b6746N1410o918j3149Q355r459o0758k7471K7386N1375j5804l0770P2717
4974B0168R1316l2881k4697O393O854l0647J2318j5093l4671l6483j7434L2013
4962b2844J7826O822L3553L7359K6372m5619l469o541j2629j9549m8936L5698
4950a957O469o6471k1182j1508j9645O169r767j7034P141k3470L6405O8436L0302
$$ plain form
4986 -26746 24664 17746 4597 12952 3493 -57265 -84736 -57350 -5975 -21779 -52549 20168
4974 20168 111484 78603 53906 60299 67153 36506 48824 33731 -940 -37423 -54857 -22844
4962 -22844 -5018 1804 35357 72716 99088 53469 50000 43459 30830 11281 -37655 -1957
4950 -1957 4512 -61959 -83141 -94649 -114294 -108125 -117892 -134926 -127785 -151255 -114850 -46414 -16112
$$ [...]
##END NTUPLES=NMR SPECTRUM
##END=
