##TITLE=Analysis number 314490
Compound Code mo 07275
Project Code adrs
Chemist Name fudan
##JCAMPDX= 6.0         $$ Bruker NMR JCAMP-DX V2.0
##DATA TYPE= NMR SPECTRUM
##DATA CLASS= NTUPLES
##ORIGIN= Bruker BioSpin GmbH
##OWNER= NMR
$$ XWIN-NMR		Version 3.5
$$ Tue Oct 18 13:11:28 2005 GMT Daylight Time (UT+1h)  MAYBRIDGE\NMR@NMR_250MHZ
##.OBSERVE FREQUENCY= 250.131544655141
##.OBSERVE NUCLEUS= ^1H
##.ACQUISITION MODE= SIMULTANEOUS (DQD)
##.ACQUISITION SCHEME= undefined
##.AVERAGES= 16
##.DIGITISER RES= 18
##SPECTROMETER/DATA SYSTEM= dpx250
##.PULSE SEQUENCE= zg30
##.SOLVENT NAME= DMSO
##.SHIFT REFERENCE= (INTERNAL, DMSO, 0, 16.522)
##AUDIT TRAIL= $$ (NUMBER, WHEN, WHO, WHERE, WHAT)
$$ ##TITLE= Audit trail, XWIN-NMR		Version 3.5
$$ ##JCAMPDX= 5.01
$$ ##ORIGIN= Bruker BioSpin GmbH
$$ ##OWNER= NMR
$$ C:\u/data/dgb/nmr/ADRS/10970/pdata/1/auditp.txt
$$ ##AUDIT TRAIL=  $$ (NUMBER, WHEN, WHO, WHERE, WHAT)
(   1,<2005-10-18 13:11:09.58 +100>,<MAYBRIDGE\NMR>,<NMR_250MHZ>,
      <created by zg, POWCHK disabled, PULCHK disabled
       configuration hash MD5:
       62 19 C7 07 E1 42 D1 B7 37 6C 3D D0 77 39 F9 E6
       data hash MD5: 64K
       C9 4C 20 00 37 3F 03 9D 71 0F 5A EB 05 D2 00 37>)
(   2,<2005-10-18 13:11:21.13 +100>,<MAYBRIDGE\NMR>,<NMR_250MHZ>,
      <Start of raw data processing
       ef LB = 0.3 FT_mod = 6 PKNL = 1 SI = 32K 
       data hash MD5: 32K
       6B DD 60 EA 1C 78 E2 B3 AB 03 3F 5B C2 D3 B7 28>)
(   3,<2005-10-18 13:11:22.77 +100>,<MAYBRIDGE\NMR>,<NMR_250MHZ>,
      <apk 
       data hash MD5: 32K
       4C E5 D8 85 03 F3 F9 99 51 56 81 85 F3 28 B8 DC>)
(   4,<2005-10-18 13:11:23.42 +100>,<MAYBRIDGE\NMR>,<NMR_250MHZ>,
      <abs ABSG = 5 
       data hash MD5: 32K
       62 C7 CE 9A 5B 26 76 9F 5F 4F 82 6D 84 7F B2 B5>)
$$ ##END=
$$ 
$$ hash MD5
$$ BA 1A B3 F2 14 85 AE 7F F0 6F 65 B5 55 9A 79 64
##$RELAX= 
##$RELAX= 
##$RELAX= 
##$RELAX= 
##$RELAX= 
##$RELAX= 
##$RELAX= 
$$ Bruker specific parameters
$$ --------------------------
##$DU= <C:\u>
##$EXPNO= 10970
##$NAME= <ADRS>
##$PROCNO= 1
##$TYPE= <nmr>
##$USER= <dgb>
##$AMP= (0..31)
100 100 100 100 100 100 100 100 100 100 100 100 100 100 100 100 100 100 
100 100 100 100 100 100 100 100 100 100 100 100 100 100 
##$AQSEQ= 0
##$AQ_mod= 3
##$AUNM= <au_zg>
##$AUTOPOS= <27 >
##$BF1= 250.13
##$BF2= 250.13
##$BF3= 250.13
##$BF4= 250.13
##$BF5= 500.13
##$BF6= 500.13
##$BF7= 500.13
##$BF8= 500.13
##$BYTORDA= 1
##$CFDGTYP= 0
##$CFRGTYP= 5
##$CHEMSTR= <none>
##$CNST= (0..31)
1 1 145 1 1 1 1 1 1 1 1 1 1 1 1 1 1 1 1 1 1 1 1 1 1 1 1 1 1 1 1 1 
##$CPDPRG= <>
##$CPDPRG1= <>
##$CPDPRG2= <>
##$CPDPRG3= <>
##$CPDPRG4= <mlev>
##$CPDPRG5= <mlev>
##$CPDPRG6= <mlev>
##$CPDPRG7= <mlev>
##$CPDPRG8= <mlev>
##$CPDPRGB= <>
##$CPDPRGT= <>
##$D= (0..31)
0 1 0 0 0 0 0 0 0 0.06 0 0 0 0 0 0 0.0002 0 0 0 0 0 0 0 0 0 0 0 0 0 0 
0 
##$DATE= 1129637468
##$DBL= (0..7)
120 120 120 120 120 120 120 120 
##$DBP= (0..7)
150 150 150 150 150 150 150 150 
##$DBP07= 0
##$DBPNAM0= <>
##$DBPNAM1= <>
##$DBPNAM2= <>
$$ [...]
##$SUBNAM7= <"">
##$SUBNAM8= <"">
##$SUBNAM9= <"">
##$SW= 20.6930455092707
##$SWIBOX= (0..15)
0 0 3 0 0 0 0 0 0 0 0 0 0 0 0 0 
##$SW_h= 5175.983436853
##$TD= 65536
##$TD0= 1
##$TE= 294.16
##$TE2= 300
##$TE3= 300
##$TEG= 300
##$TL= (0..7)
0 120 120 120 120 120 120 120 
##$TP= (0..7)
150 150 150 150 150 150 150 150 
##$TP07= 0
##$TPNAME0= <>
##$TPNAME1= <>
##$TPNAME2= <>
##$TPNAME3= <>
##$TPNAME4= <>
##$TPNAME5= <>
##$TPNAME6= <>
##$TPNAME7= <>
##$TPOAL= (0..7)
0.5 0.5 0.5 0.5 0.5 0.5 0.5 0.5 
##$TPOFFS= (0..7)
0 0 0 0 0 0 0 0 
##$TUNHIN= 0
##$TUNHOUT= 0
##$TUNXOUT= 0
##$USERA1= <user>
##$USERA2= <user>
##$USERA3= <user>
##$USERA4= <user>
##$USERA5= <user>
##$V9= 5
##$VALIST= <valist>
##$VCLIST= <CCCCCCCCCCCCCCC>
##$VD= 0
##$VDLIST= <DDDDDDDDDDDDDDD>
##$VPLIST= <PPPPPPPPPPPPPPP>
##$VTLIST= <TTTTTTTTTTTTTTT>
##$WBST= 1024
##$WBSW= 4
##$XGAIN= (0..3)
0 0 0 0 
##$XL= 0
##$YL= 0
##$YMAX_a= 307828
##$YMIN_a= -258193
##$ZGOPTNS= <>
##$ZL1= 120
##$ZL2= 120
##$ZL3= 120
##$ZL4= 120
##$ABSF1= 16.522
##$ABSF2= -4.171173
##$ABSG= 5
##$ABSL= 3
##$ALPHA= 0
##$AQORDER= 0
##$ASSFAC= 0
##$ASSFACI= 0
##$ASSFACX= 0
##$ASSWID= 0
##$AUNMP= <proc_1d>
##$AZFE= 0.1
##$AZFW= 0.1
##$BCFW= 0
##$BC_mod= 0
##$BYTORDP= 0
##$COROFFS= 0
##$CY= 12.5
##$DATMOD= 1
##$DC= 0
##$DFILT= <>
##$DTYPP= 0
##$F1P= 14.0000005364418
##$F2P= -0.99999901652339
##$FCOR= 0.5
##$FTSIZE= 32768
##$FT_mod= 6
##$GAMMA= 0
##$GB= 0
##$INTBC= 1
##$INTSCL= 1
##$ISEN= 128
##$LB= 0.3
##$LEV0= 0
##$LPBIN= 0
##$MAXI= 10000
##$MC2= 0
##$MEAN= 0
##$ME_mod= 0
##$MI= 0
##$NCOEF= 0
##$NC_proc= -5
##$NLEV= 6
##$NOISF1= 0
##$NOISF2= 0
##$NSP= 0
##$NTH_PI= 0
##$NZP= 0
##$OFFSET= 16.522
##$PC= 1
##$PHC0= -86.6207
##$PHC1= 17.34853
##$PH_mod= 1
##$PKNL= yes
##$PPARMOD= 0
##$PSCAL= 4
##$PSIGN= 0
##$REVERSE= no
##$SF= 250.13
##$SI= 32768
##$SIGF1= 0
##$SIGF2= 0
##$SINO= 400
##$SIOLD= 32768
##$SREGLST= <1H.DMSO>
##$SSB= 0
##$STSI= 32768
##$STSR= 0
##$SW_p= 5175.98343685301
##$SYMM= 0
##$S_DEV= 0
##$TDeff= 65536
##$TDoff= 0
##$TI= <Analysis number 999999
Compound Code 99
Book Reference 9
Project Code 9>
##$TILT= no
##$TM1= 0
##$TM2= 0
##$TOPLEV= 0
##$USERP1= <user>
##$USERP2= <user>
##$USERP3= <user>
##$USERP4= <user>
##$USERP5= <user>
##$WDW= 1
##$XDIM= 32768
##$YMAX_p= 384197188
##$YMIN_p= -580778
$$ End of Bruker specific parameters
$$ ---------------------------------
##NTUPLES= NMR SPECTRUM
##VAR_NAME=  FREQUENCY,     SPECTRUM/REAL,   SPECTRUM/IMAG
##SYMBOL=    X,             R,               I
##VAR_TYPE=  INDEPENDENT,   DEPENDENT,       DEPENDENT
##VAR_FORM=  AFFN,          ASDF,            ASDF
##VAR_DIM=   32768,         32768,           32768
##UNITS=     HZ,            ARBITRARY UNITS, ARBITRARY UNITS
##FACTOR=    0.157963299565203, 1,           1
##FIRST=     4132.6476996994, 0,             0
##LAST=      -1043.33573715361, 0,           0
##MIN=       -1043.33573715361, -580778,     0
##MAX=       4132.6476996994, 384197188,     0
$$ Real data points
##PAGE= N=1
##DATA TABLE= (X++(R..R)), XYDATA
$$ [...]
22099a22659L8863n9221J5391Q6916J2390q48J7995J98894l8680k01901p0324
22088a23184P7676j16045q6326J63426J44337J2396k9304p0030j2801k5950k0126
22077h5931j4281R4357O7030l2982O335P0998j63282r0294J19365n7495L0198
22066e5982P409M7285J2699j08620O3959l101j02000m1972R4550k2164M0646j24402
22054a91693n6433J09514P131o7497N7839K2799j6432n0697J03635R3149R2935
22043A04250J7680Q2328j91j05970o7040k1134m3477j05726o2171q4536M5786
22032b40201R9756n7492J17459m54n8727J60389J17928j04429j39129J68969O9368
22021A33437Q3068m5435j07911M5616J32108l2706j67632p1087N898j4569k3170
$$ y = [-122659, -83796, -143017, -127626, -40710, -28320, -29168, -11173, 187721, 149041, -52860, -123184, -45508, -161553, -247879, -84453, 59884, 72280, 42976, -27054, -39855, -65805, -85931, -100212, -5855, 61175, 28193, 34528, 105526, -57756, -148050, -28685, -86180, -55982, -48573, -1288, 11411, -97209, -33250, -36351, -138351, -180323, -85773, -107937, -67291, -191693, -248126, -138612, -131481, -198978, -141139, -118340, -134772, -185469, -81834, 11315, 104250, 121930, 204258, 204067, 98097, 31057, 9923, -33554, -139280, -201451, -285987, -240201, -140445, -197937, -80478, -80932, -139659, 20730, 138658, 34229, -104900, 64069, 133437, 216505, 171070, 63159, 108775, 240883, 208177, 40545, -30542, -24644, -39213, -62383]
22010f2383J05295l2449r4065m411Q6747J16995O120l9729j32797p4714Q347J8523
21998i8521L888J3896j51k5347N1857K9522j46657j5747N472J19556J50866k7274
21986F1360p3766J30030r741l5928R998J4329m8376l7621o3469l5767j06709K2688
21974a72972K07164O6486j4521o1333j17814l2815n2175K7350r9030O2335J16303
21963g1022j1531N5624j32175L6111l2991q3106O2085j2382J43785O4948R4661
21952A14007j11010q8473r0109J43612P9252j31377m7760j7798Q6474J45909m7617
21941C5110J0357P9689j13181M7655j32121R238J26237R2971k00554l6160r2167
21930a72926K925P8351P7378M0036L3217j4430m5019o350J6731M3832m9042o1529
$$ y = [-62383, 42912, 10463, -83602, -88013, -1266, 115729, 121849, 82120, -50677, -125391, -117044, -98521, -94633, -80737, -80888, -106235, -54378, -24856, -171513, -187260, -181788, -62232, 88634, 61360, -12406, 117624, 107883, 71955, 81953, 96282, 47906, 10285, -53184, -88951, -195660, -172972, 34192, 100678, 86157, 24824, -92990, -125805, -177980, -150630, -249660, -187325, -71022, -82553, -26929, -159104, -122993, -155984, -239090, -177005, -189387, -45602, 19346, 114007, 2997, -85476, -175585, -31973, 47279, -84098, -131858, -149656, -63182, 82727, 35110, 45467, 125156, 11975, 59630, -72491, -63253, 62984, 155955, -44599, -80759, -172926, -170001, -91650, -14272, 25764, 58981, 44551, -468, -6818, 9913, 53745, 4703, -56826]
21918e6826j20392p5750J16532O7050N1043j01789j8899k9531J9527o417M1713
21907a13739K00355N3125k8878N8045l8050M9471m6182j44436k8842J9955k3368
21896d2544k09187j13793J23035K53965N7786j00431P282l227R5864P684j0686
21885F5748p5315n878p128k9478J25973k9411j43802P6211p8523m9895R1577p2527
21873a32448O7814J16001L0214j26522p8636P6614P819j7043r6471K917J43507
21862f234p5204j37507k6126m3769O4795m0669O0466L1916P5919L1203n5267l1611
21850a52088N2451P4880j7617k601o7182j7489K9292Q1493J26040J07452M3736
21839B58367r3002p9273j9678r8878P3017M4814m8379k15087K7456M8509O9376
$$ y = [-56826, -177218, -252968, -136436, -69386, -18343, -120132, -139031, -168562, -149035, -155452, -113739, 86616, 139741, 110863, 168908, 130858, 180329, 134147, -10289, -39131, -19176, -42544, -251731, -365524, -242489, 11476, 69262, -31169, -23887, -27114, 68750, 76434, 65748, -9567, -15445, -22573, -52051, 73922, 44511, -99291, -23080, -101603, -151498, -59921, -132448, -64634, 51367, 81581, -44941, -123577, -46963, -39144, -56187, -152658, -149741, -6234, -81438, -218945, -245071, -288840, -224045, -264714, -204248, -172332, -96413, -65210, -120477, -152088, -99637, -24757, -42374, -44975, -112157, -129646, -100354, -18861, 107179, 214631, 258367, 165365, 86092, 66414, -32464, 40553, 85367, 36988, -178099, -150643, -102134, -32758]
21828c2758J2142q399j3986K9010J8559N8522o265r0888J3047K4094J3107n7743
21816d1558M7358k8866n749j08651J184M852P474J12550J79157j32445n2062J9214
21804B458Q280r7249o6198J67383n5107r5718k0579Q5060J16490j4066J01738
21793A32492J00761N60l1535j8584j68864j09328J8615n9716L159J61607k1067
21782H100L4917M4115o2655P5060N650M3499Q4076o3147o5710O5866q2181j16981
21770b9391j42964J9971j6561J56174R7719L2859j0270K8082r1898q5726J0018
21759c1987J33301N323M9363j64894o7747J52174J07677N5790L6487j78836j0835
21748H5816j01326K8230J4635k9804l305n4568K145J78388l3517m0371j4110L9928
$$ y = [-32758, -20616, -29015, -43001, -13991, 4568, 63090, 56825, -34063, -21016, 3078, 16185, -41558, 5800, -23066, -28815, -137466, -136282, -131430, -123956, -11406, 167751, 35306, -16756, 2458, 10738, -86511, -152709, 14674, -40433, -136151, -156730, -71670, 44820, 30754, 132492, 233253, 233813, 202278, 183694, 14830, -94498, -75883, -135599, -132440, 29167, 8100, 43017, 87132, 24477, 99537, 105187, 148686, 232762, 169615, 103905, 169771, 87590, -29391, -172355, -152384, -168945, -12771, 84948, 117807, 107537, 135619, 43721, -42005, -31987, 101314, 106637, 156000, -8894, -76641, 75533, 183210, 239000, 275487, 96651, 85816, -15510, 12720, 27355, -2449, -5754, -60322, -58177, 120211, 86694, 46323, 32213, 72141]
21736G2141l7439Q0778k5751p4960j6360O4234Q1852l2760n7367j16061J42063
21725H0370O320p1572P5428n0758L0434M6272J9201m7130m5500M93q1628j01158
21713a39228J2515J93555L6324j01491r8790j0148m4990L400J98421j5736L3771
21702F7603m7795j15749O5570l7994J15707J44048N2603Q2946j29041j09459j01151
21691a2712j02804K9561J4389J3562M1859m521R6604M547n7042m3207P5626m2568
21679A3294j98418n4985J55713K4739j5303Q7174q8507P10L7776j16867J624P6399
21667g6651J46130l070r9605L123O5181q3974L3933K7543M9320k0286M4730Q7375
21655A73749k3398o8836K2959r8042j16994P9347O7996l576J1994M752r307p5003
$$ y = [72141, 34702, 115480, 89729, 14769, -1591, 62643, 144495, 111735, 54368, -61693, 80370, 86690, 15118, 90546, 39788, 70222, 116494, 135695, 88565, 43065, 43558, -38070, -139228, -126713, 66842, 103166, 1675, -97115, -107263, -152253, -148853, 49568, 33832, 67603, 19808, -95941, -30371, -68365, 47342, 191390, 243993, 326939, 197898, 88439, -12712, -115516, -85955, -71566, -58004, -16145, -20666, 75938, 80485, 23443, -19764, 55862, 13294, -185124, -240109, -84396, -59657, -74960, 12214, -76293, -75583, -37807, -154674, -153050, -76651, 69479, 66409, -33196, -30073, 35108, -48866, -14933, 12610, 61930, 41644, 86374, 173749, 150351, 81515, 104474, 6432, -110562, -31215, 36781, 33205, 45199, 49951, 40644, -34359]
21643c4359o7785k0528Q4214J83734K1565n2828j26743j00487K72749k0608P2120
21632B11044m956n0128m0624j39196q1961L2491j44207j06722K9083J34445K7722
21621a33009O8533j25842j03J15392M1828K1006R8240r2225m3934R952Q4735n2978
21609h405P7855k7068j03271k1349n0525J03239K17786l8415p9518Q920M1361
21598A20610k1257N99j06722J09812p8116L3653O9245r982j31734j41106L522
21587a51476k0754J03508J06047R3832P7899P4342k2668j40854j72826O012j3228
21576f0166K0512P6469N6933P2306M1011K0971j75915j16997n2321M6460O3615
21565g122Q237M3370k6614j27320J08090J51207r0474Q964m6370m087l2256K2787
$$ y = [-34359, -102144, -122672, -38458, 145276, 166841, 114013, -12730, -113217, 159532, 138924, 211044, 206088, 155960, 115336, -23860, -105821, -73330, -217537, -324259, -295176, -160731, -133009, -64476, -190318, -190421, -75029, -33201, -12195, 86045, -6180, -50114, -40162, 44573, -8405, 69450, 42382, -60889, -82238, -132763, -29524, 188262, 149847, 70329, 79249, 120610, 99353, 99952, -6770, 103042, 24926, 58579, 127824, 117842, -13892, -154998, -151476, -172230, -68722, 37325, 131157, 209056, 283398, 260730, 119876, -52950, -46938, -60166, -39654, 36815, 93748, 166054, 207065, 228036, 52121, -64876, -117197, -70737, -7122, 1115, 44485, 17871, -109449, -1359, 149848, 59374, 68338, 21968, 17881, -14375, 8412]
21553H412O8291J8365k6772N0334j0819j561o7242j36082L549N7071P8695P4795
21541A17036l7159j07696o501r539K4939Q8399n2419o2429J3783o3676k0182L1526
21529h3918j3523O168P5910J60663l2956m1991L0326L1888P1896j10196k6939
21518F7328J02308K4140j2112m6328l0911j5559l0761p2240q1180j18382J68431
21507d5266N5395n7024P3555k228j8829k3522J00385m165p3172L8253J2123k0860
21495C4645M9140N577j5962q2188M5790M2915L2908j24653m5087j248Q7604L8986
21483F8427r5128J02742J15948O3996k1203J3457j33552Q377M129j709L9880j40002
21471B5362j36251n257K7811J30624l2309l0518Q9566J58246M1880l7289o222
$$ y = [8412, 76703, 95068, 68296, 118630, 107811, 106250, 39008, -97074, -93525, -36454, 42241, 117036, 79877, -27819, -34320, -43859, -18920, 69479, 17060, -45369, -31586, -95262, -115444, -83918, -97441, -91273, -15363, 145300, 112344, 70353, 100679, 132567, 204463, 94267, 67328, 169636, 193776, 181664, 135336, 104425, 88866, 58105, -14135, -95315, -213697, -45266, 10129, -46895, 26660, 24432, 5603, -17919, 82466, 78301, 5129, 43382, 55505, 34645, 83785, 89362, 73400, -8788, 37002, 79917, 112825, -11828, -56915, -58163, 29441, 68427, -26701, 76041, 191989, 255985, 234782, 248239, 114687, 123064, 127193, 125484, 165364, 25362, -110889, -116146, -88335, 42289, 9980, -20538, 69028, 227274, 269154, 231865, 225643]
21460B25643M48p7738j13315K2543J88026O3698o1085n6662P6712j3959k22289
21449C2022j37792O4332J9160Q831p7643k7589J24595r15l1225J09118k9942R3698
21437A46650N1072m3514M3992M0156o5593q3954O3881j8860p0743P6495k878L0899
21425A67603l7135j6388l6189o2468o3489N1736J06696l8816j19889O5434K0704
21414C7799k1256L6882O2195j4300N1194n4310K7263m0371M7784R3365n6777j12625
21402E6843n0683J2385M1364N6902J0654j4147n8824P45M2406J2238j61644p9660
21390a31421j14049J00959J58751J8799J768l1122l3542M8967N7688p3410M7912
21379E1300M8228K8700J0168q8492L4301j9768k10415L7624J62203n1198m6148
$$ y = [225643, 226091, 148353, 35038, 57581, 245607, 309305, 248220, 191558, 268270, 254311, 32022, -105770, -41438, -22278, -13447, -91090, -118679, 5916, 5001, -26224, 82894, 52952, 146650, 197722, 154208, 198200, 238356, 172763, 88809, 152690, 133830, 63087, 139582, 136704, 167603, 130468, 114080, 77891, 15423, -48066, 3670, 110366, 71550, -48339, 17095, 37799, 16543, 53425, 115620, 101320, 152514, 98204, 125467, 85096, 132880, 226245, 169468, 56843, 6160, 18545, 59909, 116811, 127465, 113318, 54494, 55239, 97645, 109883, -51761, -131421, -245470, -144511, 14240, 33039, 34807, 3685, -29857, 19110, 76798, 3388, 51300, 99528, 128228, 138396, 49904, 84205, 64437, -145978, -108354, 53849, 2651, -43497]
21368d3497J67569J06614l2724r6177j6472O1296o6554r9908K1921j261R6719
21357I7526J3898R284m475l4856J6181r3553K2779N8380p0647N5842j9541K8537
21345G9355j40406q1662k491K5084M5982m548n440J4962M8343j06037o2194n7991
21333b47043L4835J49068R9163j57444N229K06378J20624O4083j50314k324L3981
21322A56236m7570L2491l7940l9201M3737Q4476m4052j37266J09725M0761O7256
21311B28653j6578r9625q9279l2994j43325j54445m4100Q1106P8502K9381Q4169
21300g8535m5883m7705k1109Q3775J29233O0592J7009k4187M0314n0284L4339
21289I7559l5271j95857N2105l1640l4784j9539J20261O6646Q2874K514r5142
$$ y = [-43497, 124072, 230686, 197962, 101785, 85313, 146609, 80055, -19853, 2068, 807, 97526, 111424, 120708, 116233, 81377, 97558, 4005, 26784, 85164, 14517, 70359, 50818, 79355, -61051, -142713, -145204, -120120, -74138, -78686, -84126, -69164, -20821, -126858, -189052, -247043, -212208, -63140, 36023, -121421, -116192, 90186, 210810, 274893, 124579, 122255, 156236, 108666, 141157, 103217, 64016, 107753, 192229, 148177, 10911, 120636, 161397, 228653, 212075, 112450, 23171, -9823, -153148, -307593, -351693, -270587, -192085, -162704, -78535, -124418, -172123, -193232, -109457, 19776, 80368, 97377, 73190, 113504, 63220, 97559, 62288, -133569, -81464, -113104, -147888, -167427, -47166, 19480, 102354, 104868, 9726]
21278I726O6971p6018j59355r5372J40729Q4300O6993J18452m8150K7269J9623
21267A55168o7465n6107J06074K0224p7728J198k8834r9760N9922J85150N455
21256B03297j6407n5449O452q9366j5659k686Q8324n3271k0751J71937n6260j21953
21244C8208n8673J84230J21120j448j14663l6881q260M1754L7406n424r9941Q4791
21232A82219p7363k2057l5600j04390m2503L4323o6390q5452N5098J07792O9435
21221A5112K0584j09829n8146p0781k3889P5240M449o590L7267J1091R3100j5821
21209b8213Q2374L9757R7600r571j0948l4077p8871k08671q9054J9971O6349J7641
21197a35713K0041K6243R8247L0433l2944j5329L7610k7448L2854k2431k0568
$$ y = [9726, 76697, 679, -158676, -254048, -113319, -29019, 37974, 156426, 108276, 135545, 155168, 87703, 31596, 137670, 157894, 80166, 81364, 52530, -47230, 12692, 197842, 203297, 186890, 131441, 137893, 48527, 32868, 30182, 118506, 65235, 44484, 216421, 160161, 38208, -20465, 163765, 284885, 283437, 168774, 131893, 123633, 165387, 202793, 197369, 97428, 182219, 104856, 82799, 47199, -57191, -99694, -65371, -131761, -217213, -162115, -54323, 15112, 35696, -74133, -132279, -203060, -226949, -151709, -147260, -153850, -116583, -105492, -12392, -28213, 54161, 93918, 191518, 181947, 170999, 136922, 58051, -150620, -239674, -219703, -153354, -135713, -115672, -89429, 8818, 39251, 6307, -9022, 28588, 1140, 33994, 11563, -9005]
21186i005P8693N0624k32013n663K2695Q0885Q6420m0782J1511R4063J31229l2532
21174B36125j6575o6972P868k245L2970q848O5013l7011j28036k877J21558L2916
21162B33886j9487j791k3852j66173j30610J71929J06495j22050l6250l4058P1911
21151D9950J41258N3890K7050m9759m2243p8177m7432N2149M3567J9025r4755
21140G4523l0631O0181p2275m2111O1305m789o9458k6190j05602K41261J54732
21129B40946O4838K8509j16246j66310l5475P1336n2205M4343L1130J62370R764
21118B83000q9471L7444R3367L0606n4304J8232j01555l1149L223Q0071K2161
21107B91625q7121p4340q285J04123Q8827Q946N7321J1350p1790j51552j25407
$$ y = [-9005, 69688, 120312, -111701, -117364, -94669, -13784, 72636, 31854, 43365, 137428, 268657, 236125, 219550, 152578, 160446, 158201, 191171, 182323, 247336, 210325, 82289, 79412, 200970, 233886, 214399, 212608, 188756, 22583, -108027, 63902, 170397, 48347, 12097, -21961, 49950, 191208, 245098, 272148, 222389, 180146, 101969, 54537, 106686, 150253, 169278, 74523, 43892, 104073, 31798, -10313, 50992, 46203, -23255, -49445, -155047, 86214, 240946, 305784, 334293, 218047, 51737, 16262, 87598, 35393, 79736, 110866, 273236, 283000, 193529, 230973, 324340, 354946, 300642, 318874, 217319, 186170, 189393, 269464, 291625, 204504, 130164, 121879, 226002, 314829, 323775, 381096, 392446, 320656, 169104, 43697]
21096D3697o940J6975q3072m4645n4528M2744J00828r3066J912J82694O6512O8540
21084B41651M3556r6469p2194n5582J02365O7752j029l3233L5655o0367K8482
21073B00587o3806r0196r0375j37844l1014J25841J32391R8257Q6114o3700j51406
21062A4849l3591L549J33175J8877m2408q7750J235p748k7466O6409N3244K1954
21050A14329J37942r8809r2021p8755R326K8697K6450N4959j15991j20384J51823
21039A7566R5051L9490p0912P2859O572M2970m6808Q051q3087j9762m5667q9073
21027g2750n8664q4972J54300J62625J319j21724r4825J68327J46011O3135j75542
21016H7240l5177J02812L7194k208j52488k8172L8704K0066J31851K5796O0108
$$ y = [43697, 36757, 53732, -29340, -73985, -128513, -85769, 15059, -78007, -76095, 106599, 173111, 241651, 285207, 188738, 116544, 60962, 163327, 231079, 230050, 196817, 232472, 172105, 200587, 136781, 46585, -43790, -181634, -212648, -86807, 45584, 143841, 229955, 166255, 14849, -18742, -15193, 117982, 136859, 94451, 6701, 7936, 188, -27278, 39131, 92375, 114329, 252271, 153462, 61441, -17314, -7988, 20709, 47159, 102118, -13873, -134257, 17566, 112617, 152107, 81195, 154054, 160626, 203596, 156788, 164839, 81752, 61990, 16323, -72750, -131414, -216386, -62086, 100539, 101858, -19866, -114691, 53636, 199647, 262782, 87240, 52063, 154875, 192069, 189861, 37373, 9201, 47905, 67971, 199822, 225618, 285726]
21005B85726m7854L590k8869J5194L1459k9194j9279r7269n6844k3137j50248
20994a16725r4993N0908L3592L6188Q4277J21133J32509K8882N1171P7036n7377
20983C46601r3177o9138k7923l4446p5397p7047M1012L4708J3312P1988N2403
20972A82896n1123O110k5164K9984J26908J5767o021O2536j193Q544j58917j21006
20960F9321j7265k1171Q4551J19887O4085l3064o7546n5612L9183j59965r3040
20949g0636J21369K3750P095O0095K3331k7341p486N3451r8687k4257N5940o0860
20937E5764j3943R5415q2241P8415J8085j25586j922O357R132M1344O0740J25771
20925B67331O0340j80007J5232M8711K0174Q552K0970r5381o8088j4466Q0831
$$ y = [285726, 237872, 241462, 212593, 227787, 259246, 230052, 210773, 113504, 56660, 33523, -116725, -211718, -160810, -127218, -91030, -6753, 114380, 246889, 275771, 326942, 403978, 346601, 253424, 184286, 156363, 121917, 46520, -30527, 10485, 45193, 58505, 130493, 182896, 131773, 137883, 112719, 142703, 269611, 285378, 279357, 341893, 340700, 349244, 190327, 69321, 52056, 30885, 115436, 235323, 299408, 266344, 198798, 143186, 182369, 22404, -70636, 50733, 74483, 81578, 141673, 165004, 137663, 130177, 183628, 84941, 60684, 116624, 55764, 41821, 137236, 54995, 133410, 151495, 25909, 23987, 30344, 39476, 80820, 141560, 267331, 327671, 147664, 162896, 211607, 231781, 240333, 261303, 165922, 97834, 83368, 164199]
20914A64199k0953q783Q062J60579k7229j63790q5911j7311M0217K69671P0777
20903C89528m5841q0849Q8403q6133K7887j21168j60952j15560j40401J16512
20893a28574J27321r024n3883J95500J44152r0625j32593k2461m8590m887J3757
20882i907N9169J35532j02671m5151l1072K8150o022J7072O1592l3905j05841
20871c3054J6817Q2083J14671O7190M6987l4318n2974p1873q9000L8135K827R2727
20859A80218k8790j74486j09673K441J13011J01210J48929j37871l998o6939m4030
20848a9978K9026P7875P1227Q7983j28412K9229Q7267K0271p4910k3152N4915
20837B11341O7181M0927l7107J6069l6662n2021N7118m3794k5640j04793o6141
$$ y = [164199, 143246, 134463, 142525, 303104, 275875, 112085, 26174, 8863, 49080, 318751, 389528, 343687, 262838, 351241, 265108, 292995, 171827, 10875, -104685, -245086, -128574, -1253, -10277, -64160, 131340, 275492, 184867, 52274, 29813, -18777, -23664, -9907, 49262, 184794, 82123, 36972, 5900, 34050, 28028, 45100, 106692, 72787, -33054, -16237, 65846, 180517, 247707, 294694, 260376, 207402, 135529, 46529, 84664, 87491, 180218, 151428, -23058, -132731, -130290, -17279, 83931, 232860, 94989, 90991, 24052, -19978, 9048, 86923, 158150, 246133, 117721, 146950, 234217, 254488, 179578, 156426, 211341, 278522, 319449, 282342, 298411, 261749, 209728, 266846, 223052, 197412, 92619, 26478]
20826B6478J1169r3914J08945J73021J0573m0864j77406k4722M0073n1037k1358
20815c9042Q1946Q0066n0667r0214j20405l6515Q7715Q7165R6201P1248O9587
20804B37085j0996K862L75j32300n1605P0886k2929j17234J6637j05294n2162
20793a64675J12648J85755k6058j08540J33588m3025l172L8518J3535k6000j7558
20782I5016J16687Q8944o3876p2639O3491J20079j3582k3614r0832l4765O6278
20771B51187l6723r6136O2598j2511j39477R9966P7770J2291k0533j32373O673
20760G2732P3992l5347j11294O1320J44307J04744O276o6128r8443j37393L9956
20749E4722J31544r0637n9929J1781O2342Q5309m4423r0175J70466P3631N1245
$$ y = [26478, 37647, -56267, 52678, 225699, 236272, 195408, 18002, -6720, 33353, -17684, -39042, 42904, 122970, 72303, -17911, -138316, -174831, -87116, 49, 96250, 167498, 237085, 226089, 228951, 229326, 97026, 45421, 116307, 93378, -23856, -7219, -112513, -164675, -52027, 133728, 107670, -870, 132718, 89693, 86521, 125039, 138574, 112574, 95016, 211703, 300647, 236771, 164132, 227623, 347702, 334120, 310506, 219674, 184909, 251187, 214464, 118328, 180926, 168415, 28938, 128904, 206674, 218965, 198432, 66059, 72732, 146724, 111377, 83, 61403, 205710, 310454, 316730, 250602, 152159, 14766, 54722, 186266, 95629, 35700, 47481, 109823, 195132, 150709, 60534, 231000, 304631, 355876]
20738C55876M3361j02302j07770j9957O6599m8689r7497r460m8013N4031K37098
20727C23277L6873j42520k52702j0683J9042P8761P8838j38551j91834K9263P5436
20716i4800K33680M3283J2859l5403q4034P9901M7517Q9348J14651L1175p0117
20705C68060p8340Q1577K4783N7373J30605R0951k4412j11327r7053j51250p8139
20694B12828j1514O7239K3963j41635j20523j68026O6389L186P7155M4840j11846
20683e7944Q8837J8586j13327J43941R4297j03269L2143M9584O4470J2431n4771
20672A74978j38649k4630N8236j981k41Q0314J31640n2619J6290J69396r257l6271
20660C67206j07324j49221l745p5496J47990J06680j11687j0501P4104m2445p1068
$$ y = [355876, 399237, 296935, 189165, 169208, 235807, 187118, 89621, 80161, 32148, 86179, 323277, 360150, 217630, -35072, -45755, -26713, 52048, 130886, -7665, -199499, -170236, -94800, 138880, 182163, 195022, 159619, 75585, 155486, 203003, 292351, 407002, 438177, 368060, 289720, 371297, 396080, 453453, 584058, 675009, 650597, 539270, 442217, 290967, 212828, 201314, 268553, 292516, 150881, 30358, -137668, -71279, -68093, 9062, 53902, -57944, 30893, 49479, -63848, 80093, 174390, 71121, 103264, 152848, 217318, 229749, 174978, 36329, 11699, 69935, 67954, 67713, 148027, 279667, 227048, 243338, 412734, 403477, 367206, 259882, 110661, 106916, 31420, 179410, 286090, 174403, 163902, 238006, 195561, 124493]
20649A24493L8122J5771R942j2845Q0319J3178j187q9695o8403J15092N642K1411
20637B51840o024K9126n9716q5836m3136m5500M565o5826n8110J45524N9992p5201
20625E1698K81304P1458j39933J0943K7850j5233p8014O4367Q6134O907R755q0498
20613B96738j83949r573K0925K2206j39311N1927K32067n8875k07250r8936L6117
20602c7914K07296k2211L8807P5438J60526k6910j32833j83206L8524J00786J7679
20591B35982m5957n418j021m422K8040J05116J43420L7087J36103n6035j0983
20580E61912l6465k19358p1291N1182r8533M873O9912j28272M4678K044M6168
20569B26850k2192J9740r052O8379J38328N5009J6723p7382p6670q5989j6069
$$ y = [124493, 162615, 178386, 188328, 175483, 255802, 268980, 267793, 178098, 109695, 224787, 230429, 251840, 245816, 274942, 215226, 129390, 86254, 40754, 45319, -20507, -78617, 66907, 126899, 51698, 333002, 404460, 264527, 275470, 303320, 288087, 210073, 274440, 360574, 367481, 377236, 296738, 112789, 103216, 124141, 146347, 7036, 58963, 291030, 232155, 24905, -74031, -37914, 169382, 147171, 185978, 261416, 421942, 395032, 262199, 78993, 117517, 218303, 235982, 190025, 184607, 183586, 179164, 207204, 312320, 455740, 492827, 628930, 572895, 561912, 525447, 306089, 234798, 285980, 187447, 192320, 262232, 133960, 178638, 180682, 226850, 204658, 224398, 215346, 283725, 422053, 477062, 493785, 416403, 339733, 253744, 237675]
20558B37675O6708R1070j7749j44883o6315n5957m8983L8167J4506L659J24349
20547B42247k2243r9998K9788J60553M8155p0584j8904P4986o9084m5091J0184
20536B40009P333J2799N29M8645J05317N8292n7681j23263p4861M3620M3755r3028
20524B11466r649P5674M8270R4747l0980j04149k1151o9314n340P2991O7282P103
20512C36950n4633r6220L9976J68522N1265N1080j6254L2749j08990k59995r4774
20501D9676R4448Q3362R0749J16892j03607j90143k1374K195j3981q7191o652
20490A4374l007L8026R2461j0119j8596P1754J00151m5424K4764L0798k8508L197
20478B69871L1447q3743l9271m4362j49411J7143O7050N4323J17982J0534k102
$$ y = [237675, 304383, 395453, 377704, 232821, 166506, 110549, 61566, 99733, 114239, 117898, 242247, 220004, 120006, 149794, 310347, 358502, 287918, 269014, 344000, 274916, 229825, 240009, 247342, 260141, 260670, 309315, 414632, 472924, 415243, 291980, 217119, 260739, 304494, 211466, 201817, 277491, 325761, 420508, 389528, 285379, 264228, 194914, 189574, 262565, 329847, 336950, 282317, 186097, 226073, 394595, 445860, 496940, 480686, 513435, 404445, 144450, 49676, 144124, 227486, 318235, 435127, 331520, 141377, 120003, 122198, 108217, 21026, 14374, 11367, 49393, 141854, 131735, 113139, 184893, 285044, 239620, 264384, 295182, 266674, 269871, 301318, 217575, 178304, 133942, -15469, 1674, 68724, 123047, 241029, 251563, 249461]
20467B49461m4126K8173R67m3001L8817J09695l1211L7754n4986k0513q0071p2173
20455A18786l6502J72822J42548q9376k0996k1525o2506j4271m0179Q9888J07840
20444C46529O1391r8487p2935n2119k0109K0203j1311m4861p4533J12887M5864
20433B12519P2616n9988l7076j03469j54001M1531J57006L7397K2942M1420k8397
20422B02500L2364K9774M8631m2515R5926K9215l5039L11j30138j38989l6283
20411E5757L5399J2935Q0797J102m4904j37991k245l2145J89358N5586J3246N8918
20399B85813J11603m086p6320L8523j3752q5809m413l5260l509k7913L6770Q8307
20387C09954j8985l7944p0523m6525k3247M1805Q8217L9882R0700n5094j50270
$$ y = [249461, 205335, 233508, 234475, 191474, 230291, 339986, 308775, 346529, 291543, 271030, 190959, 118786, 82284, 255106, 397654, 308278, 287282, 265757, 203251, 188980, 148801, 238689, 346529, 407920, 309433, 236498, 184379, 164270, 184473, 173162, 128301, 53768, 166655, 212519, 285135, 225147, 188071, 84602, -69399, -27868, 129138, 166535, 189477, 230897, 202500, 234864, 264638, 313269, 270754, 366680, 395895, 360856, 361167, 231029, 92040, 55757, 91156, 104091, 184888, 185990, 141086, 3095, 850, -31295, 158063, 213649, 226895, 285813, 397416, 393330, 317010, 355533, 341781, 255972, 251559, 216299, 212790, 184877, 221647, 309954, 290969, 253025, 182502, 135977, 112730, 154535, 242752, 282634, 373334, 318240, 167970]
20376A67970M0995N5133k1917O9216J2951J3550r6708M2673P2361J0641j02620
20365B64245o890M7327J13376P0184Q2463o776j86094r0319j69326o2165J18830
20354A74855L3416m3285l9273l618q327P5475J14446p5179j555k2534K857o7307
20342A39971O7315J2575q7894o3960j03418j3299K36670P7577L078j85624r3543
20331a0552O2561O0600L7341j0207J16435O4230m8839q3055L5389N7168r7374
20320A83697m4016P6177j8177K4026K9140n6135L5850j663L4243k2431p6400J18456
20308B82767M8997K8167n4908o3795O9107Q8326n2606r4136J05138L8082K702
20297C97841r8922j05126L4438R6017l6425J01967Q8536j30398j7189j15222r1158
$$ y = [167970, 208965, 264098, 242181, 311397, 324348, 337898, 241190, 283863, 356224, 366865, 264245, 257355, 304682, 418058, 488242, 570705, 563929, 377835, 287516, 118190, 56025, 174855, 208271, 164986, 125713, 122095, 113768, 189243, 303689, 228510, 226955, 204421, 207278, 139971, 207286, 219861, 131967, 68007, -35411, -48710, 187960, 265537, 268615, 82991, -10552, 52009, 112609, 149950, 139743, 256178, 320408, 271569, 188514, 223903, 281071, 183697, 139681, 215858, 197681, 221707, 250847, 194712, 230562, 228899, 263142, 240711, 164311, 282767, 331764, 359931, 305023, 241228, 310335, 398661, 346055, 251919, 357057, 395139, 397841, 298919, 193793, 228231, 324248, 287823, 389790, 478326, 347928, 330739, 215517, 124359]
20286A24359j0227j4643Q5069J0143O208K7293O3079m2876L2343n3037o1215N9436
20274B25932J03602k4542k6557k8956J8060j36243p4661J02090k2572m7207J24228
20263B13174J87866O696j71105j22764n1069J30358J7557n2487k2503J3977N445
20252A55145j1906J43688O4585k9155q8908l8167n5069l468J05609j8201k8792
20241A95361M3949J20267o9096P267p662k8068J17317J03459j9570k0111K5949
20230D69062J6423j77838n6240N8141K687K3007M1997K6591M3652l3727N0468
20219D64223Q6233n6362r4473J0181l6627m8006R4597J8382p2300l1131q6906
20208B47811J11534J38015M4827N080r8463j43395J33937J63824l7942N5067L3115
$$ y = [124359, 114132, 99489, 184558, 194701, 200909, 228202, 291281, 248405, 280748, 227711, 166496, 225932, 329534, 304992, 278435, 249479, 267539, 131296, 56635, 158725, 136153, 88946, 213174, 401040, 407736, 236631, 113867, 62798, 193156, 210713, 158226, 135723, 149700, 155145, 143239, 286927, 351512, 322357, 233449, 195282, 140213, 136745, 242354, 224153, 195361, 239310, 359577, 290481, 297748, 290086, 262018, 379335, 482794, 463224, 443113, 469062, 485485, 307647, 251407, 309548, 312235, 335242, 377239, 403830, 447482, 413755, 464223, 550456, 494094, 399621, 409802, 373175, 325169, 419766, 438148, 365848, 334717, 247811, 359345, 497360, 542187, 547267, 448804, 305409, 439346, 603170, 565228, 620295, 653410]
20197F53410n4715q5140q1329j55412n2508J13810J14509k7955K1677j18543m0620
20186B87184k3332n9803m6503j689r3667N9521J12112m0999j69398l0931J07425
20175I9920J02039m5286j11081J8821J22343l0243N3485J44970L3850J7356j69370
20164B36804m0524L4183L8750k4866O357k9372O4226r2784J3640j6141J12510
20153C02783l4645k3649r9627L322N0374J21329J4234m1716r875L682L5700q3356
20141B38556L8245n5158K3680m2926k6138P3473J25096Q5736M4228N8692p4283
20130D89201j47333M7442o128j56558L1225M1674Q000l9458n1436J07743J05892
20119D30264M4361J43419k3964k93532j54158p7782M9552J3439J32601P9708K9407
$$ y = [653410, 598695, 513555, 432226, 276814, 224306, 338116, 452625, 424670, 446347, 327804, 287184, 263852, 204049, 157546, 155857, 62190, 121711, 233823, 192824, 23426, -7505, 99920, 201959, 156673, 45592, 64413, 186756, 156513, 209998, 354968, 388818, 406174, 236804, 196280, 230463, 269213, 244347, 250704, 221332, 285558, 192774, 206414, 190273, 302783, 268138, 244489, 144862, 148184, 198558, 319887, 334121, 292405, 282530, 286212, 321912, 238556, 276801, 221643, 245323, 202397, 176259, 249732, 374828, 460564, 504792, 563484, 489201, 341868, 389310, 383182, 226624, 257849, 299523, 307523, 268065, 216629, 324372, 430264, 474625, 618044, 594080, 300548, 146390, 68608, 118160, 131599, 264200, 343908, 373315]
20108C73315r7141J36183N4782p67m2343q1806q8637o3854M0015j0269N6210M9273
20096C24961O8584k01774N5297J62317R9300P4353K7444o3595j92019j10195J04737
20085C49410J18416k6418m3426j671K3630j23251j80766R623J19356N510j07536
20074A42877L7828K54503N1226m1861j43392o7915Q172N4936J23988N7776L682
20063D81820l425K3374p9540J3440J11767p671p5611p8170R0601J22584l2776
20052E66393k3898J442j4775j03405j87441k7821L1361J55189J00384L8928j38937
20041C97420q6075J05610p898q078k2611K9732j03307o7740P6990J72699k5407
20030D61335q7704j52125l5273N4356J65548k730q0260M8020J8704J13708Q524
$$ y = [373315, 276174, 412357, 467139, 466372, 424029, 342223, 253586, 189732, 229747, 219478, 275688, 324961, 393545, 191771, 247068, 409385, 508685, 583038, 610482, 546887, 354868, 244673, 349410, 467826, 441408, 397982, 396311, 419941, 296690, 115924, 125547, 244903, 250413, 142877, 180705, 435208, 486434, 444573, 301181, 233266, 241438, 296374, 420362, 478138, 481820, 478395, 501769, 422229, 435669, 547436, 539765, 464154, 385984, 476585, 599169, 566393, 542495, 543937, 529162, 425757, 238316, 210495, 241856, 397045, 497429, 536357, 397420, 311345, 416955, 409057, 400979, 378368, 408100, 304793, 237053, 314043, 486742, 461335, 373631, 221506, 186233, 240589, 406137, 403407, 323147, 371167, 389871, 503579, 512103]
20019E12103o4107o9543J9670L3456p1051P0389R1357k9521o1575m7811J7922
20008D01289p8527P4304M0146m406n3140m941L0158q6485k367J05780k6217j18344
19996B77250K3538M8557j27979J8762J35825R5843l9165k5808O3580m4167l902
19985D22334N2694Q4301J00757j129K034p5404r3967j74085j16802q185N5195
19974B47743M6861K1917J36883K3731o1395p0421k8306N8543m253n1140q9819
19963B30344K3832J20522J15041J887r7748m1403j11215n1096N2032O5409K7429
19952C35034o5014k2043p3688J9518Q5754j979Q8991N685l6053J26132J92517
19941F54854j10324j96172K4212J07172N6003j50908n5306O4743J45948J67738
$$ y = [512103, 447996, 378453, 398123, 431579, 360528, 430917, 522274, 492753, 431178, 383367, 401289, 322762, 397066, 437212, 432806, 379666, 374725, 404883, 318398, 316031, 421811, 395594, 277250, 300788, 349345, 221366, 240128, 375953, 471796, 432631, 406823, 470403, 426236, 422334, 475028, 559329, 660086, 658957, 660991, 585587, 491620, 317535, 200733, 192548, 247743, 294604, 316521, 453404, 477135, 415740, 345319, 317013, 375556, 371303, 320163, 230344, 254176, 374698, 489739, 491626, 393878, 352475, 241260, 190164, 242196, 307605, 335034, 270020, 247977, 174289, 193807, 279561, 277582, 366573, 372258, 336205, 462337, 654854, 544530, 348358, 372570, 479742, 535745, 384837, 329531, 394274, 540222, 707960]
19931G07960j51406j01590k202k4140o8762n2225n6688R2373J31017O4619j78271
19920C60685k3625m9973P3552P585N5584l2283j2212P0169k30671J8954k1575
19909B16190K2464J64434J00182P5888N6970Q7378n5422j53840q5118m1734j8907
19898C68485J6151k01564q5918J06029J61085J66268O6868j50038q1489M6910
19888D12787L8605j2651P800O2758j03186n8483J24604n4389o1049M9021l2138
19877C73679j9520K0642j8327M7305J32445K7667j45856j10582R453J26176O2355
19866E05437j4523l2333K28r2601j89157N6346J86210R9148J9194N403J83391
19855G26743j4567j57088j44452R4585J92904P8441m1021l3251n9926p2668N3616
$$ y = [707960, 556554, 454964, 452762, 428622, 359860, 307635, 250947, 343320, 474337, 538956, 360685, 337060, 287087, 360639, 368224, 423808, 391525, 379313, 449482, 218811, 237765, 216190, 238654, 403088, 503270, 579158, 636128, 723506, 668084, 514244, 429126, 387392, 368485, 384636, 183072, 97154, 203183, 364268, 530536, 597404, 447366, 365877, 412787, 451392, 438741, 446541, 509299, 406113, 347630, 472234, 417845, 356796, 405817, 373679, 354159, 374801, 356474, 403779, 536224, 563891, 418035, 307453, 316906, 443082, 505437, 490914, 458581, 458809, 366208, 177051, 233397, 419607, 518755, 537949, 543352, 726743, 712176, 555088, 410636, 505221, 698125, 776566, 735545, 702294, 642368, 569700, 623316]
19844F23316J51648m9359j35266j58088j78888J23396O1698j72604q8932J63666
19834C40587K43565K1399j35868O2244n1264q4451O0586K1317J6604M6757M5860
19823E87336L3476M7895j03005o2404k5028j03453l6264P1202N6500q3061k7231
19812C55963K1514J63k2153K1605L6548J22215n9K4223p1983K490K4597J4408
19800E29531p496N048j5294k1139L4514n0396K1557O0675Q3523j01087J5504j04041
19788D50899j18304N5566R1630J3440j4438N9773N5008o7049r5543q1203Q5346
19777D35125O5706j23368J38687Q5865Q5326O7513j21782k05833r7252K1392O0516
19766D11895p1441M0035M5817J9551n0260N4322K8372L1554L4134L972j02972
$$ y = [623316, 774964, 725605, 590339, 432251, 253363, 376759, 438457, 265853, 176921, 340587, 584152, 605551, 469683, 531927, 480663, 396212, 456798, 478115, 494719, 541476, 587336, 620812, 668707, 565702, 503298, 478270, 374817, 338553, 409755, 466255, 383194, 355963, 377477, 377640, 355487, 377092, 413640, 535855, 535796, 560019, 488036, 490526, 515123, 529531, 522035, 527083, 511789, 490650, 525164, 474768, 496325, 557000, 640523, 539436, 554940, 450899, 332595, 388161, 479791, 493231, 478793, 538566, 593574, 526525, 430982, 349779, 435125, 500831, 377463, 516150, 602015, 687341, 754854, 633072, 427239, 329987, 351379, 411895, 340454, 380489, 426306, 445857, 395597, 449919, 478291, 509845, 543979, 547951, 444979]
19755D44979j59176N426J80406q3117o8145L0635J18883K8903r4207R1519J28396
19744F24502n789k09912n9706N8423K0490m254J1688P1503k2637j78759l6543
19733B69006J3645Q108J88635O0880R418j09487j41719L3933K5258m7020M4352
19722C55009R1736P0475N0000M4452k5846j07825n7580J6601o7036l5876J7489
19711C51599L9883M5674r438J17076R8863n9926r498M1498r703M6219q0448l6694
19699E35105K6920P9692k2282O6149j9787r6259j01491j1311r353J11852O4368
19688F23603j6156P6j39858O0109p1078q0551J9471J59657l7027m8702j6858Q8146
19676E40832O8050P2834j1307o8267q4519o313m9951J5401R2531O2527J18769
$$ y = [444979, 285803, 291229, 471635, 388518, 320373, 351008, 469891, 498794, 404587, 496106, 624502, 618713, 408801, 349095, 407518, 428008, 423754, 435442, 506945, 484308, 305549, 269006, 282651, 290759, 479394, 540274, 549692, 440205, 298486, 332419, 357677, 310657, 355009, 446745, 517220, 567220, 611672, 585826, 478001, 420421, 437022, 369986, 334110, 351599, 391482, 437156, 427718, 544794, 643657, 583731, 574233, 615731, 606028, 652247, 571799, 535105, 562025, 641717, 619435, 685584, 665797, 569538, 468047, 456736, 447383, 559235, 623603, 607447, 607523, 467665, 527774, 456696, 376145, 395616, 555273, 518246, 469544, 452686, 540832, 608882, 681716, 670409, 602142, 517623, 511310, 461359, 476760, 569291, 631818, 750587]
19665G50587J08878q7482L0860N4623j27467j17756l5810j43709J3496m3691l0413
19654C72116J40172j59990l1963O8907J22093L5154j6254j01270q0064l221K7231
19643C72911R6418Q062k7658P9238O2477l0982n3119M8227m9746j28322p996J69113
19631E38623N1199J7616J55162R3989p2809j76962m3548J63446q9730j11873m2755
19620D82358K4490j22184q606J26496O418j08419k9365N6821L5544j21933Q0915
19609D22535O818Q0148L3012Q1199N6017o5475j20569J35801J02550j5335k5403
19598F91298l8112k7671J2003M0692p089J50534O0166j50851j43664l449J71383
19587G55240J3479M8793l263O897l7602j0254J1425Q1127j21119r0218M3486Q106
$$ y = [750587, 859465, 771983, 802843, 857466, 729999, 612243, 576433, 432724, 446220, 402529, 372116, 512288, 352298, 320335, 389242, 511335, 546489, 530235, 428965, 348901, 345680, 372911, 469329, 477391, 449733, 528971, 591448, 560466, 507347, 555574, 505828, 377506, 369510, 538623, 589822, 607438, 762600, 856589, 783780, 606818, 563270, 726716, 636986, 525113, 482358, 506848, 384664, 376058, 502554, 508972, 400553, 371188, 428009, 463553, 341620, 422535, 429353, 509501, 542513, 623712, 679729, 614254, 493685, 629486, 732036, 716701, 691298, 653186, 625515, 637518, 678210, 671121, 821655, 881821, 730970, 587306, 583857, 755240, 768719, 817512, 814249, 821146, 783544, 773290, 784715, 865842, 744723, 654505, 697991, 706097]
19575G06097L1671P0003M3101l4132r189R219n0391M3652q3883O3501J3611L5602
19563H38862J9499o9400k03878k0858J57804Q780l5539p4877J3842p0771p2468
19552D90996M082p6416N0531J36032J5816m5035N6478K0224J35473N1778l6063
19541H03896p6333o0672j46040j5634O3956J00988J03334j65630Q923M4240J00057
19530G61085k1193j25837l0932R8566k9260m9991J14865m2002q8936o2443L2787
19519E56709R8224j1946J05557J81564r4195j11618l0052k0726O3332P2587Q7325
19508H96761R0632K1283r5667j08511m8613O3874l2295q3799j19093N7262R1473
19497G33307K4727L2944J05880j08657k7011Q6198R9952k7451L8788j21547J48861
$$ y = [706097, 737768, 807771, 850872, 816740, 807551, 816770, 766379, 810031, 726148, 789649, 803260, 838862, 858361, 788961, 585083, 564225, 722029, 730809, 695270, 620393, 634235, 563464, 490996, 495078, 418662, 469193, 605225, 621041, 576006, 632484, 652708, 788181, 839959, 803896, 727563, 666891, 520851, 505217, 569173, 670161, 773495, 607865, 616788, 661028, 761085, 739892, 614055, 583123, 681689, 652429, 602438, 717303, 675301, 586365, 523922, 556709, 654933, 642987, 748544, 930108, 835913, 724295, 694243, 673517, 736849, 809436, 896761, 987393, 1008676, 913009, 804498, 755885, 819759, 787464, 703665, 584572, 641834, 733307, 758034, 790978, 896858, 788201, 761190, 847388, 947340, 919889, 958677, 837130, 985991]
19486I85991J74902K13262O5789J77565J8645k4519j14399o8354L6253P8132l8406
19475A504861m5528J66652J73515j27221n4966o0558j93518j24925j00657l0039
19465A107616L3408j06693o0957M8627J47115m6109j17872K8939L4092O6955L3821
19454A168942r0105j39171q1542n7512M8915j13605o6243Q3291K2566K7408J13957
19443I16901J1866n9997m6J63141J56591m2067J2821M7115O8148Q4167R7523R6700
19431A552863J22875j25083j18771Q0214l9872q1473q3253Q1098K41272P5726
19421A705596L4597j22894m5756Q449r947j35511k13902j12273l7447K8167J21678
19410A220757j37579q8493j01897m8404Q7007P7299k4062j6630m5003l6044O8046
$$ y = [985991, 1160893, 1374155, 1439944, 1617509, 1636154, 1611635, 1497236, 1428882, 1465135, 1543267, 1504861, 1459333, 1625985, 1799500, 1672279, 1617313, 1556755, 1363237, 1238312, 1137655, 1107616, 1141024, 1034331, 973374, 1022001, 1169116, 1123007, 1005135, 1034074, 1068166, 1135121, 1168942, 1078837, 939666, 858124, 800612, 849527, 735922, 669679, 752970, 775536, 802944, 916901, 928767, 868770, 868724, 1031865, 1188456, 1146389, 1159210, 1206325, 1274473, 1358640, 1456163, 1552863, 1675738, 1550655, 1431884, 1512098, 1472226, 1390753, 1307500, 1388598, 1629870, 1705596, 1740193, 1617299, 1571543, 1579992, 1570045, 1434534, 1220632, 1108359, 1070912, 1099079, 1220757, 1083178, 994685, 892788, 844384, 931391, 1008690, 984628, 967998, 922995, 886951, 954997]
19399I54997L084m7258K2813n2770j07414M3808J24532j2971K4002j0691J1817
19388I53949J24838O7328k69503l7200N6674M2512R2472O7526O3217p5015j86967
19377H99831k16705l9371K31331O6488j12122j04474R8255J03110j13453j62068
19367F50822J04291N5296L6505K2390l5373J3726k7735P6416r5016N8352R7371
19356I57045Q0887M3357l6839l6898L3427J19897N7720q4858j54570J02852J18564
19345A200584J43684n976j59623j19552P6096N6558j63026m8877J04166J614P991
19334A093639m6565M3444j7016n6932J19285K8389l4682j31261m0142L279L9655
19323A001093M133L3482n7443J27074l1804j9434J6439Q7125J54924j44291j63553
$$ y = [954997, 958081, 910823, 933636, 880866, 773452, 817260, 941792, 928821, 952823, 942132, 953949, 1078787, 1146115, 876612, 839412, 896086, 938598, 1031070, 1098596, 1161813, 1086798, 899831, 683126, 643755, 875086, 941574, 829452, 724978, 823233, 926343, 812890, 650822, 755113, 810409, 846914, 869304, 833931, 847657, 819922, 896338, 801322, 859674, 957045, 1037932, 1081289, 1044450, 1007552, 1040979, 1160876, 1218596, 1133738, 979168, 1082020, 1200584, 1344268, 1338292, 1178669, 1059117, 1135213, 1191771, 1028745, 979868, 1084034, 1085648, 1093639, 1047074, 1090518, 1073502, 1016570, 1135855, 1164244, 1129562, 998301, 958159, 961438, 1001093, 1005226, 1038708, 981265, 1108339, 1076535, 1057101, 1073540, 1160665, 1315589, 1171298, 1007745]
19312A007745M4002k7449p0839j45613m3492K2585j5890Q9440O2249R0181P0451
19301A083370J422k4140J2447L856M6248R499o6906n6682n5815P6738L1409N9420
19289A120866J28432j27291k03034j4499N2706L4919J23906J11357N0592n2071
19279A225883j42930j07855O7411k565L573M6016J41235J1806k3758m969r631
19268A204216j02805K4644Q9364J20335J5999j3506J85834J43964J23352J17660
19258A909057J1656L857n4983j26643N1878L7266j8812J4605R1609K12667K6274
19247B158431l0384n8841j14176m9735j49152j08207k12782l0368J09169j1432
19237A502523K0077l0274P7074n1279j23505J5175J6730k12754M1950L9861K7549
$$ y = [1007745, 1051747, 1024298, 953459, 807846, 764354, 786939, 771049, 860489, 922738, 1012919, 1083370, 1084792, 1060652, 1073099, 1076955, 1123203, 1132702, 1065796, 1009114, 953299, 1030037, 1061446, 1120866, 1249298, 1122007, 918973, 904474, 957180, 992099, 1116005, 1227362, 1277954, 1225883, 1082953, 975098, 1042509, 1039944, 1043517, 1089533, 1230768, 1242574, 1218816, 1213847, 1204216, 1101411, 1126055, 1215419, 1335754, 1351753, 1338247, 1524081, 1668045, 1791397, 1909057, 1920713, 1924570, 1869587, 1742944, 1794822, 1832088, 1813276, 1827881, 1919490, 2132157, 2158431, 2128047, 2069206, 1955030, 1905295, 1756143, 1647936, 1435154, 1404786, 1513955, 1502523, 1522600, 1492326, 1569400, 1518121, 1394616, 1409791, 1426521, 1213767, 1255717, 1295578, 1323127]
19226A323127n3585j2725J9554r259L8145J8461j07484O8236K60439J49809J39921
19215A834639n354N3565M3518J09693L0753M5539L9551l8365j2768j8661R6686
19204B178796J90547r6525J0008J22596j07613j56597J99J8699j96240j45204
19194A818666p409o1200j9326Q111L6990R839q6283k4323p4470M8486J22607M4471
19182A816159j79865l5264J43751J46718J42144j11349r8056K802N6865M9584
19172A933489o4834j88620j32422l9054O6658L9085L0257j21333j5989J85040
19162A692277J58506j7772j97745p4433r710J38821L1445j14306O1149N7371P249
19151A732852k1743j65023k01872R2601J24325j40283j0355J19965J19126M01
$$ y = [1323127, 1269542, 1256817, 1276371, 1267112, 1305257, 1323718, 1216234, 1284470, 1544909, 1694718, 1834639, 1829285, 1882850, 1926368, 2036061, 2066814, 2112353, 2151904, 2113539, 2100771, 2082110, 2178796, 2369343, 2272818, 2282826, 2405422, 2297809, 2141212, 2141411, 2160110, 1963870, 1818666, 1811257, 1750057, 1730731, 1738842, 1775832, 1785671, 1699388, 1675065, 1600595, 1649081, 1771688, 1816159, 1636294, 1601030, 1744781, 1891499, 2033643, 1922294, 1824238, 1827040, 1883905, 1933489, 1868655, 1680035, 1547613, 1508559, 1575217, 1614302, 1644559, 1523226, 1507237, 1692277, 1850783, 1833011, 1635266, 1560833, 1551123, 1689944, 1721389, 1607083, 1668232, 1725603, 1732852, 1711109, 1546086, 1344214, 1436815, 1561140, 1420857, 1410502, 1530467, 1649593, 1649994]
19141A649994k8133K6679k0159Q273j42181J4981P4607k3079L9379J99515O1227
19130A861103j74784o8331Q3468m940L459J35202J80977J2626p5945j32427j50445
19119A669963R72k194K5013j4982L4649J65914K25330N138o8544j26999M0709
19108A954969P8824J6420j49014j03568L8409L9554J94308p7552m2653J67511
19098B117208j1167j18621l4989n2646j11592P8815J38230J64617K8811j01573
19088B097093L923Q882K5333k5650O7058Q4589q499M9675j61109J6441L8837o1363
19076B135210P2829J19346P2278J9250m89J9591r525M843j0232O8658K10064N1985
19064B753808l6077j15953L2931R3968j4005k6383n8066j12955L8956L3908R6472
$$ y = [1649994, 1621861, 1648540, 1628381, 1636654, 1494473, 1509454, 1584061, 1560982, 1600361, 1799876, 1861103, 1686319, 1617988, 1701456, 1696516, 1699975, 1835177, 2016154, 2028780, 1952835, 1820408, 1669963, 1670935, 1668741, 1693754, 1678772, 1713421, 1879335, 2104665, 2109803, 2041259, 1914260, 1954969, 2033793, 2050213, 1901199, 1797631, 1836040, 1875594, 2069902, 1992350, 1949697, 2117208, 2106041, 1987420, 1952431, 1899785, 1788193, 1867008, 2005238, 2169855, 2198666, 2097093, 2101016, 2109898, 2135231, 2109581, 2176639, 2261228, 2252729, 2302404, 2141295, 2157736, 2196573, 2135210, 2208039, 2327385, 2399663, 2418913, 2418424, 2438015, 2428490, 2433333, 2423101, 2491759, 2701823, 2753808, 2717731, 2601778, 2634709, 2728677, 2714672, 2688289, 2630223, 2517268, 2556224, 2590132, 2686604]
19053B686604J50513J50117J58409K76062J21206p1659j47031j81019j02413R7443
19043C138232K35875K33743J9354r8327o74l788j15909K8740L6407p2163q705
19032C392785q7489Q7950K2742L7638J20358J47449J86035J67801O3018q3862
19022D054425j63718n9070J00173R8099m8749L244J32115J22788J482Q7298J64912
19011D492999J90468J2811N3726J41798J52526J53500P5779J90457J93183K48566
19001E905813K51831L46077L58158L48158L58096L11884K93950J96551J33217
18992H503735K86747M42217O27618O20178O24867P67879J083916R65043O97764
18983A4619964J044732J359493J806171K616442L618944N306484P741389J1371108
$$ y = [2686604, 2837117, 2987234, 3145643, 3421705, 3542911, 3471252, 3324221, 3143202, 3040789, 3138232, 3374107, 3607850, 3627204, 3528877, 3528203, 3524415, 3408506, 3437246, 3473653, 3401490, 3392785, 3305296, 3393246, 3415988, 3453626, 3573984, 3721433, 3907468, 4075269, 4138287, 4054425, 3890707, 3831637, 3931810, 4029909, 3981160, 3984404, 4116519, 4239307, 4240789, 4328087, 4492999, 4683467, 4696278, 4750004, 4891802, 5044328, 5197828, 5273607, 5464064, 5657247, 5905813, 6157644, 6503721, 6861879, 7210037, 7568133, 7880017, 8173967, 8370518, 8503735, 8790482, 9232699, 9860317, 10480495, 11105362, 11873241, 12957157, 13922200, 14619964, 15664696, 17024189, 18830360, 21446802, 25065746, 30372230, 38113619, 49484727]
18975D9484727J7332795K6713192L8974192M4889205K1986924k2786846l5717659
18968A40876530k5597103j3623092k536356Q953798K3078708L9392787M7451807
18961B17997079J7240698l8414589m8834525l5551500k4094444j6427418j1800697
18954F0114604q604492o266995m547611l156183k028659j274167p50342q89959
18946C2596196j850100k292777k194843j991823j498539j101417q92127m51305
18938B0323265p0822J17814L7091J18452j06667O6136M78782R95683J677140K718341
18928B6355215M272353O366516R683860J4648461K3563953L6969721N0425152
18921A72285231M3571262p676874m3252553l5270617k0280939p257302M496318
$$ y = [49484727, 66817522, 93530714, 132504906, 177394111, 199381035, 176594189, 140876530, 115279427, 101656335, 99119979, 108073777, 131152485, 170545272, 217997079, 235237777, 196823188, 147988663, 112437163, 88342719, 71915301, 60114604, 51510112, 45243117, 40695506, 37539323, 35510664, 34236497, 33486155, 32596196, 30746096, 28453319, 26258476, 24266653, 22768114, 21666697, 20774570, 20323265, 20252443, 20370257, 20407348, 20525800, 20419133, 20485269, 20964051, 21959734, 23636874, 26355215, 30627568, 36994084, 46677944, 61326405, 84890358, 121860079, 172285231, 215856493, 208179619, 164927066, 129656449, 109375510, 102118208, 106614526]
18914A06614526J7753709L3357397M5543291L3244655j8105996m9054175m1503753
18907A27849654k8715161j9933209j4361778j0656964p902104n837038m269089
18900C6174311l049857j943100j185843j318865k139542k677160k514038k255526
18892A9090380k141509j910447j626573j116888q67473p50568r70156r13514p46791
18883H046461p16283o32925n81574n77726n74481n70133m51077k70712k53160
18874C418390j74099j50651k62336k45323k87537l33721k39102j86602j72601
18865A366418j45564o2084O0747P3505l4627L2448j30327o3225J04588j17662
18855A084217j31514O8000p5784J16469l938m8167R6974R1188l4489n3365q3664
$$ y = [106614526, 124368235, 157725632, 203268923, 236513578, 218407582, 169353407, 127849654, 99134493, 79201284, 64839506, 54182542, 46280438, 40443400, 36174311, 33124454, 31181354, 29995511, 28676646, 26537104, 23859944, 21345906, 19090380, 16948871, 15038424, 13411851, 12294963, 11427490, 10676922, 9706766, 8793252, 8046461, 7330178, 6697253, 6115679, 5537953, 4963472, 4393339, 3942262, 3671550, 3418390, 3244291, 3093640, 2831304, 2585981, 2298444, 1964723, 1725621, 1539019, 1366418, 1220854, 1158770, 1219517, 1293022, 1258395, 1290843, 1160516, 1097291, 1201879, 1084217, 952703, 1020703, 944919, 1061388, 1057450, 1009283, 1106257, 1197445, 1162956, 1109591, 1025927]
18844A025927J40585K69777O3065k13615j92613K9921J78607J55200J3271J24575
18834A594700J24139q4374p4103Q9986M2448o2325O1447J49692p3943q2176j04871
18823A580620r3964L7948J51686O3146q1505O9838J49722o6112p1443L3851J14677
18812A888464J2478j19180m6511N1053K2645n4507P4462Q4176K2710j9105M4452
18801A961137m9775j6919k2716Q5008J17213K58352L30878J16540j07303j6295
18791B656120k462o604J86287R0099J34490J18447j0900P1372M5518K0860P7228
18780C380455P5615J92272J49161o8501L2960k0803J25982J15194J58663J59928
18770D300926J00609Q0422K65835L79667K92016L03051L89968M33375O02015N24598
$$ y = [1025927, 1166512, 1436289, 1499354, 1285739, 1093126, 1123047, 1301654, 1456854, 1470125, 1594700, 1718839, 1634465, 1560362, 1650348, 1692796, 1630471, 1691918, 1841610, 1767667, 1685491, 1580620, 1486656, 1524604, 1676290, 1739436, 1657931, 1727769, 1877491, 1811379, 1739936, 1773787, 1888464, 1900942, 1781762, 1735251, 1786304, 1808949, 1754442, 1828904, 1913080, 1935790, 1916685, 1961137, 1911362, 1894443, 1871727, 1956735, 2073948, 2332300, 2663178, 2779718, 2672415, 2656120, 2653658, 2647054, 2833341, 2923440, 3057930, 3176377, 3165477, 3236849, 3282367, 3303227, 3380455, 3456070, 3648342, 3797503, 3729002, 3761962, 3741159, 3867141, 3982335, 4140998, 4300926, 4401535, 4481957, 4747792, 5127459, 5419475, 5722526, 6112494, 6545869, 7147884, 7672482]
18760G672482K58536J08312K82590M89943N74843P83896Q24345Q76706J303327
18751A3174980J538691J732034J851712K124990K918570M511481P049150J0874627
18743D5776235J6839620K6471598M0385106N0629223L2799720j7620563l9749890
18736A55531049l0977818j8701022p552244L805584J7154795L3830487M5721975
18729A98812806K5409015k9806155m7031412l5197606k4430035j6887887j2009099
18722E8859627q598722o239256m418646k908238j979014j511379j397142j237931
18714C0569299j619312j807679j787342j587609j466378j222076r53089q19490
18706A9306324n15116k11646J91043M93019Q37261J138945J225114J606434K495820
$$ y = [7672482, 7931018, 8039330, 8321920, 8811863, 9386706, 10170602, 10994947, 11871653, 13174980, 14713671, 16445705, 18297417, 20422407, 23340977, 27852458, 34901608, 45776235, 62615855, 89087453, 129472559, 180101782, 212901502, 195280939, 155531049, 124553231, 105852209, 98299965, 102105549, 119260344, 153090831, 198812806, 224221821, 194415666, 147384254, 112186648, 87756613, 70868726, 58859627, 50260905, 44021649, 39603003, 36694765, 34715751, 33204372, 31807230, 30569299, 28949987, 27142308, 25354966, 23767357, 22300979, 21078903, 20125814, 19306324, 18791208, 18579562, 18770605, 19263624, 20100885, 21239830, 22464944, 24071378, 26567198]
18697B6567198M137633O594518J0469835J6971564K7356878M3849597N8777718
18690A94724941M3735263j8782301m8850016l6903262k2203044r365130K854419
18683A05210870J6527036L2075692M2662578K5127998k4185632m4851308l6248097
18676A16319137k5827311j8048348j3089892r677007o957123m950689l518557
18669C4250210k583986k189159k049574j750938j905122k408320k480244k222933
18661A6659934j876433j348536j283993j322724j225635j104295r26516q63632
18653F708170p86258o95200n79106n87723m58012l97957l44768k68247k56609
18644B334290l25408l04210k96934k19632q5341k24117k19370j43659q3911m1908
$$ y = [26567198, 30704831, 37299349, 47769184, 64740748, 92097626, 135947223, 194724941, 238460204, 219677903, 170827887, 133924625, 111721581, 102356451, 105210870, 121737906, 153813598, 196476176, 221604174, 197418542, 152567234, 116319137, 90491826, 72443478, 59353586, 49676579, 42719456, 37768767, 34250210, 31666224, 29477065, 27427491, 25676553, 23771431, 21363111, 18882867, 16659934, 14783501, 13434965, 12150972, 10828248, 9602613, 8498318, 7571802, 6708170, 5921912, 5226712, 4647606, 4059883, 3601871, 3203914, 2859146, 2590899, 2334290, 2008882, 1704672, 1407738, 1188106, 1102765, 878648, 659278, 515619, 431708, 389800]
18634C89800j46382m6517m1525L9167p6080k22996q011j03866m0432O2035J4568
18623a80239m6261r7730k5554M0673Q6841N7376L0484P4787M8243J10824J3655
18612A13099q1338j54243j06163j24452l0947M8865J45637R4155l1157k8861k8863
18601a84268j72553k2309J0987K30023J0468k7612J4867j9302l6461M871k3737
18590b15026L3553K6142q5872k68734p0841J48641J07413J15518J31842J5922
18580f1442N1083J4327r3011n2138K7561M6201k7492m8447J53747N7527N514p4810
18568a380J4493p748K5659R3905R5334j64357r0240J09914P9031k2809J7662k6506
18556A22958Q2428R9139J0754n6788k03458n7625o6967N0301Q1192K4884J05096
$$ y = [389800, 243418, 196901, 155376, 194543, 118463, -104533, -112544, -216410, -256842, -194807, -180239, -226500, -324230, -349784, -309111, -222270, -164894, -134410, -59623, -11380, 99444, 113099, 31761, -122482, -228645, -353097, -384044, -335179, -189542, -95387, -126544, -155405, -184268, -356821, -379130, -368143, -138120, -127652, -155264, -140397, -159699, -196160, -191289, -215026, -181473, -155331, -241203, -509937, -580778, -432137, -324724, -209206, -77364, -61442, -10359, 3968, -89043, -141181, -113620, -67419, -94911, -143358, 10389, 67916, 73430, -1380, 13113, 5365, 31024, 124929, 220263, 55906, -34334, 75580, 154611, 131802, 149464, 122958, 205386, 304525, 315279, 258491, 55033, -2592, -69559, -19258, 61934, 86818, 191914]
18545A91914N3325j32130q9939M4828J41934p2448k5908J08351J05243N6116P107
18534C88393N0480r4951l9828k6713L4448J08220j01043k948j856n2126M7064
18523C09140j5665J17957L2063K5854O1870o6113j69692l1904J14871m0887q2610
18512B54884m671K9391j7554J32057N897r6199l4469L0989J52980n3116j10456
18501B89733K5704l4999J13981K1607k09410J3232R7332o7004J5202q4495o5399
18490A15484J51785K1473k3880m9544Q6882M6337o2074O1278k2235Q427p7391
18479B56542j15763O4630K8607R8983K3370k7526N0763M4153P1790l469J67079
18468F59159O860o5857r2672N4474M4388J4506M0464l5544Q7318J58685J57979
$$ y = [191914, 245239, 113109, 23170, 67998, 209932, 137484, 111576, 219927, 325170, 381286, 388393, 438873, 343922, 304094, 277381, 311829, 420049, 319006, 316058, 314202, 262076, 309140, 293475, 411432, 443495, 469349, 531219, 465106, 295414, 263510, 378381, 337494, 254884, 250213, 279604, 262050, 394107, 400004, 303805, 269336, 300325, 453305, 400189, 289733, 315437, 280438, 394419, 416026, 206616, 219848, 317180, 250176, 265378, 180883, 115484, 267269, 288742, 264862, 215318, 302200, 348537, 286463, 347741, 325506, 333933, 256542, 140779, 205409, 234016, 332999, 356369, 328843, 379606, 423759, 495549, 492080, 659159, 666019, 600162, 507490, 561964, 606352, 620858, 661322, 625778, 713096, 871781, 1029760]
18457A029760P3098J71211J90151k8118j32886j90871k8042j03913j089N1319
18447A030620R6896J690l4789L520R94J06227m4781j36095n4412m3688J9015l9326
18435I05871q0380J3690j7911j34921r5102m8185J02792J2393Q9898M3964O8221
18424H60330J65079m8335q2802j43457j37319k7686M8500q6145n8888J35222J17760
18413G42259M177j21474L7351K34158Q1046p1357M6450J77206J17878N0161o661
18402A291194P2087o6056m0725r4263J17314J52071R9455N1316Q9657p0411j60584
18391A441055j04395j32988j39928m3443K4077o571o7682n1518Q6718k1812N2963
18380A036476p0284j89112L9064M104p3222L6023j04969j8041J56008J58148J2484
$$ y = [1029760, 1102858, 1274069, 1464220, 1436102, 1303216, 1112345, 1084303, 980390, 979301, 1030620, 1127516, 1129206, 1094417, 1097937, 1098931, 1205158, 1160377, 1024282, 969870, 926182, 945197, 905871, 825491, 839181, 821270, 686349, 591247, 543062, 645854, 658247, 748145, 792109, 860330, 1025409, 977074, 894272, 750815, 613496, 585810, 634310, 548165, 489277, 624499, 742259, 746436, 624962, 662313, 896471, 977517, 906160, 952610, 1129816, 1247694, 1297855, 1291194, 1363281, 1297225, 1256500, 1162237, 1279551, 1431622, 1531077, 1582393, 1672050, 1601639, 1441055, 1336660, 1203672, 1063744, 1020301, 1044378, 1037807, 970125, 918607, 1005325, 983513, 1036476, 966192, 777080, 816144, 820248, 747026, 783049, 678080, 660039, 816047, 974195, 986679]
18369I86679J26723l9626r3989L0730j11470n7851P2696q9778K3678j3058j25620
18358G09114Q8213O3054j3771j24200N5511K08386r217j60132j98226o7771J11649
18347F62610J76451r0417j3999N4573m507N9677k8626N6558l9340N4143n8385
18336H28738m6615K5805N0984J05951J3974R886J11656M5392j17795J3181L7367
18325A078524r3428n0374k1194p225N4642j6635j5345J56669o2375n2500n2241
18314I18518k0560O7621Q2017J94253j3190N3292j9555j23978p1795n7163o1886
18303I47574P7824J60206P4795P1921j30254j67083j02020m4609j8496N7680M3909
18292I71447P9605k16k6246q540j01407Q3931J52237J1433o322p064l8551r2109
$$ y = [986679, 1113402, 1073776, 979787, 1010517, 899047, 841196, 913892, 824114, 847792, 834734, 709114, 797327, 860381, 846610, 722410, 777921, 986307, 977090, 816958, 618732, 550961, 662610, 839061, 748644, 734645, 789218, 784711, 844388, 815762, 872320, 832980, 887123, 828738, 782123, 807928, 858912, 964863, 978837, 988723, 1100379, 1145771, 1027976, 1041157, 1078524, 985096, 934722, 913528, 906303, 960945, 944310, 928965, 1085634, 1023259, 970759, 918518, 897958, 965579, 1047596, 1241849, 1228659, 1281951, 1262396, 1138418, 1066623, 1009460, 947574, 1025398, 1185604, 1260399, 1332320, 1202066, 1034983, 932963, 888354, 869858, 927538, 971447, 1051052, 1050836, 1024590, 1016050, 914643, 998574, 1150811, 1162244, 1155922, 1148858, 1110307, 1018198]
18280A018198q1280J19415M0898j23082p6894k667J10830N5223P2308J64562o6115
18269A231396p2943K9358J24977J34355j19939r0103l2524l1812N1953K2843K7688
18258A275249m5608n4896P4248N631j77635N3334Q0455l1212J13821J3014j08920
18247A197481m9000k123J68455L8402J1128N4639O8244r1309m570M2585l1892
18236A402040o004n6490n7082J1928L0817J30104Q9798L673j1782q5853Q50J08535
18224A560534R5523L9097q6459j31952J64252R1101K2012J15147J32853J21826
18214B123934K6696l9569j13087J9232K17667M1079l0806K8477J27444J36929
18204B537996k4867j32161j25606j04649k75859j29087j1594k9131J26334M3357
$$ y = [1018198, 936918, 1056333, 1097231, 974149, 897255, 894588, 1005418, 1060641, 1132949, 1297511, 1231396, 1158453, 1187811, 1312788, 1447143, 1327204, 1237101, 1204577, 1172765, 1224718, 1247561, 1275249, 1229641, 1174745, 1248993, 1254624, 1076989, 1130323, 1210778, 1179566, 1293387, 1306401, 1197481, 1148481, 1146358, 1314813, 1353215, 1364343, 1418982, 1487226, 1395917, 1391347, 1433932, 1402040, 1396036, 1339546, 1282464, 1294392, 1325209, 1455313, 1545111, 1548784, 1537002, 1451149, 1451999, 1560534, 1656057, 1695154, 1608695, 1476743, 1640995, 1732096, 1754108, 1869255, 2002108, 2123934, 2150630, 2111061, 1997974, 2017206, 2234873, 2275952, 2245146, 2273623, 2401067, 2537996, 2513129, 2380968, 2255362, 2150713, 1874854, 1745767, 1734173, 1705042, 1831376, 1874733]
18194A874733L2083K1220k4916j00834R823k1198n8251J11110j58093p9253p4747
18183A531677k5625L5067K4712J15124N7491M7388n4530M7501Q0019j42629J0422
18172A726617J35590M1481n1377J49724K15463J98878R9157k07175l4131J4970
18162B289197J34673L8181p9269L5230n216j00347o1333m3073m7396n8844q3018
18151B018785j08216o1103j7378n0604k1054J3536R2447J9669K5582n6259r9993
18140A755412n3097N5623Q24n2831K7342P157j5535M3659L5696j20507q4403M0320
18128A639660L2932j9426O8386M8059K5415k9905M1848n2731n27L6350M9560N2167
18116A891788q0016N054J07345n0662p5674J39121J0649n9939M5787l1829q8812
$$ y = [1874733, 1906816, 1928036, 1903120, 1802286, 1812109, 1790911, 1732660, 1843770, 1685677, 1606424, 1531677, 1506052, 1541119, 1565831, 1680955, 1738446, 1785834, 1731304, 1778805, 1858824, 1716195, 1726617, 1862207, 1903688, 1852311, 2002035, 2217498, 2416376, 2515533, 2308358, 2274227, 2289197, 2423870, 2462051, 2382782, 2418012, 2412796, 2312449, 2251116, 2208043, 2160647, 2101803, 2018785, 1910569, 1849466, 1832088, 1781484, 1760430, 1773966, 1866413, 1886082, 1911664, 1855405, 1755412, 1702315, 1757938, 1758762, 1705931, 1733273, 1740430, 1724895, 1768554, 1804250, 1683743, 1599340, 1639660, 1672592, 1653166, 1721552, 1769611, 1795026, 1765121, 1806969, 1754238, 1753711, 1790061, 1839621, 1891788, 1811772, 1816826, 1924171, 1873509, 1797835, 1936956, 1947605, 1887666, 1933453, 1901624, 1812812]
18105A812812M4019N0752r8137L3120N5681J04786K1333q5823P4147J2265M0618
18094B065573n4485j36074m841J25997Q8307O7195q3782j14020N3102M3864j9382
18083B031454j02073k5296J26759R6866m5380j67683J44131K3711J01198J33715
18073B317402K59l9214j65909j04266R0809q710l2153o288j3275M7507k9800J10775
18061B167137N5031k3123m5847P2076J00089m7243o7969n0966J51153K04230q7002
18050B427566l2948m395j04248r2130j530L2802o1759J10492O9825R4163M2215
18039B480053q2045k28597m8546J71092J51770L4295j25031q6621L5043j3490
18029B287923L2377K1314O5143L4557n1309k754k27183o3539K1544M7598m5458
$$ y = [1812812, 1856831, 1907583, 1809446, 1842566, 1898247, 2003033, 2024366, 1938543, 2012690, 2024955, 2065573, 2011088, 1875014, 1870173, 1996170, 2084477, 2151672, 2067890, 1953870, 2006972, 2050836, 2031454, 1929381, 1904085, 2030844, 2127710, 2082330, 1914647, 2058778, 2082489, 2183687, 2317402, 2317661, 2278447, 2112538, 2008272, 2099081, 2090371, 2058218, 2051930, 2038655, 2086162, 2056362, 2167137, 2222168, 2199045, 2153198, 2225274, 2325363, 2278120, 2210151, 2159185, 2310338, 2514568, 2427566, 2394618, 2390223, 2285975, 2193845, 2192315, 2225117, 2163358, 2273850, 2343675, 2437838, 2480053, 2398008, 2169411, 2120865, 2291957, 2443727, 2478022, 2352991, 2266370, 2301413, 2287923, 2320300, 2341614, 2406757, 2441314, 2390005, 2387251, 2160068, 2096529, 2118073, 2165671, 2120213]
18018B120213M5581L8218L2138J01431J49866R8380j45160j19585l3852R3851
18008B381081P7074J21661M0435m2929J3485P391n9459O6677R9903O6607M3333
17997B815259K1265j1786k9866n9604m140j7718k7249K4437l2011N345Q6558N1472
17985B821962P5237j12286k7927K5736L4059Q2106j56890k7495K7358m9552J25874
17974B818182K2834L2991M6443o5703j73625p6919M7976J64026L2314k8771k8073
17963B791675R7477Q4070N2496L8159o4531r8742k8834K3913j817j1739n8888
17952B823239N8303J65251P7001K4009p1864l3782j34196j7253P1629J7144R7919
17941C077400J49114p1857j21436o4147j3035J7048M7774J68976O2427J546k3158
$$ y = [2120213, 2165794, 2204012, 2236150, 2337581, 2487447, 2585827, 2440667, 2321082, 2287230, 2381081, 2458155, 2579816, 2620251, 2577322, 2590807, 2598198, 2538739, 2605416, 2705319, 2771926, 2815259, 2836524, 2824738, 2794872, 2735268, 2731128, 2713410, 2686161, 2710598, 2678587, 2683932, 2770490, 2821962, 2897199, 2784913, 2756986, 2782722, 2816781, 2898887, 2741997, 2714502, 2741860, 2692308, 2818182, 2841016, 2874007, 2920450, 2854747, 2681122, 2604203, 2652179, 2816205, 2848519, 2819748, 2791675, 2889152, 2973222, 3025718, 3063877, 2999346, 2900604, 2871770, 2895683, 2893866, 2882127, 2823239, 2881542, 3046793, 3123794, 3147803, 3075939, 3042157, 2907961, 2890708, 2962337, 2979481, 3077400, 3226514, 3154657, 3033221, 2969074, 2956039, 2973087, 3020861, 3189837, 3252264, 3253810, 3230652]
17930C230652j66945r958N5688O322N2394Q7647R6653k7762Q2634j10105p0884
17919C226336O6368q5219j11183Q002J60461J53306q0592k6461k7118p842j41720
17908C134338L6307J09021M9047J9738m1890j6433O5587n049M8701N652l2378
17897C372641K8759Q6189l5695J9440J80901J5385o7300m1586M025j6922P2202
17886C618039J26264J3826o9564L0243K6396L9956j16284k9858l4646K5585Q3982
17875C713939k6004M3517o738P4864P3806j4587p0828l3721O8535o695l2080J5555
17863C799563Q2927J5114l4261l6061n4253K2645l0643J670K3470N4872P7885
17852C922928K219l0812J00900k4360j30063J98323j5412k7261n076R2299P9300
$$ y = [3230652, 3063707, 3053749, 3109437, 3115759, 3168153, 3255800, 3352453, 3324691, 3407325, 3297220, 3226336, 3292704, 3207485, 3096302, 3104304, 3264765, 3418071, 3337479, 3311018, 3283900, 3276058, 3134338, 3170645, 3279666, 3328713, 3348451, 3306561, 3290128, 3355715, 3350666, 3399367, 3405019, 3372641, 3401400, 3487589, 3451894, 3471334, 3652235, 3667620, 3600320, 3558734, 3562759, 3545837, 3618039, 3744303, 3758129, 3688565, 3718808, 3745204, 3785160, 3668876, 3639018, 3604372, 3629957, 3713939, 3687935, 3731452, 3724714, 3799578, 3873384, 3858797, 3787969, 3754248, 3822783, 3816088, 3784008, 3799563, 3882490, 3897604, 3863343, 3827282, 3773029, 3795674, 3765031, 3766701, 3790171, 3845043, 3922928, 3925147, 3894335, 3995235, 3970875, 3840812, 4039135, 4023723, 3996462, 3991386, 4083685, 4162985]
17841D162985J32770r5431q2686q4087q0286n7674J11538J76283J32072J60311
17831D475795p1580r4628j44439J15777K7845J0810P3971n1481N8675O3178o6763
17820D397160o398R091k6494j0981J4633q6181J24278K02399N3814j01981j764
17809D567576J6794K5858r4450j06976M4636N5265K43j8442O0619M6397j0366
17798D587154J10614K36036P8998j29437j54108K0183K48336Q0858J6396j42601
17788D952429o4147j06206o4890J36857P2334o242P6870J2659K1151r5717p0230
17777D864868M6678J50858J13948q5731R1584J05239r4933J8632l810J53634O4829
17766E425796m6568j03182J25477J2346o226K1441r251m4189m41K7189m1821q0189
$$ y = [4162985, 4295755, 4200324, 4117638, 4033551, 3953265, 3895591, 4007129, 4183412, 4315484, 4475795, 4404215, 4309587, 4165148, 4280925, 4308770, 4319580, 4393551, 4342070, 4400745, 4463923, 4397160, 4390762, 4399853, 4373359, 4362378, 4377011, 4290830, 4415108, 4617507, 4671321, 4569340, 4567576, 4584370, 4610228, 4515778, 4408802, 4453438, 4508703, 4508946, 4490504, 4551123, 4597520, 4587154, 4697768, 4933804, 5012802, 4883365, 4729257, 4749440, 4997776, 5078634, 5095030, 4952429, 4888282, 4782076, 4717186, 4854043, 4926377, 4920135, 4997005, 5009664, 5030815, 4935098, 4864868, 4911546, 5062404, 5176352, 5090621, 5182205, 5287444, 5192511, 5211143, 5207333, 5360967, 5425796, 5379228, 5276046, 5401523, 5413869, 5407643, 5429084, 5419833, 5375644, 5375203, 5402392, 5360571, 5280382]
17754E280382L9683n0224p728L0384M2694P5596J86677J76239o2871j58768M0579
17743E592643J20768n6408K8039P2383Q1758K6609R088n3613n4661M4647L3429
17732E844682M2914J02927J12239O2446q570j13232n6568L2309N6505p3928j62069
17721E839655j4286J82466K13310L71p0693J8108J15495O3485N4906K4799p3336
17710F354280Q9866K12942J0388j89856M3484J33665k3413p6311P1651R0360N1863
17699F768919m7329n3871j21753K6481J03681J65022Q7856j52k01903r233M2947
17688F760665P1288M0750K7310j5702J59698l4640j29456J6639J7473P674J20213
17677G041912R5016o1407J9095J00859O3568Q341p3628k2940j20202L78J07533
$$ y = [5280382, 5320065, 5269841, 5262113, 5292497, 5335191, 5410787, 5597464, 5773703, 5710832, 5552064, 5592643, 5713411, 5657003, 5685042, 5757425, 5839183, 5865792, 5874880, 5821267, 5766606, 5811253, 5844682, 5887596, 5990523, 6102762, 6165208, 6156638, 6043406, 5986838, 6019147, 6075652, 6001724, 5839655, 5825369, 6007835, 6221145, 6221516, 6150823, 6168931, 6284426, 6347911, 6402817, 6427616, 6354280, 6444146, 6657088, 6667476, 6477620, 6521104, 6654769, 6631356, 6555045, 6626696, 6717056, 6768919, 6721590, 6667719, 6545966, 6572447, 6676128, 6841150, 6929006, 6928854, 6726951, 6717718, 6760665, 6831953, 6872703, 6900013, 6884311, 7044009, 7009369, 6879913, 6896552, 6914025, 6921699, 7041912, 7136928, 7075521, 7094616, 7195475, 7259043, 7267384, 7193756, 7170816, 7050614, 7050992, 7158525]
17666G158525J04033R5259P772Q5757J24131Q8224J49637P381n2993j28701N481
17655G644506K37662L4646O4762r788j01060J35176k3784j31585O2199J32358
17645H045092M1407n0557n6906L4203J43703J23766K5484J4168k6693o745K14551
17634H501473L6775j35457k2984R5246R521N5992M7076m739k3057J72960N879
17623H738685j1366J83854n051j25552n2215J15252J71602J07416P2557J07027
17613I302209l2146j35231L086k9775M4237Q936J73243q2082j7519M9733K4174
17602I308865K8594P9734J10072J47506J94900K0798N0463j8550M918k4896L9486
17591I941890K0531l327R4635J22121p6074j4365j5645K971l1435K6748M8777
$$ y = [7158525, 7262558, 7357817, 7365589, 7451346, 7575477, 7663701, 7813338, 7820719, 7767726, 7639025, 7644506, 7882168, 7916814, 7981576, 7971788, 7870728, 8005904, 7982120, 7850535, 7912734, 8045092, 8086499, 8035942, 7979036, 8013239, 8156942, 8280708, 8306192, 8320360, 8293667, 8286922, 8501473, 8538248, 8402791, 8379807, 8475053, 8484574, 8540566, 8587642, 8582903, 8559846, 8732806, 8738685, 8727319, 8911173, 8906122, 8780570, 8728355, 8843607, 9015209, 9122625, 9195182, 9302209, 9270063, 9134832, 9137918, 9108143, 9152380, 9161316, 9334559, 9252477, 9234958, 9284691, 9308865, 9337459, 9417193, 9527265, 9674771, 9869671, 9890469, 9940932, 9922382, 9927300, 9902404, 9941890, 9962421, 9959094, 10053729, 10175850, 10099776, 10085411, 10069766, 10072737, 10041302, 10068050, 10116827]
17580A0116827M7067K3649J36038J67784L2721J12909Q883l0252l0676M2016N4510
17569A0681476J09669l9828k9536J09255J34102J14652N8328m1467n9576o3096
17559A0973979J63086J28842Q1010J48849R0865o435k1503R6024J3241K7754J3771
17548A1709483j23880J2627K02665O3033N5145j5227o6521M9127J68064J07433
17538A2161949O064q7217J58798K08674O8443r113Q8037J71339J42816q9286J57612
17527A2978116J81391K32888J17499O8087l2504p8248P05L7418o2782j62465k3867
17516A3256238N3272J08686J16168N0925m2618K6202J42113J10794K4167m3523
17506A3802424M1677O2931J51894J44026j03970J1219O8963M6620l7998J1776
$$ y = [10116827, 10163894, 10187543, 10323581, 10491365, 10524086, 10636995, 10645878, 10615626, 10584950, 10626966, 10681476, 10791145, 10751317, 10721781, 10831036, 10965138, 11079790, 11138118, 11096651, 11037075, 10973979, 11137065, 11265907, 11346917, 11495766, 11586631, 11580196, 11558693, 11654717, 11667958, 11695712, 11709483, 11585603, 11598230, 11800895, 11863928, 11919073, 11903846, 11837325, 11886452, 12054516, 12161949, 12168013, 12080796, 12239594, 12448268, 12516711, 12507598, 12595635, 12766974, 12909790, 12820504, 12978116, 13159507, 13392395, 13509894, 13577981, 13545477, 13467229, 13467934, 13505352, 13442570, 13280105, 13256238, 13309510, 13418196, 13534364, 13585289, 13542671, 13568873, 13710986, 13821780, 13845947, 13802424, 13844101, 13907032, 14058926, 14202952, 14098982, 14110201, 14179164, 14225784, 14187786, 14199562]
17496A4199562J76994M6364m5641N1707J21609K40882k1483J04856J00084O1145
17486A5036079J40189J09207Q401L3427L3403R4986J64299J88302K31445K38647
17476A6278385K31180K09437J0967j16782j16148j61978j56017k13365L3442R9474
17466A6098595M4790m4900J2910J67562K588o4540O1661K00504N2697j15167m2858
17455A6373842J51552Q4522N3401L5136l269J0695J49472p1924r7090J0937O8260
17444A6765534m805J59923K0513N463J74866J13011O4144L1348K4310Q4875m407
17433A7434775Q0480J60451J64860N0875J47594J48059Q7214J04304N8211j4345
17423A8422478k2209q2394o5485p946N401k2515j1403l0743O8155n5149m7805
$$ y = [14199562, 14376556, 14422920, 14377279, 14428986, 14550595, 14791477, 14769994, 14874850, 14974934, 15036079, 15176268, 15285475, 15293876, 15327303, 15360706, 15455692, 15619991, 15808293, 16039738, 16278385, 16509565, 16719002, 16729969, 16613187, 16497039, 16335061, 16179044, 15965679, 15999121, 16098595, 16143385, 16098485, 16111395, 16278957, 16281545, 16217005, 16278666, 16479170, 16531867, 16416700, 16373842, 16525394, 16609916, 16663317, 16698453, 16695184, 16705879, 16855351, 16783427, 16686337, 16697274, 16765534, 16760729, 16920652, 16941165, 16946628, 17121494, 17234505, 17298649, 17329997, 17354307, 17439182, 17434775, 17515255, 17675706, 17840566, 17891441, 18039035, 18187094, 18274308, 18378612, 18436823, 18422478, 18400269, 18317875, 18252390, 18244444, 18249845, 18227330, 18215927, 18185184, 18253339, 18198190, 18150385]
17412A8150385P8120J58740N5610L5661N6723M3266K6079l2241Q1909J34848N970
17401A8795070J00557J60420Q1790l3519j57014r3797K4899J4313K6527O1015
17391A8980261J11402K35682J6338j2167J3226J91529N6670q2397N7434P9499
17381A9647477p1780n3884J32974J14125l1426j02690J16415K5816J5524k1246
17371A9771305J73949O6927J3168R864o0685j311n5731M5845M3908q088l4259
17360A9964892M5498M3206r640j8451R2831P0407k4665l107K7218m0675O4426
17349B0211940J6054o8406L0706L4163P4548N820K9816N3397N6266M4889m0592
17338B0448601k7720m9969L8364n6371M6583Q2891k7289q1103p5898j6647L8652
$$ y = [18150385, 18228505, 18387245, 18442855, 18478516, 18535239, 18578505, 18604584, 18572343, 18654252, 18789100, 18795070, 18895627, 19056047, 19137837, 19104318, 18947304, 18853507, 18878406, 18892719, 18919246, 18980261, 19091663, 19327345, 19343683, 19331516, 19344742, 19536271, 19592941, 19510544, 19567978, 19647477, 19575697, 19521813, 19654787, 19768912, 19737486, 19634796, 19751211, 19777027, 19792551, 19771305, 19945254, 20012181, 20025349, 20035213, 19974528, 19973217, 19917486, 19963331, 20007239, 19999151, 19964892, 20010390, 20053596, 20043956, 20025505, 20118336, 20188743, 20164078, 20160971, 20188189, 20147514, 20211940, 20227994, 20159588, 20190294, 20224457, 20299005, 20304825, 20334641, 20388038, 20444304, 20489193, 20448601, 20420881, 20370912, 20409276, 20352905, 20399488, 20482379, 20455090, 20373987, 20298089, 20281442, 20320094]
17327B0320094R6976O5179m1368l1602p3020j66944R5833j6009q9390j046o9012
17316B0089691n3211l8738n204K5348J28409J16047o5410K2581o1431r396M3047
17305B0191733j51815q5607m2954J57941J76433L3563j16750l8486m8667j07056
17295A9968335J715P1696r1148l81m8514j2648j3616l1929K0313k9255j08476
17284A9726092l4983L996j85227n3529O2069j51402l7931K4909M386P4252r9660
17273A9332972j00220j02541N6227j0764o5037k20922j02932O3384K5928M4148
17263A8920243N8099j33400j36621k3519P9357m1456m6477O1851J12833k0013
17253A8830897j39616r9744p1879j20153q5093j12891j58586l5997J27972N7425
$$ y = [20320094, 20417070, 20482249, 20440881, 20409279, 20336259, 20169315, 20265148, 20249139, 20159749, 20158703, 20089691, 20036480, 19997742, 19992538, 20017886, 20146295, 20262342, 20196932, 20219513, 20158082, 20148686, 20191733, 20039918, 19954311, 19911357, 20069298, 20245731, 20279294, 20162544, 20124058, 20075391, 19968335, 19970050, 20041746, 19950598, 19950217, 19901703, 19889055, 19875439, 19843510, 19863823, 19834568, 19726092, 19691109, 19695105, 19509878, 19456349, 19518418, 19367016, 19329085, 19353994, 19358380, 19432632, 19332972, 19232752, 19130211, 19186438, 19175674, 19110637, 18889715, 18786783, 18850167, 18876095, 18920243, 18978342, 18844942, 18708321, 18684802, 18764159, 18722703, 18676226, 18738077, 18850910, 18830897, 18691281, 18591537, 18519658, 18399505, 18314412, 18201521, 18042935, 18006938, 18134910, 18192335]
17243A8192335J31155J0577j93621j09545j7892p5317j95928n9971q1207o4028
17233A7536558r6147J01838K3562j36687k25036j82103n1086K4607J09035J2429
17223A7116970j14713k01829j31486m1045q8883R9215k8620m6285j35461J9338
17213A6447201L6741J8164q2897k5936J8302q6048j90156k8658L0727J02026m0306
17202A6199160n0046k5805r5894k03150j37614j0371j55000r3744M7013R4583
17192A5569132j34753j53966o0538l6941r5876j25935o7849J64035j4743m6230
17182A4996336n0969k05297r8266K0180L5324m7574j39894k9240R7784p060q4944
17171A4486380j40560j82833k1781q5581o5891J6132j6511p4259k1767k9722j02415
$$ y = [18192335, 18323490, 18334067, 18140446, 18030901, 18013009, 17937692, 17741764, 17681793, 17600586, 17536558, 17440411, 17542249, 17565811, 17429124, 17204088, 17021985, 16970899, 16995506, 17104541, 17116970, 17002257, 16800428, 16668942, 16627897, 16539014, 16638229, 16609609, 16563324, 16427863, 16447201, 16483942, 16502106, 16419209, 16393273, 16411575, 16325527, 16135371, 16106713, 16137440, 16239466, 16199160, 16149114, 16123309, 16027415, 15824265, 15686651, 15676280, 15521280, 15427536, 15474549, 15569132, 15434379, 15280413, 15219875, 15182934, 15087058, 14961123, 14893274, 15057309, 15042566, 14996336, 14945367, 14740070, 14641804, 14661984, 14697308, 14649734, 14509840, 14480600, 14578384, 14571324, 14486380, 14345820, 14162987, 14141206, 14055625, 13989734, 14005866, 13989355, 13915096, 13893329, 13863607, 13761192]
17160A3761192j8872J8531o7185j53312j02373k00583q1193J31678J44660O671
17150A3439214k05457j48983j39522k8503L2178N7445j27727r5114j9826M9435
17140A2813140j28451j40664n6847q0716J77881K0124k50489j28982l5147k24312
17130A1965537o916J76485k044j85612k14335j4954K7956l8402k4588Q0287K256
17119A1765670m3698j13612j11878Q4331m5804q5402j25021q5999N7745K4320
17109A1320652n8810p7550j2310L1001L7860k1710p7371l8010J9174L7536L747
17098A1164209j05379q9065j22438J46J8454l5587K6329n8547j55241o0098J134
17087A0583917j122O1334N0705m5491k32084j64429j04796p1007p5580K7661J00909
$$ y = [13761192, 13742320, 13760851, 13693666, 13540354, 13437981, 13237398, 13156205, 13287883, 13432543, 13439214, 13233757, 13084774, 12945252, 12916749, 12948927, 13006372, 12878645, 12783531, 12763705, 12813140, 12684689, 12544025, 12487178, 12406462, 12584343, 12604467, 12353978, 12224996, 12189849, 11965537, 11958621, 12135106, 12133062, 11947450, 11733115, 11718161, 11746117, 11707715, 11683127, 11763414, 11765670, 11721972, 11608360, 11496482, 11580813, 11535009, 11449607, 11324586, 11238587, 11296332, 11320652, 11261842, 11184292, 11171982, 11202983, 11240843, 11219133, 11141762, 11103752, 11122926, 11160462, 11164209, 11058830, 10969765, 10847327, 10847473, 10865927, 10830340, 10856669, 10798122, 10642881, 10582783, 10583917, 10582795, 10644129, 10694834, 10649343, 10417259, 10252830, 10148034, 10077027, 10001447, 10029108, 10130017]
17076A0130017l7889q8905M3799J16838J67001J8803j61177p2073j06271M5786
17066A0055929p6794j7607K9583M7927j42345l7832J58817L8808j38195l2004
17056I886287O9088R7736R4495j5643p1205j38510N187O2302P8835P3501j20289
17045A0021784L2824l8077k0824M9930J07726N2577J74636L74753L03268N8811
17035A1117408j11375n5150O9582J15362J3451J30529L20281K46018P7100j26114
17025A1797092N315O008J07123J97926K73137K50202J58278K89297M32161O86378
17015A4202917P61190P87254J160024J518205J981449K794660L658627N038253
17007C1902579P454893J1281720J7588079K7539504M1597058N2035519L1926625
$$ y = [10130017, 10092128, 10003223, 10047022, 10163860, 10330861, 10349664, 10188487, 10116414, 10010143, 10055929, 9979135, 9961528, 9991111, 10039038, 9896693, 9858861, 10017678, 10056486, 9918291, 9886287, 9955375, 10053111, 10147606, 10131963, 10060758, 9922248, 9927435, 9989737, 10068572, 10142073, 10021784, 10054608, 10016531, 9995707, 10045637, 10153363, 10205940, 10380576, 10755329, 11058597, 11117408, 11006033, 10950883, 11020465, 11135827, 11149278, 11279807, 11600088, 11846106, 11923206, 11797092, 11802407, 11808415, 11915538, 12113464, 12386601, 12636803, 12795081, 13084378, 13516539, 14202917, 14964107, 15751361, 16911385, 18429590, 20411039, 23205699, 26864326, 31902579, 39357472, 50639192, 68227271, 95766775, 137363833, 189399352, 221325977]
17000B21325977k4015436m7069455l7440160k6253404j7812891j1724247p874094
16993D9136290n686175m033948k847342k158577j348307n86225n99490j365053
16985C0511173j983629k135498j968682j696038j050166n50397k06602k96320
16977B0623841n14165m77046m06025n39198m38784j77650j25144L5122L07301
16968A8288252O39537R64873J085663J160826J445052J938583K653380L778961
16960C1955127N449304P594417J0761687J6053337K4858584L8728493N9571046
16953A94971995Q2715912Q0827766K5681515m5212760p9274172o6651549m6643013
16946A46415694l1603959k1271636j4418230j0275029p447372n480457l914551
$$ y = [221325977, 197310541, 150241086, 112800926, 86547522, 68734631, 57010384, 49136290, 43450115, 39416167, 36568825, 34410248, 33061941, 32475716, 31876226, 30511173, 28527544, 26392046, 24423364, 22727326, 21677160, 21126763, 20920161, 20623841, 20109676, 19632630, 19226605, 18687407, 18248623, 18070973, 17945829, 17980951, 18288252, 18927789, 19892662, 20978325, 22139151, 23584203, 25522786, 28176166, 31955127, 37404431, 44998848, 55760535, 71813872, 96672456, 135400949, 194971995, 277687907, 358515673, 384197188, 338984428, 259710256, 193058707, 146415694, 114811735, 93540099, 79121869, 68846840, 61399468, 55919011, 52004460]
16939E2004460k669185j836193k170537l025859l800328l684589l384136l015311
16931B8418322k427922j796699j442195j044478j064196q06386o24005r33277
16923A8279164j253875j069721o14507k47747n565Q5694K92322L85704J84027
16914A6035496R0613M93669R58704J628773K408670L459705N156951P925756J2477417
16905E0635754J9711325L1015049M4488733M4629871L453842m0540027m0490283
16898A12904264k8923582j9784093j3277916q786253o058885m400719l142141
16891B8530675k254757j630564j318115r81444j123576j638488j856656j805897
16883A5921178j623303j392621j132615q98227p66101m48254k44928l28982m00276
$$ y = [52004460, 49335275, 47499082, 45328545, 42302686, 38502358, 34817769, 31433633, 28418322, 25990400, 24193701, 22751506, 21707028, 20642832, 19836446, 19212441, 18279164, 17025289, 15955568, 15341061, 15093314, 15087749, 15173443, 15465765, 15851469, 16035496, 16126109, 16619778, 17578482, 19207255, 21615925, 25075630, 30232581, 38158337, 50635754, 70347079, 101362128, 145850861, 190480732, 193934574, 153394547, 112904264, 83980682, 64196589, 50918673, 42132420, 36073535, 31672816, 28530675, 26275918, 24645354, 23327239, 22345795, 21222219, 19583731, 17727075, 15921178, 14297875, 12905254, 11772639, 10874412, 10108311, 9660057, 9415129, 9086147, 8685871]
16874H685871m76868n33171l16033n25767m26799j53853O666M979j28775l50205
16864E786045l95455l61776k05039k67780l44406k24230j40133o565r9260j73598
16854C567803r6371k0781k146r7902j63971J4693p2921p4216q4591L0741k2465
16843B977873q1887o9567j01785l97L5702m900j12000p4284O2854J6271j12164
16832B535716m7196M2213l6378q206O6714J61196J90455Q1814r6650j14420j73011
16821B602247j22767N5447m6243k32288k6157K18205J32865l7116q3232l6122
16811B424839l3830j75964n2352j0472r381M099K6887r6961o6032n8238P9197
16800B031792J01608M4179N5426m8441Q2334M8387p7336k7662J3361J2909r2847
$$ y = [8685871, 8209003, 7675832, 7359799, 6834032, 6407233, 6253380, 6260046, 6265025, 6136250, 5786045, 5390590, 5028814, 4823775, 4555995, 4211589, 3987359, 3847226, 3840661, 3741401, 3567803, 3471432, 3450651, 3448505, 3350603, 3186632, 3201325, 3128404, 3054188, 2969597, 3000338, 2977873, 2895986, 2826419, 2724634, 2724237, 2759939, 2755039, 2643039, 2568755, 2631609, 2647880, 2535716, 2488520, 2530733, 2494355, 2486149, 2552863, 2714059, 2904514, 2986328, 2889678, 2775258, 2602247, 2479480, 2534927, 2488684, 2256396, 2230239, 2448444, 2581309, 2544193, 2460961, 2424839, 2391009, 2215045, 2162693, 2152221, 2142840, 2146939, 2173826, 2076865, 2010833, 1952595, 2031792, 2133400, 2177579, 2233005, 2184564, 2266898, 2315285, 2237949, 2210287, 2223648, 2236557, 2143710]
16789B143710L1366L481j02496N6198J04486n9078j4982j19190q4419R8850k8872
16778B029054l1132J01699J89538N2608j25446m778m1196R20m1416j66837p8909
16767A884105N6442O5818M9237k7143j25218k6556K3600l097O0000p4596n6375
16756A826217o8082l4910J1501N0774P154n8543N9726n4321o5021K4915J23162
16745A822572L3726j2824L0668j503o8753l3585q8340o3110j04898m0172N0214
16734A523995K9774q5265J9987L0992J16866P1464o7937k10096j3607O3838M6846
16723A526857J13976J0757o4591K1498j525R5938o7598p8617R3874p5856o7460
16712A507253M463m6857L7729J7712m0497m1064M1128J13432R3272j3365j81158
$$ y = [2143710, 2175076, 2178557, 2076061, 2132259, 2236745, 2177667, 2162685, 2043495, 1959076, 2057926, 2029054, 1997922, 2099621, 2289159, 2341767, 2216321, 2211543, 2170347, 2171267, 2129851, 1963014, 1884105, 1940547, 2006365, 2055602, 2028459, 1903241, 1876685, 1900285, 1897188, 1957188, 1882592, 1826217, 1758135, 1723225, 1734726, 1785500, 1792654, 1734111, 1793837, 1739516, 1674495, 1699410, 1822572, 1856298, 1843474, 1874142, 1872639, 1803886, 1770301, 1681961, 1618851, 1513953, 1473781, 1523995, 1553769, 1468504, 1488491, 1519483, 1636349, 1707813, 1639876, 1429780, 1416173, 1480011, 1526857, 1640833, 1651590, 1586999, 1608497, 1606972, 1702910, 1635312, 1556695, 1650569, 1574713, 1507253, 1511716, 1464859, 1502588, 1520300, 1479803, 1438739, 1479867, 1593299, 1686571, 1673206, 1492048]
16701A492048j20770Q159K54l1967j48642J68361R0343l1384j779Q7506L4914
16690A547043M1213R5220q9917j20857r8942N142k6102r8689k7247o3791M4707
16679A207780J56534J07189p4813r7062o6353N9238r800L7692J20079p6511j29987
16668A233986J59873K17265j49609j30609l6891p6936N2825J9517l1191p1860
16658A186370N1328N4188K7135M2750k55380p8499L449k2072j8054J58651L7501
16647A187367Q5269l7559O0488q2795p0655r177J24891R1450o3552p6733n8772
16636A150222m9873k5132J23748m0189o0656m1890q6295Q3158P0693j10613O0461
16625A073634J6722l1427N307L0646j35080N8212L3473k2496K8802J60407P0337
$$ y = [1492048, 1371278, 1379437, 1379691, 1347724, 1199082, 1367443, 1457786, 1426402, 1424623, 1512129, 1547043, 1588256, 1683476, 1593559, 1472702, 1373760, 1378902, 1352800, 1254111, 1226864, 1163073, 1207780, 1364314, 1471503, 1396690, 1299628, 1233275, 1292513, 1282713, 1320405, 1440484, 1363973, 1233986, 1393859, 1611124, 1461515, 1330906, 1294015, 1217079, 1269904, 1289421, 1258230, 1186370, 1237698, 1291886, 1319021, 1361771, 1106391, 1027892, 1031341, 1009269, 991215, 1149866, 1187367, 1272636, 1235077, 1295565, 1212770, 1142115, 1132938, 1257829, 1349279, 1285727, 1208994, 1150222, 1100349, 1075217, 1198965, 1158776, 1098120, 1056230, 969935, 1053093, 1123786, 1013173, 1073634, 1090356, 1058929, 1064236, 1094882, 959802, 1018014, 1051487, 1028991, 1057793, 1218200, 1288537]
16614A288537j08109j05166K7081M9209j23569n389p0323p5670J71617N5656k3063
16603A080811p6514j11039J78107m8027o5642j8859L1172m7462j02495p8588Q7459
16592H28923K29145J16496n6778q3350L8093J00183j62955j47310K2819K08635
16582A093901n4617j48003N0792P3681o8950n7618k3678P4417O7258L6769j18965
16571I24987j13865l7843K7963N7849R7701k9045k5868M1820J09338j9245j0341
16560A023451r6221q1448j4266L6280j7215p6450J00214J70929J05409q6640l02604
16549G61439o4363J29364Q657J18823p2797j47345q8167N8597q1179N7577k9358
16538F51248j78953J4194K12006J60636J32847p7024k3632P3433M3473j4625k28993
$$ y = [1288537, 1180428, 1075262, 1102343, 1151552, 1027983, 1022594, 952271, 876601, 1048218, 1103874, 1080811, 1004297, 893258, 1071365, 1023338, 957696, 938837, 970009, 922547, 820052, 741464, 828923, 1058068, 1174564, 1117786, 1034436, 1072529, 1172712, 1009757, 862447, 885266, 1093901, 1039284, 891281, 942073, 1015754, 946804, 889186, 865508, 939925, 1007183, 1043952, 924987, 811122, 773279, 801242, 859091, 956792, 927747, 901879, 943699, 1053037, 1033792, 1023451, 927230, 845782, 831516, 867796, 850581, 774131, 874345, 1045274, 1150683, 1064043, 761439, 697076, 826440, 835097, 953920, 881123, 733778, 645611, 704208, 623029, 680606, 651248, 472295, 486489, 698495, 859131, 991978, 914954, 891322, 964755, 1008228, 993603, 764610]
16527G64610N5737L03648P7221m4613j03606j49268N4665j0511R334j7715n7059
16516H82443m0454k6167L0595J26425j24957j18182k891n3390N6989J3950k2459
16505G21902j8100J27455J09870j55792j56445L123J13592J31068k7557j9703
16495H29413L713l3406j02078k656p0411L2409R7986l8123m7493j00073l4534
16484E34747Q3899o1811M7655P1180K2127J13086M1916Q7936J6640N0529M5778
16473A053682Q646P3028J27798K8717o61j62756l135n8670j06841o8032n9778
16462H31998n5981k8845r0476J75024J99797m4533K3066l5437j23233n3772O1112
16451H58720n4422q4094j53160Q2141Q3469r990K0339j6406o5823j03378m3343
$$ y = [764610, 820347, 1123995, 1201216, 1156603, 1052997, 903729, 958394, 947883, 957217, 939502, 882443, 841989, 815822, 846417, 972842, 847885, 729703, 726812, 673422, 730411, 744361, 721902, 703802, 831257, 941127, 785335, 628890, 632013, 745605, 876673, 849116, 829413, 833126, 799720, 697642, 694986, 624575, 656984, 754970, 716847, 669354, 569281, 534747, 618646, 556835, 604490, 675670, 697797, 810883, 852799, 940735, 957375, 1007904, 1053682, 1062328, 1135356, 1263154, 1291871, 1291210, 1128454, 1125319, 1066649, 959808, 891776, 831998, 776017, 747172, 656696, 831720, 1031517, 986984, 1010050, 974613, 851380, 797608, 858720, 804298, 720204, 567044, 649185, 732654, 722664, 743003, 726597, 660774, 557396, 514053]
16440E14053m5114p2609O7423N6207O0917P5195l0439p6598j08656Q3036J48549
16429F71964K07018J50242N1347J85549K86306J79532J89890R1926O4488k17299
16419A860963k29604k70392k00701m0648R8442q6441k20777k61289q3457Q013
16409E74109N9912O7441J03904J89226j85887j21864l3012M2865O1880P523K4497
16398G90594p0718N3349P9234r1702r2430M862L7890r7609j31388j9299J8443
16387D81226j6750Q2917J4476k0715Q9331p740L0352k2841L6993j0014K31589
16376H88824J93902Q8707Q8769l0079R600l3704q7738n0450l2227j73000r2234
16365G70370J8185j3334j92807n0411O9691J5600l8887j50857K0037k4216n4351
$$ y = [514053, 468939, 396330, 463753, 519960, 580877, 656072, 625633, 549035, 440379, 523415, 671964, 878982, 1029224, 1080571, 1266120, 1552426, 1731958, 1921848, 2013774, 2078262, 1860963, 1631359, 1360967, 1160266, 1119618, 1218060, 1131619, 910842, 649553, 566096, 574109, 634021, 701462, 805366, 994592, 808705, 686841, 653829, 696694, 758574, 766097, 790594, 719876, 773225, 852459, 760757, 668327, 673189, 711079, 613470, 482082, 462783, 481226, 464476, 547393, 561869, 541154, 630485, 622745, 653097, 630256, 667249, 657235, 888824, 1082726, 1171433, 1260202, 1230123, 1239723, 1206019, 1118281, 1067831, 1035604, 862604, 770370, 788555, 775221, 582414, 532003, 601694, 617294, 578407, 427550, 447587, 423371, 369020]
16354C69020J1876k930N735J25332L8426J940o7294m6741k4126M4496N2647r2461
16342D15920L9074j5059j4652j58263L0563N0828p373M7730R8810o9398l5981
16331C82199n1345n0369M1890o9952j41134J4550J21962p985L8590K1268J9574
16320C19248j03895K524m2239o9429R0092K24097M9372k6355j55348q5417J8575
16309B21225J9611N5593j0045j8893J10139J38154n0180j05678n4413L7872m6527
16298B96858n8045j1213O4085R9411j03616o9627L0135j10945L0262J09138O7544
16287C43987Q888j05042N2136P8121o626P6665J7072N9370L657j34728r1190k0249
16275B82061o750Q2982J22646j48785k10400N5277L4581J23608O5465q3458k1466
$$ y = [369020, 380896, 377966, 383701, 509033, 547459, 549399, 482105, 435364, 411238, 455734, 508381, 415920, 454994, 439935, 425283, 267020, 297583, 348411, 341038, 388768, 487578, 418180, 382199, 330854, 280485, 322375, 252423, 111289, 125839, 247801, 239816, 278406, 299674, 319248, 215353, 217877, 175638, 106209, 196301, 420398, 469770, 443415, 288067, 202650, 221225, 240836, 296429, 286384, 267491, 377630, 515784, 465604, 359926, 305513, 343385, 296858, 238813, 227600, 291685, 391096, 287480, 217853, 247988, 137043, 167305, 276443, 343987, 352875, 247833, 299969, 378090, 371464, 448129, 465201, 524571, 528228, 393500, 302310, 282061, 275311, 358293, 480939, 332154, 121754, 177031, 211612, 335220, 400685, 317227, 295761]
16264B95761R4956m8868l3429O9758K0688j1024p2791J6790o8506K5555N7397
16253C46287r0683k0392O980o2315L2385Q3506J12765Q1308o1051o4578j15069
16242B49143q2242p2032Q6395J42215J12976r20n9868m3278q9518K3340L3054
16231B99265J2172N3091L9835L8613o3678q6381p7817n9696n6627m0417p0253
16220a1893l3611P7860N9967K1456K2710m3860O0341J86300m0447m6109K9282
16209B81996r5332j31635J84693j7855m3125J6473j32734L83N6441l4102R101
16198I4304J81221P8304M8163N5508l8578j13813l7241P964P4725J3059K0324
16187C83940j24169j23923m7120m6915k2502n5943j02824J33802J01120P7782
$$ y = [295761, 390717, 341849, 308420, 378178, 398866, 387842, 315051, 331841, 263335, 288890, 346287, 255604, 235212, 242192, 179877, 212262, 295768, 408533, 489841, 428790, 364212, 249143, 166901, 94869, 181264, 323479, 436455, 435535, 375667, 332389, 242871, 266211, 299265, 311437, 364528, 404363, 442976, 379298, 292917, 215100, 155404, 98777, 58360, -11893, -45504, 32356, 92323, 113779, 136489, 92629, 152970, 339270, 298823, 252714, 281996, 186664, 55029, 239722, 221867, 178742, 195215, 62481, 62864, 119305, 85203, 94304, 275525, 353829, 401992, 457500, 418922, 305109, 267868, 275832, 350557, 363616, 383940, 259771, 135848, 88728, 41813, 19311, -36632, -139456, -5654, 95466, 173248]
16177A73248o6704q0963R965k2628J26785J06646j8544o1185q3725K808l751n1849
16165C0103Q5256j3711k2492R4445N4159L4641k3224j27216q429l4148M0578J17972
16153B27934J06706q5349j19547p4309p098j457P9602Q7718p8945q8140J10681
16142A57796J71513J08422j54687k44307O509J12059J10060r6929j45376K8556
16132E3616m7968K8716J3086j13828J5913J14562M7072o115k7414R3912J48094
16121C19646j5439m4044m8864r0674o5088l6697j7740K4463Q455m9537J6196J077
16109A754O8690N9779l6664m9052r2941q9239J1845J07386N6043m5503j5112p3140
16097i6154N039K7627M8976M3273N717K5441m4056N2762K432k2086R2263J4587
$$ y = [173248, 106544, 25581, 35546, 12918, 139703, 246349, 227805, 166620, 82895, 85703, 81952, 30103, 115359, 101648, 79156, 173601, 227760, 262401, 239177, 111961, 103532, 69384, 109962, 227934, 334640, 249291, 129744, 55435, 48337, 46880, 126482, 214200, 135255, 47115, 157796, 329309, 437731, 283044, 38737, 45246, 157305, 267365, 170436, 25060, 53616, 5648, 34364, 47450, -66378, -50465, 64097, 111169, 105054, 77640, 171552, 319646, 304207, 260163, 211299, 120625, 55537, 18840, 1100, 25563, 34018, -15519, 677, 1754, 70444, 130223, 93559, 44507, -48434, -137673, -125828, -18442, 37601, -7902, -23014, -96154, -91115, -63488, -14512, 28761, 34478, 59919, 15863, 68625, 71057, 48971, 141234, 155821]
16085A55821J8336J1215K4651K9467j49119j04666J642J35408k1157j86289J16933
16074C2242J43907j47256J241J12437O2585j65953m8752m2455m604O6589J21653
16063A31634j19238p5461j05929J21439K07990k4033p2081M1766j4488o5238j08183
16052h1822o9224J00838J8022P8462N2824m0769k3531N4297l0308P5184j19434
16041A4539j10957j8880M7211N2011N7306Q952Q358o4453q9441j09246J8084R3914
16029i2602J41186J79934o4396m1616K3526j9672k6894O0723p0057j15224j20148
16018a45240O328O4769O4081J77234R0393j6425o3365K7969n1261K2768L4497
16007B11748j11839m7930K1137J23709J43943q4654j22043j15594o8403P8077
$$ y = [155821, 174157, 185372, 210023, 239490, 90371, -14295, -12653, 122755, 101598, -84691, 32242, 176149, 28893, 30134, 142571, 205156, 39203, -9549, -52004, -56608, 9981, 131634, 12396, -63065, -168994, -47555, 160435, 136402, 64321, 106087, 91599, 26361, -81822, -151046, -50208, -32186, 46276, 99100, 58331, 34800, 89097, 58789, 133973, 14539, -96418, -115298, -68087, -16076, 41230, 50182, 58540, -5913, -95354, -204600, -186516, -92602, 48584, 228518, 164122, 122506, 146032, 126360, 99466, 160189, 90132, -25092, -145240, -138912, -74143, -10062, 167172, 257565, 241140, 177775, 205744, 154483, 177251, 211748, 99909, 51979, 73116, 196825, 340768, 256114, 134071, 18477, -49926, 28151]
15997B8151O872M5095J56472O3966j24591J9163l5316q1906j54411J22689J50600
15986A96784j23212k5777k1444j8605M1704P9047L318J31631K4434j11982m6636
15975A29262N4561M8290j03497J7968J96811J11780j47445n0923r8375j53235
15965E197J0284J81368j3016n2949p5770Q6334o9844l287k0786k0125Q218L4003
15953F9627P614j9497M6177J14552q6993o7415J30484Q9729o3240r4746K8027
15942A54319Q238n106J309n3374m8498o4736O1779n6050j27195j36548J24548
15931a41314J54543Q4726l2109j18211k0554J04951j34428m8734J40060P9731
15921F8661J44673l4103m446o994p8494q7958L3942Q4259j93935k50926j2809
$$ y = [28151, 35023, 80118, 236590, 300556, 175965, 195128, 159812, 77906, -76505, 46184, 196784, 73572, 47795, 26351, 7746, 49450, 128497, 131815, 263446, 287880, 175898, 129262, 183823, 232113, 128616, 146584, 343395, 455175, 307730, 256807, 158432, 5197, 15481, 196849, 183833, 130884, 55114, 141448, 71604, 68317, 47531, 27406, 35624, 69627, 77241, 57744, 103921, 218473, 131480, 64065, 194549, 284278, 221038, 126292, 154319, 162557, 157451, 158760, 105386, 56888, -7848, 53931, -2119, -129314, -265862, -141314, 13229, 97955, 65846, -52365, -72919, 32032, -102396, -151130, -11070, 68661, 213334, 179231, 174785, 167791, 89297, 1339, 35281, 119540, -74395, -325321, -338130]
15910c38130J42463n3936O8962O6436j658R0391P5340R1136m0519o3664L6425
15899G3246j14094q7732o7546N844J92193l8885j83194J38501O7896k2935j29688
15888a66394o0302J04328M9692J29706P2002o6224M8097m4236M8653j0796j41691
15877c7165k19014q2738J56948J56718J25671n2314p6646q783l8093J32861p984
15866D9461p3338k5113Q6085J61723P9285o7844l4191m6714K7548n7518j16958
15855a7574l392N2362j1705q1834j07084L7219J66674J59941l5560J8761K9808
15844B07616K0553j55047j18396J8796J2778r1010j07677K2536Q6357l8760N8423
15833h3831J9717j3887L573o6076k834n2091L8137J45236q2499R35J32670R5731
$$ y = [-338130, -195667, -249603, -180641, -114205, -115863, -25472, 49868, 141004, 100485, 36821, 73246, -40848, -128580, -196126, -190282, 1911, -36974, -220168, -81667, -13771, -36706, -166394, -226696, -122368, -72676, 57030, 129032, 62808, 110905, 66669, 115322, 104526, -37165, -256179, -338917, -181969, -25251, 100420, 48106, -28540, -37323, -75416, 57445, 49461, -23877, -48990, 37095, 198818, 278103, 210259, 176068, 129354, 156902, 99384, -17574, -20966, 31396, 19691, -62143, -169227, -132008, 34666, 194607, 159047, 177808, 207616, 228169, 73122, -45274, -26478, -13700, -104710, -212387, -189851, -103494, -142254, -83831, -64114, -78001, -74428, -140504, -143338, -195429, -157292, -12056, -94555, -93620, 39050, 134781]
15821A34781r46L1753j45309l9155R2381K26028m2003j92153j73632r3003L4953
15810a66305J9170j1744o8781n700J81735N7039k506K8835r0772J816q125O6593
15798A255j17416O0294L2668n0038R6122M2013q1471j46121p5273Q6783l172P3415
15786h0941q2564J20647J55977O2757k0724m8494k8312j33314p0553q899L0518
15775a03902O641n5737O8532l2019j84238P2733K4958N7978J2885j53202o3032
15764c48403M7424J00470N191Q2328o0582q6015j5997K5626K2942Q2223j1039
15753a55832N9348K9151K8417L6062m5493k9994Q8886L5730N1511o0967o0691
15742b3872M9386m324O3424k7080q4237M396l7365o9084K1642J14092k7576r5614
$$ y = [134781, 133835, 165588, 20279, -18876, 73505, 299533, 257530, 65377, -108255, -201258, -166305, -147135, -158879, -227660, -233360, -51625, 5414, 2908, 31743, -59029, -57213, -65338, 1255, -116161, -55867, -23199, -73237, 22885, 64898, -16573, -162694, -237967, -151184, -154356, -80941, -163505, -42858, 113119, 175876, 155152, 106658, 78346, -54968, -125521, -134420, -103902, -97261, -152998, -84466, -116485, -300723, -227990, -203032, -145054, -132169, -285371, -348403, -300979, -200509, -195318, -112990, -173572, -259587, -275584, -249958, -227016, -144793, -155832, -96484, -67333, -38916, -2854, -48347, -78341, 10545, 46275, 97786, 36819, -23872, 25514, 21190, 84614, 57534, -26703, -22307, -59672, -128756, -107114, 6978, -20598, -116212]
15730a16212J39562q7018n8633l7086J0699J68240K1087l8161o1538O5221q0472
15719g4311n5217M0538N8398l6869J02441J51042J5565k3114J02566j9623j49699
15708A11717k47048n2448L0210k4429M8837N8216j7078k086j8456J1974r1972
15697a92563l0272R3445l8354q0063J31619o4047j6586J50061J16190K8609m1525
15686E6514j66025L1455J79865N5677r1963j03971l6384j0549l1l2829R8952p693
15674b6982k13416j06061p398K7801J26217R4867O5631P2549N9422o0340M9000
15663H1290r1329j05431J13347P1456o7839k427o9005j6899J5486O0238J5435
15652D322Q614j4863J6783P8899n8702q8796q7358K0858p0085l6826n487P6495
$$ y = [-116212, 23350, -63668, -122301, -159387, -148688, 19552, 40639, 2478, -59060, 6161, -74311, -129528, -88990, -30592, -67461, 34980, 186022, 201587, 178473, 281039, 261416, 111717, -135331, -187779, -157569, -181998, -133161, -74945, -92023, -94109, -112565, -100591, -192563, -222835, -129390, -167744, -247807, -116188, -180235, -196821, -46760, 69430, 98039, 56514, -109511, -78056, 101809, 157486, 65523, -38448, -74832, -85381, -85412, -118241, -19289, -26982, -240398, -346459, -353857, -326056, -199839, -104972, -39341, 33208, 92630, 32290, 81290, -10039, -115470, -2123, 69333, 1494, -933, -69938, -86837, -71351, -11113, 4322, 12936, -1927, 14856, 93755, 35053, -53743, -141101, -120243, -190328, -227154, -232641, -156146]
15640a56146P4702J57859J4748j87529m3847O5189j6646O5621R3412Q1824P7610
15629B26797o6257j8894l0369j6433j03604l9708Q2579R9905j31014j71819j62188
15618c31005J49614K13000J1036J559j7385o0252n0248j82720j32748R5930N8591
15607b44628Q7203J50398j44169m2193J17597Q5929q7306J5235P0106l290l6126
15596c1244j11616j99580o4550J22617N9376N2075N1365L2848r3158p3139R3691
15585a61315R806q763K6938M6258k01461o7238O1003J21254K9190j50339k3989
15574c18656o7249m4477J30969K05387l6704l1010L7501k1254k1947q6660o3744
15563c17844l9618k67J70402J04567n3013J9863M0603J0307J49387o4802j61531
$$ y = [-156146, -81444, 76415, 91163, -96366, -140213, -75024, -91670, -26049, 67363, 149187, 226797, 160540, 141646, 111277, 94844, -8760, -48468, 34111, 134016, 3002, -168817, -331005, -181391, 31609, 42645, 44204, 26819, -33433, -83681, -266401, -399149, -303219, -244628, -157425, -7027, -151196, -193389, -75792, 10137, -77169, -61934, 8172, 4882, -31244, -142860, -342440, -406990, -284373, -224997, -172922, -121557, -88709, -181867, -255006, -161315, -151509, -160272, -133334, -87076, -288537, -355775, -294772, -173518, -144328, -294667, -318656, -385905, -430382, -299413, -94026, -130730, -161740, -124239, -145493, -167440, -254100, -317844, -357462, -357729, -187327, -82760, -135773, -115910, -75307, -65000, 84387, 19585, -141946]
15552a41946J1604m1244O171J01335l7584j26658N9252l829k6093M4480J10746
15541d3766j27420j4560J56585M0229n4877M1135j24958L999J38953q1894J25381
15530E8807R6950L3671m377r7183k01984J5360J11611j05245q3071l9495J57635
15519e7321m9025O093j527k4713j0493L4499J66208J44992N3070j18482k47625
15508a04324r5060P7888J13054j65484k1454R900q152p3840j5594O5264P858J12445
15496i7499M7876p6633m0544P7619O556n764p961K7334O3207J00845j11751j75714
15484a92429J79968K9653j46050l7592L1932k1047m7452J1222m9302K7128K9111
15473a84858q7778P6016m800k6505Q0735n1084o6018q7549Q6359M5367J8278Q0970
$$ y = [-141946, -130342, -171586, -165415, -64080, -101664, -228322, -169070, -172899, -198992, -154512, -43766, -171186, -185746, -29161, 11068, -43809, -2674, -127632, -123633, 15320, -66574, 58807, 155757, 189428, 185051, 87868, -114116, -98756, 12855, -92390, -175461, -214956, -57321, -106346, -100253, -101780, -126493, -136986, -102487, 63721, 208713, 261783, 143301, -104324, -199384, -121496, -8442, -173926, -195380, -185480, -193632, -267472, -283066, -217802, -209944, -97499, -49623, -126256, -166800, -89181, -82625, -88389, -96350, -69016, -5809, 95036, -16715, -192429, -12461, 17192, -128858, -166450, -134518, -155565, -203017, -191795, -241097, -213969, -184858, -272636, -196620, -201420, -227925, -147190, -198274, -264292, -351841, -265482, -220115, -201837, -120867]
15461a20867M2781l2408j1184M510N287M7180N7319L3423q6294j02518L4432Q0994
15449d7345q2249m3356J50698L5478j14816j05170N7761M2127n2460K1840O5391
15438g2101O4995j9571r66J00279r4740o3979O5768l8898m7137j6951l3427J56257
15426d71L1420j03276l4543j0371k7948N521m1812o9829N7823P8886m6013p8715
15414b39328o082p1398K8953J11940Q9266m490o2909j09633p779l2888O5069O7882
15402a71397n872k1184k2204M865j05020J3794J21392L5829N708m1006k3873o738
15390b15706R9400r6100J7276K43035K4321p7273j06405l8570l1617K2583l4126
15379a93182j13406J3307o391L9203J4872Q1826K05901P278q7513j05164j46912
$$ y = [-120867, -78086, -110494, -121678, -117168, -111881, -64701, -7382, 26041, -60253, -162771, -128339, -47345, -129594, -172950, -22252, 13226, -101590, -206760, -148999, -106872, -159332, -137492, -72101, -7106, -26677, -27643, 72636, -22104, -86083, -20315, -59213, -106350, -123301, -156728, -471, 30949, -72327, -106870, -117241, -145189, -139668, -181480, -251309, -193486, -114600, -160613, -239328, -245410, -316808, -287855, -175915, -86649, -91139, -154048, -263681, -271460, -304348, -239279, -171397, -177269, -198453, -220657, -215792, -320812, -307018, -185626, -149797, -144089, -185095, -208968, -215706, -116306, -212406, -195130, 47905, 72226, -5047, -111452, -150022, -181639, -159056, -193182, -306588, -293281, -299672, -260469, -245597, -163771, 42130, 49408, -38105, -143269, -290181]
15368b90181j4284P9432J09994J03435P7987M9816j2480r6500k3511J32897k3287
15357I3318q1507r3175k7974o0831j05128J4370N7200p1026L3184J83025J42498
15346H3954p5979m6828r2101L3257N7552k1133l0762M906j3782j65815k2898M065
15334b85564J97304Q6143r7761j12505N6429n230p1605J6342q7842K7649J06418
15323a70222j13577j82607J11448K19035n8002j38209r761J78351J12976n2108
15313a02676j61164J01538P3828J61695k2246j08416j33341n3520l7380J7869
15303b63813O1500J91160P2941K752m3033m3589j08187j805l4204J02408O4073
15292B03n9566j27187j5274r666j6944L5608o344O6628K44676p0905k5971Q1676
$$ y = [-290181, -304465, -225033, -115039, -11604, 66383, 116199, 103719, 7219, -16292, 116605, 93318, 11811, -81364, -109338, -170169, -275297, -260927, -203727, -274753, -241569, -58544, 83954, 7975, -38853, -130954, -97697, -40145, -61278, -92040, -87134, -100916, -266731, -289629, -285564, -88260, -2117, -99878, -212383, -155954, -161184, -232789, -216447, -304289, -276640, -170222, -283799, -466406, -354958, -135923, -193925, -332134, -341895, -163544, -50568, -102676, -263840, -162302, -88474, 73221, 50975, -57441, -190782, -244302, -281682, -263813, -202313, -11153, 61788, 64540, 21507, -22082, -130269, -132074, -166278, -63870, 203, -59363, -186550, -201824, -211490, -228434, -192826, -199170, -132542, 112134, 41229, 15258, 96934]
15280I6934r281M0762k9119m2592j11232l4644L5251Q8856K9676j06463M8589
15269F737M4124q3994o4233J8183k5154j8329q7775J5347J2057L707j10634n8755
15257c48719Q5194P2244p0074M883o7702K3209O2350J1389M1084Q2457J77778
15246G4093J18299p796n515j9055J24401r7766l05408j9603P1871N9152P3685
15235F6358n5299j47890L0195j32744j05711K2244o047P7206J96812O0076O66
15224E866O4338J681L5240k0414K9391l5207p6467N845J33743Q2349k8720j79953
15212A7692L9618N0734R2283n0164r8392j00764j7008L4569O0858J67764j29710
15201F7480j33447k4673J38020L8252L3552m9049o4281o8998k46163m7571J2227
$$ y = [96934, 87653, 128415, 99296, 56704, -54528, -89172, -53921, 34935, 64611, -41852, 6737, 50861, -33133, -97366, -79183, -104337, -122666, -210441, -195094, -183037, -179330, -289964, -348719, -263525, -191281, -261355, -256472, -324174, -300965, -238615, -227226, -186142, -103685, 74093, 192392, 184596, 179081, 160026, 284427, 186661, -118747, -138350, -66479, -7327, 66358, 11059, -136831, -106636, -239380, -345091, -322847, -328894, -251688, -54876, 5200, 5866, 70204, 71885, 107125, 86711, 116102, 80895, 4428, 10273, 144016, 226365, 197645, 17692, 57310, 108044, 200327, 150163, 51771, -48993, -66001, -31432, 29426, 197190, 67480, -65967, -90640, 47380, 85632, 119184, 70135, 5854, -63144, -309307, -356878, -344651]
15190c44651J11658K9076L1647P0692q76k490j1894L4787J6213l3754q0381q7819
15178b67792K6906l794Q636l0903J42116R3593m3775n0103j20482M613J23428
15167a17557K9384j6504M4663L9476J6715J04218J076K7486K9584q5641l3222
15156C9678K0406L6991r8257J3621L1700j09037p9393j13880L345J12952k4424
15145a66298l7330k358R3149Q443j23811M8157l8178R148K7294m5263Q3155J21712
15133b2180R6496J17500k5066J2722j2193j82196j90036L0497J47648n569q9429
15122a21806P9663j90876L4772L8414K0194J33203L4552j37672m8129N5327n1410
15111a53768j10594n8322p6229J34933J60745Q9848j194p5146R0168m082n0127
$$ y = [-344651, -232993, -203917, -172270, -101578, -102454, -104944, -116838, -82051, -65838, -99592, -179973, -267792, -240886, -244680, -236044, -266947, -124831, -31238, -75013, -125116, -245598, -240985, -117557, -88173, -104677, -60014, -20538, -3823, 100395, 101471, 128957, 158541, 72900, 39678, 60084, 97075, -1182, 12439, 44139, -64898, -144291, -258171, -254826, -141874, -166298, -203628, -205986, -112837, -104394, -228205, -180048, -218226, -209078, -181784, -227047, -143892, -22180, 74316, 191816, 166750, 179472, 167279, -14917, -204953, -174456, -26808, -32377, -121806, -42143, -233019, -198247, -159833, -139639, -6436, 28116, -109556, -157685, -102358, -153768, -264362, -322684, -398913, -263980, -103235, -13387, -14581, -89727, 441, -3641, -53768]
15100e3768O101m7363P8925K2596n0623J5906O9513L0690j15606o0584j0641N649
15088a09205L1071J07060O2058Q640j7622j44900q7389m4590o874R9690l0993
15077a33054o1154m5168O0395k8065j16300L2134l8006N6979J16343P9923m7385
15066a23358P2220O9619l1494k5081P8877n9025j02490o8333m2302J56019J4643
15055f0705n8254p7970n1998N0526Q3661q1943J4728P4475q108N4390k4607j01853
15043a87658j95928k4348R2990P1673Q1844J04712Q0289R2j9594J85466n7622
15032A31916p3598l6418m1681j71522k8865J3136n7005K501K434r950J09030J75807
15020A5785k015k5933R2495k3736p7462m540J0966J5463R1912l8787j39378l6299
$$ y = [-53768, -47667, -95030, -16105, 6491, -44132, -28226, 41287, 71977, -43629, -104213, -114854, -109205, -78134, 28926, 90984, 99624, 82002, -62898, -150287, -194877, -201751, -102061, -133054, -194208, -239376, -178981, -207046, -323346, -291212, -329218, -272239, -155896, -75973, -123358, -51138, 18481, -13013, -38094, 40783, -18242, -120732, -189065, -231367, -75348, -60705, -118959, -196929, -248927, -198401, -114740, -196683, -181955, -107480, -115588, -61198, -85805, -187658, -383586, -407934, -314944, -243271, -161427, -56715, 23574, 23666, 4072, 189538, 131916, 58318, 21900, -19781, -191303, -220168, -207032, -264037, -261536, -259102, -269052, -160022, 15785, 13770, -12163, 80332, 56596, -20866, -25406, -14440, 1023, 92935, 54148, -85230, -121529]
15008a21529p0530q029J61471r5234m7904m0663J00543J11365n5800p363M2471
14997c1202j9338Q6032J1419k5668m8304l8158j041j35393q3561K351P6042M8046
14985a58775J10094J07891O3247N8829j16399j01716j8787K809j6532p459m3034
14974a19832l9512K8166J29203L7603Q000k3188r0291j13927j5978m0984K329
14963b38411J34291k4760l9400P8225R2688l2662K6074r6102L9032M4339n1982
14952f8668j90092m8105J29444j1141m5434N5309N7045l7702M2264J08579j3051
14941b1552j20026n8518N0610P3645M0980l0253j31314n5137J14970K6112q53
14930a11336k6627j50981q016N628l1562P0238J70880L2585k2159L1444q0397
$$ y = [-121529, -192059, -200088, -38617, -133851, -181755, -222418, -121875, -10510, -66310, -73673, -31202, -50540, 35492, 46911, 21243, -27061, -65219, -66260, -201653, -285214, -282863, -206821, -158775, -48681, 59210, 122457, 181286, 64887, -36829, -55616, -52807, -69339, -76798, -119832, -159344, -131178, -1975, 35628, 43628, 20440, -69851, -183778, -199756, -240740, -238411, -104120, -128880, -168280, -90055, 2633, -30029, -3955, -100057, -61025, -16686, -68668, -258760, -306865, -177421, -188562, -233996, -178687, -121642, -159344, -117080, -8501, -21552, -141578, -200096, -149486, -75841, -34861, -65114, -196428, -251565, -136595, -110483, -111336, -137963, -288944, -296960, -291332, -322894, -252656, -81776, -49191, -71350, -39906, -120303]
14919a20303n3292m9721Q6601J2597p6936L2054J70632R0899k4309q1472r0667
14908a03917J40934j1535j92934J0685p0401j8068J34053O9321m5383j2885j7846
14897a17976o2236l8153q7153p8298J82751K28752L1972q3761o6552q3241K8209
14886a45686L3877Q7673O7785o9430m6430N5019J18910N1156j34630n9973j5378
14875e7107j44898Q4162N3803r1458m0455o5016J2837j5856J53809J70099r2420
14864c2500q5135j18360p1504Q0633L159P8590K31193L5844j33327K1842J30918
14853A41353p4786j29586l0181o8194j27861J21915J2273j02311M6915L0321K6016
14842a54126J03722R9480O808j83914n6899r179j6080O2457o3419j24785j8827
$$ y = [-120303, -173595, -223316, -136715, -124118, -201054, -169000, 1632, 92531, 68222, -13250, -103917, 37017, 25482, -167452, -156767, -227168, -245236, -111183, -41862, -87245, -100130, -117976, -180212, -218365, -305518, -383816, -201065, 27687, 59659, -24102, -90654, -173895, -145686, -111809, -24136, 43649, -25781, -72211, -17192, 101718, 152874, 18244, -41729, -57107, -202005, -117843, -64040, -155498, -195953, -260969, -248132, -263988, -110179, 59920, -32500, -117635, -235995, -307499, -226866, -223707, -145117, 86076, 121920, -11407, 10435, 141353, 66567, -63019, -93200, -161394, -289255, -167340, -155067, -257378, -210463, -180142, -154126, -50404, 49076, 55884, -128030, -184929, -194108, -210188, -147731, -211150, -335935, -354762]
14831c54762k7518P3343L4083n0590P656p2437M3163O0199J18133R6395J17551
14820D5216N8880J2736j8837K0729j06755j51882n3749O3317J42599j0577l7124
14809c5447p2051q0763l6782r3627o8543J11699N3387N0599j14113O9769L00814
14798H4942o056j26153j8719P704l8841O6970N8483k9868R4463N403j23066k8780
14786e3518K9917m410K7667J09089J1435j10787j18662j9183K0692l2266M8682
14775i1344J20568j772r3899l8596O5160P6896M6551j77746m3264J8680J01382
14764a7384P5795L4380k7371l02683m0644L4285q6529K8046J17170K8849m8072
14753b04158q9881N4949J81985Q6853j5836q538r0256p2678J09730o7857P921
$$ y = [-354762, -382280, -308937, -274854, -325444, -317788, -390225, -347062, -286863, -168730, -72335, 45216, 104096, 116832, 97995, 118724, 11969, -139913, -193662, -130345, 12254, 1677, -35447, -107498, -188261, -225043, -318670, -387213, -275514, -222127, -171528, -285641, -215872, 84942, 78886, -47267, -65986, -58282, -97123, -30153, 28330, -1538, 92925, 98328, -24738, -53518, -23601, -28011, -344, 108745, 120180, 9393, -109269, -128452, -107760, -140026, -91344, 29224, 27452, -66447, -105043, -39883, 37013, 83564, -94182, -137446, -118766, -17384, 58411, 92791, 65420, -237263, -277907, -243622, -330151, -302105, -184935, -156086, -204158, -294039, -239090, -57105, 29748, 13912, 5374, -84882, -157560, -47830, -115687, -107766]
14742a07766L494l5472N6361j22152j6150M868j8684O7165j26623M9943J16097
14731a28919j4051J2381j04437k5267k225J12312l012J1565m2807Q2581L4j60881
14719b62726n3581J464J53818J85513k8254j69036k0402j10216L0264J22220n274
14708a56210J03657J96809o8211K4901j18793j941m0824o6868l384j336l660j9665
14696a55525J5012l9168K4846L1364L4790k4888m4160L8181O1412Q3560r5764
14685g0340q4801J36461P9052l7424j28190p1340K1714O1448J852k6298R8510
14674a9356j00064j38793j05956J98160J89006k3095j39325N9632J17262j78418
14664a40947k1622O404j10259k0694N548k4434o345n4272N7476m5960M7551N9629
$$ y = [-107766, -104272, -139744, -83383, -205535, -221685, -216817, -235501, -168336, -294959, -245016, -128919, -142970, -130589, -235026, -260293, -262518, -150206, -153218, -141653, -184460, -101879, -101845, -262726, -316307, -314843, -161025, 24488, -3766, -172802, -193204, -303420, -273156, -150936, -156210, -52553, 144256, 76045, 100946, -17847, -19788, -60612, -127480, -130864, -132200, -135860, -155525, -140513, -179681, -154835, -123471, -88681, -113569, -157729, -119548, -58136, 25424, -70340, -155141, -18680, 60372, 22948, -105242, -176582, -154868, -93420, -91568, -117866, -19356, -119420, -258213, -364169, -166009, 22997, -98, -139423, -79791, 37471, -140947, -162569, -156165, -266424, -287118, -281570, -306004, -312349, -366621, -309145, -355105, -307554, -247925]
14652b47925o1496j1807J24083k8943j5925n8174N3096R3082r800R5526n3189
14641a21472k1417O7792M2583K7988j38958j52886q2223j3060M7979L7263M2700
14630b63711n3417M5247J9035J2514Q6640q141M2063m1960J08038P6520r5168
14619g2340p1806M6640l6223L8951R0892L6501j09360L8391l969m8398L7627j5121
14607f8215j20965l1158J08516R6969R717O87j9970L4840l7796l4146L4633o6544
14595i3432m6636N8914J7498Q4157r990j23593m6081j7935O410o8184O1896L3844
14583a43132q623l2594n3280j04934p7736J41327K77290j73677M2407M0217j45296
14572b38031k3131J7374J15944K8340K4208j0669J9708J0521j62715k2250N8121
$$ y = [-247925, -309421, -321228, -197145, -226088, -242013, -300187, -247091, -154009, -163809, -68283, -121472, -142889, -75097, -32514, -4526, -143484, -296370, -378593, -391653, -343674, -306411, -263711, -317128, -271881, -252846, -240332, -153692, -161833, -119770, -161730, -53692, 22828, -72340, -144146, -97506, -133729, -94778, -3886, 32615, -76745, -38354, -42323, -90721, -53094, -68215, -189180, -220338, -111822, -14853, -5136, -4449, -24419, 10421, -27375, -61521, -26888, -93432, -140068, -81154, -63656, 20501, 10511, -113082, -159163, -177098, -170688, -238872, -176976, -143132, -151755, -184349, -237629, -342563, -420299, -278972, -1682, -175359, -132952, -92735, -238031, -261162, -243788, -127844, -99504, -75296, -85965, -66257, -55736, -218451, -240701, -182580]
14561a82580R8867P4069o247l9982r8546k0590P1218q8833J12071J07313j29509
14550a02749j77990J75097R0042l4634l6102Q1185K6773j20792l3499k7445J37507
14539b2607k386j87206l7477O2912P9555N3160P2857q553q1886r6326K4944J4358
14527a28655q4129J18557N4766n5629k20139k6783J47613J26511J24887m6696
14517A0303j29999j20073M2125R6234r620j00887J5777J82575R0185j5191j78387
14506a16958j4170M6547m4367q6691n7534o0600n0830p739J50916J30381J17696
14495F651j1059K5358k1107q3457k5680l6919K2117O5948N0809r6082r3555l282
14483b00258O7671q7441N0393P0883j8254J8269K17733Q107p8861K1662m8464
$$ y = [-182580, -83713, -9644, -15891, -55873, -154419, -175009, -103791, -192624, -80553, 26760, -102749, -280739, -105642, -15600, -50234, -86336, -5151, 21622, -99170, -132669, -160114, -22607, -24993, -212199, -249676, -186764, -107209, -54049, 18808, 10255, -71631, -167957, -143013, -128655, -212784, -94227, -39461, -95090, -315229, -342012, -194399, -67888, 56999, 10303, -119696, -239769, -197644, -101410, -111030, -211917, -196140, -13565, 76620, 61429, -116958, -131128, -84581, -128948, -215639, -273173, -333773, -384603, -392342, -241426, -111045, 6651, -4408, 20950, -157, -83614, -109294, -146213, -124096, -58148, -7339, -103421, -196976, -200258, -132587, -220028, -169635, -98752, -117006, -98737, 118996, 127103, 48242, 69904, 21440]
14472B1440j07785j8937m5345O6355j03937k0003K9748N8618Q653l5404j07652
14461b54249q3508R3487J47369J6602J66789K5958q7862n3705m0969Q2494O5707
14450G8113J275O395r7998K1204o5895o9772n048K28204J06713k410j04296r1231
14438E254j14923n5672O4214o2657M5110r0640m3716o747P0208m9540Q8684J10184
14426d0241J66950r995j01425J6871J05239J1415j13488q0062n743o5984k6814
14415a43277J7303P0047R6364q233j33073K7239J51432N9010j20140q0405K6361
14404c7372o3533j69931J121o6617L074J43007J03691p2460o8231N9491j082P4518
14392i4324Q7806l2980o0808r119j03841R083J73806K5076j57717L1194L9276
$$ y = [21440, -86345, -105282, -150627, -84272, -188209, -208212, -178464, -119846, -111193, -146597, -254249, -337757, -244270, -96901, -80299, 86490, 112448, 24586, -29119, -70088, 12406, 78113, 79388, 85783, -12215, 8989, -56906, -126678, -131726, 96478, 203191, 200781, 96485, 5254, -109669, -165341, -101127, -163784, -118674, -209314, -253030, -259777, -189569, -239109, -150425, -40241, 126709, 116714, 15289, 32160, 137399, 148814, 35326, -44736, -50479, -116463, -143277, -125974, -55927, 40437, 32204, -100869, -73630, 77802, 136812, 16672, -63733, -37372, -100905, -270836, -269715, -336332, -333258, -190251, -86560, -159020, -227251, -167760, -168842, -94324, -6518, -39498, -100306, -109425, -213266, -204183, -30377, -5301, -163018, -131824, -92548]
14381i2548L6855L5698n6778J98754j5572j55846m7215o2005q9289j3805R0804
14370a70947K5322J17258j5155j01503p4811k955J18955j0457O7933j7538j4033
14359g7931k3029p4986O1051J762j3473o8960l6041l410q9509q8079N8458K9865
14347c24282K22300J09913M7097M9855p148m2343q6383l5017K7854N7883q2154
14336f2425L4788Q0694m7026j14922j16925j11474J01851m5466M6557L1921J00987
14325a01440m0161q7002J24255O3201l2333k6733o1289j2679M6315P2502n3398
14314a08762q3056L0729K2975k0157J33755K6872l7065P8950M4313J2413J61244
14303B62211j12010j79854k7157k8789j5077J3553j29226K3835N3016k7814P9852
$$ y = [-92548, -55693, -19995, -76773, 121981, 106409, -49437, -96652, -158657, -247946, -261751, -170947, -145625, -28367, -43522, -145025, -219836, -222791, -103836, -114293, -46360, -63898, -77931, -100960, -175946, -114895, -113133, -126606, -195566, -231607, -235017, -324526, -412605, -354147, -324282, -101982, 7931, 55028, 104883, 97735, 55392, -30991, -66008, -38154, 19729, -62425, -27637, 53057, 6031, -108891, -225816, -337290, -235439, -280905, -234348, -202427, -101440, -141601, -228603, -104348, -41147, -73480, -100213, -161502, -174181, -127866, -55364, -108762, -191818, -161089, -138114, -158271, -24516, 2356, -34709, 44241, 88554, 100967, 262211, 150201, -29653, -56810, -85599, -100676, -87123, -216349, -192514, -139498, -167312, -87460]
14292h7460P1057J10852k8614o8981j80935J9606n50q6316K9565J7600R0046O1295
14280e2835J16627J9396j46554k4188l1036m3683j05808n3327O1975J8394J41464
14269i9575M3177J8840o1839l6725M9268M5856m4045j1804J693J6406J4392j7583
14257h1939l3608J8842R1889j45541j0454J5583r359L0595J01104j20706n2342
14246a95936J13013q1869j88813J69488J18117O7969j14569j22806N9444J85677
14236I715Q1347j04128j19005o5080J7097k5541j2477n7347R7998j09354J12813
14225a73962N099q2225N5601k977J4226K1131r3233o9947J07771J03061j08616
14214b24071j0887J86279N5530o6803j02634j5262p5502M014R1648J52194J21951
$$ y = [-87460, -16403, 94449, 65835, -3146, -184081, -164475, -165025, -251341, -221776, -204176, -114130, -52835, 63792, 83188, -63366, -87554, -118590, -162273, -268081, -321408, -259433, -241039, -99575, -56398, -37558, -99397, -136122, -86854, -40998, -85043, -96847, -95154, -78748, -64356, -81939, -115547, -96705, -4816, -150357, -160811, -145228, -154587, -123992, -22888, -143594, -195936, -82923, -164792, -353605, -184117, -66000, 1969, -112600, -235406, -175962, 9715, 91062, -13066, -132071, -197151, -180054, -205595, -218072, -275419, -177421, -286775, -173962, -168863, -251088, -195487, -198464, -184238, -163107, -256340, -326287, -218516, -115455, -224071, -234958, -48679, 6851, -59952, -162586, -177848, -253350, -249336, -157688, -5494, 116457]
14203A16457o2336k67738K6951L9234j02269m0826O3142J4210N4466M4474J4342
14192i9893k5163j24151k7963P8838M8176j4059j17933k9007Q8980J20725J05503
14181D053k4187l4841Q9906N7766r0393j17985j7938Q0502K5506j43421J9711
14170a51321R2685L92j20188j16672J08189k2061j1637J16748L2783k06123n5912
14159c33117P3884L7963Q7012R6612r7887L6194R6150J6635J8105j6402q6800
14148g1651j59513o2208J73407J61984J55254j02564j79304r2200j21897K1081
14138b77611j01628N6805J25259J27881k3629j10043P8037Q534j9868P7270M5041
14127a3952Q8418K8072j12973L1826J41151j19538j29351J10512J11029j52949
$$ y = [116457, 54121, -213617, -186666, -147432, -249701, -290527, -227385, -213175, -158709, -114235, -99893, -125056, -249207, -277170, -198332, -150156, -164215, -282148, -311155, -222175, -101450, 4053, -20134, -54975, 34931, 92697, 2304, -115681, -133619, -53117, -27611, -171032, -151321, -58636, -58244, -178432, -295104, -186915, -208976, -220613, -103865, -71082, -277205, -333117, -259233, -221270, -134258, -37646, -135533, -99339, -3189, 13446, 31551, 15149, -71651, -231164, -293372, -119965, 42019, 197273, 94709, -84595, -176795, -298692, -277611, -379239, -322434, -197175, -69294, -92923, -202966, -124929, -116395, -136263, -58993, -13952, 74466, 102538, -10435, 21391, 162542, 43004, -86347, 24165, 135194, -17755]
14117a7755J2064m8821k2813l6335J2982k7467m3254K7653p68M4125M2010O0980
14105B601o1238l4863n7783N8308l1070o2889Q903n4080J76130M3063q4174n3198
14093a50290r6176P4992J14479K5237R9770m8992N0934Q8807n2876r5277N1849
14082F2457O5218j48710k06141N6737J27364q9150M1917P9315n6753m1789j8099
14071a27634l8473q6498Q2702R2255j9106j96018L9836j2653K0235J56223J15064
14060B5933J18429k3229K3717p2360j53593k3239N4631j6307k5955K7390Q1570
14049A6987J7968j4290o0888l2414j08566J21691J37304P6608p0709k04771k06994
14038c28074N8600J14420J71420l29L0929O9189R253m5470j52961n9619M0290
$$ y = [-17755, -5691, -54512, -77325, -113660, -100678, -128145, -171399, -143746, -144514, -100389, -58379, 2601, -58637, -93500, -151283, -92975, -124045, -186934, -178031, -232111, -55981, -12918, -97092, -150290, -246466, -171474, -56995, -31758, 68012, 19020, 69954, 158761, 105885, 10608, 62457, 127675, -21035, -227176, -170439, -43075, -132225, -90308, -10993, -67746, -109535, -127634, -166107, -252605, -169903, -77648, -96754, -292772, -252936, -265589, -245354, -89131, 25933, 144362, 121133, 144850, 72490, -81103, -104342, -49711, -66018, -91973, -64583, 16987, 34955, 20665, -40223, -72637, -181203, -59512, 77792, 154400, 83691, -121080, -328074, -269474, -155054, 16366, 16037, 46966, 116155, 125408, 79938, -73023, -132642, -92352]
14027i2352n613j34071L0072j58n984R5820J30688j51909o8159O6548N260L0589
14015i9269j11410N9598M0061l8189K6814J82140J07294J0665p9622j16895k27919
14004b46732j74949M5917J79588O4126N6525m0096m6892R800l0949M0654R1831
13993e1177j1877n6971k6047N402O7900o537R2629P6305k36094j02000k328J55658
13981i5137J84392j260p3668o7027N2028O2853J04906r3779p6007q2190P0871
13970a4018M599m000J14707O414j14662j24479M253k04240j2919M4991l4392L5281
13958b98465J54171K00786l3403q5361O7749k2207q2314l6067n5712l0873L5687
13947a86009q8062j71120m2988J43682J24942R4286R3043q522J1148o4381j37638
$$ y = [-92352, -97965, -232036, -201964, -202122, -208106, -112286, 18402, -133507, -201666, -135118, -129858, -99269, -210679, -151081, -111020, -149209, -122395, 59745, 167039, 177704, 98082, -18813, -246732, -421681, -375764, -196176, -132050, -75525, -115621, -162513, -152713, -183662, -143008, -51177, -63054, -120025, -146072, -140670, -72770, -79307, 13322, 89627, -146467, -248467, -250795, -95137, 89255, 87995, 14327, -52700, -672, 62181, 167087, 73308, -2699, -84889, -14018, -9419, -13419, 101288, 107702, -6960, -131439, -127186, -331426, -344345, -299354, -333746, -298465, -144294, 56492, 23089, -62272, 5477, -16730, -99044, -135111, -190823, -221696, -186009, -274071, -445191, -488179, -344497, -219555, -125269, -32226, -40748, -29600, -93981, -231619]
13936b31619K9429N8263N3786o1658j1541N9912m736N555J6140k7856q368m494
13924a27187n3760l647J19299J77885n7004l2304m7991j06997J7467Q5618m5547
13913g4168J34392J2318j04770m003l4983Q9930J6490m5333Q1784P5325m1806
13902A05176j14046l1976M5519O9996k4882M6130k7603j62603q9447K3336n196
13891a65596o4835K6948O5613J2143P330M5711K6264m7585M3107P317L4465M9692
13879D0574K463p8083j6742K7795m8275K7734j3904j4676j54647L1940K35205
13868C9384k6974r3376R6898J97877K449o8299r4603o5788l6672J23644n5723
13857A8817J5000q8590r8719J5409K1980q9608j31006m8885N4243Q6791P4780
$$ y = [-231619, -202190, -143927, -90141, -151799, -163340, -103428, -108164, -102609, -86469, -114325, -122693, -127187, -180947, -184594, -65295, 112590, 55586, 23282, -24709, -131706, -114239, -28621, -74168, 60224, 72542, -32228, -36231, -71214, 18716, 35206, -10127, 71657, 146982, 105176, -8870, -40846, 4673, 74669, 49787, 95917, 68314, -94289, -183736, -160400, -165596, -230431, -203483, -137870, -125727, -118397, -72686, -46422, -94007, -50900, -43583, -9118, 40574, 43037, -35046, -51788, -23993, -72268, -44534, -58438, -73114, -227761, -195821, 39384, 12410, -80966, 15932, 213809, 216258, 147959, 53356, -12432, -49104, 74540, 18817, 33817, -54773, -153492, -138083, -116103, -205711, -336717, -385602, -331359, -244568, -169788]
13846a69788k1548K4773J06424O0291n7550m2731k0842j5450o632P2756J14061
13835D3764R2743q6822j10906q5191L2931K4043K1621J3925q2892K8972R5963
13824a1849L8441M5157o2167j5382l7608m2812o639Q1071r0982k3659Q4858j36502
13812a78073n8998Q1172K22728p4860q4478j65174L4096J09131m6270n3331k0404
13801b34461L9196R0756Q7243O5744j09340k5908N3460N5498j8407j1236o2366
13790f9821q1285j4072m2621j36350p161J92836J33501L0475J09540J19355j75938
13779E8459q9403J02499l5343J00696R0873n3063j20165j15002r8866K0093l6828
13768a76050J01121K6544J59235M985l6321j78451o6869P3337N9470j25220R8612
$$ y = [-169788, -191336, -166563, -60139, 152, -57398, -100129, -120971, -136421, -143053, -70297, 43764, 136507, 49685, -61221, -146412, -113481, -89438, -67817, -53892, -136784, -107812, -11849, 26592, 71749, 9582, -5800, -43408, -86220, -92859, -11788, -102770, -126429, -41571, -178073, -237071, -155899, 66829, -8031, -92509, -257683, -223587, -114456, -160726, -214057, -234461, -195265, -104509, -17266, 48478, -60862, -86770, -33310, 22188, 3781, -7455, -69821, -151106, -165178, -207799, -344149, -351310, -158474, -24973, 5502, 115042, 234397, 58459, -30944, 71555, 36212, 136908, 227781, 174718, 54553, -60449, -159315, -139222, -176050, -74929, -48385, 110850, 115835, 79514, -98937, -165806, -92469, -32999, -158219, -59607]
13757e9607M5969J6915O9028N6151p6473k4072k7102k7580J5194k4378n4484O3780
13745b6659M5488l153L7169Q2456M589M1159N8381j4915j47736j17803k2709R155
13733e4578k6757L5453P1941k094m4376j0292n0186j20628Q0999J26444q0865
13722g4939K0927k2541O5750l5414j556j3257j1797K2000M8101J7443K4030K4992
13710F3739o3881j15799M4416l5668q3167L3362j8092J52211J66179p6504k0681
13699D6115j18520p6349Q2592l0920O0741L5718j10820J9859j8060j07494M5635
13688a71503n5780m2059j0691J60309L6584k9059l8793J21209N7477p0656j3015
13677e5977J19619L4585k6777k06380n8324J45162J18550O5692j3636K6828O1293
$$ y = [-59607, -13638, 3277, 72305, 128456, 51983, 27911, 809, -26771, -11577, -35955, -90439, -26659, 18829, 15676, 52845, 135301, 139890, 181049, 239430, 224515, 76779, -41024, -63733, -54578, -81335, -45882, 26059, 23965, -20411, -30703, -80889, -201517, -120518, 5926, -74939, -54012, -76553, -10803, -46217, -47773, -61030, -72827, -50827, -2726, 14717, 38747, 63739, -142, -115941, -71525, -107193, -190360, -156998, -175090, -22879, 143300, 66796, 46115, -72405, -148754, -66162, -97082, -36341, -623, -111443, -91584, -109644, -217138, -171503, -227283, -269342, -280033, -119724, -83140, -112199, -150992, -29783, 27694, -42962, -55977, 63642, 98227, 71450, -134930, -193254, -48092, 70458, 136150, 122514, 149342, 210635]
13666B10635n7812j17584j13280m4100J41340p9700j0980j0529j9373q9847L0811
13655a60419J06515l2333J801J42787M088o8590j4140N5395N1238j09643j22759
13644a46060K1826J39573k1123j666k5979j60095P2730J26183M2914J7769J05370
13633A71442p6179N6092n0580j23645q1600P0993L5567Q9715k28894j68166J31650
13622a73605J15565j58719M7174J18186k07681J1257J23002P6561j960J9619R5683
13611F5082J07598j37540q2149r57R0486P9342o4135j72506j52672J50692J72164
13600E5405J19168n401k8695N1950j06509j8913N0360O5974L3364j93555J1133
13589C4281M8589q134P4748K5461L4315o1540j56568j86696k2530R3815M4553
$$ y = [210635, 152823, 35239, -78041, -122141, 19199, -60501, -71481, -82010, -101383, -191230, -160419, -53904, -86237, -84436, 58351, 62439, -6151, -20291, 35104, 86342, -23301, -146060, -124234, 15339, -5784, -7450, -33429, -193524, -120794, 5389, 48303, 66072, 171442, 95263, 151355, 100775, -22870, -104470, -33477, 2090, 91805, -137089, -305255, -173605, -58040, -216759, -169585, -51399, -259080, -247823, -124821, -48260, -50220, -30601, 65082, 172680, 35140, -47009, -47966, 42520, 121862, 57727, -114779, -267451, -116759, 55405, 174573, 169172, 140477, 192427, 85918, 67005, 117365, 183339, 216703, 23148, 34281, 82870, 74736, 149484, 174945, 209260, 147720, -8848, -195544, -218074, -124259, -79706]
13578g9706K4644N8820J19955Q6493L2868n6423m1089k8961j00570L7104J05094
13567A58229J40964J41727q2785r9057j7890J16575R6521k2365r5791o1444q288
13556B66396q060Q908l6546j1157J20344q8382q60N8396p6013q3695n5686j8417
13544G5228p617R8736J57572Q0260n0289J2050p6981j57543j24751O3459J30034
13533B00158K2566K363j5254L3961n8756q7436R4188m7745L5534J15484J47336
13522D42399r912j42953j02297n5423J36365J89735J00207j03999q489o2421J19831
13511E03043k9541n0844K473j20349n0112L7833O5774j7918r7016J53671R8374
13500D95388j79401r1961l677J23129O3657j27425L8228J9874j26561k9291p194
$$ y = [-79706, -55062, 3758, 123713, 210206, 243074, 186651, 145562, 116601, 16031, 53135, 158229, 299193, 440920, 358135, 259078, 241188, 357763, 454284, 431919, 336128, 274684, 266396, 258336, 267244, 230698, 219541, 339885, 251503, 250643, 309039, 233026, 149331, 93645, 75228, 67611, 166347, 323919, 404179, 353890, 365940, 288959, 131416, 6665, 70124, 200158, 222724, 225087, 209833, 243794, 185038, 97602, 191790, 144045, 179579, 295063, 442399, 432487, 289534, 187237, 131814, 268179, 457914, 558121, 454122, 445633, 383212, 503043, 473502, 422658, 425131, 304782, 254670, 292503, 358277, 340359, 243343, 397014, 495388, 315987, 224026, 220349, 343478, 407135, 279710, 317938, 337812, 211251, 181960, 174766]
13489A74766J98081R3446j38149j41781L3602O2612p8484j05783r2628J09214
13479A14896L6946k7682m6862R4833l1700l190N3746k1908K5571N3610m0205l9734
13467A68321m1100k0556K0461j39821r8867L9510P2834M5899J1041m5061P001
13456A9662M297j1950Q3915J0722k0313K5272J4937M4836J32648r2353m1358l6262
13444A34053j7596j13439j51778Q7290K48396J03574j00260n0739j68696Q3713
13434E4518R1498K8129j71054p3613R686O6621J8669M8462j73415m4024q33J4779
13422a30577J54116J37831j40853q81J02069j09989j19708Q5503p6445J2202l3179
13411a19911J0470J40796J12965p2961k7795M7602k1486N8214p6888J926R0860
$$ y = [174766, 372847, 466293, 328144, 186363, 219965, 282577, 204093, 98310, 5682, 114896, 151842, 124160, 77298, 172131, 140431, 137241, 190987, 169079, 194650, 248260, 208055, 168321, 127221, 106665, 127126, -12695, -111562, -72052, 782, 46681, 57722, 12661, 19662, 23959, 12009, 95924, 106646, 86333, 111605, 126542, 171378, 304026, 211673, 170315, 134053, 116457, 3018, -148760, -61470, 186926, 290500, 190240, 139501, -29195, 54518, 146016, 174145, 3091, -70522, -60836, 5785, 24454, 72916, -100499, -144523, -145356, -130577, 23539, 161370, 20517, 19636, 121705, 11716, -107992, -22489, -98934, -86732, -119911, -109441, 31355, 144320, 71359, 43564, 91166, 69680, 127894, 51006, 52932, 143792]
13400A43792P0827N2305q5853j35046j71350P2303J63119R4239j63435p6066L4589
13389e76J15706Q4574K01K1498j04634j29607k1525m9350j8943J03590J30976
13378A31910m9914l5793r4836j0389Q535J2777K6950L3165r1119n233l5947k9833
13366a39727J6447L9834J2697P33O3310O5470p9873N1515J3876M8997p2921j80287
13354a59929j44537n9275J38628K45198K1581j10344m6530R2563J71735m410j34607
13343A0073p6927J4050j13476j88876J60235J61501P7215q53j81626j52707J05826
13332a85565J59611J08494P1846j0676j81982j47796K41983J91527k5381l8700
13322A83361m6700o0342j3096K951j39432j03934q0243J75123J29628o5479j3387
$$ y = [143792, 214619, 266924, 181071, 46025, -125325, -53022, 110097, 204336, 40901, -35165, -576, 115130, 199704, 199905, 221403, 116769, -12838, -34363, -83713, -102656, 934, 131910, 81996, 46203, -48633, -59022, -50487, -37710, -10760, 22405, -68714, -73947, -109894, -139727, -123280, -83446, -70749, -70016, -6706, 58764, -21109, 30406, 44282, 93279, 20358, -159929, -304466, -363741, -225113, 20085, 41666, -68678, -115208, -22645, 149090, 144680, 10073, -66854, -52804, -166280, -355156, -194921, -33420, 43795, 42942, -138684, -291391, -185565, -25954, 82540, 154386, 143710, -38272, -186068, 55915, 247442, 222061, 183361, 136661, 76319, 63223, 66174, -73258, -177192, -257435, -82312, 47316, -18163, -31550]
13311c1550R489J1171R6073J32962Q1301n9414j98061l630L5103n2121J15861
13300A37184R1429n1332j46672Q5014m7729n7029n302L7552M9025P9087J4478
13289A85705J1500n2736j30895l7991P5155l2738l6747M6560J05689P0808j30484
13278G3826k6295k8796m3017K8383M9844j50616K1233J97469p3233j57390N1991
13267e6601N1196O0959M4482M2525R9491k7259l9961j31993r9346p902j5576p8402
13255a58387j14399J60355R9696k1407M352q418J30113P7043k9603p6339r4428
13244c1422r6831j4621R0536J18416Q1147k5373j84675r2891l2525L5187N4124
13233i8928K92203p5669k78126k9001J58084K9745m2724N4187J33882l1362l1871
$$ y = [-31550, -22061, -10890, 85183, 218145, 299446, 240032, 41971, 38341, 73444, 21323, 137184, 228613, 177281, 30609, 115623, 67894, 10865, 5563, 43115, 92140, 171227, 185705, 197205, 144469, 13574, -24417, 50738, 18000, -18747, 27813, 133502, 204310, 73826, 47531, 18735, -24282, 4101, 53945, -96671, -75438, 122031, 48798, -108592, -56601, -5405, 55554, 100036, 142561, 242052, 214793, 174832, 42839, -56507, -64409, -79985, -158387, -272786, -112431, -12735, -34142, -29790, -38208, 91905, 168948, 139345, 63006, -31422, -128253, -142874, -52338, 66078, 147225, 121852, -62823, -155714, -188239, -153052, -98928, 193275, 117606, -160520, -189521, -31437, -1692, -44416, 9771, 143653, 112291, 80420]
13222H0420q0626q4122L7688Q0306L2985M9298j05426q2816Q2500p7565N1293
13211a6065k6393r3587j9026j6733O6851R2237m7884o5192q5095O927J32153J73053
13199A01246j0468o5657j99109j46961J23115K19252P5572j0945l7793L5464L3679
13188A17395j2159p3206j25079J8784L5556L7860N6761O1773J20454j2328p3202
13177A52609N1861l7014k0604M3996o551j6483K8083O0941m2389r7331p141j05897
13165D080k7287N0770P9070q9264m7175j5854l3116j4388K0189k0311L7844M72
13153e4970L20j01045j7291k2230m4371P3284O0368m6899M5369J13446O0773J15428
13141A82182J3239Q965j01733l9441m5139J7773l035k8821J21273K6816j37056
$$ y = [80420, -206, -84328, -46640, 33666, 66651, 115949, 10523, -72293, 10207, -67358, -16065, -42458, -136045, -155071, -171804, -104953, -12716, -60600, -125792, -210887, -203960, -71807, 101246, 90778, 25121, -173988, -320949, -197834, 21418, 96990, 86045, 48252, 83716, 117395, 105236, 32030, -93049, -74265, -38709, -849, 55912, 117685, 238139, 225811, 152609, 204470, 167456, 146852, 190848, 184297, 167814, 195897, 256838, 214449, 117118, 109977, 4080, -23207, 27563, 106633, 17369, -29806, -45660, -78776, -93164, -72975, -93286, -55442, -54970, -54650, -155695, -172986, -195216, -239587, -166303, -105935, -152834, -107465, 5981, 66754, 182182, 195421, 204386, 102653, 63212, 18073, 35846, 32811, 3990, 125263, 152079, 15023]
13130A5023j07250L0863L7406O9147j5773R775j2212j15562q1708J7981M6753
13119a05557n0419j1782P0525Q146Q7702M1318j14052r3061J69331L5886o7859
13108b9822n0610o3647N7900L5249P5487J1132L4799m314j31890k1363P4007R3828
13096H0756r5906n952O2917M7207k0070J0303J2686o5611j26893Q4343Q2942p4250
13084g528j84926n0953K44381J43184o9672m2461j597N4767J02208k3257j02759
13073F1387j09623o7256K1257o7733m9978j830P8887L4099M8731O407J39127R8394
13061A91869P4776N6591n7513j32877j39028J0536O9524J5672M7458R883P0347
13050B17238J7068j9372p7747m2722k6202N092J9865j17043o3309r8423L3508
$$ y = [15023, -92227, -61364, -23958, 45189, 29416, 39191, 26979, -88583, -170291, -152310, -105557, -155976, -167758, -97233, -89087, -1385, 39933, -74119, -167180, 2151, 38037, -29822, -80432, -144079, -86179, -50930, 24557, 35689, 70488, 66174, -65716, -87079, -13072, 80756, -15150, -21102, 41815, 89022, 68952, 79255, 91941, 26330, -100563, -16220, 66722, -7528, -192454, -243407, 974, 144158, 74486, 32025, 30428, 85195, 187403, 164146, 61387, -48236, -115492, -94235, -161968, -211946, -213776, -134889, -100790, -52059, -45652, 93475, 191869, 266645, 323236, 265723, 132846, -6182, 4354, 73878, 89550, 137008, 146891, 217238, 234306, 214934, 137187, 94465, 68263, 73355, 93220, -23823, -87132, -185555, -152047]
13039a52047J5711O2450J29252k8901p6354o7749l3744J4189Q0329R1672O9890
13028A04698o1906r3428k0237N8514O8056K1916N6783r9503p3768O928n4135Q5908
13016a74m2444O798q2778o1504J16792J13724r7108l8004J01531N2095o5479p3279
13004f9830j12437L0315J13589Q4587J06208K571P2363n7355N516l8828j44463
12993g764l3927l023j9883n4944K4282J29516K37640L1367k23175O7408k5799
12982A21698q6407j3453P7819k4177N3627l6492N932j19812P411R5818k8281l8066
12970A5617j31304O4004J12753J4708p2146q65O1315K2161J13484J747q8243o7856
12958D5375O9001J28805k292j66519k8670N0636J28808K9002j61175r4240j8331
$$ y = [-152047, -136336, -73886, 55366, 26465, -49889, -117638, -151382, -137193, -56864, 34808, 104698, 42792, -50636, -70873, -12359, 55697, 77613, 134396, 34893, -38875, -31947, -86082, -174, -42618, -35820, -118598, -180102, -63310, 50414, -46694, -84698, 16833, 68928, 3449, -69830, -182267, -151952, -38363, 46224, 152432, 155003, 227366, 170011, 175527, 136699, -7764, -41691, -44714, -64597, -119541, -95259, 34257, 271897, 303264, 80089, 147497, 121698, 35291, 21838, 99657, 75480, 129107, 92615, 98547, -21265, -13854, 81964, 53683, 15617, -115687, -51683, 61070, 75778, 3632, 2767, 64082, 86243, 199727, 201474, 113231, 45375, 114376, 243181, 240889, 74370, 45700, 96336, 225144, 254146, 92971, -1269, -19600]
12947a9600p1563K9683n1150q8486m7122N878J04321J53104M0047O4755l4577
12936H5290J7582k2071L1335o5654l3443N4174n132L7917O9556l1078k5975l1951
12924H0550O5436q9324m813m7425M4032K6653N2964k5696n7193k5224Q901o37
12912B8224j18284J0939n3998l693N6428R5943Q8469l1885O0142J36856J05968
12901C75109o6509m0900O5847j6404k51454n4109k0117J13054m4006L0537R0424
12890A81472M497j66898j16142j5525J2725J0202Q1904R3173J0769j120o7038
12879B8019R3090M0429n7091K7365l8803q5107n2593l0434K9217o5658K6150P5678
12867i738Q5492R930K7065k0351m6625j6277L6257j3491R653R037J27231r3413
$$ y = [-19600, -91163, -61480, -112630, -201116, -248238, -242360, -138039, 15065, 55112, 119867, 85290, 102872, 80801, 112136, 46482, 13039, 67213, 62081, 99998, 169554, 138476, 112501, 80550, 145986, 56662, 51849, 4424, 48456, 75109, 128073, 102377, 45184, 19960, 28861, 28224, -90060, -79121, -133119, -136812, -80384, 15559, 104028, 72143, 132285, 269141, 375109, 308600, 267700, 333547, 317143, 65689, 11580, -8537, 104517, 60511, 91048, 181472, 185969, 19071, -97071, -112596, -99871, -89669, -7765, 85408, 96177, 95057, 28019, 121109, 161538, 104447, 131812, 93009, 7902, -44691, -75125, -45908, -111566, -85416, -9738, 75754, 85684, 112749, 92398, 45773, 29496, 65753, 52262, 61915, 70952, 198183, 104770]
12855A04770j23991l1728J12493K33499O3780j0909l463j17321n6757J3098j0822
12844A72649j43825o0324L4637M0812o436O0634Q9863L989l8249Q6753q233j81397
12832E0873o0834P3939J20312J60814l9941k7616M9330l0178P66K2218n4933K6605
12820B91355k4749k3240j2550n3217j19626p3968L4031n7337m3973J08380J72795
12809A97901j5365n8106r6527j6686R3239q8380N6811J14354N763q2173L0497
12798A41328l8156N4040N0814J788p43p8330k0338p8883k6129M5597k3603M3486
12786G0871L0125o1462l9214M3057L2015J13725K5916q104J26327J9157j64470
12775A87943m3808J06088l4464J08079j2992n0007K440j52899N5836J51851m7946
$$ y = [104770, -19221, -50949, 61544, 295043, 358823, 347914, 344451, 227130, 170373, 183471, 172649, 28824, -31500, 3137, 43949, 37513, 98147, 188010, 191999, 153750, 240503, 232270, 50873, -9961, 63978, 184290, 345104, 305163, 277547, 326877, 296699, 297465, 319683, 264750, 291355, 266606, 243366, 230816, 177599, 57973, -15995, 18036, -39301, -83274, 25106, 197901, 182536, 124430, 27903, 11217, 104456, 16076, 72887, 187241, 193004, 110831, 141328, 103172, 157212, 208026, 209814, 209071, 130741, 110403, 31520, 5391, 50988, 27385, 70871, 100996, 39534, 320, 43377, 75392, 189117, 215033, 206929, 333256, 352413, 187943, 144135, 250223, 215759, 323838, 310846, 260839, 263279, 110380, 166216, 318067, 270121]
12764B70121r3837j00294O1495J28499Q4231l0918J2289n3258k14628j25801J92096
12753A29995K14248Q6648j37766o0747o8838Q8448p4976j50742O3621N9478L7837
12742A87206N3537K6003l1204j47159P5472N6939j30320K1220P6847m0882J54129
12731C01788O9507n0580k8592Q2520n9917P2440Q9537N2851m8699J6114j56653
12720C40316p4741j08127O524J8030l9888M435k1614J02135r1148o6158J42579
12709B12343J04634m7706k23502j06160M3071P1719Q5440P3960L7279P792M4213
12698C03083K4316n1022m2817m0708Q4644J10629k8057p0270L6442M0077j24975
12687B41342j1157P9896M7489m7224N7193Q9182R2418j14454l0931k5131j12130
$$ y = [270121, 176284, 75990, 137485, 265984, 350215, 319297, 331586, 278328, 63700, -62101, 129995, 344243, 430891, 293125, 232378, 163540, 251988, 177012, 26270, 89891, 149369, 187206, 240743, 266746, 235542, 88383, 163855, 220794, 90474, 111694, 188541, 147659, 301788, 371295, 320715, 292123, 374643, 314726, 387166, 476703, 529554, 480855, 496969, 340316, 265575, 157448, 163972, 182002, 142114, 146549, 124935, 227070, 135922, 69764, 212343, 316977, 269271, 45769, -60391, -17320, 54399, 139839, 213799, 251078, 258870, 303083, 327399, 276377, 233560, 192852, 277496, 388125, 360068, 289798, 326240, 366317, 241342, 230185, 310081, 357570, 310346, 367539, 456721, 549139, 434685, 403754, 378623, 266493]
12676B66493n2870J3055r1913M9069J43723L8032K5013j5053j0242q363j34417
12665B22527j21271k1273p1760J53938J26605J04632N5162m3784j76294K4081
12655B52563K38520J41786j52193p1335Q4369O9569J18856n5012r198n9004m6197
12644E12724n8002l4316P0430R7245l4887o7015p1110J5818O1172j29684J5277
12633C77652J98631J39548k7592m015l1375n0830j99m3436q3791k1650J06454
12622E59397N5515o4205K6434n4077k69997j79048J28082J76451J70113n9351
12612D89314j02664q5787K1524O4649O6738J02528J5752Q3040l9130q0760m4969
12601D90235N0858j8136k4416L5549l5172N5089J62800J8096Q4027O0622J6219
$$ y = [266493, 213623, 226678, 134765, 183834, 327557, 365589, 390602, 375549, 365307, 356944, 222527, 101256, 79983, 8223, 162161, 288766, 393398, 448560, 404776, 228482, 252563, 491083, 632869, 480676, 409341, 493710, 563279, 682135, 627123, 617925, 558921, 512724, 454722, 420406, 490836, 588081, 553194, 486179, 415069, 430887, 492059, 362375, 377652, 576283, 715831, 688239, 684224, 652849, 602019, 601820, 558384, 474593, 452943, 559397, 614912, 550707, 577141, 523064, 253067, 74019, 202101, 378552, 548665, 489314, 386650, 300863, 322387, 387036, 453774, 556302, 572054, 655094, 615964, 535204, 490235, 541093, 522957, 498541, 534090, 498918, 554007, 716807, 734903, 818930, 879552, 895771]
12590H95771j48630j38697K2243J29182q206r8160M8935L7773o7166L0498K520
12579G06063m3584R704k1573j94507k21536n3268K850O2395O2462J55067J90388
12568F54461j77112m3324j47978m5490J35712J08396J45341l4708k047L8863R7271
12557G29385M8005m2578L4890N2222J9641O832j27855j26739o9500M6023J7837
12546E88163j0718l3032L9016j97731j56337j16242J1237J83257J73786k5097
12536D56302q9597J6587J02444j1176j2916N9131J17905k6191k05772j10531N4332
12525C50518K06668J25856m1112J3935O7842l7387j56512m450J8227k9840O984
12514E20729J9839L9519j8194o8487j4795J04100l2462l9021L7259o0562r245
$$ y = [895771, 747141, 608444, 630687, 759869, 751663, 653503, 702438, 740211, 673045, 703543, 706063, 662479, 672183, 650610, 456103, 234567, 181299, 184149, 246544, 309006, 464073, 654461, 477349, 434025, 286047, 240557, 376269, 484665, 630006, 595298, 593251, 632114, 729385, 777390, 734812, 769702, 821924, 841565, 848397, 720542, 593803, 524303, 570326, 588163, 577445, 544413, 583429, 385698, 229361, 113119, 124356, 307613, 481399, 456302, 366705, 383292, 485736, 474560, 461644, 520775, 638680, 612489, 406717, 296186, 350518, 557186, 683042, 641930, 655865, 723707, 686320, 529808, 525358, 543585, 513745, 520729, 540568, 580087, 561893, 493406, 478611, 582711, 550249, 511228, 548487, 487925, 478680]
12503D78680O9436r302n1265K2396j49224l4861J05378K6137j46250p9805J13262
12492C44582O8501k951Q7362k5928r757o0935p7079M3337K135J46457J87427q9600
12480F13551m938m3648j2841r9996m5484p2559O0852L1153J51623k0135j30692
12469D26886J05954l0543j44704j7764J75616K25953j00692j54581L088j06895
12459C82318r3191N1871J25660p2578q8369L9708j6272M0540L7447L3986J00802
12448E41922K5598l7175P9922P6539p1972j8407l4938l4552n2367k5233J00772
12437E50109N3228o0469j53405j92197Q4033J41605M2644r4543q5176M8450m68
12426C33811K7836J3058J844J39825J4654K1347p7566q5713p456o4130L0660J04288
$$ y = [478680, 548116, 538814, 487549, 509945, 360721, 325860, 431238, 457375, 311125, 231320, 344582, 413083, 410132, 497494, 471566, 461809, 400874, 323795, 367132, 369267, 515724, 703151, 613551, 608613, 564965, 552124, 452128, 406644, 334085, 394937, 426090, 577713, 557578, 426886, 532840, 502297, 357593, 339829, 515445, 741398, 640706, 486125, 489213, 382318, 289127, 340998, 466658, 394080, 305711, 345419, 329147, 369687, 407134, 441120, 541922, 567520, 530345, 610267, 686806, 614834, 596427, 561489, 526937, 474570, 449337, 550109, 603337, 542868, 389463, 197266, 281299, 422904, 465548, 371005, 285829, 334279, 333811, 361647, 374705, 376549, 516374, 531028, 552375, 474809, 389096, 381640, 317510, 348170, 452458]
12414D52458N1912O0180N7519r7461k0646K1349n1302o8646P1534J65375m4525
12403E97747j9367J7555J1287R6147l3913P9199n216o0966O6577p9692j02838
12392E66520K6880l4681j6251O252J92242K5673n1700j30031j7840J36188O796
12381G10048j40973k4968J79745O8232O3742P4803q0207k2276m2585K759m1958
12370G46362j13627j00601p5883J58326K8057l392O0763p0450M9592J10329R018
12359G98494Q415K9671r5997n9038M6924Q4597m797L0087Q185l4792n8973j16045
12347F36731O2047O1607O9011J6072L6479R882O96j12813l4267o2761R7849L9759
12335H20292J94L6057j9690K3885p510p7287o6660J033L4335n7882K5427k5098
$$ y = [452458, 504370, 564550, 622069, 524608, 503962, 525311, 474009, 405363, 476897, 642272, 597747, 578380, 595935, 607222, 703369, 669456, 748655, 743439, 682473, 749050, 669358, 566520, 593400, 558719, 542468, 548720, 740962, 766635, 714935, 584904, 567064, 703252, 710048, 569075, 544107, 723852, 792084, 855826, 930629, 850422, 828146, 785561, 788320, 746362, 632735, 532134, 456251, 614577, 642634, 639242, 700005, 629555, 679147, 789476, 798494, 806909, 836580, 740583, 681545, 728469, 813066, 808269, 838356, 846541, 811749, 752776, 636731, 698778, 760385, 829396, 845468, 881947, 891829, 892525, 779712, 745445, 682684, 780533, 820292, 820486, 856543, 836853, 860738, 853228, 775941, 709281, 710314, 744649, 686767, 712194, 687096]
12323F87096J25570k8362r0164O2853Q2611k5172K011J13852j9412j04500r221
12312G97162m3660R1325N2006Q573l1644J6403J61029p7188o8681n2052j32836
12301G20437p6463j5184J82537J1036J7314q17j1309Q4228J8692k1919J8260k3461
12289I03351N3780K7482l3860J4450L9545J16934R3396j70917m3403p1757l3355
12278H95646J53594n1762p2152M1683o0708j30606j7985N0765J65345j9766q8925
12267H65129O1192q582J16468m7397p1819l6962N7856J13355J05940o3330N4007
12256A145857Q2718K7225q0869P8496M0859n8039p1587K6525K0078k1899p7823
12245A111541r015J36003l4766j84646o4283J11963K30763J12708n3707l392o360
$$ y = [687096, 812666, 784304, 694140, 756993, 839604, 814432, 816443, 930295, 910883, 806383, 797162, 753502, 844827, 896833, 905406, 873762, 890165, 1051194, 974006, 905325, 853273, 720437, 643974, 628790, 811327, 822363, 839677, 838860, 827551, 911779, 930471, 908552, 926812, 903351, 957131, 984613, 950753, 965203, 1004748, 1121682, 1215078, 1044161, 1000758, 929001, 895646, 1049240, 997478, 925326, 967009, 906301, 775695, 757710, 808475, 973820, 954054, 865129, 926321, 917739, 1034207, 986810, 914991, 878029, 935885, 1049240, 1155180, 1091850, 1145857, 1228575, 1255800, 1174931, 1253427, 1294286, 1236247, 1164660, 1191185, 1211263, 1189364, 1111541, 1102526, 1238529, 1203763, 1019117, 954834, 1066797, 1297560, 1410268, 1356561, 1353169, 1346809]
12234A346809o7076m0800M5908M1433J14943n3954K1832j5157o5424k2381n3737
12223A252396Q7434J39640J33165q5172M0723q402q0618L9639L0994j10949j440
12212A437410J33874K1337j11147k9073O3827l7062L767J38400J75567J4094j0513
12201A800481J6239P0612l8679j9934j88013j13168M003J56144J36815p1565O1522
12190A814457j3243r5846q7592k5071O6193K9547J58446J03855j34301j56977
12180A659468k5700R8322J83610J16951N3088J59577O210m1004K0930J2672o7524
12169B176600O8352N5137j7837m5412q996J84862K0718k17692j03145J21789m9265
12158B185111N1762Q9126p4647j4011N054j5704N8288P1944P696J4952K5815O554
$$ y = [1346809, 1279733, 1238933, 1284841, 1326274, 1441217, 1387263, 1409095, 1393938, 1328514, 1306133, 1252396, 1339830, 1479470, 1612635, 1527463, 1568186, 1559784, 1479166, 1518805, 1549799, 1438850, 1437410, 1571284, 1592621, 1481474, 1452401, 1516228, 1479166, 1482933, 1621333, 1796900, 1810994, 1800481, 1816720, 1887332, 1848653, 1828719, 1640706, 1527538, 1531541, 1687685, 1824500, 1752935, 1814457, 1801214, 1705368, 1617776, 1592705, 1658898, 1688445, 1846891, 1950746, 1816445, 1659468, 1633768, 1732090, 1915700, 2032651, 2085739, 2245316, 2251526, 2210522, 2231452, 2244124, 2176600, 2244952, 2300089, 2282252, 2236840, 2227844, 2412706, 2433424, 2215732, 2112587, 2234376, 2185111, 2236873, 2325999, 2251352, 2237341, 2242395, 2226691, 2284979, 2356923, 2364619, 2379571, 2405386, 2411940]
12146B411940r3455j6240J29433K201R9319J22410P8831Q7694K3035m6276o568
12135B792324Q1648k5859N3568q551j27954o2122P0123J15634N7448R978p8532
12124B877705K02580Q0125M3759j2298J56632k6513j20245O7125L4671q2869K4866
12113C245538J27206J88511k8936j06323j074N1692Q5958J61756q1111L6033J99707
12102C878957O9921k7476o5161O3513J43379N148L0666J0090P6830J54411k115
12091D338163j35859m8050J56047J53598j21661q5148K8130J39201Q9984Q1038
12081D595443J22050O6544J2529Q4654J48294J82843O9067j51893R2573J77615
12071E399719J3348n544M4611O7701J32128N1697j0613K6812J35754K81700K7285
$$ y = [2411940, 2318485, 2302245, 2431678, 2433879, 2533198, 2655608, 2734439, 2822133, 2845168, 2798892, 2792324, 2873972, 2848113, 2901681, 2893130, 2765176, 2703054, 2773177, 2888811, 2946259, 2956237, 2877705, 3080285, 3160410, 3204169, 3191871, 3348503, 3321990, 3201745, 3268870, 3303541, 3220672, 3245538, 3372744, 3561255, 3532319, 3425996, 3424922, 3476614, 3562572, 3724328, 3643217, 3679250, 3878957, 3948878, 3921402, 3856241, 3919754, 4063133, 4068281, 4098947, 4109037, 4185867, 4340278, 4338163, 4202304, 4154254, 4310301, 4463899, 4342238, 4257090, 4285220, 4424421, 4514405, 4595443, 4717493, 4784037, 4796566, 4881220, 5029514, 5212357, 5281424, 5129531, 5222104, 5399719, 5413067, 5407523, 5452134, 5519835, 5651963, 5703660, 5693047, 5719859, 5855613, 6137313, 6164598]
12060F164598k3334P5382J98518J45341N1703M4179K7203l9838L6239P408R9030
12049F786429J74493J58716P9080Q3999P9333J93143J87340K18308J07669J40569
12039H209079P3621J48144J31156P5265J47655O6620L4499K28271N4944O5247
12029I234501J26401K50853L09736K73170J56654J512N5716J85455J67102K18549
12019A0979649J78764J14350J25238K71206J37995J08741Q8434L41760L15649
12010A2661786K85246K34015L73535K83398K55290J90996J28459J03010K61386
12001A4777121K40101L59872L48877K95671J86491J61649L27789M18360K76206
11992A7392137L18717L48544K85238K49233K78810L80484L94949L63418M97371
$$ y = [6164598, 6141264, 6216646, 6415164, 6560505, 6612208, 6656387, 6683590, 6643752, 6679991, 6687399, 6786429, 6960922, 7119638, 7198718, 7282717, 7362050, 7555193, 7742533, 7960841, 8068510, 8209079, 8282700, 8430844, 8562000, 8637265, 8784920, 8851540, 8886039, 9114310, 9169254, 9234501, 9360902, 9611755, 9921491, 10194661, 10351315, 10352827, 10408543, 10593998, 10761100, 10979649, 11158413, 11272763, 11398001, 11669207, 11807202, 11915943, 12004377, 12346137, 12661786, 12947032, 13181047, 13554582, 13837980, 14093270, 14284266, 14412725, 14515735, 14777121, 15017222, 15377094, 15725971, 16021642, 16208133, 16369782, 16697571, 17115931, 17392137, 17710854, 18059398, 18344636, 18593869, 18872679, 19253163, 19648112, 20011530, 20508901]
11983B0508901M05531L82017M31857N10341L35304L85168N05211M37233M11983
11974B4313546M43158N81332N12578N98765N05516L11539M01219N15082O78398
11965B8861133M81157L41742M99279O00215O38002N28240N31921M54375M12675
11956C3348739N47079N80974M27941L97035N24985N04007M93831L59289K49655
11947C7433535M23783L77388L95349L40554L36610N08115M83512J86579L3342
11938D0518767P4363J76379K73977K77208K50979J20718L9142L8539O5174J0931
11928D1846177m2478l7430k40786j87859j95348j29138k19360k56145l47588l16472
11918C9873573l68006k73131k86177l08903m73049n03009l97401l58208l69410
$$ y = [20508901, 20914432, 21296449, 21728306, 22238647, 22573951, 22959119, 23464330, 23901563, 24313546, 24756704, 25338036, 25850614, 26449379, 26954895, 27266434, 27667653, 28182735, 28861133, 29342290, 29684032, 30183311, 30783526, 31421528, 31949768, 32481689, 32936064, 33348739, 33895818, 34476792, 34904733, 35301768, 35826753, 36330760, 36824591, 37183880, 37433535, 37857318, 38234706, 38630055, 38970609, 39307219, 39815334, 40298846, 40485425, 40518767, 40593130, 40769509, 41043486, 41320694, 41571673, 41692391, 41731533, 41770072, 41835246, 41846177, 41803699, 41766269, 41525483, 41337624, 41142276, 41013138, 40793778, 40537633, 40190045, 39873573, 39505567, 39232436, 38946259, 38637356, 38164307, 37661298, 37263897, 36905689, 36536279]
11909C6536279m35540n12415n76552m25628n11670n58701m72224n23697m65370
11900C2054482n30969n61131m02675m89368o14886m91321o20222l11146m10506
11891B7622258m99908n87178m86592o84262n65307l88359l63915l92240m85975
11882B3168522m63011m09507m33903m76529l71113m49867l69892m10303k12520
11873A9571877l25554n00193l69840k56454k56299l89864m14378m02060k75858
11864A6381377l32281l41575k14039j47812k76037l59026m56131j82524j57998
11855A3913954j98751l12974k91403l23689l41060k24895k28335r7694p4520k83130
11845A1537503k52134l11282j77815j76039j04826k6644j87019k81930j27671
$$ y = [36536279, 36100739, 35588324, 35011772, 34586144, 34074474, 33515773, 33043549, 32519852, 32054482, 31523513, 30962382, 30559707, 30070339, 29455453, 28964132, 28343910, 28032764, 27622258, 27122350, 26535172, 26048580, 25364318, 24799011, 24410652, 24046737, 23654497, 23168522, 22705511, 22296004, 21862101, 21385572, 21014459, 20564592, 20194700, 19784397, 19571877, 19246323, 18746130, 18376290, 18119836, 17863537, 17473673, 17059295, 16657235, 16381377, 16049096, 15707521, 15493482, 15345670, 15069633, 14710607, 14254476, 14071952, 13913954, 13715203, 13402229, 13110826, 12787137, 12446077, 12221182, 11992847, 11895153, 11820633, 11537503, 11285369, 10974087, 10796272, 10620233, 10515407, 10488763, 10301744, 10019814, 9892143]
11836I892143j71186j07041j43169j50921j62959j53628j90291k7725j33548j67575
$$ y = [9892143, 9720957, 9613916, 9470747, 9319826, 9156867, 9003239, 8812948, 8785223, 8651675, 8484100]
$$ [...]
##END NTUPLES=NMR SPECTRUM
##END=
