##TITLE=Analysis number 318461
Compound Code mo 07286
Project Code adrs
Chemist Name fudan
##JCAMPDX= 6.0         $$ Bruker NMR JCAMP-DX V2.0
##DATA TYPE= NMR SPECTRUM
##DATA CLASS= NTUPLES
##ORIGIN= Bruker BioSpin GmbH
##OWNER= nmr
$$ XWIN-NMR		Version 3.5
$$ Wed Mar 29 13:57:40 2006 GMT Daylight Time (UT+1h)  MAYBRIDGE\nmr@NMR_250MHZ
##.OBSERVE FREQUENCY= 250.131544655141
##.OBSERVE NUCLEUS= ^1H
##.ACQUISITION MODE= SIMULTANEOUS (DQD)
##.ACQUISITION SCHEME= undefined
##.AVERAGES= 16
##.DIGITISER RES= 18
##SPECTROMETER/DATA SYSTEM= dpx250
##.PULSE SEQUENCE= zg30
##.SOLVENT NAME= CDCl3
##.SHIFT REFERENCE= (INTERNAL, CDCl3, 0, 16.522)
##AUDIT TRAIL= $$ (NUMBER, WHEN, WHO, WHERE, WHAT)
$$ ##TITLE= Audit trail, XWIN-NMR		Version 3.5
$$ ##JCAMPDX= 5.01
$$ ##ORIGIN= Bruker BioSpin GmbH
$$ ##OWNER= nmr
$$ C:\u/data/dgb/nmr/ADRS/1730/pdata/1/auditp.txt
$$ ##AUDIT TRAIL=  $$ (NUMBER, WHEN, WHO, WHERE, WHAT)
(   1,<2006-03-29 13:57:15.03 +100>,<MAYBRIDGE\nmr>,<NMR_250MHZ>,
      <created by zg, POWCHK disabled, PULCHK disabled
       configuration hash MD5:
       84 BC 41 DB A1 6E 1D 46 DA 25 12 A5 C1 ED C5 3A
       data hash MD5: 64K
       4B 7E 9E 56 7B 1D 2E 7D 5B A4 E0 F4 A3 95 F8 86>)
(   2,<2006-03-29 13:57:30.02 +100>,<MAYBRIDGE\nmr>,<NMR_250MHZ>,
      <Start of raw data processing
       ef LB = 0.3 FT_mod = 6 PKNL = 1 SI = 32K 
       data hash MD5: 32K
       30 C1 F5 B0 7B 02 F4 64 8F AF E2 B6 94 94 72 14>)
(   3,<2006-03-29 13:57:31.53 +100>,<MAYBRIDGE\nmr>,<NMR_250MHZ>,
      <apk 
       data hash MD5: 32K
       DB 58 40 08 C5 61 B8 34 D3 6A F3 8C D4 70 F8 99>)
(   4,<2006-03-29 13:57:32.69 +100>,<MAYBRIDGE\nmr>,<NMR_250MHZ>,
      <abs ABSG = 5 
       data hash MD5: 32K
       AE 6B CF E3 32 30 9A 6B 97 BD C2 D7 06 AB 80 27>)
$$ ##END=
$$ 
$$ hash MD5
$$ 97 50 A6 DB 4E 5B A5 68 F2 FA 95 24 72 15 05 65
##$RELAX= 
##$RELAX= 
##$RELAX= 
##$RELAX= 
##$RELAX= 
##$RELAX= 
##$RELAX= 
$$ Bruker specific parameters
$$ --------------------------
##$DU= <C:\u>
##$EXPNO= 1730
##$NAME= <ADRS>
##$PROCNO= 1
##$TYPE= <nmr>
##$USER= <dgb>
##$AMP= (0..31)
100 100 100 100 100 100 100 100 100 100 100 100 100 100 100 100 100 100 
100 100 100 100 100 100 100 100 100 100 100 100 100 100 
##$AQSEQ= 0
##$AQ_mod= 3
##$AUNM= <au_zg>
##$AUTOPOS= <33 >
##$BF1= 250.13
##$BF2= 250.13
##$BF3= 250.13
##$BF4= 250.13
##$BF5= 500.13
##$BF6= 500.13
##$BF7= 500.13
##$BF8= 500.13
##$BYTORDA= 1
##$CFDGTYP= 0
##$CFRGTYP= 5
##$CHEMSTR= <none>
##$CNST= (0..31)
1 1 145 1 1 1 1 1 1 1 1 1 1 1 1 1 1 1 1 1 1 1 1 1 1 1 1 1 1 1 1 1 
##$CPDPRG= <>
##$CPDPRG1= <>
##$CPDPRG2= <>
##$CPDPRG3= <>
##$CPDPRG4= <mlev>
##$CPDPRG5= <mlev>
##$CPDPRG6= <mlev>
##$CPDPRG7= <mlev>
##$CPDPRG8= <mlev>
##$CPDPRGB= <>
##$CPDPRGT= <>
##$D= (0..31)
0 1 0 0 0 0 0 0 0 0.06 0 0 0 0 0 0 0.0002 0 0 0 0 0 0 0 0 0 0 0 0 0 0 
0 
##$DATE= 1143637034
##$DBL= (0..7)
120 120 120 120 120 120 120 120 
##$DBP= (0..7)
150 150 150 150 150 150 150 150 
##$DBP07= 0
##$DBPNAM0= <>
##$DBPNAM1= <>
##$DBPNAM2= <>
$$ [...]
##$SUBNAM7= <"">
##$SUBNAM8= <"">
##$SUBNAM9= <"">
##$SW= 20.6930455092707
##$SWIBOX= (0..15)
0 0 3 0 0 0 0 0 0 0 0 0 0 0 0 0 
##$SW_h= 5175.983436853
##$TD= 65536
##$TD0= 1
##$TE= 294.16
##$TE2= 300
##$TE3= 300
##$TEG= 300
##$TL= (0..7)
0 120 120 120 120 120 120 120 
##$TP= (0..7)
150 150 150 150 150 150 150 150 
##$TP07= 0
##$TPNAME0= <>
##$TPNAME1= <>
##$TPNAME2= <>
##$TPNAME3= <>
##$TPNAME4= <>
##$TPNAME5= <>
##$TPNAME6= <>
##$TPNAME7= <>
##$TPOAL= (0..7)
0.5 0.5 0.5 0.5 0.5 0.5 0.5 0.5 
##$TPOFFS= (0..7)
0 0 0 0 0 0 0 0 
##$TUNHIN= 0
##$TUNHOUT= 0
##$TUNXOUT= 0
##$USERA1= <user>
##$USERA2= <user>
##$USERA3= <user>
##$USERA4= <user>
##$USERA5= <user>
##$V9= 5
##$VALIST= <valist>
##$VCLIST= <CCCCCCCCCCCCCCC>
##$VD= 0
##$VDLIST= <DDDDDDDDDDDDDDD>
##$VPLIST= <PPPPPPPPPPPPPPP>
##$VTLIST= <TTTTTTTTTTTTTTT>
##$WBST= 1024
##$WBSW= 4
##$XGAIN= (0..3)
0 0 0 0 
##$XL= 0
##$YL= 0
##$YMAX_a= 505729
##$YMIN_a= -499881
##$ZGOPTNS= <>
##$ZL1= 120
##$ZL2= 120
##$ZL3= 120
##$ZL4= 120
##$ABSF1= 16.522
##$ABSF2= -4.171173
##$ABSG= 5
##$ABSL= 3
##$ALPHA= 0
##$AQORDER= 0
##$ASSFAC= 0
##$ASSFACI= 0
##$ASSFACX= 0
##$ASSWID= 0
##$AUNMP= <proc_1d>
##$AZFE= 0.1
##$AZFW= 0.1
##$BCFW= 0
##$BC_mod= 0
##$BYTORDP= 0
##$COROFFS= 0
##$CY= 12.5
##$DATMOD= 1
##$DC= 0
##$DFILT= <>
##$DTYPP= 0
##$F1P= 14.0000005364418
##$F2P= -0.99999901652339
##$FCOR= 0.5
##$FTSIZE= 32768
##$FT_mod= 6
##$GAMMA= 0
##$GB= 0
##$INTBC= 1
##$INTSCL= 1
##$ISEN= 128
##$LB= 0.3
##$LEV0= 0
##$LPBIN= 0
##$MAXI= 10000
##$MC2= 0
##$MEAN= 0
##$ME_mod= 0
##$MI= 0
##$NCOEF= 0
##$NC_proc= -2
##$NLEV= 6
##$NOISF1= 0
##$NOISF2= 0
##$NSP= 0
##$NTH_PI= 0
##$NZP= 0
##$OFFSET= 16.522
##$PC= 1
##$PHC0= 170.9315
##$PHC1= 4.491553
##$PH_mod= 1
##$PKNL= yes
##$PPARMOD= 0
##$PSCAL= 4
##$PSIGN= 0
##$REVERSE= no
##$SF= 250.13
##$SI= 32768
##$SIGF1= 0
##$SIGF2= 0
##$SINO= 400
##$SIOLD= 32768
##$SREGLST= <1H.CDCl3>
##$SSB= 0
##$STSI= 32768
##$STSR= 0
##$SW_p= 5175.98343685301
##$SYMM= 0
##$S_DEV= 0
##$TDeff= 65536
##$TDoff= 0
##$TI= <Analysis number 999999
Compound Code 99
Book Reference 9
Project Code 9>
##$TILT= no
##$TM1= 0
##$TM2= 0
##$TOPLEV= 0
##$USERP1= <user>
##$USERP2= <user>
##$USERP3= <user>
##$USERP4= <user>
##$USERP5= <user>
##$WDW= 1
##$XDIM= 32768
##$YMAX_p= 381441433
##$YMIN_p= -358695
$$ End of Bruker specific parameters
$$ ---------------------------------
##NTUPLES= NMR SPECTRUM
##VAR_NAME=  FREQUENCY,     SPECTRUM/REAL,   SPECTRUM/IMAG
##SYMBOL=    X,             R,               I
##VAR_TYPE=  INDEPENDENT,   DEPENDENT,       DEPENDENT
##VAR_FORM=  AFFN,          ASDF,            ASDF
##VAR_DIM=   32768,         32768,           32768
##UNITS=     HZ,            ARBITRARY UNITS, ARBITRARY UNITS
##FACTOR=    0.157963299565203, 1,           1
##FIRST=     4132.6476996994, 0,             0
##LAST=      -1043.33573715361, 0,           0
##MIN=       -1043.33573715361, -358695,     0
##MAX=       4132.6476996994, 381441433,     0
$$ Real data points
##PAGE= N=1
##DATA TABLE= (X++(R..R)), XYDATA
$$ [...]
19512 10626 11875 5761 1939 -6548 -21640 -33478 -30599 -15713 -14949 -18319 -25503 -32798 -24542 -19059
19498 -19059 -15795 -3200 -6729 -2794 5653 -3413 -24063 -7848 5622 3649 -1669 1793 2851
19485 2851 -4866 -8122 -6599 5458 -382 -6538 -13335 -15346 -16297 -22931 -23712 -21207 -32324 -29427 -31944
19470 -31944 -18303 -27364 -27698 -25992 -25643 -20030 -6224 9417 12894 -2413 -5744 -20446 -33711
19457 -33711 -24883 -17510 -26305 -17168 -9030 -16397 -25321 -19101 -2053 -5905 -8501 -2080 -11963 -20616
19443 -20616 -12111 -12382 -22860 -22206 -5502 9548 8325 8424 -10172 -18129 -9542 2565 15482 11947
19429 11947 -2661 -7499 -28360 -20760 -254 6861 7541 10683 9048 5982 30896 17305 1179
19416 1179 7214 5970 1461 -439 10877 22771 10788 514 -8677 4531 4692 -1763 -3505 8124
19402 8124 18750 20289 26602 30343 28943 22923 3947 -1696 8511 16607 5584 3495 12608 5670
19388 5670 -17741 -27081 -20843 -12187 11712 24757 10473 -16686 -21553 -20015 -31370 -33996 -28184
19375 -28184 -36755 -22215 -14618 -22298 -24381 -25247 -3954 5734 2187 10557 7485 8315 25766 13455
19361 13455 -11574 -25610 -35022 -15647 -6805 2378 -3460 -1702 7905 4448 -14225 -16893 -5485
19348 -5485 -7814 -434 8051 431 -12489 -15528 -2536 -16520 -21650 -17390 -14566 -20023 -21230 -15564
19334 -15564 -8999 -11425 -15007 -9167 -3143 -11216 -7471 -8653 -21745 -28237 -33392 -32585 -26764 -19213
19320 -19213 -5952 -2240 -8165 -16909 -4258 -4621 -20096 -13524 3451 1756 4068 9656 -632
19307 -632 -3959 -2702 -28575 -17729 5748 18139 25714 29105 37987 22827 9446 -2473 -4425
19294 -4425 13325 9836 1077 -3210 10365 9358 2530 520 -8949 -12384 -25352 -21468 -12183 2626
19280 2626 8532 15338 23287 16557 -684 -7416 259 4614 8248 14165 18601 13585 5020 7899
19266 7899 1570 -12641 -20041 -25313 -31383 -28283 -29293 -30078 -30217 -26165 -16753 -15724 -4907 6196
19252 6196 -3657 -19407 -11691 -9485 -15215 -24367 -36602 -28860 -18781 -24198 -23705 -14531 -2872 -21787
19238 -21787 -26489 -19051 -22043 -21011 -17165 -250 14290 14660 6973 -2937 -8981 -21899 -31009 -22275
19224 -22275 -11245 6610 3251 538 6332 -2997 -8844 -5804 -3361 -16009 -16858 -5743 -958 -3217
19210 -3217 -9076 -16537 -13002 -6803 -13363 -23323 -29748 -20421 1317 6688 -3472 -14963 -15872 -24752
19196 -24752 -21621 -33623 -33278 -31048 -18786 -5067 12598 14077 17479 13 -17006 -29305 -17898
19183 -17898 -5334 -3469 -2532 -3492 5923 13540 21740 5104 -5881 -19728 -10570 -28429 -36756 -27605
19169 -27605 -37233 -19230 150 7039 7788 -5632 -20476 -25628 -18826 -7596 -1573 -9010 944
19156 944 12626 6248 -5349 -2097 7978 9327 10188 20736 13939 -610 -2662 2054 -10221 -20577
19142 -20577 -30123 -27912 -18404 3086 12770 5334 13596 13565 16851 -2691 -12313 -11117 -15002 -29284
19128 -29284 -36464 -17901 2328 -2636 -3506 -1314 -10589 -23858 -18623 -7465 -5760 -15641 -7775 -1806
19114 -1806 3824 3467 -10222 -12722 -19011 -31283 -36692 -39593 -29140 -14898 -13600 -20266 -23212 -28601
19100 -28601 -17364 -11348 -16304 -22451 -34415 -37056 -27769 -11893 -3401 8134 13165 9989 21350
19087 21350 21005 9201 -9309 -15274 -19765 -4576 -5080 -11280 -9805 -12910 -12429 -10619 -5881 -9637
19073 -9637 -14002 -5849 -8158 -16305 -19185 -18154 -32980 -22747 -27914 -23769 -19541 -22823 -17511 -7484
19059 -7484 -24693 -30719 -18251 -6972 -2570 -15993 -22728 -17428 -9344 -413 -2645 -15800 -17309
19046 -17309 2168 3335 -3465 4867 -2643 -2460 2000 15629 22925 9260 11898 3358 -5819 -20545
19032 -20545 -31148 -18815 -16810 -10555 2689 14470 15257 357 1767 -3509 -19138 -11897 4111
19019 4111 12419 1042 -3145 -13267 -34660 -35152 -37596 -47008 -27727 -12502 -413 2616 1863 -2433
19005 -2433 -11993 -10113 -9908 -31061 -40993 -32273 -18573 -5313 -18038 -23353 -37730 -27499 -20959
18992 -20959 -4073 -24393 -35659 -19452 -17346 -23988 -23008 -14894 2572 10685 6529 23568 32733
18979 32733 19515 -11957 -30731 -33297 -23239 -5138 20448 12620 5315 5070 3490 20922 14600
18966 14600 21035 7721 8947 5164 1566 -11242 -21075 -12227 -23830 -24945 -13295 249 11004
18953 11004 24143 16502 6389 8786 789 -3351 -5425 -17183 -27987 -37357 -35883 -12027 6004
18940 6004 -3439 -18778 -12592 -18017 -27973 -31330 -27008 -21839 -23177 -30091 -22487 -12464 -5381 -9587
18926 -9587 -26815 -31276 -5315 3722 848 -156 -14587 -8046 -10655 -22190 -33963 -19731 -8356
18913 -8356 1944 3962 -11998 -10018 -3266 -3137 -14635 -18620 -22435 -22057 -28111 -27041 -14160 -2514
18899 -2514 -2385 -15777 -29443 -28160 -8185 -3435 6340 -5260 -27723 -30799 -24090 -16680 -22998 -27845
18885 -27845 -23031 -2379 4720 7921 8345 -6377 -11791 -25489 -30424 -16369 -1289 -2563 1543
18872 1543 -8285 1273 -6513 -9421 1166 -9669 -18204 -22084 -20177 -36311 -44331 -17656 9466
18859 9466 17658 4631 -21000 -31277 -40619 -38846 -29041 -7513 -1886 -8314 -10598 -22360 -19789
18846 -19789 1711 2163 -17666 -42058 -36323 -21364 -10505 -20174 -15154 -15622 -18280 -14740 -2377
18833 -2377 -7591 -24483 -30797 -6501 19285 28066 14130 110 -8270 4567 -2322 2266 9667
18820 9667 -1535 1947 8993 7865 4484 -6916 -13647 2074 6073 7732 1507 -13778 -9355 -2671
18806 -2671 11376 9556 5127 -2939 -17292 -28725 -21910 -13819 -9359 6522 32127 31511 25484 14231
18792 14231 9780 13719 16408 15202 20792 14010 13132 14132 19708 20672 10360 -2707 -21147 -16830
18778 -16830 2665 3514 -7907 -7015 -11908 -2627 -5614 -12826 -17618 -6425 6429 19693 30893
18765 30893 51513 114208 160893 136745 98520 79329 63303 44271 33466 40707 44204 27006
18753 27006 14892 14106 26318 16315 16101 24772 27216 22576 21409 25053 35778 33088 31817 18193
18739 18193 -1084 14117 24008 27212 -3962 -18459 693 15069 7352 -1640 -1384 -11992 -14127
18726 -14127 -11738 -5684 4542 -1292 -4269 -17683 -15651 -6440 -6874 -923 7495 7799 5609 -5613
18712 -5613 7603 10606 15563 45773 54095 55761 47152 41493 49951 49590 46230 41504 43853 30213
18698 30213 26619 15660 9206 3755 -12871 1376 7035 -1407 -14764 -30974 -33562 -23328 -29734
18685 -29734 -34404 -16512 -1042 12598 -2120 -8636 5355 9945 -1871 -10666 -13172 -13779 -18539
18672 -18539 -28379 -33206 -24372 -24416 -14554 -20381 -34960 -17121 1036 19172 26412 21478 24905 38931
18658 38931 42777 45259 50706 55836 47143 54544 51242 41673 31765 28122 41379 34558 21429 29802
18644 29802 32993 28262 42809 59732 80967 82007 66540 75997 88879 98027 110236 112306 129231
18631 129231 128738 121281 115362 121554 124682 123905 111706 102996 97371 100838 105466 105743 101684 82691
18617 82691 72522 67769 56914 42080 27436 32287 21084 21675 19151 19745 27818 24371 25220 27831
18603 27831 18323 19538 19705 -2345 -6873 -3153 9611 -1413 -525 -2194 7851 21359 37038
18590 37038 52089 61567 49280 40317 37762 45825 40930 52117 54974 53323 55918 32557 29318
18577 29318 23136 12266 26256 37853 39924 26866 31146 47965 43674 34759 29122 19815 20182
18564 20182 16222 15990 11700 3843 2900 -982 1376 -1902 -914 1481 5037 18822 -2442 -10690 -1027
18549 -1027 8467 15650 13109 26822 43599 57247 63208 49748 35334 31045 28021 26344 34117
18536 34117 27687 24100 29553 32963 40305 31927 17806 4636 -6248 -2875 12224 17379 18045 9449
18522 9449 11840 27326 27337 23017 22214 30747 28081 34070 22461 11943 4575 10464 10848 20419 40772
18507 40772 43933 25405 22385 32715 38969 37808 31617 41339 60275 70411 71169 78016 81620 72168
18493 72168 56632 57503 58487 39836 35707 51124 31410 19053 9156 7394 -6773 -21060 -5705
18480 -5705 6186 4958 10862 11886 13392 32582 27220 17455 13278 17432 14624 17646 5447 2207
18466 2207 3830 6540 20621 27558 27848 26259 29841 17054 11083 5008 5378 9590 15286 11630 22388
18451 22388 28053 24660 6145 430 2341 6325 -1259 -11524 83 -5345 3352 593 -5231 3686
18437 3686 12681 12639 18101 28285 29170 28476 37436 54348 48326 41544 41828 50344 53400 38227 27588
18422 27588 16902 8221 11210 19601 16473 26884 19061 14101 12813 16541 11373 16408 19713 21957
18408 21957 26763 21284 16282 17495 17231 6544 -693 -16321 -12590 -13523 1442 9405 17224 20338
18394 20338 22263 11720 -14133 -26506 -15152 -3059 4739 -1697 -8247 -10241 -1003 3021 -4455
18381 -4455 4055 12926 22493 34293 30552 17022 24322 28886 25143 22831 15305 10310 12078 27672
18367 27672 32803 35134 55182 42364 38653 38909 38755 36333 44730 46567 38491 40623 50660 41963
18353 41963 32007 6280 -7795 941 16203 7103 -850 10496 20697 13489 10124 -12315 -17759
18340 -17759 -11744 -26199 -17192 -751 -896 -18066 -20199 -32592 -19119 5159 4504 9877 8463
18327 8463 6358 8070 375 -4175 7501 20226 9408 705 19162 33979 22993 20380 20503
18314 20503 15690 -1964 4619 -358 -2450 7748 11376 2888 -4820 18575 27547 31430 29606 27944
18300 27944 29274 34182 35883 49889 54051 35077 16462 -992 -841 7822 13695 15780 28096
18287 28096 41878 45239 57376 77031 87769 96769 112297 137311 141437 138070 155847 169777
18275 169777 170617 167151 150422 141531 148486 153268 152653 178305 223563 268041 347502 470328 680016
18262 680016 1016502 1529183 2170377 2792355 3294968 3563741 3657118 3713672 3756395 3694315
18252 3694315 3386284 2842576 2219512 1646725 1221503 942656 759822 645442 559259 486646
18242 486646 409094 356934 316296 307695 314759 329958 348724 353349 370071 383782 408793 451360
18230 451360 514884 564995 589121 572851 538124 529034 551015 605290 691024 819129 997058
18219 997058 1264159 1660901 2313283 3310500 4748684 6532649 8346518 9772465 10661004
18210 10661004 11182194 11724382 12460097 13025012 12819762 11527634 9462425 7279179 5421160
18201 5421160 4074571 3174813 2563381 2140101 1845817 1625154 1465308 1353815 1280009
18192 1280009 1232036 1202309 1176369 1143674 1105528 1058023 1030133 1009739 990119 973781 935618
18181 935618 909039 909418 932969 986276 1077868 1212020 1403664 1683979 2085698 2710577 3665632
18170 3665632 5120886 7049070 9040097 10479715 11041040 11158722 11738641 13332088 15435074
18161 15435074 16789740 16355073 14319747 11789961 9692756 8381088 7844506 7819066 8028952
18152 8028952 8339466 8812040 9545387 10456421 11405488 12285268 13118055 14000279 15058432
18143 15058432 16189747 17176963 18043100 19000395 20219781 21636781 22838082 23542540 24013467
18134 24013467 24603759 24975176 24681046 23903141 23124507 22528696 22084261 21836367 21805923
18125 21805923 21733325 21586586 21516325 21107758 19920269 18287543 16602284 14831950 13040253
18116 13040253 11505114 10356395 9531709 9000828 8774845 8781993 9014387 9765833 11682720
18107 11682720 16167545 25317354 34586864 32562701 23332607 14737934 9851205 7264035
18099 7264035 5791491 4867547 4233553 3804408 3535352 3406791 3412266 3526709 3778608 4087250
18089 4087250 4363274 4615673 4892347 5040543 5007753 4951708 4932317 4915891 4949797 5125647
18079 5125647 5346404 5540915 5747657 5917401 5873175 5637932 5332156 4984891 4576953 4175948
18069 4175948 3877293 3661025 3493093 3398833 3342364 3267508 3176983 3093527 3024015 2971028 2971595
18058 2971595 3063385 3243001 3532511 3908828 4367503 4839318 5330485 5806673 6240088 6608157
18048 6608157 6891810 7144799 7358501 7562370 7810117 8117603 8428661 8737684 9018340
18039 9018340 9227603 9312488 9236253 8998830 8640331 8200974 7750929 7329626 6936363 6576864
18029 6576864 6257450 5990044 5722365 5423880 5077829 4715508 4351552 3972526 3609758
18020 3609758 3274824 2998388 2767348 2575558 2455533 2406053 2406708 2441752 2521909 2650904
18010 2650904 2822246 3028695 3263009 3500337 3716145 3931677 4131134 4308760 4470184
18001 4470184 4619947 4772188 4938754 5110389 5296692 5486598 5650568 5752671 5783348 5765685
17991 5765685 5656124 5483795 5259712 5013018 4763001 4526710 4314121 4122748 3928906
17982 3928906 3748935 3552046 3311741 3071179 2818667 2547948 2277753 2026324 1809972
17973 1809972 1614603 1427485 1272783 1156122 1070551 966937 878107 810936 765900 731079
17963 731079 694513 659332 621751 587130 550824 513645 490480 465835 433749 416497 408833 399991
17951 399991 381060 355361 326214 324712 340883 334690 316871 303485 296199 283686 274403 262285
17939 262285 250586 247189 251995 242933 232042 215449 209139 196656 191195 177624 161647 168348 184320
17926 184320 181859 170946 152954 135668 127197 137274 146852 164352 165053 164588 178805 186261 177259
17913 177259 165909 151875 151091 146970 143880 150590 157495 149693 142978 140389 128222 125614 135924
17900 135924 137006 129615 125134 114735 114890 112494 107991 111315 110124 124284 118163 116950 102385 99979
17886 99979 86756 91891 98260 111228 99518 94959 93814 90802 87011 75166 78281 81773 83870
17873 83870 84189 91505 98431 89569 79873 87478 81767 89584 93525 82128 90076 95279 89122 72542
17859 72542 67667 64352 77714 87058 82297 71632 70629 83876 91250 90884 71901 54088 54102 54045
17845 54045 57487 48238 42851 39939 46777 59267 52586 51319 45981 31651 25539 32522 9366 13473
17831 13473 24694 29918 17802 14862 24307 25680 38446 32600 38997 40025 45139 46716 53264 36709
17817 36709 24291 19484 24878 37000 24238 15921 25115 30349 19837 15686 8084 9182 25602
17804 25602 26806 17688 24464 33175 49926 56561 37840 37224 31988 29527 29493 26716 36688 39148 39974
17789 39974 40144 32437 39840 41727 33042 30093 31191 15734 8952 7709 2307 18752 26904 24459
17775 24459 15605 22152 26810 46170 48075 44089 39709 33706 35257 31653 30929 20604 24187 17513
17761 17513 20638 30385 18842 14682 18048 21193 17432 22180 26233 24618 38349 37142 33820 34439
17747 34439 33572 40084 47086 48705 41892 49293 68938 82442 103077 108800 94869 78460 69519
17734 69519 73284 63168 54412 50451 46392 39302 42427 33959 37602 29821 22393 22999 28207 11920
17720 11920 11538 14172 11729 7080 19319 14592 949 -10513 -6693 4756 3756 8349 17249 15072
17706 15072 19805 26399 29757 26037 17956 12286 6603 12107 28514 34151 34158 43501 56630 55093 72856
17691 72856 82960 89454 89583 86963 97110 104083 74330 49370 45652 45010 36692 31440 29306 32588
17677 32588 23657 27256 6021 13252 28248 20988 23717 17049 21999 29337 26250 19643 13371 10506
17663 10506 14553 7644 12925 15522 28754 49026 53721 60832 77049 90062 90491 90693 101470 112604
17649 112604 111557 104564 104406 113089 120857 145605 163321 161149 176081 165876 155774 144900 143468
17636 143468 127700 117252 118651 113866 109584 98925 86998 76577 92729 96113 90286 90031 92015
17623 92015 91065 84059 79316 76040 62181 55653 61716 57072 47327 36805 30467 27160 29290 27418
17609 27418 18322 17153 36890 37641 33455 43855 52450 44179 47341 42477 42321 46289 33182 17460
17595 17460 14521 22407 30386 32856 35005 34168 32952 30786 28473 19049 18688 36616 46354 46956 41023
17580 41023 33036 20425 28536 34059 45114 45028 43795 45133 53786 51472 60643 57603 45894 42057
17566 42057 51040 50265 47776 43128 26967 16554 9134 15773 27237 40413 32509 15849 33165
17553 33165 31715 25076 25256 18607 23786 33838 32229 39267 51082 62529 61001 53469 63443 65405
17539 65405 56306 57342 48445 40415 55424 72699 81258 62761 52249 42763 43358 35235 35144 33794
17525 33794 24105 26862 25875 36884 47578 34476 25501 39289 52238 47461 40150 46021 36579
17512 36579 24472 29846 35405 27209 27141 12078 22921 31933 28307 21629 7982 -159 5606 7574
17498 7574 12259 26284 31828 28034 22196 28988 38581 38136 36004 34485 31020 20760 13927 10274
17484 10274 7239 -5396 830 16474 16515 18166 10900 -3081 3249 17722 28866 22044 16278 12090
17470 12090 4192 7179 13591 34138 46075 34213 41187 34742 9410 -6839 -3765 1326 801
17457 801 -561 -8363 -729 8114 15102 1796 1674 9444 9163 11062 5825 10201 14708 6946 -79
17442 -79 22373 54634 90666 137151 160794 141059 85653 37387 13979 5612 29418 40361
17430 40361 35791 36185 38330 18452 19821 27570 21263 22056 23750 22910 10893 -2269 1705 -11380
17416 -11380 -18080 -12749 -1183 25264 25865 10814 6692 725 -8889 -27612 -30780 -6948 9799
17403 9799 22208 14377 -9907 -18284 5466 33732 36823 18573 12751 4111 2184 -2229 -6903
17390 -6903 -3806 -1778 -8829 -7797 -6333 -5744 2397 8468 28331 20700 -10077 -11991 -10255 -3050
17376 -3050 9626 9328 7240 7699 13605 38782 42945 36508 11097 7828 15120 15476 17821 12705 -590
17361 -590 -13520 -9420 -6376 9762 17120 26264 17700 21036 5060 -6371 11180 22965 19382
17348 19382 21853 11576 10423 4297 8368 5725 -2900 -5184 -10601 -1595 -4494 7589 20729 20914
17334 20914 25757 26932 20398 19085 13065 -3954 -11480 8777 16605 5035 4573 -5961 -4496 8136
17320 8136 7798 -806 361 2745 -15452 -19647 -7284 4133 8244 2466 1789 -1341 2844 -5966
17306 -5966 -10362 -11110 -5589 8845 7407 -7682 -13934 -16379 -29187 -21941 -9272 -3708 -6699 -5607
17292 -5607 -15580 -18639 -26048 -20165 -9615 162 -4704 -2579 13142 28856 29059 20767 -1494 -2928
17278 -2928 1850 13380 22201 17298 31517 29897 20070 9397 11670 24780 38972 26949 25080
17265 25080 28244 27984 23755 19508 17849 4651 -6850 2636 14048 6863 14183 11162 13636 23295
17251 23295 15861 15615 4085 -2914 -9515 -10340 -16391 -26084 -17722 -10160 -10095 3883 8164 -7672 -6066
17236 -6066 -498 11046 19207 29401 31591 27316 13592 -988 13064 29667 38681 39947 36858
17223 36858 32445 26701 33813 44859 34830 22060 13607 4251 24999 28427 21650 21399 27310 21245
17209 21245 9904 6688 9029 -4037 -6414 -9521 -7725 -9926 -8312 10560 17848 12807 7376 6301
17195 6301 14326 6659 8600 6067 6202 -10218 -8574 -7452 -4677 12997 25563 14694 -3943 391
17181 391 1847 3814 4288 4634 7855 16316 4006 -22636 -19644 -11164 68 375 479 12770 10707
17166 10707 10054 2756 -2245 -11104 -4856 -7399 -20704 -12070 9044 15858 5616 17585 28992
17153 28992 30088 14271 -5064 -8327 5002 19385 23080 36661 29755 15820 17423 13379 4585
17140 4585 -7191 -11834 -21915 -35996 -37091 -24546 -2201 10115 8924 6754 -4653 -4953 -14781
17127 -14781 -12139 -9556 6878 12132 -3097 -27690 -31460 -30768 -17558 -14908 -2957 7025 1174
17114 1174 -14194 -27700 -21626 -13225 -7222 186 7193 10488 9636 3698 -4787 5002 6287 10484
17100 10484 4965 7504 -1561 -18520 -21326 -13155 -5411 9396 13789 4293 4559 -393 -3718 -8241
17086 -8241 -18928 -20307 -1814 5233 5650 -719 1960 7783 4939 14613 12019 8169 25169 35998
17072 35998 31388 17814 23930 14140 4203 -11034 -21708 -14885 -15002 -15984 -4893 -131 -835 -6011
17058 -6011 -9643 -13165 -19922 -22945 -12477 -13963 -8800 -7117 -18175 -25101 -10607 -12881 -14916 -9905
17044 -9905 -14611 -21692 -24160 -18102 -7568 -412 -6035 -6531 -4688 -5799 -22828 -21730 -18926 -4912
17030 -4912 -5267 -3645 -1124 11980 11300 2147 -3115 -10527 -5259 7029 308 3430 4451 8249 -3175
17015 -3175 14279 21051 13747 -16129 -20592 -5757 10264 3576 12186 14715 5325 10300 4128 11250
17001 11250 24528 20718 10022 11412 8764 20015 29606 17173 6561 17113 12294 7351 12944
16988 12944 22481 19543 20016 20948 18365 12249 4765 1425 -5403 -3890 7833 15698 14250 10220 -2377
16973 -2377 15329 30207 28079 18409 15612 12430 23711 15259 9216 -9085 -10582 3592 4891
16960 4891 1448 669 -9797 -16244 -12968 -10780 753 4554 -8664 -10643 -5071 11731 15486 9473
16946 9473 7718 7517 1607 2452 6604 1543 13672 32907 23764 23633 23799 19326 5369 2582 -1893
16931 -1893 -2218 -127 11966 14181 -1642 -766 -5444 -3926 1196 920 -7188 -9275 -1910 2874 10360
16916 10360 9218 11460 6792 -8014 -16038 7 3172 8174 -10030 -9916 -1295 2208 -2152 -6145
16902 -6145 -11520 -23746 -26059 -3253 6832 -921 -14750 -9289 -3887 -5647 -11766 -19117 -9701 -1650
16888 -1650 -1946 -16254 -15199 -9158 -3683 -9087 -3583 -4329 -23071 -31399 -23959 -17984 -8928 1463
16874 1463 -2132 -1849 8802 -7023 -19714 -23857 -3685 -3268 -1611 -7442 -868 -4309 -12575 -31848
16860 -31848 -25376 -8150 9284 20997 28476 30023 26584 8800 11869 -3749 -4003 9991 4295
16847 4295 5168 19986 4188 -10910 -12127 -7011 -10671 -10511 -4554 6374 28419 10562 -6318
16834 -6318 -25388 -40143 -34108 -39467 -34046 -37515 -25958 -2432 -8820 -16551 -10497 -11782 -7336 17179
16820 17179 20995 6107 -5223 -10806 -3875 4080 -2735 -2613 -1769 -4789 -1029 5853 3088 4682
16806 4682 -1995 -11454 -7769 -5442 1986 18177 12261 5737 -2722 -5913 -1475 -5677 -15462 -18563
16792 -18563 -5865 21071 22171 14053 16610 11972 1747 -8341 -10422 7963 29531 38634 45744
16779 45744 44768 32396 20180 13095 15966 10960 22511 30852 14585 -3418 4969 3174 -5019
16766 -5019 -4058 1202 2677 -3529 12587 18239 6732 3503 12688 23485 19977 20768 18660 -2442
16752 -2442 -19732 -18377 -6348 -10100 -10230 -8349 -6566 -1505 553 -3552 -9995 174 10152 11326
16738 11326 5026 -2158 8966 8454 -3595 1645 -3979 -13339 -3990 -2924 2167 2761 1112 3276
16724 3276 10085 -2284 -14935 5477 23762 29844 35322 38065 30875 23820 21087 8964 6312
16711 6312 -11607 -8921 -3291 4356 9601 8220 6653 540 -5850 -10388 -24688 -39854 -33114 -35483
16697 -35483 -26105 -17292 -1756 -4694 -14522 -11625 -7710 4947 18604 1278 -399 6813 5747
16684 5747 -3948 -6809 -1904 7637 1067 -664 1204 4165 -2556 4467 10657 2783 8300 16446 13364
16669 13364 20895 32143 32043 18742 10684 6621 17832 19779 21432 17991 19952 6416 -8902
16656 -8902 -14752 -9494 -5909 -4153 -15919 -13502 11082 31857 22921 14031 14093 6812 -4392 8815
16642 8815 2506 -8247 2729 6603 -2527 -16666 -27004 -29287 -29138 -32910 -23925 -7736 -3793 -16870
16628 -16870 -23409 -14320 664 10751 7485 -1014 -3018 -13777 -25766 -30329 -17765 -6951 -534
16615 -534 -13620 -5799 -10572 -20530 -9123 1915 -236 10246 26312 27926 22741 16829 12538 8143
16601 8143 5102 18228 -305 -6770 16127 18198 3088 7925 20791 16906 14115 8628 9168 12548
16587 12548 3791 5593 -1163 -12934 -18998 -13977 -9709 -11174 -1987 19258 10997 1968 -6409 -21343
16573 -21343 -17463 -5729 -2436 -18872 -17244 -6492 -2788 -9657 -6566 -329 -2067 1480 22309
16560 22309 30992 23143 10108 -2622 -10496 -12739 -6 -87 5694 7512 14914 14457 18803 22629
16546 22629 11856 7830 7839 -15647 -27039 -31670 -39913 -37567 -20779 -7462 652 7958 5364 7177
16532 7177 18691 15471 9403 6409 6482 5989 435 -7426 -9216 -164 13362 22259 7918 2814 -2922
16517 -2922 -1009 305 8060 25397 40820 26678 14278 8477 3523 7539 -1581 -1777 -11052 -3425
16503 -3425 -9021 -3853 2483 -528 1471 2486 -10152 -18670 -21914 -33622 -40358 -45708 -31285 -3037
16489 -3037 4840 20096 24139 18247 9320 3787 8053 18822 17530 2317 -1728 1543 2285 6288
16475 6288 16116 15555 5095 3366 -849 -460 -7451 -24003 -23056 -12677 -6952 -5789 5796 772
16461 772 -8079 -15706 -6758 6800 -2634 7336 5354 -7429 -11750 -9158 13713 26605 22364 18736
16447 18736 16690 25586 35161 33116 29711 9521 11826 12693 22461 9046 1336 -8586 -6819 -4093
16433 -4093 2143 -3417 -2298 476 13436 12767 18944 25216 10773 -11290 -5511 -9714 -19435 -19728
16419 -19728 -4155 -6370 -12665 -14412 -5423 5310 20349 20425 12304 -4032 -4094 17430 18235 467
16405 467 -1718 3038 13746 7179 -5693 -20581 -6768 6718 6889 -531 2885 -4059 -27413 -32239
16391 -32239 -17745 10989 15149 13438 22233 22792 33361 35074 37134 27550 9631 5888 7229 1997
16377 1997 -5495 -5229 405 9623 1240 -4008 3938 8247 3779 12148 23905 14265 14475 13372 12820
16362 12820 5700 -2771 -18256 -15761 -8668 -6256 -1973 -2449 3918 18078 41106 30433 33610 37884
16348 37884 23193 27266 36134 39811 23789 18576 33668 20597 3246 -4473 -5645 -4551 755
16335 755 13020 5677 4999 9605 -400 -6300 -5856 -2701 690 17899 19891 7747 4556 9916
16321 9916 4288 1134 3324 7650 7856 13787 8828 15942 24251 10116 -13158 -19481 -17350 -7261
16307 -7261 13944 7915 10503 16944 -2638 2437 19797 15601 16456 7762 9402 7007 7807 190
16293 190 -11210 -11985 -8507 16280 25802 7608 -6594 -4735 -72 6357 1478 1493 10161 18305 14188
16278 14188 4849 -7063 -9431 278 15384 22884 16479 18196 18983 37979 34627 16742 2965
16265 2965 2643 10599 11255 2779 6617 5806 10840 4297 909 2474 -1308 -14169 -11514 -2383 -2854
16250 -2854 -10463 -18274 -591 -2665 -17904 -8510 -1375 -4931 -6712 553 -9699 -13564 -10641 -7309
16236 -7309 3673 683 2926 -6923 290 -9051 -4031 3795 -4864 1962 5338 13720 16318 25010
16222 25010 16864 5514 12307 19399 21686 9729 3477 13427 27685 27189 18383 14403 12652 18692
16208 18692 30490 27563 25982 15168 -1891 -12092 -11513 3495 -7369 -11076 -13694 -11710 -11145
16195 -11145 -5472 -13796 -14639 625 14034 24657 15288 20235 15145 -5702 -16101 -9101 -3362
16182 -3362 -12097 -349 13719 19176 10888 15391 29150 31309 24044 26030 24318 23773 20487 16598
16168 16598 4346 5481 -3693 -4726 2458 11937 16852 22476 23297 5138 -6291 2038 -13721 -28559
16154 -28559 -9546 20349 25560 11432 5432 3177 5839 3388 -2114 -7991 -8239 -13057 -8606 -17393
16140 -17393 -31383 -26782 -17497 -10147 -7343 1757 -6253 319 12652 15194 9328 2814 18138 33785
16126 33785 18826 8190 17508 8541 7079 14749 5792 -3258 407 5476 -3757 -7058 -2318 -4130
16112 -4130 -10273 -1553 5046 18714 5754 -3082 7469 -3128 -9533 -2454 16259 22967 11459
16099 11459 -5631 -6730 1328 -4012 -12511 -5837 -6059 -6094 -10458 -8404 -9632 -2135 15741 16955 22648
16084 22648 17906 12827 6008 968 -1655 13821 27594 23696 4310 -144 -13073 -10108 -3347
16071 -3347 -4443 -2479 784 9643 -5607 7020 24950 14259 10737 16666 8753 -6494 11561
16058 11561 14141 4139 6610 14628 13151 -18330 -37449 -45438 -22780 -24538 -24188 -20745 -7188
16045 -7188 6111 6906 -3303 -9880 -5303 8125 17385 -2210 -8553 -5079 11245 21559 22714
16032 22714 3597 -13791 -22542 -19395 -12985 -10743 873 3027 8919 21361 14419 3699 6600
16019 6600 9019 3422 6979 3074 4513 23264 19530 19216 12097 19153 24438 26443 15790 11000
16005 11000 -3922 -16192 -26232 -20178 -15075 -12284 -11118 -6876 -1164 6710 15087 11079 1475 -6098
15991 -6098 -5805 -6238 -5824 5005 8301 10913 3182 -13816 -13058 -24202 -10642 3111 4936 1374
15977 1374 6565 9402 7301 5719 10651 16478 25506 23364 22442 -7386 -12536 -12588 -580 1848 17460
15962 17460 30470 25443 -2632 -5203 3567 12003 12553 10249 14235 7584 11802 10458 -2385 -6017
15948 -6017 -11005 -8507 -4460 -6409 -14248 -2071 1145 -12784 -17177 -8408 294 8962 -335 -8191
15934 -8191 -4234 -6891 -4550 6534 5476 5479 7558 9973 1381 10403 6374 -4961 -11270 -13570 -9077
15919 -9077 -3060 732 -6695 -21075 -24238 -25365 -33494 -28762 -14372 -18742 -14721 -3335 5132 16248
15905 16248 16247 12006 17123 27513 23309 22294 18834 18246 22925 35570 25142 14524 2625 13549
15891 13549 18668 14943 5851 862 8160 20268 6094 -5803 9351 16662 17400 958 -3468
15878 -3468 15277 11369 -2121 -12643 -12641 -14304 -18558 -20520 -9520 -5563 2119 -10889 -16429 -2996
15864 -2996 10316 5953 275 -18891 -22447 -9452 -7398 -9660 -1972 11664 10788 8706 1714 12455
15850 12455 20692 808 -5097 10056 12898 -10303 -16273 -21893 -23188 -1739 21625 27875 18492
15837 18492 13000 22468 18036 769 -2997 -13054 -6109 6594 24370 7297 3841 -4751 -2166
15824 -2166 1451 15483 30756 22046 7618 9032 13344 6322 6000 17072 11025 -7984 -7235 -7304
15810 -7304 -11562 -3447 -9666 -187 -12641 -31351 -16861 -10934 -20827 -31063 -23824 -14533 1147
15797 1147 464 5019 13694 12243 66 -6961 6701 16876 13180 13099 20173 10721 6783 9603 14560
15782 14560 14427 20990 13749 5354 4214 9883 -1786 2093 1025 -5188 521 4701 9910 4594
15768 4594 -9426 -2682 -5830 -12154 -326 12837 9365 -11051 -16725 -19453 -10288 -1878 13789
15755 13789 22367 24760 13252 7139 949 4376 9255 12749 24584 22213 15655 -3716 -9502 2046
15741 2046 -1855 -22780 -27450 -11872 5283 3102 4224 14519 10979 14514 25238 20950 19930
15728 19930 16120 20900 10591 -9044 -19538 -12534 237 4178 -671 -9281 -1315 10999 11017 5453
15714 5453 8038 -8819 -13569 -9791 1193 13578 -13205 -18491 -5834 6786 9616 5 -4193
15701 -4193 -533 -9566 -16707 -11560 -19046 -6666 -73 2462 9912 22725 22878 10155 -5744 -12250
15687 -12250 -11382 -16315 -12589 -5590 14833 9250 6161 1737 -10879 -11266 -15879 -21604 -3034 4472
15673 4472 -2487 10155 18454 7889 7077 10678 2242 -4021 -6428 9383 15232 18513 33842 25050
15659 25050 15606 11382 14973 8912 16418 30793 30746 11411 4033 8305 20734 12732 3394 -1549
15645 -1549 1802 18148 19593 8117 -6386 6539 14949 7533 2572 18346 24802 10827 7252
15632 7252 -8054 -24861 -27895 -24992 -17789 -19603 -2422 14446 15763 252 -8563 -16544 -12395
15619 -12395 -1023 -6862 697 -3226 -8298 -9303 5742 16952 14485 15996 12433 20083 8669
15606 8669 -1379 -5271 -11970 -12615 -10588 -3235 -1484 -1622 4454 844 4891 6719 12256 -5999 1380
15591 1380 20484 20836 5419 11010 6771 11147 10221 7089 -7157 -13384 -11411 -10292 -3117 -5373
15577 -5373 486 15446 6416 8850 2604 4083 5733 5981 16437 25091 22534 32491 16563 -1702
15563 -1702 -3152 7718 11513 27713 16238 3476 8904 -4811 6771 8156 -659 -6900 1343
15550 1343 5791 -1862 1634 -4637 -22279 -37745 -30136 -18621 -21129 -11196 -9244 7013 23735
15537 23735 24936 10463 11076 -4192 96 17896 14261 5133 -4805 8773 12235 8123 7460 23351
15523 23351 20309 27937 22809 -6118 -3719 4626 -2112 -9159 -15663 -6874 -7293 -2835 -11016 -12247
15509 -12247 -3336 6462 17484 9250 3955 -2820 -5468 -6202 -22685 -23024 -13443 -17703 -19600 2550
15495 2550 18450 10070 12314 8892 10349 11052 -2198 1939 7398 -2043 -18566 -16409 -22297 -18362
15481 -18362 -2291 -462 -10473 -13466 -1595 -11088 -27374 -36006 -27768 -23087 -15072 -20896 -13584
15468 -13584 -6176 -828 -17574 -26312 -33531 -33559 -28017 -24681 -24887 -18937 -12959 -15249 -11881 -667 2715
15453 2715 1577 13680 28888 7340 -8806 -10160 -6906 1321 7784 12572 15942 22002 26549 26423
15439 26423 22406 375 -9899 -6364 -4366 -5173 -11387 -9623 -9344 -7190 -1065 11879 9938 -2188
15425 -2188 -3754 -5133 -3505 -1893 -5238 -1542 2202 5254 5464 9745 12821 4981 -10677 -8701 -5734
15410 -5734 -5720 -176 -4234 -10949 -4669 984 16341 20404 21116 28829 29300 10162 -3774 -7361 -11259
15395 -11259 -13980 -6814 -1203 -1258 -2811 -8457 -11401 6497 4079 -4472 -5648 -5583 11615 20914 5363
15380 5363 -9254 -15811 -20151 -30194 -30134 -13456 -9937 -10064 -1747 -7155 -15235 -13713 -6200 -1102 -4670
15365 -4670 -2913 4937 7248 21874 25650 10632 -15131 -18548 -30107 -40776 -31106 -10319 4742
15352 4742 1706 1066 5499 -115 9521 17809 21361 15152 23151 19010 17326 11557 -241 962 8109
15337 8109 13532 21285 19104 -3342 2608 -2288 -7063 -4816 -426 -3704 3515 -4962 -16992 -15649
15323 -15649 -7539 8498 19882 -1689 -26074 -9119 -10324 -12506 -10319 -5594 11672 5498 -1107
15310 -1107 16067 16024 7487 8190 -9114 -13468 -12200 -3607 10539 7267 14425 14268 9805 11622 9134
15295 9134 12004 5401 536 -5647 -8062 1018 12217 20578 12760 -5392 -952 7561 12201 2743
15281 2743 -10458 -20212 -13312 2733 4710 13465 7428 18987 29083 24549 13851 4462 3677 -8622
15267 -8622 -10019 -12118 -12308 -11320 -10673 -4796 7096 8108 21558 17385 18091 1350 -8132 5908 8181
15252 8181 3893 -16031 -17675 -14631 -17573 -22218 -22392 -10822 3971 3014 -1064 3357 10915 7273
15238 7273 4303 -513 -11779 -2684 -378 -8482 -15700 -24736 -18745 7021 14875 13164 27386 36700
15224 36700 27558 14310 -1131 -14959 -14654 -5052 7123 20993 28820 37291 24905 23614 26117
15211 26117 27673 23633 23802 27324 20842 3687 -12882 -8014 -1874 -16777 -27598 -11818 2423
15198 2423 22198 15398 16232 11215 12323 11430 17340 20106 26530 17917 -3174 -18718 -15781 -5200
15184 -5200 -2153 17015 15508 27926 24487 8710 7579 12434 18378 17234 -5922 -16502 -10849
15171 -10849 2088 -45 -4397 -15159 -10276 443 -880 -4557 -7338 -10821 -26001 -28165 -8012
15158 -8012 2170 7543 -7896 -15709 4313 14233 16979 17243 11178 9340 19809 16376 13987 9170
15144 9170 15180 10324 -8590 -13760 -15764 -4232 -9277 -6485 -831 4982 -10752 -20705 -16650 -12935
15130 -12935 -8125 -3991 -9650 295 5380 -5457 -8065 -3927 -13685 -13330 -377 5887 5745 8825
15116 8825 17877 32257 23797 -8053 -29588 -33849 -14856 -13253 -12927 -11750 -10864 2621 15623 4701
15102 4701 -17998 -12492 -4307 -2719 9530 22365 14928 5993 6297 11795 20409 22447 11576 4895
15088 4895 3890 -7523 -11634 -9696 -6185 -11978 -25289 -32571 -29899 -48924 -53497 -37268 -19650
15075 -19650 -12126 -16459 -15884 -5048 -5381 -7161 -13000 -7133 -3048 -13880 -12853 -14472 -16644 -18540
15061 -18540 -9871 -18097 -20037 -25749 -24309 -16791 -13829 1999 12669 13914 14275 18462 25165 18732
15047 18732 5061 -8665 -565 17399 12020 10652 12829 11652 11975 25287 22932 14167 -5273
15034 -5273 -374 18745 20578 13509 8259 11928 9824 -658 5083 13612 20646 19747 24580 23672 16961
15019 16961 21297 20023 4695 -10142 -19294 -16639 932 -154 -656 11315 8464 -11653 -4230
15006 -4230 10198 17515 19735 25042 14863 -11997 -11882 2452 17524 43150 54818 63502 41101
14993 41101 18743 23773 12448 8965 7669 -1972 -381 3927 7583 394 -4517 8214 9051 14940
14979 14940 8466 -914 -14536 -26071 -24714 -16907 1492 10443 13703 18840 17898 2152 -3111 2586
14965 2586 4361 -7707 -1013 10080 7757 4188 9430 12370 5518 -4594 -5998 -216 2443 6430
14951 6430 32899 36273 26247 17713 5825 12918 13441 21483 21520 13853 10637 13864 8724 3737 9345
14936 9345 14048 -3608 -5068 -2295 11098 3986 -5624 7398 14025 12561 37477 35694 27345 19524
14922 19524 12533 21150 33332 30635 24369 -971 1030 -2756 10740 12484 2459 16571 36606
14909 36606 31511 240 -4452 -5131 -9588 3536 9394 8361 21254 17855 20042 22180 21019 12509
14895 12509 6687 11701 17673 17103 14728 8356 13849 9725 486 -8308 -6359 -12266 -9287 4600
14881 4600 6075 8365 17761 36484 40491 22406 5880 -4846 -4633 2681 1767 8302 17182 24835
14867 24835 23426 18379 8391 13730 27677 28737 31559 7702 -7 20081 25630 36628 34811
14854 34811 14486 14939 3898 178 15698 32457 45948 43439 18416 726 16908 21293 6760
14841 6760 27470 30740 12170 4214 24231 31315 23793 15135 9035 7604 7955 2269 17528 11900
14827 11900 15289 4320 6356 23871 21395 12468 6647 6301 12877 15883 14706 12240 29591 34486
14813 34486 42447 46363 26331 9564 4293 15529 19969 14682 14803 29481 40996 28409 8146
14800 8146 -6682 10365 5628 74 15228 20701 21730 21942 13445 9030 9894 17872 18301 19148 31652
14785 31652 37395 28253 11399 7595 11115 12696 13805 19005 18121 19424 6894 12620 12383 8342
14771 8342 24055 38098 41924 42894 43450 38730 30757 25204 25542 24956 49675 59502 52803 34254 37382
14756 37382 36197 30557 18248 17174 25272 20957 17971 31260 27083 14772 19161 29029 31369 34200
14742 34200 44703 32764 26871 22719 23605 28108 37165 45023 32803 29221 32330 26246 25973 34630
14728 34630 39774 37686 25068 23052 16490 22075 20724 24808 44870 57077 52104 45048 39405 26444
14714 26444 22920 20830 23068 32437 38527 31297 25405 27625 33963 34029 39548 42194 26931 37660
14700 37660 29913 16251 27177 19086 13485 13958 15949 25557 35769 30234 28932 37181 50474 48442
14686 48442 41022 52413 40641 32534 27537 27589 34196 29484 41991 48332 43330 36518 37325 38144 21240
14671 21240 11051 26586 23275 3179 19572 31764 30665 21853 23573 30711 44554 50067 46673
14658 46673 41477 41706 27000 33269 25647 32686 38234 41272 39064 37023 37202 33689 17736 29066
14644 29066 33339 26251 29445 35374 48570 50293 27899 36551 50410 50751 43093 38642 49598 47325
14630 47325 43735 38042 33900 38847 36391 32055 38594 47988 60621 51229 59693 58926 59574 46422
14616 46422 28639 28313 46704 45441 54068 54172 61145 63030 64162 61953 66973 73537 79582 68515
14602 68515 40498 41053 41626 36042 39143 38533 49039 70577 65664 58400 53829 57429 58658 61404
14588 61404 57947 67387 64368 51027 54643 61366 72602 67483 60930 64551 74040 73779 63229 66404
14574 66404 71044 62734 65235 55475 48245 64343 80901 103453 94614 92730 80665 80260 76322 68804
14560 68804 70151 72202 74251 80813 93248 109621 109122 102487 98391 96643 91174 87938 104537 93995
14546 93995 79258 68149 68858 64662 54668 62023 80975 85267 89373 96108 101483 94074 87436 84275
14532 84275 78063 80870 90712 89091 92475 94751 100344 99636 97435 100456 101396 100494 105294 109055 109598
14517 109598 115241 109277 112323 123815 120823 122287 131951 130548 122976 118019 107034 109925 117354 127156
14503 127156 123374 122056 133145 150341 159074 153980 171059 185882 184101 181023 204340 243672 272825
14490 272825 292390 301726 288798 286886 294257 289085 266651 262648 256377 246356 253578 248545 228517
14477 228517 224150 220148 197625 204062 207607 210539 214900 210572 203587 212721 228063 232311 237665 233678
14463 233678 234146 236139 243420 252348 255638 259870 277179 301432 320973 354148 377594 393056 413833
14450 413833 419285 403688 387569 376512 372465 361416 349101 345303 338214 332819 333620 329827 332375
14437 332375 344511 358133 347876 341116 322456 336271 365123 380467 381488 382790 376408 385406
14425 385406 392584 401082 416151 417827 408706 431285 445293 450594 464091 470902 480540 482977 469063
14412 469063 469409 485838 491972 496806 515473 526735 532379 556607 571394 595459 615060 627999
14400 627999 645474 646809 663824 704311 721956 721248 734421 739345 743443 766586 789459 828705
14388 828705 853696 872524 873380 883990 909182 945878 967520 984536 1017759 1056109 1072853 1081217
14376 1081217 1112744 1143685 1166817 1193896 1220615 1254994 1296607 1311014 1333549 1355868 1369347
14365 1369347 1389377 1430767 1459168 1482995 1503947 1546452 1593575 1626145 1648212 1660521 1688103
14354 1688103 1718969 1727543 1757269 1784622 1812398 1828090 1844528 1868503 1898547 1921998 1932894
14343 1932894 1945224 1973784 2007729 2044823 2076434 2091813 2098814 2118036 2145433 2184772 2223429
14332 2223429 2233720 2240340 2232426 2259177 2292628 2309179 2318637 2329639 2358891 2374785 2393817 2410768
14320 2410768 2412736 2415823 2442153 2452024 2441948 2429050 2421335 2422722 2426622 2446585 2463253 2466972 2459509
14307 2459509 2454291 2439331 2422723 2416486 2402267 2392730 2378930 2360844 2340104 2345981 2355003 2352958
14295 2352958 2330093 2304848 2286193 2252096 2218940 2210225 2211777 2195951 2181809 2151747 2123709 2107104
14283 2107104 2085195 2058890 2053102 2044971 2024846 2017560 2001245 1979613 1950006 1903827 1868958 1846664
14271 1846664 1813163 1792981 1753118 1749392 1731922 1683021 1641728 1620405 1614792 1594040 1563169 1545019
14259 1545019 1513188 1485564 1457636 1437999 1414197 1387731 1362400 1332385 1298625 1254459 1220094
14248 1220094 1200533 1172056 1162878 1150649 1125982 1109864 1100743 1071426 1034832 1024254 1008313 988593
14236 988593 959521 943200 923651 896692 881771 857054 827287 810967 804275 806978 809140 807899
14224 807899 782182 763092 732476 706378 701148 690278 680895 680313 676978 662177 653176 637918 631877
14211 631877 637348 613932 598226 592762 594905 584997 564833 564826 567835 568154 561981 548953 547420 528236
14197 528236 522386 517882 509708 513724 505454 493762 473394 453021 464919 455975 446701 441666 449951
14184 449951 440177 433535 450754 435143 414525 400778 393089 387577 389400 397139 401590 392580 377797
14171 377797 380544 358917 334856 325729 327252 331557 328790 328208 346275 343859 344491 351011 350551 356504
14157 356504 363876 355847 358020 364541 378771 378125 353588 339601 333095 314257 307621 306079 289038
14144 289038 276538 285063 285957 287218 272163 267406 257740 244246 232168 232638 243874 241059 218293
14131 218293 206459 212124 211342 227589 232931 246314 245650 249820 256845 245304 234898 228201 229989
14118 229989 236261 242110 239138 250413 262734 268040 268741 249976 250899 270768 268804 270825 276856 278399
14104 278399 279746 277155 268629 266404 255185 241551 245944 265400 278137 264646 250610 255702 272189
14091 272189 266129 264358 266404 269367 286841 290370 292792 310664 312112 303668 297073 322612 341072
14078 341072 352223 363917 387188 415060 425553 424107 442175 463970 498059 512932 526795 576202
14066 576202 618026 655808 720445 779794 851096 939546 1055445 1204740 1364639 1554413 1777967
14055 1777967 2037032 2353583 2761680 3261301 3908950 4794021 6031186 7722947 9921011
14046 9921011 12590516 15556738 18670175 21699144 24326425 26231612 27241390 27326546
14038 27326546 26490479 24793722 22484595 19878372 17262388 14767776 12546402 10664803
14030 10664803 9165773 8025537 7152197 6505168 5984032 5579304 5265082 5019736 4854570
14021 4854570 4764985 4753136 4811018 4959202 5166555 5462136 5885945 6470133 7226010 8288810
14011 8288810 9776776 11742817 14161994 16914363 19837533 22704220 25221814 27097727
14003 27097727 28095952 28124089 27222020 25446289 22944979 20071994 17153044 14366716 11845269
13994 11845269 9692023 7964936 6627839 5610221 4833249 4225255 3721489 3305982 2955843
13985 2955843 2632267 2364587 2149057 1960218 1798821 1650449 1508785 1396658 1310254 1247960
13975 1247960 1182308 1096392 1045897 1003749 952553 881166 823601 795989 788051 771002 740306
13964 740306 713724 711433 693683 684591 668593 638335 639026 633067 611341 588717 568642 549931
13952 549931 535293 527108 529172 530123 497155 469717 465084 456949 448258 454861 448823 440152 445342 430277
13938 430277 414060 393795 383769 385031 376884 384308 383068 372829 366402 371129 377020 373292 356184
13925 356184 352318 359793 369926 365878 372192 379061 383122 379889 377437 372176 380106 392014 392582 388496
13911 388496 383867 380475 379038 373258 374201 359557 334153 318218 317562 336611 341659 325686 315538
13898 315538 309540 306238 309377 301886 302511 307957 305098 298142 302952 301736 301113 291870 296822 284449
13884 284449 266250 274785 290021 302491 308179 302284 304650 317342 326860 332504 320826 308834 302196
13871 302196 305072 306236 293562 265248 265350 256616 247592 264340 266023 268381 277667 278893 267262
13858 267262 273176 268205 259710 262457 272121 257976 268144 253314 218205 197495 202724 210665 210816
13845 210816 206841 192317 196067 207256 197819 192118 188595 196587 194936 194426 187793 187002 193988 191365
13831 191365 196320 194222 185674 178102 183367 193984 199997 205303 178335 170652 164290 152676 149812
13818 149812 139916 152226 169349 163619 158522 137291 132448 142167 135853 129220 122376 112965 105315
13805 105315 109921 106066 109482 111202 110277 110922 115743 115977 95869 100713 118042 121071 118426 116811
13791 116811 107671 114689 117637 124950 110456 106794 122713 132603 134237 121743 104899 101484 101591
13778 101591 93194 85146 80882 98366 108943 98449 108438 107501 111349 94759 85247 87111 96180
13765 96180 94031 88554 83882 91178 102784 93524 75519 76868 82029 96122 93844 114931 126603
13752 126603 112740 101510 101054 101302 115873 111686 92078 86345 79186 73159 63351 66800 76375 69156
13738 69156 74518 81619 74910 62263 65283 65231 68875 69518 74206 74316 66072 78261 86552 80230 79105
13723 79105 92511 82363 76051 57746 43805 54556 65200 67378 76871 76743 70406 57582 66771
13710 66771 75777 76748 75028 80502 70060 59170 59272 70254 72164 85292 90176 86438 80693 84066
13696 84066 83932 73492 57541 50417 31507 20993 27328 52868 73483 72786 65098 39431 57951
13683 57951 64437 55136 49411 41579 56886 64301 64817 63684 58144 51494 56074 54942 70699 73933
13669 73933 73509 65997 64505 69099 64334 62462 59914 62102 59975 54895 51250 66435 75711 75127 68747
13654 68747 62746 49698 57105 68795 74155 58707 57982 73025 74222 78619 62494 71336 65356
13641 65356 72550 83440 104707 119337 125323 121759 104979 94063 105273 111380 115140 108765 100382
13628 100382 83262 72230 81525 76762 58140 54015 49686 44606 54970 67377 74016 61819 59538
13615 59538 70413 67359 74568 93161 100495 85185 85698 95672 91176 97898 104293 111203 98217 107913
13601 107913 124785 134339 130299 137874 153981 153672 134833 131211 131791 144938 146519 159505 173418
13588 173418 189565 203108 202361 203344 196961 194354 179676 164804 149275 136040 116943 104711 99040
13575 99040 89221 95119 105525 119157 102421 97007 101135 110135 119956 119459 116897 118782 122938 120904
13561 120904 121619 122575 120064 127687 145533 157052 167565 183831 195680 199090 219578 220486 234902
13548 234902 262228 277840 249260 224852 226017 203274 165565 158310 154699 150649 160399 159790 142344
13535 142344 140484 146196 133339 149276 164387 174876 178450 172837 171592 186821 184897 191490 207577
13522 207577 215609 215816 219180 230770 242168 240575 237800 243909 253151 262394 287535 297715 312735
13509 312735 325471 330081 339034 355282 371920 394658 406469 423607 443174 486788 504632 515618
13497 515618 545356 583716 623006 653952 676997 728363 753421 788214 829807 887646 957707
13486 957707 1033586 1121688 1197462 1270835 1360200 1454165 1565524 1692147 1842277 1990986 2154246
13475 2154246 2351297 2555030 2777982 3035848 3340386 3659078 4021261 4428605 4874556
13466 4874556 5373373 5922053 6521742 7185330 7893943 8646735 9402461 10151811 10889270
13457 10889270 11603960 12244490 12761885 13177636 13444662 13554284 13535701 13375363 13108794
13448 13108794 12738215 12277935 11781582 11251666 10702572 10179844 9695780 9242193 8818260
13439 8818260 8450667 8149333 7896626 7677166 7520810 7425039 7393454 7408791 7468736 7589507
13429 7589507 7782267 8019081 8331475 8705639 9139862 9618985 10130497 10676764 11225380
13420 11225380 11758055 12259383 12700936 13034813 13267683 13400896 13389281 13238919 12984363
13411 12984363 12617494 12162821 11628983 11046842 10438864 9831855 9226679 8638008 8083800
13402 8083800 7559372 7057779 6609256 6199940 5820784 5458506 5111596 4803939 4534320
13393 4534320 4281073 4054389 3851726 3648393 3465529 3312328 3157849 3015945 2882158
13384 2882158 2752599 2634650 2529976 2429315 2350890 2261728 2162296 2080759 2010918 1947412
13374 1947412 1885831 1838293 1792368 1731222 1680967 1629948 1580698 1531179 1471292 1414506 1395484
13363 1395484 1377864 1350250 1333351 1294897 1243795 1202533 1162462 1136607 1116712 1101461 1072030
13352 1072030 1068141 1057638 1035177 999869 975577 954772 926424 909514 894255 873978 858542
13341 858542 831458 808469 805514 772302 756652 753931 740019 719440 704069 702888 687960 694122
13329 694122 694981 681044 662515 645516 619226 600112 599618 596464 589495 590076 581067 567357 545396
13316 545396 538797 528594 517922 502236 485856 484329 476980 468228 469761 470397 449745 421890 403885
13303 403885 389741 382823 362628 361079 372745 370905 357826 357837 356965 351462 346131 339258 334091 326186
13289 326186 314985 288624 290751 292304 292150 287505 282373 290852 289413 277983 281538 260989 243160
13276 243160 248029 235541 213023 195094 189804 190558 191384 201717 199329 184498 178347 164817 154363
13263 154363 145117 144761 144259 153349 162647 172918 175758 165443 151836 155870 153600 148858 141697 119510
13249 119510 119125 132177 135830 123252 123395 113782 112745 119304 123296 121200 117170 128087 143433 146663
13235 146663 130973 127985 119633 108045 111671 108947 83375 65714 61992 90643 103650 93009
13223 93009 89008 78936 75084 77375 78664 74145 63472 65257 75646 74070 88364 106028 99443
13210 99443 81377 77989 78009 88021 88783 80058 65077 53984 56076 71547 90352 80346 65966
13197 65966 58875 55757 61901 61611 47135 41293 45169 39679 52120 52817 38148 38969 36110 29519
13183 29519 31270 40880 33020 39068 55140 54456 58501 59108 59940 54210 59388 59652 60422 50751 41587
13168 41587 30603 27677 35344 42146 37303 40834 54103 55675 46875 47260 46923 48530 34738 14943
13154 14943 -762 4387 12186 40199 48237 35922 28274 18006 13427 8214 6222 6054 11325 21107
13140 21107 21263 17881 28190 27825 22047 35693 52633 45865 36028 34502 48017 54005 39155 30814
13126 30814 24842 34349 36761 28487 40687 47963 44082 33107 22904 26939 45431 41914 21138
13113 21138 34223 48957 41850 37981 28761 30499 37054 40667 54366 51190 34989 32860 24222
13100 24222 6718 11406 19014 16907 25196 10488 -6776 -12467 -3024 23640 31727 38309 28155
13087 28155 6567 12307 18121 18128 10486 22309 25901 33976 43431 40338 43891 50507 57289 67174 50071
13072 50071 31465 23300 29197 28603 33169 38929 42390 33229 31041 35396 44157 52612 49390 26164
13058 26164 20950 23663 17155 14615 26075 33545 27535 8921 -14334 3128 18018 28595 24652
13045 24652 21860 7799 5191 17287 12490 6962 24278 28746 26477 21258 20188 20631 30542 31889
13031 31889 31773 38105 35696 38241 26784 21936 26703 29588 35663 49706 40590 44276 67975 93342
13017 93342 96277 97377 85808 80635 77314 79576 67228 66307 71026 75727 74088 75591 88937 91144
13003 91144 84328 91643 92626 83062 87635 74572 64140 56319 58720 53298 50490 58020 60342 41045
12989 41045 44688 50172 56549 60805 70069 74050 67778 68264 66940 83365 88834 81053 78001 71484
12975 71484 72126 77767 87421 83045 84151 85228 75412 68074 73585 70448 66197 47781 46232 42443
12961 42443 40009 44355 53103 66785 62151 44667 56043 70781 65434 45962 33932 38767 40510
12948 40510 36523 26711 29495 31891 20444 -493 -21538 -11011 -2858 1553 21472 21876 21625 30146
12934 30146 26377 10930 9182 14938 26940 18367 5467 -3162 -7606 63 15310 18622 13039
12921 13039 20081 24019 7091 -3563 -1485 9091 5193 14343 25185 13232 -480 -10527 -1317
12908 -1317 -4207 -1518 896 -340 -6383 -3080 2645 12243 16453 28799 42259 27751 21437 21679
12894 21679 12825 14752 20750 30913 28281 29317 23640 24686 18017 7491 -18889 -23987 -26422 -18533
12880 -18533 -16378 -7013 10761 13792 2815 -4283 -5042 -241 11480 19176 10662 9684 11372 14068
12866 14068 24501 41001 42188 32918 30603 21853 21601 22718 20869 25501 27658 21314 34492 38814
12852 38814 20866 16242 8994 10543 15977 14791 16937 24594 23315 7036 -13750 9880 24492
12839 24492 10788 5138 -7335 -311 -942 -4569 2010 11800 9282 2114 -1432 -5986 -9952 -6055
12825 -6055 -4207 -3953 -4250 -114 10861 14583 8949 10978 11404 4163 12458 10320 5954 1476 33158
12810 33158 27004 9352 11551 489 -12657 -12442 -11211 -8913 3323 -10453 -16834 -20502 -24666
12797 -24666 -17067 -7095 783 -2130 -6429 -4555 -4119 -7848 -5161 -15923 -15131 -15127 -3592 25531 22600
12782 22600 12466 589 4880 -1754 6973 7970 9229 16986 20331 25024 31352 7880 -4594 -3678
12768 -3678 -6902 -17014 -8093 3473 252 8216 6278 13929 4469 8441 26317 19956 -325 -5769
12754 -5769 -4242 -1742 18204 24453 15161 17184 29189 36621 27483 17697 9308 -5245 -27501 -29694
12740 -29694 -14960 3329 -5689 -2243 13573 21856 12616 9011 17672 20336 -13152 -29605 -24924
12727 -24924 -4535 15422 23242 19990 2068 -7742 -8044 101 4945 1849 2869 -983 -5634 -8092
12713 -8092 -3455 -8557 -2004 4959 8492 13139 9528 12553 14140 1462 -3265 -8673 -11997 -15967
12699 -15967 -1225 -3403 3686 15396 -4353 -15433 -27449 -14553 -4586 6378 14597 4421
12687 4421 1008 -6694 -12638 -18766 -18763 -3648 7925 19301 21954 26085 13823 6326 6100 12829 13930
12672 13930 -7909 -22651 -23443 -21399 -22174 -23195 -33863 -12512 4258 7082 19607 24492 15286
12659 15286 11387 -12149 -14349 -8415 -15744 -7159 -7071 -18189 -16332 1732 1963 -5844 5536 20765
12645 20765 30186 20861 -8618 -20280 8611 17804 11789 1019 4147 14028 11101 -1929 5157
12632 5157 15502 4163 -6252 -10968 -7068 -12499 -6957 5694 8169 5060 3168 -3883 -10250 -15223
12618 -15223 -23171 -22279 -6525 -7922 -5212 -4434 -7671 -5629 -2541 -20189 -4197 8031 1544 8563
12604 8563 4039 7824 3062 -14691 -11609 7000 10642 9867 -13041 -18645 -7078 -10050 -858 -2805
12590 -2805 -2002 4266 -1513 -299 -3014 -5435 -8012 -6098 16752 30611 32767 37179 36149 23093
12576 23093 14476 8879 388 -10793 -7666 -8472 -19301 -5671 -15826 -27199 -21161 -31711 -24955
12563 -24955 -10570 8153 -1445 -5859 1866 9839 10911 4018 -21429 -29681 -19402 7994 507
12550 507 -5797 -10424 4401 5901 20173 23045 12675 -4850 -17216 -18425 -13778 -12458 -10351 3877
12536 3877 13620 14795 4846 -1662 4012 -823 -8104 -5067 4179 7971 6092 -8727 -1509 11645
12522 11645 17664 31887 35021 26214 14251 21659 29465 13189 5482 -13550 76 -3906 -7975
12509 -7975 4743 11479 5593 -1498 -12041 -16255 -20816 -18154 -13158 -9161 3800 -4418 -5588 -7535
12495 -7535 -357 9441 11548 10605 8823 -6191 -26738 -20087 -11160 -11813 1001 2594 -4535 -6639
12481 -6639 1604 8040 -5413 -6473 1109 5565 12869 18518 15942 11974 13614 23495 33727 37254
12467 37254 11961 -21303 -29214 -19400 -21440 -28431 -17723 1182 15367 8240 869 12469 14058
12454 14058 15021 6183 -7440 -10831 -2361 -1794 9576 3484 11313 13757 10320 4730 -1864 8780
12440 8780 15100 -8579 -5880 8515 7174 -8095 -17439 -12412 4272 6508 9818 16567 6014
12427 6014 -12556 -28221 -32325 -17467 -6354 -114 15824 19067 28456 27050 20464 9924 9326
12414 9326 11088 32365 35714 21104 7112 5272 -2786 -1228 -920 -4798 -700 7693 5282 -348
12400 -348 1518 5057 -553 -1234 1346 7084 9125 6585 3239 -3783 -10257 -19673 -15040 -7392 -16160
12385 -16160 -12702 -5912 -8240 -9325 -5680 -22197 -20399 2059 19906 28941 31438 25110 18997 6142
12371 6142 2737 99 -17128 -14954 1115 2329 3371 23481 24582 14908 10853 1801 -18490 -20430
12357 -20430 -284 7116 3490 2843 -7717 -14794 -17236 -12170 -3562 -1151 -4580 13992 20781 20668
12343 20668 15352 7625 12488 16539 15107 15874 9699 -3507 -10295 -12304 -1265 2112 12595 8459
12329 8459 11854 2167 -9183 -8616 -3911 459 4218 -6860 -34246 -22231 -1115 16604 17343 16754
12315 16754 25507 22880 5586 4871 13948 12659 27188 32364 7901 -1618 -340 -10042 -14437 -12272
12301 -12272 -9998 1319 6397 1615 10596 13705 7026 3862 1250 716 688 -3304 -12030 -18141 -11195
12286 -11195 -4260 -11156 -26821 -27322 -7648 -1842 -1197 -3370 5236 -5264 -26865 -17791 -3031 271
12272 271 -3980 -4036 -15252 -18245 -7968 -13200 -16351 -18038 -19297 -2994 19307 2740 -18532 -11684
12258 -11684 3212 12267 1401 -20176 -27222 -17384 -3809 -2387 -5413 -9525 -5435 -8140 -1749
12245 -1749 -1372 -1935 -4308 -4322 3385 5725 -7242 4372 2863 -13340 -14436 -6204 -11678 -10162 -7315
12230 -7315 -8235 -13657 -8261 -8051 -6534 -9456 -6655 4463 14601 12390 2942 -1169 -6802 -7502 -14753
12215 -14753 -20051 -17262 -13378 -10320 9885 17694 1322 -10853 -7360 1371 -9931 -4228 12356
12202 12356 7916 16388 20629 14540 14628 3336 -2435 -3401 -4308 1311 -3294 6257 8110 20878 22517
12187 22517 23817 16431 -15837 -44561 -44808 -21700 -9794 -6542 -10738 -11004 -8903 -25591 -11290
12174 -11290 6578 8825 23097 9676 10262 -2520 -18285 -14533 -670 -6294 -17644 -8159 -2796
12161 -2796 10147 22788 31380 25603 26713 26455 16281 4543 17012 15151 -8737 -8005 522 5585
12147 5585 20852 12013 9116 4876 -4746 3592 93 14445 26401 11342 -16692 -21786 -16627
12134 -16627 -9892 6282 15543 9485 -1201 2434 4431 4554 194 2158 1429 7575 13488 14837
12120 14837 6537 7058 7576 15130 4951 -7343 -1172 -3934 2996 9181 18463 25513 9087 877
12106 877 -9615 -16480 -14905 -15596 -4293 5708 1021 -8675 -7190 -1280 -2842 -14772 -15484 -18151
12092 -18151 -15834 -17752 -9998 -8419 -6381 9772 20485 21736 21524 36967 35557 34448 30029 21481
12078 21481 200 9944 22861 22488 12624 -1391 710 3014 9569 15690 4530 -14119 -11876
12065 -11876 6795 -1628 -16053 -16291 -5904 3433 7945 11273 10548 6723 1307 -1532 6136 -261
12051 -261 1405 448 -4788 -2033 2688 3849 18442 21559 20827 11349 -10687 -25571 -23081 -11250
12037 -11250 -9173 -7308 13714 -1769 -6832 -5965 -5380 7771 10579 8171 7932 21101 19469 10721
12023 10721 -2139 -6748 -5912 -5475 -11470 -7637 3660 11636 12659 3544 -10244 -15376 -8508 9984
12009 9984 9025 -3693 -14446 -8449 2907 5953 -7785 2512 20862 13454 -7074 -12179 -7384
11996 -7384 -3794 4195 12984 6634 -1730 -12619 -26591 -36842 -32910 -16351 -4914 6765 24116
11983 24116 12801 2153 -12977 -3709 400 -17076 -27595 -27421 -18807 -12738 -3490 -10366 -21204
11970 -21204 -13704 -8345 8995 7950 -3627 -900 15119 21740 11621 3835 -12138 -24929 -14670
11957 -14670 -11358 -11871 -9603 -11786 -2129 8962 15785 7251 10653 9690 11802 22048 19439 12467
11943 12467 -9319 -11609 -5851 -18734 -23010 -32788 -25597 -25087 -22711 -8278 -9039 -5630 -3822 662
11929 662 -6779 -16086 -6077 698 18354 13680 2262 6349 1334 -7804 -15859 -6556 -9051 -18938
11915 -18938 -17181 -18729 -21940 -12514 2931 -10392 -24672 -23870 -7215 -3883 -9919 -20333 -8034
11902 -8034 -12280 -17049 -10276 -25852 -19975 -6109 -4730 1257 10613 12491 -8559 -13184 9427 8648
11888 8648 -1136 4809 -2426 -17869 -13371 -5895 5135 8074 -7136 -12156 -11170 -1664 10814 15313
11874 15313 26409 14080 6478 -2783 -6921 -3028 4532 10515 14571 18270 19465 22306 24277 21040
11860 21040 -880 -16558 -25308 -21999 -11739 -3 -6194 1927 -12845 -27918 -20251 -1249 4276
11847 4276 -9166 856 4419 -12619 -14155 5970 2989 13851 19491 7906 1790 -10815 -8005
11834 -8005 -2178 -5245 -4247 -873 -1605 -677 -7337 -3868 -7659 -9002 -10565 -23111 -17648 -19288 -6875
11819 -6875 4214 -208 3487 15358 216 -6548 -8907 4307 1439 6124 4082 12803 19777 -633
11805 -633 -10759 -12933 -13293 -15132 -20689 -20638 -20905 -9787 -1413 28 -12004 -28510 -29281 -26146 -12536
11790 -12536 -15799 -7403 -2229 -1798 -9186 -17496 -19649 -16417 -18060 -19364 -11827 -11725 -3557 -6716 -12781
11775 -12781 -21783 -25244 -8525 -26803 -30082 -22106 -17338 -25900 -23038 -11997 -14590 -25346 -16308
11762 -16308 -9948 -18554 -27281 -21787 5748 7330 9268 9594 -779 -19703 -26857 -22376 -29664 -23076
11748 -23076 -21012 -28415 -14860 3721 11947 12825 -316 -11124 -4864 5055 4013 2577 5096 -551
11734 -551 -23431 -16997 -6074 5576 11213 4054 -2756 -10622 -12871 -9194 4053 11493 11879 10067
11720 10067 21808 22501 17977 4568 -4812 -14873 -10621 9679 9942 -10124 -36509 -41258 -26754
11707 -26754 -12654 -775 6047 6866 -4334 -1497 -2666 -5818 -11361 -3253 15671 11160 6039 -7526
11693 -7526 -3046 -13110 -23008 -12769 1251 4369 -8513 -17375 -8842 -13463 -14389 -13382 -7836 -47
11679 -47 387 -2261 -4387 2697 3133 12900 18966 9553 9266 4805 8993 8035 4853 5665 3741 -2070
11663 -2070 -18479 -19267 9846 19237 6155 -17477 -25929 -19839 -23581 -10548 -11378 6500 8438 -20976
11649 -20976 -43297 -27995 -18179 -18133 -17616 -10237 -693 11299 18502 27243 27739 10839 -11083 -6404
11635 -6404 -4810 -9205 2745 5421 -8289 -7347 -1672 -8682 -11478 -21369 -18860 -3750 10177 14604
11621 14604 -14886 -22510 -11349 5960 8706 -6611 -13895 -16543 -13053 -2422 3387 -14052 -4989
11608 -4989 7644 5596 8695 -4545 -15112 -12313 -21792 -9204 2107 11334 17973 5526 6416
11595 6416 -1317 -12829 -28094 -30181 -32354 -31497 -14910 -9324 -5072 5190 9718 -1149 8058 19330
11581 19330 28592 9125 -1134 -2471 -10674 5534 1930 -7321 -10194 -17421 -4469 4560 1806
11568 1806 -7074 -2912 -9637 -12687 -18216 -21895 -14524 4183 -1402 -11189 1621 14867 2932 -7633
11554 -7633 -23442 -27352 -22692 -6419 -1441 -8822 -6783 -3221 799 -9296 -8263 -6144 -3917 1083
11540 1083 -12268 -8025 -4063 -5046 4862 25625 43021 32615 12458 13340 10808 -10842 -36360
11527 -36360 -40919 -26201 -11415 -21872 -36327 -47396 -34019 -11447 -4975 9677 3922 20053
11515 20053 38340 34156 27657 19364 5765 -8491 -6352 -10772 -6283 -1372 11891 18800 14671
11502 14671 16765 17312 10021 595 -8250 7702 3970 -6749 4647 9339 4013 -6811 -10158 -8945
11488 -8945 -19651 -12934 -19634 -10532 12380 14798 -2613 -12531 -8408 -19349 -21222 -4573 5511
11475 5511 9840 2280 -4281 -1362 -8244 2948 4814 9387 3393 11101 23787 34497 13147 15463
11461 15463 11146 -3328 5758 8724 14534 18223 17699 13207 18581 27514 12119 5834 -6229 -3373
11447 -3373 14748 21401 11166 19595 32057 29564 20642 12776 16248 9278 -7206 -7258 -10494 -13243
11433 -13243 -31802 -41663 -45616 -46144 -43072 -27480 -15803 -1348 6945 7870 -7156 -8343 279 3734
11419 3734 6865 562 -4357 -8901 -11509 -13243 -14275 -15841 -25443 -33679 -14716 -2988 73 6505
11405 6505 11082 -1528 -9518 -6425 -2745 -6542 -6705 -4267 -3353 -9383 -15854 -19718 -13843 -20337 -18595
11390 -18595 -9386 -637 732 2877 -3386 9267 17326 21673 9587 -2711 -11269 -12351 -26856
11377 -26856 -35404 -22794 -18843 -28127 -21596 -10667 -12290 -6602 -10156 -8867 -2337 -2080 6615 1292
11363 1292 -8436 -7830 10188 10237 -732 -11577 -6356 -7434 -5841 259 -12212 -19276 -12989 -10956
11349 -10956 -6524 4375 -348 -15446 -11383 -6986 -6858 4326 4494 -8215 -202 13376 15916 10855
11335 10855 -12244 -17268 -4144 3430 10025 17940 19764 21373 10754 -3532 -3082 5861 5969 11437
11321 11437 28956 31382 30661 17362 -87 -804 4510 4109 4733 -7831 -13057 303 -263 -14144
11307 -14144 -11122 -5105 11549 18880 11973 1482 5623 5848 7012 19529 34826 15097 -11945
11294 -11945 -8858 -6544 -13285 -4267 8819 15175 6833 35 -14403 -10393 -3959 -7063 -12045 -5084
11280 -5084 -14855 -9119 -4481 -10038 -13983 -11250 -20198 -23075 -9948 -13982 -15573 -8739 4097 8351
11266 8351 -3216 -12884 -19289 -16132 -16986 -4648 12466 22359 17435 10476 8792 16500 10746 1981
11252 1981 -1816 4703 1063 -17337 -14798 -1172 1673 -3122 12955 17046 5484 -8405 2236
11239 2236 21966 16909 8724 4123 2531 -2585 -3955 -14699 -22901 -38331 -30230 -34378 -33326 -18782
11225 -18782 -13848 -9827 -14812 -7485 9766 12823 16600 22433 23869 27738 9626 -11134 -15074 -11799
11211 -11799 -6781 7200 18463 3196 6965 9280 13784 905 -3340 -481 -3803 -2491 -13487
11198 -13487 -10562 -7813 -28314 -28111 -30586 -27624 -13239 -8070 -10192 -9771 -9240 -12955 -27059 -34141
11184 -34141 -20010 -13429 -5345 -2409 -9992 -10467 -14946 -8559 -763 3121 -4821 -11807 -4065 5078
11170 5078 7141 16276 14024 5401 4500 -1395 1286 1243 3273 -9553 -17188 -23959 -27116 -3121 12795
11155 12795 9494 9769 15863 15339 1113 -6723 3004 10094 -1361 -4894 -14006 -15847 -17264 -6817
11141 -6817 -5912 -8621 -2452 18290 13473 9206 5798 3437 -15081 -27868 -32239 -33676 -25130 -9734
11127 -9734 -4548 -11808 -9496 -7653 -18070 -13815 5043 8509 -1403 -4317 -1589 -16829 -34576 -23548
11113 -23548 -8384 -6189 -4797 -5300 -8462 -12191 -10797 -16358 -15949 -7107 10239 9094 -6859 -14622
11099 -14622 -29636 -19157 -9442 -12744 -14653 4302 4046 2531 -2814 -6072 -2434 -3552 574 -966
11085 -966 -8063 -22460 -21129 -10719 9066 20674 6280 10708 1124 -25731 -32999 -31396 -30981 -26736
11071 -26736 -29955 -18642 -22286 -28440 -20395 -9656 -21272 -15176 -3540 13406 30561 36034 24650
11058 24650 4718 -8813 -17158 -19581 -15296 -15594 -11917 -6073 -184 11909 8168 5361 15 -5439
11044 -5439 -14718 -3026 -11389 -29756 -30500 -26369 -16114 -9256 -11002 -21749 -25128 -31661 -23613 -12476
11030 -12476 -10049 -23263 -24228 -11636 -7499 1029 19313 22511 4506 -6418 -3530 3976 12260
11017 12260 2935 13479 29787 34132 28772 20130 5110 -7855 -13048 -27103 -26737 -13549 -13387
11004 -13387 -16438 -6405 -4487 -463 -2886 5769 450 -14621 -28762 -28113 -7650 -1925 -7053 -6921
10990 -6921 -2135 7146 15883 6742 5061 3536 6282 588 7228 16659 -617 7632 25695 18355
10976 18355 -810 2944 15268 9481 6802 9938 6352 -732 -17000 -16117 -883 -14477 -24984
10963 -24984 -22156 -14703 -527 17203 30592 14012 -406 2536 1024 -1465 13862 15393 20364
10950 20364 29794 22250 5219 828 17379 18618 3982 7940 14592 -10615 -7798 12362 17958
10937 17958 897 -5762 -12662 -17092 -14527 -27662 -42691 -37158 -9595 -3115 -6326 1752 11980
10924 11980 6720 13951 4428 -19100 -22548 -19412 -15311 -10572 -9504 -8075 -15460 -9567 -10822 -13391
10910 -13391 131 -4849 3953 6456 -8283 -11137 -19484 -21969 -22378 -18552 -15091 -11105 -17168 -12523
10896 -12523 -4781 3466 726 608 9443 -3733 1208 14100 10917 9310 6943 9290 2618 -11452
10882 -11452 -19491 -18624 -14854 -22156 -25326 -27819 -12690 -5300 -15227 -10708 -8932 -15607 -17088 -21586
10868 -21586 -37488 -38004 -23759 -9816 -12190 -12867 3794 12534 9020 8716 6567 -6087 -12334 -5036
10854 -5036 151 3621 -3730 -10080 -17682 -14713 -9146 -5575 -1031 2853 -2436 6565 17098 3776
10840 3776 -16253 -12653 -18469 -23815 -26228 -21297 -10648 -7751 -4675 -11348 -30659 -28340 -8635 -3248
10826 -3248 -7201 -15300 -10683 3154 -4328 -27464 -25242 -14541 -15208 -17834 -22064 -17392 -9402 12002
10812 12002 22082 13735 3804 -6110 -15176 -7604 6049 3496 -4062 -13013 -10765 -11034 -10234 -8858
10798 -8858 100 28447 37521 21272 -1868 -6917 -4953 -10798 -15934 -9500 388 23546 15056 12081
10784 12081 -5791 -13532 -26239 -34900 -34702 -32598 -26605 -23090 -17299 -11492 -16945 -27193 -16905 3983
10770 3983 23963 16721 3999 1327 -984 -1968 -7163 -4252 -10151 -5010 -10303 -10967 199 2691
10756 2691 -4122 -20660 -26166 -38690 -34345 -37002 -28616 -20567 -13140 -24111 -24095 -20273 -3119 -1071
10742 -1071 1848 11823 17502 4257 -8197 2041 1565 -11468 -28137 -34685 -25797 -13708 -19080
10729 -19080 -13301 -5864 -7182 -10427 -9058 -4604 1572 4862 3459 455 3563 1214 -2899 8001
10715 8001 17973 13695 7179 -7472 -18436 -8995 -10722 -10930 -3482 100 2735 2573 -3943 -747 30
10700 30 2809 18342 16511 16572 17147 15534 10591 3659 -8560 -25465 -41933 -41490 -39045 -33778 -38892
10685 -38892 -45653 -30595 -17478 -11360 -19231 -31041 -27406 -26359 -11890 -8016 -11901 -18109 -12469
10672 -12469 -2409 -14980 -18916 -6375 7600 7908 -666 -6035 2864 -4617 -8270 -9043 -25250 -40713
10658 -40713 -42598 -42119 -36693 -19298 -19124 -18089 -4901 -7536 -10500 -10348 -2708 -669 6679 10247 16702
10643 16702 12656 -3474 -11424 -763 19155 22626 18332 13166 -5042 -15984 -2910 20014 -391
10630 -391 -14437 -8472 -8358 -19289 -23294 -10078 -8668 -2897 -9083 -7820 -11694 -12850 -19057 -22586
10616 -22586 -7360 -17701 -18820 -23562 -45417 -40957 -42482 -34397 -20510 -15557 -20566 -9216 4313
10603 4313 8694 1774 2349 -9436 -19023 -19649 -11068 -22969 -25116 -17091 -17209 2466 18283 28090
10589 28090 16776 591 3414 11295 -3036 -20846 -14902 -4648 -3656 -11705 -20849 -15691 -12395
10576 -12395 492 1606 -2800 -6930 -9400 -22247 -28560 -16663 -10679 2399 2059 5106 4872 8549
10562 8549 6341 6294 516 4202 -12075 -20190 -16978 -8591 -9006 -13181 -18705 -30136 -30383 -17778 -21045
10547 -21045 -16771 -9691 -702 -15947 -20974 -5790 -3694 6850 16967 12404 -5730 -20978 -20472
10534 -20472 -25893 -24735 -16359 -17172 -19353 -26837 -42822 -33984 -19694 -8607 15124 28229 25137
10521 25137 17699 15445 23098 18637 6112 -335 -19897 -21091 -19315 -21736 -28704 -13365 -18031 -32185
10507 -32185 -22113 -10075 -16388 -13369 -5631 -10726 -18837 -21645 -22240 -20559 -11412 -15884 -3638 -926
10493 -926 -7395 7435 11661 16614 -8393 -14571 1025 5778 -12847 -17239 -21971 -28092 -26559 -25588
10479 -25588 -30622 -15721 -10530 -9483 -4839 -4304 7410 1479 -1028 -6833 -1926 8883 -3632 781
10465 781 12799 1506 -2409 -3109 -962 -1897 -606 -1834 3932 3017 -1576 -1535 -12890 6386 26279
10450 26279 26034 27545 24400 28796 35355 32147 30740 32209 32829 36788 29406 15100 7455 13928 3082
10435 3082 -8652 -12234 -11258 -14414 -24037 -23249 -6435 13584 16726 -1801 -9238 -3281 -5258 -8023
10421 -8023 -7042 -11735 -10989 -19491 -18322 -11759 6354 14054 4124 -4718 -13508 -9211 -7493 -5053 4351
10406 4351 10173 -14484 -26080 -22850 -15515 -4911 5372 12307 9150 -1253 -12030 -7771 -3396
10393 -3396 -21982 -17006 -13468 -23167 -34288 -39055 -33503 -19061 -3243 -6275 -18986 -5597 -4699
10380 -4699 12530 14508 17885 22254 16549 18481 15068 -232 -23549 -31561 -9276 6696 -6568
10367 -6568 11415 13169 26761 26696 20674 19971 14428 17815 11545 7930 18287 23124 14700 -559
10353 -559 -3324 -18509 -16198 -9325 -51 -5633 -18888 -30708 -31479 -20888 -3476 -15758 -34580
10340 -34580 -31587 -5651 -6663 -7292 -8198 -17881 -19218 -9642 -9378 -6879 -3239 -13119 -17018 -37522 -42253
10325 -42253 -28329 -12525 -21562 -23361 -30009 -33112 -21920 -7452 -11983 -20714 -12650 -7249 2353
10312 2353 13338 14312 6362 12472 19103 17592 -2303 -5383 -5156 -4496 6159 -6552 -12827 -17049
10298 -17049 -7390 -3609 -2704 -16237 -8380 332 -7218 -9917 -12035 -5596 -8668 -16985 -15638 -6796
10284 -6796 3608 -10712 -35592 -25590 -18492 -20421 -8383 12033 14799 3438 7502 4222 -2322
10271 -2322 -5620 -15191 -14444 -6210 -3795 13938 25452 20394 14316 705 -4362 -19443 -27366 -18057
10257 -18057 -5132 1265 -6928 -18121 -14027 -21889 -26199 -34690 -25061 123 11413 427 -20979
10244 -20979 -23180 -24409 -11925 558 4669 10724 1319 1952 7665 4683 -14529 -14888 -9273 5637
10230 5637 4820 950 -1548 -7652 -7524 -22791 -30518 -25893 -25671 -23680 -21641 -37671 -37300 -30680 -24871
10215 -24871 -24870 -26979 -21437 -29595 -27687 -10058 -7674 -14313 -14850 -9136 4296 -7397 -8225 -20898 -13662
10200 -13662 -4598 1315 1324 3731 -7113 -25486 -25431 -23274 -28384 -18529 -8063 -12831 -21478 -13429 -13968
10185 -13968 -10845 -16905 -25242 -14064 -13551 -6667 2416 16623 22928 13371 8072 -9239 -9285 1123
10171 1123 2061 -6102 -7536 -21107 -24219 -28860 -34492 -19999 -2080 -12504 -11166 -5971 -21152 -22852
10157 -22852 -31882 -39784 -25024 -7730 -3057 -17491 -10113 5511 -9393 -17208 2656 170 -19263
10144 -19263 -26634 -19169 -20575 -22401 -6533 -14135 -23740 -33971 -48768 -28643 -9384 -7254 -7564
10131 -7564 -10540 -9463 972 -3915 5465 18374 17850 11362 -9120 -20345 -23542 -20110 -22237 -20789
10117 -20789 -10627 -9388 3700 968 4059 4930 -3997 -17762 -27896 -29623 -24808 -11920 3347
10104 3347 1009 -9150 -13064 -23945 -39129 -30845 -18519 -2635 4101 5900 11303 13418 6731
10091 6731 -5089 -1443 11535 10747 10361 13295 18026 18566 12943 -4023 -8681 -4112 5004 13372 3814
10076 3814 1242 17482 12052 -8872 -11758 -305 14054 12314 25222 44444 46883 45954 53042
10063 53042 87914 120802 131071 148164 158614 164840 179098 198478 242841 305773 373486 480001
10051 480001 623331 824356 1144174 1691034 2746974 4940747 9280145 13927846 13236730
10042 13236730 9200338 5455911 3373364 2315654 1739047 1384455 1111640 899135 744528
10033 744528 630351 530036 456376 401046 370093 337275 320867 305609 306776 287597 263861
10022 263861 224451 185967 163463 155028 136831 120259 110131 93830 85675 71380 85661 98603
10010 98603 105180 102001 88314 75340 61743 47080 49888 66870 83745 83199 78320 62053 48322
9997 48322 56347 59382 51328 43928 42498 48468 41206 51811 65553 75939 71808 43728 28645
9984 28645 24835 33463 29388 29982 27559 27505 26612 20818 29815 24187 -2249 -15006 -27737 -29382 -30039
9969 -30039 -34447 -40569 -36114 -12714 -4597 7771 5270 2885 23148 27197 25630 22219 9177 24305
9955 24305 38780 42733 37364 22413 15724 18399 21921 17664 7540 -4029 -5118 -587 4085 13664
9941 13664 16906 13019 11898 21058 12550 6138 14742 29668 28622 22196 29583 20360 25086 35860
9927 35860 37032 27498 9262 -4906 -13731 -12833 -3310 -8266 5010 24882 21120 11267 3381 10603
9913 10603 18138 26461 25702 15540 7280 16441 18669 30225 32336 34196 18671 1833 -203 16604
9899 16604 18756 13288 17597 23508 10031 6573 5783 11045 16940 14327 1008 5059 11518 9622
9885 9622 21039 29317 28371 38969 33756 16171 7690 5155 7890 14925 14128 2610 2084 6388 -4903
9870 -4903 -25285 -21547 -17195 -2189 8840 20030 33479 31030 28034 12338 20222 36957 39668
9857 39668 38446 35891 39489 38501 28083 23151 21505 6782 10075 18852 10123 9875 14055 12587 5944
9842 5944 7277 11420 13377 17486 694 -5401 262 15221 13148 5587 17484 30861 25072 23991
9828 23991 28389 40232 37426 32635 30514 27302 25939 20273 24654 19138 23844 19371 25404 27496
9814 27496 39943 45515 54789 53033 46829 45213 77971 117726 167745 232592 309854 350297 327604
9801 327604 284467 221366 154621 106061 80212 60539 54141 65733 63599 46570 31231 34112
9789 34112 37426 49564 44774 33018 29552 24031 12115 12680 16666 2864 -3797 2936 20626 17425
9775 17425 18494 17027 22036 8241 4395 8058 1836 -19731 -3245 17383 12881 4228 17174
9762 17174 23840 19942 2714 57 -10348 -15075 890 7552 2881 -2560 -11982 -18673 -17601 -9539
9748 -9539 -3499 14256 14178 15360 16411 15481 15455 8225 485 3475 -3240 -4019 1999 10856 18749 11645
9732 11645 -6444 -20162 -22620 -17844 -21836 -17524 -22697 -18980 -4138 2473 16012 29450 25839
9719 25839 17067 -876 -7141 10576 18789 4252 -2236 -11347 -17150 -21297 -29301 -29351 -15909 -2122
9705 -2122 8335 9555 9041 6400 -1353 13452 25015 47638 62067 38495 29577 15893 20949
9692 20949 27820 30935 31159 27580 24329 22426 19070 14781 30078 21011 4705 2920 13198 -2791
9678 -2791 -3897 1188 5201 5447 -1066 4886 -12186 -8027 650 19752 27645 22535 39060 47908
9664 47908 35499 15599 14494 16248 17254 24437 31687 47233 58192 46205 42952 34471 23252
9651 23252 7571 -12409 -16198 -8406 2395 22656 43257 49081 35831 54732 63300 64299 54814
9638 54814 52102 65620 57939 53049 54934 55144 65990 71925 67948 70575 51534 67816 87493 81930
9624 81930 80877 84029 70778 82675 78298 64017 62433 67637 75230 83188 109124 134975 139967
9611 139967 123973 119921 137447 149904 175167 184042 193868 217359 237965 232309 238275 268232 316332
9598 316332 347314 388640 429024 482712 539012 617929 724702 861663 1039487 1250116 1504375
9587 1504375 1819285 2221593 2756743 3452644 4344629 5388498 6462439 7327864 7687091
9578 7687091 7441717 6733904 5842579 4972530 4228151 3622554 3129127 2761186 2453267 2200264
9568 2200264 2025042 1873393 1729056 1628043 1550131 1491440 1454840 1440416 1465276 1522548 1586362
9557 1586362 1666393 1779800 1928232 2122490 2360652 2678265 3082271 3607651 4287102 5203326
9547 5203326 6423858 8061214 10176255 12683779 15114731 16654358 16647396 15163396 12912096
9538 12912096 10597102 8619987 7081039 5896439 4989858 4288245 3723788 3282419 2911534
9529 2911534 2608949 2356465 2141485 1974386 1846066 1751330 1675292 1610718 1598240 1591678 1602625
9518 1602625 1625162 1673407 1754641 1874463 2050017 2264940 2527536 2877413 3326528 3918805
9508 3918805 4661351 5528196 6438602 7186242 7510500 7240551 6508822 5559349 4614931 3801330
9498 3801330 3145939 2633291 2229337 1904685 1656986 1452994 1279474 1128177 987109 884875
9488 884875 812008 747185 685757 618135 558953 513145 471578 426560 394386 375416 353712 339966
9476 339966 332995 324402 309262 289988 270596 240087 225010 219717 225596 217327 202990 197181 177081
9463 177081 154892 160886 167560 153062 150769 138027 137477 155041 180108 170910 155684 146211 143248
9450 143248 132088 130260 136666 134560 112517 93012 94878 95315 88615 72931 51695 45101 54411
9437 54411 75469 76137 72604 76439 77344 66422 68155 74109 75383 70783 65828 52875 54820 74252
9423 74252 84178 76311 58390 53201 64963 65152 63108 73533 68571 67220 75165 75577 65356 52064
9409 52064 46300 45064 65382 64754 36564 28463 21239 25364 28633 43693 45012 39887 26453 31395
9395 31395 26234 12252 16479 21616 16504 -3105 2503 11263 -12476 -34268 -35364 -27112 -18339 -9607
9381 -9607 9873 23888 31693 49546 64218 64836 62096 65893 67495 64559 53100 53118 58783 58227 67133
9366 67133 79310 84978 64170 46117 52326 57893 66648 83842 81821 74834 71961 72410 81531 92919
9352 92919 85651 75138 67690 53118 42454 43385 58899 67017 54004 58287 66571 58342 70238
9339 70238 78026 76453 78625 87248 97124 96186 111402 133532 142811 151150 168338 203946 253467 302757
9325 302757 360701 424762 499898 579568 687140 820997 969177 1097806 1207636 1285687 1323326
9314 1323326 1306948 1258217 1183825 1070311 946466 820231 706782 600551 498756 439830
9304 439830 398155 343572 297933 285527 268255 257247 242967 228559 200603 178917 163627 141884
9292 141884 134992 141170 148841 142508 128310 97882 80361 94714 87423 79792 82852 88491 94709
9279 94709 95876 89673 93555 94653 93259 88447 100544 105569 110211 106770 115028 100743 77670 79854
9265 79854 84956 99434 117624 112388 98742 87173 103587 120344 113263 93381 95765 107644 102532
9252 102532 106074 118156 132178 156919 155950 166088 183236 159467 154491 173239 179662 181125 191919
9239 191919 208257 227399 232989 233885 252334 256078 274000 304487 327064 361408 384697 387064 384729
9226 384729 405569 423146 439692 471254 514629 565535 638752 730106 837628 979970 1169270
9215 1169270 1416529 1731076 2124383 2641322 3353635 4294043 5439956 6637877 7499628
9206 7499628 7657843 7079117 6058857 4959368 3994292 3232332 2652256 2200238 1852513
9197 1852513 1578058 1371045 1208276 1066988 947236 859337 796514 736402 687682 629260
9187 629260 585554 532675 485423 460108 433706 420863 411865 399970 370242 335991 307694 310748
9175 310748 330137 323990 315185 299550 280668 272442 269698 245379 223851 201873 179116 161213
9163 161213 151897 141427 125556 122005 113618 112191 113566 111133 113258 125549 130230 140626 155174
9150 155174 134972 143996 168526 166693 169727 176208 171480 149364 132522 126207 135256 130819 118434
9137 118434 121733 123778 137436 140018 150281 155697 152250 139996 134667 122792 96353 82272 78510
9124 78510 88648 107084 122932 128538 138067 130800 133422 146891 144170 146568 173172 193826 210110
9111 210110 214920 191673 154279 64239 -52499 -156444 -221834 -234358 -236374 -224665 -196699 -161824
9099 -161824 -132449 -113738 -99419 -93483 -80707 -79814 -87087 -75162 -40987 -8695 8342 21980
9087 21980 34802 41792 49017 58530 63647 70079 74825 70574 77164 104375 180571 268432 364826
9074 364826 492467 628087 665975 622158 521892 404480 327964 287560 247937 236364 232557
9063 232557 211724 200945 196952 166664 139783 115786 99296 78003 25692 -10150 -28230 -44007
9051 -44007 -72098 -110353 -168064 -234827 -309450 -358695 -354253 -319968 -260687 -210833 -159064 -104760
9039 -104760 -46643 -24646 -15675 -5877 -4535 4740 13239 22969 38741 55499 57002 70502 89628
9026 89628 78985 76041 84234 88180 85087 81199 89113 95445 91904 98005 113239 131413 140643 135154
9012 135154 128937 119862 122248 127990 133681 149238 177266 197328 208016 218243 234580 240755 229983
8999 229983 242789 256070 266801 290069 306843 335973 370355 407805 437514 456908 494729 530223
8987 530223 547296 554382 582398 614952 668630 735916 787440 819152 826778 816876 812192 799161
8975 799161 788717 763133 763263 783292 824364 852236 861680 870503 915550 956399 1005784 1062610
8963 1062610 1108863 1152104 1199288 1285291 1387010 1514554 1635584 1757234 1884162 2008368
8953 2008368 2132884 2282379 2430693 2608306 2810664 3023379 3265908 3544069 3860225 4225176
8943 4225176 4642504 5088473 5577371 6135304 6806784 7605950 8577416 9763901 11226134
8934 11226134 12983135 15060076 17550020 20492924 23855176 27541839 31614625 36530059
8926 36530059 43080232 52158430 64934328 83378499 110627514 151076650 209392741
8919 209392741 284180174 354292962 381441433 350847441 285715511 218433815 165255150
8912 165255150 127289657 100708388 81799961 67960922 57564745 49617722 43476504
8905 43476504 38680036 34770327 31276649 27961458 24823364 22028454 19627934 17592092
8897 17592092 15846159 14340567 13058705 11953349 10979138 10148837 9452362 8835650 8311388
8888 8311388 7814081 7337735 6878593 6448432 6060947 5702703 5354809 5048879 4767460 4524510
8878 4524510 4308731 4092709 3897616 3709774 3529267 3339297 3153139 2994890 2824223 2658684
8868 2658684 2515080 2382440 2251573 2128098 2031324 1947870 1865200 1788694 1700786 1605440 1532820
8857 1532820 1456628 1392247 1341664 1308095 1265980 1210176 1166294 1124383 1065864 1028581 997818
8846 997818 976010 947411 919422 908949 877647 877764 882639 894941 890584 864483 843576 807285
8834 807285 789229 753316 706000 693705 703297 724954 732324 719804 708670 698670 683401 678262
8822 678262 667959 651104 617716 595272 595546 592683 584942 572242 571811 572038 558233 527432 509459
8809 509459 501394 495675 490229 491862 500353 496690 473270 476224 485269 481861 495000 485991 492576 508185
8795 508185 553627 585031 610714 657903 713672 763033 803833 819461 794609 725135 638457 580022
8783 580022 536498 502900 476593 452441 416619 355391 309889 281586 239098 219516 199959 174459
8771 174459 147289 109016 82307 74767 55335 -671 -73259 -185885 -282758 -334313 -301289 -203539
8759 -203539 -77085 26013 85626 125183 149933 160211 173663 181637 194652 212339 217896 197932
8747 197932 192233 209036 238324 276734 301522 308323 319518 312142 301582 293430 300289 322569 341817
8734 341817 362455 408544 451336 476431 474379 461059 396849 280981 143713 37278 -22117
8723 -22117 -35688 -21999 -50 20121 34526 51687 73697 74800 71170 68718 53163 34427
8711 34427 25002 52436 95436 97187 88242 70086 58327 46993 51522 34971 32165 35446 39237
8698 39237 31330 25198 26535 26890 22882 19991 28377 39606 32937 40591 39990 37236 36688 24968 31938
8683 31938 53334 73821 75694 85838 99905 108123 99176 92401 105727 114189 113522 109476 109493 110794
8669 110794 81664 83834 85254 93482 87595 66584 60154 68510 76326 64089 68705 86938 104505
8656 104505 119829 105390 114780 96783 88777 88158 86160 81964 77911 77995 78944 81964 94017 83358
8642 83358 67873 67098 77807 84087 75310 88385 96266 84593 87318 93885 92452 91456 89024 73189
8628 73189 79369 74033 65272 66346 77776 87952 94922 87830 79305 84220 97793 97458 100367 112207
8614 112207 106475 102063 92973 92589 88903 73100 41591 13200 -24957 -45160 -57610 -51645 -34343
8601 -34343 -21268 -20170 -1738 10912 -7163 -21210 -20471 -3918 8582 18008 28481 48804 59493
8588 59493 58593 38528 20987 16610 24188 48463 51989 42765 22055 19097 35563 35610 38754 47400
8574 47400 44165 43945 46852 52152 42155 34038 25293 41730 47570 52377 64594 65982 49966 52837
8560 52837 45986 44650 39727 40605 36374 27364 28676 49578 66470 63364 67457 82590 74607 69616
8546 69616 59714 61582 53747 45442 51364 63665 66765 60049 55969 62169 53794 44405 58924 67428
8532 67428 74160 87763 88075 111442 114838 117346 158601 203616 239032 294627 375114 481532 598550
8519 598550 711857 831935 965140 1090494 1176748 1217705 1242098 1235948 1187767 1099590 994550
8508 994550 872714 758715 651001 558728 478408 412599 351944 299867 245315 209608 207393
8497 207393 193835 163405 135068 118816 102406 86418 75567 83425 83118 83656 86169 70881 59784
8484 59784 62555 53655 46010 46953 44756 41341 43310 57336 74217 66961 57721 65343 61174 50621
8470 50621 22185 10985 22495 31392 44200 49897 38143 27212 17165 9785 31253 41596
8458 41596 57388 49413 36487 43607 54634 66057 74535 90231 96630 83582 85418 87758 81563
8445 81563 70885 67455 59360 56828 59073 64256 58184 43234 41018 38315 31917 23669 26731 25592
8431 25592 15533 17884 42653 56123 47081 45177 47988 34061 21305 18153 13941 9574 9405 5250
8417 5250 9433 16448 32461 32697 40615 29688 32838 30161 43995 43383 31688 34446 48828 52120
8403 52120 48989 43179 22877 27380 43265 36938 33059 31842 39529 38749 34902 31058 20294 17816
8389 17816 38841 53653 54535 38377 22546 31680 38850 38879 25460 28447 38581 48022 43255 40131
8375 40131 50593 38512 31863 24430 26825 28459 37094 40883 31201 39398 23644 23090 17481 13447
8361 13447 14235 19183 12650 12434 14385 23786 28411 11447 17191 34986 36346 28288 28131 31756 32240
8346 32240 43530 29530 13615 15727 28412 22604 21670 24335 34059 31935 28390 26462 23510 28357
8332 28357 28070 11086 -3306 -4813 4028 8237 7199 32 -5210 7459 13979 17482 13275 18995
8318 18995 2834 -7033 -4391 -241 -5541 1895 9654 21455 19144 38233 44054 46272 34591 16751
8304 16751 10987 2376 10096 12140 -3004 -14975 -8902 -122 -2774 7073 11816 4760 4831 -1980 7969
8289 7969 11148 15681 5558 5244 -2789 -5688 -1600 -2175 8754 7843 14212 5952 -1911 -14897 -1496
8274 -1496 7928 28948 38203 37386 29236 21932 19278 26032 22978 10659 8818 12651 14210 15986 10222
8259 10222 44055 64777 50582 24767 3970 13443 10584 11018 16823 1138 -16041 -9233 -20052
8246 -20052 -28651 -26193 -20193 -8327 -13484 -20666 -17693 -5245 2425 -2837 10370 17488 10882 19411
8232 19411 15084 21089 5708 1250 14214 19272 14450 15839 22008 14753 15061 3825 14257 28543
8218 28543 26256 15158 -1048 -6085 -1072 2061 -2147 3493 22149 15840 5016 2456 17332
8205 17332 17718 7452 18333 20846 21857 24104 16452 6772 10418 16858 19868 14402 2699 9343
8191 9343 10313 5245 5150 10062 13419 16254 4107 276 16685 25312 23721 33396 39665 44010 38724
8176 38724 32373 25230 17398 2177 9378 14338 17293 15616 7187 -8244 -15828 -8751 -3379 -6102
8162 -6102 -9129 -1634 9448 13408 16423 23753 17588 10820 -2798 -14722 -23462 -18602 348 10477
8148 10477 12068 11456 13433 4149 6001 1889 5173 -1817 -4372 830 1001 8701 12025 8732 15839
8133 15839 20031 10316 -7367 -15455 -24419 -11558 3761 12277 7933 -2648 -5566 5524 16334
8120 16334 21084 31887 32884 23031 22858 20049 8366 10859 20395 25541 38027 36843 30687 32758
8106 32758 23979 25539 26839 31765 29730 31946 31088 10395 1626 2955 5724 3805 8321 9424 12246
8091 12246 10625 1990 1840 -7462 -14404 -14493 -9996 8422 9588 16910 20196 6520 -7290 4434
8077 4434 21360 22148 23638 21115 18657 29924 22253 12435 30496 39476 26071 12651 5707 1603
8063 1603 -6708 -4521 -9112 5357 9843 -80 10598 14186 19873 23230 6008 -10291 -3093 10062
8049 10062 6411 14776 15489 16501 5295 10988 16949 21969 24130 25206 30066 28531 16342 3451
8035 3451 -3931 -7145 15510 19943 15278 12740 19617 26513 9432 -502 33 -13738 -8842 -3091
8021 -3091 7128 23698 21100 40374 47429 42277 33575 41076 49191 45803 39301 13670 10193 14945
8007 14945 35269 49093 62139 57495 48036 36470 22274 13641 31774 50274 63385 63837 60171
7994 60171 45754 55744 75174 87362 98622 101286 93524 82758 58080 49440 33925 13315 9469
7981 9469 2467 2807 7540 8707 9261 19069 23043 17592 4993 -1670 23242 47559 31453 9806
7967 9806 14209 14083 27425 23109 18222 24911 33124 41618 29670 37478 51562 47144 42237 45054
7953 45054 45486 50458 63562 79042 77759 93063 100317 69150 48087 40844 39123 48120 43161 27952
7939 27952 33375 27565 23215 20756 8881 3816 1919 2937 11432 19472 16635 15142 -13971 -16598
7925 -16598 768 8492 23511 29430 32637 47191 45929 47842 44012 17296 15603 22125 33201
7912 33201 36187 25435 25164 20345 -1144 10395 24720 26715 31417 24849 4942 1606 3614 14628
7898 14628 9885 370 10185 18478 26914 30066 29109 25250 13301 9218 20014 9932 7645 8134
7884 8134 11674 6711 475 1130 5033 4942 5019 3708 3239 4608 1081 -3400 -7395 11180 14263 -3527
7868 -3527 -6052 -6524 8226 14980 16126 15379 11928 21147 11531 3908 7014 -1829 -3618 -8117 -2280
7853 -2280 5776 1652 -1941 8880 21967 16041 14752 3260 2962 23032 31170 24748 8332 92
7839 92 -10598 -26372 -17491 -4633 1122 -1929 -9960 -9052 -5279 -4671 5583 9778 10209 11633 18880
7824 18880 6465 1847 7705 20494 22621 9179 -3683 94 -590 -653 3580 13773 20360 24270
7810 24270 296 -11329 -12487 1194 12255 5279 -7480 -10300 -9469 -14963 -10454 14017 14609 7647
7796 7647 5858 14430 19825 -4643 -15512 -14536 -5010 2423 24562 39832 35482 15012 4080 6327
7782 6327 2599 5054 -8877 -15019 -31427 -35942 -11140 9264 -692 -5678 -2051 -5561 -6000 -11624
7768 -11624 -23977 -27025 -12689 -15046 -9785 812 10827 22990 24505 7958 -10229 -13316 -6172
7755 -6172 -2840 6173 17442 16199 8991 -1517 -491 -9141 -13989 -3744 12618 6335 -142 -7901
7741 -7901 -14850 -23172 -27710 -7095 -1630 -1554 -8024 -20823 -28106 -20768 -322 16646 15343 16276 18685
7726 18685 28504 19183 -156 -7748 -2335 20518 15165 4833 7125 18684 19555 10849 13569 1081
7712 1081 -12384 -17429 3492 7204 8853 -2320 -14928 -6116 -14003 -2844 4314 23662 51353
7699 51353 44302 21431 6722 20584 21063 16989 -1781 -5212 -3764 3312 -11451 -7166 2137 -7696
7685 -7696 -16294 -13083 -422 10063 12050 13591 23734 17561 1034 3967 11362 9079 3738 7841
7671 7841 1518 2996 14647 28010 9590 -723 12407 11283 7156 -4928 -4358 12382 23055
7658 23055 11048 11126 16824 16807 5913 1671 1806 22598 28566 7040 -15234 -15714 -13771 -11095 -18997
7643 -18997 1360 -3771 -13796 -13572 3595 8198 3529 7684 19618 13269 1467 -10793 -13887
7630 -13887 -8605 -15486 -16923 -3957 -3784 -3205 -3474 -2504 1279 18120 24150 14301 15718 12091 8374
7615 8374 10938 12657 3384 -7125 -12741 -1195 4396 5888 19363 9406 -8353 -3358 4406 16167
7601 16167 29857 37180 38211 31445 20670 13623 12078 4208 -3232 1049 16792 21474 11962 -3155
7587 -3155 5226 13993 -541 -12021 3943 8854 3626 8398 4738 646 -493 7410 15588 29316
7573 29316 34453 21966 17541 27047 19499 15431 17916 22224 14560 -4028 -5669 -11475 -13214 1273
7559 1273 -6764 -21586 -8421 9579 11795 3177 979 7063 4521 -3234 -832 1964 8367 4941
7545 4941 -3981 330 -2424 3752 -342 -8313 -9479 -10080 -10449 -20144 -25723 -21639 -16513 -2689 -219
7530 -219 -2762 6706 3333 14117 21097 17201 934 -24133 -40934 -43989 -31857 -10006 -4968 -2898
7516 -2898 4292 2307 8069 15558 29496 23075 5776 10353 1984 -14983 -3405 5743 8116 4999
7502 4999 -10266 -11441 -4298 -10245 -23186 -22231 -11564 -19080 -23561 -3093 -516 -3731 1315 -13750
7488 -13750 -13160 -17091 -12504 -345 11280 4029 -4898 -4611 2897 -8873 -17283 -8327 5524 13960
7474 13960 8159 -763 -6222 -13357 -10548 -9724 388 2289 2981 -12510 -23400 -13099 -14595 -5282
7460 -5282 3170 7172 2779 -2873 -613 3433 2363 5880 -2397 -3634 -10382 -50 10515 11057 8368
7445 8368 -17324 -40316 -20883 -27335 -32903 -11005 -19257 -9832 -3924 -224 10982 7710 -1331 7499
7431 7499 15441 15448 1570 6887 9997 11291 -9554 -19883 -20135 -8378 9185 11826 4928 -13768
7417 -13768 -15510 195 10807 -1089 -5272 -7291 -254 10098 14244 1965 110 9937 9815 -2762
7403 -2762 -3195 -1284 2353 13329 8927 6463 14073 24988 32871 31348 25157 25742 11876 3381 -8781
7388 -8781 -18324 -21844 -16613 -18720 -11802 -5603 14722 15192 10547 5624 -1802 5188 5701 6568 1871
7373 1871 1260 1277 12028 17927 16607 11785 5115 8987 161 -20627 -18888 -2645 4921 8374 15391
7358 15391 23177 21845 15428 19830 21692 14432 9469 5988 3450 -4258 -9676 1474 13072 34750
7344 34750 35675 27178 32281 25760 -494 -383 16465 14910 18487 16350 14735 17118 17997 18984 23891
7329 23891 14640 2994 -10908 -10991 -7949 498 6734 13979 25832 17548 7073 -17825 -29986 -4754
7315 -4754 7043 9604 11151 3931 6473 22059 33009 12699 5622 12848 3937 12634 11792 16434
7301 16434 3796 -1693 1063 -6008 -7993 -4402 5692 7027 3382 8125 5544 3931 3901 3103 -2597
7286 -2597 -9121 -15458 -25980 -34761 -23912 -23627 -25503 -28507 -28360 -6964 3748 -1087 -1730 -7007 -2394
7271 -2394 -3051 2546 -2304 -2297 11430 11778 16598 13587 -1713 -9501 -4171 6700 7651 7607 14699 19534
7255 19534 10389 73 -5039 -23705 -32616 -18323 858 -3035 -553 574 4643 8008 2672 -1345
7241 -1345 -6025 -5161 9063 17643 11413 4347 9008 21964 24029 13056 -4681 -10388 -13335 -13404 5544
7226 5544 5323 2948 3370 7190 -8232 -7646 15533 20993 9808 2629 7147 5945 11337 3446 2455
7211 2455 -1046 3495 10696 31222 34103 23111 21199 404 -25489 -23822 -19844 -17790 -29680 -21061
7197 -21061 -5380 -1601 -6366 -9720 -10407 -15270 -31208 -29891 -15731 -13920 -15195 3352 25959 25827
7183 25827 12076 13088 5086 -6231 -11708 -20716 -26403 -16376 3079 3623 -7504 -11222 -3434 -1675
7169 -1675 -1742 -13393 -19513 -4014 15458 33417 35007 15291 265 -7320 -9918 -13804 -14294 6422
7155 6422 8840 511 -976 11355 15550 23307 17638 19288 34164 35063 32184 30885 17847 12905
7141 12905 876 -3759 11990 8238 4549 3504 -660 4451 5321 244 -17781 -13272 2802 11382
7127 11382 12482 12650 20855 23914 26577 29670 19371 12258 11344 2589 5856 4777 -10311 -659 12976
7112 12976 789 -956 -604 -533 -10100 -12163 -14127 8334 17978 22958 31796 17923 9834 16449 7034
7097 7034 -6914 -10759 -5869 -5254 -14210 -17575 -17293 10023 19647 2263 -6511 1253 9881 7358 5056
7082 5056 -11914 -24541 -15649 4140 -1842 -12092 -15950 -21662 -16942 -25451 -7109 10668 7890
7069 7890 -1285 4770 14457 -1637 -14531 -23583 -8685 6560 12239 13242 9376 2796 -1730 3921
7055 3921 3061 -5825 -6028 -5207 -1811 4705 3282 18543 18340 8891 8812 12870 28966 45914 46212 33943
7039 33943 24234 22509 12148 6267 13797 10628 5021 9695 12205 12411 -2754 -2503 3586 15672
7025 15672 17231 2664 9097 13221 17186 25650 24531 19329 16374 11179 -10378 -20342 -20839 -22459
7011 -22459 -15431 -17102 -12985 -14563 -10593 -7851 -9904 -4688 11395 18890 26928 17759 7252 -1585
6997 -1585 1132 9179 11933 1563 -8628 -3045 5745 7544 1016 1781 -1611 -18455 -28519 -38074
6983 -38074 -31542 -19059 -11469 -4805 4140 9465 15677 7367 7956 8298 10732 11878 -5392 -17870
6969 -17870 -12213 -1824 -2651 12030 20539 21319 5694 1133 -5423 -2446 8233 7276 -7867 -14205
6955 -14205 -14682 -10918 -1334 527 6828 3625 2490 7592 7757 -2042 -3846 -8475 -10545 -25791 -17881
6940 -17881 -15276 -16857 -15506 -15684 -15742 -10761 1582 4580 8012 6046 5761 -7885 -15567 -28651 -36848
6925 -36848 -27658 -36448 -40787 -24274 -5176 4372 17119 17023 -6270 4161 -407 -6745 -1656 -8610
6911 -8610 -23695 -25864 -17379 -7692 792 8997 -3493 -12214 -16294 -5875 -1529 12364 17459 20948
6897 20948 21367 16752 5274 -4694 -2105 -4348 -533 -2358 -18061 -30453 -30598 -28629 -23940 -22594
6883 -22594 -27931 -23074 -13005 -5369 275 -14072 -16172 -16594 -16564 -12267 -14128 -16799 -32101 -33202 -20869
6868 -20869 -8716 4941 2960 8609 9386 2286 4175 7751 3359 -10215 -10496 -3146 -13364 -15377
6854 -15377 -13925 -18704 -14930 -19611 -20228 -9339 -5107 -9073 -5396 -4288 4277 16169 4814 -4232
6840 -4232 -17076 -7562 -3976 -7486 -2236 8237 15200 9893 272 -12980 -21481 -10739 -13316 -18016
6826 -18016 -11500 -12001 -18988 -27506 -18296 -16784 -10131 -7610 -4532 -228 7684 10054 -3440 -4933 3638
6811 3638 -2680 -5564 -10107 -15765 -6006 -8854 -14768 -10976 -3354 2368 -1336 -16803 -19810 -8202
6797 -8202 -17738 -16915 -8829 -10203 -7943 151 -3650 -3600 145 -1410 -1341 -3675 1553 -1453 -17857 -22811
6781 -22811 -5167 -9322 -12482 -9114 -12353 -11380 1744 7483 12067 12190 10051 6941 14111 7297 10519
6766 10519 12840 24260 23761 12919 -5554 1254 7746 5543 4765 6883 14009 15632 19636 24482
6752 24482 13351 -5116 -8416 -10137 -8749 -9044 -7919 -2841 -15356 -5254 -11285 -11815 -18774 -20109
6738 -20109 -12896 4244 1746 -4992 -13385 -6924 -855 4928 13154 19220 23439 10648 19759 17395
6724 17395 23447 23600 18737 11065 6161 6606 8777 20707 28336 33982 37148 27662 23783 6288 -12019
6709 -12019 -28158 -17828 2122 10766 10431 16518 34803 29025 19495 -6818 -11344 -9194 -17958 -17024
6695 -17024 -3107 -1415 -441 9277 15264 14079 3870 -18126 -7417 -5289 -11847 -332 5186 12056
6681 12056 5342 -179 8995 4382 2410 5515 6699 5409 1379 -12719 -17090 -9245 -5466 1710
6667 1710 -5070 -6164 3449 801 13476 13132 18585 16956 717 -13996 -7668 -2426 -6618 7047
6653 7047 12514 -2423 -7045 -9935 -8451 -3179 -258 -10817 -7893 -3410 3286 682 -1935 13259
6639 13259 19599 12860 26744 40096 26814 23953 30769 26701 10257 7914 4445 -5369 -19154
6626 -19154 -19581 -21151 -20063 -18618 -7433 4134 15631 12377 -4988 -8812 -10480 -11751 -24662 -24481
6612 -24481 -22122 -17142 -3614 -807 -12210 -16134 -13802 -2923 3673 2218 5424 10832 12011 5807
6598 5807 4880 2125 3677 -2805 -7465 -12183 -5467 -10931 -9248 -8851 -12268 -1289 -3333 6148 13002
6583 13002 10763 -1965 -26824 -33755 -39494 -42403 -12434 9640 13220 14701 8054 3292 5425 -999
6569 -999 -4615 873 -14940 -8210 -4232 -7536 -11298 -19621 -23392 -22170 -14711 7478 24634 21378
6555 21378 11359 8559 3827 -4759 -10779 -1078 -1166 -6957 -15965 6788 14557 -1333 -1626 -257 -12964
6540 -12964 -7964 -15805 -24139 -21473 -14892 -2797 3474 2294 6499 14030 8525 -10074 -17196 -23932
6526 -23932 -15729 -5406 -9251 -21512 -22965 -10287 7856 10633 9496 4222 554 -2483 -1973 -5650
6512 -5650 -5040 1583 10906 23948 3760 -1960 9014 -366 -14739 -20644 -20824 -13940 -20420 -25767
6498 -25767 -34815 -40716 -26179 -27222 -35284 -12688 -1993 10654 4095 7939 1874 -61 2214 -20417
6484 -20417 -14943 5196 18309 9864 6125 11711 17519 17683 -1516 9719 2351 -14337 -25408
6471 -25408 -42282 -45356 -46434 -42544 -45072 -42784 -28618 -19713 -15197 282 -18145 -16741 -18421 -17609
6457 -17609 -22617 -7175 -2503 -2667 -543 -5226 -6484 -4058 4802 -5210 -10829 -3663 10320 625
6443 625 4367 11280 15044 3979 -1121 -4693 -9609 8314 31560 43497 30450 24565 17127 10179
6429 10179 8763 10311 11735 17130 -2892 -8146 1759 6787 4368 -6050 -6638 1503 24719 43657
6415 43657 36309 20848 27322 25716 19117 15302 19558 15656 7196 6376 -3853 -20072 -2141 -14126
6401 -14126 -18190 -2833 -9140 -5508 950 -4351 -15791 -18177 -25468 -16483 -13719 -7400 -16480 -22163
6387 -22163 -8998 14353 14056 19260 2871 -7112 -626 3403 3015 -9279 -4398 -6666 2650 537
6373 537 -5889 -6724 3312 9169 5646 2802 1074 -4885 -14011 -18468 -15680 -13669 -14084 -17800 -8932
6358 -8932 2668 943 -8573 -14219 -27827 -24067 -19296 -8371 4234 3766 4037 -4452 -12379 -305
6344 -305 5884 6652 14802 20717 14836 10761 4657 -8649 -9687 -5266 -14885 -19072 -15072 -20812 -20388
6329 -20388 4971 17511 15997 10610 -8109 -23763 -34188 -26659 -18774 -13357 -13721 -5482 725 1803
6315 1803 -1930 -8325 -14327 -20009 -15201 173 5215 5464 6660 1392 12204 8687 2852 18559
6301 18559 16150 4957 6858 4972 -7598 -10802 -1759 24 -10412 -12937 -20514 -23958 -22783 -13647
6287 -13647 -2988 3460 -11632 -16366 -22556 -24859 -23582 -26900 -11619 -4649 1149 -33 -6092 -10668
6273 -10668 -6924 -1947 -3896 3281 11780 3940 -2797 -1975 4957 4718 4380 7341 -9822 -15356 -1264
6258 -1264 7375 -9808 -13605 -6303 -5027 2957 1486 -8908 -18642 -19468 -18552 -30594 -29249 -9084
6244 -9084 561 -1638 -1265 2632 -13956 -12318 -6877 -7968 -17292 -12617 -7437 -6766 -1610 -6167 -23572
6229 -23572 -28173 -4946 15252 7677 7711 11843 13847 17009 16565 11093 5365 -11478 -21592 -18412
6215 -18412 -10058 -18870 -18291 4095 15998 19221 16488 -4813 -20357 -7044 2393 16261 9033
6202 9033 10874 6032 6629 15777 22916 17 -25050 -17938 -12231 3731 20289 25773 20903 -2390
6188 -2390 -8633 -4652 6144 7674 -17000 -16485 -2579 4484 13744 9447 2978 12670 8162 -9323
6174 -9323 1945 14496 11592 6540 2160 12102 8964 7152 6896 2253 7325 3585 3973 -453 7590
6159 7590 22944 36293 25380 -12990 -22293 -19667 -16514 -14636 -7271 72 1744 16147 17183 28379
6145 28379 23128 16101 15033 6228 -4741 -3978 7446 13170 12133 8113 -6602 -8867 -12966 -20219
6131 -20219 -19040 -24155 -29957 -29845 -13096 -3898 -8988 -4855 18804 29153 21211 16261 1466 -14448
6117 -14448 -15905 4271 15962 4281 -4762 -4346 -3760 -4646 -1179 8243 15626 6438 -7395 -7557 -6090
6102 -6090 -5692 -15927 -8016 -14708 -17272 -19932 -18230 -14170 -21536 -27725 -18670 -7731 -14265 -6072 -2366
6087 -2366 -4928 -7456 -4717 1014 1125 4277 -3065 -12598 -1936 -59 985 7068 -3225 -15006
6073 -15006 -17600 -1682 14903 15993 16003 7690 -5632 -11190 1648 1402 8456 6607 1943 3707
6059 3707 -5731 -12626 -6820 -8874 -10423 -11120 -4551 2966 -1156 -16964 -11341 -13888 -12343 -3462 -14942
6044 -14942 -27669 -10309 -4565 -260 -6208 -20880 -24496 -17403 8030 21175 30953 35864 20132
6031 20132 18531 20855 22296 24697 25156 16174 9132 7398 8083 14821 14530 20603 9389 -3813 -9912
6016 -9912 -15585 -5717 -445 -12475 -10076 -16271 -16727 -14578 -14399 -14264 -4182 -2197 -26620 -27484 -24947
6001 -24947 -38681 -25060 -8469 -20539 -30819 -34203 -40175 -28275 -9881 -18502 -16988 5134 25928
5988 25928 29217 13783 4707 3806 -493 18682 54614 43992 18969 16487 17481 19306 5467 -6833
5974 -6833 -9062 4533 -7873 -7791 7527 5531 -4227 -8264 11276 17644 3080 1950 19782 17972
5960 17972 22414 23727 24435 15957 6521 6947 11280 7434 -2421 -14553 -9676 3994 8901 9461 10241
5945 10241 -12733 -19064 -7532 -5438 -11373 -2254 -8971 -5418 -1356 4512 16206 9837 -1417 5583
5931 5583 14350 6614 -5174 3735 14213 2590 -2200 -12667 -18240 -22129 -20367 -13662 2677 -3281
5917 -3281 72 -2841 -5352 -10029 -14202 -3703 -2650 -781 -5289 362 -7562 -24953 -30410 -20136
5903 -20136 -9765 -2164 -3401 -536 6562 5557 918 -10675 -13885 -19701 -22364 -21458 -13211 -3968
5889 -3968 7104 15773 11507 3830 9571 27051 23622 16346 -8068 -35060 -31258 -10308 7008
5876 7008 -71 -1948 5287 -1317 -15228 -17232 -32249 -28607 -10096 -9494 -3237 9292 12425 7470
5862 7470 38 -9707 -4951 -9011 -16303 -15343 -20742 -7558 1180 6194 -418 -8124 -8634 -6521 -11912
5847 -11912 -16984 -19410 -5962 3132 -3133 -7845 -24070 -33894 -28375 -14702 -17538 -27460 -29820 -29087
5833 -29087 -21908 -5504 -10286 1087 4197 -10955 -10868 12597 25958 18519 15869 19131 5050 4488
5819 4488 18285 12346 3566 -20640 -38250 -15820 -10956 -2991 4297 15833 14109 7925 7578 14747
5805 14747 30640 33130 24942 12550 21149 8308 -600 7356 -5945 275 -1154 -29023 -36400
5792 -36400 -17288 -9444 -7840 -5336 897 7606 1129 -4430 -20281 -18446 -6561 3135 10051 10540
5778 10540 13287 12938 6805 20151 18500 23538 15205 1973 -5992 -1974 7182 15722 14026 17736
5764 17736 18861 15019 5629 -15939 -5985 4913 5496 3719 5123 172 720 -3777 -7939 -18354
5750 -18354 -19618 -21430 -30515 -45235 -32829 -14983 -11789 -11961 -19043 -34484 -31996 -17791 882
5737 882 10484 14256 20673 18582 1995 -14600 -12244 5168 7608 6769 -13816 -20227 -10986 608
5723 608 8699 10145 6304 -10463 -15239 -1308 -7285 -6535 4899 2648 -1066 1420 14325 9614
5709 9614 -2956 -8592 -17489 -31075 -21949 1589 10352 17243 9968 2870 5494 7759 4819 -3203
5695 -3203 -215 10100 14596 26996 25941 26413 19962 12014 4562 15236 26887 29579 24755 8816
5681 8816 2353 7488 3098 -13894 -35516 -37283 -19930 -12825 8974 6468 4665 -2159 -13801 -13168
5667 -13168 -6535 -5987 5544 -997 -18921 -17192 -12690 -20667 -18961 -8331 3496 -10443 -825 10028
5653 10028 2970 6731 7154 9830 15162 16234 17196 14209 6131 -1593 2482 8585 3507 11499 17152
5638 17152 11443 8959 -7 -11706 -10605 -1698 8430 9627 -8974 -5588 -17418 -33319 -33185 -20189
5624 -20189 -16460 -17831 -27621 -17975 -3188 2859 282 -1723 -5662 1933 -1032 4596 9318 -7317
5610 -7317 -10094 -1954 -668 -9445 -14271 -17158 2181 16375 4217 -10143 -1576 10979 1000 -7769
5596 -7769 -5613 3561 16173 20371 22401 5881 -7425 -25417 -21943 -3157 -19591 -40770 -29328
5583 -29328 -12315 -22945 -23929 -22707 -14128 -9147 601 14099 8122 6448 -6287 -8222 -8939 -5320
5569 -5320 -5856 -2395 565 9078 1649 -1571 6667 -3888 -20745 -19548 -2166 1754 390 16771
5555 16771 19029 3046 2388 17243 6606 -4742 7391 15359 5493 5916 27816 8677 -8647
5542 -8647 1843 3352 1387 18607 13098 9344 18906 23653 25154 22401 5038 -10124 -8231 7995
5528 7995 22461 26591 14897 14780 9316 11823 13651 19981 16184 18915 17819 12487 23033 16426
5514 16426 5979 3804 17977 13337 850 -10088 -3153 -2341 -4797 -9635 -11887 -7963 -10546 -19259
5500 -19259 -20353 -38102 -41612 -36473 -19715 1529 15881 16478 25521 35314 20521 -4608 -15818
5487 -15818 -15511 4248 14007 8010 2662 11209 15500 5888 11519 5885 659 2194 -3589 -10410 -4258
5472 -4258 8015 -1039 4518 5634 8019 16500 27548 32153 18535 20421 27567 22835 15787 -11592
5458 -11592 -25286 -18024 -12541 -18217 -14924 -7898 -14777 -11187 2638 8759 -7089 337 5195 -5420
5444 -5420 -14476 -2097 -453 15319 5866 -10890 11270 9778 -13287 -29692 -19812 -24509 -16167
5431 -16167 -4254 -5804 -9144 -8860 -6167 -11292 -25873 -16439 -11121 -16651 -12272 2578 3599 15055
5417 15055 20099 28765 20260 11130 6913 358 8847 11835 4930 11861 14007 -3372 -4597 -12525
5403 -12525 -17240 -8377 -4097 -8751 6065 8234 969 5004 849 2870 5456 -4381 -3976 -8964 -9033
5388 -9033 -16673 -11307 -12595 -24870 -33527 -35871 -30742 -20521 -2938 -3942 -1839 4171 7167 4443
5374 4443 -5397 -11648 -5893 -1078 -1885 -6915 -11591 -7331 -7726 -32000 -43072 -37030 -23561 -7614
5360 -7614 -15405 -19854 -31902 -33803 -24672 -22227 -12257 -2580 1722 1379 12923 13448 5903 8057 22838
5345 22838 33377 27888 21671 18252 8840 10319 12713 5864 -10602 -15603 5016 18536 1168
5332 1168 -2393 4802 5234 3705 11076 16063 10965 20456 20111 11579 4402 -722 2531 19481 4564
5317 4564 -5395 4277 9615 1521 389 9319 14759 7733 2017 -6859 -17300 1168 10528 2013
5303 2013 -3408 -947 5050 1950 -6168 -479 792 -7644 -10964 -12955 -13929 -12628 1120 -14870 -20765
5288 -20765 -20997 -16120 -4349 3336 8455 12150 29918 36686 20285 6486 15816 29936 25489 16560
5274 16560 22733 14191 5858 17553 17089 10311 10140 8030 3132 9016 22077 20080 22311 27558 16524
5259 16524 140 -16692 -12345 -295 4218 -7309 2297 9529 -9532 -8739 -2352 10779 19239
5246 19239 6603 6955 19457 24869 12080 11711 25067 26232 24447 15510 7792 5954 -1009 -6168
5232 -6168 -16193 -5819 2739 15230 15947 6790 5543 3101 186 4219 9036 1517 -5679 -10007
5218 -10007 -21714 -23517 -28794 -25666 -10051 -11112 4304 9745 12291 6102 4595 -11499 -20406 -20789
5204 -20789 -26655 -10808 2338 7497 14580 12136 9803 -2256 -9411 -3795 5285 15267 3001 -12139
5190 -12139 -16462 -2303 8565 10334 9433 8307 13467 17916 3231 4169 -787 -17332 -29564 -15077
5176 -15077 -416 6826 5929 18873 22711 23132 29557 27434 10709 -6892 -2859 4573 8074 12206
5162 12206 15417 20070 10633 3419 4271 -396 -9418 -3289 3592 -4135 -20128 -21540 -10276 -5528
5148 -5528 13264 17065 22469 12797 -1790 -17590 -34881 -34844 -28145 -16997 -3917 18899 25790 18359
5134 18359 -2234 -3680 549 902 -5193 -1903 18155 34491 21966 4685 1676 358 3262 10700
5120 10700 15672 14356 13227 21010 22612 17172 12233 16356 18340 20387 16190 22271 18824 6859
5106 6859 -8139 -8886 -10772 -13856 -12 13021 6175 2930 51 -5504 -13944 -22342 -13028 -5714
5092 -5714 -5793 -5814 -6044 5604 -7055 -12723 -10776 -9112 4130 14758 23623 16672 3494 -69 10450
5077 10450 17169 10392 9534 22379 22390 641 -586 -1813 -17298 -24882 -7959 8400 -8399 -21971
5063 -21971 -20782 -1894 4553 1300 -13669 -25796 -28473 -21328 -32597 -21233 -16059 -11602 -13423
5050 -13423 -3930 -4322 -428 -1802 -7616 -8651 7500 -1335 -19313 -9907 14470 25896 21512 7014
5036 7014 1883 4339 -1784 3061 8043 -2672 -18125 -6229 -2314 8141 7079 -6022 -18026
5023 -18026 -18673 87 -1281 -1082 2251 9390 8087 14158 13249 14389 13742 -4928 2513 8946 7149
5008 7149 -5643 -14694 -24514 -25199 -14169 -7586 -313 19931 23628 19469 -4641 -3752 4168 -4167
4994 -4167 -8822 -5629 6264 4752 98 -10692 -15342 -32163 -34719 -32203 -27745 -20436 -25868 -25067
4980 -25067 -11843 111 5311 9788 10828 8623 8749 -4536 -633 -16249 -23172 -28163 -32383 -29381
4966 -29381 -34257 -24731 -4193 -5042 -15648 -12437 -8646 983 10649 7594 4186 8395 8859 12137 22917
4951 22917 6120 -9594 -10619 2 3797 -1732 -4924 -6155 -9680 -24309 -15551 -3356 -11690
4938 -11690 -22905 -28030 -27219 -21726 -14929 -7022 -5409 7018 9986 -3482 -2206 -1451 618 773 -4329
4923 -4329 -11907 -17013 -19817 -4303 11727 1390 -1065 958 -14472 -18415 -8572 -13804 -26120 -26407
4909 -26407 -17001 -12667 -25369 -42790 -31874 -4766 -6262 -21591 -18188 -10720 -14960 -4014 13198
4896 13198 5647 102 -1471 -6030 -14781 -9857 -14439 -6340 10818 7374 -5133 -444 7056 18533
4882 18533 20801 13294 4964 -2293 1193 -18637 -21745 -17459 -23240 -19604 -16011 -17610 -12395 -5463
4868 -5463 -7056 552 15674 4614 9820 9723 1462 -11852 -12259 -6526 15713 15726 15045 16462 11020
4853 11020 19673 19886 20378 13347 -3648 -12211 -11769 3972 17796 8263 -10075 -2532 -12240 -24121
4839 -24121 -6057 -3010 -1005 -5939 -12690 -14121 -6947 -10416 -17060 -12807 -12955 -20358 -20110 -31772 -37275
4824 -37275 -24099 -10113 5483 12851 4587 -6355 -16193 -12267 -188 -19033 -16946 -6245 -4963
4811 -4963 -10113 -12858 -31892 -31369 -29291 -26447 1933 20388 18877 8018 10921 18183 4776 -10763
4797 -10763 -14351 -25299 -8836 6673 5817 4641 2344 779 -242 10624 12343 5220 4634 8763
4783 8763 2572 -13619 -10421 2633 -695 4846 664 -5551 1194 -6211 -16583 -11900 541 -7391
4769 -7391 -12667 2243 8964 26033 33867 15358 -16252 -9238 -3853 -10840 -6059 15613 -1720
4756 -1720 -30937 -36780 -30434 -20791 -17500 -11520 207 -8703 -4156 19511 21910 23478 32180 24198
4742 24198 9640 6064 -2739 8242 19191 9573 2241 8418 14365 14565 12772 -5625 -11278 -4811
4728 -4811 -7004 -13145 -15147 2528 2682 2958 -2922 -8122 -6982 914 -1542 4565 9666 8165 8392
4713 8392 15023 20614 9657 -1802 9435 14665 2168 -3800 13519 30148 24930 27344 16541
4700 16541 -586 -17670 -24777 -16921 6762 15783 9343 -11681 -11103 386 -12377 -22810 -12400
4687 -12400 1419 9370 13368 16862 15335 22573 16639 1947 -2928 8209 13411 1793 -14842
4674 -14842 -13781 -3626 -3824 857 -3641 -12980 -16976 -3522 -2490 -7709 -10163 -10207 -6189 1899 -3975
4659 -3975 -511 -3417 -11744 -2756 8252 2737 -1177 -317 -11988 -15284 -11866 -22375 -25961 -17399
4645 -17399 -1199 8061 12763 15209 22219 9617 -2031 3501 1566 -2822 -931 6902 23097 31918
4631 31918 23869 5109 -19979 -17360 -2191 7215 22963 21037 22074 18583 8608 9231 3964 -10970
4617 -10970 3611 22930 23141 6752 -5056 -16075 -35450 -28695 -16836 -2312 469 9234 -2604
4604 -2604 -5973 6904 10595 6693 11764 -2971 -18449 -11011 -12563 -9048 5223 13761 6122 5701
4590 5701 -1594 -5147 6166 22047 15310 5746 -5968 -11224 -4842 -8798 -10833 -1101 1701 2564
4576 2564 5597 -3408 -9109 1660 5126 7480 6396 5228 11932 9601 4362 -4071 -15338 -7319
4562 -7319 4995 1093 -806 -10145 -12434 -15512 -18677 -31560 -19711 -2455 9415 8925 11098 1235
4548 1235 -213 -860 -721 8313 15550 5368 -4732 -12790 -5627 14716 23071 6841 6526 -345 -12809
4533 -12809 -13938 -10591 -8432 8050 4772 -12006 -18598 -6145 14998 14797 14884 19946 23372 11771
4519 11771 12176 16720 14215 26622 20978 21439 8251 12333 6634 -5191 -7839 -9793 -12726 -18914
4505 -18914 -18553 324 4002 -993 4502 24132 20552 2770 7505 9562 -9027 -22605 586
4492 586 12098 9641 10573 9418 5921 6371 -8977 -9406 -18194 -29575 -31584 -29481 -12565 1936 -3105
4477 -3105 1005 11899 4324 3222 3121 -10449 -11437 -7156 -16532 -27763 -25765 -25870 -25866 -27049 -21854 -20028
4461 -20028 -12566 -5589 4958 15971 8788 11627 20111 17977 9844 -4553 -6050 -10524 -10417 -11339
4447 -11339 -14754 -27338 -27840 -18935 -15214 -3663 1526 2605 -5009 -10569 -6524 -12358 -20353 -26057
4433 -26057 -28206 -30039 -27080 -22141 -17909 -17143 -18181 348 21654 10838 -7939 -14931 -22803 -22020
4419 -22020 -5807 12293 12848 13763 10769 20417 3819 -84 1097 -14926 -20656 -26203 -13367 -4266
4405 -4266 4916 9714 14880 20153 4407 -10515 -13234 -19028 -13686 -7514 -8845 -1923 605 -408
4391 -408 -1391 -22614 -16059 -14402 -31949 -30507 -1821 15075 12936 16858 -3182 -9196 -3171 -10124
4377 -10124 -4806 4679 11133 11314 3289 2149 -459 -2283 -202 15386 16977 4478 -2167 -12687
4363 -12687 -26532 -15406 -190 3326 22640 19017 5183 19294 25444 27117 11715 -4596 -1019
4350 -1019 -897 -21854 -20436 -4855 5634 2281 69 -6460 -12077 -14643 -11648 -3137 -18780 -30556
4336 -30556 -21671 -8502 10821 32964 25727 21679 34589 13968 -826 -2620 7249 7403 8124 9373
4322 9373 4291 -3796 12339 5125 -16587 -21256 -23016 -32582 -35171 -24791 -12042 -7768 -16425 -19617
4308 -19617 -14527 -13797 -828 1518 -1980 -2658 -2677 -3739 -9940 -8662 -11986 -15509 -11751 -6900 -6899 2217
4292 2217 -797 -10633 -20452 -10999 4340 8422 6826 3517 5600 8565 -2872 -12474 -11901 -16277 -22295
4277 -22295 -28675 -27279 -16341 -7099 1957 -12806 -12538 -9911 -12624 -12807 5188 11531 -10786 -19396
4263 -19396 1219 4282 -6474 -3726 14851 12595 4576 9522 16733 32782 16605 -2941 -7705
4250 -7705 -14106 -9815 -6153 -13501 -15333 -13534 -2696 -1123 -2259 -6765 -2233 -1825 5371 3153 1383
4235 1383 8049 6661 9166 12925 23205 19746 13862 3900 13584 19405 18928 18726 5569 5841 23829
4220 23829 8168 -1253 -15918 -7457 1002 -15619 -12870 -13 710 -4234 8886 25274 27740
4207 27740 28887 31672 13831 -1912 -2688 595 -2017 12618 16626 -3523 -21999 -14814 -10079 258
4193 258 8827 13881 12294 3530 -2044 6689 18980 1526 1284 9331 10780 3301 -9799 -16557 -16224
4178 -16224 -14237 -10032 23385 37273 20638 5644 8032 5669 8244 16568 13517 20395 16837 14129
4164 14129 16837 4955 5368 16472 14927 6955 7708 -2136 -10378 -4038 512 -6061 -9540 1842
4150 1842 7693 28437 31677 11529 -1705 1675 9014 1506 -16982 -15798 -6923 13969 17235 335
4136 335 -15286 -17569 -16486 -35120 -38208 -17881 5275 15340 15018 8831 7279 1473 1552 -2889 -3251
4121 -3251 1619 3206 94 -9175 -6607 -4823 750 4585 3096 -2309 -2986 -9727 -15713 -10164 -3681
4106 -3681 10173 15307 7801 11874 15740 12034 17495 15804 12192 30037 32258 -499 -13503 -5577
4092 -5577 2416 -16321 -18472 -17309 -15973 -13078 -8414 15902 17932 18061 15333 -2468 -8508 -4244
4078 -4244 718 5899 -2259 -13189 -2186 4496 2413 -3539 3333 9966 10647 15382 20887 37837
4064 37837 39718 16223 5976 3439 1230 -7409 -12457 -13202 6182 15040 -4527 -19427 -16053 724
4050 724 1212 8810 11980 1746 -5825 4477 12771 12503 11862 14168 8566 -894 -4530 -11457 -21445
4035 -21445 -18126 -15612 -10528 -1079 -2819 586 -4757 -12277 -14239 -24751 -15433 -5418 -4854 -4258 -9325
4020 -9325 -6012 -8064 -4934 -20404 -25016 -14567 -8404 -9685 -16943 -26108 -28771 -17567 -5999 4837
4006 4837 1229 -4963 -5291 -14408 -26810 -23274 -7045 2591 5877 -10319 -7911 4828 1594 -1085
3992 -1085 -7574 -16873 -13934 -4013 839 -6415 -6823 1060 -2572 -14919 -20253 -22995 -22172 -16742 -25836
3977 -25836 -36549 -32591 -7057 10007 12970 17932 9849 5295 17920 22157 20589 12272 16736 21074
3963 21074 19891 10966 23915 18279 12006 22856 25752 18142 -5781 -14058 -10732 -23349 -23954 -26694
3949 -26694 -12525 -28243 -33367 -25138 1717 19578 16454 -3842 4747 2724 3910 6570 12656
3936 12656 7794 -10304 -14239 -10898 -4906 -5425 -15 -8975 -24947 -25582 -30409 -18896 -4793 6301
3922 6301 50 -16415 -27672 -7428 -1830 -4843 -826 -5356 -30101 -32010 -22970 -12634 -1051
3909 -1051 1136 2529 754 -8740 -13614 -11998 -13754 -4140 9038 13358 -282 -12383 -14097 -15361
3895 -15361 -7191 -2330 3071 7620 19718 21035 21550 9808 7169 22844 24826 19118 7333 -3565
3881 -3565 4116 -2756 -11941 -19701 -20300 -14884 1716 1998 -235 1942 -1544 -10394 -11186 -18991 -25454
3866 -25454 -19424 -1633 6094 -2132 -1756 1040 -552 -5322 -13604 -23559 -14530 -22130 -25688 -9849
3852 -9849 2566 8172 -13754 -17627 -1783 -955 -2714 -4890 -20740 -28560 -18192 -15565 -13105 -3007
3838 -3007 -8691 -17892 -5793 10010 17060 18530 6155 3201 -1060 3587 6301 15404 10104 5815
3824 5815 9556 -2341 -7766 -10480 -18122 -31407 -17706 -17267 -14361 -12269 -7503 -6378 1081 -1504
3810 -1504 -12295 -11864 -27752 -25743 -11199 -5774 -6403 -6126 -15298 -13147 -13532 -14127 -20117 -11072 2363
3795 2363 3960 -3135 -1590 -6717 -8485 53 -1974 -6639 -12255 -8493 -20664 -30457 -23484 -11733
3781 -11733 -10376 -7049 -16245 -14697 4455 10311 2624 354 1414 1575 -6165 -5883 -2828 -828 1958
3766 1958 -8235 -18350 -10393 -5557 -10629 -11569 701 6683 3808 26841 18698 8492 6299 -3394
3752 -3394 -16931 -6740 318 -6301 -15411 -23994 -13256 -13355 -24458 -34844 -30285 872 -3595 -5754
3738 -5754 -14402 -24284 -27719 -30196 -15791 -9361 -4332 2728 7904 8303 -3038 -10013 -1302 1037 8211
3723 8211 -1807 -6063 -2049 -822 12813 5012 -317 6380 21038 14460 12375 10581 11765 7934
3709 7934 -3509 -16508 -32114 -34274 -28373 -2135 -260 10732 13218 2088 5518 -6282 3685
3696 3685 7379 -8324 -4790 -11389 -4704 -8467 -16095 -12876 1161 -8538 -12482 -23095 -22003 161
3682 161 841 -13364 -4184 -5213 -12465 -20791 -14273 -11781 6358 9589 5787 6605 4287 -7239 -7692
3667 -7692 -12841 -332 15055 23932 15920 19897 14966 10449 5024 4296 7510 2109 868 519 -3923
3652 -3923 4048 10476 22779 14429 19565 7589 -1381 3460 3771 -1819 4857 11659 22102 11807
3638 11807 17758 12587 16472 11512 13587 4252 5437 5139 5802 14005 26245 17227 9811 6121 7223
3623 7223 14111 5081 7118 8965 -7423 -4877 20101 18644 -362 -22142 -20696 -8385 -6379 -5775
3609 -5775 1533 8941 10753 11940 -6671 -3115 7510 2783 -7563 -16413 -5757 5892 8864 16869
3595 16869 27065 24491 6613 633 10940 18085 16451 -4 1740 14676 7932 -2185 1460
3582 1460 2579 -1484 13275 20078 25883 12252 16289 23820 -1171 -18577 -21606 -34127 -26960 -14396
3568 -14396 -4851 11868 5523 5576 4230 6753 24428 25371 14896 1356 -14417 -9287 -6335 -3020
3554 -3020 11705 13868 5605 372 20 -7448 -14762 -19249 -642 10011 11591 -2144 -1243 849
3540 849 -4004 -15772 -8806 9864 11661 16315 15638 14795 10098 12796 8900 -782 -13188 -6896 6793
3525 6793 12905 21601 17286 15437 9919 8552 -2307 -15650 7756 15859 8190 3224 11726 9401
3511 9401 -2024 -3855 -12526 -27072 -25740 -3118 9265 4879 4507 6802 4440 868 3691 29427
3497 29427 32299 9235 3649 10413 24635 27930 21880 13860 7283 -3390 -11119 -14373 279 68
3483 68 -3116 1240 8201 3702 -3448 -614 -618 -3578 -1207 7898 1765 -8958 -19059 -9640 -13043 -10209
3467 -10209 -1334 9553 12376 7747 3250 4593 3641 5723 8668 3515 -17632 -16243 -2722 -10130
3453 -10130 -10295 -15996 -19659 -18617 -21164 -4317 6780 13343 15829 25974 33972 33970 33204 14864 10197
3438 10197 6087 15240 11336 10077 14560 6540 -156 -7550 -21231 -22154 -21482 -4158 47 4873 11054
3423 11054 19664 14632 6613 -3666 1534 13781 41235 22800 5101 -916 -3316 -9140 5667
3410 5667 13887 7584 6980 -3731 -19511 -6588 -3789 1174 13908 18343 2903 -6271 -27984 -36476
3396 -36476 -36475 -29046 -12040 -9 -5192 -2488 -3854 3019 9108 14510 9047 1318 -5588 6851 23272
3381 23272 26101 5380 -6852 -3019 -4162 4117 3900 -7798 -10685 -797 -17293 -24514 -11478 -7857
3367 -7857 -8915 -4642 6789 7597 -3315 -9046 -2458 -4151 -6902 7932 10395 -349 -8169 -15274
3353 -15274 -9287 -6224 -9070 -14726 -6985 3380 -9362 -9839 -7013 -5199 -2067 1857 -3220 -20994
3339 -20994 -19777 -7530 3068 5407 -3312 8700 9505 1164 4376 1052 -10164 -24746 -35774
3326 -35774 -34057 -32596 -32158 -41992 -30470 -27958 -15214 -15102 -11284 14996 33250 20776 -654 -20735
3312 -20735 -26865 -17112 -17419 -28283 -17880 -9041 552 2411 9765 5291 13651 8147 1998 -9286
3298 -9286 -8297 -12117 -2141 4635 551 -1999 -7417 -8933 -863 -1875 -3723 -9617 -4845 11985 16988
3283 16988 12245 1421 -6251 60 7057 11451 9727 4173 -5796 7173 3209 -529 -394 939
3269 939 11186 10240 -2035 -10496 -3418 9106 19827 20128 9915 678 1010 -9443 -23577 -27286
3255 -27286 5070 20465 14343 6969 15182 21104 2696 -10280 -2917 -9642 -16895 -13663 -9176 -16307
3241 -16307 -11616 -18769 -28921 -10607 -11599 3298 4099 5658 -1517 -1244 3070 8117 11259 14573 23372
3226 23372 22746 26176 14619 -7350 -17793 -17145 2842 21573 10025 -100 -14014 -8906 -834
3213 -834 -4276 -6978 273 6435 10382 3643 -10240 -4547 -11062 -24010 -25994 -34973 -24354 -19025
3199 -19025 -10591 -5796 1875 4781 -11413 -18212 -10313 3929 11669 7104 14353 12230 8297 1815
3185 1815 -3914 -1982 -16770 -13546 5620 7091 -13993 -25592 -8107 1382 -3397 -14584 -24783
3172 -24783 -26660 -14443 -7553 -7165 -14061 -14952 -15035 -10408 -14762 -20360 -9703 588 -12675 973
3158 973 14462 8535 9677 15832 7740 8326 8402 8660 7090 10716 991 -1533 -8835 -13366 -20347 -9024
3142 -9024 4788 7496 -825 -8433 -22309 -27743 -10672 -596 -5969 -10770 -6746 -5477 -14933 -32515
3128 -32515 -30999 -6684 1142 910 3869 -51 4448 10465 1497 -19232 -21399 -19086 -22849 -35341
3114 -35341 -29931 -33064 -39261 -46534 -38893 -30315 -15207 -13611 -14776 -6163 -3811 -4415 3238 9588 13671
3099 13671 -5171 -23844 -19937 -15312 -5958 3993 13519 12224 18535 11323 24322 16441 2045 11832
3085 11832 8927 -21278 -22200 -3897 9935 10918 -2145 -21471 -21365 -9792 -5689 -6490 3345 -1496
3071 -1496 12060 3694 -8460 -495 -1645 3632 11784 31738 38830 38155 23808 12448 21014 16362
3057 16362 7997 -1355 -15874 -10753 -3136 -5567 795 6724 -824 1819 1149 5764 687 -2194 -1619
3042 -1619 -6424 -8035 -4685 -997 1421 9469 27017 23216 11444 22391 23433 15642 13370 29688
3028 29688 52525 46344 43528 41242 30193 15568 19773 15899 -5413 -13016 10854 15131 2876
3015 2876 18009 13666 13118 16808 19475 24638 16202 19868 23327 6223 3447 12894 -592 -10405
3001 -10405 -15156 -19409 -22088 -22345 -27553 -25982 -18167 -10262 8780 21700 18218 7184 3601 1768
2987 1768 -2272 6988 18639 2956 -12085 -5103 1383 16886 4949 -116 -2606 5912 -4145
2974 -4145 -8344 1067 9244 10450 1493 -8198 -6717 -903 7300 10639 8245 5794 3694 11252 7035
2959 7035 4092 -8312 -16646 -13276 -8963 -7461 1791 -8941 -10990 -13054 -8088 2297 1512 14981
2945 14981 14622 4813 -2620 -9910 -30202 -26554 -18954 -13842 -9100 1936 -1557 -9482 -16620 -6670
2931 -6670 3257 6396 -7690 -22217 -17266 -7778 3447 3258 -13073 -14809 -1534 6922 -7550 -14872
2917 -14872 -21005 -24045 -25521 -12269 -5293 4102 7995 19317 9795 -4993 2833 4210 4430 12361
2903 12361 613 3416 12956 16839 8638 2328 6230 870 5177 18126 18821 16603 17788 2663
2889 2663 6373 -1910 -7766 4929 -11675 -25163 -12173 8029 12579 24945 16144 -3558 -2245
2876 -2245 -10839 -12436 -8859 -1680 9838 13114 5305 -5439 -20335 -21922 -25048 -25817 -18921 -5325
2862 -5325 3769 2136 -11112 -3485 5583 8956 13279 14891 10251 -3603 5798 11080 22682 21216
2848 21216 20596 19638 4810 15351 17343 5206 10098 7739 654 -4680 2953 8006 13624 18507
2834 18507 15066 -4348 -9763 7444 17442 23342 22724 7382 5824 22802 35036 18592 17916 16932
2820 16932 11831 6670 -530 18164 23792 15366 14219 21658 24833 5960 2355 2351 -5472 -442 14074
2805 14074 14863 12104 8881 2176 -6624 -11200 -12571 -13947 -15804 -12358 -1096 9991 3645 -6067
2791 -6067 2916 611 -11289 -9257 -8282 -15794 -17274 -32445 -34487 -24899 -10875 9268 21383 14570
2777 14570 9539 3496 6242 -2276 2606 24059 21689 12883 4651 8713 3924 3548 340 96 1211
2762 1211 11438 7967 -13569 -8020 -1023 -6774 -6685 3801 20037 23430 6631 -19930 -39089 -37132
2748 -37132 -31153 -17159 -11314 -15018 -14858 -10634 -14658 -25827 -15968 -6820 -2038 4021 4121 90 -2919
2733 -2919 963 -8129 -20889 -33286 -24161 -15694 -28961 -28862 -26842 -28871 -30599 -18448 -2339 4519
2719 4519 10261 12257 10590 13981 19709 23606 801 -626 -10514 -21667 -13569 -10698 -16265 -15333 -13392
2704 -13392 -2046 1316 1744 11431 22096 21493 21101 29398 27108 29731 26125 14379 1437 -2819
2690 -2819 -4132 14636 19955 19771 6359 -18867 -21769 -21827 -24285 -29674 -11217 2150 6672 -1595
2676 -1595 -5979 1418 474 -673 -2392 5437 15246 13483 11716 3033 10620 18592 9983 -3525 -3931
2661 -3931 -5633 -7261 2436 7979 546 -1962 2361 4176 12798 17487 29984 31216 29542 23000 12194
2646 12194 -945 -13653 -21852 -41711 -26354 -5560 -8135 -11482 -13223 -12956 -7543 -9140 -14213 -20496
2632 -20496 -14287 13525 30668 19776 9881 2617 -10670 -20370 -7206 12478 -762 -13268 -17045
2619 -17045 -7072 -14142 -27459 -19277 -23578 -20083 -14495 -7642 -12806 -9109 -9406 -5064 -6168 -9222 4407
2604 4407 12896 7446 8181 2315 -14291 -17241 -20644 -16825 -15633 -24897 -29073 -24645 -12201 -14358 -7375
2589 -7375 -11624 -19279 -6957 -8761 -25416 -33345 -32527 -22162 -10991 -8064 -5169 -7458 -14898 -8335
2575 -8335 -248 562 2010 -10063 -10598 -2890 6113 -516 -13851 -19398 -11375 -5628 -21383 -17628 -3970
2560 -3970 246 -4708 2791 21045 33527 27262 31858 25670 17726 14954 9389 11250 11652 9080 560
2545 560 1767 -3437 -9311 -4170 7705 -423 -14412 -25194 -32806 -28626 -22515 -5600 -2451 1472
2531 1472 2929 3498 7162 10878 11520 14818 9197 7247 18861 21055 10030 -8573 -12449 -21543 -15993
2516 -15993 -5044 -1031 9868 7640 -15227 -18708 -3517 17997 15191 8516 -1077 -5294 6421
2503 6421 13171 6294 -10405 -19556 -13760 -5683 1055 4083 -3487 3634 -2047 -3765 -11321 -7006 -1682
2488 -1682 10306 14527 8331 5622 1916 -5446 -11475 -14051 -9132 -6164 -15484 -24956 -22323 -20807 -12287
2473 -12287 -1490 2929 3301 -1986 -18949 -32433 -26323 -19504 -29215 -25842 -10864 -19157 -18050 -4102
2459 -4102 449 -4146 -8173 -23046 -9509 -3016 -2304 -16793 -26034 -14806 -9482 4791 7166 5028
2445 5028 2873 -2386 -11191 -10692 169 -643 11043 29206 22915 17641 7928 25762 26086 19478 16941
2430 16941 24470 22237 18039 5449 5379 19276 14687 19595 8568 -2399 6283 3378 -2645 5488
2416 5488 9650 18142 24270 36488 33736 27994 32194 39254 29565 21656 33388 23015 13017 18121
2402 18121 16865 10367 -1346 -1623 -51 14393 9188 1983 -4256 -14932 -10726 -11096 -10989 -7481 -5437
2387 -5437 -7611 -9982 -14962 -15911 -9869 -6540 -12682 -8014 -3165 -14520 -11549 1854 595 -3672 -152
2372 -152 9534 4225 2674 -2589 -6893 -18470 -2474 -378 -6648 20646 22269 1311 -17076 3111
2358 3111 10411 12654 20312 27225 24533 17472 5612 -2556 -730 -8869 -5773 5560 7346 -2332
2344 -2332 -10040 -16751 -1886 -13021 -9811 11912 19798 13479 3976 -3531 -6552 -13909 -8923 -6767
2330 -6767 9089 11098 -5978 -4473 11016 14295 9980 -7356 -9691 -5563 -2094 -7090 10571 22975
2316 22975 5852 -10025 -9832 -11503 -2881 12379 18846 7290 6418 5786 3210 1532 9141 332
2302 332 -9959 -6226 8997 15146 12881 15347 21164 20505 19788 6327 14037 19754 14832 2343 5121
2287 5121 8302 4543 6326 1405 -5072 -4018 -10662 -14767 -19199 -41896 -46131 -38576 -35952 -35272 -23171
2272 -23171 -8871 -6175 3444 -6349 -18323 -20325 -9808 -119 -2882 -2446 8276 15940 19780 8959
2258 8959 18253 6454 4767 -1131 -5240 -3063 6514 10662 3093 -10855 -24008 -26303 -18184 2855
2244 2855 14893 11926 11223 3746 12275 10347 13264 2207 -2936 1726 -6652 -10734 -5434 3920 5632
2229 5632 -4658 -16676 -2003 475 1128 -15905 -12648 8420 6775 -4898 -10998 -10872 -19620 -21376
2215 -21376 -22996 -21396 -20575 -27086 -26196 -16916 -6071 -13316 -6605 -12687 -17260 972 2737 5617 8026
2200 8026 11135 16796 7598 4011 22883 20882 7533 485 1308 -9278 -1230 376 -6910 -8948
2186 -8948 -3733 11762 23977 16872 -3167 592 15996 2238 -9473 -10346 -17093 -28820 -21790
2173 -21790 -13463 -19993 -13486 -5889 -8024 -11149 3021 7166 7442 2722 1292 -9126 -6934 -5612
2159 -5612 -12199 -1900 4120 13143 30448 20920 -4338 -1076 7156 24317 9691 213 -3402 -9878
2145 -9878 -5437 14356 26632 19584 6803 4794 -9387 -3006 -1787 -4837 -254 10301 14145 6260
2131 6260 -15319 -33065 -31268 -17422 -5383 1987 -9179 -8174 10018 2560 -9752 -20108 -12968
2118 -12968 870 280 -4959 4990 2620 -3590 -627 19459 16191 16751 22388 9608 -2567 7376
2104 7376 12898 10745 7150 -6032 9028 12232 15752 9591 8406 18292 16445 17312 19492 6551
2090 6551 -8616 -8009 -5684 -6686 -17701 -5584 3520 2668 -11138 -14698 -8461 -11477 -4900 -3521
2076 -3521 5031 23750 21954 23053 8179 -20726 -23720 -2153 10398 -1972 8001 16363 8743
2063 8743 5105 10660 18399 27894 25310 16628 -7180 -15793 -17410 -23098 -23503 -21111 -15645 -14128 -2524
2048 -2524 7842 7954 9130 19585 28101 22694 15930 7175 -12923 -15046 -12976 -21859 -10483 -5823
2034 -5823 19765 22817 10967 8285 -2711 1137 6696 8608 -1808 716 2109 6469 -8268 -16135
2020 -16135 -8532 8703 29116 20274 9646 3834 18022 21374 6233 -2195 -199 -1969 4002
2007 4002 4910 14207 12102 -10731 -30899 -22415 -6600 -7388 2597 7541 -5281 -2854 9618 15355
1993 15355 1502 -16293 -13030 -3924 -2918 -811 8079 9560 -3327 1113 -2670 -8014 -2723 -1849
1979 -1849 -5512 -15280 -19215 -16620 -9332 4038 17791 2005 -10151 -6967 -6026 -15161 -15587 -26078
1965 -26078 -32839 -27055 -5905 11581 6770 5266 -9410 -10453 16810 17812 3948 5025 5200 1443
1951 1443 8791 4559 1615 2857 4599 8992 7239 -2491 -8427 -3265 -7271 -5791 2117 2664 976
1936 976 17000 13503 8401 -3041 -14486 -7396 1949 5562 6650 13038 8918 -17013 -10950 9549
1922 9549 14010 4559 9572 3371 4692 -2440 -2954 10740 18618 2519 -7287 -9534 -4642 2608 -2232
1907 -2232 -10363 -10184 2348 18753 8635 8335 15838 4412 -5772 -4808 -12341 -1008 6583 4574
1893 4574 -2358 -18735 -23252 -14741 -19004 -11032 -7070 -8636 -12292 -12555 -4352 7923 15615 23350 11376
1878 11376 9055 11952 15577 10749 6062 10486 11388 3892 13923 18477 11516 15392 20752 28087 18038
1863 18038 4734 -324 -13147 -7879 1129 -3452 8052 7842 4684 11679 9519 -6647 -12243 -16810
1849 -16810 -5754 18186 26683 2795 -16680 -19955 -15078 -18118 -14895 -6918 -6551 -9538 4478 24809
1835 24809 19759 8083 1404 5473 6812 18599 28778 12029 -2702 -13347 -7668 -1222 5663
1822 5663 590 -6719 -10117 -15594 -7088 7019 7922 564 11811 19678 12333 8052 -730 -4972 -2435
1807 -2435 -1512 -3908 -1257 2701 19216 20267 12281 14955 18588 15036 5260 -701 -6213 -8207 -10604
1792 -10604 -9488 1532 12525 10152 11338 8674 13226 15316 18070 6808 11729 14080 15285 10524
1778 10524 -5966 -7938 -8659 -8194 -7124 -25173 -34868 -34053 -25352 -6546 9042 7002 -18007 -8891
1764 -8891 11170 22152 29101 12885 9001 19090 28165 21739 1649 -1789 -17865 -25317 -24145
1751 -24145 -20516 -21649 -15077 -17603 -20146 5837 14681 7548 -3720 -3854 17970 11221 -2922 -16370
1737 -16370 -11741 -8496 -9250 -13856 -9828 3234 -2014 -6942 -5289 2967 4729 8111 6031 -1617 4697
1722 4697 9896 6388 -862 9140 1973 -5286 -2805 -20648 -14636 -2113 -6788 -12658 -14965 -12474
1708 -12474 -12209 -9728 -4056 2214 7254 5636 11795 9178 9956 5611 5133 5820 4784 2080 2703 7197
1692 7197 11150 3273 11143 14969 13047 10476 14483 30032 42501 36927 23815 3877 13789 13974
1678 13974 13309 -1513 -9263 -8306 3477 9174 12581 8015 -1539 -9986 -898 3589 6167 16598
1664 16598 19194 16559 15495 11302 601 -14362 -30809 -29797 -16242 -8012 -9493 -295 -8066 -14856
1650 -14856 -25049 -25605 -30595 -15005 -5100 3874 -1490 -19181 -26362 -22813 -16118 -1488 9080 -6868
1636 -6868 -18810 -13259 -14341 -6620 8788 -8069 -125 35 18048 25531 16874 18000 22536 33362
1622 33362 23518 11046 14532 11052 13940 5768 -3275 4681 9943 10868 16025 8785 5335 -671 -6632
1607 -6632 -16780 -8404 -15186 3837 22109 16590 5794 3674 2898 8144 -895 1270 7005 3061
1593 3061 -2823 -13348 -49 13549 9717 6601 11053 8424 -22092 -25249 -21794 -29573 -23132 -8121
1579 -8121 2449 6386 -3017 -13539 2135 14657 5655 2850 -1721 -207 -7094 -8801 -14658 -28542
1565 -28542 -31191 -23639 -22326 -14778 4887 12940 8383 6198 -25985 -26524 -20867 -27115 -16093 -11087
1551 -11087 -18101 -24499 -32913 -32361 -8118 11624 5646 -17686 -10990 -11082 782 -2468 -9835 -2678
1537 -2678 2146 -4233 3188 6630 11825 13626 6300 1946 11279 5279 -4894 -1673 13198 -874
1523 -874 -13527 -2457 10881 19820 6000 1501 -41 -14094 -7799 6999 6895 -12802 -21208 -21423
1509 -21423 -8158 -18016 -20873 -6088 -17861 -21819 -19363 -10079 -2283 -11850 -23002 -16131 -16389 -17439
1495 -17439 -18596 -19612 -18270 -22292 -17600 -11529 -260 2500 18382 24675 16169 11179 16398 8820
1481 8820 13476 30303 21724 4056 -2916 -12727 -26387 -16133 -20985 -13804 -24138 -23599 -7183 8304
1467 8304 -703 -9291 -670 14565 1791 2576 -1123 -13585 -13011 -13873 -6818 -4571 3444 22601 21640
1452 21640 13332 14114 13191 1164 -11118 3856 26059 25934 14780 -1740 -9335 1003 1853 5227
1438 5227 2430 8164 7843 4446 167 6392 3682 783 -18613 -22839 -25984 -26867 -12928 -12417 -10189
1423 -10189 -5664 -7078 -8760 -6769 -21251 -9988 -941 -20114 -24099 -911 10408 20616 13958
1410 13958 16177 11177 6642 17794 13536 11067 9468 9637 3737 -8186 -17913 -22472 -24093 -21525
1396 -21525 -8329 11015 27054 29222 26080 23992 17787 23951 38828 28262 9868 -4135 -10357
1383 -10357 -5683 1224 9843 2670 5297 7373 12451 9408 2230 1780 -881 1332 -6984 -12717 8720
1368 8720 13612 17331 13897 29728 47051 31814 6214 1316 -11445 -12028 -9378 7713 11917 -2278
1354 -2278 -9893 -6828 -10245 4193 1688 7267 5900 -2081 4687 10541 -399 657 10106 11985
1340 11985 17997 14783 19598 23440 6382 -4242 17095 18801 8233 -5278 3255 -210 11931
1327 11931 16476 13900 -1889 -7232 -15392 -22799 -15550 -15550 -22363 -7649 -13435 -4744 4000 -8266 -27689
1312 -27689 -25493 -22711 -6721 3780 6101 710 -14140 -27869 -31457 -25671 -9012 7316 15794
1299 15794 16349 1371 -2049 14311 8400 9324 25488 28690 14222 3603 -10726 -20394 -9411
1286 -9411 -11490 -9975 -14561 -10751 15964 20014 17475 8255 6121 23225 25788 19786 28837 33194
1272 33194 17010 10889 1964 -12570 -15903 -10459 13029 17413 20449 27036 23674 11316 -1010
1259 -1010 -6554 -3701 12391 5916 3450 783 13014 12906 -2306 2443 4677 6159 13309 21180
1245 21180 15782 11270 50 -351 7264 1632 -2975 3524 13194 10565 -3579 -16757 -21937 -16255
1231 -16255 -285 7805 2332 2653 5084 -5690 6730 17894 5768 4196 10276 17207 11520 13572
1217 13572 757 -7922 -6605 -3460 -1660 4838 10043 9130 8949 21193 31089 16581 3265 4746
1203 4746 8504 -6838 1033 4811 14466 -1015 -5346 -4864 -932 -3617 -6867 -5639 7279 -2431
1189 -2431 -6231 -6018 2113 -8310 3217 13333 9657 -6372 -10648 -11832 -17476 -17165 -2268 6603
1175 6603 19090 28360 21939 5966 6513 5501 4758 989 2105 9904 5694 -2123 1350 2432 -13662
1160 -13662 -19711 -14269 -14209 -14446 -5024 1747 20276 25033 26909 33117 18744 5496 20907 28341
1146 28341 10766 -1918 -2478 10563 14967 14518 14670 10225 7948 13953 9698 5260 -10583 -11762
1132 -11762 -7805 -11919 -19179 -7661 -7039 -7988 -1933 -340 4567 8895 6527 -9086 -11639 -7679 -3061
1117 -3061 20 -11690 -32316 -26500 -19839 -13007 917 -17203 -16206 -8227 -14506 2019 4202 -4677
1103 -4677 1958 11990 18519 6639 10874 6002 -855 -13938 -6127 9571 22842 22523 18014 25361
1089 25361 33697 36839 28595 12804 18061 11699 1724 -1914 2327 2612 909 11560 19175 12076
1075 12076 -2815 2213 1165 -15178 -18379 -8196 -3930 -11404 -6085 -316 8894 10653 12481 9843
1061 9843 -10233 -10480 -4953 10134 10318 742 -22983 -37971 -37682 -22413 -24499 -27174 -13686 -4183
1047 -4183 -18035 -19661 -9164 -1293 694 -11077 -15141 -5698 2236 -7850 -18103 -21210 -866
1034 -866 12980 28224 20431 18698 24445 20240 16137 19368 11859 1026 -5752 -9197 -7564 -2410
1020 -2410 3660 4392 -5070 3105 10300 19357 23542 14858 6946 -3020 3808 23510 24174 13976 4350
1005 4350 1962 -2043 -12446 -11994 10283 24778 22196 2062 5263 -3071 -4882 -2995 57 11632
991 11632 1639 2208 -5058 251 5102 7128 18500 12534 5124 1790 20501 18141 7484 -3890
977 -3890 755 -4005 12638 10333 -802 7096 5367 2058 9313 3554 3256 12518 -5114 -2320 -3423
962 -3423 2949 8110 -2715 15470 17424 -1672 4661 10695 14310 9156 4286 4600 -3544 -6911 2364
947 2364 8873 24699 44924 49843 40556 18954 15517 14292 13284 12892 27616 28594 17948 -5045
933 -5045 -13572 -3651 -5968 -14116 -13918 3411 6869 -3679 -17315 -3309 5487 -937 9631 11148
919 11148 2095 9133 9372 22390 23601 12596 1872 -5521 -10194 -5196 5660 1836 -1485 6786
905 6786 2729 -9979 -21246 -17893 3753 6714 3945 -1661 -19257 -15224 -14131 -13356 -23734 -10426
891 -10426 -2092 1242 12104 14495 20876 20566 10128 4379 -2878 7537 3359 -4462 -17951 -22652
877 -22652 -13236 -2681 -1227 5512 10628 3719 -3797 15905 14587 12722 20371 19826 6205 -1172
863 -1172 -2342 12682 12382 9379 -1541 6408 23460 9213 4994 1526 -12568 -19514 -20305 -5164
849 -5164 -6407 -18922 -19591 -2362 -4292 -18042 -11366 -3484 -10510 -7658 -2692 -10517 -15720 -12350 -23349
834 -23349 -20389 -12903 -6084 -5135 -1900 -1023 1439 691 -16711 -18458 -8898 5334 10758 21456 20476
819 20476 18599 10765 -2820 -4249 2641 3320 7953 6621 884 357 3201 1609 -8336 5759 10049
804 10049 11271 14645 7276 611 3009 11853 18658 24692 19060 20121 18023 3627 -10824 -12499
790 -12499 -18747 -15025 5300 3723 -13835 -17229 -11437 -3614 -7159 -11325 -9980 -12578 -1614 15187
776 15187 19744 15812 18560 16409 3555 376 13416 13363 10101 11199 19427 28171 22346 16540 316
761 316 -1480 5360 8882 8036 7155 14318 3628 -12910 -11701 -4863 9872 9253 7876 6998 -5802
746 -5802 -13981 -21155 -19015 -10477 8640 15270 15793 12049 8633 7535 -275 4033 12113 1621 -11279
731 -11279 -16108 -1496 11821 20920 42397 34012 14215 3377 687 -13869 -7740 -7326 1741 7742
717 7742 7227 11964 6308 7721 11936 4565 -9988 -8561 5479 10085 5207 -2564 -3394 5378 -3459
702 -3459 -1706 4373 20035 22671 20016 20085 7900 -1244 -6767 7685 20248 29770 33054 28003 26726
687 26726 20740 2599 -11423 -3811 8866 4030 -3634 -1395 -788 -9846 -12138 -13006 -13833 -9766 3306
672 3306 5800 810 7244 25484 28075 23130 30893 20417 -4638 -8374 -16339 -13580 -10945 -28051
658 -28051 -30099 -25044 -18403 -5246 1932 -5110 1649 13266 22510 10961 1629 -3904 10933 11605
644 11605 9820 16885 16088 14160 14906 19803 16708 -5556 -8145 -2541 538 1611 24024 40940 27247
629 27247 13881 14323 10023 -847 6868 -669 -10196 -12018 -11930 -13703 3162 11549 6004 -465 12726
614 12726 21388 29021 26952 12957 8273 7098 12016 7951 -1247 -3004 2549 13738 17880 -5200
600 -5200 -12189 13885 28414 18938 10094 -4680 1577 4611 22935 25730 19053 7472 13191 10590
586 10590 17062 13482 2500 6354 1190 7907 25039 7717 -21624 -21870 -19066 -12794 -3192 -7272
572 -7272 -6996 -9152 -18690 -9706 -8464 -3664 -765 8678 -3250 -7665 -3277 -3553 3941 -9913 -30005
557 -30005 -22712 -12389 -2491 11905 18744 23074 22057 1275 2071 14571 23545 26777 10145 -1973
543 -1973 -6349 5882 2277 12401 10623 16407 32438 16572 8881 3353 449 -34 1192 -14018
529 -14018 -19952 2778 1199 -10895 -7548 -6815 -6034 5530 12363 10181 1949 -1155 530 9643 12134
514 12134 11229 15876 12980 1571 2158 1859 -243 -3734 2234 8179 18274 19499 7532 4098 1414
499 1414 -5314 -6403 -7928 -8671 1497 17621 23694 29457 38120 38442 34989 19418 7631 9968 8051
484 8051 10080 26804 24071 10334 8796 13039 10064 6738 -4600 -9231 -6496 -1037 3194 -1510
470 -1510 3556 16612 12705 12185 4103 -6482 270 21417 24309 13715 1015 2189 754 -16862
456 -16862 -36983 -36008 -17723 -14399 -21458 -4197 -3943 -4350 16984 9960 7270 6886 3611 262 -10282
441 -10282 -13020 -10129 -8522 -3983 3524 17701 5186 10255 9186 11313 15624 11071 14355 18647
427 18647 16569 9881 9922 18874 16685 14410 7941 -4768 -3109 -6045 -5960 2433 5757 9179 12685 2471
411 2471 6472 16414 13661 11737 16400 7964 8703 9214 8737 8329 5442 15102 33311 35105 25440 20624
395 20624 19499 16055 3137 6775 12188 14873 23289 16192 7995 14226 23644 28671 33176 32873 11834
380 11834 -8930 -5465 -4781 -9689 -8859 -8895 -3081 10400 18809 30855 22420 3760 13832 16190 20279
365 20279 11911 -4936 -5853 13505 8628 8173 5205 5249 23384 30366 21686 20061 20637 15834 15987 12099
349 12099 8387 15791 19571 12013 -3215 -10376 -11621 -2424 4368 8578 663 -9919 -1316 3259
335 3259 -4095 -5193 6298 6582 2264 8673 11110 15334 19892 23926 7229 -14298 -11051 -10148 -12037
320 -12037 -16608 -10687 -1001 -4135 -2273 -6038 -3816 3759 6537 -2579 -6360 -8862 -7558 2370 4771
305 4771 4831 1098 643 -11015 -7633 5262 3600 18948 34988 33333 31217 24736 14299 12170 19947
290 19947 22827 13279 -6115 3649 147 -6955 -10028 -10986 -7266 112 9589 21408 22430 7553
276 7553 -3995 8671 21788 29776 26777 20397 17011 15774 7334 -2565 -20999 -19603 -5259 -8786
262 -8786 -11297 -13903 -4870 -4363 -4802 334 -246 1483 1042 6707 9745 4484 7780 10388 -751 -13454
246 -13454 -15114 -10291 -7755 -8081 -2723 8888 11176 15056 26377 22490 8247 3641 -4166 -5129 -6761
231 -6761 -6229 -6839 -9142 -5443 -1225 -11338 -4581 5144 3129 8259 3852 -1094 -997 725 7292 17266
215 17266 14306 17636 24717 24431 21280 26169 37418 41006 30331 22507 5738 -4 -1917 -4776
201 -4776 2598 15267 17827 21421 15651 17730 16882 8507 9206 16999 15288 10709 7332 11087 13987
186 13987 21676 9440 6502 11326 10528 8516 7137 9312 5114 -869 -1798 -1870 1320 -5396 787 9675
170 9675 15769 8349 -4843 -6005 -14815 -3865 2684 -1 7149 3651 2970 -2167 4276 -2193 -22
155 -22 15571 23412 14934 4152 13019 22973 14925 8065 2826 947 -8683 -11607 -13038 2829 10268
140 10268 10240 18350 23579 15930 10976 1343 7443 -1402 -15830 -3737 5892 7753 5325 5622 18412
125 18412 25443 20566 12319 12642 10291 13960 12681 11945 19871 20819 14848 13063 14648 21880 11054
110 11054 -727 -4080 2065 -6501 -8180 -2553 2394 8734 13852 14548 8914 13958 6577 5831 17773
95 17773 18465 16277 13681 19731 12122 11508 7600 8749 9806 4801 -1288 -4992 3141 9154 9324 -1731
79 -1731 -6787 8327 19903 22265 22427 16479 7609 11862 13236 14761 12035 3664 -3212 2681 4004
64 4004 8852 3212 -2062 2702 708 1857 -110 7964 24113 16821 5222 6549 9270 8902 617
49 617 -3689 4019 9031 5346 6050 10492 18356 20014 22671 19402 13664 3592 7529 16222 16014 13566
33 13566 9775 9636 10387 10648 8966 13925 16259 9205 -4279 -4567 -10994 -17414 -6405 -6022 -13236 -4961
17 -4961 10487 18516 19391 20801 20215 19431 16029 6577 4427 2260 -4189 -5724 -10827 3321 14608
2 14608 12253 8406
0 8406
$$ Imaginary data points
##PAGE= N=2
##DATA TABLE= (X++(I..I)), XYDATA
32767 27458 20194 22322 32247 38141 31763 34339 33519 29411 32418 30880 25725 27430 22240 22015 21905
32752 21905 16581 19645 24325 24478 27259 29891 20226 14973 21109 27703 35144 30366 28714 40744
32738 40744 32859 21022 36388 47657 54197 56442 48571 55673 50984 59172 47482 31911 37602
32725 37602 49808 51717 53410 54956 50179 42814 35311 36093 44347 50298 53141 54371 56041 50787
32711 50787 55462 45991 39581 47169 50773 51254 41062 35736 44602 44648 51873 60449 53439 56110 55298
32696 55298 52624 53677 60177 69852 68262 74296 85459 68487 63748 63753 69514 74711 83155 85970 77892
32681 77892 79279 69785 62156 65701 68300 75984 67033 57676 62174 70578 65409 59158 48475 61228
32667 61228 69544 70595 81346 68486 65557 72637 82707 73943 67897 75965 81001 77021 62881
32654 62881 56927 55085 56774 59218 65571 84751 85868 83049 73570 72149 69723 73690 88046 94019
32640 94019 94443 78706 70765 75448 75683 76579 80301 80243 76208 83724 96624 101813 104134 102903 91460
32625 91460 89367 84115 82010 74294 73128 73898 69518 73046 79582 82066 84482 87944 92266 88177 83424
32610 83424 93822 100323 92635 79244 71270 84730 88657 85131 70057 68835 70097 86678 102692
32597 102692 102847 108954 108751 96478 91263 96655 102064 101304 99190 94539 80320 87566 103950 105690
32583 105690 104052 113535 118995 112010 102944 108963 114658 105831 109662 101971 92333 90201 110490 107506
32569 107506 103604 114987 109407 123979 125265 115594 110877 109982 101049 102326 98095 103834 105737 104901
32555 104901 100886 101633 114556 123227 107321 95339 95930 100981 113707 128417 138066 126884 111317
32542 111317 121844 123922 114966 101306 92547 98180 104470 112210 120957 126122 123460 118583 126128 130039
32528 130039 129885 120983 117998 117570 113616 119923 114596 119186 127948 139626 129196 123870 126860 141162
32514 141162 131829 126166 123811 119507 126987 121209 114408 111512 122267 128883 132291 137221 140683 149059
32500 149059 140759 124669 125280 128735 134932 143482 145745 128203 117379 123166 121415 136209 131035
32487 131035 133116 142065 146502 149869 150936 158584 170406 156865 127111 107212 109763 124004 136924
32474 136924 132022 128470 130403 132586 142188 135550 124739 116283 116703 114569 122917 130490 126249 120956
32460 120956 116793 110844 109360 117315 132831 142111 143461 135252 133738 131820 152413 141887 122805
32447 122805 128294 143484 163501 167590 152576 143312 137829 144650 129917 128641 124534 121302 127375
32434 127375 136104 138691 143955 133936 141539 136208 137964 143624 147708 153908 163235 173110 159904 147175
32420 147175 150383 145402 139196 133955 144307 150600 156078 158721 163314 172475 159122 151544 166320
32407 166320 170100 170204 172033 179827 163480 153785 153429 155718 153772 164088 160213 156574 157539 166742
32393 166742 179915 182903 176135 169015 157329 162147 161403 166311 171739 176552 163286 169198 146011
32380 146011 135019 142062 154684 155826 151737 144647 140021 138048 146308 133061 123210 135321 157188
32367 157188 175921 180071 160959 148455 143187 143194 138709 152135 158478 150293 145445 141697 144232 149821
32353 149821 159761 167865 162482 161067 154853 157509 162654 155561 152597 154684 164619 180569 182813 161313
32339 161313 146825 144299 153608 152803 163797 163143 158460 167228 172213 169367 154991 149095 155594 151586
32325 151586 142454 142301 150553 164117 164550 158441 145780 158001 160828 169066 168628 165573 172051 172772
32311 172772 166623 171972 159055 143086 142595 137122 144294 150086 156008 153449 158597 170263 163098 153313
32297 153313 146574 140096 162857 170475 162624 169607 176328 179792 162315 164550 172865 174387 162567
32284 162567 160024 162833 161433 159875 162736 162428 167461 182643 176484 166662 166673 163361 162601 175312 181706
32269 181706 180753 172073 165961 157623 148350 132853 128385 145480 158021 150263 140854 151725 164552
32256 164552 178639 192772 198335 197488 176603 169663 167440 168250 183504 183970 158670 148021 156740
32243 156740 161764 159824 161168 156775 160060 158573 141580 131803 135968 159870 177526 168115 143668
32230 143668 145464 145980 142928 152166 173642 182041 178284 167574 180656 179648 170309 160532 150874 147565
32216 147565 143946 140584 144612 156893 159421 164479 164139 159682 158515 168998 171036 176287 179166 178891
32202 178891 157665 137189 152770 165159 161744 152334 142241 150255 159487 169619 170412 165855 170548
32189 170548 174294 159272 155582 156814 150826 158735 170990 180827 177945 172717 176604 174530 166077 163440
32175 163440 177883 174852 169927 154147 154415 153699 143411 152305 158481 175589 192677 185940 168169
32162 168169 162698 161871 167517 175893 189507 185927 173451 166105 163524 172852 166027 164167 166884 170376
32148 170376 162465 157806 145709 139079 138656 149904 161143 169115 173412 185936 187594 180698 172135
32135 172135 173493 172860 189907 193662 184356 187768 187781 173271 170590 161379 161428 173771 178008 159832
32121 159832 153001 161494 151765 147739 161401 179509 187263 185901 189586 184784 175682 171817 176399 171183
32107 171183 158895 167300 181763 188556 210255 212736 201465 191225 190252 183102 190707 177233 153544
32094 153544 164178 172995 176863 165672 177158 191246 189733 174258 163277 162388 165733 168737 177251
32081 177251 184994 183159 191009 191965 177033 163222 148997 155855 170976 174768 191842 179479 169466
32068 169466 159938 173455 173636 172283 177727 170436 173581 184752 184356 188071 186302 179339 171287 168518
32054 168518 167430 160738 174942 177162 169871 168891 161459 164480 168249 164771 169063 176748 176119 168053
32040 168053 173213 186726 195595 184414 169109 174084 179205 184141 190194 174762 170995 168990 170755
32027 170755 167567 173014 171548 160429 161999 188689 210224 194356 189071 194124 188374 178656 168911
32014 168911 183598 194443 192964 192030 193509 192728 179948 173603 180499 185180 182722 171604 173678 187326
32000 187326 189941 183100 184347 187036 181515 171521 156518 153193 170606 181836 159955 168739 187484
31987 187484 179940 161406 160792 162131 169425 171845 178119 179970 173388 167252 156517 158310 164149 164408
31973 164408 163398 170426 159047 148467 167155 181977 189752 201193 191366 182137 185957 189100 192353
31960 192353 185987 176486 175980 172765 161993 152476 160258 164440 161639 157997 156738 158387 147867 154687
31946 154687 165778 161868 152448 153863 162704 161576 159827 172139 179687 197666 191012 180505 194016
31933 194016 196632 183360 178963 193859 203083 183420 181738 196316 176686 168623 183977 180862 173258
31920 173258 181901 179259 173152 184791 192285 202537 186209 180783 185762 160536 153870 160828 148837
31907 148837 146081 142450 153990 159384 167158 165082 164714 171907 174454 192495 198808 197138 176104 171995
31893 171995 173110 179828 198824 201119 188841 192457 202636 204680 206401 195880 189930 177826 180284
31880 180284 185077 185056 182832 174972 183916 202277 196218 179573 175259 183930 186410 179062 167747 161500
31866 161500 172226 168932 158798 147070 164919 170116 180186 176514 187054 186878 179071 172777 172954
31853 172954 190595 183543 165924 149704 157679 169547 183880 187305 177634 167183 171823 186011
31841 186011 190241 184123 179370 182866 185489 190280 177851 170879 168003 157623 146801 144298 155134
31828 155134 169469 186196 181117 172927 179197 176289 178039 170465 161227 170637 181420 189216 189690 179120
31814 179120 163610 160575 156986 164516 167094 165127 154975 165070 187310 182850 175470 169458 155917
31801 155917 158850 182228 187898 181319 170033 161961 168955 168686 171149 168908 192559 190872 181556 171814
31787 171814 172003 170777 179379 184402 179757 186795 188513 176624 167898 167622 173937 170865 167718 160805
31773 160805 153063 167033 179575 193994 203461 195582 176868 163177 164132 162530 157965 167256 182232
31760 182232 175375 169542 158611 151521 162622 171114 173975 172340 167047 148191 148084 158492 173472
31747 173472 177847 189727 190525 188470 178823 174093 168920 165640 159405 153269 171347 166508 175168 174705
31733 174705 165436 148212 166338 189898 198447 194556 176866 177459 193327 195960 197178 205289 198850
31720 198850 184338 171337 171559 193835 193454 174639 168497 172668 167843 164578 163273 161719 172109
31707 172109 172482 154347 157067 175654 182397 180138 177521 170445 156180 159850 173329 187133 190619
31694 190619 186538 190469 189083 173248 176736 181215 180711 172669 177095 183157 183675 172635 182577 190254
31680 190254 181603 174130 186358 191665 174416 157074 157436 168812 177207 162871 174000 181261 172438
31667 172438 170846 177626 175631 168069 157930 150600 150106 146871 156419 158572 169054 183376 178410 181155
31653 181155 167329 159446 158123 165595 165962 160526 180501 182919 181804 193679 197433 191408 185535 178911
31639 178911 178134 167387 155495 149904 160836 174682 171208 159031 160326 156737 145355 153410 169659
31626 169659 158334 154581 177524 191384 186560 185009 193921 199878 195398 182115 175359 164416 154933
31613 154933 182034 184615 165672 148130 159490 177710 179776 183179 187247 191928 185442 179505 183350
31600 183350 173821 162168 178231 178969 167642 174505 168945 171276 180896 175745 182610 182327 176005 171117
31586 171117 184657 186437 187808 186172 182062 175163 177509 188242 197279 175659 171395 159777 144211
31573 144211 146976 164612 188258 206308 200381 188164 182829 177234 186112 199938 202943 190260 189061
31560 189061 186689 181595 177794 174793 189526 195997 176656 164743 151639 153505 172014 173325 166620
31547 166620 158056 161965 174082 187430 178749 191620 201948 198557 189663 186914 184121 185051 177775
31534 177775 165415 153200 152536 152443 148158 153385 152877 167767 178803 178448 186173 209541 210328 199840
31520 199840 180552 176432 173975 172226 163236 157242 162150 167204 158601 160255 138371 146060 168008
31507 168008 181213 187563 192772 181841 177406 182215 198870 207410 200715 198688 198456 198198 203104 213682
31493 213682 225400 216663 212333 194283 175797 193234 186904 176742 176320 183314 178751 173459 163604
31480 163604 165175 182858 191412 186528 188508 187962 183230 191550 194938 196575 185138 163532 157100 158583
31466 158583 150524 163728 173527 177182 177867 175914 173432 174029 183750 186260 194190 207235 201677 205309
31452 205309 195498 191364 186356 186987 206513 208489 214155 220741 206840 193479 185747 187385 189016 181076
31438 181076 178548 171375 169088 165537 179361 175987 157951 163121 168254 176547 176655 184638 168333 161663
31424 161663 170874 169846 174669 179348 194268 192894 190687 179453 173896 181110 189216 189806 189535 195827
31410 195827 204381 214235 198651 185135 176638 177714 176314 178534 166909 161004 160489 177295 184867
31397 184867 186614 190615 201835 202479 203127 197057 187190 200144 186534 177471 179411 179495 172393 154026
31383 154026 144477 151769 168053 184280 192259 194714 193619 185649 186243 186651 179821 171794 172356 180003
31369 180003 193962 191013 173718 166594 164636 162499 159657 176116 175261 162774 165119 175478 181155
31356 181155 164032 162982 168979 172585 179754 191320 184670 173902 172656 154933 150757 147941 151762
31343 151762 161608 170870 161134 176297 182621 181721 184514 184504 170312 174701 191468 204778 203996 190685
31329 190685 176968 166898 164889 173968 178945 184973 173939 166159 169134 178420 193602 176514 167363
31316 167363 167062 194203 198998 188494 193812 185307 179016 177327 166247 167981 176335 181959 177642 181427
31302 181427 185580 171336 164159 158165 151985 149359 149957 138151 142626 145093 148240 155589 167306 172797
31288 172797 161224 156358 151217 164651 174116 179002 179358 178275 160652 167482 169686 168009 161901 166698
31274 166698 184515 194235 193154 176974 163600 176458 188528 195302 190925 191463 192989 175918 179168
31261 179168 188528 193580 194405 195171 192717 187547 174657 162026 161323 174779 185366 199495 195586 189936
31247 189936 184367 182144 175329 178581 181580 175309 156257 144513 155430 168150 166658 168130 187546
31234 187546 182157 176370 176789 181301 173757 181874 177447 172033 177029 190163 191682 185255 182633 185214
31220 185214 189816 183026 171389 176821 179251 168788 160067 158594 185963 193396 184567 188362 194137
31207 194137 190057 180482 161666 161966 168281 182905 199408 196068 210084 211277 209526 211268 205939
31194 205939 199552 217299 227177 213141 196105 190291 188902 178825 181013 182615 186347 182353 182508
31181 182508 184122 195385 200723 187618 176702 180074 191686 186325 178663 185011 173450 175773 178296
31168 178296 180078 173262 179605 189472 182984 171284 170757 171680 176234 166109 160583 169854 172861 163207
31154 163207 173370 180398 172886 165734 175056 176497 169700 154091 156966 161791 171433 170933 177290 187507
31140 187507 188143 170633 168920 167725 174066 173788 173208 163225 155125 158881 165711 166784 164993 165226 164926
31125 164926 169283 170556 172265 168203 175573 184610 178248 172799 177246 188380 192832 193940 196141 208969
31111 208969 216279 209417 204912 197659 199968 180607 156608 166663 172831 175542 159153 168775 175197
31098 175197 200027 201736 195088 195782 185099 185002 190445 183636 179546 179081 189556 188225 185188 178778
31084 178778 178891 190507 179768 183488 191798 192299 188329 182392 187865 172604 155419 146920 158656
31071 158656 173443 172518 183977 194592 188047 180940 166817 167722 167882 176881 187403 179230 181945 184184
31057 184184 182230 193507 181839 182242 191245 189422 171591 161999 160276 167052 179804 189629 191806
31044 191806 190032 187259 179070 166771 171644 179472 175888 178688 174580 169831 176425 172839 174627 177384
31030 177384 170457 167742 177504 175588 180539 188435 182655 190283 191353 186232 188622 164500 159785 173003
31016 173003 180137 177558 180252 169775 157532 153448 162734 172038 165727 159664 157233 170303 175264
31003 175264 174208 178425 170432 174335 174915 168677 190159 199442 187111 180283 183340 182070 173759 178756
30989 178756 184002 195314 184220 165685 170546 171177 176519 190900 190641 192421 181754 184066 179275
30976 179275 188040 189612 180221 174718 174778 195603 201952 178599 177669 193808 215522 232216 224210 211646
30962 211646 209432 215512 226231 218050 209053 199794 186435 187101 180505 168055 172457 193063 195153
30949 195153 192982 193218 200282 201652 199498 200547 183836 170981 183516 194510 189979 177553 166050
30936 166050 163867 184034 191241 191504 185713 173127 163573 169356 172224 176005 195626 208683 199680
30923 199680 178021 171168 165567 175870 180062 175413 178564 188938 186338 175614 161020 144590 159461
30910 159461 179946 181174 167106 164691 184574 197088 185607 176416 177411 179292 188132 179430 175456
30897 175456 172405 181681 200280 210035 209356 193379 183352 175926 168532 167486 168005 168091 168336 175806 171037
30882 171037 166112 157444 148961 154942 169750 167401 172622 161708 161480 161883 139913 142591 149597 168750
30868 168750 173409 164486 163038 174533 180512 183745 196125 189434 191100 178724 173865 180898 179820
30855 179820 186753 190979 184724 188493 182388 181702 186245 173450 163721 167043 175874 186110 202129 192017
30841 192017 180108 189547 191497 184703 192044 182744 170217 181566 199786 201102 195712 190007 197029
30828 197029 192376 190826 182465 175155 178036 176975 178510 172888 173029 173777 175224 175749 176158 177981 184433
30813 184433 180715 176261 178767 197373 216923 216054 219898 217115 218436 206787 192103 182431 185068
30800 185068 186366 194619 204392 189659 188920 190135 184246 176609 176211 182801 181884 162956 166191 180557
30786 180557 185871 180701 177925 176710 167652 170893 174955 194274 193371 164877 154032 163861 178092
30773 178092 189783 185089 181191 178598 170166 167321 169033 171473 178831 171792 169924 175518 176766 181229
30759 181229 179423 173502 185745 176286 169844 168206 178327 187119 203581 224453 220120 202118 194865
30746 194865 182490 179765 180233 173248 173619 190077 190189 173537 169221 177956 187767 191530 194160 212902
30732 212902 226992 221345 207398 181831 163417 161267 159111 165247 168634 166890 180075 164844 156462
30719 156462 164846 177298 185982 185715 172783 183754 187908 181047 185110 191396 190164 186342 191729 186229
30705 186229 180603 193469 200914 194661 191549 197217 212042 210118 204207 203841 211837 215961 209035 186633
30691 186633 183499 199682 189948 181010 187377 182623 180833 182909 177724 172697 181462 176975 174686 186079
30677 186079 194495 202401 197025 191779 202990 209325 206912 201895 195791 190549 188842 183199 172164 165887
30663 165887 189177 197265 192424 166856 151009 169082 189371 187805 173536 176264 185024 184698 191420
30650 191420 207002 213235 213371 212662 204194 193032 181370 174442 174747 176119 171319 172517 180789 177376
30636 177376 177698 181168 171710 171603 175359 169720 161159 154474 155660 153520 153021 165718 171630 176497 183833
30621 183833 188300 187760 182979 185536 180159 182460 189398 196874 188330 200162 197043 185103 191348 195991
30607 195991 197242 192496 196144 199724 192724 200909 201941 200502 194101 196294 197450 184918 176253 189093
30593 189093 195446 198368 197306 190070 190380 208683 208041 187130 182530 185015 184408 188357 173285 173360 176630
30578 176630 182174 176988 175589 185584 181777 190023 192473 188498 172254 165803 169716 179772 193287
30565 193287 195291 185658 174135 186806 188731 185508 187502 179844 183660 191613 192367 180981 172488 170104
30551 170104 153270 155564 159957 164646 171760 179553 179240 188186 190103 201464 199147 195086 187213 189057
30537 189057 199086 181566 178850 174057 174395 169167 181241 190098 201710 202652 181534 174400 186195
$$ [...]
##END NTUPLES=NMR SPECTRUM
##END=
