##TITLE=Analysis number 316227
Compound Code mo 07312
Book Reference 414/156/2
Project Code adrs
Chemist Name mattw
##JCAMPDX= 6.0         $$ Bruker NMR JCAMP-DX V2.0
##DATA TYPE= NMR SPECTRUM
##DATA CLASS= NTUPLES
##ORIGIN= Bruker BioSpin GmbH
##OWNER= nmr
$$ XWIN-NMR		Version 3.5
$$ Fri Jan  6 08:27:21 2006 GMT Standard Time (UT+0h)  MAYBRIDGE\nmr@NMR_250MHZ
##.OBSERVE FREQUENCY= 250.131544655141
##.OBSERVE NUCLEUS= ^1H
##.ACQUISITION MODE= SIMULTANEOUS (DQD)
##.ACQUISITION SCHEME= undefined
##.AVERAGES= 16
##.DIGITISER RES= 18
##SPECTROMETER/DATA SYSTEM= dpx250
##.PULSE SEQUENCE= zg30
##.SOLVENT NAME= CDCl3
##.SHIFT REFERENCE= (INTERNAL, CDCl3, 0, 16.522)
##AUDIT TRAIL= $$ (NUMBER, WHEN, WHO, WHERE, WHAT)
$$ ##TITLE= Audit trail, XWIN-NMR		Version 3.5
$$ ##JCAMPDX= 5.01
$$ ##ORIGIN= Bruker BioSpin GmbH
$$ ##OWNER= nmr
$$ C:\u/data/dgb/nmr/ADRS/14320/pdata/1/auditp.txt
$$ ##AUDIT TRAIL=  $$ (NUMBER, WHEN, WHO, WHERE, WHAT)
(   1,<2006-01-06 08:26:45.66 +000>,<MAYBRIDGE\nmr>,<NMR_250MHZ>,
      <created by zg, POWCHK disabled, PULCHK disabled
       configuration hash MD5:
       62 19 C7 07 E1 42 D1 B7 37 6C 3D D0 77 39 F9 E6
       data hash MD5: 64K
       54 77 40 2D FC A5 BF 48 4E E6 4A B1 8E 3B 73 9E>)
(   2,<2006-01-06 08:27:00.76 +000>,<MAYBRIDGE\nmr>,<NMR_250MHZ>,
      <Start of raw data processing
       ef LB = 0.3 FT_mod = 6 PKNL = 1 SI = 32K 
       data hash MD5: 32K
       44 19 67 49 F5 54 23 D6 24 8F 52 02 DC 5F 6F DF>)
(   3,<2006-01-06 08:27:02.63 +000>,<MAYBRIDGE\nmr>,<NMR_250MHZ>,
      <apk 
       data hash MD5: 32K
       98 05 26 5B 10 F8 06 A2 E7 1A 43 99 B1 C5 18 13>)
(   4,<2006-01-06 08:27:03.43 +000>,<MAYBRIDGE\nmr>,<NMR_250MHZ>,
      <abs ABSG = 5 
       data hash MD5: 32K
       22 E0 EE B1 81 D3 3B 2F 11 18 64 2A E4 6E 66 79>)
$$ ##END=
$$ 
$$ hash MD5
$$ 6D F2 04 E6 CB 33 81 15 26 0D 50 92 A5 F7 A6 44
##$RELAX= 
##$RELAX= 
##$RELAX= 
##$RELAX= 
##$RELAX= 
##$RELAX= 
##$RELAX= 
$$ Bruker specific parameters
$$ --------------------------
##$DU= <C:\u>
##$EXPNO= 14320
##$NAME= <ADRS>
##$PROCNO= 1
##$TYPE= <nmr>
##$USER= <dgb>
##$AMP= (0..31)
100 100 100 100 100 100 100 100 100 100 100 100 100 100 100 100 100 100 
100 100 100 100 100 100 100 100 100 100 100 100 100 100 
##$AQSEQ= 0
##$AQ_mod= 3
##$AUNM= <au_zg>
##$AUTOPOS= <7 >
##$BF1= 250.13
##$BF2= 250.13
##$BF3= 250.13
##$BF4= 250.13
##$BF5= 500.13
##$BF6= 500.13
##$BF7= 500.13
##$BF8= 500.13
##$BYTORDA= 1
##$CFDGTYP= 0
##$CFRGTYP= 5
##$CHEMSTR= <none>
##$CNST= (0..31)
1 1 145 1 1 1 1 1 1 1 1 1 1 1 1 1 1 1 1 1 1 1 1 1 1 1 1 1 1 1 1 1 
##$CPDPRG= <>
##$CPDPRG1= <>
##$CPDPRG2= <>
##$CPDPRG3= <>
##$CPDPRG4= <mlev>
##$CPDPRG5= <mlev>
##$CPDPRG6= <mlev>
##$CPDPRG7= <mlev>
##$CPDPRG8= <mlev>
##$CPDPRGB= <>
##$CPDPRGT= <>
##$D= (0..31)
0 1 0 0 0 0 0 0 0 0.06 0 0 0 0 0 0 0.0002 0 0 0 0 0 0 0 0 0 0 0 0 0 0 
0 
##$DATE= 1136536004
##$DBL= (0..7)
120 120 120 120 120 120 120 120 
##$DBP= (0..7)
150 150 150 150 150 150 150 150 
##$DBP07= 0
##$DBPNAM0= <>
##$DBPNAM1= <>
$$ [...]
##$SUBNAM7= <"">
##$SUBNAM8= <"">
##$SUBNAM9= <"">
##$SW= 20.6930455092707
##$SWIBOX= (0..15)
0 0 3 0 0 0 0 0 0 0 0 0 0 0 0 0 
##$SW_h= 5175.983436853
##$TD= 65536
##$TD0= 1
##$TE= 294.16
##$TE2= 300
##$TE3= 300
##$TEG= 300
##$TL= (0..7)
0 120 120 120 120 120 120 120 
##$TP= (0..7)
150 150 150 150 150 150 150 150 
##$TP07= 0
##$TPNAME0= <>
##$TPNAME1= <>
##$TPNAME2= <>
##$TPNAME3= <>
##$TPNAME4= <>
##$TPNAME5= <>
##$TPNAME6= <>
##$TPNAME7= <>
##$TPOAL= (0..7)
0.5 0.5 0.5 0.5 0.5 0.5 0.5 0.5 
##$TPOFFS= (0..7)
0 0 0 0 0 0 0 0 
##$TUNHIN= 0
##$TUNHOUT= 0
##$TUNXOUT= 0
##$USERA1= <user>
##$USERA2= <user>
##$USERA3= <user>
##$USERA4= <user>
##$USERA5= <user>
##$V9= 5
##$VALIST= <valist>
##$VCLIST= <CCCCCCCCCCCCCCC>
##$VD= 0
##$VDLIST= <DDDDDDDDDDDDDDD>
##$VPLIST= <PPPPPPPPPPPPPPP>
##$VTLIST= <TTTTTTTTTTTTTTT>
##$WBST= 1024
##$WBSW= 4
##$XGAIN= (0..3)
0 0 0 0 
##$XL= 0
##$YL= 0
##$YMAX_a= 415817
##$YMIN_a= -443640
##$ZGOPTNS= <>
##$ZL1= 120
##$ZL2= 120
##$ZL3= 120
##$ZL4= 120
##$ABSF1= 16.522
##$ABSF2= -4.171173
##$ABSG= 5
##$ABSL= 3
##$ALPHA= 0
##$AQORDER= 0
##$ASSFAC= 0
##$ASSFACI= 0
##$ASSFACX= 0
##$ASSWID= 0
##$AUNMP= <proc_1d>
##$AZFE= 0.1
##$AZFW= 0.1
##$BCFW= 0
##$BC_mod= 0
##$BYTORDP= 0
##$COROFFS= 0
##$CY= 12.5
##$DATMOD= 1
##$DC= 0
##$DFILT= <>
##$DTYPP= 0
##$F1P= 14.0000005364418
##$F2P= -0.99999901652339
##$FCOR= 0.5
##$FTSIZE= 32768
##$FT_mod= 6
##$GAMMA= 0
##$GB= 0
##$INTBC= 1
##$INTSCL= 1
##$ISEN= 128
##$LB= 0.3
##$LEV0= 0
##$LPBIN= 0
##$MAXI= 10000
##$MC2= 0
##$MEAN= 0
##$ME_mod= 0
##$MI= 0
##$NCOEF= 0
##$NC_proc= -3
##$NLEV= 6
##$NOISF1= 0
##$NOISF2= 0
##$NSP= 0
##$NTH_PI= 0
##$NZP= 0
##$OFFSET= 16.522
##$PC= 1
##$PHC0= 86.77477
##$PHC1= 5.780932
##$PH_mod= 1
##$PKNL= yes
##$PPARMOD= 0
##$PSCAL= 4
##$PSIGN= 0
##$REVERSE= no
##$SF= 250.13
##$SI= 32768
##$SIGF1= 0
##$SIGF2= 0
##$SINO= 400
##$SIOLD= 32768
##$SREGLST= <1H.CDCl3>
##$SSB= 0
##$STSI= 32768
##$STSR= 0
##$SW_p= 5175.98343685301
##$SYMM= 0
##$S_DEV= 0
##$TDeff= 65536
##$TDoff= 0
##$TI= <Analysis number 999999
Compound Code 99
Book Reference 9
Project Code 9>
##$TILT= no
##$TM1= 0
##$TM2= 0
##$TOPLEV= 0
##$USERP1= <user>
##$USERP2= <user>
##$USERP3= <user>
##$USERP4= <user>
##$USERP5= <user>
##$WDW= 1
##$XDIM= 32768
##$YMAX_p= 381730743
##$YMIN_p= -129302
$$ End of Bruker specific parameters
$$ ---------------------------------
##NTUPLES= NMR SPECTRUM
##VAR_NAME=  FREQUENCY,     SPECTRUM/REAL,   SPECTRUM/IMAG
##SYMBOL=    X,             R,               I
##VAR_TYPE=  INDEPENDENT,   DEPENDENT,       DEPENDENT
##VAR_FORM=  AFFN,          ASDF,            ASDF
##VAR_DIM=   32768,         32768,           32768
##UNITS=     HZ,            ARBITRARY UNITS, ARBITRARY UNITS
##FACTOR=    0.157963299565203, 1,           1
##FIRST=     4132.6476996994, 0,             0
##LAST=      -1043.33573715361, 0,           0
##MIN=       -1043.33573715361, -129302,     0
##MAX=       4132.6476996994, 381730743,     0
$$ Real data points
##PAGE= N=1
##DATA TABLE= (X++(R..R)), XYDATA
$$ [...]
19572A21967K4683r778K3205J9748K3698J3274L5757k600K1158k3864j3934l02
19560B33012K0917P748j365N365J3611M8800J23074J29044P7277J5482k8275k5459
19548F19231l3618m1814k3205n2l1980j0417m981j9720m4269q6514o7690j6911
19536B38060l6042l6198l0607k2098l9059j1572j2094K3384M0491j9136k3011
19525G2118m363p084Q372j647k1039l447J3741K0052L718j855j6002K3505J9586
19512A05655k8472l9261O617R492l7976k6222j1935J4410p379J2277P143P015
19500A1364J1633j9048j414L4060n886l3587l2681J4553J4044L585m698K9588
19488B1513l400j2409J0834K146J636L6308n515J8915q872k6555l8351K1981J8736
$$ y = [121967, 146650, 136872, 160077, 179825, 203523, 216797, 252554, 249954, 271112, 247248, 233314, 233012, 253929, 261677, 260312, 265677, 279288, 328088, 451162, 580206, 657483, 672965, 644690, 619231, 585613, 543799, 520594, 520542, 488562, 478145, 473164, 453444, 409175, 322661, 254971, 238060, 202018, 165820, 135213, 113115, 74056, 62484, 50390, 73774, 114265, 95129, 72118, 67755, 60671, 69043, 67396, 46357, 42910, 56651, 76703, 80421, 78566, 62564, 86069, 105655, 77183, 37922, 44539, 54031, 16055, -10167, -22102, -7692, -15071, -2794, 4349, 11364, 22997, 3949, 2535, 36595, 30709, -2878, -35559, -21006, -6962, -3377, -8075, 21513, 18113, 5704, 16538, 18684, 20320, 56628, 51113, 70028, 61156, 34601, -3750, 18231, 36967]
19475C6967K4775j4587o356J0253k2467j3078k964j5037K2783M1316j2702p751
19463D1152j3361p216K6239L7359P812l866J6393j5173l7652p298l0516j6486
19451b613o406l697Q907j2874m726K5392J8808K580K2441K4725R305r320L3659
19438A06181J7208j3550k8598k8082k3854j2045O894l347j0265R851L3382M0162
19426I3937k9996l2225j2226J0025p650k5371n113j8703k1477J8645J8345L2217
19414B0408k542l0939L4318J3620j5212K4426M1663j281r069j9606J0296k3491
19402D2591j4831k248n27L5517K4736K5788L5090L0289k1305m0730j180l679J2795
19389A22306J0171j4926p39k9769L3223J2973O872R411O395k0512j9352K1981
$$ y = [36967, 61742, 47155, 40799, 51052, 28585, 15507, 12543, -2494, 20289, 61605, 48903, 41152, 27791, 20575, 46814, 84173, 91985, 88119, 104512, 89339, 51687, 44389, 13873, -2613, -9019, -12716, -3809, -16683, -21409, 3983, 22791, 25371, 47812, 72537, 81842, 72522, 106181, 123389, 109839, 81241, 53159, 29305, 17260, 24154, 20807, 10542, 20393, 53775, 93937, 63941, 31716, 19490, 29515, 21865, -3506, -8619, -27322, -48799, -30154, -11809, 20408, 17866, -13073, 21245, 34865, 19653, 44079, 85742, 84461, 75392, 55786, 66082, 42591, 27760, 25512, 24985, 60502, 85238, 111026, 146116, 176405, 155100, 114370, 113190, 109511, 122306, 132477, 117551, 116812, 87043, 120266, 133239, 140111, 149522, 155917, 135405, 116053, 138034]
19377A38034N484j511l061j0720m2332l3638j5524N243j1369K6564L9221J3937
19365A10328K7407J5212K367r28j2302m3593k9845j2114j645J5763J8909L2674
19353A22233K4166l4262k1142L6554p873L329J9323M5778J6197M1414L0175k0332
19341B55560N722p198k6485k234l1422m2438J3809K1755R191J489N238m0133l8646
19328A24208l5802K7127M9788K9089R879p937O805k1757k2610N140k8389k1274
19316A14267r058J1927P420L766j0426j626n456J0125J323L803L3380J3135j032
19303A71548k0799J5372O437q566J2881J1221j0720L7597J3639j6074J1256M58
19291B24250k8263J0016K7476m09J320p350k2732l7734l0247j3843Q179k495O838
$$ y = [138034, 143518, 142007, 138946, 128226, 85894, 52256, 36732, 41975, 30606, 57170, 96391, 110328, 137735, 152947, 155314, 154386, 142084, 98491, 68646, 56532, 54887, 70650, 89559, 122233, 146399, 112137, 90995, 127549, 119676, 123005, 142328, 188106, 204303, 245717, 275892, 255560, 261282, 254084, 227599, 225365, 193943, 151505, 165314, 187069, 196260, 197749, 202987, 162854, 124208, 88406, 115533, 165321, 194410, 204289, 196352, 203157, 181400, 158790, 163930, 135541, 114267, 105209, 117136, 124556, 128322, 117896, 116270, 110814, 120939, 122262, 126065, 159445, 172580, 171548, 150749, 166121, 172558, 163992, 176873, 188094, 177374, 214971, 228610, 212536, 223792, 224250, 195987, 206003, 233479, 233070, 234390, 227040, 204308, 166574, 136327, 122484, 130663, 128168, 135006]
19278A35006k2885K8155J9483K4889P79L29j1766k8979j189N875P10n08J0057
19265A59956J626o178p601k771j4922o501j2183K2705j452J7182K8249j2599j8442
19252A47069M724K654J5391K5739J2205k9133l3828O871Q972J7042P567l2214
19240A53059k1556n006J803J5431P595L321M2194R056K670o972q15K9095M1157
19227B71032K3101l0905l1978R592J2776k499m616j9578k4541j729N2200P5051
19215C27906O836j3799o708m3889q910K1290J7645J9646j4847n2466j8574L2719
19203B66849l170J6579K300R581R989J1969j247O872j3297p556K238j9784k6436
19190B54887o303M2887J5489J9738N5899L2770j5289k9088j3752o375K6959J4593
$$ y = [135006, 112121, 140276, 159759, 184648, 185427, 185756, 173990, 145011, 143822, 149697, 150407, 149899, 159956, 161582, 155404, 147803, 145032, 130110, 123609, 111426, 134131, 132679, 149861, 178110, 165511, 147069, 151793, 154447, 169838, 195577, 207782, 178649, 144821, 151692, 160664, 177706, 185273, 153059, 131503, 126497, 128300, 143731, 151326, 154647, 196841, 205897, 208567, 201595, 200780, 229875, 271032, 294133, 263228, 231250, 240842, 253618, 251119, 246503, 226925, 202384, 200655, 252855, 327906, 334742, 320943, 314235, 270346, 261436, 282726, 300371, 320017, 305170, 252704, 234130, 266849, 263679, 280258, 282558, 292139, 302128, 314097, 312850, 319722, 306425, 298869, 301107, 281323, 254887, 248584, 291471, 306960, 326698, 382597, 415367, 400078, 370990, 357238, 350863, 377822, 392415]
19178C92415L2745Q590j384o073J9372N6523r93K4490K8565K7671K803l138J5552
19165E97138K9216K9645J3954j441j6329Q232L273K4697K6481j5215k5772n262
19153F68617N8729N4499L2382N9291L5163j7614J7851N5354K5510J6772M5251
19142A051805N2102M3419O6585J02617O9933J28253J12082J34656Q8871P7500
19132A927823R4624Q9864J44462J99339K87282M11359M38361M45085L94281L07314
19122D739794K39381J18178Q4968J07534J34981J41366K04305K40042L12224M31957
19112F754730N37243N91523P08422R04527J227932J712155K257909K836062L154288
19103B0684791K918366K104300J341664R00067J361819L028545N882190J0091812
$$ y = [392415, 425160, 433750, 432366, 426293, 445665, 502188, 501195, 525685, 554250, 581921, 584724, 581586, 597138, 626354, 655999, 669953, 668512, 652183, 660415, 663688, 688385, 714866, 699651, 673879, 668617, 727346, 781845, 814227, 873518, 908681, 891067, 908918, 964272, 989782, 1006554, 1051805, 1103907, 1147326, 1213911, 1316528, 1386461, 1514714, 1626796, 1761452, 1850323, 1927823, 2022447, 2112311, 2256773, 2456112, 2743394, 3154753, 3593114, 4038199, 4432480, 4739794, 4979175, 5097353, 5182321, 5289855, 5424836, 5566202, 5770507, 6010549, 6322773, 6754730, 7291973, 7883496, 8591918, 9496445, 10724377, 12436532, 14694441, 17530503, 20684791, 23603157, 25707457, 27049121, 27949188, 29311007, 32339552, 38221742, 48313554]
19095D8313554J5198732J9383649K0667026J7002247R448030Q21514o893387j1955894
19087A11985471j4438876j4791082j3312088r944380n717467j792588O23991P06954
19079E3319935j173966l783465n940261o730965o072059m720224l282769k262768
19071A9353458j551470j081355p83389n97976m57231l55818l21856l14966k63142
19062A3626255j29987J23920M17562Q44616J394073K138643L161259M528549O174403
19053C2279293P494312P726375O208624L244691K00709j647885j105270J997729
19045E6398578O957701J2510876J7362207K0365848K0604482J7777276J1051140
19038A63028108L88935j1382016k1056894k6030307k4811535j9613622j3153046
$$ y = [48313554, 63512286, 82895935, 103562961, 120565208, 130013238, 130834752, 123941365, 111985471, 97546595, 82755513, 69443425, 59499045, 53781578, 51988990, 52612981, 53319935, 52145969, 48362504, 42422243, 35691278, 29619219, 24898995, 21616226, 19353458, 17801988, 16720633, 15937244, 15339268, 14882037, 14526219, 14204363, 13889397, 13626255, 13496268, 13620188, 14037750, 14882366, 16276439, 18415082, 21576341, 26104890, 32279293, 39773605, 47499980, 53708604, 56953295, 57154004, 55506119, 54400849, 56398578, 63356279, 75867155, 93229362, 113595210, 134199692, 151976968, 163028108, 163417043, 152035027, 130978133, 104947826, 80136291, 60522669, 47369623]
19031D7369623p481560l648965j634360j298461k134473l279935m143061m188721
19023A9560087l648670k892711k129109j556586j119996q33629o44976m48914
19015F285496l45952k81282l12153l94685m18623m54272m22561l67151l10628
19006B978189k15428k15012j87157j47773j31817j19217q7861j18566j07886q2638
18996A564834q6264o4998r7152p0151l3195l7459m2210n8005n5029k6922j8087
18985I75362m3497m3972l3235k7005m7905j8113Q799N0l5803k2304o619k8781
18973F76977l7675j5837k6000l3340O087R635l3563k5618k932p211j5818j3391
18961D81314k5971N838j9994j9947j4665J3849L053J5437L2290M0159j5783l7200
$$ y = [47369623, 39888063, 36239098, 34604738, 33306277, 31171804, 27891869, 23748808, 19560087, 15911417, 13018706, 10889597, 9333011, 8213015, 7379386, 6734410, 6285496, 5939544, 5658262, 5346109, 4951424, 4532801, 4078529, 3655968, 3288817, 2978189, 2762761, 2547749, 2360592, 2212819, 2081002, 1961785, 1873924, 1755358, 1647472, 1564834, 1478570, 1413572, 1316420, 1246269, 1213074, 1175615, 1133405, 1075400, 1020371, 993449, 975362, 931865, 887893, 854658, 827653, 779748, 761635, 770434, 770484, 734681, 712377, 705758, 676977, 639302, 623465, 597465, 564125, 570212, 579847, 546284, 520666, 517734, 510523, 494705, 481314, 455343, 461181, 441187, 421240, 406575, 420424, 423477, 438914, 471204, 511363, 495580, 458380]
18949D58380j0817k24R999p061l9422m9808j082L0561k1876L016N387k4611j5661
18936C36781N190m828l5489P122l00l566l7409k8631J7208J4455O46j8067J3315
18923B66427Q925j5504J129n075l0072l0635j3450Q327K2941l502k2035n873K4224
18910B05827K2407K375N873K7794J4876N775j4705m854M2961J3390k7099J9371
18898C13991M472q111M866p042j2214k9122k1193r230J4168K2466O708q674k1954
18885B49131j794Q079k4083l0450j487Q442O384o705J488l085L940N257j7341
18872A97776q127n240J8937K9101K0167N852k4675k3388J0420R692o796j1788
18860B11931N13L4754K5221J0871j3732n588k693j6964K6698j6194L626l3277
$$ y = [458380, 447563, 447339, 457338, 450277, 410855, 361047, 359965, 390526, 368650, 371666, 377053, 352442, 336781, 341971, 337143, 301654, 308776, 308476, 304910, 267501, 238870, 256078, 270533, 271179, 253112, 266427, 275352, 259848, 260977, 255902, 225830, 195195, 181745, 190072, 213013, 209511, 187476, 181603, 205827, 228234, 230609, 236482, 264276, 279152, 284927, 270222, 265368, 308329, 321719, 294620, 313991, 318463, 310352, 315218, 308176, 295962, 266840, 245647, 236417, 250585, 273051, 279759, 271085, 249131, 247337, 255416, 231333, 200883, 199396, 207838, 214222, 207517, 209005, 205920, 209860, 215117, 197776, 189649, 184409, 203346, 232447, 252614, 258466, 233791, 210403, 220823, 230515, 223719, 211931, 212444, 247198, 272419, 283290, 269558, 263970, 261277, 244313, 271011, 254817, 258443, 225166]
18848B25166k9069p061L54Q4j6939L5568k7272k0409J7821J7487j112K4531r306
18835B09843l6856j1966k943L320j0106n162R956K2852K2893j912j674k0389k847
18822A75009L186p566n65K3401M2549K0267j8470k0549J1703K262l1618m496o373
18809A88740k5405O220L0802N456o259J1039O177J9004K586k0394j398l283j4070
18796A99215j9743J4571P853j0813j4664j0014l1386K5991n398k5571r550K3169
18784A43660N7851N467o963N611L8710K450m836l8215k7017P284L0345J8959J6599
18771B49905K9802K0320N9767Q5475O1266j193l8482p5709p7869n1184m4514k4038
18759A93546k5999J0913j4858j5076j1540K0986Q696l567K7752L23k3375Q984
$$ y = [225166, 196097, 189036, 189390, 189474, 172535, 208103, 180831, 160422, 178243, 195730, 194618, 219149, 209843, 172987, 161021, 158078, 161398, 151292, 146130, 156086, 178938, 201831, 199919, 198245, 177856, 175009, 178195, 170629, 170064, 193465, 236014, 256281, 237811, 217262, 228965, 231227, 199609, 195113, 188740, 163335, 169555, 200357, 205813, 199554, 210593, 216770, 235774, 238360, 217966, 216568, 213285, 199215, 179472, 194043, 201896, 191083, 176419, 166405, 135019, 161010, 155612, 130041, 120491, 143660, 201511, 206978, 200015, 205626, 244336, 246786, 241950, 203735, 176718, 184002, 214347, 233306, 249905, 279707, 300027, 359794, 445269, 506535, 505342, 466860, 391151, 313282, 262098, 217584, 193546, 167547, 178460, 163602, 148526, 136986, 157972, 166668, 163101, 190853, 191176, 167801, 176785]
18747A76785K4165J8468j0799N716m051K6344l645k020j6097k7607J759K0745
18735B09763L1884K6633j3138J0098J6376K4531N0256P025L0409J9503k1014l5568
18723C56758j0174J6765l100r648l3378j8507m924j568J7143L9097K5639l966
18711C70137n588O614K1049j09j3485k6816l225N437k7115m021K3463K5497K2003
18698C93841m047j2587J0887J9938K8540M3133n587L103m515J4361J7807m2020
18686D62854j23M9589L8260j6222l0313J8077J0663J9527M0872M6622J2076K677
18674F54559l919N714N1514J4061j3645N141K6148J9294P00K8030M9202J9081
18662H55880l49K4325M7439K5413K0053M1403K8892J254M3714N8729M8076O8531
$$ y = [176785, 200950, 219418, 208619, 214335, 210284, 236628, 232983, 230963, 214866, 187259, 189018, 209763, 241647, 268280, 255142, 265240, 281616, 306147, 356403, 363428, 393837, 413340, 392326, 356758, 346584, 363349, 360249, 350601, 317223, 298716, 293792, 292224, 309367, 348464, 374103, 370137, 364549, 371163, 392212, 392103, 378618, 351802, 348577, 354014, 326899, 322878, 346341, 371838, 393841, 389794, 377207, 388094, 408032, 436572, 479705, 474118, 477221, 472706, 487067, 504874, 462854, 462731, 512320, 550580, 534358, 504045, 522122, 532785, 552312, 593184, 639806, 651882, 654559, 650640, 656354, 707868, 721929, 708284, 713425, 739573, 758867, 759567, 787597, 836799, 855880, 855531, 879856, 927295, 952708, 972761, 1014164, 1043056, 1044310, 1088024, 1146753, 1194829, 1263360]
18650A263360L2677K8724Q9788P2646P7588Q8131P3796R1525P8223J08361J08229
18639B113048J14025J39064J78223K01186K44212K70127K55674L02893L73574
18630D192026M01231M81663M92243N52584N94091O62739O91726Q17101J002555
18621I887959J234578J599190K080668K576077L079108L547366L621972L461936
18613C1088854L357249L049963L339908M687355P132920J0414366J3780488J7308640
18605I4159743J8296029J5964772J3113772O426227j820387p302343j2859805
18598A25978008j6261678j5637297j3942376j1194513p398139m264322k555472
18591E4724211j931765k202695l624425m737159n411923n752677n170781m227530
$$ y = [1263360, 1296037, 1324761, 1414549, 1487195, 1564783, 1652914, 1726710, 1818235, 1896458, 2004819, 2113048, 2227073, 2366137, 2544360, 2745546, 2989758, 3259885, 3515559, 3818452, 4192026, 4593257, 5074920, 5567163, 6119747, 6713838, 7376577, 8068303, 8885404, 9887959, 11122537, 12721727, 14802395, 17378472, 20457580, 24004946, 27626918, 31088854, 34446103, 37496066, 40835974, 45523329, 52656249, 63070615, 76851103, 94159743, 112455772, 128420544, 141534316, 147960543, 146140156, 138837813, 125978008, 109716330, 94079033, 80136657, 68942144, 61544005, 57279683, 54724211, 52792446, 50589751, 46965326, 42228167, 36816244, 31063567, 25892786, 21665256]
18583B1665256l280659k337391j560895j043971o22576l28924r5987Q2400J91349
18574A2668602L32590M64845O87074R36242J210839J606557K284988L221847M139912
18565B7553496N002445N559439N188788M539143L628223K421029K210497K817609
18557E8920669M152362O817832R174970J0328849J1063269J0040781O291023J734263
18549A18524018k863098q847178j2735751j4243450j5012161j3072966j0080649
18542D1668765p307742m723555l050382k165665j884834k125560k270113k380446
18534A5760468k367574k026058j648759j327664j021960p96575o20382m96292
18526E455204m70218m09490l60853l49095l33251k72570k62694k07219k05955
$$ y = [21665256, 18384597, 16047206, 14486311, 13442340, 12819764, 12490840, 12394853, 12477253, 12668602, 13001192, 13466037, 14153111, 15089353, 16300192, 17906749, 20191737, 23413584, 27553496, 32555941, 38115380, 43304168, 47843311, 51471534, 53892563, 56103060, 58920669, 63073031, 69890863, 79065833, 89394682, 100457951, 110498732, 116789755, 118524018, 115660920, 106813742, 94077991, 79834541, 64822380, 51749414, 41668765, 34361023, 29637468, 26587086, 24421421, 22536587, 20411027, 18140914, 15760468, 13392894, 11366836, 9718077, 8390413, 7368453, 6571878, 5951496, 5455204, 4984986, 4575496, 4214643, 3865548, 3532297, 3259727, 2997033, 2789814, 2583859]
18517B583859j84766j34802j56326j11915j05703r5412o2213q8723r3336q6601
18507A464062j04943o2785m9285p5689n6213l5002m0159k4483M712n7995r4565
18496H67655k0291r187k1885l9311m4225k9268j9493j1723L65P314m643j9139
18484F56169k6456l0534j8722j3221l4735m0227l4313L1728O000k7817k8397k8592
18472D10883n09M3583K1426o321j8975l1083m1369j151J5971L4991J0615m1904
18460C96157l294L3062j0202m2966N489l500j855p29k0503k3550J2794l749j5984
18447C21170j9702J3306k0573l8887M3011J8034o536k7196l2608L375K2775J0914
18435B87083j0379k6351j4573j8928k463L041j4636J4244o086j001p05j4802l2772
$$ y = [2583859, 2399093, 2264291, 2107965, 1996050, 1890347, 1794935, 1732722, 1643999, 1550663, 1464062, 1359119, 1296334, 1247049, 1171360, 1115147, 1080145, 1039986, 1015503, 1020215, 962220, 867655, 847364, 838177, 816292, 776981, 732756, 703488, 683995, 672272, 672637, 679951, 675308, 656169, 629713, 599179, 580457, 567236, 532501, 492274, 457961, 489689, 495689, 467872, 439475, 410883, 410374, 453957, 475383, 469062, 450087, 419004, 377635, 376484, 392455, 427446, 438061, 396157, 392863, 425925, 415723, 372757, 378246, 374746, 372891, 372162, 351659, 328109, 340903, 337154, 321170, 301468, 314774, 294201, 255314, 298325, 316359, 309823, 282627, 250019, 253394, 276169, 287083, 276704, 250353, 235780, 216852, 214389, 217430, 202794, 217038, 210952, 209951, 209246, 194444, 161672]
18422A61672J1179J7572O371o008l667J2469K443L1516J1536m53k55N755j1195
18409B38935j0045k4611K0945M5063J049n2742J8348M2835j4925j2659K9163j837
18397B79519m9046j5174M4022l113l8750l3502k4701L4472L4666p488J533m766
18385B17672k3217n065o801q075J3283m562J3750R878j0992O460J1690j7682r238
18372A87101J1821K2628j857p126K2062K2742j673j8337J0445K1847j233p431
18360B60989M592K9847k214K726N6663L140R488k4861j3538l9015l771M373l8882
18347B49537j2450J286k3797j1623J6605k6234j7644J6954j3085m1435Q402m459
18335A42057j3332O611R55n013J4315k5422j3984L879N7155J4802j1835L120m223
$$ y = [161672, 172851, 190423, 196794, 190786, 187119, 199588, 202031, 233547, 245083, 244630, 244375, 250130, 238935, 228890, 204279, 225224, 270287, 271336, 218594, 236942, 279777, 264852, 252193, 281356, 279519, 230473, 215299, 259321, 256208, 217458, 183956, 159255, 193727, 228393, 220905, 222438, 217672, 194455, 189390, 182589, 174514, 187797, 183235, 196985, 206863, 195871, 202331, 214021, 196339, 187101, 198922, 221550, 219693, 212567, 234629, 257371, 255698, 237361, 247806, 269653, 268420, 260989, 265581, 295428, 293214, 295940, 352603, 355743, 365231, 340370, 326832, 287817, 284046, 288419, 249537, 237087, 238373, 214576, 202953, 219558, 193324, 175680, 192634, 179549, 138114, 146516, 142057, 128725, 135336, 136291, 131278, 145593, 120171, 106187, 110066, 167221, 182023, 170188, 173308, 169085]
18322A69085O591J1351m1106k3170J9743Q529n454j1345l8655J5266J4661J6631
18310A42127J5448R65r130j9910R3K5289K6457P20l168j2756l0315k1522O516
18297A20814J8373L8626M1522j0507k1648j292l6234k371O700J0110p733m132
18285A52228j7355j2338m1951m88K5147J3234J8515l275k7330r594l839j1949
18273H1005k5007k029K2643k112k5324k968j2433K1478Q491L1378O499k0717k4980
18260E5924J6179K2478l090j0669j756K675o165n752J1420q337j0451J6833J4319
18247I3608R348M1218K3883p753K4K5517J2467L598K501r690L7402j4931k9860
18234A87332k2596k8710J931j4097N2613L572j3835m7026R748k638l1405k9229
$$ y = [169085, 175676, 187027, 145921, 122751, 142494, 151023, 145569, 134224, 95569, 110835, 125496, 142127, 157575, 158540, 149410, 129500, 129593, 154882, 181339, 182059, 178891, 166135, 135820, 114298, 120814, 139187, 177813, 219335, 208828, 187180, 185888, 149654, 147283, 153983, 164093, 156360, 152228, 134873, 122535, 80584, 80096, 105243, 118477, 136992, 133717, 106387, 96793, 92954, 81005, 55998, 53969, 76612, 74500, 49176, 46208, 33775, 55253, 63744, 95122, 101621, 80904, 55924, 72103, 94581, 91491, 80822, 79066, 81741, 75576, 69824, 81244, 72907, 62456, 79289, 93608, 102956, 144174, 168057, 160304, 160328, 185845, 198312, 201910, 204411, 194721, 232123, 217192, 187332, 164736, 136026, 137957, 123860, 176473, 180045, 166210, 119184, 128932, 126294, 94889, 65660]
18222F5660j1210o345J3303J5975o909R231K4331k2292k052m235k5456K4461J317
18209G5779j6258k3321O594Q282M9175M3243P051l1234N513j6530K0374M81J4130
18196A43279J1927n360l27k5323k6101j0827j4074J5848L7508Q406k5973l6721
18184G2262L0457J6510j311K460J1057j1282K1414j4879J3864J3371l174j7886
18172A32863k1190k0532J3163O45J5957J8835j4352m944K8430L9778M0223L0892
18160B59768k2612j3768k9200M761K7239l307l549L7227K6181J2350J1063R735
18148C15888R159K5849Q799Q134j5881K3807M5409n655R024K0886M3127N2718
18136E41264L695J5800L0930O3628O6903P1122N1908O1930P8590Q5272J04411
$$ y = [65660, 54450, 48105, 61408, 77383, 70474, 79705, 104036, 81744, 79692, 75457, 50001, 74462, 75779, 59521, 36200, 42794, 51076, 100251, 143494, 150545, 119311, 124824, 108294, 128668, 129149, 143279, 155206, 149846, 149519, 124196, 98095, 87268, 73194, 89042, 126550, 134956, 108983, 72262, 102719, 119229, 117918, 120378, 131435, 120153, 141567, 126688, 140552, 153923, 150749, 132863, 111673, 91141, 104304, 104949, 120906, 139741, 125389, 120445, 148875, 188653, 228876, 259768, 237156, 223388, 194188, 198949, 226188, 222881, 219332, 256559, 282740, 295090, 306153, 315888, 325047, 350896, 359695, 367829, 351948, 375755, 421164, 415509, 424533, 445419, 488546, 541264, 544959, 560759, 591689, 655317, 722220, 793342, 845250, 907180, 985770, 1071042, 1175453]
18125A175453R8952J46973J77902K25875K41026L04659L92689M83496O21678Q26677
18115D695380J179216J726711K607921M226353P274854J1525179J1142701L066363
18107D7444678m098352j0518675j1115085p381149m319570k627651j661641j113370
18099D609185p63478n70040l81451l19111k78227j90754j41080j42987j25272
18090A696785j04712n6919l7564n8451q1506p1184j07260j46208j22707o7707
18080H42567p1180r1875p5932o7307o2632j6981J8219J9235k3688j6826j7013
18069D36587l1043p370L1398j73m3281l6300r781J623M0636J5503L6713M1503
18057D76015M550K2646J5696J9433K0020K4183K9388L3774M1065M4249J2659J1241
$$ y = [1175453, 1274405, 1421378, 1599280, 1825155, 2066181, 2370840, 2763529, 3247025, 3868703, 4695380, 5874596, 7601307, 10209228, 14435581, 21710435, 33235614, 44378315, 47444678, 43346326, 32827651, 21712566, 14331417, 10011847, 7384196, 5722555, 4609185, 3845707, 3275667, 2894216, 2575105, 2296878, 2106124, 1965044, 1822057, 1696785, 1592073, 1535154, 1497590, 1439139, 1357633, 1286449, 1179189, 1032981, 910274, 842567, 771387, 679512, 603580, 536273, 473641, 456660, 474879, 494114, 470426, 453600, 436587, 405544, 398174, 429572, 429399, 386118, 349818, 340037, 341660, 382296, 397799, 434512, 476015, 480565, 503211, 518907, 538340, 558360, 582543, 611931, 645705, 686770, 731019, 743678, 754919]
18045G54919r569j4192k2317m2681n4827m9129n2332n7550l0080j7796L1686M8066
18033D84198K0001j6932J8681K2551l1264k6098n1077n6819n5474m6467m7269
18022B14031j9365m3634j0025k8340l604J5245K1699k3693M842k0915k836p960
18010I5445L5678K7433j8769m0489q368P358J0118K5223J9276M358J9248K4260
17998B00771Q539K8782K9774J0317K9151j758Q230L4206P1935L7524J0315j6411
17986D51375k455M255j4400m619J0806p593m7577m3138l5249l2984k3037m5292
17974B10092k7648p716n4239J2534K0063j8746j2144j8958J2857m353J2967J3788
17962A38497K544L86j5006O036L707j1340J4892j8796J3152K8296J6880k1933
$$ y = [754919, 745350, 731158, 708841, 666160, 611333, 562204, 509872, 452322, 422242, 404446, 436132, 484198, 504199, 487267, 505948, 528499, 497235, 471137, 420060, 363241, 307767, 261300, 214031, 194666, 151032, 141007, 112667, 109063, 124308, 146007, 122314, 127156, 106241, 103405, 95445, 131123, 158556, 139787, 99298, 90930, 98288, 108406, 133629, 152905, 157263, 176511, 200771, 209310, 238092, 267866, 278183, 307334, 305576, 313806, 348012, 419947, 457471, 467786, 451375, 448920, 453175, 438775, 434156, 444962, 437369, 389792, 346654, 311405, 278421, 255384, 210092, 182444, 174728, 120489, 133023, 153086, 134340, 122196, 103238, 116095, 111742, 124709, 138497, 141041, 141427, 126421, 132457, 136164, 124824, 139716, 120920, 134072, 162368, 179248, 157315]
17950A57315J9923J3500J5824k669q32o088r1K7855J0129r282O270K141M1405
17937B75400J2431r446j4271M811O952l7771l9576l478l0555m2575j150J2135
17925A32907N929m4277q853l396l4247k0282Q474q588r916K8312J4585N741J3922
17912H0311L335o288r943M179k372k8347m204K1908L8090K4327K2904k4754n1209
17899F7937l941n475J9152k905J2176L950L799k5317P972M0532N4479K968o6676
17886A08651o255m553n0416l7393k7087K3621J8931l9086r877K0465O871J4652
17874A8524j0858k6268L6926J1831N67k2920k0025m815m9660L904R533J9309K4330
17861i622J4235K5267K8348K0484K4198K774k5302l7046j0978k3043k5672N869
$$ y = [157315, 177238, 190738, 206562, 203893, 203061, 196973, 196882, 224737, 234866, 225584, 231854, 233995, 275400, 287831, 278385, 264114, 268925, 275877, 238106, 198530, 195052, 164497, 121922, 120772, 132907, 138836, 94559, 85706, 82310, 48063, 27781, 36255, 27667, 17751, 46063, 60648, 66389, 80311, 83646, 77358, 67415, 71594, 69222, 40875, 36671, 58579, 96669, 120996, 143900, 119146, 67937, 63996, 58521, 77673, 74768, 86944, 90894, 94693, 69376, 77348, 117880, 172359, 175327, 108651, 102396, 97843, 47427, 10034, -17053, 6568, 25499, -13587, -23464, -2999, 3872, 18524, 7666, -18602, 18324, 30155, 30722, 7802, -12223, -17038, -66698, -62794, -53261, -33952, -9622, 4613, 29880, 58228, 78712, 102910, 105684, 80382, 43336, 32358, 9315, -16357, -10488]
17849a0488J0119J5904L4451O265k0697q643m4431p726M0346J5091j0759q656
17837A0776j3638Q140J2303N369J2474J3936j1674n602k1199j8541j503j2608
17825b1767j0975K0009K4433O360K009J5254L5375m521R845J0790R55l8133l5907
17812A3727J5177K3573M3868M6633j2704J0620J8706l8672n0104k9075l0889q125
17800B735j012k2333k1328L4437N2438j8633l2833J7275K2329k984K3501K105
17788E5697k2044j3462N581n890P027L673j813j8718o47M3784J794j3147k7194
17775A4641j0529L009J5354j6200k651n450K7170L152l2008j2962K6417J9031
17763B8974K316J1324l352k7295l9932l8593L5797L8175m321J1479M035L689j8049
$$ y = [-10488, -369, 15535, 49986, 56251, 35554, 26911, -17520, -25246, 15100, 30191, 19432, 10776, -2862, 5278, 17581, 22950, 35424, 49360, 37686, 32084, 10885, -7656, -9159, -21767, -32742, -12733, 11700, 18060, 20069, 35323, 70698, 66177, 76022, 86812, 87767, 49634, 13727, 28904, 52477, 96345, 142978, 130274, 140894, 159600, 120928, 70824, 41749, 10860, 2735, 1723, -20610, -41938, -7501, 44937, 26304, -6529, 10746, 33075, 30091, 53592, 55697, 33653, 20191, 25772, 19882, 26909, 30582, 28769, 10051, 9404, 53188, 54982, 41835, 14641, 4112, 7121, 22475, 6275, 3624, -1826, 25344, 28496, -3512, -16474, 9943, 28974, 31290, 42614, 39262, 11967, -27965, -66558, -30761, 7414, 3093, 14572, 18607, 22296, 4247]
17750D247l6472J4097J0225j1824P010j3102j9185k1605J3531M9994P995j392
17738C519P555K088j3247l1071r395O239P901P268J7686P201j2967k3473k42Q042
17724b2896K3038N438K15m7j1335J638L1286R767j6247o922n669m9251j0077L5760
17710a5302k33o107J0625Q326J8508j266j3191p906j3849Q328m98M491m2033m610
17696e4717J1800K2735j847k5342L5743R489J4831Q772J1872P133K3702K895m1847
17683B5219l2629K755J2421k0235l3864r224J1770J8570J7915J5756j985k5870
17671a9401q611p385K2733k7520l850J1862J2624O454k2559j4535p472Q333N002
17658d4325J2848l5948l5369J8114K0718K8499K4206K5140J2497O093O589k9059
$$ y = [4247, -32225, -18128, -7903, -19727, -12717, -25819, -45004, -66609, -53078, -3084, 4911, 3519, 11074, 13162, -85, -31156, -40551, -34312, -26411, -19143, -1457, 5744, -7223, -30696, -30938, -22896, 142, 5580, 5795, 5748, -5587, -3949, 27337, 37104, 20857, 13935, 8266, -40985, -51062, -15302, -15535, -21642, -11017, -2691, 15817, 14551, 1360, -6546, -20395, -12067, -12565, -8074, -50107, -54717, -42917, -20182, -22029, -47371, -11628, -2139, 12692, 21464, 33336, 40469, 64171, 67066, 25219, -7410, -4655, 7766, -12469, -46333, -55557, -43787, -25217, -7302, 8454, 6469, -19401, -28012, -35397, -12664, -40184, -44034, -32172, -19548, -13094, -35653, -50188, -57660, -49327, -44325, -31477, -67425, -102794, -84680, -63962, -35463, -11257, 13883, 26380, 32473, 39062, 10003]
17646A0003n5995j6239J1509J3090n297K6896L9728j8151l3316J4404J7432p254
17634c190l865j5223J20J9563J6269l0954n7788k627K9314K3624N63q641J5879
17621a6956K6866J2016J7378J1906j4506n0765l0232M599K1287J3527o738q89
17609a2507L9326j8528J0914M5988K4884m6226l2145n46o219p037R219k1342K8739
17596A4520j1939n4567k3822L0161L2690K9799k164k599M845q443m790K2024k1159
17583D556k131J9504Q349j9692o781m0269J6507M5923J233m3458n69K5777J3375
17570B2324o430m7837l059K3640L0866k2745j1485N921P607j4202J3641J3736
17558A1977o352M190J1618J5269K7348j3392q669j7403j828j9414j0531N535J8362
$$ y = [10003, -45992, -62231, -50722, -37632, -42929, -16033, 23695, 5544, -27772, -13368, 4064, -3190, -7055, -22278, -22158, -2595, 13674, -17280, -75068, -77695, -48381, -24757, -24194, -32835, -16956, 9910, 21926, 39304, 51210, 36704, -14061, -44293, -39694, -18407, -4880, -11618, -12507, 26819, 8291, 19205, 65193, 90077, 43851, 11706, 11160, 4941, -2096, 7123, -14219, 14520, 2581, -51986, -75808, -45647, -12957, 16842, 14678, 12079, 16924, 8481, 3691, 25715, 4556, 2425, 21929, 30278, 10586, 3805, -36464, -19957, 25966, 27199, -16259, -16828, 8949, 22324, 15894, -31943, -35002, -11362, 19504, -3241, -14726, -8805, -1198, -15400, -1759, 11977, 5625, 9815, 21433, 36702, 64050, 50658, 41989, 24586, 22758, 3344, -7187, -1652, 16710]
17545A6710p593r930Q895l558k6638M001J8067p323K7938j4174O54J6020J3916
17532C6985j2337L100J0042J398o113k813r740m2839k3553J1636K4181l8335k5043
17519g3431L2276L7931j0583o337j6151l6542J8982M9258Q408k7527k8145N1432
17507d29J0684j5038k0059q498K387R553K788J7728O129j7540j8611J0051J6319
17494d536N435j6741K5999L1727J6198m0696l3921L574K9777O632n611k447q672
17481F718l3703n696M0820L066p778Q652J7443m5021j8806j5219m426J2008L1774
17468a0168J3952J7441M547j61m81j50k297j143j0037k3575o742J0501K5414J9184
17454C6285j0443p051K6057P148j7013P131Q695J3855M34K4441O3871N1701o164
$$ y = [16710, 9117, -813, 8082, 4524, -22114, -18113, -46, -7369, 20569, 6395, 7049, 23069, 36985, 24648, 27748, 37790, 39188, 33075, 30262, 20522, -22317, -45870, -34234, -10053, -48388, -73431, -41155, -3224, -13807, -20144, -36295, -72837, -53855, -4597, 3811, -23716, -51861, -429, 10255, -4783, -24842, -33340, -30953, -21400, -18612, -884, 5245, -12295, -30906, -20855, -4536, 899, -15842, 10157, 41884, 58082, 17386, -16535, -12961, 16816, 23448, 17837, 15390, 6718, -26985, -32681, 8139, 11205, 3427, 12079, 29522, -15499, -34305, -49524, -53950, -41942, -10168, 3784, 21225, 25772, 25611, 25130, 24980, 22683, 21540, 11503, -12072, -18814, -8313, 17101, 36285, 25842, 18791, 44848, 51996, 34983, 42114, 50809, 64664, 65098, 89539, 153410, 205111, 198947]
17441A98947k5102l1332l5149j2420l2463k6413k384k0933r246K38K6422L835
17429C4000l4102j9627K9734J6371j9462p541k1308Q833J7302j6041j0718K2464
17417i5k947K2991K4703j5122n3349m5647J7120L2379J5914J7425J6633J5760
17405D5765N50m0703L312M2668q843k9940l9240k8237J4154K6275K3717k3639
17393a4161j4498L0986j962J703J6351k163q375l37j7325k974L275p371L09L0422
17379A3880N4266k909n2520o760K0344k7819q598J253K1745J0155P768n071q567
17366A7167m655l9711J5595r551J6922l933q190J0542L701o638j2329J1890J6828
17353G638j0834j1605L4781K9526j2125j2928r147n361m4744k2799N485P483j4989
$$ y = [198947, 173845, 142513, 107364, 94944, 62481, 36068, 33684, 12751, 3505, 3743, 30165, 34000, -102, -19729, 10005, 26376, 6914, -627, -21935, -13102, 4200, -11841, -22559, -95, -3042, 19949, 44652, 29530, -23819, -69466, -52346, -19967, -4053, 13372, 30005, 45765, 46315, 5612, 8924, 51592, 42749, 12809, -26431, -54668, -40514, -14239, 9478, -14161, -28659, 2327, 365, 2068, 18419, 16256, 7881, 7544, -9781, -12755, -9480, -16851, -16542, 13880, 68146, 65237, 12717, 5957, 26301, -1518, -10116, -8863, 12882, 23037, 30805, 25734, 17167, 12512, -27199, -11604, -21155, -4233, -8166, -16356, -5814, -2113, -8751, -21080, -9190, 7638, -3196, -14801, 19980, 49506, 37381, 24453, 15306, 9945, -34799, -57598, -52113, -44630, -59619]
17340e9619J7491R344P838Q361j7543N925P618p707l2042k2279R851J6276L280
17327e3206J0625j757M839K2457O529j433k1221j1997J6382J4610N651K698Q7
17314e736p560J1189J4998M327P785k6865j3511j6803m1077k3721L9898R640K241
17301d5195j2108L999J5649q73j5459j816L9258K7189j2308k7275p078M5961j0559
17288f15q964O570k1958L928J884l4224j6678J4029k7734l6721K9084L2516K4741
17275c4142j310j0393j5148R447K1471L8432Q106j6434m882J3418k317k2634O009
17262a0377J0592r764L438j3213q316K4906L774K0909j5917j8011k9978L405O209
17249c2343j1688k280o373j7576J7724K5490J2480k3669m004J6087L321N302l93
$$ y = [-59619, -42128, -32784, -24946, -16585, -34128, -28203, -20585, -28292, -60334, -82613, -72762, -56486, -53206, -42581, -44338, -39499, -17042, -10513, -11946, -33167, -45164, -28782, -14172, -8521, -5823, -5736, -13296, -2107, 12891, 17218, 25003, -1862, -15373, -32176, -73253, -96974, -57076, -47436, -45195, -57303, -53304, -37655, -38528, -53987, -55803, -16545, 10644, -1664, -28939, -36017, 9944, -615, -9579, -3009, -24967, -21039, -19155, -53379, -70057, -56028, -83762, -120483, -91399, -58883, -34142, -35452, -45845, -60993, -51546, -30075, 8357, 16463, 29, -4853, 8565, 6248, -16386, -10377, 215, -9549, -6111, -19324, -27640, -2734, 1040, 21949, 6032, -11979, -41957, -38552, -32343, -44031, -46311, -52684, -70260, -52536, -27046, -14566, -38235, -42239, -26152, -22831, -17529, -17922]
17236a7922K00j1895l569L0606R67j930N165O786Q125n873J0020k809k6159n394
17222a3682j5607k3573Q507K9645M354n263L3372Q11j2183k0087J0339Q110j1427
17209f684k9366Q362K2950K7685K5710j7343l0428k1558O093j0449J1892K7455
17197A4319J2108J164o303r344p38p952J0910J5755J513k7140j7558L560L0322
17184B0616K698J2833O501k4299j0044l0803Q1j3016J0178K4257L6563J1580N999
17171E3144K9713j7755m7704k888k9635l86q660j1466L0607J7550K2000j7082
17159A7438k1408j1696K290K0544m304m048R161L9093r451j5746m5338l2277j0320
17146f6062K9358K7498j2821l246O891L342K21p293J7072M0214J4684l6947r705
$$ y = [-17922, -17722, -29617, -33186, -2580, -1613, -3543, 1622, 8408, 16533, 10660, 20680, 17871, -8288, -13682, -29289, -52862, -44355, -14710, -10356, -15619, 17753, 18564, 6381, -13706, -3367, 4743, -6684, -36050, -27688, -4738, 22947, 48657, 31314, 886, -20672, -14579, -25028, -13136, 14319, 26427, 27591, 21288, 11944, 11206, 3254, 14164, 29919, 31432, 4292, -13266, -9706, 20616, 23314, 36147, 42648, 18349, 8305, -22498, -22417, -35433, -25255, -998, 35565, 47145, 53144, 82857, 65102, 17398, 14510, -15125, -15511, -24171, -35637, -5030, 12520, 34520, 17438, -3970, -15666, -13376, 7168, 2864, -1184, 7977, 47070, 37619, 21873, -23465, -55742, -66062, -36704, -9206, -22027, -25273, -18382, -15040, -14819, -22112, -5040, 35174, 49858, 12911, 3206]
17133C206j4261J9736j0355k0650J5396K112k572m802j8770k1372q772J8633J7531
17120b4940l507K0313k700j6633Q20K9840Q179k3028j4142J9117M3129J1594J0554
17107E8596j4182j8406k919m65k9846L200P046J3279j3649p644J7624K7433k9361
17094A0706l4689k59Q299K0974l0087k6556J9863N2221J459l6981m874J1289K683
17081e952J1926r463k1616k4169J810K4960n152k0078j0292K0979L0841L1156
17069B4950n146r560n774O165K3723j3045j0557j7600j2205J310n314l703K8444
17056A688J253k0162j5467m396J4105L237J5178j3987k5497k2259j1788k7795
17044a05890K0196J9998K2284K1827p265o070L456K6647L688k4089l244q685j6873
$$ y = [3206, -11055, 8681, -1674, -22324, -6928, -4816, -7388, -12190, -30960, -52332, -61104, -42471, -24940, -28447, -8134, -10834, -27467, -26647, 3193, 11372, -11656, -25798, -6681, 36448, 48042, 58596, 44414, 26008, 23089, 22624, -7222, -4022, 3024, 16303, 2654, -4990, 12634, 40067, 10706, -23983, -24242, -15943, 5031, -25056, -51612, -31749, 20472, 21931, -15050, -19924, -8635, -5952, 5974, -3489, -25105, -49274, -47464, -22504, -27656, -47734, -58026, -37047, -6206, 24950, 19804, 10244, 4470, 10635, 34358, 21313, 10756, -6844, -19049, -17739, -23053, -26756, 1688, 2941, -17221, -32688, -37084, -22979, -19742, -4564, -18551, -44048, -66307, -78095, -105890, -85694, -65696, -43412, -21585, -28850, -34920, -31464, -4817, -1129, -25218, -28462, -37147, -54020]
17031e4020n069K2850J279l1181O210M1301L9422M5337J0718q301m2909l1102
17019e465j0087J6888r531k2216Q826p393l4136J52J259N382R453J7029K5606
17006d233L7652J1131m014o652k6029r1M018j0695j6389J0461l2682j6791M696
16993d9618J7402L3904J2010q014k616j1354K4271K1023j3211J9490Q919r415
16981D2791j4377l7975O755N047M337k5010k2326P97J9240J1873j2232r501k5934
16968e6515J2708k237j0404J2838J1552J4622r752Q145q57K2674J9691L80n6951
16955c4106k8404l112J8534M994N826k2973L04L3695M2911L2493j1062k5707j0023
16942C370k1043K3752L6110P901l4712l3568j4605k505J5719J4739q036K3391
$$ y = [-54020, -59089, -36239, -34960, -66141, -59931, -18630, 20792, 66129, 76847, 68546, 25637, -5465, -15552, 1336, -8195, -30411, -21585, -28978, -63114, -62962, -61703, -56321, -46868, -29839, -4233, 33419, 44550, 40536, 33884, 7855, 7764, 11782, 1087, -15302, -4841, -37523, -54314, -49618, -32216, 1688, 13698, 5684, 3068, -8286, 15985, 37008, 23797, 43287, 52206, 42791, 28414, -9561, -2806, 2241, 6578, -18432, -40758, -39961, -20721, -8848, -21080, -30581, -56515, -43807, -46044, -56448, -43610, -32058, -17436, -27188, -19043, -19900, 2774, 22465, 22845, -34106, -62510, -65622, -47088, -42094, -36268, -59241, -58937, -25242, 17669, 50162, 39100, 13393, 3370, -17673, 6079, 42189, 50090, 15378, -18190, -32795, -35300, -19581, -4842, -12878, 10513]
16930A0513K9810R339l1598j9340j3741L832L0254k9173m2913L2589K6458j0423
16918d393l365r916k1529J844O829j2155m631L2501K3340L807K4561n647j6940
16905A4306k8859k7871p058L6620K4496j3665m974J6812k2989O29n443K843J4092
16892a061J4134J0498k5586k4289n929K0572Q798j3209J700J9180k4001k2839
16880d2032k2082R960J3577N828O338M2275J6020P341M051j3017k6867j7104J4289
16867a423J0466N608j7589R649J6076J0914k033k1194p760J8006J0188J4014k6346
16854A8576q876j793k0740k0717J5999o03J7907n370k6238j2498Q585k1791k00
16841e7759L1557K5200j0421K6910M1342N766j3529l0235j652l5630k1639K3223
$$ y = [10513, 40323, 49662, 18064, -1276, -15017, -11185, 19069, -10104, -53017, -20428, 6030, -4393, -7758, -17674, -39203, -37359, -30530, -42685, -47316, -14815, 8525, 12332, 36893, 31246, 14306, -14553, -42424, -49482, -12862, 11634, -2031, -7005, 9807, -13182, -12553, -17996, -15153, -1061, 13073, 23571, -2015, -26304, -32233, -11661, -2863, -16072, -14372, 4808, -19193, -42032, -64114, -54154, -40577, -34749, -28411, 13864, 29884, 37225, 41276, 28259, 1392, -15712, -1423, 9043, 14651, -2938, 6711, 22787, 33701, 31668, 10474, 2714, 20720, 30908, 44922, 18576, 9700, 7907, -12833, -33550, -17551, -18154, -247, -5617, -31855, -44353, -35768, -57559, -57759, -26202, -1002, -11423, 15487, 56829, 62595, 49066, 18831, 17179, -18451, -40090, -16867]
16829a6867O327l479K1982J5286j3666k0373j0208L1416j551L113R250k5754l8837
16816d3361k2311K5798K0836K1954K3674r550k8430q388M268M245O902K857R339
16803G833Q686j6182J501k5927q013j2322m673L4958L318n568Q787M6176M1283
16790G9857q366l4396J1838k25m5957q614J3128M517k4137m0715O018M7335K1610
16777B1893j6050r815K0455O168J3224J880l0699q0R028j8028k1809J0543j0434
16764b3724O167j4201j353J0137L1857L7320p148l4978k4360n119L225j0118J1895
16751b0400K8458M90M686l256P940K99n044J323p36m32J0652k0440k4756j0113
16737c1329M187J1745K612Q8j2529k8321L532P098L5582k210k5119k4171P93J3159
$$ y = [-16867, -10540, -14019, 7963, 23249, 9583, -10790, -20998, 10418, 8867, 11980, 21230, -4524, -43361, -65672, -39874, -19038, 2916, 26590, 17040, -11390, -19778, -15510, -11265, -4363, -1506, 7833, 16519, 337, 1838, -24089, -32102, -44424, -49097, -14139, -10821, -16389, -7602, 38574, 79857, 71491, 37095, 48933, 48708, 2751, -5863, 7265, 11782, -12355, -53070, -47052, 283, 21893, 5843, -3972, 16483, 22651, 35875, 37755, 7056, 6976, 16004, -2024, -23833, -13290, -23724, -17557, -31758, -33111, -22974, 8883, 46203, 39055, 4077, -20283, -25402, -22177, -32295, -20400, 8058, 8548, 13234, 9978, 17918, 18217, 13173, 14496, 13760, 13328, 23980, 3540, -21216, -31329, -27142, -15397, -12785, -12697, -25226, -53547, -50015, -42917, -7335, -9545, -34664, -58835, -58042, -44883]
16723d4883k379K5333J2995N282q631k6142j3545J006L6989J0253Q469K680j5196
16710g769J4163j7626j2849l107J22p141k217Q927K6009j3406j8739R65M9646
16697A6978j1427q307J7203J5247m591j1896n790J3029K636J714j4981j81R285
16684A8919m456j1386n715m279j009p286j8323J4466p855j1931L0281K3044O440
16671B0910j6464j6661r54k0240N9670L9035j7110k091k823K238l2396r883j0879
16658g648J7638J5239J5151K199k4505l0431j0257o893o580j5616R253J6196K0874
16645e380j8471M150M010j8703k1742J8489L4652J6841J5743J6j2623m856p335
16632D791J8194k1993l4827R60J2754K4489j4900l5179j2938K3466L0645k0951
$$ y = [-44883, -47262, -21929, -8934, -3652, -12283, -38425, -51970, -50964, -13975, -3722, 4747, 7427, -7769, 6394, -11232, -24081, -27188, -27066, -34207, -36424, -27497, -1488, -14894, -33633, -32668, 16978, 5551, -2756, 14447, 29694, 25103, 13207, 7417, 20446, 23082, 24796, 9815, 9634, 18919, 14463, 3077, -2638, -6917, -7926, -15212, -33535, -19069, -26924, -38855, -8574, 14470, 20910, 4446, -12215, -13169, -33409, 26261, 65296, 48186, 46095, 43272, 45510, 13114, 3231, -7648, 9990, 25229, 40380, 42579, 18074, -12357, -22614, -29507, -36087, -51703, -42450, -26254, -5380, -23851, -19701, -15691, -34394, -56136, -37647, -2995, 13846, 29589, 29605, 16982, 12126, 4791, 22985, 992, -33835, -32875, -20121, 4368, -10532, -45711, -58649, -35183, -4538, -25489]
16620b5489q744J9273j935j1711J0165N768Q631k268K891J4197Q443L552J6315
16607C9088L2804O246l8485m4357q838l959J4650J8758j358n069k1535j4461O349
16594b0167j436o069m307M35j7288J390k333K2809L358K02J3521N730q347L1552
16580A9050J6900k7407j6919J1815j4253q388l764J6541K8885p750k9261J373
16568a3178N711K3119j6469l5763M3447K5620j7957k5626j5541Q431l3627n597
16556e7430q076J5049M4630j4401l4096J6081M973o58M0937k276N543j5919p881
16543a3524J0636J2001l016r13L6075O517k7438m8854j8422k4594j5272J5734
16531g1070L6014L3714K9535M02j4994r021q213Q634j9006l3497j70J2553K5831
$$ y = [-25489, -34233, -14960, -16895, -28606, -18441, -12673, -4042, -6310, -3419, 10778, 19221, 22773, 39088, 71892, 78138, 39653, -4704, -13542, -17501, -2851, 15907, 14549, 9480, -12055, -26516, -20167, -21603, -27672, -31979, -31544, -48832, -47442, -49775, -26966, -23608, -23406, -9885, -4155, -12502, 19050, 35950, 8543, -8376, 3439, -10814, -19202, -22966, -6425, 22460, 14710, -14551, -13178, -7467, 15652, -817, -36580, 6867, 32487, 14530, -11096, -26637, -18206, -51833, -57430, -65506, -50457, -5827, -20228, -54324, -38243, -33270, -33928, 7009, 4733, 10276, -5643, -13524, -2888, 9113, 6097, 5184, 41259, 47776, 20338, -28516, -46938, -71532, -86804, -71070, -35056, -1342, 28193, 28595, 13601, 4580, -3633, 5001, -14005, -47502, -47672, -35119, -9288]
16518i288L190j7334o533J8116J77R566J0500K4120j4321l552j2968k124k260
16505b711J5968k353J3366K3813j3068k8541o579L1165K3549J2935N95Q58k4555
16492D4442j3844L884j6375j7925j1917o755L4997J3346J0066k6098k7540k0909
16480c4628K4138L847k102l396k6533Q971j8225k6051N3195J2705J5375L4550
16468D1846k0957j3435j186k4262k4939k0474l503J5539K4570J5016L2609N607
16456B6431J181K0375l8683j8584L2176k445o2555m058L6610J3099Q873R156J5985
16443C7561k3695j6756J887K7494j3625m998K216j90O143L160J6773J2637j7687
16430C0920k2912n1283j7702J2124K2194O203j3703j574K1507K5681P709j1042
$$ y = [-9288, -6098, -23432, -29965, -11849, -11672, -2106, 8394, 32514, 18193, 14641, 1673, -451, -2711, 13257, 10904, 24270, 48083, 35015, 6474, -105, 31060, 54609, 67544, 68139, 68997, 44442, 30598, 34482, 18107, 182, -11735, -18490, 16507, 29853, 39919, 13821, -13719, -34628, -10490, -6643, -8745, -12141, -38674, -29703, -47928, -73979, -20784, -8079, 7296, 41846, 20889, 7454, 6268, -17994, -42933, -63407, -66910, -51371, -26801, -11785, 20824, 26431, 27612, 47987, 9304, -9280, 22896, 20451, -42104, -46162, -9552, 3547, 12420, 21576, 37561, 13866, -2890, -1003, 26491, 12866, 7868, 10084, 9894, 16037, 19197, 35970, 48607, 30920, 8008, -43275, -60977, -48853, -26659, -20456, -34159, -35733, -14226, 11455, 19164, 8122]
16418H122j762Q070q821k0016q166J0044R3J2941j2425q77j8594J6168K1945n3099
16404d6377j6043K5496R216q119Q616M2173n083j0842O966q494k5112r507N8958
16391B1848Q936k9871j5245O147K5557K6182j2278q999j2880J6959r05P268N871
16378C8590R048O857J549k3992m4344R345j162j2849k9886k946L5486K6618J9669
16365C1983K124r432l3396j650Q414K315M956l955O904N97j340J2142q872p69
16351A0021K6372k4508j7259J2260j1441J8307o569l2738o95k508j4471K324L52
16338d0553K7885K0134j4232J263J3731j355N64J387J0903k021L077J2661K5730
16325E9174j0665l7192j9507J8519l4461p079Q991J4313K9083k8620q735J2099
$$ y = [8122, 6360, 14430, 5609, -14407, -22573, -12529, -12436, 505, -11920, -12797, -31391, -15223, 6722, -46377, -62420, -36924, -27708, -35827, -27211, 14962, 9879, -963, 6003, -2491, -27603, -37110, 21848, 30784, 913, -14332, -8185, 17372, 43554, 31276, 22277, 9397, 26356, 25451, 32719, 38590, 47638, 54495, 56044, 32052, -12292, -2947, -4109, -16958, -46844, -49790, -14304, 12314, 31983, 34107, 24675, -8721, -10371, -1957, 358, 5314, 1359, 8263, 8860, 7520, 19662, 10790, 10021, 36393, 11885, -5374, 6886, -4555, 13752, 7183, -25555, -26250, -28758, -43229, -40905, -40553, -12668, 7466, -6766, -5503, 8228, 6873, 7437, 8824, 19727, 17706, 20783, 33444, 59174, 48509, 11317, -8190, 10329, -24132, -31211, -22220, -7907, 21176, -7444, -16179, -4080]
16313d080J8020J3337k2920K8561K9302q528l2673o732m504j7521j0409p468k8442
16300e4057j3703n80J4170L4576k1758L0461N044K5710K2255k7021k1006n070
16288a0979j1862J1279p848m579j1214o26P704j0532l3709j0896K2553M0293J1533
16275h883K0983J5017j7043k4941J3286O450K1282r411R60o124K750K0129m032
16262C0423k1075L341k5021K2805j9153k7400l2574J5572K4732l4088l6838K2958
16250g6318O7458L2953l825l0788k9892J2452M2427o29M248J110O238K1770j7009
16237C0195k5000q976k1595j8649J2822J203J9543R213k260J4392j9157n353M147
16224i475J5011O423k9627l2770q090L6697L0492L053j1242k1988l235j2812L8686
$$ y = [-4080, 13940, 27277, 4357, 32918, 62220, 53692, 21019, 14287, 9783, -7738, -18147, -25615, -54057, -67760, -68340, -54170, -19594, -41352, -10891, -5847, 19863, 42118, 15097, -5909, -10979, -22841, -11562, -19410, -23989, -35203, -35829, -28125, -38657, -72366, -83262, -60709, -20416, -8883, 12100, 27117, 10074, -14867, -1581, 4869, 26151, 16740, 17700, 11576, 14326, 34455, 30423, 9348, 12689, -12332, 10473, -8680, -36080, -68654, -53082, -28350, -62438, -99276, -76318, -8860, 24093, 20268, -10520, -40412, -27960, 14467, 13838, 18086, 19196, 25434, 47204, 30195, 5195, -3781, -25376, -44025, -31203, -30000, -10457, -1244, -3504, 10888, -8269, -13622, -9475, 5536, 11959, -17668, -50438, -58528, -21831, 8661, 11714, 472, -21516, -24751, -37563, 1123]
16211A123J3553j6102R087J4046P012j5007l0158l9707j7513J9000J2998J8288
16199b3380L4531j042j1164N742K2117n519J0653K1297P769l718l1445k6042K3857
16186B3656J0362J3570j1031l6244p094k6947l134J2811j0008J3727J0187K290
16174g855J0818j2121l004N475Q645M858r940k971L465k6003M0408K1790j3397
16161B0168m66k0464k4933N243R816M1818J6595k1185j5645k8743k5796k3587
16149f7179J3495M5850L2678p242j1346l520N592J5228j9543r995L064Q868j6438
16136a0488j638j9526K2960N4117J2212j4776l753K709j978n0180K3985K9146
16124D2790p548m1239j0209L080k3280k6914j2271J5710K3124p595O708l34K1067
$$ y = [1123, 14676, -1426, 7661, 21707, 28719, 13712, -16446, -56153, -73666, -54666, -41668, -23380, 11151, 10109, -1055, 4687, 26804, 21285, 31938, 53235, 61004, 57286, 25841, -201, 23656, 34018, 47588, 36557, 313, -6781, -33728, -36862, -24051, -34059, -20332, -10145, -7855, 2963, -9158, -12162, -6687, 1958, 6816, -3124, -6095, -2630, -28633, 11775, 33565, 20168, 19702, -762, -25695, -20452, -10636, 31182, 47777, 26592, 10947, -17796, -43592, -67179, -53684, -7834, 24844, 17602, 6256, 2736, 8328, 23556, 4013, -5982, -2918, 5950, -10488, -12126, -31652, -8692, 45425, 57637, 42861, 39108, 41817, 39839, -10341, 13644, 42790, 35242, -5997, -16206, -13126, -36406, -63320, -75591, -59881, -36757, -44352, -37644, -37978, -16911]
16111a6911L5384p229k860J4916J272j8805j8566l479K071K118J4502j8640J4977
16098a250K6754r154Q463L0298n500k3460j5194n875p594j4750j5408o126L9244
16085D48L2318k0414q008o211P585k3243j9505J6248k420j8194q28R659M7174
16072A4609J2001p370k2124j1038J3918l17J7193K2866J5570k7193O875k7538
16060G452m946J9125r371j4573J878k1902P513L6100P046l6341l7568K4163l945
16047b5369j0580N396O6664o418j9873j6090j3206j5288J0347q666j050L9492
16035E359L3999j3272M512O808o576k8053K2106K7033M2967q932m5947m5023j0440
16022a5459K5698R050N029p880j6288J776K1593M254k5879j5024K757K7148j7454
$$ y = [-16911, 18473, 11244, 8384, 23300, 24572, 5767, -12799, -16278, -14207, -12089, 2413, -16227, -1250, 25504, 16350, 24813, 55111, 49611, 26151, 10957, 5082, -2512, -17262, -32670, -38796, 448, 32766, 12352, 4344, -1867, 5718, -17525, -37030, -20782, -23202, -41396, -42224, -32565, 14609, 26610, 19240, -2884, -13922, -4, -321, 16872, 39738, 55308, 28115, 34990, 7452, 2506, 21631, 12260, -2313, -435, -22337, -14824, 21276, 28322, -8019, -45587, -21424, -25369, -35949, -30553, 36111, 29693, 9820, -6270, -19476, -34764, -24417, -33083, -34133, 5359, 39358, 26086, 30598, 37406, 30830, 2777, 24883, 51916, 94883, 85951, 40004, -5019, -15459, 10239, 19289, 24318, 16438, 150, 1926, 23519, 27773, 1894, -13130, -10373, 16775, -679]
16009f79r459J6857K6455J2212j5518k6470r193K5517j8086k7018J9928J7540
15997A2086J2551R391m013L226j6331K4807j1490j6113L4171l6096k7767k4519
15985d0097j746M402N231M203k5817O441J6390K6353N189k9564J3439N281N01
15972i794P262j1054j0634j7967n818L2632k6939j9600J1530K5144L4481J630
15960A0873q872J3925J0754Q380q174K086k529o872r113k3568r338k1234J3257
15947c0425N9380R524k7042l6472k5313R779J9925K9461k978l2636l2920J705
15935e8012J4476K9203K1360O548k1379K2463J5274n012L3245j5030k1011k862
15923A9263P118K407j513k4082n420m129j522n885n836k770o226j0444p765o098
$$ y = [-679, -10138, 6719, 33174, 45386, 29868, 3398, -5795, 19722, 1636, -25382, -5454, 12086, 24637, 34028, 30015, 33241, 16910, 41717, 30227, 14114, 48285, 12189, -15578, -40097, -41843, -37441, -32210, -28007, -53824, -47383, -30993, -4640, 549, -29015, -15576, -10295, -9794, -2532, -13586, -24220, -42187, -48005, -15373, -42312, -61912, -50382, -25238, 9243, 10873, 2001, 15926, 26680, 35060, 26886, 28972, 26443, 19571, 10458, -13110, -22448, -43682, -30425, 28955, 38479, 11437, -25035, -50348, -40569, -20644, 8817, 5839, -26797, -59717, -58012, -43536, -14333, 7027, 13575, -7804, 14659, 29933, 24921, 58166, 43136, 22125, 19263, 26381, 28788, 27275, 3193, -2227, -6356, -7878, -13763, -19599, -22369, -28595, -39039, -46804, -52902]
15909e2902J5549J8837m0357J242j285R046J16J2777L0352k235o144m609l361
15896b2974L0541J0850k7555j7866p315R887j4992j5700J5948q832P491R333n217
15883c6401K9371R661L822j4667j8339K8843N601r082l3569L4905J8989m2099
15871b2965J0379L9640j1603j2656q037j1047l06p301m146p986M3686K8310l1967
15858D001N784k694J858R593J811o982j5251j9001j0711m143p313J6360L005j6595
15844d0278J1042o800J3903J1613r723l4338n975J9466q56M0623l7763Q599r639
15831d0126p050K5961j3512j357O235q848m169K0594m090j3171J3763j923K7057
15818f36N704j7511J1568j4926j8031K8137J1851K930P078l1423M058K718j1674
$$ y = [-52902, -37353, -18516, -58873, -57631, -58916, -49870, -49754, -36977, -6625, -8860, -15004, -19613, -22974, 7567, 18417, -9138, -27004, -34319, -24432, -39424, -55124, -39176, -48008, -40517, -31184, -36401, -7030, 2631, 6453, -8214, -26553, 2290, 7891, -1191, -34760, 145, 19134, -22965, -12586, 27054, 15451, 2795, -5242, -16289, -16595, -23896, -28042, -36028, 7658, 35968, 4001, 9785, 7091, 8949, 18542, 20353, 13371, -1880, -20881, -31592, -35735, -43048, -26688, -23683, -40278, -29236, -36036, -22133, -10520, -20243, -54581, -60556, -41090, -41946, -1323, -39086, -30487, -40126, -47176, -21215, -34727, -36084, -29849, -38697, -42866, -22272, -26362, -39533, -25770, -27693, -636, 5068, -12443, -875, -15801, -33832, -5695, 6156, 9086, 16164, -15259, -11201, -8483, -20157]
15805b0157K0291K1005k3094L218P78N792K881o978j7960m383L5533k452J2805
15792B7279q692l6444j0123J5905o911k5899R606L1256J0720K7757M306J2249
15780E1009M1k001j1664m7595n0928l180J6942L3883K3041J4395j8020j9232R52
15767a2357q168K960J2937J3027J8657j0815j7414J4612k0883j0696J2442j8188
15755b3886R095J1799k0956J884K7400L1850J213N226k3854l8494j3306L438L0606
15742B015k4231j2446K1469k546K456L409Q163N496R154l146l016J2162O222l0959
15728e798r099J2195K3838J1602j5153m2781j3766L0474J3851m533L3437j2352
15716B1915Q014k994l3168O68Q394J2144k2830O292L570r210L958k0071r227N922
$$ y = [-20157, 134, 21139, -1955, 1263, 2041, 7833, 10714, 3736, -14224, -18607, 16926, 14474, 27279, 18587, -17857, -27980, -12075, -18986, -44885, -35279, -4023, 6697, 34454, 38760, 51009, 51050, 49049, 37385, -10210, -61138, -64318, -47376, -13493, 9548, 23943, 5923, -13309, -12357, -20525, -17565, -4628, 8399, 27056, 16241, -1173, 13439, -7444, -18140, -5698, -23886, -14791, -2992, -23948, -22064, 5336, 37186, 38399, 43625, 19771, -18723, -32029, -28591, 2015, -22216, -34662, -13193, -15739, -13283, -9874, -1711, 3785, 12939, 9793, 6777, 18939, 25161, -5798, -14897, -2702, 21136, 32738, 17585, -25196, -38962, -8488, 5363, 830, 34267, 21915, 29929, 26935, -6233, -5565, 2829, 14973, -7857, -1565, 2005, -7205, -3247, -23318, -32545, -26623]
15702b6623J812J6753R377k974j5934l8725K795M3863J0466k507r140M557n005
15689a1285O288k740k71j4182l5831j362L7644K4373L984l594k2165k743K5383
15676C499l297K79j8722j9085j527J0109n995J0142L9546L081m40L777n619K0033
15662C5781L7041J6976j6498j8109l6937l3006K5493L1191j8375k4691q830J0177
15650B13q547j0608k1252L122J9033K5948K1742q156k7245J5653Q734j550K3191
15637D0278j2471j0172l486J5064j1230N892M8864k492k8817p979K4212K5608
15625H3271k5354l9578j6632k9412m411P693q553Q350K1643r07k1449j2260J4779
15612b2820J4006k2783k6568J1228Q890J1698K6471J8839J3880k8979p101J529
$$ y = [-26623, -24811, -8058, 1319, -1655, -17589, -56314, -53519, -9656, 810, -1697, -10837, -6280, -11285, -4997, -7737, -8008, -22190, -58021, -59383, -21739, 2634, 6618, 3024, -19141, -21884, 3499, 202, 481, -18241, -37326, -38853, -28744, -34739, -24597, 14949, 18030, 17590, 21367, 15748, 35781, 72822, 89798, 73300, 55191, 18254, -14752, 10741, 41932, 23557, -1134, -9964, 213, -8334, -18942, -40194, -37072, -18039, 7909, 29651, 21495, -5750, 9903, 18637, 17087, 40278, 27807, 17635, 14149, 29213, 17983, 23875, 72739, 70247, 41430, 33451, 57663, 83271, 57917, 18339, 1707, -27705, -32116, -24423, -32976, -24626, -2983, -3890, -25339, -37599, -22820, -8814, -31597, -58165, -46937, -38047, -26349, 122, 18961, 32841, 3862, -3239, -1710]
15600a710J4585j4786K221l3243p491K5161J670L0967K1589l2936j7111L3021
15588B1937j0784j0304J0430M67j3745l2677J3927J9884j4954J665N048K1457
15576A2351J1448j9175m065J7364m9091k8876J059p715J469R671N148J4833K037
15563c3542l60J8882k6627n554J1182J0016j3k058P865j2690j2589P737L1465
15550f286J3046r958K865K078M802Q506j2440J2619J2359J4581J4659o208k5075
15537B5548K890k5681j5530J0622N774p885J6786O280k3230j7937j4603L5128
15525a838K7816j3459j9893r351k738j4449p008M4728J1521j3802k8526q997J2934
15512b3062o954l033j1119N769J4267j9357R918L328J760R123M915j6719j8813
$$ y = [-1710, 12875, -1911, 310, -32933, -40424, -15263, -13593, 17374, 38963, 6027, -11084, 21937, 11153, 849, 11279, 11746, -1999, -34676, -20749, -865, -15819, -14154, -9106, 12351, 23799, 4624, 559, 17923, -31168, -60044, -58985, -66700, -65231, -55560, -50412, -35579, -33542, -33902, -15020, -41647, -47201, -36019, -26003, -26016, -28074, -20209, -32899, -45488, -37751, -6286, 6760, -3198, -333, 1745, 6547, 15053, 2613, 15232, 27591, 42172, 56831, 50623, 25548, 28438, 2757, -12773, -2151, 3623, -4262, 12524, 18804, -4426, -22363, -36966, -1838, 25978, 12519, -7374, -16725, -19463, -33912, -40920, 3808, 15329, 1527, -26999, -35996, -23062, -30016, -33049, -44168, -38399, -24132, -43489, -33571, -30243, -28483, -19360, -14445, -31164, -49977]
15499d9977L2768J6090o095j4258K8847M0135n383k5872p487k765k2223L030O522
15486f668K4824r745r763J4616K815p694l0639p160K9476J9032M604k7076j3078
15473a6456j7500l42M455J7900K047j9351l340K4448J3218j3634k2781j9315J2928
15460c7723J2890L4238K4405J3157j969l2026j3206k918K8546l818K067o825k8408
15447a1590l5323p964L3485L8660n646J0813k6201k4235j81K294J7246o117n742
15434b0501J8735M603K0965J3437K1988n030m9163J4302j5766m0388M341L4843
15422B366L321O524O928j8699p212n629J7758j4287K896J166J6174o760j5309
15409a0763r024j1459M0305J8129K075O4j1991k3502n863l0632o681K3818N0554
$$ y = [-49977, -17209, -1119, -7214, -21472, 7375, 47510, 42127, 16255, 8768, 6003, -16220, -13190, -6668, 18156, 8411, -1352, 13264, 16079, 8385, -22254, -29414, 62, 19094, 23698, -3378, -16456, -33956, -34298, -29843, -11943, -9896, -29247, -32587, -8139, 5079, -8555, -31336, -50651, -37723, -24833, 9405, 33810, 46967, 44998, 12972, -234, -3152, 25394, 21576, 23643, 16818, -11590, -46913, -54877, -21392, 17268, 11622, 22435, -3766, -28001, -28182, -25888, -8642, -14759, -20501, -1766, 2837, 23802, 37239, 59227, 54197, 5034, 19336, 3570, -36818, -32477, 2366, 5687, 12211, 19139, 440, -6772, -12401, 5357, -8930, -6034, -4868, 11306, 4546, -10763, -19787, -31246, 9059, 27188, 29263, 29327, 17336, -6166, -12029, -42661, -49342, -25524, 25030]
15396B5030Q732k0078j0419J4526m653J1964J3573k3460k0883O873p274Q41K5347
15383B0119L0721R128j0684K757k0776j0344K1308P918n93o922k4421k5465j0095
15370a7349j1908M323J1987l808j4016j3821l311o737L2718L6013R288j1145j8974
15357f740k2157J7543R095L1094l971P349M252j3745J762m169q854M615j0964
15344E110k60L1330J5506k814m6590l1943L674J4782K1784K2027K838l2798J979
15331D625L5289K130r408k9807k4365O062J7108R120j9762j4073K8439J5166j3851
15318F673j9255j4382j4907P318K6211N1463n382k4066Q173k2286j7612K7319
15306I267J1442j9595l2142k3695K6987L9417J6291k1487k9282K1604J0280O37
$$ y = [25030, 33762, 13684, 3265, 17791, 13138, 25102, 38675, 15215, -5668, 1205, -6069, -5228, 20119, 50840, 59968, 49284, 52041, 31265, 20921, 42229, 50147, 49554, 42632, 18211, -7254, -17349, -29257, -24934, -12947, -16755, -30771, -44592, -47903, -54640, -21922, 14091, 23379, 12234, -6740, -28897, -11354, -2259, 28835, 24864, 32213, 36465, 22720, 24482, 20313, 11459, 16074, 5110, 4850, 36180, 51686, 48872, 2282, -29661, -25987, -11205, 10579, 32606, 35444, 2646, 4625, 39914, 42044, 32636, 2829, -21536, -15474, 1634, 10754, -9008, -23081, 5358, 20524, 6673, -12582, -26964, -41871, -34553, -8342, 43121, 37739, 13673, 21846, -440, -18052, 9267, 20709, 1114, -31028, -54723, -27736, 11681, 27972, 6485, -22797, -1193, 9087, 9724]
15294I724j2605k6629j139J7922J9770P112m342N330m5377j1847J2797j3841k2560
15281f5685j513L4360L2668O946k5343J5957K9862l787j324N256k6674j8205m431
15268b1913K5494l855k2088k1831K2332j2360j9810L4139L7167q956j2322l064
15256g067j2733q084K3748n366l089k2740k7883O0095L8552j3123j9389J4656
15244A7577r258O140o024M964n163K1544M8007P553j4943q500m989K853k2742
15231C7019j312j0868l0830n5564J1546M9583J6390J5400r700l1258j6751J4071
15219a2274M694J3709j1494K6981L1748j2949r622k3741j3446j133R515K059j6593
15206a2546J7869J0712j0905k0011k0943j1179K1703L6036J3257N202q865m0192
$$ y = [9724, -2881, -29510, -30649, -12727, 7043, 14155, 9813, 15143, -30234, -42081, -29284, -43125, -65685, -67198, -32838, -170, 6776, -18567, -2610, 27252, 23465, 22141, 27397, 723, -17482, -21913, 3581, -274, -22362, -44193, -21861, -34221, -54031, -19892, 17275, 8319, -4003, -7067, -19800, -27884, -4136, -9502, -12591, -35331, -63214, -3119, 35433, 22310, 2921, 17577, 8319, 14459, 8435, 13399, 8236, 29780, 77787, 85340, 70397, 61897, 56908, 59761, 37019, 35707, 24839, -5991, -61555, -50009, -426, 15964, 31364, 21664, -9594, -26345, -12274, -7580, 6129, -5365, 21616, 53364, 40415, 30793, 7052, -6394, -7527, 1988, 4047, -12546, 5323, 16035, 5130, -14881, -35824, -47003, -25300, 10736, 23993, 29195, 20330, -19862]
15194a9862k3367m872J4553L0990K2235J0316p771K741r939k6624j9242N747J470
15181b3625n771q51j0645K4705O96o553J6803j6099p517L1000K6162J6366l380
15168D1291k0060j4481j4570J4299L0582k2444K885R835p61j45k7536J7427M4488
15155F0810Q282k4144m6011j5157J6466J1878O85q612r494m2110j9345K7867J3949
15142b4936J4249k0348m554J9909L3411L5941j2666j6922K9133j354o845k6593
15130A8425q719j1835l134K8070Q495j2619l911j0746k4038k471L9057J2149L5538
15117F4261l692l9895K2831K556k5590j6065K0497J8866n890j0357j0383J6083
15105C3222l864j8026O881k990J5685L61j4619m155n470J7439M998Q37J5585J3450
$$ y = [-19862, -43229, -48101, -33548, -2558, 19677, 29993, 22222, 24963, 15024, -11600, -30842, -25095, -23625, -29396, -30247, -40892, -16187, -15491, -22044, -5241, -21340, -28857, 2143, 28305, 44671, 41291, 21231, 6750, -7820, 6479, 37061, 14617, 17502, 27337, 26576, 26431, -1105, 16322, 60810, 69092, 44948, -1063, -16220, 246, 12124, 12809, 4197, -5297, -47407, -66752, -38885, -24936, -10687, -31035, -35589, -15680, 17731, 53672, 41006, 24084, 53217, 51863, 45018, 18425, 9706, -2129, -5263, 22807, 31302, 18683, 14772, 4026, -20012, -22483, 16574, 28723, 64261, 60569, 20674, 43505, 46061, 20471, 4406, 24903, 43769, 37879, 27522, 17139, 33222, 29358, 11332, 18213, 15223, 30908, 31269, 16650, 12495, 7025, 24464, 29462, 30299, 45884, 59334]
15091E9334k3255n983k926j4194j2952P606j9556q003J5117L41K1424n27r474
15078F952m66j1157K4296j8422k9091Q804k143j333r386o469J7524L2537J9983
15065C1629J2278m887j8827m0126J2193l2313k779K1976L2921K3j4298n517K8144
15052B0417l9057j7784J6930L2195J9775p92J1245j2807l0019k2313k781J9191
15040e800j0377j2486L0862N5058R896j4161j3498k1122n115M874q74M110k4929
15027c562J1047K4566M156K3491j9790r263P56l2266j2398K0727k9187j6646L2346
15014f023L1921j9768l0435j1235L0093P022j345k258l761N497j1011l6791J0011
15001c8083J7202j6819K45K5946J0729l4365K6707R415J1767l8175J1773L3020
$$ y = [59334, 36079, 30096, 27170, 12976, 24, 7630, -11926, -19929, -4812, -4471, 16953, 16426, 6952, 6486, -4671, 19625, 1203, -27888, -19084, -21227, -22560, -31946, -38415, -20891, 11646, 31629, 43907, 39020, 20193, -19933, -7740, -40053, -42832, -20856, 12065, 12088, -2210, -7727, 20417, -18640, -36424, -19494, 12701, 32476, 31684, 42929, 30122, 103, -22210, -24991, -5800, -16177, -28663, 2199, 57257, 67153, 52992, 39494, 18372, 13257, 18131, 17257, 21367, -3562, 7485, 32051, 36207, 59698, 39908, 30645, 31401, -865, -13263, 7464, -21723, -38369, -6023, 25898, 6130, -24305, -35540, -5447, 1575, 230, -2028, -5789, -292, -11303, -48094, -38083, -20881, -37700, -37455, -11509, -780, -35145, -8438, 977, 12744, -25431, -13658, 19362]
14989A9362K1539K8549j0764k8776k1052n75R963j1073R352L913j078m818J5190
14976B9732p156l5005M235J135K0041j7579k3482K8565K3914k1042k2708k4779
14964d4129j1357L7495J9080l436j1362m764M233J6314L0469o253Q46J2274l0469
14951H941k3992n44R7J7567J152k4816M704L6507M8559K0148J0229j9842o5877
14938A2833m9079P012J4425L0801K8300l226l3967p971n843j6619p034o244k307
14925c8919K62J4924K5664P488j134K9506L893k1499k0223M3502J5674l8225Q835
14912B9748J4002j5540j2204K940J4020k1653k8686j4105N239O118l413j2652
14900c6186K838J2086J7458L1492n977j8862n270m555K6397K4039j1318j5799
$$ y = [19362, 40901, 69450, 58686, 29910, 8858, 8283, 18246, 7173, 16525, 20438, 19360, 14542, 29732, 22576, -12429, -8194, -7059, 12982, -4597, -28079, 486, 24400, 3358, -19350, -44129, -55486, -17991, 1089, -2347, -13709, -18473, -14240, 2074, 32543, 26290, 27136, 39410, 8941, -15051, -15595, -15498, 2069, 3221, -21595, -16891, 19616, 68175, 88323, 98552, 78710, 12833, -36246, -29234, -14809, 15992, 44292, 41066, 7099, -872, -6715, -23334, -30368, -36612, -38919, -38657, -23733, 1931, 9419, 8285, 37791, 41684, 20185, -38, 43464, 59138, 20913, 29748, 43750, 28210, 16006, 18946, 32966, 11313, -17373, -31478, -26239, -20121, -23534, -36186, -33348, -21262, -3804, 27688, 21711, 2849, -2421, -6976, 19421, 43460, 32142, 16343]
14888A6343J3578o851k2243j3153J6740k292J8114J3851n557K556K0379J1170
14876F2635o748j0497m606p5l7504k2594l520P007K2985K6737N538J2871J5506
14863F7735j0354k6618k6395j0031K0709k2488R749K3587J6252j0991k9121O989
14851I023n150L817r358P158J3794J991J9033l946L409j6277N729j870J3292K5256
14837F5901j2807m3314K641M0497j4531l1638k719n248O804N114k1184l2012j906
14824d4402K1271K6869J1223j1119k0392p586K0172J7427Q190j2687K2284J0514
14812D1764n776j7406k5545r666K0208J4070k081J3740n526J9430J0686k3664
14800C0234j9498n208J2446k378m6691j1710M9451M0838K187j2962n0768j3090
$$ y = [16343, 29921, 23070, 827, -12326, 4414, 2122, 20236, 34087, 28530, 31086, 51465, 62635, 55887, 45390, 40784, 40709, 3205, -19389, -22909, -15902, 7083, 33820, 39358, 52229, 67735, 57381, 30763, 4368, -5663, 15046, -7442, 2307, 25894, 42146, 31155, 2034, 9023, 3873, 7690, -1668, 5490, 19284, 21275, 40308, 36362, 39771, 23494, 29223, 27353, 40645, 65901, 53094, 9780, 12421, 52918, 38387, 6749, 4030, -1218, 5586, 10700, -10484, -42496, -44402, -23131, 3738, 14961, 3842, -16550, -24136, -3964, 13463, 21653, 8966, 31250, 41764, 35988, 18582, -6963, -16629, 3579, 17649, 15568, 29308, 23782, 43212, 53898, 30234, 10736, 5528, 17974, 15596, -31095, -42805, 6646, 47484, 49671, 36709, -14059, -27149]
14788b7149M4050Q501p734N246P710L102j0619J3178m96j3684J1937j8215j3699
14775B128j7273j0542K5397J3719J762k343l54J271L279r842k5133m4088n686
14762f7705J4477M4758M3382r041m128j7194k2603M920L6390K0221J4406j913
14750E5970k6824j320l2558k4851M318R121K0168J85R901m334j7767j5077M0200
14737A7132K831m251k2406r940J5931J0445J6913J1930J4325R881R017k2265j9701
14724B9842Q177j9913J364N1k630k8841j1691P703K610R253l61j8940j7621K1223
14710a9774K6598R238L0438J1804j6581J6136j2802k4814R260K430j3107l722
14698A5104O663o045l6709J5356O389N690k3877j5643M7837L4187j4672j3568
$$ y = [-27149, 16901, 25402, 17668, 22914, 30624, 33726, 23107, 36285, 35789, 22105, 34042, 15827, 2128, -15145, -25687, -290, 13429, 15191, 12848, 12494, 13765, 17044, 7202, -17931, -62019, -67705, -53228, -8470, 34912, 25871, 21743, 4549, -18054, -13134, 23256, 43477, 57883, 55970, 29146, 27826, -4732, -29583, -25265, -16144, 4024, 4209, 14110, 9776, -7991, -23068, 17132, 19963, 15712, -6694, -16634, -703, 9742, 26655, 38585, 52910, 62791, 71808, 49543, 29842, 38019, 18106, 19470, 19521, 16891, -11950, -23641, -15938, -13328, -4075, -4436, -23376, -40997, -19774, 6824, 16062, 46500, 58304, 41723, 57859, 45057, 20243, 29503, 31933, 18826, 15104, 21767, 15722, -20987, -5631, 758, 6448, -17429, -33072, 14765, 48952, 34280, 20712]
14686B0712l0103j7273P753J2767K4019M651K1601j6163k8281k2997k76K8043
14674D453J6280j4238M620l402J1837J0437M848J0472J1000k2919j7384J1376
14662B7380J4871O056k3759k9291m953Q831N532j9136j8690K9569K2300J0370
14650B9080j3066R569Q5M833k7021o355J3155l6018k0052J4831N6698P201k9433
14637C507Q262J3783J2660p305j8817o605J8023J7042k9087j7738j5863l799K5840
14624i7o855j4101j1123m24p50K6851L9982K8310k4493j1079J1400j4245l8163
14611a4787J166J9047J9471k3284k2660M062K0584J6659K6183J6409j5379l5910
14599A1561j3476P830j6176k1013J4098J3943J5093L45L494K859J7158j4634k4928
$$ y = [20712, -9391, -26664, -18911, -6144, 17875, 22526, 44127, 27964, -317, -23314, -23590, 4453, 20733, 6495, 11115, 7713, 19550, 29987, 34835, 45307, 56307, 33388, 16004, 27380, 42251, 48307, 24548, -4743, -9696, -865, 4667, -14469, -33159, -3590, 18710, 29080, 16014, 25583, 25668, 30501, 3480, -2875, 10280, -25738, -45790, -30959, 25739, 32940, 3507, 11769, 25552, 38212, 30907, 12090, 5485, 23508, 40550, 11463, -6275, -22138, -25937, -97, -6952, -21053, -32176, -32600, -33350, -6499, 33483, 61793, 37300, 26221, 37621, 23376, -14787, -13621, 5426, 24897, 1613, -21047, -16985, 3599, 20258, 46441, 62850, 47471, 11561, -1915, 5915, -10261, -31274, -17176, -3233, 11860, 12205, 15699, 18558, 35716, 21082, -3846]
14586c846J9984J3358j9581j1850K8028k1370l9358K5313M0124O408j4804j7063
14574E343n937J6397l375k315M304q848M057n985k0933j3241J9166J5502k2874
14561a8739j0842J5611J870j4425j2213q70J6687M390J1543N213j4823J4089J9745
14548A7236M951j3141k1064J646K3161j9956l1814Q491K3510L8669M6716l527
14536G4878m124m672J795l7554j7638Q224j5616j0188p88R679M2451L45l5218
14523A1574L0035K5749j3101K5101N465j0286j9925k3011l7311l8897O214J0758
14511b7635K3119L6139O624R343k095n35j0762P933n774j9396J9734J8436j6969
14498C8162l2091J1390n366m0367j6976k889R71K0640o681j8379K1602K1805k850
$$ y = [-3846, 16138, 29496, 9915, -1935, 26093, 4723, -34635, -9322, 30802, 37210, 22406, 5343, -594, 15803, 12428, 10113, 14417, 5569, 9626, 3641, -17292, -30533, -11367, 4135, -18739, -29581, -13970, -12100, -26525, -38738, -39608, -22921, -18531, -6988, -1775, -16598, -2509, 17236, 22187, 9046, -12018, -10372, 12789, -7167, -38981, -30490, -6980, 31689, 78405, 74878, 70754, 66082, 67877, 30323, 12685, 20909, 5293, -4895, -5683, 3996, 46447, 46792, 11574, 41609, 67358, 54257, 79358, 84823, 74537, 54612, 31601, -5710, -44607, -38393, -27635, -4516, 31623, 38247, 47590, 45495, 44960, 34198, 42131, 36357, 16961, 36695, 55131, 38162, 6071, 17461, 12095, -28272, -45248, -48137, -47166, -26526, -33207, -51586, -29984, -8179, -11029]
14485a1029j5137J2458j2636j6416P517J7910l877k2291L3471L5973O109j1610
14473B0442r03k7813p905K5929J4353J9987R20m921J0439m13k920M942k342J2071
14459F1866n386j9936K148M412R72k4745k4133n906K2536N783J5849o266M191
14446C1385Q383k2758K62L3390J1761j3468r638k7623r660K2813j6362j5341K3408
14433A6552J6401N250J0046L3673k0160Q866J7907o212k6040j6453k580J0231
14421D7481j6395k5490j1277J2587J3049J4571J3709P682j2653j3394K555j482
14409C0943Q84j5032P761J1648j646q296l344p71j8348l818q725p136M3736K6693
14395E4549j562j8547j2856j8060k5300J3344L1303K7569K659l497o061k4920
$$ y = [-11029, -26166, -13708, -26344, -42760, -35243, -17333, -21210, -43501, -10030, 25943, 32052, 20442, 19539, -8274, -16179, 9750, 24103, 44090, 45010, 40089, 50528, 50115, 47195, 52137, 49795, 61866, 56480, 36544, 38692, 43104, 44076, 19331, -4802, -10708, 11828, 17611, 33460, 27194, 31385, 39768, 17010, 17272, 50662, 62423, 48955, 39317, 11694, 2034, 24847, 8485, -6856, 16552, 32953, 38203, 48249, 81922, 61762, 70628, 88535, 82323, 56283, 39830, 37250, 47481, 31086, 5596, -5681, 6906, 19955, 34526, 48235, 55917, 43264, 29870, 32425, 30943, 31827, 16795, 24556, 36204, 34558, 26262, 22918, 22147, 3799, -19, -8744, -15880, 27856, 54549, 52987, 34440, 21584, 3524, -21776, -8432, 22871, 50440, 53099, 49602, 43541, 18621]
14383A8621m1771K6713K6487j3394J0442L542j4313k1017j544P585l0249j3907
14371d2805L8715L2877J1810k3237k5973L0759J6648j21j2067r883L4308j2700
14359C8331q896q277m228k6104J1965j4372k2637k283J1257J8328J1103L5812
14347C9999j3086l0844l496k95J2760L4492O751j0977j9350j2623L961n021k042
14334B29p347l662M180K3231O337J8579j0546J7991K863j7096j0656K5856J1240
14321F1199j0896j3899k868q749K5962J1686p152O77j7541o251R730M182j075
14308D5005L15k1704l3260O033K8204q08r198j4306j2657K1028J6520P410m250
14295B8332J9609J1720m8067k2890J7316L6329j240J4756K9162l5655k9432L570
$$ y = [18621, -23150, 3563, 30050, 16656, 27098, 30640, 16327, -4690, -6234, 1351, -28898, -42805, -4090, 28787, 40597, 17360, -8613, 22146, 38794, 38673, 26606, 16723, 51031, 38331, 29435, 21158, 16930, -9174, 2791, -11581, -34218, -36501, -25244, -6916, 4187, 39999, 26913, -3931, -7427, -7722, 5038, 39530, 46281, 35304, 15954, 3331, 7292, 2271, 229, -7118, -10780, -6600, 16631, 22968, 41547, 31001, 48992, 51855, 34759, 24103, 49959, 61199, 50303, 36404, 33536, 24787, 50749, 62435, 55283, 55960, 38419, 32168, 41898, 46080, 45005, 45320, 23616, -9644, -3611, 24593, 23785, 14587, 281, -12376, 8652, 25172, 32582, 28332, 47941, 59661, 11594, -11296, 6020, 42349, 41109, 55865, 85027, 49372, 19940, 23510]
14283B3510J7363m345J9659L1047q0k7736q075J7322k9023p520K3929J3055J0429
14270G9535P070L995k0216L3474K0714N383j893K463q862j5802O276L6768P5655
14257B24560K4234N623K748Q998J9625K3936j6378J3537P3052Q4283R8991J19377
14245F82586J30627K09809K56823K60950K88166K35796R4092m0194j81107k88009
14235A649539k59761k43040k40389k30044j80335j14453l6096n6460p769N400
14225B86592o020O115k5941j9512k8121l1045j0735j8148j3446j9694k827J008
14213A18226K2923J5290j1522j1972k861R60N516j6303k116k064j6037P476K672
14200A10188K916j764K1669j900P220k0882j6563J1112q46K985O57q788k6827
$$ y = [23510, 40873, 36528, 56187, 87234, 87154, 59418, 51343, 68665, 39642, 32122, 56051, 69106, 79535, 86605, 90600, 70384, 103858, 124572, 129955, 128062, 130525, 121663, 105861, 112137, 148905, 224560, 248794, 254417, 257165, 266163, 285788, 309724, 293346, 306883, 379935, 464218, 563209, 682586, 813213, 1023022, 1279845, 1540795, 1828961, 2064757, 2158849, 2118655, 1937548, 1649539, 1389778, 1146738, 906349, 676305, 495970, 381517, 345421, 288961, 281192, 286592, 280572, 286687, 260746, 241234, 213113, 182068, 171333, 153185, 139739, 120045, 117218, 118226, 141149, 156439, 144917, 132945, 130084, 131044, 136560, 120257, 118141, 116077, 100040, 107516, 110188, 113104, 111340, 133009, 131109, 138329, 117447, 100884, 111996, 111150, 114135, 114792, 106004, 79177]
14187G9177m8678k0035L0512J1243J2144j0952R087K2704j1216o333m0381k8788
14175a516J226j1676L9863K2594J9996n9O952j2492k336J5032j7432O319J5874
14162H2345l5803k86k2425j7034Q529J1830m252o608M619K4060O83l0010J7941
14149C3589J8680n707j1700J3432L7475j719k0164j5588j3102J9522M410J1500
14137G0628k774j5190j6590l958L576j0340l5098K4439L7964L3989j792k14k8113
14124E6527m5050P22M1846J9073M515J3333M278j3936k6178r212r468O215K4701
14111F7366J2557R925M1074J3319k8347m0556J365L623k7281N77L9859r874m0121
14098D3486N334J2233M401j6794J2686R015j1971K474Q203k5076j7438J3959O489
$$ y = [79177, 30499, 10464, 40976, 52219, 64363, 53411, 62498, 85202, 73986, 67653, 27272, -1516, -290, -11966, 27897, 50491, 70487, 70428, 77380, 64888, 62552, 77584, 60152, 66471, 82345, 46542, 46256, 23831, 6797, 15326, 27156, 22904, 16296, 20915, 44975, 45658, 15648, 33589, 52269, 46562, 34862, 48294, 85769, 84050, 63886, 48298, 35196, 54718, 59128, 70628, 67854, 52664, 36074, 32116, 35692, 25352, -9746, 14693, 52657, 86646, 84854, 84640, 56527, 11477, 12199, 54045, 73118, 77633, 90966, 95244, 81308, 55130, 45918, 36450, 42665, 67366, 79923, 89848, 130922, 144241, 115894, 75338, 76703, 80326, 53045, 53622, 93481, 83607, 43486, 48820, 61053, 65454, 48660, 61346, 70361, 58390, 60864, 69067, 43991, 26553, 40512, 47001]
14085D7001J7885p51o317J0722K0122l671n9039l1700J7867K6446J658l0243l1473
14072b1493l2301l0396r561l5551O50O2808O4323P0801M3711L1832K8523L2273
14060B05619L721k7935Q54m011j7921L0108L8200N169m0173k7044k0724J8584
14048A64447J6773k2276l531R925n1501k4851J1856j0056J3114K3130J2844K1876
14036A61750k7986P287J6458J537k3346R180O851j2877k052m58j5531q433K2222
14023A34602j2592j175L5713L0123L0828J3763K0898J3157J9271N0365M6738K4127
14011D05818l388m3472l5642j8674n597k2395k4508l5219m5468m8575j438L938
13999A25380r27p389Q65L8206L8316j760l5450J5010J4623j1615k3103j8417P515
$$ y = [47001, 64886, 64135, 57818, 68540, 88662, 84991, 25952, -5748, 12119, 38565, 40223, 9980, -21493, -53794, -84190, -93751, -129302, -128652, -65844, -1521, 69280, 112991, 144823, 173346, 205619, 209340, 181405, 182259, 178248, 160327, 190435, 228635, 233804, 193631, 166587, 145863, 164447, 181220, 158944, 155413, 165338, 113837, 88986, 100842, 90786, 103900, 127030, 139874, 161750, 133764, 141051, 157509, 159046, 135700, 144880, 151731, 138854, 136802, 136344, 120813, 112380, 134602, 122010, 120835, 156548, 186671, 217499, 231262, 252160, 265317, 284588, 334953, 381691, 405818, 402430, 358958, 323316, 304642, 299045, 276650, 252142, 216923, 171455, 122880, 121442, 125380, 124453, 117064, 117929, 156135, 194451, 192691, 157241, 172251, 186874, 175259, 152156, 133739, 141254]
13986A41254q991K9633P364O701j921P825k1140j3065J8312L2728K1229R374J7581
13973B46884M727O224J3551K6327L2695J9810j0294O629L6306N6845L7346M8774
13961E25824N0948O1435P6474J24809J80646K62154M24040N47570O88364Q02925
13951C745189P72301P06195M91083J69020j02248m15269o50675p77572q02844
13942C135180p19039n74644m09634k89992j89934j52078r2825o6890o8693n8284
13932E13167l5230l2284r827k4989j3583l5544k9159m6095k1919N118J4410j061
13920B83004K9878K3221J4381K750m4171l1294j3995r533j5409J5543P416k9164
13908B32627J841j3402j6754J1955l23J7086K3479L055J2809M3548K6983l5991
$$ y = [141254, 132263, 161896, 169260, 175961, 174040, 181865, 160725, 147660, 165972, 198700, 219929, 229303, 246884, 251611, 257835, 271386, 297713, 330408, 350218, 339924, 346553, 382859, 439704, 477050, 525824, 576772, 638207, 714681, 839490, 1020136, 1282290, 1706330, 2253900, 2942264, 3745189, 4517490, 5223685, 5714768, 5883788, 5781540, 5366271, 4715596, 3938024, 3135180, 2416141, 1841497, 1431863, 1141871, 951937, 799859, 707034, 640144, 571451, 513167, 477937, 445653, 435826, 410837, 397254, 361710, 332551, 286456, 264537, 269655, 284065, 283004, 312882, 336103, 350484, 353234, 309063, 277769, 263774, 254241, 238832, 254375, 261791, 232627, 234468, 221066, 204312, 216267, 215944, 233030, 256509, 259564, 272373, 315921, 342904, 306913]
13896C06913m6313L2175r08R999K7098P091p56o613J4873N9081O2396L7052q564
13883D93524M163M337l0449m0893j1584J920M367l1400k1998m930K0087J8508
13871D05652R868k4204J3112Q336K3476P905Q360J6653J0197J4627m552l73J4018
13858E03075k0882j0146j3641K5424M667k0900J033p58N3412K0644K4196K7311
13846E93435q640R629K9441L4287L8336J8147J607O602K6975J9045j2640J0679
13834G66903J3098K2129J6732M641J8450N4773L3959J0641L3351N7587K0945Q203
13822A061412J3873N5281M8990N0016O0557P0331Q2910P1551N2782M9964M1464
13811A659131L4120K9279K7741M1205R9572R4509Q7870P6049R7733J05981Q2972
$$ y = [306913, 260600, 292775, 291867, 301866, 328964, 336055, 335299, 328686, 343559, 402640, 465036, 502088, 493524, 497687, 502024, 471575, 430682, 419098, 421018, 425385, 393985, 371987, 367057, 387144, 405652, 415520, 391316, 404428, 412764, 436240, 444145, 452505, 469158, 479355, 493982, 489430, 489057, 503075, 482193, 472047, 458406, 483830, 488497, 467597, 468630, 467872, 521284, 541928, 566124, 593435, 584795, 594424, 623865, 658152, 696488, 714635, 716242, 722844, 749819, 768864, 756224, 766903, 780001, 802130, 818862, 823503, 841953, 896726, 930685, 941326, 974677, 1032264, 1053209, 1061412, 1075285, 1130566, 1179556, 1229572, 1290129, 1360460, 1443370, 1514921, 1567703, 1617667, 1659131, 1693251, 1722530, 1750271, 1791476, 1891048, 1985557, 2073427, 2149476, 2247209, 2353190, 2436162]
13800B436162J25903J59082J38223J66267J61564J73721J95851K25407K83349
13791D065529K87481L06653L29828L61881M24280N01145N61083O24598P43507
13782H205985Q00913R52472J189846J469166J797777K066238K279122K405214
13774B1166733K474973K449940K572044L057781L828173N076780P015411R942464
13766E7584299J4622665K1903728L1813259M2800118N2725774N6551324N1697909
13759C29699076L7822891J4208776j0656928l4588497n0931715n6628582n4656169
13752A74268852m5351534l4191397k3891734j5812475j0513408p198266n149039
13745C2160999l842569k994022k509808k267397k088682j979357j901549j759645
$$ y = [2436162, 2562065, 2721147, 2859370, 3025637, 3187201, 3360922, 3556773, 3782180, 4065529, 4353010, 4659663, 4989491, 5351372, 5775652, 6276797, 6837880, 7462478, 8205985, 9006898, 9959370, 11149216, 12618382, 14416159, 16482397, 18761519, 21166733, 23641706, 26091646, 28663690, 31721471, 35549644, 40626424, 47641835, 57584299, 72206964, 94110692, 125923951, 168724069, 221449843, 278001167, 329699076, 367521967, 381730743, 371073815, 336485318, 285553603, 228925021, 174268852, 128917318, 94725921, 70834187, 55021712, 44508304, 37310038, 32160999, 28318430, 25324408, 22814600, 20547203, 18458521, 16479164, 14577615, 12817970]
13737A2817970j562871j320166j078159q93028p00046n56025m66535m24768l91195
13728E425177l94280l61681k81958k61410k53757k36831k15616j80595j59293
13719C079756j55115j68404j71535j43332j10011j13121j19485p5575p3632o7734
13709A881812o7988m5411n4968p2289o7832j13924j35149p9882o8911k6954n560
13698A142944q883N636q48m9441m9981m3921n3374m1479p299j9517k2074q781
13686H42982l0209n3687l0543K1007Q4j0166j0700l3821j3607j8221j8442p294
13674F37383k3814j7677J5419p94j8038j7949j5956j5332j7252m3488K667k607
13662D82562o809j5702j9184o426r178k7870l0031l7189k3200K1279L6410j1297
$$ y = [12817970, 11255099, 9934933, 8856774, 7963746, 7263700, 6707675, 6241140, 5816372, 5425177, 5030897, 4669216, 4387258, 4125848, 3872091, 3635260, 3419644, 3239049, 3079756, 2924641, 2756237, 2584702, 2441370, 2331359, 2218238, 2098753, 2023178, 1949546, 1881812, 1813824, 1768413, 1713445, 1641156, 1573324, 1459400, 1324251, 1244369, 1175458, 1148504, 1142944, 1134061, 1139697, 1138849, 1089408, 1039427, 995506, 942132, 900653, 893354, 873837, 851763, 842982, 812773, 759086, 728543, 749550, 749634, 739468, 728768, 694947, 681340, 663119, 644677, 637383, 613569, 595892, 611311, 610517, 592479, 574530, 558574, 543242, 525990, 482502, 485169, 482562, 475753, 460051, 440867, 434441, 425263, 397393, 367362, 330173, 306973, 328252, 364662, 353365]
13650C53365j9617J391J1468l3841j7685o676Q894O142k2850R555p169j9162r85
13637B62830j1490l3606j8242K5686Q227J3424j1192l5575J3312R517m213L630
13625B22308O556J9987J4363J2353j6677p268m820M2997j7885l1968J7226J9044
13613B76216N709k1334L147m200l8704P952L2295p142j6664q988j5368k3185o071
13600A83663l8683j908n206K5126L3209M071j635P653K3688l842L9335M2807K8801
13587C37079k023m1276j8972j091N889j726m2277l881j8565n0530m5633m9774
13575F7220m719K6431l0093j8045j5615l1106K1911K1046J227J3769K7105J3696
13563I2827J4535M288n48l0593K3276J4841O226J6356L582j6803J959N379m300
$$ y = [353365, 333748, 335139, 346607, 312766, 295081, 288405, 297299, 303441, 280591, 290146, 282977, 263815, 262830, 251340, 217734, 199492, 225178, 233405, 246829, 235637, 200062, 213374, 222891, 218678, 222308, 228864, 248851, 263214, 275567, 258890, 251622, 246802, 289799, 271914, 239946, 257172, 276216, 281925, 260591, 263738, 259538, 220834, 228786, 261081, 253939, 237275, 228287, 212919, 189734, 183663, 144980, 143072, 137866, 162992, 196201, 200272, 198637, 206290, 229978, 226136, 265471, 308278, 337079, 335056, 293780, 274808, 273717, 279606, 277880, 235603, 231722, 213157, 162627, 116994, 67220, 62501, 88932, 58839, 40794, 25179, -5927, 15984, 37030, 38257, 52026, 79131, 92827, 107362, 111650, 111102, 80509, 103785, 118626, 124852, 141208, 144790, 127987, 129946, 135325, 131025]
13550A31025k056N905o834K1359j234k8452j2015l110Q417k4057R47K452J1129
13537A03476J9222q856j7777K1099q821l7316l3446J0513J8037k481J5662J9328
13525I8640Q74K6304P657l7841j1563m36L9068L2255n773q492l3523J3364K9142
13512A49676k6350n0309k8126j6425J5533J6094J2050j2820N528p221k3790q028
13500B5812Q008l814L971J560L9015q89n704j1820j6623R25k320n582M000K6833
13486F3372l211k7172k4496j4827K4521K1401k7677m012k7783O362K9664j8125
13474a983k5144L946M961K4099K2284K3755k686k9877k3211j8384n983J6565j1113
13461b2771k6167l354r399K1014O819k197L6058J8892p514M0239M7175L8617J6439
$$ y = [131025, 128969, 134874, 128040, 149399, 148165, 119713, 107698, 104588, 113005, 88948, 89895, 92347, 103476, 122698, 113842, 96065, 117164, 108343, 71027, 37581, 48094, 66131, 63650, 79312, 98640, 99514, 125818, 133475, 95634, 84071, 83635, 122703, 154958, 149185, 140693, 107170, 120534, 149676, 123326, 73017, 44891, 28466, 43999, 60093, 72143, 59323, 64851, 57630, 33840, 25812, 33820, 30006, 33977, 35537, 74552, 73663, 67959, 56139, 39516, 40441, 38121, 32539, 36539, 63372, 60161, 32989, 8493, -6334, 18187, 39588, 11911, 7899, -19884, -13522, 16142, -1983, -27127, -23181, -18220, 5879, 28163, 51918, 49232, 19355, -3856, -22240, -28223, -11658, -22771, -48938, -52292, -61691, -40677, -33858, -36055, 3, 18895, 11381, 51620, 98795, 137412, 153851]
13448A53851O504N317Q672j1982j6361k1770j3567P371M395j7423j4884J2206
13436A02329r578k2570L327j3009q672J2897K3643J027J5820j8429l1925K1495
13424G6355J0048J7276q947k6184n229j3796K4985j3122j2410J6849l9035N448
13412C2238L199j1879J2677j0395m504k946j3621K783N648K6124J2371R43R537
13399F2175j1401J4733L764o600n47j3512K23k2169N566r888J6960J0812k3224
13386B6892j3609J0061q110o638J1964o443J9800L7188l7720k1875Q921J1406
13374C1837J0039j3643k3336k328l4280l412N5687M0650p596j4216M180J0789
13362E4371K5201p545j0732j0196l04j8181j5497l383K3909K1957K3882M169L063
$$ y = [153851, 160355, 165672, 174344, 162362, 146001, 124231, 110664, 118035, 122430, 105007, 90123, 102329, 92751, 70181, 73508, 60499, 51827, 64724, 88367, 89394, 105214, 86785, 54860, 76355, 86403, 103679, 94732, 68548, 63319, 49523, 74508, 61386, 48976, 65825, 26790, 32238, 35437, 23558, 36235, 25840, 21336, 18390, 4769, 7552, 13200, 39324, 51695, 52638, 62175, 50774, 65507, 69271, 62671, 62124, 48612, 48835, 26666, 32232, 22344, 39304, 50116, 26892, 13283, 23344, 15234, 8596, 20560, 14117, 33917, 71105, 33385, 11510, 20431, 31837, 41876, 28233, 4897, 2569, -31711, -35123, 20564, 61214, 53618, 39402, 43582, 54371, 79572, 72027, 61295, 51099, 50795, 32614, 17117, 13734, 37643, 59600, 83482, 87651, 90714]
13349I0714L472k8905k8028J1525Q7j8090J3949L261l2430k4933n723K2887J3699
13336B1485J3324K2921O954j6195R125l940J1641r217R421O72j5617j1314J7433
13323E6693j9989l0697R060K0454o491r119R066J4658J472j0720j2381M162q108
13310A8060K7725j8307Q042l453l417m395R467j2968j8379K9542N422k5834O059
13297A7564o652K1394j316l275j086P674N353J1179j3662L5990L3666J6047J3712
13284A36588l275l716K4291N9604M7158M0527R6094J34547J61575K08704K77286
13273A179383L13779K82849K32882P1111p6824j86983k90701k90370k94785k00605
13263G39736j59142j78269j17214o0311l9757n605k8120J0110l7126L957q002
$$ y = [90714, 94186, 65281, 37253, 48778, 48865, 30775, 44724, 47985, 15555, -9378, -15101, 7786, 21485, 34809, 57730, 64684, 48489, 57614, 53674, 65315, 56098, 65519, 66191, 50574, 39260, 56693, 36704, 6007, 15067, 35521, 29030, 19911, 28977, 43635, 45107, 34387, 22006, 26168, 18060, 45785, 27478, 35520, 32067, 28650, 24255, 33722, 20754, 2375, 31917, 37339, 11505, 17564, 10912, 32306, 30990, 27715, 26629, 34303, 39656, 50835, 37173, 73163, 106829, 122876, 136588, 133313, 129597, 153888, 213492, 260650, 301177, 397271, 531818, 693393, 902097, 1179383, 1493162, 1776011, 2008893, 2080004, 2003180, 1816197, 1525496, 1235126, 940341, 739736, 580594, 402325, 285111, 224800, 185043, 179438, 151318, 161428, 124302, 128259, 120257]
13252A20257m8618j8869J2795R216j6494M751M012k8227l6672M1548J8506K428
13240F4633Q989m590k1629l8950n353q869K7506P694j7692j6585J1970L306k7229
13227a6799M186J8702J6114k2496q878J0414J6939m854N451K5180j297R710m419
13214D7953O552m550j5486k0451m281K614k6332k4212M3557m632m377J7426L3149
13201D6930K6955J2621p334n4L331n685m9413L483p697j2621J077K7970j5640
13188B3923j4577P64j1903J2037K9677o486j6872m3376n748J3369p8J6321N621
13175B672r136K1288L2736j4447m0637j5189K2555N432P149j8009k0846r574L9318
13162C312K3739k130r681j1501K2900K2995J2865K4833N6276K0935L4253J8377
$$ y = [120257, 71639, 52770, 65565, 74781, 58287, 63038, 67050, 38823, 2151, 43699, 62205, 64633, 73622, 69032, 47403, 8453, 3100, -5769, 21737, 29431, 11739, -4846, 7124, 10430, -16799, -12613, 6089, 22203, -293, -9171, 1243, 18182, 13328, 18779, 43959, 42662, 52372, 47953, 54505, 49955, 34469, 14018, 9737, 12351, -13981, -38193, 5364, 732, -3645, 13781, 46930, 73885, 86506, 79172, 79118, 82449, 76764, 27351, 30834, 23137, 10516, 11593, 39563, 23923, 9346, 10110, -1793, 10244, 39921, 33435, 16563, -26813, -32561, -19192, -19270, -2949, 2672, -6464, 14824, 47560, 33113, -7524, -22713, -158, 5274, 12423, -5586, -26432, -36006, 3312, 27051, 24921, 15240, 3739, 26639, 49634, 62499, 87332, 143608, 164543, 198796, 217173]
13150B17173l7358j8734l0814k6811o326j7466k2346n6862o124j5061p055K4651
13138c133K2194J281n5759o920M7249K3865J5451N144j7196p165j383J5970J805
13125D1403j5475q561j9177l642J6051J1563m405k3919m726j3461L8544L7035
13113E1230j9688l612J5693J5896K6877M2467K6140K9903k0494k6744l7114j7087
13101H3467j4689k7734j1800j9027j3756o403J5526K3119Q388q585j7425k8580
13089a7499j6639R96J8163J0764J1935l61K091k4556l136j3457Q421j963j4715
13076c9956J7843N5661j5698j533M173O726J3226j1989j6957P793K1770k1356
13064A9703o735L3587M0639K6833N343m390m9544m5661Q553M8048k6219m8062
$$ y = [217173, 179815, 161081, 130267, 103456, 97130, 79664, 57318, 456, -5668, -20729, -27784, -3133, 19061, 20342, -35417, -42337, 4912, 28777, 44228, 49372, 32176, 25011, 23628, 39598, 41403, 25928, 17367, -1810, -5452, 10599, 22162, 17757, -6162, -10888, -24349, 14195, 51230, 31542, 27930, 43623, 59519, 86396, 128863, 155003, 184906, 164412, 137668, 100554, 83467, 68778, 41044, 29244, 10217, -3539, -9942, 5584, 28703, 37091, 28506, 11081, -17499, -34138, -33142, -14979, -4215, 7720, 7359, 9450, -15106, -18242, -31699, -23278, -25241, -39956, -22113, 33548, 17850, 16317, 20490, 27216, 40442, 28453, 11496, 19289, 41059, 19703, 12968, 46555, 87194, 114027, 119370, 114980, 65436, 19775, 28328, 76376, 50157, 2095]
13052B095o477K494K0743J5483k1085R745J8334P502R121p641l899N869k6325
13039B5959k0822K803l229L501J6584K439L820L187m252j0724k263J3966j7j4809
13025A6143k2031k3657l791J7795K8231o8j6652j260L125L7652j8049k8850R159
13012b253L9889k401l1361k6635j5575K2683L1038J9064j9638j7728l433K2075
13000A5725J2271rl2056j6793L1196L6016m169j7220l6909j7417J3890K1259K1155
12987B6939J8580l075j0143l6791j366j1002j9797r199J3132J8427j1829J0007
12975a6117Q146j2356L2621p732L722j0821N678J4837q789N358j1592j3653m495
12962a5193J5256J8679r918m273L0683Q449k7578R268K1661M4283R520k3707o369
$$ y = [2095, -4382, -1888, 18855, 34338, 13253, 22998, 41332, 48834, 57955, 50314, 46415, 52284, 25959, 5137, 7940, 4711, 8212, 24796, 27235, 31055, 34242, 29990, 19266, 17003, 30969, 30952, 16143, -5888, -29545, -33336, -15541, 12690, 12622, -4030, -5290, -2165, 35487, 17438, -11412, -2253, 37636, 35235, 3874, -22761, -38336, -15653, 15385, 34449, 14811, -2917, -6350, 15725, 27996, 27987, -4069, -20862, 10334, 46350, 42181, 24961, -11948, -29365, -15475, 5784, 26939, 45519, 42444, 32301, -4490, -5856, -16858, -36655, -45854, -32722, -14295, -26124, -16117, -7971, -20327, 12294, 4562, 8284, -2537, 3141, 17978, 9189, 14547, 2955, -10698, -15193, 63, 18742, 8824, 4551, 35234, 43683, 16105, 25373, 47034, 91317, 100837, 77130, 70761]
12949G0761k3604P934P112j1323m2374j5130K8352L1558P921l034J5283J227k0460
12936E4223j7663j824K5954N1459R751j5209k3791j9795L3829L0627k5169K833
12924A05225j2238L003M7m764K468K0072L4089M689N870R531o373l4282k8180
12911I9157J6502J9198K0840N294k8425j5316L76n887q007o291J2383l6024K221
12898G6021L1852J8593p590j280k5716k523J341J2238m673l9226l7787J2957M2102
12885G6309L703q233N567j0741q059j5836O45J7229n472j4151j3800l377R357
12872C3141P888R002m789o941L1513j0288j5882m818n876l2515l2387j979J9322
12859a4609K1073j4300m1469J3288L9763m463K2072J4272k1976k3369M3708p386
$$ y = [70761, 47157, 55091, 62203, 50880, 8506, -6624, 21728, 53286, 61207, 58173, 73456, 74683, 54223, 36560, 34736, 60690, 112149, 121900, 106691, 82900, 63105, 96934, 127561, 102392, 105225, 92987, 95990, 96037, 91273, 93741, 113813, 147902, 152591, 158461, 167992, 161619, 127337, 99157, 115659, 134857, 155697, 160991, 132566, 117250, 117626, 111739, 103732, 97441, 109824, 73800, 76021, 107873, 126466, 118876, 117596, 91880, 89357, 90698, 102936, 98263, 59037, 21250, 34207, 76309, 80012, 71779, 77346, 66605, 58546, 42710, 43355, 60584, 55112, 40961, 27161, 23784, 33141, 41029, 50031, 45242, 38301, 69814, 59526, 43644, 38826, 32950, 435, -31952, -33931, -14609, 6464, -7836, -49305, -36017, 3746, -717, 21355, 35627, 13651, -9718, 33990, 26604]
12847B6604n284j0098j6135J8277J0092J2970L565k5934K720K5610k3057j1153
12835H177l531J3097L1067k2481L563J5653Q814j3442J9471o164j8814k5100n607
12822D703L188M477M333R344J4227K1078j3533k2823j0678j0893K895J2590j6483
12809B425q826R415j0890J5670m374k9790J092J4980J3561R603J2370o404N491
12796B4323N650l092j8114j0212J1351l11J3506l063K2479k3608p339p940k7379
12783b3749j3056P689K9038j1795j972J6190K9612j4966L6528L8198k4581j3483
12771E3653m3435j8113J9553P346j5511q9N166j2545k363j407J9016j6912j8035
12758b3676j5421J3694M724j3713j0997K7422j2501k0020L2622J7363J2368r431
$$ y = [26604, 21320, 11222, -4913, 13364, 23456, 36426, 39991, 14057, 16777, 42387, 19330, 8177, 4646, 17743, 48810, 26329, 29892, 45545, 54359, 40917, 60388, 54224, 35410, 10310, 4703, 7891, 12368, 16701, 26045, 40272, 61350, 47817, 24994, 14316, 3423, 6318, 18908, 2425, -6401, 3014, -7876, 7794, 3420, -26370, -25278, -10298, 3263, 12866, 25236, 18832, 24323, 29973, 26881, 8767, -1445, 9906, 9595, 23101, 20038, 42517, 18909, 11570, 3630, -23749, -36805, -29116, -78, -11873, -13845, 2345, 31957, 16991, 53519, 91717, 67136, 53653, 10218, -7895, 11658, 19004, 3493, 3404, 8570, -3975, -6338, -7745, 11271, -5641, -23676, -39097, -25403, -20679, -34392, -45389, -17967, -30468, -50488, -17866, -503, 11865, 2434]
12746B434n735j324K0554J6102o118q413o918K645J5745J3967n389p034q114k6932
12732d530j032j4968J5560K2486J010k7320j5534Q008M1301J9220k9949k5391
12720a1139j8878j432j5981j8441N232K1272J7520O594q904r304j0213J941j2224
12707e3957Q787M6421J0880m947Q143j5984k2559J7787P194K0566K8214l654J1503
12694E8394M895l4639k4561Q17J7132l839j932J7820o161k1697m3084J8115J5236
12681c504K2168J4387m518J333N429l1993k2210k5158P024M1572K972j4151j2016
12668a8665m609R947j3165k2061l567J3634K6849m690J0500M8669J0983n0212
12656C613k5876L1561K5523L560j1306l8027o590L0482L0855N880l2075l427R627
$$ y = [2434, -3301, -4625, 15929, 32031, 25913, 17500, 10582, 13227, 28972, 42939, 37550, 30516, 22402, -4530, -5562, -20530, -4970, 17516, 18526, -8794, -24328, -16320, 24981, 44201, 14252, -11139, -30017, -31449, -47430, -65871, -60639, -39367, -21847, -15253, -24157, -33461, -43674, -41733, -53957, -45170, 1251, 12131, 7184, 15327, -657, -23216, -5429, 1765, 22331, 50545, 46891, 58394, 63289, 28650, 4089, 4906, 22038, 18199, 16267, 34087, 27926, 6229, -36855, -18740, -3504, 18664, 33051, 28533, 29866, 35295, 3302, -18908, -44066, -37042, 4530, 7502, -6649, -18665, -23274, -13327, -26492, -48553, -52120, -38486, -11637, -16327, -5827, 42842, 53825, 3613, -22263, 9298, 34821, 38381, 27075, -10952, -17542, 12940, 43795, 49675, 17600, 14173, 23800]
12643B3800k804k6315j3117L757m371Q726j9495J953K1756Q877M111j3747j598
12630h467K8142p586k5210j187N2j3778p687j64j5960P477J8599K4688J1855j9578
12616h804j4804O132J8134J689K7201M945m8744L84l935J0992j4674r144j5654
12603d6282L6412K1208m663J5191L5628J6159l1197k1344P083J799o489o293k1669
12590d457l1012R11Q054J1825J440L6485o092r216j1462k4900j2632J2189J8226
12577a0641L03J4543J5498j9912k9787J8370L0326K1465l1298k3007Q966P707
12565B533k3217J8695L0068r141j4771q147j515k9644k4495j306K8506J0461J6658
12552e315N144K5944K3880L6444k0962k116k5405l9366j1832N53R242j6487N504
$$ y = [23800, 20996, -5319, -18436, -14679, -19050, -10324, -29819, -27866, -6110, 2767, 6878, -6869, -8467, 19675, 12089, -13121, -14308, -14256, -28034, -35721, -35885, -51845, -44368, -25769, -1081, 10774, -8804, -23608, -17476, 658, 2347, 29548, 34493, -14251, -13867, -17802, -6810, -21484, -30628, -46282, -9870, 11338, 6675, 21866, 57494, 73653, 42456, 21112, 28195, 29994, 23505, 17212, -4457, -35469, -34558, -26504, -14679, -13239, 23246, 17154, 7938, -3524, -28424, -41056, -28867, -10641, -10338, 4205, 19703, -209, -29996, -11626, 18700, 40165, 8867, -14140, -5174, 2533, -20684, -1989, 28079, 18938, 4167, -3980, -5495, -35139, -59634, -60940, -32434, -21973, -5315, -171, 25773, 49653, 86097, 65135, 63019, 37614, -1752, -13584, -13031, -3789, -20276, -14772]
12539a4772j348q404J4754J837j0179J2062j769n3355l5016P409J8726L4688J1127
12526b4240P192J4929Q446J557j330l562j0175j9258m049m193K6532K2162J1804
12513B5815m663m775j1091N861r436l0397j984k6741j5467Q10R16J3212K0391
12500c7549K6339R435j6674J0505j6641p821j8101l833K5789K1921n411L220N804
12487c017J0517k3169j5472P46L1352M5389K8m5285k0738K6627J1222l1861n748
12474a9409K7147K3555j555j0784j1971j4487j6265p502J596J2094J2264j2044
12462a7361K9681J0747r84o028j9830q922n274R76J9241J1066R38m80l1152P837
12448i545K784L11j3928l986L2024P457j0257Q547P225l0957k4598J8219M63Q226
$$ y = [-14772, -16120, -24524, -9770, -7933, -18112, -6050, -7819, -61174, -96190, -88781, -70055, -35367, -24240, -17048, -2119, 6327, 7884, 6554, 2992, -7183, -26441, -30490, -34683, -8151, 14011, 25815, 21152, 16377, 5286, 11147, 1711, -28686, -30670, -57411, -72878, -72068, -71152, -57940, -37549, -11210, -1775, -18449, -7944, -24585, -32406, -50507, -54340, -28551, -6630, -12041, -8821, -3017, 7500, -15669, -31141, -30395, 957, 46346, 46374, 1089, -19649, 6978, 18200, -13661, -19409, 7738, 31293, 29738, 18954, 6983, -7504, -23769, -31271, -29675, -17581, -5317, -17361, 12320, 23067, 22083, 16055, -3775, -12697, -17971, -16995, 2246, 13312, 14250, 13770, -17382, -9545, -6761, -6450, -20378, -24364, 7660, 15117, 4860, 13407, 20632, -10325, -34923, -16704, -16241, -8015]
12434h015N159l4680P831K2595K2504j3388j5995l180K70L718Q84j2028J865j3160
12420c5620m572P4J3898K8133j298l3702J7118L0673K3429l2013k0596P270l078
12407a0284j6131J0155K7663j6517j5305o632n578r120O666M0834L6390k9139
12395A3002k7560j0464j3207n093j575n827L8311L3087k747L0876J0580k7178
12383C2205n0859k2063m080J4175j0030L311J0409j2174j3234Q399P693J7112
12371a9136q330j554n694k440K1703O4252J872l8209k8206p013J0230j1030j1992
12358c5547J4316K207P455J2019p924j2196K3984N442J2973k0955j4240m298M097
12345a2667j8311O839J3737K2986L252l1740l6863K1596K8889j1600m1302n86
$$ y = [-8015, -2856, -37536, -29705, -7110, 15394, 2006, -13989, -17169, -16899, -13181, -12297, -24325, -22460, -35620, -40192, -40118, -26220, 1913, 615, -33087, -15969, 14704, 38133, 6120, -14476, -7206, -10284, -26415, -16260, 11403, -5114, -20419, -27051, -32629, -41749, -35083, 5751, 42141, 13002, -14558, -25022, -38229, -43322, -44897, -50724, -12413, 20674, 17927, 48803, 59383, 32205, -18654, -40717, -44797, -30622, -40652, -37341, -26932, -39106, -52340, -43941, -36248, -19136, -27466, -29020, -34714, -37154, -15451, 48801, 50673, 12464, -15742, -22755, -12525, -23555, -35547, -21231, -19024, -11569, 450, -7474, -19670, 4314, 9756, 22729, 1774, -12466, -16764, -12667, -30978, -24139, -10402, 12584, 15836, -15904, -52767, -31171, -2282, -13882, -55184, -55770]
12333e5770J2338K6600Q893J039n827q039K5629K3142K1114L8370l2798j5449
12321C9242m872k8814k6141j011j1655J7053K2893R583m123p645k559m743m762
12308g554J94K0295n638j431J6286j1001j1102k663k7381k8814j0749J4431O3935
12295H808J5382k6693j2000j0124k944K1254J5371j2656j0409k667P129J3080
12283C531P56j6836m2074j218J8301O217O366j7958p529J7460o643l317J4131
12270b8813j4390P7J5533r89o658K1612K6461k2533k9673k0885J6278M2289j1490
12257a3181j4992K6939K3139L329j5069P381K762k4187N25k8225k6492k29J2898
12244d5402K2963L4688k264o806N986K0428J3369j2272j3678j4151o342P953j4145
$$ y = [-55770, -43432, -16832, -7939, -6900, -12727, -20766, 4863, 28005, 49119, 87489, 54691, 39242, 34370, 5556, -20585, -21596, -33251, -16198, 6695, 16278, 12155, 4510, 1951, -2792, -7554, -7360, 12935, 7297, 5866, 22152, 11151, 49, -2614, -29995, -58809, -69558, -55127, 8808, 24190, -2503, -14503, -24627, -27571, -6317, 9054, -3602, -14011, -16678, -9549, 3531, 4287, -12549, -54623, -55841, -37540, -31323, -24957, -42915, -50444, -32984, -39627, -42944, -28813, -43203, -43126, -27593, -28582, -35240, -13628, 12833, -9700, -39373, -60258, -43980, -1691, -13181, -28173, -1234, 21905, 25234, 10165, 17546, 20308, -3879, -3354, -31579, -58071, -58300, -45402, -22439, 12249, 9985, 3179, 9165, 29593, 42962, 30690, 17012, 2861, -3481, 4472, -9673]
12231i673O575L468J2808R767o390k4770J0289j3826l866m08L7780j1236N35K8833
12217C9886j1720l7200n533J2415j8548j9559N879J7867L740J0122J5106j213
12205A1242K542j3632l5416J243Q445q690J1301J6325j0755N111j1305N22K6807
12192C740J9666K5529n052k1359j1433r398l0853q827O503J0818p584J0240K6890
12179H880Q636p71o505K0563J5974j5150k7497K1134R603r456j2442K5792m979
12166C3782l3275j5135Q190Q659k7242J1103K6589L3378j7305r793l889j8014
12154b952j772J2216K1820j0112j7573k3303J8209j015p429J8365j6073k085M018
12141g686J319J3146m114n481J8826M414J0247l985j7431O156J9658j1905q437
$$ y = [-9673, -3098, 370, 13178, 22945, 16555, -8215, 2074, -11752, -15618, -16026, 21754, 10518, 11053, 39886, 28166, -9034, -14567, -2152, -20700, -40259, -34380, -16513, -12773, -2651, 12455, 11242, 13784, 152, -35264, -34021, -25576, -34266, -22965, -6640, -17395, -12284, -23589, -23067, 3740, 23406, 48935, 43883, 22524, 11091, 1693, -29160, -37987, -31484, -20666, -28250, -18010, 8880, 17516, 16745, 10240, 30803, 46777, 31627, 4130, 25264, 34867, 25411, 12969, 38761, 33782, 507, -14628, -6438, 2221, -25021, -13918, 12671, 46049, 28744, 18951, 15062, -2952, -4724, 7492, 29312, 19200, 1627, -21676, -3467, -4482, -11911, 6454, -9619, -11704, -7686, -6367, 6779, 2665, -2816, 16010, 20424, 30671, 26686, 9255, 15411, 35069, 23164, 14727]
12128A4727n777J2695j8036k2499j551L3589K447r735j1901j9254L5807k0430
12116i918l2593j245R009r37J6689J163J0285j493j2076L4772K4551Q040J1860
12103E8107j8084R657q60k9658j0850j547L821m679j4027O971K3496P811L2721
12090F2879j2884l2434m1414m65j3942j0125K8127L9954j3817j8201j6952j6992
12078d6266K2382N5707j0872J846p577j976j3943l496k7355k706m045J5857n98
12065b3042o748J0073L431j2614j7590J6546M67n457k09j5324M2303K2386J1605
12052B5827n189j5790n716L5373J9957j4915q851k8665j9549o003n525K576L8651
12039A2181O8017J5147l4339l8365L352k8359j6466M176M358J4820K5903n976
$$ y = [14727, 8950, 21645, 3609, -18890, -20441, 13148, 15595, 5860, -6041, -25295, 10512, -9918, -42511, -43756, -34747, -35684, -18995, -17832, -7547, -9040, -21116, 13656, 38207, 46247, 58107, 40023, 49680, 48820, 19162, 8312, 6765, 10586, 5907, -8120, -1149, 22347, 30158, 62879, 49995, 17561, -23853, -24318, -38260, -48385, -20258, 19696, 5879, -12322, -29274, -46266, -23884, 31823, 20951, 22797, 15220, 13244, -699, -4195, -31550, -34256, -38301, -22444, -23042, -29790, -19717, -16286, -28900, -46490, -29944, -29477, -34934, -35143, -50467, -8164, 14222, 25827, 20638, 4848, -868, 34505, 54462, 39547, 30696, 2031, -17518, -23521, -29046, -26470, 12181, 80198, 95345, 61006, 22641, 25993, -2366, -18832, -14656, -10298, 4522, 30425, 24449]
12027B4449n852j1380j7279K976R363O1n589J0528K0653L4131R49m1207j6458
12014E345L1583k0299k9041r195J491j2306k4092J5639o499j6266J2224M8183
12002c233J5008O094K2503q342m2174J4401J3185k5482J4541r56j3205m6514k5221
11989g9395N651M2188N9118J737O553o226M518j6278l2549J6213J7741j6084l1284
11976b8097j5519M5946L743r734k3543P955q528M4214N663k2892l9623j1817L6627
11963a5605k49k9580L5K3324L1378l250l574j4969o734K6474j037l8034k706Q757
11949b5770J8j1795m28J7371K289J1192q069l1827K6887L3648j3912j7987j0304
11936b8687j8192J5896J0536L8324J3969k3575k4357N81j4559k3517N1180N2634
$$ y = [24449, 18597, 7217, -10062, -7086, 2277, 2338, -3251, 7277, 27930, 62061, 63010, 21803, 5345, 36928, 16629, -12412, -21607, -20116, -32422, -56514, -40875, -47374, -63640, -51416, -3233, 11775, 17869, 40372, 32030, -10144, 4257, 17442, -8040, 6501, 5545, -7660, -54174, -79395, -73744, -31556, 27562, 29299, 35852, 29626, 34144, 17866, -14683, 1530, 19271, 3187, -28097, -43616, 2330, 6073, -3661, -27204, -19249, -27777, 16437, 22100, -792, -40415, -52232, -15605, -15854, -45434, -45399, -22075, 9303, 6053, 2479, -12490, -19224, 7250, 6213, -31821, -34527, -25770, -25752, -37547, -37975, -20604, -18315, -7123, -15192, -47019, -20132, 13516, -396, -18383, -28687, -46879, -30983, -20447, 17877, 31846, 8271, -16086, -15505, -30064, -53581, -2401, 50233]
11924E0233l253k8670J8847K4752j0988J6892k1036k0026J361j4882o645n887
11912F98j0257k4499q494N208J4270M258J4272L5676Q042N31l869l4691n892K594
11898b153J4509l5451J1465K254J4622J7193j1604k0578L3k270J1331N926N45
11885E822j726n590q268K7897J612k1964K713J9019q164l2650J2728p125J4291
11872a405P110j4345j783k7154L2370K9839J4814j0081l0054j2840J9263K982
11860H716J3538J73l1671n2090r787O0087P798N099J756l157n212j0241l0750
11847d5741k383M471J5245m35N992J0392J642J0443m277q903N886R947p382J4750
11833I647L270K718o707J8033o447j6619k5917k5274J635l952k94j633K9623J9583
$$ y = [50233, 46980, 18310, 37157, 61909, 50921, 67813, 46777, 26751, 28112, 13230, 6585, 698, -9559, -34058, -42552, -37344, -23074, -18816, -4544, 31132, 39174, 39705, 35836, 1145, -4747, -2153, 12356, -23095, -11630, -9376, 5246, 22439, 10835, -9743, -9710, -11980, -649, 5277, 5822, 4096, -1494, -9762, 18135, 19747, -2217, 496, 19515, 11351, -21299, -8571, -15696, -1405, 5705, -8640, -10423, -37577, -5207, 24632, 39446, 29365, -689, -13529, 5734, 8716, 22254, 22427, -9244, -61334, -71121, -11034, -3236, 1863, 3619, 462, -4750, -14991, -45741, -48124, -43653, -28408, -28843, -22851, -12459, -10817, -374, -4651, -13554, -7668, 2279, -5103, 9647, 12917, 15635, 8928, 26961, 20514, 3895, -22022, -47296, -45661, -49613, -49907, -51540, -21917, -2334]
11819b334o365K2230K2289o382l840m2516o953J9637J4245q506N959O184k6706
11806a3058j3220N608J3469P155p288k7245l771K9197N520N325J538J049K51j1003
11792f473k263R494K45j008j946J1515K2931l2570o747J5849j7827j975M523q27
11778g079n37J1589J0429j5334k8409j9630R866J315K3413L0521p032L3000k4582
11765A7530l6791K9873j3529j9572l2722l1914L0206K8597J1383J6241o773r136
11753a6607j6529J3824Q119o217j5266k796J7017J4923J4958k2296K892M765p67
11740c980j4984m612J8252P496l0312k1759l2013n175j2723K4271L3520K1635
11728b0384k2855J7977J5771k3197n931N282J9924J9268R296r292j4874R179j7273
$$ y = [-2334, -8699, 13531, 35820, 29438, 25598, -16918, -23871, -4234, 10011, 1505, 7464, 13648, -13058, -26278, -20670, -7201, -46, -7334, -34579, -38350, -9153, -3633, 1692, 3230, 4279, 4530, -6473, -8736, 758, 1003, -5, -1951, 9564, 32495, -75, -6822, 9027, -8800, -10775, -6252, -7079, -7616, 3973, 14402, -932, -29341, -48971, -39105, -37790, -14377, 16144, 9112, 42112, 17530, -19261, 10612, -2917, -22489, -55211, -87125, -56919, -28322, -16939, -698, -7471, -16607, -33136, -19312, -11193, -17410, -32676, -35472, -18455, -3532, 11426, -10870, -7978, -3213, -3980, -18964, -23576, -5324, 2172, -28140, -49899, -81912, -87087, -99810, -75539, -42019, -20384, -43239, -25262, -9491, -32688, -38619, -33337, -13413, 5855, 15151, 5859, -9015, 164, -17109]
11715a7109P692K2813j4497J3721K3589k8874m80L2928J9738K3700l8103m6827
11703a709j6330k2088K3053O696N909M220J1824J1628j7832n054q533j3010k194
11690b3420K7236l960j4952j1549j0139R855J687p370N370J9001K3136J9296k524
11677C1667J133m131l0858k7638R566J4100q386j945N975k3642N288K5838k752
11664e785J871M935r794m1889j3911J8645n36q600J4657K3175M461j1818N399
11651a9190l638l2165L711J6791L3535K1765j2924M405J0125K71J4241K731m7520
11638g862j0939k783j0101j6337k3367j9459K7612o204J0054L1110M2315n266
11626H773k0322r616L1789k311P13j4003J1263K5602j8758o4518q926K7481j314
$$ y = [-17109, -9417, 13396, -1101, 12620, 36209, 7335, 6855, 39783, 59521, 83221, 45118, -1709, -18039, -40127, -17074, -10378, -4469, -249, 11575, 23203, 5371, 317, -8216, -21226, -23420, 3816, -144, -15096, -26645, -36784, -26929, -25242, -32612, -27242, -8241, 14895, 34191, 31667, 32800, 28669, -2189, -29827, -20261, -6161, -14547, -16492, -10517, -34159, -28871, -3033, -5785, -3914, 1021, -8773, -50662, -64573, -45928, -46464, -55064, -40407, -17232, -12771, -24589, -19190, -22828, -54993, -51282, -34491, -956, 20809, 7885, 12290, 22415, 22686, 36927, 39658, -7862, -18801, -21584, -31685, -48022, -71389, -90848, -63236, -69440, -59386, -28276, 14039, 8773, -11549, -21165, 10624, 8313, 9026, -4977, 6286, 31888, 13130, -51388, -60314, -32833, -34147]
11613c4147N987L688j6749J9547n258J7094N0160J2353k5012l2032J1323k0557
11601a3603J2980J7491l2643j0950J9206n129j3912m676J2028P624j6770J4572
11589a3782L212j5194Q656K3422j2958N48j13L1887j4263k9189M91l574J1116
11576i741K7045P942l9678q067o336k619k3941J6714L59J8221J8988J7627j2636
11563C878J1169K2238J6941j5603k1318m716K4350J4899k6226p908R628o076L546
11550B4802l873j2323M035j1465k7010R394n233J8193J1504L57O118l0909m4492
11537f0902M2509q512L948J6173l4j8641k2184j3524J3761O7507Q674k6771Q374
11524A0378L452N965p266k2406l3901J1810L9252J8274q540N293L879j6639k0782
$$ y = [-34147, -28160, -24472, -41221, -21674, -26932, -9838, 40322, 52675, 27663, -4369, 6954, -13603, -623, 16868, -15775, -26725, -7519, -12648, -26560, -31236, -19208, -11584, -28354, -13782, -10570, -25764, -17108, 6314, -6644, -6096, -6209, 25678, 11415, -17774, -17283, -20857, -9741, 17304, 25246, -14432, -22499, -28835, -31454, -55395, -38681, -38322, -20101, -1113, 16514, 3878, 15047, 37285, 54226, 38623, 17305, 12589, 36939, 51838, 25612, 17704, 27332, 21256, 24802, 20929, 8606, 12641, 1176, -25834, -16440, -21673, -3480, 8024, 8381, 14499, -16410, -60902, -18393, -26905, -22957, -6784, -6818, -25459, -47643, -61167, -47406, 20101, 28775, 2004, 10378, 13830, 19795, 12529, -9877, -43778, -31968, 7284, 25558, 17018, 22311, 26190, 9551, -11231]
11511a1231k0583K6360J0750l075r781k4931k5154J5359K5221j1359j1165K4851
11499a4738J5718k244J5798m494m519N947N12K685o16J2355m404q162J054m646
11485A0246n7163j3851K2336L1776J6316K6211j212k6445J2495m686r396N298
11473A1925m549m529J2779j5028j4427K751J5737N177k3539n210J2290K7219m695
11460A5901p559J5784K4396j2486j5307k4241J2597j886J0008j6342k1821J3588
11448g368K112k3696j3569L3779K8826j7761k2518j6735K1025p469k4434k1364
11436f9172J9336J7058L8588k8056k1124K9989J168L0348j1535J0084r842K7802
11424C4644o574l830J2732J069o199o726J4884l2043l0081l5237k453K3411k0902
$$ y = [-11231, -31814, -5454, 5296, 2221, -7560, -32491, -57645, -42286, -17065, -28424, -39589, -14738, 980, -1264, 14534, 10040, 5521, 11468, 11980, 14665, 14049, 26404, 22000, 13838, 14892, 10246, -46917, -60768, -38432, -6656, 9660, 35871, 34659, 8214, 20709, 16023, 6627, 11925, 7376, 2847, 15626, 598, -13829, -11078, 4659, 9836, -13703, -18913, -6623, 20596, 15901, 8342, 24126, 48522, 36036, 20729, -3512, 9085, 7199, 17207, 865, -20956, -7368, -5256, -28952, -42521, -8742, 20084, 2323, -20195, -36930, -15905, -23374, -47808, -69172, -49836, -32778, 5810, -22246, -43370, -13381, -12213, 18135, 6600, 16684, 6842, 34644, 28070, 24240, 36972, 38041, 31842, 25116, 40000, 7957, -22124, -57361, -59814, -36403, -57305]
11411e7305j483L3847J9236J6589R91r715M174Q821O006J4707M769l840k8693
11398H104k4294j6572q285J365k564J8202K7333k5316j0715j3861q867K3406L3365
11385A301J5744R165L4J3971o989R853q743j0440r085J793K745J3966k2953j5776
11371e414L0723j2076j2007M80j6595p451J606M259J5648j546P477Q480j2390
11358A194j7144K54k183K1511J2589k2529j902l535N038p053j0650k2555O695
11345d0270K8674J1641j5566J4201K1418R450l0941j5245J2984L7004k2251m6261
11333c5162N574k853m815J9017o112p645j0200Q82J0801L2523J4044j329j0887
11320C838m936k003J4513m7780R584K5757J0014k5181J7194J9522n041k027j0634
$$ y = [-57305, -58788, -24941, -5705, 10884, 11875, 2160, 6334, 15155, 21161, 35868, 40637, 36797, 8104, -16190, -32762, -41047, -39682, -42246, -24044, 3289, -22027, -32742, -46603, -55470, -32064, 1301, 17045, 26210, 26244, 40215, 33226, 43079, 34336, 23896, 14811, 16604, 19349, 33315, 10362, -5414, 25309, 13233, 1226, 1706, -14889, -22340, -20734, -16475, -827, -2373, 5104, 13584, 1194, -15950, -15696, -17879, 3632, 16221, -6308, -8210, -11745, -6707, -13760, -24410, -46965, -40270, -11596, 45, -15521, -1320, 20098, 29548, -1393, -16638, -3654, 33350, 11099, -35162, -29588, -32441, -37256, -18239, -24351, -31996, -42196, -41314, -30513, 2010, 16054, 14725, 3838, -1098, -3101, 11412, -36368, -26784, -1027, 8987, -16194, 1000, 20522, 15481, 13454, 2820]
11307B820J0453m771J2034r579J0427j992j3850J0763j7775l9858J6063L0071
11295D806J5190R72k2189J5477j4562J2687p735J3910q805R086J4513k229J5674
11282D6795k845j8925j5449n87L081k2152j1877p333o652p052m850J5563K4030
11269h253n406Q443P447K7191k099m681l329J9564j5406j3520j5204q703j4681
11256b8637j2419L2622K8231J1835L404k3294l4794k7715J1237J1897J9637R947
11244A951J6225m379J892K104j7196j0087m418J6792k0416J4471j4051m379L4828
11231A3337L714j6090k4497R201K6399j4175j8844J0674R923P629l730O598k8935
11218a8796J825Q273j068N936J6162j6368M076J1695k1195k7621j7843j6150j1265
$$ y = [2820, 13273, 8502, 20536, 10957, 21384, 19392, 5542, 16305, -1470, -41328, -25265, 4806, 19996, 20968, -1221, 14256, -306, 12381, 4646, 18556, 9751, 18837, 33350, 31121, 46795, 43950, 25025, 9576, 8989, 12070, -10082, -21959, -29292, -35944, -42996, -47846, -32283, -8253, -13659, -5216, 2231, 29422, 27323, 22642, 19313, 38877, 23471, 9951, -5253, -13956, -28637, -41056, -8434, 19797, 31632, 35036, 11742, -23052, -50767, -39530, -27633, -7996, 1951, 18176, 13797, 15689, 17793, 597, -9490, -13908, 2884, -17532, -3061, -17112, -21491, 13337, 17051, 961, -23536, -14335, 12064, -2111, -20955, -10281, -358, 7271, 3541, 10139, -18796, -16971, -8698, -9766, -3830, 12332, -4036, 40, 11735, -9460, -37081, -54924, -71074, -82339]
11205h2339o94M4590L2124j3367p931L2757J1789l892j9098j8846P262K1993M72
11192D820j7900r072J2690q075q53p397o750k3005N267K3121p806K0482J9984
11179E506k394j3728O233Q597J0394Q780K2895j8424k8560K1125J5600m3062p446
11166a4484J1202J9993o174j8576j6033K4879K9050R360l6247j5470N918K3042
11154A6460l3740k9446k038J7756L368J3751J9415j1662O13j4265R83m17J3455
11141e767N806j3742k5031r140N17j8664n3543L48K7143K6434L3305J3691j7694
11128c6337n418q502L9050K9676R905o254k1819j2470N560m339j6959L3605L4904
11115D0602R507l6608n496N114Q765J0819p698k9608k0277k5449j3578J6086q092
$$ y = [-82339, -83033, -38443, -6319, -19686, -27617, 5140, 16929, 13037, -6061, -24907, -17645, 4348, 4820, -13080, -22152, -9462, -17537, -18390, -25787, -32537, -55542, -50275, -27154, -34960, -14478, 5506, 3112, -10616, -4383, 4214, 14608, 23388, 46283, 27859, -701, 20424, 36024, -7038, -14484, -3282, 16711, 10537, -8039, -24072, 807, 29857, 39217, 2970, -12500, -6582, 16460, -17280, -46726, -48764, -31008, -27640, -13889, 5526, -6136, -5523, -19788, -18805, -19222, -5767, 39, -13703, -38734, -47874, -47357, -66021, -119564, -119216, -92073, -65639, -32334, -18643, -36337, -41755, -50257, -11207, 18469, 28374, 22120, 301, -12169, -6609, -10948, -27907, 5698, 40602, 50109, 13501, 8005, 13119, 21884, 32703, 25005, -4603, -24880, -50329, -63907, -47821, -55913]
11102e5913J8935L0541K060K5538j3094j3345K1112J8133P845p130k827l667k516
11089B5672m0914l234k238k441N369O843L415M157j8077m8311o848K3522r232
11076f2317j8684K1445M3677J6625j4847j9115O039J796J0143j69j4511O418K4328
11063H28m527l1J678P886k0841l3735O439l119k807J9519j1126J6591P51J2683
11049i811j4112j0892J7555L0041J3317n273n749P841k2275j2039k504J672L123
11036i106N175j1585n34j6428M21Q929j377J9954K1371J1587q822j197j2055j6172
11022i839k0961J6611J3727r802l7626J135K0417k0738j8018j7652J9862J3661
11010d9223k76j6465L5920J7982k739J2190L7926L1542m924k0555M052O242J691
$$ y = [-55913, -36978, -6437, -4377, 21161, 8067, -5278, 15834, 33967, 41812, 34682, 31855, 28188, 25672, -15242, -18476, -20714, -23155, -17786, -10943, -7528, -3371, -21448, -69759, -76607, -53085, -62317, -81001, -59556, -15879, 746, -14101, -33216, -27177, -25381, -15238, -15407, -29918, -23500, 828, -3699, -3730, -2052, 5834, -15007, -48742, -42303, -45422, -48229, -28710, -39836, -23245, -22494, -9811, -23923, -34815, -17260, 12781, 26098, 20825, 15076, 22917, 642, -11397, -13901, -12229, -9106, -3931, -15516, -16050, -32478, -32057, -23128, -24505, -4551, 16820, 28407, 19585, 18388, 6333, -9839, -30800, -14189, -462, -10264, -47890, -46755, -26338, -47076, -65094, -82746, -62884, -49223, -49499, -65964, -30044, -12062, -14801, -2611, 35315, 66857, 61933, 41378, 45430, 51672, 53363]
10997E3363p002k2343j1013j1745k988K8577K1323j6066j7804j1586j2345K870
10985f759J5393j7812j0321j2539o290L192l0402j3395K230L5118M6152P537K1728
10972C3832j5788j4589m3445j6143J4183J4018P303k5553l0243j4220p748L1153
10960f7240K7054j616n867J1081M179j0485P304M9488J6020k6630k033K934o822
10947b633m282j1789l0893j5192N248K6472M6068j5869j8501n105M2287O650j2867
10934I594J628J5316j4064l995m858q538k1925k042J2466j2815l0922J4366O045
10921c9744K0277N9007l3248k1163n29J3843R117o115M007J9035p241r549j6813
10908i116j573j6404k7313J9248K4057J2020j1981n15j8389P306j771j8216j7641
$$ y = [53363, 46361, 24018, 13005, 1260, -1728, 26849, 48172, 32106, 14302, 2716, -9629, -6759, 8634, -9178, -19499, -32038, -38328, -35136, -65538, -78933, -76703, -41585, 4567, 12104, 33832, 18044, 3455, -39990, -56133, -41950, -27932, -20629, -46182, -76425, -90645, -98393, -67240, -40186, -41802, -47669, -36588, -32409, -42894, -35590, 13898, 29918, 3288, 1255, 4189, -2633, -6915, -18704, -49597, -64789, -59541, -33069, 12999, -2870, -21371, -26476, 15811, 22461, 9594, 11222, 26538, 12474, 8479, 3621, -4917, -26842, -28884, -16418, -29233, -60155, -45789, -39744, -19467, 39540, 6292, -14871, -15400, -1557, 7560, 1445, 5452, 24487, 17246, 7697, -9116, -10689, -27093, -54406, -35158, -11101, 919, -11062, -11577, -29966, -22660, -24431, -42647, -60288]
10895f0288K0684J9390J3676r775l9064R14J364K1024K1818M92J8093J9065q218
10882A9175l9546j5455J2095J1216J4842J471j2469N73m159l377k6418J7679J9985
10869d388K5091j6995n1422q708R137K1757j369p095L4338J0157k8063J264J2173
10856d123j2312J2593L688j6106l5596k8384J3277p257J3926M4260j4263j5102
10844d5399R540q83K800q775J7466Q462j5546L640o492J0176m874m185K75K1633
10830a2162J2679j2134K6020M545k8394j015j805K057k0401J3864n360N590J3362
10817c154j4378l470J2700J2859j0470m529k09P123j2001L882K6057k0607k4671
10804c0868K2689p016j073M384J2384p375o6k964m992l6786J1035J1297j6379
$$ y = [-60288, -39604, -20214, -6538, -16313, -55377, -54463, -53099, -32075, -10257, -9765, 8328, 27393, 19175, -20371, -35826, -23731, -12515, 2327, 3798, -8671, -8098, -12257, -15634, -42052, -24373, -4388, 20703, 3708, -47714, -56422, -47285, -25528, -26897, -33992, 346, 10503, -17560, -16296, -4123, -16435, -3842, -154, -16260, -51856, -80240, -66963, -74220, -60294, -16034, -30297, -45399, -35859, -36742, -33942, -42717, -25251, -16789, -32335, -28695, -35187, -25011, -29885, -34070, -33795, -12162, 517, -11617, 14403, 18948, -9446, -10461, -12266, -10209, -30610, -16746, -22106, -16516, -3154, -17532, -21002, -8302, 4557, -5913, -10442, -10651, -3528, -15529, -11647, 14410, -6197, -30868, -8179, -15195, -16268, -11884, 500, -6875, -6941, -9905, -14897, -51683, -40648, -29351, -45730]
10791d5730M332L8696L7491l3116m8371J1731K4979M0005k042j681J6390k4733
10779A7951k5886k163n644l2050k3936R491l741L3682K0236J075O532j6870k417
10766b3740j8482L579j218O918K7217O028m9717m672K4662k3714J4170J8834j1943
10753c2078P977R481J919j8986j1593L5763j691k5656J462J3751p55J3042k1907
10740b9271K679j1165M159n110M1216N979q535R56k1567j578k7548J5958J3356
10727b0471l835K3441K0061R5k1008K50q360m075J5543J3947j5515o056o794L5422
10713B2645K8116l721l0764j4487k5544k1250L6169l316k8837j474K1675Q60J8108
10700a820j130j1371l2143m0714L770J0594O001K0955K4726j0276j7188k258j7978
$$ y = [-45730, -41398, -2702, 34789, 1673, -46698, -34967, -9988, 30017, 27975, 26294, 42684, 17951, -7935, -10098, -15742, -47792, -71728, -62237, -65978, -32296, -12060, -10985, -4453, -21323, -23740, -42222, -38643, -39861, -32943, -5726, 302, -49415, -54087, -29425, -53139, -38969, -20135, -32078, -24101, -14620, -12701, -31687, -43280, -7517, -9208, -34864, -33402, -19651, -20406, -7364, -29271, -26592, -37757, -33598, -38708, 2508, 8487, -48, 908, -20659, -22237, -49785, -33827, -20471, -24306, -865, 19196, 19291, -1717, -1467, -9827, -13902, 1641, 15588, 73, -5983, -12777, 22645, 50761, 47040, 16276, 1789, -23755, -45005, -8836, -12152, -40989, -42463, -20788, -19928, -1820, -2950, -14321, -46464, -87178, -83408, -72814, -66813, -45858, -21132, -31408, -48596, -50854, -68832]
10687f8832J8935N356L538P099K0405K6588K6616m571j6395k9252l0604l49K3908
10674a7558K8053j2518J58j6721o974J064L4328P487k286N171k478j9707j5366
10661a7347J2879K8346L371n047j5116J205K4919j835P373k1088p166r674l0100
10648b9280Q695L650r072J3884M8256K7706k3698R395j4597j2041k7574j8361
10636b3037j7399k8814j6497J3576L9945L7832N116j7538k2207J3731P907J1590
10624D205L603j0208k4411K690k8340l1481k3536K9291M0765K9232J5649k941
10612D518K927K4385K2316k3239k2881m0605j0938r359K4655P039k3618j311Q15
10599d5296K2320K1452k951p264n108j9278J4922o541L8755J4195J9300l985j0813
$$ y = [-68832, -49897, -44541, -41003, -33904, -13499, 13089, 39705, 35134, 18739, -10513, -41117, -41466, -17558, 10495, -2023, -1865, -18586, -25560, -24496, 9832, 17319, 15033, 20204, 17726, -1981, -17347, -4468, 23878, 27249, 22202, 7086, 8291, 33210, 31375, 38748, 17660, 10494, 820, -29280, -20585, -16935, -26007, -12123, 36133, 63839, 40141, 49536, 34939, 22898, -4676, -23037, -40436, -69250, -85747, -72171, -32226, 5606, 10722, -6816, -29023, -15292, -7385, 4205, 7808, -2400, -26811, -24121, -52461, -83942, -107478, -78187, -37422, -8190, 7459, 4518, 7445, 31830, 54146, 30907, 8026, -32579, -43517, -52876, -28221, -21182, -44800, -46111, -45296, -22976, -1524, -4475, -11739, -16847, -36125, -21203, -27744, 11011, 25206, 44506, 40521, 29708]
10586B9708m6041k9213K2597n538k136J9132N34J2310K2342j5646j2989N970J1835
10573A2865l7164j648o1J1680J3446L6914K0645k0023j7809j0227j8732K5407
10561A5293N2001O141j9853k8900N386O674k3128N742M577n988Q142ol7032k1285
10547c2236J3367P861j683r45j0858p704L4038M853l9024n362J5120J8258L195
10534a120J665j9145k648o936q696k122r255K5276L4433p311n459M4733K39j1491
10520C2163j6191M676k008o384k0757M549N646J9947L1667j447j1719K5619j1177
10507E4584p799k1668m373K4428K2590k4309j5572j8938j3589K228j243J0094
10495F433q650J2996J2654L255k5j0931k3325J6508K8419L6346k4715j027J6932
$$ y = [29708, -16333, -45546, -22949, -28487, -30623, -11491, -10957, 1353, 23695, 8049, -4940, 1030, 12865, -24299, -25947, -26008, -14328, -882, 36032, 56677, 36654, 18845, 8618, -10114, 15293, 67294, 73435, 53582, 24682, 30068, 36742, 13614, 19356, 23933, 17945, 26087, 26081, -10951, -32236, -18869, -11008, -12691, -13636, -24494, -32198, 1840, 6693, -32331, -37693, -22573, -4315, -1120, 545, -18600, -21248, -28184, -36880, -39002, -48257, -22981, 11452, 4141, -1318, 43415, 43654, 32163, 15972, 20648, 18640, 12256, -8501, -3952, 1694, 21641, 53308, 51861, 40142, 65761, 54584, 46785, 25117, 20744, 45172, 67762, 43453, 27881, 8943, -4646, -2418, -3661, 6433, -2217, 10779, 23433, 26688, 26663, 15732, -7593, 8915, 37334, 73680, 48965, 47938, 64870]
10482F4870J6002K052L4590K3349P566K3331R611n80j2129L3471m908o1100m4608
10469I1517j9903k4151k2977l354K7332L5053j8684n2877l6980k3032R227J7597
10457b1232m698J1178K4417l1403j1325K8577Q416K4700J740k2660q010L1994
10445C1694R440m937j5323l7719J2002J2180J4496l422j8008R118N932k8231m9039
10432f1817j1694K5744K0118K245k93J7072K5759J414J0432Q990l6160m5616K1133
10419b2673L3283j0316J1714O413m3357p479L8966j77j459K0873K2513k7516k6778
10406e993k679p750j7144J7253K5776k3318k1814Q402L600M898M5928p645k1000
10393a486m621j0639j8768K2776K7585j7211k1286L0977J7847J7867j4972j7800
$$ y = [64870, 80872, 82924, 117514, 140863, 148429, 171760, 181371, 180791, 168662, 202133, 197225, 136125, 91517, 71614, 47463, 24486, 21132, 48464, 83517, 64833, 11956, -25024, -48056, -38829, -21232, -25930, -14752, 9665, -21738, -33063, -4486, 3930, 28630, 30370, 7710, -300, 31694, 41134, 36197, 20874, -16845, -4843, 7337, 21833, 18411, 403, 9521, 15453, -12778, -61817, -73511, -47767, -27649, -25404, -25697, -8625, 17134, 18548, 28980, 37970, 1810, -43806, -22673, 10610, 294, 12008, 18421, -24936, -32415, 6551, 6374, 4915, 25788, 48301, 20785, -5993, -8672, -16422, -33566, -16313, 9463, -13855, -35669, -27267, -23667, -18769, 27159, 19514, -1486, -6107, -16746, -35514, -12738, 14847, -2364, -23650, 7327, 25174, 43041, 28069, 10269]
10381A0269r590P608J4517K8286K4853J1189r265j3721k1332k658l2552k4647
10369a7043l960N311j1944M799J1053J3580L846l1949P423N636K7434p928K2111
10356B8369Q545J0434k230k9005l792N646l407K6331K6790L3880J3440j1199J7497
10343A21299N1179N5679O7489R3789J02888Q7256J14645J13411J22107R1227M0822
10332A061791K2239l0263o5395r6555j36881j51112j01288r8702p2173j09565
10322B22096n8993j9774l2343k5966j2203k570p695j1988M317l0116j6901Q550
10310A6414j2243J840K170K1776J2731N882m868K4888j6013l6365l1784m066J4078
10297e560p233m0690j3826j6035L3670K2836K1773J8850N478j8441l883j757j5356
$$ y = [10269, 679, 8287, 22804, 51090, 75943, 87132, 77867, 64146, 42814, 40156, 7604, -17043, -21003, -15692, -27636, -22837, -11784, 1796, 5642, -26307, -18884, -13248, 14186, 6258, 28369, 36914, 47348, 45118, 16113, 12321, 17967, 14560, 40891, 67681, 101561, 115001, 103802, 121299, 172478, 228157, 295646, 389435, 492323, 579579, 694224, 807635, 929742, 1020969, 1061791, 1084030, 1053767, 988372, 891817, 754936, 603824, 502536, 403834, 331661, 222096, 163103, 143329, 110986, 85020, 72817, 70247, 62552, 50564, 54881, 24765, 7864, 16414, 4171, 6011, 8181, 29957, 42688, 48570, 43702, 68590, 52577, 16212, -15572, -19638, -5560, -12793, -53483, -67309, -83344, -49674, -26838, -5065, 13785, 19263, 822, -3061, -4818, -20174]
10284b0174J0490P706j1305j3888j1805K6414L7891L264k0394j4468L6417l346
10272B6802k0144J6265l6756j5785j2995J2903M961J0777J8924p509J2467K6541
10260C6451p572P624L4344L9312O0191L0161j4258l6802P601n167k216k8820l9216
10247H1633j9167J7501N658q355q166p46p861l926p597J4133K960o411m1373k8247
10233i964O965Q805j0072J8388J7732o9276k016M3672l116K7219L3501k7088k2953
10220A1797Q369J4001Q648k1897K2929L4j2849k0787L5984M4198n643k6265j4337
10207D4182m2307k051P042J6289j4251j9896l055N183J0110m194j5248l912R58
10194b1150K7411M4040k704l5289N870k0132j1717J1047M812j8262l6101M4662
$$ y = [-20174, -9684, -1978, -13283, -27171, -38976, -12562, 25329, 28593, 8199, -6269, 30148, 26802, 6658, 22923, -13833, -29618, -42613, -29710, -24749, -13972, 4952, -2557, 9910, 36451, 28879, 36503, 70847, 110159, 170350, 200511, 186253, 149451, 157052, 151885, 149669, 120849, 81633, 62466, 79967, 85625, 77270, 69104, 68358, 60497, 56571, 48974, 63107, 66067, 59656, 18283, -9964, -2999, 5806, -4266, 14122, 31854, -37422, -39438, 4234, 1118, 28337, 61838, 34750, 11797, 20166, 34167, 42815, 20918, 43847, 43881, 31032, 10245, 46229, 90427, 84784, 58519, 44182, 1875, -176, 6866, 23155, 8904, -10992, -14047, -8864, 1246, -2948, -18196, -22108, -21150, 6261, 50301, 47597, 12308, 18178, -1954, -13671, -2624, 2188, -16074, -52175, -7513]
10182g513L8003j0510l3582Q476J5113p309L97K005J3037p729l5101p713J1900
10169b0526K4378K0242j828l3833l7806K4991L3929M8531o7576p756J9952J8221
10157B0919l1379r527Q559J0922R051Q110M753j3253K778L0278j563N360L3821
10144G8829L7639M002k2221o596k1470j2919k5910k034j9771k2547p097J678K2631
10131D214J6122l62n791j0086M2648l706k6342M2489J478l6651j0187R26K157
10118A6909J6995J7373n2676q031K5325o655k3500j2532K633k676n513R950L189
10105a9209q848M751L4987j2936l2927J7240M2212J8993j3378K45O78Q201k4842
10092A5167n2445J863K4076K3738n6372k9277K6784K0705P423N787l716K0107
$$ y = [-7513, 30490, 19980, -13602, -5126, 9987, 2678, 3075, 5080, 18117, 10388, -24713, -32426, -20526, 3852, 24094, 22266, -11567, -49373, -24382, 9547, 58078, -9498, -17254, 2698, 20919, -10460, -19987, -11428, -506, 8545, 16655, 21408, 8155, 10933, 41211, 39648, 45008, 78829, 116468, 120470, 98249, 91653, 70183, 57264, 31354, 29320, 9549, -12998, -20095, -18417, 4214, 20336, 19974, 14183, 4097, 46745, 43039, 16697, 59186, 60664, 24013, 13826, 14752, 16909, 33904, 51277, -1399, -9430, 15895, 9240, -14260, -26792, -24159, -26835, -32348, -22398, -19209, -28057, -23306, 11681, -1255, -34182, -16942, 25270, 44263, 30885, 31130, 31808, 40009, 15167, -37278, -35415, -11339, 12399, -43973, -73250, -46466, -25761, -18338, -12551, -16267, 3840]
10080C840M1598j2805k0020P082j4802j1137J2788J2478M1166p559k5361j8081
10068I187O829p633m903j5057R243L2685P599J5377j1463k4417j2313j7883O78
10055a2071J4771j6993L966L3761K5352J3490l2105l7284j9467O801Q856K8609
10043A7686P607Q63j6995l8623K5785K7928Q569l1295l3952k2090K9953j4530
10031c9094J2202K2838q443J2329J5517J0832r119j1724p292r510N532J2384J9564
10018B6016P884p082l86j3886j9608J2066J9039k0766k746k7493m34M218l6419
10005e9597k652J2789K0175J0432L14j6029K6213L083k5672k3926O674J3573J1377
9992b3246K4114L901p824k3837j1590J810l252O34J2220j1434L6954l46k1710
$$ y = [3840, 45438, 32633, 12613, 19695, 4893, -6244, 6544, 19022, 60188, 52629, 27268, 9187, 16016, 8383, 3480, -11577, -2334, 30351, 37950, 53327, 41864, 17447, 5134, -12749, -12071, 2700, -14293, -10327, 23434, 48786, 62276, 30171, -7113, -26580, -19779, -10923, 17686, 25293, 26156, 9161, -29462, -3677, 24251, 32820, 1525, -32427, -54517, -24564, -39094, -26892, -4054, -12497, -168, 15349, 26181, 17062, 5338, -1954, -11464, -5932, 6452, 26016, 33900, 26818, 26432, 12546, -7062, 5004, 24043, 3277, 531, -26962, -27396, -23178, -59597, -62249, -49460, -29285, -18853, -18539, -34568, -8355, -5272, -30944, -54870, -48196, -34623, -23246, 868, 4769, -3055, -26892, -38482, -36672, -39924, -39290, -27070, -38504, -1550, -1896, -23606]
9979b3606O773N828K6771J5101J2233j1199j3275j0859j3622K7655k2024l5051
9967c5275J8622L5079J2066k1910k0675j6198J8907J3630o046j9129N127m501
9955b0303M26L05O31m143P594K677q804K7442n00q522P932M5364J0878j0627K7725
9940G8075P751j7930N115J9406P582k5604k7865M485j5341j4398j2371P851Q693
9927B5449P705j5950j0297l2636J2696l225l149J3898J1454k742j7027j0447M648
9914a9623K7302O220k634l995k6644M179m042O613J5696L845q061j4356k826K0076
9900A750Q747j2807k975L696K6146o784M881k5181k6243L9057J3140k8016j7144
9887b1733L9864L3518j0155k0143m848j4300k4976K3403M8624J7156p214l4113
$$ y = [-23606, -16833, -11005, 15766, 30867, 43100, 31901, 18626, 7767, -5855, 21800, -224, -35275, -16653, 18426, 30492, 8582, -12093, -28291, -9384, 4246, -1800, -20929, -15802, -20303, -19877, -19572, -18941, -23084, -15490, -12813, -21617, 5825, 5325, -3197, 4735, 50099, 60977, 50350, 78075, 85826, 67896, 73011, 92417, 99999, 74395, 46530, 51015, 35674, 21276, 8905, 16756, 25449, 33154, 17204, 6907, -25729, -13033, -16258, -19407, -5509, 5945, 3203, -13824, -24271, -19623, 7679, 13899, 11265, 7270, -19374, -15195, -19237, -12624, 3072, 6917, -1144, -15500, -18326, 1750, 10497, -2310, -5285, -1589, 24557, 17773, 22654, -2527, -28770, 10287, 23427, -4589, -21733, 18131, 51649, 41494, 21351, 16503, 2203, -22773, 630, 49254, 66410, 59196, 25083]
9875B5083l3795q293L1578J7983o133k7886j4437K8362k119O345j3341P490J0823
9862B1660m264J5295J6409j10J3358N162J8342M671j1270Q807l484J4175M8938
9849A47689R0492J00665J45116J79353J20308J6907o5573j36596k05853j44704
9839B47804p6962l5383l9041j9911O578J724l4572J6789k3638j6988j2840k1482
9827g922K384K1207Q748o408L1080R988o664m0015j1444J2416j1982l2543O988
9814b4167j375M510l2122J3892P2773P149p736j3018k7033P610K1305J1439l2324
9801I03l3058M713M0805K0650l2481p127K0366j4057Q196J6942l1381l4879L9494
9788i14O081j4648m653J2040M500M2230O15j0822j6953j8243j5060l869J8346
$$ y = [25083, -8712, -17005, 14573, 32556, 26423, -1463, -15900, 12462, 10343, 16688, 3347, 10837, 21660, 17396, 32691, 49100, 48990, 62348, 67510, 85852, 90523, 79253, 88060, 84576, 98751, 147689, 238181, 338846, 483962, 663315, 783623, 800530, 734957, 598361, 392508, 247804, 170842, 135459, 96418, 76507, 83085, 84809, 50237, 67026, 43388, 26400, 13560, -7922, -5538, 15669, 24417, 18009, 49089, 59077, 52413, 12398, 954, 13370, 1388, -31155, -24167, -25542, -21032, -53154, -39262, 33511, 40660, 32924, 19906, -7127, 483, 21788, 33227, 903, -32155, -27442, 13363, 34013, 1532, -5595, 14771, 714, 8910, 25852, -5529, -40408, -914, 5167, -9481, -14134, -2094, 2406, 44636, 45251, 34429, 17476, -767, -15827, -19696, -1350]
9775a350L1046j3504j8708j6940l6565l251N208K2835M0729j825k757k4191m0807
9762f0080J2033L0332J7124j3955M197J1181N511r030J113j1763j7238o346L5433
9749a488J0016J6723K8898L329o439l4986l6279n836K3063m664P720j012K026
9736A071p270J7428j429M007p943m220j4030J5445j0132k869J1647K9791l2617
9723a121k3101k3518l340K0113J049P1J154J0355J5675K5115J2480J2190L92j0846
9709C6668J7876n68J4647o409l2116j3176R39r909O620L467k0K4957J517R521
9695E4014j470k2169j9329j5093L628q113R398J8769J926J1688R926j473l524
9682C8178J1601l419j9688r492J3454J496n196Q22K3646j0831j2475P29p979k0528
$$ y = [-1350, 29696, 16192, -2516, -19456, -56021, -59272, -54064, -31229, 9500, 7675, 4918, -19273, -60080, -48047, -17715, -591, -14546, -10349, 832, 6343, -2687, -1574, -13337, -30575, -36921, -1488, 8528, 25251, 54149, 57478, 51039, 16053, -20226, -26062, -2999, -7663, 57, -955, 1071, -6199, 11229, 9800, 13807, 5864, 1644, -12386, 3059, -7073, -9942, 1705, 31496, -1121, -24222, -47740, -51080, -30967, -29918, -29847, -28693, -18338, -2663, 22452, 34932, 47122, 47514, 36668, 54544, 53976, 68623, 62214, 30098, 16922, 17861, 7952, 14572, 18039, 18019, 42976, 44493, 54014, 52544, 30375, 11046, -4047, -419, -8532, 866, 19635, 21561, 33249, 43175, 41702, 38178, 49779, 46360, 26672, 17180, 30634, 32130, 26934, 27756, 51402, 40571, 28096, 28825, 20846, 318]
9668C18j3912j523K405N412l493n635n252n567j6934R289P271m871O286l352M6041
9653A6483J3610n658l344j4866Q696K4347l1125q641J2564J6567l392P645j5613
9640A7273m4124j1463K4450M9574N3941j1382l9614j9301J3933O516k86q343P957
9627C9131o47l4536j3040j0883p995J2267L92j1597l716L455j4497J6179K0153
9614e334J7396p633k0372m117o212J3010J8769J1367k1171j428K687J8066k820
9601A2208l880r739j0581j0777J0851j5556r813J6077N477Q527o449k189j4468
9588c0312k801J654K3049L6060N754P62O157o639l0309J6959K5158j1921o880
9575B6691M614l0598j1770j9550l9135j1370K4971J5170L1142J2066J902O478
$$ y = [318, -13594, -15117, -12712, -7300, -10793, -16428, -21680, -27247, -44181, -34892, -27621, -32492, -26206, -29558, 16483, 30093, 24435, 21091, 6225, 14921, 39268, 8143, -498, 12066, 28633, 25241, 32886, 17273, -26851, -38314, -13864, 35710, 89651, 78269, 38655, 19354, 33287, 39803, 39517, 31174, 39131, 38484, 3948, -9092, -19975, -27970, -15703, -15311, -26908, -30624, -27169, -41666, -25487, -5334, 12062, 4429, -15943, -20060, -26272, -13262, 5507, 16874, -4297, -5725, -3038, 15028, 12208, 8328, -1411, -11992, -22769, -11918, -27474, -37287, -21210, -15733, -7206, -13655, -15844, -30312, -33113, -31459, -8410, 27650, 33404, 34166, 40323, 33684, 3375, 20334, 45492, 33571, 26691, 31305, 707, -11063, -30613, -69748, -81118, -56147, -40977, -9835, 2231, 4133, 10611]
9563A0611N749o593J0837J2585J7477J0345j7156k9617j3587j7902j2681R186
9551b0746M6313k593n0469k723K1377R217J4356j5532O739j3204k9205J8125K133
9538a6212j3142N388M1831O637J5233N793m0196N301J7915L7321j2068j8470k8161
9525G170Q368l5435l582M257J062o260r310K665j9407K5377J4871J3352J6836
9512A9964j3983k7709k9971J6162L7449M0191L3639m116l8029k2789p033K0613
9500B4388n88j0399j718p149l667K959j9461Q440k848K090J6310m183j3667J9028
9486I535R092L346J56n596k142j4474j1431n67Q032r748M287K0470J1254k2874
9472f60l13J2636l5913j6802j0643j3299j144L7472L6657l590J1129J3678n136
$$ y = [10611, 16360, 9767, 20604, 33189, 50666, 61011, 43855, 14238, 651, -17251, -29932, -20746, 25567, 22974, -27495, -30218, -8841, 376, 14732, -800, 5939, -7265, -36470, -18345, -16212, -29354, -23966, 17865, 24502, 39735, 45528, 5332, 10633, 28548, 65869, 53801, 35331, 7170, 15538, -19897, -23479, -19222, -18160, -24420, -33730, -31065, -50472, -25095, -10224, 3128, 19964, 5981, -21728, -51699, -35537, 1912, 42103, 75742, 71626, 33597, 10808, 3775, 24388, 23800, 13401, 11683, 4534, 867, 3826, -15635, -7195, -10043, -7953, 8357, 4174, -9493, 9535, 18627, 21973, 22129, 16533, 14391, -83, -11514, -12081, -4049, -13797, -9510, 10960, 22214, -660, -973, 11663, -24250, -41052, -51695, -64994, -66138, -28666, 7991, 4401, 15530, 29208, 24072]
9459B4072r20N468M869j231j3325p398M983L1830M660j0275l1052l3682M078L459
9445a4464R28o663J9450p55J0474j0499l964L05J5673l911r318K2933K2096k1015
9431B1270k3398n009L8156K085k3828k0434J5542n169k1867P017K2780j1777j261
9418e893p855k1874J6544R740k4002j7719M936j3506N982O050J521R596k6883
9405f3363m179L4193J8115K8485N348M194K9635J6078k4676j1364k1013l624K617
9392A0446q984j2699m729O373N510K3952R736K3435J9910j6729j0889O27j6954
9379B9005k8116j7299j3185J2010k2124Q334K7129O376O772L8067j041l3546l8239
9366b5857J5667N462j0731j0176m303J1149K1728l437J7887j2188j1095l4317
$$ y = [24072, 23152, 28620, 33489, 32258, 18933, 11535, 16518, 48348, 53008, 42733, 11681, -22001, -17923, -14464, -13536, -20199, -749, -1504, 8970, -1529, -5493, -5188, 10485, 6574, -2744, 20189, 42285, 21270, -2128, -7137, 31019, 33104, 9276, -11158, 4384, -785, -22652, -15635, 7145, -4632, -5893, -13748, -35622, -19078, -9338, -33340, -51059, -46123, -59629, -53647, -47597, -46076, -36480, -63363, -67542, -33349, -15234, 13251, 18599, 22793, 52428, 68506, 43830, 32466, 11453, 7829, 10446, 1462, -11237, -15966, -9593, -4083, 19869, 29605, 53040, 72950, 56221, 45332, 45959, 29005, 889, -16410, -29595, -17585, -39709, -31375, -4246, 2130, 8902, 46969, 45928, 12382, -25857, -10190, -4728, -15459, -25635, -29938, -18789, 2939, -498, 17389, 5201, -5894, -40211]
9354d0211J8909K5297j5964M072R369p875K0235R276J2520M462j8293r76k3370
9341b549j0488J8889J443m1817j6664M857R703J2904M488P187J5848j2089K021
9328f267J1400L7273P332K461O928j0870l5827k6806K1612J4157m150K4287j2258
9315B9272n443j4280k0809L232j4952K7127R849p781k4587O317L0941n567n895
9302G424J755J5742k1118l1378L19M2964K3906k3210j3761J9390n620l3846J4136
9289c297K0251p206L4666K6793k4651k4763K4839p722m0984O932K3939M87j9151
9276A0133k4699l2064J2067J3231K5332L3334J435k9290J6595Q882m724L84M115
9263C4731K2918m252k0121k7273j6488l649R751L3820J3674Q05m506l323J8804
$$ y = [-40211, -21302, 3995, -11969, -7897, 1472, -6403, 13832, 23108, 35628, 40090, 21797, 20821, -2549, -13037, 5852, 7295, -34522, -51186, -46329, -36626, -23722, -19234, -12047, 3801, -8288, -6267, 5133, 42406, 49738, 52199, 59127, 48257, 12430, -14376, 7236, 21393, 17243, 41530, 29272, 23829, 9549, -11260, -8028, -22980, 4147, 13996, 6215, -18372, -12055, 18886, 13319, 7424, 9179, 24921, 3803, -27575, -27256, 15708, 39614, 16404, 2643, 22033, 16413, -17433, -3297, 16954, 9748, 44414, 71207, 46556, 21793, 46632, 38910, -2074, 4858, 28797, 29284, 10133, -14566, -46630, -34563, -21332, 4000, 37334, 38769, 9479, 26074, 34956, 30232, 30616, 34731, 57649, 53397, 33276, 6003, -10485, -14134, -4383, 29437, 43111, 43916, 39410, 36087, 54891]
9250E4891j3176l1231K8087K820J2711k4802p049J91J0804K2661K9299o289k8127
9237E0790j1936j506K2351J968j1286J4288R363l5335j9650J7735J7492N1318
9225A05592n472k5051L721N121n67K2721p332j6777n724k6010K2455L2414K989
9212A08080m877J9971K6320J764j5976j0631j3205P110o047Q029K2600J0452k2970
9199A30620J728J1894J9921K119j2079J984P423K7055M5803M0287K8720J8902
9187C24377K9706j2736k7331J8389K0606K7796M2965N8466N0804M5182J704J9190
9175E99118Q3799O1010P5890R9262R8026P0049O4346J15010J37455J01959J21968
9164A627892J48178J46719J21829J12023J18615P4314N7017O596l3944k1682n5012
$$ y = [54891, 41715, 10484, 38571, 41391, 54102, 29300, 22251, 22442, 33246, 55907, 85206, 78917, 50790, 38854, 37348, 59699, 61667, 50381, 64669, 74032, 38697, 19047, 36782, 54274, 105592, 100120, 75069, 78790, 83911, 83344, 106065, 98733, 81956, 76232, 50222, 72677, 105091, 108080, 103203, 123174, 149494, 151258, 135282, 124651, 111446, 118556, 112509, 120538, 143138, 153590, 130620, 132348, 144242, 164163, 166282, 154203, 156187, 163610, 190665, 236468, 276755, 305475, 324377, 354083, 341347, 314016, 332405, 353011, 380807, 423772, 482238, 533042, 578224, 579928, 599118, 682917, 743927, 819817, 919079, 1017105, 1087154, 1151500, 1266510, 1403965, 1505924, 1627892, 1776070, 1922789, 2044618, 2156641, 2275256, 2349570, 2406587, 2413183, 2379239, 2357557, 2302545]
9153B302545j23660j14512j49997j42328j57341j16843j33320j37277j18152r2997
9143A016118p6641k6299n1507p1947r6646q0540l4633j641m1561l7140j9505o539
9131D71519l0304n1404l2110j0367k5551j2248K194k8593m6178l9559m122k2117
9119A71160M722Q360l4058j0472P63J6389k136l1543j4959j8048K4938J4933m318
9106A25731l079J0437J0316k5038k7999J4664q159L762J696K9773O066n023L119
9093A36266K0249J656l5546k7048p180P768r884j3646N707m469J1927L906l4022
9080E5684k7882L4279J7073p119n3400j1749J6661K8788K2454m1914l2118J4670
9068A5427N791K3973J4192L4955j0246l4554l7808K0166n762n094q836J2831n461
$$ y = [2302545, 2178885, 2064373, 1914376, 1772048, 1614707, 1497864, 1364544, 1227267, 1109115, 1016118, 939477, 913178, 861671, 789724, 693078, 612538, 577905, 576264, 534703, 497563, 478058, 471519, 441215, 389811, 357701, 347334, 321783, 309535, 311729, 283136, 236958, 197399, 193277, 171160, 175882, 184242, 150184, 139712, 140475, 156864, 154728, 123185, 108226, 90178, 115116, 130049, 125731, 122652, 133089, 143405, 118367, 90368, 105032, 96873, 100635, 102331, 132104, 138170, 133147, 136266, 156515, 158171, 122625, 95577, 88397, 96165, 86281, 72635, 78342, 73873, 85800, 89706, 55684, 27802, 62081, 79154, 72035, 18635, 6886, 23547, 52335, 74789, 32875, 757, 15427, 21218, 45191, 59383, 94338, 84092, 49538, 11730, 31896, 26134, 21040, 12204, 25035, 19574]
9055A9574P81j9039k465J7407K2531m861k1750J2748r485J6940n222R234K8872
9042F5265P820k3001k1268k7966j0809R558q859L807L6611n960k3716p072K7457
9029B1867m114j3326j3357K8589J8540o101m165l0922l531N8376k0712L858J9919
9016E4921n1651l6023J4269J1119j838K426J5251K7018J8242k30l62K712j7566
9003C8288l2694j6507P073J917q629J4875K5042J1311q644k1041N448j4081J1161
8990A3519K9228kj8259p396J7563Q952r701k7865j6100m60J8487J794O28p794
8976B594k0257N485J7950L053K017L735j6625J911M365j2336K524R824n701j2944
8962a4405P71q340L0009k696R149R729L155k6507k8448R793J6764j033j616J4154
$$ y = [19574, 20355, 1316, -1149, 16258, 38789, 33928, 12178, 24926, 15441, 32381, 27159, 36393, 65265, 73085, 50084, 28816, 850, -9959, -401, -9260, -5453, 31158, 25198, 1482, -5590, 21867, 17753, 4427, -8930, 19659, 38199, 32098, 27933, -2989, -6520, 51856, 31144, 35002, 54921, 3270, -32753, -18484, -7365, -9203, -6777, 8474, 35492, 53734, 53504, 53142, 55854, 38288, 5594, -10913, -3840, -1923, -10552, 4323, 29365, 40676, 32032, 10991, 16439, 2358, 13519, 42747, 42745, 24486, 17090, 34653, 43605, 33904, 6039, -10061, -10521, 7966, 9760, 10388, 2594, -17663, -12178, 5772, 8825, 10842, 14577, -2048, -137, 4228, -8108, -5584, 4240, -1461, -14405, -13634, -21974, 8035, 5339, 14488, 24217, 27372, 865, -27583, -17790, -1026, -2059, -3675, 10479]
8948A0479L9680K46m981j2538k821N087l112j8835J102j5174J006N165k0914J3465
8934b145K0047L034k2581J658k90k353J9838J8831R461J0584l0081K037k630l5262
8920i852j6853J9266J0283P240k937j6489p825j0299l897N747K688J6260P600
8907I32K8197K0530n044J0832k6044j5363P237J1022R042J7621j5418j8756k6021
8894a233l08j1210q281j482J9621K2070o769l950K2444j4514j9213J3100l3474
8881b3199j3067O192J0246k3671k637J2301J9969J0768j0469J7480q038N96K8572
8868B5043j6330j4161J120K7369P93j8982L476L0731N4318L6398j1306k2111j8093
8855G8265r501o940o366j0005p105k5053k9600J3018o415l4703O334J9910j838
$$ y = [10479, 50159, 50405, 45424, 32886, 30065, 35152, 32040, 13205, 14307, -867, 139, 5304, -15610, -2145, 17902, 20936, -1645, 13, -277, -2630, 17208, 36039, 45500, 56084, 26003, 28040, 25410, -9852, -26705, -7439, 2844, 10084, 7147, -9342, -17167, -27466, -31363, -25616, -22928, -6668, 932, 29129, 49659, 44615, 55447, 29403, 14040, 21277, 32299, 41341, 58962, 43544, 24788, -1233, -1541, -12751, -21032, -22514, -2893, 19177, 12408, 8458, 30902, 16388, -2825, 10275, -23199, -36266, -30074, -19828, -43499, -46136, -33835, -13866, -3098, -13567, 3913, -4125, -3529, 25043, 8713, -5448, -4328, 23041, 23834, 4852, 8328, 39059, 93377, 129775, 118469, 96358, 78265, 68764, 61824, 55458, 45453, 38348, 13295, -16305, -3287, -9702, -44405, -38071, -18161, -19999]
8842a9999J4486k653J3085K6907L475l3930l7157j2404j359M089N918P260K5032
8829g250J2574j4921k3576J5123J0541K06k4863l245J3529L063Q205L2385K5057
8816D6828j6944l3790k3709K8427L2787K639j7435l444j1149l917j1213n313K8693
8803A2460n809n004J3357M813J545j203r35L050k7120M917L6326J8381q153k3437
8789B3188o384J8841M108j2553n521l288j0799m1612l024J375Q794K0773o269
8776a2371n626M278K8976J1721k9672P058N667k67P716K113m7927j1898K1106
8763a9126l048K0556r900j1726J3418J7181l238N300O924N499J4676l5581j8538
8750a7603l184K155L4863J8873j1809j0998N178K1630j5747k1939L784R383k7378
$$ y = [-19999, -5513, -8166, 4919, 31826, 35301, 1371, -35786, -48190, -49549, -45460, -39542, -32282, -7250, 5324, -9597, -33173, -18050, -7509, -7303, -32166, -35411, -21882, -18819, -10614, 21771, 46828, 29884, -3906, -27615, 812, 33599, 36238, 18803, 15359, 4210, 293, -10920, -16233, 12460, 6651, 1647, 15004, 19817, 21362, 20159, 19224, 22274, -4846, 71, 36397, 54778, 46625, 23188, 16804, 35645, 39753, 27200, 21679, 18391, 7592, -34020, -37044, -35669, -26875, -6102, -12371, -17997, -13719, 15257, 26978, -2694, 4364, 10031, 9764, 17480, 19593, -28334, -40232, -19126, -22174, -1618, -11518, -23244, -9826, 7355, 4117, 9417, 16341, 21840, 36516, 935, -17603, -20787, -18632, 16231, 35104, 23295, 12297, 17475, 39105, 23358, 1419, 5203, 14586, -12792]
8737a2792q900J4550K9921k43q998O878k0017J1778L0760K3121l944l0325j3079
8724A8710j5150j8465n078J3049J8178M3634K5713N77j9154k2384n604K638l76
8711C6288J9812m133J9193L61j2903l1509k2797k1785J3129N8356J3671l0082
8699C7601k9088Q081q42J7411J9580P331Q498o319j6863J1159k3119k0362K1219
8686C4287J7156j2582o496n564P592R762J8356L1970L5839l2535K585J3984j0573
8673A03781j1438q673l8738j4235K798q482k2050m571K3842J4637K5006J5652
8661G7529n235J0348N477L605k0375l5003o854K2201J0692k5517j02J6774j5240
8648C8300K9242N9690N3640L8739M4784J2737k3107j816l5708r746k1746k8973
$$ y = [-12792, -21692, -7142, 22779, 22536, 13538, 20416, 399, 12177, 42937, 66058, 62114, 31789, 18710, 3560, -14905, -19983, -6934, 11244, 54878, 80591, 81168, 62014, 39630, 34026, 36664, 36288, 56100, 51967, 71160, 71521, 58618, 27109, 4312, -17473, -4344, 54012, 67683, 37601, 8513, 16594, 15752, 33163, 52743, 60074, 68572, 62253, 45390, 56549, 33430, 13068, 34287, 51443, 38861, 32365, 26801, 34393, 44155, 62511, 94481, 130320, 97785, 100370, 114354, 103781, 92343, 83670, 44932, 30697, 33495, 25013, 2963, -1608, 22234, 36871, 61877, 77529, 72294, 82642, 88119, 91724, 71349, 36346, 29492, 51693, 62385, 36868, 36766, 53540, 38300, 67542, 127232, 180872, 219611, 264395, 277132, 254025, 252209, 216501, 206755, 185009, 156036]
8636A56036J0890j7820j2795J3226J1104k5716M840N500J4491Q25k5079j5997
8624A19505J4339K8223L5479L3883Q970M77l342K9223n315j5431K0892N0439J0421
8611C27763n829J6036j8636j6246K1425N283j7312k4714M904L0051P7514P1571
8599D71810Q8961N8885J3506l6659q9398q4032o8782j5599m2576k1273m1637l7933
8587A95273k74p984k9344L389l516J305k1109j2743j2577j7816k4248j8379J2440
8574F4417K4366n539j1255k3351o387j346j2916q257l436K0161L1727q31j8942
8561D8411n82J2052K7430J7771k832j2430L3297N0746N3834J0413l3312o0190
8549A44608l2940k7869j5622j0454l4855o164l4218K001M4367L2763j010l0774
$$ y = [156036, 166926, 149106, 136311, 149537, 160641, 134925, 139765, 145265, 159756, 160581, 135502, 119505, 133844, 162067, 197546, 231429, 240399, 240876, 237534, 266757, 261442, 246011, 266903, 317342, 327763, 321934, 337970, 319334, 303088, 324513, 329796, 312484, 287770, 292674, 322725, 400239, 471810, 560771, 619656, 633162, 596503, 507105, 423073, 354291, 338692, 296116, 274843, 233206, 195273, 194999, 187015, 157671, 161060, 157544, 158849, 137740, 124997, 112420, 94604, 70356, 51977, 64417, 88783, 83244, 71989, 48638, 42251, 40905, 27989, 19732, 16296, 36457, 68184, 67353, 48411, 47829, 59881, 87311, 105082, 102250, 89820, 123117, 173863, 227697, 238110, 204798, 144608, 111668, 83799, 68177, 57723, 22868, 16704, -17514, -15513, 28854, 61617, 60607, 29833]
8537B9833j4936R376K9179k3284j2780j821k0338p594J103J3694K8320j8539j0524
8524A689K8575p81j3130Q177j1887k8503O951K294j7011j0981K7219M1572M663
8511C8847k1110j2433l1075j3758j2179K5833j941j5063J1636K5802J536l9062
8499d2967m074L7297J6377m398j60J4948K1214j0037K7995K2179J993k3990j6811
8486C9566k829m424R110k507n173l5018M017J5348K2662j4256m607L1896N235
8473E9020l347q630J3634j5657k0132j787j3262J1446j4252N054J1580L22K3485
8460D7474l793j7402J8186j883o69k60j9676m934k193k765J5233J2686j2416j7729
8446I859j4770K4956J4533k692j6079k8977q610Q830K7310K5738K0499j3117l1158
$$ y = [29833, 14897, 24273, 53452, 30168, 17388, 15567, -4771, -12365, -11262, 2432, 30752, 12213, 1689, 30264, 29483, 16353, 24530, 12643, -15860, -8909, -6615, -23626, -34607, -7388, 34184, 38847, 17737, 5304, -25771, -39529, -51708, -25875, -27816, -42879, -31243, -5441, -3905, -42967, -47041, -9744, 6633, 2235, 2075, 17023, 38237, 28200, 56195, 78374, 80367, 56377, 39566, 36737, 32313, 41423, 38916, 33743, -1275, 2742, 18090, 40752, 26496, 21889, 53785, 59020, 55673, 47043, 60677, 45020, 24888, 23101, 9839, 21285, 7033, 12087, 23667, 23989, 47474, 43681, 26279, 44465, 42582, 41913, 41653, 21977, 17043, 14850, 12085, 27318, 40004, 27588, 9859, -4911, 20045, 34578, 31886, 15807, -13170, -21780, -12950, 14360, 40098, 60597, 47480, 16322]
8433A6322l357J5514k3009N169J4245J0026P439L0089J6261j7792l0172m5649
8421d914M067j4723L319K5018L7144J4452k9662p091k886m828k5671J2787K127
8408I139J5682K7193P259j1416m1758l089k933o3L25L155l728J7265j4550l9146
8394c6665q793m88J9941R654o800R98P05j8306j445J5151L0401J7622K165k5387
8380a247L505j098k566J9267K3655J0474K8611q871l9575l2681k0910l496J9831
8367e101J3001M382j8397o688J4178j2223l0755K4208L5088R970j045L323O13
8354C0554r144o273O256m167j5881J672k7644k9216L0080K465j5468L8660m311
8341b417j9557K7921K8029R063J1778J1472P78m3750k9663k418O969J7700j4368
$$ y = [16322, 12965, 28479, 5470, 10639, 24884, 34910, 42349, 72438, 88699, 70907, 40735, -4914, -847, -15570, -12251, 12767, 49911, 64363, 34701, 27610, 24724, 19896, -5775, 7012, 9139, 24821, 52014, 59273, 47857, 6099, 3010, 77, 14, 339, 3494, -234, 17031, 2481, -36665, -45458, -45946, -26005, -16351, -23151, -22153, -21448, -39754, -41199, -26048, 4353, 21975, 24140, -1247, 2258, 1160, -1406, 17861, 41516, 51990, 80601, 71730, 32155, -526, -21436, -24932, -5101, 7900, 12282, -6115, -12803, 1375, -10848, -41603, -17395, 17693, 27663, 26618, 29941, 30554, 21410, 15137, 21393, 17226, 1345, 3017, -24627, -53843, -23763, -21298, -36766, 1894, -2417, -21974, 5947, 33976, 43039, 54817, 66289, 67067, 23317, -6346, -8764, -1795, 15905, 1537]
8328A537r406J4880P72K2702m739j2668j9267j130J7224Q405j1482j4744n136
8315a3052n637Q137J607j2331q092J3868O523j2867l7108J476M0344K1754L757
8302H379J4527K2007j471q766o50M603k1408r968J9724j036K5720n688q171L677
8288D1479m527J830k601J0985k232l1760l5902j0285L3642J1828j8913M9918K7472
8275G0934j5979k1530j2384m72k287j3846O670K9771n668q336j364k5141J3536
8262A3904K0027J4742o798j6040k3453l763J3012L1058K546j0290k1883O768P312
8249B7142p130j466j3186k1085j3122k573J043n61J8066j1357j650N225j2303
8236c2957L6211J8168l6814q572K5293N985l4731K0322L7760O549k953Q414P786
$$ y = [1537, -7869, 7011, 7783, 30485, 25746, 13078, -6189, -7319, 9905, 18310, 6828, -7916, -13052, -18689, -10552, -8945, -21276, -29368, -15500, -8977, -21844, -58952, -57476, -17132, 4622, 8379, 22906, 44913, 43442, 34676, 34026, 38629, 17221, 7253, 26977, 25941, 51661, 45973, 37802, 41479, 36952, 38782, 36181, 47166, 44934, 13174, -22728, -33013, 629, 12457, -6456, 43462, 70934, 54955, 33425, 21041, 20569, 18282, 4436, 11106, 40877, 35209, 26873, 25509, 368, 13904, 33931, 48673, 41875, 25835, 2382, -1381, 11631, 42689, 45235, 34945, 13062, 19830, 27142, 20012, 18546, 5360, -15725, -28847, -31420, -30377, -30938, -12872, -24229, -25879, -20654, -32957, 3254, 21422, -15392, -23964, 1329, 7314, -27417, -7095, 30665, 37214, 34261, 42675, 50461]
8223E0461j1975j4271j8244k1924J862J3021q789j2157K1134Q356j6441r940k6717
8210d5624M295K7767K2693j4894k5366J7114L0238J6975q714k0732j0241k4469
8198c0958l1414K8113J1856K3521M179K4746k8327j5409K2598M65j5417k767J5839
8185G025J0789l277J7192j9938l1411P254K4827J4526r516k2715l3755R648L4299
8172D948P063m905o23m719K0932o520j1320l3817r184P599j6265o109K8905K4755
8158G40j1676J4223J5414l475k253K4993K4267J183k9897j166p627n694m675J0240
8144B4597N162l832j3127j2644L570l554R227O707K1648m878k9891L381O612k2643
8130i665k4483K3462L8009Q170n604J5522j9280j2174m5704j5068N735M724J4005
$$ y = [50461, 38486, 24215, 5971, -15953, -14091, -1070, -9859, -22016, -882, 7474, -8967, -18907, -45624, -41329, -13562, 9131, -5763, -31129, -14015, 16223, 33198, 24484, 3752, -6489, -30958, -62372, -34259, -22403, 1118, 5297, 30043, 1716, -13693, 8905, 9370, -6047, -8814, 7025, 17814, 14537, 31729, 11791, -19620, -12366, 12461, 26987, 17471, -5244, -38999, -29351, 4948, 12011, 7106, 6483, 1764, 22696, 16176, 4856, -28961, -38145, -30546, -46811, -52920, -24015, 740, -10936, 3287, 18701, 15226, 12973, 37966, 62233, 63416, 33519, 32353, 24726, 19032, 14357, 24597, 29759, 25927, 12800, 156, 3726, 172, 9399, 16106, 37754, 32876, 2985, 6366, 12978, -9665, -34148, -10686, 27323, 35493, 29889, 45411, 26131, 13957, -31747, -46815, -41080, -36356, -22351]
8117b2351L0947L1908N230R158K1989K6442j336k5052J2566j4378n0857r895K0000
8104C4371R76J7352J632m0341k3292K8741R858j3848j133L1114n882l0266J5305
8091B4587R866R644j43j2622k35J8114j2843l0662R030k945j5646L163o607K3494
8077A6195R804J441j717J4171j0232l657m366q55L9689n434l9976k4209L236l453
8063i363Q161L5612j2042m224N669j941L1572O528J0946j301J7929r73L6834j642
8049A21765l8813j6618K2423J5389o509K5628K2626j225j4676K7952N44j0531
8037A47955J7549K6744q188k9140k8992L978K885M323l4099j2715j2022O545J2993
8024I7816k7071K1022K0451J347K1006P265n297N761l27k4388l1764R85K8003
$$ y = [-22351, 8596, 40504, 45734, 54892, 76881, 103323, 101987, 76935, 89501, 75123, 24266, 14371, 34371, 35347, 52699, 54331, 13990, -9302, 19439, 29297, 15449, 14316, 45430, 39548, 9282, 24587, 34453, 44097, 43954, 31332, 31097, 49211, 36368, 5706, 14736, 11791, -3855, -692, -7299, 16195, 25999, 27440, 25723, 39894, 29662, 26005, 21639, 20784, 60473, 55039, 15063, -9146, -5910, -9363, -1202, 34410, 22368, 18144, 23813, 21872, 53444, 59972, 70918, 69617, 87546, 86573, 123407, 121765, 82952, 66334, 88757, 104146, 97637, 123265, 145891, 144666, 129990, 157942, 158486, 147955, 165504, 192248, 184060, 154920, 125928, 129906, 132791, 137114, 103015, 90300, 78278, 84823, 97816, 70745, 91767, 112218, 113565, 134571, 141836, 136539, 142300, 141973, 117585, 85821, 86806, 114809]
8011A14809K7070J0943j673J5362Q628L4414K3798L703Q0914O7402K4931M1078
7999D51379j3553p6844p0057l0961r759k2502j6494J4195J5948M9526M6937K0909
7987C58724m3944m1858k7063m4694o1461j9180j1618K0726j0955l7468k9877j6646
7975C4686O702M3388K8140r919K10J5004j6632q960J4031k393j189P266L961J3664
7961A27959J1607K4227K7597P1525L7217J6230j3878k1344N587j9663k3148m094
7949B39822j0243m364K6958M1560L533n0113l7822k8027l9341k9443j0489K920
7937A04951j1310r066M303J7655k6016j5388j5015l355N320J2443J2682o068o942
7924F4194J7891o180j8757q957N889K0137j7189J447L2203r537N665J1069K4021
$$ y = [114809, 141879, 152822, 151149, 166511, 175139, 209553, 233351, 237054, 317968, 385370, 410301, 451379, 437826, 360982, 290925, 259964, 250205, 227703, 211209, 225404, 241352, 290878, 337815, 358724, 314780, 272922, 245859, 201165, 139704, 120524, 108906, 129632, 118677, 81209, 51332, 34686, 41388, 84776, 112916, 102997, 103207, 118211, 101579, 92619, 106650, 104257, 103068, 110334, 114295, 127959, 139566, 163793, 191390, 262915, 300132, 316362, 302484, 281140, 286727, 267064, 243916, 239822, 229579, 225215, 252173, 293733, 297266, 247153, 209331, 181304, 141963, 112520, 102031, 104951, 93641, 84575, 88878, 106533, 80517, 65129, 50114, 46759, 52079, 64522, 77204, 71136, 64194, 82085, 75905, 57148, 48191, 54080, 74217, 57028, 58475, 90678, 81141, 86806, 97875, 121896]
7911A21896p569m1053k971N452K0890q84j2373O801n0237l8731J2931q112J3614
7898A9654J222O571n880K3375N871k3646J4168j2408l2778l719K507K3747j146
7885A7538k1407k4669M5165L7530M337j2872j1657m8572l4940J5671J1277K8060
7873E461J7994j4135j9875J0203P793O58P859J4062m820k7300N155p155k5533
7860b9633K220K3053n032q725j121J8660j210n037J1711o374P093M4231K7396
7847G7232j0522n1788n3085p138M7390L6927m6795k6725L2371j3937q723K747
7835b2046r741N453l4j3081J1961K4132K2622k7016k7365l719r354p655J5612
7822d0231M5045l436k0731N700J4358p440q07l1395N559J5356K8275P677j0584
$$ y = [121896, 114327, 73274, 70303, 75755, 96645, 95761, 83388, 90189, 39952, 1221, 14152, 6040, 19654, 20876, 27447, 21567, 44942, 50813, 27167, 41335, 28927, -3851, -7570, -5063, 18684, 17538, -3869, -28538, 16627, 54157, 58494, 45622, 33965, -14607, -49547, -33876, -22599, 5461, 23455, 9320, -10555, -352, 7441, 8099, 15958, 30020, 25200, -2100, 3055, -4100, -29633, -27413, -4360, -9392, -18117, -19238, -578, -1788, -6825, 4886, -1488, 5605, 49836, 77232, 66710, 14922, -38163, -45301, 2089, 39016, -7779, -34504, -2133, -16070, -24793, -22046, -31787, -26334, -26368, -39449, -27488, -3356, 19266, -7750, -35115, -38834, -48188, -55843, -40231, 4814, 1378, -19353, -13653, 705, -6735, -7542, -38937, -33378, -18022, 10253, 17930, 7346]
7809G346k6199j2174M525j5323j3912M7851L5139m1218K3272k418m2291j2377
7797d7779K476N520l368L9685K2158j557L810n888m934k588K505k8776l7948l558
7783f0242K9158L2912k439k9485k5200J6079J1918p126K5959k9191P569O470L9358
7770A5740K6523L861l2346l002J1047j5003L9343P860l2566q955P352p38j8076
7757A040m634k2256j5454k3454O255J3951J4918J5622k319P615j3278j9109J0406
7744c0697K1329R493K3606K311j2096j0547k5042K4609l3935m6096L647L2481
7732d0937J1949L1298K9399j5402n885o737N664l0964J2327J2174j7111j2251
7720b6476p995q64L4328J9968L733r827r147J9224J8949j2154j2370k35j6368
$$ y = [7346, -18853, -31027, -26502, -41825, -55737, -7886, 27253, -13965, 9307, 6889, -35402, -47779, -45303, -39783, -43151, -3466, 18692, 17135, 20945, 15057, 10123, 7535, 10040, -18736, -56684, -60242, -31084, 1828, -611, -30096, -55296, -39217, -27299, -34425, -8466, -37657, -30088, -23618, 15740, 42263, 46124, 13778, 10776, 21823, 6820, 46163, 54023, 21457, 12502, 19854, 19116, 1040, -3594, -25850, -41304, -64758, -58503, -44552, -29634, -14012, -16331, -8716, -21994, -41103, -30697, -9368, 125, 23731, 26042, 13946, 3399, -21643, 2966, -30969, -77065, -73418, -40937, -28988, 2310, 31709, 16307, 10422, 3685, 9349, -21615, -9288, 2886, -14225, -26476, -34471, -35335, -1007, 18961, 22694, 12867, 3720, 22944, 41893, 29739, 17369, 17134, 766]
7707G66J0323Q297k0388l8746j6215J8519K8042J5319J4673j8305k175j1044R954
7694i80n1112l7129K9158M0445M5327L8723R794j9619O504q494k0109j2776j4632
7681E100r614K102k3336q378J8937K566j1831J1281J629p905N032l59L9745m443
$$ y = [766, 11089, 19386, -1002, -39748, -55963, -37444, -9402, 5917, 20590, 2285, 110, -10934, -980, -52092, -89221, -60063, -19618, 25709, 64432, 74226, 54607, 61111, 52617, 32508, 19732, 5100, -4514, -2412, -25748, -34126, -15189, -12623, -24454, -13173, -11544, -19449, -14417, -14776, 24969, 20526]
$$ [...]
##END NTUPLES=NMR SPECTRUM
##END=
