##TITLE=Analysis number 318606
Compound Code mo 07323
Project Code adrs
Chemist Name endeavour
##JCAMPDX= 6.0         $$ Bruker NMR JCAMP-DX V2.0
##DATA TYPE= NMR SPECTRUM
##DATA CLASS= NTUPLES
##ORIGIN= Bruker BioSpin GmbH
##OWNER= nmr
$$ XWIN-NMR		Version 3.5
$$ Wed Apr  5 15:36:04 2006 GMT Daylight Time (UT+1h)  MAYBRIDGE\nmr@NMR_250MHZ
##.OBSERVE FREQUENCY= 250.131544655141
##.OBSERVE NUCLEUS= ^1H
##.ACQUISITION MODE= SIMULTANEOUS (DQD)
##.ACQUISITION SCHEME= undefined
##.AVERAGES= 16
##.DIGITISER RES= 18
##SPECTROMETER/DATA SYSTEM= dpx250
##.PULSE SEQUENCE= zg30
##.SOLVENT NAME= DMSO
##.SHIFT REFERENCE= (INTERNAL, DMSO, 0, 16.522)
##AUDIT TRAIL= $$ (NUMBER, WHEN, WHO, WHERE, WHAT)
$$ ##TITLE= Audit trail, XWIN-NMR		Version 3.5
$$ ##JCAMPDX= 5.01
$$ ##ORIGIN= Bruker BioSpin GmbH
$$ ##OWNER= nmr
$$ C:\u/data/dgb/nmr/ADRS/2160/pdata/1/auditp.txt
$$ ##AUDIT TRAIL=  $$ (NUMBER, WHEN, WHO, WHERE, WHAT)
(   1,<2006-04-05 15:35:39.76 +100>,<MAYBRIDGE\nmr>,<NMR_250MHZ>,
      <created by zg, POWCHK disabled, PULCHK disabled
       configuration hash MD5:
       84 BC 41 DB A1 6E 1D 46 DA 25 12 A5 C1 ED C5 3A
       data hash MD5: 64K
       77 EA 3A 1F 25 95 A2 D1 8F A3 4C 44 09 7D 0C F9>)
(   2,<2006-04-05 15:35:53.71 +100>,<MAYBRIDGE\nmr>,<NMR_250MHZ>,
      <Start of raw data processing
       ef LB = 0.3 FT_mod = 6 PKNL = 1 SI = 32K 
       data hash MD5: 32K
       BA 36 74 E1 56 F6 29 5D 6A 33 68 AD 79 95 D8 40>)
(   3,<2006-04-05 15:35:55.37 +100>,<MAYBRIDGE\nmr>,<NMR_250MHZ>,
      <apk 
       data hash MD5: 32K
       84 86 31 83 19 D9 7F 20 CF 3A BB 75 76 E8 91 FE>)
(   4,<2006-04-05 15:35:56.16 +100>,<MAYBRIDGE\nmr>,<NMR_250MHZ>,
      <abs ABSG = 5 
       data hash MD5: 32K
       6A 93 ED BF 74 42 45 35 39 C5 14 62 CB 35 27 37>)
$$ ##END=
$$ 
$$ hash MD5
$$ 87 7E 25 5B B8 8C FC 49 58 E7 D4 68 1B 1D 16 88
##$RELAX= 
##$RELAX= 
##$RELAX= 
##$RELAX= 
##$RELAX= 
##$RELAX= 
##$RELAX= 
$$ Bruker specific parameters
$$ --------------------------
##$DU= <C:\u>
##$EXPNO= 2160
##$NAME= <ADRS>
##$PROCNO= 1
##$TYPE= <nmr>
##$USER= <dgb>
##$AMP= (0..31)
100 100 100 100 100 100 100 100 100 100 100 100 100 100 100 100 100 100 
100 100 100 100 100 100 100 100 100 100 100 100 100 100 
##$AQSEQ= 0
##$AQ_mod= 3
##$AUNM= <au_zg>
##$AUTOPOS= <51 >
##$BF1= 250.13
##$BF2= 250.13
##$BF3= 250.13
##$BF4= 250.13
##$BF5= 500.13
##$BF6= 500.13
##$BF7= 500.13
##$BF8= 500.13
##$BYTORDA= 1
##$CFDGTYP= 0
##$CFRGTYP= 5
##$CHEMSTR= <none>
##$CNST= (0..31)
1 1 145 1 1 1 1 1 1 1 1 1 1 1 1 1 1 1 1 1 1 1 1 1 1 1 1 1 1 1 1 1 
##$CPDPRG= <>
##$CPDPRG1= <>
##$CPDPRG2= <>
##$CPDPRG3= <>
##$CPDPRG4= <mlev>
##$CPDPRG5= <mlev>
##$CPDPRG6= <mlev>
##$CPDPRG7= <mlev>
##$CPDPRG8= <mlev>
##$CPDPRGB= <>
##$CPDPRGT= <>
##$D= (0..31)
0 1 0 0 0 0 0 0 0 0.06 0 0 0 0 0 0 0.0002 0 0 0 0 0 0 0 0 0 0 0 0 0 0 
0 
##$DATE= 1144247738
##$DBL= (0..7)
120 120 120 120 120 120 120 120 
##$DBP= (0..7)
150 150 150 150 150 150 150 150 
##$DBP07= 0
##$DBPNAM0= <>
##$DBPNAM1= <>
##$DBPNAM2= <>
$$ [...]
##$SUBNAM7= <"">
##$SUBNAM8= <"">
##$SUBNAM9= <"">
##$SW= 20.6930455092707
##$SWIBOX= (0..15)
0 0 3 0 0 0 0 0 0 0 0 0 0 0 0 0 
##$SW_h= 5175.983436853
##$TD= 65536
##$TD0= 1
##$TE= 295.16
##$TE2= 300
##$TE3= 300
##$TEG= 300
##$TL= (0..7)
0 120 120 120 120 120 120 120 
##$TP= (0..7)
150 150 150 150 150 150 150 150 
##$TP07= 0
##$TPNAME0= <>
##$TPNAME1= <>
##$TPNAME2= <>
##$TPNAME3= <>
##$TPNAME4= <>
##$TPNAME5= <>
##$TPNAME6= <>
##$TPNAME7= <>
##$TPOAL= (0..7)
0.5 0.5 0.5 0.5 0.5 0.5 0.5 0.5 
##$TPOFFS= (0..7)
0 0 0 0 0 0 0 0 
##$TUNHIN= 0
##$TUNHOUT= 0
##$TUNXOUT= 0
##$USERA1= <user>
##$USERA2= <user>
##$USERA3= <user>
##$USERA4= <user>
##$USERA5= <user>
##$V9= 5
##$VALIST= <valist>
##$VCLIST= <CCCCCCCCCCCCCCC>
##$VD= 0
##$VDLIST= <DDDDDDDDDDDDDDD>
##$VPLIST= <PPPPPPPPPPPPPPP>
##$VTLIST= <TTTTTTTTTTTTTTT>
##$WBST= 1024
##$WBSW= 4
##$XGAIN= (0..3)
0 0 0 0 
##$XL= 0
##$YL= 0
##$YMAX_a= 268154
##$YMIN_a= -323564
##$ZGOPTNS= <>
##$ZL1= 120
##$ZL2= 120
##$ZL3= 120
##$ZL4= 120
##$ABSF1= 16.522
##$ABSF2= -4.171173
##$ABSG= 5
##$ABSL= 3
##$ALPHA= 0
##$AQORDER= 0
##$ASSFAC= 0
##$ASSFACI= 0
##$ASSFACX= 0
##$ASSWID= 0
##$AUNMP= <proc_1d>
##$AZFE= 0.1
##$AZFW= 0.1
##$BCFW= 0
##$BC_mod= 0
##$BYTORDP= 0
##$COROFFS= 0
##$CY= 12.5
##$DATMOD= 1
##$DC= 0
##$DFILT= <>
##$DTYPP= 0
##$F1P= 14.0000005364418
##$F2P= -0.99999901652339
##$FCOR= 0.5
##$FTSIZE= 32768
##$FT_mod= 6
##$GAMMA= 0
##$GB= 0
##$INTBC= 1
##$INTSCL= 1
##$ISEN= 128
##$LB= 0.3
##$LEV0= 0
##$LPBIN= 0
##$MAXI= 10000
##$MC2= 0
##$MEAN= 0
##$ME_mod= 0
##$MI= 0
##$NCOEF= 0
##$NC_proc= -5
##$NLEV= 6
##$NOISF1= 0
##$NOISF2= 0
##$NSP= 0
##$NTH_PI= 0
##$NZP= 0
##$OFFSET= 16.522
##$PC= 1
##$PHC0= 162.3861
##$PHC1= 13.01251
##$PH_mod= 1
##$PKNL= yes
##$PPARMOD= 0
##$PSCAL= 4
##$PSIGN= 0
##$REVERSE= no
##$SF= 250.13
##$SI= 32768
##$SIGF1= 0
##$SIGF2= 0
##$SINO= 400
##$SIOLD= 32768
##$SREGLST= <1H.DMSO>
##$SSB= 0
##$STSI= 32768
##$STSR= 0
##$SW_p= 5175.98343685301
##$SYMM= 0
##$S_DEV= 0
##$TDeff= 65536
##$TDoff= 0
##$TI= <Analysis number 999999
Compound Code 99
Book Reference 9
Project Code 9>
##$TILT= no
##$TM1= 0
##$TM2= 0
##$TOPLEV= 0
##$USERP1= <user>
##$USERP2= <user>
##$USERP3= <user>
##$USERP4= <user>
##$USERP5= <user>
##$WDW= 1
##$XDIM= 32768
##$YMAX_p= 427748963
##$YMIN_p= -1351364
$$ End of Bruker specific parameters
$$ ---------------------------------
##NTUPLES= NMR SPECTRUM
##VAR_NAME=  FREQUENCY,     SPECTRUM/REAL,   SPECTRUM/IMAG
##SYMBOL=    X,             R,               I
##VAR_TYPE=  INDEPENDENT,   DEPENDENT,       DEPENDENT
##VAR_FORM=  AFFN,          ASDF,            ASDF
##VAR_DIM=   32768,         32768,           32768
##UNITS=     HZ,            ARBITRARY UNITS, ARBITRARY UNITS
##FACTOR=    0.157963299565203, 1,           1
##FIRST=     4132.6476996994, 0,             0
##LAST=      -1043.33573715361, 0,           0
##MIN=       -1043.33573715361, -1351364,    0
##MAX=       4132.6476996994, 427748963,     0
$$ Real data points
##PAGE= N=1
##DATA TABLE= (X++(R..R)), XYDATA
$$ [...]
15534A85133k46097j6169Q9685O0253M7986k9617j12521l98734K48927K24337
15524E3183p4120m63094K17928J91898j0863k88879k05837J6436k35894N4943
15514g44299K75367L13056L7384Q4739M30143j84446n7110K31799l44368l66972
15504c24707j92842k0673q6449j59756L07913r433P1749J78596k1842K37139J23722
15493A03417N4587m647k31110r4383l8953L88900L13101l9318J3056j03502m52795
15482i1647j70689K58611J21740j04381j33340K05439J70324j38150k63365o4092
15472b09550L40419n2405L8812L30945R5136j83563j97681R5149q0344M388Q9658
15461B70964k012k2705k42442k40031J66969K09654K40989k37854k63355j6640
$$ y = [185133, -60964, -77133, 12552, 72805, 120791, 91174, -21347, -420081, -171154, 53183, -20937, -484031, -266103, -74205, -85068, -373947, -579784, -563348, -799242, -744299, -468932, -155876, -118492, -33753, 396390, 211944, 154834, 386633, 42265, -324707, -517549, -538222, -624671, -784427, -476514, -485947, -414198, -235602, -257444, -20305, 103417, 158004, 153357, -77753, -172136, -211089, 177811, 490912, 451594, 464650, 361148, -91647, -262336, -3725, 118015, 13634, -119706, 85733, 256057, 117907, -145458, -209550, 130869, 78464, 117276, 448221, 543357, 359794, 162113, 257262, 176918, 181306, 270964, 268952, 246247, 3805, -236226, -69257, 140397, 381386, 143532, -119823, -136463]
15451a36463j15718j25842J47829J93704K97535L55580m2331k92750m62165k17303
15441c97924q4059K98940R905j21772l11661k20093j96445K92790N08635J01655
15431a20029J52921l1033k98981J39718p8998J78149l26626l59923O261K58406
15421d80135k1223Q2359K74208k0154o1590j45100K5753L13530P5783M6037k23314
15410a33846M30302K25737l0334j96573j69146l6289r5661j13696m62290J7669
15400e64127L91668J33503M5285q2580J16457o5202o4348J5765K38741j78094
15390a2932j67258O7810l9074l04509n2691J78872L74257J09586J35219j98458
15380I0822j49584l20127O097J78812n1902j45427K01812L87866L15074m64250
$$ y = [-136463, -252181, -378023, -230194, -36490, 261045, 616625, 574294, 281544, -180621, -397924, -481983, -183043, -173138, -294910, -606571, -826664, -1023109, -730319, -221684, -120029, 32892, 1859, -297122, -157404, -236402, -58253, -384879, -744802, -738541, -480135, -501358, -418999, -144791, -164945, -226535, -371635, -345882, -32352, 43431, 89468, -133846, 296456, 522193, 491859, 295286, 126140, 89851, -5810, -119506, -581796, -564127, -172459, -38956, 6329, -76251, 40206, -24996, -89344, -73579, 165162, -12932, -180190, -112380, -151454, -455963, -508654, -329782, 44475, 154061, 289280, 90822, -58762, -378889, -372792, -193980, -245882, -391309, -189497, 198369, 513443, 49193]
15370D9193j29651J32560n2546o2122J66189Q8995j51706J15689k703N9188L8343
15359B51429J4321j00145K66567k46392k14538k6890N8700j11987n7321j25088
15349b91344k6716J47566J32821L42630p5924O8341o4253J01111K75561l04195
15339C05598m39187J21090J09232k37508J89791L35927j50254j54106M7909J73310
15329C01802j08529k13801J95216k980k81931j98903L8169r2269J79191Q1590
15319a02445Q1315J78041K12523R991k80686l73582J87071J75422j23951r0273
15309a26574K8623p8382J34552L47710k59469l71163J87372J90337M5805J82360
15299B81171r5605J40385J18253l46155J23285j02799j93771L31297o0167J9425
$$ y = [49193, -80458, 52102, -444, -62566, 103623, 192618, 40912, 156601, 153898, 213086, 251429, 265750, 165605, 432172, 185780, -28758, -55648, 3052, -108935, -166256, -291344, -318060, -170494, -37673, 304957, 229033, 297374, 233121, 334232, 609793, 305598, -133589, -12499, 96733, -140775, 49016, 384943, 234689, 80583, 128492, 301802, 193273, -20528, 174688, 171708, -110223, -309126, -270957, -363226, -184035, -102445, -21130, 156911, 369434, 379425, 98739, -274843, -87772, 87650, -36301, -126574, -97951, -176333, -41781, 305929, 46460, -324703, -137331, 53006, 98811, 281171, 185566, 325951, 444204, 98049, 221334, 118535, -75236, 256061, 195894, 215319]
15289B15319j95776j52535k12149l98359M1250M96829M16783j00639j81559M60682
15279C89846J07981j40271m79476J63618J47046J36135j63691Q3325J91281k09339
15269B26455k36954p4309q6868J49228K92665K00558J85020k61589m54733M512
15259e6015Q7838k43695j13609L41342L58908n9689q2935L3996J35628m6798k08611
15248A46360p5357o1919m913j229K39039J4410P5387l93629k37503j04592l3928
15237d37874j4576M5746J10647M05158J89311l34024l06225N6987k2559n3030
15227c60439J32450L43003k15145j18576J37938K52452j56721J08600k1397k42422
15217a40257O5131K39082m7037j36620M1883n4787k28265o2694N7539K00386p9992
$$ y = [215319, 19543, -132992, -345141, -743500, -702250, -205421, 211362, 110723, -70836, 389846, 497827, 357556, -121920, 41698, 188744, 324879, 161188, 244513, 435794, 226455, -10499, -84808, -171676, -22448, 270217, 470775, 655795, 394206, -60527, -56015, 31823, -211872, -325481, 15861, 374769, 315080, 232145, 266141, 401769, 354971, 146360, 71003, 9084, 4171, 2942, 241981, 256391, 331778, -61851, -299354, -403946, -437874, -452450, -406704, -296057, 109101, 298412, -35612, -341837, -284850, -307409, -360439, -227989, 115014, -100131, -218707, -80769, 171683, 14962, 123562, 102165, -140257, -75126, 163956, 116919, -19701, 22182, -32605, -260870, -323564, -266025, -65639, -145631]
15206a45631j34239K38542K6272q9070l82795r5322K58004K79850m469n49556
15196e98414j90211L65016J04520l3442j89206J95350J64717r8726j29049K62663
15186a46782J74584j49958n5453j25755J29952K49847l7005K9668R4541j17500
15176D6139n212j5258j81235j73116K4751j93223j88482K30098K01417K73914
15166A9793l1670m14238k19234K27423K81063Q25714K39665n06131m13356K8251
15156C7280P8704p2987J26873J55005Q92Q649m53653j25056K41416N57551Q5551
15145F40225j08169k48352k03739J8615m6578j95463j24424l22045k12253N69774
15135b32409O11529j32251q5440l03072k68275K1095j68484J76541L2008Q3123
$$ y = [-145631, -279870, -41328, -15056, -104126, -486921, -582243, -324239, -44389, -48858, -598414, -788625, -423609, -319089, -352531, -541737, -346387, -181670, -280396, -409445, -146782, 27802, -122156, -177609, -303364, -173412, 76435, 39430, 69098, 163639, 46139, 40927, 25669, -155566, -328682, -303931, -497154, -685636, -455538, -254121, 19793, -11877, -426115, -645349, -417926, -136863, 688851, 928516, 422385, 9029, 37280, 115984, 42997, 169870, 324875, 325767, 334416, -119237, -244293, -2877, 554674, 640225, 532056, 283704, 79965, 98580, 52002, -143461, -267885, -589930, -802183, -232409, 379120, 246869, 161429, -141643, -409918, -388823, -557307, -380766, -348758, -265635]
15125b65635J03458K08923l38408j45452L66742O3559N9910m3321J43719K62938
15115D16433j21614l2441l59340k24003K04670r7314l5051j57264J70127K71794
15105C5997J83472l47206l32843P9917j33539j04994K9062Q6853K48860O1360
15095a93061J4781j4674J85038L01521q2817j42949j35237j40766J51145R3626
15085C6607K33560M16704J38184l9135k21173j66763o2041o21974o4214J30469
15075b19776j39047R0724m9114M64288J69053k94324l54201l3140j40023j91367
15065f96927L13293J28186k7442J66292L39741n7686l85394k25056K35727K98984
15055H9718P0012j5515k9688j84787J40315M16049k04242n00011p5063j1711J38932
$$ y = [-265635, -162177, 46746, -291662, -437114, -70372, -6813, 53097, 9776, 153495, 416433, 294819, 262378, -96962, -320965, -116295, -213609, -248660, -405924, -235797, 35997, 219469, -127737, -460580, -380663, -514202, -619196, -590134, -503281, -254421, -193061, -178280, -192954, -7916, 293605, 210788, 67839, -67398, -208164, -57019, 36607, 270167, 686871, 825055, 785920, 564747, 397984, 335943, -286031, -350245, -219776, -358823, -268099, -317213, 147075, 316128, 21804, -332397, -365537, -505560, -696927, -383634, -255448, -282890, -116598, 223143, 165457, -219937, -444993, -209266, 89718, 159730, 144215, 114527, -70260, 70055, 486104, 281862, -218149, -293212, -304923, -165991]
15044a65991k3432j78015k8503J82157k7707l43786J04838Q3593K964K14586K26749
15033D7453k6527M51410J0426j87584K01883n2932j82699Q1502J5670k52523l08292
15022b02213J30351O4666K58427j06388j09948j01872k33229J66331k21085m4478
15012c99438L08632J72447J25872n3889j58524k9009m01052k06860l2482j30968
15002h05271M18550K36148N9784M8314K4116m01017J83277K0291K88868R0930
14992A63990J31368R8531j56332n6453j49398j41797j18447j59527q910J72650
14982b24325J31118J46280j1026m31307j75416K98042J37845j2725J74553L92807
14972D25846J53544n65070j16140M465l01666j98476R1407N25301R3058k65391
$$ y = [-165991, -189423, -367438, -395941, -213784, -241491, -585277, -480439, -396846, -393882, -179296, 47453, 20926, 472336, 482762, 295178, 497061, 444129, 261430, 342932, 358602, 106079, -202213, -71862, -7196, 251231, 144843, 34895, -66977, -300206, -133875, -354960, -399438, -90806, 81641, 207513, 153624, -4900, -33909, -434961, -641821, -674303, -805271, -386721, -150573, -90789, -42475, -18359, -419376, -236099, -215808, 73060, 163990, 295358, 393889, 237557, 181104, 31706, -110091, -228538, -388065, -396975, -224325, -93207, 53073, 42047, -389260, -564676, -266634, -128789, -141514, 33039, 425846, 579390, 14320, -101820, -97355, -399021, -597497, -506090, 19211, 112269, -153122]
14962a53122J65124L76472K797R5472K22628K21466k63204k42811j80236q9753
14952A54833K55820L7127m3813j1083r8533k01483k76866q9483K31190M1117j76250
14941a77424k88140J43534K68622J28311o2535j212L2424K31265J46767J68842
14931E90454j21545k75690l97396j63302K32966K20121K4763j72345m9007K16431
14921A05450n07594m96731K69117K78944L05413J75756J08062J27298m25904m85843
14911e46032R6055N8181M4948J12215R8727j53912j92189j12650M46208K9869
14901a18580l43070k52937l18662K4365K54207M20241k52005Q5073K40830O9342
14891a91196r3843L97799M14344m13484p2029M70333j59985l26357m0470j31729
$$ y = [-153122, 12002, 388474, 391271, 486743, 709371, 930837, 667633, 424822, 244586, 154833, 410653, 447780, 403967, 392884, 294351, 92868, -183998, -273481, -42291, -1174, -177424, -465564, -322030, -53408, 74903, 12368, 11156, 43580, 274845, 421612, 590454, 468909, 193219, -204177, -367479, -134513, 85608, 110371, -61974, -110981, 105450, -402144, -898875, -629758, -350814, -45401, 130355, 238417, 365715, -60189, -546032, -449977, -391796, -346848, -234633, -135906, -289818, -482007, -594657, -148449, -118580, -461650, -714587, -1033249, -1008884, -754677, -334436, -586441, -501368, -260538, -191196, -285039, 112760, 527104, 113620, 41591, 511924, 351939, 25582, -14888, -146617]
14881a46617K4903j00618k61310o5885L22103J8365j15896K61824K29825k71720
14871a05026j23288R7201L56089m10592k32824P6361J74376Q8110k43561l62760
14861f85914k9202J72503n2313Q6654k37605j19036J70008J08906K54187j78880
14851e10692q0660j42673j6743q4014O4690K26390J69130k28929k84603J79528
14841g08576j69901n0454J13772L34022R4954J43784L24318l9978J68375l26967
14831a16651q1218O34641P8517J01831j63432l50471j70536L08005L6645k20052
14821E7279l87733q329K89090J46947l28595m0415J41416J34331J90430K3857
14811B18278k11399j90819O7422M5699R1176J98463j10693n44005K7578L91753
$$ y = [-146617, -121714, -222332, -483642, -549527, -227424, -209059, -324955, -63131, 166694, -105026, -228314, -131113, 224976, -185616, -418440, -342079, -167703, -79593, -323154, -685914, -715116, -542613, -594926, -508272, -745877, -864913, -694905, -585999, -331812, -510692, -591352, -734025, -750768, -834782, -770092, -543702, -374572, -603501, -888104, -708576, -878477, -928931, -815159, -481137, -386183, -242399, 81919, 41941, 210316, -116651, -197869, 436772, 515289, 617120, 453688, 103217, -67319, 240686, 277331, 57279, -330454, -338783, -49693, 97254, -231341, -271756, -130340, 3991, 194421, 218278, 6879, -183940, -116518, -70819, 20357, 218820, 108127, -435878, -408300, -16547]
14801a6547q4060m11356Q3990R0769k4542k16669P7616j82903O2754L23734K9701
14790b67513P1059K53893n4895m4779j5230R276K07135J24857l87885j05817R6519
14779a13380j09636o8592k24517n60345N02035K65828M3033J81363J52500j30789
14769f2500j35723K05291m0102j21523q5313j1488O9160N9499k61699k73888n3819
14758g12105N46996L54422q365J16348k43954l07716J35177n8799n6359j4292
14748b48647L71683m05531l93064K87462J18247J98179J08184j5376k44023r9703
14738c22589J81049K4996j58328K77597K61188j23501j38491q9903k10857J2998
14728b85841j48899j8206J02804Q2457J47748J20805L72820L5765j55137r4802
$$ y = [-16547, -100607, -511963, -427973, -337204, -361746, -578415, -500799, -683702, -620948, -297214, -267513, -196454, 57439, 2544, -42235, -57465, -48189, 158946, 283803, -104082, -209899, -113380, -223016, -291608, -516125, -1076470, -574435, -308607, -265574, -84211, 68289, -62500, -198223, 7068, -33034, -154557, -239870, -251358, -182198, -122699, -384398, -658286, -712105, -165109, 189313, 180948, 297296, 53342, -254374, -119197, -177996, -234355, -248647, 123036, -282495, -675559, -388097, -269850, -71671, 36513, 21137, -222886, -322589, -141540, -116544, -274872, 2725, 263913, 140412, 1921, -87982, -298839, -285841, -434740, -452946, -350142, -267685, -119937, 868, 373688, 409453, 254316, 159514]
14718A59514k51134j53910Q7263J43634r2144k57552J18839M34156L51859j78528
14708C61997M1332M7559j16775j44465l93878k62522J62532N31177l7037j48163
14698D1757O0684j24761j94156K7309J4487k42025K02199L09975R4925l3363j77810
14687b0779j67171l8579k20227L41884J41554k33327k35121j35722J06646J20769
14677c40073N81961J10926r4709l51922l07176r0039J51732j46675K16644K90788
14667B1457j52528M6538K72464L37255k99028j75256J12812n2552K78010J05397
14657D94569l87741n32887j85234K26690L09334P3984K40910j9520m25174m71467
14647f76536j34841K13455L79728N48767k61455l61111k44929N4188m9837K69437
$$ y = [159514, -91620, -245530, -158267, -14633, -106777, -364329, -245490, 188666, 540525, 361997, 403329, 450888, 334113, 189648, -204230, -466752, -304220, 226957, 189920, 41757, 102441, -22320, -216476, -189167, -174680, -416705, -214506, 95469, 190394, 157031, -20779, -187950, -226529, -446756, -104872, 36682, -196645, -431766, -567488, -460842, -340073, 241888, 352814, 258105, -93817, -400993, -491032, -339300, -485975, -269331, 21457, -131071, -84533, 187931, 525186, 226158, 50902, 163714, 111162, 389172, 494569, 106828, -426059, -611293, -384603, -75269, -1285, 239625, 220105, -205069, -676536, -811377, -597922, -218194, 330573, 69118, -291993, -536922, -482734, -532571, -263134]
14637b63134K87830J34762J25752P3269m27032p3074k0876J81543J96410l12673
14627i7223j60513K48683K36645j7628N4617J70517n4572k17911j55952m4977
14617c8314K41001q6501J48123L92224J5557l74667k35949j64944k65793K57848
14607a11415j51520J35727p1243n99798k37994K94245O0717l449L72912K70331
14597d1487K856K42342J95801M2230j28106k23627J28901m5959J68015p4864n67094
14586c00992k96365L26139J70276j89258L20514J20156l93328k49558Q362M11230
14576g2824M46006m83665j69792J11085J0758J55746m1172J09179L2670j67356
14566f9365k04872j17029L19343j9466k53777R511J2777k55687O3655J63880K10704
$$ y = [-263134, 24696, 159458, 285210, 358479, -68553, -141627, -162503, 19040, 215450, -97223, -257736, -9053, 227592, 209964, 264581, 435098, 380526, 162615, 6663, -38314, 202687, 116186, 264309, 656533, 672090, 297423, 61474, -103470, -369263, -111415, -262935, -127208, -198451, -798249, -1036243, -741998, -681281, -684730, -311818, -41487, -38631, 203711, 399512, 441742, 313636, 90009, 218910, 172951, 340966, 266102, -300992, -597357, -271218, -100942, -290200, 30314, 150470, -242858, -492416, -484054, -72824, 373182, -110483, -280275, -169190, -158432, -2686, -43858, 65321, 97991, -69365, -274237, -391266, -71923, -91389, -345166, -335655, -322878, -578565, -514910, -351030, -140326]
14555a40326J53811j36106j52371j68579L35645M47150L32738l22987r5732j7484
14545B35759l47477m01676m65665j99349J71012J82602M31612l4739R6272q3781
14535d15430J24796J81318k07318k58402R373K64110J35114k2807J24861k43002
14525c07387M6653L52604k25442k5682P6349L6022P2984j20081o3611J3154k84474
14514d28911L1447J82579j96026Q6420K72308K8852l29036O7178L71351n0062
14504C6100k22659K67605K72119O3601j74544l44115q6505M8606J23036K66628
14494B49872J33955k46695n59976m61282L46018M21769o2415j53346J08001l8983
14484b63082j33644L97516J41060k5018j02115j26607j76091N01806L59187o13021
$$ y = [-140326, 13485, -122621, -274992, -443571, -107926, 339224, 671962, 348975, 253243, 235759, -111718, -513394, -979059, -1178408, -1007396, -824794, -393182, -427921, -331649, -415430, -290634, -109316, -316634, -575036, -565663, -301553, -166439, -189246, -64385, -307387, -260734, 91870, -133572, -159254, -82905, -46883, 26101, -93980, -157591, -144437, -428911, -397464, -214885, -410911, -324491, -52183, -23331, -352367, -285189, 86162, 36100, -186559, 81046, 353165, 416766, 242222, -101893, -188398, -139792, -16756, 249872, 383827, 137132, -422844, -884126, -538108, -116339, -178754, -332100, -224099, -263082, -396726, 790, 141850, 116832, 14717, -111890, -287981, 213825, 573012, -40009]
14474d0009J1817K37096K0623K49570j17036l41180M4486l77105l6153L33928
14464a3963J21700J95762J49072q6838j22847M9825j63563L6162l43978j48364
14454c27032K03021k39975r3993K00468K41708J17500m32622j10252q5958O6303
14444d60832M60729l9138l8367k04799j87837j99346N1432n7716K55876O05401
14434A85403N5849j63972j45804J1805J26297j24632k64958J77978L15594J56410
14424C29970J40743k6101j31975J06810J37707K82504Q9336k70110m72767n8172
14414A27945N6812L04830K14076l08798J87962J4846k34879k59442r5442R2267
14404A00177k98615K94689L39825j70559J75629k50095l51743L3380L4746l33259
$$ y = [-40009, -28192, 208904, 229527, 479097, 362061, 20881, 65367, -311738, -347891, -13963, 107737, 303499, 452571, 365733, 242886, 292711, 129148, 165310, -178668, -327032, -124011, -363986, -457979, -257511, -15803, 101697, -330925, -441177, -527135, -460832, -103, -39241, -77608, -282407, -470244, -669590, -618158, -675874, -419998, 185403, 241252, 77280, -68524, -56719, 69578, -55054, -320012, -142034, 173560, 329970, 470713, 444612, 312637, 419447, 557154, 839658, 928994, 658884, 186117, 127945, 184757, 489587, 703663, 394865, 582827, 597673, 362794, 103352, 7910, 100177, -198438, 96251, 436076, 265517, 441146, 191051, -160692, -127312, -92566, -425825]
14394d25825n3138K42002j63429n0474M98418L84909L7213j32761P1796j89600
14384B19111k24295O8169k11730K892k18697j01005J05291J44782K2967N1543
14374a40972K81737N4724l72097j75778P4988J57511j05602j65207K99423K44130
14364A52857O5317j85330K13678L29093k16974l61766l40427k05315K97230K63025
14354A1388M05672j19199l33815L3233K0888N6895r2651k19770l61518l08539
14344i07416K23433L71353L1185j31847N85290O38610j00059o29989J00728K4
14334A81312m06489l56037J47235k4100J42203J03489j43091J98784L02221j10679
14324C4848k44811J68503j91854J64477n3193j73967L3402l23488r1422n9571
$$ y = [-425825, -478963, -236961, -400390, -450864, 47554, 432463, 469676, 336915, 408711, 219111, -5184, 62985, -148745, -145853, -364550, -465555, -360264, -215482, -192515, -140972, 140765, 195489, -176608, -352386, -277398, -119887, -225489, -390696, -91273, 152857, 218174, 32844, 246522, 575615, 358641, -3125, -343552, -548867, -251637, 11388, 417060, 297861, -35954, -2721, 18167, 75062, -17589, -237359, -598877, -907416, -683983, -312630, -281445, -413292, 171998, 810608, 710549, 80560, 181288, 181312, -225177, -581214, -433979, -458079, -315876, -212387, -355478, -156694, 145527, 34848, -209963, -41460, -233314, -68837, -122030, -295997, -262595, -586083, -677505, -737076]
14314g37076K77427K71931J29379K13515J17635K59737q1942N2465j99416j50033
14304A53622K28153l84251j82872J15360N4739M9897j29677j04757j13716k82730
14294e96232K2210L87077P7815P6271k31199l94563K40983N18716N0875l12747
14284a60794l81668m08355J96708M41564K4876r1319M682K69062K21890J45433
14274B62079M20215k00158m33430k91529o2821k46947K20851P5364l11671J77261
14264c90786k1581j0636J43525k80069k55368J95895L02542J57502j87709J55127
14254a91558l667K8913K26798q6412R6558K55252J20506l41777k65939Q8217O5993
14243g116N5094J3390M06532q4012m08319J12325J06177k0479j22203j98535j51602
$$ y = [-737076, -459649, -187718, -58339, 155176, 272811, 532548, 450606, 503071, 303655, 153622, 381775, -2476, -185348, -69988, -15249, 34648, -95029, -199786, -313502, -596232, -574022, -186945, -109130, -32859, -264058, -658621, -417638, 101078, 151953, -160794, -542462, -950817, -754109, -312545, -287669, -378988, -374306, -105244, 116646, 262079, 682294, 482136, 48706, -242823, -305644, -552591, -331740, -256376, -568047, -390786, -412367, -423003, -279478, -559547, -814915, -619020, -316478, -158976, -346685, -191558, -195225, -166312, 60486, -25926, 70632, 325884, 446390, 104613, -161326, -73109, -7116, 47978, 61368, 467900, 383888, -24431, 87894, 194071, 173592, 51389, -147146, -298748]
14232b98748o2778k81370k08316K57784J38518J68383j9975m7674J82302m6162
14222b18036N3571J72247K04058J36164J14007l92135k832J55619l38866k76829
14212c93032J1781r8673K35963L30546Q7016j3019K15143K08177l0113J20013
14202F73802l68065j74570k11902l78280j96444k32644J4382M53570R6499J58671
14192a64981J73145J37740P7176J06934O8381k97811J67323K28510J9680j39845
14182C76252J49070J22n86792J77934l919j79448o8637M81106J07195K46486Q8694
14171G88063J09482l77739k59174J91233k59388k66073L88206L61688k33114n7185
14161C85999l00677k93600K85328J90307n5546K3695k5010j32473M59159K67518
$$ y = [-298748, -361526, -642896, -851212, -593428, -454910, -286527, -306502, -354176, -171874, -218036, -164465, 7782, 211840, 348004, 462011, 69876, 67044, 222663, -116203, -393032, -381251, -479924, -243961, 86585, 173601, 160582, 375725, 583902, 553789, 673802, 305737, 131167, -80735, -459015, -655459, -888103, -873721, -420151, -323652, -164981, 8164, 145904, 223080, 330014, 398395, 100584, 267907, 496417, 516097, 376252, 525322, 525444, -61348, 116586, 112667, -66781, -135418, 345688, 452883, 699369, 788063, 897545, 519806, 260632, 451865, 192477, -73596, 314610, 676298, 443184, 385999, 85322, -208278, 77050, 267357, 211811, 235506, 210496, 78023, 537182, 804700]
14151H04700j7145l34777n48709l09710p4590K26040M41667J65227j01591p8550
14141A72562l6612k05860J81238M11469K84051j72116j94869j45050q5626N235
14131B14422N6047l10985J98288K37664J47263k43174l09983j03006O4396j65334
14121b14402J65578M15221R3051k63211L7246j37639J85327L48116j08299m81332
14111C9656m7603L6599P7196Q2384k61799J06519L08444J7015j0171O2073q2847
14100C27466J6998J12426j1485j52517p8422L65825m6250k07150l68389J66627
14090A25129J07955m5391N212K4709j44366K51378n136J19864j78919p310M45103
14079F98228j49865m70274j61402J34590P62k49754k10389P7032J46454l0768
$$ y = [804700, 787555, 452778, -95931, -405641, -480231, -254191, 187476, 352703, 251112, 172562, 135950, -69910, 111328, 522797, 806848, 634732, 439863, 294813, 209187, 214422, 270469, -40516, 157772, 395436, 542699, 299525, -10458, -113464, -49068, -214402, -48824, 366397, 459448, 196237, 233483, 95844, 281171, 629287, 520988, 39656, -7947, 28652, 105848, 188232, -73567, 32952, 341396, 358411, 348240, 410313, 327466, 344464, 456890, 445405, 292888, 214466, 580291, 534041, 326891, -41498, 125129, 233084, 187693, 192905, 217614, 73248, 324626, 319490, 439354, 260435, 253125, 698228, 548363, 78089, -83313, 51277, 52039, -197715, -408104, -331072, -184618, -215386]
14069b15386l94074M87K28559L20862M88725j73754R8083j00160q082L3525k82536
14058c751l00485M07033R2443R9181o4954j90263J90643O9510j7849k2335O8081
14047C27254j5159O2029J77397k2085l34094k99078l39863J35050K29213J89273
14037A09937k8397M8410j11120j84340j84881O441K06842K43359j3611j88903
14027i6263P8348J75987n1697P8986J72590k53123k14635P5598r108K19447j32655
14016D3475J51940j64763q8541j91289N3680j23082o5468J03194l92519q5544
14006g58917k9396K32501K99554K89552l5217L1597N745j4176K19958j1676j04119
13995A25406J08705K2620m4926k09072j8896R3500k72656j43747Q0547M4931l76125
$$ y = [-215386, -609460, -608973, -380414, -59552, 429173, 255419, 353502, 253342, 245260, 278785, -3751, -304236, 102797, 195240, 294421, 229467, 39204, 229847, 299357, 281508, 259173, 327254, 312095, 374124, 551521, 529436, 195342, -103736, -443599, -308549, -79336, 109937, 81540, 129950, 18830, -165510, -350391, -343950, -137108, 106251, 92640, -96263, -17915, 158072, 106375, 185361, 357951, 104828, -109807, -34209, -43317, 176130, 43475, 195415, 30652, -57889, -249178, -195498, -318580, -384048, -280854, -673373, -758917, -788313, -555812, -256258, 33294, -1923, 29674, 35419, 21243, 241201, 229525, 125406, 234111, 256731, 211805, 2733, -16163, 77337, -195319, -339066, -258519, -213588, -589713]
13984e89713P1079K1397K09593N7144l25591m4138K76977l1548K04023j62655
13974c13432N7192K84940J80389k08565o0654k00017j08518J53755M8881J01328
13964f4701N2210o6765j21903j98339J73886O00381K58272J27338l59828q0377
13954C20174p0993l7584k83355o0991M6234L37142J76042K94507l44977o31793
13944b55594j84133J36561J28333J24165k1653q4736M19N7126l45424k76759J11124
13933f10571K93981J14784l8657J95666q5064M042O31356J96948J32428j78385
13923F56528n67204j90895j34811K90068k03655k94695J63864L57331m3279j12083
13913g8831j74058l05332j53720M26420L93441J75188J49926r7688l0387p7271
$$ y = [-589713, -518634, -497237, -287644, -230500, -556091, -600229, -323252, -354800, -150777, -313432, -256240, 28700, 209089, 524, -60130, -260147, -368665, -214910, -166029, -64701, -12491, -79256, -201159, -399498, -225612, 374769, 633041, 760379, 400551, 320174, 249181, 211597, -71758, -132749, -86515, 250627, 426669, 721176, 376199, -255594, -439727, -303166, -174833, -50668, -72321, -157057, -156638, -99512, -444936, -721695, -610571, -316590, -201806, -240463, -44797, -129861, -125819, 505537, 702485, 834913, 656528, 89324, -101571, -236382, 53686, -149969, -444664, -280800, 76531, 33252, -78831, -252889, -558221, -711941, -285521, 107920, 283108, 433034, 335346, 304959, 227688]
13903B27688j43225j96891J13580K13061K17530r7009k61653L4754j20246K65719
13893B53308K93472J53391l00258r4156M7027J44014j92399k45054K23987k17607
13883F5725k36166L8087J94426l90765R8311L45765j08650j48595M3516o8545
13873a66891j62012K61633K84082J18135O5830j89276k42411l93761M08515K10826
13863A94670p7382p9831r9365L6903J01248l73631l38609L11014j2882j3843L26306
13852b5402m256k98191k10133M65386J30259R9598K26046l18737k62455J89839
13842h046j93820j69545P1025L99261N1252l00294R3056o9708N182j03468J25636
13831i9469K33960K39441j0305j67752j6742Q7830j40712l86956j40410K39834
$$ y = [227688, 84463, -112428, 1152, 214213, 431743, 334734, 73081, 107835, -12411, 253308, 546780, 700171, 399913, 305757, 352784, 496798, 304399, 59345, 283332, 65725, -170441, -132354, 62072, -328693, -230382, 115383, 6733, -141862, -98346, -166891, -328903, -67270, 216812, 334947, 400777, 211501, -30910, -424671, -16156, 194670, 117288, 37457, -61908, -25005, 76243, -297388, -635997, -324983, -337865, -351708, -25402, -29658, -327849, -537982, -72596, 57663, 157261, 383307, 64570, -197885, -8046, -201866, -371411, -300386, 98875, 150127, -150167, -57111, -126819, -121637, -225105, -99469, 134491, 373932, 363627, 195875, 179133, 266963, 126251, -260705, -401115, -161281]
13821a61281Q9262j51248l48426j54512L20054J91130l63161L54310J70151J19151
13811F5430K02819J78544N009j15188J8125j87611Q4600L1126J77061k17171k32621
13800A0123m93141j04349M65974J14025p766J79726l45579K0525L7391m5007J10395
13789e7683Q7056J09100o6751Q7019r5636j05840q6255J02304L2385J03282K707
13778A11688l27209l36624L5874L08400M9928j65508J52837R073L107k23353l9368
13767d21155R5465o2581l86788o3441K61380J83370N6718M8374Q1537M4300j64976
13756c27797K8073L4282q549K60715L06370j93465j72195P8035K56927r4432k46642
13745g8678J9652Q7306m8032J52560J51405j31089J98603j5744K03930K24414
$$ y = [-161281, -72019, -223267, -571693, -726205, -406151, -215021, -578182, -223872, -53721, 65430, 268249, 446793, 451802, 336614, 354739, 167128, 251728, 282854, 459915, 242744, 10123, -483018, -587367, -121393, -7368, -15134, 164592, -180987, -160462, -123071, -168078, -57683, 29373, 138473, 71722, 158741, 63105, -42735, -128990, -26686, 5699, 108981, 111688, -215521, -552145, -516271, -207871, -157943, -323451, -170614, -161541, -158434, -381787, -421155, -325690, -388271, -775059, -838500, -577120, -393750, -337032, -288658, -207121, -162821, -327797, -299724, -265442, -273991, -13276, 293094, 99629, -72566, 5469, 262396, 167964, -78678, -59026, 28280, -19752, 132808, 284213, 153124, 351727, 335983, 539913, 764327]
13735G64327l28580j25442P2243k19761p0848L0828j08759k30670k30007m5944
13725d92613N9327K30333j33374p1017K25538J21845j18291J04876J00832K33598
13715B61054m02978k82687L13764N20653K02727l82601k50244m8356J53734o0578
13705B4488p7728J92063K06854J66170n9717K26275K45615j92881m47157m0679
13695B43303N20565M8962m13800n15150j48684K01124O7154k20849K149L47296
13685A32070K76974k19382q2720K5152L9600R2305m17860j23281J41257j18461
13675b54346k79082r7976J13840P4444M22814O4572k8692n3072j24681M8499j62178
13664b75858J17041J72968M9948k07002k14887k25295K10129K31121J95013n1684
$$ y = [764327, 435747, 310305, 382548, 162787, 91939, 122767, 14008, -216662, -446669, -492613, -433286, -202953, -336327, -407344, -181806, -59961, -178252, -73376, 27456, 261054, -141924, -424611, -110847, 409806, 612533, 229932, -20312, -68668, 85066, 24488, -53240, 138823, 345677, 511847, 452130, 678405, 924020, 731139, 283982, 243303, 763868, 812830, 399030, -116120, -264804, -63680, 3474, -217375, -215226, 132070, 409044, 189662, 106942, 132094, 171694, 263999, -153861, -277142, -135885, -254346, -533428, -631404, -517564, -443120, -20306, 44266, 15574, -37498, -162179, -113680, -275858, -158817, 14151, 64099, -142903, -357790, -583085, -372956, -141835, 53178, 1494]
13654A494m95781l55191r2657K1566R6985J83369L18707J91665m8322J37276l7073
13643g7962k85159k75605M12016J9156k02318L5791M7337j98236j7338R5699K64236
13632a82383N7361j59568k38755L00037J14580j90941J20207K13191k51982L09972
13622I1719P6900j30792j63636j44426j56185L38358L34341K64628L07293k62949
13612E55251k22372k98013n7093j5417j66264j04141M85567L26334J83212n79981
13602A07083K9358J57248J42972j98386m68009m32596j59571p3958K96636M71118
13592a28105M9965j6586O1728k9348k56027p1009L18933K11565r0709Q8242j01821
13581C6828l2086K7046k34493m6481M785k80336J15825n8268J61023L88906L00884
$$ y = [1494, -494287, -849478, -942135, -920569, -823584, -640215, -321508, -129843, -178165, -40889, -77962, -363121, -638726, -226710, -207554, -409872, -374081, -326744, -524980, -542318, -446619, -182383, -125022, -284590, -523345, -223308, -108728, -299669, -179462, 33729, -218253, 91719, 168619, 37827, -125809, -270235, -426420, -88062, 246279, 510907, 818200, 555251, 332879, 34866, -22227, -37644, -203908, -308049, 177518, 503852, 687064, 107083, 136441, 293689, 436661, 238275, -229734, -662330, -821901, -895859, -599223, -128105, -78140, -94726, -32998, -62346, -318373, -389382, -70449, 141116, 50407, 138649, 36828, 4742, 31788, -202705, -249186, -244401, -524737, -408912, -467180, -306157, 82749, 383633]
13570C83633l42723j16393n1041k77659J6800J01388q4885j77936J97213O1156
13560b90447K45900K7925K06677J70638j14797k45016k40120k92472K82793L51799
13550A02880L3570k29565R7220l29724k34600K07027M35161O2930j83322j02624
13540a41047L8085K96569Q486k34614m4030l7448j37049k5906J40239O7041M12959
13529C43285j7060K10311k13855l70482L4137K23338J1320k05456j47076k1287
13519a52825k68452J34191J18193K6687J08385p3628R3082j29423l63044M22394
13509h4440L70551R8528m46354j65722K37646J83186j8175j38003k71398L17438
13499H3257M69151N507k39104q4476k39410k57424j37450J44670Q9061M4570N1868
$$ y = [383633, 40910, -75483, -126524, -404183, -387383, -285995, -370880, -548816, -351603, -290447, -44547, -16622, 190055, 360693, 245896, 880, -239240, -531712, -248919, 102880, 136450, -93115, 4105, -325619, -560219, -353192, 81969, 144899, -38423, -141047, -102962, 193607, 202093, -32521, -76551, -113999, -251048, -276954, -136715, -69674, 343285, 326225, 536536, 322681, -47801, -13664, 209674, 220994, 15538, -131538, -152825, -421277, -287086, -168893, -142206, -33821, -107449, -14367, -143790, -506834, -84440, 286111, 384639, -61715, -227437, 10209, 193395, 175220, 37217, -234181, 83257, 552408, 557915, 318811, 234335, -5075, -262499, -399949, -255279, -166218, -121648, -69780]
13488f9780m657j02156J81084L9853o3231l7797k30408J32101K07147J10148l81581
13477b19277L9448M06760j10173p4822N121K10844o7183k21438J06415k177r251
13466F4267L5561J45811m0621j20318l68145j36342L77508J95752J29551k78308
13456D716J49802J73106J40342P6406k17107j02102j31719k21984J02278j37493
13446a63755o8920K078L7730q7144n1895J19319M75045N6136M149J91970K2843
13435E37556l20836o9027J48211K82715j79456o1207K00478p0180j32395k07542
13425A28317k30973j2808J47491J06073q1992L26161k0846J84478q9940o5439
13415C90522k41439J0862p6330k37969l09280K94510K9633R2490n9407k29429
$$ y = [-69780, -74437, -176593, 4491, 44344, -18887, -56684, -287092, -154991, 52156, 162304, -219277, -179829, 226931, 116758, 41936, 47057, 257901, 190718, -30720, 75695, 73518, 64267, 99828, 245639, 205018, 84700, -283445, -419787, -42279, 153473, 283024, 4716, 154518, 327624, 467966, 544372, 327265, 225163, 93444, -128540, -26262, -163755, -232675, -230597, -192867, -280011, -331906, -212587, 262458, 318594, 322743, 514713, 537556, 216720, 147693, 295904, 578619, 399163, 337956, 538434, 468254, 335859, 128317, -102656, -115464, 32027, 138100, 56108, 382269, 361423, 545901, 455961, 390522, 149083, 159945, 83615, -154354, -463634, -169124, -139491, -47001, -106408, -335837]
13405c35837o1175J0758L84033j16435m3635j70622q3455M72797P7547j24344
13395I632l42327R0558J35703m93170l1903L63945J28180j55322M9522n9802n1683
13384c56667n1674q7064J62092J44996o4488j52006j28066j31445P9097J13134
13374d72091q3140N0727K23702k4811k70804o1718l5100j97463L55079K96586
13364b19033O8416K43024N7655j9533l7441j55460j42722m7939Q6943J67433j97529
13353a96186l2993J60509J08114K14443M90470M2634j14944k95542n05852l27610
13343d56957j10122q3321R6229J33904K00688K77699j28706j8749k56762M0880
13333c05217J62858J24545k78621R4048O3174j06458k81097k84270K49779L60356
$$ y = [-335837, -397012, -386254, -2221, -118656, -162291, -332913, -416368, 56429, 133976, 9632, -332695, -242137, -106434, -599604, -631507, -267562, -139382, -294704, -245182, -304984, -356667, -408341, -495405, -333313, -188317, -252805, -404811, -532877, -664322, -585225, -472091, -555231, -504504, -280802, -305613, -576417, -638135, -673235, -870698, -515619, -219033, -150617, 92407, 150062, 130529, 93088, -62372, -205094, -253033, -166090, 1343, -196186, -229179, -68670, 39444, 253887, 744357, 786991, 672047, 376505, -129347, -456957, -567079, -650400, -554171, -420267, -219579, 58120, -70586, -89335, -346097, -305217, -142359, -17814, -296435, -202387, -139213, -245671, -526768, -811038, -561259, -200903]
13323b00903j8929j85987L1720J47814j08942P5457J40790L96048j60419j57470
13313d0821J47929k98332k29424L56913J71628j18192K61056j93144k15084R2300
13303f5171J42113j56952k18262l0048J609j95237O9207K07021j6690m2k61158
13292e23610O5182O63256J4433j01412j42110n6310j51174j76663J36687J0894
13282b60827k17951N7304N80831J71453M6423m10353Q2865K01352l2526K01952
13272D20523J44257k27181k56969O1306m3226R4918J14538j65475R1326k55976
13262b1959J20400L01548L6258j95355k1487j81883K9001K58533J0507k03220
13252A32343R0168j9340K7948K1248o9636m30644K61823J67521P336k28994j97525
$$ y = [-200903, -219832, -405819, -374099, -226285, -335227, -259770, -118980, 277068, 116649, -40821, 107108, -191224, -420648, -63735, 107893, -10299, 250757, 57613, -157471, -65171, 76942, -80010, -298272, -328320, -326711, -521948, -452741, -245720, -262410, -262452, -523610, -458428, 204828, 219261, 117849, -24261, -80571, -231745, -408408, -271721, -260827, -478778, -421474, 159357, 330810, 377233, -33120, 49745, 251097, 218571, 420523, 564780, 337599, 80630, 141936, 98710, 193628, 308166, 142691, 234017, -21959, 98441, 399989, 436247, 240892, 219405, 37522, 66523, 325056, 335563, 132343, 222511, 203171, 231119, 252367, 182731, -247913, 13910, 181431, 188767, -40227, -237752]
13241b37752j87403L16411J67784l16248k62177J29200L0505K61355J12659k1144
13231f810l02967J755k81972j39164K67956O6582O9204K25294K36694l4815j54749
13220e2992l06003k70319M9431N752L36359L6010K94288J95144J40002j98127
13210B29545Q874o6264k94183l79544L54078L29698K45394k12279k69209J12738
13200E8848q9940J26834M53093j3193J37737k53376k13414J07209J59184k39056
13190B33926l40351J6830Q151R6145M8395j30071k27060L8414J31264N0710n6828
13179a30475J62809P0255j66562K29230J55001j30371J30890k68972k33892J19694
13169f2393O8159j51940j4735J85914J01602J2007P7053j09681Q4721k2575K23448
$$ y = [-237752, -425155, -108744, 59040, -257208, -519385, -390185, -359680, -98325, 14334, -6810, -309777, -308022, -589994, -729158, -461202, -394620, -325416, -100122, 136572, 101757, -52992, -358995, -629314, -579883, -574131, -237772, -201762, 92526, 287670, 427672, 229545, 238419, 172155, -122028, -501572, -147494, 182204, 427598, 215319, -53890, 58848, -31092, 95742, 548835, 535642, 673379, 420003, 206589, 313798, 472982, 233926, -106425, -89595, -81444, 14701, 63096, -66975, -294035, -255621, -124357, -73647, -130475, 32334, 102589, -63973, 165257, 320258, 189887, 320777, 51805, -182087, -62393, 5766, -146174, -160909, 25005, 126607, 138614, 215667, 105986, 190707, 168132, 391580]
13158C91580J21137m09277m3490K38385l08384j6701L62378n5240j42035M2368
13148A80721j70014j82466J0280J08768k44895M32503Q6800o5969r1237k67533
13138b03042p1756K04311K174j54813m5222J48085Q4936j8842k32319j41407K29522
13127a98373L09882J03058k83344m1506R623N8222j45376l5986L79082Q1681j76305
13116F0658l8788L25579J22349j76663l62935P9925L89533l07292N2627K88274
13106D33267o3541j3678p0815k30383l13346j48809J84940j02689L1028j03883
13096c97909l04268K08494N25530K41790P1772K70381K1416o0410J8052j81465
13086D13383l71068j4833l20919K19633J30403m64759L44025J97859k12895J455
$$ y = [391580, 512717, 103440, 59950, 298335, -10049, -26750, 335628, 280388, 138353, 180721, 10707, -171759, -161479, -52711, -297606, 134897, 221697, 155728, 64491, -203042, -274798, -70487, -68313, -223126, -268348, -120263, -35327, -54169, -286488, -427895, -198373, 111509, 214567, -68777, -110283, -100660, -42438, -187814, -223800, 155282, 236963, 60658, 21870, 347449, 469798, 293135, -69800, 10125, 399658, 92366, 144993, 433267, 369726, 356048, 285233, 54850, -258496, -407305, -222365, -325054, -294026, -397909, -702177, -493683, 31847, 273637, 345409, 615790, 637206, 576796, 594848, 413383, 42315, 27482, -293437, -73804, 56599, -408160, -64135, 133724, -79171, -77716]
13076g7716l03124j9140K06225L94280L1543p8559l73197l53360q2470L78686
13066b76832J58990N0667J51735l7175J15949J91687j61090m00670j15361J5821
13056c06279J08553k86579j8155K99745j77026l00766L56989L02258k19733J87376
13046e3617k9999j38575J54169k17121L53640L80695Q1633j95701j9061L27195
13036F43258R955k76217J96584O8313j31891k81081J50975L22283j33196m61511
13026A07472j58597K72290K40175j93394l73051n4902J7221m43301P4003K39133
13016b72951L8154k47925M5604J15303j206J87351L76854R763j1604k61511J36243
13005A14075J25967j0600K81087k08859j62834J00041l54309j26933K08463J20871
$$ y = [-77716, -380840, -399980, -193755, 200525, 232068, 153509, -219688, -573048, -655518, -276832, -117842, -67175, 84560, 47385, 163334, 355021, 193931, -206739, -322100, -306279, -197726, -484305, -502460, -202715, -379741, -680507, -323518, -21260, -240993, -53617, -83616, -222191, -68022, -285143, 68497, 449192, 530825, 335124, 316063, 643258, 653213, 376996, 573580, 641893, 510002, 228921, 379896, 702179, 568983, 107472, -51125, 221165, 461340, 267946, -105105, -160007, -142786, -586087, -512084, -272951, -234797, -482722, -437118, -321815, -323021, -135670, 241184, 250947, 239343, -22168, 114075, 240042, 229442, 510529, 301670, 138836, 238877, -115432, -242365, -33902, 86969]
12995H6969K89083o178m23537k68315J10024J95208l1828j59565j1523k2132M058
12984b37736K07731M3569m1688j05671K01454o8326L0338K45786L82525q6948
12974E71034m77910l72356p5882K09247K58155K1K44012K66000j84137k92287
12964A45897K4182K56226j64448j23227J64130r262J37581k2394r0758o7350K3372
12953B73949K15849J05238K17070K23831n32872m86533j59312k7659L88754J28336
12943C46651n4991r1501K53010l4355j97424j51857K86612L43767P4250k08770
12933E65392l14976Q984m04283l27400O9421J16845m6234J14215L27190j65532
12923e6378m7133m4288J23242K00855j97228j85742m08978P3524K81593m2135
$$ y = [86969, 376052, 369874, -53663, -321978, -211954, -16746, -48574, -208139, -219662, -241794, -237736, -30005, 13564, -28124, -133795, 67659, -667, 29671, 275457, 657982, 571034, 93124, -279232, -355114, -145867, 112288, 112309, 356321, 622321, 438184, 145897, 170079, 426305, 261857, 138630, 302760, 293498, 431079, 408685, 317927, 250577, 273949, 489798, 595036, 812106, 1035937, 503065, 16532, -142780, -170439, 218315, 346651, 291660, 200159, 453169, 418814, 221390, 69533, 356145, 699912, 774162, 565392, 250416, 259400, -144883, -472283, -402862, -286017, -332251, -218036, 109154, -56378, -103511, -147799, -24557, 176298, -20930, -206672, -615650, -542126, -260533, -302668]
12913c02668k39039p3229o4355J26454J17801J28088k50920j09922K21723M4296
12903d01771j08910J9370k90956j20328Q9372K3440N45026J79107k41942j10535
12893d18127L66640J16246k87004L72919N33822K8364k7525j11461p18202k73159
12883d17487K600K11870j49047j43594k8882M3526K06053K02741R446K30022k3949
12872A43299j23482J84776K3258J00543M7489n7537l0291J62899n07776n712L0904
12861c1630l20996J1017R5793L02807Q9175L3166j60223j26662J86564K83416
12851C62427j23531l01368J02890j20100N6596M53194m8811j89030l58650q7742
12841b54125j37368m7972Q0279Q5726M09248J37390m50603p7900l5951M29138
$$ y = [-302668, -541707, -614936, -679291, -552837, -435036, -306948, -557868, -667790, -446067, -401771, -510681, -491311, -782267, -902595, -813223, -789783, -244757, -65650, -307592, -418127, -51487, 64759, -222245, 150674, 684496, 712860, 685335, 573874, -144328, -417487, -414887, -203017, -352064, -495658, -524540, -481014, -274961, -72220, -62774, 167248, 143299, 19817, 204593, 227851, 328394, 375883, 318346, 288055, 450954, -56822, -62534, -31630, -352626, -341609, -245816, 56991, 146166, 179332, 19109, -107553, 79011, 362427, 238896, -62472, 40418, -79682, -23086, 430108, 381297, 192267, -166383, -254125, -391493, -439465, -359186, -273460, 135788, 273178, -177425, -255325, -291276, 137862]
12831A37862K53185l4580k33772m6423L1704k80698Q5968J45267j52996j52584
12821b47067M2028N52J09826J49298n8001j76444r2359j89965j51359j63963L08585
12810d68869K69729m060P6306O9700k721J32415K26692k68112j98166j9102q2987
12799b69175n018J65753k66819N667M1339K9300j39048j65683J79224K84307J98626
12788E8473J10775R7036L28614j8992n6871m31729m73089J29239J96509q8715
12778a48750o3643K76934q5535l49322j04333q5814J44502M24980J39615K14582
12768C63216j2739k9832j63430p5507l39571q3577r4965M18574M04946p8225n4980
12757B53910l07158J36840J58372k72294L88276K96142k31939k35171m4533o0615
$$ y = [137862, 391047, 356467, 122695, 76272, 107976, -172722, -86754, 58513, -94483, -247067, -205039, -204487, -94661, 54637, -3364, -179808, -272167, -462132, -613491, -777454, -468869, -199140, -203200, -126894, -57194, -59915, 72500, 299192, 31080, -167086, -186188, -269175, -274193, -108440, -375259, -369592, -328253, -298953, -438001, -603684, -424460, -140153, 58473, 169248, 266284, 594898, 575906, 519035, 87306, -385783, -256544, -60035, -148750, -212393, 64541, -20994, -370316, -474649, -560463, -415961, 9019, 148634, 363216, 350477, 320645, 157215, 81708, -257863, -341440, -436405, -17831, 387115, 308890, 253910, -53248, 83592, 241964, -30330, 357946, 654088, 422149, 186978, 142445, 81830]
12747H1830l9927L6214Q7526J77026J81523J22988m1608J44249J97582j19148
12737H28255o4531k60748p7521j66742r942L2692j30405R4989J55366K2260p9886
12726C43787m18616j6172J40524j56445m5892k36280l4397J40062M12859K33135
12716C62565j43119o1919m7764K31029J40002j77647K3597j01268m2984j21710
12706F0782k14298K87350M0321J98586K5510l01147n825m32984k74241N62406
12696e3540J12789J47285O52369J7972n26360M8718L9933k86839J24385n9175
12686B17537l55964l49606P9269N30882O7147o9304O0028K66658L24386p2031
12676F99002j57944k41198k07413K50554P3404j3760k66056k22300j9041J51826
$$ y = [81830, 41903, 78117, 165643, 342669, 524192, 647180, 605572, 749821, 947403, 828255, 763724, 502976, 425455, 258713, 248771, 281463, 151058, 246047, 401413, 423673, 343787, -74829, -91001, 49523, -106922, -152814, -389094, -423491, -283429, 129430, 362565, 219446, 157527, 109763, 340792, 480794, 303147, 326744, 225476, 182492, 60782, -153516, 133834, 174155, 372741, 398251, 97104, 91279, -341705, -615946, -53540, 59249, 206534, 858903, 876875, 350515, 399233, 439166, 152327, 276712, 217537, -138427, -488033, -408764, 122118, 189265, 119961, 179989, 446647, 771033, 699002, 541058, 299860, 92447, 343001, 416405, 402645, 136589, -85711, -104752, 47074]
12666D7074K77512k2202r8979J351k330J48838L839j87024J08726J8723K43235
12655E38763j86182p7309l31159r8760J4483L2114Q1980L32803n139k4872m78784
12644b02062M7249J3252j4864j84674J68279J76609J45357J82722P6784j65073
12634B43579l1777K54258j7421O3678l47800j97376L215Q4068m5954M8028r4600
12623c8102k00331j02138K84139l04288j15718J94617K1281P0987k57968m0633
12613d88154M96018N8540l25423Q4334k5626K35100L22144k12024k55791K90351
12603A79469k30483k25580P4460J77308j0166k1483o7864J40511J2899J33460
12593A62531j87435P8225j47829k05947M0945L4339L62836K18219j20591J18226
$$ y = [47074, 324586, 302384, 203405, 204756, 202426, 351264, 355103, 168079, 276805, 295528, 538763, 352581, 275272, -55887, -154647, -140164, -108050, -26070, 306733, 301594, 276722, -202062, -154813, -141561, -156425, -341099, -172820, 3789, 149146, 331868, 408652, 243579, 211802, 466060, 448639, 512317, 164517, -32859, -29644, 54424, 8470, 56498, -38102, -238433, -340571, -56432, -360720, -476438, -281821, -260540, -189553, -447521, -488154, 7864, 66404, -259019, -174685, -200311, 34789, 356933, 144909, -110882, 179469, -51014, -276594, -202134, -24826, -34992, -56475, -124339, 16172, 29071, 162531, -24904, 53321, -94508, -300455, -259510, -225171, 137665, 355884, 235293, 353519]
12583C53519J35042K0233k22205l34272K12215L17930k2710k00527J0158k8621
12573B40762J22195J54710k1473l26002l65387O120K2629L79535j9628r8427n1957
12562D3077N90048j53665m20972k70804r2014o7622J80539L42616r4147J02786
12552A59842J66623L33309j01697j48228K3164l15680l02956J89025j5829J83419
12542A70992K19969r7781j71107L45236j95211L42713K54580K5082j20676k90930
12532D82867N146o1377m2306l04702n3726J66379J72439j7037K32240K24493J6352
12521H20768j49657j08823l1546k24244n21927k94603L2256N54311O8492j03916
12511D1111J54808K52224J8195J25662r2521L52257L3580k04125l87224k2588
$$ y = [353519, 488561, 508794, 286589, -47683, 164532, 482462, 459752, 259225, 269383, 240762, 362957, 517667, 496194, 170192, -195195, -189075, -166446, 213089, 193461, 95034, 43077, 633125, 479460, 58488, -212316, -304330, -371952, -191413, 151203, 57056, 159842, 326465, 659774, 558077, 409849, 433013, 117333, -185623, 3402, -12427, 170992, 390961, 293180, 122073, 467309, 272098, 614811, 869391, 894473, 773797, 482867, 488013, 426636, 384330, 79628, 25902, 192281, 364720, 347683, 579923, 804416, 820768, 671111, 562288, 530742, 306498, -215429, -510032, -477776, 76535, 145027, 41111, 195919, 448143, 466338, 592000, 499479, 851736, 885316, 681191, 293967, 271379]
12501B71379K7323R922j96021K54862K51827j2228n4684J34657J24932j42886
12491F69083m4342L4859N9982K32877k86191k74352L0823J57064P7999J90758
12481H48560J25565m1298l15760p3467J102O5247J07045l92947n80831N0756N72425
12470C66397K97716J31380k14317M5653N5445j05009O876J09919r4889j55107
12460D44064n3902J11110N9623K27P1166m2616M9154j86888m953k39695J8044
12449B25334j03984r3886J31276K0689j70693M1800N0832J54077j15774k5118
12439A14553L45295M41377k38248m16952J27985J90582J16360k47680j70393j83381
12429G9498j33858k524q668J57298J53945L32549J60747r2063O916q7857n7461
$$ y = [271379, 298702, 308624, 112603, 367465, 619292, 607064, 552380, 687037, 811969, 669083, 624741, 659600, 719582, 952459, 666268, 391916, 422739, 579803, 657802, 848560, 974125, 932827, 617067, 543600, 544702, 609949, 716994, 324047, -256784, -206028, 366397, 664113, 795493, 581176, 626829, 682274, 577265, 584141, 694060, 599171, 444064, 390162, 501272, 560895, 561122, 632288, 589672, 638826, 451938, 446985, 207290, 225334, 121350, 27464, 158740, 179429, 8736, 50536, 101368, 255445, 139671, 114553, 459848, 901225, 662977, 246025, 374010, 564592, 680952, 433272, 262879, 79498, -54360, -56884, -65552, 91746, 245691, 578240, 738987, 646924, 653840, 565983, 508522]
12418E08522Q0199o0032k38072K58373Q7754j51617l9877J08770n1802j75287
12408C26931r1010K8538K07263j6487j27737o6087Q3308n1853j49917L4232l3110
12397A44071q4539m1676M3153j43947k91451K53047R5604K39330l2843l46551
12387a65802J27007J83075J39297J58604k60861l657M52076L06043M6946O9742
12377A052470J23920j3298j43220k86880J01395L66932j17880p9572j77235n43546
12367B83086j23933K16999K19652j39951k28979L43140L45976J76761q0140l27620
12357F84991J2074R9447j91035j5783k2997j74612N9340J07248j5134K31608J52352
12346I27499j11299J76059n57898l67597L63032O37051k97929j24106j02435l60876
$$ y = [508522, 588721, 528689, 290617, 548990, 636744, 485127, 445250, 554020, 502218, 326931, 235921, 264459, 471722, 455235, 327498, 261411, 344719, 292866, 142949, 177181, 144071, 59532, 17856, 61009, -82938, -374389, -121342, -25738, 213592, 180749, -165802, -38795, 144280, 283577, 442181, 181320, 177663, 629739, 935782, 982728, 1052470, 1176390, 1163092, 1019872, 732992, 834387, 1201319, 1083439, 1003867, 826632, 283086, 159153, 376152, 595804, 455853, 226874, 570014, 915990, 1092751, 1012611, 684991, 697065, 796512, 605477, 589694, 566697, 392085, 451425, 558673, 543539, 775147, 927499, 816200, 992259, 434361, 66764, 429796, 1066847, 768918, 644812, 542377, 181501]
12336A81501J25286M66871J19507L19103j15068j07754j32230J60796K23209k14559
12326A026662j15629J3216j62350l4491j42165j80348j62433L28142R9909R952
12316F80465J13795L04625Q2295k21452J16612Q3659j5589j70462j7590J49106
12306A105464J85154J14451J62690J31007J00336k28869l51126J75268k355K86444
12296A678464L81892j9009j69159N6328K4391j66825J23594J79756J714k1541
12286B069605r0467n4687L32120K85381j371K36611p432l75321m73328j28227
12276A792884k28790m8657k45243J39101M49859K55465k09930l10799K96177M06230
12266B296297j44708K0278l42804k08027j41159N349L7597K53998j30476Q5971
$$ y = [181501, 306787, 773658, 893165, 1212268, 1097200, 989446, 857216, 1018012, 1241221, 1026662, 911033, 924249, 761899, 727408, 585243, 404895, 242462, 570604, 670513, 680465, 794260, 1098885, 1181180, 959728, 1076340, 1159999, 1144410, 973948, 956358, 1105464, 1290618, 1405069, 1567759, 1698766, 1799102, 1570233, 1219107, 1394375, 1392020, 1678464, 2060356, 2041347, 1872188, 1928516, 1952907, 1786082, 1909676, 2089432, 2091146, 2069605, 1979138, 1924451, 2256571, 2541952, 2540581, 2777192, 2769760, 2394439, 1921111, 1792884, 1564094, 1515437, 1270194, 1409295, 1859154, 2114619, 1904689, 1593890, 1890067, 2296297, 2151589, 2171867, 1829063, 1621036, 1479877, 1485226, 1522823, 1776821, 1646345, 1732316]
12256A732316K1008q9924J91419l7885J2560l57652J0694M2773L0900q7042J27508
12245A596675K02782j72921k37576k18191n1613M20997M42061p7386j785l4690
12235A868353n9018N8144J68883P8673p2636l23713J33835K82210m795k53205
12225A876731k32556m4193j69728j04284m2717R4308l82680j24280K99047K80227
12215A449875j09643k6649k2547j72617J43116j41299k56500j21960N6539J45102
12205I43417J52750q1835j47376K42558J94061o2N4233N5952k6474k74946j43842
12194I68436j50343l8731M3619J78563J51751M4803o5008J7171k17420k44888
12184F87953L36322J40635j01490L06610n2412J28068Q3426M7905m86798j44651
$$ y = [1732316, 1753324, 1663400, 1854819, 1816934, 1829494, 1471842, 1482536, 1525309, 1556209, 1469167, 1596675, 1799457, 1626536, 1388960, 1170769, 1119156, 1540153, 1982214, 1904828, 1903043, 1868353, 1809335, 1867479, 2036362, 2115035, 2042399, 1718686, 1852521, 2134731, 2129936, 1876731, 1644175, 1599982, 1430254, 1325970, 1283253, 1377561, 994881, 870601, 1169648, 1449875, 1340232, 1313583, 1291036, 1118419, 1261535, 1120236, 863736, 741776, 798315, 943417, 1096167, 1014332, 866956, 1109514, 1303575, 1303513, 1357746, 1413698, 1387224, 1112278, 968436, 818093, 779362, 822981, 1001544, 1153295, 1198098, 1133090, 1150261, 932841, 687953, 1024275, 1164910, 1063420, 1370030, 1317618, 1445686, 1529112, 1577017, 1090219, 945568]
12174I45568J39108K00590K19877K66519m18414k91236Q1731K52913K83886N4866
12164A735408l69939k91177L94414L51595j13470K16515K28853K07213m4865J12378
12154B426925K2433p5139O3735q235j81798K4879J34346K12347j69963m05679
12144B043851K12020j591K995j31358n0482M65454P7601m0216K30802k68434l7553
12133B503089p3639k97482J06398K35266K9858m5629J8381j11877L17933L8047
12123B720345R8761J40417r0975M1457J01384O8729N3309j30630O92j29531k44195
12112B629763o1859j05155J04808Q2566N5496k96579k8325R6179M15382J79514
12102C071790j38580j26490m28780m83846k12438L58012J67643Q2135J32813L12725
$$ y = [945568, 1084676, 1285266, 1505143, 1771662, 1353248, 1062012, 1143743, 1396656, 1680542, 1735408, 1365469, 1074292, 1468706, 1820301, 1706831, 1923346, 2152199, 2359412, 2314547, 2426925, 2449358, 2374219, 2437954, 2429719, 2247921, 2272800, 2407146, 2619493, 2449530, 2043851, 2255871, 2254280, 2257275, 2125917, 2075435, 2540889, 2618490, 2578274, 2809076, 2540642, 2503089, 2429450, 2131968, 2238366, 2473632, 2503490, 2457861, 2476242, 2364365, 2682298, 2720345, 2819106, 2959523, 2868548, 2910005, 3011389, 3080118, 3133427, 3002797, 3003489, 2873958, 2629763, 2567904, 2462749, 2567557, 2650123, 2705619, 2409040, 2380715, 2476894, 2892276, 3071790, 2933210, 2806720, 2377940, 1894094, 1681656, 2039668, 2207311, 2289446, 2422259, 2734984]
12092B734984K77293R6307Q7359M225k59990j7162j8342J83366k7751J19185K81115
12081C460589k75688j23624L2501k87813k4144K02928J87485k22076j19755L31833
12071C162236R1749j45326o6824k70992N1882K08650J87402K18287o6859l38714
12061C031491k43021L15797J67868L183j41522L89029N4880l77965k27912K53427
12051C225255K93685P7372J8408L1883l43104k11222L57084M4116J7196J16198
12041C626871J97726j8870P4028j77357k47886O8246N4375M2706L81822L01582
12031D303243R9449J94362L93758J96390l27933k6749Q6492K14166J7401k01309
12021D949270j59120L17177K14306K06804J37126N3926N4521K31386K76261R5085
$$ y = [2734984, 3012277, 3108584, 3195943, 3200168, 2940178, 2923016, 2904674, 3088040, 3060289, 3179474, 3460589, 3184901, 3061277, 3093778, 2805965, 2781821, 2984749, 3172234, 2950158, 2830403, 3162236, 3253985, 3108659, 3041835, 2770843, 2822725, 3031375, 3218777, 3437064, 3370205, 3031491, 2788470, 3104267, 3272135, 3275318, 3133796, 3522825, 3577705, 3199740, 2971828, 3225255, 3518940, 3596312, 3614720, 3646603, 3303499, 3092277, 3449361, 3493477, 3510673, 3626871, 3824597, 3805727, 3879755, 3702398, 3454512, 3522758, 3577133, 3619839, 4001661, 4303243, 4402692, 4597054, 4990812, 5187202, 4859269, 4832520, 4919012, 5133178, 5150579, 4949270, 4790150, 5107327, 5321633, 5528437, 5665563, 5719489, 5774010, 6005396, 6281657, 6376742]
12011F376742J4282l1270Q8575j12453J8921R7104M64498o7282k4701M06953j703
12000G229666J74656n44K15584M7785N6057Q3208J50840M14597M11158O83j73598
11989H610092L6269R6213M73665K70634n9725J2170P2430K59808L90973J7058
11979A0179587O8825M33199M04123N42738O52976J30644m4450p6036J21903M29133
11969A2842642N23972L0831M35769K29893J65591M09038O51942P21465L54237
11960A6365380M67139O49010L34790M07130L67359L00824P12174R76944O31389
11951B1212139M73816M63575N44928O02871O22713J042414J042075M54447J010029
11942B7469007J227633R42145P89452R64178R71907J359002J324612R94244R81811
$$ y = [6376742, 6391024, 6359754, 6448329, 6335876, 6354797, 6451901, 6916399, 6849117, 6824416, 7231369, 7229666, 7404322, 7403778, 7619362, 7667147, 7723204, 7806412, 7957252, 8371849, 8783007, 8783690, 8610092, 8646361, 8742574, 9216239, 9486873, 9427148, 9439318, 9511748, 9771556, 10162529, 10179587, 10248412, 10681611, 11085734, 11628472, 12281448, 12412092, 12367642, 12291606, 12413509, 12842642, 13366614, 13397445, 13833214, 14063107, 14228698, 14637736, 15289678, 16011143, 16365380, 16832519, 17481529, 17816319, 18223449, 18590808, 18891632, 19603806, 20580750, 21212139, 21685955, 22149530, 22694458, 23297329, 23920042, 24962456, 26004531, 26458978, 27469007, 28696640, 29638785, 30428237, 31392415, 32364322, 33723324, 35047936, 36042180, 37023991]
11933C7023991J042588J108951J579159J060750R75219J146722J187111J054744
11925D6179235J302285J547020J463712J323091J258371J071260P50255O93279
11917E5588508P72888Q85097Q24537O50259O69750O31454O74409L3178k6971k88154
11907F0414955k71289l32386n07637q06923o95810n21260n61894p72665p86064
11898E5159027q14056j025489p55372o29128p29591j416134j221740j238525j007995
11889D6320997r71617o89032r31977j274146r39959q13029p73606j130555p71345
11880C8025731o62709q10696r43139m89992p97735j033178m52230m01673n82454
11871C1851925p03916r01736r26289p54245p61777q15773p21828m48606j75333
$$ y = [37023991, 38066579, 39175530, 40754689, 41815439, 42790658, 43937380, 45124491, 46179235, 47481520, 49028540, 50492252, 51815343, 53073714, 54144974, 54895229, 55588508, 56361396, 57246493, 58071030, 58721289, 59391039, 60022493, 60696902, 60730080, 60703109, 60414955, 60143666, 59811280, 59303643, 58496720, 57800910, 57279650, 56717756, 55945091, 55159027, 54344971, 53319482, 52564110, 51934982, 51205391, 49789257, 48567517, 47328992, 46320997, 45349380, 44660348, 43728371, 42454225, 41514266, 40701237, 39927631, 38797076, 38025731, 37363022, 36552326, 35609187, 35119195, 34321460, 33288282, 32836052, 32434379, 31851925, 31148009, 30246273, 29319984, 28565739, 27803962, 26988189, 26266361, 25817755, 25642422]
11862B5642422n65600r49096k59465o25002n04732n43033n95435l70461r4082
11853B1135516l29045k95197k42037q41870n97025l2772l70447l08637o42695
11844A7475791j19701k99316n17195k42755r9740k50555l35125L807l419k79454
11834A5332338l41047m44290m28325n47691m8046K22383l71837m44959k80664
11825A2647862m85689m3968J80228J85773j33918p19986n13188j10086j31993
11816A0875035k85744j51703L27811M7940l66302l35675l23531k76743p3619Q8282
11806I525751k01671j95065j13445j02963J57028K06992j7879l42850l87988k89745
11796H238165O6423O2292k96839m0218l5558J2911l77082n1755J77202J04833
$$ y = [25642422, 25076822, 24127726, 23868261, 23243259, 22738527, 22195494, 21600059, 21229598, 21135516, 20806471, 20511274, 20269237, 19427367, 18830342, 18797570, 18427123, 18118486, 17475791, 17356090, 17056774, 16539579, 16296824, 16197084, 15946529, 15611404, 15615211, 15611792, 15332338, 14991291, 14547001, 14118676, 13570985, 13522939, 13745322, 13373485, 12928526, 12647862, 12162173, 12118205, 12298433, 12484206, 12350288, 11630302, 11117114, 11007028, 10875035, 10589291, 10437588, 10765399, 10813339, 10447037, 10111362, 9787831, 9511088, 9437469, 9525751, 9324080, 9129015, 9015570, 8912607, 9069635, 9276627, 9258748, 8915898, 8527910, 8238165, 8304588, 8366880, 8070041, 8029823, 7994265, 8007176, 7630094, 7578339, 7755541, 7860374]
11786G860374j0443j62807k48912l98133m12809j09865L18119m4301R343J51328
11776F951894j74750m65225k7823r5993Q0374o434j37051k56109m86278j24850
11766E257755J5076J40825J16942K96318J83963k29058m98371l67179j97993k5988
11756D692290M29j60865K14269K00298j26507r4360k92861K29991R0658j52216
11746D601126r3584k66307m43857k70648j16L95332M42824l1300m16004p407l0920
11735C879139j75814j44269r6545p8039L33654J90239j12545k89922j28190n382
11725C372326l04128l75074p6307K83118K89720L7785K7539O2648q5464o9726
11715C162437j69134j60973K50735m1491k87761L6734k39764l96873K3850L29648
$$ y = [7860374, 7849931, 7687124, 7438212, 7040079, 6627270, 6517405, 6835524, 6791223, 6800566, 6951894, 6777144, 6311919, 6284096, 6188103, 6268477, 6262043, 6124992, 5868883, 5382605, 5257755, 5272831, 5413656, 5530598, 5826916, 6010879, 5781821, 5283450, 4916271, 4718278, 4692290, 4692719, 4531854, 4746123, 4946421, 4819914, 4725554, 4432693, 4662684, 4753342, 4601126, 4507542, 4241235, 3797378, 3526730, 3526614, 3921946, 4364770, 4333470, 3917466, 3910059, 3879139, 3703325, 3559056, 3462511, 3384472, 3718126, 3908365, 3795820, 3505898, 3377708, 3372326, 3068198, 2693124, 2616817, 2899935, 3189655, 3227440, 3254979, 3317627, 3232163, 3162437, 2993303, 2832330, 3083065, 3041574, 2753813, 2790547, 2550783, 2153910, 2177760, 2507408]
11705B507408K24913k5947k36905l9379j91931K0083k60912J9223j23673K4639
11695A917519p4435J41262L55735N668k29344q4144J07054r3986j32248j15507
11685A797574k09657p899j57610K67687K47193R7092n8950j43852j99664k08627
11675A423287J11347k5139K44429N78k83391Q9721q2926K25275J69309J21684
11665A994174J76093j8805k70709J37829K36493J1315l47346m31233k75002j34396
11655A078413O4170k2741Q7212M63039p000j47126p631K48126J18635j3369R3996
11644A955724j53011l28262N4607K28371O4524m77366l44080P7312J62772R5153
11634A335744Q0454k63615j2870K200J6193p7901j75934Q1319M20231J6728j55664
$$ y = [2507408, 2732321, 2706374, 2469469, 2430090, 2238159, 2258242, 1997330, 2016553, 1892880, 1917519, 1843084, 1984346, 2340081, 2345749, 2116405, 2032261, 2139315, 2045329, 1913081, 1797574, 1587917, 1580018, 1422408, 1690095, 1937288, 2034380, 1975430, 1831578, 1631914, 1423287, 1534634, 1509495, 1753924, 1754502, 1471111, 1560832, 1477906, 1703181, 1872490, 1994174, 2170267, 2151462, 1880753, 2018582, 2255075, 2266390, 1919044, 1487811, 1212809, 1078413, 1142583, 1119842, 1207054, 1670093, 1663093, 1515967, 1508336, 1756462, 1875097, 1861728, 1955724, 1802713, 1474451, 1529058, 1757429, 1821953, 1344587, 1000507, 1077819, 1240591, 1335744, 1416198, 1152583, 1139713, 1141913, 1158106, 1080205, 904271, 985590, 1405821, 1422549, 1266885]
11623A266885K9329l65550m04231M09724j59407m3077j0306J71845K4818l54125
11613E65905J27344Q6820j9648L25311L54613K42887k39915l30113j7596P1376
11603A166984L2662k60269j18912J75402N1029K31461J55029J519j27029j62954
11593A144922l04626m1007o0512k11500k21437R4874J58312J76755N3953k93761
11583D95973K3498r4473k14387J20503J39701r0414J95476J88184j33395r5136
11573E35530J53079j16566o0977j97590N3875K45467l93818n4908N3662J58674
11563C76428K69445M2404j21759l57276K17350K56832j28643k01532r9710k24516
11553B9023j04609N31083M32088m62603J53924J82835J39367l38774j50187o8655
$$ y = [1266885, 1296214, 930664, 526433, 936157, 776750, 733673, 723367, 895212, 920030, 565905, 693249, 780069, 760421, 1085732, 1440345, 1683232, 1443317, 1113204, 1095608, 1166984, 1199646, 939377, 820465, 995867, 1046896, 1278357, 1433386, 1434905, 1307876, 1144922, 840296, 799289, 738777, 527277, 305840, 400714, 559026, 735781, 789734, 495973, 519471, 424998, 210611, 331114, 470815, 380401, 575877, 764061, 630666, 535530, 688609, 572043, 511066, 313476, 367351, 612818, 219000, 164092, 217754, 376428, 645873, 688277, 566518, 209242, 426592, 683424, 554781, 353249, 253539, 29023, -75586, 455497, 887585, 424982, 578906, 761741, 901108, 562334, 412147, 343492]
11543C43492j45666k12223M73618M35641k3885k37422m12280p7185L50695L20033
11533H14818K5014m18386j64756J08900J10926l39775J09362J14641j76454L39338
11523E23628M7412j30436j03325J45235j03974q9941k9708K62122K19323M5705
11513G86041j76365k00514K83030l2680k10824M3904J05381l02917j16959k15965
11503c7868j79973M0895K04257K34151L34078p1263k94061j42426Q0957J30937
11493B99684k88420n31415J29380K20586J30518K23191n5469L11225L11313J71163
11483I21756l69246k04363j11731k45635Q3921j40636L33400L74244L7050l68692
11473C10068l11729R1316M02563m0959r8719l8648q6888O4641k72503J60215R0329
$$ y = [343492, 197826, -14397, 459221, 894862, 870977, 633555, 221275, 144090, 494785, 814818, 839832, 421446, 256690, 365590, 476516, 136741, 246103, 360744, 184290, 523628, 571040, 440604, 337279, 482514, 378540, 288599, 258891, 521013, 740336, 786041, 609676, 409162, 692192, 659512, 448688, 492592, 597973, 295056, 178097, -37868, -217841, -176946, 27311, 261462, 595540, 524277, 230216, 87790, 168747, 299684, 11264, -520151, -390771, -170185, -39667, 183524, 128055, 439280, 750593, 921756, 552510, 348147, 236416, -9219, 74702, -65934, 267466, 641710, 678760, 310068, -1661, 89655, 492218, 451259, 352540, 313892, 227004, 291645, 19142, 179357, 269686]
11462B69686m9153J26797Q7143J29057k0191j49103k11049L45000J54178J7928
11452G00293p2510j58100Q1190J17023K8553l1591J23703J66842o320k30111n31090
11441A87882k49412j05942J31697L01235j98070P822J79581k09176J04189J75776
11431C25582K5956m46251K96482J29802k35065K10480n0455p8483Q8103K07981
11421D74132l48691k27526L27824M89870j21308l1373k00185j71659P063N34113
11411G32260K54846l43867k35422J90068K60855J03453j50250k77358j03635J0842
11401D41792j26474j97988R0628p5437K79560J9039r0639k27628j58114J04541
11391E9280J23280K72131Q1199k48548L4808J10725r2194k23410j42745J19838
$$ y = [269686, 220533, 347330, 434473, 563530, 543339, 394236, 183187, 528187, 682365, 700293, 627783, 469683, 550873, 667896, 696449, 664858, 788561, 955403, 949083, 718972, 187882, -61530, -167472, -35775, 265460, 67390, 75212, 254793, 45617, 149806, 325582, 351538, -94713, 201769, 331571, 96506, 306986, 256531, 178048, 266151, 474132, 125441, -102085, 225739, 715609, 594301, 562928, 362743, 191084, 198147, 732260, 987106, 643239, 407817, 597885, 858740, 962193, 811943, 534585, 430950, 441792, 315318, 117330, 207958, 132521, 412081, 431120, 340481, 112853, -45261, 59280, 182560, 454691, 535890, 287342, 322150, 432875, 340681, 117271, -25474, 94364]
11381I4364J07911k88062l07978P4267K76251K30347l52989p6366K58385J05908
11371A22038M6766J48371K46164q0923p7433r7599k67767j85965j10895Q9520
11361a67723n8592N4625k86806j5062L29526J3912q8660K240J61283N52944K72042
11350G69729k30354k87419n109k55164j05496j74562k00379J67533M95898j43354
11340C1323j22867M4452J8622J26772o6729o857K05385J02392j82736l40361j00479
11329b91083L462K99071J40850J937J42931L345j54634m04596R8212o9430K50513
11318B0578K76085k49852q0796O50282p6421m18372j91905k9274J97845j65035
11308f6865l0501K19967L52711K23069n4978p4225J3564K383j68997m11180n4991
$$ y = [94364, 202275, -85787, -393765, -319498, -43247, 187100, -165889, -242255, 16130, 122038, 168804, 317175, 563339, 482416, 404983, 307384, 39617, -146348, -257243, -167723, -226315, -171690, -458496, -473558, -144032, -130120, -218780, -216540, -55257, 497687, 769729, 539375, 251956, 246847, -8317, -113813, -288375, -488754, -321221, 174677, 31323, -91544, -47092, -28470, 98302, 31573, 24716, 230101, 332493, 149757, -190604, -291083, -287621, 11450, 152300, 154237, 297168, 300513, 145879, -258717, -160505, -229935, 20578, 296663, 46811, -33985, 616297, 539876, 121504, -70401, -99675, 98170, -66865, -97366, 122601, 475312, 698381, 643403, 569178, 582742, 585125, 416128, 4948, -50043]
11297e0043N8024k26858L2057K30919n1942J78910k4118j49078K13355L68830
11287E80056N1881J79882M2119m73024l43570J21543J71761L0095P0903J80341
11277F11987k00757l73389q1716J71364j01685l67341r6952J42297n1947K53011
11267i5128k05464q15o9827k3643L11430N912O8563K56581P2550l07894M9299
11256F1564J54050l9372m21122N2499j14882o8485P236j82242j10860K95646K23610
11245a42358N0494K12958N28948J70268k42920k83377k98406n8346K37533j01660
11235G3134l300K86971q8920q5380K8604p0536j35378K29953J89249k13071m3872
11224A67454O4025M6669Q9875J91269k0366l48066l47029K62582q218j1070K75772
$$ y = [-50043, 7981, -218877, -186820, 44099, -7843, 171067, 146949, -2129, 211226, 580056, 631937, 811819, 853938, 380914, 37344, 158887, 330648, 360743, 431646, 611987, 411230, 37841, -43875, 127489, 25804, -341537, -438489, -296192, -348139, -95128, -300592, -301407, -371234, -394877, -83447, -77535, -8972, 247609, 320159, 12265, 61564, 215614, 176242, -244880, -192381, -307263, -375748, -368512, -550754, -661614, -365968, -142358, -91864, 121094, 650042, 820310, 577390, 294013, -4393, -62739, 174794, 73134, 69834, 356805, 267885, 182505, 211109, 140573, 5195, 235148, 424397, 211326, 167454, 231479, 278148, 368023, 559292, 538926, 190860, -156169, 106413, 98195, 87125, 362897]
11213C62897J88806j6252J20695r5713m53522j90709K21256J38523j14748j5065
11203A46168J41536J64100j09394m24918j44073J98139j94870J95263J55168j96325
11193f9206q6111J48629J09337R1862J43504j43261k07444k50993K86425K03210
11183B25952J34074m3672L0743k98055j01940K59938p5257k34424O5291L06186
11173B68836l53851J27127n5143k8115J70209M13031K8202k21929n5388j37304
11163A55675P3058J78335k26806j95211j55904P8832J22678j56298k36622j26748
11153d89011j96086p563L99092M92713p102m07316j26384m3531L19201L02460
11143B36473R4775q3931o6256j26375k87036r2234k09824K66822M43427J66214
$$ y = [362897, 551703, 535451, 656146, 560433, 106911, -83798, 137458, 275981, 161233, 146168, 287704, 451804, 342410, -82508, -226581, -28442, -223312, -28049, 127119, -69206, -155317, -6688, 102649, 194511, 338015, 194754, -12690, -263683, 22742, 225952, 360026, 316354, 347097, 49042, -52898, 207040, 131783, -102641, -37350, 268836, -85015, 42112, -13031, -41146, 129063, 542094, 570296, 348367, 292979, 155675, 228733, 407068, 180262, -14949, -170853, -92021, 30657, -125641, -362263, -489011, -685097, -692660, -293568, 199145, 192043, -215273, -341657, -385188, -65987, 236473, 331248, 247317, 181061, 54686, -232350, -324584, -534408, -267586, 175841, 342055]
11133C42055j80172l09529J07308O0383j30109j98761K7797M8794n7077q9603
11123c78914J63759j41418M12950M18244J08920j34909j9789p3613k16697n61861
11113d23328N4647L56946r6220Q5785M36780J51799k23199r2204k01819j40213
11103i1026J21688j65857m5610J82837j81844j00813K27001K96374p1755k34507
11093f3512j99596K89179K42954J02193k97859j87031K86274M36894l46978j53924
11083A08594p6153R1506j25862K3322k4115O1300k65118n891K57607K31935j27318
11072A49807r1262J7332L00238L8339p6853j67452j3915J06371O0334K80214j64205
11061D38948k49333K6173r0284k01226k16054R9916L90804M37254j92751k58705
$$ y = [342055, 161883, -147646, -40338, 20045, -110064, -308825, -281028, -232234, -289311, -378914, -215155, -356573, 56377, 474621, 583541, 448632, 428843, 355230, 138533, -423328, -368681, -11735, -107955, -22170, 414610, 566409, 343210, 251006, 49187, -91026, 30662, -135195, -180805, 2032, -179812, -280625, -53624, 242750, 170995, -63512, -263108, 26071, 269025, 371218, 73359, -113672, 172602, 609496, 262518, 108594, 32441, 123947, -1915, 21407, -2708, 58592, -206526, -212417, 45190, 277125, 149807, 58545, 75877, 376115, 414454, 337601, 170149, 156234, 262605, 322939, 603153, 438948, 189615, 215788, 125504, -75722, -291776, -191860, 198944, 636198, 443447, 184742]
11051A84742L3419k9617K73690J49338j26044J69742M93640j05924k88930m7808
11041G06248J31736Q9822k15280k09142Q2770N19583M66042L33872M37319j47542
11031B195428p0329j5836l32680J21982M9951J31841J24287l24123j82576Q542
11021A706487L66867M35400K14508j01808j92460k57635j51850k68021l54407
11012A397081K02010N30637R4144j9650j9993J14268j63006j10827n59928n12241
11002I52495K45174L59573n1113k60143L4926R8066J01944k65205n12137j8243
10992F85337K09698j65327J6050k38160q9861K26862j77223M13N1402k06317K33683
10981E46557J63846P0281R7068O7389k60387J0176j80104j76843N7401K07673
$$ y = [184742, 218161, 188544, 462234, 611572, 485528, 655270, 1148910, 1042986, 754056, 706248, 837984, 927806, 712526, 503384, 586154, 1105737, 1571779, 1905651, 2342970, 2195428, 2125099, 2109263, 1776583, 1898565, 1948516, 2080357, 2204644, 1880521, 1697945, 1706487, 2073354, 2508754, 2723262, 2621454, 2428994, 2171359, 2019509, 1751488, 1397081, 1599091, 2129728, 2223872, 2204222, 2184229, 2298497, 2135491, 2024664, 1464736, 952495, 1197669, 1557242, 1506129, 1245986, 1280912, 1378978, 1480922, 1215717, 703580, 685337, 895035, 729708, 745758, 507598, 417737, 644599, 467376, 467789, 519191, 312874, 546557, 710403, 780684, 877752, 945141, 684754, 694930, 514826, 337983, 395384, 603057]
10971F03057N4714l24816j10609K75884l24023m68123j1499q4344J29768M88412
10961B28421K35818o3488n5963j59691J02371J1869M49124J72885j15939J62879
10951I68286k5645L4262l33487j27748j18407j21819J93876J72328r4404K34721
10941G81963m0047l29510j2538p1598j4790R1283K6378k62779Q1224q5617L9903
10930B03872L6483n7689K8441o5487P8814P0654j81940j42278p5269P5946K76184
10919B47731J43266m3499M60460l9175j44220j51104j64826j42096j55215p5039
10909f3717m98181J47781K80175J70373j48248m41190j88199J72458J24695j5956
10899d60009K57220K01014J74555k24431j44448K08486o22j85734K72349K48085
$$ y = [603057, 657771, 332955, 222346, 498230, 174207, -293916, -305415, -389759, -259991, 228421, 464239, 400751, 344788, 185097, 287468, 299337, 748461, 921346, 805407, 968286, 942641, 976903, 643416, 515668, 397261, 275442, 469318, 641646, 547242, 781963, 741916, 412406, 399868, 328270, 313480, 404763, 431141, 168362, 249586, 163969, 203872, 240355, 182666, 211107, 145620, 224434, 295088, 113148, -29130, -104399, -28453, 247731, 390997, 347498, 807958, 768783, 624563, 473459, 308633, 166537, 11322, -63717, -561898, -414117, -133942, 36431, -111817, -553007, -741206, -568748, -444053, -460009, -202789, -1775, 172780, -51651, -196099, 12387, 11765, -173969, 98380, 346465]
10889C46465K68539k345j1273j40538l08476J03609j83494l4812K13446q6716
10879A64405L7538R4331O0908k81737j52881l4734K94854n740J03315M2023p1936
10868B50346K266r7184K0390j32324r3318r7391J04044j31684j4708O12901K86191
10857G09529l60847k17260l4491K5127l9446J13653J80055k20384k00924j42670
10847a87658q0266J81223J13094q1316n20508J06147J81679j17326J75714K90875
10837F1658n314L1672J53856L27614p9359k98418K35528j24914k21468L18245
10827C99100N52613l20814N252N5023K01860l58062m88345n9374o983k32860j39790
10816c92380K332P5154K61O9494j2852j40891J88492K70764j00344j74340L56009
$$ y = [346465, 615004, 612659, 601386, 460848, 152372, 255981, 72487, 37675, 251121, 164405, 201943, 296274, 357182, 75445, -77436, -112170, 182684, 176944, 280259, 322282, 250346, 252612, 155428, 175818, 43494, -49824, -147215, -43171, -174855, -189563, 423338, 709529, 348682, 131422, 96931, 122058, 82612, 196265, 376320, 155936, -44988, -187658, -267924, -86701, 26393, -54923, -575431, -469284, -287605, -404931, -229217, 61658, 56344, 88016, 241872, 569486, 490127, 191709, 427237, 302323, 80855, 399100, 951713, 630899, 636151, 691174, 893034, 534972, 46627, -12747, -19730, -252590, -392380, -390048, -314894, -314633, -245139, -257991, -398882, -210390, 60374, -39970, -214310, 141699]
10805A41699j6171J34407K9285j72817q1878q9799N4320l0208N9389k0165R5879
10794A03941J0800o082k40195L01177J10889l15772J12925R0791J56666l00360
10784B4780P439M48459J30178K55718L67290n8140j83822k45165R326J50653M4477
10773I51193J36840J0193m16130l52511j81766J80004K09601j17920m79543k50627
10763c10666K23067R8832J80939L11647J12474j25996j49436L84132O6544p7383
10753G14154r8597m52655m12414J06394M76714J25980j79258m27853j5079J85277
10743B2663O3176j82349j63324O9354L11310L81696o6447j65045q6404J39591
10733C24221m4538j69515O9781l60465j17592N37466J81185q5011k2011Q4611
$$ y = [141699, 125528, 259935, 289220, 116403, 34525, -55274, -954, -31162, 28227, 8062, 103941, 114741, 108659, -131536, 169641, 280530, -35242, 77683, 168474, 325140, 24780, 32219, 480678, 610856, 866574, 1233864, 1175724, 991902, 746737, 756063, 906716, 951193, 1088033, 1098226, 682096, 329585, 147819, 327823, 537424, 419504, -60039, -310666, -87599, 11233, 192172, 503819, 616293, 490297, 340861, 724993, 791537, 714154, 615557, 162902, -249512, -143118, 333596, 459576, 280318, -147535, -162614, 22663, 85839, -96510, -259834, -190480, 120830, 502526, 436079, 271034, 184630, 324221, 279683, 110168, 179949, -180516, -298108, 239358, 420543, 335532, 313521, 398132]
10723C98132M2016l48437K47541M42652j06716n7553R6432L25495K38287J28402
10713A406251l55337k95600k8060Q76J22576j89828J43310K22181K48291N1047
10703A325707J02706J48397K87950R968J15260j25225L68231L66407J76497k2783
10693B753115O05020K58322L0654M07428R2849k44749M9645K31369l68791j98916
10683C615946j3904J74127J32557J60702j01046J9928K5975L49988K81206j50781
10673D494698L56124K46732J36229m19020j47476O5401J30502J47274o1111N1864
10663E001217L16029K00317k05953n68285P2902L47538L16923K70364M35841K61825
10653F448718J92376L90981J85719n0230l26344j09720L15430J49361o47311m49424
$$ y = [398132, 440148, 91711, 339252, 781904, 675188, 617635, 714067, 1039562, 1277849, 1406251, 1050914, 755314, 727254, 728130, 850706, 660878, 804188, 1026369, 1274660, 1325707, 1428413, 1576810, 1864760, 1874728, 1989988, 1864763, 2232994, 2599401, 2775898, 2753115, 3358135, 3616457, 3647111, 4054539, 4147388, 3902639, 3952284, 4183653, 3814862, 3615946, 3602042, 3776169, 3908726, 4069428, 3968382, 3988310, 4014285, 4364273, 4645479, 4494698, 4850822, 5097554, 5233783, 4814763, 4667287, 4732688, 4863190, 5010464, 4949353, 5001217, 5317246, 5517563, 5311610, 4743325, 4816227, 5163765, 5480688, 5751052, 6186893, 6448718, 6641094, 7032075, 7217794, 7167564, 6841220, 6731500, 7046930, 7196291, 6548980, 6099556]
10643F099556O8544K02244K64547L98421L12898K07058k5568L10016O44789R72623
10633I455128J121186J229304J043001R81142J111836J132069Q07458R85265J423732
10624A9290121K456717L091503M497720O137809P224880R665031J2785668J5213995
10616H0363444J6283230J5891833J4266291J1228811N147919o61803k629360p59404
10608A39130961M786025J2152021J9613709K7040227L0415778K8996323K4572188
10601B86707232J6147393J705270j4093210j8915503j3577002k721148J0318493
10594B65571525K3114116L3103057L7383718L3546239K4807637J0222671j2735014
10587D15013949l4939049m1486924l3320371j9873202o150853N459221J3816479
$$ y = [6099556, 6168100, 6370344, 6634891, 7033312, 7346210, 7553268, 7527700, 7837716, 8482505, 9455128, 10576314, 11805618, 12848619, 13829761, 14941597, 16073666, 16881124, 17866389, 19290121, 21746838, 24838341, 29336061, 35473870, 42698750, 52363781, 65149449, 80363444, 96646674, 112538507, 126804798, 138033609, 143181528, 142519725, 139890365, 139130961, 143916986, 156069007, 175682716, 202722943, 233138721, 262135044, 286707232, 302854625, 304559895, 290466685, 271551182, 257974180, 255253032, 265571525, 288685641, 321788698, 359172416, 392718655, 417526292, 427748963, 415013949, 380074900, 338587976, 305267605, 285394403, 279243550, 284702771, 298519250]
10580B98519250J6631938J3978898P347682l132848j8578651l1667330l3919082
10573B49179857k7215301j8266302r790200l465367L87483K315495P68856k417821
10565A91496700p205734j3381481j8258927j8196732j5986546j2709541r603465
10558I6154274p378140n416600m541362l962842l305815l081516k602227k216087
10550F3649685k245402j985708j512681j601695j358368j818270j656168j408753
10542E0062640j249977j563262j340512j178876j107773o30227r07268j314736
10534D0770009j004477p52429j096766o28776n65394q19199j050086j006917r25221
10525C2920744n83648l93839l85956m41092p99332o12703p18329p57658o22777
$$ y = [298519250, 315151188, 329130086, 336477768, 333344920, 314766269, 283098939, 249179857, 221964556, 203698254, 193908054, 190442687, 190830170, 193145665, 193914521, 191496700, 184290966, 170909485, 152650558, 134453826, 118467280, 105757739, 96154274, 88776134, 83359534, 78818172, 74855330, 71549515, 68467999, 65865772, 63649685, 61404283, 59418575, 57905894, 56304199, 54945831, 53127561, 51471393, 50062640, 48812663, 47249401, 45908889, 44730013, 43622240, 42992013, 42084745, 40770009, 39765532, 39013103, 37916337, 37287561, 36722167, 35902968, 34852882, 33845965, 32920744, 32337096, 31943257, 31557301, 31116209, 30316877, 29704174, 28985845, 28228187, 27605410]
10516B7605410m18388k26046q897m52957n10604o45557k45413J94999k31232l93840
10506B4667475m02724m17361k75961j10874l05540n43893m55701l74973j37928
10497B1642520l22302l96393k43244k53759K6833r230k83344l99503l75666l02046
10487A9083866l20578l79784k40938j29812l65877m76889k52478k45175l36312
10478A6336023j01007k64827m92807l64479L10165k00040q29060l26524J3525
10469A4080969l28786j32733k88267l56564K04219J95927o4306m2102k93979m86355
10459A2488023k27267q6546k76764k28342l50547j94446j33286m19978k59252
10450A0311595K06520j45005k04792j8079j56898k76378q3896r1475m9275l93754
$$ y = [27605410, 27187022, 26960976, 26952079, 26499122, 25988518, 25342961, 25097548, 25292547, 25061315, 24667475, 24264751, 23847390, 23571429, 23460555, 23155015, 22611122, 22155421, 21780448, 21642520, 21320218, 20923825, 20680581, 20426822, 20453655, 20444425, 20161081, 19761578, 19385912, 19083866, 18763288, 18383504, 18142566, 18012754, 17646877, 17169988, 16917510, 16672335, 16336023, 16235016, 15970189, 15477382, 15112903, 15423068, 15223028, 14393968, 14067444, 14080969, 13752183, 13619450, 13331183, 12974619, 13178838, 13374765, 13310459, 13268357, 12974378, 12488023, 12260756, 12174210, 11897446, 11669104, 11318557, 11124111, 10990825, 10570847, 10311595, 10518115, 10373110, 10168318, 10150239, 9993341, 9716963, 9633067, 9541592, 9492317, 9098563]
10440I098563j57258L04210j24870l32390m26184k57029J2733j4081n90913n63053
10430F949728J21586P4127L36451J86241n8753n95256l15295K5090l80747k07972
10420F135200M6587k12195n4353L7197j0693k7045K1111k98871q1873P160j81562
10409E380663l01430k4489J31851J05461M7872N661j33160M6329M6868L5208L5848
10398E376682l79912l55483n8642M02857K09731k89643k8892k4677k16833j05078
10388D530110J09412n4270k93248K58508L15450M67136O01589M13503O58833J334703
10378H341726J967592K129523J916056J032012M76944o01531k143372k474120
10370A0644830j743023j384371p10174r09917n58682M4608Q592l80240N2404l8930
$$ y = [9098563, 8941305, 9245515, 9120645, 8788255, 8362071, 8105042, 8117775, 8103694, 7512781, 6949728, 7071314, 7145441, 7481892, 7668133, 7609380, 7014124, 6698829, 6723919, 6343172, 6135200, 6181787, 5969592, 5915239, 5952436, 5941743, 5914698, 5935809, 5636938, 5555065, 5562225, 5380663, 5079233, 5054744, 5186595, 5292056, 5339928, 5345589, 5212429, 5258758, 5305626, 5340834, 5376682, 4996770, 4641287, 4582645, 4985502, 5195233, 4905590, 4876698, 4852021, 4635188, 4530110, 4639522, 4585252, 4292004, 4550512, 4865962, 5333098, 5934687, 6348190, 7007023, 8341726, 10309318, 12438841, 14354897, 15386909, 15863853, 15262322, 13118950, 10644830, 8901807, 7517436, 6807262, 5897345, 5338663, 5383271, 5391863, 5011623, 5064027, 5025097]
10360E025097n93062j85617j2517p5714r4810R7728Q7691L0459l00496M0846J80940
10349D200545p02424m73787L93662J0562j76519j52879j52133J83669k70151k39461
10339B621084J16697Q135j51330k779K4825k10826j54580J94162P6135j36293
10329B385230l15805K01996M18520l22960k43246R9785Q7152j71083O1700J18137
10319B319426o6731p02121P5882L80866L92165j90712k08632J53534j84926N9006
10309B027757L6136l53486J81786J8522r7975Q8325J00076m06651K06507Q272
10299A809269k78231j89658r2511k420l08776L08598K85700k5141l40525J93049
10289A359354o226j31419o1684l299l8712K02713J94204k3536l74871J00128J52708
$$ y = [5025097, 4432035, 4246418, 4233901, 4158187, 4063377, 4161105, 4248796, 4279255, 3978759, 4019605, 4200545, 3498121, 3024334, 3417996, 3428558, 3252039, 3099160, 2947027, 3130696, 2860545, 2621084, 2737781, 2745916, 2594586, 2591807, 2616632, 2405806, 2251226, 2445388, 2521523, 2385230, 2069425, 2271421, 2689941, 2366981, 2123735, 2223520, 2310672, 2139589, 2201289, 2319426, 2252695, 1550574, 1626456, 2007322, 2399487, 2208775, 2000143, 2153677, 1968751, 2027757, 2063893, 1710407, 1892193, 1910715, 1812740, 1901065, 2001141, 1594490, 1800997, 1809269, 1531038, 1341380, 1248869, 1246449, 937673, 1246271, 1531971, 1506830, 1166305, 1359354, 1353128, 1221709, 1160025, 1156726, 1118014, 1320727, 1514931, 1491395, 1116524, 1216652, 1369360]
10278A369360j17947j04730J5931J40048R9983K95298J61009l65933n57740J31243
10268A066522K06315j46408j42040k4429K77655N3400m11300J40830M76855k89844
10258A207556k81739L7032K47667K20862q2766Q3429r733j37020K98637j10051
10248A473874j81228j10890k97152o5910J92609J27530k68326j35904j39478K34815
10238H29940J0715j69594L2124n975J14247k17812j30320J17865K95882N8315
10228I35387j90613l76938r909n4390l95238R4150N27445J66749j33333J0530
10218E73840J94306J02295P5554P8391L6497l3640o0752N9504j45392N8335k71551
10207F67387n6928j73067j24582K88630n3851k38961N3807j37930K27296L30161
$$ y = [1369360, 1251413, 1146683, 1162614, 1302662, 1402645, 1697943, 1858952, 1493019, 935279, 1066522, 1272837, 1126429, 984389, 959960, 1237615, 1291015, 879715, 1020545, 1497400, 1207556, 925817, 962849, 1210516, 1431378, 1348612, 1432041, 1422308, 1285288, 1583925, 1473874, 1292646, 1181756, 884604, 818694, 1011303, 1138833, 870507, 734603, 595125, 829940, 840655, 671061, 703185, 697210, 811457, 593645, 463325, 581190, 877072, 935387, 744774, 367836, 357927, 303537, -91701, 2449, 529894, 696643, 563310, 573840, 768146, 870441, 945995, 1024386, 1060883, 1027243, 966491, 1025995, 880603, 938938, 667387, 610459, 437392, 312810, 601440, 547589, 308628, 362435, 224505, 451801, 781962]
10197G81962l50615k04107n7802l8832J90080O2702K42821j1398K70628J33957
10187A019396M23415l3743L6248k35946m2216j1607J9160J63785K23750p7309
10177A484933q4991R8094P7286j15752j12787K12183N7375j41399L96863L22879
10167B194684J91520l339k20768l13345q5830k3881j29845K85491L49568k5118
10157B219137j09822k9545J03975K53100L46908K46052k79231n11672l21640M258
10147A921520J6401j66895J47872M47193K90395J45865l28839m15209o5418J15622
10137B108507n6314l45803m74126k31547R3997K31563K05975L13889O5481k7766
10127A883856l21507k2466R3308J46374n3371m70141j95533R0552M03287m7971
$$ y = [781962, 431347, 227240, 169438, 130606, 320686, 383388, 626209, 614811, 885439, 1019396, 1442811, 1409068, 1445316, 1209370, 1167154, 1155547, 1174707, 1338492, 1562242, 1484933, 1399942, 1498036, 1575322, 1459570, 1346783, 1558966, 1616341, 1474942, 1871805, 2194684, 2386204, 2382865, 2162097, 1848752, 1762922, 1739041, 1609196, 1894687, 2244255, 2219137, 2109315, 2079770, 2183745, 2436845, 2783753, 3029805, 2750574, 2238902, 1917262, 1921520, 1937921, 1771026, 1918898, 2366091, 2656486, 2802351, 2473512, 2058303, 1992885, 2108507, 2052193, 1706390, 1232264, 1000717, 1094714, 1326277, 1532252, 1846141, 1911622, 1883856, 1562349, 1539883, 1633191, 1779565, 1726194, 1256053, 1060520, 1151072, 1554359, 1506388]
10117A506388k77783j44819j29870M9071L56535K62537o24082k61447j17482J27794
10107G46842l6362j02374k72247M3323M3641K68948l54984k90719J62957K29658
10097D38683J73504L42068K31517p7077l02460k74667l10912l45817J99411p335
10087F6915l7783J70069L34354J70406j4146J05855j56209k56404n19973J28911
10077h005K46774M61358k8752k57699k43000K78142R4017j37080m7113j02120
10067B56522J6130p9061K54313J8448Q5450k05319q2777J02336k1553l02395k07450
10056a65356L89016J39465j09419N1265L34931o2574K10854o6993m34349k33372
10046E3468J64907n2776l71857J44904m8566l53180J56334M28722M00726K61583
$$ y = [1506388, 1228605, 1083786, 953916, 1002987, 1359522, 1622059, 997977, 736530, 619048, 746842, 710480, 608106, 335859, 379182, 422823, 691771, 336787, 46068, 209025, 438683, 612187, 954255, 1185772, 1108695, 806235, 531568, 220656, -125161, 74250, 66915, 29132, 199201, 533555, 703961, 689815, 795670, 639461, 383057, -136916, -8005, 238769, 700127, 671375, 413676, 170676, 448818, 542835, 405755, 358642, 256522, 272652, 193591, 447904, 466352, 551802, 346483, 263706, 366042, 344489, 42094, -165356, 223660, 363125, 253706, 304971, 639902, 577328, 788182, 721189, 286840, 53468, 218375, 165599, -206258, -61354, -109920, -463100, -306766, 121956, 522682, 784265]
10036G84265P8276m091n05600j26757j1783M1668M92474L84576l26196m5495K15495
10025I76832k02952k27322L83396K8625J27931L93894L48239M72921N56516J14017
10015B972097j53993m04756m33850k50377k25775k70031j16297o06340j93510
10006C17168L12574j35247j66688n36801K9249L88707k05476l17617N15241K97116
9996D98226j15973k9156Q3898j96054J0476J44147P1389j24805N1411R7375q5311
9985D05623n1297K44547k23462j74252J96202K5734j62350j39988O09850K96281
9975A026888q2011m17682m33658J64859P2814J9404K02466k7647J21049M6082
9965F92564o7057j80145l04620L6297P7794Q5654M0205K55408m5385k13841R54
$$ y = [784265, 862541, 858450, 352850, 226093, 214310, 255978, 748452, 1133028, 806832, 761337, 976832, 773880, 546558, 929954, 958579, 1086510, 1480404, 1828643, 2301564, 2858080, 2972097, 2818104, 2413348, 1979498, 1729121, 1503346, 1233315, 1117018, 510678, 317168, 629742, 494495, 327807, -208994, -179745, 208962, 3486, -314131, 201110, 498226, 382253, 353097, 436995, 240941, 251417, 395564, 466953, 342148, 393559, 490934, 405623, 354326, 598873, 375411, 201159, 397361, 423095, 260745, 120757, 730607, 1026888, 944877, 527195, 93537, 258396, 331210, 350614, 553080, 525433, 646482, 692564, 625507, 445362, 140742, 177039, 254833, 340487, 380692, 636100, 590715, 376874, 377828]
9954C77828K0721O4226k69599n6128l6149J57182L5767o203J36699K9759j17413
9943C36690J26187O623J40580K51380Q8098m0623j04460J33865l3126k13204j08606
9932E83404K66487M26097k74219j31639k06984j98018L6008K8576N1586j17431
9922D63867L5214m6518R0765k21835j85043j51719J86161P0784j74338q8482n5169
9911g6313k26053o108K36168P0504k8104l245J57915q9758J09845Q3067J8027
9900B45945j35157j52042K64148R2291j01824p5937j66807J34542K47303J41942
9890D94404k0718j99300m03588j39406J40160L82229N5009n01238m85774J61924
9880e16298K57733J58967p6737K12803K08908n4235j05549N0395J78586m99478
$$ y = [377828, 398549, 462775, 193176, 137048, 100899, 258081, 293848, 287645, 424344, 454103, 336690, 462877, 469500, 610080, 861460, 949558, 908935, 804475, 938340, 905214, 692010, 583404, 849891, 1275988, 1001769, 870130, 663146, 465128, 501136, 529712, 581298, 463867, 499081, 452563, 543328, 321493, 136450, -15269, 170892, 241676, 67338, -21144, -76313, -302366, -308474, -72306, -1802, -29906, -33151, 124764, 35006, 144851, 227918, 245945, 110788, -41254, 222894, 315185, 213361, 137424, -29383, 105159, 352462, 494404, 473686, 274386, -129202, -268608, -128448, 253781, 308790, -192448, -678222, -516298, -258565, -99598, -176335, 36468, 245376, 191141, 85592, 135987, 314573, -184905]
9870a84905m19701K32074K68188j20728j97952n6948N111M23828K49229l6084
9860A62112m11084j12563L02839l4387M3292N061M4465k19929k5721m4110J03917
9849a86108K58211O5458R983j16214q4736K60129J62081l29769j56512m3480o9674
9838b30631N39929K92273K55161J30427m64524n41414j33607R6771m657K33693
9828A73421m431k0749j19972J11422Q5112j21351l8255l4347K56546K56217M6693
9817E90306j03842j81483m72400j6448J21553j78354J57901J8711K0908r3833
9807a36981K70081q5134j26855j92853L6749m9570K91369j73718J21755J1496
9797c3661K19245j38530O3109K5386J46549p6425j22508N8181o3982j44389j60936
$$ y = [-184905, -604606, -372532, -104344, -225072, -423024, -479972, -474861, -51033, 198196, 162112, -248972, -361535, -58696, -93083, -49791, -44730, -265, -220194, -245915, -290025, -186108, 72103, 137561, 147544, 31330, -53406, 206723, 368804, 39035, -117477, -160957, -230631, 309298, 601571, 856732, 987159, 522635, -18779, -152386, -55615, -60272, 173421, 168990, 148241, 28269, 139691, 224803, 103452, 65197, 30850, 287396, 543613, 590306, 486464, 304981, -167419, -183867, -62314, -240668, -82767, -64056, -43148, -136981, 133100, 47966, -78889, -271742, -234993, -284563, 6806, -166912, -45157, -33661, 185584, 47054, 110163, 135549, 282098, 205673, 83165, 141346, 77364, -67025, -227961]
9786b27961O9966K59102K43864K55057l03843J79268j12338q4373Q1965o4123
9776B96584k23421l95410P1735L39032K3717J31287m1508J00610j87570k96351
9766a81295k8642R2861M1308J95791K14597L7192N7772k44937j64809O2495N9912
9755A42245O9994J27786k30330K39487L09934k78141l98702K49094j59313l4744
9745C7310P2355L39840J8646k47176j5725J68444j3571m09434J5713K07209L3014
9734B06625O8688k11212j42429J46434j78699Q8850r8078k03168K54435J77471
9724A08917j51107M30610R6107J02729l53554j76966j03188K4269j36773K54340
9714I5384J78492k72904r7068n2246J16468J24362M8138O424p2253J69064K6507
$$ y = [-227961, -157995, 101107, 344971, 600028, 296185, 475453, 363115, 278742, 360707, 296584, 73163, -322247, -250512, 88520, 112237, 243524, 202016, 302626, 115056, -181295, -209937, -117076, -75768, 120023, 334620, 371812, 429584, 184647, 19838, 82333, 142245, 212239, 340025, 109695, 349182, 659116, 380975, -17727, 231367, 72054, 37310, 109665, 449505, 468151, 220975, 205250, 373694, 360123, -49311, -33598, 173611, 206625, 275313, 64101, -78328, 68106, -110593, -21743, -119821, -322989, -68554, 108917, -42190, 388420, 484527, 587256, 233702, 56736, -46452, -22183, -158956, 95384, 273876, 972, -96096, -148342, -31874, 92488, 140626, 147050, 74797, 243861, 270368]
9703B70368p1874j35537j45305Q0379M72869q8622l8192J92248n9784o1829o4691
9692C50030o6164l54417k80570J49237K96302M4183Q0487j25550J01778J04959
9682C00275Q410K5496m37853p4709j88261m56109J12475J92667L72403L54273
9672B09067J22511j78641J11882m61025J02648J34142n9290l1950k68103K94073
9662b4686K93827r3988K37178O4825o6097L7476J1568M35941K81119L26745L29950
9651A833858K68753k17425l62138J71905j51215m08704k10411l05620K7896J79835
9641H26734p0502l51562l66894k43826j86216j72723J21738L90827m3867P3790
9631b2501q2992k40051L57036K66816J11027j83763o5385J54211k42104j79603
$$ y = [270368, 198494, 62957, -82348, -1969, 470900, 382278, 344086, 536334, 476550, 414721, 350030, 283866, -70551, -351121, -201884, 94418, 138601, 219088, 93538, 195316, 300275, 308685, 334181, -103672, -178381, -366642, -822751, -710276, -517609, -145206, 209067, 331578, 152937, 264819, -196206, -93558, 40584, -18706, -50656, -318759, -24686, 269141, 175153, 412331, 477156, 411059, 448535, 460103, 896044, 1177163, 1503908, 1833858, 2102611, 1885186, 1523048, 1694953, 1543738, 1135034, 924623, 619003, 646899, 826734, 756232, 404670, 37776, -206050, -392266, -564989, -443251, -52424, -96291, -22501, -105493, -345544, 11492, 278308, 389335, 205572, 140187, 294398, 52294, -127309]
9621a27309K4813J01712K48840o6514m03877l05106j5033L79389L61714P0838
9611B69467o7973r3495j34048J3881k05564R0164L94859J10434j01330j30333
9601A46062m39671k41698L51923K30031k2798j26974j11716k57476L9062J5379
9591d17876K89604K32311J86526J13074j62627n08185J1407k95065J30659L88135
9581c2037J1632J3034J48365k44476k7344r8945k19157j03379M37534K38665k88068
9570a64176k37712J64105K84965k20871J19282k43038l00651Q4347L16001K21809
9560B4061k90455j51148J73751p9665K1690K32896L4388k89368m9886M18681J80199
9549B25144k12919k04395n3598K78091K89399k17344n593N29616K84743p5714
$$ y = [-127309, -102496, -784, 248056, 181542, -222335, -527441, -542474, -163085, 198629, 269467, 201494, 107999, -26049, -12168, -217732, -127568, 267291, 377725, 276395, 146062, -293609, -535307, -183384, 46647, 23849, -103125, -214841, -472317, -433255, -417876, -128272, 104039, 290565, 403639, 241012, -267173, -255766, -550831, -420172, -32037, -20405, -7371, 140994, -103482, -130826, -229771, -448928, -552307, -114773, 123892, -164176, -401888, -237783, 47182, -173689, -54407, -297445, -598096, -513749, -197748, 24061, -266394, -417542, -243791, -323456, -301766, -68870, -34482, -323850, -373736, 44945, 225144, 12225, -192170, -245768, 32323, 321722, 104378, 98785, 628401, 913144, 837430]
9539H37430Q1982k82302k82984J65496l31579q443M0424J74633K33463J09643
9529G37763J59074L6064n84955m50486K4231l07978r5165J84617K09580o7178
9519a54433O6642j64144Q6084K11494o898n3523k24236J19698P9877J9897m4400
9508f3942q9285M1580L45804N54378j3832r4027J0332K7273o9899k36725O1063
9497D72720L01801P7159q6896k16332k97410j55352J5728k09847n8841Q2777M3635
9486c0858Q2665K7056O1670k61829l36649M1245o065j67838P5889M22460j51086
9475b43340l56911Q7876M04214K83108k83012J3464K32431J13026n8321m60257
9465b67722J6798J28995Q7474M00886L32428L09521j79536j70942L57910m6997
$$ y = [837430, 919412, 637110, 354126, 519622, 188043, 179600, 220024, 394657, 628120, 737763, 896837, 932901, 347946, -102540, -78309, -386287, -481452, -296835, -87255, -154433, -87791, -251935, -165851, 45643, 38745, -14778, -239014, -119316, -39439, -19542, -63942, -153227, -111647, 234157, 788535, 774703, 680676, 691008, 718281, 648382, 411657, 472720, 774521, 851680, 764784, 548452, 251042, 95690, 111418, -98429, -157270, -74493, -30858, 51807, 78863, 140533, -121296, -457945, -416700, -422765, -590603, -514714, -92254, -243340, -600251, -512375, -108161, 174947, -108065, -94601, 137830, 250856, 192535, -267722, -250924, -121929, -34455, 366431, 698859, 1008380, 828844, 657902, 1015812, 968815]
9455I68815l14608l93851k63843N7726j6683k1093K534j87456P6706j47297P8952
9444a60098J51639R0251J80167k22982l1780N1105J92427J05403j48679J39337
9434C46790J96345J31553k3673j41427L05432k17180l45139q1125j22390p4770
9424b5584Q0098j90477K6165J44876K85908J84408J97955l09634j82501j12967
9414I8247j71000p291L30930j09099J7159M88476Q1407j19570O8805j82246m28756
9403F7062j55003j06089j4244L49790J40390l09357J72618l42607K69385J33290
9393B05235L8602J0107k04145M93178K02472k59336m37701M5481K49493j80358
9383A63028J12233N936l07325l04170K03586L70485L79062m45885p25225j25724
$$ y = [968815, 654207, 260356, -3487, 54239, 37556, 16463, 18997, -168459, -91753, -239050, -160098, -8459, 81792, 261959, 38977, 7197, 58302, 250729, 356132, 207453, 346790, 543135, 674688, 651015, 509588, 815020, 597840, 252701, 171576, 49186, -25584, 54514, -135963, -109798, 35078, 320986, 505394, 703349, 393715, 211214, 98247, -72753, -80044, 250886, 141787, 158946, 647422, 728829, 609259, 678064, 495818, 67062, -87941, -194030, -208274, 141516, 281906, -27451, 145167, -197440, 71945, 205235, 243837, 253944, 49799, 542977, 745449, 486113, 48412, 93893, 343386, 163028, 275261, 281197, -26128, -330298, -126712, 243773, 622835, 176950, -548275, -673999]
9373f73999J47238k65727j61631j54212J86907M75701K29880K68967K71176P369
9363C31669K11353L6678J1102l99047L35812l1817k76841N6863k80290J52594
9353A48076j73526j03275R9577K10334o4834J92766K73107L44468m00033m31316
9343I5344Q3066J03056k99337m2958N85291K7603j92499k68625Q8449K01430R2443
9332D73263p376j0588k04306j48397J4697j52952k44864N4667K72932J72701M48
9321B20225l41501l3276J82501n2810q3532m0454j03410O3110Q007k28613j8337
9310d28090K64276K93812L284j7214j001l2925j35299l98516L328L87684N5577
9299e084J41145l05050k04249J11052L08801J78567p6774M8616O5085j32428k69526
$$ y = [-673999, -526761, -792488, -954119, -1108331, -921424, -445723, -215843, 53124, 324300, 331669, 543022, 579700, 590802, 191755, 527567, 495750, 218909, 275772, -4518, 148076, -25450, -128725, -29148, 181186, 116352, 309118, 582225, 926693, 526660, 95344, 178410, 281466, -17871, -60829, 524462, 552065, 359566, 90941, 179390, 380820, 473263, 465887, 455299, 250993, 102596, 117293, -35659, -280523, -225856, 47076, 219777, 220225, -121276, -154552, 27949, -24861, -108393, -148847, -252257, -189147, -181140, -409753, -428090, -163814, 129998, 133282, 116068, 115067, 82142, -53157, -451673, -448345, -60661, -5084, 136061, -168989, -373238, -262186, 46615, 225182, 148408, 197024, 262109, 129681, -139845]
9288a39845J3360J85159j07670l00957j62166k9442K01976L17936J01771k93829
9278b13707J6728M85768k58941m89658l70056Q7615N2817K6052L16220K2883j44040
9267d68319K1872L64493K21199P7645k23053Q8884k12073p3329k37118k49265
9257f89064L17349N85453n4291l26647J38596J34652k02602K67670J97904k34310
9247A34710k43899O1844q0187Q6097k50539j78825R8109J13255K95170K04240
9237B39975L6563k33302p064J73623l11306k25427n8530M63641J14925L36856
9227E29954J64548j00788j23310j44736l6629k91725J3754K69748J985K86121
9217E68922J74434j69548k31881r0617Q6811k24497j76217J7803n4549j22404
$$ y = [-139845, -126485, 58674, -48996, -349953, -512119, -541561, -339585, -21649, 80122, -213707, -196979, 288789, 29848, -459810, -829866, -742251, -689434, -663382, -347162, -324279, -468319, -446447, -81954, 139245, 216890, -6163, 82721, -129352, -202681, -439799, -689064, -371715, 213738, 159447, -167200, -28604, 106048, -96554, 171116, 369020, 134710, -109189, -47345, -127532, -41435, -291974, -470799, -372690, -259435, 35735, 239975, 276538, 43236, 36172, 209795, -101511, -326938, -385468, 78173, 193098, 529954, 694502, 593714, 470404, 325668, 289039, -2686, 11068, 280816, 282801, 568922, 743356, 573808, 341927, 251310, 338121, 113624, -62593, -44790, -99339, -221743]
9207b21743P8021m7009M9498m96542q5785L15462J07101j03966K91499K58854
9197A45390p0747L37332J87452l98712l97222k38394J68235L86934J70492k76309
9187A4451k84832l3065L96714L5516k40980K4388n1740o2339n2341J23027k54944
9176c86145k72424j9184K23661j5254L5250M81947J25821j21043J49942k10480
9166g909j20006K45897L07696j47653M9897J7021m0065m68969r9525K82343j38472
9155a19745M6567l07082l07399K9376L51486J96354q8848O71300L4570k68833
9145B37746J75945n454k5576J94107k40716k04646J11400K70850K30333L80437
9135A124426q3224m57833j97370m03058k08768k12705Q8226J70622k33364J86473
$$ y = [-221743, -143722, -190731, -141233, -637775, -723560, -408098, -300997, -404963, -113464, 145390, 74643, 411975, 599427, 200715, -196507, -434901, -266666, 120268, 290760, 14451, -270381, -303446, 93268, 128784, -112196, -87808, -139548, -201887, -254228, -131201, -386145, -658569, -677753, -454092, -469346, -434096, 47851, 173672, 52629, 202571, -7909, -127915, 117982, 425678, 278025, 327922, 344943, 304878, -164091, -263616, 18727, -119745, -73178, -380260, -687659, -658283, -306797, -110443, -199291, 472009, 506579, 237746, 413691, 408237, 382661, 576768, 336052, 131406, 242806, 513656, 743989, 1124426, 1041202, 583369, 385999, -17059, -225827, -438532, -350306, -179684, -413048, -226575]
9125b26575j3921j66372J15821L39607R0517K62023n8943o3398k10532n34369
9115d66142k02772J75516K24813K21503J78843k22849K26114k88237j15989k1862
9105b91062N4947J09438K6506J50811J57466K80740o7110l41716o2179j19762
9095a01921J34204P3064o0470J79296j69523j59660J1169k93579N9757j04361
9085d32024p9726j9036L99576L34567l12586j59579J46685O6745p9401l12925
9075d47704K68526j34216N3229J40712n1424k10535M92921K74968K21458r136
9065E98799l71477K31440O2452j96956j31696k74885L20804J26769j45138n8087
9055A62025p3109J93116l58605j40943K37077L21862j58173r1223j01260j93034
$$ y = [-226575, -240496, -406868, -291047, 48560, 139077, 401100, 342157, 278759, 68227, -466142, -668914, -493398, -268585, -47082, 131761, -91088, 135026, -153211, -269200, -291062, -236115, -126677, -100171, 50640, 208106, 488846, 421736, 80020, 17841, -101921, 32283, 105347, 44877, 224173, 54650, -105010, -93841, -387420, -327663, -432024, -511750, -530786, -131210, 203357, -109229, -268808, -122123, -55378, -134779, -447704, -179178, -313394, -260165, -119453, -170877, -381412, 111509, 386477, 607935, 598799, 227322, 458762, 521214, 324258, 192562, -82323, 238481, 365250, 220112, 162025, 88916, 282032, -76573, -217516, 19561, 341423, 183250, 92027, -9233, -202267]
9045b02267j32299O084k10031j50117L33507J57304r6619R4422o0702j40119J02673
9034b98164N0212J81347j8409L6655J55624j02652M465j81470k41013L18915J18132
9023B3642m2729J22075k16469J12981j10633r4754J255r8604K55070O31925L98824
9012I82583J20767l04670n24345m69295l88429o0632K50565J90717L59858o6668
9002I0451J1124J2720p1949J32596j1460K10096K9821j87648l14522l87313l0110
8991e16194P3388o7280K29876J68872M2300K06141M5867Q6382k04632k77697k83253
8980d96230m9853K90423O72610O3446l07061l25511q5404L25902J64830j92432
8970F0720j61539K79475j36620m18755P6057L44493P9189j65574O1227p2389k35836
$$ y = [-202267, -334566, -328482, -538513, -688630, -355123, -197819, -294438, -200016, -260718, -400837, -298164, -247952, -66605, -85014, -48359, 107265, 4613, 9078, -172392, -413405, -94490, 23642, -19087, 102988, -113481, -500, -111133, -205887, -204632, -303236, -48166, 583759, 982583, 1103350, 798680, 274335, -194960, -583389, -644021, -393456, -202739, 157119, 90451, 101575, 114295, 42346, 174942, 163482, 373578, 403399, 215751, -98771, -486084, -516194, -442806, -510086, -280210, -111338, -69038, 137103, 182970, 269352, 64720, -212977, -496230, -546083, -255660, 416950, 480396, 173335, -152176, -237580, 88322, 253152, 60720, -100819, 178656, 42036, -376719, -300662, 43831, 123020, -42554, 18673, -53716, -289552]
8959b89552K25337N43996k17842j56570r9423k24404N2230K51062M274k4284k50210
8948a85386J51926r0302k37874N8520K79735K19584J57616N8316l4840j592k65781
8937A09922J63814L61959K42794m95761k88386J18327K50673j82420R260J19601
8927D09783k35864m598J97078m06867j02901K57779J47563r2722k42005k80740
8917c53494p0650r8049L01064M61065k52261q248N2242J43707L44666J35834j20104
8906E35772j19453j79318M2011n8263J05282N9889N4468k15209k54180k62277
8896b91278J53857L27534M5133j45055m26035K35703r2605j43441L12159J72802
8886A48774J7555N3995o2528J31000J57431K50032J24579o49372l66037K97665
$$ y = [-289552, -64215, 479781, 261939, 105369, 5946, -218458, -166228, 84834, 89108, 64824, -185386, -33460, -123762, -361636, -303116, -23381, 196203, 353819, 412135, 377295, 375703, 109922, 273736, 635695, 878489, 382728, 94342, 212669, 463342, 280922, 290182, 409783, 173919, 169321, 366399, -40468, -143369, 114410, 261973, 169251, -72754, -353494, -424144, -522193, -221129, 239936, -12325, -20573, 31669, 175376, 520042, 655876, 535772, 416319, 237001, 279012, 220749, 326031, 385920, 440388, 225179, -29001, -291278, -137421, 190113, 235246, 90191, -335844, -100141, -192746, -336187, -24028, 148774, 166329, 220324, 157796, 288796, 446227, 696259, 820838, 171466, -194571, 103094]
8876A03094j79820M1793L69k597r4144J50648J95072Q7800k24070k25055k89320
8865d36230J07527M00370K23027J10735q7264r6247k94074J0401J15177l73406
8855c19984m5980J43087L48373m7234o0619Q9276O6515l07978N664K03782K58374
8844C33276m02294J23309K63815J3220p1956m8619l08575j08460j9113L1029J50884
8833d3484K05616j7571k22960l26170N7195n1371J28657l0109J4587J88199J97815
8822A00404Q4888K6663J6605p5210K36549j46560n8973J40896j99510L47280K0864
8811D93896j7386n28029m10246J34189J87438J90339K65909k64681k28036r674
8801a86281l30527n4706N36587K89477J96764m1797K11920j56781l66963j43666
$$ y = [103094, -76726, -34933, -34564, -37161, -131305, 19343, 214415, 302215, 78145, -146910, -436230, -328703, 71667, 294694, 405429, 318165, 221918, -72156, -61755, 53422, -319984, -365964, -222877, 125496, 78262, 17643, 106919, 173434, -134544, -128880, 74902, 333276, -69018, 54291, 318106, 331326, 259370, 210751, -97824, -206284, -225397, -194368, -43484, 162132, 144561, -78399, -404569, -347374, -398745, -270088, -300197, -285610, -97411, 100404, 185292, 211955, 228560, 153350, 389899, 243339, 184366, 325262, 125752, 473032, 493896, 476510, -51519, -461765, -327576, -140138, 50201, 316110, 51429, -176607, -186281, -516808, -571514, -34927, 254550, 451314, 409517, 621437, 464656, 97693, -45973]
8791d5973L1523j08137N7942J02789K00311j16941k13264k8784j03089R0154J63542
8780C0073L1198k28513k61588k89739J416j8106M15820L48027L0108n8571K25184
8769B25309J90898l24607P3444j17156l02913k92776m5593K12425J56049K01906
8759b3014m2733L34443M15296M28405r0212l15866k92925k61654j40305P3674
8749H5109N0087J66781J80246J95964j60722j80361l6578J93887m2178R2811n5970
8738D89076j46863k92380N9192J12381m3597J38124J50942m10529l4911j71248
8728a49813L3299J37855l9649p7117L54336q288J03782j16884K1230k55244n65171
8717e61664q1831L99075N1787J11027K40067J13496J66920j34974N7825L59201
$$ y = [-45973, -14450, -122587, -64645, 38144, 238455, 121514, -91750, -120534, -223623, -133469, 30073, 61271, -167242, -428830, -718569, -717153, -735259, -319439, 28588, 58696, 125, 225309, 416207, 91600, 165044, 47888, -255025, -547801, -593394, -380969, -224920, -23014, -65747, 268696, 683992, 1112397, 1022185, 706319, 413394, 151740, 11435, 85109, 135196, 301977, 482223, 678187, 517465, 337104, 300526, 494413, 452235, 545046, 489076, 342213, 49833, 109025, 221406, 177809, 315933, 466875, 56346, 21435, -149813, -116514, 21341, -18308, -95425, 258911, 250623, 354405, 237521, 258751, 3507, -561664, -643495, -244420, -192633, -81606, 158461, 271957, 438877, 303903, 361728, 720929]
8707G20929j46427r1374k6460k40386m77082N2613L63079J21310l35630k8004
8697h7432l27060K7424M49450J76065m37095l57933M1528L8005L85835J82800
8687I1587j15131j74109Q5377l77233N0409m687K57752K93948L26299N6036r1771
8676C98477j34006J95j21559j12211l9945J6814j26338m75007k78537N3306M768
8665h14043j07498J00022N2123K89503K41707L52880l8568j41040M2854N6202
8655C4142o84911l20920K16121K66175J43034J19406r4630l24815n8795J17933
8645e87260P5582Q2464M2977P1021p7856K08679K89492K92438O95643j65120k92704
8634F35356k91988o4602m40801k52872J25866M8761m245q2368K88142j2573k48342
$$ y = [720929, 574502, 483128, 456668, 216282, -260800, -208187, 154892, 276202, -59428, -87432, -414492, -387068, 62382, 238447, -198648, -556581, -515053, -477048, -91213, 91587, -23544, -197653, -112276, -489509, -439100, -443787, -186035, 107913, 434212, 490248, 398477, 264471, 264666, 143107, 30896, -9049, 7765, -118573, -593580, -872117, -818811, -814043, -921541, -821519, -769396, -479893, -238186, 114694, 76126, -64914, -22060, 34142, -650769, -971689, -755568, -489393, -346359, -226953, -321583, -646398, -705193, -587260, -511678, -429214, -386237, -315216, -393072, -184393, 105099, 397537, 1093180, 928060, 635356, 343368, 278766, -162035, -414907, -289041, -240280, -244525, -326893, -38751, -51324, -299666]
8623b99666J39319L30670m049p7995M4094j0552K77838j46717k41777l0117k6533
8612d5485O5046R5597j69075k72716P0182K77593M02103J08352q7944o0687N337
8601C88303l6753j04781l23536J66379L31237J54491k60609O3211L2861o5039
8591C45764N4031j89786k35524n8672j53367q5921j4685L30545K60961J46135
8581C99481K19086m2725k81319j71167l48339j61084L96192k09600n28609l8067
8571g66151M22015L47034m4699l8862J89631p4153J11503k5517J95762L87568
8561G04131k80305k09515k05760m2638M7617K2192J12832l73258m76138J08392
8551e92450K09902m1154q6043K22201J05456J7935K82829K49350n6489j86474
$$ y = [-299666, -160347, 170323, 166274, 88279, 132373, 121821, 399659, 252942, 11165, -18952, -45485, 19561, 115158, -53917, -326633, -256451, 21142, 423245, 531597, 443653, 382966, 388303, 351550, 246769, -76767, 89612, 420849, 575340, 314731, 377942, 410803, 345764, 399795, 210009, -25515, -84187, -237554, -323475, -338160, -7615, 253346, 399481, 618567, 575842, 294523, 123356, -224983, -386067, 10125, -199475, -728084, -766151, -344136, 2898, -41801, -80663, 108968, 34815, 146318, 120801, 316563, 704131, 423826, 214311, 8551, -34087, 13530, 35722, 148554, -224704, -700842, -592450, -382548, -423702, -509745, -287544, -182088, -164153, 118676, 368026, 311537, 125063]
8541A25063k62213k21943K31197o0087m09027j11449L24257m357j21926K92619
8531b17866K59481j8899k6873j80154l40176k5869l9233R7821K87084L9825L49400
8520A84541j48026N6191l8818j46339O1230K0281R1978L4030k75534N1729q5968
8509a94705J27262K39489R4412J81419o5410j97374K51690N0005j4322Q3896J89766
8498G46128m92133k48564j14999J87120J02747j5102K01018j01532k17134k13227
8488a65678p9382j31631J98546K24878q2735m10369K9812K98631J97923K56989
8478C36984J81119n42825k03666P5289K28361j85649k55875n8505J5680J90079
8468b19008q9522J59981M62441J37606n0359k20654l26935R5921M92965R4530
$$ y = [125063, -137150, -359093, -127896, -187983, -597010, -708459, -384202, -388559, -510485, -217866, 41615, 22716, -4157, -184311, -524487, -550356, -589589, -491768, -204684, -164859, 184541, 36515, 92706, 53888, -92451, -31221, -10940, 81038, 115068, -160466, -108737, -194705, -67443, 172046, 266458, 447877, 382467, 185093, 436783, 486788, 472466, 556362, 746128, 253995, 5431, -109568, 77552, 180299, 165197, 366215, 264683, 47549, -165678, -245060, -376691, -178145, 46733, -36002, -446371, -416559, -117928, 79995, 336984, 518103, -24722, -228388, -153099, 75262, -110387, -366262, -424767, -409087, -219008, -308530, -148549, 313892, 451498, 401139, 180485, -146450, -50529, 442436, 536966]
8458E36966l99084o19170L2646k0109k8528L24901L59273K82241J1614j9032p7030
8447C84688O150K95056J17439J8575k1693j64550J2497j55007k60287K8593L66464
8436F27925L64953l47646l41559r1262K40896K15015k31894K5330r1342j68093
8426B02323j43617R2485j3062J85425k23724J73547k93810l07343k20846m1021
8416e89643q0823j33919K17628L9580r7309P467L52208M75300j64691q1918k12663
8405b68783K92581K7754J10961J0286k5402j55471J58246R7187o5888k76943K453
8394i3019L82291o6114k42443l49633j64480J80188M60774J43781j9025K09744
8384D42064k6706l34247p3513K9226q8176o0817o7336p4237J97696L12774M4206
$$ y = [536966, 137882, -481288, -448642, -468751, -497279, -172378, 186895, 469136, 480750, 461718, 384688, 390838, 685894, 803333, 821908, 800215, 635665, 648162, 493155, 232868, 261461, 627925, 992878, 645232, 303673, 212411, 453307, 668322, 436428, 461758, 370416, 202323, 58706, 151191, 138129, 323554, 99830, 273377, -20433, -327776, -548622, -589643, -670466, -804385, -586757, -547177, -644486, -637019, -284811, 190489, 25798, -56120, -268783, 23798, 51552, 162513, 172799, 147397, -8074, 150172, 247359, 181471, -95472, -93019, 289272, 223158, -19285, -368918, -533398, -353210, 107564, 251345, 232320, 442064, 415358, 81111, 7598, 36824, -51352, -112169, -179505, -253742, -56046, 256728, 300934]
8373C00934n5747J14312l3441J29414j22915k33398J84310k21676l19631l3683
8363b91521R0411j18883l70895R7481K18932K08887P7014L3462L38334J08116
8353C91338j99432j98988j83813l1015K07249M1421k32869j15463j63667K78667
8343b06572K49794j39204J21409j13364l04232J63909J23496K98002k15210k33167
8333b55139R2295P5279j20736j94047J25982M92869J05782r9297k04084L27059
8323C45963J54863O2311P2145n3332l88860k87314j11176o8385J9639J44912P3376
8312c5858R4806J47721J44019j51986k04740l3700J9702L1031k38698P6666P6148
8301g4889r2975K83800K90195k40383o3785l9990j76738l22273j60169K29250
$$ y = [300934, 245187, 359499, 326058, 455472, 332557, 99159, 283469, 61793, -257838, -291521, -201110, -319993, -690888, -593407, -374475, -165588, -88574, -55112, 283222, 391338, 191906, -7082, -190895, -221910, -14661, 26760, -206109, -321572, -485239, -206572, 43222, -95982, 25427, -87937, -392169, -228260, -104764, 193238, -21972, -255139, -162844, -87565, -208301, -402348, -276366, 216503, 322285, 222988, 18904, 345963, 500826, 563137, 635282, 581950, 193090, -94224, -205400, -273785, -254146, -109234, -35858, 58948, 206669, 350688, 198702, -6038, -39738, -20036, 10995, -227703, -151037, -74889, -167864, 115936, 406131, 165748, 101963, 61973, -114765, -437038, -597207, -367957]
8291c67957K60913K11222K17860j96760k17389Q163P1845J36468k26644j64552
8281b66831J10711J99808K61457m96924l37749K23883J78632O6610j86004k45451
8271d91858o5538J46957J62962J43725j09411k6358j32290q647L38593n6918J21637
8260B2854L40251J4752j21198q1149o4391J92278k4942j81701J06949J84520J53757
8249E41980j56172o2104r8773j71765p0034L08534k08572k64727k03729J30885
8239b54477J47289R1252n6150k02122j61754Q3270K34497L39958J39997k08399
8229A53361K30299m78357m47149j17709j27904k4105M74706Q31646k9982m76923
8219a2117j0231k89528J01085K60820l8203K90333k65263Q0270o0133J22719j0607
$$ y = [-367957, -107044, 104178, 322038, 125278, -92111, -83948, -12103, 124365, -102279, -266831, -156120, 43688, 305145, -191779, -529528, -305645, -127013, -60403, -246407, -491858, -557396, -410439, -247477, -103752, -213163, -239521, -371811, -380458, -41865, -98783, 22854, 363105, 377857, 256659, 175510, 111119, 303397, 278455, 96754, 203703, 388223, 541980, 385808, 323704, 224931, 53166, -16868, 291666, 83094, -181633, -385362, -254477, -107188, -15936, -72086, -274208, -435962, -352692, -118195, 221763, 361760, 153361, 383660, -94697, -541846, -659555, -787459, -811564, -336858, 494788, 464806, -12117, -22348, -311876, -210791, 50029, 11826, 302159, 36896, 117166, 57033, 179752, 169145]
8208A69145R3754P6982j02535J08373L40812j34262N5270j92173n01979n38000
8198f24613k12262J32278J56010k5607L7260K3495L4883J34998j17489j39919
8188f00966L73878J45167M1741M7958k05011k013k008J18948K14471j04120l27573
8177b99528O6285K19701R3120K71481j64260m19930N9137j49620o6957l23917
8167g14488J3333J15292K99431J41075k05645j15824l3711L25156K93333J35204
8157B53156K6085k36633n06250J7174J800L0889K82831O0477p9529K22150k88139
8146b15989r6800J95421N9140k07251j5690M06252L19245J4623j46537L05815
8136F18229m570j16635j97641k04830r6260r35R0183j53594k34808l22635R5863
$$ y = [169145, 262899, 339881, 237346, 345719, 686531, 552269, 607539, 415366, -86613, -624613, -836875, -704597, -548587, -574194, -536934, -513439, -478556, -343558, -461047, -600966, -227088, -81921, -40180, 7778, -197233, -199246, -201254, -82306, 132165, 28045, -299528, -233243, -13542, 79578, 351059, 186799, -233131, -173994, -323614, -390571, -714488, -701155, -585863, -286432, -145357, -351002, -466826, -500537, -175381, 117952, 253156, 279241, 42608, -463642, -446468, -444668, -413779, -130948, -70471, -150000, 72150, -215989, -312789, -117368, -58228, -265479, -281169, 125083, 444328, 458951, 312414, 618229, 613659, 497024, 299383, 94553, -1707, -2642, 87541, -66053, -300861, -623496, -527633]
8125e27633J59482P6210K49890K77005j82547l43459k59317J64981M03229L40996
8115C58837J04211j58098j46703Q4185r141k43450j06061N4479k61075k56641
8105e79457j19837J27671P80615K73506j76128n1868j56605m10909j59138l3438
8095e05588J77976q8582j74049K38081K08098J82536O9416k4976J61779J39394
8085C84085l34977k54395R1813R4696N5586q4388k45339L2562K50266k4383k49115
8074b83589K07813j12132j28386L57351j166j17911K13155O7768l3085P7903J9982
8063B67703k21994j15178L92081M09929m7951J38725L78142j94639k86547k25963
8053D94308m07394Q9242J00705n0119k13501N6495l11331k39405m1242M63242
$$ y = [-527633, -368151, -291941, -42051, 234954, 52407, -291052, -550369, -385388, 17841, 358837, 463048, 304950, 158247, 242432, 233291, -10159, -116220, -61741, -322816, -579457, -699294, -571623, 208992, 482498, 306370, 254502, 97897, -313012, -472150, -505588, -327612, -416194, -590243, -352162, -144064, 38472, 107888, 82912, 244691, 384085, 49108, -205287, -113474, -18778, 36808, -47580, -292919, -260357, -10091, -34474, -283589, -75776, -187908, -316294, 41057, 39891, -78020, 135135, 202903, 169818, 247721, 267703, 45709, -69469, 322612, 732541, 684590, 823315, 1201457, 1006818, 720271, 494308, 86914, 176156, 276861, 226742, 13241, 69736, -241595, -481000, -522242, -59000]
8043e9000M7836j76984L2771k212r6322L58332l3416p4140q697k1763j24745r9474
8031b57814j38010j27271q7734l2463r7023L62428K52011L7492K48364p9333j16931
8020c6284J6862K57896l73603J6897J41210j44434P6685J08912k02889k63481
8010d02229J31091j6977K93259o9912j16666J8079J19206j61625p3887K46256
8000c3405j7370n99005j75690L68841K02948J70436J74338J93238Q6288n0002
7990C20617j63879J35495l2282j96714m11971M2048J29474M4356q847K12191L80156
7979D50644m11351j31153L6197M7135o11055j81247K74925J44796M50052k63407
7969a94464j8415L05611L63090L55064o4357l38999j17034k22899l41741o4445
$$ y = [-59000, -11164, -188148, -155377, -157589, -253911, 104421, 71005, -3135, -11832, -33595, -158340, -257814, -395824, -523095, -610829, -643292, -740315, -377887, -125876, -88384, 159980, 80647, -36284, -19422, 238474, -135129, -118232, 22978, -121456, -44771, 64141, -138748, -402229, -271138, -288115, 5144, -64768, -181434, -163355, -44149, -205774, -279661, -33405, -50775, -649780, -825470, -456629, -253681, -83245, 91093, 284331, 370619, 320617, 156738, 292233, 259951, 63237, -348734, -306686, -177212, -132856, -141703, 70488, 450644, 39293, -91860, -55663, -8528, -619583, -800830, -525905, -381109, 68943, -194464, -212879, 92732, 455822, 810886, 746529, 407530, 290496, 67597, -274144, -338589]
7959c38589L89212k10972m31846R7601O6827R3435J66599J36834J48601P0081
7949A87783l4044k82114n7077Q4868J72918J02602j21564j28234K56892m938k60009
7938h2917j87813J83521n165J78216J78246K50622N2123k07128j48678P5319J60798
7927D47144L0074L7913J07077j04402j28017j45093r4476J13904M2436K9638m86761
7916a50563K2947J97929J07662O6630q3655K58743m06136J13109K62547l3502
7906C55711J86941r1275j73192j39723j42869K44842k77944k12122M85425K1929
7896B57723l94438j02592r9041p666J92242L53394n7958P2043K46942J73223l06423
7885C27449n09955K5309j20280l35941K45836M26526J29500M4910L9373M27384
$$ y = [-338589, 50623, -160349, -592195, -494594, -427767, -334332, -167733, -30899, 117702, 187783, 153739, -128375, -185452, -100584, 72334, 174936, 53372, -74862, 182030, 177092, -82917, -270730, -87209, -92374, 85842, 264088, 514710, 566833, 359705, 211027, 286346, 447144, 477218, 515131, 622208, 517806, 389789, 244696, 150220, 264124, 306560, 336198, -150563, -127616, 70313, 177975, 244605, 160950, 419693, 13557, 126666, 389213, 355711, 542652, 451377, 278185, 138462, -4407, 240435, -37509, -249631, 235794, 257723, -136715, -239307, -338348, -346014, -153772, 199622, 141664, 213707, 460649, 633872, 327449, -182506, -157197, -277477, -613418, -367582, 58944, 188444, 233354, 272727, 700111]
7875G00111O1691m31941o3960l3787m10156R9596J29707l63932k16451M479K0142
7864e04501j0305N070j1607R5507l3686J86211J97117p7493k99332L93206L77516
7853C17703k80611j80436N9803K02214O0517r9848k35328J69068J507j51356Q2190
7842e4577J37402J13171K54116q8802n59779m7251l6697J48721j6530j7554q4071
7831b51851L61809K95425J0460J05144K49574m83732j67803M2062P6558J9671
7821B57317N7212J16628J29486m9980j46999n73851k4301K20376K60891j77759
7811F9020o1670l82250m01347p7212K82073K36763J77253L15760Q5275K10781
7801D54446J58968L56691j21965m13514j04128k04950o74358Q9643K22467Q124
$$ y = [700111, 761802, 329861, 265901, 232114, -178042, -78446, 51261, -312671, -529122, -524643, -504501, -514806, -509736, -521343, -425836, -459522, -273311, -76194, -153687, -453019, -59813, 317703, 37092, -143344, -83541, 118673, 179190, 79342, -155986, 13082, 14589, -136767, -54577, 82825, 195996, 450112, 361310, -198469, -245720, -282417, -133696, -150226, -167780, -251851, 109958, 405383, 415843, 520987, 770561, 286829, 119026, 161088, 237646, 257317, 314529, 431157, 560643, 510663, 363664, -210187, -234488, -14112, 246779, 69020, 7350, -374900, -776247, -853459, -571386, -334623, -157370, 158390, 243665, 454446, 613414, 970105, 848140, 434626, 330498, 125548, -548810, -459167, -236700, -228576]
7791b28576p3846M48902J87516m92349k56816K22642j26429K26421O2237j53472
7781a83770L7992j182K15260Q6129J8926J00675l2209j09141K7328j18972j09718
7770f8682j92357k35360O3426l5786o606J29546K95498K31913j33741q3248J9179
7759a6218j59117k7785j4417J00183m9106j83651J22511J55335j32875q6705p3112
7748c64957J14Q0694N6713k0171j48975L29845P9075j55522K0804l11357k22347
7737f56084L5903K78786K31429m4000J75499M22864j02392k01264P3768N2256
7727B66765K2754N6664l8128N2334K3729j95636R3580R7672J55044j29708l73336
7716C1734l63728P0314J2626J33952j99707l56919j44739m4752J58440J19126
$$ y = [-228576, -302422, 146480, 333996, -158353, -415169, -192527, -318956, -92535, -30298, -183770, -145778, -146960, 68300, 154429, 173355, 274030, 241821, 132680, 160008, 41036, -68682, -261039, -496399, -432973, -468759, -475365, -345819, -50321, 181592, 47851, -35397, -16218, -175335, -203120, -217537, -117354, -166460, -350111, -227600, -72265, -205140, -291845, -364957, -364843, -284149, -227436, -247607, -396582, -66737, 12338, -143184, -122380, -433737, -656084, -620181, -341395, -109966, -153966, 21533, 444397, 342005, 140741, 214509, 266765, 289519, 346183, 308055, 360389, 384118, 188482, 282062, 379734, 534778, 405070, 31734, -331994, -261680, -249054, -115102, -314809, -671728, -816467, -861219, -702779, -583653]
7706e83653K19126J87848k52449K60789L65104l33786j14646k8098k28729K75658
7696b32836J82686q5022j1552K14088j43992m0124m342k85414j72694k12687K603
7685g89286L03321K14706Q608J40164j85434P7301K38807L50891J32517J94837
7675F86432j51495l83988l64156j96476k421K97257k71564j05181L53967L16343
7665A78718K06519k7778k58193m47984R5073Q7246N6850q3254m7473L20334K3257
7654A03315m94843L5509M71690k040R8673j77693j96807K56225l7892J56396K60276
7643D72809j06064m90751M3437l7267J99712J53929L555J80714L70567M1626l27954
7632E04313o15072J39337M12891j37750m29109l95648M5873L92942L20703j7887
$$ y = [-583653, -364527, -176679, -429128, -168339, 196765, -137021, -251667, -279765, -508494, -232836, -50150, -135172, -146724, 67364, -76628, -116752, -121094, -406508, -579202, -791889, -789286, -485965, -271259, -262651, -122487, -307921, -230620, 8187, 359078, 491595, 686432, 534937, 150949, -213207, -409683, -412104, -114847, -386411, -491592, -137625, 178718, 385237, 357459, 99266, -348718, -253645, -166399, -109549, -192803, -240276, 80058, 103315, -391528, -356019, 115671, 113631, 212304, 34611, -162196, 94029, 56137, 212533, 472809, 366745, -124006, -80569, -117836, 81876, 235805, 239360, 420074, 790641, 832267, 504313, -110759, 28578, 441469, 303719, -125390, -521038, -475165, -82223, 238480, 220593]
7622B20593n47349j5816L73210L26730k8341k01378l4057j43068J19818M57789
7612E28131P6712p5623n3157Q2151k33486l83618l67289L22699K80450r1782q902
7601G6286M5973K57941K7891J29297k78818K4727j36492k09031K2380J58929k36354
7590a17271j49507N7326j76874j80508K28790k4346j22067J56406K24212K16229
7580A12390M6187R3030j6315P1373J84162l1235l23527L0759l6723k38145Q2055
7569b5989J36239j56506j19900J53390J65242K12446m630j19972l3383l33980
7559a27043l73554K49365o2847o1789K3277L9967K31786M8642k1658l76398K05363
7548b24889O9552J6824K26112K33838j91942j75124K03615J73673j39169j19577
$$ y = [220593, -326756, -342572, 30638, 357368, 329027, 127649, 93592, -49476, 70342, 528131, 604843, 529220, 476063, 558214, 324728, -58890, -426179, -103480, 176970, 85188, 76286, 122259, 380200, 408091, 537388, 258570, 283297, 146805, -62226, -39846, 119083, -117271, -266778, -209452, -386326, -566834, -338044, -362390, -484457, -328051, -103839, 112390, 158577, 251607, 235292, 306665, 490827, 459592, 136065, 166824, 130101, -108044, -25989, 110250, -46256, -166156, -12766, 152476, 364922, 360292, 240320, 206937, -127043, -500597, -251232, -314079, -375868, -352591, -312624, -80838, -32196, -53854, -430252, -224889, -155337, -138513, 87599, 321437, 129495, -45629, 157986, 331659, 192490, 72913]
7538G2913J75303M7967J17510M0341J93718J83856k37484m31132n16939n36255
7528h90202k78605L30391N96911L07486k5375k94044k33690j10710L70880K27597
7518F39j38453j47503K80597j7683j51262q8125j22522K46762L7135j79058P7232
7507b02241k02156k23322j67544K22816K90307K48730P9929K00059j48293k47806
7497a49521n0880J47955K71179o9492J31056K06464k70553m35616m38750J10395
7487e47763K04878N4053l2147J35502P2156R9874K29502l4074o5317J05695n4239
7476A68120l81276k38447j1660K29616R9024M8539j27830m80581O358L30701K46656
7465a10780K22452L90291l13508m69101q3362k6611J77514K22013j08235L54748
$$ y = [72913, 248216, 296183, 413693, 454034, 647752, 831608, 594124, 162992, -353947, -890202, -1168807, -838416, -241505, 65981, 40606, -253438, -487128, -597838, -226958, 639, -137814, -285317, -4720, -22403, -173665, -261790, -384312, -137550, -100415, -279473, -202241, -404397, -627719, -795263, -572447, -282140, -33410, 46519, 246578, 98285, -149521, -200401, -52446, 218733, 149241, 280297, 486761, 216208, -219408, -658158, -547763, -342885, -288832, -320979, -185477, -113321, -13447, 216055, 181981, 116664, 222359, 168120, -213156, -451603, -463263, -233647, -134623, -86084, -213914, -694495, -688137, -357436, -110780, 111672, 501963, 188455, -280646, -364008, -390619, -213105, 8908, -99327, 255421]
7455B55421K73091k0771K27495k08666j16062l21231k92669J97160R3028M949
7445I1745n27308L0610l8146K45407k1572K16004J59062J46579j39560R6230K34158
7434D93209l00377j99438k6519j80120j25967m6913J06635J90609k3486N0412
7424f1955k28157J42570K07407n2610K83290O7160O1563J43759n13283l15579
7414b65835k70805q9855O0622L7043L93421M40670J72994j58508J07409J39641
7404E66797q3677n4139J20895o8093k83960J70565P3084J29264N6474J18118o6315
7393F79013j69195j5699l77260l44315K94148J4658j09234l33639j16339J35410
7383c42452L6604l6435J0508P1512M47644J80377k25656k57619k63582Q0159L55207
$$ y = [255421, 528512, 507741, 735236, 526570, 410508, 89277, -203392, -6232, 86796, 91745, -435563, -404953, -443099, -197692, -219264, -3260, 155802, 302381, 162821, 259051, 493209, 192832, -6606, -33125, -213245, -339212, -386125, -279490, -88881, -112367, -61955, -290112, -147542, 59865, 7255, 290545, 357705, 419268, 563027, 49744, -265835, -536640, -626495, -565873, -528830, -135409, 305261, 478255, 319747, 427156, 566797, 483120, 428981, 549876, 481783, 197823, 368388, 441472, 570736, 627210, 745328, 679013, 509818, 494119, 116859, -227456, 66692, 81350, -27884, -361523, -477862, -342452, -305848, -342283, -331775, -260263, 187381, 367758, 142102, -115517, -379099, -298940, 56267]
7372E6267o4196J6199K47091j51261j54239J72147O9717q621l4988k5292j59215
7361c6391N3508M2659m1807j35320m07905m98999l27109M42067J81557n374J25712
7350f07402Q4567L93011J97005J11267J06592j18484P7593Q04j58042L5486K16223
7339C38620m8700j55930l24926n97999m5049M19789l70975Q512P2540L28258l1856
7328d07716j01895L5641K73597q2037l31094J72099K92759K06641K8276k14313
7318a28042l75954l89962K72355J28412j78898L74872J84776k63138K63953n469
7308a17095k02390r9926Q2068q883k14171J01125J33050l4587m0606O2371K55884
7297h3160K3544J3398Q0079K19781J88277j17486K8482M4397j81136M08454J39972
$$ y = [56267, -7929, 8270, 255361, 104100, -50139, 122008, 191725, 183104, 148116, 122824, -36391, 17117, 59776, 17969, -117351, -525256, -1024255, -1351364, -909297, -727740, -733114, -607402, -522835, -129824, 67181, 178448, 285040, 166556, 244149, 244953, 86911, 122397, 338620, 289920, 133990, -190936, -788935, -833984, -414195, -785170, -776658, -704118, -375860, -407716, -509611, -473970, -200373, -282410, -613504, -441405, -148646, 57995, 86271, -128042, -503996, -893958, -621603, -493191, -672089, -297217, -112441, -375579, -111626, -117095, -319485, -419411, -337343, -346226, -560397, -459272, -326222, -360809, -401415, -339044, -83160, -59616, -46218, 33861, 253642, 441919, 324433, 352915, 397312, 216176, 624630, 764602]
7286G64602k00716j7672k87559l26698j2725p5861l04187j96331J52884K22430
7276b81833K00297L30231J73255O8897J14997j7726j2797o5528l90579j26776
7266g562K05832q3649J6849Q3239Q7191j49875J09724k52029q9591o5129J19331
7255b5669O8344j05366p7249L0922r9683J21107K70962K32578k89036k18111l6861
7244a28062j76869J27553J09335k89929M9319K34724M7333O3004k92683j98920
7234d55195J50674J20585j53679Q3511M6455J86783K38707j91011j58117K97636
7224A66349K64997o9008N0523k5872j09332n6169j58388j13597K46271K30040
7214D25814k5470r3546j08911J69980l84543k65296J8534Q7316O5234J59655K9884
$$ y = [764602, 563886, 546214, 258655, -68043, -80768, -156629, -460816, -657147, -504263, -281833, -81536, 248695, 421950, 490847, 605844, 588118, 575321, 509793, 119214, -7562, 198270, 114621, 131470, 214709, 301900, 152025, 261749, 9720, -79871, -145000, -25669, 42675, -62691, -139940, -109018, -208701, -87594, 183368, 415946, 126910, -91201, -128062, -304931, -177378, -68043, -357972, -308653, -73929, -26596, 36408, -256275, -455195, -304521, -183936, -337615, -254104, -207649, -20866, 217841, 26830, -131287, 166349, 431346, 362338, 412861, 386989, 277657, 221488, 63100, -50497, 195774, 425814, 400344, 306798, 197887, 367867, -16676, -281972, -263438, -176122, -110888, 48767, 78651]
7203G8651J26447J4807K46911J01848K2910n224J20651j05811k29516m48027l13392
7192c89745N8048K83618k6589J79953p0803k67854M905J15356p4911o2740j28798
7181c79560O0488r8693L5520J22662J62306J62012J42929J39569k26056M5396
7171A66573m671j71547k41334M4353M63633L24590j6435p7340N14K2640j69206
7160C41770k49692r5597M6899j64507l6077J73432J45546k07771O3596J22139
7150A39738j33256j00236J69569K02432r4478M205R6163j36277q6035K5147k34519
7139a47547o5668L68045j96318j61626J55142n433n7042J33773L97130n5769j29101
7128B35586j95296l93210k96878k30513N36061K75781L4955k45849j35381k83253
$$ y = [78651, 205098, 219905, 466816, 568664, 591574, 586350, 707001, 601190, 371674, -76353, -389745, -331697, -48079, -74668, 105285, 34482, -233372, -228467, -113111, -188022, -250762, -379560, -319072, -417765, -382245, -259583, -97277, 64735, 207664, 347233, 121177, 166573, 161902, -9645, -250979, -206626, 257007, 581597, 565162, 487822, 488336, 510976, 341770, 92078, -3519, 43380, -121127, -157204, 16228, 161774, -45997, 17599, 139738, 6482, -93754, 75815, 278247, 183769, 187974, 284137, 147860, 61825, 86972, -147547, -213215, 154830, -41488, -203114, -47972, -53405, -110447, 23326, 420456, 364687, 235586, 40290, -352920, -649798, -880311, -344250, -68469, -33514, -279363, -414744, -697997]
7118f97997K53669M01856j5838l3755K02268P783j04346j92767j57847L26919
7108a0055L21023J07954o5885j97374P9822k43056l22432R3568L23194k21402
7098a34643r6413K69740k5187l28635m01125L01040j72015N4657J27082k05157
7088f10656n7762M25999M48626K3515L50883L92711p0849l72666k50772l46360
7078f7331K13849j70606k00069j21963m95269l11452M34816K74719j31719K71316
7068c03709M8607K7768p3361P8178J7072n2680K13054j1199N3576J46423l15526
7057a71797J30895K32242J79695k78963j4231K09374J35209n55777m07687p5523
7047f16563J71429L63298M35967m7453o9838J9779k41707l48506j92596K09000
$$ y = [-697997, -444328, -42472, -58310, -92065, 110203, 117986, 13640, -179127, -336974, -10055, 310968, 418922, 353037, 155663, 235485, -7571, -330003, -236435, 86759, -134643, -231056, 38684, 13497, -315138, -716263, -415223, -587238, -532581, -405499, -610656, -668418, -242419, 206207, 229722, 580605, 973316, 902467, 529801, 279029, -67331, 146518, -24088, -224157, -346120, -841389, -1152841, -718025, -443306, -575025, -303709, -255102, -227334, -300695, -222517, -205445, -258125, -45071, -56270, -2694, 143729, -171797, -40902, 191340, 371035, 92072, 77841, 287215, 422424, -133353, -541040, -616563, -445134, -81836, 354131, 306678, 236840, 256619, 14912, -333594, -526190, -317190]
7037c17190j68417k00140J23428K24909J35405l469l70997k01839K03085N86539
7027A1314L22830j42525j77535j40064J76203K05192r3898r9109L2117m4204n0976
7016f55l25913j08546J03225J51799J57857K13782O6586j2601q5604k34673j7639
7005i2382J35556K29948R0440q8617q7256Q8558m090j46501J15551J6458Q2654
6994C40319L5682m3199p7122j45322l01582j99834K19337j48143K5945J96160
6984i7759K48674l1615K2966L04654r15J2407r5059k23763m70636j05757K6748
6973d10055J30363R6355J00120K07811J88143n10031j38628j31491n1811L65056
6963a54168L39232M4512N8621n4991O0433K9425j26454r7451j65732k8203J624
$$ y = [-317190, -485607, -685747, -562319, -337410, -202005, -205474, -576471, -778310, -575225, 11314, 334144, 191619, 14084, -125980, 50223, 255415, 161517, 62408, 94525, 50321, -655, -326568, -435114, -331889, -180090, -22233, 191549, 258135, 245534, 159930, -74743, -92382, 43174, 273122, 363562, 274945, 187689, 276247, 272157, 125656, 241207, 257665, 340319, 376001, 332802, 255680, 110358, -191224, -391058, -171721, -319864, -293919, -97759, 150915, 119300, 142266, 446920, 446005, 458412, 363353, 139590, -331046, -436803, -410055, -279692, -183337, -83217, 124594, 312737, -197294, -335922, -467413, -519224, -154168, 185064, 229576, 288197, 233206, 293639, 323064, 196610, 99159, -66573, -94776, -93152]
6952i3152l13850j65091J37868L64323Q7197M8543O1102q571l479j02953j2321
6941c84K50417M23332n0971J87019k33541n19023l75648L32475J10003q2851K74808
6930C15636j36484m3253M8243K63232j91672l97665j2940J1039r2742N9245J14904
6919f2457L5974K14873j11193j05169O7185k09110K461O2117R305K21294K32320
6908C57600m36203m68010l948J52417J95819L9310k5280k63306j71255R4592L31839
6897a96425R704L9526m0088q2547N2906J16462j58227Q9648Q6179L5564L38281
6886B90983M7740k04112J67661r6536o67221o7593j2847p7544K8415j41009N87240
6875a44823K65749j8809j08970j28707j18848J9898K2575j12193K93112J71942
$$ y = [-93152, -407002, -572093, -434225, -69902, 17295, 65838, 126940, 118369, 114890, 11937, -384, 250033, 673365, 622394, 809413, 575872, 56849, -318799, 13676, 123679, 40828, 315636, 179152, 135899, 184142, 447374, 255702, -141963, -154903, -143864, -236606, -177361, -62457, -26483, 188390, 77197, -27972, 39213, -169897, -167436, -105319, -96014, 125280, 357600, -78603, -546613, -550561, -398144, -202325, -163015, -188295, -451601, -622856, -528264, -196425, -186721, -147195, -187283, -269830, -216924, -100462, -258689, -169041, -82862, -47298, 290983, 338723, 134611, 302272, 205736, -461485, -529078, -541925, -619469, -591054, -732063, -144823, 120926, 102117, -6853, -135560, -254408, -234510, -211935, -324128, -31016, 140926]
6865A40926J37427k56751j396L50917n468p158r0684k09841j39236l89433L2610
6854d38087J95036J03099J25882J59403o1760M8483K67011j10059o692J76936
6844D59252k84477j28070J47496n1691j11640k53441O1282K9571L856j82079p8608
6833c88549k6220k62655O996K81425M7236J28312M04254n8975k49491l40662K0603
6822d37726K17169N42321J76966q8108J86236N4299k57712Q1003K03843j31282
6812E47009p35458k08926r7733L7947L30316P1916r7586k37553J03004K21407
6802f5657j30250k32792L02037M87987L00371l5442l54200J23476J25317k55123
6792B65724m5489k4177l6930M0539K11908J21872l04788J11688L14687K12332
$$ y = [140926, 278353, 21602, 20206, 371123, 365655, 358497, 267813, 57972, -81264, -470697, -438087, -243051, -139952, -14070, 145333, 83573, 132056, 399067, 289008, 282316, 459252, 174775, 46705, 194201, 142510, 30870, -222571, -161289, -131718, -127862, -309941, -388549, -414769, -677424, -670428, -389003, -341767, -213455, 190799, 131824, -117667, -458329, -437726, -220557, 321764, 498730, 410622, 596858, 651157, 393445, 474448, 678291, 547009, -188449, -397375, -495108, -457161, -126845, -54929, -152515, -390068, -287064, -65657, -195907, -428699, -126662, 361325, 661696, 626254, 272054, 395530, 520847, 265724, 220235, 196058, 159128, 199667, 411575, 533447, 228659, 340347, 655034, 867366]
6782H67366n20821j91153J77642N4323j42012k46125k8518k09633K3851J2032
6772b03048K84880j10862l80857j88617P0548L88785R0184j60588p1584j80834
6762d61993M3204K01967P7905J90283K86541j1382l02242j3019k02954o3129J00198
6751a54621K00646j10475m05108R3849M89593j89399m19224k59228k3082N4313
6741g22736J56457K11267J88753R3665M57261K81057M5835M4582j47213l51999
6731B56929l79934J86437J21754n2416j66826j15367J62102N5954k13558J37959
6721f966j54111L8198K36506M5156r7511o6870R7795l4447l65348m8015P29342
6710C73729j7673k09096m15116L33858k15238j1346J26867L23518n22708n0695
$$ y = [867366, 346545, 155392, 333034, 387357, 245345, -780, -29298, -238931, -215080, -203048, 81832, -29030, -409887, -598504, -527956, -139171, -48987, -209575, -281159, -461993, -418789, -216822, -138917, 51366, 337907, 326525, 24283, 11264, -191690, -254819, -154621, 46025, -64450, -469558, -375709, 113884, -75515, -494739, -753967, -777049, -722736, -566279, -355012, -166259, -72594, 384667, 665724, 711559, 756141, 608928, 256929, -123005, 63432, 185186, 132770, -34056, -149423, 12679, 68633, -144925, -6966, -161077, -122879, 113627, 158783, 61272, -5598, 92197, 57750, -307598, -355613, 373729, 356056, 146960, -268156, 65702, -149536, -160882, -34015, 289503, -233205, -283900]
6700b83900J68760k57421J27642N26693K66194j26312k56354J02k83770Q0580
6690c7786k38123j19617K34272J70111k48172j98204J1897Q5738m7454q9145J7087
6679d59396J43900K0085J67557K20462K67603J41668j5100m78436j90358L0726
6669a51289r6915K0194J39453p0606J3970j6012J84637J65309l27889k45648O5650
6658c19146K92133K41155O5557l18984j51999J33994M8467J44230P5316k30620
6648a9897R2941j61618k95378J42821o2710O4335R6689J18780J14855p7813k34131
6637b21126k66006K94866K19930q0406R8891J80321k45331k21313n5282K53822
6627d1634L09634K00409R6099k10965j84458o7728M8834K2944k5212N09923M3661
$$ y = [-283900, -115140, -372561, -244919, 281774, 547968, 421656, 165302, 165404, -118366, -37786, -275909, -395526, -161254, 8857, -239315, -437519, -425622, -339884, -387338, -476483, -459396, -315496, -295411, -127854, 92608, 360211, 501879, 486779, 8343, -182015, -151289, -248204, -228010, -88557, -159163, -145193, -161205, 23432, 188741, -139148, -384796, -319146, -27013, 214142, 279699, -39285, -191284, -57290, -8823, 135407, 210723, -19897, 73044, -88574, -383952, -241131, -303841, -239506, -142817, -24037, 90818, 13005, -221126, -487132, -192266, 27664, -52742, 46149, 226470, -18861, -240174, -295456, -41634, 268000, 468409, 564508, 353543, 169085, 101357, 150191, 173135, 147923, 657846, 701507]
6616G01507k65107m3707k87755k61440o4398J91916K24168j5165M1235j2698k40264
6605c1708k98127N03579k48487l53068L2414J40152J85854k40287m03156R7949
6595f14885k39841j03918M43364L06023L83880J24881j14417k99871j65859J3096
6585b67547j56945j26408j71808J69877K51918J01832R4564K98778N9778O5482
6575C19521p8810m6728L88522j1161k81148l60905j28225M626q1913O0911J13096
6564a02214k82618M0680L82840R032m4827k13304L3202K81433L04422K13522p7882
6553E44286m06215m0332L17791m2798r5352P6575J41464L6340l80442j79591O8945
6542D0671K97535O181m10515J1654k4453k78308J90787J8998l148M53974K9591
$$ y = [701507, 436400, 392693, 104938, -156502, -220900, -28984, 195184, 180019, 221254, 208556, -31708, -329835, 173744, -74743, -427811, -395397, -255245, -69391, -309678, -712834, -614885, -854726, -958644, -515280, -209257, 174623, 299504, 185087, -114784, -280643, -267547, -424492, -550900, -722708, -552831, -300913, -199081, -104517, 194261, 254039, 319521, 240711, 193983, 582505, 571344, 290196, -70709, -198934, -194308, -276221, -215310, -102214, -384832, -344152, 38688, 47720, 2893, -210411, -177209, 104224, 408646, 622168, 544286, 138071, 97739, 415530, 372732, 277380, 353955, 495419, 531759, 151317, -28274, 40671, 338206, 344387, -66128, -54474, -78927, -357235, -166448, -147450, -150598, 303376, 332967]
6531C32967o34927j16009L77110J85097L9556j0254j16396L83190M18271o2297
6521G96308k84202l82413n03386L6073K83697K78458K6427N7067l00372K07310
6511B14967M85193j71863m10804m89568O4024O7181L0467L25860J61663J69918
6501D47038k25331m06149k35671O7234J14009j15154J86412J18912J79466k93269
6491a62503j35846J75456q1101m4734J05420k2399j24076j18294J93164K14071
6481h42m01196j55435L8261k2490L34548n7879l43131R4487K62425K97515k05605
6470a59342k88194j5826M53422L84193l5494l48846m32240K64906L66891Q1739
6460B71209j85848n37228J31639L35943L3047N731k0998l6610K49998k9852k44952
$$ y = [332967, -301960, -417969, -40859, 144238, 183794, 173540, 57144, 440334, 858605, 796308, 512106, 129693, -373693, -337620, -53923, 224535, 250962, 308029, 7657, 214967, 700160, 528297, 117493, -372075, -308051, -240870, -210403, 115457, 277120, 447038, 221707, -184442, -420113, -352879, -238870, -354024, -167612, -48700, 130766, -162503, -298349, -122893, -203994, -248728, -143308, -165707, -289783, -408077, -214913, -842, -402038, -557473, -519212, -541702, -207154, -265033, -608164, -513677, -251252, 46263, -159342, -447536, -463362, -9940, 374253, 338759, -10087, -442327, -177421, 189470, 271209, 85361, -451867, -320228, 15715, 48762, 54493, 33495, -3115, 246883, 217031, -27921]
6449b7921j53324p0356k8036o6605n280J38230j39220o1283N9608J36144L49071
6438A31028K63232j13042j90664J49858M20883j20801q79582r1860M44799K33930
6428B47781M0242k11360m93249q551L77556K62213j00665j08356r7030J5175K90027
6417B13783J62964m90318n0367N763N5097Q9513L89264r1157m70379k45849R234
6406d22452n1498J51903L2606J27178K43000Q609o6501O6467J40490Q5589j11214
6395B04177j23470M5345q2933k69307L7780L65613O6471q6753j64253R3352j73985
6384h7963l04241K62760L37019l00783j71779N9943L53277J22789o1405o3722
6374A45895q99o2787Q6616J04152J15609J81765l48729k49279P5223l1795q6788
$$ y = [-27921, -181245, -251601, -279637, -346242, -351522, -213292, -352512, -413795, -354187, -218043, 131028, 394260, 281218, 90554, 240412, 661295, 540494, -339088, -430948, 13851, 247781, 288023, 76663, -416586, -425137, -47581, 214632, 113967, 5611, -91419, -76244, 213783, 376747, -113571, -163938, -158175, -103078, -13565, 375699, 284542, -185837, -431686, -422452, -473950, -322047, -289441, -162263, 80737, 89346, 22845, 89312, 229802, 315391, 204177, 80707, 126052, 43119, -226188, -188408, 177205, 243676, 156923, -7330, 86022, -87963, -392204, -129444, 207575, -93208, -264987, -205044, 148233, 271022, 209617, 145895, 144996, 82209, 168825, 272977, 388586, 570351, 221622, -27657, 47566, 15771, -71017]
6363g1017k9804j11627Q6675J898K3293j08674l196N4791J77466M7815J1476j2490
6351F6606K67495L0286j42613k3854k49728j05047n0101J55633K26987k14740
6341c9076l63473K49421K34165K05716j09482p4051j21730J2962k84727m5885
6331c36160K26813J96371k59308k45474K71002J74200K12807K68687j36598j24294
6321B48046k92778N6239J17528j40802k3078M25954R2921m10371m42416J56023
6311b12734N06541K87170r8494m22956k68253j06244M31661n7419k02599q712
6301a52039k10353n1328J38079J82475L6867K08539k12930p17357Q9106O34994
6291e3947J95044r2441j61432m6372L31878L64554j86462o06613l68789K01697
$$ y = [-71017, -100821, -212448, -125773, -123875, -100582, -209256, -212452, -157661, 19805, 67620, 79096, 66606, 334101, 364387, 221774, 197920, -51808, -156855, -206956, -51323, 175664, -39076, -402549, -153128, 81037, 286753, 177271, 103220, -18510, -5548, -290275, -336160, -109347, 87024, -172284, -417758, -146756, 27444, 240251, 508938, 372340, 248046, -44732, 11507, 129035, -11767, -34845, 391109, 484030, 73659, -368757, -212734, 293807, 580977, 482483, 59527, -208726, -314970, 116691, 59272, -143327, -152039, -362392, -413720, -275641, -93166, -56299, 152240, -60690, -778047, -688941, -53947, 141097, 48656, -112776, -159148, 172730, 537284, 350822, -255791, -624580, -422883]
6281d22883M27473K54579n8684j02420l0242j33262k41656k54048k15939k0177
6271g97259L00903M90494n4791k15695k51277J44692j17433L15339K71808j39800
6261e3019J19345O3721l45993Q8065j59847k32767K36381J1654n340J35419l8856
6250a81237o0235j07984J94752J32401q022L01993r575n7643R7408J76867O2266
6239E40991n14460J27095L64361Q9924k22866j06334k89442l91857J34287N41418
6229B73117K44162l62871n3208J23267l4134J89324P3651l39452m14084K02720
6219i7508L55473j12110j72854j07854m1974J53898j25167k18484L2746J39780
6209a94054L83030J09719j34171k26451r7905k11250r4147R2281k08754L0590
$$ y = [-422883, 4590, 259169, 200485, 98065, 67823, -65439, -307095, -561143, -777082, -797259, -496356, -5862, -60653, -276348, -527625, -382933, -500366, -185027, 86781, -53019, 66326, 130047, -215946, -127881, -287728, -520495, -284114, -272460, -277800, -142381, -181237, -241472, -349456, -154704, -22303, -30325, 271668, 262093, 204450, 301858, 478725, 540991, 26531, 153626, 517987, 607911, 385045, 278711, -10731, -402588, -268301, 273117, 517279, 154408, 101200, 224467, 190333, 379657, 453308, 113856, -300228, -97508, 257965, 145855, -26999, -134853, -176827, -22929, -148096, -366580, -333834, -194054, 188976, 298695, 164524, -61927, -159832, -371082, -465229, -372948, -581702, -551112]
6199e51112K13056J60881l9482k16031p7032k4907J63323J96840K08777N5251
6189H9564O5185o9452K58541j09862j60340K64570p976p7480l39343M11147L07602
6178F32156j06695m40521k87172q4427J11774k99962J17934O2193j51151K5248
6168d20623J23130M09120N76934k56062l3690j67708p9482j10062k58430J7849
6158a99024J8825k3629Q244p1885o0947Q3930J33694J42653j16004o2146l2642
6147a78931j35680q3517J12230O0266r8419m16391n8577N96061J29085k38669
6137c12542j77131J75938K51155j63690q2378K75409p1333K03726L4153R756o0068
6126H2995K92187M6437k44572o57815m8049L65248m01698o5502O283k40634L58675
$$ y = [-551112, -338056, -177175, -216657, -432688, -509720, -534627, -371304, -174464, 34313, 89564, 154749, 85297, 343838, 233976, 73636, 338206, 330230, 252750, -86593, 324554, 632156, 525461, 84940, -202232, -286659, -174885, -474847, -356913, -294720, -445871, -420623, -297493, 111627, 688561, 432499, 398809, 231101, 151619, 41557, -216873, -199024, -180199, -203828, -195584, -267469, -328416, -244486, -110792, 31861, -84143, -146289, -178931, -314611, -398128, -285898, -225632, -324051, -740442, -799019, -202958, -73873, -312542, -489673, -313735, -62580, -226270, -308648, -33239, -104572, 99154, 133307, 143063, 82995, 375182, 421619, 177047, -480768, -528817, -163569, -565267, -630769, -624486, -865120, -506445]
6115e06445K25197J35175j7469l44880K54810K0993j70951J25096K06999R3963
6105B2488j45169l5506j41431j88156K89753J22968J16903M20051R8332K40146
6095H00379j91461n52609j01049J22721N594j4901N2086J71397o0048j93328j09544
6084g0763k83507Q3030J69561k8928L5513m99K58966K5017k31547m07361m8507
6073d99025l9288j43307L03195p4980L47090N38593j38656j68694n2523j12357
6063c9952j85234j12859J13177m8093R471q1982L7446j7715j71529M03622M31528
6052C37880J17965k05432l97871j98555O6951K52362o4836N9086k47948l65120
6042f45518O5984J64284k74759j38216o4412O16825M63216j08635l34879J54932
$$ y = [-506445, -281248, -146073, -163542, -508422, -253612, -232619, -403570, -278474, -71475, 22488, -122681, -158187, -299618, -487774, -198021, -75053, 41850, 461901, 560233, 800379, 608918, 56309, -44740, 77981, 83575, 68674, 120760, 292157, 232109, 38781, -70763, -354270, -271240, -101679, -130607, -95094, -95593, 163373, 188390, -43157, -450518, -499025, -538313, -681620, -378425, -453405, -106315, 432278, 293622, 124928, 72405, -39952, -225186, -338045, -224868, -272961, -263490, -345472, -308026, -325741, -497270, -93648, 337880, 455845, 250413, -147458, -346013, -279062, -26700, -91536, -32450, -280398, -645518, -579534, -415250, -690009, -828225, -892637, -275812, 187404, 78769, -256110, -101178]
6032a01178L09498j27477K8764p3534j04346O7115J46257l23415m53185j3427
6022f44928J04348L76919j18373j29132O1839L22348J21788M2220j92621k09369
6012b64961J03534K43164K9643k204k4168J204k18132J42727m5787q1136J83863
6001F7747o2291j19447K9979R5478K41893l6473j66515q243q5352L09293R6968
5990C63037j04222K1217m78526m48782Q7190L40644n4279l093L04302R6242k03307
5979g9577m89283m2410L87218K0024p7668P6538j49587J11805j64509P7860L99693
5968G0104L09355r1050K8445l5660j66193k30180K18379P7080k92983M5143k29627
5957b97187J07578J99728N6190k47981j44069L98643K15369m4357l33229l30558
$$ y = [-101178, 208320, 80843, 109607, 36073, -68273, -1158, 145099, -178316, -631501, -644928, -540580, -163661, -282034, -411166, -349327, -26979, 94809, 137029, -55592, -264961, -161427, 81737, 111380, 109176, 85008, 86212, -131920, 10807, -34980, -116116, 67747, 5456, -113991, -84012, 11466, 253359, 216886, 50371, 42128, -43224, 266069, 363037, 258815, 280032, -198494, -647276, -560086, -219442, -273721, -276814, 27488, 123730, -79577, -568860, -611270, -224052, -204028, -281696, -205158, -354745, -242940, -407449, -329589, 70104, 379459, 288409, 316854, 281194, 115001, -115179, 103200, 180280, -112703, -67560, -297187, -189609, 10119, 66309, -181672, -325741, 72902, 288271, 243914, -89315, -419873]
5947d19873L69342J10218l12636k81445n2448j91029J86737M00686K48511l16418
5937b58355j89935j08315K47018K62713j77978k65535J40177L81945N4385Q6067
5927A72187j04231j87434j09833p3961l6565O1676N3500J52299L19253q6121n08555
5916c47785n9363M81404j70991J84967O1974o3157j46816J54214J77526J81174
5906D53147Q5700l03028j84657j19380j76707J52110j24071J06096K7372k20004
5896c03422K53480l33113l17301R5994M49424J92792L73815K72481M4479j02464
5886F26165j33506L36889o6354k95485m84702m28293K35812J30837K1496O5347
5876H206m3673k73489N1058J20137m03508k06278J92425J18519M791L08934L56440
$$ y = [-419873, -50531, 59687, -252949, -534394, -586842, -777871, -591134, -190448, 58063, -258355, -448290, -556605, -309587, -46874, -224852, -490387, -350210, 31735, 86120, 172187, 67956, -119478, -229311, -303272, -339837, -278161, -224661, -72362, 246891, 160770, -347785, -407148, 74256, -96735, 88232, 150206, 87049, -59767, 94447, 271973, 453147, 538847, 235819, 51162, -68218, -244925, -92815, -216886, -110790, -83418, -303422, -49942, -383055, -700356, -604362, -154938, 37854, 411669, 684150, 728629, 626165, 492659, 829548, 763194, 467709, -16993, -445286, -209474, -78637, -57141, 8206, -35467, -308956, -257898, -137761, -541269, -747547, -555122, -436603, -431812, -122878, 233562]
5865B33562l8733j90572l16251k13298K15881K88933K8460l96722K12414Q9069
5855h7257l89319o1512J59648L06726L0714j75600j15651j5254J57578J41592
5845d8335j59769k51969k766O1212j13137o441J56777P5936j31167j4623r8153
5834e32435J66795l6120r1988J21884k29669j99534j01927O76298J85084j45535
5824a87147J16925K62759L26807k00047n5008j59962j2602j90096k75122l7384
5814d10877L86236Q9522j28175J36956p6632r3221k2356q2194m6339K35065k25418
5803b37433j87625j58774J5723J43881Q8136M92396M7816k4740q4932j97713K6347
5792g6918j05620N1612J0371l06057j44462r064L64836K15117J66702K43469k3531
$$ y = [233562, 194829, 4257, -311994, -525292, -309411, -20478, 7982, -388740, -176326, -87257, -476576, -538088, -378440, -71714, -41000, -216600, -332251, -347505, -189927, -48335, -208104, -460073, -462839, -401627, -514764, -521205, -364428, -288492, -419659, -434282, -532435, -365640, -401760, -493748, -371864, -601533, -801067, -902994, -226696, -41612, -187147, -70222, 192537, 519344, 319297, 264289, 104327, 91725, -98371, -373493, -410877, -24641, 64881, -63294, 73662, -2970, -96191, -118547, -200741, -247080, -12015, -237433, -425058, -583832, -568109, -424228, -336092, 156304, 204120, 179380, 94448, -103265, -76918, -182538, -130926, -120555, -426612, -571074, -580138, -215302, -185, 166517, 409986, 386455]
5781C86455k93801o7323O06574K10497k25069k73946k77563j9314j60871j44234
5771b58595Q775L24670m429k96289J95809L00426M6964k22096j91607j12042J83128
5760b5286m02467J57481l34121l26507K33472J78908N9568J04386J56586K84317
5750H6337J8385j05513n8607l65345j38841K60780J24958J44782M8212j66302
5740a51154K20846M7719J99q2141p1572j53406j16692L34654L00910P7657p5500
5729C31520K82059J34871j21936l33736j73348j24216j16270r3534J11717K63030
5719A60157J95000Q829r5338j7637k98278r6006O1574k63768p6094L7383k68167
5708f52345J55949K44780K67973R3700j0272K80405J3449O1601m60361r4355J20529
$$ y = [386455, 92654, 25331, 631905, 842402, 617333, 343387, 65824, 46510, -114361, -258595, -249820, 74850, 70421, -225868, -30059, 270367, 317331, 95235, -96372, -208414, -25286, -427753, -270272, -604393, -930900, -697428, -518520, -458952, -354566, -197980, 86337, 104722, -791, -59398, -424743, -563584, -302804, -177846, -33064, 15148, -151154, 69692, 117411, 117610, 35469, -36103, -189509, -306201, 28453, 329363, 407020, 331520, 613579, 748450, 626514, 292778, 119430, -4786, -121056, -214590, -102873, 160157, 355157, 363986, 268648, 251011, -47267, -143273, -81699, -345467, -421561, -384178, -652345, -496396, -251616, 16357, 110057, 99785, 380190, 393639, 455240, -5121, -99476, 21053]
5697B1053j23399k32010k890M68420n6934p5340j8749k98304P5044J69528J79876
5686A06295N4747o7110k34649l7369J80127l34709j60141J35344L16762K64867
5676B24164l78869r7201N95782K03733j52944j17649l75560k63986k00492L45819
5666b17203L17973K826k26791k37401o5418k70807J29051K32022M50311J70548
5656B85111j12004o21720n8576M94901j69131n2623R475J71483j28152K37685
5646E6449k38134O773J5212J95305K63654j82758Q1165m0536j35072j27462m175
5635a09579N4684N2689Q1817j04763l46030L5292J23429j40421J72720R9633m2178
5624a22707k58138Q6413K3203Q4494J68699L43782K5276p4581r6401K3807q8865
$$ y = [21053, -102346, -334356, -337246, 131174, 74240, -1100, -19849, -318153, -243109, -73581, 106295, 161042, 93932, -140717, -178086, 2041, -332668, -492809, -357465, -40703, 224164, -154705, -251906, 343876, 547609, 394665, 277016, -98544, -362530, -563022, -217203, 100770, 103596, -123195, -360596, -426014, -696821, -567770, -335748, 114563, 285111, 173107, -448613, -507189, -12288, -181419, -234042, -224567, -53084, -181236, 56449, -181685, -174912, -159700, 35605, 299259, 116501, 197666, 157130, 22058, -105404, -109579, -54895, -2206, 79611, -25152, -371182, -335890, -212461, -352882, -180162, -80529, -122707, -380845, -294432, -271229, -186735, -18036, 325746, 351022, 276441, 180040, 203847, 114982]
5613A14982k49255L9611K92660M15575o354l39366k27444k15789J06774Q1737
5603A3131k01336j28863n18215M0510J13505K65453J75453L59357L32531l13704
5593A37822l49223N0677L96248J6318j30912j44785K06193L50838j28425l93554
5583A1197M3365L61581J48673k26114j96597m12040O2309J27160J67021k88927
5573b02372Q7234m2274M72188K03522j37593k98214n62978Q627L92970K38495
5563A59605j1707j51233k23062L68456P5387k27978n00920J4302L47976o9367
5553b18541k16595k16531K30551J38255J30032K38786N0342j13577q6090J58189
5543I4821L80433K12813k42333r6846j72410j70679L8684J98797m67j71756k31490
$$ y = [114982, -134273, -94662, 197998, 613573, 607219, 267853, 40409, -175380, -68606, 13131, -188205, -317068, -835283, -794773, -681268, -415815, -240362, 118995, 451526, 137822, -211401, -160724, 235524, 251842, 120930, -23855, 182338, 533176, 404751, 11197, 54562, 416143, 564816, 338702, 142105, -269935, -207626, -80466, 86555, -202372, -115138, -157412, 314776, 518298, 380705, 82491, -480487, -471860, -78890, 159605, 147898, -3335, -226397, 142059, 217446, -10532, -511452, -497150, -149174, -218541, -435136, -651667, -421116, -282861, -152829, 85957, 136299, 22722, -63368, 94821, 475254, 688067, 445734, 348888, 176478, 5799, 44483, 243280, 242813, 71057, -160433]
$$ [...]
##END NTUPLES=NMR SPECTRUM
##END=
