##TITLE=Analysis number 319457
Compound Code mo 07329
Project Code adrs
Chemist Name fudan
##JCAMPDX= 6.0         $$ Bruker NMR JCAMP-DX V2.0
##DATA TYPE= NMR SPECTRUM
##DATA CLASS= NTUPLES
##ORIGIN= Bruker BioSpin GmbH
##OWNER= nmr
$$ XWIN-NMR		Version 3.5
$$ Tue May 16 09:51:32 2006 GMT Daylight Time (UT+1h)  MAYBRIDGE\nmr@NMR_250MHZ
##.OBSERVE FREQUENCY= 250.131544655141
##.OBSERVE NUCLEUS= ^1H
##.ACQUISITION MODE= SIMULTANEOUS (DQD)
##.ACQUISITION SCHEME= undefined
##.AVERAGES= 16
##.DIGITISER RES= 18
##SPECTROMETER/DATA SYSTEM= dpx250
##.PULSE SEQUENCE= zg30
##.SOLVENT NAME= CDCl3
##.SHIFT REFERENCE= (INTERNAL, CDCl3, 0, 16.522)
##AUDIT TRAIL= $$ (NUMBER, WHEN, WHO, WHERE, WHAT)
$$ ##TITLE= Audit trail, XWIN-NMR		Version 3.5
$$ ##JCAMPDX= 5.01
$$ ##ORIGIN= Bruker BioSpin GmbH
$$ ##OWNER= nmr
$$ C:\u/data/dgb/nmr/ADRS/4400/pdata/1/auditp.txt
$$ ##AUDIT TRAIL=  $$ (NUMBER, WHEN, WHO, WHERE, WHAT)
(   1,<2006-05-16 09:50:52.53 +100>,<MAYBRIDGE\nmr>,<NMR_250MHZ>,
      <created by zg, POWCHK disabled, PULCHK disabled
       configuration hash MD5:
       84 BC 41 DB A1 6E 1D 46 DA 25 12 A5 C1 ED C5 3A
       data hash MD5: 64K
       D4 E0 F4 9E 3B 43 0C 2A 39 38 FE B8 4C 43 91 F4>)
(   2,<2006-05-16 09:51:10.30 +100>,<MAYBRIDGE\nmr>,<NMR_250MHZ>,
      <Start of raw data processing
       ef LB = 0.3 FT_mod = 6 PKNL = 1 SI = 32K 
       data hash MD5: 32K
       47 5D DA 78 2F 15 F8 01 2F 58 1F 10 EC 38 91 0B>)
(   3,<2006-05-16 09:51:14.81 +100>,<MAYBRIDGE\nmr>,<NMR_250MHZ>,
      <apk 
       data hash MD5: 32K
       4C F4 0E 27 E3 01 EC 8A C7 DB 68 9B 89 41 AC 92>)
(   4,<2006-05-16 09:51:16.08 +100>,<MAYBRIDGE\nmr>,<NMR_250MHZ>,
      <abs ABSG = 5 
       data hash MD5: 32K
       E7 04 26 A7 60 59 3D 48 AF 59 93 10 16 CC 7A BB>)
$$ ##END=
$$ 
$$ hash MD5
$$ 7B FB CC 2F 7A E1 70 0E 01 AA 9F 4E 9D 09 BB 0F
##$RELAX= 
##$RELAX= 
##$RELAX= 
##$RELAX= 
##$RELAX= 
##$RELAX= 
##$RELAX= 
$$ Bruker specific parameters
$$ --------------------------
##$DU= <C:\u>
##$EXPNO= 4400
##$NAME= <ADRS>
##$PROCNO= 1
##$TYPE= <nmr>
##$USER= <dgb>
##$AMP= (0..31)
100 100 100 100 100 100 100 100 100 100 100 100 100 100 100 100 100 100 
100 100 100 100 100 100 100 100 100 100 100 100 100 100 
##$AQSEQ= 0
##$AQ_mod= 3
##$AUNM= <au_zg>
##$AUTOPOS= <11 >
##$BF1= 250.13
##$BF2= 250.13
##$BF3= 250.13
##$BF4= 250.13
##$BF5= 500.13
##$BF6= 500.13
##$BF7= 500.13
##$BF8= 500.13
##$BYTORDA= 1
##$CFDGTYP= 0
##$CFRGTYP= 5
##$CHEMSTR= <none>
##$CNST= (0..31)
1 1 145 1 1 1 1 1 1 1 1 1 1 1 1 1 1 1 1 1 1 1 1 1 1 1 1 1 1 1 1 1 
##$CPDPRG= <>
##$CPDPRG1= <>
##$CPDPRG2= <>
##$CPDPRG3= <>
##$CPDPRG4= <mlev>
##$CPDPRG5= <mlev>
##$CPDPRG6= <mlev>
##$CPDPRG7= <mlev>
##$CPDPRG8= <mlev>
##$CPDPRGB= <>
##$CPDPRGT= <>
##$D= (0..31)
0 1 0 0 0 0 0 0 0 0.06 0 0 0 0 0 0 0.0002 0 0 0 0 0 0 0 0 0 0 0 0 0 0 
0 
##$DATE= 1147769450
##$DBL= (0..7)
120 120 120 120 120 120 120 120 
##$DBP= (0..7)
150 150 150 150 150 150 150 150 
##$DBP07= 0
##$DBPNAM0= <>
##$DBPNAM1= <>
##$DBPNAM2= <>
$$ [...]
##$SUBNAM7= <"">
##$SUBNAM8= <"">
##$SUBNAM9= <"">
##$SW= 20.6930455092707
##$SWIBOX= (0..15)
0 0 3 0 0 0 0 0 0 0 0 0 0 0 0 0 
##$SW_h= 5175.983436853
##$TD= 65536
##$TD0= 1
##$TE= 295.16
##$TE2= 300
##$TE3= 300
##$TEG= 300
##$TL= (0..7)
0 120 120 120 120 120 120 120 
##$TP= (0..7)
150 150 150 150 150 150 150 150 
##$TP07= 0
##$TPNAME0= <>
##$TPNAME1= <>
##$TPNAME2= <>
##$TPNAME3= <>
##$TPNAME4= <>
##$TPNAME5= <>
##$TPNAME6= <>
##$TPNAME7= <>
##$TPOAL= (0..7)
0.5 0.5 0.5 0.5 0.5 0.5 0.5 0.5 
##$TPOFFS= (0..7)
0 0 0 0 0 0 0 0 
##$TUNHIN= 0
##$TUNHOUT= 0
##$TUNXOUT= 0
##$USERA1= <user>
##$USERA2= <user>
##$USERA3= <user>
##$USERA4= <user>
##$USERA5= <user>
##$V9= 5
##$VALIST= <valist>
##$VCLIST= <CCCCCCCCCCCCCCC>
##$VD= 0
##$VDLIST= <DDDDDDDDDDDDDDD>
##$VPLIST= <PPPPPPPPPPPPPPP>
##$VTLIST= <TTTTTTTTTTTTTTT>
##$WBST= 1024
##$WBSW= 4
##$XGAIN= (0..3)
0 0 0 0 
##$XL= 0
##$YL= 0
##$YMAX_a= 477178
##$YMIN_a= -557858
##$ZGOPTNS= <>
##$ZL1= 120
##$ZL2= 120
##$ZL3= 120
##$ZL4= 120
##$ABSF1= 16.522
##$ABSF2= -4.171173
##$ABSG= 5
##$ABSL= 3
##$ALPHA= 0
##$AQORDER= 0
##$ASSFAC= 0
##$ASSFACI= 0
##$ASSFACX= 0
##$ASSWID= 0
##$AUNMP= <proc_1d>
##$AZFE= 0.1
##$AZFW= 0.1
##$BCFW= 0
##$BC_mod= 0
##$BYTORDP= 0
##$COROFFS= 0
##$CY= 12.5
##$DATMOD= 1
##$DC= 0
##$DFILT= <>
##$DTYPP= 0
##$F1P= 14.0000005364418
##$F2P= -0.99999901652339
##$FCOR= 0.5
##$FTSIZE= 32768
##$FT_mod= 6
##$GAMMA= 0
##$GB= 0
##$INTBC= 1
##$INTSCL= 1
##$ISEN= 128
##$LB= 0.3
##$LEV0= 0
##$LPBIN= 0
##$MAXI= 10000
##$MC2= 0
##$MEAN= 0
##$ME_mod= 0
##$MI= 0
##$NCOEF= 0
##$NC_proc= -4
##$NLEV= 6
##$NOISF1= 0
##$NOISF2= 0
##$NSP= 0
##$NTH_PI= 0
##$NZP= 0
##$OFFSET= 16.522
##$PC= 1
##$PHC0= 12.12723
##$PHC1= 9.805206
##$PH_mod= 1
##$PKNL= yes
##$PPARMOD= 0
##$PSCAL= 4
##$PSIGN= 0
##$REVERSE= no
##$SF= 250.13
##$SI= 32768
##$SIGF1= 0
##$SIGF2= 0
##$SINO= 400
##$SIOLD= 32768
##$SREGLST= <1H.CDCl3>
##$SSB= 0
##$STSI= 32768
##$STSR= 0
##$SW_p= 5175.98343685301
##$SYMM= 0
##$S_DEV= 0
##$TDeff= 65536
##$TDoff= 0
##$TI= <Analysis number 999999
Compound Code 99
Book Reference 9
Project Code 9>
##$TILT= no
##$TM1= 0
##$TM2= 0
##$TOPLEV= 0
##$USERP1= <user>
##$USERP2= <user>
##$USERP3= <user>
##$USERP4= <user>
##$USERP5= <user>
##$WDW= 1
##$XDIM= 32768
##$YMAX_p= 422364877
##$YMIN_p= -97230
$$ End of Bruker specific parameters
$$ ---------------------------------
##NTUPLES= NMR SPECTRUM
##VAR_NAME=  FREQUENCY,     SPECTRUM/REAL,   SPECTRUM/IMAG
##SYMBOL=    X,             R,               I
##VAR_TYPE=  INDEPENDENT,   DEPENDENT,       DEPENDENT
##VAR_FORM=  AFFN,          ASDF,            ASDF
##VAR_DIM=   32768,         32768,           32768
##UNITS=     HZ,            ARBITRARY UNITS, ARBITRARY UNITS
##FACTOR=    0.157963299565203, 1,           1
##FIRST=     4132.6476996994, 0,             0
##LAST=      -1043.33573715361, 0,           0
##MIN=       -1043.33573715361, -97230,      0
##MAX=       4132.6476996994, 422364877,     0
$$ Real data points
##PAGE= N=1
##DATA TABLE= (X++(R..R)), XYDATA
$$ [...]
19469C938K0356O239p954j891j6128l720K686r986R732K1376l282q929M258R83
19455A7678j0669l874O446K537M322l415j0322P58J2048L541l489P73n435r760
19441A139j4465l774N719L985P659p54p49r401J1951J57j1848K356q086M06J2916
19426b789O411m033r47N505n753p69M245J906L260O57J164O814M128j4361J75
19411E613j0115n063Q647J4414j3022j5431O221K3001K3846N212k2224j8272O033
19398H860O221k678Q190j991m206r856m939m920N378J711M57l119J325p286q79
19383g732O741P324o371m436N653M019k92N148j1420j5264L494O730L463K104
19369h39L983L749r430J745J9985L902j3655J532m677j0342r125q344N256J0337
$$ plain form
19469 3938 24294 30533 22579 20688 4560 840 3526 -6460 3272 24648 21366 12437 16695 17678
19455 17678 7009 3135 9581 12118 16440 13025 2703 3461 15509 19050 15561 16334 10899 1139
19441 1139 -13326 -17100 -11381 -7396 263 -491 -1240 -10641 1310 1467 -10381 -8025 -16111 -15705 -2789
19426 -2789 3622 -411 -1358 4147 -1606 -2375 1870 3776 7036 7693 8857 15671 19799 5438 5613
19411 5613 -4502 -9565 -918 13496 474 -14957 -8736 14265 38111 43323 21099 2827 8860
19398 8860 15081 12403 20593 18602 14396 4540 -399 -5319 59 1770 2227 -892 433 -6853 -7732
19383 -7732 -991 6333 -38 -4474 1179 5198 4906 10054 -1366 -16630 -13136 -6406 -2943 -839
19369 -839 3144 6893 -2537 -792 19193 23095 9440 10972 6295 -4047 -13172 -21516 -16260 -5923
19355e923m872O161R525p49J358r713l934P992p796m845P995M61J8341J826o727
19340I100q216J946P616r323m684N582l104p842o278m782N228k467k772L316J4259
19325b421M849p069k233O772R97j4583l722J2189L713L172j0513L53L330l693
19311h859o29J0848k972q713j0466J396J5067P636l752K949j293J323M166O329
19297A3030L705j6926q214J5410j2780K402l47L862j0926K457n80Q89O734o960
19283h244k617L218L07K925N992J114p151m61N489J4076R845k287r308J877j1983
19268B792j0766J8930J7708p505j0883j4455L906J5955l38j0605r852K411N508
19255B806O11n839n856Q734Q843N081K333n915q301J233n611p112r190j466Q678
$$ plain form
19355 -5923 -10795 -4634 4891 4142 5500 -4213 -8147 -155 -7951 -12796 -4801 -4340 14001 15827 9100
19340 9100 884 2830 10446 1123 -3561 2021 -1083 -8925 -15203 -19985 -14757 -17224 -19996 -16680 -2421
19325 -2421 2428 -4641 -6874 -102 895 -13688 -17410 -5221 -1508 1664 -8849 -8496 -5166 -8859
19311 -8859 -9488 1360 -1612 -10325 -20791 -19395 -4328 3308 -444 2505 1212 2535 6701 13030
19297 13030 16735 -191 -8405 7005 -5775 -3373 -3720 142 -10784 -8327 -8907 -8018 -1284 -8244
19283 -8244 -10861 -7643 -7336 -4411 1581 2695 -4456 -4917 572 14648 24493 22206 12898 14775 2792
19268 2792 -7974 10956 28664 21159 10276 -4179 -273 15682 15344 4739 -5113 -2702 2806
19255 2806 3417 -2422 -8278 456 9299 14380 16713 10798 2497 3730 -1881 -8993 -18183 -19649 -10971
19240a0971J0145n142P76J3719n976j059R925j010J4958K084j2981j812j958k813
19226G885k917n90j512j7527j973q60n36J5601J0841l250K105P245J1432M642
19212C0586r276O87j4747o951j0664Q077Q190L374K329J8879K336j7368j5328
19199A24n824M43J910N679R863M825o401r685K008L064p401J3049R615o638j7672
19184c041l146n976k433J6368M439J749j227m588l810J311J618Q20K029O75q32
19169C956J2129O468J502N148L250P169M344j1555L64P224j095j0407l530j6736
19155H231q029N954p422p083P902J2760L697O06P196N517r080K791K076j1923
19141A3193j5609Q788L380J667P653O016n943o976n473L092M968N901P09n377
$$ plain form
19240 -10971 -826 -5968 -5192 8527 2551 1492 11417 10407 25365 27449 14468 12656 10698 7885
19226 7885 4968 4378 2866 -14661 -16634 -17494 -18030 -2429 8412 5162 7267 14512 25944 30586
19212 30586 21310 21997 7250 299 -10365 -2288 5902 9276 11605 30484 32820 15452 124
19199 124 -5700 -5257 -3347 2332 12195 17020 10619 934 2942 6006 -1395 11654 21269 14631 -3041
19184 -3041 -6187 -12163 -14596 1772 6211 7960 6733 2145 -1665 -354 1264 2084 4113 4788 3956
19169 3956 16085 22553 24055 29203 32453 39622 43966 32411 32775 39999 38904 28497 24967 8231
19155 8231 202 6156 -1266 -8349 -447 12313 16010 16616 23812 29329 20249 23040 25116 13193
19141 13193 -2416 6372 9752 11419 19072 25088 19145 12169 6696 9788 14756 20657 21366 15989
19127A5989k054K600Q920l943j9619l493J6484J5457l209K638L992j2074j116
19114B0572Q238l415n231l624n110j1311J8477K1209P326o868r407p399p051q889
19100G517j159K072K538j2778j1974l29J3413N728Q89J686p09k323J0190m979
19086I782J719P7J5402J1170l765j2471j0423O3k461J5147J3332J760r196m562
19072B5574J228O739J4890k94n098J0049l182k922o074m462M432M290m214j300
19058C9656r034N035N736j04m197J2980K799j608o379j0625m991r268k675N118
19044B2443N523l877p463r062r94J0632j108L332N249J1300L467j309O435J638
19030D6206P083j0921j4167j8918K328J7679N855k506m983J2454O575n993k2198
$$ plain form
19127 15989 13935 16535 25455 21512 1893 -1600 14884 30341 27132 29770 33762 21688 20572
19114 20572 28810 25395 20164 16540 11430 119 18596 39805 47131 40263 30856 23457 16406 7517
19100 7517 6358 8430 10968 -1810 -13784 -14113 -700 5028 5917 7603 6894 4571 14761 9782
19086 9782 11501 11578 26980 38150 34385 21914 11491 11554 9093 24240 37572 39332 30136 25574
19072 25574 26802 33541 48431 48137 43039 53088 49906 46984 40910 36448 40880 45170 40956 39656
19058 39656 30622 35657 41393 41289 37092 50072 52871 51263 44884 34259 29268 20000 17325 22443
19044 22443 27966 24089 16626 7564 6570 17202 16094 19426 24675 35975 39442 38133 44568 46206
19030 46206 53289 42368 28201 9283 11611 29290 35145 32639 27656 40110 46685 40692 18494
19017A8494P291n48m552N365N795j3181P44P12l499Q295L868J1827k290J1993
19003E0314n854K092L843j5085K945K061k74j2558R151K029j1481j352m357J1580
18989C3054J2373J1602k7787k3020J3906J9728M255q475K188J2789p576j2928
18977C0109K716L355L554P268J086j1631K779J7016J0477k599j945Q28m818r685
18963D8510j079J0989l092j950M2n214L222n694K929p608p063O018P43j963P512
18948D6302j538L540K124L319J0218L224r825j2719j77L899o370k411R931K692
18934E2209P430Q274m020m274j5175k01J0117J1691j7606j0008m057O05J7437
18921E2422J2730O980q912j5048o382K128M661O134k482j423o209j0801m889P622
$$ plain form
19017 18494 25785 25237 20685 26050 31845 18664 19408 20120 16621 24916 28784 40611 38321 50314
19003 50314 44460 46552 50395 35310 38255 40316 40042 27484 36635 38664 27183 25831 21474 33054
18989 33054 45427 57029 29242 6222 20128 39856 44111 35636 37824 50613 43037 30109
18977 30109 32825 36180 39734 47002 48088 36457 39236 56252 66729 64130 62185 63013 58195 48510
18963 48510 47431 58420 55328 53378 53420 48206 51428 45734 48663 41055 33992 40010 40753 38790 46302
18948 46302 44764 48304 50428 53747 63965 67189 57364 44645 44468 48367 41997 39586 49517 52209
18934 52209 59639 67913 63893 59619 44444 44243 54360 66051 48445 38437 34380 34985 52422
18921 52422 65152 72132 63220 48172 41790 43918 48579 54713 52231 50808 44599 33798 28909 36531
18907C6531K5097K3571r177j7699j0551M312N897N932k235o660j615J6196P393
18894G6992k079j6608M447J2302N073j4336l087N498R832K752J1678J057P33k95
18880I3959r500J770j913m400m55J116N673o856M05K0149J3248O424K2992J8327
18866A60939k85L663M937J6026L2126K2064L4750O202k3166j15n191K341L361
18853B57652j0592Q871M0889M0339M2899Q802j9519n4695n3305l1596j4567J1246
18841B26424L797j271R491J2961j6379l6676k8471K869J28j2972q030o226l099
18828A42546o817l333J612J3090J0119o21Q664J8959J4833J8724M1425L3212K9183
18815C21596M5337M2775L1288K1847l7429l3277k471K7271K6098M4126O9439Q1442
$$ plain form
18907 36531 61628 85199 76022 58323 47772 52084 57981 63913 61678 55018 53403 69599 76992
18894 76992 74913 58305 62752 75054 80127 65791 62704 68202 78034 80786 92464 93521 94254 93959
18880 93959 84459 86229 84316 79916 79461 80577 86250 79394 79799 99948 113196 119620 142612 160939
18866 160939 160654 164317 169254 185280 217406 239470 274220 280422 257256 257141 251950 254291 257652
18853 257652 247060 255931 296820 337159 380058 388860 369341 314646 261341 229745 215178 226424
18841 226424 230221 228950 238441 251402 235023 198347 169876 172745 172873 159901 151871 145645 142546
18828 142546 135729 132396 134008 147098 157217 156596 165260 184219 199052 217776 259201 292413 321596
18815 321596 366933 409708 440996 462843 425414 392137 389666 416937 443035 487161 556600 638042
18803F38042O0898L1325j6403n7386p5564o1891m0465o507J8905L0721K9701K28
18791E51604n5140p0839n7508l2633j3947m162k0797j8936j6919k0249k227j0741
18779B27506k6551j0044n051R784J1769L099K4572K3072J3517K1937J3733J101
18767C08444J0534o807K839K3218J1098K3947L3403M7021P0474P7492P5117M9154
18755G25934J8153l6356o0344n1223m0005m0432l1684j786p466j782l4116n4554
18743C84339m5936k3801r983k823n91o331j3787k4240o443m753j5855j0846j2938
18730B06012k0012J456J19m316J543l122n820K663K046r860K161J393P810P43
18716A82816J2773j004J754L2932L9610M7339M4935N9547O8812O4555N0654K7746
$$ plain form
18803 638042 698940 730265 713862 656476 580912 519021 478556 472049 490954 521675 551376 551604
18791 551604 496464 425625 368117 335484 321537 317375 296578 277642 260723 240474 238247 227506
18779 227506 200955 190911 185860 195644 207413 210512 235084 258156 271673 293610 307343 308444
18767 308444 318978 312171 315010 338228 349326 373273 406676 453697 524171 601663 676780 725934
18755 725934 744087 707731 647387 596164 556159 515727 484043 482257 474791 473009 438893 384339
18743 384339 338403 314602 304619 301796 301205 294874 281087 256847 250404 245651 229796 218950 206012
18730 206012 186000 187456 187575 183259 184802 181680 175860 178523 180569 170709 172870 174263 182073 182816
18716 182816 195589 194585 196339 229271 268881 316220 361155 420702 489514 554069 604723 632469
18704F32469O587j7491m7727m9424m8037n2825n5641m9636l4597j8656k2437j9346
18692B23239p119N005j333j587M117j2390j0120j0475N568o469L081r655r530
18679A72332M33Q155L026r584k781j0835M291O49J0668J2545p86j0680p620N609
18665A75422J567J6863L978J4370L3647K4897K4571N9410M5397M3111K6396j1990
18653D57639j4141k7316m2155n2183l2920p869j4279l4344j4075j4013j3998j0370
18641A79976L914J7283J1366k844k0749j0246q35j0630l215L724K596n733j9064
18628A45543n812J7395R986r620l349P105J0340m544n270N950L406P662J0635
18615A89427J1130J507J781J2791J9345J2524J890J3773K952o564N814j96J0264
$$ plain form
18704 632469 639056 621565 573838 524414 476377 423552 367911 318275 283678 265022 242585 223239
18692 223239 216120 221125 219792 218205 222322 209932 199812 189337 194905 188436 191517 181862 172332
18679 172332 172765 180920 183946 174362 171581 160746 165037 165686 176354 188899 188113 177433 169813 175422
18665 175422 176989 193852 197830 212200 245847 270744 295315 354725 400122 443233 469629 457639
18653 457639 443498 416182 374027 321844 288924 281055 266776 232432 218357 204344 190346 179976
18641 179976 183890 201173 212539 209695 188946 178700 177865 167235 164020 167744 170340 164607 145543
18628 145543 139731 157126 167112 157492 154143 161248 171588 167044 161774 167724 171130 178792 189427
18615 189427 200557 202064 203845 216636 235981 248505 250395 264168 267120 260556 266370 266174 276438
18602B76438n133m150J0457J5699P424K326j0288j8295j2663r559j0814l776k300
18589B35366Q229R685P066q010p893j3991j2827q892j2219o570q231o214r175
18576A66324q715N946J1323K59Q213o337L551o30J6483o581J713J2715P7J027
18562B05368K124n85O047J1111O131J0327J8677J353n050j1162m033O941l381
18549B43868p788J1195m963j05j7904j9948J3499J0413J0630l889k2674k562J0687
18536B20459K974L72M914j5233o534q31r085m381J0819N940k984k071j0986J734
18522A95107L149M283J4299J3205J7095J5554J5150R373M348J3591K2834K6665
18510C54653L8412J5312L856J871n877k934r229r33J4945N314q299j8565j3827
$$ plain form
18602 276438 271305 267155 277612 293311 300735 303061 292773 274478 261815 252256 241442 237666 235366
18589 235366 243595 253280 260346 252336 244443 230452 217625 208733 196514 189944 181713 175499 166324
18576 166324 157609 163555 174878 175137 183350 177013 180564 179934 196417 189836 191549 204264 204341 205368
18562 205368 207492 206907 212954 224065 230196 240523 259200 260553 255503 244341 240308 247249 243868
18549 243868 236080 247275 242312 242207 224303 204355 217854 228267 238897 235008 212334 209772 220459
18536 220459 223433 223805 228719 213486 206952 206121 197036 192655 203474 209414 206430 204359 193373 195107
18522 195107 198256 202539 216838 230043 247138 262692 277842 287215 291563 305154 327988 354653
18510 354653 393065 408377 412233 414104 408227 405293 396064 395131 410076 415390 407091 388526 374699
18497C74699m657J384O771k895j0287j6696o641m368J0169K1320J4085l358n472
18484C74054N467q934L198L9312J9454J1396k600k2704k0313r377n508p770R496
18471C85171L3163K7177M5548N5791O8092P9760Q5963P4854N6572K1788k8423
18460I05456k9522k7728k8789r431o130n540n845k594n42K0765J9471j059P9j3574
18446H15017k0688m2629l8144k8670j1115j0302p741J021K4292K1568L108J2001
18434G17718N666J4722J6715m503L825J1616K4469L1176K9978J0861J0258k7723
18422H44778j5759L0703P0026P6506P5976P6242J5144j9988j4427j7211J5921
18411A137911M8248O4127M7863K2458k914j8979k4775k4912m808l837j463J3916
$$ plain form
18497 374699 370042 371426 378197 375302 365015 348319 341678 337310 347479 368799 382884 379526 374054
18484 374054 379521 370587 373785 413097 432551 443947 441347 418643 398330 388953 383445 375675 385171
18471 385171 418334 445511 491059 546850 614942 694702 780665 855519 912091 933879 905456
18460 905456 875934 848206 819417 809986 803856 798316 792471 789877 789335 810100 829571 828512 828591 815017
18446 815017 794329 751700 713556 684886 673771 663469 655728 656749 681041 702609 705717 717718
18434 717718 723384 738106 754821 750318 754143 765759 790228 821404 851382 862243 872501 844778
18422 844778 829019 859722 929748 1006254 1082230 1158472 1173616 1153628 1139201 1121990 1137911
18411 1137911 1186159 1250286 1298149 1320607 1317693 1298714 1273939 1249027 1244219 1240382 1238919 1252835
18399A252835K7733J5065R457M471j4930%J7020K0792L1483L8169L9342O4674
18387A506111P6084J08143J18209J12490O0637L2738K8449L7365K8066M6695R0546
18376B245533Q1920P8742J26365J80588K70629M40344P04407J030410J408699
18367F567637J671951J467415N47871o70471j044328n78646P3589P48169J528992
18358A0312179K649059M242813O355176Q724047J0157558R170216N698259K606014
18350E9915321L19844k938260n899544n710868m512464n099725n639320m125815
18342B6309169j808007K64720J936711L031142K687046K41766l251657m829057
18334B4581833l977923k634880j673758j063767o83310m39785l16568j90318J7959
$$ plain form
18399 1252835 1280568 1295633 1305090 1309561 1294631 1294631 1311651 1332443 1363926 1402095 1441437 1506111
18387 1506111 1582195 1690338 1808547 1921037 1981674 2014412 2042861 2080226 2108292 2154987 2245533
18376 2245533 2327453 2406195 2532560 2713148 2983777 3424121 4128528 5158938 6567637
18367 6567637 8239588 9707003 10254874 9584403 8540075 7961429 8035018 8783187 10312179
18358 10312179 12961238 17204051 23559227 32283274 42440832 51611048 57309307 59915321
18350 59915321 60235165 57296905 51397361 45686493 41174029 36074304 30434984 26309169
18342 26309169 24501162 24765882 26702593 29733735 32420781 32662547 29410890 24581833
18334 24581833 20603910 17969030 16295272 15231505 14548195 14108410 13791842 13601524 13619483
18325A3619483L24373P93485J337807J800659J873107J272854R7673o55264j25315
18316B0338862J101295K533820M057437N519999O357861N810802M416787M845851
18308E4982714Q983289J4489888J7539981J5280039P915105L68333l748797k319119
18300A13491433R67995K599495M45919l205781l729251l721306n997878q920225
18292I1930401r992347j0914409j1050952q840936n930566l564841j801392m43634
18284C9391324K86267j12137j721327l208352l179104k389941j642848j097081
18276B6326801p72969o50013o09958m93735k79108K1619M12236Q92211J582625
18267B6429709K601513L985888N560891O517014N436584J628986k702682l439142
$$ plain form
18325 13619483 13943856 14737341 16075148 17875807 19748914 21021768 21119441 20464177 20338862
18316 20338862 21440157 23973977 28031414 33551413 39909274 45720076 50136863 54982714
18308 54982714 63966003 78455891 95995872 111275911 119191016 119559349 115810552 113491433
18300 113491433 114459428 117058923 117504842 114299061 110569810 106848504 100850626 91930401
18292 91930401 81938054 71023645 59972693 51131757 45201191 41636350 39834958 39391324
18284 39391324 39677591 39565454 37844127 34635775 31456671 29066730 27423882 26326801
18276 26326801 25553832 24903819 24293861 23800126 23521018 23542637 23954873 24847084 26429709
18267 26429709 29031222 33017110 38578001 45095015 50531599 52160585 49457903 46018761
18259D6018761n84790L401133P511992J1225430J3748382J5308081J7949831K0382345
18251A34961165J6798287N890033o359299j5917525k2767998k3392909j8327550
18244G0884204j2583961q347469n628860l849877k573820j548941o05678K83016
18236C6028614Q05079L74272j202914k927101l196292k468204j780700j362259
18228B4270495j119292r28056p94725o67663n94105m90314l70015k24018j57534
18219A8924773j81858k02886k17763k24314j82650n9680J70803M76275R08826
18210A9411526J561037K545533M012996O129223Q917623J1882730J3993055J4126464
18202H2580187J2192936Q784527M028873j987973p579478j0857601j2233320j2469236
$$ plain form
18259 46018761 45433971 48835104 56347096 67572526 81320908 96628989 114578820 134961165
18251 134961165 151759452 157649485 151290186 135372661 112604663 89211754 70884204
18244 70884204 58300243 49952774 44323914 40474037 37900217 36351276 35745598 36028614
18236 36028614 36833693 37207965 36005051 33077950 29881658 27413454 25632754 24270495
18228 24270495 23151203 22223147 21428422 20760759 20166654 19676340 19306325 19082307 18924773
18219 18924773 18742915 18540029 18322266 18097952 17915302 17855622 18026425 18502700 19411526
18210 19411526 20972563 23518096 27531092 33660315 42577938 54460668 68453723 82580187
18202 82580187 94773123 103557650 107586523 105598550 98019072 87161471 74928151 62458915
18194F2458915j1211850q812374o292837m390790l181611k418285j926101j568561
18186B2656506j288544j045870q61750p12924o24962n84830n32737n03954m74832
18177A6026103m27776l68949l17812k73492j92703j54941j02618n8692r0937j38452
18167A3899731j95754k25187j69510n1768J02293K69547M93372Q18528J319037
18158A6260289K109636L287109M999005P316888J0023813J2152619J2134572R105754
18150G7389685L788397j952078p081254j0849559j1767690j0011367p306416n048447
18142B7161271l557828k597815j960527j525226j219506r97189q48198p18060
18134A3736922o24661n38309m56003m09008l52900k96346k58179k48065k40255
$$ plain form
18194 62458915 51247065 42434691 36141854 31751064 28569453 26151168 24225067 22656506
18186 22656506 21367962 20322092 19460342 18747418 18122456 17537626 17004889 16500935 16026103
18177 16026103 15598327 15229378 14911566 14638074 14445371 14290430 14187812 14129120 14038183 13899731
18167 13899731 13703977 13478790 13309280 13257512 13359805 13629352 14122724 14941252 16260289
18158 16260289 18369925 21657034 26656039 33972927 43996740 56149359 68283931 77389685
18150 77389685 81178082 79226004 72144750 61295191 49527501 39516134 32209718 27161271
18142 27161271 23603443 21005628 19045101 17519875 16300369 15303180 14454982 13736922
18134 13736922 13112261 12573952 12117949 11708941 11356041 11059695 10801516 10553451 10313196
18125A0313196k39268k29372j84535j85282j82079j64291j80067j96484j95947
18116H555871j31909l2604Q1440J85900K17928K48057L26020N89752J104338J862059
18106A3006852K718881L054761J833607j224941l784074l405309k111462j281850
18098H806465q23251n65776m01277k92739k44180k09743j93576j82003j59856
18089E734064j53444j70126j70333j62064j49831j33298j10419q6787q6042o9146
18079D442574p8489j07681j03058j10225r2532r2517r1663r4397n7091m2669m2883
18068C529369m4631l7461l8818n5546n1144J30M099J1840L6980O4412Q8871Q3398
18056C591499N4983Q0710J01035J04577J03472J27551J33515J30627J32352J55331
$$ plain form
18125 10313196 10073928 9844556 9660021 9474739 9292660 9128369 8948302 8751818 8555871
18116 8555871 8423962 8391358 8472798 8658698 8876626 9124683 9450703 10040455 11144793 13006852
18106 13006852 15725733 18780494 20614101 19389160 15605086 12199777 10088315 8806465
18098 8806465 7983214 7417438 7016161 6723422 6479242 6269499 6075923 5893920 5734064
18089 5734064 5580620 5410494 5240161 5078097 4928266 4794968 4684549 4597762 4511720 4442574
18079 4442574 4364085 4256404 4153346 4043121 3950589 3858072 3766409 3672012 3614921 3572252 3529369
18068 3529369 3484738 3447277 3408459 3352913 3301769 3301899 3305998 3317838 3354818 3419230 3508101 3591499
18056 3591499 3646482 3727192 3828227 3932804 4036276 4163827 4297342 4427969 4560321 4715652
18046D715652J85165J46102P2685L8632L2822N057m1566j21426j71531j75586
18036D686006j84451k00481k05863j71872j11642j03865j11485p5831k4409m805
18026C491302p323l596k1551l7683j1011K0778N8053O3846N9494L3838K297M0702
18014C689146J15724J64744K13146K41980L17571M55670O35269Q73742J223776
18005G930768J782095K615950L725596M848612N100728L527357N22811r45892
17997B9108025Q01905L944479O932441Q273153N809564q93259p340550p589451
17989C9046307l794114n1584K241742K092001r46449n107975o392396m868238
17981B2219294l157858k041225j356422r04405n90375l90582k93629k74625k57639
$$ plain form
18046 4715652 4900817 5046919 5119604 5158236 5191058 5196115 5154549 5033123 4861592 4686006
18036 4686006 4501555 4301074 4095211 3923339 3811697 3707832 3596347 3520516 3496107 3491302
18026 3491302 3483979 3480383 3458832 3421149 3410138 3430916 3488969 3552815 3612309 3646147 3648444 3689146
18014 3689146 3804870 3969614 4182760 4424740 4742311 5197981 5833250 6706992 7930768
18005 7930768 9712863 12328813 16054409 20903021 26003749 29531106 30053917 29108025
17997 29108025 29909930 33854409 40786850 49060003 54869567 53976308 46635758 39046307
17989 39046307 35252193 35200609 37442351 39534352 38587903 33479928 27087532 22219294
17981 22219294 19061436 17020211 15663789 14759384 14169009 13778427 13484798 13210173 12952534
17972A2952534j73659p1031N1125J66766K47654K90192L75114N65252R26822J498188
17962A6828957K349043L638720N445353P606844R451876R860525Q010770M702804
17954F7894892K700195L563074O737966R871233J1740954J2917310J3750348J1572117
17946A40748089N176372k223688p890169j0264520j0123892r164781p559068m526854
17938I4171489j971115j617619m053610p444524j0202689j0871192q834719o214991
17930D2961030m302681l088335k296057j773878j422176j167254r97682q74200
17922B7038767p37409o23142n56219m89989l66555j90298J28L09903P61297J430864
17912B6577347K392917L672015N049451O188249O613064N603372K765708l58463
$$ plain form
17972 12952534 12778875 12707844 12758969 12925735 13173389 13463581 13838695 14403947 15330769 16828957
17962 16828957 19178000 22816720 28262073 35868917 45320793 55181318 63192088 67894892
17954 67894892 70595087 74158161 80896127 90767360 102508314 115425624 129175972 140748089
17946 140748089 145924461 143700773 135810604 125546084 115422192 106257411 98698343 94171489
17938 94171489 92200374 90582755 86529145 79084621 68881932 58010740 49176021 42961030
17930 42961030 38658349 35570014 33273957 31500079 30077903 28910649 27912967 27038767
17922 27038767 26301358 25678216 25121997 24632008 24265453 24075155 24075283 24385186 25146483 26577347
17912 26577347 28970264 32642279 37691730 43879979 50493043 56096415 58862123 58503660
17904E8503660k19762K366353N333518P820475Q188732M658094j426455m705324
17896H0519291m210738l097296j920302m59155n48554k381757m079178m594197
17888E9228114n355928n973512n705407n154767m203260l076610k148053j559080
17880B6051497j242161j035832q86419p88165p73494p53587p37110p46858p68769
17871A8319102p16787o33549n61315m84941m27044m24891m50448m27384m10544
17862A3782199l83248l37206l00887k81807k82432k53115k29693k22849k23638
17853A1267324j94883j59500j48138j58664j60186j37483j04789o5938m0471k2097
17843A0075175j4686K3461R5251J95412K77925L56369L99440L89223M12655N11188
$$ plain form
17904 58503660 58283898 60650251 65983769 73804244 81992976 86651070 85224615 80519291
17896 80519291 76308553 73211257 71290955 70831800 70283246 67901489 63822311 59228114
17888 59228114 53872186 47898674 42193267 37038500 32835240 29758630 27610577 26051497
17880 26051497 24809336 23773504 22887085 22098920 21325426 20571839 19834729 19087871 18319102
17871 18319102 17602315 16968766 16407451 15922510 15495466 15070575 14620127 14192743 13782199
17862 13782199 13398951 13061745 12760858 12479051 12196619 11943504 11713811 11490962 11267324
17853 11267324 11072441 10912941 10764803 10606139 10445953 10308470 10203681 10137743 10097272 10075175
17843 10075175 10060489 10083950 10179201 10374613 10652538 11008907 11408347 11797570 12210225 12721413
17833A2721413O60603R29615J335772J882270K640532L636291M702536N202027
17825C3711059M779205M113786M479001N771947P497909J0177940J3462778J6453914
17817A00447539J8477072J9362132J7321323R311207k837591j2136794j0141689
17810A39803199J708484J5398226K5674231K7949031J8688026K250774q895205
17803B22576766j0765528j0850366j4628404j9094561j9959015j7179378j1830550
17796A18268964n760113j77838M241224N939278L703204j867769p287072r733631
17788A07326247j0729176j0962237r905483q329070o642706m998775l682343k728608
17780D9347849j970591j335210p60117j41246P03210J826806L224816M694312
$$ plain form
17833 12721413 13382016 14311631 15647403 17529673 20170205 23806496 28509032 33711059
17825 33711059 38490264 42604050 47083051 52854998 60352907 70530847 83993625 100447539
17817 100447539 118924611 138286743 155608066 164919273 162081682 149944888 139803199
17810 139803199 141511683 156909909 182584140 210533171 229221197 231471971 222576766
17803 222576766 211811238 200960872 186332468 167237907 147278892 130099514 118268964
17796 118268964 112508851 112331013 116572237 122511515 126214719 124346950 117059878 107326247
17788 107326247 96597071 85634834 75729351 67400281 60757575 55758800 52076457 49347849
17780 49347849 47377258 46042048 45281931 45140685 45843895 47670701 50895517 55589829
17772E5589829N364297M301714K030172J196861L207809N760833N716260K067403
17764H5235178k067689j696254L635886J0511409J5083299J3545568M794961m730805
17756A24311553o818431l571676Q08279L580427J359060o290424j4622261j6228607
17748H2527920j1966874p904917o189701n645802m794273l657618k705914k000575
17740C7662246j476597j060455o36524j77605J30460j65288j124651k128587k357412
17731B8665587j921598j403489j084922r34509q90116q61519p87934p07235o33470
17722A9440795n83551n44576n25570n08318m60191m43783m27506l94105l67496
17713A5185699l42790l46366l45258l39232l00816k76655k72681k53784k84233
$$ plain form
17772 55589829 60954126 65255840 67286012 68482873 71690682 77451515 83167775 85235178
17764 85235178 83167489 81471235 85107121 95618530 110701829 124247397 129042358 124311553
17756 124311553 117493122 113921446 114729725 118310152 119669212 113378788 98756527 82527920
17748 82527920 70561046 62656129 56466428 50820626 46026353 42368735 39662821 37662246
17740 37662246 36185649 35125194 34488670 34311065 34441525 34276237 33151586 31022999 28665587
17731 28665587 26743989 25340500 24255578 23321069 22430953 21569434 20781500 20074265 19440795
17722 19440795 18857244 18312668 17787098 17278780 16818589 16374806 15947300 15553195 15185699
17713 15185699 14842909 14496543 14151285 13812053 13511237 13234582 12961901 12708117 12423884
17704A2423884k86024k78996k68198k34687j98970j60600j69061j78737j82292
17695A0466319j68059j49376r7656n3978m7524p5960j18541j42436j30700p9344
17685I402745n4813q0017j05862o3375L979P1480J60371K74708L93921N23158
17675A0526295P46829J206129J974717L142396M700896O416739P648144P401269
17667D3763414N161391J668238j164300j542291J68814K223424K661410P15145
17659E3655245k568439n003089n071348l108274j32829K595073M176348L994270
17651D8536957K097745n10892k036020j562527J33326J439731R71231j349997
17643D7719554m297047o077017o066672m886128l455409k354474j649743j220427
$$ plain form
17704 12423884 12137860 11858864 11590666 11355979 11157009 10996409 10827348 10648611 10466319
17695 10466319 10298260 10148884 10051228 9997250 9949726 9873766 9755225 9612789 9482089 9402745
17685 9402745 9347932 9267915 9162053 9098678 9102657 9174137 9334508 9609216 10003137 10526295
17675 10526295 11273124 12479253 14453970 17596366 22297262 28714001 36362145 43763414
17667 43763414 48924805 50593043 49428743 47886452 48055266 50278690 52940100 53655245
17659 53655245 51086806 46083717 41012369 37904095 37771266 40366339 44542687 48536957
17651 48536957 50634702 50123810 48087790 46525263 46658589 48098320 49069551 47719554
17643 47719554 43422507 37345490 31278818 26392690 22937281 20582807 18933064 17712637
17635A7712637r49257p38685o03883n26579m72210m36063l61920k72078j42213
17626A3209749m016J01681K68017N63213J039402J795237K901211M293970N660555
17617B9829019O260464N346576K888424l0914j623573j032030P50594K133647
17609D4522207J759724m04992l061728m372275l656299j512327J037586L005843
17601C7317739L701660K780349O52246j469208k009581r15075O35657J229368
17593D1923155Q6179k278905m523274n359378m817785l623924k512575j757632
17585A7135861j287532j006369q09962p06075o32287n44843m86808m38521l90406
17576A0833058l71196l41297l12004k97743k79221k65764k58799k49536k63131
$$ plain form
17635 17712637 16763380 16024695 15420812 14894233 14422023 13985960 13624040 13351962 13209749
17626 13209749 13205733 13307414 13575431 14138644 15178046 16973283 19874494 24168464 29829019
17617 29829019 36089483 41436059 44324483 44293569 42669996 41637966 42388560 44522207
17609 44522207 46281931 45876939 42815211 38442936 34786637 33274310 34311896 37317739
17601 37317739 41019399 43799748 44451994 42982786 40973205 40058130 40693787 41923155
17593 41923155 42009334 39730429 35207155 29847777 25029992 21406068 18893493 17135861
17585 17135861 15848329 14841960 14031998 13325923 12693636 12148793 11661985 11223464 10833058
17576 10833058 10461862 10120565 9808561 9510818 9231597 8965833 8707034 8457498 8194367
17567H194367k57217k55433k36041k14640j96031j88684j84550j86292j81507
17558F293972j65104j58476j59257j45867j29588j20269j19614j02824j03452
17549E089521j05109j03945j03179j02982r6662q4017p3566p7751r1429j06025
17539D144856j12426q9093r1699q9654r0024p6896p5704p7680q6544p8315n0735
17528C226086m8489o7934o5254o1875o3893n4439m7442m1866o8458o5528o5072
17517B575836n7733n7509n2098n1636l9369m1583m8788n2668m6250m3835l9790
17506B044577k0993k2054j0619M793L30l186L390O931Q951k904R609J4100J5804
17493B048729J7874M6719N1350M9095M1778K2822k616o113j0376j7151r523l447
$$ plain form
17567 8194367 7937150 7681717 7445676 7231036 7035005 6846321 6661771 6475479 6293972
17558 6293972 6128868 5970392 5811135 5665268 5535680 5415411 5295797 5192973 5089521
17549 5089521 4984412 4880467 4777288 4674306 4577644 4493627 4420061 4342310 4250881 4144856
17539 4144856 4032430 3943337 3851638 3761984 3671960 3595064 3519360 3441680 3355136 3276821 3226086
17528 3226086 3177597 3109663 3044409 2982534 2918641 2864202 2816760 2774894 2706436 2640908 2575836
17517 2575836 2518103 2460594 2408496 2356860 2317491 2275908 2227120 2174452 2128202 2084367 2044577
17506 2044577 2023584 2001530 1990911 1995704 1996034 1992848 1996238 2003169 2012120 2009216 2018825 2032925 2048729
17493 2048729 2066603 2113322 2164672 2213767 2255545 2278367 2275751 2269638 2259262 2242111 2232588 2229141
17481B229141l9440p0874q7210q4805q1761p3246p9064o2597n8075n7608n4295
17470A480166o0608n4746m6706l4785k3310l0666n1395n0039m4657m7499m3748
17459I92007l0896j1708j5308l3262k6599k5015j1882R219K1622J8455L2872L3742
17447I53247N1851N5268O2257Q1664O7913M5478M5827L7753M8038P6796P1881
17436A597973N0560P794n0798q5698r2283m4726r036j7734k2361n1052n3207p4481
17424A154951p5619o7858m0975q023k162k1873l3097m3156k6163k2813j7352k0348
17412G75512k7901j4249j9932k4769k6192j9317n936j1560p436J1682J7955J7684
17400F65541M0964L0570K1253L0825L2525J3132L353J942Q352K8152M3160L5119
$$ plain form
17481 2229141 2189701 2118827 2031617 1946812 1865051 1791805 1712741 1650144 1592069 1534461 1480166
17470 1480166 1419558 1364812 1318106 1283321 1260011 1229345 1177950 1127911 1083254 1035755 992007
17459 992007 961111 949403 934095 900833 874234 849219 837337 846556 868178 886633 919505 953247
17447 953247 1005098 1060366 1122623 1204287 1272200 1317678 1363505 1401258 1449296 1526092 1597973
17436 1597973 1648533 1656327 1605529 1519831 1427548 1382822 1373786 1356052 1333691 1282639 1229432 1154951
17424 1154951 1079332 1011474 970499 962476 960314 938441 905344 862188 836025 813212 795860 775512
17412 775512 747611 733362 713430 688661 662469 643152 637216 625656 618220 629902 647857 665541
17400 665541 706505 737075 758328 789153 821678 834810 838163 840105 848457 876609 919769 954888
17388I54888P14l5915m0497m3538k9797j0135r454o686k9010m4375m8618n3772
17376F03805l1789l9187l8224k5230j2896l686p204j175j754q578j6387j5460
17364D02235M752L4q041j4759n309k987L72l134j1289o000j4343j4979j1107l497
17350C11948K782J3135q353l732j1412m442l332j436K700n055j1797r352L72N335
17336B77361j2388m206k314N555J698r125j5626l360K1626J2400j1846j1481n058
17323B43236M077J7920J1863J3534O380J6750J2278K9246M4322P0084Q1549J02138
17311F53377Q0858O5671L8556L2604K7976m634j7395k3103j2993n216J2105M1604
17299H89410N2782O9793O7345M1464M2593L5803j0392o8111p7315o7884m7769
$$ plain form
17388 954888 955602 919687 879190 835652 805855 795720 786266 779580 750570 706195 657577 603805
17376 603805 572016 532829 494605 469375 456479 452793 445589 444414 442660 434082 417695 402235
17364 402235 406987 407021 398980 384221 378912 375925 376297 373163 361874 355874 341531 326552 315445 311948
17350 311948 314730 327865 319512 315780 304368 299926 296594 295158 297858 292803 281006 271654 272026 277361
17336 277361 264973 260767 258453 264008 265706 256581 240955 237595 259221 271621 259775 248294 243236
17323 243236 247313 265233 277096 290630 297010 313760 326038 355284 399606 469690 551239 653377
17311 653377 734235 799906 838462 871066 899042 894408 877013 853910 840917 835701 847806 889410
17299 889410 942192 1011985 1079330 1120794 1163387 1199190 1188798 1120687 1043372 975488 927719
17288I27719k4401l7181l7845l5363l4700k7561k3214k5157l2864m8413n0108
17277E50912m8103n3922m2906l1046J1474K2574O300k5199k3242j1511n1n36K4424
17264C79168J3436K882K8174M0208N4656N0176K1664K9968K7337J6012j4097l5550
17252F14034l0250j4952J4832J5862k2408l8708m5854l2752M686K8103M2442M6298
17240E81333K5617r861l7566m0185l5309j0597J4391J6656J4779j8061l3784m8996
17228D18417m7256l7739m3090l1916n717m985j0111j456r86o085p939p046j3068
17215B01023J14j1155n525Q904O186j429J79J88P165j1507j4912n131m932j340
17201A67828j702O773M03N405L821r559j5603r551o202P778Q459M363l584r160
$$ plain form
17288 927719 903318 866137 828292 792929 758229 730668 707454 682297 649433 601020 550912
17277 550912 502809 448887 405981 374935 386409 408983 415283 390084 366842 355331 355280 354744 379168
17264 379168 392604 395486 423660 463868 518524 568700 590364 620332 647669 663681 649584 614034
17252 614034 583784 568832 583664 599526 577118 538410 492556 459804 464490 492593 535035 581333
17240 581333 606950 597089 559523 519338 484029 473432 487823 504479 519258 501197 467413 418417
17228 418417 371161 333422 290332 258416 252699 247714 237603 236147 235161 229076 221137 214091 201023
17215 201023 201137 189982 184457 193361 199547 198118 198297 198485 205650 194143 179231 174100 169168 167828
17201 167828 166126 172899 173302 178707 182528 172969 157366 147815 141613 149391 157850 162213 158629 149469
17187A49469L572R951j2061n963j796k273o120l230J0264k019m206n972m616m041
17173A20959j0419o444OJ099K083j991q873K629N243k362l609J3580J3892m785
17159A21008Q621J2716J4431K0474L2443L8384K5930K5879J8199k901j3496Q540
17147C10228K0772P898l854k0020k3540j7231p771k14J4624K2937J628O71M506
17134C10634m248J1572J0931j1807j0268k7187l3816k2785k8273k5737j3852k512
17122A52652l865j6505r428P335q013m735L149p49O28J3507Q068q543j2625J0579
17108A31455R854K718l424K5471L2586K1296J9200K8004K2190m019j717J1345
17096B94959J9046J242m411k4533j3519l4370k3189J0695O637J9802K1326K5492
$$ plain form
17187 149469 153041 162992 150931 144968 143172 140899 134779 131549 141813 139794 135588 129616 125000 120959
17173 120959 110540 104096 104102 105201 107284 105293 96420 99049 104292 101930 98321 111901 125793 121008
17159 121008 129629 142345 156776 177250 209693 248077 274007 299886 318085 315184 301688 310228
17147 310228 331000 338898 335044 315024 291484 274253 266482 266268 280892 303829 305457 306128 310634
17134 310634 306386 317958 328889 317082 306814 279627 245811 223026 194753 169016 155164 152652
17122 152652 148787 132282 122854 130189 122176 117441 120590 119841 120469 133976 142044 133501 120876 131455
17108 131455 141309 144027 140603 166074 198660 219956 239156 267160 289350 285331 283614 294959
17096 294959 314005 315247 310836 286303 272784 238414 215225 225920 232557 252359 273685 299177
17084B99177J4307j044k1912j7375M124N301m068j2995j8729k7081l1298j9929
17072A68478k7867j6529o704M553O083p8m885j4113o021q468M129J7051M873j6261
17058A04241j1394L222P460N172Q046N261j6534l928n043Q467J293r914q509l549
17044H4291J766o445m949K369l345m538P880R392M277J1032n32j6936n900q286
17030G0076K153k01j983M452O813j513j1278j2544l147l787J3606O98P910r842
17016F1413j1466p013o222R026J6937K292p556O217o389j0949m13J7599J0218
17003G3694o672r035k808m024P484j5231K841J4084R127r777j2296J0918N936
16990F4241j3070n488M504J121K411o876J305O93o410O72P703O7j0733K222j3034
$$ plain form
17084 299177 313484 312440 290528 273153 277277 282578 278510 265515 246786 219705 188407 168478
17072 168478 140611 124082 117378 121931 128014 127936 123051 108938 102917 94449 98578 115629 120502 104241
17058 104241 92847 96069 103529 108701 116747 122008 105474 101546 96503 104970 106263 96349 87840 84291
17044 84291 86057 79612 74663 77032 73687 69149 77029 86421 90698 101730 101198 84262 78362 70076
17030 70076 72229 72028 70045 74497 81310 79797 68519 55975 52828 49041 62647 63345 71255 61413
17016 61413 49947 42934 36712 45738 62675 64967 57411 63628 57239 46290 45877 63476 73694
17003 73694 67022 57987 55179 51155 58639 43408 46249 60333 69460 59683 47387 58305 64241
16990 64241 51171 45683 50187 51308 53719 46843 48148 48841 42431 43103 50806 50873 40140 42362 29328
16975B9328j5868J4797K1390n11K643K880l022o840M766K637O91k908n658R80
16961D5305J0787p750j3387R494R155n174q567K934k634o294J770P973M525P171
16947E5308p386j1492q447N540M695p844P86l954j52j714O131J370p596J2682
16933C7927J2589L52k0o972M326n543q494j958J753M772P230j778K337n128k970
16918C8423J7m670n445J0573n47m539O698J2651o15k366l097m220N554K1499J13
16903G0029j7865k714m710n691K610J650l170K351j943N389J070j3863J1446l852
16889D0737n425j3269j656J2202j2889n343R876j565k027q751j170J8079J4484
16876D3283n893j8226M747K659n167Q640J7084j588k025j1099Q255o411p940j568
$$ plain form
16975 29328 13460 28257 49647 49136 51779 54659 51637 44797 49563 52200 52891 49983 44325 45305
16961 45305 56092 48342 34955 44449 53604 48430 39863 42797 40163 33869 35639 43612 48137 55308
16947 55308 47922 36430 27983 33523 38218 30374 31160 27206 27054 25340 31471 32841 25245 37927
16933 37927 50516 50868 50848 43876 48202 42659 34165 32207 33960 38732 45962 44184 46521 41393 38423
16918 38423 38440 33770 28325 38898 38351 33812 40510 53161 52546 50180 47083 42863 48417 69916 70029
16903 70029 52164 49450 44740 39049 41659 43309 40139 42490 40547 45936 47006 33143 44589 40737
16889 40737 35312 22043 20387 32589 19700 14357 24233 22668 20641 11890 10720 28799 43283
16876 43283 37390 19164 23911 26570 21403 30043 47127 45539 43514 32415 40670 34259 26319 24751
16862B4751J6990J1072l456j483J563o284o408K009j568N353l589o734j89P4J992
16847C4093r204j1022m903M316J1154R803q57J060m505P704R056j0996n884k215
16833B7600J505M041j908j1503q70n060O008M928K009k680j0899m972N078k730
16819A0547J952K640l572J067m492k248J788J352n029J89j103q501M045J6092
16805A4727M246j7606n530K433l062J3658M180J2471Q89n709l24j2082J2508J1712
16791C2511n549r274M729J2882N644j0169j6356j5169J3325M291m308k698J5531
16778B5390K167M328n222P951J2772l190k4688j1119Q150j693O70M807m144J513
16764A7692K0262O575m059j313r209j0160Q738K934q257N586R475p174o516N365
$$ plain form
16862 24751 41741 52813 49357 47874 49437 43153 36745 38754 37186 42539 38950 32216 32027 32101 34093
16847 34093 24889 13867 8964 13280 24434 34237 33380 34440 29935 37639 46695 35699 29815 27600
16833 27600 29105 33146 31238 19735 18865 13805 19813 24741 26750 24070 13171 8199 13277 10547
16819 10547 12499 15139 11567 12634 8142 5894 7682 9034 4005 4194 3091 -5410 -1365 14727
16805 14727 18973 1367 -4163 -1730 -4792 8866 13046 25517 26406 20697 20373 8291 20799 32511
16791 32511 26962 17688 22417 35299 40943 30774 14418 -751 12574 16865 12557 9859 25390
16778 25390 27557 31885 26663 34614 47386 44196 19508 8389 16539 14846 15516 20323 16179 17692
16764 17692 37954 44529 40470 39157 29948 19788 28526 31460 23203 28789 38264 31090 24574 29939
16750B9939J1569k922k378j4883N510J2100p236k70o598K679J1681j1936J536
16737B8791M099J1955N61j1601m730M994M120q958q070q713l86m156j389P172
16723A3689j6672M99Q43j197J038k871N255J0430J5543L940l076j4894k450m474
16709E603j695p626j0695R212P153J1065r20M003j3231J649K1734J2366N73n472
16695C3719M216k84j211p695L12K21J439M800n5q755r183J1464Q600K938M774
16680D5300k18l308o94n068j5598j6455l508k104O132K3061j0510j6047m678J6066
16666A2371K2766k867k4286P646R506l293j5460p920J482P331L878j138P176M501
16652B1693K015p533j7324j019r497N701Q214Q766R048Q23r383q390L021j0482
$$ plain form
16750 29939 41508 38586 36208 21325 26835 38935 31699 31429 24831 27510 39191 27255 28791
16737 28791 32890 44845 45406 33805 29075 34069 38189 29231 21161 12448 12062 7906 6517 13689
16723 13689 -2983 -2484 -1641 -2838 -1800 -4671 584 11014 26557 30497 27421 12527 10077 5603
16709 5603 3908 -3718 -14413 -5201 1952 13017 12097 16100 2869 4518 26252 38618 39191 33719
16695 33719 37935 37651 36440 28745 29057 29278 30717 35517 35462 26707 17524 28988 37588 40526 45300
16680 45300 45082 41774 41080 36012 20414 3959 451 -1653 4479 27540 17030 983 -3695 12371
16666 12371 35137 32270 7984 15630 25136 21843 6383 -1537 -55 7276 11154 10016 17192 21693
16652 21693 23708 16175 -1149 -2168 -11665 -5964 2250 11016 20064 20887 11504 3114 6135 -4347
16638d347K782J1506o593l56q134J344p294N421R894P325J2442K722m999j684
16624B0029Q177k66n138j4482J270r771l839K493J1982o700j0836L203K0827M323
16610B1272q653l986N433K512k871Q382P766j546m764q175n815r198l198J53J8666
16595A5978M652l14K359J313P526l607j0108l680J3802J471M240P529j0632M559
16581C5088k665p343r609j774p097j332L219P067j0525N667Q247j333O42L558
16567B1810J0271j7081j3371Q735Q86j0231J2287J0317p61j049N492r550q268
16554I487R806k190m675M030N000j4164j98J1143J5350k318M176l676o220l260
16540B2291l266o964K700O504p050l346k85J3634J2633M447l616N26Nl193j869
$$ plain form
16638 -4347 -1565 9941 3348 2992 -5142 -3798 -11092 -5671 4223 11548 23990 26712 21713 20029
16624 20029 28206 27940 22802 8320 9590 -181 -4020 -1527 10455 3755 -7081 -3878 16949 21272
16610 21272 12619 8633 14066 16578 13707 22089 29855 28309 23545 15370 9555 357 -2841 -2688 15978
16595 15978 20630 20316 22675 23988 31514 27907 17799 14119 27921 29392 33632 41161 30529 35088
16581 35088 32423 25080 15471 13697 6600 5268 8487 15554 5029 10696 18943 17610 18252 21810
16567 21810 32081 15000 1629 10364 11250 1019 13306 23623 22862 21813 27305 17755 9487
16554 9487 19293 17103 12428 16458 21458 7294 7096 18239 33589 31271 35447 31771 25551 22291
16540 22291 19025 12061 14761 21265 14215 10869 10584 24218 36851 41298 37682 38208 38213 35020 33151
16525C3151p915q793k2249j0619J7811J0708n798P375J2999L076p0q485j6154
16512E037k65O592J4791Q167q036q560j3963o431M055L987j0897j0565J1823J238
16498c027J4268J2332k134M757Q613P809k838m088j166J001j684j340l867j082
16484B7554j3405n683O555K281J496L890J2988L372j8655o286o101R856k514o575
16470H773p888j0478R562K2193J3602q633j1247p334M542k831m581k731o780p255
16456a1086J364J6565k283m557l974j1440l302J7715J3583N654O788j338n719
16443A7970j2546M509l322K0549N735j4628p258Q691K170q669q901k844p195m36
16429f175K139q09J5027J1592r396q806P863J685m232O975N260o211L278K742
$$ plain form
16525 33151 25236 16443 -5806 -16425 1386 12094 6296 13671 26670 29746 29676 21191 5037
16512 5037 4772 11364 26155 34322 26286 17726 3763 -2668 1387 5374 -5523 -16088 -4265 -3027
16498 -3027 11241 23573 21439 26196 34809 42618 39780 35692 34526 35527 33843 32503 28636 27554
16484 27554 14149 8466 15021 17302 18798 22688 35676 39048 20393 14107 8006 17862 15348 8773
16470 8773 885 -9593 -31 22162 35764 27131 15884 8550 13092 10261 5680 2949 -3831 -11086
16456 -11086 -9722 6843 4560 3 -3971 -15411 -18713 -998 12585 18239 25027 23689 17970
16443 17970 5424 9933 6611 27160 32895 18267 11009 19700 21870 13201 4300 1456 -5739 -6175
16429 -6175 -4036 -4845 10182 21774 12378 3572 11435 13120 8888 15863 21123 14912 18190 20932
16415B0932l925j0648p7L716M698j0866j3552r471J716J2130L47N108R28n683
16401d647R544N882R903m696j8338n851N340J1670j0385j3176Q387K3783P456
16388B4872k775m902p659P469L055O123q29m289j5656o669M212k380J0884J3387
16374B4843O521k129q642j0296J59j018n590l633K764J1542R879q709p086r205
16360f00K660R435K621J047j350j2742p322M152N558K114j2313O478J7223n907
16346A1054k0412N444m9L722k421L801n111N28j010K110P786l08J3679k388j0087
16331F338M737o143n053J4433j830q694J108K507P711p029m111J5897K61o268
16317A3864M007p979J524m058q997P78N036R046j4013o447P10k897J0586Q473
$$ plain form
16415 20932 17007 6359 6282 9998 14696 3830 -9722 -19193 -17477 -5347 -5000 108 1036 -4647
16401 -4647 4897 10779 20682 15986 -2352 -8203 -2863 8807 -1578 -14754 -6367 17416 24872
16388 24872 22097 17195 9536 17005 20060 26183 25354 21065 5409 -1260 2952 572 11456 24843
16374 24843 31364 29235 20593 10297 10456 9438 3848 215 2979 14521 24400 15691 8605 -600
16360 -600 2060 11495 14116 15163 13813 1071 -6251 -2099 3459 5573 -6740 -262 16961 11054
16346 11054 -9358 -3914 -3963 -241 -2662 1139 -3972 -3444 -4454 -2344 5442 5134 18813 16425 6338
16331 6338 11075 4932 -121 14312 12482 3788 4896 7403 15114 8085 3974 19871 20132 13864
16317 13864 17871 9892 11416 7358 -1639 -861 4175 13221 -792 -7239 -6529 -9426 1160 9633
16303I633J1401K887l542k476q371j3152j2974J2671J7179J698o996q385R70K162
16289B705j531m170Q807j836J470Q209J933j0433l325m897J2315k144J003M490
16275A2596Q436n269j56J0722J929n407j0027j1520k715o582k015l921K059R112
16261b758P477P238L511m829P259q314j4690L01K873n980j6882r945J1554J8250
16247d935O919q68m365J25N484o386J231O129l296N658O594O412m247o520k64
16232G671J0111r264p350N333o879R477j232q989j460L927l732K705p492j944
16218i118J5919J17m79N256L184k809p779J089j4619K378l113l088J6128P794
16204A0860N948K944j5910m498j0840J1913J394r902M192l464K618N602q114q916
$$ plain form
16303 9633 21034 23921 20379 17903 9532 -3620 -16594 -3923 13256 14954 7958 -427 543 2705
16289 2705 1174 -2996 5811 3975 5445 13654 15587 5154 1829 -3068 9247 7103 8106 12596
16275 12596 21032 15763 15607 26329 28258 22851 12824 1304 -1411 -7993 -10008 -13929 -11870 -2758
16261 -2758 4719 11957 15468 10639 17898 9584 -5106 -4805 -1932 -7912 -24794 -34739 -23185 -4935
16247 -4935 1984 1116 -3249 -3124 2360 -4026 -2795 3334 38 5696 12290 18702 14455 7935 7671
16232 7671 17782 8518 1168 6501 -378 9099 7867 -1122 -2582 1345 -2387 318 -7174 -9118
16218 -9118 6801 6918 6439 11695 14879 12070 4291 5380 -9239 -6861 -9974 -13062 3066 10860
16204 10860 16808 19752 3842 -656 -11496 417 1811 -8091 -3899 -7363 -4745 857 -7257 -16173
16190a6173m416L824K0108J4103j915j5289k617M456R925q632q202r46j523o382
16176a3679q366j88j703J402J6790J6654J0985j3753j5950J533Q705J3599J824
16163A7853j3525q499K642q900l607J5649l5p349l051R739j745L324L163M324
16149I983R41J725j0897l325K570N703j311j1300J194n419L1k826M551L51O335
16134a694J3883k165j236q551j397K158k422R772k741j4802k365p43m246M62r54
16119a7041J1198J7712n809n325P330j08j1987p206m578O331L601J458k135P780
16105A221K240j0942m213L859J6025r133j4779o070L047K4265J773o747J8768
16092A9314J3131m589j1637j0174Q005M423j0782J924n127J318R561p844K72q266
$$ plain form
16190 -16173 -20589 -16765 3343 17446 15531 242 -2375 2081 12006 3374 -4828 -5774 -7297 -13679
16176 -13679 -22045 -22233 -23936 -22534 -5744 10910 21895 8142 -7808 -6275 2430 16029 17853
16163 17853 4328 -4171 -1529 -10429 -14036 1613 1578 -5771 -8822 917 -828 2496 5659 9983
16149 9983 10924 12649 1752 -1573 997 6700 5389 -5911 -4717 -10136 -10105 -12931 -8380 -8029 -1694
16134 -1694 12189 10024 8788 237 -1160 998 -1424 8348 5607 -9195 -11560 -12303 -16549 -16087 -17041
16119 -17041 -5843 11869 6060 735 8065 7957 -4030 -11236 -15814 -9483 -5882 -4424 -6559 1221
16105 1221 3461 -7481 -11694 -7835 8190 -943 -15722 -21792 -18745 5520 7293 546 19314
16092 19314 32445 27856 16219 6045 14050 18473 7691 9615 4488 5806 15367 7523 7795 -471
16078d71j838J6629J7933J677j5402m939l982L03k553l029l991L798l616o466
16064e947P675K646o468J2385q039m090N545j1043l0l076L500m174J0039j623
16050b700k013N321k288j856j346k65J139K333L710j516J779M095k43j1926N02
16035e274R355R352M134q474m55j629P15J727J2386O04j1934j564r295O988K647
16020I283m019q862N754N951n818J9P495J988m52L196j077r224Q0o480R432J1669
16004A8935k405p209j1820j462J2740J241M32j0892K067N121J5391o957p547N807
15990A3442j2735r661K585p079M967J6097O743l575k58m794j9092l910J360K854
15976a3056J2188J7347L532n06l576j1946K321J1771r335M424R457j013Q470q857
$$ plain form
16078 -471 -2309 14320 32253 33930 18528 13589 9607 9910 7357 4328 337 4135 519 -5947
16064 -5947 1728 4374 -2094 10291 2252 -1838 3707 -7336 -7366 -10442 -6942 -11116 -1077 -2700
16050 -2700 -4713 608 -1680 -3536 -4882 -5147 -4008 -1675 2035 519 2298 6393 6150 -5776 -5274
16035 -5274 4081 13433 17567 9093 8638 7009 7724 9451 21837 22441 10507 8943 -352 6636 9283
16020 9283 5264 -3598 2156 8107 2289 2308 9803 11791 11339 14535 13458 4234 4314 -2166 7266 18935
16004 18935 16530 9321 -2499 -3961 8779 10020 10452 -440 1627 6748 22139 15182 7635 13442
15990 13442 707 -8954 -6369 -13448 -8481 7616 14359 10784 10526 5732 -13360 -17270 -15910 -13056
15976 -13056 -868 16479 20011 19505 15929 3983 6304 18075 8740 13164 22621 21608 30078 21221
15962B1221o010N11J488q496O963j8055k742J2459M928n861K906K736p976L70
15948D442j4876k256J9198J3835j3671j069O15p045j1741p732R225N921J138q705
15934a2721N20J0239J5223m583q868P116M314O3O84l448O954M264n911j271r873
15919B702j647q797l69j0126J206J3343J388L820r32q177j003M512P788j0895
15905g187j473l572J1046J022o733r685k439M466K3615O884j2110K975l71J961
15891H399j0020n118N175M029m101n203J689N150O548q029n872l729J2672J0626
15877A2216N065m773K230m149j1089J5599J157j3977q024Q038r465P6J0637L820
15863G361M048P690k1955j3032L650N846K6102J921k2832j3174N503Q637M135
$$ plain form
15962 21221 15211 15722 17210 8714 15677 -2378 -5120 7339 12267 6406 9312 12048 4072 4442
15948 4442 -10434 -12690 6508 20343 6672 5603 6218 -827 -12568 -20300 -11075 -5154 -4016 -12721
15934 -12721 -12201 -1962 13261 8678 -190 6926 11240 11303 11987 8539 15493 19757 13846 12575 2702
15919 2702 1055 -7742 -8111 -18237 -17031 -3688 -2300 1520 588 -7589 -8592 -4080 3708 -7187
15905 -7187 -8660 -12232 -1186 -164 -6897 -16582 -19021 -14555 9060 15944 3834 6809 6438 8399
15891 8399 -1621 -6739 -1564 2465 -1636 -6839 -5150 0 6548 -1481 -7353 -11082 1590 12216
15877 12216 17281 12508 14738 10589 -500 15099 16256 2279 -5745 2293 -7172 -7096 3541 7361
15863 7361 11409 19099 -2856 -15888 -12238 -6392 19710 21631 -1201 -14375 -8872 -235 3900
15850C900j5529j2859J115N276M763L867O179J4896o276j1831L277k23K70J534
15836a641R491m809N606j671L005J516n943M653m548Q942j75R290m347k5350j2273
15821a8254P291j299k693L218j857m342M440J0130J3468J4606p462j5085j5203
15808a3042o045k161k283q851J435Q297J0382o422K1127J5235J5734j0120k7746
15795d460Q65N316J0991j0216j4233J6006P346L213K640n439O40k017q67j4136
15781d351J217n533o392K588r84J0421J8005l246j6814r26O843J565j4150J0487
15767a270N458p421m825R671K186k201m050N304L388n232j2419l953J45l950O677
15752a2492Q399k634J2574L157o173n617N757q560J345l948j2385K388P684J0377
$$ plain form
15850 3900 -11629 -24488 -23373 -18097 -13334 -9467 -3288 11608 5332 -6499 -3222 -3445 -3175 -1641
15836 -1641 7850 3041 8647 6976 9981 11497 5554 10207 5659 14601 14426 23716 19369 -5981 -18254
15821 -18254 -10963 -12262 -14955 -11737 -13594 -17936 -13496 -3366 10102 24708 17246 2161 -13042
15808 -13042 -19087 -21248 -23531 -32382 -30947 -22650 -12268 -18690 2437 17672 33406 23286 -4460
15795 -4460 -3595 1721 12712 2496 -11737 4269 11615 14828 17468 12029 12669 10652 9785 -4351
15781 -4351 -3134 -8667 -15059 -12471 -13455 -3034 14971 11725 -5089 -6015 828 2393 -11757 -1270
15767 -1270 4188 -3233 -8058 1613 3799 1598 -2452 2852 6240 1008 -11411 -15364 -15219 -19169 -12492
15752 -12492 -4093 -6727 5847 9004 2831 -2786 2971 -5589 -4244 -8192 -20577 -18189 -10505 -128
15738a28j01R014K868j0458j7185p46J0601O211L65K880J0572p663p451M698k772
15723G05m272k454K065L26J278O154J3306j146j3277n664M915N993o291o27O104
15708G115k087j0659n63N197O752K958j2688j5606j116J26L140M3L346O953l540
15693a0629l748J947n416K59J631R085P500k594N167l203m548L773q257L176O799
15678I42L688n694J4693k439j0865j1036m118M466q614m309R33P821J4114n83
15664a001q527n381o635L970M449K1211J1672q507q285K75L679q114j0084k5o672
15649a7975J8617K973n768M548L131P359K126r598m324L92m297L962J3814L695
15635A8655o927j9633n032O64k93J8631M826j0220p138j5076k191J2188Q750M049
$$ plain form
15738 -128 -229 8785 11653 1195 -15990 -16736 -6135 76 441 3321 13893 6230 -1221 3477 705
15723 705 -3567 -6021 -3956 -3630 -2352 3802 17108 15962 2685 -2979 1936 7929 1638 1011 7115
15708 7115 5028 -5631 -6194 -997 5755 8713 -3975 -19581 -20697 -20571 -17431 -17388 -14042 -7089 -10629
15693 -10629 -14377 -12430 -17846 -17587 -15956 -6871 629 -1965 3202 -1 -4549 -776 -9033 -5857 942
15678 942 4630 -1064 13629 11190 325 -10711 -14829 -10363 -18977 -23286 -22353 -14532 -418 -1001
15664 -1001 -9528 -14909 -21544 -17574 -13125 8086 19758 11251 2966 3241 6920 -1194 -11278 -11303 -17975
15649 -17975 642 3615 -2153 2395 5526 12885 15011 5413 1089 1481 -2816 1146 14960 18655
15635 18655 11728 -7905 -12937 -12273 -12566 6065 10891 671 -6467 -21543 -23734 -11546 -2796 1253
15621A253m740l341j1201L338R222p096l732J5411j295J587N096l16K799m091
15607B894k283p903j249Q212Q800q165p186k612O505J1035J955k3936p631M488
15593a7076q064n582J3359P545M523J2324R273j319p736k579Q366L571j4224L526
15579E907j1924j3470Q323R0J619k194j98l324J4182J690j0637m537Q315k015
15565h173o501q00K579J6013J2801p843j1988m014p158o255N227J3410q972j0144
15551b1818J315P430P788k483K872N627J1129n159r60j2275r668M290P045L912
15537i55N468O475j1174n833K312J4287m219k1933o758J7475P661j5912k1076
15524c4182Q701J3138l861m452N809K349L215J2345K577j1193j608l421J278J1768
$$ plain form
15621 1253 -3487 -6828 -18029 -14691 -5469 -12565 -16297 -886 -2181 -594 4502 4186 6985 2894
15607 2894 611 -7292 -8541 -329 8471 306 -6880 -9492 -2987 8048 10003 -13933 -21564 -17076
15593 -17076 -25140 -30722 -17363 -9818 -5295 7029 16302 14983 7247 4668 13034 16605 2381 5907
15579 5907 -6017 -19487 -11164 -11074 -9455 -11649 -11847 -15171 -989 701 -9936 -14473 -6158 -8173
15565 -8173 -14674 -15474 -12895 3118 15919 8076 -3912 -7926 -15084 -21339 -16112 -2702 -11674 -21818
15551 -21818 -20503 -13073 -5285 -7768 -4896 731 11860 6701 5741 -6534 -16202 -11912 -4867 -955
15537 -955 4513 10988 -186 -6019 -3707 10580 6361 -15572 -22330 -4855 2806 -13106 -34182
15524 -34182 -25481 -12343 -16204 -20656 -14847 -12498 -9283 3062 5639 -5554 -7162 -10583 -9305 2463
15510B463J985n80R868m12O859K804j689j861j7478j2776N000P740J064o672J972
15495a713l551j1690k309J1217K168l31m440r723k164m953o847O542P393L651
15481a6750j054J898P84R126J1129k528j0497K032J3994o600j3342j931j7655
15468c1394M621P723J0161k543J24P158K340j830k253m994p722O891K028k506
15454a2196r688n376k686K830J4210j491l947j3612k206J1705J1740O652j342
15441e407m636j348J1622k414n881o120l552l019n219P315Q276j293K531M272
15427d873j171P94k995p398j56N087J6300O90k402n33j4355p224n507O773K835
15412a4135j359j821O735N752N681J199Q281L732j4244l764L597L883O225J313
$$ plain form
15510 2463 4448 3868 13736 13324 20183 22987 21298 19437 1959 -10817 -5817 1923 2987 -3685 -1713
15495 -1713 -5264 -16954 -19263 -8046 -5878 -6209 -10649 -20372 -22536 -27489 -34336 -27794 -20401 -16750
15481 -16750 -17804 -15906 -15122 -5996 5133 2605 -7892 -5860 8134 1534 -11808 -13739 -31394
15468 -31394 -26773 -19050 -8889 -11432 -11308 -4150 -1810 -3640 -5893 -10887 -18609 -11718 -9690 -12196
15454 -12196 -21884 -27260 -29946 -27116 -12906 -14397 -18344 -31956 -34162 -22457 -10717 -4065 -5407
15441 -5407 -10043 -11391 231 -2183 -8064 -14184 -17736 -20755 -25974 -18659 -10383 -11676 -9145 -4873
15427 -4873 -6044 -5250 -8245 -15643 -15799 -10712 5588 6278 3876 3343 -11012 -18236 -23743 -16970 -14135
15412 -14135 -15494 -17315 -10580 -4828 853 2052 10333 14065 -179 -3943 -346 3537 9762 11075
15398A1075j2695p485q447j419j156O372n823l172J906j028k360P893J1559O368
15384A588m386j154j1401K975K530p209r763P883Q478M526M649j249P97p286l278
15369a2300J2317L038j1654L695L974n948O006j2375j1885K079r656J4426J279
15356a7004N02n29N759P008N442K36q127N837K179q607k784Q830K753k1235j6751
15341c6491j239l665R561R387J0110P116p743L533l75j7685j500J1652j773J0104
15327i008k495K58O877J2751K194j814l489M770j0496r857K073M001L943K0479
15313B0187O582O148N694j752p489j4775j0236k953j9319L601Q6O721l174l472
15299a4151J3720L366q243j0011M591K1563m255j0187k282j169Q777J8641o624
$$ plain form
15398 11075 -1620 -9105 -17552 -18971 -20127 -13755 -19578 -22750 -20844 -21872 -24232 -16339 -4780 1588
15384 1588 -2798 -3952 -15353 -12378 -9848 -17057 -26820 -18937 -10459 -5933 -1284 -2533 -1736 -9022 -12300
15369 -12300 17 3055 -8599 -4904 -930 -6878 -872 -13247 -25132 -23053 -32709 -18283 -17004
15356 -17004 -16502 -17031 -11272 -4264 1178 1414 -6713 -876 1303 -7304 -10088 -1258 1495 -19740 -36491
15341 -36491 -37730 -41395 -31834 -22447 -12337 -5221 -12964 -9431 -9806 -27491 -28991 -17339 -19112 -9008
15327 -9008 -11503 -11245 -4368 8383 10577 8763 5274 10044 -452 -10309 -8236 -4235 -292 20187
15313 20187 26769 32917 38611 36859 29370 14595 4359 1406 -17913 -14312 -14226 -7505 -10679 -14151
15299 -14151 -431 2935 -5308 -15319 -10728 10835 6580 -3607 -5889 -7058 1719 20360 13736
15286A3736j0299j2484o067N5j2115N795P239L724j954k339m535P020J9086j10
15272F752j1715K562K946n852K58m915J300o4j1557J3626Q058r898k545k671n348
15257a9063R427L325P026L239m613O763Q531k336m129j4041o300j521m017R878
15243g831o064J548o700l001Q345L232P644P243J686R379L568o513r875j0568
15229g907J1654n313j3889j0752L576J0444J9510o799j4910q795l494L56J2304
15216a4015Q761R096j284O384O00l625J518N025m829j2661n949J2315J0064l341
15202H059j1273j1281J9106Q483j1915j3118j1077o685m311Q123J7503o69j0636
15189a9691j3537J439N828k417p580K098m51q987J485K0070J2048J0270j70j4298
$$ plain form
15286 13736 3437 -9047 -15114 -15059 -27174 -21379 -14140 -10416 -12370 -14709 -19244 -12224 6862 6752
15272 6752 -4963 -2401 545 -5307 -5049 -9964 -8664 -8728 -20285 -6659 1399 -8499 -11044 -13715 -19063
15257 -19063 -9636 -6311 715 3954 -659 6104 14635 12299 8170 -5871 -12171 -13692 -17709 -7831
15243 -7831 -13895 -12347 -19047 -22048 -13703 -10471 -2827 4416 6102 15481 19049 12536 2661 -7907
15229 -7907 3747 -1566 -15455 -26207 -22631 -12187 7323 524 -14386 -23181 -26675 -26319 -14015
15216 -14015 -5254 3842 2558 8942 9542 5917 7435 12460 7631 -5030 -10979 1336 11400 8059
15202 8059 -3214 -14495 4611 13094 1179 -11939 -23016 -29701 -34012 -25889 -8386 -9055 -19691
15189 -19691 -33228 -31789 -25961 -28378 -35958 -33860 -34311 -43298 -41813 -21743 -9695 575 405 -13893
15175a3893n379J909k383Q468J6128n600P97R346Q330j5679j0300J0336q196q323
15161a4439j711j1699j801P235J3947O368j1928p152k25J862R642J2500m666l536
15147e603k069Q985M240J714J779K271j039j4190p69j101K883N953k056l443M540
15132B095k545l03O122n791j3048l009r894K863J02Q0J0266J655P1P186O116k1526
15116a9560j307M411K588k166J0151l460l911Q508R802J70o908L086r713q867
15102a7176L548j676M790l661p014J0444m814K145J1304m407K940j7763k137J2743
15088a0734N467Q70l400j1707j1118J2768m705P122N452o058O46N181l919n443
15074a9578O972J1356J8021O011m28q705L505r58j2841n038m98J0751n225J3336
$$ plain form
15175 -13893 -19272 -17363 -19746 -11278 4850 -750 47 9393 17723 2044 -8256 2080 -6116 -14439
15161 -14439 -16150 -27849 -29650 -22415 -8468 -2100 -14028 -21180 -21405 -19543 -9901 2599 -2067 -5603
15147 -5603 -7672 1313 5553 7267 9046 11317 10278 -3912 -4681 -5782 -2899 3054 998 -2445 2095
15132 2095 -450 -753 5369 -422 -13470 -16479 -26373 -23510 -23408 -23328 -13062 -11407 -11336 -4150 1966 -19560
15116 -19560 -20867 -16456 -13868 -16034 -5883 -9343 -13254 -4746 5056 5226 -1682 1404 -8309 -17176
15102 -17176 -13628 -15304 -10514 -14175 -21189 -10745 -15559 -13414 -2110 -6517 -3577 -21340 -23477 -10734
15088 -10734 -5267 -4397 -7797 -19504 -30622 -17854 -22559 -15437 -9985 -16043 -15397 -10216 -14135 -19578
15074 -19578 -12606 -1250 16771 22782 22354 13649 17154 16196 3355 -1683 -2181 8570 3345 16681
15060A6681N631l35q200r396O980q655j6706k604K68L704n883q668M545O120R81
15045a5537L79L196P963P896L309j4892k1150N095M183P766l844P059J106p422
15031a4893P047K806k328j4915k209K827j1715n38J6255J3552O432M517j5648
15018h810o797J3460q89p167j646m690j2199M22J707Q68j96J8640K396j1653P296
15003i258J7691L165p181k596J630p84J0566J6803q255q060j031j6994l820J1103
14989B979j0624j4737R538J1804p594o500J1074L618j864K287K670l725j1915
14976a2989R29J3495k894r382m330r629q59J402j33j208j216j204O178j842L126
14961b0556L522M15J400L894k876J6597J0774j4059J87M556P47j0406q513M762
$$ plain form
15060 16681 22312 21977 13777 4381 11361 2706 -14000 -16604 -16336 -12632 -18515 -27183 -22638 -16518 -15537
15045 -15537 -15158 -11962 -3999 3897 7206 -7686 -28836 -23741 -19558 -11792 -15636 -8577 -7471 -14893
15031 -14893 -7846 -5040 -7368 -22283 -24492 -21665 -33380 -33918 -17663 -4111 2321 6838 -8810
15018 -8810 -15607 -2147 -3036 -10203 -11849 -16539 -28738 -28316 -26609 -25741 -25937 -7297 -4901 -16554 -9258
15003 -9258 8433 11598 4417 1821 3451 2667 13233 30036 21781 13721 12690 -4304 -8124 2979
14989 2979 -7645 -22382 -12844 -1040 -8634 -15134 -4060 -442 -2306 -19 2651 -1074 -12989
14976 -12989 -12060 1435 -1459 -10841 -15171 -24800 -25659 -24257 -24390 -25598 -26814 -28018 -21840 -23682 -20556
14961 -20556 -17034 -16619 -15219 -11325 -14201 2396 13170 -889 -702 3854 4601 -5805 -14318 -9556
14947i556N715L215l688O841n118r641o075N783j747l886k405M961Q111n91p222
14932a5303j403j127M98L274Q738J7461j099P535l302j8303q435q303j430P603
14918a3596J3376P87j0500K829K411o195N90m42N598p093o100n524j4775O849
14904c1785k050j5153j1100K0442J0523P122j792q64P491L996L423O869K0p085
14890i943j2402J1092j1053Jk546M038K055J187m37k026k668K229J0496j2437
14876b2414j1271J5052J3037k419m384L408j0369J225J1941L855o087R707O863
14863H144n063r301J7222L268l0515k239R119j140o297K593K382j1858m509J3682
14849a4512J592j601J514P282J264j1046q807l454P217O9J973O23M973p246M651
$$ plain form
14947 -9556 -3841 -626 -4314 2527 -2591 -12232 -18307 -12524 -14271 -18157 -20562 -15601 -7490 -8081 -15303
14932 -15303 -16706 -17833 -17335 -14061 -5323 12138 11039 18574 15272 -3031 -11466 -19769 -21199 -13596
14918 -13596 -220 567 -9933 -7104 -4693 -10888 -10298 -10740 -5142 -12235 -18335 -23859 -38634 -31785
14904 -31785 -33835 -48988 -60088 -39646 -29123 -22001 -23793 -24657 -17166 -13170 -9747 -2878 -2858 -9943
14890 -9943 -22345 -11253 -22306 -22305 -24851 -20813 -18758 -17571 -18008 -20034 -22702 -20473 -9977 -22414
14876 -22414 -33685 -18633 -5596 -8015 -12399 -8991 -19360 -18135 -6194 -2339 -8426 1281 8144
14863 8144 3081 -6220 11002 14270 -16245 -18484 -9365 -10505 -16802 -14209 -11827 -23685 -28194 -14512
14849 -14512 -12920 -14521 -13007 -5725 -4461 -15507 -24314 -27768 -20551 -20482 -18509 -17886 -12913 -20159 -15508
14834a5508M230j010L253j96j3814j0272Q235L173j030M680j0925j2118K501J0715
14820b8086J1911N621j09l131j0976n930J4286N716J0984O066n831j8122r165
14807b6766Q974N356J4541R587j1645r836l069P145R271k654n969J233J408n948
14793h372j163N055O463o760j3145r792P221R856K093l605J5269N711o565q570
14779f304j1107k960j507L394P491n978m560J2602l621r144l32J362J143o73N191
14764a5003k23P080j820J96K4106n374j0709n218K26k928p598J5323J0680n102
14750C636j5591r246O371l02L241K687n32M253O292l259j0804r038r523p337R953
14735b9199O252K7910J9713n378q401r45j5969o915k590j2664N43K320m888O288
$$ plain form
14834 -15508 -11278 -12288 -9035 -9231 -23045 -33317 -25082 -21909 -22939 -18259 -29184 -41302 -38801 -28086
14820 -28086 -16175 -10554 -10663 -13794 -24770 -30700 -16414 -10698 286 6352 521 -17601 -26766
14807 -26766 -17792 -12436 2105 11692 47 -9789 -12858 -5713 3558 904 -5065 -3832 -2424 -8372
14793 -8372 -9535 -4480 1983 -4777 -17922 -27714 -20493 -10637 -8544 -12149 3120 8831 2266 -6304
14779 -6304 -17411 -20371 -21878 -18484 -10993 -16971 -21531 -8929 -12550 -21694 -22026 -20664 -19521 -20194 -15003
14764 -15003 -15226 -8146 -9966 -9770 14336 8962 -1747 -6965 -6739 -9667 -17265 -1942 8738 3636
14750 3636 -11955 -21201 -14830 -15132 -11891 -9204 -9736 -5483 809 -2450 -13254 -22292 -31815 -39152 -29199
14735 -29199 -22947 4963 24676 19298 10897 9952 -6017 -12932 -15522 -28186 -27643 -25323 -30211 -23923
14721b3923J4174k571k476qO156J9199J920l858p40j244m539j793m683l905Q17
14706g474N533j346q28n790o912J4964O910m139l169p171l063P311O13J892K342
14691c27k199j680K608k196k562L749N365p753j861j317j317L641K101j355J741
14676c362o382j0784q95l766j2440p24M531R222Q975j0762M00j944j4378q401
14662e0710q436Q726K0271J3542K096O134L00L021Q97k507j1782q241j114p86
14648b8589R54J1769m918r871n068M993R346K11N642j343j21K815m775k802k472
14633b4229q576J3763M05L733Q050m819L071M932j3559j295r71Q717p42L41o572
14618a7751O903Q786j387j345n044Q221J2057k508m593l792O767n957l108O600
$$ plain form
14721 -23923 -9749 -12320 -14796 -14804 -8648 10551 12471 8613 7873 6629 2090 297 -4386 -8291 -7474
14706 -7474 -1941 -3287 -4115 -9905 -16817 -1853 5057 918 -2251 -9422 -12485 -5174 -4561 -2669 -327
14691 -327 -2526 -4206 -1598 -3794 -6356 -2607 2758 -4995 -6856 -8173 -9490 -5849 -3748 -5103 -3362
14676 -3362 -9744 -20528 -21423 -25189 -37629 -38353 -33822 -24600 -15625 -26387 -25987 -27931 -42309 -50710
14662 -50710 -59146 -50420 -30149 -16607 -14511 -8377 -8077 -5056 -4159 -6666 -18448 -26689 -27803 -28589
14648 -28589 -27635 -15866 -20784 -30655 -35723 -30730 -21384 -21173 -15531 -16874 -16995 -14180 -18955 -21757 -24229
14633 -24229 -32805 -19042 -18637 -14904 -6854 -11673 -8602 -3670 -17229 -18524 -19495 -10778 -11520 -11179 -17751
14618 -17751 -10848 -2062 -3449 -4794 -9838 -1617 10440 7932 3339 -453 6314 357 -2751 3849
14604C849J937j630q248K219J884j6345k719Q381O695n207n753j6174p055J8194
14590a9972R478n15K340p03Q142M442n197j0159q993r914Q529O787L952J360q102
14575a8525n900K481n66M755N674r00n464j7883j3699J0281J1357k578J048j685
14561c1604J1767J1596L127n915l63q485j0460o496J743j261m740n695L353K653
14547d0780P363k473N105O7M64Q900j458R919Q270p889J3495K403q721J272p463
14532a1526o739L702l743M924P36p878n571N179P075K076r577j392k701K774p889
14517c0550J791O462n09K909L568m184K471k177q333l835o626J6586O918m552
14503b0061j653o679k141J1809J2852P102j5229j1263N630P391k491j2112K327
$$ plain form
14604 3849 5786 4156 -4092 -1873 11 -16334 -19053 -10672 -3977 -9184 -14937 -31111 -38166 -19972
14590 -19972 -10494 -11009 -8669 -9372 -1230 3212 -1985 -12144 -21137 -31051 -22522 -15735 -11783 -10423 -18525
14575 -18525 -24425 -21944 -22510 -17755 -12081 -12981 -18445 -36328 -50027 -39746 -28389 -30967 -29919 -31604
14561 -31604 -19837 -8241 -5114 -11029 -11392 -19877 -30337 -36833 -35090 -36351 -41091 -46786 -43433 -40780
14547 -40780 -33417 -35890 -30785 -30718 -30254 -21354 -22812 -12893 -4623 -12512 983 3386 -5335 -4063 -11526
14532 -11526 -18265 -14563 -18306 -13382 -12646 -20524 -26095 -20916 -13841 -11765 -21342 -22734 -25435 -22661 -30550
14517 -30550 -28759 -22297 -22806 -19897 -16329 -20513 -18042 -20219 -28552 -32387 -39013 -22427 -15509 -20061
14503 -20061 -21714 -28393 -30534 -18725 -5873 1229 -14000 -25263 -19633 -12242 -14733 -26845 -24518
14490b4518K025k199j810J1808J811r986L211M527p149j3979K077p07L566N137
14476b6186l993J0736J2694Q016j724l866r157j1337j0397j311J2940N101r373
14463b7857l188J1188P470K7r07o743K372O219J782O60m182J0178j291J860Q916
14448F504j654l949j3068P42K713O291p386j4275j341O796m812m882Q773O925
14434a2623j0609o348K128Q011L416K614n263J980o079R19o485j0889M47K0427
14420a8354j0170o873M350J2263O385P573L41r514j5608r145m55R899M379m888
14406b9817M588j77n140Q802k037l45L201j344l446p030p083J1872Q551K769N351
14391a1285L725j976L459q059L270m603l791Q619P635J552J280k82p276m307L360
$$ plain form
14490 -24518 -22493 -24692 -26502 -14694 -12883 -22869 -19658 -15131 -22280 -36259 -34182 -34889 -31323 -26186
14476 -26186 -30179 -19443 -6749 1267 -457 -4323 -13480 -24817 -35214 -36525 -23585 -18484 -27857
14463 -27857 -31045 -19857 -12387 -12360 -13267 -20010 -17638 -11419 -9637 -8977 -13159 -2981 -4272 -2412 6504
14448 6504 4850 901 -12167 -11425 -8712 -2421 -9807 -24082 -25423 -18627 -23439 -28321 -19548 -12623
14434 -12623 -23232 -29580 -27452 -19441 -16025 -13411 -18674 -16694 -22773 -21854 -28339 -39228 -38781 -18354
14420 -18354 -28524 -35397 -31047 -18784 -12399 -4826 -4485 -13999 -29607 -38752 -39207 -29308 -24929 -29817
14406 -29817 -25229 -25406 -30546 -21744 -23781 -24126 -20925 -22269 -25715 -32745 -39828 -27956 -19405 -16636 -11285
14391 -11285 -7560 -9536 -6077 -14136 -10866 -15469 -19260 -10641 -3006 -1454 -174 -456 -7732 -12039 -8679
14376h679M016j0362N03P477j951q224o864K676M099q445n723R433J4334J2680
14362D970n148o388J675J972o675p213K654L342j1616m328o288j93P866J7534
14348g836j1352n617J3990J1015l255J3786P445k966L442j69l822J324k878k603
14334A0504m469Q152k884R655N241Q455n709m677m832n373l933j5699k52O942
14320A121m572J0490J555J1256j255r623j3210j0651J470M867J4922J1386P70
14307A8526j2844q775J33J5891J925j4849m80M941K861j2968j2092n194j839J9645
14293e119R974L806J2017M511p260L468o04l580j4023o277L941j4406j2523L296
14279b2779L705J217J3224K627N681m585q184k297Q022j77J499k279k207n592
$$ plain form
14376 -8679 -4663 -15025 -14522 -7045 -8996 -17220 -24084 -21408 -17309 -25754 -31477 -22044 -7710 4970
14362 4970 -178 -6566 -4891 -2919 -9594 -16807 -14153 -10811 -22427 -26755 -33043 -33236 -25370 -7836
14348 -7836 -19188 -24805 -10815 200 -3055 10731 18176 15210 18652 18483 14661 15985 13107 10504
14334 10504 6035 14187 11303 20958 26199 34654 28945 24268 19436 14063 10130 -5569 -5821 1121
14320 1121 -3451 7039 8594 19850 18595 8972 -4238 -14889 -13419 -8552 6370 17756 18526
14307 18526 5682 -3093 -2960 12931 14856 7 -473 4468 7329 -5639 -17731 -22925 -24764 -5119
14293 -5119 4855 8661 20678 25189 17929 21397 20793 17213 3190 -3087 854 -13552 -26075 -22779
14279 -22779 -19074 -17857 -4633 -2006 3675 -910 -9094 -11391 -3369 -3546 -2047 -4326 -6533 -12125
14265a2125N587N422K136J0782Q794o875n080O20Q534j570N602K206j7029k467
14251D537P793j932m557M479p314m682K969J0094m935P138N178p950J877K848
14237A5543j224M903j0530J348J658Q09j750P767J8133q551k874P662k521L914
14223C4287p234j2588K163J1647m914p061k046o561n214q281q058M633J4871J0757
14209A6401j1019m720J0065N869j824r513j7897j6918l353J229Q172P299j2003
14196b8212j0980J5570K573K862J5343l9j917J1766n106o083J099j44J9706Q057
14182B4495K692O978j374P71j0890J0644m174j3509j1862J1581K4156J1554r954
14169D1108L691Q504J3559K1176L6046J4710L575Q643K3372L3269O5900R4095
$$ plain form
14265 -12125 -6538 -1116 1020 11802 20596 13721 8641 9261 17795 16225 21827 24033 7004 4537
14251 4537 12330 10398 5841 10320 3006 -1676 1293 11387 6452 13590 18768 10818 12695 15543
14237 15543 14319 19222 8692 10040 11698 12507 10757 18524 36657 28106 25232 32894 30373 34287
14223 34287 27053 14465 16628 28275 23361 16300 14254 7693 2479 -5802 -13860 -9227 5644 16401
14209 16401 5382 662 10727 16596 14772 5259 -12638 -29556 -32909 -31680 -23508 -16209 -28212
14196 -28212 -39192 -23622 -21049 -18187 -2844 -2883 -4800 6966 1860 -4223 -3124 -3268 16438 24495
14182 24495 27187 34165 32791 33562 22672 33316 29142 15633 3771 15352 39508 51062 41108
14169 41108 44799 53303 66862 88038 124084 138794 142369 151012 174384 207653 273553 367648
14157C67648J36687K09097K60508L19570L46501L07507K16299O4827p8989k07944
14147A941711k82075l14555k78111k26155j74279j13128p4236l6606k7056l0679
14137C84831k2909j3903l0380k4849k4371j6833j0146j6734m185j7428l3760j3300
14125A56033n125q313l0888j1372J0346L539J0905O81O188R125p02o881k6411
14112A07125l028o004k1112j0009J545l9J2688K958j3221O289q559j6444R77R435
14098F2601M450O50K202J955o066k740n031m522r114p744p315J0042l699j7359
14084A8310k1885j838J0026J021k104p74o796m857M925J1940K596j0303n04J0692
14070A0449J8619P68K385j662j4468j6983J332Q529R108J1402k082N8J151J2177
$$ plain form
14157 367648 504335 713432 973940 1293510 1640011 1947518 2163817 2228644 2149655 1941711
14147 1941711 1659636 1345081 1066970 840815 666536 553408 479172 442566 415510 384831
14137 384831 361922 348019 317639 292790 268419 251586 241440 224706 220521 203093 169333 156033
14125 156033 150908 142595 111707 100335 110681 114220 125125 125806 131994 141119 140417 133536 107125
14112 107125 104097 98093 76981 66972 68517 68478 81166 84124 70903 77192 68633 52189 53166 62601
14098 62601 67051 67701 69903 71858 65792 63052 58021 53499 44385 36641 29326 39368 35669 18310
14084 18310 -3575 -5413 4613 5634 3530 2756 -4040 -8897 -3972 7968 10564 261 -243 10449
14070 10449 29068 29836 32221 30559 16091 -892 440 8969 18077 29479 27397 27455 28606 40783
14056D0783N106K993J1517p289j6210p16j8128j1917n734M066l709j1457J1751
14043A056P008m864m852O02L652j871m69O566m651p025m067J1750j1678N690r906
14028a3059N019J1071K797n157j7998j2435J3981K943M438J7490J3485J7802L195
14015D3572n369j1098k363j7315O997P559j32l878M067j787K388J1553J381r084
14001B6491J608Q792k219k0053q145l342M039N528%M47J5091O359p25k331J271
13986C2811P735j748j649l073O897K4289J911j3810q713j2751Q899j19p427r707
13972B3545r616k190j5078j2499L238P45p5q883r85q147o774r947j2864r443r312
13957g8285m442k938j1565L537P289K6223J8686J7009J0600K798J7818J7103j441
$$ plain form
14056 40783 45889 48882 60399 53110 36900 36184 18056 6139 405 4471 762 -10695 1056
14043 1056 8064 3200 -1652 -1050 2602 731 262 6828 2177 -4848 -8915 2835 -8843 -3153 -13059
14028 -13059 -8040 3031 5828 671 -17327 -29762 -15781 -12838 -8400 9090 22575 40377 43572
14015 43572 38203 27105 24742 7427 14424 21983 21851 17973 22040 20253 22641 34194 35575 26491
14001 26491 28099 36891 34672 14619 6474 3132 7171 12699 12699 13146 28237 34596 33871 31540 32811
13986 32811 40546 38798 37149 34076 40973 65262 67173 53363 44650 31899 40798 40679 33252 23545
13972 23545 13929 11739 -3339 -15838 -12600 -11855 -11930 -20813 -21798 -29945 -36719 -46666 -59530 -68973 -78285
13957 -78285 -82727 -85665 -97230 -93693 -86404 -60181 -41495 -24486 -13886 -11088 6730 23833 22392
13944B2392m433m109j4622j8712k0848p838l390N295K4960J6203Q746L587J4741
13931B1972J8669J7725L1418L5935K9004K4908L6542M1309R008j7435j8521l5114
13919A95420k7280k5544j9015k7483k4911j0284k9810j1296J977J905m957m822
13907A3900q366j34k517j5165j2873j2323N183n636L148R750l157n425k0017k22
13893e3854J8699J0130N802q693M294n760K467n437q986L849m241k80k1661j3145
13879g6816o866r6J3227p67O570J0304R909R064k72k97m059j25N565M481J565
13864b8613Q862J3936J2036J4451K0251L79p597m71K973J0761J5254J0945J6123
13851H9290K2071J4954m842m339j489k4128j9515j2267k2087j3982k744k1145
$$ plain form
13944 22392 17959 13850 -772 -19484 -40332 -48170 -51560 -46265 -21305 -5102 3644 7231 21972
13931 21972 40641 58366 89784 125719 154723 179631 216173 257482 266490 249055 230534 195420
13919 195420 168140 142596 123581 96098 71187 60903 31093 19797 21774 23679 18722 13900
13907 13900 5534 5400 2883 -12282 -25155 -37478 -32295 -37931 -34783 -25033 -28190 -33615 -53632 -53854
13893 -53854 -35155 -25025 -19223 -27916 -23622 -29382 -26915 -32352 -41338 -37489 -41730 -42010 -63671 -76816
13879 -76816 -83682 -83778 -70551 -71318 -64748 -54444 -44535 -35471 -35743 -36040 -40099 -40224 -34659 -30178 -28613
13864 -28613 -19751 -5815 6221 20672 40923 41302 33705 33234 36207 46968 62222 73167 89290
13851 89290 111361 126315 121473 117134 115645 91517 72002 59735 37648 23666 20922 -223
13839b23r521l081l776J1656J2633K3029K4921L6531K8655K8427K7812J1976J101
13826A90140L013J9020L4127M3493O0966R3118J08320J13915J35649J13418J02146
13815A017325R1933N5004K8761k1226p6263j00889r6078j03269q3204o7643m2869
13804F01582j6057J2147N261J5116J2393J185k5504m1194m3817o8116q1256n9663
13792C12077o4450l3777L077J805J5214K3886K0467J0359M054P827R227J0926
13780C20692M402m847K6472L9747N2483N6561N1944M4549M5630M2524L3357q317
13768G05197k2746l3844n1353m6741m5391l6863k7450n458R960K1143K5299K1313
13756E13066L1439J8178N511K166j4666k5212m424O511N942o410k313K829j037
$$ plain form
13839 -223 -9744 -12825 -16601 -4945 7688 30717 55638 92169 120824 149251 177063 189039 190140
13826 190140 193153 212173 246300 289793 350759 443877 552197 666112 801761 915179 1017325
13815 1017325 1109258 1164262 1193023 1171797 1095534 994645 898567 795298 712094 644451 601582
13804 601582 585525 597672 602933 618049 630442 631627 606123 564929 521112 452996 371740 312077
13792 312077 247627 213850 216927 218732 233946 257832 278299 288658 292712 300539 309766 320692
13780 320692 325094 320247 346719 386466 438949 495510 547454 592003 637633 680157 713514 705197
13768 705197 682451 648607 597254 550513 505122 468259 440809 435351 445311 466454 491753 513066
13756 513066 544505 562683 568194 570360 555694 530482 526058 532569 538511 532101 529788 532617 531580
13743E31580K3613L7249L1989L5309K5658K4522J1969J6126N513n244j3918j43
13731G24223Q685K18M356J6212Q535J0166K0322J2602J1154K7772L0920L5720
13719I10885M3874P9322R8246J01385R9153J11733J28729J16274Q2903Q9683R6402
13708A958589R5076P5705P3680Q6422R0717J10692J60768J94588K14449K42515
13698C303201K49744K51022K79528L61381M80900O68700Q96407J162190J423590
13689I076663J605243J670317J638653J578407J577406J744283K178100K925383
13681B3994455M129442O006418Q968590J3744930K1068878L1609236M4802269
13674A54324218N7866153O5938471O4570534N1602361K8063140r39209k9311273
$$ plain form
13743 531580 555193 592442 624431 659740 685398 709920 721889 738015 743528 738284 724366 724223
13731 724223 732908 733126 737482 753694 762229 772395 792717 805319 816473 844245 875165 910885
13719 910885 954759 1034081 1132327 1233712 1332865 1444598 1573327 1689601 1772504 1862187 1958589
13708 1958589 2053665 2129370 2203050 2289472 2380189 2490881 2651649 2846237 3060686 3303201
13698 3303201 3552945 3803967 4083495 4444876 4925776 5594476 6490883 7653073 9076663
13689 9076663 10681906 12352223 13990876 15569283 17146689 18890972 21069072 23994455
13681 23994455 28123897 34130315 43098905 56843835 77912713 109521949 154324218
13674 154324218 212190371 278128842 342699376 394301737 422364877 421425668 392114395
13667C92114395m9712730n9430871n7822503m8394833l6151068k4723632j6523998
13660I9354760j1364902q161375o146769m832504l954255l357969k979557k782995
13652E5774434k725007k728650k736008k679587k525546k308535k067449j840555
13644C6163097j661808j486568j331961j193512j091281r96739q81727q30772
13636B6688729q03541p77933p71969q00403p94926p73436p34305o62567n99148
13627A9970501n37190m72550m64411m65426m76433m71594m76824m85520m88383
13618A5632170m85253m60672m53506m24171m07404l91616l79548l45164l38461
13609A1946375l45390l21851l14462l20082l06425k89631k67800k45809k31247
$$ plain form
13667 392114395 342401665 282970794 225148291 176753458 140602390 115878758 99354760
13660 99354760 87989858 79828483 73681714 68849210 64894955 61536986 58557429 55774434
13652 55774434 53049427 50320777 47584769 44905182 42379636 40071101 38003652 36163097
13644 36163097 34501289 33014721 31682760 30489248 29397967 28401228 27519501 26688729
13636 26688729 25885188 25107255 24335286 23534883 22739957 21966521 21232216 20569649 19970501
13627 19970501 19433311 18960761 18496350 18030924 17554491 17082897 16606073 16120553 15632170
13618 15632170 15146917 14686245 14232739 13808568 13401164 13009548 12630000 12284836 11946375
13609 11946375 11600985 11279134 10964672 10644590 10338165 10048534 9780734 9534925 9303678
13600I303678k13698j97341j71099j59320j46630j34658j36052j33073j40635
13591G871172j44129j60631j69288j69860j80463j86311j78847j78927j67937
13582F334779j68575j64883j71869j56803j41857j33493j05245j00851j03873
13573E087330j03017r2363q4725j01266j13553j34329j34641j38235j35157j32709
13563C917335j13650p9648o7520p7474q2073q1413p3032o0856p3591p9959n6179
13552C071940m6576m7691m5797m3288l1301l5243k8492k3520n2233m2480m8445
13541B626874o6449o9263o5997q8348j04362q0967p2598p5214p4786p0479p4445
13530A783966p6336o0287o2905o1560o8412p5380p6519o2795o7989n0920n0445
$$ plain form
13600 9303678 9089980 8892639 8721540 8562220 8415590 8280932 8144880 8011807 7871172
13591 7871172 7727043 7566412 7397124 7227264 7046801 6860490 6681643 6502716 6334779
13582 6334779 6166204 6001321 5829452 5672649 5530792 5397299 5292054 5191203 5087330
13573 5087330 4984313 4891950 4807225 4705959 4592406 4458077 4323436 4185201 4050044 3917335
13563 3917335 3803685 3724037 3656517 3579043 3496970 3415557 3342525 3281669 3208078 3128119 3071940
13552 3071940 3025364 2977673 2931876 2888588 2857287 2822044 2793552 2770032 2717799 2675319 2626874
13541 2626874 2560425 2491162 2425165 2336817 2232455 2151488 2078890 2003676 1928890 1858411 1783966
13530 1783966 1707630 1647343 1584438 1522878 1454466 1379086 1302567 1239772 1171783 1120863 1070418
13519A070418l7856l9230l0694k7535l3940l2705k6317k3362m2549k7529n919
13508G42782o79J0551M94p945p820k6599p378P913q100k8548l2290j2799j4729
13495F14853m0802l7450k8273j7511j6395j6528j8362M821J8204J2221J6179q665
13483D82292k641j5233r750j420J5395J6870J3718M468M911r468J533o761k791
13470D91123j151M375J0087J6198N876n705k4314l348Q876J4861J8358k254j1370
13457E21612L380R065j3383j9105q345j9557q775j7236j0033N304O792P430j4312
13444D42837m93N261l170k793N720j0543P26p515J691P934K430k3668l0916p443
13430C80058m10p581n615j4217j5497m872J446j3327J4380J1878k534J2605R830
$$ plain form
13519 1070418 1032562 993332 962638 935103 901163 868458 842141 818779 776230 748701 742782
13508 742782 742103 752654 753148 745203 737383 710784 703406 711319 703219 674671 642381 629582 614853
13495 614853 574051 536601 508328 490817 474422 457894 439532 444353 462557 474778 490957 482292
13483 482292 479651 464418 454668 453248 468643 485513 499231 503699 508610 499142 500675 493914 491123
13470 491123 489972 494347 504434 520632 526508 520803 496489 493141 502017 516878 535236 532982 521612
13457 521612 524992 534057 520674 501569 493224 473667 464892 447656 437623 442927 449719 457149 442837
13444 442837 442344 447605 444435 441642 447362 436819 437545 430030 431721 439655 442085 418417 387501 380058
13430 380058 379648 372067 366452 352235 336738 331866 333312 319985 334365 346243 343709 356314 366144
13417C66144N488j805l918L885l250j0125L044N735R191J870P08L345m581j3014
13403C62717m454n335p499n033j2210J422J1105N224n943L276J6266Q051L254
13390C70841l170k6921k083M867j4533j3998o840j734k2270j0797j4440j2114
13378B46808j5198j8197o183K39j3430q748m62J3584J1376O505n40N348l428q411
13364B09263j5513j6956j9422k2559j8568L139M737J987j944J770j6246r251O096
13351A06533m177k1408M571J5836j86P02J5782J5547J1524p099j2076L918o531
13338A22936P621P465j1827k5443o618J541N300m438j2142o263J8577J0102Q551
13325A15362j492N822J0857j6195r581j306o915o715J3200l71Q661J2371M033
$$ plain form
13417 366144 371632 369827 365909 369794 366544 356419 359463 365198 374389 376259 376967 380312 375731 362717
13403 362717 358263 352928 345429 340396 328186 329608 340713 345937 339994 343270 359536 367587 370841
13390 370841 367671 340750 338667 343534 329001 315003 308163 306429 284159 273362 258922 246808
13378 246808 231610 213413 207230 207469 194039 185291 184829 198413 209789 216294 215754 221102 217674 209263
13364 209263 193750 176794 157372 134813 116245 119384 124121 126108 124164 125934 109688 100437 106533
13351 106533 102356 80948 85519 101355 101169 101871 117653 133200 144724 137625 125549 129467 122936
13338 122936 130557 138022 126195 100752 94134 95675 100975 96537 84395 78132 96709 106811 115362
13325 115362 113870 119692 130549 114354 104773 103467 96552 89837 103037 102666 111327 123698 127731
13312A27731L197Q630n4j4740j6438J019M301J900m121m826J7919J3010L593o926
13298A34195P731M583j4181l760k6448k0039j20p389K2192o603o777N657P444
13285I6485m935M313m458J2034O777m242j2763K5k443P996R762N736J89M233P983
13270A26692P035K41r304r57L910p463k101p903J56M146N432N77j3431P893M381
13255A19304r389m959j0498k093R050J452l573n0o752j5725R58O188L500J7445
13241A04858J0835N80p776J802N359j292q230j1886o458J3743O073j0213o325
13228I1070J393M013Q092Q806L49K431R913j8745j2676k901j538J151K326m556
13214H9128m341J6797K0398l666j7340r448P239o911K688J4129J2714l472j766
$$ plain form
13312 127731 130928 139558 139504 124764 108326 109345 113646 115546 111425 106599 124518 137528 141121 134195
13298 134195 141926 146509 132328 128568 102120 82081 81961 74572 96764 90161 83384 89041 96485
13285 96485 91550 95863 91405 103439 110216 105974 93211 93236 90793 98789 108551 114287 114476 118709 126692
13270 126692 133727 133968 124664 123707 127617 120154 118053 110150 110306 114452 119884 120461 107030 114923 119304
13255 119304 109915 104956 94458 92365 101415 102867 99294 99244 92492 76767 77725 83913 87413 104858
13241 104858 115693 116273 108497 110299 115658 114366 106136 94250 87792 101535 107608 97395 91070
13228 91070 92463 96476 104568 113374 113723 116154 126067 107322 94646 91745 90207 91358 93684 89128
13214 89128 84787 101584 121982 118316 100976 91528 98767 91856 94544 108673 121387 117915 116149
13201A16149J6080l97N330J0103J1655J8712K4288K3919L2615M6592N2625Q6201
13189D43872J24566J86052K45807L17315L54211L38281K44870J06791n2559j88373
13179B120833k78093l12274k74701k32363j72035j13499r3379o0150l9791l2933
13169E11615l0132k5459k1745k9472j7465k4082j5258j3357j2869j1581k2196
13158B87999j5145J1428n903j2088r423O507j1630j886M298Q391N681l474O561
13145B71316J0108J3323J7123J6032J2833J2897M959M528k674j6579j0584j2145
13133C21137j6032j7644j5080j4315j6772k988j2659j32j1672p044p725j0772
13121A88302j4228j8608k1228J039K947n404j1052k716J0376R33o810J7798J6973
$$ plain form
13201 116149 132229 131832 137162 147265 158920 177632 201920 225839 258454 305046 357671 443872
13189 443872 568438 754490 1000297 1317612 1671823 2010104 2254974 2361765 2309206 2120833
13179 2120833 1842740 1530466 1255765 1023402 851367 737868 644489 584339 544548 511615
13169 511615 481483 456024 434279 404807 387342 363260 348002 334645 321776 310195 287999
13158 287999 272854 284282 278379 266291 256868 263375 251745 249859 254157 262548 268229 264755 271316
13145 271316 281424 294747 311870 327902 340735 353632 358591 363119 360445 343866 333282 321137
13133 321137 305105 287461 272381 258066 241294 238306 225647 225515 213843 206799 199074 188302
13121 188302 174074 155466 134238 135277 138224 132820 121768 119052 129428 130361 123551 141349 158322
13108A58322K268j9387p624p723k395K097k013j228j0100n174j759j2950j1581
13095H0753k157J2264K78Q205L345Q805o391p100j4667O665K186m528o929J3921
13081I4650l909k3970j0603O130O377j5669l854J699J753K2221J1692j482N755
13068I0790K762j777L799r315J210k070j7784p699k981j283J2082J1107p042j2191
13054E9608n279J1022o407j3114l723J4177l00j5764l395Q569R222O606j734K636
13040F2124j4269p567q377o615l55P221N076J3245K033j0366j166Q46k0662R647
13026C0815J0350l387R065K85k031m962j2239k192j485R531J5438J0860K30K138
13012F2416o274j3932m973j962J014J4941J6419j7133o185j6740O801O735o066
$$ plain form
13108 158322 160590 141203 133579 125856 123461 125558 123545 122317 112217 107043 105284 92334 80753
13095 80753 78596 90860 91138 99343 102688 111493 105102 98002 83335 90000 92186 87658 80729 94650
13081 94650 90741 66771 56168 62298 68675 53006 49152 50851 52604 74825 86517 85035 90790
13068 90790 93552 91775 95574 86259 87469 85399 67615 59916 56935 55652 67734 78841 71799 59608
13054 59608 54329 65351 58944 45830 42107 56284 55984 40220 36825 45394 54616 61222 59488 62124
13040 62124 47855 40288 31911 25296 24941 32162 37238 50483 52516 42150 40984 41830 21168 30815
13026 30815 41165 37778 46843 47128 45097 40135 27896 25704 24219 33750 49188 60048 60278 62416
13012 62416 56142 42210 37237 35275 36289 51230 67649 50516 44331 27591 34392 41127 35061
12999C5061L795Q266k364r816L791P56o82j1283p316N707J8554J5229l395j0909
12985D5394r551l818j1485J3270j972J273k920L623J5344J4136J1672p121n053
12972F2792J2041N832p812m915k854j7969j1515p205L864J1238K67m35J2437N270
12958F1036p919p87J1259j593N572q5R621l085o001o397Q155R509J7755J9017
12944A16057J1425m343m788P499J3938K5547K3892L0682M1442M9267P9006R0488
12932D80112R5012Q4614Q6068Q4298P1415M3058K4713j062l9047n0729o9544p7793
12920G31115p1086o5025n2756o5270m1515l5302l3901j8091j1091j1986j5891
12909C09201O257J2128J4565J2023Q79R285j984M865J0276J2827L824r600j3873
$$ plain form
12999 35061 38856 47122 44758 34942 38733 39489 38807 27524 20208 25915 44469 59698 56303 45394
12985 45394 35843 32025 20540 33810 31838 33111 30191 33814 49158 63294 74966 67845 62792
12972 62792 74833 80665 72853 67938 65084 47115 35600 28395 32259 43497 43764 43329 55766 61036
12958 61036 53117 52330 63589 61996 67568 67483 77104 74019 68018 61621 69776 79285 97040 116057
12944 116057 127482 123139 118351 125850 139788 165335 189227 219909 261351 310618 389624 480112
12932 480112 575124 659738 745806 830104 901519 944577 969290 968228 929181 878452 808908 731115
12920 731115 660029 595004 542248 476978 435463 400161 366260 348169 337078 325092 309201
12909 309201 315458 327586 342151 354174 355053 364338 362354 367219 377495 390322 394146 384546 370673
12896C70673K085k45k2516j2481j905M60r205j7291k5194l1431k0991o270k2943
12883B02746j7413m767M193J7361M40k0810j0754J167P960J1168P766P496o318
12870B00235j0935N789q728J990l43O662K1517J3865J4759M2571M9143O0286N5523
12857D52334P5715R2566J02629J17793J06259Q3575Q4391O4066L3398j210k1118
12846A190398m6474o2315q8176r4227j01300r9097r9404p8916n3916m0208m0172
12835C86193l1514j3560j1649k4825k1034j8759j4653o437o398n951m117K974
12823B30270j6888l968K629j1445j1138j8448j5740o733k159P237n729Q59O876
12810A55623J1797j2191k4012p083P473j481k311J78o424j0575j1936K600N469
$$ plain form
12896 370673 372758 372513 349997 337516 335611 336071 326866 309575 284381 252950 231959 225689 202746
12883 202746 185333 180566 184759 202120 202560 181750 170996 172163 180123 191291 199057 206553 200235
12870 200235 189300 195089 186361 188351 188008 194670 216187 230052 244811 287382 336525 396811 452334
12857 452334 528049 620615 723244 841037 947296 1030871 1115262 1179328 1212726 1211516 1190398
12846 1190398 1143924 1081609 993433 899206 797906 698809 599405 520489 466573 426365 386193
12835 386193 354679 341119 329470 304645 283611 264852 250199 243762 237364 231413 227296 230270
12823 230270 213382 209414 212043 200598 189460 171012 155272 148539 146380 153617 147888 148747 155623
12810 155623 167420 155229 131217 124134 131607 130126 127815 127993 121569 110994 99058 101658 107127
12797A07127j458q779o88k90p107j5081j0039M837M892m870M587J414q85k990
12783G0670R060L567M27n881m378o672p680N56j0758k184P415Q303O542r76m851
12768F3160m111q806j0872m40J0934O255J289N478p110j3283N567O187m512j0841
12754C8895p556M153l2K47J0481m650R423m167j1016P560N298p546N90n428N353
12739D1605n19j957J3588j472p128j2731R242J029j801n248m520O348L938o256
12725C4118q899J4112J3042o14k531k402p315q840Q685j0673k128R286o24M137
12711C9354n996m968K849J2659l176L145l71j6170J89Q143o09M547l65j0713j494
12696B7024p366M159Q259l58N247J0264o810o281q615J100O367K89j078j0966
$$ plain form
12797 107127 105669 96890 96202 95912 88805 73724 63685 68522 73414 68544 73131 74545 73660 70670
12783 70670 79730 83297 83724 77843 73465 66793 59113 59669 48911 46727 54142 62445 68987 68011 63160
12768 63160 59049 50243 39371 38931 49865 56120 57409 62887 55777 42494 48061 54248 49736 38895
12754 38895 31339 35492 35460 35707 46188 41538 50961 46794 35778 43338 48636 41090 41680 36252 41605
12739 41605 41086 39129 52717 51245 44117 31386 40628 41657 39856 34608 30088 36436 40374 34118
12725 34118 25219 39331 52373 51759 49228 46826 39511 30671 39356 28683 26555 35841 35217 39354
12711 39354 33358 28390 31239 43898 40722 43867 43496 27326 27515 35658 35049 39596 39231 28518 27024
12696 27024 19658 23817 32076 31718 36965 47229 40419 34138 25523 26623 32990 33279 32201 21235
12682B1235o708L575N070n522k652j270J2759p031K774K999q489k34k370K657
12668A6793J1796R895j268j3638L385K719R95N530l714L466J577o480Q319J1765
12654E1140R22M300q016j0771R32j217K13m398N646j025j434L761m801J3471j5041
12639C3682j4102O751q7L36p707j1292j362j4465k370Q695M699j276R520K1832
12625C2854r285j4351J301j2134j2473q309Q855L113JK66k001Q175J1613P25j0640
12610b290j09P155k348j535J5760j495P696J2184P41n225j5560R384N818k971
12596B7205N350N228J745k6566r270M401N124R262j590l123m676q48k441M306
12582A4107P687P579K911o774o259q940N94R194J0449J5075J0079j0465j5576
$$ plain form
12682 21235 14527 18102 23172 17650 14998 13728 26487 19456 22230 25229 16740 16506 14136 16793
12668 16793 28589 38484 37216 23578 26963 29682 30677 36207 32493 35959 37536 31056 39375 51140
12654 51140 52062 56362 48346 37575 38507 37290 37503 33105 38751 37726 36292 40053 35252 48723 33682
12639 33682 19580 26331 26244 26580 18873 7581 6219 -8246 -10616 -1921 2778 1502 11022 32854
12625 32854 23569 9218 10519 -1615 -14088 -22397 -13542 -10429 -10428 -10162 -12163 -3988 7625 8350 -2290
12610 -2290 -2399 4756 2408 873 16633 15138 22834 35018 35759 30534 14974 24358 30176 27205
12596 27205 32555 37783 39528 12962 3692 8093 13217 22479 20889 17766 13090 12242 9801 14107
12582 14107 21794 29373 32284 25510 19251 10311 10905 20099 30548 45623 55702 45237 29661
12569B9661j2077j3302Q220J3354r744m569R834M559r141p609N121R06l417J453
12555A3249N652J1488n638n430k926P14K262n461m639L632o54Q718J1115M727
12541C6809j1761j8119P869J4210J2513O09m466P840Q566j2123P92O575j9502
12528B9812q001l59p794m857o93N523l399J464R892O173p204K963p301m151K0535
12513C2603m901q857O171P463m92j1700N004k242j417l778j2379O159P554N127
12499B4315P393M913o459j0852P25M270l36m315l14K839M63L144R110M563k393
12484C7066l730j7421J547K259P834m338r956N880P557K26N538m420L217m803
12470B6456M453r095j0856J4390J5967l42j7533l714l447L9n037o782O735N804
$$ plain form
12569 29661 17584 4282 12502 25856 16112 11543 21377 25936 16795 9186 14307 15213 11796 13249
12555 13249 18901 30389 24751 19321 16395 17109 19371 13910 9271 12903 12249 20967 32082 36809
12541 36809 25048 6929 14798 29008 41521 42130 37664 45504 54070 41947 42739 49314 29812
12528 29812 21811 21452 13658 8801 8108 13631 10232 11696 21588 27761 20557 23520 16219 12068 32603
12513 32603 27702 18845 25016 32479 31987 20287 25291 23049 21632 17854 5475 11634 19188 24315
12499 24315 31708 36621 30162 19310 20035 24305 23969 19654 19340 22179 22642 25786 34896 39459 37066
12484 37066 33336 15915 17462 19721 27555 23217 13261 19141 26698 26924 32462 28042 31259 26456
12470 26456 30909 21814 10958 25348 41315 40973 23440 19726 16279 16318 11281 4499 11234 17038
12456A7038L435j0473l317R094P038o72q518k35n727p132M919K663p27j2410M652
12441c72K2238K1675J2690j0454j4780n247p650J945k557j909j1368q281l739
12428g809M557K374r887J593j078Q271J0802k280j685L920N989j230M850k764
12414A5623L046J4477J091K206m022l662R41j1834j191k947j5544K122J3274P309
12400B0889j26j0157Q890P779j0924O568J1040M342j6737k700P044L301l104L681
12386B9786o32m839m965m794j0608q512Q637R872L796q7k548J0233k761q288L025
12371A7315M172r42J712K029j0140M259J048j4322K730N248n548J9665O139j0616
12357B2749m931M789l081P553J9520n271r659j8094j0568J7149L780L423N659
$$ plain form
12456 17038 20473 10000 6683 15777 22815 22143 13625 13390 7663 531 5450 8113 7386 -5024 -372
12441 -372 21866 43541 56231 45777 30997 25750 18100 20045 17488 15579 4211 -4070 -7809
12428 -7809 -3252 -878 -10765 -9172 -10250 -1979 8823 6543 4858 8778 14767 13537 18387 15623
12414 15623 18669 33146 34237 36443 32421 28759 29700 17866 16675 13728 -1816 306 13580 20889
12400 20889 20763 10606 19496 27275 16351 22919 33959 38301 21564 18864 25908 29209 26105 29786
12386 29786 29154 24315 19350 14556 3948 -4564 4073 13945 17741 17654 15106 25339 22578 14290 17315
12371 17315 21487 20545 22257 24286 14146 18405 19453 5131 7861 13109 7561 27226 33365 22749
12357 22749 17818 22607 19526 27079 46599 41328 31669 13575 3007 20156 23936 27359 33018
12344C3018M812K264j0144P82j6129r302r426l566J1096L917M15O534J2061j2782
12330A3550j517p617j3226J0948J1054O838L178k890l065r308m261J3312N909
12317B2905q428L439J179l828M912m280J152N172M901l391j5078p333J072O230
12303H624J1261l360q682P429R041j1946R541r012Q55P833R415j2130l203R55
12289A6621j641k538o346k693J4144n100k894R275N609N236l099r873J1028Q240
12275C5969o697r453o898k016j3068q95J2869L384j3573r322J3668J3293j722
12262A5539o527K097r471J1685J4700J232q187j3744l438K676p955q481O559L864
12248E49J1816j1012J892L733O641l258p612R651P045J1516J3723Q61n653j3535
$$ plain form
12344 33018 37830 40094 29950 30732 14603 5301 -4125 -7691 3405 7322 7737 14271 26332 13550
12330 13550 12033 4416 -8810 2138 13192 20030 23208 20318 17253 7945 3684 16996 22905
12317 22905 14477 17916 19095 15267 20179 15899 17051 22223 27124 23733 8655 1322 2394 8624
12303 8624 19885 16525 7843 15272 24313 12367 21908 12896 13751 21584 30999 18869 15666 16621
12289 16621 14980 12442 6096 3403 17547 12447 9553 18828 24437 29673 26574 16701 27729 35969
12275 35969 29272 19819 12921 10905 -2163 -3058 9811 13195 -378 -9700 3968 17261 15539
12262 15539 9012 11109 1638 13323 28023 29255 21068 7324 3886 6562 -1393 -9874 -3315 549
12248 549 12365 1353 3245 6978 13619 10361 2749 12400 19445 30961 44684 45545 39892 26357
12234B6357j2630j1424O79J1628R384O95n419m765L515k50Q274m919j4024o987
12220A14J185Q287K0534l33k1185j4452J0026R96J5476K101k0039p977J2820N531
12206A3084M321j898l727K706j982M073J0280J0418R673J2460L7872K663k952
12193I6991n452m1462k1412n290j6276K800J346O770R968p96p3j0885j942r95
12179A3292k034N431J0969L525L442n733j0991K899r92M666q854O92M561j3289
12165G584m457Q760L53q811q26J4400J7794J4582K379R007P011J1544j2711O048
12151G2657J8500Q286m795j5560j1215q514p444j1393j6606j0719j799K422j8627
12138d807J01J7633J0684m191O904J2003N784j2200j2242K895J325l881j0057
$$ plain form
12234 26357 13727 2303 2982 14610 23994 24689 19270 14505 18020 17770 26044 21125 7101 114
12220 114 1299 9586 30120 29787 8602 -5850 4176 5172 20648 22749 2710 -5267 7553 13084
12206 13084 17405 15507 11780 14486 12504 16577 26857 37275 46948 59408 97280 99943 96991
12193 96991 91539 50077 28665 23375 7099 9899 11245 18015 27983 27187 27114 16229 14287 13292
12179 13292 11258 16689 27658 31183 34625 28892 17901 20800 19808 24474 15620 16312 20873 7584
12165 7584 3127 11887 12240 3429 2603 17003 34797 49379 51758 60765 67776 79320 66609 72657
12151 72657 91157 99443 94648 79088 67873 59359 51915 40522 23916 13197 11398 13820 -4807
12138 -4807 -4706 12927 23611 19420 26324 38327 44111 31911 19669 22564 23889 20008 9951
12125I951J446j430m593j1327J608N721k177m627L479L050J1478K775n060K03
12111A0497k232O337O294J7188K95q294o143p696N393J482j2413j0012J4950J1952
12097B7598o968N960r153r89l607r207J641J2429j459J488N769q43l687n260j059
12082A2653o100k3758m535J0456J778L720J0306j316j548r289N654O850l065j5171
12068a3365l274q944m935P107J6588R043j0973O400J3293K403k10p738M338O002
12054A5735r523M029O956P359L009n352k6514o095k448Q609P084k541l841k494
12040f027J0533O829J962q371j3260l236M831R044m47J1439k64j2311r308M453
12026d133J1547L248L941o892l135N056J9751k990j2908j5584n743J0978J4326
$$ plain form
12125 9951 11397 9967 5374 -5953 -4345 1376 -801 -5428 -1949 1101 12579 15354 10294 10497
12111 10497 8265 14602 20896 38084 38379 30085 23942 16246 21639 23121 10708 696 15646 27598
12097 27598 20630 26590 17437 16448 12841 3634 5275 17704 16245 17733 23502 22659 18972 13712 12653
12082 12653 6553 -17205 -21740 -11284 -9506 -5786 4520 3204 1656 -7633 -1979 4871 1806 -13365
12068 -13365 -16639 -25583 -30518 -23411 -6823 2220 -8753 -2353 10940 13343 13133 5395 9733 15735
12054 15735 6212 10241 17197 24556 27565 22213 -4301 -10396 -12844 -4235 2849 308 -3533 -6027
12040 -6027 4506 11335 13297 4926 -8334 -11570 -6739 2305 1858 13297 13033 722 -8586 -4133
12026 -4133 7414 10662 14603 7711 4576 9632 29383 26393 13485 -2099 -7842 3136 17462
12013A7462Q279k958k524q567n863M764K781N131P486j0492j0021n409L343P704
11999A1116l957Q547J3868j0616k685m863j0657j2841n610J0280J0322Q87o956
11986c165k654Q613O760k498n689r252m379l05O579j235m018l68O383J0691n07
11971D956L156J0128P912j3189j883o560L965m783j1932J6374P161j7959N867
11958C213L576j565O563J0898j3342j2698O014N186p815o890N422L29r900K775
11944h234J0817m726k4383P774K9806P411j2199Q572P539J0434k371j4639K869
11931A8670O251m19p430n343J3416L252j1382j2128j3105J6714k491k970k999
11918C6J0859K525o325k605M586N810J650K614j0323L417Q464j772N416O415l443
$$ plain form
12013 17462 25741 22783 20259 11692 5829 10593 13374 18505 25991 15499 5478 69 3412 11116
11999 11116 7159 15706 29574 18958 16273 11410 753 -12088 -17698 -7418 2904 3791 -3165
11986 -3165 -5819 2794 9554 7056 1367 -7885 -12264 -12569 -5990 -7225 -11243 -11611 -5228 5463 4956
11971 4956 8112 18240 26152 12963 11080 4520 8485 3702 -8230 8144 15305 -2654 3213
11958 3213 6789 5224 11787 22685 9343 -3355 2659 7845 30 -6860 -1438 -1109 -11009 -8234
11944 -8234 2583 -2143 -26526 -18752 11054 18465 6266 14838 22377 32811 30440 15801 18670
11931 18670 24921 24502 17072 11729 25145 28397 17015 4887 -8218 8496 6005 3035 36
11918 36 10895 13420 7095 4490 9076 14886 16536 19150 8827 12244 20708 18936 24352 30767 27324
11903B7324p06J526p872l553M030M047j0103j0747p653k688M13K304J4867K167
11889A3356m70Q082J3590l308o905j0347q189J845L588o154n191k785N49K829
11875D90j0354j214J2952O816R252l453j1342m786m383j1712P460L388J1929j876
11861C167o259O780l092o310J7950K642j6818n000L478l249J3462O274p789O365
11847A1601q352j671L230Q840M823Q74q394m081P082j967k167l192N878J4821
11833B7325m497l782j6222M239N642j2947M343j5785o48M306N00J238P321J5151
11819A6184P018o420p358k172o292J7386J734j4381p990j7522M830J2988L074
11806A079O176M016j1166N112j773r754J024Q787L247n661J094k734p667j647
$$ plain form
11903 27324 26618 28144 20272 16719 20749 24796 14693 3946 -3707 -6395 -5982 -3678 11189 13356
11889 13356 12886 20968 34558 31250 24345 13998 5809 7654 11242 5088 -103 -2888 -2339 490
11875 490 -9864 -11078 1874 8690 17942 14489 3147 -1639 -6022 -17734 -10274 -6886 5043 3167
11861 3167 -3092 3688 596 -5714 12236 14878 -1940 -6940 -3462 -6711 6751 13025 5236 11601
11847 11601 3249 1578 4808 13648 18471 19345 10951 6870 13952 11985 9818 6626 12504 27325
11833 27325 22828 19046 2824 7063 12705 -242 4101 -11684 -12332 -8026 -7526 -6288 1033 16184
11819 16184 23202 16782 9424 7252 960 18346 20080 5699 -2291 -19813 -14983 -1995 1079
11806 1079 7255 11271 105 5217 3444 -6310 -5286 3501 6748 1087 2181 -553 -8220 -9867
11792i867J5833N782l465n295p890j1183K253J7026o506k552m384l666K082R90
11778a0842j0731J1381J2111l713K847K217Q27O52O819k320q825q946o80N958
11764c245J495j2920j0928M761P951p14P543P610Q057Q310J505l297n314j607
11750I207m906P912m697k5470q792J3694J7736J6756L553j9609j2973J5612N377
11737A3400q495O54J6682r806K315Q676o246j2959k1698o400k023N857J6931J0209
11723G097K0782L568j4095j3868P491P914J390J120k748N414L396n291r651l876
11709H643m382k508R067J622N64m315L137R595k920K381J461q16K259o055r569
11694H164l213J383L364K778r684n629J261O527o799k36q541j1463l895J0583
$$ plain form
11792 -9867 5966 11748 8283 2988 -4902 -16085 -13832 3194 -3312 -5864 -10248 -13914 -11832 -10842
11778 -10842 -21573 -10192 1919 -1794 1053 3270 4097 4749 11568 9248 423 -8523 -9203 -3245
11764 -3245 -1750 -14670 -25598 -20837 -12886 -13600 -6057 1553 9610 17920 19425 16128 10814 9207
11750 9207 4301 12213 7516 -17954 -26746 -13052 4684 21440 24993 5384 -7589 8023 13400
11737 13400 4905 5559 22241 12435 14750 23426 17180 4221 -17477 -23877 -25900 -20043 -3112 7097
11723 7097 27879 31447 17352 3484 10975 18889 20279 21399 18651 24065 27461 22170 12519 8643
11709 8643 4261 1753 10820 12442 13006 8691 11828 21423 18503 20884 22345 21529 23788 17733 8164
11694 8164 4951 6334 9698 12476 2792 -2837 -1576 4951 -1848 -2084 -10625 -22088 -25983 -15400
11680a5400K617J224n42Q133J3054P216j142k401j162J611l879M425r10k5119
11666a2275j1940J4715R797J523k650j4740L710J0412o467n108J3748R202r448
11653D79L922p734L444J3877J5578o892j3796J510r341O337K471l231j3916o015
11639a3307J7504L972q741q312m329k117R703K0942j2583j378N762j9411M272
11626h023N451N5N26O648j3027m94M673J0715J0198o091l400n561p302M340P477
11611F185j1908q562o136J4358J2212j6124j658K314J0426J625l565j0463P178
11598d118Q307R0J002k189l366N853l74q153J61j3252j5218M383J5510K462k359
11583a1261P642J0479k033r886L238J0364n089l098J0818J904N05j906p029k823
$$ plain form
11680 -15400 -12783 -11559 -12101 -3968 9086 16302 15160 12759 11597 13208 9329 13754 12844 -12275
11666 -12275 -24215 -9500 297 1820 -830 -15570 -11860 -1448 -7915 -13023 725 9927 479
11653 479 4401 -3333 111 13988 29566 22674 8878 10388 1047 7384 9855 6624 -7292 -13307
11639 -13307 4197 8169 -572 -8884 -13213 -15330 -5627 15315 2732 1354 7116 -12295 -8023
11626 -8023 -2572 -2517 -1991 4657 -8370 -8864 -4191 6524 16722 10631 7231 1670 -5632 -1292 6185
11611 6185 -5723 -14285 -20421 -6063 6149 -9975 -11633 -9319 1107 2732 -833 -11296 -4118
11598 -4118 4189 4279 5281 3092 -274 5579 5205 -2948 -2787 -16039 -31257 -26874 -11364 -8902 -11261
11583 -11261 -3619 6860 4827 -5059 -1821 8543 3454 356 11174 13078 13583 11677 4648 1825
11569A825M926J3406p517r139M31J542O674o84p456N148j590P562J364p493M365
11554A3364R538M853Q882j1787j1067o188j236Q751p199l322r344R96K96j373
11540d836j7173P455M671k034J0147N589r976J920r33j7394p867N381J9063N902
11526h5n596L142l53J5776O111m295j818K212q531r758n537o721J3561n5l851
11511e798j480N326N387q141j1673L969J920O5n397j658L811J3528R242q765l078
11496b742j1107j5345l472J0606J3811J3014k757l355L590J767N147L532j8323
11483e634j1514Q558J2522J645K56P349L962o119q394l630O80P888N810k789r377
11468A213p391k14O399R693N888n552p224M425p018o401O89M177J25r883j2442
$$ plain form
11569 1825 6751 20157 12640 3501 3932 5474 12148 11464 4008 9156 7566 15128 16492 8999 13364
11554 13364 22902 27755 36637 24850 13783 7595 6359 15110 7911 4589 -4755 -3759 -3463 -4836
11540 -4836 -22009 -14554 -9883 -11917 -1770 3819 -6157 -4237 -5170 -22564 -30431 -25050 -5987 -85
11526 -85 -5681 -2539 -2892 12884 18995 14700 12882 15094 6563 -3195 -8732 -15453 -1892 -1947 -5798
11511 -5798 -7278 -1952 3435 -4706 -16379 -12410 -10490 -10425 -15822 -17480 -13669 -141 9101 336 -2742
11496 -2742 -13849 -29194 -32666 -22060 -8249 4765 2008 -1347 2243 4010 9157 12689 -5634
11483 -5634 -17148 -8590 3932 5577 5833 13182 17144 11025 2631 -999 -319 7569 13379 10590 1213
11468 1213 -6178 -6392 7 9700 15588 10036 2812 7237 219 -6182 -5493 -1316 -1191 -11074 -23516
11453b3516Q723J3270J2001m018j1170J235M381j0680n737J340R692J5330k64
11440A0587j2375N752m49L677Q348m022j6135j2840J0638Q312N206J2981Q457
11427B8137j2259j6946R001O021m605m551K870n476p833o615j949J1981q31Q761
11413E706J5694k149q250o419j979j7529q115O383l579k935J8819O709j465k248
11399a357R586M955p40o372r107p73Q920m699j4004J2311N23j0213q814R921J7603
11384G740R568l235j3562K473L957N665q20Q45J155P413j2848p418k46J1718J3013
11369B5418j996L119p875j7626J739k718N832L771k430j2355L900J0183p080r755
11355g873J218J1709M881q256J149o818O111j394o70m746R160J4301J2703j1037
$$ plain form
11453 -23516 -14793 -1523 10478 6460 -4710 -3475 906 -9774 -15511 -14171 -4479 10851 10587
11440 10587 -1788 3964 3515 7192 15540 11518 -4617 -17457 -6819 1493 6699 19680 28137
11427 28137 15878 -1068 7933 13954 9349 4798 7668 2192 -5641 -12256 -14205 -2224 -3055 5706
11413 5706 21400 19251 11001 4582 2603 -14926 -23041 -16658 -20237 -23172 -4353 2356 891 -1357
11399 -1357 8229 13184 12444 6072 -3035 -3808 5112 413 -13591 -1280 -757 -10970 -19784 -9863 7740
11384 7740 17308 14073 511 2984 6941 12606 11786 12631 13786 21199 8351 933 687 12405 25418
11369 25418 23422 26541 18666 1040 2779 61 5893 9664 7234 -5121 -1221 8962 1882 -7873
11355 -7873 -6655 5054 9935 1679 2828 -3990 2121 727 57 -4689 4471 18772 31475 20438
11341B0438j6297k111p390m15Q323J3304J883O494M942m373L148N290k411p869
11327B2956J4697J0609K713J8473J3954J0825J7210K4055M1587J9614o087j5305
11315A75301j4638l0324l0468k1099q649j402r370k951J0114M097j5168o531J617
11302E0529q636R46J3202Q307j5471q884J428o56P474N378N111l567k0247K415
11288C7329N300J513k122l165P4Q950J6661M642O749J9916K7717M0902L8279L0309
11274B33054M3698M4962K8833K2035M406k2405l3211l4026n3665m0887k5588j5743
11262A51463j4008k1938q728k944q146j4675j6360K128J677N734O856q384j0351
11249F2324m341N298J307l161p686n097O69q866j1376J218J4046O465J9192P877
$$ plain form
11341 20438 4141 2030 -5360 -5775 2548 15852 17735 24229 29171 24798 27946 33236 30825 22956
11327 22956 37653 48262 50975 69448 83402 94227 111437 135492 177079 196693 190606 175301
11315 175301 160663 130339 99871 78772 70123 68721 59351 56400 66514 70611 55443 48912 50529
11302 50529 41893 42839 56041 64348 48877 39993 41421 40765 48239 53617 58728 55161 34914 37329
11288 37329 42629 44142 42020 38855 38929 47879 64540 69182 75931 95847 123564 164466 202745 233054
11274 233054 276752 321714 350547 372582 376988 354583 321372 287346 233681 192794 167206 151463
11262 151463 137455 115517 106789 103845 95699 81024 64664 66792 68469 74203 81059 72675 62324
11249 62324 57983 63281 64588 61427 53741 48644 49313 40447 29071 30289 44335 50800 69992 77869
11235G7869J2715J2447L855m37J2860M201R751K5437J8187K7066J6281J172l884
11222B17520J521n468k0269k8365k8588j3017j079j2660j3914q282O40n225o769
11209G6045m423j0008p791J585R872n546j1200Q73J1177J5938O532k2585j9128
11196D1341k737O333j852q778k449K373M299p88j915r283n473J433O722o762m934
11181A7530o050O174R245M70J747j043L51r27J461j161N39j077M278n127o130
11166B0280j411j544m16L469K38k787N092J5004j4311j4315J1200Q194k203k340
11152B4150l817k257J5251J7547O017j3191j0350o008j7638k171J0221l322j696
11139A2736J50n420k504m160j216n054J2673J6735L273J9591R875k009k5639k7447
$$ plain form
11235 77869 90584 103031 106886 106449 119309 123510 133261 158698 176885 203951 220232 221404 217520
11222 217520 219041 213573 193304 164939 136351 123334 122255 109595 95681 87399 88039 82814 76045
11209 76045 71622 61614 53823 55408 65280 59734 48534 49407 60584 76522 83054 60469 41341
11196 41341 38604 44937 43085 34307 31858 34231 38530 37742 35827 26544 21071 22504 29226 22464 17530
11181 17530 11480 17654 26899 27369 29116 28073 28424 27497 28958 27797 28336 27259 31537 26410 20280
11166 20280 18869 17325 16909 20378 20616 17829 22921 37925 23614 9299 20499 28693 26490 24150
11152 24150 20333 18076 33327 50874 56891 43700 33350 27342 9704 7533 17754 14432 12736
11139 12736 12886 7466 4962 802 -414 -5468 7205 23940 27213 46804 56679 54670 29031 1584
11125A584j0301j5753k779J5247J3434J518j0887K990L314J268P472l675N97J810
11111E839j456k927r967R579J2309N196o132j16q423O018L194P570n931q080P933
11096A4606n153k564L666J627j8444M485R100L527n39q227j3922j2963j182K113
11082b3870L127k459o433o279J4325J5374j760M957J6174M252n181p243J759j1877
11068e134q386Q13n798M553K431K1838j965m056Q517p41J33O24r634J1501N312
11053B0008o477r221l78J0832N743m275J549l747j647J449k161k180K229k161
11039I563j996O862J356r680j8126k574L869M230J1801l46L101L850l188l126
11025E596J8838n539q230N72q07k403L739o538n841R202P786N58J395q592k523
$$ plain form
11125 1584 -8717 -24470 -27249 -12002 1432 2950 -7937 -4947 -1633 -365 7107 3432 4029 5839
11111 5839 4383 1456 -8511 1068 13377 18573 12441 12325 3902 9920 13114 20684 14753 6673 14606
11096 14606 9453 6889 10555 12182 -6262 -1777 7323 10850 10311 2084 -11838 -24801 -25983 -23870
11082 -23870 -20743 -23202 -29635 -35914 -21589 -6215 -7975 -3018 13156 17408 12227 4984 6743 -5134
11068 -5134 -13520 -12707 -18505 -13952 -11521 10317 8352 4296 12813 12072 12205 12829 3195 14696 20008
11053 20008 13531 4310 3932 14764 20507 16232 17781 14034 12387 13836 11675 9495 11724 9563
11039 9563 7567 14429 15785 6105 -12021 -14595 -10726 -6496 5305 4959 8060 11910 8722 5596
11025 5596 24434 18895 10665 11237 10430 8027 11766 5228 -613 8589 16375 16933 18328 9736 7213
11010G213j512m458M822N882n079n246l420N795J7499K834m108n022q928j0402
10996d130L677M062o780K926P133M880P05k27k587o892l279k497P449P743n234
10981F949m714j036Q588j2494k686K951L389r413j3312J30J4559J4456K177l43
10967I201P440l513p885J102p253j5798j1645n07K208M673J9197j599J1614r24
10953F311n644O384n55j903R37j409Jr078j932J474M127R322M609m019l922O942
10937A1645R461j3388M74M901n374n381j096J4339o53j086J2552n313j6921j0009
10923e849j0978J1604J2130M322p46p437j6406n916k678K404N148J441J2145L624
10909B808K71o366J399K890Q979J5055K325o436m945m725J455M03k017l021l070
$$ plain form
11010 7213 5701 1243 6065 11947 6868 1622 -1798 3997 21496 24330 20222 15200 6272 -4130
10996 -4130 -453 3609 -3171 -245 6888 11768 12473 12246 9659 2767 -512 -3009 4440 12183 6949
10981 6949 2235 1199 9787 -2707 -5393 -2442 947 -8466 -21778 -21648 -7089 7367 9544 9201
10967 9201 16641 13128 5243 6345 -908 -16706 -28351 -28858 -26650 -21977 -2780 -4379 7235 6311
10953 6311 667 7051 6496 4593 5530 4121 4122 -4956 -6888 -5414 -1287 8035 12644 8625 4703 11645
10937 11645 21106 7718 8192 13093 7719 2338 1242 15581 14928 13842 26394 21081 4160 -5849
10923 -5849 -16827 -5223 6907 11229 10483 3046 -13360 -19276 -21954 -19550 -14402 -12961 -816 2808
10909 2808 3079 -3287 -1888 1002 9981 25036 27361 20925 15980 11255 12710 13113 11096 8075 5005
10894E005R767o928r44J5591R518K430j1795K220J4317k686j2908q540o006M186
10880A3227J8068M44k054j0905p518K310O503p56r92K210j3388n732R315R147
10866A9879J5345Q526n759j2751l748k685k635L047l900Q631M731N066O262P814
10852D7823R71P988q677J699R296q191r009N017N82k279q414M247k524j893R853
10837D6489n284p702L6L751j3939m161J1941K737O906J4135R014l479m733L937
10823E9648M877j1740N72J4628j1340r63K194n830p688J73n843k681K3122N826
10809F4955k955M678J2096k744j2658k730K199j2159l912P850l036j0885J3457
10796E4156K5629J0732R833K388m445j0324K312J3917O056m423j018L682p146
$$ plain form
10894 5005 14772 7844 6900 22491 32009 34439 22644 24864 39181 36495 23587 15047 9041 13227
10880 13227 31295 31739 29685 18780 11262 13572 20075 19319 18327 20537 7149 1417 10732 19879
10866 19879 35224 43750 37991 25240 21492 18807 16172 19219 15319 23950 28681 33747 40009 47823
10852 47823 48794 56782 48105 49804 59100 50909 41900 46917 47499 45220 36806 41053 38529 36636 46489
10837 46489 41205 33503 33539 37290 23351 19190 31131 33868 40774 54909 63923 60444 55711 59648
10823 59648 64525 52785 53357 67985 56645 55682 57876 52046 44358 44531 38688 36007 59129 64955
10809 64955 62000 66678 78774 76030 63372 60642 62841 50682 46770 54620 51584 40699 54156
10796 54156 79785 90517 100350 102738 98293 87969 90281 104198 110254 105831 104813 108495 101349
10783A01349N673m333j5967j6437k019m83o414P346J8210J0864j368j769J113
10770I5765j0437q854O910p477p667J836k835K401M328j1533m643N958p418j0792
10756D5542p697Q461R425P77R069L868q796N12j1568l214N075n563j674J883M945
10741E1045q172n864K723J6345M039J544n71q62r89n981j1756j1960M377J5368
10727D9286M942J492l269l262P790L342q969q39N738R744l700Q189o37q426l483
10712E7938M861J518m277j2755j4706p395J350o197P765P922m229j6965j2100
10699B730P901R751J1458Q782o611q281N428m007r677p458L708j102l61M868j3137
10684C992l974N893m147N401M064Q242l112J476R597o74j2433k147j1287q776
$$ plain form
10783 101349 107022 102689 86722 70285 68266 67783 61369 68715 86925 97789 96421 94652 95765
10770 95765 85328 76474 83384 75907 68240 70076 67241 69642 73970 62437 57794 63752 56334 45542
10756 45542 37845 46306 55731 56508 65577 69445 60649 61161 49593 46379 51454 45891 44217 46100 51045
10741 51045 42873 37009 39732 56077 60116 61660 61089 60227 59238 53257 41501 29541 33918 49286
10727 49286 54228 55720 52451 49189 56979 60321 51352 50513 56251 65995 62295 70484 69847 61421 57938
10712 57938 62799 64317 60040 47285 32579 25184 26534 20337 28102 36024 31795 14830 2730
10699 2730 10631 20382 31840 40622 34011 25730 31158 27151 17474 10016 13724 12622 12261 17129 3992
10684 3992 18 5911 1764 7165 11229 19471 16359 17835 27432 26758 14325 12178 891 -7885
10670g885L479L534j857P413J0884p603j3605K041J248N755P899M482M378R632
10656B9795o238p652q506J923J5462j915o704n917Q749j71O36N476k83N666l984
10641B6337n040J962j757P597J300J505m849q583K42R87k160o348m478Q25k439
10626E101j790P741P005Q58L085M845j257n216j0611L518k34j321p681r343J702
10611c598P631O882N080K131O775j671l427q760j2437P266J727k39l016Q728K963
10596A6035k018p262l783N015N358n645m782l154j0040l357N82M788K4769J6545
10582C3051j7629j7604L46l729r253l772O66P201J3683Q708k557m741j022o286
10568b938j069R949J0270N403q816j5353j1932J4496J3143k647q111l759N171
$$ plain form
10670 -7885 -4406 -872 -2729 4684 15568 7965 -5640 -3599 -2351 3404 11303 15785 20163 29795
10656 29795 23557 15905 7399 9322 24784 22869 16165 10248 18997 18826 19462 24938 24655 30321 26337
10641 26337 21297 23259 21502 29099 30399 31904 27055 18472 18714 19701 17541 11193 6715 7540 5101
10626 5101 3311 11052 18057 18915 22000 26845 25588 20372 9761 13279 13045 11724 4043 -5300 -3598
10611 -3598 4033 10915 15995 18126 24901 23230 19803 11043 -1394 5872 7599 7360 4344 13072 16035
10596 16035 14017 6755 2972 7987 13345 7700 2918 -236 -10276 -13633 -13051 -8263 16506 33051
10582 33051 15422 -2182 -1836 -5565 -14818 -18590 -17924 -10723 2960 11668 9111 4370 3348 -2938
10568 -2938 -4007 5942 16212 21615 12799 -2554 -14486 10 13153 10506 2395 -1364 3807
10555C807J0822M614J0412P89j0813j7992o873M915k39P330L107l486L133O982
10541A6508l317r583k793Q582J3351n56j828Q37K870q428p786p568m143j0247
10527a4101M683K5060J4525j3341j3729K401N573r39j0843O824q28K422l507j7668
10513a3468J0160J0266J1064n390j3151l3J5301Q700j3000q992Q24j256L641K489
10499G155l584r517m076N425J2400p271q229o200q666o716J0887K5105Q924j0437
10485E200L943R58q084L716l623N072n565m106M242M96J7864P015L455j0041q337
10470A2205L275J4541L88j971l982r398m679k376P907k119q842k919M863P494
10456A4387m644l695j586j0129R902J0289O909P690o573p129k765j276R618N223
$$ plain form
10555 3807 14629 19243 29655 30444 19631 1639 -5234 -319 -558 6772 9879 6393 9526 16508
10541 16508 13191 3608 815 9397 22748 22192 20364 21201 24071 15643 7857 289 -3854 -14101
10527 -14101 -9418 15642 30167 16826 3097 5498 11071 10132 -711 6113 5285 7707 4200 -13468
10513 -13468 -3308 6958 18022 12632 -519 -552 14749 23449 10449 1457 2281 1025 4666 7155
10499 7155 3571 -5946 -10022 -4597 7803 532 -7697 -13897 -22563 -29279 -18392 6713 15637 5200
10485 5200 9143 10101 2017 5733 2110 7182 1617 -2489 1753 2249 20113 27128 30583 20542 12205
10470 12205 15480 30021 30409 28438 24456 15058 10379 8003 15910 13791 4949 2030 6893 14387
10456 14387 9743 6048 4462 -5667 4235 14524 21433 29123 22550 15421 12656 11380 20998 26221
10442B6221M000K296O051o135j215O357p834O322O117m124k638M879O161j508
10428D4950O223J0215N574k757j1796q653P46J4459K1400N035J0161K085k768
10415I4874N338J3342K4549L8679L3832L2159K2512L1371L4429K6716K6395L2331
10403D16527O6567J01831J34316K27342L65286M96575O43415P56352P93615Q29518
10393D831344P95824O81570M70429K06627l2179k14735m29244o36525p17437p11272
10383D244402o23457n52982m87069l91452k96531j90733j17879q7317p1665n0837
10373A374480m3796n9633n4785m2096m5914n0139l2647j9460j4984o938o617j2956
10361I84515j4780m534p293p833J596o561j8384m0555m7451l2819j7210j0910
$$ plain form
10442 26221 30221 32517 38568 32433 31218 37575 29741 36063 42180 38056 35418 40297 46458 44950
10428 44950 51173 61388 66962 64205 52409 43756 44502 58961 80361 85396 95557 97642 94874
10415 94874 100212 113554 138103 176782 210614 242773 265285 296656 331085 357801 384196 416527
10403 416527 483094 584925 719241 946583 1311869 1808444 2451859 3208211 4001826 4831344
10393 4831344 5627168 6308738 6779167 6985794 6953615 6738880 6309636 5673111 4955674 4244402
10383 4244402 3620945 3067963 2580894 2189442 1892911 1702178 1584299 1496982 1425317 1374480
10373 1374480 1330684 1271051 1216266 1174170 1128256 1078117 1045470 1026010 1011026 1004088 997471 984515
10361 984515 969735 965201 957908 950075 951671 945110 926726 886171 838720 805901 788691 777781
10349G77781j7190M97j6611j8368J891o968L469J7681M53K556r610k194P044J6661
10335G57092L8816L9140K9726M4189Q4580J25982J57625J94869K31028K63114
10325A966161K54102K21259J53982L6536o9320j48530k19661k60138k39209k02315
10315A492867j85228j50532j12380p6010q3025n5805o0628n4386k1752k3231k4807
10304F45083n138q283k0060j5800j4485o649K899k363q620m242j5739n456M07
10291E41554o450q893k472N918J3828L296j4272j3439j6634j7103k467m576j8742
10278D59548j5036j1488j4090k922q85j8909r357j553j5985j791j0252l0673j3811
10265C12796k6196j3105O627q40J0252K0917K946M590j98k4159j2363j3859O78
$$ plain form
10349 777781 760591 761088 744477 726109 728000 721032 724501 742182 742635 745191 735581 733387 740431 757092
10335 757092 795908 835048 864774 908963 993543 1119525 1277150 1472019 1703047 1966161
10325 1966161 2220263 2441522 2595504 2632040 2562720 2414190 2194529 1934391 1695182 1492867
10315 1492867 1307639 1157107 1044727 968717 885692 829887 769259 714873 693121 669890 645083
10304 645083 639945 631662 611602 595802 581317 574668 577567 575204 566584 562342 546603 541147 541554
10291 541554 535104 526211 523739 529657 543485 546781 532509 519070 502436 485333 482866 478290 459548
10278 459548 444512 433024 418934 416012 415127 396218 386861 385308 369323 367532 357280 326607 312796
10265 312796 286600 273495 280122 279282 289534 310451 313397 317987 317789 293630 281267 267408 268086
10252B68086J2565J6313J3352J6511K8966J5025l640q701j5547j6408j9199k9784
10240B77539j9584j1549k224j0367r022O124Q252K4657L4841K0074J3500P907
10228C40148J0801J1531J2485K4473J0433n413j1512j3868j9671q788P397P310
10216C65326J5498K6598L1238O6753J18859J41955J91104K35567K53307K59190
10206A705395K19078J51154O4905n7405j39444j60486j15006n7973J1895P3722
10196A695835R9303P0172L7559k330n3142j00163j25012j47651j58796j68450
10186A147325j62725j20367r0438p2115n0414l5677l2062k6340k4296j4802r789
10175E08300m1275l4514k2919j0166r739k0074k0612j3063n911k0601j4038o946
$$ plain form
10252 268086 280651 296964 310316 326827 355793 370818 367178 358477 342930 326522 307323 277539
10240 277539 257955 246406 244182 233815 224793 230917 239169 263826 298667 318741 332241 340148
10228 340148 350949 362480 374965 399438 409871 404458 392946 379078 359407 350619 358016 365326
10216 365326 380824 407422 438660 505413 624272 766227 957331 1192898 1446205 1705395
10206 1705395 1924473 2075627 2140532 2083127 1943683 1783197 1668191 1610218 1622113 1695835
10196 1695835 1795138 1865310 1902869 1900539 1847397 1747234 1622222 1474571 1315775 1147325
10186 1147325 984600 864233 773795 701680 651266 615589 583527 557187 532891 518089 508300
10175 508300 467025 432511 409592 399426 389687 369613 349001 335938 330027 309426 295388 288442
10163B88442o563m271j9150j0091L35P699o193p75n165q276j7079l118K2275R976
10149B48046M165K1212L6057M6777M5568L6374J0211j3160l0710l6349l0817l6907
10137C00467l4282l1667k3834j576j522r381n928j6531k8490j3428m426o684J1781
10124A34499r085r841j957J4057o04J0859k861M747l070K941n049m942J1391J8373
10110A59458J1246l427k484L445n688k83k263q559k935n5q316j357J0881J246
10096A50909j1855j0246j2049m395n011j313j5852j5773k74M341M591J886k295
10083H2664j407M993l957N958J581o543q805m288p599P409K528j0415M54J1645
10069G4218m617P799J6172J431m422l674j0381Q37k528J170j1742m544J2539J6490
$$ plain form
10163 288442 281879 277608 258458 248367 248702 256401 250208 249433 244268 235992 218913 215795 238070 248046
10149 248046 252211 273423 309480 356257 401825 438199 448410 435250 404540 368191 337374 300467
10137 300467 266185 234518 210684 209108 207586 198205 192277 175746 147256 133828 129402 122718 134499
10124 134499 125414 115573 113616 127673 127069 137928 135067 139814 136744 139685 134636 129694 141085 159458
10110 159458 170704 167277 164793 168238 162550 162267 160004 151445 148510 148455 140139 138782 149663 150909
10096 150909 139054 128808 116759 112364 107353 106040 90188 74415 74141 78482 83073 84959 82664
10083 82664 81257 86250 82293 88251 89832 83289 74484 70196 62597 70006 72534 62119 62573 74218
10069 74218 69601 77400 93572 95003 90581 86907 76526 77363 74835 76005 64263 59719 72258 88748
10055H8748O101j1977K008J870K036k915M306M237l082J1029M895L161L715J4122
10041A28254J244q245O81j197j2316q068k545q954o845N980q056j075j0298j5041
10027E3519P547L654Q279J8068o44K199J6524q239K1614K359j237K202p398j7098
10013A01349j7850m111J0157J0021K68P223j824o959K359j0796j2225Q460J4084
10000A00156L950M542J0173q643j219M425R011O613J0225M314p916Q991J7045
9987A61667j985l828Q090J964J9191J1389L525R184J01Q515K1960K1483N386q416
9973B58226O662J6730K4752P999j4249n630m615j5804k5172J710p634j2345j2839
9960B17791q666j077K428l369n911J1404K14m087M925j4886k422K366J390k1329
$$ plain form
10055 88748 94849 82872 84880 86750 88786 85871 90177 94414 91332 102361 107256 110417 114132 128254
10041 128254 129498 121253 121934 120737 108421 100353 97808 88854 82009 87989 79933 78858 68560 53519
10027 53519 61066 64720 72999 91067 90423 92622 109146 100907 122521 124880 123643 125845 118447 101349
10013 101349 83499 79388 89545 99566 99834 107057 105233 98274 100633 89837 77612 86072 100156
10000 100156 104106 108648 118821 110178 108959 113384 122395 129008 139233 143547 135631 144622 161667
9987 161667 159682 155854 163944 165908 185099 196488 200013 209197 209298 217813 239773 261256 266642 258226
9973 258226 264888 281618 306370 314369 300120 294490 289875 274071 248899 250609 242975 230630 217791
9960 217791 209125 208048 210476 207107 201196 212600 212814 208727 213652 198766 196344 198710 200100 178771
9946A78771p631j2853q665k688n165M526K287M458j637M658l65R626q310q838
9932A48174k936J2714K1600J7454K5731K4624K2189J264L820n171j3485j8826
9920B37152j7010k0473k0537j5849p606q368n156j8533o846K78l297j2454J456
9907A02757J6209p119J1113M727j4245m446N150n206j4344L927M092j729r086
9894I1800J015J2683n39l335K346P397j1646k164O77q452K445L727J8183K0309
9880A34446K6928K8226M247j7234k2065j1627q656k6770j0329m69L209j3044N386
9867I2248l869Q478n275j230j0154j2415P545J8670p430j1904m797L095Q57o632
9853F7187k00r040p156j364L190L452N592j006n472k468Q072p220j417P45M284
$$ plain form
9946 178771 171140 158287 149622 146934 141769 146295 148582 153040 151403 156061 155696 165322 157012 148174
9932 148174 145238 157952 179552 197006 222737 247361 269550 270814 274634 269463 255978 237152
9920 237152 220142 199669 179132 163283 155677 147309 142153 123620 116774 117052 113755 101301 102757
9907 102757 118966 111847 122960 127687 113442 108996 114146 108940 94596 98523 102615 100886 91800
9894 91800 92815 105498 104959 101624 103970 111367 99721 97557 98234 89782 92227 95954 114137 134446
9880 134446 161374 189600 193847 176613 154548 142921 134265 107495 97166 96697 99906 86862 92248
9867 92248 88379 96857 91582 90352 80198 67783 75328 93998 86568 74664 69867 72962 73819 67187
9853 67187 66987 57947 50791 49427 52617 56069 61661 60655 55183 52715 60787 53567 52150 52895 57179
9838E7179K2163L634k0283J789J6951Q174q833K795L64j3797j6959q052m165N449
9824D6409K712o151M024K6485j970N110j0367r571k2094K783J2208O779o447j2074
9810C7836M200O921J4719n14j2365k43m203Q8k673O94j2408o259O130J0854Q973
9795E1750J1690p040n368j557q17J2933O012j0841j6176J882q00J0050J282j9471
9781C3529j4851J097J8788k013q921K831L994M964k229M8M768R231j5834R48N083
9766D1433j554n277M521r601j768N265K788r331j0459l521L823R089l783O117
9752B7742R035k283L905O793N587O023L514n218q679J0688O761j0458o793N200
9738E1817J096j9175j1556J7174R878j474j0769J918k55L275J0305M149j592m247
$$ plain form
9838 57179 79342 82976 62693 64482 81433 89607 80774 83569 83933 70136 53177 45125 40960 46409
9824 46409 49121 42970 46994 73479 71509 76619 66252 56681 34587 37370 49578 56357 49910 37836
9810 37836 42036 48957 63676 63162 50797 50554 46351 46439 43766 44460 32052 25793 31923 42777 51750
9795 51750 63440 56400 51032 49475 48658 61591 67603 56762 40586 42468 41668 51718 53000 33529
9781 33529 18678 19775 38563 36550 27629 30460 34454 39418 37189 37237 42005 51236 35402 36350 41433
9766 41433 39879 34602 39123 29522 27754 33019 35807 26476 16017 12496 16319 25408 21625 27742
9752 27742 36777 34494 38399 45192 50779 56802 60316 55098 46419 57107 63868 53410 46617 51817
9738 51817 52913 33738 22182 39356 49234 47760 36991 38909 38654 41929 52234 56383 54791 50544
9724E0544r460p516N30k0612K837J8167K886j0346j1787P249Q093K864O86M372
9710C8507O806j8119L977p650o30r266L923k423L016O127j506O846K645M696k636
9695C4313J0047j686j3284J2737M41M681j4879j2673l562k998M969j0652Q014
9682A5468O354j6156P844J8655Q136L462M536m567J4349J9247k1250j6001k319
9669C7758j5735J43O162L51l352M477m549K625J748J4666J3315k169j9861j1969
9655B3610K1265m320l464J5308M429j6799r923l607L650J4127r065j144j705j1138
9641B1224o741j8522L812J1162r47l800J8993R151k189m43K573r0J1073Q88P442
9626E3586P440k332j3688j1920N168J4397N339q310j897J0082q69j3527J6434
$$ plain form
9724 50544 41084 33568 34098 13486 16323 34490 37376 27030 15243 22492 30585 33449 34135 38507
9710 38507 45313 27194 31171 23521 22891 13625 17548 15125 18141 24268 22762 29608 32253 36949 34313
9695 34313 44360 42674 29390 42127 42568 47249 32370 19697 16135 13137 18106 7454 15468
9682 15468 21822 5666 13510 32165 40301 43763 48299 43732 58081 77328 56078 40077 37758
9669 37758 22023 22166 28328 28679 25327 29804 25255 27880 29628 44294 57609 55440 35579 23610
9655 23610 44875 40555 37091 52399 56828 40029 30106 26499 30149 44276 35211 34067 32362 21224
9641 21224 14483 -4039 -227 10935 9988 6188 25181 34332 32143 31700 34273 34183 45256 46144 53586
9626 53586 61026 58694 45006 33086 38254 52651 57990 49680 47783 57865 56996 43469 59903
9613E9903m139M333J0917q834J0343L849p26j2211j3758N630N201j3920m612p996
9599C3980P218m14n13j4425j0270J1625K3712M089p475J0375n985r79j0242L26
9585D1022J3651k360k850J2910l837p484j632J0215n307j1259j1602o838J9714
9572D4343M504J304J3394J9791J0775J6385n079j923L9778O4453P2444P7855K9650
9559C87674j8813o4874p8825o1538l7554q165Q608J296n595K476J941k2524q189
9546I5918p503k2498j0417J21R774J788N963K2382J6681K1057P840j1305j5099
9533A14702l976k280j4462p585r799k261J7378O626m757j315Q200J540j2597j5684
9519G3730q325n418J0121J4027j0334Q39L530M38M329L104j95k717o738j6922
$$ plain form
9613 59903 55764 60097 71014 62180 72523 76372 75646 63435 49677 55307 60508 46588 41976 33980
9599 33980 41198 40784 40271 25846 15576 27201 50913 55002 47527 57902 51917 50938 40696 41022
9585 41022 54673 52313 49463 62373 58536 51052 49420 59635 54328 43069 31467 24629 44343
9572 44343 48847 50151 63545 83336 94111 110496 105417 103494 143272 207725 280169 358024 387674
9559 387674 368861 303987 225162 163624 126070 117905 126513 127809 122214 124690 126631 104107 95918
9546 95918 88415 65917 55500 55621 65395 67183 73146 95528 112209 133266 141106 129801 114702
9533 114702 110726 108446 93984 86399 76600 74339 91717 98343 93586 92271 100471 102011 89414 73730
9519 73730 65405 59987 70108 84135 73801 74640 78170 78608 82937 86041 85846 83129 76391 59469
9505E9469L054J2540q537r727q830P81N256K012J5364k400p875J3498n451j4608
9491E4546N723q38k017q329j5680l494J6296P652P362p496n015J2425Q282k373
9477F7044J0131L383j709r414j3728K241o08P338P636l050j267K670L250k87m345
9462F9285O849K853J866L044p73j8814j719R472k563o582q092k517O806J2888
9448G2003P824l288j8225j6730J3021J3954J6834K813j7035j1907n049J1812J3262
9435G9289n904j8192N98J7267L530k576j514j6290n250L319l495K082J0066K207
9421F5137m28J1876N518o424O249J609r200j2208j05j0719q429L185J9825M133
9407G0019Q17p943P604J6999n536O686J6719K519m357Q358J292m4Q993k899j8134
$$ plain form
9505 59469 62523 75063 66526 56799 47969 48750 54006 56018 71382 68982 61107 74605 69154 54546
9491 54546 60269 59431 57414 49085 33405 29911 46207 53859 61221 53725 48710 61135 69417 67044
9477 67044 77175 80558 78849 69435 55707 57948 57340 64678 72314 69264 67997 70667 73917 73630 69285
9462 69285 76134 78987 80853 83897 83124 64310 62591 72063 69500 62918 54826 52309 59115 72003
9448 72003 79827 76539 58314 41584 54605 68559 85393 88206 71171 59264 54215 66027 79289
9435 79289 73385 55193 55791 73058 76588 74012 72498 56208 50958 54277 50782 52864 62930 65137
9421 65137 64709 76585 82103 75679 81928 83537 74337 62129 62024 51305 42876 46061 65886 70019
9407 70019 70836 62893 70497 87496 81960 88646 105365 107884 103527 111885 113177 113133 122126 119227 101093
9392A01093J551q682K958j664n992j1161K681J74l556j976j6560n789K255O384
9378F1716K781R396J1616o176l479p504j70N240o718P761k49j1099j0330j1926
9364D0859j324n028K3404J6628N065L32J0569N09r424L076N914J3026Q876q778
9350A03704l390L740q087n925N965k209k491o433O54R829J2579L057j6765J298
9336I5526n159L968Q374J442j0449k933J5433Q833k1709j9329J5952P030j0428
9323H6551J0344K403R239j2236j4927J2093P151j0714J524M838J9459L187K466
9310A21378r232j3928j0613m80P936j095l343P794j1917j1381q006N142J1791
9297H4046O837J5714J1118J2296l402q558k323M895p476p708J7407J049j3056
$$ plain form
9392 101093 102644 93962 96920 95256 89264 78103 80784 80958 77402 75426 58866 53077 55332 61716
9378 61716 64497 73893 85509 79333 75854 68350 68180 73420 66702 74463 74214 63115 52785 40859
9364 40859 39535 34507 57911 74539 79604 79936 90505 91014 81590 84666 90580 103606 112482 103704
9350 103704 100314 104054 95967 90042 96007 93798 91307 84874 85528 95357 107936 110993 94228 95526
9336 95526 90367 94335 102709 104151 93702 90769 106202 115035 93326 73997 89949 96979 86551
9323 86551 96895 99298 108537 96301 81374 93467 100618 89904 91428 96266 115725 118912 121378
9310 121378 112146 98218 87605 87125 95061 93966 90623 98417 86500 75119 67113 72255 84046
9297 84046 90883 106597 117715 130011 126609 118051 115728 120623 113147 105439 122846 123895 110839
9284A10839p37l584j0438M06K396p414J4258P377K257k323j93l321l791j9990
9270H5742o669O19M062K8562J3748N74M99N65P375O224L366p819j6348R256J0713
9255A40469j0108k151K2011R575Q027Q983j0436j0312O216J478j686m557j2386
9242A45123o388P476R205o614M242J3167M411Q823M134q178q001j2717j865J3592
9228A66410J565o296j0986L787J4411L377j2442L76J2897J2214k546p292P040
9215A82515M863k101r449n812N0Q583J357Q637P453k297N324K373j787n773r289
9200A84647N843j976M599Q686j566L329L238n54J0521J781k503j0532j3017k0068
9186A72428q888n741n054l230J1154J1241J182j080o201R954j1625j0243K09j030
$$ plain form
9284 110839 110102 106518 96080 96486 98882 91468 105726 113103 115360 113037 112844 109523 105732 85742
9270 85742 79073 79692 83754 112316 126064 126638 127137 127702 135077 141301 144667 136848 120500 129756 140469
9255 140469 130361 128210 150221 159796 167823 176806 166370 156058 162274 163752 162066 157509 145123
9242 145123 138735 146211 155416 148802 153044 166211 170622 179445 183579 175401 167400 154683 152818 166410
9228 166410 167975 161679 150693 154480 168891 172268 159826 160202 173099 185313 182767 175475 182515
9215 182515 187378 185277 175828 170016 170066 178649 180006 188643 196096 193799 199123 201496 199709 193936 184647
9200 184647 190490 188514 193113 201799 200233 203562 206800 206246 216767 218548 216045 205513 192496 172428
9186 172428 163540 157799 152745 149515 160669 171910 173092 172012 165811 175765 164140 153897 154106 153076
9172A53076J1906j990R317O514R110l635k7030J0428J6155M379o31m45m27Q494
9158A95221Q231N848O459J72l622N838n176r842p09K914L816J028K562P453M567
9143B24760j800M011J5100R805M304J310j4849o475j483k3251j6920P425J1046
9130B12983O080Q473L747j879j2129j599R076N69J19J4497R196Q082L135J2362
9116B72712R465J0334J4525J9491J4000p739l82J7203j4191j592N794N528j259
9103C43889J5744K5809K1152J0863l968O647K8145M0018M6805M4286M9386N3869
9091F82645O7143Q1779Q8544Q0821J21343J55483K02315K67288L60826M53056
9081B561243N80612P05318P93385P95298O55612L48805o6409m50334o66266o91297
$$ plain form
9172 153076 164982 162992 172309 178823 187933 184298 157268 167696 183851 188230 187599 187154 186727 195221
9158 195221 203452 209300 215759 215931 212309 218147 212971 203129 202420 205334 209150 210178 212740 220193 224760
9143 224760 222960 226971 242071 251876 256180 257490 242641 236166 234683 211432 194512 201937 212983
9130 212983 219063 227536 231283 229404 217275 215676 224752 225321 225440 239937 249133 257215 260350 272712
9116 272712 282177 292511 307036 326527 340527 332788 332406 349609 335418 333826 339620 345148 343889
9103 343889 359633 385442 406594 417457 413489 420136 448281 488299 535104 579390 628776 682645
9091 682645 749788 831567 920111 1000932 1122275 1277758 1480073 1747361 2108187 2561243
9081 2561243 3141855 3847173 4640558 5435856 6091468 6440273 6373864 5923530 5257264 4565967
9071D565967o18138n35271m37034l47459k84294k13393j79644j55592j23195j00624
9061A571323q2105p5998o2423n4858o6404n2456m1911n9146m6723l7758l870j1956
9049I75715k2809k1978j5584j6057k0569k4213k3557j3034p130j7811k804P778
9037G97947j0720j1135N128j283j7936k4503j1788j2256j2899n771j2812j7138
9025F64834k4785j1406n520J789J597j5964j5462n553q080P891P521q900j4419
9012E73543j6936k3140k7496k455L904M700k287j910o138j7468j7845k1013k1652
8999D23807o448j6964m810p09J2978J008j631P147J734J0423p33P562m184j0353
8985D18827m012o92r099m398m281j7655l354O530n238j7637l698nl468o002j311
$$ plain form
9071 4565967 3947829 3412558 2975524 2628065 2343771 2130378 1950734 1795142 1671947 1571323
9061 1571323 1489218 1413220 1350797 1295939 1229535 1177079 1135168 1076022 1029299 991541 987671 975715
9049 975715 952906 930928 915344 899287 878718 854505 830948 817914 810784 792973 790169 797947
9037 797947 787227 776092 781220 779937 762001 737498 725710 713454 700555 694784 681972 664834
9025 664834 640049 628643 623123 624912 626509 610545 595083 589530 581450 589341 596862 587962 573543
9012 573543 556607 533467 505971 503516 507420 512120 509833 507923 501785 484317 466472 445459 423807
8999 423807 417359 400395 395585 394876 407854 408862 407231 414378 416112 426535 425802 433364 429180 418827
8985 418827 414815 414123 405024 400626 396345 378690 375336 381866 376628 358991 355293 355288 351820 345818 344507
8970C44507j717L229R302J2855M417J4625m242j8297j3279j6496n623j243J0003
8957C38041J563j693r149J83n672k217j031J1790p004j8417J4936K9099J2125
8944C62554j23K468J2933n394j0939k3788k2958k158l260P572L856m267r284p121
8930C00091j757R792J021J983L99k84o890M886o262K058k215q656J6562J8821
8916C29549k819k136J727m004n044O465K5806J4717j8908k6709j3241k659p442
8903B95302K199L664j4679n864J4026R745M824J642J447L637j1886o037K945K404
8889C03369j3743k3223j5977J3909P276Q506J0537J865K280O082M042R973J9684
8876C34580r537k4827j2453r408J2454Q806n362J1531K0910J5623j2456j4644
$$ plain form
8970 344507 342790 346019 355321 368176 372593 387218 382976 364679 351400 334904 329281 328038 338041
8957 338041 339604 337911 328762 328945 323273 321056 320025 331815 324811 306394 321330 350429 362554
8944 362554 362431 364899 377832 372438 361499 337711 314753 312595 309335 316907 320763 316496 307212 300091
8930 300091 298334 308126 309147 311130 311529 311245 304355 309241 302979 305037 302822 294166 310728 329549
8916 329549 326730 324594 326321 322317 317273 323738 349544 364261 345353 318644 305403 302744 295302
8903 295302 297501 301165 286486 280622 294648 304393 309217 310859 312306 315943 304057 298020 300965 303369
8889 303369 289626 266403 250426 264335 271611 280117 290654 292519 294799 300881 304923 314896 334580
8876 334580 325043 300216 287763 278355 290809 299615 294253 305784 326694 342317 329861 315217
8864C15217r221k1338k6802j2157r006L416K238M825N168L23j0403k4138o395
8851B11727j2516L64J4580l5k420K638O175K078r84j0737N783K124L385j4374
8837B07788m644n330r810m581pJ503m169J066r09K39j792O887K429l391M138Q671
8821A98088j329o056N097M865p507p818K712J9223J6777K0971J2003m450m698
8808B47878o148j255l975J2835n562k348p524L115R891J997m68m422m45j7636
8794B25933j2958j6285j2771N932j14J5955J1701o586j1549K150p2q235j359n694
8780A86048j711P878J4483N842j780r676J0376j1100o244Q730p71j3857o092n581
8766A76545O723N605J748M387Q292O385l110q654J200R120J4318J2058P591J7425
$$ plain form
8864 315217 305996 284658 257856 245699 236693 240109 242347 247172 252340 252663 242260 218122 211727
8851 211727 199211 199575 214155 214120 211700 214338 220513 222591 221607 210870 216653 218777 222162 207788
8837 207788 203144 197814 188004 183423 183416 184919 180750 181816 180907 181146 179354 186241 188670 185279 189417 198088
8821 198088 196759 190703 195800 200665 193158 185340 188052 207275 224052 245023 257026 252576 247878
8808 247878 241730 240475 236500 249335 243773 241425 233901 237016 246907 248904 248436 244014 243569 225933
8794 225933 212975 196690 183919 189851 189737 205692 217393 210807 199258 201408 201336 193101 191742 186048
8780 186048 184337 192215 206698 212540 210760 201084 211460 200360 194116 202846 202075 188218 182126 176545
8766 176545 183268 188873 190621 195008 203300 209685 206575 197921 199121 208241 222559 234617 242208 259633
8752B59633Q963j4880j4089m878n473J4588K9889J7839J8534J1754p923j8305
8740B95652l639P95m671l958j101R424J510m972r874j325J8644K6330Q308L323
8726C34446j4613k600J2228l209L598P80l534J5899K9470J2372K794N405J0851
8713D03887j154r669m484q086o194O196m293J2472J0639m26j640r757Q434J1060
8699D06985O649O580Q732J2735R993J3051J6988J412k46K4976M1610K6517K7553
8686F03535L1107M4337M2753N3531O9997P9020Q2523R1088Q1562P9460R4913R8834
8674A452660R0769O2832K4827k9675q4899j14412j23718j15290j17700q9025m8328
8663I08041l9158l3159j1095l3229l8517l1977l8384l2109j4620k1314k5384k4020
$$ plain form
8752 259633 268596 253716 239627 234749 229276 243864 273753 291592 310126 321880 313957 295652
8740 295652 292013 292808 288137 284179 283078 292502 294012 289040 279166 277841 296485 322815 331123 334446
8726 334446 319833 317233 329461 326252 329850 330630 327096 342995 372465 384837 387631 393036 403887
8713 403887 402733 393064 388580 380494 374300 380496 376203 388675 399314 398888 397248 387491 395925 406985
8699 406985 413634 420214 428946 441681 451674 464725 481713 483125 482879 507855 549465 575982 603535
8686 603535 634642 678979 721732 775263 845260 924280 1006803 1097891 1179453 1258913 1353826 1452660
8674 1452660 1543429 1606261 1631088 1601413 1516514 1402102 1278384 1163094 1045394 956369 908041
8663 908041 868883 835724 824629 791400 752883 720906 682522 650413 635793 614479 589095 565075
8651E65075j2453j2694j2997N759M48k2769j1931n821k549r760L257j6873j6619
8638D50073o589M1J7140J2982J5779J7322K4134K0982k149M957j6899l8182l0150
8625D69441k3179k1447j1130q796L10J2916j2467n457l640J5238N786J7881K6927
8612D62383J1510j4033j9141j1085l9820l5677j5221k0865j5480j2702J2595J9716
8600C22180n400j137K2679J9463j0544Q3L649J262j1084q232k8R206L0081M8872
8586D21050L3713J0699j1760k8454l2955l6020l9540j9528j8447k5977r598N37
8574B43720r030k554O177o159j0844K531J4733r674n31l74J5823J6193O8j1170
8560B48909j2827K216k4594k4342j432k277j0680J2242J1270J3000J2964J6174
$$ plain form
8651 565075 552622 539928 526931 532690 533138 510369 498438 492617 490068 480308 483565 466692 450073
8638 450073 443484 443525 460665 473647 489426 506748 530882 551864 549715 554672 537773 499591 469441
8625 469441 446262 424815 413685 404889 405199 418115 405648 400191 396551 411789 417575 435456 462383
8612 462383 473893 459860 440719 429634 389814 354137 338916 318051 302571 289869 302464 322180
8600 322180 316780 315643 338322 357785 347241 347324 350973 352235 341151 332919 332891 342097 372178 421050
8586 421050 454763 465462 453702 425248 392293 356273 316733 297205 278758 252781 243183 243720
8574 243720 234690 232136 238313 232154 221310 223841 238574 228900 228369 227995 243818 260011 260079 248909
8560 248909 236082 238298 213704 189362 187930 185653 174973 187215 198485 211485 224449 240623
8548B40623J4957J1397O722k75j3369j4046m680J82o560j3869n655q609p334r080
8534A90404r335j005n921p727R254o801r080j419l327m66J0352k008K704N815
8520A71440R768L629N206O10k754m945o501l433l395n264l3572j5749M439P579
8506A27058k708J588r24r48K0421J8410R381J671j7520l221n575O679q73k4j0298
8491A43117P37M547n768K469j33j4872k3298j5389K0271J5265j1342j0987J019
8478A05636L473L01M818j1861n987q977m908N643N33N288O274m853j823M114Q452
8463A06123N391Q958L430K815n861L473Q993M185N029K32j776J8506Q402J0317
8449A78217J2256l678j2114k3680k2873j2541j2230P313M880l534j1658K192n654
$$ plain form
8548 240623 255580 266977 273699 273424 260055 246009 241329 241511 234951 221082 215427 206818 199484 190404
8534 190404 181069 180064 174143 166416 175670 168869 159789 158370 155043 154577 164929 162921 165625 171440
8520 171440 181208 184837 190043 190653 187899 182954 176453 173020 169625 164361 130789 115040 119479 127058
8506 127058 124350 125938 125014 124066 144487 162897 172278 173949 156429 153208 147633 154312 153439 153415 143117
8491 143117 143854 148401 142633 145102 144969 130097 106799 91410 111681 126946 115604 104617 105636
8478 105636 109109 109410 114228 102367 96380 87403 82495 88138 88671 93959 100233 95380 93557 97671 106123
8463 106123 111514 120472 123902 126717 120856 124329 133322 137507 142536 142768 140992 159498 167900 178217
8449 178217 190473 186795 174681 151001 128128 115587 103357 110670 115550 112016 100358 102550 96896
8436I6896p831l5P537M461K379j872L64j01J9563J7005j0109j4330O709J1796
8422A32432k3567j7634j3167k542R772k938L098K177L19R226O820K1621J6411
8409A42028R97n33J912R066J6644L596j8216J338L392k5208j5568r000K069M45
8395A12962k522o703K160n079j3119l149K263J0359J4888R456j7706j0997J36
8382I2949l80j2567j0950N601R969R971M380j0803j2669P00J878l757p885M821
8368G1258J213r059q844L556K532j84J0361J7936O830q16m973k102j2441j9795
8354E5472Q614J1561J877Q077J232N693m700j0514J7259J9330k954k428m655q236
8340I5628N792J2253m789L783J12p182p721k224P682K1853J5313P466k611j3006
$$ plain form
8436 96896 89065 89030 96567 101028 103407 101535 101899 101798 121361 138366 128257 113927 120636 132432
8422 132432 108865 91231 78064 75522 85294 82356 85454 87631 87950 97176 103996 125617 142028
8409 142028 143025 142492 144404 153470 170114 173710 155494 156832 160224 135016 119448 110448 112517 112962
8395 112962 110440 103737 105897 100818 87699 84550 86813 97172 112060 121516 103810 92813 92949
8382 92949 92569 80002 69052 74653 84622 94593 98973 88170 75501 76201 78079 74322 66437 71258
8368 71258 72471 63412 54568 58124 60656 60472 70833 88769 95599 94783 89810 87708 75267 55472
8354 55472 64086 75647 77524 85601 86833 92526 87826 77312 94571 113901 110947 108519 103864 95628
8340 95628 101420 113673 108884 112667 112779 105597 97876 95652 103334 125187 140500 147966 145355 132349
8326A32349O533l655J441l771l070K870p997O080Q445n77j2267k2009M779q2j2437
8311I6632k3311j4432N906p21r56j189J1661K2400L539l94M478j6075m237M588
8297H7889j776o50l187n4o813p273O160K0703N670J1807N843n118L671J1473o175
8282A22170q976j8057o639p767o459K357n605L753N717r293j967J1019M035j0272
8268G4016m641j007k968J332l473n267N184J4489O815M058m161n547p007K610
8254G4433O534m51L056J1108J3721l124r147l089J0797M356J5096N554j4804k794
8240A11246O128j172j6528q497k642j0810Q353m84p04J1427m841Q113M326J230
8226A05145Q071J3307M254p338L253j47N381K539j0840r427j8027j9143M8P078
$$ plain form
8326 132349 138882 135227 136668 132897 129827 132697 124700 130780 139225 138648 126381 104372 109151 109069 96632
8311 96632 73321 58889 64795 64074 63118 61929 73590 95990 99529 99135 103613 87538 83301 87889
8297 87889 86113 85463 82276 82222 75409 68136 74296 94999 100669 112476 118319 113201 116872 128345 122170
8282 122170 113194 95137 88498 80731 74272 76629 71024 74777 80494 71201 69234 80253 84288 74016
8268 74016 69375 68368 65400 66732 63259 57992 63176 77665 84480 88538 84377 78830 71823 74433
8254 74433 80967 80516 83572 94680 108401 105277 96130 93041 103838 108194 123290 128844 114040 111246
8240 111246 117374 116202 99674 91177 88535 77725 86078 85594 84890 96317 91476 99589 103915 105145
8226 105145 113216 126523 130777 123439 126692 126545 131926 134465 123625 114198 96171 77028 77076 84154
8212H4154J5046R732L052R607J0409j919m011p694n439J8010M315j026O131J00
8198A40467J2528J6757J047l243J1197N530j2401q418j070k73P090l204q169J1071
8184A68909P293k992j1505q231j8270J500J909k540j4515r236k570l801O771Q092
8170A20814j907L867m481m162P949K3946J7267J3471R850J471q910n094j4126
8157A59955j7308k874M919r006n703j7472k764J6613J6141J4712j074j623J2539
8144A67055P41J6787L4239J6969j4855k7218p603l131n298M434J50L89j1841L055
8130A73873j736J300M004L236J0479J2625L589N117j470q013j0784j5331j2085
8117A64804J7715K1591N399o807l437P342L093N829R285K203m253J0661K5962
$$ plain form
8212 84154 99200 108932 111984 121591 132000 130081 126070 118376 112937 130947 135262 134236 140367 140467
8198 140467 152995 169752 170799 167556 178753 184283 171882 163464 162394 162121 169211 166007 157838 168909
8184 168909 176202 173210 161705 153474 135204 136704 138613 136073 121558 112322 109752 105951 112722 120814
8170 120814 118907 122774 118293 114131 122080 146026 163293 176764 186614 188085 179175 174081 159955
8157 159955 142647 139773 144692 135686 129983 112511 109747 126360 142501 157213 156139 154516 167055
8144 167055 167796 184583 218822 235791 220936 193718 186115 182984 177686 182120 182270 182659 170818 173873
8130 173873 172137 173437 177441 180677 191156 203781 207370 212487 211017 203004 192220 176889 164804
8117 164804 182519 204110 209509 202702 199265 206607 209700 215529 224814 227017 222764 233425 259387
8104B59387n689j8091n57K69J788n176p352j3307K268k473j4152M851K3573J188
8090B26527J0765J1735J4235n992p072r389P982J2433K260M954J1818J3044K2492
8077C15792K3418R918P06k849j2758k2038j7872r532J678R8j5807j0031m689j8462
8063B37572j0408n467O265o820j0617j0497m597J4657J7188J862m840j262J592
8050B24628p72M137J1962Q33M19R427L621r700P954O953J3509R111j769r17j0452
8035B68944j735J2202l667j0808p368K498L378k354j361j6321j1659j0059o613
8022B15077p339n607N701l481j0695P80M536J7L502K527o697k1033L557N824r702
8007A76967M638J0566J0450M39q350j1854P12m763r652j3869p501R43M916K143
$$ plain form
8104 259387 253698 235607 235050 235319 237107 231931 224579 211272 213540 211067 196915 201766 225339 226527
8090 226527 237292 249027 263262 257270 250198 240809 248791 261224 263484 268438 280256 293300 315792
8077 315792 339210 349128 349834 346985 334227 312189 294317 284785 286463 286561 270754 260723 256034 237572
8063 237572 227164 221697 227962 221142 210525 200028 195431 210088 227276 229138 224298 223036 224628
8050 224628 223856 227993 239955 240788 241207 250634 254255 244555 252509 259462 272971 282082 280313 279396 268944
8035 268944 267209 279411 275744 264936 257568 260066 263444 261090 259729 243408 231749 221690 215077
8022 215077 207738 202131 207832 204351 193656 194436 198972 198989 202491 205018 198321 177288 180845 186669 176967
8007 176967 181605 192171 202621 203060 194710 182856 183568 178805 169153 155284 147783 148726 153642 155785
7993A55785J1896j1240k2301j3002P914l340j6866k478M293l260l910L400l768
7980A03123J937J0980N382J166k09j1603p98r931Q59R428P305L80j3743j7630
7966H6646m157L711r00J0697k138j203J2171O298q177Q350j896p930J845j03q96
7951A02318M644m810j1936q537J2109r093p627m12K1692O191J196j180n327k831
7937I6397q457j2208j0420m567J206o591M523r980j3967J526J2964l274k567O662
7923E1247j348J0092J283n353p595n2J64J0372J2743r834j0461l755J100L827
7909E2430j712J7274q384k6863M308J3898Q40l102k839r14j3698J924n407O966
7895C4721M740P45J9786m852j848q181j9957Q364M302m378j949JL129l457L412
$$ plain form
7993 155785 167681 156441 134140 121138 129052 125712 108846 106368 110661 107401 103491 106891 103123
7980 103123 105060 116040 121422 122588 122379 110776 109978 100047 100906 110334 117639 118019 104276 86646
7966 86646 82489 86200 85300 95997 93859 92656 104827 111125 102948 111298 109402 101472 103317 103214 102318
7951 102318 106962 102152 90216 81679 93788 84695 77068 76656 98348 104539 105735 104555 99228 96397
7937 96397 87940 75732 65312 60745 61951 55360 59883 49903 35936 37462 50426 47152 44585 51247
7923 51247 49899 59991 61274 55921 48326 48274 48438 58810 71553 61719 51258 47503 48603 52430
7909 52430 50718 67992 59608 32745 37053 50951 51791 48689 45850 44936 31238 33162 27755 34721
7895 34721 39461 40206 59992 55140 53292 45111 25154 33518 37820 33442 31493 31494 34623 31166 34578
7880C4578l876J318k108Q527O868M41l394j090j865K263q243o94O943P100r241
7865C7527q450j0452l70j366k839J4406p151m468Q035P30K492j093n171J1116
7851C2946N532r627l671n672N920J556j3158j2799p957N737J5372K2944L972j5006
7837B6089J322o295p159l152P994J6194J1986P235p872o033j7754o360K053l906
7823A4342l072J955N773p025k995J1907J7090k496j1839j396N01M852K328k850
7809B7075j040P074k608o664L161r17j1697p636r303J901J2253Q354j198j3220
7795E535L406J0868j2556j1914K596J0930Q619m648R762m826p861J261M263j5386
7781D9j4710n614J2275K1067L504J656k143m365k74n402r954m64k21N899K779
$$ plain form
7880 34578 30702 32020 29912 38439 45307 45748 42354 41264 39399 41662 33419 32725 39668 46768 37527
7865 37527 29077 18625 18255 16889 14050 28456 21305 16837 24872 25602 28094 27001 21830 32946
7851 32946 38478 28851 25180 19508 25428 26984 13826 1027 -6930 -1193 14179 37123 41095 26089
7837 26089 27411 21116 13957 10805 18799 34993 46979 54214 46342 40309 22555 16195 18248 14342
7823 14342 11270 13225 18998 11973 8978 20885 37975 35479 23640 22244 22745 27597 29925 27075
7809 27075 26035 33109 30501 23837 26998 26081 14384 6748 -2555 -654 11599 19953 18755 5535
7795 5535 8941 19809 7253 -4661 -2065 8865 17484 12836 22598 17772 9911 11172 15435 49
7781 49 -14661 -20275 -8000 13067 16571 18227 16084 11719 11445 6043 -3911 -4375 -4596 1303 4082
7766D082j0934Q238Q128J833k3228L918l722K923N783N555J87Q16M185R750Q151
7751B5665M13p37l876o634j2454q181j309o96L929r44J5012M021N426J4935r099
7736B5471o790j3080j0020J9208m117L636m635K58m828J1933K838K045l954L565
7722B1530j879N084M639o617j1051J080K996o064M407M648m845o89P341j1275
7708I305k4555J880J2495J1934p045j3417m748k895J4648O713L055J4211J849
7695B3430m376l295j3841j0962L976j200m583j1876n21J1020L900O470J9555L165
7681B0862j3815j4340j462Q961K231L921n217m439q816K728J2641M486L550n318
7667E973j3276q822J640N935J667K078J0199J8494q358j7375j328N758k07l455
$$ plain form
7766 4082 -6852 1386 9514 11347 -11881 -7963 -11685 -8762 -2979 2576 2763 3579 7764 17514 25665
7751 25665 26078 25341 21465 14831 2377 -5804 -7113 -7809 -3880 -4824 10188 14209 19635 34570 25471
7736 25471 18681 5601 -4419 14789 10672 14308 9673 9931 5103 17036 19874 21919 17965 21530
7722 21530 19651 24735 29374 22757 11706 12786 15782 9718 14125 18773 13928 13239 20580 9305
7708 9305 -15250 -13370 -875 11059 4014 -9403 -14151 -17046 -2398 4315 7370 21581 23430
7695 23430 19054 15759 1918 -9044 -5068 -6268 -10851 -22727 -23248 -12228 -8328 -1858 17697 20862
7681 20862 7047 -7293 -8755 206 2437 6358 1141 -3298 -12114 -9386 3255 7741 11291 5973
7667 5973 -7303 -16125 -14485 -8550 -6883 -4805 5394 23888 15530 -1845 -3173 2585 2378 -1077
7653a077K043K093R408N443j9361j1509K143O979J4199N15j6507j3710K1421J6068
7639A8148J038j2733o396n340L078J1484J0686o613j916n179l315m619p014N469
7625c222N096l900J297m907j6928r955J8279J0581j17j2596k260K823N094Q205
7611b510J0441O408P934q199o711L079j6117k0241n41J4688P287R066p712l413
7597f541K15P902j0389l723O544N456M146j896L393n604j3865o105P331J580p931
7582a9487k54j0184j65N975J119j220O788M432j0100N03J5790n338p112K608J875
7567a4770R759M628K891l468n04N178q540j3399J5292J6006L391K154r262r408
7553e2Q303O18k719k0760j0262O019J2032Q945j090O340P386m212l897o34n098
$$ plain form
7653 -1077 966 3059 12467 17910 -1451 -12960 -10817 -3838 10361 10876 -5631 -19341 2080 18148
7639 18148 19186 6453 57 -5283 -2205 9279 19965 13352 11436 6257 2942 -1677 -8691 -3222
7625 -3222 1874 -2026 -729 -5636 -22564 -32519 -14240 -3659 -3776 -16372 -18632 -15809 -10715 -2510
7611 -2510 7931 14339 22273 14074 7363 10442 -5675 -25916 -26457 -11769 -4482 4584 -3128 -6541
7597 -6541 -6326 1576 -8813 -12536 -5992 -536 3610 1714 5107 -497 -14362 -20467 -13136 -11556 -19487
7582 -19487 -19741 -29925 -30090 -24115 -22996 -24216 -17428 -12996 -23096 -22593 -6803 -12141 -19253 -16645 -14770
7567 -14770 -5011 -383 2508 -960 -1464 3714 -4826 -18225 -2933 13073 16464 18618 9356 -52
7553 -52 8251 8869 6150 -14610 -24872 -18853 -6821 2124 1034 7374 14760 10548 6651 6017 919
7538I19n846K420m113p58J259q156j3459l115K0243J1266q010l74M720N387l386
7523a003O686L109m327Q536L385r82j1970q240M098L573j1926j6118M825Q649
7509a1705J028o680o285j1498K08J0624J1902J3590J0401j0549p324J761k761
7496g288p55Q229O996M76M601j0519n534M92K425J2427R478j134j2127j0090k003
7481d326n125n72R298J087r792k620R440J130j0007q041N021M991k778k412m23
7466a5129O319O387n144p549o658J3264O697j1694p191L523J2226J7905L874n400
7452A1430l572m684j2322O852n855r260R779J5482J9002k92n372q278j2564P828
7438H174K721q363k11q089J4297J0761j7117j7093j0012O456K847O18J1922J0287
$$ plain form
7538 919 -4927 -2507 -6620 -7378 -6119 -14275 -27734 -30849 -10606 660 -7350 -7724 -3004 2383 -1003
7523 -1003 5683 8792 4465 13001 16386 15404 3434 -4806 -708 2865 -9061 -25179 -20354 -11705
7509 -11705 -10677 -17357 -23642 -35140 -34932 -24308 -12406 1184 11585 1036 -6288 -4527 -7288
7496 -7288 -8043 186 7182 7658 12259 1740 -3794 -3302 -877 11550 21028 19894 7767 -2323 -4326
7481 -4326 -9451 -10023 -725 362 -9430 -12050 -2610 -1480 -11487 -19528 -14507 -9516 -12294 -14706 -15129
7466 -15129 -8810 -2423 -7567 -15116 -21774 -8510 -1813 -13507 -20698 -17175 -4949 12956 16830 11430
7452 11430 7858 3174 -9148 -2296 -8151 -17411 -7632 7850 26852 26560 21188 12910 346 8174
7438 8174 10895 2532 2321 -5768 8529 19290 2173 -14920 -24932 -18476 -15629 -15011 -3089 7198
7424G198o888L015j0090r704M727R464J957l714p783K152J1168O016j6704K527
$$ plain form
7424 7198 310 3325 -6765 -16469 -11742 -2278 -321 -4035 -11818 -9666 1502 7518 -9186 -6659
$$ [...]
##END NTUPLES=NMR SPECTRUM
##END=
