##TITLE=Analysis number 313784
Compound Code mo 07381
Book Reference 383/158
Project Code adrs
Chemist Name geraintj
##JCAMPDX= 6.0         $$ Bruker NMR JCAMP-DX V2.0
##DATA TYPE= NMR SPECTRUM
##DATA CLASS= NTUPLES
##ORIGIN= Bruker BioSpin GmbH
##OWNER= NMR
$$ XWIN-NMR		Version 3.5
$$ Wed Sep 21 12:08:54 2005 GMT Daylight Time (UT+1h)  MAYBRIDGE\NMR@NMR_250MHZ
##.OBSERVE FREQUENCY= 250.131544655141
##.OBSERVE NUCLEUS= ^1H
##.ACQUISITION MODE= SIMULTANEOUS (DQD)
##.ACQUISITION SCHEME= undefined
##.AVERAGES= 16
##.DIGITISER RES= 18
##SPECTROMETER/DATA SYSTEM= dpx250
##.PULSE SEQUENCE= zg30
##.SOLVENT NAME= CDCl3
##.SHIFT REFERENCE= (INTERNAL, CDCl3, 0, 16.522)
##AUDIT TRAIL= $$ (NUMBER, WHEN, WHO, WHERE, WHAT)
$$ ##TITLE= Audit trail, XWIN-NMR		Version 3.5
$$ ##JCAMPDX= 5.01
$$ ##ORIGIN= Bruker BioSpin GmbH
$$ ##OWNER= NMR
$$ C:\u/data/dgb/nmr/ADRS/9770/pdata/1/auditp.txt
$$ ##AUDIT TRAIL=  $$ (NUMBER, WHEN, WHO, WHERE, WHAT)
(   1,<2005-09-21 12:08:36.28 +100>,<MAYBRIDGE\NMR>,<NMR_250MHZ>,
      <created by zg, POWCHK disabled, PULCHK disabled
       configuration hash MD5:
       62 19 C7 07 E1 42 D1 B7 37 6C 3D D0 77 39 F9 E6
       data hash MD5: 64K
       3A 16 AE B3 DD 5C E2 47 C3 33 C0 95 BB 7C 7C 87>)
(   2,<2005-09-21 12:08:46.99 +100>,<MAYBRIDGE\NMR>,<NMR_250MHZ>,
      <Start of raw data processing
       ef LB = 0.3 FT_mod = 6 PKNL = 1 SI = 32K 
       data hash MD5: 32K
       4C E9 AC DD 01 48 9A 32 4C 1B 9B 00 47 94 D0 9C>)
(   3,<2005-09-21 12:08:48.81 +100>,<MAYBRIDGE\NMR>,<NMR_250MHZ>,
      <apk 
       data hash MD5: 32K
       D7 F9 3D EC 1F 3D AA F7 47 D5 3F D7 9A 09 16 8B>)
(   4,<2005-09-21 12:08:49.58 +100>,<MAYBRIDGE\NMR>,<NMR_250MHZ>,
      <abs ABSG = 5 
       data hash MD5: 32K
       FC C4 D8 F8 F5 3E EB 45 43 36 2E D3 D1 81 9E 6F>)
$$ ##END=
$$ 
$$ hash MD5
$$ 96 F7 57 9D A5 09 F9 D2 68 DA DE FE F9 37 F9 BC
##$RELAX= 
##$RELAX= 
##$RELAX= 
##$RELAX= 
##$RELAX= 
##$RELAX= 
##$RELAX= 
$$ Bruker specific parameters
$$ --------------------------
##$DU= <C:\u>
##$EXPNO= 9770
##$NAME= <ADRS>
##$PROCNO= 1
##$TYPE= <nmr>
##$USER= <dgb>
##$AMP= (0..31)
100 100 100 100 100 100 100 100 100 100 100 100 100 100 100 100 100 100 
100 100 100 100 100 100 100 100 100 100 100 100 100 100 
##$AQSEQ= 0
##$AQ_mod= 3
##$AUNM= <au_zg>
##$AUTOPOS= <26 >
##$BF1= 250.13
##$BF2= 250.13
##$BF3= 250.13
##$BF4= 250.13
##$BF5= 500.13
##$BF6= 500.13
##$BF7= 500.13
##$BF8= 500.13
##$BYTORDA= 1
##$CFDGTYP= 0
##$CFRGTYP= 5
##$CHEMSTR= <none>
##$CNST= (0..31)
1 1 145 1 1 1 1 1 1 1 1 1 1 1 1 1 1 1 1 1 1 1 1 1 1 1 1 1 1 1 1 1 
##$CPDPRG= <>
##$CPDPRG1= <>
##$CPDPRG2= <>
##$CPDPRG3= <>
##$CPDPRG4= <mlev>
##$CPDPRG5= <mlev>
##$CPDPRG6= <mlev>
##$CPDPRG7= <mlev>
##$CPDPRG8= <mlev>
##$CPDPRGB= <>
##$CPDPRGT= <>
##$D= (0..31)
0 1 0 0 0 0 0 0 0 0.06 0 0 0 0 0 0 0.0002 0 0 0 0 0 0 0 0 0 0 0 0 0 0 
0 
##$DATE= 1127300915
##$DBL= (0..7)
120 120 120 120 120 120 120 120 
##$DBP= (0..7)
150 150 150 150 150 150 150 150 
##$DBP07= 0
##$DBPNAM0= <>
##$DBPNAM1= <>
$$ [...]
##$SUBNAM7= <"">
##$SUBNAM8= <"">
##$SUBNAM9= <"">
##$SW= 20.6930455092707
##$SWIBOX= (0..15)
0 0 3 0 0 0 0 0 0 0 0 0 0 0 0 0 
##$SW_h= 5175.983436853
##$TD= 65536
##$TD0= 1
##$TE= 295.16
##$TE2= 300
##$TE3= 300
##$TEG= 300
##$TL= (0..7)
0 120 120 120 120 120 120 120 
##$TP= (0..7)
150 150 150 150 150 150 150 150 
##$TP07= 0
##$TPNAME0= <>
##$TPNAME1= <>
##$TPNAME2= <>
##$TPNAME3= <>
##$TPNAME4= <>
##$TPNAME5= <>
##$TPNAME6= <>
##$TPNAME7= <>
##$TPOAL= (0..7)
0.5 0.5 0.5 0.5 0.5 0.5 0.5 0.5 
##$TPOFFS= (0..7)
0 0 0 0 0 0 0 0 
##$TUNHIN= 0
##$TUNHOUT= 0
##$TUNXOUT= 0
##$USERA1= <user>
##$USERA2= <user>
##$USERA3= <user>
##$USERA4= <user>
##$USERA5= <user>
##$V9= 5
##$VALIST= <valist>
##$VCLIST= <CCCCCCCCCCCCCCC>
##$VD= 0
##$VDLIST= <DDDDDDDDDDDDDDD>
##$VPLIST= <PPPPPPPPPPPPPPP>
##$VTLIST= <TTTTTTTTTTTTTTT>
##$WBST= 1024
##$WBSW= 4
##$XGAIN= (0..3)
0 0 0 0 
##$XL= 0
##$YL= 0
##$YMAX_a= 360622
##$YMIN_a= -526342
##$ZGOPTNS= <>
##$ZL1= 120
##$ZL2= 120
##$ZL3= 120
##$ZL4= 120
##$ABSF1= 16.522
##$ABSF2= -4.171173
##$ABSG= 5
##$ABSL= 3
##$ALPHA= 0
##$AQORDER= 0
##$ASSFAC= 0
##$ASSFACI= 0
##$ASSFACX= 0
##$ASSWID= 0
##$AUNMP= <proc_1d>
##$AZFE= 0.1
##$AZFW= 0.1
##$BCFW= 0
##$BC_mod= 0
##$BYTORDP= 0
##$COROFFS= 0
##$CY= 12.5
##$DATMOD= 1
##$DC= 0
##$DFILT= <>
##$DTYPP= 0
##$F1P= 14.0000005364418
##$F2P= -0.99999901652339
##$FCOR= 0.5
##$FTSIZE= 32768
##$FT_mod= 6
##$GAMMA= 0
##$GB= 0
##$INTBC= 1
##$INTSCL= 1
##$ISEN= 128
##$LB= 0.3
##$LEV0= 0
##$LPBIN= 0
##$MAXI= 10000
##$MC2= 0
##$MEAN= 0
##$ME_mod= 0
##$MI= 0
##$NCOEF= 0
##$NC_proc= -2
##$NLEV= 6
##$NOISF1= 0
##$NOISF2= 0
##$NSP= 0
##$NTH_PI= 0
##$NZP= 0
##$OFFSET= 16.522
##$PC= 1
##$PHC0= -77.37672
##$PHC1= 7.23022
##$PH_mod= 1
##$PKNL= yes
##$PPARMOD= 0
##$PSCAL= 4
##$PSIGN= 0
##$REVERSE= no
##$SF= 250.13
##$SI= 32768
##$SIGF1= 0
##$SIGF2= 0
##$SINO= 400
##$SIOLD= 32768
##$SREGLST= <1H.CDCl3>
##$SSB= 0
##$STSI= 32768
##$STSR= 0
##$SW_p= 5175.98343685301
##$SYMM= 0
##$S_DEV= 0
##$TDeff= 65536
##$TDoff= 0
##$TI= <Analysis number 999999
Compound Code 99
Book Reference 9
Project Code 9>
##$TILT= no
##$TM1= 0
##$TM2= 0
##$TOPLEV= 0
##$USERP1= <user>
##$USERP2= <user>
##$USERP3= <user>
##$USERP4= <user>
##$USERP5= <user>
##$WDW= 1
##$XDIM= 32768
##$YMAX_p= 370014272
##$YMIN_p= -48889
$$ End of Bruker specific parameters
$$ ---------------------------------
##NTUPLES= NMR SPECTRUM
##VAR_NAME=  FREQUENCY,     SPECTRUM/REAL,   SPECTRUM/IMAG
##SYMBOL=    X,             R,               I
##VAR_TYPE=  INDEPENDENT,   DEPENDENT,       DEPENDENT
##VAR_FORM=  AFFN,          ASDF,            ASDF
##VAR_DIM=   32768,         32768,           32768
##UNITS=     HZ,            ARBITRARY UNITS, ARBITRARY UNITS
##FACTOR=    0.157963299565203, 1,           1
##FIRST=     4132.6476996994, 0,             0
##LAST=      -1043.33573715361, 0,           0
##MIN=       -1043.33573715361, -48889,      0
##MAX=       4132.6476996994, 370014272,     0
$$ Real data points
##PAGE= N=1
##DATA TABLE= (X++(R..R)), XYDATA
$$ [...]
15028a1816p008j50L983R55J2278K783m826q849m085L73J016K003L726P011J0435
$$ -11816 -18824 -18974 -14991 -14036 -1758 1025 -3801 -12650 -16735 -16362 -15346 -13343 -9617 -2606 7829
15013G829j5325k1001j5654K50J4899R344M528k697j0391P059O039J2632m599
$$ 7829 -7496 -28497 -44151 -43901 -29002 -19658 -15130 -17827 -28218 -21159 -15120 -2488 -7087
15000g087P27o86o021J1396M260L502k893R114o749j4445M114J0950j2380p687
$$ -7087 -6360 -7046 -13067 -1671 2589 6091 3198 12312 5563 -8882 -4768 6182 -6198 -13885
14986a3885k218K42j2614N24J3299k96J0824P252L887J769j38P795k612m016n514
$$ -13885 -16103 -15861 -28475 -27951 -14652 -14948 -4124 3128 7015 8784 8646 16441 13829 9813 4299
14971D299m622q339j247J2533K131q132J064l172o650K492J162j0116M98R004
$$ 4299 -323 -8662 -9909 2624 4755 -3377 -2313 -5485 -12135 -9643 -8481 -18597 -18099 -9095
14957i095J316J6975l653j5725k095J0027J5555j251m556J945j1082j3813p665
$$ -9095 -7779 9196 5543 -10182 -12277 -2250 13305 12054 7498 9443 -1639 -15452 -23117
14944b3117N386K862J725O23N49m283o338j569J0371L006P357O859M851p441j5827
$$ -23117 -17731 -14869 -13144 -12521 -11972 -16255 -22593 -24162 -13791 -10785 -3428 3431 8282 841 -14986
14929a4986J2285p400j448K482Q430q59N529J3251l781q586p608P384K476J053
$$ -14986 -2701 -10101 -11549 -9067 -637 -1496 4033 17284 13503 4917 -2691 4693 7169 8222
14915H222R75k1935j6208n13J0420M721K862j175j881K80O812K1765m164j9047
$$ 8222 9197 -12738 -28946 -29459 -19039 -14318 -11456 -12631 -14512 -14232 -7420 14345 10181 -8866
14901h866m46K785k011K400l907J384j080L307n131J811J2663n70P250J1085j6131
$$ -8866 -9312 -6527 -8538 -6138 -10045 -8661 -9741 -6434 -11565 -9754 2909 2339 9589 20674 4543
14886D543j0828M217k840j4363M114K0931q92k2468q441K996O35J6240J2888j4957
$$ 4543 -6285 -2068 -4908 -19271 -15157 5774 4882 -17586 -26027 -23031 -22396 -6156 6732 -8225
14872h225L367M577K333K015n53m192o972L247Q243J549j2213r224P0K798N398
$$ -8225 -4858 -281 2052 4067 3514 -678 -7650 -4403 3840 5389 -6824 -16048 -15978 -13180 -7782
14857g782p18M191J73J0678o18j1914m047J5762P071q494R86m682k480j0057M467
$$ -7782 -8500 -4309 -4136 6542 5924 -5990 -10037 5725 12796 4302 5288 606 -1874 -11931 -7464
14842g464J1321n112l456M766M779K929O611N887q541J23R644K775j4883j4513
$$ -7464 3857 -1255 -4711 55 4834 7763 14374 20261 11720 11843 21487 24262 9379 -5134
14828e134k0207J673L769j636L217j1268J0871O872o253J36L116P654P783m274
$$ -5134 -25341 -23668 -19899 -21535 -18318 -29586 -18715 -11843 -18096 -17960 -14844 -7190 593 -3681
14814c681p439k42Q239P070P095N354k820j4865j5157j3444J3024J766J3444p374
$$ -3681 -11120 -11362 -3123 3947 11042 16396 13576 -1289 -16446 -29890 -16866 -15100 -1656 -9030
14800i030l825J2342K266n888J2582m893q582j3382p036q035J4553J5785P380
$$ -9030 -12855 -513 1753 -4135 8447 3554 -5028 -18410 -25446 -33481 -18928 -3143 4237
14787D237l578j2731N288M522n061m788k411J2902R400K11k558j27n846k33J0459
$$ 4237 659 -12072 -6784 -2262 -7323 -12111 -14522 -1620 7780 7991 5433 5306 -540 -773 9686
14772I686o208j1135J689j0736j1242J2164N347N172O820J1927N914K78j0490
$$ 9686 3478 -7657 -5968 -16704 -27946 -15782 -10435 -5263 1557 13484 19398 19676 9186
14759I186O332O863j978j2803k961o230j401m147L346j92M429O610m436j7635
$$ 9186 15518 22381 20403 7600 4639 -1591 -2992 -7139 -3793 -3985 444 7054 2618 -15017
14745a5017o95M141K72m360J43J1722l718M761J0137J169M938L54j6930j2679
$$ -15017 -15712 -11571 -11299 -15659 -15516 -3794 -7512 -2751 7386 8555 13493 13847 -3083 -15762
14731a5762J517N14j009J702l413N589j286R792m859j8884L5J4640J114J6403
$$ -15762 -14245 -13731 -14740 -13038 -16451 -10862 -12148 -2356 -7215 -26099 -26064 -11424 -10310 6093
14717F093J1392m761o311l052K773l713L984Q749j0989q033o050m245P673l24
$$ 6093 17485 12724 6413 3361 6134 2421 6405 15154 4165 -3868 -9918 -14163 -6490 -6814
14703f814P63l825L007q083j5672Q392N640q284J2051k127M455R094R948m84l907
$$ -6814 -6051 -9876 -6869 -14952 -30624 -22232 -16592 -24876 -12825 -14952 -10497 -1403 8545 8061 4154
14688D154J376k64l902j969J2337R77q00n134J077J326M368K967j2701l007l309
$$ 4154 5530 5266 1364 -605 11732 12709 11909 6775 7852 9178 13546 16513 3812 805 -2504
14673b504j852P1j0950o43J3487R344L921R77l524k009l583J3905p209j679P338
$$ -2504 -4356 -4285 -15235 -15878 -2391 6953 10874 11851 8327 6318 2735 16640 9431 7752 15090
14658A5090p323r79j198N267q871j7585k85K291L227o832k246l566p16N608J0220
$$ 15090 7767 6788 5590 10857 1986 -15599 -15884 -13593 -10366 -17198 -19444 -23010 -23726 -18118 -7898
14643g898j65K982n71P482R215k495l355k124O364j2069o469Q265o475r20M439
$$ -7898 -8063 -5081 -5652 1830 11045 8550 5195 3071 9435 -2634 -9103 -838 -7313 -8233 -3794
14628c794N124K569K845o695j2864K129R972L594J277M017M421j0699j5992r173
$$ -3794 1330 3899 6744 49 -12815 -10686 -714 2880 4157 8174 12595 1896 -14096 -23269
14614b3269l133P040R383j1837n35L506p984m488j288J2213J1967O345J765N515
$$ -23269 -26402 -19362 -9979 -21816 -22351 -18845 -26829 -31317 -32605 -20392 -8425 -2080 -315 5200
14600E200r14o499m013P360R703M775o783j3011j699l780K188n221M779M806J089
$$ 5200 4286 -2213 -6226 1134 10837 15612 8829 -4182 -5881 -9661 -7473 -12694 -7915 -3109 -2020
14585b020Q22l931r442j464j488L441j975P178L284J917o202k342N23n179m191
$$ -2020 -1198 -5129 -14571 -16035 -17523 -14082 -16057 -8879 -5595 -3678 -9880 -12222 -11699 -16878 -21069
14570b1069J0516J6807K844R22j2524r034J256J5628R769r301p756K556J823o785
$$ -21069 -10553 6254 9098 10020 -2504 -11538 -10282 5346 15115 5814 -1942 614 2437 -4348
14556d348q151L908l155J2280Q218L270o993j0297q311o171m368N654l157r553
$$ -4348 -12499 -8591 -11746 534 8752 12022 5029 -5268 -13579 -19750 -24118 -18464 -21621 -31174
14542c1174J0028J1936L313P212k510o414p80J758j3377k13O729n578l639O43
$$ -31174 -21146 -9210 -5897 1315 -1195 -7609 -8389 -6631 -20008 -20221 -13492 -19070 -22709 -22066
14528b2066Q716L87J815l838J1461L250J436l385k628j4681N015o378M290J0558
$$ -22066 -13350 -12963 -11148 -14986 -3525 -275 1161 -2224 -4852 -19533 -14518 -20896 -16606 -6048
14514f048p479N590p326k695P888J3196J029j0666j1308K583R744k316n209j137
$$ -6048 -13527 -7937 -15263 -17958 -10070 3126 4155 -6511 -17819 -15236 -5492 -7808 -13017 -14154
14500a4154M969k981J1400J916q745Q492R836r591l265M235j256M510M817N649
$$ -14154 -9185 -12166 -766 1150 -7595 897 10733 1142 -2123 2112 856 5366 10183 15832
14486A5832k392K260M032j3233k4949m938J1639P656M009Q482j816m497l005p413
$$ 15832 13440 15700 19732 6499 -18450 -23388 -11749 -4093 -84 8398 6582 2085 -920 -8333
14472h333j207M651L140o116Q391L203o346m147k909m860L010J1261J1495M178
$$ -8333 -9540 -4889 -1749 -7865 526 3729 -2617 -6764 -9673 -14533 -11523 -262 11233 15411
14458A5411L029M018j0910j6517m790j0156q273K725J2232N210q769o98O330p639
$$ 15411 18440 22458 11548 -4969 -9759 -19915 -28188 -25463 -13231 -8021 -16790 -17488 -11158 -18797
14444a8797P24O299q696P416Q135j865J38m376K0208L381j0949R3k638N431M703
$$ -18797 -18073 -11774 -20470 -13054 -4919 -6784 -6646 -11022 9186 12567 1618 1711 -927 4504 9207
14429I207j807m259j906q995j3377j589J4204N510O857M605J493L924o797j5259
$$ 9207 7400 3141 1235 -7760 -21137 -22726 -8522 -3012 3845 8450 9943 13867 7070 -8189
14415h189j0690N538M736k487q142r303Q841J7943P103q440P666J1857R382o428
$$ -8189 -18879 -13341 -8605 -11092 -19234 -28537 -19696 -1753 5350 -3090 4576 16433 25815 19387
14401A9387k0671q642M103j136j1749j088K904M414n366L417r411q124N522M181
$$ 19387 -1284 -9926 -5823 -6959 -18708 -19796 -16892 -12478 -17844 -14427 -23838 -31962 -26440 -22259
14387b2259Q888Q204n954r425P446j685J550J4463j1071j2156j008P76l199J73
$$ -22259 -13371 -5167 -11121 -20546 -13100 -14785 -13235 1228 -9843 -21999 -23007 -22231 -25430 -25257
14373b5257R289R07J3876m119M015K810K989q180l196K578m895R576M261K076
$$ -25257 -15968 -15061 -1185 -5304 -1289 1521 4510 -3670 -6866 -4288 -9183 393 4654 6730
14359F730q125K870R215M451R170L179j2542K035P726q881j1993p626j2648J0147
$$ 6730 -1395 1475 10690 15141 24311 27490 14948 16983 24709 15828 3835 -3791 -16439 -6292
14345f292K3875o955j1630Q636j195o244l077o101J176N395m759O662J5851P409
$$ -6292 17583 10628 -1002 7634 6439 195 -2882 -8983 -7807 -2412 -7171 -509 15342 22751
14331B2751k592r57j0675k824N032M299k716o411m487o066q580n104p938O680
$$ 22751 20159 19202 8527 5703 10735 15034 12318 5907 1420 -4646 -13226 -18330 -26268 -19588
14317a9588K0593K161K86n039j0144J152L957J062j597N591p959J372P020J2297
$$ -19588 1005 3166 3452 -1587 -11731 -10579 -6622 -5560 -7157 -1566 -9525 -8153 -1133 11164
14303A1164m838j1609K130j851n088K279J43J826O70j8396j190J160J1192P636
$$ 11164 6326 -5283 -3153 -5004 -10092 -7813 -7670 -5844 -5174 -23570 -24760 -23600 -12408 -4772
14289d772j637j0867o62n6J3776J0271J965j7045o718j2725K72J3504L160j000
$$ -4772 -6409 -17276 -17938 -17994 -4218 6053 8018 -9027 -15745 -28470 -28198 -14694 -11534 -12534
14275a2534J4173j39k25L917J2669r984j4881j3675K630N515K062J0817J2278
$$ -12534 1639 1500 1275 5192 17861 7877 -7004 -20679 -18049 -12534 -10472 345 12623
14262A2623l349j5400N927l610r376k887J0030J0686M270j0531k480J3053j799
$$ 12623 9274 -6126 -199 -3809 -13185 -16072 -6042 4644 8914 -1617 -4097 8956 7157
14249G157N58j0465o609O826p30R264J0093j490q350L917l669r214o174q432p70
$$ 7157 7715 -2750 -9359 -2533 -3263 6001 16094 14604 6254 10171 6502 -2712 -8886 -17318 -18088
14234a8088J7763J6613o26j0982r852L112n041l49j0343P612J3422j963j233L889
$$ -18088 -325 16288 15662 4680 -5172 -2060 -7101 -7450 -17793 -10181 3241 1278 45 3934
14220C934l545o229O15j5169o020J1634R540L524k720o340K228m577J1626K667
$$ 3934 389 -5840 -5225 -20394 -26414 -14780 -5240 -1716 -4436 -10776 -8548 -13125 -1499 1168
14206A168r833q82n875p194P331O277P712l011k286o329m930n93J618K842L174
$$ 1168 -8665 -9547 -15422 -22616 -15285 -9008 -1296 -4307 -6593 -12922 -17852 -18445 -16827 -13985 -10811
14191a0811r466M355J3750k06o749P948P686O689n663j0113j7206M194N101R284
$$ -10811 -20277 -15922 -2172 -2378 -9127 -1179 6507 13196 7533 -2580 -19786 -15592 -10491 -1207
14177a207k51n084p881N158p025j35J1367J6457q149M897k436r783J748R283J776
$$ -1207 -1458 -6542 -14423 -9265 -16290 -16425 -5058 11399 3250 8147 5711 -4072 -2324 6959 8735
14162H735n655j789j60M650N313j425j3150k201Q092M521o06l194j2022n087R330
$$ 8735 3080 1291 1131 5781 11094 9669 -3481 -5682 2410 6931 6325 3131 -8891 -13978 -4648
14147d648l828j0242j917Q988O858k042p792M972j595J182k098q971K627M726
$$ -4648 -8476 -18718 -20635 -11647 -4789 -6831 -14623 -9651 -11246 -10064 -12162 -21133 -18506 -13780
14133a3780L680r002J11K135O884R148N620k25L468M431O04m205r532m394m344
$$ -13780 -10100 -19102 -18991 -16856 -9972 -824 4796 4571 8039 12470 13074 8869 -663 -5057 -9401
14118i401N34J288K589R933P03Q573O464j2447n698j1862K037J2913O877j5558
$$ -9401 -8867 -7579 -4990 4943 5646 14219 20683 8236 2538 -9324 -7287 5626 12503 -3055
14104c055j4202n059R122O324K821M031N97j0274k346J1403j439K561j0740j4147
$$ -3055 -17257 -22316 -13194 -6870 -4049 -18 579 -9695 -12041 -638 -2077 484 -10256 -24403
14090b4403L210P358k8k286J1819M177j0767r57M921N061O396P173O369j188o076
$$ -24403 -21193 -13835 -13863 -16149 -4330 -153 -10920 -11877 -6956 -1895 4501 11674 18043 16855 10779
14075A0779k816o594j239l089Q79q596j7584J2402J2437M083j1723r955n119J0116
$$ 10779 7963 1369 130 -2959 -2080 -10676 -28260 -15858 -3421 662 -11061 -21016 -26135 -16019
14061a6019P480J394j2396N96J7492q047n091J7762L208o731l051k483q42q750
$$ -16019 -8539 -7145 -19541 -18945 -1453 -9500 -14591 3171 6379 -352 -3403 -5886 -6728 -15478
14047a5478N663L063J095P230K607L952J0201j0922r869N441R272j27j9394j1718
$$ -15478 -9815 -6752 -5657 1573 4180 8132 18333 7411 -2458 2983 12255 12128 -7266 -18984
14033a8984j8797P029J6294M875k130N471P842k64m203M864o963j0558r238j8882
$$ -18984 -37781 -30752 -14458 -9583 -11713 -6242 1600 1336 -2867 1997 -4966 -15524 -24762 -43644
14019d3644j315O706J4300P942j72l889n25Q643O626J2560J0044j181j2794q321
$$ -43644 -44959 -38253 -23953 -16011 -16183 -20072 -20597 -11954 -5328 7232 17276 16095 3301 -5020
14005e020M709j528K933J0616J263j0721r692j924P741l404l023M191L251O088
$$ -5020 -311 -1839 1094 11710 12973 2252 -7440 -9364 -1623 -5027 -8050 -3859 -608 5480
13991E480J5486l712N34j2697K705J1614p762o014k111j545q684l595K97R188
$$ 5480 20966 17254 17788 5091 7796 19410 11648 5634 3523 1978 -6706 -10301 -10004 -816
13977h16J0117p063o359j2709o230R301J0863Q756j0073n322J0190l687r489Q221
$$ -816 9301 2238 -4121 -16830 -23060 -13759 -2896 5860 -4213 -9535 655 -3032 -12521 -4300
13963d300J5827r61L865j1571j2610M117M253R81Q936O341L45r80l179j171m04
$$ -4300 11527 10566 14431 2860 -9750 -5633 -1380 -399 8537 14878 15223 14243 11064 9893 9489
13948I489K387L96N791r145k530O321J015M506N002p467n008J3576N086N071J015
$$ 9489 11876 12272 18063 8918 6388 12709 13724 18230 23232 15765 10757 24333 29419 34490 35505
13933C5505n73m198n592P66P585q521J995Q775q953q341L180j1297J0305J4930
$$ 35505 34932 30734 25142 25908 33493 24972 26967 35742 26789 18448 21628 10331 20636 35566
13919C5566o94J3320J0088o843j2611M206M040P812K677j1763j2991j0593J7703
$$ 35566 34872 48192 58280 51437 38826 43032 47072 54884 57561 45798 32807 22214 39917
13906C9917j194r893L992q481l437n122J3348J783j816k365j111K448J1510J0438
$$ 39917 38723 28830 32822 24341 20904 15782 29130 30913 29097 26732 25621 28069 39579 50017
13892E0017j0201k5587j2740J5421J5394N060k57o828j061j807j0205l761j515
$$ 50017 39816 14229 1489 16910 32304 37364 37107 30279 29218 27411 17206 13445 11930
13879A1930Q298o13j7973m326j900N124k642n305q601O864J1120J0143l448q541
$$ 11930 20228 19615 1642 -2684 -4584 540 -2102 -7407 -16008 -9144 1976 12119 8671 130
13865A30j975J0854J2622J4149k006L733q698J0412P762J0067O207L32j8372o377
$$ 130 -1845 9009 21631 35780 33774 37507 28809 39221 46983 57050 63257 63589 45217 38840
13851C8840k942j0501K278J2336n297j4024j0053o42J4011J8866J8136m50n157
$$ 38840 35898 25397 27675 40011 34714 20690 10637 9995 24006 42872 61008 60558 55401
13838E5401R369R458J620l995j7868m432J2797N519j0009q340p005R524n958j1644
$$ 55401 64770 74228 75848 71853 53985 49553 62350 67869 57860 49520 42515 52039 46081 34437
13824C4437P587J0994j4059j9143M955K913O726p331M552R473o594o691M831O798
$$ 34437 42024 53018 38959 19816 24771 27684 34410 27079 31631 41104 34510 27819 32650 39448
13810C9448r991j0568o82n20L694n78J5792K0717j0348j6728J741L748n247p402
$$ 39448 29457 18889 18207 17687 21381 20803 36595 57312 46964 30236 31977 35725 30478 23076
13796B3076q815O855J839p742j896L617j646Q80K047P280r82l688j5894q684K419
$$ 23076 14261 21116 22955 15213 13317 16934 15288 16168 18215 25495 24513 20825 4931 -3753 -1334
13781a334L574J458L095J311r733l422O930O21Q86J601P027J6463J2921n771p104
$$ -1334 2240 3698 6793 8104 -1629 -5051 1879 2500 3386 4987 12014 28477 41398 35627 28523
13766B8523p533p604l304j071L637j772o791j037j860Q147m090p833N184r041
$$ 28523 20990 13386 10082 9011 12648 10876 4085 3048 1188 9335 5245 -2588 2596 -6445
13752f445J511J2473m792P940P250J1441J0981K804j9366j3874l267O338O581
$$ -6445 -4934 7539 2747 10687 17937 29378 40359 43163 23797 9923 6656 12994 19575
13739A9575R612N685k129j1235J850M802n431j251m265j3324O781J6180p096P042
$$ 19575 29187 34872 32743 21508 23358 28160 22729 21478 17213 3889 10670 26850 19754 26796
13725B6796K862j0505j4268J219J331L004O585M872M652K721k148j943P842K381
$$ 26796 29658 19153 4885 6104 7435 10439 17024 21896 26548 29269 27121 25178 33020 35401
13711C5401M291K18j531l824m85p118r134O656P306N686l228m077O790O807p028
$$ 35401 39692 39910 38379 34555 34070 26952 17818 24474 31780 37466 34238 30161 36951 43758 36730
13696C6730j6303j7136J0776J8415J2858l755r145m922j192R449O06o164m298
$$ 36730 20427 3291 14067 32482 45340 41585 32440 27518 26326 35775 36381 30217 25919
13683B5919M662O454J3397J129j0317J504O891K118R901j140p489m005k3529P514
$$ 25919 30581 37035 50432 51561 41244 42748 49639 51757 61658 60518 53029 49024 25495 33009
13669C3009J1052O641n128k698j2848r46L879J0855m402n869j552j2020J553J668
$$ 33009 44061 50702 45574 42876 30028 29082 32961 43816 39414 33545 31993 19973 21526 23194
13655B3194N091P270P138j1716n067n391Q653Q142J127j2034q915M346O064L585
$$ 23194 28285 35555 42693 30977 25910 20519 29172 37314 38441 26407 17492 21838 27902 31487
13641C1487J2543J3557O326M73r55j8116k0861M051K980q315l224J0688J4994
$$ 31487 44030 57587 63913 64386 63431 45315 24454 28505 31485 23170 19946 30634 45628
13628D5628L438L072j2800j3071J8141J0744p679K376J0175P837m678J977J0937
$$ 45628 49066 52138 39338 26267 44408 55152 47473 49849 60024 67861 63183 65160 76097
13615G6097j0620q383r828j6578p758J1648J6989Q200q397p55L927J862m107r404
$$ 76097 65477 57094 47266 30688 22930 34578 51567 59767 51370 50615 54542 56404 52297 42893
13601D2893l279M844R837l566q194j676J3415K59l245l588k457j933j866j1762
$$ 42893 39614 44458 54295 50729 42535 40859 54274 54533 51288 47700 45243 43310 41444 29682
13587B9682K335P699m068O180J436j533J012j8820l841L517J575p808J5582K0002
$$ 29682 32017 39716 35648 41828 43264 41731 42743 23923 20082 23599 25174 17366 32948 52950
13573E2950M214Q32J289m431j6984j3704R640Q375q556Q696O341r872m902l619
$$ 52950 57164 57996 59285 54854 37870 24166 33806 42181 33625 42321 48662 38790 33888 30269
13559C0269j5935r377J671p62R471J6468J2874L741k636o907K157l822n876N110
$$ 30269 14334 4957 6628 5866 15337 31805 44679 48420 45784 38877 41034 37212 31336 36446
13545C6446j0328m318O999J3149P213N356j628K254M741p101M492L218p808j1723
$$ 36446 26118 21800 28799 41948 49161 54517 52889 55143 59884 52783 57275 60493 52685 40962
13531D0962j287M326Q816q05o704L054j1347j2627o84J2405N190p156m187J1399
$$ 40962 39675 44001 52817 52012 45308 48362 37015 24388 23704 36109 41299 34143 29956 41355
13517D1355K53J2776j488k815J0634j294j615j2264r203m398J2498Q761P053M985
$$ 41355 41608 54384 52896 50081 60715 59421 57806 45542 36339 31941 44439 53200 60253 65238
13503F5238n454k0292l994R960J7528K2863j356O155p045j4847l438p440Q256
$$ 65238 59784 39492 35498 45458 62986 85849 84493 90648 83603 68756 65318 57878 66134
13490F6134N060n572R011n36K641l329L819J1790j1851r438N891j940J192J040
$$ 66134 71194 65622 74633 74097 76738 73409 77228 89018 77167 67729 73620 71680 72872 73912
13476G3912J7742R465j3850k6964o031K0843Q293o377l532M128J2297N789K537
$$ 73912 91654 101119 87269 60305 54274 75117 83410 77033 73501 77629 89926 95715 98252
13463I8252P65p359n432j515j2320k312K885O948Q811R37J1376k663p607q017
$$ 98252 99017 91658 86226 84711 72391 70079 72964 79912 88723 89660 101036 98373 90766 82749
13449H2749J2729J2086J3731N977o993p467q342j5502m488k154M5K576P535L694
$$ 82749 95478 107564 121295 127272 120279 112812 104470 88968 84480 82326 82371 84947 92482 96176
13435I6176R774J2150m639L182K1338R397k887n39J2344o164j1299K716l981p039
$$ 96176 105950 118100 113461 116643 137981 147378 144491 143952 156296 150132 138833 141549 137568 130529
13421A30529R575J0946r426k0245n706r70n665J2150O123n60M301R373J8554J4408
$$ 130529 140104 151050 141624 121379 115673 114703 109038 121188 127311 126751 131052 140425 158979 173387
13407A73387j2381j1535j72M784P014O026O156L25N884K970J2797R654Q790P453
$$ 173387 161006 149471 149299 154083 161097 167123 173279 173604 179488 182458 195255 204909 213699 221152
13393B21152J2662j653O658J366P2J2314j0404J67L622m514P993K2900Q16J1152
$$ 221152 233814 232161 238819 240185 240257 252571 242167 242334 245956 241442 249435 272335 273151 284303
13379B84303J5525r328j0264m034O148k366l719l368O984J6817k617J666Q600
$$ 284303 299828 290500 280236 276202 282350 279984 276265 272897 279881 296698 294081 295747 304347
13366C04347J3975K1278J1529J655K985M371J3126r355M326O042P533J2831J5333
$$ 304347 318322 339600 351129 352784 355769 360140 373266 363911 368237 374279 381812 394643 409976
13353D09976J1974J5471Q135J0014J905J0512Q345K70J0524J1424R399J4858K546
$$ 409976 421950 437421 445556 455570 457475 467987 476332 476602 487126 498550 507949 522807 525353
13340E25353J9138R632q557O290L2832L8420J4724J174R864J1158J6386K7365
$$ 525353 544491 554123 545566 551856 584688 623108 637832 639006 648870 660028 676414 703779
13328G03779K4284K2086K3535K2764J4758J8401L0809K1136J3544L3388L3137
$$ 703779 728063 750149 773684 796448 811206 829607 860416 881552 895096 928484 961621
13317I61621K6852K4911K9560L3790Q817L4823M7511N3812M1046L5525K4482L2497
$$ 961621 988473 1013384 1042944 1076734 1085551 1120374 1167885 1221697 1262743 1298268 1322750 1355247
13305A355247N4794M7427M1843M5487M9099L9159M2390N5043P1079O7784O3215
$$ 1355247 1410041 1457468 1499311 1544798 1593897 1633056 1675446 1730489 1801568 1869352 1932567
13294A932567P2738M9358M7335M2465P4641R5018P4539N2465O0111O4305P8742
$$ 1932567 2005305 2054663 2101998 2144463 2219104 2314122 2388661 2441126 2501237 2565542 2644284
13283B644284P5958N2507P3027P7633P6357P0862O9722O4426O3531N7827P3032
$$ 2644284 2720242 2772749 2845776 2923409 2999766 3070628 3140350 3204776 3268307 3326134 3399166
13272C399166Q2493P6920N1823M7440L6308N3406N9856N3331N6577M5569M9507
$$ 3399166 3481659 3558579 3610402 3657842 3694150 3747556 3807412 3860743 3917320 3962889 4012396
13261D012396N9357M6219M5833L3605K4762L0088M1348K6852J3750J4549Q389
$$ 4012396 4071753 4117972 4163805 4197410 4222172 4252260 4293608 4320460 4334210 4348759 4357148
13250D357148P039O646J0589k34J5156N814j609j7761k2367k4472k5468j8427
$$ 4357148 4364187 4370833 4381422 4381188 4396344 4402158 4400549 4382788 4360421 4335949 4310481 4292054
13238D292054j2562j6637k9715k2295k9800m1741j3237j1996l0346k4043k2104
$$ 4292054 4279492 4262855 4233140 4210845 4181045 4139304 4126067 4114071 4083725 4059682 4037578
13227D037578m3584k2088j7322l3960k4236k3739k7719l6745l6909j9386n648
$$ 4037578 3993994 3971906 3954584 3920624 3896388 3872649 3844930 3808185 3771276 3751890 3746242
13216C746242k669j9157j1812J0410P640R506j864m660J6007M507K219N952J0452
$$ 3746242 3743573 3724416 3712604 3723014 3730654 3740160 3738296 3733636 3749643 3754150 3756369 3762321 3772773
13203C772773J7612L2892K8686K4694K8546L5599K3781L3476L1945L8994M2440
$$ 3772773 3790385 3823277 3851963 3876657 3905203 3940802 3964583 3998059 4030004 4068998 4111438
13192D111438L4396M5730M9626K8050K2914L4483K1274J9265M1860M2570K5045
$$ 4111438 4145834 4191564 4241190 4269240 4292154 4326637 4347911 4367176 4409036 4451606 4476651
13181D476651M0817L6315J4796K2439O130K7926K6981J5562J487K460j3434k601
$$ 4476651 4517468 4553783 4568579 4591018 4597148 4625074 4652055 4667617 4669104 4671564 4658130 4655529
13169D655529J0703l578j0128j6365j5725p669l2517l2554k9396l6087m9662n3996
$$ 4655529 4666232 4662654 4652526 4636161 4620436 4612767 4580250 4547696 4518300 4482213 4432551 4378555
13157D378555m3299m0105m3386l7247n6604o3877n3884p0461o2879o5736o0531
$$ 4378555 4335256 4295151 4251765 4214518 4157914 4094037 4040153 3969692 3906813 3841077 3780546
13146C780546o7467p8394o2518p4007p7766p0224p1680o8482q5246r1182p7203
$$ 3780546 3713079 3634685 3572167 3498160 3420394 3350170 3278490 3210008 3124762 3033580 2956377
13135B956377p2258p1128p8808q4317p3146o4360p9807p2239o2073o5660p2490
$$ 2956377 2884119 2812991 2734183 2649866 2576720 2512360 2432553 2360314 2298241 2232581 2160091
13124B160091q1496n4876n2674o3984o3484o1577n3479n4601m3856m3790m1955
$$ 2160091 2078595 2023719 1971045 1907061 1843577 1782000 1728521 1673920 1630064 1586274 1544319
13113A544319l4471l4274m6543m6657n1210l8937k4009k9920l6461l0704k8486
$$ 1544319 1509848 1475574 1429031 1382374 1331164 1292227 1268218 1238298 1201837 1171133 1142647
13102A142647l6375l1666l0505m1421k6492k3187k3995j8018j2671j5113k3676
$$ 1142647 1106272 1074606 1044101 1002680 976188 953001 929006 910988 898317 883204 859528
13091H59528l1624k6512l500k2191k5831k2275j8422j6610j4033k1245k0639J517
$$ 859528 827904 801392 797892 775701 749870 727595 709173 692563 678530 657285 636646 638163
13079F38163m292k0168j6864k3164j3060l886o261j6655k1303j1370o659L63q467
$$ 638163 633871 613703 596839 573675 560615 556729 550468 533813 512510 501140 494481 494844 486377
13066D86377k167k732j7274j8465j004N84l741k3907j1831l420n171j4478p639
$$ 486377 484210 481478 464204 445739 444735 445319 441578 417671 405840 402420 397249 382771 375132
13053C75132L108L478l508j0981l622j1966K763j0358k6000j5672j126o423m739
$$ 375132 378240 381718 378210 367229 363607 351641 354404 344046 318046 302374 301248 294825 290086
13040B90086O093J619p356j2223j0011j854N902N437Q066p411j5757j6643j1257
$$ 290086 296179 297798 290442 278219 268208 266354 272256 277693 285759 278348 262591 245948 234691
13027B34691J965J0426L374n163M670p061j2624j9283j0151m819m899J0802J6117
$$ 234691 236656 247082 250456 245293 249963 242902 230278 210995 200844 196025 191126 201928 218045
13014B18045n968j1375j7570r499J2662J888J769R500k11n917j0052o640j981
$$ 218045 212077 200702 183132 173633 186295 188183 189952 199452 199241 193324 183272 176632 174651
13001A74651n548j1898L088q109n334o571j0985p240m768J5172J4942o288J869
$$ 174651 169103 157205 160293 152184 146850 140279 129294 122054 117286 132458 147400 141112 142981
12988A42981l297M541P937j071p161J122j1697j3581k656m672L499M671R378j041
$$ 142981 139684 144225 152162 151091 143930 145052 133355 119774 117118 112446 115945 120616 129994 128953
12974A28953j3842L703K029j0260k349k327p614L248O727L1M63L073k043l496
$$ 128953 115111 118814 120843 110583 108234 105907 98293 101541 108268 108299 108762 111835 109792 106296
12960A06296r575l993j3651K0716L203j8676n463j6201m702P209L528Q769O233
$$ 106296 96721 92728 79077 99793 102996 84320 78857 62656 57954 65163 68691 77460 83693
12947H3693j4R545N917M926J3077K90j0325j1943j4292j4519n369J360j524j265
$$ 83693 83679 93224 99141 104067 117144 117434 107109 95166 80874 66355 60986 62346 60822 59557
12933E9557K0207J567q229j4351j343J0326J5586N047P099q802j6521n077Q88
$$ 59557 79764 81331 73102 58751 57408 67734 83320 88367 95466 86664 70143 65066 65954
12920F5954P117J2514l283m510j4889R040J8827J787j9740j6423k247K2702N207
$$ 65954 73071 85585 82302 77792 62903 71943 90770 92557 72817 56394 54147 76849 82056
12907H2056j5970m835N803j3628J1040J596j2010j080n990j3545j0448m69J91
$$ 82056 66086 61251 67054 53426 64466 66062 54052 52972 46982 33437 22989 22520 22711
12894B2711r85K855L306n667N816j0389J425N55L102J4890q660K003J0168M970
$$ 22711 21726 24581 27887 22220 28036 17647 19072 19627 22729 37619 28959 30962 41130 46100
12880D6100P92P343J9040O061j5713j3312p120N373K874n466O848P594m916K131
$$ 46100 46892 54235 73275 79336 63623 50311 43191 48564 51438 45972 52820 60414 55498 57629
12866E7629J4108q463j1896j5272p378J8988K64q264J1297J3464K471J163j873
$$ 57629 71737 63274 51378 36106 28728 47716 47980 39716 51013 64477 66948 68111 66238
12853F6238K32k252K977M643O334O13n260l863j1933q444Q033m22p671O749P750
$$ 66238 66470 64218 67195 71838 78172 78785 73525 69662 57729 49285 57318 56896 49225 55974 63724
12838F3724M484L032n808Q11J2497j1279J97O348k0236k996J81R853M090J839
$$ 63724 68208 71240 65432 66243 78740 67461 67658 74006 53770 50774 50955 60808 64898 66737
12824F6737n728R34l608j1608j0889J2469O004J462J319N365k546j2071J223o195
$$ 66737 61009 61943 58335 46727 35838 48307 54311 55773 57092 62457 59911 47840 49063 42868
12810D2868o543j6035M106J5827N125N607J1946n57q601O431J6320m89j0686O546
$$ 42868 36325 20290 24396 40223 45348 50955 62901 62344 53743 60174 76494 76005 65319 71865
12796G1865o626j6402n399K164J8116R237M42J1193L653o506j862r44r311p81
$$ 71865 65239 48837 43438 45602 63718 72955 73397 84590 88243 81737 79875 78931 69620 68839
12782F8839l326P235L247m500j0476j356m589L901N401q981j3223M620j70m949
$$ 68839 65513 72748 75995 71495 61019 59663 55074 58975 64376 55395 42172 46792 46622 41673
12768D1673P888M520J062J376Q761P118K182J705J0235q468o392K517K953p560
$$ 41673 49561 54081 55143 56519 65280 72398 74580 76285 86520 78052 71660 74177 77130 69570
12754F9570L116J598r705k869K408J912M171J084o072j1569l818Q119N827Q139
$$ 69570 72686 74284 64579 61710 64118 66030 70201 71285 65213 53644 49826 57945 63772 71911
12740G1911L846j6335n952P360n820j2792M481j2089o013K395R08p486j527R613
$$ 71911 75757 59422 53470 60830 55010 42218 46699 34610 28597 30992 31900 24414 22887 32500
12726C2500J5739O842K585r22o741p973j5658J02K281L47K095R796L061j3706
$$ 32500 48239 55081 57666 56744 50003 42030 26372 26474 28755 29102 31197 40993 44054 30348
12712C0348l457n460O854J7050M606j8345j534M609N73J4397J1916j5615j0303
$$ 30348 26891 21431 28285 45335 49941 31596 30062 34671 35244 49641 61557 45942 35639
12699C5639n22p625L962M921j2653l605l87J2615J138m355l361N764L98N708j717
$$ 35639 35117 27492 31454 36375 23722 20117 19730 32345 33483 29128 25767 31531 31929 37637 35920
12684C5920n704j4851o359J3357J3936R671q505q970p22o485r341Q495j422k787
$$ 35920 30216 15365 9006 22363 36299 45970 37465 28495 27773 21288 11947 20442 19020 16233
12670A6233P687p660k00K744l00k227M731N740L821m310j3423m332m444N149K101
$$ 16233 23920 16260 16060 18804 18504 16277 21008 26748 30569 26259 12836 8504 4060 9209 11310
12655A1310P14j340l855M291M495m414J813j7661N726N850n438j1517J960J3761
$$ 11310 12024 10684 6829 11120 15615 11201 13014 -4647 1079 6929 1491 -10026 -8066 5695
12641E695r590j481l792K7674k405j1517q509K126J8501J530K640l829j5431o386
$$ 5695 -3895 -5376 -9168 18506 16101 4584 -3925 -1799 16702 18232 20872 17043 1612 -4774
12627d774L669Q702N554j0716l553L065J2970J3113j3701q763j1226p907P964
$$ -4774 -1105 7597 13151 2435 -1118 1947 14917 28030 14329 5566 -5660 -13567 -5603
12614e603J3038J9889M800q31o609l763m638n446N269l372j0232k2363j24N05
$$ -5603 7435 27324 32124 31293 24684 20921 16283 10837 16106 12734 2502 -19861 -19985 -19480
12600a9480P355P131Q154J0105j044m059r905L970J2397k250j5733j1293m155
$$ -19480 -12125 -4994 3160 13265 12221 8162 -1743 2227 14624 12374 -3359 -14652 -18807
12587a8807J8238N742L969O974j8255j3097L081O093J2026K0842j0120j4904N04
$$ -18807 -569 5173 9142 16116 -2139 -15236 -12155 -6062 5964 26806 16686 1782 2286
12574B286j129j4340m23l21Q38N432L643j331m309P057O921N205j399m76j6025
$$ 2286 1157 -13183 -13606 -13927 -13089 -7657 -4014 -5345 -9654 -2597 4324 9529 8130 7654 -8371
12559h371O663J1170o214L579P481K293j0566n25J807J60J360j854q648p68o197
$$ -8371 -1708 9462 3248 6827 14308 16601 6035 5510 7317 7477 8837 6983 -1665 -2433 -8630
12544h630l228O377r14m172J1598j031J111n790q977JL46J336J2646j069m724
$$ -8630 -11858 -5481 -6395 -10567 1031 0 1111 -4679 -13656 -13655 -13309 -11973 673 -396 -5120
12529e120m34j237P561N7K442P91N694K923j1763q447N091J751J2805Q903j5914
$$ -5120 -5554 -6791 770 827 3269 4060 9754 12677 914 -7533 -2442 -691 12114 21017 5103
12514E103p318R501p664j1656J3405J2611l200j3398O480J455k113J3862k415
$$ 5103 -2215 7286 -378 -12034 1371 13982 10782 -2616 3864 5319 3206 17068 14653
12501A4653n628k001m594k0740J559N817J8675j110n914m439m933j302p552K611
$$ 14653 9025 7024 2430 -18310 -16751 -10934 7741 6631 717 -3722 -8655 -9957 -17509 -14898
12487a4898M005L807m429Q615K764r351j290P107O974M066L172j592J819J4973
$$ -14898 -10893 -7086 -11515 -2900 -136 -9487 -10777 -3670 3304 7370 10542 8950 10769 25742
12473B5742J7949J1047J1490J3434O853j6536l0759k7227j5903m548K366J2237
$$ 25742 43691 54738 66228 79662 86515 69979 39220 11993 -3910 -8458 -6092 6145
12461F145j891p667k686J791L543n15p479j609J725m031Q271j175j1441J268R649
$$ 6145 4254 -3413 -6099 -4308 -765 -1280 -8759 -10368 -8643 -12674 -4403 -5578 -17019 -15751 -6102
12446f102n891j3965p881M86J5070P132J4595j0414n897J0914J488K622P098l315
$$ -6102 -11993 -25958 -33839 -33353 -18283 -11151 3444 -6970 -12867 -1953 -465 2157 9255 5940
12432E940m451j110M148j786L671j322O179p374l134Q657J270o727n713k161M208
$$ 5940 1489 379 4527 2741 6412 5090 11269 3895 761 9418 10688 3961 -1752 -3913 295
12417B95J2006J1292M995j1229m947K842O048O899j5032j3824M76L002j1153q43
$$ 295 12301 23593 28588 17359 12412 15254 21302 28201 13169 -655 -179 2823 -8330 -9173
12403i173O758J2040m525j0527J191J575M544J7633N497p395r12l603L743j749
$$ -9173 -2415 9625 5100 -5427 -4236 -2661 1883 19516 25013 17618 16706 13103 16846 15097
12389A5097M164n325o795m922p577M846Q775J3989R241K848j1329q388J566O788
$$ 15097 19261 13936 7141 2219 -5358 -512 8263 22252 31493 34341 23012 14624 16190 22978
12375B2978P577o993J412L49j2741o997J902n09o932l406J5033O192k732l22L659
$$ 22978 30555 23562 24974 25323 12582 5585 7487 6978 46 -3360 11673 17865 15133 14811 18470
12360A8470n787j0736j088k9P402P736o391k504J608L309M274R786M379R926m585
$$ 18470 12683 1947 859 830 8232 15968 9577 7073 8681 11990 16264 26050 30429 40355 35770
12345C5770j1553k1829J334J0213K810P781m342r646K201J8520k354j6152o221
$$ 35770 24217 2388 3722 13935 16745 24526 20184 10538 12739 31259 28905 12753 6532
12332F532L263m256n335M184Q089P309O408j854j5599J354N847q903M313J965
$$ 6532 9795 5539 204 4388 12477 19786 26194 24340 8741 10095 15942 7039 11352 13317
12318A3317L618L819K444j559j0076M549L288n315j2916n84J646J355R849m49
$$ 13317 16935 20754 23198 21639 11563 16112 19400 14085 1169 585 2231 3586 13435 12986
12304A2986j5739q49Q087O911R447l127m812J0215L641q590j5064L843k128N987
$$ 12986 -2753 -3602 4485 11396 20843 17716 12904 23119 26760 18170 3106 6949 4821 10808
12290A0808J5305L461K511K873j2303j4985l97J2191R839q351q396O340J1989
$$ 10808 26113 29574 32085 34958 22655 7670 7273 19464 29303 20952 12556 18896 30885
12277C0885L003o983j3672p303m412P071J1368Q31k869Q68Q291j2647o888K310
$$ 30885 33888 26905 13233 5930 1518 8589 19957 20788 17919 18787 27078 14431 7543 9853
12263I853m793O940N701r966r132L498P768R026k336r636L204p92m158M426O457
$$ 9853 5060 12000 17701 7735 -1397 2101 9869 18895 16559 6923 10127 9335 5177 9603 16060
12248A6060j0172k31N543L848j5961K121J4065n325o507M127K321K2935J2876
$$ 16060 5888 5657 11200 15048 -913 1208 15273 9948 3441 7568 9889 32824 45700
12235D5700o78j5877k8727o909J472L287J795M386j75J930N920r837o638K314
$$ 45700 45022 29145 418 -6491 -5019 -1732 63 4449 4274 6204 12124 2287 -4351 -2037
12221b037j2266l226J1355R34P189N084J6251R826j4742j4208r288R153J6526
$$ -2037 -14303 -17529 -6174 -5240 1949 7033 23284 33110 18368 4160 -5128 4025 20551
12208B0551J2010m991O34p385k7820j2220R811J3972J0390J0670M683J0453K855
$$ 20551 32561 27570 28204 20819 -7001 -19221 -9410 4562 14952 25622 30305 40758 43613
12195D3613j6049n807p106m503j916j0628j184L416O150o7j3463L554O999J772
$$ 43613 27564 21757 14651 10148 8232 -2396 -3580 -164 5986 5919 -7544 -3990 3009 4781
12181D781M487R464l906j368K104j3639P95L449j968R006J0114k746j0833k825
$$ 4781 9268 18732 14826 13458 15562 1923 2718 6167 4199 13205 23319 20573 9740 6915
12167F915L622r006m264O678p28O601J7335N422k576k970K870p522l13N239o65
$$ 6915 10537 1531 -2733 3945 3217 9818 27153 32575 29999 27029 29899 22377 22064 27303 26638
12152B6638M523M236J149N988j446j4204r09O360l097o557K880o745o501r519
$$ 26638 31161 35397 36546 42534 41088 26884 25975 32335 29238 22681 25561 18816 12315 2796
12138B796J87M610j361j930P552q620J808L517J2549K879Q784J774K17n480o521
$$ 2796 2983 7593 6232 4302 11854 3234 5042 8559 21108 23987 32771 34545 34762 29282 22761
12123B2761J62n713p890J1034J6389r46K458P589Q942p208O551K595k2535o97
$$ 22761 22923 17210 9320 20354 36743 35797 38255 45844 54786 47578 54129 56724 34189 33492
12109C3492P153Q114p56j4034M707R942l617q896n05R588j0286j4060J732N619
$$ 33492 40645 48759 48003 33969 38676 48618 45001 36105 35600 45188 34902 20842 22574 28193
12095B8193J2020J8614R374k035r598k779O908M579r957o97J4494N693J4876K683
$$ 28193 40213 58827 68201 66166 56568 53789 60697 65276 55319 54622 69116 74809 89685 92368
12081I2368J441n461l712j0110q819Q294o843k5197p962k761L094q170k418J1350
$$ 92368 93809 88348 84636 74526 65707 74001 67158 41961 33999 31238 34332 26162 23744 35094
12067C5094L675o746j1447R214P677j938R262O594M809J0635m358j155L199K933
$$ 35094 38769 32023 20576 29790 37467 35529 44791 51385 56194 66829 62471 61316 64515 67448
12053F7448j956L219M314k466q773m834j987M476K6392O138L375K1823J2062J2777
$$ 67448 65492 68711 73025 70559 61786 56952 54965 59441 85833 91971 95346 117169 129231 142008
12039A42008K2647J4214J5285J0277L1013L6894M6839N6659N2305O1403R9445
$$ 142008 164655 178869 194154 204431 235444 272338 319177 375836 428141 489544 588989
12028E88989J29704J77123K00996K05096J87891J19325O0930j6304r4242j34686
$$ 588989 718693 895816 1096812 1301908 1489799 1609124 1670054 1653750 1559508 1424822
12018A424822j42492j46061j31204j00488n8133l4664j3465j5942J9623M1896
$$ 1424822 1282330 1136269 1005065 904577 846444 811780 798315 782373 801996 843892
12008H43892N3342Q4912J12887J48856J62491K02326K46958K48742K31799K06931
$$ 843892 897234 982146 1095033 1243889 1406380 1608706 1855664 2104406 2336205 2543136
11998B543136J50622N0642n6208j29517j96288k20532k17452k06908j66485j52091
$$ 2543136 2693758 2744400 2688192 2558675 2362387 2141855 1924403 1717495 1551010 1398919
11988A398919j21974q5085o9833m3528l4686j0779N192J1401K6355M1199O8994
$$ 1398919 1276945 1191860 1122027 1078499 1043813 1033034 1038226 1049627 1075982 1117181 1186175
11977A186175P3105P4194O8684P5539N1249K6981J5693q878k4287l6834j7381
$$ 1186175 1259280 1333474 1402158 1477697 1528946 1555927 1571620 1562742 1538455 1501621 1484240
11966A484240M058K938L3653L7165N8938R0732J23147J87374K48008K82036K83242
$$ 1484240 1488298 1491236 1524889 1562054 1620992 1711724 1834871 2022245 2270253 2552289 2835531
11955B835531K62986K00972R2577j9387j23511k13910k63759k68671k33812j95729
$$ 2835531 3098517 3299489 3392066 3372679 3249168 3035258 2771499 2502828 2269016 2073287
11945B073287j48563r7883n3883q447L8835P3715J07192J53544K09539K67300
$$ 2073287 1924724 1826841 1772958 1764511 1803346 1877061 1984253 2137797 2347336 2614636
11935B614636L35985M11818M85010N49635N72280M93002L65316J64977q2472l14815
$$ 2614636 2950621 3362439 3847449 4397084 4969364 5462366 5827682 5992659 5910187 5595372
11925E595372m80558n75070n76428n28614m42108l47954k97106k17798j66742
$$ 5595372 5114814 4539744 3963316 3434702 2992594 2644640 2347534 2129736 1962994
11916A962994j17522p5839l5813K8969M1985Q1198J31483J59458J83782K14622
$$ 1962994 1845472 1769633 1733820 1762789 1804774 1885972 2017455 2176913 2360695 2575317
11906B575317K19456J82746J41038O6346k6975j01172j69435j97419k12808k27255
$$ 2575317 2794773 2977519 3118557 3184903 3157928 3056756 2887321 2689902 2477094 2249839
11896B249839j95032j59322j18918p5052m7407j0605K2056L7916M5896P0105P7217
$$ 2249839 2054807 1895485 1776567 1701515 1654108 1643503 1665559 1703475 1749371 1819476 1896693
11885A896693N5425K1021l3618o2542r5922j26427j14871j28027j06799p5478
$$ 1896693 1952118 1973139 1939521 1876979 1781057 1654630 1539759 1411732 1304933 1229455
11875A229455n6402l7750L127N170J5316M5070Q0578R9657J23058J68163K02582
$$ 1229455 1173053 1135303 1138430 1143600 1158916 1203986 1284564 1384221 1507279 1675442 1878024
11864A878024K36286K62988K80870K31804J81251P9193k3857j51265k60483k89099
$$ 1878024 2114310 2377298 2658168 2889972 3071223 3150416 3126559 2975294 2714811 2425712
11854B425712l10013k94716k54319k18184j59795j19948j04632o9246m6654l2694
$$ 2425712 2115699 1820983 1566664 1348480 1188685 1068737 964105 894859 848205 815511
11844H15511p020L8865M6054P3926J05107J32037J59970J96757J84493J46863
$$ 815511 808491 847356 893410 967336 1072443 1204480 1364450 1561207 1745700 1892563
11834A892563O9404k2091j09568j81125k26580k09650j97951j88115j48295j14231
$$ 1892563 1961967 1939876 1830308 1649183 1422603 1212953 1015002 826887 678592 564361
11824E64361r5391o3538n7442m8868m5764k5996j3322j6660l2064j8871q448m415
$$ 564361 468970 405432 347990 299122 253358 227362 214040 197380 165316 146445 137997 133582
11812A33582j2351k3131j2891J344l066O722L597M083p228j8728P260J3444R465
$$ 133582 121231 98100 85209 86553 83487 90209 93806 97889 90661 71933 79193 92637 102102
11799A02102m939p209J1798o153n661j4761j6265p026n16j719K485p835l298k139
$$ 102102 97163 89954 101752 95599 89938 75177 58912 51886 51370 49651 52136 44301 41003 38864
11785C8864N661R455j551J0056m593j3193n790K526Q845Q957P619l419j3966q849
$$ 38864 44525 53980 52429 62485 57892 44699 38909 41435 50280 59237 66856 63437 49471 40622
11771D0622l422J5484l288j2450J190r415n170N313J0374j36j1893n558J674o179
$$ 40622 37200 52684 49396 36946 38136 28721 23551 28864 39238 39102 27209 21651 23325 17146
11757A7146o767R046r625K064Q550J3529P390o496j1132M656Q889j0049m387N672
$$ 17146 10379 19425 9800 11864 20414 33943 41333 34837 23705 28361 37250 27201 22814 28486
11743B8486L200q044m81O456N265p317k826j8136P332J5974J0492K0501J3749
$$ 28486 31686 23642 23161 29617 34882 27565 24739 6603 13935 29909 40401 60902 74651
11730G4651R833O644J530j4409j9678j4587N781J998o079j3842N361L408l80l175
$$ 74651 84484 91128 92658 78249 58571 43984 49765 51763 45684 31842 37203 40611 40231 37056
11716C7056p514K0289J5431M570l516J171J0390k722Q543q57k110P928J71M423
$$ 37056 29542 49831 65262 69832 66316 67487 77877 75155 83698 82841 80731 88659 88830 93253
11702I3253j3617j0959K084m066j735k302o231L814L831j4081j1272p479K0966
$$ 93253 79636 68677 70761 66695 64960 62658 56427 60241 64072 49991 38719 31240 52206
11689E2206O953N528N957J072j2561M420O958j3778n006m818q219j4704j0625
$$ 52206 59159 64687 70644 71716 59155 63575 70533 56755 51749 46931 38712 24008 13383
11676A3383k877J0275M799l156J1104P309j4265r804R251N056j2809k977l683
$$ 13383 10506 20781 25580 22424 33528 40837 26572 16768 26019 31075 18266 15289 11606
11663A1606O145J439m886J740o165j107K475R858K512R570M437q818q708j0647
$$ 11606 17751 19190 14304 16044 9879 8772 11247 21105 23617 33187 37624 28806 20098 9451
11649I451k749J9217J2559j1221n008N648K6825J188R462j77j3910j0348j4432
$$ 9451 6702 25919 38478 27257 22249 27897 54722 55910 65372 65195 51285 40937 26505
11636B6505J3729K164J391J274J443q853r299j241M595J3912p218p170M762N096
$$ 26505 40234 42398 43789 45063 46506 37653 28354 27113 31708 45620 38402 31232 35994 41090
11622D1090J8847J032J1900Q835l848j3487l731N069p997j2075n183O20K9037
$$ 41090 59937 60969 72869 81704 77856 64369 60638 65707 57710 45635 40452 41072 70109
11609G0109J7190j719m830k87o853j2383L956J0321n960j9036j1109P173O497
$$ 70109 87299 85580 80750 80463 73610 61227 65183 75504 69544 50508 39399 46572 53069
11596E3069J0457K070L961Q1l543j6846k105P138p157P157P471j998n925l64M52
$$ 53069 63526 65596 69557 69638 66095 49249 47144 54282 47125 54282 61753 59755 53830 53466 53918
11581E3918n057m380j7086K261R5l69K830L355K869n066j1731M544J405L167p788
$$ 53918 48861 44481 27395 29656 29751 29382 32212 35567 38436 33370 21639 26183 27588 30755 22967
11566B2967k335R933J2058M600q596p161n269n492l076K0153K5063n746M510R608
$$ 22967 20632 30565 42623 47223 38627 31466 26197 20705 17629 37782 62845 57099 61609 71217
11552G1217j5276m065J1029q88l807j0444K097n558m179j291n428L228R099J0842
$$ 71217 55941 51876 62905 62017 58210 47766 49863 44305 40126 38835 33407 36635 45734 56576
11538E6576l923m5R364P072j4250p163n927N168O781N371P694L046k095j2319
$$ 56576 52653 52608 61972 69044 54794 47631 41704 46872 53653 59024 66718 69764 67669 55350
11524E5350l877R561m329j0967M317j4001J415M269N312O812o24j0329k381l4
$$ 55350 51473 61034 56705 45738 50055 36054 37469 41738 47050 53862 53238 42909 40528 40494
11510D0494Q610l966k49k067M2J0538L640j2539q804J2277M330p960j2381J86
$$ 40494 49104 45138 44889 42822 42864 53402 57042 44503 35699 47976 52306 44346 31965 32151
11496C2151O190k572k723K83O277r295j7785O436J2507K032K094K668j7739j3437
$$ 32151 38341 35769 33046 33329 39606 30311 12526 18962 31469 33501 35595 38263 20524 7087
11482G087K463J6862N773M257p885m642o929o139M427J066n59L626q75J256J1080
$$ 7087 9550 26412 32185 36442 28557 23915 16986 10847 15274 16340 15781 19407 18532 19788 30868
11467C0868J3794Q684j6604M330K968M168l675O907J1933p999o963n108m558j0334
$$ 30868 44662 53346 36742 41072 44040 48208 44533 51440 63373 55374 48411 43303 38745 28411
11453B8411J630L572m257n185J8390k55j3889j6719L847m989M989R341O167l992
$$ 28411 30041 33613 29356 24171 42561 42306 28417 11698 15545 10556 15545 24886 31053 27061
11439B7061M523M514j3096q96J7941K4798N912j4157j781J3102j4563l296k457
$$ 27061 31584 36098 23002 22106 40047 64845 70757 56600 54819 67921 53358 50062 47605
11426D7605Q52k962R639K791l993K088N040j2613j0140N735R631N948K569n887
$$ 47605 48457 45495 55134 57925 53932 56020 61060 48447 38307 44042 53673 59621 62190 56303
11412E6303q56N176o213j2386P021J1616N35L341J989p421o535J9494J2387K275
$$ 56303 55447 60623 54410 42024 49045 60661 61196 64537 66526 59105 52570 72064 84451 86726
11398H6726n978n300l055o228m025M274k55O279j0794O779k202L576J0997Q517
$$ 86726 80748 75448 72393 66165 62140 66414 66159 72438 61644 68423 66221 69797 80794 89311
11384H9311m636j439j482J598p003K624J4634N059j1024o990K76n500L931J214
$$ 89311 84675 83236 81754 83352 76349 78973 93607 98666 87642 80652 80928 75428 79359 80573
11370H0573J6367J2908j3758j9635O888J2277Q147j576J098n030j360j711K738
$$ 80573 96940 109848 96090 76455 83343 95620 103767 102191 103289 98259 96899 95188 97926
11357I7926R448J223L054K0725K526l981m466r578R137J2060P211j5882M33J0574
$$ 97926 107374 108597 111651 132376 134902 130921 126455 116877 126014 138074 145285 129403 129836 140410
11343A40410N005J556K2805J5800M596O787J0533J0355q955r510l285k922J0455
$$ 140410 145415 146971 169776 185576 190172 196959 207492 217847 208892 199382 196097 193175 203630
11330B03630K2093p43K526N612K2372R605J552K420J9866J4148k132J7833J1762
$$ 203630 225723 224980 227506 233118 255490 265095 266647 269067 288933 303081 300949 318782 330544
11317C30544r809M679J1482L4628K1628J5505J7188K1960K1062J6509J5008J8269
$$ 330544 320735 325414 336896 371524 393152 408657 425845 447805 468867 485376 500384 518653
11305E18653J7484K5547L4729K0675L4221L3683L1863L7825K7836L6919M6107
$$ 518653 536137 561684 596413 617088 651309 684992 716855 754680 782516 819435 865542
11294H65542L8752O1260P8927P0574O9808O6994R0570Q7686Q8687R4326J05113
$$ 865542 904294 965554 1044481 1115055 1184863 1251857 1342427 1430113 1518800 1613126 1718239
11283A718239J15639J19100J29277J35032J55278J45506J51676J49684J50478
$$ 1718239 1833878 1952978 2082255 2217287 2372565 2518071 2669747 2819431 2969909
11274B969909J29170J03242J01762P8462O2788N2911L0003K2834L519N004J5817
$$ 2969909 3099079 3202321 3304083 3382545 3445333 3498244 3528247 3551081 3554600 3559604 3575421
11263C575421k819k198J2474Q438J4621K9758K3921J2637J3264K1518J2178j5271
$$ 3575421 3572602 3570404 3582878 3591316 3605937 3635695 3659616 3672253 3685517 3707035 3719213 3703942
11251C703942j6122j9893m1934o6048q7502q7573q6019r3913j00157j02414j04628
$$ 3703942 3687820 3667927 3625993 3559945 3472443 3384870 3298851 3204938 3104781 3002367 2897739
11240B897739j07270j09779r7049q8469q0360q1343o9659o3070o1684n0831l1216
$$ 2897739 2790469 2680690 2583641 2495172 2414812 2333469 2263810 2200740 2139056 2088225 2057009
11229B057009k0991k6215j7991j1919J0262J8931K5601K947J4045L3410M3102
$$ 2057009 2036018 2009803 1991812 1979893 1990155 2009086 2034687 2037634 2051679 2085089 2128191
11218B128191N7199P6542O1650N9538P8000Q6742J05624J07658J19826J26309
$$ 2128191 2185390 2261932 2323582 2383120 2461120 2547862 2653486 2761144 2880970 3007279
11208C007279J36415J46851J54988J64227J65528J78575J86421J93408K04565
$$ 3007279 3143694 3290545 3445533 3609760 3775288 3953863 4140284 4333692 4538257
11199D538257J93680K03367J92564J79634J73571J77145J69071J52883J50810
$$ 4538257 4731937 4935304 5127868 5307502 5481073 5658218 5827289 5980172 6130982
11190F130982J35563J31876J31013J10694J07380R2682N4685N6390M3429K6703
$$ 6130982 6266545 6398421 6529434 6640128 6747508 6840190 6894875 6951265 6994694 7021397
11180G021397J1548N453k1220m3487m9526p1874r2705r5696r6075j14832j39255
$$ 7021397 7032945 7038398 7017178 6973691 6924165 6852291 6759586 6663890 6567815 6452983 6313728
11169F313728j41307j58025j70010j76440j71710j67328j84448j87901j98311
$$ 6313728 6172421 6014396 5844386 5667946 5496236 5328908 5144460 4956559 4758248
11160D758248k11307j89241j79038j85070j80310j76379j83527j60561j41839
$$ 4758248 4546941 4357700 4178662 3993592 3813282 3636903 3453376 3292815 3150976
11151C150976j40391j11409j17307j09147r6189p8360p9726p0708q4176q0119
$$ 3150976 3010585 2899176 2781869 2672722 2576533 2498173 2418447 2347739 2263563 2183444
11141B183444n3769l5609l5408l1488j7233r671m972r243J4654K3328R864J9486
$$ 2183444 2129675 2094066 2058658 2027170 2009937 2000266 1995294 1986051 2000705 2024033 2033897 2053383
11129B053383N2184L7065N0060N6049N7948N7771P4483Q1518R6309R2024Q5014
$$ 2053383 2105567 2142632 2192692 2248741 2306689 2364460 2438943 2520461 2616770 2708794 2793808
11118B793808R0798J01157R3272Q1551Q1407Q4599N1677N3913N4102M1327K3004
$$ 2793808 2884606 2985763 3079035 3160586 3241993 3326592 3378269 3432182 3486284 3527611 3550615
11107C550615P921M057Q712M320Q019R640J3141J1927R260R360J5190J3178j297
$$ 3550615 3558536 3562593 3571305 3575625 3583644 3593284 3606425 3618352 3627612 3636972 3652162 3665340 3664043
11094C664043J0063j3230j7937l0114o4548p3386r7488j12725j11481j26685j34726
$$ 3664043 3674106 3660876 3642939 3612825 3548277 3474891 3377403 3264678 3153197 3026512 2891786
11083B891786j67132j69700j36308j39469j35316j28253j40725j16390j02433
$$ 2891786 2724654 2554954 2418646 2279177 2143861 2015608 1874883 1758493 1656060
11074A656060q8021r2482q9342p5617o9979p2998o1751m7696m8121m1244l7469
$$ 1656060 1568039 1475557 1386215 1310598 1240619 1167621 1105870 1058174 1010053 968809 931340
11063I31340l9396m3875m5572m1572l8725l9292k0863j4066l9283l6742k0307
$$ 931340 891944 848069 802497 760925 722200 682908 662045 647979 608696 571954 551647
11052E51647k4101q686j6416l2311k5332j3754n40q123j7140k7052j5591p387
$$ 551647 527546 518860 502444 470133 444801 431047 430507 422384 405244 378192 362601 355214
11040C55214o470j1090N586o350j1934j662j2697j0964j3811m956k963l864j4942
$$ 355214 348744 337654 343240 336890 324956 323294 310597 299633 285822 280866 277903 274039 259097
11027B59097k2679j887P405k762k1388j1568n736j1144J1503J3356k065o824j0138
$$ 259097 236418 234531 241936 239174 217786 206218 200482 189338 200841 214197 212132 205308 195170
11014A95170M281J6161J2667r221j6228K673N076n518j6552j581m625L206j6006
$$ 195170 199451 215612 228279 219058 202830 205503 210579 205061 188509 186928 182303 185509 169503
11001A69503q145m186j2489j2117o85Q385N102J3306R165o616o531o909j0975
$$ 169503 161358 157172 144683 132566 131881 140266 145368 158674 167839 161223 154692 147783 136808
10988A36808j583J468m503o41o794r198l650J4296M629q59j9409r320q466R699
$$ 136808 135225 136693 132190 131549 124755 115557 111907 126203 130832 129973 110564 101244 92778 102477
10974A02477n880p759J0647J0097j0653o138n707o914Q377N149k664K685n067
$$ 102477 96597 88838 99485 109582 98929 92791 87084 80170 88547 93696 91032 93717 88650
10961H8650m142Q921k019o455p125j2882j960Q804J1454m437j3735m679k907k860
$$ 88650 84508 93429 91410 84955 77830 64948 62988 71792 83246 78809 65074 60395 57488 54628
10947E4628r011k947L629l315J618J5745L84k1629P22R87o686N13L470O442M082
$$ 54628 45617 42670 46299 42984 44602 60347 60731 39102 39824 40811 34125 34638 38108 44550 48632
10932D8632N192J087p221p090J0074P240j1431q225j383j397K576j53M15N960
$$ 48632 53824 54911 47690 40600 50674 57914 46483 38258 36875 35478 38054 37901 38316 44276
10918D4276r51L930o166n710k570O70o498j8106L730J6988R387j2612j219j904
$$ 44276 43325 47255 41089 35379 32809 33479 26981 8875 12605 29593 38980 26368 25149 23245
10904B3245Q099O800n474M54r082m742J1988P024R052Q602K477k521j573q311
$$ 23245 31344 38144 32670 33124 24042 19300 31288 38312 47364 55966 58443 55922 54349 46038
10890D6038m798O252M920j68r641k998l012j289l335r414M890O264Q126l496n453
$$ 46038 41240 47492 52412 52244 42603 39605 36593 35304 31969 22555 27445 33709 41835 38339 32886
10875C2886k685N86K956m79J377l963o384L147O218M730m577j473l055j461n98
$$ 32886 30201 30787 33743 33264 34641 30678 24294 27441 33659 38389 33812 32339 29284 27823 27225
10860B7225J306K094L17R307k126M828p556k565o407Q546n215J19O836j0567o786
$$ 27225 28531 30625 30942 40249 38123 42951 35395 32830 26423 34969 29754 29873 36709 26142 19356
10845A9356Q267j1127J496J0001J895O932p747M386K524n37q98K353l044L777
$$ 19356 27623 16496 17992 27993 29888 36820 29073 33459 35983 35446 34548 36901 33857 37634
10831C7634o19q343P38q760J172k442J412N648J2377P578o978J1503j0791j1409
$$ 37634 37015 28672 29410 20650 21822 19380 20792 26440 38817 46395 39417 50920 40129 28720
10817B8720p270l55J1162J0464R776n039j2356n95q032m428R46N518k718q86r118
$$ 28720 21450 21095 32257 42721 52497 47458 35102 34507 26475 22047 22993 28511 25793 24907 15789
10802A5789j794P599N30m736K185O413p864L657J1024M849l287p724Q27L52j3671
$$ 15789 13995 21594 22124 17388 19573 25986 18122 21779 32803 37652 34365 26641 27468 27820 14149
10787A4149j5996k152l561J9528P003p582Q27P140J253p052L413J5585J4046M638
$$ 14149 -1847 -3999 -7560 11968 18971 11389 12216 19356 20609 13557 16970 32555 46601 51239
10773E1239J988K318j4818R74j9032P089l696j40R891P419L92K429m654j1042
$$ 51239 53227 55545 40727 41701 22669 29758 26062 25922 35813 43232 43624 46053 41399 30357
10759C0357J314J1349r830o172l14J2529m782k118n584R846J5910j176j2788R330
$$ 30357 31671 43020 33190 27018 26704 39233 34451 32333 26749 36595 52505 51329 38541 47871
10745D7871N75m597r37J204j5476j0946J0733N180N382K927O403J8899O721k4162
$$ 47871 48446 43849 42912 44116 28640 17694 28427 33607 38989 41916 48319 67218 73939 49777
10731D9777r538k986L817N083j2785m709M487j2367k1796p77K172J2164j9J3966
$$ 49777 40239 37253 41070 46153 33368 28659 33146 20779 -1017 -1794 378 12542 12523 26489
10717B6489Q154j9546M640r465p084n721L714P778R628L080J0967p2r172k0420
$$ 26489 34643 15097 19737 10272 3188 -2533 1181 8959 18587 21667 32634 32562 23390 2970
10703B970p642J5144J8278p624r052J693J207j2765j9014Q668J2034m586N656
$$ 2970 -4672 10472 28750 21126 12074 13767 14974 2209 -16805 -8137 3897 -689 4967
10690D967k24n753J0549J5092M78j6189j6261r124J6802J4630k193J076J41k110
$$ 4967 4743 -1010 9539 24631 25109 8920 -7341 -16465 337 14967 12774 13850 13991 11881
10676A1881J904N084P954l592j1463j32J0982J800m084Q654O293Q72N230J2252
$$ 11881 13785 18869 26823 23231 11768 11636 22618 24418 20334 28988 35281 36153 41383 53635
10662E3635j7054r862o368r741m116P599P553k773j6681k978R080P537O826l329
$$ 53635 36581 26719 20351 10610 6494 14093 21646 18873 2192 -786 8294 15831 22657 19328
10648A9328q06n270l152J2949J155j1420M44J3853m667k493j6036K948J5598l256
$$ 19328 18522 13252 10100 23049 24204 12784 13228 27081 22414 19921 3885 6833 22431 19175
10634A9175K753k404r549m225L714l512L226N688j790l102n137K987M806j077
$$ 19175 21928 19524 9975 5750 9464 5952 9178 14866 13076 9974 4837 7824 12630 11553
10620A1553j1400j1834o207n277M926J1787Q10Q794J4894m280K776N84N332n885
$$ 11553 153 -11681 -17888 -23165 -18239 -6452 -5642 3152 18046 13766 16542 17126 22458 16573
10606A6573k120r454J895K693j2788J08Q488M808K790O37o947J1586J122N674
$$ 16573 14453 4999 6894 9587 -3201 -3093 5395 10203 12993 13630 6683 18269 19391 25065
10592B5065l469R666K528j2296n821L096j072p365m446K032r275n928j2601n063
$$ 25065 21596 31262 33790 21494 15673 18769 17697 10332 5886 7918 -1357 -7285 -19886 -24949
10578b4949j497K011J1906J6837J0422j5764j2417Q12o852l842J0957k494R471
$$ -24949 -26446 -24435 -12529 4308 14730 -1034 -13451 -12639 -19491 -23333 -12376 -14870 -5399
10565e399J1664n0p221o129J862J3778j0021r562R594O417o630J2987Q753Q25
$$ -5399 6265 6215 -1006 -7135 -5273 8505 -1516 -11078 -1484 4933 -1697 11290 20043 20868
10551B0868R463J761p198p320j40r79j5764K578R491J464j856J525l045l859l380
$$ 20868 30331 32092 24894 17574 17434 16455 691 3269 12760 14224 12368 13893 10848 6989 3609
10536C609k651q865r414L898o755L34o807p941O434O141J303P191J4734L353L405
$$ 3609 958 -7907 -17321 -13423 -20178 -19844 -26651 -34592 -28158 -22017 -20714 -13523 1211 4564 7969
10521G969k91k1743j2847O680O440L220O776L034m665l094L283P197J0466r691
$$ 7969 7678 -14065 -26912 -20232 -13792 -10572 -3796 -762 -5427 -8521 -5238 1959 12425 2734
10507B734j6761Q949J4450k067j2695m062L941J407k684j3269l015N554O873J2106
$$ 2734 -14027 -5078 9372 7305 -5390 -9452 -5511 -4104 -6788 -20057 -23072 -17518 -10645 1461
10493A461n027p090J697N175n286m656l818K412R54N323R979L539N160r6L414
$$ 1461 -3566 -10656 -8959 -3784 -9070 -13726 -17544 -15132 -14178 -8855 1124 4663 9823 9727 13141
10478A3141L784r009r58j1564q660l683l854J4437K380l894r479K800M234k286
$$ 13141 16925 7916 6958 -4606 -13266 -16949 -20803 -6366 -3986 -7880 -17359 -14559 -10325 -12611
10464a2611R846P46p175q146q315M422K119J1667P680K1972j7454j1591p213L770
$$ -12611 -2765 -2019 -9194 -17340 -25655 -21233 -19114 -7447 233 22205 4751 -6840 -14053 -10283
10450a0283k012M583M09p109M055m416j0329R849J5371r051J5958J1613n861k1725
$$ -10283 -12295 -7712 -7303 -14412 -10357 -14773 -25102 -15253 118 -8933 7025 18638 12777 -8948
10436h948j7446K460J650R961J9097J448j6680o287N120L031N956j6759k2208
$$ -8948 -26394 -23934 -22284 -12323 6774 8222 -8458 -14745 -9625 -6594 -638 -17397 -39605
10423c9605J1565J9920J5751M765J1207o183p074j130j2694j298j62P089L439
$$ -39605 -28040 -8120 7631 12396 23603 17420 10346 9216 -3478 -4776 -4938 2151 5590
10410E590r678j073J141P366K368L916K514q33q634r71k994J2638J616p0K562
$$ 5590 -4088 -5161 -4020 3346 5714 9630 12144 11311 2677 1706 -1288 11350 12966 12896 15458
10395A5458K327j6810o978n110J0279J0781N904J285j2660j9271m474r001J6861
$$ 15458 17785 975 -6003 -11113 -834 9947 15851 17136 4476 -14795 -19269 -28270 -11409
10382a1409J2117j0163L869P90o364l217K982M420l764r35J5131L862o951L215
$$ -11409 708 -9455 -5586 -4796 -11160 -14377 -11395 -6975 -10739 -11674 3457 7319 368 3583
10368C583O565o9r408Q011L603j331l726p260L552p348j5431J0247R716M461O926
$$ 3583 10148 10079 671 8682 12285 10954 7228 -32 3520 -3828 -19259 -9012 704 5165 12091
10353A2091k972p776j4268P882N401r616p646N104K947n470n889J904R672Q2o285
$$ 12091 9119 1343 -12925 -5043 358 -9258 -16904 -11800 -8853 -14323 -20212 -18308 -8636 -8554 -14839
10338a4839l167R363O064J959P201p837l771o974R286J097r926k229J0038P696
$$ -14839 -18006 -8643 -2579 -620 6581 -1256 -5027 -12001 -2715 -1618 -11544 -13773 -3735 3961
10324C961J361O556r506K053r513j3973q506N85J5050N659n561q497P178J8810
$$ 3961 5322 11878 2372 4425 -5088 -19061 -27567 -26982 -11932 -6273 -11834 -20331 -13153 5657
10310E657J0233m482m740n396p965J183M907r04p286j628l245j554o3K848J772
$$ 5657 15890 11408 6668 1272 -6693 -5510 -603 -1507 -8793 -10421 -13666 -15220 -15283 -12435 -10663
10295a0663j199j602Q965R0J4327J150j7114R196J5359n613j229r160j734L948
$$ -10663 -11862 -13464 -4499 -4409 9918 11068 -6046 3150 18509 12896 11667 2507 773 4721
10281D721m951j3654M965R422J3158Q650j3863l122j3623q490L172j68K892L86
$$ 4721 -230 -13884 -8919 503 13661 22311 8448 5326 -8297 -16787 -13615 -13783 -10891 -10505
10267a0505Q164r485j9323J424O575N976l367o645R85O255J1144P078K277l074
$$ -10505 -2341 -11826 -31149 -29725 -23150 -17174 -20541 -27186 -26201 -19946 -8802 -1724 553 -2521
10253b521r869l368M427Q547J148m762j898L987K217o640P19Q797O2k172l10O000
$$ -2521 -12390 -15758 -11331 -2784 -1636 -6398 -8296 -4309 -2092 -8732 -8013 784 846 -1326 -1636 4364
10237D364n238j0004J1084l578r427o328P919k716L398j752O201K003q0j886j3
$$ 4364 -874 -10878 206 -3372 -12799 -19127 -11208 -13924 -10526 -12278 -6077 -4074 -4154 -6040 -6053
10222f053r582l229J672N866Q865r867m858P959j297j106N336j776P753L066o878
$$ -6053 -15635 -18864 -17192 -11326 -2461 -12328 -17186 -9227 -10524 -11630 -6294 -8070 -317 2749 -4129
10207d129j1700M337M440O528R293K401j2929q796j0229N52J2098r23q7M233O921
$$ -4129 -15829 -11492 -7052 -524 8769 11170 -1759 -10555 -20784 -20232 -8134 -9057 -9144 -4911 2010
10192B010q199p919P783M561n124Q088J72K957M800J162r480j1107q773N447J1571
$$ 2010 -6189 -14108 -6325 -1764 -6888 1200 1372 4329 9129 10291 811 -10296 -19069 -13622 -2051
10177b051L67O943Q63J970J119p92j926q206p05l134o019n493m240R529R873M83
$$ -2051 -1684 5259 6122 8092 9211 8419 6493 -1713 -2418 -5552 -11571 -17064 -21304 -11775 -1902 -1419
10161a419L95j4005k121J0113J5971J0702j1503l160O51R998r586J0850m8N20
$$ -1419 -1024 -15029 -17150 -7037 8934 19636 8133 4973 5624 15622 6036 16886 16838 17358
10147A7358O128j0660o239j299j7052r688R388O447N746L998m63K895J09q382
$$ 17358 23486 12826 6587 5288 -11764 -21452 -12064 -5617 129 4127 3664 6559 6668 -1714
10133a714j2277j353k041L592o692r001P366Q084N52j1157J2361J1879J1227j792
$$ -1714 -13991 -15344 -17385 -13793 -20485 -29486 -22120 -14036 -13484 -24641 -12280 -401 10826 9034
10119I034k591n565j832j0983n02m422J090L635J0830n265q486L393P636J6377
$$ 9034 6443 878 -954 -11937 -12439 -16861 -15771 -12136 -1306 -6571 -15057 -11664 -4028 12349
10105A2349N722j8450j1512L373l568k43p513L142O866J7818m824l305m267r763
$$ 12349 18071 -379 -11891 -8518 -12086 -12329 -19842 -16700 -9834 7984 3160 -145 -4412 -14175
10091a4175j9495L563J7984J0034o106k080P991p301k87O021P470q793l562R811
$$ -14175 -33670 -30107 -12123 -2089 -8195 -10275 -2284 -9585 -9872 -3851 3619 -5174 -8736 1075
10077A075j948m919R153R295j0322m745j4268j418J1436J0825l821r061q015m961
$$ 1075 -873 -5792 3361 12656 2334 -2411 -16679 -18097 -6661 4164 343 -8718 -16733 -21694
10063b1694M03p748j0069Q274M555Q831J2986J1358K97r079R773j6032j2365N519
$$ -21694 -21291 -29039 -39108 -30834 -26279 -17448 -4462 6896 7193 -1886 7887 -8145 -20510 -14991
10049a4991L031K613R183k570P416J1494K382r511k373J0253m121j7296l012R7
$$ -14991 -11960 -9347 -164 -2734 4682 16176 18558 9047 6674 16927 12806 -4490 -7502 -7405
10035g405O126l435j6421M059K1351k663j2417P281J0543R645j0151N540J4390
$$ -7405 -1279 -4714 -21135 -17076 4275 1612 -10805 -3524 7019 16664 6513 12053 26443
10022B6443p898j7796m268L894k360L268M520q049j0314j097J1803R888n294K824
$$ 26443 18545 749 -3519 375 -1985 1283 5803 -2246 -12560 -13657 -1854 8034 2740 5564
10008E564N892o405n129l586J667J2730l298n046n769j423L749R796J0721r939
$$ 5564 11456 5051 -78 -3664 -1997 10733 7435 2389 -3380 -4803 -1054 8742 19463 9524
9994I524q043J2570O141r639q279m135Q237J0603n582O035M527p452j0764N674
$$ 9524 1481 14051 20192 10553 2274 -1861 6376 16979 11397 17432 21959 14507 3743 9417
9980I417J7819K252M887J4848J9978N029m480M865J0234J3311L891R798K3164
$$ 9417 27236 29488 34375 49223 69201 74230 69750 74615 84849 98160 102051 111849 135013
9967A35013L6720M4927N9066R3038J41284J97088K31203K09011J25909J664j15711
$$ 135013 171733 216660 275726 368764 510048 707136 938339 1147350 1273259 1274923 1159212
9956A159212k05609k20282k03080j50222j03333p1332m0963k0744k4472k9059
$$ 1159212 953603 733321 530241 380019 276686 205354 164391 143647 119175 90116
9946I0116k0752j7590j1670Q203Q634k389j1519o64K183p361j6606N022R198N980
$$ 90116 69364 51774 40104 48307 56941 54552 43033 42369 44552 37191 20585 25607 34805 40785
9932D0785j293l159P04p206j1327L333R293J0430q848n201L977J449K713M885
$$ 40785 39492 36333 37037 29831 18504 21837 31130 41560 32712 27511 31488 32937 35650 40535
9918D0535j0740n517O754O39m342o573j2311k424R322N100R976l01J21M689q579
$$ 40535 29795 24278 31032 31671 27329 20756 8445 6021 15343 20443 30419 30118 30239 34928 26349
9903B6349m665L439j0562P272M924Q867J7180M8j8779j0538j1950L251k190K3761
$$ 26349 21684 25123 14561 21833 26757 35624 52804 52852 34073 23535 11585 14836 12646 36407
9889C6407K1493J560J1445J050j9299o470m200k593j4518q514J2155J9966N815
$$ 36407 57900 59460 70905 71955 52656 46186 41986 39393 24875 16361 28516 48482 54297
9876E4297q355m776Q0J1077q26n915J0479k338q333j3704Q531J5442k245j0565
$$ 54297 45942 41166 41246 52323 51497 45582 56061 53723 45390 31686 40217 55659 53414 42849
9862D2849K115k978k036j0443l73m886L456J4776P414n477Q460Q151L191M215
$$ 42849 44964 41986 39950 29507 29134 24248 27704 42480 49894 44417 52877 61028 64219 68434
9848F8434p174j3995j6598K110Q442j740N749L845q815q913r397J537J5492l295
$$ 68434 61260 47265 30667 32777 41219 39479 45228 49073 40258 31345 21948 23485 38977 35682
9834C5682M414O402j90q110O70N327N611j182j2180r617N43j0421k851J1576J1222
$$ 35682 40096 46498 46308 38198 38868 44195 49806 48624 36444 26827 27370 16949 14098 25674 36896
9819C6896J4268N455j8926N331M807j5406p451j102l380K1314L577M538P160O854
$$ 36896 51164 56619 37693 43024 47831 32425 24974 23872 20492 41806 45383 49921 57081 63935
9805F3935k603j2702M625k938j7193p717J0590J0310p43o391p159N604J1054N864
$$ 63935 61332 48630 53255 50317 33124 25407 35997 46307 45564 39173 32014 37618 48672 54536
9791E4536n162p203L074o365m341J2502R288o533j81k484q99R671j825k82o869
$$ 54536 49374 42171 45245 38880 34539 47041 56329 49796 49615 47131 46232 55903 54078 53796 46927
9776D6927k944Q27j0442m907N240K0268P836m039j0194O73K08J014r241n61M999
$$ 46927 43983 44810 34368 29461 34701 54969 62805 58766 48572 49245 49453 50467 41226 40665 45664
9761D5664l284p033j0086o767J3301K1144L550l168j1562m675K943J5918o924
$$ 45664 42380 35347 25261 18494 31795 52939 56489 53321 41759 37084 40027 55945 49021
9748D9021r332R881m47j565P284R96K9J7424L742o533m672p43P340L143M784L597
$$ 49021 39689 49570 49123 47558 54842 55838 55867 73291 77033 70500 65828 65085 72425 75568 80352 83949
9732H3949l195J5237l0N923N930P746O307j6142k472O678j3197j203J0179j6484
$$ 83949 80754 95991 95961 101884 107814 115560 121867 105725 103253 109931 96734 95531 105710 89226
9718H9226j9397o074J0188N977l240l662M23R418K02l264L98J211J4003J4475
$$ 89226 69829 63755 73943 79920 76680 73018 73441 82859 83061 79797 80195 81406 95409 109884
9704A09884P410k825j860K722o290P415R533n036j1858j2520J058N74J3723J0501
$$ 109884 117294 114469 112609 115331 109041 116456 125989 120953 109095 96575 97633 98207 111930 122431
9690A22431J3148N789p651r92K035J5328K504j0393P551N395j6007o663M889m110
$$ 122431 135579 141368 133717 132725 134760 150088 152592 142199 149750 155145 139138 132475 137364 133254
9676A33254J8418K354j3858q171J0266J5628Q465j848Q974N136K426M571n693
$$ 133254 151672 154026 140168 131997 142263 157891 166356 164508 173482 178618 181044 185615 179922
9663A79922m666O707J2100Q989k099Q467r85n726j548j032q678K961P581N346
$$ 179922 175256 181963 194063 203052 200953 209420 208435 202709 201161 200129 191451 194412 201993 207339
9649B07339n122P911M313L998p213r536n880M023p62P543J5907R699P63r185j047
$$ 207339 202217 210128 214441 218439 211226 201690 195810 199833 199071 206614 222521 232220 232983 223798 222751
9634B22751J3167K8346Q706K316M224L658O00J1728O026k661P269K4424N906M914
$$ 222751 235918 264264 272970 275286 279510 283168 283768 295496 301522 298861 306130 330554 336460 341374
9620C41374J3824Q765L913Q589K3007L1850J5806J8115K6068J9226J4495J8368
$$ 341374 355198 363963 367876 376465 399472 431322 447128 465243 491311 510537 525032 543400
9608E43400L5642K8998K3473J7608K5740K3748L5967M2116L9323L5854L4474M5057
$$ 543400 579042 608040 631513 649121 674861 698609 734576 776692 816015 851869 886343 931400
9596I31400L8878N3761N2870N3923O3893P5010O8648O1515M9598M7068N7536O5976
$$ 931400 970278 1024039 1076909 1130832 1194725 1269735 1338383 1399898 1449496 1496564 1554100 1620076
9584A620076O1264O7155O2046O6593P0883N7089O6309P2845P1054P7952R5144
$$ 1620076 1681340 1748495 1810541 1877134 1948017 2005106 2071415 2144260 2215314 2293266 2388410
9573B388410Q4092Q2419R5699J00115J01280P5744O8358Q0462Q6524Q9299P8131
$$ 2388410 2472502 2554921 2650620 2750735 2852015 2927759 2996117 3076579 3163103 3252402 3330533
9562C330533O4966M2894M1785L9701K2771R341J0678K379J9568J3837J8065J1970
$$ 3330533 3395499 3438393 3480178 3519879 3542650 3551991 3562669 3565048 3584616 3598453 3616518 3628488
9550C628488M2011R932P078L3958K4868J4726J3578R080k709L70J5826j2491l6429
$$ 3628488 3670499 3680431 3687509 3721467 3746335 3761061 3774639 3783719 3781010 3781380 3797206 3784715 3748286
9537C748286m8666l8577m9330n6504o1074m8255m4558m6517m2751o1691o1164
$$ 3748286 3699620 3661043 3611713 3555209 3494135 3445880 3401322 3354805 3312054 3250363 3189199
9526C189199m8916l1623o310j9752k3237p100J1445J8700R644J1424R726K2775
$$ 3189199 3140283 3108660 3102350 3082598 3059361 3052261 3063706 3082406 3092050 3103474 3113200 3135975
9514C135975J4310L6514O6960O4823M7987N2098P4254Q5996R6713J07502J08654
$$ 3135975 3150285 3186799 3253759 3318582 3366569 3418667 3492921 3578917 3675630 3783132 3891786
9503C891786J17741J00065R9577R8219R9568J23876J17168J11424J14829J11047
$$ 3891786 4009527 4109592 4209169 4307388 4406956 4530832 4648000 4759424 4874253 4985300
9493D985300J17173J29091J43830J49911J39745J66018J74677J74951J90259K08742
$$ 4985300 5102473 5231564 5375394 5525305 5665050 5831068 6005745 6180696 6370955 6579697
9483F579697J88687J73956J62409J50324J39411J18606R0228Q5328P0641L9225
$$ 6579697 6768384 6942340 7104749 7255073 7394484 7513090 7603318 7688646 7759287 7798512
9473G798512K1391P643j3146m271j2865j0903j6452k3903k5333o242J5618l589
$$ 7798512 7819903 7827546 7814400 7810129 7797264 7786361 7769909 7746006 7720673 7714431 7730049 7726460
9461G726460j8607k2003j6870k1694j9891m4728o8270q2375q9893j05919j25827
$$ 7726460 7707853 7685850 7668980 7647286 7627395 7582667 7514397 7432022 7342129 7236210 7110383
9450G110383j44117j65834j76648j90339j84706j81106j80541j79975j79492j62278
$$ 7110383 6966266 6800432 6623784 6433445 6248739 6067633 5887092 5707117 5527625 5365347
9440E365347j67989j54904j53229j38518j20721j22623j21551j20709j01687r7541
$$ 5365347 5197358 5042454 4889225 4750707 4629986 4507363 4385812 4265103 4163416 4065875
9430D065875j07363r3323p1038n7596m4170l5691k8518n607K5025M0269N9673
$$ 4065875 3958512 3865189 3794151 3736555 3692385 3656694 3628176 3622569 3647594 3687863 3747536
9419C747536Q5898J13758J42233J53319J58081J45028J22411Q3074J897q4315
$$ 3747536 3833434 3947192 4089425 4242744 4400825 4545853 4668264 4751338 4753235 4668920
9409D668920j42760j92881k20317k20814k21050k16584j82853j49427j29422j02142
$$ 4668920 4526160 4333279 4112962 3892148 3671098 3454514 3271661 3122234 2992812 2890670
9399B890670p2944m8109q686K9563N1340O4269R3926J37993J65806J74655J79272
$$ 2890670 2817726 2769617 2760931 2790494 2841834 2906103 3000029 3138022 3303828 3478483 3657755
9388C657755J94180J76691J32529R6685J1108q3103j65331k12790k55139k61245
$$ 3657755 3851935 4028626 4161155 4257840 4268948 4185845 4020514 3807724 3552585 3291340
9378C291340k37156k32041k26815j70956j54700j24531j18290r6464o6086n3214
$$ 3291340 3054184 2822143 2595328 2424372 2269672 2145141 2026851 1930387 1864301 1811087
9368A811087m8205n1963k5974j1326m563J3858M1130K5367L6614O5422P8666Q5582
$$ 1811087 1762882 1710919 1684945 1673619 1669056 1682914 1724044 1749411 1786025 1851447 1930113 2015695
9356B015695J05505J18698J52897J96336J95534K26347K86014L06000L52117L78106
$$ 2015695 2121200 2239898 2392795 2589131 2784665 3011012 3297026 3603026 3955143 4333249
9346D333249L81200L82985L78946L62240L08580K49493J57944R2650J9816p8106
$$ 4333249 4714449 5097434 5476380 5838620 6147200 6396693 6554637 6647287 6667103 6588997
9336F588997j43510j86129k01001j91606j38169p9390l169O4353R8146J19838
$$ 6588997 6445487 6259358 6058357 5866751 5728582 5649192 5646023 5710376 5808522 5928360
9326E928360J31503J47411J23834Q0606P4783O8791Q4101R6900J08848J06176
$$ 5928360 6059863 6207274 6331108 6411714 6486497 6555288 6639389 6736289 6845137 6951313
9316F951313R9364O2163K2251l9302j12236j83547k65923l03595l61006l66187
$$ 6951313 7050677 7112840 7135091 7095789 6983553 6800006 6534083 6230488 5869482 5503295
9306E503295l44376l28263k94498k55822k22450j76961j62872j49325j54988j66806
$$ 5503295 5158919 4830656 4536158 4280336 4057886 3880925 3718053 3568728 3413740 3246934
9296C246934j67146j80968j73063j79022j47550j41337j21741j08964q5518n7693
$$ 3246934 3079788 2898820 2725757 2546735 2399185 2257848 2136107 2027143 1941625 1883932
9286A883932l2757j8634o316R720K6719M0983N7902P7056R6284J26271J50493
$$ 1883932 1851175 1832541 1826225 1835945 1862664 1903647 1961549 2038605 2134889 2261160 2411653
9275B411653J73334K07191K29319K30309K35628K16029K07087J57624P7222K9091
$$ 2411653 2584987 2792178 3021497 3251806 3487434 3703463 3910550 4068174 4145396 4174487
9265D174487K048n2555m1459k9004j9352J1232N6088O9720N3609O1576N8607M0229
$$ 4174487 4176535 4123980 4082521 4053517 4034165 4045397 4101485 4171205 4224814 4286390 4344997 4385226
9253D385226J9352O628j9251l7809l2170k7305k605J4089M6599R7286Q5558O2650
$$ 4385226 4404578 4411206 4391955 4354146 4321976 4294671 4292066 4306155 4352754 4450040 4535598 4598248
9241D598248K1896j1443o3049j13064j24799j07535j17860r7652o6106n3402m2274
$$ 4598248 4620144 4608701 4545652 4432588 4307789 4200254 4082394 3984742 3918636 3865234 3822960
9230C822960n0096o5922p6389r1038r7460j28807j75110j94716k01907j92734
$$ 3822960 3772864 3706942 3630553 3539515 3442055 3313248 3138138 2943422 2741515 2548781
9220B548781j87488j91819j90882j70276j50460j37613j11483q0176p6927p3856
$$ 2548781 2361293 2169474 1978592 1808316 1657856 1520243 1408760 1328584 1251657 1177801
9210A177801m9724m6852l9984k7161k4369l0802r024j9749q504j7113J453J1560
$$ 1177801 1128077 1081225 1041241 1014080 989711 958909 949885 930136 921632 904519 905972 917532
9198I17532R575J7481J8310K8340M8331L9624N5828Q3211O7033R1747J20668J24443
$$ 917532 927107 944588 962898 991238 1039569 1079193 1135021 1218232 1285265 1377012 1497680 1622123
9186A622123J38215J67681J65792J78522J67547J53243J17021J08282J41070J43877
$$ 1622123 1760338 1928019 2093811 2272333 2439880 2593123 2710144 2818426 2959496 3103373
9176C103373J77048K69012L94437M15405L39378K15855Q8443n7908k28834l79251
$$ 3103373 3280421 3549433 3943870 4359275 4698653 4914508 5002951 4945043 4716209 4336958
9166D336958m68111m77254l94926l25826k42960j66020j14660o7273l1369k5188
$$ 4336958 3868847 3391593 2996667 2670841 2427881 2261861 2147201 2079928 2048559 2023371
9156B023371k6701l6892k6746m7671r7870j27756j48444j46697j42765j13165
$$ 2023371 1996670 1959778 1933032 1885361 1787491 1659735 1511291 1364594 1221829 1108664
9146A108664r2886r0683p4222p5649o9374n6588m9275n3298l9904j9024k3999
$$ 1108664 1015778 925095 850873 775224 705850 649262 599987 546689 506785 487761 463762
9135D63762k0833k6387k3972r863k36P009J349j2672k876J1534K027j6334r669
$$ 463762 442929 416542 392570 382707 382471 389480 390829 378157 375281 386815 388842 372508 362839
9122C62839o254K7k2712l7787k058R838K1514K4105Q998j1624j4141k3662k9207
$$ 362839 356585 356612 333900 296113 294055 303893 325407 349512 358510 346886 332745 309083 279876
9109B79876m8507m9624k8806l2890o758N065k904k0360j5375N183J9347L0198
$$ 279876 231369 181745 152939 120049 113291 118356 115452 95092 79717 84900 104247 134445
9097A34445J9887J457J0729j0890p848k5580j9748j7038q872j058O193L1007L989
$$ 134445 154332 155789 166518 155628 147780 122200 102452 85414 76542 75484 81677 112684 116673
9084A16673Q151P096l377J4366R724K786K636q434P519K9029J8521O128m344P450
$$ 116673 124824 131920 128543 142909 152633 155419 158055 149621 157140 186169 204690 210818 206474 213924
9070B13924o423j9103o478P764L449L373J7614J4780m486K65p247n036J593K2541
$$ 213924 207501 188398 181920 189684 193133 196506 214120 228900 224414 224679 217432 212396 213989 236530
9056B36530L7119L4960k262p6527o6394K1804P4276K7297J317k29K782j8512j5128
$$ 236530 273649 308609 306347 229820 163426 185230 259506 286803 288120 287891 290673 272161 257033
9043B57033j7687j8762P115R994r289j5520N172K828p344p277M234Q896Q666J9280
$$ 257033 239346 220584 227699 237693 228404 212884 218056 220884 213540 206263 210497 219393 228059 247339
9029B47339P77n25M512Q030L3078O4242R2698J26108J28066O4960l0807j04977
$$ 247339 248116 247591 252103 260133 293211 357453 450151 576259 704325 769285 738478 633501
9017F33501j19556q4792n4787l2696j0462O98J0082M650K1185L4109p114j8698
$$ 633501 513945 429153 374366 341670 331208 331906 341988 346638 367823 401932 394818 376120
9005C76120M706k48L152K1296J9111K2958K3930K0005k000J1613P980M466J2904
$$ 376120 380826 380578 383730 405026 424137 447095 471025 491030 489030 500643 508623 513089 525993
8992E25993J4535O469Q436J4916K5016L3083K9109L4101L2728K4425L7833L1434
$$ 525993 540528 546997 555433 570349 595365 628448 657557 691658 724386 748811 786644 818078
8980H18078J2824K383N061K0867L3334L4017M3761Q6654P1543P8035Q0675P5590
$$ 818078 830902 833285 838346 859213 892547 926564 970325 1056979 1128522 1206557 1287232 1362822
8968A362822P1261O6772N8624P2047O9262R2566J29142J56440J58482J51926J53356
$$ 1362822 1434083 1500855 1559479 1631526 1700788 1793354 1922496 2078936 2237418 2389344 2542700
8957B542700J68150J90352K37681K92508L27937L89397M51617N02725N32899N88616
$$ 2542700 2710850 2901202 3138883 3431391 3759328 4148725 4600342 5103067 5635966 6224582
8947F224582O68765Q22175J079190J377357J734443K116013K507991K912584L309170
$$ 6224582 6893347 7715522 8794712 10172069 11906512 14022525 16530516 19443100 22752270
8938B2752270L684210M118643M807687N951688P863492J1018633J6041960K4150182
$$ 22752270 26436480 30555123 35362810 41314498 49177990 60196623 76238583 100388765
8930A00388765L7333822N6511833P3366327O8170741L4242784j4376589n6968433
$$ 100388765 137722587 194234420 267600747 335771488 370014272 355637683 298669250
8923B98669250p3764687o3690683m5434495l0362026k0215520j3808929r730722
$$ 298669250 224904563 161213880 115779385 85417359 65201839 51392910 41662188
8916D1662188o933442m954946l610368k835977k507454k392381k285500k072150
$$ 41662188 34728746 29773800 26163432 23327455 20820001 18427620 16142120 14069970
8908A4069970j777977j484798j272718j114829r45057p84426o37126n05294l87455
$$ 14069970 12291993 10807195 9534477 8419648 7474591 6690165 6053039 5547745 5160290
8899E160290l42893l09078k87000k65332k46425k27942k06462j68596j56280j46124
$$ 5160290 4817397 4508319 4221319 3955987 3709562 3481620 3275158 3106562 2950282 2804158
8889B804158j36824j33835j37311j33211j18889r2101p8196q5446o3090o0350
$$ 2804158 2667334 2533499 2396188 2262977 2144088 2051987 1973791 1888345 1825255 1764905
8879A764905n6330n7615m9737n0583n1848m4760n9423o6668p3613n8923l1139
$$ 1764905 1708575 1650960 1601223 1550640 1498792 1454032 1394609 1327941 1254328 1195405 1164266
8868A164266k4379l2258k1950j3214k6736l4533l8456j9712j4860k0316j7439
$$ 1164266 1139887 1107629 1085679 1072465 1045729 1011196 972740 953028 938168 917852 900413
8857I00413k3850m5075l8482l3648k2220r446Q441J075j3208k0130k0445j7350
$$ 900413 876563 831488 793006 759358 737138 727692 736133 737208 724000 703870 683425 666075
8845F66075j6507j7518j8102j5209K197K489M326J965m014j2221j7215k2393j8364
$$ 666075 649568 632050 613948 598739 600936 603425 607751 609716 605702 593481 576266 553873 535509
8832E35509m491p109j9693q464K666O569m842p086j7165J703r162k1453k837r540
$$ 535509 531018 523909 504216 495752 498418 504987 500145 493059 475894 477597 468435 446982 444145 434605
8818D34605j4746L593N496L335j1495l695k0059l113N898n107o44j1926j0974
$$ 434605 419859 423452 428948 432283 420788 417093 397034 393921 399819 394712 394068 382142 371168
8805C71168j1326J04O338L4298N5246M4990k7976n8967l0983j9098N68j2671j2218
$$ 371168 359842 359946 366284 400582 455828 500818 472842 413875 382892 363794 364362 351691 339473
8792C39473j7211j4827j2555m638o435m971R302q518j4368n902j0192j7580j3388
$$ 339473 322262 307435 294880 290242 283807 278836 288138 279620 265252 259350 249158 231578 218190
8779B18190m62J0304J262J4387J7236J1294O272m985M596r348j1213k433J7699
$$ 218190 217728 228032 229294 243681 260917 272211 278483 273498 278094 268746 257533 255100 272799
8766B72799J9957J8164M298p991J584o053j1682j7696k3369m631J7727K3031n140
$$ 272799 292756 310920 315218 307227 308811 302758 291076 273380 250011 245380 263107 286138 280998
8753B80998o801p699J058j0522m621J3772N235P051k5285l6938m2682m9752m6637
$$ 280998 274197 266498 267556 257034 252413 266185 271420 278471 253186 216248 173566 123814 77177
8740G7177k7488j0531k5525q14M5317K0195K215Q453n678K818K957M393l502j9150
$$ 77177 49689 39158 13633 12819 58136 78331 80546 88999 83321 86139 89096 93489 89987 70837
8726G0837k805L987k56n65J7438R086J0677J4738Q608J6549L446n204k365o668
$$ 70837 68032 72019 71763 71198 88636 97722 108399 123137 131745 148294 151740 146536 144171 137503
8712A37503l733K597p581k3451l916N8L342J0663Q684m79l130j0402j1055K065
$$ 137503 133770 136367 128786 105335 101419 101477 104819 115482 124166 123687 120557 110155 99100 101165
8698A01165O207m561J1788J0421j191j0291j1546j3118o222l403R207k018Q00
$$ 101165 107372 102811 114599 125020 123829 113538 101992 88874 82652 79249 88456 86438 87238
8685H7238N74q033m362L845K973j628q845j7441J027J6837O345M997J4626Q095
$$ 87238 87812 79779 75417 79262 82235 80607 71762 54321 55348 72185 78530 83527 98153 106248
8671A06248J9624N952J0489K992N979K997j0152n715l152p598k10k632j2946j2690
$$ 106248 125872 131824 142313 145305 151284 154281 144129 138414 135262 127664 127454 124822 111876 99186
8657I9186j0435n727j0980j377Q049J1020j749j2995n374m874j3731M55K495p527
$$ 99186 88751 83024 72044 70667 78716 89736 87987 74992 69618 64744 51013 51468 53963 46436
8643D6436L701Q57J4490J2623Q442J0345Q602n459M389J0479j009J0528J7547
$$ 46436 50137 50994 65484 78107 86549 96894 105496 100037 104426 114905 113896 124424 141971
8630A41971J5604J0320J7431K3410k295j3144n783j5959k4655l3682j8426l221
$$ 141971 157575 167895 185326 208736 206441 193297 187514 171555 146900 113218 94792 91571
8618I1571m956j9677j0876M044j8506j5541N796l062j0766R085O378K1502P447
$$ 91571 86615 66938 56062 60106 41600 26059 31855 28793 18027 27112 33490 54992 62439
8605F2439J6503P899p302o71Q561K497o798j2779O15J9382L032r075n90K664M709
$$ 62439 78942 86841 79539 78868 87429 89926 83128 70349 70964 90346 93378 84303 83713 86377 91086
8590I1086r87j590M60j1420o515l391j918J0155j873l738Q510Q763L735m367q260
$$ 91086 90099 88509 88969 77549 71034 67643 65725 75880 74007 70269 78779 87542 91277 86910 78650
8575G8650j4682Q861K837L745K511j2944n663q291N811Q243J0531p657q768j0533
$$ 78650 63968 72829 75666 79411 81922 68978 63315 55024 60835 69078 79609 71952 63184 52651
8561E2651m393j6003M902L729m244M465R449J7425Q192N594Q24O54J2907J626
$$ 52651 48258 32255 37157 40886 36642 41107 50556 67981 76173 81767 82591 83245 96152 97778
8547I7778K101M323P842J0631J0025q667o9J2977K0629N686J0015J8642L0888
$$ 97778 99879 104202 112044 122675 132700 124033 123964 136941 157570 163256 173271 191913 222801
8534B22801M1923M1497M8110O1173Q0073J11487J28016J26125J25718J03218Q1062
$$ 222801 264724 306221 354331 415504 495577 607064 735080 861205 986923 1090141 1171203
8523A171203N1942J5061k2637n4018q4923j12603j30181j35685j16729j01673
$$ 1171203 1223145 1238206 1215569 1161551 1076628 964025 833844 698159 581430 479757
8513D79757q1712p0453o4378k6299j8268j9171k1899l6175j7004q698L80p847
$$ 479757 398045 327592 263214 236915 218647 199476 177577 141402 124398 115700 116080 108233
8501A08233j5835m465n755K755O495k007N426p574j9570j8393J1690J2734q34
$$ 108233 92398 87933 82178 84933 91428 89421 94847 87273 67703 49310 61000 73734 72900
8488G2900j3662m190l79j0000J0823J2050o419j1970o26m156J6623J4400M218
$$ 72900 59238 55048 54669 44669 55492 67542 61123 49153 48527 44371 60994 75394 79612
8475G9612r284j0567l75m640k18K320l199l152l319j0715o744N986M401j1057
$$ 79612 70328 59761 59386 54746 54528 56848 53649 50497 47178 36463 29719 35705 40106 29049
8461B9049p028L384k290n174N762M361R597j0836j1517J7701K582M015q25J364
$$ 29049 22021 25405 23115 17941 23703 28064 37661 26825 15308 33009 35591 39606 38781 40145
8447D0145L629j0227R138l178J184J1336M539m361M008j2167N379o87n886j94
$$ 40145 43774 33547 42685 39507 40691 52027 56566 52205 56213 44046 49425 48738 42852 42658
8433D2658O630k843j746q79j596l781n889j9248r621R557J6091J1565O747Q530
$$ 42658 49288 46445 44699 43820 42224 38443 32554 13306 3685 13242 29333 40898 47645 56175
8419E6175r183j8440M335J2035m582p123J54k00J498N860m41J4403J3740j0465
$$ 56175 46992 28552 32887 44922 40340 33217 33371 33171 34669 40529 40088 54491 68231 57766
8405E7766j4120k2505j748p539P079N875K939L155o753J808O916l667j089q437
$$ 57766 43646 21141 19393 11854 18933 24808 27747 30902 24149 25957 32873 29206 28117 19680
8391A9680K675N702l14n217P551K092n997J5378L198N955O946j1599o627N58n494
$$ 19680 22355 28057 27743 22526 30077 32169 26172 41550 44748 50703 57649 46050 39423 39981 34487
8376C4487p153R247J2353l70j4377j4570Q016R940k214j908P130l139J1947m691
$$ 34487 27334 36581 48934 48564 34187 19617 27633 37573 35359 33451 40581 37442 49389 44698
8362D4698q277O29l568R89K044K155J81p680n457Q289l011j0025O699o773K10
$$ 44698 36421 37050 33482 34471 36515 38670 38851 31171 25714 34003 30992 20967 27666 20893 21103
8347B1103N065n134L254N891J7076K128N647q523r094q001j285K3J509M995J849
$$ 21103 26168 21034 24288 30179 47255 49383 55030 46507 37413 29412 28127 28150 29659 34654 36503
8332C6503J970L004K152j089Q705K145M649M864j5925o726J498Q357j2896K249
$$ 36503 38473 41477 43629 42540 51245 53390 58039 62903 46978 40252 41750 50107 37211 39460
8318C9460M854P132J79j5960j0596J901L75M081j374L687j546m888J0016L259
$$ 39460 44314 51446 51625 35665 25069 26970 27345 31426 30052 33739 32193 27305 37321 40580
8304D0580L879j0620m948k933J360P684O519l733j986J54J304j887j1110N649
$$ 40580 44459 33839 28891 25958 27318 35002 41521 37788 35802 35956 37260 35373 24263 29912
8290B9912K75k803K295N76K308L706N008J51j1375Q848N628n954n159k11m202
$$ 29912 30187 27384 29679 30255 32563 36269 41277 41428 30053 38901 44529 38575 33416 33205 29003
8275B9003r67R664j396l003k820r518r660P013R583k724J058o568n734R944M603
$$ 29003 28036 37700 36304 33301 30481 20963 11303 18316 27899 25175 26233 19665 13931 23875 28478
8260B8478k008l752M257J73O397K262L242O93K267p088k0004q056P399k710m570
$$ 28478 26470 22718 26975 27148 33545 35807 39049 39742 42009 34921 14917 6861 14260 11550 6980
8245F980R967J5568L537p004j4708j5472k1238L033K3960J3100K57q165q73J1201
$$ 6980 16947 32515 36052 29048 14340 -1132 -22370 -19337 4623 17723 17980 9815 8942 20143
8231B0143l699n641L4J206O334N749n137k155L556k440l360M070J0848j0827Q634
$$ 20143 16444 10803 10837 12043 18377 24126 18989 16834 20390 17950 14590 18660 29508 18681 27315
8216B7315N317q857r720P460k268M816J527n299N925L54O006M504J2035J140j8846
$$ 27315 32632 23775 14055 21515 19247 24063 25590 20291 26216 26570 32576 37080 49115 50255 31409
8201C1409k1559j845J6409M028j3083p600M474Q85p405L996O088J1198N917N22
$$ 31409 9850 8005 24414 28442 15359 7759 12233 13118 5713 9709 15797 26995 32912 33434
8187C3434K678L583k554N85o944j1599L854o695L125o166p966l432p920q913Q154
$$ 33434 36112 39695 37141 37726 30782 19183 23037 16342 19467 13301 5335 1903 -6017 -14930 -6776
8172f776P012k717Q228J0165N076M612L507j1038m120j423N614j455l554J6968
$$ -6776 236 -2481 5747 15912 20988 25600 29107 18069 13949 12526 18140 16685 13131 30099
8158C0099j9959r590M758J340P743j0142J765Q593L773J1093M973N827j136O116
$$ 30099 10140 550 5308 6648 14391 4249 6014 14607 18380 29473 34446 40273 39137 45253
8144D5253p839q840O313p469j0557m855m039M94J5271l0j4740j8450j7130J226
$$ 45253 37414 28574 34887 27418 16861 12006 7967 8461 23732 23702 8962 -9488 -26618 -25392
8130b5392J842P738N468k587O579N096j343k943J4343O760q706p70K3841p777
$$ -25392 -23550 -15812 -10344 -12931 -6352 -1256 -2599 -5542 8801 15561 6855 6085 29926 22149
8116B2149m051O309r843n435K066n389J901O234K508P406O778n750P323o218r910
$$ 22149 18098 24407 14564 9129 11195 5806 7707 13941 16449 23855 30633 24883 32206 25988 16078
8101A6078p182j007k029k732J1358k120P17P28o598J5186O979j729K996K208P473
$$ 16078 8896 7889 5860 3128 14486 12366 13083 13811 7213 22399 29378 27649 30645 32853 40326
8086D0326M514K930j9030k0568l902l409N853J5263R76Q339J6633j7264j5895
$$ 40326 44840 47770 28740 8172 4270 861 6714 21977 22953 31292 47925 30661 14766
8073A4766M616J972L589M529R618l437k2936o265J421K651J0005o690j0078K909
$$ 14766 19382 21354 24943 29472 39090 35653 12717 6452 7873 10524 20529 13839 3761 6670
8059F670M093J5265l57p832p788J7945L730j4286q37q082m689J3019j2472l771
$$ 6670 10763 26028 25671 17839 10051 27996 31726 17440 16603 8521 3832 16851 4379 608
8045F08R858L114K452J750m949N491O368J0567P801M192j6553j0565Q485j262
$$ 608 10466 13580 16032 17782 12833 18324 24692 35259 43060 47252 30699 20134 28619 27357
8031B7357K887m090n444L232N412K539n532j6553l225J6214L480m168L417j1903
$$ 27357 30244 26154 20710 23942 29354 31893 26361 9808 6583 22797 26277 22109 25526 13623
8017A3623k557J6776O129m713l36p350L728l480k613Q461N169N780Q25j4897Q160
$$ 13623 11066 27842 33971 29258 28922 21572 25300 21820 19207 27668 32837 38617 39442 24545 32705
8002C2705J4839Q240p835K1528Q457m486k983M122j7709k0572K621P729N430q655
$$ 32705 47544 55784 47949 69477 77934 73448 70465 74587 56878 36306 38927 46656 52086 43431
7988D3431m29K0566K3292k162j3089k1780r964r546j0875Q589K471q856j1470
$$ 43431 43002 63568 86860 84698 71609 49829 39865 30319 19444 28033 30504 21648 10178
7975A0178Q08K167j613K899K110r61p794J6536j594j7208M673K195K040L297k45
$$ 10178 10986 13153 11540 14439 16549 15588 7794 24330 22736 5528 10201 12396 14436 17733 17488
7960A7488K438J6742R498j214Q83P243M167l803R878k61j6014K24l014n400M769
$$ 17488 19926 36668 46166 44952 45835 53078 57245 53442 63320 63059 47045 47269 44255 38855 43624
7945D3624K695Q989J978q785j1682r848r345O516J6602j4852l219M374R466k876
$$ 43624 46319 55308 57286 48501 36819 26971 17626 24142 40744 25892 22673 27047 36513 33637
7931C3637j275M48o86k923l369j6846m55J1953J1313J363j4515j4533M564K0288
$$ 33637 32362 32810 32124 29201 25832 8986 8531 20484 31797 33160 18645 4112 8676 28964
7917B8964Q769m312m268M41Q630Q685m755j3252k3204j713R149J1802k196j7387
$$ 28964 37733 33421 29153 29594 38224 46909 42154 28902 5698 3985 13134 24936 22740 5353
7903E353m552p601M615P821J5212l57k294m474l100l752K553r170L364k830l681
$$ 5353 801 -6800 -2185 5636 20848 20491 18197 13723 10623 6871 9424 254 3618 788 -2893
7888b893n871j0643O731J5271P459J1429n799r433J3406Q832o320J408m754n461
$$ -2893 -8764 -19407 -12676 2595 10054 21483 15684 6251 19657 28489 22169 23577 18823 13362
7874A3362j265j8878J527M076J712j779R288J3858o134j2079L347J78M893J4441
$$ 13362 12097 -6781 -5254 -1178 534 -1245 8043 21901 15767 3688 7035 7213 12106 26547
7860B6547l523Q0K017j5602P56J6987j987r186O013O183P639p111j2015o390j0493
$$ 26547 23024 23104 25121 9519 10275 27262 25275 16089 22102 28285 35924 28813 16798 10408 -85
7845h5o066m396R159J4912J100R109M989m021K713k761j0114r644K531L280l371
$$ -85 -6151 -10547 -1388 13524 14624 23733 28722 24701 27414 24653 14539 4895 7426 10706 7335
7830G335R323J454m724p530l582j288q77L758K508l059N998j3076M591J4552j3694
$$ 7335 16658 18112 13388 5858 2276 988 111 3869 6377 3318 9316 -3760 831 15383 1689
7815A689P621r018n05o555m091K0947J9689k0327k994j118M004n884o799m866
$$ 1689 9310 292 -213 -6768 -10859 10088 29777 9450 6456 5338 9342 3458 -3341 -8207
7801h207Q4J4463l270l409k03N009n506j9678j7347l180n780L360K4746J3093
$$ -8207 -8123 6340 3070 -339 -542 4467 -1039 -20717 -38064 -41244 -47024 -43664 -18918 -5825
7787e825J1136r07q691j0105k376R357N501l453P147J6083M561j3366P83M34N526
$$ -5825 5311 4404 -4287 -14392 -16768 -7411 -1910 -5363 1784 17867 22428 9062 9845 10279 15805
7772A5805m97j819K400L836L217n973k323N080J2019J038j1356M831N65J735K352
$$ 15805 15308 13489 15889 19725 22942 16969 14646 19726 31745 32783 21427 26258 26823 28558 30910
7757C0910R57P779q209k7385n405J1400K636p603K792J936j0897o4N089J5006
$$ 30910 31867 39646 31437 4052 -1353 10047 12683 5080 7872 9808 -1089 -1153 3936 18942
7743A8942j1099j1619K358N432J443j243M365L464P391n421n805r14o008K018
$$ 18942 7843 -3776 -1418 4014 5457 4214 8579 12043 19434 14013 8208 7294 1286 3304
7729C304Q188M749M899j158j3417j049N696J2320J764k560Q551R22m708r268P423
$$ 3304 11492 16241 21140 19982 6565 5516 11212 23532 25296 22736 31287 32209 27501 18233 25656
7714B5656J846j388m476m700m321P387o799P84Q721j529r134p869p29M147j143
$$ 25656 27502 26114 21638 16938 12617 20004 13205 13989 22710 21181 12047 4178 3449 7596 6453
7699F453J95l110N462J094O098L262m795k586m188m003O129p788l916J3479J0918
$$ 6453 6648 3538 9000 10094 16192 19454 14659 12073 7885 3882 10011 2223 -1693 11786 22704
7684B2704n838j6708j955p142k64J0687j603N062J0486l004o24N798m842K872
$$ 22704 16866 158 -1797 -8939 -9203 1484 -119 4943 15429 12425 11801 17599 12757 15629
7670A5629p584l951O709P44l301J2288m2K242K522j0719j1751Q48j428K556j828
$$ 15629 8045 4094 10803 11547 8246 20534 20492 22734 25256 14537 2786 3634 2206 4762 2934
7655B934J718k957J900j3055N260n282j623p491M607JR6J0837P074O364P607j1630
$$ 2934 4652 1695 3595 -9460 -4200 -9482 -11105 -18596 -13989 -13988 -13892 -3055 4019 10383 17990 6360
7639F360q818o55n172K442Q549J023m026j0995k491K287J4268O691j2365k870
$$ 6360 -2458 -3113 -8285 -5843 2706 3729 -297 -11292 -13783 -11496 2772 9463 -2902 -5772
7625e772J1714R724l023P845l945O930k756m127p041P759O826K672m302j4645
$$ -5772 5942 15666 12643 20488 16543 23473 20717 16590 9549 17308 24134 26806 22504 7859
7611G859K07J273j566N153m492k867n662n124J9724k090j3820j0580J1376L600
$$ 7859 8066 9339 7773 12926 8434 5567 -95 -5219 14505 12415 -1405 -11985 -609 2991
7597B991n200q11M445J1996l646q518r222l052L131R694K0914m3j5718j3353J854
$$ 2991 -2209 -3020 1425 13421 9775 1257 -7965 -11017 -7886 1808 22722 22679 6961 -6392 -4538
7582d538J0756N114j668r28j257p138j935K825J0918l48P169L962n182N359j2380
$$ -4538 6218 11332 9664 8736 7479 341 -1594 1231 12149 11801 18970 22932 17750 23109 10729
7567A0729n770J1800Q526k825n786M074n728r297M821O48r525N332L313m086L34
$$ 10729 4959 16759 25285 22460 16674 20748 15020 5723 10544 11192 1667 6999 10312 6226 6560
7552F560p774o552P459J2824o86j2319K490J1713J088q765j5256o029Q88J9527
$$ 6560 -1214 -7766 -307 12517 11831 -488 2002 13715 14803 6038 -9218 -15247 -14359 5168
7538E168O027Q660J5665r324j4739j2423P46J7258M228j719r272j288J2591M329
$$ 5168 11195 19855 35520 26196 11457 -966 -220 17038 21266 19547 10275 8987 21578 25907
7524B5907J768j7648j1009m090J811N632L119j3841r127o90n372J3684P658p598
$$ 25907 27675 10027 -982 -5072 -3261 2371 5490 -8351 -17478 -18168 -23540 -9856 -2198 -9796
7510i796m106Q592R282J0727m099k2326l819N416N585l747k159o144J698J134
$$ -9796 -13902 -5310 3972 14699 10600 -11726 -15545 -10129 -4544 -8291 -10450 -16594 -14896 -13762
7496a3762N562J2108K1663J3868j6107q121o768m724p912Q23j357m289J4589K2925
$$ -13762 -8200 3908 25571 39439 23332 15211 8443 3719 -4193 -3370 -4727 -9016 5573 28498
7482B8498q293j4676o209R67N560q401K736L247N191j3449m290N971Q500n657
$$ 28498 20205 5529 -680 287 5847 -2554 182 3429 8620 -4829 -9119 -3148 5352 -305
7468c05J1500N003k496N456J0424L64l367p978o096j270p28J404m244M840m526
$$ -305 11195 16198 13702 19158 29582 29946 26579 18601 12505 11235 10507 11911 7667 12507 7981
7453G981j705P350N482l735m222R371M748r770J27m601k618N40j1349l842P28
$$ 7981 6276 13626 19108 15373 11151 20522 25270 15500 15627 11026 8408 8948 -2401 -6243 -5515
7438e515Q151q126q895p340Q013J3953j260J420L707m495q572m323J9931n62j5167
$$ -5515 2636 -5490 -14385 -21725 -13712 241 -1019 401 4108 -387 -8959 -13282 6649 6087 -9080
7423i080j0602L083P896J2678L167o197q122J800M622P57j566N741j2552K5822
$$ -9080 -19682 -16599 -8703 3975 7142 945 -7177 -5377 -755 2 -1564 4177 -8375 17447
7409A7447Q392j4805j2635j860J480r01k32l086q629L430J2470k432j3934m095
$$ 17447 25839 11034 -1601 -3461 -1981 -2882 -3114 -6200 -14829 -11399 1071 -1361 -15295 -19390
7395a9390N134Q237J865k460M311L802o603o272j1792J0122J4622J2948M067k2526
$$ -19390 -14256 -6019 -4154 -6614 -2303 1499 -5104 -11376 -23168 -13046 1576 14524 18591 -3935
7381c935j4393L679J0810J5771N568p828j5716J632J5140l290j8940k516Q366
$$ -3935 -18328 -14649 -3839 11932 17500 9672 -6044 -4412 10728 7438 -11502 -14018 -5652
7368e652P678j326r932k519K698p230J0845J632j6897r092J5774J8382O064k330
$$ -5652 2026 700 -9232 -11751 -9053 -16283 -5438 -3806 -20703 -29795 -14021 4361 10425 8095
7354H095J0128J0960k4169L277p835m516J1124O69q853K668P431M217M296m946
$$ 8095 18223 29183 5014 8291 456 -4060 7064 7733 -1120 1548 8979 13196 17492 12546
7340A2546q73m878k256j008P084K001m084n436M335r543J001l636L509J4064L620
$$ 12546 11673 6795 4539 3531 10615 12616 8532 3096 7431 -2112 -1111 -4747 -1238 12826 16446
7325A6446n225q597j5058q486J7995J5204l675l800J6195N545j7037j8562R05
$$ 16446 11221 2624 -12434 -20920 -2925 12279 8604 4804 20999 26544 9507 -9055 -8150
7312h150n774R369O818k946J679J6844R303j6209j3686N941N872p49j726K699
$$ -8150 -13924 -4555 2263 -683 996 17840 27143 10934 -2752 3189 9061 8312 6586 9285
7298I285m847n978r506J405J1313K472O23o68j059j2165M963O058K055j915j554
$$ 9285 4438 -1540 -11046 -9641 1672 4144 4767 4099 3040 -9125 -4162 1896 3951 2036 482
7283D82Q635L493j789K576p183r037k56k377O168R273n671j272p797k925J4058
$$ 482 9117 12610 10821 13397 6214 -2823 -3079 -5456 712 9985 4314 3042 -4755 -7680 6378
7268F378J7045Q962p527k0046m778J1262L256q651r213q830n298n16m658Q432
$$ 6378 23423 32385 24858 4812 34 11296 14552 5901 -3312 -12142 -17440 -17956 -22614 -14182
7254a4182J4368P280J1293p146k525n942k67P87r617l861j3015m00J0868J7374
$$ -14182 186 7466 18759 11613 9088 3146 2879 3666 -5951 -9812 -22827 -23227 -12359 5015
7240E015J8086L604m545k6726j1873Q790k500J4978L605p615l714p305J5670J0265
$$ 5015 23101 26705 22160 -4566 -16439 -7649 -10149 4829 8434 819 -2895 -10200 5470 15735
7226A5735k801M717K253n364q467o843k502l166K947P604r24j765j21m712k229
$$ 15735 12934 17651 19904 14540 6073 -770 -3272 -6438 -3491 4113 3189 1424 1303 -3409 -5638
7211e638R274L160m748P730Q098o511j270J867l974q992K489M804R855P582J515
$$ -5638 3636 6796 2048 9778 17876 11365 10095 11962 7988 -1004 1485 6289 16144 23726 25241
7196B5241j1399q582n709O311J5q855N171m516j0368M8K68J6584J5573r26M93
$$ 25241 13842 5260 -449 5862 5877 -2978 2193 -2323 -12691 -12643 -12375 4209 19782 18856 19349
7181A9349J1414K241j3633k469m816j4691j637M71J0066J128o000m480r910J976
$$ 19349 30763 33004 19371 16902 12086 -2605 -4242 -3771 6295 7423 1423 -3057 -12967 -10991
7167a0991J3344J0336J102j3863P19O41K83j3171n618K900M841j850R606L416
$$ -10991 2353 12689 13791 -72 647 1288 1571 -11600 -17218 -14318 -9477 -11327 -1721 1695
7153A695m140j8102m549Q348p525M259J662N442J0346P594q401l153O827m477
$$ 1695 -2445 -20547 -25096 -16748 -24273 -20014 -18352 -12910 -2564 5030 -3371 -6524 303 -4174
7139d174M854j8071K150J792p44j716M171L802J902J8108K411M729o934l816J0
$$ -4174 680 -17391 -15241 -13449 -14193 -15909 -11738 -7936 -6034 12074 14485 19214 12280 8464 8474
7124H474o291N841j6326p371J4219K048k503N446K411n790m336K761j76K670O983
$$ 8474 2183 8024 -8302 -15673 -1454 594 -1909 3537 5948 158 -4178 -1417 -1593 1077 8060
7109H060j443L236j32P99o570n663n76k800M897J2894J3433q022n463q349j596
$$ 8060 6617 9853 9721 10520 3950 -1713 -2289 -5089 -192 12702 26135 18113 12650 4301 2705
7094B705M237j4454L486J4057j0679o487j977o695j094J4308m93j7542O674N788
$$ 2705 6942 -7512 -4026 10031 -648 -7135 -9112 -15807 -16901 -2593 -3086 -20628 -13954 -8166
7080h166k699M554m60k432R022k291Q593n068j4494j7464j054J8709k135N305
$$ -8166 -10865 -6311 -6771 -9203 -181 -2472 6121 1053 -13441 -30905 -31959 -13250 -15385 -10080
7066a0080J1469O634Q117Q792K3J332J911j1631n817Q069l54q600M779L82j6682
$$ -10080 1389 8023 16140 24932 24955 26287 28198 16567 10750 18819 18465 9865 14644 15026 -1656
7051a656r104Q851m03N488j1178j0286j761R136Q740j504J2089O006j1937j4105
$$ -1656 -10760 -1909 -2312 3176 -8002 -18288 -20049 -10913 -2173 -3677 8412 14418 2481 -11624
7037a1624q410O220J3019r235k45J4152O625q769K495J0830n588m973J7239K494
$$ -11624 -20034 -13814 -795 -10030 -10275 3877 10502 1733 4228 15058 9470 4497 21736 24230
7023B4230n02r680l832N559L93r958j3117n995o051J8798J6323j538O28O137L261
$$ 24230 23728 14048 10216 15775 16168 6210 -6907 -12902 -18953 -155 16168 14630 15258 21395 24656
7008B4656j1977n468l776k724J657Q48p109O331O717j762j3252p676P044m638
$$ 24656 12679 7211 3435 711 2368 3216 -3893 2438 9155 7393 -5859 -13535 -6491 -11129
6994a1129M009J3486J0666k190j3942n331M919l874j209K560M261j2354L493K1716
$$ -11129 -7120 6366 17032 14842 900 -4431 488 -3386 -4595 -2035 2226 -10128 -6635 15081
6980A5081J3249j2199p478N735k303k7j4876j5395N123J836N908J4477O209N400
$$ 15081 28330 16131 8653 14388 12085 12058 -2818 -18213 -13090 -11254 -5346 9131 15340 20740
6966B0740J132q715J473N42L452j9329j5143N453M641n661R814L088N710J4975
$$ 20740 21872 13157 14630 15172 18624 -705 -15848 -10395 -5754 -11415 -1601 1487 7197 22172
6952B2172q627k0209p540l097Q816j731O664J0065l468M139J606K939P878j1612
$$ 22172 13545 -6664 -14204 -17301 -8485 -10216 -3552 6513 3045 7184 8790 11729 19607 7995
6938G995j3970L410j0985j2821R072m734r840M397J6137P001J672N724J487p262
$$ 7995 -5975 -2565 -13550 -26371 -17299 -22033 -31873 -27476 -11339 -4338 -2666 3058 4545 -2717
6924b717j1292j510P909R092R756J301j866n809j4791r811J2054n325m564O847
$$ -2717 -14009 -15519 -7610 1482 11238 12539 10673 4864 -9927 -19738 -7684 -13009 -17573 -10726
6910a0726l795J6955J8196j2940L646O733o775k062k450o176n228K072M410J0146
$$ -10726 -14521 2434 20630 7690 11336 18069 11294 9232 6782 606 -4622 -2550 1860 12006
6896A2006K025k233n224j476J024O071K274J868m764o844r22k924j827k15K553
$$ 12006 14031 11798 6574 5098 6122 12193 14467 16335 11571 4727 3805 881 -946 -1161 1392
6881A392m544j2339n50R14M272K682K486J0635p542J274K4106J213m520o050j4130
$$ 1392 -3152 -15491 -16041 -15127 -10855 -8173 -5687 4948 -2594 -1320 22786 23999 19479 13429 -701
6866g01k933M892j4004p83O180P09k667o597J3727o236j4421M247J0528j112P367
$$ -701 -3634 1258 -12746 -13529 -7349 -6640 -9307 -15904 -2177 -8413 -22834 -18587 -8059 -9171 -1804
6851a804P117M860j1771Q388J4343p502k2948j701J61K31R943J3065L890p233
$$ -1804 5313 10173 -1598 6790 21133 13631 -9317 -11018 -10857 -10626 -683 12382 16272 9039
6837I039j8508m133J9M967O675J0817k136k878l649l161L343p319p919J084J5570
$$ 9039 -9469 -13602 -13583 -8616 -1941 8876 6740 3862 213 -2948 395 -6924 -14843 -13759 1811
6822A811k771l094Q3k080j4499q356J6309R247Q849J2265M035K469q271l086j2742
$$ 1811 -960 -4054 -3971 -6051 -20550 -28906 -12597 -3350 5499 17764 21799 24268 15997 12911 169
6807A69n159P11n192Q65L314J3846J1503j2841q860P088J906j0945n511n566J2556
$$ 169 -4990 -4279 -9471 -8606 -5292 8554 20057 7216 -1644 5444 7350 -3595 -9106 -14672 -2116
6792b116J0940R659j9878q437M162J019o359J685J0819N643L92j2424Q008p384
$$ -2116 8824 18483 -1395 -9832 -5670 -4651 -11010 -9325 1494 7137 7529 -4895 3113 -4271
6778d271n046K768N650j252M622n244p784j950J0161m824q05K0367J2758j1944
$$ -4271 -9317 -6549 -899 -2151 2471 -2773 -10557 -12507 -2346 -7170 -7975 12392 25150 13206
6764A3206j7922j2675M955J8137J03j1277O076n957L398J8561J0192r865l051
$$ 13206 -4716 -17391 -12436 5701 5804 -5473 603 -5354 -1956 16605 26797 16932 13881
6751A3881r400m948R160P820r783l368k307J3037Q044j4909k999K300m133p628
$$ 13881 4481 -467 8693 16513 6730 3362 1055 14092 22136 7227 4228 6528 2395 -5233
6737e233J92K076P957M777j1665k276L152r40l605n708M612M95J1338Q660L072
$$ -5233 -5041 -2965 4992 9769 -1896 -4172 -1020 -1960 -5565 -11273 -6661 -6166 5172 13832 16904
6722A6904q335p866K743k100m97J0391O917l603m373q272Q770M184O37o837l862
$$ 16904 8569 703 3446 1346 849 11240 18157 14554 10181 1909 10679 14863 15500 8663 4801
6707D801m952o598p978K465Q855L268j68n452R845j580j379K706q980K105R49
$$ 4801 -151 -6749 -14727 -12262 -3407 -139 -307 -5759 4086 2506 1127 3833 -5147 -3042 -2093
6692b093l922o374J149J8856p23K814r25j3231o610J742K27P282K081M542R33
$$ -2093 -6015 -12389 -11240 7616 6893 9707 8782 -4449 -11059 -9317 -9090 -1808 273 4815 5748
6677E748O139K553Q418n578j1107o412M27q726l57n871o851k74m213K672j244
$$ 5748 11887 14440 22858 17280 6173 -239 188 -8538 -8895 -14766 -21617 -21891 -26104 -23432 -24676
6662b4676J4380J3842M197o485n011L649R819N394j2019N7o336j394O426l664
$$ -24676 -10296 3546 7743 1258 -3753 -104 9715 15109 3090 3147 -3189 -4583 1843 -1821
6648a821M908J9294P840j1038j0061n912k277L330O684l821l409q325j0925n839
$$ -1821 3087 22381 30221 19183 9122 3210 933 4263 10947 7126 3717 -4608 -15533 -21372
6634b1372L549P778J979O035O118Q55L02l412n144J3124P004M204j0971Q293J0009
$$ -21372 -17823 -10045 -8066 -2031 4087 4942 5244 1832 -3312 9812 16816 21020 10049 18342 28351
6619B8351j3181j2857L781l535j778j999l618r493o304J3346J3978J980r91j1091
$$ 28351 15170 2313 6094 2559 781 -1218 -4836 -14329 -20633 -7287 6691 8671 7680 -3411
6605c411j0802N377l159J0335J3497k486l529k1922j3381l795J8525N925Q638
$$ -3411 -14213 -8836 -11995 -1660 11837 9351 5822 -16100 -29481 -33276 -14751 -8826 -188
6592a88R188n699q130o538J1475P454o68j5063j2030O801K2958J3993M284K365
$$ -188 9000 3301 -4829 -11367 108 7562 6894 -8169 -20199 -13398 9560 23553 27837 30202
6578C0202j6719k2866j186K166J0469J2619n519l987j2288m891O737n593J2305
$$ 30202 13483 -9383 -10569 -8403 2066 14685 9166 5179 -7109 -12000 -5263 -10856 1449
6565A449j004q50J100q830M599n828p071O566J364P301J5663J895m043j0127m162
$$ 1449 445 -405 695 -8135 -3536 -9364 -16435 -9869 -8505 -1204 14459 16354 12311 2184 -1978
6550a978J8178M869n95l412o366r507p51l322J4318J729j5243K485O366j0439
$$ -1978 16200 21069 20474 17062 10696 1189 438 -2884 11434 13163 -2080 405 6771 -3668
6536c668J111O570R018j371J4330o267n482K273L228o196j1893o454r1n445r140
$$ -3668 -2557 4013 13031 11660 25990 19723 14241 16514 19742 13546 1653 -4801 -4892 -10337 -19477
6521a9477k962N545J7403P260J935n927L465J0807m461j4493m393K021O37p48
$$ -19477 -22439 -16894 509 7769 9704 3777 7242 18049 13588 -905 -5298 -3277 -2640 -3388
6507c388L192m631k413J988O324K528M81J108j2548k0367j561J1241J3809m12
$$ -3388 -196 -4827 -7240 -5252 1072 3600 4081 5189 -7359 -27726 -29287 -18046 -4237 -4649
6493d649k832N536M913j884j660l078o485Q545R430J128j2130n23j1558M059R456
$$ -4649 -7481 -1945 2968 1084 -576 -3654 -10139 -1594 7836 8964 -3166 -3689 -15247 -11188 -1732
6478a732N562R136k36j566j643r138K237j001j3809P177J0031o145j0026L242
$$ -1732 3830 12966 12730 11164 9521 383 2620 1619 -12190 -5013 5018 -1127 -11153 -7911
6464g911n96o404N609J0129K342P882M328o515n809J136O121r886m217k092j973
$$ -7911 -8507 -14911 -9302 827 3169 11051 15379 8864 3055 4191 10312 426 -3791 -5883 -7856
6449g856l359O076N414O594J1606p969j5191j539j889l92j378J0710n662j1922
$$ -7856 -11215 -5139 275 6869 18475 10506 -4685 -6224 -8113 -8505 -9883 827 -4835 -16757
6435a6757k202m599l689J9468K073l168l671k993R819N512k048M790M887j2755
$$ -16757 -18959 -23558 -27247 -7779 -5706 -8874 -12545 -15538 -5719 -207 -2255 2535 7422 -5333
6421e333M959J1241K77q30m867j52L865q62m566M609J5546n453j2912j888k137
$$ -5333 -374 10867 11144 10314 5447 5295 9160 8298 3732 8341 23887 18434 5522 3634 1497
6406A497p551k312J101P220P224k734n994J185L224j07o217k010N195J386l381
$$ 1497 -6054 -8366 -7265 -45 7179 4445 -1549 -364 2860 2753 -3464 -5474 -279 1107 -2274
6391b274q742k7028J825J1276R623J4365k611J5740K841j2495k703k394N481K951
$$ -2274 -11016 -38044 -36219 -24943 -15320 -955 -3566 12174 15015 2520 -183 -2577 2904 5855
6377E855j5159O2J2928R582O668p035j360N01l432O248K307o472J219j876m729
$$ 5855 -9304 -9242 3686 13268 19936 12901 11541 12042 8610 14858 17165 10693 11912 10036 5307
6362E307j3607K209l498q125J284J4766J4733L611m203l25o27J293j113j1420
$$ 5307 -8300 -6091 -9589 -17714 -16430 -1664 13069 16680 12477 12152 11525 12818 11705 285
6348B85j2103K997R876L058n573l101n764J586N054R82O374J400q111p498k009
$$ 285 -11818 -8821 1055 4113 -1460 -4561 -10325 -8739 -3685 -2703 3671 5071 -3040 -10538 -12547
6333a2547R021O343P916P740K239j0167j4258j0072n559K079n739P812k011j3349
$$ -12547 -3526 2817 10733 18473 20712 10545 -3713 -13785 -19344 -17265 -23004 -15192 -17203 -30552
6319c0552M080Q665L429J342J1476M084R144p663j9613R650J2291N085m99j983
$$ -30552 -26472 -17807 -14378 -13036 -1560 2524 11668 4005 -15608 -5958 6333 11418 10919 8936
6305H936L18o273m405q748m915J258O775J7096K121j1024k0451l074P319j824
$$ 8936 9254 2981 -1424 -10172 -15087 -13829 -7054 10042 12163 1139 -19312 -22386 -15067 -16891
6291a6891l244J6976R249m574j4789J141N669j985L767k686N852k163K365J3834
$$ -16891 -20135 -3159 6090 1516 -13273 -12132 -6463 -8448 -4681 -7367 -1515 -3678 -1313 12521
6277A2521J1442n022j1779m907l509m531J1094N649j7287n992Q061K609L185J1762
$$ 12521 23963 18941 7162 2255 -1254 -5785 5309 10958 -6329 -12321 -4260 -1651 1534 13296
6263A3296L075j5905l360J1917m930j0019J810O248J5090j0518j5714l739J0405
$$ 13296 16371 466 -2894 9023 4093 -5926 -4116 2132 17222 6704 -9010 -12749 -2344
6250b344J0125r556j4438K039J5200J2482N87q463q296P24N034J4554q038n889
$$ -2344 7781 -1775 -16213 -14174 1026 13508 14095 5632 -2664 -1940 3094 17648 9610 3721
6236C721J3262P707J786j6078p384J3551N512r077m614p937m206j083M416P507
$$ 3721 16983 24690 26476 10398 3014 16565 22077 13000 8386 449 -3757 -4840 -424 7083
6222G083p080j4022M955J654k937p84j098J0117J359l20J3933L731k858m670l797
$$ 7083 3 -14019 -9064 -7410 -10347 -11131 -12229 -2112 -753 -1073 12860 16591 13733 9063 5266
6207E266j3734j3473N829L206O329P117J0050m59k2699L36M54k771j7237J2516
$$ 5266 -8468 -21941 -16112 -12906 -6577 540 10590 10131 -12568 -12232 -11778 -14549 -31786 -19270
6193a9270K0992m555r571Q934n53o408m437J6154J205q809o906J1866k537q141
$$ -19270 1722 -2833 -12404 -3470 -4023 -10431 -14868 1286 2491 -6318 -13224 -1358 -3895 -12036
6179a2036o23o526J0276N199K218L637p535J860o56k708n371Q544J1174J106K331
$$ -12036 -12659 -19185 -8909 -3710 -1492 2145 -5390 -3530 -4186 -6894 -12265 -3721 7453 8559 10890
6164A0890q765j2478j088P066k013K451j0298j443R589J3636J657j4770r212K544
$$ 10890 2125 -10353 -11441 -4375 -6388 -3937 -14235 -15678 -6089 7547 9204 -5566 -14778 -12234
6150a2234M198J034O665K291j4959k0923k657J3498J2868L551R61J4602J1166
$$ -12234 -8036 -7002 -337 1954 -13005 -33928 -36585 -23087 -10219 -6668 -5707 8895 20061
6137B0061j0045j6011m789M054J1563m90N366Q772j4976j1821K645j793N616M269
$$ 20061 10016 -5995 -10784 -6730 4833 4343 9709 18481 3505 -8316 -5671 -7464 -1848 2421
6123B421N770q403m500R602L832j992j4887L03J5717J1652q761o577n10q303K823
$$ 2421 8191 -212 -4712 4890 8722 6730 -8157 -7854 7863 19515 10754 4177 3667 -4636 -1813
6108a813L477O525L540o424o791K204l103j204p508k244L139J5510N407j0584
$$ -1813 1664 8189 11729 5305 -1486 718 -2385 -3589 -11097 -13341 -10202 5308 10715 131
6094A31m088K563j875l882n146O116q641j0109J9019J8278j555p29J407L551P827
$$ 131 -3957 -1394 -3269 -7151 -12297 -6181 -14822 -24931 -5912 12366 10811 10082 11489 15040 22867
6079B2867l641j2103j3006k653L525R831n953M911L789r884j0419n75O3J2916
$$ 22867 19226 7123 -5883 -8536 -5011 4820 -1133 3778 7567 -2317 -12736 -13311 -13248 -332
6065c32J006J1217o542p236J176O237J1816M472q824k0476j1454Q441j683k2J165
$$ -332 674 11891 5349 -1887 -711 5526 17342 21814 12990 -7486 -18940 -10499 -12182 -12204 -11039
6050a1039P191K251L076M344o746r593O436J263m93J0758K310O438M697p88l76
$$ -11039 -3848 -1597 1479 5823 -923 -10516 -4080 -2817 -3310 7448 9758 16196 20893 20105 19729
6035A9729J0054p6o172j1633j0266L617k340j666l129k778J1848R196j5292k2127
$$ 19729 29783 29707 23535 11902 1636 5253 2913 1247 -1882 -4660 7188 16384 1092 -21035
6021b1035j3144Q045J9738O807o571l588J1826O404K314j3838l784J1536J7867
$$ -21035 -34179 -26134 -6396 411 -6160 -9748 2078 8482 10796 -3042 -6826 4710 22577
6008B2577m341J199P498r709p510o974l93K136L526n381k660K853J654N002k424
$$ 22577 18236 19435 26933 17224 9714 2740 2347 4483 8009 2628 -32 2821 4475 9477 7053
5993G053J2821J2131O836l336R41j1919j1828l302p556O960l618l250O186O289
$$ 7053 19874 32005 38841 35505 36446 24527 12699 9397 1841 8801 5183 1933 8119 14408
5979A4408p920p843p53k73N628J2308j1846m595M61J098j7160m256J1520J2097
$$ 14408 6488 -1355 -2108 -2381 3247 15555 3709 -886 -425 673 -16487 -20743 -9223 2874
5965B874j115J1195k07k7610j3399j0275p79O560J0942o595R013J1986K110J1569
$$ 2874 1759 12954 12747 -14863 -28262 -38537 -39316 -32756 -21814 -28409 -19396 -7410 -5300 6269
5951F269Q338J542r124j1457j0659J035j3159o638K1490J5228p48qM206o508k543
$$ 6269 14607 16149 7025 -4432 -15091 -14056 -27215 -33853 -12363 2865 2117 2109 6315 -193 -2736
5936b736p301K519J599R505L425l264j1190J6022P80Q9n830j1507O481J3189M263
$$ -2736 -10037 -7518 -5919 3586 7011 3747 -7443 8579 9359 9448 3618 -7889 -1408 11781 16044
5921A6044q12l305j3034O951l832l403L590M654L216r080p863m090M879J1458
$$ 16044 15232 11927 -1107 5844 2012 -1391 2199 6853 10069 989 -6874 -10964 -6085 5373
5907E373j374k608j5171J361L026j379q313K56J2023Q649L077j6167M076K06L59
$$ 5373 3999 1391 -13780 -12419 -9393 -10772 -19085 -18829 -6806 1843 4920 -11247 -7171 -6965 -6606
5892f606o146R598J1070r794q996R03K989K0096o520q591p988o539l252J7774
$$ -6606 -12752 -3154 7916 -1878 -10874 -9971 -6982 13114 6594 -1997 -9985 -16524 -19776 -2002
5878b002J9226J3988N543j3860r839q187L375J5676J3125q981k800q996J571j0908
$$ -2002 17224 31212 36755 22895 13056 4869 8244 23920 37045 28064 25264 16268 17839 6931
5864F931j7572N3J1877N36l36o605m293P575J7971R17l879l668p767q659P12J327
$$ 6931 -10641 -10588 1289 1825 1489 -5116 -9409 -1834 16137 17054 13175 9507 1740 -6919 -6207 -4880
5848d880k343o445M855K026O006o446r400j861L810O76J029K560N766J9287K429
$$ -4880 -7223 -13668 -8813 -6787 -781 -7227 -16627 -18488 -14678 -14002 -12973 -10413 -4647 14640 17069
5833A7069r972n797k147j853m459j1095J505L444l921M655K6287r522o631j1432
$$ 17069 7097 1300 -847 -2700 -7159 -18254 -16749 -13305 -17226 -12571 13716 4194 -2437 -13869
5819a3869p468J2425k372K446k558J867P955M248R810L917q387j4323o350k32
$$ -13869 -21337 -8912 -11284 -8838 -11396 -9529 -1574 2674 12484 16401 8014 -6309 -12659 -12891
5805a2891L893J3149K931p334M832J614r904k947Q629Q774l511O43o725n747O887
$$ -12891 -8998 4151 7082 -252 4580 6194 -3710 -6657 1972 10746 7235 7878 1153 -4594 2293
5790B293O250L493l598j1461J5321k97p020K019n675p016P320J787l795M40J8134
$$ 2293 8543 12036 8438 -3023 12298 12001 4981 7000 1325 -5691 1629 3416 -379 61 18195
5775A8195q577k3035j5734O043n738N347P261P842P361J0357j1218j1093p3j5447
$$ 18195 9618 -13417 -29151 -23108 -28846 -23499 -16238 -8396 -1035 9322 -1896 -12989 -13062 -28509
5761b8509j3607J0314J9928j0295l272J1768J6082k495J933k222r165N039P552
$$ -28509 -42116 -31802 -11874 -22169 -25441 -13673 2409 -86 1847 -375 -9540 -4501 3051
5748C051M450q591O869K183j1817J058Q467l687L729j071n995j0541O499K20R470
$$ 3051 7501 -1090 5779 7962 -3855 -2797 5670 1983 5712 4641 -1354 -11895 -5396 -5176 4294
5733D294p858j3322Q793Q805J618M722O79p713j651m390O70O820o528M83J634
$$ 4294 -3564 -16886 -8093 712 2330 7052 7731 18 -1633 -6023 -5353 1467 -5061 -4578 -2944
5718b944l42m240k072O958J8913L872p022k2529m448J3344l38K51O228j0117o56
$$ -2944 -3286 -7526 -9598 -2640 16273 20145 13123 -9406 -13854 -510 -848 -597 5631 -4486 -5142
5703e142M622Q657k877j1240m897j0832l866O651l63N808J4415M711J063L268
$$ -5142 -520 8137 5260 -5980 -10877 -21709 -25575 -18924 -19287 -13479 936 5647 6710 9978
5689I978p421P756J2941n044p707r105L713P765o286K014J002o059J1014P077
$$ 9978 2557 10313 23254 18210 10503 1398 5111 12876 6590 8604 9606 3547 14561 21638
5675B1638q034j347k362k3055j3325R53J2720K530q805L151L070J0465J4664m260
$$ 21638 13604 12257 9895 -13160 -26485 -25532 -12812 -10282 -19087 -15936 -12866 -2401 12263 8003
5661H003q203N693K964r049j2777J5792J6014N191j4429J066J306l636j796M408
$$ 8003 -200 5493 8457 -592 -13369 2423 18437 23628 9199 10265 11571 7935 6139 10547
5647A0547o200p402m027K307L201R552L065o800k2538p887J6534J3875j267j0529
$$ 10547 4347 -3055 -7082 -4775 -1574 7978 11043 4243 -18295 -26182 -9648 4227 2960 -7569
5633g569J8639j940l40j0506n673n766J122J2119P984L80j2058r570K609j931
$$ -7569 11070 9130 8790 -1716 -7389 -13155 -12033 86 8070 8450 -3608 -13178 -10569 -12500
5619a2500J3188J805l673k585j3668O14P121j2191m208J4189k39M774R041M706
$$ -12500 688 2493 -1180 -3765 -17433 -16819 -9698 -21889 -26097 -11908 -12147 -7373 1668 6374
5605F374J8995m966j6144l067r842P14R89j0554J5088J7921P617j7367J522K824
$$ 6374 25369 20403 4259 1192 -8650 -7936 -6947 -17501 -2413 15508 23125 5758 7280 10104
5591A0104l53l938k528j115j9551L060Q805K57Q086K313j6222j523l101K278O366
$$ 10104 9751 5813 3285 2170 -17381 -14321 -5516 -5259 2827 5140 -11082 -12605 -15706 -13428 -7062
5576g062p874R25N660l200m671m868N235O762J0836L196j936j6764p981R077K336
$$ -7062 -14936 -14011 -8351 -11551 -16222 -21090 -15855 -9093 1743 4939 3003 -13761 -21742 -12665 -10329
5561a0329o351M193k986L991P40J800j4977r23R087l707m941k857o357j564J796
$$ -10329 -16680 -12487 -15473 -11482 -10742 -8942 -23919 -24842 -15755 -19462 -24403 -27260 -33617 -35181 -33385
5546c3385M294J4521K506q814J0114k616N924m627O863K185q71J477q608k767
$$ -33385 -29091 -14570 -12064 -20878 -10764 -13380 -7456 -12083 -5220 -3035 -3906 -2429 -11037 -13804
5532a3804j3524n167l326L586N040K3947M526j3289K32J7063J656q100j49j4352
$$ -13804 -27328 -32495 -35821 -32235 -27195 -3248 1278 -12011 -11779 5284 6940 -1160 -1309 -15661
5518a5661k274J1302j724n353J110N710M782n696k300J689R002O585l234k4847
$$ -15661 -17935 -6633 -8357 -13710 -12600 -6890 -2108 -7804 -10104 -8415 587 7172 3938 -20909
5504b0909j2348Q922L779M056K044j505K605P312m14j1212J1887K02J369M790
$$ -20909 -33257 -24335 -20556 -16500 -14456 -15961 -13356 -6044 -6458 -17670 -5783 -5581 -4212 578
5490E78k960j998l441N019j4189m673J486n579J0101j1689k880R739p894Q438
$$ 578 -2382 -4380 -7821 -2802 -16991 -21664 -20178 -25757 -15656 -27345 -30225 -20486 -28380 -19942
5476a9942n28j309N103N526q903J084Q47j8059j0241P488J0652J956K186J3362
$$ -19942 -20470 -21779 -16676 -11150 -20053 -18969 -18122 -36181 -46422 -38934 -28282 -26326 -24140 -10778
5462a0778N792M004J832j0789n623J0287R768L674L257M574j240j1895K365N97
$$ -10778 -4986 -982 850 -9939 -15562 -5275 4493 8167 11424 15998 14758 2863 5228 5825
5448E825q424L248r40n987M354J1646j0738j6437J6860O63r556j270k847P127
$$ 5825 -2599 649 -291 -6278 -1924 9722 -1016 -17453 -593 70 -9486 -10756 -13603 -6476
5434f476L368J620r510O558k827K248J154m571p398j0152R061J6867M841p9j644
$$ -6476 -3108 -1488 -10998 -4440 -7267 -5019 -3865 -8436 -15834 -25986 -16925 -58 4783 4704 3060
5419C060K417q703o078P012L469p671n199q07m135L647N800l845n617K564O410
$$ 3060 5477 -3226 -9304 -2292 1177 -6494 -11693 -12500 -16635 -12988 -7188 -11033 -16650 -14086 -7676
5404g676J2097j073j2182r755J828M465k11J79o20q547Q760N223j115j1706k010
$$ -7676 4421 3348 -8834 -18589 -16761 -12296 -12507 -12328 -12948 -21495 -12735 -7512 -8627 -20333 -22343
5389b2343K0468P457o786L628o740k058j880L912o435L928J367N08N731J2497
$$ -22343 -1875 5582 -1204 2424 -4316 -6374 -8254 -4342 -10777 -6849 -5482 -4974 757 13254
5375A3254l073q372J894J1518O640p402J093j3155j2023j0186J5777L6o056j57
$$ 13254 10181 1809 3703 15221 21861 14459 15552 2397 -9626 -19812 -4035 -3999 -10055 -10212
5361a0212J127n001L337J046l472k169P30n9R282J1739m11p233o156l571r675
$$ -10212 -9085 -14086 -10749 -9703 -13175 -15344 -14614 -14673 -5391 6348 5937 -1296 -7452 -11023 -20698
5346b0698M063P058k513n159l254P663J0685M653L316m206j0967J3178J6541L922
$$ -20698 -16635 -9577 -12090 -17249 -20503 -12840 -2155 2498 5814 1608 -9359 3819 20360 24282
5332B4282q165n151j5210k697R039J1586P535l967j1181J082Q026o442r17n569
$$ 24282 16117 10966 -4244 -6941 2098 13684 21219 17252 6071 7153 15179 8737 7820 2251
5318B251P80N056n397j448j405k944R887q39j377p407r28j3326j689J5336n584
$$ 2251 3031 8087 2690 1242 -163 -3107 6780 5941 4564 -2843 -3771 -17097 -18786 -3450 -9034
5303i034m861J0599k977k166p309n699O972Q72k164j286J2912n406J159N588M509
$$ -9034 -13895 -3296 -6273 -8439 -15748 -21447 -14475 -13603 -15767 -17053 -4141 -9547 -8388 -2800 1709
5288A709J265o230L655O470m397j447j2526l826O943J1917j0483m415r12K863
$$ 1709 2974 -3256 399 6869 2472 1025 -11501 -15327 -8384 3533 -6950 -11365 -12277 -9414
5274i414N259J310N435j5844j1261R63R648J8871N735j2040j9870j7752Q217J2089
$$ -9414 -4155 -2845 2590 -13254 -24515 -23552 -13904 4967 10702 -1338 -21208 -38960 -30743 -18654
5260a8654O444j914n523l246L003n61O576J080n513J9215Q710j2260j1440J0076
$$ -18654 -12210 -14124 -19647 -22893 -19890 -20451 -13875 -12795 -18308 907 9617 -2643 -14083 -4007
5246d007l232K792m412J036l143o66m931n929K002L566M297L735M716L889J2240
$$ -4007 -7239 -4447 -8859 -7823 -10966 -11632 -16563 -22492 -20490 -16924 -12627 -8892 -4176 -287 11953
5231A1953M997j98j531R694j1730o643q12R765m07Q084j6996m358Q135j2r63M571
$$ 11953 16950 16752 15221 24915 13185 6542 5730 15495 15088 23172 6176 1818 9953 9941 8978 13549
5215A3549J3428l885q226J2182j0599m565p103J511L57J950o818j3716o810L649
$$ 13549 26977 23092 14866 27048 16449 11884 4781 6292 6649 8599 1781 -11935 -18745 -15096
5201a5096J2562P524K512k3596j6523R219M744k02J0866j0347j2744J1956J3906
$$ -15096 -2534 4990 7502 -16094 -32617 -23398 -18654 -18856 -7990 -18337 -31081 -19125 -5219
5188e219J562r075p025M517L317K079L608J617o179j781l777m119N974Q983R59
$$ -5219 -3657 -12732 -19757 -15240 -11923 -9844 -6236 -4619 -10798 -12579 -16356 -20475 -14501 -5518 -4559
5173d559j054k089o650Q356J092k282N150q159Q351J0558J0695k334l537o640
$$ -4559 -5613 -7702 -14352 -5996 -4904 -7186 -2036 -10195 -1844 8714 19409 17075 13538 6898
5159F898q921r946q304K841J042l472j471j504R324J8003R083j3530n398J171
$$ 6898 -2023 -11969 -20273 -17432 -16390 -19862 -21333 -22837 -13513 4490 13573 43 -5355 -4184
5145d184J356j2135J012P462L292q478J034J7656K19n732q477j001J1188P898
$$ -4184 -2828 -14963 -13951 -6489 -3197 -11675 -10641 7015 7234 1502 -6975 -7976 3212 11110
5131A1110K390n028n109J89N471n554j6959P850J7260j1638Q43J4023P84r502
$$ 11110 13500 8472 3363 3552 9023 3469 -13490 -5640 11620 -18 825 14848 15632 6130
5117F130j9990j2455K301J5617J0295O64J026R425P098j2705j4097m145j1885
$$ 6130 -13860 -26315 -24014 -8397 1898 2562 3588 13013 20111 7406 -6691 -10836 -22721
5104b2721N7R721J0277k033K979P488K753n40o09j2769J455M260o505N830o179
$$ -22721 -22664 -12943 -2666 -4699 -1720 5768 8521 7981 7372 -5397 -3942 318 -6187 -357 -6536
5089f536K247K041j2805K860J9390L039l483J285J823M401l812L392k1o32j2011
$$ -6536 -4289 -2248 -15053 -12193 7197 10236 6753 8038 9861 14262 10450 13842 13821 13189 1178
5074A178p751O220J975J923k958p25Q40q293q226O842J0443N239Q673r24j0042
$$ 1178 -6573 -353 1622 3545 587 -138 702 -7591 -15817 -8975 1468 6707 15380 14456 4414
5059D414n353j0286m162p15J3073P034k220Q091J1230j8653j6775o440Q648L312
$$ 4414 -939 -11225 -15387 -16102 -3029 4005 1785 9876 21106 2453 -14322 -20762 -12114 -8802
5045h802O078K747q816j776L517K209j992J203J804k568J642j536j101J1999P970
$$ -8802 -2724 23 -8793 -10569 -7052 -4843 -6835 -5632 -3828 -6396 -4754 -6290 -7391 4608 12578
5030A2578k950m413q562r502j022R53J108O641P493n577L116J6087r205k2608
$$ 12578 9628 5215 -3347 -12849 -13871 -12918 -11810 -5169 2324 -3253 -137 15950 6745 -15863
5016a5863m573K318J3646K277n155J698k104K572N202j8796K910J3846J5041p651
$$ -15863 -20436 -18118 -4472 -2195 -7350 -5652 -7756 -5184 18 -18778 -15868 -2022 13019 5368
5002E368j6029j445J359J261M850J127n097J1234M481j4917j310J6148O690p571
$$ 5368 -10661 -12106 -10747 -9486 -4636 -3509 -8606 2628 7109 -7808 -9118 7030 13720 6149
4988F149k056l823q613k071k023P65J179L050M087j546j6578j8001L259J1306
$$ 6149 4093 270 -8343 -10414 -12437 -11672 -10493 -7443 -3356 -4902 -21480 -39481 -36222 -24916
4974b4916R632J3483M21p65Q92j0689O503n898j0548P752J4786J555J0831K833
$$ -24916 -15284 -1801 -1380 -2145 -1253 -11942 -5439 -11337 -21885 -14133 653 2208 13039 15872
4960A5872j6690j4952M963J0326K346l402q232p69Q175J0150n126l455J1038l518
$$ 15872 -818 -15770 -10807 -481 1865 -1537 -9769 -10538 -2363 7787 2661 -794 10244 6726
4946F726j623r462p864M110l922L69J794N972L825p80p281R153J9904M120k6258
$$ 6726 5103 -4359 -12223 -8113 -12035 -11666 -9872 -3900 -75 -855 -8136 1017 20921 25041 -1217
4931a217j5193N759O047K328j1060j0006J0862J5088k921p419N228j18R53R909
$$ -1217 -16410 -10651 -4604 -2276 -13336 -23342 -12480 2608 -313 -7732 -2504 -2622 -1669 8240
4917H240j6410r407J424K584N780M793q03n66m921M682j950m484J1925M674P138
$$ 8240 -8170 -17577 -16153 -13569 -7789 -2996 -3799 -4365 -9286 -4604 -6554 -11038 887 5561 12699
4902A2699Q438o590r877M628k717J668O839l781O425L349r172p417m846J0901
$$ 12699 21137 14547 4670 9298 6581 8249 15088 11307 17732 21081 11909 4492 -354 10547
4888A0547J155j1649l644P49J3275J0062N108m942m454r993j5831m10J7314R727
$$ 10547 11702 53 -3591 -2842 10433 20495 25603 20661 16207 6214 -9617 -10027 7287 17014
4874A7014l043j0889n18r413n681j105K155R603J128l082k32k38J2230N32j1962
$$ 17014 13971 3082 2564 -6849 -12530 -13635 -11480 -1877 -749 -3831 -4063 -4301 7929 8461 -3501
4859c501p883P022o771l653J6211j936j3514M985O040J1386q005m234O445J082
$$ -3501 -11384 -4362 -11133 -14786 1425 -511 -14025 -9040 -3000 8386 381 -3853 2592 3674
4845C674p153q84q003m934P511R000p846l988L26m290n48M3J860N844k665M644
$$ 3674 -3479 -4363 -12366 -17300 -9789 -789 -8635 -12623 -12297 -16587 -17135 -17092 -15232 -9388 -12053 -7409
4829g409l778j6829l31M467l521k477J610r74N334N088K073J9993r36m925m800
$$ -7409 -11187 -28016 -28347 -23880 -27401 -29878 -28268 -29242 -23908 -18820 -16747 3246 2310 -2615 -7415
4814g415M98l161l914Q669Q240n004L774j0341J105M4N810L297P66J106P211k562
$$ -7415 -6917 -10078 -13992 -5323 2917 -2087 1687 -8654 -7549 -7505 -1695 1602 2368 3474 10685 8123
4798H123o038L732k298j0826j1531Q629J1204K572N31m414J124o206j2153J5000
$$ 8123 2085 5817 3519 -7307 -18838 -10209 995 3567 4098 -316 808 -5398 -17551 -2551
4784b551J0847l596k592J482K27l074j632l428M319J854L451N805o692K196m62
$$ -2551 8296 4700 2108 3590 3817 743 -889 -4317 2 1856 5307 11112 4420 6616 6154
4769F154N045o03n764m078j3501O905P579R0p177M249J111o487P57K875L112m571
$$ 6154 11199 10596 4832 754 -12747 -5842 1737 1827 -5350 -1101 10 -6477 -5720 -2845 267 -4304
4753d304j296j912R105m844j4343J2097L457j304K421n424K134L030J3619M346
$$ -4304 -5600 -7512 1593 -3251 -17594 -5497 -2040 -3344 -923 -6347 -4213 -1183 12436 16782
4739A6782j1880j9045K936J8437P35M638O76K997j6882j0242r17r381q668k245
$$ 16782 4902 -14143 -11207 7230 7965 12603 13279 16276 -606 -10848 -11765 -21146 -29814 -32059
4725c2059K267L609J3889J3043J587j4510L775L288p330l945J0498J7147M189
$$ -32059 -29792 -26183 -12294 749 2336 -12174 -8399 -5111 -12441 -16386 -5888 11259 15448
4712A5448j864J772Q374o299n50K26n398r680l704R659j483j1289r343j1184M242
$$ 15448 13584 15356 23730 17431 16881 17107 11709 2029 -1675 7984 6501 -4788 -14131 -25315 -21073
4697b1073J2386M307J894k65j4822m490Q670K6380J0151o815l974l302k577o402
$$ -21073 -8687 -4380 -2486 -2751 -17573 -22063 -13393 12987 23138 16323 12349 9047 6470 68
4683F8R057l041j1389L47k08j5043Q174J4620J685k725l188J920p216n378J0809
$$ 68 9125 6084 -5305 -4958 -5166 -20209 -12035 2585 4270 1545 -1643 277 -6939 -12317 -1508
4668a508K109l973k955J437R985R475K814j2258R263p997j3222j4593Q729P865
$$ -1508 601 -3372 -6327 -4890 5095 14570 17384 5126 14389 6392 -6830 -21423 -12694 -4829
4654d829m428O411L301n386q509L964L213M293j4165j0206K852Q756o957J5969
$$ -4829 -9257 -2846 455 -4931 -13440 -9476 -6263 -1970 -16135 -26341 -23489 -14733 -21690 -5721
4640e721J580p610M24l789j1454M12O047m900K279J2157k699Q627K012j771J839
$$ -5721 -4141 -11751 -11327 -15116 -26570 -26158 -20111 -25011 -22732 -10575 -13274 -4647 -2635 -4406 -2567
4625b567m387J338O47l613k122p566J822j1913k273J3620N728l403M829K28j2361
$$ -2567 -6954 -5616 -4969 -8582 -10704 -18270 -16448 -28361 -30634 -17014 -11286 -14689 -9860 -9632 -21993
4610b1993O098J8733J826L009k63j0876j1289k525m129n048J898J0980J8514M099
$$ -21993 -15895 2838 4664 7673 7410 -3466 -14755 -17280 -21409 -26457 -24559 -13579 4935 9034
4596I034j0812o902j0196m273l67J8817O321j253N319N731j818K993n754q230
$$ 9034 -1778 -8680 -18876 -23149 -23516 -4699 1622 369 5688 11419 9601 12594 6840 -1390
4582a390j1989m193N312L033K380j1042q865J5395P959k855j0818K768J08K424
$$ -1390 -13379 -17572 -12260 -9227 -6847 -17889 -26754 -11359 -3400 -6255 -17073 -14305 -14197 -11773
4568a1773J3229M845J543Q02j782o631j0450j0694j0910j650p50J4847J0653p986
$$ -11773 1456 6301 7844 8646 6864 233 -10217 -20911 -31821 -33471 -34221 -19374 -8721 -16707
4554a6707J171R532J3200n946o221r906r262R112J4823j1224J0125o833p618R314
$$ -16707 -15536 -6004 7196 1250 -4971 -14877 -24139 -15027 -204 -11428 -1303 -8136 -15754 -6440
4540f440k359n681R17L583q843L104l745o508L228J0219k024K459J2027k885l799
$$ -6440 -8799 -14480 -13563 -9980 -18823 -15719 -19464 -25972 -22744 -12525 -14549 -12090 -63 -2948 -6747
4525f747O486K0297Q1k0200j5952L82j1999p003J7110L933J0935m445j443L88
$$ -6747 -261 20036 20117 -83 -16035 -15653 -27652 -34655 -17545 -13612 -2677 -7122 -8565 -8177
4511h177q204N330R676P602k920j5900l652M243p272J4013O16k751k315m531J0157
$$ -8177 -16381 -11051 -1375 6227 3307 -12593 -16245 -12002 -19274 -5261 -4645 -7396 -9711 -14242 -4085
4496d085O530l199l406J219O429M092j0924o826j951n74P9L046p06k789n540L404
$$ -4085 2445 -754 -4160 -2941 3488 7580 -3344 -10170 -12121 -12695 -12616 -9570 -10276 -13065 -18605 -15201
4480a5201P298J7414p319l737J7373O617r229p055j7009m882J2848q911q161K828
$$ -15201 -7903 9511 2192 -1545 15828 22445 13216 6161 -10848 -15730 -2882 -11793 -19954 -17126
4466a7126Q875Q510K519L1k353p429O988K336q38O340K107j8433o882J498J6492
$$ -17126 -8251 259 2778 2809 456 -6973 15 2351 1513 7853 9960 -8473 -15355 -13857 2635
4451B635jl548k791J1200N229k0843l645o265O599R574M895o786p659P349R084
$$ 2635 2634 -914 -3705 7495 12724 -8119 -11764 -18029 -11430 -1856 3039 -3747 -11406 -4057 5027
4436E027N714J723k423K308k569k558R651N493j8852j0090q90O633J9365L214
$$ 5027 10741 12464 10041 12349 9780 7222 16873 22366 3514 -6576 -7466 -833 18532 21746
4422B1746o77L70l672L46n95j7560j0265l04q025J425J999J121J9530R468q379
$$ 21746 21069 21439 17767 18113 17518 -42 -10307 -10611 -18636 -17211 -15212 -14091 5439 14907 6528
4407F528n380q574J94P740J1018o845q186j5727k1158N016L297L259N446J3651
$$ 6528 1148 -7426 -7232 508 11526 4681 -3505 -19232 -40390 -35374 -32077 -28818 -23372 -9721
4393i721Q878K539j2645L962J4047q057o772J2189J4126q70p591m441m089o611
$$ -9721 -843 1696 -10949 -6987 7060 -997 -7769 4420 18546 17676 10085 5644 1555 -5056
4379e056J59l009J647m20p649J0867R831q346J104M481n075K06O66K560m861J55
$$ -5056 -4897 -7906 -6259 -6679 -14328 -3461 6370 -1976 -872 3609 -1466 -1260 -594 1966 -2895 -2740
4363b740K158Q184j3546l04Q514k830M353Q446p702j0619m510j272j5518l766
$$ -2740 -582 7602 -5944 -6248 2266 -564 3789 12235 4533 -6086 -10596 -11868 -27386 -31152
4349c1152J1922Q029L039L562O774m941J109l021j196o205n105o65J169L980R638
$$ -31152 -19230 -11201 -8162 -4600 2174 -2767 -1658 -4679 -5875 -12080 -17185 -17850 -16681 -12701 -3063
4334c063R051j2198j6660J9578J0076r029l125j4434N148P885J980L377J082J0030
$$ -3063 5988 -6210 -22870 -3292 6784 -2245 -5370 -19804 -14656 -6771 -4791 -1414 -332 9698
4320I698q32q357K09k973r272K482l317N428j346J4586J9461o547j1859j0795
$$ 9698 8866 509 718 -2255 -11527 -9045 -12362 -6934 -8280 6306 25767 19220 7361 -3434
4306c434k716l129n880J4439P675J0106J129j1276L203K314k940j4050j1693Q087
$$ -3434 -6150 -9279 -15159 -720 6955 17061 18190 6914 10117 12431 9491 -4559 -16252 -8165
4292h165o678n537o25K958o25J3006p414n149J2004K972m968L363N730n170l451
$$ -8165 -14843 -20380 -21005 -18047 -18672 -5666 -13080 -18229 -6225 -3253 -8221 -4858 872 -4298 -7749
4277g749K541J3263O56O050J3005K623j0620j9193l121J1191L956O549r394m312
$$ -7749 -5208 8055 8711 14761 27766 30389 19769 576 -2545 8646 12602 19151 9757 5445
4263E445j630K003N220n551p5O598M578M564m939n536k130j1638j800O220n747
$$ 5445 3815 5818 11038 5487 5412 12010 16588 21152 16213 10677 8547 -3091 -4891 1329 -4418
4248d418j1005R884p580q266K334L761M773n156M592R092j806l597p2N762l769
$$ -4418 -15423 -5539 -13119 -21385 -19051 -15290 -10517 -15673 -11081 -1989 -3795 -7392 -7464 -1702 -5471
4233e471j167j486P892L477q268j3676p722k517J9696M434j0265n329M837O046
$$ -5471 -6638 -8124 -232 3245 -5023 -18699 -26421 -28938 -9242 -4808 -15073 -20402 -15565 -9519
4219i519j0678N615M089k572r588N188K7812O765K99P40p842j2573j2612k058
$$ -9519 -20197 -14582 -10493 -13065 -22653 -17465 10347 17112 17411 18151 10309 -2264 -14876 -16934
4205a6934J4365j52m480J431o203k484Q373J776m206R31n097k369J756J5489J3924
$$ -16934 -2569 -2721 -7201 -5770 -11973 -14457 -6084 -4308 -8514 -7583 -12680 -15049 -13293 2196 16120
4190A6120L993o823j2673j1333J705k507L682j375J2994p048r261o862k100O721
$$ 16120 20113 13290 617 -10716 -9011 -11518 -7836 -9211 3783 -3265 -12526 -19388 -21488 -14767
4176a4767j241K1224O994j916j7115j3985k48Q505O376J8089O080j2436m405p712
$$ -14767 -16008 5216 12210 10294 -6821 -20806 -21054 -12549 -6173 11916 17996 5560 1155 -6557
4162f557j1169n204n528J0946J9990J041n711Q708J343m644o722Q085m147J732
$$ -6557 -17726 -22930 -28458 -17512 2478 3519 -2192 6516 7859 3215 -3507 4578 431 2163
4148B163Q623J3785L981j4254r226o298r273L673J0962Q818p252K739o972l809
$$ 2163 10786 24571 28552 14298 5072 -1226 -10499 -6826 4136 12954 5702 8441 1469 -2340
4134b340r785n079j55L278J2329p727j1640p183Q751J6241J7561P351j0427o799
$$ -2340 -12125 -17204 -17359 -14081 -1752 -9479 -21119 -28302 -19551 -3310 14251 21602 11175 4376
4120D376l166j0892j111O471j797r895N992J1228o774M30M753n708q743J0103
$$ 4376 1210 -9682 -10793 -4322 -6119 -16014 -10022 1206 -5568 -5138 -385 -6093 -14836 -4733
4106d733J2290j6135l312M218m660m537L628q451m599j809L711M910P809k583
$$ -4733 7557 -8578 -11890 -7672 -12332 -16869 -13241 -21692 -26291 -28100 -24389 -19479 -11670 -14253
4092a4253R699m496n692n172p932J3676O389J0315k350o268M567k603m713j807
$$ -14253 -4554 -9050 -14742 -19914 -27846 -14170 -7781 2534 184 -6084 -1517 -4120 -8833 -10640
4078a0640j2639J041J6235J1700l141K597K323j0391m273l689M661o172m964L591
$$ -10640 -23279 -22238 -6003 5697 2556 5153 7476 -2915 -7188 -10877 -6216 -12388 -17352 -13761
4064a3761J0080J2483J2914q446o608q335m206O890O720o237l682J753O049l274
$$ -13761 -3681 8802 21716 13270 6662 -1673 -5879 1011 7731 1494 -2188 -435 5614 2340
4050B340J921R576r186j5104k695M744L509k152o21R680N654j593K999r335k534
$$ 2340 4261 13837 4651 -10453 -13148 -8404 -4895 -7047 -7668 2012 7666 6073 9072 -263 -2797
4035b797J750N250M026Q40n718j3574o53O897M722J1779N198q500m199j6797o340
$$ -2797 -1047 4203 8229 9069 3351 -10223 -10876 -3979 743 12522 17720 9220 5021 -11776 -18116
4020a8116k21P894K237J1126J0482j276j1025N82K473n076J982m056j1485j143
$$ -18116 -18337 -10443 -8206 2920 13402 12126 1101 1683 4156 -920 1062 -2994 -14479 -15622
4006a5622K524o754P73J8474R53Q813j214j0639m014J833P360p436R88N479j2602
$$ -15622 -13098 -19852 -19079 -605 348 9161 7947 -2692 -6706 -4873 2487 -4949 -3961 1518 -11084
3991a1084P044R229J2110K909m388k211j2963j730R000J4876Q486j6515o977n040
$$ -11084 -4040 5189 17299 20208 15820 13609 646 -1084 7916 22792 31278 14763 7786 2746
3977B746m972L70J977n70M769R97j50p902j102J4422J0804q694j157k497l897
$$ 2746 -2226 -1856 121 -449 4320 5317 5167 -2735 -3837 10585 21389 12695 11538 9041 5144
3962E144k63J322k0207j8825m121M378M893L513K354j0890o786J9774J0625l518
$$ 5144 4881 6203 -14004 -32829 -36950 -32572 -27679 -24166 -21812 -32702 -39488 -19714 -9089 -12607
3948a2607Q17Q32O068J1442o036p071N394Q736P508m153m770q854o129j257l240
$$ -12607 -11790 -10958 -4890 6552 516 -6555 -1161 7575 15083 10930 6160 -2694 -8823 -10080 -13320
3933a3320l846P282R661M654K719j1269Q838m450q244p589j6723q70O893R222
$$ -13320 -17166 -9884 -223 4431 7150 -4119 4719 269 -7975 -15564 -32287 -33157 -26264 -17042
3919a7042J4092J839R482j780p863o576l160r375Q669J1107j361M779o383q923
$$ -17042 -2950 -1111 8371 6591 -1272 -7848 -11008 -20383 -11714 -607 -1968 2811 -3572 -12495
3905a2495J3672P532P564J1089l136j5543j0711k193P178n462j1940m364J467
$$ -12495 1177 8709 16273 27362 24226 8683 -2028 -4221 2957 -2505 -14445 -18809 -17342
3892a7342J047K002R724O331o66p223L709O232m797O904p317p078j775L735n952
$$ -17342 -16295 -14293 -4569 1762 1096 -6127 -2418 3814 -983 5921 -1396 -8474 -10249 -6514 -12466
3877a2466n130N928R324l68L299q152M346R806l436P4r129O822J0577M18j8037
$$ -12466 -17596 -11668 -2344 -2712 587 -7565 -3219 6587 3151 3225 -5904 918 11495 11913 -6124
3862f124J3132m201j6361k711p251M882M269n985m557N765j733J7724Q683j2889
$$ -6124 7008 2807 -13554 -16265 -23516 -18634 -14365 -20350 -24907 -19142 -20875 -3151 5532 -7357
3848g357k030P145j0445O10N122J595Q862J1892q674L380j876m082P821o694r075
$$ -7357 -9387 -2242 -12687 -12077 -6955 -5360 3502 15394 6720 10100 8224 4142 11963 5269 -3806
3833c806p085o515k067N69J801J8848l861j4360o174N339M561M661R109j383J0862
$$ -3806 -10891 -17406 -19473 -18904 -17103 1745 -2116 -16476 -22650 -17311 -12750 -8089 1020 -363 10499
3818A0499j2655j1307K3981J8807j309n295r992m321j7910m082O977P219P140
$$ 10499 -2156 -13463 10518 29325 28016 22721 12729 8408 -9502 -13584 -6607 612 7752
3805G752J4217l58K513j9047q578m212K384K493l26O526N066M866o95j3847R197
$$ 7752 21969 21611 24124 5077 -3501 -7713 -5329 -2836 -3162 3364 8430 13296 12601 -1246 7951
3790G951M02p438L919K353k17j2686j7850M893K935j0589K628P050L434l689K614
$$ 7951 8353 915 4834 7187 6970 -5716 -23566 -18673 -15738 -26327 -23699 -16649 -13215 -16904 -14290
3775a4290Q272k389J853J0936o885m679L939N212k491M64r531j9419O394J1618
$$ -14290 -6018 -8407 -6554 4382 -2503 -7182 -3243 1969 -522 -58 -9589 -29008 -22614 -10996
3761a0996J2557p36j0560n196m229J031K362J034J2875N929n832j7092j492k760
$$ -10996 1561 825 -9735 -14931 -19160 -18129 -15767 -14733 -1858 4071 -1761 -18853 -20345 -23105
3747b3105K5284K3739m268j7069m853M949R555N921j4441k361J643j57M557l466
$$ -23105 2179 25918 21650 4581 -272 4677 14232 20153 5712 3351 4994 4837 9394 5928
3733E928k0091j1893J9098L458j0495o242J5222J1608q038P972J2267j539j0724
$$ 5928 -14163 -26056 -6958 -3500 -13995 -20237 -5015 6593 -1445 6527 18794 17255 6531
3720F531l693N009j6345k3134K354Q997J1635J0043N410p397j0982L947K2275
$$ 6531 2838 7847 -8498 -31632 -29278 -20281 -8646 1397 6807 -590 -11572 -7625 14650
3707A4650k547n9o609j586n832J3670j6206o310M45M436j856q96j283J964J5939
$$ 14650 12103 12044 5435 3849 -1983 11687 -4519 -10829 -10384 -5948 -7804 -8700 -9983 -8019 7920
3692G920O381m006o831L140n034p97k822n938j583R390P9M568M784j1528k802
$$ 7920 14301 10295 3464 6604 1570 773 -2049 -7987 -9570 -180 -101 4467 9251 -2277 -5079
3677e079P524O840J023k766r614q074j784J0085J2499j561j2191r554R525k853
$$ -5079 2445 9285 10308 7542 -2072 -10146 -11930 -1845 10654 9093 -3098 -12652 -3127 -5980
3663e980J544J1008J091J6608o941o606n324L536k189o073k791N705M979N642
$$ -5980 -4436 6572 7663 24271 17330 10724 5400 8936 6747 674 -2117 3588 8567 14209
3649A4209R662j233j83k857o360K746j651M287Q115p192o396q158j707J2606P99
$$ 14209 23871 22638 22455 19598 13238 15984 14333 18620 26735 19543 13147 4989 3282 15888 16687
3634A6687j26Q839n091o331j2448Q65o434l748M127l095J602J1551l165J807J408
$$ 16687 16561 25400 20309 13978 1530 2395 -4039 -7787 -3660 -6755 -5153 6398 3233 5040 6448
3619F448m184k995j659Q99r254o32L331N110R834j431L731R462J2291j1375L72
$$ 6448 2264 -731 -2390 -1491 -10745 -11377 -8046 -2936 6898 5467 9198 18660 30951 19576 19948
3604A9948O95j6440j4796m353J0609o22m994q08J651p761R950Q277K411j1708
$$ 19948 20643 4203 -10593 -14946 -4337 -4959 -9953 -10761 -9110 -16871 -6921 1356 3767 -7941
3590g941j0J010j0862J017J9607j433N217p306l575J580o897J9136O256p507p164
$$ -7941 -7951 -6941 -17803 -16786 2821 1388 6605 -701 -4276 -2696 -9593 9543 15799 8292 1128
3575A128m197M543L597r251m382L840Q17J1156j0602m948J0657R401P358p328
$$ 1128 -3069 1474 5071 -4180 -8562 -4722 -3905 7251 -3351 -8299 2358 11759 19117 11789
3561A1789r278L23N437O991K628k966k7p093n093r187M87J2805j3886N478O201
$$ 11789 2511 2834 8271 15262 17890 14924 14897 7804 2711 -6476 -5989 6816 -7070 -1592 4609
3546D609L285M510j5062J556L235l003k092N718J0972O929j5601k106l657r806
$$ 4609 7894 12404 -2658 -1102 2133 -870 -2962 2756 13728 20657 5056 2950 -707 -10513
3532a0513R345R869L698o008j135J1641l782l806J4688N999m588O81l558j3779
$$ -10513 -1168 8701 12399 6391 5256 16897 13115 9309 23997 29996 25408 26089 22531 8752
3518H752p578r891O004Q914J0377j1862k462J0875N818l598o664o916Q794k444
$$ 8752 1174 -8717 -2713 6201 16578 4716 2254 13129 18947 15349 8685 1769 10563 8119
3504H119j3431K1255J1669o813k072k439n333O354J3449m158j0281j3715l97j6770
$$ 8119 -5312 15943 27612 20799 18727 16288 10955 17309 30758 26600 16319 2604 2207 -14563
3490a4563J909J1055Q701J2395K223M425n12j4971j052P37K553p23j5669m745
$$ -14563 -12654 -1599 7102 19497 21720 26145 25633 10662 9610 10347 12900 12177 -3492 -8237
3476h237P001R531k079j4873P30N456J2362k636q780n199p953K253P370O643K2113
$$ -8237 -1236 8295 6216 -8657 -7927 -2471 9891 7255 -1525 -6724 -14677 -12424 -5054 1589 23702
3461B3702Q212n282p114j5796r942m189Q305j027J953K607o016M785J1367j1148
$$ 23702 31914 26632 19518 3722 -6220 -10409 -2104 -3131 -1178 1429 -4587 198 11565 417
3447D17j4091L043P75j460K174o781L944M873J624o284j0947J2465K112q189q917
$$ 417 -13674 -10631 -9856 -11316 -9142 -15923 -11979 -7106 -5482 -11766 -22713 -10248 -8136 -16325 -25242
3432b5242O433Q442m48Q206Q106P125O553m76o91n339o443R15L106O363O994q840
$$ -25242 -18809 -10367 -10815 -2609 5497 12622 19175 18699 18008 12669 6226 7141 10247 16610 23604 14764
3416A4764J4350k127q768K633j7665m033K217r437K306m276Q606R77q756L284
$$ 14764 29114 26987 18219 20852 3187 -846 1371 -8066 -5760 -10036 -1430 -453 -9209 -5925
3402e925J7149K748l948q281M11j3852j6923M16K8454Q942l30p718n464R187m587
$$ -5925 11224 13972 10024 1743 2154 -11698 -28621 -28205 249 9191 8861 1143 -4321 4866 279
3387B79l663j623l905J522R647J4034o212o493M162M148n164q693j054p679j446
$$ 279 -3384 -5007 -8912 -7390 2257 16291 10079 3586 7748 11896 6732 -1961 -3015 -10694 -12140
3372a2140K374k420J1961O014o768n226N846O182J735r877j8588l728Q212J5702
$$ -12140 -9766 -12186 -225 5789 -979 -6205 -359 5823 7558 -2319 -20907 -24635 -16423 -721
3358g21J034P191R382L720J279o624o166l302L670l86o65j949k572P536M940o807
$$ -721 313 7504 16886 20606 21885 15261 9095 5793 9463 9077 8412 6463 3891 11427 16367 9560
3342I560n364j4712L117N443j302J6180o263n397q35k506k115j1884K592m73O816
$$ 9560 4196 -10516 -7399 -1956 -3258 12922 6659 1262 427 -2079 -4194 -16078 -13486 -13959 -7143
3327g143P290m928j341l996R200J2938m693N423M757j977Q518n119j4394j5684
$$ -7143 147 -4781 -6122 -10118 -918 12020 7327 12750 17507 15530 24048 18929 4535 -11149
3313a1149m451J3279L178n417j0651q576J6010J4041j166p142j9530n532J497
$$ -11149 -15600 -2321 857 -4560 -15211 -23787 -7777 6264 5098 -2044 -21574 -27106 -25609
3300b5609J1737K4246O28o356L633O576M11r225q951Q42o523m848J1968J181l484
$$ -25609 -13872 10374 11002 4646 8279 14855 15266 6041 -2910 -2068 -8591 -13439 -1471 -290 -3774
3285c774J2063J806q230L391j4649j288J0306L76J1109k045Q316j4894p47k409
$$ -3774 8289 10095 1865 5256 -9393 -10681 -375 1 11110 9065 17381 2487 1740 -669
3271f69l44K913l71M97J947N164N773K494m16m146n825K930J0400k069j0150j7230
$$ -669 -1013 1900 1529 2026 3973 9137 14910 17404 16988 12842 7017 9947 20347 18278 8128 -9102
3255i102o152J0345J5807m21l239m71J585n751j1217l337l013K271j489j846M467
$$ -9102 -15254 -4909 10898 10477 7238 6767 8352 2601 -8616 -11953 -14966 -12695 -14184 -16030 -11563
3240a1563p37J8956N350P753j0876j6902J1129J2451M13k285k1143j2677M243
$$ -11563 -12300 6656 12006 19759 8883 -8019 3110 15561 15974 13689 -7454 -20131 -15888
3227a5888O528l928k653P69K853P772J1378k779j1556J4260l436j1359p280l552
$$ -15888 -9360 -13288 -15941 -15172 -12319 -4547 6831 4052 -7504 6756 3320 -8039 -15319 -18871
3213a8871N122Q080p53R666j2982n764k682J511J7422Q865Nn8L409p147j0027
$$ -18871 -13749 -5669 -6422 3244 -9738 -15502 -18184 -16673 749 9614 9619 9561 12970 5823 -4204
3198d204J022l126o368R864O858n978j991M22N146n401q077N972M127r631Q472
$$ -4204 -3182 -6308 -12676 -2812 4046 -1932 -3923 -3501 1645 -3756 -11833 -5861 -1734 -11365 -2893
3183b893J3655Q165o978K684O333m640o962j0016Q480P444M559j0163k135r596
$$ -2893 10762 18927 11949 14633 20966 16326 9364 -652 7828 15272 19831 9668 7533 -2063
3169b063J028L466o733N855k524o707n110P370l148K244l500j0831J513K325K3371
$$ -2063 -1035 2431 -4302 1553 -971 -7678 -12788 -5418 -8566 -6322 -9822 -20653 -19140 -16815 6556
3154F556j28M018j751J784M9p724n740R23j251N167p137p402N010L077k297j038
$$ 6556 6428 10446 8695 10479 10528 2804 -2936 -2013 -3264 1903 -5234 -12636 -7626 -4549 -6846 -7884
3138g884L050n405Q432K1902P88j4635k802J0520r420q507o416k685R13j64P81
$$ -7884 -4834 -10239 -1807 20095 20883 6248 3446 13966 4546 -3961 -10377 -13062 -12149 -12313 -11532
3123a1532J2323k877j634o053o513K589J9374M275j2954M011J581L095K633l497
$$ -11532 791 -2086 -3720 -9773 -16286 -13697 5677 9952 -3002 1009 2590 5685 8318 4821
3109D821Q180L533J39k228j6138j1736J121k687l261O218L228J2834l911r471
$$ 4821 13001 16534 16673 14445 -1693 -13429 -12308 -14995 -18256 -12038 -8810 4024 113 -9358
3095i358Q821R415n530j834n868J376M789L272p82j728n614j2946J2500n77q073
$$ -9358 -537 8878 3348 1514 -4354 -2978 1811 5083 4301 2573 -3041 -15987 -3487 -4064 -12137
3080a2137n128J0107L696j0326N065J7005Q72M792k921q408p234L958k853o799
$$ -12137 -17265 -7158 -3462 -13788 -8723 8282 9154 13946 11025 2617 -4617 -659 -3512 -10311
3066a0311j5990O298K1222L456r946l701L318o637j3k0245j146P677J5024K5710
$$ -10311 -26301 -20003 1219 4675 -5271 -8972 -5654 -12291 -12304 -32549 -33695 -26018 -10994 14716
3052A4716Q229j0539j2067k888O941q80r32j3688n614Q385p513o649K145P762
$$ 14716 22945 12406 339 -2549 4392 3512 2580 -11108 -16722 -8337 -15850 -22499 -20354 -12592
3038a2592J3722L984l232j5825j8353q443J0046J5546J1311q532r582Q682R731
$$ -12592 1130 5114 1882 -13943 -32296 -40739 -30693 -15147 -3836 -12368 -21950 -13268 -3537
3025c537o604l61J276N612n11j564Q110l111j0317j1764k341Q36l185J2234J1602
$$ -3537 -10141 -10502 -9226 -3614 -4125 -5689 2421 -690 -11007 -22771 -25112 -24276 -27461 -15227 -3625
3010c625Q835l558r323Q247Q260j2029l619J3767L914o462L528j980N150j79K663
$$ -3625 5210 1652 -7671 576 8836 -3193 -6812 6955 10869 4407 7935 5955 11105 10926 13589
2995A3589j2300j3989P060Q301O720j4465m38J0312K684L366O029K211j7173n42
$$ 13589 1289 -12700 -5640 2661 9381 -5084 -5522 4790 7474 10840 16869 19080 1907 1365
2981A365r096r931M924K2288K184j0300N7n744j6328r985N420R707m067R513Q25
$$ 1365 -7731 -17662 -12738 9550 11734 1434 1491 -4253 -20581 -30566 -25146 -15439 -19506 -9993 -9168
2966i168o996R162J2197P246J4317j601K001K236r222j2477N634j2473j7112Q977
$$ -9168 -16164 -7002 5195 12441 26758 25157 27158 29394 20172 7695 13329 856 -16256 -7279
2952g279J0764r93k03M02K443K859j695k0247m047R485J9994J5761J0546R42q844
$$ -7279 3485 2492 2289 2691 5134 7993 6298 -13949 -17996 -8511 11483 27244 37790 38732 29888
2937B9888q023n927p090J301J1062n034j0414o676n312k913Q113Q203L882m140
$$ 29888 21865 15938 8848 10149 21211 16177 5763 -913 -6225 -9138 -1025 7178 11060 6920
2923F920q265j0967K958J7318l322k404K079l206M352N243P859j2171j4402J0415
$$ 6920 -1345 -12312 -9354 7964 4642 2238 4317 1111 5463 10706 18565 6394 -8008 2407
2909B407J9216n92j5365L252O645J0075p127j5722o045P492m263o861n43P23J5729
$$ 2407 21623 21031 5666 8918 15563 25638 18511 2789 -3256 4236 -27 -6888 -7431 -6708 9021
2894I021J1565j0670Q744r280j1279L678M831j8718j144N32J091l073K800J2032
$$ 9021 20586 9916 18660 9380 -1899 1779 6610 -12108 -13252 -12720 -11629 -14702 -11902 130
2880A30L620o4j3136K2020J1274n834m072l846j4508q837J1352L953O098q916
$$ 130 3750 3686 -9450 12570 23844 18010 13938 10092 -4416 -13253 -1901 2052 8150 -766
2866g66J331l499l814m9N951J6654j230l292q13m189j839r218N021j0106J417
$$ -766 565 -2934 -6748 -6797 -846 15808 14578 11286 10473 6284 4445 -4773 248 -9858 -8441
2851h441N110k007N429O598K123n197N513j1166N692p75j4761L017k852J3192
$$ -8441 -3331 -5338 91 6689 8812 3615 9128 -2038 3654 2879 -11882 -8865 -11717 1475
2837A475J2385l755q088J12J3332P545k177n024r956k722q987O081M565J365O559
$$ 1475 13860 10105 2017 2129 15461 23006 20829 15805 5849 3127 -5860 221 4786 6151 12710
2822A2710P308n061P040O75r083M497p053j3406k21J5918L649l625l317m689M687
$$ 12710 20018 14957 21997 22672 13589 18086 11033 -2373 -2594 13324 16973 13348 10031 5342 10029
2807A0029M675J164Q84P53K43m553J409Q865j2899k417N302k524L661K424m232
$$ 10029 14704 15868 16752 17505 17748 13195 14604 23469 10570 8153 13455 10931 14592 17016 12784
2792A2784l935N909r854K544j1028p07n04J409p511R87j065Q034M83j81J484l246
$$ 12784 8849 14758 4904 7448 -3580 -4287 -4791 -3382 -10893 -9906 -10971 -2937 -2454 -2635 -1151 -4397
2776d397O719M948R53k471j3551K542K820N946j5077j5101J795m21M596M383r024
$$ -4397 2322 7270 8223 5752 -7799 -5257 -2437 3509 -11568 -26669 -24874 -25295 -20699 -16316 -25340
2761b5340j5479M570j078O45J7719k066J1325O087l278M840P512r643j6224m105
$$ -25340 -40819 -36249 -37327 -36682 -18963 -21029 -9704 -3617 -6895 -2055 5457 -4186 -20410 -24515
2747b4515j251J3791K708m022P749Q941j0510p113O088K7355J3122j2139j2286
$$ -24515 -25766 -11975 -9267 -13289 -5540 3401 -7109 -14222 -8134 19221 32343 20204 7918
2734G918p975o489J1998J966j0251l21m35K801P042j171m030P825n088q40o463
$$ 7918 -57 -6546 5452 7418 -2833 -3154 -3589 -788 6254 5083 1053 8878 3790 2950 -3513
2719c513m959l64l142l428j4447P124R092Q301J2577l469j2430o746M498J7833
$$ -3513 -8472 -8836 -11978 -15406 -29853 -22729 -13637 -5336 7241 3772 -8658 -15404 -10906 6927
2705F927K557j1684j1682j74K358M054J2246M947q014L908P05Q332k298J4915
$$ 6927 9484 -2200 -13882 -14056 -11698 -7644 4602 9549 1535 5443 6148 14480 12182 27097
2691B7097J526k0868o614q2M800r645j0414J6149n195n532q950q461O00N057k102
$$ 27097 28623 7755 1141 1059 5859 -3786 -14200 1949 -3246 -8778 -17728 -26189 -25589 -20532 -22634
2676b2634J922M311L467R084N807N77n505q99J576Q438J773l849o762o509L089
$$ -22634 -20712 -16401 -12934 -3850 1957 2534 -2971 -3870 -2294 6144 7917 4068 -2694 -9203 -6114
2661f114R513J0427o753j3641O288N916M543J2306M627k676o917o593m850j5385
$$ -6114 3399 13826 7073 -6568 -280 5636 10179 22485 27112 24436 17519 10926 6076 -9309
2647i309r489J214J562j061N340M610K946k116O034K693q654L838J1383J826r874
$$ -9309 -18798 -17584 -16022 -17083 -11743 -7133 -4187 -6303 -269 2424 -6230 -2392 8991 10817 943
2632I43l306O771N247q162q71l169o514K899m498Q891Q816L398o369j3825k375
$$ 943 -2363 4408 9655 1493 622 -2547 -9061 -6162 -10660 -1769 7047 10445 4076 -9749 -12124
2617a2124j601Q177K1621n70j557q337q782n711j470l966l314q48K0323J8707
$$ -12124 -13725 -5548 16073 15503 13946 5609 -3173 -8884 -10354 -14320 -17634 -18482 1841 20548
2603B0548L431Q265m829j3606j1352l506k259L632P622o371O000Q62K870N0j3779
$$ 20548 23979 32244 27415 13809 2457 -1049 -3308 324 7946 1575 7575 8437 11307 11357 -2422
2588b422m624M102k993O5O45L292m931j5149M298J2078M833K346J0576r868j0647
$$ -2422 -7046 -2944 -5937 -5872 -5227 -1935 -6866 -22015 -17717 -5639 -806 1540 12116 2248 -8399
2573h399K718M140J0317R779M798p058j2153Q408n966r942P955r067j0936K772
$$ -8399 -5681 -1541 8776 18555 23353 16295 4142 12550 6584 -3358 4597 -4470 -15406 -12634
2559a2634J6512L275j1140K376R529J499K166j0071j7534Q760K0799k222j9173
$$ -12634 3878 7153 -3987 -1611 7918 9417 11583 1512 -16022 -7262 13537 11315 -7858
2546g858l061r055q6K3031J4889j4883p881K295k642N35k520j0591m543p625J2086
$$ -7858 -10919 -19974 -20060 2971 17860 2977 -4904 -2609 -5251 -4716 -7236 -17827 -22370 -29995 -17909
2531a7909J0318M997o545K185K312L73k610M423j147R89M326M338r293j503o280
$$ -17909 -7591 -2594 -9139 -6954 -4642 -4269 -6879 -2456 -3603 -2614 1712 6050 -3243 -4746 -11026
2516a1026J5788J2359j0228r530J2722Q361O933K315j1312k778q091r790J2343
$$ -11026 4762 17121 6893 -2637 10085 18446 25379 27694 16382 13604 5513 -4277 8066
2503H066o669j754m582j0583O589J5849j705K742q32n426K616l592j990P918O050
$$ 8066 1397 -357 -4939 -15522 -8933 6916 5211 7953 7121 1695 4311 719 -1271 6647 12697
2488A2697J1851o497q602j6952J4993J3751l228J770r709p528k718j0753O932
$$ 12697 24548 18051 9449 -7503 7490 21241 18013 19783 10074 2546 -172 -10925 -3993
2475c993P680j2325j0244j862J5426r696M259K3577J4340o988j7818j2776J4077
$$ -3993 3687 -8638 -18882 -20744 -5318 -15014 -10755 12822 27162 20174 2356 -10420 3657
2462C657J9510n313j3356p675O535q319n256l66l93j230J2169R65q392j4289l567
$$ 3657 23167 17854 4498 -3177 3358 -4961 -10217 -10583 -10976 -12206 -37 928 -7464 -21753 -25320
2447b5320J8090J2512p560m340n004M800K3113J529l30Q030l21p071P325j983
$$ -25320 -7230 5282 -2278 -6618 -11622 -6822 16291 17820 17490 25520 25199 18128 25453 23470
2433B3470r783j3339j7772O918O048Q962O511r591j5026o611J3322J9155O453
$$ 23470 13687 348 -17424 -10506 -4458 4504 11015 1424 -13602 -20213 -6891 12264 18717
2420A8717l117o256j1582Q584o176j736m235n227n011Q070J2239K0320m378r917
$$ 18717 15600 9344 -2238 6346 170 -1566 -5801 -11028 -16039 -7969 4270 24590 20212 10295
2406A0295K153l78K591Q605p092q299o343J7q247p638k336J615N519R448K885
$$ 10295 12448 12070 14661 23266 16174 7875 1532 1549 -6698 -14336 -16672 -15057 -9538 -90 2795
2391B795m531J324n552j4094O152L646O579j079q097L561R846J1326M999L064
$$ 2795 -1736 -412 -5964 -20058 -13906 -10260 -3681 -4760 -12857 -9296 550 11876 16875 19939
2377A9939J889l993p570j026k735J306J0410O498j6694j4386o71o19j3623J363
$$ 19939 21828 17835 10265 9239 6504 7810 18220 24718 8024 -6362 -7033 -7652 -21275 -19912
2363a9912J3412O728N987L527j1153Q644o339m725J78r165L367J71L219J6667
$$ -19912 -6500 228 6215 9742 -1411 7233 894 -3831 -3653 -12818 -9451 -9280 -6061 10606
2349A0606P736p694j546N560N333j0291q403K328R96J5437j687n091r251M286
$$ 10606 18342 10648 9102 14662 19995 9704 1301 3629 4625 20062 18375 13284 4033 8319
2335H319L195j2536o408J109k172n214P69O576j900J3383P167p471p866P780k969
$$ 8319 11514 -1022 -7430 -6321 -8493 -13707 -12938 -6362 -8262 5121 12288 4817 -3049 4731 1762
2320A762k108j2991p09J4595Q669k761M161q241j2043J889N649K759p06k771L594
$$ 1762 -346 -13337 -14046 549 9218 6457 10618 2377 -9666 -7777 -2128 631 -75 -2846 748
2305G48j1833p453P414J579P008K200N503j228j2595M503L633J0671Q429n507
$$ 748 -11085 -18538 -11124 -9545 -2537 -337 5166 3938 -8657 -4154 -521 10150 18579 13072
2291A3072j0388l105j2886Q249O892q474j90J211n588J5253J308m78j1477o36
$$ 13072 2684 -421 -13307 -5058 1834 -6640 -6830 -5619 -11207 4046 5354 4876 -6601 -7237
$$ [...]
##END NTUPLES=NMR SPECTRUM
##END=
