##TITLE=Analysis number 318703
Compound Code mo 07383
Project Code adrs
Chemist Name fudan
##JCAMPDX= 6.0         $$ Bruker NMR JCAMP-DX V2.0
##DATA TYPE= NMR SPECTRUM
##DATA CLASS= NTUPLES
##ORIGIN= Bruker BioSpin GmbH
##OWNER= nmr
$$ XWIN-NMR		Version 3.5
$$ Mon Apr 10 15:56:58 2006 GMT Daylight Time (UT+1h)  MAYBRIDGE\nmr@NMR_250MHZ
##.OBSERVE FREQUENCY= 250.131544655141
##.OBSERVE NUCLEUS= ^1H
##.ACQUISITION MODE= SIMULTANEOUS (DQD)
##.ACQUISITION SCHEME= undefined
##.AVERAGES= 16
##.DIGITISER RES= 18
##SPECTROMETER/DATA SYSTEM= dpx250
##.PULSE SEQUENCE= zg30
##.SOLVENT NAME= CDCl3
##.SHIFT REFERENCE= (INTERNAL, CDCl3, 0, 16.522)
##AUDIT TRAIL= $$ (NUMBER, WHEN, WHO, WHERE, WHAT)
$$ ##TITLE= Audit trail, XWIN-NMR		Version 3.5
$$ ##JCAMPDX= 5.01
$$ ##ORIGIN= Bruker BioSpin GmbH
$$ ##OWNER= nmr
$$ C:\u/data/dgb/nmr/ADRS/2480/pdata/1/auditp.txt
$$ ##AUDIT TRAIL=  $$ (NUMBER, WHEN, WHO, WHERE, WHAT)
(   1,<2006-04-10 15:56:34.90 +100>,<MAYBRIDGE\nmr>,<NMR_250MHZ>,
      <created by zg, POWCHK disabled, PULCHK disabled
       configuration hash MD5:
       84 BC 41 DB A1 6E 1D 46 DA 25 12 A5 C1 ED C5 3A
       data hash MD5: 64K
       5F 63 C6 5F E2 6C 01 FE DF 37 55 FD CA FB 71 81>)
(   2,<2006-04-10 15:56:49.06 +100>,<MAYBRIDGE\nmr>,<NMR_250MHZ>,
      <Start of raw data processing
       ef LB = 0.3 FT_mod = 6 PKNL = 1 SI = 32K 
       data hash MD5: 32K
       69 75 11 76 05 04 C5 2B EC E3 16 F4 7F 8A 26 8C>)
(   3,<2006-04-10 15:56:50.70 +100>,<MAYBRIDGE\nmr>,<NMR_250MHZ>,
      <apk 
       data hash MD5: 32K
       A4 6A 87 CB 73 5F F4 65 D7 2B 24 11 22 5B C6 EC>)
(   4,<2006-04-10 15:56:51.53 +100>,<MAYBRIDGE\nmr>,<NMR_250MHZ>,
      <abs ABSG = 5 
       data hash MD5: 32K
       FB A1 B8 BE C2 9B 3B 56 9E 19 05 06 08 1E 7D B3>)
$$ ##END=
$$ 
$$ hash MD5
$$ 24 85 5E 97 F9 0A AC 8F A2 71 3B 72 36 36 A2 75
##$RELAX= 
##$RELAX= 
##$RELAX= 
##$RELAX= 
##$RELAX= 
##$RELAX= 
##$RELAX= 
$$ Bruker specific parameters
$$ --------------------------
##$DU= <C:\u>
##$EXPNO= 2480
##$NAME= <ADRS>
##$PROCNO= 1
##$TYPE= <nmr>
##$USER= <dgb>
##$AMP= (0..31)
100 100 100 100 100 100 100 100 100 100 100 100 100 100 100 100 100 100 
100 100 100 100 100 100 100 100 100 100 100 100 100 100 
##$AQSEQ= 0
##$AQ_mod= 3
##$AUNM= <au_zg>
##$AUTOPOS= <60 >
##$BF1= 250.13
##$BF2= 250.13
##$BF3= 250.13
##$BF4= 250.13
##$BF5= 500.13
##$BF6= 500.13
##$BF7= 500.13
##$BF8= 500.13
##$BYTORDA= 1
##$CFDGTYP= 0
##$CFRGTYP= 5
##$CHEMSTR= <none>
##$CNST= (0..31)
1 1 145 1 1 1 1 1 1 1 1 1 1 1 1 1 1 1 1 1 1 1 1 1 1 1 1 1 1 1 1 1 
##$CPDPRG= <>
##$CPDPRG1= <>
##$CPDPRG2= <>
##$CPDPRG3= <>
##$CPDPRG4= <mlev>
##$CPDPRG5= <mlev>
##$CPDPRG6= <mlev>
##$CPDPRG7= <mlev>
##$CPDPRG8= <mlev>
##$CPDPRGB= <>
##$CPDPRGT= <>
##$D= (0..31)
0 1 0 0 0 0 0 0 0 0.06 0 0 0 0 0 0 0.0002 0 0 0 0 0 0 0 0 0 0 0 0 0 0 
0 
##$DATE= 1144680993
##$DBL= (0..7)
120 120 120 120 120 120 120 120 
##$DBP= (0..7)
150 150 150 150 150 150 150 150 
##$DBP07= 0
##$DBPNAM0= <>
##$DBPNAM1= <>
##$DBPNAM2= <>
$$ [...]
##$SUBNAM7= <"">
##$SUBNAM8= <"">
##$SUBNAM9= <"">
##$SW= 20.6930455092707
##$SWIBOX= (0..15)
0 0 3 0 0 0 0 0 0 0 0 0 0 0 0 0 
##$SW_h= 5175.983436853
##$TD= 65536
##$TD0= 1
##$TE= 295.16
##$TE2= 300
##$TE3= 300
##$TEG= 300
##$TL= (0..7)
0 120 120 120 120 120 120 120 
##$TP= (0..7)
150 150 150 150 150 150 150 150 
##$TP07= 0
##$TPNAME0= <>
##$TPNAME1= <>
##$TPNAME2= <>
##$TPNAME3= <>
##$TPNAME4= <>
##$TPNAME5= <>
##$TPNAME6= <>
##$TPNAME7= <>
##$TPOAL= (0..7)
0.5 0.5 0.5 0.5 0.5 0.5 0.5 0.5 
##$TPOFFS= (0..7)
0 0 0 0 0 0 0 0 
##$TUNHIN= 0
##$TUNHOUT= 0
##$TUNXOUT= 0
##$USERA1= <user>
##$USERA2= <user>
##$USERA3= <user>
##$USERA4= <user>
##$USERA5= <user>
##$V9= 5
##$VALIST= <valist>
##$VCLIST= <CCCCCCCCCCCCCCC>
##$VD= 0
##$VDLIST= <DDDDDDDDDDDDDDD>
##$VPLIST= <PPPPPPPPPPPPPPP>
##$VTLIST= <TTTTTTTTTTTTTTT>
##$WBST= 1024
##$WBSW= 4
##$XGAIN= (0..3)
0 0 0 0 
##$XL= 0
##$YL= 0
##$YMAX_a= 339730
##$YMIN_a= -475064
##$ZGOPTNS= <>
##$ZL1= 120
##$ZL2= 120
##$ZL3= 120
##$ZL4= 120
##$ABSF1= 16.522
##$ABSF2= -4.171173
##$ABSG= 5
##$ABSL= 3
##$ALPHA= 0
##$AQORDER= 0
##$ASSFAC= 0
##$ASSFACI= 0
##$ASSFACX= 0
##$ASSWID= 0
##$AUNMP= <proc_1d>
##$AZFE= 0.1
##$AZFW= 0.1
##$BCFW= 0
##$BC_mod= 0
##$BYTORDP= 0
##$COROFFS= 0
##$CY= 12.5
##$DATMOD= 1
##$DC= 0
##$DFILT= <>
##$DTYPP= 0
##$F1P= 14.0000005364418
##$F2P= -0.99999901652339
##$FCOR= 0.5
##$FTSIZE= 32768
##$FT_mod= 6
##$GAMMA= 0
##$GB= 0
##$INTBC= 1
##$INTSCL= 1
##$ISEN= 128
##$LB= 0.3
##$LEV0= 0
##$LPBIN= 0
##$MAXI= 10000
##$MC2= 0
##$MEAN= 0
##$ME_mod= 0
##$MI= 0
##$NCOEF= 0
##$NC_proc= -4
##$NLEV= 6
##$NOISF1= 0
##$NOISF2= 0
##$NSP= 0
##$NTH_PI= 0
##$NZP= 0
##$OFFSET= 16.522
##$PC= 1
##$PHC0= 175.2262
##$PHC1= 4.453763
##$PH_mod= 1
##$PKNL= yes
##$PPARMOD= 0
##$PSCAL= 4
##$PSIGN= 0
##$REVERSE= no
##$SF= 250.13
##$SI= 32768
##$SIGF1= 0
##$SIGF2= 0
##$SINO= 400
##$SIOLD= 32768
##$SREGLST= <1H.CDCl3>
##$SSB= 0
##$STSI= 32768
##$STSR= 0
##$SW_p= 5175.98343685301
##$SYMM= 0
##$S_DEV= 0
##$TDeff= 65536
##$TDoff= 0
##$TI= <Analysis number 999999
Compound Code 99
Book Reference 9
Project Code 9>
##$TILT= no
##$TM1= 0
##$TM2= 0
##$TOPLEV= 0
##$USERP1= <user>
##$USERP2= <user>
##$USERP3= <user>
##$USERP4= <user>
##$USERP5= <user>
##$WDW= 1
##$XDIM= 32768
##$YMAX_p= 518019028
##$YMIN_p= -482263
$$ End of Bruker specific parameters
$$ ---------------------------------
##NTUPLES= NMR SPECTRUM
##VAR_NAME=  FREQUENCY,     SPECTRUM/REAL,   SPECTRUM/IMAG
##SYMBOL=    X,             R,               I
##VAR_TYPE=  INDEPENDENT,   DEPENDENT,       DEPENDENT
##VAR_FORM=  AFFN,          ASDF,            ASDF
##VAR_DIM=   32768,         32768,           32768
##UNITS=     HZ,            ARBITRARY UNITS, ARBITRARY UNITS
##FACTOR=    0.157963299565203, 1,           1
##FIRST=     4132.6476996994, 0,             0
##LAST=      -1043.33573715361, 0,           0
##MIN=       -1043.33573715361, -482263,     0
##MAX=       4132.6476996994, 518019028,     0
$$ Real data points
##PAGE= N=1
##DATA TABLE= (X++(R..R)), XYDATA
$$ [...]
19301 -22387 -1179 55838 1226 -47775 21536 88296 40822 -67688 -158677 -16716 76173
19290 76173 79767 145668 157054 171289 102305 75297 53689 35065 55190 111693 87988 -28478
19278 -28478 -35852 -12312 11090 29194 -44845 -91576 -48514 15451 -107325 -121827 -39241 -74316
19266 -74316 -31867 3444 40228 -27523 -157181 -89103 37158 12526 69369 73683 -3047
19255 -3047 -45134 -6991 2811 -106392 -72312 -4621 15815 75841 99699 -26180 -104982 -66496
19243 -66496 -34740 93557 113381 1924 61382 26898 -22909 -119495 -213454 -218982 -23747
19232 -23747 105523 38104 45874 -33328 -147633 -147548 -128104 1093 -55455 -195115 -103381 -3695
19220 -3695 37682 102922 -19553 19383 64195 22052 -41596 -75083 -153858 -127505 -50294 -127233
19208 -127233 -226982 -148759 -115682 -51621 25265 88909 119483 -20975 -107924 -66054 -43584
19197 -43584 -100510 -151324 -221641 -163501 -146980 -109635 -10590 -120490 -255020 -324900 -312123
19186 -312123 -225598 -327547 -369723 -227890 -131156 -165066 -136988 -236571 -186172 -29573 -35697
19175 -35697 -64355 -124156 -14632 104161 153395 137139 144507 175422 98848 -134665 -176665
19164 -176665 -138668 -139590 -199232 -34742 181411 143597 14618 33242 41513 1308 -28346
19153 -28346 -38165 -7061 27860 -59793 -21473 22330 4627 -124502 -11514 47973 52814 6865
19141 6865 -3374 81682 -1815 15146 82098 57428 4761 -9492 98495 77482 -65305
19130 -65305 -123580 -113737 -95912 -128541 -69890 -37561 -71316 -74574 -118892 -66630 -10440 138496
19118 138496 211051 211090 96116 53370 80228 63636 3929 -140734 -175613 -107290 -66064 -197291
19106 -197291 -219291 -291853 -266582 -259029 -193640 -168118 -60889 58497 -6890 -47359 49029
19095 49029 166004 221471 208574 162307 109348 21058 38886 96567 179896 102460 -54859
19084 -54859 -58479 -59360 -99677 -116738 -94777 -66922 -15355 -116499 -53303 56749 137905 193827
19072 193827 102736 27705 98249 110873 -103984 -261697 -312775 -268816 -134048 34257 139453
19061 139453 87626 84046 161278 37177 -85116 -17994 98497 174615 154172 102727 50462
19050 50462 -52722 -99300 -197066 -149906 -95378 -136974 37151 116187 242925 216037 158234
19039 158234 162766 38412 58424 14023 5126 26424 -1355 60204 185628 289198 184767
19028 184767 29834 -78939 -90394 31575 108589 123128 45411 51231 24634 -79133 -70314
19017 -70314 -118383 -57862 108982 95413 140194 136874 51228 53543 71392 89265 124164 -30506
19005 -30506 -57918 -135739 -249677 -190683 -12878 64517 86347 47681 41205 45274 -12902 -79237
18993 -79237 -72164 -140135 -181425 -7823 51582 42975 -6349 -29476 -61866 -172178 -200469 -184436
18981 -184436 -142845 -73218 32130 191136 191107 239166 180807 12396 -114403 -158302 -128067
18970 -128067 -60274 -74997 -135685 -225592 -224177 -232785 -271375 -340135 -348732 -373459 -236484 -88939
18958 -88939 -18397 -70619 -58200 -91377 -145420 -168542 -165130 -153318 -29631 5034 -41683 -74840
18946 -74840 -104549 -153971 -167485 -184445 -43629 22047 21244 -80125 -165333 -204684 -126515 -19050
18934 -19050 -13899 -142125 -288004 -320422 -243130 -141331 -188250 -252990 -285952 -184105 -211114
18923 -211114 -269351 -256881 -128631 -59493 -105581 -45916 39612 33473 15434 113805 163249
18912 163249 279656 225077 65027 -1362 6612 -62881 -123377 -48018 -16601 9594 40735
18901 40735 58724 -26193 -12867 23631 -92710 -125929 -83680 -202639 -135321 -37318 -55641
18890 -55641 -73764 -181535 -239861 -74279 49547 -4342 -3452 41689 -92232 -174825 -220387
18879 -220387 -244213 -206335 -192474 -97345 -7930 -52290 -32479 -8193 -54095 -54857 208 -35327
18867 -35327 -81297 -46451 -71087 -139860 -85895 -88149 70481 71557 -69561 -219742 -165955
18856 -165955 -56083 124694 117938 19731 -97360 -199457 -185705 -145610 -68632 -125675 -59733
18845 -59733 21927 38952 120626 38424 -117671 -109526 120776 208915 198786 265339 328825
18834 328825 332391 282995 144580 163872 97735 23104 4080 50148 49914 -36483 -80064 -802
18822 -802 88425 51146 91824 163935 209891 207526 197980 41760 -98593 -36954 12836 -10755
18810 -10755 -23846 -53394 51930 94256 4397 -35462 30300 2256 58027 38525 82619
18799 82619 129364 -33788 -27971 -96018 -139219 -181013 -149106 -171067 -194163 -138061 -81954 -164939
18787 -164939 -70737 30467 91037 41075 -95089 -62597 -27235 -44996 124222 217457 117256
18776 117256 -23391 -20147 -10985 48452 100498 158682 199233 276330 375240 471298 633401
18765 633401 655572 396378 245239 155128 226712 240590 210248 266344 109509 67797 5232
18754 5232 -58141 -79559 -9553 29671 146807 11556 -164590 -169468 2791 69219 115044
18743 115044 217035 121355 57793 -42753 12184 96656 112636 126207 140477 155922 128192
18732 128192 84105 107784 42222 44855 41137 -34263 -90498 -8219 34789 87938 107347 59871
18720 59871 -37145 -45013 -48021 24650 172712 134290 122896 108718 78936 58040 -3270 42633
18708 42633 87374 107619 166300 134722 -19340 -124854 -115133 -109809 -123843 -106025 -78722 -6457
18696 -6457 -39954 -57419 -66027 -26316 -122819 -168623 -225217 -238779 -233243 -236063 -160695 -68942
18684 -68942 -77562 24765 102462 153756 101153 34497 36550 20686 -100 -115626 -163327 -86078
18672 -86078 -76501 -154371 -217923 -246933 -197925 -46119 -84446 -134253 -255153 -282583 -185061
18661 -185061 -7147 -13144 -27252 -131531 -258249 -346734 -295721 -262286 -277808 -338003 -357240
18650 -357240 -124496 -26384 -64085 -66689 -89916 -1522 24204 -1737 -51167 -140867 -158403
18639 -158403 -130878 -216873 -184937 -220494 -170712 -24525 155298 52194 -38172 -149847 -112105
18628 -112105 -73933 91641 -16348 16501 -57074 -67568 -42520 -16073 -35702 -128896 -167442
18617 -167442 -116135 63079 81679 123111 140050 79733 66888 212947 128912 58671 77303
18606 77303 139427 225678 238795 195914 134838 77287 -6302 -8129 42090 53785 -49661 -4330
18594 -4330 142441 154301 139395 165408 70037 65068 62896 47501 48250 82384 127928 53482
18582 53482 108927 178111 134833 159371 119704 111653 117239 10047 -11344 -57103 -36521 85471
18570 85471 182508 123901 90751 64464 -4887 16714 43088 119230 72922 61032 77286 76450
18558 76450 -87544 -145083 -147934 -78212 -19049 -111718 -126412 -219208 -240050 -154629 -73156 -97000
18546 -97000 -62033 -142935 -237913 -200822 -41877 43255 -2155 51210 -62496 -108142 -69420
18535 -69420 -59759 9850 25071 136459 170073 57672 -5045 45613 120575 82407 45846
18524 45846 95444 33124 -7481 -38003 43376 94561 125755 61825 18455 -82894 -192922
18513 -192922 -165430 -198781 -161364 -58605 -105065 -96321 -16620 26381 -47038 -128690 25974
18502 25974 109081 74453 -7919 -180590 -279863 -170609 -17282 -35898 -143742 -120727 -87721
18491 -87721 69969 95211 142171 174373 92835 59150 61822 -61533 -20866 43299 69661
18480 69661 72563 53641 77007 58546 71018 105876 70386 16801 -70743 -103860 1283 59378
18468 59378 38752 -98871 -54623 -63483 -175958 -102061 -131317 -220297 -218888 -150094 -147459 -86367
18456 -86367 45876 -8332 -12556 -15228 34223 189593 233538 201859 203380 146157 56663 100768
18444 100768 20368 -38006 -171901 -118005 -8275 54835 134559 94493 27056 32736 189016
18433 189016 117927 -39155 -15955 101388 235021 125571 73685 139719 184014 150889 138831
18422 138831 120806 52692 143588 211565 234051 157456 179478 176797 78772 115532 107551 155565
18410 155565 92748 85915 196497 166980 69999 74445 102714 183064 171726 129113 54765 90376
18398 90376 132816 182404 187734 147453 148582 57582 -11641 28284 64267 133508 80946 112655
18386 112655 191114 116654 161471 196551 273602 294592 228852 46248 68438 65822 56183 34306
18374 34306 -25047 -67235 56568 94740 208762 273469 225129 239260 292561 270382 224204
18363 224204 132066 120504 174996 270769 192872 59690 38447 -96962 -164377 -145194 -151045
18352 -151045 -85202 -34707 -42178 641 167829 242352 185386 165272 201283 131384 63772
18341 63772 -55965 -45348 59225 69112 86052 39853 109290 239367 147878 79760 -34425
18330 -34425 -80722 -20782 54449 -47220 60341 64853 60013 152068 68128 -15875 32432 54330
18318 54330 18412 -15328 -11106 -24317 110304 90222 -115133 -270977 -206121 -13975 180046
18307 180046 180319 139479 163090 163529 53468 -44359 -101948 -140491 -96484 -37219 43032 182333
18295 182333 160319 -110347 -171399 -45730 33474 39760 76118 -45504 -4642 105851 143649
18284 143649 70948 68797 144065 164438 79682 72676 129772 512296 823839 1108357 1418181
18273 1418181 1536956 1217736 889252 681155 647680 527741 359840 284490 221990 267862
18263 267862 239489 164902 155320 67735 87523 126314 140188 84892 -10548 73214 215807
18252 215807 233741 156345 118755 140035 122789 223849 205574 219547 167946 256639 340369
18241 340369 235467 333260 332097 248129 411371 710612 918509 1068587 960180 815796
18231 815796 533263 412613 425377 410027 393550 455129 439174 304690 292713 305296 275396
18220 275396 301160 297204 154352 125376 144664 272498 359263 315941 191100 217898 364378
18209 364378 364273 294789 258330 268590 224390 117523 151088 229104 230667 184095 151383 191666
18197 191666 177207 126619 234125 290752 304522 275285 257994 312154 300905 275678 206916
18186 206916 234925 226517 247772 379238 277100 165506 186773 254821 348762 488213 601350
18175 601350 530881 455863 428819 301860 278065 317548 328787 315304 441694 452380 431554
18164 431554 413005 424158 463342 503549 507755 448172 228553 272615 485277 596558 573032
18153 573032 648221 627499 596000 571029 532210 612661 656118 476791 450632 575314 620568
18142 620568 728322 698768 754791 816553 896207 1020791 1106041 1159768 1291896 1460103 1622761
18131 1622761 1570894 1487466 1578713 1707513 1828520 1976311 2220553 2440584 2693772 2987363
18121 2987363 3351037 3934590 4681872 5555128 6828678 8585235 11178285 14924317 20645173
18112 20645173 30194390 46997442 74852923 112161591 149610605 150762632 109172192
18105 109172192 72567893 50138178 37424014 29939009 25055532 21589078 19071754
18098 19071754 17039584 15401945 14072134 13127065 12259841 11434554 10816071 10254438 9730316
18089 9730316 9322645 8938925 8544430 8156592 7754624 7306835 6989019 6827247 6735697 6521193
18079 6521193 6398942 6299030 6055684 5952122 5850801 5612807 5414367 5310544 5166693 4967028
18069 4967028 4848675 4685488 4538918 4367773 4263117 4198503 4064646 3809785 3774420 3753257
18059 3753257 3736847 3612391 3522196 3513096 3300328 3066473 2872465 2807865 2864920 2932819 2802290
18048 2802290 2773427 2663617 2607837 2620023 2585258 2483396 2418059 2369381 2320200 2325364 2265196
18037 2265196 2175052 2147104 2170445 2199651 2170644 2058224 1928586 1925504 2011854 1984201 1904688
18026 1904688 1856180 1827291 1734346 1713650 1753727 1855003 1802645 1630561 1495314 1369256
18016 1369256 1252378 1317994 1318435 1216209 1138137 1057041 993207 950503 1003697 1143195 1143728
18005 1143728 1228301 1256196 1206079 1121613 1062298 1142646 1142294 1126897 1098984 1082831 1099757 1096454
17993 1096454 1007607 1014274 983803 1005264 1082986 1164082 1184626 1266945 1255185 1292489 1335391
17982 1335391 1324814 1203694 1048784 984391 1086666 1105248 970527 857175 902325 913087
17972 913087 955912 1018336 999464 961372 993531 959425 846272 799256 778977 801988 990254
17961 990254 1024033 1047029 1052151 1010739 857349 814228 868144 773114 654018 683615 727007
17950 727007 646672 704125 598295 556021 519819 542494 552478 571505 489974 501750 531581
17939 531581 501898 462970 423396 407201 396675 525696 579268 530650 399478 389912 371469
17928 371469 298380 329856 351101 325602 256281 210746 386955 529987 526354 456176 287678
17917 287678 213107 320277 433108 412323 449260 390513 374651 378126 465558 430919 543852
17906 543852 652672 616308 506292 455475 346688 320016 293550 316566 261683 183247 206687
17895 206687 313095 300355 268475 295446 320110 296789 301689 346412 402193 375773 301628
17884 301628 182525 46616 -2098 -105460 -57129 53177 39876 3029 81971 176493 201760
17873 201760 223886 205470 150419 199122 269961 379838 355975 189915 172735 128649 56796
17862 56796 20910 84555 127629 126673 156706 152281 247304 327410 362831 340149 267272 370416
17850 370416 424345 424352 518897 564192 640102 601531 531385 489028 471720 494946 547548 539660
17838 539660 547593 652566 655933 673135 648723 673812 677597 491418 429568 513834 564783 579232
17826 579232 578042 591606 503672 381541 360350 457636 443499 389099 304980 286951 175715
17815 175715 255686 334503 348169 385070 310298 254599 348296 326016 305553 397457 472786
17804 472786 424598 417946 601427 691067 702016 673297 569938 514510 438728 467819 644375
17793 644375 617466 631350 541626 433495 586353 672218 667717 655184 714541 597759 488979
17782 488979 451551 306876 238322 143849 242588 318380 270861 226679 202875 77077 74303
17771 74303 170749 294064 280113 287378 256503 341598 318099 428699 523265 465536 364874
17760 364874 409706 380790 163342 54655 108313 51296 38549 128625 233340 233128 237874
17749 237874 162665 185299 243999 255377 137744 213794 324828 355169 280953 257925 209710
17738 209710 252939 198143 126354 -38357 -72212 -108479 -82439 27731 85443 91680 191435
17727 191435 175365 127948 42717 110803 213921 54278 -62906 -24402 109722 319248
17717 319248 304011 139559 132192 225066 251995 229930 178242 37125 10865 95851 55488
17706 55488 -55239 -17886 94362 198478 245029 157127 55883 -116613 -138698 -41980 -47616
17695 -47616 9684 73850 89802 -55458 -145520 -56459 -10084 -37199 -13994 56965 45492
17684 45492 25432 43526 93556 31255 -42514 -90880 -120276 -18765 47136 145026 169051
17673 169051 8354 -30784 -57867 -144125 -149377 -31654 -42480 -114600 -34495 -150819 -98455
17662 -98455 -55803 -73975 -101732 -152456 91802 201275 116459 107170 154496 89349 30412
17651 30412 7034 110915 175710 40077 71244 38344 -11318 -31373 189300 254366 164393
17640 164393 101035 20827 -1902 3135 -92926 -98790 17547 142616 127318 114729 86538
17629 86538 98346 88351 82757 104160 117300 154840 209930 192057 34514 73809 44765 63413
17617 63413 113911 19721 23169 55380 58342 89206 43832 114493 92419 -135948 -168705 -111855
17605 -111855 4232 123724 93435 106313 106576 111173 196735 378205 382165 270763 104391
17594 104391 11666 116775 138807 94187 45787 7571 23820 -6620 23180 83762 140820
17583 140820 54112 -27499 42618 80408 61507 206499 259454 238927 179213 145653 137006
17572 137006 220397 257041 224030 312331 323765 237820 228846 129202 69997 71933 249476 210423
17560 210423 198192 145658 74032 26185 98855 150852 168489 68268 -21956 45546 120953
17549 120953 129871 254685 338995 363500 268961 172322 126377 37835 5016 40078 18136
17538 18136 -48834 -89817 -34362 51588 204762 135453 174224 292031 292915 178436 117675
17527 117675 287697 254055 113555 26299 -16022 -18669 -3053 -2909 97644 190340 321910
17516 321910 265864 189509 176317 219202 277989 51162 -45935 32096 196437 242980 279654
17505 279654 146470 63051 -6691 62078 258519 328213 243717 223023 173760 209953 156707
17494 156707 109911 190154 126534 138124 146920 297154 362690 275224 292882 241631 228447
17483 228447 240664 233323 236553 73064 -40150 134439 232956 195759 230585 236020 300370
17472 300370 336991 323550 338208 266640 359076 437358 504361 385191 208752 262197 414115
17461 414115 446187 428535 508308 445090 473138 591506 597290 656379 698529 694235 729378 753144
17449 753144 866330 955715 984925 1153189 1315185 1446320 1568213 1896195 2086301 1824987
17439 1824987 1533748 1281949 1078883 1047599 1074114 1073107 1063019 986274 885809 857004 975829
17428 975829 995213 914762 833792 759867 689061 842574 1017921 1118681 1298864 1306747 1260175
17417 1260175 1369487 1484848 1465132 1497157 1399498 1296117 1170435 1069313 1021733 1125167
17407 1125167 1144008 1167292 1145491 1061713 1057586 1208519 1168708 1111055 1155716 1066315 1073629
17396 1073629 1143630 1319029 1462797 1428632 1279748 1098081 1081164 1178213 1097704 1122059
17386 1122059 1115561 1057017 1119578 1236634 1213082 1203559 1139423 1139314 1087483 1133565 1201360 1233910
17374 1233910 1418380 1556423 1504374 1473369 1449954 1448055 1507542 1455149 1508308 1599349 1611625
17363 1611625 1721446 1794021 1846293 1876712 2091352 2334388 2452687 2600981 2813468 2923205
17353 2923205 3057355 3209348 3486059 3776295 4067438 4400571 4806535 5330433 5793205
17344 5793205 6533197 7441601 8714114 10417804 12961119 16372983 20555612 25037958
17336 25037958 29422848 34687277 41502380 48212812 51029820 50944697 52364981 55515698
17328 55515698 56593426 54214438 53064365 55244052 59848006 64688587 69223690 76158372
17320 76158372 86766813 97690420 101286478 98927011 99239452 102213368 100149083 88963194
17312 88963194 77008478 68557563 61713103 54061775 46256365 40271524 36168425 33457469
17304 33457469 31715719 30564538 30038477 30232118 31137086 33188585 36674748 42509044
17296 42509044 51024532 62439288 75574978 89238503 104653111 118195464 122308366
17289 122308366 122373775 122614909 115509335 101219130 88920148 79169313 70666911 65434928
17281 65434928 64330455 65870511 69093791 74107870 78816488 79131025 77428895 76052678
17273 76052678 71387795 63083268 55588909 49031247 42564754 37158381 33057130 29989375
17265 29989375 27749468 25863460 24434848 23372686 22460103 21592232 20762893 19970115 19383771
17256 19383771 18768509 18112954 17550962 17138884 16559497 16045056 15444422 14902387 14323693
17247 14323693 13842118 13500240 13208355 12854002 12482870 12152906 11824866 11442272 11187356
17238 11187356 10945463 10585612 10218995 10044954 9965735 9777155 9429199 9250878 9071320
17229 9071320 8882127 8751618 8527948 8289727 8136733 8133007 7925261 7706555 7511569 7250707
17219 7250707 7036002 6943207 6824588 6616417 6607586 6535902 6279916 6034535 5975405 5985446
17209 5985446 5857743 5671565 5625434 5569190 5501673 5348888 5270029 5296141 5231119 5157414 5075839
17198 5075839 5003213 4901842 4806364 4725107 4674356 4703090 4697135 4637148 4584356 4570376 4411289
17187 4411289 4236782 4086711 4104116 4071003 3979227 3796355 3686383 3572985 3537133 3592373
17177 3592373 3498453 3387016 3301468 3255815 3216132 3169436 3124942 3191833 3131337 3094427 3156582
17166 3156582 3180186 3201889 3121237 3063213 3127175 3104503 3027149 2991222 2932099 2778223 2667822
17155 2667822 2584834 2618906 2632134 2589174 2569183 2419239 2412128 2387229 2262181 2244536 2166874
17144 2166874 2127646 2085723 2167934 2209781 2200092 2078602 1997780 1947279 1933597 1930530 1936204 1998852
17132 1998852 2007317 1975888 2004943 2107839 2113759 1954162 1778230 1790624 1753527 1650241 1759730
17121 1759730 1852515 1894384 1885569 1813380 1870540 1963272 2172052 2189766 2253028 2371329 2354839
17110 2354839 2286488 2231829 2172109 2089530 2008995 1902331 1884325 1667889 1608191 1560009 1380546
17099 1380546 1243334 1218430 1199352 1081730 1047825 990746 982780 1125695 1117284 959835 1010501
17088 1010501 1118059 935046 932026 935357 937535 1046599 1075408 915279 857095 948656 907975
17077 907975 910519 1098262 1171852 1068651 1022096 1079285 1082202 822425 784792 779141 744554
17066 744554 760150 673699 443208 423993 457427 552021 583509 592567 685399 604077 517826
17055 517826 444677 472407 495426 537111 488931 527520 505564 468461 402190 267942 269720
17044 269720 347223 292932 308910 267378 318147 296588 272821 223104 313243 316258 322387 381202
17032 381202 446011 484356 462117 341476 230138 228599 272893 225897 119777 99457 258994
17021 258994 203906 143141 159208 191589 308725 369614 444758 389861 307978 219065 132875
17010 132875 160643 213857 291067 251011 171726 111774 50882 9463 100213 277427 295638
16999 295638 190481 176247 188375 162018 212882 223815 211446 185191 171490 240795 163124
16988 163124 89118 80609 73360 185724 191923 175979 155669 137144 224135 178775 212175 297875
16976 297875 245772 260436 153772 55386 59133 171440 216307 254090 242512 165361 100597
16965 100597 121099 56723 58794 62260 8883 64172 91376 249 -54037 -161447 -83029 -28281
16953 -28281 -58658 -51993 -113246 -176150 -180870 6753 94402 127533 103911 79396 189061 170437
16941 170437 45465 15896 70603 193845 182012 34899 -42168 -84735 -95233 -102309 -52393
16930 -52393 94666 153391 51500 432 -6449 -121479 -51749 -152467 -175468 -119025 -59425
16919 -59425 3315 -57839 -140607 -150936 -156890 -202205 -112445 25634 -7880 144776 101207
16908 101207 88301 166840 204833 321714 248213 135838 88566 150637 -368 -139399 -89989
16897 -89989 -73487 -55828 -47274 32481 158626 177200 161602 106543 85740 55621 -12246 -46940
16885 -46940 667 -69229 -73635 -81275 -102040 -141180 -1563 124423 118204 27420 -775 -97809
16873 -97809 -97190 -59103 8084 63601 133360 81292 23892 -3529 -13269 -134469 -225547 -220227
16861 -220227 -84119 -99639 -163806 -179199 -79286 -144331 -229919 -135966 -14705 -37784 5941
16850 5941 122071 36274 -62504 -15049 51420 88216 -10047 -32929 38560 -8381 -40342 -16372
16838 -16372 -38234 -46747 -143570 -52779 30339 -37594 -104191 -141555 -124169 -140392 -31197 67110
16826 67110 59202 78857 107960 -24493 -47501 -99001 -21815 50305 199821 233247 83763
16815 83763 71233 201860 287985 298240 207736 111376 228534 328787 340996 373126 404346
16804 404346 527924 507043 402417 282056 217945 366180 424831 328241 395176 404879 501546
16793 501546 490156 469843 336401 277837 236697 271348 312989 340716 296097 231171 217145
16782 217145 183289 145213 228673 225068 338501 577187 668475 730924 814638 691452 464992
16771 464992 338873 273847 282168 390406 332962 319200 400150 427752 367235 486546 456449
16760 456449 513397 544035 432823 252676 267844 115015 -33612 69669 193834 250336
16750 250336 113221 64052 109419 120013 157954 81691 142218 92234 3466 -1027 29181
16739 29181 22820 65803 151380 191852 183369 211127 181970 70025 -19592 90092 138669 121901
16727 121901 136444 240377 210792 86626 172276 128049 72284 63039 -17091 -129717 -80823
16716 -80823 -63094 -24179 -64131 -28353 13011 -32991 -93390 1848 -36649 89650 -59946
16705 -59946 -194615 -214729 -158427 -183011 -187779 -72993 175755 149362 -30715 -77468 -141440
16694 -141440 -75036 -90249 -113500 -87610 -80299 -127778 -159938 -32874 29193 -20086 -106052
16683 -106052 -273248 -288087 -180634 -43026 75932 9646 -152814 -256957 -156793 -162410
16673 -162410 -151804 -4815 2989 32282 -65912 -41663 -85802 -151692 -165489 -193238 -192138 -120487
16661 -120487 -96944 -181057 -122019 -85715 -9649 -59981 -38135 -32860 -112701 -97993 7523
16650 7523 72348 35917 -101387 -84140 -64529 -129776 -176194 -155777 -142918 -111605 48529
16639 48529 79393 -24844 -106571 -7269 -46905 -153489 -156868 -219941 -301599 -176378 -56748
16628 -56748 3943 54887 107870 110343 11365 -69089 -65472 -108642 -121645 83636 51656 -12545
16616 -12545 28702 -80529 -168804 -149978 -77185 -60898 -194544 -277372 -285363 -242922 -237576 -177689
16604 -177689 -106835 -160679 -148136 -139019 -251763 -143917 -113498 50262 81755 58579 66800
16593 66800 -18787 -156140 -219076 -273451 -172203 -16136 67082 -46368 -203959 -200741 -106004
16582 -106004 57024 76074 112144 1305 -60098 -21187 2673 16406 57638 110121 99537
16571 99537 -20030 -80543 -18742 -107107 -168246 -73824 85395 196413 144024 12071 -101425
16560 -101425 -74240 -869 -125665 -109152 -31275 -152421 -197143 -185587 -234884 -182604 -146187
16549 -146187 -131932 -126072 -49177 -45199 -29246 -87594 -131537 -43695 -8765 -73668 -95293 -129623
16537 -129623 -151155 -150108 -176771 -165524 -24970 -64787 -62034 5163 120354 62847 30574
16526 30574 -158153 -258096 -302358 -254007 -309354 -312980 -229556 -268184 -208165 -72604 -55280
16515 -55280 -95585 -106128 -52340 38675 66406 91061 26049 -96378 -122919 -170003 -175771 -148726
16503 -148726 -32906 -93150 -141431 -126084 -86835 -75295 -12985 46013 -117238 -59279 -482
16492 -482 -25090 -47685 -59338 51213 118072 49950 -38487 -82336 -87563 29339 29869 -27416
16480 -27416 -25583 -29595 63142 77747 66623 -76189 -116814 -293625 -362403 -188968 2398
16469 2398 -80895 -227879 -305560 -339528 -232865 -74484 709 -23834 -52681 -15912 20786
16458 20786 -14371 15444 -3018 -53010 -155810 -121736 -62343 -34362 -26670 -40615 -112522 27498
16446 27498 46097 -146618 -81614 9352 5312 -45782 14647 60076 126907 33835 40302 25013
16434 25013 34098 35461 -48764 -64019 -187271 -340697 -331002 -367580 -337831 -217963 -84047
16423 -84047 -55324 -51932 -20782 -28083 27060 -53666 -79873 -69890 -51301 77096 118036 108373
16411 108373 73482 133624 157712 99807 24289 13473 634 -1658 17406 -121255 -26345
16400 -26345 -9563 -84992 -84931 -70044 -5650 -53304 -1568 1885 -102498 -205502 -237071 -259738
16388 -259738 -271273 -221258 -235407 -203515 -259290 -262374 -148160 -94030 -109229 -135364 -74826
16377 -74826 -25003 -22128 786 109977 94039 -29439 -72715 -25622 28886 -25475 -48627
16366 -48627 -86599 -81426 -70258 -60100 -48090 -135785 -63700 -71748 -125095 -44976 -37514 -69460
16354 -69460 -59401 60438 116908 353 39655 15283 -70271 -109482 -69895 -52877 -32839
16343 -32839 -94577 -163692 -160233 -185556 -152329 -48043 33928 72810 176755 55648 -94627
16332 -94627 -132579 -125243 -28110 93991 115915 21383 -34141 18856 44375 37730 215148 223593
16320 223593 207588 84261 42855 37378 -45495 -107183 -26495 -27905 -6222 -10344 -6472 10132
16308 10132 -100762 -85349 -114579 -141002 -81500 -19624 37855 9761 -81843 -9120 -68125
16297 -68125 -141997 -198869 -146119 -18526 -29191 -129689 12749 105972 30851 54493 -47238
16286 -47238 -121892 31031 153255 193988 204545 125344 108797 174718 68226 -32016 -42918
16275 -42918 -61838 -28420 -126288 -197025 -190410 -109628 5052 -67201 -135822 -97937 -174036 -202444
16263 -202444 -225014 -206103 -133796 -196651 -107921 -93855 -45043 -104645 -94524 -62154 22982
16252 22982 23710 -9950 -81126 -82119 -123537 -105870 -134370 -91624 53109 28313 -3058 -46780
16240 -46780 -85323 -110147 -65157 -59223 -108284 -43963 -65608 -70601 -61198 82938 162032 59623
16228 59623 -9279 -55781 -51838 -24877 -102001 -98590 -94128 -240413 -156619 -126658 -169320 -106361
16216 -106361 -92079 -220915 -313775 -278565 -190850 -199290 -264071 -184601 -29589 189867 276973
16205 276973 232059 165102 137853 88703 67403 -993 -13094 9684 53744 11586 69331
16194 69331 -12922 -127205 -150668 -121838 -95197 -51423 -34873 -62596 -136264 -124874 -154465
16183 -154465 -121227 -148774 -102717 -142395 -123425 -15472 147442 149217 99554 71464 46939
16172 46939 -42147 -119151 -161274 -49707 -7731 15051 36572 -94080 -80285 -139856 -273521
16161 -273521 -272821 -355554 -437991 -314165 -124194 -70714 -131510 -61799 83814 149662 53316
16150 53316 46285 113266 5705 -187 19442 23367 -16936 -60592 -70605 -175346 -197798 -85986
16138 -85986 -22952 3823 38071 71628 39926 -1154 56548 -96711 -161847 -126335 -200030
16127 -200030 -270131 -306888 -323530 -134626 -44565 1963 18479 35634 -7671 23869 94575
16116 94575 48661 -127796 -198945 -262260 -112519 11292 77710 -7153 -45414 -9975 -91520
16105 -91520 -210903 -191820 -55073 -3705 -99201 -61816 45210 -110955 -200141 -146450 -141763
16094 -141763 -56664 6166 -118766 -199628 -204606 -81139 40645 62209 -10433 -128566 -222308
16083 -222308 -202949 -158472 -154046 -124074 -112210 -73461 -55472 -106738 -70947 -65024 -147833 -148612
16071 -148612 -204796 -216689 -145654 -168176 -143296 -100008 -45405 20660 18377 -67175 13412 114295
16059 114295 123742 2765 6031 116873 60706 -152062 -291197 -287266 -217131 -97327 42207
16048 42207 46340 31602 -92351 -124637 -22874 89630 127586 102716 64650 -11987 -122201
16037 -122201 9767 45849 7633 14543 -47628 -18433 46010 17934 6698 23150 29836 -60127
16025 -60127 -144931 -174473 -62403 94426 142243 161058 137601 24873 112885 118916 -27989
16014 -27989 -57981 -113107 -164196 -143057 -55372 8091 -2198 -77754 -38229 -83425 -102703 -118533
16002 -118533 -181092 -172133 -301955 -372879 -376773 -277624 -135095 -160059 -140306 -25765 -48719
15991 -48719 -121355 -126924 -218235 -210636 -178808 -199856 -221855 -178284 -35418 2066 -113848 -101565
15979 -101565 -17295 -8333 -57750 -129884 -64122 -64677 -14732 14481 -25403 -129080 -27550 36081
15967 36081 -59936 -2744 -117932 -154648 -120334 -109160 -55058 -33239 -204302 -304464 -307086
15956 -307086 -223574 -154856 -131839 -32794 26076 49883 -10537 -147275 -92101 -29388 -3284
15945 -3284 -13090 -28701 -98031 -102616 -81953 -121632 -92550 -65824 -105350 -163779 -217008 -190648
15933 -190648 -74603 -105729 -129191 -81218 -46243 -111186 -100991 -12566 -26296 -59268 -88720
15922 -88720 -451 69991 28798 -67754 -91633 -78597 372 -25119 -83309 -56456 -50056 43468
15910 43468 35892 31368 -28655 -108052 38132 52491 -138653 -164079 -78135 -127824 -83032 -128192
15898 -128192 -80960 -71911 -70136 -37329 -43483 -61395 -46761 -63082 -13236 -4352 -68161 -77774
15886 -77774 -6431 -46019 -150299 -58054 3057 31368 59149 1532 -25959 76953 22636
15875 22636 -188915 -264908 -86558 18096 55403 -12047 -115855 -4517 99184 43536
15865 43536 -15396 89624 63279 -13697 -143076 -90081 -17210 25896 18421 13984 120644
15854 120644 242749 195283 185484 198542 74965 -22856 -93632 -86052 -106478 -29344 29806
15843 29806 14615 -44438 -98064 -116132 -149424 -183359 -169330 -35825 -59670 -113479 -147728
15832 -147728 -179301 -132219 -138979 -137404 -57371 -100156 -166088 -174888 -118834 -121367 -69393 -87041
15820 -87041 -133290 -41566 109591 116332 132783 1028 -149709 -179551 -221526 -173489 -26341
15809 -26341 30101 33470 -100574 -93797 65745 144200 74737 56153 -47037 -89623 -46989
15798 -46989 -15806 -25315 -63002 75327 96525 195161 330054 253923 158620 116489 136183
15787 136183 145710 -7356 -150845 -126110 -189058 -120296 -103385 51005 122071 83595 35832
15776 35832 -55897 -101321 -138326 -107789 -96523 -96682 -17578 -38878 -80185 -102197 -98138 -137652
15764 -137652 -151420 -91287 95991 161772 116998 -3390 -52061 -146746 -159727 -103536 -139344
15753 -139344 -69856 5849 83197 48025 27355 112980 97085 26085 -53055 -61303 -105426 -32203
15741 -32203 153843 298102 200553 5782 -132703 -236080 -222404 -324775 -299687 -284789
15731 -284789 -255384 -109919 -139611 -161952 -114542 -130224 -130001 -94319 -307360 -465424 -320777
15720 -320777 -215201 -89397 42345 115254 73384 8104 -74608 -78196 -54384 -116938 -86039
15709 -86039 -17831 7959 16138 -7987 -19688 -18608 -6312 -34852 113964 89935 36781 24292
15697 24292 124882 84815 -33606 -122673 -105825 22582 136033 73718 -60474 -221265
15687 -221265 -67074 93590 108975 106461 117135 156644 56808 72146 78396 30213 -39499
15676 -39499 -98116 -146274 -76050 -169612 -145133 -139997 -130087 -296663 -346578 -138438 -29843
15665 -29843 -54822 -124536 -182768 -205469 -146769 -113747 -187980 -162550 -142467 -2521 26577
15654 26577 24342 -2878 -91428 -18526 -166165 -283865 -415285 -376452 -217557 -71492 40777
15643 40777 78912 94318 -4609 -146433 -203843 -240486 -212246 -90807 -22804 -130671 -217654
15632 -217654 -142457 -41768 -32988 -142141 -112203 -54322 -14741 -56707 -142197 -162736 -95184
15621 -95184 -72824 -47822 -44780 -20954 -55883 -3236 64526 100139 -22524 -201523 -307341
15610 -307341 -256484 -193527 -124716 -146082 -131830 -91649 -123312 -143190 -108985 -28000 -142010
15599 -142010 -90559 -115943 -133917 -91556 29074 163836 138400 26520 -140604 -118787 41633
15588 41633 117051 164085 140106 -33638 -92874 13183 -43548 -239246 -213439 -137013 -118358
15577 -118358 -104845 -2277 -22612 -36390 -11284 46679 22319 6603 3570 -25109 -71680
15566 -71680 -40907 -19080 -134067 -204908 -224876 -206890 -91762 -77660 -170918 -98277 -86450
15555 -86450 -160196 -232579 -138190 -92111 -95896 -55131 39430 71826 21505 -85024 -139146 -65800
15543 -65800 -72155 -139823 -4589 -1368 14528 98310 -16100 -119821 -70532 -104379 -50724
15532 -50724 -52218 -19641 -52039 -182935 -235498 -82521 133838 161589 189253 195019 109502
15521 109502 -45009 -153207 -221332 -124344 -134294 -160963 -134345 -100086 -87281 -137619 -222179
15510 -222179 -189956 -226663 -211070 -195911 -95191 -67312 -72743 -126786 -123184 -57920 -141303 -223815
15498 -223815 -179734 -94563 -126429 -115936 -55804 -86357 -51550 24926 -33348 -61557 15878
15487 15878 -45581 -47544 -103935 -151796 -82873 -18651 77813 14205 -82040 -29062 -17261 41633
15475 41633 130150 33630 -13424 16391 126519 100950 47727 49862 82506 177102 60811
15464 60811 -91959 -97698 96884 139764 12912 122326 123681 87650 9546 526 10865
15453 10865 83895 111640 22994 -88747 -167305 -210062 -166525 -85898 -47492 -113777 -52480
15442 -52480 16347 -5268 45152 -38321 -39583 24446 13048 25377 92963 -25886 -177257
15431 -177257 -196186 -139025 -62765 27525 44406 90 38620 91220 52424 -35039 -39273 -18930
15419 -18930 -22189 14059 86243 61344 62929 89676 133760 156521 96903 -8482 -1417 89321
15407 89321 71453 -6440 -68093 -22965 -59609 -17932 -18731 -60862 -109948 -92641 11194 -27596
15395 -27596 -112624 -27013 -50876 -137581 -106382 -506 15271 2605 -209952 -183997 -24079
15384 -24079 8410 35469 13816 -12573 137587 235335 96255 49124 56095 50020 25625 61377
15372 61377 186953 129402 -38226 -51809 70883 47956 -24458 -84137 7785 -65152 -121464
15361 -121464 -94341 -161666 -213406 -205880 -114614 -207320 -277224 -208551 -198525 -154308 -78688 -186039
15349 -186039 -131786 -111467 -36542 50288 90396 35814 -2718 -72448 -128753 -110646 -40996
15338 -40996 33796 138554 27416 115614 173735 198725 289814 147139 25596 -3631 -5166
15327 -5166 -75509 -157376 -55861 -27195 32615 -16957 61644 120723 121450 12303 -103263 -127121
15315 -127121 -146653 -221931 -86084 -74837 -65610 33874 -50610 -109280 -198861 -259190 -342074
15304 -342074 -242875 -98615 20283 45894 19529 11425 118160 118474 -62531 -69383 -25757
15293 -25757 -59223 -121234 -104571 -140375 -118787 -55179 -17667 40333 -14357 -97072 -207074
15282 -207074 -161555 -149425 -140634 -178613 -212440 -202443 -121672 7275 53829 57690 116085 160306
15270 160306 129525 59325 -96216 -119973 -189413 -138160 22795 136463 146167 162491 223098
15259 223098 191719 255870 181530 -22915 9423 -112823 -127915 -43040 -19633 -2035 -61968
15248 -61968 -124216 -204909 -136641 -56387 36883 97041 88970 141080 240749 257160 234002 163061
15236 163061 91165 51071 144362 79068 39707 -7229 -112019 -24694 40513 41182 70917 -408
15224 -408 -97101 -22700 -73578 -216234 -249333 -166500 -198531 -181852 -120182 -163224 -222490 -246246
15212 -246246 -191045 -102867 -87041 -58800 29738 -39914 -142954 -141541 -154627 -137965 -81016
15201 -81016 -21530 -48730 -87134 -45755 -839 -12592 -120279 -215212 -147953 -112652 -100062
15190 -100062 -148890 -115995 -29798 -11939 7180 9952 -14129 -56259 -133511 -192244 -9589
15179 -9589 212166 138816 94936 135125 113676 44727 -207557 -257562 -133204 -147278 -2913
15168 -2913 142101 175366 119004 160817 23506 -48225 -90184 -70589 17453 -20519 87810
15157 87810 133870 76736 -51869 -7758 -14130 642 -51302 -209491 -198165 -234666 -80099
15146 -80099 -29433 -40424 -99515 -111941 -212214 -172486 -116231 -160460 -177130 -133716 -56954
15135 -56954 19302 15753 -82532 -145895 -8730 808 -9997 43604 19256 -86077 -78244 -15065
15123 -15065 299 69648 84521 31552 17092 32815 -73694 -54514 -52095 -107094 -188594 -130731
15111 -130731 -172716 -239333 -224385 -320862 -294326 -222493 -210629 -306254 -290477 -272248 -238054
15100 -238054 -262107 -298010 -229905 -179423 -106118 -71623 -108510 -148277 -189740 -246576 -134813
15089 -134813 19134 22587 1575 7039 -64327 8945 97980 42865 -12882 64057 170740
15078 170740 89813 -942 -101639 -126734 -150751 -206344 -219947 -217203 -153588 -27578 -100129
15067 -100129 -211858 -125997 -80919 -177331 -148474 -165303 -140388 -151073 -234778 -299814 -292845
15056 -292845 -329952 -231993 -74368 70348 67030 28549 179577 144063 65734 -60300 -90785
15045 -90785 -106582 -20422 107176 124739 133221 83374 -80328 -178741 -204544 -167400 -140410
15034 -140410 -82013 -12473 26813 -10598 -66347 -156945 -193899 -180361 -175159 -173546 -223247 -162061
15022 -162061 -109091 -55025 -66591 -63826 -93496 -49787 4923 42258 -111300 -98690 -41230
15011 -41230 -21999 -27264 -11276 -32992 -65144 -62566 -16789 111060 121086 30552 20962 34686
14999 34686 152279 290944 283092 221735 33961 -214264 -187086 -35760 5400 55278 131282
14988 131282 129586 40308 -106764 -149308 -186781 -92951 -141253 -253602 -271874 -193049 -100172
14977 -100172 58889 31173 118555 106953 170619 118211 101908 126694 96284 3665 -89820
14966 -89820 -98347 -96441 -65038 -19632 13203 -31051 -40920 -12368 96996 27276 -43075 80811
14954 80811 122170 17973 -34692 63436 -9594 -61281 -15632 16048 11476 -51409 -35806 -72572
14942 -72572 -77616 -39196 -34071 -53948 -104935 -117994 -46358 -23334 13827 108008 68019 51218
14930 51218 27852 23875 21926 -28834 -159661 -97079 123781 168170 47493 -73697 -53549
14919 -53549 -25946 -68954 -102940 -123952 -97311 -111334 -167502 -147957 -50294 -14567 52104 30860
14907 30860 69152 52472 -70127 -55188 -114926 -106162 9206 19795 -19559 -24809 4639 69831
14895 69831 115858 10009 -69855 -126237 -61615 -99194 -58419 -50696 -52655 -208794 -280578 -229146
14883 -229146 -124352 -115935 -77496 -57151 -150807 -116093 38536 161366 192256 127811 -49340
14872 -49340 -145710 -96368 -2050 29555 -20728 -19789 -75309 -205072 -170698 -96563 -58502 -50602
14860 -50602 -34089 64330 57274 14948 4049 -48502 -139384 -150879 -72894 -4879 90818 44667
14848 44667 -27221 5562 40968 -13987 -10855 -24207 -124375 -124942 -138986 -95965 -47269 -72416
14836 -72416 -68345 -24727 34516 94451 77737 94886 142753 134541 8794 -23350 -192124 -239665
14824 -239665 -228903 -150746 -159305 -135935 -188465 -223738 -244584 -236480 -332387 -287306 -116255 25869
14812 25869 18725 -56065 -243031 -432246 -441407 -321320 -176166 -160198 -176125 -233743 -243938
14801 -243938 -100309 -50832 -93063 -174173 -146670 -193447 -203193 -264108 -276022 -255434 -167647
14790 -167647 -45192 -65191 -104779 -98219 -111705 38938 46938 41663 41834 -112383 -175095 -100344
14778 -100344 -93308 -16720 -1267 2121 -64359 21090 -18822 -160615 -144713 -120825 -21624 -33553
14766 -33553 -25767 -129827 -184559 -138425 -150450 -123482 -142019 -161223 -134245 -45635 -137189 -49900
14754 -49900 38637 -56500 10681 74866 56045 26558 114120 102138 44420 5976 -29671 -56595
14742 -56595 -69992 -96657 -21438 137171 95454 -11402 -20056 -39390 56833 -2321 -111705
14731 -111705 -137307 -25023 -25742 -28252 46593 39292 35238 85994 16174 -83301 -104185 -108821
14719 -108821 -51596 -43276 -149756 -98797 -24920 -121780 -152919 -77616 -123949 -157671 -73513
14708 -73513 54688 38037 100351 69224 -25793 -45589 46420 112096 95192 99105 231626
14697 231626 260327 213961 60802 -128320 -130927 -64861 -77993 -7462 133815 240361 236887
14686 236887 201510 120578 -29593 -121091 -127213 -57315 14081 129290 204242 177507 78843
14675 78843 45346 83091 121478 123537 98113 101852 97447 148343 153037 60627 -83377 -128911
14663 -128911 -25960 -62369 -63565 -70179 -67260 -79751 -52563 -16852 21158 26477 40462 28984
14651 28984 -11184 -28715 -69442 -147604 -112179 -96784 -68348 -161226 -111758 35483 81386
14640 81386 83809 110562 192107 131163 35021 103083 147113 131450 -10106 8008 26914 979
14628 979 -99418 -179435 -150517 -56422 24025 -28743 30096 11902 -7251 44520 -23047 26512
14616 26512 69391 89333 86326 18022 -93797 -217865 -127575 39152 167943 18960 -93847
14605 -93847 -142970 -159324 -178402 -62443 17840 76290 109513 25136 -101861 -75193 -120359
14594 -120359 -170637 -74681 -32393 93239 -97871 -152218 -162555 -180462 -99408 -69442 -127762
14583 -127762 -136508 -61021 27214 5750 83280 165354 140051 41547 -81123 -109535 -85118
14572 -85118 -12544 124467 128665 89002 96362 43175 -17616 -10966 25542 -27781 -181180 -186325
14560 -186325 -125043 -44399 62692 51182 20848 58200 -19385 -82916 -23746 27813 4373
14549 4373 11604 23925 15874 77773 124383 225697 234948 121380 28174 -64146 -19154 83496
14537 83496 112574 86031 68155 70016 6543 -11990 -121736 -147064 -163744 -126954 -132057 -74486
14525 -74486 86859 261220 240420 94796 -11403 -58091 -78602 -124672 -154908 -254671 -144617
14514 -144617 -60512 -104535 -155467 -103136 -104753 -103559 -128144 -79673 21553 72759 -10980 54094
14502 54094 4302 -83314 -100639 -5536 19055 31439 -27080 -102854 -80892 14357 7876 70393
14490 70393 134591 17640 -115300 -19631 62077 54835 36712 -60415 120078 34197 14813
14479 14813 58175 1832 -122756 -174818 -85921 -68898 -73625 -105422 -196405 -254820 -86260
14468 -86260 100229 83905 70416 1089 -77204 -97173 -118518 -34589 19078 -101657 -119720
14457 -119720 5218 76444 -8124 -20327 -52564 -70723 -87799 -45247 3547 -38864 -62961
14446 -62961 18682 55929 -119412 -238194 -188225 -112822 -139312 -117979 -145400 -78018 -42425
14435 -42425 -71301 -28768 -16619 -144241 -197517 -79109 -21366 15029 -132285 -73095 105910
14424 105910 65213 -18645 7007 88191 -23230 -62140 -34368 -64564 -71595 37258 -22532
14413 -22532 -133019 -184658 -149830 -94629 -91457 -141996 -140022 -19314 47972 109310 58662 -17836
14401 -17836 -86969 21854 70487 -30442 -80892 -35063 12758 22752 65408 142553 152345 130669
14389 130669 92677 192844 167272 108532 75586 -63600 -77823 -28864 13639 59932 -46612
14378 -46612 -38506 -62085 -54208 -94858 -178191 -166488 -80672 -39781 -127979 -93254 -35307 -38039
14366 -38039 -23071 -68465 -165499 -143823 7310 65983 -66 85536 106995 130407 83167
14355 83167 37706 87540 131934 250928 203501 149865 160147 87203 21727 8013 42169
14344 42169 -53142 -65992 -43615 147927 137644 -95380 -289147 -263475 -216942 -83891 27165
14333 27165 76812 50623 8056 32274 56219 49373 35748 -24211 -84711 -56998 25528 57920
14321 57920 96357 -1085 -140995 -154719 -160576 -91818 -2846 84238 75894 17992 15984 52909
14309 52909 106657 143072 108199 7065 -123849 -140121 -136768 -99783 -117055 -73277 3912
14298 3912 -81818 8148 37106 64282 91130 61728 107475 26664 48076 40549 63865 65336
14286 65336 162317 224085 211741 154826 28590 42299 96209 -5932 -61093 -53850 23697
14275 23697 152984 61993 -40911 -17521 -48744 1877 27407 -46565 20447 2154 -45055
14264 -45055 -97995 -230892 -149001 -157243 -187671 -103514 -76058 -69654 -75895 51018 104344 243837
14252 243837 229673 -8309 -93960 -124639 -175599 -135928 -153592 -181102 -244187 -375614 -227333
14241 -227333 -33788 -23302 -49376 -38600 -40800 -106270 -52880 -66134 -88772 -141446 -153564
14230 -153564 -98877 -5015 56096 51589 -22495 -38226 -6737 71344 98643 -88628 -232074
14219 -232074 -66591 96701 84355 15672 -33271 37292 84295 -16567 -41304 -137663 -78216
14208 -78216 -6671 16464 -90971 -97745 -86151 -49061 -5998 -41342 -38770 -19004 -13801 -175839
14196 -175839 -216998 -215612 -207417 -189461 -122452 -105947 -107722 -35049 -84769 -12970 26474 -150835
14184 -150835 -128627 -75020 49781 125492 225639 242891 160348 101249 8022 31495 142368
14173 142368 149411 279790 254243 171700 145294 34729 -97024 -37400 35566 -110645 -199070
14162 -199070 -151214 -12804 87936 -32441 -223039 -182701 -109439 -23723 51882 101191 82095
14151 82095 -83468 -152678 -74435 -2440 38013 -53679 -52830 10968 -87135 -143606 -67105 -63069
14139 -63069 -4596 -95185 -130109 -163487 -112124 -30853 85482 132347 70565 131425 82734
14128 82734 -1003 -18547 47504 19400 104050 21965 -20486 -59101 -134525 -86292 -65143 -37235
14116 -37235 8109 41108 -17456 -44482 34838 -128675 -152532 -134157 -209931 -198516 -131117
14105 -131117 -105435 -139006 -219285 -251189 -258059 -335859 -342155 -204178 -87036 -60465 -62475 59479
14093 59479 103308 25194 -109096 -297209 -256748 -92365 -17692 36160 116742 52486 -113614
14082 -113614 -156936 -92542 63955 46170 -54295 -125679 -112485 -105153 -180296 -160554 -161055 -159457
14070 -159457 -55980 -42822 -156962 -177292 -196766 -216717 -21639 177046 58769 -12107
14060 -12107 -27311 -104304 -29506 50948 31508 -72286 -75181 -171987 -100619 -66577 -18812 74469
14048 74469 145519 182849 200826 184471 267104 197849 137719 192209 167631 44928 29143
14037 29143 -58327 -3285 -28752 -133300 -183431 -231531 -304385 -230671 -118690 -101613 -110311
14026 -110311 -3590 83581 112683 87376 53881 -15837 -123865 -118990 64155 162976 115646
14015 115646 56229 -55546 -45974 -97157 -74905 21900 118791 35836 30523 38085 118194 101778
14003 101778 37152 -19301 39167 68300 129102 78203 -5551 28278 -19481 102096 58058
13992 58058 -15973 -103881 -64433 -3407 -58887 -106819 -111932 -165449 -133830 -106604 -32579 80763
13980 80763 34418 106337 133864 25026 -198985 -291956 -227792 -208558 -180502 -250049 -271063
13969 -271063 -229227 -142532 -85607 -79513 -126477 -72120 24346 60034 13088 -2977 -86029 -65717
13957 -65717 -119838 -129651 -104219 120075 285122 310047 133415 109722 78233 -55875 -108054
13946 -108054 -106929 -103275 -102719 55033 100843 107133 96144 144146 184193 159710 51184 -115060
13934 -115060 -131980 -26997 -46422 -1676 102081 202375 211809 147072 44335 -107426 -140493
13923 -140493 -161429 -238682 -246024 -122161 -38082 44286 52945 23199 44743 22053 34892 -86679
13911 -86679 -20516 -6443 189 -45277 -10641 20438 7649 21344 -998 -43189 -224212 -293086
13899 -293086 -163496 -79094 10922 -22517 -46217 -25121 8239 -149394 -159183 -72773 -21653
13888 -21653 -9727 32561 94822 64958 55621 86185 -50104 -133636 -135472 -107737 -106146 -156824
13876 -156824 -173484 -187584 -164638 -144303 -147592 -126059 -157899 -92567 374 13485 12316 34105
13864 34105 39381 124939 115420 -62497 -86793 -22197 -33041 76705 86750 13454 5316 96726
13852 96726 97151 16014 27455 -22436 -129041 -72449 -91932 24230 59021 166833 118113
13841 118113 -17412 -105045 -153845 -101879 -20110 -116909 -194087 -186655 -83716 3044 35209
13830 35209 44588 102232 -45280 -172342 -36665 -77121 -167224 -63990 60050 -11217 -12188
13819 -12188 40471 25481 -29873 -28570 -55577 -38151 -63448 -60154 37208 -31082 -57686 21021
13807 21021 -78327 -121459 -62254 -3262 18544 24027 -40087 -85657 -133621 -137946 -169409 -14254
13795 -14254 -72211 -148717 -92505 -25771 5457 24403 -14346 -20119 -41712 -1629 -21817 -16647
13783 -16647 -36919 -63829 -197381 -189173 -77004 -35019 53665 59026 87737 46802 24647 40877
13771 40877 50214 83977 147321 16209 29790 42771 124798 187415 234312 155223 139289 203442
13759 203442 201600 109930 139419 247268 57105 -7342 -318 50203 65193 59988 92378 39445
13747 39445 -73362 -2854 34116 80686 77593 90253 44486 -62867 -59999 -142340 -244263
13736 -244263 -303659 -195437 -91802 -79731 -115610 -88606 -71415 62084 109772 -33420 -25896
13725 -25896 -40373 18589 20256 156104 121226 -30204 -40584 1609 79624 155850 108503
13714 108503 15206 53675 183605 229989 87517 108299 250327 140153 136070 156279 108026
13703 108026 103140 143496 16676 -41874 62325 157596 58840 34023 -20311 -2272 -45608
13692 -45608 -95564 -222326 -208208 -114784 -7884 -100630 -18942 48845 153491 185199 125354
13681 125354 133704 -25615 -216775 -263354 -165076 -36075 -25850 -4210 -219464 -242636 -116956
13670 -116956 -61077 -67746 -20325 -38534 -17384 80811 39978 43949 76333 126487 143337 104732
13658 104732 65375 70845 54505 27638 99241 77609 106631 90741 45504 -2312 -169724
13647 -169724 -284102 -299043 -202422 -39879 13784 4684 47514 -57363 -228285 -207870 -112402
13636 -112402 -119410 -83890 -195077 -17460 186240 240789 188876 169664 207181 96712 59151
13625 59151 108037 116768 105466 15671 52578 95483 138121 96974 60461 81220 60009 -20472
13613 -20472 -138490 -115017 -130354 -70732 -7666 40143 -26940 -12925 31440 45559 59364
13602 59364 101457 194386 230728 146631 234398 159764 57860 2888 1272 -57843 -35757 65312
13590 65312 49548 54358 -6279 -16195 51314 16073 -12433 59990 171951 132338 88236 43635
13578 43635 -98903 -72842 -92975 -500 47073 -67455 -16431 57402 86269 147601 74302
13567 74302 -34143 -54816 -60867 -127965 -184882 -72584 25389 -4772 55739 26237 78569
13556 78569 189840 48622 15899 -48711 -70978 -2748 -48634 -149475 -8876 65213 66108
13545 66108 38395 58945 38390 12311 9624 27311 2015 1695 56625 -48540 -106001 -15489
13533 -15489 1349 33221 78417 41326 -17636 -18423 14817 112647 147521 193396 21882 -41373
13521 -41373 5928 -38057 16691 88971 73098 7687 143108 153102 97116 146692 206305 81671
13509 81671 121666 178849 51395 -49805 -17532 -2387 -90876 -124798 -141747 -142363 40242
13498 40242 185306 258719 195191 51762 37 65962 60709 50677 75706 40911 -116222
13487 -116222 -168076 -77346 18690 93488 132814 -66604 -88732 -56982 -49417 -9159 -36191
13476 -36191 11923 93744 169897 222630 189915 201042 173692 251593 252836 152842 102183 237397
13464 237397 320770 319707 186263 142511 219839 106478 -65815 -110446 -145484 -212565 -210668
13453 -210668 -157280 -30199 -117727 -172912 -338362 -306034 -177121 -33899 -23445 37850 82307
13442 82307 25979 -85899 -149372 -115737 -118913 -39949 107565 197174 162709 110971 129782
13431 129782 119119 92525 128649 32891 84564 208784 161373 22598 -73432 -124848 -102474
13420 -102474 -45953 13167 -11837 25152 -41154 -165887 -184487 -145230 -132388 -47123 5321
13409 5321 55162 119133 133024 174060 252083 207150 293257 315406 20258 -167852 -187675
13398 -187675 51906 23926 -16149 12688 35158 -23569 -127847 -162474 -157453 -128845 -82871
13387 -82871 78988 143709 29500 -55028 -6847 158207 258898 270138 99231 15155 35903
13376 35903 88063 142519 172598 128958 45745 -2178 14870 14499 32277 128833 149822 11801
13364 11801 69696 96691 41897 69952 90639 19427 -136400 -81185 -46951 -11393 152
13353 152 167066 198762 109810 -46740 -192111 -185975 12613 184900 208422 142730 136167
13342 136167 203836 155452 3132 -10475 108995 69237 -28004 -150307 -47741 -6312 35044
13331 35044 130180 129573 47722 -54324 -85178 -3458 -21108 -122459 -77032 41439 17073
13320 17073 -20185 -9814 18631 25880 -27873 -71321 -84238 -42579 -84124 -172219 -169463 3969
13308 3969 111102 74024 114237 175476 194393 11913 54150 132300 107903 -10044 -40227
13297 -40227 -279 158322 217130 230745 193943 125565 70018 67076 193326 340279 187431
13286 187431 -17088 -16224 -43116 -115281 -114899 -16002 43190 11501 119332 24606 -97947 -47716
13274 -47716 -34313 -122810 -166032 -85661 33666 5863 -43007 -31187 69965 212337 92270
13263 92270 43303 -90016 -115322 981 75321 132535 275799 245014 127891 98428 -7941
13252 -7941 23524 69551 185991 222773 110817 79577 9496 23543 101340 56190 62638 93279
13240 93279 32778 -86513 -93731 -57943 41457 108330 57999 49112 102733 26239 -3352 106800
13228 106800 206739 124356 122949 79954 -52375 -67125 72061 93039 33169 -131166 -58162
13217 -58162 132286 110219 85348 54542 98029 76425 -9914 -42542 -12295 -68452 -120870
13206 -120870 -109939 -132798 -108615 24669 39835 -74212 -52079 19406 -14606 -51985 -52272
13195 -52272 25310 -21837 -10547 145461 202691 22215 -97324 8098 21554 -3530 94650
13184 94650 67859 93415 107816 35587 21194 44164 43608 61707 81642 124925 194733 223219
13172 223219 153375 60662 -46852 -175267 -140138 -89831 -121087 -5505 70018 65371 51913
13161 51913 78061 223785 210853 207748 185549 83980 86536 193998 141907 217718 422796
13150 422796 352553 164251 62886 142719 200199 244995 230495 182332 78895 -59780 -139123
13139 -139123 -730 99968 73102 63108 -22790 10707 77139 75641 79028 133740 31164
13128 31164 41524 213314 246036 110812 -92669 -89899 76637 198108 199913 148945 171760
13117 171760 111483 155696 273164 289330 223154 100556 66684 79456 10015 -31785 44721
13106 44721 110913 209406 207400 90425 119911 251532 357493 338592 312222 227464 170716
13095 170716 83658 -48812 -14622 33792 -60377 -131481 -63240 133434 233175 137756 11117
13084 11117 -71046 -21639 84803 220613 170576 86817 94485 104376 118068 147796 219985 145810
13072 145810 60175 134124 169114 217222 268594 212226 212050 164002 65147 118170 167085 135734
13060 135734 139879 133140 38188 115279 240434 200516 167824 164569 167674 179797 103721 40001
13048 40001 -70638 56288 126170 227310 214560 194052 188683 52770 128001 158907 221536
13037 221536 116909 26176 50807 57361 72030 14167 -97711 -10596 37788 -40665 -75346
13026 -75346 17323 43724 -13013 -18678 78595 93212 131803 187126 184366 72058 -5447 -30793
13014 -30793 -92371 -22066 -6112 129515 230016 350269 369853 167214 154776 207516 161219
13003 161219 251067 192298 117908 92722 -966 55803 68689 -61307 -78830 -50887 -139634
12992 -139634 -168828 -148090 -127060 10590 78982 110212 183258 151390 97401 60460 76126
12981 76126 144146 122877 91569 89321 6531 -145944 -5372 36453 -61505 -180657 -239382
12970 -239382 -51612 100167 129513 30652 -20881 -37645 -106360 -67423 68317 191275 280190
12959 280190 371326 335292 151284 108776 240194 346765 368574 246033 39146 -46665
12949 -46665 80934 149768 116358 127360 155953 213848 151457 142296 179554 172988 183857 89975
12937 89975 65624 191969 196213 164101 32765 -74725 -52724 85405 127062 64644 48754
12926 48754 138760 236781 243148 144346 179241 121132 124027 160030 46483 -61702 11106 97092
12914 97092 152233 146009 141989 109339 73169 66410 3446 -52945 -111353 -77394 -13633 43060
12902 43060 72230 104500 73864 -5250 -16656 192243 197046 142391 134798 198954 287607 230376
12890 230376 123828 111514 108296 143909 109906 114575 143612 324770 400342 445162 395847
12879 395847 386619 266036 178866 159936 157946 235148 311079 222368 178584 301955 282209
12868 282209 108609 -26445 -58796 -59041 27083 118140 242360 232948 195223 135054 138369 182371
12856 182371 160808 35149 92552 212708 193019 117194 95118 41652 5130 49232 116900
12845 116900 10033 115109 280016 310133 161965 156501 188689 227865 195423 336294 282668
12834 282668 158469 65410 44738 23700 97935 53012 -19286 45727 162200 205101 29150
12823 29150 -26102 100498 303183 368133 329920 272215 322194 312005 381754 311876 131980
12812 131980 42150 42618 52420 49601 11491 49475 30495 39016 -21531 92983 274276 290662
12800 290662 227700 129151 165993 167921 181258 116572 80307 226479 353989 391688 365047
12789 365047 293373 249845 174079 203157 234873 212594 206512 103498 175611 279804 316754
12778 316754 319833 244054 203565 249636 179465 -4480 40536 104675 144920 159309 10807
12767 10807 58781 206188 296557 359094 340463 338922 343803 388013 234120 86285 169630
12756 169630 232846 198230 171859 255468 362486 284635 273796 266559 215512 40247 29265
12745 29265 88598 144533 173153 164412 138571 206734 160264 181748 166540 180490 221104 166465
12733 166465 164398 149573 281892 258741 144836 47699 75574 29277 72362 116700 264446
12722 264446 256823 173366 181873 110326 2992 -29183 1738 -54319 -38213 223028 266402
12711 266402 153569 145201 200795 146083 279315 421685 400406 358746 357928 312910 267826
12700 267826 218023 208994 260197 309477 246599 102541 37164 -3579 73246 162043 142861
12689 142861 165301 220851 201725 210866 236354 180232 123563 144612 157386 140351 143054 225186
12677 225186 210455 304046 292413 122700 62983 28787 -67666 57836 337892 318333 269737
12666 269737 121474 141218 148961 188649 262187 346448 354931 301683 351342 450686 460708 435704
12654 435704 452003 422437 323739 236864 222703 186169 167376 171443 216060 144197 12324
12643 12324 -33812 -20588 164822 266242 303583 295202 250446 261213 206185 209456 240678 242236
12631 242236 357582 386020 331854 284372 168597 188191 285338 289957 308481 299345 278657
12620 278657 301642 325707 318987 184212 268057 305772 354583 449122 377615 304181 294343 378375
12608 378375 433335 456920 517055 427739 322991 294786 394777 444601 340303 320250 380541
12597 380541 296996 198476 277489 271057 180353 165209 317085 465577 448438 506602 485231
12586 485231 393365 270136 226640 243669 376099 427604 418559 332530 406514 497331 581969
12575 581969 571079 458016 474260 507777 550739 461964 379249 407766 365931 338691 403660
12564 403660 430905 372526 265999 350402 440575 466512 518172 562002 467115 347460 424999
12553 424999 493562 399334 320072 335969 327403 352953 346398 207342 333067 471539 405891
12542 405891 336781 442886 461250 327044 158205 275382 415591 491259 469406 412379
12532 412379 393129 327126 465241 610683 596609 600471 609043 590489 599825 501821 420052 398316
12520 398316 476738 466179 501741 673600 872846 830891 592743 598693 625264 551140 482811
12509 482811 413925 322082 322977 420329 508762 502800 480684 419344 466523 542804 644327 494073
12497 494073 331813 366808 450645 507513 684574 609532 537368 482435 497925 578400 591067
12486 591067 664484 682207 673783 635349 597074 625754 561936 601208 680807 654889 655529 725777
12474 725777 772348 667480 578486 624204 689449 693042 675968 721475 570687 600788 819022
12463 819022 904602 770889 721710 714020 614071 689867 730204 741344 628884 614442 618067
12452 618067 466602 411934 440685 553609 541576 463373 560894 494196 479504 468709 492804
12441 492804 453690 512721 643521 655445 674784 711577 690717 621492 573717 627423 592291
12430 592291 655945 614816 668852 638969 703884 751043 737077 712958 751570 791268 657828
12419 657828 688846 667532 510515 536839 598421 637251 809289 855419 817723 730840 730070
12408 730070 705463 736833 684822 731099 709721 741364 750531 660933 550000 560483 600340
12397 600340 692505 723710 663876 668975 633505 657586 760817 851064 842188 928016 985653 895226
12385 895226 806093 741636 688715 767707 832919 737394 673945 737128 785878 797927 773358
12374 773358 875012 993262 1011909 1168131 1183672 1146231 1090701 961187 957110 846054 703056
12363 703056 513917 599400 777409 820457 794364 709933 886318 993007 951939 933379 943296
12352 943296 915349 943792 917668 939579 906236 875503 863747 916569 940741 885594 735715
12341 735715 677033 866241 969667 881844 907335 913903 965254 1074708 1063172 1054643 1031720
12330 1031720 1024759 935936 797280 806589 1003061 1050506 1084594 1147367 1203166 1159904 1080474
12319 1080474 1012394 1112058 1199268 1172830 1099825 1078134 1120992 1117347 1040225 1103465 1078223
12308 1078223 1085912 1221490 1254239 1270844 1354411 1343467 1338352 1366719 1352250 1237403 1223028
12297 1223028 1263502 1237481 1353347 1467157 1398902 1296032 1234994 1388922 1319442 1210507
12287 1210507 1225288 1419708 1373318 1359742 1286494 1235555 1224526 1414179 1408214 1302996 1292043
12276 1292043 1260334 1304712 1316938 1332356 1318886 1257354 1246824 1227008 1331238 1393983 1346263
12265 1346263 1366995 1398323 1416833 1371399 1321263 1403758 1543892 1660736 1744309 1734140 1629031
12254 1629031 1619397 1593344 1532210 1443900 1364376 1390690 1545385 1702246 1781990 1635462 1650528
12243 1650528 1670511 1631926 1662619 1604026 1664346 1697346 1749141 1751952 1887415 2012068 1938367
12232 1938367 1891009 1948187 2010651 2011331 2059053 2114715 2075399 2021653 1962637 1909982 1868554 1822771
12220 1822771 1780563 1791888 1794554 1841539 1890245 1959380 1951695 1993532 2206021 2280269 2146953
12209 2146953 2153065 2181435 2188591 2241402 2220072 2156605 2119446 2159444 2165025 2094556 2048364 2138749
12197 2138749 2118970 2160612 2224019 2427205 2457360 2379704 2292813 2223542 2216060 2257923 2353030
12186 2353030 2415121 2521644 2500641 2415858 2359306 2420965 2495321 2490257 2416439 2341756 2397382
12175 2397382 2471846 2529472 2585997 2682599 2909583 2960065 2902083 2847049 2844264 2935821 3000002
12164 3000002 2929008 2851853 2872724 2873709 3046858 3206917 3086003 2997798 2911969 3022667 3031473
12153 3031473 3015160 3020539 2999104 2998206 3127563 3254029 3230892 3180420 3186759 3300315 3324167
12142 3324167 3357303 3396683 3463893 3573839 3575283 3511753 3516367 3587265 3647396 3657870 3601559
12131 3601559 3612195 3790549 3827234 3778204 3908827 3999294 4017494 4014127 4005408 3990140 4081745
12120 4081745 4238214 4296003 4237625 4193924 4284983 4308188 4242239 4248323 4360218 4355935 4279624
12109 4279624 4357449 4515283 4715430 4812055 4813692 4851976 4956379 5081069 5119101 5111971 5131771
12098 5131771 5286753 5431390 5441644 5509739 5574263 5570940 5585187 5712316 5678844 5610249 5645634
12087 5645634 5696956 5787153 5913088 5982413 6006696 6060841 6087566 6166197 6256701 6337532 6495915
12076 6495915 6690804 6852480 6935296 6910852 6816225 6745776 6847241 7000718 7203347 7446607
12066 7446607 7485287 7411623 7534131 7657112 7830668 8124206 8224718 8335081 8470976 8647743
12056 8647743 8655246 8702914 8827298 8901329 8956101 9094087 9340990 9297377 9269456 9438474 9744899
12045 9744899 9890868 9925263 10076328 10274940 10390655 10554477 10766894 10854667 10975801 11096765
12035 11096765 11293622 11514574 11599635 11792914 11930254 12051814 12185794 12286244 12384629 12555466
12025 12555466 12736218 12878157 12992135 13277138 13612238 13697241 13946186 14191125 14469651
12016 14469651 14784274 15060725 15373133 15674831 15632262 15785672 16157670 16542110 16744111
12007 16744111 17160219 17523885 17792518 18104240 18544961 18821350 19084997 19409368 19833549
11998 19833549 20147988 20410978 20811416 21311534 21790309 22274832 22691987 23194308 23720661
11989 23720661 24220567 24688254 25037218 25380911 25871921 26392054 26977775 27610228 28213198
11980 28213198 28806895 29480853 30154652 30856136 31575322 32168860 32864360 33517175 34235538
11971 34235538 34999075 35822642 36641165 37426610 38156913 38952144 39930031 40912742 41783825
11962 41783825 42707791 43573731 44531042 45643658 46752809 47889238 49059339 50132690
11954 50132690 51234601 52304017 53513921 54715315 55859381 57060766 58289818 59440212
11946 59440212 60706033 61937109 63056210 64292991 65490523 66542735 67703157 68867867
11938 68867867 70123611 71230442 72235020 73247583 74307309 75390941 76321871 77201164
11930 77201164 78144232 79053077 79769276 80232024 80636995 81049925 81468428 81831633 82125577
11921 82125577 82296029 82514737 82649105 82651787 82471515 82212828 81997651 81655551 81276021 80828323
11911 80828323 80405648 79886945 79297624 78609244 77850212 77065912 76186794 75456803 74712809
11902 74712809 73922791 72959179 72055601 71106499 70010440 68957485 67975908 67002768 66117889
11893 66117889 65201632 64148422 63155805 62182957 61141777 59967294 58955671 58117001 57203475
11884 57203475 56366341 55448536 54506369 53536103 52551518 51705964 50764401 49842943 49138704
11875 49138704 48376326 47573778 46727283 45929917 45198057 44416207 43757933 43024282 42188999
11866 42188999 41339868 40520835 39779129 39266293 38688832 37982613 37353908 36748733 36123479
11857 36123479 35488890 34897443 34283137 33746548 33186791 32751215 32347788 31736235 31161024
11848 31161024 30680738 30233960 29780237 29259594 28744179 28367708 27995493 27559624 27207949
11839 27207949 26782440 26396402 25979726 25508214 25091279 24829894 24471803 24182716 23862255
11830 23862255 23475609 23029390 22691617 22434287 22209180 21787580 21443803 21184975 20914263
11821 20914263 20612937 20400799 20175223 19922740 19617115 19428646 19191226 18802917 18457661
11812 18457661 18254374 18031040 17682915 17529572 17373351 17214895 16981787 16663897 16372643
11803 16372643 16221975 16078226 15882540 15555916 15237612 15089699 14914774 14776996 14761648
11794 14761648 14607800 14353008 14250675 14047968 13920015 13797284 13469458 13118986 12969105
11785 12969105 12847694 12803578 12651130 12361453 12248412 12187378 12040487 11818908 11637690 11660910
11775 11660910 11578544 11306464 11073380 10949498 10842709 10788241 10851851 10712217 10504041 10330713
11765 10330713 10205305 10151305 10125503 10015716 9842356 9735063 9667139 9637936 9534726 9435746
11755 9435746 9330375 9177575 8945435 8730989 8637126 8502343 8298211 8146237 8025530 7802933
11745 7802933 7709912 7668717 7773740 7846480 7792216 7718739 7642670 7478365 7449331 7338928 7269071
11734 7269071 7232660 7194621 7121706 6842831 6716776 6655405 6657075 6542577 6353251 6317140 6373757
11723 6373757 6273855 6236609 6304381 6215980 5945636 5825555 5854075 5845978 5805712 5967690 5882417
11712 5882417 5705196 5710587 5633403 5486622 5534349 5386217 5333481 5382605 5272342 5189187 5168583
11701 5168583 5051495 5014990 4871650 4773585 4740640 4800866 4939598 5001754 4951684 4781108
11691 4781108 4628916 4551990 4424453 4391513 4429954 4368137 4244882 4189317 4213748 4294577 4095178
11680 4095178 3874009 3866057 3905272 3987458 3910731 3804736 3707156 3548579 3550699 3668126 3625996
11669 3625996 3523286 3580436 3595219 3591233 3574522 3600420 3527295 3509392 3422784 3290212 3178466
11658 3178466 3143965 3136562 3141212 3096097 3118292 3157799 3087140 3152814 3167183 3144213 3003115
11647 3003115 2796798 2679010 2734214 2818060 2943698 2996743 3004898 2910867 2927996 2907825 2887058
11636 2887058 2735753 2635408 2589655 2597554 2630953 2739854 2786236 2679679 2599650 2668685 2685552
11625 2685552 2613011 2475330 2481506 2622226 2693642 2671481 2512151 2444842 2303895 2306327 2333751
11614 2333751 2296936 2284948 2228847 2218857 2186190 2250597 2384472 2346416 2419523 2382812 2264203
11603 2264203 2165315 2143725 2082776 2084074 2045636 1988840 1969809 1940198 1983666 2116612 2053087
11592 2053087 2019744 1909408 1762816 1733937 1769338 1827765 1924493 2010019 1917142 1880294 1967427
11581 1967427 2041438 1898253 1698242 1659922 1688219 1659971 1695250 1706863 1645835 1639480 1573583
11570 1573583 1514782 1494995 1558103 1683766 1690864 1596529 1522873 1566091 1583378 1479409 1352308
11559 1352308 1390635 1446305 1475177 1490730 1309760 1224658 1229675 1274354 1334062 1270593 1345392
11548 1345392 1510612 1402181 1303732 1340478 1431398 1497013 1545837 1569764 1469401 1421549 1390627
11537 1390627 1256511 1260887 1241579 1172167 1137998 1088257 1083572 1169589 1178791 1267010 1301791 1300297
11525 1300297 1295128 1244228 1261851 1397691 1319456 1124403 1054267 1019812 1033450 1060703 1045331
11514 1045331 1189629 1127472 1045748 1099273 1098387 1016624 949096 1044383 1099273 1094630 1134598 1069970
11502 1069970 1014196 1023780 1021885 1051649 1138197 1210408 1188089 1173058 1171294 1204785 1247101 1240528
11490 1240528 1071221 956244 969684 930029 993879 1034680 1018676 1084060 1044378 904553 929425
11479 929425 1005781 1072102 1133232 1052318 904535 937828 953486 848416 765331 753383 900309
11468 900309 954657 880988 889090 970837 853094 677555 650919 798235 802265 807247 714578
11457 714578 651327 676038 756287 893126 869934 834172 895818 936103 926630 875412 808872
11446 808872 804755 803114 746313 707193 720284 799161 1011306 1042016 906088 829875 796075
11435 796075 839892 891781 799731 690329 662563 712439 694571 714286 777806 741640 761022
11424 761022 776300 795696 872378 883698 835420 771944 675292 635458 553777 561753 519425 525354
11412 525354 498850 412980 388726 581698 625473 568293 617691 553818 537625 504095 495147
11401 495147 570542 803332 837615 839789 761020 748857 680262 735858 673572 540764 447147
11390 447147 500433 463730 598034 733183 733738 746283 752839 758991 798011 788477 773101 782782
11378 782782 812570 731636 780130 813956 774978 679756 547359 550715 613773 778068 722124
11367 722124 649439 643550 648158 668939 621911 520031 507936 555836 498892 494643 472835 545613
11355 545613 619842 671937 593508 618967 680625 656404 640152 734989 765919 639206 444888
11344 444888 411001 454075 438371 378467 374549 499426 661728 551283 515576 448064 341032
11333 341032 377133 462035 411738 512281 545172 539346 638401 586277 443879 437524 498318
11322 498318 502009 497552 450181 400502 490358 498684 475168 457269 472138 454664 407614 292819
11310 292819 200857 278463 294338 251432 256188 336576 319369 414112 565670 694592 764663
11299 764663 697938 581838 707125 725373 577734 466521 486702 488893 383569 308096 398986
11288 398986 468768 407725 236889 230346 356427 439664 537287 628258 592569 554488 521565
11277 521565 443108 425746 424138 429343 529613 468003 377453 417083 486954 497337 501801 594520
11265 594520 605067 472175 518991 473815 327444 326864 320719 326039 316150 296409 348356 333601
11253 333601 305540 300926 347840 314330 394240 492129 276101 181064 258133 239980 240482 302062
11241 302062 329236 279563 367097 525804 437100 498932 648620 546388 513480 425455 379744
11230 379744 314600 342216 337031 337302 348881 323819 395898 411938 511739 566222 670698 782268
11218 782268 764396 617709 412508 329059 384237 388420 286995 192864 254696 192972 235704
11207 235704 306835 353962 339941 253460 257292 272641 235875 237325 302757 236813 264271 265191
11195 265191 267584 235430 247786 137168 131087 181363 263031 268404 353979 387049 415176 656949
11183 656949 644029 625845 563728 500269 472238 426649 395855 466040 515354 401918 327972
11172 327972 360211 486129 454829 183196 18677 86584 120273 149184 240839 355905 334836
11161 334836 234211 259117 171911 33023 30757 13800 -870 107482 189216 232151 218674
11150 218674 367778 359625 409958 401018 377749 454988 419876 411217 378173 332113 327419 310425
11138 310425 391116 403636 375970 375577 338518 318147 384788 414280 406033 469043 375856 328664
11126 328664 168549 181705 193475 133185 214257 427660 513588 502619 475433 410432 323376
11115 323376 172884 195787 243556 183319 89204 72173 86942 142427 266645 269108 223709
11104 223709 213497 147857 146695 206241 201789 86120 -6199 73793 142261 158094 190113 282956
11092 282956 372550 247185 219584 177359 266659 316140 340820 320859 252907 222320 284049
11081 284049 291545 322388 462633 430664 375286 358959 334633 335882 419213 379677 346925 298938
11069 298938 229344 165056 334595 378760 394308 416776 301641 235972 311672 393803 286898
11058 286898 272281 296957 332105 338172 311404 284547 324980 219369 48972 -72858 55623
11047 55623 101739 111457 194650 186070 56287 -5768 8433 33596 141127 259331 227309
11036 227309 143869 98764 131214 126240 230139 336624 350883 355090 277643 326217 286012
11025 286012 147565 116919 156604 197767 223566 150131 360553 366508 213698 248080 256215
11014 256215 121807 130182 63078 51075 141136 113265 138451 306884 403544 424436 379977
11003 379977 314189 225637 310303 452482 537476 512375 447856 212936 175503 270219 281683
10992 281683 161400 119983 258311 295317 358923 314561 276318 346175 253063 261635 320223
10981 320223 310004 196987 47963 -12792 -57561 -82615 -5445 218515 221349 202979 172296
10970 172296 179266 189454 124169 6013 -34439 -20093 101044 264691 210284 170093 108750
10959 108750 43688 5518 89478 180404 129800 45938 19758 55985 185133 125873 118070
10948 118070 96124 79324 84920 46100 30714 -13028 9643 104262 108783 220588 191419 150910
10936 150910 173091 286271 417765 553591 522505 322296 267824 279689 197659 183234 8016
10925 8016 26581 181955 274634 172329 164625 158789 66253 -10521 59598 31359 -1244 42725
10913 42725 108964 105532 92947 91422 175378 229095 203165 179893 187534 148512 105760 94440
10901 94440 24777 -67771 -34897 -1184 59572 119315 191823 180652 143249 75034 120234 112227
10889 112227 -38488 70501 141696 114568 89706 189300 228521 193537 110577 128745 189856
10878 189856 324367 252567 246033 270632 292151 293152 226361 147676 101181 90467 41145 146582
10866 146582 113945 191570 198227 124922 140294 172245 241851 212751 188198 261914 352691 259550
10854 259550 237921 214933 142844 267203 293942 200671 197931 204337 224504 82629 -43100
10843 -43100 -71654 -7214 62291 75681 229632 340905 287634 163032 158449 164031 223737
10832 223737 248661 136859 88449 67534 185655 297726 271131 160481 90763 78788 66332
10821 66332 90366 142672 66618 168591 244064 291526 380375 277158 189186 248418 264047
10810 264047 209711 89037 123764 77914 -3568 -37605 1502 25061 37017 53048 32352
10799 32352 39607 79797 21050 249252 327083 388903 398732 382459 523324 668385 778929
10788 778929 957380 1055458 1149330 1408296 1586369 1454300 1116530 793316 765447 794731
10778 794731 680888 625142 667088 686573 618550 553877 530280 457284 415501 447224 470558
10767 470558 442822 438799 587606 506046 355578 329536 386084 276481 292750 300471 263696
10756 263696 251602 298909 301211 185394 172671 195126 113818 84164 110228 166258 92415
10745 92415 96933 225088 139018 153804 217887 213615 252416 297154 200854 237972 276116 300800
10733 300800 360937 270021 157641 88881 124846 194600 361973 447411 465485 399302 370462
10722 370462 343273 291105 344048 389608 408676 483344 473447 397864 482171 306832 190698
10711 190698 120916 53553 131396 168912 174908 98498 12927 -16925 32135 83996 196173
10700 196173 355449 418165 404491 381335 394101 329796 145438 77736 105301 155088 198435
10689 198435 204283 229188 244125 146478 235660 354825 285385 164128 223397 391593 374822
10678 374822 389896 356705 370263 321965 379264 292955 204438 211460 285970 360345 466371
10667 466371 610943 727331 751309 688255 632613 621090 607935 585486 656647 732961 636019
10656 636019 454216 515722 609043 598370 606020 667163 752835 755385 553056 433200 478561
10645 478561 517880 473265 376724 372695 429162 454007 445523 292498 268273 184598 164461 158795
10633 158795 338627 440157 428288 396739 265837 357815 490385 427093 491567 425025 390841
10622 390841 469366 425849 373997 292964 226525 328628 262649 285412 306242 312028 243825
10611 243825 214409 336571 351561 285391 169423 58527 3887 -56463 28371 -27761 -53223
10600 -53223 68340 163928 246943 387960 421580 329141 340667 267362 134286 81107 165828
10589 165828 117546 46113 100704 173260 132835 73344 278775 189709 1602 -23388 157838
10578 157838 203699 213893 190530 90619 146258 137261 231564 287271 310873 268159 139050
10567 139050 128089 251592 309888 215553 103884 103096 120273 99371 135675 217267 327978
10556 327978 353696 354466 335541 348564 301222 164490 78434 140296 83552 19685 -3880 110302
10544 110302 223057 230723 276759 332096 344129 321767 290073 331204 346692 317858 331490
10533 331490 452852 361783 199722 243693 264500 221044 117768 78719 160437 120569 140740
10522 140740 108699 44987 -10911 -106673 -231367 -190949 -131611 22505 75911 137947 299675
10511 299675 237792 110027 47634 143684 231152 170428 190445 290797 319012 260985 331779
10500 331779 363259 299447 283070 225417 211619 234957 199481 256009 289478 423270 476241
10489 476241 420186 384227 349179 221711 165151 227171 148855 184607 270365 339589 252026
10478 252026 205905 317692 357465 371437 332861 364334 313796 295024 311932 368177 316283
10467 316283 357871 371545 388850 410740 366765 494133 351858 319029 204413 179777 223575
10456 223575 256253 235304 352722 401300 339509 335371 186883 192180 215037 307733 145436
10445 145436 72123 92930 68057 136859 308830 375627 479112 469006 512416 662201 822643
10434 822643 987207 1124407 1401922 1821603 2220709 2439980 2745433 2995448 2910932 2585448
10424 2585448 2392191 2296225 1901474 1404683 1115199 918695 739586 590034 576839 502517
10414 502517 485355 476609 426877 449422 475494 439111 456398 370916 282296 295134 363291 524316
10402 524316 540067 473661 423166 474156 449695 433031 418682 399406 302298 276213 320519
10391 320519 256275 261736 390916 549942 522875 346342 320036 407590 430889 351018 363397
10380 363397 348588 374755 262818 224136 415043 543739 610465 424416 405888 428051 328445
10369 328445 231403 67700 150553 183729 133105 127794 164331 195695 281298 363257 301248
10358 301248 415252 499610 384207 457619 503275 527738 500718 361317 292847 290596 276714
10347 276714 290673 332419 316806 240175 105266 108371 169270 352657 242848 190575 392747
10336 392747 424532 446678 299759 411388 520318 504137 503335 496212 460445 402098 214268
10325 214268 90326 2728 -46693 -21289 69747 249577 343779 236736 284298 428102 494341
10314 494341 479503 312062 237114 233080 249190 246367 256713 337836 520719 299154 215754
10303 215754 296301 313820 331159 433745 369079 287446 370268 415180 342779 344938 338952 404499
10291 404499 486838 544796 744004 771751 856904 814501 743794 772078 676529 616431 521120
10280 521120 415868 380227 474500 517953 512180 524640 449192 365212 398647 413952 401765
10269 401765 395802 440217 452633 403026 459234 534405 560753 493927 509597 532005 461214 454011
10257 454011 495096 504184 490369 418896 458240 447192 506472 490837 413387 305997 424702
10246 424702 525787 379132 424575 455562 376826 326231 394686 506161 434629 400259 341617
10235 341617 229656 320015 450592 453530 404173 526731 592412 546396 536339 396806 373506
10224 373506 366403 350168 242885 342070 448102 409615 534005 567745 581234 577806 743433
10213 743433 795852 793088 804027 728268 708266 731185 772373 810887 614707 550137 549430 645806
10201 645806 669789 712737 746816 793512 688799 481829 473264 547529 585982 512798 478066
10190 478066 498847 484871 579539 672494 677695 558519 552937 725326 782426 718885 663900
10179 663900 611482 646475 767184 951470 1026611 1036188 1055179 1005159 938766 1013181 1099586
10168 1099586 1204213 1256955 1277341 1349860 1416511 1556507 1670880 1897879 2225255 2716310
10158 2716310 3095712 3364680 3671759 3817760 3725351 3679238 3494868 3312249 3081885 2812477
10148 2812477 2547206 2356980 2132906 1907782 1820365 1812199 1722005 1780694 1888002 1890974 1949216
10137 1949216 2036110 2058246 1998440 1904895 1939074 1849693 1769473 1783340 1824071 1849995 1956683
10126 1956683 1880771 1719223 1693301 1683036 1807953 1871272 1861839 1952927 2066319 2184265 2347118
10115 2347118 2328075 2313322 2242196 2117957 2065650 2150507 2135133 2169768 2068187 2026457 2032642
10104 2032642 2164633 2140294 2153183 2288351 2492699 2966630 3468718 3994480 4359717 4770514
10094 4770514 5111850 5224072 5037555 4656196 4142780 3794863 3640008 3463172 3283758
10085 3283758 3163273 3175239 3286190 3255157 3314035 3372981 3305848 3343107 3410825 3492460 3647150
10074 3647150 3562568 3483015 3552811 3742600 3936996 4059332 4107926 4224528 4463296 4520735
10064 4520735 4701934 5029187 5343119 5603549 5926876 6402571 6909237 7445302 8301004
10055 8301004 9149210 10061018 11048464 12018223 13232712 14829157 16580632 18518257 20612409
10046 20612409 22940748 25290349 27674932 30549480 34281683 38976820 45309667 54601288
10038 54601288 69228914 91898731 127185512 179624644 248591279 324324736 380633676
10031 380633676 423611981 477684133 518019028 503026309 452422621 410202661 372705678
10024 372705678 309630674 239271494 186321382 151092086 128097746 112233366 100645484
10017 100645484 92085929 85415787 79822409 75124800 71151208 67472280 64066454 60918750
10009 60918750 57700106 54614457 51647768 49063150 46670856 44499296 42554881 40800084
10001 40800084 39312402 38170767 37081106 36059755 35106985 34138559 33129324 32208123
9993 32208123 31428605 30446590 29361015 28423328 27658167 26882760 26096138 25251091 24524646
9984 24524646 23898900 23156738 22451836 21820818 21139550 20593884 20030607 19442819 19038533
9975 19038533 18529320 18009245 17568809 17174720 16971415 16632453 16292504 15939523 15542597
9966 15542597 15258052 14963737 14611088 14325171 13977178 13655743 13412304 13251099 13022061
9957 13022061 12929733 12811279 12498085 12066608 11823707 11541224 11207310 11037322 10819195 10755250
9947 10755250 10564974 10296042 9921046 9636612 9560973 9467386 9376020 9174455 8934515 8675669
9937 8675669 8426132 8342214 8260578 8051421 7736429 7637563 7447544 7210361 7031687 6962117
9927 6962117 6850831 6734034 6669532 6526938 6433004 6407713 6382573 6158100 5987543 6020522
9917 6020522 5986034 5991142 6016630 6049832 5995638 5906834 5808034 5855860 6038700 6102390 6136196
9906 6136196 6331087 6503888 6579306 6475338 6411453 6370449 6253831 6152395 5865979 5579853
9896 5579853 5402494 5042888 4848432 4819031 4742514 4581665 4603975 4769204 5014610 5194617
9886 5194617 5320162 5236453 4907417 4579856 4482763 4347559 4242171 4099804 4008370 3910359
9876 3910359 3725677 3583621 3459222 3284807 3147769 3154988 3179457 3146862 3162577 3240063 3135314
9865 3135314 2855398 2773497 2797348 2866132 2779372 2644620 2637416 2578568 2491547 2657969 2839314
9854 2839314 2878889 2838863 2731757 2558649 2367654 2190255 2201524 2248338 2225372 2123094
9844 2123094 2103838 2107957 1976499 1792479 1767978 1735979 1717684 1713056 1642610 1709333 1639356
9833 1639356 1667447 1652787 1720826 1704641 1619334 1640389 1722597 1632884 1501390 1554854 1542366
9822 1542366 1501873 1409809 1195300 1244346 1202376 1274764 1290771 1281756 1238171 1319252 1290160
9811 1290160 1228544 1247147 1227642 1155194 1017715 926548 913658 907558 889049 892600 960548 917917
9799 917917 925183 897435 988356 1093104 1153989 1182705 1047446 715613 554776 578813 531292
9788 531292 535480 552442 721433 868407 858394 727120 777564 788066 623261 598453 603475
9777 603475 607786 609420 610936 619289 642174 612600 653737 748944 676974 643100 564602 483839
9765 483839 439026 492086 660778 672849 588948 568171 539418 485075 537691 542132 303897
9754 303897 218952 294939 344589 471707 583952 511555 475867 348663 339767 379428 401504
9743 401504 391694 437706 460113 342944 343784 380430 446329 440627 428210 299245 225235 227156
9731 227156 304880 320426 202823 297066 326469 281729 315611 230124 295783 403502 323280
9720 323280 345993 354832 432259 390255 290083 347092 404895 256011 262386 260347 418659 473286
9708 473286 484491 412579 341199 238283 230185 372584 454650 455490 423934 323601 346901 333237
9696 333237 356682 325975 308275 233481 233326 315870 239820 214298 223283 132907 11159 85102
9684 85102 235131 211351 204700 150183 168663 113458 97365 133505 134367 90530 -9068 -133578
9672 -133578 22635 148737 173618 147679 161677 132217 149790 88482 90311 115878 112157 191004
9660 191004 248952 292175 336290 205696 177378 213866 97359 10855 129814 205732 296441
9649 296441 266696 290961 366985 363928 364143 390507 434342 282950 302582 364425 324346 323117
9637 323117 271759 320896 392723 435871 558310 807236 1227966 1586630 1823167 2019660
9627 2019660 2320237 2663252 2761504 2511905 2322361 2235987 1972692 1494303 1064999 875761
9617 875761 829343 766582 643314 581154 556762 588386 528256 461836 330351 241347 143561
9606 143561 180871 255935 245717 197201 209884 270407 349902 316713 361687 345242 382787 434899
9594 434899 453614 471319 394596 224607 137592 290407 216413 104300 117417 169904 112538
9583 112538 74980 -40053 -155551 -62907 129868 189090 300371 350318 368728 276482 86222
9572 86222 39388 138298 24759 63664 136829 215420 213871 152030 203946 303305 245137 115401
9560 115401 151105 243544 371585 345318 388605 302357 197305 185686 255441 228409 79587
9549 79587 48802 183888 307165 286708 186623 132623 295111 381062 256702 206428 225397
9538 225397 238405 241236 165968 103958 237329 338222 362749 304036 146234 90153 207293
9527 207293 190006 131852 177265 286997 352770 367553 340680 302684 266654 217973 260856
9516 260856 257241 213301 155965 187455 226774 235412 249557 304758 306047 224528 192156 165769
9504 165769 234040 247482 169078 206670 185884 138178 73205 78141 176709 109863 150005 187548
9492 187548 248897 304622 246859 1561 -121820 -166044 -59550 10625 -30876 4051 27543
9481 27543 79161 130318 220332 210749 117703 85266 67992 125766 235979 285472 211991 77583
9469 77583 20562 -35045 91010 124740 142744 252220 259999 148907 174401 172956 139961 65477
9457 65477 3805 -60328 5789 87383 180664 193914 46499 77464 101553 213348 184978
9446 184978 173265 174849 170152 161239 135807 166123 178683 130210 119682 133735 192465 134998
9434 134998 42495 156679 228978 228333 262037 224217 199640 131887 125914 116423 53459 47632
9422 47632 7758 -74137 -93781 -39764 -21357 62271 78630 92723 73284 124266 288507 287521
9410 287521 168789 226939 274959 161363 175662 233947 183096 76582 128862 218707 223677
9399 223677 213077 274823 258851 192594 68367 15809 216781 182253 201341 278215 249601
9388 249601 96150 147918 248495 241870 193233 197758 173619 164280 85117 -8465 -65653 -101427
9376 -101427 -116352 -94713 -2382 160320 184806 102272 127581 107411 282965 368295 254451
9365 254451 105786 43048 20529 28644 88451 121653 147079 201732 174282 222203 230176 212627
9353 212627 161382 174332 115730 93323 210370 294234 235806 143739 155753 223721 275355
9342 275355 368713 275610 179190 187505 340310 343286 365298 365308 288852 206235 141405 116319
9330 116319 160591 88023 59259 201205 349488 389557 212279 146583 219795 261524 241827
9319 241827 236131 239754 208400 199758 279915 294385 312237 293887 287400 258857 230715 297967
9307 297967 337493 252473 310279 387742 367173 225487 144686 128932 229989 417739 577254
9296 577254 498947 443878 411376 292112 170270 125429 239784 277044 300619 276419 234354
9285 234354 223362 269948 283802 350255 423154 361652 301362 377214 459726 406600 421422 400895
9273 400895 403435 250214 157636 245527 388180 338353 256997 290714 365176 505995 530932
9262 530932 460401 412998 333267 393870 374570 269284 272442 220396 204411 226533 306389 313736
9250 313736 254370 183210 262349 387666 344264 342573 328609 391444 438080 392598 364092 217618
9238 217618 42690 172685 161569 201745 227859 277672 359112 234674 232596 293527 394760
9227 394760 434293 435522 398125 284985 266286 237326 295020 321031 347843 335458 338274 397399
9215 397399 435044 446014 403058 373679 315292 228185 235141 240242 371620 352253 324269 284099
9203 284099 376781 460531 400809 322346 240036 217028 322484 356731 314189 413490 435428
9192 435428 494337 443919 457677 540616 469068 431967 378625 444425 428239 372949 393440 494851
9180 494851 556072 473366 435980 364379 245033 204787 229379 341309 383543 419839 496251
9169 496251 404646 391298 464381 433851 523770 522006 444986 385887 443118 411055 339746 325980
9157 325980 322332 454718 408387 340721 355720 428088 517904 475532 400511 352835 342566 317790
9145 317790 303890 411633 471212 554664 589242 513420 404572 247736 314454 357828 353531
9134 353531 286338 361371 447291 341170 364284 431606 410196 369540 386292 337728 224292
9123 224292 173780 262782 328524 357507 391523 319958 395046 382778 348628 292597 332418 478059
9111 478059 449584 307056 191345 65522 168786 316438 323230 235612 196319 284993 350365
9100 350365 373485 417466 428951 387326 191676 108069 121822 106877 116830 194498 199902 425665
9088 425665 473246 377656 263225 209136 231018 271266 302619 337249 382128 327836 358519
9077 358519 601289 504235 263796 192279 373966 460101 476411 465143 507872 578599 476287
9066 476287 431598 198505 170993 273062 362137 330128 276914 170782 118401 181989 250210
9055 250210 389522 441018 472973 562066 466066 547230 538747 477959 395867 454937 542871 507112
9043 507112 375717 256748 164199 226320 252463 350714 491473 384609 248914 172612 234565
9032 234565 351061 247390 229709 371092 288317 297325 360782 350600 412169 487413 511740
9021 511740 482016 465226 362045 387421 282836 153290 129967 217187 332471 350150 389381
9010 389381 390555 442000 519110 454200 342523 268083 308622 473629 425289 325820 347490
8999 347490 373580 320873 247740 94471 116091 99460 78853 198583 224439 236586 251700
8988 251700 350040 423077 447365 379793 259400 273640 236947 196589 311189 329517 302222
8977 302222 207686 86684 106439 246437 204360 195745 356371 394922 304653 261003 252879
8966 252879 320352 339089 292233 380043 282230 216547 373062 438663 309556 219922 180056
8955 180056 203457 135709 131576 63178 153589 258803 163132 254566 343721 177337 65814
8944 65814 102571 130242 138725 139420 190585 248758 220901 127006 44937 23859 1437 42518
8932 42518 212802 302051 293884 319505 395733 334379 293590 247526 272104 177673 35418 -13329
8920 -13329 27095 49058 116330 60784 41280 101658 248931 262832 325400 439989 277059
8909 277059 291885 375437 365054 254831 272127 207816 126936 206702 243956 227194 155900
8898 155900 86959 98270 161758 265691 256714 226983 152524 80696 52094 -26414 15998 149749
8886 149749 82363 6752 80390 260865 348295 307830 235372 208617 290514 229689 176703
8875 176703 156211 227666 297975 215019 268652 337277 280323 255858 320724 254764 213950 290134
8863 290134 337959 203597 135081 203090 245542 152161 164215 160381 201061 189369 -22936
8852 -22936 -54380 32779 28225 -38587 78331 232935 266936 135037 5391 46140 78229
8841 78229 41391 -28468 -68699 -39174 38566 30934 95873 95003 88754 44454 86182 -35983
8829 -35983 -124103 -123384 40434 67039 118065 93102 -10018 -57443 -81684 -11726 -23802 17932
8817 17932 78679 -9073 10040 56980 125598 235123 326701 175228 78954 137047 65793
8806 65793 -12624 88092 100464 -57224 -30076 133166 198026 161368 158806 193745 182603
8795 182603 203038 226852 241452 191073 59708 47566 108808 49281 34839 56049 57813 115282
8783 115282 62533 -394 36187 74736 120634 79812 106197 160076 202178 208231 181542 122555
8771 122555 234536 152791 75344 138816 230389 262575 216620 141714 90374 75563 101884
8760 101884 188088 111960 -4110 27174 95825 156133 72266 -2776 30033 39207 -24574 -82343
8748 -82343 -104646 125524 254322 134192 -35349 -107457 18095 32666 119351 304091 224749
8737 224749 138269 81744 3298 -28050 -20632 82489 110800 -73555 -188835 7593 73594
8726 73594 27644 15102 -11642 3801 -5377 -63511 -31651 -25989 -20027 -25161 21076 51507 -7235
8713 -7235 -64888 -38671 -67790 -88888 9708 -101461 -163841 -158327 -120583 -142774 -56836 -22000
8701 -22000 16240 -58194 -22986 45698 90659 107670 127562 101411 152378 204738 139429 167009
8689 167009 250019 306999 269037 48693 -6120 65264 151547 100139 -25124 77437 81786
8678 81786 15481 61603 33109 57178 49535 94196 138931 179222 199678 273211 290568 276062
8666 276062 276584 169057 5381 41614 68091 101049 50584 126818 187036 127511 166756 113624
8654 113624 215438 267248 255709 267069 128722 112642 143414 150433 134942 152709 151834 187923
8642 187923 26008 3957 63777 58039 53570 -5200 61824 106017 113789 312384 306823 161290
8630 161290 107825 183642 249851 335984 425497 463073 552180 603091 435418 151800 139361
8619 139361 238256 275349 136361 84087 55524 180141 288492 225465 221431 328093 354375
8608 354375 407636 479575 479913 531278 497812 396896 366038 265296 198188 266246 302086 317453
8596 317453 233339 146524 179089 197574 137838 2181 -15554 -35407 40148 194044 280034
8585 280034 325722 202677 226139 229038 232021 368767 334758 298084 238136 147350 178695 194542
8573 194542 155889 129063 69762 152981 213441 92031 41744 220832 322170 253859 339018
8562 339018 419553 411277 336510 179593 28134 72955 206819 254313 200141 -589 -10452
8551 -10452 108769 223768 106178 31897 109259 58098 -43972 37965 142080 118515 166010
8540 166010 146748 204960 121880 170839 160080 64214 -24141 -5135 62362 -7516 5921 94137
8528 94137 85137 52426 -32639 -49236 -48485 -34146 8423 28406 83336 52205 -58548 -105614
8516 -105614 -134789 -166377 -156813 -125197 -140905 -239072 -284237 -205084 -145075 -79420 -70232 16120
8504 16120 185023 233814 197088 128642 112621 157595 104570 84895 117940 78568 52972 6117
8492 6117 61706 195242 147583 3330 -11651 -79258 -200272 -135617 -130478 -20924 102724
8481 102724 38551 106017 223093 206827 130614 95645 80260 110240 56450 -41823 -27283
8470 -27283 50253 64353 69300 64532 65455 4513 -12892 52925 82276 137312 100316 193527 226839
8457 226839 85827 24783 -31638 -32244 -55048 -158633 -185492 -156624 -70731 25170 -18991 -63296
8445 -63296 -109035 -56968 -40215 27459 -36478 -96181 -8198 63826 20189 -87862 -19499 48281
8433 48281 73112 -2376 11724 65738 -1174 -35818 -40063 -61712 -54094 -98836 -25358 -146808
8421 -146808 -95209 -623 46378 164072 177596 177099 118547 90839 -52376 -205440 -181803
8410 -181803 -12313 49970 -8427 71119 84158 88548 -32691 -50163 108854 284010 115188
8399 115188 -9276 52340 51159 147257 94514 123694 141414 104504 -11559 -42204 -48692 -57997
8387 -57997 -12889 27484 113324 77300 179297 58644 -7491 72586 149975 99575 -14380
8376 -14380 -72753 -169650 -266945 -210560 -242933 -194922 -77141 -21606 17042 -73942 -120987 -55688
8364 -55688 -21302 -6090 -33373 -150774 -148115 -46481 -42908 -87465 -6476 32018 -126987 -236426
8352 -236426 -156518 -110062 -51431 -93059 3999 43095 -6920 -38959 -32533 -125205 -166510 -256636
8340 -256636 -238780 -42912 9858 -164425 -215459 -87599 54809 87654 -471 38563 54856
8329 54856 36794 23069 -3190 -12760 -15935 -42070 -76265 4763 2215 -136744 -235559 -206448
8317 -206448 -122364 -90864 -154909 -45344 -100106 -120762 -14368 -34767 -141561 -119943 -43910
8306 -43910 36911 26583 -65466 -152726 -163091 -63605 -24030 -102411 17257 123617 99619
8295 99619 92706 61148 -51250 71390 110491 60183 23344 -26653 -95612 20037 53875
8284 53875 55130 8095 83457 82082 -4200 -174939 -91611 -58781 -67691 -4833 76214 -30120
8272 -30120 -204582 -148370 -72677 3122 -20086 -35817 99571 238430 332112 192394 27260
8261 27260 -99656 -102274 -78447 -65827 -43434 -76292 -83239 -137602 -89646 8900 67933 275
8249 275 -34776 47475 20600 44643 -68412 -64323 3841 -79007 -141091 -219031 -176883 -97067
8237 -97067 -186831 -204154 -142822 -170166 -142410 -118125 -93714 -62670 9917 -92910 -193841
8226 -193841 -159383 -51252 118942 145554 85433 -32148 -53254 -36985 128357 277651 197915
8215 197915 147921 149386 195402 206894 122602 90912 45218 8312 56605 9643 73205 184594
8203 184594 166639 -50304 -94900 38451 -56753 -108598 -94832 -58070 -56083 -118409 -39935
8192 -39935 -31994 -96680 -94833 -121662 -119701 -83212 -54180 -43358 -25757 -18013 -89437 -141917 -148765
8179 -148765 -178673 -69686 -101548 -161554 -131755 -130369 -183782 -136229 -28699 -28357 120709 72828
8167 72828 118423 140336 163496 147217 158631 141170 89134 -51051 14074 -1195 -45818 -63812
8155 -63812 -20173 34038 82711 -38531 -86132 -114604 -64706 -71162 -27590 -28382 -40272 -104062
8143 -104062 -68680 -40859 -20920 33493 142823 156361 136071 127860 -11915 23056 276641
8132 276641 398178 336651 206822 108500 36817 116647 133799 71243 181221 302555 313124
8121 313124 280191 123670 56013 12344 31254 -25747 -13186 25547 165763 205554 242736
8110 242736 171555 73005 68686 163236 143146 97223 122680 75199 69036 50487 -42945 -81302
8098 -81302 -16504 96489 123224 95804 50012 -51807 -79746 -27023 35030 -25766 -69749
8087 -69749 45359 -25174 -67021 4003 -91755 -89264 -96045 -58365 -89751 -31459 -124853 -97214
8075 -97214 -29829 -75960 -270485 -304262 -204913 -194632 -215275 -200881 -140986 -94104 -46715 82866
8063 82866 190382 103887 9829 -94048 -95182 72329 74922 -73623 -11699 6639 15670 -118906
8051 -118906 -165358 2117 23844 -19096 -35057 38238 116166 22831 42617 36149 26172 16617
8039 16617 22380 -49491 -8957 44715 158 1945 21352 10561 -5300 -1477 -111386 -184713
8027 -184713 -171232 -93990 -89573 23917 109060 207558 306826 127017 139888 156304 80334
8016 80334 51275 70791 143681 156008 48964 86593 159878 160626 116333 52598 4304 97842
8004 97842 184080 237514 225474 155412 251222 309161 363339 431505 414053 329143 300534 267574
7992 267574 159728 89639 264102 252658 227080 164579 43347 148467 206521 213962 237351
7981 237351 60513 -28025 57228 88661 62838 -1980 -100454 -35326 71926 4915 106109
7970 106109 270183 311441 344644 358396 301213 276077 226293 206750 81607 36818 105400
7959 105400 172737 173322 228740 276689 322305 157826 109615 201120 203056 215704 242318 237066
7947 237066 242817 82237 -15848 876 55832 -5034 6779 -31705 -138590 -82259 17879
7936 17879 -44854 -23743 91511 173616 47689 21919 28982 94073 -26238 -3177 -21833
7925 -21833 17713 78736 157483 189954 147997 163693 103610 25148 111555 88206 198242 253959
7913 253959 251575 206252 213360 172481 113509 119856 76093 88095 -9422 -68974 103231 141332
7901 141332 94058 6237 -26902 28897 -65466 -156887 -184761 -41351 -31340 -43335 -11230
7890 -11230 -76292 -48997 82599 62933 -12758 -130666 -131544 -49861 104885 119034 57051 95921
7878 95921 123193 52839 72877 112836 65330 29004 77461 -1307 18863 57168 -32130 -105183
7866 -105183 41044 128703 146921 111687 175326 130468 82180 64075 96230 84200 74116
7855 74116 -76519 -155425 -150390 -106933 43874 -27283 -85326 -15608 -87313 -121081 -133268 -114861
7843 -114861 37612 -1053 -94263 -66689 -97478 -42535 -107965 -150573 -175010 -213981 -206270 -107850
7831 -107850 -139380 -75758 -75575 -139 46486 -36759 -59975 -24732 -20192 8874 -69665 -106765
7819 -106765 -83627 -30563 141395 29314 -57973 -102600 -136311 -26924 -52361 21995 -56407
7808 -56407 -236530 -328050 -189955 -10176 43865 13412 65946 56212 49283 143321 14997
7797 14997 6510 -66160 -156774 -171229 -103168 4665 32508 -171344 -222646 -184963 -211606 -159173
7785 -159173 -177685 -228166 -210966 -181240 -80724 -95956 -96429 -163400 -172789 -171102 -187861 -91111
7773 -91111 77510 51274 76602 112380 11561 14030 28413 51353 -2755 -35805 -1449 -68381
7761 -68381 -92291 -17205 -3606 -66828 -98778 -108708 -162289 -236197 -187502 -11593 9701 79688
7749 79688 10415 -100469 -55084 -53153 -95372 -138259 -31720 -55446 -102051 -185496 -229167 -244833
7737 -244833 -299884 -273844 -221012 -136735 -257529 -271783 -169378 -44456 -30800 -92931 -146029
7726 -146029 -181079 -159440 -182787 -94080 -15164 -61584 -13363 -50656 -26872 76039 142144
7715 142144 48752 -6176 1713 -66063 -115272 -107022 -91364 -142250 -120486 -226659 -87162 5945
7703 5945 61551 59565 11560 39286 57020 -9609 -138753 -108230 -125142 -73650 30025 -58077
7691 -58077 -154259 -214116 -298990 -374983 -254409 -136621 -156084 -138818 -109270 -76286 -35862
7680 -35862 91825 107862 17645 24454 -31622 -117940 -135532 -3291 19247 -15940 -163379
7669 -163379 -279952 -224312 -123086 -107984 -145027 -94027 -247553 -203706 -80947 -46581 -28058
7658 -28058 -18526 55479 38003 122547 1910 -102147 -188531 -203810 -283804 -224471 -247065 -245209
7646 -245209 -206094 -50571 -496 -138170 -64376 23050 34280 36370 67613 -8843 -131149
7635 -131149 -152462 -175198 -131875 27533 -7232 -56545 42516 168375 116821 -20156 -218419
7624 -218419 -281339 -326511 -381914 -315973 -193432 -57738 -108292 -186033 -158877 -153218 -192160
7613 -192160 -205510 -251807 -229006 -167553 -99697 -16120 81174 71150 -8229 64825 34315 49639
7601 49639 106692 33366 -111508 -127878 -111716 -227996 -163247 -208558 -185495 -221184 -188262
7590 -188262 -25043 -1653 -39309 -103659 -259745 -255528 -208801 -110752 -92763 -200202 -130400
7579 -130400 50232 63211 -95358 2715 40670 65822 63380 -15399 1893 4272 42860 5244
7567 5244 77413 93724 48541 40550 -57684 -188935 -87762 21109 84063 -28894 -71003
7556 -71003 -93125 -124944 -159882 -118610 -36940 -181252 -173304 -104813 -9588 -61136 -37748 106306
7544 106306 87761 36837 10943 -12404 -118956 -228572 -341602 -431036 -321444 -156510 -54824
7533 -54824 -84799 -205821 -250777 -292333 -281181 -67017 -91402 -206139 -327349 -305040 -212273
7522 -212273 -213345 -340496 -247622 -215923 -188144 -197799 -150113 -79983 -50106 -102708 -86116 45587
7510 45587 170440 109982 -107656 -69769 -20251 -3679 -44475 -48408 51734 22272 -149656
7499 -149656 -167221 -136152 -95528 55941 114986 17916 -25143 -16746 7712 -49583 -71000 20027
7487 20027 136180 118778 107835 106918 9777 -87586 18077 63340 49837 -44870 -107406 -141425
7475 -141425 -87625 -59439 -10271 69704 -15847 -87601 -3785 -5105 2492 -59532 -16159 47931
7463 47931 -27253 -136189 -208319 -165194 -33667 75093 -41058 -71807 -147163 -31630 72063
7452 72063 36669 -70293 -98182 -140326 -282855 -330255 -189504 -134398 -86835 -6166 -26026
7441 -26026 -129547 -184375 -247189 -309788 -215121 -119937 -45406 -120163 -241631 -171785 -114133
7430 -114133 -112100 -63865 -200933 -225781 -172933 -43312 -22811 -65805 -133778 -135606 -175865 -121440
7418 -121440 -134326 -183640 -106975 23633 60501 -38180 -89931 -167447 -185324 -216276 -156161
7407 -156161 -127142 -122243 -139166 -121452 -109584 -124831 -173301 -220221 -274213 -204390 -84996 -116123
7395 -116123 -182421 -149815 -245575 -337414 -151630 -45174 -18884 37640 62720 91725 68477
7384 68477 7406 15471 106812 126135 50848 21764 100526 117901 101021 18815 9313 -113252
7372 -113252 -124896 -4461 72617 -9170 109764 145178 50735 -29433 -914 -75070 -83905
7361 -83905 -66202 -141164 -96954 12780 -32785 -73145 -222381 -117543 -38107 -107166 -102602
7350 -102602 -139624 -177410 28779 152105 123715 164156 101028 -39948 -185675 -49250 -12283
7339 -12283 -6088 -17013 -47074 -124243 38045 140309 146573 75177 94658 114733 132144 218964
7327 218964 200936 169129 42214 175060 235149 129471 32310 16057 51499 29097 4997
7316 4997 84848 47556 -84482 -123911 -220812 -316921 -281907 -140739 -145360 -79825 -25073 -96459
7304 -96459 -80171 -129931 -204453 -133830 -115905 -107913 -127278 -168687 -161196 -104512 -123397 -109074
7292 -109074 16072 63008 95250 81488 48111 114406 145600 190137 -4164 -147222 -270277
7281 -270277 -293738 -150865 -106632 -193386 -195188 -291275 -378081 -286771 -166302 -158156 -128190 -57165
7269 -57165 -36571 -58852 -51512 -8649 71925 139685 -7392 -213752 -332381 -293642 -181073
7258 -181073 -164818 -165867 -68976 11230 -27193 14133 158652 196506 145606 197199 110883 34238
7246 34238 -85142 -119629 -62292 -27673 -84275 -121026 -85530 -92259 -51005 -8959 -57490 -129965
7234 -129965 -117455 -15491 121212 190593 175588 70217 72439 166594 140272 -21270 -200535
7223 -200535 -201924 -168542 -125091 -87932 -128311 -199249 -233549 -138026 -123006 -239085 -240031 26399
7211 26399 82077 81008 86403 174700 204094 117351 57337 61843 180329 79769 -180093 -146928
7199 -146928 -98118 -108683 -94923 3613 -31459 -27106 10100 -82213 -137185 -45727 -82809 -127693
7187 -127693 -146701 -123910 -106724 -112998 -25218 13673 -12882 -107704 -138596 -64037 -40280 33877
7175 33877 239368 349672 375063 301166 185123 199182 238056 207356 160131 -29016 -65330
7164 -65330 75281 28364 30855 -46028 -58895 -115765 -622 84374 38437 -26301 -61485 -158880
7152 -158880 -140077 -124592 -157727 -162118 -76623 -35540 23841 -23264 -91062 -109506 -145461 -83523
7140 -83523 -124144 -85857 -34337 -95442 -134441 -29382 9607 -151495 -278479 -179101 -189664
7129 -189664 -180832 -179974 -239814 -225397 -31591 -15832 -120874 -288578 -318476 -332840 -236965 -88013
7117 -88013 -118648 -36628 46766 13768 -23534 -44955 -89288 -55409 -69581 -210565 -177000 -125518
7105 -125518 -99106 37714 -102597 -193930 -114430 -195 -113504 -129071 -103559 -79518 -120361
7094 -120361 -193676 -408452 -482263 -395640 -247500 -119020 20422 107580 28776 -56142 -6622
7083 -6622 63458 52193 -26391 -12310 -63926 -77090 34316 36046 -33925 -111577 -157016 -179709
7071 -179709 -73866 -32477 -82311 -21747 26215 -40084 -56062 -11812 -22062 -102972 -177581
7060 -177581 -156305 -33157 -36203 -65331 22753 44881 -68750 -84827 67283 76948 -14438
7049 -14438 -18445 -25516 77739 124749 158634 196251 206624 32557 14103 76979 -31897 -164030
7037 -164030 -291448 -290207 -267448 -103016 -11453 37828 2329 -72227 -38423 -94302 -134488
7026 -134488 -134743 -92368 -20390 -110422 -70199 -31087 -175669 -120329 -21583 -18407 -138853 -185934
7014 -185934 -27248 66444 46329 -77008 -82489 -156715 -233509 -239085 -184072 -83520 -132685
7003 -132685 -113501 -213042 -177881 -9258 55665 3197 2676 46403 -5282 -76007 -186438 -237730
6991 -237730 -108559 -17712 -20333 108165 119188 -32425 -44714 -83152 -30873 -80042 -140162
6980 -140162 -43920 -144489 -79817 15426 -24906 -46318 -23000 66685 75465 83978 -88458 -188478
6968 -188478 -198770 -164122 -80223 49940 66702 -18485 -63970 -38433 118865 212798 96955
6957 96955 6507 -40077 -60544 -127296 -202587 -260915 -265545 -89634 -13074 -175263 -213728 -185869
6945 -185869 -155154 -222526 -194748 -89760 25941 85834 90493 -72973 -222776 -252520 -287605
6934 -287605 -303055 -211783 -207644 -223476 -213828 -69337 104148 45998 -48697 -58090 -82683 -82809
6922 -82809 -89491 -163166 -160084 -114282 -124175 -108005 -35593 46362 -12087 -8489 140205 94822
6910 94822 127487 80156 -48244 -188605 -224857 -213831 -147499 -92327 -173706 -187106 -202924
6899 -202924 -179119 -164358 -218346 -228740 -179348 -162569 -137374 -70643 10010 87622 2998 98296
6887 98296 108051 133242 124811 147734 196534 189727 146145 39982 -13979 -14427 -28947 -118210 -170154
6874 -170154 -232735 -248647 -160929 -148780 -141832 -53736 14123 -7577 -119001 -233266 -207274
6863 -207274 -68476 152025 180912 53840 -22935 -40249 -66663 -164428 -184948 -83415 -36636
6852 -36636 -102795 -95566 -79971 -60297 67024 17231 62268 172971 140558 188300 95085 -41659
6840 -41659 46220 102074 -15465 -144841 -214411 -158042 -55817 -60744 -37383 -179607 -198023
6829 -198023 -92091 -57531 -133513 -35214 -27173 -73298 -103967 -35560 16253 -117081 -172015
6818 -172015 -95329 -47887 -85536 -57357 -76158 -161823 -154836 -80215 12706 56797 38351 12796
6806 12796 -152111 -199964 -193843 -157971 -127599 -123965 -109080 -121188 -102961 -65328 -8901 -42647
6794 -42647 -106977 -40762 15084 -118497 -75127 4347 40642 50941 115316 140964 57335 297
6782 297 -7904 3071 -27039 -11934 -56137 -54149 -3480 29495 72356 9586 -50420 -56748 -117122
6769 -117122 -213552 -131991 -50260 -69966 -90618 -175549 -68834 -55771 -91730 -159492 -152866 -162286
6757 -162286 -209534 -172477 -109703 -61222 -82434 -90669 -104741 -209214 -208671 -136279 -60055 -101876
6745 -101876 -36378 -100317 -193367 -185172 -264157 -256366 -229769 -233328 -96215 7455 -17670 -7484
6733 -7484 -69146 -122911 4102 179240 166245 63906 -27279 6469 14646 -46074 -127883 -170386
6721 -170386 -205210 -211646 -211569 -173130 -163024 -8073 -29374 -94436 -72991 -114722 -52045 7763
6709 7763 7091 -6635 -13442 -155380 -185747 -180812 -103391 -82003 3102 24526 27669 -19624 2579
6696 2579 75893 49522 80048 -27665 -144342 -64398 12315 2324 15102 -79324 38103 21485
6684 21485 -59387 -211221 -253725 -87243 -22140 -113734 -79830 -34630 59216 282863 248472
6673 248472 101440 84696 68530 -26659 18094 65159 30191 16533 3526 -60961 -4691
6662 -4691 -50565 28291 25735 -5985 -38774 -62973 -190253 -237440 -122972 -224296 -177801 -235916
6650 -235916 -227618 -133790 -41412 -42531 35431 120043 141317 178677 182011 92252 95996 72102
6638 72102 -32988 -44716 -37226 -136565 -137486 -120969 -118133 20713 22223 28091 -59908 -179947
6626 -179947 -259579 -289604 -245123 -60433 -77075 -177955 -197560 -222364 -339249 -378732 -313216
6615 -313216 -203067 -70214 1591 5362 49955 -55045 -139976 -76390 -19018 -6685 -39891
6604 -39891 -108266 -160445 -172103 -240223 -212780 -154129 -154168 -97860 58727 8517 -31306 -49769
6592 -49769 -129564 -160240 -109901 -117735 -123949 -93946 -46413 -44098 -112569 -119212 -101425 -186782 -125392
6579 -125392 -57671 -19718 -14049 -37122 22941 -45517 -85638 -146646 -150533 -114100 -55929 35336
6567 35336 64929 -78171 -123542 -215572 -201231 -118871 -166157 -61225 -19232 -63520 -41664
6556 -41664 -26161 -68059 -27202 71531 85039 57700 113105 83526 -19291 -100569 -53505 -60593
6544 -60593 54725 211379 140582 18483 -42460 -65026 -80907 2619 -62030 52558 111007
6533 111007 113200 125549 160310 94495 60266 6109 -70936 -97048 -9366 56328 47292 82203
6521 82203 -70309 -140884 -137354 -110233 -150751 -86404 -121290 -183864 -184014 -158873 -52274 37880
6509 37880 -4483 -1081 -40145 -29973 -21587 121949 194523 132599 165149 91680 18810 1623
6497 1623 -8614 -49794 -22985 54838 139221 104029 -84494 -177824 -195809 -117028 -131951 20907
6485 20907 131442 204369 79082 -108063 -127095 1296 -13160 -6382 -52163 -160880 -96997
6474 -96997 12845 8856 -79932 -155954 -70815 -58188 -49880 3931 49475 97672 93904 29543
6462 29543 -115336 -124256 -156489 -51805 98666 174846 82138 -83119 -93664 -193826 -339989
6451 -339989 -325808 -210372 -127055 -2699 -2579 -142726 -97824 -43526 -111563 -79843 -91054
6440 -91054 -123556 -241202 -156446 -110381 -231007 -249785 -142632 -135758 -129123 -111694 -77685 -98938
6428 -98938 -172947 -240003 -155605 -88431 -87393 -36969 -16863 -5643 -52381 42033 -41198 -149715
6416 -149715 -99816 -74855 -153647 -199823 -97456 -169755 -286366 -254452 -248440 -160778 -46181
6405 -46181 -37176 -59029 -41173 -36460 -7778 102135 97835 92241 56122 -22045 -64939 -88301
6393 -88301 -126431 -66657 -27031 -14088 3406 7566 107317 -9203 -40105 47559 42972 -100196
6381 -100196 -50137 60964 87246 27463 -107411 -85714 -219111 -413592 -307032 -109499
6371 -109499 -105644 -112314 -97191 -56520 9348 5924 -33838 61288 85838 42879 -72499 -70871
6359 -70871 -102084 -132010 -158225 -116945 -60233 -56014 -119549 -140976 -127549 -246068 -270561 -286099
6347 -286099 -349928 -299320 -230094 -179574 -102142 -101487 23631 122473 -25991 -140104 -119299
6336 -119299 -77469 10962 -19086 7337 41 -14734 23785 -69260 -104122 -38235 -128029 -193496
6324 -193496 -226843 -209523 -143585 -161336 -303157 -162894 10504 105875 73105 21477 -41092
6313 -41092 -31249 -67467 -72094 -109904 -66908 6 41157 -108600 -202145 -34563 11497 30038
6301 30038 -10360 -122937 -127774 -82049 29206 86884 124028 5182 -144453 -97660 -44143
6290 -44143 -27132 -8221 -27849 -57567 -97548 22891 65001 113409 33677 59989 148935 10078
6278 10078 -37076 43728 76547 23947 -26325 -142068 -76173 -9860 -72143 -158453 -33304
6267 -33304 -42511 -88177 -62234 -57329 -147272 -251643 -50238 118212 96040 16658 1194 50026
6255 50026 -54650 -103751 -174852 -191689 -157082 -131714 -123633 -27329 -4932 -44416 -2580 -25084
6243 -25084 -145959 -88639 -16107 31153 140807 176279 30296 -69106 -58399 19516 72192
6232 72192 19572 75205 -3525 -32706 -46668 -49981 -94767 -29027 -22101 -68500 50713 204685
6220 204685 73138 31965 -23507 -21663 -14499 -36487 -14398 81617 176013 90022 87830 98617
6208 98617 31919 -23038 -29054 15070 40227 96099 143223 215315 115611 26804 1981 -40378
6196 -40378 -241073 -237511 -92955 -85072 -68070 -73716 32167 134363 254871 190941 59798
6185 59798 -23731 -70465 -46818 -1836 -11507 -96637 -9397 51776 -28597 -67869 -78947 4824
6173 4824 78856 23070 -43730 6583 108648 95327 32121 90822 183229 309634 176496
6162 176496 -2082 -43787 -1511 -14865 -20387 -72665 -93726 -190120 -161235 -78519 34821
6151 34821 -9280 -70758 -132646 -92679 -45397 80161 58681 -88103 -195241 -137313 -55668
6140 -55668 39624 64181 31840 122435 149815 249436 283869 176643 37525 25444 69387
6129 69387 -9448 -120821 -187129 -194876 -105962 -48325 -33129 67964 46639 -23170 57993 111387
6117 111387 97905 -79090 -97700 -10785 -95008 -183100 -135003 -83879 -61396 -68279 13224 62828
6105 62828 -24521 -114607 22666 17169 -42829 -144472 -220233 -273498 -274378 -186713 -128174 -122428
6093 -122428 -51760 -65356 -130000 -246331 -239272 -196700 -8938 104311 105617 106918 -157916
6082 -157916 -166503 -58619 41648 -73116 -96095 -40646 -50092 -47690 78430 124623 -79346
6071 -79346 -127810 -21477 25129 12135 -15480 103895 161113 176983 84523 -74292 -222594
6060 -222594 -220489 -215763 -126803 -28343 -171949 -236004 -39599 144291 225888 147596 52797
6049 52797 86135 139090 114910 17729 -81542 -119343 -56777 43864 79996 76149 48439 17327
6037 17327 -1881 12802 15681 38074 -136777 -215502 -182382 -123472 -145346 -100461 -35374 25608
6025 25608 115311 181537 22237 -55071 -157751 -254831 -98476 -59784 78353 138574 138498 159210
6013 159210 127446 34002 87782 6302 -24862 56666 -52285 -141498 -98995 -17693 -47799
6002 -47799 3820 131008 136823 -14210 -123137 -48104 -1609 21501 13456 -62638 -241301
5991 -241301 -197511 -154747 -87518 13596 29374 -7457 -101150 -156089 -121389 -159594 -173586
5980 -173586 -171749 -210195 -161540 -22689 -103182 -250954 -348449 -324144 -261458 -234245 -92686
5969 -92686 -113699 -160061 -97854 17264 -45243 -16907 29133 -61297 -109202 -66687 -4277 -47618
5957 -47618 -101115 -47347 1073 -62772 -76364 -150378 -251880 -158384 -27022 76604 139642
5946 139642 78737 -15069 -103239 -142482 -133669 -157594 -113900 108598 156632 141994 81242 102679
5934 102679 48165 48401 96020 86890 14344 -102820 -234034 -263644 -307824 -334700 -371520 -264133
5922 -264133 -148326 -105083 -74460 -31535 -64971 -68342 12637 -25803 9554 19309 -81506 -115658
5910 -115658 -161068 -149859 -220526 -217066 -99732 -69843 -70969 -87292 -88032 -106300 -89555 -179799
5898 -179799 -65752 18660 20417 -46414 -58803 -49530 -57969 -16901 65861 -12308 -38642 -142224
5886 -142224 -175215 -189315 -131489 33735 229078 271472 161135 41341 -24319 -109528 -148521
5875 -148521 -160717 -181319 -153580 -115603 -23431 33482 -11627 -16839 1063 -1145 -127331 -87255
5863 -87255 23876 58220 20703 -107462 -84544 -51340 -49815 -46050 -41468 -88155 -123031 -84792
5851 -84792 -139798 -94441 -125882 -68310 -134270 -121187 -176928 -257644 -50452 6573 -7330 -118147
5839 -118147 -129467 -32673 80346 90137 -40520 -77042 -81111 -110013 -57322 -59200 -86229 -130561
5827 -130561 -153904 -155370 -31632 -25043 -43773 -103250 -109372 -53919 -55911 25847 4620 19965
5815 19965 16164 -11231 49924 248090 215211 69796 28279 60461 100990 135430 111251 127250
5803 127250 38999 20859 -91134 -71303 -125515 -14396 -19545 -24347 -16286 29469 -124061 -212522
5791 -212522 -225594 -123604 -116351 -176948 -170841 -146019 -163003 -150489 -97523 -144379 -224134 -214075
5779 -214075 -78416 -37485 -31769 25629 -27344 -72819 -82826 -209875 -310089 -389513 -405355
5768 -405355 -249988 -157173 -116941 -97539 -81645 -907 3847 92941 119334 153970 188708 86719
5756 86719 42504 4037 27133 -54387 -140382 -266262 -168839 -101168 -88390 1989 -202444
5745 -202444 -162990 -112106 -42939 10019 -5026 -7872 -97744 -73491 -49385 -53953 -30236 -47301
5733 -47301 -90167 -86534 -51213 -119003 -159972 -118805 13520 -58469 -79533 -79172 -51271 19153
5721 19153 -37571 -28949 -94910 20315 85796 48947 33199 -49569 -206552 -70038 12626
5710 12626 4392 78405 124121 30831 -90589 -160022 -179826 -117796 -17935 55159 -88384 -172678
5698 -172678 -144245 -92264 -34072 -5044 -106578 -138939 -140724 -168688 -192283 -125351 -107975 -76911
5686 -76911 -30932 14230 -28497 -24344 -94628 -164561 -214465 -133782 -29166 75823 54995 75709
5674 75709 42385 -168348 -180494 -75976 -74516 -124099 -200224 -120489 -57986 4410 76895 62068
5662 62068 94809 64454 -122218 -231981 -247834 -133745 3629 -154593 -224653 -154384 -165687
5651 -165687 -218749 -129123 -153815 -240056 -134175 -69616 -109227 -164044 -341326 -289555 -187326
5640 -187326 -148974 -175178 -118689 -161820 -151646 -107823 -89986 -62737 -95110 -47236 -33807 -81784
5628 -81784 -118695 -49632 -62820 -57575 -106177 -25433 41676 17351 62691 66428 60356 170702
5616 170702 146158 192225 100722 -72997 -30323 -79478 -51471 -65713 -83624 13396 107750
5605 107750 156383 69278 -62464 -107487 -111039 -167767 -92005 1097 -30012 -129077 -16865
5594 -16865 159807 145336 43733 37906 -105568 -278531 -170255 -105352 -95158 -91403 -58441
5583 -58441 -94233 -101546 -139744 -107410 -122331 -163738 -82225 -58631 7453 23486 107420 170118
5571 170118 141950 175165 179580 80750 -103819 -147835 -161304 -95803 33736 13702 -40087
5560 -40087 -106423 -177899 -231818 -151963 -2086 -33777 -120546 -190556 -117784 -143244 -124805 -3717
5548 -3717 -36089 -123905 -176409 -92432 21930 69783 -63722 -151791 -125372 46968 145505
5537 145505 144094 195576 132030 53992 96414 116890 16967 -202 12210 36598 32727 85437
5525 85437 29163 -85794 -73318 -1819 9615 -115598 -262012 -228955 -39551 -34405 -28453
5514 -28453 -106728 -97982 -108166 -155613 -143225 -103093 -101757 -134703 -140605 -148414 -124464 -95970 -32319
5501 -32319 -27034 -10582 79150 209698 137920 45745 -24613 65488 144417 169156 40037 -12694
5489 -12694 -22202 -88486 -136090 -147822 -207597 -57385 101852 89432 189801 199894 95235
5478 95235 8983 -6377 -64266 -168914 -166477 -113273 -107635 -97684 -122436 -65936 -4423 1319
5466 1319 -71904 -179612 -145729 -69323 -9592 28983 4880 61387 26243 -132773 -198233 -206088
5454 -206088 -195106 -29249 45941 -18536 -68497 -163160 -85551 29229 -29511 -83046 25173
5443 25173 83933 117145 75673 58470 -132154 -86435 -48899 -117676 85190 173390 256457
5432 256457 259805 167728 -40880 -60852 25500 104127 -40920 -117324 -41477 32326 47284
5421 47284 85695 64664 30604 83395 96271 38242 -61887 -87138 37980 113705 134939
5410 134939 61710 -8950 6221 -77719 -94702 4624 127314 150569 181024 243304 176074
5399 176074 76080 14892 57683 86915 -13390 -106356 -88498 -73018 -25106 23240 139443
5388 139443 13894 -134330 -29737 51489 2332 -65312 -61128 28336 113399 49765 -55440
5377 -55440 -140806 -202513 -201018 -124330 10458 150694 168739 215217 159099 156130 84917 -33368
5365 -33368 -88074 -67885 -24802 45630 67905 24048 16805 38418 120319 36633 -10741 -37999
5353 -37999 -33632 -41599 -113643 22365 -13507 -104249 -243189 -205102 -171806 -25690 80249
5342 80249 34652 -30220 -107003 -45153 96068 159815 119367 -65931 -73896 106451 165798
5331 165798 1192 -147716 -177551 -186606 -139146 -204179 -323782 -224486 -164089 -91651 14731
5320 14731 75639 58061 24684 145262 158471 181813 133010 53352 114585 252382 244850 128301
5308 128301 100400 40048 4222 64584 11226 -44678 -71867 -7148 -37598 -76219 -79015 -72706
5296 -72706 -64865 -84789 -79491 21867 -18572 133263 182736 109825 21615 65624 67875 26808
5284 26808 -193956 -316449 -102599 39180 110248 69756 -11758 -51082 -83587 49862 25287
5273 25287 -70511 -101682 -190122 -190017 -9039 2517 -97623 -191664 -131086 -105428 -108999 24374
5261 24374 3339 -14554 -27839 -182810 -87146 8600 63012 23481 4792 -84304 -255726
5250 -255726 -284797 -261839 -203340 -179121 -60227 -30243 -74628 -86503 -50022 -142171 -145080 -207735
5238 -207735 -193011 -62716 27235 -8843 -130516 -114423 -101761 -193240 -107008 51754 -88565
5227 -88565 -135490 -218913 -194906 -185129 -129222 -177164 -163406 -19 42707 -33967 -154411 -194688
5215 -194688 -100768 -128228 -118183 -66873 -27497 -19868 49749 57939 39609 35290 -1175 32769
5203 32769 150046 192178 207638 33904 -126144 -38576 -23565 -105497 -14453 -39409 -108524
5192 -108524 -8315 13509 37052 50922 76776 80444 93888 36693 -100495 -146382 -100295
5181 -100295 -101801 -23125 35712 22690 -28444 -92969 -194287 -125823 -107588 -21061 -15526 96580
5169 96580 56042 18066 38369 114067 167239 142913 222032 69214 -57506 -8406 -12078 -37281
5157 -37281 6585 -48241 -122919 -143381 -115422 -120570 -129413 -52348 -25377 102564 199127 176345
5145 176345 31586 17404 43780 132669 160648 73861 78865 146883 97696 -22860 50028
5134 50028 45561 -92729 -159954 -160817 -73455 -24323 -2410 -106030 -43379 79837 205639 200936
5122 200936 219986 260666 178496 -82765 -190769 -130996 -124877 -116430 -77552 -7617 -136611
5111 -136611 -175926 -139743 -176085 -99255 47211 1466 -17175 -76656 -57022 -86083 -37008
5100 -37008 -106531 -16261 119291 63180 84192 167979 189308 96540 37022 23372 24271 -63301
5088 -63301 -161658 -167901 -144835 100658 79222 111162 112005 84813 10056 -158296 -221814 -189272
5076 -189272 -21448 151931 98276 111877 181785 152898 128714 203387 188529 111665 100995
5065 100995 32260 11765 6689 -36412 -34439 -19820 -44411 -151841 -132185 -50804 -57187 9298
5053 9298 -107372 -165264 -44699 24799 90025 109635 68296 3940 -43205 -6850 92974 32396
5041 32396 -61477 1412 91711 38763 73484 126602 253889 368170 184360 21107 19047
5030 19047 66760 -18911 -106141 -92518 -40932 57165 143740 137034 76455 11546 -101052 -149260
5018 -149260 -118059 -74702 46734 45103 -95084 -102613 -3373 12802 46165 94475 30355 -2468
5006 -2468 3488 -9862 -64054 -40819 160629 243074 299725 319523 192494 104484 -9719 13062
4994 13062 -43473 -85099 22449 27218 39841 21573 22113 -6021 -54796 -8869 29838 -106453
4982 -106453 -95880 -66434 34473 40285 -101897 -180585 -152074 -169035 -103469 -48076 -112841
4971 -112841 -85922 -6804 56079 55114 -10532 -27881 -25894 16524 108504 131893 28994 78688
4959 78688 -5586 -68965 -77193 -60539 -7677 75311 90575 -2612 -98650 -90641 -34831 -43291
4947 -43291 57507 89325 127724 62235 90982 168601 218043 161808 82829 60122 51455 106408
4935 106408 64247 -58545 18595 37355 41935 69973 114976 103871 92398 65776 9236 26340
4923 26340 -145802 -197043 -191393 -124896 -69697 -6387 -8506 413 -147041 -123984 -101955 -85521
4911 -85521 -26811 -5240 -58800 -15929 15655 102631 232258 125641 72963 34392 30134 -18063
4899 -18063 -94258 -125274 -66755 -105406 -134531 -117144 -104844 -96042 -63374 -93756 -103939 -80636
4887 -80636 -31914 -2276 110736 111733 88526 12988 -22945 4592 -13798 -20104 -40864 -132272
4875 -132272 -125398 -687 194078 233779 153978 195870 249109 177440 116345 59625 -37678
4864 -37678 -22281 27207 34191 -36557 -18538 -75891 -130471 -223239 -234658 -246821 -111966 11505
4852 11505 69175 -19147 -78860 -42630 -26798 -52810 -164835 -92053 68064 59204 -102644
4841 -102644 -213803 -45682 35849 4138 71306 56486 453 -77463 -64913 -97598 -64066
4830 -64066 78261 236045 111225 86536 103012 42181 72088 21780 -40300 -164364 -275486
4819 -275486 -199749 50617 201226 176461 197620 157093 132306 113712 146050 123946 159745
4808 159745 182066 -16359 -52427 25403 22442 -104046 -104970 -91241 -77181 -82935 -44488 -43093
4796 -43093 11588 -61109 -76646 31300 54744 48887 -76290 -119686 -92156 -125269 -155117 -124223
4784 -124223 -253804 -183564 -76151 77833 138359 150871 36298 -38739 -26267 59900 28423
4773 28423 -21838 -11985 -23684 51356 56772 -85079 -162589 -243488 -264667 -208836 -204502 -170201
4761 -170201 -218536 -74468 39224 -14369 -154386 -127090 -34735 114533 196267 209572 65292
4750 65292 -97412 -140193 -52211 23326 -27125 -33301 -87110 -40934 920 -184916 -343790
4739 -343790 -251870 -253701 -227933 -88557 -146115 -144987 -16490 59032 -34521 75444 218777
4728 218777 74624 -43036 -89960 -16565 -9352 55348 145974 127659 -21727 -159561 -104020
4717 -104020 -113972 -186238 -146866 -41370 -92225 -107940 -118225 -96332 9472 -41461 -38325 45356
4705 45356 80193 160455 227472 275105 304290 277806 219291 190316 88742 85167 153892 247955
4693 247955 390106 384339 204413 120267 18829 79322 68231 128844 198544 121611 38398
4682 38398 21339 33717 8890 61656 56543 -23608 -29534 29043 -39508 -164780 -239435 -199846
4670 -199846 -103587 -137110 -165560 -194179 -188474 -144514 9787 225299 163928 65421 132244
4659 132244 10835 -73387 -106309 -228180 -232577 -278192 -300687 -156614 -95836 -94931 -133279 -174467
4647 -174467 -176571 -113539 -218035 -274516 -292737 -125031 -78383 -178092 -268772 -111476 -46608
4636 -46608 -23229 -56639 -23256 -38951 30644 72309 39901 8121 48189 47849 39317 -48467
4624 -48467 -111415 -143346 -195334 -245424 -100912 -205603 -256462 -120550 -111296 -144785 -9678
4613 -9678 7289 -105579 -130682 -10572 134177 77710 39614 61693 24699 -48938 -102551
4602 -102551 2047 76625 26429 117870 188348 32805 -60143 79642 242125 224411 78207
4591 78207 -55770 -108277 -34900 -25813 -62105 -95074 -71002 -49138 -60082 3557 2932 -26690
4579 -26690 -8116 105960 104609 11618 -52219 -11988 27090 -34327 -108584 -39715 -14462 55336
4567 55336 52744 -44079 -142240 -184362 21495 114713 113544 53896 -44186 -44887 -37588 37732 -57459
4554 -57459 -128789 -128068 -4907 46380 -38063 -158 88060 117899 101669 106954 -56097 -106134
4542 -106134 95202 17433 -26319 -59513 -104221 -128892 -233512 -274056 -61467 65009 -352
4531 -352 34503 5233 -56989 -172107 -138928 -106448 -48773 -35478 -38928 -60089 -21288 -26838
4519 -26838 -84412 -169695 -175102 -79457 -12495 -7697 -107803 -55536 29330 91817 139730 129887
4507 129887 -36217 6392 3001 -51099 -1350 60757 -79259 -229710 -230352 -189930 -115540 -57987
4495 -57987 -1012 -44997 -60772 31109 13438 -111780 -109623 -62290 3833 -4569 -9031 -113319
4483 -113319 -155239 -196857 -276536 -251302 -97832 -87461 -180221 -191168 -121214 -3470 30453
4472 30453 16838 -111699 -87939 -111340 -109299 78887 77151 16763 56586 166216 195378 233405
4460 233405 169830 91306 38395 34630 79798 117868 108515 56331 11691 -95733 -73029 23343
4448 23343 68452 13695 -11645 29674 41335 50985 60061 10029 70623 59654 -49412 -123703
4436 -123703 -164009 -157516 -172079 -125962 -37252 34960 58861 32100 -48782 -48966 -7943 -4201
4424 -4201 -2901 3592 -31830 -4332 -11728 -50891 -92483 -9584 52909 39727 278 29435 62179
4411 62179 27952 -492 76726 71567 968 49150 -30611 -111030 -131547 -133630 -174253 -185674
4399 -185674 -147902 -108655 -63332 -10517 151868 285752 303298 264690 7968 -98822 -134175
4388 -134175 -218649 -226032 -129131 -72174 -89680 -93755 -71279 47037 120583 220831 177988 114656
4376 114656 -26731 -4001 -9120 -104002 -20716 -16420 -73509 -34527 -60155 -148081 -225929 -204163
4364 -204163 -109048 29862 -87179 -159922 -138083 -82168 -41057 21285 12292 -24011 -19510 80256
4352 80256 58472 -126375 -109134 28007 -99467 -143193 -121250 -119509 1479 31400 51968
4341 51968 -87482 -146751 -84156 -85588 -94760 -107665 21900 81448 5762 81523 95005 24716
4329 24716 -58309 -97986 -14352 14258 -42140 -83759 -158126 -105299 -56081 -31101 -34365 -21238
4317 -21238 41213 83131 134705 119253 52917 127008 130117 162485 175823 97805 -21247 -192885
4305 -192885 -240839 -133142 -86124 -172427 -265063 -369285 -339422 -199318 -177570 -234267 -120168
4294 -120168 -99203 -44100 -39164 -59073 12213 -2927 34103 51359 137109 141683 69950 9459
4282 9459 20488 -29557 -118240 -238704 -136967 -73267 -127602 -25945 -62340 -142585 -92200
4271 -92200 93702 27387 -3207 44607 14781 59072 -12255 -79477 -20050 -80850 -171099 -193330
4259 -193330 -150939 -58490 -62596 -74572 -87982 -86358 -74619 -174486 -237364 -92636 -502 7627
4247 7627 37380 -128052 -248321 -221669 -188318 -89294 -150508 -157424 -256067 -318052 -184085 -79860
4235 -79860 -59628 -83283 -146567 -208879 -238948 -257055 -169948 -39515 114166 164337 85913
4224 85913 66690 45926 -2552 -6376 58241 79634 46206 50757 1332 -113870 -423942 -444419
4212 -444419 -206822 -86461 -173556 -99693 -38813 -69158 -175638 -200881 -116322 -45324 16415
4201 16415 31804 -66527 -87596 -127400 -121742 -132532 -113499 -33651 104267 184138 83156 -16667
4189 -16667 -86170 -3465 -38970 -31376 98891 32666 2046 32078 -101460 -147548 -216665 -169880
4177 -169880 -51595 -173055 -218268 -177057 -51784 58393 287812 274432 21004 -46342
4167 -46342 -103186 -116740 -5689 117404 93867 -1363 4938 14695 79934 131808 42160 -52348
4155 -52348 55731 41783 -109271 -302547 -257486 -95055 -28494 67757 23374 -99708 -74423
4144 -74423 -101194 -109599 -129858 -83260 -49326 -145716 -150861 -75445 -57024 -1223 217144 237432
4132 237432 241491 114561 174566 228888 137875 103900 79426 84385 29047 -88406 -110675 -224380
4120 -224380 -218988 -76955 23234 105365 83771 54914 83676 93608 101791 95217 111576 164487
4108 164487 134054 50328 13597 146584 237143 19010 -39465 17950 75804 129020 60711
4097 60711 -7088 24312 50160 27534 30460 30440 -49198 -146981 -199378 -191746 -62686 -77930 -49449
4084 -49449 -3990 24018 -15235 -32808 26042 112171 64588 40893 -31066 -205101 -309662
4073 -309662 -243021 -138046 -112646 -45660 -101737 -11501 95846 50762 40152 95468 180042
4062 180042 83900 -90669 -218840 -133232 -23298 -41870 -28608 -37857 14043 57079 -53738
4051 -53738 -100639 -103819 -83691 -60065 5115 7272 -131877 -179217 -176813 -117110 21692 43334
4039 43334 106945 113935 21051 -97000 -678 -25010 6552 25650 -109654 -136320 -142486 -21367
4027 -21367 142819 105268 62516 -41924 -60714 -99705 -206726 -313461 -191826 1695 29276
4016 29276 -33392 -2272 71067 71577 -34586 -181645 -206679 -231441 -232056 -97256 -10955 -3186
4004 -3186 9849 -113574 -189112 -175893 -86659 -56375 -23408 25497 -6223 -53723 60962 196643
3992 196643 94651 -39003 -52821 79867 192413 123950 116738 60158 -34439 -114690 -175519
3981 -175519 -75660 2601 -59767 -93543 -304747 -292218 -109341 -44064 -76439 -75724 54030
3970 54030 85686 85220 122567 124763 -67149 -156299 -65354 -14097 110662 29864 -52738 -11480
3958 -11480 181866 272495 199325 -67717 -99259 -35234 142265 112387 15546 -16136 -77294
3947 -77294 -129198 -9245 49536 202086 102316 -7324 47105 64636 143622 135523 98961
3936 98961 35249 185301 240694 247865 123204 1750 19999 -32489 37527 22590 -89221
3925 -89221 -96616 -160858 -100021 -99714 -25579 6919 -52461 -221448 -182437 -140224 -85525 -72958
3913 -72958 -32688 -761 138849 225370 201863 115540 151208 113422 6714 -71922 -124555
3902 -124555 -102429 28511 112060 36478 -31044 -11205 -31493 -90564 -36227 -102766 -118983
3891 -118983 -108921 -32379 -24319 -107136 -184268 -175962 -15521 -11939 -52679 44085 112605 -13960
3879 -13960 -133370 -44247 120646 91762 -126643 -192776 -91465 -41479 -35128 -4935 30485
3868 30485 65728 42019 58464 83415 150367 107245 44978 86393 204784 208105 19603 -64690
3856 -64690 -69736 44477 15176 68404 42316 -20320 63155 -4463 -9695 142496 119542 445
3844 445 95952 42339 118465 57149 -32300 -68679 -81903 -147781 -65868 31027 167479 85061
3832 85061 35327 83691 85345 64428 91316 146721 114216 85655 98384 94230 103569 151129
3820 151129 145996 39200 -71411 -8027 91628 128510 191325 19469 -79487 -140642 -118517
3809 -118517 -130110 -110062 -102942 -33287 98680 137862 106902 -10493 -73895 -114678 -62255
3798 -62255 -23466 8916 -8537 37374 -9203 -40587 -81119 43756 33528 143114 165362
3787 165362 59008 8173 105009 278427 227309 141339 37144 -60377 7087 132848 165411
3776 165411 62518 1321 -41226 -42436 -71069 -19670 -36407 -77199 -99660 -138852 -204576 -207120
3764 -207120 -165255 -206671 -164377 -167407 -223094 -155153 -65322 65455 138746 121125 127871 29261
3752 29261 27902 148213 126732 78356 9221 38048 147957 193808 80233 28622 24721 -2072
3740 -2072 37058 -27099 -55995 -8619 14607 43635 117167 -16099 -132394 -39635 -42939 -74275
3728 -74275 -70836 -168726 -112625 -36390 121232 189618 42252 105291 167426 54490 12900
3717 12900 15287 85900 81604 -47977 -103049 -22789 38075 -1721 -120880 -186550 -146561 -90686
3705 -90686 -122072 -24902 -30940 28714 -42754 -30443 11117 69858 77727 87895 -6395 -81390
3693 -81390 -100275 -34887 -124048 -242691 -190708 -22497 168887 123634 126731 133375 136373 52935
3681 52935 -32593 -4025 51823 164045 152614 77927 -8763 -6698 37831 25541 -12954 -87727
3669 -87727 -82569 -25235 75264 125355 81976 -29742 -41279 56100 63263 18152 -46923 -60888
3657 -60888 -61381 -164425 -202657 -129837 -9488 -133778 -111304 -29620 39569 44989 4347 -4710
3645 -4710 39447 -39398 -65650 -126433 -139030 -83480 -56375 -68888 -81998 -146573 -290835 -215500
3633 -215500 -151063 -123776 -165584 -146743 -6927 -22520 -120551 -157097 -136336 -97155 -21083
3622 -21083 -79850 -276828 -422177 -283543 -102389 -92196 -95693 -41591 61140 54158 16025
3611 16025 -31406 -104432 -138452 -30125 52327 -35369 -52471 106194 279138 209948 255785
3600 255785 194508 42734 -74771 -103598 -109218 -213301 -179018 -138430 -164503 -187734 -128395
3589 -128395 -164461 -145310 -39756 -72218 -48504 -6341 -91453 -213507 -137832 19936 -36843
3578 -36843 15366 159253 101923 68783 47585 -35454 46612 52148 133676 100166 15488 -53633
3566 -53633 -95166 -177516 -129179 -118534 -81370 -208313 -141388 -77349 -2538 -54133 -80409 -88556
3554 -88556 -101814 -108113 -147070 -109553 72211 52197 66950 117343 94093 -116733 -189156 -61191
3542 -61191 -245958 -226897 -160576 -225730 -208028 -168762 -179155 -121261 -76457 -67053 18279 -81461
3530 -81461 -121559 -98301 -17622 23058 46479 112742 26059 -76216 -177946 -266356 -192556
3519 -192556 -48748 -94246 -228375 -180017 -123299 -99810 -21347 39748 29674 -47405 -92157
3508 -92157 -29127 142066 128133 114646 137141 268398 231675 196909 210170 167248 30194
3497 30194 30793 72105 80738 14555 -93499 -175057 -91781 10978 30460 -62204 -198214 -183610
3485 -183610 -68023 -1726 -64494 -193740 -139607 -20674 139089 172442 97820 8871 74973
3474 74973 71446 51166 19432 61672 2125 -82990 -7490 11554 22873 21038 23371 -12978
3462 -12978 -29727 -83915 -98560 -19558 -124592 -208165 -156850 -33923 55407 36584 -37982
3451 -37982 -104269 -25225 116923 215457 185248 113310 16963 -88825 -74674 92273 152064
3440 152064 177845 125662 36108 54978 -5506 71104 179357 128624 154577 106724 144024
3429 144024 125334 79059 45243 83582 91874 107240 26438 -39363 27818 73192 61402 52111
3417 52111 75095 14150 -64013 -55167 -66007 -39450 -30336 -51185 -45067 -39566 -18664 58355 145866
3404 145866 50578 32056 52210 -59064 -209788 -210973 -153496 -69992 -3258 1819 35402 -56523
3392 -56523 -156966 -87258 -13632 -83278 -103094 -35526 15804 134601 21688 -113959 -128164
3381 -128164 -109811 -64708 -104129 -52882 51062 28736 -130324 -132734 -84321 -21413 -8264
3370 -8264 29157 -47960 -72061 -8943 21875 -11807 -92693 -62938 47114 150150 127093 -40162
3358 -40162 10861 152755 135745 58121 38257 51291 95981 60479 78177 198331 225110
3347 225110 235494 233142 193271 48485 -16125 71105 -74955 -78647 93294 194316 65031
3336 65031 19813 37589 165187 268861 105147 38033 45649 -10843 -6265 -13602 -16090 -12817
3324 -12817 13438 -33561 -58913 -62596 -57178 48306 -16039 -30193 29018 123803 171154 118990
3312 118990 883 -5713 -60044 -21518 43072 165173 261361 298907 317856 231889 132636
3301 132636 199661 307774 245127 191346 163376 199792 175432 129630 94851 73768 -84724
3290 -84724 -123192 -46182 -6565 39318 -13624 -22694 14530 -35985 -36597 3480 4579 -120026
3278 -120026 -167557 -94946 11546 70461 43121 -5018 25344 151582 129912 64547 25495
3267 25495 104078 234473 303994 210335 -1645 -185070 -190821 -86426 -58217 -9049 42520
3256 42520 28281 995 -9524 38459 33917 88290 79255 30487 -7581 -5532 76726 149074
3244 149074 311269 118312 20441 -37309 92561 132269 128737 17077 -112859 -89809 -133288
3233 -133288 -96373 17075 49079 66444 71336 130820 188205 177536 170059 138833 22748 -104063
3221 -104063 -95982 -15864 79718 25395 -30166 -151988 -70750 -86521 -172808 -136423 -75017 -52856
3209 -52856 80668 83162 14803 -109141 -138520 40068 72885 1207 25218 71249 39279
3198 39279 48502 19450 -10046 -159153 -154620 -121597 -112846 -182092 -140862 92519 290381 263690
3186 263690 195346 90668 94902 85984 33013 -21157 -76847 -153310 -108643 -24590 88694 80645
3174 80645 10289 73582 191999 125460 74647 100681 59547 -57889 -155717 -141221 -36776
3163 -36776 44560 29752 -18605 -32237 48799 105943 137576 16668 31371 -22708 -27831 -834
3151 -834 -30538 28659 35163 179528 159470 167403 186860 118996 -24893 -123220 -209209 -252483
3139 -252483 -185913 -101166 -10896 56277 77753 -62806 -64655 98866 55472 -88928 -94773
3128 -94773 -86732 -59648 -76492 -11910 90669 15184 -71545 -72101 -19742 105347 128576 55687
3116 55687 102696 89557 -55994 -75793 -29472 73571 141032 28156 6223 -53723 -54303 -22758
3104 -22758 12848 63690 55674 40915 3796 75200 130719 130771 59110 44888 -34301 -111994 -198721
3091 -198721 -24090 148418 142077 154456 159023 131764 -63475 -64320 -107681 -41030 58851 46545
3079 46545 4125 110991 46877 39905 68149 77790 51015 111028 253450 195527 193116 166753
3067 166753 5542 -142373 -193535 -196103 -107684 -132303 -161542 -138800 -69790 -30497 -109613
3056 -109613 -131478 -23866 25363 1875 -16247 -97453 -205191 -265572 -183764 -56193 63023
3045 63023 216316 377449 393157 243952 130613 44357 -34205 -39389 -21336 -100686 -178459
3034 -178459 -71908 -31985 76918 34698 -27477 -31770 28219 83552 51760 85083 50385
3023 50385 -77880 11588 178816 190155 79489 38282 105775 155338 177860 43192 116065
3012 116065 163158 167135 62883 50881 104703 38494 1466 -150800 -163609 -40910 7565
3001 7565 -3163 11260 124109 85259 -6455 6609 32639 -53526 -119117 -65497 -21627 -146372
2989 -146372 -259272 -248895 -180932 -103961 -61822 -23540 27685 49748 35479 -34535 28959
2978 28959 128595 135338 47111 -11375 -92080 -151771 -99277 -1 48969 98375 112404 117966
2966 117966 106808 146127 64153 -66265 -179692 -205579 -182318 -81290 -58058 -17240 -32598
2955 -32598 12377 147863 237935 259891 160066 157395 199974 252494 197592 64124 5730 -20927
2943 -20927 -179950 -44157 109896 33055 -60596 49839 65085 116612 228956 360852 282307
2932 282307 219688 114184 28396 -24802 -61176 -9733 -37485 38491 88079 96955 93009 46018
2920 46018 14608 80523 26531 62428 85014 -40883 -158779 -153927 -100994 -155596 -232150 -257729
2908 -257729 -168861 -109935 -57636 99649 82538 80998 143765 78009 209847 283776 84442
2897 84442 55426 62402 -22959 -82066 -18776 25430 -106058 -61425 40019 -103750 -185289
2886 -185289 -193715 -150963 -184544 -267247 -221648 -157449 -199244 -228739 -202809 -185579 -281044 -183686
2874 -183686 -35650 75121 57599 53763 25354 81686 147012 202132 291049 132766 -46362
2863 -46362 -21894 176041 225438 173292 202008 249510 262218 130310 13608 -7169 121813
2852 121813 109977 -19979 -143551 -84401 -17805 -45582 -150595 -110030 -10633 48762 -38258
2841 -38258 -90444 -28531 73920 64646 87685 -75839 -92473 -259 157038 168362 166485 148174
2829 148174 149420 172733 124425 89169 81971 70493 179283 184946 173467 131467 115653 246645
2817 246645 196042 103363 4674 -41901 -74876 -72945 52997 21468 803 24549 -15385 -126097
2805 -126097 -38156 59897 29265 -134712 -90053 9646 34341 77548 8584 4091 124626
2794 124626 115021 -18965 -3866 26682 -32172 -35075 -6199 54102 101151 72692 101407 151087
2782 151087 142060 277042 234998 26446 -75283 -74316 42243 76610 53466 147791 129730
2771 129730 95021 90208 72779 26676 7839 -64624 73772 88522 -111019 -102459 -85758 -107653
2759 -107653 -234788 -95193 43913 83770 112651 219049 170281 119073 123572 86685 81205
2748 81205 201125 223793 212053 149416 123806 77436 -20717 -170406 -207048 -41676 -78201
2737 -78201 -275591 -298174 -100813 28448 48582 38749 85811 101518 22383 27246 115917 251972
2725 251972 210898 151465 21275 -6620 -35795 -259 93038 16869 -29907 92278 249773
2714 249773 302140 156456 24780 -132368 -125458 -207387 -301764 -189959 -52912 244 -35543
2703 -35543 -62975 37187 30787 -35009 1679 31009 25973 98396 41580 -43398 -144646 -154094
2691 -154094 -140008 -143370 -123527 12637 103833 91741 112541 108173 145919 116570 112969 -27557
2679 -27557 -155037 -138673 -102488 -87327 -47049 23459 83905 39948 47286 158842 202628 215393
2667 215393 191805 156882 121655 268149 281184 273550 206679 205831 69627 22119 -45915 -27683
2655 -27683 -78470 -117599 -137803 -77940 -28980 -119023 -39327 47550 3517 -28948 70430 164825
2643 164825 206327 145135 64931 84164 73298 179407 260845 261296 128990 21299 -76971
2632 -76971 21935 138309 81618 66877 54768 98931 104259 -39064 -206681 -276740 -240188
2621 -240188 -184512 -165849 -66866 -67452 -114386 -140179 -60910 -63722 -110428 -84946 -72563 -198754
2609 -198754 -201713 -215706 -159528 -132041 -132149 -117006 -91191 17256 84180 151870 221027 167795
2597 167795 153937 219512 344259 322647 120604 -57217 -86698 -32433 85425 250159 319699
2586 319699 154669 50754 73946 7857 66225 162681 101797 76237 -199 -108437 -184315
2575 -184315 -124036 -63785 -13154 -76942 -153568 -156627 -138031 -34116 -59606 -2823 -3737 25987
2563 25987 81913 49745 -50036 -172163 -106401 -44012 -58667 -122576 -107169 21359 27846 183372
2551 183372 209218 86515 170696 151227 50894 29943 83107 82756 96867 464 -85435 -102728
2539 -102728 -53226 30565 7709 -25970 -20642 -40861 -112324 -121265 -88954 -24957 21460 -135411
2527 -135411 -137971 -38879 18121 9339 68808 104022 58047 47383 101397 -2042 87512 173522
2515 173522 124446 -32384 -24246 -9735 -48015 -49906 -6449 133554 147961 82128 45407 -57053
2503 -57053 -45204 -42522 86917 97312 150570 234627 175465 138717 125412 44614 18393 22414
2491 22414 73570 50512 15825 80565 49179 47632 -11966 -79233 -176400 -219660 -152588 -18717
2479 -18717 23645 17428 31398 -19863 -11152 66553 114868 55986 -10927 13578 -7844 -97619
2467 -97619 -113943 -103247 -104132 -99596 -118736 -142842 -195453 -56692 85580 106572 -10833 -105339
2455 -105339 -146709 -58716 17429 -33572 -4501 -49938 -112566 -186810 -139094 -86969 -77420 -88222
2443 -88222 9320 29103 15684 64535 65951 -25073 -42275 13139 71541 137128 243424 249646
2431 249646 213218 11442 -7937 -13664 40262 11757 188909 221328 222291 243748 207463 129479
2419 129479 88627 17579 -28897 -66691 -254758 -230740 -46810 63799 35906 68910 72749
2408 72749 13709 35829 82734 23068 61147 19619 -16947 -61677 -150447 -233252 -379830 -314436
2396 -314436 -131629 -85430 12856 -90864 -141775 -142927 -164266 -80293 -89402 -282463 -164218
2385 -164218 -43280 -47697 -12430 67786 135482 155560 74426 119535 56366 -37708 -51358 -78195
2373 -78195 -42182 28007 -3889 5616 12824 71905 92029 -16526 82768 177312 195856 104198
2361 104198 -73492 -122590 -93993 -51458 -8262 35009 374 -13576 -3760 42327 68605 -14708
2349 -14708 28455 129751 29352 33558 -38140 -21114 37629 63871 28481 23166 32434 115687
2337 115687 135831 37161 69325 87400 60719 29855 18699 33675 83319 58854 90095 -828
2325 -828 -10869 36883 44779 143232 179571 103136 -31235 -102181 -101155 -17565 -7417 -23157
2313 -23157 -112136 -112334 -68756 1045 145684 174500 169288 141303 37104 55562 38453 55629
2301 55629 136036 103317 -23600 -71444 -90813 -53452 15759 65843 131955 223603 184852 39692
2289 39692 68000 43510 -50750 -146629 -174755 -189933 -182419 -9964 24732 -38110 55598 70251
2277 70251 109828 214342 186869 144396 141455 287745 225560 110871 124910 -40592 -245583
2266 -245583 -296854 -231628 -123998 -7124 -93463 -84852 -26172 -122432 -123872 -35230 47494 -17255
2254 -17255 1913 28193 12917 -195034 -270049 -270200 -303992 -244150 -199965 -218371 -237453 -202703
2242 -202703 -31160 -124047 -146229 -27395 37934 -38290 -71603 -52457 -153564 -61929 10505
2231 10505 -33241 -129956 -39570 10273 -20765 -133423 -73090 -125912 -11141 77402 76943 58869
2219 58869 -21439 48285 137370 168984 177816 142007 104805 78423 35161 74410 79062 28798
2207 28798 16846 -56025 -27625 46879 75487 -25587 -69562 -17023 72915 67809 70602 200906
2195 200906 209968 172576 102619 31575 -59594 58698 150313 6376 -8849 49928 98225
2184 98225 53387 -19238 -128314 -102718 773 40296 12987 -143983 -45808 76330 16087
2173 16087 -91400 -65874 21974 26235 138826 103325 -3970 -39511 -90081 -103365 -4938
2162 -4938 124984 5344 89084 153039 58957 39890 25938 48785 84558 79751 -16708 -111060
2150 -111060 -113542 46962 67897 142336 193710 87249 -56726 -85975 3508 -138763 -103436
2139 -103436 44034 -66536 -104325 -72437 -72654 31495 96730 35918 46018 -66342 -128563
2128 -128563 -100503 5737 -7980 59050 101710 262624 284536 144023 -1593 -71858 -22540
2117 -22540 29663 -51808 -89146 -31103 71848 78448 33812 21125 33227 1635 340 -32783
2105 -32783 -29015 -19742 2258 -89485 -103855 -47633 -32240 8764 20567 7407 -10015 49082
2093 49082 132307 91340 26520 61390 123144 51085 -83893 -4810 82600 96674 179194 208664
2081 208664 168564 109845 -45449 45048 77071 36334 33065 35384 87017 121432 227560 85719
2069 85719 -51893 16837 70910 94630 9049 47651 77631 -28702 19069 35119 18517
2058 18517 23741 125911 116106 93685 78562 37394 78906 22095 -105811 -78625 -21300 25814
2046 25814 -79095 -104726 6050 17771 -6557 40103 1948 -9814 -38563 -133133 -193510
2035 -193510 -144448 -108100 -83525 -71750 -48825 -80389 -38927 -23047 57616 105370 85465 -14258
2023 -14258 44379 166291 93974 -47883 -150436 -139929 -205570 -243318 -173684 -25762 61141
2012 61141 6743 38072 168626 63067 -84757 -99224 -76730 -61304 -107344 -55680 -55232 -26463
2000 -26463 21369 91990 147664 176841 156868 17575 -18884 105060 207737 53954 -117887
1989 -117887 -79210 60216 51025 -52157 -124721 -155326 -88730 17830 21323 56559 43002
1978 43002 -344 25265 -40436 -4990 175770 137150 7293 15162 4268 45070 61679 -75899
1966 -75899 -168576 -55376 -28837 56688 43825 -2382 -41805 -53462 63399 123983 59190
1955 59190 -10599 -1897 6498 -17933 -124872 -108237 11986 -32768 148307 219177 27457
1944 27457 -44985 15377 24469 12556 -143408 -212301 -164279 -43571 -54492 -31573 12922 -61719
1932 -61719 -147330 -148082 -166567 -119947 -49756 -339 80015 116248 191123 251483 276868 279608
1920 279608 351193 331184 179763 123364 118820 148908 134853 149707 89507 44129 52735 78600
1908 78600 193301 45468 -82197 -61025 47936 95753 131700 172072 153024 10404 -51633
1897 -51633 11936 169368 125623 67124 79058 84323 32728 -23395 -155154 -59975 -19783 -88164
1885 -88164 -64796 57559 9256 -71684 -382 101367 15858 -93802 -86959 -19355 20709
1874 20709 86751 36371 -92055 -117909 -130940 -13336 225667 270600 208829 70409 -135085
1863 -135085 -110451 -33081 -119995 -140709 -35224 80068 183328 72848 -8645 47279 84413
1852 84413 -961 -45306 12258 77291 137954 222316 194877 56015 4958 -58983 -60664 -129686
1840 -129686 45120 39875 -38050 42087 74980 75064 -474 59832 -5422 48382 32242 52844
1828 52844 55616 60148 -5975 15987 -12775 70219 75130 157449 255407 200082 160076 25228
1816 25228 34435 211789 151108 79179 34836 41840 50051 79967 95326 8836 4232 55748
1804 55748 38055 -13636 15555 -56057 -84092 -133491 -173219 -151449 -151440 -194938 -87840 -21189
1792 -21189 7439 -19000 -13957 -4361 108009 141776 59917 13711 64026 14983 65413 124764
1780 124764 154138 105922 41366 -55165 -293392 -303773 -129140 13931 -18890 -99366 -186320
1769 -186320 -33831 64774 -21107 -81518 -127794 -20877 40432 -7558 -47064 -71651 -87753
1758 -87753 23702 62656 29857 -8716 -24291 68241 52480 -28886 -77620 -71640 82858 97610
1746 97610 74587 80513 104846 75343 43402 61845 11133 -48023 -8630 97366 178874 138313
1734 138313 40813 -62820 -138297 -57482 -88071 -52937 64687 65143 -84626 -165293 -311793
1723 -311793 -175729 -127166 -234057 -120497 -35921 -114 34793 27322 62535 102451 199570
1712 199570 120974 43549 5859 60443 -7638 75496 19064 84705 156569 120398 89290 -2010
1700 -2010 -69630 -153461 -225090 -224870 -128034 18689 40040 39073 147298 190539 196841 198991 132452
1687 132452 -8073 80377 228138 146777 31169 54652 92333 15331 -27152 54189 38870
1676 38870 -26384 -70763 54977 164457 135333 147045 135537 172863 122369 138134 137250 154444
1664 154444 152390 215188 126129 -91999 -197707 -130534 -75925 -85984 71117 147449 62029
1653 62029 101283 178645 136608 163450 168816 152030 105009 52866 -78483 -236615 -237022 -86838
1641 -86838 64795 169496 30141 -146265 -79508 13420 -2024 71994 234065 230884 152792
1630 152792 42411 -70614 -109330 -139451 -157177 -149979 -314059 -397310 -393105 -289524 -72420
1619 -72420 -33848 80917 99145 63310 54122 104174 6194 -114692 -76580 -33570 -23611 142554
1607 142554 198349 87947 98016 102754 95966 21524 -14892 -6749 33480 108838 166698 91275
1595 91275 181045 232719 269367 160226 105389 248523 159933 -25786 -108253 -23713 125221
1584 125221 182268 142659 108173 122405 140257 89946 107969 180437 126130 91186 132482 76374
1572 76374 38946 -112275 -127468 -25869 103593 110518 96266 25732 88695 134542 76668
1561 76668 31517 -14140 -33769 22894 115787 182405 151987 119907 36413 -69749 -71471 -212539
1549 -212539 -254373 -98428 6670 70467 84868 83012 36482 4123 -34605 -105930 -15244
1538 -15244 -32062 -110269 -71434 -26190 -121202 -248193 -155430 -125271 -137102 -275105 -267909 -99260
1526 -99260 37103 159417 126734 77954 29267 -62795 -79412 -62388 -34975 -22175 -68199
1515 -68199 -104767 -99392 -63107 -112632 -91165 -74837 -138590 184 100618 113513 49525 64542
1503 64542 53511 1315 92975 141640 161729 -36812 -59121 47313 163667 159145 119567
1492 119567 114385 175642 205592 146152 106013 16095 12886 -16262 -16896 -46197 -38006 72810
1480 72810 237136 300882 211189 35555 -49310 -57981 6686 52831 137299 73427 5139 -52394
1468 -52394 -62299 2139 82381 135256 77152 52360 80591 149539 73155 134517 74709 110959
1456 110959 122466 71783 -60032 -69331 -124816 -110938 -33787 591 5347 9251 -12734 -64317
1444 -64317 29200 -44526 -104393 -24696 19717 40622 -97849 -133853 -30360 143145 207094
1433 207094 99772 23054 33042 31758 -49751 -188780 -153498 -181463 -228042 -100806 -34244
1422 -34244 -143220 40862 87867 73198 76749 118192 126647 192230 175570 69691 17442 -24250
1410 -24250 -112789 -155606 -184856 -163134 -198099 -163430 -36394 -34665 93946 115013 82106 66094
1398 66094 19596 106733 162892 64578 -41480 -20502 65361 12618 16740 45069 13210 53748
1386 53748 4798 -15249 77644 41379 -955 4632 -54856 -78246 -66986 -168 135630 251022
1374 251022 173636 450 5876 60943 -57952 -79479 43368 133909 212421 243253 181995
1363 181995 79183 32242 19636 63932 141614 177292 153847 104451 28599 111334 90607
1352 90607 63516 117394 108936 -49369 -36333 132944 196388 145356 -25293 -15164 101006
1341 101006 92955 75792 52053 92362 167886 169724 77247 -57985 -20766 84548 98674 62002
1329 62002 32294 46747 74631 40741 -24829 97623 224572 198097 108311 80088 6068
1318 6068 -69644 -43075 -83847 -125836 -40569 122183 170262 122419 102077 111738 65295 -4142
1306 -4142 -25116 -39986 -10237 20122 -58764 -133034 -63733 -34705 89257 100598 251587 238221
1294 238221 201800 136388 82497 70421 -49212 -171422 -107483 -84693 -83464 -16780 -99287
1283 -99287 -78015 90460 159633 114737 49800 8021 68839 24305 30788 82307 -79494 -113493
1271 -113493 23099 -25410 -86083 -84068 -23960 19449 -19010 -41447 -103683 -78037 -61423 -100663
1259 -100663 -65822 -62503 -57745 -76525 -120184 -112267 -28048 -24383 -44323 -75076 -66902 -59484 75257
1246 75257 172859 176952 118483 154836 171137 97456 -12312 14273 -52861 -26913 131248 60785
1234 60785 43050 45500 52491 103400 188480 162283 -8206 -70602 -45617 -80512 33823 187469
1222 187469 140180 68011 152278 50250 -70721 -76257 17442 68031 36942 31221 22794 -34780
1210 -34780 -41947 -47908 -156832 -179796 -93895 -25739 57101 245408 309248 216420 322581 287845
1198 287845 166770 169420 237918 43777 -28663 -37405 -13347 -6249 -6371 -55837 -103802 -108734
1186 -108734 -75867 -41386 -165273 -209696 -86414 17551 -17312 -91929 -100590 -32735 52171
1175 52171 41488 74805 29258 -65886 18530 138103 212613 88230 72232 19406 -99801
1164 -99801 -24789 128313 206207 220774 167975 153872 61695 -142459 -182096 -66935 22695
1153 22695 -27794 44409 131526 136347 170590 161769 -14992 -139420 -123057 23608 11753 39307
1141 39307 37901 74841 186186 108683 26548 -96672 -126800 -3189 67655 2562 -59460
1130 -59460 -48475 -61733 -217014 -210032 -72612 84724 9437 -83827 -118731 -37544 -6461
1119 -6461 -20460 -81245 575 34484 23469 36492 28154 -35190 -74915 -69137 -47744 14425
1107 14425 -93497 -114485 -14106 71826 88338 183420 160121 110296 152748 41637 -88181
1096 -88181 -143937 -39276 44301 57514 64714 100174 47254 90155 218103 124844 102081 85856
1084 85856 -16817 -93479 -75512 28220 138954 96950 -47720 -15583 58814 26823 -1073
1073 -1073 59025 119318 12548 -48292 -17333 -71815 -147685 -165785 -192149 -172865 -110234 -79092
1061 -79092 -39942 -40212 100644 152954 -2634 6083 49041 -5830 -104592 -79076 -9556 93468
1049 93468 78192 33475 -45358 -152187 -100058 38458 90095 72438 19648 -101811 -174707
1038 -174707 -166375 -108594 51958 159325 96794 97589 151603 180625 103519 146093 111016 -3829
1026 -3829 108345 228086 179256 149537 7945 -43153 -34277 -51972 -61650 -74114 -33203 -65375
1014 -65375 20046 29918 -390 15689 -61373 -159286 -61763 46891 25029 32 32875 123552
1002 123552 144600 45942 33679 114510 168814 212887 238134 199567 94971 -18940 95901
991 95901 69796 11650 -77614 -83310 -41216 86929 135678 75868 45688 23692 45368 158162
979 158162 164108 188808 162273 195845 213444 52433 -17918 65306 93797 63581 63850 -38484
967 -38484 -110287 -90218 -29654 -77228 -47353 -13390 -28296 -61456 -84835 -85072 7438 70062
955 70062 41672 4851 -146075 -196703 -47988 80205 -21131 -85747 -97679 51066 37052
944 37052 -55249 -115146 -107724 -10100 88532 176172 125774 87742 119454 203145 125398 2252
932 2252 -216900 -170226 -127241 -152243 -121416 -129341 -60829 -16352 72505 167280 103652 66408
920 66408 31474 -20115 -28154 -4626 -54901 -130637 -216964 -112781 44705 74213 193578 182585
908 182585 10645 -83301 -128190 -87068 -77323 -14779 11508 33656 17495 17416 -71157 -149385
896 -149385 -65601 -3674 12019 -24979 -27622 -8629 8798 144770 157540 127687 120494 66964
884 66964 -58249 -168835 -214912 -179189 -172116 -175867 -166981 -220385 -123125 -126706 -122307 34405
872 34405 68025 74912 166371 103854 59792 -33827 -73438 -112464 -28580 -46110 -98802 -182691
860 -182691 -267533 -269704 -118229 41681 13365 -160700 -180298 -17248 37022 -107394 -183740
849 -183740 -200609 -256234 -187792 -142913 -140910 -203252 -220662 -156486 -42211 -11730 9642 187737
837 187737 280292 138660 96345 58509 7881 86929 133860 109885 -12389 7574 46513
826 46513 179623 180905 92133 2737 -43413 -36790 59927 97532 -6150 -116488 -156618 -246747
814 -246747 -216493 -216536 -209065 -145779 -158544 -177147 -136268 -55554 -101133 -96346 -50229 -50661 44909
801 44909 68296 -21814 -136325 -154546 -134725 -154239 63268 242815 252830 239022 290409
790 290409 150430 111362 52983 27475 13392 3533 -56141 -42286 82857 69304 99370 14662
778 14662 1970 34863 45911 -32321 -1579 -19366 -5559 94485 94638 31254 -57298 -125059
766 -125059 -146745 -84600 37913 69917 -42298 -182843 -239507 -174721 -118433 -65041 -41660
755 -41660 6595 -26050 -114496 -88599 -32474 -540 -54774 -143285 -145724 -59616 -52957 -69724
743 -69724 -80767 -60779 -354 26568 60736 12540 34533 110997 136704 118728 135837 42917
731 42917 -91600 -133761 -28735 31048 -110891 -142273 -143972 -257540 -228894 -96531 15205
720 15205 64127 91978 200617 122325 5743 -117159 -125138 -164463 -184740 -72170 23799
709 23799 72319 -34214 -216305 -284248 -163998 -79090 -57035 -119544 -81727 -24734 -49563
698 -49563 -31625 61980 71670 51 -7705 -88592 -74276 40884 -33964 -116574 -68297 -93057
686 -93057 -46901 15639 40399 3041 39005 72042 17556 18803 34476 -11842 -102886 -141652
674 -141652 -48561 7342 -19986 21444 94608 172155 147949 40312 -74207 -43298 76432
663 76432 103151 134206 76459 65650 126451 95602 68059 -93658 -274537 -218246 -74816
652 -74816 -174945 -271276 -170016 -54628 -3456 146895 82005 19973 169940 153349 -81810
641 -81810 -73169 -61047 -34950 142 119178 142339 108952 93868 27823 13679 121782 211350
629 211350 127885 8935 -29733 9895 -55445 -22058 -116124 -233381 -168468 -38490 -134478
618 -134478 -172341 -151394 -194182 -204297 -168366 -61429 25428 106708 -36305 -98489 -130951
607 -130951 -97564 -101542 -100268 -237964 -204777 -201585 -322769 -325716 -221605 -168131 -106003 5059
595 5059 -62706 -167534 -138092 -244559 -268969 -274614 -369557 -356964 -345903 -203652 -83908 -68390
583 -68390 -51936 -74686 -83836 -24380 7598 -6730 -56215 -40633 -54109 -106688 -104472 59313
571 59313 -11457 -110181 -133461 -114433 -205403 -179696 -54125 -68898 -126624 -79751 -17052 -14639
559 -14639 -4490 -39178 -66289 -51377 619 44248 -21414 -104449 34295 152154 190310 183900
547 183900 144455 -7877 -45267 105637 189744 106489 82883 43335 -119586 -138048 -179951
536 -179951 -75047 -35555 -149542 -201970 -155561 -64453 97002 36875 56074 -29307 -36153
525 -36153 -4490 -87946 -80803 -36034 -73132 -55915 -114859 -99267 -207447 -233849 -128809 -152168
513 -152168 -152905 -61153 55119 98297 188007 142537 -93206 -55623 50004 25696 85906 64391
501 64391 13982 9727 -60939 -69161 -56887 -149981 -289866 -322961 -162252 3198 10045 48773
489 48773 -119872 -15072 30917 -15918 -132569 -128057 -28446 31988 27321 148555 159452 96766
477 96766 -75324 -141615 -57818 52649 109429 121493 -15342 -19769 -75594 7053 9632 -72663
465 -72663 -166466 -152960 -49263 -55202 -10486 60925 18600 -101007 -43765 -58176 -16665 -23975
453 -23975 34637 78981 75942 76113 141784 101726 99662 15704 42302 -28546 -111330 -122677 -56547
440 -56547 6663 -8524 -74137 -67028 -110345 -15808 -64322 -144378 -147262 6784 50087 120897
428 120897 199371 112890 -28587 -100684 -108592 -56000 51927 -21240 -168198 -148185 -57602
417 -57602 -57272 -54640 -60277 -225241 -207762 -250433 -137441 -69410 -86378 -156755 -145178 -77693
405 -77693 -173431 -236748 -295270 -160521 -102109 -161228 -201151 -197702 -94824 23778 -8711 -79139
393 -79139 62240 50977 -17308 -77377 -87017 -57734 42099 167660 237180 120325 55334 404
381 404 -64215 -71628 -93288 -120551 -151803 -137753 -85821 -223987 -246625 -118128 -10614 -73638
$$ [...]
##END NTUPLES=NMR SPECTRUM
##END=
