##TITLE=Analysis number 317420
Compound Code mo 07407
Project Code qc-cat
Chemist Name hixia
##JCAMPDX= 6.0         $$ Bruker NMR JCAMP-DX V2.0
##DATA TYPE= NMR SPECTRUM
##DATA CLASS= NTUPLES
##ORIGIN= Bruker BioSpin GmbH
##OWNER= nmr
$$ XWIN-NMR		Version 3.5
$$ Mon Feb 20 12:30:24 2006 GMT Standard Time (UT+0h)  MAYBRIDGE\nmr@NMR_250MHZ
##.OBSERVE FREQUENCY= 250.131544655141
##.OBSERVE NUCLEUS= ^1H
##.ACQUISITION MODE= SIMULTANEOUS (DQD)
##.ACQUISITION SCHEME= undefined
##.AVERAGES= 16
##.DIGITISER RES= 18
##SPECTROMETER/DATA SYSTEM= dpx250
##.PULSE SEQUENCE= zg30
##.SOLVENT NAME= DMSO
##.SHIFT REFERENCE= (INTERNAL, DMSO, 0, 16.522)
##AUDIT TRAIL= $$ (NUMBER, WHEN, WHO, WHERE, WHAT)
$$ ##TITLE= Audit trail, XWIN-NMR		Version 3.5
$$ ##JCAMPDX= 5.01
$$ ##ORIGIN= Bruker BioSpin GmbH
$$ ##OWNER= nmr
$$ C:\u/data/dgb/nmr/ADRS/16300/pdata/1/auditp.txt
$$ ##AUDIT TRAIL=  $$ (NUMBER, WHEN, WHO, WHERE, WHAT)
(   1,<2006-02-20 12:30:02.11 +000>,<MAYBRIDGE\nmr>,<NMR_250MHZ>,
      <created by zg, POWCHK disabled, PULCHK disabled
       configuration hash MD5:
       84 BC 41 DB A1 6E 1D 46 DA 25 12 A5 C1 ED C5 3A
       data hash MD5: 64K
       7F 27 CB F4 1B 4F 9B 48 FB 51 42 7E C4 7F C4 B7>)
(   2,<2006-02-20 12:30:16.03 +000>,<MAYBRIDGE\nmr>,<NMR_250MHZ>,
      <Start of raw data processing
       ef LB = 0.3 FT_mod = 6 PKNL = 1 SI = 32K 
       data hash MD5: 32K
       ED 3D 89 5A 8C 80 30 1E C8 3A B4 95 84 CA D9 D2>)
(   3,<2006-02-20 12:30:17.70 +000>,<MAYBRIDGE\nmr>,<NMR_250MHZ>,
      <apk 
       data hash MD5: 32K
       CA 3E 8A 68 32 BE 9C DF 42 5A 12 24 DB D7 62 E7>)
(   4,<2006-02-20 12:30:18.43 +000>,<MAYBRIDGE\nmr>,<NMR_250MHZ>,
      <abs ABSG = 5 
       data hash MD5: 32K
       C5 85 48 69 1A 9D 15 E9 A2 25 B0 6C 1C 00 E8 C5>)
$$ ##END=
$$ 
$$ hash MD5
$$ C8 C1 AA 4D B9 C5 6A 01 97 F8 FF 4D 9D 56 C8 1A
##$RELAX= 
##$RELAX= 
##$RELAX= 
##$RELAX= 
##$RELAX= 
##$RELAX= 
##$RELAX= 
$$ Bruker specific parameters
$$ --------------------------
##$DU= <C:\u>
##$EXPNO= 16300
##$NAME= <ADRS>
##$PROCNO= 1
##$TYPE= <nmr>
##$USER= <dgb>
##$AMP= (0..31)
100 100 100 100 100 100 100 100 100 100 100 100 100 100 100 100 100 100 
100 100 100 100 100 100 100 100 100 100 100 100 100 100 
##$AQSEQ= 0
##$AQ_mod= 3
##$AUNM= <au_zg>
##$AUTOPOS= <21 >
##$BF1= 250.13
##$BF2= 250.13
##$BF3= 250.13
##$BF4= 250.13
##$BF5= 500.13
##$BF6= 500.13
##$BF7= 500.13
##$BF8= 500.13
##$BYTORDA= 1
##$CFDGTYP= 0
##$CFRGTYP= 5
##$CHEMSTR= <none>
##$CNST= (0..31)
1 1 145 1 1 1 1 1 1 1 1 1 1 1 1 1 1 1 1 1 1 1 1 1 1 1 1 1 1 1 1 1 
##$CPDPRG= <>
##$CPDPRG1= <>
##$CPDPRG2= <>
##$CPDPRG3= <>
##$CPDPRG4= <mlev>
##$CPDPRG5= <mlev>
##$CPDPRG6= <mlev>
##$CPDPRG7= <mlev>
##$CPDPRG8= <mlev>
##$CPDPRGB= <>
##$CPDPRGT= <>
##$D= (0..31)
0 1 0 0 0 0 0 0 0 0.06 0 0 0 0 0 0 0.0002 0 0 0 0 0 0 0 0 0 0 0 0 0 0 
0 
##$DATE= 1140438601
##$DBL= (0..7)
120 120 120 120 120 120 120 120 
##$DBP= (0..7)
150 150 150 150 150 150 150 150 
##$DBP07= 0
##$DBPNAM0= <>
##$DBPNAM1= <>
##$DBPNAM2= <>
$$ [...]
##$SUBNAM7= <"">
##$SUBNAM8= <"">
##$SUBNAM9= <"">
##$SW= 20.6930455092707
##$SWIBOX= (0..15)
0 0 3 0 0 0 0 0 0 0 0 0 0 0 0 0 
##$SW_h= 5175.983436853
##$TD= 65536
##$TD0= 1
##$TE= 294.16
##$TE2= 300
##$TE3= 300
##$TEG= 300
##$TL= (0..7)
0 120 120 120 120 120 120 120 
##$TP= (0..7)
150 150 150 150 150 150 150 150 
##$TP07= 0
##$TPNAME0= <>
##$TPNAME1= <>
##$TPNAME2= <>
##$TPNAME3= <>
##$TPNAME4= <>
##$TPNAME5= <>
##$TPNAME6= <>
##$TPNAME7= <>
##$TPOAL= (0..7)
0.5 0.5 0.5 0.5 0.5 0.5 0.5 0.5 
##$TPOFFS= (0..7)
0 0 0 0 0 0 0 0 
##$TUNHIN= 0
##$TUNHOUT= 0
##$TUNXOUT= 0
##$USERA1= <user>
##$USERA2= <user>
##$USERA3= <user>
##$USERA4= <user>
##$USERA5= <user>
##$V9= 5
##$VALIST= <valist>
##$VCLIST= <CCCCCCCCCCCCCCC>
##$VD= 0
##$VDLIST= <DDDDDDDDDDDDDDD>
##$VPLIST= <PPPPPPPPPPPPPPP>
##$VTLIST= <TTTTTTTTTTTTTTT>
##$WBST= 1024
##$WBSW= 4
##$XGAIN= (0..3)
0 0 0 0 
##$XL= 0
##$YL= 0
##$YMAX_a= 322773
##$YMIN_a= -456077
##$ZGOPTNS= <>
##$ZL1= 120
##$ZL2= 120
##$ZL3= 120
##$ZL4= 120
##$ABSF1= 16.522
##$ABSF2= -4.171173
##$ABSG= 5
##$ABSL= 3
##$ALPHA= 0
##$AQORDER= 0
##$ASSFAC= 0
##$ASSFACI= 0
##$ASSFACX= 0
##$ASSWID= 0
##$AUNMP= <proc_1d>
##$AZFE= 0.1
##$AZFW= 0.1
##$BCFW= 0
##$BC_mod= 0
##$BYTORDP= 0
##$COROFFS= 0
##$CY= 12.5
##$DATMOD= 1
##$DC= 0
##$DFILT= <>
##$DTYPP= 0
##$F1P= 14.0000005364418
##$F2P= -0.99999901652339
##$FCOR= 0.5
##$FTSIZE= 32768
##$FT_mod= 6
##$GAMMA= 0
##$GB= 0
##$INTBC= 1
##$INTSCL= 1
##$ISEN= 128
##$LB= 0.3
##$LEV0= 0
##$LPBIN= 0
##$MAXI= 10000
##$MC2= 0
##$MEAN= 0
##$ME_mod= 0
##$MI= 0
##$NCOEF= 0
##$NC_proc= -3
##$NLEV= 6
##$NOISF1= 0
##$NOISF2= 0
##$NSP= 0
##$NTH_PI= 0
##$NZP= 0
##$OFFSET= 16.522
##$PC= 1
##$PHC0= 226.4914
##$PHC1= 17.08338
##$PH_mod= 1
##$PKNL= yes
##$PPARMOD= 0
##$PSCAL= 4
##$PSIGN= 0
##$REVERSE= no
##$SF= 250.13
##$SI= 32768
##$SIGF1= 0
##$SIGF2= 0
##$SINO= 400
##$SIOLD= 32768
##$SREGLST= <1H.DMSO>
##$SSB= 0
##$STSI= 32768
##$STSR= 0
##$SW_p= 5175.98343685301
##$SYMM= 0
##$S_DEV= 0
##$TDeff= 65536
##$TDoff= 0
##$TI= <Analysis number 999999
Compound Code 99
Book Reference 9
Project Code 9>
##$TILT= no
##$TM1= 0
##$TM2= 0
##$TOPLEV= 0
##$USERP1= <user>
##$USERP2= <user>
##$USERP3= <user>
##$USERP4= <user>
##$USERP5= <user>
##$WDW= 1
##$XDIM= 32768
##$YMAX_p= 293477118
##$YMIN_p= -214277
$$ End of Bruker specific parameters
$$ ---------------------------------
##NTUPLES= NMR SPECTRUM
##VAR_NAME=  FREQUENCY,     SPECTRUM/REAL,   SPECTRUM/IMAG
##SYMBOL=    X,             R,               I
##VAR_TYPE=  INDEPENDENT,   DEPENDENT,       DEPENDENT
##VAR_FORM=  AFFN,          ASDF,            ASDF
##VAR_DIM=   32768,         32768,           32768
##UNITS=     HZ,            ARBITRARY UNITS, ARBITRARY UNITS
##FACTOR=    0.157963299565203, 1,           1
##FIRST=     4132.6476996994, 0,             0
##LAST=      -1043.33573715361, 0,           0
##MIN=       -1043.33573715361, -214277,     0
##MAX=       4132.6476996994, 293477118,     0
$$ Real data points
##PAGE= N=1
##DATA TABLE= (X++(R..R)), XYDATA
$$ [...]
16459a0378M395j2321l970O374j6866r038J6456l538j054q286p67J7536j273r776
$$ -10378 -5983 -18304 -22274 -15900 -32766 -41804 -25348 -28886 -29940 -38226 -38993 -21457 -22730 -32506
16445c2506m284j035J0010M421K1162K839j3790p760p441N372L084O96n065j5416
$$ -32506 -36790 -37825 -27815 -23394 -2232 607 -13183 -20943 -28384 -23012 -19928 -19232 -24297 -39713
16431c9713M472R419L887Q985K306J9528j524q957q539M033n632O513j112L202
$$ -39713 -35241 -25822 -21935 -12950 -10644 8884 7360 -1597 -10136 -6103 -11735 -5222 -6334 -3132
16417c132n132k059l773j6224r777K1019K6316n330j1895j622o267K221k131j0035
$$ -3132 -8264 -10323 -14096 -30320 -40097 -19078 7238 1908 -9987 -11609 -17876 -15655 -17786 -27821
16403b7821J1934R826n945P432q89J0518J7481j77p877j5232p952j4997p45M871
$$ -27821 -15887 -6061 -12006 -4574 -5463 5055 22536 22359 14482 -750 -8702 -23699 -24444 -19573
16389a9573P370J2719p66J919O430Q764J645k8426j1989J7846J8569K2151O823
$$ -19573 -12203 516 -250 1669 8099 16863 18508 -9918 -21907 -4061 14508 36659 43482
16376D3482j4802j8416k3641P650N892j1677j24q193j0607J5676k414k1637J2252
$$ 43482 28680 10264 -13377 -5727 165 -11512 -11636 -19829 -30436 -14760 -17174 -38811 -26559
16363b6559N898j1505k965O127j0765L292j2953k416J9597J2558Q572Q060o95
$$ -26559 -20661 -32166 -35131 -29004 -39769 -36477 -49430 -51846 -32249 -19691 -11119 -3059 -3754
16350c754k5692N430J884q449k223O322R512R888J6604J2404M145K910j8499k3327
$$ -3754 -29446 -24016 -22132 -30581 -32804 -26482 -16970 -7082 9522 21926 26071 28981 10482 -12845
16336a2845K575M004j5282L952l358l931j7176j2352k293K1122O380J7364N079
$$ -12845 -10270 -6266 -21548 -17596 -20954 -24885 -42061 -54413 -56706 -35584 -29204 -11840 -6761
16323f761l569j0901k1824j4839J1312K0525J7310q29N775m183K312M346J357
$$ -6761 -10330 -21231 -43055 -57894 -46582 -26057 -8747 -9576 -3801 -7984 -5672 -1326 31
16310C1j8602O726k827j764j6834k608J1425j0958J2558J3537m20j2379J493Q061
$$ 31 -18571 -11845 -14672 -16436 -33270 -35878 -24453 -35411 -22853 -9316 -9736 -22115 -20622 -12561
16296a2561J0957J2198p26k1385k4233k757J162j4638n862L5424K6551j2746j9034
$$ -12561 -1604 10594 9868 -11517 -35750 -38507 -37345 -51983 -57845 -22421 4130 -8616 -27650
16283b7650J0277J9909R477k9395K286J8920J662N647k0109j064J8834j2410p586
$$ -27650 -17373 2536 12013 -17382 -15096 3824 5486 11133 -8976 -10040 8794 -3616 -11202
16270a1202n112r395l056r69R14M706n520j8598j8935K0298J7401p961j6366R094
$$ -11202 -16314 -25709 -28765 -29734 -28820 -24114 -29634 -48232 -67167 -46869 -29468 -37429 -53795 -44701
16256d4701K0481K6627q6k95o369l924Q717J3950k1196l3401K063Q832N101Q316
$$ -44701 -24220 2407 2321 2026 -4343 -8267 450 14400 -6796 -40197 -38134 -29302 -24201 -15885
16242a5885j2760J7506Q905L866J6397j456j5648j4397j1530R492J4482m216J495
$$ -15885 -28645 -11139 -2234 1632 18029 16573 925 -13472 -25002 -15510 -1028 -5244 -3749
16229c749p047q348Q692R554K0824J7663j6599k5348j4380l8714l158J5083Q490
$$ -3749 -10796 -19144 -10452 -898 19926 37589 20990 -4358 -18738 -57452 -60610 -45527 -37037
16216c7037Q020J6260R659o414k0255l461J6651Q350k0207j4256J9928J4802J1354
$$ -37037 -29017 -12757 -3098 -9512 -29767 -33228 -16577 -8227 -28434 -42690 -22762 -7960 3394
16203C394R241J3802j2018l2425k1770m870j2882r957K08J245K3536L827o761
$$ 3394 12635 26437 14419 -18006 -39776 -44646 -57528 -67485 -67277 -66032 -42496 -38669 -45430
16190d5430J729O778Q152J4263j187L846O148M854j8441q441N647m368j8596M939
$$ -45430 -43701 -36923 -28771 -14508 -15695 -11849 -5701 -847 -19288 -27729 -22082 -26450 -45046 -40107
16176d0107J0187K1771n549K736j1229n629P885j2269p388K432o591J8247R746
$$ -40107 -29920 -8149 -13698 -10962 -22191 -27820 -19935 -32204 -39592 -37160 -43751 -25504 -15758
16163a5758n605j610k530k027P601j0237j4553J4872J3101J315j6318K2665L2537
$$ -15758 -21363 -22973 -25503 -27530 -19929 -30166 -44719 -29847 -16746 -15431 -31749 -9084 23453
16150B3453j616j4179m967L847k723k875J561L81k747M272j256M73P909j4899
$$ 23453 21837 7658 2691 6538 3815 940 2501 2882 135 4407 3151 3624 11533 -3366
16136c366k726k0583K778Q866N183k1217j3420J4276J1618L272j1286m708o158
$$ -3366 -6092 -26675 -23897 -15031 -9848 -31065 -44485 -30209 -18591 -15319 -26605 -31313 -37471
16123c7471J0385R968l239p435L447K4133q582q441r885r902Q253P65R101J2994
$$ -37471 -27086 -17118 -20357 -27792 -24345 -212 -8794 -17235 -27120 -37022 -28769 -28004 -18903 -5909
16109e909m464p575J6250J2651k0968j0673J4039J5547K065k5829k1337P549J0545
$$ -5909 -10373 -17948 -1698 10953 -10015 -20688 -6649 8898 10963 -14866 -36203 -28654 -18109
16096a8109j27J2987J433k2845j0108K0302K7898J4737J247l1837k257q96p985
$$ -18109 -18236 -5249 -3816 -26661 -36769 -16467 11431 26168 27415 -4422 -6679 -7575 -15560
16083a5560M524j0691j1584J3617N479o509o482J2416J2397j0412q259j926j2443
$$ -15560 -11036 -21727 -33311 -19694 -14215 -20724 -27206 -14790 -2393 -12805 -21064 -22990 -35433
16070c5433R668K081n193j4487m365Q462J5138J1090o398Q251N811j3934k2817
$$ -35433 -25765 -23684 -28877 -43364 -47729 -39267 -24129 -13039 -19437 -11186 -5375 -19309 -42126
16057d2126K5961J5591j0001R008K5076m076r351J1185O83k3421l767j0927Q247
$$ -42126 -16165 -574 -10575 -1567 23509 19433 10082 21267 21950 -1471 -5238 -16165 -7918
16044g918J3430j2829j9582o057R002J7717J606R596J8685Q53j9932r554l620
$$ -7918 5512 -7317 -26899 -32956 -23954 -6237 -4631 4965 23650 24503 4571 -4983 -8603
16031h603j2810m082J0815J3750J694j7535J072J4028J0682p685j0230q505K9266
$$ -8603 -21413 -25495 -14680 -930 764 -16771 -15699 -1671 9011 1326 -8904 -17409 11857
16018A1857J0473K594K457J3530J4575L570R891M906j8342j4152j1892P626j711
$$ 11857 22330 24924 27381 40911 55486 59056 68947 73853 55511 41359 29467 37093 35382
16005C5382L1837K5629K1452N176J5040P737L3862K1379K2551K3805R722N8925
$$ 35382 67219 92848 114300 119476 134516 142253 176115 197494 220045 243850 253572 312497
15993C12497P0489M5348K9531O796J5310K5516R970j5816j9100j8631k9951m1582
$$ 312497 382986 428334 457865 464661 479971 505487 515457 499641 480541 461910 431959 390377
15981C90377m3420l8133n2836l9437k2039j96l0910m1884o034r674k0702N877
$$ 390377 346957 308824 255988 216551 194512 194316 163406 121522 115488 105814 85112 90989
15969I0989O389p068k8018j9228P842n092J590m204j4123k167P391l135N527o010
$$ 90989 97378 90310 62292 43064 50906 45814 47404 43200 29077 26910 34301 31166 36693 30683
15955C0683K5887q634l7451j7903Q331M095J8112q249j886J1687p391K582M391
$$ 30683 56570 47936 10485 -7418 913 5008 23120 14871 12985 24672 17281 19863 24254
15942B4254J8847j0157l0216n328P019j215K0960L428J2897L48L810j2483j5140
$$ 24254 43101 32944 2728 -2600 4419 3204 24164 27592 40489 40837 44647 32164 17024
15929A7024j4199p825j0081k47j742n674N221J3479o948J1013M512J0480J1457
$$ 17024 2825 -5000 -15081 -15328 -17070 -22744 -17523 -4044 -10992 21 4533 15013 26470
15916B6470J8951o610k7385j6006O194j7209l831J0876J7753K3327L453j3607
$$ 26470 45421 38811 11426 -4580 1614 -15595 -19426 -8550 9203 32530 35983 22376
15904B2376K663K110O051k2609j4488j4063n2R433P989p649K4325J4085k308j2378
$$ 22376 25039 27149 33200 10591 -3897 -17960 -18012 -8579 -590 -8239 16086 30171 27863 15485
15890A5485j0013n7J2056l0573r547K191k02j16k675J6347l570P231R092M06l235
$$ 15485 5472 5415 17471 -13102 -22649 -20458 -20660 -20776 -23451 -7104 -10674 -3443 5649 6055 2820
15875B820J2776J75j0881r127K964j3222l363J3834K2814J3756K901k3487r959
$$ 2820 15596 15771 4890 -4237 -1273 -14495 -17858 -4024 18790 32546 35447 11960 2001
15862B001R968j7321l0684j6986J2474K7559L893O840J4536J5797L721o886j0427
$$ 2001 11969 -5352 -36036 -53022 -40548 -12989 -9096 -2256 12280 28077 31798 24912 14485
15849A4485k6333P509J1781j2572O449J146r186j1872q448J3872j1337Q583Q964
$$ 14485 -11848 -4339 7442 -5130 1319 2465 -6721 -18593 -27041 -13169 -24506 -15923 -6959
15836f959J1874p268p160k167J990L1123K6313M644q414k4649N461q79j2845j7637
$$ -6959 4915 -2353 -9513 -11680 -9690 21433 47746 52390 43976 19327 24788 23909 11064 -6573
15822f573m916J887j6229j4832K1650K8026k04K829O758O358k787J3158Q788j2951
$$ -6573 -11489 -9602 -25831 -40663 -19013 9013 8809 11638 18396 24754 21967 35125 43913 30962
15808C0962j4301j4557j128L757O708j155q12N595L583K2434J0941K2075L490
$$ 30962 16661 2104 976 4733 11441 10286 9474 15069 18652 41086 52027 74102 77592
15795G7592L4J260L597P914j1697q159o929p340j1233k3357j394Q331Q707J856
$$ 77592 77626 78886 82483 90397 78700 70541 63612 56272 45039 21682 20288 28619 37326 39182
15781C9182J7513j0098j142J1785P1O556J3607k735o512r573K1397Q580l516J6124
$$ 39182 56695 46597 45455 57240 57311 63867 77474 74739 68227 58654 80051 88631 85115 101239
15767A01239L509L089m720r890n24r04r048j5978K000r5r441J3542K107o432k71
$$ 101239 104748 107837 103117 93227 92703 91799 82751 66773 68773 68678 59237 72779 74886 68454 68183
15752F8183j96l0940N9M055j102J7729K5147O34Q367L787j5758n469J5382Q157
$$ 68183 67987 37047 37106 41161 40059 57788 82935 83569 91936 95723 79965 74496 89878 98035
15738I8035j3501j737j663j6831J1911M404J876J6600m519m106j2128j8910k3755
$$ 98035 84534 82797 81134 64303 76214 80618 82494 99094 94575 90469 78341 59431 35676
15725C5676k2786L20N199J0095J0085J6652N6J1571n462m346k6737k2829o031
$$ 35676 12890 13210 18409 28504 38589 55241 55297 66868 61406 57060 30323 7494 1463
15712A463J2425J3923J7393K8195N675Q36J4713J0804j96j2867k1799O557J6240
$$ 1463 13888 27811 45204 73399 79074 79910 94623 105427 105231 92364 70565 77122 93362
15699I3362R416J5881j6485j5106l836j7569j5318J6297K865R315j233r756j2999
$$ 93362 102778 118659 102174 87068 83232 65663 50345 66642 69507 78822 77589 67833 54834
15686E4834K5234n903j1963O337P20l022n592k647J7611R067J765j445K1236L7638
$$ 54834 80068 74165 62202 68539 69259 66237 60645 57998 75609 84676 86441 84996 106232 143870
15672A43870J4818j7865n70j272p194j691k6239j8837k871m217J1457j0661r390
$$ 143870 158688 140823 140253 138981 131787 130096 103857 85020 82149 77932 89389 78728 69338
15659F9338K9928K5444J1338k0241j4388p005Q706K5706L2285l669K225J5519
$$ 69338 99266 124710 136048 115807 101419 94414 103120 128826 161111 157442 159667 175186
15647A75186L725J3356K423q523M889K3615k326L875M417J2164J3667L298j2007
$$ 175186 178911 192267 194690 186167 191056 214671 212345 216220 220637 232801 246468 249766 237759
15634B37759m477j35l772p843K676J4594k696O026p396O489O135j553R011p529
$$ 237759 233282 233147 229375 221532 224208 238802 236106 242132 234736 241225 247360 245807 254818 247289
15620B47289Q803J0466j0648n550J4840P509J6256K763K1437K6111j6837P956
$$ 247289 256092 266558 255910 250360 265200 272709 288965 291728 313165 339276 322439 330395
15608C30395J3509Q528o3J1533L9502J6239J4798K3881J9516J4191J8568K0377
$$ 330395 343904 352432 352369 363902 403404 419643 434441 458322 477838 492029 510597 530974
15596E30974J4327J1717M322J0766M2335M7179L3679L1780L3230M0254N2468O9970
$$ 530974 545301 557018 561340 572106 614441 661620 695299 727079 760309 800563 853031 923001
15584I23001N6758M7176N3317O9616O5707P6032R0778J03432R1399R3359R5599
$$ 923001 979759 1026935 1080252 1149868 1215575 1291607 1382385 1485817 1577216 1670575 1766174
15573A766174J26497J61577J64753J74552K12825K49102K58012L05061L61606
$$ 1766174 1892671 2054248 2219001 2393553 2606378 2855480 3113492 3418553 3780159
15564C780159M05612M67279N81934P08992Q26570R47985J085551J285034J515041
$$ 3780159 4185771 4653050 5234984 5943976 6770546 7718531 8804082 10089116 11604157
15555A1604157J819352K201921K738597L466957M438643N688677P149475Q744530
$$ 11604157 13423509 15625430 18364027 21830984 26269627 31958304 39107779 47852309
15547D7852309J0235384J1376274J1927899J1695986J0593440Q623174N986584
$$ 47852309 58087693 69463967 81391866 93087852 103681292 112304466 118291050
15540A18291050K760393o85798l912692o531020q370526r420067r722544r453335
$$ 118291050 121051443 120365645 116452953 109921933 101551407 92131340 82408796 72955461
15532G2955461q773960p839592o816488n802616m917426m164014l562578l132200
$$ 72955461 64181501 56341909 49525421 43722805 38805379 34641365 31078787 27946587
15524B7946587k776329k454627k203985j938198j729507j543221j357282j229878
$$ 27946587 25170258 22715631 20511646 18573448 16843941 15300720 13943438 12713560
15516A2713560j082477r55792q67524p56648o53669o22592n61274n14364m93472
$$ 12713560 11631083 10675291 9807767 9051119 8397450 7774858 7213584 6699220 6205748
15507F205748m45321l90119l45460l27917l04832k79946k56776k29494k26763
$$ 6205748 5760427 5370308 5024848 4696931 4392099 4112153 3855377 3625883 3399120
15498C399120j95757j92757j69959j52037j31705j36939j43737j20109j03580
$$ 3399120 3203363 3010606 2840647 2688610 2556905 2419966 2276229 2156120 2052540
15489B052540r3945q2755r1774q8808r9394p9412n1397m0531m6091r3133p2587
$$ 2052540 1958595 1875840 1784066 1695258 1595864 1516452 1465055 1424524 1378433 1285300 1212713
15478A212713m6106m1366l8125k6875l9299l8077m2039q986j6495k4994k8403
$$ 1212713 1166607 1125241 1087116 1060241 1020942 982865 940826 931840 915345 890351 861948
15467H61948k3532k8706k6899k4996k2611l2666j0937j5686l0579j1072j9768
$$ 861948 838416 809710 782811 757815 735204 702538 691601 675915 645336 634264 614496
15456F14496k4158q127l698j8943k4634k7719r671j5053J269p926R265j4917j2162
$$ 614496 590338 582211 578513 559570 534936 507217 497546 482493 483762 475836 485101 470184 458022
15443D58022p630p805M771o870O745j2013p926P330l692l385k0381j1276j1463
$$ 458022 450392 442587 447358 440488 447233 435220 427294 434624 430932 427547 407166 395890 384427
15430C84427m497p991k7150p561J3289J1072J5684J5569K305K98Q072K6725J1452
$$ 384427 379930 371939 344789 337228 350517 361589 377273 392842 395147 395445 403517 430242 441694
15417D41694j0626j1018R25k2591k9866k7070j1771j8742k9903k6299j4262j0954
$$ 441694 431068 420050 420975 398384 368518 341448 329677 310935 281032 254733 240471 229517
15405B29517O521P390j0680J0714j1753O084o401J3826l5K719O987j2202Q118
$$ 229517 236038 243428 232748 243462 231709 237793 231392 245218 245183 247902 254889 242687 250805
15392B50805J1878j6364j1684Q532q925k4432j5233j5425J278q023k2550j7967
$$ 250805 262683 246319 234635 243167 234242 209810 194577 179152 180430 172407 149857 131890
15380A31890N437J6822m217j5901N214l678O049j0519K0078J8590R491q332r100
$$ 131890 137327 154149 149932 134031 139245 135567 141616 131097 151175 169765 179256 170924 161824
15367A61824J0007J6943Q0J888k0996j4661j324M56O402L922j0502l3785l2491
$$ 161824 171831 188774 188854 190742 169746 155085 153761 154217 160619 164541 154039 120254 87763
15354H7763j4903k134P245j0361j917J3400j6471j1581J0720K442j7743k1758
$$ 87763 72860 70726 77971 67610 65693 79093 62622 51041 61761 64203 46460 24702
15342B4702J4265J9015j3390o41P806Q874J697r552p293M312J3421L615R07k3434
$$ 24702 38967 57982 44592 43951 51757 60631 62328 52776 45483 49795 63216 66831 67738 44304
15328D4304q189O647r511m849P462j0708k0966p00R557O176J2483J0453M399j014
$$ 44304 36115 42762 33251 28402 35864 25156 4190 3490 13047 19223 31706 42159 46558 45544
15314D5544k399j733o360K825M900J1951m496p036k2951M174K6368q11R433n937
$$ 45544 43145 41412 35052 37877 42777 54728 50232 43196 20245 24419 50787 49976 59409 53472
15300E3472N534P860O85j763M328L208j466j0175j535o21j3940j5223Q826J2652
$$ 53472 59006 66866 67551 65788 70116 73324 71858 61683 60148 59527 45587 30364 39190 51842
15286E1842M812K6455J495r856P183J4812K731j7797k5709J0891P753j847M583
$$ 51842 56654 83109 84604 74748 81931 96743 99474 81677 55968 66859 74612 72765 77348
15273G7348N882L977M681j097k717j6465j5245j7265k2003R374L3376K5396p160
$$ 77348 83230 87207 91888 90791 88074 71609 56364 39099 17096 26470 59846 85242 78082
15260G8082j6195q621l531P158J0537p606p724j7019M600J6126r752j1070j988
$$ 78082 61887 53266 49735 56893 67430 59824 52100 35081 39681 55807 46055 34985 32997
15247C2997j8289m226J4848J6180n172j3841k261Q219J2277R71O2n101K425K967
$$ 32997 14708 10482 25330 41510 36338 22497 20236 28455 40732 41703 41765 36664 39089 42056
15233D2056m158j2024O838J4605K0404P419m948L567p208j7000J460R554J0682
$$ 42056 37898 25874 32712 47317 67721 75140 70192 73759 66551 49551 51011 60565 71247
15220G1247j6099j1935p994o65r262l441N145j0611J9651K3543r678L95J4687
$$ 71247 55148 43213 35219 34554 25292 21851 26996 16385 36036 59579 49901 50296 64983
15207F4983J3707j1322k2886N550m783j1959p031m974J0082K1176k32p064j1068
$$ 64983 78690 67368 44482 50032 45249 33290 26259 21285 31367 52543 52311 45247 34179
15194C4179j6568j1539R91J1898J9609j271p836P327J4783o997r746J2522J6163
$$ 34179 17611 6072 7063 18961 38570 37299 29463 36790 51573 44576 34830 47352 63515
15181F3515N56j9715k3316R847N517J892J591J0783j5295k253j0185k533M143
$$ 63515 64071 44356 21040 30887 36404 38296 39887 50670 35375 33122 22937 20404 24547
15168B4547K79q884n306o074R982O086K116j3065K64Q411J4245J0320j0600n777
$$ 24547 24826 15942 10636 4562 14544 20630 22746 9681 9945 18356 32601 42921 32321 26544
15154B6544k748J5360J1929N600J398l595P195K358O709j435k639k5437j7350
$$ 26544 23796 39156 51085 56685 58083 54488 61683 64041 70750 69315 66676 41239 23889
15141B3889k2549p248P220J4169r86P374J2250m671r365k6987n876J5769K5004
$$ 23889 1340 -5908 1312 15481 14495 21869 34119 29448 20083 -6904 -12780 2989 27993
15128B7993J1226m046o59Q274j8056j5005k011J1818J0143J5477p814j6778K532
$$ 27993 39219 35173 34514 42788 24732 9727 7716 19534 29677 45154 37340 20562 23094
15115B3094K4102o70j7989L030l431N354L149J6340L2009M790j2642j2553R452
$$ 23094 47196 46526 28537 31567 28136 33490 36639 52979 84988 89778 77136 64583 74035
15102G4035Q557J0912J9040J8175J4339J8229L0532K9211j000M3267M9480O1031
$$ 74035 82592 93504 112544 130719 145058 163287 193819 223030 222030 265297 314777 375808
15090C75808N9620K5227L6492M8639L3800j1832j1240j0108j8138l7842l5172
$$ 375808 435428 460655 497147 545786 579586 567754 556514 546406 528268 490426 455254
15079D55254l5202o2202m5040j8198k0636l4839l2968j417j141q573j5124k4053
$$ 455254 420052 357850 312810 294612 273976 239137 206169 204752 203611 195038 179914 155861
15067A55861k6028j0899r634N305l224o643M206m163K571o116k1481k0320l955
$$ 155861 129833 118934 109300 114605 111381 104738 108944 104781 107352 101236 79755 59435 55480
15054E5480j326J4273r477j1391j0322p725K944J7892K697p069j6748k308j3398
$$ 55480 54154 68427 58950 47559 37237 29512 32456 50348 53045 45976 29228 26920 13522
15041A3522o191J5413M232K203K575n569M53J1673J5275J3633J8490R651l273
$$ 13522 7331 22744 26976 29179 31754 26185 26638 38311 53586 67219 85709 95360 92087
15028I2087p378k7177j5090m878O378r950j9104r213J7123M795R504M155K375
$$ 92087 84709 57532 42442 37564 43942 33992 14888 5675 22798 27593 37097 41252 43627
15015D3627J6634Q289j9144Qr48m696J9613j6763k1470M590q580k921K256K308
$$ 43627 60261 68550 49406 49414 48466 43770 63383 46620 25150 29740 21160 18239 20495 22803
15001B2803K216J7056K431k4948J752Q319N970R558o784j4029j1289N76J9233
$$ 22803 25019 42075 44506 19558 21310 29629 35599 45157 38373 24344 13055 13631 32864
14988C2864J3619r717q332m216l132J838P942p980j361K612J573P760J5430j2839
$$ 32864 46483 36766 28434 24218 21086 22924 30866 22886 21525 24137 25710 33470 48900 36061
14974C6061p023j354R218J4640M730j3032k2859L925J4193l843k2864o965O478
$$ 36061 29038 27684 36902 51542 56272 43240 20381 24306 38499 34656 11792 4827 11305
14961A1305j476j3719P667J0884o549j7339M775J0746N691j419L494O830M113
$$ 11305 9829 -3890 3777 14661 8112 -9227 -4452 6294 11985 10566 14060 20890 25003
14948B5003j6160k3222Q388J7883p870k0444j508J7048J0332m312L533O89q71
$$ 25003 8843 -14379 -5991 11892 4022 -16422 -17930 -882 9450 5138 8671 9360 8489
14935H489R241M505J0521J2586r107l266O063J312m249j1653m619j3111p865n734
$$ 8489 17730 22235 32756 45342 36235 32969 39032 40344 36095 24442 19823 6712 -1153 -6887
14921f887p889K0547P429J6910J964k2250o922J3685J4091o236q460L519O665
$$ -6887 -14776 5771 13200 30110 32074 9824 2902 16587 30678 24442 15982 19501 26166
14908B6166R68N398J6889j6797j5650M377P259j0374p591j0645J7269o20j426
$$ 26166 27134 32532 49421 32624 16974 21351 28610 18236 10645 0 17269 16649 15223
14895A5223J0987j5051j508l356J0091P992k3234r299p372q245M911J3767J5379
$$ 15223 26210 11159 9651 6295 16386 24378 1144 -8155 -15527 -23772 -18861 -5094 10285
14882A0285n726j1372K313Q098j1399k069K511L900J1661K227K363j7891J2138
$$ 10285 4559 -6813 -4500 3598 -7801 -9870 -7359 -3459 8202 10429 12792 -5099 7039
14869G039J6638l067N954L7286J2340l5803j1117j4038m223Q240k5482K810J1645
$$ 7039 23677 20610 26564 63850 76190 40387 29270 15232 11009 19249 -6233 -3423 8222
14856H222p468Q035J4350J842j8702k3496Q017J1624j6427J6660J2824J2316K1
$$ 8222 754 8789 23139 24981 6279 -17217 -9200 2424 -14003 2657 15481 27797 27818
14843B7818P501k1709j504M936l06j162j1105j3596J0505Q816R244P991j5505
$$ 27818 35319 13610 12106 17042 16736 15574 4469 -9127 1378 10194 19438 27429 11924
14830A1924j7760j1944q905K1138J7007l737N497n13j9355j2172o049N853J4985
$$ 11924 -5836 -17780 -26685 -5547 11460 7723 13220 12707 -6648 -18820 -24869 -19016 -4031
14817d031J3450Q438K290j5164j5553r44j4069j3175J3176M310k146J982K2367
$$ -4031 9419 17857 20147 4983 -10570 -11514 -25583 -38758 -25582 -21272 -23418 -21436 931
14804I31L922p142l495K537P922k183Q941q967l738k792o427n998q165P32R598
$$ 931 4853 -2289 -5784 -3247 4675 2492 11433 2466 -1272 -4064 -10491 -16489 -24654 -23922 -14324
14789a4324L534M117k9177j5322O686J9529K9277J3185j2182j6556k5706P964
$$ -14324 -10790 -6673 -35850 -51172 -44486 -24957 4320 17505 5323 -11233 -36939 -28975
14777b8975m36q568K8100K790j3421J0269K2621L130j092N35j231N540j2110j8855
$$ -28975 -29411 -37979 -9879 -7089 -20510 -10241 12380 15510 14418 14953 13722 19262 7152 -11703
14763a1703L519J205q353K623J9395L602j0069j964j6930J6163J9192m228N601
$$ -11703 -8184 -6979 -15332 -12709 6686 10288 219 -1745 -18675 -2512 16680 12452 18053
14750A8053J3649j9142j8648J6603p095j0673k762k371J4305P847M079L517p085
$$ 18053 31702 12560 -6088 10515 3420 -7253 -10015 -12386 1919 9766 13845 17362 10277
14737A0277R997L609P07N17j1472r799l674P743j1074j3977K1736R174N70K882
$$ 10277 20274 23883 24590 25107 13635 3836 162 7905 -3169 -17146 4590 13764 14334 17216
14723A7216n695M026j9399j5709L722K0335k280q637J039N98l417M812J6143N493
$$ 17216 11521 15547 -3852 -19561 -15839 4496 2216 -6421 -5382 -4784 -8201 -3389 12754 18247
14709A8247J398K354L369O949m343l4997k1410J1188M349M46J6616J6541J5808
$$ 18247 19645 21999 25368 32317 27974 -7023 -28433 -17245 -12896 -12450 4166 20707 36515
14696C6515k181j7198m705k370j2662n646o501N21r429m413j5896N860L984J4973
$$ 36515 34334 17136 12431 10061 -2601 -8247 -14748 -14227 -23656 -28069 -43965 -38105 -34121 -19148
14682a9148O202m384N340M909Q404L909j2783j3784j3154J525J2239J2584J3686
$$ -19148 -12946 -17330 -11990 -7081 1323 5232 -7551 -21335 -34489 -32964 -20725 -8141 5545
14669E545j5382n950J022J8643r302K54l047M752n246q414K908R684M613p611
$$ 5545 -9837 -15787 -14765 3878 -5424 -5170 -8217 -3465 -8711 -17125 -14217 -4533 80 -7531
14655g531R036k000m057j4135L919K996m38K1415J8453Q700k6518k052Q865o205
$$ -7531 1505 -495 -4552 -18687 -14768 -11772 -12210 9205 27658 36358 9840 7788 16653 10448
14641A0448l868J2845K7484j426j8547j299o600k8927k0215o53M202N520l526
$$ 10448 6580 19425 46909 45483 26936 25637 19037 -9890 -30105 -30758 -26556 -21036 -24562
14628b4562K2209J0367n254j4630q681J2904Q329J325Q478P932J2810N937j4607
$$ -24562 -2353 8014 2760 -11870 -20551 -7647 682 2007 10485 18417 31227 37164 22557
14615B2557k3697j6367Q706K116J21J1626j827j0382K296Q169J4064K596J082
$$ 22557 -1140 -17507 -8801 -6685 -6564 5062 3235 -7147 -4851 3318 17382 19978 21060
14602B1060j0116q418k685j9826L405J0535K6152j5296k9861o907J453l733m988
$$ 21060 10944 2526 -159 -19985 -16580 -6045 20107 4811 -25050 -31957 -30504 -34237 -39225
14589c9225Q880K2884R900j0407l399j9879r839M19K862J8154N504o984M239r856
$$ -39225 -30345 -7461 2439 -7968 -11367 -31246 -41085 -40666 -37804 -19650 -14146 -21130 -16891 -26747
14575b6747l978R743j2488P702k691J8016J3110J3041m529j2834P063j948P477
$$ -26747 -30725 -20982 -33470 -25768 -28459 -10443 2667 15708 11179 -1655 5408 3460 10937
14562A0937K3565L052r128o91n47P637j3571j3093j6451n976J7840M915N749P800
$$ 10937 34502 37554 28426 27735 27188 34825 21254 8161 -8290 -14266 3574 8489 14238 22038
14548B2038j8P568j9886l812l192j211J2183J198o58L966j811j7743p111Q867
$$ 22038 22020 29588 9702 5890 2698 1487 13670 14868 14210 18176 16365 -1378 -8489 378
14534C78j9302L847J5380q6J0129r591j3254O428L9969M220o687k3391j6057O290
$$ 378 -18924 -15077 303 217 10346 755 -12499 -6071 33898 38118 31431 8040 -8017 -1727
14520a727Q634J3864n481j4438p495j0667L078P271K1705Q244j1707j0731P536
$$ -1727 6907 20771 15290 852 -6643 -17310 -14232 -6961 14744 22988 11281 550 8086
14507H086O711q294J776Q897L544R358L758j8348j6799j8929O191O001J7816R537
$$ 8086 14797 6503 8279 17176 20720 30078 33836 15488 -1311 -20240 -14049 -8048 9768 19305
14493A9305j67j6834J825Q261K2941j0605r691k592j4303j8429j1755K9952K8296
$$ 19305 19138 2304 4129 12390 35331 24726 15035 12443 -1860 -20289 -32044 -2092 26204
14480B6204j6984m580j0490Q581j2319J104l513L15j6670K508J5453J0037k277
$$ 26204 9220 4640 -5850 2731 -9588 -8484 -11997 -11682 -28352 -25844 -10391 -354 -2631
14467b631K646J1422L762j6813j0742j6159k450J016M884k306P807m685J119J2946
$$ -2631 15 11437 15199 -1614 -12356 -28515 -30965 -29949 -25065 -27371 -19564 -24249 -23130 -10184
14453a0184K1332P162j5734P758P245q428J276r143N609R958q590p742q26l882
$$ -10184 11148 18310 2576 10334 17579 9151 10427 1284 6893 16851 8261 519 -307 -4189
14439d189N55N895O253N948P648q350j5845j1319M683J3074J6727n168o760P029
$$ -4189 -3634 2261 8514 14462 22110 13760 -2085 -13404 -8721 4353 21080 15912 9152 16181
14425A6181m322k10r440M047j5530j1902n448K9965l238J232J736j0605j2670
$$ 16181 11859 11649 2209 6256 -9274 -21176 -26624 3341 103 1335 3071 -7534 -20204
14412b0204L6090J2704l151p740q968O701m215n301N388J1234m406J110L789k1461
$$ -20204 15886 28590 25439 17699 8731 15432 11217 5916 11304 22538 18132 19242 23031 1570
14398A570J053j632j740J4002M89q723K550M214j2964k132P27l26j779k256o052
$$ 1570 2623 991 -749 13253 13742 5019 7569 11783 -1181 -3313 -2586 -2912 -4691 -6947 -12999
14383a2999N399k38J0107O971J663m778n973L192J5692q860q84k707J7382J1633
$$ -12999 -7600 -7838 2269 9240 10903 6125 152 3344 19036 10176 9292 6585 23967 35600
14369C5600j4924j777O081j3277l913Q683p329q036k829N639j6043j7094j7082
$$ 35600 20676 18899 24980 11703 7790 16473 9144 1108 -1721 3918 -12125 -29219 -46301
14356d6301j672K1820R681J264j80P7m256P681q879l750n91Q677J8398J1292J2148
$$ -46301 -47973 -26153 -16472 -15208 -15388 -15311 -19567 -11886 -20765 -24515 -25106 -16429 1969 13261 25409
14341B5409j494j428j8653j4994k416J7403K1205o91k36j0190j2059k4229j1929
$$ 25409 23915 22487 3834 -11160 -13576 3827 25032 24341 24105 13915 1856 -22373 -34302
14328c4302L3258L9570j4477k3331L995J7037n657j8676o248N461l881r324J1716
$$ -34302 -1044 38526 24049 718 4713 21750 16093 -2583 -8831 -3370 -7251 -16575 -4859
14315d859M716R262J92m394J760p470q113P226j1230M400o003l617R176J1318
$$ -4859 -143 9119 9311 4917 6677 -793 -8906 -1680 -12910 -8510 -14513 -18130 -8954 2364
14301B364N53j0978k622N128P630N533n702p629J8025J8172r209j2249q749r433
$$ 2364 2917 -8061 -10683 -5555 2075 7608 1906 -5723 12302 30474 21265 9016 267 -9166
14287i166j3705j881J0347J44O350J325K191l194J14Q089J2982k6170n254m929
$$ -9166 -22871 -24752 -14405 -14261 -7911 -6586 -4395 -7589 -7475 614 13596 -12574 -17828 -22757
14273b2757Q787j1894j8189J1145K4505K828J992k376N685o313J8144O181j652
$$ -22757 -13970 -25864 -44053 -32908 -8403 -5575 -3583 -5959 -274 -6587 11557 17738 16086
14260A6086J3620N232j233j2567j8601l505o3k468K013K337r134J1296P184O348
$$ 16086 29706 34938 33705 21138 2537 -968 -1031 -3499 -1486 851 -8283 3013 10197 16545
14246A6545R042j621R594J6602J034j2868j1758j1467N882p340p352j4329Q177
$$ 16545 25587 23966 33560 50162 51196 38328 26570 15103 20985 13645 6293 -8036 141
14233A41j1558L862k039m423m027o99Q373J3396J2052j278R483p984j5507o878
$$ 141 -11417 -7555 -9594 -14017 -18044 -18743 -10370 3026 15078 13800 23283 15299 -208 -7086
14219g086j4693j0J5307L2663j3861l1475N909l981P1R175q372M081K155j1701
$$ -7086 -21779 -21789 -6482 26181 12320 -19155 -13246 -17227 -17156 -7981 -16353 -12272 -10117 -21818
14205b1818n273J5726J9718j760j3023m610K6590J983r334J402O552k1671j2145
$$ -21818 -27091 -11365 8353 6593 -6430 -11040 15550 17533 8199 9601 16153 -5518 -17663
14192a7663J4295o917r815m666j511J6765K3959J0974q703k8506k610J4125j3662
$$ -17663 -3368 -10285 -20100 -24766 -26277 -9512 14447 25421 16718 -11788 -14398 -273 -13935
14179a3935p641N765j1442P438O921N263K9963J176M897K818j1588j7816n685
$$ -13935 -21576 -15811 -27253 -19815 -12894 -7631 22332 23508 28405 31223 19635 1819 -3866
14166c866N81R538M380J9441K607q643k1684m057J3189L372J1604L01Q02n784
$$ -3866 -3285 6253 10633 30074 32681 24038 2354 -1703 11486 14858 26462 26763 27565 21781
14152B1781O500q083k389k047p767k6361q94k1074j283K5167K0687J4363j5785
$$ 21781 28281 20198 17809 15762 7995 -18366 -19260 -40334 -41617 -16450 4237 18600 2815
14139B815j0173K709q39J119M334J3791q499m832O865Q806L304p734q016P629
$$ 2815 -7358 -4649 -5488 -4369 -35 13756 5257 425 7290 16096 19400 11666 3650 11279
14125A1279k399k3864k217n232J6342Q130q331O770M895j3102j39J1722j1598
$$ 11279 8880 -14984 -17201 -22433 -6091 2039 -6292 478 5373 -7729 -7868 3854 -7744
14112g744l550J3762k1480j2289M142M49K0181L3056J1218k5754p280O40j0215
$$ -7744 -11294 2468 -19012 -31301 -27159 -26710 -6529 26527 37745 11991 4711 5351 -4864
14099d864k43Q204j0708m798M606J6516k568n021J6064Q739k0199k0531Q801K693
$$ -4864 -5107 3097 -7611 -12409 -7803 8713 6145 1124 17188 25927 5728 -14803 -6002 -3309
14085c309P573q966L33R00o749r314O570Q681q780j2743J5673n050J1666J0774
$$ -3309 4264 -4702 -4369 -3469 -10218 -19532 -12962 -4281 -13061 -25804 -10131 -15181 -3515 7259
14071G259L743p089o162r216K0807K9325r350j8553j1946K437K0335J1581o459
$$ 7259 11002 3913 -2249 -11465 9342 38667 29317 10764 -1182 1255 21590 33171 26712
14058B6712j7839o445q191j135M175N38L527j528R403L234m586M884J4887j6354
$$ 26712 8873 2428 -5763 -6898 -2723 -2185 1342 -186 9217 12451 7865 12749 27636 11282
14044A1282j4949R326j6010N387J5655j7357j6132j569j796M910L1376j6l719
$$ 11282 -3667 5659 -10351 -4964 10691 -6666 -22798 -24367 -26163 -21253 10123 10107 6388
14031F388J7844J382N011K489k01q799j6497J0876J4369l207q387J744m796p272
$$ 6388 24232 25614 30625 33114 32913 24114 7617 18493 32862 29655 21268 23012 18216 10944
14017A0944j7797j8788P668j655L801J2666Q618J4399P503k531K093j2232J6332
$$ 10944 -6853 -25641 -17973 -19628 -15827 -3161 5457 19856 27359 24828 26921 14689 31021
14004C1021n42k1066l417K0543K93j6096j1756J716j516J588j143o671j4542J8852
$$ 31021 30479 9413 5996 26539 26832 10736 -1020 696 -820 768 -375 -7046 -21588 -2736
13990b736J0613J4934J7156n772l576o891j8217o694o228r60M192p996j0358j0377
$$ -2736 7877 22811 39967 34195 30619 23728 5511 -1183 -7411 -8371 -4179 -12175 -22533 -32910
13976c2910j3460Q092J2807J180m890M589K0594o33j3722k382K904P560O021N912
$$ -32910 -46370 -38278 -25471 -24291 -29181 -24592 -3998 -4631 -18353 -20735 -17831 -10271 -4250 1662
13962A662r520M204M475K280p497j6380O138o114M316J814p975K040P113n87r011
$$ 1662 -7858 -3654 821 3101 -4396 -20776 -14638 -20752 -16436 -14622 -22597 -20557 -13444 -14031 -23042
13947b3042j590O724R631O45n208r166J5217P162K26J9944J5644j8202p699m195
$$ -23042 -24632 -17908 -8277 -7632 -12840 -22006 -6789 373 599 20543 36187 17985 10286 6091
13933F091j5703L760j0278k1441K2137K094J3069K132k662n207R465P923K272
$$ 6091 -9612 -5852 -16130 -37571 -15434 -13340 -271 1861 -801 -6008 3457 11380 13652
13920A3652M740r684K79j3905j4760p14j1893j561K0463J8355j6360j177K2723
$$ 13652 18392 8708 8987 -4918 -19678 -20392 -32285 -33846 -13383 4972 -11388 -12565 10158
13907A0158M240j8914K944M197P803k11J014k96j2558m449J3512q089j189j888
$$ 10158 14398 -4516 -1572 2625 10428 10217 11231 10935 -1623 -6072 7440 -649 -1838 -3726
13893c726r208k741K5765K2741l7448p829O741J5185O861q651K0766P06j5188
$$ -3726 -12934 -15675 10090 32831 -4617 -12446 -5705 9480 16341 7690 28456 29162 13974
13880A3974J0659J2820j6978l873J2610q773r008j9443k2784K0654K3767J4235
$$ 13974 24633 37453 20475 16602 29212 20439 11431 -8012 -30796 -10142 13625 27860
13868B7860j1213o375P913n46j0211M599q797j4483M025J3601K500q854L977J7162
$$ 27860 16647 10272 18185 17639 7428 12027 3230 -11253 -7228 6373 8873 19 3996 21158
13854B1158N176j2196k2079O991K229p734M754n231P846J8618j603n828M465P608
$$ 21158 26334 14138 -7941 -950 1279 -6455 -1701 -6932 914 19532 17929 12101 16566 24174
13840B4174p03k1011j6463m510L646J3205J2512q693Q544L750P066J1995j5881
$$ 24174 23471 2460 -14003 -18513 -14867 -1662 10850 2157 10701 14451 21517 33512 17631
13827A7631r309J407l847p317l17l603K1495R371j5091j5354k3046K4332O656
$$ 17631 8322 9729 5882 -1435 -1752 -5355 16140 25511 10420 -4934 -27980 -3648 3008
13814C008p028O95Q266j4821r816J8253R393p899J2218n735j7357J290l97r945
$$ 3008 -4020 -3325 4941 -9880 -19696 -1443 7950 51 12269 6534 -10823 -9533 -9930 -19875
13800a9875j0872P692J5359J8495K4450l112k4826r882R375j1405m316M737K0751
$$ -19875 -30747 -23055 -7696 10799 35249 32137 7311 -2571 6804 -4601 -8917 -4180 16571
13787A6571P669K542J1819J1157k2310j0766j807j1382L49j7070N564K0512R511
$$ 16571 24240 26782 38601 49758 27448 16682 14875 3493 3842 -13228 -7664 12848 22359
13774B2359m6m498j421K501R693J7692p929k4582j1890J7113K416M01m357J4165
$$ 22359 22313 17815 16394 18895 28588 46280 38351 13769 1879 18992 21408 21809 17452 31617
13760C1617J3107j2620m232J5290j116k0359l059N676O774k3736m067J3265l148
$$ 31617 44724 32104 27872 43162 42046 21687 18628 24304 31078 7342 3275 16540 13392
13747A3392J931j5298k9191Q046Q666J1163j5178J4363K0711p932j9757J5474
$$ 13392 15323 25 -29166 -21120 -12454 -1291 -16469 -2106 18605 10673 -9084 6390
13735F390q514k6035p470J9355K1345M835j0038J1020o313q612j1319J2524m30
$$ 6390 -2124 -28159 -35629 -16274 5071 9906 -132 10888 4575 -4037 -15356 -2832 -3262
13722c262J1445J4500O000m833j8031k839j945k036m212Q290K0532J5244J8025
$$ -3262 8183 22683 28683 23850 5819 2980 1035 -1001 -5213 3077 23609 38853 56878
13709E6878k7406k0840J0346K6252Q210M443j4397j2360l752q461j2383L519M619
$$ 56878 29472 8632 18978 45230 53440 57883 43486 31126 27374 18913 6530 10049 14668
13696A4668j2056n15J4093J9980j5482p911l207l418L825m334k0338K822J7246
$$ 14668 2612 2097 16190 36170 20688 12777 9570 6152 9977 5643 -14695 -11873 5373
13683E373J230j629M351n395k928j0590L018K6203J97J4687J5608n171j3757j395
$$ 5373 6603 4974 9325 3930 1002 -9588 -6570 19633 19830 34517 50125 44954 31197 29802
13669B9802J8829L737j2207j2517P151p329M749O310J2125Q562o739r556j2993
$$ 29802 48631 52368 40161 27644 34795 27466 32215 38525 50650 59212 52473 42917 29924
13656B9924J6000j539j643O880k386q390J6391J7972r180j1803Q334J3216K700
$$ 29924 45924 44385 42742 49622 47236 38846 55237 73209 64029 52226 60560 73776 76476
13643G6476l550j3899o478j5925L467l984P29j0963J7221m366m924O767j9442
$$ 76476 72926 59027 52549 36624 40091 36107 36836 25873 43094 38728 33804 40571 21129
13630B1129j2941K0654p054o32n167M713R441n604j9157j5118j0756Q494O395
$$ 21129 8188 28842 21788 21156 15989 20702 30143 24539 5382 -9736 -20492 -11998 -5603
13617e603k100M577J9915J6031R978j8424l1483R88j772K6216K9237J3449J814
$$ -5603 -7703 -3126 16789 32820 42798 24374 -7109 -6121 -7893 18323 47560 61009 62823
13604F2823P45L400k7367j0668R712J8278j6738k7593n764p39J6603j174j340
$$ 62823 63568 66968 39601 28933 38645 56923 40185 12592 6828 6089 22692 21518 20178
13591B0178K6141J513j3941p678j1161q469J0696O756J3813k102r775p885j5118
$$ 20178 46319 47832 33891 26213 15052 6583 17279 24035 37848 35746 25971 18086 2968
13578B968N150J8903j951j6115P262N188N213M906L845J4422K0352m442k9685
$$ 2968 8118 27021 25070 8955 16217 21405 26618 31524 35369 49791 70143 65701 36016
13565C6016j1413j5065M471j1379j3000N925M156l897L5960M348o540P811m094
$$ 36016 24603 9538 14009 2630 -10370 -4445 -289 -4186 31774 36122 29582 37393 33299
13552C3299M054Q523l916j3386o671j406l873l331j6721k191j718k797N46j117
$$ 33299 37353 45876 41960 28574 21903 20497 16624 13293 -3428 -5619 -7337 -10134 -9588 -10705
13538a0705L936J3178j489J1148J6789p65m734L669J3345j920q278l1903p854
$$ -10705 -6769 6409 4920 16068 32857 32092 27358 31027 44372 42452 34174 2271 -5583
13525e583m842r725L899O843J0283J2475L751k111n652n908Q667n953p680J5935
$$ -5583 -10425 -20150 -16251 -9408 875 13350 17101 14990 9338 3430 12097 6144 -1536 14399
13511A4399K4214j261k6452j4912k158J6649K3877J1124j7872j3832r447l092
$$ 14399 38613 37352 10900 -4012 -6170 10479 34356 45480 27608 13776 4329 1237
13499A237K1007K608q901q094J0876m642r409P870L781j0294J3416J1379O519
$$ 1237 22244 24852 15951 7857 18733 14091 4682 12552 16333 6039 19455 30834 37353
13486C7353N05n548q708m713J252J6137J9230j5068O25L385j3395J066Q754M654
$$ 37353 37858 32310 23602 18889 20141 36278 55508 40440 41065 44450 31055 32121 40875 45529
13472D5529m235j6321m673K188N67J1955K17j4908j5487L231P546N864R182q507
$$ 45529 41294 24973 20300 22488 23055 35010 35227 20319 4832 8063 15609 21473 30655 22148
13458B2148j9786n777p535l715J2134R090R0K9094K4014k944k5398P17j7450K717
$$ 22148 2362 -3415 -10950 -14665 -2531 6559 6649 35743 59757 56813 31415 32132 14682 17399
13444A7399p193M979Q313k05O265J0809j4665r342J2345M804l511n691L444Q726
$$ 17399 10206 15185 23498 23293 29558 40367 25702 16360 28705 33509 29998 24307 27751 36477
13430C6477J7405l480L27m918j4751l35n548J952J861j7403Q863M450M572m854
$$ 36477 53882 50402 50729 45811 31060 30725 25177 27129 28990 11587 20450 24900 29472 24618
13416B4618K7680j3959k0506r102j4487N089R775J4986J1552j1857k4484j6768
$$ 24618 52298 38339 17833 8731 -5756 -667 9108 24094 35646 23789 -695 -17463
13404a7463J296K3898M129j918k277j754J1569j4974P001K4779J0713J6065l40
$$ -17463 -16167 7731 11860 9942 7665 5911 17480 2506 9507 34286 44999 61064 60724
13391F0724m481l688N066P768P3m888j1805o044j5569k0264k6201j0834J8489
$$ 60724 56243 52555 57621 65389 65462 60574 48769 42725 27156 6892 -19309 -30143 -11654
13378a1654j0746J0883M359O00K8978R828q679k811J6627K692K598K3953J583
$$ -11654 -22400 -11517 -7158 -6558 22420 32248 23569 20758 37385 40077 42675 66628 68211
13365F8211j0732k8071k0111j1637J1365K8914J0950j4218j5080K176J5328J8131
$$ 68211 57479 29408 9297 -2340 9025 37939 48889 34671 19591 21767 37095 55226
13353E5226j899j7983q4K785J644j0017P001O692J0799O820n955J743j0230j1914
$$ 55226 53327 35344 35260 38045 39689 29672 36673 43365 54164 60984 55029 56772 46542 34628
13339C4628j1073q26q874L1596J1536p7m906k586P46J4143j1927j5478k2718r184
$$ 34628 23555 22729 13855 45451 56987 56910 52004 49418 50164 64307 52380 36902 14184 5000
13325E000J8531J6608o489J233m857Q161L98K685K760N30N194r256j0319J9785
$$ 5000 23531 40139 33650 34883 30026 38187 38585 41270 44030 44560 49754 40498 30179 49964
13311D9964M772p644n981N388p422J2689j2014k5223r135J5313K0301K2723j481
$$ 49964 54736 47092 41111 46499 39077 51766 39752 14529 5394 20707 41008 63731 62250
13298F2250k611K567l308j6728m470R070N810n893j2426K161m835j3024m703J1264
$$ 62250 59639 62206 58898 42170 37700 46770 52580 46687 34261 36422 31587 18563 13860 25124
13284B5124q85K022O402K233P838J0157P685j4077p23J86R786J0075n679q767
$$ 25124 24239 26261 32663 34896 42734 52891 60576 46499 45776 45962 55748 65823 60144 51377
13270E1377j6084Q186J4690k6264k1497n37J2715m138m359o624j6079J4525J4875
$$ 51377 35293 43479 58169 31905 10408 9871 22586 18448 14089 7465 -8614 5911 20786
13257B0786J0622m632p804j649j8599m908L263O253J2316K1054L798o00r178j899
$$ 20786 31408 26776 18972 17323 -1276 -6184 -2921 3332 15648 36702 40500 39900 30722 28823
13243B8823m837J5200J8376J527k907J4287j5559j8192j0542P986J2880J2983
$$ 28823 23986 39186 57562 59089 56182 70469 54910 36718 26176 34162 47042 60025
13231F0025Q067J3469o256l4251j5365P40J59J5506J710j4170p040K572K2762
$$ 60025 68092 81561 75305 41054 25689 26429 26588 42094 43804 29634 22594 25166 47928
13218D7928J2541O448k2678k6519J1271J2310P262q403J8425p909j0609r533L64
$$ 47928 60469 66917 44239 17720 28991 41301 48563 40160 58585 50676 40067 30534 30898
13205C0898R849Q013n35q047j9889k570P616J0422J8644M83j2395n330L3975J127
$$ 30898 40747 48760 48225 40178 20289 17719 25335 35757 54401 54884 42489 37159 71134 72261
13191G2261j8286n341j7580O138J5816L164j3159M971K858j3206j1564J0562J309
$$ 72261 53975 48634 31054 37192 53008 56172 43013 47984 50842 37636 26072 36634 37943
13178C7943L155n788K465J8368M968R869Q045r136k2256n497j263J5930N373j4987
$$ 37943 41098 35310 37775 56143 61111 70980 79025 69889 47633 42136 40873 56803 62176 47189
13164D7189J2194j4694j3675O537K4487m108m64L265Q704k6451k5381L061J4147
$$ 47189 59383 44689 31014 37551 62038 57930 57466 60731 69435 42984 17603 20664 34811
13151C4811J6824j0877l403K3382N971j8516n247J287k0437j9079Q693J0234J8819
$$ 34811 51635 40758 37355 60737 66708 48192 42945 44232 23795 4716 13409 23643 42462
13138D2462J1319m675j4629P71K3535Q755l3847n70L1099J3126j3756j2284k1500
$$ 42462 53781 49106 34477 35248 58783 67538 33691 33121 64220 77346 63590 51306 29806
13125B9806p977j792p57m808K471J4951J5090J1531r232j1196l734Q156L387k0773
$$ 29806 21829 20037 19280 14472 16943 31894 46984 58515 49283 38087 34353 42509 45896 25123
13111B5123N743P167M922j663R354P41k6446L07K6656J2895J984j0757m607J4474
$$ 25123 30866 38033 42955 41292 50646 51387 24941 25248 51904 64799 66783 56026 51419 65893
13097F5893J91r569P024J4358J4383L632k3363l1559N839J004Q485J8448J593
$$ 65893 66084 56515 63539 77897 92280 95912 72549 40990 46829 47833 56318 74766 76359
13084G6359j6072k353J736J1060J3439o275r849j9105j5229J5843K4151K832Q003
$$ 76359 60287 57934 59670 70730 84169 77894 68045 48940 33711 49554 73705 76537 84540
13071H4540j8573k3365k730J1306j088J934J9845Q350k4787J432R554Q804P423
$$ 84540 65967 42602 39872 51178 50090 52024 71869 80219 55432 56864 66418 75222 82645
13058H2645q809l118j6818Q293R987L011N735J582j2450O068j1778R536J9993
$$ 82645 73836 70718 53900 62193 72180 75191 80926 82508 70058 76126 64348 73884 93877
13045I3877R551K314j8620j3339j9522j7653q857J3984J8626j6071j089J7016
$$ 93877 103428 105742 87122 73783 54261 36608 27751 41735 60361 44290 43201 60217
13033F0217J4614M926p860L496q623r931r722N803j0376q086M317R979K2923J1255
$$ 60217 74831 79757 71897 75393 66770 56839 47117 52920 42544 34458 38775 48754 71677 82932
13019H2932O139Q890j1778q661J0560R085j5740j5155j1879l93P629j068k027
$$ 82932 89071 97961 86183 77522 88082 97167 81427 66272 54393 54000 61629 60561 58534
13006E8534L117N748Q132q833j1301J8076J5357K173J6354j789r485k4357k73
$$ 58534 61651 67399 75531 66698 55397 73473 88830 91003 107357 105568 96083 71726 71453
12993G1453K76q67J1804N117R258J655P716j2722j9826q193K116P010q892J2592
$$ 71453 71729 70862 82666 87783 97041 98696 106412 93690 73864 65671 67787 74797 65905 78497
12979G8497J3758p070q906k968J3184J564n988O028O665J4920o370j5097o68r653
$$ 78497 92255 85185 76279 73311 86495 88059 82071 88099 94764 109684 103314 88217 87549 77896
12965G7896J5218J2896n598p742l561j451O848q553K359j2400j9677R059J8399
$$ 77896 93114 106010 100412 92670 89109 87658 94506 85953 88312 75912 56235 65294 83693
12952H3693j395j2114j2704J2828J3430p914P436J3935Q144p62l703O007r8p168
$$ 83693 82298 70184 57480 70308 83738 75824 83260 97195 105339 104577 100874 106881 106783 99615
12938I9615K308m641k0993m747k568J3124R827o699J204l989n912Q232K3174P529
$$ 99615 101923 97282 76289 71542 68974 82098 91925 85226 86430 82441 76529 84761 107935 115464
12924A15464l444j4648J887J3178O60j2524q022P961j0585n486J9785P332j0029
$$ 115464 112020 97372 99259 112437 113097 100573 92551 100512 89927 84441 104226 111558 101529
12911A01529l785j0613j0802o207J0552P693Q8L087K7115N161j1101r932J0296
$$ 101529 97744 87131 76329 70122 80674 88367 88455 91542 118657 123818 112717 102785 113081
12898A13081Q795k637q123p756j26n165M095k953k649k96J5748l30j3647J067
$$ 113081 121876 119239 111116 103360 103234 98069 102164 99211 96562 96266 112014 111684 98037 99104
12884I9104J1573j2012M62J6180O003m322P018o736j5285J9963J4512P8O477m722
$$ 99104 110677 98665 99127 115307 121310 116988 124006 117270 101985 121948 136460 136538 143015 138293
12870A38293o559k1231R578K3987j9764J318j9347k2350j7591p678J5379K2504
$$ 138293 131734 110503 120081 144068 124304 125622 106275 83925 66334 58656 74035 96539
12858I6539Q799J1632M066j4355P838J0553R205L944P660j304k866J0643o716
$$ 96539 105338 116970 121036 106681 114519 125072 134277 138221 145881 144577 141711 152354 145638
12845A45638l700J3157m737l865N052j2154R946j0703k1562o00O372P407R149
$$ 145638 141938 155095 150358 146493 151545 139391 149337 138634 117072 116472 122844 130251 139400
12832A39400p85r010j1248P49P961r256o453k6409r118P717J2203j43J3349J6224
$$ 139400 138615 129605 118357 119106 127067 117811 111358 84949 75831 83548 95751 95608 108957 125181
12818A25181o718K051K1621O998k622j3616Q644K0430J0495j5826l4486k0302
$$ 125181 118463 120514 142135 149133 146511 132895 141539 161969 172464 156638 122152 101850
12806A01850k1058L3160O797K055l773r690l592K3182J0165p447J0339M504N432
$$ 101850 80792 113952 120749 122804 119031 109341 105749 128931 139096 131649 141988 146492 151924
12793A51924o991j62K5501K902k6316k9471q241L407p176M812N731N886O116m365
$$ 151924 144933 144771 170272 173174 146858 117387 109146 112553 105377 110189 115920 121806 127922 123557
12779A23557Q353P941j182R790l318j2675L526K3238Q506l500j6887m738m080
$$ 123557 131910 139851 138669 148459 145141 132466 135992 159230 167736 164236 147349 142611 138531
12766A38531j793N342J0863J0512R005O445j2880j262r522j202J2666p296N42
$$ 138531 136738 142080 152943 163455 172460 178905 166025 164763 155241 154039 166705 159409 159951
12753A59951J3180J077Q570j6027j3672J3293q964j7540Q951p349K049J505p229
$$ 159951 173131 174208 182778 166751 153079 166372 157408 139868 148819 141470 143519 145024 137795
12740A37795J2817k498j5613J6308J0810j0717P453R853K506N338k3805p35n245
$$ 137795 150612 148114 132501 148809 159619 148902 156355 166208 168714 174052 150247 149512 144267
12727A44267o950J310J1776J9657J0815l479k0179j0097J2366p850r759Q224J8389
$$ 144267 137317 138627 150403 170060 180875 177396 157217 147120 159486 151636 141877 150101 168490
12714A68490J0482N889j075o421k3417m840K3642R605q79j4311P95P630O457O383
$$ 168490 178972 184861 183786 177365 153948 149108 172750 182355 181476 167165 167960 175590 182047 188430
12700A88430k2420l133l312r244L634J6796R180N483j6026j113L4k725J4507K6023
$$ 188430 166010 162877 159565 150321 153955 170751 179931 185414 169388 168275 168309 165584 180091 206114
12686B06114j8842J540J6033j0377j2488Q845M054J1361r617k1253n717J5698
$$ 206114 187272 188812 204845 194468 181980 190825 194879 206240 196623 175370 169653 185351
12674A85351J664p321O722J04J4640M751o731K413r743L562j8678j0679J4298
$$ 185351 187015 179694 186416 186520 201160 205911 199180 201593 191850 195412 176734 166055 180353
12661A80353L781K877J2076j6821k2662K016K2940J9162o197k1784j3434K526
$$ 180353 184134 187011 199087 182266 159604 161620 184560 203722 197525 175741 162307 164833
12649A64833Q089K4760K3313l683k2676Q144N812O995m852l0703j1283K6864N701
$$ 164833 172922 197682 220995 217312 194636 202780 208592 215587 210735 180032 168749 195613 201314
12636B01314p958j3042K8985J5138o042J313q975j4026j1591J2142J6031j6660
$$ 201314 193356 180314 209299 224437 218395 219708 210733 196707 185116 197258 213289 196629
12624A96629l125J6069L605K3047J5910K417l638n591J072O30L074O15j5931p783
$$ 196629 193504 209573 213178 236225 252135 254552 250914 245323 246395 247025 250099 250714 234783 227000
12610B27000M914Q228k371m960n242O780K476n932q842p089K7339J2839q516J7343
$$ 227000 231914 240142 237771 232811 227569 234349 236825 230893 222051 214962 242301 255140 246624 263967
12596B63967J0612j7060L48R05J2013J2710L090j0799p961L077J2110k0628m872
$$ 263967 274579 257519 257867 258772 270785 283495 286585 275786 267825 270902 283012 262384 257512
12583B57512O82J5759J2054l464l445k0128m826k377Q205l951Q528n00q312M902
$$ 257512 258194 273953 286007 282543 279098 258970 254144 251767 259972 256021 264549 264049 255737 260639
12569B60639M148J7296j565o17J2892l765j0260r80j3189p429K92R075J7974J4685
$$ 260639 264787 282083 280518 279901 292793 289028 278768 277788 264599 257170 257462 266537 284511 299196
12555B99196L458K1194R752j426j1326j640K070k914L300n959K913J3056K983
$$ 299196 302654 323848 333600 332174 320848 319208 321278 318364 321664 315705 318618 331674 334657
12542C34657j2096j5498P517K759o478J5065R719P363Q475Q267m4513k5917K8910
$$ 334657 322561 307063 314580 317339 310861 325926 335645 343008 351483 359750 315237 289320 318230
12529C18230J5234m025j3939j2653J5393J2401J4336p52j6476j5363K6980J0858
$$ 318230 333464 329439 315500 302847 318240 330641 344977 344225 327749 312386 339366 350224
12517C50224r351j7306r514J0486P285m217r915J7992j2444k0749j1821R965Q107
$$ 350224 340873 323567 314053 324539 331824 327607 317692 335684 323240 302491 290670 300635 308742
12504C08742M545p298J8724K1788k090O658j5031J058j262j888K453K383J2255
$$ 308742 313287 305989 324713 346501 344411 351069 336038 337096 335834 333946 336399 338782 351037
12491C51037K053J2082j402o481M209k932P186K6955p180n994p650l460O307O609
$$ 351037 353090 365172 363770 357289 361498 358566 365752 392707 385527 379533 371883 368423 374730 381339
12477C81339Q154l811J5786R638J522n571K9L34O226j451L265L643k204O015j3490
$$ 381339 389493 385682 401468 411106 412628 407057 407086 407420 413646 412195 415460 419103 416899 422914 409424
12462D09424O649K1470m949k0578j1853N322M811N170K9740J9663p316p483p963
$$ 409424 416073 437543 432594 412016 400163 405485 410296 415466 445206 464869 457553 450070 442107
12449D42107N267L17j937K2522J87K357r921P741J5195J376p969O44P801o027
$$ 442107 447374 447691 445754 468276 468463 470820 460899 468640 483835 485211 477242 477886 485687 479660
12435D79660O414l683l514O802r359O522l878K875k128P653o374k4238j1559M775
$$ 479660 486074 482391 478877 485679 476320 482842 478964 481839 479711 487364 480990 456752 445193 449968
12421D49968K3872K8J4358L508N051R544K047k142J6113N34J4023n408l168m993
$$ 449968 473840 473868 488226 491734 496785 506329 508376 506234 522347 522881 536904 531496 528328 523335
12407E23335K116J4128Q367M980N966P006P370j9099k0511N352J9660k869M080
$$ 523335 525451 539579 547946 552926 558892 565898 573268 554169 533658 539010 558670 555801 559881
12394E59881J9675q414o622r054N283Q754Q599N394K2382K1774k2709j9030Q939
$$ 559881 579556 571142 564520 555466 560749 569503 578102 583496 605878 627652 604943 585913 594852
12381E94852n695r217Q386J1118M687M796k660K0559J6597j6975o379N267p806
$$ 594852 589157 579940 588326 599444 604131 608927 606267 626826 643423 626448 620069 625336 617530
12368F17530J6574N479n082M550J3947n768P664K8025O901K991j0499K150q552
$$ 617530 634104 639583 634501 639051 652998 647230 654894 682919 689820 692811 682312 684462 675910
12355F75910L536R080J977K3701K4440k3269k2693J5031K4693l242k1770J672
$$ 675910 679446 688526 690503 714204 738644 715375 692682 707713 732406 729164 707394 709066
12343G09066J6497Q821k3456n258K102j6454j127p351P190M1181J0682K4773K5777
$$ 709066 725563 734384 710928 705670 707772 691318 690191 682840 690030 731211 741893 766666 792443
12330G92443K314j2038K53o488k84J0024J6126M646o466J0095M850o834m338J3480
$$ 792443 794757 782719 782972 776484 776200 786224 802350 806996 800530 810625 815475 808641 804303 817783
12316H17783J6373L0274p530k3891K85m0J4002l146o138K1569J5935J600Q027
$$ 817783 834156 864430 856900 833009 833294 833254 847256 844110 837972 859541 875476 877076 885103
12303H85103q20j720l652j7435J529K7374K0685L230J3595k858q698Q998J9737
$$ 885103 884283 882563 878911 861476 863005 890379 911064 914294 927889 925031 916333 925331 945068
12290I45068j5928J1133J1786J292K5129J1239j1958J822Q86m646m322P434K61
$$ 945068 929140 940273 952059 953351 978480 989719 977761 979583 980469 975823 971501 978935 979196
12277I79196J8313J0682J67J2038J7778M488j0671P712J8949K264L053J1326J1357
$$ 979196 997509 1008191 1008358 1020396 1038174 1042662 1031991 1039703 1058652 1060916 1063969 1075295 1086652
12264A086652J9949J6751p402n059p353J6178K6588O337n370M304M697J1567N56
$$ 1086652 1106601 1123352 1115950 1110891 1103538 1119716 1146304 1152641 1147271 1151575 1156272 1167839 1168395
12251A168395J4284k30l919K2652k37O881Q654J1376J6613Q197J1528J5118K448
$$ 1168395 1182679 1182449 1178530 1201182 1200945 1207826 1216480 1227856 1244469 1252666 1264194 1279312 1281760
12238A281760n459K8677N731R67Q262J5068P259J0395k23R419J468j966N903P890
$$ 1281760 1276301 1304978 1310709 1311676 1319938 1335006 1342265 1352660 1352437 1361856 1363324 1361358 1367261 1375151
12224A375151L1568J6465J15o626P648J2514J6791k530P764K3471J0156k3879
$$ 1375151 1406719 1423184 1423299 1416673 1424321 1436835 1453626 1451096 1458860 1482331 1492487 1468608
12212A468608p120K3256J8280K1939J5024k058N27M580J2022K2288L1703K5858
$$ 1468608 1461488 1484744 1503024 1524963 1539987 1537929 1538456 1543036 1555058 1577346 1609049 1634907
12200A634907R733l039R315J8505J5202J1010J5563n64J0566J3646K4966K3850
$$ 1634907 1644640 1641601 1650916 1669421 1684623 1695633 1711196 1710632 1721198 1734844 1759810 1783660
12188A783660L943J6082m973K365l337N146J7518J6263Q530J1935L191L501J8975
$$ 1783660 1787603 1803685 1798712 1801077 1797740 1802886 1820404 1836667 1845197 1857132 1860323 1863824 1882799
12175A882799M6025K1316L321P499J9512J9786Q237J801N688O051k015L501P281
$$ 1882799 1928824 1950140 1953461 1960960 1980472 2000258 2008495 2010296 2015984 2022035 2020020 2023521 2030802
12162B030802K7304L6148L970O729J1816L0818K4959J7349K5634L2232O720N147
$$ 2030802 2058106 2094254 2098224 2104953 2116769 2147587 2172546 2189895 2215529 2247761 2254481 2259628
12150B259628n49J6368K2815K5860J4408J9516L886m36J4160K8680L3908J0802
$$ 2259628 2259079 2275447 2298262 2324122 2338530 2358046 2361932 2361496 2375656 2404336 2438244 2449046
12138B449046J3861K1530K0633k125P319J5558K4635J7463K8779L9569K5727O767
$$ 2449046 2462907 2484437 2505070 2502945 2510264 2525822 2550457 2567920 2596699 2636268 2661995 2668762
12126B668762J272k146L2434K7454J5060L5738K8573K3730K951L181J7743M1057
$$ 2668762 2670034 2667888 2700322 2727776 2742836 2778574 2807147 2830877 2833828 2837009 2854752 2895809
12114B895809M4375M0450K1118j3892N546K9167J5033J8617L3485M1351J9455
$$ 2895809 2940184 2980634 3001752 2987860 2993406 3022573 3037606 3056223 3089708 3131059 3150514
12103C150514K7091N0222K0718K8594J4406J2700J3634L5274K3363L6699K6318
$$ 3150514 3177605 3227827 3248545 3277139 3291545 3304245 3317879 3353153 3376516 3413215 3439533
12092C439533N591K0961L6974K8733M762m190K6685N7749M4314J5266K4157J7508
$$ 3439533 3445124 3466085 3503059 3531792 3536554 3532364 3559049 3616798 3661112 3676378 3700535 3718043
12080C718043J9141J2162L1854L2586L3992K6942L2196K1099L3649L3407L1283
$$ 3718043 3737184 3749346 3781200 3813786 3847778 3874720 3906916 3928015 3961664 3995071 4026354
12069D026354K3248K5769J4251L6830M4385K6540J7134J6634K9902K4164M2478
$$ 4026354 4049602 4075371 4089622 4126452 4170837 4197377 4214511 4231145 4261047 4285211 4327689
12058D327689M6148K3212L2719L3119K9349J3249K8586L4366J8089O414L9414
$$ 4327689 4373837 4397049 4429768 4462887 4492236 4505485 4534071 4568437 4586526 4592940 4632354
12047D632354L9118L0017L2172O0155K5090N092J7306L8155L8450L7020M3558
$$ 4632354 4671472 4701489 4733661 4793816 4818906 4823998 4841304 4879459 4917909 4954929 4998487
12036D998487L4899L0868K8347L8931L3169R798J7890M2887K8747L2214M2889
$$ 4998487 5033386 5064254 5092601 5131532 5164701 5174499 5192389 5235276 5264023 5296237 5339126
12025E339126M3713N0305J6870O308J5861M2454L2193J9206L1293K4559K1223
$$ 5339126 5382839 5433144 5450014 5456322 5472183 5514637 5546830 5566036 5597329 5621888 5643111
12014E643111L6292L0240J9133K4054M3101N1286J7873n853K3285J8047L4518
$$ 5643111 5679403 5709643 5728776 5752830 5795931 5847217 5865090 5859237 5882522 5900569 5935087
12003E935087R830O889K7241L4848K1938K0743L2655M5865K7313J3519K396K0071
$$ 5935087 5944917 5951806 5979047 6013895 6035833 6056576 6089231 6135096 6162409 6175928 6178324 6198395
11991F198395J9011K8311J4295P391R772J6968J5664R115J6332O639O43J6788
$$ 6198395 6217406 6245717 6260012 6267403 6277175 6294143 6309807 6318922 6335254 6341893 6342536 6359324
11979F359324Q257R714J5365R776J1895J2652K3746K0752J5943J1150Q712J5022
$$ 6359324 6367581 6377295 6392660 6402436 6414331 6426983 6450729 6471481 6487424 6498574 6507286 6522308
11967F522308J625m474n878j8661r839J0731j3591l389O259O242K952J2351n028
$$ 6522308 6523933 6519459 6513581 6494920 6485081 6495812 6482221 6478832 6485091 6491333 6494285 6506636 6501608
11954F501608j4251L088L979j4181j8989k0927j5754k842r265J828M094j5381
$$ 6501608 6487357 6490445 6494424 6480243 6461254 6440327 6424573 6421731 6412466 6414294 6418388 6403007
11942F403007j8979k2031P247K926j9443l5560l5540M258l0470l2815M07M661
$$ 6403007 6384028 6361997 6369244 6372170 6352727 6317167 6281627 6285885 6255415 6222600 6223007 6227668
11930F227668k3211j2931k1349k8293j0182j1426j6967l3538l5424l4956k3998
$$ 6227668 6204457 6191526 6170177 6141884 6131702 6120276 6103309 6069771 6034347 5999391 5975393
11919E975393N259j4222j6270j9717l8894j8200k5202m9146k2020j7792k5885
$$ 5975393 5980652 5966430 5950160 5930443 5891549 5873349 5848147 5799001 5776981 5759189 5733304
11908E733304m448k0675l3376l0305j9324k1706l1910l4267k8655k5691n9764
$$ 5733304 5728856 5708181 5674805 5644500 5625176 5603470 5571560 5537293 5508638 5482947 5423183
11897E423183m0492M858n829m7476k3055j2254k7358l2024n2559m5875o7536m9673
$$ 5423183 5382691 5387549 5381720 5334244 5311189 5298935 5271577 5239553 5186994 5141119 5073583 5023910
11885E023910O1l83j6108k2305l5299l2514j9762l3841k5824j4591l4869l3542
$$ 5023910 5023971 5023588 5007480 4985175 4949876 4917362 4897600 4863759 4837935 4823344 4788475 4754933
11873D754933k7411k5694k1187m2039n0066m2976l1124j9375k9237m0299j9325
$$ 4754933 4727522 4701828 4680641 4638602 4588536 4545560 4514436 4495061 4465824 4425525 4406200
11862D406200k6886k2512l8699l9893j8268k1829k3380l1705l7718l4463l5437
$$ 4406200 4379314 4356802 4318103 4278210 4259942 4238113 4214733 4183028 4145310 4110847 4075410
11851D075410j3150j3299l6004l9168k7226r425j4963m3289l2709m7405m7957
$$ 4075410 4062260 4048961 4012957 3973789 3946563 3937138 3922175 3878886 3846177 3798772 3750815
11840C750815j8390j612k3933k5181k0089r418k4198m5932m0005l0820j0653j8984
$$ 3750815 3732425 3730813 3706880 3681699 3661610 3652192 3627994 3582062 3542057 3511237 3500584 3481600
11828C481600l2943j7878k9652l5181m2587j6071j1458m104k3303l2559l2479
$$ 3481600 3448657 3430779 3401127 3365946 3323359 3307288 3295830 3291726 3268423 3235864 3203385
11817C203385j9157j3352k2052k5339j7252j1111k6838l1951j4712j0136j6070
$$ 3203385 3184228 3170876 3148824 3123485 3106233 3095122 3068284 3036333 3021621 3011485 2995415
11806B995415j3785k1622j4778k0909l1044m1773m1104j7510J5434j1473j9842
$$ 2995415 2981630 2960008 2945230 2924321 2893277 2851504 2810400 2792890 2808324 2796851 2777009
11795B777009k3620j9867l6969l7430r816o658j5455j3340k2559k6655k691n361
$$ 2777009 2753389 2733522 2696553 2659123 2649307 2642649 2627194 2613854 2591295 2564640 2561949 2556588
11783B556588j1076j2088k2023k0086l4627l5668l6059k9475k3348j457J02j5101
$$ 2556588 2545512 2533424 2511401 2491315 2456688 2421020 2384961 2355486 2332138 2330681 2330783 2315682
11771B315682k0882k3483p331m386j3716m0346m3710j6837J1715L647k3317k1884
$$ 2315682 2294800 2271317 2263986 2259600 2245884 2205538 2161828 2144991 2156706 2160353 2137036 2115152
11759B115152j1874n602l171j1475j6956q420k1115o360k6622j1633j4691j5411
$$ 2115152 2103278 2097676 2094505 2083030 2066074 2057654 2036539 2030179 2003557 1991924 1977233 1961822
11747A961822M704p888j3772l4350k7368n966M482k9207j2184j0954j4401J2333
$$ 1961822 1966526 1958638 1944866 1910516 1883148 1877182 1881664 1852457 1840273 1829319 1814918 1827251
11735A827251l16k4633k4704j0217j0671k1543r486o556r516J2649o10l016q4
$$ 1827251 1826935 1802302 1777598 1767381 1756710 1735167 1725681 1719125 1709609 1722258 1721648 1718632 1718548
11722A718548k8159m0289q514j0178Q139J2277k3104k178Q00k7729p305k0463
$$ 1718548 1690389 1650100 1641586 1631408 1639547 1651824 1628720 1626542 1627342 1599613 1592308 1571845
11710A571845k1210l185r384j6374k1466j4155l032l952Q816O064k4050j5683
$$ 1571845 1550635 1547450 1538066 1521692 1500226 1486071 1483039 1479087 1487903 1493967 1469917 1454234
11698A454234P574q290p922k6972k5462j7988j817N96j673j0165m126r8k8160
$$ 1454234 1461808 1453518 1445596 1418624 1393162 1375174 1373357 1373953 1372280 1362115 1357989 1357891 1329731
11685A329731r115n43k0132l511j6138k8820K587m974r053k078L792R135m834
$$ 1329731 1320616 1320073 1299941 1296430 1280292 1251472 1254059 1249085 1240032 1237954 1241746 1250881 1246047
11672A246047j476m41k5580l722p984J0922O59j5293k4857j0160j651J0134k0918
$$ 1246047 1244571 1244130 1218550 1214828 1206844 1217766 1218425 1203132 1178275 1168115 1166464 1176598 1155680
11659A155680j3995q934j1170R300L397j2974j6240j0435m693p059p024K491o477
$$ 1155680 1141685 1132751 1121581 1130881 1134278 1121304 1105064 1094629 1089936 1082877 1075853 1078344 1071867
11646A071867j1122K102J7368J740l3993j3550k0095j1305P113j0678r051R769
$$ 1071867 1060745 1062847 1080215 1081955 1047962 1034412 1014317 1003012 1010125 999447 990396 1000165
11634A000165J2974j2862q872j9405o773l055k022m860m380L959j3412j7023K3880
$$ 1000165 1013139 1000277 991405 972000 965227 962172 960150 955290 950910 954869 941457 924434 948314
11621I48314O269j5229l4648j038J6870n276o350l368l012J4593J1906k0027k5187
$$ 948314 954583 939354 904706 903668 920538 915262 908912 905544 902532 917125 929031 909004 883817
11608H83817L634j3524k4687j3378n39O563J301j5087q807j6808j79M962j2094
$$ 883817 887451 873927 849240 835862 835323 841886 843187 828100 819293 802485 802306 807268 795174
11595G95174r153P54J7563K3782N955j4196k1669r225n736J206o356L846q604
$$ 795174 786021 786775 804338 828120 834075 819879 798210 788985 783249 784455 778099 781945 773341
11582G73341j9327j3755o557r77k0593j4460K2263n77m050P21j6777J51J2745
$$ 773341 754014 740259 733702 732725 712132 697672 719935 719358 715308 716029 699252 699403 712148
11569G12148j8768k065m397k764k167k0444N339K2810J1623j831j9604o400k9512
$$ 712148 693380 691315 686918 684154 681987 661543 666882 689692 701315 699484 679880 673480 643968
11556F43968j9029m515q96J1947P583Q726P452J4321j4175m323m311j1725j6615
$$ 643968 624939 620424 619528 631475 639058 647784 655236 669557 655382 651059 646748 635023 618408
11543F18408o743R974K3308j9286O239J042p055j447j8589j6861j3782l1547N442
$$ 618408 611665 621639 644947 625661 631900 632942 625887 624440 605851 588990 575208 543661 549103
11530E49103K0238r572J081N386O140J4340J151j3022J1326J7362q852n957j0536
$$ 549103 569341 559769 560850 566236 572376 586716 587867 574845 586171 603533 594681 588724 578188
11517E78188k912r451j6010k6135P16K696J5731m668j0668l167l703J1337J3223
$$ 578188 575276 565825 549815 523680 524396 527092 542823 538155 527487 524320 520617 531954 545177
11504E45177Q027k95j9697j6138K38k131j6853q322j0753M526O246M12Q184K284
$$ 545177 553204 552909 533212 517074 517312 515181 498328 490006 479253 483779 490025 490437 498621 500905
11490E00905p152j8307O709o866N218j1660j538K2988K597p338j2241j1930j0174
$$ 500905 493753 475446 482155 475289 480507 468847 467309 490297 492894 485556 473315 461385 451211
11477D51211R013k988l893j7627O838p886l136l495J6342O294M867K146M070k1788
$$ 451211 460224 457236 453343 435716 442554 434668 431532 428037 444379 450673 455540 457686 461756 439968
11463D39968R31J0434j1295Q101j3996j8301J16J3711O872J1192n512r437k802
$$ 439968 440899 451333 440038 448139 434143 415842 415958 429669 436541 447733 442221 432784 429982
11450D29982j3968j8296K0127K9176O029j5068j4648o377p243j4655r007j1028
$$ 429982 416014 397718 417845 447021 453050 437982 423334 416957 409714 395059 386052 375024
11438C75024q049L833J820k029O554J0785L706j775k6220P45K578K731j9665l885
$$ 375024 366975 370808 372628 370599 377153 387938 391644 389869 363649 364394 366972 369703 350038 346153
11424C46153J1198j168o15J5573l218M601J3841n539j7900J181l131j3485J2368
$$ 346153 357351 356183 355568 371141 367923 372524 386365 380826 362926 364107 360976 347491 359859
11411C59859K987k6218j8235l308j0657J3561L0925J145o914q634P718O43j2169
$$ 359859 362846 336628 318393 315085 304428 317989 348914 350059 343145 334511 342229 342872 330703
11398C30703K5081O245l237r989o345J6111k435k1806k0693j6348k421J8426K296
$$ 330703 355784 362029 358792 348803 342458 358569 356134 334328 313635 297287 294866 313292 315588
11385C15588L241j2679j486J1592P062J3108J00j2067j9573k0952M198Q407P202
$$ 315588 318829 306150 304664 316256 323318 336426 336526 324459 304886 283934 288132 296539 303741
11372C03741K0953J709k3273j2829j388K392j4530J144m920k2543l439J1621O470
$$ 303741 324694 326403 303130 290301 288913 291305 276775 277919 272999 250456 247017 258638 265108
11359B65108Q06O83p821K330n591O549O421Q567J6431P26l2428k420J4976Q67
$$ 265108 265914 266597 258776 261106 255515 262064 268485 277052 293483 294209 261781 259361 274337 275204
11345B75204q29l452j8336j7366J985R259L73o136j2647j7045J3703L4540K4065
$$ 275204 274375 270923 252587 235221 237206 246465 246838 240702 228055 211010 224713 259253 283318
11332B83318J780k4405k5890j7146m669k047N395K406J2962L700j720q566J24
$$ 283318 285098 260693 234803 217657 212988 210941 216336 218742 231704 235404 233684 225118 225242
11319B25242q8Q176L326j759J1313m468l0881Q956K376r49J8668j569k3414k1646
$$ 225242 225154 233330 236656 234897 246210 241742 210861 219817 222193 221244 239912 238343 214929 193283
11305A93283l661o633o9J4005K086J486J0082J4704P088l4262j9765J0584j664
$$ 193283 189622 182989 182920 196925 199011 200497 210579 225283 232371 198109 178344 188928 187264
11292A87264r904J9921j591n384P597Q762p711k575O837N058L935l0551j433J7637
$$ 187264 177360 197281 195690 190306 197903 206665 198954 196379 203216 208274 212209 181658 180225 197862
11278A97862q734P908J0669k0134J270k127O326J0545k871j6380Q596o084n399
$$ 197862 189128 197036 207705 187571 188841 186714 193040 203585 200714 184334 192930 186846 181447
11265A81447N154r368k2960n579J3650J6764j78l162J4137M806j3086j5031O182
$$ 181447 186601 177233 154273 148694 162344 179108 178930 175768 189905 194711 181625 166594 172776
11252A72776J2841J587K5468j6816j3586l299P838j2707J046R291j0321j4763
$$ 172776 185617 187204 212672 195856 182270 178971 186809 174102 175148 184439 174118 159355
11240A59355p695j3585M160J671j65N128r052J310o417j914l472p7P189j1422
$$ 159355 151660 138075 142235 143906 143741 148869 139817 141127 134710 132796 129324 129247 136436 125014
11226A25014q058l035J5657J6443j1180o515M862L205l177k5993o410N781j0639
$$ 125014 116956 113921 129578 146021 134841 128326 133188 136393 133216 107223 100813 106594 95955
11213I5955J6932K0878J5747j5029p338J5720J3092q123j5678m105j164q791r378
$$ 95955 112887 133765 149512 134483 127145 142865 155957 147834 132156 128051 126887 118096 108718
11200A08718q601M620J6386j1918q208o475K323J8093J8646j2279l735p866R980
$$ 108718 100117 104737 121123 109205 100997 94522 96845 114938 133584 121305 117570 109704 119684
11187A19684J8843M646j4597j8941r414R756o767R380k037k0888K8409J6459k0091
$$ 119684 138527 143173 128576 109635 100221 109977 103210 112590 110553 89665 118074 134533 114442
11174A14442j7105K357j3091J272j868J838J690O923P905J1420J5189j8276j99
$$ 114442 97337 99694 86603 87875 86007 87845 89535 96458 104363 115783 130972 112696 112497
11161A12497j4143m186l091l312N141K487J4318J060l706Q413R633q422j8267
$$ 112497 98354 94168 91077 87765 92906 95393 109711 110771 107065 115478 125111 116689 98422
11148I8422O176L260q718r289N69o34r170j6268J8368J0095J1463j052J2803J0497
$$ 98422 104598 107858 99140 89851 90420 89786 80616 64348 82716 92811 104274 103222 116025 126522
11134A26522l796j379l199j9546k4703J1181J826j1418k2906R399J8099O081K162
$$ 126522 122726 121347 118148 98602 73899 85080 86906 75488 52582 61981 80080 86161 88323
11121H8323k630p639O630o227N52R962J1799n545k4234m432J4088Q273j1016m685
$$ 88323 85693 78054 84684 78457 79009 88971 100770 95225 70991 66559 80647 88920 77904 73219
11107G3219q52J3835M6K233R417l685k834Q8r635p171l047P117o031r102N629
$$ 73219 72367 86202 86248 88481 97898 94213 91379 91467 81832 74661 71614 78731 72700 63598 69227
11092F9227j471k773M950r556n20L381J5292M752J3169k1017j5356m640L710Q338
$$ 69227 67756 64983 69933 60377 59857 63238 78530 83282 96451 75434 60078 55438 59148 67486
11078F7486j5188k3145N585K1116K7458J4891l787j635J334m029j2014m100j854
$$ 67486 52298 29153 34738 55854 83312 98203 94416 92781 94115 90086 78072 73972 72118
11065G2118j5595N158j904o653j2186k619N986R930L796m955J8990J0437k0051
$$ 72118 56523 61681 59777 53124 40938 38319 44305 54235 58031 53076 72066 82503 62452
11052F2452P650q812j7686m768q306R905J6970P187R673j27K754k81K0404o366
$$ 62452 70102 61290 43604 38836 30530 40435 57405 64592 74265 74138 76892 76611 97015 90649
11038I0649j0224J472k75J084L699N407j0130j3854R061N430K2716L3248M266
$$ 90649 80425 81897 81622 82706 86405 91812 81682 67828 76889 82319 105035 138283 142549
11025A42549R176K3515k7k0303k4146k3114j8965R732K0320K4633J2830J1290
$$ 142549 151725 175240 175213 154910 130764 107650 88685 98417 118737 143370 156200 167490
11013A67490N127J0551j0518j655q089j4644L16M272O931r824M570J0451q566
$$ 167490 172617 183168 172650 170995 162906 148262 148578 152850 159781 149957 154527 164978 156412
11000A56412o357O954o408l502o207l1607j1183m684n091n701J5120J1472j0409
$$ 156412 150055 157009 150601 147099 140892 109285 98102 93418 88327 82626 97746 109218 98809
10987I8809j4315j8743N014j914j6025J1472l466o149l348J5022k1052j3383M108
$$ 98809 84494 65751 70765 68851 52826 64298 60832 54683 51335 66357 45305 31922 36030
10974C6030R140j1354n086o406r707j304O316M092j675m608M627P488R911L354
$$ 36030 45170 33816 28730 22324 12617 11313 17629 21721 20046 15438 20065 27553 37464 40818
10960D0818m833O99j134M204L30j2352q178J0311j5820k0441k0305r404N740Q232
$$ 40818 35985 36684 35550 39754 40084 27732 19554 29865 14045 -6396 -26701 -36105 -30365 -22133
10946b2133R645p052o850N980j34j9954Q83J2626N502M880n430n136k945R729
$$ -22133 -12488 -19540 -26390 -20410 -20544 -40498 -39615 -26989 -21487 -16607 -22037 -27173 -30118 -20389
10932b0389n856R538m568K0782K3576P558q440j1245M060J5291J5751O306J531
$$ -20389 -26245 -16707 -21275 -493 23083 30641 22201 10956 15016 30307 46058 52364 53895
10919E3895M666K0644r054J4883M5698K4184J2269N1513P6323J01514J43514K11494
$$ 53895 58561 79205 70151 85034 130732 154916 167185 218698 295021 396535 540049 751543
10907G51543K25219K37559J82620R9007m5341j60711k14344k16878j65782j15929
$$ 751543 976762 1214321 1396941 1495948 1450607 1289896 1075552 858674 692892 576963
10897E76963q3439l5549m6960l9122m9735n3491m3861j2767k9266l0778j1873
$$ 576963 493524 457975 411015 371893 322158 268667 224806 212039 182773 151995 140122
10886A40122K513j2480r997k0149j4195o133j1615k2637j779R637M975k0209P021
$$ 140122 142635 130155 120158 100009 85814 79681 68066 45429 43650 53287 58262 38053 45074
10873D5074Q779m038p813j287o544m429J8348n757k7501l2185j1804P199K0961
$$ 45074 53853 49815 42002 40715 34171 29742 48090 42333 14832 -17353 -29157 -21958 -997
10860i97J3354n013l168k51J880q437n517j1482J9400J7735O916j661R208o550
$$ -997 12357 7344 4176 3925 5805 -2632 -8149 -19631 -231 17504 24420 22759 31967 25417
10846B5417j6236J571L203o076j5783j7486J2324k3850j0904Q125Q007N027J1856
$$ 25417 9181 10752 13955 7879 -7904 -25390 -13066 -36916 -47820 -39695 -31688 -26661 -14805
10833a4805L085p482K538J4283l694Q28q303k5143j0362J2443K6382K135k6127
$$ -14805 -11720 -19202 -16664 -2381 -6075 -5247 -13550 -38693 -49055 -36612 -10230 -8095 -34222
10820c4222k217j3087O905P012M144J3347J3082N39Q619j6458q182r911P36j359
$$ -34222 -36439 -49526 -42621 -35609 -31465 -18118 -5036 -4497 4122 -12336 -20518 -30429 -29693 -31052
10806c1052j1318j9581O530R719P010j2296j7791o613m386L993j5241M336j666
$$ -31052 -42370 -61951 -55421 -45702 -38692 -50988 -68779 -75392 -79778 -75785 -91026 -86690 -88356
10793h8356J0220J1762J2586K42M012J1631K610j7969l1200N664J0400n447K561
$$ -88356 -78136 -66374 -53788 -53546 -49534 -37903 -35293 -53262 -84462 -78798 -68398 -73845 -71284
10780g1284r032L408j713L740j2123k234R661Q225k0988l501M613L914K2491J0561
$$ -71284 -80316 -76908 -78621 -74881 -87004 -89238 -79577 -71352 -92340 -95841 -91228 -87314 -64823 -54262
10766e4262J137j2075R502o917k423K466J8005N734j4736j4575J0449K7982N320
$$ -54262 -53125 -65200 -55698 -62615 -65038 -62572 -44567 -38833 -53569 -68144 -57695 -29713 -24393
10753b4393K941K490J5316K9114J7904K0441N039N112P510j8185n8991k8384j8717
$$ -24393 -21452 -18962 -3646 25468 43372 63813 68852 73964 81474 63289 4298 -24086 -42803
10740d2803j1202K308q827j2055N228k108M413J5785J6018P7j1424k9333n473
$$ -42803 -54005 -51697 -60524 -72579 -67351 -69459 -65046 -49261 -33243 -33166 -44590 -73923 -79396
10727g9396K9757J8156L982q996j5304j6206J0427j791J011r8M174L418J069K218
$$ -79396 -49639 -31483 -27501 -36497 -51801 -68007 -57580 -59371 -58360 -58458 -54284 -50866 -49797 -47579
10713d7579P028j2275j6522K398J046j4275o590k613O917J2742J0593m567j5902
$$ -47579 -40551 -52826 -69348 -66950 -65904 -80179 -86769 -89382 -82465 -69723 -59130 -63697 -79599
10700g9599j9728r192J898K9026J019P177M175L54M598q665p257J4163K0757K1890
$$ -79599 -99327 -108519 -106621 -77595 -76576 -69399 -65224 -64870 -60272 -68937 -76194 -62031 -41274 -19384
10686a9384M858K634K87P765j0510j7229m0045l3320l2147j4235j1922j4208K102
$$ -19384 -14526 -11892 -11605 -3840 -14350 -31579 -71624 -104944 -137091 -151326 -163248 -177456 -175354
10673a75354k2022j6304J0107J3473P654q332k146K896l704p63n857q210K874
$$ -175354 -197376 -213680 -203573 -190100 -182446 -190778 -192924 -190028 -193732 -194495 -200352 -208562 -205688
10660b05688J0132K200P163K256K213J4317J080J0999L5503K5588j0321k4636
$$ -205688 -195556 -193356 -186193 -183937 -181724 -167407 -166327 -155328 -119825 -94237 -104558 -129194
10648a29194k0459k8771n111Q583P485K0006J0081J7203m858K362j956j9809m3953
$$ -129194 -149653 -178424 -183535 -174952 -167467 -147461 -137380 -120177 -125035 -122673 -124629 -144438 -188391
10635a88391k2385l501J2943K6297K7682P977J6044N3887Q0946P9392P4609Q7347
$$ -188391 -210776 -214277 -201334 -175037 -147355 -139378 -123334 -69447 11499 90891 165500 252847
10623B52847Q1541K8819q807j5972j786P106Q3102J24346J93768L12138M49035
$$ 252847 334388 363207 354400 338428 336642 343748 426850 551196 744964 1057102 1506137
10612A506137O23041P48314R56774J103594J149202J046147P97699M64144J02435
$$ 1506137 2129178 2877492 3834266 4937860 6087062 7133209 7930908 8395052 8497487
10603H497487r1683j9633K81346P28444J227232J735318K096869K162520J862436
$$ 8497487 8405804 8386171 8667517 9395961 10623193 12358511 14455380 16617900 18480336
10594A8480336J157992K18913o56178j072255q60540k60813N45737J426097K152897
$$ 18480336 19638328 19857241 19201063 18128808 17268268 17007455 17553192 18979289 21132186
10585B1132186K600363K557782J901568P06541p49440j994178k523641k219489
$$ 21132186 23732549 26290331 28191899 28898440 28149000 26154822 23631181 21411692
10577B1411692j480465o19643J60449P97068J115163J038480N45534l07691j274491
$$ 21411692 19931227 19311584 19472033 20269101 21384264 22422744 22968278 22660587 21386096
10568B1386096k023214k266751j967799j389779q38886l87253q2159L1908n0731
$$ 21386096 19362882 17096131 15128332 13738553 12899667 12512414 12430255 12462163 12411432
10559A2411432k72209n96242r44653j210760j265513j145050r64412p58489n95214
$$ 12411432 12139223 11542981 10598328 9387568 8122055 6977005 6012593 5254104 4658890
10550D658890n04574m40339l66299l15449k66150k09486k13006j80562j38083
$$ 4658890 4154316 3713977 3347678 3032229 2766079 2556593 2343587 2163025 2024942
10541B024942j15234j10965q6962o8812l4945m6493m6970k3350m0804k6545l0276
$$ 2024942 1909708 1798743 1711781 1642969 1608024 1561531 1514561 1491211 1450407 1423862 1393586
10530A393586k9064j6056L5285L7660M3566P6228R6001J27502J75522J75027K21008
$$ 1393586 1364522 1348466 1383751 1421411 1464977 1541205 1637206 1764708 1940230 2115257 2336265
10519B336265K97585M13119M99014N63786N65262N26098M38399L66643L88098
$$ 2336265 2633850 3046969 3545983 4109769 4675031 5201129 5639528 6006171 6394269
10510F394269N87850Q65120J179341J542658J982275K554067L293411M271021
$$ 6394269 6982119 7847239 9026580 10569238 12551513 15105580 18398991 22670012
10502B2670012N681075P773802J1027073J6129590K3781180L3891363M4424060
$$ 22670012 28351087 36124889 47151962 63281552 87062732 120954095 165378155
10495A65378155M9851714M4312507K8657873N276869k3860802m8050036m8765499
$$ 165378155 215229869 259542376 288200249 293477118 269616316 221566280 172800781
10488A72800781l5967732k4195698j6238299j1388657q940880q145435p731101
$$ 172800781 136833049 112637351 96399052 85010395 76069515 67924080 60192979
10481F0192979p054213o159332n216815m408637l745135l168825k689870k303053
$$ 60192979 53138766 46979434 41762619 37353982 33608847 30440022 27750152 25447099
10473B5447099j944347j683969j477484j351697j317448j323689j307310j190110
$$ 25447099 23502752 21818783 20341299 18989602 17672154 16348465 15041155 13851045
10465A3851045j039572r20088q27751p47700o65227o04388n44814m94712m71668
$$ 13851045 12811473 11891385 11063634 10315934 9650707 9046319 8501505 8006793 7535125
10456G535125m36818m40352m03338l63929l39560l05433k61959k31213k25474
$$ 7535125 7098307 6657955 6254617 5890688 5551128 5245695 4983736 4752523 4527049
10447D527049j98815j79545j70417j53628j60436j54874j25999j21560j34349
$$ 4527049 4328234 4148689 3978272 3824644 3664208 3509334 3383335 3261775 3127426
10438C127426j47701j37758r8250j08784j21187q1079p2060p7021q3296o3953
$$ 3127426 2979725 2841967 2743717 2634933 2513746 2432667 2360607 2283586 2200290 2136337
10428B136337n2271n2566m7912n8016m1864n3310p1605l9826l1845l5463l0038
$$ 2136337 2084066 2031500 1983588 1925572 1883708 1830398 1758793 1718967 1687122 1651659 1621621
10417A621621k8434k9574k0168l5182k7977k1180k1886l1538r19n796m0066n3121
$$ 1621621 1593187 1563613 1543445 1508263 1480286 1459106 1437220 1405682 1404763 1398967 1358901 1305780
10405A305780n1258k8035j7981j6355k99k7773m0072k0509l9477j1216J532N22
$$ 1305780 1254522 1226487 1208506 1192151 1191852 1164079 1124007 1103498 1064021 1052805 1054337 1054859
10393A054859j4319r737k0660k1470L802j2854k0084M820M125j7215k7238M055
$$ 1054859 1040540 1030803 1010143 988673 992475 979621 959537 964357 968482 951267 924029 928084
10381I28084L033n522k4524k624J0309j343J3475q652j051L8300P2583Q4675P9258
$$ 928084 931117 925595 901071 898447 908756 907413 920888 912236 911185 949485 1022068 1106743 1186001
10368A186001K3663m1491p3538j35823j42283r7803m1518r138j722J2871l381
$$ 1186001 1209664 1168173 1094635 958812 816529 718726 677208 668070 666348 679219 675838
10357F75838P274K3982J3935n009j179q119K7658m422j1298J708M824p436o84
$$ 675838 683112 707094 721029 716020 714841 706722 734380 729958 718660 720368 725192 717756 717072
10344G17072P327J2991j1861j359j8880l1206l4324j8992l0923n0332j9714J8889
$$ 717072 724399 737390 725529 724170 705290 674084 639760 620768 589845 539513 519799 538688
10332E38688M740L694m788q82K120o834l144M665q279m647m106j2806n02Q186
$$ 538688 543428 547122 542334 541452 543572 536738 533594 538259 529980 525333 521227 508421 507919 516105
10318E16105k3032j215P907J4466j0941p449jN069J2666N533j1776k6778j2501
$$ 516105 493073 491858 499765 514231 503290 495841 495840 500909 513575 519108 507332 480554 468053
10305D68053l4458l5134n1974l2070j7148J0740M3199M902r40J0332l496j7790
$$ 468053 433595 398461 346487 314417 297269 308009 351208 356110 355170 365502 362006 344216
10293C44216j3071O024r342n642J4621J6383k2125l747o485O284l138o186Q764
$$ 344216 331145 337169 327827 322185 336806 353189 331064 327317 320832 327116 323978 317792 326556
10280C26556N888L611N836O973j8767k386P146J1352k6864o958R414J6701J0657
$$ 326556 332444 336055 341891 348864 330097 327711 334857 346209 319345 312387 321801 338502 349159
10267C49159q571j9816K0701R864l606P902j915j1901k2643q143J0986R468k400
$$ 349159 340588 320772 341473 351337 347731 355633 353718 341817 319174 311031 322017 331485 329085
10254C29085j0158n233k495J6115K352N441K5190O688j9105N260k3428J325j08
$$ 329085 318927 313694 311199 327314 329666 335107 360297 366985 347880 353140 329712 331037 330929
10241C30929j0274l539J0149L4712p470k3046n522k0607j8597J1582J6724K859
$$ 330929 320655 317116 327265 361977 354507 331461 325939 305332 286735 298317 315041 317900
10229C17900j9766l789M436K425p36m04r452Q374L295J941N872j0546Q573K7646
$$ 317900 298134 294345 298781 301206 300470 300066 290614 298988 302283 304224 310096 299550 308123 335769
10215C35769j5109r629P318J0886p146k5884j4213L695L23M604L065j0296p74
$$ 335769 320660 311031 318349 329235 322089 296205 281992 285687 286010 290614 293679 283383 282609
10202B82609p274J163n219p104M785K0638j572p392o678Q941J2437r129j9195
$$ 282609 275335 276498 271279 264175 268960 289598 288026 280634 273956 282897 295334 286205 267010
10189B67010j3664p563m631J6542J5617J2468J358j3635j0238k0212L222J831
$$ 267010 253346 245783 241152 257694 273311 285779 287137 273502 263264 243052 246274 248105
10177B48105q271J1458L2854M037J116j224n874q471M319M984J6233K355J4910
$$ 248105 239834 251292 284146 288183 289299 288075 282201 273730 278049 283033 299266 301621 316531
10164C16531N340j9417l225j569K2397K5746j1449J5213Q617j7441K326J0059
$$ 316531 321871 302454 299229 297660 320057 345803 334354 349567 358184 340743 343069 353128
10152C53128k0416N359j248J8770K7105P135R698M077J3635o530k7305k6877j8642
$$ 353128 332712 338071 336823 355593 382698 389833 399531 403608 417243 410713 383408 356531 337889
10139C37889L814L368Q846O528p924q958R536l590m6001j1139P980o752k5058
$$ 337889 341703 345071 353917 360445 352521 343563 353099 349509 303508 292369 300349 293597 268539
10126B68539J2136L0754J9828j0088k4566k0427L671j7920j1474k642m117k53
$$ 268539 280675 311429 331257 321169 296603 276176 279847 261927 250453 247811 243694 243441
10114B43441k2542j5380J1392m633j452j1736J076J9466k0962j7135P069m084
$$ 243441 220899 205519 216911 212278 210826 199090 200166 219632 198670 181535 188604 184520
10102A84520j3315J9744n190J6894K2954o387k0340N671L1353R783J465J1242
$$ 184520 171205 190949 185759 202653 225607 219220 198880 204551 235904 245687 247152 258394
10090B58394n800K516K7803J5168K3080K2915N1726N2917P4105J11299J61984
$$ 258394 252594 255110 282913 298081 321161 344076 395802 448719 522824 634123 796107
10079G96107K02388K43330K42420J79446M5860q8039k15420k41340j89212j51517
$$ 796107 998495 1241825 1484245 1663691 1709551 1621512 1406092 1164752 975540 824023
10069H24023j10269n1419n6747n2814m2181l6969l8167m8716k1093k0064j0961
$$ 824023 713754 662335 605588 552774 510593 473624 435457 386741 365648 345584 334623
10058C34623r864k8145j1399K707J0148J30n849O86k076j7152l067j0481m635
$$ 334623 324759 296614 285215 287922 298070 298200 292351 293037 290961 273809 270742 260261 255626
10045B55626p592k9783j9241j290J3962n673j0159J496J6892J073k1601l0503
$$ 255626 248034 218251 199010 197720 211682 206009 195850 197346 214238 215311 193710 163207
10033A63207j5731N730j961L445J3094K4459j4754j1993o299L259M577Q451p80
$$ 163207 147476 153206 151245 154690 167784 192243 177489 165496 159197 162456 167033 175484 174704
10020A74704k0018k1463L573K1418Q83j2902P724L6326j0982j0532N999Q187J0754
$$ 174704 154686 133223 136796 158214 159097 146195 153919 190245 179263 168731 174730 182917 193671
10007A93671m587j8432m920M34Q40m019m008k476O945M617M594j4781P813n418
$$ 193671 189084 170652 165732 166166 167006 162987 158979 156503 163448 168065 172659 157878 165691 160273
9993A60273j8750l599n494Q029Q628J4289J1466k27j189r588l6006L249J89l210
$$ 160273 141523 137924 132430 140459 149087 163376 174842 174615 173426 163838 127832 131081 131270 128060
9979A28060K2731L0725j4542j7018J0456j3998k4803q838J7787L5803J6938n611
$$ 128060 150791 181516 166974 149956 160412 146414 121611 112773 130560 166363 183301 177690
9967A77690j8173L0051J127k2942k4391o087k257J3798r729O277J9588J2099m490
$$ 177690 159517 189568 190695 167753 143362 137275 135018 148816 139087 145364 164952 177051 172561
9954A72561N016l403k2049k0147l831K5139J0379K296K335j5617l0802n659J0714
$$ 172561 177577 174174 152125 131978 128147 153286 163665 165961 168296 152679 121877 116218 126932
9941A26932J0373M07L466j3644j350P215J1351l097n979R228J6010O611k0529
$$ 126932 137305 137712 141178 127534 126184 133399 144750 141653 135674 144902 160912 167523 146994
9928A46994k1663k921k903m923O2K4705J2887M174j7198j9787Q909K0636J9088
$$ 146994 125331 122410 119507 114584 114646 139351 152238 156412 139214 119427 128336 148972 168060
9915A68060j3486k0816k85J7051o635k5531j1454R208N79J1114M236R710j1282
$$ 168060 154574 133758 133473 150524 143889 118358 106904 116112 116691 127805 132041 141751 130469
9902A30469o425N174o859N926l266M483o182L510J2364M766r461j5162M631j322
$$ 130469 124044 129218 122359 128285 125019 129502 123320 126830 139194 143960 134499 119337 123968 122646
9888A22646l060J679J7455j0665l0500R36J5149M1102M141l0537N873n476k2713
$$ 122646 119586 121265 138720 128055 97555 98491 113640 154742 158883 128346 134219 128743 106030
9875A06030J613M801M218J3038j4684q053J7747O964K576n970l284R560P114j6421
$$ 106030 107643 112444 116662 129700 115016 106963 124710 131674 134250 128280 124996 134556 141670 125249
9861A25249j2075K5735j3040j6636M286J6472k065k0868R243M974J2665p79l379
$$ 125249 113174 138909 125869 109233 113519 129991 127926 107058 116301 121275 133940 133161 129782
9848A29782m781m420J2860m412j531p048q087l046J1458M058L456q579j8998j501
$$ 129782 125001 120581 133441 129029 127498 120450 112363 109317 120775 124833 128289 119710 100712 99211
9834I9211m046k014J2948Q632L497k930m247l30l09k5055l491K6018P83M520j119
$$ 99211 95165 93151 106099 114731 118228 115298 111051 110721 110412 85357 81866 107884 108667 113187 112068
9819A12068M505l686j4464k5355L203J9767P547m516j366K1085K3542N790j0257
$$ 112068 116573 112887 98423 73068 76271 96038 103585 99069 97703 118788 142330 148120 137863
9806A37863j0610J1074R228k0109M32J0498j1562k4492p851M540q08K29m83J0963
$$ 137863 127253 138327 147555 127446 127878 138376 126814 102322 94471 99011 98203 98432 97949 108912
9792A08912J0414J3095M525j6061q022J2962J6773j5407j680J225k840k651k3625
$$ 108912 119326 132421 136946 120885 112863 125825 142598 127191 125511 126736 123896 121245 97620
9779I7620m730k1537j2226k304R229J6340J1123j954J848K1659K0667p652j5083
$$ 97620 92890 71353 59127 56823 66052 82392 93515 91561 93409 115068 135735 128083 113000
9766A13000M08l7987o708L3166J4532m137j2638k2913Q590J0642k42j0368m277
$$ 113000 113408 75421 68713 101879 116411 112274 99636 76723 85313 95955 95713 85345 81068
9753H1068k200M545j059k622N608J2002J3946j7194K622k439M009k781q77L118
$$ 81068 78868 83413 82354 79732 85340 97342 111288 94094 96716 94277 98286 95505 94628 97746
9739I7746J200j372N133K3522j1944j028K355k367M755j1610m02P095n757j4289
$$ 97746 98946 97574 102707 126229 114285 113257 115612 113245 118000 106390 105988 113083 107326 93037
9725I3037k782j374j5039N173Q942L546L474R611r815L428M013j1871r931p882
$$ 93037 90255 88881 73842 79015 87957 91503 94977 104588 94773 98201 102214 90343 80412 72530
9711G2530q851J2565O315K093n980L497o875J1430M871P551J6203p694k2299k3527
$$ 72530 63679 76244 82559 84652 78672 82169 75294 86724 91595 99146 115349 107655 85356 61829
9697F1829J0043J4952L148K128k2552k3664K5251L2970n588o426n45P503n847
$$ 61829 71872 86824 89972 92100 69548 45884 71135 104105 98517 92091 91546 99049 93202
9684I3202j3238J7676J622j9570n864k647r883N02J2576R736P281n604J0431n803
$$ 93202 79964 97640 99262 79692 73828 71181 61298 61800 74376 84112 91393 85789 96220 90417
9670I0417o66R688L569n114j0509j5903K5309J1225k0785o664L831m193m738k4393
$$ 90417 89751 99439 103008 97894 87385 71482 96791 108016 87231 80567 84398 80205 75467 51074
9656E1074j3570K0466J4867J0181j015j130J192O730Q05J0724R721K368J6622
$$ 51074 37504 57970 72837 83018 82003 80873 82065 88795 89600 100324 110045 112413 129035
9643A29035K8406J1324j8088j2206j0883j0940j8657r969P252J1986j0647j4156
$$ 129035 157441 168765 150677 138471 127588 116648 97991 88022 95274 107260 96613 82457
9631H2457M883K735K129m226j2550R133l065J1989o414J0646O288J1245j8187
$$ 82457 87340 90075 92204 87978 75428 84561 81496 93485 87071 97717 104005 115250 97063
9618I7063j0668r92n735p621R194M332k2136P503k310j3714M323J7702j2721j8078
$$ 97063 86395 85403 79668 72047 81241 85573 63437 70940 68630 54916 59239 76941 64220 46142
9604D6142J1557J8146j159j3166R360j215k565J1371J7610j5792j7168J6735k3654
$$ 46142 57699 75845 74686 61520 70880 69665 67100 78471 96081 80289 63121 79856 56202
9591E6202j4234r329J4553M410Q045J2137J5030R857J0199k8011j1754r496j2014
$$ 56202 41968 32639 47192 51602 59647 71784 86814 96671 106870 78859 67105 57609 45595
9578D5595K624J4829L128r560M249Q321l92q315j1103K884j297k951r608Q50L030
$$ 45595 48219 63048 66176 56616 60865 69186 68794 60479 49376 52260 50963 48012 38404 39254 42284
9563D2284N504P292J0624n093J1572O878o301r769j9262K883J8739O026J4273
$$ 42284 47788 55080 65704 60611 72183 79061 72760 62991 43729 46612 65351 71377 85650
9550H5650n384j4145L338j5059q013J3710J2170r533K0375K291j0304j8905q20
$$ 85650 80266 66121 69459 54400 46387 60097 72267 62734 83109 85400 75096 56191 55371
9537E5371r895j4532j5645N423N586J609O675L7K2222J5118M939n290R899J1456
$$ 55371 45476 30944 15299 20722 26308 27917 34592 34629 56851 71969 76908 71618 81517 92973
9523I2973k8732q184K0919N068k428p501j7231L934m622r04J9826J8444k0073
$$ 92973 64241 56057 76976 82044 79616 72115 54884 58818 54196 53292 73118 91562 71489
9510G1489k9742j6876R793J1057J5409n829p410J4286L250L421N637r822O327
$$ 71489 41747 24871 34664 45721 61130 55301 47891 62177 65427 68848 74485 64663 70990
9497G0990J875p170N022J4723j5386j1303j373p231P745o082m590R929J0170M164
$$ 70990 72865 65695 70717 85440 70054 58751 57378 50147 57892 51810 47220 57149 67319 71483
9483G1483j4895J2196j898o446o860J0773M147N123j4647k1045j4021Q823o4k425
$$ 71483 56588 68784 66886 60440 53580 64353 68500 73623 58976 37931 23910 32733 32669 30244
9469C0244j2836Q938K3426P85Q662p033k0271L372J714M864Q741P266J1547r866
$$ 30244 17408 26346 49772 50557 59219 52186 31915 35287 37001 41865 50606 57872 69419 59553
9455E9553o707K0570n551j5059j8403j2167l968J8710L0448J1683j9360j4283
$$ 59553 52846 73416 67865 52806 34403 22236 18268 36978 67426 79109 59749 45466
9443D5466J573K8763J6424r562l8883j3519J1065P156q635J3754K2264O298M337
$$ 45466 47039 75802 92226 82664 43781 30262 41327 48483 39848 53602 75866 82164 86501
9430H6501P547k4204O502J5400k6062r407J1867L438k2607k746J2774n54j5538
$$ 86501 94048 69844 76346 91746 65684 56277 68144 71582 48975 46229 59003 58449 42911
9417D2911q777J2724J1064K0944J3063p895k134Q65q173Q733O654J9564j2935
$$ 42911 34134 46858 57922 78866 91929 84034 81900 82765 74592 83325 89979 109543 96608
9404I6608k5753r834o385M899K87q04k241R149J6989p051p104j5183l83M050R677
$$ 96608 70855 61021 54636 59535 59822 59018 56777 65926 82915 75864 68760 53577 53194 57244 66921
9389F6921R84p618l489N694J4141j6395k4248j5620R835J1603k3128J1117K7942
$$ 66921 67905 60287 56798 62492 76633 60238 35990 20370 30205 41808 18680 29797 57739
9376E7739O271N317j300k1563j5629P216K7623j209n041P7Q557J2313j3534j1621
$$ 57739 64010 69327 68027 46464 30835 38051 65674 64465 59424 59501 68058 80371 66837 55216
9362E5216n024J7040P693L873k2525o844q834r69L605P76R560J1755J312J298
$$ 55216 50192 67232 74925 78798 56273 49429 40595 39626 43231 44007 53567 65322 66634 67932
9348F7932j6581j5594q052n732J7244J0467J4833N791k824n819J0076J4693m157
$$ 67932 51351 35757 27705 21973 39217 49684 64517 70308 67484 61665 71741 86434 82277
9335H2277M576r537j9063N018q243j5539l177N311J0167K0916N965j3450j9864
$$ 82277 86853 77316 58253 63271 55028 39489 36312 41623 51790 72706 78671 65221 45357
9322D5357q099q959k129K1951J3031r64l923J421l104N575j1282J1966J8036m595
$$ 45357 37258 28299 26170 48121 61152 60188 56265 57686 54582 60157 48875 60841 78877 74282
9308G4282j8896m117J0019K4507J2542k3016q514j2347l965k264p957Q666L24
$$ 74282 55386 51269 61288 85795 98337 75321 66807 54460 50495 48231 40274 48940 49264
9295D9264j0970k846j7016K405O311N286j810R43K962p380p845M045K454N050
$$ 49264 38294 35448 18432 20837 27148 32434 30624 31567 34529 27149 19304 23349 25803 30853
9281C0853j0418K95n141K05J9957q12J449N177J2436j2052p218M339J2490j673
$$ 30853 20435 20730 15589 15794 35751 34939 36388 41565 54001 41949 34731 39070 51560 49887
9267D9887J939O012p048j8619j13j9572p17k778J7887R062M46N539j295O119J1416
$$ 49887 51826 57838 50790 32171 32058 12486 11769 8991 26878 35940 36386 41925 40630 46749 58165
9252E8165J336j180n907j7373r80J0195R720R589J3168n323q126k434n543J80
$$ 58165 59501 58321 52414 35041 34061 44256 53976 63565 76733 71410 63284 60850 55307 55487
9238E5487m4j1306j3762r250O482J2293M222K7774o550j2917l838m089j8142m942
$$ 55487 55443 44137 30375 21125 27607 39900 44122 71896 65346 52429 48591 44502 26360 21418
9224B1418l159J9342J4447o949J68o376j2620k024k227N62M943Q478p425j7019
$$ 21418 18259 37601 52048 45099 45267 38891 26271 24247 22020 22582 27525 36003 28578 11559
9210A1559K306q007n227J1439K7088N328j907j1618l587J2477j875j0003J3744
$$ 11559 13865 5858 631 12070 39158 44486 42579 30961 27374 39851 37976 27973 41717
9197D1717O494k3799j4535J4664l340o732n307P532k1118P378L3189L763j6319
$$ 41717 48211 24412 9877 24541 21201 14469 9162 16694 -4424 2954 36143 39906 23587
9184B3587j7652P152l024o103K3844J0971J3038N615j2723j5740K0829L1234j8894
$$ 23587 5935 13087 10063 3960 27804 38775 51813 57428 44705 28965 49794 81028 62134
9171F2134m2361M344J1545J2761J5596P458p847J56M899N557O210k093l575o698
$$ 62134 19773 24117 35662 48423 64019 71477 63630 63786 68685 74242 80452 78359 74784 68086
9157F8086J1239R483j1612j3078o902k815O20M122J1134J340N80J9238O119j8986
$$ 68086 79325 88808 77196 64118 57216 54401 55021 59143 70277 71617 72197 91435 97554 78568
9143G8568k5275r975q515J551K163J9825N459k0418j144L83p510n116J7583J3325
$$ 78568 53293 43318 34803 36354 38517 58342 63801 43383 42239 42622 35112 29996 47579 60904
9129F0904L075j2917j4527j0446L644J4555K985l2225r669J6767P438J3730K5400
$$ 60904 63979 51062 36535 26089 29733 44288 47273 15048 5379 22146 29584 43314 68714
9116F8714N002m242r727k935K384m682r117n501l984R165L891Q271J389m585K885
$$ 68714 73716 69474 59747 56812 59196 54514 45397 39896 35912 45077 48968 57239 58628 54043 56928
9101E6928l336l3022j4758J1738K828q722J3437m271N513M19m632K2030K6938
$$ 56928 53592 20570 5812 17550 20378 11656 25093 20822 26335 26754 22122 44152 71090
9088G1090m807j7913m260n551j4707o885o847J138O113R230j1600J0147q183L020
$$ 71090 66283 48370 44110 38559 23852 16967 10120 11258 17371 26601 15001 25148 16965 19985
9074A9985Q324K321P134r915n551P46P383Q423j6500Q16M476K821J171J2840K812
$$ 19985 28309 30630 37764 27849 22298 23044 30427 38850 22350 23166 27642 30463 31634 44474 47286
9059D7286K22o153r894m419J1498J1549j153J3665J2885k071q85j4090j0216q144
$$ 47286 47508 41355 31461 27042 38540 50089 48936 62601 75486 73415 72530 58440 48224 40080
9045D0080r095J1205J2321o416q505l4893K0702R665j4104J033K901N378j8587
$$ 40080 30985 42190 54511 48095 39590 4697 25399 35064 20960 21993 24894 30272 11685
9032A1685Q779J1070q043j9185M939J3752K783q39L996O781J8861k400p134l1100
$$ 11685 20464 31534 23491 4306 9245 22997 25780 24941 28937 35718 54579 52179 45045 13945
9018A3945j0735q440L210M735m947J6459J4634r66O228J4918K274j4466J0637
$$ 13945 3210 -5230 -2020 2715 -2232 14227 28861 27895 34123 49041 51315 36849 47486
9005D7486r34o53j2502m278M693j7387k348O907l880Q414K606m122j0504j3351
$$ 47486 46552 45899 33397 29119 33812 16425 14077 20984 17104 25518 28124 24002 13498 147
8991A47K3228J4930N434K4842j0395j3340k272N261p460j5497R411J2108m639
$$ 147 23375 38305 43739 68581 58186 44846 42574 47835 40375 24878 34289 46397 41758
8978D1758M148K0832j6763r560j6250K595R187j1823K436j470J0634j5069N499
$$ 41758 45906 66738 49975 40415 24165 26760 35947 24124 26560 25090 35724 20655 26154
8965B6154P866j9117j297p407r247J728K2206K0278L808K664J0464K015k824j6091
$$ 26154 34020 14903 13606 6199 -3048 -1320 20886 41164 44972 47636 58100 60115 57291 41200
8951D1200q287j5384j3815k0098Q980R48J947k706J9020J3620r615J3480J0735
$$ 41200 32913 17529 3714 -16384 -7404 -6456 -4509 -7215 11805 25425 15810 29290 40025
8938D0025N91j6316m263j471o32l361J015P32j3563L311m434q511P895P191j3183
$$ 40025 40616 24300 20037 18566 17934 14573 15588 16320 2757 6068 1634 -6877 1018 8209 -4974
8923d974R5J0755j467N98j776J0657m730n552R068K0355J5109N98n715j5707q96
$$ -4974 -4879 5876 4409 5007 3231 13888 9158 3606 12674 33029 48138 48736 43021 27314 26418
8908B6418k4605J4236K5491K4021J183k8842j2128r627j0828O546J6606J0810
$$ 26418 1813 16049 41540 65561 66744 37902 25774 16147 5319 11865 28471 39281
8896C9281o377j7066O716J1326k730o562q234k9141o445j518j5105J0771j006
$$ 39281 32904 15838 22554 33880 31150 24588 16354 -12787 -19232 -20750 -35855 -25084 -26090
8883b6090P120J4636J3177K660K548K785Q923k671J3818L607j3548j8829J3276
$$ -26090 -18970 -4334 8843 11503 14051 16836 25759 23088 36906 40513 26965 8136 21412
8870B1412K3896k262Q459Q61O837j0179m604j668j5437n205J7095o485j0827o900
$$ 21412 45308 43046 51505 52366 59203 49024 44420 42752 27315 22110 39205 32720 21893 14993
8856A4993L464J8977r867L693N725n590m015P292k455m741P884K0658J0482p946
$$ 14993 18457 37434 27567 31260 36985 31395 27380 34672 32217 27476 35360 56018 66500 58554
8842E8554k0350q645j3329q178J6884K568M48j0170j506R106n738J061J317r825
$$ 58554 38204 29559 16230 8052 24936 27504 27952 17782 16276 25382 19644 20705 22022 12197
8828A2197J3281J4413j0258j5471j386n487j4261l08K0921J898j2073p45N033
$$ 12197 25478 39891 29633 14162 12776 7289 -6972 -7280 13641 15539 3466 2721 7754
8815G754J7373K6634j1230j3747j1051m058k06K4205K2438l90j2182p110Q724
$$ 7754 25127 51761 40531 26784 15733 11675 11469 35674 58112 57722 45540 38430 47154
8802D7154o121J0286R039O426j7959q814l23Q0nl3427j1715L596Q018L196J0252
$$ 47154 41033 51319 60358 66784 48825 40011 39688 39768 39763 6336 -5379 -1783 6235 9431 19683
8787A9683Q624Q419J095J0380j441J863j1994P627N094j7417k4239k2532N500
$$ 19683 28307 36726 37821 48201 46760 48623 36629 44256 49350 31933 7694 -14838 -9338
8774i338J9652J5611j1934p747J6796O201L795P303l349o137M117k0252j4297
$$ -9338 10314 25925 13991 6244 23040 29241 33036 40339 36990 30853 34970 14718 421
8761D21J5220Q058O187j0849K653J8229j915m222O930r650N277j0378j8779k421
$$ 421 15641 23699 29886 19037 21690 39919 38004 33782 40712 31062 36339 25961 7182 4761
8747D761O330M271j3722j1604J4994M782j0767n421j0664j7582J3384K5739J5318
$$ 4761 11091 15362 1640 -9964 5030 9812 -955 -6376 -17040 -34622 -21238 4501 19819
8734A9819j4022J2752Q119p418L403J3425k5257k8084J3872Q98K6429q345J2297
$$ 19819 5797 18549 26668 19250 22653 36078 10821 -17263 -3391 -2493 23936 15591 27888
8721B7888J3975k5129j9943J2888J0877J8159J8l195N542J486J218k954m799q065
$$ 27888 41863 16734 -3209 9679 20556 38715 38733 35538 41080 42566 43784 40830 36031 27966
8707B7966O754J3183k2170j8098P925K5075j4364k9967j1652j3475j3289J1219
$$ 27966 34720 47903 25733 7635 15560 40635 26271 -3696 -15348 -28823 -42112 -30893
8695c0893L7267J1214J39J414L744J1084N371N061j9266k0846k678k907k757J5488
$$ -30893 6374 17588 17727 19141 22885 33969 39340 44401 25135 4289 1611 -1296 -4053 11435
8681A1435q076l051N076l257M668r27J3291j0126Q59K0354R905Q401m631k0964
$$ 11435 3359 308 5384 2127 6795 5868 19159 9033 9892 30246 40151 48552 43921 22957
8667B2957M284M749P023J6878j5271J088j4154R18j6701l042J7727P907J41r728
$$ 22957 27241 31990 39013 55891 40620 41708 27554 28472 11771 8729 26456 34363 34504 24776
8653B4776N750O076m320j6306j4641j724L309J8945l763J538L0678n627j7017
$$ 24776 30526 36602 32282 15976 1335 -389 2920 21865 18102 19640 50318 44691 27674
8640B7674K821Q692L682L023J3647O371o511k9599P89M783r920j052J6149k9556
$$ 27674 30495 39187 42869 45892 59539 65910 59399 29800 30589 35372 25452 24400 40549 10993
8626A0993j3245J5355J0663J2123R680k358k0469j3471j414p099Q408L776J049
$$ 10993 -2252 13103 23766 35889 45569 43211 22742 9271 7857 758 9166 12942 13991
8613A3991o47k77J51j4088j983L0170K1208j4637j4106o27J8844j3600o079j726
$$ 13991 13344 13067 13218 -870 -2853 27317 48525 33888 19782 19155 37999 24399 18320 16594
8599A6594P436L175L982P834J496J1644M063n766J806P841O029n311o351M061
$$ 16594 24030 27205 31187 39021 40517 52161 56224 50458 52264 60105 66134 60823 54472 58533
8585E8533M537r975n678q310J242q85j0891O031J9505j570q960j6057O032J3902
$$ 58533 63070 53095 47417 39107 40349 39464 28573 34604 54109 52539 43579 27522 33554 47456
8571D7456m552J334j322P727N20r246k522j305J0447k414j5694j2183r165m321
$$ 47456 42904 44238 42916 50643 51163 41917 39395 38090 48537 46123 30429 18246 9081 4760
8557D760O313J5714J8964o141N418K7660j729j6396j7333n034j1307j904M684
$$ 4760 11073 26787 45751 39610 45028 72688 70959 54563 37230 32196 20889 18985 23669
8544B3669j5109Q53K800l865r437J6236O350q538J1689P455M909j5700j4748P629
$$ 23669 8560 9413 12213 8348 -1089 15147 21497 12959 24648 32103 37012 21312 6564 14193
8530A4193J8683n721j7758l338J260m16o929m868j185J02O944R359P393J6366
$$ 14193 32876 27155 9397 6059 7319 6903 -26 -4894 -6079 -5977 967 10326 17719 34085
8516C4085J842J4320m990j3947l090n158n231J3913Q431J882m526o69j793m169
$$ 34085 35927 50247 45257 31310 28220 23062 17831 31744 40175 42057 37531 36862 35069 30900
8502C0900j8937p430n155l904O319L0955N826j0166j4401j6430L801Q917K801
$$ 30900 11963 4533 -622 -4526 1793 32748 38574 28408 14007 -2423 1378 10295 13096
8489A3096N791O755M824k5091k3193J9255K3770l664j3875J1724K0119k606j8768
$$ 13096 18887 25642 30466 5375 -17818 1437 25207 21543 7668 19392 39511 36905 18137
8476A8137P840L655n963o485l816j2320J0438J2310L758r37k0094j7683n593N677
$$ 18137 25977 29632 23669 17184 13368 1048 11486 23796 27554 26617 6523 -11160 -16753 -11076
8462a1076O540J1384K3244L625p821j678J9494Q067j7905j2564L666j863n859
$$ -11076 -4536 6848 30092 33717 25896 24218 43712 51779 33874 21310 24976 23113 17254
8449A7254j1142J2314L1584K369j916M414o892J276k6317j9543l288J1150J0245
$$ 17254 6112 18426 50010 52379 50463 54877 47985 49261 22944 3401 113 11263 21508
8436B1508J8280N625N248Q288L786q229r623n76m850j4545q995J9582r789r187
$$ 21508 39788 45413 50661 58949 62735 54506 44883 44307 39457 24912 15917 35499 25710 16523
8422A6523o153L204J0446k746l920l271N02K1834K2898j1855k2344j059r285r788
$$ 16523 10370 13574 24020 21274 17354 14083 14585 36419 59317 47462 25118 24059 14774 4986
8408D986J677N809l741k464L650J8785n503j3516J91l775L96J2379J0808L019
$$ 4986 6663 12472 8731 6267 9917 28702 23199 9683 9874 6099 6495 18874 29682 32701
8394C2701P756k1868N39k175j391P389P6R775R366o28l014L229J1885Q3p142P928
$$ 32701 40457 18589 19128 16953 15562 22951 23027 32802 42168 41540 38526 41755 53640 53723 46581 54509
8378E4509O600k996j6305m1225k2687J0709K0092J2393J0822k541j4893j3581
$$ 54509 61109 58113 41808 583 -22104 -11395 8697 21090 31912 29371 14478 897
8366H97j0984n512l757J0272L6858M331j3574q18R363K1950O735j7392N764j7985
$$ 897 -10087 -15599 -19356 -9084 27774 32105 18531 17713 27076 49026 55761 38369 44133 26148
8352B6148j8689k4566N760K085R125P206K153R159Q159j0077j443Q145P762N631
$$ 26148 7459 -17107 -11347 -9262 -137 7069 9222 18381 26540 16463 15020 23165 30927 36558
8338C6558P376j2818k383r242m178j2235J256l538L0184J0341J847k142k4807
$$ 36558 43934 31116 28733 19491 15313 3078 4334 796 30980 41321 43168 41026 16219
8325A6219q366K723r579J666K5949L860j2824j1521j2412p257j879J1285J6784
$$ 16219 7853 10576 997 2663 28612 32472 19648 8127 -4285 -11542 -13421 -2136 14648
8312A4648j6737r256K136J990Q169Q261R405m17j3475o03N575O120O683k013j5207
$$ 14648 -2089 -11345 -9209 -7219 950 9211 18616 18199 4724 4121 9696 15816 22499 20486 5279
8297E279j5420j394J881K0113M002k1429J2617J0061p721r58P423O822O383r740
$$ 5279 -10141 -11535 -9654 10459 14461 -6968 5649 15710 7989 7031 14454 21276 27659 17919
8283A7919j959J6979N36j6304j9904l843o447J6781J2878K70p625k228O514J9600
$$ 17919 15960 32939 33475 17171 -2733 -6576 -13023 3758 16636 16906 9281 7053 13567 33167
8269C3167P08j57J3877q287l3104j3002O568k7O430J9045o12j2295j3757j8663
$$ 33167 33875 33718 47595 39308 6204 -6798 -230 -257 6173 25218 24606 12311 -1446 -20109
8255b0109K6111Q556j4906J036N807L648O752L119J0747j909l447K382r101K698
$$ -20109 6002 14558 -348 688 6495 10143 16895 20014 30761 28852 25405 27787 18686 21384
8241B1384K8575N689o995j1967j68j337p68J897k6411j9355J120K561j635m523
$$ 21384 49959 55648 48653 36686 36518 35181 34413 36310 9899 -9456 -8336 -5775 -7410 -11933
8227a1933O031q035Q078j643K0000J6587L903M075j985R772Q753p994j2398k4278
$$ -11933 -5902 -13937 -5859 -7502 12498 29085 32988 37063 35078 44850 53603 45609 33211 8933
8213H933j0082J6900J2918L173p301J880k2455k1334K049o58J0055l819j1706
$$ 8933 -1149 15751 28669 31842 24541 26421 3966 -17368 -15319 -15977 -5922 -9741 -21447
8200b1447k110J4610k335j6527n087K7576R229N074J4446j0580n792M247p084
$$ -21447 -23557 -8947 -11282 -27809 -32896 -5320 3909 8983 23429 12849 7057 11304 4220
8187D220J9674o771J2549K237K782R320k3160k4584m426l677n124J0881K3908
$$ 4220 23894 17123 29672 31909 34691 44011 20851 -3733 -8159 -11836 -16960 -6079 17829
8174A7829J9129k5336k8614J6654J8289K9128p824l1624j0905N555m001N59Q661
$$ 17829 36958 11622 -16992 -338 17951 47079 39255 7631 -3274 2281 -1720 -1161 7500
8161G500n179j7234P293L599J8855J4897L822j8876m0071j3163J9087M1647k670
$$ 7500 2321 -14913 -7620 -4021 14834 29731 33553 14677 -25394 -38557 -19470 22177 19507
8148A9507k7273j6884j0655P406K1944J6804k2754m700J3238o121M090L156q723
$$ 19507 -7766 -24650 -35305 -27899 -5955 10849 -11905 -16605 -3367 -9488 -5398 -2242 -10965
8135a0965K1563o122n64R13j7258j3837O658L278K1761O72J089K003m912R390
$$ -10965 10598 4476 3912 4825 -12433 -26270 -19612 -16334 5427 6099 7188 9191 4279 13669
8121A3669J4437j483Q331k060j1034K139j473m814P885O702l02M837J1118o675
$$ 13669 28106 26623 34954 32894 21860 23999 22526 17712 25597 32299 31997 36834 47952 41277
8107D1277k4492J857J4342M903j8032j6045j689P423L19n823J5180J1402j6869
$$ 41277 16785 18642 32984 37887 19855 3810 2121 9544 9863 4040 19220 30622 13753
8094A3753k396J0774j972l217k2769p817J7160l324o472K354K3653N602M081P469
$$ 13753 11357 22131 20159 16942 -5827 -13644 3516 192 -6280 -3926 19727 25329 29410 36879
8080C6879J1161n441l44j3071j179P936p041m6146J787K3195k51j5440P161o874
$$ 36879 48040 42599 42255 29184 28005 35941 28900 -17246 -15459 7736 7485 -7955 -794 -7668
8066g668j790j3530N524J2804K3086l735M526J2189n34j869o053j8151j1157N2
$$ -7668 -9458 -22988 -17464 -4660 18426 14691 19217 31406 30872 29003 22950 4799 -6358 -6306
8052f306o055O39m253j746K0445J6527J2601n367m565j0909l041j448L818O461
$$ -6306 -12361 -11722 -15975 -17721 2724 19251 31852 26485 21920 11011 7970 6522 10340 16801
8038A6801K075o589K567m350J3382q778j6690L98r818r131j5608Q782J4222L0032
$$ 16801 18876 12287 14854 10504 23886 15108 -1582 -1184 -11002 -20133 -35741 -26959 -12737 17295
8024A7295J2452R475m43j7609j5258J571J4145m149m598r471m330q99J3394J0220
$$ 17295 29747 39222 38779 21170 5912 7483 21628 17479 12881 3410 -920 -1819 11575 21795
8010B1795Q527p967o922J7703j2992l4147P109J7297O746L825R821J1323l627
$$ 21795 30322 22355 15433 33136 20144 -14003 -6894 10403 17149 20974 30795 42118 38491
7997C8491k7209j7745K2722J6719l43J2886j0649j5799j2015j2498K268K5616
$$ 38491 11282 -6463 16259 32978 32635 45521 34872 19073 7058 -5440 -3172 22444
7985B2444K1458j492j522J3578m301Pj5083j1350M247K720k678R044j3958j0312
$$ 22444 43902 42410 40888 54466 50165 50172 35089 23739 27986 30706 28028 37072 23114 12802
7971A2802r166l005J006l965J2582J6315n871j8666j4530k637J2264J3036J7911
$$ 12802 3636 631 1637 -2328 10254 26569 20698 2032 -12498 -15135 -2871 10165 28076
7958B8076K068j59j490K595O397J431k513j0429L69k0332O998K170k0026l714
$$ 28076 30144 29985 28495 31090 37487 38918 36405 25976 26345 6013 13011 15181 -4845 -8559
7944h559K3754J8040j3431l785K4830M423j2971k5070p830n883j2931P515L713
$$ -8559 15195 33235 19804 16019 40849 45272 32301 7231 -599 -6482 -19413 -11898 -8185
7931h185L707O705k336M246Q476M273J9826o298r863k2504P27P470J7430j228
$$ -8185 -4478 2227 -109 4137 12613 16886 36712 30414 20551 -1953 -1226 6244 23674 22446
7917B2446O906l293k3120J530J6006P40j0514o217Q556j311K2972J089l147j2515
$$ 22446 29352 26059 2939 4469 20475 21215 10701 4484 13040 11729 34701 35790 32643 20128
7903B0128r11j6319j8303P671Q044p645l347L626N032n004j976n637n256q462
$$ 20128 19217 2898 -15405 -7734 310 -7335 -10682 -7056 -2024 -7028 -9004 -14641 -19897 -28359
7889b8359n13J7052K3756K975r590J2432J8216J3760p775k7004P660N299j771
$$ -28359 -28872 -11820 11936 14911 5321 17753 35969 49729 41954 14950 22610 27909 26138
7876B6138J1808j2967j6949m340K523r753J7176K2413J978j4405m030j2761M506
$$ 26138 37946 24979 8030 3690 6213 -3540 13636 36049 38027 23622 19592 6831 11337
7863A1337R640q087k078j2640K51P514J5824J0863j4648j9728O290L615j2148
$$ 11337 20977 12890 10812 -1828 -1577 5937 21761 32624 17976 -1752 4538 8153 -3995
7850c995Q075R058k1194k2083n454J5488J1772L2611P154J400j177P683j5434
$$ -3995 4080 13138 -8056 -30139 -35593 -20105 -8333 24278 31432 32832 31655 39338 23904
7837B3904k4071j8026K1892L2589L2366k1940j2691j6575o607j4254m368J1969
$$ 23904 -167 -18193 3699 36288 68654 46714 34023 17448 10841 -3413 -7781 4188
7825D188K993R568j3864j0825J659l347o305j3602J6574m611J540J2290K797L900
$$ 4188 7181 16749 2885 -7940 -6281 -9628 -15933 -29535 -12961 -17572 -16032 -3742 -945 2955
7811B955K397J9740p783j2615q370k408q998L1539R864j2849q554M401l177K271
$$ 2955 5352 25092 17309 4694 -3676 -6084 -15082 16457 26321 13472 4918 9319 6142 8413
7797H413O43L559n299M630K0719N744o923J2271j767o889j1541K1848M007j6359
$$ 8413 9056 12615 7316 11946 32665 38409 31486 43757 41990 35101 23560 45408 49415 33056
7783C3056j2905o39J547k425k435j4525r283k2841o3J8533J734o56K1506M348
$$ 33056 20151 19512 21059 18634 16199 1674 -7609 -30450 -30513 -11980 -10246 -10902 10604 14952
7769A4952m357J4487j1782r050O614r358k3438K6852J0998k1761J24j929p993
$$ 14952 10595 25082 13300 4250 10864 1506 -21932 4920 15918 -5843 -5719 -7648 -15641
7756a5641J0716N878j492o222q445O441P464p102l011N555p133p469K0788N040
$$ -15641 -4925 953 -539 -6761 -15206 -8765 -1301 -8403 -11414 -5859 -12992 -20461 327 5367
7742E367j7603J1265R743r86j0840K6159o277q192m025m648K3496j561J7703Q87
$$ 5367 -12236 -971 8772 7786 -3054 23105 16828 8636 4611 -37 23459 21898 39601 40488
7728D0488k3074p708K7405O303k0252j3442j1916j670J597J2547k831j3897o997
$$ 40488 17414 9706 37111 43414 23162 9720 -2196 -3866 -2269 10278 7447 -6450 -13447
7715a3447J4167K2974L837J06J795M57j1712L546j296j335j5712N37l819r718
$$ -13447 720 23694 27531 27637 29432 29889 18177 21723 20427 19092 3380 3917 98 -9620
7701i620J8725Q928P954j2394r43J974m984J408K975l693o793J9423j7025k8245
$$ -9620 9105 18033 25987 13593 12650 14624 9640 11048 14023 10330 3537 22960 5935 -22310
7687b2310j381J6605O785Q571j304M572O014Q652k589k7352j1569j6314j639J8516
$$ -22310 -23691 -7086 -301 8270 6966 11538 17552 26204 23615 -3737 -15306 -31620 -33259 -14743
7673a4743l433P458J1414J4237p025j1810J3052J1777j3855j2403j0388O633J530
$$ -14743 -18176 -10718 696 14933 7908 -3902 9150 20927 7072 -5331 -15719 -9086 -7556
7660g556r783p440J3779J8391L940k3667j377R278R716J0405q448k250O756j619
$$ -7556 -17339 -24779 -11000 7391 11331 -12336 -13713 -4435 5281 15686 7238 4988 11744 10125
7646A0125j3250J2947J891j3368M797m391P561j6613Q192K0311r861j4622j1993
$$ 10125 -3125 9822 11713 -1655 3142 -1249 6312 -10301 -2109 18202 8341 -6281 -18274
7633a8274R085k707k1044R909J3019J1432R053l488l171L1O768J4113n23O223
$$ -18274 -9189 -11896 -32940 -23031 -10012 1420 10473 6985 3814 3845 10613 24726 24203 30426
7619C0426l915j0398k8728J551Q825L497r525q548K0036J8276r422M744J15o124
$$ 30426 26511 16113 -12615 -11064 -2239 1258 -8267 -16815 3221 21497 12075 16819 16934 10810
7605A0810j2361r707n537o328J4447J9830q02J7339q602r200k4095j3245J0357
$$ 10810 -1551 -11258 -16795 -23123 -8676 11154 10352 27691 19089 9889 -14206 -27451 -17094
7592a7094J1930j1337j1060R104J3942J9155J5806O762L147j2867j206k440j4731
$$ -17094 -5164 -16501 -27561 -18457 -4515 14640 30446 37208 40355 27488 26282 23842 9111
7579I111j2339J7116J9469j9949k2373K971m620K0432J4076k9531j3042n83K0143
$$ 9111 -3228 13888 33357 13408 -8965 -5994 -10614 9818 23894 -5637 -18679 -19262 881
7566H81R39K556J762o70m746N570L388j7560j7460J4029J2807R34p240K4076K4358
$$ 881 1820 4376 6138 5468 722 6292 9680 -7880 -25340 -11311 1496 2430 -4810 19266 43624
7551D3624m786p340j4762j7361q627r227J4871J2979M729m479n016j3945r604
$$ 43624 38838 31498 16736 -625 -9252 -18479 -3608 9371 14100 9621 4605 -9340 -18944
7538a8944R999k6731j7682K1756K5865J1489o263K853N56j0540L134k044M439
$$ -18944 -8945 -35676 -53358 -31602 -5737 5752 -511 2342 2898 -7642 -4508 -6552 -2113
7525b113Q101K1749j855j8480j1775l06L292J2350k600j8354M628J2072O125o186
$$ -2113 5988 27737 25882 7402 -4373 -4679 -1387 10963 8363 -9991 -5363 6709 12834 6648
7511F648k4819j1421R110J1513L795k34J0236p754m081L859O449J1130R857J3849
$$ 6648 -18171 -29592 -20482 -8969 -5174 -5408 4828 -2926 -7007 -3148 3301 14431 24288 38137
7497C8137j1449q826j098n456k934N577P11j1543k0172J562R147K2968R636q130
$$ 38137 26688 17862 16764 11308 8374 13951 14662 3119 -17053 -15491 -6344 16624 26260 18130
7483A8130l796j3974r638m793P179k69M494L327J1194k0653j3578p329P014p61
$$ 18130 14334 360 -9278 -14071 -6892 -7161 -2667 660 11854 -8799 -22377 -29706 -22692 -23453
7469b3453j218K267P557j7652r275k010K2106K4555R87k4370j7802O5K1476J3182
$$ -23453 -24671 -22404 -14847 -32499 -41774 -43784 -21678 2877 3864 -20506 -38308 -38243 -16767 -3585
7455c585q354J0125R965o034j389K3558p408j8482k7912P510R993o67q737n097
$$ -3585 -11939 -1814 8151 2117 728 24286 16878 -1604 -29516 -22006 -12013 -12680 -21417 -26514
7441b6514k17P090K5075J5234j1884j6366N998J1020q397k3988j0510J1385P335
$$ -26514 -26731 -19641 5434 20668 8784 -7582 -1584 9436 1039 -22949 -33459 -22074 -14739
7428a4739Q152J6548J4587J68p447k3570M534J6195M741j8711j8248m803m0P284
$$ -14739 -6587 9961 24548 24716 17269 -6301 -1767 14428 19169 458 -17790 -22593 -22633 -15349
7414a5349j220j3067J2029K2450O551q730r755J3682J4068k083L030j3173j5870
$$ -15349 -16569 -29636 -17607 4843 11394 2664 -7091 6591 20659 18576 21606 8433 -7437
7401g437L912N197o167j1762J927Q438K106j5844j6995r688M450n5K672K3310
$$ -7437 -3525 1672 -4495 -16257 -14330 -5892 -3786 -19630 -36625 -46313 -41863 -41918 -39246 -15936
7387a5936J8716K940q560l762M997M584P828k140j5086j753Q370P081P712l348
$$ -15936 2780 5720 -2840 -6602 -1605 2979 10807 8667 -6419 -8172 198 7279 14991 11643
7373A1643j2144j8830K55l502k801L644P369m932J7221J5750k697J501l264j7482
$$ 11643 -501 -19331 -19076 -22578 -25379 -21735 -14366 -19298 -2077 13673 10976 12477 9213 -8269
7359h269j5503J4631K949j247J4241r562J4849M933J1561j0770p578l137J9734
$$ -8269 -23772 -9141 -6192 -7439 6802 -2760 12089 17022 28583 17813 10235 7098 26832
7346B6832j2513J482j7704j0833J2891n075j0427L504R552o433j1979J0210L041
$$ 26832 14319 15801 -1903 -12736 155 -4920 -15347 -11843 -2291 -8724 -20703 -10493 -7452
7333g452J4453J4783J0668k787K187R768K165p330k4526p322M627p65k8981Q999
$$ -7452 7001 21784 32452 29665 31852 41620 43785 36455 11929 4607 9234 8469 -20512 -11513
7319a1513K129p900j9435L079J0677m738Q345K838n06j3487j2961k322P139R373
$$ -11513 -9384 -17284 -36719 -33640 -22963 -27701 -19356 -16518 -17024 -30511 -43472 -45794 -38655 -29282
7305b9282k192n295J5937l758j9788o582P173j1056o05J8401J8440P612n869L524
$$ -29282 -31474 -36769 -20832 -24590 -44378 -50960 -43787 -54843 -55448 -37047 -18607 -10995 -16864 -13340
7291a3340n969K0087K914j5392O539K728K374j5196Q032L002k2671j6253L194
$$ -13340 -19309 778 3692 -11700 -5161 -2433 -59 -15255 -7223 -4221 -26892 -43145 -39951
7278c9951J8631j29R326J0884j3030j2900Q785J4232l832l929l535J4794J7140
$$ -39951 -21320 -21449 -12123 -1239 -14269 -27169 -18384 -4152 -7984 -11913 -15448 -654 16486
7265A6486m192j0721l603K284r825M53J1096o220n828j488N616j62J397n085R85
$$ 16486 12294 1573 -2030 254 -9571 -9118 1978 -4242 -10070 -11558 -5942 -6104 -4707 -9792 -8807
7250h807K936K1240M084j8280j4638K015R263r473J1166r391L558L198j300Q796
$$ -8807 -5871 15369 19453 1173 -13465 -11450 -2187 -11660 -494 -9885 -6327 -3129 -4429 4367
7236D367m301o047R228r969o322k699j0803m492P958J5329O08l766r043K9656
$$ 4367 66 -5981 3247 -6722 -13044 -15743 -26546 -31038 -23080 -7751 -7143 -10909 -19952 9704
7222I704L588m213J2917k699j1769j5031q542K248k0089j1668J6894Q526K827
$$ 9704 13292 9079 21996 19297 7528 -7503 -16045 -13797 -33886 -45554 -28660 -20134 -17307
7209a7307P785k048k191j0435l201K629J7113J2966O995j0885q795M626m006l062
$$ -17307 -9522 -11570 -13761 -24196 -27397 -24768 -7655 5311 12306 1421 -7374 -2748 -6754 -9816
7195i816K0459M101r75M668L393o659j5272o614Q919Q513J6982N163L19J0969
$$ -9816 10643 14744 13769 18437 21830 15171 -101 -6715 2204 10717 27699 32862 33181 44150
7181D4150j028k5457j4123q589J5297j3177M948J1570k4698j8739m192K1291p756
$$ 44150 43122 17665 3542 -5047 10250 -2927 2021 13591 -11107 -29846 -34038 -12747 -20503
7168b0503K5688N097L979J3824q934j3425n542n929m221q305M28j4737J589J8217
$$ -20503 5185 10282 14261 28085 19151 5726 184 -5745 -9966 -18271 -17843 -32580 -30991 -12774
7154a2774P342P498K246j1785Q352j27j3185n925l18L24J1767P628N266K243j1068
$$ -12774 -5432 2066 4312 -7473 879 752 -12433 -18358 -18676 -18352 -6585 1043 6309 8552 -2516
7139b516l0734P740K5814j143j3779L4172M0632j3541j1725j3335j468Q331M846
$$ -2516 -33250 -25510 304 -839 -14618 19554 60186 46645 34920 21585 20117 28448 33294
7126C3294Q925j2785j297m38j2259j5662K125j242k976j7667k0749O458R522J222
$$ 33294 42219 29434 28137 27699 15440 -222 1903 661 -2315 -19982 -40731 -34273 -24751 -23529
7112b3529J692L592J7857p013n638J6775Q969L711J2703n245j3422J8440K7188
$$ -23529 -21837 -18245 -388 -7401 -13039 3736 12705 16416 29119 23874 10452 28892 56080
7099E6080J935k4838l7499k1937J2158L02o6o809r807j5084J1211K7032J722j7054
$$ 56080 58015 33177 -4322 -26259 -14101 -13799 -13865 -20674 -30481 -45565 -34354 -7322 -5600 -22654
7085b2654n955N121p641n688J565q409o17K9093K4067o311j7287K909m166N87
$$ -22654 -28609 -23488 -31129 -36817 -35252 -43661 -44278 -15185 8882 2571 -14716 -11807 -15973 -15386
7071a5386n240o840Q842p787J2304r65M225M35J6819j6344n738o628J0701n722
$$ -15386 -20626 -27466 -18624 -26411 -14107 -15072 -10847 -10412 6407 -9937 -15675 -22303 -11602 -17324
7057a7324j1912J0008K9177N008J7915J6998J954j3709r211j1565j503j4792J2828
$$ -17324 -29236 -19228 9949 14957 32872 49870 51824 38115 28904 17339 15836 1044 13872
7044A3872J2421k0806n213l013j128Q377j2791J321J572r172l372J1579R554K728
$$ 13872 26293 5487 274 -2739 -3867 4510 -8281 -6960 -5388 -14560 -17932 -6353 3201 5929
7030E929Q839r481o021J8153K378j8300l996q019J128J3240n680J4486Q814J35
$$ 5929 14768 5287 -734 17419 19797 1497 -2499 -10518 -9390 3850 -1830 12656 21470 21605
7016B1605n942k9878j7143j5J6085l184L78J808n005M731K866K3252P228J3880
$$ 21605 15663 -14215 -31358 -31373 -15288 -18472 -18094 -16286 -21291 -16560 -13694 9558 16786 30666
7002C0666l731L620M63m644l521k3521n812M40l796P184r275p216L830P359N275
$$ 30666 26935 30555 31018 26374 22853 -668 -6480 -6040 -9836 -2652 -11927 -19143 -15313 -7954 -2679
6987b679k135n931L854m301J153o635K658j431J3104k9L813o307q43J3701J775
$$ -2679 -4814 -10745 -6891 -11192 -10039 -16674 -14016 -15447 -2343 -2372 1441 -4866 -5709 7992 9767
6972I767P503p95q163k4272m724J6960O338L422M046M637J089r561o404J8136
$$ 9767 17270 16475 8312 -15960 -20684 -3724 2614 6036 10082 14719 15808 6247 -157 17979
6958A7979J7554n056k3225j3018J5754L0070l488k0124k645l301N912j015k0978
$$ 17979 35533 30477 7252 -5766 9988 40058 36570 16446 13801 10500 16412 15397 -5581
6945e581n598J2535k988n797k910O62O468Q027k313J713j6403k0112r085l39m902
$$ -5581 -11179 1356 -1632 -7429 -10339 -9677 -3209 4818 2505 4218 -12185 -32297 -41382 -41721 -46623
6930d6623K963K0137J3836O352M598o257n72p227K1627K333J031J0174r286P252
$$ -46623 -43660 -23523 -9687 -3335 1263 -4994 -5566 -12793 8834 11167 12198 22372 13086 20338
6916B0338j186l3525j4336j921J8135j486p54p787P497J9174o715J480L194J4735
$$ 20338 19152 -14373 -28709 -30630 -12495 -13981 -14735 -22522 -15025 4149 -2566 -1086 2108 16843
6902A6843n475j6975M150Q784J745O441O628O097L290J3862k621k3911k3287O70
$$ 16843 11368 -5607 -1457 7327 9072 15513 22141 28238 31528 45390 42769 18858 -4429 -3759
6888c759M099J2516J577N0r991J0768L479j3047K46k704o50k375Q474R135j1503
$$ -3759 340 12856 14433 14483 4492 15260 18739 5692 5938 3234 2584 209 8683 17818 6315
6873F315r332Q344K197Q376j3322o492N934Q380J7437j4834j0259n48K4583r996
$$ 6315 -3017 5327 7524 15900 2578 -3914 2020 10400 27837 13003 2744 2196 26779 16783
6859A6783l5199q475j4909l839J9645k629N324K3659j4947j0131M588K8186l189
$$ 16783 -18416 -26891 -41800 -45639 -25994 -28623 -23299 360 -14587 -24718 -20130 8056 4867
6846D867N619j873j9975o11M750J723k1562L291J3444K235j4216Q665J7779J0792
$$ 4867 10486 8613 -11362 -11973 -7223 -5500 -27062 -23771 -10327 -8092 -22308 -13643 4136 14928
6832A4928j3174j9155j687J8683l865j1623p055O696J287J1250Q440P117J2668
$$ 14928 1754 -17401 -19088 -405 -4270 -15893 -22948 -16252 -14965 -3715 4725 11842 24510
6819B4510j0698j6642R937L795J563j741j6220j1698k697P955J2172k354O337
$$ 24510 13812 -2830 7107 10902 12465 10724 -5496 -17194 -19891 -11936 236 -2118 4219
6806D219j710j1819J7561J5767o317j2699m970j188l153m67k784L466k520j6643
$$ 4219 2509 -9310 8251 24018 17701 5002 32 -1156 -4309 -4776 -7560 -4094 -6614 -23257
6792b3257P48K1289m1318j1641J5876K1938O060K962l269o53Q563L394L879R776
$$ -23257 -22509 -1220 -42538 -54179 -38303 -16365 -10305 -7343 -10612 -11265 -2702 692 4571 14347
6778A4347j1970J163K698m169j83j4496o430j940P326j90K345J370P264L3545
$$ 14347 2377 3540 6238 2069 1886 -12610 -19040 -20980 -13654 -13844 -11499 -10129 -2865 30680
6764C0680N62k5160j6172J5774Q726j1265O046j93k7440k0075L764J8934L4938
$$ 30680 31242 6082 -10090 5684 14410 3145 9191 8998 -18442 -38517 -34753 -15819 19119
6751A9119o623j3295m953k0044k141K0662J7034j0104n987J2078j1673L932n311
$$ 19119 12496 -799 -5752 -25796 -27937 -7275 9759 -345 -6332 5746 -5927 -1995 -7306
6738g306J9405J7168O408j2046j5023k413j2665q761L063J7436k9659j3896J2885
$$ -7306 12099 29267 35675 23629 8606 6193 -6472 -15233 -12170 5266 -24393 -38289 -25404
6725b5404j4263P203J9155O754L702r635J701K542P836K0861j4546j3030M24o859
$$ -25404 -39667 -32464 -13309 -6555 -2853 -12488 -10787 -8245 -409 20452 5906 -7124 -6700 -13559
6711a3559Q129P895J588r872R750J8292j5803j3735k918q341j034l007K124L623
$$ -13559 -5430 2465 4053 -5819 3931 22223 6420 -7315 -10233 -18574 -19608 -22615 -20491 -16868
6697a6868J8420l859j4235Q398J7905O867j4169n666O552P213l515m300P413K396
$$ -16868 1552 -2307 -16542 -8144 9761 16628 2459 -3207 3345 10558 7043 2743 10156 12552
6683A2552O562q142r321q299k218k716K897j6535J3768J2874J3940k366p355n179
$$ 12552 19114 10972 1651 -6648 -8866 -11582 -8685 -25220 -11452 1422 15362 12996 5641 462
6669D62K529J257l900j0954k360J4727O716j0614K074j3285j6001O793O432j983
$$ 462 2991 4248 348 -10606 -12966 1761 8477 -2137 -63 -13348 -29349 -22556 -16124 -18107
6655a8107P631n582o209o874J5027n775J1788P092k232N801n768K0487n126j5105
$$ -18107 -10476 -16058 -22267 -29141 -14114 -19889 -8101 -1009 -3241 2560 -3208 17279 12153 -2952
6641b952j4552J2147J713K167O304m314J0974J3241j4301p98L572j1786n617k327
$$ -2952 -17504 -5357 -3644 -1477 4827 513 11487 24728 10427 9629 13201 1415 -4202 -6529
6627f529k970l872J0495J9024N524j8820r395j3514n998K988J6126p069N6m599
$$ -6529 -9499 -13371 -2876 16148 21672 2852 -6543 -20057 -26055 -23067 -6941 -14010 -13954 -18553
6613a8553K758J173r057L264j0761j1033L296N042j1464K205M143P82L1072J4489
$$ -18553 -15795 -14622 -23679 -20415 -31176 -42209 -38913 -33871 -45335 -43130 -38987 -38205 -7133 7356
6599G356K3045R319j2362o913j2326l443r615l822J1340o461j1972n19j560l772
$$ 7356 30401 39720 27358 20445 8119 4676 -4939 -8761 2579 -3882 -15854 -16373 -17933 -21705
6585b1705J6537P075j408q99J1551k7258p247R329N660K344j2783q962J0969R211
$$ -21705 -5168 1907 499 -400 11151 -16107 -23354 -14025 -8365 -6021 -18804 -27766 -16797 -7586
6571g586m107r494m852M272Q55j0278K3504K5727J0626k0983j1339O295Q017o242
$$ -7586 -11693 -21187 -26039 -21767 -20912 -31190 -7686 18041 28667 7684 -3655 2640 10657 4415
6557D415p623j2527J047J427M707J3565N871k736q281r547J983o009K0132j273
$$ 4415 -3208 -15735 -14688 -13261 -8554 5011 10882 8146 -135 -9682 -7699 -13708 6424 5151
6543E151l872j4786O287L7628N192j0073n956o234j9662k802j10j9913j2729n07
$$ 5151 1279 -13507 -7220 30408 35600 25527 19571 13337 -6325 -9127 -9237 -29150 -41879 -42386
6529d2386r61P818J4838J6089N6R393j4878J91J4038r749k5665j8065r589N427
$$ -42386 -43347 -35529 -20691 -4602 -4546 4847 -10031 -9840 4198 -5551 -31216 -49281 -58870 -53443
6515e3443k618M0204J2525O593J667P882j966N01q875j0678N698J2159P385j7534
$$ -53443 -56061 -15857 -3332 3261 4928 12810 10844 11345 2470 -8208 -2510 9649 17034 -500
6501e00p995q10J7421j131m167l746j0278j0578N329J2276j2905m332O534P124
$$ -500 -8495 -9305 8116 6985 2818 -928 -11206 -21784 -16455 -4179 -17084 -21416 -14882 -7758
6487g758j817n363k057J5104J3346j2811j3679K455j617m459K490R395O839j6260
$$ -7758 -9575 -14938 -16995 -1891 11455 -1356 -15035 -12580 -14197 -18656 -16166 -6771 68 -16192
6473a6192k05q083k0309j3239P387J1478J5912L7648P31j4751j3283r564J4808
$$ -16192 -16397 -24480 -44789 -58028 -50641 -39163 -23251 14397 15128 377 -12906 -22470 -7662
6460g662o923o939R106k70j93K909k4753n076K5525J248j3346Q851k571o864N564
$$ -7662 -14585 -21524 -12418 -12688 -12881 -9972 -34725 -39801 -14276 -13028 -26374 -17523 -20094 -26958 -21394
6445b1394L568K1152K135p307O529j971l402j6974j4997O946K2383L3768o117
$$ -21394 -17826 3326 5461 -1846 4683 2712 -690 -17664 -32661 -25715 -3332 30436 24319
6432B4319j727J7311N381r803k3684j0837k299o202O68Q138J4554j259p289j566
$$ 24319 22592 39903 45284 35481 11797 960 -1339 -7541 -6873 1265 15819 14560 7271 5705
6418E705q661o890j273J1389J3921j0961j5339j0348M093J5274k9197k5673O341
$$ 5705 -2956 -9846 -11119 270 14191 3230 -12109 -22457 -18364 -3090 -32287 -57960 -51619
6405e1619J847m984Q567K0742J4160j8020M521J4300K480J097l981n67j310j0419
$$ -51619 -49772 -54756 -46189 -25447 -11287 -29307 -24786 -10486 -8006 -6909 -10890 -11457 -12767 -23186
6391b3186m777k223K584J108j0137k121L1426k217o187K017J5637J2483o890j2345
$$ -23186 -27963 -30186 -27602 -26494 -36631 -38752 -7326 -9543 -15730 -13713 1924 14407 7517 -4828
6377d828j3789j1066J6119L151J555r452j818O445J3835o52j2452j6358P425r712
$$ -4828 -18617 -29683 -13564 -10413 -8858 -18310 -20128 -13683 152 -500 -12952 -29310 -21885 -31597
6363c1597P593m019N485J1809J1537j5659N136K1509K22j1580J2100J2538J249
$$ -31597 -24004 -28023 -22538 -10729 808 -14851 -9715 11794 12016 436 12536 25074 26323
6350B6323P33j3543p127q180L356m594k809J6085j2848j5760k999o719P962j482
$$ 26323 27056 13513 6386 -1794 1562 -3032 -5841 10244 -2604 -18364 -21363 -28082 -20120 -21602
6336b1602J8908j097J031N06o168r691J871p946O901J3771J9627j4765k5291j8084
$$ -21602 -2694 -3791 -2760 -2254 -8422 -18113 -16242 -24188 -17287 -3516 16111 1346 -23945 -42029
6322d2029J0196R803n332K985L557m064j422N569q775M715m185P101K1294j2587
$$ -42029 -31833 -22030 -27362 -24377 -20820 -24884 -26306 -20737 -29512 -24797 -28982 -21881 -587 -13174
6308a3174J8458J8909k775k370m913K419j9355J797J4072J2084n675j3822q706
$$ -13174 5284 24193 21418 19048 14135 16554 -2801 -1004 13068 25152 19477 5655 -3051
6295c051p271P910j1368j2948Q027M367J4687J3141k369R54N352K173L958j7493
$$ -3051 -10322 -2412 -13780 -26728 -18701 -14334 353 13494 11125 12079 17431 19604 23562 6069
6281F069p86j0387j502R208J0687n747o09J59M769m987j743J882j2846j0922M791
$$ 6069 5283 -5104 -6606 2602 13289 7542 6933 7092 11861 6874 5131 7013 -5833 -16755 -11964
6266a1964j346J2263j438p539L884r431m630j665K8623L889j4157j8437j5047
$$ -11964 -13310 -1047 -2485 -10024 -6140 -15571 -20201 -21866 6757 10646 -3511 -21948 -36995
6253c6995P037J4614K93O207j1917P889L1724K0695j5862k1276l743K535j0549
$$ -36995 -29958 -15344 -15051 -8844 -20761 -12872 18852 39547 23685 2409 -1334 1201 -9348
6240i348M23J1131m526j5314k3050K279p780K0698K1609R673j8598p792R146O662
$$ -9348 -8925 2206 -2320 -17634 -40684 -38405 -46185 -25487 -3878 5795 -12803 -20595 -11449 -4787
6226d787m411m163Q305J8077J8616k761l3699O212j5274r612M882J4423k829P631
$$ -4787 -9198 -13361 -5056 13021 31637 28876 -4823 1389 -13885 -23497 -18615 -4192 -7021 610
6212F10J2885J0968j3248j4148m258J6848N765j5754j9266j2548M061J0949O154
$$ 610 13495 24463 11215 -2933 -7191 9657 15422 -332 -19598 -32146 -28085 -17136 -10982
6199a0982K9052K3414j8403k0500k1777k341K3231K7738K606j1321j7949k5008
$$ -10982 18070 41484 23081 2581 -19196 -21537 1694 29432 32038 20717 2768 -22240
6187b2240n136J0978J3981J1277j5822j0135K7l258Q309M366j2006r333K1222
$$ -22240 -27376 -16398 -2417 8860 -6962 -17097 -17070 -20328 -12019 -7653 -19659 -28992 -7770
6174g770l433j0887j0022K0142J0460O893L445k6280L22J3249k3295N181K0726
$$ -7770 -11203 -22090 -32112 -11970 -1510 5383 8828 -17452 -17130 -3881 -27176 -21995 -1269
6161a269m662j438j639O418j1208k3473J5283J6825L022j6076M598o840j2663
$$ -1269 -5931 -7369 -9008 -2590 -13798 -37271 -21988 -5163 -2141 -18217 -13619 -20459 -33122
6148c3122J356P11J8005J7720m749J1530O385O323j0606Q07o202j8980n439r35
$$ -33122 -31766 -31055 -13050 4670 -79 11451 17836 24159 13553 14360 8158 -10822 -16261 -17196
6134a7196J2125O367Q125J929j2981r103K30P151p096K7R20o565J9139J767L902
$$ -17196 -5071 1296 9421 11350 -1631 -10734 -10504 -3353 -10449 -10422 -9502 -16067 3072 4839 8741
6119H741j5489k0584j6944J2800J4856k386J5177k564r628O849J0622J4756M250
$$ 8741 -6748 -27332 -44276 -31476 -16620 -19006 -3829 -6393 -16021 -9172 1450 16206 20456
6106B0456L524r192j1288m058k521j2766J2726J3348p613J7764l927j5290j3130
$$ 20456 23980 14788 3500 -558 -3079 -15845 -3119 10229 2616 20380 16453 1163 -11967
6093a1967J0056n539j3373k9267o598J5085Q597K8596N641j133p726j7570l932
$$ -11967 -1911 -7450 -20823 -50090 -56688 -41603 -33006 -4410 1231 98 -7628 -25198 -29130
6080b9130J0508L11j2644n489R697l682l990J1537j7063J1281K0096K1252k089
$$ -29130 -18622 -18311 -30955 -36444 -26747 -30429 -34419 -22882 -39945 -28664 -8568 12684 10595
6067A0595j560j2901j2001j4424J952J1775L687M845J426m201M423J2979O072
$$ 10595 9035 -3866 -15867 -30291 -28339 -16564 -12877 -8032 -6606 -10807 -6384 6595 12667
6054A2667L746k6615q825J5692n239j375M500J1822K664j0559q579q887j2830
$$ 12667 16413 -10202 -19027 -3335 -8574 -9949 -5449 6373 9037 -1522 -10101 -18988 -31818
6041c1818J8874K7126n812k0867o362J71j1661J2842K1435J1671q496l174J4735
$$ -31818 -12944 14182 8370 -12497 -18859 -18688 -30349 -17507 3928 15599 7103 3929 18664
6028A8664j7702m930j6791n969K0362J623L153j8182j2024l550j2954J6032J3012
$$ 18664 962 -3968 -20759 -26728 -6366 -4743 -1590 -19772 -31796 -35346 -48300 -32268 -19256
6015a9256L107J928j4696k671J0419N971j0370K0555J7491j4852j4500J2292J1640
$$ -19256 -16149 -14221 -28917 -31588 -21169 -15198 -25568 -5013 12478 -2374 -16874 -4582 7058
6002G058J2129j0551r159K2930k061k0802J0712j7303m459M280J113j5639N964
$$ 7058 19187 8636 -523 22407 20346 -456 10256 -7047 -11506 -7226 -6113 -21752 -15788
5989a5788N808N677Q467o278k531r93m953j0792j4053J5111Q566K305K877L732
$$ -15788 -9980 -4303 4164 -2114 -4645 -5638 -10591 -21383 -35436 -20325 -11759 -9454 -6577 -2845
5975b845Q769J0220K3584O052k1164l4361k283l162J200J5424K4504M222k2313
$$ -2845 5924 16144 39728 45780 24616 -9745 -12028 -15190 -13990 1434 25938 30160 7847
5962G847N092L342l532j8433k2604K3339K480p527m956Q724J9038j0957q958q699
$$ 7847 12939 16281 12749 -5684 -28288 -4949 -2469 -9996 -14952 -6228 12810 1853 -7105 -15804
5948a5804q856m95p31J2068R674n557n382r392l440J5675J3698J0355m104k741
$$ -15804 -24660 -25155 -25886 -13818 -4144 -9701 -15083 -24475 -27915 -12240 1458 11813 7709 4968
5934D968N439J1953O377j8653o854K223n202k2109j3018J9404N846j8925o973
$$ 4968 10407 22360 28737 10084 3230 5453 251 -21858 -34876 -15472 -9626 -28551 -35524
5921c5524J0276L9800j446q209Q750J2160k309j8793j4350p578K927j429l726
$$ -35524 -25248 14552 13106 4897 13647 25807 23498 4705 -9645 -17223 -14296 -15725 -19451
5908a9451q063r235L782o28j913N594J3143o517O40O712j063j4841P745p206R276
$$ -19451 -27514 -36749 -32967 -33595 -35508 -29914 -16771 -23288 -22648 -15936 -16999 -31840 -24095 -31301 -22025
5893b2025J0675K618j0626N805j1004m72K32Q057j1809k2942O990J1913J9391
$$ -22025 -11350 -8732 -19358 -13553 -24557 -25029 -24797 -16740 -28549 -51491 -44501 -32588 -13197
5880a3197l052K509K791j0263J677p888m096L334M842lJ7596l85j87J0355K609
$$ -13197 -16249 -13740 -10949 -21212 -19535 -27423 -31519 -28185 -23343 -23346 -5750 -6135 -6322 4033 6642
5865F642j1418R105j5702j0541L3N485J0712J6925P267q168p640Q114O484j748
$$ 6642 -4776 4329 -11373 -21914 -21881 -16396 -5684 11241 18508 10340 2700 10814 17298 15550
5851A5550j3704r828J785p12K85K115k1556r428k357m998J6705L1042J3050j83
$$ 15550 1846 -7982 -6197 -6909 -6624 -4509 -26065 -35493 -37850 -42848 -26143 4899 17949 17766
5837A7766k4499O62r359r855J1053O992M004m676k0797J0156M554j0754K242p699
$$ 17766 -6733 -6071 -15430 -25285 -14232 -7240 -3236 -7912 -28709 -18553 -13999 -24753 -22511 -30210
5823c0210R395q406l635M780M649J6065j698j2184J912L273P355J0505r335q310
$$ -30210 -20815 -29221 -32856 -28076 -23427 -7362 -9060 -21244 -19332 -16059 -8704 1801 -7534 -15844
5809a5844j0313O69j748J4828J0152o103P15m383j1963j8422O662K8771J9530
$$ -15844 -26157 -25488 -27236 -12408 -2256 -8359 -7644 -12027 -23990 -42412 -35750 -6979 12551
5796A2551j1592K431K299M184R481P01k8505r13p903O078J234k313m926M865N313
$$ 12551 959 3390 5689 9873 19354 20055 -8450 -9363 -17266 -11188 -9954 -12267 -17193 -12328 -7015
5781g015o739N704o110L938K2905J1487n89j5979k1799k548Q403p942L849M683
$$ -7015 -13754 -8050 -14160 -10222 12683 24170 23581 7602 -14197 -16745 -8342 -16284 -12435 -7752
5767g752m524j6922J3171J080Q53L573p707Q917Q001p409o236J511k2739R638
$$ -7752 -12276 -29198 -16027 -14947 -14094 -10521 -18228 -9311 -1310 -8719 -14955 -13444 -36183 -26545
5753b6545K2729j0455k819j9283Q203K9921R582r663p910J453n635j5475k312
$$ -26545 -3816 -14271 -17090 -36373 -28170 1751 11333 1670 -6240 -4787 -10422 -25897 -28209
5740b8209J8802j893l140J555J0643J1457J0589q026P02j1934q839O331r205K098
$$ -28209 -9407 -11300 -14440 -12885 -2242 9215 19804 11778 12480 546 -8293 -1962 -11167 -9069
5726i069J5566j0404j4560q891k430J2451J3517q827j456J683l1104j8378K959
$$ -9069 6497 -3907 -18467 -27358 -29788 -17337 -3820 -12647 -14103 -12420 -43524 -61902 -58943
5713e8943P56J8016J6344O018n221o803j7203J8204P308j1837k4581R879J5985
$$ -58943 -58187 -40171 -23827 -17809 -23030 -29833 -47036 -28832 -21524 -33361 -57942 -48063 -32078
5700c2078j4313J1523R485N335K035Q361p76j0942J1885R6o839L429J7333k868
$$ -32078 -46391 -34868 -25383 -20048 -18013 -9652 -10428 -21370 -9485 -9389 -16228 -12799 4534 1666
5686A666j6160m677p914O030n291k7K5715K2875R758k6576l1363J769J1325p854
$$ 1666 -14494 -19171 -27085 -21055 -26346 -26373 -658 22217 31975 5399 -25964 -24195 -12870 -20724
5672b0724J2865k680k0546L791j1072j9944k648M0435K091j9743k682j68m975
$$ -20724 -7859 -10539 -31085 -27294 -38366 -58310 -60958 -20523 -18432 -38175 -40857 -41025 -46000
5659d6000j513K3798m560k0552K517J7268Q227K341J603l537J773N838j689p873
$$ -46000 -47513 -23715 -28275 -48827 -46310 -29042 -20815 -18474 -16871 -20408 -18635 -12797 -14486 -22359
5645b2359J639J1794J8938J752o074N22Q369k4813r307J6923J8800k557j8144
$$ -22359 -20720 -8926 10012 11764 5690 6212 14581 -10232 -19539 -2616 16184 13627 -4517
5632d517j9258k4053K2600Q450j7600k222J1117J5927N492J249m43J1324M223
$$ -4517 -23775 -47828 -25228 -16778 -34378 -36600 -25483 -9556 -4064 -2815 -3258 8066 12289
5619A2289L344O105k0538j4500O924l011M38J9299Q040j8400j9756q335M373J4769
$$ 12289 15633 21738 1200 -13300 -6376 -9387 -8949 10350 18390 -10 -19766 -28101 -23728 -8959
5605h959L062k859j165k0949R967J0762j462j1658P028j4766L663M014L021m69
$$ -8959 -5897 -8756 -9921 -30870 -20903 -10141 -11603 -23261 -16233 -30999 -27336 -23322 -20301 -20770
5591b0770L123P168j3470o768K3617K0640r905L423L068j5653j3100J8254J0290
$$ -20770 -17647 -10479 -23949 -30717 -7100 13540 3635 7058 10126 -5527 -18627 -373 9917
5578I917n287j3860J780n578p568K0725L4458J725q738j0349o25k4582j2008J8468
$$ 9917 4630 -9230 -7450 -13028 -20596 129 34587 36312 27574 17225 16600 -7982 -19990 -1522
5564a522r93j2137p408j96J0398M384l1N070k817j4593J31J8107J0785k8619j0654
$$ -1522 -2515 -14652 -22060 -22256 -11858 -7474 -7505 -2435 -5252 -19845 -19714 -1607 9178 -19441 -30095
5549c0095Q335k60K9284J7624P498l1837l2269K1157L833j570q916J4201K726
$$ -30095 -21760 -22020 7264 24888 32386 549 -31720 -10563 -6730 -8300 -17216 -3015 -289
5536b89j7774K213n047k8590J5576J0738j4303Q361L2849J2318k1519j8939o213
$$ -289 -18063 -15850 -20897 -49487 -33911 -23173 -37476 -29115 3734 16052 -5467 -24406 -30619
5523c0619J3335K684J2260K3134K797k0297j0435O41q43N167r492L336J4075L695
$$ -30619 -17284 -14600 -2340 20794 23591 3294 -7141 -6500 -7343 -2176 -11668 -8332 5743 9438
5509I438k1789j8177K0486l98p893m091m361j2550N781J6993O095R62k3081K941
$$ 9438 -12351 -30528 -10042 -10440 -18333 -22424 -26785 -39335 -33554 -16561 -10466 -9504 -32585 -29644
5495b9644L799P950L710Q69J2946q372P318r656J6819K575j2118N443j1164p867
$$ -29644 -25845 -17895 -14185 -13316 -370 -8742 -1424 -11080 5739 8314 -3804 1639 -9525 -17392
5481a7392J22j7292Q406j0212k3216o413J5374J5734o750o298O10J2827k102l68
$$ -17392 -17270 -34562 -26156 -36368 -59584 -65997 -50623 -34889 -41639 -47937 -47327 -34500 -36602 -36970
5467c6970n252m173J2465k685K605M265P754K2404l897j7525J8347K0103P321
$$ -36970 -42222 -46395 -33930 -36615 -34010 -29745 -21991 413 -3484 -21009 -2662 17441 24762
5454B4762L026J0254Q935j2798j7133k4773L306J3082P837J2689R905L52j6379
$$ 24762 27788 38042 46977 34179 17046 -7727 -4421 8661 16498 29187 39092 39444 23065
5441B3065j2893k0691k4002j1157j275J9235J0001J3065K175j2177k343J2465
$$ 23065 10172 -10519 -34521 -45678 -46953 -27718 -17717 -4652 -2477 -14654 -16997 -4532
5429d532K0425L312k2599l836K7167L345k0386r994J858k0297K086M178J5433
$$ -4532 15893 19205 -3394 -7230 19937 23282 2896 -7098 -5240 -25537 -23451 -19273 -3840
5416c840k939O42P675L492o553m167j334k650M149N395J772k0060L969m705J4793
$$ -3840 -6779 -6137 1538 5030 -1523 -5690 -7024 -9674 -5525 -130 1642 -18418 -14449 -19154 -4361
5401d361J8098O886j9816k1445l198J3813L887P315R343J0022j7985j1108p582
$$ -4361 13737 20623 807 -20638 -23836 -10023 -6136 1179 10522 20544 2559 -8549 -16131
5388a6131M943J8891k0706k8044J4985R133J45r279J120O507q943m290J3166J704
$$ -16131 -11188 7703 -13003 -41047 -26062 -16929 -16784 -26063 -24943 -18436 -27379 -31669 -18503 -16799
5374a6799j1198K0167q695j1445J9867R0j8563j8254j360M999K246m859Q214J0512
$$ -16799 -27997 -7830 -16525 -27970 -8103 -8013 -26576 -44830 -46190 -41191 -38945 -43804 -35590 -25078
5360b5078J8519P406m333j230j7683N968k306m777Q819j349j1568k2208J3611
$$ -25078 -6559 847 -3486 -4716 -22399 -16431 -18737 -23514 -14695 -16044 -27612 -49820 -36209
5347c6209L360J1122J5894m254j9850K360K1148q921J839l739R186j8500N677
$$ -36209 -32849 -21727 -5833 -10087 -29937 -27577 -6429 -15350 -13511 -17250 -8064 -26564 -20887
5334b0887O096j1587L130J9712n840m792l127o812K0289J5105p421j2105J2978
$$ -20887 -14791 -26378 -23248 -3536 -9376 -14168 -17295 -24107 -3818 11287 3866 -8239 4739
5321D739K076k1062j0011O192m813N263j1111m816J1750q30N363M554Q544j1311
$$ 4739 6815 -14247 -24258 -18066 -22879 -17616 -28727 -33543 -21793 -22623 -17260 -12706 -4162 -15473
5307a5473o521j5631J06J3997K69k039N753o028r887J4967N521l829m727j3517
$$ -15473 -21994 -37625 -37519 -23522 -23253 -25292 -19539 -25567 -35454 -20487 -14966 -18795 -23522 -37039
5293c7039q617o564j7212j0307O978L9862K0738J0742K4231q206k9518q070K0031
$$ -37039 -45656 -52220 -69432 -79739 -72761 -32899 -12161 -1419 22812 14606 -14912 -22982 -2951
5280b951J6064J6024r208q377J865q286K958j4530n083K7090K3449j3927j7099
$$ -2951 13113 29137 19929 11552 13417 5131 8089 -6441 -11524 15566 39015 25088 7989
5267G989j1008j568J6848k345r686o804k510P38j1915j7223J5736J5965j7413
$$ 7989 -3019 -4587 12261 9916 230 -6574 -9084 -8346 -20261 -37484 -21748 -5783 -23196
5254b3196k1847J1283J9804J4816r773j6046J9512J9685j6734j6659j822K0811
$$ -23196 -45043 -33760 -13956 860 -8913 -24959 -5447 14238 -2496 -19155 -20977 -166
5242a66M961j0331R807O41j8184m152K6407J1844J9047K994l0343j4528j5749
$$ -166 4795 -5536 4271 4912 -13272 -17424 8983 20827 39874 42868 12525 -2003 -17752
5229a7752Q466m079j0555K035N419J5961O708j4333o161J090O181K811Q155k734
$$ -17752 -9286 -13365 -23920 -21885 -16466 -505 6203 -8130 -14291 -13201 -7020 -4209 3946 1212
5215A212r31o876J0971q66J4263J4207o58k4129j2614P251q882Q631j489Q285
$$ 1212 281 -6595 4376 3510 17773 31980 31322 7193 -5421 1830 -7052 1579 90 8375
5201H375r945j5628J3275R713j3565q512R478J9418j5646k1319O18j1292M470
$$ 8375 -1570 -17198 -3923 5790 -7775 -16287 -6809 12609 -3037 -24356 -23738 -35030 -30560
5188c0560J4597J998k363l603o666j857J4583Ol352n990L021R918O425J566N789
$$ -30560 -15963 -13965 -16328 -19931 -26597 -28454 -13871 -13865 -17217 -23207 -20186 -10268 -3843 -2277 3512
5173C512L004J2917j2790q015j8669p505J16q255J2900R563J473j1308N795r270
$$ 3512 6516 19433 6643 -1372 -20041 -27546 -27430 -35685 -22785 -13222 -11749 -23057 -17262 -26532
5159b6532J4587m957J675P557L453J867m046j0903j3000k085L088K369J518R274
$$ -26532 -11945 -16902 -15227 -7670 -4217 -2350 -6396 -17299 -30299 -32384 -29296 -26927 -25409 -16135
5145a6135J3162K481P86n776j0528k409j4091j4501Q914J7381K875k929O061J7201
$$ -16135 -2973 -492 294 -5482 -16010 -18419 -32510 -47011 -38097 -20716 -17841 -20770 -14709 2492
5131B492p193l3062o032N867O152J4595M0k1783o410L4887l245K002l981k9191
$$ 2492 -4701 -37763 -43795 -37928 -31776 -17181 -17141 -38924 -45334 -10447 -13692 -11690 -15671 -44862
5117d4862j263J3463p847l58J353j669O695J6321K6330j5884k8696j7230k3245
$$ -44862 -46125 -32662 -40509 -40867 -39514 -41183 -34488 -18167 8163 -7721 -36417 -53647 -76892
5104g6892l881L1529K7415L901J390K86J2958p006j0798p87k601O249L2781k21
$$ -76892 -80773 -49244 -21829 -17928 -16538 -16252 -3294 -10300 -21098 -21885 -24486 -18237 14544 14323
5090A4323j0079r318J0910p380k2374j1938K8009M693j0451j884m580m451l165
$$ 14323 4244 -5074 5836 -1544 -23918 -35856 -7847 -3154 -13605 -15489 -20069 -24520 -27685
5077b7685p553Q273J921L10J5861j896n569O49Q64k533J8096j1673j5283J0643
$$ -27685 -35238 -26965 -25044 -24734 -8873 -10769 -16338 -15689 -14825 -17358 738 -10935 -26218 -15575
5063a5575N675K323M540M984q770j3009N096J0156k925O116J5125J3852N750j0599
$$ -15575 -9900 -7577 -3037 1947 -6823 -19832 -14736 -4580 -7505 -1389 13736 27588 33338 22739
5049B2739k1006k069l90m947k394k855P89J2530J844J852K301l598l530N888J625
$$ 22739 1733 -336 -726 -5673 -8067 -10922 -10133 2397 4241 6093 8394 4796 1266 7154 8779
5034H779M564m83j2862q866k72K2979M270J1883j220j3358j0047q679L083m070
$$ 8779 13343 12860 -2 -8868 -9140 13839 18109 29992 28772 15414 5367 -3312 -229 -4299
5020d299M417L362n062k0773R461Q924j8347J1877K1944o630p475N523N152J1992
$$ -4299 118 3480 -1582 -22355 -12894 -3970 -22317 -10440 11504 4874 -2601 2922 8074 20066
5006B0066j0291l0144J227J205K445p255j4086J0698Q915J0588Q985j3322n486
$$ 20066 9775 -20369 -19142 -17937 -15492 -22747 -36833 -26135 -17220 -6632 2353 -10969 -16455
4993a6455R060J5981l356j6559j124J307K45k877p296J1244M405K352m42M889
$$ -16455 -7395 8586 5230 -11329 -12453 -11146 -10901 -13778 -21074 -9830 -5425 -3073 -3515 1374
4979A374J3147M395j895m857O947j9976p242o771J953Q897k6370j4046J1831J0673
$$ 1374 14521 18916 17021 12164 19111 -865 -8107 -14878 -12925 -4028 -30398 -44444 -32613 -21940
4965b1940o987L935J7716M230o435J2499J7272j1630j0552j0915O164j2815j7215
$$ -21940 -28927 -24992 -7276 -3046 -9481 3018 20290 8660 -1892 -12807 -6643 -19458 -36673
4952c6673J9262J2271q229p713K298M869n28L278O78K873k851k7250m104Q943
$$ -36673 -17411 -5140 -13369 -21082 -18784 -13915 -14443 -11165 -10487 -7614 -10465 -37715 -41819 -32876
4938c2876K3710m140k8763l998j7562K0663K5096P021J572r32J9753M283k8490
$$ -32876 -9166 -13306 -42069 -46067 -63629 -42966 -17870 -10849 -9277 -10209 9544 13827 -14663
4925a4663k0301J5802R466l922j4317j088L043J9157K309N015p140k0582j0188
$$ -14663 -34964 -19162 -9696 -13618 -27935 -29023 -25980 -6823 -4514 501 -6639 -27221 -37409
4912c7409k093j2668J3432J1046j375Q175J828r603j2165J4401L3409j083j675
$$ -37409 -39502 -52170 -38738 -27692 -29067 -20892 -19064 -28667 -40832 -26431 6978 5895 4220
4899D220j802k899J369j1251j3021J3975P068J177J392k970P118j1628o317K5762
$$ 4220 2418 -481 888 -10363 -23384 -9409 -2341 -1164 228 -2742 4376 -7252 -13569 12193
4885A2193K5816n238K828J7977N69j6170j2814q102r041N178k28J1459k6996j1761
$$ 12193 38009 32771 35599 53576 54145 37975 25161 17059 8018 13196 12968 24427 -2569 -14330
4871a4330k697j8040O971J9071M207N972m092j2819j9424j0643O15J7149K2646
$$ -14330 -17027 -35067 -28096 -9025 -4818 1154 -2938 -15757 -35181 -45824 -45209 -28060 -5414
4858e414P461R884q010l451q970j1690J603K1259K577j30J6118j2624q059k483
$$ -5414 2047 11931 3921 470 -8500 -20190 -18587 2672 5249 5119 21237 8613 554 -1929
4844a929M860J211k563O756o266k8678N220J8067L10m510Q043K023K846k1927
$$ -1929 2931 4142 1579 8335 2069 -26609 -21389 -3322 -3012 -7522 521 2544 5390 -16537
4830a6537j2369n589J4669J2043Q964j0357K671o760p565J3644O175M97j8837
$$ -16537 -28906 -34495 -19826 -7783 1181 -9176 -6505 -13265 -20830 -7186 -1011 -514 -19351
4817a9351J5384J2111K280n987j9954o22J5722L05j5327k7759q555l16M236K0452
$$ -19351 -3967 8144 10424 4437 -15517 -16139 -417 -112 -15439 -43198 -51753 -52069 -47833 -27381
4803b7381j7255j0583m42J1945J7562L625k3483Q065P085k838n061j2510r382
$$ -27381 -44636 -55219 -55661 -43716 -26154 -22529 -46012 -37947 -30862 -33700 -38761 -51271 -60653
4790f0653p046J7917J8199J9039J6957K000J1417r80j6466P647j976n879r215
$$ -60653 -67699 -49782 -31583 -12544 4413 6413 17830 16850 384 8031 6055 176 -9039
4777i039J6232M837j6876R5k799K696J1593q225J614J034j4258r670j6820Q037
$$ -9039 7193 12030 -4846 -4751 -7550 -4854 6739 -1486 128 1162 -13096 -22766 -39586 -31549
4763c1549J4782J102q615k237J4851J5789N716p626n674l2065j5531k620J0718
$$ -31549 -16767 -15665 -24280 -26517 -11666 4123 9839 2213 -3461 -35526 -51057 -53677 -42959
4750d2959L4499K6382r00k3270j4116q287K2192K592Q401p480O744P804J251J1762
$$ -42959 -8460 17922 17022 -6248 -20364 -28651 -6459 -3867 4534 -2946 3798 11602 12853 24615
4736B4615K796j5569M639N339j2467M181J4525J752j4779k2621l279J7573K745
$$ 24615 27411 11842 16481 21820 9353 13534 28059 29811 15032 -7589 -10868 6705 9450
4723I450m53j0855J576j1974R973k5713K584J1970j4894l014P421N289L884p003
$$ 9450 8997 -1858 -282 -12256 -2283 -27996 -25412 -13442 -28336 -31350 -23929 -18640 -14756 -21759
4709b1759n263l884K151K220k81J5016M264R532j701P03r726j464l951n395q309
$$ -21759 -27022 -30906 -28755 -26535 -26816 -11800 -7536 1996 295 998 -8728 -10192 -14143 -19538 -27847
4694b7847J5491J2709J575o377n820j535K578N4J444j4107n907q409L241J6649
$$ -27847 -12356 353 1928 -4449 -10269 -11804 -9226 -9172 -7728 -21835 -27742 -36151 -32910 -16261
4680a6261k255l2024Q267Q986K7608k247k3900k66J5491j782m748M386Q60r810
$$ -16261 -18516 -50540 -42273 -33287 -5679 -7926 -31826 -32092 -16601 -18383 -23131 -18745 -17885 -27695
4666b7695m848J5552K30m953p901n689l982j729K7364R798J0748K24O595M140
$$ -27695 -32543 -16991 -16761 -21714 -29615 -35304 -39286 -41015 -13651 -3853 6895 7119 13714 17854
4652A7854J6962J339j5867j6652j4K736l040r859J1420N472j2173j2956J8033
$$ 17854 34816 36155 20288 3636 3622 6358 3318 -6541 4879 10351 -1822 -14778 3255
4639C255k349P409p806K406J4380J3211j3773l1839l661P793j022N239k521k766
$$ 3255 906 8315 509 2915 17295 30506 16733 -15106 -18767 -10974 -11996 -6757 -9278 -12044
4625a2044j0074k519j7991J298J2396O204m825j4253J1336R121J427L265J4128
$$ -12044 -22118 -24637 -42628 -41330 -28934 -22730 -27555 -41808 -30472 -21351 -19924 -16659 -2531
4612b531p951J9957q502j9149r10M054j0773p562N563K0236m314j2873Q984K1550
$$ -2531 -10482 9475 973 -18176 -19086 -15032 -25805 -33367 -27804 -7568 -11882 -24755 -15771 5779
4598E779J9693l608k241j432Q665k2585k7992R403J0553M939j2748P734j0792
$$ 5779 25472 21864 19623 18191 26856 4271 -23721 -14318 -3765 1174 -11574 -3840 -14632
4585a4632Q534n915M88O039K33p945n564K716J1871q631k1390q80J3077L474J9411
$$ -14632 -6098 -12013 -11525 -5486 -5253 -13198 -18762 -16046 -4175 -12806 -34196 -35076 -21999 -18525 886
4570H86J1324N215O260n680J886j5491j921k0l935N301m412o603M880J2357P575
$$ 886 12210 17425 23685 18005 19891 4400 2479 2459 -1476 3825 -587 -7190 -2310 10047 17622
4555A7622j1474j1459j5575j1279J2141J7116Q416o222j3246J2199P388R260p361
$$ 17622 6148 -5311 -20886 -32165 -20024 -2908 5508 -714 -13960 -1761 5627 14887 7526
4542G526q704j4012J1298J8475r06j4931p409k4123j5116j636r78J8509n693l216
$$ 7526 -1178 -15190 -3892 14583 13677 -1254 -8663 -32786 -47902 -49538 -50516 -32007 -37700 -40916
4528d0916K2825K0776j8992N561K0109l456j9778j2921j4329L667m592P979j894
$$ -40916 -18091 2685 -16307 -10746 9363 5907 -13871 -26792 -41121 -37454 -42046 -34067 -35961
4515c5961L139J4179M248o439J0131L3800n696j7251l681p737M963J8505J8511
$$ -35961 -32822 -18643 -14395 -20834 -10703 23097 17401 150 -3531 -11268 -6305 12200 30711
4502C0711j906j7399N290K13m006k503m947M126k0416o866J2928L895J3072n44
$$ 30711 28805 11406 16696 16909 12903 10400 5453 9579 -10837 -17703 -4775 -880 12192 11648
4488A1648l1264k6917k152J6429J8611Q921k4588M671M661K583J5989R126j0315
$$ 11648 -19616 -46533 -48685 -32256 -13645 -4724 -29312 -24641 -19980 -17397 -1408 7718 -2597
4475b597j9610k1177K70J5065P195J392L494Q713O420N663m899o361l699o226
$$ -2597 -22207 -43384 -43114 -28049 -20854 -19462 -15968 -7255 -835 4828 -71 -6432 -10131 -16357
4461a6357O976r317j0059K5655K4907o582j1990j2619n972K282M47L790R60J4517
$$ -16357 -9381 -18698 -28757 -3102 21805 15223 3233 -9386 -15358 -13076 -12629 -8839 -7879 6638
4447F638L15N069k226j384q017P538j0248j4992n588J1299j2491P037L2404J2484
$$ 6638 6953 12022 9796 8412 395 7933 -2315 -17307 -22895 -11596 -24087 -17050 15354 27838
4433B7838l1710j2357M429q744J4343M500n095p847j711j2672J772j541J0107
$$ 27838 -3872 -16229 -11800 -20544 -6201 -1701 -6796 -14643 -16354 -29026 -27254 -28795 -18688
4420a8688M616J4035j546j0985j0348k1684J1559J9557r176P242K212J0495K819
$$ -18688 -14072 -37 -1583 -12568 -22916 -44600 -33041 -13484 -22660 -15418 -13206 -2711 108
4407A08j971j6171o083K71j371k5J3682Q916K179j521o398O917r884q900l746
$$ 108 -1863 -18034 -24117 -23846 -25217 -25242 -11560 -2644 -465 -1986 -8384 -1467 -11351 -20251 -23997
4392b3997R178m910l304R522J0001J941l590J6183l589j5394J635j3081K293j2467
$$ -23997 -14819 -19729 -23033 -13511 -3510 -1569 -5159 11024 7435 -7959 -6324 -19405 -17112 -29579
4378b9579j6299J8460K1829J7943j5147k113o547L019J6765Q073q452j3479p612
$$ -29579 -45878 -27418 -5589 12354 -2793 -4906 -11453 -8434 8331 16404 7952 -5527 -13139
4365a3139O552J3961M666J1988r952j8698k45j3219j6532L148J5111j6384R400
$$ -13139 -6587 7374 12040 24028 14076 -4622 -4867 -18086 -34618 -31470 -16359 -32743 -23343
4352b3343M03Q664J7937K7529P592j8991j3098Q724N624m971J2626K481j6490
$$ -23343 -22940 -14276 3661 31190 38782 19791 6693 15417 21041 16070 28696 31177 14687
4339A4687K173M313j2685j8741r639P603R999m34k2343J8243J6557n082p699k0018
$$ 14687 16860 21173 8488 -10253 -19892 -12289 -2290 -2724 -25067 -6824 9733 4651 -3048 -23066
4325b3066p890K429K0202K1700j2141j1431R46k0415N844Q020j5666J608K1417
$$ -23066 -30956 -28527 -8325 13375 1234 -10197 -9251 -29666 -23822 -15802 -31468 -29860 -8443
4312h443J0825n481P867Q637L504j1686k1705K11J1314M637j3502M742M858L2548
$$ -8443 2382 -3099 4768 13405 16909 5223 -16482 -16271 -4957 -320 -13822 -9080 -4222 28326
4298B8326K349j0412j2987j2628k2369m631Q926M297K019j868j615M297K987m527
$$ 28326 30675 20263 7276 -5352 -27721 -32352 -23426 -19129 -17110 -18978 -20593 -16296 -13309 -17836
4284a7836M514q893j0199J1652m918j3612L3920J6989Q073j5592j0794k817K3675
$$ -17836 -13322 -22215 -32414 -20762 -25680 -39292 -5372 11617 19690 4098 -6696 -9513 14162
4271A4162O687J4822o854k639L005J6935k2727j9947j4631M829K2133P392r722
$$ 14162 20849 35671 28817 26178 29183 46118 23391 3444 -11187 -6358 15775 23167 13445
4258A3445q778K3408K459k5426j9813n150L935j7839j13K2705J3221l772J3265
$$ 13445 4667 28075 30534 5108 -14705 -19855 -15920 -33759 -33872 -11167 2054 -1718 11547
4245A1547J1142j0559n819K740j4620j4958l045n219J571Q394p470k193O119J5195
$$ 11547 22689 12130 6311 9051 -5569 -20527 -23572 -28791 -27220 -18826 -26296 -28489 -22370 -7175
4231g175J3196r01J086q635k1122K1138J3737k092l841j2277j0150j250j867N565
$$ -7175 6021 5120 6206 -2429 -23551 -2413 11324 9232 5391 -6886 -17036 -18286 -20153 -14588
4217a4588J443o839q115j1910l002m79K1077R868J0920j552N386J1743J0325k4087
$$ -14588 -13145 -19984 -28099 -40009 -43011 -43490 -22413 -12545 -1625 -3177 2209 13952 24277 190
$$ [...]
##END NTUPLES=NMR SPECTRUM
##END=
