##TITLE=Analysis number 317507
Compound Code mo 07448
Project Code qc-cat
Chemist Name endeavour
##JCAMPDX= 6.0         $$ Bruker NMR JCAMP-DX V2.0
##DATA TYPE= NMR SPECTRUM
##DATA CLASS= NTUPLES
##ORIGIN= Bruker BioSpin GmbH
##OWNER= nmr
$$ XWIN-NMR		Version 3.5
$$ Wed Feb 22 10:38:26 2006 GMT Standard Time (UT+0h)  MAYBRIDGE\nmr@NMR_250MHZ
##.OBSERVE FREQUENCY= 250.131544655141
##.OBSERVE NUCLEUS= ^1H
##.ACQUISITION MODE= SIMULTANEOUS (DQD)
##.ACQUISITION SCHEME= undefined
##.AVERAGES= 16
##.DIGITISER RES= 18
##SPECTROMETER/DATA SYSTEM= dpx250
##.PULSE SEQUENCE= zg30
##.SOLVENT NAME= CDCl3
##.SHIFT REFERENCE= (INTERNAL, CDCl3, 0, 16.4576)
##AUDIT TRAIL= $$ (NUMBER, WHEN, WHO, WHERE, WHAT)
$$ ##TITLE= Audit trail, XWIN-NMR		Version 3.5
$$ ##JCAMPDX= 5.01
$$ ##ORIGIN= Bruker BioSpin GmbH
$$ ##OWNER= nmr
$$ C:\u/data/dgb/nmr/ADRS/16610/pdata/1/auditp.txt
$$ ##AUDIT TRAIL=  $$ (NUMBER, WHEN, WHO, WHERE, WHAT)
(   1,<2006-02-22 10:38:06.73 +000>,<MAYBRIDGE\nmr>,<NMR_250MHZ>,
      <created by zg, POWCHK disabled, PULCHK disabled
       configuration hash MD5:
       84 BC 41 DB A1 6E 1D 46 DA 25 12 A5 C1 ED C5 3A
       data hash MD5: 64K
       3E 72 16 41 44 A9 2F D1 BA 47 61 6C 2D AC 6C 6F>)
(   2,<2006-02-22 10:38:17.93 +000>,<MAYBRIDGE\nmr>,<NMR_250MHZ>,
      <Start of raw data processing
       ef LB = 0.3 FT_mod = 6 PKNL = 1 SI = 32K 
       data hash MD5: 32K
       25 99 10 D3 23 69 1C A3 2F 2F B9 03 D0 36 DD FE>)
(   3,<2006-02-22 10:38:19.74 +000>,<MAYBRIDGE\nmr>,<NMR_250MHZ>,
      <apk 
       data hash MD5: 32K
       5D 0A 53 EC 93 66 9C AD DA B4 5C 41 1E 71 9D B9>)
(   4,<2006-02-22 10:38:20.46 +000>,<MAYBRIDGE\nmr>,<NMR_250MHZ>,
      <abs ABSG = 5 
       data hash MD5: 32K
       D7 D8 F6 6D 35 D8 21 45 F0 3E 8F 9C 46 E8 C4 7D>)
$$ ##END=
$$ 
$$ hash MD5
$$ 94 30 28 81 6C 56 BD 08 E9 50 AE D6 A9 DB 14 91
##$RELAX= 
##$RELAX= 
##$RELAX= 
##$RELAX= 
##$RELAX= 
##$RELAX= 
##$RELAX= 
$$ Bruker specific parameters
$$ --------------------------
##$DU= <C:\u>
##$EXPNO= 16610
##$NAME= <ADRS>
##$PROCNO= 1
##$TYPE= <nmr>
##$USER= <dgb>
##$AMP= (0..31)
100 100 100 100 100 100 100 100 100 100 100 100 100 100 100 100 100 100 
100 100 100 100 100 100 100 100 100 100 100 100 100 100 
##$AQSEQ= 0
##$AQ_mod= 3
##$AUNM= <au_zg>
##$AUTOPOS= <13 >
##$BF1= 250.13
##$BF2= 250.13
##$BF3= 250.13
##$BF4= 250.13
##$BF5= 500.13
##$BF6= 500.13
##$BF7= 500.13
##$BF8= 500.13
##$BYTORDA= 1
##$CFDGTYP= 0
##$CFRGTYP= 5
##$CHEMSTR= <none>
##$CNST= (0..31)
1 1 145 1 1 1 1 1 1 1 1 1 1 1 1 1 1 1 1 1 1 1 1 1 1 1 1 1 1 1 1 1 
##$CPDPRG= <>
##$CPDPRG1= <>
##$CPDPRG2= <>
##$CPDPRG3= <>
##$CPDPRG4= <mlev>
##$CPDPRG5= <mlev>
##$CPDPRG6= <mlev>
##$CPDPRG7= <mlev>
##$CPDPRG8= <mlev>
##$CPDPRGB= <>
##$CPDPRGT= <>
##$D= (0..31)
0 1 0 0 0 0 0 0 0 0.06 0 0 0 0 0 0 0.0002 0 0 0 0 0 0 0 0 0 0 0 0 0 0 
0 
##$DATE= 1140604685
##$DBL= (0..7)
120 120 120 120 120 120 120 120 
##$DBP= (0..7)
150 150 150 150 150 150 150 150 
##$DBP07= 0
##$DBPNAM0= <>
##$DBPNAM1= <>
##$DBPNAM2= <>
$$ [...]
##$SUBNAM7= <"">
##$SUBNAM8= <"">
##$SUBNAM9= <"">
##$SW= 20.6930455092707
##$SWIBOX= (0..15)
0 0 3 0 0 0 0 0 0 0 0 0 0 0 0 0 
##$SW_h= 5175.983436853
##$TD= 65536
##$TD0= 1
##$TE= 293.16
##$TE2= 300
##$TE3= 300
##$TEG= 300
##$TL= (0..7)
0 120 120 120 120 120 120 120 
##$TP= (0..7)
150 150 150 150 150 150 150 150 
##$TP07= 0
##$TPNAME0= <>
##$TPNAME1= <>
##$TPNAME2= <>
##$TPNAME3= <>
##$TPNAME4= <>
##$TPNAME5= <>
##$TPNAME6= <>
##$TPNAME7= <>
##$TPOAL= (0..7)
0.5 0.5 0.5 0.5 0.5 0.5 0.5 0.5 
##$TPOFFS= (0..7)
0 0 0 0 0 0 0 0 
##$TUNHIN= 0
##$TUNHOUT= 0
##$TUNXOUT= 0
##$USERA1= <user>
##$USERA2= <user>
##$USERA3= <user>
##$USERA4= <user>
##$USERA5= <user>
##$V9= 5
##$VALIST= <valist>
##$VCLIST= <CCCCCCCCCCCCCCC>
##$VD= 0
##$VDLIST= <DDDDDDDDDDDDDDD>
##$VPLIST= <PPPPPPPPPPPPPPP>
##$VTLIST= <TTTTTTTTTTTTTTT>
##$WBST= 1024
##$WBSW= 4
##$XGAIN= (0..3)
0 0 0 0 
##$XL= 0
##$YL= 0
##$YMAX_a= 500143
##$YMIN_a= -436053
##$ZGOPTNS= <>
##$ZL1= 120
##$ZL2= 120
##$ZL3= 120
##$ZL4= 120
##$ABSF1= 16.45765
##$ABSF2= -4.235523
##$ABSG= 5
##$ABSL= 3
##$ALPHA= 0
##$AQORDER= 0
##$ASSFAC= 0
##$ASSFACI= 0
##$ASSFACX= 0
##$ASSWID= 0
##$AUNMP= <proc_1d>
##$AZFE= 0.1
##$AZFW= 0.1
##$BCFW= 0
##$BC_mod= 0
##$BYTORDP= 0
##$COROFFS= 0
##$CY= 12.5
##$DATMOD= 1
##$DC= 0
##$DFILT= <>
##$DTYPP= 0
##$F1P= 14.0000005364418
##$F2P= -0.99999901652339
##$FCOR= 0.5
##$FTSIZE= 32768
##$FT_mod= 6
##$GAMMA= 0
##$GB= 0
##$INTBC= 1
##$INTSCL= 1
##$ISEN= 128
##$LB= 0.3
##$LEV0= 0
##$LPBIN= 0
##$MAXI= 10000
##$MC2= 0
##$MEAN= 0
##$ME_mod= 0
##$MI= 0
##$NCOEF= 0
##$NC_proc= -3
##$NLEV= 6
##$NOISF1= 0
##$NOISF2= 0
##$NSP= 0
##$NTH_PI= 0
##$NZP= 0
##$OFFSET= 16.45765
##$PC= 1
##$PHC0= -116.4357
##$PHC1= 6.28208
##$PH_mod= 1
##$PKNL= yes
##$PPARMOD= 0
##$PSCAL= 4
##$PSIGN= 0
##$REVERSE= no
##$SF= 250.130016095454
##$SI= 32768
##$SIGF1= 0
##$SIGF2= 0
##$SINO= 400
##$SIOLD= 32768
##$SREGLST= <1H.CDCl3>
##$SSB= 0
##$STSI= 32768
##$STSR= 0
##$SW_p= 5175.98343685301
##$SYMM= 0
##$S_DEV= 0
##$TDeff= 65536
##$TDoff= 0
##$TI= <Analysis number 999999
Compound Code 99
Book Reference 9
Project Code 9>
##$TILT= no
##$TM1= 0
##$TM2= 0
##$TOPLEV= 0
##$USERP1= <user>
##$USERP2= <user>
##$USERP3= <user>
##$USERP4= <user>
##$USERP5= <user>
##$WDW= 1
##$XDIM= 32768
##$YMAX_p= 284867101
##$YMIN_p= -71779
$$ End of Bruker specific parameters
$$ ---------------------------------
##NTUPLES= NMR SPECTRUM
##VAR_NAME=  FREQUENCY,     SPECTRUM/REAL,   SPECTRUM/IMAG
##SYMBOL=    X,             R,               I
##VAR_TYPE=  INDEPENDENT,   DEPENDENT,       DEPENDENT
##VAR_FORM=  AFFN,          ASDF,            ASDF
##VAR_DIM=   32768,         32768,           32768
##UNITS=     HZ,            ARBITRARY UNITS, ARBITRARY UNITS
##FACTOR=    0.157963299565203, 1,           1
##FIRST=     4116.55206703262, 0,            0
##LAST=      -1059.43136982039, 0,           0
##MIN=       -1059.43136982039, -71779,      0
##MAX=       4116.55206703262, 284867101,    0
$$ Real data points
##PAGE= N=1
##DATA TABLE= (X++(R..R)), XYDATA
$$ [...]
14955D3315O743N002L070p529J377K552N461J1684j1508o238j1726J7113J0335
14942F9651L500n723J3425J0763o824q326P966K441l281M526M79j3990j0302J77
14928F4482J8631J0258k0668n237j5869o9O824k330J4110m720r625R185R341K5466
14914I9779M74j3085o091n118R538j663k3713P723q64k0145Q939J5147K0446O332
14900I7699j1889k0142j4175l071Q845l494L866R755j0898k638O146J8061j219
14887G6846j7182L654J8616L767J4514j5638j019R043o887j493L075P468m233
14874I0531l905N810j2477l615j591m985J1621J1744L595K108n964p908j1137
14861G3827l678j788K792k395k555K3806L2349m663K124O888j1153r60J560j3900
$$ plain form
14955 43315 50058 55060 58130 50601 51978 54530 59991 71675 60167 53929 42203 59316 69651
14942 69651 73151 67428 80853 91616 84792 76466 84432 86873 83592 88118 88597 74607 64305 64482
14928 64482 83113 93371 72703 67466 51597 51528 58352 56022 70132 65412 55787 64972 74313 99779
14914 99779 100253 87168 81077 75959 85497 83834 60121 67844 66980 46835 55774 70921 91367 97699
14900 97699 85810 65668 51493 48422 57267 53773 57639 67394 56496 53858 60004 78065 76846
14887 76846 59664 63318 81934 85701 100215 84577 83558 92601 85714 84221 87296 94764 90531
14874 90531 86626 92436 79959 76344 74753 69768 81389 93133 96728 98836 92872 84964 73827
14861 73827 70149 68361 71153 68758 66203 90009 122358 117695 119819 126707 115554 114594 116154 102254
14847A02254r684J388J1722j1806m244q564R573R937L157p297K7595J9801k1548
14834A22284q782K1063J8374K748j1741o112n273N848n19o753p330J987K1650
14821A47444j2118r724J2276J5576J31o523p972J2933q895j3720K3O180J391K94
14807A37296j828K959O161k479J1124k29k1676j3603J1773K9016j5264k7376o066
14794A09808M5911L3378o286j7458p746j7611j1831J1814P028j3669j6895l957
14782A12486K1905K8062Q211j6413j1219O070J2229J8186j943k236O333k075J1230
14769A90826j340J6338K441M704n71p609j4851j1618K1737J4119j0290m404M649
14756B04131j4619j1572O377N796J7536J9675j1017j6932J8211P761L099j1645
$$ plain form
14847 102254 92570 93958 105680 93874 89630 81066 90639 100576 103733 96436 124031 143832 122284
14834 122284 113502 134565 152939 155687 143946 137834 132561 138409 137890 131137 123807 125794 147444
14821 147444 135326 125602 137878 153454 153585 147062 139090 152023 143128 129408 129431 135611 137002 137296
14807 137296 135468 138427 144588 142109 153233 153004 131328 117725 129498 158514 143250 115874 109808
14794 109808 155719 189097 182811 165353 157607 139996 128165 139979 147007 133338 116443 112486
14782 112486 134391 162453 170664 154251 143032 149102 161331 179517 177574 175338 181671 179596 190826
14769 190826 189486 205824 208265 212969 212398 204789 189938 178320 200057 214176 203886 199482 204131
14756 204131 189512 177940 184317 190113 207649 227324 216307 199375 217586 225347 228446 216801
14744B16801K721J2475j5700o500J9660q767J755k4195J1522L895p596P6K0181
14731B26328J6753J6050j8126N386K3914O570l227j2215N397O880o099J4468M357
14718B86436l861j2421m212L2399K3239J7536L554M677J91j356J2378p16k566
14705C55278J1115N517P032l128M667k287j3233k359m281J2216K905K6427K3963
14692D23832j0336k6236m534Q449j723n970J7840K9343K8041L1037k2813p196
14680D59734P058j1425M287m801J1764o011J8223J7333J128j0855K4680J0263
14668E21378j6985K8628K9483J2532L734r82R980J9491M48N805N140Q789K453
14655F29894P160K3357J3271O888R080m061J0112L9119K2584M842J4016K0478
$$ plain form
14744 216801 219522 231997 216297 209797 229457 220690 222445 198250 209772 213667 206071 206147 226328
14731 226328 243081 259131 241005 246391 270305 276875 273648 261433 266830 273710 267611 282079 286436
14718 286436 282575 270154 265942 298341 321580 339116 342670 347347 347538 346182 358560 357844 355278
14705 355278 366393 371910 378942 375814 380481 378194 364961 362602 358321 370537 373442 399869 423832
14692 423832 413496 387260 382726 391175 389452 383482 401322 430665 458706 489743 466930 459734
14680 459734 466792 455367 459654 454853 466617 460606 478829 496162 497290 486435 511115 521378
14668 521378 504393 533021 562504 575036 578770 577788 587768 607259 607707 613512 618652 627441 629894
14655 629894 637054 660411 673682 680570 689650 685589 695701 734820 757404 762246 776262 796740
14643G96740K7324M2975J3303J6240J9233m988p15J8985J9835K0686L4992N738
14631A010348J3822J6717K9463J8974K3428N5953L8188J6103K5467L7903L2623
14620A318989K0027J9788K8532L2445L4420K9049J7273L9337M6046M5133N0451
14609A681490M6068M3418N9455N2685N1773N3021M3293M5113O0170O4499M2542
14598B243527N9174P3451N0886M0397N7777P1236M7660O2058Q8481Q1018O3723
14587B939388O1037N5869N3822O4544P2775O8071Q6558J00319Q7420P0340O5841
14576C725984N0881N3446P1380O3180N9705M4031O7590O2856N3623O1044M9411
14565D363131O0683O5047P5849P5834N8668N3553N0836N6341N5543O2258N3083
$$ plain form
14643 796740 824064 867039 880342 896582 915815 910827 910112 929097 948932 969618 1004610 1010348
14631 1010348 1024170 1040887 1070350 1089324 1112752 1168705 1206893 1222996 1248463 1286366 1318989
14620 1318989 1339016 1358804 1387336 1419781 1454201 1483250 1500523 1539860 1585906 1631039 1681490
14609 1681490 1727558 1770976 1830431 1883116 1934889 1987910 2031203 2076316 2136486 2200985 2243527
14598 2243527 2302701 2376152 2427038 2467435 2525212 2596448 2644108 2706166 2794647 2875665 2939388
14587 2939388 3000425 3056294 3110116 3174660 3247435 3315506 3402064 3502383 3589803 3660143 3725984
14576 3725984 3776865 3830311 3901691 3964871 4024576 4068607 4136197 4199053 4252676 4313720 4363131
14565 4363131 4423814 4488861 4564710 4640544 4699212 4752765 4803601 4859942 4915485 4977743 5030826
14554E030826N2657N1175P9792O6226O8267N2546O1577O0869N2222N6330N6681
14543E689168N7403O2377N1692L7869M5769M3148L4262K7988M7572L5726L1247
14532F164221J9519p340P27m816J2374l233o555j1812j8965k3383l9539k4337
14520F056861k1250m5215m3705o409l5474l7168l0693l1546m9229l8820l9525
14509E677827n6158m4456k6997m444k0686o0270m7434n2263l9959l5321o7782
14498E222057n0968l8948o3255o9587k4406l2450o4773p5457n3872o3443o5079
14487D619819p8953o9356n2894n6048p5558q2651o8148n3674o7986p3738n8053
14476C882760n8281r3982o1403o7617n8412n7662p7632o7235n8742r2952p8029
$$ plain form
14554 5030826 5083483 5134658 5214450 5280676 5348943 5401489 5463066 5523935 5576157 5632487 5689168
14543 5689168 5746571 5808948 5860640 5898509 5944278 5987426 6021688 6049676 6097248 6132974 6164221
14532 6164221 6183740 6176400 6177127 6172311 6184685 6181452 6174897 6163085 6144120 6120737 6081198 6056861
14520 6056861 6035611 5990396 5946691 5940282 5904808 5867640 5836947 5805401 5756172 5717352 5677827
14509 5677827 5621669 5577213 5550216 5545772 5525086 5464816 5417382 5365119 5325160 5289839 5222057
14498 5222057 5171089 5132141 5068886 4999299 4974893 4942443 4877670 4802213 4748341 4684898 4619819
14487 4619819 4540866 4471510 4418616 4362568 4287010 4204359 4136211 4082537 4014551 3940813 3882760
14476 3882760 3824479 3730497 3669094 3601477 3543065 3485403 3407771 3340536 3281794 3188842 3110813
14465C110813n2601o8353n5756m7145n2961o8134n2672m1764m0614p5869o7172
14454B487772o3161n3191l3359m1891n0003k8552m9799l2148k9946n5349n3379
14443A996994j0615j0505m0440l8269n0872m9257l0771k0484r372k4810k5343
14432A686256j5672l0708l7020l9439k1735j6294k0102j9256L939M851m1087m9979
14420A403754l7863j4571j1513n697j6839j9251J640P576j4388l3048k3681q758
14408A227361k0103k423K21J6565j1454k9652k2434j5069p665j8662n798j1393
14396A099494j6396j5442j5701k240k7190m220M642K3L105R773j9183j6574j5796
14383I84295k1656O933J0597j4954k3604k9489m286L680j0299J0706M783j9162
$$ plain form
14465 3110813 3058212 2989859 2934103 2886958 2833997 2765863 2713191 2671427 2630813 2554944 2487772
14454 2487772 2424611 2371420 2338061 2296170 2246167 2217615 2167816 2135668 2105722 2050373 1996994
14443 1996994 1986379 1975874 1935434 1897165 1846293 1797036 1766265 1745781 1736409 1711599 1686256
14432 1686256 1670584 1639876 1602856 1563417 1541682 1525388 1505286 1486030 1489969 1494820 1453733 1403754
14420 1403754 1365891 1351320 1339807 1334110 1317271 1298020 1299660 1307236 1292848 1259800 1236119 1227361
14408 1227361 1207258 1204835 1205056 1221621 1210167 1180515 1158081 1143012 1135347 1116685 1110887 1099494
14396 1099494 1083098 1067656 1051955 1049715 1022525 1018305 1022947 1022970 1026075 1035848 1016665 1000091 984295
14383 984295 962639 969572 980169 965215 941611 912122 907836 911516 901217 911923 916706 897544
14371H97544j7389J284k870K4108J2437j1876P261J3096j6759l0850j2895J6406
14359H79497L741p520j1750r508l384p191j1606j9097L997K572j3856L031k166
14346H06760Q917j3700m46J7843j5954m448k057o224n17O573R303J6440P761p132
14332H23119p477N32j9154O739J2198p832j0539L46P946K388j3991q63K563P41
14318G96716q825q520J0058m469m801j686o73L2n420l565m895J3101j9695j1941
14304G45417K588j6458R764J9542J963j5079l691k345k4002M122N896l2101r592
14291F86024M568K6513K0321R216j6562j6230l347j4405j4282J9870Q845R682
14279G20213k538j1288j5010n701j8330K2791O768j9364j4850p239r037J2313
$$ plain form
14371 897544 880155 881439 878569 902677 915114 903238 910499 923595 906836 875986 863091 879497
14359 879497 883238 875718 863968 854460 851076 843885 832279 813182 817179 819751 805895 808926 806760
14346 806760 815677 801977 801531 819374 803420 798972 796915 790691 790174 796747 806050 822490 830251 823119
14332 823119 815642 816174 797020 803759 815957 808125 797586 797932 805878 808266 794275 793412 795975 796716
14318 796716 787891 779371 789429 784960 780159 778473 777800 777832 772412 768847 763952 777053 757358 745417
14304 745417 748005 731547 741311 760853 762816 747737 744046 741701 717699 721821 727717 695616 686024
14291 686024 690592 717105 737426 746642 730080 713850 710503 696098 681816 701686 710531 720213
14279 720213 717675 706387 691377 685676 667346 690137 696905 677541 662691 655452 646415 658728
14267F58728K7814J0097j0588k008k132j5389j3924o174k1801k405q34j6342o107
14254E98935q905J9006J5835n919J3709L667j1606j0382m527j5849j0643J4500
14242E97821P027q992o520O670j7498q224k765J2793K358k0710k3967j1639l615
14229E22739j2870j7601Q995N966k0616l320k260J4889P887K76l1283j3191r79
14216D58632J421k1986m946p699j2907K714K0814J128o95o131j3560K242l561
14203D15466j9316j3991n0J9091m491Q530n43j3220J930n754j5810q435k3611
14190C39796Q038L745j1869L270J522j6745o355m02L734J7607l252k1073k7929
14177B90087j6122k825Q333m796r653K522M876K543m065N025q700j2404K579J2872
$$ plain form
14267 658728 686542 696639 686051 684043 681911 666522 652598 646424 624623 622218 621384 605042 598935
14254 598935 590030 609036 624871 618952 632661 636328 624722 614340 609813 593964 583321 597821
14242 597821 604848 595856 589336 596006 578508 570284 567519 580312 582670 561960 537993 526354 522739
14229 522739 509869 492268 501263 507229 486613 483293 481033 495922 503809 504085 472802 459611 458632
14216 458632 460053 438067 433121 425422 412515 415229 436043 437171 436476 430345 416785 419027 415466
14203 415466 396150 382159 382109 401200 396709 405239 404696 391476 393406 387652 371842 363407 339796
14190 339796 347834 351579 339710 342980 344502 327757 321402 321000 324734 342341 339089 318016 290087
14177 290087 273965 271140 279473 274677 265024 267546 272422 274965 270900 275925 267225 254821 257400 270272
14163B70272l812p813k1508k4820R559J6388J0196o906k6644r218J7002r619J8207
14150B31284j943l2062q714J5266L421Q19j6465m321J5963k096J1501K330l111
14137B11872o566o237r121n668j6921M437l963l059r380J1392K359l776j892L54
14123A63831n516Q611J458K698o002J2857L124p337k4119p90K0770j5893O193
14110A59885K0046q238k9519j1795M729O768L579j0209O694m410r567p564J3266
14097A33665L477J330j686l549O576J5004N56j1226j7703l147m179j779O401P967
14083A31707J220m934n282O361J7206p298k4789Q130o636j3890J3995K181m10
14070A17561l6537j704k324K1225K3159J7921P78l5043k1169L644J1360k652k943
$$ plain form
14163 270272 266460 258647 237139 212319 221878 238266 248462 241556 214912 205694 222696 213077 231284
14150 231284 229341 197279 188565 203831 207252 208071 191606 187285 203248 201152 212653 214983 211872
14137 211872 205306 199069 189948 184280 167359 171796 167833 164774 155394 166786 169145 165369 163477 163831
14123 163831 158315 166926 168384 171082 165080 177937 181061 173724 149605 148815 169585 153692 159885
14110 159885 179931 171693 142174 130379 135108 141876 145455 135246 141940 137530 127963 120399 133665
14097 133665 137142 138472 136786 133237 139813 154817 155373 144147 126444 123297 119118 117339 123740 131707
14083 131707 132927 127993 122711 129072 146278 138980 114191 122321 115685 101795 115790 117971 117561
14070 117561 81024 79320 76996 98221 121380 139301 140079 105036 83867 87511 98871 96219 93276
14057I3276J2630J0811l20o905J4238Q610J742N287N708n135l584k2377P387Q612
14043A29980j242J5515J0761M999J7198l707j2945J3441J8081K162O384J6938
14031B17565K6536P87K1561n747m30Q470K4412K2437O207j1563M066l891k7139
14018B83271l44O52j6593J7476l557k2158j3092l589n908P168J1874q899j4985
14005B31316q116P403q027n698j1201K0084J4405l824J969R209R449J1405J9293
13992B87667L955p946k213K0188l92k584n802l0418m249O623J1055r908q315J3103
13978B70764j1550k1453j709k018k4651j6231l216J369n466j3976Q666Q433l0001
13965A58961o070l57o067l176j912j1242L09o638m521j1555j6649K7842P570j8219
$$ plain form
14057 93276 105906 116717 116397 109492 123730 132340 134082 139369 145077 139942 136358 113981 121368 129980
14043 129980 128738 144253 155014 160013 177211 173504 160559 174000 192081 194243 200627 217565
14031 217565 244101 244888 266449 260702 260272 268742 293154 315591 321798 310235 314301 310410 283271
14018 283271 282927 283579 266986 284462 280905 258747 245655 242066 236158 243326 255200 246301 231316
14005 231316 223200 230603 222576 216878 205677 225761 240166 236342 238311 247520 256969 268374 287667
13992 287667 291622 283676 281463 301651 301259 298675 292873 262455 258206 264829 275884 265976 257661 270764
13978 270764 259214 237761 236052 234034 209383 193152 189936 191305 185839 171863 180529 188962 158961
13965 158961 152891 152534 146467 143291 141379 130137 130446 123808 119287 107732 91083 118925 126495 108276
13951A08276k8887j6104J1450r742K993Q168j0627r671N274J7126j8246j3700
13939D6310m88K839m076M452J5918q446Q396j8752R763J3174J520K190j7790n232
13925D9778K8427K1244j411r78p570o213j3369k1485o357j4084l274Q980J2608
13912D6296K7354J1950j0215L204j844l1225m616J7188J3154j7494j2636j6354
13900B4762R196p172K257O504J2206m87j5603K2932R476p558q731L184Q323R747
13886F9036Q023J1323j0007J5467J2922K70j5362M369J5692m074j5171q720m307
13873G9461J4159O871m679m967k7945j6090M487N172K5138J5528j8473j1910N605
13860G2357R961K2242l983M310o241j0522q012K6316J747j7562j7826O400J6490
$$ plain form
13951 108276 79389 63285 74735 64993 67986 76154 65527 55856 61130 78256 60010 46310
13939 46310 45822 48661 44585 49037 64955 56509 64905 46153 55916 69090 70610 72800 55010 49778
13925 49778 78205 99449 98038 97060 89490 83277 69908 48423 42066 27982 24708 33688 46296
13912 46296 73650 85600 75385 78589 76745 45520 40904 58092 71246 53752 41116 24762
13900 24762 33958 26786 29043 35547 47753 47266 31663 54595 64071 56513 47782 50966 59289 69036
13886 69036 77059 88382 78375 93842 106764 107034 91672 96041 111733 107659 92488 83768 79461
13873 79461 93620 100491 95812 90845 62900 46810 51297 56469 81607 97135 78662 66752 72357
13860 72357 82318 104560 100577 104887 98646 88124 80112 106428 108175 90613 72787 79187 95677
13847I5677j341j9375q104O274K070J0193o673R941J5665L181J1378l861j8488
13834I6537P530j6910o522J1443O186j7992j4558r946J5664J3967J0884j9099
13822G7184l0306J2151J6842J5849j4387k9376J8417J7547o952k2109K6341K1847
13810A03048q231n057j5683j1626O386P855R818J6029R784j597K826j7920m693
13797I0939R306K4243L214n587p685k0416k6476l070P044p171J3335J513K373
13784H1562j387K846j9886r957K1660O3L546R840j98r128p510J194j8480r437
13770D4728Q857O019M793J3267P357p49l90l2872O742K7765J0636J4206K791j2376
13756A00774p881N214j1992L694J9534M827p434j802P31M916N852L441J654k2296
$$ plain form
13847 95677 94336 74961 66857 73131 75201 85394 78721 88662 104327 107508 118886 115025 96537
13834 96537 104067 87157 80635 92078 98264 80272 65714 55768 71432 85399 96283 77184
13822 77184 46878 59029 75871 91720 77333 47957 66374 83921 76969 54860 81201 103048
13810 103048 94817 89760 74077 62451 68837 76692 86510 102539 112323 110726 113552 95632 90939
13797 90939 100245 124488 127702 122115 114430 94014 67538 64468 71512 64341 77676 79189 81562
13784 81562 80175 83021 63135 53178 74838 74901 78447 88287 88089 78961 71451 72645 54165 44728
13770 44728 53585 59604 64397 77664 85021 84272 83882 51010 57752 85517 96153 110359 113150 100774
13756 100774 92893 98107 86115 89809 109343 114170 106736 104934 105665 110581 116433 119874 121528 99232
13742I9232N659J0578P238P619k366j5519k0752M407J7374J0648L986J041j8627
13729A10518r316N625P034K4486p818M497j0059j4370J2157L9569L458k1494K512
13716A46799K5322J6074J1945j2863l6692J611M371j2038K2900J8979p233K0431
13704A99606J4272L485P146l130r127O427q775N770J9293J030n02K4716m08J954
13690B61757J4853J0685R064N225P529k022J7812L3544J9930J231j3630R071J6339
13677C91388r300k2641J6389m031j126J4548J7710K4629Q700j7159o334L53P544
13664D20670N486J0779L7407J7236K3360K3635J9777P756M409K0858J0713J47
13652F02233J8962L9866K7279K1056K4126K1380K7021L6932J7454Q916L7867O7178
$$ plain form
13742 99232 104891 115469 122707 130326 127960 112441 91689 96096 113470 124118 128104 129145 110518
13729 110518 101202 106827 113861 138347 130529 135026 124967 110597 122754 162323 165781 144287 146799
13716 146799 172121 188195 200140 187277 150585 152196 156567 144529 167429 186408 179175 199606
13704 199606 213878 217363 224509 221379 212252 218679 209904 215674 234967 235997 235495 260211 259803 261757
13690 261757 276610 287295 296359 301584 309113 307091 324903 358447 378377 379608 365978 375049 391388
13677 391388 382088 359447 375836 371805 370679 385227 402937 427566 436266 419107 412773 413126 420670
13664 420670 426156 436935 474342 491578 514938 538573 558350 566106 570515 591373 602086 602233
13652 602233 621195 661061 688340 709396 733522 754902 781923 818855 836309 845225 883092 950270
13640I50270L7469K1507L4763L2528K6938M2603L9430M3608O3829O6627N8767
13629A418339P6049R0964R0135P4339O4146J01060J19330Q9216Q6033J26404J56861
13618B492876J58229J75217J77426J95262K20178K52655K77538L04628L35841
13609D589850L47227L93267M41825M76840N30510O16653O65227P32385Q10389
13600I604173R04001R79864J072343J177853J274046J376812J482911J527497
13592A9399500J535887J533852J520851J406502J251409J071851Q56505N92694
13584B9169051L07962K4159k29446m70621o96209q65300r88675j073509j103217
13575B4074195j100564j083306j018173r20571q24737p38721o12300n11229l97783
$$ plain form
13640 950270 987739 1009246 1044009 1076537 1103475 1146078 1185508 1229116 1292945 1359572 1418339
13629 1418339 1494388 1585352 1675487 1749826 1813972 1915032 2034362 2123578 2209611 2336015 2492876
13618 2492876 2651105 2826322 3003748 3199010 3419188 3671843 3949381 4254009 4589850
13609 4589850 4937077 5330344 5772169 6249009 6779519 7396172 8061399 8793784 9604173
13600 9604173 10508174 11488038 12560381 13738234 15012280 16389092 17872003 19399500
13592 19399500 20935387 22469239 23990090 25396592 26648001 27719852 28576357 29169051
13584 29169051 29477013 29501172 29271726 28801105 28104896 27239596 26250921 25177412 24074195
13575 24074195 22973631 21890325 20872152 19951581 19126844 18388123 17775823 17264594 16866811
13566A6866811k95018j74734p5717N5484J75855K84226L83091M98730O31398P75501
13556A9125627Q62929R73821J039031J089427J133396J114222J038202R56064
13548B7332719Q01457O10488M01070J38758j20471l42386n75772q06809r87658
13539B6451396j104210j198484j277870j277984j253865j243596j174669j102492
13531A6818226j054317r89583q92126q21178p63494p31249o68169n81957n44341
13522I771812n10289m68057m34494l88538l55744l41527l14252k81838k58374
13513F418699k40795k44629k38926k22186j81231j64074j73936j72606j52471
13504D627845j28614j27336j30311j18025j13432j22651j13194j06389r0467p2550
$$ plain form
13566 16866811 16571793 16397059 16321342 16376826 16552681 16836907 17219998 17718728 18350126 19125627
13556 19125627 19988556 20962377 22001408 23090835 24224231 25338453 26376655 27332719
13548 27332719 28134176 28744664 29145734 29284492 29164021 28821635 28245863 27439054 26451396
13539 26451396 25347186 24148702 22870832 21592848 20338983 19095387 17920718 16818226
13531 16818226 15763909 14774326 13882200 13061022 12297528 11566279 10898110 10316153 9771812
13522 9771812 9261523 8793466 8358972 7970434 7614690 7273163 6958911 6677073 6418699
13513 6418699 6177904 5933275 5694349 5472163 5290932 5126858 4952922 4780316 4627845
13504 4627845 4499231 4371895 4241584 4123559 4010127 3887476 3774282 3667893 3577426 3504876
13494C504876q3019r4186q8287p9077n8137m9457m8638p1295q3709n2868o5609
13483B730594o5611m9741m8117m6967k8840m6065m7198o2758o1324l4735l2207
13472B207031l0816l8957k7569k3230m3080o2585n2567j3848l4472l3833k3597
13461A822477k9059l0616l3005k7282k1335l3225k4737l2839k6630j4815k2422
13450A526512l7421m2527r910j7328j9773k4867k8790j0898n175k3277m7083n4231
13438A205232j2016q661q787n921l6324j7406j6931k3243k7860k5432j4061k7567
13426I81023j7397N151j2114k5103m1030k3033m797j6931k2182l2546k2593r971
13414G58477O099k1968j4060M318j0991k7124k7265m2479m20K0301J031r215n264
$$ plain form
13494 3504876 3421857 3327671 3239384 3160307 3102170 3052713 3004075 2932780 2849071 2796203 2730594
13483 2730594 2664983 2615242 2567125 2520158 2491318 2445253 2398055 2335297 2273973 2239238 2207031
13472 2207031 2176215 2137258 2109689 2086459 2043379 1980794 1928227 1914379 1879907 1846074 1822477
13461 1822477 1793418 1762802 1729797 1702515 1681180 1647955 1623218 1590379 1563749 1548934 1526512
13450 1526512 1489091 1446564 1436654 1419326 1399553 1374686 1345896 1334998 1329823 1306546 1259463 1205232
13438 1205232 1193216 1184555 1175768 1169847 1133523 1116117 1099186 1075943 1048083 1022651 1008590 981023
13426 981023 963626 968777 956663 931560 890530 867497 862700 845769 823587 791041 768448 758477
13414 758477 764576 742608 728548 732866 721875 694751 667486 625007 624587 644888 645919 636704 631440
13401F31440r856n959l1230j3222J8006o253j1671j2447l406k8149k5566k1448
13389D80239k829m513K644j3043k2321p146j7471j2679N077l223j9539j1766k2685
13376C50745j6260l791j125J1391j7733l3059p299J2042J1712L549k4705j7315
13364B68152M596L343L888l932O07j1593j074k439k398r52j0560l578k529p548
13350B33983k3158o413N083n395o327j6458n084O198J83J2066r27n772O432n388
13336A89023M172J571j1935j1137j4833r556p786l324O716j0918k0863J4934J3671
13323A39735N905K13K646L826j1918k5209K606N148R2N47j6148J7728P109k0315
13309A11965j9064k168J0887K325n852j1151L392K2830Q221J6477K542j7220j5488
$$ plain form
13401 631440 621584 615625 584395 571173 589179 582926 571255 558808 555402 527253 501687 480239
13389 480239 477410 472897 475541 462498 440177 433031 415560 402881 407958 404735 385196 373430 350745
13376 350745 334485 330694 329569 340960 323227 290168 282869 294911 306623 310172 285467 268152
13364 268152 272748 276091 279979 276047 276654 265061 263987 261548 259150 258198 247638 244060 241531 233983
13350 233983 210825 204412 209495 204100 197773 181315 176231 182429 182612 194678 193751 187979 194411 189023
13336 189023 193195 194766 182831 171694 156861 147305 139519 136195 142911 131993 111130 126064 139735
13323 139735 145640 145853 148499 152325 140407 115198 117804 122952 123044 123591 107443 125171 132280 111965
13309 111965 92901 90733 101620 103945 98093 86942 90334 113164 121385 137862 140404 123184 107696
13296A07696J3870J3041J3627p827k3820K070J7229l12j3915l183k8594l2199
13284E7683J2013K020J482J3824k461j0851j0113R974J6655q019k2555j949J2549
13271G0252q894j8339l98J3559J5688J8418Q97j1194m711O485K3367m022j3226
13258H7882Q851k0695j1473q452j0398j084R408O026J982J5388J4690p942j958
13245H2225J1212l967j0393K25O130p450J576j2967l155J054Q634J1969k7398
13232E7695j6780N908Q953J1681m057j6414n133o346O103O938K616j3663K482
13219C9983o80q660j2088K9396q534p409R32K280O179j1734J1434J2010J392j0912
13205D3589j9014j3178O052J8600Q930N316P79K99j3688j7835k542j498j0187
$$ plain form
13296 107696 121566 134607 148234 140407 116587 118657 135886 135574 121659 118476 89882 57683
13284 57683 69696 71716 73198 87022 84561 73710 63597 73571 90226 82207 59652 57703 70252
13271 70252 61358 43019 42621 56180 71868 90286 91183 79989 75278 81763 105130 101108 87882
13258 87882 96733 76038 64565 56113 45715 44631 54039 60065 62047 77435 92125 84183 82225
13245 82225 93437 89470 79077 79302 85432 77982 79558 66591 63436 64490 73124 85093 57695
13232 57695 40915 46823 55776 67457 63400 46986 41853 35507 41610 48548 51164 37501 39983
13219 39983 39303 30643 18555 47951 39417 32008 32940 35220 41399 29665 41099 53109 54501 43589
13205 43589 24575 11397 17449 36049 44979 50295 51074 51373 37685 19850 17308 15810 5623
13192E623q56j456J9507J6642q374q342K363n039Q934J2471j6752n321r5j5642
13178C663r543K5479L4220J1108j2591j0872l155j0058j0853J3227K5986J6059
13166G2670N289n809k5835j4099K040O415J6079K1879j2317m579K4271P224L2231
13153A25459J4818j2226K495J7488R966j5295p379m699J1600J4988o122q449k120
13140A40524J8435N467j8016k619L531q500j7177p548m685J999n212O522J2911
13127A25632L893r436j3892O191J6124N979r852M490Q557j1402k3743m512J4949
13114A12978j1486L496J5034J0148j0730K4411L9083k489j2889K2878K240j3160
13102A79514r036j6455l64K7044p961j8745k3313k1157m202P133k505J1716j5852
$$ plain form
13192 5623 4767 3311 22818 39460 31086 22744 25107 20068 29002 41473 24721 19400 19305 3663
13178 3663 -5880 19599 53819 64927 52336 41464 38309 28251 17398 30625 56611 72670
13166 72670 77959 72150 46315 32216 34256 40671 56750 78629 66312 61733 86004 93228 125459
13153 125459 140277 128051 130546 148034 158000 142705 135326 130627 142227 157215 151093 142644 140524
13140 140524 158959 164426 146410 143791 147322 138822 121645 114097 109412 111411 106199 112721 125632
13127 125632 129525 120089 106197 112388 128512 134491 124639 129129 137686 126284 102541 98029 112978
13114 112978 101492 104988 120022 130170 119440 143851 182934 180445 167556 190434 192674 179514
13102 179514 170478 154023 153659 180703 172742 153997 130684 109527 105325 112458 109953 121669 105817
13089A05817q479j893j03q372o746j0164l0569M178J4030K5127o667j0077k2959
13076D3123k5583Q432N876L899Q765O958k393q722j5021M870J2495o864k807j4742
13062A8286J1955Q200K86j1313r066j4667j607J5672N282J2987R958k493j3366
13049C0114j0307k80m813J1356M615J0243O545j1674k4381p194N495M182J3888
13036B7789Q823J1061n393j6271M841j0616q297j0911N371Q588k37o490q360O020
13022E918J0845j0861r628q473J6243J5772O12q952N073n594J781J7668k862L23
13008B7865k0364k1216Q826N966M646J8180K1163j375j1477k0549P355J2702Q108
12995C9830n194j1230k3746j6582j7416J4103K4017J6880n411k608j9025j0579
$$ plain form
13089 105817 97338 95445 95342 86970 80224 70060 39491 43669 57699 82826 76159 66082 43123
13076 43123 17540 25972 31848 35747 44512 51470 49077 40355 25334 30204 42699 35835 33028 18286
13062 18286 30241 38441 38727 27414 18348 3681 2074 17746 23028 36015 45973 43480 30114
13049 30114 19807 19527 14714 26070 30685 40928 47473 35799 11418 4224 9719 13901 27789
13036 27789 36612 47673 42280 26009 30850 20234 11937 1026 6397 14985 14748 8258 -102 5918
13022 5918 16763 5902 -3726 -12199 4044 19816 20428 11476 16549 10955 12736 30404 27542 27865
13008 27865 7501 -13715 -4889 1077 5723 23903 45066 43691 32214 11665 19020 31722 39830
12995 39830 34636 23406 -340 -16922 -34338 -20235 3782 20662 15251 12643 -6382 -16961
12983a6961J8631K8042n587j1471O134J8265n422k2565j5848q294J2889J8080
12971A5893J8496p903j9374J31L236j7901m353J53Q322L302j2465J0806R511P124
12957A4978q522k6759n483k463j6028j385J3603L4189J8027J023j963r996j0605
12944a384M989O64L158K3484P591j3138j796J5552k339l4163j2433l445J5365
12931B105m655o054K082J4997J0715j8148J087l74K040q396J5171J9282j2384
12918A7468o616n981r304r908k656n837M6J2874J2061r710J125J2197K2755O915
12904C5429j5594j1898q575k522J5358j749Q615J2490r234j0376M64J0031j0611
12891A1828k018J1151O311r558j1593l855J6937O440j6935j1611J744l124K1291
$$ plain form
12983 -16961 1670 29712 24125 12654 18788 37053 31631 9066 -6782 -15076 -2187 15893
12971 15893 34389 26486 7112 7243 10479 -7422 -11775 -11622 -3300 2 -12463 -1657 7854 14978
12957 14978 6456 -20303 -25786 -28249 -44277 -45662 -32059 2130 20157 21180 19217 9221 -1384
12944 -1384 3605 4269 7427 30911 38502 25364 23568 39120 36781 2618 -9815 -13260 2105
12931 2105 -2550 -8604 -6522 8475 19190 1042 2129 1755 3795 -4601 10570 29852 17468
12918 17468 10852 4871 -4433 -14341 -16997 -22834 -22788 -9914 2147 -7563 -6438 5759 28514 35429
12904 35429 19835 7937 -638 -3160 12198 10449 19064 31554 22320 11944 12408 22439 11828
12891 11828 9810 20961 27272 17714 6121 2266 19203 25643 8708 -2903 -1159 -4283 17008
12878A7008o937O489L716j0384o086J5831K593l97L491m640L879j3114q438k166
12864H45J1604r432q631k689l268J2225R872L496k0593n465J2036K2777j2293
12851A0484J5980J2582j2914M126j0254k1352o492K7185R612j2228j6914j671
12839a856n827n483M367O102N560m818n32q398j1962N629J8145J9917R502q785
12825B1561j4435o834r475J8881j115k4194j2325r75J1943n93p011K3735J6678
12812A5841o507Q42P133j2092J795l661j690k1058L990J8509J7449L425L696q382
12798A9290M44r572r503r87J0296j7145p897Q233R964j912o892J3332j67R269
12784A6753r36O659J8594J422j5429k916J0657J116P012P081M761Q671J8722K8437
$$ plain form
12878 17008 10071 16560 20276 9892 3806 19637 22230 21833 25324 20684 24563 11449 3011 845
12864 845 12449 3017 -5614 -8303 -11571 654 10526 14022 -6571 -12036 0 22777 10484
12851 10484 26464 39046 26132 30258 20004 -1348 -7840 19345 28957 16729 -185 -1856
12839 -1856 -7683 -13166 -8799 -2697 2863 -1955 -2487 -10885 -22847 -17218 927 20844 30346 21561
12825 21561 7126 292 -9183 9698 8583 -15611 -27936 -28911 -16968 -17561 -24572 -837 15841
12812 15841 9334 10176 17309 5217 7012 3351 1661 -19397 -15407 3102 20551 23976 27672 19290
12798 19290 19734 10162 659 -328 9968 -7177 -15074 -6841 3123 1211 -5681 7651 7484 16753
12784 16753 15817 22476 41070 42492 27063 24147 34804 35920 42932 50013 54774 63445 82167 110604
12770A10604R440N662q021L4J3267J3208R367n324j239j7446j5038j3819k0458
12757H0237j6660j1917k2578M57O727m175l968n614J40r53n58O59r300j2466k566
12742b535O17R876K266J5006N668k225l130j9463k2078L924J8263P395J0409j0837
12728A3156p965N250p446Q72K303O636q697q816l720J2835L419K0179o986k7705
12714f685J3669m271r730j04j72P221j3014k5633K9064J9802N13q338N694j2075
12700d059J0354P150j5278j1906j281R085r569L133M4J3706K3586j3404m224K431
12686I768N000r684R59J2516r47j6999r205J2125N364j4731j3751k157k486N726
12672a8502j5117o430K1335K9762o122l1396l454K3027J1712K998j3907j2439
$$ plain form
12770 110604 120044 125706 117685 117719 130986 144194 153561 148237 146998 129552 114514 100695 80237
12757 80237 63577 51660 29082 29539 36266 32091 28123 22509 22649 21696 21138 21797 12497 31 -2535
12742 -2535 -1918 7958 10224 25230 30898 28673 25543 6080 -15998 -12074 6189 13584 23993 13156
12728 13156 5191 10441 2995 3867 6170 12806 4109 -4707 -8427 4408 7827 28006 21020 -6685
12714 -6685 6984 2713 -7017 -7121 -7293 -72 -13086 -38719 -9655 10147 10660 2322 8016 -4059
12700 -4059 6295 13445 -1833 -13739 -15020 -5935 -15504 -12371 -12327 1379 24965 11561 7337 9768
12686 9768 14768 5084 6043 18559 17612 613 -8592 3533 8897 -5834 -19585 -21742 -24228 -18502
12672 -18502 -33619 -40049 -18714 11048 4926 -26470 -29924 -6897 4815 7813 -6094 -18533
12660a8533K009m994j2906n000R652J0961K2504J1144J387j5680k1117k5700N170
12647d1103n211j25K7504O273O256L00r066m580K2970J7720o179j1421r758L570
12633b850J2912J3245j5343l2371J1343J2964K4497n240m469J0103j1524o638
12621F629P951N69j5341j2083m383L166o29Q872P315K360j8390j7907M78k3253
12607e4646j690L1320J0188J0249O967K386j5757p608J2361J1325o96R65o369
12594a005j8460j0351K3069N88o718N267l655J064r197j8521J5774l55K2370k228
12580b358n965o94l743M524K664q624k969J6865K1593J5905j3472o882j8630k0763
12566b2549J4893q180m138j3627o031J3300Q183j1682O14J9731j0965j2017Q249
$$ plain form
12660 -18533 -16524 -21518 -34424 -39424 -29772 -18811 3693 14837 16224 544 -20573 -46273 -41103
12647 -41103 -46314 -46439 -18935 -12662 -6406 -6106 -15172 -19752 3218 20938 14759 3338 -6420 -2850
12633 -2850 10062 23307 7964 -24407 -13064 -100 24397 19157 14688 24791 13267 6629
12621 6629 14580 15149 -192 -12275 -16658 -13492 -14121 -5249 2066 4426 -13964 -31871 -31393 -54646
12607 -54646 -56336 -25016 -14828 -4579 2388 4774 -10983 -18591 -6230 5095 4399 5364 -1005
12594 -1005 -19465 -29816 -6747 -6159 -12877 -7610 -11265 -10201 -19398 -37919 -22145 -22500 -130 -2358
12580 -2358 -8323 -9017 -12760 -8236 -5572 -14196 -17165 -300 21293 37198 23726 16844 -1786 -22549
12566 -22549 -7656 -15836 -19974 -33601 -39632 -26332 -18149 -29831 -29217 -9486 -20451 -32468 -24219
12553b4219J1250K6130J4267p952k899M216Q506p937n655j5240R555L690k2883
12540i171j3657M196p097j6868j6499R849J4020O151J0107K3408J8409m283l137
12527A5428k583j4188P232J2347J2990N149o908m623j230O370k7l166M732L014
12513C4537j2037L680k330k8412P477K0604K131J1162L10o730L498l657j2138
12500A8095R670P686K675L584j171k63J306J1814K0362J2050K5613J8272L1086
12487A60779J9304p263k876p508l5875n1438k9032J339m341k5997j6989m000r847
12474a3744j5138L698L4843J5413n86q860J2516j6111k2657r592J917m474q578
12461c1353J1132J7604L18L710p990K755l369k5724J1909J2868m240j0327J1956
$$ plain form
12553 -24219 -12969 13161 27428 19476 16577 20793 29299 21362 15707 467 10022 13712 -9171
12540 -9171 -22828 -18632 -25729 -42597 -59096 -49247 -35227 -29076 -18969 4439 22848 18565 15428
12527 15428 12845 -1343 5889 18236 31226 36375 29467 24844 23614 29984 29957 26791 31523 34537
12513 34537 22500 26180 23850 -4562 2915 23519 25650 36812 37122 30392 33890 30233 18095
12500 18095 27765 35451 38126 41710 40539 40276 41582 53396 73758 85808 111421 129693 160779
12487 160779 180083 172820 169944 162436 126561 75123 46091 47430 43089 17092 103 -3897 -13744
12474 -13744 -28882 -25184 9659 25072 24486 15626 28142 12031 -10626 -20218 -18301 -22775 -31353
12461 -31353 -20221 -2617 -2299 1411 -6579 -3824 -7193 -32917 -21008 -8140 -12380 -22707 -10751
12448a0751m576L078o62J3721K9507j2024j166n201o989n185k0644J7241p627
12435a1278q645k336k482J3768K030K18J2133O302O174J0764N152j482l664k030
12421B4624j230j3007k4749R080J2746J0610N829j2821k2960j5701Q077K747P610
12408i145J6073K031j7668o814K190P90r249J6986J4852k3726p530p377l235M678
12394b7144P7m743K12Q744m824J8600j2094k903J2857J1343k526R230J2514K2
12380A9365q565k7070j6256j6287P564J4630M558J8286J3541l549O067r48J1329
12367B2665J2178j5111M553O607q472r570j8504Q664j441j3042j1106J4343M775
12354c461k686N020L19J0256n807J0623K3166L454j8844j823n596K4938p283q827
$$ plain form
12448 -10751 -15327 -12249 -12911 810 30317 18293 17127 11926 4937 -248 -20892 -3651 -11278
12435 -11278 -19923 -22259 -24741 -10973 -8943 -8725 3408 9710 15884 26648 31800 30318 26654 24624
12421 24624 23394 10387 -14362 -5282 7464 18074 23903 11082 -11878 -27579 -19502 -16755 -9145
12408 -9145 6928 8959 -8709 -15523 -13333 -12543 -21792 -4806 10046 -13680 -21210 -28587 -31822 -27144
12394 -27144 -27067 -31810 -31598 -22854 -27678 -9078 -21172 -24075 -11218 125 -2401 6829 19343 19365
12380 19365 10800 -16270 -32526 -48813 -41249 -26619 -22061 -3775 9766 6217 12284 11336 22665
12367 22665 34843 19732 24285 30892 22420 12850 -5654 3010 1569 -11473 -22579 -8236 -3461
12354 -3461 -6147 -1127 -808 9448 3641 14264 37430 40884 22040 20217 14621 39559 32276 23449
12340B3449o461J1568P73j4198r646N694k0935p216q165K414J627j3477O273K227
12326b6073J2504J9786M131k738k899J3851j3795R97M774n693L660M533n696J1965
12312A9307Jj3994l4487o063J3114K0541K2501O84p934o7k5594k7345L1593K0228
12298A2485j0245j3899j3809j713J8385n305j6280J0681J1943O054m241r08n271
12285a2123R651Q512n154j081j3303k2049o081p647j0115J4104Q882Q63J8387
12272a7154J9339j6364p693M972P682o537n256j741M094K3972N206m53M629j7315
12258b619N490J3600J1655j943k2434j7382J5246Q203l770n171r944K22P035k427
12244d239r805R577R97k417O776J3144M667k1437l4777M555J7147J3546R947o334
$$ plain form
12340 23449 16988 28556 29329 15131 5485 11179 -9756 -16972 -25137 -22723 -21096 -34573 -28300 -26073
12326 -26073 -13569 6217 10348 7610 4711 18562 4767 5764 10538 4845 8505 13038 7342 19307
12312 19307 19308 5314 -29173 -35236 -22122 -1581 20920 21604 13670 13603 -11991 -39336 -7743 12485
12298 12485 2240 -11659 -25468 -27181 -8796 -14101 -30381 -19700 -7757 -1703 -5944 -6852 -12123
12285 -12123 -2472 6040 886 -195 -13498 -35547 -41628 -49275 -59390 -45286 -36404 -35541 -17154
12272 -17154 2185 -14179 -21872 -16900 -9218 -15755 -21011 -22752 -18658 5314 10520 10067 14696 -2619
12258 -2619 2871 16471 28126 26183 3749 -13633 1613 9816 6046 875 -9069 -8847 -1812 -4239
12244 -4239 -14044 -4467 -3470 -5887 889 14033 18700 -2737 -37514 -32959 -15812 -2266 7681 1347
12230A347q128J1611K472J532J2519m915q92J5971r90k1357j9859O097n287N927
12216c952o46K187N714j904j0279L396N382j9410p463J3351m292j2948n20J0933
12202b0451j532P695J847r385q191L898J4985j5409L58R70j3790j5731J2488J6835
12188b5413P009K628O389Q494j443m4K739K161r962O151m32j4707l691L339P387
12173i395J6592M588m17j4293l740l298p571J3752O180K572P756m122N507K864
12159A6975J721M920j7054j6814j3045L0698J5300N995J0700r41K4723k219k3690
12146C7269j2592q395j9681K793j9706l394L964j2104R595K6898j0768j074p813
12133a5008K693L301Q95L954j4001J6551L6528J1305j6550j5440K617P381k0940
$$ plain form
12230 1347 -6781 4830 7302 8834 21353 16438 15546 31517 30527 9170 -10689 -4592 -9879 -3952
12216 -3952 -4598 -2411 3303 1399 -8880 -5484 -102 -19512 -26975 -13624 -17916 -30864 -31384 -20451
12202 -20451 -21983 -14288 -12441 -21826 -30017 -26119 -11134 -26543 -26185 -25215 -39005 -54736 -42248 -25413
12188 -25413 -18404 -15776 -9387 -893 -2336 -2380 359 2520 -7442 -1291 -1723 -16430 -20121 -16782 -9395
12173 -9395 7197 11785 11368 -2925 -6665 -9963 -17534 -3782 2398 4970 12726 8604 14111 16975
12159 16975 18696 23616 6562 -10252 -23297 7401 22701 28696 39396 38455 63178 60959 37269
12146 37269 24677 16282 -3399 -606 -20312 -23706 -19742 -31846 -22251 4647 -6121 -7195 -15008
12133 -15008 -12315 -9014 -8119 -4165 -18166 -1615 34913 46218 29668 14228 16845 24226 3286
12120C286l056j6582k2002L171J7634o980M638k986J1726J6486O713n749O805
12107A3104K8154q738m484q725j6754k211j4671l816L967q783J2834Q599j9779
12094b1303L58M881J9627O228O24m450J8274j3703j2753k3806p394J8824R879
12081d714p024j0671R163P345J2357j5207m61n977N782q17j8302n124L3612J4713
12067A4675P448n983m37m362j3679R67Q323K200K1004q856k2868r141p378k3466
12053d1553j818L4896J4503j0137l8820j734K0877J3457l738O87K384o379K2251
12040D876J0175l108o797j3366j7509J2014J8840M989j3381J5452j2036j3596
12028a3447K0607N604k220J6791J0239q388n286r353n447O488J34j1598P309m675
$$ plain form
12120 3286 230 -16352 -38354 -35183 -17549 -24529 -19891 -22877 -11151 5335 12048 6299 13104
12107 13104 41258 32520 28036 19311 2557 346 -14325 -18141 -14174 -22957 -10123 -1524 -21303
12094 -21303 -20945 -16064 3563 9791 10415 5965 24239 10536 -2217 -26023 -33417 -14593 -4714
12081 -4714 -11738 -22409 -13246 -5901 6456 -8751 -9212 -15189 -9407 -10224 -28526 -33650 -38 14675
12067 14675 22123 16140 15703 11341 -2338 -1371 6952 9152 30156 21300 -1568 -10709 -18087 -41553
12053 -41553 -43371 -8475 6028 -4109 -42929 -44663 -23786 -10329 -14067 -13380 -10996 -17375 4876
12040 4876 15051 11943 5146 -8220 -25729 -13715 5125 10114 -3267 12185 149 -13447
12028 -13447 7160 12764 10544 27335 37574 29186 23900 14547 9100 15588 15722 4124 11433 6758
12014F758j0570q964n611k361R140l202J180O1P181k534r428O434l768k949K836
11999a5797k5800k400J4078J9733N21l526J9283J4203K776q436J0526r383j6541
11986g63J0226R404Q540o719o784q06L863n715p713j503j950J4285q217j7103
11972a0955p702O582k891o712M081p928k254J4783q488j4131J2640k45Q875J5067
11958G22j0440q51j365m444J3134J1246K323j443n651j2046J127K101L940k56
11944a903R531j41j2759k3832R681J4684J1273k8295k635J5243K4494J3652J033
11931C0026j0773K415j3707k4740Q557N955K238j7402m091L945R773K0859R754
11918B2809n220q248M848o648j2167N488j7314q721K038R248J0294J1413l826
$$ plain form
12014 6758 -3812 -12776 -18387 -20748 -11608 -14810 -13630 -13569 -6388 -8922 -18350 -11916 -15684 -18633 -15797
11999 -15797 -41597 -43997 -29919 -10186 -9665 -13191 6092 20295 23071 14635 25161 15778 -763
11986 -763 9463 18867 27407 20688 13904 13098 16961 11246 3533 2030 80 14365 6148 -10955
11972 -10955 -18657 -12075 -14966 -21678 -17597 -25525 -27779 -12996 -21484 -35615 -22975 -23220 -14345 722
11958 722 -9718 -10569 -11934 -16378 -3244 8002 10325 8882 3231 -8815 -7688 -5587 -1647 -1903
11944 -1903 7628 7487 -5272 -29104 -19423 -4739 6534 -21761 -24396 -9153 15341 28993 30026
11931 30026 19253 21668 7961 -16779 -8222 -2267 -29 -17431 -21522 -17577 -7804 13055 22809
11918 22809 17589 9341 14189 7541 -4626 862 -16452 -25173 -23135 -13887 -3593 7820 3994
11905C994J715m977P194L107J3505j1897k1488k5016k826K985J5507J2055j5732
11892b1874o890p970j3383J2891J6813Q272K2559P761o800p831j1300j547r191
11879a8490j0007n984k728J1071m178P086J4162r755n189J8552L885q391J196
11866h770R94O882Q871N835k409j4560O794n493p407J692L659R531j1833j9360
11852b5574n844Q656J20K7213N209k0789J831J6559k97q691L763O774k459n070
11838A401j1467K994K0038O23j2349L889q992k3180P214q263k391R96M076l158
11824b8569m356J478K1485J8285J1903M082j0413j3962j3646K958J8309O740J426
11811A5720k6483k141j840j8169m804K3641J9165L672j0224k1431n059L931J6315
$$ plain form
11905 3994 5709 732 7926 11033 24538 12641 -8847 -33863 -36689 -33704 -18197 -6142 -21874
11892 -21874 -28764 -36734 -50117 -37226 -20413 -12141 10418 18179 11379 3548 -7752 -9299 -18490
11879 -18490 -28497 -34481 -37209 -26138 -30316 -23230 -9068 -18823 -24012 -5460 -1575 -9966 -8770
11866 -8770 -7776 -894 7977 13812 11403 -3157 3637 -1856 -9263 -7571 -3912 5619 -6214 -25574
11852 -25574 -31418 -22762 -22642 4571 9780 -11009 -9178 7381 7084 -1607 2156 8930 6471 1401
11838 1401 -10066 -7072 12966 13589 1240 5129 -3863 -27043 -19829 -28092 -30483 -29487 -25411 -28569
11824 -28569 -32925 -31447 -9962 8323 20226 24308 13895 -67 -13713 -10755 7554 14294 15720
11811 15720 -10763 -12904 -14744 -32913 -37717 -14076 5089 8761 -1463 -22894 -27953 -24022 -7707
11798g707M82k0148j2998J8186K9415j2130j4079J6906r661j9448J1919M775N307
11785i181R991j2369K331l615l328N816M833J3127L772j883j3217n548O782J3825
11771A1336O204K063j484j54q915j1466k3110j820L5605J578j4203j3854r968
11758b8188K5484K9942k360l5936j1481K336P196K854j0309Q644J9070Q291l2835
11745a7292l0513K4030M0085P680k4848K732O11m948J637k140L639o313k7309
11732c2949j599K8837J9884J540n200P425k8158L37L559j0547J022l584J3243
11719f190r892L341j85j599O697M349J6618P050p475k8163j357M037K6843J0218
11705B4292j965l2496j2639J5484K1003k687k0213K0858l988p313J1918K461J4281
$$ plain form
11798 -7707 -7225 -27373 -40371 -22185 7230 -4900 -18979 -2073 -11734 -31182 -19263 -14488 -9181
11785 -9181 810 -11559 -9228 -12843 -16171 -10355 -5522 7605 11377 9494 -3723 -9271 -2489 11336
11771 11336 17540 19603 18119 17965 9050 -2416 -25526 -27346 8259 9837 -4366 -18220 -28188
11758 -28188 -2704 27238 24878 -11058 -22539 -20203 -13007 -10153 -20462 -11818 7252 15543 -17292
11745 -17292 -47805 -23775 16310 23990 -858 1874 2485 -2463 -826 -2966 673 -5640 -32949
11732 -32949 -34548 -5711 14173 15713 10513 17938 -10220 -9883 -6324 -16871 -15849 -19433 -6190
11719 -6190 -16082 -12741 -12926 -14525 -7828 -3479 13139 20189 12714 -15449 -16806 -12769 14074 24292
11705 24292 22327 -10169 -22808 -7324 13679 10992 -9221 11637 7649 336 12254 14715 28996
11692B8996j6477k2302l985O455l349P040P770r010j7668m655K4878J5556j8232
11679d983j7611Q155l117k36J0277R219Q151L131j3947J0943l588r548N598J2943
11665A5387R325J249j7240j2360r378j4000l357K1670J2320q101J639R013r8r611
11651c542j7919N255N708Q993J8905O725j6258k2115j039r211O18j3044J118J0665
11637b5141L0690R535q410j295N155k695l908Q127j8722k729r39n820o675N551
11623a7276K615L302J0544K1856j7835k0555m865Q453J3080K8312l574j0323J962
11610A5696k1118j0605J8002P529L173O662o942j7008p04p642j1278K7601J8704
11597B2070j8419k2750k211J5936M035m855q832R13K5934J7994o971m521l240
$$ plain form
11692 28996 12519 -9783 -13768 -7313 -10662 -3622 4148 -4862 -22530 -27185 -2307 13249 -4983
11679 -4983 -22594 -14439 -17556 -17792 -7515 1704 9855 12986 -961 9982 6394 -3154 2444 15387
11665 15387 24712 25961 8721 -3639 -13017 -27017 -30374 -8704 3616 -4485 -2846 6167 6069 -3542
11651 -3542 -21461 -16206 -10498 -1505 17400 24125 7867 -14248 -15287 -24498 -23880 -36924 -35806 -25141
11637 -25141 5549 15084 6674 5379 10534 7839 3931 12058 -6664 -9393 -10332 -16152 -22827 -17276
11623 -17276 -14661 -11359 -815 21041 3206 -17349 -22214 -13761 -681 27631 24057 13734 15696
11610 15696 -5422 -16027 1975 9504 12677 19339 12397 -4611 -5315 -12957 -24235 3366 22070
11597 22070 3651 -19099 -21310 -5374 -1339 -6194 -15026 -14113 11821 29815 22844 18323 15083
11584A5083j3056l961K610L287K903j699J5463o895r98r258j5819N86j9237o577
11570c7568K069Q642l407N292J1333R255j178J725k3970k0470k460J9157J9280
11557a2300N357j446n318k985R083J9094q797k052o955j8319P624M780J4997q85
11543A878j976k1490j4955m093j3427K5259J622Q713J5995R419k262q401J739
11530a979j356M22p60k16O73j859r844P382j886n795P295J7534q275o112P571
11515B795j3590r960l676J1870J3695K2942r064k0822j201j4510j6689j21K3244
11502a5087K2982j86p163j8056J9009N697k5432L832n056k5749j0064J4535L875
11489c6863J9985O001l2262l219L634J4058J7638K8651J3120l4802J073J4396
$$ plain form
11584 15083 2027 -1934 676 3963 6866 5167 20630 13735 12737 3479 -12340 -11754 -30991 -37568
11570 -37568 -35499 -26857 -30264 -24972 -13639 -4384 -5562 -3837 -27807 -48277 -50737 -31580 -12300
11557 -12300 -6943 -8389 -13707 -16692 -7609 11485 2688 636 -6319 -24638 -17014 -12234 2763 1878
11543 1878 -98 -21588 -36543 -40636 -54063 -28804 -27182 -18469 -2474 6945 4683 -3718 -1979
11530 -1979 -3335 -2913 -3673 -3889 -3216 -5075 -14919 -7537 -9423 -15218 -7923 9611 1336 -4776 2795
11515 2795 -10795 -20755 -24431 -12561 1134 24076 15012 -5810 -7011 -21521 -38210 -38331 -15087
11502 -15087 7895 7709 546 -17510 1499 7196 -18236 -14404 -19460 -45209 -55273 -40738 -36863
11489 -36863 -16878 -10877 -43139 -46358 -42724 -28666 -11028 17623 30743 -4059 -2986 11410
11477A1410k515o798J3470N108j3920q470k581J997M918Q240J3575r700j9625
11464d891o000j7151j1824N78K3799K1924O88j6634j530J5793j5573j592K0177
11451G764m937n056p845l451j451k473J866J2598P809n671j9929O627M197J697
11437h255Q607j0695K359q052j2416J1488J0729n637r104j4491J3738Q396j7590
11424c0923q785P811J9521P322K0343q83l802j936O610K581j1787q129k4018J367
11410b4708O30r650r306J317P928J7078J2483j6325k0324o273J5778J4262N880
11397a1230q504j4831M239J1719K2228j3732k7667K734r214J090J3428K3321j258
11384g677m024p209n208p4j0515k915L426K82K0887K5739r411L511q892o458j2511
$$ plain form
11477 11410 8895 2097 15567 20675 6755 -1715 -4296 -2299 2619 10859 24434 14734 -4891
11464 -4891 -10891 -28042 -39866 -39288 -15489 6435 7123 -9511 -11041 4752 -10821 -12413 7764
11451 7764 2827 -2229 -10074 -13525 -14976 -17449 -15583 -2985 4824 -847 -20776 -14149 -9952 -8255
11437 -8255 352 -10343 -7984 -16036 -28452 -16964 -6235 -11872 -20976 -35467 -21729 -13333 -30923
11424 -30923 -39708 -31897 -12376 -5054 15289 14406 10604 8668 15278 17859 6072 -2057 -26075 -24708
11410 -24708 -24078 -33728 -43034 -41717 -33789 -16711 -4228 -20553 -40877 -47150 -31372 -17110 -11230
11397 -11230 -19734 -34565 -30326 -18607 3621 -10111 -37778 -35044 -44258 -43168 -29740 -6419 -7677
11384 -7677 -11701 -18910 -24118 -24192 -34707 -37622 -34196 -33914 -13027 12712 3301 6812 -2080 -8538 -21049
11369b1049K80J534j798J6281J661n771Q30J0134l132J003q141J6738Q815j0427
11355F958J002o737p553j6589K766J7856M795o332j503O84j2637p518J4870K5508
11341A5570J5302j4204o919k8412k4882p461O365J0226J042k412n99L0073R107
11328B796j0754j3862L67K4087j1611Q233o719J460K0276m196q648l869J939J5948
11314A5447N061j6503k6611J110K027j1678J1261n82P121K8317j0825j8600K836
11301a1619K227K1743R760M196o735j1701m775J7300j712j0423J7611j0572j2368
11288B932m661n025Q938n763O529l9j3420j2251J2041Q237j5777m700RR491j2736
11273b6195M234k257p194m134m774J532N993J2608J9059K0159M213k9286j7155
$$ plain form
11369 -21049 -20769 -19235 -21033 -4752 -3091 -8862 -8032 2102 -1030 -27 -8168 8570 17385 6958
11355 6958 7960 1223 -6330 -22919 -20153 -2297 2498 -3834 -5337 -4653 -17290 -24808 -9938 15570
11341 15570 30872 16668 9749 -18663 -43545 -51006 -44641 -34415 -33373 -35785 -36384 -6311 2796
11328 2796 -7958 -21820 -21453 2634 -8977 -744 -7463 -6003 14273 10077 1429 -2440 -501 15447
11314 15447 20508 4005 -22606 -21496 -19469 -31147 -19886 -20468 -13347 14970 4145 -14455 -11619
11301 -11619 -9392 12351 22111 26307 19572 7871 3096 20396 18684 8261 25872 15300 2932
11288 2932 -1729 -6754 2184 -3579 2950 2911 -10509 -22760 -10719 -2482 -18259 -22959 -22950 -13459 -26195
11273 -26195 -21961 -24218 -31412 -35546 -40320 -38788 -32795 -20187 -1128 19031 23244 -6042 -23197
11260b3197j563j0272L966j5532J1217K4037J2153j1381j0324J9262j2475O140
11248g969K5336j0735l840q610k0826J2173J0834p998j0176L155M312J464j1632
11235b4512j8623J1831Q920J5114P900k309n061j7586j3783N68J8735j466Q055
11222a2217L630N60K029K2264P383j0329q862J91J756k2142j1262k272Q26N911
11208b2534j0262j5759Q725L8729O677J2585r319O104k120k4667o941j6985k475
11195c8242J6512N506q955O631P923n442K223J4498j485L841m516O243J0962j6306
11181f07r007J6501K0452L163j2033n820L843j9367k8645L75J7890L216p41o041
11167a6821j4644R187j8965j3032L0288K2816K3038J7002q802j1821q988q084
$$ plain form
11260 -23197 -24760 -35032 -31066 -46598 -35381 -11344 809 -10572 -20896 -1634 -14109 -7969
11248 -7969 17367 6632 2792 -5818 -26644 -14471 -3637 -11635 -21811 -18656 -14344 -12880 -24512
11235 -24512 -43135 -31304 -22384 -7270 630 -1679 -6740 -24326 -38109 -37541 -18806 -20272 -12217
11222 -12217 -8587 -8027 -5998 16266 23649 13320 4458 4649 6405 -15737 -26999 -29271 -28445 -22534
11208 -22534 -32796 -48555 -39830 -1101 5576 18161 8842 14946 12826 -11841 -18782 -35767 -38242
11195 -38242 -21730 -16224 -25179 -18548 -10625 -16067 -13844 654 -831 3010 -1506 4737 15699 -607
11181 -607 -9614 6887 27339 30502 18469 12649 16492 -2875 -31520 -31145 -13255 -10039 -10780 -16821
11167 -16821 -31465 -22278 -41243 -54275 -23987 -1171 21867 38869 30067 18246 9258 1174
11155A174l052p306K0681L950O87j120J1050J3487j7361N73J0840j4087k0193
11142f77j6980r18P485O869K4898k832q163j1889p887l2662Q140K4079N152O950
11128A565J4252Q742j1074J5882J5693j8475j9497J109k732N281j0383K205M415
11115F983J56J374L704K522r847l3359k4628P398K0883J2223k600l363j5687k448
11101c6689J4805O473n030L150o85J1416J966n477l786Q395J3097N354j1693R987
11087A1283m659n400J5583L802O251j5033j1819L210j128L400K815R619l136j5821
11073a033K347J2538k146L158k791j3119J0717p270k1995j558o912Q659J036J9264
11059H95m225l681Q762J1408K559j4064k2860J959k344l555n337O20j1180J4421
$$ plain form
11155 1174 -1878 -9184 11497 15447 16134 15014 26064 39551 22190 22763 33603 19516 -677
11142 -677 -17657 -18575 -11090 -4221 20677 17845 9682 -2207 -10094 -42756 -34616 -10537 -5385 1565
11128 1565 15817 24559 13485 29367 45060 26585 7088 8197 5465 10746 363 2568 6983
11115 6983 7139 8513 12217 14739 4892 -28467 -53095 -45697 -24814 -12591 -15191 -18554 -34241 -36689
11101 -36689 -21884 -15411 -20441 -17291 -17976 -6560 -4594 -10071 -13857 -5462 7635 12989 1296 11283
11087 11283 6624 1224 16807 20609 26860 11827 8 3218 2090 5490 8305 17924 14788 -1033
11073 -1033 1314 13852 11706 14864 12073 -1046 9671 2401 -19594 -21152 -28064 -19405 -18369 895
11059 895 -3330 -7011 1751 13159 15718 1654 -21206 -19247 -21591 -25146 -30483 -29863 -41043 -26622
11045b6622K0964R865j7631q01l263l059j3878r657J049K7980K0697j7923p784
11032b0063N679j4986j14M311j507j0404M330N909Q387Q264m526J5290n709K5004
11018A9865r073l3799j7205J2895L733J213l699J4698k837p191J2817P699j6983
11005a7867O794K5799O832j4906k0134j2692n942j442M91L095J1925J169j766
10992a8644J5538J1440k354j1769K2560L005j1450j9932N856P131P980o94J4488
10979B3155j2663j2998k0899K325M991M609m000m987J1243j5676O100K1105j3641
10966a1336j8525q929K4336J9177M500m746k156M341j2931J1900P238k480p737
10953B652l3880j895K9282J7162j1675l920l744Q582L196j3122j1417j950J3131
$$ plain form
11045 -26622 -5658 4207 -13424 -14225 -17488 -20547 -34425 -44082 -43033 -15053 5644 -12279 -20063
11032 -20063 -14384 -29370 -29484 -25173 -26680 -37084 -32754 -26845 -18458 -10194 -14720 570 -5139 19865
11018 19865 10792 -23007 -40212 -27317 -23584 -22371 -26070 -11372 -14209 -21400 -8583 -884 -17867
11005 -17867 -11073 14726 21558 6652 -13482 -26174 -32116 -33558 -33067 -29972 -18047 -16878 -18644
10992 -18644 -3106 8334 5980 -5789 16771 19776 8326 -11606 -5750 1381 9361 8667 23155
10979 23155 10492 -2506 -23405 -21080 -16089 -11480 -15480 -20467 -9224 -24900 -18800 2305 -11336
10966 -11336 -29861 -38790 -14454 4723 9223 4477 2321 6662 -6269 5631 12869 10389 2652
10953 2652 -31228 -33123 -3841 13321 1646 -2274 -6018 2564 5760 -7362 -18779 -20729 -7598
10940g598O063j1493J530p015m716m627J3432K947Q88n178j2715K6771R455j1417
10926c673j7533O445p699M004R120l044K544L139J5413Q0j5535p166J1513K17
10912b175j55K1800O550j3535k3708J4956n721K262j1726n929r391q786K6014
10899i544J0550j8633L425M319K0811K1174J2376j2116j6115j2966O467j1945
10887b197j6582K2340L444j7751Q207N854J0655k357l1044j3187J0565R291J0905
10874a857Q195J4470L433k743k464L026R208Q674j4539j6638p14J4847J0922K710
10860C6530J944j4497j5958n440J2432O624l789j6473l362j1044q516P036J7244
10847B731P033J1496o9K3795j570j5609k2414o822K4457q2j8396r802O247L511
$$ plain form
10940 -7598 -1535 -13028 -11498 -18513 -23229 -27856 -14424 -11477 -10589 -15767 -28482 -1711 7744 -3673
10926 -3673 -21206 -14761 -22460 -18456 -9336 -12380 -9836 -6697 8716 8796 -6739 -13905 -2392 -2175
10912 -2175 -2330 19470 26020 12485 -11223 3733 -1988 274 -11452 -17381 -26772 -35558 -9544
10899 -9544 1006 -17627 -14202 -9883 10928 32102 44478 32362 16247 3281 9748 -2197
10887 -2197 -18779 3561 7005 -10746 -2539 3315 13970 11613 -19431 -32618 -22053 -12762 -1857
10874 -1857 6338 20808 24241 21498 19034 22060 31268 39942 25403 8765 8051 22898 33820 36530
10860 36530 38474 23977 8019 2579 15011 21635 17846 1373 -1989 -13033 -21549 -14513 2731
10847 2731 9764 21260 21191 44986 43416 27807 5393 -1429 23028 22946 4550 -5252 995 4506
10833D506r143Q901J2356n092J5265O298p26q506j0703m933m462Q145J2655N180
10819B9741q378l0537J657J2866p426j4710r777J436L525o624r309J9367J2362
10806e807P00m597l484N356J7657J0780J2185n406j5811p656l966k661m158n97
10792g465p803j615R422J3343J5654M81j2554o464l906K3077K4544l719q509J0104
10778D4590j0219j5755j1263o595O359J4453M478j987k2713j4357O21J3871p681
10765f198k0716j3899j6272J5954J8158P802P796j3900M31O655J0518M823p080
10752e928P694j8586m982J7613k393k6189R632L2620K3514k01j9277k0517m163
10739a1163M712P490N637J0099j2422o182N567J757J0199O111n052j4607o688
$$ plain form
10833 4506 -4637 4264 16620 11528 26793 33091 32365 23859 13156 8223 3761 11906 24561 29741
10819 29741 21363 -9174 -7517 5349 -2077 -16787 -26564 -25128 -21603 -28227 -37536 -18169 -5807
10806 -5807 -5107 -9704 -13188 -7832 9825 20605 32790 27384 11573 3917 -49 -2710 -6868 -7465
10792 -7465 -15268 -16883 -7461 5882 21536 22017 9463 2999 -907 22170 46714 42995 34486 44590
10778 44590 34371 18616 7353 758 7117 21570 26048 24061 1348 -13009 -12388 1483 -6198
10765 -6198 -26914 -40813 -57085 -41131 -22973 -15171 -7375 -21275 -20844 -14189 -3671 1152 -5928
10752 -5928 1766 -16820 -21802 -4189 -6582 -32771 -23139 9481 32995 32794 13517 -7000 -11163
10739 -11163 -6451 1039 6676 16775 4353 -1829 3738 5495 15694 21805 16753 2146 -4542
10726d542k5627k78Q962j754J8500J349J3479N753K735N029o457j1721l458O606
10712H576k1172J1570L6438n343j7546K152J2673j2667k549K3013J4820j8592
10700C1373m4769J1939J7065J0344q624k0015j252q483m665j4013j0642K0082
10688b1660J5506J5351L30j9227k72K4568L190j8628j1632r077j9757J1583J6208
10675a3517L313J7723L77j2386k6154L455K306m887M08J0316R141Q672R98P632
10661G397L341K286o548m992m301r866J6686j031j019J3795N637qj131Q2j3000
10646G328M174l865k060J1230p715O84J0197m782M734M309J0697N310j3825m0377
10632a3961p894O057Q475J3522o403j4564J3629K217j2816O148j6739m313N1086
$$ plain form
10726 -4542 -30169 -30447 -21485 -23239 -4739 -3390 10089 15842 18577 23606 17149 5428 1970 8576
10712 8576 -12596 -1026 35412 30069 12523 14675 27348 14681 12132 35145 49965 31373
10700 31373 -13396 -1457 15608 25952 17328 -2687 -3939 -12422 -17087 -31100 -41742 -21660
10688 -21660 -6154 9197 9527 -9700 -9972 14596 17786 -842 -12474 -21551 -41308 -29725 -13517
10675 -13517 -10204 7519 7896 -4490 -30644 -27189 -24883 -29770 -29362 -19046 -9905 -1233 -235 7397
10661 7397 10738 13024 6476 1484 -2817 -12683 4003 2972 1953 15748 21385 21377 20246 20328 7328
10646 7328 11502 7637 5577 16807 9092 9776 19973 15191 19925 24234 34931 40241 26416 -13961
10632 -13961 -21855 -15798 -7323 6199 -204 -14768 -1139 1078 -11738 -5590 -22329 -26642 24444
10619B4444J3391k4234p980R499n240k467K889p401j8875K1188r181J4878K3454
10606C4365o264j11M064l359K646Q877j3507j6823J2534O304J2879p669l1405
10593B531o468O317n59o114R703O335j08k1187k852O409R337M050K268P517j3703
10578C476k7210o840K1129J9506q78R402r235k6034J622M289J2393o880L748j175
10564b687L83J3154J0814q008j0218J2371J9354O442K64k0208K0282Q115L344
10551E3402m579J545J6705K0079L2984L9236N3857M1662M2016K9349J276n1420
10539B76112m9260m6931k7349o885j8915j8323m0512k3247k829r789J3625P081
10527E2778j8583j603J8202m030k6643J1570J1797j1030M26n011J931n583j5545
$$ plain form
10619 24444 37835 13601 5621 15120 9880 7413 10302 2901 -15974 5214 -3967 10911 34365
10606 34365 28101 27990 32054 28695 31341 40218 26711 9888 22422 28726 41605 33936 2531
10593 2531 -3937 2380 1821 -4293 5410 11745 11637 -9550 -12402 -5993 3344 7394 9662 17179 3476
10578 3476 -23734 -30574 -9445 10061 9183 18585 9350 -16684 -15062 -10773 1620 -5260 -1512 -2687
10564 -2687 -2304 10850 21664 13656 3438 15809 35163 41605 41869 21661 41943 50058 53402
10551 53402 48823 50368 67073 87152 120136 159372 213229 254891 296907 326256 327532 276112
10539 276112 226852 179921 152572 145687 126772 108449 67937 44690 41861 32072 45697 52778
10527 52778 34195 32592 50794 46764 20121 31691 43488 32458 32884 27873 29804 24221 8676
10514H676J675P393k1489k4179J1332J4597J1725N593j841Q449P072j275J8383
10501D6111J3319r096k1273n924j7890j558M681J4503o677k4488l0716N735q944
10488d2217N486K0927M590O028q379o881l165j0487p684J8018K9179j3942j0692
10475a9219j0971J7730J0732J4230p541j7166L746m98q493K371J2983J510j1312
10462a1898k367k524O379Q229o782j2278P257K0096J5657J0182L621o305q586
10449B0681J2301P319k567l925L800j1532j130P316k9597l7259j144K0317M6137
10436C0717R06n946J9615k0423o803m202j5384N502J1703n39j5997k4779R59j3178
10422c7849L732K7403M62j0570R620k170N34N439K5849N93k796J164J0296j2893
$$ plain form
10514 8676 10351 17744 -3745 -27924 -16592 -1995 9730 15323 13482 21931 29003 27728 46111
10501 46111 59430 50334 29061 23137 5247 3689 8370 22873 16196 -8292 -39008 -33273 -42217
10488 -42217 -36731 -15804 -11214 -5186 -13565 -20446 -23611 -34098 -41782 -23764 5415 -8527 -19219
10475 -19219 -30190 -12460 -1728 12502 4961 -12205 -8459 -8957 -17450 -15079 -2096 -586 -11898
10462 -11898 -14265 -16789 -10410 -2181 -8963 -21241 -13984 6112 21769 31951 35572 29267 20681
10449 20681 32982 40301 37734 33809 37609 26077 24947 32263 2666 -34593 -35737 -15420 30717
10436 30717 31623 25677 45292 24869 18066 13864 -1520 3982 15685 15146 -851 -25630 -24671 -37849
10422 -37849 -34117 -6714 -6252 -16822 -7202 -9372 -8838 -3399 22450 23043 20247 21411 31707 18814
10408A8814Q505K567j0242j3885n241Q054n435j0054O051m750K0014J983r414
10395F967l443J108n797J484J5905k54j2753J0396O396k52K883p328m45j0542
10381D325o323j14p295j452Q618J3461q311j1748L197J0534J0774j3140k4782
10368b2256j5130J1615K6920K1365J0981J655n239j0835j8634j1290J2171O460
10356G783j7987j513R764K0075j0535j6172M472o739N591R590j4926K707J6964
10343I074K112m858j5616j8140QJ4747J4629K469m027J7784J3874k871N821j5784
10329A9222k1708l505O679J9632J3525j8505j0934k3525R483L4198q871m899j9084
10316h292j0756J6912m834j5569J8m637k38J4091N398l513J1189k115L911J4209
$$ plain form
10408 18814 27319 29886 19644 5759 518 8572 3137 -6917 -866 -5616 14398 16381 6967
10395 6967 3524 4632 -1165 319 16224 15970 3217 13613 20009 19757 22640 15312 14867 4325
10381 4325 -1998 -2112 -9407 -10859 -2241 11220 2909 -8839 -5642 4892 15666 2526 -22256
10368 -22256 -37386 -25771 1149 22514 33495 35150 29911 19076 442 -10848 1323 7783
10356 7783 -10204 -11717 -1953 18122 7587 -8585 -4113 -10852 -5261 4329 -10597 -7890 9074
10343 9074 11186 6328 -9288 -27428 -27420 -12673 1956 4425 398 18182 32056 29185 35006 19222
10329 19222 -2486 -5991 688 20320 33845 15340 4406 -19119 -9636 24562 15691 10792 -8292
10316 -8292 -19048 -2136 -6970 -22539 -22521 -27158 -27396 -13305 -7907 -11420 -231 -2346 1565 15774
10302A5774M806l482K017q175M351k604j4855m364j4069q265K4673N076P53K641
10288D277j867O983J2249k0703J425J3806q049m330M919J1765J0131p314q146
10275A5146J3027J0999O584j5528j7672j2922K457N337J056p403k9881Q157K5361
10262D718o91k921m456M210n527k643j3473Q781K1538M075r423o805L619k262
10248a260L276j5132l1531m119M0611P123l396J2858J0874J0035k925k9576r517
10235a2679L518N700o698J347Q057J9596J812k1775J0781n895p07L940K7332j201
10221C3128k942r267j8270l433q008K0067R938O58j4901j0922k492J908r206l206
10207a6948J4020J7363J810j8201r852M587J340r435M285J2098n705j1855J3355
$$ plain form
10302 15774 20580 17098 19115 10940 15291 12687 -2168 -6532 -20601 -28866 -4193 883 1636 4277
10288 4277 2410 9393 21642 939 2364 16170 8121 3791 8710 20475 30606 23292 15146
10275 15146 28173 39172 45756 30228 12556 -366 2091 7428 8484 1081 -28800 -20643 4718
10262 4718 4027 1106 -3350 860 -4667 -7310 -20783 -12002 9536 13611 4188 -2617 1002 -1260
10248 -1260 2016 -13116 -44647 -48766 -8155 -1032 -4428 8430 19304 29339 26414 -3162 -12679
10235 -12679 -9161 -3461 -10159 -8812 -755 18841 20653 -1122 9659 3764 3057 6997 34329 33128
10221 33128 30186 20919 2649 -784 -8792 11275 21213 21871 6970 -3952 -6444 -4536 -13742 -16948
10207 -16948 -2928 14435 16245 -1956 -11808 -7221 -5881 -15316 -11031 1067 -4638 -16493 -3138
10194c138J9201O8j6173O233q451p134P486j7984r078O963R901J6388K3139j3480
10180A3941j7581o159K080R528j270r03m207k474J1204J775j2699K658J8969J423
10166A6285j4622J794K553N607j5536j048j1090J5242K6249Q266j1833j9493j4746
10153a2372n889J472O225N03K3528M75J386K763J2253J939j0565L138j0549j5362
10139a055m364j9793o064m638O732J0907L2319J3163o61J610p78O188j2867p51
10125A9948M299N939N081r188j4545m856q294l463Q559N864L125o798l751J0730
10111A2650K3812j8437r347k605Q379J5789p081k279O261j7505j6360P541J1107
10098A1925L205O286R246n412m743J68k2418Q921J6412J10P817J182O681j0368
$$ plain form
10194 -3138 16063 16131 -42 6191 -2260 -9394 -1908 -19892 -28970 -22007 -12106 4282 27421 13941
10180 13941 -3640 -9799 -7719 1809 539 -364 -4571 -7045 4159 5934 -6765 -4107 14862 16285
10166 16285 1663 3457 6010 11617 -3919 -4967 -16057 -815 25434 33700 21867 2374 -12372
10153 -12372 -18261 -16789 -10564 -10061 13467 13942 15328 18091 30344 32283 21718 24856 14307 -1055
10139 -1055 -5419 -25212 -31276 -35914 -29182 -18275 14044 27207 26546 28156 27378 33566 20699 19948
10125 19948 24247 30186 35267 26079 11534 6678 -1616 -5079 3480 9344 12469 5671 1920 12650
10111 12650 36462 18025 8678 6073 14452 30241 23160 20881 27142 9637 -6723 818 11925
10098 11925 15130 21416 30662 25250 20507 20675 -1743 7178 23590 23700 31517 32699 39380 29012
10084B9012l15K110r859m65p506K563J5578O916L84J622p020L501Q061M754m658
10069D4678m016J706o08k6546K3680L6148J026j7420k574K1133K6444k4003j2649
10056F6999K7832J9203J2419K0433K5740J5930n166P31M1121N9961O9296P5179
10044D29678Q5526J41735J91233L01430M73110Q25525J484579K118193J697717
10035G748726L53777j331512k243942j682998r41461n35930l47419k27088j67200
10026F24953j28309o8360m5758l3252m3516l9134j2899k351n855l897l9642k9558
10014A72422j7886m4303k3578P846k541j1179l777Q428r078J0054l463j8823j6867
10001D7255n55J7744l103k3107L561J2450l931j4667m122r915m885J296j0181
$$ plain form
10084 29012 28697 30807 20948 20483 12977 15540 31118 38034 38418 40040 33020 36521 44582 49336 44678
10069 44678 40662 42368 41760 15214 38894 75042 76068 58648 56074 77207 103651 79648 66999
10056 66999 94831 114034 126453 146886 172626 188556 183390 184121 225242 285203 354499 429678
10044 429678 515204 656939 848172 1149602 1622712 2448237 3932816 6051009 7748726
10035 7748726 8102503 6770991 4527049 2844051 1902590 1366660 1019241 792153 624953
10026 624953 496644 428284 382526 349274 305758 266624 253725 251374 245519 241622 201980 172422
10014 172422 154536 110233 86655 94501 91960 80781 77004 85432 76354 86408 82945 64122 47255
10001 47255 46700 64444 61341 38234 41795 54245 50314 35647 31525 21610 16725 18021 7840
9988G840n577K0605m604k0995k953J7475J0184R6j1435J617M036J24L306J219
9974B0938j1243K209J1058R703l859o200p882J860P78j0388n16J710Q578J1763
9960B8509N956K4310o126j9072P984j4315q696l6k3530j6084j6154L0639J7797
9947A1182k8421J0924K2262j1503k420J37K708N352K152O686J2670m717l96K610
9933B9226l164l740j926J6566j1284k8713k927R737j1994j0290J1786m926p882
9920a9531J8187M2471J0469j2351j9024r731j782o294L507m917R353N750j9350
9907c243n879O861J4949j6569j1022j5137J4080Q560J2782J4088n117n155j138
9894H060p780j4771K0408o060q237K2028J4015O571j5747K643m50r323r614k517
$$ plain form
9988 7840 2263 22868 18264 -2731 -5684 11791 21975 22071 10636 12253 16289 16413 19719 20938
9974 20938 9695 11904 22962 32665 28806 22606 14724 16584 17362 6974 6458 8168 16746 28509
9960 28509 34465 58775 52649 33577 41561 27246 18550 18514 -5016 -21100 -37254 -6615 11182
9947 11182 -17239 -6315 15947 4444 2024 2161 4869 10221 12373 19059 31729 27012 26616 29226
9933 29226 26062 22322 20396 36962 25678 -3035 -5962 3775 -8219 -18509 -6723 -11649 -19531
9920 -19531 -1344 41127 51596 39245 20221 10490 8708 2414 5921 1004 10357 16107 -3243
9907 -3243 -9122 -2261 12688 -3881 -14903 -30040 -15960 -7400 5382 19470 14353 9198 8060
9894 8060 280 -14491 5917 -143 -8380 13648 27663 34234 18487 21130 20680 11357 1743 -774
9880g74J8328J9815k45L382q621L119j2533m786l501J7239O962j0926o356k3377
9866b274p809m75j7051R407K5862P544j045k2712J718J0682l435J3695l555N674
9852A6226O429j7913p595o157j2435j7366K3238J4450J6575j8528j4842K8338
9840A0420J9353N467M996k039k987l090j9349j6338J1870N187j5201J7317K5935
9827D1541K054j359j2117r732n001k673l957j8364K787J4894N119N5R108J520
9813B3875J3673N477j2251k2654p168K1009N859j0445j0354J689j4485j0041j303
9800a7119J1198J1310j8654j6866L420J7524j757n782R31J3874k231m543o664
9787a5359o187M598J3197M593p586m55J5728L426K23O12K699j488J336O617J0444
$$ plain form
9880 -774 17554 37369 37124 40506 31885 35004 22471 17685 14184 31423 38385 27459 21103 -2274
9866 -2274 -10083 -10558 -27609 -18202 7660 15204 14159 -8553 -6835 3847 412 14107 10552 16226
9852 16226 22655 4742 -2853 -9010 -21445 -38811 -15573 -1123 15452 -3076 -17918 10420
9840 10420 29773 35240 40236 38197 35210 32120 12771 -3567 8303 13490 -1711 15606 41541
9827 41541 43595 42236 30119 20387 15386 12713 8756 -9608 -6821 8073 13192 13247 22355 23875
9813 23875 37548 43025 30774 8120 952 21961 27820 17375 7021 8710 -5775 -15816 -17119
9800 -17119 -5921 5389 -13265 -30131 -26711 -9187 -10944 -16726 -15795 -1921 -4152 -8695 -15359
9787 -15359 -21546 -16948 -3751 842 -6744 -7199 8529 11955 12178 12790 15489 14001 15337 21954 32398
9772C2398q263J090K3447k213j5392N108n58k3265M519j988r861J7052n054l298
9758A3722R921R267m285j2987j739q069Q092O63J0180K1332k836j5485j5710K161
9744A4227J8586J2273M033k1039l2997M594R780N630J6381q785K727m483j718
9731A9209j1756j5779L151J4497J1335J8132J2415k439l078n796k1141l770k1684
9718f704n543R962J9310N094k581j2566N042K5510k352o826p824o842P221p076
9704A3825j022J5199j9764L702P080k0934r921J1023J1898P280K2871j08J131
9691D2260J576J2898O792n005j8684j1237J4344p71k1423m000J481L51M440k463
9677B0559O062J3875J1328n982m15p266j2769k3335q118R597J3881j788L574O044
$$ plain form
9772 32398 24135 25225 48672 46459 31067 36175 35617 12352 16871 14883 5022 22074 17020 13722
9758 13722 23643 32910 28625 15638 13899 5830 13922 14585 24765 46097 43261 27776 12066 14227
9744 14227 32813 45086 49119 28080 -4917 -323 9457 15087 31468 22683 25410 20927 19209
9731 19209 7453 -8326 -5175 9322 20657 38789 51204 48765 45687 39891 18750 14980 -6704
9718 -6704 -12247 -2285 17025 22119 19538 6972 12014 37524 35172 28346 20522 13680 20901 13825
9704 13825 12803 28002 8238 11940 19020 -1914 -11835 -812 11086 18366 41237 41129 42260
9691 42260 43836 56734 63526 58521 39837 28600 42944 42173 20750 16750 18231 18582 23022 20559
9677 20559 26621 40496 51824 45842 45427 38161 25392 2057 -6061 3536 17417 15629 19203 25247
9663B5247n008J882Q971k6582n283L748P072J5542o260j9560J9071J6280n433
9650B9687j6516Q541o260n199R39K1728R229J995P237J3677k581J250k2716j7117
9636B3894K397P151K3233N331L344M549k2708j5823J0431P551o850k002R161l344
9622D6315k9910o838l712N295p500K631K3723N556j9804j3542K817J1890J4920
9609C1841P103j3801j2864Q443R483k0579r036J8424J5349L390k1357M511J8779
9596C9686j4656j1011N658K1920J5518O621k1027q902J9906r91j4336q174n573
9583B4639l977j192L009R485K879P83N217n346j8657j4516O080R459J1913J208
9569C0984l231J513J6873J0822r897R81R836J257J2992q972j2203J1803Q230k4837
$$ plain form
9663 25247 20239 22121 31092 4510 -773 2975 10047 25589 19329 -231 18840 35120 29687
9650 29687 13171 21712 15452 10253 11192 32920 42149 44144 51381 65058 62477 63727 41011 23894
9636 23894 26291 33442 56675 62006 65350 69899 47191 31368 41799 49350 42500 40498 49659 46315
9622 46315 16405 9567 5855 11150 3650 6281 30004 35560 15756 2214 5031 16921 31841
9609 31841 38944 25143 12279 20722 30205 9626 590 19014 34363 37753 16396 20907 39686
9596 39686 25030 14019 19677 41597 57115 63736 42709 33807 53713 52722 38386 30212 24639
9583 24639 20662 19470 22479 31964 34843 35626 40843 35497 16840 2324 8404 17863 29776 30984
9569 30984 27753 29266 46139 56961 47064 48045 57881 59138 72130 63158 50955 62758 70988 46151
9555D6151j0031q319R081p175q835J42K6356J9530q028O923P825k311j3395p345
9541E0569L151n615r596L835r108o798J1471Q585j259j358J5702j4667N877J7586
9527F8375M543j4748k3603j3002j3650o999K959K2003J0833K658P735l101K529
9514D6532M436j1155N44J0451J1406m991J974J753o009j0729n51j0979J646J5047
9500D9375K8427J9603o911j5193r853n216L057p962l653J4526j974O961j836j5031
9486E4320Q158M246j291j6226l396J0182Q356k7082r480J6636l340J3158l945
9473E0296j472P799R912P714k467r419j2436J041o684J9876k792P301j7853j3586
9459C7230L0708K2009J0353j1921o611J1491J8765n239q483k158j5185j365j504
$$ plain form
9555 46151 36120 27801 36882 29707 20872 21014 47370 66900 58872 65795 73620 71309 57914 50569
9541 50569 53720 48105 38509 42344 33236 26438 37909 46494 45235 43877 59579 44912 50789 68375
9527 68375 72918 58170 34567 21565 7915 916 3875 25878 36711 39369 47104 44003 46532
9514 46532 50968 39813 40357 50808 62214 57223 59197 60950 54941 44212 43661 32682 34328 49375
9500 49375 77802 97405 90494 75301 65448 60232 63289 55327 51674 66200 64226 71187 69351 54320
9486 54320 62478 66724 65433 49207 45811 55993 64349 37267 27787 44423 41083 54241 50296
9473 50296 48824 56623 66535 74249 71782 62363 49927 50968 44284 64160 61368 68669 50816 37230
9459 37230 67938 89947 100300 88379 81768 93259 112024 106785 98302 96144 80959 79594 78090
9446G8090J2715k5714j2604q121Q595J1324J716j204j1400Q382J0845n139n347
9433F2138Q938K0929j7842j5053m928L582j270K2274R130r74k140O661N506o080
9419I0871j5323j399J2087N83k751j2787J5910K635j0514o730K230J94k669K043
9405G4380J9096N767k7592m464Q104j7574J838M316r14n581r85n466M408J7202
9391G2535J7046K62k0490K510J1317p494m601m537J1281K3133K184m348r055p208
9377H2535K002n546k820N285o813p409m777o236j841N161N303J2068J4862M982
9363I6756Q034m175O146J1200N483N451J282N294J5614J5936l364O539k234q113
9349A59849j2893O35L7525Q099J1406O626K7885K3107J5533K4203M1877K9305
$$ plain form
9446 78090 90805 65091 52487 44366 52961 64285 66001 64797 53397 61779 72624 67485 62138
9433 62138 71076 92005 74163 59110 54182 57764 56494 78768 87898 86924 84784 91445 96951 90871
9419 90871 75548 74149 86236 86819 84068 71281 87191 89826 79312 72582 74812 75006 72337 74380
9405 74380 93476 99243 71651 67187 75291 57717 59555 63871 62957 57376 56391 50925 55333 72535
9391 72535 89581 89843 69353 71863 83180 75686 71085 66548 77829 100962 103146 98798 89743 82535
9377 82535 84537 78991 76171 81456 74643 67234 62457 56221 54380 59541 64844 76912 91774 96756
9363 96756 104790 100615 106761 117961 123444 128895 130177 135471 151085 167021 163657 170196 167962 159849
9349 159849 146956 147591 185116 193215 204621 211247 239132 262239 277772 301975 343852 373157
9337C73157J9053K0845M5113L5515O0458N2201J3338M1084N4094O4023Q7080R1554
9325I57515R0440Q5192N3832P1141P4041O2046N2108N1061J3249n056n28j9794
9313A485247l6446n2247n4008n1866m5428o7251p9884o2001n2885n3720m0123
9302H89388m9826m8748m5989l6719l2752n8214n1355k5130o358j5060k8307j0899
9290D80031J5954K973l1632j9703L603M752o968P070j2164j8544j4350r984J2668
9277D13706J9695J4584J36J5574R545J9901O686K294J4211K5867K9845M5293J1200
9264F28537J6857K6406N3593O1879L1688O0714N5703M5488O7033P7858Q4497Q6331
9252A296584Q0757O5781Q5320P6306O4120P1823M4058J2224o316l9777o8176p9053
$$ plain form
9337 373157 392210 413055 458168 493683 554141 606342 619680 660764 714858 778881 865961 957515
9325 957515 1047955 1133147 1186979 1258120 1332161 1394207 1446315 1497376 1510625 1505569 1505041 1485247
9313 1485247 1448801 1396554 1342546 1290680 1245252 1178001 1098117 1036116 983231 929511 889388
9302 889388 839562 790814 744825 708106 675354 617140 565785 540655 534297 519237 490930 480031
9290 480031 495985 498958 467326 447623 451226 455978 449010 456080 443916 425372 411022 401038 413706
9277 413706 433401 447985 448121 463695 473240 493141 499827 502121 516332 542199 572044 617337 628537
9264 628537 645394 671800 725393 787272 818960 879674 935377 980865 1047898 1125756 1210253 1296584
9252 1296584 1377341 1443122 1528442 1604748 1668868 1740691 1784749 1796973 1790657 1750880 1682704 1603651
9240A603651o3381n3392o6587r0381r8254p5593p6138q0084n7669n6025n6207
9229H29940n4958o1825m0129j9228k2713m3625k7175k9461l2475l2536j7236j8431
9217D30148r354N994n151j6597m0342M595Q303j5143k0293J3241m7L134J5803
9204C74291M762K493k5657k0598n461M692R778Q662O881j0890j3013k585Q055
9191C41410L358j0422j2537P400Q386J201j1473J3485L1498P098j1362J439K5441
9178C94922J5422J9886M1024L0214k090K425m484J029p782J568P146j1441j8492
9165D69347j5021k0225k3007m0030j0370k0970k3136J666J464k977N993j4299
9153C08435k0987J3124R242j1157k997j9409j4500m449M505r810j6934m314q128
$$ plain form
9240 1603651 1540270 1486878 1420291 1329910 1231656 1156063 1079925 999841 942172 886147 829940
9229 829940 774982 713157 673028 653800 631087 587462 560287 530826 498351 465815 448579 430148
9217 430148 420794 426788 421637 405040 364698 369293 377596 362453 342160 355401 355354 358488 374291
9204 374291 379053 381546 355889 335291 329830 334522 344300 352962 359843 348953 335940 333355 341410
9191 341410 344768 334346 321809 329209 337595 338796 327323 340808 372306 379404 368042 369481 394922
9178 394922 410344 430230 471254 501468 499378 501803 497319 498348 490566 492134 499280 487839 469347
9165 469347 454326 434101 411094 371064 360694 339724 316588 318254 319718 316741 322734 308435
9153 308435 287448 300572 309814 298657 295660 276251 261751 257302 261807 251997 235063 230749 222621
9140B22621N72n145l216J1001l922P523J0571M631l637k9713k182P943j2152N638
9126B10533j613j2335N131N851K3533J2897l672r387O663k586k0335k1092J4224
9113B07812J9398J3918M685J654l300k1360K35N177o131R284O894K0277J5985
9100B74528j4167K2992M9508J9116K7224r571p020Q749m72J9257J4946O303J2989
9087D24382K1682K4653J9015K6099J0566J677j6332k1523J2138L2841J485J84
9075E36867J2531n236m070J2675K865O221k613R171J0948J6745L147J718J3046
9062F14015J9101O921J0968J9351P043O598L4817L5552J2824j0971K2265K8236
9050H06720j268J4621J5253K7166J6982M0725K8516L7174K8906J7513L0646K0480
$$ plain form
9140 222621 223193 218048 214832 225833 221911 229434 240005 244636 240999 211286 209104 217047 204895 210533
9126 210533 208920 196585 201716 207567 231100 243997 240325 230938 237601 235015 214680 193588 207812
9113 207812 227210 241128 245813 247467 244167 222807 223042 228219 222088 231372 238266 258543 274528
9100 274528 260361 283353 332861 351977 379201 369630 362610 371359 370887 390144 405090 411393 424382
9087 424382 446064 470717 489732 515831 526397 528074 511742 490219 502357 535198 536683 536867
9075 536867 549398 544162 540092 552767 555632 561853 559240 568411 579359 596104 599251 600969 614015
9062 614015 633116 640037 651005 670356 677399 683997 718814 754366 767190 756219 778484 806720
9050 806720 805452 820073 835326 862492 879474 920199 948715 985889 1014795 1032308 1062954 1083434
9038A083434Q111K2316J7549J6648L663J6792J9069J7351J0621L2356J9338L4826
9026A302074N2361K9829K3855L5263M9269K3255L1583M4736N6843K7813J9740
9015A696621M0110K0374J9024L4489K9130K9917O9799N3954M4729P4467O1621
9004B174235N3962J4426L9991O9097O9851J01210Q4590N4507N9983Q9978Q7904
8993B899734R6748R0689P5853Q8986J31719J24753J07900J08014J29168J27273
8983C980837J54141J59365J75838J68630J63273J87423K20655K26415K40730K46713
8973E924020K78007K92361L17292L11634L17616L50209M01418M10712M22445M83076
8963I508790N04324M94199N36977O00681O63296P11960P78335Q14842Q79757R77551
$$ plain form
9038 1083434 1091545 1113861 1131410 1148058 1151721 1168513 1187582 1204933 1215554 1247910 1267248 1302074
9026 1302074 1354435 1384264 1408119 1443382 1492651 1515906 1547489 1592225 1649068 1676881 1696621
9015 1696621 1736731 1757105 1776129 1810618 1839748 1869665 1939464 1993418 2038147 2112614 2174235
9004 2174235 2228197 2242623 2282614 2351711 2421562 2522772 2607362 2661869 2721852 2811830 2899734
8993 2899734 2996482 3087171 3163024 3252010 3383729 3508482 3616382 3724396 3853564 3980837
8983 3980837 4134978 4294343 4470181 4638811 4802084 4989507 5210162 5436577 5677307 5924020
8973 5924020 6202027 6494388 6811680 7123314 7440930 7791139 8192557 8603269 9025714 9508790
8963 9508790 10013114 10507313 11044290 11644971 12308267 13020227 13798562 14613404 15493161 16470712
8953A6470712J035699J160417J264332J395373J517974J666254J830287K009487
8945B8350535K220443K446366K707736L007701L391760L790878M235543M737529
8937E4888491N317111N977364O684843P460257Q375950R394304J0512448J1752285
8929A20363053J3109120J4472064J5812895J7039894J7952057J8363096J8042858
8922B35155037J6725429J4299365J0776825O384301J526144l348044p721179j1234823
8914B62563055j3718897j5195916j5753574j5609230j4970891j4058239j2972602
8907A60283706j1803428j0685359r722117q959105q333742p764513p170003o563964
8899H9281475n939994n377727m836334m321581l938162l607264l378145l184480
$$ plain form
8953 16470712 17506411 18666828 19931160 21326533 22844507 24510761 26341048 28350535
8945 28350535 30570978 33017344 35725080 38732781 42124541 45915419 50150962 54888491
8937 54888491 60205602 66182966 72867809 80328066 88704016 98098320 108610768 120363053
8929 120363053 133472173 147944237 163757132 180797026 198749083 217112179 235155037
8922 235155037 251880466 266179831 276956656 283340957 284867101 281519057 273797878 262563055
8914 262563055 248844158 233648242 217894668 202285438 187314547 173256308 160283706
8907 160283706 148480278 137794919 128072802 119113697 110779955 103015442 95845439 89281475
8899 89281475 83341481 77963754 73127420 68805839 64867677 61260413 57882268 54697788
8891E4697788k991140k733221k495567k269533k076106j935921j798796j685337
8883C6712167j579714j479694j373122j300083j221032j131665j079718j038444
8875B6508695r58527q87651q12446p81299p51485o99745o94724o58353n89433
8866A9675032n54425n34035n21946m86094m43802m29355m39256m02891l87922
8857A5475306l76714l37728l45299l43835l26265l35244l09108k87091k84572
8848A2529450k87649k60685k64972k30534k42242k47857k29973k37611k18856
8839A0309071k01190k24767k31192k01487j94976j73540j68949j91296j96092
8830H525582j99350j72693j76313j43251j51034j63393j63984j77769j58299j45660
$$ plain form
8891 54697788 51706648 48973427 46477860 44208327 42132221 40196300 38397504 36712167
8883 36712167 35132453 33652759 32279637 30979554 29758522 28626857 27547139 26508695
8875 26508695 25550168 24662517 23850071 23068772 22317287 21617542 20922818 20264465 19675032
8866 19675032 19120607 18586572 18064626 17578532 17134730 16705375 16266119 15863228 15475306
8857 15475306 15098592 14760864 14415565 14071730 13745465 13410221 13101113 12814022 12529450
8848 12529450 12241801 11981116 11716144 11485610 11243368 10995511 10765538 10527927 10309071
8839 10309071 10107881 9883114 9651922 9450435 9255459 9081919 8912970 8721674 8525582
8830 8525582 8326232 8153539 7977226 7833975 7682941 7519548 7355564 7177795 7019496 6873836
8820F873836j46939j38205j47247j47656j08358j27810j45437j24661j13853j10749
8810E562921j28136j10537j02603j06506j18408j31659r9725j05742j02361j10691
8800D446553j06882j07162q0389o4881q3263q9823q3581q2349p3792r7198r3788
8789C483445o5210o8242r0885p5416p7714m5574n1559q1615o2552m6549n2251
8778B765878o0319o8874n9846n1950p3088p0073o4814p0284m1348k9466k6629
8767B149187m8873o2748m5149l5721l0064m6603n2386l7495m9244l3631j9797
8756A687476j5139k8234m8149m4251l0590m9628p802m834l8116l5435m0974k9350
8744A314974k6455j6099j9629k1682n768q93j6154l3380k4676J094O01j9678p204
$$ plain form
8820 6873836 6726897 6588692 6441445 6293789 6185431 6057621 5912184 5787523 5673670 5562921
8810 5562921 5434785 5324248 5221645 5115139 4996731 4865072 4765347 4659605 4557244 4446553
8800 4446553 4339671 4232509 4152120 4087239 4003976 3914153 3830572 3748223 3674431 3577233 3483445
8789 3483445 3418235 3349993 3259108 3183692 3105978 3060404 3008845 2927230 2864678 2818129 2765878
8778 2765878 2705559 2636685 2576839 2524889 2451801 2381728 2316914 2246630 2205282 2175816 2149187
8767 2149187 2100314 2037566 1992417 1956696 1926632 1880029 1827643 1790148 1740904 1707273 1687476
8756 1687476 1672337 1644103 1595954 1551703 1521113 1471485 1463683 1458849 1420733 1385298 1344324 1314974
8744 1314974 1288519 1272420 1252791 1231109 1225341 1224448 1208294 1174914 1150238 1151332 1151933 1132255 1125051
8731A125051P50j1565l3361j8810k302j3747k5620k9326j7789k1809l019o57k6134
8718I21662l2063r15N028n397l0710k6592N818N721m934l987n450j0731O30M682
8704H22762k4671j2455r482l1949j6674m903k1172k4189j9351k5742j4868O424
8692F23730n556o04L048J0093k467l9836p43j1533k7327o335O952j0226j2476
8679E26720k4294j2215k9k4534p977N651m967j1043o864N24q884l425N84r549
8665D19698j2318P480O986P879q206j4906j7258k1352m112Q582P312m305O344
8652C81824r894j7046k2100k6175j590R18k5748R202J1125J9042J0165k3081j2939
8639B93703O357N529J779M191o16o649J2564J1697N26n998q561M502N060m730
$$ plain form
8731 1125051 1125801 1114236 1080875 1062065 1059763 1046016 1020396 991070 973281 951472 948453 947796 921662
8718 921662 889599 888684 893712 888315 857605 831013 836831 842552 837618 833631 828181 817450 818080 822762
8704 822762 798091 785636 776154 744205 727531 722628 701456 677267 657916 632174 617306 623730
8692 623730 618174 617570 620618 630711 628244 588408 587665 576132 548805 542470 549422 539196 526720
8679 526720 502426 490211 490182 465648 457671 463322 458355 447312 440448 440972 432088 428663 429247 419698
8665 419698 407380 414860 421846 429725 421519 406613 389355 368003 363891 372473 379785 375480 381824
8652 381824 371930 354884 332784 306609 305019 305937 280189 289391 300516 319558 329723 306642 293703
8639 293703 300060 305589 307368 311559 310943 304294 316858 328555 329081 323083 314522 319024 324084 319354
8625C19354j46J9877o981K504k727k1290J3333R15M939l854j1841j3381m320m991
8611B91391M442p041l811J3435K744O254O862K2794n260K137j3012K131m834O947
8597C25179j044N688J1120j117P254J5136L7006L7092K1750J788L012J0488K8562
8584E01914M0921L7508K8746J2314K8319L2634m394j3931k2418k9341p1924q1897
8572D58451m5805j9183p216l288j6819k4987r284o747r485q705J1814m204J0280
8559C24822j372j2542j2307K543O831r310j2877J3880K2666K343j1783l954K4577
8546C33517M672O83J2456J2747J6594L808P515K3973J8103L5598K5517m423P136
8533D97896K7002K3365M5268N6692M2233N4191O6512M6596M8400P0742R6877Q6826
$$ plain form
8625 319354 319208 339085 332104 334608 331881 310591 323924 324839 329778 325924 314083 300702 296382 291391
8611 291391 295833 288792 284981 298416 301160 307414 314276 337070 331810 333947 320935 323066 318232 325179
8597 325179 324135 329823 340943 339826 347080 362216 399222 436314 458064 459852 462864 473352 501914
8584 501914 542835 580343 609089 621403 649722 682356 677962 664031 641613 612272 540348 458451
8572 458451 412646 393463 386247 382959 366140 341153 331869 325122 315637 306932 318746 314542 324822
8559 324822 323450 310908 298601 301144 307975 298665 285788 299668 322334 324677 312894 308940 333517
8546 333517 338189 338872 351328 364075 380669 384477 391992 415965 434068 469666 495183 490760 497896
8533 497896 524898 548263 593531 650223 692456 746647 813159 859755 908155 978897 1075774 1162600
8521A162600N9435O1281O3073M8229M6488L5637K6544J6112o500k5044n9766m9657
8509A378432n6940n1723o6943p1689o2151n4921n9818o1603n3865m9693m8545
8498G40541m3086l9530k0231l0161k3306k1156l4883l1920m6798j9351r954j0190
8486D09975N052k0632m7443k0082K327j2296j72p260J4290j7183j5475m523l348
8473B83230j3747Q45J06j8867r008Q353k0163J023j0882j0717J83j1888J640K8151
8459B28259n301n689j5709Q369P716j5914k1120l591j6162j0225J181j0193k1057
8446A20564P398J0275K321k1934m001J2356k168j4334m974J8662J1953P377m435
8433A39060k5002R124K16l162J8128N099J970r077m558j572k941l994j4187k8386
$$ plain form
8521 1162600 1222035 1283316 1346389 1394618 1441106 1476743 1503287 1519399 1512899 1487855 1428089 1378432
8509 1378432 1321492 1269769 1202826 1131137 1068986 1014065 954247 892644 838779 789086 740541
8498 740541 697455 657925 637694 607533 584227 563071 528188 496268 449470 430119 420165 409975
8486 409975 415027 394395 346952 326870 329197 316901 316729 309469 323759 306576 291101 286578 283230
8473 283230 269483 270328 270434 251567 242559 250912 230749 231772 220890 210173 210356 198468 200108 228259
8459 228259 222958 217269 201560 209929 217645 201731 180611 177020 160858 150633 151814 141621 120564
8446 120564 127962 138237 140558 118624 114623 126979 124811 110477 105503 124165 136118 143495 139060
8433 139060 114058 123182 123398 120236 138364 143463 145433 136356 131798 130226 127285 123291 109104 80718
8419H0718o685K3445N877k3943j1513N968J8577P437J2403Q917K954o472R704
8406A27387k0680k4967l375p788j7153J4434J7970K668j2360R653L006R321j4200
8393H3916k1989m348R861K991Q328R498p655r779P280j299j3439J32j140j9867
8379D2490j963N489J859O901R505j7524j2668N062K913J1141K3701O841m733Q418
8365H7432R535o845k1388O076R935k0572o636M710K017o52L312q453j6830m371
8351C7270m928J0361L266P589m865k069J5268J4689j7422j5739J8292j2519p359
8338D1834J2129n159Q468Q348k575l43j9489q557j3245K0772J7187J0091j8998
8325E0463k7695k986K1625J3831k152O948j6593k1488N272K6842K0064K334j5096
$$ plain form
8419 80718 74033 97478 103355 79412 67899 73867 92444 99881 112284 121201 124155 117683 127387
8406 127387 106707 81740 78365 70577 53424 67858 85828 88496 76136 85789 88795 98116 83916
8393 83916 61927 57579 67440 70431 78759 88257 80602 70823 78103 76804 63365 63497 62357 42490
8379 42490 40527 46016 47875 54776 64281 46757 34089 39151 42064 53205 76906 83747 79014 87432
8365 87432 96967 90122 68734 74810 84745 64173 57537 62247 64264 63612 66924 58471 41641 37270
8351 37270 32342 42703 45969 53558 48693 46624 61892 76581 59159 43420 61712 49193 41834
8338 41834 53963 48804 57272 65620 63045 62702 43213 34656 21411 42183 59370 69461 50463
8325 50463 22768 19782 41407 55238 53086 60034 43441 21953 27225 54067 74131 76465 61369
8312F1369k3618O936J9242M00j0189j3698L65O345J1439j0751K224k327J9645
8299F7382r930k0671j3104K619Q877L129j7253l349j9718K205P388P784K7424
8286D2783L4050l436j6949M052P637j8538l832Q51k955j1957J1941J7155o141
8273E4661o527q740q587n508M765o44J875j185o006r411J6723j848o652K3519
8259D6435M05J1973o840r899j1032j653J168j4907N443R441l004j2747L650N538
8245B3971j366J905j670L412m291k414K8946Q126j7852p505J0377N526k8119n24
8231A8522O587K789o301N500O11l1425j3029J1871Q893K4191L935j6368j273r572
8217D931R02J8583l485j9247K2603J485k942K0951J2731L862r098l9708q952J4076
$$ plain form
8312 61369 37751 44687 63929 64329 54140 40442 40807 47152 58591 47840 50064 47737 67382
8299 67382 57452 36781 23677 26296 35173 38302 21049 17700 -2018 187 7575 15359 42783
8286 42783 76833 73397 56448 60500 68137 49599 45767 46618 43663 31706 43647 60802 54661
8273 54661 48134 39394 30807 25299 30064 29420 31295 30110 24104 14693 31416 29568 22916 46435
8259 46435 46840 58813 51973 42074 31042 29389 30557 15650 21093 30534 27530 14783 18433 23971
8245 23971 22605 24510 22840 26252 21961 19547 48493 56619 38767 31262 41639 47165 19046 18522
8231 18522 25109 27898 21597 27097 27708 -3717 -16746 -4875 4018 28209 32144 15776 14503 4931
8217 4931 5833 24416 20931 1684 24287 25772 22830 43781 56512 60374 51276 11568 2616 16692
8203A6692J674p251j2259J4564M460j2266R674k1923p026k286j535J0203Q283
8190A004K2795J2600o009j423j9201r165J1312K2768J9104j0338k2893J0759J2228
8177D3541o885l366n250J0358R462n714j6664k6218N819K7224l055p592R047J0716
8163D1423L857k817K94j4112J916J0457J0197j4721j1967J0510N931P900j7562
8150C1306j8707R764k0743j5151J1506J1212P841j3032j1482K040R951J2632J7496
8137C4633q82L600j5121o333K5503J8258p137K418p191k7736j7973N742Q764l69
8123A6176k004J7740K5382P699j4836j0952j60O612j2811m273P085O04r020l12
8109B6930M161k361J7453J6384K701M419K373j1693m398J1693Q429K409Q754J3114
$$ plain form
8203 16692 18366 11115 -1144 13420 17880 5614 15288 -6635 -13661 -15947 -17482 -7279 1004
8190 1004 23799 36399 30390 28967 9766 601 11913 34681 53785 43447 20554 31313 43541
8177 43541 36656 33290 28040 38398 47860 42146 25482 -736 5083 32307 29252 21660 30707 41423
8163 41423 45280 42463 42757 28645 30561 41018 51215 36494 24527 35037 40968 48868 31306
8150 31306 12599 22363 1620 -13531 -2025 9187 17028 3996 -7486 -5446 4505 17137 34633
8137 34633 33751 37351 22230 15897 41400 59658 52521 54939 47748 20012 2039 7781 16545 16176
8123 16176 14172 31912 57294 64993 50157 39205 39045 45657 32846 28573 35658 36262 27242 26930
8109 26930 31091 28730 46183 62567 65268 69687 72060 60367 55969 67662 76091 78500 87254 100368
8095A00368j3012j9967j6747J1030R512n212Q203r034k8969R373J4818P839r39
8082F7263K933l719J562j3881k4024m354R087m386r691J3083J2032j416j4137
8069C0352J6503l115Q020J5735r230o392k638J3166n192J7633K2610M218P148
8056A08818o967q638R60K0252Q196n21J2408J8859j92j8578k8086L469r840p344
8042I2796M057r965q865n309N820K675j871l823q560j006L262J9836R740j215
8028I7572j7090o52J529j917P948P347K126k268q327r391j359J1867J1881j3452
8014H5814J9147J1500Q135k879j1408n090J0856J7230q037q515J6679O415K916
8001A42763k776l1735q226J7137R526p312j3135K707P89j271j1302m699L584K348
$$ plain form
8095 100368 87356 67389 50642 61672 71184 65972 74175 65141 36172 45545 60363 68202 67263
8082 67263 70196 66477 68039 54158 30134 25780 34867 30481 20790 33873 45905 44489 30352
8069 30352 46855 43740 51760 67495 58265 51873 49235 62401 57209 74842 97452 101670 108818
8056 108818 101851 93213 94173 114425 122621 122100 134508 153367 153175 134597 106511 109980 100140 92796
8042 92796 96853 86888 78023 72714 78534 81209 79338 75515 66955 65949 69211 89047 98787 97572
8028 97572 80482 79830 81359 79442 87390 94737 96863 94595 86268 76877 75518 87385 99266 85814
8014 85814 104961 116461 124596 121717 110309 105219 116075 133305 125268 116753 133432 139847 142763
8001 142763 139987 108252 100026 117163 126689 119377 106242 108949 109738 108467 97165 92466 96050 98398
7987I8398j1227N832J5231P789j0119j3845K4157j2564k5356k8107l848J4756
7975F1097J8014K57n097O802M741L664k070k0880r417n584J4662Q801J1127l140
7961H2977j3680r461m982L8j061J471P632J5792J5545l116Q326m132K1361R676
7947A26386k4607k136L244M106J5767L800q040j1009N073r272k2371k2019k230
7934E6692P664Q679K681n702j7775p049Q048k602r890j2996j7019P097K6780p640
7920C6968j1347O940o121o558J1736K1378K385j330j688J1545K596r384j7953
7907C9167J7048J6939q146p378m949j8155J4004J4255M584O87K456j0242k4011
7894C6259N890r35j7594P635J0576O233N185J6j6813l157m996j238j881l537J0148
$$ plain form
7987 98398 87171 93003 108234 116023 105904 92059 116216 103652 78296 50189 46341 61097
7975 61097 79111 79368 74271 81073 85814 89478 87408 66528 57111 51527 66189 74990 86117 82977
7961 82977 69297 59836 54854 54892 53831 55302 62934 78726 94271 91155 99481 95349 116710 126386
7947 126386 101779 99643 102887 106993 122760 126560 118520 107511 112584 103312 80941 58922 56692
7934 56692 64356 73035 75716 70014 52239 45190 53238 50636 40746 27750 10731 17828 44608 36968
7920 36968 25621 32561 26440 19882 31618 52996 55381 54051 52363 63908 66504 57120 39167
7907 39167 56215 73154 65008 57630 52681 34526 48530 62785 67369 68056 70512 60270 36259
7894 36259 42149 41214 23620 31255 41831 48064 53249 53265 36452 33295 28299 27061 25180 21643 31791
7879C1791J6459O755m139k399l1496r510M416K4117M3081J7576o630j0423r522
7866G0076j2889j2319k6637L052L0477J4159j0949l0136j4514L254O408j3422
7854F560L12J4757J1672p943M712J552O48j0978R517o318k972Q415p136k283r153
7839A1362j3291K941n718J0036N411j998q137O227J6690J920L418J0635p782J5672
7825D7386q362j1257O462L158j0642j2009k3188M556j480Q912J7408J2344j4494
7812A8794j5835q991o93J9220J8002r976j7659o226J0356R965p29J006n0j8643
7798a459Q12J912q563m213J1768J3085J5766j0804q395J0569J772q361j9111Q930
7784C708J6662j013M639O495o962k0126L273L057l796K4488Q141k1341j0133J844
$$ plain form
7879 31791 48250 55005 50866 48467 16971 7461 11877 35994 79075 96651 90021 79598 70076
7866 70076 57187 44868 18231 21283 51760 65919 54970 24834 10320 13574 19982 6560
7854 6560 6872 21629 33301 25358 30070 31622 32270 21292 30809 24491 21519 29934 22798 20515 11362
7839 11362 -1929 1012 -4706 5330 10741 8743 606 6833 23523 25443 28861 39496 31714 47386
7825 47386 39024 27767 34229 37387 26745 14736 -8452 -3896 -5376 3536 20944 33288 18794
7812 18794 2959 -6032 -6725 12495 30497 20521 2862 -3364 6992 16957 16228 17234 17184 -1459
7798 -1459 -647 1265 -7298 -11511 257 13342 29108 18304 9909 20478 22250 13889 -5222 3708
7784 3708 20370 19357 23996 30491 23529 3403 6676 9733 5937 30425 38566 17225 7092 8936
7770H936K7018o272j453J7833N480k924k867k4919p168k191J0172p043L389J9875
7756C7866K581m587k462P233K294r477J2215j8535M805J3295n85p746q60q986
7742B7051p898j2391n667o621r522O198N632O479N156Q876J8954o414l2812p735
7728a0714O562K1039K0914M574P981l4745j4112J2934j167K8083P792j5615L118
7715C6644r352N170J225p822j0864r866J4165J6219L558n255j7823j1693Q55o675
7701a514k4446j4277l635K8571n714o232o954O467P770J5758N3O742l64K61l504
7686a018m915K951J8964m429N077J1175k0256k1483j0767L342J1378L9415K4305
7673E3739k159j3465j0745p889M51O963j0222j7185j0746M070n454O357j978J4527
$$ plain form
7770 8936 35954 29682 28229 46062 51542 48618 45751 20832 13664 11473 21645 14602 17991 37866
7756 37866 40447 35860 33398 40631 42925 33448 45663 27128 31933 45228 44643 36897 36037 27051
7742 27051 19153 6762 1095 -5526 -15048 -8850 -3218 3261 8417 17293 36247 29833 -2979 -10714
7728 -10714 -4152 16887 37801 42375 50356 15611 1499 14433 13266 41349 49141 33526 36644
7715 36644 27292 32462 33687 25865 15001 5135 19300 35519 39077 33822 15999 4306 5161 -1514
7701 -1514 -25960 -40237 -43872 -15301 -21015 -27247 -34201 -27734 -19964 -4206 -4153 2589 2225 2486 -1018
7686 -1018 -5933 -2982 15982 11553 16630 27805 7549 -13934 -24701 -21359 -9981 29434 53739
7673 53739 51580 38115 27370 19481 19932 26895 16673 -512 -11258 -7188 -12642 -6285 -8263 6264
7659F264n215r899J5160Q057k2794o02J9452J1125l219J0729j317j4436j1453
7646A852r78J314j1864j0553j4799K3708J8147K266Q316J081P805N525k2933p101
7632A786j4516m268Q467M06K3819R91j7474r827j6501l778M862Q555J0745k7088
7618c3821j5827J1673J6533M12p311J6392J9834J6023o533j1658O909Q747N855
7605B7228r112O787Q206j1260j3183j2522q892j00K858Q183L0402j6668j5272
7592c345k46P19J1252K940L157j1740j304R834P339K981j9510k9479p879J8501
7578a6780M290q391R97J3923r365n252J9513k102q553M606O839l031j3970P334
7564i942O609j4661J3140J9738o992j6570O706R817p537j2319j400J402J3212
$$ plain form
7659 6264 1049 -8850 6310 14367 -8427 -9029 10423 21548 18329 29058 27741 13305 1852
7646 1852 874 2188 -9676 -20229 -35028 -11320 6827 9093 17409 18490 26295 31820 8887 1786
7632 1786 -12730 -16998 -8531 -8125 15694 16685 -789 -10616 -27117 -30895 -26033 -17478 -6733 -33821
7618 -33821 -49648 -37975 -21442 -21030 -28341 -11949 7885 23908 17375 5717 12626 21373 27228
7605 27228 18116 24903 33109 21849 8666 -3856 -12748 -12848 -9990 -1807 28595 11927 -3345
7592 -3345 -3591 -2872 8380 11320 14477 2737 1433 11267 18606 21587 2077 -27402 -35281 -16780
7578 -16780 -12490 -20881 -19884 -5961 -15326 -20578 -1065 -3167 -11720 -7114 -275 -3306 -17276 -9942
7564 -9942 -3333 -17994 -4854 14884 7892 -8678 -1972 7845 308 -12011 -13411 -12009 1203
7551A203k091j7156j781J3849l151L018N328M962R009o414K537j1649j6577J4407
7537d506p729j7389K846O403J2069J042m771K3736L6706K914k1909k5633q190
7524d411J8998o250l8793M436K6297k004M683j601J7378J2788M61m818p059N155
7510B5260L943j6959j3839p031Q568J6498M811P808j6543j7869R589l615l2981
7497c2360j7974p055M068K8657J9426j0183j7212m656K9831P017P080N356j4396
7484b401j8565Q727J3295n550o595L886J8531m022j0878m131M25j0792L427Q127
7470f516L84k81K31K3303K2919m78k9199o964K2795M062L603K915l19k726R722
7455D3451k141k2537m112p179J239m460R301P362N024j6896j0301j3719K2675
$$ plain form
7551 1203 -888 -18044 -19825 -5976 -9127 -6109 -781 4181 13190 6776 9313 -2336 -18913 -4506
7537 -4506 -12235 -29624 -26778 -20375 -8306 -7264 -12035 11701 48407 51321 29412 3779 -4411
7524 -4411 14587 8337 -30456 -26020 277 -1727 2956 1355 18733 31521 31982 27164 20105 25260
7510 25260 29203 12244 -1595 -8626 -58 16440 21251 29059 12516 -5353 4236 621 -32360
7497 -32360 -50334 -57389 -53321 -24664 -5238 -15421 -32633 -37289 -7458 -441 6639 11995 -2401
7484 -2401 -20966 -12239 1056 -4494 -11089 -7203 11328 7306 -3572 -7703 -7278 -18070 -14643 -6516
7470 -6516 -6132 -6413 -6182 17121 40040 39562 10363 3399 26194 30256 33859 36774 36455 33729 43451
7455 43451 41310 18773 14661 7482 8721 4261 13562 20924 25948 9052 -1249 -14968 7707
7442G707K5351q652q21q633j1895J3785J3787j5599q168P532K5396k3672l021
7429A3097r477q985o360j533N630m563J4780P70m953j3496j9391J3197J4646K4484
7415A7846R124j3224N902J5935l130l062q653Q444q815j4196J6352j055k9376
7402g908N840q399r236K0120Q856j944k1393r929K3250J7763J99k6699j7303j846
7388b8629J4415N826R052o573k4524j8897J9428J9955P858j370o435r01J980J2396
7374C581N869j090N121k276j0480n659Q813K838K0066J3903o003o362q593j1789
7360G939j4438j6078j473J2198J0387r308K3251J1898J1637j3106l0028Q95J7515
7347A1289O679Q612M987l294j3668j8452R515R816M895j4986j9763j0398K429
$$ plain form
7442 7707 33058 24406 23585 14952 3057 16842 30629 15030 6862 14394 39790 16118 13097
7429 13097 3620 -5365 -11725 -13258 -7628 -12191 2589 3359 -1594 -15090 -34481 -21284 -6638 17846
7415 17846 26970 13746 19648 35583 32453 29391 20738 29182 20367 6171 22523 21468 -7908
7402 -7908 -2068 -10467 -19703 417 9273 7329 -14064 -23993 -743 17020 17219 -9480 -26783 -28629
7388 -28629 -14214 -8388 664 -5909 -30433 -49330 -29902 -9947 -2089 -3459 -9894 -10795 -8815 3581
7374 3581 9450 8360 13481 11205 725 -4934 3879 6717 26783 40686 34683 28321 19728 7939
7360 7939 -6499 -22577 -24050 -11852 -1465 -10773 12478 24376 36013 22907 -7121 -6226 11289
7347 11289 17968 26580 31567 28273 14605 -3847 5668 15484 20379 5393 -14370 -24768 -22339
7334b2339J6666N179q388m956K671N834K564M534J4926Q405Q868k4380j6681j7012
7320b4109O89K8852j768O78q79J3840R629j0757l519k1840j5431P64J9424J8465
7306A4038J4157q256j8625o581L1178Q711j3208j5495k5071L42J1841j6690j5160
7293c8819M697K6232J5395j0846L317K821P926j1525k026K6751J51k0110n372
7280a408k449J6867J9715r367j6337j9721j8264J0602J7912J3519K55q426N854
7267H752k747p217l135O214k0098R28J7406P766j917q15k111r935J0222m21k2527
7252a9635p177M818k514K1622L342j6919n644n612j1940J5765k436q782K7117
7239g995J481K676J370k908K607P347o817j9452j5876M500l71L095J0837j7159
$$ plain form
7334 -22339 -5673 -494 -8882 -13838 -11167 -5333 -2769 1765 16691 25096 33964 9584 -7097 -24109
7320 -24109 -23420 5432 3664 4342 3463 17303 26932 16175 12656 -9184 -24615 -23851 -4427 14038
7306 14038 28195 19939 1314 -5267 25911 34622 21414 5919 -19152 -18810 -6969 -23659 -38819
7293 -38819 -34122 -7890 7505 -3341 -24 2797 10723 -802 -2828 23923 24074 3964 -1408
7280 -1408 -3857 13010 32725 23358 7021 -12700 -30964 -20362 -2450 11069 11324 2898 8752
7267 8752 6005 -1212 -4347 1867 -18231 -17303 103 7869 5952 5137 3026 -6909 3313 2892 -19635
7252 -19635 -26812 -21994 -24508 -2886 456 -16463 -22107 -27719 -39659 -23894 -26330 -35112 -7995
7239 -7995 -6514 -3838 -2468 -5376 -2769 4578 -2239 -21691 -37567 -33067 -33438 -30343 -19506 -36665
7225c6665j7639R522J3879o742Q899Q108K621J5753j0859k6052K1756K5782r267
7212i04j0623O285l62P071J2716L278n006r183n274r535M251J3495j8309p993
7198b0093m38R230K529n590m912Q306J4333K365R358o096p093N12J907j8583q210
7183b2475Q598Q96J2332j1395J3229K887K75K0753q394j1330m912n430j1008P141
7169h833O108Q706Q045r30J135p985J277J465j843J2319O969j2830k6055k501
7155a4953M527L799O100M798O704j1994r59r005j57J6360Q85j0600M359R879O432
7140A6175j0404p143J696m362J3724p1N690K837K062j83o550M816J3145q848k8107
7125e523j6231J4547J3943L208k092K584q738k549r372j7774r799J7653K0083
$$ plain form
7225 -36665 -54304 -44782 -30903 -37645 -28746 -20638 -18017 -2264 -13123 -39175 -17419 8363 -904
7212 -904 -11527 -5242 -5604 1467 14183 17461 12455 3272 -2002 -11537 -7286 6209 -12100 -20093
7198 -20093 -20531 -11301 -8772 -14362 -19274 -10968 3365 5730 15088 8992 1899 2411 4318 -14265 -22475
7183 -22475 -13877 -12981 -649 -12044 1185 4072 4347 25100 16706 5376 464 -4966 -15974 -8833
7169 -8833 -2725 5981 14026 13096 14231 6246 7523 8988 7145 19464 26433 13603 -12452 -14953
7155 -14953 -10426 -6627 -527 4271 10975 -1019 -1978 -10983 -11140 5220 6105 -4495 -136 9743 16175
7140 16175 5771 -1372 324 -4038 9686 9615 15305 18142 20204 20021 13471 18287 31432 22584 -5523
7125 -5523 -21754 -7207 6736 9944 7852 10436 1698 -851 -10223 -27997 -37796 -20143 -60
7112f0j236J8076N340j0135q757l523j6293J5546Q975j0778n726q57J0121L424
7098D117K3022j3419l2628r574K1907k063q855j5201o292N279K7458J3748k4607
7085a7108k610Q167J2462N492P023j471k1521l203M24N746l977J0895J3409j1849
7071A879p100j0882O001R334n912j034N962J2098K8689n799j8872o542Q762J0708
7057B7292Q76m091J513j933N201K171j3198r136m016J7618p338j2324p450n510
7043a0325j6371J691Q575J8062K6682l299j2162j9346k0547K50R159K4378m361
7030B386O453O80j3248k3642L089J6500L018j1405N073L893J3153r389n117M896
7016c660J7804J599q716M560k173l925j2757j4373R243L892L485L887j524l932
$$ plain form
7112 -60 -1296 16780 22120 11985 3228 -295 -16588 -1042 7933 -2845 -8571 -9428 693 4117
7098 4117 27139 13720 -18908 -28482 -6575 -8638 -17493 -32694 -38986 -33707 -6249 7499 -17108
7085 -17108 -19718 -11551 911 6403 13426 11955 -9566 -12769 -12345 -6599 -10576 319 13728 1879
7071 1879 -5221 -16103 -10102 -768 -6680 -7714 -1752 10346 39035 33236 14364 7822 16584 27292
7057 27292 28168 24077 25590 23657 28858 31029 17831 8695 4679 22297 14959 2635 -4815 -10325
7043 -10325 -26696 -25005 -16430 1632 28314 25015 12853 -6493 -27040 -26790 -17631 6747 2386
7030 2386 8839 9519 -3729 -27371 -24282 -7782 -4764 -16169 -11096 -7203 5950 -3439 -8556 -3660
7016 -3660 14144 15743 7027 11587 9414 5489 -7268 -21641 -12398 -8506 -5021 -1134 -2658 -6590
7002f590L233K1820J5146J0160J5526p618l7597l984j2194j1120K024Q273Q012
6989E091q864J1730j290r633j9589k0289P049K1953O516J4153J9351n724j50J151
6975B1455j3175j559J2636m521j5960j208l511j1260p074L369O663Q604l510J3324
6961D273K2424j3665k7286p213q358j305J8243P155J3177k295p734o932q623J6462
6947a677J9697O523L627j5843k0098j2324L72J4153N738j1727r468Q084P186j5364
6933b1121p852K8730K2959q787j0800p25j638N874l49o211o971l282j341j2748
6919b4262j1095J1681K6952L2844k3995k8786O781J0984o495M161n496O013j7692
6906a8405m198R243K4525J4712r24r404j133m732o533J198J0884J76K966o817
$$ plain form
7002 -6590 -3357 18463 33609 43769 59295 51677 14080 10096 -2098 -13218 -11194 -2921 5091
6989 5091 -3773 7957 6667 -2966 -22555 -42844 -35795 -13842 -7326 6827 26178 20454 20304 21455
6975 21455 8280 6721 19357 14836 -1124 -2332 -5843 -17103 -24177 -20808 -14145 -5541 -9051 4273
6961 4273 26697 13032 -14254 -21467 -29825 -31130 -12887 -5732 7445 5150 -2584 -9516 -18139 -1677
6947 -1677 18020 24543 28170 12327 -7771 -20095 -19723 -5570 168 -11559 -21027 -12943 -5757 -21121
6933 -21121 -28973 -243 22716 13929 3129 2404 766 6640 6291 80 -6891 -10173 -11514 -24262
6919 -24262 -35357 -23676 3276 36120 12125 -16661 -9880 1104 -5391 -1230 -6726 -713 -18405
6906 -18405 -22603 -13360 11165 25877 24953 15549 14416 9684 3151 4349 15233 15409 18375 11558
6892A1558k827N487j1229p475k8707J463J1203K483O795J5203P632n448Q275q84
6878A3529N896j9012j8222J091J5076O700K944J796r751N986J1958K138r909j1772
6864a552j372m543j3834J83R768n126m250J5361J3813Q054q505j0355R197M042
6850A0881j4491k0231N612J2281K1495L429P268J5024l376j413m505k385j6566
6837A3023L552m971r469m003j2223j0248k333J3017j8556K787J0191o963L980
6824b2216k296J0276o818j0044J0835K2932m597k8398j869J4687J6567p505L993
6811d453Q571j4971q058J6757M878J682l535p50J459o579K950o390L140j6244
6797b1543l098J3324M515k1870J2330K1213J2544j5812k2633o572J7527J8112
$$ plain form
6892 11558 8731 14218 2989 -4486 -33193 -31730 -20527 -18044 -11249 3954 11586 6138 14413 13529
6878 13529 19425 413 -17809 -16718 -1642 5058 8002 9798 47 6033 17991 20129 10220 -1552
6864 -1552 -2924 -7467 -21301 -21118 -11350 -16476 -20726 -5365 8448 16502 7997 -2358 6839 10881
6850 10881 -3610 -23841 -18229 -5948 15547 18976 26244 41268 37892 36479 31974 29589 13023
6837 13023 16575 11604 2135 -1868 -14091 -24339 -26672 -13655 -32211 -29424 -19233 -26196 -22216
6824 -22216 -24512 -14236 -21054 -31098 -20263 2669 -1928 -30326 -32195 -17508 -941 -8446 -4453
6811 -4453 4118 -10853 -18911 -2154 2724 4406 871 121 1580 -4999 -2049 -8439 -5299 -21543
6797 -21543 -24641 -11317 -6802 -28672 -16342 4871 17415 1603 -21030 -27602 -10075 8037
6785H037k271n644J7005M122k0583m515J2926L441j5543L931O491n594r017j7592
6771b4806j175J7730m557J808q194J567J1456k313Q806j245n069l891l528L482
6757i929K964J0443N596J5415K2434q83k127j3794r507j902K0202m162p169j069
6743B6512J84J6569N584K838j1307o603K0116K0592L0648L3145J4254k709M762
6730A54585O458j8303k3282k7814o469J1776J6159j5445J530J4073J6924J3409
6718A43601K7700N4206P6020R2646J24496J72762K35411L22724M46562N36716
6708B232844M98405J99434k23950n54428o07736m72363l04398j95905j28561q0610
6698C62732o9639n2866m4167l2859k3710j5528j9653j3463p155O520o607o04K7047
$$ plain form
6785 8037 5766 122 17127 21249 666 -3849 9077 12518 -3025 906 7397 1803 -7214 -24806
6771 -24806 -25981 -8251 -12808 -11000 -19194 -17627 -6171 -8484 322 -923 -5992 -9883 -13411 -9929
6757 -9929 -6965 3478 9074 24489 46923 46040 43913 30119 20612 18710 38912 34750 27581 26512
6743 26512 26696 43265 48849 51687 40380 33777 53893 74485 105133 138278 152532 149823 154585
6730 154585 161043 142740 119458 91644 85175 96951 113110 97665 99195 113268 130192 143601
6718 143601 171301 225507 301527 394173 518669 691431 926842 1249566 1696128 2232844
6708 2232844 2731249 2930683 2706733 2152305 1544569 1072206 767808 571903 443342 362732
6698 362732 293093 240227 196060 163201 139491 123963 104310 90847 83692 90212 83605 83001 110048
6685A10048K3223k709n555L752k2201l6227l1421j4539j590J2815j3160j3832
6673H604K1665K5932J01K414K4343o620M64j5930l4618q077q629j3836q816Q517
6659d486J7968J4365K675j5436j5514j196M116j316o324N845j5108j2755O673
6646b0493Q280J0407n177n314J6419j1307K598J6351J02k4209J4927o63j412Q409
6632H918k103k249p135j5343l000m357r302R328K4082j1120k2594J0546O584K730
6618a5015N876M202j0201N410M1849L317j1389j0413o289j792L062Q645j1222
6605F040j8845j8118n147J3414J1856o244R28N201M358R113J0570J2546k5733
6592f1L375P842R512j3673j9519j6444l924J3207J2941l624J169O395m730M750
$$ plain form
6685 110048 133271 130562 125007 128759 106558 70331 38910 24371 22781 35596 22436 8604
6673 8604 30269 56201 56302 58716 83059 76439 76903 60973 26355 18278 9649 -4187 -13003 -4486
6659 -4486 13482 27847 30522 15086 -428 -1624 2492 1176 -5148 697 -14411 -27166 -20493
6646 -20493 -12213 -1806 -6983 -12297 4122 -7185 -4587 11764 11866 -12343 2584 1921 509 8918
6632 8918 6815 4566 -2569 -17912 -20912 -25269 -34571 -25243 -1161 -12281 -34875 -24329 -17745 -15015
6618 -15015 -9139 -4937 -15138 -9728 32121 35438 24049 13636 7347 5555 8617 17262 6040
6605 6040 -12805 -30923 -36070 -22656 -10800 -17044 -16116 -10915 -6557 2556 13126 25672 -61
6592 -61 3314 11156 20668 6995 -12524 -28968 -32892 -19685 -6744 -10368 -9199 -2804 -7534 -2784
6578b784j087J6364J2496j6819j3428j0853J5364M564J933Q564J7528o287k7045
6565a490j7534k1491j2034m354J4381J9736J3342Q851n884R84j3098p177N470
6552b0298J0492l52j3592M231J1768o173K3170P558O111j3439k6782j9290J1709
6539b4887K3635J825J5047J9998K333P48k4670j9528j6021q102j4614j1014J6525
6526c8725L1733Q153o558k1394J1067J6456N976P134J2180O48q971k6264j5942
6513b4507o14R337M443O675J3734R391r437j0155J1251P045J416j2716j300P755
6499A2318Q430J7187j0695k8786j9779o678n933J2636J7278K2714J2007j6037
6487A4662k0028q870j3674o887N179J2269q926k4065K1413K2199l065P531M242
$$ plain form
6578 -2784 -3871 12493 24989 8170 -5258 -16111 -747 3817 5750 14314 31842 25555 -1490
6565 -1490 -19024 -40515 -52549 -56903 -42522 -22786 -9444 -593 -6477 -5493 -18591 -25768 -20298
6552 -20298 -9806 -10158 -23750 -19519 -7751 -13924 9246 16804 22915 9476 -17306 -36596 -24887
6539 -24887 -1252 573 15620 35618 37951 38699 14029 -5499 -21520 -29622 -44236 -55250 -38725
6526 -38725 -6992 1161 -5397 -26791 -15724 732 6708 13842 26022 26670 17699 -8565 -24507
6513 -24507 -25121 -15784 -11341 -4666 9068 18459 9022 -1133 10118 17163 18579 5863 4563 12318
6499 12318 20748 37935 27240 -1546 -21325 -28003 -33936 -21300 -4022 18692 30699 14662
6487 14662 -5366 -14236 -27910 -34797 -29618 -17349 -26275 -50340 -28927 -6728 -9793 -2262 1980
6474A980J0202Q974J8803Q191j9467p952l1780j1586N812P351j1343K87O261J044
6460a3223R109K609J2935j1724j3604l017J343j60L294Q316L353j309J642P264
6446F828o567j5393j3043M578J4055K2149m476j6100j3673J6893K6774J0455k133
6433C0347o96J734k2356R519j5181p050K7127O088j0082j0432k8470M238J1453
6420c761J4482r484l592J7404j3691J5095J646Q094l626j9108J295r83r311L91
6406e149P890N26K141M554o540J441p248k686j3017J1548N258o793j2962m832
6392b5869J9070O362j118j899l494l540J5087p483l703l698j3555j739K5966O890
6378G277J2159K6780r97j2243j5160k0017J5385J7751j1413j5655j7456j5888
$$ plain form
6474 1980 12182 21156 39959 48150 28683 20731 -11049 -22635 -16823 -9472 -20815 -20528 -14267 -13223
6460 -13223 -4114 -1505 11430 -294 -13898 -16915 -15572 -15732 -12438 -4122 -769 -2078 -436 6828
6446 6828 261 -15132 -28175 -23597 -9542 12607 8131 -7969 -21642 -4749 22025 32480 30347
6433 30347 29651 31385 9029 18548 3367 -3683 23444 29532 19450 9018 -19452 -15214 -3761
6420 -3761 10721 1237 -2355 15049 1358 16453 18099 26193 22567 3459 4754 3771 -5540 -5149
6406 -5149 2741 3267 5408 9962 3422 4863 -2385 -5071 -18088 -6540 -1282 -8075 -21037 -25869
6392 -25869 -6799 -437 -1555 -3454 -6948 -10488 4599 -2884 -6587 -10285 -23840 -25579 387 7277
6378 7277 19436 46216 45219 32976 17816 -2201 13184 30935 19522 3867 -13589 -29477
6366b9477J2133Q869P524j6469o28K442j3886j4325L161K2955L1861j351j0481
6353B328M90p89J8661L444q254p018j8218j446j2541j236J693J4988J6787J9474
6339B8363p168j3768m381m26p436K33j0347k315o62k0686j3192N2100K1215O055
6325B7585M695O082j7592j2777l652j953J353r337l729J6272K0047j2878n354
6312H762j3054l8996K207J9892J5479J0228J2649L368q093k275k827r590r676
6299a1926o218Q335m389N75N069J652M556M273j4971K677L741j6930k841K3117
6285c280r656P728j547r13J680J0012K0367j1599k409k0617k7794J4755K2418
6272h55m731m228R836K3060K303k8247N350Q614j0590n43N960n28P76K07n987
$$ plain form
6366 -29477 -17344 -8475 -951 -17420 -18048 -15606 -29492 -43817 -40656 -17701 14160 12809 2328
6353 2328 2818 2029 20690 24134 15880 8862 -9356 -10802 -23343 -24579 -22886 -7898 8889 28363
6339 28363 21195 7427 3046 2620 -4816 -4583 -14930 -17245 -17907 -38593 -51785 315 21530 27585
6325 27585 32280 38362 20770 7993 4341 2388 3741 -5596 -9325 6947 26994 14116 8762
6312 8762 -4292 -43288 -41081 -21189 -5710 4518 17167 20535 12442 10167 7340 -2250 -11926
6299 -11926 -18144 -9809 -14198 -13623 -8554 -6902 -2346 1927 -13044 -10367 -6626 -23556 -26397 -3280
6285 -3280 -12936 -5208 -6755 -7668 -5988 4024 24391 12792 10383 -10234 -38028 -23273 -855
6272 -855 -5586 -9814 22 23082 25385 -2862 2488 11102 512 -31 5929 5401 6177 6384 397
6257C97P212m289j3221L175q16O46J936j8130J5621J4465K411j009k1472R55Q842
6242c277L217J6439p721q34L201j1041n251l955k439o768j0283L235N693l837
6228b3621L564J6899L844j0712m121N353k226O738n74k9606r479n101Q152J5540
6214b5350R396J2044j0153j536L146j1214k614N784k4674J229J3157J3138M684
6201a2963J6999j1493m182J552l724j051j21O698J4303j4222j5313K880J3469
6188g168O957N09P934L900j6757j5673J7522K263M75j0526j8449j2028K694K4174
6174a4173J0309J5922j6157j6191N39l030L500J0966K0974J9869J4771o352l6379
6161D568j5798J46P495L752m929J008l058O528J6801r01j7221j1873MK9150l99
$$ plain form
6257 397 7609 3320 -9901 -6726 -7542 -6896 -4960 -23090 -7469 6996 9407 8398 -13074 -12119 -3277
6242 -3277 -60 16379 8658 7824 11025 -16 -5267 -9222 -11661 -18429 -28712 -25477 -19784 -23621
6228 -23621 -20057 -3158 686 -10026 -14147 -8794 -11020 -4282 -4856 -34462 -43941 -49042 -40890 -25350
6214 -25350 -15954 -3910 -14063 -15599 -12453 -23667 -26281 -20497 -45171 -43942 -30785 -17647 -12963
6201 -12963 4036 -7457 -11639 -10087 -13811 -14862 -14983 -8285 6018 -8204 -23517 -20637 -7168
6188 -7168 -211 298 8232 12132 -4625 -20298 -2776 -513 -38 -10564 -29013 -41041 -38347 -14173
6174 -14173 -3864 12058 -4099 -20290 -19751 -22781 -19281 -8315 12659 32528 47299 40947 4568
6161 4568 -11230 -11084 -3589 163 -4766 -3758 -6816 -288 16513 15612 -1609 -13482 -13478 15672 15273
6146A5273r655K216P369k1580l165O504r627j3336J3092J4013R079j0632j995
6133b444K2682M889P214N107N228J3143Q593j0676j2088n773J806l656k7038n905
6119A082J726m455n487N472O338k99K034n040j0540q442l561l80K103J713J4636
6104c100K6193J4496j0220k2529k5774o827J2936J5587R13j2638j5630r445j0991
6091d7029J3969K198N140L683p083j994M190M158L90k193K5334Q897j5717k3559
6077b9616j9207K3812J5670J5164P055K24l0305j5988M956j3104J3097R306M177
6064a4759m690j11p560L511J0508Q058J0932k124J415k412Q901n249k1895m302
6050a9777M147K0655J4638k3864j4365j3463N531J6024n928M723R298n428q370
$$ plain form
6146 15273 5618 7834 15203 -6377 -9542 -3038 -12665 -26001 -12909 1104 10183 -449 -2444
6133 -2444 20238 25127 32341 37448 42676 55819 64412 53736 41648 35875 37681 34025 6987 1082
6119 1082 2808 -1647 -7134 -1662 4676 4377 6411 1371 -9169 -17611 -21172 -21552 -19449 -17736 -3100
6104 -3100 23093 37589 27369 4840 -20934 -27761 -14825 762 1675 -10963 -26593 -36038 -47029
6091 -47029 -33060 -30862 -25722 -22039 -29122 -31116 -26926 -22768 -22378 -24571 763 9660 -6057 -29616
6077 -29616 -48823 -25011 -9341 5823 12878 13102 -17203 -33191 -28235 -41339 -28242 -18936 -14759
6064 -14759 -19449 -19560 -27120 -23609 -13101 -5043 5889 3765 5180 2768 11669 6420 -15475 -19777
6050 -19777 -15630 5025 19663 -4201 -18566 -32029 -26498 -10474 -16402 -11679 -2381 -7809 -16179
6037a6179J2220J925Q890J3687l327p247q159R703m335L57J2572J3397m482j4093
6023A4929j420p081J883K423K913n277m085L208o668N084J7747k9870j2882J2675
6009f421O331K3019P243n800q16L158K73m919j9283k4439p196K227j4177k649
5995d3449K0480O481O382o516k3718n237L982N910J4591q407o634q88j1912K4530
5981b4405j3712O970J5800p838j0584n601j0059J4666K4904M510j5130R038J4258
5968B817j1557m311J8937K087j7192J7241J1487l572P80m584k9768r338J7745
5955i228P724p363k797j7725j615k334N3l612J2776M737L222q971j7731N803O229
5940c0832j4225J0669J1386k415K0788m360N455R797P850k1898l0499r762P909
$$ plain form
6037 -16179 -3959 -2034 6856 20543 17216 9969 1810 11513 7178 7535 20107 33504 29022 14929
6023 14929 13509 6428 8311 10734 13647 8370 4285 7493 825 5909 23656 -6214 -19096 -6421
6009 -6421 -90 22929 30172 24372 23556 26714 26987 22068 2785 -21654 -28850 -26623 -40800 -43449
5995 -43449 -22969 -16488 -10106 -16622 -40340 -45577 -41595 -35685 -21094 -29501 -36135 -37023 -48935 -24405
5981 -24405 -38117 -31147 -15347 -23185 -33769 -39370 -49429 -34763 -9859 -5349 -20479 -11441 2817
5968 2817 -8740 -13051 5886 7973 -9219 8022 19509 15937 16717 12133 -17635 -26973 -9228
5955 -9228 -1504 -8867 -11664 -29389 -31004 -33338 -33285 -36897 -24121 -19384 -16162 -25133 -42864 -37061 -30832
5940 -30832 -45057 -34388 -23002 -25417 -4629 -8989 -3534 6263 14113 -7785 -38284 -48046 -40137
5927d0137K2150P887J9673m712M103K483n252l309M931Q609m459j4092K992K7065
5913B7932j707k9186r096r02O195r349k226J6285O203m0o229j5389j938K807L410
5898a3230R172J8144J1924M508j365l7955j3887p06m509p730J813K6920N874J683
5884F56m089m884J4037L306J1184j0468m477M480l862O674M360n032k0542J1511
5870B854Q629Q395j0069j756j393k921J4246K284K186l716M67j3973j9160l888
5856a7815N202N424q878j952K943P086p418J922l860K2241J1412n740k302K867
5842A1132j1055L646q167o961J1325n6j177R010J0917j850j0436r302j1251j1454
5828b5679m853K0177n892j2533L773J3700J2322q759p880J9419J2218j5392O15
$$ plain form
5927 -40137 -17987 -10100 9573 4861 8964 11447 6195 2886 7817 16426 11967 -2125 867 27932
5913 27932 26225 -2961 -12057 -12959 -6764 -16113 -18339 -2054 4149 4109 -2120 -17509 -19447 -16640 -13230
5898 -13230 -4058 14086 26010 30518 29153 -8802 -22689 -23395 -27904 -35634 -33821 -6901 -1027 656
5884 656 -3433 -8317 5720 9026 20210 9742 5265 9745 5883 12557 16917 11885 -8657 2854
5870 2854 11483 19878 9809 8053 6660 3739 17985 20269 22455 18739 19206 5233 -13927 -17815
5856 -17815 -12613 -7189 -16067 -18019 -15076 -7990 -15408 -13486 -17346 4895 16307 10567 8265 11132
5842 11132 77 3723 -4444 -11405 -80 -136 -1313 7697 18614 16764 6328 -2974 -14225 -25679
5828 -25679 -30532 -10355 -16247 -28780 -25007 -11307 1015 -7744 -15624 3795 16013 621 1236
5815A236J2735K611N12J794J0116n928p876J29M311q117J8975l274k1829j900
5801C495m203J922J7322L067j1852q385m198j3768n927J7603J5227Q355j518O381
5787B3521O078j8602m992L891Q57J5962j2719j6414l903o59j133O666j449n421
5773h317j0513k385J7921J9291j3847j3026o863N919N417J4295l2628k10J0201
5760a4745l449M055j7463n459j3913P081J7387J9152j4672m698m828N125J7176
5747i251N606M077J4901L196j0262j8477j8186r737K246M706J0440j152j5165
5734c7058l030J4681J1067J4157R270M20K234k2392N861o402n031R345j266k497
5720a0641O213J6667o629k856J3249M797O263j6957j5345K3284J6571k9179M369
$$ plain form
5815 1236 13971 16582 17094 18888 29004 23076 15200 15329 19640 11523 30498 27224 5395 3495
5801 3495 -708 1214 18536 21603 9751 1366 -2832 -16600 -22527 -4924 10303 18658 17140 23521
5787 23521 29599 10997 6005 9896 10753 26715 13996 -2418 -6321 -6980 -8113 -1447 -2896 -8317
5773 -8317 -18830 -21215 -3294 15997 2150 -10876 -17739 -11820 -6403 7892 -24736 -24946 -14745
5760 -14745 -18194 -14139 -31602 -37061 -50974 -43893 -26506 -7354 -22026 -26724 -31552 -26427 -9251
5747 -9251 -3645 432 15333 18529 8267 -10210 -28396 -38133 -35887 -31181 -20741 -21893 -37058
5734 -37058 -40088 -25407 -14340 -183 9087 9507 11741 -10651 -4790 -11192 -16223 -6878 -8144 -10641
5720 -10641 -4428 12239 5610 2754 16003 20800 27063 10106 -5239 18045 34616 5437 9806
5707I806O648j3603L62Q638j3491k1357k0250K5J5826J5641m538J2687J1916J2107
5693B0417J9170J813k0617j3876j8728j5983J2327L961j2216j3751P78K0943K4667
5680H905j8369n583L459j235M022K1341p982j6765R175J6683J0196o713j531k9213
5666a3610j3874K5878j932j2907J041o347j276k525j470L991J0215J1827j131
5653b120r353j1334J2226R231j2560p562l071j8565J145J2916K8983N225q176
5640c015q208J809N383J8333Q910k1233l558m96j8500J3272j96K301J2292n931
5626A163q689p528P376J4682l438J5455J653j1296l88k0575j3904m656P046R201
5612a3898Q946L593n678J8925n851k1804k0973J1710J5242J8438J4359K113n106
$$ plain form
5707 9806 16454 2851 3213 11851 -1640 -22997 -43247 -43222 -27396 -11755 -16293 -3606 8310 20417
5693 20417 39587 41400 20783 6907 -11821 -27804 -15477 -11516 -23732 -37483 -36705 -15762 8905
5680 8905 -9464 -15047 -11588 -12823 -8801 12540 4558 -12207 -3032 13651 23847 17134 15603 -13610
5666 -13610 -27484 -1606 -3538 -16445 -15404 -21751 -23027 -25552 -27022 -23031 -12816 -989 -2120
5653 -2120 -11473 -22807 -10581 -1350 -13910 -21472 -24543 -43108 -41963 -29047 -64 5161 -3015
5640 -3015 -11223 -9414 -4031 14302 23212 1979 -1579 -2075 -20575 -7303 -7499 -5198 7094 1163
5626 1163 -7526 -15054 -7678 7004 3566 19021 20674 9378 8990 -11585 -25489 -30145 -23099 -13898
5612 -13898 -4952 -1359 -7037 11888 6037 -15767 -36740 -25030 -9788 8650 23009 25122 20016
5599B0016k9884r493P762L231j2906L648K7303P094R872k190j3126K253J21q693
5585E008j0393k0538N876J2518J104K5083r817l336l813p073k2181J6634J0185
5572g43q799j6004k771o235N716J799j0210k970J3322j4397J8286K1153N844n503
5558a512m098J4357Q384j0826k0027q319J8889K9490J749L982m782n341r890p658
5544D398j4514j3129Q5j286q565Q688J8090L536P266O273j1558j5985j891J7085
5530a507N027M973J0073J7690j6707k4456j4721K5826k86k5559l253J0778J778
5517a0344j327M956M544k676j0490k397J0760M324l212j3114J2883L076K941J3570
5503A3494j1975r627Q642R081k210k3901j0975J2019K1454J1230m225m992J419
$$ plain form
5599 20016 -9868 -19361 -11599 -8368 -21274 -17626 9677 16771 26643 24453 11327 13580 13701 5008
5585 5008 -5385 -25923 -20047 -7529 -6425 18658 8841 5505 1692 -5381 -27562 -10928 -743
5572 -743 -9542 -25546 -28317 -34552 -28836 -27037 -37247 -40217 -26895 -41292 -23006 -1853 3991 -1512
5558 -1512 -5610 8747 17131 6305 -13722 -22041 -3152 26338 28087 32069 27287 21946 12056 4398
5544 4398 -10116 -23245 -23160 -24446 -33011 -24323 -6233 -2697 4569 10842 -716 -16701 -18592 -1507
5530 -1507 3520 8493 18566 36256 19549 -4907 -19628 6198 5912 -19647 -22900 -12122 -10344
5517 -10344 -11671 -6715 -2171 -4847 -15337 -17734 -6974 -2650 -5862 -18976 -6093 -3017 -76 13494
5503 13494 1519 -8108 534 9615 7405 -16496 -27471 -15452 6002 17232 13007 8015 9434
5490I434o471j4184q775n928J6844J7056K179k7542J2247R973k3352J1019L650
5477c850n503l274N472j2955j4957q27K8375K7523m620p396o495k539q860J6118
5463F212J3035j4664k0923l330o658K0415J6379m515L262J0006k584j3970P127
5450I792Q946n2NN158m647j028O601L701j3659j0053j5811j5866m334k37J1475
5435b0009K6429L0231o662k1379j7392l032J4291k1485j6774J5662J9117N123
5423D120j1182j9257j2121L798Q923K544k358K999K4851q49L148L613k1616j3826
5409b7213L243J3457M565k323K705j5865J50R175J0214k109J8014J2908j9121
5396G800p385P771J789j2117M131j371k965Q637j8453M100J5781l559j2678p651
$$ plain form
5490 9434 2963 -11221 -19996 -25924 -9080 7976 10155 -17387 -5140 4833 -18519 -7500 -3850
5477 -3850 -9353 -12627 -7155 -20110 -35067 -35894 -7519 20004 15384 7988 1493 -1046 -9906 6212
5463 6212 19247 4583 -16340 -19670 -26328 -5913 10466 5951 9213 19219 16635 2665 9792
5450 9792 18738 18686 18691 23849 19202 18174 24775 28476 14817 4764 -11047 -26913 -31247 -31484 -20009
5435 -20009 6420 36651 29989 8610 -8782 -11814 2477 -19008 -35782 -20120 -1003 4120
5423 4120 -7062 -26319 -38440 -34642 -25719 -23175 -25533 -22534 2317 1468 4616 8229 -13387 -27213
5409 -27213 -23970 -10513 -5948 -8271 -5566 -21431 -21281 -12106 -1892 -4001 14013 26921 7800
5396 7800 415 8186 9975 -2142 1989 618 -2347 6290 -12163 -8063 7718 4159 -8519 -16170
5382a6170L349j3225k263M401P346N685N506m892N409j3913k2257j2829J3031
5369d0822K2632L579K5325P538n966K0365o851n887j3323L893O261j73J4335m185
5355B6721k693j0069j5116j4294J2205J4370p239r902J0534J7624k201j8839l0773
5342b9672J6611J3546m674j6743j953J5609J755j1084P14N184o162k003J1366
5329g506J6463k7591k3814l64J3936J1226J6719K4643q4k2203K596R482o809k847
5315C847n778m325L534R586K23L875q731r048n223k415N841L977N582N716J0491
5300A7152o294k1408O957J7317o16j4079j9802o142m510J9450J601J756R423l757
5286b952o451j727L86L6573r817j9095m917N163N572r007p787J2740J4585O653
$$ plain form
5382 -16170 -12821 -26046 -28309 -23908 -16562 -10877 -5371 -10263 -4854 -18767 -41024 -53853 -40822
5369 -40822 -18190 -14611 10714 18252 12286 32651 25800 19913 6590 10483 16744 16571 30906 26721
5355 26721 24028 13959 -1157 -15451 -3246 11124 3885 -6017 4517 22141 19940 1101 -29672
5342 -29672 -13061 485 -4189 -20932 -22885 -7276 -5521 -16605 -15891 -10707 -16869 -18872 -7506
5329 -7506 8957 -18634 -42448 -42812 -28876 -17650 -931 23712 23628 1425 4021 13503 6694 3847
5315 3847 -1931 -6256 -2722 6864 7087 10962 2231 -6817 -12040 -14455 -8614 -4637 945 6661 17152
5300 17152 10858 -10550 -3593 13724 13108 -971 -20773 -26915 -31425 -11975 -10374 -8618 805 -2952
5286 -2952 -9403 -11130 -10744 25829 16012 -3083 -8000 -2837 2735 -6272 -14059 -1319 13266 19919
5272A9919N854J6886k3964j4877k213R998K6542J4492j3625l6138j902K141J5064
5259A8177l26j2793l613Q835J1878j5008j8558m4540o409K7448K8345M154j612
5246d022K0419J7105p204j8215j7990L706j8665m925J5632P848m533k272L708
5233i408m102L567J1041L650k8799O888K3851Q605j6403j7427J9760j43l1955
5220c0875l263K390L1754J2133j5163j9436K2174P068j4958m69J524J2007r122
5207d236j89J6203k658J878K844l542O186j2521n204M286M820n94j7123j3073
5193b2923k2242j595K4566J5854J083R072o521J274J686r454j2629l879K6429
5180G21M367l09j3620q020R43n340K1441k607r943O598O461j424j070K591K3418
$$ plain form
5272 19919 25773 42659 18695 3818 1605 11603 38145 52637 39012 2874 972 3113 18177
5259 18177 17851 5058 1445 10280 22158 7150 -11408 -55948 -62357 -34909 -6564 -2410 -4022
5246 -4022 16397 33502 26298 8083 -9907 -6201 -24866 -29791 -14159 -6311 -10844 -13116 -9408
5233 -9408 -13510 -9943 1098 4748 -24051 -17163 6688 15293 -1110 -18537 1223 1080 -30875
5220 -30875 -34138 -31748 6 12139 -3024 -22460 -286 6782 -8176 -8645 -7121 4886 -4236
5207 -4236 -4425 11778 9120 10998 13842 10300 16486 3965 -1239 3047 7867 7273 -9850 -22923
5193 -22923 -45165 -46760 -22194 -6340 -5257 3815 -2706 -1432 254 -9200 -21829 -25708 721
5180 721 5088 4779 -8841 -16861 -15918 -21258 183 -2424 -12367 -5769 692 -732 -1802 789 24207
5165B4207J247j4135j1688l401p602l509j5096J2235L0611Q683j8434j9603p299
5152b3784K6023N655j219k03r649j3307O82J0173J5647j75M788K369o402l837
5138F761Q202R696M891L639K442j7758L346o704m379N710j5484k4519n617J0245
5124a9529O929K4283j494r180r402r891J8259m639j3253J9269m499J109o782J4789
5110E969j3870r880j5069j2258L6935K4302J1279j1026j7204k1268L389L575q481
5097b3607R304Q187J1914J1644O385j3734n392k5817J6145L035P246J8004q673
5084A4641l121J1009K471k753Q052O970l3884P15k147n352J3988K794J2922l604
5070B2701q815l366J4441K3846k0773l4130N241j1610j0712r059K1298K1698P814
$$ plain form
5165 24207 25454 11319 -369 -3770 -11372 -14881 -29977 -17742 12869 21552 3118 -16485 -23784
5152 -23784 2239 7894 6675 6472 -3177 -16484 -15802 -5629 10018 9843 14631 17000 10598 6761
5138 6761 14963 24659 29550 33189 35631 17873 21219 14515 10136 15846 362 -24157 -29774 -19529
5124 -19529 -12600 11683 10189 1009 -8393 -18284 -25 -4664 -17917 1352 -3147 -2038 -8820 5969
5110 5969 -7901 -17781 -32850 -45108 -8173 16129 27408 16382 -822 -22090 -18701 -15126 -23607
5097 -23607 -14303 -6116 5798 17442 23827 10093 4701 -21116 -4971 -1936 5310 23314 14641
5084 14641 11520 22529 25000 22247 30299 37269 3385 4100 1953 -3399 10589 13383 26305 22701
5070 22701 13886 10520 24961 48807 28034 -6096 -855 -12465 -23177 -32236 -10938 10760 18574
5057A8574p421L276p216m7j3463r672Q387K0965J8121j8657k4815k3792J2070
5044b3690M628P012J5767N366J0203M902j8215j1028o187N749K655J1189N230
5031A3581j9423k0311N616Q308Q678N577O745l655J1097J0443k743k5154j4309
5018a5550k103r009M061J8740L0810p228q766L412n266M978q71l657N164J887
5004A6602M193J4092J8466r456p005J100j6018j3586j0848M090M387r59j4091
4991i033J0104j4885k9257J2942K3048P487m768j2211J3207O098J339P203p905
4978C369l950J1606J0102L926j980j5976k2668o581j621r198L314J1354N657o603
4964a9249q326k3613M320J1035R642r47K6098J9191J5898r544o720L872p36k149
$$ plain form
5057 18574 11153 14429 7213 7166 -6297 -15969 -7582 13383 31504 12847 -11968 -35760 -23690
5044 -23690 -19062 -12050 3717 9083 19286 24188 5973 -5055 -11242 -5493 -2838 8351 13581
5031 13581 -5842 -26153 -20537 -12229 -3551 2026 8771 5116 16213 26656 23913 -1241 -15550
5018 -15550 -17653 -26662 -22601 -3861 26949 19721 10955 14367 9101 14079 13208 9551 14715 16602
5004 16602 20795 34887 53353 43897 36892 37992 21974 8388 -2460 1630 6017 5058 -9033
4991 -9033 1071 -13814 -43071 -30129 -7081 406 -4362 -16573 -3366 2732 4071 11274 3369
4978 3369 -581 11025 21127 25053 23073 7097 -15571 -22152 -23773 -32971 -29657 -18303 -12646 -19249
4964 -19249 -27575 -51188 -46868 -35833 -26191 -27138 -1040 18151 34049 24505 17785 21657 20921 18772
4950A8772r365M582J6501j2597j984M933p753j4172J3537q855k1589J6631k2421
4937b3780q313J0361Q488l721P437o653J6410K0230j2164j2046j806j899N956
4924a500j3245K325n20n626j1328J3486l299P277n85N556m319k832m515p155K6301
4909B1J547n278p828j15l255J6315J0749j6954j0410q568p184k845J0918j567
4895b4454o621J7875k60Q57M982J6429N353l849O859J306J3163n193j3173l4l218
4880A0022l603j3874R51J1631J0992J019p878m993k64q926k5917j3941K5156L3446
4866A3821j7470J564p78l891K816J0225r270j237J7080Q105o780k1363N576L303
4852A701j0797R48J13q355R910J089j1333N287M935l738J1883k672J0343L681
$$ plain form
4950 18772 9407 13989 30490 17893 15909 20842 13089 -1083 12454 3599 -17990 -1359 -23780
4937 -23780 -32093 -21732 -13244 -16965 -9528 -16181 229 20459 8295 -3751 -5557 -7456 -1500
4924 -1500 -14745 -12420 -12940 -18566 -29894 -16408 -19707 -12430 -13015 -7459 -11778 -14610 -19125 -26280 21
4909 21 1568 -3710 -11538 -11653 -14908 1407 12156 -4798 -15208 -23776 -30960 -33805 -22887 -24454
4895 -24454 -31075 -13200 -13460 -12603 -7621 8808 14161 10312 17171 18477 31640 26447 13274 13240 10022
4880 10022 6419 -7455 -6504 5127 16119 17138 9260 4267 4003 -4923 -30840 -44781 -19625 13821
4866 13821 -3649 -2085 -2863 -6754 -3938 6287 -2983 -4220 12860 20965 14185 -7178 -1602 1701
4852 1701 -9096 -8148 -8035 -16390 -6480 -5391 -16724 -11437 -6502 -10240 1643 -1029 9314 12995
4838A2995p298o373P001Q073N166l1l9578q053J7148J6998o316l356J3287j5815
4824f152j6293n637R602J8395J4224j7771l446K610Q934j4106J929R207P574j6218
4810g148j9673r2M814J4712K5004J2190j2802n534R777L861j999j8514j6233k7293
4796c8930L662K2181K699p370L08J5347o68j3067k998J909m367J257J334J1923
4782f780R532j958r505M758L759K491j2869q014p343m237K6887K2981l666Q989
4768B5025J902r409K137K327N86j8028n948j1593n54N897K459j0277K724N163
4754g589k186Q695K9609O817O876r678j1077n875P924n422j5572o774r089k811
4740a6152j454j6449J7196K1336j5336k4679N482K1795J8567L489j1506q174j5599
$$ plain form
4838 12995 5697 -676 6325 14398 19564 19533 -20045 -28098 -10950 6048 -268 -3624 9663 -6152
4824 -6152 -22445 -28082 -18480 -85 14139 -3632 -7078 -4468 4466 -9640 -7711 1496 9070 -7148
4810 -7148 -26821 -26913 -22099 -7387 17617 29807 17005 11471 21248 25109 23110 4596 -11637 -38930
4796 -38930 -35268 -13087 -10388 -17758 -17450 -2103 -2771 -15838 -18836 -16927 -21294 -20037 -18703 -6780
4782 -6780 2752 794 -8711 -3953 -194 2297 -10572 -18586 -25929 -30166 -3279 19702 16036 25025
4768 25025 26927 17518 19655 21982 22568 4540 -1408 -13001 -13555 -7658 -5199 -15476 -12752 -7589
4754 -7589 -9775 -1080 28529 35346 42222 32544 21467 15592 23516 18094 2522 -4252 -13341 -16152
4740 -16152 -17606 -34055 -16859 4477 -10859 -35538 -30056 -8261 10306 13795 2289 -5885 -21484
4727b1484J4318k471L786P902N654q505j1168N100k007O26K192O552J1876o388
4713E983l6819J671L4897K7984j9j4036p014j4737M241j2947j0729J2118J2569
4700C162J4706J5524M77j9468o810o458R59j1968J896p30N212l495n066K0776
4686H717J3105Q54l158j7229q109l91k0572o600O730J2084J7844K6247j0386j6892
4672B244r93n06M358J619l486j4851J0311R736k845m263J2030J5964r184k8994
4658h860j0625J2644n174l917J7099J892q594J970L821m035L92N208J3091j4487
4644D25l001j7785r566J2059Q038j193O693m476m751K885q675R359K256L330Q399
4629C997Q886r801J4309K232m22j5001j5444m673k816R666K4895J5332q509k1648
$$ plain form
4727 -21484 -7166 -9637 -5851 2051 7705 -800 -11968 -6868 -8875 -8249 -6057 495 12371 5983
4713 5983 -30836 -29165 5732 33716 33697 19661 12647 -2090 2151 -10796 -21525 -9407 3162
4700 3162 17868 33392 33869 14401 7591 1133 2092 -9876 -7980 -8710 -3498 -6993 -12059 8717
4686 8717 21822 22676 19518 2289 -5820 -6211 -26783 -33383 -26653 -14569 3275 29522 19136 2244
4672 2244 1251 745 5103 6722 3236 -11615 -1304 8432 5587 1324 13354 29318 20134 -8860
4658 -8860 -19485 -6841 -12015 -15932 1167 3059 -5535 -3565 256 -3779 -3387 1821 14912 425
4644 425 -2576 -20361 -29927 -17868 -9830 -11023 -4330 -8806 -13557 -10672 -19347 -9988 -7732 -4402 3997
4629 3997 12883 3082 17391 19623 19201 4200 -11244 -15917 -18733 -9067 15828 31160 22651 1003
4615A003p730m653R893P011K23P354R335m533k7406k2616j7649N729K2610J4836
4601f593J0768L172J0110M129p278M166j7572k0527j0452p386J89Q194J6673k923
4587a5330J3627N510L318p84q110k7076L63N355J9866J2887O49j6560P43J2461
4573F919o970k3429n165K0674Q659n922j650P345M867m84J5329q683l0776j7501
4559c6787J4029J089R075k0296j6163K2116J6302o674N397l866L684J0615j0384
4546a1863J771J0629j3774J3917J1394j0846J0156K8012Q466o671k1289j9936
4534c4R68j0480J556N727J2011J16M013O534M14j4311J4051j6229r019K618P35
4519a330J2916J1391n199j413P22j732q300J650j76p771j3317J1365J4875p032
$$ plain form
4615 1003 -6727 -11380 -1487 5524 5747 13101 22436 17903 -9503 -32119 -49768 -44039 -21429 -6593
4601 -6593 4175 7347 17457 21586 14308 18474 902 -19625 -30077 -37463 -37274 -29080 -12407 -15330
4587 -15330 -1703 3807 7125 6341 -1769 -28845 -28482 -23127 -3261 9626 10275 -6285 -5542 6919
4573 6919 -51 -23480 -28645 -7971 688 -5234 -6884 461 5328 4844 20173 11490 -19286 -36787
4559 -36787 -22758 -21669 -12594 -32890 -49053 -26937 -10635 -17309 -11912 -15778 -12094 -1479 -11863
4546 -11863 -10092 537 -13237 680 12074 1228 11384 39396 47862 41191 19902 -34
4534 -34 934 -9546 -7990 -2263 9748 9864 13877 20411 20825 6514 20565 4336 -4683 -2065 -1330
4519 -1330 11586 22977 17778 16365 17087 15355 7055 8705 8529 758 -12559 -1194 13681 6649
4505F649O857j641k2135n640P310p890k7605j4391L252K559K3658J0552p89P059
4491a2195J0166n876P761J331k364l901J281k929l886J5442j438q474k0413O32
4477b4863J3879J5097j599r320K61J5100m457j415Q668K722k5264j225J9827J1607
4463A9018o833o742L365J802J0961J2838J5674j7826p619j7356m841J294j1504
4450g769o128o253j461J1834R821L108m719j4296j2246J4394r32J9156L259j8933
4436a1165r020o780p450n404K1282J7556K302k007j8278k9672r424K2391K8669
4423g000J2919J6324J6063k6686k4320K2902P687J723j2357M46L843M548l877
4410A2215m280q260J9571J1347j208l1950j6931K865j0084N10P398o555j3308
$$ plain form
4505 6649 13506 11865 -10270 -15910 -8600 -16490 -44095 -58486 -55234 -52675 -29017 -18465 -19254 -12195
4491 -12195 -2029 -7905 -144 1187 -1177 -5078 -3797 -6726 -10612 4830 3392 -5082 -25495 -24863
4477 -24863 -10984 4113 2514 -6806 -6545 8555 4098 2683 11351 14073 -11191 -12416 7411 19018
4463 19018 12185 5443 8808 10610 21571 34409 50083 32257 24638 7282 2441 3735 -7769
4450 -7769 -13897 -20150 -21611 -9777 44 3152 -1567 -15863 -28109 -13715 -14647 4509 7768 -11165
4436 -11165 -20185 -26965 -34415 -39819 -18537 -981 1321 -686 -18964 -48636 -58060 -35669 -7000
4423 -7000 5919 22243 38306 11620 -12700 10202 17889 19612 7255 7701 11544 16092 12215
4410 12215 7935 -325 19246 30593 29385 -2565 -19496 -16631 -26715 -26205 -18807 -25362 -38670
4397c8670N386l118R436J0413o798k185J2426n708j1815q648j0759R749J9370
4384b0921L557n109R259M423J4375L600L674r616P203j838o878J132N626j873
4370F614j6229j4598N97j0630j2402L013R626J860N577j4755M177K3435P001K972
4356c742R201k147J865n672l631o582n710L742n67J9038J2445j2296l542n227
4342b825r443j5580R212K8901j1557K271k5138j9151M945Q291L914k558L575j0768
4328c5911N906N415J3169M316Q274j748J064Q288m376q145j389P178j7703k0557
4314c6219J2996n39J1567K1592l549k2210p388n441K0278J9798j326J053K3202
4301C3814j5404k8078r762J5503k617O954o66R819p805j702n492p459M71J070
$$ plain form
4397 -38670 -33284 -36402 -26966 -16553 -23351 -25536 -13110 -18818 -30633 -39281 -50040 -40291 -20921
4384 -20921 -17364 -22473 -13214 -8791 5584 9184 12858 3242 10445 8607 1729 2861 8487 6614
4370 6614 -9615 -24213 -23616 -34246 -46648 -43635 -34009 -32149 -26572 -41327 -37150 -13715 -6714 -3742
4356 -3742 5459 3312 5177 -495 -4126 -10708 -16418 -12676 -13243 5795 18240 5944 2402 -2825
4342 -2825 -12268 -27848 -18636 10265 -1292 979 -24159 -43310 -38365 -30074 -26160 -28718 -25143 -35911
4328 -35911 -30005 -24590 -11421 -7105 1169 -579 485 8773 4397 -3748 -5137 2041 -15662 -36219
4314 -36219 -23223 -23762 -12195 9397 5848 -16362 -23750 -29191 -8913 10885 9559 10612 33814
4301 33814 18410 -9668 -19430 -3927 -6544 410 -256 9563 1758 56 -5436 -12895 -12424 -11354
4287a1354K160q20r948P015J8298m72k5512p374M342N915l833q422n11M859J1460
4272a4197J8045Q941n609q676q92J4183o243m466j5640k3796P085M0159K4055
4259C2949j4364q768j072J009j5309J696R483p955j2275J2349J2193J6946k2111
4246D771m060q711k7413L263J5700J0708O112k4781n021j033P30O362J2149N241
4232e983j5193R556m427j3859J7219O460J7211O585Q450J1373o320l2425j2614
4219a3967m258K705r167J710M572J88K3461J1294J7914M151j7890k1209q589K8965
4205A9880r12j3708j8264P697K6466n557R03k609m445K825j1457j1652j2106J638
4191b1301K5122J4135k0342j4278O55N143P752R627N732j2700k0924j2736M508
$$ plain form
4287 -11354 -9194 -10014 -19962 -12947 5351 4879 -20633 -28007 -23665 -17750 -21583 -30005 -30516 -25657 -14197
4272 -14197 3848 12789 7180 -1496 -2388 11795 5552 1086 -14554 -38350 -31265 8894 32949
4259 32949 18585 9817 8745 9754 -5555 -3859 5624 -2331 -14606 -2257 9936 26882 4771
4246 4771 711 -8000 -35413 -32150 -16450 -5742 370 -24411 -29432 -30465 -29735 -23373 -11224 -5983
4232 -5983 -21176 -11620 -16047 -29906 -12687 -6227 10984 17569 26019 37392 31072 -1353 -13967
4219 -13967 -18225 -15520 -24687 -22977 -18405 -18217 5244 16538 34452 38603 20713 -496 -9085 19880
4205 19880 18968 5260 -13004 -5307 21159 15602 16505 13896 9451 12276 819 -10833 -22939 -21301
4191 -21301 3821 17956 -2386 -16664 -16009 -10866 -3114 6513 12245 -455 -21379 -34115 -29607
4178b9607J0094J6364j8552o056l61M842R587O112J9616J745q613p587j3660J0885
4164e191J2095J362J154K7o807O625O101m949l059Q597K831j5306j939n144O03
4149c000j204J3256J1882m653k6368p821J2293J1901J4973M010k978j1624j2756
4136b089j1043O030O877J748q756J1921J1345J255o686j6239l922O942j0385L93
4122a2609l167J5096L005j1566r217R698J0218K305j369k9889k78J1986N94j2185
4108b7378J2086J5587J187j884k5686j8363M952k142Q599J6576J6259O445p372
4095a134Q230k482j1615J59J3816j2358p686K596J2112p996k109J2654k5792j3405
4081c5010J6467j227K1996K8598K65q835k2051L969q86j4786o405J0696J0968
$$ plain form
4178 -29607 -19513 -3149 -21701 -27757 -28118 -23276 -13689 -7577 12039 13784 5171 -2416 -16076 -5191
4164 -5191 6904 8266 9420 9447 2640 9265 15366 10417 7358 15955 18786 3480 1541 -3603 -3000
4149 -3000 -4204 9052 20934 16281 -10087 -17908 -5615 6286 21259 25269 22291 10667 -2089
4136 -2089 -13132 -7102 -225 1523 -7233 4688 16033 17288 10602 -5637 -9559 -2617 -13002 -12609
4122 -12609 -15776 -680 2325 -9241 -18458 -8760 1458 3763 2394 -27495 -27773 -15787 -15193 -27378
4108 -27378 -15292 295 1482 -402 -26088 -44451 -39499 -41641 -33042 -16466 -207 6238 -1134
4095 -1134 7096 4614 -7001 -6842 6974 -5384 -13070 -10474 1638 -6358 -8467 4187 -21605 -35010
4081 -35010 -18543 -19770 2226 30824 31089 22254 203 4172 3286 -11500 -17905 -7209 3759
4068C759Q728J0004j7372k706L023j2211n978p023k116J2038K2565O75m538M225
4054A3073q404m957j78L658P139N591Q342J537j5903J28N192L061J4519K255l552
4039C1501k741k9209j9447j2514J956K06L802J5757J9051j845o043o453O197R065
4025I283J4257J7626q824k3883J7553K6771n9q208j6783n918o564j1067j4111
4012i927k21J1566J368o982j2112K757J4882j513k24R406K311k8252j3223J2590
3998a7574J3095q567K0051O196M999P292j0392P430j875P460l20M162k876o610
3984B2471j6366L66j9039K142P894K01j2087k70Q41M245l706M925J20k495j868
3969a2626L1653J7293r792k9126J294L76o468R786l818L762p639K634n798J6784
$$ plain form
4068 3759 12487 22491 5119 2413 5436 -6775 -12753 -19776 -21892 -9854 12711 13386 8848 13073
4054 13073 4669 -288 -466 3192 10331 15922 24264 25801 9898 10026 15218 18279 32798 35053 31501
4039 31501 28760 -449 -19896 -32410 -30454 -30248 -26446 -10689 8362 6517 474 -5979 218 9283
4025 9283 23540 41166 32342 8459 26012 52783 52724 44516 27733 21815 15251 4184 -9927
4012 -9927 -10148 1418 2786 -4196 -16308 -13551 1331 -182 -406 9000 11311 -16941 -30164 -17574
3998 -17574 -4479 -13046 7005 13201 18200 25492 15100 22530 20655 28115 27795 31957 29081 22471
3984 22471 6105 6471 -12568 -10426 -2532 -2331 -14418 -14688 -13847 -9602 -13308 -8383 -8263 -10758 -12626
3969 -12626 19027 36320 26528 -2598 -1304 -928 -7396 2390 -1428 2334 -5305 -2671 -8469 8315
3955H315J3044n627k1821O310J9735N656R718J9k700k206m430j249r409P133j0586
3940A1902O413q496m454l51M783K745O57m860n518q808l74J1906J2082Q127M341
3925C0095j786j1354j0126j9990K768N413j3467j7596m439Q124J2879l548J1357
3912a1670J7566J5739O029j05n246j3914n550R40O29K134N378m938Q929m654j0224
3897A043l008k0293k00Q755R998P369J1625j1926j0823R449J2128P533j1322p278
3883C050q706k631n313R591L31l269J2218J0423k885j3365k2528J686o053J5874
3869a1577K6785K0579l2857j2994j0604m740M099K6160J325R752J1205j4361j9123
3856f351l580o347J3635J5853K1292k972j9458J5624J6379j3104l5736j8872j5778
$$ plain form
3955 8315 21359 15732 -6089 221 19956 25612 35330 35349 32649 30443 26013 24764 15355 22488 11902
3940 11902 18315 9819 5365 5014 9797 12542 13199 8339 2821 -5987 -6361 5545 17627 25754 30095
3925 30095 28309 16955 6829 -13161 -10393 -4980 -18447 -36043 -40482 -32358 -19479 -23027 -11670
3912 -11670 5896 21635 27664 27559 22313 8399 2849 3789 4418 6552 11930 6992 15921 11267 1043
3897 1043 -1965 -22258 -22458 -13703 -3705 3664 15289 3363 -7460 1989 14117 21650 10328 3050
3883 3050 -5656 -8287 -13600 -4009 -3678 -6947 5271 15694 12809 -556 -23084 -21398 -27451 -11577
3869 -11577 15208 35787 2930 -10064 -20668 -25408 -21309 4851 6176 15928 27133 12772 -6351
3856 -6351 -9931 -16278 -2643 13210 34502 31530 12072 27696 44075 30971 -4765 -23637 -39415
3843c9415J9103k177j693J1084K9567R702l317m854M296j5725n924m208J954k1638
3829b3245k84N327L487j863L405p126k0499o61J8136J9416R575J072k1008J802
3815a2466P681K4216q592O03J3584j7282j698j1110O418J4392K444q823k7005
3802a7638k4126P376J7732R751J3394K1468J4261j8787o448j46k270r353m659
3789E55k968K513J1471j8474P958J2903k8803O727J4731n480p476m020J0762J0204
3775A0603K990o772o379j7027j1739j3144J0845L9700l288j4274l305J6330N457
3762I997R675R699J81n717Q748k1345j2387q886r036Q272O782j5087p429o74m115
3747c1322R778r92J3221O735n424J6436J0746j1579j8637k6298J5682J1389n153
$$ plain form
3843 -39415 -20312 -22489 -24182 -13098 16469 26171 22854 18000 22296 6571 647 -3561 -1607 -23245
3829 -23245 -23529 -18202 -14715 -16578 -13173 -20299 -40798 -41459 -23323 -3907 5668 6740 -14268 -12466
3815 -12466 -4785 19431 10839 11442 25026 7744 6046 -5064 1354 15746 18190 9367 -17638
3802 -17638 -41764 -34388 -16656 -6905 6489 27957 42218 23431 16983 16837 14567 5214 555
3789 555 -2413 100 11571 -6903 1055 13958 -14845 -8118 6613 1133 -6343 -10363 399 10603
3775 10603 13593 6821 442 -16585 -28324 -41468 -30623 9077 5789 -8485 -11790 4540 9997
3762 9997 19672 29371 29552 23835 32583 11238 -1149 -10035 -19071 -10799 -4017 -19104 -26533 -27207 -31322
3747 -31322 -21544 -22536 -9315 -2580 -8004 8432 19178 7599 -11038 -37336 -21654 -10265 -15418
3734a5418J7365J0437j4761j1717j0074O294N83J3027k71o538q267N443L4445
3721B0548J8359o55j9853j812J043m579n242j7616K343R332O158O123N708J044
3707B0901j1265N702N54j8313j0087o739n123J710K4993J5234J6816m672P235
3694C6946n151k8221j4907o163J6428J74o675O584l811M889K3195J487j6851j6112
3680h188J696J7746j5985p030l235q275J634J7457J067J6429N868j1149j1002
3667b967m996k885N720p659k0859J9970J6263k4932p161K590j8637L958Q658K3061
3653i876R399O08K852j5050j2498M556R137q0J2436Q954l1030n395J6247Q515
3639a225K858J2526q862M722J765M268Q932L606l752j3222J501q149o869j6977
$$ plain form
3734 -15418 1947 12384 -2377 -14094 -24168 -17874 -17291 -4264 -4535 -11073 -19340 -13897 20548
3721 20548 38907 38252 18399 16587 17630 13051 7809 -9807 -7464 1868 8026 14149 19857 20901
3707 20901 9636 15338 15892 -2421 -12508 -19247 -24370 -22660 2333 17567 34383 29711 36946
3694 36946 31795 3574 -11333 -17496 -1068 -894 -7569 -985 -4796 93 23288 24775 7924 -8188
3680 -8188 -6492 11254 -4731 -11761 -14996 -23271 -21637 -4180 -3113 13316 19184 8035 -2967
3667 -2967 -7963 -10848 -5128 -12787 -33646 -13676 2587 -22345 -29506 -26916 -45553 -41595 -32937 -9876
3653 -9876 -477 131 2983 -12067 -24565 -20009 -10872 -10952 1484 10438 -20592 -25987 -9740 -1225
3639 -1225 1633 14159 5297 10019 11784 16052 24984 28590 24838 11616 13117 4968 -1901 -18878
3625a8878K5089J2653R332j2398j2981p200r102n52L5475p866o04o492k73J0364
3611A6567m292j3347k2911r310N21L4165J4908j9731j0073J2414P813N397N329
3598A7450J3160j3615l587J5022P752r357r044j7501M237j226J293j5931K4569
3585A3222J2305j5734o161q99R240j4261j5945k0689P050p453J9545o529r376
3572c5685K0694J5032J967m136j0825j480P966n449R00Q638p097j7614j80N406
3558b1863j4012J1468K1169K4688K2345J76j8643j3681k0426j1856J0572P251
3546b812K876o28p280m452L165n702l797n968K693J1045L116O859L887J4092n481
3531A1613L578J206J2638q079j4834j0176m743q424M665K1530K0164M11l0274
$$ plain form
3625 -18878 6211 18864 28196 15798 2817 -4383 -13485 -14037 21438 13572 12968 6476 6203 16567
3611 16567 12275 -1072 -23983 -33293 -32772 1393 16301 -3430 -13503 -1089 6724 12121 17450
3598 17450 30610 16995 13408 28430 36182 26825 17781 280 4517 3291 4584 -11347 13222
3585 13222 25527 9793 3632 2733 11973 -2288 -18233 -38922 -31872 -39325 -19780 -26309 -35685
3572 -35685 -14991 41 2008 -2128 -12953 -14433 -6467 -11916 -11016 -2378 -9475 -27089 -27269 -21863
3558 -21863 -35875 -24407 -3238 21450 43795 43971 25328 11647 -8779 -20635 -10063 -2812
3546 -2812 64 -564 -7844 -12296 -9131 -14833 -18630 -24598 -21905 -10860 -7744 -885 3002 17094 11613
3531 11613 15191 16397 29035 20956 6122 -4054 -8797 -17221 -12556 8974 29138 29549 -725
3518g25m039Q701l749j0978K733j4279p061R07O733l602K1141J5268J2186k3455
3504b19o337J2765l239R963p058k408M810p987L93J7987m09k227q670j7839q659
3489a9134L867q688L943J3440r964j153r803J1356J4659L443o729j8413j526M365
3475b0337p94p52k869j670J2443J0826R811j2884j8726M358N440P928L709l78
3461c895m730J3308q75j4468j5712K573J7725J663n345O686K655O235j076l408
3447A336K5096o600j8322M399M574j2089p967o490P355J1708m798j3009J844K7055
3433A4092p168j9465r267Q703P73P337o02j033m401J9124K653Q748N349K475L324
3418C0642n874k1318O060L100K937J4157P784q97L558j926R831j0712j7141l918
$$ plain form
3518 -725 -4764 3937 188 -10790 -8057 -22336 -29397 -28490 -21757 -25359 -4218 11050 23236 -219
3504 -219 -6556 6209 2970 12933 5875 3467 8277 290 683 18670 18261 16034 7364 -10475 -19134
3489 -19134 -15267 -23955 -20012 -6572 -16536 -17689 -27492 -16136 -1477 1966 -4763 -23176 -24702 -20337
3475 -20337 -21131 -21883 -24752 -26422 -13979 -3153 6658 -6226 -24952 -20594 -15154 -7226 -3517 -3895
3461 -3895 -8625 4683 3808 -10660 -26372 -23799 -6074 -4411 -9756 -3070 -415 5820 4744 1336
3447 1336 26432 19832 1510 5909 10483 -1606 -9573 -16063 -8708 3000 -1798 -14807 -12963 14092
3433 14092 6924 -12541 -21808 -13105 -12332 -4995 -5597 -6630 -11031 8093 10746 19494 24843 27318 30642
3418 30642 24768 3450 9510 12610 15547 29704 37488 36591 40149 38223 48054 37342 20201 16283
3404A6283L740K298j5843o963J611J7158J6535P84j5033r685j1125j7779j9684
3391c7703J1576Q516J7522P066l42J9739l94j254Q752J1377p482q496o898j5501
3377F478L477L346lL079P132p513J4961l320j3906j9763L1426m575k2461o181
3363g823o593R151J0981K360n498k3311k0327J0148o257J8540J2515N140l24o634
3349g932o977O290J5181R20k0012j0970O439l41o634J9681L209p520j2577L771
3335a7472K2547J626P331j2338l670m73Q590K4376m372j6743J7919P190j1823
3322B2688q44o802q836R64N445j7402j6151l411J0391J500o52J0462j0997j1820
3308b5465q313J6653K1869J5498r046j6696J5873J2962R1O555j6356j220n472
$$ plain form
3404 16283 20023 22321 6478 -485 1126 18284 34819 35603 20570 10885 -240 -18019 -37703
3391 -37703 -26127 -17611 -89 6977 6635 26374 25980 24726 33478 44855 37373 28877 21979 6478
3377 6478 9955 13301 13298 16377 23509 15996 30957 27637 13731 -6032 25394 20819 -1642 -7823
3363 -7823 -14416 -5265 5716 8076 2578 -20733 -41060 -30912 -37169 -18629 -6114 -974 -1298 -7932
3349 -7932 -14909 -8619 6562 7482 -12530 -23500 -17061 -17402 -24036 -4355 -1146 -8666 -21243 -17472
3335 -17472 5075 6701 14032 1694 -1976 -2449 6141 30517 26145 9402 27321 34511 22688
3322 22688 21844 15042 6206 7170 12615 -4787 -20938 -24349 -13958 -12458 -13110 -2648 -13645 -25465
3308 -25465 -33778 -17125 4744 20242 11196 -5500 10373 23335 23426 29981 13625 12405 6933
3295F933k307q646J2455P387k5923j46M555P259l105J3448J6197P415l180k2770
3281I572k465j1658o674j803N083K3493J7653j8686j2953m080k395N500M442l288
3267A741N358o115q412J3781J4052p054p701J0084k29p37j5172K015K053O13J2719
3252A6996j6415o786J3571L982Q6K529r143q198n76J5964J4263r034j8433j027
3238b221Q380k919o127J6285j0603K351r593Q40L535j1529Q763L384j0173K0626
3224A0999Q001r420j2662k485M942J0028K705j5986J4036k206j4472p68m848m031
3210a6167P423J6210J6447k28j6827j3240L460M644P153r831p516L190K6046l3526
3196a2762r617J2427o635Q499M186r811m757N81J5183J3089l737J405R691P828
$$ plain form
3295 6933 4626 -4020 8435 15822 -10101 -10247 -5692 1567 -1538 11910 28107 35522 32342 9572
3281 9572 7107 -4551 -11225 -13028 -7945 15548 33201 14515 1562 -2518 -4913 587 5029 1741
3267 1741 7099 984 -7428 6353 20405 13351 5650 15734 15505 14768 -404 1611 3664 4277 16996
3252 16996 581 -6205 7366 11348 11434 13963 4820 -3378 -3954 12010 26273 17239 -1194 -2221
3238 -2221 6159 3240 -2887 13398 2795 5146 -4447 -3607 -72 -11601 -2838 546 -9627 10999
3224 10999 19000 9580 -3082 -5567 -625 9403 12108 -3878 10158 7952 -6520 -7288 -12136 -16167
3210 -16167 -8744 7466 23913 23685 6858 -6382 -2922 1722 8875 -956 -8472 -5282 20764 -12762
3196 -12762 -22379 -9952 -16587 -8088 -3902 -13713 -18470 -17889 -2706 10383 6646 8051 17742 25570
3182B5570j3691o423L615R252m855j3574P324j505k199p134j7106L755J0425K6513
3168A9967K0370J0421J7050J1003m583l2638l1419j8228o648R040j773p535Q53
3155a4120j95j2514l268Q188K865N105Q024N269O371q887k0984q152K5213J1651
3141D566L916l319k937k0688J7064K3531L757m423L352j2899k0545q835o264N916
3127a7808J2962r191o892J0607J6530n987j0060R267J631k558k2470n103j5397
3114d4469J7313K2177O80J6988l236j1173P86m36n030j2994p203P312M955J6898
3100B568j45j8203k39K617j6893k567J1069n591P996R265J4893J849j569n875
3086h25N862J190j2925N037q918J8319J0949P064j2229o846N792j3202p092j7732
$$ plain form
3182 25570 11879 5456 9071 18323 13468 -106 7218 5713 3514 -3620 -20726 -16971 -6546 19967
3168 19967 40337 50758 67808 78811 74228 41590 10171 -8057 -14705 -5665 -7438 -14973 -14120
3155 -14120 -14315 -26829 -30097 -21909 -19044 -13939 -5915 -646 5725 -3162 -24146 -32298 -7085 4566
3141 4566 8482 5163 2226 -18462 -1398 22133 25890 21467 24819 11920 -8625 -17460 -23724 -17808
3127 -17808 -4846 -14037 -20929 -10322 6208 221 -9839 -572 1059 -1499 -23969 -29072 -44469
3114 -44469 -27156 -4979 -4299 12689 9453 -1720 -934 -1370 -6400 -19394 -26597 -19285 -14330 2568
3100 2568 2423 -15780 -16019 -13402 -30295 -32862 -21793 -27384 -19388 -10123 4770 6619 5050 -825
3086 -825 5037 6227 -6698 -1661 -10579 7740 18689 25753 13524 6678 12470 -732 -7824 -25556
3072b5556p905J2995r439k2399J8087J0342l731R762k315K7400R236o920p03j7715
3058h861K776J2899j499M378j1059p720O79J742j996j5794K2471J9999J2833n992
3044B4856l4169j4492R244J5611K7194o454k2217o284M279j2706M661K8153O532
3031B4208j1356j0504j479J129o959k877O539K3541J0320r397l681J6631O443
3018D2558j6837R867K757j6984j6772J576J3377n834L30l3543k1065K0263J3236
3005g071J0260j1811q064O625k280m44K3181j2801l05j0223o422K307r56J8183
2991A79Q423p851L593J569m819j5379j0864o6J6137K198l473K89J5086K1608J0127
2976C6757j0393k001j922O690l116j753p285j9333q450N068j0730N657J5284Q008
$$ plain form
3072 -25556 -33461 -20466 -29905 -52304 -34217 -23875 -27606 -17844 -20159 7241 16477 9557 8854 -8861
3058 -8861 -6085 6814 5315 9693 -1366 -9086 -8407 -6665 -8661 -24455 -1984 18015 30848 24856
3044 24856 -9313 -23805 -14561 1050 28244 21790 -427 -6711 -2432 -15138 -10477 17676 24208
3031 24208 12852 2348 869 1998 -4961 -7838 -1299 22242 32562 23165 19484 36115 42558
3018 42558 25721 35588 38345 21361 4589 6165 19542 13708 14038 -19505 -40570 -20307 -7071
3005 -7071 3189 -8622 -16686 -10061 -12341 -12785 10396 -2405 -2710 -12933 -19355 -17048 -18004 179
2991 179 8602 751 4344 5913 1094 -14285 -25149 -25215 -9078 -6880 -10353 -10064 5022 26630 36757
2976 36757 26364 24363 22441 29131 26015 24262 16977 -2356 -10806 -5738 -16468 -10811 4473 12481
2962A2481r636Q004j419Q03P780q104j2523p372P63j1555J554K1560r574j5717
2948b2955j0881N290O513J492j1933P043l446p731K3947j210K74K0390J1918j2292
2934F419j0994j8722j4691N83J2080k774O386P880N476Q582M632j4391N072N917
2920A455m097l75J6042R566l1035n030K9705O059j6893k0760R00L061J2207M476
2906E281Q865k0283j3564O801J1128J0946K0528L164N580j0332k3786j9018Q073
2893f617k709j6226J1263L178j294j6611o367J9296K4424P524j7596M748Q937
2880A1950r300j3576l372j095M414M562P335J2989M458j8539j9137l24m427K275
2866b1787K2542J616k312m628q040M371J4289O640k3679j3640n411k1354M259
$$ plain form
2962 12481 2845 10849 9430 10233 18013 9909 -2614 -9986 -9223 -20778 -19224 2336 -7238 -22955
2948 -22955 -33836 -28546 -22033 -20541 -32474 -25431 -28877 -36608 -12661 -13871 -13597 6793 18711 6419
2934 6419 -4575 -23297 -37988 -37405 -25325 -28099 -21713 -13833 -8357 225 4857 -9534 -4462 1455
2920 1455 -2642 -3017 13025 22591 -8444 -13474 16231 22290 5397 -15363 -14463 -11402 805 5281
2906 5281 14146 -6137 -19701 -12900 -1772 9174 29702 32866 38446 28114 4328 -14690 -6617
2893 -6617 -9326 -25552 -14289 -11111 -12405 -29016 -35383 -16087 8337 15861 -1735 3013 11950
2880 11950 2650 -10926 -14298 -15393 -10979 -6417 918 13907 18365 -174 -19311 -19635 -24062 -21787
2866 -21787 755 2371 59 -4569 -12609 -8238 6051 12691 -10988 -24628 -30039 -51393 -47134
2853d7134P717m576j0126l030Q166K2567K0707L756n492P751j0908j3989J0836
2840a3755K3208K38q112p187J831j3129j7615n133J0533J4729J1044j0766J2559
2827a555L4194m65r582M377M066k0394k5796n499q612K2862R818m198J1705q697
2813B224j7285J3753K3243k4129J5635J559j4901n137q281J253K219j9729k1490
2800e1066J9386J2965k189p507K062Q249K3991L135J0914j597n034j672k6276
2787a4639l288O659L201q874J2249J8881p942K337j2110J533J9433j2382j1780
2774f722k768L657m047q132J5394M383J2898O117L131j920j5699p362l840N673
2760G63J5105R237r544L514J1490r850k0634k117P697r816R487J9617r136k4075
$$ plain form
2853 -47134 -39417 -43993 -54119 -57149 -48983 -26416 -5709 -1953 -7445 306 -10602 -24591 -13755
2840 -13755 9453 9691 1579 -5608 -3777 -16906 -34521 -39654 -29121 -14392 -3348 -14114 -1555
2827 -1555 32639 32174 22592 26969 31035 10641 -15155 -20654 -29266 -6404 3414 -784 10921 2224
2813 2224 -15061 -1308 21935 -2194 13441 15000 99 -5038 -13319 -12066 -9847 -29576 -51066
2800 -51066 -31680 -18715 -20904 -28411 -26349 -18100 5891 9026 19940 18343 13309 11637 -14639
2787 -14639 -17927 -11268 -8067 -16941 -4692 14189 6247 8584 -3526 -1993 17440 5058 -6722
2774 -6722 -9490 -5833 -9880 -18012 -2618 1765 14663 20780 23911 21991 6292 -1070 -4910 763
2760 763 15868 25105 15561 19075 30565 20715 81 -2036 5661 -4155 5332 24949 15813 -8262
2746h262m436J2887K198J4804J0949j1292L915J1848L569j7072J4988o119r045
2733A8932j9756K23J5062n437k062J921M343J3804r627l7j265j3902j4100M553
2719g348K4264J4927r462k6771k721k620N517J8309P788l377k2693j9132J2410
2706a0909l058P323m269q478P129Q090j6396J2406J5299Q077o319n022L844J7693
2692B5410L933j5138j9857j999L998M881R611n66l221K1649J4518j5102j1431
2679A6686M447N778j4224j9842L731L268p845J2524Q222L077l511r178j6302p146
2665b0315L110J4526K2118J1556R209k676k0214l1985N285P874J390J2109J0313
2652B2300J1018O443p821m071j1765M784j5211j0242j1300J1739K6166j4971k4469
$$ plain form
2746 -8262 -12698 189 2387 17191 28140 16848 20763 32611 36180 19108 34096 27977 18932
2733 18932 -824 -601 14461 9024 6962 8883 13226 27030 17403 17366 16101 2199 -11901 -7348
2719 -7348 16916 31843 22381 -4390 -7111 -9731 -4214 14095 21883 18506 -4187 -23319 -10909
2706 -10909 -13967 -6644 -10913 -19391 -12262 -4172 -20568 -8162 7137 15214 8895 3873 7717 25410
2692 25410 29343 14205 -5652 -7651 -3653 1228 10839 10273 7052 28701 43219 28117 16686
2679 16686 21133 26911 12687 -7155 -3424 -156 -8001 4523 12745 15822 12311 3133 -13169 -20315
2665 -20315 -17205 -2679 19439 30995 40204 37528 17314 -14671 -9386 -1512 -122 11987 22300
2652 22300 33318 39761 31940 27869 16104 20888 5677 -4565 -15865 -4126 22040 7069 -17400
2639a7400Q955J1140m318J0293O427J8131R311q405p349o162O944n511m628P128
2625B4556J1728l936j5592J302m648j0141P157l090J310m308p220J5502J5655
2612B8275j7976k2791P504J2100j372k882J558j1222j5348q13L118l640J2520
2599a0969r691k76K8584K920l061k056k0141o81K6424K6521O286j6558Q506r704
$$ plain form
2639 -17400 -8445 2695 -1623 8670 15097 33228 42539 34134 26785 20623 27567 22056 17428 24556
2625 24556 36284 32348 16756 18058 13410 3269 10426 7336 8646 4338 -2882 12620 28275
2612 28275 10299 -12492 -4988 7112 5740 2858 4416 -6806 -22154 -22967 -19849 -23489 -10969
2599 -10969 -20660 -20936 7648 10568 7507 5451 -14690 -15371 11053 37574 43860 27302 35808 26104
$$ [...]
##END NTUPLES=NMR SPECTRUM
##END=
