##TITLE=Analysis number 313692
Compound Code mo 07624
Book Reference 453/24
Project Code adrs
Chemist Name lesleyd
##JCAMPDX= 6.0         $$ Bruker NMR JCAMP-DX V2.0
##DATA TYPE= NMR SPECTRUM
##DATA CLASS= NTUPLES
##ORIGIN= Bruker BioSpin GmbH
##OWNER= NMR
$$ XWIN-NMR		Version 3.5
$$ Mon Sep 19 08:35:21 2005 GMT Daylight Time (UT+1h)  MAYBRIDGE\NMR@NMR_250MHZ
##.OBSERVE FREQUENCY= 250.131544655141
##.OBSERVE NUCLEUS= ^1H
##.ACQUISITION MODE= SIMULTANEOUS (DQD)
##.ACQUISITION SCHEME= undefined
##.AVERAGES= 16
##.DIGITISER RES= 18
##SPECTROMETER/DATA SYSTEM= dpx250
##.PULSE SEQUENCE= zg30
##.SOLVENT NAME= CDCl3
##.SHIFT REFERENCE= (INTERNAL, CDCl3, 0, 16.522)
##AUDIT TRAIL= $$ (NUMBER, WHEN, WHO, WHERE, WHAT)
$$ ##TITLE= Audit trail, XWIN-NMR		Version 3.5
$$ ##JCAMPDX= 5.01
$$ ##ORIGIN= Bruker BioSpin GmbH
$$ ##OWNER= NMR
$$ C:\u/data/dgb/nmr/ADRS/9590/pdata/1/auditp.txt
$$ ##AUDIT TRAIL=  $$ (NUMBER, WHEN, WHO, WHERE, WHAT)
(   1,<2005-09-19 08:34:53.25 +100>,<MAYBRIDGE\NMR>,<NMR_250MHZ>,
      <created by zg, POWCHK disabled, PULCHK disabled
       configuration hash MD5:
       62 19 C7 07 E1 42 D1 B7 37 6C 3D D0 77 39 F9 E6
       data hash MD5: 64K
       6A C0 4A C6 FB A7 14 EB 75 E1 A0 7D 0C D6 B5 6A>)
(   2,<2005-09-19 08:35:06.89 +100>,<MAYBRIDGE\NMR>,<NMR_250MHZ>,
      <Start of raw data processing
       ef LB = 0.3 FT_mod = 6 PKNL = 1 SI = 32K 
       data hash MD5: 32K
       0F 65 BC B5 16 D2 15 66 53 D4 ED 7B DD 6F 76 EC>)
(   3,<2005-09-19 08:35:08.60 +100>,<MAYBRIDGE\NMR>,<NMR_250MHZ>,
      <apk 
       data hash MD5: 32K
       68 01 C9 ED 38 1C E3 92 61 25 01 A3 CB F7 06 10>)
(   4,<2005-09-19 08:35:09.72 +100>,<MAYBRIDGE\NMR>,<NMR_250MHZ>,
      <abs ABSG = 5 
       data hash MD5: 32K
       97 3F 55 46 BB 4B 54 C3 4C B3 B4 E0 46 FC 2C 3D>)
$$ ##END=
$$ 
$$ hash MD5
$$ 63 A0 75 13 6C 39 4C F1 AB 13 18 16 4B 35 DB 3B
##$RELAX= 
##$RELAX= 
##$RELAX= 
##$RELAX= 
##$RELAX= 
##$RELAX= 
##$RELAX= 
$$ Bruker specific parameters
$$ --------------------------
##$DU= <C:\u>
##$EXPNO= 9590
##$NAME= <ADRS>
##$PROCNO= 1
##$TYPE= <nmr>
##$USER= <dgb>
##$AMP= (0..31)
100 100 100 100 100 100 100 100 100 100 100 100 100 100 100 100 100 100 
100 100 100 100 100 100 100 100 100 100 100 100 100 100 
##$AQSEQ= 0
##$AQ_mod= 3
##$AUNM= <au_zg>
##$AUTOPOS= <1 >
##$BF1= 250.13
##$BF2= 250.13
##$BF3= 250.13
##$BF4= 250.13
##$BF5= 500.13
##$BF6= 500.13
##$BF7= 500.13
##$BF8= 500.13
##$BYTORDA= 1
##$CFDGTYP= 0
##$CFRGTYP= 5
##$CHEMSTR= <none>
##$CNST= (0..31)
1 1 145 1 1 1 1 1 1 1 1 1 1 1 1 1 1 1 1 1 1 1 1 1 1 1 1 1 1 1 1 1 
##$CPDPRG= <>
##$CPDPRG1= <>
##$CPDPRG2= <>
##$CPDPRG3= <>
##$CPDPRG4= <mlev>
##$CPDPRG5= <mlev>
##$CPDPRG6= <mlev>
##$CPDPRG7= <mlev>
##$CPDPRG8= <mlev>
##$CPDPRGB= <>
##$CPDPRGT= <>
##$D= (0..31)
0 1 0 0 0 0 0 0 0 0.06 0 0 0 0 0 0 0.0002 0 0 0 0 0 0 0 0 0 0 0 0 0 0 
0 
##$DATE= 1127115292
##$DBL= (0..7)
120 120 120 120 120 120 120 120 
##$DBP= (0..7)
150 150 150 150 150 150 150 150 
##$DBP07= 0
##$DBPNAM0= <>
##$DBPNAM1= <>
$$ [...]
##$SUBNAM7= <"">
##$SUBNAM8= <"">
##$SUBNAM9= <"">
##$SW= 20.6930455092707
##$SWIBOX= (0..15)
0 0 3 0 0 0 0 0 0 0 0 0 0 0 0 0 
##$SW_h= 5175.983436853
##$TD= 65536
##$TD0= 1
##$TE= 294.16
##$TE2= 300
##$TE3= 300
##$TEG= 300
##$TL= (0..7)
0 120 120 120 120 120 120 120 
##$TP= (0..7)
150 150 150 150 150 150 150 150 
##$TP07= 0
##$TPNAME0= <>
##$TPNAME1= <>
##$TPNAME2= <>
##$TPNAME3= <>
##$TPNAME4= <>
##$TPNAME5= <>
##$TPNAME6= <>
##$TPNAME7= <>
##$TPOAL= (0..7)
0.5 0.5 0.5 0.5 0.5 0.5 0.5 0.5 
##$TPOFFS= (0..7)
0 0 0 0 0 0 0 0 
##$TUNHIN= 0
##$TUNHOUT= 0
##$TUNXOUT= 0
##$USERA1= <user>
##$USERA2= <user>
##$USERA3= <user>
##$USERA4= <user>
##$USERA5= <user>
##$V9= 5
##$VALIST= <valist>
##$VCLIST= <CCCCCCCCCCCCCCC>
##$VD= 0
##$VDLIST= <DDDDDDDDDDDDDDD>
##$VPLIST= <PPPPPPPPPPPPPPP>
##$VTLIST= <TTTTTTTTTTTTTTT>
##$WBST= 1024
##$WBSW= 4
##$XGAIN= (0..3)
0 0 0 0 
##$XL= 0
##$YL= 0
##$YMAX_a= 371604
##$YMIN_a= -409210
##$ZGOPTNS= <>
##$ZL1= 120
##$ZL2= 120
##$ZL3= 120
##$ZL4= 120
##$ABSF1= 16.522
##$ABSF2= -4.171173
##$ABSG= 5
##$ABSL= 3
##$ALPHA= 0
##$AQORDER= 0
##$ASSFAC= 0
##$ASSFACI= 0
##$ASSFACX= 0
##$ASSWID= 0
##$AUNMP= <proc_1d>
##$AZFE= 0.1
##$AZFW= 0.1
##$BCFW= 0
##$BC_mod= 0
##$BYTORDP= 0
##$COROFFS= 0
##$CY= 12.5
##$DATMOD= 1
##$DC= 0
##$DFILT= <>
##$DTYPP= 0
##$F1P= 14.0000005364418
##$F2P= -0.99999901652339
##$FCOR= 0.5
##$FTSIZE= 32768
##$FT_mod= 6
##$GAMMA= 0
##$GB= 0
##$INTBC= 1
##$INTSCL= 1
##$ISEN= 128
##$LB= 0.3
##$LEV0= 0
##$LPBIN= 0
##$MAXI= 10000
##$MC2= 0
##$MEAN= 0
##$ME_mod= 0
##$MI= 0
##$NCOEF= 0
##$NC_proc= -4
##$NLEV= 6
##$NOISF1= 0
##$NOISF2= 0
##$NSP= 0
##$NTH_PI= 0
##$NZP= 0
##$OFFSET= 16.522
##$PC= 1
##$PHC0= -71.62419
##$PHC1= 5.610014
##$PH_mod= 1
##$PKNL= yes
##$PPARMOD= 0
##$PSCAL= 4
##$PSIGN= 0
##$REVERSE= no
##$SF= 250.13
##$SI= 32768
##$SIGF1= 0
##$SIGF2= 0
##$SINO= 400
##$SIOLD= 32768
##$SREGLST= <1H.CDCl3>
##$SSB= 0
##$STSI= 32768
##$STSR= 0
##$SW_p= 5175.98343685301
##$SYMM= 0
##$S_DEV= 0
##$TDeff= 65536
##$TDoff= 0
##$TI= <Analysis number 999999
Compound Code 99
Book Reference 9
Project Code 9>
##$TILT= no
##$TM1= 0
##$TM2= 0
##$TOPLEV= 0
##$USERP1= <user>
##$USERP2= <user>
##$USERP3= <user>
##$USERP4= <user>
##$USERP5= <user>
##$WDW= 1
##$XDIM= 32768
##$YMAX_p= 350337113
##$YMIN_p= -343402
$$ End of Bruker specific parameters
$$ ---------------------------------
##NTUPLES= NMR SPECTRUM
##VAR_NAME=  FREQUENCY,     SPECTRUM/REAL,   SPECTRUM/IMAG
##SYMBOL=    X,             R,               I
##VAR_TYPE=  INDEPENDENT,   DEPENDENT,       DEPENDENT
##VAR_FORM=  AFFN,          ASDF,            ASDF
##VAR_DIM=   32768,         32768,           32768
##UNITS=     HZ,            ARBITRARY UNITS, ARBITRARY UNITS
##FACTOR=    0.157963299565203, 1,           1
##FIRST=     4132.6476996994, 0,             0
##LAST=      -1043.33573715361, 0,           0
##MIN=       -1043.33573715361, -343402,     0
##MAX=       4132.6476996994, 350337113,     0
$$ Real data points
##PAGE= N=1
##DATA TABLE= (X++(R..R)), XYDATA
$$ [...]
21837G723L7169j7640r855k2205j3673J1444k0853m27o489Q007j9357J0194M9025
21824A3063J3051m3020r990K9105J3604L2518q276k0011J0369l6505j8537J7512
21812g117j2268m8979O279J0662k7627n763L6105J8595n312j621J1532R638M629
21799a1247N111O088p620Q783J3369j8605R265j3057k9163K2764J3072j1462O11
21786a2091O050j7290k4391q487j7913q291M3199J8301R043r33k4362J2742K2091
21773b332p98l2024M100N699o477K6942M0323P122l3316J9007l2117n4742m039
21760f2652N9639j907j0464L2604P180J5484q201j4801n593k6413m411r898K1308
21747h125O129j6527L9757K4860n0734l2351J3949K7059p066K6334n869k3541
$$ plain form
21837 7723 44892 27252 17397 -4808 -18481 -7037 -27890 -28317 -34806 -26799 -46156 -35962 13063
21824 13063 26114 -16906 -26896 2209 15813 48331 40055 20044 30413 -6092 -24629 -7117
21812 -7117 -19385 -68364 -62085 -51423 -79050 -84813 -48708 -30113 -35425 -37046 -25514 -15876 -11247
21799 -11247 -6136 -48 -7668 1115 14484 -4121 5144 -7913 -37076 -14312 -1240 -12702 -12091
21786 -12091 -6041 -23331 -47722 -56209 -74122 -82413 -39214 -20913 -11870 -12803 -37165 -24423 -2332
21773 -2332 -3130 -35154 -31054 -25355 -31832 -4890 35433 42555 9239 28246 -3871 -58613 -62652
21760 -62652 -3013 -4920 -15384 17220 24400 39884 31683 16882 11289 -15124 -19535 -29433 -8125
21747 -8125 -1996 -18523 21234 46094 -4640 -36991 -23042 4017 -3049 23285 17416 -6125
21735f125N001j7421n252L2750J7448j2792n1428J9329m179l9196L3762K4056
21723d047k4913p810n3K0811K089N245j3427j4855J540M2307k1273l0543j4342
21710e9271N332J4548J2513p036K7561L7388O9801M0037M2629L2971k8751q4630
21698A03092m6672O494l4281J3267P648j2170n635j2363m2216K5251n681j7447
21686b0713p89L601l5806Q450M0057K1975O301k6586k6755j8082q8K2534J9215
21673f686j5574k2242P654J6795K9116J9397l31K824q713J3841N639l0891k2191
21660a1362j4287K764J2426j2968j36P224n410j5630K4955K936P818J354o503
21647f819J946J2188o343m9001l7079L945M5077K0772K4812K3957l3059j9687
$$ plain form
21735 -6125 -1124 -18545 -23797 8953 26401 13609 -37819 -18490 -22669 -61865 -28103 -4047
21723 -4047 -28960 -36770 -36823 -16012 -13923 -8678 -22105 -36960 -35420 6887 -14386 -44929 -59271
21710 -59271 -53939 -39391 -26878 -33914 -6353 31035 100836 140873 183502 216473 187722 103092
21698 103092 56420 62914 28633 41900 49548 37378 31743 19380 -22836 2415 -3266 -20713
21686 -20713 -21502 -17901 -53707 -45257 -5200 16775 23076 -3510 -30265 -48347 -48435 -25901 -6686
21673 -6686 -22260 -44502 -36848 -20053 9063 28460 28129 30953 22240 36081 41720 10829 -11362
21660 -11362 -25649 -22885 -10459 -23427 -23563 -16339 -21749 -37379 -12424 -9488 -1670 -316 -6819
21647 -6819 -4873 7315 972 -48029 -85108 -81163 -36086 -15314 9498 33455 396 -19291
21635a9291J7383K4768J7518j459m910m115l1620j9323N852j4120k4539M747Q824
21622d0285L2437k0031o226k2217K341K2912M2619j3800r706R286J177K3577J9243
21609D1327l265j0776j786j4659J8133r948m2392m5477J2987J0156K7734L034
21597a4932j5659m156k699m5087R065L6124L5257N792J2113k7403k5374K3854
21585a3105J3765J6647l1050j6924L4385L3544k1566l5829o310K9725K4456L61
21573B8099N7487k7324n2293k4247N898j2492K1109J1089j127j7625o312K0237
21561B499n317M410J8375M3128M311r107m5466p4123j4949L3802Q644K32J1695
21548b1866L1500k1214Q565k2602k5917n489K1044J7921k0203K7597L929l7095
$$ plain form
21635 -19291 -1908 22860 40378 38919 34009 29894 -1726 -21049 -15197 -29317 -53856 -49109 -40285
21622 -40285 -7848 -27879 -34105 -56322 -53981 -31069 11550 -2250 -11956 -2670 -1493 22084 41327
21609 41327 38062 27286 25500 10841 28974 19026 -23366 -68843 -55856 -45700 -17966 -14932
21597 -14932 -30591 -34747 -37446 -82533 -73468 -37344 -2087 3705 15818 -11585 -36959 -13105
21585 -13105 660 17307 -13743 -30667 3718 37262 15696 -20133 -26443 3282 27738 28099
21573 28099 85586 58262 5969 -18278 -12380 -24872 -3763 7326 6199 -11426 -17738 2499
21561 2499 -2818 1592 19967 63095 67406 58299 12833 -61290 -76239 -42437 -33793 -33561 -21866
21548 -21866 9634 -11580 -3015 -25617 -51534 -57023 -35979 -18058 -38261 -10664 -6735 -43830
21536d3830j8694p230n131o347j521K4678L7491R531J353j6488M4776Q648j3575
21523A3661j1580M405k771K1448j8229k5505k8876j6272J271J1036k8731J5662
21511f4481L4393j0166j5513K0775P523n567m242M519Q493l1405j7521L3970M6007
21498F785K7842K6352j4439k121n3262K409J3632J0311L00K0222m602l3464l1753
21485c1788j7389J0420J3536n582J5145L2741l332j4916l2105k5297k2082J0343
21473g0306K6395o829M1372M8645Q776Q119K7357j1575j6567k7591l3343k5082
21461c0629J1489J0123K0035N468j0399k4916J1237K4570r708J414J4770j7953
21449E501j2432J9118J9256j6508k2314k045K0162q884k0623j1288o021O691J0795
$$ plain form
21536 -43830 -62524 -69754 -74885 -81232 -82753 -58075 -20584 -11053 -9700 -26188 18588 27236 13661
21523 13661 2081 6486 3715 25163 6934 -18571 -47447 -63719 -62448 -51412 -80143 -64481
21511 -64481 -30088 -40254 -55767 -34992 -27469 -33036 -37278 -32759 -24266 -55671 -73192 -39222 6785
21498 6785 34627 60979 46540 44419 -8843 -6434 7198 17509 17809 38031 33429 -35 -31788
21485 -31788 -49177 -38757 -25221 -30803 -15658 17083 13751 -1165 -33270 -58567 -80649 -70306
21473 -70306 -43911 -50740 -9368 39277 48053 56172 83529 71954 55387 27796 -5547 -30629
21461 -30629 -19140 -9017 11018 16486 6087 -18829 -7592 16978 7270 8684 23454 5501
21449 5501 -6931 12187 31443 14935 -7379 -9424 10738 1854 -18769 -30057 -36078 -29387 -18592
21436a8592q291r150k6837J5948K3452R527J965j7218j0679J9561j4901J6326
21424a8889p096P318j9056J073J800K68J734L6373m797J1330J1254L4205O445
21411F1962l0209K4193j6895j0922q16j3281l5358P616O982k2900L689R628n028
21398b1339r73p835n33J051j8554o52k279R896k321k4876r743J7560K5926L2311
21384b361J7680j1656P50j7955k0749j0668K6140j4407L3383J7901j3843n8276
21372e4061k6555j3197K9153Q975L8665M3348L1999J2121k5397k4459j7051k2638
21360a9097j1213r277M4569N0480P209k9382k5144K3641m7988m0806l641J6394
21348d4255J9609r597K048R57J6641N7523J5317o273j8412J2670k9402k4786j3007
$$ plain form
21436 -18592 -26883 -36033 -62870 -46922 -23470 -13943 -11978 -29196 -39875 -20314 -35215 -18889
21424 -18889 -25985 -18667 -37723 -36650 -34850 -34582 -32848 3525 -1272 10058 21312 55517 61962
21411 61962 31753 55946 39051 28129 27313 14032 -21326 -13710 -6728 -29628 -25939 -16311 -21339
21398 -21339 -22312 -30147 -30680 -29629 -48183 -48835 -51114 -41218 -43539 -68415 -78158 -60598 -34672 -2361
21384 -2361 15319 3663 4413 -13542 -34291 -44959 -18819 -33226 157 18058 4215 -54061
21372 -54061 -80616 -93813 -64660 -55685 -17020 26328 58327 70448 45051 20592 3541 -19097
21360 -19097 -30310 -39587 4982 55462 62671 33289 8145 31786 -16202 -57008 -60649 -44255
21348 -44255 -24646 -34243 -32195 -31238 -14597 42926 58243 51970 33558 46228 16826 -7960 -20967
21335b0967k0398O517j776J0403J4798k451m5597o275K562L392J8679J5266j3061
21322c8908J0417K8604Q706j0425l9521k729J4055j0699K1007j3780l0440J6556
21310d7157K4230m543l6840J2136L9849L2006J4789m5519k7686J8164K5309n720
21298i82j1521j1590J6701M0500k9524j5761l5504J3526j010j3340k3215j8485
21286i0205j516N284o427N5839K6101l7311oL3529m445l9036n72J2304J2661L5219
21272A419O191J386n4870k3444R456K2177L638J9615j2154J5735M1657K236r416
21259B3626J7559k3669j4195k4653j0284k2466R031k954m0714m080q442K9175
21247g2066J4536l3905j3018M873Q445J3797K8424J1303L2073M9324O205l1856
$$ plain form
21335 -20967 -41365 -34848 -36624 -26221 -11423 -13874 -59471 -65746 -63184 -59792 -41113 -25847 -38908
21322 -38908 -28491 113 8819 -1606 -41127 -43856 -29801 -40500 -19493 -33273 -63713 -47157
21310 -47157 -22927 -27470 -64310 -52174 -12325 19681 34470 -11049 -38735 -20571 4738 -982
21298 -982 -12503 -24093 -7392 33108 3584 -12177 -47681 -34155 -35165 -48505 -71720 -90205
21286 -90205 -91721 -86437 -92864 -37025 -10924 -48235 -48241 -14712 -19157 -58193 -58765 -46461 -33800 1419
21272 1419 7610 8996 -45874 -69318 -59862 -37685 -34047 -14432 -26586 -10851 30806 33042 23626
21259 23626 41185 17516 3321 -21332 -31616 -54082 -45051 -48005 -88719 -92799 -101241 -72066
21247 -72066 -57530 -91435 -104453 -99580 -91135 -77338 -48914 -37611 -5538 43786 49991 18135
21235A8135l4275p266l7580k24o652M011k1639L41J0465N5493O5656R440j3514
21222D2391j2835m736r550n6927l430L5612J8259K4682k7664j1236l0417o473
21210d2324j1395P40L25R835J7096j1821L7914K9720l8029M933k7124j4864L162
21197d1832K5252K5732M827k3223l4806j9888K8113o109j2604O386J060R869j5343
21184e2566k3426J077L6923R921j7278K3448J9353k1135K461L2275K9780M627
21172D5460j9995j5445k0178l0800j4169L1564N452K5527J5355P719L3319K1797
21160H5606k2830L267j7169m7780j264j5088j6503L7275M0749M218j5665j8536
21148A6280m1428j2281r201J8776k21j4084M4714K2532J5075J0385k3387P22K438
$$ plain form
21235 18135 -16140 -23406 -60986 -61210 -67862 -63851 -85490 -85149 -74684 -19191 46465 55905 42391
21222 42391 29556 24820 15270 -41657 -45087 -9475 8784 33466 5802 -5434 -35851 -42324
21210 -42324 -53719 -52979 -52654 -42819 -25723 -37544 370 30090 -7939 -3006 -30130 -44994 -41832
21197 -41832 -16580 9152 13979 -9244 -44050 -63938 -35825 -41934 -54538 -48152 -47092 -37223 -52566
21184 -52566 -75992 -74915 -37992 -28071 -45349 -21901 -2548 -23683 -21222 11053 40833 45460
21172 45460 25465 10020 -10158 -40958 -55127 -23563 -18111 7416 22771 30490 63809 85606
21160 85606 62776 66043 48874 1094 -170 -15258 -31761 5514 46263 50481 34816 16280
21148 16280 -25148 -37429 -46630 -27854 -28075 -42159 2555 25087 40162 50547 27160 27882 30320
21135C0320K8059k223l3048Q189l0537r298j3498o279Q564K5324l863l0776j6851
21122d5917r881n855J0027M4830J6966l3478k115K7808J1356q648j8326k8686
21110d1919K8969r391m8572J1809J5397J395j3468M8788P036n187j2577K2747
21098E027K9000k2773j6160j5853K2975k9061J240o792l1392J017J1022K5274
21086b6476K700r102o43K1472R973N535L4186j0876l5773M758p037K338p598l5883
21072e2426J5068K6365P662l7160j869j5675l543J6308j0851m4754j3363L1590
21060h2648J2610j7615J372K7828O8008Q710q367N059k0899j956M5527N216l8030
21047D815K507J5404l075K0423k930j6782L0716K065k6469J1311l4864k2890k1469
$$ plain form
21135 30320 58379 56156 23108 31297 760 -8538 -22036 -28315 -19751 5573 1710 -29066 -45917
21122 -45917 -55798 -61653 -51626 -6796 10170 -23308 -25423 2385 13741 5093 -13233 -41919
21110 -41919 -12950 -22341 -70913 -59104 -43707 -42312 -55780 -6992 44 -5143 -17720 5027
21098 5027 34027 11254 -4906 -20759 2216 -26845 -25605 -32397 -63789 -62772 -51750 -26476
21086 -26476 -23776 -32878 -33521 -12049 -2076 3459 37645 26769 -9004 -4246 -11283 -8945 -16543 -52426
21072 -52426 -37358 -10993 -3331 -40491 -42360 -58035 -61578 -45270 -56121 -100875 -114238 -82648
21060 -82648 -70038 -87653 -86281 -58453 9555 18265 9898 14957 -5942 -7898 37629 42845 4815
21047 4815 7322 22726 19651 40074 37144 20362 51078 53143 26674 37985 3121 -19769 -41238
21034d1238j1557K5595L3088j2247K0622K9173j6121r602L1560o977k4805k7734
21022a0243j1523m167n456K5427M153k3499K6145J4593l2030m7912Q45l3628J1973
21009h5322L2681J6874J6283l413m1766j3191L4006J5545q18l5122k0709K2396
20997f2556J1946j0504J6830Q094k5748J743P831J5260l1356j7922K2554J0596
20985e3232M0985J2949n854K4355Q473Q833l7796j5111N576k4715l0934M5139
20973b1332J8018k7614q990J719j1134k1397k5097q690J2048J8703p654P502M8454
20960b5464J978o2804j8904M3921M0522K1080K201k7148J2570L2623K8902k0802
20948B8675k7188l3939m1554o186K4077j9709J484p314K0939N7985j528o369q717
$$ plain form
21034 -41238 -52795 -27200 5888 -6359 14263 43436 27315 17713 49273 42296 17491 -10243
21022 -10243 -21766 -25933 -31389 -5962 -1809 -25308 837 15430 -16600 -64512 -63667 -97295 -85322
21009 -85322 -52641 -35767 -19484 -22897 -64663 -77854 -43848 -28303 -29121 -64243 -84952 -62556
20997 -62556 -50610 -61114 -44284 -36190 -61938 -60195 -52364 -37104 -68460 -86382 -63828 -53232
20985 -53232 -12247 702 -5152 19203 27676 36509 -1287 -16398 -10822 -35537 -66471 -21332
20973 -21332 -3314 -30928 -39918 -38199 -49333 -70730 -95827 -104517 -92469 -73766 -81420 -73918 -25464
20960 -25464 -23486 -86290 -105194 -61273 -20751 329 2530 -24618 -12048 20575 49477 28675
20948 28675 1487 -32452 -74006 -80192 -56115 -75824 -74340 -81654 -60715 -2730 -4258 -10627 -19344
20935a9344j5550P3280K2082m1762m2563K0071r342L4988j7134J0281r287k2454
20923a6734J1356K1320k5339l6024K7237Q938R607o0169O377M3220L9038J3467
20911D2294k5509j2749K573r55j3143J7392j1693k4834J3709j9136j1114J2389
20899c0776k4293K5824L8916j5752m6916k056L5342Q96j7530L9657Q964K945J2968
20886B8189O790j8645j8992m0130k5934J3806M4662J0607N729k194l4399J476
20874b9035O966J6673j5792m6561M1757L7071Q940L9676j6231k8522O010p1n424
20861A5457k19j9912J690J7269j4130M805o304N442J9086L0193M1576n8341j3201
20848B3411r623k692J5753j995k0702n2274j9408M7068L5910Q688j4409l7339
$$ plain form
20935 -19344 -34894 38386 60468 18706 -23857 -3786 -13128 21860 4726 15007 5720 -16734
20923 -16734 -5378 15942 -9397 -45421 -18184 -9246 361 -59808 -53431 -10211 28827 42294
20911 42294 16785 4036 6609 5654 -7489 9903 -1790 -26624 -12915 -32051 -43165 -30776
20899 -30776 -55069 -29245 9671 -6081 -52997 -55053 -19711 -18815 -36345 3312 12276 15221 28189
20886 28189 34979 16334 -2658 -42788 -68722 -54916 -10254 353 6082 3888 -30511 -29035
20874 -29035 -22069 -5396 -21188 -67749 -25992 11079 20019 59695 43464 14942 20952 20881 15457
20861 15457 15238 -4674 -2984 14285 155 4960 -1344 4098 23184 53377 94953 36612 23411
20848 23411 13788 11096 26849 24854 4152 -48122 -67530 -20462 15448 24136 9727 -27612
20836b7612j6872N1545m878k1142j3582N248k9812m2804P824K9254K1815M0947
20824f9J1066L9895J8694k4301j9461j4761o666L5826k001n8275k2217k4445o265
20811g2980n85L6781K1235l277J7257j3278l2885m7416k1911K615J0018M8285
20799e6141P212J856K3716K464J4066n200n333l4280J1367K9259J8641N98L8627
20786D6852K178k5066k0675m2910k3172m452m590L6336J1828K309l182p38l096
20773b8378J3809n766o78r957O942K432L24m0067j3488J7918K7806j1868P302
20760c3669K9683N847l0987J9913n217k6870k8499j9579K0956L2432j5099k6068
20748g7157K8675L0868J9559j8898k643L2515K7570k9989J1724O16R285j7092
$$ plain form
20836 -27612 -44484 7061 2183 -18959 -32541 -27293 -57105 -99909 -92085 -62831 -41016 -69
20824 -69 10997 50892 69586 45285 25824 11063 4397 40223 38222 -20053 -42270 -66715 -72980
20811 -72980 -73565 -36784 -15549 -18826 -1569 -14847 -47732 -95148 -117059 -114444 -104426 -56141
20799 -56141 -48929 -47073 -23357 -20893 -6827 -12027 -17360 -51640 -40273 -11014 7627 8225 46852
20786 46852 49030 23964 3289 -39621 -62793 -67245 -71835 -35499 -23671 -21362 -24544 -25282 -28378
20773 -28378 -14569 -20335 -21013 -30970 -24028 -21596 -21272 -61339 -74827 -56909 -29103 -40971 -33669
20760 -33669 -3986 1861 -29126 -9213 -14430 -41300 -69799 -89378 -68422 -35990 -51089 -77157
20748 -77157 -48482 -17614 1945 -16953 -19596 12919 40489 10500 22224 22840 32125 15033
20736A5033m7823Q024l7457L8526J6217r67N0735k632k808J0113m5958k3798p297
20723c0092n032K643K8488J0298q697L8393j3418R84K1402m9781k1496k182q606
20710c7096l1036j2556M6552m934j175K4968J0702J3592K9325J879j5384l6318
20698a1481k0069l7120o991Q114J6100K064J827R271L4638j5577k8931j2144J9225
20685d1074K1415J3658j7013n050N8401j308l0541k6543l0323K3325O5878j0376
20673B0449J2266j7953o2785J049M4275m1921k3928K1756K6451O843J0215j8833
20661b2116K2734J9368j9955J1033K461m2882j4112J5890M0094m267k0692J27
20649a2317j0092m6508m559L5461p609L919J5115J3108N861k5362l3549J2584
$$ plain form
20736 15033 -32790 -24766 -62223 -23697 -7480 -8447 42288 39656 36848 46961 1003 -22795 -30092
20723 -30092 -35124 -32481 -3993 6305 -2392 36001 22583 23567 44969 -4812 -26308 -28490 -37096
20710 -37096 -68132 -80688 -34136 -39070 -40245 -15277 -4575 9017 38342 40221 24837 -11481
20698 -11481 -31550 -68670 -75661 -67547 -51447 -49383 -47556 -38285 -3647 -19224 -48155 -60299 -41074
20685 -41074 -19659 -6001 -23014 -28064 30337 29029 -1512 -28055 -58378 -35053 30825 20449
20673 20449 32715 14762 -48023 -46974 -2699 -44620 -68548 -46792 -20341 -13498 -3283 -22116
20661 -22116 618 19986 31 11064 13525 -29357 -43469 -27579 12515 8248 -12444 -12317
20649 -12317 -22409 -68917 -73476 -38015 -45624 -41705 -26590 -13482 -7621 -32983 -66532 -53948
20637e3948P765J0581J441J4595J4561J4512N781n50j5766j1056k9303J9003p524
20624b9908L43j9733j8348J963j1210l888K7449Q313M703o934j0387K8182J5869
20611a3586K13k4006j6466l2579K3607L0162M2281j607n3328k8513L8675Q934
20599b6213k6725j3249J2476M404L781N895l1503j1309M505Q127R313J8853R383
20586c2262j19L9124K5582j5811J3045k3685n8261K7032J8736k6143k3037m050
20574e9849J9665J481L877k8916k078L0252P373k1355k1960K4687N0837L613n2598
20561d4971k2327k7611J7915J8915J4204L786l5971K2684O2011L3337k6691m0702
20549b5421k8398K0740N362Q260j3036j1501n582Q62K6808Q612m0713J2326K0078
$$ plain form
20637 -53948 -46183 -35602 -34161 -19566 -5005 9507 15288 14738 -1028 -12084 -41387 -22384 -29908
20624 -29908 -29565 -49298 -67646 -65683 -76893 -80781 -53332 -45019 -40316 -47250 -57637 -29455 -13586
20611 -13586 -13373 -37379 -53845 -86424 -62817 -32655 9626 8019 -45309 -73822 -35147 -26213
20599 -26213 -52938 -66187 -53711 -49307 -45526 -39631 -71134 -82443 -77938 -69811 -60498 -41645 -32262
20586 -32262 -32381 6743 32325 16514 29559 5874 -52387 -25355 -6619 -32762 -55799 -59849
20574 -59849 -40184 -38703 -34826 -63742 -65820 -35568 -28195 -49550 -71510 -46823 4014 7627 -44971
20561 -44971 -67298 -94909 -76994 -58079 -43875 -40089 -76060 -53376 8635 41972 15281 -25421
20549 -25421 -53819 -33079 -27717 -19457 -32493 -43994 -49576 -48714 -21906 -13294 -54007 -41681 -21603
20536b1603N191J8884K0730L0968j6279l4455l3041j2893L1619J5568m0367k8525
20524f4203J6467M1924L774M987J978l1296m3663Q835M7784K1893K4813n094M35
20511B8634n853Q935m0091j0840J2133k6775j9280M1122K1852j9535K3059r799
20499C562k5749Q854o523m968J8529L056m954Q50j8239L5293J4337l1247k3121
20486c0320J7337L7462k6250J69j1467K6178Q452r905R856K8231J0203j214j0691
20473D8041m4861n8407J093K6354P919j5742j3016J0095k3829j0468l7375J803
20461a08393O2591J9714L0746K3396n1658q372L2925J7304K6211J8859k6795m3573
20449g045L1252R751J2812L2478J2852p386j7772r289k5467r4140l0793M2330
$$ plain form
20536 -21603 -16412 2472 23202 54170 37891 3436 -29605 -42498 -10879 4689 -35678 -64203
20524 -64203 -47736 -5812 -2038 2949 4927 -26369 -70032 -61197 -13413 8480 33293 28199 28634
20511 28634 22781 31716 -8375 -19215 -7082 -33857 -53137 -12015 9837 -9698 13361 3562
20499 3562 -22187 -13333 -19856 -24824 -6295 -3239 -8193 -7343 -25582 9711 24048 -7199 -30320
20486 -30320 -12983 24479 -1771 -1602 -13069 13109 21561 11656 21512 49743 59946 58732 48041
20473 48041 3180 -55227 -54134 -27780 -19861 -35603 -48619 -38524 -62353 -72821 -110196 -108393
20461 -108393 -45802 -26088 4658 28054 -23604 -31976 949 18253 44464 63323 36528 -7045
20449 -7045 24207 33958 46770 79248 92100 84714 66942 57653 32186 -61954 -92747 -50417
20437e0417N1890m937l322J3260k3427j4897j9603J2624j2222j975K3426M1472
20425A1872m178k7517J0876n134j870Q581k2896J1769q556R26J5993j1906L151
20412a8889L6615K1669q148k3529K895m1706l0317K1677J6286J2951n500j4251
20400c0247J9540j4357j1695n903n42K9453J5475m286l6593J0348J0906r287J7642
20387i546K8833j5701m6114k198M6226j5373N8937M2831p571k8870j7454j2122
20375B1878p032j1134n8323k3105j573K0286K3886J4148M137r06j1570q511j2055
20362d9874p832j3855K3306L1216J3704j9832j2271M59J9610K3245j0224Q980
20350F632k3522q567P519Q089Q950k8127m3479l4589K160L2180n283J6587j7532
$$ plain form
20437 -50417 1473 -3464 -6786 6474 -16953 -31850 -51453 -38829 -51051 -53026 -29600 11872
20425 11872 7694 -19823 -8947 -14081 -15951 -7370 -30266 -18497 -27053 -26127 -10134 -22040 -18889
20412 -18889 17726 39395 31247 7718 10613 -31093 -61410 -39733 -23447 -10496 -15996 -30247
20400 -30247 -10707 -25064 -36759 -42662 -43204 -13751 1724 -2562 -39155 -28807 -17901 -27188 -9546
20387 -9546 19287 3586 -42528 -44726 1500 -13873 45064 87895 80324 51454 34000 21878
20375 21878 14846 3712 -54611 -77716 -79289 -59003 -35117 -20969 -16832 -17738 -29308 -37819 -49874
20362 -49874 -57706 -71561 -48255 -17039 -3335 -23167 -35438 -34979 -15369 7876 -2348 6632
20350 6632 -16890 -25457 -17938 -9849 -899 -29026 -72505 -107094 -104934 -72754 -78037 -61450 -78982
20337g8982J6745K7645L8433j1115J2749K6260q86n7493l135J5763K680l2537
20325d3873N1635J075j4644K156l8524J547L4055K8078N030j490K300l5420j8484
20312b6559J2317M3076m098k7275K449K2854k6681k5926J918L0302L4933K5901
20300F3211K600K0068j0157m0502k5700o721O122L8044j0373k756Q211k6977j8285
20287c215j454J6262L4311J0613m3563p629J6279K7679p955p758l0723l6961j8128
20274e2242j9165j018J8170O714K7064J1514k316k8455l1610K0310L3397K3848
20262F211J281o760j5639p929l3796m814M8071L1680O648j9516K9505j2994k8008
20249f060k7818P402J2599J0347p793l5417L2278L5749P141j7587P507Q653j8318
$$ plain form
20337 -78982 -62237 -34592 3841 -7274 5475 31735 30849 -26644 -29779 -14016 -11336 -43873
20325 -43873 7762 8837 -5807 -3651 -42175 -40628 -6573 21505 26535 25045 27345 -8075 -26559
20312 -26559 -14242 28834 24736 -2539 -90 22764 -3917 -29843 -27925 2377 37310 63211
20300 63211 65811 85879 75722 35220 9520 2799 8921 46965 36592 33836 42047 15070 -3215
20287 -3215 -4669 11593 45904 56517 12954 5325 21604 49283 41328 33570 2847 -34114 -52242
20274 -52242 -71407 -72425 -54255 -47541 -20477 -8963 -11279 -39734 -71344 -51034 -17637 6211
20262 6211 7492 732 -14907 -22836 -56632 -61446 -13375 18305 24953 5437 34942 21948 -6060
20249 -6060 -33878 -26476 -13877 -3530 -11323 -46740 -14462 21287 28428 10841 18348 27001 8683
20236H683l0540p333j8226m071m562N018q19K3902k0336N884L7365N714k0817
20223b0138J3583L1776L3164j9228j5361J37k3720j1101J9902K7141L0660j0075
20211E6740m1183k4193k8125J5006l86N685k3026J0790K2629p827k2891j4003
20199e0784M0492K1672j9725O506m651j4710J7190j2361K632J5757J098k2557
20187a9441J1968N633k8919J7139K4290j7892P449K1478Q887m4802k8237l0417
20175g2864j5986K4908L5101j51J8808J9036m9224k615L9888k39o8563k400M3794
20162c0507M1914R606Q702k117n7022l402P960J0807k5476j7752r707Q089K0986
20149c7919L0929l42k3702J6826P770O820o837j1601j6j5660k0879Q854K2384
$$ plain form
20236 8683 -21857 -29190 -47416 -51487 -56049 -51031 -51850 -27948 -48284 -42400 -5035 679 -20138
20223 -20138 -6555 25221 58385 39157 23796 23933 213 -10888 9014 36155 66815 56740
20211 56740 15557 -8636 -36761 -21755 -22141 -16456 -39482 -28692 -6063 -13890 -36781 -50784
20199 -50784 -10292 11380 -8345 -1839 -6490 -21200 -4010 -16371 -13739 2018 3116 -19441
20187 -19441 -7473 -1840 -30759 -13620 10670 -7222 227 21705 30592 -14210 -42447 -72864
20175 -72864 -88850 -63942 -28841 -28992 -10184 8852 -40372 -42987 -3099 -3338 -71901 -74301 -30507
20162 -30507 11407 21013 29715 27598 -29424 -32826 -24866 -14059 -39535 -57287 -66994 -58905 -37919
20149 -37919 -6990 -7332 -31034 -14208 -6438 382 -6455 -18056 -18072 -33732 -54611 -45757 -23373
20136b3373M150J6941J7324l5605j6208j2620L6394J247l8964K6164J9979l087
20124g658K0368r179K0024K0047l0038Q398j4329K448K1k7723r053K9481J2305
20111A5112p842k869o647k9109J6472K3542k6969j1228j6433j0299j775K7489
20099c0556J9298k1083J5699N593j7295j0871q030N916J6307l102J1226J1705
20087e193p904k1311J8194K1134l2221j6440J5046M647j2202P816q351k732Q839
20074c0678o631j907j4644M7009M9901Q615l3791k3994P835J4361L199l7242n8894
20061g6861j730M3014L2298K4939L057k1940j8616m2498k5945n948K9990j33K0929
20048c9444m1447j8311J1120J3567K888J9020J6219J5952j418k4884j4850l492
$$ plain form
20136 -23373 -19223 -2282 15042 -20563 -36771 -49391 -12997 -11750 -50714 -24550 -4571 -7658
20124 -7658 12710 3531 23555 43602 13564 21962 7633 10081 10102 -17621 -26674 2807 15112
20111 15112 7270 4401 -2246 -31355 -14883 8659 -18310 -29538 -45971 -56270 -58045 -30556
20099 -30556 -11258 -32341 -16642 -11049 -28344 -39215 -47245 -41329 -25022 -28124 -16898 -5193
20087 -5193 -13097 -34408 -16214 4920 -27301 -43741 -28695 -24048 -36250 -28434 -36785 -39517 -30678
20074 -30678 -37309 -39216 -53860 -6851 43050 51665 17874 -6120 1715 16076 19275 -17967 -76861
20061 -76861 -78591 -35577 -3279 21660 24717 2777 -15839 -58337 -84282 -90230 -60240 -60373 -39444
20048 -39444 -80891 -99202 -88082 -74515 -71627 -52607 -36388 -20436 -21854 -46738 -61588 -65080
20036f5080N499K0090k0602j4949n903K859K7973K4488L2341j4645J710l054L0351
20023B1078k1877k3631k3510J2656k591l3425J4077j7166K0302J5599p309o185
20011e1982O29L9128L5254m3429j0597l0744J7030N1147j0134q997K7259J3232
19999B7796K4020J4258k5460n2591o017J278l1978k7918k0929J2313j073K1004
19987f5297N2855N215J2054k5272l9718N965Q480P912M8535l698j2580K8876J7276
19974D0603L965l759m9846K649L8709K3793K8m5154n1166Q269j0864O02r900K1078
19960c0993L3587r381k1882J124k921k237j4525l3306J3368M8497M5307J4448
19948D1086j2537m983N061l5304j0737q95n810k3169m63j4458j1822J7203p470
$$ plain form
20036 -65080 -59581 -39491 -60093 -75042 -80945 -78086 -50113 -25625 6716 -7929 -6219 -9273 21078
20023 21078 -799 -24430 -47940 -35284 -37875 -71300 -57223 -74389 -54087 -38488 -45797 -51982
20011 -51982 -51353 -12225 23029 -20400 -30997 -61741 -44711 6436 -3698 -12695 14564 27796
19999 27796 51816 66074 40614 -11977 -17994 -16716 -48694 -76612 -97541 -85228 -86301 -65297
19987 -65297 -12442 -7227 4827 -20445 -60163 -54198 -45718 -37806 10729 7031 -5549 23327 40603
19974 40603 44568 40809 -9037 -6388 32321 56114 56142 10988 -40178 -31909 -42773 -42171 -52071 -30993
19960 -30993 2594 -6787 -28669 -27545 -30466 -32703 -47228 -80534 -67166 -18669 26638 41086
19948 41086 28549 23566 28627 -6677 -17414 -18309 -24119 -47288 -47751 -62209 -74031 -56828 -64298
19935f4298o739q987M2730N9454m737k4057J5589J6735j0742l4963j2559P567
19923b5007J6860j6483k3591J2103J3235m419j2448l3521j4304j8592L6924N224
19911f4019j9240N028Q593K6569J5262k7131k1536L1297N452J5939M4110k147
19899A8177q525j1166K588L365Q800J7190j6395o720l668j5841k6959l966j05
19886d3225j6330J2604K2355L0186p180k7800K0837J9451q726m9313K1367L1743
19874E969K4356L1928j7182j9379R19j7444j3430R35j2861Q181j174j6316j7538
19861d3036M9603K5979n422k7817k5562n917J2116j245K9467J201o745n541O336
19848C417j0783J0013O611Q721J2146k8570k1837J4991J7111J5706j1034k8684
$$ plain form
19935 -64298 -71037 -80024 -37294 22160 17423 -6634 8955 25690 14948 -20015 -32574 -25007
19923 -25007 -8147 -24630 -48221 -36118 -22883 -27302 -39750 -73271 -87575 -106167 -69243 -64019
19911 -64019 -83259 -78231 -69638 -43069 -27807 -54938 -76474 -45177 -39725 -23786 20324 18177
19899 18177 9652 -1514 1074 4439 13239 30429 14034 7314 3646 -12195 -39154 -43120 -43225
19886 -43225 -59555 -46951 -24596 5590 -1590 -29390 -8553 10898 2172 -47141 -25774 5969
19874 5969 30325 62253 45071 25692 26611 9167 -4263 -3328 -16189 -8008 -9182 -25498 -43036
19861 -43036 6567 32546 27124 -693 -26255 -32172 -20056 -21301 8166 9367 2622 -2919 3417
19848 3417 -7366 2647 9258 17979 30125 1555 -20282 -5291 11820 27526 16492 -12192
19836a2192j6942K7916L4855l5591j6496k409l139P478L0404l3261l8007O904
19824e0480L1203J3262P579j0960j3109K0441N718O237l3394j1678K2167K8887
19812A5873K5493M658j4394K9552K7459k4227k9927j7659j5688O978n788j3591
19800a1261J6002m3485k9685J0438J5681J4911k0327p907M791j2547L4212k420
19788c1597k785J0256k1255j1682P816K861k429k8632J5350j3150o780L894M6564
19775c1569n90J4358k1631l2606M738K381o468J4901K1856L3169O621J198l9163
19762c2805J434J3281J9874l3135l6683M02j5077j4784J9226K0671k6404j1677
19750i5677O894J1972J5718O4729P898k8444L7791K9579R253k7064k6325K1238
$$ plain form
19836 -12192 -29134 -1218 33637 -1954 -18450 -20859 -23998 -16520 13884 -19377 -57384 -50480
19824 -50480 -19277 -6015 1564 -9396 -22505 -2064 3654 9891 -23503 -35181 -13014 15873
19812 15873 41366 46024 31630 61182 88641 64414 34487 16828 1140 8118 2330 -11261
19800 -11261 4741 -38744 -68429 -57991 -42310 -27399 -47726 -55633 -50842 -63389 -29177 -31597
19788 -31597 -34382 -24126 -45381 -57063 -49247 -46386 -48815 -77447 -62097 -75247 -82027 -78133 -31569
19775 -31569 -32159 -17801 -39432 -72038 -67300 -64919 -71387 -56486 -34630 -1461 5160 6358 -32805
19762 -32805 -31371 -18090 1784 -31351 -68034 -67632 -82709 -97493 -78267 -57596 -84000 -95677
19750 -95677 -88783 -76811 -61093 3636 11534 -16910 20881 50460 59713 32649 6324 27562
19738B7562o812n666m101J964K9k7328j8651L4276k5825K4765R898l141l4687
19725b7717J0363K9034k0491j5939P116l935k0155L4158K957j3036k7760j8561
19713f3966L684J4748L3394n047p6831R297M1658l0350N306K459l40J26K9160
19700c6702M2127J8762k0292P750N197k5460J4712K856k5942m913k3063j0061
19688e5029O845K7279O909j6838J133J3332j4888k2952M26N606J4524p538j3117
19675e4308j4551j0356K3658M1174j1060K9336r989n3258r133j2235p831L8766
19663d9787L8198P198J2067Q2q493J3768o441k3982k298M2456J0972l4618l6510
19650c7388K3607L9049j3630n8251l1775J9920M3611K4150k6719k3228q840M4705
$$ plain form
19738 27562 20750 15084 10983 12947 12976 -14352 -33003 1273 -24552 213 10111 6970 -27717
19725 -27717 -17354 11680 -8811 -24750 -17634 -21569 -41724 -7566 -4609 -17645 -45405 -63966
19713 -63966 -60282 -45534 -12140 -17187 -94018 -84721 -43063 -73413 -68107 -65648 -65988 -65862 -36702
19700 -36702 5425 24187 3895 11645 16842 -8618 6094 8950 -16992 -21905 -44968 -55029
19688 -55029 -48184 -20905 -13996 -30834 -29701 -16369 -31257 -54209 -53783 -48177 -33653 -41191 -54308
19675 -54308 -68859 -79215 -55557 -14383 -25443 3893 -6096 -59354 -68487 -80722 -88553 -49787
19663 -49787 -11589 -4391 7676 7758 -735 13033 6592 -17390 -19688 22768 33740 -878 -37388
19650 -37388 -13781 25268 11638 -46613 -78388 -58468 -14857 9293 -17426 -40654 -49494 -4789
19638d789Q040k537j0675l416m189K544P773k777K350j8025K2741L3802m7632
19625a6790l0424k0775M0653M756n2382k507J7988J2858M1161m3364k2350N4299
19613a6877K694j0746L9463j8509J8514J2772l5808k6625l0250J6433K7396l0708
19601e2251j5071J0925N3254j8070P248J9569K5006O897l1432N501j2964l8188
19589c9576j6238K3802L2190j4071j7462N586j7515j0495O0787N756o381n189
19577A194Q782k759j3382l2471k2162j4522m260K106L5671L5913j875l1403P425
19564c1743K7464M4722k456r191p696k191K2980n711N78K5226J1470j1592k5753
19551C6107j4979R384J3138j1704l2040l0919L2457J4296q046K227l260m603n400
$$ plain form
19638 -4789 3251 714 -9961 -13377 -17566 -15022 -7249 -10026 -7676 -25701 -2960 30842 -16790
19625 -16790 -47214 -67989 -27336 -22580 -74962 -77469 -59481 -46623 -5462 -48826 -71176 -16877
19613 -16877 -14183 -24929 14534 -3975 14539 27311 -8497 -35122 -65372 -48939 -21543 -52251
19601 -52251 -67322 -56397 -3143 -21213 -13965 5604 30610 37507 6075 11576 -1388 -39576
19589 -39576 -55814 -32012 178 -13893 -31355 -25769 -43284 -53779 7008 12764 6383 1194
19577 1194 9976 7217 -6165 -38636 -60798 -75320 -79580 -77474 -41803 -5890 -7765 -39168 -31743
19564 -31743 -4279 40443 37987 28796 21100 18909 41889 36178 36756 61982 73452 61860 36107
19551 36107 21128 30512 43650 31946 -94 -31013 1444 15740 7694 9921 6661 2058 -3342
19538c342j9100J688P465J395r40o50l305j8829k755r301J4899l096Q620P202
19524b0049k367k6745k1466M514R784j0081J3036K446k566j6718j4941l6569N099
19511a16623O0128O274O806k7255k511M2533M3628M74j253p651k4801J0141J0020
19498i0K7254n7400P9K5900m026m380J1860q374K9965j8536k87K8739k5283j1240
19484e819K3850O0644M194K5372l5146L0093K1270j3761K2243M5565J7004k7288
19472A68221l0312p434j6908J5498l9276o1556j9169J370J1254Q436K7664n329
19460E2459J049k5956j1443k0250l0108K7272J0949k3701j1876O781L4069M3622
19448E2867k763k0733l3221k4404l2530j1201K940J893K8012M5334O891K0208
$$ plain form
19538 -3342 -22442 -20754 -13289 -11894 -12834 -13484 -16789 -35618 -38373 -47674 -32775 -35871 -27251 -20049
19524 -20049 -22416 -49161 -70627 -66113 -56329 -66410 -53374 -50928 -53494 -70212 -85153 -121722 -116623
19511 -116623 -56495 -50221 -43415 -70670 -73181 -30648 12980 13454 12201 4550 -20251 -10110 -90
19498 -90 27164 -30236 -30157 -4257 -8283 -12663 -803 -9177 20788 2252 1965 30704 5421 -5819
19484 -5819 18031 78675 82869 108241 73095 103188 124458 110697 132940 178505 195509 168221
19472 168221 137909 130475 113567 129065 89789 28233 9064 10434 21688 30124 57788 52459
19460 52459 53508 27552 16109 -4141 -34249 -6977 3972 -19729 -31605 -24824 9245 52867
19448 52867 50104 29371 -3850 -28254 -60784 -71985 -69045 -67152 -39140 6194 13085 33293
19436C3293L1889j2846n864K5594N0622N3595M517k1323j1533m6271l2842L0857
19424I9688j6365K3929R7l2300P848M263J4630k5181M464l4531p610k3386n729
19411I817M1582r47O949Q366o681j1122P729l2543j3929m6964j1717N1796K9794
19398C2130r322l3840l7297P36R648j2583J1119L6339l254n239j5511p788O279
19385b8583K305J9380k2007l6741L2564N0514K3220J4849l4408l5375m356q335
19373b6973k3136J3489P502q19J3294m138k3265j6519J8708K0976J7686J2357
19361I162M778k1537n0627l8361nO7145L4642j124j5115o376O400L3964l392Q238
19347B7792R919k802p70n928K445l008o219k988R100K8885m2645k2279o332L0236
$$ plain form
19436 33293 65182 52336 46472 72066 122688 176283 180800 159477 147944 101673 68831 99688
19424 99688 83323 107252 107349 75049 82897 87160 101790 76609 81073 46542 38932 15546 9817
19411 9817 51399 50452 57401 65767 59086 47964 55693 23150 9221 -37743 -49460 2336 32130
19398 32130 22808 -11032 -48329 -47593 -37945 -50528 -39409 -3070 -6324 -11563 -27074 -34862 -28583
19385 -28583 -26278 -6898 -28905 -65646 -33082 17432 40652 55501 21093 -14282 -18638 -26973
19373 -26973 -50109 -36620 -29118 -29937 -16643 -20781 -44046 -60565 -41857 -20881 -3195 9162
19361 9162 13940 -7597 -58224 -96585 -96590 -29445 5197 4073 -11042 -17418 -11018 22946 19554 27792
19347 27792 37711 34909 34139 28211 30656 27648 21429 18441 27541 56426 13781 -8498 -14830 15406
19333A5406J4935J6056j0034n526l9471M679J8907J9897j4887j7397j110J6137
19321A7592l1611j1559J7879r918p956K6330K6984J3607k0095K4702l2771J4160
19309B7344L2671J666L737l1616o958p483j4457j4248K0609K8117J5824k412J5042
19296F7836j3475k992q583m0205k7255l1966o368P240j0243K377O424L9352O5954
19283D8096Q020j8736J5071j971k815l5884O94q011j8673m8735l2536N1493N1971
19270G984m2388m877M578J2557P777L3186k557l822o044J365K7014J7405n7111
19257d933j9507m2117j8486J1576N1728J2896M0316p316l9118j2526O686R661
19245a1140k4835k1334O3329N4876k8190k6420m4519j1094K6029n461q435K0802
$$ plain form
19333 15406 30341 46397 36363 30837 -8634 -3955 14952 34849 19962 2565 1455 17592
19321 17592 -14019 -25578 -7699 -17617 -25573 757 27741 41348 21253 45955 13184 27344
19309 27344 60015 61681 65418 33802 26844 19361 4904 -9344 11265 39382 55206 52794 67836
19296 67836 54361 51369 42786 2581 -24674 -56640 -63008 -55768 -66011 -63634 -57210 -17858 48096
19283 48096 56116 37380 52451 50480 47665 11781 12475 4464 -14209 -62944 -95480 -43987 7984
19270 7984 -34404 -39281 -34703 -22146 -14369 18817 16260 12438 6394 7759 34773 52178 -4933
19257 -4933 -24440 -66557 -85043 -73467 -21739 -8843 31473 24157 -14961 -27487 -20801 -11140
19245 -11140 -35975 -57309 6020 60896 32706 6286 -38233 -49327 -23298 -28759 -37194 -16392
19233a6392p973J214L5705L6227m9859l8736k8306M929N7217J9146m1235r305
19221c7368n05R273j6461j9058O40L4747M9046o297j9537J5032n3157l3769l096
19208h0510Q720M4600M5703K678l6090K557j788K4087J5920l8242k026P999K120
19195d272o767j4273J6693J9160j7209J4513N380J204M175m1648l7593K4997L4389
19182a251q686K565n288p0338j9325L3344M9020L1718L1260k9759k2540k0677
19170b9957K527m336k1175l814K0838J1439L1570j9015j3473N380n026J2348N88
19157a2106M506j9960O12m32m39J4233J736K5215K4456m028j5642J4666j4751
19144A8066m8995j9855J386j6417J701o250O271O6311K1057Q224q342j4628J0888
$$ plain form
19233 -16392 -24365 -23151 12554 48781 -1078 -39814 -68120 -63191 -5974 13172 -28063 -37368
19221 -37368 -37873 -28600 -45061 -64119 -63479 -28732 20314 14017 -5520 9512 -43645 -77414 -80510
19208 -80510 -71790 -27190 18513 21191 -14899 -12342 -14130 9957 25877 -12365 -14391 -6392 -4272
19195 -4272 -11039 -25312 -8619 10541 -6668 7845 13225 14429 18604 -23044 -60637 -35640 -1251
19182 -1251 -9937 -7372 -12660 -82998 -102323 -68979 -19959 11759 43019 13260 -9280 -29957
19170 -29957 -27430 -31766 -52941 -56755 -35917 -24478 7092 -11923 -25396 -20016 -25042 -12694 -12106
19157 -12106 -7600 -27560 -26948 -27380 -27819 -13586 -11850 13365 37821 33793 18151 32817 18066
19144 18066 -30929 -50784 -49398 -65815 -64114 -70364 -64093 2218 23275 31499 23157 8529 19417
19131A9417K3921k2357N582L082P480J7167Q385J494k0639j0673j012k0790k1777
19118a0720j3584n5894m900N97L0232J1947j0940L6060L0458L3605j8068r13L8215
19105F6095K1619l5220n91O838j2621l5078m8943m734O5031M8963k650M687k6597
19092D6799j1645j054L3662m063O088j0506o2981n2561K7756M2712P479L5509
19080E7195k6431j0251J5337J2763k8598O205j7066r847j5762k501P448K0661
19068I153J1793J7853J1369j4525k3183j4226p488N712J432J1365l0006J4143
19056f608O3546o877K2330l528l6933k5115q599j1553K4915P92M3k4907k280j3871
19042b8645K9455P04n6199l6757M883K6949L9137j4229O708J9748q247o48l604
$$ plain form
19131 19417 43338 20981 26563 29645 37125 54292 62677 64171 43532 32859 31847 11057 -10720
19118 -10720 -24304 -80198 -85098 -84501 -54269 -42322 -53262 -17202 13256 46861 28793 27880 66095
19105 66095 87714 52494 51903 58741 46120 11042 -37901 -42635 22396 71359 68709 73396 46799
19092 46799 35154 34100 67762 63699 69787 59281 -3700 -56261 -28505 14207 21686 57195
19080 57195 30764 20513 35850 48613 20015 26220 9154 -693 -16455 -18956 -11508 9153
19068 9153 20946 38799 50168 35643 12460 -1766 -9254 -3542 -2110 9255 -20751 -6608
19056 -6608 56938 50061 72391 68863 31930 6815 -1784 -13337 11578 12370 12413 -12494 -14774 -28645
19042 -28645 810 1514 -54685 -91442 -86559 -59610 -20473 -34702 -27994 -8246 -16493 -17141 -20745
19029b0745j189J9162N073j1741J4738J4396j2391j5834k879n321m852K5876l1431
19016b7138k030K585j1950L253J9298K8872m3663J8361M5209P898N929j547j1227
19003C3850O870j342Q07j1373j8281m975K7841j9651j8939m634j0674K1892M0973
18990D2364l03J7470J7070k9790m3399K2190j7571j0047K8019J8430K7696j1939
18978F0190j5623J5412K6592k3448l2502j8355k5116q992J351J2586J5758j3021
18966e168R01M7295j264r722j1851j600K3558P404P339l9003k033L4698Q853k4591
18952C4816P944J2188l4400l4136J0324J9743j6672j6978n223L3429J4996l4277
18940h246q619J5984L7096K6023k0039L558J1022j325k6598k957N840J9746k3773
$$ plain form
19029 -20745 -21934 -2772 2301 -9440 5298 19694 7303 -8531 -11410 -16731 -21583 4293 -27138
19016 -27138 -29168 -26583 -38533 -35280 -15982 12890 -30773 -12412 32797 40695 46624 45077 33850
19003 33850 40720 39378 40185 28812 10531 5556 33397 13746 -5193 -9827 -20501 1391 42364
18990 42364 42061 59531 76601 46811 3412 25602 8031 -2016 26003 44433 72129 60190
18978 60190 44567 59979 86571 63123 30621 12266 -12850 -21842 -20491 -7905 7853 -5168
18966 -5168 -4267 43028 41764 32042 20191 18591 42149 49553 56892 17889 15856 50554 59407 34816
18952 34816 42760 54948 20548 -13588 -3264 16479 -193 -17171 -22394 11035 26031 -8246
18940 -8246 -16865 -881 36215 62238 42199 45757 56779 55454 28856 25899 31739 51485 27712
18927B7712K469K8063Q655j4400K4189J231k0611r645Q422J3842l3711j395j5640
18914A9181K4448K2706l1202j1844l2428M937J5839j9605l1345M1482M1274M945
18902D8388j4122k6393o90M407j5684J0923J6911O96l6527J5132m89j4915j6528
18889b8891j149r284J1566K2399K6136K242K0985J3087m991k877o1495l5831j5929
18876f4032P081J3544M7132J2194O995N328l978K0904q088J9304l0191P602Q944
18863D2739k4376l8622J5830j770l5494K7380N8208K5866J6211n9543l826K3844
18851D6447k479K5773j6672j0534p641Q893o0891m2502M0982J1093K0230l4809
18839b2110Q857J3791r039K2207K4160r916o950k0990l6381o645L5633N3024P481
$$ plain form
18927 27712 30181 58244 66899 52499 76688 77919 57308 47663 56085 69927 36216 34821 19181
18914 19181 43629 66335 35133 23289 -9139 -4202 11637 -7968 -39313 2169 43443 48388
18902 48388 34266 7873 7183 11590 -4094 6829 23740 24436 -12091 3041 2552 -12363 -28891
18889 -28891 -30040 -39324 -27758 -5359 20777 23019 44004 57091 52100 49223 -12272 -48103 -64032
18876 -64032 -56951 -43407 3725 15919 22914 28242 24264 45168 37080 56384 26193 33795 42739
18863 42739 18363 -20259 -4429 -6199 -41693 -14313 43895 69761 85972 26429 22603 46447
18851 46447 43968 69741 53069 42535 34894 43787 -17104 -59606 -18624 -7531 12699 -22110
18839 -22110 -13253 538 -8501 13706 37866 27950 21000 10 -36371 -43016 -7383 45641 53122
18826E3122k0547m7597j7934l159N429L7334J4696j1130N886J2325m342L382O671
18813C4136j2470J1236K018j5141l4717O049N6485J5599q66k0093m6618K3637
18801A9255M8108k8874J2562L4122K7701l968Q699m082k3637K6485j0741n843
18789I9787K0048j5161k9147k0097m2724J8131n421j5084K6903P116J467J6405
18777F2223K758q288k9411m880l72K9807K6727K0068L7359N7824R4378O1044J6102
18764C65339j6848o0817j05149p9986k7088n1248m919k2137K5158J8755K0638
18753F1698j2021K9279K0912K0166j1377m2430l4185l8107r344M4485N5792l1927
18741E2941k1555j5310l9414k5691j2367K3570K5891J1315J5296L0404J4456j4084
$$ plain form
18826 53122 32575 -15022 -32956 -36115 -30686 6648 21344 10214 16100 28425 24083 27465 34136
18813 34136 21666 32902 34920 19779 -14938 -8889 47596 63195 62329 42236 -4382 19255
18801 19255 67363 38489 51051 85173 112874 108906 117605 113523 89886 116371 105630 99787
18789 99787 119835 104674 75527 55430 12706 30837 25416 10332 37235 44351 45818 62223
18777 62223 64981 56693 27282 22402 22030 51837 78564 98632 135991 193815 288193 349237 365339
18764 365339 348491 287674 182525 102539 75451 24203 19284 -2853 22305 41060 61698
18753 61698 49677 78956 99868 120034 108657 66227 32042 -6065 -15409 29076 84868 52941
18741 52941 31386 16076 -23338 -49029 -61396 -37826 -11935 -620 14676 45080 59536 45452
18729D5452J5905j1229k9186Q884R545j3444N157p137M729j4201K1261K8826M17
18716F4979j6121k3379J2952M3210m329J9941J4357j9544P981j3394J4796O3601
18704A65050n545K724O2555J22885J56297J91195K03868K19466J56906l4772j40423
18693A100206k54375k69071j63664j18942r3794o9454k6242J8923K7070p599k4016
18682A19042J5115J5348L3956P4832P5603J41664K10721K41974K15260J15293
18672A258808p2045j39322j97825k42864k11574j04901n6794l6342l6728O568
18662A66981m291j0673p936k1770m7964m6900k2703K9645j820m168Q95l0617Q37
18649d84K0760K4353o666o99M6749J4409j9060l8440j8089j597K594O126R375
$$ plain form
18729 45452 61357 50128 20942 29826 39371 25927 31084 23947 28676 14475 35736 64562 64979
18716 64979 48858 25479 38431 81641 77312 97253 111610 92066 100047 86653 101449 165050
18704 165050 159505 162229 224784 347669 503966 695161 899029 1118495 1275401 1240629 1100206
18693 1100206 845831 576760 413096 294154 200360 130906 104664 123587 150657 143058 119042
18682 119042 134157 149505 183461 258293 333896 475560 686281 928255 1143515 1258808
18672 1258808 1186763 1047441 849616 606752 395178 290277 233483 197141 160413 166981
18662 166981 162690 152017 144081 122311 74347 27447 4744 34389 32569 28401 29296 -1321 -484
18649 -484 20276 44629 37963 37264 84013 98422 79362 40922 22833 21236 23830 29956 39331
18636C9331j2955K396J5625P859P939M827k6753n0094q144L5425r906k736J9463
18623B2277L4718j0768l8368m7268J554J8923l3017j6386N3842M9806K0315l8915
18611A6713j9038n521M0594o818n4884j5234J2377o650L2452K9588k4105J5050
18599A4524K2533J3256j3975j2075R898l7178l0260M0043L8553l508J568L0574
18587G3953j6321J6735k1925M031j9214l2181J3559L1335K2310m0805J0670J368
18575D3515J7443j7170k1109q279J8559J0606j2479j8370K8036K3519J069O037
18563G1377k0841j465o648J3780J6825j0788M919Q279l2553j9786N109j840J3822
18550D0190n41k7710K3113j3199j8699J465j5605p604K3049L7155M0061O071m9233
$$ plain form
18636 39331 26376 28772 44397 52256 60195 65022 38269 -11825 -19969 15456 5550 2814 22277
18623 22277 56995 46227 7859 -39409 -37855 -18932 -51949 -68335 -14493 35313 55628 16713
18611 16713 -2325 -7846 32748 25930 -28954 -44188 -31811 -38461 -6009 23579 -526 14524
18599 14524 37057 50313 36338 24263 34161 -3017 -33277 6766 45319 41811 43379 73953
18587 73953 57632 74367 52442 56473 37259 5078 18637 49972 72282 31477 42147 43515
18575 43515 60958 43788 22679 14400 32959 43565 31086 12716 40752 64271 65340 71377
18563 71377 50536 49071 42423 56203 73028 62240 67159 75438 42885 23099 28208 26368 40190
18550 40190 39649 11939 35052 21853 3154 4619 -10986 -18590 4459 41614 81675 87746 38513
18537C8513k3223o321L3203r219P273j0451K1842K4830k615M187j5501k1966k7399
18524A3153K42m32K1728K3529J3332L632J4287J9233K55k115l5370K0630L8559
18511A30663K1366K0523L0791P864K5988K5669o443K439K2383K1628L7343L5765
18499C75979K5144K9880N6352J21132J47583J52101K46848M50514O76458Q28868
18489C110859Q30121M52575j77363l92768q26829q25454n29089k42837n5361J12493
18479A456347L51877O43654O88854O77136M56499j88256m58827q40884r46405
18470A839995o56624l53760k18446j51675j09035q8289o6495j5608n5427n2547
18460G2089L8996K1932O60N760l0837O477M1996K2372l3227l6483j5833J304l784
$$ plain form
18537 38513 15290 8969 42172 32953 40226 29775 51617 76447 73832 78019 62518 40552 13153
18524 13153 13395 12963 34691 58220 71552 75184 89471 108704 108959 106844 71474 92104 130663
18511 130663 152029 172552 203343 211207 237195 262864 256421 258860 281243 302871 340214 375979
18499 375979 401123 431003 487355 608487 756070 908171 1155019 1605533 2281991 3110859
18489 3110859 3940980 4393555 4216192 3823424 2996595 2171141 1642052 1399215 1343854 1456347
18479 1456347 1808224 2451878 3140732 3817868 4274367 4086111 3627284 2786400 1839995
18470 1839995 1183371 829611 611165 459490 350455 262166 195671 180063 124636 72089
18460 72089 111085 133017 133677 139437 108600 115077 157073 179445 146218 109735 93902 95206 91422
18447I1422q034K4464M74J9823l0029j3216q937K7296L0373q595K4781n234r220
18434A35368m4212k1352K774p901k1232R494o06l683Q342j4494Q522l0882r401
18421A0737K2245J1754j6995k5148q698M6810R528K6117q125j7227j0283j751
18409C8964k316L8684L3881q421m1140K030j0848k3302j2565L276K368M9921Q036
18396G8568J2611l85l3159K3549j8261O954l576K7496n133n1862L658J9726k6097
18383C4089L7939J9628n6030r148K271n748j6379j3777K7801J6467P018J0050
18371E4181K7743M0280J6220M390P463m0260K4819L7137Q604l0784J3032J2031
18359A74856m8517j0431L1876j3186O269k2229r930K0472N0172O698J1212L504
$$ plain form
18447 91422 83388 107852 108326 128149 98120 84904 75967 103263 133636 125041 149822 144588 135368
18434 135368 91156 69804 72578 64677 43445 52939 52333 48650 56992 42498 51020 20138 10737
18421 10737 32982 44736 27741 2593 -6105 40705 50233 76350 68225 50998 40715 38964
18409 38964 36648 75332 109213 100792 59652 61682 50834 27532 14967 18243 20611 70532 78568
18396 78568 91179 90794 57635 81184 62923 69877 66301 93797 88664 36802 40460 60186 34089
18383 34089 72028 91656 35626 26478 28749 23001 6622 -7155 20646 37113 44131 54181
18371 54181 81924 122204 138424 142814 150277 110017 134836 171973 180577 149793 162825 174856
18359 174856 126339 115908 147784 134598 140867 118638 108708 129180 179352 186050 197262 200766
18347B00766k3897O2754Q0209N4313J3278J09297K08219K64087K74691K44301
18337A488018J17923j08527j20588j83129l34961l00224j86587q1699l4166K0956
18327B77016K8604J4316k3845r021k1508r516N6963R2847R8399J34207K07984
18316H46446M30680M10654L87381K17060n1874j44241k86166n48300m65312k68667
18306E27661o2844L2069J5947J9319m0082l6077m9549o3825r716j224m5298m1741
18294B44640l8798j0759k4466n895j2498j9894L7584L1345M484j7390k4169O3909
18282B28093J22059J26393K8905j4053k7057q8841k9518J7760n0236n0474o479
18271B56552J5561R480P534Q386j5751l6570P573J7102J969k022p821n412J4145
$$ plain form
18347 200766 176869 239623 319832 374145 387423 496720 704939 969026 1243717 1488018
18337 1488018 1605941 1497414 1376826 1193697 858736 558512 371925 290226 256060 277016
18327 277016 305620 319936 296091 287070 265562 256046 313009 405856 504255 638462 846446
18316 846446 1277126 1687780 2075161 2292221 2240347 2096106 1809940 1261640 796328 527661
18306 527661 464817 496886 512833 532152 492070 455993 406444 342619 332903 331679 286381 244640
18294 244640 205842 195083 170617 164722 152224 132330 169914 201259 205743 188353 164184 228093
18282 228093 350152 476545 505450 491397 464340 375499 345981 363741 313505 263031 256552
18271 256552 272113 281593 289127 297513 281762 245192 252765 269867 271836 269814 261993 256581 270726
18258B70726O846J7850J8052O1666L2114Q922j9732m0463N0162L6817J9855l3390
18246D29425P520O6689P3535J03695J64191J82023J96340K83855M59144N84977
18236B551394M81921J11171n37401p93533n68243l14450j64502j27532r9711l3194
18226E05920l1933j2841j2290K3949K6113L4568p307N020K4041M3762Q5905J90937
18214H75844L38388M04736K87284N4319l15965n13453l59778j61975r0561p4213
18204D44626m7189k3956j7525n807m9479l4432k2771j0221P403L5408J6503M904
18192B97464k45l335J8894P323K9722K6143q748q126k71J0193J0475L5502J3024
18179D28015P510M754J7797J8714R381J8084L7077J4461R0733O4939J09471O7479
$$ plain form
18258 270726 277572 295422 313474 375140 407254 416176 396444 355981 406143 442960 462815 429425
18246 429425 436945 503634 577169 680864 845055 1027078 1223418 1507273 1966417 2551394
18236 2551394 3033315 3144486 2607085 1813552 1245309 930859 766357 638825 539114 505920
18226 505920 473987 461146 448856 472805 498918 533486 526179 531199 555240 599002 684907 875844
18214 875844 1214232 1618968 1906252 1960571 1644606 1131153 771375 609400 518839 444626
18204 444626 397437 373481 355956 350149 300670 266238 243467 233246 240649 276057 292560 297464
18192 297464 297219 293884 312778 320101 349823 375966 367218 359092 358821 369014 379489 414991 428015
18179 428015 435525 440279 458076 476790 486171 504255 541332 555793 646526 711465 820936 888415
18167H88415J01498J18571J22859J00668O9949N1412M9424O5516Q0223J12603
18157A761138J10540M7157J7464L3592j4667j7230L5314J03727J04515Q9108J16151
18146B386809J55091K08073K87619L96353M50472N89082P03917P46313P06484
18137F630213N70735M12740J75771J62864K61257M38786O25173Q05845R92574
18128A1075958J189031J448710J750852K116622K523722L038953M000056N557132
18120C2701036Q127649J2583971K0400864L2700853M2695719M5039017L7983269
18113B32232378L395696j7604643l4734138m2416128k4489134p868400k161569
18106A06354062n577362k0325551k0992823j3136442p029720l283195q62277R75567
$$ plain form
18167 888415 989913 1108484 1231343 1332011 1401960 1453372 1502796 1568312 1648535 1761138
18157 1761138 1871678 1918835 1936299 1969891 1955224 1937994 1973308 2077035 2181550 2270658 2386809
18146 2386809 2541900 2749973 3037592 3433945 3884417 4473499 5177416 5923729 6630213
18137 6630213 7200948 7613688 7789459 7952323 8213580 8652366 9277539 10083384 11075958
18128 11075958 12264989 13713699 15464551 17581173 20104895 23143848 27143904 32701036
18120 32701036 40828685 53412656 73813520 106514373 149210092 194249109 232232378
18113 232232378 235628074 218023431 183289293 140873165 116384031 108515631 106354062
18106 106354062 100776700 80451149 59458326 46321884 39292164 36008969 35146692 36122259
18098C6122259L059484O040867J0797502J8774275L1374709M2366884M4935963
18091A93471943L9227360L844198k1150755l9807969n3623909m2086442k6476362
18084E3398064j5936504r885046o375134m271769k894094k119676j669975j366032
18076H879834j198149j108854q82343n98000m42216k64096n3695J08446J95152
18067D636079J54598K8468j13017l79229n30156n82377n17934l72925k60652k07028
18057A855827j64423j33397j03021o8853n1965n3983j7140m1408n2242n5235Q918
18046A123078O434j7377p4950r0993o5024q338q120j5647k1210l056j2430k9856
18034G82511n1508l2801l0034k0831N78k3525o875J1091R543k0263l7823l7306
$$ plain form
18098 36122259 39181743 45222610 56020112 74794387 106169096 148535980 193471943
18091 193471943 232699303 236543501 215392746 175584777 121960868 79874426 53398064
18084 53398064 37461560 27576514 21201380 16929611 14035517 11915841 10245866 8879834
18076 8879834 7681685 6572831 5690488 5092488 4650272 4386176 4332481 4440927 4636079
18067 4636079 4790677 4819145 4706128 4326899 3796743 3214366 2696432 2323507 2062855 1855827
18057 1855827 1691404 1558007 1454986 1386133 1334168 1280185 1263045 1221637 1169395 1114160 1123078
18046 1123078 1129512 1112135 1037185 946192 881168 872830 864710 849063 827853 824797 812367 782511
18034 782511 731003 698202 668168 647337 647915 624390 617515 628606 638149 617886 580063 542757
18022E42757k2699J7070J6412l2155r1581m2204J9086J4903j9684k0960K8054
18011D08999M2997M1209j1341n0145m9830n444R193j829j492L0089l323k4557
17999C84526j2315k7763j5167K0660N507N336L1977J1813J9210k0795J2073k0090
17987C94972n1858k5219n6514k5035k9467N2032J6289K2J4503p1112o7868k4694
17975A26051J2002K9616M933K6667K1696L0436M6497K5401k6328p2351n3211k1686
17963A49723l9092n0751l8454N837M1193J4729k3536k0583J0266k5342N717K6226
17951E5933j4295j9502N8j7500M7441n553j6134k946j3993J7212R94l3065q492
17938i842J3221O399k5683nQ798q978l3188k1966m0246j1462R541n3937m5448
$$ plain form
18022 542757 520058 537128 553540 521385 429804 387600 406686 421589 401905 380945 408999
18011 408999 451996 493205 481864 431719 381889 376445 385638 383809 382317 412406 409083 384526
17999 384526 372211 344448 329281 349941 355448 360784 392761 404574 423784 402989 415062 394972
17987 394972 343114 317895 261381 236346 206879 258911 275200 275222 289725 218613 150745 126051
17975 126051 138053 167669 172602 199269 220965 251401 297898 323299 296971 224620 171409 149723
17963 149723 110631 59880 21426 27263 68456 83185 59649 39066 49332 23990 29707 55933
17951 55933 41638 22136 22194 4694 52135 46582 30448 27502 13509 30721 31715 -1350 -9842
17938 -9842 3379 9778 -15905 -15910 -7112 -16090 -49278 -71244 -111490 -122952 -113411 -167348 -212796
17925b12796l9991N577K4640Q1811L5332K2042O4229n202P043M9489J680j9329
17913A4525K0073j3501J432K7204K98j4874j2358K505j1460l3597q8908n4430
17901a63091l6229K6364R1924R6275L9236O2858N4231P247J1208j5203k7579k2510
17889A24731l102K0215J3128J5071J8733j9420p456k5064k6903N848k8564J8578
17877A05795O064k1785J5496K2085q443J8569L3087k1169n2120l8575q186N2873
17865A03691J2471P368K0469j1213r525r512J0977j4334k0946Q244K3125k9374
17853I1441o0231K0438L3816K711o433J3013J7522k9374m3l415o164N738L0204
17840A09223m803k6535r335N137l3474o766K7567P101l5750p564K4738L733k3891
$$ plain form
17925 -212796 -252787 -247210 -222570 -140759 -105427 -83385 -19156 -24358 -17315 32174 33854 14525
17913 14525 34598 21097 22529 49733 50031 35157 22799 25304 13844 -19753 -108661 -163091
17901 -163091 -199320 -172956 -81032 15243 54479 117337 171568 178815 190023 174820 147241 124731
17889 124731 121629 141844 154972 170043 188776 169356 161900 136836 109933 115781 87217 105795
17877 105795 111859 90074 105570 127655 119212 137781 170868 149699 97579 59004 50818 103691
17865 103691 116162 123530 143999 132786 123261 113749 124726 110392 89446 97690 120815 91441
17853 91441 31210 51648 85464 88175 81742 94755 112277 82903 82860 79445 73281 79019 109223
17840 109223 104420 77885 68550 73687 40213 33447 61014 68115 32365 24801 49539 53272 29381
17827B9381J4630j1914J4436K6994j1366j0428J3219l3486o562J9645L1012p355
17815F8206n8538m2352K550J2029L6538K0814J9809k2912J6930J2515r781K8857
17803H4665j637J3857M974j1633m7672l9552k8848Q541K3212j0082j39J341j4433
17790a7406m034l0348r741J5172L1471Q744K2005k989L098J4062J2260j8206J7133
17777D1221P714k0892L3780q961l7491j8480j2997O144M1750L4323m259K3058
17765H4910J1270J6896m814m9626o131j0552K751k8147O792K5571J9892J8355
17753H7167J9309j78l7032k6285M8939j5897n1557l9611J8773J7661j0255j4348
17741c314j698L8160J281n096N73k3375p204K0342k7224K0280r9k654m0002j4116
$$ plain form
17827 29381 44011 32097 46533 73527 62161 51733 64952 31466 24904 44549 75561 68206
17815 68206 9668 -32684 -30134 -18105 18433 39247 59056 36144 53074 65589 55808 84665
17803 84665 83028 96885 101859 90226 42554 3002 -25846 -17305 5907 -4175 -4314 -2973 -17406
17790 -17406 -21440 -51788 -61529 -46357 -14886 -6142 15863 12874 15972 30034 42294 24088 41221
17777 41221 48935 28043 61823 52862 15371 -3109 -16106 -9962 31788 66111 61852 84910
17765 84910 96180 113076 108262 58636 52505 41953 44704 16557 23349 48920 68812 87167
17753 87167 106476 106298 69266 42981 91920 76023 24466 -15145 3628 21289 11034 -3314
17741 -3314 -5012 33148 34429 29333 29906 6531 -673 19669 -7555 12725 12626 9972 -30030 -44146
17727d4146P063L3607K5086N997j593k3933j6940j848J3032M1392L0358m642K4236
17714H7669l503l9432j9172K1049L4194J0260j551M0366K9558P6967M4187K577
17702B83169L6031R9067J81832K37156J86095J32109M9631k4757o6813j49321
17692I64199k15377j82842j53129j21902p4529l0277l2046l9426K0545K1312K125
17681A58653j8765j8Q4136R7986J66338K01683J25873J32069Q2337k5823l6932
17670I67537j60693k10278k18665j18144o9438n2575m3968j5763J4498j1200j3649
17659F7662Q098K0087J8691m039j4063N377K9333j4222k6844n0341l8953N833
17647F619k1481j6617L3767K8974r498k6807j3754R90n739J8199L590J8488K2592
$$ plain form
17727 -44146 -37083 -3476 21610 27607 26014 2081 -14859 -16707 -3675 37717 68075 63433 87669
17714 87669 84166 44734 25562 46611 80805 91065 89514 129880 159438 236405 280592 283169
17702 283169 319200 418267 600099 837255 1023350 1155459 1205090 1180333 1113520 964199
17692 964199 748822 565980 412851 290949 216420 186143 154097 114671 135216 156528 158653
17681 158653 139888 139870 224006 321992 488330 690013 815886 947955 1030292 1004469 967537
17670 967537 806844 596566 377901 259757 190319 137744 93776 78013 92511 81311 67662
17659 67662 75760 95847 114538 110499 96436 101813 131146 116924 90080 39739 786 6619
17647 6619 -14862 -31479 2288 31262 21764 -5043 -18797 -17807 -23546 -5347 -1757 16731 39323
17634C9323p565K9382J7638l4598k4250l5516J171K7416K1861J991j3030m599
17622A9224j7161k0392j5146j0547K6894M2526L2907K9995l5167j6252k9460o518
17610I03M491J602l0902J0165j183q239L2715J9915j056K4973j9784m1788K899
17597e289k4651k264K8021r702J2782P3783O148k7270J8734l1193o0813r788J5364
17584a6138M305l3037L3506O6960j453k8532L604l7251k6419J3511K6343L4762
17572D0161J0060K9023j5157k0533J2294K5430j24l7083n001J7607m2195j6633
17560b151k85r311L6299L3097j3289k0306K4074j2512K966K3620p57K7518J1758
17547A00721K4766J5233m1485j5088j497j451L947J096k2703r928L1336J3603
$$ plain form
17634 39323 31758 61140 78778 44180 19930 -15586 -14415 13001 34862 36853 23823 19224
17622 19224 2063 -18329 -33475 -44022 -17128 25398 58305 88300 53133 36881 7421 903
17610 903 5394 6996 -23906 -13741 -14924 -23163 9552 29467 28411 53384 33600 -8188 -5289
17597 -5289 -29940 -32204 -4183 -13885 -1103 72680 78828 51558 70292 39099 -21714 -31502 -16138
17584 -16138 -11833 -44870 -11364 55596 54143 25611 29215 -8036 -34455 -20944 5399 40161
17572 40161 50221 79244 64087 43554 55848 81278 81154 44071 39070 56677 14482 -2151
17560 -2151 -2436 -11747 24552 57649 44360 24054 48128 35616 38582 62202 61445 88963 100721
17547 100721 125487 140720 99235 84147 82650 81199 85146 86242 63539 53611 84947 98550
17535I8550K2215R738p769M0945P4182O9733J23480J80311K06216K33045J40175
17524A190821j3519j08107k22574k41263j91146j12992q0082k0853j135j9314
17514A79836R093K0120K7748J7033o284j2024L4874N2688J38775K21486L10276
17503I93621J98688J89469L7554j04874k37988k87726j88341j50460m9787n6108
17493C44048q3568p4569q1160l2259j2107R375J8822Q650k2014j7302n8535l5672
17481c6291O127O5710L2224J1885j2524L815K480j2930k5698M4448L1024q962
17469A01308Q782J2778k7905J9738J6220k3981J2938J1192Q812o015K527r96m289
17456A31109L0172j667r981l925k4130k333k3900M580O7302J2062K5699L6055
$$ plain form
17535 98550 120765 130503 122734 163679 237861 307594 431074 611385 817601 1050646 1190821
17524 1190821 1177302 1069195 846621 605358 414212 301220 221138 200285 199150 179836
17514 179836 188929 209049 236797 253830 247546 235522 270396 323084 461859 683345 993621
17503 993621 1192309 1381778 1419332 1314458 1076470 788744 600403 449943 400156 344048
17493 344048 260480 185911 104751 72492 60385 69760 88582 97232 75218 57916 -619 -36291
17481 -36291 -30164 35546 67770 79655 67131 70946 73426 60496 34798 79246 110270 101308
17469 101308 110090 122868 94963 114701 130921 106940 119878 131070 139882 133867 136394 135398 131109
17456 131109 161281 159614 149633 145708 121578 119245 95345 99925 167227 179289 204988 241043
17444B41043O0924N8159Q6280Q2176R3054J906j27490p3941J7336M2907J8837
17433E01191J08042J56878K09355L55624N98240R47808J231736Q87127K70339
17424E266340r10057j306294r32809n21420k40582r1521N9308K73665M56025Q34529
17414B887184J055986Q30096K91894r21390j383699j044145o04694l47361j61455
17405F02416j01183j02000p2461p3548m3426l0064O279j7341Q953K2741k6932
17394A73434l2753L425J973p841n102k982J1513J8476j151k2537j9967l7067K30
17381G9651n849J5303L0577P167k3720p079K0292P848K2069M5568j1968o3317
17369A16542l8149J6389k1000l0302n1614Q484L6320R720o89j7024m5152k2981
$$ plain form
17444 241043 301967 360126 446406 528582 621636 623542 496052 422111 439447 482354 501191
17433 501191 609233 766111 975466 1331090 1929330 2877138 4108874 4996001 5266340
17424 5266340 4356283 3049989 2117180 1595760 1355178 1263657 1322965 1596630 2052655 2887184
17414 2887184 3943170 4773266 5065160 4143770 2760071 1715926 1111232 763871 602416
17405 602416 501233 399233 326772 253224 209798 179734 186013 168672 177625 200366 173434
17394 173434 140681 144106 146079 138238 133136 130154 141667 160143 158992 136455 116488 79421 79651
17381 79651 73802 89105 119682 126849 103129 96050 116342 124190 146259 191827 179859 116542
17369 116542 78393 94782 73782 43480 -8134 350 36670 46390 45701 28677 -16475 -39456
17357c9456M1364J0240J4855L9632L7345K7160M0771J7192k4569k0919Q142k2158
17345A29599m3201l0377L0406m749o5819n1363O686k6831k4051L0566Q437l5004
17333g5701j1163k774O114J0343Q015N9686J5755L208K301r057k4105N245k2914
17320c5047J5429K2964M937J6333N8450K5534P0080R1235N0624j6958k30l5543
17308B67808m8676j5590j0429j2851k8703j6930j4543k5288L061L2347L6927j6278
17296A50855j4840J7622K2156M4916J2409O0557N3371N1065O4874M246l2246j5170
17284D19815k2133k3543k3293m6244k1785L9638J2412N6060M6968Q614J35j5285
17272D31359j6945r981j6577n2165r246P807O85K4285K6023p494J0727R295K1191
$$ plain form
17357 -39456 1908 12148 27003 66635 103980 131140 171911 189103 164534 143615 151757 129599
17345 129599 86398 56021 86427 81678 15859 -35504 -28818 -55649 -79700 -49134 -40697 -75701
17333 -75701 -86864 -89638 -83524 -73181 -65166 -5480 10275 13483 15784 6727 -17378 -12133 -35047
17320 -35047 -19618 3346 8283 24616 83066 108600 178680 269915 320539 303581 303351 267808
17308 267808 219132 203542 193113 180262 151559 134629 120086 94798 97859 130206 167133 150855
17296 150855 136015 153637 175793 220709 233118 293675 347046 398111 462985 467231 434985 419815
17284 419815 397682 374139 350846 304602 282817 322455 334867 390927 437895 446509 446644 431359
17272 431359 414414 404433 387856 335691 326445 334252 334937 359222 385245 377751 388478 397773 418964
17259D18964k2480L527L0763P457L0512N6601N7378M3203l314k3051K323J7650
17247F19533K374P661j6218N254J904J7610j8279n1768L8191K1413P820k7664
17235F07831m6634l5407k1015o733K8287L1737L8386R446m5431m5023l1772l8250
17223D45422L505K4629N6153N539j241j4877j7135K0575N1631J3824K1154k6660
17211E82519n1990k6051l0638K668l2396m120K8223Q815L448l9270r158j1582
17199D20468l3549l755m872p904l2672p58J0039q989k0448K2214L3884K7868J8295
17186D19821j199j2440R025K6698J9346M3072L5739K714k1705M662M7322N0405
17174F23460L7798L6130L9539M1605O7469o726L4286O1891M6500K651K4104J14407
$$ plain form
17259 418964 396484 400011 430774 438231 468743 525344 582722 625925 622611 599560 601883 619533
17247 619533 621907 629568 613350 618604 620508 638118 619839 568071 606262 627675 635495 607831
17235 607831 561197 525790 504775 498042 526329 558066 596452 605898 560467 515444 483672 445422
17223 445422 448927 473556 529709 535248 534007 519130 501995 522570 574201 588025 609179 582519
17211 582519 530529 504478 473840 476508 444112 439992 468215 477030 480478 441208 432050 420468
17199 420468 386919 383164 378292 370388 337716 336958 346997 338008 317560 339774 373658 401526 419821
17186 419821 418622 406182 415207 441905 461251 504323 540062 542776 521071 525733 573055 623460
17174 623460 661258 697388 736927 778532 846001 839275 873561 935452 981952 984603 1008707 1123114
17162A123114J23322O2364O8674R1817J14308J49259J65393K61704M07868N30586
17152C098409N58773N91247M63141K15926J61795J91970k8224p6327J39956L18829
17142E635495M92160O60347P91472R95236J117912J238032J434818J583884J758289
17133A5707645K137549K813727L835607N389602P841909J1821269J8823538K9852351
17125I8223197L7789469L6296007K9829911N497062r172817j0479405k7504109
17118A60479315m5274227l6776637k2978691j3495795p877584m549986k441278
17111B7085117j057862L9588J117289K290261L684532N929394R768701J6229683
17103F5086703K6693856L5211055L4216248K9194962O894268q782180j0340072
$$ plain form
17162 1123114 1246436 1308800 1377474 1469291 1583599 1732858 1898251 2159955 2567823 3098409
17152 3098409 3657182 4248429 4711570 4927496 5089291 5281261 5253037 5176710 5316666 5635495
17142 5635495 6127655 6788002 7579474 8574710 9692622 10930654 12365472 13949356 15707645
17133 15707645 17845194 20658921 24494528 29884130 37726039 49547308 68370846 98223197
17125 98223197 136012666 172308673 202138584 207635646 198462829 187983424 160479315
17118 160479315 115205088 78428451 55449760 41953965 34076381 29526395 27085117
17111 27085117 26027255 26066843 27184132 29474393 33158925 39088319 48857020 65086703
17103 65086703 91780559 126991614 161207862 190402824 197297092 188514912 178174840
17096A78174840k4621569m3466192l6912709k3611165j4357711r089989o019376
17089B0096129l987064k911991k217970j559566j103433r93404r36998p42618
17081E643085o69658o14517m89028l78858k31308j47468n2301K0547J03610J41370
17071C325474J10748P9961K5805k48480l68451k95144l02527l29883k56358k46049
17061A495096j68991p9955n1946p6869p1718r1113q3674j3686l4200p5813p2408
17050F74723m3151k5352J7322O321J3444m102J5588L4298l8522m2416J374k879
17038F06648J93k3157j3720L3832J3565o6924l3405j7844j1682n0270l9619l1864
17026C65753j1854P526k9960k2075K3349K6562K0912k7408o979M578j3409j0750
$$ plain form
17096 178174840 153553271 110087079 73174370 49563205 35205494 26115505 20096129
17089 20096129 16109065 13197074 10979104 9419538 8316105 7322701 6385703 5643085
17081 5643085 4973427 4358910 3869882 3491024 3259716 3112248 3059947 3080494 3184104 3325474
17071 3325474 3436222 3516183 3541988 3293508 2925057 2629913 2327386 1997503 1741145 1495096
17061 1495096 1326105 1246150 1194204 1117335 1045617 954504 870830 857144 822944 747131 674723
17050 674723 631572 606220 623542 629863 643307 639205 654793 689091 650569 608153 609527 606648
17038 606648 606841 583684 569964 603796 617361 550437 517032 499188 487506 437236 397617 365753
17026 365753 353899 361425 331465 309390 332739 359301 380213 352805 345826 350404 336995 326245
17014C26245m32k388J1353N1572j4666m8130m6393j5759K0696N3255K1253o741
17002C49865O750J0387J1130K3488r498k1365l0093j8225L8581k3296l097L318
16990C37945n5185m3167J0366J6981J846R842j6554K7595j9693l0534N708K9587
16978B74737N0652j2821l2667o630k2062l3212M3626l2186J3814K2477k7453o5478
16966A72797l2636k4852k8911J5403j5328k2953p740k644j651j497k019K5474
16954G3443j1659K2680L529P26N889M437J8108J6433J2651r34j8850l5879k6900
16941F3674k9284o8998l6503J414k4329o5012n9555k3676k3463j010O2874P0450
16929a33418O3156M8521N1925K7509L787O305J4824K8466m2431l6489J9628K3232
$$ plain form
17014 326245 325813 323425 334778 386350 371684 323554 277161 261402 282098 335353 356606 349865
17002 349865 356615 367002 378132 401620 392122 370757 340664 322439 361020 337724 334627 337945
16990 337945 282760 239593 249959 266940 268786 278628 262074 289669 269976 239442 245150 274737
16978 274737 325389 312568 279901 273271 251209 217997 261623 229437 243251 265728 238275 172797
16966 172797 140161 115309 86398 101801 86473 63520 55780 53136 51485 49988 47969 73443
16954 73443 61784 84464 87993 88719 94608 99045 117153 133586 146237 145303 126453 90574 63674
16941 63674 34390 -34608 -71111 -69697 -94026 -159038 -218593 -242269 -265732 -266742 -203868 -133418
16929 -133418 -70262 -21741 30184 57693 61480 67785 82609 111075 68644 32155 51783 75015
16917G5015l9998q9790P521Q184j7043o4171k8666o792m8567N4378Q7126Q2741
16905A9938M2920L0908J03719K1801n3483j0432K9504j7957j7161J0424L6144
16894A96325k124l2527j6764j358J2033j4467m960J857l9445K0671K742l5398
16882H6585m1591l364j8344J1958J5124N297Q9L7870J9790K7970J2230l5822o887
16869A10905K0587m5750N177K3933k5524N887k3158j0969k1195l3899j1479L7171
16857C1686L7004J8139q475k2459k8250r888L6902K9397L8048J0940j795k466
16845A28783O013k816j0363j0385L8046R798N773o991M035M413O2604N1454L7547
16832C17911j7341k6428m239M3776O7654M7628K7998N8600L8702Q6391J71173
$$ plain form
16917 75015 35017 -54773 -47252 -39068 -56111 -120282 -148948 -155740 -204307 -149929 -62803 19938
16905 19938 62858 93766 197485 219286 165803 155371 184875 166918 149757 160181 196325
16894 196325 194201 161674 144910 143552 155585 141118 136158 138015 98570 119241 121983 86585
16882 86585 44994 41630 23286 35244 50368 55665 55754 93624 113414 141384 153614 117792 110905
16869 110905 131492 85742 90919 114852 89328 95215 72057 61088 39893 5994 -5485 31686
16857 31686 68690 86829 78354 55895 27645 17757 54659 84056 122104 133044 131249 128783
16845 128783 134796 131980 121617 111232 149278 159076 164849 157858 161893 166306 228910 280364 317911
16832 317911 300570 274142 269903 313679 381333 428961 456959 515559 554261 640652 811825
16821H11825J67161K06502L23996M93063P61463J035642J286546J328295R69471
16812G383964K73527m77499j108292j389155j316259j019544o66624m57555l21467
16803I01096j98121j23186j05113o0650n3604l710N952k7791O0552M7500n2714
16792C90211o8331n7982m0128n6430l8210J1506k2323l9577l0601o961J5025N3211
16780A09410L2459l5255K0674O1347K8143N0171O6851L1386J0828P218n8492p2713
16768B52027m3559l7274l1335k0128J6448l1346k3867J1255K5257j2037n549k5128
16756G4764l4634k2258l8522L5670O7275L0370j307j4253J0897m2508k0479J0284
16744E5299k808K2521k2038l1655J1767L8788P627j0027k0250J0265J4080M0482
$$ plain form
16821 811825 978986 1185488 1509484 2002547 2764010 3799652 5086198 6414493 7383964
16812 7383964 7657491 7179992 6071700 4682545 3366286 2346742 1680118 1222563 901096
16803 901096 702975 579789 474676 414026 360422 356712 362664 334873 395425 442925 390211
16792 390211 321880 263898 223770 167340 129130 140636 118313 78736 48135 41174 56199 109410
16780 109410 141869 106614 127288 188635 216778 266949 333800 365186 376014 383232 324740 252027
16768 252027 208468 171194 139859 119731 136179 104833 80966 92221 117478 105441 99892 74764
16756 74764 40130 17872 -20650 15020 82295 112665 111358 97105 108002 65494 45015 55299
16744 55299 52491 75012 52974 21319 33086 71874 79501 69474 49224 59489 73569 114051
16732A14051o261J4854L1223l1265j3380q383k341q257J9945j1906k0210j136
16720G6934j6861l7763K5870K7490L8349J2134n709m2992M749R0305J543j6608
16708A57441m9715M109K8685j5281m6244j3225l0148L2912M0586j4099K4713q506
16696A11228J62K6347J6987k4322k4164K0707k8389k4723m9654n5L4031n138l2890
16683B0127j2940L3814K7566q17K8094L8282J7576p332K3323L311j9234N675J6900
16670A74345l961j7563K165L0364O268J3470L2399o372l1296j1525O2196J48557
16658C99047J15122J20655J64872K19510K82555K75109K41507J56049Q568j02726
16648A880268j85543k61917k81838k90269k44835j79237p4762n7365m6823p856
$$ plain form
16732 114051 107790 122644 153867 122602 109222 100839 98498 90241 110186 98280 78070 76934
16720 76934 60073 22310 48180 75670 114019 126153 120444 77452 82201 172506 174049 157441
16708 157441 107726 111835 140520 125239 78995 65770 35622 68534 109120 95021 119734 111228
16696 111228 111390 137737 154724 130402 106238 126945 98556 73833 24179 24124 58155 53017 20127
16683 20127 7187 41001 68567 67750 95844 134126 151702 144370 167693 171004 151770 157445 174345
16670 174345 170384 152821 154986 185350 191618 205088 237487 231115 199819 188294 250490 399047
16658 399047 514169 634824 799696 1019206 1301761 1576870 1818377 1974426 1982994 1880268
16648 1880268 1694725 1432808 1150970 860701 615866 436629 361867 304502 257679 249823
16638B49823o7897k2775k2558l1470k4899k2448k5906M3861l137l796K0185j977
16626H7006l1389m039j353l3851J1875L5583L336j9731L199j2365j2915K845K661
16613C0862J8778J1669p957j3778k6139k4531J3731J7944k3622j6353J7109J9692
16601A7405k1997L131K2028k590m9690m523j021K4815M8653J3337l10J9019K3988
16588I2245p291j576K8297P360j7449k1383J4494O614K1502K1407J3208m1552
16576A15876j6557Q592k5628J1342J9314K3951L236j2097n6730l6624j8431L0686
16564D6930j5013o297r939J6516N1132J5293m230O393n00J8223p555O479q820
16551A08612M8753N3432K2577L9868N2508J09085J48319J95165J94258J76348
$$ plain form
16638 249823 181926 159151 136593 105123 80224 57776 31870 75731 72594 68798 88983 87006
16626 87006 55617 51578 50225 16374 28249 63832 67168 47437 50636 38271 25356 28201 30862
16613 30862 49640 61309 53352 39574 13435 -11096 2635 20579 -3043 -19396 -2287 17405
16601 17405 -4592 -1461 20567 17977 -31713 -36236 -37257 -12442 36211 49548 49238 68257 92245
16588 92245 84954 83378 111675 119035 101586 80203 94697 101311 122813 144220 157428 115876
16576 115876 99319 107911 82283 93625 112939 136890 140126 128029 71299 34675 16244 46930
16564 46930 31917 25620 15681 32197 83329 98622 94392 100785 100285 118508 110953 117432 108612
16551 108612 157365 210797 233374 273242 325750 434835 583154 778319 972577 1148925
16541A148925L7071n3210p6732j85089k25699j75489j07859p9385o2286l3066
16531A87181J4982j5436N6453K2219k434o916K0830M8634P7249J65674K10501
16520G78937J97270J00150l767k0610o5822j77592j94367j73568j32870j11888
16510A95873k1899m3915j1482j2156j2316j7226m465K2889n828k7325l3939j935
16498B6276L7587o708l3583j6384J9750Q497R877N5844J7564k6834J3717j9306
16486H6297o0941k4696L3106J7151J1900K2337p396J4607m783l0141r091k7895
16474B0455J4970K7562L556j7994L191m6353J373L2348K7213k0601l389K2283
16462F4614J9857l0049l5912n837K3295J4542k0336l432O05J3917K5002R834j3945
$$ plain form
16541 1148925 1185996 1132786 1056054 870965 645266 469777 361918 282533 220247 187181
16531 187181 202163 186727 243180 265399 262965 256049 276879 325513 402762 568436 778937
16520 778937 976207 1076357 1072590 1051980 986158 808566 614199 440631 307761 195873
16510 195873 173974 130059 118577 106421 94105 76879 72414 95303 89475 62150 28211 26276
16498 26276 63863 57155 23572 7188 26938 35435 45312 101156 118720 91886 105603 86297
16486 86297 25356 660 33766 50917 62817 85154 77758 92365 87582 57441 48350 20455
16474 20455 35425 62987 66543 48549 51740 5387 6760 39108 66321 45720 42331 64614
16462 64614 84471 54422 18510 12673 35968 50510 30174 26742 27347 41264 66266 76100 62155
16449F2155j3013k4726m921k6158M616J1374L507J1896Q099l1035l1283O79K6381
16436b429L7130l4607n5869O320L7984o740J914Q584K0608J9573J7109j1817k2619
16423A5141k7260K8965L618q123O292J0288k0625j9045L2097K5301l7643J2361
16411B1367J4817J0036R345j2728L3411k9400j7513m033k4902R996K9270L0116
16399F9782J3409K2254j0305j6103r710j7319j7645j372j4030j0849j1956m379
16387h223J8844r481k841j8928M0392j3395R840L1978m839n3648k864O421K9846
16374B3102M2082k220L60J4246j5496k4890N781J3638L5862K7874j1717M3075
16362A51697P4928k243j3224K1200K0575k8707j9472P609m674n5515j4634p75
$$ plain form
16449 62155 49142 24416 19495 -6663 -2047 9327 12834 24730 32829 1794 -29489 -28810 -2429
16436 -2429 34701 94 -55775 -49455 -11471 -18211 -16297 -7713 12895 32468 49577 37760 15141
16423 15141 -12119 16846 20464 12341 18633 28921 8296 -10749 21348 46649 9006 21367
16411 21367 36184 46220 55565 42837 76248 46848 29335 25302 400 10396 39666 69782
16399 69782 83191 105445 95140 79037 69327 52008 34363 32991 18961 8112 -3844 -8223
16387 -8223 10621 1140 -1701 -20629 19763 6368 16208 48186 43347 -10301 -13165 -6744 23102
16374 23102 65184 62964 63324 77570 62074 37184 42965 56603 92465 120339 108622 151697
16362 151697 226625 224382 211158 232358 252933 224226 204754 212363 207689 152174 137540 136765
16350A36765n434j3932j2956j9221m0065l3340J2732K7834L0266J901l8042j1869
16338C4639l7358J1488J3954P829K1292k3601j1888O202J1004J0458l4492Q759
16326A8286M2171M8176J1156n0615k485N41l4054k1221l62p904K5356L3899J1551
16313G4495j401k5661m7986p049L623k0095l244K876L2449N2999O8779M5276M7655
16300B22716P0669M3847K7326Q1522Q5557J2927m867m1109o2629m3746l5622p9814
16288B76777l8510k0235k116k1557j2251m1806k6872L6998k499j6578P044K7827
16276A66222K3497K6527k479k93n047n203K7223j048k1732l720M075j8589n235
16263A84198l9704j1640p001J4064J845N634j7955o911n237J1458M5596L5600
$$ plain form
16350 136765 131331 117399 104443 85222 45157 11817 24549 52383 82649 84550 46508 34639
16338 34639 -2719 8769 22723 30552 51844 28243 16355 22557 33561 44019 9527 18286
16326 18286 60457 108633 119789 69174 66689 67230 33176 11955 11593 3689 29045 62944 74495
16313 74495 73094 47433 -553 -7602 -3979 -24074 -27318 -24442 8007 61006 129785 175061 222716
16300 222716 293385 337232 364558 446080 531637 544564 539697 498588 435959 392213 356591 276777
16288 276777 238267 218032 215916 194359 182108 140302 113430 150428 147929 131351 138395 166222
16276 166222 189719 216246 213767 213474 208427 203224 230447 229399 207667 203947 208022 189433 184198
16263 184198 144494 132854 125853 139917 141762 147396 129441 122530 117293 128751 174347 209947
16251B09947O291j5611j0402L1685L7083M2992J5080m5021j51K2095K4827J4060
16239C32875o216j159J8329M4019K1703l5111k1240n2759p0642n4356n6921m4456
16227G4066m0111l7980l5671j9197M4652L2172r093j4582L7542j6873M1639K2491
16215G9055J7804j4396P777Q233K8720p857K966J6051J3462L9892N3752K9996
16203B75455j1516m1365m4632O215k1917k213K7900l635Q116Q214k456j650K3520
16190B20036p874m84j7839L737J8031K3870k7813l0220K6078M2893Q1432Q694
16178C40541J6944j2339R980j95j6252J6215K7573L8177K7017k961q473L1399
16166D67626K1755J8221j0768O0515P2294J08775P0584O4014O0892O6394K6428
$$ plain form
16251 209947 216238 200627 190225 221910 258993 301985 317065 272044 271893 293988 318815 332875
16239 332875 326659 325500 343829 387848 409551 374440 353200 300441 229799 175443 118522 74066
16227 74066 33955 -4025 -39696 -58893 -14241 17931 8838 -5744 31798 14925 56564 79055
16215 79055 96859 82463 90240 98473 127193 119336 122302 138353 151815 191707 245459 275455
16203 275455 263939 222574 177942 184157 162240 160027 187927 184292 192408 200622 198166 196516 220036
16190 220036 212162 211678 193839 197576 215607 239477 211664 181444 207522 250415 331847 340541
16178 340541 357485 345146 355126 354931 338679 354894 382467 420644 447661 444700 436227 467626
16166 467626 489381 507602 496834 557349 629643 738418 809002 873016 933908 1000302 1026730
16155A026730N7698L0185M841M1954P4278L5598Q0521N3687N6864J12172J22830
16144A697358J04571Q5208J06547J58998J74474J86342K42186K91886L04202L80341
16134C732113M41806N06182N97308O52012P30880Q53578J003946J131772J366753
16125A1016350J566544J819246J988703K200204K469377K821805L466989M326795
16117C1676013N503236P463507J0406341J5052165K2044801L1324096M1355514
16110A64825673M9090457N0876514M4653736L0371545J0519188j1653802l1914463
16103C06768848m6175797n2580455n1060075m3471233l2804406k2565923j4948273
16096D3162686j0030099o954233n011593l656877k706500k016554j584097j300239
$$ plain form
16155 1026730 1084428 1114613 1119454 1161408 1235686 1271284 1351805 1405492 1462356 1574528 1697358
16144 1697358 1801929 1887137 1993684 2152682 2327156 2513498 2755684 3047570 3351772 3732113
16134 3732113 4173919 4680101 5277409 5929421 6660301 7513879 8517825 9649597 11016350
16125 11016350 12582894 14402140 16390843 18591047 21060424 23882229 27349218 31676013
16117 31676013 37179249 44642756 55049097 70101262 92146063 123470159 164825673
16110 164825673 213916130 264792644 309446380 339817925 350337113 338683311 306768848
16103 306768848 260593051 208012596 156952521 113481288 80676882 58110959 43162686
16096 43162686 33132587 26178354 21166761 17509884 14803384 12786830 11202733 9902494
16088I902494j169084j064032j003204r12948p64851o86295n49340m24837l28896
16079B999007k74607k12846j53394j10054j11412j35353j30923j12448o7828p7600
16069A612542r8456n5040o3085r4156j08686q8337n5149q1005n2942m6186o0924
16058H08576q738n6782k618Q847L8200N614l1398Q868n830K549o97j0120j3822
16045G42649j0786k0246k7257k7796M74O052k0605o5061l4849j7201q833k0006
16033D96535o8K984K8174J8174L294L7379Q675k4927j2280n0341k2016j082k6652
16020D57849m5568j9031M982J6933j9254k8603j9362l8463o758J620M1910J3926
16008C60181M271p074n6986k7472K6022J0473r72n130k7244J2965K5885j311j3781
$$ plain form
16088 9902494 8733410 7669378 6666174 5753226 4988375 4302080 3752740 3327903 2999007
16079 2999007 2724400 2511554 2358160 2248106 2136694 2001341 1870418 1757970 1690142 1612542
16069 1612542 1514086 1459046 1395961 1301805 1193119 1104782 1049633 968628 915686 869500 808576
16058 808576 799838 743056 740438 749285 787485 793099 761701 770569 764739 767288 766591 756471 742649
16045 742649 731863 711617 684360 656564 657038 663090 642485 577424 542575 525374 516541 496535
16033 496535 496467 499451 527625 545799 549093 586472 595147 570220 557940 507599 485583 484501 457849
16020 457849 412281 393250 398232 415165 395911 367308 347946 309483 302725 304345 346255 360181
16008 360181 364452 357378 300392 272920 298942 309415 308443 303313 276069 289034 314919 313608 299827
15995B99827j1035j8174j8637L221N5236K3607K2338R488M681J4524j296j895
15983C81885M8168r827k5170o5180q6286m0511m5256l0560n6602n8441P71M180
15971A7171M8681N6118L878k3108k1060o1387m1060N7592M4578j2296n329O021
15959F9799p732J2017J4274J1490K0781k0915l5373k518l168j2732k000P456k2268
15946B9111m5123j894K2944L1718L9317O09k8184J6030J6191L803j8429m266k2023
15933C9804m7856j7781l2397j2217K4314K3889n447j9670n5296n0276p73M813
15921a48893q4177l1571j6201n3019r541K3135L9275N2997J12146J34479O4415
15910H3045L1826K4183J7606K2609M825k7340j8992l5405L4420K1664J4610j6064
$$ plain form
15995 299827 288792 270618 251981 255202 310438 334045 356383 365871 370552 385076 383780 381885
15983 381885 430053 420226 395056 329876 243590 203079 157823 127263 70661 12220 12991 17171
15971 17171 65852 121970 125848 102740 81680 20293 -20767 36825 81403 69107 63778 69799
15959 69799 62067 74084 88358 99848 120629 99714 64341 61823 58655 45923 43923 51379 29111
15946 29111 -16012 -17906 5038 36756 76073 76682 48498 64528 80719 84522 66093 61827 39804
15933 39804 -8052 -25833 -58230 -70447 -46133 -22244 -27691 -47361 -102657 -152933 -153706 -148893
15921 -148893 -233070 -264641 -280842 -333861 -343402 -320267 -280992 -227995 -115849 18630 83045
15910 83045 114871 139054 156660 179269 184094 156754 137762 102357 136777 158441 173051 156987
15898A56987k7650n07J4105k6956K3715J4446j9130q123j7588K392O067m0836
15886G6922J3769J7094J0510L434J8055q879J3884k1359m8993K7357N3759J800
15874A57353j304p0454k3898j0728J8855M5608M6700K9633k383P864M7803K9056
15862B74105J8184K343K849j5542k3920l3323n9450J6265K7084j9847m4105k3378
15850A21265k3994k3170L0777O507m1562o0237l0754J7284K314L5441L9430k1209
15838E2092j0481M160R826R033L737k5245P603m723J3275J8100M0736J8857K359
15825A39329m2977j3924j1683m1567m4712R99J203j9467J3100k807Q652O549L527
15812c778k529Q277j1993J146N855J894J452j1958j3472P747M628k0709N383K2522
$$ plain form
15898 156987 129337 128830 142935 115979 139694 154140 135010 126887 109299 111691 117758 76922
15886 76922 90691 107785 118295 121729 139784 130905 144789 123430 74437 101794 155553 157353
15874 157353 156049 85595 61697 50969 69824 115432 162132 191765 189382 197246 245049 274105
15862 274105 292289 294632 297481 281939 258019 224696 165246 181511 208595 188748 144643 121265
15850 121265 97271 74101 104878 111385 69823 9586 -21168 -3884 -1570 33871 73301 52092
15838 52092 41611 45771 55597 64630 68367 43122 50725 46002 59277 77377 118113 136970 139329
15825 139329 96352 82428 70745 29178 -15534 -14535 -13332 -32799 -19699 -22506 -13854 -7305 -3778
15812 -3778 -6307 1970 -10023 -8877 -3022 -1128 324 -11634 -25106 -17359 -12731 -33440 -28057 -5535
15798e535n03R316J7238j7465j6308j2361K4203K6896p17j5356N440j1022m9338
15785d5512o977K3350P106L7111O860K591l1113l172L1585J6508K4945J2841r416
15772F6707j0219J3333q008K1259J3106P707k7880m9834k8676J9297j8065k7452
15760b8725M0975M255J1274N4571k0272m3429K4275K7556R574J3388M559K5798
15748A23799P8589O1269J0719J9495L7687M5014M351l4624j2977J7549J752n0954
15736C01669n7037p154K3499l559j2158n489L1324L9345J1814n361k0488m8063
15724B48342L075j3747l280L7424Q722J6873K1640M8954O7397Q6893O1975L3812
15712F18080R656j0992M7022L2297n215k7052K419L811l6106m7843j8383K1014
$$ plain form
15798 -5535 -6038 3278 20516 3051 -13257 -25618 -1415 25481 24764 9408 14848 3826 -45512
15785 -45512 -52489 -29139 -22033 15078 21938 24529 -6584 -9756 21829 38337 63282 76123 66707
15772 66707 56488 69821 61813 83072 96178 103885 76005 26171 -2505 16792 -1273 -28725
15760 -28725 12250 16505 27779 82350 62078 18649 42924 70480 80054 93442 98001 123799
15748 123799 202388 263657 274376 293871 331558 376572 380923 346299 333322 350871 352623 301669
15736 301669 244632 237478 260977 257418 245260 239771 271095 310440 322254 316893 296405 248342
15724 248342 251417 237670 234390 271814 280536 297409 319049 368003 435400 522293 584268 618080
15712 618080 627736 616744 663766 696063 690848 663796 666215 670026 633920 586077 567694 588708
15700E88708j2616l9342o1908l0610l5438n9254n8279j0742J11m4485o9642n0535
15688A15968r726L3380J1411l046L1411M9277K1909J9119N6116O6205K5241n931
15676D11334m6253M105L2635m846n7571m0595m690l9945o6796p0417n9267l0153
15664B7541r791r458k5240k9063K577J5708M242l0999P496k970M5705Q9487P099
15651I2334p2832K862L3849n887j2615k3525j0416J8297j6730k4525l1869j7862
15639f8919N659K8574J0687n57r061q720K2459J4765r093j7614o128K8595L1136
15626B1783J3583m953J5964m9502m1096j7683N5221O9794k5609j1869n9j5916
15614I658l0727L9167L761q206j5020q75n416j1871l394K7880J280l868M96M88
$$ plain form
15700 588708 576092 536750 474842 444232 408794 349540 291261 280519 280630 236145 166503 115968
15688 115968 106242 139622 151033 147987 179398 228675 250584 269703 325819 392024 417265 411334
15676 411334 365081 369186 401821 396975 339404 298809 294119 254174 187378 116961 57694 27541
15664 27541 17750 8292 -16948 -46011 -43434 -27726 -23484 -54483 -46987 -49957 -4252 85235 92334
15651 92334 19502 22364 56213 50326 37711 14186 3770 22067 5337 -19188 -51057 -68919
15639 -68919 -63260 -34686 -23999 -24556 -33617 -42337 -19878 -5113 -14206 -31820 -37948 -9353 21783
15626 21783 35366 30413 46377 -3125 -44221 -61904 -6683 63111 37502 25633 25574 9658
15614 9658 -21069 18098 21859 13653 -1367 -2242 -7658 -19529 -22923 4957 6237 2369 2865 3353
15600C353J3894n299l7995o41R974K6377K4440M7086q657n2074J6465j1032l6467
15587a0576j1865j5789P868K7593K695L311r664n716N382K6867p920j3580J9958
15574A8564K8160J1688J685J9476l241Q398L0369K1718M5014K0850J9539L0895
15562B53115Q2928J00211J54847K37737K63404K58064K67268K15607J13705l3632
15552A913254j32846k33199k69541k64020k44070k21871j45053r1880n6731n0307
15542B03736m8198r61l6179l4043l1116j0687j2862K9833J230n6334J431J189
15530G039K6169J852o5556j3916K3432K9426k9686j5559K7552M2567J0963n7109
15518a2826O876Q610k8527l1469K2077N5690L374j0758k164K7202K3477m6215
$$ plain form
15600 3353 17247 11948 -26047 -26688 -16714 9663 34103 81189 72532 20458 36923 25891 -10576
15587 -10576 -22441 -38230 -30362 -2769 -74 3237 -6427 -12143 -6761 20106 12186 -1394 18564
15574 18564 46724 58412 60097 79573 76332 84730 115099 136817 181831 202681 222220 253115
15562 253115 336043 436254 591101 828838 1092242 1350306 1617574 1833181 1946886 1913254
15552 1913254 1780408 1547209 1277668 1013648 769578 547707 402654 310774 254043 203736
15542 203736 155538 154577 118398 84355 53239 42552 29690 59523 60753 4419 5850 7039
15530 7039 33208 35060 -30496 -44412 -20980 8446 -21240 -36799 -9247 33320 44283 -12826
15518 -12826 -5950 2660 -25867 -57336 -35259 20431 23805 13047 10883 38085 61562 15347
15506A5347l9132k447p832K4130M15q784J8836J9065p279l2448K487J4063J1332
15493G753K5295k2229k9417p411J0452p268L1647K6219m2078l5219J7819n59j4058
15480c9054J3092K2626j3305k1592K0804n763J8757Q005J9560k664j6168J3179
15468A7477k1383k6069K3671K0163J338j7710q994k0518M605p496J3709K2911
15456A704M805n0401j3597m375M6291L0386K1141k4753L815M312K558l2309l7126
15443d7549K0352j757n018Q550L5358k9105l0004J0232J6164K5282J5077K4072
15431D1654j6473m1999K082r817k0176k2932Q196R113n872L0532Q268m3667J1826
15418d9265K4743o054O984j051K5407L8297j7960q333N934q417k1161m8454M776
$$ plain form
15506 15347 -23785 -26232 -34064 -9934 -9519 -18303 533 19598 12319 -20129 -17642 -3579 7753
15493 7753 33048 10819 -18598 -26009 -15557 -22825 8822 35041 -7037 -42256 -24437 -24996 -39054
15480 -39054 -25962 -3336 -16641 -38233 -17429 -23192 -4435 3570 23130 20466 4298 17477
15468 17477 -3906 -29975 -6304 13859 15197 -2513 -11507 -32025 -27420 -34916 -21207 1704
15456 1704 6509 -43892 -57489 -61864 -15573 14813 35954 11201 15016 19328 21886 -10423 -47549
15443 -47549 -27197 -28954 -33972 -25422 9936 -19169 -49173 -38941 -22777 2505 17582 41654
15431 41654 25181 -16818 -14736 -24553 -44729 -67661 -59465 -50352 -56224 -25692 -17424 -61091 -49265
15418 -49265 -24522 -30576 -23592 -24643 764 39061 21101 12768 18702 10285 -10876 -59330 -54554
15405e4554o777K3646L9552j1597k4038N851j863P277J7413L775L0424k3614k8111
15392b2616m223M1955O627l933j8399j2239J2368k2508J8103J3224K69K0457j4630
15379A4455m00J4705k5817J6709J9428L2011j1989l2933j0107j7571N075r547
15367e981R194l0878M090K7245o331j0709j9170k5232J6767L1228J357M280k7682
15354c1822k6092N1541L9983K0059n9703j2159r122l6584L116K7400J3602J7290
15342b491R029j1484j6662k6933l1900J2052J4017R425R880J6535K0233k3222
15330b1521N8713L5002m400o5073n8141J409K652k9003p53O3999M0332p06l5514
15317a3004j5922K0698O4498L1721k6944m6991k288j8019J4951l770Q249p713
$$ plain form
15405 -54554 -61331 -37685 1867 -9730 -33768 -27917 -29780 -22503 -5090 -1315 29109 5495 -22616
15392 -22616 -26839 15116 21743 17810 -589 -12828 -460 -22968 -4865 8359 8628 29085 14455
15379 14455 14055 28760 2943 19652 39080 71091 59102 26169 16062 -1509 3566 -5981
15367 -5981 3213 -27665 -23575 3670 -2661 -13370 -32540 -57772 -41005 -9777 -8420 -4140 -31822
15354 -31822 -57914 -6373 33610 53669 -6034 -18193 -27315 -63899 -60783 -33383 -19781 -2491
15342 -2491 6538 -4946 -21608 -48541 -80441 -68389 -54372 -44947 -35067 -18532 1701 -21521
15330 -21521 37192 72194 67794 2721 -55420 -54011 -51359 -80362 -81115 -17116 23216 22510 -13004
15317 -13004 -28926 -8228 56270 87991 61047 14056 11768 -6251 8700 4930 13179 5466
15305E466j0630J2988r220o0358J3694K5403n664j749K6844K8942K0592R104k2337
15292C3075j0874M0780L7933j1327k3076m4459l3364j080l099J8903P666p332
15280C746k4793J148j0823n837R297j4396l500M6641L3812j8466l8133k3590Q127
15267c6767J9986k8340l2603L9549K5175n2641n1839L5173K7888M518K480K7699
15255a9722J7799n399o652L1751l073j1237J6036j4689m8046j7792P544J789j4646
15242f6337n75J6156J6091K3667J5447J8391m814k3369j4820P762J5405k7703
15230b4699L378Q970m5886K7064O2825M186l9173j5860J3813j8792j2196M9238
15218A2868J0293n0223l654Q052J4442M4264l3387l7252J5025N1322R04j8473
$$ plain form
15305 5466 -5164 7824 -1396 -61754 -48060 -22657 -28321 -30070 -3226 25716 46308 55412 33075
15292 33075 22201 62981 100914 89587 66511 22052 -11312 -12392 -15491 3412 11078 3746
15280 3746 -21047 -19899 -30722 -36559 -27262 -41658 -45158 1483 35295 16829 -21304 -44894 -36767
15267 -36767 -16781 -45121 -77724 -38175 -13000 -65641 -117480 -82307 -54419 -49901 -47421 -19722
15255 -19722 -1923 -7322 -13974 17777 14704 3467 19503 4814 -43232 -61024 -53480 -51691 -66337
15242 -66337 -66912 -50756 -34665 -10998 4449 22840 18026 -5343 -20163 -12401 3004 -24699
15230 -24699 -21321 -12351 -58237 -31173 31652 35838 -3335 -19195 -5382 -24174 -36370 12868
15218 12868 23161 -27062 -30716 -22664 -8222 36042 2655 -34597 -19572 31750 32654 14181
15206A4181n744l9438J3499j4325L849M1685N9096P118k9186m5344Q306J6639
15194C0336m1164J6095l1637l6374J3500J7153p661K2243r336O851m349k7051
15182e1394l491J401J1747K2186L6701r95l2941j3883P298J5528J5363L2305K375
15169D2200k210j557m2389p3329K5698J4307j3185R301j9568j3322O056m409N5671
15156a6736l949j0293L5880O526m0169j2827k768P712n854L1983N5084k8953m8186
15143c2550R345j5604j8559K8879M49K092l584q630J0344j5245J9698L6862j8269
15130d772l6331p143R920m621p287K5402J9426M675m574L194K2122J2913L299
15117C6223K5994N3380M7224j4642o2377j3948n4186o7937l1792J4996K9620k1837
$$ plain form
15206 14181 8437 -31001 -17502 -31827 -27978 13707 72803 79921 50735 5391 13697 30336
15194 30336 -10828 5267 -26370 -62744 -49244 -32091 -39752 -17509 -26845 -19994 -24343 -51394
15182 -51394 -54885 -53484 -41737 -19551 17150 16155 -16786 -30669 -23371 -7843 7520 39825 42200
15169 42200 39990 38433 -3956 -77285 -51587 -37280 -50465 -41164 -60732 -74054 -67998 -72407 -16736
15156 -16736 -20685 -30978 4902 11428 -28741 -41568 -44336 -36624 -42478 -10495 44589 15636 -32550
15143 -32550 -23205 -38809 -57368 -28489 -28040 -25948 -29532 -38162 -27818 -43063 -23365 13497 -4772
15130 -4772 -41103 -48246 -38326 -42947 -50234 -24832 -5406 -731 -5305 -2111 20011 32924 36223
15117 36223 62217 115597 162821 148179 85802 71854 17668 -50269 -82061 -67065 -37445 -59282
15105e9282J4154k4528l6774M2591K3301L7216p08J655J2832R419j0599L1127
15093D0404O695N975m2761m7645j9797L4552J0994m0356q429q02K4097J5787P95
15080b0491p453j9185m3223J3083L261J8513J0055K1026R030K976K6561J6177
15068C0330j2710k4680J7074J6103K4595L350Q593k2910m2319K1181J1467K088
15056C2162L053J800l6206k7961J9461k2254j0671J1069L7314j1270m9706r993
15044f3202L223j7464K8798O368j0737l4799n087N892K6535j7178m8513J6701
15032a09463K5217K3484J0630R070J2196q502j9720J9649K0244J702J4678K3169
15020B2354J5050Q425J2933n567o409l8149m0857Q636j5202j2975L2526j3247
$$ plain form
15105 -59282 -45128 -69656 -106430 -63839 -40538 -3322 -4030 -2375 10457 19876 9277 40404
15093 40404 47099 53074 10313 -37332 -57129 -22577 -11583 -51939 -60368 -61170 -37073 -21286 -20491
15080 -20491 -27944 -47129 -90352 -77269 -74008 -55495 -45440 -24414 -15384 -12408 14153 30330
15068 30330 17620 -7060 10014 26117 50712 54062 62655 39745 -2574 18607 30074 32162
15056 32162 35215 37015 809 -27152 -7691 -29945 -40616 -29547 7767 -3503 -53209 -63202
15044 -63202 -59979 -77443 -48645 -42277 -53014 -87813 -92900 -87008 -60473 -77651 -126164 -109463
15032 -109463 -84246 -60762 -50132 -41062 -28866 -37368 -57088 -37439 -17195 -15493 -815 22354
15020 22354 37404 45829 58762 53195 46786 8637 -32220 -23584 -38786 -51761 -19235 -32482
15008c2482K3765q611m6106k0857J7226J1061J4100K0303k3951L8101J385L379
14996b687J4158j1069j98n320m3098Q026M7281L3541j3450K419r191k6298j4421
14983b0307J4320k7342J1692N1278M7262k8043j4674J8091j8858j2023l8213r441
14971b6258j9580m0414K7495N5273J9736o357j80n6945N61K4511J2692j1956K1225
14958a97r02k5188k2843K6440R689K2671K1093n7454m1657j2103O2054J2511k9478
14945c5364J3881J2323J1658J7208j0183P288L05L9950Q252K3652K5516N976O757
14932A27219N441k7491n5549k0956j8250l2716J6936K6198n73R201m887L1378
14920E5951J7488m517k8809j4463M04l7788J281J1071k6368J9219J798m2571k5638
$$ plain form
15008 -32482 -8717 -17328 -63434 -84291 -67065 -56004 -41904 -21601 -45552 -7451 -6066 -2687
14996 -2687 11471 402 204 -5116 -48214 -40188 7093 40634 27184 29603 20412 -5886 -20307
14983 -20307 -5987 -33329 -21637 29641 76903 48860 34186 52277 33419 21396 -16817 -26258
14971 -26258 -45838 -86252 -58757 -3484 16252 9895 9715 -47230 -46669 -22158 -9466 -21422 -197
14958 -197 -1099 -26287 -49130 -22690 -13001 9670 30763 -26691 -68348 -80451 -18397 -5886 -35364
14945 -35364 -21483 -9160 2498 19706 9523 16811 17116 57066 65318 88970 114486 120462 127219
14932 127219 132660 105169 49620 28664 10414 -22302 -5366 20832 20259 29460 24573 55951
14920 55951 73439 68922 40113 25650 26054 -11734 -10453 618 -25750 -6531 -4733 -47304 -72942
14907g2942k6534K4236M548k782j1535L4006J8162J7834o502K8489j807K749L458
14894A1380P266l419l0216j2322p521o439P840J0052l1523k0303J8046R328j1835
14881e9666O343L2580K7253k5666m1923K2538J2057K852M5655K1756J3345j1362
14869D5762n9864J2236K2740k0527m5391j6318J8392K8135P566l760K343j4942
14857b3628K2221K0482K2354q754l0070q134M5362J520m8744r125M5419J0031
14845C8934j8593j0691Q285R692O769j2313j5216j8300J0162J0K7716J4045K205
14832D2705k0096k2922J5830R904j1351K364k3446k1503J5707O5944m617j4271
14820C4248l5555q413K1689j1626Q972K1215k1113k9288k8302n258J6562K1273
$$ plain form
14907 -72942 -99476 -75240 -70692 -73474 -85009 -51003 -32841 -15007 -21509 6980 5173 7922 11380
14894 11380 18646 15227 -14989 -27311 -34832 -41271 -33431 -23379 -54902 -75205 -57159 -47831 -59666
14881 -59666 -53323 -20743 6510 -19156 -61079 -38541 -26484 -23632 22023 43779 57124 45762
14869 45762 -14102 -1866 20874 347 -45044 -61362 -42970 -14835 -7269 -11029 -8686 -23628
14857 -23628 -1407 19075 41429 32675 2605 -5529 39833 41353 -7391 -16516 28903 38934
14845 38934 20341 9650 17935 27627 34396 22083 6867 -11433 -1271 -1261 26455 40500 42705
14832 42705 22609 -313 15517 25421 14070 16434 -7012 -28515 -12808 53136 48519 34248
14820 34248 -1307 -9720 11969 343 9315 30530 9417 -19871 -48173 -53431 -36869 -15596
14808a5596j681k8348J3662J7893j3915K8511L8626K7217L471l8965p2670k0743
14796f2538L9456j8439p705K8711L0275P554q985j4101J8639j329K3662L2364
14784F7564j9852K2125K0230l0046l5766P13j1441k5156l8583k590N2235k6037
14772b6604k5353l6224J3863K0238L193Q48k1466n208J6818l856j799o723Q295
14759f3978J4151r825R041P4627j5608n737L5843j5280R241k0482J7351Q895j6178
14746B2061l7504J8829J1243O62Q639p110l5954k7437r705K9584K8679n835j1798
14733a5646L6366L935J1187l2840m040K8058k2919k8332l2656j2673N363N2228
14721a1969R659J2436L7973k1307p486p092k9820K8016L0867P745j7982k2652
$$ plain form
14808 -15596 -17277 -45625 -31963 -14070 -27985 526 39152 66369 69840 30875 -41795 -62538
14796 -62538 -23082 -41521 -49226 -20515 9760 17314 8329 -5772 12867 11538 35200 67564
14784 67564 47712 69837 90067 60021 24255 24968 13527 -11629 -50212 -52802 -567 -26604
14772 -26604 -51957 -88181 -74318 -54080 -50887 -50039 -71505 -76713 -59895 -63751 -65550 -72273 -63978
14759 -63978 -49827 -59652 -50611 24016 8408 2671 38514 23234 32475 11993 29344 38239 22061
14746 22061 -15443 3386 14629 15291 23930 16820 -19134 -46571 -56276 -26692 1987 -3848 -15646
14733 -15646 20720 24655 35842 3002 -1038 27020 4101 -24231 -56887 -69560 -64197 -11969
14721 -11969 -2310 10126 48099 26792 19306 12214 -17606 10410 41277 49022 31040 8388
14709H388L47k2206r615j468J8323J7876L1490j4188n894k9085n404K362M6716
14696C7642n824n3034J6793L2980k5726l6104l0734L852J230J9849P754k9142
14684f0464j5859L8804J6081j950J5609j6850k0242k6009K3871L2263j5201k4423
14672e4370m106n308k4718j6039L9338O2387J9570j5471M843l684j4045j9361
14660c0964J5264m402L3016q108m408P26J0451n624j2477Q68O670L3511N198l8776
14646I45l1197m621n003L2355L238k9079J0617J5992Q685k006k1072m548J7079
14633h615M5097j0720l0723r089K8779K7272K5615k1788j7798n2536K3843K5479
14621B4816k9305J0999M416j4503K6305m742j4663j5555L1751k1549k5847m761
$$ plain form
14709 8388 8735 -13471 -23086 -24554 -6231 11645 43135 28947 23053 -6032 -11436 -9074 37642
14696 37642 31818 -21216 -4423 28557 2831 -33273 -64007 -60155 -58925 -39076 -31322 -60464
14684 -60464 -76323 -37519 -21438 -23388 -7779 -24629 -44871 -70880 -47009 -14746 -29947 -54370
14672 -54370 -58476 -63784 -88502 -104541 -65203 -2816 16754 1283 6126 2442 -11603 -30964
14660 -30964 -15700 -20102 12914 4806 398 1124 11575 5951 -6526 -5658 1012 34523 39721 945
14646 945 -30252 -34873 -39876 -7521 -4283 -33362 -22745 -6753 1932 -74 -21146 -25694 -8615
14633 -8615 36482 25762 -4961 -14050 14729 42001 67616 45828 28030 -24506 -663 24816
14621 24816 -4489 6510 10926 -3577 22728 17986 3323 -12232 19519 -2030 -27877 -32638
14609c2638n889j2163Q644r404L2684O717K6475J9108n826M0659j176QJ0204o4689
14595A2714j7410K7249j5382j3192k8997L1644L9323k0944L3N831k9587j7923
14583b6641L5632q64r967M3358M377j856o347n0758n0570N165L3687J1680J154
14570a1950R685J8988K0013k106P419j9761k3064L014r135K8475M4836R398l500
14557G2312l3818k3601J500M21j3133j9410l827K795K4065L9310L7830O819k2925
14544F8338j2749l0106m4186j9023K6563L5229l0116m6242J4898J5446j0872L429
14532b9391K7409n252q697j6406k0102q01R427J6205O015K5658M7642K3801j1917
14519F3591k3040l6479J1340m5180j8558L0505M104J2056k0210k5536q692L7929
$$ plain form
14609 -32638 -38527 -50690 -42046 -51450 -18766 -12049 14426 33534 27708 68367 67191 67199 77403 12714
14595 12714 -4696 22553 7171 -6021 -35018 -3374 35949 15005 15038 20869 -8718 -26641
14583 -26641 8991 8127 -1840 41518 45895 44039 37692 -13066 -63636 -58471 -24784 -13104 -11950
14570 -11950 -2265 16723 36736 34630 42049 22288 -776 2238 -6897 21578 66414 75812 72312
14557 72312 38494 14893 16393 16814 3681 -15729 -19556 -16761 7304 46614 84444 91263 68338
14544 68338 55589 25483 -18703 -37726 -11163 24066 -6050 -52292 -37394 -21948 -32820 -29391
14532 -29391 -1982 -7234 -15931 -32337 -52439 -53240 -43813 -27608 -21593 4065 51707 75508 63591
14519 63591 40551 4072 15412 -29768 -48326 -17821 -13717 -1661 -21871 -47407 -56099 -18170
14507a8170P628L2905J4446r538J6283N1749K1155m4248L419k7376k3794j217
14495B3242p397q059p086J3933J1822K8802K6320o702j7932j8527r79j9562l69
14482A7506k4666k1610Q782N375K3974N4233j1346m178j8441j8979J3739M768
14470B9157k9416k5682L8717J3974j1959K1742p062l0664k617M450m2296j4136
14458e5792J2754K080K705K7284M65L012J4238L9013K7149j2048k9102k8433j3287
14445i962J1375j2501l323r065K4199M3753L416m0385J0943K7482l2866J8247
14433C1313M2098L2135K6663k9001n0736l5575l4237l6985L3895J06k2989L236
14421d0077L6232l0944k60k830j8095l90L9851N2619J418j2871k5644J4116m62
$$ plain form
14507 -18170 -10542 22363 36809 27271 43554 95303 116458 72210 75629 48253 24459 23242
14495 23242 15845 7786 700 14633 26455 55257 81577 74875 56943 38416 37437 17875 17506
14482 17506 -7160 -28770 -19988 -14613 9361 63594 52248 48070 29629 10650 24389 29157
14470 29157 -259 -25941 12776 26750 14791 36533 29471 -1193 -3810 640 -41656 -55792
14458 -55792 -43038 -40958 -38253 -10969 -10504 -7492 6746 45759 72908 60860 31758 3325 -9962
14445 -9962 1413 -11088 -14411 -23476 723 44476 47892 7507 18450 45932 13066 31313
14433 31313 73411 105546 132209 103208 52472 16897 -17340 -54325 -20430 -20324 -43313 -40077
14421 -40077 -3845 -34789 -35049 -37879 -55974 -56364 -16513 36106 37524 24653 -991 13125 12663
14408A2663l906q767l2886k117R446k5719J52J9064Q312o587J4982L8265K0142
14395D3044k041J7713j7626n8594K5119O3390K1340m2625k9650K9684k6119m0900
14383a7265k1592O382j0903p854m628L0978J3324L938M0570L7588k8737L052j8231
14370B6622k1624K4277K3098p980l0866l7017K424R198j4180K2947J9949j3033
14358C815j9163k7532J262M9956l7055j1800L2657M5862k0244k8868J5207j8814
14346a4717o121K0769J5901J1108K8568K380k9725J0737K6858j1520l674m1919
14334H645l5353K2891Q846k7156J1075N734n387L9575L7247r372k2300m157r150
14321B1138O038m728j7839K326N9356k7207l7983j7435j6723j1777K8621k4812
$$ plain form
14408 12663 8757 -10 -32896 -35013 -25567 -51286 -51134 -32070 -23758 -30345 -15363 22902 43044
14395 43044 41003 58716 41090 -17504 7615 71005 92345 49720 20070 49754 23635 -17265
14383 -17265 -38857 -32475 -43378 -51232 -55860 -24882 -11558 -7620 32950 70538 41801 44853 26622
14370 26622 4998 29275 52373 44393 13527 -23490 -21066 -11868 -26048 -3101 16848 3815
14358 3815 -15348 -42880 -41618 8338 -28717 -40517 -7860 38002 17758 -11110 4097 -14717
14346 -14717 -20838 -69 15832 26940 55508 57888 28163 38900 65758 54238 50564 8645
14334 8645 -26708 -3817 5029 -22127 -11052 -5318 -10705 28870 66117 56745 34445 30288 21138
14321 21138 27176 22448 4609 6935 66291 39084 1101 -16334 -33057 -44834 -16213 -41025
14309d1025m1487L5214M4223J738M414J6448j3148l2318J6883J6506P847k6487
14297a1192J8323M317J7290l6587j1686j1740L5165L4594L018l427j0107k3L7256
14284F5201j588L416k4433k1934q515J0293L1877M2947n177l2448m3606j2872
14272C161J1647R576M054k6018m4881j318L3516L4100j1561m149k4719j7613N2999
14259A8794O186Q054j6452k5545k5788J6459l615R915L5592J3483k4638k6316
14247a3871k9326o107N5060p445l6989N885J8305j4725r122N5170L4535j4855
14235C6515K9239k9840q027j6778J811j3077k830r400L798L678j3643M343K5291
14222A1080K2257j4115l1616j8126n26k0844o240R991L2369K4794J4103j4264
$$ plain form
14309 -41025 -82512 -47298 -3075 -1337 3077 19525 6377 -25941 -9058 7448 15295 -11192
14297 -11192 7131 11448 28738 -7849 -19535 -31275 3890 38484 41502 38075 27968 27945 65201
14284 65201 63613 67029 42596 20662 12147 22440 54317 97264 92087 59639 16033 3161
14272 3161 14808 24384 28438 2420 -42461 -43779 -10263 23837 12276 8127 -16592 -34205 18794
14259 18794 24980 33034 16582 -8963 -34751 -18292 -21907 -11992 23600 37083 12445 -13871
14247 -13871 -43197 -49304 5756 -1689 -38678 -32793 -14488 -29213 -38335 16835 51370 36515
14235 36515 65754 35914 27887 11109 12920 -157 -2987 -12387 -8589 -4911 -18554 -14211 11080
14222 11080 33337 19222 -12394 -30520 -31046 -51890 -58130 -48139 -15770 9024 23127 8863
14210H863j4350j3887M320K8968k0161R499O963K061p035q094m699l416J4252
14197C284L9380J2482P010l4068l4729j0713O4366L823l630l2288l555K1812K8286
14184F1460j6844r916K1636P284k6082p755j5071k1584k0588P462K1697K5173
14172B6872J9662J9521j1550m2604J6323K6822J3522j7930j1791P078K6055J10
14160G2090K8704J1502r250q714j1572R112O2705L4889P035j1757l6439J8910
14148A67215L6718N1090O2081O4710J55325K73732M45075P41364Q25309O50017
14138C472636K23553q61263j038094o69057m00088k22240j02011o8702o1580k3089
14128B50065n5078p6129k1995q278n582k4846l159k0010k6758J7372R531k3962
$$ plain form
14210 8863 -5487 -19374 -15054 13914 -6247 3252 10215 12276 5241 -2853 -7552 -10968 3284
14197 3284 42664 55146 62156 28088 -6641 -17354 47012 50835 47205 14917 11362 33174 61460
14184 61460 44616 34700 56336 63620 37538 29783 14712 -6872 -27460 -19998 1699 26872
14172 26872 46534 66055 54505 11901 28224 55046 68568 50638 38847 45925 71980 72090
14160 72090 100794 112296 103046 94332 82760 91872 154577 189466 196501 184744 148305 167215
14148 167215 203933 255023 317104 381814 537139 810871 1255946 1997310 2822619 3472636
14138 3472636 3696189 2834926 1796832 1127775 727687 505447 403436 334734 273154 250065
14128 250065 194987 118858 96863 88585 83003 58157 54998 34988 8230 25602 35133 11171
14116A1171n6321l1788Q999K5018K9016L4305O887M73L0391k5603l2734K1852
14104B1666O50J254J5329K4349j737k1732j3706L8633R881n80J914p2485n1937
14091d8501j1270L9596M3526K2389l6851j1567j1174J5621j0231k3351J596J3148
14079a7069N1689J4927j5881p934j4588k8091j0499J6450J3699L5277r118j0958
14067A7904m0635j0024K6051L8076J6501P890k3191J536J8506j4067j6298Q626
14055C0875m5019K795O4086N981P671k0365j6531q49o146j0589l8843J2270J0690
14042c974O1515M561r821j703k5526J7913k0009l0906j0846l702J931K7937o865
14029E05k7376n515L0930j0155J8201L1459J2897P154k253l4372k0197j6101k5030
$$ plain form
14116 11171 -45150 -76938 -67939 -42921 -13905 20400 27287 27760 58151 32548 -186 21666
14104 21666 22316 23570 38899 63248 61511 39779 26073 64706 74587 74007 75921 3436 -48501
14091 -48501 -59771 -20175 23351 45740 8889 -2678 -13852 1769 -8462 -31813 -30217 -17069
14079 -17069 34620 49547 33666 25732 11144 -16947 -27446 -10996 2703 37980 28862 17904
14067 17904 -22731 -32755 -6704 31372 47873 55763 32572 34108 52614 38547 22249 30875
14055 30875 -14144 -11349 52737 58718 66389 46024 29493 28644 22498 11909 -26934 -14664 -3974
14042 -3974 57541 62102 52281 50578 25052 42965 22956 -7950 -18796 -22498 -20567 7370 505
14029 505 -26871 -32386 -1456 -11611 6590 38049 50946 58100 55847 21475 1278 -14823 -39853
14016c9853q781M181j2977l1166K9456K7256J9997K8879k950J144J5080j7304
14004A2962l4108J4932L4777M1600K014j4767L267j5999m7479k6350K3093L4384
13992B8326l9068m358M285K7562P214k4540j1352l77j0402j92k3776L305j6103
13979e9476J0811P865L5571K522L5481L0963j032L251M552Q85j3485q87J4185
13966G1206j0266m4244l8732o539j0555k4010J5767Q68L6584L2096K4120j5684
13954C0611q218j5372J2178K999L0250J0221P384K404K2364J451l1057l833k0265
13941D1117k8287M542L2053r703M4031k591l1879K467L3428q06n807k6574l270
13928D8721J6587L7000K2795j6368R586l6048N398P500k9256k9937j7475K6499
$$ plain form
14016 -39853 -48634 -44453 -57430 -88596 -59140 -31884 -11887 16992 14042 15186 30266 12962
14004 12962 -21146 -6214 28563 70163 72177 57410 60677 44678 -2801 -29151 -6058 28326
13992 28326 -10742 -15100 -10815 16747 23961 -579 -11931 -12308 -22710 -22902 -46678 -43373 -59476
13979 -59476 -48665 -40800 -5229 -2707 32774 63737 62705 65956 70508 71393 57908 57021 71206
13966 71206 60940 16696 -22036 -28575 -39130 -63140 -47373 -46505 -9921 22175 46295 30611
13954 30611 22393 7021 19199 22198 52448 62669 70053 72457 94821 96272 65215 61382 41117
13941 41117 12830 17372 49425 39722 83753 81162 49283 51750 85178 84372 78565 51991 48721
13928 48721 65308 102308 125103 108735 118321 82273 87671 95171 65915 35978 18503 45002
13916D5002l1435k4426K4019J3204j5854J84k4403p835K3121m445p01P232J6018
13903A9681J8763k9969n020O874j5714K2013O5313K5148j0692o563O31j8816J0399
13890H2048j8202p094j2978p570m016r988j3816m310J2053k206O212p910J1582
13877B3805n837J0599p715k4316l9644J6312L4114J1259K3238k2875o382J1498
13865B4056m5562k6909l079L5175K0538J5763N4544K5597p495l2460j6658k658
13853D0852J1511L1407L2677K9885j2971l0416j4668j0918J2706o74k9307q291
13841E1793k2904j2337j1551N326p648M3435N313o243L1040l2388r5072k2047
13829g3283L0726L4097L1269Q498K8158L1072l7526n9452J349K6614m540M952
$$ plain form
13916 45002 13567 -10859 13160 26364 10510 10694 -13709 -21544 1577 -2868 -3569 3663 19681
13903 19681 38444 8475 3455 10329 -5385 16628 81941 107089 96397 89834 90465 71649 82048
13890 82048 63846 56752 43774 36204 32188 22200 8384 4074 16127 13921 20133 12223 23805
13877 23805 17968 28567 20852 -3464 -43108 -26796 7318 18577 41815 18940 12558 24056
13865 24056 -21506 -48415 -51494 -16319 4219 19982 74526 100123 92628 60168 43510 40852
13853 40852 52363 83770 116447 146332 133361 102945 88277 77359 90065 89391 60084 51793
13841 51793 28889 16552 5001 10327 2679 46114 51427 45184 76224 43836 -51236 -73283
13829 -73283 -42557 -8460 22809 31307 59465 90537 53011 -6441 -5092 21522 16982 21934
13817B1934O427k36K9475K7263n664k7067n376L3280L0364o0177m5120R674K4297
13804C9074Q240p675k2248O072R007N4356L0434n696k3090J1161j6262k9574M891
13791E8690M9351K2183k1516m0413j7532k2865k5057k5792L7124K0701J4029P635
13779E6538k6288j9546L8938J2306P138N344J5285r131m0940J9079L1837p145
13767H3415P323k415l4573K4881m290K0519J5646K9096m967j4947n8359j0N742
13754F7061K8807L8850P040k9311m1228j0820P490J1956K6633l3796o158k8552
13742C7972K502J7708k2629j9646J0892J7160K464j4694k0455j2113K6079M6086
13730G1326L7795k8806k4583n12k2256J3253J8645R476M4975j2927q902m198J0147
$$ plain form
13817 21934 28361 28125 57600 84863 79199 52132 46756 80036 110400 50223 5103 14777 39074
13804 39074 47314 39639 17391 23463 32470 86826 117260 111564 88474 99635 83373 53799 58690
13791 58690 108041 130224 108708 68295 50763 27898 2841 -22951 14173 34874 48903 56538
13779 56538 30250 10704 49642 61948 69086 74430 89715 80584 39644 58723 90560 83415
13767 83415 90738 88323 53750 78631 74341 94860 110506 139602 134635 119688 61329 61319 67061
13754 67061 95868 134718 141758 112447 71219 60399 67889 79845 106478 72682 66524 37972
13742 37972 40474 58182 35553 15907 26799 43959 46423 31729 11274 -839 25240 71326
13730 71326 109121 80315 55732 55220 32964 46217 64862 74338 119313 106386 97484 93286 103433
13717A03433n1033K6253J0269J243q969J859N183K2656q898k7166j7233N394k0214
13704D2777j1135M9547N3600R2717P6036L8832K3616P289n1707m9623p1005j6781
13692A84163k2177q127J171j8998J7623m2363J3048J4358j6421j421M5250r987
13680A56119n4808p3651m1918K2382N1999J4849M1465N4286j0263j9155P74Q108
13668A50187j1034k3524r418N8732K7844K8047N3449P9719Q5334J33948J75526
13657G48810J10506J4557o2714j35422q8526M011J9953O3080J10564P9182j0553
13646H53448r9280j84051j10258p4996p4643p7995l1375N82K9024k3273k9945
13635A77238r383k444Q835J0865q68K2795L7442J1147j263K4572M1923K2479o220
$$ plain form
13717 103433 52400 78653 88922 90165 81196 83055 88238 110894 101996 74830 57597 62991 42777
13704 42777 31642 81189 134789 227506 303542 342374 365990 373279 321572 271949 200944 184163
13692 184163 161986 153859 155030 136032 153655 111292 124340 138698 122277 120856 166106 156119
13680 156119 101311 27660 -14258 8124 60123 74972 116437 170723 160460 141305 142079 150187
13668 150187 139153 115629 106211 164943 192787 220834 274283 354002 439336 573284 748810
13657 748810 859316 873873 811159 675737 587211 591222 611175 674255 784819 864001 853448
13646 853448 754168 570117 459859 384863 310220 232225 200850 201432 230456 207183 177238
13635 177238 167855 165411 174246 185111 184243 207038 244480 255627 254364 278936 320859 343338 337118
13622C37118K6920O0107O2713O3628N5316J00357J15131Q2423J9926j8498J4309
13611I19450R9572J84285K75046K84494J25685j13376l03767l50120k57480k11955
13601F51834j61822q1346o0526L113K2825n269J3703K2961m896K2063J1618L9168
13589D73426J09243J30008J63271J67724R5955n1851j26722k05972j76125r7889
13579D81068m8991k7849m3596l4022N1273J6573L3662M5171O9637J25805J72327
13568H41058J52601J07584N4861n7992j67841j95388j69314j30503m7411j4251
13558C73404M913J6001J2010J9138K4294J14028J03214J21191J97472K07014K18423
13547A411102J18626K512j6412k1100m4064j56205k28592k02975j56205r7352
$$ plain form
13622 337118 364038 424145 486858 550486 605802 706159 821290 903713 923639 905141 919450
13611 919450 1019022 1203307 1478353 1762847 1888532 1775156 1471389 1121269 863789 651834
13601 651834 490012 408666 348140 351253 374078 368809 382512 405473 400577 422640 434258 473426
13589 473426 582669 712677 875948 1043672 1139627 1087776 961054 755082 578957 481068
13579 481068 432077 404228 360632 326610 377883 394456 428118 473289 542926 668731 841058
13568 841058 993659 1101243 1156104 1098112 930271 734883 565569 435066 387655 373404
13558 373404 378317 394318 406328 425466 449760 563788 667002 788193 985665 1192679 1411102
13547 1411102 1529728 1532240 1515828 1494728 1450664 1294459 1065867 862892 706687 609335
13537F09335n1872q247j7235k2813m2735o9031q0428l8127k2677j1776J0294j0107
13525B44581j8825J9443r554n0824J823N7560K3587q094J5410L4132M8805K7581
13513C85625p881L1889Q2139J03143J57922K18871K14696J44337r751j11948j84896
13502A024146j65745r7026j8106n066k8497l9621K963k2049l9145o3155o0832
13491D87867o4821p5689p6463J514k4859k4313n321j2835J6581j7513J9658K2780
13479B46586k8235r859o991p727p567k1552k726L2385J4264K2086J2009j2121
13467B30552p755J00L959L6929K6092m577K1706L9756R5032J40124N9876J6768
13455F58562o1653o1408m8081o7541k2284j1535m1931m3405k4929l5892l396j6394
$$ plain form
13537 609335 557463 549216 531981 509168 466433 397402 316974 278847 256170 244394 254688 244581
13525 244581 225756 245199 235645 184821 186644 244204 267791 259697 275107 309239 358044 385625
13513 385625 377744 409633 491772 594915 752837 971708 1186404 1330741 1320990 1209042 1024146
13502 1024146 858401 761375 743269 738203 709706 670085 673048 650999 611854 548699 487867
13491 487867 423046 347357 270894 272408 247549 223236 217915 205080 221661 204148 223806 246586
13479 246586 218351 208492 201501 193774 186207 164655 161929 194314 208578 230664 242673 230552
13467 230552 222797 222897 226856 263785 289877 285300 307006 346762 441794 581918 641794 658562
13455 658562 596909 535501 487420 419879 397595 386060 344129 300724 275795 239903 236507 220113
13443B20113j1989k7837L1156M35j3287l0277j8526L6579M8472K150l578j3155
13431B20256J0050K5750K3356o351k0094r732k0260L2137L3529k4486l933N220
13419B65442m508n255J46m2997l033J8731K8651N848q315L396J1628j7773K3483
13406B75444L4574J6606q970r769K042Q003J1606J0294K008j9928M576L267L1009
13393C60762K4363K8382l0737n8011j2844l4274j5608l4535M2611K5742N5437
13382C51288O01p066k3244l6653J5481j138L026J1366N5062k8103l5488L3832
13370C38964k0850n2655l0490K397J6532k623p244P9313Q2170J02172R9047Q6221
13358F92954J17511N4092K9487R8300J86145K71066K16702L8484j62880l33351
$$ plain form
13443 220113 208124 180287 211443 211878 198591 168314 149788 186367 234839 236989 233411 220256
13431 220256 230306 256056 279412 273061 252967 243235 222975 255112 288641 264155 260222 265442
13419 265442 260934 255679 255825 212828 209795 228526 257177 263025 254710 258106 269734 251961 275444
13406 275444 310018 326624 317654 307885 309927 317930 329536 339830 341838 321910 326486 329753 360762
13393 360762 385125 413507 382770 324759 311915 277641 262033 227498 270109 295851 351288
13382 351288 351889 344823 321579 284926 300407 299269 302295 313661 368723 340620 305132 338964
13370 338964 318114 265459 234969 237366 253898 251275 244031 323344 405514 507686 606733 692954
13358 692954 810465 864557 894044 992344 1178489 1449555 1666257 1704741 1541861 1208510
13348A208510k86679j56423j00167j02746p2517l9301l3139J0727M1202Q2404
13338E51871O5076K1719K1929k8619k8383p180K2998K8124K8645K5944J5757K8470
13326G46351Q4215J02429Q6919J00060J31571K20336K80064L51325L19072L30983
13316B753325K22038P7011J42971L46597N46975N83704L48988j38516m31356m15083
13306D036654k10628k6305M388k23319m19118m40590k88852n4545J03715L18731
13296B800131N08229M81564K14525j11321m55687n94104n64192l57764j79827
13287A741554j05041k6084M6619J65735K82407L91663L02185J43699j75974l47966
13277B418797l87462k61829j53652j21786p9127J7463J36237J40840J64185K27860
$$ plain form
13348 1208510 921831 765408 665241 562495 489978 450677 417538 428265 469467 551871
13338 551871 616947 638666 660595 631976 603593 596413 619411 647535 676180 702124 717881 746351
13326 746351 830566 932995 1019914 1119974 1251545 1471881 1751945 2103270 2422342 2753325
13316 2753325 2975363 3052374 3195345 3541942 4088917 4672621 5021609 4883093 4451737 4036654
13306 4036654 3826026 3799721 3804109 3580790 3161672 2721082 2432230 2377685 2481400 2800131
13296 2800131 3308360 3789924 4004449 3893128 3437441 2843337 2279145 1921381 1741554
13287 1741554 1636513 1610429 1657048 1822783 2105190 2496853 2799038 2942737 2766763 2418797
13277 2418797 2031335 1769506 1615854 1494068 1414941 1432404 1568641 1709481 1873666 2101526
13267B101526L95887N56072O11394M15370n8923n39866p45468n99162l75965k37352
13257A523513j49267j29757o9079k4207j6120K0780M9696K5311M2626K3979J31
13246A297606L584K2142L9129j564l9981J3186N0638J00848J38779J44455J16164
13235A884986R6495Q4430J40613J75706K17366K61272L36625L53679M07351M70403
13225D428926N17411O68616Q50047J183455J642924K214538K886819L571889M599614
13216B2564239O332502P495403P093685K729798l930764q924160r595254o746378
13208A7019071l949378k150374j143680p19810n15429k71986J07345N97311J196509
13199A0169579K044234L194000M271969M451838L104546J8602l067119m418006
$$ plain form
13267 2101526 2497413 3053485 3664879 4080249 4021326 3481460 2735992 2136830 1760865 1523513
13257 1523513 1374246 1244489 1175410 1151203 1135083 1155863 1205559 1230870 1273496 1297475 1297606
13246 1297606 1301190 1323332 1362461 1360897 1320916 1334102 1384740 1485588 1624367 1768822 1884986
13235 1884986 1981481 2065911 2206524 2382230 2599596 2860868 3197493 3551172 3958523 4428926
13225 4428926 4946337 5614953 6465000 7648455 9291379 11505917 14392736 17964625 22564239
13216 22564239 28896741 36392144 43485829 46215627 42284863 33360703 23765449 17019071
13208 17019071 13069693 10919319 9775639 9055829 8540400 8268414 8375759 8973070 10169579
13199 10169579 12213813 15407813 19679782 24131620 27236166 27254768 24187649 19769643
13191A9769643l739670k477653j366405o07893j53751J61190M00383O63663R69469
13182A3618976J289104J662099K009910K493037L263877M395087O327850R575866
13174D4635806J4899391K2329131K8191988K8023540J7221398l446123k1320554
13167A30534577k8819322k3287898j4072604o410866j68329N990325J2570752
13160G6336635J7680077J8384549J1701752k677359j5197260k0413040j5934757
13153F9880597p829028j31286P400050J5551604K2194958K3818743J6668550k05953
13145A47348235j6335167k4825662k1253804j2736979m876256J752583Q303228
13138G7376178J5917669K3079160K5962975K1167006N542574j1964094k2779851
$$ plain form
13191 19769643 16029973 13552320 12185915 11578022 11424271 11585461 11985844 12649507 13618976
13182 13618976 14908080 16570179 18580089 21073126 24337003 28732090 35059940 44635806
13174 44635806 59535197 81864328 110056316 138079856 155301254 151855131 130534577
13167 130534577 101715255 78427357 64354753 57943887 57775558 63765883 76336635
13160 76336635 94016712 112401261 124103013 121425654 106228394 85815354 69880597
13153 69880597 62051569 61920283 69320333 84871937 107066895 130885638 147554188 147348235
13145 147348235 131013068 106187406 84933602 72196623 67320367 69072950 77376178
13138 77376178 93293847 116373007 142335982 163502988 169045562 157081468 134301617
13131A34301617k0431252r026810M585099J9489139L3364062L9550325L3504129
13124B35336309Q604314j7505671l0329528j9511375n7773J0140381M747678j3719696
13116A77704639l1454318l6938148k9798937k0199859j3071439q594789n754513
13109C1892636l732807k300209j256136o32321l33411k35306j98168r3292K11015
13100B3322001Q31897J498288K160864K778476L454071M322802N552473P546564
13092E1467436J0727537J5969615K3849680L1660620L4042050K6955771Q605781
13085B03278490r069510j2243490L351005K1768047K7514081J4024244j6809676
13078B31813191m3140279m5469598k9878713j3159153R04516J3106120K0991128
$$ plain form
13131 134301617 113870365 104843555 109428654 128917793 162281855 201832180 235336309
13124 235336309 243940623 226434952 196105424 176594049 176536276 186676657 191424335 177704639
13116 177704639 146250321 109312173 79513236 59313377 46241938 37647149 31892636
13109 31892636 28159829 25859620 24603484 23971163 23637752 23402446 23204278 23110986 23322001
13100 23322001 24153898 25652186 27813050 30591526 34045597 38368399 43920872 51467436
13092 51467436 62194973 78164588 102014268 133674888 167716938 194672709 203278490
13085 203278490 194208980 181965490 185316495 207084542 234598623 248622867 231813191
13078 231813191 188672912 143203314 113324601 100165448 101069964 114176084 135167212
13071A35167212K0636906R326309j0497535k6228004k7812922j9965166j1411276
13064F9215524m525088J430664Q055437J6029875K2725082K3169489J4282226
13057A50383209m516058k2613533k7780482k0904005j1553043l484935L737783
13050F3268936J1332996J7983619J9743790J3748717q50255j6554939k2471506
13043H6201358j7603992r888904l170201K723949R277335J7447729K5132499K6676034
13035A36795807J8028719k508283k4890831l4428237k8607763j9043124j1910126
13028C3436162p420089m770482l187622k209362j672873j427110j224186r95394
13020A0529044o44569l09667J3217L14632N96522J050535J857380K931888L860355
$$ plain form
13071 135167212 155804118 165130427 154632892 128404888 100591966 80626800 69215524
13064 69215524 64690436 66121100 74176537 90206412 112931494 136100983 150383209
13057 150383209 145867151 123253618 95473136 74569131 63016088 59531153 63268936
13050 63268936 74601932 92585551 112329341 126078058 125227803 108672864 86201358
13043 86201358 68597366 58708462 55538261 58262210 67539545 84987274 110119773 136795807
13035 136795807 154824526 152316243 127425412 92997175 64389412 45346288 33436162
13028 33436162 26016073 21245591 18057969 15848607 14175734 12748624 11524438 10529044
13020 10529044 9884475 9574808 9588025 9902657 10499179 11549714 13407094 16338982 20199337
13011B0199337L869551K420836o56560l604691m766909l934326k590471j501159
13003I435608q03052l66950p1668K09380N20273J005117J719330K907348M985520
12994A9540906P673917R105552P845215K403943m910090r263222q140695n386202
12986A8869324l871926l359286k803210k009679j354340r22789o27455m58731
12978C461908l29962k24362j91104j89796j95390k37729j82952j56651j17999
12969A635963j18066r1576j4097n708J6993R570m8552q0474j12675n4662m7626
12958A089090m5742l8733j4625K2574L3504N2827l2155o0405k9400l8569j3286
12947I25080o2467l2041j0315m7769k4296K8297K2836l1643l8869l624q431l873
$$ plain form
13011 20199337 24068888 26489724 25833164 22228473 17461564 13527238 10936767 9435608
13003 9435608 8632556 8265606 8193938 8403318 8923591 9928708 11648038 14555386 19540906
12994 19540906 27214823 36320375 44165590 46569533 41659443 32396221 24255526 18869324
12986 18869324 14997398 11638112 8834902 6825223 5470883 4548094 3920639 3461908
12978 3461908 3131946 2907584 2716480 2526684 2331294 2093565 1910613 1753962 1635963
12969 1635963 1517897 1426321 1412224 1406516 1423509 1433079 1384527 1304053 1191378 1136716 1089090
12958 1089090 1043348 1004615 989990 1012564 1046068 1098895 1066740 1006335 976935 938366 925080
12947 925080 862613 830572 820257 772488 748192 776489 799325 767682 728813 725189 716758 712885
12935G12885K1373q186j4808L845M960n3007n5865k7574K0393N2256L3912L5564
12923G25748J5867m2885j4799j9697l6698N197M6148M5003L8047J06120J81897
12912A049948K17728J76017R9775n9421k63401l27463j92112j65726q6764p5651
12902C72930n9191m8950P879k8284p6808l8714L1878O1996Q787q573k7566o6929
12890A28455k3220M5324O9700R0385L4486l1879p962k1817p7300j0793L4522L1333
12878B61234m394M3022M7123j6663j8953j9445j2700l5354P832k7315k9089L9767
12866B35065L4947K6069J8256L0728j6935j0781j6895n6150m0383k2688j8741
12855A62492J245K6754L6752K7104K6056O542j4516j4466m1454j5609m391j2099
$$ plain form
12935 712885 734258 726072 711264 715109 720069 667062 611197 583623 604016 656272 690184 725748
12923 725748 741615 698730 683931 664234 627536 632733 678881 723884 761931 868051 1049948
12912 1049948 1267676 1443693 1543468 1484047 1220646 893183 701071 535345 448581 372930
12902 372930 313739 264789 272668 244384 167576 128862 160740 222736 231523 222950 195384 128455
12890 128455 105235 150559 220259 310644 345130 313251 305289 283472 206172 195379 229901 261234
12878 261234 256840 299862 346985 330322 311369 291924 279224 243870 251702 224387 195298 235065
12866 235065 270012 296081 314337 345065 328130 317349 300454 244304 203921 181233 162492
12855 162492 163737 190491 227243 254347 280403 286945 272429 257963 216509 200900 196509 184410
12843A84410M5751M7795O6173J3517r215Q32k7230q326j5374m299k8587j8597
12831B46850l5440p340J5837R79P061j215L45k7501l1618J3436J0316O071l7116
12818A60665K9288L7496K6131j9340k5182L1168J5762K2452k7915l6217M1924
12807B56232o257O600K4403K5310k1985m0194j0197k3928L312M8559L9910l4405
12795B67360j8104p7L0207p318m148M594M933n03N401N670m0055j6982O0711K5773
12781C17462K1186P831J6159j9238Q07J545J7666P163k6511j7686j5477J0020
12769C20927Q1685L7923j3032M63J1597K5243J3872p951j0792J8914k1192l8943
12757D18714k9216o561L0791J5427N153K4281J637m2577J8901J1887j7651j5987
$$ plain form
12843 184410 230161 277956 344129 357646 348431 349263 322033 313707 298333 294034 265447 246850
12831 246850 211410 204070 219907 220886 227947 226732 227077 199576 167958 181394 191710 197781 160665
12818 160665 189953 227449 253580 234240 209058 240226 255988 278440 250525 214308 256232
12807 256232 249975 256575 280978 306288 284303 244109 233912 209984 213296 261855 301765 267360
12795 267360 249256 249179 279386 272068 267920 272514 277447 276944 282345 288015 247960 230978 291689 317462
12781 317462 338648 346479 362638 343400 344207 345752 363418 370581 344070 326384 310907 320927
12769 320927 402612 440535 427503 427966 439563 464806 478678 470727 459935 478849 457657 418714
12757 418714 389498 382937 413728 429155 434308 458589 460226 417649 436550 448437 430786 414799
12745D14799M4734O2872L6919P6131J06813R8970Q332o8130q1172n6566l8498
12734F05204j8778j140O53l2732m2761j9053K2477r084k3839P189j1042j6725
12722D60369m474K0648J0622L4963j2278o744j4891J9495R773Q002K8754L5668
12710E89907j9466M1423L5640Q0504R9325R7334P6465R9902J03222M2996k2354
12699A224898p140K28j823m085j3539Q2379J56896J73036J81999R3348l5831k02187
12687A648179k66231j79031j02342q5942l3396n5851l3873o287j4225J2086K7130
12676I10217q698L1160O3967M3878L9681N4263N3594J17086R1717N5728P6266
12665A528859L0634P296M8181L0969J6746K1243P7114P0213J51876K59884L03850
$$ plain form
12745 414799 459533 522405 559324 635455 742268 841238 849570 781440 700268 643702 605204
12734 605204 586426 585286 585939 553207 510446 491393 513870 504786 480947 488136 477094 460369
12722 460369 455895 476543 487165 522128 509850 503106 488215 507710 517483 525485 554239 589907
12710 589907 570441 611864 647504 728008 827333 924667 1001132 1101034 1204256 1247252 1224898
12699 1224898 1217758 1217986 1216163 1212078 1198539 1280918 1437814 1610850 1792849 1886197 1850366 1648179
12687 1648179 1381948 1202917 1100575 1014633 981237 925386 891513 885226 871001 883087 910217
12676 910217 901519 932679 996646 1040524 1080205 1134468 1188062 1305148 1396865 1452593 1528859
12665 1528859 1559493 1566789 1614970 1645939 1662685 1683928 1761042 1831255 1983131 2243015 2546865
12654B546865K83073K09284O1693r3676p3741j54158l12865l16553k78771j99851
12644A671300j32937l3578P5274J06946J2310l7556o5473n7516K6778R7031J11442
12633A774021K13527K03938J26189K6648j22271j74250j61099j08716o4416k9005
12623A684566j1933j4684q4945m2978o5670l9543K2309N6073J30747J21047J50226
12612A905215J43214J8979n4669j51140j38314r9305l3079k9852n5784o7758p3533
12601A363974q9239r4201m6615k5816N547O466O1438J21278K22156L22100K87128
12590B134216J71383l9084k40703l21133k90534k07693q0635k6914l6985k1800
12580A040118q7907j11726q1532m2843j3907k1742l367M948m473l1712l2491n556
$$ plain form
12654 2546865 2829938 3039222 3100915 3007239 2933498 2779340 2466475 2149922 1871151 1671300
12644 1671300 1538363 1504785 1580059 1687005 1699315 1661759 1596286 1538770 1565548 1662579 1774021
12633 1774021 1987548 2191486 2317675 2344323 2222052 2047802 1886703 1777987 1713571 1684566
12623 1684566 1672633 1657949 1573004 1530026 1464356 1424813 1447122 1503195 1633942 1754989 1905215
12612 1905215 2048429 2067408 2012739 1861599 1723285 1623980 1590901 1561049 1505265 1437507 1363974
12601 1363974 1274735 1180534 1133919 1108103 1113650 1120116 1181554 1302832 1524988 1847088 2134216
12590 2134216 2305599 2266515 2025812 1704679 1414145 1206452 1125817 1098903 1061918 1040118
12580 1040118 952211 840485 758953 716110 702203 680461 677094 682042 677569 645857 613366 607810
12568F07810k5163m4390o2430m5282j4027N1001j4415j4736O456J4644k6162j3964
12556D19342M10M3455O3907P1877J19409J84903J14558P1336l0817p1382j17798
12545H69200o4141J9539O6338J29762J34731L8055n0289r0173r8134o2131J2515
12534I05272k1588q722J9478M9672P0468J40800K11493K43363M79714Q10960J118406
12523D019316R91573N79164o07912j440487j192795p78876m50352k41663j73036
12514G04932j28301r5817n9652k8286M808k4798j6827j3880L8101J1612J6024
12503D07916J7631K6105M0665P4953K755m8840p9431r4612m0379J4532k8177k9633
12491B63485m7424n7901Q085k795n032k0901j6485J3309l1699k2694J6423J6867
$$ plain form
12568 607810 582647 538257 475827 430545 416518 467519 453104 438368 444824 459468 433306 419342
12556 419342 419752 463207 527114 598991 718400 903303 1017861 1089197 1058380 986998 869200
12545 869200 805059 824598 890936 1020698 1155429 1193484 1143195 1053022 954888 892757 905272
12534 905272 883684 874962 894440 944112 1014580 1155380 1366873 1610236 2089950 2900910 4019316
12523 4019316 5010889 5590053 4982141 3541654 2348859 1569983 1119631 877968 704932
12514 704932 576631 480814 421162 392876 397684 372886 356059 342179 380280 391892 407916
12503 407916 425547 451652 492317 567270 570025 521185 441754 347142 306763 321295 293118 263485
12491 263485 216061 158160 166245 163450 158418 137517 121032 134341 102642 79948 96371 113238
12479A13238J9903j1911J0020K4363M1011Q677l5004N073L519Q160K994L0325
12467B20368R294L0133J0375J8439k216m2097n1323J1726K1748j4355K3198j1513
12455B23777k4330k9734k7740j2709j4624J072j9780l8347Q611N5443J5587k9415
12443A07811K6128J0913k0399J4435J8453J2045M5470J8501J1657j7687k8971
12432A98356l6153k5761N886j7927j1390J3982R581J0203M7567L3144k481Q275
12420B33282K7344n0030k1126r877j5432l3543O077J8411Q69l3370L396l179k1822
12407A01000R374K5178m1651k1674k0664q35l2512p213L8228J0042r961M716J6007
12394G0035O023L8794J4927l2796j3187j0040l7703q51k1861l7644l3093N111
$$ plain form
12479 113238 133141 121230 131250 155613 196624 205301 170297 175370 178889 187049 190043 220368
12467 220368 229662 259795 270170 288609 286393 244296 192973 204699 226447 212092 235290 223777
12455 223777 199447 169713 141973 129264 114640 115712 95932 57585 66196 121639 137226 107811
12443 107811 133939 144852 124453 138888 157341 169386 214856 233357 245014 227327 198356
12432 198356 162203 136442 142328 124401 113011 126993 136574 146777 194344 227488 225007 233282
12420 233282 260626 210596 189470 179593 164161 130618 136695 155106 155975 122605 126001 122822 101000
12407 101000 110374 135552 93901 72227 51563 50728 18216 11003 49231 59273 49312 54028 70035
12394 70035 76058 114852 129779 96983 83796 73756 36053 35202 13341 -24303 -57396 -52285
12382e2285N1791O7034o273k4731K086M731m4782K903L9664L2304K2946J6677
12370A12065J8978P218q233l0866m397l0492l8132K8865L737J9236M6q498o2412
12357G115O674J9229l0724k2133J8233J0822j6244n852J1880L5009K377l936J6212
12344D8662k2326m3805n3058J2034J4427K796q394k1321K1462L8805o154k340
12332a9212j6709p717K6633K2821J4023r208o333j9581Q254J1285j722n9Q995
12319A1470K717k21j1777L250M5601q244n2271p466J9569M0036o740l762K1357
12306E3519K7o619J7779J966J0650j2708l6057j8806j2910J0346j84K519K5570
12293C5092r88m5371p863J8647m813K0784L623Q388k7871r643M7420J904n5743
$$ plain form
12382 -52285 -494 66540 60267 35536 37622 42353 -2429 474 40138 72442 95388 112065
12370 112065 131043 138261 130028 99162 94765 64273 26141 55006 58743 77979 78025 69527 7115
12357 7115 13789 33018 2294 -19839 -1606 9216 -7028 -12880 -1000 34009 36386 32450 48662
12344 48662 26336 -17469 -70527 -58493 -44066 -41270 -49664 -70985 -49523 -10718 -16872 -19212
12332 -19212 -35921 -43638 -17005 5816 19839 10631 4298 -15283 -7029 4256 2534 2475 11470
12319 11470 14187 13966 2189 5439 51040 42796 -9475 -16941 2628 42664 35924 32162 53519
12306 53519 53546 46927 64706 66672 77322 64614 28557 9751 -3159 7187 7003 9522 35092
12293 35092 34104 -11267 -19130 -483 -5296 15488 19111 27499 -372 -10015 37405 39309 -16434
12280a6434R076n67j8030j304L4328o282q35j3349r109j2744m356m279q925n533
12266e8343j684K1569L9187J2883J9678L7886k504N284L054m3603j2939k3958
12254c490k2280n517M4082L7686Q07p542l6321l781j6941K20K5909j7646k9743
12241c4557n94P574K1271l612K3669N261k0228K5268M177k9435J2543j9997j9307
12228b7967R409o085k8479j5265K5226K4833K5096J8238K2967j3797n8996q983
12216c3803M6137q160J8107j7980j8465K7042J8933k640Q33J4038j5309l1848
12204c115o667o550l7991J4589L8981j3722j1918K0539l29m662J1987J2478o2562
12191d8942l6973J1411K8101M9507K7139j5525m1367r04J4220L8616K9986m345
$$ plain form
12280 -16434 -7358 -7925 -25955 -27259 7069 787 -48 -13397 -22506 -35250 -39606 -43885 -52810 -58343
12266 -58343 -60027 -38458 729 13612 33290 71176 68672 73956 77010 33407 20468 -3490
12254 -3490 -25770 -31287 12795 50481 51288 43746 7425 3644 -13297 -13077 12832 -4814 -34557
12241 -34557 -35151 -27577 -6306 -9918 13751 19012 -1216 24052 28229 -1206 11337 -8660 -27967
12228 -27967 -18558 -24643 -53122 -68387 -43161 -18328 6768 25006 47973 34176 -24820 -33803
12216 -33803 12334 4174 22281 4301 -14164 12878 31811 29171 30004 44042 28733 -3115
12204 -3115 -9782 -16332 -54323 -39734 -753 -14475 -26393 -5854 -6183 -10845 1142 13620 -48942
12191 -48942 -85915 -74504 -46403 3104 30243 14718 -26649 -27553 -13333 25283 55269 50924
12179E0924K9503O413l9089m1313P010K1132j7484l7346K188J4148R215L8299
12167D3600J1744k1177m0244j0713q216N38l066L4743J7449M2023K547O918Q517
12154H4663P529k4191m9387j1966k8915K067L9430J0554R089n44l0322J918J9877
12141B9802M53J7307J2113l9482j5866J6789N8952J1391m1583J1007J9219k0238
12129E9864l1773k0979j2928K8743m106k4223o538k2128q587n755K0243J2276
12117a5891L753p878K5549j4190j4471O504m804k0568k6656p726J6179L3844K9372
12104C017q121k0538R363M0222K2974k8660m8723k1894j7934M0968R480K1743
12092A897L0968J3391j2325j2354k3019k5544k42j3031J3383K9581J0337K036
$$ plain form
12179 50924 80427 86840 47751 6438 13448 34580 17096 -20250 -18062 -3914 5301 43600
12167 43600 55344 34167 -6077 -16790 -25006 -24468 -27534 7209 24658 66681 69228 76146 84663
12154 84663 92192 68001 18614 6648 -22267 -20200 19230 29784 38873 38329 8007 9925 29802
12141 29802 30255 47562 59675 20193 4327 21116 80068 91459 49876 60883 80102 59864
12129 59864 28091 7112 -5816 22927 18821 -5402 -11940 -34068 -42655 -48410 -28167 -15891
12117 -15891 -12138 -20016 5533 -8657 -23128 -16624 -21428 -41996 -68652 -76378 -60199 -26355 3017
12104 3017 -5104 -25642 -16279 23943 46917 18257 -30466 -52360 -70294 -29326 -19846 1897
12092 1897 32865 46256 33931 21577 -1442 -26986 -27228 -40259 -26876 2705 13042 15078
12080A5078k3725j1930j9081M484L4072k564n008k3085k5024J1951L1359L3097
12068A9624M9995j5022N824k4552k8767o193o567j423K270M8545k4348l1357K003
12055i968Q361j662j0555j7030L8940M090J026K0310n121l8018L2503J7965j7386
12042B3455J387k1682J36K2773j4735o1808j4320K7184J630j4930J3929P988j5035
12029d4028J8229J4325k770P10j7591j2588p625j4828L1520M3014J4648k8212
12017e196k3467j0633m357K2698N785L6435j5814k6662q760j6485N616L4149J0496
12004C805j3860j7988j6645K8193m826j2773j0361k5160l1898l6948M6223O3654
11992b8584M8602J0602K2796j5699k4289P748Q871l1580J4259J4233M5580k9626
$$ plain form
12080 15078 -8647 -20577 -39658 -35174 -1102 -3666 -8674 -31759 -56783 -44832 -13473 19624
12068 19624 69619 54597 60421 35869 7102 909 -5658 -7081 -4811 43734 19386 -11971 -9968
12055 -9968 -1607 -3269 -13824 -30854 8086 12176 13202 33512 28391 -9627 22876 40841 23455
12042 23455 24842 3160 3296 26069 11334 -50474 -64794 -37610 -35980 -50910 -36981 -28993 -44028
12029 -44028 -25799 -11474 -14244 -13534 -31125 -43713 -51338 -66166 -34646 8368 23016 -5196
12017 -5196 -28663 -39296 -43653 -20955 -15170 21265 5451 -21211 -29971 -46456 -40840 -6691 3805
12004 3805 -10055 -28043 -44688 -16495 -21321 -34094 -44455 -69615 -101513 -138461 -92238 -28584
11992 -28584 20018 30620 53416 37717 13428 21176 30047 -1533 12726 26959 72539 42913
11980D2913l1596p61K341K3868P519j926J3460K5914p24k8456j3844j6800K281
11967B4189m9659J6630O5574p287n2219o998j4294J8914l7120o1387K6530N9441
11955a7686r862k4860k3011K8146L2211M8150L2942O968k2871k164K3797n77l6269
11942C4914r990m2106O038M3967k625p12q889P686J7639n7024p542L0104M455
11929A5915k1620k7395K4043k0421j9130K2903K8157J8821L0435L096o1266j7452
11917b3914N7952K104K513J7699n1854m947K0967j6606M098l9412l2718L349K0079
11904d0690k2571Q125J2223R651j1677M0632l554k6648j2624m4469J7218K6580
11892d7804L6278L0835J441k7962N583J9048l877k2356Q980j6390j8654J0331
$$ plain form
11980 42913 11317 10556 12897 36765 44284 42358 55818 81732 81008 52552 38708 21908 24189
11967 24189 -25470 -8840 56734 49447 -2772 -9770 -24064 -5150 -42270 -103657 -77127 -17686
11955 -17686 -27548 -52408 -75419 -47273 -15062 33088 66030 72998 50127 47963 71760 71183 34914
11942 34914 24924 -17182 -11144 32823 30198 29486 20597 28283 45922 -11102 -18644 11460 15915
11929 15915 -5705 -33100 -9057 -29478 -48608 -25705 2452 21273 51708 54804 -6462 -23914
11917 -23914 34038 36142 38655 56354 4500 -447 20520 3914 8012 -31400 -64118 -60769 -40690
11904 -40690 -63261 -55136 -42913 -33262 -44939 -4307 -7861 -34509 -47133 -91602 -74384 -47804
11892 -47804 -11526 19309 20750 -7212 -1629 17419 13542 -8814 166 -16224 -34878 -24547
11880b4547R067N840N6100K7162J6151j4066j8073l0583j4738r852j8406l3765
11868d9710r786p504K493j1546L591Q791M3477L9222p029n3347o792K5232k939
11855b5847j4438R14K892j4884K0683M5236J6360j7947j2769O151J7912m9186
11843b4923j190K272k1044l7699J2216L9836K236m5787L385N8266L9118J0376
11831C7062L279J5484j9737k2267m844l2018j2836R11j4420k6805N9285m314m7352
11818f8572M839J8262j754O87K8057M0793O725J2474J203m042n115o945l1694
11805e082j5127L74L7443j9405l1637j3007k2540J4336J4034J7367K1202K1997
11793A9955j6854j4499j510L8037j6714J1105O3247N850N470q581k1792k7925
$$ plain form
11880 -24547 -15480 -9640 46460 73622 89773 75707 57634 27051 12313 2461 -15945 -49710
11868 -49710 -59496 -67000 -64507 -76053 -72462 -63671 -20194 19028 11999 -41348 -48140 -22908 -25847
11855 -25847 -40285 -39371 -36479 -51363 -30680 14556 30916 12969 200 6351 24263 -24923
11843 -24923 -26113 -23841 -44885 -82584 -70368 -30532 -28296 -74083 -70698 -12432 26686 37062
11831 37062 40341 55825 36088 13821 8977 -23041 -35877 -34966 -49386 -76191 -16906 -21220 -68572
11818 -68572 -63733 -45471 -47225 -46538 -18481 22312 29037 41511 42714 38672 33557 26612 -5082
11805 -5082 -20209 -19835 17608 -1797 -33434 -46441 -68981 -54645 -40611 -23244 -2042 19955
11793 19955 3101 -11398 -12908 25129 8415 19520 82767 88617 94087 85506 63714 35789
11781C5789k7174l9488r006j2795j1992K6171k4757o5J6110Q2123k4459j8290
11769g833J4927M104J5352J0819j7195l5610J1922L1136l3480k6k5873k4238J7555
11756c8440l9087l9645L8014N2595K8075J9157l4440o645L4506p906j7182j2269
11744b3267J705R329l3947J9729L2216j0770j0489l363L1235M6159J3314q487
11732F3364n8956m9316N7317j4288l145k4444m332J634J3733l988o717K886M74
11719b5778K2175K5202O005j2514l7634j6726P08O302q109J1404K7206p950m3882
11706e3591K190L2362M990j670K5984K0107N009k0142j9731j3942N579N336K8190
11693B0671M3010m3173k8754n484k0898k3392J4779L0463m1054k5469j3192j0333
$$ plain form
11781 35789 8615 -30873 -39879 -52674 -64666 -38495 -63252 -63317 -47207 34916 10457 -7833
11769 -7833 7094 11198 26550 37369 20174 -15436 -3514 27622 -5858 -5884 -31757 -55995 -38440
11756 -38440 -77527 -117172 -79158 -26563 1512 20669 -13771 -20416 14090 6184 -10998 -23267
11744 -23267 -21562 -12233 -46180 -26451 5765 -5005 -15494 -18857 12378 58537 71851 63364
11732 63364 4408 -44908 12409 -1879 -5024 -29468 -33800 -32166 -18433 -22421 -29138 -26252 -25778
11719 -25778 -3603 21599 27604 15090 -22544 -39270 -38562 -32260 -40369 -28965 -1759 -9709 -53591
11706 -53591 -51401 -19039 -14049 -15719 10265 30372 35381 15239 -4492 -18434 -12855 -7519 20671
11693 20671 63681 20508 -8246 -13730 -34628 -58020 -43241 -12778 -53832 -79301 -92493 -102826
11681a02826K66L0261J6879J4984j5726k5685K0373N3789o174o165K5879K4502
11669C0357j4088j2500o340J5398l2863p222J9831r118k7447J9213K7666k6995
11657b4108K4695O2518j4454l2389K8995J7752J0521n1955j6832J6586p309o021
11645G999k4905M413K6184l4958m0233P282M4455J0410r099J9679m3401k2653
11633e4827L3331k1382K657N3314J7930M618j5633j3009m1552j2527p328K233
11621e2175j1168J6688o041j7580K2832K9162l312K7911l1511j3479K4851N682
11609h140M736L0074K4138j5078J0730K8538K8656N787j7826l6217l5818J9110
11597C8690P543l1967n428j8476j5595Q042k4897j5272J4025R419K770L6341Q486
$$ plain form
11681 -102826 -102560 -72299 -55420 -40436 -56162 -81847 -61474 -7685 -13859 -20024 5855 30357
11669 30357 16269 3769 -2571 12827 -20036 -27258 -7427 -16545 -43992 -24779 2887 -24108
11657 -24108 587 63105 48651 16262 45257 63009 73530 21575 4743 21329 14020 7999
11645 7999 -16906 -12493 13691 -21267 -61500 -54218 -9763 647 -8452 11227 -32174 -54827
11633 -54827 -21496 -42878 -40221 13093 31023 35641 20008 6999 -34553 -47080 -54408 -52175
11621 -52175 -63343 -46655 -52696 -70276 -47444 -18282 -21594 6317 -25194 -38673 -13822 -8140
11609 -8140 -3404 26670 50808 35730 46460 74998 103654 109441 91615 55398 19580 38690
11597 38690 46233 14266 8838 -9638 -25233 -17191 -42088 -57360 -43335 -33916 -31146 5195 13681
11584A3681k6032r592K521R086P829p777J7432j0902j0616k4056j8269L454J7703
11571c5538J5655o319J6874M3603N0319L9687l0694j0620o558m2601M144J215
11559C9167j9780m2453k0030O447J1639K8435J1533k3278j6063L3656K2157k7001
11547D429J0138N829J4909L570O723k2000j9209j1745j3182j4687K0589K0345
11535E709L1303J4614l683J226r185n3048J0849J9617j3071k0136Q711j5037j8547
11522d0678j1520j8923K0585J8699m1856L3887N3089J8255J0942J3718P69j8860
11510C8107k9736L931j2852l0093K126l5702j4431K9097M0386r159n987L0256
11498E943K701j058j4908o583j0324j165Q412J7873l17P23J888n1310n54O643
$$ plain form
11584 13681 -12351 -21943 -19422 -10336 -2507 -10284 7148 -3754 -14370 -38426 -56695 -53241 -35538
11571 -35538 -19883 -26202 -9328 34275 84594 124281 93587 82967 76409 33808 37952 39167
11559 39167 19387 -23066 -43096 -36649 -25010 3425 14958 -8320 -24383 9273 31430 4429
11547 4429 14567 20396 35305 38875 45598 23598 4389 -7356 -20538 -35225 -14636 5709
11535 5709 37012 51626 47943 49169 39984 -13064 -2215 17402 4331 -15805 -7094 -22131 -40678
11522 -40678 -52198 -71121 -50536 -31837 -73693 -39806 13283 31538 42480 56198 56967 38107
11510 38107 8371 12302 -550 -30643 -28517 -64219 -78650 -49553 -9167 -18326 -24313 5943
11498 5943 8644 7586 -7322 -13905 -24229 -25394 -16982 891 574 1297 3185 -48125 -48679 -42036
11484d2036K8469K1860L0946K3523J6254J6743J9147p0537m2645J1966P21l3401
11472a8990k2356J7809O687M1057M4126k3761n4023m9896r171n494l442o774R875
11459g4353J6835K5752J0052J3821M9186p547j214N445j4989N566k9780o891J3000
11446D883k1432j3589j3329k1988L080j9464q104M0111K3933j9400L2639M1099
11434B8439N138J0477j2526l2417l5938j1546J0490n410P632R590N5804L1250
11422F0983l5292n3983L9011J578k6240m410L2602K6035k1074k7030l22J4018
11410E876k369m1062l0137R828L4185K6640R057j2497l4707K2016O177k9208l9489
11397g5690o269L4151K8800K4922j5837k0118J1175k152J6096j3242M770J2600
$$ plain form
11484 -42036 -13567 8293 39239 62762 79016 95759 114906 44369 1724 13690 14411 -18990
11472 -18990 -41346 -23537 -16850 24207 68333 44572 -9451 -59347 -68518 -74012 -77454 -84228 -74353
11459 -74353 -57518 -31766 -21714 -7893 41293 33746 32532 37977 22988 28554 -1226 -8117 4883
11446 4883 -16549 -30138 -43467 -65455 -62375 -81839 -89943 -49832 -25899 -45299 -12660 28439
11434 28439 33577 44054 31528 -889 -36827 -48373 -37883 -43293 -35661 -26071 29733 60983
11422 60983 25691 -28292 10719 12297 -13943 -18353 14249 40284 19210 -7820 -8142 5876
11410 5876 3507 -37555 -67692 -57864 -23679 2961 12018 -479 -35186 -13170 -6993 -36201 -75690
11397 -75690 -81959 -47808 -19008 5914 -9923 -30041 -18866 -21018 -4922 -18164 -13394 -794
11385g94J5671n460r355R79N627m930J5875J0804j7446L2515N3756j7663m8877
11372C0702J1535L7288j0232K597J0521l8572q048l6354m049K7261J1504j0755
11360B3398J248K343k7590k1651p500J7203O2451k496l7636R666r971j7807k9423
11347c7765o551J4129L8248L3307J1745P325k0714j7552J5087r583l6420j5724
11335b4468J958k6774l512K0360j1897J1587o454L3108L105J2661K688j3505J424
11322B81K3927J0365P115M622K5606n1570o5044j8208M6246M7972O364N399n6722
11309a3647l5472k0349m77O9491P885k622J1028R922k4271O13L6980m690K5343
11296E9734R816l3344l4940r650n403K2106j499k6665p789J4819J9493m0825L26
$$ plain form
11385 -794 14877 9417 62 1041 6668 1738 17613 28417 10971 43486 97242 79579 30702
11372 30702 42237 79525 69293 71890 82411 43839 35791 -563 -4612 22649 34153 23398
11360 23398 24646 26989 -601 -22252 -29752 -12549 49902 47406 9770 19436 9465 -8342 -37765
11347 -37765 -44316 -30187 8061 41368 53113 60438 39724 22172 37259 27676 -8744 -24468
11335 -24468 -22510 -49284 -52796 -32436 -44333 -32746 -39200 -6092 -2987 9674 12362 -1143 281
11322 281 24208 34573 41688 46310 71916 20346 -44698 -62906 -16660 31312 37676 43075 -13647
11309 -13647 -49119 -69468 -69945 -454 7431 4809 15837 25759 1488 2101 39081 34391 59734
11296 59734 69550 36206 1266 -8384 -13787 8319 6820 -19845 -27634 -12815 6678 -34147 -33821
11283c3821J3021K1905o095K907P016m117J1410k2839k043k2373j3950L9185J047
11270h747k6361l2507j6508J898P648K3891M1961Q927J3385J9143J379l477K1459
11257E2091K417m6235m2907k6613o986L455o385l334K3377J816J181L5655L2305
11244A9837q968j5047j279O1330O414j0398k3622k5265k3468j4775L8677r517
11232f081l4786j254j9296L444J1065q037L647J0469K9002O70l3466K4552J4834
11219e237R10L3100j9028m6550L8668K5223l8179l5591r973J1133L3840J4885
11207C201j605j4204j5386L3180N477r827q742J8741j1640m2534K5177J256j7930
11194c4836j8486K5464L2050K6576j1201j7492l3395k0590j1751J5053J7982k0638
$$ plain form
11283 -33821 -20800 1105 -4990 -2083 4933 816 12226 -10613 -12656 -35029 -48979 -9794 -8747
11270 -8747 -35108 -67615 -84123 -82225 -74577 -50686 -8725 202 13587 32730 34109 30632 52091
11257 52091 54508 8273 -34634 -61247 -68233 -64778 -71163 -74497 -51120 -49304 -48123 -12468 19837
11244 19837 10869 -4178 -5457 55873 62287 51889 28267 3002 -20466 -35241 3436 -6081
11232 -6081 -40867 -42121 -61417 -57973 -46908 -54945 -51298 -40829 -11827 -11157 -44623 -20071 -5237
11219 -5237 -4327 28773 9745 -36805 1863 27086 -11093 -46684 -56657 -45524 -11684 3201
11207 3201 1596 -12608 -27994 5186 10663 836 -7906 10835 -805 -43339 -18162 -16906 -34836
11194 -34836 -53322 -27858 4192 30768 19567 2075 -31320 -51910 -63661 -48608 -30626 -51264
11182e1264n674M9482J6296J5183R570m470p492j1942L7868l430l0755m524K206
11169A1054J2395N324k1872k8171k1111j7270p756J3104Q600J7471J802j0967
11157c7397J491J3578M312J6993n579k0425r867J7198L0959j0184O49K0155K1863
11144D3746j2076l2218m696M6736M7418j9890l5886M0958K1510K8489j9268n8715
11132D6108j4656J7198K589l6479l8664J270K868M296Q959J5354j002j1588j820
11119e567p723L1978K554o660K5472k3016j5834L1645k7073k0212r211j2823K0828
11106a5642L9282k4527r010J268L267K4896L1658j7113J9251m4530n7398j0325
11094e8923J5310k3497k1849M4849M6238l4084q433L2981n129J8772K1712L1399
$$ plain form
11182 -51264 -56938 -7456 8840 24023 33593 29123 21631 9689 47557 44127 13372 8848 11054
11169 11054 23449 28773 6901 -21270 -42381 -59651 -67407 -54303 -45703 -28232 -26430 -37397
11157 -37397 -35906 -22328 -18016 -1023 -6602 -27027 -36894 -19696 11263 1079 1728 21883 43746
11144 43746 31670 -548 -5244 41492 88910 69020 33134 74092 95602 124091 104823 46108
11132 46108 31452 48650 51239 14760 -23904 -22634 -19766 -15470 -6511 8843 7841 -3747 -5567
11119 -5567 -13290 18688 21242 14582 40054 17038 1204 32849 5776 -14436 -23647 -36470 -15642
11106 -15642 23640 -887 -9897 -8629 -5362 19534 51192 34079 53330 8800 -48598 -58923
11094 -58923 -43613 -67110 -88959 -44110 2128 -31956 -40389 -7408 -12537 6235 27947 59346
11082E9346J8029J8850L6336n1785m7666k0419J8499K9614K265j1904l2048J9986
11070C9103K1506r107l4542j8067Q795j7232L2043k3249k1701k5114l275k7165
11058g8005j1400K1502O0158l818l2735N2973J8768J6047j5779o566p065k3k2663
11045h606O257J6118J3677k347N966q817J6854K9080K9901j3435j4242l0252k7048
11032A3106p656J5754r62j5558L9963K0740O501q153J163J5463K0216Q410m5409
11019F3578N583p062l6323L4534j735j403K0172P16J5590M3866J7635N5448M8038
11006B58637L5764j302J4274M7665L6945K1415J30638J26486J15390J63044K37216
10995A186172L24318M78148P34329J231345J963596K113376J489379p4151k339240
$$ plain form
11082 59346 77375 96225 132561 80776 33110 12691 31190 60804 63069 51165 19117 39103
11070 39103 60609 51502 16960 -1107 7688 -9544 22499 -750 -22451 -47565 -50840 -78005
11058 -78005 -89405 -67903 -7745 -11563 -44298 8675 27443 43490 27711 21145 14080 14057 -8606
11045 -8606 -2349 13769 27446 25099 31065 22248 39102 68182 98083 84648 70406 40154 13106
11032 13106 5450 21204 20242 4684 44647 65387 71888 63735 64898 80361 100577 108987 63578
11019 63578 69161 62099 25776 60310 58575 57172 77344 78060 93650 137516 155151 210599 258637
11006 258637 294401 293099 307373 355038 391983 413398 544036 670522 785912 948956 1186172
10995 1186172 1510490 1988638 2722967 3954312 5917908 8031284 9520663 9446512 7107272
10986G107272k484897j599884r82222o19766l60666k15836j55617r7431r8923
10977D92030m8278k4452n3159n2021p2625l7041m9878k1398n04l5861k9013j9950
10965D7850M73p586K8262L4510M4491L1170J8108p0425m3024j5098J032R609M2154
10952A21526J0423j7296l670Q85j8846j3646j9013j3336M235Q999L6704J0071
10940A07036J1526j7988l3766k9634K8734J8330l738k3579q142j3900k6541J7450
10928B5788R434N0008K7032J377j6986k5991m182O51M6686m492m9145j2536l793
10915D3851l939k6486J4456j6983K516K004K5286p007K522k479m540j5461j658
10902A2082j2612m4413j9948J9276K3482o309O558N3070L5404J5068M3817n20
$$ plain form
10986 7107272 4622375 3022491 2040269 1420503 1059837 844001 688384 590953 492030
10977 492030 443752 419300 366141 314120 241495 204454 154576 133178 132674 96813 67800 47850
10965 47850 48323 40737 68999 103509 148000 179170 197278 126853 83829 68731 69763 79372 121526
10952 121526 131949 114653 110983 111868 93022 79376 60363 47027 51262 60261 96965 107036
10940 107036 118562 100574 66808 37174 65908 84238 80500 56921 48779 34879 8338 25788
10928 25788 35222 85230 112262 113639 96653 70662 66480 67131 113817 109325 60180 47644 43851
10915 43851 39912 13426 27882 10899 13415 15419 40705 33698 36220 33741 29201 13740 12082
10902 12082 -530 -44943 -64891 -45615 -22133 -28442 -21884 31186 66590 81658 125475 124955
10890A24955M3309L9983Q935k858n8398k5466l0065k7644q934k938Q387K5335
10878I4601m589L8818Q930J036q649j2040k9255n3253j8493j5547q357J890J9748
10865A4840J1695J9514l4646J0605r404k418K3680J2417J092J7078k127j8260
10853D4066k1451J0336J3250k6296K0025P944j2364j960j1024j9132l3775K2591
10841g790M9836J2356j0722K2674M2368N4699K8970O1005K3884m3932l1282k5738
10829A76328k6187m2241k6056o409k7828l7977l6522K5853K1091J0859q990k6842
10817d921r734j9284J4623Q620K0627J257J0516K0790K927J1415J1006k2251J0266
10804E5857O858J4254n2579l5505j3205K7886k251k2074M966L8489M1046j3332
$$ plain form
10890 124955 168264 208247 217182 214324 155926 130460 100395 72751 63817 60879 69266 94601
10878 94601 90012 128830 137760 138796 130147 118107 88852 35599 17106 1559 -6798 -4908 14840
10865 14840 26535 46049 11403 22008 12604 10186 33866 46283 47375 64453 62326 44066
10853 44066 22615 32951 46201 19905 39930 47874 35510 33550 22526 3394 -30381 -7790
10841 -7790 42046 54402 43680 66354 108722 163421 192391 253396 277280 233348 202066 176328
10829 176328 150141 107900 81844 75435 47607 9630 -26892 -1039 20052 30911 21921 -4921
10817 -4921 -14655 -33939 -19316 -10696 9931 11188 21704 42494 45421 56836 67842 45591 55857
10804 55857 62715 76969 24390 -11115 -24320 3566 1315 -20759 -15793 22696 63742 50410
10792E0410q686K1813K2091m2762l7942J1475M4703j6117j2065K1605j763l2676
10780B0086k810j231k2203L9990M811j3401K338M908l608k6699l0476J3080L5352
10767B0137j9702J5308L2296j3217k3951k6839l1884o012L4574J4167j4223K0027
10755F81K3723J0809j2115p444o316j1346j2969k3879J4937P573L0367L6411J6740
10742F7172J3626L9004q354j9954K188p272j2928m192p556p272k823j1039o813
10729C3787l2752m5903j2379L7389J6624m248M959j9588k2715J8413K3083K2159
10717A8829k161R801J9005K1752q904l2459l6487L741L0191M116J26n950K5888
10704D7488k972k152k8224M029N289k7811J3086L3218q048k8050q570k8086J1005
$$ plain form
10792 50410 41724 63537 85628 42866 4924 16399 61102 44985 32920 54525 52762 20086
10780 20086 17276 16045 -6158 33832 38643 25242 27580 32488 28880 2181 -28295 -15215 20137
10767 20137 435 15743 48039 34822 10871 -15968 -47852 -53864 -19290 -5123 -19346 681
10755 681 24404 35213 23098 15654 9338 -2008 -14977 -38856 -23919 -16346 14021 50432 67172
10742 67172 80798 119802 111448 91494 93682 86410 73482 69290 61734 54462 51639 40600 33787
10729 33787 1035 -44868 -57247 -19858 -3234 -7482 -2523 -22111 -44826 -26413 -3330 18829
10717 18829 16668 26469 45474 67226 58322 25863 -10624 -6883 23308 27424 27550 21600 47488
10704 47488 44516 42364 14140 18169 23458 -4353 8733 41951 33903 5853 -2717 -30803 -19798
10691a9798k452M252k0146J6828R54K5740P91j7727N926K0743r742k1176k5201
10678d1008p543j231J0194K061L7097K7440k827l1079m2007k6626P013K2756L9798
10665e962J9596l2806j0530K8733l5544l5550M686J5987j8657K7496K6757M0019
10653B4225J1004l9977K1486j3474m3137j8259L2506M5557l883N083M9186R023
10641G9340o221K5418j1818n6480k0975O372k2391l4143N0549M6506j3968j4193
10629B7996l3359n685n3937k144N5481o596p108j9997j131K2298L3015O619P601
10616B3053j9933n711k2157K4666K14k2164P005m7499k83N8066j169m3925L0582
10603a9255J5661l5334N509K9220R146m55J469J1479j0315l610L300J3919R179
$$ plain form
10691 -19798 -22250 -17998 -38144 -21316 -20362 5378 6169 -11558 -5632 15111 5369 -15807 -41008
10678 -41008 -48551 -49782 -39588 -37527 -430 27010 24183 -6896 -48903 -75529 -68516 -45760 -5962
10665 -5962 13634 -19172 -29702 -969 -36513 -72063 -67377 -51390 -70047 -42551 -15794 24225
10653 24225 35229 -4748 16738 3264 -39873 -58132 -25626 19931 16048 21131 70317 79340
10641 79340 73119 98537 86719 30239 9264 15636 -6755 -40898 9651 56157 42189 27996
10629 27996 -5363 -11048 -64985 -67129 -11648 -18244 -25352 -45349 -46480 -24182 8833 15452 23053
10616 23053 3120 -2591 -24748 -82 132 -22032 -15027 -62526 -62809 -4743 -5912 -49837 -19255
10603 -19255 -3594 -38928 -33419 -4199 4947 4492 5961 17440 7125 3515 6815 20734 29913
10590B9913L9715j9380j4927j280k5262j6698j0885J72K4740l7059K3935K429
10578d587l6179J8913J6621K3058j7737J2166L518l5489j5992j8116M975K1719
10566b7130M2732n323J959j4823l6471j1522k2730k06M6561N0522k6740n8977
10554f2148K4392N0428k0179j2902M5508Q981J427j1810j1177J5018k5134j8280
10542a5876J8889j1821l494J0744o906K263j7405l6679L4051K8506J2000J1851
10530B6123n6380l78K1498J8008j418J262r750J7332k7496r943Q334M4243L0185
10517F1620j6352m2570K3031j8392m3618J324J9202m724j8426N579P102O5100
10505C8876K4003k0389j9159m0041r789R487K7292J960o704M4221o6025l8467
$$ plain form
10590 29913 69628 50248 35321 34041 8779 -7919 -18804 -18632 6108 -30951 -7016 -4587
10578 -4587 -40766 -21853 -5232 17826 89 12255 15773 -19716 -35708 -53824 -48849 -27130
10566 -27130 15602 10279 12238 -2585 -39056 -50578 -73308 -73514 -26953 23569 -3171 -62148
10554 -62148 -37756 12672 -7507 -20409 25099 34080 35507 23697 12520 27538 2404 -15876
10542 -15876 3013 -8808 -12302 -1558 -8464 -6201 -23606 -60285 -26234 2272 14272 26123
10530 26123 -30257 -30635 -9137 8871 7453 8715 -1035 16297 -11199 -21142 -12808 31435 61620
10517 61620 45268 2698 25729 7337 -36281 -34957 -15755 -20479 -38905 -33326 -26224 38876
10505 38876 62879 42490 23331 -16710 -26499 -17012 10280 12240 5536 49757 -16268 -54735
10493e4735J9413K2531L7433L3653r948j801p656l0936m515M9298L3077k3924
10481F1890j6311j055L638k8520J3584L385j3537j54k3380m767p039j8140j1261
10468d1667O788J1530J4594m6603Q456N7798l201K1478J2201j0268j2565L1108
10456D9649o288n164j9121o13M4831K8557J0218l3785m43j7845q347q442n010
10443B8197k0608k987L9001M3319J4825j7355j4125J4853J804L383K5582l7805
10431G8084o0859k7326p492j1119J7772J5136P214j5352j9493r913L2648M5421
$$ plain form
10493 -54735 -35322 -12791 24642 58295 48347 46546 38890 7954 3439 52737 85814 61890
10481 61890 45579 44524 48162 19642 33226 36611 23074 22920 -460 -5227 -12266 -30406 -41667
10468 -41667 -34879 -23349 -8755 -55358 -46902 10896 7695 29173 41374 31106 18541 49649
10456 49649 43361 38197 19076 18463 63294 91851 102069 68284 67841 49996 41649 33207 28197
10443 28197 7589 4602 43603 86922 101747 84392 70267 85120 86924 90307 115889 78084
10431 78084 17225 -10101 -17593 -28712 -10940 4196 11410 -3942 -23435 -33348 -700 44721
$$ [...]
##END NTUPLES=NMR SPECTRUM
##END=
