##TITLE=Analysis number 316467
Compound Code mo 07688
Book Reference 461/200/4
Project Code adrs
Chemist Name toml
##JCAMPDX= 6.0         $$ Bruker NMR JCAMP-DX V2.0
##DATA TYPE= NMR SPECTRUM
##DATA CLASS= NTUPLES
##ORIGIN= Bruker BioSpin GmbH
##OWNER= nmr
$$ XWIN-NMR		Version 3.5
$$ Mon Jan 16 14:49:59 2006 GMT Standard Time (UT+0h)  MAYBRIDGE\nmr@NMR_250MHZ
##.OBSERVE FREQUENCY= 250.131544655141
##.OBSERVE NUCLEUS= ^1H
##.ACQUISITION MODE= SIMULTANEOUS (DQD)
##.ACQUISITION SCHEME= undefined
##.AVERAGES= 16
##.DIGITISER RES= 18
##SPECTROMETER/DATA SYSTEM= dpx250
##.PULSE SEQUENCE= zg30
##.SOLVENT NAME= CDCl3
##.SHIFT REFERENCE= (INTERNAL, CDCl3, 0, 16.522)
##AUDIT TRAIL= $$ (NUMBER, WHEN, WHO, WHERE, WHAT)
$$ ##TITLE= Audit trail, XWIN-NMR		Version 3.5
$$ ##JCAMPDX= 5.01
$$ ##ORIGIN= Bruker BioSpin GmbH
$$ ##OWNER= nmr
$$ C:\u/data/dgb/nmr/ADRS/14790/pdata/1/auditp.txt
$$ ##AUDIT TRAIL=  $$ (NUMBER, WHEN, WHO, WHERE, WHAT)
(   1,<2006-01-16 14:48:57.25 +000>,<MAYBRIDGE\nmr>,<NMR_250MHZ>,
      <created by zg, POWCHK disabled, PULCHK disabled
       configuration hash MD5:
       62 19 C7 07 E1 42 D1 B7 37 6C 3D D0 77 39 F9 E6
       data hash MD5: 64K
       AE F5 4B C5 70 6E 2F DD 8A 81 72 37 EF 7E 76 F1>)
(   2,<2006-01-16 14:49:16.92 +000>,<MAYBRIDGE\nmr>,<NMR_250MHZ>,
      <Start of raw data processing
       ef LB = 0.3 FT_mod = 6 PKNL = 1 SI = 32K 
       data hash MD5: 32K
       43 91 A7 82 A1 06 9F 8E F8 F5 32 D4 EB E0 6C 5A>)
(   3,<2006-01-16 14:49:24.68 +000>,<MAYBRIDGE\nmr>,<NMR_250MHZ>,
      <apk 
       data hash MD5: 32K
       60 4C 8F 4A CD 29 FE 1B 73 5A 05 C7 B1 2C 5C 84>)
(   4,<2006-01-16 14:49:26.43 +000>,<MAYBRIDGE\nmr>,<NMR_250MHZ>,
      <abs ABSG = 5 
       data hash MD5: 32K
       20 0C E9 B9 2F E1 F3 2C 65 39 E6 A1 5B FE 82 44>)
$$ ##END=
$$ 
$$ hash MD5
$$ 7D 3B 06 B6 08 6A 00 9F F0 2C 9A 54 FB 09 39 26
##$RELAX= 
##$RELAX= 
##$RELAX= 
##$RELAX= 
##$RELAX= 
##$RELAX= 
##$RELAX= 
$$ Bruker specific parameters
$$ --------------------------
##$DU= <C:\u>
##$EXPNO= 14790
##$NAME= <ADRS>
##$PROCNO= 1
##$TYPE= <nmr>
##$USER= <dgb>
##$AMP= (0..31)
100 100 100 100 100 100 100 100 100 100 100 100 100 100 100 100 100 100 
100 100 100 100 100 100 100 100 100 100 100 100 100 100 
##$AQSEQ= 0
##$AQ_mod= 3
##$AUNM= <au_zg>
##$AUTOPOS= <41 >
##$BF1= 250.13
##$BF2= 250.13
##$BF3= 250.13
##$BF4= 250.13
##$BF5= 500.13
##$BF6= 500.13
##$BF7= 500.13
##$BF8= 500.13
##$BYTORDA= 1
##$CFDGTYP= 0
##$CFRGTYP= 5
##$CHEMSTR= <none>
##$CNST= (0..31)
1 1 145 1 1 1 1 1 1 1 1 1 1 1 1 1 1 1 1 1 1 1 1 1 1 1 1 1 1 1 1 1 
##$CPDPRG= <>
##$CPDPRG1= <>
##$CPDPRG2= <>
##$CPDPRG3= <>
##$CPDPRG4= <mlev>
##$CPDPRG5= <mlev>
##$CPDPRG6= <mlev>
##$CPDPRG7= <mlev>
##$CPDPRG8= <mlev>
##$CPDPRGB= <>
##$CPDPRGT= <>
##$D= (0..31)
0 1 0 0 0 0 0 0 0 0.06 0 0 0 0 0 0 0.0002 0 0 0 0 0 0 0 0 0 0 0 0 0 0 
0 
##$DATE= 1137422933
##$DBL= (0..7)
120 120 120 120 120 120 120 120 
##$DBP= (0..7)
150 150 150 150 150 150 150 150 
##$DBP07= 0
##$DBPNAM0= <>
##$DBPNAM1= <>
$$ [...]
##$SUBNAM7= <"">
##$SUBNAM8= <"">
##$SUBNAM9= <"">
##$SW= 20.6930455092707
##$SWIBOX= (0..15)
0 0 3 0 0 0 0 0 0 0 0 0 0 0 0 0 
##$SW_h= 5175.983436853
##$TD= 65536
##$TD0= 1
##$TE= 294.16
##$TE2= 300
##$TE3= 300
##$TEG= 300
##$TL= (0..7)
0 120 120 120 120 120 120 120 
##$TP= (0..7)
150 150 150 150 150 150 150 150 
##$TP07= 0
##$TPNAME0= <>
##$TPNAME1= <>
##$TPNAME2= <>
##$TPNAME3= <>
##$TPNAME4= <>
##$TPNAME5= <>
##$TPNAME6= <>
##$TPNAME7= <>
##$TPOAL= (0..7)
0.5 0.5 0.5 0.5 0.5 0.5 0.5 0.5 
##$TPOFFS= (0..7)
0 0 0 0 0 0 0 0 
##$TUNHIN= 0
##$TUNHOUT= 0
##$TUNXOUT= 0
##$USERA1= <user>
##$USERA2= <user>
##$USERA3= <user>
##$USERA4= <user>
##$USERA5= <user>
##$V9= 5
##$VALIST= <valist>
##$VCLIST= <CCCCCCCCCCCCCCC>
##$VD= 0
##$VDLIST= <DDDDDDDDDDDDDDD>
##$VPLIST= <PPPPPPPPPPPPPPP>
##$VTLIST= <TTTTTTTTTTTTTTT>
##$WBST= 1024
##$WBSW= 4
##$XGAIN= (0..3)
0 0 0 0 
##$XL= 0
##$YL= 0
##$YMAX_a= 652333
##$YMIN_a= -470201
##$ZGOPTNS= <>
##$ZL1= 120
##$ZL2= 120
##$ZL3= 120
##$ZL4= 120
##$ABSF1= 16.522
##$ABSF2= -4.171173
##$ABSG= 5
##$ABSL= 3
##$ALPHA= 0
##$AQORDER= 0
##$ASSFAC= 0
##$ASSFACI= 0
##$ASSFACX= 0
##$ASSWID= 0
##$AUNMP= <proc_1d>
##$AZFE= 0.1
##$AZFW= 0.1
##$BCFW= 0
##$BC_mod= 0
##$BYTORDP= 0
##$COROFFS= 0
##$CY= 12.5
##$DATMOD= 1
##$DC= 0
##$DFILT= <>
##$DTYPP= 0
##$F1P= 14.0000005364418
##$F2P= -0.99999901652339
##$FCOR= 0.5
##$FTSIZE= 32768
##$FT_mod= 6
##$GAMMA= 0
##$GB= 0
##$INTBC= 1
##$INTSCL= 1
##$ISEN= 128
##$LB= 0.3
##$LEV0= 0
##$LPBIN= 0
##$MAXI= 10000
##$MC2= 0
##$MEAN= 0
##$ME_mod= 0
##$MI= 0
##$NCOEF= 0
##$NC_proc= -3
##$NLEV= 6
##$NOISF1= 0
##$NOISF2= 0
##$NSP= 0
##$NTH_PI= 0
##$NZP= 0
##$OFFSET= 16.522
##$PC= 1
##$PHC0= 102.2413
##$PHC1= -23.09404
##$PH_mod= 1
##$PKNL= yes
##$PPARMOD= 0
##$PSCAL= 4
##$PSIGN= 0
##$REVERSE= no
##$SF= 250.13
##$SI= 32768
##$SIGF1= 0
##$SIGF2= 0
##$SINO= 400
##$SIOLD= 32768
##$SREGLST= <1H.CDCl3>
##$SSB= 0
##$STSI= 32768
##$STSR= 0
##$SW_p= 5175.98343685301
##$SYMM= 0
##$S_DEV= 0
##$TDeff= 65536
##$TDoff= 0
##$TI= <Analysis number 999999
Compound Code 99
Book Reference 9
Project Code 9>
##$TILT= no
##$TM1= 0
##$TM2= 0
##$TOPLEV= 0
##$USERP1= <user>
##$USERP2= <user>
##$USERP3= <user>
##$USERP4= <user>
##$USERP5= <user>
##$WDW= 1
##$XDIM= 32768
##$YMAX_p= 321202207
##$YMIN_p= -128905
$$ End of Bruker specific parameters
$$ ---------------------------------
##NTUPLES= NMR SPECTRUM
##VAR_NAME=  FREQUENCY,     SPECTRUM/REAL,   SPECTRUM/IMAG
##SYMBOL=    X,             R,               I
##VAR_TYPE=  INDEPENDENT,   DEPENDENT,       DEPENDENT
##VAR_FORM=  AFFN,          ASDF,            ASDF
##VAR_DIM=   32768,         32768,           32768
##UNITS=     HZ,            ARBITRARY UNITS, ARBITRARY UNITS
##FACTOR=    0.157963299565203, 1,           1
##FIRST=     4132.6476996994, 0,             0
##LAST=      -1043.33573715361, 0,           0
##MIN=       -1043.33573715361, -128905,     0
##MAX=       4132.6476996994, 321202207,     0
$$ Real data points
##PAGE= N=1
##DATA TABLE= (X++(R..R)), XYDATA
$$ [...]
22760 7545 15330 11195 10445 15846 14216 8201 13039 936 -7954 3379 2074 847 11446 14000
22746 14000 13479 -4351 -499 -6258 -6629 -7636 -3582 -2582 -14468 -5017 7253 -5149 -5951 1038
22732 1038 9451 7063 18769 21354 30133 40794 41274 17863 2433 21750 25002 21562 20246 9616
22718 9616 6188 18244 22061 15635 21717 24489 11122 3378 19924 30264 23826 -524 -1810
22705 -1810 4895 9702 8074 9656 11194 22944 20520 9674 7992 10818 3679 -4293 2516 -1918
22691 -1918 10465 26365 34891 40942 31474 21923 16871 8879 -11187 -12171 -12301 -12861 1215 7766
22677 7766 14277 24774 24700 13267 342 -7357 -6941 -2079 -7153 -6092 -7944 -5227 1665 14447
22663 14447 30130 23876 6864 9563 7937 -780 6745 6081 -147 4113 -5845 -7079 -10652 -11070
22649 -11070 -14045 -6614 -4414 4490 9176 11010 4465 3582 -1180 -6048 2580 14433 27456 13452
22635 13452 8691 4652 -2737 -8010 6783 21613 27232 33442 34341 28846 12701 12441 13063 16885
22621 16885 13275 14352 13170 8648 8237 6206 12327 13590 12045 17296 13289 13174 931 3310 5447
22606 5447 6983 1720 -2272 3019 11224 4002 -6434 -2571 5240 6115 4932 964 8021 11717 7959
22591 7959 13998 2996 323 -509 12942 20016 20820 9216 2882 5392 15316 25506 31238 30792
22577 30792 30320 24718 15190 12971 6449 8592 18588 24996 24785 31451 27397 15850 10650 14084 13607
22562 13607 9628 13896 17023 8068 -2326 -13186 -24815 -5167 18527 27821 19608 20155 21301
22549 21301 26049 14629 4473 5788 7848 3078 233 -7676 -13414 -12338 -7164 -2883 14920 25612
22535 25612 10331 4926 6371 8302 16468 26770 35665 16148 7643 3774 9419 6778 -7651
22522 -7651 -11323 -4465 -10021 -9211 -2104 3591 -2089 834 9303 7339 20061 18018 1638 701 -3163
22507 -3163 -13517 -23279 -36815 -46497 -36043 -18821 6134 20972 16602 15024 6385 5801 1200
22494 1200 9740 15068 4383 -241 -4244 -5726 9971 14618 22026 19391 26330 39996 27630 19660
22480 19660 10165 7618 12260 6014 12620 4966 4303 14738 17739 20649 15879 343 -20803 -17066
22466 -17066 -7187 949 2454 9115 21095 5287 -5774 -278 -15745 -7565 6076 -1762 -9021
22453 -9021 -10167 -12631 -6241 5796 30285 20077 12146 7588 -188 12913 22248 12578 2177
22440 2177 -926 -3298 -4950 -9069 -15305 6422 10771 13341 22490 25332 19096 22196 21364 11745 9132
22425 9132 22909 27807 21977 18746 18399 22790 31218 25762 1659 -21172 -15220 -513 6571 -1585
22411 -1585 7447 17108 26993 36571 26652 13473 15486 15964 26747 29463 14621 4047 9774 8531
22397 8531 2629 -861 -4538 4121 14256 8622 3777 -627 -6203 732 11325 8602 5331 9358
22383 9358 17251 8874 -1776 -3774 -1901 -3286 6576 11638 9411 3466 -1716 -14116 -12813 -4830
22369 -4830 435 1129 1605 4224 5058 -826 -10796 -17503 -13120 -9846 2869 13355 7358 2166 6481
22354 6481 8928 -359 8765 9681 -1162 -7597 1858 16229 11390 5559 -1866 2236 11704 11432 16614
22339 16614 16491 1229 992 -1569 -5798 8629 5433 6491 12897 9330 1379 -15736 -20565 -7917
22325 -7917 809 11064 15471 9588 29882 35055 17401 2108 5281 25824 24983 9409 7766
22312 7766 4334 11423 7570 1179 -2611 2141 2823 -4383 -12512 -4836 4713 7303 22052 15939 1675
22297 1675 -8602 -10531 2007 -7384 -2704 12924 7804 4977 -5592 -1012 16739 12095 -866
22284 -866 -4327 -1839 -717 2686 8165 10187 18762 22543 29566 26422 24908 34472 36931 31082 28554
22269 28554 37346 30831 20692 16694 15868 8379 5658 -1440 6914 -1003 5348 5861 2499 6164 15379
22254 15379 25608 20817 15856 13050 16278 10479 18831 23114 6956 5238 -3720 -7028 6027 10336
22240 10336 7193 1084 746 -3847 19399 23290 6842 4205 10253 -2152 156 15946 30449
22227 30449 28227 20217 14418 1917 8865 12343 13233 7654 11898 25955 9414 12799 20734 12516
22213 12516 11235 9693 8085 7174 10238 2788 -4313 -15886 -9914 -8647 4368 4617 -5950 -6153
22199 -6153 7023 26209 30275 33133 26175 25771 26428 29159 19275 18570 15515 13839 22766 28687 21221
22184 21221 17420 10285 11156 31317 26652 17622 -2739 1681 -1811 3541 -5184 -387 4862 4034
22170 4034 15145 19279 19488 8152 7862 26338 29999 23068 16896 15482 19884 13338 4227 -2077
22156 -2077 1363 785 3448 6074 5067 -3010 7600 8405 16527 14307 -4865 -12157 -11024 3947
22142 3947 1736 15764 17934 7789 10911 11992 8395 -4903 -14628 -10269 7087 15161 5195 10574
22128 10574 9676 6122 -279 -4066 -785 11245 -1954 -3327 2922 4327 14629 14400 10699 10886
22114 10886 6813 4726 7475 -8255 -22642 -20999 -13695 2609 9165 3914 7500 17469 15572 18451
22100 18451 11966 9066 -2031 11504 26662 9625 -1388 2926 4720 16124 18341 8030 3609
22087 3609 -1882 10066 5137 6649 -3871 8592 8885 7003 1070 -2137 -543 -2574 1839 10792
22073 10792 27455 27461 18874 7882 5258 3333 8811 15694 18089 24656 24990 23139 24475 16248 1021
22058 1021 -6730 -1864 5615 2150 945 -903 15592 14690 10164 2668 5429 11678 15207 10106 6955
22043 6955 4257 1253 195 303 -4441 -6222 -5496 -10091 -3933 -13080 -22913 -14837 -7539 7777 18525
22028 18525 26839 21478 10351 -1407 1899 9462 11109 126 -11251 -1557 10669 -6677 -10834
22015 -10834 -509 8547 18244 7932 -1544 -8116 5427 20513 8780 4825 3089 2977 9178
22002 9178 -2236 -10139 -5023 13545 11860 12649 12911 12925 12921 10447 -1961 8797 16636 14511 10778
21987 10778 9727 7930 9075 11258 10296 3056 10361 6252 -4397 7435 13062 9882 4546 7648
21973 7648 22661 21718 9704 12694 10017 12595 6331 16838 10186 14645 16368 15786 12853 -2288
21959 -2288 9983 15572 6795 -2189 13109 11472 12718 14422 13132 16844 7669 6872 28435 26054
21945 26054 15613 5672 -2688 2813 2946 -1180 -12022 -12824 -19317 -25742 -15711 -5096 5540 20
21931 20 -4077 -17657 -5410 10202 10840 6935 6866 -235 -4330 -10167 -6682 5136 9120 -1263 -1697
21916 -1697 12046 -3228 -17218 -16884 -11345 -4386 5678 17662 12258 1409 -10672 -11673 -1158
21903 -1158 -9911 -15697 -9131 5331 -3320 -18208 -15966 -1750 2271 17371 3500 -3761 -4711 -4146
21889 -4146 -12878 -9443 -9338 -19247 -9986 -576 6204 7902 14261 19415 18159 10951 10492 9873 4750
21874 4750 3974 11554 21132 13221 -776 -122 -1172 498 -3012 3846 21911 17370 10440 14280 9530
21859 9530 -1309 -1164 -588 3873 5908 -1861 -4927 -10017 -14929 -10672 -3014 3278 6343 12154 -6590
21844 -6590 -5806 5544 5988 6353 4723 1857 1803 372 -10237 -10629 -19347 -9219 7413 3283 7488
21829 7488 10415 6336 -5805 -17284 -19433 -15067 -4362 -8572 -12530 -8457 -96 8852 -1713 -8364
21815 -8364 -4340 -5374 -18499 -20093 -16410 -1815 8287 -8343 -14316 4444 5395 4854 5794 -2973
21801 -2973 227 1841 3376 3253 -2779 -8377 -13685 -2163 4864 7744 9020 11970 15350 3262
21787 3262 -4754 -12212 -1755 5486 2401 3124 3656 5649 7783 1077 2697 19152 20674 10910 13679
21772 13679 -627 -10329 -5523 -8000 -17717 -8005 3541 4081 -139 893 11897 16424 22264 21543
21758 21543 35950 34045 36064 34150 22472 4115 -8254 -6017 -8029 159 1708 -1972 -11946
21745 -11946 -16818 -11900 -16578 -10022 -12120 -6097 4725 139 -4970 -3096 -367 3416 5889 3957
21731 3957 9970 11305 14235 25700 22920 26035 15256 12638 17730 15086 7196 -7119 -4698 -1163
21717 -1163 -1756 -13083 -14719 -2840 195 -5701 -10704 -8865 14551 10347 15680 11105 -176 942
21703 942 9078 12158 15614 18676 9563 -10979 -4576 10718 7211 9956 20732 19851 13698 6898
21689 6898 1683 5021 10868 -1619 -1648 -4802 -5729 -11288 -14365 -3128 -87 -9996 -2652 464 -6916
21674 -6916 -9189 -988 1722 -18198 -5589 10278 12080 5326 -6879 -311 7711 14889 13440 18282
21660 18282 14681 17642 20681 17560 10888 12208 8370 7533 9183 -517 -8430 163 -10638 2069
21646 2069 20722 16323 -1086 1438 17736 15731 14327 3192 5119 17379 16376 14048 28377
21633 28377 37953 38471 16444 -4290 -7330 -7157 -2817 4972 16907 31919 29130 20337 15079 -35
21619 -35 -9267 4042 19798 27664 26718 9513 -186 -7929 555 7611 -7089 -12502 -7795 -16977
21605 -16977 -9769 4374 10249 7597 11814 19113 19452 18504 12934 13686 15909 2462 248 8783 8374
21590 8374 9325 6560 12835 1131 -8110 -4696 13793 24570 32549 29724 20955 6290 10241 14016
21576 14016 14775 15042 4268 -18009 -18300 -14447 -9121 1955 13715 18476 12823 -6032 -24826 -30623
21562 -30623 -17901 -6282 -13330 -17709 -11333 -6053 9645 16125 12701 16555 22834 13506 10694 6715
21548 6715 20172 16873 22204 25033 22995 9406 10593 647 -19119 -10034 -1654 13175 15484 6463
21534 6463 15387 4874 -3187 654 10491 10903 10393 -4241 -8265 -17063 -10398 -2560 713 204 -645
21519 -645 -8199 -21620 -17176 -3255 -4756 1545 -8760 -4200 2831 11878 24700 29288 25924 21227
21505 21227 21289 33736 29671 14714 8687 5639 17136 32091 24691 5336 -1625 4786 -11206
21492 -11206 -8860 -9332 -3078 -488 -16315 -13999 4873 12180 4216 -2419 -5741 -15890 -22540 -15157
21478 -15157 -13006 -12617 -22923 -11048 6975 8883 1395 -1196 11274 20135 19792 7554 6166 18666
21464 18666 32585 10061 -18386 -18000 -14454 -15498 -9580 2426 10912 12787 19176 17350 14715 16804
21450 16804 9415 12861 12180 9978 15043 13628 1620 -10838 -8723 -2580 -9827 -5955 -4176 8601
21436 8601 6456 -7047 -1921 -4140 1772 16092 22132 6499 -1865 2277 -43 1928 -8070 -3270
21422 -3270 8965 1465 -8202 -14223 -6766 12295 7297 12545 416 -9993 -11420 -15703 -12930 -10122
21408 -10122 -9418 -1671 -3684 -14570 -14492 -6872 2681 10903 2311 -5649 -10634 -7341 -2024 -2732 4461
21393 4461 9735 18180 14193 9674 209 12132 8665 -1682 6123 4045 -14875 -14623 -645 7851
21379 7851 15083 10190 13888 4008 4644 8839 6828 16053 8320 1513 -424 -8054 -6314 -9658 -9763
21364 -9763 -774 -9915 -1013 -3698 -13783 -9823 -11231 -9088 4050 17467 21167 5779 -2471 13611
21350 13611 19514 30402 37269 27427 15606 -1956 -1082 5059 12786 15838 11866 20084 20570 9345
21336 9345 -2297 -4444 5314 2184 2722 11117 6519 -1983 -1282 -434 783 -7250 -17640 -11387 3050
21321 3050 9206 4747 -2583 -1952 -9237 107 12551 31612 40068 47651 42868 32156 23859 28455
21307 28455 25352 9185 3710 13730 14646 14269 13684 17443 17530 15384 27042 31871 14719 16964 31776
21292 31776 48502 40444 30461 9986 8160 13712 19013 14294 8793 6326 6048 19147 13074 16744
21278 16744 14519 -14422 -22544 -34270 -37476 -36219 -19867 -4040 8624 13741 6263 -4109 2089
21265 2089 12913 13648 31572 16986 -5048 -15512 -6579 -3721 759 8344 18051 14265 13076 17035
21251 17035 11300 2635 1061 6832 4053 -4691 -1683 -1974 15636 17105 13751 8307 14848 8880
21237 8880 -9832 -4531 -900 18353 27429 18416 15019 18677 16049 10146 4418 -655 -4869 -303
21223 -303 -2827 -7928 -8040 -9167 -9585 -18613 -19648 -23262 -19991 -15322 -10555 -1280 6698 7464 5356 -1580
21207 -1580 -7241 -7184 -11784 -9026 -1411 -3505 1752 2480 6821 13276 19079 10124 14237 13535 8153 3679
21191 3679 5722 398 -5405 -22141 -14590 -5469 -4468 8912 3719 -16047 -12507 -14163 -17220 -9063
21177 -9063 -8317 -20290 -23310 -15597 -3154 -6705 -4466 366 -7821 -16761 -21342 -13124 -2660 -6841
21163 -6841 -22850 -24279 -11051 -685 -998 3225 -6561 -19655 -22445 -24732 -20238 -12727 -1730 -1332
21149 -1332 7029 4201 -3894 -17783 -24179 -16081 -5953 -4076 -16246 -14005 5964 18337 305
21136 305 -16299 1539 6276 -6238 -10404 -7998 -15113 -16432 -10968 1624 8893 1414 10373 20715
21122 20715 22260 24587 29068 15864 21841 26548 17341 8800 4640 4867 5580 18401 23956 18867
21108 18867 11505 9607 15199 26382 38035 29939 17348 16416 24193 19381 23792 16874 20086 13593
21094 13593 5818 805 -3685 6610 1116 -10145 -8149 7427 3375 2306 6685 1367 4736 9333
21080 9333 1238 -10720 -2123 8941 23622 14843 2114 16069 5557 -12149 1518 10268 13545
21067 13545 10247 20502 11755 -4313 -14030 -9966 -1258 -4467 -2540 6601 6935 7521 -3045 -9419
21053 -9419 2327 -789 -19016 -33279 -23005 -14897 -8508 -7171 -11943 -12762 -5528 9290 19728
21040 19728 22984 20741 30006 20088 9091 -463 2273 11723 16737 23945 25705 21675 11023 4775
21026 4775 13618 9134 -2590 -8424 -12997 -25811 -22176 -13824 -18982 -13201 -3794 -3754 -3362 -8251 -12087
21011 -12087 -6180 -13639 -15032 1198 -4283 -10915 2800 18887 17438 13153 6064 -10742 -17459
20998 -17459 -3767 -6181 -2665 2940 -6421 -18645 -19363 -15557 -8776 -1212 -7485 -9396 -10910 -6519
20984 -6519 -12062 -22934 -16966 -17864 -18451 -17478 -15863 -4560 796 -5747 -14723 -12736 2138 7434 -1648
20969 -1648 1373 -1535 3551 11056 7694 2686 -11970 -21124 -25130 -10509 7656 12080 -272 -2120
20955 -2120 -1867 -991 -13702 -14226 -1098 6889 -1021 -14794 -22260 -30471 -12358 7050 11069 9866
20941 9866 24833 8505 -10852 -9253 -4291 1711 7658 8467 354 10670 4047 2074 3737 15715
20927 15715 30317 25911 18295 14660 16503 14941 27911 30102 43409 33951 6423 -53 4866
20914 4866 1122 -8673 -15097 -15713 -6676 -10177 -12456 -6265 30 -516 546 24264 28032 18019 17060
20899 17060 19905 30149 25274 12258 14052 -690 -5948 -1981 -8226 -18997 -10976 -18546 -13057
20886 -13057 -11587 -12546 -11614 -23394 -32630 -34264 -26084 -14729 -4926 2432 19035 14703 13463 18089
20872 18089 8768 3514 -1807 3101 14333 32706 32049 25623 33997 35740 24821 8823 -6147
20859 -6147 -19203 -15543 -1374 -3180 6684 21835 13851 8827 15027 5711 -6433 -11475 -15435 -13108
20845 -13108 -16376 -17233 -25672 -25064 -4570 -1745 -5996 -1614 731 -10794 -10967 -16773 -15658 -7017 -271
20830 -271 1510 -2173 -17027 -14857 -26333 -18804 9492 20026 10732 4082 -1623 -8626 -14100 -24997
20816 -24997 -36264 -38360 -29728 -12939 2587 4560 3229 -1204 -3697 -1696 1589 -3265 -12229 -20995
20802 -20995 -27597 -25204 -24432 -14875 -29126 -34708 -17099 -3433 -4049 2247 5960 7734 -2231 -394
20788 -394 3212 6026 1013 -6972 -14785 -8954 625 4645 -3679 8748 8670 -1740 -2599 -6781 252
20773 252 8012 13724 11159 -4365 -15689 -29176 -30875 -26346 -13524 -10075 -462 1311 1013 6387
20759 6387 5745 2532 4696 11419 12722 7892 -4621 -12994 -15667 -10204 -11825 -7799 656 11474
20745 11474 2352 5018 9272 -3813 -13407 -19075 -16477 -6109 -8840 -8068 -14324 -7925 -5977 8172
20731 8172 11722 17589 15361 18898 16113 6231 12184 11763 7167 10448 12581 11630 240 -2483 3361
20716 3361 -4356 -4953 -1392 -12941 -9155 2949 16676 22834 15044 12953 2098 -2080 7997 19019
20702 19019 32358 28270 16811 -6472 -9348 6472 17502 11133 17257 14978 18422 20782 17441
20689 17441 18056 13899 441 -9463 -8638 -3022 2409 -13794 -16955 -2328 -3513 -12436 -19067 -9888
20675 -9888 1177 -184 7292 374 -7348 -2127 -1647 -1995 -7945 -14998 -19218 -15065 -9117 -1241 -2486
20660 -2486 1558 3034 -1395 -4737 -22356 -22762 914 9012 2422 -16994 -10314 -3023 -5885 681
20646 681 7129 4266 11466 23374 18017 5404 -756 -11959 6827 22554 28019 14834 9010
20633 9010 7277 9460 -3636 -1212 11244 13650 5268 10159 19353 19319 3291 -2424 -3798 3505
20619 3505 -784 -17464 -19922 -11801 -8588 -1371 4435 1507 -1448 42 16232 21276 17224 7841
20605 7841 4476 9321 24267 28922 18760 -13691 -19994 -17800 -22057 -10915 2507 14250 15751
20592 15751 10341 20884 18921 7013 -6393 -3441 4031 12877 13935 5028 -12848 -24299 -21262
20579 -21262 -11228 -1375 1202 -1395 -13987 -8579 -10137 -1396 -8161 -16720 -2415 1232 6570 11832
20565 11832 8593 14377 9953 7186 5751 11887 9326 -6186 -7861 -5154 7505 -653 -2318 8043
20551 8043 14286 4685 1173 390 2653 -381 -5964 2102 -5307 6075 15892 13010 -745 -8049
20537 -8049 -5671 -466 -1111 -12427 -14570 -684 12396 -4661 -16134 -13516 -18588 -17671 -9879 397
20523 397 -1026 -4798 -16089 -11001 -1727 6133 3152 5568 6011 5953 2658 -11354 -17946 -17897 -11765 -5416
20507 -5416 -5985 -2070 1307 5223 7606 -4814 -16418 -4489 9526 12914 7288 12561 15695 6859
20493 6859 -293 -2421 -2337 -77 -1639 -2858 115 1561 10619 16359 11492 2441 -3047 -8378 -1983
20478 -1983 5116 9952 4622 -1827 5806 6028 -1719 -6104 -24227 -17768 -7044 -7770 -19379 -16920
20464 -16920 -2920 -7145 -15494 -8668 57 -3435 -18143 -16395 -12888 -18090 -21514 -18044 -20616 -25452
20450 -25452 -20099 -18082 3402 343 -16185 -17024 -11397 -6600 -2921 121 -698 2152 -15174 -21527
20436 -21527 -17070 -10950 -12391 -2437 9809 3644 7146 4249 -5189 -14583 4761 8995 11454 3211
20422 3211 -7656 -4285 2038 -699 -4956 -6102 -7531 -16456 -25953 -19726 -24709 -22498 -11237 -5794
20408 -5794 -6068 5322 21015 12900 6333 9190 5032 -3134 -4554 331 -2045 -9295 -11227 -3079
20394 -3079 2638 -309 -16827 -13880 -9865 299 10851 8640 10205 16164 9438 8926 5825 13962
20380 13962 2876 1145 12827 2313 -1465 -5525 -17506 -19971 -26243 -17671 -9435 -13361 2530
20367 2530 15801 15521 18137 3971 -8861 -2098 771 3727 -2456 -2243 1172 -8465 -5705 -5837 516
20352 516 6497 1288 -3827 6724 11523 12819 16453 21365 19319 10520 7952 1586 -3753 -5721 -18318
20337 -18318 -6996 -3522 -2796 -4417 -8010 -14007 -330 9998 4731 -6910 -10852 -12066 -4836 -5090
20323 -5090 -4814 3112 15662 8968 4731 4743 279 -1554 3874 1024 -4456 -9630 -17904 -19341 -27543
20308 -27543 -33696 -35761 -26331 -1501 3065 -1668 -7088 -11695 -5642 -8198 -12180 -9067 -4227 -2903
20294 -2903 -9112 -13705 -1300 -647 -10869 -21545 -29091 -28991 -31194 -22708 -6024 -17236 -8505 16899
20280 16899 37720 28111 19580 16251 3554 105 3310 9474 -1391 -14152 -25507 -13704 -6053
20267 -6053 -15651 -20310 -21437 -23369 -27808 -14002 478 8916 5943 7215 -3812 -17047 -12665 8177
20253 8177 10392 -4946 -13322 -14837 -13885 -11434 -16534 -20292 -10226 6380 14086 16074 7006 -11854
20239 -11854 -2970 5889 5159 -2147 -12524 -12961 -2541 5152 2227 -6824 6246 12425 12009 776
20225 776 4851 9133 -2591 -14920 -15250 -11443 -2038 -9690 5076 23737 25530 30540 28793 22676
20211 22676 3068 291 1681 -9642 -3950 -5586 -3687 -213 4965 1884 4919 6870 14745 11868
20197 11868 312 1486 6822 17782 19916 15867 18950 24138 12899 6953 -709 -5069 -9511 1517
20183 1517 7560 4902 983 4539 -9539 -8472 -5466 12254 22514 13297 3550 9513 10112 8701
20169 8701 9309 10824 14957 10191 1463 3613 4674 -10538 -8578 -11725 -18957 -12890 -1822 15100
20155 15100 13792 2938 -715 6830 4827 -5853 -18520 385 1191 4007 12301 18355 16560 13753
20141 13753 14626 12413 17225 20086 17212 13639 14982 10435 -3234 1367 7181 8011 -14253 -13025
20127 -13025 -6841 -18433 -14348 -8194 2261 -1597 -11104 -24572 -9183 5640 3809 -424 -12858
20114 -12858 -25041 -33819 -26735 -27861 -32072 -23509 -18711 -15123 -2854 4928 13907 10779 12118 -3902
20100 -3902 -19278 -17345 -12516 -14994 -7235 2183 -3640 -8399 -3148 -12112 -20179 -13785 -9211 8196
20086 8196 -2195 -16572 -29397 -20881 -15291 -6337 10935 12685 1613 -2032 -1616 -798 -8248 -7318
20072 -7318 -4553 -9487 -8217 -15725 -21651 -24730 -28525 -20932 -8090 -3225 -5274 -19443 -15567 6803
20058 6803 5017 2501 8733 16822 16601 12446 9535 1512 6522 10060 -1510 3991 -3540 -5701 -8426
20043 -8426 -6697 -794 4762 -1645 -11322 -244 12401 15069 12311 10131 9332 2443 -4590 -12914
20029 -12914 -14131 2449 2849 -1572 -4876 -8152 6238 10025 6849 10924 22676 18008 1382 1411
20015 1411 4882 6380 -1279 2234 -5332 -13828 -21525 -14277 -14756 -18229 113 17481 -1287 -17345
20001 -17345 -11129 5210 8807 6383 10999 5947 6264 19248 22386 9295 -13689 -6204 -4090 -4838
19987 -4838 -13666 -17018 1183 6698 5015 1562 14799 23079 10655 5253 -10721 -14357 -2244
19974 -2244 11423 1121 -17804 -24813 -1375 6666 4643 4121 3691 11780 13732 8981 5716 8832
19960 8832 -5695 -8769 -815 14738 19285 1424 1022 4200 10484 -2214 -6169 15475 21637 2012
19946 2012 -16107 -11710 -11295 -7484 -5278 -10213 -14266 -4605 2052 3680 12049 11842 15413 19455 16200
19931 16200 12314 10079 13220 8437 10275 -5398 -6158 2623 -5135 -9097 -11221 -4163 -7241 1147
19917 1147 -3498 -1036 2362 -4406 -8852 -6559 3887 11671 8089 7581 4036 -4869 -6688 7690
19903 7690 20774 28485 34170 39626 27980 9204 -8221 -8756 1027 3731 -1851 -4606 -3821 1977
19889 1977 -7787 -13137 -6449 -16643 -5595 15253 17205 1923 -1927 -5762 1137 -12610 -27094
19876 -27094 -15908 -7954 -21786 -23857 -14972 -7669 2912 -1282 1501 6615 -496 -12741 -27417
19863 -27417 -23013 -6587 -1431 -7021 -12972 -12385 -9192 -8070 -5754 -802 -14426 -25049 -26723 -24997
19849 -24997 -17691 -7448 -11194 -7403 7260 19466 4336 -6961 -2727 -1856 834 1459 -146 -9407
19835 -9407 -12508 -342 -7814 -15993 -337 -9297 -9491 -4568 3386 1771 4364 -10152 -10857 -7151
19821 -7151 -13036 -7644 -2429 -1391 -9325 -13264 -7378 3647 -419 -10614 -25449 -30562 -14482 -9501
19807 -9501 -5522 -6976 -1782 8144 -76 -12049 -23048 -42454 -52692 -29547 -3889 11349 11885
19794 11885 4515 12222 10434 3447 2999 -17059 -29336 -19932 -9400 -9677 -8785 10463 10095 4448
19780 4448 2706 5828 10744 9179 -3800 -3575 4476 -1373 -601 -9079 -17371 -14638 5491 7817 6486
19765 6486 3933 -8227 1892 6936 6090 9918 -10015 -27859 -9895 5590 4573 -7431 -2306
19752 -2306 1443 10457 11490 16436 14350 4304 -9171 -9968 -28220 -22147 -10640 -6173 16337 37654
19738 37654 27514 25064 11506 4135 10174 -1589 -11475 -18166 -17550 -8777 2821 -636 729 3639
19724 3639 12647 28637 27969 15166 21114 22326 11078 4753 -10450 -25360 -29858 -23851 -11730
19711 -11730 -17403 -14857 418 2522 -3456 -1992 -1193 -1795 11734 24020 25801 7970 -4909 796
19697 796 6405 10201 7392 13207 6836 -5047 -10976 -14504 -23131 -20766 -13217 32 -14482 -16423
19683 -16423 -14355 -15757 -17850 -9846 8926 13606 8181 -9154 -3553 10352 11016 10233 8903 -4822
19669 -4822 -15980 -818 15419 13037 -5477 -16177 -21647 -13580 -26105 -27962 -12886 7959 10199
19656 10199 5242 7559 8913 11515 15393 14922 -6158 -21475 -15422 -9149 -1218 4550 -1040 -828
19642 -828 8155 9260 1493 -6225 -4170 -12893 -22239 -18458 -14361 -26889 -22796 -25464 -18953 -25976 -26717
19627 -26717 -32218 -17547 -10896 -14950 -8279 3965 12396 19909 9153 3460 4443 -6865 -9383 2248
19613 2248 8945 191 8884 8111 3788 2061 -4115 -18610 -30361 -23228 -18305 -31301 -17899 7712
19599 7712 20169 16540 12355 6298 6780 6231 10713 7843 1810 -8014 3027 7543 9226 2497 -3504
19584 -3504 6752 5830 2765 2497 -13520 -21645 -23190 -24702 -9510 10987 9431 7729 7532 2718
19570 2718 -4609 4355 2620 3083 8911 16430 1876 -16887 -26247 -24383 -23242 -24772 -15472 -13460
19556 -13460 -10618 -9840 7465 10205 -569 -11465 -17579 -17038 1774 7933 -9791 -9085 -5163 -3305
19542 -3305 12364 4401 -13710 -5228 -13630 -26359 -23408 -23482 -14625 646 9264 -3253 -4453 8695
19528 8695 2949 4159 1329 -5796 -11702 -5464 -6964 10663 28046 27403 6825 1398 8709 -193
19514 -193 -12078 -10407 -15376 -25283 -44353 -39414 -30470 -36707 -47522 -31565 -21547 -13170 3692
19501 3692 2310 -7145 -1357 2915 -14851 -12540 -4963 -7378 -8401 -2459 -8511 -7143 -2766 527
19487 527 12108 22849 34723 25324 20661 27902 29015 15694 1230 4612 1364 1520 -1641 -10314
19473 -10314 -11686 -6399 -16208 -8884 -10723 -1059 -310 5005 3844 -3562 -1310 -32 4451 -8170
19459 -8170 -8667 -19878 -19459 -5604 -5187 -11983 -4042 11693 9520 4798 5251 -2504 4462 14857 10973
19444 10973 4552 -6984 -3732 5456 -2949 -17165 -20721 -18905 -18675 -17091 -28059 -22442 -11721 -26963
19430 -26963 -28158 -18922 -10937 -7549 1470 4632 5694 4637 -752 -2662 6201 8008 7751 7612 -927
19415 -927 -1792 -14808 -14672 -12572 -16950 -16417 -7130 -225 -15140 -6589 592 4099 -200 -9850 -6729
19400 -6729 -6320 -8875 3111 10107 1807 -6855 -15857 -18190 -18424 -9492 1932 4539 10052 8271 -7526
19385 -7526 -8652 5895 -3530 -10630 -1794 -2863 765 -8215 -8030 6151 11627 16042 7248 -7350
19371 -7350 -4319 -10357 -14445 -9376 -21568 -23035 -24584 -21061 -5664 -7525 -17300 -27883 -28382 -20055
19357 -20055 -19449 -23177 -23403 -27280 -31117 -14343 -12120 -17145 -10800 -16975 -22842 -26622 -31842 -30462 -24230
19342 -24230 -28548 -22022 -23918 -19924 -6597 -8555 -14740 -8269 -488 -2927 6355 8959 -8390 -4673
19328 -4673 -1135 -7146 -3593 -7407 -15993 -4173 4084 15176 16809 1158 -10025 -16126 -8351 -13740
19314 -13740 -14602 -14822 -6684 -4672 -9181 -17508 -18050 -20902 -21726 -29103 -30500 -25464 -19329 -16253 -13110
19299 -13110 -8505 -12003 -7341 -5006 -5520 6410 5993 2549 10307 17763 9408 3469 -681 -4851 1421
19284 1421 4683 1560 -14107 6715 7512 -17102 -33002 -21137 -4304 1741 -13470 -21354 -24060
19271 -24060 -27335 -18817 -1557 -2762 -7296 -3479 -3724 2202 -3616 -5605 -5415 -18615 -5686 -5310
19257 -5310 -12963 -4133 5437 11357 1183 5243 4118 -13372 -11523 -7019 -1170 -11575 -17282 -19656
19243 -19656 -18595 -3978 -4556 -22545 -20612 -17555 -18935 -18074 -20244 -18320 -9518 5940 15088 19510
19229 19510 12847 13289 4267 1605 431 -2027 -11633 -21254 -11006 -7209 -11172 -10075 -9113 -21240
19215 -21240 -22112 -3415 8 6393 15140 3017 10511 17705 26061 26370 16169 19237 12795 9458
19201 9458 12696 8993 7607 7280 8010 -8407 -22927 -19843 -28850 -26401 -25766 -20495 -7292 2053 12043
19186 12043 17610 4282 -557 -8084 -6779 -6858 -2047 509 -7908 -14094 -21511 -27482 -30179 -21927 -12957
19171 -12957 -16712 -19568 -24126 -15732 -14536 -18016 -14763 -6079 -11945 -8987 -5597 -18725 -21470 -24395
19157 -24395 -5684 11556 4413 -10634 -3707 3007 -3301 -3884 -17703 -26981 -16771 -16678 -16097 -12011
19143 -12011 -3769 -3653 5573 11806 4705 -4864 -7036 -10764 -17101 -9063 -4479 -7774 -27930 -18676
19129 -18676 -5744 -5670 -274 3809 -13861 -18496 -16569 -9153 -10692 -16754 -10735 -2025 -4435 -17928
19115 -17928 -27912 -16440 -12649 -6259 1161 -2986 -8407 -3258 -11211 -7504 6109 -9792 -25604
19102 -25604 -22522 -5483 -6691 -8856 -13713 -8997 380 6665 1367 -10550 -7195 -6085 -18016 -24665
19088 -24665 -26384 -9977 -134 4116 10357 19955 16395 12939 -1018 -14409 -19009 -14100 -16298 -13901
19074 -13901 -20938 -18885 -13908 -8267 -7793 -14372 -29356 -24513 -2977 2588 3991 -7439 -18184 -15299
19060 -15299 -11357 3392 -5323 -20358 -18177 -15885 -10461 -2591 3673 3571 8131 8941 9762 3645 -2700
19045 -2700 -5515 -5574 -9456 -14137 -14968 -8453 845 -1030 14040 18321 12907 1923 -4731 -19316 -29604
19030 -29604 -28319 -17018 -11213 -17333 -25047 -25039 -24533 -16787 3907 2600 -11623 -26661 -26132 -18341 -15030
19015 -15030 -29004 -22530 -9771 -13167 -6922 1741 1617 -6946 -4101 -7586 -18005 -26095 -15457 -24408
19001 -24408 -15002 -6082 -2649 1645 -703 -14619 -1124 -3886 -10324 -18227 -18095 -1260 -4071 -10227
18987 -10227 -9317 -2166 -2589 -525 -3388 -9132 2168 -9328 -13251 -5907 -9468 -6232 -3083 4828
18973 4828 -13103 -21577 -24554 -14632 -6312 -10160 -3015 850 1828 -5877 -5106 -9279 -23773 -40012
18959 -40012 -38798 -26750 -16571 -21398 -25167 -28614 -25419 -11536 726 -521 -1791 -712 310
18946 310 -22640 -35108 -30641 -30197 -23901 -15672 -11908 -6807 -8701 -9737 -15684 -21424 -25395 -18945 -2706
18931 -2706 -1232 -11793 -16753 -6045 -7349 -4183 4216 4103 -9754 -8889 6867 3158 -2842 3008
18917 3008 11063 18472 5595 -2680 3311 15065 15619 3894 -10527 -22460 -18166 -15342 -14373 -20144
18903 -20144 -24746 -12031 -4281 -11574 -17046 -11887 -7189 -15120 -20788 -21139 -32381 -32647 -21430 -8313
18889 -8313 -5869 -10950 -25420 -29240 -27826 -17601 -13941 -20548 -8025 -10429 -11254 -18991 -23961 -12669
18875 -12669 -1025 11984 13393 11124 7570 -5104 -18749 -18508 -12900 -3914 -10346 -6500 -14149 -9266
18861 -9266 1630 7158 2862 3720 4880 -8077 -4172 -2057 -8687 -6080 -6710 -12175 -4102 -12582 -15963
18846 -15963 -13823 -7147 -5338 -8053 -10754 -4304 -2729 -13267 -24160 -19189 -26167 -40731 -53006
18833 -53006 -55612 -49338 -31041 -9645 3867 1843 -4372 -2250 -20854 -36216 -44817 -27694 -7313
18820 -7313 -5748 -16028 -15671 -9073 -1669 -3786 -2389 -8646 -11111 -10196 -18383 -17740 -15817 -7732 -2664
18805 -2664 -11195 -26713 -32934 -16836 -924 2321 7998 941 -12870 1310 15133 12474 -2950
18792 -2950 3376 9429 1624 -1573 -5275 -18601 -29801 -29847 -22326 -12325 -3 3559 -10830 -16132
18778 -16132 -8873 -6414 6592 20657 26905 18472 33482 44225 70151 116166 186483 198054
18766 198054 160202 113750 82918 53522 40123 43661 48727 31111 12570 17370 30464 25220
18754 25220 24543 28805 28088 20610 4048 -408 20727 18957 25017 31432 26185 8455 20860 48122
18740 48122 50099 43695 52262 57762 55228 55980 49326 44802 42953 51342 57055 50316 52733 50270 50014
18725 50014 65803 71437 68114 47663 27089 35424 31113 26274 34277 34297 35221 34041 23582 7966
18711 7966 7166 6503 19003 38296 46944 44028 33793 36275 31960 29664 32495 26642 23172 23109 16598
18696 16598 20831 35735 33587 28867 24578 29542 21378 18535 11616 145 -3160 4317 5431 1902
18682 1902 2120 1368 909 9685 4941 8980 10163 12441 -2127 -11187 -10454 -3461 -353 -4892 -748
18667 -748 7120 8023 9763 19905 24209 25319 24090 9402 -3785 -3714 -12004 -14520 -13785 -8956 -4883
18652 -4883 -6394 -14245 -18042 -6397 -11131 -14265 -17151 -22859 -5175 8027 19750 24179 3978
18639 3978 -18831 -26045 -36835 -42170 -27421 -21102 -17735 -20325 -7607 -6289 -7301 232 4034 4658
18625 4658 6986 -5402 -19478 -27218 -20313 -18711 -17151 -13141 -7074 2583 2430 5484 -9687 -18862
18611 -18862 -21961 -26361 -19770 -7757 1675 12738 -64 4210 -4896 -23061 -27728 -23417 -25412
18598 -25412 -33615 -46512 -52075 -48231 -35888 -20293 -35078 -26384 -11538 -11647 -15421 -9975 -12220
18585 -12220 -344 -8148 -17735 -15713 -16225 -26359 -15823 -371 1716 2915 -4914 -6809 -14479 -18331
18571 -18331 -30842 -20932 -11558 -11317 -12932 -25892 -22245 -16916 -21212 -28333 -35398 -40214 -52982 -62308
18557 -62308 -48117 -26103 -19882 -41834 -37160 -19924 -14347 -23185 -29400 -24357 -27450 -9532 -2102
18544 -2102 -21167 -25228 -18084 -11679 -20037 -22778 -3379 959 4162 8186 4645 -16676 -29768 -27509
18530 -27509 -31339 -38119 -39313 -40251 -33262 -25830 -16346 -14241 -13502 -11903 -14310 -21966 -22526 -26187 -27264
18515 -27264 -21565 -23513 -35689 -37902 -24608 -15058 -15607 -22854 -39210 -39349 -14731 -2639 241 -7009
18501 -7009 -17696 -12542 -12466 -25262 -20433 -16446 -21765 -21837 -35167 -45160 -29456 -20104 -26726 -30145 -31589
18486 -31589 -48304 -42677 -36049 -29667 -26051 -27259 -30081 -36286 -23600 -19774 -21980 -21713 -14176 -13699
18472 -13699 -28780 -38886 -43816 -46047 -43053 -42070 -42348 -37891 -26113 -18057 -14471 -17569 -26671 -30646
18458 -30646 -28200 -28965 -24597 -25126 -31130 -30242 -32012 -35330 -28000 -16831 -13625 -19983 -27088 -24203 -25815
18443 -25815 -26142 -27626 -31308 -32007 -30216 -39215 -49647 -44744 -32135 -30313 -28258 -12177 -2474 -10222
18429 -10222 -23959 -28873 -34015 -37778 -39365 -54460 -58525 -64173 -51428 -51423 -44587 -36335 -31965 -36409
18415 -36409 -30908 -31991 -30543 -22164 -30500 -39640 -48921 -47606 -37659 -35898 -34318 -23886 -31980 -30527
18401 -30527 -6548 -11495 -10993 -8923 -16924 -23760 -23618 -21503 -14760 -4388 -12052 -18763 -34458 -47293
18387 -47293 -47516 -42220 -44860 -32815 -12438 -8642 -9913 -11163 -4583 5311 2408 -12421 -15329 -25617
18373 -25617 -26850 -28078 -30451 -23880 -20529 -22047 -20301 -33196 -27966 -27033 -24894 -13518 -4218 1764
18359 1764 2826 5703 7560 4956 -18941 -28103 -17174 -20704 -33231 -35176 -38745 -25873 -20977 -29591
18345 -29591 -38455 -41512 -39408 -46994 -40964 -39305 -30629 -21741 -16955 -24204 -18595 -919 -357 -3009
18331 -3009 -19205 -21375 -19269 -10265 -19124 -29680 -31277 -36312 -37922 -35454 -35672 -35339 -26894 -21849 -25297
18316 -25297 -34044 -27913 -33394 -31569 -39594 -33556 -33015 -58357 -70998 -57454 -42019 -56235 -54086
18303 -54086 -47159 -38247 -49201 -59228 -51690 -42855 -50229 -49679 -36276 -22378 -31897 -43597 -37025
18290 -37025 -27220 -31638 -35653 -19241 -19595 -24221 -28634 -36215 -37198 -38705 -41980 -35898 -18029 -18458 -16718
18275 -16718 -16395 -31093 -44590 -53187 -53426 -47260 -47409 -53188 -51996 -58992 -65308 -62184 -56718 -64966 -68930
18260 -68930 -63291 -47827 -36906 -44252 -58474 -58757 -41465 -47454 -56214 -47764 -46958 -40966 -46200 -54382
18246 -54382 -57168 -61754 -55315 -51069 -51791 -42516 -35062 -31481 -39679 -36814 -46729 -39592 -24744 -13509
18232 -13509 -37673 -60714 -54554 -54431 -50377 -57220 -63764 -69280 -69718 -73662 -71238 -69156 -50012 -53964
18218 -53964 -59468 -53793 -51519 -59272 -53662 -57195 -60138 -61728 -58253 -51859 -39939 -43206 -43754 -49116
18204 -49116 -55102 -59392 -66355 -71444 -65543 -61791 -55787 -62882 -56521 -42830 -43744 -58115 -55262 -56093
18190 -56093 -65371 -79946 -100930 -105759 -101656 -92111 -78717 -73383 -77231 -88507 -86538 -79859 -74071
18177 -74071 -70346 -64678 -73045 -87114 -84824 -81575 -75418 -79956 -90251 -107430 -107901 -85653 -86165 -84302
18163 -84302 -94568 -118834 -113591 -87423 -77793 -78197 -80284 -80126 -97033 -98256 -112467 -128905 -116727
18150 -116727 -96998 -94263 -98434 -82894 -75541 -79877 -86113 -101055 -97350 -84265 -82220 -77725 -76078
18137 -76078 -73570 -82508 -81246 -64923 -47176 -46448 -44931 -46838 -39160 -10387 10074 19324 50054
18124 50054 111798 180990 245296 325183 429513 552108 726524 928186 1172311 1533548
18114 1533548 2120997 3118844 4947254 8809203 17558980 29211042 29198441 22555664 14661459
18105 14661459 8745472 5609498 3909096 2896060 2269862 1826232 1504929 1292828 1127110
18096 1127110 976396 865949 760357 689884 639165 598441 568852 535325 493891 448933 406461
18085 406461 372586 339902 316792 303418 312566 309010 289840 267367 256530 259807 252170 226322
18073 226322 213638 210148 214113 208023 205428 208325 197910 190448 182411 164428 160593 165359 166068 158169
18059 158169 148012 133220 125522 122573 142551 148068 155474 153887 143664 138173 138656 136322 128901
18046 128901 129284 112723 107845 104034 101755 99060 99017 100531 93231 83059 81236 83171 90966 91068 102333
18031 102333 110163 102301 99541 105839 95394 87971 93478 85087 90042 83959 85226 85737 86920 89581
18017 89581 94441 98597 78527 60215 64562 75594 81484 78736 63043 35142 29932 35559 50743
18004 50743 56666 58242 67078 67911 53291 54767 64580 72813 69275 57239 42698 43452 56087 49072
17990 49072 33560 33091 43026 48177 53165 49178 40872 23165 4364 1465 6479 7779 9633 22633
17976 22633 26631 30027 23767 40628 43012 27318 27506 41991 46809 28977 39464 51984 55674
17963 55674 50131 23477 16753 22456 24898 21399 30246 32657 31045 34724 29620 33701 50765 59313
17949 59313 52985 55451 59757 49734 34649 32091 36769 23155 23334 37378 44914 45629 27910 16094
17935 16094 23094 15264 556 5381 19336 22818 21509 15075 14138 25251 27541 20684 28963 33217
17921 33217 35264 35607 12952 10087 24120 22781 16046 15889 24027 22386 8219 20237 20554 39937
17907 39937 43704 38123 19768 15933 11834 11995 11614 4059 2907 9006 14769 16835 6123 15544
17893 15544 24167 16893 6516 -11606 -1097 6274 18913 20501 18418 14542 7595 -1291 12229
17880 12229 184 -1255 2326 -3111 -5604 13477 19602 19869 11377 4685 10193 10538 -4704 87
17866 87 -11279 -10327 -2656 5629 7596 2479 -3826 -14010 -16353 -732 16510 15404 6207 21408
17852 21408 12824 10294 22043 22515 22231 21507 21037 -610 -10509 -3912 3667 13416 21046 22657 13222
17837 13222 7409 11999 16573 15327 2639 3969 12261 9936 14053 21201 27218 16597 14769 8338
17823 8338 6063 5680 1319 -13106 -7199 12233 15574 22323 6311 5502 19803 30992 29696 23191
17809 23191 15698 24412 17247 23321 21167 3180 -4783 -8496 4299 19047 28366 36308 41919 39570
17795 39570 36885 32894 21439 14782 27687 20070 10211 11549 24131 38271 28325 13542 4757
17782 4757 22883 33090 27151 12303 -5539 -8292 -6136 2394 15347 17234 4695 9093 12608
17769 12608 16025 -44 4311 5947 -9242 -15823 -15831 -6113 -5700 -5690 -3080 -1846 4123 119 -1719
17754 -1719 773 8219 20260 32569 22988 25673 25541 20152 6853 -207 6194 10619 6773 16011
17740 16011 11593 7305 2418 -9582 -7685 1556 14045 22965 15034 2935 -2229 -1689 15028 8981
17726 8981 -1168 -5772 -3494 5437 15880 13537 19963 25511 31903 25739 21510 27268 30041 16088
17712 16088 7807 927 -9328 -4665 4293 2238 -1080 -2815 3168 -3912 -19527 -25949 -21996 -15986
17698 -15986 -19414 -11672 -5416 3684 -2250 -5650 2255 1085 2977 -7837 -3573 6076 10370 15851
17684 15851 7894 0 -3404 -1654 -17846 -19642 -17338 -33166 -31501 -12470 2446 5768 10301
17671 10301 3605 1345 -2821 -65 288 12531 20993 21885 15035 22102 18818 18281 26402 21825 14133
17656 14133 17602 15681 3332 58 6509 1805 -216 2284 6007 -475 -5772 -8789 -10705 392
17642 392 10910 19863 12428 -2022 -6483 603 3410 -6981 -7428 -2443 2419 19644 29040 15957
17628 15957 11024 16880 26233 22089 9696 6991 14545 6241 4596 15887 12347 12010 -4363 -5593
17614 -5593 -6748 -13738 -5122 -9166 -5707 -7670 -6946 -5683 -6829 -8700 -15609 -13387 -15590 -17698 -20542
17599 -20542 -11984 12255 21879 18561 2492 4253 11609 272 -12740 -12076 -17492 -17110 3339 -2045
17585 -2045 -5591 2918 -6945 -14423 -13560 -13244 -12352 -20891 -17371 -20262 -25719 -18451 67 23530 18962
17570 18962 8483 -7491 -14540 -15846 -18891 -10407 4867 -1578 -19138 -19623 -15934 -19643 -19527 -17397
17556 -17397 -14993 -15146 -10796 -10991 -13793 -20095 -19198 -25467 -11800 -6861 -12463 -5336 1810 4301 21146
17541 21146 16741 17543 23368 15658 20649 22857 24183 14389 16984 11945 -2822 -1322 4172 7367
17527 7367 3364 2694 3803 -4526 -9088 -19322 -28288 -35179 -30796 -27397 -31324 -28654 -22821 -24425 -22399
17512 -22399 -3381 5517 16066 21849 22456 8337 114 -3211 695 -5763 -7389 3450 6962 -6145
17498 -6145 -15647 -2792 -10673 -17824 -20548 -23556 -20897 -19333 -4588 10096 1614 466 10513 3150
17484 3150 4542 419 834 7591 11396 5647 -325 -8108 -24601 -35273 -14996 -3927 -5017 9978
17470 9978 20845 26415 15234 6240 -401 1804 -13965 -8743 -7825 -5653 -12480 -17891 -21105 -16619
17456 -16619 819 14836 11610 8178 7427 4960 -10514 -13571 -10472 120 6169 15632 26315
17443 26315 63389 130851 163422 141812 102043 60154 20274 890 -14897 -17666 -13980 -16823
17431 -16823 -23592 -26255 -26230 -2754 20205 21643 15784 16243 8896 -352 -1876 -6856 -10606 -13989 -14372
17416 -14372 -19159 -30547 -18081 -14236 -19077 -15700 -10857 -2320 6971 9712 -6214 -14625 -14719 -22141
17402 -22141 -15139 -30 -8758 -10974 -14875 -13742 -6647 -8749 -2380 -6680 -13806 -21635 -14620 -20536
17388 -20536 -26866 -22764 -27859 -33012 -29621 -35979 -20165 -11004 -14838 -19325 -21731 -19979 -20705 -13056
17374 -13056 3078 684 5070 12488 10895 6079 -1704 -2164 -3404 1657 4124 4020 1806 -8657
17360 -8657 -8283 4368 17961 9185 -3725 -5717 -7802 -4960 -1405 -10573 -9842 1252 12636 18157
17346 18157 -8262 -10773 -14773 -14108 -6372 2367 7296 2783 6736 16056 4307 -7008 -6861 1831
17332 1831 -2435 7922 16096 19025 15672 16778 8599 -739 -10079 -16405 -16045 -19904 -13290 -3716 7655
17317 7655 8552 -9788 -10801 -8026 -18310 -16591 -20781 -18519 -4648 -3631 -9006 -13339 -14008 -12030
17303 -12030 -7555 -6572 7573 17577 7284 -5925 -9828 -26376 -23165 -10252 -20157 -18892 -18413
17290 -18413 -12650 -13376 -20271 -17929 -17652 -22690 -30153 -19596 -707 5649 2458 10129 4118 -10193
17276 -10193 -22680 -14024 -8343 -2238 -21839 -20803 -18486 -19663 -14471 -478 -3482 -8905 -19498
17263 -19498 -15675 -16270 -20948 -22636 -17326 -20214 -14374 979 6812 -13822 -29377 -33297 -24978 -7090
17249 -7090 -6182 -13849 -17204 -13023 -18962 -29930 -25684 -18162 -21025 -15392 -16410 -27294 -38044 -29765
17235 -29765 -18499 -24071 -21386 -8135 4002 2894 1356 -3991 -17408 -12525 -19231 -22991 -29534
17222 -29534 -35487 -24507 -9250 -4850 -2024 2148 3357 14830 21879 10201 3372 -6009 -13398
17209 -13398 -3386 7882 -6105 -15153 -5249 -12517 -17448 -31768 -32595 -16963 -15925 -18039 -23214
17196 -23214 -5704 -5156 -9523 -4458 8282 -1432 -2925 17055 13939 4307 -1715 4185 173 -5434
17182 -5434 -8101 -19638 -14423 -5441 -4961 -10926 -21589 -25867 -15397 -20871 -20981 -12578 676 -1142
17168 -1142 5926 5591 -5541 -10591 -17363 -11307 1609 -887 -19820 -14845 -10270 -7192 -11129 -19919
17154 -19919 -12328 -2668 -5908 -14962 -12105 -13557 -25129 -31606 -30292 -21663 -19733 -21286 -14920 -10158
17140 -10158 1400 6930 -1695 1731 7942 -2654 -15245 -1125 -4410 -2444 11998 7279 8393
17127 8393 -241 -7221 -9016 -15955 -18907 -22489 -15773 -18838 -12159 5961 -421 -16238 -13530 14816
17113 14816 24069 1027 -10214 -13015 -7018 3340 -4684 -13069 -16019 -11217 -11559 -11277 -9713 -9305
17099 -9305 -12589 -7243 2838 -7476 -3028 6116 13298 949 3284 7186 2224 -4355 -13274 -24754
17085 -24754 -17679 809 11062 3109 -8346 -26941 -31122 -22661 -15306 -20028 -22630 -19121 -2181
17072 -2181 5983 3884 -9471 -29050 -35943 -31866 -19808 -13251 -31948 -38797 -17955 -25081 -32713
17059 -32713 -28609 -26836 -11738 1314 -260 -3308 -5211 -21195 -19841 -21241 -25143 -19462 -17662 -11413
17045 -11413 -15823 -11471 2224 9636 15731 12978 -1643 -6848 -16865 -15002 -22383 -22461 -8615 -17544
17031 -17544 -20036 -19145 -11569 -2266 3475 2072 8577 5954 3573 9290 5710 6781 -2563 -15536
17017 -15536 -21161 -15297 -18515 -10189 -15472 -37702 -33300 -38481 -42091 -38461 -34949 -26196 -25013 -30473
17003 -30473 -18982 -16658 -12764 -6448 -12602 -19846 -20792 -12533 -12013 -10765 -4350 -2347 -2522 -16007 -11883
16988 -11883 -17100 -22138 -34097 -33077 -25527 -33596 -24941 -22079 -26774 -32176 -11644 -7775 -17801 -13329
16974 -13329 -13470 -14035 -13344 -12992 -16443 -22677 -27476 -29563 -27405 -15810 -25682 -37627 -33277 -32911 -20982
16959 -20982 -774 -1405 -3715 -11651 -17159 -22903 -19532 909 7622 3735 -11045 -27165 -33185 -29189
16945 -29189 -18470 -12812 -19207 -24886 -30802 -29826 -25222 -26544 -20153 -20247 -21000 -15927 -17414 -17805 -17794 -20254
16929 -20254 -27988 -28818 -26832 -16986 -6920 -5791 -4747 -6806 -10808 -18314 -30242 -30007 -25748 -19932
16915 -19932 -20883 -30475 -35407 -32138 -18793 -3657 -8577 -24518 -29778 -29956 -10292 2766 8779 -7018
16901 -7018 -19099 -24294 -19482 -16530 -18993 -11966 446 19370 10856 -12390 -15616 -16100 -5136 -4396
16887 -4396 3339 13071 9547 -450 -15461 -22620 -28920 -36563 -31749 -25607 -11119 -16403 -27536 -23949
16873 -23949 -27001 -32924 -16380 -17578 -26528 -29135 -23122 -20236 -29862 -32442 -37060 -39407 -22011 -32726
16859 -32726 -39432 -34187 -18206 -23777 -37657 -29449 -26850 -30437 -35596 -27773 -15871 -28596 -23477
16846 -23477 -15979 -23010 -30918 -34956 -27490 -19563 -22244 -6298 -11385 -26264 -33523 -40763 -46930 -33064
16832 -33064 -20771 -31889 -37980 -33095 -27675 -22151 -10328 -19717 -22867 -29287 -24349 -23476 -29775 -11330
16818 -11330 1370 2097 -1388 -5882 -12070 -9549 -4075 -6220 -14319 -25853 -35186 -27751 -3149 8474
16804 8474 -1189 -9729 -21890 -20483 -29505 -25999 -21285 -29342 -26079 -15346 3242 -1237 -7884 -14547
16790 -14547 -22272 -21658 -28512 -28728 -22460 -20779 -15264 -24062 -20967 -12142 -2476 768 1961 -4712 -8729
16775 -8729 -13076 -20758 -22245 -22681 -17002 -18613 -23001 -22752 -31160 -38472 -37715 -38800 -40602 -32069 -35292
16760 -35292 -35068 -21190 -5823 -12257 -14167 -6410 -3863 -328 -322 3171 -6303 -9010 -28506 -22612 -16648
16745 -16648 -17822 -9830 -16856 -26613 -24032 -27187 -25874 -34100 -43567 -49229 -39055 -29888 -30059 -30308 -23014
16730 -23014 -10741 -11256 -6805 7844 6451 365 -5107 -11599 -12169 4189 -3770 -535 3755 8743
16716 8743 7126 5311 -1681 2897 14471 21360 3126 -9650 -11620 -12713 -12396 -7272 -295 -11027
16702 -11027 177 -8403 -25328 -18373 -16152 -16587 -11719 -17995 -15966 -8552 -8341 -12476 -18132 -21312
16688 -21312 -20376 -12211 4348 -2041 -6368 -1570 -5057 -10399 -6716 -7926 -4652 -6230 -7601 2496
16674 2496 1516 -778 -5697 -7192 -9595 -14428 -10883 -17885 -29520 -19359 -10622 -15881 -14222 3346
16660 3346 -3174 -8144 -1390 3951 2460 -8282 -21414 -25453 -26773 -25048 -23719 -10769 674 -9029
16646 -9029 -11982 2730 -10475 -14199 -8290 -15965 -32823 -39123 -27564 -14905 -11487 -23441 -25042
16633 -25042 -18080 -17833 -11641 -67 5699 -12032 -26631 -25186 -19735 -15445 -6852 -4708 -338 -227
16619 -227 1978 -4816 -18539 -17470 -21744 -10069 -5457 -9957 -5608 -13565 -12334 -15270 -20669 -6528
16605 -6528 4866 -6633 -12421 -10873 -19973 -24281 -19051 -31171 -30847 -21040 -27897 -26861 -22799 -20275
16591 -20275 -29080 -28903 -24548 -31861 -9608 -8686 -11413 -17678 -20468 -20302 -29214 -27576 -25464 -32100 -23821
16576 -23821 -20999 -23731 -25065 -36875 -45943 -26222 -16648 -19421 -20683 -26439 -27530 -35523 -51160 -47539
16562 -47539 -38446 -26731 -14696 -16034 -15252 -11158 -12887 -23894 -35805 -29348 -32953 -30359 -22825 -11757
16548 -11757 -23908 -39037 -48696 -44753 -42085 -33211 -21699 -28136 -23250 -13259 -18483 -27749 -29193 -36111
16534 -36111 -31596 -29573 -25519 -29870 -34042 -38411 -36497 -36620 -33713 -20563 -4756 -20723 -19888 -3657
16520 -3657 6910 -1795 -23572 -18171 -24618 -33552 -32650 -38506 -30310 -21822 -32373 -35445 -25492 -15023
16506 -15023 -15499 -19609 -17397 -24752 -33237 -34247 -22529 -10622 -5502 -15106 -27828 -27250 -31874 -42826
16492 -42826 -43353 -37447 -36360 -28960 -21750 -9722 -8200 -14870 -14964 -11982 -16645 -18721 -20114 -23401 -21489
16477 -21489 -29550 -49349 -55655 -46517 -35556 -39888 -37641 -34195 -23574 -17377 -21481 -18868 -5434
16464 -5434 1106 -5660 -16281 -14702 -11297 -13089 4251 5237 -3871 -14610 -23702 -35970 -34986 -21730
16450 -21730 -11890 -4073 3837 -7044 -15349 -17756 -10103 -5345 -1142 -12144 -16151 -7622 -2752 -8625
16436 -8625 -24236 -28133 -40409 -42834 -42497 -43260 -34223 -30663 -38267 -40843 -43022 -41263 -32726 -30514 -29861
16421 -29861 -20702 -15821 -17347 -24979 -30096 -27935 -18619 -12265 -4052 -17465 -26725 -5380 12114 -931
16407 -931 -11461 -16931 -22415 -24256 -22004 -7176 2167 -15672 -18975 -22330 -19634 -12599 -12628 -16171 -24073
16392 -24073 -32750 -35855 -28900 -26178 -22974 -17676 -23419 -35373 -46149 -38121 -38164 -48093 -35403 -27765
16378 -27765 -3689 -3978 7427 627 -510 -9034 -13143 -18785 -15826 -16832 -29420 -26430 -24761 -5960
16364 -5960 -1119 -18404 -15980 1220 13443 10390 14943 14168 25895 31317 16637 10392 13975 22348
16350 22348 35640 41981 37311 31287 46966 37567 38314 39987 49780 40042 22212 16623 18533 39121
16336 39121 44849 40301 17420 8276 -4508 -8137 -7139 -549 9208 26210 40992 47807 41453 41087
16322 41087 49768 64634 68906 77007 79915 72742 78958 75311 61353 69939 90885 79541 73732
16309 73732 86142 85496 82122 84036 81076 65510 49673 45653 40515 22277 30052 41474 31095
16296 31095 29442 25071 28324 24850 10911 1713 6375 9607 4254 12423 22466 25300 24320 18030
16282 18030 20969 31455 47904 49896 36279 38268 42092 43750 50103 48623 38566 46090 48321
16269 48321 49966 31682 32223 41783 32405 7543 1237 16673 12286 1169 -13618 -21582 -7841
16256 -7841 -9669 -19214 -14133 -7689 -9142 -7384 -12021 -6663 6958 -1984 -3281 -2508 -6521 -28318
16242 -28318 -22962 -23083 -15512 -8245 -2136 2340 4635 8667 5035 907 13166 13891 -6009 -13009
16228 -13009 -12892 -24909 -13833 -13849 -23080 -19489 -21006 -18170 1621 -2108 -21911 -26222 -30786 -26286
16214 -26286 -3645 3605 1682 -11797 -28198 -21446 -8998 -1074 514 -9657 2417 9211 5348
16201 5348 6584 2119 -14571 -23846 -32436 -39009 -36723 -47871 -32633 -16863 -5696 -2196 -6367
16188 -6367 -20918 -20478 -20638 -17006 -15420 -20968 -27080 -15176 -6509 -11309 2050 7805 -6767 -6999
16174 -6999 -8210 -1788 -3320 1684 3251 -9624 -5875 -2400 -54 -5547 -7797 -8550 -2750 -12754
16160 -12754 -31653 -22586 -22498 -19129 -24731 -34046 -30573 -36560 -46209 -24359 -6646 -9116 -2337 -1146
16146 -1146 -3570 -8940 -17536 -6921 1250 -14468 -22193 -33185 -18690 -5932 609 -14509 -14185
16133 -14185 -1484 -13728 -13011 -26132 -40568 -21546 -15788 -30183 -26830 -27314 -36163 -44439 -43626 -46630
16119 -46630 -44437 -21258 -14185 -14705 -13030 -15376 -22990 -40504 -36135 -24857 -36730 -33236 -22123
16106 -22123 -14396 -38447 -58206 -48873 -25622 -27932 -30245 -28992 -24211 -14715 -4637 -12013 -33853
16093 -33853 -45650 -51841 -40427 -29539 -13772 -19950 -13576 -30514 -34616 -39625 -33875 -27555 -29043
16080 -29043 -24660 -30009 -34122 -26273 -20869 -11689 -17183 -25568 -14931 -16911 -30995 -27148 -18587 -14766
16066 -14766 -16601 -21110 -16472 -8501 -8835 -7080 -8630 -6328 -18230 -14593 -20092 -29854 -27436 -12082
16052 -12082 -5421 -3102 -17352 -7813 -11787 -19795 -16697 -14886 -22218 -31914 -22789 -10686 -8002 -4601
16038 -4601 -3336 -15922 -24538 -14475 -9294 -11110 -13783 -12432 -15136 -23947 -36135 -41850 -37614 -18258
16024 -18258 -8733 -16205 -8591 1388 4078 7862 7338 2305 25072 41969 46871 54947 39531 23302
16010 23302 9768 15083 19435 13556 28341 51886 62687 68862 62412 54531 55677 51822 51630 35532
15996 35532 32959 27115 27221 22785 23595 13617 24410 27251 33842 49294 50481 46535 57695 51629
15982 51629 57064 72728 78308 76551 81614 93150 112395 113507 125881 115750 121643 109314 92604
15969 92604 79844 75026 67216 65846 69375 69024 54208 47825 44234 45839 29488 31584 26233 24600
15955 24600 30813 20841 12717 18774 27137 29833 25610 23829 20054 23272 38653 35761 35558 48139
15941 48139 60137 66761 58499 41834 45979 46393 51045 58266 50041 46754 40556 36782 16133 5869
15927 5869 5961 10303 5949 5506 15191 17030 9123 -341 2144 9846 1232 -7457 -8886 -16474 -8064
15912 -8064 -8638 -7371 -7702 3994 7469 6773 9150 6013 -7068 -20485 -29220 -34452 -22186 -26073
15898 -26073 -38078 -36695 -47540 -34515 -15520 -10729 -17264 -22404 -35384 -25850 -13682 -12568 -10748
15885 -10748 -5237 138 8568 8769 16022 -1766 -23844 -40657 -35558 -47827 -56480 -45926 -36201
15872 -36201 -28709 -23513 -17536 -5343 881 -10381 -10543 -13926 -16725 -13785 -11626 -4458 2294 15507
15858 15507 17988 6375 -12872 -26848 -27750 -22548 -16145 -7664 -11405 -28554 -33276 -28900 -28715 -33888
15844 -33888 -22210 -15582 -13691 -6799 -4409 -9888 -5186 4034 4423 -14854 -15001 -16485 -19958 -15806
15830 -15806 -12276 -17251 -24731 -23623 -19770 -4800 -1531 -11347 -9234 -4326 -9565 -25677 -22031 -16984
15816 -16984 -19627 -11421 -3171 8103 5679 -9436 -7269 4167 -4550 -1989 -2510 -7760 -22951 -10948
15802 -10948 4595 17183 18945 16584 11663 8323 -6525 -18047 -24842 -28109 -28409 -30531 -42715
15789 -42715 -39899 -29738 -23467 -21325 -9340 -16730 -18488 -14268 -9260 8937 17535 20138 9048
15776 9048 1278 -2732 -8148 -6114 9892 26937 24315 21397 40541 42048 36803 36981 33244 32963
15762 32963 25926 28130 41327 46694 49944 44172 34302 33034 41586 51658 51229 52419 50457 43519
15748 43519 31123 24963 35884 33591 22874 19519 11773 26214 51736 49483 46449 58500 87974
15735 87974 92668 84392 73909 74966 101154 105571 101865 112850 119973 126166 127318 135731 123471
15722 123471 110697 106435 90401 76182 79195 88661 87387 81879 63664 55854 50678 53216 42147
15709 42147 33547 44845 47326 48047 43008 41059 34596 44420 55241 58830 60559 53630 43945 40935
15695 40935 47215 61731 71086 74106 76634 66275 58334 47815 33683 35484 38563 30536 34146
15682 34146 48023 54628 22985 15654 16498 22305 14525 5637 3430 1850 9045 8710 4272 622
15668 622 566 5791 8967 1643 18186 20617 11138 9192 9711 1513 -5109 -2066 1846 -4759 -9177
15653 -9177 -4381 -2546 -1306 8578 3256 -1093 -10608 -9280 -22052 -33587 -30253 -17950 1073 9537
15639 9537 23691 18294 -6965 -20375 -9818 10162 11581 14242 12546 15628 8315 -633 -3989
15626 -3989 -11724 -7933 4345 1150 -1817 -2317 5102 9967 18260 21686 17299 15944 7898 6685 13227
15611 13227 21222 40630 40547 29121 18504 23044 37209 36112 37240 39568 31129 20406 25073 25636
15597 25636 16016 10317 13314 20769 25113 25594 22231 21679 26385 19775 16711 31330 27667 18139 6742
15582 6742 -1030 -2221 11187 20762 8350 -5528 10813 18775 21698 20070 13942 16877 31707
15569 31707 24174 14420 34963 54001 56033 47196 54916 44015 32661 20536 17678 37152 39004
15556 39004 32115 27659 30708 32231 31284 40818 51375 54437 41263 41076 49798 53404 42810 37152
15542 37152 55273 60744 50199 40026 37367 23020 24824 24123 15423 19742 29852 43257 46976
15529 46976 47452 39951 30206 22670 36018 50453 48072 34500 38369 44778 36895 43642 44989 50972
15515 50972 47036 41741 43980 42394 43463 47064 64733 60103 56259 57107 52662 37689 31118 35888
15501 35888 37391 41610 30072 35423 40708 51547 55082 49601 39188 44883 66591 60698 56352
15488 56352 58689 71037 73751 78909 82984 73515 69142 71485 69419 67948 63631 58373 83656 92016
15474 92016 91827 76874 79415 81257 82219 72182 73043 74595 87487 103420 94905 85465 86983 90468
15460 90468 98536 96187 106652 117539 115356 124530 134549 131555 135232 141967 151101 165530 179575
15447 179575 170135 177108 190761 200535 202272 207554 216172 227799 227960 231937 230079 232468 231383 223261
15433 223261 231193 236022 219168 201213 207548 199298 178863 174767 176307 163457 161664 171060 169155
15420 169155 166577 160015 163989 177551 171094 149667 141977 140227 135220 157128 155090 160120 159314 166186
15406 166186 170219 165881 167704 171774 159876 162643 169887 172612 179281 192566 188064 174495 183985
15393 183985 189269 193381 199748 215346 218080 205976 208709 209354 212777 213718 209419 210208 207499 201415
15379 201415 200074 215141 234485 241466 243140 258056 270867 273237 263244 265447 262112 278166 282142
15366 282142 277173 285495 288075 295183 295223 285368 285871 293770 299363 303742 309024 307285 313015 327523 325378
15351 325378 323150 333034 344329 357754 362355 354852 356044 362970 361019 364097 361580 366517 360533 374104
15337 374104 387379 401542 403468 396446 390078 395698 394073 389925 396162 398781 392980 408819 421419
15324 421419 427340 431973 439154 447977 461721 465809 454279 446818 453244 471085 480727 495015 499355
15311 499355 501926 504320 492951 492330 513158 528816 530831 535976 543523 557994 570310 571517 581817
15298 581817 596442 604794 618300 627915 631447 639424 640444 629029 615571 633541 653298 673929
15286 673929 689842 698130 716228 723310 726697 739004 748209 773151 800082 808725 806124 823717 854345
15273 854345 868172 887911 895006 910713 937154 938324 957700 978402 985880 1015800 1036647 1038819
15261 1038819 1040828 1068369 1099071 1125011 1142356 1160886 1172519 1210899 1236060 1262334 1291869
15250 1291869 1305496 1336737 1359266 1385530 1419428 1448389 1473216 1506931 1550058 1593304 1612438
15239 1612438 1649554 1693246 1732538 1766270 1799131 1858721 1909860 1954439 1991371 2038854 2094724
15228 2094724 2144118 2181185 2233596 2296358 2362040 2419327 2486210 2550829 2623775 2699191 2764297
15217 2764297 2840950 2917604 2991041 3072225 3160904 3246415 3336770 3422443 3517581 3617075 3730147
15206 3730147 3835895 3936220 4039048 4160595 4285928 4407833 4530544 4671797 4828502
15197 4828502 4984857 5137648 5291624 5452717 5616799 5789487 5978072 6167816 6371554
15188 6371554 6592493 6833062 7071853 7312688 7554312 7799888 8056105 8334965 8620307
15179 8620307 8905138 9204102 9499550 9812579 10136632 10458143 10793031 11141486 11507167
15170 11507167 11870103 12233793 12608704 12972502 13326561 13681666 14056345 14415215 14770115
15161 14770115 15122391 15464403 15777819 16068644 16360677 16626615 16883754 17103726 17290542
15152 17290542 17459004 17602861 17714993 17790464 17827017 17839832 17817040 17771868 17697577 17588772
15142 17588772 17448866 17282340 17092760 16881130 16649944 16404538 16155390 15859729 15532096
15133 15532096 15198966 14859335 14531851 14210047 13865160 13526259 13183513 12835892 12498143
15124 12498143 12160435 11819457 11487690 11165112 10835931 10520672 10219662 9928630 9641563
15115 9641563 9368268 9107848 8847547 8585175 8326299 8094439 7873254 7659046 7453928
15106 7453928 7245089 7041172 6853633 6683793 6509157 6340753 6179862 6012353 5850025
15097 5850025 5697639 5556940 5431983 5299267 5163166 5038292 4918704 4801799 4685033
15088 4685033 4571185 4456219 4356132 4260589 4162883 4073620 3991637 3913294 3813306 3709574
15078 3709574 3635233 3548781 3467938 3396681 3328248 3265434 3200156 3137640 3080948 3000083 2936046
15067 2936046 2876861 2833065 2784957 2742708 2688859 2629915 2576042 2524661 2487416 2450639 2408559
15056 2408559 2378633 2330454 2301016 2262758 2218347 2183195 2157011 2121461 2086167 2054253 2022523
15045 2022523 1990640 1972669 1955875 1930048 1886850 1855930 1844045 1817289 1790511 1768664 1769672
15034 1769672 1766723 1747198 1719297 1698617 1683656 1665594 1646238 1632174 1635890 1644871 1637862 1630097
15022 1630097 1625568 1625357 1607046 1593160 1597096 1587810 1581093 1581722 1568370 1565423 1573246 1571118 1565379 1557774
15008 1557774 1546904 1533475 1516918 1492171 1470162 1467701 1453639 1429648 1411287 1381598 1369273
14997 1369273 1349719 1318748 1310408 1285463 1249429 1225896 1200341 1177524 1150648 1141326 1122666 1112273
14985 1112273 1096831 1068654 1024795 1005156 1000878 983457 964875 942659 931408 920488 919194 912759
14973 912759 904117 880960 870721 864427 862681 851081 845489 838851 825749 825840 820171 808988 793367
14960 793367 774949 758262 761339 763900 746387 744661 744704 722296 706181 687830 677153 678415 676261
14947 676261 670839 668431 673840 651837 656046 659895 652466 648447 655024 649634 631047 634286 632083 626030
14933 626030 620097 606526 595940 592196 584536 586275 576023 568042 553116 552847 559326 558986 538297
14920 538297 531968 537120 538182 535782 525570 527652 519496 520429 522904 529090 544500 521978 517998 512115
14906 512115 485393 482827 475581 473828 460791 454498 472573 478376 454365 449703 444825 444265 445210 438023
14892 438023 429545 439644 435156 424819 420089 413845 415748 420674 411129 403256 402029 403952 402463 405611
14878 405611 404156 408848 411897 414244 426717 432064 425966 427886 424193 425563 429459 424732 433266 455898
14864 455898 474169 467923 463871 465222 462118 457102 458966 455074 453183 443310 447172 438818 415335 403087
14850 403087 390225 369540 352432 349453 353045 345193 344933 327563 320931 327742 330461 329906 335757 328799
14836 328799 331249 318942 306863 308325 317664 308987 306334 297056 299949 297461 284988 299548 314102
14823 314102 320681 321294 327127 326815 315152 299215 289748 281188 280242 277932 282281 287214 293917 299740
14809 299740 297276 294773 280070 279220 283946 288691 290663 258136 264587 267572 274028 277239 274345 265509
14795 265509 266353 267212 266264 253473 246089 242852 228838 223047 231263 229760 236555 226727 222272 213610
14781 213610 218798 228156 214018 208529 219324 223218 237507 242759 240414 234571 225832 228872 223713
14768 223713 216101 221925 219156 211821 215356 216529 218255 213047 216393 225575 224291 218636 210784 212867
14754 212867 206667 201453 210933 205326 199421 206537 210181 218171 211337 211111 204491 211979 218404 216403
14740 216403 207701 224922 214515 203448 197679 196230 200213 204708 207023 207073 198584 196467 186665 176944
14726 176944 176447 175086 172377 179547 183328 191545 204012 210267 211936 202757 189510 200329 207975 203463
14712 203463 196555 186062 179682 184051 182942 166111 156723 158691 169642 188183 186943 163932 164349
14699 164349 170940 169035 175723 170340 160445 166767 157283 157349 157430 166151 181957 177988 179571 163825 164074
14684 164074 170334 158627 157570 156112 166785 173512 159546 146527 138644 139047 148206 155058 164585
14671 164585 163001 151872 155494 153879 149307 153709 141702 147381 150260 141565 135256 138021 152245
14658 152245 145592 135836 144210 134236 120205 114982 106212 112019 118427 126487 132092 132518 132743 132670 128716
14643 128716 108131 93342 103489 118463 134352 130257 110233 117105 135183 126184 115985 123342
14631 123342 129110 141499 145676 143554 147206 155866 157731 139979 123346 123435 129143 130924 128482 119303
14617 119303 113649 112422 115877 128715 127387 120302 116872 114226 120235 126766 124765 129767 131461 119136
14603 119136 117018 118957 117254 110970 111412 107883 104882 106488 112295 112502 118944 116439 106250 109541
14589 109541 108772 108025 117131 123200 132812 140313 135731 146181 156795 151283 137781 115268 115433 111682
14575 111682 116760 101189 96827 115008 116584 114677 108455 99907 90824 94519 93710 103627 104838 98964
14561 98964 90632 91247 95260 104798 117875 100044 98354 116835 128306 118811 122653 139197 140012 153673
14547 153673 164668 184099 211108 255835 306350 349041 341297 313413 262436 219692 193405 169292
14535 169292 133245 144796 148558 140868 115932 98913 84044 88415 95944 105053 111810 120381 121709
14522 121709 110311 104345 100831 99847 99960 107434 113477 116149 120147 118387 119660 135443 156948 183606
14508 183606 215952 257378 307689 385164 502909 648707 707550 658893 550008 440234 350239
14497 350239 267244 223475 189313 166039 148321 138877 143038 153526 157592 159432 154723 132897
14485 132897 127362 143456 147096 140205 118976 117612 126877 120183 111197 129138 141817 147970 161322
14472 161322 174349 183101 195763 223813 264415 327518 407738 552226 752693 916254 944983
14461 944983 820844 656926 502490 383060 308910 258255 214931 175097 160898 143731 136110
14450 136110 143293 150019 150132 146537 139704 134005 129023 119387 113945 117225 110118 112638 116735 117092 107760
14435 107760 111663 123347 137222 140941 141939 166166 214011 259944 302850 367559 471222 602908
14423 602908 701702 692807 602098 473265 362418 281654 231832 207453 191927 178877 162372
14412 162372 144353 134122 120859 106932 111248 99074 95853 94367 93984 90230 92802 86773 82136
14399 82136 83579 85650 93485 100750 97072 106433 109939 106094 114904 124299 136377 161279 185736 220417
14385 220417 268079 303867 322897 297752 254058 205407 183973 162420 159168 131604 108264 102088
14373 102088 91494 79652 73852 75687 89379 89186 85761 79618 81149 78953 80319 79456 75524 78923
14359 78923 77711 75286 74979 74864 85992 88090 83518 78961 70982 75723 84589 82333 77779 88990
14345 88990 114805 126229 127590 130863 115315 110396 92993 74807 70968 67444 52161 47913 54540
14332 54540 59759 65104 66406 76155 60238 55417 50758 40582 58422 72467 69595 71770 69416
14319 69416 79978 82601 75787 79354 69303 57090 57412 47904 36802 46842 62844 60306 54183
14306 54183 49455 60180 56971 54289 37472 40584 58962 68038 78769 81890 69405 70229 75037
14293 75037 69494 55389 59062 70250 61236 53383 55333 63179 62127 70703 79411 76578 73693 73562
14279 73562 75722 61912 37860 35222 50773 68250 79173 73676 70904 62368 70559 69296 59455
14266 59455 40128 46582 52710 44164 38849 55872 55296 49929 46882 52248 49480 42145 48505 57690
14252 57690 51083 50468 50652 43384 40336 46280 53097 70134 66810 58341 54157 51348 44904 46254 53232
14237 53232 54109 56687 60648 68065 70465 69671 63823 53195 55769 65363 72099 78397 68904 59630 68491
14222 68491 76203 71972 80077 87173 71418 74650 76312 82132 71835 65681 52551 53682 56031 60715
14208 60715 50219 43073 45525 46605 46541 48885 57794 56125 43153 39772 34491 33486 39828 42547
14194 42547 25484 37136 54795 65418 70040 74524 80052 76595 71870 61550 55216 72271 85618
14181 85618 87497 84514 86852 79788 66903 64242 73259 70799 66895 64919 54873 56327 54789 48773
14167 48773 55007 64806 64950 62774 46432 50254 40972 45051 55373 49916 45691 46424 49058 53398
14153 53398 56470 57888 52519 44752 53396 60175 49933 40395 51166 56966 46117 41737 35614 24100
14139 24100 29501 18590 10424 13116 24167 16831 26423 41047 42332 15508 14046 30241 32990
14126 32990 32553 37208 36796 38034 32942 42854 30303 17422 11858 11520 25002 30917 41450 52564
14112 52564 57571 36932 36219 35443 33045 46105 37292 28349 18875 12055 7752 28406 36687 44463
14098 44463 43593 37029 41728 45463 40440 28951 25053 31533 39286 42921 39769 49414 58096 48352
14084 48352 35094 28439 36384 18276 14656 15976 25697 30848 34931 32923 27871 19435 25351 37584
14070 37584 37725 25155 10822 8455 1315 19527 30914 36584 39077 48024 43402 37031 29202 15521
14056 15521 6119 10933 16882 6452 9314 22966 31891 23823 29431 38556 53426 52234 46343 49169
14042 49169 49353 41082 38143 37861 48210 53712 52843 55382 46410 37397 39064 38419 39040 43657 40872
14027 40872 23525 3331 3068 13768 14985 10870 16586 28225 27158 27798 25114 24024 27411 28511
14013 28511 26268 26312 31035 30957 21615 21569 19162 11606 10314 7165 19544 32009 30014 24606 24098 14820
13997 14820 21147 21158 15094 24047 36166 37792 46858 49464 49843 36597 36091 21842 9844 21999
13983 21999 43300 43955 29427 30257 32364 31428 26770 18621 20934 28575 23925 29002 34140 32087 29780
13968 29780 25482 35571 39960 46224 45605 42725 31841 33898 42178 51219 57389 45803 32100 28000
13954 28000 30366 26769 23919 7717 6406 3798 11699 15942 14747 14565 19977 24092 38330 39058
13940 39058 27973 20278 24121 19439 16499 20620 26883 20705 15689 31332 35366 25361 8765
13927 8765 -2478 2348 15855 25965 27501 26092 20400 28362 17991 -1391 1054 1639 2058 3694
13913 3694 10218 12995 5885 3321 3570 9608 10586 21225 24096 21275 18653 7684 6609 5630 7087
13898 7087 15894 30897 41151 39593 28815 18829 8513 1905 5490 5039 921 -5977 2234 -10660
13884 -10660 -9569 10350 29523 31436 21248 22913 19966 27551 24711 36944 38133 30645 30377 13489
13870 13489 16137 27249 35191 32485 35321 29879 28457 18799 15319 39531 46204 40549 25837 18188
13856 18188 3673 -12227 -3076 13504 20321 29839 32489 33315 34119 27380 11832 14154 9799 5953
13842 5953 -7919 -8130 5606 22137 26224 30244 18405 18424 21275 10646 7850 23392 20935 7028
13828 7028 10276 21883 16184 13237 18634 7218 10677 13954 16768 19148 32930 29063 17998 10864
13814 10864 21383 29954 24082 21205 26397 16424 -2878 -1050 -1443 -4903 4182 15158 16519 22364
13800 22364 25907 18680 21088 15489 24400 33519 29867 16491 6360 1158 9713 13528 21652 19791
13786 19791 -1596 -3213 504 7222 5331 -597 -12610 -16035 -11611 -7578 222 3865 -2869 -3245
13772 -3245 -1706 5047 7134 13721 3794 -295 3968 12804 19094 25609 6548 -3551 6994 20519
13758 20519 16521 9303 -5426 -9236 -12784 -22764 -12149 2451 12654 24220 30876 33143 28907
13745 28907 26956 28238 29196 16471 5530 7992 20382 24282 12576 7417 -923 10349 11407
13732 11407 3111 4494 7232 17745 17142 1112 8542 17774 19301 10683 9394 12504 10371 7004
13718 7004 9400 11756 8442 1339 6836 16156 9584 2908 10728 18340 27163 30882 25368 23667 25448
13703 25448 22570 21698 12316 3633 1280 -796 7031 12573 17931 19534 6105 -893 3243 7302
13689 7302 19083 29426 32622 25342 33026 26031 4645 -713 -1482 -413 10512 -961 190 8700
13675 8700 -6313 -3814 4715 13611 8132 1130 546 9016 10100 22764 18766 17087 24500 20448
13661 20448 6570 3222 8786 18742 23584 26136 24494 45670 38213 21913 23350 20811 9695
13648 9695 12255 26942 23667 13256 12351 4455 -13600 -11596 -15077 -22439 -11723 -6454 -6052 171
13634 171 -137 4510 9251 4482 7028 -6650 -3826 -3481 -2113 -6332 -14474 -12595 -30851 -33223 -35051
13619 -35051 -31197 -19377 -8481 -4109 6123 8133 9341 5694 17506 14485 11774 3740 -560
13606 -560 7082 3519 1778 5228 11807 16176 24063 23719 19278 6464 -4521 4921 10471 14923 16567
13591 16567 10541 10686 5298 -11378 -12567 -9235 -2433 -3338 -7733 -9831 -4518 -727 2418 11474 -717
13576 -717 -17759 -14407 2736 18535 12472 16258 14978 6794 19778 18417 12067 1195 4162 1063
13562 1063 17 -1170 -1980 6081 7692 8759 4670 6568 3850 -2457 -3106 3516 17644 17814 9953
13547 9953 4485 4625 8406 -3453 -14290 2961 15868 12007 8031 -3980 -8214 -4768 5007 9224
13533 9224 5233 -2589 1518 487 -6333 -6006 -9751 -17106 -19540 -12967 3206 7381 3537 -4126 -1058
13518 -1058 -3546 6436 23707 31768 22260 15635 18482 10639 6194 1796 16602 20008 18744 21131
13504 21131 6082 -21724 -22864 -10365 143 16008 5057 7569 6766 15569 24969 18469 3133
13491 3133 -1274 15860 9079 -1141 6156 11034 12508 7888 -1530 -7976 -11168 -19137 -19917 -886
13477 -886 -1754 -983 -11494 -15291 4435 17533 9493 1303 -3269 -1344 2010 -10088 -10073 -5954 -2013
13462 -2013 -5975 -13163 -11825 -14280 -13192 -759 542 9715 21228 18394 14970 5637 10713 19042
13448 19042 31610 28030 571 -14856 -16206 -19497 -23597 -26754 -20199 -15981 -14696 -18511 -15450 -21023
13434 -21023 -1539 12954 9141 -3470 -15 9298 -2762 -12948 -20205 -10635 -7341 -11512 -9778
13421 -9778 -7571 -1204 8278 3215 -2060 2861 -3078 -5200 -5993 -7951 -11506 -14400 -8010 -10436 -10281
13406 -10281 -11918 -6628 2784 7002 -11519 -19638 -20486 -8863 1446 8209 1047 -2161 -302 -8420
13392 -8420 -5089 -1099 -9352 -5349 10788 -11948 -14435 -19583 -17460 -30752 -39215 -23896 -3876
13379 -3876 1333 59 -1793 -11968 -7125 -5040 -576 -5440 -5826 -8201 8085 4868 9679 18639
13365 18639 16066 8152 2747 -8374 -16796 -16010 -28434 -27771 -16181 -1557 4720 -6657 -3659 1177
13351 1177 -2879 -15134 -23360 -17058 -10858 -15003 -26678 -24621 -27360 -36393 -45094 -39094 -22812 -15960
13337 -15960 -4729 -5561 -12626 -1119 17925 20426 -3440 -25158 -26741 -21968 -20646 -15049 -23341
13324 -23341 -33809 -33324 -37331 -36935 -24631 -12235 -9959 -9798 -13848 -12711 -12355 -7422 1437 4337 -5088
13309 -5088 -3826 -14413 -14277 -17910 -17548 -24337 -29906 -29202 -28170 -23377 11971 15007 10678 7805 -929
13294 -929 1974 12327 7135 9358 1051 -7928 -4962 2740 -15893 -13242 -13796 -14909 1564 -1994
13280 -1994 -12732 -27563 -30944 -29048 -23339 -15743 -17086 -16629 -16098 -3421 -4195 -7799 -7981 -7651 -10666
13265 -10666 -12670 -4600 -3287 -12753 -21861 -15613 -4877 2982 -6371 4635 14442 18191 14811 2985
13251 2985 -830 324 6098 5745 2028 -19590 -25768 -16686 -14344 -17616 -14272 -3998 2102 4792
13237 4792 -1341 -12336 -5599 14799 2594 -14427 -6939 4933 6283 361 8451 11102 6770
13224 6770 -4896 -5115 7771 -1191 -7116 -1849 1108 782 573 -2327 9831 14246 3834 -14315
13210 -14315 -22881 -1614 2071 -5435 -13075 -16663 -18718 -18420 -16764 -8061 -8697 -5339 6841 551
13196 551 -15479 -28442 -39467 -33751 -33174 -33482 -30317 -30817 -21473 -17441 -24201 -30604 -13076 7125
13182 7125 9872 -859 -8814 -7153 -1610 -8117 -1942 545 3251 -1904 -5581 -4371 163 15928
13168 15928 14750 18981 28723 45531 43690 53528 54275 33666 12769 -1084 -13236 -15167 -29740
13155 -29740 -21822 -21036 -4170 1911 1218 12207 25709 21203 15494 9765 5499 -6166 -6737 -4691
13141 -4691 -4203 -7702 -6823 -14512 -16247 -4381 -112 -18450 -12651 -3926 -11869 -20793 -19956 -6340 -261
13126 -261 18067 24956 5437 -12331 -13797 2654 13958 11037 9461 13089 8515 19498 5147
13113 5147 -9498 -18834 -26822 -17182 -14216 -14672 -10216 1680 205 2827 10443 18201 15149 18881
13099 18881 11586 188 -1959 -198 5811 7084 12571 12458 2564 -2685 4290 6312 -585 -8988
13085 -8988 -31987 -32484 -35911 -36897 -31863 -20781 -9413 -8596 -9736 79 -11058 -19658 -16002 -6809
13071 -6809 2379 13791 12111 4232 -11476 -12744 4172 6178 6503 10731 666 -7674 -14664 -14707
13057 -14707 -6639 6528 6886 9279 7782 -5228 -20087 -17296 -1362 14659 20175 8653 -2767
13044 -2767 -2204 -9879 -14501 -14062 -13096 -15298 -20668 -31205 -34149 -37220 -31466 -23255 -20724 -9272 -1805
13029 -1805 3710 -6270 -10277 -8327 -7298 6186 7972 6181 8765 -13003 -20054 -24793 -33187 -30976
13015 -30976 -25538 -22133 -17611 -7735 -1332 -1695 -9127 -16331 -17537 -8857 -4431 -8660 -12111 -6353 -2742
13000 -2742 12476 14522 -1038 -13523 -19406 -8007 4761 11975 9008 -10286 -25846 -30847 -22507
12987 -22507 -14943 -10003 -20089 -30824 -29306 -33513 -15092 -1007 -7032 -25751 -25950 -3114 -13079
12974 -13079 -25564 -17523 -8826 -9712 -13284 -6063 -12009 -20600 -22347 -26682 -43782 -50272 -39259 -16632
12960 -16632 7429 20663 13562 10925 10809 -13120 -33136 -31934 -23683 -18704 -23813 -13579 -13874 -17104
12946 -17104 -13471 -22412 -24179 -28012 -17071 -15239 -15257 -10849 -16657 -18490 -10872 -22113 -15343 -6667
12932 -6667 -7996 -1140 -2327 -2013 -5389 -36594 -42808 -28277 -39418 -48789 -38223 -39447 -44981 -40642
12918 -40642 -25345 -16252 -20126 -18189 -16613 -12861 1200 -10264 -21890 -15422 -9486 -9018 -9330 -11631
12904 -11631 -19646 -32368 -29399 -24967 -17434 -2139 9517 13424 25586 18172 16522 17044 27724
12891 27724 7024 -7362 -3289 -4678 -7384 -19059 -35395 -29379 -13214 -11401 -17680 -13925 4193
12878 4193 -1765 4172 13801 7922 -496 -11066 -20846 -21056 -24046 -16035 -21278 -26000 -27921 -28177 -16263
12863 -16263 -2631 6768 6480 -6885 -13274 -26153 -26238 -16559 -13905 -3040 -7493 -4049 -3620 -10075
12849 -10075 -11096 -13150 -32065 -20746 -17473 -22986 -14683 -14184 -24719 -15485 -18472 -30305 -22620 -29909
12835 -29909 -35410 -29668 -28446 -11405 -8923 -19349 -22867 -10639 2365 -4198 -5002 -7528 -10511 -5834
12821 -5834 -11761 -12369 5414 3224 440 2752 -6318 -10695 -8788 -12958 -17517 -26505 -18757 -10720 -8427
12806 -8427 -4417 -20985 -27116 -20272 -3540 4517 -1071 -3592 -2408 -6371 -10091 -15855 -22085 -25433
12792 -25433 -17337 -18583 -17822 -5001 -5958 -1230 5126 -11430 -12411 -3840 11192 13956 9326 -2102
12778 -2102 -4821 -13458 -22741 -21440 -23588 -12883 -8736 -51 15865 29499 29891 30370 55316 87936
12764 87936 117433 122461 112776 96543 62143 33784 34401 35156 26348 19286 13303 15826 14378 9469
12750 9469 19071 23112 19833 34752 59020 78550 104536 119940 120966 110781 86763 69003 58413
12737 58413 47536 41407 37634 40527 38573 32852 30088 38176 44481 61675 92440 134002 197184
12724 197184 304279 421281 452979 394658 298684 228761 192946 182331 182299 194426 203811 206531
12712 206531 194961 183053 167358 162156 157824 177733 210437 286545 407306 492311 467061 392139
12700 392139 304522 232202 187654 175513 169024 180732 208034 214764 199349 181337 159860 158973
12688 158973 162894 176403 208769 259349 344253 437367 486926 454320 391204 318968 268160 276883
12676 276883 312877 377833 489158 561506 517931 419466 316079 244777 218074 216660 245637
12665 245637 309424 417719 522997 532891 466455 375983 299190 277911 286348 341029 425726
12654 425726 518489 547945 472841 371193 277069 211575 172013 151029 152652 150491 155843 182631
12642 182631 214673 210425 184712 158393 159462 188581 227590 301217 400808 500222 493528 393022
12630 393022 281732 207682 175519 167348 162313 182286 214315 248492 258226 250399 223411 200915
12618 200915 196581 231093 280278 362125 477848 532890 482452 376358 263109 182342 137628
12607 137628 112627 101734 87970 90423 74904 70992 50088 29753 36964 51077 55692 73956
12595 73956 87459 125260 162079 171020 148422 121364 85422 67096 78285 99196 92155 87227
12583 87227 97953 86147 83094 89446 80919 70558 72606 79034 104497 163517 188889 174844 140986
12570 140986 103749 90793 89306 83754 88050 108177 119929 115053 89809 84439 67706 51604
12558 51604 37218 36566 31051 45064 49613 48428 36407 44381 53245 81873 114832 154635 201292
12545 201292 241130 259545 284391 304810 303877 306996 308237 302315 267942 212265 148468 114995
12533 114995 117280 96571 82344 84240 83223 100676 123951 146678 174666 199680 207974 175929
12521 175929 134341 99686 79436 76094 80595 114861 140909 146293 167188 194671 224441 250669
12509 250669 262810 296310 325604 359469 380798 391732 394622 384754 375651 383072 408324 473490
12497 473490 533737 556283 551868 528591 495486 471358 441574 378024 326190 278834 253883 251965
12485 251965 258343 269226 278707 281603 298019 326702 313501 257879 217726 168501 138390 120435
12473 120435 125671 147497 155433 179798 197164 233084 283610 342737 391017 414485 435178 445189
12461 445189 448825 454489 457439 446834 416536 390011 372089 354324 322365 300061 298418 295206
12449 295206 305428 337030 379712 430525 487149 549096 600588 612712 603724 585681 522906 456039
12437 456039 375332 302561 239579 205319 179746 141173 117427 111319 93296 80608 70173 55769
12425 55769 54566 60063 61553 63585 71853 83648 82204 76355 104313 128297 153823 171642 204208
12412 204208 247297 279421 311214 339673 354900 354367 355059 344698 327054 286142 249695 212219
12400 212219 175226 135501 102413 90463 76925 56751 62445 59151 34399 23909 18229 26452
12388 26452 35774 23374 18306 15266 14836 17208 20764 23657 18541 14597 -4858 -18543 -13971 -9111
12374 -9111 -3796 3803 20587 13493 18525 30196 22530 -9952 -15843 -10179 -2673 -5258 -16827 -6871
12360 -6871 687 5288 11724 6333 6112 -22 -17805 -19509 -29752 -40641 -25388 -17762 -17310 -23394
12346 -23394 -24585 -19014 -15039 -17627 -19276 -6948 -1411 677 -7432 -9340 -3790 440 -10937 -16483
12332 -16483 -7422 13494 19453 10586 19492 36934 33973 32563 37944 47046 51754 64217 72376 75625
12318 75625 77621 79287 72410 71859 73233 88282 93972 84376 90181 95919 95719 104550 96358 92110 94149
12303 94149 105643 105485 107133 103471 103791 104968 96649 94298 93353 83399 83449 69036 56650 66902 79821
12288 79821 103108 134638 156676 146923 136929 125932 126983 129493 140291 145340 154382 190348 234914
12275 234914 262362 285848 288408 278715 282741 278827 257626 220416 191663 184445 171019 182126
12263 182126 193465 209464 220165 235264 279505 376514 556299 836252 1115050 1144355 944830
12252 944830 670232 435251 310754 238555 196559 177874 167541 164764 162563 146610 152660
12241 152660 172342 195096 247970 360870 563557 844093 1035978 953044 705948 443839
12231 443839 266850 178663 129499 94015 59257 44448 41012 39472 19697 -6643 -19615 -30253
12219 -30253 -50222 -47581 -56502 -69231 -59581 -33073 2856 38988 86406 109493 122269 143491
12207 143491 155434 151404 135407 122126 126565 130658 133842 136424 136408 139621 146356 182683 218051
12194 218051 242810 276032 317071 367778 434561 525007 658416 905515 1312706 1765518 1907588
12183 1907588 1649101 1271453 934022 706582 589318 547388 530973 545636 563280 573186
12173 573186 591564 615397 630506 649254 714984 862508 1125513 1516820 1851586 1831447 1551606
12162 1551606 1193575 936031 798838 743176 725436 696605 675536 664833 682531 702573 738958
12151 738958 773706 819080 872515 917779 978144 1030445 1069264 1085582 1123168 1190651 1245081
12140 1245081 1289451 1304408 1305948 1319766 1362623 1436218 1535380 1617469 1722677 1849139 2005151
12129 2005151 2206764 2460867 2844715 3379946 3867433 4039295 3827561 3398000 2944436
12120 2944436 2621713 2455051 2410402 2467436 2568368 2671289 2728272 2712857 2616261 2471126
12110 2471126 2313294 2198023 2134904 2114476 2146363 2222141 2341640 2489141 2660347 2805016
12100 2805016 2860290 2826216 2715386 2590953 2520093 2482259 2486785 2551426 2668968 2869514 3198285
12089 3198285 3668056 4356855 5365874 6848028 8715835 10224167 10472252 9475202 7918356
12080 7918356 6440413 5339246 4618467 4180355 3937855 3817580 3800090 3836927 3891225 3927686
12070 3927686 3954721 3996749 4087512 4246521 4499241 4837608 5267560 5787926 6358530 6978072
12060 6978072 7636588 8290116 8964596 9786113 10957591 12752316 15602673 20237805 27408084
12051 27408084 35910161 40479472 38459465 32984178 27442662 23805972 22267530 22340395
12043 22340395 23525088 25501247 28252281 32105801 37793585 46391214 59422465 78324826
12035 78324826 102303960 125908581 139040706 134564634 120195268 106979959 101828586
12028 101828586 107588065 125142521 155425280 197311826 243764170 283955458 310426074
12021 310426074 321202207 318288931 304370790 281129156 250654900 216452897 182945654
12014 182945654 154234950 132860510 119194962 111577194 107327400 104069162 100470310
12007 100470310 96031423 90336405 83041928 74212399 64503157 54946324 46417825 39412106
11999 39412106 34082503 30401509 28201879 27277674 27407795 28228711 29189564 29800212 29843418
11990 29843418 29271591 27979155 25838872 22975252 19791518 16763745 14200194 12190016
11982 12190016 10703844 9606707 8821073 8237937 7734696 7283223 6885322 6563273 6349258
11973 6349258 6190640 6053896 5906234 5742356 5624119 5538731 5532923 5640125 5852401 6181581
11963 6181581 6623307 7167169 7776272 8350865 8809390 9104638 9235945 9186886 8899549 8336758
11953 8336758 7549475 6680576 5849694 5126430 4550464 4109077 3763719 3516157 3314437
11944 3314437 3171492 3071262 3012538 2973955 2944384 2933039 2953640 2953872 2936733 2922182 2922341 2933663
11932 2933663 2974278 3064783 3259183 3571771 3940882 4254796 4415335 4425608 4432113 4608860
11922 4608860 4937004 5100778 5011544 4851673 4729630 4673023 4593952 4392813 4034345 3601603
11912 3601603 3167843 2791471 2483056 2236447 2026889 1859861 1731003 1616707 1540203 1489717
11902 1489717 1443537 1404773 1347706 1294974 1245095 1205808 1178709 1152805 1121383 1109652 1112393
11891 1112393 1095461 1076412 1081609 1095913 1101126 1095217 1071083 1054633 1053700 1061104 1078085 1094870
11879 1094870 1109615 1152050 1208056 1287145 1407076 1657433 2033898 2325659 2296679 2014828
11869 2014828 1673182 1405424 1237544 1160293 1128962 1126509 1137138 1145300 1157608 1181594 1186546
11858 1186546 1181423 1191860 1211393 1250173 1358575 1587854 1879384 2034544 1914768 1655070
11848 1655070 1393602 1188920 1088114 1035820 1017492 1008144 1016263 1017803 1020108 1018924 1021203 1013724
11836 1013724 983010 961250 944693 941267 965821 1008049 1071306 1138500 1223930 1311013 1395868
11825 1395868 1478982 1538657 1599091 1652053 1691791 1714872 1715421 1687865 1658417 1614400 1551305 1484060
11813 1484060 1411491 1347127 1279204 1220214 1195870 1202887 1245101 1306072 1394558 1559147 1831389
11802 1831389 2110829 2186070 2058708 1851507 1691735 1623143 1588715 1592091 1634062 1705036 1804146
11791 1804146 1949272 2116199 2237504 2315078 2320879 2275672 2225849 2187987 2179605 2157272 2157031
11780 2157031 2180392 2160686 2063442 1928207 1780970 1647530 1549027 1471246 1398291 1340284 1298050
11769 1298050 1265714 1234197 1217469 1212499 1238314 1259558 1270333 1311693 1365478 1410761 1474604
11758 1474604 1533589 1593626 1676966 1805408 1980703 2212890 2490533 2828582 3195431 3515413
11748 3515413 3641761 3550374 3321179 3081090 2911820 2851812 2864279 2894826 2912475 2947488
11738 2947488 2999250 3103776 3226776 3358145 3501961 3667787 3860904 4079226 4362292 4713034
11728 4713034 5125214 5640230 6249379 7002871 7910138 8994820 10334718 12009829 14234327
11719 14234327 17381141 22168716 29590938 40649074 54345311 65943807 72112521 72289048
11711 72289048 65308297 53641752 41356510 31046198 23596708 18544847 15175661 12901951
11703 12901951 11338297 10243308 9442048 8837756 8389744 8066154 7859070 7758166 7756720
11694 7756720 7869977 8113063 8476236 8997921 9709193 10595965 11710294 13064405 14717495
11685 14717495 16782601 19367038 22672401 27044150 33124208 41478462 52100831 66103764
11677 66103764 86249024 112569960 138173361 152481350 150697242 137444118 115383149
11670 115383149 89498460 66821046 50278872 40184437 33957122 28659337 23782018
11663 23782018 19624229 16422567 14081339 12336396 10990569 9932681 9121982 8523244
11655 8523244 8110610 7822539 7665191 7644650 7767009 8054482 8518621 9128730 9911170 10918399
11645 10918399 12150950 13674405 15597559 18106657 21596713 26733444 34582524 46551377
11637 46551377 63147642 80757971 92595132 95085828 86818121 70949900 53722894
11630 53722894 39147440 28583680 21462332 16734367 13505409 11215560 9508061 8152466
11622 8152466 7064285 6165565 5414296 4782943 4249712 3818326 3468230 3151483 2870810
11613 2870810 2629808 2434787 2257208 2098709 1968343 1863540 1794926 1721376 1652634 1597821
11603 1597821 1560341 1520688 1478625 1442753 1419705 1427554 1425611 1424047 1460135 1525804 1609264 1631208
11591 1631208 1619084 1564816 1501118 1449174 1409159 1382040 1343592 1313501 1304028 1300061 1302443 1329724
11579 1329724 1340572 1325978 1330437 1353871 1331271 1253477 1157386 1052201 962902 891570 834178
11568 834178 798866 784703 756598 730790 701461 687832 684423 670818 659249 652834 660552 667026
11556 667026 689206 701561 710428 710212 715664 712048 700022 699941 692908 681250 680895 693264 717720 742578
11542 742578 769830 794750 815506 845137 897658 935833 987955 1041633 1050692 1030951 981624 925296
11530 925296 870802 822984 782795 731999 657991 596000 558467 524912 514850 502309 489566
11519 489566 494122 517015 533176 539218 528309 529842 552418 566488 592399 632856 697827 752565
11507 752565 787953 803875 804642 815864 815786 812090 791465 756175 707590 654276 631985 603415 574782
11494 574782 571068 569929 588634 593037 590792 582696 558669 537523 535971 533322 536793 543213 546948
11481 546948 544798 540766 542219 546384 557872 576248 598874 620458 677669 772641 831648 864301
11469 864301 860760 823135 778120 749364 716391 671871 648704 640345 646159 640202 614894 557994
11457 557994 513310 468306 443840 409860 379720 350903 325042 310684 289304 275783 287789
11446 287789 302691 327716 333150 363781 387489 395944 405244 417597 429743 431262 439910 448410 456240
11433 456240 479946 491095 487500 468427 444018 421169 413966 426835 438455 443859 456748 428270
11421 428270 388171 359589 335382 312986 305344 284875 282369 294635 289018 271571 251989 254755
11409 254755 248154 233459 226522 248913 277860 293947 294111 284519 272024 266948 238107 224787 233334
11396 233334 243447 256379 268045 281142 292114 306018 304661 295802 288140 272118 274466 264515
11384 264515 243483 247715 251887 250079 244371 234203 222729 207416 199203 206421 216578 222209 220148
11371 220148 215310 211190 207810 211645 228853 241325 244090 252798 263655 251641 230197 225340 212779
11358 212779 215862 219069 230916 245111 245896 261052 275434 283841 281101 273599 270620 269894 266495 261917
11344 261917 262533 276537 283167 284537 278122 279748 281753 290275 297758 304305 299110 278587 261894 251069
11330 251069 240774 238198 229247 236915 237606 234901 235446 249395 244591 244138 246766 253031 254721 254292 246092
11315 246092 255205 263551 262281 263846 272455 257301 261167 288370 298230 290971 296290 293392 292734 286590
11301 286590 303542 320692 322749 338356 350638 352874 351439 347029 338256 325507 311945 311738 333384
11288 333384 358295 378775 391511 395925 379048 345573 322293 312819 309596 313222 333366 364107
11276 364107 383740 370529 346777 351109 354178 343065 350990 353330 342449 333512 322519 320621 316351
11263 316351 310969 307647 312467 323467 336677 352419 364120 375994 380638 387161 414154 443799
11251 443799 489600 534405 543407 542341 540867 540335 557644 592899 615184 633591 652743 707840
11239 707840 768515 787732 757115 703767 642189 601666 589799 577021 556284 541468 525479
11228 525479 498871 481024 480296 467237 442586 433268 422255 405977 411518 426579 445216 456315
11216 456315 469648 493472 509643 529707 558979 619930 683406 754258 825615 884008 899346
11205 899346 879504 846671 867493 906652 934576 950090 934384 893825 853724 814009 765876
11194 765876 719659 690896 662398 636574 615788 613965 607588 595848 595469 596870 606810 611820 611207
11181 611207 616095 631338 636698 637775 622237 611112 600994 602929 634117 654076 678048 685391
11169 685391 700311 703500 683772 659558 664812 676618 681095 687091 682471 698158 716463 726029 739075
11156 739075 738184 742069 740679 738625 739557 747330 747866 748124 740870 744434 740111 708901 676252 656174
11142 656174 656535 677672 705803 705347 694381 698229 725701 756344 787935 837953 889196 920699
11130 920699 945591 948864 963739 977848 1012851 1069141 1132115 1171787 1196714 1227537 1265635 1297518
11118 1297518 1324867 1377178 1439784 1510604 1602390 1697733 1798977 1903488 2022226 2131343
11108 2131343 2279350 2432512 2575386 2749875 2958383 3224046 3545041 3923955 4368235
11099 4368235 4911099 5572097 6372777 7338982 8490819 9920411 11706904 13979322 16957442
11090 16957442 21112721 27216154 36513025 50502768 68891162 86635678 97565308
11083 97565308 98053075 86319874 68122695 50239505 36230370 26696814 20522066 16487546
11075 16487546 13761762 11826479 10404551 9339209 8560870 7996060 7615516 7366909 7209287
11066 7209287 7182647 7282788 7491560 7836485 8326867 8970934 9800180 10892624 12306065
11057 12306065 14139126 16581349 19913351 24428345 29699826 34560519 39987398 48567505
11049 48567505 63490141 86673869 113272934 137454341 156505867 160796992 146842842
11042 146842842 120278035 92037465 69160311 52314775 39759369 30524752 23855899
11035 23855899 19175604 15843209 13393894 11553432 10190684 9165434 8378756 7761098
11027 7761098 7290126 6932955 6682561 6532139 6461597 6499350 6680825 6961208 7362228 7903865
11017 7903865 8625289 9554350 10712056 12212342 14257178 17144734 21405932 27871847
11009 27871847 37605945 50717868 63880394 72480057 75118455 69714711 57349381 43234001
11001 43234001 31041487 22249730 16464989 12691639 10170718 8403027 7080909 6057216
10993 6057216 5274872 4670700 4165065 3733376 3370641 3058745 2820183 2633829 2481667
10984 2481667 2349248 2196834 2056478 1937948 1844014 1764977 1701873 1653075 1589058 1524950
10974 1524950 1470852 1439844 1423497 1434050 1444142 1455171 1463409 1422643 1350787 1298742 1264649
10963 1264649 1224968 1182817 1114104 1059685 1015095 973456 955076 970354 991487 982874 979007 976532
10951 976532 976781 960892 966904 982191 1013681 1042162 1056300 1043393 1025626 998201 975216 952972
10939 952972 926740 911852 873488 845786 848141 850085 881102 915912 943825 973154 1001998 997949
10927 997949 988746 971126 965881 977522 976365 935165 861481 804671 759095 735918 737603 755225
10915 755225 774868 778656 775657 754395 762055 775394 789286 822251 863606 906547 947163 973882
10903 973882 931836 868253 794172 725527 678257 653552 649572 648093 647071 665882 675667 661128
10891 661128 645973 628088 615413 609599 599723 592379 575912 559568 553233 547088 542313 532186 501115
10878 501115 482312 491289 491458 478626 460176 442898 437135 436977 447431 444763 456507 464188 454023
10865 454023 428833 407195 382025 360154 336450 322717 328149 329861 332326 347734 382536 424900
10853 424900 462301 499301 527112 564777 619645 683657 727189 721208 659742 574626 507188 474126
10841 474126 442687 411664 373099 361933 364942 378778 391734 399457 426710 465019 497842 541799
10829 541799 582006 612159 609107 568032 499887 406662 339401 303612 278756 245817 231634 230549
10817 230549 241956 245970 248597 260582 269847 271536 263380 271912 289361 294042 291584 287647 283650
10804 283650 250208 226251 226964 222272 231205 236823 229553 235266 236121 230030 225945 230926 238150 254662
10790 254662 262887 261382 257055 255468 253784 242702 222023 208767 209091 219012 228268 231978 231964 250728
10776 250728 273502 297580 320284 330929 353029 375669 378309 391362 400573 408536 431392 444163
10764 444163 439531 425628 423497 424248 419765 425094 458839 498019 535737 599261 706522 845758
10752 845758 1020999 1180444 1269161 1256640 1151868 991942 838850 716474 620893 550797
10742 550797 493307 450669 417006 394109 386048 397305 427690 453466 461407 481363 509207 563730
10730 563730 610182 662933 707961 734072 717596 707666 670151 635175 618195 609724 626828 657714
10718 657714 707577 796073 916016 1099055 1351917 1683845 2045943 2309186 2337750 2148919
10708 2148919 1851813 1532099 1243450 1014277 848604 711479 612740 552789 504639 484265
10698 484265 472327 442937 422583 415557 415561 417807 419632 431720 441390 460867 473604 470984 466050
10685 466050 459110 448294 446304 429419 429893 442888 459810 501975 558392 626421 707620 804544
10673 804544 922301 1040184 1137834 1120446 1021538 897183 765225 645862 542041 470942
10663 470942 421754 388975 371446 379912 403758 421818 465866 532936 602281 678565 699821 646572
10651 646572 554187 456035 389721 334499 295868 276963 263151 241761 225912 217634 203110 183059
10639 183059 183307 181536 178082 181525 187991 191271 188821 200491 203981 209327 210040 214728 223490 236070
10625 236070 256602 273477 294207 318373 338955 383186 436970 513077 636139 783829 935986
10614 935986 1035133 1002082 873000 704343 565861 472315 412213 368999 321921 276877 249618
10603 249618 235588 210892 194032 188040 189217 190000 187114 187332 190325 209097 217378 216772 217720 212553
10589 212553 212034 210562 210014 210798 216146 230866 222308 216423 229929 253365 312605 389256 469171
10576 469171 540460 562989 538505 484163 404854 343507 319301 312080 304416 287282 286691 272216
10564 272216 262740 227944 186084 161015 158657 169852 170415 156327 152781 130597 123885 149692 165277
10551 165277 151068 141909 137775 133713 135027 141762 140642 137368 136263 134212 124112 118386 128156 129515
10537 129515 135685 144224 148507 146676 144559 138619 124005 129568 132613 125407 115021 118661 117253 123500
10523 123500 133156 136306 143832 136646 140259 139942 142226 141083 130818 129202 126734 135849 142292 158266
10509 158266 176041 192556 198490 190492 191233 193551 177139 162258 146745 128236 135145 134360 145595
10496 145595 152054 159255 163481 166330 168330 184134 209906 246754 263886 292310 345736 404550
10484 404550 434664 422767 380169 323645 255250 217271 198407 168092 166206 168364 144663 143095
10472 143095 145288 133630 116843 121312 132822 141147 132894 140484 133751 122217 119295 137459 142708
10459 142708 140999 138458 132659 126525 137583 140110 136592 129972 127157 128028 118521 121173 140784 154692
10445 154692 176005 187882 194504 210978 267454 321219 322621 292780 258828 226718 210969 204152
10433 204152 199654 196408 202083 222156 252965 294284 336253 379866 401378 374869 335277 291757
10421 291757 252681 207742 189321 185110 183560 189773 199562 191839 198262 210895 221824 244669 292599
10408 292599 330676 337850 317066 269197 230649 203806 182417 164099 162917 157618 149288 149929 144519
10395 144519 147919 139607 140168 123735 109784 119790 118442 106528 90109 80119 96291 99662 91236
10382 91236 91564 119925 131523 136516 132997 148805 157519 156352 150958 151647 131182 132852 136927 129671
10368 129671 131187 146622 146873 141379 135850 135636 146615 162483 172288 172176 165115 169989 181980 185503
10354 185503 189314 200939 227174 258866 279465 311698 328405 312143 269075 230477 201099 189571
10342 189571 186602 175281 167774 161580 143753 158510 168401 165205 151068 159246 157946 168909 168971
10329 168971 150868 140864 142362 126544 120413 138195 137770 131416 119222 116346 106932 104576 92676
10316 92676 93030 100925 87987 96039 97974 94240 88843 95701 97590 100507 105231 121289 114735 97535
10302 97535 76300 62678 66375 90687 106566 105497 93871 89697 91249 92044 95747 105515 116686
10289 116686 129850 147268 152104 143599 126237 119909 122207 126411 131255 131877 122390 105807 105643 107056
10275 107056 102576 120094 120163 112954 114180 111553 122416 127340 117771 109302 113033 94231 88732 90933
10261 90933 90840 104799 111925 105587 109787 119909 116436 110776 98226 97513 97712 94221 93049 94152 95784
10246 95784 93822 97260 106378 104007 92552 85070 87832 101977 106905 97713 103258 104740 97313 88148
10232 88148 83065 83084 97131 105826 96724 96235 93876 85395 85387 84013 82344 83328 90589 96319 87471 83333
10216 83333 88920 92284 89352 67338 68233 75908 83372 88753 81964 92122 80539 81772 89666 98317
10202 98317 101053 97223 107039 104808 89736 80597 81957 75825 74205 82268 88983 87512 86289 91114
10188 91114 90508 69503 63684 81293 90242 100331 95900 82033 74013 75160 78496 75790 73460 74190
10174 74190 69421 71200 67137 71158 78196 78162 81863 84829 86791 86509 93717 100778 97386 103860 106507
10159 106507 114078 105757 94373 107463 110261 97199 94510 107480 104133 102451 95363 95953 98369
10146 98369 91897 69885 64351 81890 90457 91350 74256 78192 97476 98392 94721 93739 95194 99435
10132 99435 96190 89538 89138 99127 99271 92416 90308 88055 91552 87234 94426 97724 83764 90038 100846
10117 100846 97439 92595 81874 87536 85655 90679 86439 67567 58584 72111 86961 92854 88932
10104 88932 90034 98495 91814 91998 87834 90456 100814 105373 108852 92737 95414 108077 100726 99115
10090 99115 92423 95169 87445 79993 78848 80914 80359 78120 94306 102909 98853 101493 115249 101849
10076 101849 84381 82640 85242 87418 94799 100572 112089 126525 123015 118010 99718 92059 87833
10063 87833 83807 77779 79240 96130 102697 97413 83697 80425 69658 60872 63475 74425 87752
10050 87752 88850 96203 109449 108717 99739 85815 70333 73205 83932 89289 95496 84686 71312
10037 71312 80572 103451 102440 93000 107499 107433 102189 82052 72015 65548 72864 71940 68530 76247
10023 76247 82611 84448 96575 109347 104942 101747 100185 92175 93323 93436 89934 96651 103585 99743
10009 99743 100784 109484 104089 101584 90808 93208 104818 114318 106148 100793 93153 92377 88432 77511
9995 77511 73523 68968 82091 91177 111475 140203 168296 156926 128294 92745 83481 92598 91438
9982 91438 78513 62628 67886 75371 88878 98024 98411 106427 102007 84124 79606 87188 89777 86132
9968 86132 94672 96750 107160 95608 95056 94980 93477 84053 78930 76217 80771 84085 103132 104732 103657
9953 103657 113335 132484 135946 124757 112650 115438 114133 108981 89624 80389 101329 107066 91547
9940 91547 96421 107935 117454 108752 95705 90096 102549 99734 66956 60002 75561 93021 97557
9927 97557 91778 83105 80160 84542 84036 82059 73205 66126 79175 90857 95287 97944 89067 83422
9913 83422 78053 79860 95502 95264 83845 88015 81404 90514 94583 97329 110497 112951 106436 94227
9899 94227 90954 88345 88977 93772 90427 91685 117600 121961 97472 79156 76026 79517 76871 82453
9885 82453 89788 95429 102338 92128 87037 85028 86403 82959 93321 104956 97137 104237 99774 97819
9871 97819 100141 90820 79474 79083 77331 87718 91045 94085 87481 92686 90265 97647 95829 101107
9857 101107 96681 94329 97831 111259 114280 116326 117608 104795 94595 101700 101414 99200 94215 83894
9843 83894 91358 103426 100088 102489 103023 99134 85979 90282 103233 94402 90517 99862 91515 85342
9829 85342 80074 83553 87265 96000 107144 103302 87471 84032 79886 72503 77375 84217 88718 85348
9815 85348 90007 104880 101799 86180 86844 83008 88389 100223 120993 111922 83009 60646 72174
9802 72174 77280 79268 88557 80997 82825 84588 94245 114730 123215 120776 104288 94577 101153 93941
9788 93941 88616 88746 97272 100404 102023 101507 96505 93891 103994 105118 97040 85338 76847 79975 91305
9773 91305 92103 89002 81246 88926 90585 76762 70611 73811 82021 94656 95505 88356 85481 82909 86097
9758 86097 82734 89139 95845 100792 97776 89447 97723 104822 111157 115968 113210 105895 102239 93405 95740
9743 95740 106464 116486 111412 110702 106474 99484 96282 89201 90561 101328 118760 117306 107378 114103
9729 114103 114336 107941 100700 106652 125671 125589 114175 90583 84270 87471 93448 91125 98052 114247
9715 114247 124634 136097 115158 95224 103547 106665 102779 112817 108940 117037 115354 105680 101432
9702 101432 109754 117600 115913 115824 110411 104981 102376 109372 119352 127420 126711 124446 119839 133872 128334
9687 128334 120447 115228 111545 117877 119999 118027 104220 98396 89602 85296 90288 99856 105957 104527
9673 104527 104920 106227 106061 102726 99174 104013 107447 109300 126838 137505 137425 134228 130994 137899 141553
9658 141553 131618 117187 126328 135143 135551 138927 133368 134807 122547 120075 119333 121396 113401 113954 108275
9643 108275 117064 137606 131308 132960 132175 124067 124651 126846 119889 119606 121604 114345 109389 109730 108015
9628 108015 110519 108839 107219 113816 108301 103162 109722 123868 141132 135536 117900 116050 103485
9615 103485 99892 116307 125014 128433 124742 124730 113763 110647 109474 109817 115123 108536 107771 112964 118352
9600 118352 121004 115861 105654 101743 111462 117390 120868 127981 138818 140245 145291 149942 152881 154659
9586 154659 154370 131408 132849 131720 124605 123869 120890 112999 106196 107561 116967 129295 136303 132094
9572 132094 121496 123538 123593 127476 143552 144239 136674 112153 103910 110867 122707 144496 143756 129535
9558 129535 126567 117271 102072 104115 115578 130094 131191 116226 116452 120175 121090 115551 131816 139114
9544 139114 129628 123592 118378 111105 113095 116385 117357 125180 109614 99131 123984 142196 131434
9531 131434 116546 117376 116995 123024 135566 139426 121791 104362 97677 106058 128166 153757 161792
9518 161792 147835 150852 145403 140231 107097 105832 118306 126882 132280 132486 128608 135117 134788 123619
9504 123619 125574 127835 119452 119873 126912 121779 109716 104048 104654 108092 124652 137691 138987 137891
9490 137891 143173 145115 138005 126480 128144 131059 126121 131680 132280 127423 129929 140479 146124 142186
9476 142186 132477 141550 154377 138424 131945 130926 129269 127416 129297 136114 139978 140072 135124 136657
9462 136657 146739 154364 145988 140461 147228 147471 142507 140526 144045 142677 146866 141056 124228 121353
9448 121353 115970 115897 123173 122243 129366 126975 119153 117753 124706 132360 127445 118772 105045 105219 113742
9433 113742 124674 127318 132545 126478 124130 131744 127695 124949 134996 155653 158784 158108 160122 153037
9419 153037 145268 143583 140162 146596 143297 144969 152308 170272 168759 171804 168186 163754 166417 172273
9405 172273 162730 163347 160965 159899 163487 161026 157067 149920 146102 144007 146431 150670 150916 147201 153843
9390 153843 157168 148010 141859 146104 150140 154355 154301 156941 155861 169055 174740 176155 175110 167393 161347
9375 161347 155174 154024 162413 159238 152757 145450 143208 145819 142822 138893 139715 154163 145388 146932
9361 146932 152142 137389 145833 160567 152418 144621 135278 133711 140859 151629 160974 167345 155622
9348 155622 146530 147647 148959 153224 161593 165750 163242 159322 135839 135667 146943 150806 146382 151141
9334 151141 158666 156202 162932 164888 178982 184729 182720 177271 163024 178329 181695 178459 186790 175421
9320 175421 166923 168192 180932 184533 187234 192262 205899 214048 205281 196215 185908 187603 187457 190343
9306 190343 182884 164716 161291 172787 185644 189236 192897 191555 182194 191247 185549 170994 175989
9293 175989 182273 192383 191994 191150 207817 219180 207092 204343 210900 213247 214951 213862 222419 215540
9279 215540 215527 217412 221429 213614 204449 204169 210377 213300 215802 205803 210786 225427 234744 231626 230182
9264 230182 227263 233759 230497 225282 221535 216375 230228 235545 243975 245365 228741 216021 222705 237106
9250 237106 228089 210700 205859 215483 223368 213706 206655 206746 219545 225675 234200 255575 254539 251591
9236 251591 252223 245929 248376 248213 249527 257927 263257 243553 240064 233967 244521 240129 245392 244842 239921
9221 239921 249236 246108 246457 244161 239227 246141 242978 233945 242683 242698 248764 245943 241894 241190 238360
9206 238360 244777 245178 255737 261497 266239 266225 279652 273197 266971 275553 287983 290354 290576 313275
9192 313275 332875 334136 336327 343951 332439 329048 332993 347184 361653 358591 363002 361557 349711
9179 349711 353485 349490 333679 330531 328613 344361 358080 352043 352574 359506 363219 358950 354428 349307
9165 349307 356602 360721 357231 358192 380577 396368 397181 389659 389290 404998 420989 409737 411367 424984
9151 424984 428676 425276 423600 433354 448570 465317 468658 485224 498964 502370 502250 508103 503954 476973
9137 476973 469210 476684 462101 461611 458171 425550 424895 434977 431383 433207 426490 424345 402756 389766
9123 389766 395456 405406 404708 393598 397583 408190 410425 418526 433061 438853 431808 414267 401967
9110 401967 405376 409285 414373 421894 415244 427374 428422 418012 424949 433319 425516 415661 428708 439819
9096 439819 444211 445475 463903 463366 453776 441993 439878 433140 436710 453305 463729 459242 471980
9083 471980 487993 505015 519052 523222 524528 540841 566002 586217 588089 581740 594130 596345 599740
9070 599740 608958 607043 609851 599771 589737 593301 608413 607266 622960 645222 650147 659005 666658
9057 666658 673437 676430 688488 693688 705206 703957 707960 738831 747343 748043 762378 765815 771540 769452
9043 769452 778253 788220 800744 813093 811285 818869 824469 829262 840553 866319 868414 872927 886804
9030 886804 892615 893802 890995 926012 950357 958341 971298 991355 1007697 1031287 1054683 1070668
9018 1070668 1087180 1114699 1138819 1156208 1180949 1207689 1222400 1237430 1244932 1247550 1236265 1228326
9006 1228326 1227406 1237389 1241296 1242173 1245796 1256823 1284701 1309749 1323894 1340703 1352971 1362956 1389920
8993 1389920 1418289 1419089 1429551 1451399 1462612 1476481 1504170 1527669 1547835 1582515 1618445 1637248
8981 1637248 1660120 1702936 1740108 1773536 1800264 1828337 1862392 1894026 1920140 1952878 1972947
8970 1972947 2005714 2049125 2100696 2148795 2192333 2246177 2293457 2340515 2393300 2437300 2493892
8959 2493892 2556932 2630166 2701295 2761749 2828292 2906945 2997909 3097054 3197213 3286570 3371005
8948 3371005 3472847 3568557 3673657 3811331 3958424 4112485 4242120 4377148 4511421 4655898
8938 4655898 4823512 5005891 5190960 5390226 5616028 5861089 6135257 6399971 6683134 6995781
8928 6995781 7342907 7693747 8063747 8462775 8884304 9329191 9817605 10347686 10945331 11590390
8918 11590390 12276415 13026816 13846700 14740328 15737197 16829276 18028927 19369454 20876287
8909 20876287 22558877 24443024 26548376 28938461 31662981 34774059 38327255 42365254
8901 42365254 46994637 52327611 58467828 65542043 73674990 83016176 93631231 105446292
8893 105446292 118242317 131472624 144126295 154819115 161966367 164315666 161339607
8886 161339607 153453808 141907235 128287159 114045618 100253286 87573505 76297475
8879 76297475 66485746 58055559 50864200 44754894 39569911 35129474 31318427 28043593
8871 28043593 25220207 22774749 20635054 18761648 17110265 15638808 14339162 13195649
8863 13195649 12158828 11227029 10420869 9690071 9033473 8451802 7928681 7436869 7001245
8854 7001245 6588059 6220923 5890135 5578718 5277967 4995988 4738470 4507582 4307266 4102018
8844 4102018 3915299 3746062 3578151 3417919 3272380 3130448 2995748 2873600 2760530 2657903
8834 2657903 2584456 2499871 2387241 2297656 2215721 2139973 2066998 2007516 1956270 1907547 1858617
8823 1858617 1807465 1740261 1688080 1615268 1552782 1503487 1452563 1395689 1346834 1315807 1277536
8812 1277536 1229377 1201227 1174737 1130398 1085546 1053563 1034810 1016509 988994 967684 949870
8801 949870 935926 916017 910645 899352 871957 849810 835259 815827 797071 771593 754218 724799
8789 724799 695458 683392 661265 660800 650841 631685 624011 620047 611492 620752 621131 640822 649255 676275
8775 676275 688889 704705 725514 749761 749079 706486 648532 591370 536900 473919 434782 412022
8763 412022 389928 384333 390040 382811 382835 391122 379607 381250 372004 344907 323724 307781 292981
8750 292981 279872 265675 248845 236832 241634 247825 253756 250867 239551 225360 224540 219500 204747
8737 204747 214601 220954 213129 215000 223213 216875 206381 206777 200543 188490 168554 162546 168531 189072
8723 189072 190004 195508 197560 207610 250447 273600 278659 266933 247280 237894 225709 219873 217402
8710 217402 203064 188044 184333 182539 156956 143496 148069 151162 140157 139388 147621 161041 181394
8697 181394 185386 188195 193747 197082 195973 188181 181448 192909 184790 161317 154987 162905 165140 173559
8683 173559 185232 164869 162274 170539 182197 179066 171296 174566 178009 183458 179689 176875 178927 192627
8669 192627 186175 190195 213352 224551 218684 202340 195355 191329 190378 171709 155598 159693 157177
8656 157177 151133 158123 183680 180978 179209 177547 168250 143960 134743 133475 147183 158586 168675
8643 168675 169726 167275 165255 168640 165824 164816 168676 151437 150161 151361 165507 184089 174150 165880
8629 165880 170590 179314 190869 208817 211262 207949 206832 227904 236568 233171 225836 235348 257508
8616 257508 291674 316197 327183 336694 343022 353234 374945 405556 432982 461445 484775 520046
8604 520046 539730 575532 621477 676080 730398 790708 859568 936567 1020721 1117939 1232094
8593 1232094 1397260 1606997 1862632 2193672 2640808 3192571 3780911 4278853 4535646 4560992
8583 4560992 4486858 4511297 4791605 5466114 6691316 8674434 11501652 14539717 16018839
8574 16018839 14861442 12029199 8915958 6356706 4587654 3408178 2635645 2111813
8566 2111813 1741590 1487050 1307569 1188397 1100778 1022173 934964 834233 739508 676174
8556 676174 637072 619742 593672 580589 574266 564541 572615 561107 555737 551676 556629 603250 665404
8543 665404 731259 787960 840607 905153 1004027 1126174 1282683 1530734 1891948 2432916 3297107
8532 3297107 4746517 7042233 9430260 9794322 8145742 5873625 3893521 2586904
8524 2586904 1805068 1334506 1045397 863672 735023 647227 604316 589255 576417 562338
8514 562338 561133 551998 543822 546043 539165 534828 538266 531208 544121 581496 637151 693194 752767
8501 752767 806140 873946 965900 1096966 1295305 1578289 1988892 2612009 3627506 5335475
8491 5335475 7789817 9635385 9125119 7131588 4886105 3156473 2088255 1465340 1066090
8482 1066090 799879 622279 507513 450531 393070 366827 346634 326699 296996 270315 241282
8471 241282 205780 179336 167046 156969 135942 126422 146988 168273 201388 266411 383255 445056
8459 445056 381530 269311 183688 140878 111028 89012 79585 82933 92930 100922 109491 113250 142040
8446 142040 176638 176386 147135 112784 109349 98080 62416 50359 51836 58821 78187 97772 101033
8433 101033 91204 88115 88922 85966 84757 92887 119294 142754 149141 182451 271498 386227 396163
8420 396163 324174 247722 186626 151496 141986 144352 143408 145326 138650 139932 159705 187272 210515
8407 210515 249426 265623 261758 247753 220336 206133 208006 236636 274676 323325 389561 475907
8395 475907 548492 584232 552140 504458 460919 430562 400078 370190 367792 372477 387542 411302
8383 411302 447573 479414 538442 626821 771066 992068 1311227 1675972 1916214 1903899 1687757
8372 1687757 1433800 1243313 1139499 1108836 1162981 1275986 1467385 1810336 2378649 3394143
8362 3394143 5139703 7370992 8435153 7466124 5616180 3854919 2662964 1956606 1493989
8353 1493989 1195814 992482 854741 755166 682010 632092 625073 617961 625870 626801 641014 673571
8341 673571 721629 787484 936825 1170432 1484183 1783584 1889377 1746804 1476443 1225813
8331 1225813 1051047 968781 961825 996342 1109836 1281300 1576770 2071712 2919101 4408717
8321 4408717 6553376 8073895 7588987 5827228 3901627 2457646 1585991 1090350 784070
8312 784070 590367 454890 359772 288627 248599 262404 299437 302021 274454 242671 232217
8301 232217 209418 179526 163803 142260 120075 93448 61434 42918 28544 33915 41440 38246
8289 38246 34532 22513 19285 30947 48470 54859 63556 71444 94942 115078 130897 123374 129351
8276 129351 139135 107197 77839 65394 46481 34020 12903 12673 13810 21765 28317 12476 9423
8263 9423 28302 42555 41598 39842 41250 18583 -4373 -17717 -24964 -32038 -33186 -31879 -36539 -29540
8249 -29540 -14553 -13357 -13811 -17897 -22128 -24070 -18483 -998 6483 -5495 -11328 -5923 1630 -16621
8235 -16621 -27238 -19582 -10205 -10344 -18649 -16841 -22912 -19114 -25532 -34379 -33257 -25067 -17117 -15378 -11377
8220 -11377 -18132 -20019 -16774 -15575 -22797 -28762 -29150 -29144 -32722 -34288 -38134 -27934 -16757 -15759 -15408 1724
8204 1724 8599 2731 3725 7672 15021 27618 31074 39311 54909 62224 61728 44446 21435 16061
8190 16061 7258 1016 -11088 -31426 -50805 -54371 -43002 -24184 -22315 -18578 -1417 8595 5958
8177 5958 3190 11587 18681 22115 21410 20595 27140 38596 40418 38707 44983 44904 43479 27852 20857
8162 20857 18987 3963 11185 26477 38324 50256 58733 74876 88157 81768 51209 14780 5230
8149 5230 14784 23325 19111 11618 -8434 -28494 -42234 -28995 -34471 -33017 -37872 -33186 -19880 -22681
8135 -22681 -26843 -26319 -32714 -32841 -16806 -8217 -5218 10338 13509 9111 10890 7210 -4161 1879
8121 1879 7602 -12046 -18651 -26340 -23396 -16836 -12796 -1786 -10524 -16992 -10319 -15599 -18227 -14580
8107 -14580 -17875 -26461 -24761 -12378 -20390 -21594 -17439 -14304 -11097 -23082 -38960 -36683 -29179 -27527
8093 -27527 -12680 -16458 -14252 -10690 -13040 -9620 -926 5940 -1024 -10014 -19833 -30890 -23219 -23564
8079 -23564 -33445 -44045 -31844 -13288 -383 -4065 262 8592 -1720 -30098 -36470 -27171 -18931
8066 -18931 -10786 -22246 -30516 -43162 -51826 -33836 -16358 -11924 -25496 -32911 -27175 -24313 -25910
8053 -25910 -40361 -49222 -63463 -57846 -53476 -43752 -26149 -16864 -12746 -15079 -29087 -17786 -6602
8040 -6602 -11806 -6349 -10111 -20992 -21222 -19572 -15384 -13498 -19304 -24480 -21004 -29620 -23476 -7828 371
8025 371 1668 -6025 -9755 -10357 -8410 4808 1044 4953 704 -8155 -5351 -15386 -22054 -18480 -9327
8010 -9327 -2398 37 -1140 305 -9758 -20877 -16327 -442 4983 2050 -10655 -20757 -17373 -14715
7996 -14715 -19914 -19021 -6979 -6768 -7278 -5286 -8617 -9134 -1608 5444 3949 9526 314 -11543 -23889
7981 -23889 -22036 -20488 -18808 -15204 -10855 -8566 -1232 -1868 -8736 -6023 -3886 -1567 -4941 -10122 62
7966 62 6923 4378 -6022 -22166 -20789 -5310 4311 26456 47929 33057 31617 31626 22790 9935
7952 9935 1873 -9136 -1815 6037 6217 12460 14566 8726 15255 10480 15355 7381 10766 6025 -4527
7937 -4527 979 -4350 -12051 -15968 -7745 8993 9247 17654 22471 4817 -2736 -14581 -28506 -28227
7923 -28227 -19779 -764 18244 28441 53347 57066 47863 37504 22738 25389 12818 10782 8335
7910 8335 15776 28388 27408 8067 -1726 -12816 -14700 -15175 2255 11843 2589 3590 -1720 4246
7896 4246 -7685 -17308 -28588 -14166 3153 15028 15155 18232 5419 -4596 -2454 3429 -2424
7883 -2424 -3641 13715 3558 -8406 5053 13903 15224 17970 6375 -783 8682 14000 24618
7870 24618 18951 10044 7108 575 -13312 -22157 -17417 2581 22872 26330 8554 4765 6219 -4647
7856 -4647 -11523 3403 13535 11488 6071 -956 -15312 1222 14866 10806 -1026 -5503 -11380
7843 -11380 1904 6889 4961 -3100 11030 19626 5875 -16740 -19343 -14592 -15322 -18143 -19000 -30829
7829 -30829 -26710 -23290 -28640 -30292 -11091 -4155 -9996 -23179 -23591 -7807 10745 12392 -9412 -12238
7815 -12238 -24896 -16271 -7286 -2451 16797 12957 12563 12224 13799 1379 -7015 -12640 1075 8469
7801 8469 4564 -7403 -2841 5732 6667 -6061 -553 2339 -4639 -3826 -4981 2910 12654 18535 14410
7786 14410 -4905 -23132 -30059 -28209 -26491 -16397 -22087 -24321 -25690 -18048 -32914 -26884 -4269
7773 -4269 11085 2748 -27045 -44947 -30606 -19660 -11138 -17828 -15329 -8831 -8412 -10185 -5496 -11458
7759 -11458 -16348 -28229 -23522 -11180 -7991 -16386 -31711 -23438 -12984 -15434 -21925 -18951 -15087 -14195
7745 -14195 -13943 -27514 -20111 -9470 -8800 -24248 -26125 -18488 -11113 -13335 -24762 -21829 -19754 -25451
7731 -25451 -25435 -15652 -21791 -17377 -10762 -7762 -10268 -9373 -1832 3485 6139 -8082 -17753 -16962 -15577
7716 -15577 -6626 -1682 -5085 -17660 -11821 -5486 -1625 -3510 -9839 -3040 4850 -3876 -28768 -35535
7702 -35535 -45785 -38471 -8238 3320 -7820 -22161 -26204 -28583 -16968 -6861 -7321 -16793 -17731
7689 -17731 -16396 -6047 19 -16220 -19536 -21838 -19721 -19113 -37558 -37094 -27291 -12501 -13184 -13910 -21825
7674 -21825 -16605 -2998 -5155 -7146 -13716 -29578 -40703 -36623 -20682 -21033 -29227 -37023 -39672 -34637
7660 -34637 -43160 -28340 -21641 -18306 -13668 -8974 -11048 -23778 -25797 -32138 -27657 -13424 -13624 -24183
7646 -24183 -29219 -32216 -39572 -43342 -30087 -19901 -22843 -35216 -40491 -35113 -26240 -28475 -39709 -35374
7632 -35374 -23204 -16857 -5502 -16908 -20649 -23665 -18433 -4250 -7214 -14997 -15687 -4203 -1078 2853
7618 2853 13738 3616 -8514 -8968 -13427 -11677 -12274 -21895 -11839 -6950 -4897 -14113 -24869 -35659
7604 -35659 -44067 -47047 -41987 -28708 -18604 -24945 -27853 -13595 -5375 -17893 -17293 -15114 -16419 -29240
7590 -29240 -24724 -17682 -15488 -12175 -10196 -8827 -15144 -30709 -38715 -35640 -44237 -33214 -20544 -24027
7576 -24027 -18675 -17395 -7927 -5281 -7459 -11373 -26545 -24917 -23256 -24666 -14122 -17299 -28417 -33542
7562 -33542 -23425 -19869 -33495 -33819 -45114 -39975 -35239 -29139 -35038 -41311 -42949 -23750 -10887 -12430
7548 -12430 -23881 -22547 -17671 -15895 -21774 -27190 -28964 -30495 -28593 -30749 -27221 -20447 -9005 1332
7534 1332 -10210 -4145 -15471 -21925 -23429 -11306 -15185 -10262 -7193 -13581 -38161 -42150 -45463 -38103
7520 -38103 -30973 -35796 -49115 -31760 -8712 -3853 -7980 -17412 -23524 -18214 -14904 -25234 -31842 -39121
7506 -39121 -36845 -22978 -7694 438 3762 445 1357 4134 -11282 -17911 -5656 768 -6581 -13514
7492 -13514 -21663 -26561 -22351 -21057 -32530 -28583 -34858 -27102 -27486 -34469 -21559 -29929 -30121 -23794 -17852
7477 -17852 -5783 4540 925 -6242 -19618 -33003 -29598 -20419 -19609 -23181 -26228 -19379 -9521 2533
7463 2533 12858 11364 6571 -18228 -39076 -41084 -27238 -17715 -10431 5014 25428 19996 13510
7450 13510 18443 11626 12407 7010 -5841 -20790 -26309 -32333 -30734 -9569 10585 -5852 -6630 -553
7436 -553 -155 -6979 -5456 -10273 -16670 -14778 -13816 -17254 -19106 -23575 -24334 -30734 -23559 -27824 -36777 -36507
7420 -36507 -14533 -6207 -2000 -3474 -11359 -27700 -34525 -16880 -7406 3892 339 -14743 -14366 -7299
7406 -7299 -20319 -20781 -14588 -5583 -6649 -7540 5707 18338 18940 9833 -1084 -1218 -6627 -7878 -515
7391 -515 -4754 -2627 -10249 -12344 -14372 -20492 -23540 -21260 -16613 -4814 2644 -1033 170 -6028 -12555
7376 -12555 -30687 -26429 -26932 -17983 -15142 -10412 -15006 -28088 -25508 -17635 -2751 20383 1723 -11370
7362 -11370 8308 6128 -2562 -5497 -214 4674 11234 2182 -12387 -19717 -15178 -6268 -14409 -17031
7348 -17031 -12079 -7968 -8811 -14859 -23449 -25021 -35610 -30453 -26117 -25352 -28144 -6631 -3675 -14279
7334 -14279 -17496 -21433 -24693 -13127 -6789 1052 696 6700 12569 20647 15696 2619 -8920 3860
7320 3860 -1115 743 -5066 430 1276 -1466 -521 3387 -7054 -13584 -14713 -21192 -25128 -23022 -24261
7305 -24261 -31247 -17516 -5852 -684 -3059 -7339 -1304 -11804 -25524 -35187 -16013 -9032 -8641 840
7291 840 -6851 -2721 -3577 -7730 568 -6718 -11863 3290 1586 -15252 -25157 -15210 -15046 -525 -9947
7276 -9947 -9806 -1489 -3878 -2462 -6625 -9985 -13224 -20034 -17465 -3263 -6293 -16019 -13893 -7198 -13699
7261 -13699 -9553 -13404 -19731 -22261 -13534 -9999 -23834 -21652 -17939 -20893 -19788 -7805 -5453 -24552
7247 -24552 -34032 -24618 -14390 -7642 -12233 -12924 -9558 -17821 -14177 -19815 -15453 -9295 -4418 -4437 -4090
7232 -4090 -3677 3701 -1421 -2027 4137 -3383 -12365 -10395 -10894 -9539 -9320 -11041 -7071 -8765 -19578 -26314
7216 -26314 -24543 -17496 -21499 -21225 -21731 -21412 -23494 -17137 -19197 -28964 -27955 -21208 -24750 -30035 -21078
7201 -21078 -10486 -6681 -7998 -10746 -17409 -20981 -6733 3719 -971 498 4659 7947 4024 1885
7187 1885 -8 -14093 -15186 -15893 -24942 -15172 -4058 -9914 -13651 -10925 -4751 -7841 -9213 -24614
7173 -24614 -12125 1973 5488 -5543 -106 -881 -356 -10468 -19520 -22223 -21090 -15126 -16471 -12474
7159 -12474 -1070 144 -11526 -11787 948 6381 1749 12732 20533 11621 12219 16832 14396 10308
7145 10308 7920 7544 6712 11739 19517 23970 10939 676 2908 -15216 -22024 -18468 -5115 8989
7131 8989 607 -6711 -1291 12257 23284 11058 -986 5298 16353 9373 -15113 -21157 -13260
7118 -13260 -4853 5219 9874 5185 -1725 -4075 2315 3245 -5122 -4709 11446 11252 -9127 -25142
7104 -25142 -31811 -31410 -36699 -23038 -7620 -4040 -9919 -14216 -15511 -23162 -28516 -20143 -16038 -10096
7090 -10096 -8815 -13490 -12986 -14036 -26024 -18583 -13592 -7945 5584 -4858 -18780 -29333 -22810 -21557
7076 -21557 -23176 -33362 -33614 -28190 -27787 -30995 -24737 -18433 -11697 -6999 -9542 -13739 -20020 -18044 -14926
7061 -14926 416 4709 4609 9833 -1696 -16313 -13940 -11168 2851 -1950 -20604 -23122 -15445 -12114
7047 -12114 -14790 -26231 -20484 -8230 573 6904 -4806 -6699 -3479 -17082 -17024 -14115 -25320 -25210
7033 -25210 -12235 -18115 -28524 -12529 -5169 -6723 -5034 -1914 1184 -4478 546 10479 12987 8289
7019 8289 4900 -378 2171 5435 6830 5746 8234 5797 12727 8746 7916 9859 4224 2391 -3496
7004 -3496 149 -3645 -10442 -15819 -9335 793 -4114 2050 8220 3933 4212 -12061 -29999 -31663
6990 -31663 -20553 -14113 -15447 -17423 -24746 -14433 -19864 -13413 587 2281 1289 754 -977 -18615
6976 -18615 -6357 -4651 -2994 8271 8995 4395 3257 2290 2745 5222 8353 -3184 -6449 -19878
6962 -19878 -17661 -11668 -12601 1013 8831 6133 2624 -12664 -17202 -11613 -9371 1004 13793 13676
6948 13676 -153 -12703 -8138 -11337 -25094 -35873 -20971 -6285 -1731 -2071 -11653 -2530 7088
6935 7088 -3975 -16048 -22259 -12826 1843 14451 18319 9616 11145 -4809 -4734 -7358 -16047 -15464
6921 -15464 -7106 -20508 -25317 -10499 -1932 -12669 -9062 -11453 -10516 -15789 -27802 -20859 -19381 -19916
6907 -19916 -6376 -990 -10703 2136 14037 19335 12229 9689 10797 -5675 -988 -788 -4251 3963
6893 3963 15415 7816 -889 -15859 -24384 -14955 -6125 39 -1877 -4659 -6573 -3746 -19526 -33165
6879 -33165 -45536 -39304 -30585 -13481 -5216 266 2134 -713 4824 -2571 -4497 -10277 -18944 -22407
6865 -22407 -23310 -19958 -13141 -13586 -17224 -22775 -21117 -19665 -7510 -1187 -4593 -12679 -17901 -10188 -18219
6850 -18219 -17945 -12332 -1754 -8229 -7898 -15337 -20688 -9717 -11283 -20419 -11417 -308 -2373 1011
6836 1011 456 7231 1179 -13543 -3187 6485 16260 23022 15839 -4321 3611 15277 8410 -1577
6822 -1577 -7376 -9123 5899 10790 -3064 -5987 -11949 -9808 -10954 -8913 -2133 -16731 -24325 -11846
6808 -11846 -1139 13871 27396 21940 -11117 -23173 -9847 5565 9279 4531 7098 15128 21236
6795 21236 12723 3299 -3205 -15498 -24863 -19557 -10831 -12466 -3841 -18732 -24818 -21584 -13104 -990
6781 -990 -7230 -26309 -32022 -37127 -35979 -27753 -20231 -6095 4031 4544 -2102 -19109 -17696 -23999
6767 -23999 -22133 -22982 -15350 -12779 -20804 -14639 -8961 -12350 -11934 -6712 -1596 -6395 -18660 -33416 -32567
6752 -32567 -33241 -14047 -2632 -4559 -546 3833 10119 9191 3603 3602 -8629 -6111 -7770 -2918 -132
6737 -132 4151 -10988 -22321 -16245 -12504 -16996 -25528 -18636 -17845 -19653 -22089 -14082 -17710 -27709 -15498
6722 -15498 -12093 -11436 -2267 761 -3948 -5743 -3309 4215 7517 6478 1041 4538 14292 24910 3031
6707 3031 -4024 -8243 -9928 142 -115 -13728 -12576 -4354 9220 5690 -4207 -1376 11506 12857
6693 12857 -716 -3017 2609 5050 -1567 -2984 -3222 -9733 -8327 -9591 -16644 -16289 -19859 -27666 -30229
6678 -30229 -28219 -20731 -1238 10483 7644 15721 15584 16461 18610 26544 18361 15980 28623 18912
6664 18912 2735 17254 17287 5265 -4471 -14022 -21958 -14154 -9839 -11381 -10564 -3166 -3466 -6854 -2257
6649 -2257 9612 295 -17034 -31718 -35311 -35744 -8023 -7079 -14812 -18357 -6063 -3139 -3073 -19697
6635 -19697 -11938 -9067 -8162 649 -34 -6406 -2452 5125 3821 -1268 -11010 -8190 3510 1613 -10942
6620 -10942 -8476 -1020 -10777 -15241 -20382 -24580 -22190 -5616 432 10714 19338 19347 10592 2264 4454
6605 4454 17352 13168 14143 6299 2253 -5201 -24400 -41828 -34707 -33312 -33586 -18574 -18384 -15804 -15504
6590 -15504 -13346 -12780 -2610 -9582 -18820 -21111 -21097 -11141 -6355 -762 14220 7193 2256 8269 -5001
6575 -5001 -18964 -11979 -13419 -13591 924 7965 20742 18481 5139 -3845 -4444 -14697 -14904 -21620
6561 -21620 -24015 -7081 -13867 -15862 -11926 -564 -1051 1057 3694 3857 214 5204 -4851 -13621
6547 -13621 -8315 -9764 -8608 -8923 -18995 -10841 -4487 -2222 -4359 -5386 6438 5772 -375 -6505 -11512
6532 -11512 -14145 -4368 -3443 -8906 1903 4039 3190 729 1148 4697 16670 14685 -2060 -12029 -12739
6517 -12739 -21601 -27154 -6351 1421 -3497 4858 8465 -295 590 5769 4317 -8014 -5704 11995
6503 11995 16678 14691 9499 2579 1678 4 -8726 -4473 -3849 -11506 -20834 -25839 -33394 -30101 -24080
6488 -24080 -16912 -8730 -3083 -12511 -24818 -13170 -7620 -22689 -21914 -17076 -16693 -14035 -15692 -18346
6474 -18346 -9155 -6530 -17404 -18947 -19146 -8041 -1376 4893 4584 6779 -887 310 3460 -1384 -7884
6459 -7884 406 -5823 -4168 3319 13608 7154 -4284 1221 2661 -6480 -7880 -13029 -20685 -21211 -12222
6444 -12222 -4883 447 -3157 -17855 -32689 -32775 -29266 -39448 -42340 -28277 -20477 -20730 -17886 2015
6430 2015 12090 12020 9911 6949 2546 -3366 -7285 4338 4430 -7740 -19153 -16610 -4285 9465
6416 9465 12293 9878 4247 -386 -13043 -28808 -29962 -11769 -8328 -28314 -16663 -16622 -14559 -18007
6402 -18007 -4960 8804 15443 1399 -4684 -4294 -6101 -13842 -11677 -6958 -5511 -13904 -14728 -13433
6388 -13433 -6025 9174 22908 27544 24157 21464 18715 16474 17716 7969 -3560 -740 12862 21438
6374 21438 23978 35888 37945 11010 15091 16252 12874 3140 3216 -6671 966 11416 15525 13330
6360 13330 997 -9032 -8842 5818 -770 -12531 -10245 -12366 -20419 -17290 -6292 -1047 2735 4232
6346 4232 2680 -8425 -10823 -5230 5545 11373 6897 2656 10870 8191 11468 17961 18211 19019 19562
6331 19562 9112 -4031 -7874 -1234 -8790 98 10535 8599 3765 10629 8186 -2055 -7100 -2217
6317 -2217 6572 1143 -15119 -15939 -11739 -10665 -18411 -20521 -13684 -6804 -4842 -3831 19052 37081
6303 37081 19707 -11908 -21771 -7302 -12256 -12942 -13526 -16803 -16732 -12034 -12527 -12016 -13816 -15958 -10223
6288 -10223 169 12768 11144 -13919 -12692 -989 -8697 -14533 -9239 -16261 -9440 -7865 -8382 -19100
6274 -19100 -16796 -11349 4121 15899 16113 12087 5611 -9109 -12481 -5743 -9074 -22678 -30017 -27129
6260 -27129 -12404 -6959 -14353 -2509 9664 13930 -3894 -19162 -21961 -19444 -16745 -15256 -10443
6247 -10443 -14011 -18054 -17773 -11006 -2372 -6564 -16629 -8917 -6568 870 2111 9925 12844 7847 -1977
6232 -1977 -22624 -18528 -10759 -10459 -14005 4817 14306 11888 9441 4908 1837 59 -7192 -10317 -10852
6217 -10852 1212 18291 15664 5433 456 -2189 -10223 -4012 9882 5462 2224 1366 11101 18276
6203 18276 12800 9492 4043 5285 1517 -3672 -12582 -9926 -7888 -12441 -11599 -8295 -12586 -19826 -8227
6188 -8227 -9763 -7288 337 -6445 -10467 -1068 5946 14471 9013 3072 6849 19769 26262 11426
6174 11426 -518 2122 4304 5004 -4274 -3139 1608 6322 10079 8693 13929 18820 14850 15249 14409
6159 14409 10627 13569 8393 -6383 -9081 -13617 -16714 -22441 -20035 -15290 -7055 -4514 -7237 -7705 -11443
6144 -11443 -11425 -5510 -9932 -19531 -13504 -4194 -2390 -11361 -7128 2084 23924 38503 18854 -933
6130 -933 -3188 -331 631 7093 19688 14644 -10109 -4137 -2279 -24732 -26298 -31228 -34929 -52516
6116 -52516 -54012 -38713 -21211 -8525 -13477 -6641 -6784 -5527 8327 13189 -5151 -5692 -11070 -6502
6102 -6502 -9097 -17024 -8126 -9782 -553 -816 -5104 -6682 846 -3247 -8470 -13254 -20127 -7828 -9898
6087 -9898 -13210 -8665 7615 13987 9625 -1620 5916 3403 11020 10398 10451 5217 -9556 -12205 -13512
6072 -13512 -21299 -15152 -6457 -2785 -4217 -8838 -9048 -10252 -7387 -5629 1046 16050 8641 5126 6897
6057 6897 2017 13372 9321 -4095 1459 1955 -6309 5024 2680 321 337 3539 14384 13574 19621
6042 19621 20829 18323 8808 4233 -6113 -15345 -2771 12002 5884 -5136 -4852 -1674 451 -1025
6028 -1025 6571 7447 12706 31710 35571 27587 21423 14558 23725 30841 17941 8699 1574 -4836 -6505
6013 -6505 -4380 -1257 -5855 -11799 -11811 -8374 2468 -5103 -11660 -1891 -3735 3492 -500 -349 3454
5998 3454 -11445 -17967 -13122 -10992 -5180 -12277 -15403 -4088 -11075 -20521 -990 1953 3097 -855
5984 -855 -8822 -18148 -17430 -4793 20496 23665 18411 18377 2438 -13274 -14494 -7001 -2433 -9638 -11595
5969 -11595 -7326 -6665 -12483 -12369 -8355 -4276 -11352 -18141 -10983 -10822 -6635 1374 600 -10109 -10654 -22445
5953 -22445 -25446 -6911 -5432 -5576 -7951 -15696 -18313 -11572 -10628 -2171 -4227 -17807 -17284 -4908 -3545
5938 -3545 -9146 11062 22251 22594 16597 19699 16757 15591 7292 -3330 -17713 -16614 -10646 -11533
5924 -11533 -9593 -11697 -25089 -24372 -15807 -9713 9247 8566 2661 5118 9590 15183 11453 -4405
5910 -4405 -13079 -14416 -28437 -24494 -11962 -368 6926 18155 16639 10602 7032 -2541 882 10635
5896 10635 16235 21266 13208 357 8318 13110 13019 13963 9525 12252 11805 12725 7394 -7813 -12867
5881 -12867 -9053 -6945 -8727 -8958 80 -6618 -5428 8043 12738 4467 4660 5164 891 -4841 1842
5866 1842 6734 17435 7173 3866 63 -15866 -20630 -7546 -3369 10353 12974 13279 -3069 -1718
5852 -1718 -6459 -11734 -9965 -13590 -6222 3429 -12012 -6120 11267 6066 11480 23001 22506 8778
5838 8778 22816 23387 -199 -7729 -18228 -6960 -891 -2036 7332 8916 7584 10281 6658 879
5824 879 5869 18547 19071 5704 -2166 -4358 6310 20261 24067 -3440 -6343 -6761 -7836 -18044
5810 -18044 -4811 5785 3476 -4695 4778 -7327 -14913 -301 -2845 -7911 -7052 -7671 6311 21505
5796 21505 12712 -14416 703 9883 1845 5381 7156 -4987 -12937 -19947 -17735 2095 -660 -2132
5782 -2132 -9237 -21336 -9612 -11067 -17728 -16335 1246 3764 -5938 -11447 -5907 -5922 2129 13402
5768 13402 10215 1066 -8723 -4199 -3158 -2828 12983 22528 12847 3827 1630 -1756 9413 15176
5754 15176 16055 5686 -16764 -2777 5324 3218 1704 2378 -10970 -17205 -16824 -20895 -30553 -39453
5740 -39453 -30893 -12828 -15529 -11933 -15292 -10293 10358 2715 1178 11614 -879 -4766 -2403 -3699
5726 -3699 -8070 -13259 -11172 -15790 -6073 3455 -3932 -23552 -27355 -2292 985 -665 -13552 -11190
5712 -11190 -23244 -26460 -22975 -24106 -10252 -1073 588 -2384 12145 10682 14982 12719 307 4020
5698 4020 16971 3456 735 185 1465 941 10996 14869 6784 133 1835 -3734 -1320 10423
5684 10423 7739 -187 11166 10997 3930 2025 15574 21373 12616 5174 -677 -8476 -16223 -7652
5670 -7652 -10199 -11681 -5861 8368 12513 11519 12284 20899 11230 -11328 -11945 -9417 -4521 -9397 -6440
5655 -6440 -6215 1654 8907 11073 9610 8052 2004 12990 8489 -1357 -11021 -23118 -18538 -18553 -15178
5640 -15178 -2318 -14546 -23555 -23332 -8968 7176 7195 1709 -4325 -14385 -4586 4154 -5075 -13235
5626 -13235 -17819 -12887 -16378 -20672 -21818 -26573 -12789 -6745 7451 20061 14500 9551 17773 23794
5612 23794 4490 -5547 -6434 -9136 -1863 8026 2589 7672 8175 -9140 -15331 -7040 24345 42611
5598 42611 39211 11622 1949 442 -11933 -9120 -11041 -7529 4102 -10747 -6377 -430 -2487 -2740
5584 -2740 -4016 1936 10904 17366 20139 12334 -302 -7990 1982 6562 15764 9514 1898 389 6335
5569 6335 8114 -8067 -3857 6337 895 167 -19789 -23591 -12444 2053 12117 -2333 -3241 -2910
5555 -2910 584 -4072 -5450 -505 10459 22026 12901 15432 14148 11242 8172 700 1690 1994 11735
5540 11735 6456 -3167 -4415 -10524 -931 1380 -467 -1054 -13133 -28898 -15503 -15697 -7181 7710
5526 7710 7070 4269 -1414 2087 7044 484 2278 12525 6880 -474 2067 -6283 -13355 -5301 -8003
5511 -8003 -11416 -14587 -9565 -176 5940 12913 15167 13624 12131 12259 74 951 -1198 -13663 -4974
5496 -4974 -1343 3108 12651 15524 16522 22909 26462 11465 -9555 -17539 -13454 -620 -4962 -4406 -15045
5481 -15045 -16214 -20543 -6286 23240 7661 -6892 -3158 13046 13803 3240 8402 16525 27016
5468 27016 27451 24062 -7018 -11910 -442 -868 -6350 -31819 -31208 -16612 448 29012 15307 6082
5454 6082 16548 10766 9717 15671 7947 13564 23805 8735 13439 14906 16925 5271 -12127 -16410
5440 -16410 -3473 7669 2849 -4736 7356 17861 13690 15905 22025 28290 21519 25498 20754 17804
5426 17804 5842 -1075 -10621 -12212 7457 15095 6838 -3239 996 1227 1936 -9087 -10841 703
5412 703 6068 6768 15070 17470 15088 13336 13116 510 -4469 -13279 -6588 -4533 -14936 -16322 -19771
5397 -19771 -8767 6077 5876 -3741 -1842 -8545 -21269 -23053 -4353 5657 3442 13846 7272
5384 7272 -1037 -20395 -26491 -17530 -7533 -7512 -5202 2357 7090 247 8395 15466 5042 -20238 -15405
5369 -15405 -954 2087 822 7715 5760 9157 6518 54 -6020 -13343 -7247 12863 19631 7935
5355 7935 -5819 4590 22817 20044 21887 14795 4781 10425 13498 12239 6238 -16 -6497 -15061
5341 -15061 -11684 -3405 6824 -2292 6974 9444 13681 22177 14533 1309 8625 19631 33621 23698
5327 23698 31323 44228 31544 17820 18832 29996 29852 18630 -1849 -2472 -9861 -7991 -12400 -17780
5313 -17780 -6386 -3722 -5809 -13005 -16105 -25687 -14837 -6435 -9856 -5012 -8048 -12362 -863 16825
5299 16825 24514 25359 6046 -2016 -6677 -1645 -11198 -18675 -13977 1436 2322 -2991 -2842 7371 14903
5284 14903 11512 21081 18123 14425 4163 4881 11450 5508 -5267 -8916 -7820 -5724 -4361 -2824
5270 -2824 -4603 2480 8006 5496 -1152 -14178 -12887 2120 -1698 -13119 -19062 -12843 -2727 -3374
5256 -3374 -3774 -5752 1901 -4663 -4115 -6954 -9294 506 4223 7872 12580 -8261 -22363 1790 12684
5241 12684 -345 -2169 -6934 3022 8057 12748 19313 19970 16388 10704 3574 -8815 -3987 -1740
5227 -1740 509 -9783 4980 20496 17160 3759 4459 4879 3187 6777 4948 -5162 -4205 3778
5213 3778 4540 -4119 1458 -1577 -2630 1358 -1583 -1512 -3818 -10779 -10366 -14231 -2291 -17429 -24471
5198 -24471 -11639 -224 4438 1279 -4868 5807 12654 2962 -9802 -20088 -15913 -5769 -10983
5185 -10983 -27250 -19954 -305 -2582 3555 17115 20502 8877 14122 11656 9322 6673 2415 -4777
5171 -4777 -21528 -10573 -18755 -11610 -8048 -1681 -1006 8115 12594 14061 9307 3258 7909 16418 21819
5156 21819 16088 6038 3796 8780 19105 17696 11303 -2398 -9700 -13194 -30124 -24866 -10920
5143 -10920 665 2248 357 -12025 -9429 11145 27098 29731 19362 23332 33812 33587 12429
5130 12429 7059 12609 11079 -746 -16209 -14984 -20208 -14359 -11166 452 -9193 -14898 7269 10596
5116 10596 2900 2206 5442 8437 10614 7798 15800 21597 21252 19396 17149 17887 9811 -6629 -9308
5101 -9308 -15420 -7339 -1240 3621 2660 3925 -7221 -8504 -5763 -6320 -9205 -5699 8953 12882 2834
5086 2834 -3881 3887 1247 -8264 -20210 -3055 -1613 -27654 -30037 -11807 -18517 -24986 -9005 749
5072 749 3767 5612 10608 23501 26379 19257 22748 15294 14731 29204 29624 19689 19795 24271 30328
5057 30328 28455 23920 3157 -19582 -21906 -9090 -17721 -15811 -863 13261 16704 6811 -3718
5044 -3718 6291 3817 8698 15375 958 4235 15722 17311 17670 24504 13737 19174 10310 10697
5030 10697 19414 2296 -2763 9574 10290 5929 -6195 6888 4499 -1149 14897 12418 4075 2643
5016 2643 -5386 -6402 -3088 11225 1474 -13301 -9865 1333 20394 26187 19521 8521 2347 419
5002 419 -9724 -11749 -8962 -9791 1148 10580 -638 -4655 -7853 -19211 -19437 3676 26690 16545
4988 16545 6625 -1694 -3120 -2448 -10103 -15682 -3531 -8038 9571 9782 20222 20890 17772 25538 13176
4973 13176 -3395 -2338 2173 2560 -4292 -4482 -5507 3526 11497 4214 -2728 -7770 -1113 -8335 -25732
4958 -25732 -20969 -10897 -14499 -13349 -4311 6726 14873 -268 -5145 -2227 -4452 -6710 -3436 -6367
4944 -6367 -2667 4073 1756 4402 6932 -5867 -10076 4277 -1377 2772 1404 1553 6150 6106 16584
4929 16584 24304 24175 20919 14818 23983 35465 35183 8441 -7985 -8364 -7860 2983 6892 630 -4846
4914 -4846 -1869 -3093 -11754 -11924 -21097 -31601 -20663 -15627 -12343 -11489 920 1248 -7759 -4078 -9360
4899 -9360 -5061 4086 1695 2985 11682 4652 4194 5335 4561 -1035 -4804 -8995 9458 18817 6079
4884 6079 -3734 -16320 -20434 -15263 -10945 -10118 -13806 -21335 -18032 -13236 -5746 -3491 3830 4110 4638
4869 4638 2778 6514 2826 -5078 -11344 -3041 11522 20022 5797 1774 3588 -945 -7249 -1030
4855 -1030 4067 493 -11418 -8743 -5081 -6428 -1437 -850 5352 6847 3051 5050 5973 10513 9479
4840 9479 6826 -1361 -6717 -10267 -13695 -20769 -15292 -12892 542 -7603 994 4600 459 5395 -71
4825 -71 -7103 -2037 14136 19242 16908 20556 10246 6165 7018 1524 -8931 -10628 581 660 -8642
4810 -8642 -4427 2926 6741 13005 2637 3125 11358 3559 8529 9304 -7394 -6440 -7467 -9125 -2335
4795 -2335 1769 6343 16826 17976 12774 8408 5967 4532 12021 17816 11791 4491 -3866 -3533 -18463
4780 -18463 -24428 -12167 -5798 -8965 -17344 -21701 -14080 -15555 -10128 8609 7476 3058 -2684 -7353
4766 -7353 -8564 -35 -7237 -10059 748 16473 22843 11591 4544 9992 9503 3171 11888 12590 20506
4751 20506 19054 20872 29307 32395 26218 26516 13344 13464 9066 10300 17400 20461 11311 -3964 910
4736 910 5634 2117 7510 18411 19602 25501 19724 7080 -7798 -2894 18632 31601 41718 37233
4722 37233 37753 30935 18070 21601 12204 -11565 -5428 -3113 -9469 -4808 12346 13963 11828 -4887
4708 -4887 -13120 -5332 2171 8368 7045 16680 10846 12162 25476 17382 10548 4273 -5976 -6196 5544
4693 5544 18750 21556 15161 20635 9324 7511 -1203 2424 730 3930 -2223 6591 15850 10389
4679 10389 10003 17164 26278 28939 26967 11915 12611 8046 -4006 -615 12477 15891 24838 16971
4665 16971 3140 -4963 -16434 -20000 -14959 -7068 -1356 2099 872 -12655 -14900 -3286 -12372 -18241
4651 -18241 -11006 -1030 -2546 -14558 -17326 -8933 -6373 -6626 -14273 -8714 -10784 -9509 -10675 3905
4637 3905 22247 14976 3490 -12458 -17444 -13376 -8547 -1269 4071 2749 -7066 -4327 3205 6361
4623 6361 -13829 -20426 -7426 -5200 -8485 -4464 -11234 -8880 -1584 7733 6014 5269 -24358 -29931
4609 -29931 -7417 4038 1075 4617 2128 2377 4697 -4795 289 8628 12261 14775 6793 -1782
4595 -1782 4543 12146 5931 8843 3782 17607 23025 14533 7000 14198 17270 6058 1393 5532
4581 5532 9814 10320 10191 5039 -992 11083 11026 3852 13533 18285 19544 18281 16662 11904 6479 -870
4565 -870 -5376 -2847 -2935 -5659 -1239 10031 6947 11503 7113 8765 8474 5598 19353 14327 2711
4550 2711 3290 3019 8418 12204 6067 3582 -7297 2501 -2195 -8556 -5508 2068 8558 13646 21077
4535 21077 614 -1490 -3843 -2767 -4893 -20463 -24556 -12583 13289 12900 8075 14075 24102 30066
4521 30066 23118 17736 17207 10367 12327 -3276 -8925 305 3652 -6180 -1833 6687 7727 -5884
4507 -5884 600 10691 22059 26702 34066 16593 9571 8075 24097 28020 29475 20840 2926 -5728
4493 -5728 -5386 10261 3423 -3361 -490 5296 -70 1582 -8190 -6353 -1652 3456 21066 21952 5735
4478 5735 5260 5783 1078 3633 8597 9282 18380 15468 14631 24152 19751 17352 7097 1669 1434 -7494
4462 -7494 -16117 -11792 -1239 1825 6658 17721 28790 30367 25437 18862 11178 -1793 -5691 -4115
4448 -4115 1353 -7967 -20871 -16934 -4639 11173 3362 9752 17634 12507 8733 4981 -11119 -23041
4434 -23041 -2679 -2222 -11680 -7312 -12919 -9344 -11846 -11525 4059 5607 9151 14959 18180 19576 7888
4419 7888 4340 3201 2550 6771 -492 1239 5519 4907 8984 -1981 -6565 4627 15520 9772 4588
4404 4588 -2045 -5091 -4007 4561 -4163 6204 14784 14090 14213 21877 27381 28506 27481 18168 9925
4389 9925 10156 15064 21584 34672 21553 -513 -7832 -14165 -2830 -1272 -4822 -3796 -9241 -6024
4375 -6024 -7077 -841 -6766 -13432 -7623 8303 8235 9994 1831 -2825 -10017 -5779 6575 5659 -958
4360 -958 1253 -2391 742 3889 5230 -4325 -9259 -10547 -4878 -11192 -10673 -12548 3123 3506 3819 17541
4344 17541 25072 26759 25580 22500 32520 21977 4137 3764 3302 10934 15342 13953 8554 13484
4330 13484 13562 -61 -1032 -18536 -23450 -12389 4363 10006 10339 -3026 -5055 -4976 10558 26429
4316 26429 22748 23174 14695 10286 15462 24460 19827 18540 28417 33751 23856 18409 19691 7236 -8271
4301 -8271 -13153 -9868 -13863 -19872 -8848 10654 17335 8157 -8501 -13269 -2356 17760 24280 36068
4287 36068 34616 31528 36148 34941 31009 22960 17875 16923 16125 17601 18707 3575 -146 3431 10536
4272 10536 -6772 -5614 8232 12193 20308 24057 17245 6636 -8459 -14407 2589 -3687 -9285
4259 -9285 -1734 3236 4683 3761 5882 7190 12379 25031 19594 11320 3362 1924 8064 18195 7631
4244 7631 5184 11204 7740 9701 4121 819 7547 -2994 -6389 -2839 8619 8274 787 7327 19050
4229 19050 15614 11687 15895 20181 26945 25400 31925 31507 31162 11054 4600 -822 4985 9356 16719
4214 16719 21394 3908 -531 4955 7761 8675 18576 16650 3459 679 10009 15640 12147 12016 19273
4199 19273 16574 14518 14002 -4117 -15652 -3347 7457 3203 2912 -8704 -13564 -3014 1863 4659
4185 4659 9346 -3495 -11630 -8355 -3313 1160 18264 21769 19649 24345 19109 5037 7467 8040
4171 8040 3203 -10687 -20796 -10211 9020 7714 -3842 -16639 -14399 -8562 6749 6290 23439
4158 23439 23873 3806 -1325 -8060 -8540 -327 -2153 2725 4013 16234 20676 9247 1266 -393
4144 -393 -3176 2139 2711 -4400 -11699 1622 -2571 -1044 1607 10135 24900 27371 14396 7637 16708
4129 16708 20715 10413 -17 2927 -2295 -2117 9048 1085 2558 -3923 -11425 -1884 14529 20528
4115 20528 30151 39201 42325 26116 21614 32165 33553 13732 2618 9711 -8996 -8353 -5153 3897
4101 3897 15198 17448 13170 13085 16375 15484 15289 6030 5569 5456 -8105 16777 27686 25550 19891
4086 19891 10223 2401 950 8607 16774 23415 39204 44004 22600 10673 10385 8574 284 -14935
4072 -14935 -9670 20106 26331 14923 2917 -2288 -13392 -15596 -12939 -8914 -14498 -6733 8132
4059 8132 10744 29396 31592 23420 22350 6665 1845 -2025 929 13755 9333 -2761 -5552 7381
4045 7381 12926 5801 -2213 -3011 -1507 -318 -15926 -11091 5461 9575 5266 6390 13861 22666 20990
4030 20990 9254 6605 3670 16083 34480 32083 14877 15462 22376 15997 1417 -1876 6324 7422
4016 7422 -13137 -26587 -30608 -23142 -20360 -6721 2419 -9350 -7045 -1444 9079 1542 15139
4003 15139 13387 4206 10782 23274 21475 10209 1455 -4983 5367 17483 24758 11256 17088
3990 17088 34327 28486 16673 6541 3927 9877 16219 16572 14637 3004 -6212 -12796 -5448 -978
3976 -978 14054 19960 17243 16758 9622 4949 16393 23447 24415 24034 21625 16277 4354 14358 10416
3961 10416 -1710 -2361 -482 9660 14377 -807 -4751 -6636 -5001 -6492 -302 8699 6803 9152
3947 9152 4214 133 2804 -7974 -913 4230 3563 5690 -3537 -6282 -4622 -8712 -16033 -14000 -4342
3932 -4342 10055 11690 -7835 -19766 -18350 -15706 -15896 -8878 -3426 7206 9535 8931 11268 6306
3918 6306 8670 4599 -5034 -5083 -5608 -6873 -6521 -11949 -2709 12605 18729 18712 6480 5326 17630 13861
3902 13861 4358 -5459 -4932 9810 21049 21399 8747 -240 -8097 -18828 -13005 2675 4996 7905
3888 7905 9255 19849 13250 -2040 -5900 4696 -2199 -8450 -7823 1953 10082 7369 1725 -6407
3874 -6407 -12083 -12535 -3584 -4172 2343 -2102 3472 7226 18598 17203 9228 6040 4129 3008 942
3859 942 -5026 3623 1447 -22560 -6847 4080 4628 20650 22731 27116 21966 191 -562 790
3845 790 6003 3792 4277 -644 -15940 -17175 -12373 -2480 1437 2491 9086 18132 32336 30408 20593
3830 20593 25042 21319 4885 -2998 -4351 12232 10020 2490 3321 3931 7331 13235 14743 7973 18231
3815 18231 26141 30811 27761 23804 27579 21043 7974 4928 18858 19311 1473 -4013 -10139 -7214
3801 -7214 -2916 7726 16169 23159 10533 -150 -712 2266 9091 18587 14257 3512 -9568 -14289
3787 -14289 -10369 -2189 13685 15548 13903 9683 12480 14700 6919 6855 7710 20469 6338 3578 15121
3772 15121 4266 7077 5022 1487 -3190 -3532 -9945 -625 -910 -10188 -10902 2458 6255 4500 -931
3757 -931 -4316 13050 12204 10926 14592 8950 1281 -2496 2037 3455 4555 7295 -1773 -9236 -3828
3742 -3828 -6175 -5978 5858 17359 10943 10543 16073 20838 17998 124 4288 -1395 -2442 -7899 -17768
3727 -17768 -14329 -8586 -671 2152 -2366 -7105 -6312 2668 7557 -3551 -2327 9779 -5035 -13977
3713 -13977 6358 18525 9096 2524 -4239 -6012 -8090 -11533 -1109 7734 5688 9975 2439 6285
3699 6285 16388 13946 10313 8164 11757 9678 11749 7049 3906 -2314 -12142 -14225 -9298 -3190 9051
3684 9051 8519 15575 9439 -2691 -8713 542 10335 13915 9375 15339 19119 18848 24153 20146 883
3669 883 3330 13152 18674 1483 -11623 -2163 21664 9122 -7425 -16878 -13713 -6795 2287 -2633
3655 -2633 -14752 -13146 644 14977 7230 -4048 12140 20577 13340 730 1581 4872 9345 -4097
3641 -4097 -4088 8510 21687 35081 35787 15865 23227 35788 28589 7861 -150 9911 5699 4481
3627 4481 12511 19010 20281 21675 17118 7316 11019 8609 14065 23568 22329 24455 25885 34135 36768
3612 36768 30446 13548 -2007 -12332 -12117 -5195 -4075 3051 6623 8799 14542 7721 -1167 571
3598 571 325 -7589 -2971 6179 5103 -16182 -12243 -13357 -12181 -3661 12919 11564 -4840 -2532 19609
3583 19609 38451 30734 19688 7676 1157 14987 15068 2126 -10635 -13191 -14597 -5711 6256
3570 6256 7438 2761 -6616 -11716 -12062 543 -6872 -1422 -3481 -5547 8940 -2689 -11779 1152
3556 1152 -854 -493 7981 7134 10572 18203 11556 15972 22156 15663 6821 1744 -4225 8197 1115
3541 1115 -10973 -15425 -7507 -282 15063 29390 34371 27068 30111 18807 17177 17383 23475 10005
3527 10005 1176 3105 642 -6616 -3198 1394 13562 19623 18984 22925 19531 12148 9952 16527 17088
3512 17088 9529 8348 7302 -4493 -9113 -6586 -1033 -10287 -15011 -10914 -1633 4597 15978 18980
3498 18980 7564 -4440 -7871 -5844 -4264 13907 26149 17952 13447 11586 1487 -7557 -189
3485 -189 9552 19983 3226 2454 14886 -1004 -2346 9064 13984 17890 14607 12225 2516 -5682
3471 -5682 1434 -4964 -3681 6382 15680 14864 -4265 -5290 -2635 8274 9190 10182 15187 14792 7889
3456 7889 7470 17950 31924 14311 -990 -663 7880 3827 6659 2846 16733 23951 17247 13607
3442 13607 20395 10557 16045 25247 30116 26905 28183 13805 -6223 1539 14221 6660 18438 33529
3428 33529 28892 16153 6151 2239 13980 9086 22346 19384 12030 6801 8170 15912 15823 12539
3414 12539 -4745 -9647 3471 4642 1607 1652 -10486 -8057 1015 -7457 -12666 -6484 789 -5257
3400 -5257 6665 10086 7849 15762 29254 21973 10921 22334 18322 10492 1477 -11279 -4133 10891
3386 10891 7764 902 513 12867 17535 17854 13035 16612 19452 9821 2536 373 15223 16069 9517
3371 9517 12542 14125 5989 6583 11437 17375 11687 -4105 -15213 -11359 -7091 1954 11791 23279
3357 23279 25393 5747 -15976 -10929 -297 6929 10861 27512 37888 20346 11771 11008 5084
3344 5084 -9832 -2426 17396 3708 2369 5914 -6403 -9808 -6295 -1988 7946 8726 5462 8586
3330 8586 8367 13281 16449 8171 12650 12306 7980 -6687 -9493 -390 -179 -324 -7 -3178 -2368 7429
3314 7429 24093 35176 22835 19631 2346 -8868 -2139 3732 20915 18880 6866 1854 -6096
3301 -6096 -14670 -17674 -10898 -11357 -17755 -5998 -5016 -7839 -16616 -13807 -6135 -5877 1888 2999 6987
3286 6987 -3180 -13546 -685 12326 -394 3150 -225 450 8718 5657 3954 2407 -6863 -12345
3272 -12345 7025 17347 13946 21622 24117 14117 12495 -1354 -10741 -6551 4492 19431 10481
3259 10481 8539 16271 21247 18594 7299 -2665 5414 1225 -9099 3560 9272 5086 11793 24897
3245 24897 31156 25424 21027 8279 3878 -4528 -7944 -3847 2803 3219 -4631 -9273 1693 17531
3231 17531 32260 36824 29797 20534 -2543 294 14302 25178 16654 7055 22809 20682 13156
3218 13156 15508 10972 31679 56298 53772 32754 19600 20849 24505 22224 13362 -2375 2037
3205 2037 11621 8211 13231 22425 19858 26703 20600 9073 4869 14395 30140 33184 30312 11667
3191 11667 6672 21429 21806 22885 26954 12619 5995 5433 709 -2388 5775 -361 -4469 -6958 -383
3176 -383 2589 15907 1629 -13837 -7962 10624 18023 15658 19584 25388 11961 1639 -4242 3769
3162 3769 675 -11231 -10907 -9907 1491 7952 -2194 -10586 -8785 2920 11278 3322 11445 12476
3148 12476 -1453 -4002 7909 7739 6361 663 -23018 -26668 -10544 1104 8209 24672 28005
3135 28005 11725 -7373 -11368 -6128 -1372 -6109 -12984 -20062 -17670 -5378 3004 -4492 -4490 6233
3121 6233 12098 685 2286 3034 15571 33043 32784 22934 24057 33355 28936 19855 11360 9377 8556
3106 8556 8650 3266 3670 6655 -3883 -3870 -6854 -6816 5458 19380 8579 3845 3005 -564 -3109 15868
3090 15868 14711 6443 16524 24089 12200 8779 -4076 -3459 1237 -5769 -4909 -9882 -11095 -10419 -13706
3075 -13706 -15697 -19613 -24462 -18723 -11329 -19336 -17976 -5671 -94 -772 -4788 -3340 14693 9643
3061 9643 -6655 2645 16291 10980 -4013 181 15322 22870 18312 7667 6257 1077 -3676 -13055
3047 -13055 -13400 -5735 7578 19628 22402 23366 26951 25085 -455 -14764 -22448 -18959 -17135 -6723
3033 -6723 -8343 -21688 -6816 3661 14440 22885 26416 24936 7513 29 -13756 -2647 6221
3020 6221 2602 360 -6219 -14203 -1658 -1881 -9472 3896 12024 16398 14104 8852 -5625 -15525
3006 -15525 -15282 -11771 -9074 -5643 -3838 -17130 -11488 5101 20065 18418 13987 15874 17226 18226
2992 18226 1838 -17201 -11048 7649 11526 20792 12688 5260 7016 14327 2205 -6061 -1261 2912
2978 2912 8694 11742 16394 15231 10733 14659 25244 30750 12253 8454 -3315 -20200 -14851 -7922
2964 -7922 -12584 -3945 2439 18907 23082 1483 -1132 -11612 -29153 -30766 -18252 -4409 -8539
2951 -8539 -19476 -25761 -24435 -9084 11571 23796 12250 874 7560 14127 11130 11526 16254 12689
2937 12689 -5351 -14548 -14274 -4012 6800 3681 13392 13600 -3299 -5645 -4002 2308 15454 21374
2923 21374 17350 -617 166 4240 34 -9555 -21783 -24089 -13990 -1825 -10633 -891 7365 967
2909 967 -4090 5054 8198 7407 4380 -4501 -1350 -5633 -11388 -9154 -13458 -14585 -10097 -1318 5756
2894 5756 -6359 -855 1405 -14541 -17628 -12678 -496 14361 8018 -730 6283 10500 4625 1855
2880 1855 7624 8860 19319 16054 16164 14981 12820 11873 7825 -2024 -11475 -9626 -8565 -5419 700
2865 700 1154 -1246 -1483 -13734 -2795 9043 -1099 -13760 -13831 -16514 -17057 -8976 -15232 -21289 -8198
2850 -8198 -8128 -17456 15203 30970 24815 3934 -2371 -16703 -15649 -13401 -4075 271 14769 21784
2836 21784 21445 22492 22427 22309 23525 13914 8977 -938 1503 8689 -6691 -10710 -15957 -9981 -6016
2821 -6016 3512 4464 13902 19402 19423 -709 -7085 -5348 -4119 -1482 -12 -14942 -6858 -5064 1328
2806 1328 14104 16606 -6288 -17745 -3793 12209 24686 29778 34336 31140 17236 -3274 -5749
2793 -5749 -5035 -7687 -2811 8885 9843 1871 10941 7961 10660 -1796 -11844 -591 -7502 -19664
2779 -19664 -17302 -3167 5851 9612 6331 4263 11037 20808 14112 2369 -3378 5753 10724 4521
2765 4521 16839 29830 26772 10021 -9823 -20963 -18006 -9022 -1169 2275 1834 6121 11266 10056
2751 10056 -6109 -3921 5116 2095 -8392 -8692 -10360 -5123 2103 -7062 -11376 -6289 21948 25278
2737 25278 16093 27096 25895 20439 13167 8845 4465 8980 17801 16000 10918 3055 6343 14228
2723 14228 13829 5495 -10980 -10117 8708 27104 31427 22260 9070 -13983 -22688 -11612 3171
2710 3171 3216 -13111 -15469 -4802 9160 480 -10479 -15582 4107 11452 7703 7278 3986 4052 -1237
2695 -1237 9638 15633 16087 7102 9483 17853 10353 4533 11656 15559 7794 2112 -6234 -10457 -3262
2680 -3262 6309 19727 6461 -22260 -36642 -20975 -13593 -451 7848 11332 8659 -1379 -9104
2667 -9104 8476 10124 2846 7721 14904 5307 -8382 -11419 -5649 -6331 -11853 -2273 1842 -11344
2653 -11344 -11016 -6613 -15198 -16104 -6595 13 -815 6643 9102 9970 7073 3949 15304 20466 13710
2638 13710 17209 -2537 -17758 -18039 -11784 -8059 2768 11703 10546 12995 1418 -6172 -5947 3665
2624 3665 17626 21440 7013 19385 20892 15090 6164 9910 -13630 -23762 -31125 -21181 -11637 -8305
2610 -8305 -4504 2845 -2101 2815 8445 17470 14504 3908 8803 15666 15194 29523 27232 7472
2596 7472 -735 -11824 -14204 -56 2294 -12059 -13791 1831 8179 27197 19135 5817 7712
2583 7712 604 -1069 -4617 12 7489 16192 16004 5361 1765 7390 -6857 -14242 -10552 -2583 5213
2568 5213 8212 11955 15368 14168 16338 11521 9878 9806 7377 13981 32514 42610 25945 11313
2554 11313 -2988 13210 16258 -4872 -9411 6998 12116 15716 15086 15511 -2628 -7747 -11693 -23043
2540 -23043 -12841 -196 -9326 -15148 -16353 -4906 8127 13550 8480 5533 7081 6366 11975 12121
2526 12121 1850 -1105 1404 4387 4054 1343 -3054 -6967 2711 2508 17409 18201 23424 14962 -2368
2511 -2368 2805 13582 8779 12485 4264 7338 12521 11242 8350 13669 14357 -9715 -14736 -13558 -11744
2496 -11744 5806 14922 11743 15097 25988 22100 14704 16221 21125 22991 20795 4206 3745 -5096
2482 -5096 -6149 1412 19483 20513 16202 8088 9 3380 5239 4057 10145 10179 7843 -11552 -12314
2467 -12314 12848 20094 16910 15890 17497 9721 3087 316 -2886 7165 13033 11394 11974 9300
2453 9300 12772 19239 31470 39463 31370 25812 6647 -668 12869 11036 2934 4040 8998 12682
2439 12682 8535 6742 4133 -2831 -6685 -3042 -5978 -2301 -441 -2751 -10301 -651 5853 19461
2425 19461 24350 1153 4361 14430 9865 7733 19428 13101 -8662 -19701 -7478 1146 10316
2412 10316 1268 -6508 -14897 -10025 1118 7428 -3238 -4299 855 -2292 6822 1059 -14820 -10686
2398 -10686 -479 10636 8253 7249 1393 -4597 -6291 -11918 -33794 -26724 -10846 7086 -3390
2385 -3390 -1124 -1734 250 -5895 -7668 1753 -1309 -16041 -12778 -955 -13367 -14697 -9081 -10191
2371 -10191 5127 7803 5333 -1844 -5144 3157 2321 7603 1195 5879 5747 13042 6218 8064 3085
2356 3085 -2830 -993 -658 1581 2053 -536 3580 6763 17802 16747 10936 9376 2058 4558 12928
2341 12928 20840 20128 -4346 -26177 -7942 11072 15385 16470 16657 8771 4526 14081 1469 -8331
2327 -8331 577 22072 26093 10660 8457 810 -4548 3124 4740 -879 -14243 -16380 -7632 -4704
2313 -4704 -6775 -5903 -9499 -12428 -9995 -11453 -2313 -5225 -4368 -19642 -8992 -3064 4048 -2731 -16167
2298 -16167 -6701 -7774 -15077 -5976 -6605 -17404 -28030 -32027 -35065 -27244 -16875 -15120 -17500 -18105
2284 -18105 -4887 -9228 -23053 -22059 -6759 4890 7272 5968 -4375 -11420 14481 27662 20810
2271 20810 22675 24072 7021 -7255 1230 3277 5996 10394 21841 24278 17630 20440 25502 17279
2257 17279 5663 -2110 -327 11558 8842 11429 17179 12229 4095 216 -3646 -3610 -9159 -13412 -16194
2242 -16194 -8750 -11084 -9311 -16104 -10544 -1907 -7160 -11826 -4888 -7856 -6849 7794 13216 8888
2228 8888 2651 7186 5543 -3001 -9821 -9110 -2376 -6465 -8545 -2724 -482 3924 -902 5326 5354 9090
2212 9090 1655 -10615 -7512 -3677 -8338 -13030 -1884 13615 20426 16750 12624 10383 24626 23146
2198 23146 24003 10841 4247 -1141 -2727 -484 10512 10160 2133 -2461 7234 22321 19244 -5878
2184 -5878 -634 17181 17297 16018 3876 -1067 -19189 -22397 -7951 -2216 5359 4594 -3787 -150
2170 -150 14778 16593 13243 160 -7088 -13371 -11662 -4081 303 -1926 -10891 -3130 10387 14912
2156 14912 8743 -6801 -12446 -7188 -11440 356 2553 -9867 10218 27388 32695 25753 9610
2143 9610 11167 12094 24504 30017 33567 17055 -8667 -11070 -4311 -11268 -13362 -15627 -2080 12988
2129 12988 3917 8685 3251 3524 10419 2024 -8673 -17661 -12745 -10729 -7839 -7845 -3663 9379 16110
2114 16110 10776 3446 719 -3204 920 -3497 -5139 7431 9673 19897 13858 13090 17618 21713
2100 21713 12316 -1034 12735 18336 8866 1231 -7649 -3575 10876 8854 12514 14068 13374 4962
2086 4962 -3250 -6550 -2348 10895 12693 7745 3205 -467 3453 -4152 -8285 -11183 -28874 -32252
2072 -32252 -21919 -20977 -21903 -5021 -2985 -7937 -6560 2530 9989 4839 -97 -18075 -11969 -236
2058 -236 7654 9360 4388 4338 10263 -1160 -2899 16641 18616 14239 18721 21601 13995 1809 459
2043 459 13084 760 -6237 -3571 -6147 8249 14776 15772 14850 3859 5862 7363 6289 -2482 3871
2028 3871 3232 -2552 -5157 -4638 6603 -1448 -12711 19 9388 3452 -8224 -13164 -2453 -5476
2014 -5476 -4643 -1766 -2687 9761 16303 6097 6550 -8870 -2439 -4767 1871 13947 21511 23147 14275
1999 14275 9125 9214 -9769 -27747 -9373 2053 9064 8701 -4002 -6706 8969 13785 3572 -2183
1985 -2183 -6711 -9591 4142 9494 9382 2955 -3362 -1383 989 2245 12094 7912 908 7141 8125
1970 8125 8841 5608 16604 22740 17770 5236 3167 -2964 7296 15798 23957 20530 5444 8199
1956 8199 2665 4544 12989 17582 17377 20354 7090 -3357 -2833 3808 9527 -1421 -3276 -6869 -1577
1941 -1577 5308 5742 717 9319 20217 14132 13621 9720 18091 13985 8988 13802 10670 3245 -8812
1926 -8812 -10667 -9996 -22859 -24213 -28498 -17268 -13677 -18111 -8514 -566 -3853 -550 -6856 -17019
1912 -17019 -10144 -12021 9128 19699 11113 -2403 -192 -4858 -9665 -11988 -775 9571 14203
1899 14203 18830 18837 18069 3466 -4871 5751 11628 12096 9807 8427 -10452 -22251 -17028 -6457 8907
1884 8907 10522 1955 -12672 -20492 -5267 -9430 -21202 -24559 -18056 -22774 -13625 -9001 -18134 -19984
1870 -19984 -13786 -8454 -18538 -33255 -32003 -18915 131 -3274 -22230 -19236 -1777 518 -2029
1857 -2029 -13316 -3270 -12131 -15094 -9619 -19736 -16478 -21453 -9776 300 -11038 -13269 -22432
1844 -22432 -21019 -12792 -987 5315 3695 11007 14508 14699 17002 16336 11980 8136 14378 10893 -865
1829 -865 -9899 -13201 -7811 -7008 -14597 -13642 -17423 -15467 -8427 -4191 -4862 -12313 -6463 -4636 -9204 -8909
1813 -8909 2278 -889 768 -2932 -6461 -625 1012 -2109 599 5475 3225 -9426 -7968 2550
1799 2550 9695 8523 5755 2411 3426 7854 18410 6779 3607 13107 17326 -10121 -15159 -12140
1785 -12140 -5199 3902 -1709 159 3459 14837 20851 17442 11752 4109 5203 12747 14296 14664 19178
1770 19178 22066 1559 -9768 -15674 -5598 -7378 -11968 -10879 -5134 47 -4040 -18159 -10749 -3031
1756 -3031 -1506 11755 22203 17118 14052 3484 6013 13992 1857 -8887 -19128 -10208 898
1743 898 -8549 -13485 -19532 -19089 -28412 -24375 -25118 -18868 -10608 669 6469 13557 3955 -6110 -22020
1728 -22020 -17692 4342 16005 20230 11458 -11998 -26873 -36047 -43009 -36396 -24493 -21007 -21928 -15630
1714 -15630 -12445 -7258 3666 8564 12380 24392 24077 14506 -15130 -20360 -19161 -2896 1160 8606
1700 8606 15214 4139 -7569 325 3277 1591 -4763 -4992 2388 -3403 -3588 3728 -2111 -12053 -19130
1685 -19130 -9685 13084 7211 -8450 -4814 3863 22238 21254 -317 -27796 -29163 -23821 -3227
1672 -3227 15209 8059 -426 -11046 -25705 -26945 -21731 -22776 -16840 -11257 -12168 -8114 6405 12324
1658 12324 6573 -293 -8439 8201 14746 11836 233 -4502 -3290 3323 7633 15373 9643 -6658
1644 -6658 -2991 -345 -14596 -17151 -5037 8703 -3802 2076 6730 -8336 -5827 -1854 -9278 -5865
1630 -5865 -9138 -7470 -7693 -7916 -8141 -5137 4547 14720 5430 6248 2061 -10123 -2955 -4144 -18553
1615 -18553 -8398 -7817 1670 10554 5214 649 7402 13480 27567 23143 7856 7675 6566 171
1601 171 -6531 -1331 -3080 4845 -1322 -12144 -5742 10668 14741 10357 3226 17218 13125 -5500
1587 -5500 -14914 -10891 -8510 -4480 10727 5044 -3296 8090 -1763 -18572 -25133 -7020 -7433 8008
1573 8008 5147 8566 4488 2700 -6363 -13676 -2177 7527 12833 10305 -1447 -15854 -15226 -5973
1559 -5973 -8376 -2512 2311 -938 410 3916 -10190 -9366 -1746 -7219 -11419 3732 -154 -9003 -18322
1544 -18322 -10859 -21974 -32483 -14628 -11810 -6375 -8741 -6525 -7695 -5420 8370 18079 37757
1531 37757 35859 30959 38554 42488 25659 5472 2634 848 -6620 -12381 -14186 -12017 -10963 -17463
1517 -17463 -16162 2909 11860 10594 -4262 -30467 -39946 -39434 -37326 -34820 -26978 -25194 -17512 -3973
1503 -3973 -6876 -12118 -5675 -3780 -13255 -16394 -2905 462 3431 8042 9949 4858 8546 663 -9646
1488 -9646 -15349 -10639 -11205 -17917 -16134 -15743 -17829 -16846 -11067 -7787 -10363 -11725 -15984 -7362 6463
1473 6463 12307 18389 -1574 -11795 -13877 -12771 -7056 -4344 -5930 -17011 -19976 -23908 -17970 -6813
1459 -6813 1670 -13332 -22010 -14882 -17766 -25042 -12354 -10181 -1238 3539 -4840 -5472 4199 -8755
$$ [...]
##END NTUPLES=NMR SPECTRUM
##END=
