##TITLE=Analysis number 319142
Compound Code mo 07740
Project Code adrs
Chemist Name chemcon
##JCAMPDX= 6.0         $$ Bruker NMR JCAMP-DX V2.0
##DATA TYPE= NMR SPECTRUM
##DATA CLASS= NTUPLES
##ORIGIN= Bruker BioSpin GmbH
##OWNER= nmr
$$ XWIN-NMR		Version 3.5
$$ Wed May  3 14:30:20 2006 GMT Daylight Time (UT+1h)  MAYBRIDGE\nmr@NMR_250MHZ
##.OBSERVE FREQUENCY= 250.131544655141
##.OBSERVE NUCLEUS= ^1H
##.ACQUISITION MODE= SIMULTANEOUS (DQD)
##.ACQUISITION SCHEME= undefined
##.AVERAGES= 16
##.DIGITISER RES= 18
##SPECTROMETER/DATA SYSTEM= dpx250
##.PULSE SEQUENCE= zg30
##.SOLVENT NAME= DMSO
##.SHIFT REFERENCE= (INTERNAL, DMSO, 0, 16.522)
##AUDIT TRAIL= $$ (NUMBER, WHEN, WHO, WHERE, WHAT)
$$ ##TITLE= Audit trail, XWIN-NMR		Version 3.5
$$ ##JCAMPDX= 5.01
$$ ##ORIGIN= Bruker BioSpin GmbH
$$ ##OWNER= nmr
$$ C:\u/data/dgb/nmr/ADRS/3760/pdata/1/auditp.txt
$$ ##AUDIT TRAIL=  $$ (NUMBER, WHEN, WHO, WHERE, WHAT)
(   1,<2006-05-03 14:29:55.49 +100>,<MAYBRIDGE\nmr>,<NMR_250MHZ>,
      <created by zg, POWCHK disabled, PULCHK disabled
       configuration hash MD5:
       84 BC 41 DB A1 6E 1D 46 DA 25 12 A5 C1 ED C5 3A
       data hash MD5: 64K
       11 92 43 2D 6B 6A B6 2C 5D BC 35 DC 44 41 29 71>)
(   2,<2006-05-03 14:30:11.90 +100>,<MAYBRIDGE\nmr>,<NMR_250MHZ>,
      <Start of raw data processing
       ef LB = 0.3 FT_mod = 6 PKNL = 1 SI = 32K 
       data hash MD5: 32K
       CE E8 3B 74 D1 B7 8A 18 5D C0 72 52 CA 10 BD 2D>)
(   3,<2006-05-03 14:30:13.46 +100>,<MAYBRIDGE\nmr>,<NMR_250MHZ>,
      <apk 
       data hash MD5: 32K
       DF 11 93 2A 8C 12 3D 78 BF 16 AE E2 10 3B 6D 63>)
(   4,<2006-05-03 14:30:14.24 +100>,<MAYBRIDGE\nmr>,<NMR_250MHZ>,
      <abs ABSG = 5 
       data hash MD5: 32K
       36 D4 04 59 AB 78 7D 0F F0 B4 5A 13 47 1B 1B 70>)
$$ ##END=
$$ 
$$ hash MD5
$$ DA 33 9E 80 51 D2 4B 4C 93 B0 2D F2 8C BA 67 1F
##$RELAX= 
##$RELAX= 
##$RELAX= 
##$RELAX= 
##$RELAX= 
##$RELAX= 
##$RELAX= 
$$ Bruker specific parameters
$$ --------------------------
##$DU= <C:\u>
##$EXPNO= 3760
##$NAME= <ADRS>
##$PROCNO= 1
##$TYPE= <nmr>
##$USER= <dgb>
##$AMP= (0..31)
100 100 100 100 100 100 100 100 100 100 100 100 100 100 100 100 100 100 
100 100 100 100 100 100 100 100 100 100 100 100 100 100 
##$AQSEQ= 0
##$AQ_mod= 3
##$AUNM= <au_zg>
##$AUTOPOS= <38 >
##$BF1= 250.13
##$BF2= 250.13
##$BF3= 250.13
##$BF4= 250.13
##$BF5= 500.13
##$BF6= 500.13
##$BF7= 500.13
##$BF8= 500.13
##$BYTORDA= 1
##$CFDGTYP= 0
##$CFRGTYP= 5
##$CHEMSTR= <none>
##$CNST= (0..31)
1 1 145 1 1 1 1 1 1 1 1 1 1 1 1 1 1 1 1 1 1 1 1 1 1 1 1 1 1 1 1 1 
##$CPDPRG= <>
##$CPDPRG1= <>
##$CPDPRG2= <>
##$CPDPRG3= <>
##$CPDPRG4= <mlev>
##$CPDPRG5= <mlev>
##$CPDPRG6= <mlev>
##$CPDPRG7= <mlev>
##$CPDPRG8= <mlev>
##$CPDPRGB= <>
##$CPDPRGT= <>
##$D= (0..31)
0 1 0 0 0 0 0 0 0 0.06 0 0 0 0 0 0 0.0002 0 0 0 0 0 0 0 0 0 0 0 0 0 0 
0 
##$DATE= 1146662994
##$DBL= (0..7)
120 120 120 120 120 120 120 120 
##$DBP= (0..7)
150 150 150 150 150 150 150 150 
##$DBP07= 0
##$DBPNAM0= <>
##$DBPNAM1= <>
##$DBPNAM2= <>
$$ [...]
##$SUBNAM6= <"">
##$SUBNAM7= <"">
##$SUBNAM8= <"">
##$SUBNAM9= <"">
##$SW= 20.6930455092707
##$SWIBOX= (0..15)
0 0 3 0 0 0 0 0 0 0 0 0 0 0 0 0 
##$SW_h= 5175.983436853
##$TD= 65536
##$TD0= 1
##$TE= 296.16
##$TE2= 300
##$TE3= 300
##$TEG= 300
##$TL= (0..7)
0 120 120 120 120 120 120 120 
##$TP= (0..7)
150 150 150 150 150 150 150 150 
##$TP07= 0
##$TPNAME0= <>
##$TPNAME1= <>
##$TPNAME2= <>
##$TPNAME3= <>
##$TPNAME4= <>
##$TPNAME5= <>
##$TPNAME6= <>
##$TPNAME7= <>
##$TPOAL= (0..7)
0.5 0.5 0.5 0.5 0.5 0.5 0.5 0.5 
##$TPOFFS= (0..7)
0 0 0 0 0 0 0 0 
##$TUNHIN= 0
##$TUNHOUT= 0
##$TUNXOUT= 0
##$USERA1= <user>
##$USERA2= <user>
##$USERA3= <user>
##$USERA4= <user>
##$USERA5= <user>
##$V9= 5
##$VALIST= <valist>
##$VCLIST= <CCCCCCCCCCCCCCC>
##$VD= 0
##$VDLIST= <DDDDDDDDDDDDDDD>
##$VPLIST= <PPPPPPPPPPPPPPP>
##$VTLIST= <TTTTTTTTTTTTTTT>
##$WBST= 1024
##$WBSW= 4
##$XGAIN= (0..3)
0 0 0 0 
##$XL= 0
##$YL= 0
##$YMAX_a= 359334
##$YMIN_a= -547592
##$ZGOPTNS= <>
##$ZL1= 120
##$ZL2= 120
##$ZL3= 120
##$ZL4= 120
##$ABSF1= 16.522
##$ABSF2= -4.171173
##$ABSG= 5
##$ABSL= 3
##$ALPHA= 0
##$AQORDER= 0
##$ASSFAC= 0
##$ASSFACI= 0
##$ASSFACX= 0
##$ASSWID= 0
##$AUNMP= <proc_1d>
##$AZFE= 0.1
##$AZFW= 0.1
##$BCFW= 0
##$BC_mod= 0
##$BYTORDP= 0
##$COROFFS= 0
##$CY= 12.5
##$DATMOD= 1
##$DC= 0
##$DFILT= <>
##$DTYPP= 0
##$F1P= 14.0000005364418
##$F2P= -0.99999901652339
##$FCOR= 0.5
##$FTSIZE= 32768
##$FT_mod= 6
##$GAMMA= 0
##$GB= 0
##$INTBC= 1
##$INTSCL= 1
##$ISEN= 128
##$LB= 0.3
##$LEV0= 0
##$LPBIN= 0
##$MAXI= 10000
##$MC2= 0
##$MEAN= 0
##$ME_mod= 0
##$MI= 0
##$NCOEF= 0
##$NC_proc= -5
##$NLEV= 6
##$NOISF1= 0
##$NOISF2= 0
##$NSP= 0
##$NTH_PI= 0
##$NZP= 0
##$OFFSET= 16.522
##$PC= 1
##$PHC0= 165.658
##$PHC1= 4.124941
##$PH_mod= 1
##$PKNL= yes
##$PPARMOD= 0
##$PSCAL= 4
##$PSIGN= 0
##$REVERSE= no
##$SF= 250.13
##$SI= 32768
##$SIGF1= 0
##$SIGF2= 0
##$SINO= 400
##$SIOLD= 32768
##$SREGLST= <1H.DMSO>
##$SSB= 0
##$STSI= 32768
##$STSR= 0
##$SW_p= 5175.98343685301
##$SYMM= 0
##$S_DEV= 0
##$TDeff= 65536
##$TDoff= 0
##$TI= <Analysis number 999999
Compound Code 99
Book Reference 9
Project Code 9>
##$TILT= no
##$TM1= 0
##$TM2= 0
##$TOPLEV= 0
##$USERP1= <user>
##$USERP2= <user>
##$USERP3= <user>
##$USERP4= <user>
##$USERP5= <user>
##$WDW= 1
##$XDIM= 32768
##$YMAX_p= 380697051
##$YMIN_p= -708318
$$ End of Bruker specific parameters
$$ ---------------------------------
##NTUPLES= NMR SPECTRUM
##VAR_NAME=  FREQUENCY,     SPECTRUM/REAL,   SPECTRUM/IMAG
##SYMBOL=    X,             R,               I
##VAR_TYPE=  INDEPENDENT,   DEPENDENT,       DEPENDENT
##VAR_FORM=  AFFN,          ASDF,            ASDF
##VAR_DIM=   32768,         32768,           32768
##UNITS=     HZ,            ARBITRARY UNITS, ARBITRARY UNITS
##FACTOR=    0.157963299565203, 1,           1
##FIRST=     4132.6476996994, 0,             0
##LAST=      -1043.33573715361, 0,           0
##MIN=       -1043.33573715361, -708318,     0
##MAX=       4132.6476996994, 380697051,     0
$$ Real data points
##PAGE= N=1
##DATA TABLE= (X++(R..R)), XYDATA
$$ [...]
$$ plain form
15513 212870 105120 -43058 -60627 55864 50657 -54835 -1052 -10726 -91360 -294435 -295050
15502 -295050 -199398 -345235 -279459 -293187 -338286 -467830 -313918 -25133 -157537 -311698
15492 -311698 -240014 -100266 -49657 -134314 -458316 -666673 -471039 -454537 -430926 -465020 -372962
15481 -372962 -334736 -271791 -32435 -72908 -245542 -416287 -364623 -155876 -151013 -298805 -310338
15470 -310338 -154284 1754 -59360 -283822 -430074 -369037 -284505 -158684 -175399 25708
15460 25708 118056 109063 157662 234340 241570 176125 176343 33345 18302 62978 77283 11658
15448 11658 -10116 63172 90731 240154 167635 182779 12423 -35467 -9737 -24890 -26317
15437 -26317 107834 236263 173284 183337 49753 -40256 -117762 -154107 -143747 -26750 -104491
$$ packed form
15513B12870j07750j48178j7569J16491n207j05492N3783r674q0634k03075o15
15502b95050R5652j45837O5776j3728m5099j29544J53912K88785j32404j54161
15492c11698P1684J39748N0609q4657l24002k08357J95634J6502K3611l4094R2058
15481c72962L8226O2945K39356m0473j72634j70745N1664K08747M863j47792j1533
15470c10338J56054J56038o1114k24462j46252O1037Q4532J25821j6715K01107
15460B5708R2348q993M8599P6678P230o5445K18j42998j5043M4676J4305o5625
15448A1658k1774P3288K7559J49423p2519J5144j70356m7890K5730j5153j427
15437b6317J34151J28429o2979J0053j33584r0009p7506l6345J0360J16997p7741
$$ plain form
15426 -104491 -29706 66696 66276 -198292 -285408 -216473 -128926 33993 -128030 -29951 44733
15415 44733 106138 -4455 -138339 -228261 -399911 -378482 -422519 -336984 -430944 -312477 -82396
15404 -82396 -173530 -250118 -272127 -211627 -105112 -125847 -21571 164507 -136751 -210995 9325
15393 9325 57167 168114 281068 186872 12840 -139425 -127094 -141607 -202637 -391622 -463435
15382 -463435 -243553 -124140 -245154 -236114 -111185 -42549 40227 52027 46515 12794 -116525
15371 -116525 -307783 -191068 -191454 -233273 -122643 -87229 -128825 -17834 48815 -78672 -183384
15360 -183384 -73482 36494 -36064 -232428 -198710 -18272 49486 13787 48185 19135 102581
15349 102581 56844 59743 -47671 -191703 -254304 -252360 -532479 -497128 -219525 -195190 3319
$$ packed form
15426a04491P4785R6402m20k64568q7116O8935Q7547J62919j62023R8079P4684
15415D4733O1405j10593j33884q9922j71650K1429m4037Q5535r3960J18467K30081
15404h2396r1134p6588k2009O0500J06515k0735J04276J86078l01258p4244K20320
15393I325M7842J10947J12954r4196j74032j52265J2331j4513o1030j88985p1813
15382d63435K19882J19413j21014R040J24929O8636Q2776J1800n512l3721j29319
15371a16525j91258J16715l86m1819J10630L5414m1596J10991O6649j27487j04712
15360a83384J09902J09976p2558j96364L3718J80438O7758l5699L4398k9050Q3446
15349A02581m5737K899j07414j44032o2601J944k80119L5351K77603K4335J98509
$$ plain form
15338 3319 190725 297376 274616 350160 251118 351609 289096 -45128 -200847 -45748 -41979
15327 -41979 138433 104156 -143221 -204595 775 124527 84427 11983 -91865 68903
15317 68903 42157 58365 311145 415265 193404 -44798 -104063 51229 119289 91886 -375
15306 -375 112225 360223 569496 483127 258517 37412 67282 65206 166644 97028 -16750
15295 -16750 141085 200809 236808 196173 -43314 -251298 -302719 -86399 53171 237644
15285 237644 213588 50247 145540 367116 285885 248646 97111 -4654 -61412 -71526 136771
15274 136771 267990 221997 152419 269472 187734 3797 44173 214471 322281 300383
15264 300383 106142 33513 48908 56822 -144941 -336603 -363735 -203197 -46028 -1154 -89058
$$ packed form
15338C319J87406J06651k2760P5544r9042J00491o2513l34224j55719J55099L769
15327d1979J80412l4277k47377o1374K05370J23752m0100p2444j03848J60768
15317F8903k6746J6208K52780J04120k21861k38202n9265J55292O8060k7403r2261
15306c75J12600K47998K09273q6369k24610k21105K9870k076J01438o9616j13778
15295a6750J57835N9724L5999m0635k39487k07984n1421K16320J39570J84473
15285B37644k4056j63341R5293K21576q1231l7239j51535j01765n6758j0114K08297
15274A36771J31219m5993o9578J17053q1738j83937M0376J70298J07810k1898
15264C00383j94241p2629J5395P914k01763j91662k7132J60538J57169M4874q7904
$$ plain form
15253 -89058 -119849 401 -25727 95877 -40444 -18755 19673 100910 65751 -4390 228198
15242 228198 255229 66523 94619 220959 357143 402541 294087 260724 80070 134996
15232 134996 340397 430276 299461 85844 104392 85381 537 172648 36889 -193866
15222 -193866 -146755 -628 -9765 146173 314757 244846 285020 98609 -53435 90746
15212 90746 18665 -176535 -65288 244834 140842 -143794 -162361 -93941 -79739 65100
15202 65100 99804 -51653 -98060 140386 478770 444924 403094 343175 219919 307154 201406
15191 201406 167090 244253 158987 275334 380197 327480 74002 -141794 -179039 -395217
15181 -395217 -290138 -224595 -221190 -23050 60133 70723 -127399 -194044 -103006 -54390 101764
$$ packed form
15253h9058l0791J20250k6128J21604j36321K1689L8428Q1237l5159p0141K32588
15242B28198K7031j88706K8096J26340J36184M5398j08454l3363j80654N4926
15232A34996K05401Q9879j30815k13617J8548j9011q4844J72111j35759k30755
15222a93866M7111J46127r137J55938J68584o9911M0174j86411j52044J44181
15212I0746p2081j95200J11247L10122j03992k84636j8567O8420J4202J44839
15202F5100L4704j51457m6407K38446L38384l3846m1830n9919j23256Q7235j05748
15191B01406l4316P7163q5266J16347J04863n2717k53478k15796l7245k16178
15181c95217J05079O5543L405J98140Q3183J0590j98122o6645R1038M8616J56154
$$ plain form
15170 101764 407 -95597 -25774 -31957 -13001 222213 258849 99785 197641 225197 313428
15159 313428 111107 -76866 -113731 108599 520419 596989 613148 677093 639193 637850 404048
15148 404048 389659 928731 912673 891792 796224 739201 689613 574206 510050 612082 608004
15137 608004 759650 1127711 1144842 828745 362740 153381 452898 519299 492695 535570
15127 535570 519169 350156 302741 196061 318842 452835 451510 314155 243406 335493 465970
15116 465970 545042 321606 226910 70409 64835 89922 49256 52699 -97233 2049 197601
15105 197601 109006 19422 106365 78161 90347 70653 181184 303579 89144 -56267 -22666
15094 -22666 -237201 -329646 -318648 -101955 125118 10226 -64519 -92601 -13748 4837 -32853
$$ packed form
15170A01764j01357r6004O9823o183J8956K35214L6636j59064R7856K7556Q8231
15159C13428k02321j87973l6865K22330M11820P6570J6159O3945l7900j343k33802
15148D04048j4389N39072j6058k0881r5568n7023m9588j15407o4156J02032m078
15137F08004J51646L68061J7131l16097m66005k09359K99517O6401k6604M2875
15127E35570j6401j69013m7415j06680J22781J33993j325j37355p0749R2087J30477
15116D65970P9072k23436r4696j56501n574K5087m0666L443j49932R9282J95552
15105A97601q8595q9584Q6943k8204J2186j9694J10531J22395k14435j45411L3601
15094b2666k14535r2445J0998K16693K27073j14892p4745k8082P8853J8585l7690
$$ plain form
15083 -32853 67596 30101 -278222 -100625 80866 157436 429680 541337 567287 536524
15073 536524 609893 373223 32787 -7732 -44537 184545 461068 490105 374650 253726
15063 253726 -24976 -105189 -44597 127418 358697 673659 422512 244250 250936 339425
15053 339425 421170 415905 518423 568369 701202 558016 342301 564376 659644 483116
15043 483116 420845 736764 714639 485108 435846 689187 748790 715484 598372 656476 588975
15032 588975 601179 685044 553763 429303 437529 432347 468684 437356 200247 14435 36629
15021 36629 48710 281952 475128 428233 254915 65437 -47191 -14266 105331 160537
15011 160537 126150 233091 292751 261475 310179 204009 99289 226923 297715 396981 395762
$$ packed form
15083c2853J00449l7495l08323J77597J81491P6570K72244J11657K5950l0763
15073E36524P3369k36670l40436m0519l6805K29082K76523K9037j15455j20924
15063B53726k78702q0213O0592J72015K31279L14962k51147j78262O686Q8489
15053C39425Q1745n265J02518M9946J32833j43186k15715K22075R5268j76528
15043D83116o2271L15919k2125k29531m9262K53341N9603l3306j17112N8104o7501
15032E88975J2204Q3865j31281j24460Q226n182L6337l1328k37109j85812K2194
15021C6629J2081K33242J93176m6895j73318j89478j12628L2925J19597N5206
15011A60537l4387J06941N9660l1276M8704j06170j04720J27634P0792R9266j219
$$ plain form
15000 395762 323402 25641 236712 326885 328293 379594 129947 -78213 -164721 -103011 -59312
14989 -59312 26361 84361 58755 107253 301376 486413 446449 313766 393205 552211 538956
14978 538956 509122 552862 449771 264259 284736 434412 604409 545099 340001 328467
14968 328467 150563 116085 75245 202362 250414 144133 83110 21820 194595 246853 263304
14957 263304 391686 187762 170017 301974 369091 327820 142217 44999 -42117 124994
14947 124994 464538 396742 493319 393089 278372 224898 200470 220074 298584 254789 225840
14936 225840 302325 377949 264647 70753 73991 31597 214745 211267 165522 299047 298912
14925 298912 204033 13535 1641 45051 92441 140012 435336 492753 423245 304123 226226
$$ packed form
15000C95762p2360k97761K11071R0173J408N1301k49647k08160q6508O1710M3699
14989e9312Q5673N8000k5606M8498J94123J85037l9964j32683P9439J59006j3255
14978E38956k9834M3740j03091j85512K0477J49676J69997n9310k05098j1534
14968C28467j77904l4478m0840J27117M8052j06281o1023o1290J72775N2258J6451
14957B63304J28382k03924j7745J31957O7117m1271j85603r7218q7116J67111
14947A24994L39544o7796R6577j00230j14717n3474k4428J9604P8510m3795k8949
14936B25840P6485P5624j13302j93894L238m2394J83148l478m5745J33525j35
14925B98912r4879j90498j1894M3410M7390M7571K95324N7417o9508j19122p7897
$$ plain form
14914 226226 92150 188769 356599 497376 367053 233216 275107 485417 407335 298659
14904 298659 424880 263295 406669 408856 262017 310848 333250 271327 238578 143646 216966
14893 216966 462726 490455 455043 598213 572093 444773 376362 325686 300145 297966 177334
14882 177334 173005 437155 529320 584710 518527 432905 434257 425668 383441 277763 126982
14871 126982 4767 96176 264263 248565 169794 368391 285889 215122 354682 469168
14861 469168 528472 427787 247359 61257 85703 260516 315586 188260 104127 30601
14851 30601 3858 92712 -10512 -39792 291011 319612 345363 622897 663620 550632 579714
14840 579714 527051 496370 545909 435064 412392 316386 474973 485570 281798 161210 185681
$$ packed form
14914B26226j34076R6619J67830J40777j30323j33837M1891K10310p8082j08676
14904B98659J26221j61585J43374K187j46839M8831K2402o1923l2749r4932P3320
14893B16966K45760K7729l5412J43170k6120j27320o8411n0676k5541k179j20632
14882A77334m329K64150R2165N5390o6183q5622J352q589m2227j05678j50781
14871A26982j22215R1409J68087j5698p8771J98597q2502p0767J39560J14486
14861D69168N9304j00685j80428j86102K4446J74813N5070j27326q4133p3526
14851C0601k6743Q8854j03224k9280L30803K8601K5751K77534M0723j12988K9082
14840E79714n2663l0681M9539j10845k2672r6006J58587J0597k03772j20588K4471
$$ plain form
14829 185681 313377 416704 297275 119141 232004 354256 449321 429074 456641 444620
14819 444620 473801 454032 439335 393578 359284 343350 338543 518713 632974 674004 965861
14808 965861 1111940 914320 799366 739213 696551 644650 742385 974394 903664 798242
14798 798242 787932 926604 934921 846253 972470 1399878 1474097 1348085 1258509 1348493 1341132
14787 1341132 1277067 1100585 976088 911021 993739 1188857 1366095 1505781 1462244 1522461
14777 1522461 1495520 1552391 1607068 1723962 1888133 1783695 1822983 1955929 1968141 2131237
14767 2131237 2247556 2094851 2132314 2310764 2253397 2466569 2846193 2833129 2641056 2597928
14757 2597928 2585823 2557206 2461004 2760034 3155288 3289056 3496815 3660021 3652410 3764522
$$ packed form
14829A85681J27696J03327j19429j78134J12863J22252R5065k0247K7567j2021
14819D44620K9181j9769j4697m5757l4294j5934m807J80170J14261M1030K91857
14808I65861J46079j97620j14954o0153m2662n1901R7735K32009p0730j05422
14798G98242j0310J38672Q317q8668J26217M27408P4219j26012q9576Q9984p361
14787A341132o4065j76482j24497o5067Q2718J95118J77238J39686m3537O0217
14777A522461k6941N6871N4677J16894J64171j04438L9288J32946J2212J63096
14767B131237J16319j52705L7463J78450n7367K13172L79624j3064j92073m3128
14757B597928j2105k8617r6202K99030L95254J33768K07759J63206p611J12112
$$ plain form
14747 3764522 4220940 4590200 4735059 4932657 5332138 5595101 5775611 6038887 6386092
14738 6386092 6849708 7253029 7733473 8281101 8952706 9354076 9803766 10330891 11262407
14729 11262407 12223024 13170693 14475138 15644633 16959946 18443493 20373459 22499004
14721 22499004 24857998 27336037 30291536 33778055 37691518 42545255 48323098 55054663
14713 55054663 62741148 71956777 83134166 96492980 112148981 129984809 149047538
14706 149047538 168080561 185493932 199354669 207699785 209313929 203632614 192163625
14699 192163625 176666259 159563860 142605971 127175929 113632378 101969428 92076262
14692 92076262 83719200 76464430 70173292 65018134 60547343 56735467 53475826 50345806
$$ packed form
14747C764522M56418L69260J44859J97598L99481K62963J80510K63276L47205
14738F386092M63616M03321M80444N47628O71605M01370M49690N27125R31516
14729A1262407R60617R47669J304445J169495J315313J483547J929966K125545
14721B2499004K358994K478039K955499L486519L913463M853737N777843O731565
14713E5054663P686485R215629J1177389J3358814J5656001J7835828J9062729
14706A49047538J9033023J7413371J3860737Q345116J614144n681315j1468989
14699A92163625j5497366j7102399j6957889j5430042j3543551j1662950r893166
14692I2076262q357062p254770o291138n155158m470791l811876l259641l130020
$$ plain form
14684 50345806 47601677 45178873 42916244 40667505 38557244 36833595 35285044 33848462
14676 33848462 32499294 31150409 29768315 28613782 27715494 26863142 26060573 25070773 24163592
14667 24163592 23423307 22740238 22087778 21486617 20762994 20192052 19611132 19034185 18516515
14658 18516515 18061036 17524011 17216282 16844330 16476295 15935918 15510312 14960877 14415620
14649 14415620 13981266 13681177 13324042 13204585 13079037 12800839 12575042 12193506 11940814
14640 11940814 11664817 11439622 11303673 10964176 10668231 10509944 10351680 10208524 10090934
14631 10090934 9760894 9502444 9602440 9526482 9124772 8812143 8625076 8556511 8509474 8504130
14621 8504130 8219065 8200140 8135301 7836405 7468027 7261902 7208991 7251696 7101918 6713118
$$ packed form
14684E0345806k744129k422804k262629k248739k110261j723649j548551j436582
14676C3848462j349168j348885j382094j154533q98288q52352q02569r89800r07181
14667B4163592p40285o83069o52460o01161p23623n70942n80920n76947n17670
14658A8516515m55479n37025l07729l71952l68035n40377m25606n49435n45257
14649A4415620m34354l00089l57135j19457j25548k78198k25797l81536k52692
14640A1940814k75997k25195j35949l39497k95945j58287j58264j43156j17590
14631A0090934l30040k58450R9996p5958m01710l12629j87067o8565m7037n344
14621H504130k85065j8925o4839k98896l68378k06125n2911M2705j49778l88800
$$ plain form
14611 6713118 6640852 6595586 6382896 6201094 6172427 6061911 5736004 5680081 5977244 6094134
14601 6094134 5815228 5762051 5910761 5844705 5599653 5433418 5424032 5381033 4966581 4763412
14591 4763412 4892248 4835056 4766258 4595431 4539543 4650250 4624116 4337286 4370839 4097677
14581 4097677 4126700 4389076 4262706 4083210 4085824 4123635 4162831 3863549 3621180 3493185
14571 3493185 3341967 3271954 3116458 3097271 2978404 3005382 2885172 2701877 2688779 2694659
14561 2694659 2875893 2985599 2992278 2930338 2795424 2706501 2520869 2609068 2663497 2492475
14551 2492475 2349158 2402715 2458395 2321174 2268687 2029676 1705281 1577246 1753704 2065779
14541 2065779 2130288 2052611 1993101 2028371 1995160 2200078 2240571 2029998 1828855 1875049 1858823
$$ packed form
14611F713118p2266m5266k12690j81802k8667j10516l25907n5923K97163J16890
14601F094134k78906n3177J48710o6056k45052j66235r386m2999m14452k03169
14591D763412J28836n7192o8798j70827n5888J10707k6134k86830L3553k73162
14581D097677K9023K62376j26370j79496K614L7811L9196k99282k42369j27995
14571C493185j51218p0013j55496j9187j18867K6978j20210j83295j3098N880
14561B694659J81234J09706O679o1940j34914q8923j85632Q8199N4429j71022
14551B492475j43317N3557N5680j37221n2487k39011l24395j28035J76458L12075
14541B065779O4509p7677n9510L5270l3211K04918M0493k10573k01143M6194j6226
$$ plain form
14530 1858823 1844065 1918012 1941591 1892467 1919756 1908095 1727849 1634313 1743266 1757618 1665854
14519 1665854 1378585 1368450 1474760 1433184 1549727 1600627 1622298 1604730 1368860 1260066
14509 1260066 1257635 1182076 1279315 1046487 1043314 1143815 1252910 1540004 1542918 1428475 1282070
14498 1282070 1104783 1069662 916538 1038162 1125046 1232746 1175600 1214760 1271948 1289046
14488 1289046 1192556 1086672 1082700 1055744 896343 866184 969679 1124911 1152257 1222616 1140216
14477 1140216 972144 682556 513816 523126 655209 749139 786953 1026111 1098414 844625
14467 844625 815696 834116 988779 1004774 912033 891305 892215 981379 1060496 942899 871719
14456 871719 862068 893608 902034 867962 826569 1053726 1053655 1047621 806782 611705 471484 531128
$$ packed form
14530A858823j4758P3947K3579m9124K7289j1661j80246r3536J08953J4352r1764
14519A665854k87269j0135J06310m1576J16543N0900K1671j7568k35870j08794
14509A260066k431p5559R7239k32828l173J00501J09095K87094K914j14443j46405
14498A282070j77287l5121j53124J21624Q6884J07700n7146L9160N7188J7098
14488A289046r6490j05884l972k6956j59401l0159J03495J55232K7346P0359q2400
14477A140216j68072k89588j68740R310J32083R3930L7814K39158P2303k53789
14467H44625k8929J8420J54663J5995r2741k0728R10Q9164P9117j17597p1180
14456H71719r651L1540Q426l4072m1393K27157p1o034k40839j95077j40221N9644
$$ plain form
14444 531128 502030 506061 664751 613778 591310 825501 768894 478270 396921 441411 432360
14433 432360 376561 408766 500790 388436 345516 503273 731615 987742 1143336 843472
14423 843472 652875 435541 549500 715389 602120 440895 439866 291795 393017 464237
14413 464237 428649 636962 606373 644059 405680 422489 509449 559416 596396 611960 661086
14402 661086 623285 751454 638152 642652 606312 472958 441718 341803 232246 57776 154604
14391 154604 251668 411951 735130 664741 694240 678590 469610 223719 253227 355488
14381 355488 439313 321379 434698 436531 536661 483839 214789 213589 163304 379901 601988
14370 601988 349256 276457 399068 365488 434117 454912 515306 347858 293918 379971 471857
$$ packed form
14444E31128k9098M031J58690n0973k2468K34191n6607k90624q1349M4490r051
14433D32360n5799L2205R2024j12354m2920J57757K28342K56127J55594k99864
14423H43472j90597k17334J13959J65889j13269j61225j029j48071J01222P1220
14413D64237l5588K08313l0589L7686k38379J6809Q6960M9967L6980J5564M9126
14402F61086l7801J28169j13302M500l6340j33354l1240r9915j09557j74470R6828
14391A54604R7064J60283L23179p0389K9499j5650k08980k45891K9508J02261
14381C55488Q3825j17934J13319J833J00130n2822k69050j200n0285K16597K22087
14370F01988k52732p2799J22611l3580O8629K0795O0394j67448n3940Q6053R1886
$$ plain form
14359 471857 638622 651804 673593 785120 744535 666139 614936 542892 451489 420461 629001
14348 629001 800430 720596 359147 195195 322623 354852 390736 575383 434680 250448
14338 250448 262391 86586 118504 82284 218033 385168 270530 160501 152459 116791 -14545
14327 -14545 -15363 22580 -77735 31070 343836 483595 306191 214009 256331 135684 17598
14316 17598 152835 431265 633672 573453 311085 315114 553572 426289 337873 349656 221532
14305 221532 259331 229672 388610 510482 367905 359014 375941 382342 330696 318810 271001
14294 271001 137985 265885 653520 780748 711160 716231 470595 509384 644662 627010
14284 627010 496823 276737 90493 206086 375655 394945 176291 187853 376408 258294
$$ packed form
14359D71857J66765J3182K1789J11527m0585p8396n1203p2044r1403l1028K08540
14348F29001J71429p9834l61449j63952J27428L2229L5884J84647j40703j84232
14338B50448J1943j75805L1918l6220J35749J67135j14638j10029q042l5668j31336
14327a4545q18L7943j00315J08805L12766J39759j77404r2182M2322j20647j18086
14316A7598J35237K78430K02407o0219k62368M029K38458j27283q8416J1783j28124
14305B21532L7799k9659J58938J21872j42577q891J6927O401n1646j1886m7809
14294B71001j33016J27900L87635J27228o9588N071k45636L8789J35278j7652
14284F27010j30187k20086j86244J15593J69569J9290k18654J1562J88555j18114
$$ plain form
14274 258294 334312 248834 230504 480347 587264 564399 402905 337942 208736 188183 244474
14263 244474 366943 578121 709478 708472 788737 840764 894494 985681 862100 732271 850218
14252 850218 924146 886490 905953 661454 489339 365577 292177 440138 544878 603490
14242 603490 549943 342179 389926 489677 426402 627429 736894 632470 380059 234377
14232 234377 204964 184267 348063 347122 280369 339250 351389 431757 295800 273508 334689
14221 334689 341298 295120 164065 179089 120599 47855 -48790 50070 291751 384560 156591
14210 156591 -20916 245904 455230 301087 225622 330705 328761 316255 206061 126861
14200 126861 152706 415653 323586 214683 13649 -62770 154107 126538 175961 200650 173892
$$ packed form
14274B58294P6018q5478j8330K49843J06917k2865j61494o4963j29206k0553N6291
14263B44474J22469K11178J31357j006Q0265N2027N3730R1187j23581j29829J17947
14252H50218P3928l7656J9463k44499j72115j23762p3400J47961J04740N8612
14242F03490n3547k07764M7747R9751o3275K01027J09465j04424k52411j45682
14232B34377k9413k0697J63796r41o6753N8881J2139Q0368j35957k2292O1181
14221C34689O609m6178j31055J5024n8490p2744r6645R8860K41681R2809k27969
14210A56591j77507K66820K09326j54143p5465J05083j944j2506j10194p9200
14200A26861K5845K62947r2067j08903k01034p6419K16877k7569M9423K4689k6758
$$ plain form
14189 173892 233320 298926 101297 -161973 -131191 31463 88212 55163 -16827 52865 5767
14178 5767 -100651 919 -158380 -226820 -168900 23289 34826 95714 71408 -71054 -29991
14167 -29991 80274 -103584 -154442 -141424 -158901 -72239 8698 -40623 -217820 59538 261104
14156 261104 161150 174453 39684 84244 49426 -48899 -41868 104925 249629 177140 143794
14145 143794 103906 146653 306591 258256 193330 89727 -31811 -192574 -334131 -268815
14135 -268815 24637 50998 90092 48728 143387 -41991 -211691 -174838 -58565 39053 188255
14124 188255 358454 418349 449365 317136 294277 154329 182542 440890 500907 436941 371297
14113 371297 195693 177042 153230 202718 245662 181168 231224 274411 313930 267355 123354
$$ packed form
14189A73892N9428O5606j97629k63270L0782J62654N6749l3049p1990O9692m7098
14178E767j06418J01570j59299o8440N7920J92189J1537O0888k4306j42462M1063
14167b9991J10265j83858n0858J3018j7477Q6662Q0937m9321j77197K77358K01566
14156B61104r9954J3303j34769M4560l4818r8325P031J46793J44704p2489l3346
14145A43794l9888M2747J59938m8335o4926j03603j21538j60763j41557O5316
14135b68815K93452K6361L9094m1364R4659j85378j69700L6853J16273R7618J49202
14124A88255J70199N9895L1016j32229k2859j39948K8213K58348O0017o3966o5644
14113C71297j75604j8651k3812M9488M2944o4494N0056M3187L9519m6575j44001
$$ plain form
14102 123354 -10480 -45395 -77032 80577 137278 172859 157028 -55548 -50866 161911 450991
14091 450991 565984 442225 326687 214221 248864 284893 196761 -40160 -88846 -55453
14081 -55453 -16079 -7642 66267 67382 159285 189948 146100 255091 144171 -22480 28726
14070 28726 51823 181234 212854 89501 14030 126920 133424 2694 -103300 -183575 -26918
14059 -26918 212170 386568 319119 130450 215978 291867 -90424 -182854 -140084 -139490 -80884
14048 -80884 -30062 -25845 -56468 -7653 -72524 235574 313469 323507 388452 305447 309847 336711
14036 336711 105234 -111203 -221721 -359504 -394312 -160170 -237767 -143954 104358 230273
14026 230273 120400 6184 82026 333976 434776 313215 112561 -37886 137776 62329
$$ packed form
14102A23354j33834l4915l1637J57609N6701L5581j5831k12576M682K12777K89080
14091D50991J14993j23759j15538j12466L4643L6029q8132k36921m8686L3393
14081e5453L9374Q437P3909J115R1903L0663m3848J08991j10920j66651N1206
14070B8726K3097J29411L1620j23353p5471J12890O504j30730j05994q0275J56657
14059b6918K39088J74398o7449j88669Q5528P5889l82291r2430M2770N94N8606
14048h0884N0822M217l0623M8815o4871L08098P7895J0038O4945q3005M400K6864
14036C36711k31477k16437j10518j37783l4808K34142p7597R3813K48312J25915
14026B30273j09873j14216P5842K51950J00800j21561k00654j50447J75662p5447
$$ plain form
14016 62329 -2640 184406 147730 -51912 63541 223654 111221 98287 153125 191501 7477
14005 7477 -3031 64524 183192 237347 177854 202810 11161 -128845 30312 -12578 -71003
13994 -71003 -49997 9063 141259 370314 291049 179718 83477 166864 177167 85907 -11904
13983 -11904 187448 153852 16948 47668 146230 115828 5114 -1283 117953 122546 200910
13972 200910 213692 102589 -83973 61028 32002 73357 108453 218718 275839 313411 212930
13961 212930 129131 83521 278733 476678 547835 318352 93163 -204635 -355819 -339948
13951 -339948 -234577 -87367 49657 101331 116436 128953 92496 95536 77267 40724 -76683
13940 -76683 -100164 80333 300048 310033 91082 25775 40001 95400 155428 334739 265529
$$ packed form
14016F2329o4969J87046l6676j99642J15453J60113j12433j2934N4838L8376j84024
14005G477j0508O7555J18668N4155n9493K4956j91649j40006J59157m2890n8425
13994g1003K1006N9060J32196K29055p9265j11331r6241Q3387J0303r1260r7811
13983a1904J99352l3596j36904L0720R8562l0402j10714o397J19236M593P8364
13972B00910J2782j11103j86562J45001k9026M1355L5096J10265N7121L7572j00481
13961B12930q3799m5610J95212J97945P1157k29483k25189k97798j51184J5871
13951c39948J05371J47210J37024N1674J5105J2517l6457L040j8269l6543j17407
13940g6683k3481J80497K19715R985k18951o5307J4226N5399O0028J79311o9210
$$ plain form
13929 265529 139015 94374 144766 61940 35164 68489 -80610 -96635 106884 135737 126982
13918 126982 79577 80933 -114769 -232665 33341 316778 401669 453236 500871 456211 330875
13907 330875 338370 6175 37201 215147 157445 108810 54516 107831 53019 21825 46530
13896 46530 -51578 -69253 133379 209738 161598 32032 52320 44046 180446 291421 356379
13885 356379 114452 203504 194874 237320 261125 418469 223769 134569 218869 298302 305210
13874 305210 475338 462707 372727 153096 102545 302187 221146 145303 144917 91414 50496
13863 50496 199951 261709 191387 351531 209596 270151 284883 275582 253522 262706 297705
13852 297705 66949 -57472 -105075 51449 -55311 51129 233869 242323 240411 213894 257431
$$ packed form
13929B65529j26514m4641N0392q2826k6776L3325j49099j6025K03519K8853q755
13918A26982m7405J356j95702j17896K66006K83437Q4891N1567M7635m4660j25336
13907C30875P495l32195L1026J77946n7702m8635n4294N3315n4812l1194K4705
13896D6530r8108j7675K02632P6359m8140j29566K0288q274J36400J10975O4958
13885C56379k41927Q9052q630M2446K3805J57344j94700q9200Q4300P9433O908
13874C05210J70128j2631q9980k19631n0551J99642q1041p5843l86n3503m0918
13863E0496J49455O1758p0322J60144j41935O0555J4732r301k2060R184L4999
13852B97705k30756j24421m7603J56524j06760J06440J82740Q454j912k6517M3537
$$ plain form
13841 257431 390741 333353 165419 147664 265716 149581 282377 401302 323385 480763
13831 480763 619791 715987 570086 174861 314939 380738 275332 283697 251571 412091
13821 412091 430584 339320 472193 533519 536492 469943 280507 118740 47116 -30442 209453
13810 209453 390445 444360 475171 392462 122537 101977 -17571 -126654 -74312 12911 171759
13799 171759 136118 132534 244426 217194 184711 194192 257407 137433 -3594 144417 186144
13788 186144 273327 341281 222050 13018 -54148 50948 182337 70058 -8148 -15512 61532
13777 61532 82035 141239 202288 92494 -88820 93950 178507 96433 1981 -212862 -175106
13766 -175106 -72227 23217 -77846 -109402 -70361 100251 315379 256135 333120 252122 153495
$$ packed form
13841B57431J33310n7388j67934j7755J18052j16135J32796J18925p7917J57378
13831D80763J39028R6196j45901l95225J40078O5799j05406Q365l2126J60520
13821D12091J8493r1264J32873O1326K973o6549j89436j61767p1624p7558K39895
13810B09453J80992N3915L0811q2709k69925k0560j19548j09083N2342Q7223J58848
13799A71759l5641l584J11892k7232l2483R481O3215j19974j41027J48011M1727
13788A86144Q7183O7954j19231k09032o7166J05096J31389j12279p8206p364P7044
13777F1532K0503N9204O1049j09794j81314J82770Q4557q2074r4452k14843L7756
13766a75106J02879R5444j01063l1556L9041J70612K15128n9244P6985q0998r8627
$$ plain form
13755 153495 148597 180770 275155 384790 285197 259749 279815 152032 144379 117278 131069
13744 131069 214015 284467 369433 258126 223953 198373 187057 133333 285111 522407 295007
13733 295007 142186 40976 84692 163393 224221 236000 251113 333214 326292 353462 347522
13722 347522 13754 36033 298533 448317 462538 354622 240485 94956 -3165 -18567
13712 -18567 -8007 64830 -89015 1982 61580 26999 174338 251879 204331 67457 84087
13701 84087 80156 195078 449067 536576 623389 590349 339426 145982 156901 153257 155074
13690 155074 270911 212074 148475 309948 124532 -34834 -182795 -57677 -40402 -68974
13680 -68974 -116596 -39106 129907 244155 296712 325574 83503 -43543 125068 273407
$$ packed form
13755A53495m898L2173R4385J09635r9593k5448K0066j27783p653k7101J3791
13744A31069Q2946P0452Q4966j11307l4173k5580j1316n3724J51778K37296k27400
13733B95007j52821j01210M3716P8701O0828J1779J5113Q2101o922K7170n940
13722C47522l33768K2279K62500J49784J4221j07916j14137j45529r8121j5402
13712a8567J0560P2837j53845R0997N9598l4581J47339P7541m7548j36874J6630
13701H4087l931J14922K53989Q7509Q6813l3040k50923j93444J0919l644J817
13690A55074J15837n8837o3599J61473j85416j59366j47961J25118J7275k8572
13680f8974m7622P7490J69013J14248N2557K8862k42071j27046J68611J48339
$$ plain form
13670 273407 251961 -93360 -140360 -158436 -167821 -17703 255131 375468 228416 230656 241061
13659 241061 183194 202322 119456 130071 71012 81556 125684 183482 28436 5167 63719
13648 63719 -11529 -149841 -260684 -213842 -234134 -189910 -63360 209447 381461 506673
13638 506673 670660 648125 522072 386780 354074 388266 160668 331096 458131 447326
13628 447326 381633 356247 228127 161147 64102 57241 249338 252352 155603 66711 -58943
13617 -58943 35995 68362 76672 231002 156111 -56772 -70760 17513 187965 195890 118199
13606 118199 97108 217269 193257 70168 222247 43910 70854 210967 277525 207364
13596 207364 26661 210952 285116 147120 -7690 -139059 -70240 -11354 -13084 74667 233270
$$ packed form
13670B73407k1446l45321m7000j8076r385J50118K72834J20337j47052K240J0405
13659B41061n7867J9128q2866J0615n9059J0544M4128N7798j55046k3269N8552
13648F3719p5248j38312j10843M6842k0292M4224J26550K72807J72014J25212
13638E06673J63987k2535j26053j35292l2706L4192k27598J70428J27035j0805
13628D47326o5693k5386j28120o6980r7045o861J92097L014r6749q8892j25654
13617e8943R4938L2367Q310J54330p4891k12883j3988Q8273J70452P925p7691
13606A18199k1091J20161k4012j23089J52079j78337K6944J40113O6558p0161
13596B07364j80703J84291P4164j37996j54810j31369O8819N8886j730Q7751J58603
$$ plain form
13585 233270 164180 -96859 -128150 -35062 -43042 -108190 -46043 -17384 97824 252483 197307
13574 197307 45172 130475 211470 161365 121006 130882 -36871 -29750 286621 184754 97004
13563 97004 122925 132715 160908 -106466 -48385 131174 145801 80403 24612 225208 660542
13552 660542 639573 253159 182253 338517 281061 316061 77572 -159455 -193914 -146485 -90611
13541 -90611 -209531 -347415 -237468 26341 259496 316504 191298 329962 646519 496063
13531 496063 309878 433851 435925 440567 176073 -99498 -261706 -164284 -69493 -143330 117634
13520 117634 189086 163635 59386 -58042 266714 470616 327076 339454 424371 245069
13510 245069 -761 215773 269353 165330 52988 177977 325961 409985 456004 181945
$$ packed form
13585B33270o9090k61039l1291R3088p980o5148O2147K8659J15208J54659n5176
13574A97307j52135Q5303Q0995n0105m0359R876j67753P121L16371j01867q7750
13563I7004K5921R790K8193k67374N8081J79559J4627o5398n5791K00596M35334
13552F60542k0969l86414p0906J56264n7456L5000k38489k37027l4459M7429N5874
13541i0611j18920j37884J09947K63809K33155N7008j25206J38664L16557j50456
13531D96063j86185J23973K074M642k64494k75571j62208R7422R4791p3837K60964
13520A17634P1452k5451j04249j17428L24756K03902j43540J2378Q4917j79302
13510B45069k45830K16534N3580j04023j12342J24989J47984Q4024M6019k74059
$$ plain form
13500 181945 189128 237949 62097 5521 36340 130867 137119 129468 84654 165190 486182 536301
13488 536301 308980 321866 484829 477430 329622 165857 -32488 -63434 -65238 102669 236488
13477 236488 165629 228443 277743 302687 201830 317177 431395 518674 356024 301881 213691
13466 213691 304831 298837 294998 22390 38944 149491 -66052 -100523 -74545 -169207 -82214
13455 -82214 176066 46017 69985 202062 160826 210922 213987 196897 236079 295058 121343
13444 121343 -127724 -231159 -169062 247721 351572 409926 304013 77693 86533 19678
13434 19678 -36591 272534 596468 642860 593626 454425 466179 480887 383598 285699 252107
13423 252107 284464 215098 220971 282017 214172 3786 -95435 -6078 61925 157287 51556
$$ packed form
13500A81945P183M8821j75852n6576L0819R4527O252p651m4814Q0536L20992N0119
13488E36301k27321J2886J62963p399j47808j63765j98345l0946j804J67907J33819
13477B36488p0859O2814M9300K4944j00857J15347J14218Q7279j62650n4143q8190
13466B13691R1140n994l839k72608J6554J10547k15543l4471K5978r4662Q6993
13455h2214K58280j30049K3968J32077m1236N0096L065j7090L9182N8979j73715
13444A21343k49067j03435O2097M16783J03851N8354j05913k26320Q840o6855
13434A9678n6269L09125L23934M6392m9234j39201J1754J4708r7289r7899l3592
13423B52107L2357o9366N873O1046o7845k10386r9221Q9357O8003R5362j05731
$$ plain form
13412 51556 203638 329045 327180 331516 174907 82660 133544 175849 229682 244769 119152
13401 119152 283807 226015 240301 376651 241271 186373 257736 226404 392089 662854
13391 662854 688587 648224 697684 620502 484033 129524 -47837 37264 129818 292768 489227
13380 489227 351215 249923 305840 323445 160197 -25063 -208252 -333772 -139613 94103
13370 94103 16779 82597 46572 215199 356055 300630 105515 73475 175162 347173 398643
13359 398643 248148 331676 338030 220322 93855 263128 340873 346416 378305 341684 444058
13348 444058 366917 390723 614836 623365 487857 205191 161911 72276 94171 101925 109146
13337 109146 162899 -26448 -89392 167708 257901 28877 -120107 -67068 125376 322108
$$ packed form
13412E1556J52082J25407j865M336j56609r2247N0884M2305N3833J5087j25617
13401A19152J64655n7792J4286J36350j35380n4898P1363l1332J65685K70765
13391F62854K5733m0363M9460p7182j36469l54509j77361Q5101R2554J62950J96459
13380D89227j38012j01292N5917J7605j63248j85260j83189j25520J94159K33716
13370I4103p7324O5818l6025J68627J40856n5425j95115l2040J01687J72011N1470
13359C98643j50495Q3528O354j17708j26467J69273P7745N543L1889l6621J02374
13348D44058p7141K3806K24113Q529j35508k82666m3280q9635K1895P754P221
13337A09146N3753j89347o2944K57100R0193k29024j48984N3039J92444J96732
$$ plain form
13327 322108 496717 551854 556782 449176 360978 328637 269263 391246 519587 382757 6634
13316 6634 -45279 -169171 -141076 226461 204728 264785 153514 28831 -16334 13496 79512
13305 79512 105109 125585 279289 295936 467386 522678 454117 490452 234429 108217 220562
13294 220562 170774 147759 108775 56824 118342 60246 -3828 96052 268670 315242 440569
13283 440569 480057 257476 64129 -40367 193289 312761 198015 308049 476094 564750
13273 564750 536197 613108 450794 218841 189109 314147 365956 329871 224686 245557 239190
13262 239190 131508 96354 71287 90979 362434 509965 509855 385570 348116 313544 287267
13251 287267 372454 364798 377562 273700 146246 106527 124584 319722 336590 505229 509222
$$ packed form
13327C22108J74609N5137M928j07606q8198l2341n9374J21983J28341j36830l76123
13316F634n1913j23892K8095L67537k1733O0057j11271j24683m5165K9830O6016
13305G9512K5597K0476J53704J6647J71450N5292o8561L6335k56023j26212J12345
13294B20562m9788k3015l8984n1951O1518n8096o4074R9880J72618M6572J25327
13283D40569L9488k22581j93347j04496K33656J19472j14746J10034J68045Q8656
13273E64750k8553P6911j62314k31953k9732J25038N1809l6085j05185K0871o367
13262B39190j07682l5154k5067J9692K71455J47531j10j24285l7454l4572k6277
13251B87267Q5187p656J2764j03862j27454l9719J8057J95138J6868J68639L993
$$ plain form
13240 509222 476684 450265 438316 416739 442644 234421 282261 158649 285767 260676 344143
13229 344143 233005 210666 603865 849006 771017 449429 373403 458973 403235 538417
13219 538417 348494 142883 100390 73648 173639 301353 469068 379772 388084 514925 474875
13208 474875 556508 451638 265136 237344 200033 287012 299185 283014 309963 258074 170786
13197 170786 123956 8552 52761 87698 -76515 50444 261871 403505 404906 276702
13187 276702 254236 228422 149920 144186 230113 222858 206154 59058 28188 99366 13181 270530
13175 270530 300326 326837 409915 435627 633185 536239 500639 447321 510695 542404 466261
13164 466261 511487 540348 460876 311228 233118 202308 164155 169523 350989 369328 331705
$$ packed form
13240E09222l2538k6419j1949k1577K5905k08223M7840j23612J27118k5091Q3467
13229C44143j11138k2339L93199K45141p7989l21588p6026Q5570n5738J35182
13219E38417j89923k05611m2493k6742R9991J27714J67715q9296Q312J26841m0050
13208D74875Q1633j04870j86502k7792l7311Q6979J2173j6171K6949n1889q7288
13197A70786m6830j15404M4209L4937j64213J26959K11427J41634J401j28204
13187B76702k2466k5814p8502n734Q5927p255j6704j47096l0870P1178q6185K57349
13175B70530K9796K6511Q3078K5712J97558r6946l5600n3318O3374L1709p6143
13164D66261M5226K8861p9472j49648p8110l0810l8153N368J81466J8339l7623
$$ plain form
13153 331705 459819 390132 219668 64809 149348 480592 491146 514508 633166 680471
13143 680471 501961 620840 865913 728247 633682 586179 492359 316995 403276 495691
13133 495691 591716 629962 646092 401466 462093 705385 950469 860102 672698 484227
13123 484227 272175 259539 396155 459200 718084 923868 916288 972822 655688 320214
13113 320214 317226 472009 420068 385196 524890 607575 603876 714211 721625 860568 907373
13102 907373 949389 1128968 994053 886926 1050440 1357809 1249772 1012304 869530 1011110
13092 1011110 1138596 1305112 1275528 1100899 976911 1069341 1047098 1062783 921562 998319
13082 998319 883361 795794 752574 732580 834905 858264 884064 782352 760688 849934 1019812
$$ packed form
13153C31705J28114o9687j70464j54859Q4539L31244J0554K3362J18658M7305
13143F80471j78510J18879K45073j37666r4565m7503r3820j75364Q6281R2415
13133D95691R6025L8246J6130k44626O0627K43292K45084r0367j87404j88471
13123D84227k12052j2636J36616O3045K58884K05784p580N6534l17134l35474
13113C20214k988J54783n1941l4872J39694Q2685l699J10335P414J38943M6805
13102I07373M2016J79579j34915j07127J63514L07369j08037k37468j42774J41580
13092A011110J27486J66516k9584j74629j23988R2430k2243J5685j41221P6757
13082I98319j14958q7567m3220j9994J02325K3359K5800j01712k1664Q9246J69878
$$ plain form
13071 1019812 933735 835616 925786 946378 830402 789810 742322 474539 275823 292763 300600
13060 300600 481303 635240 619974 567547 501646 582642 597321 664489 644466 716765 633263
13049 633263 802953 770506 788232 901071 912566 732091 688683 834877 574667 369481
13039 369481 194698 264597 490171 850591 826393 549328 428439 486081 543835 632768
13029 632768 799478 890374 935808 772054 869312 801332 951478 894974 726172 593114
13019 593114 683265 730315 694925 474268 425692 362800 562748 416736 487655 640717 547835
13008 547835 697991 895701 795534 562308 397253 244204 376764 347468 441604 659906
12998 659906 867275 745044 645767 517431 513802 581897 672340 873754 916902 858485 812064
$$ packed form
13071A019812q6077r8119R0170K0592j15976m0592m7488k67783j98716J6940P837
13060C00600J80703J53937j5266n2427o5901Q0996J4679O7168k0023P2299q3502
13049F33263J69690l2447J7726J12839J1495j80475m3408J46194k60210k05186
13039C69481j74783O9899K25574L60420k4198k77065j20889N7642N7754Q8933
13029F32768J66710R0896M5434j63754R7258o7980J50146n6504j68802j33058
13019E93114R0151M7050l5390k20657m8576o2892J99948j46012P0919J53062r2882
13008E47835J50156J97710j00167k33226j65055j53049J32560k9296R4136K18302
12998F59906K07369j22231r9277j28336l629O8095R0443K01414M3148n8417m6421
$$ plain form
12987 812064 794240 755428 790177 852797 854602 615697 519143 566996 716375 553658 670563
12976 670563 552474 331384 340343 411690 511229 711516 687973 795542 1122006 1081376 1146368
12965 1146368 1118656 1186035 1180120 1038029 858009 869759 843217 703766 699819 728350 847384
12954 847384 773634 990000 985216 924324 1113356 1132056 1046670 936699 998533 950375 798219
12943 798219 506657 508520 708275 904551 1027095 1032246 1120067 1380379 1273400 1211560 1465418
12932 1465418 1681601 1630465 1320259 983116 1146635 1330309 1141227 1141892 1253963 1245108
12922 1245108 1128871 1195663 1208029 1280413 1145728 1032000 982459 942063 891084 876419 1027650
12911 1027650 1145983 1057426 1282368 1324330 1209566 1358864 1082991 1045112 1137560 1108931
$$ packed form
12987H12064j7824l8812L4749O2620J805k38905r6554M7853J49379j62717J16905
12976F70563j18089k21090Q959P1347R9539K00287k3543J07569L26464m0630O4992
12965A146368k7712O7379n915j42091j80020J1750k6542j39451l947K8531J19034
12954H47384p3750K16366m784o0892J89032J8700q5386j09971O1834m8158j52156
12943G98219k91562J863J99755J96276J22544N151Q7821K60312j06979o1840K53858
12932A465418K16183n1136l10206l37143J63519J83674j89082O65J12071q855
12922A245108j16237O6792J2366P2384j34685j13728m9541m0396n0979j4665J51231
12911A027650J18333q8557K24942M1962j14764J49298k75873l7879R2448k8629
$$ plain form
12901 1108931 1254534 1296997 1232577 1158721 1126532 1211652 1365593 1476711 1472979 1403156 1521050
12890 1521050 1664119 1600886 1418415 1422792 1501968 1499477 1582735 1692619 1622108 1579141 1501452
12879 1501452 1622237 1863125 2025703 2007435 2127224 2177253 1970383 1910901 1942174 2084427
12869 2084427 2194431 2304286 2320496 2380446 2390582 2600310 2430107 2507281 2501693 2278258
12859 2278258 2286736 2294354 2339948 2228078 2042980 1890556 1924571 2001726 2004172 2247471 2131042
12848 2131042 1727575 1553014 1616217 1760521 2078436 2102418 1760654 1454359 1265992 1603443
12838 1603443 2001614 2139256 1947676 1929077 2048129 2132686 1937463 1635676 1705007 1850580
12828 1850580 1981655 1975126 1668687 1654990 1859077 2131736 2111827 2195825 2220258 2013752
$$ packed form
12901A108931J45603M2463o4420p3856l2189Q5120J53941J11118l732o9823J17894
12890A521050J43069o3233j82471M377P9176k491Q3258J09884p0511m2967p7689
12879A501452J20785K40888J62578j8268J19789N0029k06870n9482L1273J42253
12869B084427J10004J09855J6210N9950J0136K09728j70203P7174n588k23435
12859B278258Q478P618M5594j11870j85098j52424L4015P7155K446K43299j16429
12848B131042m03467j74561O3203J44304L17915K3982l41764l06295j88367L37451
12838A603443L98171J37642j91580j8599J19052Q4557j95223l01787O9331J45573
12828A850580J31075o529l06439j3697K04087K72659j9909Q3998K4433k06506
$$ plain form
12818 2013752 1946087 1987310 1943160 1973584 2035007 1896687 1862562 1990600 1961931 2020849 2110166
12807 2110166 2236061 2194534 2072333 2021001 2096437 2215243 2226806 2194335 2294134 2174297
12797 2174297 1958201 1899915 1919881 1887050 2200828 2320342 2445541 2527005 2575393 2435151
12787 2435151 2306527 2377187 2369118 2336460 2373713 2504402 2574894 2621915 2666946 2498486 2384693
12776 2384693 2451684 2479232 2521425 2674467 2629394 2687516 2542316 2640109 2794047 2924722
12766 2924722 3111807 3046297 3057695 3232721 3356317 3246859 3201285 3390350 3533941 3486068
12756 3486068 3223610 3224113 3520933 3742773 3649257 3727242 3760401 3874104 4020096 4160887
12746 4160887 4354227 4519840 4438044 4516654 4558392 4605095 4434926 4446801 4486700 4558069 4701548
$$ packed form
12818B013752o7665M1223m4150L0424O1423j38320l4125J28038k8669N8918Q9317
12807B110166J25895m1527j22201n1332P5436J18806J1563l2471R9799j19837
12797B174297k16096n8286J9966l2831L13778J19514J25199Q1464M8388j40242
12787B435151j28624P0660q069l2658L7253J30689P0492M7021M5031j68460j13793
12776B384693O6991K7548M2193J53042m5073N8122j45200R7793J53938J30675
12766B924722J87085o5510J1398J75026J23596j09458m5574J89065J43591m7873
12756C486068k62458N03K96820K21840r3516P7985L3159J13703J45992J40791
12746D160887J93340J65613q1796P8610M1738M6703j70169J1875L9899P1369J43479
$$ plain form
12735 4701548 5012617 5143175 5293215 5403316 5528936 5620210 5643402 5840532 6167518 6593449
12725 6593449 6838977 7113735 7328234 7599367 7706086 7761251 7956137 8273053 8773385 9333591
12715 9333591 9604619 9831607 10161508 10529749 11133745 11844258 12410192 12882877 13338327
12706 13338327 14149941 14742015 15467382 16317333 17177053 18356071 19174082 20260285 21447366
12697 21447366 22907676 24505230 26126596 27963398 29893143 32078764 34284732 36545723
12689 36545723 39044444 41772374 44927686 48546872 52643953 56968705 61285055 66162301
12681 66162301 71549399 77168149 82889714 88752271 94866737 101017181 106470677 111215423
12673 111215423 115159834 118119099 119510980 119734670 118911453 116772697 113486821 109603951
$$ packed form
12735D701548L11069J30558J50040J10101J25620R1274K3192J97130L26986M25931
12725F593449K45528K74758K14499K71133J06719N5165J94886L16916N00332N60206
12715I333591K71028K26988L29901L68241O03996P10513N65934M72685M55450
12706A3338327Q11614N92074P25367Q49951Q59720J179018Q18011J086203J187081
12697B1447366J460310J597554J621366J836802J929745K185621K205968K260991
12689C6545723K498721K727930L155312L619186M097081M324752M316350M877246
12681F6162301N387098N618750N721565N862557O114466O150444N453496M744746
12673A11215423L944411K959265J391881K23690q23217k138756l285876l882870
$$ plain form
12665 109603951 105360604 100861799 96221704 91449961 86659859 82171111 77649836 73418866
12657 73418866 69817672 66504232 63431277 60383513 57540415 54618516 51966342 49821748
12649 49821748 47994320 46029215 44117952 42197395 40507115 39098425 37888896 36591868
12641 36591868 35209069 34007292 32850897 31888490 30946979 30047991 28937766 28008970 27130719
12632 27130719 26232918 25556227 24878112 24258218 23715487 22911803 22179424 21746937 21391996
12623 21391996 21001858 20606728 20002619 19523238 19200755 18814292 18194046 17756517 17437671
12614 17437671 16885339 16357510 15877695 15543636 15532162 15173117 14714060 14463930 14197761
12605 14197761 13778829 13502650 13514959 13517322 13145072 12791903 12592691 12444547 12323128 12054971
$$ packed form
12665A09603951m243347m498805m640095m771743m790102m488748m521275m230970
12657G3418866l601194l313440l072955l047764k843098k921899k652174k144594
12649D9821748j827428j965105j911263j920557j690280j408690j209529j297028
12641C6591868j382799j201777j156395r62407r41511q98988j110225r28796q78251
12632B7130719q97801o76691o78115o19894n42731q03684p32379m32487l54941
12623B1391996l90138l95130o04109m79381l22483l86463o20246m37529l18846
12614A7437671n52332n27829m79815l34059j1474l59045m59057k50130k66169
12605A4197761m18932k76179J2309K363l72250l53169j99212j48144j21419k68157
$$ plain form
12595 12054971 11769858 11436997 11281905 11233544 11059269 10879423 10741899 10497961 10454238 10449678
12585 10449678 10191367 10117556 9956192 9583853 9362215 9274222 9257492 9455472 9465791 9191553
12575 9191553 8811216 8672524 8615630 8700643 8578084 8500821 8306835 8091454 7838740 7356543
12565 7356543 7350582 7168195 7028390 7109503 7190812 7170280 7194268 7015295 6816844 6936200
12555 6936200 7158091 7168010 6945693 6707452 6531838 6526240 6549183 6461845 6222290 6177216 6170871
12544 6170871 6124963 6107388 6012287 5969721 6022495 5850373 5628377 5365536 5679269 5773343
12534 5773343 5565633 5394471 5313098 5191985 5115739 5055484 5066474 5105113 4964510 4744293
12524 4744293 4684019 4995397 5085626 4966232 4924681 4857920 4783276 4692715 4618858 4698787 4667439
$$ packed form
12595A2054971k85113l32861j55092m8361j74275j79846j37524k43938m3723m560
12585A0449678k58311p3811j61364l72339k21638q7993j6730J97980J0319k74238
12575I191553l80337j38692n6894Q5013j22559p7263j93986k15381k52714m82197
12565G356543n961j82387j39805Q1113Q1309k0532K3988j78973j98451J19356
12555F936200K21891R919k22317k38241j75614n598K2943q7338k39555m5074o345
12544F170871m5908j7575r5101m2566N2774j72122k21996k62841L13733R4074
12534E773343k07710j71162q1373j21113p6246o0255J0990L8639j40603k20217
12524D744293o0274L11378R0229j19394m1551o6761p4644r0561p3857P9929l1348
$$ plain form
12513 4667439 4508351 4551507 4583954 4515790 4512909 4364523 4219655 4144526 4416554 4500741 4512595
12502 4512595 4415508 4294610 4229662 4186430 4278708 4552039 4526624 4313629 4141375 4008873
12492 4008873 3872546 3862003 3791745 3781822 3740460 3686435 3804890 3994246 3927625 3698786 3645461
12481 3645461 3630589 3699561 3751821 3723350 3744212 3765042 3678282 3584642 3688531 3752658 3893837
12470 3893837 3792843 3992303 4095184 4028282 3974570 3947432 4033701 4066125 4114945 3954721
12460 3954721 4212210 4346385 4316885 4394722 4420465 4540013 4773466 4765290 4648466 4736832
12450 4736832 4873410 4807018 4604790 4598778 4803406 5064481 5070022 5031230 4853260 4858378 4914087
12439 4914087 5006636 5047926 5022166 4953863 5072476 5114675 5106005 5232418 5471799 5258382 5178901
$$ packed form
12513D667439j59088M3156L2447o8164k881j48386j44868p5129K72028Q4187J1854
12502D512595r7087j20898o4948m3232R2278K73331k5415k12995j72254j32502
12492D008873j36327j0543p0258r923m1362n4025J18455J89356o6621k28839n3325
12481C645461j4872O8972N2260k8471K0862K0830q6760r3640J03889O4127J41179
12470C893837j00994J99460J02881o6902n3712k7138Q6269L2424M8820j60224
12460C954721K57489J34175k9500P7837K5743J19548K33453q176j16824Q8366
12450D736832J36578o6392k02228o012K04628K61075N541l8792j77970N118N5709
12439D914087R2549M1290k5760o8303J18613M2199q670J26413K39381k13417p9481
$$ plain form
12428 5178901 5120392 5072053 5219750 5431735 5470415 5466794 5449310 5429514 5499406 5689565 5768372
12417 5768372 5633731 5650490 5464157 5047199 5189445 5362142 5449434 5389484 5350615 5533007
12407 5533007 5486802 5422937 5358495 5373934 5399133 5179540 5052247 5117565 5146999 5386036 5210769
12396 5210769 4991803 4914712 4895727 4871532 4794723 4893040 5145246 5182601 5219827 5060741 4869571
12385 4869571 4737183 4858156 4990983 4857269 4782478 4765133 4387272 4334345 4220416 4255368
12375 4255368 4450643 4458229 4492443 4488376 4581615 4890676 4931114 4875045 4845422 4576099 4600730
12364 4600730 4623410 4501220 4733583 4954326 4870712 4841929 4808880 4755975 4728743 4889421
12354 4889421 4848261 4772285 5031722 4979466 4859414 4852001 4925984 4906732 4693619 4509284 4748219
$$ packed form
12428E178901n8509m8339J47697K11985L8680l621j7484j9796O9892J90159P8807
12417E768372j34641J6759j86333m16958J42246J72697Q7292n9950l8869J82392
12407E533007m6205o3865o4442J5439K5199k19593j27293O5318K9434K39037j75267
12396E210769k18966p7091j8985k4195p6809R8317K52206L7355L7226j59086j91170
12385D869571j32388J20973J32827j33714p4791j7345l77861n2927j13929L4952
12375D255368J95275P586L4214m067R3239L09061M0438n6069k9623k69323K4631
12364D600730K2680j22190K32363K20743q3614k8783l3049n2905k7232J60678
12354D889421m1160p5976K59437n2256j20052p413P3983j9252k13113j84335K38935
$$ plain form
12343 4748219 5021839 5087538 4923680 4863607 4829073 4948452 5058698 5071058 4893361 4872713
12333 4872713 5025776 5161914 5087221 5219582 5333408 5569101 5766161 5805509 5749735 5925314
12323 5925314 5897020 5825169 5833211 5895672 6077080 6198549 6274075 6253860 6354771 6339886 6213645
12312 6213645 6190554 6377659 6578819 6718112 6782802 6914002 7211334 7234830 7132078 7193074
12302 7193074 7419289 7471814 7328259 7412418 7596567 8006837 8232667 8360497 8309176 8249593
12292 8249593 8276083 8423287 8594771 9197135 9498313 9473940 9745164 10023550 10475281 10802466
12282 10802466 10944782 11179225 11576346 12014148 12302382 12724749 13181398 13528285 14034532
12273 14034532 14620506 15132810 15783830 16316408 16833589 17696304 18545449 19476502 20572942
$$ packed form
12343D748219K73620O5699j63858o0073l4534J19379J10246J2360j77697k0648
12333D872713J53063J36138p4693J32361J13826K35693J97060L9348n5774J75579
12323E925314k8294p1851Q042O2461J81408J21469P5526k0215J00911j4885j26241
12312F213645k3091J87105K01160J39293O4690J31200K97332K3496j02752O0996
12302G193074K26215N2525j43555Q4159J84149M10270K25830J27830n1321n9583
12292H249593K6490J47204J71484O02364L01178k4373K71224K78386M51731L27185
12282A0802466J42316K34443L97121M37802K88234M22367M56649L46887N06247
12273A4034532N85974N12304O51020N32578N17181Q62715Q49145R31053J096440
$$ plain form
12264 20572942 21649500 22666334 23684053 25074385 26433786 28139758 29935141 32019379
12256 32019379 34197368 36390523 38956532 42003015 45156617 48322126 51662606 55332685
12248 55332685 59160914 62910709 66584754 70350642 73983434 77373962 80408462 83096011
12240 83096011 85329500 87257335 88993576 90339377 91307750 92305882 93227892 94255848
12232 94255848 95352715 96580193 97782806 99501320 101635299 103777424 106079674 108436970
12224 108436970 111210999 113746759 116384600 119411427 122197395 124784719 127188313 129382629
12216 129382629 131431290 133097415 134524939 135507483 136159416 136877114 136999638 136536793 135946763
12207 135946763 135301152 134314473 132904068 131361632 129792239 128066229 126047366 124254526
$$ packed form
12264B0572942J076558J016834J017719J390332J359401J705972J795383K084238
12256C2019379K177989K193155K566009L046483L153602L165509L340480L670079
12248E5332685L828229L749795L674045L765888L632792L390528L034500K687549
12240H3096011K233489J927835J736241J345801R68373R98132R22010J027956
12232I4255848J096867J227478J202613J718514K133979K142125K302250K357296
12224A08436970K774029K535760K637841L026827K785968K587324K403594K194316
12216A29382629K048661J666125J427524R82544O51933P17698J22524m62845n90030
12207A35946763o45611r86679j410405j542436j569393j726010k018863j792840
$$ plain form
12199 124254526 122619321 120991272 119372581 118034244 116876959 115983832 115199866 114726339
12191 114726339 114446137 114208435 113946505 113768124 113166754 112533100 111611259 110596393 109337351
12182 109337351 107421221 105159723 102615798 99753357 96562893 93122985 89541540 85963875
12174 85963875 82491951 79180861 75936134 73065830 70193271 67472495 64665131 62032159
12166 62032159 59630392 57431918 55413720 53577313 51649235 49992813 48428470 47072953
12158 47072953 45657995 44401597 43116704 41880888 41023464 40115895 39078141 37944290
12150 37944290 37075928 36392686 35502730 34723409 33919699 33140151 32510909 31936908 31291911
12141 31291911 30751598 30185990 29448942 28759256 28328888 27885672 27303804 26896430 26306049
$$ packed form
12199A24254526j635205j628049j618691j338337j157285q93127p83966m73527
12191A14726339k80202k37702k61930j78381o01370o33654r21841j014866j259042
12182A09337351j916130k261498k543925k862441l190464l439908l581445l577665
12174H5963875l471924l311090l244727k870304k872559k720776k807364k632972
12166F2032159k401767k198474k018198j836407j928078j656422j564343j355517
12158D7072953j414958j256398j284893j235816q57424r07569j037754j133851
12150C7944290q68362o83242q89956p79321q03710p79548o29242n74001o44997
12141C1291911n40313n65608p37048o89686m30368m43216n81868m07374n90381
$$ plain form
12132 26306049 25932262 25555253 25027426 24702712 24389291 24119272 24061788 23809507 23503360
12123 23503360 23321925 23060327 22680824 22378844 21937561 21596759 21269202 20942402 20746059
12114 20746059 20517907 20256476 20061492 19776884 19500599 19356920 19058961 18921829 18854853
12105 18854853 18700659 18568693 18508931 18391155 18214529 17927821 17565676 17465983 17432107 17333675
12095 17333675 17175811 16929818 16932287 16686577 16407707 16186141 16159376 16277602 16213811 16018742
12085 16018742 15956372 15645548 15470907 15336971 15316042 15447538 15398825 15242126 15231782 15269472
12075 15269472 15120530 14887800 14535420 14118836 14029885 14031046 14127944 13976904 13777719 13729951
12065 13729951 13820841 13787705 13859704 13893028 13763982 13663111 13381964 13350760 13522873 13444712
$$ packed form
12132B6306049l73787l77009n27827l24714l13421k70019n7484k52281l06147
12123B3503360j81435k61598l79503l01980m41283l40802l27557l26800j96343
12114B0746059k28152k61431j94984k84608k76285j43679k97959j37132o6976
12105A8854853j54194j31966n9762j17776j76626k86708l62145r9693l3876r8432
12095A7333675j57864k45993K469k45710k78870k21566k6765J18226o3791j95069
12085A6018742o2370l10824j74641j33936k0929J31496m8713j56699j0344L7690
12075A5269472j48942k32730l52380m16584q8951J161R6898j51040j99185m7768
12065A3729951R0890l3136P1999L3324j29046j00871k81147l1204J72113p8161
$$ plain form
12055 13444712 13345054 13185400 13166064 13174062 13049348 12971048 12904828 12924600 12844930 12704783 12775479
12044 12775479 12766842 12783806 12472944 12462971 12571532 12409075 12282759 12203798 12369124 12596147
12034 12596147 12456894 12442587 12254721 12123762 12392898 12248690 12165681 12010807 12031572 11953516
12024 11953516 11773319 11803717 12034103 12198281 12089492 12127751 12038756 12140321 12355033 12217556
12014 12217556 11797437 11706750 11701540 11900407 12103295 12248856 12174004 12178831 12274266 12389393
12004 12389393 12401382 12476595 12385745 12129773 12009696 12068298 12108009 12002367 12046648 12080066
11994 12080066 11961900 11873700 11695400 11737706 11895200 11873918 12035155 11904386 11783390 11967175
11984 11967175 12197209 12239704 12424611 12537248 12514046 12309525 12137158 12138658 12057674 12036069
$$ packed form
12055A3444712r9658j59654j9336P998j24714p8300o6220J9772p9670j40147P0696
12044A2775479q637J6964l10862r973J08561j62457j26316p8961J65326K27023
12034A2596147j39253j4307j87866j30959K69136j44208q3009j54874K0765p8056
12024A1953516j80197L0398K30386J64178j08789L8259q8995J01565K14712j37477
12014A2217556m20119r0687n210J98867K02888J45561p4852M827R5435J15127
12004A2389393J1989P5213r0850k55972j20077N8602L9711j05642M4281L3418
11994A2080066j18166q8200j78300M2306J57494k1282J61237j30769j20996J83785
11984A1967175K30034M2495J84907J12637k3202k04521j72367J500q0984k1605
$$ plain form
11974 12036069 11988964 11804823 11800716 12067624 12034003 11988173 11983230 12049544 12274712 12397569 12204597
11963 12204597 12159345 12204846 12240727 12145173 12317675 12277143 12011694 11911580 11972491 11881462
11953 11881462 11930462 12285608 12500291 12407898 12490715 12344389 12398138 12473965 12304000 12194997
11943 12194997 12109255 12143514 12290639 12338575 12343890 12101100 12047818 12107807 12216941 12180882 12253704
11932 12253704 12254819 12332090 12304447 12173524 12068544 12195571 12198812 12114789 12186060 12115891 12087946
11921 12087946 12152944 12242728 11980085 12103868 12085344 11999380 11961277 12138427 12335181 12315134
11911 12315134 12094294 12104937 12256601 12430955 12487468 12533944 12398821 12237282 12030703 11944054
11901 11944054 11986901 12193721 12399356 12339866 12255855 12020202 12043555 11949340 11749223 11796237
$$ packed form
11974A2036069m7105j84141m107K66908l3621m5830m943O6314K25168J22857j92972
11963A2204597m5252M5501L5881r5554J72502m0532k65449j00114O0911r1029
11953A1881462M9000L55146K14683r2393Q2817j46326N3749P5827j69965j09003
11943A2194997q5742L4259J47125M7936N315k42790n3282N9989J09134l6059P2822
11932A2253704J115P7271k7643j30923j04980J27027L241q4023P1271p0169k7945
11921A2087946O4998Q9784k62643J23783j8524q5964l8103J77150J96754k0047
11911A2315134k20840J0643J51664J74354N6513M6476j35123j61539k06579q6649
11901A1944054M2847K06820K05635n9490q4011k35653K3353r4215k00117M7014
$$ plain form
11891 11796237 11924690 11900731 11990762 11923442 11778508 12038868 12186894 12023890 11653782 11516522
11881 11516522 11739102 11779617 11809463 11599655 11494197 11667383 11577412 11481443 11666021 11656201
11871 11656201 11396034 11445068 11549179 11479439 11332325 11316458 11270112 11148323 10992177 10926818
11861 10926818 10941145 10994251 11091325 11078383 10852040 10764042 10843333 10795389 10666026 10704339 10622670
11850 10622670 10516928 10588602 10683276 10707686 10634804 10741019 10772838 10796250 10626314 10668328
11840 10668328 10777960 10708218 10832440 10789818 10636759 10572824 10406808 10390938 10643137 10423669
11830 10423669 10125979 10146261 10326203 10117376 10027928 10199208 10407602 10366395 9876948 9735985
11820 9735985 9887627 9933527 9792150 9797377 9776004 9809621 9748508 9633678 9624887 9582788 9399810
$$ packed form
11891A1796237J28453k3959R0031o7320j44934K60360J48026j63004l70108j37260
11881A1516522K22580M0515K9846k09808j05458J73186q9971r5969J84578r820
11871A1656201k60167M9034J04111o9740j47114j5867m6346j21789j56146o5359
11861A0926818J4327N3106R7074j2942k26343q7998P9291m7944j29363L8313q1669
11850A0622670j05742P1674R4674K4410p2882J06215L1819K3412j69936M2014
11840A0668328J09632o9742J24222m2622j53059o3935j66016j5870K52199k19468
11830A0423669k97690K0282J79942k08827q9448J71280K08394m1207m89447j40963
11820I735985J51642M5900j41377N227k1373L3617o1113j14830q791m2099j82978
$$ plain form
11809 9399810 9292995 9456096 9366768 9381008 9410707 9335875 9242822 9203914 9262997 9316749 9175339
11798 9175339 9042225 9059371 8932165 8870350 8993629 9131168 9112497 9062046 8827272 8958974
11788 8958974 9043538 8734783 8377725 8572401 8795505 8443031 8473549 8602765 8464956 8428636
11778 8428636 8412988 8541870 8652799 8680823 8541800 8444764 8343309 8260632 8157522 8211324
11768 8211324 8374321 8460006 8600641 8670958 8591291 8483687 8264378 8094243 8005337 7998165
11758 7998165 8020268 8079234 8165255 8108391 8108193 8046356 7928271 8037312 7812293 7595792 7572599
11747 7572599 7642969 7604086 7617903 7705902 7757539 7652839 7375049 7209146 7170468 7223019 7317123
11736 7317123 7446004 7216452 6888442 6759834 6836646 6889104 6955550 6990164 6950084 7009097
$$ packed form
11809I399810j06815J63101q9328J4240K9699p4832r3053l8908N9083N3752j41410
11798I175339j33114J7146j27206o1815J23279J37539j8671n0451k34774J31702
11788H958974Q4564l08755l57058J94676K23104l52474L0518J29216j37809l6320
11778H428636j5648J28882J10929K8024j39023r7036j01455q2677j03110N3802
11768H211324J62997Q5685J40635P0317p9667j07604k19309j70135q8906p172
11758G998165K2103N8966Q6021n6864j98o1837j18085J09041k25019k16501k3193
11747G572599P0370l8883J3817Q7999N1637j04700k77790j65903l8678N2551R4104
11736G317123J28881k29552l28010j28608P6812N2458O6446L4614m0080N9013
$$ plain form
11726 7009097 7019198 6869619 6796477 6735553 6486146 6179713 6300390 6511549 6412731 6236292
11716 6236292 6232369 6211029 6173953 6012230 6011056 6267405 6328446 6096573 5948095 5955167 6076945
11705 6076945 6060743 5891918 5898789 5928869 5645318 5652670 5575503 5461945 5528301 5481858 5551262
11694 5551262 5376667 5435379 5488407 5260913 5324858 5575638 5721639 5451431 5142824 5006191
11684 5006191 4931827 4946176 4968214 4986100 4981419 5084763 5172745 5222499 4995835 4820615 4660204
11673 4660204 4716552 4812640 4673903 4740061 4738710 4563946 4450407 4589010 4585067 4534094 4444984
11662 4444984 4420338 4621796 4705166 4582078 4591860 4785399 4757247 4471144 4485389 4620269
11652 4620269 4531592 4195970 4144413 4252671 4361574 4391390 4190944 4168558 4197398 3981221
$$ packed form
11726G009097J0101j49579p3142o0924k49407l06433J20677K11159r8818j76439
11716F236292l923k1340l7076j61723j174K56349O1041k31873j48478P072J21778
11705F076945j6202j68825O871L0080k83551P352p7167j13558O6356m6443O9404
11694E551262j74595N8712N3028k27494O3945K50780J46001k70208l08607j36633
11684E006191p4364J4349K2038J7886m681J03344Q7982M9754k26664j75220j60411
11673D660204N6348R6088j38737O6158j351j74764j13539J38603l943n0973q9110
11662D444984k4646K01458Q3370j23088R782J93539k8152k86103J4245J34880
11652D620269q8677l35622n1557J08258J08903K9816k00446k2386K8840k16177
$$ plain form
11642 3981221 3984660 3943587 4046537 4144942 4104183 4123844 4088244 4063711 3700673 3566060 3509377
11631 3509377 3837431 4060824 4080995 4146904 4084881 4013399 3959003 3982775 3756381 3594083
11621 3594083 3584922 3546156 3598072 3780640 3949363 3898186 3805785 3677189 3711689 3781093 3723077
11610 3723077 3541346 3456678 3365853 3526255 3603600 3521091 3389158 3448326 3412934 3419968 3559843
11599 3559843 3471420 3414574 3475023 3244168 3142204 3220853 3313990 3436507 3430697 3547676 3526070
11588 3526070 3187761 3078792 3002218 3107277 3054416 3023649 3053749 2971439 3124007 3202410
11578 3202410 3202264 3157598 3009977 3123701 3134669 2941075 2822674 2806231 3003413 3272583
11568 3272583 3119110 3045962 3188791 3046366 2963667 2923870 2896834 3019997 3077803 3003939
$$ packed form
11642C981221L439m1073J02950R8405m0759J9661l5600k4533l63038j34613n6683
11631C509377L28054K23393K0171O5909o2023p1482n4396K3772k26394j62298
11621C594083r161l8766N1916J82568J68723n1177r2401j28596L4500O9404n8016
11610C723077j81731q4668r0825J60402P7345q2509j31933N9168l5392P034J39875
11599C559843q8423n6846O0449k30855j01964P8649R3137J22517n810J16979k1606
11588C526070l38309j08969p6574J05059n2861l0767L0100q2310J52568P8403
11578C202410j46m4666j47621J13724J0968j93594j18401j6443J97182K69170
11568C272583j53473p3148J42829j42425q2699l9797k7036J23163N7806p3864
$$ plain form
11558 3003939 2911868 3003614 3178390 3128757 2853059 2784389 2811064 2781093 2882541 2834485 2895098
11547 2895098 2831234 2638489 2579387 2455596 2541259 2715293 2793566 2762116 2527235 2601167
11537 2601167 2807192 2929578 2962268 3083326 3029880 2923069 2789699 2750380 2726632 2608587
11527 2608587 2623045 2679420 2784652 2951209 2867892 2563845 2558689 2599902 2552296 2653969 2731107
11516 2731107 2743921 2748122 2732970 2540772 2520389 2485908 2591039 2573153 2533402 2625840 2644077
11505 2644077 2533596 2528772 2543396 2591671 2645772 2524395 2469625 2511353 2539364 2482699 2471685
11494 2471685 2439766 2279302 2301083 2161846 2339854 2196365 2181286 2214154 2347541 2377906
11484 2377906 2496186 2645333 2618262 2662128 2629061 2392728 2278377 2360212 2196696 2196059 2271133
$$ packed form
11558C003939r2071R1746J74776m9633k75698o8670K6675k9971J01448m8056O0613
11547B895098o3864j92745n9102j23791Q5663J74034P8273l1450k34881P3932
11537B601167K06025J22386L2690J21058n3446j06811j33370l9319k3748j18045
11527B608587J4458N6375J05232J66557q3317l04047n156M1213m7606J01673P7138
11516B731107J2814M201j5152j92198k0383l4481J05131j7886l9751R2438J8237
11505B644077j10481m824J4624M8275N4101j21377n4770M1728K8011n6665j1014
11494B471685l1919j60464K1781j39237J78008j43489j5079L2868J33387L0365
11484B377906J18280J49147k7071M3866l3067k36333j14351Q1835j63516o37P5074
$$ plain form
11473 2271133 2055166 1927381 1891865 1858545 1907027 1872623 2014765 2046084 2014129 2233301
11463 2233301 2327339 2449843 2453869 2278913 1929658 1808436 1817934 1859530 1854658 1974394 2186480
11452 2186480 2234897 2110232 1988524 1930958 1951496 1897557 1928817 1896744 1902945 1896852 1843583
11441 1843583 1934106 1876558 1769114 1790242 1794794 1751740 1611726 1771211 1924205 2062153
11431 2062153 2159145 2213126 2201466 1946326 1835970 1882445 1734464 1635437 1518094 1562853
11421 1562853 1744775 1978617 2027303 1761915 1498835 1573492 1653162 1522515 1510904 1465238
11411 1465238 1516822 1205669 1411785 1532659 1597860 1611120 1514713 1539676 1498559 1650172
11401 1650172 1836138 1655830 1486788 1404792 1389322 1344567 1280217 1285688 1256387 1448209 1500657
$$ packed form
11473B271133k15967j27785l5516l3320M8482l4404J42142L1319l1955K19172
11463B233301R4038J22504M026j74956l49255j21222R498M1596m872J19736K12086
11452B186480M8417j24665j21708n7566K0538n3939L1260l2073O201o093n3269
11441A843583R0523n7548j07444K1128M552m3054j40014J59485J52994J37948
11431B062153R6992N3981j1660k55140j10356M6475j47981r9027j17343M4759
11421A562853J81922K33842M8686k65388k63080P4657P9670j30647j1611m5666
11411A465238N1584l11153K06116J20874O5201J3260r6407K4963m1117J51613
11401A650172J85966j80308j69042q1996j5470m4755o4350N471k9301J91822N2448
$$ plain form
11390 1500657 1461465 1551996 1571100 1493480 1464339 1289496 1558568 1895460 1903240 1801475 1569471
11379 1569471 1486369 1481077 1617907 1751491 1674976 1603762 1596002 1622666 1483208 1443414 1584434
11368 1584434 1487784 1593045 1784093 1548642 1402449 1438534 1446830 1607994 1574087 1659702
11358 1659702 1630691 1557331 1557290 1444550 1071008 925354 1026437 1322853 1569686 1540509 1494099
11347 1494099 1477130 1519126 1551459 1518599 1551835 1532189 1462855 1374758 1260422 1395841 1667476
11336 1667476 1613349 1544551 1490310 1479224 1381862 1336664 1354439 1369185 1192113 1162745 1094858
11325 1094858 1102389 1051888 898947 1018664 1228809 1030196 971913 997826 1094315 1108938 1375319
11314 1375319 1327492 1211817 1180092 1144315 1071690 1233689 1270261 1291135 1084807 1190443
$$ packed form
11390A500657l9192R0531J9104p7620k9141j74843K69072L36892P780j01765k32004
11379A569471q3102n292J36830J33584p6515p1214p760K6664j39458l9794J41020
11368A584434r6650J05261J91048k35451j46193L6085Q296J61164l3907Q5615
11358A659702k9011p3360m1j12740l73542j45654J01083K96416K46833k9177m6410
11347A494099j6969M1996L2333l2860L3236j9646o9334q8097j14336J35419K71635
11336A667476n4127o8798n4241j1086r7362m5198J7775J4746j77072k9368o7887
11325A094858P531n0501j52941J19717K10145j98613n8283K5913R6489J4623K66381
11314A375319m7827j15675l1725l5777p2625J61999L6572K0874k06328J05636
$$ plain form
11304 1190443 1431105 1485771 1429937 1483021 1471717 1276514 1311823 1387517 1226311 1162814 1104258
11293 1104258 1398298 1481553 1520723 1450748 1443352 1333820 1055376 1021117 1134107 1233947 1208579
11282 1208579 1127229 1220229 1192204 1144818 1188776 1261014 1441588 1494822 1484508 1419820 1405677
11271 1405677 1103926 1005852 1013695 1008909 976659 1127476 906965 1138591 1345092 1138237
11261 1138237 1116631 1237369 1362709 1120228 1091099 1011290 993130 1253312 1254493 1053783
11251 1053783 1003896 1143346 1048335 1005248 1005245 978615 981660 1023449 1018391 1052157 1162771 1304858
11239 1304858 1219905 1073111 998083 892926 794415 800170 869102 970158 1068513 982609 1124268
11228 1124268 1269393 1157966 898602 801728 799272 573348 716304 986848 1279899 1207023
$$ packed form
11304A190443K40662N4666n5834N3084j1304j95203L5309P5694j61206o3497n8556
11293A104258K94040Q3255L9170o9975p396j09532k78444l4259J12990R9840k5368
11282A208579q1350R3000k8025m7386M3958P2238J80574N3234j0314o4688j4143
11271A405677l01751r8074P843m786l2250J50817k20511K31626K06501k06855
11261A138237k1606J20738J25340k42481k9129p9809j8160K60182J181k00710
11251A053783m9887J39450r5011m3087lk6630L045M1789n058L3766J10614J42087
11239A304858q4953j46794p5028j05157r8511N755O8932J01056R8355q5904J41659
11228A124268J45125j11427k59364r6874k456k25924J42956K70544K93051p2876
$$ plain form
11218 1207023 1214216 1139288 843072 872964 959450 885281 926327 904917 827457 838536 873958
11207 873958 859467 738690 750315 954796 1018953 868283 961239 857667 907422 990904 1022533
11196 1022533 1046127 984622 808441 883245 1012865 1013737 1191377 1255099 1030144 943262 960036
11185 960036 1178385 1242965 1211716 970574 846348 743324 823218 939661 982392 721522
11175 721522 808389 1088426 1230704 981502 794509 949962 1054819 1193406 1310787 1206518
11165 1206518 1008874 1010793 1119281 1136718 1168318 1147907 1135611 1198927 1169833 974852 772902
11154 772902 794677 684300 610045 626048 645984 598246 754899 886502 1043377 1104570 969165
11143 969165 917190 903989 662395 668636 723231 543924 662776 889894 943115 865739 884051
$$ packed form
11218A207023P193p4928k96216K9892Q6486p4169M1046k1410p7460J1079L5422
11207H73958j4491j20777J1625K04481O4157j50670R2956j03572M9755Q3482L1629
11196A022533K3594o1505j76181P4804J29620Q72J77640O3722k24955q6882J6774
11185I60036K18349O4580l1249k41142j24226j03024P9894J16443M2731k60870
11175G21522Q6867K80037J42278k49202j86993J55453J04857J38587J17381j04269
11165A206518j97644J919J08488J7437L1600k0411j2296O3316k9094j94981k01950
11154G72902K1775j10377p4255J6003J9936m7738J56653J31603J56875O1193j35405
11143I69165n1975j3201k41594O241N4595j79307J18852K27118N3221p7376J8312
$$ plain form
11132 884051 975019 1039917 970916 1031074 1029943 1113486 1145534 1075587 877332 723092 760709
11121 760709 630886 530792 633789 645915 836228 1150020 1169319 989767 1023299 1009819
11111 1009819 1106299 952213 881596 1142167 1106837 1147163 941752 680750 607823 574318
11101 574318 585180 908702 969341 1028929 1106196 1130665 1032963 948888 945820 726516 754469
11090 754469 872012 931436 1027786 957909 965307 917483 722044 613297 504426 388901 502114
11079 502114 515171 389068 530593 685183 593418 619903 632670 954378 1343893 1387134
11069 1387134 1300948 1007360 996313 1101874 1040693 882537 806119 970857 924399 957446
11059 957446 924038 696998 695420 742077 665515 490014 525780 683661 877939 812928 766789
$$ packed form
11132H84051R0968O4898o9001O0158j131Q3543L2048o9947j98255j54240L7617
11121G60709j29823j00094J02997J2126J90313L13792J9299j79552L3532j3480
11111A009819R6480j54086p0617K60571l5330M0326k05411k61002p2927l3505
11101E74318J0862L23522O0639N9588P7267K4469r7702q4075l068k19304K7953
11090G54469J17543N9424R6350o9877P398m7824j95439j08747j08871j15525J13213
11079E02114J3057j26103J41525J54590r1765K6485J2767L21708L89515M3241
11069A387134q6186k93588j1047J05561o1181j58156p6418J64738m6458L3047
11059I57446l3408k27040j578M6657p6562j75501L5766J57881J94278o5011m6139
$$ plain form
11048 766789 817179 813749 816129 695590 800895 980426 976196 894223 1055857 904043 1086514
11037 1086514 1169965 1271446 1467950 1434546 1450093 1374593 1394792 1548390 1767737 2023463
11027 2023463 2086768 2060067 2055603 2031493 2177441 2319420 2301125 2214048 2314890 2387113 2578708
11016 2578708 2768851 2768374 2800801 2832198 2830467 2642924 2324435 2099954 2020138 2106280 2211448
11005 2211448 2275633 2303150 2330716 2306518 2500057 2480600 2296106 2013598 1915419 1987139 1920886
10994 1920886 1878110 1994411 1756970 1728062 1861285 1707348 1557429 1461045 1481804 1307178
10984 1307178 1099157 1095840 1053686 1070730 1035618 1117671 1160547 1045486 823117 587915 702617
10973 702617 976234 964680 966541 975571 842128 909987 891635 936682 1012647 982626 962726
$$ packed form
11048G66789N0390l430K380j20539J05305J79531m230q1973J61634j51814J82471
11037A086514Q3451J01481J96504l3404J5547p5500K0199J53598K19347K55726
11027B023463O3305k6701m464k4110J45948J41979j8295q7077J00842P2223J91595
11016B578708J90143m77L2427L1397j731j87543l18489k24481p9816Q6142J05168
11005B211448O4185K7517K7566k4198J93539j9457j84494k82508r8179P1720o6253
10994A920886m2776J16301k37441k8908J33223j53937j49919r6384K0759j74626
10984A307178k08021l317m2154J7044l5112Q2053M2876j15061k22369k35202J14702
10973G02617K73617j1554J861R030j33443O7859j8352M5047P5965l0021j9900
$$ plain form
10962 962726 730363 834517 1128083 1089762 1032278 1025500 1081215 1048165 843530 841576 916858
10951 916858 1045946 1070511 987539 844452 863662 1169215 1195859 1102980 1058946 862655 900275
10940 900275 968849 746839 538257 349206 472150 698912 878445 860198 837776 1045768
10930 1045768 1081139 905971 852531 952358 1143677 1145167 1207896 1464381 1286752 972893
10920 972893 775856 1033658 1138727 1194554 1355712 1374513 1270715 1265337 1374341 1289527
10910 1289527 1268358 1264397 1232004 1391505 1353964 1216110 1478009 1726359 1571038 1475676
10900 1475676 1402943 1232917 1375693 1503941 1576827 1378399 1228321 1524629 1356515 1335107
10890 1335107 1425442 1434884 1640706 1685776 1624172 1630085 1628543 1797812 1848643 1988404 1991969
$$ packed form
10962I62726k32363J04154K93566l8321n7484o778N5715l3050k04635j954P5282
10951I16858J29088K4565q2972j43087J9210L05553K6644r2879m4034j96291L7620
10940I00275O8574k22010k08582j89051J22944K26762J79533j8247k2422K07992
10930A045768L5371j75168n3440R9827J91319J490O2729K56485j77629l13859
10920I72893j97037K57802J05069N5827J61158J8801j03798n378J09004q4814
10910A289527k1169l961l2393J59501l7541j37854K61899K48350j55321r5362
10900A475676p2733j70026J42776J28248P2886j98428j50078K96308j68114k1408
10890A335107R0335R442K05822M5070o1604N913j542J69269N0831J39761L565
$$ plain form
10879 1991969 1956625 1927464 1894993 1853032 1842892 2022905 1946393 2024992 2241680 2112950 2042883
10868 2042883 2142435 2073308 2284352 2560569 2601917 2701516 2707873 2316754 2309053 2251149 2343443
10857 2343443 2480220 2610701 2557559 2500704 2696646 2780304 2529490 2324119 2322394 2364477
10847 2364477 2350487 2511171 2468734 2379967 2535803 2730588 2728610 2689230 2820270 2860230 2731241
10836 2731241 2803315 3032909 3173755 3084926 2888287 2746041 2713432 2808499 2835647 2711850
10826 2711850 2622440 2412620 2574708 2679511 2852987 2994227 2989776 2989154 2939814 2848080 2719371
10815 2719371 2777121 2974518 2837330 2622755 2407115 2276860 2198121 2094694 2111524 2132929
10805 2132929 2212283 2271680 2240946 2442824 2628965 2503727 2286450 2217406 2141908 2242961
$$ packed form
10879A991969l5344k9161l2471m1961j0140J80013p6512P8599K16688j28730p0067
10868B042883R9552o9127K11044K76217M1348R9599O357l91119p701n7904R2294
10857B343443J36777J30481n3142n6855J95942Q3658k50814k05371j725M2083
10847B364477j3990J60684m2437q8767J55836J94785j978l9380J31040L9960j28989
10836B731241P2074K29594J40846q8829j96639j42246l2609R5067K7148j23797
10826B711850q9410k09820J62088J04803J73476J41240m451o22m9340r1734j28709
10815B719371N7750J97397j37188k14575k15640j30255p8739j03427J6830K1405
10805B132929P9354N9397l0734K01878J86141j25238k17277o9044p5498J01053
$$ plain form
10795 2242961 2544495 2626387 2421314 2200750 2126511 2020612 2055243 2093316 1986537 1762575
10785 1762575 1898369 2071904 2052036 1982517 1956634 2176789 2251681 2061132 1791066 1718143
10775 1718143 1816308 1935311 1845654 1759703 1769667 1934171 2075828 1877414 1694102 1540774
10765 1540774 1621296 1660399 1771913 2045032 2074219 2020075 1907114 1860690 1784544 1741964 1597311
10754 1597311 1664977 1666344 1667825 1493862 1411888 1592400 1605199 1599730 1564502 1595311 1556815
10743 1556815 1606854 1612955 1495671 1316479 1191508 1310169 1298662 1397436 1662256 1844362
10733 1844362 1747410 1713222 1680884 1543460 1672967 1857576 1929405 1766916 1457353 1266078
10723 1266078 1482358 1562410 1660814 1522280 1502926 1529046 1613306 1667318 1794539 1873639 1931534
$$ packed form
10795B242961L01534Q1892k05073k20564p4239j05899L4631L8073j06779k23962
10785A762575J35794J73535j9868o9519k5883K20155P4892j90549k70066p2923
10775A718143R8165J19003q9657q5951R964J64504J41657j98414j83312j53328
10765A540774Q0522L9103J11514K73119K9187n4144j12961m6424p6146m2580j44653
10754A597311O7666J367J481j73963q1974J80512J2799n469l5228L0809l8496
10743A556815N0039O101j17284j79192j24971J18661j1507R8774K64820J82106
10733A844362r6952l4188l2338j37424J29507J84609P1829j62489l09563j91275
10723A266078K16280Q0052R8404j38534j9354K6120Q4260N4012J27221P9100N7895
$$ plain form
10712 1931534 2149760 2056153 1951271 2140644 2038658 1709971 1782109 1901453 2245083 2310082
10702 2310082 2262066 2121230 2155047 2136500 1886541 1791232 1776128 1898072 1963049 1995021 1992201
10691 1992201 2044313 2115589 1901051 1929987 2016311 1875451 1753535 1559148 1714750 1990406
10681 1990406 1945649 1918742 2018137 2237187 2304628 2429725 2464292 2431981 2521125 2567135 2459663
10670 2459663 2421728 2249310 2446169 2370249 2321736 2563870 2734696 2665544 2621683 2638465
10660 2638465 2679849 2855783 2774790 2560160 2565208 2629352 2812833 3036802 3250929 3400383
10650 3400383 3493036 3712184 4090225 4309058 4555755 4811332 5241680 5372751 5722662 6118695
10640 6118695 6011820 5937091 5897312 5983893 6139530 6466768 6700042 7044299 7189614 7362485
$$ packed form
10712A931534K18226r3607j04882J89373j01986l28687P2138J19344L43630O4999
10702B310082m8016j40836L3817j8547k49959r5309j5104J21944O4977L1972k820
10691A992201N2112P1276k14538K8936Q6324j40860j21916j94387J55602K75656
10681A990406m4757k6907R9395K19050O7441J25097L4567l2311Q9144M6010j07472
10670B459663l7935j72418J96859p5920m8513K42134J70826o9152m3861J6782
10660B638465M1384J75934q0993k14630N048O4144J83481K23969K14127J49454
10650C400383R2653K19148L78041K18833K46697K55577M30348J31071L49911L96033
10640F118695j06875p4729l9779Q6581J55637L27238K33274L44257J45315J72871
$$ plain form
10630 7362485 7858571 8794159 9852075 11021123 12038109 13014975 14075495 14998328 15997657
10621 15997657 16946868 18163763 19606678 21667943 24654608 28257511 32909376 39423663
10613 39423663 47832707 58000983 70045817 83352663 96753240 109564308 120325122
10606 120325122 127613982 131086456 132030034 133104420 136829650 145493874 160206669 180457193
10598 180457193 204306517 228616410 250233763 266471447 273793086 270390498 259630086
10591 259630086 249033074 244997458 250280448 265560846 288916723 317110055 345092898
10584 345092898 367755428 380697051 379124255 361375523 332850182 304055710 282890817
10577 282890817 272052453 270793813 277260231 287767756 298353884 305459266 305619841 295907822
$$ packed form
10630G362485M96086R35588J057916J169048J016986R76866J060520R22833R99329
10621A5997657R49211J216895J442915K061265K986665L602903M651865O514287
10613C9423663Q409044J0168276J2044834J3306846J3400577J2811068J0760814
10606A20325122P288860L472474R43578J074386L725230Q664224J4712795K0250524
10598A80457193K3849324K4309893K1617353J6237684P321639l402588j0760412
10591B59630086j0597012m035616N282990J5280398K3355877K8193332K7982843
10584C45092898K2662530J2941623j572796j7748732k8525341k8794472k1164893
10577B82890817j0838364j258640O466418J0507525J0586128P105382J60575r712019
$$ plain form
10569 295907822 275733541 249603624 224712945 205233828 192492779 185699089 183177866
10562 183177866 182930103 182636290 180635551 175417402 166026229 152840655 137657623 122829671
10554 122829671 109964854 99660500 91666463 85458324 80319893 75965019 72591540 69613825
10546 69613825 67147872 64750179 62500342 60601842 58822318 57176675 55725358 54198041
10538 54198041 52868532 51874408 50852100 49910499 48830534 47867113 46969696 46275777 45574711
10529 45574711 44890424 44315819 43721453 43489946 43130629 42669858 42227049 41857247 41644292
10520 41644292 41265426 40933747 40552440 40358542 40330504 40455615 40642004 40703500 40581887 40539403
10510 40539403 40972746 41268014 41433347 41966994 42689020 43334589 43932613 44531714 45259243
$$ packed form
10569B95907822k0174281k6129917k4890679j9479117j2741049o793690k521223
10562A83177866k47763k93813k000739n218149r391173j3185574j5183032j4827952
10554A22829671j2864817j0304354p994037o208139n138431m354874l373479k977715
10546F9613825k465953k397693k249837j898500j779524j645643j451317j527317
10538E4198041j329509r94124j022308r41601j079965r63421q97417o93919p01066
10529D5574711o84287n74605n94366k31507l59317m60771m42809l69802k12955
10520D1644292l78866l31679l81307j93898k8038J25111J86389O1496j21613m2484
10510D0539403M33343K95268J65333N33647P22026O45569N98024N99101P27529
$$ plain form
10501 45259243 46050389 47143266 48333649 49439365 50671494 51691273 52983547 54580658
10493 54580658 56252953 58016475 59805483 61627517 63801024 66035342 68198783 70274537
10485 70274537 72227125 74323584 76268350 78414326 80335032 82400816 84377334 85952441
10477 85952441 87187306 88568634 90051411 91382547 92592956 93892903 95210550 96575795
10469 96575795 97750087 98892179 100117758 101275712 102393823 103610000 104751967 105946627
10461 105946627 107240172 108442122 109412372 110329446 111452870 112491172 113363991 114196796
10453 114196796 114917958 115666396 116220974 116367271 116619252 116837933 116713626 116381991 116029231
10444 116029231 115731201 115045677 114259052 113578320 112994363 112170592 111303388 110249826 109196748
$$ packed form
10501D5259243P91146J092877J190383J105716J232129J019779J292274J597111
10493E4580658J672295J763522J789008J822034K173507K234318K163441K075754
10485G0274537J952588K096459J944766K145976J920706K065784J976518J575107
10477H5952441J234865J381328J482777J331136J210409J299947J317647J365245
10469I6575795J174292J142092J225579J157954J118111J216177J141967J194660
10461A05946627J293545J201950R70250R17074J123424J038302Q72819Q32805
10453A14196796P21162P48438N54578J46297K51981K18681j24307l31635l52760
10444A16029231k98030o85524p86625o80732n83957q23771q67204j053562j053078
$$ plain form
10435 109196748 108124138 107090472 106206448 105340264 104220141 103085553 102130687 101000924
10427 101000924 99751120 98792204 98082983 97031313 95651098 94210697 92967780 91657939
10419 91657939 90205951 88574648 86814229 84858733 82965599 81052506 79013079 76925242
10411 76925242 74857220 72933008 70891102 68971487 66831053 64690604 62698638 60967044
10403 60967044 59355043 57500063 55830321 54430848 52840731 51187588 49572605 48012946
10395 48012946 46575420 45436775 44312642 43255033 42351218 41199864 39996943 38794540
10387 38794540 37866852 36898706 35804079 34960908 34023484 33388754 32558118 32091612 31519933
10378 31519933 30805802 30202282 29676376 28881995 28360300 27921426 27272675 26463465 25566502
$$ packed form
10435A09196748j072610j033666q84024q66184j120123j134588r54866j129763
10427A01000924j249804r58916p09221j051670j380215j440401j242917j309841
10419I1657939j451988j631303j760419j955496j893134j913093k039427k087837
10411G6925242k068022j924212k041906j919615k140434k140449j991966j731594
10403F0967044j612001j854980j669742j399473j590117j653143j614983j559659
10395D8012946j437526j138645j124133j057609r03815j151354j202921j202403
10387C8794540r27688r68146j094627q43171r37424o34730q30636m66506n71679
10378C1519933p14131o03520n25906p94381n21695m38874o48751q09210q96963
$$ plain form
10369 25566502 25011724 24538040 23932232 23608824 23319700 22884179 22408111 22123721 21602160
10360 21602160 21201672 20928260 20626144 20245965 19936180 19562385 19195280 19007368 18769089
10351 18769089 18383891 17908404 17459653 17118361 16869987 16680074 16278111 15980335 15889764
10342 15889764 15805653 15354225 14961451 14914268 14782670 14268847 13905515 13949755 13959156 13528254
10332 13528254 13309739 13207901 13035112 12798321 12587536 12462795 12271158 12023378 11877603
10323 11877603 11516480 11285064 11286145 11367476 11428103 11072673 10548369 10354635 10446240 10332669
10313 10332669 10019708 9798128 9711081 9548859 9565827 9479969 9403621 9225410 9008743 8943596
10303 8943596 8902963 8665620 8393454 8148512 8121782 8012555 8174669 8129699 7915302 7864530
$$ packed form
10369B5566502n54778m73684o05808l23408k89124m35521m76068k84390n21561
10360B1602160m00488k73412l02116l80179l09785l73795l67105j87912k38279
10351A8769089l85198m75487m48751l41292k48374j89913m01963k97776r0571
10342A5889764q4111m51428l92774m7183j31598n13823l63332M4240R401m30902
10332A3528254k18515j01838j72789k36791k10785j24741j91637k47780j45775
10323A1877603l61123k31416J081Q1331O0627l55430n24304j93734R1605j13571
10313A0332669l12961k21580q7047j62222J6968q5858p6348j78211k16667o5147
10303H943596m0633k37343k72166k44942k6730j09227J62114m4970k14397n0772
$$ plain form
10293 7864530 7723734 7595617 7507146 7423772 7318116 7195860 7159890 7094514 6851906 6820954
10283 6820954 6950261 6868702 6718206 6679997 6452286 6077963 6148285 6109542 6045936 5995880
10273 5995880 5927382 5659103 5672545 5820858 5832404 5832254 5814761 5583448 5510040 5309202 5056237
10262 5056237 4988152 4973620 4979844 4884281 4597624 4687612 4717651 4533374 4320547 4224250 4340247
10251 4340247 4411166 4454553 4386794 4296765 4167550 4168068 4126714 4075604 4105901 3974748 3961598
10240 3961598 3869218 3626375 3596909 3622958 3449019 3382340 3408768 3378402 3580287 3543937 3474367
10229 3474367 3530603 3390470 3333040 3371372 3263978 3108571 3038423 3123337 3017474 2969736
10219 2969736 3047325 3136119 2993817 2778874 2923727 3092561 3223289 3338040 3165270 2998829
$$ packed form
10293G864530j40796j28117q8471q3374j05656j22256l5970o5376k42608l0952
10283F820954J29307q1559j50496l8209k27711l74323P0322l8743o3606n0056
10273E995880o8498k68279J3442J48313J1546j50j7493k31313p3408k00838k52965
10262E056237o8085j4532O224r5563k86657Q9988L0039j84277k12827r6297J15997
10251D340247P0919M3387o7759r0029j29215N18m1354n1110L0297j31153j3150
10240C961598r2380k42843k9466K6049j73939o6679K6428l0366K01885l6350o9570
10229C474367N6236j40133n7430L8332j07394j55407p0148Q4914j05863m7738
10219B969736P7589Q8794j42302k14943J44853J68834J30728J14751j72770j66441
$$ plain form
10209 2998829 2888010 2827054 2726719 2798322 2780081 2818799 2653986 2503227 2467710 2519334
10199 2519334 2597968 2436493 2182295 2007986 2084102 2292259 2380391 2391499 2408585 2280639
10189 2280639 2314430 2378963 2250589 2127621 2140469 2276102 2243566 2110309 2058259 2303310
10179 2303310 2198925 2096680 2291764 2334349 2145489 2122187 2317239 2448216 2568593 2694006
10169 2694006 2784714 2873942 2861542 2688380 2599023 2643246 2723042 2796727 2902669 3077535 3327716
10158 3327716 3275996 3312019 3301516 3355522 3188586 2857887 2869132 3128505 3372139 3528951
10148 3528951 3700174 3765748 3810236 3569333 3146286 3253585 3169502 3047822 2904102 2940776
10138 2940776 3087534 3000446 3020231 3096600 3093098 3066787 3181612 2897031 2731435 2568621
$$ packed form
10209B998829j10819o0956j00335P1603j8241L8718j64813j50759l5517N1624
10199B519334P8634j61475k54198j74309P6116K08157Q8132J1108J7086j27946
10189B280639L3791O4533j28374j22968J2848J35633l2536j33257n2050K45051
10179B303310j04385j02245J95084M2585j88860k3302J95052J30977J20377J25413
10169B694006R0708Q9228j2400j73162q9357M4223P9796P3685J05942J74866K50181
10158C327716n1720L6023j0503N4006j66936l30699J1245K59373K43634J56812
10148C528951J71223O5574M4488k40903m23047J07299q4083j21680j43720L6674
10138B940776J46758q7088J9785P6369l502k6311J14825k84581j65596j62814
$$ plain form
10128 2568621 2229234 2028724 1957250 2177827 2135384 1812210 1666127 1803672 2015106 2066620
10118 2066620 1756398 1399338 1543539 1753650 1704849 1452418 1395307 1597166 1910653 1950140
10108 1950140 1743912 1605695 1464355 1448030 1208917 1147000 1436791 1448506 1306931 1065380
10098 1065380 1137606 1270468 1414311 1322637 1416958 1362395 1291811 1308882 1364267 1298783 1363334
10087 1363334 1520873 1360827 1232827 1310286 1204594 1014372 919601 747673 594928 640754
10077 640754 812880 816597 743031 783905 746410 799686 1044745 1303407 1266544 1068932 938444
10066 938444 987429 1176833 1100169 1032036 1124047 1158526 1158345 1196661 1493908 1669210 1557961
10055 1557961 1549117 1466897 1281347 1000600 1045894 1283849 1431559 1427451 1188445 1139604 1368895
$$ packed form
10128B568621l39387k00510p1474K20577m2443l23174j46083J37545K11434N1514
10118B066620l10222l57060J44201K10111m8801k52431n7111K01859L13487L9487
10108A950140k06228j38217j41340j6325k39113o1917K89791J1715j41575k41551
10098A065380P2226J32862J43843r1674R4321n4563p0584J7071N5385o5484O4551
10087A363334J57539j60046j28000P7459j05692j90222r4771j71928j52745M5826
10077F40754J72126L717p3566M0874l7495N3276K45059K58662l6863j97612j30488
10066I38444M8985J89404p6664o8133R2011L4479j81L8316K97247J75302j11249
10055A557961q844q2220j85550k80747M5294K37955J47710m108k39006m8841K29291
$$ plain form
10044 1368895 1539237 1496700 1428860 1256747 1115224 1092775 1063030 1157571 1242992 1262912 1263560
10033 1263560 1016497 900087 927635 921363 1104778 1143548 1255911 1304519 1286652 1233251 1165804
10022 1165804 1133800 1009421 1113864 1426741 1469046 1504342 1671772 1557480 1416529 1319007
10012 1319007 1278919 1310570 1304763 1276935 1226887 1259969 1276840 1165341 1096553 997765 986694
10001 986694 830419 827957 749626 784214 939525 805397 663806 775502 1064854 1134551
9991 1134551 1136852 1231680 1060062 920574 804051 848043 831814 965111 1112757 1095909 1052019
9980 1052019 978555 970152 1027440 961465 772700 818481 746705 616585 638153 670856 824865
9969 824865 841698 718531 763914 748327 747789 910621 861336 788243 604945 503870 627137
$$ packed form
10044A368895J70342m2537o7840j72113j41523k2449k9745R4541Q5421J9920O48
10033A263560k47063j16410K7548o272J83415L8770J12363M8608j7867n3401o7447
10022A165804l2004j24379J04443L12877M2305L5296J67430j14292j40951r7522
10012A319007m0088L1651n807k7828n0048L3082J6871j11499o8788r8788j1071
10001I86694j56275k462p8331L4588J55311j34128j41591J11696K89352O9697
9991A134551K301R4828j71618j39488j16523M3992j6229J33297J47646j6848m3890
9980A052019p3464q403N7288o5975j88765M5781p1776j30120K1568L2703J54009
9969H24865J6833j23167M5383j5587n38J62832m9285p3093j83298j01075J23267
$$ plain form
9958 627137 680800 578529 474125 637400 717564 637719 314155 169312 335762 482380
9948 482380 760565 737306 534596 547075 712170 770962 539504 372558 534703 593692
9938 593692 321263 108357 163715 353657 290763 108220 186325 296730 519714 668277
9928 668277 740596 692440 713813 521035 385021 337289 353720 277208 17207 -88519 -45380
9917 -45380 8329 55133 69933 290070 513238 643478 736923 794619 892093 646101 470927
9906 470927 359649 272024 316595 405319 483683 495403 225734 193866 306930 473230 443748
9895 443748 514075 494327 360904 383363 146638 161929 167969 310860 259950 98262 189598
9884 189598 300209 326862 305706 154855 -57242 183654 420758 278539 144334 71419
$$ packed form
9958F27137N3663j02271j04404J63275Q0164p9845l23564j44843J66450J46618
9948D82380K78185k3259k02710J2479J65095N8792k31458j66946J62145N8989
9938E93692k72429k12906N5358J89942o2894j82543P8105J10405K22984J48563
9928F68277P2319m8156K1373j92778j36014m7732J6431p6512k60001j05726M3139
9917d5380N3709M6804J4800K20137K23168J30240R3445N7696R7474k45992j75174
9906D70927j11278q7625M4571Q8724P8364J1720k69669l1868J13064J66300k9482
9895D43748P0327j9748j33423K2459k36725J5291O040J42891n0910j61688R1336
9884A89598J10611K6653k1156j50851k12097K40896K37104j42219j34205p2915
$$ plain form
9874 71419 170387 247519 186055 307088 536246 672956 518413 267460 166346 238359 265632
9863 265632 400381 351371 309992 287728 196553 270190 401530 330519 620483 707087 842995
9852 842995 794093 711321 621308 422674 415065 466151 583821 604793 608518 481271 308695
9841 308695 232326 169223 358738 477105 417012 477886 367044 299478 352444 134178 52131
9830 52131 66692 159053 204886 118221 14044 190313 193970 220541 194787 96326 359654
9819 359654 391833 193993 164838 337397 284170 3879 -29931 -1594 -215466 -391578 -217686
9808 -217686 -202114 -180030 -138330 -152003 -10121 -35437 -16889 158313 320438 118438 152270
9797 152270 300582 374039 290301 269440 523783 686965 667441 448527 429131 341445 167240
$$ packed form
9874G1419R8968P7132o1464J21033K29158J36710j54543k50953j01114P2013K7273
9863B65632J34749m9010m1379k2264r1175P3637J31340p1011K89964Q6604J35908
9852H42995m8902q2772r0013j98634p609N1086J17670K0972L725j27247j72576
9841C08695p6369o3103J89515J18367o0093O0874j10842o7566N2966k18266q2047
9830E2131J4561R2361M5833q6665j04177J76269L657K6571k5754r8461K63328
9819C59654L2179j97840k9155J72559n3227k80291l3810K8337k13872j76112J73892
9808b17686J5572K2084M1700j3673J41882k5316J8548J75202J62125k02000L3832
9797A52270J48312P3457q3738k0861K54343J63182j9524k18914j9396q7686j74205
$$ plain form
9786 167240 189654 291199 358189 421658 183959 52924 220574 349660 362482 355889 333296
9775 333296 333343 342608 314110 140564 84416 29840 4026 107053 208248 318596 399538 427893
9763 427893 459951 427104 344434 327390 71409 -22707 199040 378876 495247 475346 409355
9752 409355 240091 84223 62734 132017 438134 320093 224431 83160 95306 186592 493076
9741 493076 416532 184369 216588 164186 238717 397903 528730 422234 241761 308903 216700
9730 216700 139548 132786 91848 134463 313788 266733 109990 -131924 -235938 182549 329407
9719 329407 343829 225809 227982 274291 339104 158726 -24026 -63086 -224493 -327214 -109299
9708 -109299 202276 165508 101405 -17152 160815 2951 10216 267971 222097 274092 205955
$$ packed form
9786A67240K2414J01545O6990O3469k37699j31035J67650J29086J2822o593k2593
9775C33296M7R265k8498j73546n6148n4576k5814J03027J01195J10348Q0942K8355
9763D27893L2058l2847q2670j7044k55981r4116K21747J79836J16371j9901o5991
9752D09355j69264j55868k1489O9283L06117j18041r5662j41271J2146R1286L06484
9741D93076p6544k32163L2219n2402P4531J59186J30827j06496j80473O7142r2203
9730B16700p7152o762m0938M2615J79325m7055j56743k41914j04014M18487J46858
9719C29407J4422j18020K173M6309O4813j80378j82752l9060j61407j02721K17915
9708a09299L11575l6768o4103j18557J77967j57864P265K57755m5874N1995o8137
$$ plain form
9697 205955 -7760 -118869 -23827 203407 330733 75333 10726 -15002 38256 -32157 -57972
9686 -57972 -81076 120290 224618 284094 236010 162432 421750 457586 420711 340182 175324
9675 175324 -51073 -208092 -240850 -197679 4919 245787 266836 55479 -113350 -99368
9665 -99368 99465 92810 185417 322336 320302 173293 -113775 -273516 -35471 110759 106002
9654 106002 252368 93232 73155 149487 331797 525473 483628 677807 1080396 1268095
9644 1268095 1071270 655512 328455 100352 82843 175421 111686 183587 284008 331665
9634 331665 270549 214362 96091 -74189 -126593 -33942 46935 144840 199205 214036 106590
9623 106590 195537 290789 184986 -89419 -168191 -78888 -59343 -58410 -68078 104871 225229
$$ packed form
9697B05955k13715j11109R5042K27234J27326k55400o4607k5728N3258p0413k5815
9686e7972k3104K01366J04328N9476m8084p3578K59318L5836l6875q0529j64858
9675A75324k26397j57019l2758M3171K02598K40868K1049k11357j68829J3982
9665i9368J98833o655R2607J36919k034j47009k87068j59741K38045J46230m757
9654A06002J46366j59136k0077P6332J82310J93676m1845J94179M02589J87699
9644A268095j96825m15758l27057k28103j7509R2578o3735P1901J00421M7657
9634C31665o1116n6187j18271j70280n2404R2651Q0877R7905N4365J4831j07446
9623A06590Q8947R5252j05803k74405p8772Q9303J9545R33r668J72949J20358
$$ plain form
9612 225229 362327 316983 224929 210288 73503 -109224 -122693 -25034 -64844 89737 2047
9601 2047 -102732 -71699 79490 38256 50882 119000 226982 317195 339229 135474 -9718
9590 -9718 85008 348255 265767 189852 184177 294529 364600 260736 64535 -57511 104747
9579 104747 147582 329408 354888 292578 297352 330270 422519 395161 247278 248988 339016 304620
9567 304620 219690 107329 152079 165370 187870 -36316 -207350 -355580 -251420 -95569
9557 -95569 -31527 -20772 113404 148406 70377 -57559 95534 103607 -58174 -33151 43721
9546 43721 66715 266428 312436 303981 344089 462339 375239 339636 244384 202225 58169
9535 58169 -34743 3846 -11709 -135526 -199487 47340 -34444 158803 181698 35999 58228
$$ packed form
9612B25229J37098m5344r2054j4641j36785j82727j3469R7659l9810J54581q7690
9601B047j04779L1033J51189m1234J2626O8118J07982R0213K2034k03755j45192
9590i718R4726K63247q2488p5915n675J10352P0071j03864j96201j22046J62258
9579A04747M2835J81826K5480o2310M774L2918R2249k7358j47883J710R0028l4396
9567C04620q4930j12361M4750J3291K2500k24186j71034j48230J04160J55851
9557i5569O4042J0755J34176L5002p8029j27936J53093Q073j61781K5023P6872
9546D3721K2994J99713M6008q455M0108J18250q7100l5603r5252m2159j44056
9535E8169r2912L8589j5555j23817o3961K46827q1784J93247K2895j45699K2229
$$ plain form
9524 58228 -76218 -239995 -212338 -119776 -32242 -71655 65970 244733 296984 210827 90732
9513 90732 123833 217643 220824 83215 37875 70168 99461 119587 67088 228478 271001 56073
9501 56073 48832 142092 -23640 -175959 -70919 -9979 59030 -113600 -141 73382 -13523
9490 -13523 178552 241062 142133 84955 144172 146964 197781 103859 4087 77354 50386 73101
9478 73101 40011 76266 123366 228789 237289 196215 69800 51298 6459 4389 156120 199225
9466 199225 305920 476184 271663 410051 594146 679424 469123 142662 177283 294425
9456 294425 298401 366345 369569 397906 502872 428727 116725 180004 378551 210651 253061
9445 253061 277993 91797 175215 433199 398667 233035 26471 -246105 -376297 -295703
$$ packed form
9524E8228j34446j63777K7657R2562Q7534l9413J37625J78763N2251q6157j20095
9513I0732L3101R3810L181j37609m5340L2293K9293K0126n2499J61390M2523k14928
9501E6073p241R3260j65732j52319J05040O0940O9009j72630J13459P3523q6905
9490a3523J92075O2510r8929n7178N9217K792N0817r3922r9772P3267k6968K2715
9478G3101l3090L6255M7100J05423Q500m1074j26415j8502m4839k070J51731M3105
9466A99225J06695J70264k04521J38388J84095Q5278k10301l26461L4621J17142
9456B94425L976O7944L224K8337J04966p4145l12002O3279J98547j67900M2410
9445B53061K4932j86196Q3418K57984l4532j65632k06564k72576j30192Q0594
$$ plain form
9435 -295703 40614 178088 244323 326196 287733 178422 150895 123662 167778 -1169 -16108
9424 -16108 126437 280791 367445 393689 21266 -254097 -77062 63933 146984 108695 24625
9413 24625 22177 78110 66713 -58003 -4148 20847 -73085 -50914 50097 15562 -104192
9402 -104192 -68481 98989 47964 40272 -42803 112337 11827 -240318 -217560 -251134 15771
9391 15771 200849 208907 240807 180500 -83395 -195987 59613 121282 -10219 -20888 -13133
9380 -13133 -32914 -20381 -77751 -36329 -7198 -189764 -319525 -191229 -125720 -126928 -283966
9369 -283966 -143996 -84668 -66547 46278 149010 263819 247829 102184 -17040 -13385 -10476
9358 -10476 70500 152249 72849 52413 179376 157067 91256 127909 -24455 -104435 -94501 -39720
$$ packed form
9435b95703L36317J37474O6235Q1873l8463j09311k7527k7233M4116j68947j4939
9424a6108J42545J54354Q6654K6244l72423k75363J77035J40995Q3051l8289q4070
9413B4625k448N5933j1397j24716N3855K4995r3932K2171J01011l4535j19754
9402a04192L5711J67470n1025p692q3075J55140j00510k52145K2758l3574K66905
9391A5771J85078Q058L1900o0307k63895j12592K55600O1669j31501j0669P755
9380a3133j9781J2533n7370M1422K9131j82566j29761J28296O5509j208j57038
9369b83966J39970N9328J8121J12825J02732J14809j5990j45645j19224L655K909
9358a0476Q0976Q1749p9400k0436J26963k2309o5811L6653j52364p9980R934N4781
$$ plain form
9346 -39720 -86566 -177902 -438941 -366349 -95164 86593 136342 180867 518212 474583 474116
9335 474116 500872 281459 175445 108786 61812 225467 207716 223168 132717 11947 -158742
9324 -158742 -348162 -167864 -2078 -235 1581 12124 -80389 -86331 -76601 -160229 -218285 -357462
9312 -357462 -358163 -306469 -169274 -196862 -135683 -5586 203071 399421 382739 409115 345284
9301 345284 359940 262573 352227 109777 -126852 -55989 -64513 -133907 -302870 -203411 -222498
9290 -222498 -158011 34548 85004 90018 7796 -89714 -41588 -79271 149202 271133 153188
9279 153188 291914 253045 205582 164990 95196 155255 245170 122250 3399 -56303 -104664
9268 -104664 -239423 -138400 1881 5260 55027 48427 144541 270965 295158 264469 320712
$$ packed form
9346c9720m6846r1336k61039P2592K71185J81757M9749M4525L37345m3629m67
9335D74116K6756k19413j06014o6659m6974J63655j7751J5452r0451j20770j70689
9324a58742j89420J80298J65786J843J816J0543r2513n942R730q3628n8056j39177
9312c57462p01N1694J37195k7588O1179J30097K08657J96350j6682K6376o3831
9301C45284J4656r7367Q9654k42450k36629P0863q524o9394j68963R9459j9087
9290b22498O4487J92559N0456N014q2222r7510M8126l7683K28473J21931j17945
9279A53188J38726l8869m7463m0592o9794O0059Q9915j22920j18851n9702m8361
9268a04664j34759J01023J40281L379M9767o600R6114J26424K4193l0689N6243
$$ plain form
9257 320712 257342 158359 -203587 -148256 102886 285206 388403 273237 236814 99777
9247 99777 207298 345824 397247 327906 369999 446578 349487 248513 25205 140974 210985
9236 210985 156885 87786 118454 438009 388048 176528 -13786 -157921 -11121 51299 -94465
9225 -94465 -76498 -58256 -29920 104454 35648 124745 198526 222353 271642 183613 158897 74118
9213 74118 37177 60610 22554 26349 25682 170867 430991 453013 337153 213962 199752 159783
9201 159783 -106480 -213460 -159255 55031 136665 -36776 -12173 24227 189599 235332 333932
9190 333932 345311 53411 -187135 -227566 -14319 59903 -147850 -27181 27130 -5402 -65278
9179 -65278 -78474 -31220 167097 115396 239509 177896 -27761 -102848 36432 204487 196532
$$ packed form
9257C20712o3370r8983l61946N5331K51142J82320J03197j15166l6423j37037
9247I9777J07521J38526N1423o9341M2093P6579r7091j00974k23308J15769P0011
9236B10985n4100o9099L0668L19555m9961k11520j90314j44135J46800O2420j45764
9225i4465J7967J8242K8336J34374o8806Q9097P3781K3827M9289q8029k4716q4779
9213G4118l6941K3433l8056L795o67J45185K60124K2022j15860j23191j4210l9969
9201A59783k66263j06980N4205K14286Q1634j73441K4603L6400J65372M5733R8600
9190C33932J1379k91900k40546m0431K13247P4222k07753J20669N4311l2532n9876
9179f5278j3196M7254J98317n1701J24113o1613k05657p5087J39280J68055p955
$$ plain form
9168 196532 102738 98414 -150020 -430225 -450163 -374955 -87033 -202429 -340257 -266523 -264553
9157 -264553 -154148 -232372 -88945 214621 228202 267660 150113 55164 153296 141243 -38479
9146 -38479 10977 179949 86854 309480 369510 217228 170432 100622 -20143 -40532 -27535
9135 -27535 -127009 -235043 -297196 -260596 -245970 -87721 -69081 -128178 -178073 -4245 51331
9124 51331 119608 82911 -142264 -339936 -260427 -316206 -394359 -404065 -439521 -192224 116656
9113 116656 149001 -128235 -283946 -168611 -186085 -278644 -354853 -135368 -130455 -202983 -141405
9102 -141405 -138623 -76941 26421 34134 -185848 -165562 -13790 -89921 -412596 -430253 -104957
9091 -104957 41496 42509 5183 31185 145655 202991 126251 179993 382272 430744 412374
$$ packed form
9168A96532r3794m324k48434k80205j9938P5208K87922j15396j37828P3734J970
9157b64553J10405p8224J43427L03566J3581L9458j17547r4949R8132j2053j79722
9146c8479M9456J68972r3095K22626O0030j52282m6796o9810j20765k0389J2997
9135b7535r9474j08034o2153L6600J4626J58249J8640n9097m9895J73828N5576
9124E1331O8277l6697k25175j97672P9509n5779p8153r706l5456K47297L08880
9113A16656L2345k77236j55711J15335j7474r2559p6209K19485M913p2528O1578
9102a41405K782O1682J03362P713k19982K0286J51772p6131l22675j7657L25296
9091a04957J46453J013l7326K6002J14470N7336p6740N3742K02279M8472j8370
$$ plain form
9080 412374 379193 80608 91718 -70975 -117907 -133663 -150645 -167219 -61474 -1285 -67788
9069 -67788 -363537 -212154 -173597 -384958 -227648 82570 41169 52199 157024 7201
9059 7201 134 -52805 105748 335709 274488 157589 137614 290380 130303 147756 117413
9048 117413 88830 55142 50519 89498 -21010 -294948 -376028 -353416 -132382 -73680 23953
9037 23953 -18198 -67265 53322 175630 31286 -65622 -30585 -51068 -121311 -116052 -39515
9026 -39515 -9650 128771 193370 185620 81792 -23788 127090 262681 220475 -85445 -144115
9015 -144115 10314 92846 92089 169532 283930 203246 35653 21210 -134733 -238070 -278496
9004 -278496 -257808 -113104 -161525 -186286 10622 103922 148632 138782 -136858 -148692 -70632
$$ packed form
9080D12374l3181k98585J1110j62693m6932j5756j6982j6574J05745O0189o6503
9069f7788k95749J51383L8557k11361J57310L10218m1401J1030J04825j49823
9059G201p067n2939J58553K29961o1221j16899j9975J52766j60077J7453l0343
9048A17413k8583l3688m623L8979j10508k73938q1080K2612K21034N8702R7633
9037B3953m2151m9067J20587J22308j44344r6908L5037k0483p0243N259P6537
9026c9515K9865J38421O4599p750j03828j05580J50878J35591m2206l05920n8670
9015a44115J54429Q2532p57P7443J14398q0684j67593j4443j55943j03337m0426
9004b78496K0688J44704m8421k4761J96908R3300M4710r850k75640j1834P8060
$$ plain form
8993 -70632 -77465 -261239 -292909 -208173 -90396 24579 -94035 32720 -182587 -284192 -327975
8982 -327975 -276156 -126834 -176512 -194059 -33441 157800 198192 120201 -33478 -89605 -11855
8971 -11855 -41806 -66233 -183591 -110544 -24234 -65517 -157277 -84550 112725 184850 -93579
8960 -93579 -173091 -103138 -224587 -251177 -148865 -174147 -325634 -212701 -246445 -281595 -288397
8949 -288397 -105297 179372 126413 231422 376939 449419 162409 -32366 -43822 74021
8939 74021 48125 136763 231019 256745 192990 68926 215649 323395 75151 70153 123238
8928 123238 96531 216533 239625 -36351 -129304 -164274 -38235 119495 33262 -166436 -300908
8917 -300908 -501406 -670598 -695450 -627953 -343316 -109588 6051 -124158 -271595 -300973
$$ packed form
8993g0632o833j83774l1670Q4736J17777J14975j18614J26755k15307j01605m3783
8982c27975N1819J49322m9678j7547J60618J91241M0392p7991j53679n6127P7750
8971a1855k9951k4427j17358P3047Q6310m1283r1760P2727J97275P2125k78429
8960i3579p9512O9953j21449k6590J02312k5282j51487J12933l3744l5150o802
8949b88397J83100K84669n2959J05009J45517P2480k87010j94775j1456J17843
8939G4021k5896Q8638R4256K5726o3755j24064J46723J07746k48244m998N3085
8928A23238k6707J20002K3092k75976r2953l4970J26039J57730q6233j99698j34472
8917c00908k00498j69192k4852O7497K84637K33728J15639j30209j47437k9378
$$ plain form
8907 -300973 -64215 -94696 -93681 -186522 -114591 98188 126255 108463 162444 180227 89262
8896 89262 17991 102338 128394 -37907 -124493 -133489 -99433 -58717 -25166 -62704 -114523 -113326
8884 -113326 -246625 -152492 -160091 -69890 -52576 -122489 -73930 -53259 70001 165215 149558
8873 149558 267142 214804 -30256 -239879 -129378 165638 209684 65436 -8530 -45703
8863 -45703 -102159 -219233 -198396 -106864 32306 282038 220022 126224 157472 71909 175217
8852 175217 214637 103438 -67744 -199210 -223953 -133894 110441 140998 32584 -9656 38134
8841 38134 49159 199496 446940 532715 473929 223940 137669 41899 -42305 -149733 -296749
8830 -296749 -297375 -96730 131823 292808 315500 125453 39711 89936 224485 385776 304091
$$ packed form
8907c00973K36758l0481J015r2841P1931K12779K8067j7792N3981J7783r0965
8896H9262p1271Q4347K6056j66301q6586q996L4056M0716L3551l7538n1819J197
8884a13326j33299R4133p599R0201J7314o9913M8559K0671J23260R5214j5657
8873A49558J17584n2338k45060k09623J10501K95016M4046j44248p3966l7173
8863d5703n6456j17074K0837R1532J39170K49732o2016r3798L1248q5563J03308
8852A75217L9420j11199j71182j31466k4743R0059K44335L0557j08414m2240M7790
8841C8134J1025J50337K47444Q5775n8786k49989q6271r5770q4204j07428j47016
8830b96749o26K00645K28553J60985K2692j90047q5742N0225J34549J61291q1685
$$ plain form
8819 304091 290150 322002 115849 -99390 -347774 -358607 -165503 -13206 -206890 -133286
8809 -133286 107978 109053 15601 179608 264957 103380 -44072 -42167 -45142 5327 -70264
8798 -70264 -183372 -39669 103103 321669 208135 209034 283939 189890 -57126 -233049 -90553
8787 -90553 -69679 -314455 -404133 -253687 82969 93990 204440 384721 138404 -101092
8777 -101092 53046 -1885 -139972 -248636 -212037 -144101 -133372 -241587 -15923 193801
8767 193801 268043 -57453 -206439 -181813 -179986 -120633 -86402 -290373 -247291 -43997 76961
8756 76961 -70290 -150592 -48009 103647 120069 -10374 919 -148746 -266245 -199331 -236194
8745 -236194 -219349 -56599 72084 -45465 -224518 -336782 -222284 -172685 -196480 -119130
$$ packed form
8819C04091j3941L1852k06153k15239k48384j0833J93104J52297j93684P3604
8809a33286K41264J075r3452J64007Q5349j61577j47452J905k975N0469p5591
8798g0264j13108J43703J42772K18566j13534Q99P4905r4049k47016j75923J42496
8787i0553K0874k44776q9678J50446L36656J1021J10450J80281k46317k39496
8777a01092J54138n4931j38087j08664L6599O7936J0729j08215K25664K09724
8767A93801P4242l25496j48986K4626J827N9353L4231k03971M3082K03294J20958
8756G6961j47251q0302J02583J51656J6422j30443J1293j49665j17499O6914l6863
8745b36194J6845J62750J28683j17549j79053j12264J14498M9599k3795P7350
$$ plain form
8735 -119130 -31863 85510 151574 47592 172 278991 192202 136421 -138947 -405886 -357126
8724 -357126 20225 122056 -47475 -270566 -181746 -38606 -26232 13992 -129655 -205779
8714 -205779 -109914 -61720 -18023 -17388 -112082 -124874 106422 295588 150291 123242 304513
8703 304513 126043 -172732 -246271 -119157 78130 201839 185867 13739 -67248 -76537 -75277
8692 -75277 -131769 -156231 -170649 -98988 -20727 48592 66902 94338 21364 193232 224292 33043
8680 33043 58201 143699 29833 -268130 -243749 -11942 -96150 -60850 120326 313746 504413
8669 504413 207917 47935 -75502 -94741 -27787 322387 288163 240811 228231 159920 18533
8658 18533 -20478 120325 180271 208010 271386 307802 301056 317276 261547 43645 36789 102024
$$ packed form
8735a19130Q7267J17373O6064j03982m7420K78819q6789n5781k75368k66939M8760
8724c57126L77351J01831j69531k23091Q8820J43140J2374M0224j43647p6124
8714b05779R5865M8194M3697O35r4694j2792K31296J89166j45297k7049J81271
8703C04513j78470k98775p3539J27114J97287J23709j5972j72128q0987r289J260
8692g5277n6492k4462j4418P1661P8261O9319J8310K7436p2974J71868L1060j91249
8680C3043K5158Q5498j13866k97963K4381K31807q4208L5300J81176J93420J90667
8669E04413k96496j59982j23437j9239O6954L50174l4224m7352j2580o8311j41387
8658A8533l9011J40803N9946K7739O3376L6416o746J6220n5729k17902o856O5235
$$ plain form
8646 102024 70854 15870 44 -21410 -116563 -47366 54702 256439 369825 194846 5847
8635 5847 -104430 12442 100571 48022 193760 105938 60307 96082 55405 23583 -166231
8624 -166231 -291995 -270446 -143597 127046 -23093 -75627 18465 -18260 43174 298713 264988
8613 264988 163469 138373 62605 66894 24874 -189895 -173950 -24541 -167051 -495970 -510498
8602 -510498 -308240 -68564 -161800 39213 278587 229821 104619 118649 -9355 -159282
8592 -159282 -186341 -185921 -194462 -95850 138145 263909 343235 202982 61293 221446 252869
8581 252869 548877 539951 364010 232143 337642 237349 -9279 24497 44529 -31412 140508
8570 140508 278946 138261 -48638 -142256 111477 176051 177625 27292 -34732 -181875 -63309
$$ packed form
8646A02024l1170n4984j5826k1454r5153O9197J02068K01737J13386j74979j88999
8635E847j10277J16872Q8129n2549J45738q7822m5631L5775m0677l1822j89814
8624a66231j25764K1549J26849K70643j50139n2534R4092l6725O1434K55539l3725
8613B64988j01519k5096p5768M289m2020k14769J5945J49409j42510l28919j4528
8602e10498K02258K39676r3236K01013K39374m8766j25202J4030j28004j49927
8592a59282k7059M20q541R8612K33995J25764P9326j40253j41689J60153L1423
8581B52869K96008q926j75941j31867J05499j00293k46628L3776K0032p5941J71920
8570A40508J38438j40685j86899r3618K53733O4574J574j50333o2024j47143J18566
$$ plain form
8559 -63309 -26673 96619 238961 174890 114775 136570 222441 228635 201315 -12621 -126245
8548 -126245 -84001 -32875 -269128 -234353 -128160 -83324 16254 281676 261308 -31980 -17810
8537 -17810 162705 -127445 -222245 14193 255508 276370 299230 148830 -212247 -128090 21268
8526 21268 42442 22144 87815 149148 71177 -99428 -354939 -377503 -385928 -72429 28804
8515 28804 -58249 -68907 -92202 -150156 -218270 -271826 -281507 -370261 -131213 23552 -13565 -70691
8503 -70691 -316915 -458092 -273201 -218708 -197846 111591 165267 39039 -115904 -155696 -71795
8492 -71795 53641 31627 104997 12557 -31971 38485 169566 122958 -152618 -251693 -78926
8481 -78926 -18395 153506 24053 -14243 16590 -19811 31857 84729 97328 2511 117887
$$ packed form
8559f3309L6636J23292J42342o4071o0115K1795Q5871O194k7320k13936j13624
8548a26245M2244N1126k36253L4775J06193M4836R9578K65422k0368k93288J4170
8537a7810J80515k90150r4800K36438K41315K0862K2860j50400l61077Q4157J49358
8526B1268K1174k0298O5671O1333p7971j70605k55511k2564q425L13499J01233
8515B8804q7053j0658k3295n7954o8114n3556r681q8754K39048J54765l7117n7126
8503g0691k46224j41177J84891N4493K0862L09437N3676j26228j54943l9792Q3901
8492g1795J25436k2014P3370r2440m4528P0456J31081m6608k75576r9075J72767
8481g8926O0531J71901j29453l8296L0833l6401N1668N2872J2599r4817J15376
$$ plain form
8470 117887 36816 -124868 -326319 -62532 -9183 -39272 -122789 -163369 -98874 -134209 -95201
8459 -95201 -130348 -167101 -191934 -90487 142007 101741 -52043 18590 -25177 93759 179883
8448 179883 155453 40889 -19135 -26625 -48480 81346 -13075 -97512 2328 -7887 -55213
8437 -55213 -149846 -17722 -100572 -155562 -108857 -141912 -237274 -174084 72897 -47714 -119132
8426 -119132 78946 145621 242690 351825 377581 363936 341083 267402 1673 -11514 119521
8415 119521 145156 239274 360953 313148 109075 23622 52665 107545 314774 512591 454063
8404 454063 413543 306001 50980 -28553 -37118 15349 -264066 -146373 119260 51933 47180
8393 47180 257039 256516 -7554 -119011 -128802 -118582 -232063 -205205 -113852 -58378 -259330
$$ packed form
8470A17887q1071j61684k01451K63787N3349l0089q3517m0580O4495l5335L9008
8459i5201l5147l6753k4833J01447K32494m0266j53784P0633m3767J18936Q6124
8448A79883k4430j14564o0024p490k1855J29826r4421q4437R9840j0215m7326
8437e5213r4633J32124q2850n4990M6705l3055r5362O3190K46981j20611p1418
8426a19132J98078O6675R7069J09135K5756j3645k2853p3681k65729j3187J31035
8415A19521K5635R4118J21679m7805k04073q5453K9043N4880K07229J97817n8528
8404D54063m0520j07542k55021p9533q565N2467k79415J17693K65633o7327m753
8393D7180K09859n23k64070j11457r791J0220j13481K6858R1353N5474k00952
$$ plain form
8382 -259330 -355465 -185332 10865 11590 -78039 -65482 -39321 -74822 -110297 -130268 -89666 -6966
8370 -6966 -15475 -92156 -220173 -11792 147495 -221231 -334313 -202591 16791 142044 154408
8359 154408 194701 121772 -19557 -269128 -237062 16060 215772 96552 2633 8356 -173927
8348 -173927 -162543 -48722 -151900 -170630 -23445 37649 66423 35989 68004 105123 58940
8337 58940 -110963 -235229 -248134 -52632 -24363 68297 28966 -166361 52023 299906 176398
8326 176398 -56108 -166553 -70961 17640 -25386 -9798 57977 7839 94103 196105 91239
8315 91239 -113109 -132657 -266954 -293922 -241890 -99736 12597 -25337 -139283 -230627 -135056
8304 -135056 31352 28539 -169111 -189777 -125933 -30549 19307 30762 145586 205869 153868
$$ packed form
8382b59330r6135J70133J96197P25q9629J2557K6161l5501l5475j9971M0602Q2700
8370f966q509p6681j28017K08381J59287l68726j13082J31722K19382J25253J2364
8359A54408M0293p2929j41329k49571L2066K53122J99712j19220r3919N723j82283
8348a73927J1384J13821j03178j8730J47185O1094K8774l0434L2015L7119m6183
8337E8940j69903j24266j2905J95502K8269R2660l9331j95327K18384K47883j23508
8326A76398k32506j10445R5592Q8601m3026J5588O7775n0138Q6264J02002j04866
8315I1239k04348j9548j34297k6968N2032J42154J12333l7934j13946r1344R5571
8304a35056J66408k813j97650k0666O3844R5384M9856J1455J14824O0283n2001
$$ plain form
8293 153868 249248 456097 293490 8280 -15248 75062 79813 -86825 -60882 19798 254759
8282 254759 318114 264427 154577 29168 1494 -70659 -270701 -315874 -318663 -61083 -63943
8271 -63943 -90553 116185 313117 225328 182133 140266 -41452 -347291 -276750 -168449 -293452
8260 -293452 -442284 -451768 -361051 -260766 -62379 62967 -232 -186972 -339543 -313123 11705
8249 11705 166978 53836 96125 29013 81934 41094 142891 242747 133891 -220655 -20838
8238 -20838 255079 27581 -184425 -229094 -240689 38366 -39309 -33552 105920 35985 18158
8227 18158 41844 161754 166612 65311 -82727 -277597 -58476 -215777 -416890 -438111 -332096
8216 -332096 -256690 -184385 -123459 -69675 97913 10397 -186979 -82791 24755 -56936 100869
$$ packed form
8293A53868R5380K06849j62607k85210k3528R0310M751j66638K5943Q0680K34961
8282B54759O3355n3687j09850j25409k7674p2153k00042m5173k789K57580k860
8271f3943k6610K06738J96932q7789m3195m1867j81718l05839P0541J08301j25003
8260b93452j48832r484R0717J00285J98387J25346o3199j86740j52571K6420L24828
8249A1705J55273j13142M2289o7112N2921m0840J01797R9856j08856l54546J99817
8238b0838K75917k27498k12006m4669j1595K79055p7675N757J39472o9935j7827
8227A8158K3686J19910M858j01301j48038j94870K19121j57301k01113k1221J06015
8216c32096P5406P2305O0926N3784J67588q7516j97376J04188J07546q1691J57805
$$ plain form
8205 100869 232031 53295 57310 -584 73663 59472 -17969 194004 325030 180740 -18377
8194 -18377 34670 -22075 -36043 114145 168868 51136 -151937 -146955 -68876 -41639 16865
8183 16865 -57727 -111992 58652 131593 96765 -86517 -73682 242912 135295 310292 148579
8172 148579 -194881 -322934 -217124 -215548 -144888 -87823 -177869 -239634 -121040 -25532 16745
8161 16745 -196020 -101557 113294 369459 624392 659652 419736 148272 -121057 -172106
8151 -172106 -161519 -165956 -150494 -132593 -136943 38237 47604 3194 112468 -21615 -145871
8140 -145871 -196880 -87418 -47777 21100 -46996 -196718 -267830 -107356 -8659 36787 6108
8129 6108 -77373 -113657 -49299 -49208 -85417 -91326 68221 81561 151544 152962 220236 302723 221539
$$ packed form
8205A00869J31162j78736M015n7894P4247j4191p7441K11973J31026j44290j99117
8194a8377N3047n6745j3968J50188N4723j17732k03073M982P8079K7237N8504
8183A6865p4592n4265J70644P2941l4828j83282J2835L16594j07617J74997j61713
8172A48579l43460j28053J05810J576P0660N7065r0046o1765J18594R5508M2277
8161A6745k12765R4463K14851K56165K54933L5260k39916k71464k69329n1049
8151a72106J0587m437J5462J7901m350J75180R367m4410J09274j34083j24256
8140a45871n1009J09462L9641O8877o8096j49722p1112J60474R8697M5446l0679
8129F108q3481l6284O4358R1l6209n909J59547J3340O9983J418O7274Q2487q1184
$$ plain form
8116 221539 349295 411912 416193 407524 323889 241581 168748 271096 79284 100117 48272
8105 48272 -25478 -153119 -112362 -45923 24722 -17471 218955 329647 264465 263376 197419
8094 197419 58489 31513 -50692 -162501 -153741 -130773 -158589 -287434 -267605 -177433 -24152
8083 -24152 21001 -191255 -429049 -536743 -455892 -419324 -167508 86950 279842 463834
8073 463834 257117 -188181 -304219 -98709 157199 287108 302811 -74478 -281966 -80775
8063 -80775 15762 -10761 70493 -77723 -295683 -179595 -89850 69859 73441 -3650 -94253
8052 -94253 82080 64331 84844 130525 58167 -18246 -227649 -283544 26240 82281 40933
8041 40933 269396 232363 67080 -97505 -19581 37036 -58429 -165221 -133851 -78859 -21025
$$ packed form
8116B21539J27756O2617M281q669q3635q2308p2833J02348j91812K0833n1845
8105D8272p3750j27641M0757O6439P0645m2193K36426J10692o5182j089o5957
8094A97419j38930k6976q2205j11809Q760K2968k7816j28845J9829R0172J53281
8083b4152M5153k12256k37794j07694Q0851L6568K51816K54458J92892J83992
8073D63834k06717m45298j16038K05510K55908J29909J5703l77289k07488K01191
8063h0775R6537k6523Q1254j48216k17960J16088Q9745J59709L582p7091r0603
8052i4253J76333j7749K0513M5681p2358p6413k09403n5895L09784N6041m1348
8041D0933K28463l7033j65283j64585P7924N6617r5465j06792L1370N4992N7834
$$ plain form
8030 -21025 -82871 36710 63336 -77365 -124175 29629 151748 230637 135577 51510 156634
8019 156634 214119 257393 213524 85370 -145246 -173779 -223775 -43895 107977 244683 278178
8008 278178 119464 112354 262212 384422 301265 148619 251449 181297 198178 133702 70192
7997 70192 175367 332649 595360 483771 262052 127978 154464 142777 75764 128746 318841
7986 318841 291781 164697 103541 28489 51178 333300 483613 443744 187110 -225507 -394311
7975 -394311 -235198 -110718 -76192 -40645 7760 124725 123248 29775 65433 73197 84620
7964 84620 99461 -11525 111220 246425 49025 -49968 -76090 -64649 56914 129428 13431
7953 13431 -81133 -12449 36643 190315 342490 460360 253957 -121632 -129649 -321867 -374288
$$ packed form
8030b1025o1846J19581K6626j40701m6810J53804J22119P8889r5060q4067J05124
8019A56634N7485M3274m3869j28154k30616k8533m9996J79880J51872J36706L3495
8008B78178j58714p110J49858J22210q3157j52646J02830p0152J6881o4476o3510
7997G0192J05175J57282K62711j11589k21719j34074K6486j1687o7013N2982J90095
7986C18841k7060j27084o1156p5052K2689K82122J50313l9869k56634m12617j68804
7975c94311J59113J24480L4526L5547M8405J16965j477r3473L5658P764J1423
7964H4620J4841j10986J22745J35205j97400r8993k6122J1441J21563P2514j15997
7953A3431r4564O8684M9092J53672J52175J17870k06403l75589q017j92218n2421
$$ plain form
7942 -374288 -252833 -158584 -235855 -189853 -44776 -111258 -121991 -205047 -168488 -256021 -183224
7931 -183224 -141180 -4687 106696 46104 -104953 -188867 -310089 -150474 -351106 -200902
7921 -200902 65315 132337 1937 -268090 -287948 -157993 -153501 -6202 -119960 39762
7911 39762 171754 213572 212539 47136 -232855 -244925 -246187 -446682 -360524 -118488 -144471
7900 -144471 -27022 117240 106784 178606 36600 3371 39798 10883 -77478 30939 -33434
7889 -33434 -110435 7685 -49291 -264486 -363768 -329485 -221031 -12135 279575 329800 222538
7878 222538 -54047 -144183 -135415 -77190 -69048 72337 148768 58023 9125 -144154 -185486
7867 -185486 -64696 -32297 4026 31663 138393 27025 -6106 -55328 -211322 -238465 -297084
$$ packed form
7942c74288J21455R4249p7271M6002J45077o6482j0733q3056L6559q7533P2797
7931a83224M2044J36493J11383o0592j51057q3914j21222J59615k00632J50204
7921b00902K66217O7022j30400k70027j9858J29955M492J47299j13758J59722
7911C9762J31992M1818j033j65403k79991j2070j262k00495Q6158K42036k5983
7900a44471J17449J44262j0456P1822j42006l3229L6427k8915q8361J08417o4373
7889c3434p7001J18120n6976k15195r9282L4283J08454K08896K91710N0225j07262
7878B22538k76585r0136Q768N8225Q142J41385P6431r0745m8898j53279m1332
7867a85486J20790L2399L6323K7637J06730j11368l3131m9222j55994k7143n8619
$$ plain form
7856 -297084 -215238 -171577 -305731 -284013 -64267 -11682 68694 -10011 -117834 -248276 -186516
7845 -186516 -228655 -209417 -121495 -172560 6054 -188481 -261564 -149448 -54736 -132338 -258481
7834 -258481 -105110 -203177 -349996 -227278 -77450 -119588 -121267 19786 48239 73548 107007
7823 107007 60325 -99323 -1181 96544 67675 141455 278769 109019 -89159 -93455 -64853
7812 -64853 206547 403351 260077 291975 406971 282481 101432 105266 159812 89731 21851
7801 21851 36362 152127 385032 449290 482907 284144 186814 -8342 -163280 -120912 2816
7790 2816 -109205 29808 214166 37488 -23525 -170310 -74865 8974 -20915 -49686 7397
7779 7397 19807 11160 309038 350129 231773 123096 158023 360479 216299 -30144 -172961
$$ packed form
7856b97084Q1846M3661j34154K1718K19746N2585Q0376p8705j07823j30442O1760
7845a86516m2139J9238Q7922n1065J78614j94535p3083J12116R4712p7602j26143
7834b58481J53371r8067j46819J22718J49828m2138j679J41053K8453K5309L3459
7823A07007m6682j59648R8142R7725k8869P3780J37314j69750j98178m296K8602
7812f4853K71400J96804j43274L1898J14996j24490j81049L834N4546p0081o7880
7801B1851J4511J15765K32905O4258L3617j98763r7330j95156j54938M2368J23728
7790B816j12021J39013J84358j76678o1013j46785R5445Q3839k9889k8771N7083
7779G397J2410q647K97878M1091j18356j08677L4927K02456j44180k46443j42817
$$ plain form
7768 -172961 -53289 -45060 67144 213091 284535 98600 -45439 -113424 -54021 -68245 -156612
7757 -156612 -152770 -92616 -29814 171561 -13495 -101318 -188536 -259106 -55821 124090 13119
7746 13119 -71016 6777 -141458 -212686 -356495 -380595 -105019 -56172 -337600 -346850 -318809
7735 -318809 -186723 66869 31314 5038 764 73771 180724 172556 43527 44259 -5545 -26592
7723 -26592 58005 160110 228646 240395 164457 19524 126985 268707 214592 66143 -107523
7712 -107523 -142040 -90911 81760 156899 -3310 -134406 32479 116571 -6211 -28538 -201422
7701 -201422 -175783 -114055 -234759 -182560 -43512 -191607 -426701 -433954 -170554 -162183 -256362
7690 -256362 -344098 -535176 -422247 -321979 -253645 -112106 -22118 -59163 -120436 -188565 -5237
$$ packed form
7768a72961J19672Q229J12204J45947P1444j85935j44039o7985N9403j4224q8367
7757a56612L842O0154O2802K01375j85056q7823q7218p0570K03285J79911j10971
7746A3119q4135P7793j48235p1228j43809k4100K75576M8847k81428r250K8041
7735c18809J32086K53592l5555k6276m274P3007J06953q168j29029P32m9804k1047
7723b6592Q4597J02105O8536J1749p5938j44933J07461J41722n4115j48449j73666
7712a07523l4517N1129J72671P5139j60209j31096J66885Q4092j22782k2327j72884
7701b01422K5639O1728j20704N2199J39048j48095k35094p253K63400Q371r4179
7690b56362q7736j91078J12929J00268O8334J41539Q9988l7045o1273o8129J83328
$$ plain form
7679 -5237 -84482 -10020 50863 14253 85313 -156206 -292877 -336949 -341124 -186919 -124007 134476
7667 134476 100541 117053 255323 235586 74096 -49211 50120 140687 198593 141478 96630
7656 96630 -3439 -107022 -190671 -170837 112776 278743 372155 255550 171311 42927 -72951
7645 -72951 -93631 -283039 -416329 -337222 -261696 -330126 -356006 -179032 30117 -59977 23560
7634 23560 70749 45936 79159 357598 502848 498580 404348 171032 -293716 -274747 -3604
7623 -3604 228740 246688 191989 195359 95761 111710 78850 104436 182268 -208994 -474712 -311126
7611 -311126 -237075 -363067 -475654 -456673 -334661 -36789 12183 -38967 -92405 -73710 -139339
7600 -139339 -168653 -282131 -271095 -108953 -192118 -165802 -100314 -389741 -566811 -300682 -57295
$$ packed form
7679e237p9245P4462O0883l6610P1060k41519j36671m4072m175J54205O2912K58483
7667A34476l3935J6512J38270j9737j61490j23307R9331R0567N7906n7115m4848
7656I6630j00069j03583q3649J9834K83613J65967R3412j16605q4239j28384j15878
7645g2951k0680j89408j33290P9107P5526o8430k5880J76974K09149r0094Q3537
7634B3560M7189k4813L3223K78439J45250m268r4232k33316m64748J8969K71143
7623c604K32344J7948n4699L370r9598J5949l2860K5586P7832l91262k65718J63586
7611c11126P4051j25992j12587J8981J22012K97872M8972n1150n3438J8695o5629
7600a39339k9314j13478J1036J62142q3165K6316O5488k89427j77070K66129K43387
$$ plain form
7589 -57295 109229 101685 168757 46349 -111467 192349 133388 46389 63808 162880 105154
7578 105154 -71765 -137797 -58534 -8204 -203066 -318360 -181486 68761 200534 318600
7568 318600 370266 431510 180791 8586 -170752 -212041 -125798 -134836 -117733 -194147 -179907
7557 -179907 -101888 -142360 -173269 -200504 -241394 -212473 -193390 -261197 -6384 -6233 -47347 -383151
7545 -383151 -618277 -615899 -350532 -240738 -172316 -192604 -68575 12654 -42073 -70282 -127100
7534 -127100 -199512 -130460 -220005 -263864 -263334 -282079 -174398 -254187 -206746 -312976 -433018
7523 -433018 -472953 -380448 -341619 -316133 -518008 -473901 -469006 -474830 -381164 -348709 -59885 40699
7511 40699 -94616 -96201 22008 64731 77633 92928 -43869 -49968 -12372 25703 -20640 25050
$$ packed form
7589e7295J66524p544O7072j22408j57816L03816n8961q6999J7419R9072n7726
7578A05154j76919o6032P9263N0330j94862j15294J36874K50247J31773J18066
7568C18600N1666O1244k50719j72205j79338m1289Q6243r038J7103p6414J4240
7557a79907P8019m0472l0909k7235m0890K8921J9083o7807K54813J51m1114l35804
7545c83151k35126K378K65367J09794O8422k0288J24029Q1229n4727k8209n6818
7534a27100p2412O9052q9545m3859N30j8745J07681p9789M7441j06230j20042
7523d33018l9935R2505L8829K5486k01875M4107M895n824R3666L2455K88824J00584
7511D0699j35315j585J18209M2723J2902J5295j36797o099L7596L8075m6343M5690
$$ plain form
7499 25050 -77370 -52105 141585 -89111 -311564 -84002 -232373 -310282 -139049 -83376
7489 -83376 6253 147731 57321 -206741 -230958 -248596 -7720 140635 -48083 -173635 -288263
7478 -288263 -275008 -388322 -301788 -212956 -231202 -257875 -260659 -143771 -115328 -122927 32907
7467 32907 30447 -74754 -132727 -141713 -336894 -340780 -176082 -14531 91080 -155893 -271306
7456 -271306 -200202 -78974 -60481 14127 81003 -151569 -288641 -69375 -206234 -7769
7446 -7769 53447 11978 51586 55057 16417 3129 -1323 110022 -53423 -231150 -105236 91794
7434 91794 185913 79910 137828 134213 164067 320593 197918 33561 -60656 -128060 -143948
7423 -143948 -151509 -217851 -181835 -221749 -156639 -183286 -72871 83612 -18849 -173160 -222716
$$ packed form
7499B5050j02420K5265J93690k30696k22453K27562j48371p7909J71233N5673
7489h3376Q9629J41478r0410k64062k4217j7638K40876J48355j88718j25552j14628
7478b88263J3255j13314Q6534Q8832j8246k6673k784J16888K8443p599J55834
7467C2907k460j05201n7973q986j95181l886J64698J61551J05611k46973j15413
7456b71306P1104J21228J8493P4608O6876k32572j37072K19266j36859J98465
7446g769O1216m1469L9608L471l8640j3288m452J11345j63445j77727J25914J97030
7434I1794R4119j06003N7918l615K9854J56526j22675j64357r4217o7404j5888
7423a43948p561o6342L6016l9914O5110k6647J10415J56483j02461j54311m9556
$$ plain form
7412 -222716 -57422 52696 -131276 -304443 -274280 -281734 -382269 -377763 -364589 -481343 -320299
7401 -320299 -20278 -31427 -144340 -198272 -35318 28230 -207390 -322473 -223578 -167303 -204342
7390 -204342 -259567 -212625 -167859 -32502 -115253 -22718 15111 -37895 -31479 -37328 96183 44386
7378 44386 -82207 39854 172202 14696 -94081 -215598 -291188 -171426 -224852 -151520
7368 -151520 19647 -17008 -11471 -121178 -142896 -137789 -295065 -456344 -171852 -157899 -240880
7357 -240880 -95883 118511 4064 -154437 -66758 -7159 -110527 -106686 187530 31774
7347 31774 -160040 -65515 102713 42945 -10598 24210 -36247 -48263 -106552 -56488 -144440
7336 -144440 -355633 -166886 -151834 -109106 -99940 -137617 -169951 -237248 -282638 -195226 -137180
$$ packed form
7412b22716J65294J10118j83972j73167L0163p454j00535M506J3174j16754J61044
7401c20299L00021j1149j12913n3932J62954O3548k35620j15083R8895N6275l7039
7390b04342n5225M6942M4766J35357q2751R2535L7829n3006O416n849J33511n1797
7378D4386j26593J22061J32348j57506j08777j21517p5590J19762n3426P3332
7368a51520J71167l6655N537j09707k1718N107j57276j61279K84492J3953q2981
7357b40880J44997K14394j14447j58501Q7679N9599j03368L841K94216j55756
7347C1774j91814R4525J68228n9768n3543L4808o0457j2016n8289N0064q7952
7336a44440k11193J88747J5052M2728R166l7677l2334o7297m5390Q7412N8046
$$ plain form
7325 -137180 11307 84263 286832 -19104 -13889 314145 200906 59110 151752 176568 113004
7314 113004 -55662 -32363 -53575 -120842 142522 86240 104120 208620 279753 210045 195406
7303 195406 130044 285727 78267 -7816 38104 56882 11042 113538 176542 70170 78725
7292 78725 -94880 48423 147346 -44354 -143533 -191867 -249111 -156396 6487 73392 112922
7281 112922 39542 -92351 -229314 -492724 -379182 -219803 -267791 -369495 -373096 -52732
7271 -52732 -84 2043 229837 363170 339637 417018 314352 53254 -34219 94576 25763
7260 25763 -124584 59266 173938 178974 197660 373859 380298 135310 66241 98411 -185470
7249 -185470 -222805 -266300 -365189 -156745 50597 132558 82272 180885 274779 251994 82883
$$ packed form
7325a37180J48487P2956K02569l05936N215L28034j13239j41796R2642K4816o3564
7314A13004j68666K3299k1212o7267K63364n6282J7880J04500P1133o9708j4639
7303A95406o5362J55683k07460q6083M5920J8778m5840J02496O3004j06372Q555
7292G8725j73605J43303R8923j91700r9179m8334n7244R2715J62883O6905L9530
7281A12922p3380j31893j36963k63410J13542J59379m7988j01704l601L20364
7271e2732N2648K127K27794J33333k3533P7381j02666k61098q7473J28795o8813
7260B5763j50347J83850J14672N036J8686J76199O439k44988o9069L2170k83881
7249a85470l7335m3495r8889K08444K07342Q1961n0286R8613R3894k2785j69111
$$ plain form
7238 82883 76225 6704 -31562 -114744 -231201 -92211 -5957 -25306 -220746 -138827 -115673
7227 -115673 44446 8001 -24583 83030 -49421 -62131 -260302 -243070 -158093 -233010 -141777
7216 -141777 7620 92627 82457 102766 -134696 -318778 -39624 -251229 -466885 -386559
7206 -386559 -341185 -227128 -93905 48123 -24864 -199356 -241574 -200810 -70574 85458
7196 85458 -50452 -7892 69420 -18442 -142183 -255892 -232922 -161075 -48639 -22967 -272238
7185 -272238 -423191 -380270 -179847 -175368 -61587 21675 150849 153831 213209 4769 -77549
7174 -77549 18628 8028 56900 -172581 -143251 -261995 -284788 -338348 -272078 -174027 -152697
7163 -152697 -235131 -230144 -176173 -216701 -44386 83141 19615 13889 85251 26168 -93910
$$ packed form
7238H2883o658o9521l8266q3182j16457J38990Q6254j9349j95440Q1919K3154
7227a15673J60119l6445l2584J07613j32451j2710j98171J7232Q4977p4917R1233
7216a41777J49397Q5007j0170K0309k37462j84082K79154k11605k15656Q0326
7206c86559M5374J14057J33223J42028p2987j74492m2218M0764J30236J56032
7196H5458j35910M2560P7312q7862j23741j13709K2970P1847J12436K5672k49271
7185b72238j50953M2921K00423M479J13781Q3262J29174K982N9378k08440q2318
7174g7549R6177j0600M8872k29481K9330j18744k2793n3560O6270R8051K1330
7163a52697q2434M987N3971m0528J72315J27527o3526n726P1362n9083j20078
$$ plain form
7152 -93910 14578 142740 113856 109655 -12947 -381907 -670733 -496237 -255903 -232640 50593
7141 50593 15910 -120824 -261402 -243281 -164593 -55698 -71284 148221 144754 -2766 -148405
7130 -148405 -185291 -445938 -437814 -119831 192582 74575 37874 48237 25309 119400 -57917
7119 -57917 -344500 -109076 66211 -67882 -143813 -159860 -54814 -248663 -386968 -378312 -123400
7108 -123400 58070 11440 -70857 -74554 82879 125807 188445 -676 -241464 -125175 102899
7097 102899 177521 165426 56315 99486 70812 -103081 -228586 -221737 -337887 -277905 -246131
7086 -246131 -318957 -353945 -318157 -235045 -9226 98205 137883 -38966 -133049 -443510 -591103
7075 -591103 -515371 -450951 -523875 -422144 -383913 -75003 122882 -43376 -208904 -305935 -232804
$$ packed form
7152i3910J08488J28162k8884m201j22602l68960k88826J74496K40334K3263K83233
7141E0593l4683j36734j40578J8121P8688J08895j5586K19505l467j47520j45639
7130a48405l6886k60647Q124L17983L12413j18007l6701J0363k2928R4091j77317
7119e7917k86583K35424J75287j34093p5931j6047J05046j93849j38305Q656K54912
7108a23400J81470m6630q2297l697J57433M2928O2638j89121k40788J16289K28074
7097A02899P4622j2095j09111M3171k8674j73893j25505O849j16150N9982L1774
7086b46131p2826l4988L5788Q3112K25819J07431L9678j76849r4083l10461j47593
7075e91103P5732O4420p2924J01731L8231L08910J97885j66258j65528r7031P3131
$$ plain form
7064 -232804 -214305 -102577 -213405 -335046 -236822 -376370 -576633 -405973 -317609 -314198 -340318
7053 -340318 -338556 -126359 -167032 -171824 -58878 -109018 -141005 -96661 -33132 -41870 20631 -222919
7041 -222919 -508522 -479592 -323020 -269601 -108876 116224 -112126 -274231 -328375 -404807
7031 -404807 -260612 47943 222684 -10711 -143243 -502883 -603854 -431721 -465275 -314975
7021 -314975 -55019 -98542 -294239 -288745 -112984 91527 -65223 -314128 -221263 -239559 -257333
7010 -257333 -132400 -74893 -66714 -3449 -188809 -239035 -397683 -561732 -382318 -34450 -27537
6999 -27537 -125071 -374827 -392584 -265690 -240827 -118672 40452 65715 213892 219138 93770
6988 93770 -70330 23353 352262 214792 4637 104318 54668 -48941 -34093 5890 -79875
$$ packed form
7064b32804J8499J11728j10828j21641R8224j39548k00263J70660Q8364L411k6120
7053c40318J762K12197m0673m792J12946n0140l1987M4344O3529q738O2501k43550
7041b22919k85603K8930J56572N3419J60725K25100k28350j62105n4144p6432
7031d04807J44195L08555J74741k33395j32532l59640j00971J72133l3554J50300
7021c14975K59956m3523j95697N494J75761K04511j56750k48905R2865j8296j7774
7010b57333J24933N7507Q179O3265j85360n0226j58648j64049J79414L47868O913
6999b7537r7534k49756j7757J26894K4863J22155J59124K5263J48177N246j25368
6988I3770j64100R3683L28909j37470k10155R9681m9650j03609J4848L9983q5765
$$ plain form
6977 -79875 -184726 -96232 69013 116439 -61216 -117529 -38274 -117836 -163972 -93476 894
6966 894 9033 -52319 -4700 -108917 -95165 46381 13146 -134042 -181967 -214063 -86954 -148384
6954 -148384 -174544 -130327 -117982 -53760 25122 133469 361276 198125 38845 55913 219320
6943 219320 161234 53372 22401 116073 251111 188323 -33665 -26958 -29722 -126504 -240502
6932 -240502 -290303 -109272 -225138 -352602 -130548 64605 286432 334386 337830 143721
6922 143721 105587 115515 138173 98404 204286 -52018 -244076 -269561 -232726 -200850 -530489
6911 -530489 -701647 -583125 -187550 -31529 209365 257453 250414 383242 207768 17070
6901 17070 -54135 -16385 -16382 21035 48844 118205 48131 2989 22123 157990 135144 54114
$$ packed form
6977g9875j04851Q8494J65245M7426j77655n6313P9255p9562m6136P0496R4370
6966H94Q139o1352M7619j04217J3752J41546l3235j47188m7925l2096J27109o1430
6954a48384k6160M4217J2345O4222P8882J08347K27807j63151j59280J7068J63407
6943B19320n8086j07862l0971R3672J35038o2788k21988O707k764r6782j13998
6932b40502m9801J81031j15866j27464K22054J95153K21827M7954L444j94109
6922A43721l8134R928K2658l9769J05882k56304j92058k5485L6835L1876l29639
6911e30489j71158J18522L95575J56021K40894M8088p039J32828j75474j90698
6901A7070p1205L7750LL7417K7809O9361p0074m5142J9134J35867k2846q1030
$$ plain form
6889 54114 -54300 -75165 -102462 -75100 62275 74675 11426 133927 65143 -20317 6086
6878 6086 -64039 125788 234593 100334 120790 186058 75046 -250825 -327967 -269817 -258422
6867 -258422 -62043 205943 169779 142536 -32990 -101870 40682 -81472 -310345 -360215
6857 -360215 -367287 -339799 -293665 -239055 -190690 -290159 -455079 -457366 -388442 -151893 -100025 -312074
6845 -312074 -330022 -191145 -192692 -395008 -415361 -481596 -371399 -378429 -350317 -241961 -231379
6834 -231379 16479 16378 -19813 45211 -70746 49605 56276 251792 296091 186790 147681
6823 147681 213238 37435 60122 79461 75760 62992 58514 86867 235737 437460 340267
6812 340267 191333 148412 88003 61223 -63861 -250187 -186926 -145506 -247888 -198967 -108690
$$ packed form
6889E4114j08414k0865k7297K7362J37375J2400o3249J22501o8784q5460K6403
6878F086p0125J89827J08805j34259K0456O5268j11012l25871p7142N8150J1395
6867b58422J96379K67986l6164k7243j75526o8880J42552j22154k28873m9870
6857c60215p072K7488M6134N4610M8365r9469j64920k287O8924K36549N1868k12049
6845c12074j7948J38877j547k02316k0353o6235J10197p030K8112J08356J0582
6834b31379K47858j01l6191O5024j15957J20351O671J95516M4299j09301l9109
6823A47681O5557j75803K2687J9339l701j2768m478K8353J48870K01723r7193
6812C40267j48934m2921o0409k6780j25084j86326O3261M1420j02382M8921R0277
$$ plain form
6801 -108690 -12680 -17237 109752 357944 533145 298095 175524 163558 154377 160967 -87304
6790 -87304 -366226 -288523 7536 263073 323325 181309 74955 -53407 -169825 -208511
6780 -208511 -56231 17143 -129382 78427 96329 42379 198417 94399 151447 236726 19733
6769 19733 -100287 -21109 136994 218566 270385 213127 195761 70552 -52234 -197062 -304675
6758 -304675 -247375 -236598 -305476 -224322 -216930 -111820 39133 -40879 24582 -169426 -158608
6747 -158608 -171405 -235505 -381393 -405118 -428709 -307457 -350020 -397503 -215368 -291496 -74700
6736 -74700 -6984 -40569 212084 245497 145140 17361 -178175 -227157 -103865 -89966 39394
6725 39394 -135691 -383343 -122439 -3506 -83336 41866 16646 -280564 -352240 -136364
$$ packed form
6801a08690R6010m557J26989K48192J75201k35050j22571j1966r181O590k48271
6790h7304k78922P7703K96059K55537O0252j42016j06354j28362j16418l8686
6780b08511J52280P3374j46525K07809J7902n3950J56038j04018N7048Q5279k16993
6769A9733j20020P9178J58103Q1572N1819n7258j7366j25209j22786j44828j07613
6758c04675N7300J0777o8878Q1154P392J05110J50953q0012O5461j94008J0818
6747a58608j2797o4100j45888k3725k3591J21252m2563m7483J82135p6128K16796
6736g4700O7716l3585K52653L3413j00357j27779j95536m8982J23292J3899J29360
6725C9394j75085k47652K60904J18933p9830J25202k5220k97210p1676K15876
$$ plain form
6715 -136364 -100061 -155352 -129014 -152578 -132445 -249101 -190329 -28737 43459 87485 57686
6704 57686 -15573 75751 73460 167311 32086 -37477 67331 2013 -27015 -109016 -196535 -173064
6692 -173064 -68001 -218278 -299490 -103882 -83620 -86036 -56139 65590 41475 189149 30681
6681 30681 -243962 -377460 -138887 -3858 -131474 -342196 22192 79016 -87363 -80225
6671 -80225 -15842 -165771 31302 134268 164094 54774 -6137 -68518 -217489 -146712 -57747
6660 -57747 -62027 -88800 -165481 -210361 -102412 -18725 19896 -2316 2804 -49640 -281425 -281437
6648 -281437 -234163 -267977 -357075 -350705 -210741 -66260 -28683 -163613 -201831 -88144 66674
6637 66674 114202 350755 300104 17974 -65792 -31850 -60327 -400357 -434082 -215896 -36861
$$ packed form
6715a36364L6303n5291K6338k3564K0133j16656N8772J61592P2196M4026k9799
6704E7686p3259R1324k291R3851j35225o9563J04808o5318k9028q2001q7519K3471
6692a73064J05063j50277q1212J95608K0262k416K9897J21729k4115J47674j58468
6681C0681k74643j33498K38573J35029j27616k10722L64388N6824j66379P138
6671h0225O4383j49929J97073J02966K9826j09320o0911o2381j48971P0777Q8965
6660e7747m280k6773p6681m4880J07949Q3687L8621k2212N120n2444k31785j2
6648b81437M7274l3814q9098O370J39964J44481L7577j34930l8218J13687J54818
6637F6674M7528K36553n0651k82130q3766L3942k8477l40030l3725K18186J79035
$$ plain form
6626 -36861 36656 181519 175256 -122251 -366126 -346319 -220809 -148902 -79701 110111 208117
6615 208117 158688 197661 -10087 -126355 -307854 -392324 -381042 -343671 -265534 -72122 107318
6604 107318 82875 150144 -36611 -65083 -152413 164373 710890 685005 306184 112624 -131184
6593 -131184 -74328 -102113 -256310 -222354 -182289 -180097 -115039 194391 413984 397495 412255
6582 412255 313611 82214 52763 43875 165457 329798 294103 439050 331089 -87501 -160961
6571 -160961 63037 217326 218822 124268 117665 114455 94149 -77108 9081 15304 -113799 -200648
6559 -200648 -237345 -171342 -207851 -131522 106669 123859 178969 228527 91172 10834 6507
6548 6507 -33305 -62740 186155 321765 375470 385530 433011 266340 -15098 -92119 -190660
$$ packed form
6626c6861P3517J44863o263k97507k43875J9807J25510P1907O9201J89812R8006
6615B08117m9429L8973k07748j16268j81499q4470J1282L7371P8137J93412J79440
6604A07318k4443O7269j86755k8472q7330L16786N46517k5885l78821j93560k43808
6593a31184N6856k7785j54197L3956M0065K192O5058L09430K19593j6489J4760
6582D12255r8644k31397k9451q888J21582J64341l5695J44947j07961m18590p3460
6571a60961K23998J54289J496r4554o603l210k0306j71257Q6189O223j29103q6849
6559b00648l6697O6003l6509P6329K38191J7190N5110M9558j37355q0338m327
6548F507l9812k9435K48895J35610N3705J0060M7481j66671k81438p7021r8541
$$ plain form
6537 -190660 -268074 -199630 62918 234418 76580 -89166 65995 278684 325441 235704
6527 235704 326420 139683 -22076 30380 5547 -35263 21379 -95778 -196595 -290135 -272409
6516 -272409 -185940 -83375 143631 149090 127457 186410 205278 177962 234075 77396 152464
6505 152464 217803 123743 95736 197544 -53155 -193486 -315630 -135161 77327 -111730
6495 -111730 -193690 -138691 19181 19469 1572 38347 79393 69404 15455 -87588 -14431 -37352
6483 -37352 -90723 -104703 -29077 -46662 -19485 -88706 -67735 168772 28415 52640 -5084
6472 -5084 -3437 1009 10117 -139376 -112889 61634 317603 315879 171647 314577 264809 50493
6460 50493 72391 -22541 -80375 93745 70338 -188354 -444080 -378013 -188605 51965 100094
$$ packed form
6537a90660p7414O8444K62548J71500j57838j65746J55161K12689M6757q9737
6527B35704R0716j86737j61759N2456k4833m0810N6642j17157j00817r3540J7726
6516b72409Q6469J02565K27006N459k1633N8953J8868k7316N6113j56679P5068
6505A52464O5339r4060k8007J01808k50699j40331j22144J80469K12488j89057
6495a11730q1960N4999J57872K88j7897L6775M1046r989n3949j03043P3157k2921
6483c7352n3371j3980P5626j7585K7177o9221K0971K36507j40357K4225n7724
6472e084J647M446R108j49493K6487J74523K55969j724j44232J42930m9768k14316
6460E0493K1898r4932n7834J74120k3407k58692k55726O6067J89408K40570M8129
$$ plain form
6449 100094 118828 -269152 -342631 -191185 -97620 28209 -23739 -169674 -464697 -437758 -102892
6438 -102892 -18890 107157 212122 39291 90689 -64808 -221078 -174493 -108300 -269552
6428 -269552 -353855 -455600 -396753 -207790 -174853 -240063 -184463 -297522 -109197 156901 530138
6417 530138 390648 169107 137293 38098 38388 1412 -26172 -208819 -81227 -113095 -177880
6406 -177880 -273743 -186109 -72395 -120554 -110972 -143687 -65423 -197161 -182292 -99487 -51877
6395 -51877 76386 177120 276732 257615 98454 -54728 -140282 60040 281264 91240
6385 91240 -57279 -106766 -53099 -14705 -184149 -188793 -94751 15106 110016 140592 65393
6374 65393 -107296 -252289 -101687 220709 137209 -185051 -295269 -381061 -303948 -65553
$$ packed form
6449A00094J8734l87980p3479J51446R3565J25829n1948j45935k95023K6939L34866
6438a02892Q4002J26047J04965j72831N1398j55497j56270M6585O6193j61252
6428b69552q4303j01745N8847J88963L2937o5210N5600j13059J88325K66098L73237
6417E30138j39490k21541l1814r9195K90l6976k7584j82647J27592l1868o4785
6406a77880r5863Q7634J13714m8159R582l2715P8264j31738J4869Q2805M7610
6395e1877J28263J00734R9612j9117j59161j53182q5554K00322K21224j90024
6385I1240j48519m9487N3667L8394j69444m644R4042J09857R4910L0576p5199
6374F5393j72689j44993J50602L22396q3500l22260j10218q5792P7113K38395
$$ plain form
6364 -65553 -201635 -327858 -251867 -328270 -298806 -268259 -240153 -220740 -257937 -154764 -154080 -126514
6352 -126514 -191088 -350061 -257512 -99106 -52952 -240251 -126019 -131855 -86959 -172635 -192620
6341 -192620 -278575 -325237 -333040 -236371 -318382 -216583 -69940 -10170 -15845 -10067 -45196 124233
6329 124233 43089 44657 54993 15944 -109111 -33543 5614 -22882 -224306 -427744 -487094
6318 -487094 -290980 -189670 -198681 -128832 94575 -214463 -243719 -62702 -223057 -286717 73602
6307 73602 175087 122151 81303 -70809 -204848 -119364 -46320 -125232 61563 105918 -56376
6296 -56376 -106217 -128370 -182062 -392469 -218738 -44903 125010 238222 282764 386390 364370
6285 364370 27521 -299281 -413944 -528327 -469596 -513147 -535074 -471096 -347912 -90341
$$ packed form
6364f5553j36082j26223P5991p6403K9464L0547K8106J9413l7197J03173O84K7566
6352a26514o4574j58973R2549J58406M6154j87299J14232n836M4896q5676j9985
6341a92620q5955m6662p803R6669q2011J01799J46643N9770n675N778l5129J69429
6329A24233q1144J568J0336l9049j25055P5568L9157k8496k01424k03438n9350
6318d87094J96114J01310r011O9849K23407l09038k9256J81017j60355o3660L60319
6307G3602J01485n2936m0848j52112j34039Q5484P3044p8912J86795M4355j62294
6296e6376m9841k2153n3692k10407J73731J73835J69913J13212M4542J03626k2020
6285C64370l36849l26802j14663j14383N8731m3551k1927O3978J23184K57571
$$ plain form
6275 -90341 -47434 -55389 -90884 -333200 -213734 -53673 -22791 38387 -51870 9156 327699
6264 327699 250762 -84719 -230737 -170656 -112429 -217604 -60297 -23444 -28304 -64863 -143950
6253 -143950 -88859 -141513 -133391 -3264 -118769 -190832 45766 208345 168695 -16111 -169410
6242 -169410 -58072 -155882 -159010 -76620 87121 107801 -42433 -24517 120388 113207 171537
6231 171537 39263 -33104 -50854 -36390 93642 137790 37238 29728 173650 195150 233804
6220 233804 -5677 -131249 -161482 -79299 -237318 -288698 -148184 36850 187447 387852
6210 387852 172062 175475 367041 464655 174836 137980 -60740 -172844 -86302 -81492 -122009
6199 -122009 -175871 -149454 -220183 -210932 -17876 143715 195142 19151 -228798 -89395 -246806
$$ packed form
6275i0341M2907p955l5495k42316J19466J60061L0882O1178r0257O1026L18543
6264C27699p6937l35481j46018O0081N8227j05175J57307L6853m860l6559p9087
6253a43950N5091n2654Q122J30127j15505p2063K36598J62579l9650j84806j53299
6242a69410J11338r7810l128Q2390J63741K0680j50234J7916J44905p181N8330
6231A71537j32274p2367j7750J4464J30032M4148j00552p510J43922K1500L8654
6220B33804k39481j25572l0233Q2183j58019n1380J40514J85034J50597K00405
6210C87852k15790L413J91566R7614k89819l6856j98720j12104Q6542M810m0517
6199a22009n3862K6417p0729R251J93056J61591N1427j75991k47949J39403j57411
$$ plain form
6188 -246806 -289951 -373021 -284682 -36557 266531 190944 94940 116859 80128 84820 76415 23258
6176 23258 -32069 -92888 -103218 -223642 -147743 -85 -149977 -432977 -225831 -1418 183153
6165 183153 110053 139258 76885 81043 48143 57068 6167 -3441 -174200 -142722 -228329 -79894
6153 -79894 198041 222566 34306 -141383 -173087 -91797 -74604 -84928 36115 135378 79499
6142 79499 65604 -49003 -320922 -325390 -161176 156366 263523 176628 -44679 -140729 -161079
6131 -161079 -56507 20232 -170326 -283686 -321399 -169579 3961 -136542 -55865 118204
6121 118204 -161725 -241404 -172237 50310 304108 281065 259178 374022 424550 278044 88004
6110 88004 -111243 -3198 40488 195753 129313 -67166 -51161 -106890 -58666 -185496 -181713
$$ packed form
6188b46806m3145q3070Q8339K48125L03088p5587r6004K1919l6731M692q405n3157
6176B3258n5327o0819j0330j20424P5899J47658j49892k83000K07146K24413J84571
6165A83153p3100K9205o2373M158l2900Q925n0901r608j70759L1478q5607J48435
6153g9894K77935K4525j88260j75689l1704Q1290J7193j0324J21043R9263n5879
6142G9499j3895j14607k71919m468J64214L17542J07157q6895k21307r6050k0350
6131a61079J04572P6739j90558j13360l7713J51820J73540j40503Q0677J74069
6121A18204k79929p9679O9167K22547K53798k3043k1887J14844N0528j46506j90040
6110H8004j99247J08045M3686J55265o6440j96479J6005n5729M8224j26830L783
$$ plain form
6099 -181713 -122751 -237798 -267840 36914 89809 -91405 -111348 -174204 -255689 -135178 56272
6088 56272 207863 177425 24862 176880 256788 116905 180556 124666 -51784 -178187 -169234
6077 -169234 -122784 42683 195285 -25715 -276318 -444727 -342873 -141074 -203251 -316622
6067 -316622 -384737 -259266 -100861 13906 217379 312194 42513 -60987 -197784 -278517
6057 -278517 -385904 -243519 -354648 -378108 -267836 -76373 54864 92628 118927 65969
6047 65969 -123373 -191118 -154411 -244918 -287920 -115833 -83901 26444 124192 121726 197256
6036 197256 185963 351435 383008 302120 281781 191095 12834 -98219 -44488 59945 38752
6025 38752 -63801 -179665 -284745 -241929 -260242 -147619 -159449 -140738 -35199 -81107 -101072
$$ packed form
6099a81713N8962j15047l0042L04754N2895j81214j9943o2856q1485J20511J91450
6088E6272J51591l0438j52563J52018P9908j39883O3651n5890j76450j26403Q953
6077a69234M6450J65467J52602k21000k50603j68409J01854K01799o2177j13371
6067c16622o8115J25471J58405J14767K03473R4815k69681j03500j36797q0733
6057b78517j07387J42385j11129k3460J10272J91463J31237L7764K6299n2958
6047F5969j89342o7745L6707r0507m3002J72087L1932J10345R7748k466P5530
6036A97256j1293J65472L1573q0888k0339r0686j78261j11053N3731J04433k1193
6025C8752j02553j15864j05080M2816j8313J12623j1830J8711J05539m5908j9965
$$ plain form
6014 -101072 -50874 141008 18886 -49363 -52438 -204516 -224211 -162190 -201271 44513 274178
6003 274178 291368 234850 268215 143743 67925 72609 214087 115461 -69642 -117960 -93234
5992 -93234 -132403 -38050 11387 -39499 8032 226746 376932 332120 64572 -124143 -48549
5981 -48549 25050 192532 273787 73292 -118247 -220676 -248724 -189150 -169310 -166394 -158814
5970 -158814 -195719 -123253 -194951 -154331 31013 166360 156621 291255 207278 25026 -90535
5959 -90535 -47384 77191 99978 173835 65983 109518 37903 46819 49255 -56035 -212335
5948 -212335 -163180 -44726 -99905 -59183 -76837 -36101 24795 -19227 -27442 -122015 -204485 -118285
5936 -118285 59252 55751 -36448 55370 3521 -28589 -52166 -100308 78257 182635 361534
$$ packed form
6014a01072N0198J91882j22122o8249l075j52078j9695O2021l9081K45784K29665
6003B74178J7190n6518L3365j24472p5818M684J41478r8626j85103m8318K4726
5992i3234l9169R4353M9437n0886M7531K18714J50186m4812k67548j88715P5594
5981d8549P3599J67482Q1255k00495j91539j02429k8048N9574J9840K916P580
5970a58814l6905P2466p1698M0620J85344J35347r739J34634q3977j82252j15561
5959i0535M3151J24575K2787P3857j07852M3535p1615Q916K436j05290j56300
5948b12335M9155J18454n5179M0722j7654M0736O0896m4022q215r4573q2470Q6200
5936a18285J77537l501r2199R1818n1849l2110k3577m8142J78565J04378J78899
$$ plain form
5925 361534 174577 -177014 -327495 -434914 -566532 -361957 -107962 -37360 -51578 29875
5915 29875 54485 -2956 101943 240441 290792 86459 3937 -103872 -334408 -47313 82998
5904 82998 -85121 39 280018 329906 147867 242359 211815 22213 53835 -113068 -244910
5893 -244910 -487203 -577361 -612915 -425118 -289974 -356551 -213944 -133319 -228437 -196812 -203848
5882 -203848 -314128 -81015 230967 243831 -2058 -60501 -206505 -181169 -179316 -178572 -134842
5871 -134842 -72847 -161561 -90872 -78277 -275183 -304016 -200288 -7788 -89042 -270959 -140603
5860 -140603 -280373 -444118 -332671 -69436 77375 117736 191747 143709 114536 -131879
5850 -131879 -281895 -178699 -96838 -50051 11260 16847 26296 -1968 118286 -56069 -137318
$$ packed form
5925C61534j86957l51591j50481j07419j31618K04575K53995P0602j4218Q1453
5915B9875K4610n7441J04899J38498N0351k04333q2522j07809k30536K87095J30311
5904H2998j68119Q5160K79979M9888j82039R4492l0544j89602L1622j66903j31842
5893b44910k42293r0158l5554J87797J35144o6577J42607Q0625r5118L1625p036
5882b03848j10280K33113L11982J2864k45889n8443j46004K5336J853P44M3730
5871a34842O1995q8714P0689J2595j96906k8833J03728J92500q1254j81917J30356
5860a40603j39770j63745J11447K63235J46811M0361P4011m8038k9173k46415
5850a31879j50016J03196Q1861M6787O1311N587R449k8264J20254j74355q1249
$$ plain form
5839 -137318 -30126 -153295 -173733 -28932 -151755 -146341 23336 -37267 54224 148744 26664
5828 26664 -17731 -258867 -479737 -607903 -552367 -267588 -26605 91342 87039 -35113 -98735
5817 -98735 -80209 -114994 -144669 -116856 -190818 -176501 -74786 57 37231 -202051 -181440
5806 -181440 -98735 103945 126653 273272 265191 204722 79634 13349 -2287 -42499 -20935
5795 -20935 -120447 -154378 189371 352442 266563 218036 252445 92305 131491 31623 39043
5784 39043 50777 38260 41111 24083 46454 124939 133990 121274 241779 191805 210462 78013
5772 78013 59051 89091 25803 -18735 -131551 -247643 -281519 -167749 3892 82214 45604
5761 45604 74102 142211 85484 184334 109240 28971 60982 25202 55663 72618 218145 262437
$$ packed form
5839a37318J07192j23169k0438J44801j22823N414J69677o0603R1491R4520j22080
5828B6664m4395k41136k20870j28166N5536K84779K40983J17947m303j22152o3622
5817i8735J8526l4785k9675K7813p3962J4317J01715P4843L7174k39282K0611
5806a81440Q2705K02680K2708J46619q081o0469j25088o6285j5636m0212K1564
5795b0935r9512l3931L43749J63071q5879m8527L4409j60140L9186r9868P420
5784C9043J1734j2517K851j7028K2371P8485R051j2716J20505m9974J8657j32449
5772G8013j8962L0040o3288m4538j12816j16092l3876J13770J71641P8322l6610
5761D5604K8498O8109n6727R8850p5094q0269L2011l5780L0461J6955J45527M4292
$$ plain form
5749 262437 403741 522186 559195 467183 468121 430284 446103 311942 380472 335899 262468
5738 262468 220576 89730 133356 88626 176620 17073 -103713 67079 98032 67483 102248
5727 102248 112254 117807 -119584 -120549 -28952 -132010 -279337 -265729 -157734 -37850 -22503
5716 -22503 -90990 -6542 -46110 -53388 -15840 -91140 -268527 -25016 167701 -38552 -44518
5705 -44518 -24881 130112 -93306 -72763 64289 159968 283777 175687 -45229 -122836 -111970
5694 -111970 -226597 -207343 -78535 -99872 -132488 -188162 -299345 -220194 -84134 -91198 -20895
5683 -20895 -24800 -11152 -203805 -248944 -324028 -294356 -261178 -161768 9394 -93687 -197840
5672 -197840 -266081 -153141 -181322 -202001 -111064 1131 72894 60753 -81840 3952 88335
$$ packed form
5749B62437J41304J18445L7009r2012R38l7837J5819j34161O8530m4573p3431
5738B62468m1892j30846M3626m4730Q7994j59547j20786J70792L0953l0549L4765
5727A02248J0006N553k37391r65R1597j03058j47327J3608J07995J19884J5347
5716b2503o8487Q4448l9568p278L7548p5300j77387K43511J92717k06253n966
5705d4518J9637J54993k23418K0543J37052R5679J23809j08090k20916p7607J0866
5694a11970j14627J9254J28808k1337l2616n5674j11183P9151J36060p064P0303
5683b0895l905J3648j92653m5139p5084K9672L3178R9410J71162j03081j04153
5672a97840o8241J12940k8181k0679R0937J12195P1763j2141j42593Q5792Q4383
$$ plain form
5661 88335 12628 -109017 -247867 -140349 -95352 -104433 -64196 -67726 101255 -68928 -182491
5650 -182491 -219699 -210251 -114210 -27014 46092 75571 -62128 -21615 -4086 -156392 -206859
5639 -206859 -204809 -173659 -46770 123015 149632 -80621 -259681 -290099 -402373 -258411 -240476
5628 -240476 -163325 9361 -9004 -144339 -165957 -11678 23707 95283 214851 178772 74122
5617 74122 147159 7611 -222640 -64270 25564 -60677 -101188 -40730 43229 -53645 -91470
5606 -91470 -260858 -285143 -291845 -213236 -112264 -112882 7321 -3981 91161 20810 -164501 -102842
5594 -102842 -156366 -317507 -88091 215837 139764 -49148 -131183 -57746 -114951 -98611 122080
5583 122080 103269 -93742 -141012 11607 153602 51324 160242 150721 116840 216516 237204
$$ packed form
5661H8335p5707j21645j38850J07518M4997r081M0237l530J68981j70183j13563
5650a82491l7208R448R6041Q7196P3106K9479j37699M0513J7529j52306n0467
5639b06859K050L1150J26889J69785K6617k30253j79060l0418j12274J43962J7935
5628b40476P7151J72686j8365j35335k1618J54279L5385P1576J19568l6079j04650
5617G4122P3037j39548k30251J58370Q9834q6241m0511O0458Q3959r6874l7825
5606i1470j69388k4285o702P8609J00972o18J20203j1302R5142p0351j85311O1659
5594a02842n3524j61141K29416L03928p6073j88912q2035P3437n7205J6340K20691
5583A22080j8811j97011m7270J52619J41995j02278J08918r521l3881R9676K0688
$$ plain form
5572 237204 -17491 -7805 309215 347696 201951 -12491 -81637 69745 130403 24983 -53855
5561 -53855 -94467 -117328 -115197 -37177 26319 147693 235212 327799 423170 279982 130107
5550 130107 96598 -113796 -96346 -128453 -203628 -122084 -171328 -199504 -188745 -109771 2347
5539 2347 -31728 -229553 -113518 -127594 -81673 -180275 -334879 -253820 -81454 13130 91768
5528 91768 2518 122828 265243 277977 252426 218047 328157 314288 419421 414795 312423
5517 312423 268729 185590 113436 15804 -104547 -211816 -300572 -241718 -258391 -82887 23075
5506 23075 -37733 -97681 -120980 -226797 -94029 120887 151623 -11307 -127855 -147246 -11168
5495 -11168 -53087 72135 237645 128701 103320 142859 -50321 -44027 105051 -92737 -181679
$$ packed form
5572B37204k54695R686L17020L8481j45745k14442o9146J51382O0658j05420p8838
5561e3855m0612k2861K131P8020O3496J21374Q7519R2587R5371j43188j49875
5550A30107l3509k10394J7450l2107p5175Q1544m9244k8176J0759P8974J12118
5539B347l4075j97825J16035j4076M5921r8602j54604Q1059J72366R4584P8638
5528I1768q9250J20310J42415J2734k5551l4379J10110j3869J05133m626j02372
5517C12423m3694q3139p2154r7632j20351j07269q8756N8854j6673J75504J05962
5506B3075o0808n9948k3299j05817J32768K14916L0736j62930j16548j9391J36078
5495a1168m1919J25222J65510j08944k5381L9539j93180O294J49078j97788q8942
$$ plain form
5484 -181679 -142563 -35795 -140296 -234287 -153385 122482 123441 88922 119284 192033 280266
5473 280266 14148 47186 142438 275413 372030 476334 421911 215576 278915 143789 -47467
5462 -47467 -80300 -32805 -76531 -228805 -185888 -252368 -255786 -299283 -67773 -221759 -322462
5451 -322462 -287737 -235517 -229121 -241599 -191193 -211413 -185426 -148068 -57875 -5870 -118597 -114600
5439 -114600 17009 77620 134742 56019 -2591 127297 128253 -72198 -209706 -175868 -31819
5428 -31819 7505 6912 -76243 123178 110133 -125984 -110977 29531 155992 183253 157955
$$ packed form
5484a81679L9116J06768j04501r3991Q0902K75867R59l4519L0362P2749Q8233
5473B80266k66118L3038R5252J32975R6617J04304n4423k06335O3339j35126j91256
5462d7467l2833M7495m3726j52274M2917o6480l418m3497K31510j53986j00703
5451c22462L4725N2220O396j2478N0406k0220K5987L7358R0193N2005j12727L997
5439a14600J31609O0611N7122p8723n8610J29888R56k00451j37508L3838J44049
5428c1819L9324n93q3155J99421j3045k36117J5007J40508J26461K7261k5298
$$ [...]
##END NTUPLES=NMR SPECTRUM
##END=
