##TITLE=Analysis number 317525
Compound Code mo 07742
Project Code qc-cat
Chemist Name chemcon
##JCAMPDX= 6.0         $$ Bruker NMR JCAMP-DX V2.0
##DATA TYPE= NMR SPECTRUM
##DATA CLASS= NTUPLES
##ORIGIN= Bruker BioSpin GmbH
##OWNER= nmr
$$ XWIN-NMR		Version 3.5
$$ Wed Feb 22 12:30:04 2006 GMT Standard Time (UT+0h)  MAYBRIDGE\nmr@NMR_250MHZ
##.OBSERVE FREQUENCY= 250.131544655141
##.OBSERVE NUCLEUS= ^1H
##.ACQUISITION MODE= SIMULTANEOUS (DQD)
##.ACQUISITION SCHEME= undefined
##.AVERAGES= 16
##.DIGITISER RES= 18
##SPECTROMETER/DATA SYSTEM= dpx250
##.PULSE SEQUENCE= zg30
##.SOLVENT NAME= DMSO
##.SHIFT REFERENCE= (INTERNAL, DMSO, 0, 16.522)
##AUDIT TRAIL= $$ (NUMBER, WHEN, WHO, WHERE, WHAT)
$$ ##TITLE= Audit trail, XWIN-NMR		Version 3.5
$$ ##JCAMPDX= 5.01
$$ ##ORIGIN= Bruker BioSpin GmbH
$$ ##OWNER= nmr
$$ C:\u/data/dgb/nmr/ADRS/16670/pdata/1/auditp.txt
$$ ##AUDIT TRAIL=  $$ (NUMBER, WHEN, WHO, WHERE, WHAT)
(   1,<2006-02-22 12:29:31.10 +000>,<MAYBRIDGE\nmr>,<NMR_250MHZ>,
      <created by zg, POWCHK disabled, PULCHK disabled
       configuration hash MD5:
       84 BC 41 DB A1 6E 1D 46 DA 25 12 A5 C1 ED C5 3A
       data hash MD5: 64K
       6C 02 4E 5B 64 ED 92 7F 43 9D CA 60 3A 94 17 D5>)
(   2,<2006-02-22 12:29:47.56 +000>,<MAYBRIDGE\nmr>,<NMR_250MHZ>,
      <Start of raw data processing
       ef LB = 0.3 FT_mod = 6 PKNL = 1 SI = 32K 
       data hash MD5: 32K
       AD 92 2F EF E3 CE 99 20 15 6C 11 F8 93 3F 32 49>)
(   3,<2006-02-22 12:29:51.35 +000>,<MAYBRIDGE\nmr>,<NMR_250MHZ>,
      <apk 
       data hash MD5: 32K
       52 85 74 E6 1D 1C D1 26 61 77 2B 0B 48 BD BC 3C>)
(   4,<2006-02-22 12:29:52.42 +000>,<MAYBRIDGE\nmr>,<NMR_250MHZ>,
      <abs ABSG = 5 
       data hash MD5: 32K
       04 FE CB C8 55 46 23 1C 84 21 D6 22 89 F4 C0 AA>)
$$ ##END=
$$ 
$$ hash MD5
$$ 31 FD 59 72 9B B5 D9 DF 7D D6 69 5C CA 52 16 61
##$RELAX= 
##$RELAX= 
##$RELAX= 
##$RELAX= 
##$RELAX= 
##$RELAX= 
##$RELAX= 
$$ Bruker specific parameters
$$ --------------------------
##$DU= <C:\u>
##$EXPNO= 16670
##$NAME= <ADRS>
##$PROCNO= 1
##$TYPE= <nmr>
##$USER= <dgb>
##$AMP= (0..31)
100 100 100 100 100 100 100 100 100 100 100 100 100 100 100 100 100 100 
100 100 100 100 100 100 100 100 100 100 100 100 100 100 
##$AQSEQ= 0
##$AQ_mod= 3
##$AUNM= <au_zg>
##$AUTOPOS= <27 >
##$BF1= 250.13
##$BF2= 250.13
##$BF3= 250.13
##$BF4= 250.13
##$BF5= 500.13
##$BF6= 500.13
##$BF7= 500.13
##$BF8= 500.13
##$BYTORDA= 1
##$CFDGTYP= 0
##$CFRGTYP= 5
##$CHEMSTR= <none>
##$CNST= (0..31)
1 1 145 1 1 1 1 1 1 1 1 1 1 1 1 1 1 1 1 1 1 1 1 1 1 1 1 1 1 1 1 1 
##$CPDPRG= <>
##$CPDPRG1= <>
##$CPDPRG2= <>
##$CPDPRG3= <>
##$CPDPRG4= <mlev>
##$CPDPRG5= <mlev>
##$CPDPRG6= <mlev>
##$CPDPRG7= <mlev>
##$CPDPRG8= <mlev>
##$CPDPRGB= <>
##$CPDPRGT= <>
##$D= (0..31)
0 1 0 0 0 0 0 0 0 0.06 0 0 0 0 0 0 0.0002 0 0 0 0 0 0 0 0 0 0 0 0 0 0 
0 
##$DATE= 1140611369
##$DBL= (0..7)
120 120 120 120 120 120 120 120 
##$DBP= (0..7)
150 150 150 150 150 150 150 150 
##$DBP07= 0
##$DBPNAM0= <>
##$DBPNAM1= <>
##$DBPNAM2= <>
$$ [...]
##$SUBNAM7= <"">
##$SUBNAM8= <"">
##$SUBNAM9= <"">
##$SW= 20.6930455092707
##$SWIBOX= (0..15)
0 0 3 0 0 0 0 0 0 0 0 0 0 0 0 0 
##$SW_h= 5175.983436853
##$TD= 65536
##$TD0= 1
##$TE= 293.16
##$TE2= 300
##$TE3= 300
##$TEG= 300
##$TL= (0..7)
0 120 120 120 120 120 120 120 
##$TP= (0..7)
150 150 150 150 150 150 150 150 
##$TP07= 0
##$TPNAME0= <>
##$TPNAME1= <>
##$TPNAME2= <>
##$TPNAME3= <>
##$TPNAME4= <>
##$TPNAME5= <>
##$TPNAME6= <>
##$TPNAME7= <>
##$TPOAL= (0..7)
0.5 0.5 0.5 0.5 0.5 0.5 0.5 0.5 
##$TPOFFS= (0..7)
0 0 0 0 0 0 0 0 
##$TUNHIN= 0
##$TUNHOUT= 0
##$TUNXOUT= 0
##$USERA1= <user>
##$USERA2= <user>
##$USERA3= <user>
##$USERA4= <user>
##$USERA5= <user>
##$V9= 5
##$VALIST= <valist>
##$VCLIST= <CCCCCCCCCCCCCCC>
##$VD= 0
##$VDLIST= <DDDDDDDDDDDDDDD>
##$VPLIST= <PPPPPPPPPPPPPPP>
##$VTLIST= <TTTTTTTTTTTTTTT>
##$WBST= 1024
##$WBSW= 4
##$XGAIN= (0..3)
0 0 0 0 
##$XL= 0
##$YL= 0
##$YMAX_a= 260436
##$YMIN_a= -387687
##$ZGOPTNS= <>
##$ZL1= 120
##$ZL2= 120
##$ZL3= 120
##$ZL4= 120
##$ABSF1= 16.522
##$ABSF2= -4.171173
##$ABSG= 5
##$ABSL= 3
##$ALPHA= 0
##$AQORDER= 0
##$ASSFAC= 0
##$ASSFACI= 0
##$ASSFACX= 0
##$ASSWID= 0
##$AUNMP= <proc_1d>
##$AZFE= 0.1
##$AZFW= 0.1
##$BCFW= 0
##$BC_mod= 0
##$BYTORDP= 0
##$COROFFS= 0
##$CY= 12.5
##$DATMOD= 1
##$DC= 0
##$DFILT= <>
##$DTYPP= 0
##$F1P= 14.0000005364418
##$F2P= -0.99999901652339
##$FCOR= 0.5
##$FTSIZE= 32768
##$FT_mod= 6
##$GAMMA= 0
##$GB= 0
##$INTBC= 1
##$INTSCL= 1
##$ISEN= 128
##$LB= 0.3
##$LEV0= 0
##$LPBIN= 0
##$MAXI= 10000
##$MC2= 0
##$MEAN= 0
##$ME_mod= 0
##$MI= 0
##$NCOEF= 0
##$NC_proc= -5
##$NLEV= 6
##$NOISF1= 0
##$NOISF2= 0
##$NSP= 0
##$NTH_PI= 0
##$NZP= 0
##$OFFSET= 16.522
##$PC= 1
##$PHC0= 237.3672
##$PHC1= 9.921049
##$PH_mod= 1
##$PKNL= yes
##$PPARMOD= 0
##$PSCAL= 4
##$PSIGN= 0
##$REVERSE= no
##$SF= 250.13
##$SI= 32768
##$SIGF1= 0
##$SIGF2= 0
##$SINO= 400
##$SIOLD= 32768
##$SREGLST= <1H.DMSO>
##$SSB= 0
##$STSI= 32768
##$STSR= 0
##$SW_p= 5175.98343685301
##$SYMM= 0
##$S_DEV= 0
##$TDeff= 65536
##$TDoff= 0
##$TI= <Analysis number 999999
Compound Code 99
Book Reference 9
Project Code 9>
##$TILT= no
##$TM1= 0
##$TM2= 0
##$TOPLEV= 0
##$USERP1= <user>
##$USERP2= <user>
##$USERP3= <user>
##$USERP4= <user>
##$USERP5= <user>
##$WDW= 1
##$XDIM= 32768
##$YMAX_p= 497994995
##$YMIN_p= -1141634
$$ End of Bruker specific parameters
$$ ---------------------------------
##NTUPLES= NMR SPECTRUM
##VAR_NAME=  FREQUENCY,     SPECTRUM/REAL,   SPECTRUM/IMAG
##SYMBOL=    X,             R,               I
##VAR_TYPE=  INDEPENDENT,   DEPENDENT,       DEPENDENT
##VAR_FORM=  AFFN,          ASDF,            ASDF
##VAR_DIM=   32768,         32768,           32768
##UNITS=     HZ,            ARBITRARY UNITS, ARBITRARY UNITS
##FACTOR=    0.157963299565203, 1,           1
##FIRST=     4132.6476996994, 0,             0
##LAST=      -1043.33573715361, 0,           0
##MIN=       -1043.33573715361, -1141634,    0
##MAX=       4132.6476996994, 497994995,     0
$$ Real data points
##PAGE= N=1
##DATA TABLE= (X++(R..R)), XYDATA
$$ [...]
15561b3403M0754l78363k48126J14928J78389L1043O310j8167m3111J18753r5723
15550c16716j49963N0623K79049L0011J76695l2621l2821J11522J61945j32422
15540A45302P5741j24291J44219k26903J6290O4346j95901R3644n4479K74120
15530B12088K86238K15531m11228k33290J22361j4857j0938J82589j83096j58994
15520F404l9845J92790M4468O0161j23766K84280J85773j26954k82223K0027L09333
15509E30448M49444r8539l39012l24206n52749L9430L82661J50840l030k6216
15499B09071j29231N7065J58881j09525K21644J71918O0663k68815j49608K9407
15489B51470K02952P3189m15023l38115J22340M64722J58370O0300q0191o5390
$$ plain form
15561 -23403 17351 -361012 -609138 -494210 -315821 -284778 -278468 -296635 -339746 -220993 -316716
15550 -316716 -466679 -416056 -137007 -106996 69699 37078 4257 115779 277724 145302
15540 145302 221043 96752 240971 14068 30358 94704 -101197 -7553 -62032 212088
15530 212088 498326 713857 302629 69339 191700 176843 165905 348494 165398 6404
15520 6404 -33441 159349 203817 263978 140212 424492 610265 483311 201088 221115 530448
15509 530448 979892 881353 542341 218135 -334614 -295184 87477 238317 235287 209071
15499 209071 79840 136905 295786 186261 407905 579823 640486 371671 222063 251470
15489 251470 454422 527611 112588 -225527 -103187 361535 519905 580205 500014 434624
15479D34624j9714K33540J27676j68306l52810L7227J70188K70325K20281m827
15469I48204P0114j26275J66726J056P4215L77307J60687j02172n0558j43086
15459A376218j15579p8351J74898K77474k76163o4332n2370k20895O5049o9179
15449A016770J4984k07839j48518n8766j32902J72432J80547m9913j59943k30604
15439C96248j62434j90353J27997O7597k05713j65172O0027K89494q8593k44607
15429a15509P5202o6521n4127J08667K58214R0742j14324l4556j50225L4046j59177
15418a27568j58697j76290q4140M32212K64010K85611J22104r3291J69396j54256
15408D79091n14613n9793L4146P584K59964j54401r4299M16829J24373j97640
$$ plain form
15479 434624 414910 648450 776126 607820 255010 292237 462425 732750 953031 948204
15469 948204 1018318 892043 1058769 1059825 1134040 1511347 1672034 1569862 1519304 1376218
15459 1376218 1260639 1182288 1357186 1634660 1358497 1294165 1241795 1020900 1085949 1016770
15449 1016770 1031754 823915 675397 616631 483729 656161 836708 786795 626852 396248
15439 396248 233814 43461 171458 239055 33342 -131830 -71803 217691 129098 -115509
15429 -115509 -40307 -106828 -160955 -52288 205926 296668 182344 147788 -2437 31609 -127568
15418 -127568 -286265 -462555 -546695 -114483 149527 435138 557242 463951 633347 479091
15408 479091 -35522 -95315 -61169 -53585 206379 51978 -42321 374508 498881 301241
15398C01241l74079l75967O9754K44753J26142J61282N2311L8123p2968q4503
15388H6089q3534o2121j24415m3933L45509k50607l25683K22310J30262Q7161
15378a8962l49922j95962Q620J24816O9682l7537M3240J00539J9049j7358Q3730
15367a70065O814J14624M01780K28191l80830j76259j29879K03122N9650k17255
15357f0107O3526j53403N9151K75358k54485k65484K36025p6258J32959J59348
15347A16630q922k51448j36044J37425K58019K53743j70429j42580K69686J13124
15337D39204q8392j72799j20873J56949Q9902r6531o9106K69903m9581k8229J09037
15326D39484l41107j46365j21526J46591Q8563K93047L02113M18870j16507l82337
$$ plain form
15398 301241 -72838 -448805 -379051 -134298 -8156 153126 205437 243560 170592 86089
15388 86089 2555 -59566 -183981 -227914 117595 -133012 -458695 -236385 -106123 -18962
15378 -18962 -368884 -564846 -556226 -431410 -361728 -399265 -356025 -255486 -236437 -253795 -170065
15367 -170065 -163251 -48627 353153 581344 200514 24255 -105624 97498 157148 -60107
15357 -60107 3419 -149984 -90833 184525 -69960 -335444 -99419 -175677 -42718 116630
15347 116630 107708 -143740 -279784 -142359 115660 369403 198974 56394 326080 439204
15337 439204 350812 178013 57140 214089 303991 207460 138354 408257 358676 330447 439484
15326 439484 98377 -47988 -169514 -22923 65640 358687 660800 1079670 963163 580826
15316E80826k88411K5526j2411j08332o1611j3142j67358j09589J6661N2223p5275
15305a60893K7060K29572J00866M9151o289j84528J78886J1844j67238J44523
15295B22954L7335l00054J77305J49986J06449k74224k30455O7212L33603P1836
15285C61947j47401j75982k2881N6850O6668l26L2096J5312q6009J63806P727
15274B71807N6622K16896p378o8591L5180R7669K20073j48302J08889M34004O3157
15263A280026l25351l46704j26993n9440J59028P2797j13483j53956Q7729J13112
15253E86765J91460k20460l78108p0981n5633n8909K19098J11415j43014k53896
15243g2263j47461J43783J45388K13748k7759o7654L42000R3059l4345L5751P3479
$$ plain form
15316 580826 292415 317941 305530 197198 135587 122445 -44913 -154502 -137841 -85618 -160893
15305 -160893 -133833 95739 196605 245756 239467 54939 233825 245669 78431 222954
15295 222954 260289 -39765 137540 287526 393975 119751 -110704 -43492 290111 361947
15285 361947 214546 38564 15683 72533 139201 138875 170971 186283 100274 264080 271807
15274 271807 328429 545325 537947 469356 504536 602205 822278 673976 782865 1216869 1280026
15263 1280026 954675 607971 480978 421538 580566 653363 539880 385924 473653 586765
15253 586765 778225 557765 179657 108676 53043 -5866 213232 324647 181633 -72263
15243 -72263 -219724 -75941 69447 283195 255436 187782 529782 622841 588496 624247 697726
15232F97726k89681r3124j01772r4053K07630J69729k18224k80998R6722K00445
15222B94400J07850P403j55854J55994l8402r3808p4937l06791o1562K07887L43257
15211C85437n3717l4484J49594J7134j75768l12504J58521K99230m825J34149
15201E62767l84734k51727K03964J77334N033k8848J7591j90087o11787N6925
15191d43569M12523M38285q2015P2936K82238r3819m29208J06293r3917j43979
15181B5768j4892o3375K9000J06685k72961P0238L24472M67985J72971j72512
15171F73379O5346l5125j13365P0620N1247l1431j87541j89654M4174O5162k8773
15160C84039k9151l8760J49079K6575K46643j25991j40662j77853J33329O39602
$$ plain form
15232 697726 408045 314921 213149 119096 326726 496455 278231 -2767 93955 294400
15222 294400 402250 409653 253799 409793 371391 277583 202646 -104145 -165707 42180 385437
15211 385437 331720 297236 446830 463964 288196 -24308 134213 433443 428618 562767
15201 562767 178033 -73694 130270 307604 312637 283789 301380 111293 -500494 -443569
15191 -443569 -31046 407239 325224 398160 680398 586579 157371 263664 169747 25768
15181 25768 10876 -52499 -23499 83186 -189775 -119537 204935 672920 845891 673379
15171 673379 738725 703600 590235 660855 712102 680671 493130 303476 347650 412812 384039
15160 384039 354888 316128 465207 491782 738425 612434 471772 293919 427248 1066850
15150A066850J31272k29226k55088q8337P299R4138R4599K48475O2133o2839L51516
15139A420792o8249k87060k06206J53963K18972J02485L63966k5169m0232j32934
15129A500328M4818l4104l2944K7050j18805o112q9663j04725J66082q2388r5569
15118A173968K4032J03347m7837j15139m9332N0402K97418j07772l23211P4j04072
15107I01878J00993N154J24216J48122J77924l9614K93855M5997j07265r3602
15097A557658j01554O1785k95127j78141L2030K34854k8057j09911K79359N02363
15087A955259K05809K23433k57648l89594K58159K55624J47029n5937l57496J81074
15077B165712M46674l0675j83400J61810J05322J63719P3093J79776K60621J58896
$$ plain form
15150 1066850 1198122 968896 713808 625471 632770 726908 821507 1069982 1132115 1069276 1420792
15139 1420792 1352543 1065483 859277 1013240 1232212 1334697 1698663 1673494 1633262 1500328
15129 1500328 1545146 1511042 1478098 1505148 1386343 1380231 1290568 1185843 1351925 1269537 1173968
15118 1173968 1198000 1301347 1253510 1138371 1089039 1139441 1436859 1329087 1005876 1005950 901878
15107 901878 1002871 1008025 1132241 1280363 1458287 1418673 1712528 1758525 1651260 1557658
15097 1557658 1456104 1517889 1222762 1044621 1076651 1311505 1283448 1173537 1452896 1955259
15087 1955259 2161068 2384501 2126853 1737259 1995418 2251042 2398071 2342134 1984638 2165712
15077 2165712 2612386 2581711 2398311 2560121 2665443 2829162 2902255 3082031 3342652 3501548
15067C501548J006j09908k03214J53485L60492M09346J24962J97751J66508L05997
15057D907973L04743L17766M31251K57134J6764K62339J12705L47716N77446M10854
15047G946691L53770M24185O69284Q71867O57384N69318R04943R35055J012139
15038A4344636J604591J687613J696745J868171K286662K403683K977475L460489
15030C2330065M008071M773129N806056P543549R320125J1632928J4180440J6812395
15022A06406758J8898477K0168503K0094477K0178862K1311747K4620622K8799838
15015B60479284L2266682L0916479K2545116J0459524J53315l902075q00895N653593
15007C57771023Q516756L090690q985317k1526325k9347765l0801448k7038884
$$ plain form
15067 3501548 3502554 3392646 3189432 3342917 3703409 4112755 4237717 4435468 4601976 4907973
15057 4907973 5212716 5530482 5961733 6218867 6235631 6497970 6610675 6958391 7535837 7946691
15047 7946691 8300461 8724646 9393930 10265797 10923181 11492499 12397442 13332497 14344636
15038 14344636 15949227 17636840 19333585 21201756 23488418 25892101 28869576 32330065
15030 32330065 36338136 41111265 46917321 54460870 63780995 75413923 89594363 106406758
15022 106406758 125305235 145473738 165568215 185747077 207058824 231679446 260479284
15015 260479284 292745966 323662445 346207561 356667085 356820400 352918325 352117430 357771023
15007 357771023 366287779 369378469 360393152 338866827 309519062 278717614 251678730
15000B51678730k1918298j8619920j7892805j8950198k0508911k0363465j8814404
14993A14610729j6399664j3976979j1293480q934368p464015o025566m906626
14986D5610031m386689l926944l438934l117837k751759k235312j911884j825008
14978B2015664j843790j466208j094132j235351j294906j023683r89423p18557
14970A2349614m66651o57776q09482o08166m45073n71674n32940k00689k61441
14961G795722l61798k84280l47857r7725q3671m8027j23830r3793p9865n66901
14951E707975o99943k63819k00330k00728l25044j13393m6159O2861m11465l59302
14941C150653j4516J39895P3486l25331o9457R0441k36920r3379j39978j96038
$$ plain form
15000 251678730 229760432 211140512 193247707 174297509 153788598 133425133 114610729
14993 114610729 98211065 84234086 72940606 64006238 56542223 50516657 45610031
14986 45610031 41223342 37296398 33857464 30739627 27987868 25752556 23840672 22015664
14978 22015664 20171874 18705666 17611534 16376183 15081277 14057594 13068171 12349614
14970 12349614 11882963 11225187 10415705 9807539 9362466 8790792 8257852 8057163 7795722
14961 7795722 7433924 7149644 6801787 6704062 6620391 6572364 6448534 6354741 6274876 5707975
14951 5707975 5008032 4744213 4543883 4343155 4018111 3904718 3858559 3921420 3509955 3150653
14941 3150653 3136137 3276032 3349518 3024187 2954730 3045171 2808251 2714872 2574894 2378856
14931B378856l06315k18348J4769J76161p3018J22905J46150l4683j44554L0879
14921B092802J46887j23210k55377r5448n2578J5088k39282p5213J20938j38516
14911A396091j0012k14597J16074J71469k51424l01140K7890j04862j75125k52896
14901D01468J80522M45439j52001Q151K11504Q9708j01141j33699J9627j53267
14891H16311l85295p5399j75159R8040K13789J95653n7032n1487k72319j71580
14881A35522M5158l3070r3472J38387R8464l7232j22298L6446q3510J95972J94715
14870D75082l0778J96550R4045p3372j16005k18766K56608O2204q7263k60485
14860B97820k99695K5399K92961Q2415j03952L548K7218J89213K27886L0227L9
$$ plain form
14931 2378856 2072541 1854193 1868962 2045123 1972105 2095010 2241160 2206477 2061923 2092802
14921 2092802 2239689 2116479 1861102 1765654 1713076 1728164 1488882 1413669 1534607 1396091
14911 1396091 1386079 1171482 1287556 1459025 1207601 906461 934351 829489 654364 401468
14901 401468 581990 1027429 875428 883579 1095083 1184791 1083650 949951 969578 816311
14891 816311 431016 355617 180458 278498 492287 687940 630908 579421 307102 135522
14881 135522 180680 147610 54138 192525 290989 253757 131459 167905 84395 280367 475082
14870 475082 444304 640854 734899 661527 545522 326756 583364 645568 558305 297820
14860 297820 -1875 23524 316485 398900 294948 298496 325714 514927 742813 773040 773079
14849G73079o5396k87975J9152L9598l5870J53411l3507L154K787k2490j58083
14838C87860k22384O0647J18182J50350L16053K8115k35027l20237o3250j06039
14828A14270K5390L45792J33878K33273j30280k63831j3543L5259o5737J24470
14818E38941J6300K8244K05655J77349j61529l29693j06636k34270k73231L56684
14808B17814M25884m3248R0814J24487j941j56222j94155m8215O7677J94583J21111
14797G98589l85737k84971M4483K65387J39150K26094j13076l01046R6763K53453
14787G39089J25127m01801k77636R0737O4716p5961Q6604k03563p597J45628J39047
14776D24390J32875k45124j03940j46484j440o3806n5282N3214J09179K01551
$$ plain form
14849 773079 707683 419708 438860 478458 442588 595999 562492 565646 568433 545943 387860
14838 387860 165476 226123 344305 494655 810708 838823 603796 283559 220309 114270
14828 114270 139660 485452 619330 852603 722323 458492 444949 480208 414471 538941
14818 538941 555241 583485 789140 966489 804960 475267 368631 134361 -138870 217814
14808 217814 643698 600450 691264 815751 813810 657588 463433 415218 482895 677478 798589
14797 798589 412852 127881 172364 437751 576901 802995 689919 388873 485636 739089
14787 739089 864216 462415 184779 275516 340232 264271 350875 147312 139715 285343 424390
14776 424390 557265 312141 208201 61717 60277 -3529 -58811 -5597 103582 305133
14766C05133L4948k31318P4144r3939k23947q0325j24650k16473k4382K03771
14756c77038N09848M32224o2085k4693k12485l67168K08130J17815R2267p6239
14746B40576N3301n9625j99959m12151j89925q0888N1309J26724J67881n885j70898
14735d79540M4445m2100J98686J6763J67132J07345r9592k27937J94204J18784
14725a810N8594K12941L29215j87626k31492q853j47718J15227L9039j19224l5392
14714B2901K07616Q0645k32388q4500j77905p6257J16916J56578J76018j26353
14704F3271k43641j41729K62298L98146j80583j37896J18679J0816j04712J04461
14694A49110K03736Q488R3656j15162q6272j56803K3427P302J23810K63560m9199
$$ plain form
14766 305133 340081 108763 182907 88968 -134979 -215304 -339954 -556427 -580809 -377038
14756 -377038 132810 565034 502949 478256 265771 -101397 106733 224548 316815 240576
14746 240576 293877 234252 34293 -377858 -567783 -648671 -597362 -470638 -302757 -308642 -479540
14735 -479540 -435095 -477195 -278509 -261746 -94614 12731 -86861 -314798 -120594 -1810
14725 -1810 56784 269725 598940 411314 179822 170969 23251 138478 177517 58293 22901
14714 22901 230517 311162 78774 -5726 -183631 -259888 -142972 13606 189624 63271
14704 63271 -180370 -322099 -59801 338345 157762 19866 138545 149361 44649 149110
14694 149110 352846 361334 454990 339828 253556 96753 120180 127482 251292 514852 465653
14683D65653k5484L36910k72606l73882J46056l00950K7619K03955R1505L935
14673C02711q8589k46891P602N1378O4789k5697j0513m6452N2856K23499J34769
14662D19462j67240j9136n1824m0596J51105r6114J18199O7505k75765j56017
14652e0421K23419j38912K5351m3914M1018K16027j46960M9418j2047m1534n2976
14641F8469j39852o8803J22104j57477Q6062J53643M78399j30241l6622j71183
14631B04499j36250m8040j63760j65605Q0135K00113J32950n0620J10053K26175
14621C89650J27180k45774k25426j36194J8372j96175k5005M14155K23464m7949
14611B96298l332J2474j10815j04708j76766j1466O6378l0927q3973k07355M2323
$$ plain form
14683 465653 440169 777079 504473 130591 276647 -24303 3316 207271 298776 302711
14673 302711 214122 -32769 -25167 26211 91000 65303 54790 8338 61194 284693 419462
14662 419462 252222 233086 181262 140666 291771 195657 313856 381361 105596 -50421
14652 -50421 172998 34086 59437 15523 56541 272568 125608 175026 162979 121445 68469
14641 68469 -71383 -140186 -18082 -175559 -89497 64146 542545 412304 375682 204499
14631 204499 68249 20209 -143551 -309156 -229021 -28908 104042 53422 163475 389650
14621 389650 516830 271056 45630 -90564 -72192 -268367 -293372 120783 344247 296298
14611 296298 292966 305440 194625 89917 -86849 -98315 -31937 -62864 -146837 -354192 -311869
14600c11869M53829j0994k44189j6555J33612o6309j16776j03062J98738J58923
14590G5348J35632j05624j09356Q9707j90087q0224K78433j2236l6363N0757Q800
14579A04787j49866N4004k21329o8069K00578K58237O8742j72811J1188L49022
14569D34483O1028K8984Q9273J37593k57510J12266L74585J97321J34034J77241
14559A489298j44020J63256K17094J76266p4940J34978j78566j27606J00585J70926
14549A927271Q4750l40204J546J69389l08185n26765m0564J52050J00878p2408
14539A147758l01557k76027j03299J82359j16630K79247j32333l32937k0400P2146
14529C98327l45041j25995N950n3580K34779J04666J71292J00268q1666j82143
$$ plain form
14600 -311869 141960 130966 -113223 -129778 3834 -62475 -179251 -282313 -83575 75348
14590 75348 210980 105356 -4000 85707 -104380 -184604 93829 81593 45230 95987 104787
14579 104787 -45079 8925 -212404 -280473 -79895 178342 247084 74273 85461 434483
14569 434483 495511 524495 613768 751361 493851 606117 980702 1178023 1312057 1489298
14559 1489298 1345278 1508534 1725628 1901894 1826954 1961932 1783366 1655760 1756345 1927271
14549 1927271 2012021 1671817 1673363 1842752 1534567 1007802 967238 1119288 1220166 1147758
14539 1147758 846201 570174 466875 649234 532604 811851 679518 346581 326181 398327
14529 398327 53286 -72709 -66759 -120339 114440 219106 390398 490666 409000 226857
14519B26857k30668J23235j40742M8995K55706p660l37528K37086j54677j75J0164
14508C0593j62605K03745R2533o5106j74425j14097K6512j16794J16718m0319
14498b03245Q0835L52719k09173k50233q2911Q1947J76720J36258N3014p350m310
14487A24271n4934n3575K53Q0062j42178q9005R9300K09660j52j18975J33763
14476A88490O5449J21161j66673j30601k78128j90129N5687O8316r3049R7567
14466b61910J67538J27301j00592L1948J70548q7667k56626K3012K14505N0636
14456G8693Q0895j91472k990j66073N3914j57211k44748p7548K26903K95316K05164
14445A00843J45883J56611P6857m209k61838j70247j17594j87648o8953q3896
$$ plain form
14519 226857 -3811 119424 -21318 27677 283383 275723 -61805 175281 20604 20429 30593
14508 30593 -132012 71733 164266 99160 -75265 -189362 -162850 -279644 -162926 -203245
14498 -203245 -122410 230309 21136 -229097 -312008 -230061 -53341 82917 135931 128581 124271
14487 124271 69337 15762 16015 96077 -46101 -135106 -35806 173854 173702 54727 188490
14476 188490 253939 375100 208427 77826 -200302 -390431 -334744 -266428 -359477 -261910
14466 -261910 -94372 32929 -67663 -35715 134833 47166 -209460 -186448 28057 78693
14456 78693 159588 -31884 -34874 -200947 -147033 -304244 -548992 -626540 -399637 -104321 100843
14445 100843 246726 403337 480194 475985 214147 43900 -73694 -261342 -330295 -414191
14435d14191L9998K55316K37603o149k6835K84154l9194m18524j38159q887L5676
14424a99192j19311k68647k79101J18929M24822K98210l20266M7725Q6912L5353
14414a74566J52523J97692j44125k5162j4450J82470R7842j13166q4387r4486
14404a9815P0829J0334j25403Q3807O5063J54348l4053p0964q6718J64467J68328
14393C80223k20744j87465K3871j33358M1093m0023J75038P550k15906Q1906K5143
14382f2672J81728J81988m3585J05245l0528N1110r4344k03605r5576Q3664K4916
14371I8341r6926l992K61073O2062j33203O060P8001J05105J37303k37456j75079
14360A01289k80634m1885J24157J30577J60781j76515n1961J47403K26862l6122
$$ plain form
14435 -414191 -374193 -118877 118726 112577 85742 369896 330702 -87822 -225981 -234868 -199192
14424 -199192 -318503 -587150 -866251 -747322 -322500 -24290 -344556 -296831 -209919 -174566
14414 -174566 -22043 175649 31524 6362 -8088 174382 272224 159058 74671 -19815
14404 -19815 51014 61348 -64055 19752 84815 239163 205110 134146 47428 211895 380223
14393 380223 159479 -27986 -4115 -137473 -96380 -136403 38635 46185 -169721 -87815 -62672
14382 -62672 119056 301044 257459 362704 332176 383286 288942 85337 -10239 73425 98341
14371 98341 1415 -2577 258496 320558 187355 193415 271416 376521 513824 276368 101289
14360 101289 -179345 -221230 -97073 33504 194285 17770 -34191 113212 340074 303952
14350C03952k46371l4634j45481m9687j00515j90408k5178Q5115p1312p3237L0170
14339e17586J17654K63520L61144m3227j66904j31766k50418J46499R2715l5816
14329a64185J41859N0900P3037J74770K36757m7490k24916l70783P0354J49154
14319H9457k6970j45797j00330M0135M1055k08205p3305K46602P1090R9622j05723
14308g2369j89327J31159Q4487k01927J70369J44191M9307k1446L8233m3897l7394
14297E1386k07089k9061k22841j68064J29318K49198J77817k28563l50270r6413
14287f94582J42361M04290M36119k64255j22049k35217K45372K75728m223Q820
14277A92364j10816J9408J556j57799K6681L50185K6712l81019j51325J28473
$$ plain form
14350 303952 57581 22947 -122534 -172221 -272736 -463144 -488322 -403207 -474519 -547756 -517586
14339 -517586 -399932 -136412 224732 181505 14601 -117165 -367583 -221084 -128369 -164185
14329 -164185 -22326 28574 101611 276381 513138 465648 240732 -130051 -59697 89457
14319 89457 62487 -83310 -183640 -143505 -102450 -310655 -383960 -137358 -66268 33354 -72369
14308 -72369 -261696 -130537 -46050 -247977 -77608 66583 115890 94444 132677 88780 51386
14297 51386 -155703 -184764 -407605 -575669 -446351 -197153 -19336 -247899 -598169 -694582
14287 -694582 -552221 -147931 288188 23933 -98116 -333333 -87961 187767 183544 192364
14277 192364 81548 100956 102512 -55287 -28606 321579 348291 -32728 -184053 -55580
14267e5580J79260J92434j06946l28488n9384J13438Q7881K11091j14956R986
14257A28736Q722J38165j4808l414J13014R8573k22880j03933Q7382j92607k16295
14246a79345n3584J84393k12735l03588R8004R0847L83447p9245j73042k39647
14236d84495l36927O8031J88470N04324J19938l73360m2327J34131L15813J44546
14226B38144J54661j15737k65787O1166J16327m5714K57636N5369j45679k10872
14216I9514l1789k03452n8370o2973j3056N7882j0650J486K7226L20281J13153
14205B39252j12784J5284j52047j05269j74647J98518K29335j7495M0523J16558
14195B77228o5398J32218j31687q4864k52003N7382J08296J46777l1313M7317
$$ plain form
14267 -55580 123680 316114 209168 -119320 -178704 -65266 22615 233706 118750 128736
14257 128736 137458 275623 260815 257401 370415 468988 246108 142175 229557 36950 -179345
14246 -179345 -232929 -48536 -261271 -564859 -466855 -376008 7439 -71806 -244848 -484495
14236 -484495 -821422 -753391 -564921 -60597 59341 -314019 -356346 -222215 93598 238144
14226 238144 392805 277068 11281 72447 188774 143060 400696 456065 310386 99514
14216 99514 67725 -135727 -194097 -257070 -270126 -212244 -222894 -221408 -194182 126099 239252
14205 239252 126468 141752 -10295 -115564 -290211 -91693 137642 120147 160670 277228
14195 277228 211830 344048 212361 127497 -124506 -67124 41172 187949 156636 203953
14185B03953K87m14657K07094J73209m6012k12991O8746L21906O2923J0471j21563
14174B53366q771j154j04880k55896N3901K38868k30309p0997k0356J3452q7610
14163b20386o8039J03865q0699m3367j12342K5959J2125K97021J22164J17024
14153A53325o300L11711k85091j72159P9000O9523k1535j1567l9000K6650j43802
14142c9245j48517m8244L4229J62455K24112n6602l30634J62086K18074J88637
14132C66351j43762m0798K984P9320L1481M760J80581l4974m94693L2068N6961
14121D0279Q9864R8854j92832j78468K25261J00629j49920r1636J67159n5087
14111E4103j27020K0532R9844j38892l29221k37544L4035L22501J75859K91340
$$ plain form
14185 203953 204240 -210417 -3323 169886 123874 -89117 -20371 301535 364458 374929 253366
14174 253366 244595 243441 138561 -117335 -63434 175434 -54875 -125872 -146228 -132776 -220386
14163 -220386 -288425 -184560 -265259 -308626 -420968 -395009 -382884 -85863 36301 153325
14153 153325 147025 458736 173645 1486 80486 150009 128474 116907 77907 104557 -39245
14142 -39245 -187762 -236006 -201777 -39322 184790 128188 -202446 -40360 177714 366351
14132 366351 222589 181791 184775 264095 295576 300336 480917 445943 -48750 -16682 40279
14121 40279 130143 228997 36165 -142303 82958 183587 33667 -57969 109190 54103
14111 54103 -72917 -52385 47459 -91433 -420654 -658198 -624163 -301662 -125803 165537
14101A65537R3821j5110l2510j57271K22148P2124q8918k16259j57221j73650
14091b87309k9099K66809l2538j59490J01616M40576p1143J5776k33872n3254
14081d1928r4108j03522K05182Q0274o0059o341J20763J75777k10343k19583N6116
14070i7772M8627K09225N331r5537J2731r0922K105J82975N7113j04327O6580
14059A96129j05264j88488j99163M119J59962O8456j29336M01243Q8433o6139
14049B29952j6271q864K44736k8258l93614k1783N4854j40358j11028l7630k32839
14038d61103P8925L4683J07140J65203M5000J36072J12342k06851j37849j78809
14028c05247j92756J40984L76894J23977p9667j74594k2853r8120O2893j95676
$$ plain form
14101 165537 259358 244248 211738 54467 276615 348739 259821 43562 -113659 -287309
14091 -287309 -316408 -49599 -82137 -241627 -140011 300565 229422 245198 11326 -41928
14081 -41928 -136036 -239558 -34376 45898 -14161 -20502 100261 276038 65695 -153888 -97772
14070 -97772 -49145 160080 165411 69874 82605 -8317 -6212 176763 233876 129549 196129
14059 196129 90865 -97623 -296786 -292667 -132705 -64249 -193585 207658 296091 229952
14049 229952 213681 204817 449553 421295 27681 5898 60752 -79606 -190634 -228264 -461103
14038 -461103 -382178 -347495 -240355 -75152 -30152 105920 218262 11411 -126438 -305247
14028 -305247 -498003 -357019 19875 143852 64185 -110409 -133262 -231382 -168489 -364165
14018c64165j43396q6067J81642K53273j24732J47417k15099K34287j28060k35012
14008d79912K2039p9614j26140M37672J05772n0997j68601j05936k15795K42896
13998d18616L97538K29966j54607Q8499q7302o9829k68972k28199J98055L13060
13988d07J71307j40852k47402j23676m3428K76502K73593K25370j86108J01625
13978C06524O335k64108O84j0020M46J43167n2392r347p6369j05276J97566l4634
13966A02576o906k04630j69234J80384K71748o1245N2799R916j96725l7815j25922
13955a85054n6517L3770k5622p6014J80521J04089M418j69008l77193k0604K60355
13944c26859M8816j46755l8212L2799J66840J29375R2272L1005N9892j97994j45104
$$ plain form
14018 -364165 -507561 -593628 -411986 -158713 -283445 -136028 -351127 -116840 -244900 -479912
14008 -479912 -457873 -537487 -663627 -225955 -120183 -171180 -339781 -445717 -661512 -418616
13998 -418616 -21078 208888 54281 142780 55478 -14351 -283323 -511522 -313467 -407
13988 -407 170900 30048 -217354 -341030 -384458 -107956 165637 391007 204899 306524
13978 306524 312859 48751 49435 39415 39861 183028 130636 121289 44920 -60356 137210 102576
13966 102576 95670 -108960 -278194 -97810 173938 112693 165492 175408 -21317 -59132 -185054
13955 -185054 -241571 -207801 -233423 -309437 -128916 -24827 -20409 -189417 -566610 -587214 -326859
13944 -326859 -278043 -424798 -463010 -430211 -263371 -133996 -41724 -10719 49173 -148821 -293925
13933b93925k7381k84451J816L1357J70577J18680m6076j69557J49980L54510
13923E530J64640k85010O523J19875j4775p1030l8618l7460j3879k04410K8285
13912c40329Q0353K2548J66790N6023K47882k73100j13965K03181L18513j22720
13902B45176j03370l0662P4472j71120r0357j1054j8135q6740k8553j8799j30094
13891c69236N894L26663L4051Q7355R2508k10084m9895J63313k93391p0726K40254
13880d3294M3049n0961J39284O6177j03929j11129Q1524l6511K09741O3884n5149
13869B02686K6178K34653q3347k09089k78427k6396M0722N6379K32673K51082
13859D47114L0308k72945l69504k75776K8294L87357L2197J9112L2303K04310
$$ plain form
13933 -293925 -321306 -605757 -603941 -572584 -402007 -283327 -329403 -498960 -348980 5530
13923 5530 170170 -114840 -108317 11558 -3217 -74247 -112865 -150325 -164204 -368614 -340329
13912 -340329 -259976 -237428 -70638 -14615 233267 -39833 -153798 49383 367896 245176
13902 245176 141806 111144 185616 14496 -75861 -86915 -105050 -191790 -220343 -239142 -369236
13891 -369236 -363342 -36679 -2628 84727 177235 -32849 -82744 80569 -212822 -283548 -43294
13880 -43294 -245 -51206 88078 154255 50326 -60803 20721 -15790 193951 257835 202686
13869 202686 228864 463517 380170 171081 -107346 -133742 -93020 -36641 196032 447114
13859 447114 477422 204477 -165027 -440803 -412509 -25152 7045 26157 58460 262770
13849B62770K51321j28335m7639j81509j75650P2431q9084q4576K24175P0496
13839A74400j42074k00460l05016k8650K99777J0700r1483K82897K99285J961
13829C01337P3151J06894J88266M39763N48305M31088N19519K32608J94377n112
13819C030196k87940m14055p0452k22122l00167l96781k08600p0783k88253j96997
13809E74046j6701J44055J61229o6102k52073k08207m8871N5747j22603Q1662
13799C02182R9438j29121J00851k00973j77709k07740L18424M2998j66314n1972
13789f9936O5768r2359o4256j70551N854j00340J64856K82107K91152P7728k2663
13778C67360K2863j86120J66321j2185k88193q2443N5713k5523K4560j09290j90903
$$ plain form
13849 262770 514091 385756 338117 156608 -19042 53389 -35695 -120271 103904 174400
13839 174400 32326 -168134 -473150 -501800 -202023 -191323 -282806 91 299376 301337
13829 301337 374488 481382 669648 1109411 1657716 2088804 2608323 2840931 3035308 3030196
13819 3030196 2742256 2328201 2257749 2035627 1735460 1338679 1130079 1059296 771043 574046
13809 574046 557345 701400 862629 796527 544454 336247 287376 343123 220520 302182
13799 302182 401620 272499 373350 172377 -5332 -213072 105352 148350 -17964 -69936
13789 -69936 -4168 -96527 -160783 -331334 -325480 -425820 -260964 21143 312295 390023 367360
13778 367360 390223 204103 370424 358239 70046 -12397 43316 17793 42353 -66937 -257840
13767b57840J15470J45904q6902l22307r8674K21966L61627J36738o5873n3860
13757I6249n5585K7260j8803j01015j43708Q5637L2429R525j68848J46915J46103
13746E6159j12182j22242l4566O1062j39935j32728P4040L84285j06423r2769
13736a65299p6029r7811k16821N5814K38384J17214R7410j07826j78488R5070
13726b38382O47k66486m0175K79804J08388J23957j85169l48537J63131K05375
13716a97447R0184K45607o6839k15197L09688M06531p1276n00314j49787K78741
13706A29891J84033J36707j62414k6528l0511k24170k61772j80380K04052J94483
13696c6609j29190K4697J2099r3840K22616N9879j36932Q8569l7074k0069J70108
$$ plain form
13767 -257840 -142370 3534 -83368 -405675 -504349 -282383 79244 215982 150109 96249
13757 96249 40664 67924 49121 -51894 -195602 -109965 -77536 -68011 -236859 -89944 56159
13746 56159 -56023 -178265 -212831 -151769 -291704 -424432 -350392 33893 -72530 -165299
13736 -165299 -241328 -339139 -555960 -500146 -261762 -144548 -47138 -154964 -333452 -238382
13726 -238382 -237735 -504221 -544396 -264592 -156204 -32247 -217416 -565953 -402822 -197447
13716 -197447 -107263 138344 71505 -143692 165996 572527 501251 937 -148850 129891
13706 129891 313924 450631 288217 261689 231178 7008 -254764 -435144 -231092 -36609
13696 -36609 -165799 -141102 -129003 -222843 -227 59652 -77280 11289 -25785 -45854 124254
13685A24254k67951k03438J7955J65180p9391k78015J92500K80001k9971j17377
13675a96253j65951J1754j49860j30991J16129R0281N2542M2772J31783J00899
13665i6895l0081m4155J39488L10225p1466k2530k01818k63747Q5537M36332j34416
13654A06474m660N5449n6221J47404k88000k84901O0874K20407Q0666k78799p9239
13643c20546j24797M0605L13852J34108j53523Q2534J33790M3777m1057J20137
13633B28880P0918O5983q1009j07992M8127j30325j8622l0685n9402O3246k48455
13622a99336K72450Q600l50490j18648l5842J0639L7460j12142K03171M72797
13612A88659k0540j43877Q3320j68889k16025J36271j47649J87586K20912j92467
$$ plain form
13685 124254 -143697 -347135 -329180 -164000 -243391 -521406 -328906 -48905 -78876 -196253
13675 -196253 -362204 -350450 -500310 -631301 -515172 -424891 -372349 -329577 -197794 -96895
13665 -96895 -126976 -171131 -31643 278582 207116 184586 -17232 -280979 -195442 240890 106474
13654 106474 101814 157263 101042 248446 -39554 -324455 -263581 -43174 37492 -241307 -320546
13643 -320546 -445343 -404738 -90886 43222 -110301 -27767 106023 149800 108743 228880
13633 228880 299798 365781 284772 176780 224907 94582 75960 45275 -14127 49119 -199336
13622 -199336 73114 81714 -268776 -387424 -423266 -412627 -375167 -487309 -284138 188659
13612 188659 168119 24242 107562 -61327 -277352 -141081 -288730 -101144 119768 -72699
13602g2699R013K62865M33364k47995j35601k68627L679k6744R4238J26622N7762
13591B35877j22628j84186j2496k3382o1319j62777j24062R9640L42837K22251
13581B09755J28749R8328k76182l85J6956l5640o3625k1061J32204m46941O1227
13570a96615K16752R8878j15976P5235J56227J92050j22581k1875m3688j19147
13560A19260j19246K4299J23448j02181R988K18852J12862j20842j31124k28004
13550i2688o0104L05551K69691l7369l01160j42486j95074J73608P6289j78404
13540a82146J34994J42838k37113j43908L3103L62787K71608j52464j55748M28641
13530E02592J37585j04868l63042o7568O8850j47586K7243J57740n3506l09690
$$ plain form
13602 -72699 -63686 199179 632543 384548 248947 -19680 -16001 -42745 51493 178115 235877
13591 235877 113249 -70937 -83433 -106815 -168134 -330911 -454973 -355333 -12496 209755
13581 209755 338504 436832 160650 160265 177221 141581 77956 56895 189099 -257842 -196615
13570 -196615 20137 119015 3039 78274 234501 426551 303970 282095 238407 119260
13560 119260 14 24313 147761 45580 55568 274420 387282 266440 135316 -92688
13550 -92688 -152792 152759 422450 385081 83921 -58565 -253639 -80031 -3742 -182146
13540 -182146 -47152 95686 -141427 -285335 -252232 110555 382163 229699 73951 502592
13530 502592 640177 535309 172267 104699 173549 25963 53206 210946 157440 -152250
13520a52250j8102M7239J62343J44800j65374j71466J82081L39422k63206j3409
13510I2078m16073j40131J80875k14168r2257K23191J24759J74434L50125J53686
13500D36519J28767j80951k76651k3108L789n5917R4057L6737J4199J92528L30038
13489G00007k9278l45368j01798j03094N4275j62003j5111k01207j66223L20678
13479d9122J08621p6392K2277o4546j51099k30503j420K04887J21285R2230L48246
13468C24464k8973r2729J2896k65464k30872J79722L41956L4892j85295J41531
13458B32128J25K37879J76309L25m98586k36857O3977M5708n8810l38093m95936
13447h71831m3986N96521M78700L80136J59980l5318j19845m50960j85018r686
$$ plain form
13520 -152250 -170352 -123113 39230 184030 18656 -152810 29271 368693 105487 92078
13510 92078 -323995 -464126 -283251 -497419 -589676 -366485 -241726 -67292 282833 436519
13500 436519 565286 384335 107684 84576 88365 32448 126505 163242 177441 369969 700007
13489 700007 670729 325361 223563 120469 174744 12741 -2370 -203577 -369800 -49122
13479 -49122 59499 -16893 5384 -59162 -210261 -440764 -442184 -237297 -116012 -23782 324464
13468 324464 295491 202762 215658 -49806 -280678 -100956 241000 275892 90597 232128
13458 232128 232253 470132 646441 646766 148180 -88677 -24700 21008 -37802 -375895 -871831
13447 -871831 -915817 -319296 159404 539540 699520 664202 544357 93397 -91621 -101307
13437a01307O5140J27926J14950R9044K1165j75061k93065k13089k55315K34655
13427c74957K15497J44878j4974l74235k0460J94142J21984R1599j04056j10568
13417b31150j04907K44815J82644k3923J70132k6928j66397Q9016J58609K5760
13407C17671M9265n529k67350K706P0364j1104J2359k97410j94810J82794M9505
13396i1539K06169N6731k9596p9290k38592L40640j14337j32725m2530R6089j38488
13385a67468j02129q3865J09898J88453k53471p0325L4303M2485J66931K32448
13375I7260K12291k1537N8901J80004j8207j17287r9121m36919j87561l3200J2223
13364c53153J28663k382J90993K5036K26203j56022k5831J25997j79279l20958
$$ plain form
13437 -101307 -36167 91759 206709 305753 326918 151857 -141208 -354297 -609612 -374957
13427 -374957 -159460 -14582 -29556 -403791 -424251 -230109 -108125 -16526 -120582 -231150
13417 -231150 -336057 -91242 91402 67479 237611 210683 44286 133302 291911 317671
13407 317671 366936 361407 94057 96763 167127 156023 168382 -129028 -323838 -141044 -91539
13396 -91539 114630 171361 141765 62475 -176117 164523 50186 -82539 -125069 -28980 -167468
13385 -167468 -269597 -353462 -243564 -55111 -308582 -378907 -344604 -302119 -135188 97260
13375 97260 309551 288014 346915 526919 508712 391425 292304 -144615 -332176 -365376 -353153
13364 -353153 -224490 -226872 -35879 -10843 215360 59338 33507 159504 -19775 -340733
13354c40733k8295K71639J63118p0948R1979P6222j48194j32375l1633n1886L7005
13343a64101p8037L91347J58210m48267k66982L08104J47820q8242P2474N1985
13333H4311r6959L2457j58859j21068J60939K65536M3038J20669r9636k27833
13323B595j97167p0197L1083N962O073J4741K3061j62839J54708J35584m7059
13312a03455j37067J26404j04144p1465K6489q5578J65887J44162J07060m6843
13302B1450j89216k05682j68657N473J07060O2325j12489Q3946k22381N608K96658
13291c15905K50637P697o011K12920K17356J65330k9248L9113K01246k47966m2530
13280D52639j78698J58k05032k78351j00001J49126K54841Q0552j54341k56651
$$ plain form
13354 -340733 -369028 -97389 65729 -5219 86760 162982 14788 -117587 -149220 -201106 -164101
13343 -164101 -242138 149209 307419 -140848 -407830 -99726 48094 -40148 32326 84311
13333 84311 -12648 19809 -139050 -260118 -99179 166357 209395 330064 230428 2595
13323 2595 -194572 -264769 -233686 -227724 -221651 -206910 -183849 -346688 -191980 -56396 -103455
13312 -103455 -240522 -114118 -218262 -289727 -263238 -348816 -182929 -38767 68293 21450
13302 21450 -167766 -373448 -542105 -536632 -429572 -367247 -479736 -395790 -618171 -612563 -315905
13291 -315905 -65268 -57571 -63582 149338 366694 532024 502776 541889 743135 495169 452639
13280 452639 273941 274099 69067 -209284 -309285 -160159 94682 175234 20893 -235758
13270b35758j1106J51383J35198j52154l9104j9421l2624K29481m9534L13230
13260B89591k397J83590R865K2305p2194N7581k69080l33672j66924L5263J94376
13249e1696j21476k94734q5338K59306L89831N1428m1685j07421j78630N1876
13239a28539k8775J53195j14312j70324J97889J30312k00850K16831J41124K53153
13229D49704k85636Q1097J80697K03322j05969l51044j75752N0038P1298j26360
13219h605k07335p3233K9151j900J60085L37530j63949k24934M6776Q837k0467
13208a18044K73802N22936J90086o3368j95786j62666m1576l05186j9441J578
13198H2335q9573J04863k37798K3084k0590R0477J73913J88354J19600J13986
$$ plain form
13270 -235758 -246864 -95481 39717 -112437 -151541 -170962 -203586 25895 -23639 289591
13260 289591 287194 470784 480649 502954 430760 488341 219261 -114411 -281335 -246072 -51696
13249 -51696 -173172 -467906 -553244 -293938 95893 147321 105636 -1785 -180415 -128539
13239 -128539 -157314 -4119 -118431 -288755 -90866 39446 -161404 55427 196551 449704
13229 449704 164068 245165 425862 629184 523215 172171 -3581 46457 117755 -8605
13219 -8605 -215940 -289173 -260022 -261922 -101837 235693 71744 -153190 -106414 -97577 -118044
13208 -118044 155758 678694 868780 805412 609626 446960 405384 100198 80757 82335
13198 82335 -7238 97625 -140173 -117089 -137679 -47202 126711 315065 434665 548651
13188E48651j86946j51170J19593k33574n4948J28832O6351J95455j63851k65034
13178C359j64078j76907L48451J82713K95459k40853o6857J4745R8520O9695r124
13167C55123M5895j45441j41230L1179K1148L5204r5292q0340n0585K8763R8838
13156A03262O4250o6267k7710J14830Q3637q5102J46582J04242j79805k4034m6303
13145A87582K2267L8780l8536j39816j35272R4235J90637j18240K1204j6233J36741
13134B43349k4259j71349j08870J51929j48316j20925L96891J21035J07788j32368
13124C14905o2515j87316L2226O7113q0526N3889q1266j5456j91710L3868K23592
13113A06804O7079o7849K8474K40285K4446p5226k82299j25272R997L3897J10212
$$ plain form
13188 548651 361705 210535 330128 96554 41606 170438 236789 432244 268393 3359
13178 3359 -160719 -337626 10825 193538 488997 248144 181287 196032 294552 364247 355123
13167 355123 401018 255577 114347 145526 166674 201878 106586 26246 -24339 4424 103262
13156 103262 167512 101245 73535 188365 272002 186900 333482 437724 257919 233885 187582
13145 187582 209849 248629 210093 70277 -64995 29240 219877 101637 122841 106608 243349
13134 243349 219090 47741 -61129 90800 -57516 -178441 218450 339485 447273 314905
13124 314905 252390 65074 97300 164413 83887 137776 56510 41054 -150656 -116788 106804
13113 106804 173883 106034 134508 374793 399239 324013 41714 -83558 -73561 -39664 70548
13102G0548R6913J23878K37626j22146j23532r9554k0454j35762J9310j65K60702
13091C07364J15380o4206m4930j44709J34960l3842r9384O5541k4188J1697n9481
13080A64202M0091n2550J73777O4854r8068k03860J88894J15755q9960K0256n7291
13069B66100M3845q9540j67112L8654O8070K8566j2425j90424J03104M9843k9727
13058A08954N3306J31659N4526l80825k3601M13810K45244p5160l46051L0606
13048B12468O4590q8284q9629O7148L93778K73484j7925j65308k88352j42436
13038B19534k02803j30642K70355J30831K40254Q3611k79819m1716J04129j17095
13028B76639j29616o5335j01976O4403p6516K2570K71326K29809q7119J79252
$$ plain form
13102 70548 167461 291339 528965 406819 283287 183733 163279 27517 46827 46662 307364
13091 307364 422744 358538 313608 168899 303859 270017 170633 236174 211986 223683 164202
13080 164202 204293 151743 325520 390374 292306 88446 277340 393095 303135 323391 266100
13069 266100 309945 220405 53293 91947 160017 188583 176158 -14266 88838 138681 108954
13058 108954 162260 293919 348445 -32380 -55981 357829 603073 527913 181862 212468
13048 212468 277058 188774 99145 166293 560071 833555 815630 650322 361970 219534
13038 219534 16731 -113911 156444 287275 527529 611140 331321 289605 393734 276639
13028 276639 147023 81688 -20288 44115 -32401 -9831 261495 491304 404185 583437
13018E83437j16143k68536j27063j74267k02425J63880J97288j18081J19833q6217
13008b8294q7424L1782R8591M0762j5164q5017j0343q483J62540O5945j36537
12997B8358l2557k03527j67474J00020M91864L688Q9772M15272j57430m09788
12987A58198l44816O6356J92770j93487k35599p2565j6217r2928J65283j4934
12977c87939j32913K11110P0965j28779L64267J37136k7793J35963J60812m7062
12967C55767l4577j38438p1763j04062k1993J18100J92386K02826j14864j21044
12957B62338M194m6153j87015o7387J56299K2487q902o6439j92889j01845O610
12946b18702j8326N4902Q516r4055J33444r7574K8414K00249M1801m394J97514
$$ plain form
13018 583437 467294 198758 71695 -102572 -304997 -141117 56171 -61910 57923 -28294
13008 -28294 -115718 -83936 14655 55417 40253 -44764 -55107 -63590 98950 164895 28358
12997 28358 -4199 -207726 -375200 -275180 216684 220372 310144 725416 567986 158198
12987 158198 -186618 -120262 72508 -120979 -356578 -429143 -445360 -538288 -373005 -387939
12977 -387939 -520852 -309742 -238777 -367556 -3289 133847 106054 242017 402829 355767
12967 355767 321190 182752 110989 6927 -15066 103034 295420 498246 383382 262338
12957 262338 266532 220379 33364 -34023 122276 144763 135861 69422 -123467 -225312 -218702
12946 -218702 -237028 -182126 -173610 -267665 -134221 -231795 -203381 -3132 38669 34275 231789
12935B31789J6889M9347K67301k8498O6227k412k50672m22094k7433k23820l2237
12924c55613r0797N6433J53744K21043j31700j78282j19903L60438K8002k39054
12914b95689j33819J82353J56018J5292k0054J37925j21050m5233k48773j0308
12904c83338p7213j08387k41308K14611L95191K60362J78550l80133j27810o981
12894b76456K535K99996k57818j16767o7488R2786J81786J98612j04001k16644
12884b63459K54918Q7410p0928j21078J23206J11766j64346k81619K40758J5339
12874f8033m09186m439L44724J75493l6424L3631L5780L767J54874K73626K74393
12863G78206j07941l34832p0462K24191l50203k98052j36132P0340J15255N1951
$$ plain form
12935 231789 248678 298025 565326 536828 603055 600643 349971 -72123 -99556 -323376 -355613
12924 -355613 -446410 -389977 -236233 -15190 -146890 -325172 -445075 -84637 -56635 -295689
12914 -295689 -429508 -247155 -91137 -75845 -95899 42026 -79024 -124257 -373030 -383338
12904 -383338 -460551 -568938 -810246 -595635 -200444 59918 238468 -141665 -269475 -276456
12894 -276456 -273921 26075 -231743 -348510 -415998 -323212 -141426 57186 -46815 -263459
12884 -263459 -8541 78869 7941 -113137 10069 121835 -42511 -324130 -83372 -68033
12874 -68033 -477219 -481658 -136934 38559 2135 35766 71546 75313 230187 503813 778206
12863 778206 670265 335433 264971 489162 138959 -159093 -295225 -224885 -109630 -57679
12853e7679l4707k62724R8200J09058q3195j57397J77003N51273m8503K7898J4819
12842C34046k08190k77324o1904J94256J61581l03304l25522K07943K78853k8222
12832b7787J35079J38728j40845J27853o4954Q1360n2709j50419j69118J46902
12822B4090K22231k99664j09821J37598K1359K05878Q5868j47165J20228J43029
12812D03631Q5553O2475l21676k25962J16612J87796k35817J58244n8833J17129
12802B89152k5782j08272R030r9214j9304K23842p2908J48248L0432J29807j28190
12791C76841j98313K7682j37616j76385j75348P2522J10960q015Q1832L03075
12781B77235q0529k87485q2006J44175J93435p3470k40461o5187N5874J7048J18139
$$ plain form
12853 -57679 -92386 -355110 -256910 -147852 -231047 -388444 -211441 339832 291329 319227 334046
12842 334046 125856 -151468 -213372 -19116 142465 -160839 -486361 -278418 435 -27787
12832 -27787 107292 246020 105175 233028 168074 249434 196725 46306 -122812 24090
12822 24090 246321 -53343 -163164 -25566 -4207 201671 287539 140374 260602 403631
12812 403631 489184 551659 229983 4021 120633 308429 72612 230856 172023 289152
12802 289152 263370 155098 164128 64914 45610 269452 196544 344792 375224 505031 376841
12791 376841 178528 206210 68594 -107791 -283139 -210617 -99657 -107672 -25840 277235
12781 277235 196706 -90779 -172785 -28610 164825 91355 -149106 -214293 -158419 -141371 -23232
12770b3232q8569R0967J20327L55854j05626k3855o9900j64207J80056J78032
12760D49847j07938j421j55936k58267O3463J90582j30862J22921Q6117l9529
12750B18977j96912m5796m18653r8802K05087K70249j10733j99896o9316r6344
12740e42139J01695K4564j64483K68650J82348K22849n8782j08885k5287p344
12730a06814J27183J92810J71690o0022J46510p9846k39652J67873L00039n8405
12720E61366k57486q0077l4334K86367J11816r6435j87354q3725m470j32964j88448
12709a05744O331k93010j74018M7517M31779M41238K37732k19490k57361j14519
12699D55L5878N4305N561J34182O675k3587p2269m1005K941J96232j4292p5238
$$ plain form
12770 -23232 -111801 -20834 99493 455347 349721 325866 255966 91759 271815 449847
12760 449847 341909 340488 184552 -73715 -10252 180330 49468 172389 258506 218977
12750 218977 22065 -23731 -442384 -541186 -336099 -65850 -176583 -376479 -445795 -542139
12740 -542139 -440444 -415880 -580363 -311713 -129365 93484 34702 -74183 -99470 -106814
12730 -106814 20369 213179 384869 324847 471357 391511 151859 319732 619771 561366
12720 561366 303880 223803 189469 475836 587652 491217 303863 220138 215668 82704 -105744
12709 -105744 -99413 -392423 -566441 -518924 -87145 354093 591825 372335 114974 455
12699 455 36333 90638 96199 230381 237056 213469 141200 100195 103136 299368 285076 209838
12687B09838l02288l26778J2766M76251J12733j76006K66026J37926l20156k71221
12677a80909n9246K27848J34420j02198L4783J76075J51504j54870J53614j19203
12667B61818o2557L0804m9751K7068j13977M58l8792R9856J4595n0056q5232m5441
12655a1207j0464J60268m9573j19313J53596n8968J54001J18714P739p1585J60659
12644D33867K32264k06649j88891j36086K5235m708K97645K37139k52641j86015
12634B51160L12890J71877j97947m23399r1972j00735j16974o7808R662K55197
12624A951N6378J45928L1788q1134J18855K45107J28689j53760k64551l0893O2541
12613B60899J08758M7211P0609K59852K31947k58304j28505j97793J9304k68720
$$ plain form
12687 209838 -92450 -419228 -406462 69789 182522 6516 272542 410468 90312 -180909
12677 -180909 -240155 -12307 122113 19915 54698 230773 382277 227407 381021 261818
12667 261818 199261 230065 180314 207382 93405 93863 55071 154927 169522 119466 34234 -11207
12655 -11207 -21671 138597 89024 -30289 123307 64339 218340 337054 344793 273208 433867
12644 433867 666131 459482 270591 134505 159740 155032 452677 689816 437175 251160
12634 251160 564050 735927 537980 114581 22609 -78126 -195100 -262908 -253246 1951
12624 1951 58329 204257 236045 154911 273766 518873 647562 493802 229251 198358 260899
12613 260899 369657 416868 487477 747329 979276 720972 592467 394674 413978 145258
12603A45258J0515j24311l1752m6883k61459k72513j74492J75656l0500K78841
12593c31640K81558L8477p8529K02840j21034l64336l916N45377L9132k87930
12583h0001r9184K55719K83561j50082n8052l9887o5292J15521K4316j60891r1230
12572f5502J38372J69252n7581J4497J96626O8174R5147J3704r4631k04324K75484
12561E49218j29930k88790L4649P3096k03550l47370p1440L73766K44689N3091
12551B87429Q4885O4262j90154L8285n4756l6463q7638r120o8670j92660k37607
12540d02207K27386K75677K05657p9214k830M2940K3031J3751m28590k35395L0828
12529c28966N4115j42020J94183J14577M700J47475N9961R5403k47647k38555
$$ plain form
12603 145258 155773 31462 -290 -47173 -308632 -581145 -755637 -579981 -610481 -331640
12593 -331640 -50082 -11605 -90134 112706 -8328 -372664 -376580 168797 207929 -80001
12583 -80001 -179185 76534 360095 210013 151961 112074 46782 162303 186619 25728 -65502
12572 -65502 72870 242122 184541 199038 395664 463838 558985 572689 478058 273734 549218
12561 549218 419288 130498 165147 238243 34693 -312677 -384117 -10351 234338 287429
12551 287429 372314 436576 246422 284707 229951 193488 105850 96730 28060 -164600 -402207
12540 -402207 -174821 100856 306513 227299 224469 267409 290440 304191 -124399 -359794 -328966
12529 -328966 -274851 -416871 -222688 -108111 -103411 44064 104025 199428 -48219 -286774
12519b86774N7910J38135K83273j32546N3198P6737k60335K7417L04595K74721
12509E36331j05067j31786J14982K9516p293m5155j38968Q7412p9269R341J09327
12498C79371O2081l29571j01722J58077k1092L5007Q3839k4414o5872Q4040o539
12487B53205j4311o413J58114O9166J00250N7828k43497l13214Q238J25204R0467
12476B85037J46671R037j40770L9529j47252j22309K7491K41797p4351k49494
12466A5386O7626J57388J02975j4758J42467o8040l78670l8189M30588J49208
12456E65981o1268k39181p7135j59681K2710n966n9826L43097J02644k5247K06269
12445F12397K86018L0476k26014r8704k36610l52482j25174n3377J41269L49941
$$ plain form
12519 -286774 -228864 -90729 192544 59998 113196 189933 -70402 -42985 261610 536331
12509 536331 431264 299478 414460 443976 436683 391528 252560 339972 260703 270044 379371
12498 379371 441452 111881 10159 168236 147144 182151 265990 241576 175704 259744 253205
12487 253205 238894 232481 390595 459761 560011 617839 374342 61128 69366 194570 285037
12476 285037 431708 440745 299975 339504 192252 69943 97434 339231 264880 15386
12466 15386 83012 240400 343375 328617 471084 403044 24374 -13815 416773 565981
12456 565981 504713 265532 188397 28716 51426 45460 -14366 328731 431375 406128 612397
12445 612397 898415 928891 702877 604173 367563 15081 -110093 -163470 -22201 327740
12435C27740m2940k71589o3347M04293J31554K4402q2712K63859k70653j08376
12425C12231J98746J6806j76513j46035j64597j07107k710K67882J08211J26209
12415D33123J16256j96085j21275j50537l45338M4795K18318L07982K73818j5477
12405E65580J45199j967j01044l05156j82699j72247o6106K23501K65390k7591
12395C42860K65534K17212j04036m39215j48312q2315J22123K88550Q4717j27635
12385D19483J99408l029N6876j48202p9286P233j06804K8642p8356O7693j72819
12374A90839J28880J87592j49473J6158P0409r9181q8180J5288m237J2279J631
12363B82005j67427O9343J66254K26797N8538l6354j87995j17923K30106p4719
$$ plain form
12435 327740 284800 13211 -50136 354157 485711 510113 427401 691260 420607 312231
12425 312231 510977 527783 351270 205235 40638 -66469 -69179 198703 306914 433123
12415 433123 549379 353294 232019 81482 -263856 -219061 -743 307239 581057 565580
12405 565580 710779 708812 607768 302612 119913 -52334 -118440 105061 370451 342860
12395 342860 608394 825606 721570 282355 134043 51728 173851 462401 547118 419483
12385 419483 618891 615862 672738 524536 445250 452483 345679 374321 295965 363658 190839
12374 190839 319719 507311 357838 373996 444405 345224 257044 272332 268095 280374 282005
12363 282005 114578 183921 350175 576972 635510 599156 411161 293238 523344 448625
12353D48625k93866k33846J55184J81625p6144j400j5836k09022N707J99039K52761
12342D12827j53371j29708n2641K50932J8227J59161J51829j3504o6188j60749
12332D16815k98253K50448l086N1383j74896l7168J96884J2416J68522K07484
12322G90549M8092k09348n33323k13191L41181K44912J3977m23975j83023K92338
12312A68189M83593j9911j50751j46131L9041L22962M7409j35586J17662J29480
12302H55957k41025l1373j28549O7703J36288j65230j21491K0206K06312q7321
12292E11477k26435K77259K29980j08597l23189j78874J45432j40978j31006K59431
12282C14500K86167j34647J22544k34496N191k8429O26889J36892j48432j85496
$$ plain form
12353 448625 154759 -79087 76097 257722 181578 180178 164342 -44680 -38973 160066 412827
12342 412827 259456 129748 77107 328039 346266 505427 657256 643752 577564 416815
12332 416815 118562 369010 365924 417307 242411 205243 402127 414543 583065 790549
12322 790549 838641 629293 95970 -117221 223960 468872 482849 58874 -124149 168189
12312 168189 651782 631871 481120 334989 374030 696992 744401 608815 726477 855957
12302 855957 614932 583559 455010 522713 659001 493771 372280 392486 598798 511477
12292 511477 285042 562301 792281 683684 360495 181621 327053 186075 55069 314500
12282 314500 600667 466020 588564 354068 359259 330830 957719 1094611 946179 760683
12272G60683q6085j8330k78911m1827j02721j08516K61480K12589J62605m9511
12262G11456j66882j12337K64679J76141k36299k58088p284o7222m0950K96730
12252E59944K84338J75863J33230k82712j73467j62607j92069K69806l2018o0250
12242E20058J75491r686P1415k3555Q5999M22451k6535m25381k96714R5157K32271
12231H20971J70036j50130j58094j6989M60J29865R5160l67659J02390K72476
12221H98486k91470j98357O635N0363R5153J96538K2947j4516K26696n2882j02046
12210H37547j11925j18778K45950n7419O0044L47889K12693p5978q4886K1483
12200A276620l1893J16272M8557m96621N4458L15848P6061Q684k26087m62100
$$ plain form
12272 760683 674598 656268 377357 335530 232809 124293 385773 598362 760967 711456
12262 711456 544574 432237 696916 873057 636758 378670 371386 304164 263214 559944
12252 559944 844282 1020145 1153375 870663 697196 534589 342520 612326 580308 520058
12242 520058 695549 685863 757278 733723 819722 1242173 1215638 790257 493543 588700 820971
12231 820971 991007 840877 682783 665794 666254 796119 891279 523620 626010 898486
12221 898486 607016 408659 415294 465657 560810 757348 780295 765779 992475 939593 837547
12210 837547 725622 606844 852794 795375 855419 1203308 1416001 1340023 1255137 1276620
12200 1276620 1244727 1360999 1409556 912935 967393 1283241 1359302 1367986 1141899 679799
12190F79799k17223k18912J2586K14739K90656L74109R3604j90475l14959L6720
12180G60644J52547l0830O856N4777J29364K62401j71682Q8755j4204J972q3847
12169A156753K52663J16546k39623l10160j1525K75477L39853K12711k46877j36774
12159A409044O9688M0775l3276j7115m2927J3018q6790p8581Q1438l6208l28657
12148I90409J60673K40399n5024j00778l5534o2232l2326j76557p1141n7082N9350
12137H60157p2157p31L03289K56743L35272R4600j3318j96982j48763J79665L55787
12126A953562P0882j12569m0714n7719j38914J18043j53230r7120K38371J39171
12116A919763j11315j34020K84662o9181j04278K18608N5729k33743k19294j38208
$$ plain form
12190 679799 462576 243664 256250 470989 761645 1135754 1229358 1038883 723924 760644
12180 760644 913191 882361 889217 943994 1073358 1335759 1164077 1252832 1238628 1240600 1156753
12169 1156753 1409416 1525962 1286339 976179 964654 1240131 1579984 1792695 1545818 1409044
12159 1409044 1478732 1519507 1486231 1469116 1426189 1439207 1352417 1273836 1355274 1319066 990409
12148 990409 1151082 1391481 1336457 1235679 1200145 1137913 1105587 929030 857889 800807 860157
12137 860157 788000 787269 1090558 1347301 1682573 1777173 1763855 1566873 1418110 1597775 1953562
12126 1953562 2024444 1911875 1871161 1813442 1674528 1792571 1639341 1542221 1780592 1919763
12116 1919763 1808448 1674428 1959090 1889909 1785631 2004239 2059968 1826225 1606931 1468723
12106A468723Q6213o6092O4167L81136K05759p9355K0904k18657j3641J10873
12096A960030p6754j30203j42324J34577J03451K9454q034K52242J58278l6994
12086B243723o9698j02736K82606K36691P5977P1118p6456j91984J46023j27028
12076B488236L7998J59642J53847k23561p1083J4536q4183K1853L15593L99265
12066C212143K25060k27896k45690q6183Q2920K5849n3483J19211L53578P2804
12056C478313O1004M0565j0625J12623q8732L90238O27785k61304j77667j98689
12046C973511j98372m5678j81464N0920L15310K74570K25695J57914k15619Q086
12036D364873P7254J37656K5801K22145L4695p70J99314L22824K05661L0408k49633
$$ plain form
12106 1468723 1554936 1488844 1553011 1934147 2139906 2060551 2081455 1862798 1849157 1960030
12096 1960030 1883276 1753073 1610749 1745326 1848777 1878231 1870197 2122439 2280717 2243723
12086 2243723 2174025 2071289 2353895 2590586 2666563 2737681 2661225 2469241 2615264 2488236
12076 2488236 2526234 2685876 2839723 2616162 2545079 2559615 2475432 2497285 2812878 3212143
12066 3212143 3437203 3209307 2963617 2877434 2960354 2986203 2932720 3051931 3405509 3478313
12056 3478313 3539317 3579882 3569257 3681880 3593148 3983386 4611171 4349867 4172200 3973511
12046 3973511 3775139 3729461 3547997 3598917 3914227 4188797 4414492 4572406 4356787 4364873
12036 4364873 4442127 4579783 4605584 4827729 4862424 4861654 5060968 5383792 5589453 5619861 5370228
12025E370228M7537M60658k30743M3848L53888L14641j15098k36157J62150M47016
12015F617968K20098K33435r088r7711J48150M26952J77849K56990K70348l3304
12005H211687O9284K9828J95598K52095K40253K20716L03775J53050M43178J85940
11995A0305404O3057K60014J17329L22870L77125K08546L39271M03938O40640
11986A3038194K03862J60098M01653M11313L32103M82394P65764N15421L47893
11977A6658695M03276M21062L07344M24538N51842P39763N90643N39787N56202
11968B1193152O78042Q26119Q73405J172976Q15893M29043N37549P70149R68529
11959B8264857J006980P40693O27382R57944J294420J477842J141999J204878
$$ plain form
12025 5370228 5417765 5878423 5647680 5691528 6045416 6360057 6244959 6008802 6170952 6617968
12015 6617968 6838066 7071501 7062413 6964702 7112852 7539804 7717653 7974643 8244991 8211687
12005 8211687 8280971 8310799 8506397 8758492 8998745 9219461 9523236 9676286 10119464 10305404
11995 10305404 10368461 10628475 10745804 11068674 11445799 11654345 11993616 12397554 13038194
11986 13038194 13242056 13402154 13803807 14215120 14547223 15029617 15795381 16310802 16658695
11977 16658695 17061971 17483033 17790377 18214915 18766757 19506520 20097163 20636950 21193152
11968 21193152 21871194 22697313 23570718 24743694 25559587 25988630 26526179 27296328 28264857
11959 28264857 29271837 30012530 30639912 31597856 32892276 34370118 35512117 36716995
11951C6716995J323606J383471J412333J397859J003271J426080J531001J210944
11943D7405560J367033J388501J397265J321446J428450J694229J150079J095395
11935E8247958J315880J336417J221679R79183J039435P73304Q05234P44714K59531
11926F6723335M80004K70244n5126j16845l03310l79879m92587n48578o11990
11917F4965268p45148j160023j159967j149887j176335j459784j218549r47385
11909E5948190j261594j611126j494819j800308j264513j283366j777455j250066
11901D4204943r18251j373070j347115j204814j199599q59782j172486j303031
11893C4826795j120479r75947r71514q53925j144082j179994q95651n08013j121135
$$ plain form
11951 36716995 38040601 39424072 40836405 42234264 43237535 44663615 46194616 47405560
11943 47405560 48772593 50161094 51558359 52879805 54308255 56002484 57152563 58247958
11935 58247958 59563838 60900255 62121934 63101117 64140552 64913856 65719090 66463804 66723335
11926 66723335 67203339 67473583 67418457 67301612 66998302 66618423 66125836 65577258 64965268
11917 64965268 64220120 63060097 61900130 60750243 59573908 58114124 56895575 55948190
11909 55948190 54686596 53075470 51580651 49780343 48515830 47232464 45455009 44204943
11901 44204943 43286692 41913622 40566507 39361693 38162094 37302312 36129826 34826795
11893 34826795 33706316 32730369 31758855 30904930 29760848 28580854 27685203 27177190 26056055
11884B6056055j054839o13882o59700p51192j055134o93800k90492l50275r59890
11875A9626851n29996k27320l93226m51955q66308m52489l39630m60484p01513
11866A5203930m21241k32031m45236k31643l47358m10264p02344n06138m9000
11857A1858675k29022p3497L9454n18674l80958l41317n2223l38989j87973L8587
11847I814063j61164j92514n59977m33935k12101o1686J72991P4236m14898k94358
11837G730657j15837j17998o5995R3790k01985m21523l65613k12702j74565P548
11827F155777L3882q0424k09700M1586k20555n5788k40451k50738j0014J51430
11817E315005j39619j63438j08862j94217m54118k70251k19638K11487J30984
$$ plain form
11884 26056055 25001216 24387334 23727634 22976442 21921308 21227508 20937016 20586741 19626851
11875 19626851 19096855 18869535 18476309 18024354 17158046 16705557 16365927 15905443 15203930
11866 15203930 14782689 14550658 14105422 13873779 13526421 13116157 12413813 11907675 11858675
11857 11858675 11629653 11556156 11595610 11076936 10695978 10354661 10302438 9963449 9775476 9814063
11847 9814063 9652899 9460385 8900408 8466473 8254372 8192686 8365677 8439913 8025015 7730657
11837 7730657 7614820 7496822 7430827 7524617 7322632 6901109 6535496 6322794 6148229 6155777
11827 6155777 6189659 6109235 5899535 5941121 5720566 5664778 5424327 5173589 5163575 5315005
11817 5315005 5175386 5011948 4903086 4708869 4254751 3984500 3764862 3976349 4107333
11808D107333l3114P3490L1020L25347m0759r1658N0889j59284j474k597M5705
11797D304898k62182k71901L9911K700k46069l17200j26723j00466m2693J0889
11787B991164j16546J48236j941R516L7730J58600P8776k04957j96633j35661
11777B768284l8673O88k52349k00453K25197L9959p2894k42272k81786m1262K0335
11766A924774K31254l8937Q6742K06898o5199j66780p9651L4518O3945P5497q4806
11755B188255j10867j12514k66234L3055K37862P7132K7033M9732j80172J4315
11745A957597k16298k6633M4260P4793J57999j93889j17840K31401j3770j26506
11735A771114k99136q5732q1271k949N5767l41253j53964J90032J37095q7882
$$ plain form
11808 4107333 4074219 4147709 4178729 4504076 4463317 4371659 4422548 4263264 4261790 4259193 4304898
11797 4304898 4042716 3770815 3810726 3813426 3567357 3250157 3123434 3022968 2980275 2991164
11787 2991164 2874618 3022854 3020913 3030429 3068159 3226759 3305535 3100578 2903945 2768284
11777 2768284 2729611 2730299 2477950 2277497 2502694 2542653 2469759 2227487 1945701 1904439 1924774
11766 1924774 2156028 2117091 2203833 2410731 2345532 2178752 2099101 2133619 2197564 2273061 2188255
11755 2188255 2077388 1964874 1698640 1731695 1969557 2046689 2073722 2123454 1943282 1957597
11745 1957597 1741299 1714666 1758926 1833719 1991718 1797829 1679989 1911390 1897620 1771114
11735 1771114 1471978 1386246 1304975 1302026 1357793 1016540 862576 1052608 1189703 1101821
11725A101821m3869N4210K49112J59970o3406J18492J02708N2024p8634J80454
11715A832882p2808j51756r4263j84138k56474j09453J583J77806J42827j39636
11705A146570p316q3554j61933J49031L12351O7038j8667j65485n1888k27702
11695I58445R2804J81698J60256P1535k59165k44791l39791K79554J55719K8830
11685A085094p4648j25626l98750j33594M60419K1234j16995L87371R8650J5944
11675A219099l21907M2536P7782j38687k08628K34r9109R3038K97448K50160N7578
11664A269544m219o2051j22673O932q759j35882n1788N8529r2289n9548K12172
11653A009968J0715r6793J8171k5023j32394K6731L7995J8926j75900j15952J48509
$$ plain form
11725 1101821 1057952 1112162 1361274 1521244 1457838 1576330 1679038 1731062 1652428 1832882
11715 1832882 1760074 1608318 1514055 1329917 1073443 963990 965573 1143379 1286206 1146570
11705 1146570 1139254 1055700 893767 1042798 1355149 1422187 1403520 1238035 1186147 958445
11695 958445 1051249 1232947 1393203 1464738 1205573 960782 620991 900545 1056264 1085094
11685 1085094 1010446 884820 486070 352476 812895 834129 717134 1104505 1203155 1219099
11675 1219099 897192 939728 1017510 878823 670195 670429 571320 664358 961806 1211966 1269544
11664 1269544 1265325 1203274 1080601 1087533 1078774 942892 891104 949633 857344 797796 1009968
11653 1009968 1020683 923890 942061 917038 784644 811375 849370 868296 692396 576444 724953
11642G24953L6094k51578M0656m1727j81041L4669J34089K8028K9243K79983L29567
11631A162936M903j68988l7678j9363p8632j56501l43273k02246M5729R6614K87892
11620E91393J88933m7339l34268Q2767J73397j23538M1253Q5622R8564K1619r0245
11609F88158J6507j18284Q0628o5842k616J38238l11363j065J52462m6131K5439
11598E56131j3999J77228Q9051M0051J22781j12766J28173J59410k3536R1568
11588A214092l47664m26380k05818j08314j11291J64906L62392L30314J97114
11579A069351k55419k48553J0543L87876K9903k10918j78640k60249j96420Q0203
11569B27677R1107K30601J17060k6285k6848Q3906j45912R9473l40435j89786
$$ plain form
11642 724953 761047 509469 550125 508398 327357 362026 496115 524143 553386 833369 1162936
11631 1162936 1167839 998851 961173 941810 863178 706677 363404 161158 206887 303501 591393
11620 591393 780326 732987 398719 481486 654883 531345 572598 658220 756784 778403 688158
11609 688158 704665 586381 667009 601167 598551 736789 425426 424361 576823 530692 556131
11598 556131 542132 719360 808411 848462 971243 858477 986650 1146060 1122524 1214092
11588 1214092 866428 440048 234230 125916 14625 179531 541923 872237 1069351
11579 1069351 813932 565379 575922 963798 993701 782783 604143 343894 147474 227677
11569 227677 318784 549385 666445 640160 613312 697218 551306 650779 310344 120558
11559A20558K71268K80569l1233k56097q5394j48529J13422k1137J17295N3428
11549D14150j7939L63782J04105K76561j10951m64443k91669o4663q8099L35599
11539D56433J04543P2005J36521r7300j40176l27775J19487P4334O3178p4201
11529C87049k4133n6905k87435k05055K76401L08307R2438k6290L5935L22216
11519H22528J55308k09440k62896j50473J51803r5746k6102J34175q8218m54437
11509b3498r4761J67424K23629k7423N8863L08885k54558o09269J75623L08815
11499B33730k02907J30415j26599N489J40288K34511Q4240k09767k3161j42637
11489A23602m9060j85582P6714J88577K60379j11383N8763j79024J00961K64640
$$ plain form
11559 120558 391826 672395 641162 385065 299671 151142 264564 243427 360722 414150
11549 414150 396211 759993 864098 1140659 1029708 565265 273596 208933 120834 456433
11539 456433 560976 632981 769502 672202 532026 204251 323738 398072 461250 387049
11529 387049 362916 306011 18576 -186479 89922 398229 490667 464377 500312 822528
11519 822528 977836 768396 505500 355027 506830 411084 384982 519157 430939 -23498
11509 -23498 -118259 49165 272794 245371 304234 613119 358561 -250708 -75085 233730
11499 233730 30823 161238 34639 40128 180416 414927 499167 289400 266239 123602
11489 123602 74542 -111040 -34326 154251 414630 303247 362010 182986 283947 548587
11479E48587j15279Q7886J04954j89873p6225k4189j72375l85245k15427K46203
11469a90983R0733p041R1787Q6381J02551Q8168r735l33897k9334J59255K70665
11458C18550J36137J18360Q2545n9837k60371j74352J68162J04496k31483j94057
11448H150j97208K04782J96130k1787j02807O4036m3916l9454K71993R5360J20497
11437E55776p6108l14937L6370J06972L4142k35140m2616M1585q0214o8918m4213
11426h7301J68585K49303Q1163p1933q6064j55178j6469j41434p5342P6929K77898
11415B20157k95656j89824J07717j3860N7143o8553k91283J89107L67559K28490
11405C10997j24730k17849P7660j24634O2151K1463J88484K11995m0768j89448
$$ plain form
11479 548587 433308 521194 626148 436275 360050 335861 163486 -221759 -437186 -190983
11469 -190983 -100250 -107291 -15504 70877 173428 261596 251861 -82036 -111370 47885 318550
11458 318550 454687 573047 655592 595755 335384 161032 329194 433690 202207 8150
11448 8150 -189058 15724 211854 190067 87260 151296 107380 67926 339919 435279 555776
11437 555776 479668 164731 201101 308073 342215 107075 64459 106044 25830 -43088 -87301
11426 -87301 81284 330587 411750 339817 253753 98575 82106 -59328 -134670 -57741 220157
11415 220157 -75499 -265323 -157606 -171466 -114323 -182876 -474159 -285052 82507 310997
11405 310997 186267 -31582 46078 -78556 -16405 5058 193542 405537 364769 175321
11395A75321j09262Q118J37673p48j09417J32991J50420J9721J10714m0253j57657
11384C17621M2779R5346o3542k4772r86N1210L13078j96498j03204l3784n7649
11373C39599k2952J15505K6313N675l24713k82825J91889J16027R8944j57880
11363A05582k26607k9155L20487J86294k0416j15478j72538k13107j20702R2079
11353a93561P3267r3130Q3855N4887Q9623m4410q2968k28667j7132K71764L02428
11342B15956M4310j05136k62365K28023J98542j59930K2780o3097k5810k23557
11332a30284J06138J15339o8720K9168K25661J3866J32066J87500q1410J0043
11322E39367q6091k60543j22325m9805K14794K41125j80361m2249L7945j51637
$$ plain form
11395 175321 66059 74177 211850 211102 101685 234676 385096 404817 515531 475278 317621
11384 317621 360400 455746 392204 367432 366446 417656 730734 534236 431032 397248 339599
11373 339599 316647 432152 458465 464140 139427 -143398 48491 164518 263462 105582
11363 105582 -121025 -150180 170307 356601 336185 220707 48169 -164938 -285640 -193561
11353 -193561 -120294 -213424 -129569 -74682 14941 -29469 -112437 -341104 -358236 -86472 215956
11342 215956 260266 155130 -107235 120788 319330 159400 182180 119083 93273 -130284
11332 -130284 -24146 91193 22473 51641 277302 291168 423234 610734 529324 539367
11322 539367 453276 192733 70408 20603 235397 476522 296161 253912 291857 140220
11312A40220k73174j43394J70429j49109J69080k73382q9092L08762K48349l10927
11302b02238o7575j15291K3688K27034K94804K69484r5489J1594o0843j48595
11292A36573k92430K22358K24163k49320k10806J11066K21195J27990J5649j55879
11282A50559k9841p1172J16175K40207j95557j32913M3986M55147Q4119k40974
11272D19736j02268j31143j21134j8148K35747J93961j91648j03437J29670j32716
11262A78620j42237J34608J01572l0317j72383K10074K2856R8459o7480L9564
11252C73336j43147j73897k9594N9835k5708J8635k44921K44102M59320j62748
11242C75213k49170k9549L7280K50253J00845j09043l41927n3617R7701K26078
$$ plain form
11312 140220 -132954 -276348 -105919 -255028 -85948 -359330 -448422 -139660 108689 -202238
11302 -202238 -269813 -385104 -361416 -134382 160422 429906 334417 346011 285168 136573
11292 136573 -155857 66501 290664 41344 -169462 -58396 162799 290789 306438 150559
11282 150559 120718 49546 165721 405928 210371 77458 121444 576591 660710 419736
11272 419736 317468 186325 65191 47043 282790 476751 285103 181666 311336 178620
11262 178620 36383 170991 272563 242246 69863 279937 302793 401252 333772 373336
11252 373336 230189 56292 26698 86533 60825 79460 -165461 78641 537961 375213
11242 375213 126043 96494 133774 384027 484872 375829 33902 -19715 77986 304064
11232C04064k82879j88572j28643J30537Q1126J80032j31426j83503o2776K8576
11222b53464l2175R4432K51499J56093K77469J82755j03082l66460n0665J5904
11212A72306j47460J21516J92692L8810j13463n54958j31087K67299J96103L31714
11202C73472K51810k50643k64656N373J92840J03106j55321m9039j83364k38173
11192b14595j44726O3295R6511K92292J95604k1624K732p0843j18334K4763J0572
11181A15647j25408l30870O111J5247P0372n5605Q3910M14802p2887l04078L6770
11170a45989j60431k62373M17118R2766k1903J00512q3725n091p1763O4075k0569
11159i7373k39618j76215K64330K10007k29442P0400J57996j44605l90691O6227
$$ plain form
11232 304064 21185 -167387 -296030 -165493 -84367 95665 -35761 -219264 -282040 -253464
11222 -253464 -285639 -191207 60292 216385 493854 676609 573527 207067 156402 172306
11212 172306 24846 146362 339054 377864 264401 -290557 -421644 -154345 41758 373472
11202 373472 625282 374639 109983 115356 308196 411302 255981 206942 23578 -214595
11192 -214595 -359321 -296026 -199515 92777 288381 266757 269489 198646 80312 105075 115647
11181 115647 -9761 -340631 -334520 -319273 -248901 -304506 -220596 194206 121319 -182759 -145989
11170 -145989 -306420 -568793 -151675 -58909 -80812 19700 -64025 -69116 -140879 -76804 -97373
11159 -97373 -336991 -513206 -248876 -38869 -268311 -197911 -39915 -184520 -575211 -508984
11149e08984L85245N9836J25400K36310J41842j8798n3745q8078j74177k66898
11139a62047j32456r9881K53742p0998K57672J53576K7558J17026j04961k14549
11129B4682R0603O2772O3610o2857k2432j66412j34824n9490K74204K53355j31154
11118A92057l25021l42240J46406j32587K7019L58298J89315K23012K2407l4858
11108C23808j06818k92279n7275L54458M6930M098q8885n06931k35804K10239
11098c48459L56286K54247J29500P8706r0555R1850j02421j53285j55841k6096
11088C3932O3076j49299k87255j42438J53502P6770p4839L48505K08920l241P9057
11077C06690j18349j26657j39901q4622J08794J79319L24090K14848Q5039k95106
$$ plain form
11149 -508984 -123739 -63903 61497 297807 439649 420851 367106 279028 104851 -162047
11139 -162047 -294503 -394384 -140642 -211640 46032 199608 227166 344192 239231 24682
11129 24682 115285 178057 241667 178810 156378 -10034 -144858 -204348 69856 323211 192057
11118 192057 -132964 -475204 -328798 -461385 -434366 -76068 113247 336259 358666 323808
11108 323808 216990 -75289 -132564 221894 268824 272922 184037 -322894 -558698 -348459
11098 -348459 7827 262074 391574 470280 379725 471575 369154 215869 60028 33932
11088 33932 97008 -52291 -339546 -481984 -328482 -251712 -326551 21954 230874 227633 306690
11077 306690 188341 61684 -78217 -162839 -54045 125274 449364 664212 749251 454145
11067D54145j62069j59405l27680p5332O2059K80004K1354j0519m1730q0838N1109
11056A1098L1219j62371J37109R3369k09105k74893j4110J95864q884J24961K06788
11045A31045M02741J70204j04784m55509j68091k06123J85004P0515L29975l363
11035C51614J52210K14516j31434J17851K05590J24849j5110l5102Q3779M05869
11025A474632M73698K27411j38770O1937q1985k56377j93718j23817Q4223K44508
11015A771742J03658K83441L15690L02457J785j23418m17402n08628j12179l11936
11005A305210m2807K38776Q6991K89190j1829j08986k46576j53423l02037k63436
10995G91073L8743l88266j3203J05630J89984K76208n2480j96923K1333L9992
$$ plain form
11067 454145 292076 132671 -195009 -270341 -208282 71722 93076 82557 40827 -40011 11098
11056 11098 42317 -120054 17055 110424 -98681 -373574 -387684 -191820 -200704 -75743 131045
11045 131045 533786 703990 599206 143697 -24394 -230517 -45513 25002 354977 351614
11035 351614 503824 718340 586906 704757 910347 1035196 1020086 984984 1068763 1474632
11025 1474632 1948330 2175741 2036971 2098908 2016923 1760546 1566828 1443011 1527234 1771742
11015 1771742 1875400 2158841 2474531 2776988 2778773 2655355 2237953 1729325 1617146 1305210
11005 1305210 1262403 1501179 1588170 1877360 1865531 1756545 1509969 1356546 1054509 791073
10995 791073 829816 441550 428347 533977 723961 1000169 947689 750766 772099 812091
10985H12091k99309l04163q4515K82924L0956j36763P6538j75475L9472k11096
10975C0660Q775M92663q8673j56347j2680q559k20809l05790j27013q1987L61309
10964a08451K46708q7182N0381K32462j51222J2643l5936q7002P1676k26936J60490
10953G7631J16750K07452J26749L9274P1072m7620n9892M7916l4380k06377j27725
10942B10850J01759l6169O0827l02184j29698j11607j07765J313R5733N0649J42227
10931b4065L9881O2166j5394j1887j95486N6861j3255j87731o604J13107J80404
10920b003j31526M7773P1419k86262j2058K42637J66260r3313k01754j64823j45901
10909e09551L06111K97964m4993j72886J67147p9132L187Q5395l29665j10781
$$ plain form
10985 812091 512782 208619 124104 407028 437984 301221 377759 202284 241756 30660
10975 30660 39435 532098 443425 287078 274398 265839 45030 -260760 -387773 -469760 -108451
10964 -108451 138257 51075 101456 333918 182696 195339 159403 72401 144077 -82859 77631
10953 77631 194381 401833 528582 567856 638928 591308 531416 579332 544952 338575 210850
10942 210850 312609 276440 337267 35083 -94615 -206222 -313987 -312674 -216941 -166292 -24065
10931 -24065 15816 77982 62588 50701 -144785 -87924 -101179 -288910 -295514 -182407 -2003
10920 -2003 -133529 -85756 -14337 -300599 -312657 -70020 96240 2927 -198827 -363650 -509551
10909 -509551 -203440 94524 49531 -123355 43792 -35340 -32153 53242 -276423 -387204
10899c87204L70001K20352j74948k14700p5766P0911R1399n3908k0869M706J77356
10888G330J51107k61977j51459q6679L50804N2484J1361L02870j26987k20120
10878B8734o6076o962O9640j65870r4235J53551R2801j45045p294O8171R0044
10867A7459j26883k89451M00436L58444J63133j52799j70201K7428k899n7490
10857A67177j37123r5920p9955M4243K21042j76189j3104K80922P9899j22601
10847A68391j96495p1319J6181N36366o7932k04394Q4128m697M4266r7119j04627
10836A02749J85373m8842J77213J26812j38668Q5346l5637m1934P2053j48058
10826C36407L2998J28262q1722l70072q3492K45012j14364j77594J50680L7176
$$ plain form
10899 -387204 -17203 203149 28201 -186499 -262265 -191354 -99955 -153863 -174732 -170026 7330
10888 7330 158437 -103540 -254999 -341678 9126 61610 72971 375841 248854 28734
10878 28734 -37342 -44304 25336 -140534 -234769 -81218 11583 -133462 -140756 -72585 17459
10867 17459 -109424 -398875 1561 360005 523138 370339 200138 227566 224667 167177
10857 167177 30054 -65866 -145821 -101578 119464 -56725 -69829 211093 290992 168391
10847 168391 -28104 -99423 -83242 453124 385192 180798 264926 260229 304495 207376 102749
10836 102749 288122 239280 416493 543305 404637 489983 454346 412412 484465 336407
10826 336407 369405 497667 415945 45873 -37619 207393 93029 -84565 66115 103291
10816A03291n6343J16214J40182J78515M3437l15424o6544J36118r5008j77665
10806F773q4509K47280J75231K32499L28409j64982j85864j62890j12880k28269
10796E0798o6974m0619j37043J44335Q6983o4189J06889j03733n3129J0579j40032
10785b06135l46580N6748L43898K0998K15630L20847l32154j0053k06481j62232
10775c05514J21835K61207m6404o0036J86392K04041m5749j60557j87202k10972
10765b42959j03505k77448k27724M8253K12610R470J58200M30645K80994J06870
10755C95406m1870j75578j2439l50698N7202K34746J79525j19875K59240L1870
10745D57529o2544j77608k01394K39324N7508m9296p882j3293j58521l6696K53408
$$ plain form
10816 103291 46948 163162 303344 481859 525296 209872 143328 279446 184438 6773
10806 6773 -77736 169544 344775 577274 905683 740701 554837 391947 279067 50798
10796 50798 -16176 -56795 -193838 -49503 37480 -26709 80180 -23553 -76682 -66103 -206135
10785 -206135 -552715 -495967 -152069 -131071 84559 405406 73252 63199 -143282 -305514
10775 -305514 -183679 77528 31124 -28912 157480 361521 315772 155215 -31987 -242959
10765 -242959 -346464 -623912 -851636 -803383 -590773 -581303 -423103 7542 288536 395406
10755 395406 353536 177958 165519 -185179 -127977 106769 286294 166419 425659 457529
10745 457529 394985 217377 15983 255307 312815 263519 255637 242344 83823 47127 300535
10734C00535j2581K20433K17205K6363l85864Q666J77731j90738j72096m9068
10724A40586j7314K1390K79393L984n8934k9571j56290K78605L68862M1797q4410
10713G88098o1822j86893J2314N9248j83331l7631J05378o3860m89426j68791
10703b26716R1293M3362M8231J43189j02924L6322M16154K71596j64543j81518
10693C74446j71760l20643q8010L70251L06907m3931k05721o2137L1241j83138
10683G505J59922j8533n1611Q6898Q6933K91284J48615j81919j5792j8604j838
10672D92860p701p9618k70864N08M54173J99638P0882M8525K38370l09743m99621
10661C37409J76121K65887j45241j17348L24323K26095n1821j70299l4273J06111
$$ plain form
10734 300535 287954 508387 725592 751955 366091 374757 552488 361750 189654 140586
10724 140586 123272 144662 424055 428039 369105 339534 183244 461849 830711 872508 788098
10713 788098 726276 539383 551697 610945 427614 389983 495361 431501 -57925 -226716
10703 -226716 -135423 -92061 -43830 99359 -3565 32757 448911 720507 555964 374446
10693 374446 202686 -117957 -205967 164284 471191 427260 221539 159402 190643 7505
10683 7505 167427 148894 97283 184181 271114 562398 711013 529094 513302 494698 492860
10672 492860 485159 405541 134677 135185 589358 788996 859878 908403 1146773 837030 337409
10661 337409 513530 779417 634176 516828 841151 1067246 1015425 845126 810853 916964
10651I16964J73772l213m7901K40968L03518J38883K76602L67276N25899L39948
10641C232716N35218K67866k86012l91075m48713j19172j82119r2958J74895P2846
10631B763492Q67L96571N67598N54736O57837R05170N35828J081882J126893O46628
10621I237502P59733Q70500Q14872J349915J683886K254879L109880M429593O349063
10612C0859823Q377741J1721937J5996912K0783491K4593561K2479040J5273689
10605A50086194N330498l420122p269906n573264p69805O562941J6007124K8152241
10597A89105901M1566706N0613666M5267668K3207034l986663k3400993l0156393
10590B92216926k5027124j2942111J603115J8174572L6808829N5016572O4787609
$$ plain form
10651 916964 1090736 1087523 1039622 1280590 1584108 1722991 1999593 2366869 2892768 3232716
10641 3232716 3767934 4035800 3749788 3358713 2910000 2790828 2608709 2515751 2690646 2763492
10631 2763492 2764359 3160930 3728528 4283264 4941101 5846271 6382099 7463981 8590874 9237502
10621 9237502 9997235 10867735 11682607 13032522 14716408 16971287 20081167 24510760 30859823
10612 30859823 39237564 50959501 66956413 87739904 112333465 134812505 150086194
10605 150086194 155416692 151996570 144726664 139153400 138383595 144946536 160953660 189105901
10597 189105901 230672607 281286273 326553941 349760975 345774312 322373319 292216926
10590 292216926 267189802 254247691 255850806 274025378 310834207 365850779 430638388
10583D30638388N1826990J5529617k3754571n0024867n7343469m9087187l3707358
10576B84077543j6813687l81617J5215046K8887497L3888554K2435019k992296
10569C64316059k8793787m4119551m6049116l8185450k6509894j5909681o766371
10562A57982209J560988P259334P673171J970092p940531j7692651k3098586k3713141
10554A04000885k0283041j5800008j1983304r272714o714112n179484m108462
10547C0659760l243412k839761k519190j961080j752529j496481j331169j101625
10539A4414513j019545r42537q85114q44845p58777n81967m91586k47868k52818
10530H389456l42747o17204p46731j68931k20658j48029k25680p0675N8875l79835
$$ plain form
10583 430638388 482465378 497994995 474240424 424215557 366872088 317784901 284077543
10576 284077543 267263856 266882239 282097285 310984782 344873336 367308355 364316059
10569 364316059 335522272 291402721 245353605 207168155 180658261 164748580 157982209
10562 157982209 159543197 166802531 174475702 176445794 168505263 150812612 127714026 104000885
10554 104000885 83717844 67917836 55934532 46661818 39947706 34768222 30659760
10547 30659760 27416348 24576587 22057397 20096317 18343788 16847307 15516138 14414513
10539 14414513 13394968 12452431 11567317 10722472 9963695 9381728 8890142 8642274 8389456
10530 8389456 8046709 7429505 6682774 6513843 6293185 6145156 5919476 5848801 5907676 5527841
10520E527841l34425l09403l81007m06272j99112l06554k82248N777N9103k73626
10510C100074n9572J50761m0573m0443k80511l44781k53404K81996P4823l36142
10500B252228j15453j18384o4068K66204j71402m46358R4425J04570k63366l43947
10490A194449j40312j42530J64936L11538J28254j51755m88601J36237Q6569j54650
10480I44135R3311k23896J22551J36329p5666k59145k13757Q5247J17330o6294
10470F60145q0018n4768J62554J90801o4764J29411j87982p101k53625j04414
10460C90239m3867l2332L6147K17252k77914q030J89369j14660j4102Q9139q0604
10449C50637l37160N2339L17n7806p0686N2818M20K68483J93216L32274J43337
$$ plain form
10520 5527841 5193416 4884013 4503006 4096734 3897622 3591068 3308820 3314597 3373700 3100074
10510 3100074 3040502 3191263 3150690 3110247 2829736 2484955 2231551 2513547 2588370 2252228
10500 2252228 2136775 2018391 1954323 2220527 2049125 1602767 1697192 1801762 1538396 1194449
10490 1194449 1054137 911607 1076543 1388081 1516335 1364580 875979 1012216 1098785 944135
10480 944135 1037446 813550 936101 1072430 996764 737619 523862 609109 726439 660145
10470 660145 580127 525359 687913 878714 813950 943361 755379 748278 494653 390239
10460 390239 346372 314040 350187 567439 289525 281495 470864 356204 342102 431241 350637
10449 350637 13477 65816 66133 8327 -62359 -9541 -9121 259362 452578 784852 928189
10438I28189j49983P6634j96346k00490Q4513K93616M2927m53172j22436K66754
10428E70206K8735L70R5861k5228j22321k25878j19952J39405O0628J41812K4950
10417E68588l19741N7728P4154j91057O7180K22019J42930j21898k0991K6385
10407E05297l04286j96376L7351o971J64998m0914L36916K56542N0347j44659
10397F58245J0285j70590l51149j70536N0022K45994K78779j08116M5936J18115
10387F06985r9636j10191l3515K04240L02162L7533J18444J22029k55238n86174
10377C06639m11780K59268j06549j50457K90943L0551k87606K03912J67755J71074
10367D73750J95021o5718k44946j00171J33106J15006o731J6785o7106J54211
$$ plain form
10438 928189 778206 854840 658494 458004 542517 836133 879060 425888 303452 570206
10428 570206 598941 599311 695172 669944 547623 321745 201793 341198 401826 543638 568588
10417 568588 248847 306575 380729 189672 256852 478871 621801 499903 478912 505297
10407 505297 201011 4635 41986 35015 200013 159099 496015 752557 802904 658245
10397 658245 668530 497940 146791 -23745 26277 272271 551050 442934 488870 606985
10387 606985 507349 397158 363643 567883 870045 907578 1026022 1148051 892813 306639
10377 306639 -105141 154127 47578 -102879 188064 218615 -68991 134921 302676 473750
10367 473750 668771 603053 358107 257936 391042 506048 499317 516102 448996 603207
10357F03207J86727p8544k26279k35426j00846j70537j49636m6270K39440j13427
10347i1591J10033M45475N8863j31917M1225K03323K46009k65776j70813n5800
10337C89031k18991q7144J11590j8261l2036L37899J89732k99827l9519j16283
10327B16191q7352o9177j00040J6568M59312J39972l2356j42551q917r7594M3847
10316C37903O964j27664j5336J8305j62298m9641K47248M94786J20795k26067
10306F44995n02355k3122J80694L283j34609K91868K72415l31548n1129R2362
10296D42854q9113J04302q2473r8356O4258r1821j48721O556L64084J4762j3360
10285D72972l8921P1337K20017k01918k37517k16854r7881k75549j89813J13708
$$ plain form
10357 603207 789934 711390 485111 249685 148839 -21698 -171334 -217604 21836 -91591
10347 -91591 18442 463917 522780 390863 432088 635411 881420 615644 444831 389031
10337 389031 170040 82896 194486 176225 144189 482088 671820 371993 332474 216191
10327 216191 128839 59662 -40378 -23810 435502 575474 543118 400567 391650 294056 337903
10316 337903 344867 217203 201867 220172 57874 8233 255481 750267 871062 644995
10306 644995 142640 119518 300212 303495 168886 460754 733169 401621 350492 442854
10296 442854 353741 458043 375570 277214 341472 249651 100930 107486 471570 486332 472972
10285 472972 434051 505388 725405 523487 285970 69116 -28765 -304314 -494127 -380419
10275c80419Q4092K741J58866K59087k9029j12193L9858L6050Q1027j47394L47518
10264C40204O1792j52535n488q023n9532J38532j5032J10996k46928m5325N5594
10253A74255m025q4432J06844L6110N5840R6625j51676L20160J81571J6183j65070
10242E82385K53971J51466k60600l73416k18291R016n8487J76850M1396Q67L5825
10231C40982R2479O6875P5894k25101k80188j62122J08496q4191k37688j11562
10221d16126m1746k57811R6570L48520K84709K2267Q0981K94278K28753m6686
10211E93709m09111K8038J43063R4203k5918K19798j31195p8003o5141j02714
10201B66729J9672J84429j43592k57296k73257O6666j29956O970L94338K38731
$$ plain form
10275 -380419 -296327 -293586 -134720 124367 95338 -16855 23003 59053 140080 -7314 340204
10264 340204 401996 249461 243973 235950 176418 314950 299918 410914 163986 118661 174255
10253 174255 170230 85798 192642 228752 284592 381217 229541 549701 731272 747455 582385
10242 582385 836356 987822 727222 353806 135515 144531 86044 262894 304290 305157 340982
10231 340982 433461 500336 576230 351129 70941 -91181 17315 -66876 -304564 -416126
10221 -416126 -457872 -715683 -619113 -270593 14116 36383 117364 411642 640395 593709
10211 593709 184598 212636 355699 449902 423984 643782 512587 434584 369443 266729
10201 266729 286401 470830 327238 69942 -203315 -136649 -266605 -259635 134703 373434
10191C73434j54153k39843J8922k21743Q1301K36043K08610K5208o33749j58729
10181d64699K54104J37361K36758r7797m79829K661N60389K24944j07177l3948
10171B32767L31412L35447K59509k03590l56205o1469j02921K92063J01097n293
10161H22817J89950K14306M17033L96788N098J82015l43766m45969p9181k94585
10151A064506p8723J91935M81759M20179J9046R1238Q6991M4497k36420k82558
10141A802450j65595j05974J96501J09683K16560K676O8423j25350p0849P1425
10131A999950j56633k50120M3418K58448m14160m99405l382K38201m0259j66407
10121A009651o9459l3825l46709l39080n9258J55823j64153q1095L1040j70783
$$ plain form
10191 373434 219281 -20562 -1640 -223383 -142082 93961 302571 327779 -305970 -464699
10181 -464699 -210595 -73234 163524 65727 -414102 -411441 148948 373892 266715 232767
10171 232767 564179 899626 1159135 955545 599340 537871 434950 727013 828110 822817
10161 822817 1012767 1227073 1644106 2040894 2045992 2228007 1884241 1438272 1359091 1064506
10151 1064506 985783 1177718 1659477 2079656 2098702 2189940 2276931 2321428 2085008 1802450
10141 1802450 1636855 1530881 1727382 1837065 2053625 2056301 2124724 1999374 1928525 1999950
10131 1999950 1843317 1593197 1636615 1895063 1480903 981498 978116 1216317 1176058 1009651
10121 1009651 940192 906367 559658 220578 161320 317143 152990 71895 102935 -67848
10111f7848K03991O9858l19010l40887P8617K82114K96695j7798O7957R822M4389
10100C07900q3182j25090l99367K1206r0833O9600L07107N03259Q0117j95309
10090C95408k91919m0602l20381r9173j3055K145J12249J35754J44201j60019
10080a35392j53517L0286r3741J615M0976j89078K85781J81480K16461L6757Q0688
10069C02316j76216p6224q7834k23935L65473l0934j15579j37583J72071L41141
10059C32696k8974r1717N8360j88243j05105l4726j56584N0440m8143j33810J7839
10048c27967J28649L13471K94604o649l30846j51358k49371j481L15631L22100
10038C06783o3848L2848l7813N1404L73225J0882k84743k85635o5520K3681p7606
$$ plain form
10111 -67848 136143 206001 -113009 -453896 -375279 -93165 203530 185732 253689 263511 307900
10100 307900 224718 99628 -299739 -278533 -369366 -299766 7341 510600 590717 395408
10090 395408 103489 62887 -257494 -356667 -369722 -367577 -255328 -119574 24627 -135392
10080 -135392 -288909 -258623 -352364 -350749 -309773 -498851 -213070 -31590 184871 221628 302316
10069 302316 126100 49876 -37958 -261893 103580 72646 -42933 -180516 -8445 332696
10059 332696 303722 212005 270365 82122 -22983 -57709 -214293 -163853 -211996 -345806 -327967
10048 -327967 -199318 114153 408757 402108 71262 -80096 -329467 -330948 -15317 306783
10038 306783 242935 275783 237970 289374 662599 673481 388738 103103 37583 61264 -16342
10027a6342K03467J24420j15555q9239j40961J0625J60343N0509k01002j17373
10017a31108j23652k08045K23468K02256J32707J49871j23651o2919K2697R333
10007I0957j46011K14661o5328r313n1853q8147L19461O6616k81786k26631L51422
9996A74048L5801j79405q906q0638O76K47716O2588j30325j17159j3435R9923
9985I0884N2940j40616k01907L04637K7148j32890O4720M9630J40576K37197J33981
9974F26300j5192o1096M884l13660j30414L24603K8439r3870n8890j74044j39675
9963b615M3708j42926K27565L2031J71161N149j74942j93540j53094m2576J04897
9952a25182K3595J38687Q4040J01758j06735j83083j7326j97962P7394k47279
$$ plain form
10027 -16342 187125 311545 195990 106751 -34210 -23585 136758 187267 -13735 -131108
10017 -131108 -254760 -462805 -239337 -37081 95626 245497 121846 58927 81624 90957
10007 90957 -55054 159607 94279 84966 33113 -55034 264427 331043 49257 -177374 174048
9996 174048 209849 30444 21538 -59100 -58424 189292 251880 121555 4396 -9039 90884
9985 90884 143824 3208 -198699 105938 133086 196 64916 114546 255122 492319 626300
9974 626300 611108 550012 554896 241236 110822 435425 463864 369994 311104 137060 -2615
9963 -2615 41093 -101833 125732 157763 328924 334073 159131 -34409 -187503 -230079 -125182
9952 -125182 -101587 37100 121140 222898 116163 -66920 -84246 -282208 -204814 -452093
9942d52093L2794R274P5748L67527q7578k39834k6178q3172J78013N9417J07116
9931e8966n1981L96132J53202j37020n6972K07247J12833q5210L83840K32083
9921A095188K51196l15601p47252k39812P7586p6946j12559J6561O6354Q4902
9911I9617J68897K17769j85410k40354j51228j56535J02178K77910l4002j15682
9901a6840L00127J50636R679r2219l2887P7053j60428m42334k57277K15704J49434
9890i9352j50719P2567k08508k17578K83396J86649K13363K82301j74867j74838
9880A2414j08536l25248l2895K06523m2871j91191K53239J03124j35507k3586
9870b84534J35234l6225J66723J24996L95017l11604j25287J82799j42969j1492
$$ plain form
9942 -452093 -419299 -410025 -334277 33250 -54328 -294162 -320340 -403512 -225499 -166082 -58966
9931 -58966 -110947 285185 438387 301367 244395 451642 564475 479265 863105 1095188
9921 1095188 1346384 1030783 283531 43719 121305 44359 -68200 -51639 14715 99617
9911 99617 268514 486283 300873 60519 -90709 -247244 -145066 132844 98842 -16840
9901 -16840 283287 433923 443602 351383 318496 395549 235121 -207213 -464490 -248786 -99352
9890 -99352 -250071 -177504 -386012 -603590 -320194 -133545 79818 362119 187252 12414
9880 12414 -96122 -421370 -454265 -247742 -290613 -481804 -228565 -125441 -260948 -284534
9870 -284534 -149300 -185525 -18802 106194 501211 189607 64320 247119 104150 92658
9860I2658r2463q0354J24668P810j06510j44986M1152K27319k7066j14681J15789
9849D3336n4697l59911M1200J18587M5748J30306K24750J07423l26376J46189
9839A16555k2330O5924Q4008k11047k78258j70561J62399N1554L9323j52602N2938
9828b62097J75969j14103L35721J45903J08963j82871j52991K11354J44567K7175
9818D37590l38431m08801K94865n2489j38021l64064L67839K74178O9323q0955
9808F1034J18467k84553q4473J68950L03053M7142l10057k09207k20944m8077
9798d58665K52434L20272J49835J48177R6024P636J5670k69246r4135K5172O0281
9787B53455m189l98253m4929J95937n1443m8078L01385j9134j01922k34782K9984
$$ plain form
9860 92658 195 -80159 44509 52319 -54191 -199177 -158025 69294 42228 -72453 43336
9849 43336 -11361 -371272 -330072 -211485 -165737 -35431 189319 296742 -29634 116555
9839 116555 94225 160149 244157 33110 -245148 -415709 -253310 -201756 -162433 -315035 -262097
9828 -262097 -86128 -200231 135490 281393 390356 207485 54494 265848 410415 437590
9818 437590 99159 -309642 -14777 -67266 -205287 -569351 -201512 72666 141989 61034
9808 61034 179501 -105052 -189525 -20575 282478 329620 19563 -189644 -410588 -458665
9798 -458665 -206231 114041 263876 412053 508077 515713 531383 262137 168002 193174 253455
9787 253455 249266 -148987 -193916 2021 -49422 -97500 203885 184751 82829 -151953 -121969
9776a21969K80056j60114O8232l9386r1114k22255l3196J62651J84882J81549
9766B09336J8941k56613j73368K8296P3126J53700K83317j15714j42739Q0125
9756A58407L3109J73547J10157j26632k58524r7961K54846j39656k23980J99273
9746H2586J8495j24275L0084j52179k43719q6033N4526J08621J60321J26497p3411
9735i8487k3964O3330O1360Q3922M1914j24280j36608K56010J03099R8392l519
9724C21169j64327j20215j28371n3023L9602J9263r8296n8830J19288K19514j56896
9713f1122R2200O3931k28295j61865M5322K71385j03206k41187J3862j35140K38459
9702b05656K37191M5576R2941K1391k09360k60975K9363k7647j4679O2876K37825
$$ plain form
9776 -121969 158087 -2027 66205 26819 -64295 -286550 -319746 -157095 27787 209336
9766 209336 228277 -28336 -201704 -173408 -100282 53418 336735 221021 78282 158407
9756 158407 191516 365063 475220 348588 90064 -7897 246949 107293 -116687 82586
9746 82586 101081 -23194 6890 -145289 -389008 -475041 -420515 -311894 -151573 -25076 -98487
9735 -98487 -122451 -59121 2239 86161 128075 3795 -132813 123197 226296 324688 321169
9724 321169 156842 36627 -91744 -144767 -105165 -85902 -184198 -243028 -123740 95774 -61122
9713 -61122 31078 95009 -133286 -295151 -249829 21556 -81650 -322837 -308975 -444115 -205656
9702 -205656 31535 77111 170052 191443 -17917 -278892 -249529 -277176 -291855 -228979 8846
9691H846K04095k25259m18533L1109O7496J38904K8558o3528j50455j83998L51603
9680b11162M29488k20269k97462J7800K86213J40581k45228m3273j74025j92699
9670e10036J60068M77713J09544J13496j90878k6728r1848K75015m5258j46783
9660A24305j07145j74759J04766j52516J47770J92828M4250j5702J4832P5107
9650B53736k92508k24457p1361j9923J54429K56015O10596J40336n83669p7288
9640A45906j73327l64971J2536K13883K30292j01719j28463j56161J43677J39793
9630c8554P3534k8567l10673j36179n407O2623J81530J42435j32998J59128J59124
9619A25996j9709p147J31518J0958l54343l91832l0653n5151L9012K19253K73715
$$ plain form
9691 8846 212941 -12318 -430851 -399742 -332246 -193342 -164784 -228312 -378767 -562765 -211162
9680 -211162 218326 -1943 -299405 -281605 4608 145189 -100039 -143312 -317337 -510036
9670 -510036 -349968 127745 237289 350785 159907 133179 41331 316346 271088 124305
9660 124305 17160 -157599 -52833 -205349 -57579 135249 179499 163797 178629 253736
9650 253736 -38772 -263229 -334590 -354513 -200084 55931 666527 806863 223194 145906
9640 145906 -27421 -392392 -379856 -165973 64319 -37400 -165863 -322024 -178347 -38554
9630 -38554 34980 6413 -304260 -440439 -445846 -383223 -201693 -59258 -192256 -33128 125996
9619 125996 106287 99140 230658 241616 -112727 -504559 -535212 -590363 -551351 -332098 -58383
9608e8383j9952j71451M2502j15125J57244K91118J86891J95203J26334k08702
9598D25679m26664l90834j31429R7585J11945K23961n230L5810L2276N8558j52548
9587a20891j27338K1162K4472o3711J02164m9042k77980O2167j58225J96994N766
9576c84462J02270j26975j42042L32966J28299k37568n1108Q4376N6202N9043
9566a78999N8759K21161K65863k22740m65533J23141J49783K2469n0393j677j47632
9555b25798k19329K5870n227m3017K3030M13149J86787r0174j86093j7293k84378
9544d22473P0505P8512J88138J65531k40632k09897j90286J35889j54500J17420
9534d61793J88379J21660J88599j9751Q9329m0227J40608J7983j33211J86136
$$ plain form
9608 -58383 -78335 -249786 -207284 -322409 -165165 125953 312844 508047 634381 425679
9598 425679 -985 -391819 -523248 -425663 -313718 -89757 -94987 -59177 -26901 31657 -120891
9587 -120891 -248229 -227067 -202595 -266306 -164142 -213184 -491164 -428997 -587222 -390228 -384462
9576 -384462 -282192 -409167 -551209 -218243 -89944 -327512 -378620 -294244 -238042 -178999
9566 -178999 -120240 100921 366784 144044 -321489 -198348 -48565 -26096 -76489 -78166 -225798
9555 -225798 -445127 -419257 -424484 -467501 -444471 -31322 155465 65291 -120802 -138095 -422473
9544 -422473 -351968 -273456 -85318 80213 -160419 -370316 -560602 -424713 -579213 -461793
9534 -461793 -273414 -151754 36845 17094 106423 66196 206804 224787 91576 277712
9524B77712l8277j59653R4044J1838j32524o7848J56426p7565r4804j20465j02924
9513b54040P6220k5804J76921n8587l319L09809n7242J51621P7979l22791j80554
9502a09787j99354j91835N6156M47423M67290j62266l13418j77738J11356j24528
9492a96701j29109k6923p5624J76329L13400J14713l1578m50976P4156K49880
9482A7567K05554o1877l1412p8915O1090l5485J72741J83135m06832l7597N301
9471f730K5074J47985k59032n2393K9916K53366J48453q1426o619q3384q6136
9460B9074k2405r4894P4648p3470l0464j5936K83905P131n1581P9513j79076j01298
9448i4853j28201J32337j13051m7013j83413o1319M8534M2692j4203k0465J10474
$$ plain form
9524 277712 239435 79782 173826 185664 53140 -14708 141718 64153 -30651 -151116 -254040
9513 -254040 -177820 -203624 -26703 -85290 -88609 221200 163958 315579 393558 70767 -109787
9502 -109787 -309141 -500976 -444820 2603 469893 307627 -5791 -183529 -72173 -196701
9492 -196701 -325810 -352733 -428357 -252028 61372 176085 144507 -306469 -232313 17567
9482 17567 223121 161244 129832 50917 112007 76522 249263 432398 25566 -12031 -6730
9471 -6730 18344 166329 -92703 -145096 -115180 138186 286639 205213 198594 115210 29074
9460 29074 6669 -88225 -13577 -87047 -117511 -133447 150458 157589 106008 185521 6445 -94853
9448 -94853 -223054 -90717 -203768 -250781 -434194 -495513 -446979 -404287 -418490 -438955 -328481
9437c28481k12405N0624N2380K19267j17315J35694q8273k991L46341L89623L06156
9426G50620p9496o84192n24868m81251J76133M89768J28005k33024o5955K90559
9416b33701K71632k75196J4436R039k83897R2864K1193j91669r71L90280K62085
9405G6095J21400L10105J09884l03685l66217k34191J52783q4281j99626J28486
9395b89247J92139K03267o567l35516j56584J1308J23880J0876r7830m7053K58265
9384a33062J53990q9957N6185o4131o2877N8638n0470o3583L0408o0577J15413
9373a10023q3635n8991n700J34430M13564o9365k85454k84896J28196L10411J22893
9362B11430N9533j63685k18463K0997K99014q359n5459j46636L9745r1905n3723
$$ plain form
9437 -328481 -540886 -490262 -437882 -218615 -335930 -200236 -288509 -291500 54841 444464 750620
9426 750620 671124 -13068 -537936 -1019187 -843054 -353286 -225281 -458305 -524260 -233701
9416 -233701 37931 -237265 -222829 -213790 -497687 -404823 -383630 -575299 -576270 -185990 76095
9405 76095 197495 507600 617484 313799 -52418 -286609 -133826 -218107 -417733 -289247
9395 -289247 -97108 106159 99592 -235924 -392508 -381200 -257320 -246444 -344274 -391327 -133062
9384 -133062 20928 -69029 -12844 -76975 -139852 -81214 -131684 -195267 -164859 -225436 -110023
9373 -110023 -193658 -252649 -258349 -123919 289645 220280 -65174 -350070 -221874 88537 211430
9362 211430 270963 107278 -111185 -90188 208826 200467 145008 -1628 38117 -53788 -107511
9351a07511J64398J84779l2671j32484l89447J55314K90055J79272M0344M1131
9341C93180P1177p1790j78511k84480j68274J6496q7034j2861Q2808j83032J44264
9330b78057J13204p5248K32418K02751K75934Q2711k74119J70281j62600K910
9320B90185j80185J22204l4673o01j26662m2137J60009J70193L30551J1574l08748
9309C91710l29504r9206k91030q1705J94639r049K44262K60815R4101r1276r4356
9298A89401O6512J0208k6451j04700L16556k84337l27730m6434J3723K74011j53140
9287g2381j90827o8229R3270m4566M1032J24177n2618J1929j34842j80390K9526
9276d43919K77109K14144k4045k09515j59J28100l24975k85732L35644j8266J56584
$$ plain form
9351 -107511 56887 241666 208995 76511 -312936 -157622 132433 311705 352049 393180
9341 393180 464357 392567 214056 -70424 -238698 -222202 -309236 -322097 -239289 -422321 -278057
9330 -278057 -164853 -240101 -7683 195068 471002 553713 279594 449875 287275 290185
9320 290185 110000 232204 197531 196930 70268 28131 188140 358333 688884 700458 391710
9309 391710 62206 -37000 -328030 -409735 -215096 -224145 20117 280932 375033 283757 189401
9298 189401 255913 266121 239670 134970 451526 167189 -160541 -206975 -193252 80759 -72381
9287 -72381 -263208 -331437 -238167 -282733 -241701 -117524 -170142 -158213 -293055 -473445 -443919
9276 -443919 -166810 47334 23289 -186226 -186385 -58285 -383260 -668992 -333348 -351614 -195030
9265a95030M1342J0833J66446K9799Q2971j04225K8049j39358L0685k00774k3117
9254b72379L15881j67476M7986o8343l02879j02372K23560M03551J33828j80107
9244C1250J6522N8981J28051J53273k52721k92278J77798K25780O8466r3146J47248
9233C69224j83510r3819o6411r0864j99440J9619j22889j14986K8160J67525N9331
9222b28060K01952K70591n3647l12918L7683j34425R712K5940k8957R7465K33298
9211A18634R4227j35017J3868M0824J8740P2064p4290j83891j0387N8816o6625
9200e3037q2555K57768L4053k50895l45540j36509k0697k4956P9696J74284J83616
9189a84772K77658J00520j40695J31688r7917j36641q0656k49665J00771J09537
$$ plain form
9265 -195030 -153688 -142855 23591 53390 136361 32136 60185 -79173 -48488 -249262 -272379
9254 -272379 43502 -123974 -75988 -144331 -447210 -549582 -326022 77529 211357 31250
9244 31250 47772 106753 234804 388077 135356 -156922 20876 246656 315122 221976 369224
9233 369224 185714 91895 25484 -65380 -264820 -245201 -368090 -483076 -454916 -287391 -228060
9222 -228060 -26108 244483 190836 -122082 -84399 -218824 -209112 -183172 -212129 -114664 118634
9211 118634 212861 77844 91712 132536 151276 223340 149050 -34841 -45228 13588 -53037
9200 -53037 -135592 122176 156229 -94666 -440206 -576715 -597412 -622368 -542672 -368388 -184772
9189 -184772 92886 193406 52711 184399 86482 -50159 -130815 -380480 -279709 -170172
9179a70172q9747j7689p9043k80660j81635M76266N09201J88102R5833l38844
9169A11612j21437J70099L46525n4817m0417j63397L9936J59717k39430k90278
9159h1887l13728o4766J72078J31026r1792K6071K81998o6735k67413K949o215
9148b78414k23609R5615L2810q381M7220K50904K05934K36512N7247R1165j20798
9137C86205m96963L5754K41713p3996P1898k24294p5681K0642N2029m46345r3980
9126f03018L21389J87674j19401K5789k7353l6563J95034J58243o7789j25494
9116i1489m5620p6421P1369K19597M83589k93479p00172k01320K17694K70792
9106a45460K78666l26674l9999J28886k47348K28499N3427J1351L5623J8397N8080
$$ plain form
9179 -170172 -259919 -277608 -356651 -637311 -818946 -342680 166521 354623 450456 111612
9169 111612 -9825 160274 506799 451982 411565 248168 288104 447821 208391 -81887
9159 -81887 -395615 -460381 -288303 -157277 -249069 -222998 59000 -7735 -275148 -272199 -278414
9148 -278414 -502023 -406408 -373598 -381979 -334759 -83855 122079 358591 415838 507003 386205
9137 386205 -110758 -75004 166709 92713 164611 -59683 -135364 -114722 -62693 -509038 -603018
9126 -603018 -281629 -93955 -213356 -187567 -214920 -251483 -56449 101794 34005 -91489
9116 -91489 -137109 -213530 -142161 77436 561025 267546 -432626 -633946 -416252 -145460
9106 -145460 133206 -193468 -233467 -104581 -351929 -123430 -70003 -58652 -23029 -4632 53448
9095E3448O0112O6460n5012J77439m406K6838j72796j551K2913L5456J36004j70292
9083A74613j83920J63567K84120J28944k40599l92866P4941n4800j08860J28444
9073b6416m5123j1236K03765J73998m2493p2822n7545k68772l3468l10826k54265
9062g45203l96431K8350L53252M59964K17752l8287N4093M5623J0425K01007j52369
9051C8176k63245p2631J08032J35160J58949r0021l65858R2982J05112k28099
9041c81443Q1818J99936L76052k28412j76267N474k34008n6440Q7429j34251n4401
9030e14513L14876J41661j67409k67516J61237L19804j43406p8279K4704P6426
9020a32415J92393K96565K8937k04275n36551m57826O8879L24642j00555l53141
$$ plain form
9095 53448 113560 180020 125008 302447 298041 324879 152083 150532 173445 208901 344905 174613
9083 174613 -9307 154260 438380 567324 326725 -66141 8800 -46000 -154860 -26416
9073 -26416 -71539 -82775 120990 294988 252495 179673 122128 -146644 -180112 -490938 -745203
9062 -745203 -1141634 -1113284 -760032 -300068 -82316 -120603 -66510 -20887 -10462 190545 38176
9051 38176 -225069 -297700 -189668 -54508 104441 14420 -351438 -258456 -153344 -381443
9041 -381443 -299625 -99689 276363 47951 -128316 -122842 -356850 -413290 -325861 -460112 -514513
9030 -514513 -199637 -57976 -225385 -492901 -331664 -11860 -155266 -233545 -208841 -132415
9020 -132415 59978 356543 385480 181205 -355346 -813172 -744293 -419651 -520206 -873347
9010h73347P3280J59608p2957K50608J65253J4363K05622L9402J01832r2019k20164
8999b48519k04405P7998R8002p3025K30545J31609J23595j5051j61401j39251
8989a79903L09738J62913j17956l19941o4088K28209Q3259l3706l1579j97879
8979a60933k6215Q1097J39307J72804P3479k47860j61649J40028K12627k63422
8969d0737k23296J1497N5151K30222J85171K1549J31093J97794k61366k38039
8959F9039o047J78512j70517k22049J19547k1850j94183j35075M2594K54376o4061
8948a49714k314R0663J96022M0076k30484j86610l5540K01815p5466l4567Q823
8937a77296L34387J84214o4430l4847k06840l22295k09922J7657J17414K35218
$$ plain form
9010 -873347 -800067 -640459 -713416 -462808 -297555 -283192 -77570 -38168 63664 -28355 -248519
8999 -248519 -452924 -374926 -276924 -349949 -119404 12205 135800 120749 -40652 -179903
8989 -179903 129835 292748 174792 -145149 -209237 18972 102231 68525 36946 -160933
8979 -160933 -187148 -106051 33256 206060 279539 31679 -129970 10058 222685 -40737
8969 -40737 -264033 -252536 -197385 32837 218008 239557 370650 568444 307078 69039
8959 69039 62992 241504 70987 -151062 -31515 -53365 -247548 -382623 -340029 -85653 -149714
8948 -149714 -152028 -61365 134657 174733 -55751 -242361 -277901 -76086 -151552 -186119 -177296
8937 -177296 157091 341305 276875 242028 35188 -287107 -497029 -479372 -361958 -126740
8927a26740p2626p3161k6482J02630J1961k0141L22497K18129k73492r4955j76035
8916b08415K65705L4775j58424r5983P109J03324k07161q1314j61191k5681R4222
8905d33034K88847j53704j44114K95661o4474q1151K05547O9862Q4378N7349J19232
8894B44399l6860R8512j66613r0936N5424J37926O2571K03378o8567j54513j97982
8883H6739l4668J18104J57491m705N1710j53407J26625M2034j43309k56459k77646
8872b87491R5936K40842r0589k61109N3673J05447J71071J25582p8149o1353P460
8861B1320k4110j5489p1324l6287m3234j4507P7357J25477Q5211K6089j95152
8850f4649J13887k7548j06919j71091K95669J44938K39220j81054k71883m0666
$$ plain form
8927 -126740 -199366 -272527 -299009 -196379 -184418 -204559 117938 336067 62575 -32380 -208415
8916 -208415 57290 92065 -66359 -162342 -155233 -51909 -259070 -340384 -501575 -527256 -433034
8905 -433034 -144187 -297891 -442005 -146344 -210818 -291969 -86422 -16560 67818 125167 244399
8894 244399 207539 306051 139438 48502 103926 241852 304423 507801 439234 284721 86739
8883 86739 52071 170175 327666 322961 374671 221264 347889 389923 246614 -9845 -287491
8872 -287491 -191555 49287 -41302 -302411 -248738 -143291 27780 153362 75213 13860 21320
8861 21320 -2790 -18279 -89603 -125890 -169124 -183631 -106274 19203 104414 130503 -64649
8850 -64649 49238 21690 -85229 -256320 39349 184287 423507 242453 -29430 -70096
8840g0096q0221k2404J47361Q2358o7740j29649J17472O1475L20990J80539j55936
8829C84149j43785k18464j59625K19070J3007N2364J3846O8482k74j97162k93935
8818b62327J38389L19339K2697l3312N6237j61629k68532o7464K57588J77358
8808A78344o4041q4503J83426q2145m1174J08855J8048j42909j01797K7902j81188
8797a81182j82325Q2233K88467K19736k13675k03672l10068r3970L23344L87122
8787A16010P949k36164R2470r156P0627J87899L43661k97311l39813N1624J01860
8776H9656J96870O158l93139J1957O0576n2329l1233j41385R7343N1658j01021
8765b04889l6798K20141j06986l50172q0985M12726R4930p2364J64508k77537
$$ plain form
8840 -70096 -150317 -172721 -25360 56998 -10742 -140391 -22919 38556 359546 540085 384149
8829 384149 240364 21900 -137725 81345 94352 146716 160562 229044 228770 31608 -262327
8818 -262327 -123938 195401 218098 184786 241023 79394 -189138 -256602 986 178344
8808 178344 114303 29800 213226 131081 89907 198762 216810 73901 -27896 6 -181182
8797 -181182 -363507 -281274 7193 226929 13254 -190418 -500486 -594456 -271112 116010
8787 116010 123959 -112205 -19735 -28891 41736 229635 573296 275985 -63828 -12204 89656
8776 89656 286526 292684 -100455 -88498 -27922 -80251 -111484 -252869 -155526 -103868 -204889
8765 -204889 -241687 -21546 -128532 -478704 -559689 -146963 -52033 -124397 40111 -237426
8755b37426l2362J79916R3428j62442l7346n5634j16831N9799k28176L9796J38876
8744c58402K34923m9072k10522J14417J07414J7112K73573P3505N8939j2077q2818
8733A66992k06017k90861R4386K18366m5687K59243J30011k95931j93482J62893
8723h7R2998J5895P6060J04186k83643j27203j16850J65129j18123j69532J88196
8712a72974K32506q9562M00546j96032n51180n5882O1852M43964K83957m6166
8702C11029k71115L3560k99750o5578J71813p3237J99856J32000O7219p6984R9964
8691B28777J53043O5082q9374k02776K2962K97974N6766k45060n615j79977Q4825
8680A86627J49128L42977m1852k12897m64507J8841K93492k21809l37749L87110
$$ plain form
8755 -237426 -269788 -89872 3556 -158886 -196232 -251866 -368697 -308898 -537074 -497278 -358402
8744 -358402 -123479 -172551 -383073 -268656 -161242 -144130 129443 202948 261887 249810 166992
8733 166992 -39025 -329886 -235500 -17134 -62821 196422 326433 30502 -162980 -87
8723 -87 92911 108806 184866 289052 5409 -121794 -238644 -73515 -191638 -361170 -172974
8712 -172974 59532 -30030 370516 174484 -376696 -432578 -370726 73238 357195 311029
8702 311029 39914 73474 -226276 -291854 -120041 -193278 6578 138578 205797 128813 228777
8691 228777 381820 446902 357528 154752 177714 475688 532454 287394 281779 101802 186627
8680 186627 335755 678732 636880 423983 -40524 -21683 271809 50000 -287749 99361
8670I9361M47205L7261L7995j02841k04449l45333J0828o6582L3588j34574m5913
8659b33454q7530p2991J28904K63370j12239k40915j12442L381J36425o4609j209
8648c93309j5894P5271j05792K5716M15048J53532o5095J45247Q6588r5383j51839
8637G4090l01712j16938j2312Q3939O6765R1395P9904k32942k6053J93519k5469
8626a25814o8602J5988K4799p864K1990j53862J36158p3208m06K34241j8183k86135
8614c00898j28299J72555N7200Q2500L2288p9941L5357L56932k12185k43281l5034
8603b62806P1994L38202r1085j7714m9511L7314j74167k95090O0026J4950J55267
8592b12620P4146k28551L5732O4705L4874R134l0530R9243L1073J1715J77815
$$ plain form
8670 99361 546566 583827 621822 518981 314532 -30801 -19973 -86555 -52967 -187541 -233454
8659 -233454 -320984 -393975 -265071 -1701 -113940 -354855 -467297 -463916 -327491 -392100 -393309
8648 -393309 -409203 -333932 -439724 -414008 1040 154572 89477 234724 321312 225929 74090
8637 74090 -227622 -344560 -356872 -272933 -206168 -114773 -34869 -267811 -293864 -100345 -125814
8626 -125814 -194416 -178428 -153629 -161493 -139503 -293365 -157207 -230415 -230821 3420 -14763 -300898
8614 -300898 -429197 -256642 -199442 -116942 -84654 -164595 -129238 227694 15509 -227772 -262806
8603 -262806 -190812 147390 56305 38591 -10920 26394 -147773 -442863 -382837 -367887 -212620
8592 -212620 -138474 -367025 -331293 -266588 -231714 -222580 -253110 -153867 -122794 -111079 66736
8581F6736J72264K18951l34110k74457K24182j31474k97853J65592O3418J91788
8571F5037J65114R5872p7254j52900L59388q2800m19059k6319k54269j26161L05513
8560a47838J06355o846k4102L1203N9850j5087P3139P0149J35685r2049j20334
8549G0125p4261L16321L43106l3615N5503k94158m30201j64661M17392k4280n5035
8538A26236j58383l79202q1999M84744M35931J53722o2251m711j16679j05840
8528B91568j40978k09295p3327J89471J05634J4228k16055J13064J07796j9118
8518A62988l2530n0667K01970j55571J58045N3049k21411L0613q3523l9784m4762
8507b1583L5212n8336k06384R7564K77520K32122L27403k51366k19413J40700
$$ plain form
8581 66736 239000 457951 123841 -150616 73566 -57908 -355761 -190169 -126751 65037
8571 65037 230151 326023 248769 95869 455257 372457 -46602 -72921 -327190 -453351 -147838
8560 -147838 -41483 -48329 -72431 -41228 18622 3535 76674 146823 282508 190459 70125
8549 70125 -4136 312185 655291 621676 677179 383021 -47180 -211841 205551 181271 126236
8538 126236 -32147 -411349 -493348 -8604 427327 581049 518798 514087 397408 291568
8528 291568 150590 -58705 -132032 57439 163073 177301 -38754 74310 182106 162988
8518 162988 130458 79791 281761 126190 284235 337284 115873 146486 62963 23179 -21583
8507 -21583 13629 -44707 -251091 -153527 123993 356115 683518 432152 212739 353439
8497C53439K08452p5121j05092k12921j13900j53844P168j47713m3064J89839
8487i2757r2055k256M3942o2150j79332j18320J67428J72762j43994r8410Q4658
8476c20484J67006J32566k7679J13543K54766n5493L2011J77757j47835j3019
8466C13139l2690j35840J10679j4988n8203k1319Q9616P8583j72481j67917L3871
8455B2450o061J7603J21158j04925k36432m5306j90534O36263L06696m28786j15418
8444b3292R9713l5268M6502K17331P941k49658P2599q3015m14529j03871R8623
8433c66924J70118K41544O0863O7679K40207O5855j71927j18873J42607r8442
8423B32707l7386n7448n4488k47795j53071N5478J83073O6002j79095k16960P1592
$$ plain form
8497 353439 561891 486770 381678 168757 54857 -98987 -91819 -239532 -282596 -92757
8487 -92757 -184812 -187068 -143126 -205276 -384608 -502928 -335500 -162738 -306732 -405142 -320484
8476 -320484 -153478 -20912 -48591 64952 319718 264225 296236 473993 326158 313139
8466 313139 280449 144609 255288 240300 182097 160778 250394 328977 156496 -11421 22450
8455 22450 16389 33992 155150 50225 -186207 -231513 -422047 214216 520912 92126 -23292
8444 -23292 76421 41153 87655 304986 312927 63269 135868 52853 -361676 -465547 -366924
8433 -366924 -196806 44738 105601 173280 413487 479342 307415 188542 331149 232707
8423 232707 195321 137873 83385 -164410 -317481 -262003 -78930 -12928 -192023 -408983 -337391
8412c37391J05315J51269P7905K8366J58557n9191l43782q690n4631J90548J30516
8401C8791j06052j24044j04683j0275P704J82698K06777K1989K7163j07353K32898
8390B65613L38059j58296j74877k5568j00428j13107M5488Q7049j93347p2190
8380a01604j8369m5593R6813O0090J81430n9484m67584K18122J55154q8190l06714
8369c75929m8993J78882j0805K31486J89853n813k28483k44841l1380J6370j07924
8358d37577K1372K14249K69310J19683l8589m656N090o7547M0400p4553j76877
8347a29695K54986r4291m03939J99408K74562O2325n5625k33652p3806K18450
8337A8723n4799Q2588J36040o3653m8828k54356m7995K82084P0930k19620l09010
$$ plain form
8412 -337391 -232076 -80807 -2902 25464 184021 124830 -218952 -227642 -282273 -91725 38791
8401 38791 -67261 -191305 -295988 -306263 -298559 -115861 90916 112905 140068 32715 265613
8390 265613 603672 445376 270499 244931 144503 31396 76884 163933 -29414 -101604
8380 -101604 -119973 -165566 -68753 -8663 172767 113283 -354301 -136179 18975 -69215 -375929
8369 -375929 -424922 -246040 -256845 -25359 164494 158681 -69802 -314643 -346023 -329653 -437577
8358 -437577 -416205 -201956 67354 187037 148448 143792 148882 81335 121735 47182 -129695
8347 -129695 125291 31000 -372939 -173531 101031 163356 107731 -125921 -199727 18723
8337 18723 -36076 46512 182552 118899 70071 -184285 -232280 49804 120734 -98886 -407896
8326d07896K10011k445l3788K38728R8218k92226N155K2672O0346j38324m3468
8315b83017Q5715l6322L7073K29657l2860k40581j77369J49117o6468P6961M0687
8304b17407L10356K9612K6400P4176N6622r5648k90492k28997m4327m91171k69925
8293a140801L50676O30258J50689p0412j04029P7997J13831r5489j88575J01479
8283a74376K10470M6962l18425l15589L3361M30708K99340K95531q1984j80436
8273B45562p6811m95592j17516L8237M42529L6464l04977M6181J21127j8534J93245
8262A09915m8887J3941q5311j16244k74513Q93j05724K70863K08024J68926J12205
8251B54088r6545P3309l46567q4462j70719J428K8377L6114q7019N6507J91480
$$ plain form
8326 -407896 -197885 -200330 -234118 4610 102828 -189398 -184243 -161571 -101225 -239549 -283017
8315 -283017 -197302 -233624 -196551 33106 246 -240335 -417704 -268587 -335055 -258094 -217407
8304 -217407 92949 122561 148961 223137 279759 184111 -106381 -335378 -379705 -870876 -1140801
8293 -1140801 -790125 -159867 -9178 -79590 -183619 -105622 8209 -87280 -275855 -174376
8283 -174376 36094 83056 -235369 -550958 -517597 -86889 212451 507982 425998 245562
8273 245562 168751 -326841 -444357 -406120 36409 72873 -232104 -185923 -64796 -83330 109915
8262 109915 61028 74969 -10342 -126586 -401099 -400206 -505930 -235067 -27043 141883 254088
8251 254088 157543 230852 -115715 -200177 -370896 -369468 -341091 -304977 -391996 -335489 -144009
8240a44009O1337N8145j53168J5606L10443j29847j4614j03245n4085J78435O6242
8229I1240o596o5020r7753J32053J13808J19973r4863k68686K57744l57523K9413
8218a46210P6996N7968K68976J56187o0766p4r2832k95067j27030K6636k22226
8207c57442J3216J36092q6416M3537k5527Q8939L46890l05652p6442Q1647K44009
8196A02851Q1517q3281K17664n9978j47264j5303j21614j34092M9356M0453j3942
8185h3633J25248J20870l0309k25523j19837J41439J41194j1124j44750K2142
8175f4283J8474J43004J0624k06584P1843K44002J65892l58935l47030r0167K86741
8164a26419K76391R2328n1860r9597j91294j31007O3567k43834k01407M18623
$$ plain form
8240 -144009 -82672 -24527 -177695 -162089 148354 18507 3893 -99352 -153437 24998 91240
8229 91240 84644 19624 -78129 53924 167732 287705 192842 -75844 181900 -175623 -146210
8218 -146210 -69214 -11246 257730 413917 353151 353077 260245 -34822 -161852 -135216 -357442
8207 -357442 -344226 -208134 -294550 -251013 -276540 -187601 159289 -146363 -222805 -141158 102851
8196 102851 184368 101087 318751 258773 111509 96206 -25408 -159500 -110144 -69691 -83633
8185 -83633 41615 162485 132176 -93347 -213184 -71745 69449 58325 -86425 -64283
8175 -64283 -45809 97195 107819 -98765 -26922 217080 382972 24037 -322993 -413160 -126419
8164 -126419 149972 242300 190440 90843 -100451 -231458 -167891 -411725 -613132 -194509
8154a94509L72529k03466L7106K29218q1273K54870O2313R7961o4201j23508m05734
8143a8694j65249m9481L78823j16651M4635P9476J96742K58035K6679j47119j57449
8132C29747j41190k26647j08548j34809L24588K9967j3865n068K17830J38340
8122D10345K9158N73j13876p9947o5352K2569j94372m6122J1760K42798r5309
8111A22225Q1627Q8217j83153K54785K47965o8718k73605M7652P888r5529R0691
8100C20045l9634k22727m81679l23371K12711K66649J58463O3911k7677j3370
8090h6679M4415k2408j84267j7520R5713J80030L4100j43898q1726J49802o4928
8079i7366J64940J94906n1776J25015o6816L8545j07279j17728j0990J52138P9225
$$ plain form
8154 -194509 178020 -25446 11660 240878 159605 414475 476788 574749 510548 387040 -18694
8143 -18694 -183943 -233424 145399 28748 73383 152859 349601 607636 634315 487196 329747
8132 329747 188557 -38090 -146638 -281447 43141 73108 59243 54175 272005 410345
8122 410345 439503 440076 326200 246253 180901 203470 9098 -37024 -25264 217534 122225
8111 122225 203852 292069 108916 363701 611666 542948 269343 316995 324883 229354 320045
8100 320045 280411 57684 -423995 -747366 -534655 -268006 -109543 -45632 -73309 -86679
8090 -86679 -42264 -64672 -248939 -266459 -170746 9284 43384 -100514 -182240 -32438 -97366
8079 -97366 67574 262480 210704 335719 268903 307448 200169 82441 71451 223589 302814
8068C02814j99802l69661k0999j5109K2790K89801L9488q0024J9728K20100J38713
8057C47839k45247n4599q4744j85543Q0039N5116J00514K73382o9223j55748j7629
8046D4157m9717j61983j46659l59164K64169M07452l27595k54762m612J70765
8036d17949L19930L18625J65166n1070j58002m28751l25702k00347K16693J26008
8026d35399K76182j77250j72063K17998K46680k2641k82242J85208Q9445k37820
8016c11902M4158m8147J14548J05530J9535N0924P7902M4824k38154j62863J72832
8005a30813J93325K3580k5681M9751J28078K794l8396O1506O1764p5473j30935
7994A19500j07328r5141j96570k46762K76345K71142M1007k80864L14849J85175
$$ plain form
8068 302814 103012 -266649 -287648 -302757 -279967 9834 49322 -30702 -10974 209126 347839
8057 347839 102592 47993 -36751 -222294 -142255 -87139 13375 286757 217534 61786 44157
8046 44157 -5560 -167543 -314202 -673366 -409197 -1745 -329340 -584102 -588714 -417949
8036 -417949 -98019 220606 385772 334702 176700 -252051 -577753 -778100 -561407 -435399
8026 -435399 -159217 -336467 -508530 -290532 -43852 -66493 -348735 -163527 -74082 -311902
8016 -311902 -267744 -315891 -201343 -95813 -76278 -25354 52548 97372 -140782 -303645 -130813
8005 -130813 62512 86092 60411 110162 238240 241034 202638 264144 325908 250435 119500
7994 119500 12172 -82969 -279539 -526301 -249956 21186 62193 -218671 96178 281353
7984B81353j37524q2636J48585k23630k71668K13152r7830n5632P7732j92131
7974c40229k30244M6057J59118J92193k4052J19487q7314j79055K0350J76662
7964a47027J18573m3074j43962J31572J27456M1303r8337n253j10617O0112o866
7953g6120p3547J39807l6708O2669J83589K96068Q4947k09869j56359o781k11024
7942c328j15124J42060k69818j75083M65435J99614j13441n9147o5217K1656L1535
7931E9142N067m87867j03260K37028L81295M4268j76644j52571q9205Q6719O583
7920a89445J19895L811p8655K5065n5346l4434Q297j06694J84200K05518m6412
7909C5800k28284j5638K16613L37160j89011J72717R8240j26770O4108r2288j79402
$$ plain form
7984 281353 143829 61193 209778 -13852 -285520 -72368 -170198 -225830 -148098 -340229
7974 -340229 -570473 -524416 -365298 -173105 -197157 -77670 -164984 -344039 -323689 -147027
7964 -147027 -28454 -71528 -215490 -83918 43538 84841 -13496 -18749 -129366 -69254 -76120
7953 -76120 -149667 -9860 -46568 16101 199690 495758 580705 370836 214477 207696 -3328
7942 -3328 -118452 23608 -246210 -421293 44142 243756 130315 71168 5951 27607 59142
7931 59142 64209 -423658 -526918 -289890 91405 135673 -40971 -193542 -282747 -196028 -189445
7920 -189445 -69550 -65739 -144394 -119329 -174675 -209109 -200812 -307506 -123306 82212 35800
7909 35800 -192484 -208122 8491 345651 156640 329357 427597 300827 364935 272647 93245
7898I3245O3044J59961P8145M06158K7362l07997l38231q7623K54101O97j03062
7887B45800j48461o9107r6459j17935j40115J65087J23186K37715J69266m5181
7877C23796j40189j75644n76737k82921K85822J64354k25170p5092J6370J12124
7867e73287L03944J0559R4703p5478o0942M8747N1772m387K22065J93563k36994
7856b5735k55587L5348O1277J52108M5796J48548k71308j28302p139J2080J52754
7845h0160N9089Q184K05033K17451J14269j48791k3698L34436O3928l93407l45689
7834A0645l97396K43073J16961j98777J92927O0240P9094k08486q3327O6849j75266
7823b93463K42203n0805J86291L26682N936l60061k49867J38057P3966K938j25124
$$ plain form
7898 93245 156289 316250 394395 800553 827915 519918 181687 94064 348165 348862 245800
7887 245800 97339 28232 -68227 -186162 -326277 -161190 -38004 199711 368977 323796
7877 323796 183607 7963 -568774 -851695 -565873 -401519 -626689 -701781 -685411 -573287
7867 -573287 -269343 -258784 -164081 -239559 -300501 -251754 -199982 -204369 17696 211259 -25735
7856 -25735 -281322 -245974 -184697 -32589 13207 161755 -109553 -237855 -244994 -232914 -80160
7845 -80160 -21071 -12887 192146 409597 523866 375075 351377 685813 749741 356334 10645
7834 10645 -386751 -143678 -26717 -225494 -32567 27673 106767 -101719 -185046 -118197 -293463
7823 -293463 -51260 -102065 84226 410908 416844 56783 -193084 -55027 18939 21877 -103247
7812a03247k94318K08891J4366n078J61035K5017r2830k37651k67426J86747P0881
7801c33613j28187J88271q7934J22538R3498q6694L40986P6882k73702J33204
7791D5249J29929K5769Q9551j35070O2696o6391k3842J73854K42823r3875p6471
7780C74222m0504j87613O5114J13559k03215k30289Q6137J08046J21697p1983
7770A35171k63328J2920J55477K15638J50437P8100l15564K06239k5907j88760
7760A60423L0707L47750k4689k58338l2022r9453r5861j52508J24864j31454j49574
7749b80155R7494o7150R4857k1809N53087K13393K6042j94982j80547q4251k12765
7738e6786j10706j28525l9561O46K77455K39323J32047k26719r7463J53856O045
$$ plain form
7812 -103247 -397565 -188674 -174308 -179386 -18351 6666 -86164 -323815 -591241 -404494 -333613
7801 -333613 -461800 -273529 -361463 -238925 -145427 -232121 108865 185747 -87955 45249
7791 45249 175178 200947 290498 155428 218124 151733 127891 301745 544568 450693 374222
7780 374222 333718 146105 211219 324778 121563 -108726 -22589 85457 207154 135171
7770 135171 -128157 -115237 40240 255878 406315 484415 168851 375090 349183 160423
7760 160423 191130 538880 514191 255853 223831 124378 28517 -123991 873 -130581 -280155
7749 -280155 -182661 -249811 -154954 -176763 376324 589717 615759 420777 240230 155979 -56786
7738 -56786 -167492 -296017 -335578 -334932 -57477 181846 313893 87174 -10289 143567 149612
7727A49612l5867j25984n0306M4715m4760k67963J52318J77295J3410K64282J6645
7716B93397p7389k0248K0084k68494k17770j89151j02256J58359M01633P1362
7706F9527q7761j10357k02957J33652K06584Q7822J52051j57188q3748j52171
7696a44546l20445j8434L23687M70414K61000l17788k78368o2260n8511J95959
7686E0708j57916j75247J00146K0111k471J85827J20199M1436j76829o5901j71240
7675b31177R1967K20311o4848n5615O3893L5834J41584K87239k74531k80758K1277
7664d4824J00797K49300J5928m4853j18282k14029J68646j6745j38469Q9214J40994
7653A87677Q2167J60344q1798j03674J33294p7489R1765N8136k20920j118l11879
$$ plain form
7727 149612 113745 -12239 -62545 -17830 -62590 -330553 -178235 -940 12470 276752 293397
7716 293397 216008 195760 215844 -52650 -270420 -459571 -561827 -403468 -1835 69527
7706 69527 -18234 -128591 -331548 -197896 8688 96510 248561 91373 7625 -144546
7696 -144546 -464991 -483425 -159738 310676 571676 253888 -24480 -86740 -145251 50708
7686 50708 -107208 -282455 -182309 -162198 -164669 21158 141357 182793 5964 -59937 -231177
7675 -231177 -139210 81101 16253 -39362 24531 60365 201949 489188 214657 -66101 -44824
7664 -44824 55973 305273 321201 276348 158066 -55963 112683 95938 -42531 46683 187677
7653 187677 269844 430188 348390 244716 378010 300521 392286 450422 229502 228384 -83495
7642h3495K2575j29432k81385k8777K60509R5745o9859j33987P6314K14811j7935
7631g4916N5318j714J72950N4594j58281j30176K9810j96481j03086j5616J95890
7620a71708Q2100k48169J03738J1142j89309K84577M12871J07674l18828K044
7610G6132J8702J31586j41509Q1495J48880j7921k62300O0132M7057j8341m9909
7599G4004j3646L8404n3667k30016J34107J69940l85m3714j10392j50503M3975
7588a41893j47410k0718n9537L33150Q4518j85216j77586n7448J3646q876J96926
7577a70444J02138j04468j95189J9752K11686Q3117Q5978P7611J11598J97294
7567D19073P5125j09034O5054R1368q5558l05658k25572J73175J6831k78627J34669
$$ plain form
7642 -83495 -60920 -190352 -471737 -500514 -240005 -144260 -214119 -348106 -271792 -56981 -74916
7631 -74916 -19598 -21312 151638 206232 47951 -82225 -52415 -248896 -351982 -367598 -171708
7620 -171708 -89608 -337777 -234039 -222897 -412206 -127629 285242 392916 74088 76132
7610 76132 94834 226420 84911 166406 315286 297365 35065 95197 142254 123913 74004
7599 74004 60358 98762 45095 -184921 -50814 119126 118741 75027 -35365 -185868 -141893
7588 -141893 -289303 -310021 -369558 -36408 48110 -137106 -314692 -372140 -358494 -367370 -170444
7577 -170444 -68306 -172774 -367963 -348211 -136525 -53408 32570 110181 221779 419073
7567 419073 494198 385164 450218 541586 456028 150370 -75202 97973 114804 -163823 -29154
7556b9154K93320j99060j25493j16728N1585p0525k7861K23387r662j34306n8123
7545b02620N3654j9917j74375M8706K54614K17791J11983j05097M9386j68830
7535F5295q3934K5629K7505J03202P1288M5011J7013J35293j85926j88022M5555
7524G7909q1865M8561j68305k01040k05367L39828k5605R3668K15938l57560k63943
7513e27781N6429O1265R6121j19196J12909J21375N3319O4370o3573J53254j6428
7502g936K4936j15508O7742p9755J15576j39326p5579L7032K94761J57988r119
7491B70812j52387l7161r1588j32266J37831J6949m625j68029j14353K56999l0762
7480d8580K64852J48213j60508n9042N4387p9375j99742M6005k0679J09148K18279
$$ plain form
7556 -29154 264166 65106 -60387 -177115 -125530 -196055 -223916 -529 -10191 -144497 -202620
7545 -202620 -148966 -168883 -343258 -294552 -39938 177853 289836 184739 234125 65295
7535 65295 -18639 6990 34495 137697 208985 253996 271009 406302 220376 32354 77909
7524 77909 -3956 44605 -123700 -324740 -530107 -190279 -215884 -122216 93722 -263838 -527781
7513 -527781 -471352 -410087 -313966 -433162 -320253 -198878 -145559 -81189 -144762 8492 -7936
7502 -7936 17000 -98508 -30766 -110521 5055 -134271 -209850 -172818 121943 279931 270812
7491 270812 118425 81264 -10324 -142590 -4759 12190 7565 -160464 -274817 -17818 -48580
7480 -48580 216272 364485 203977 144935 199322 119947 -79795 -33790 -54469 54679 272958
7469B72958k00436m25667j30823M1378J70953j80157N7436J44816j19235K36916
7459a31861m4478L3594J59077K24656J62689q3342k17836j70857j76827J4706
7449b30479J95924Q1495J22593j0636J34832r0736j03077Q3024k16296M8981J718
7438A7343J33540J10909j71738j27412p714K02577q1497O4231n1845j66163P7702
7427f7P5871J74529O8678M979j14359k05694K53969p7243o4065m8698M0005J95410
7415C03315j16007m11524l56457O7673K59396K36901K25460K35532J04008k21948
7405C26349J03154k34793L1072n1925o3494J63090j55672j46548J02656J86745
7395B60634K9615Q7211K31064n4140P6930n8258l21957k25883j06228o4413K03257
$$ plain form
7469 272958 72522 -353145 -483968 -442590 -271637 -451794 -394358 -249542 -368777 -131861
7459 -131861 -176339 -142745 16332 240988 403677 320335 102499 -68358 -245185 -230479
7449 -230479 -34555 46940 169533 158897 293729 202993 99916 182940 -33356 15625 17343
7438 17343 150883 261792 90054 -37358 -45072 157505 76008 140239 88394 -77769 -67
7427 -67 75804 250333 319011 323990 209631 3937 257906 180663 116598 67900 107905 303315
7415 303315 187308 -224216 -580673 -513000 -253604 -16703 208757 444289 548297 326349
7405 326349 429503 194710 225782 173857 110363 273453 117781 -28767 73889 260634
7395 260634 290249 377460 608524 554384 631314 573056 251099 25216 -81012 -145425 57832
7384E7832n2646J15446K10487j47048l30666q6482k20340J47827J18068J5869
7374a71653K233K43194L16579j50428k63733K36433L8379j02915Q3573J18835
7364C50497j65032P190r7821n7506J95330M5701q0570q2876J2042j08749j20116
7353a01910J84393K41077m7650r2000k23272p0090o0628J56496J3216k53792k27876
7342d82036J49260O1636j20596j0771L44647J45271k6036K385j68159j23286j74883
7331d02568k47357M7729O1787O5912K8385R2095q3550L01535m1712K66296L41312
7320D29864J7135j93168r5664p9598J43547J04340j09834j97179j07722n4646
7310a42925q3236J35983m0084j31274L131L02275J06732K13910j84522j87019
$$ plain form
7384 57832 5186 120632 331119 184071 -146595 -233077 -453417 -305590 -187522 -171653
7374 -171653 -169420 73774 390353 239925 -23808 212625 251004 148089 231662 350497
7364 350497 185465 192655 94834 37328 232658 278359 197789 114913 126955 18206 -101910
7353 -101910 82483 323560 275910 183910 -39362 -109452 -170080 -13584 -368 -254160 -482036
7342 -482036 -332776 -271140 -391736 -402507 -57860 87411 61375 63760 -104399 -227685 -402568
7331 -402568 -649925 -602196 -540409 -474497 -446112 -354017 -437567 -136032 -177744 88552 429864
7320 429864 446999 253831 158167 78569 222116 326456 216622 19443 -88279 -142925
7310 -142925 -226161 -90178 -130262 -261536 -258405 43870 150602 364512 179990 -7029
7300g029r0913J28658J90928j87967P6408n2739j09013K8900p4851j60377j93105
7289d51100j66085J50237K74565K43069J2606o3058M5062L9526R5217N7283k20127
7278A7195l09940k3606L56168J77423j40215j48560j98577R8925K67808J00331
7268A96952J00300j62129k40516j46370J9146j07084Q6251r3598l0953J53065
7258b24936K55807l7326N2819K7134o5962r5501L7050K02867q0433r2466J1910
7247i037o7956L16522J38478j12554l4411k16403j15295j35291n5609N4223O4113
7236a73220L09538L25183j17005K03213J7960l77268n22585r6479k1660l67546
7226h19869L17384M41572J18054j73119m9303K64511n6626j73899m8805o4081
$$ plain form
7300 -7029 -97942 30716 221644 33677 110085 57346 -51667 -22767 -97618 -257995 -451100
7289 -451100 -617185 -466948 -192383 50686 63292 234 45296 84822 180039 237322 17195
7278 17195 -292745 -316351 39817 217240 77025 -71535 -270112 -171187 96621 196952
7268 196952 297252 135123 -105393 -251763 -232617 -339701 -253450 -347048 -378001 -224936
7258 -224936 30871 -6455 46364 73498 7536 -87965 -50915 151952 71519 -20947 -9037
7247 -9037 -76993 239529 378007 265453 231042 14639 -100656 -235947 -291556 -237333 -173220
7236 -173220 136318 461501 344496 547709 565669 188401 -334184 -430663 -452323 -819869
7226 -819869 -502485 -60913 57141 -115978 -165281 99230 42604 -131295 -180100 -244181
7216b44181l8640L5162J97816K12060k31025l56169L46981J15364J03746j19094
7206B2020k52992M6008r1190j12077P3931r5364L452j68346J32945r3756J25052
7195d10317J05703p4133o7959p3600K9461M8287L11759J06475q8300j17326q5933
7184c15883R3850M4385P9010o7358j58117k44037j89286O5805L62460K10246K03031
7173H4106l7113K77461J68730j81059k96139j41460l989o9960K61708J28863J14128
7162C05276J32276j32455n2113k57915l2346J75039J09173m6817p1243L9833K93381
7151D62089L2672n07702m33480K10150K78622J31566p1873j98532J31293r5578
7141f0773K65737J75537P471j87766j52807k0845j07883J25825L21973j63207
$$ plain form
7216 -244181 -282821 -247659 -49843 162217 -68808 -424977 -77996 37368 141114 22020
7206 22020 -230972 -184964 -276154 -388231 -314300 -409664 -406212 -574558 -441613 -535369 -410317
7195 -410317 -304614 -378747 -446706 -520306 -490845 -442558 -130799 -24324 -112624 -229950 -315883
7184 -315883 -222033 -177648 -98638 -165996 -324113 -568150 -757436 -691631 -329171 -118925 84106
7173 84106 46993 324454 493184 312125 15986 -125474 -129463 -199423 62285 191148 305276
7162 305276 437552 305097 252984 -4931 -37277 137762 246935 200118 128875 168708 462089
7151 462089 494761 -12941 -446421 -236271 42351 173917 102044 -96488 34805 -60773
7141 -60773 204964 380501 387972 200206 47399 26554 -81329 44496 366469 203262
7131B03262l5416j74317K03727p0252n5484J2751k69564j0077N8986Q3015J92146
7120A38777M7302k53445o9426K07079k90859j32605J37561m255l1892q5653L40078
7109B662K4346k50703l35151J49690K73363L0699J4764j56839M648J95661K45644
7098A98784n4340j00682J323k50756j71577n148K86473P1546n4593J30491R7185
7087A48706j41704j11969j93263j50868q7463O2746L05299M1558P0318J11239
7077E4599P6067m6560j90890q8678j1773K42327j21493J7176J67368j99191j30931
7066b31979p534N8520q4837l98740J95711J17280K63714O155m865R5801k4119
7055a4893k22333K04526k18550o750n9416N5279L69228J1307k61973n3725j9632
$$ plain form
7131 203262 167846 -6471 197256 127004 71520 84271 -185293 -195370 -136384 -53369 138777
7120 138777 186079 -67366 -136792 70287 -220572 -353177 -215616 -219871 -251763 -337416 2662
7109 2662 27008 -223695 -558846 -409156 -135793 -105094 -90330 -247169 -242521 -46860 198784
7098 198784 144444 43762 45085 -205671 -377248 -382396 -95923 -24377 -78970 51521 148706
7087 148706 7002 -104967 -298230 -449098 -536561 -473815 -168516 -126958 -56640 54599
7077 54599 130666 84106 -106784 -195462 -207235 35092 -86401 -69225 98143 -101048 -231979
7066 -231979 -239513 -180993 -265830 -664570 -468859 -351579 -87865 -81710 -86575 9226 -14893
7055 -14893 -237226 -32700 -251250 -258000 -317416 -262137 107091 118398 -143575 -197300 -216932
7044b16932o9423J21041K2829K06271J76926j67784l24617r0474J91835J42277
7034h051m7870j13056J6199l1437N2323J41584J58162j68714J47418j1438j68854
7023c3734j06481J39350J32579r0840J69680O1731j43235R8768K19020Q250j0601
7012D44487J52988m6352l27616l0697j92123m3429j9100J0594K9262o0478k8655
7001a11119k36089N102K0810J702J09844Q1031r4472l10796r1216K13544M7915
6990c63744J88799O0769j84119j23402p0776P5515P4558R5150o5391O4894k3730
6979b71477l4088J26136K0313K44851j04241J4746L51596L64761L5555k41189
6969E06963k27561K8712k1077k52490r4110L1173j04638J97216k02101J2287j6093
$$ plain form
7044 -216932 -286355 -165314 -142485 63786 240712 72928 -251689 -342163 -150328 -8051
7034 -8051 -55921 -168977 -152778 -184215 -131892 9692 167854 -860 146558 135120 -33734
7023 -33734 -140215 -865 131714 40874 210554 272285 129050 227818 446838 455088 444487
7012 444487 597475 551123 223507 192810 687 -42742 -61842 -51248 -21986 -82464 -111119
7001 -111119 -347208 -342106 -321296 -319594 -209750 -128719 -223191 -533987 -625203 -411659 -363744
6990 -363744 -174945 -114176 -298295 -421697 -492473 -416958 -342400 -247250 -312641 -247747 -271477
6979 -271477 -305565 -179429 -159116 85735 -18506 -3760 347836 712597 748152 506963
6969 506963 279402 308114 287037 34547 -59563 -28390 -133028 64188 -137913 -125626 -141719
6958a41719J11835J30775J71778l6085k03204J47053K0452M2714j77234L1819
6948I8184k10580k84131j41371k5467J5850L6237o3026J47037j46733j56291L18219
6937d12072J90389r995J57264J5360j95032K54197J50233j11759j14836n3305
6927a29556Q6536j2817j26122r7385j18321L6260J83916K61779K77503l71312
6917i519k41202J51444J02408N0047m7235J5534K49735L05959l7766k07224k14316
6906A17865j14327J53804j48801k12976r224O674k6015K75745r3229j03029O4839
6895h8674K35314J20980j49108m5459j74722q6452j67381L55676L79511q5103
6885B94582k03632k82957p1266K15507K25890q015j26705L5654o7174j46655q5963
$$ plain form
6958 -141719 -29884 100891 272669 236584 33380 180433 200885 243599 66365 98184
6948 98184 -112396 -396527 -537898 -563365 -547515 -511278 -574304 -427267 -574000 -730291 -412072
6937 -412072 -221683 -231678 -74414 -59054 -254086 111 150344 38585 -76251 -129556
6927 -129556 -43020 -55837 -181959 -279344 -397665 -361405 -177489 84290 361793 -9519
6917 -9519 -250721 -99277 3131 53178 5943 21477 271212 577171 539405 332181 117865
6906 117865 3538 157342 8541 -204435 -213659 -206985 -233000 42745 -50484 -153513 -88674
6895 -88674 146640 267620 118512 73053 -101669 -188121 -355502 174 379685 294582
6885 294582 90950 -192007 -263273 -47766 178124 170109 43404 79058 11884 -134771 -220734
6874b20734k16593r6503m1787K69678N8512L4244L9457Q7273j66077Q9188N5720
6863a07622J74329O9990P10M8575r7324j45816J11153K88053J09815j02947j37721
6852B11195j48972j9088K88634k46122m41440k44126M7266K21987K64079K32813
6842A66226l056j81514j90945r8908p6649O2676J20814K08536J63757j31559j03672
6831f4294k03569M8770n5852j52664l6318j28110K41119K61794j4318P2153Q1244
6820D9955L4789J66794q3787j1411n25285J28697J09678P751k45118j16729K32194
6809b52472J17044M95495K67728l4132k71788l53909P2583K22424j41049k74113
6799a52189J27371P6668l4017K1994J08430j39467J1127J32327R7048N1003j8331
$$ plain form
6874 -220734 -437327 -533830 -575617 -305939 -247427 -213183 -173726 -86453 -252530 -163342 -107622
6863 -107622 66707 136697 137407 185982 88658 -57158 53995 342048 451863 348916 211195
6852 211195 62223 43135 331769 85647 -355793 -599919 -552653 -330666 -66587 166226
6842 166226 163170 -18344 -209289 -308197 -384846 -322170 -201356 7180 170937 39378 -64294
6831 -64294 -267863 -219093 -274945 -427609 -463927 -592037 -350918 -89124 -103442 -31289 49955
6820 49955 84744 251538 167751 156340 -368945 -240248 -130570 -122819 -367937 -484666 -252472
6809 -252472 -135428 360067 627795 593663 321875 -32034 40549 262973 121924 -152189
6799 -152189 -24818 51850 17833 39827 148257 8790 19917 152244 249292 300295 281964
6788B81964q5347j75845R4008j4564J06891R9624L850l3402k53044j37938J64232
6777E0429J38857r0260k12567O6858N46916K582k88374k29795L9198j57640l470
6766a37266K61720j74372k39616r4529r8482j6455L02411L4142L9065J7235n3337
6755a59484N4994j44533K2468J29961P8691j00838N0167K81856R0249j89512j20311
6744f292q3437j0544M8554k9017k98442j36701J77590J22164j08644j02554N9918
6733c67405M4090k7356j7739K32277J68601P0656j02982K15834j40957k68406
6723a93387k9864L50645O1354O7711N022n5447k97772j64044j50379K14471O2369
6712a29321k90636j4087P7030J18118J13978J12606j1236j85459n9334K21039
$$ plain form
6788 281964 196617 20772 114780 100216 207107 306731 310581 277179 24135 -113803 50429
6777 50429 189286 99026 -113541 -46683 500233 502815 214441 -15354 23844 -133796 -137266
6766 -137266 124454 -49918 -289534 -384063 -482545 -499000 -196589 -162447 -123382 -106147 -159484
6755 -159484 -104490 -249023 -226555 -96594 -17903 -118741 -68574 213282 303531 114019 -6292
6744 -6292 -89729 -100273 -51719 -80736 -379178 -515879 -338289 -216125 -324769 -427323 -367405
6733 -367405 -323315 -350671 -368410 -136133 32468 103124 142 215976 75019 -193387
6723 -193387 -223251 127394 188748 256459 261481 206034 -91738 -255782 -406161 -191690 -129321
6712 -129321 -419957 -434044 -357014 -238896 -124918 -12312 -23548 -209007 -268341 -47302
6702d7302J28744r0805n9240J32099R2911L3292J04387k6l85197L46K9785l1402
6690i2408K9739j81344k73434L4298Q3493J00315k0723J85133P3826j27689J12499
6679g6295K57475P206j75280k21312k24037r955k6465J47687K60343K1978O6176
6668B7521k80032k03210j0081R0554K58096m1447O7495j0859N5019n1466k91070
6657c89480j58981J21451p5788K59028K15268L03071j04231k29877r2605K09915
6647E7771J75521J01720J03367n5002l3143j2560m08046j64065j7272K94696K46323
6636B89310P4354q5970j07829j35550K22252L4366j8751J6592l31231r4607K70296
6625A33232l58979O7895K60545J06105N1754J07777j63945K2918j13193k47089
$$ plain form
6702 -47302 81442 -9363 -68603 63496 156407 189699 294086 294060 -91137 -90791 -61006 -92408
6690 -92408 -62669 -244013 -517447 -483149 -399656 -299341 -320064 -134931 -61105 -188794 -76295
6679 -76295 181180 188386 13106 -208206 -432243 -442198 -468663 -320976 -60633 -38655 27521
6668 27521 -252511 -455721 -465802 -375248 -117152 -158599 -91104 -101963 -46944 -98410 -389480
6657 -389480 -548461 -427010 -502798 -243770 -28502 274569 170338 -59539 -152144 57771
6647 57771 233292 335012 438379 383377 350234 337674 -70372 -234437 -251709 42987 289310
6636 289310 363664 277694 169865 34315 256567 290933 272182 288774 -42457 -137064 133232
6625 133232 -225747 -157852 102693 208798 260552 368329 204384 227302 114109 -132980
6615a32980J34515K75761j57318j30184L9352J65523J74126j16908l59779L752
6605a04140K56302M99818M2249j42604l62806m00932J24256O0713M8260R0678
6595A11794J05912j12147k01656k33378j37691K4982J70398K12848K57039j82816
6585A5285j98310M2594J76564o6857j1631J24589J654j63718j12034L95735J35053
6574C38924j84863l17464J26100N2023J19021k15892j77435q6313j31630J75128
6564c02401L34346L62942N6432n29673k31288J79775k0447o3067M1180J23286
6554d8915K30225Q2714j79370q761K13421R4328k35260J22587P7578O6234r2646
6543C22135k50837k00336k8643j66785K15196J9545l81064R9986J88279m9940
$$ plain form
6615 -132980 1535 277296 119978 -10206 29146 194669 368795 251887 -107892 -104140
6605 -104140 152162 651980 694229 551625 188819 -212113 -87857 -27144 21116 111794
6595 111794 217706 105559 -96097 -329475 -467166 -442184 -271786 -58938 198101 15285
6585 15285 -183025 -140431 36133 -30724 -42355 82234 83888 -79830 -191864 203871 338924
6574 338924 154061 -163403 -37303 14720 133741 -82151 -259586 -345899 -477529 -302401
6564 -302401 31945 394887 451319 -78354 -309642 -129867 -150314 -213381 -172201 -48915
6554 -48915 181310 264024 84654 75893 289314 383642 148382 270969 348547 414781 322135
6543 322135 71298 -129038 -157681 -324466 -109270 -89725 -470789 -370803 -182524 -232464
6533b32464j54608m8943K81962O2722J35402j7313K1833j3780o486M6121J0147
6522H4593J25128k54669n2643K16762K62135k39711j13604p1180j68934L34848
6512A22725K84734n4517j0707q829k87869l58053K76726J80565j09358j118k7020
6501G279J22044K46948p772M4974k67852l59760j38879J77096j62325j86977K07636
6490c17588J45394M2077K98738K96006j1800k454k3816M8989j81616l01462J87739
6479A80207J02781k35528j72808r1071j75442r3170O3572J69622j78551J18138
6469c12250K49830j9551m1300n3982k6867O80K97796K9281k07407r0919p6835
6458b51524J70211L15374l3239j76656k03721L23851J39219j67083j65624Q603
$$ plain form
6533 -232464 -387072 -436015 -154053 -91331 44071 26758 48591 34811 28325 74446 84593
6522 84593 209721 -44948 -97591 119171 381306 141595 27991 -43189 -212123 122725
6512 122725 407459 352942 342235 333406 45537 -312516 -35790 144775 35417 34299 7279
6501 7279 129323 376271 368499 413473 145621 -214139 -353018 -175922 -338247 -525224 -317588
6490 -317588 -172194 -130117 168621 464627 452827 450373 426557 475546 293930 -7532 180207
6479 180207 282988 47460 -125348 -216419 -391861 -485031 -421459 -251837 -430388 -312250
6469 -312250 -62420 -81971 -123271 -177253 -204120 -203440 94356 123637 -83770 -174689 -251524
6458 -251524 -81313 234061 200822 24166 -179555 144296 283515 116432 -49192 -40589
6448d0589k7956j19265j62468j58069j45998J15507J01394J61119J01069J52019
6438b3237K1335K26160r220l52808P2400J90917J53352J9018r9468l00097k43709
6427c45357k7099L78194o5837k10244j43783M7189J99791K24922j69476m02686
6417e14386J96718J24623J99506K3588L3414j91818R0281J44663l514R5847L33118
6406E32040o2534l58859k92395L77671j31738j77594n3726o0623N409R4715J48312
6395B0678l2752j61213J74577J71389n09316k6682L33028J36573K48590l9689
6385C15183j62511L08796m5561l8084m5561k20072J19574P1918p7696J13588J34143
6374D73717q0815o0924n1318K9006L0321j59283m6512P974R1977l5986j47740
$$ plain form
6448 -40589 -68545 -187810 -350278 -508347 -654345 -538838 -437444 -276325 -175256 -23237
6438 -23237 -1902 224258 215038 -137770 -65370 125547 278899 297917 198449 -101648 -345357
6427 -345357 -372456 5738 -60099 -270343 -414126 -366937 -167146 57776 -111700 -514386
6417 -514386 -317668 -193045 6461 30049 63463 -128355 -38074 106589 103075 198922 532040
6406 532040 469506 110647 -181748 195923 64185 -113409 -167135 -227758 -222349 -127634 20678
6395 20678 -12074 -173287 1290 172679 -336637 -363319 -30291 106282 354872 315183
6385 315183 152672 461468 415907 377823 332262 112190 231764 303682 225986 339574 473717
6374 473717 392902 331978 280660 309666 339987 180704 134192 142166 234143 198157 50417
6363E0417j55286m4279M42663R2839k01698K00906K05497j78668m05399j39522
6353a32530P7495L72215M2563k19160j15949j31823k36312q8351L3587k4888L05957
6342a17196P3710j75084l66827o615K16765K86194J43144R4047n2744l2037j22812
6331e9455j00506R9529J23625j04642n7045J58144j74316l59475p0258P36504
6321A92105O3622j20491k11369k00733K2747J82540j98791p5327O601n1459L9882
6310c50673K99858K02871k49701j82320L2607l192j0969J66217l07177J2992K30031
6299a59456K23430j02272q6153L32314J9044j87727p8761j00762j00542J08659
6289a32226J32014P0331P9450K3327j52873n7997j82260q5410k84618k0546M27288
$$ plain form
6363 50417 -104869 -149148 293515 386354 184656 385562 591059 412391 6992 -132530
6353 -132530 -55035 317180 359743 140583 24634 -107189 -343501 -431852 -398265 -423153 -117196
6342 -117196 -43486 -218570 -585397 -592012 -375247 -89053 54091 148138 95394 63357 -59455
6331 -59455 -159961 -60432 63193 -41449 -98494 59650 -114666 -474141 -544399 192105
6321 192105 255727 135236 -76133 -276866 -254119 -71579 -270370 -345697 -339096 -390555 -350673
6310 -350673 -50815 152056 -97645 -279965 -247358 -250550 -261519 -95302 -402479 -389487 -159456
6299 -159456 63974 -38298 -124451 207863 226907 39180 -39581 -140343 -240885 -132226
6289 -132226 -212 70119 149569 172896 20023 -37974 -220234 -305644 -590262 -610808 -183520
6278a83520K38025M5768Q3413r884k25536J56402j4371k65588K35964n2348J5805
6267B4130j01670Q7506K33499p3239j52768j75331k40080r2307K1982l21134j31948
6256i21360J03856J54279J05536R4288o5060j31875J8853N2929k7431J93398J48763
6245b73824Q6478J39370o8895m02638j87772p2155O9770M23367Q7562J35768J82966
6234A19997J06027p8082K060K617N2889j6835j25327J11410J06386J09852o4669
6223C26325L3555L3328j26627K50326r61k19492k99682J18123m4366j33861j34769
6212a98101K94744K44015n685j36320J87234J03529k13439k20780j57295K3313
6202g8785J13251j19886j8190K38625P952j5384P3719J31933K63116k94246m29651
$$ plain form
6278 -183520 54505 100273 183686 173802 -51734 104668 90297 -175291 60673 8325 24130
6267 24130 -77540 9966 243465 170226 17458 -157873 -397953 -490260 -468278 -789412 -921360
6256 -921360 -817504 -663225 -557689 -463401 -528461 -660336 -641483 -588554 -615985 -422587 -273824
6245 -273824 -187346 -47976 -116871 -519509 -707281 -779436 -709666 -286299 -198737 -62969 119997
6234 119997 226024 147942 150002 152619 205508 188673 63346 174756 281142 390994 326325
6223 326325 359880 393208 266581 516907 515946 296454 -3228 114895 70529 -63332 -198101
6212 -198101 96643 340658 334973 198653 385887 489416 275977 55197 -102098 -78785
6202 -78785 34466 -85420 -103610 135015 142967 127583 201302 333235 596351 302105 -127546
6191a27546l2836M6347J39770j01332N6734L50344l02293J91298P6557L3658k05144
6180A25557j86912j62318Q3604J35023o1194L41849k1641r3495k45423k4569J81481
6169G1962k56721k44257J75698l3424q7574o7163M82118J05213m56357k3956K01619
6158a32842L73222K02875O9640j5106l61379l555J593q2684Q223q538p1977O3958
6146D3430q6695m8140k22020r3065M5142R1333m9288J94151J57431j70730j54478
6135b92929J95468J02026n2713O8839Q2146k02697k65833J86301M2813l9331p8504
6124b54414J64109o016M6913Q1870l21981j37833q5266L74559N685O1830m6534
6113a17078J32261K06374J76252j43666k29126m6592Q1685K79797j83711j41476
$$ plain form
6191 -127546 -160382 -114035 25735 -75597 -18863 331481 29188 220486 297043 330701 125557
6180 125557 -61355 -223673 -140069 -5046 -66240 275609 253968 160473 -84950 -109519 71962
6169 71962 -184759 -429016 -253318 -286742 -374316 -441479 40639 145852 -310505 -334461 -132842
6158 -132842 240380 443255 512895 497789 136410 132855 134448 51764 59987 51449 -20528 43430
6146 43430 -43265 -91405 -313425 -406490 -361348 -270015 -319303 -125152 32279 -138451 -292929
6135 -292929 -97461 4565 -48148 20691 102837 -99860 -365693 -179392 -136579 -175910 -254414
6124 -254414 -90305 -96321 -49408 32462 -289519 -427352 -512618 -138059 -132374 -70544 -117078
6113 -117078 15183 221557 397809 254143 25017 -21575 60110 339907 156196 14720
6103A4720p7647P9848J48431k3895l8958J70030q2390k12825J07402n8857j3560
6092A2299R3769j46501J25120l60041M3665R2204L423M61527L89399j43109n16201
6081E5554k66489j5016J90443L0179J1272L68523K42120j43899n60511k68843
6071c56667J6586q0689J90438J05607n9470r3711k6822N5684J6954J01106j5260
6060a46244j28887q6197R0585L3184L04560K93591k07612O984p8817k36526m3994
6049a99373j22715p331m6188n6997K68806j33806j80201m6167K46941K36754J42641
6038A02364o2415J09061j51942J09714R6590r1349j8099Q2773j15329l2500K62402
6027B91270m035j34587K6567m2336j680j93911l5945k01843J87534M3245K6029
$$ plain form
6103 14720 -62927 16921 165352 141457 102499 272529 190139 -22686 84716 25859 12299
6092 12299 106068 -40433 84687 -275354 -231689 -139485 -136062 325465 714864 571755 55554
6081 55554 -210935 -225951 -35508 -5329 5943 374466 616586 472687 -87824 -356667
6071 -356667 -340081 -420770 -230332 -124725 -184195 -277906 -304728 -249044 -232090 -130984 -146244
6060 -146244 -275131 -361328 -270743 -237559 67001 360592 152980 159964 81147 -155379 -199373
6049 -199373 -322088 -329419 -375607 -432604 -163798 -297604 -477805 -523972 -277031 -40277 102364
6038 102364 39949 149010 -2932 106782 203372 112023 93924 176697 61368 28868 291270
6027 291270 287235 152648 179215 136879 135199 -58712 -94657 -296500 -108966 -65721 -39692
6016c9692N4516r2972K0226K62744J13511R4584k05801k28389R6405K14353o6262
6005B23223q7101m381Q368J6710j10344J94624J04036O7316l40958j96688L3973
5994i1222J39883j5787O9654l86291l07785L81382M47155J42119k91656j94606
5984a07154k75174k91653L52070M04143J20438k05971q9353R2283k36729j05344
5974c42444j3091N7090k6924J42153J81811j1248Q4226r5933j89967j90675Q8154
5963c16848J57051K44559p9736j37297p728K87403K10454P8171j05283k01147
5953A29599Q5733k9220l83678j89047K2506r2599J28875k26735J96318J74135
5943a84113r1443M8176J88486K06531L76804M2079j92397k74641J6978j79335
$$ plain form
6016 -39692 14824 -78148 -57922 204822 318333 412917 207116 -21273 75132 289485 223223
6005 223223 136122 131741 140109 156819 46475 241099 345135 412451 71493 -125195 -91222
5994 -91222 48661 32874 102528 -283763 -591548 -210166 236989 379108 87452 -107154
5984 -107154 -382328 -673981 -321911 82232 202670 -3301 -92654 -371 -237100 -342444
5974 -342444 -355535 -298445 -325369 -183216 -1405 -12653 71573 -24360 -214327 -405002 -316848
5963 -316848 -159797 84762 5026 -132271 -139999 147404 357858 436029 330746 129599
5953 129599 215332 186112 -197566 -386613 -364107 -456706 -327831 -554566 -358248 -184113
5943 -184113 -275556 -227380 -38894 167637 544441 586520 394123 119482 136460 -42875
5933d2875j02331j15420j28243J16475K87120J63182j69763j12338k0389j97971
5923c22553k22707j12603q971J60612L19487J53519K2422K9472j1020j08815r6290
5912a97447k5986N7441L495K9901J14336M1179j5539J3602j03520n4844N5801
5901h1581j42641k3488j84038o5956J91370J49676Q2289j525r7693l35069K4014
5890d84642K72478K00100J56409n8105j67818J57427J08115n3551J3559O5679
5880B09651l09065L628O1531j71650K64236J4979j03855L9786j61102N029M7640
5869i9192J3243P5630j80259k6678R1715r7734M0133Q4424K08131r2212l0108
5858a2907q1691j36321j10792K36479L00491L2549M2278k92859k0950K53642K3976
$$ plain form
5933 -42875 -145206 -260626 -388869 -272394 14726 177908 8145 -104193 -124582 -322553
5923 -322553 -545260 -657863 -666834 -506222 -186735 -33216 -10794 18678 7658 -101157 -197447
5912 -197447 -223433 -165992 -162497 -132596 -18260 22919 7380 20982 -82538 -137382 -81581
5901 -81581 -224222 -247710 -431748 -497704 -306334 -156658 -74369 -75894 -173587 -508656 -484642
5890 -484642 -212164 -12064 144345 86240 -81578 75849 183964 130413 143972 209651
5880 209651 -99414 -95786 -34255 -205905 58331 73310 -30545 9241 -151861 -146832 -99192
5869 -99192 -85949 -10319 -190578 -217256 -125541 -223275 -183142 -98718 109413 17201 -12907
5858 -12907 -94598 -230919 -341711 -105232 195259 227808 270086 -22773 -43723 209919 233895
5847B33895j36589p5113K76041J81587m3246k68165l0703j60393l10226j49913
5837d82825J69059J05763n7137k70601P6668K53020O0076j505J16796r1696k2093
5826a44475K62160m2277k66515q36J73880J31993K02647l07012k67993K32589
5816b5839J31956J42437j45638p7L45403J41490j77773k77955l1079J01886j39874
5805F4937j75992M4088Q6505o5072m941K50612L7406l25900J54447k1440J01498
5794A46148j05768k79905J00540k9562Q4542J29420J26043j3241r9850R2707j08073
5783D3001k3392j22593k80389q143J23986K5193J75250p9948j07576k17861j6784
5772d89256J38022Q9716J04983l3671M3705p5628J12913J46740N7079J6116l28168
$$ plain form
5847 233895 97306 22193 298234 479821 436575 168410 137707 -22686 -332912 -482825
5837 -482825 -313766 -208003 -265140 -535741 -459073 -206053 -145977 -147482 -30686 -122382 -144475
5826 -144475 117685 75408 -191107 -191943 -18063 113930 316577 9565 -258428 -25839
5816 -25839 106117 248554 102916 102839 448242 589732 411959 134004 102925 204811 64937
5805 64937 -111055 -66967 19538 -45534 -50475 200137 237543 -88357 66090 44650 146148
5794 146148 40380 -239525 -138985 -168547 -84005 45415 171458 158217 58367 151074 43001
5783 43001 19609 -102984 -383373 -391516 -267530 -242337 -67087 -147035 -254611 -472472 -489256
5772 -489256 -351234 -261518 -156535 -190206 -146501 -222129 -109216 37524 94603 110719 -217449
5761b17449J36061m2247L79997J30603p7241p9339o329r7959k27749J21420J08647
5750A28415m0238j1431r1047j84432j7393Q7675L20382m7899K99205Q3399j75746
5739C50890j16572Q5381o3825k99255n0222j31829r4810N34731Q6952l07529o6200
5728g2288J537j2398Q7971J44508k2212J08716j00319k07776m4253N022n9555
5717a71047K06796K9005j89020L00713M61144j7062m0740n13823k58696q0674
5707b73404j7805J80543j9043m3564J99972r4104J43236J8187j57086j16511R3193
5696h6386j23982n131j59635M0267l0073J626J43753j73885N7791K38610o4880
5685a61925p8709P7492J18183M4086j82346j30957l01287K45527J73868j10498
$$ plain form
5761 -217449 -81388 -123635 256362 386965 309724 230385 224056 126097 -101652 19768 128415
5750 128415 88177 76746 -14301 -198733 -216126 -128451 191931 144032 443237 526636 350890
5739 350890 234318 319699 255874 -43381 -93603 -225432 -320242 214489 301441 -6088 -72288
5728 -72288 -70751 -83149 4822 149330 127118 235834 135515 -72261 -116514 -111492 -171047
5717 -171047 35749 64754 -124266 176447 637591 620529 579789 65966 -192730 -273404
5707 -273404 -291209 -110666 -129709 -173273 26699 -67405 75831 94018 -63068 -179579 -86386
5696 -86386 -210368 -215499 -375134 -334867 -364940 -363314 -219561 -393446 -335655 -97045 -161925
5685 -161925 -240634 -163142 -44959 -873 -183219 -314176 -615463 -369936 -196068 -306566
5675c06566o143J02785L51553J11794j21417L3858P5766M1589k1402m9789j25467
5664H6561k35368J14935J33619n0256N7334P886o6017q7544Q6627J22364p3478
5653I6663k26848k69212J09616J8799m38625J9612J65344J17680J40402J89986
5643g6583j51763p180J24943J03045J10914j28659j33643P8885k2854l77292J91816
5632b88371J87030j69864K16130k984P159J41978k90021j9221R1633K84896J83087
5621C41452P7064q7921k74013l15099P81K55429Q0309j20487k43312k74831M6210
5610e14418K30855K80172J99546l32919M3815O905j08406l118O4414J00435j63236
5599a95955j49995r0723J18772J5601L49302M7283O0000K3834j70415N8276m8387
$$ plain form
5675 -306566 -312709 -209924 141629 253423 132006 165864 241630 283219 261817 212028 86561
5664 86561 -148807 -33872 99747 49491 106825 114711 48694 -38850 47777 170141 96663
5653 96663 -130185 -399397 -289781 -270982 -709607 -689995 -524651 -406971 -266569 -76583
5643 -76583 -228346 -235526 -110583 -7538 103376 -25283 -158926 -80041 -102895 -480187 -288371
5632 -288371 -101341 -271205 -55075 -58059 -50900 91078 -198943 -218164 -126531 158365 341452
5621 341452 418516 330595 56582 -258517 -257736 -2307 78002 -42485 -285797 -560628 -514418
5610 -514418 -283563 -3391 196155 -136764 -92949 -86044 -194450 -197568 -133154 -32719 -195955
5599 -195955 -345950 -436673 -317901 -302300 47002 94285 154285 178119 7704 65980 17593
5588A7593k39403l6168M5653L07265n3029k84668L7824M4143K92759R728j12231
5577B9466k00504p3812j09089r4167R9725L68874R7046j34052j25015p9420L75480
5566A54532K78298M9203m71082l34321K74817j34584K84989K3171j25320q9636
5556h9933J0415L2513o2552R6309r0845k77578J81105P7793r8408J63354J26722
5545F8895K71955L51947j9269m06744j4209n8407J8366l5885o7641l82701N4935
5534b18758J46425J43420K11052n1082k14358l41360J5000j12221R3895K17612
5524a10375J30860j63451k89042j37216j4022Q1196L6846M1025L18698L20783
5514B15302J22727j35970k55136k09243j15402j1819K38996N8323K832m8806j27298
$$ plain form
5588 17593 -221810 -257978 -212325 94940 41911 -242757 -204933 -160790 131969 141697 29466
5577 29466 -171038 -244850 -353939 -448106 -348381 20493 117539 -16513 -141528 -220948 154532
5566 154532 432830 482033 10951 -323370 -48553 -183137 101852 125023 -297 -89933
5556 -89933 -79518 -47005 -109557 -13248 -104093 -381671 -200566 -122773 -221181 -57827 68895
5545 68895 340850 692797 673528 266784 252575 194168 212534 176649 109008 -273693 -218758
5534 -218758 -72333 71087 282139 231057 16699 -324661 -309661 -421882 -327987 -110375
5524 -110375 20485 -142966 -432008 -569224 -583246 -502050 -465204 -424179 -105481 215302
5514 215302 338029 202059 -53077 -262320 -377722 -389541 -150545 -92222 -89390 -138196 -265494
5503b65494j15436J8617K30516j8713J6843j8549j28801K62596J15220j0765j6250
5492F9784r3911j56193k62025q582L72453K74589J68958k31089o9996J57336m9765
5481A71559j82943k82821o2207K65312J83817K16395l3479r2242K004K60832J00877
5470E47104p0m55383l80096j28922J14191L58502N3193l0670j66871o0474j02093
5459b51589M4725J69375l246N9077j8795J23233j90986L54979K36646l24526l45245
5448a46352k13598q1862P3599J98989P5346K45J28600K78649Q1771m12419j50092
5437a67124K77760l63699j65361j28127J26850J34743l34878n2297J87765K58855
5427b25513K80444J44671n96879r3506L15746K07168l4412O1889K19278n3041
$$ plain form
5503 -265494 -380930 -362313 -131797 -150510 -133667 -152216 -281017 -18421 96799 86034 69784
5492 69784 -24127 -180320 -442345 -450927 -78474 196115 365073 133984 63988 221324 171559
5481 171559 -11384 -294205 -356412 -91100 92717 309112 275633 183391 185395 446227 547104
5470 547104 547034 91651 -288445 -417367 -303176 55326 108519 77849 -89022 -149496 -251589
5459 -251589 -206864 -37489 -40735 18342 -453 122780 -68206 286773 523419 198893 -146352
5448 -146352 -359950 -441812 -368213 -169224 -93878 -93633 34967 313616 395387 -17032 -167124
5437 -167124 110636 -253063 -418424 -546551 -419701 -284958 -619836 -672133 -484368 -225513
5427 -225513 54931 199602 -397277 -490783 -175037 32131 -2281 59608 278886 225845
5417B25845M2450j08684k0113k25111l6639J52926Q1159l034P2864q9867j92841
$$ plain form
5417 225845 268295 159611 139498 -85613 -122252 30674 111833 108799 181663 91796 -101045
$$ [...]
##END NTUPLES=NMR SPECTRUM
##END=
