##TITLE=Analysis number 317529
Compound Code mo 07743
Project Code qc-cat
Chemist Name chemcon
##JCAMPDX= 6.0         $$ Bruker NMR JCAMP-DX V2.0
##DATA TYPE= NMR SPECTRUM
##DATA CLASS= NTUPLES
##ORIGIN= Bruker BioSpin GmbH
##OWNER= nmr
$$ XWIN-NMR		Version 3.5
$$ Wed Feb 22 13:02:27 2006 GMT Standard Time (UT+0h)  MAYBRIDGE\nmr@NMR_250MHZ
##.OBSERVE FREQUENCY= 250.131544655141
##.OBSERVE NUCLEUS= ^1H
##.ACQUISITION MODE= SIMULTANEOUS (DQD)
##.ACQUISITION SCHEME= undefined
##.AVERAGES= 16
##.DIGITISER RES= 18
##SPECTROMETER/DATA SYSTEM= dpx250
##.PULSE SEQUENCE= zg30
##.SOLVENT NAME= DMSO
##.SHIFT REFERENCE= (INTERNAL, DMSO, 0, 16.522)
##AUDIT TRAIL= $$ (NUMBER, WHEN, WHO, WHERE, WHAT)
$$ ##TITLE= Audit trail, XWIN-NMR		Version 3.5
$$ ##JCAMPDX= 5.01
$$ ##ORIGIN= Bruker BioSpin GmbH
$$ ##OWNER= nmr
$$ C:\u/data/dgb/nmr/ADRS/16710/pdata/1/auditp.txt
$$ ##AUDIT TRAIL=  $$ (NUMBER, WHEN, WHO, WHERE, WHAT)
(   1,<2006-02-22 13:01:45.34 +000>,<MAYBRIDGE\nmr>,<NMR_250MHZ>,
      <created by zg, POWCHK disabled, PULCHK disabled
       configuration hash MD5:
       84 BC 41 DB A1 6E 1D 46 DA 25 12 A5 C1 ED C5 3A
       data hash MD5: 64K
       E2 43 05 68 54 1C 2D 82 48 73 48 C2 38 0D 98 66>)
(   2,<2006-02-22 13:02:11.27 +000>,<MAYBRIDGE\nmr>,<NMR_250MHZ>,
      <Start of raw data processing
       ef LB = 0.3 FT_mod = 6 PKNL = 1 SI = 32K 
       data hash MD5: 32K
       C0 D5 DC 4B F3 EC 5F A3 CB F8 AB B2 7B 44 15 C3>)
(   3,<2006-02-22 13:02:15.04 +000>,<MAYBRIDGE\nmr>,<NMR_250MHZ>,
      <apk 
       data hash MD5: 32K
       B5 16 99 AB 76 B5 0D 73 90 CE 01 7D 79 20 29 29>)
(   4,<2006-02-22 13:02:15.95 +000>,<MAYBRIDGE\nmr>,<NMR_250MHZ>,
      <abs ABSG = 5 
       data hash MD5: 32K
       12 77 65 63 66 DF C1 CB 50 0B 0B ED 87 DB 8C D0>)
$$ ##END=
$$ 
$$ hash MD5
$$ 97 4D BF EB 9F 78 67 56 48 FE 0F 12 E8 6E 22 93
##$RELAX= 
##$RELAX= 
##$RELAX= 
##$RELAX= 
##$RELAX= 
##$RELAX= 
##$RELAX= 
$$ Bruker specific parameters
$$ --------------------------
##$DU= <C:\u>
##$EXPNO= 16710
##$NAME= <ADRS>
##$PROCNO= 1
##$TYPE= <nmr>
##$USER= <dgb>
##$AMP= (0..31)
100 100 100 100 100 100 100 100 100 100 100 100 100 100 100 100 100 100 
100 100 100 100 100 100 100 100 100 100 100 100 100 100 
##$AQSEQ= 0
##$AQ_mod= 3
##$AUNM= <au_zg>
##$AUTOPOS= <31 >
##$BF1= 250.13
##$BF2= 250.13
##$BF3= 250.13
##$BF4= 250.13
##$BF5= 500.13
##$BF6= 500.13
##$BF7= 500.13
##$BF8= 500.13
##$BYTORDA= 1
##$CFDGTYP= 0
##$CFRGTYP= 5
##$CHEMSTR= <none>
##$CNST= (0..31)
1 1 145 1 1 1 1 1 1 1 1 1 1 1 1 1 1 1 1 1 1 1 1 1 1 1 1 1 1 1 1 1 
##$CPDPRG= <>
##$CPDPRG1= <>
##$CPDPRG2= <>
##$CPDPRG3= <>
##$CPDPRG4= <mlev>
##$CPDPRG5= <mlev>
##$CPDPRG6= <mlev>
##$CPDPRG7= <mlev>
##$CPDPRG8= <mlev>
##$CPDPRGB= <>
##$CPDPRGT= <>
##$D= (0..31)
0 1 0 0 0 0 0 0 0 0.06 0 0 0 0 0 0 0.0002 0 0 0 0 0 0 0 0 0 0 0 0 0 0 
0 
##$DATE= 1140613303
##$DBL= (0..7)
120 120 120 120 120 120 120 120 
##$DBP= (0..7)
150 150 150 150 150 150 150 150 
##$DBP07= 0
##$DBPNAM0= <>
##$DBPNAM1= <>
##$DBPNAM2= <>
$$ [...]
##$SUBNAM7= <"">
##$SUBNAM8= <"">
##$SUBNAM9= <"">
##$SW= 20.6930455092707
##$SWIBOX= (0..15)
0 0 3 0 0 0 0 0 0 0 0 0 0 0 0 0 
##$SW_h= 5175.983436853
##$TD= 65536
##$TD0= 1
##$TE= 293.16
##$TE2= 300
##$TE3= 300
##$TEG= 300
##$TL= (0..7)
0 120 120 120 120 120 120 120 
##$TP= (0..7)
150 150 150 150 150 150 150 150 
##$TP07= 0
##$TPNAME0= <>
##$TPNAME1= <>
##$TPNAME2= <>
##$TPNAME3= <>
##$TPNAME4= <>
##$TPNAME5= <>
##$TPNAME6= <>
##$TPNAME7= <>
##$TPOAL= (0..7)
0.5 0.5 0.5 0.5 0.5 0.5 0.5 0.5 
##$TPOFFS= (0..7)
0 0 0 0 0 0 0 0 
##$TUNHIN= 0
##$TUNHOUT= 0
##$TUNXOUT= 0
##$USERA1= <user>
##$USERA2= <user>
##$USERA3= <user>
##$USERA4= <user>
##$USERA5= <user>
##$V9= 5
##$VALIST= <valist>
##$VCLIST= <CCCCCCCCCCCCCCC>
##$VD= 0
##$VDLIST= <DDDDDDDDDDDDDDD>
##$VPLIST= <PPPPPPPPPPPPPPP>
##$VTLIST= <TTTTTTTTTTTTTTT>
##$WBST= 1024
##$WBSW= 4
##$XGAIN= (0..3)
0 0 0 0 
##$XL= 0
##$YL= 0
##$YMAX_a= 359806
##$YMIN_a= -418767
##$ZGOPTNS= <>
##$ZL1= 120
##$ZL2= 120
##$ZL3= 120
##$ZL4= 120
##$ABSF1= 16.522
##$ABSF2= -4.171173
##$ABSG= 5
##$ABSL= 3
##$ALPHA= 0
##$AQORDER= 0
##$ASSFAC= 0
##$ASSFACI= 0
##$ASSFACX= 0
##$ASSWID= 0
##$AUNMP= <proc_1d>
##$AZFE= 0.1
##$AZFW= 0.1
##$BCFW= 0
##$BC_mod= 0
##$BYTORDP= 0
##$COROFFS= 0
##$CY= 12.5
##$DATMOD= 1
##$DC= 0
##$DFILT= <>
##$DTYPP= 0
##$F1P= 14.0000005364418
##$F2P= -0.99999901652339
##$FCOR= 0.5
##$FTSIZE= 32768
##$FT_mod= 6
##$GAMMA= 0
##$GB= 0
##$INTBC= 1
##$INTSCL= 1
##$ISEN= 128
##$LB= 0.3
##$LEV0= 0
##$LPBIN= 0
##$MAXI= 10000
##$MC2= 0
##$MEAN= 0
##$ME_mod= 0
##$MI= 0
##$NCOEF= 0
##$NC_proc= -5
##$NLEV= 6
##$NOISF1= 0
##$NOISF2= 0
##$NSP= 0
##$NTH_PI= 0
##$NZP= 0
##$OFFSET= 16.522
##$PC= 1
##$PHC0= 237.4775
##$PHC1= 8.545073
##$PH_mod= 1
##$PKNL= yes
##$PPARMOD= 0
##$PSCAL= 4
##$PSIGN= 0
##$REVERSE= no
##$SF= 250.13
##$SI= 32768
##$SIGF1= 0
##$SIGF2= 0
##$SINO= 400
##$SIOLD= 32768
##$SREGLST= <1H.DMSO>
##$SSB= 0
##$STSI= 32768
##$STSR= 0
##$SW_p= 5175.98343685301
##$SYMM= 0
##$S_DEV= 0
##$TDeff= 65536
##$TDoff= 0
##$TI= <Analysis number 999999
Compound Code 99
Book Reference 9
Project Code 9>
##$TILT= no
##$TM1= 0
##$TM2= 0
##$TOPLEV= 0
##$USERP1= <user>
##$USERP2= <user>
##$USERP3= <user>
##$USERP4= <user>
##$USERP5= <user>
##$WDW= 1
##$XDIM= 32768
##$YMAX_p= 295845311
##$YMIN_p= -685214
$$ End of Bruker specific parameters
$$ ---------------------------------
##NTUPLES= NMR SPECTRUM
##VAR_NAME=  FREQUENCY,     SPECTRUM/REAL,   SPECTRUM/IMAG
##SYMBOL=    X,             R,               I
##VAR_TYPE=  INDEPENDENT,   DEPENDENT,       DEPENDENT
##VAR_FORM=  AFFN,          ASDF,            ASDF
##VAR_DIM=   32768,         32768,           32768
##UNITS=     HZ,            ARBITRARY UNITS, ARBITRARY UNITS
##FACTOR=    0.157963299565203, 1,           1
##FIRST=     4132.6476996994, 0,             0
##LAST=      -1043.33573715361, 0,           0
##MIN=       -1043.33573715361, -685214,     0
##MAX=       4132.6476996994, 295845311,     0
$$ Real data points
##PAGE= N=1
##DATA TABLE= (X++(R..R)), XYDATA
$$ [...]
15500b23831r1557J42366J03918P5169j47712m9197K200r416j12755k8105J08073
15489b30847j34541J0804J56659J59787J81472k279Q0704n4111N6817o8472P965
15478A63958M2820j70454O1722j64969j31328p3416M4956J13067m2371j1066N3750
15467a13331J08125m4518M2835K1744J6837J711k9605M4576o1449p030r9734j0413
15455a30252j21262j33878M2900J47899N742m2197N5616K64362Q8743j38794J1872
15444E0751o2480j85562j52930J71177J20948j56628J47882N6676k07423j39444
15434c57033k9456J87815K55825r3730O7907n5475R2646Q254j878l873M8149j01440
15422A7711n1620k0297O358M040j2699m0092J03317K9159p8162q8148J45649J14696
$$ plain form
15500 -223831 -315388 -173022 -69104 6065 -141647 -190844 -188644 -198060 -310815 -338920 -230847
15489 -230847 -365388 -354584 -197925 -38138 143334 141055 221759 167648 224465 155993 163958
15478 163958 206778 36324 98046 -66923 -198251 -271667 -226711 -113644 -156015 -167081 -113331
15467 -113331 -5206 -49724 -6889 14855 31692 33403 3798 48374 -13075 -20105 -119839 -130252
15455 -130252 -251514 -385392 -342492 -194593 -188851 -231048 -175432 88930 177673 38879 50751
15444 50751 -11729 -197291 -350221 -179044 -58096 -214724 -66842 -10166 -217589 -357033
15434 -357033 -386489 -198674 57151 -36579 31328 -24147 68499 76753 74875 71002 119151 17711
15422 17711 -33909 -54206 -47848 -43808 -56507 -96599 6718 35877 -42285 -130433 15216 129912
15410A29912J01441Q0995j2745q7371q0033J76485O3833o2034j44849P6610l4635
15399B07609Q3760n2467k0219K2700l5810r9337o9712N614N9245k20520l6767
15388a55904J92991L4485l1668k20153J84025K1099k77040o364M0528L1179p6363
15377b63185l1498N0682Q0426N0515k4804L0734L0759n296n1161M6815q7227K6661
15365a46579q3439Q289k4650m9465K27463J36845L5281R746N9509M6783j28995
15354I0788j49693l0387J36268m3572P1397j36287p0724m0664k2509P2586r9834
15343b22631m7870K9194J30651m704j13824P2586K3916L3145R8299J4283J44766
15332A57811N7741j24320l4945q537l3238J21678n4267P1289o1616n6708O2772
$$ plain form
15410 129912 231353 312348 299603 212232 132199 308684 372517 310483 165634 242244 207609
15399 207609 291369 238902 218683 241383 205573 106236 36524 42138 101383 -119137 -155904
15388 -155904 37087 71572 39904 -180249 3776 24875 -252165 -258529 -218001 -186822 -263185
15377 -263185 -294683 -244001 -163575 -113060 -137864 -107130 -76371 -81667 -132828 -86013 -173240 -146579
15365 -146579 -230018 -221729 -246379 -295844 -68381 68464 103745 113491 173000 219783 90788
15354 90788 -58905 -89292 46976 3404 74801 -61486 -132210 -172874 -195383 -122797 -222631
15343 -222631 -270501 -241307 -110656 -115360 -229184 -156598 -132682 -99537 -1238 13045 157811
15332 157811 215552 91232 56287 47750 14512 136190 81923 153212 91596 34888 97660
15321I7660Q024O1323r0543o5119J2298p0450K0392j04290k5905K25563J15982
15310A84935Q5323r8001P0339J03162k4983M8431n6713r9502O9925L7194j25423
15299A94687k44939L801J72074L2036j08678j18388R0881J21385N8826j35690
15289F5995j54087j15105P4167o1121j4744O4869n1214R7887J18814K18249N3081
15278B96791r3093j90930r8477p1733q6173O252J06228K8920j23575o6877N6991
15267b35676o4751P3056Q6053J88624J86174j98906p4598J78397L6534j31532
15257D3375J1066q700M9700J2480J39759k8898j94066M1280K22q8611k2186j10259
15245a54838j28563J35125K42176J01306L3745l5873j91172J4581J84358m0643
$$ plain form
15321 97660 105684 167007 76464 11345 23643 -46807 -26415 -130705 -156610 68953 184935
15310 184935 270258 172257 242596 345758 320775 369206 312493 212991 282916 320110 194687
15299 194687 -50252 -46451 125623 157659 48981 -69407 21474 142859 201685 65995
15289 65995 -88092 -203197 -129030 -190151 -204895 -140026 -191240 -93353 25461 243710 296791
15278 296791 203698 12768 -85709 -157442 -243615 -237363 -131135 -102215 -225790 -292667 -235676
15267 -235676 -300427 -227371 -141318 47306 233480 34574 -40024 138373 174907 43375
15257 43375 54441 45741 95441 107921 247680 218782 24716 65996 66218 -22393 -44579 -154838
15245 -154838 -283401 -148276 93900 195206 228951 193078 1906 16487 200845 160202
15235A60202k1257j5685J26351Q6516L6469L7264j23883j36154r4526K3824m3295
15224C5826J2570J00989o2180k10192j0568J2301o0273J9031J65140J62704J695
15213A67043q2714q5953P203O8076J66699j09585k35358o6270k2392J12428J50053
15202F9230L9253K3173j35008j20493Q2716J9443L351q4289l3555J36816J44549
15191A45186j2251k2059j2764J08948p6959j44652j29993p8374l28306P7302K03974
15180b69948J08410L2106M9503N3756j43176k14195K8933J33906k59J13074N0200
15169e7690K05090j9432L2292r8522Q1535j35786k00431r4897r4313K33292J85004
15158C6142l8546J71649j61392j12404m4682Q0879J68609O4877j11073n1392o998
$$ plain form
15235 160202 138945 123260 249611 336127 372596 409860 285977 149823 55297 79121 35826
15224 35826 48396 149385 87205 -122987 -133555 -121254 -181527 -162496 2644 165348 167043
15213 167043 84329 -1624 5579 73655 240354 130769 -104589 -170859 -193251 -80823 69230
15202 69230 108483 131656 -3352 -123845 -41129 -21686 -18335 -102624 -136179 637 145186
15191 145186 132935 110876 98112 207060 130101 -14551 -144544 -222918 -551224 -473922 -269948
15180 -269948 -161538 -129432 -79929 -26173 -169349 -383544 -354611 -220705 -220964 -107890 -57690
15169 -57690 147400 127968 160260 61738 143273 7487 -192944 -287841 -382154 -148862 36142
15158 36142 -2404 169245 7853 -104551 -149233 -68354 100255 165132 54059 2667 -4331
15147d331J7145K05086k7810n5021l6451J347J24693k84684n3584O4118j5600
15136f5092K9512J19541J17978j44989M3310k1798j93719k1703P9760K8237N5362
15125B6399J07039L856K0812l9761r0619j3379j76228N336J01504n8520j10367
15114b23928J12647q0070k033L8578K18006k2359J08521o5037n1696l1866j18997
15103a18234R574J95711J65980l5690j20170j22285r4592J48124N0070j86906
15093a08418r77M5048J04057r849j2520L1365n3222q491P4121N0286k06687p0841
15081a66128L5088N0794o935P2185l1531r6082k8274N2639m0000j44771K00761
15070a02254J10453K3111n1689p1161r2443m171j53104r9461l3125K49764J09894
$$ plain form
15147 -4331 12814 217900 190090 135069 98618 99965 224658 -60026 -113610 -49492 -65092
15136 -65092 -35580 83961 201939 56950 100260 78462 -115257 -136960 -57200 -28963 26399
15125 26399 133438 137294 158106 118345 27726 14347 -161881 -156545 -55041 -113561 -223928
15114 -223928 -111281 -191351 -193384 -154806 63200 40841 149362 84325 32629 763 -118234
15103 -118234 -108660 87051 253031 217341 97171 -25114 -119706 28418 78488 -108418
15093 -108418 -109395 -64347 39710 29861 17341 48706 -4516 -13007 61114 111400 -95287 -166128
15081 -166128 -131040 -80246 -87181 -14996 -46527 -142609 -170883 -118244 -158244 -303015 -102254
15070 -102254 8199 31310 -20379 -91540 -183983 -188154 -341258 -440719 -473844 -224080 -114186
15059a14186j1642k0566n3569J4852L0439q5398j8819j33038Q743L18423J92598
15048A27837N4178j20683j96291j74765q7498R2118J87922L7443J58094r4282
15038a5927l3407N1593j2108j25199K6137P7442l4950p9727J9354k2011J30955
15027a7848J1001j39389j143L8651N9155l4607Q0447R4568R7203j46069J1152
15016E3121P0318Q8596k2161j8847j69403j45875m084J4870l1411L2305P1755
15005f0816q5216p3659n013l881J90587P944J5598j5852l1382q0201j00195k63548
14993e05634J64342L37453J7348Q5481L3915P649n5438j37196q2326N6787N7289
14982b0330K6416j03863O210r8001J47371L1735K00473R4088l8209j00719k3755
$$ plain form
15059 -114186 -125828 -146394 -199963 -185111 -154672 -240070 -258889 -391927 -383184 -64761 127837
15048 127837 182015 61332 -134959 -309724 -397222 -305104 -117182 -79739 78355 -15927
15038 -15927 -49334 2259 -9849 -135048 -108911 -31469 -66419 -146146 -126792 -148803 -17848
15027 -17848 -6847 -146236 -147379 -108728 -49573 -84180 -3733 90835 188038 41969 53121
15016 53121 123439 212035 189874 171027 1624 -144251 -148335 -133465 -164876 -132571 -60816
15005 -60816 -146032 -219691 -224704 -228585 -37998 -30054 -14456 -30308 -61690 -141891 -242086 -505634
14993 -505634 -341292 -3839 13509 98990 132905 140554 85116 -52080 -134406 -77619 -20330
14982 -20330 6086 -97777 -91567 -189568 -42197 -10462 190011 284099 245890 145171 121416
14971A21416j61286l8151O5223P7707N2350J03671k63802J0583J63409P7517j02023
14960A06614q119J54376J0479m9603j83535j37684j5628o643M3978j00273R6196
14949h9842K04821J35103q1293k57497q6288R5486j0336j44887J48637J15854
14939B9758M4948O5348n3633n6790n0874r9853j1378N44p9263p43K25272M740
14927A8076J64381O669N5325O0331p3082j32738o2940l0874O8468J58963N0015
14916B82594j47168r3699O7028J85398r7474q1199J7903j11034q7443J68278n0985
14905E2199j51312Q7559L4839J1739K47910J06600k23257k16968k24113j24553
14895c99357R2844K26795K04352J42698k37944j64535N3726m079j16660J72447
$$ plain form
14971 121416 -39870 -78021 -12798 64909 117259 220930 -42872 -32289 131120 208637 106614
14960 106614 98495 252871 263350 213747 30212 -107472 -123100 -129743 -85765 -186038 -89842
14949 -89842 114979 250082 168789 -88708 -174996 -79510 -89846 -234733 -86096 29758
14939 29758 74706 140054 86421 29631 -21243 -121096 -132474 -131930 -211193 -211936 13336 18076
14927 18076 182457 189126 244451 304782 231700 98962 36022 5148 73616 232579 282594
14916 282594 135426 41727 108755 294153 196679 115480 133383 22349 -65094 103184 52199
14905 52199 -99113 -11554 23285 35024 282934 389534 166277 -50691 -274804 -399357
14895 -399357 -306513 -79718 124634 267332 29388 -135147 -81421 -85500 -202160 -29713
14885b9713J69637k6900l3372l4114R2728j6526j56592l0712J48686r034k28512
14874a54424O1001J54957m897j54848l663m6370Q3904M9822p3587l3612L3900
14863h7817m1399K21430J96106j57312k76139K0736P668K107k8588P4256k0777
14852h9729J2681N4013j60632j30481J48976N557J24150R0716n0383m5512J4663
14841b5981J20100o4177j16331n7776r5563o4045L9333J01312j3561K7350J67072
14830A7733P7357J25653q3843p1778J8768j70230j06914J16662k8898j23831p7654
14819c06975J07107Q139k0695J77058Q3358n6899L2877J54529q8582j22052J9399
14808a2736q0965l8686m927j346J8453M7401j13308o9957L9542Q6948L0310K84640
$$ plain form
14885 -29713 139924 113024 79652 45538 138266 121740 -34852 -65564 83122 74088 -154424
14874 -154424 -93423 61534 56637 -98211 -101874 -148244 -64340 -14518 -88105 -121717 -87817
14863 -87817 -129216 92214 288320 131008 -145131 -124395 -116727 -114620 -143208 -68952 -89729
14852 -89729 -77048 -23035 -183667 -314148 -165172 -159615 -35465 55251 4868 -40644 -25981
14841 -25981 94119 29942 -86389 -144165 -239728 -303773 -264440 -163128 -176689 -149339 17733
14830 17733 95090 220743 136900 65122 83890 -86340 -193254 -76592 -105490 -229321 -306975
14819 -306975 -199868 -191729 -212424 -35366 47992 -8907 23970 178499 89917 -32135 -12736
14808 -12736 -93701 -132387 -137314 -138660 -120207 -72806 -186114 -256071 -216529 -129581 -99271 185369
14796A85369o266j70639o2178N1742l4259J82657m542N3513o9793j00467j15204
14785i0067Q8072J07971j11858K0602J06352K6851M8875n3128j290p4155Q7983
14774A56208O3151j44910q3791L7084K13141J82193j06668m01671J27332J64568
14764B06637l9961j11999Q2395Q5840j94250j12895J692R3348j18961n4807J05488
14753e7473J7204q9876k33736L5090K48323L10743o8851k4166o1795o2254j88781
14742a75572J2065n4690J27783P2398n0451J5686m9616k93973J16309J5059R9378
14731a65624K1679O9892k3193j65174Q8878J67699j3419J5178O9217l7608j45
14720B7380j7864j9964j41886O1064K53087K95553k6978j44684j82278r7110j45432
$$ plain form
14796 185369 179103 8464 -53714 -1972 -36231 146426 141884 195397 125604 25137 -90067
14785 -90067 -1995 105976 -5882 14720 121072 147923 196798 143670 142380 68225 156208
14774 156208 219359 74449 -9342 27742 240883 423076 316408 -85263 42069 206637
14764 206637 166676 54677 137072 222912 28662 -84233 -82541 10807 -108154 -162961 -57473
14753 -57473 -40269 -130145 -363881 -328791 -80468 230275 161424 137258 75463 13209 -175572
14742 -175572 -163507 -218197 -90414 -18016 -68467 -52781 -102397 -396370 -280061 -265002 -165624
14731 -165624 -143945 -74053 -97246 -262420 -173542 -5843 -19262 -4084 65133 27525 27380
14720 27380 9516 -10448 -152334 -91270 161817 457370 430392 285708 103430 6320 -139112
14709a39112J59890J87420q0157M370r4589j9258J0126j16403K4138m4125k95292
14698d02992m5989O7575P7107n5155K24501J57191J91025N5662k17159j52324
14688a00558Q9825R2494j30167q4610J1908Q4592R0523l6901J90002N5429K4720
14677B87257r7949l0234N0993m3479k775j509L9215M4445L7459k04946j15193
14666c6716Q0755K96298j01438k5000l9493O1728j4107J3605q0509j13489L3842
14655G5476P2767M3267j11489M3270o2266j60499M2538j4419j2481K1834o3803
14644a25805M0070J06015O2873J52559N8561N3511k54697o2473J95616p2901j65299
14633a1970M5023L5171j59009O6314J33907J63671r4195k5468j2993P0222o4588
$$ plain form
14709 -139112 20778 208198 128041 132411 37822 18564 28690 -87713 -63575 -107700 -402992
14698 -402992 -448981 -381406 -304299 -359454 -134953 22238 213263 268925 51766 -100558
14688 -100558 -10733 81761 -48406 -133016 -121108 -36516 54007 17106 207108 262537 287257
14677 287257 189308 159074 210067 166588 163813 162304 201519 245964 283423 78477 -36716
14666 -36716 44039 340337 238899 213899 174406 236134 222027 235632 155123 41634 75476
14655 75476 148243 191510 80021 123291 61025 -99474 -56936 -71355 -83836 -62002 -125805
14644 -125805 -85735 20280 83153 235712 294273 347784 93087 30614 226230 153329 -11970
14633 -11970 33053 68224 -90785 -24471 109436 273107 178912 153444 140451 210673 146085
14622A46085o4426j46391r2255P3297K4670Q0181m7117R4422k4568q0386n0784
14611h7272K16306k3832L9647j36622l585j25342Q1029K13500N4871Q5002p9742
14600B33960j22742J88552J64117j82257j63078o3006k4539N4044J27432j21533
14590I0950j04919M8771Q1804K5281p3437K15j81994P2174M916K9584L05Q3767
14578G7417j36231k94849N8923j4874R2419K67020j6075Q8581K4187l1394m0115
14567G5009O8469J8542k40824j323J38919l6629K3066J52657P9345j66851n1551
14556E8829J29115j26091j17635j01447J13613M5930J38968j98153l23317K0654
14546c59534R9507J02711m9762J33544K6746M3667P7216m0164l8364n4216N628
$$ plain form
14622 146085 81659 -64732 -156987 -83690 -59020 21161 -25956 68466 43898 -36488 -87272
14611 -87272 129034 105202 144849 8227 4642 -120700 -39671 173829 228700 313702 233960
14600 233960 111218 299770 463887 281630 118552 55546 31007 85051 212483 90950
14590 90950 -13969 34802 116606 141887 68450 68665 -113329 -41155 -36239 -6655 -6350 77417
14578 77417 -58814 -353663 -294740 -309614 -217195 49825 33750 122331 146518 115124 75009
14567 75009 143478 162020 -78804 -80127 58792 22163 45229 197886 277231 110380 58829
14556 58829 187944 61853 -55782 -157229 -43616 2314 141282 -56871 -380188 -359534
14546 -359534 -260027 -157316 -207078 -73534 -46788 -3121 74095 33931 -4433 -58649 -53021
14535e3021J72946n2542L1749J61416r6013J4395k02454j88142Q5059K8859j32945
14524b30693J50189O5167L4085M0080j8774l0906L7318M7167o2158k14894J03166
14513h0253P9093k2523K2102l102m6930K3292J25421j19316j26526J43225K52782
14502B47265J4547k18358j67007L3791Q355o153o9056J42848J40754M6604L3382
14491B06972Q8982j02016k41454l7267m2723j1597P5850k4049J6724J84816P922
14480A22160m0418K3579j58757p2850J05919k1875n5142l0800R777J91559K01175
14469B74327J32420k63885k06969j16677L6921J25704q3064q5593k3052N4375
14459a55493J0276j1444J63650J07808J02208m4467j43534n6658n6330J63642
$$ plain form
14535 -53021 119925 67383 99132 260548 164535 178930 -23524 -211666 -126607 -97748 -230693
14524 -230693 -80504 -15337 18748 58828 40054 9148 46466 93633 31475 -183419 -80253
14513 -80253 -1160 -23683 -1581 -4683 -51613 -28321 97100 -22216 -148742 -5517 247265
14502 247265 261812 43454 -123553 -89762 -81407 -87560 -156616 -13768 126986 173590 206972
14491 206972 295954 193938 -47516 -84783 -127506 -139103 -63253 -87302 -70578 114238 122160
14480 122160 81742 105321 -53436 -126286 -20367 -42242 -97384 -128184 -118407 73152 274327
14469 274327 406747 142862 -64107 -180784 -143863 -18159 -101223 -186816 -209868 -155493
14459 -155493 -145217 -156661 6989 114797 217005 172538 29004 -27654 -83984 79658
14449G9658P4850k2674j4936m1271J05613J02958M4649n3704m2410L6871r8661
14438A70943j11795J23899Q9315N9756j4333m989j45202J2000j12445J88003N9651
14427C14803k98292n7443j01222N4716J29215K1117j52112K1274J18229L8588
14417H8873k19674K2706L2753o2791J2452J88016J1827O6075m7361j35268m2789
14406h5181R435J00201J37638J0129j00968m1969m083n6704k31461k3588k8621
14395c15172k8246L687J3778J88606K49467q9330j648r500M6961o0605j25059
14384a27061j31991j52724K22587K65352J02151J60443J79827R1535j05066o9647
14374D35406j38775p4041j709m1519j37470r1102Q3042j8008j09426r3581m903
$$ plain form
14449 79658 154508 131834 116898 75627 181240 284198 328847 275143 232733 269604 170943
14438 170943 59148 183047 272362 332118 317785 312796 167594 179594 67149 255152 314803
14427 314803 16511 -40932 -142154 -87438 41777 62894 -89218 -67944 50285 88873
14417 88873 -130801 -108095 -75342 -138133 -125681 62335 74162 140237 92876 -42392 -85181
14406 -85181 -75746 24455 162093 172222 71254 29285 25202 -31502 -262963 -286551 -315172
14395 -315172 -343418 -339731 -325953 -137347 112120 22790 21142 11642 58603 -2002 -127061
14384 -127061 -259052 -411776 -189189 76163 178314 338757 518584 610119 505053 435406
14374 435406 296631 222590 220881 179362 41892 -49210 33832 15824 -93602 -187183 -192086
14363a92086J24284R7952K7858N014L2150j24265m7645m0830m8748o1714k1191
14352b49221L5781K19746l6517o3402J92796J31628q0613k66342m7762J17034
14342d6872J22749o2950j70961l6239O1466J96950J38984j67030j38084R7337
14332d650K1272m7553k9532P4838J32433L7883k5046R913j93739M8117J11184
14321A35120N7541l9584j4619j754p9582j51830p6456M2576L8690K2867j6555
14310h3586p946N2262k5341k2873l5994R7832K68461J16706k0047j46441p01j42836
14298D9496J21908j1574j25208P1905o3802p0816q4040J61600N1756Q1132j13874
14287F8483J40169J11620k66100n6088J52694j51485J8417o1364j27055K1321
$$ plain form
14363 -192086 -67802 30150 58008 63022 95172 -29093 -76738 -117568 -166316 -228030 -249221
14352 -249221 -213440 6306 -30211 -93613 99183 230811 150198 -116144 -163906 -46872
14342 -46872 75877 12927 -158034 -194273 -132807 64143 203127 36097 -101987 -4650
14332 -4650 16622 -30931 -60463 14375 146808 184691 159645 169558 -24181 23936 135120
14321 135120 192661 153077 138458 136704 57122 -94708 -171164 -128588 -89898 -67031 -83586
14310 -83586 -91532 -39270 -64611 -87484 -123478 -25646 242815 359521 339474 193033 192332 49496
14298 49496 171404 159830 34622 106527 42725 -28091 -112131 49469 101225 182357 68483
14287 68483 208652 320272 54172 -1916 150778 -707 17710 -43654 -170709 -149388
14277a49388J56433o8827K5701L5622J6385p7167k72409J29570J56178k3292k3415
14266i4609O6413J70023N0784n5483p2817j67635J2839R1520j0731m0601j23676
14255a73973N6465N4081j20943j22348J58017L2387J88143L8319r6082k6004J11816
14244I9878K2762j14728K8089K49217j84931k57307n3963J4965n0302J35474N8186
14233e2660R9306K7910J0444o8373L0217o5713j5911J43392J9636j25912r4372
14222i2036l80416m3382L68482j794j61277L782P0962L7501N4809m5101N9120
14211a29350L8499J14834Q9999k6385J04454j11101m1650N1086J1279j00831k2048
14200b1214P2755j9099r8557N5918J54881p3353k8031k0708j6266J8114q8120
$$ plain form
14277 -149388 7045 -61782 -36081 -459 15926 -61241 -333650 -204080 -47902 -71194 -94609
14266 -94609 -28196 141827 192611 137128 64311 -103324 -90485 1035 -9696 -50297 -173973
14255 -173973 -117508 -63427 -184370 -306718 -148701 -116314 71829 110148 14066 -11938 99878
14244 99878 122640 7912 36001 285218 100287 -157020 -210983 -196018 -246320 -110846 -52660
14233 -52660 46646 74556 85000 16627 46844 -18869 -34780 108612 128248 2336 -92036
14222 -92036 -472452 -515834 -147352 -149146 -310423 -306641 -235679 -198178 -143369 -188470 -129350
14211 -129350 -90851 23983 113982 87597 192051 80950 39300 90386 101665 834 -21214
14200 -21214 51541 32442 -66115 -10197 144684 71331 43300 22592 6326 24440 -63680
14189f3680K4025J7490J02491R36j24423p231Q6092J83520N5531L2230j34890
14178A72091j14778n0599j31891M853J29689N6558J8839p2000l9548j9439Q9990
14167D3765J5773j38439R2065Q6604j9632o5362j14321O2086m1201j4713J15661
14156B2286J5861K7370j19754J2679P6063O8088q054J86992N1219m9081o6722
14145B16947j16806J06319O0700p303n1729m4513j4586M6461O8878j8012N1953
14134B98309p6859M4185M1246K06381J03413P2243j91483q4383J52344j74643
14124C90753k17467Q6175J89742P1461K2011k73944q2109J37875J23621j17188
14114C30930j77797l4502J33412J43884o6578r5658j29817n1319M9984J74296
$$ plain form
14189 -63680 -39655 -22165 80326 81262 -43161 -50392 35700 219220 274751 306981 172091
14178 172091 57313 6714 -125177 -120324 9365 65923 84762 12762 -26786 -46225 43765
14167 43765 59538 -78901 13164 99768 80136 14774 -99547 -37461 -78662 -93375 22286
14156 22286 38147 65517 -54237 -41558 34505 102593 94539 281531 332750 283669 216947
14145 216947 100141 206460 267160 259857 208128 163615 149029 195490 264368 246356 298309
14134 298309 221450 265635 306881 513262 616675 688918 497435 413052 565396 390753
14124 390753 173286 259461 449203 520664 542675 268731 186622 324497 448118 330930
14114 330930 153133 118631 252043 395927 329349 233691 103874 52555 102539 276835
14104B76835j53164j88054J30495K24799L6865L4742Q7029j58726r8006l5880
14094A56935j9982M3100J87359o070j07400J0184P9722K0218M955L9525N4371
14083D62917R3890P3457J0154j1923J08768p5717j59848K5246N733j6441l0520
14072D85716k0662o4575j4156L0289Q0923J41249P6204j46829K60O8868q991q0299
14060E47997j05249q1038l3292M1153J38824p0887j83255J0423N434k39708L3828
14049F4230K0831J77563N9998m209K5030p3442M4431q4975j00895j4464Q1797
14038A95895j602n1348J433l0075j29728L3277K33933J07331j12726N1648J58198
14027D56236K06179J89509J9478M5917r7222j19231n7681M2177j13240o7181N8432
$$ plain form
14104 276835 123671 -64383 66112 290911 327776 362518 449547 290821 192815 156935
14094 156935 136953 180053 367412 361342 253942 264126 343848 364066 369021 408546 462917
14083 462917 556807 630264 640418 628495 737263 661546 501698 526944 532677 516236 485716
14072 485716 465054 400479 386323 416612 497535 638784 714988 568159 568419 637287 628296 547997
14060 547997 442748 361710 328418 369571 508395 437508 254253 264676 270110 30402 64230
14049 64230 85061 262624 322622 318413 343443 270001 314432 229457 128562 114098 195895
14038 195895 194293 142945 144378 114303 -15425 17852 251785 359116 246390 298038 456236
14027 456236 662415 851924 871402 917319 820097 700866 643185 685362 572122 504941 563373
14016E63373J16385j60440j04728N3091L5595n6584k2061j11687j28182j19263
14006F5499K9342O1947N8080l9943p4429j44814k6024J60151l0267n9951L970
13995C561j71102r3411J03135K08649l3036P4755j3439j00227P5133N7941j83439
13984g1480K7371L4530q2292k007n3984m3842N3669L3046Q8767j1363M7386k8423
13972h622O289M6629n084J16756l3026j69190J03611O2308J05243N90n1775j16009
13960E7720o2624p3093J49620J21716J45210j38693j00496j43356N9262J7184
13950C2450j16812J75020N7432n4671J33296j6969N1608J10417p9545j36780J1373
13939A66819J45596L1956j32013m865K1380j21604j1364N1673K3026p1086k2303
$$ plain form
14016 563373 679758 519318 414590 467681 503276 446692 424631 312944 184762 65499
14006 65499 94841 156788 214868 174925 100496 -44318 -70342 89809 59542 -409 3561
13995 3561 -167541 -260952 -157817 50832 17796 92551 79112 -21115 54018 111959 -71480
13984 -71480 -44109 -9579 -91871 -93878 -147862 -191704 -138035 -104989 -16222 -27585 19801 -8622
13972 -8622 -2333 44296 39212 155968 122942 -46248 57363 119671 224914 225504 173729 57720
13960 57720 -4904 -77997 71623 193339 338549 199856 99360 -43996 15266 32450
13950 32450 -84362 90658 148090 93419 226715 209746 261354 371771 292226 155446 166819
13939 166819 312415 344371 212358 207493 228873 107269 95905 147578 170604 99518 77215
13928G7215J98536J77457M611k48546j34771J83520J45417p4525K854N6909p5794
13917C12883j38163k3669J7645j03331j2595J0102J12485N0629K7094k8027k2504
13906B02549N5367k0048O3515l15L7060j82043Q914J24667k090l903L6874j02253
13894B18294j02968J8180K429J8909j43739m4232M0152L8551J79624j19023K6191
13883A32368J24226N1131k32415j24396K56815N3009j04319R0874L3198J7266
13873B97757l3941L9012j21962j65902j52173P1056K6288m7689n9380K6659P9582
13862d0693j7146K3109J02331J79075m8294j21991P183J42758J0012m7559o7908
13851A20877R9747N4582K284j58766m9212j6204j34127j3681M6172J02343l0196
$$ plain form
13928 77215 275751 453208 457819 209273 74502 258022 403439 328914 331768 388677 312883
13917 312883 174720 151051 168696 65365 52770 62872 175357 225986 253080 225053 202549
13906 202549 257916 237868 301383 301068 338128 156085 164999 289666 287576 283673 320547 218294
13894 218294 115326 133506 135935 154844 11105 -33127 7025 45576 225200 106177 132368
13883 132368 256594 307725 75310 -49086 207729 260738 156419 247293 280491 297757
13873 297757 263816 302828 180866 14964 -137209 -66153 -39865 -87554 -146934 -120275 -40693
13862 -40693 -57839 -34730 67601 246676 198382 76391 83574 226332 236344 188785 120877
13851 120877 220624 275206 277490 118724 69512 53308 -80819 -94500 -48328 54015 23819
13840B3819L2330N129p2830J69512J72702o1p0397N4925P2911k33249j38362q7394
13828g0965J19628K88463N2p6890M8672J04007k7754k4046L3539k74801m0145
13817G9760K19269P3850n4776j2808K3955J41905K3292r5907k04120l0678J39035
13806C02777P7706j30886j72247j32797Q7840J54268q970p7053P635L1494J28987
13795B68754J70219L8753J87959L3900J8536j62160j14038p7852p0730r720M082
13784B87703j8608j6544o1297L9590l8033P275O5573L5647R0260k2784L264Q6283
13772D58329O1075J16113n7187O7786j8842J77839P0342N5019M8061O1873j54824
13761H85584j85070Q1460P1232P8327J89835J3586q0241l047r9452R003K8203
$$ plain form
13840 23819 56149 61278 -11552 157960 330662 330601 260204 315129 388040 154791 16429 -70965
13828 -70965 48663 337126 337178 260288 308960 412967 385213 361167 394706 119905 79760
13817 79760 299029 372879 318103 305295 329250 471155 494447 398540 194420 163742 302777
13806 302777 380483 249597 77350 -55447 32393 186661 177691 100638 108273 139767 268754
13795 268754 438973 477726 665685 699585 718121 555961 441923 364071 293341 283621 287703
13784 287703 269095 252551 191254 230844 192811 200086 265659 301306 391566 368782 372046 458329
13772 458329 519404 635517 578330 646116 627274 805113 875455 930474 978535 1040408 885584
13761 885584 700514 781974 853206 931533 1121368 1134954 1054713 1051666 952214 961217 989420
13750I89420n9930n0807R9094J28811Q6264J12204J98241j24933o562J12087p1149
13739A412740p291K545K07027J58979k2071J5805p9633P055K76912J37480J05242
13728B214790R4383O210o1922J24446J76561J39141R2497J84267K38508K5613
13718C234494J17444n116J9330K34080K89655J88861L76719L24108K50302L27251
13708E357128L31159L67750N05026P37122O43068O53807P48961J085408J148475
13699A1577904J273922J425779J660821K040021K400207K794061L179991L749285
13691C0101991M697699N036163N668146O272411O727601P002833O737815O376709
13683G8621368N734716M680192L390526J988179M79066j037946k367229l686739
$$ plain form
13750 989420 929490 878683 977777 1106588 1192852 1305056 1503297 1378364 1371802 1483889 1412740
13739 1412740 1405449 1407994 1615021 1774000 1751929 1767734 1688101 1695156 1972068 2109548 2214790
13728 2214790 2309173 2315383 2253461 2377907 2554468 2693609 2786106 2970373 3208881 3234494
13718 3234494 3351938 3346822 3366152 3600232 3889887 4078748 4455467 4779575 5029877 5357128
13708 5357128 5688287 6056037 6561063 7298185 7941253 8595060 9344021 10429429 11577904
13699 11577904 12851826 14277605 15938426 17978447 20378654 23172715 26352706 30101991
13691 30101991 34799690 39835853 45503999 51776410 58504011 65506844 72244659 78621368
13683 78621368 84356084 89036276 92426802 94414981 94894047 93856101 91488872 87802133
13675H7802133m477268n223134n708144n779592n649601n207365m773483m369733
13667D6613813l732602l249481k738833k131058j589316j008708q77989k21404
13659C1064422L51720Q26744J190110J587484K194055K709996L306293L856637
13651D7087461M093045M022113M322269M531957M673536M765441M983204N073012
13643H3552038M854879M873211N050058N263143N206472N097635M924186M640144
13635A23461766L950690K973855K157129J339158M10682k49997j057491j844378
13627A31141414k437807k981618l399532l714467l999331m342998m313400m315249
13619A01637012m660034m795928n051161n103968n014322m839696m724680m572590
$$ plain form
13675 87802133 83324865 78101731 72393587 66613995 60964394 55757029 50983546 46613813
13667 46613813 42881211 39631730 36892897 34761839 33172523 32163815 31285826 31064422
13659 31064422 31416142 32242886 33432996 35020480 37214535 39924531 43230824 47087461
13651 47087461 51180506 55202619 59524888 64056845 68730381 73495822 78479026 83552038
13643 83552038 88406917 93280128 98330186 103593329 108799801 113897436 118821622 123461766
13635 123461766 127412456 130386311 132543440 133882598 134293280 134043283 132985792 131141414
13627 131141414 128703607 125721989 122322457 118607990 114608659 110265661 105952261 101637012
13619 101637012 96976978 92181050 87129889 82025921 77011599 72171903 67447223 62874633
13611F2874633m250528m079454l816576l555015l387887k738974k213464j764656
13603C7068079j310757r84109o38043j52633K92017Q16764J486359J905943K385742
13594D0869362L306859L799861M430659N198166N764193O203810O491807O305020
13586H2369737N797746N181586M168512K813238J314759n64269j819040l293928
13578I5968341m756617n877675o518807o823928o899288o749731o370010n902192
13570D6070093n422041m818143m097282l598218l073181k605758k167706j927944
13562A8359820j790598j344849j232530j231334r34278r98195q62834q25795o19776
13553H519631n30623m89036n42718l61126m60310l54691j87722k47272k17189
$$ plain form
13611 62874633 58624105 54544651 50728075 47173060 43785173 41046199 38832735 37068079
13603 37068079 35757322 34773213 34135170 33982537 34274554 35091318 36577677 38483620 40869362
13594 40869362 44176221 47976082 52406741 57604907 63369100 69572910 76064717 82369737
13586 82369737 88167483 93349069 97517581 100330819 101645578 101081309 99262269 95968341
13578 95968341 91211724 85334049 78815242 71991314 65092026 58342295 51972285 46070093
13570 46070093 40648052 35829909 31732627 28134409 25061228 22455470 20287764 18359820
13562 18359820 16569222 15224373 13991843 12760509 11826231 10828036 9965202 9139407 8519631
13553 8519631 7989008 7499972 6957254 6596128 6135818 5781127 5593405 5346133 5128944
13544E128944l1978j56201l84017k05661l82532k40363j34720j19182m808J9197
13534C488679k81419k70077n4836K05613p5012k31208l2447o0181j10913k87232
13524B290967j06055o484L5456l0870j36579j84562o4034R0041o9480p6313k2264
13513A719823Q5264m7076j9071n9906j82861j23544R4734L616J50894l9308k63446
13502A319119r2821K12052K75386j27409j19264J06803j20957k54430j80091N9658
13492A078046O9774O4154J6621M5309Q5401l558j51128q7253P67o0368M0788J30757
13480A229310j5977j96496n9184J08892n8071j2822R7549Q387L5939j10027j94152
13469H33348P8105L0104k02640j62121L6658K00998O6184r8231J42102P7137L2716
$$ plain form
13544 5128944 5096966 4940765 4556748 4351087 3968555 3728192 3593472 3474290 3469482 3488679
13534 3488679 3207260 2937183 2882347 3087960 3012948 2781740 2749293 2689112 2578199 2290967
13524 2290967 2184912 2178428 2213884 2183014 2046435 1861873 1797839 1887880 1818400 1742087 1719823
13513 1719823 1805087 1758011 1738940 1679034 1496173 1372629 1467363 1470979 1621873 1582565 1319119
13502 1319119 1226298 1438350 1713736 1586327 1467063 1573866 1452909 1198479 1018388 1078046
13492 1078046 1147820 1211974 1228595 1273904 1359305 1355747 1204619 1117366 1118133 1057765 1098553 1229310
13480 1229310 1213333 1016837 957653 1066545 1008474 995652 1093201 1101588 1137527 1027500 833348
13469 833348 911453 941557 738917 576796 613454 814452 880636 782405 924507 1001644 1034360
13458A034360J75684L5685j80544K8019L8065M522R9589q7049q5248j46034j29906
13447G87143M2106j31440J1832K07521J67832l4666q0885j03238k15261p5669
13437E75275J34403J36529p9356k03026p3329j02825P2409o8946J7154K17699
13427F25987P5868J0256p9793N0031J46074P5698Q091k5756j25895j11503j1299
13416F37759J76942m122q4335J1301k9985k20639j72856r4619J33116O7055P5507
13405D95124k8309L5167K5515Q9541l5363J03393J16186J45997j32266O6242j1241
13394H69986j44726N6976p4422m8557j63505l6978J0967J20562k0835J4541o2261
13383E21748j07003R464p4654j73221m9083P8061p74n758r1025L7420Q1148R2628
$$ plain form
13458 1034360 1210044 1245729 1065185 1093204 1131269 1135791 1235380 1148331 1063083 917049 787143
13447 787143 829249 697809 709641 917162 1084994 1050328 969443 866205 650944 575275
13437 575275 709678 846207 766851 563825 490496 387671 460080 391134 408288 625987
13427 625987 701855 712111 632318 682349 828423 904121 912212 886456 760561 649058 637759
13416 637759 814701 810579 726244 737545 707560 486921 314065 219446 352562 419617 495124
13405 495124 466815 501982 527497 617038 581675 685068 801254 947251 814985 881227 869986
13394 869986 725260 782236 707814 659257 495752 458774 469741 590303 569468 584009 521748
13383 521748 414745 424209 349555 176334 127251 205312 204538 198780 107755 145175 226323 318951
13371C18951O9566j12195l8276q5499l1754J70799M7334J022q8044j7087J00906
13360C35723J74617J70211N0355j67920j84480j67212j0708R5077P2649j33759
13350B34553j12473P2157j00222Q5796l6989q9834L7265J8089m4603j10245Q3973
13339C7467Q0971K6514p4257q8768Q2746R652J3144M9960J38376O6234J32418
13328D74457n1211N2737L8708l6315J13829j75567m0950M6746j08885p2353q2527
13317A58669n5651k9695j4423P390L4732K17830J16642k39220k40543J29054J80825
13306B65610q8173n1360o1161P1305M0838j26199N6051J52872K456j07465k10958
13295e6184J34385o3738q915J04973J68840K7190p8212q5053q6853K004m6570
$$ plain form
13371 318951 388517 276322 238046 152547 120793 291592 338926 339948 251904 234817 335723
13360 335723 510340 680551 730906 562986 378506 211294 200586 295663 368312 234553
13350 234553 122080 194237 94015 179811 142822 52988 90253 108342 63739 -46506 37467
13339 37467 118438 144952 70695 -18073 64673 74325 87469 137429 275805 342039 474457
13328 474457 423246 475983 514691 478376 592205 416638 375688 422434 313549 241196 158669
13317 158669 103018 73323 58900 66290 101022 318852 435494 196274 -44269 84785 265610
13306 265610 177437 126077 64916 136221 177059 50860 106911 259783 262239 154774 -56184
13295 -56184 78201 14463 5548 110521 279361 306551 228339 143286 56433 58437 11867
13284A1867j09806O694J44646N1196L3170k9997o5669P4872O5394r3762j22812
13273c4207j0928J39249j0352R4724r8437p9505K09441O2478r269p2907J02632
13262B92919K36483j46446j40900M7626l6636k45721R6820O7038j30271j19583
13252g8671J36420K28982J43377o0531j04584K1974Q1449M8160R9161n1313k5189
13241D39235j8377Q7349O5847l2128j05460r0254q0583J1487P7356L2089j33807
13230B52754j10K10531K2530k30083p5257J68837K22732M8396K1079j25104o1498
13219D54807j02787m3721k37854j81212J27730K7374P603K04726K0226m1666O2118
13208B97344J461k3782P507J12920O825j26790n4376O9090J80976J11880j75595
$$ plain form
13284 11867 -97939 -91245 53401 104597 137767 107770 42101 116973 182367 88605 -34207
13273 -34207 -45135 94114 83762 178486 80049 544 209985 272463 263194 190287 292919
13262 292919 529402 382956 242056 289682 253046 7325 104145 171183 40912 -78671
13252 -78671 57749 286731 430108 369577 264993 286967 368416 416576 515737 464424 439235
13241 439235 420858 508207 574054 541926 436466 346212 265629 277116 354472 386561 252754
13230 252754 252644 463175 485705 255622 180365 349202 571934 620330 641409 516305 454807
13219 454807 352020 308299 70445 -110767 16963 44337 51940 256666 276892 235226 297344
13208 297344 298805 275023 282530 395450 402275 275485 221109 290199 471175 583055 407460
13197D07460q7133J7274J29515m0260O2423o6969j4879m1497P8783j3016K6248
13186D57949J64139J61630j34421j33594j8989J43514J34956L7639m6405J04329
13176H70747L0117j8324o2601o0864j75419j15526Q8973Q4503j3369j69835j68093
13165B90309k2671J97937P0459J05589L7342m4675p0682N1151l6637n2198r2847
13154D33077N2310p2597p8442N0334P4808j02631P0475R4554j90619j00809O1739
13143B92199j11022j54390K57342L1781J04078R2881J2696R8334M155j98690j57998
13132B71366Q3382M0023P6871j28384j92683P8627P1442J47531O1807j40103Q1859
13121D51738R1099L407j0730n2507r0533j15574O0026n5729n0339r3540p9278
$$ plain form
13197 407460 320327 337601 467116 426856 489279 422310 407431 365934 444717 431701 457949
13186 457949 622088 783718 649297 515703 496714 640228 775184 812823 766418 870747
13176 870747 900864 882540 819939 759075 583656 468130 557103 641606 628237 458402 290309
13165 290309 267638 465575 536034 641623 678965 634290 563608 614759 578122 525924 433077
13154 433077 485387 412790 334348 384682 459490 356859 427334 521888 331269 230460 292199
13143 292199 181177 26787 284129 315910 419988 512869 525565 623899 628054 429364 271366
13132 271366 354748 394771 471642 343258 150575 229202 300644 448175 509982 369879 451738
13121 451738 542837 546244 535514 483007 392474 276900 336926 281197 230858 137318 58040
13110E8040k0033q3623j42461n574R4904J21735J29611N450j5028r6687O2554
13099A08888R2718n8049j37996k9812J871O7655J37770K79812Q112l13324n7881
13088I9764l707j27363Q3141Q2359k6490R9106P3320J156k7761n9108m7162k3034
13076A24221N3531n8123k5353Q5106n407r6403l2367K3498l1311m5595N4407j5208
13064C0996q2734M6208J11674Q0825J05925j12278N0778J19277r3120m7547n3746
13053A56258M1792k06324j45129J57260K07658q6486k29531p0752L0094K48458
13043A03298J01182j24361o6554J27122p1333J2486K04093M3912j509l9210k0937
13032B68189j06346j07744m8047J19801Q0219j69475p8312J5163J43444J06988
$$ plain form
13110 58040 38007 -45616 -188077 -193651 -98747 22988 152599 158049 143021 46334 108888
13099 108888 201606 143557 5561 -24251 -22380 45275 183045 462857 470969 157645 99764
13088 99764 96057 -31306 51835 134194 107704 206810 280130 281286 253525 194417 147255 124221
13076 124221 177752 119629 94276 179382 173975 77572 45205 68703 37392 -8203 46204 30996
13064 30996 -51738 -5530 106144 186969 292894 180616 231394 350671 257551 210004 156258
13053 156258 198050 -8274 -153403 3857 211515 125029 -104502 -175254 -145160 103298
13043 103298 204480 80119 13565 140687 69354 81840 285933 329845 328336 289126 268189
13032 268189 161843 54099 6052 125853 206072 36597 -41715 -26552 116892 223880
13022B23880m8289j60611J36202j15225j86582N7959l718M0635M1743j40732p8074
13011b32812J5486J62432m8719J72225k5913k481q5232K6328J63803k5528j11316
13000H273j16341j53118Q3256J29409o2535k16559j21409K2593P8980K68939J28885
12989E0373P9722n7214j76216J0079N4817N4896j11541M0880N577J29054K4686
12978A05113L4237k1315k00707r1661K9742J22562Q701q3316m2007l2127m7192
12967b17970K63972m1863r395j14012j34949q947J94353M5261J079q8340k7219
12956a38030P8481j8213J28322R0542L6438j02874l8494q265M9712r6005n4116
12945g2502N4559J14763j53728j81103O4016O3785J17674n7460n3493p423p8490
$$ plain form
13022 223880 175591 14980 151182 35957 -150625 -92666 -96384 -55749 -14006 -154738 -232812
13011 -232812 -217326 -54894 -103613 68612 42699 40218 -45014 -18686 145117 119589 8273
13000 8273 -108068 -261186 -177930 -48521 -111056 -327615 -449024 -426431 -347451 -78512 50373
12989 50373 130095 72881 -103335 -93256 -38439 16457 -95084 -54204 -48627 80427 105113
12978 105113 139350 118035 -82672 -174333 -144591 -22029 -13328 -96644 -138651 -170778 -217970
12967 -217970 46002 4139 -5256 -119268 -254217 -263164 -68811 -23550 -22471 -110811 -138030
12956 -138030 -59549 -77762 50560 141102 177540 74666 36172 27907 77619 -18386 -72502
12945 -72502 -17943 96820 -56908 -238011 -173995 -110210 7464 -49996 -103489 -110912 -189402
12934a89402q2233J8514J00435J49104J70054J01003k5502j39971k01603o507
12924a06108J10252Q2060k07262p2282J20513k2992j652K12158N8626R2551N2667
12913C18531j04655M0764L9826j2254P988l4654k25491o4542n5091J06315j1538
12902E199n5264r8767j0077Q255q4162m912J87743J69442k1068n1868P0309k12329
12890i7499j92286O202K02133J26460j59116J76452K30377M6322l9259j03613
12880A96173n2729O0508j53507j84153O4671K13495J91668r0942j15845N1566
12870A80905m1081j61678j18571Q6254L8191L007J44221R6501o4135j42242q9839
12859f8467K0979J15554j3809Q9975K4915j93315j7335K01288M2744k33738j67795
$$ plain form
12934 -189402 -271635 -253121 -152686 -3582 166472 267475 241973 102002 -99601 -106108
12924 -106108 4144 86204 -121058 -193340 -72827 -95819 -97471 114687 173313 265864 318531
12913 318531 213876 254640 294466 282212 290200 255546 30055 -34487 -89578 16737 5199
12902 5199 -50065 -148832 -158909 -150654 -234816 -239728 -51985 117457 96389 44521 114830 -97499
12890 -97499 -289785 -283583 -81450 45010 -114106 62346 292723 339045 299786 196173
12880 196173 143444 203952 50445 -133708 -69037 144458 336126 245184 129339 180905
12870 180905 139824 -21854 -140425 -54171 -15980 -12973 131248 227749 163614 21372 -68467
12859 -68467 -47488 68066 54257 144232 169147 -24168 -41503 159785 202529 -31209 -199004
12848a99004J17708K48379J89788J4279K4578p9617k12991j12496m1585J32110
12838H1149M7571k5783k2616p2161J69321O7634j99989J0671K5256m8750l3316
12827a013m4131O3519J54747K25982j20528j93143R2107J0053q3455j39414J27159
12816I1883J21809q2994l42502Q0889M64054P2417k28302k60112R705L5057K12848
12805A74752J41094o7529j72600j67688R1789P6516L4289k13530n4109l6640J23549
12794g0107O8811l4640J13249O1455j438R4744j73195j38629j94114P7423J21418
12783g5023r88n022K2542L5629J35305J56794r6914r3776p4564j15932n8573L3898
12771a36624J11233K22825N4365j24843J0461J30994k0635J53214P3752l0663
$$ plain form
12848 -199004 -81296 167083 356871 371150 395728 316111 103120 -9376 -50961 81149
12838 81149 128720 102937 80321 8160 177481 245115 45126 55797 81053 32303 -1013
12827 -1013 -45144 18375 173122 399104 278576 85433 177540 187593 104138 -35276 91883
12816 91883 213692 130698 -211804 -130915 333139 405556 177254 -82858 -73153 -38096 174752
12805 174752 315846 248317 75717 -91971 -182 76334 110623 -102907 -157016 -193656 -70107
12794 -70107 -1296 -35936 77313 138768 137330 232074 58879 -79750 -273864 -196441 -75023
12783 -75023 -76011 -81033 -58491 -22862 112443 269237 172323 78547 3983 -111949 -170522 -136624
12771 -136624 -25391 197434 251799 126956 137417 268411 247776 400990 474742 444079
12761D44079j28300j42948J13405K890J683j11257k62747J67315J06632q1215
12751A09537j1903k31308m0942P7252j20792m4560q3030J5760J79114J15550j49726
12740a85048p3059R0009l00N3048r300K02310K06435M1756p5290j86161m5149
12729A9251O8380l3047N5327n8397L0307J61707k5043j79894l0499l8572o1973
12718i2453m5549K44635J2806k96703j25061N7511K55475P5633P3078l4103j29856
12707d587j01747O7797o9904j60603R3866J34484m9746p0607J62490K0397j21446
12696i9606j03635P5489J65049J07645m6256q4390k3338J2406j27690M7568Q5007
12685H249m0346q5166j58K5430J35153J31582J59271j57454j0945J52496K366
$$ plain form
12761 444079 315779 172831 286236 289126 290809 179552 -83195 84120 190752 109537
12751 109537 97634 -133674 -174616 -97364 -218156 -262716 -345746 -329986 -150872 -35322 -185048
12740 -185048 -258107 -168098 -168398 -115350 -124650 77660 284095 325851 250561 64400 19251
12729 19251 87631 54584 109911 51514 81821 243528 218485 38591 8092 -30480 -92453
12718 -92453 -138002 106633 119439 -177264 -302325 -244814 10661 86294 159372 125269 -4587
12707 -4587 -106334 -38537 -108441 -269044 -175178 -40694 -90440 -161047 1443 21840 -99606
12696 -99606 -203241 -127752 37297 144942 98686 14296 -9042 3364 -124326 -76758 8249
12685 8249 -32097 -117263 -117421 -91991 43162 174744 334015 176561 165616 318112 320478
12674C20478j9884J42596j20506L4034o2706q9313J6330J12070j22871k5782k08731
12663b4285o3887K12910L7921k01502k3890O4892R2670p5192Q203O8564j9697
12652G6707q478n334q4009l8562P3495P1916R8278J0950L9411K5919J0471j94123
12640G6641j16390O8556k9638n8017J50200k1413K5273J07533Q0864k01621N3146
12629A35134R2653L8251k9978k1634q6498Q5001p1478o5602J32355j53149j82124
12618a27069R3887J0482j17234l0328j1495Q3652J13444L5581L822k6002J6568
12607D5308r8386K3067j01119o1443n4902P0535l6004M4306K8014L1519R6437
12596a2668M6125k4990K5119j6802j6067j10209Q6139q1642J7763P0533O0864
$$ plain form
12674 320478 300594 443190 322684 356718 294012 204699 221029 333099 210228 184446 -24285
12663 -24285 -88172 124738 162659 -38843 -62733 2159 94829 19637 27840 96404 76707
12652 76707 68229 62895 -21114 -59676 13819 85735 184013 194963 234374 260293 270764 76641
12640 76641 -39749 28807 -831 -58848 91352 69939 95212 202745 283609 81988 135134
12629 135134 227787 266038 236060 214426 127928 212929 141451 75849 208204 55055 -127069
12618 -127069 -33182 -22700 -139934 -170262 -181757 -98105 15339 50920 54742 28740 45308
12607 45308 -53078 -30011 -131130 -192573 -247475 -176940 -212944 -168638 -140624 -109105 -12668
12596 -12668 33457 8467 33586 16784 717 -109492 -23353 -104995 -87232 -16699 44165
12585D4165L4272J13810Q3444m4640k57570j18970m8077Q6982J54773N2494j53850
12574e3167j73216R184J49810J50077m3024l1607P7444j47794q9178J2217J44405
12563E151j2279j59700n2107n9848P474m0J57839J89093N0565q159J48343n2236
12551B14096k1694j7246O7267r4545J04900J51116o6248K5489j14140j69707o8018
12540A1270j77036J1623Q205O3035Q5308J42339J75584q6800m6449L9215m4671
12529A81623q0278L1606q9120j39462j07261l3059n8557J48491J9781Q9677R7148
12518F0589j19373L9705k4383j6496K3001O8095q3542q5838M277j5727K5884P5619
12506d8189K2732P8113K8381Q6239P7719J5024j99192j0599m4383m4365J70519
$$ plain form
12585 44165 78437 192247 275691 231051 -26519 -145489 -193566 -106584 48189 100683 -53167
12574 -53167 -226383 -217199 -67389 82688 39664 8057 85501 -62293 -151471 -139254 5151
12563 5151 -7128 -166828 -218935 -278783 -271309 -271349 -113510 75583 126148 117989 266332 214096
12551 214096 192402 175156 242423 147878 252778 403894 337646 363135 248995 79288 11270
12540 11270 -165766 -154143 -145938 -82903 2405 144744 320328 233528 187079 226294 181623
12529 181623 101345 132951 43831 -95631 -202892 -235951 -294508 -146017 -126236 -36559 60589
12518 60589 -58784 -19079 -43462 -59958 -36957 31138 -52404 -138242 -133965 -149692 -123808 -48189
12506 -48189 -25457 52656 81037 167276 244995 260019 60827 50228 5845 -38520 131999
12495A31999l0630j17706P0521J33842J02629j09974j63427j48109R8170J04424
12485G1739J31513o935p6495j84534m8558j03815L6871n4663J39453J94176l9024
12474E9728L6218j19738N9509M9884o9924o1923j51195m5347L6764O5015K13238
12463G2229J21853q6699N6262J12118K5917j25699J2905J29420j77664o7560k56
12452G2826N2432n1853k11299j37635O2534J50557J58012j55578r4557O1657J10670
12441A7766J21340j9821J10480k7064j28237j97228j31070J20432N677J50101
12431B2376Q0276k2759K7488p7909j49486J5682o5389O5337q6504r6798J5733
12420b71953N8123J07229Q7220j7247J02607J30578M1317n5883j57932j44738
$$ plain form
12495 131999 101369 -16337 54184 188026 290655 180681 17254 -130855 -32685 71739
12485 71739 203252 196317 119822 -64712 -113270 -217085 -180214 -234877 -95424 98752 59728
12474 59728 95946 -23792 35717 85601 15677 -46246 -197441 -242788 -206024 -141009 72229
12463 72229 194082 107383 163645 275763 301680 175981 188886 318306 140642 73082 72826
12452 72826 125258 73405 -137894 -275529 -212995 -62438 95574 -60004 -154561 -92904 17766
12441 17766 139106 119285 229765 202701 74464 -122764 -253834 -133402 -127725 22376
12431 22376 102652 79893 107381 29472 -120014 -104332 -169721 -104384 -190888 -287686 -271953
12420 -271953 -213830 -106601 -19381 -36628 65979 196557 237874 181991 24059 -120679
12410a20679j46569J24585J37271Q6574r0623L6490J7720K6333l116P638o1503
12399A4121J3003r5059O4859P3390M8195P752O959k06346l8096K35701P9764k125
12387B02118K9150L09o1024J23119J30266l2940j8478J4790l5906k44265Q1827
12376A88966J5523J2148R2962o9858j27786p0795J08805O3890l5597J59427L1309
12365C68994n5292J17150o1315k73483R4069J57897J48298j142p1284j14682j25905
12354A83305N437j12682N95K39743J15633J95014k2213j28369l23251j70065k1468
12343c8321m536J8061R7050J28698M3697j53018j79245M274L5287l2373J06497
12332B6071J25083K4300j54293j35220J8084M6250K1097N4455J14319L0754m2359
$$ plain form
12410 -120679 -267248 -142663 -5392 81182 -9441 27049 44769 71102 67986 75624 14121
12399 14121 27124 -67935 -3076 70314 118509 126261 133220 -73126 -111222 124479 204243 202118
12387 202118 231268 231577 170553 293672 423938 390998 372520 387310 351404 107139 188966
12376 188966 204489 216637 309599 239741 111955 41160 149965 213855 178258 337685 368994
12365 368994 313702 430852 369537 96054 190123 348020 496318 495176 423892 309210 183305
12354 183305 188742 76060 76655 316398 432031 627045 604832 476463 153212 -16853 -38321
12343 -38321 -42857 -24796 72254 200952 244649 91631 -87614 -83340 -48053 -80426 26071
12332 26071 151154 175454 21161 -114059 -95975 -49725 -28628 25827 140146 170900 128541
12321A28541k9008o4420J61191R1715j96249k17390P2741k43J462J25610J0769
12310H4719j3979q8002M7454P2468J0350J1209k20849P6977Q9334O8319J31635
12299B69635o5637n502J8541P283L6287j86190j72548m9694J61415J15021j43091
12288a4480L1829m4947l7392J88134J39526J5958r76J53484J40676j07070o6392
12277C98350j51920L5502K7102q1843K4576R5262q4666m7005Q1127j2161p6635
12266B07689J5242L0560n2428j67259R588j08537q8500O114j26601M7433K92154
12255F5455N1561J0821J63082R7450j6928K9465J20073k0226m5605L5219j09956
12244C80411j69557j67639j71043J3453K76298n6200k19530J3023J50380O3352
$$ plain form
12321 128541 99533 35113 196304 288019 91770 -125620 -52879 -53122 -51660 73950 84719
12310 84719 70740 -17262 30192 102660 113010 124219 -96630 -19653 69681 138000 269635
12299 269635 203998 198496 217037 224320 260607 74417 -98131 -147825 13590 128611 -14480
12288 -14480 17349 -27598 -64990 123144 262670 278628 277652 431136 571812 464742 398350
12277 398350 246430 281932 309034 227191 251767 347029 262363 215358 296485 284324 207689
12266 207689 222931 253491 201063 33804 43392 -65145 -153645 -147531 -274132 -226699 65455
12255 65455 117016 127837 290919 388369 371441 400906 520979 500753 455148 490367 380411
12244 380411 210854 43215 -127828 -114375 161923 105723 -113807 -100784 49596 112948
12234A12948q3757j51276O4684J4055m9132N3506R4685R0759O8657j23896j20200
12223b8967P3982K21709P6938n2692j41486Q1199p1726j73947j65712j37550J66495
12212a51757J73933J14094K47126L1174j23615P3003m8758O8751J0395j20703
12202B73643o2775K2903j01445l0747n0081J5720J08223Q8507j6094M5384J3559
12191C06797j63769p9255k1659J1234k1355j88375J34856K25702R663j00416j24602
12180a1179O4630k8594p9444J84465L02284j15471L73j64776p9921j6014O6771
12169A23124P3120l3583J63569j05011j03333J21923K44608J38082J8980r5887
12159E45592l05362k2465r3358j08305N4175J59582R0641m4587j06249j47166
$$ plain form
12234 112948 29191 -122085 -57401 -43346 -92478 -38972 55713 146472 215129 91233 -28967
12223 -28967 45015 266724 343662 290970 149484 230683 158957 -14990 -180702 -318252 -151757
12212 -151757 22176 136270 383396 414570 290955 363958 315200 383951 394346 273643
12202 273643 210868 233771 132326 101579 51498 67218 175441 263948 247854 293238 306797
12191 306797 143028 63773 42114 53348 31993 -156382 -21526 204176 213839 113423 -11179
12180 -11179 53451 24857 -54587 129878 432162 316691 317064 152288 72367 56353 123124
12169 123124 196244 162661 326230 221219 117886 239809 484417 622499 641479 545592
12159 545592 240230 217765 124407 16102 70277 229859 320500 275913 169664 22498
12149B2498n066k1772L3653r5149j3881N78J7580j29978j0871R1380O8800l7637
12137g9865J02439K6599o1870R1932R0170L2611j9810K28339R3322k17183l5061
12126B51623l3486m3322L5432n651p1445R4474J18930K535j28170j07661L9237
12115A52496K6572n2056j65588J46759P6796R2223m61j0250N950k3696j25377
12104A23368j96009m5678K50635J35338k4259J7945J23118N5872R8559N1002K9096
12093F18987k05160j78134J45054J58180j35416j86859k6915K77006J62472J29844
12083G59059j03640l08143j6779P6152o5912j6828j16221k4289k6684N3507R3609
12072C03831m3345L7829O7021o8621L8098N2149N3911L9361Q8952l9194o2147
$$ plain form
12149 22498 17432 -4340 29313 -65836 -79717 -79139 -61559 -191537 -202408 -111028 -42228 -79865
12137 -79865 22574 49173 -12697 79235 169405 202016 182206 410545 503867 286684 251623
12126 251623 218137 174815 210247 204596 133151 227625 346555 349090 220920 113259 152496
12115 152496 179068 127012 -38576 108183 184979 277202 276741 266491 272441 248745 123368
12104 123368 -72641 -118319 132316 267654 243395 261340 384458 440330 538889 589891 618987
12093 618987 413827 235693 380747 538927 403511 216652 189737 466743 629215 759059
12083 759059 655419 347276 330497 406649 340737 323909 207688 183399 156715 210222 303831
12072 303831 260486 298315 365336 296715 334813 386962 440873 480234 569186 529992 467845
12061D67845J4467j1533J9343J96934M7941K88573J04266j2218j81944j2074p7984
12050H43616k21810m9654r3004j04223K43745J11640J98464K02099j19235o1018
12040I50620j10421J10078K36236l2887J5990Q6293p1402j68024l299Q8214J63417
12029A264815k2804M6058R2287N1738P5471k15070m4100N3943q6644K77507J08109
12018A601310P6434o3877j555Q4873M2216p9543K1154O7040l562K37936K43833
12007B226259n567k58764p6137O6682Q1630p5874K30851K46912P2438o2683R8558
11996B544305J64419R1758k4699K19637J93803k49056j03908m8990J31076J37519
11986C055864L8376K024L28947K01227m9002M7086L55784L41843L21832O2873
$$ plain form
12061 467845 482312 470779 490122 687056 734997 1023570 1127836 1115618 933674 921600 843616
12050 843616 621806 572152 479148 374925 618670 730310 928774 1130873 1011638 950620
12040 950620 840199 950277 1186513 1153626 1169616 1255909 1184507 1016483 1013184 1101398 1264815
12029 1264815 1242011 1288069 1380356 1432094 1507565 1292495 1248395 1302338 1215694 1493201 1601310
12018 1601310 1677744 1613867 1612312 1697185 1739401 1659858 1681012 1748052 1744490 1982426 2226259
12007 2226259 2220692 1961928 1885791 1952473 2034103 1958229 2189080 2435992 2508430 2445747 2544305
11996 2544305 2708724 2800482 2775783 2995420 3189223 2940167 2836259 2787269 2918345 3055864
11986 3055864 3094240 3096264 3425211 3626438 3577436 3624522 3980306 4322149 4643981 4706854
11976D706854j19678m1759K24887K17761J59576Q4521K71712L45139L12111K71767
11966F432891L39983J36307K44256M45628L76397L36796L61780M72314N39668
11957I686020N42435M93659N47374M41952N73091O55751Q53240R30962R33939
11948A5658423P69290R20002R93130J240711J284824J156862J427925J577177
11940B5028344J597032J497269J658488J688452J626550J961570J901003J963663
11932C8922371J795416J668990J480475J433713J400948J115985O91304M10766
11924D8919968l4876N460m32821p86823j101634j201107j351306j521195j847147
11915D0648519j820960j818797j813456j737818j671188j615141j559346j648575
$$ plain form
11976 4706854 4587176 4545417 4770304 4988065 5147641 5232162 5503874 5849013 6161124 6432891
11966 6432891 6772874 6909181 7153437 7599065 7975462 8312258 8674038 9146352 9686020
11957 9686020 10228455 10722114 11269488 11711440 12284531 12940282 13793522 14724484 15658423
11948 15658423 16427713 17347715 18340845 19581556 20866380 22023242 23451167 25028344
11940 25028344 26625376 28122645 29781133 31469585 33096135 35057705 36958708 38922371
11932 38922371 40717787 42386777 43867252 45300965 46701913 47817898 48509202 48919968
11924 48919968 48885092 48890552 48457731 47670908 46569274 45368167 44016861 42495666 40648519
11915 40648519 38827559 37008762 35195306 33457488 31786300 30171159 28611813 26963238
11907B6963238j445515j422627j255577j129843j218135j182071j095955q67443
11899A7346072o79887r65204j097864p67286p29478p30008n72010m42247k89762
11890A1072326l97993l16253m00397n17932m00899m68518l66323k89805k47694
11881G666512j52401l35919m04047k98322l95206l06832j96506j33684j61909
11872E281686k74075j17166q0433k71677k15904l04939l6113O3783j02064j24654
11862C818444j82409j40862N0151q1034j10047k28245j53625Q8915L5658j81419
11852B915527l10771j01579j20703j699J05824O3678r292j27554k70568j4526
11842B128337l1686r1129m6666k07070j6409K35705j30968n2609l5453P3938O3067
$$ plain form
11907 26963238 25517723 24095096 22839519 21709676 20491541 19309470 18213515 17346072
11899 17346072 16666185 15700981 14603117 13835831 13106353 12376345 11804335 11362088 11072326
11890 11072326 10674333 10358080 9957683 9439751 9038852 8570334 8204011 7914206 7666512
11881 7666512 7514111 7178192 6774145 6475823 6080617 5773785 5577279 5443595 5281686
11872 5281686 5007611 4890445 4810012 4538335 4322431 4017492 3981379 4045162 3943098 3818444
11862 3818444 3636035 3495173 3545324 3464290 3354243 3125998 2972373 3061288 3096946 2915527
11852 2915527 2604756 2503177 2382474 2380775 2486599 2550277 2540985 2413431 2142863 2128337
11842 2128337 2096651 2005522 1958856 1751786 1735377 1971082 1840114 1787505 1752052 1825990 1889057
11831A889057r4341r4477j29409k9572N6708k2036k29801j88444J04497P5865
11821A338047l9506N431p3515k7815O2174K2982r7916l00484L3063O1608K8181
11810A012250j1308p5054N6488o8268O0093J6063N6417j06238l4573p4971N4051
11799H84950K07940n1270j6290o1264j70843p6332O3087j39039m3682M7503J40483
11788G85243Q1647J2898j04324M6022L3921p9965n0746q4287q078o4617Q4533
11777F52247O328j32653J33602l1560J02950o4370k8972m3732J64562k3385j35548
11766E99469k8085J80677m7461j27658o816K29027N4505M3535J08101j59990O5184
11755I10488j17349k58112r3192J72949R2206K9959l0275j97441j12211J89842
$$ plain form
11831 1889057 1794716 1700239 1570830 1541258 1597966 1575930 1346129 1157685 1262182 1338047
11821 1338047 1298541 1303972 1230457 1202642 1264816 1287798 1189882 889398 922461 984069 1012250
11810 1012250 1000942 925888 982376 914108 974201 990264 1046681 940443 905870 830899 884950
11799 884950 1092890 1041620 1025330 964066 793223 716891 779978 640939 597257 644760 785243
11788 785243 866890 879788 775464 821486 855407 775442 724696 640409 632331 567714 652247
11777 652247 658575 525922 659524 627964 730914 666544 637572 593840 758402 735017 599469
11766 599469 571384 752061 704600 576942 570126 799153 853658 897193 1005294 845304 910488
11755 910488 793139 535027 441835 614784 706990 736949 706674 509233 397022 586864
11745E86864M3994j49600J14731N218p3612j33433J52581j231m158j90242o2875
11734B88237P3806m9827K1742m763q8557j22491M4630j0061N5457Q5560J25680
11723D19413m4100m1542K34758Q5091o1185l56839J9254J41977n1073J08757k5662
11712D28849l5547K4779J22752R5842p2118k18694j10951P9380N1280j78779N2715
11701B39508K8193J21185N8553n2984O158l6071q8863O137j30243j82566l8169
11690f9162P8770L4713q3646m360O8244J0397P0144N2490N6124m2585M8583m4069
11678A75643J08050O5502Q7466k57327p3025J05053j13543L2J50631J43920N9150
11667D51552Q3689P7151j36578k7125K8583p873K8273R1666j89937m8502j40856
$$ plain form
11745 586864 630858 481258 595989 601207 527595 394162 546743 545512 541354 351112 288237
11734 288237 362043 312216 333958 329195 240638 118147 162777 152716 208173 293733 419413
11723 419413 375313 333771 568529 653620 592435 235596 254850 396827 345754 454511 428849
11712 428849 393302 418081 540833 636675 564557 345863 234912 314292 365572 186793 239508
11701 239508 267701 388886 447439 394455 400613 364542 275679 281816 151573 -30993 -69162
11690 -69162 9608 44321 -39325 -43685 24559 34956 105100 157590 213714 171129 219712 175643
11678 175643 283693 349195 436661 179334 106309 211362 97819 97851 248482 392402 451552
11667 451552 535241 612392 475814 448689 477272 469399 497672 589338 399401 350899 210043
11656B10043o9923K0137j2555q3498O1220J24026Q6913j4824q6980r0937m1502
11645A02120R000P1260J34533O6315R9475P1305J12047K8554l00403j94144j31236
11634F8826q835j39425P197J65229k9406j26963J36884J88460J24517K5759j06339
11623C05904j29615l4092k0933L9266L6304o018J24945j95739l1275J9734J8905
11612A27386R049P9560j26659j16386k02777L3072J23128L9561J48218K22540
11602C36692n367q8195J16471L0877K3496j08475K1249j39575n3578m136R5234
11591B24693R9051j1501J45754p7637l6018j78214n6915J05824M9610k0525k09520
11580C4602k44912J05628K2182l851k5860n8630O0942O5006J45406m6825K4414
$$ plain form
11656 210043 140120 160257 147702 64204 125424 249450 336363 321539 234559 143622 102120
11645 102120 111120 182380 316913 383228 482703 554008 666055 694609 394206 200062 68826
11634 68826 59991 -79434 -72237 92992 63586 -63377 73507 261967 386484 412243 305904
11623 305904 176289 142197 121264 160530 196834 190816 315761 120022 88747 108481 127386
11612 127386 136435 215995 89336 -27050 -229827 -196755 -73627 -34066 114152 336692
11602 336692 331325 243130 359601 390478 413974 305499 326748 187173 133595 129459 224693
11591 224693 323744 312243 457997 380360 344342 166128 109213 215037 264647 244122 34602
11580 34602 -210310 -104682 -82500 -86351 -112211 -170841 -109899 -44893 100513 53688 78102
11569G8102O1559L2610p5294l9909n6943j6370j60104j64210J33668P1265J83614
11558D7988k19847m6507Q4833J167k901p8910N6343L8569K8514J24364k4609R6112
11546A05116J0363Q3945K3037L651q1629j78077J1906N3167J21938J64034j0628
11535C06823J42075j1664k29470p8282K23719R1002l19298o1992J18872k3774
11525A58011J51097L5576N9184j59439j69135J32061J54081o2489m0111j5870
11515B42966K5820J49144j03404j17299j47029P9890L8853n7288j52363r2639
11505a33349N5817J35785n2272o3061O1640R0038j00032q7209j00581k19065j207
11494d13496P044J98314K49101R0891Q4509k43241j42110k0798K22607K17793
$$ plain form
11569 78102 139661 172271 96977 57068 125 -16245 -176349 -340559 -206891 -135626 47988
11558 47988 -171859 -218366 -133533 -132366 -135267 -214177 -157834 -119265 -90751 33613 9004 105116
11546 105116 115479 199424 222461 226112 144483 -33594 -21688 31479 153417 317451 306823
11535 306823 448898 437234 207764 129482 353201 444203 124905 62913 181785 158011
11525 158011 309108 344684 403868 244429 75294 207355 361436 298947 258836 242966
11515 242966 268786 417930 314526 197227 50198 130088 168941 111653 -40710 -133349
11505 -133349 -77532 58253 5981 -57080 4560 94598 -5434 -92643 -193224 -412289 -413496
11494 -413496 -406452 -208138 40963 131854 216363 -26878 -168988 -189786 32821 250614
11484B50614K2508j21139K7287R5785p4401l3717o9277j55488j12447j05159J22233
11473a53201R2457k08164p6386J24363R1896O2665k7664n5619n623M9380l1291
11462a37187P7011P4554p017K2803m6147R5842p8865j40566J0182j48782j70698
11451d48870Q5433J25439J05789J77076j5169K4086L2347K0614J1597K04315j00360
11440B22297j59564M0169k3460p945m0105R2293j148k2753j54082j88326r6215
11429c38839R6498J03160L9782n0939l688J33121J97209n7071o9099M1324Q059
11418I9517N0070j8146k1191l7852L4034M1087j5433k63069k15797J22897O7188
11407a56695r022l5144o9050R6641m8129J08618K7169n2083P4561k8421N042L2191
$$ plain form
11484 250614 273122 151983 179270 275055 200654 166937 97660 -57828 -170275 -275434 -153201
11473 -153201 -60744 -268908 -345294 -220931 -129035 -66370 -94034 -149653 -155276 -105896 -137187
11462 -137187 -60176 14378 7361 30164 -15983 79859 994 -139572 -129390 -278172 -448870
11451 -448870 -363437 -237998 -132209 44867 29698 53784 86131 106745 118342 322657 222297
11440 222297 62733 102902 79442 71497 31392 123685 122537 99784 -54298 -242624 -338839
11429 -338839 -242341 -139181 -99399 -150338 -154026 -20905 176304 119233 50134 91458 99517
11418 99517 149587 131441 110250 72398 106432 147519 132086 -130983 -346780 -223883 -156695
11407 -156695 -165717 -200861 -269911 -173270 -221399 -112781 -85612 -137695 -63134 -91555 -86513 -54322
11395e4322j22566q1116p2255O6102J99555O02j53080k0005Q0037O7762j628P5975
11383a4939o2073p0773J5021J73988n5841p4236J24435L1337k14789j32805J06279
11372a74396J59271m8667l4963j7408k0622k7933J64160n7920j27153O3843J79366
11361E7578M2996m4676m2958q6899J65784J9777q579O595p1613j68570J0838l1478
11349a51205P3852J69162J18982j63581o0926M4818L604J61568R7163M5632o5267
11338B73802J3637q4473r6787K8031K9686j87166j16137K4533R5853J9801L0031
11327C0811j7331o4395k9154r9377k9526J66159k4398j99989j04506L05787Q3172
11316A7253J9054j5443p4558J40652R126k9177J08120L269o6352j46998p359q885
$$ plain form
11395 -54322 -176888 -258004 -330259 -264157 -64602 -64000 -217080 -237085 -157048 -89286 -90914 -14939
11383 -14939 -77012 -147785 -132764 41224 -14617 -88853 35582 66919 -147870 -280675 -174396
11372 -174396 -15125 -63792 -98755 -116163 -136785 -164718 -558 -58478 -185631 -121788 57578
11361 57578 100574 55898 12940 -73959 91825 111602 103023 109618 38005 -130565 -119727 -151205
11349 -151205 -77353 91809 210791 47210 -13716 31102 34706 196274 293437 339069 273802
11338 273802 287439 202966 106179 134210 163896 -23270 -139407 -114874 -19021 780 30811
11327 30811 13480 -50915 -80069 -179446 -208972 -42813 -67211 -267200 -371706 -65919 17253
11316 17253 36307 20864 -53694 86958 96084 66907 175027 178296 111944 -35054 -42413 -51298
11304e1298J29354O0330l9165j51119k02620j1224N5682J56209J75613m8675j21420
11293d8333j07851m0296j3680K6998N4043O8257J46929j37383j50746j52659j5946
11282c70667R8413L4680J36789J22138j55324k1203J30299L0998k25967N2559
11272a67285R7176J63760n7226l1467m2573j04676J801R234N8110O4034k3570
11261c2682J06934j54002r0855o7154p4545O9836N6821J15670r3044n116J05100
11250f3037P7483r963m8817k29282n3855J05600J83840Q9719M0968n4605j22283
11239h4232r406J39947P5716l10Q1388Q6834l6178k25042M064J02170n8455j80032
11227a03536N7191L6326r0741j03368O3300Q3617k5154n9609L4536J3405l9498
$$ plain form
11304 -51298 78056 138386 99221 -51898 -254518 -265742 -210060 -53851 121762 73087 -48333
11293 -48333 -156184 -196480 -210160 -183162 -129119 -60862 86067 -51316 -202062 -354721 -370667
11282 -370667 -272254 -237574 -100785 21353 -133971 -155174 -24875 6123 -219844 -167285
11272 -167285 -70109 93651 36425 4958 -37615 -142291 -140490 -131256 -73146 -9112 -32682
11261 -32682 74252 -79750 -170605 -237759 -312304 -242468 -185647 -69977 -163021 -168137 -63037
11250 -63037 14446 4483 -44334 -273616 -327471 -221871 -38031 51688 92656 38051 -84232
11239 -84232 -93638 46309 122025 121715 203103 289937 253759 28717 32781 134951 76496 -103536
11227 -103536 -46345 -10019 -100760 -204128 -140828 -57211 -82365 -141974 -107438 -94033 -133531
11216a33531j7274R2401k0276k5611P4687Q6359j21432l4019K4943r837P977J65449
11204H9836O0085p7388n4010m0125J3959r7530n8040n1178k8601J10871K17222
11193H5101K46231j53163j05739j42800J4999k5612j06942P2184K9521M4078n6009
11182i8151k3908J71024J03750L6413j83197R626j86605M3779M7490J10336J24077
11171A54634j51480o9816J89798Q5560j68369p8843k557j36348K454L0145O8014
11160g6808o3605k4349p8804m5676O2168J88383K902k2699J43074Q694j73088
11149g9808J0233R9629K9086l6274n5793j64800M4536j1637r3632M2220J22043
11138i4197K42393r9628j84163J03669l4280j4118m7319M831j7590m079O1835
$$ plain form
11216 -133531 -150805 -58404 -78680 -104291 -29604 56755 -64677 -98696 -73753 -83590 -75613 89836
11204 89836 149921 72533 18523 -21602 -7643 -105173 -163213 -214391 -242992 -132121 85101
11193 85101 331332 178169 72430 -70370 -55371 -80983 -187925 -115741 -86220 -42142 -98151
11182 -98151 -122059 48965 152715 189128 5931 15557 -171048 -127269 -79779 30557 154634
11171 154634 3154 -66662 123136 208696 40327 -38516 -41073 -177421 -174967 -144822 -76808
11160 -76808 -140413 -164762 -243566 -289242 -227074 -38691 -35789 -58488 84586 93280 -79808
11149 -79808 -69575 30054 59140 22866 -32927 -197727 -153191 -164828 -258460 -216240 -94197
11138 -94197 148196 48568 -135595 -31926 -66206 -80324 -127643 -122812 -140402 -144481 -82646
11127h2646K2376J57253J38119j23470R0750J14822j54737j89514J02430k4953
11117E0430N4578Q1515j15356k18669m7674J26991p8233L2925J54727m6004j35095
11106a39865N0043O7166J97105l3046M056o7682j55852q8696N2035P1506P5410
11095C2180r8824j36062j50823K6890J64900j38910p3229O8718J65426q765P2654
11084g5845K618r4423j33615j6960J49134L4657j03687Q504J46293r9513J6972
11073a65865J7454k10162m9107P1262J78079K3072R9427K630q1306o7698o816
11062a89030J61133P6274O6927p0855n0135J27310o0248q5521l1690j33645k3512
11051b12992J79280j4110J095l7879j00895r4036N4762M1475J54152J10496J49316
$$ plain form
11127 -82646 -60270 96983 235102 111632 202382 317204 162467 -27047 75383 50430
11117 50430 105008 186523 71167 -147502 -195176 -68185 -146418 -113493 41234 -4770 -139865
11106 -139865 -89822 -22656 174449 141403 145459 77777 -78075 -166771 -114736 -43230 32180
11095 32180 -66644 -202706 -353529 -326639 -161739 -300649 -373878 -305160 -139734 -148499 -75845
11084 -75845 -73227 -167650 -301265 -318225 -169091 -134434 -238121 -229617 -83324 -182837 -165865
11073 -165865 -148411 -358573 -407680 -336418 -158339 -135267 -35840 -33210 -114516 -182214 -189030
11062 -189030 -27897 48377 115304 44449 -5686 121624 61376 -24145 -55835 -189480 -212992
11051 -212992 -33712 -47822 -46727 -84606 -185501 -279537 -224775 -183300 -29148 81348 230664
11040B30664J29154K3843m4713k7749J40210J03170N5363j06364J16171J39618
11030G59367m1840j07225R8891K96850o8590K5360J11763J44447J5154o9327k41510
11019I23340j64877j43178q991L13000M28459K74293J22464m2597l0986k01738
11009A469189j57771r6068j26103k03336o28K50134J81687J20681q9126n3472
10999A295187j17593r9257q4351j42364q1437o3148j10427L600J19462q0497k33859
10988D05316j99863j30619J010l0385m1553p5232j52905l2715J06165R3944r9404
10977a56241J4854K59593M3631o0198M9520O3049k7189k34777q9428j07374O0075
10966a84485K6264k0063O1379J94321M6478j35587J1753N7322M9030k6646J90704
$$ plain form
11040 230664 359818 383661 338948 311199 451409 554579 609942 503578 619749 759367
11030 759367 717527 610302 709193 1006043 937453 962813 1074576 1219023 1234177 1164850 923340
11019 923340 758463 615285 606294 919294 1347753 1622046 1744510 1701913 1670927 1469189
11009 1469189 1311418 1215350 1089247 885911 885283 1135417 1317104 1437785 1348659 1295187
10999 1295187 1177594 1078337 993986 851622 770185 707037 596610 600210 719672 639175 405316
10988 405316 205453 74834 75844 45459 3906 -71326 -224231 -256946 -150781 -56837 -156241
10977 -156241 -141387 118206 161837 101639 151159 214208 187019 -47758 -137186 -244560 -184485
10966 -184485 -158221 -178284 -116905 77416 123894 -11693 60 57382 106412 79766 270470
10955B70470k11328l45820K4455J78287n9099L4680K23836p6215p9801Q3652J06153
10944A49270p1158k1835L2818o5785o7653j44236P486J31196L56035m37j66005
10933A39696L7869j55503j31169K26305J16634k02924j90543j44589r6509k2906
10923d23639O5297J66186J56258j0149l0917r7024m2778J71932J89927n3631j69098
10912g7636p8684N962o3433r1106Q9861K79698n3573j60328l740M4114q3238q8661
10900b80764J71378J92102R0237l3182q2688L8838r1322p7664K29245Q1325j80359
10889E7146j22809l3980O1180J95761N023J704l38372j80233L6791J60048J11892
10878d5849j50373k6516J27050o4541J22762P0181j82865j21147J9520P6880R1381
$$ plain form
10955 270470 59142 -286678 -262223 -83936 -143035 -108355 115481 39266 -40535 43117 149270
10944 149270 78112 56277 89095 23310 -44343 -188579 -181093 -49897 306138 305701 139696
10933 139696 177565 22062 -109107 117198 233832 30908 -159635 -304224 -400733 -423639
10923 -423639 -358342 -192156 -35898 -46047 -76964 -173988 -216766 -44834 145093 91462 -77636
10912 -77636 -156320 -150358 -213791 -304897 -215036 64662 11089 -149239 -152979 -108865 -192103 -280764
10900 -280764 -109386 82716 172953 139771 57083 95921 4599 -73065 156180 237505 57146
10889 57146 -65663 -99643 -38463 157298 162321 164025 -174347 -354580 -317789 -157741 -45849
10878 -45849 -196222 -222738 -95688 -160229 -37467 32714 -150151 -271298 -251778 -174898 -83517
10867h3517j02282q3821O1397J13917n7226J69715J75111L2118j7185l9527q0740
10856H7960J49386L3582J21491k5522j9835m7535p6675o5553J57039J17064l6716
10845C94686o4272P5395n2434P0613K511n8921l8277k296N4056J43151J28942
10834F53154j32427l5095L6451K27213n7479k99819k55878O9252L5538J2569K4647
10823B78126M5685K1121j7727r8559L0916m8807p4791L0391J39798l3370r4259
10812A78524j24721l5563J09194j39207R541J26384P199j8682J34197l0169l0024
10801A86673l9058L6136O8757J00668J22542O0425q0454O6631J10402J17147J22528
10790H72397J00428Q240k3817r3149k47772j25851J3619Q3292p6965p7694m4244
$$ plain form
10867 -83517 -185799 -269620 -208223 -94306 -151532 18183 193294 225412 208227 168700 87960
10856 87960 237346 270928 392419 366897 347062 299527 222852 157299 314338 431402 394686
10845 394686 330414 405809 353375 423988 426499 367578 329301 327005 381061 524212 653154
10834 653154 520727 485632 522083 749296 691817 391998 136120 205372 240910 253479 278126
10823 278126 323811 344932 327205 228646 259562 210755 135964 166355 306153 272783 178524
10812 178524 53803 18240 127434 -11773 -2232 124152 131351 112669 246866 216697 186673
10801 186673 147615 183751 252508 353176 475718 536143 455689 522320 632722 749869 872397
10790 872397 972825 981065 957248 864099 616327 490476 504095 587387 510422 432728 388484
10779C88484K01689n3229r4011m49866l20439j08523o44m7070k01605J27886O3290
10768d94038J17090K17623K2849n0350O3016k02808j21491J78344J24005J8012
10758a27748k4520J8817J5414j28553Q4377N7843K4540j29050J2701K41768J64001
10747B09590J3501J75549K1757j5529r5989R507J44566k2691j81747r7815l5739
10736A24960O2095Q5075l9495n9669q0964p7623j16597n9595M9280M4544M6961
10725b1028J25719P2893p7740j0161j16796k41675k12752K24244J46238l6078
10715a47136k0648J3521n9238n5479K289J1363L18065K09126J55692j34639j49854
10704A43062M4791m6469l1101o0737K23528L7282j02680p5035Q2443J10911p5587
$$ plain form
10779 388484 590173 536944 442933 -6933 -327372 -435895 -436539 -483609 -685214 -557328 -494038
10768 -494038 -376948 -159325 -136476 -186826 -123810 -326618 -448109 -269765 -145760 -127748
10758 -127748 -152268 -133451 -118037 -246590 -162213 -104370 -79830 -208880 -196179 45589 209590
10747 209590 223091 398640 420397 404868 308879 318386 462952 440261 258514 160699 124960
10736 124960 187055 272130 232635 172966 92002 14379 -102218 -161813 -112533 -67989 -21028
10725 -21028 104691 177584 99844 89683 -27113 -268788 -481540 -257296 -111058 -147136
10715 -147136 -167784 -154263 -213501 -268980 -266691 -255328 62737 271863 427555 292916 143062
10704 143062 187853 141384 110283 49546 273074 310356 207676 132641 215084 325995 250408
10693B50408k3118J14766J78305p3397j42309k7568l4969m18m6086K2266p3335
10682A44545M5062K21375N6229J1929j24413m8414L1678j7418N0368k6174K22335
10671E67102j00687j4496J11191L2088L4187m8469k21135j11313K7464Q3377J14739
10660D74048n0736L7133O9856k661M0904p9102L127J51650R6422K1344L0466M85
10648G92936J49794K81623K53079K68707N3471M6098J78289M08503K43478q9715
10638B586263k48366k54117l28372p6100J88805K00682P5170j5495j05564J01087
10628B123993K33550M64404M67863N40402O67230N62375M65079L91189M08679
10619F324764O35237N05962Q88883J642642K055645K693165L630838N152890P310253
$$ plain form
10693 250408 227290 342056 520361 446964 304655 277087 242118 241700 195614 217880 144545
10682 144545 189607 410982 467211 479140 354727 306313 337991 320573 370941 344767 567102
10671 567102 466415 451919 563110 595198 629385 580916 359781 248468 275932 359309 474048
10660 474048 423312 460445 530301 527640 568544 489442 492569 644219 740641 761985 792451 792936
10648 792936 942730 1224353 1477432 1746139 1799610 1845708 2023997 2432500 2675978 2586263
10638 2586263 2337897 2083780 1755408 1679308 1868113 2068795 2143965 2128470 2022906 2123993
10628 2123993 2357543 2821947 3289810 3830212 4497442 5059817 5524896 5916085 6324764
10619 6324764 6960001 7465963 8354846 9997488 12053133 14746298 18377136 23530026 30840279
10610C0840279R731576J2422115J4313644J3212222Q954268L643979n90741k918185
10602H9609157k804639p87220L366515R242210J6399883K4363356K9411467K5833574
10594A94634303J3150884r26969j0016338j4375884j4007292r022023q06851R584484
10586A68214314K0919077L1867779L7209264K9113241Q521636j1788398k4293454
10579B59763459k9839184k8654889k1900657j2390137k259675P497128J5687749
10572A87903794J8826680J2180289k233822j5258798k2472094k4812664k2851269
10565A31282116j7655971j1278080n189561n9150L174555L902713R55189m765388
10557A00366423r830347j2296273j3074206j2250575j0253715q064022o133608
$$ plain form
10610 30840279 40571855 52993970 67307614 80519836 89474104 93118083 92527342 89609157
10602 89609157 86804518 86017298 89383813 98626023 115025906 139389262 168800729 194634303
10594 194634303 207785187 206858218 196841880 182465996 168458704 159436681 158629830 168214314
10586 168214314 189133391 221001170 258210434 287323675 295845311 284056913 259763459
10579 259763459 229924275 201269386 179368729 166978592 164718917 172216045 187903794
10572 187903794 206730474 218910763 216676941 201418143 178946049 154133385 131282116
10565 131282116 113626145 102348065 97158504 97099354 100273909 104176622 105131811 100366423
10557 100366423 90536076 78239803 65165597 52915022 42661307 34597285 28463677
10550B8463677m508229l340542k434940j955242j711802j665542j286168r72253
10542A0588959p85339p74516o96280o47762o21134l16367m52025k98393k46919
10533E750224l27838m03838j79272k80705j25797k20610k20524k37806j76052
10524C577782j32887k02710p7072j43836k07040j19509j9938j07062L5183m2257
10514B560654j72045j46971k2420m3687j2572L1285j33523j47024M892l9937J91616
10503B070268L4604j81326j16311J3391o1584N7828J00174k2418J35192R6767
10493B126585P126P6345p5703j28823j00239K4922M4048J05223l2374Q6034m0706
10482B092438j7547J42416L962k5588M1682J66051J47119K09973k7858j20706
$$ plain form
10550 28463677 23955448 20614906 18179966 16224724 14512922 12847380 11561212 10588959
10542 10588959 9803620 9029104 8332824 7685062 7063928 6747561 6295536 5997143 5750224
10533 5750224 5422386 5018548 4839276 4558571 4432774 4212164 3991640 3753834 3577782
10524 3577782 3444895 3242185 3165113 3021277 2814237 2694728 2674790 2567728 2602911 2560654
10514 2560654 2388609 2241638 2219218 2175531 2162959 2194244 2060721 1913697 1918589 1878652 2070268
10503 2070268 2104872 1923546 1807235 1820626 1759042 1816870 1917044 1894626 2029818 2126585
10493 2126585 2133711 2210056 2134353 2005530 1905291 1930213 1974261 2079484 2047110 2133144 2092438
10482 2092438 2074891 2217307 2221269 2195681 2237363 2403414 2550533 2760506 2732648 2611942
10472B611942K1600R0614R2376J86600K30440P9308L22645J08707P7216j050J81878
10461D002276N51298N20293L11507L37088M41759N91108O49806N84116O68631
10452H657882P05047P03296R56516J228406J377177J582428J827546K345122K740938
10443B2124358L358516M166618N386611O815109Q348725R551264J0611069J0833461
10435H1195731J0014940Q218590N128537K070184j309746m453565o785152q182885
10427H5896634q647126q808957q066324o905155o049445n007928m088452l158802
10419C5164445k556932j997488j584551j045309o15145o55380k35845K07857K81049
10410B6962701M07640N59341P59128Q95717J200888J490253J935968K503647L010676
$$ plain form
10472 2611942 2633542 2724156 2816532 3003132 3233572 3312880 3635525 3744232 3821448 3820398 4002276
10461 4002276 4553574 5073867 5385374 5722462 6164221 6755329 7405135 7989251 8657882
10452 8657882 9362929 10066225 11022741 12251147 13628324 15210752 17038298 19383420 22124358
10443 22124358 25482874 29649492 35036103 41851212 50199937 59751201 70362270 81195731
10435 81195731 91210671 99429261 104557798 106627982 105318236 100864671 94079519 85896634
10427 85896634 77249508 68440551 60374227 53469072 47419627 42411699 38323247 35164445
10419 35164445 32607513 30610025 29025474 27980165 27365020 26709640 26473795 26681652 26962701
10410 26962701 27370341 27929682 28688810 29584527 30785415 32275668 34211636 36715283 39725959
10401C9725959L778030M703302N863061P331978R149662J1687202J4765824J8408603
10393A15413621K2594027K6431440K9408840L0215183K7723901K0735018R643534
10386B82165564l583037j6080152k5325812k9716609l0214438k7969353k3984659
10379A25291504j9691452j5666559j2319520r695744p674089o237515m855572
10372D9151053l869590l021750k366442k066287j666673j306558j006282p92087
10364C3055384p43252m09432j35046N1382J27345M08398P72861J181187J958903
10355C6267730K584662L413909M553666N784209P083806Q919218J0887432J2714792
10347I2209424J4073764J4106494J2607844R427811M827852j68304n257759r342992
$$ plain form
10401 39725959 43503989 48207291 54070352 61402330 70551992 82239194 97005018 115413621
10393 115413621 138007648 164439088 193847928 224063111 251787012 272522030 282165564
10386 282165564 278582527 262502375 237176563 207459954 177245516 149276163 125291504
10379 125291504 105600052 89933493 77613973 67918229 60244140 54006625 49151053
10372 49151053 45281463 42259713 39893271 37826984 36160311 34853753 33847471 33055384
10364 33055384 32312132 31902700 31767654 31819036 31946381 32354779 33127640 34308827 36267730
10355 36267730 38852392 42266301 46819967 52604176 59687982 68607200 79494632 92209424
10347 92209424 106283188 120389682 132997526 142425337 147253189 147084885 141827126 132484134
10339A32484134j2118780j3520301j3632499j2899810j1646759r800727q128737
10332E0736521o712866n484380m404060l899717l241989k735008k347832j907036
10324B0003633j639824j511370j321899r10068q96525j014712r54463q32158o93684
10315A0228930p07891p81790m87646m75102n29762m29367n04800k09329j54705
10306E948538l35856l89122k63442q4070j16660q6410k12407l14796l26227j95192
10296C624356q0997k8026j48731j27757m3616q1069r7651m9446l2651j38193j77057
10285B619162P4948k66058l38755N3240Q4275K9085j32746j6399j22718p3367
10275A910667J7875J24897Q9933L5181k45392k75958J20871K920o2550p4727j81176
$$ plain form
10339 132484134 120365354 106845053 93212554 80312744 68665985 58865258 50736521
10332 50736521 44023655 38539275 34135215 30235498 26993509 24258501 21910669 20003633
10324 20003633 18363809 16852439 15530540 14620472 13723947 12709235 11754772 10922614 10228930
10315 10228930 9521039 8739249 8251603 7776501 7246739 6817372 6312572 6103243 5948538
10306 5948538 5612682 5223560 4960118 4876048 4759388 4672978 4460571 4145775 3819548 3624356
10296 3624356 3543359 3515333 3366602 3238845 3195229 3114160 3016509 2967063 2934412 2796219 2619162
10285 2619162 2694110 2428052 2089297 2142537 2226812 2255897 2123151 2106752 1984034 1910667
10275 1910667 1928542 2053439 2143372 2178553 1933161 1657203 1778074 1780994 1718444 1643717 1462541
10264A462541J05635Q5030p9397J8964J0598k0000R9685j13399j32680j6695l8502
10253A381780M2847J00770L2484l7494j30046j13923O8804J89523P4797L3225
10243A642767k8689r589N1r984K7179q2718M3757J6522k1938P0059K83403K0765
10231A951585k07006k17114m2180O4551k6657p6339J11091M7666q5334j81107
10221A339156J38647J07229j79958l1789J27649R015k3268m7242j95625P03L4102
10210A278619J54260N0411Q4946K4227q5018k07j30703m0701J71806J34775O2578
10199A704993j13887q0616O7854J16726J44306O453j23055K5628M16j24492j06339
10188A517987o3466J13271P9577m6690k10829q9749P4670Q9758k05417m7103J74737
$$ plain form
10264 1462541 1568176 1653206 1573809 1592773 1603371 1583371 1683056 1569657 1436977 1420282 1381780
10253 1381780 1424627 1525397 1557881 1520387 1390341 1276418 1345222 1534745 1609542 1642767
10243 1642767 1614078 1604489 1604540 1594556 1621735 1539017 1582774 1599296 1577358 1647417 1930820 1951585
10231 1951585 1744579 1527465 1485285 1549836 1523179 1446840 1557931 1605597 1520263 1339156
10221 1339156 1477803 1585032 1405074 1373285 1500934 1509949 1486681 1439439 1243814 1244517 1278619
10210 1278619 1432879 1483290 1568236 1592463 1507445 1507238 1376535 1335834 1507640 1642415 1704993
10199 1704993 1591106 1510490 1578344 1695070 1839376 1845829 1722774 1748402 1748818 1624326 1517987
10188 1517987 1454521 1567792 1647369 1600679 1389850 1300101 1374771 1464529 1259112 1212009 1386746
10177A386746n5482r7715J63223J34743K6223j11501L2902J03303N7714q7868
10167A552288L9471R1889j46630j72709J72275J98010L3015o2409K59054J15203
10157B079457J41596J17809M305k08118j72668p1450K29417K30617P7598p4034
10147B354529J23780J90933o3273j22714l62050j93707J59508M0850k03898n4821
10137A869137j04814j26678k2981J23924O2104j22552k3300j16439j04673j7013
10127A416715r6014k7791l1239o5903M8330J2687k46498k4147m9330J9683p3316
10116H83177m1587j22326j88593K5725P0219M2313j10775j0555M8131J49318n1645
10105F93402P824P3227j47124j4629k365l8133o9566j71403n8940N3211R7995
$$ plain form
10177 1386746 1331264 1233549 1396772 1531515 1557738 1446237 1479139 1582442 1640156 1552288
10167 1552288 1591759 1683648 1537018 1364309 1536584 1734594 1767609 1705200 1964254 2079457
10157 2079457 2221053 2338862 2343167 2135049 1962381 1890931 2120348 2350965 2428563 2354529
10147 2354529 2478309 2669242 2605969 2483255 2121205 1927498 2087006 2127856 1923958 1869137
10137 1869137 1764323 1637645 1614664 1738588 1800692 1678140 1654840 1538401 1433728 1416715
10127 1416715 1320701 1292910 1261671 1195768 1244098 1256785 1010287 986140 936810 956493 883177
10116 883177 841590 719264 530671 556396 626615 668928 558153 547598 595729 745047 693402
10105 693402 701226 774453 627329 612700 610335 572202 502636 331233 272293 325504 423499
10094D23499J52993O9317j53787r7009Q0683L180K6043r5770p4837J61857r0535
10083D05634j09842q5496K5206K50133R7405j42970J05760j30913j10838J67303
10073D71382J6203J60419J81817M0080k27990q2731M2025j13072q5887q5850m6630
10062B69766l1833j00617K24560l9044M1322l3135m6886O3937J586N7702l6678
10051C70680q2809k8201J44772J18011J297M2161K22355j35302k15422J12258
10041E49800J45284n637M1474k0850j21806n4358J29141M1982P7896K1176j01505
10030G02597o0104r9866J10729L3461j40837r5823j03214P7201N857N6819j31473
10019C55347o3784J46394j65933k24536N3811Q6053J6600K02006O3315o5026K4037
$$ plain form
10094 423499 576492 645809 492022 395013 475696 478876 504919 409149 334312 496169 405634
10083 405634 295792 210296 235502 485635 583040 440070 545830 414917 304079 471382
10073 471382 487585 648004 829821 869901 641911 559180 601205 488133 402246 316396 269766
10062 269766 237933 137316 361876 322832 364154 331019 284133 348070 349656 407358 370680
10051 370680 287871 259670 404442 522453 523750 565911 788266 652964 437542 549800
10041 549800 695084 689447 730921 710071 588265 533907 663048 705030 782926 804102 702597
10030 702597 642493 542627 653356 686817 545980 450157 346943 424144 430001 486820 355347
10019 355347 291563 437957 272024 47488 101299 187352 203952 405958 469273 404247 428284
10008D28284o7789P5471L7350k9148q8867M640J18930R3140k7327M1828o1759
9997E24753l8604J26099K06539K6130J47260J0392j61074j32046J8826N8222J47921
9986I34418J57602j8877o5199O5833L3258K7463j8681J56243j02957n7649N6747
9975A168201L4565r2936j17192K9687k07523l63448l6819J28725J11164J54466
9965H08890K7495R9173o6000N5769o2761L841K6853J0386o5892j68225J21908
9954G91437R9506l0426j41836J19907J45554P2584J69194j817q6820J65350K8967
9943A331600j69480q7640J50190J11774J5345L9047p906j60467r0314j19919Q531
9932A020761M5469o378m0512Q9563L6801k3674j24730n3287J16604L87856L36733
$$ plain form
10008 428284 360495 435966 473316 444168 355301 359941 478871 572011 544684 586512 524753
9997 524753 486149 612248 818787 844917 992177 1002569 841495 709449 728275 786497 934418
9986 934418 1092020 1073143 1007944 1073777 1107035 1134498 1115817 1272060 1169103 1111454 1168201
9975 1168201 1202766 1109830 992638 1022325 814802 451354 414535 543260 654424 808890
9965 808890 836385 935558 869558 925327 862566 866407 893260 903646 837754 669529 791437
9954 791437 890943 860517 718681 838588 984142 1056726 1225920 1224103 1137283 1302633 1331600
9943 1331600 1162120 1074480 1224670 1336444 1351789 1390836 1382930 1222463 1132149 1012230 1020761
9932 1020761 1066230 1059852 1019340 1108903 1145704 1122030 997300 944013 1060617 1448473 1785206
9921A785206P9757J66710N3355j08350m51642l27822N1005J94944J3973p9196
9911A377940q7784J33563l8743l7730k633R1259P4417j31315r6568L05999L17491
9900A905896K24941J13190J45446p3933j6399J58077K35787K60735K27895K49050
9890C430685K09371M25465K28655L27783K79177M43520O42970P41514Q78013J011997
9880H619150J007289J188893J441607J737259K131573K210763K164167K195914
9872B2696615K245954K091489J868524J449534Q25680J99243l37557q10267j275345
9863B8953870j862091j907568k009143j934604j562904j417508j357645j071409
9855A5830998p38806o28116j65544j60427l65495j10808R0151R4656J09399L47559
$$ plain form
9921 1785206 1864963 2031673 2085028 1976678 1525036 1197214 1248219 1443163 1457136 1377940
9911 1377940 1290156 1423719 1384976 1347246 1344613 1435872 1510289 1378974 1282406 1588405 1905896
9900 1905896 2130837 2244027 2389473 2315540 2299141 2457218 2693005 2953740 3181635 3430685
9890 3430685 3640056 4065521 4294176 4621959 4901136 5344656 5987626 6729140 7607153 8619150
9880 8619150 9626439 10815332 12256939 13994198 16125771 18336534 20500701 22696615
9872 22696615 24942569 27034058 28902582 30352116 31177796 31377039 31039482 30229215 28953870
9863 28953870 27091779 25184211 23175068 21240464 19677560 18260052 16902407 15830998
9855 15830998 15092192 14464076 14298532 14138105 13772610 13661802 13751953 13846609 13956008 14303567
9845A4303567P37008J145199J226503J418848J565936J819384K162484K275495
9837B6654424K514985K850130L222616L684157M033631M415849N073858N631792
9829E8081442N824956N606362N465984N059233L953783K856182J798428M77180
9821H9123550p28527j607369k482098l330378l887263l922455l858860l526705
9813F5779895l194046k733619k497368k443978k337254k370706k403921k131610
9805D5667393j919319j566420j380090j141907r48143n62163l6857L02891N59940
9796C8975325J389448J624770J860616K151267K215223K661594L009127L388527
9788E7275897L505578L755307M136723L913893L827031L777883L870557M138067
$$ plain form
9845 14303567 15040575 16185774 17412277 18831125 20397061 22216445 24378929 26654424
9837 26654424 29169409 32019539 35242155 38926312 42959943 47375792 52449650 58081442
9829 58081442 63906398 69512760 74978744 80037977 83991760 86847942 88646370 89123550
9821 89123550 88395023 86787654 84305556 80975178 77087915 73165460 69306600 65779895
9813 65779895 62585849 59852230 57354862 54910884 52573630 50202924 47799003 45667393
9805 45667393 43748074 42181654 40801564 39659657 38711514 38149351 38112494 38415385 38975325
9796 38975325 40364773 41989543 43850159 46001426 48216649 50878243 53887370 57275897
9788 57275897 60781475 64536782 68673505 72587398 76414429 80192312 84062869 88200936
9780H8200936M305595M349805M280474L865656K959091K094650J143932N5747
9772A11255886q85294j642380k222090k876923l303389m019463m450216m811235
9764H7044896n096782m988524m775122m494673m210572m037493l878767l705240
9756E1857723l107078l009537k730020k072610j776606j486740j112261n90553
9748C5972318k44418j80547Q6609M86318R15699Q38779R42853J147213J617392
9739D1582216J767794J606485J822907K214514K647410L207000L790765L864822
9731F2503913M154255M452769M040423L617566K344259R29740n21423k031277
9723G9490225l141188m100477m653015n190407n128543n021999m733470m262040
$$ plain form
9780 88200936 92506531 96856336 101136810 105002466 107961557 110056207 111200139 111255886
9772 111255886 110370592 108728212 106506122 103629199 100325810 96306347 91856131 87044896
9764 87044896 81948114 76959590 72184468 67689795 63479223 59441730 55562963 51857723
9756 51857723 48750645 45741108 43011088 40938478 39161872 37675132 36562871 35972318
9748 35972318 35727900 35547353 35633962 36120280 37035979 37874758 38817611 39964824 41582216
9739 41582216 43350010 44956495 46779402 48993916 51641326 54848326 58639091 62503913
9731 62503913 66658168 71110937 75151360 78768926 81113185 82042925 81521502 79490225
9723 79490225 76349037 72248560 67595545 62405138 57276595 52254596 47521126 43259086
9715D3259086l640497l053060k919905k759629k399089k201743k254128k170560
9707B1860475j943773j530463j165298j088599q90056p29993n54717o48502n09333
9698A2799741k02449j60640j11121m0864L64098L63860M55811K73829N97843R90586
9688A5330694J192166J263380J238828J172894J135555J054480R53568O05958
9680B3947523J44733l59383p99135j264579j392116j517644j706755j806086j660988
9671A3585570j371639j224781j127214r47156q04144p86656q07979m05466l29766
9662E780769m93739k64573q9828l51039l57412k27139k51460l57672j43514p4915
9652C169478j12482j79175l8417p2033j0201k56771l5548J74338K63906j14562
$$ plain form
9715 43259086 39618589 36565529 33645624 30885995 28486906 26285163 24031035 21860475
9707 21860475 19916702 18386239 17220941 16132342 15242286 14512293 13957576 13309074 12799741
9698 12799741 12597292 12436652 12325531 12284667 12648765 13012625 13468436 13742265 14340108 15330694
9688 15330694 16522860 17786240 19025068 20197962 21333517 22387997 23341565 23947523
9680 23947523 24092256 23732873 22933738 21669159 20277043 18759399 17052644 15246558 13585570
9671 13585570 12213931 10989150 9861936 8914780 8110636 7323980 6516001 6110535 5780769
9662 5780769 5287030 5022457 4932629 4581590 4224178 3997039 3745579 3387907 3244393 3169478
9652 3169478 3056996 2877821 2839404 2767371 2757170 2500399 2464851 2639189 2903095 2788533
9642B788533j95714r4638q7443k31297j43428j45151l9322K5198K0364k3455r4590
9631A779057n5501o2988R3251k3704M5267k02085m1660j13736j8183o8850R9630
9620A430498J65899J39082p313k84403j76189N5982r0215n8848M3024J38291Q2725
9609A438533n5939p8451k66886o3992J25046K51560q1128m1605L5314L6790n9079
9598A240163j86120p3252O0047k9358j6179O8202O0576J71316K36835N2463j82109
9587A402584r5192P5355N2927l6907j42443j64750r5955n7612R3314K70148M123
9576A305592j71846o7108Q9763k4793p0610K5254m6926m9842k0530j23501n9273
9565G86180K5694k0904K2378J54659m1820j03053K2506q272J1529n08p214o075
$$ plain form
9642 2788533 2592819 2498181 2410738 2179441 2036013 1890862 1851540 1876738 1897102 1873647 1779057
9631 1779057 1723556 1660568 1753819 1730115 1775382 1573297 1531637 1417901 1399718 1330868 1430498
9620 1430498 1596397 1735479 1728166 1443763 1267574 1323556 1233341 1174493 1217517 1355808 1438533
9609 1438533 1382594 1304143 1037257 973265 1098311 1349871 1268743 1227138 1262452 1299242 1240163
9598 1240163 1054043 980791 1040838 1011480 995301 1063503 1124079 1295395 1532230 1584693 1402584
9587 1402584 1307392 1382747 1435674 1398767 1256324 1091574 995619 938007 1031321 1301469 1305592
9576 1305592 1133746 1066638 1156401 1131608 1060998 1086252 1039326 989484 968954 845453 786180
9565 786180 811874 790970 813348 968007 926187 823134 845640 837368 848897 848389 841175 835100
9553H35100N4875j4858N8687K0425Q883J50498j13167j2215q1504M7186J38779
9542A092689j5833j55723m9258J46153r69j0891j69683j19473N1929J89254J7869
9531I76064N9738j23250P657Q7683k0131q432j824j75776j31511K9824Q6955J39342
9519I26339r377o229m3136K4208K6598K7892j79094j02022j079o0896l6619K6254
9507E92839j33577j07261O8218J34937J65714j37338J9372Q8221M0026L7260j95547
9496E72864k59327o4863J08260J55365J19304L0959m5787r1279K3359j45463j31588
9485B71804J47290N7193J44Q2642j08418m623K0892k4255j55840k03059L2341
9474A16111M8917L2619n070N0958K07320J8291j08198K5005L7615l6716j28310
$$ plain form
9553 835100 889975 875117 933804 954229 963112 1113610 1000443 988228 906724 953910 1092689
9542 1092689 1076856 921133 871875 1018028 1017059 1006168 836485 717012 768941 958195 976064
9531 976064 1035802 912552 920209 1007892 987761 979329 977505 801729 670218 700042 786997 926339
9519 926339 916962 910733 867597 891805 918403 946295 767201 665179 664100 603204 566585 592839
9507 592839 459262 352001 420219 555156 720870 583532 602904 691125 731151 768411 572864
9496 572864 313537 248674 356934 512299 631603 662562 616775 525496 548855 403392 271804
9485 271804 419094 476287 476431 559073 450655 446032 466924 442669 286829 83770 116111
9474 116111 165028 197647 192577 243535 450855 469146 360948 385953 423568 386852 258542
9463B58542k2801K23307R9621j95948k00283P2183P2611P6415n5220k6509P2551
9452C74469N2183J37761J43596p0798l26277j19781J01795J92612l5910n3661
9442C95989o8575j73855k3185R6356K91001M7865l7678N2886O6705m8874j94703
9431D03932k36804P1066J09484L359Q342N1330Q6734o8253k429j2666M5137Q3775
9419E43007j98065Q830N480r2160N0164P973l9026J47191K75344J59991l111k03023
9407F62595j82449q7759R6276K70263J54897j00532l4981j49878k10764L542K03357
9396F24567j59789j42876p8552R0577O6960J7946J99554K10028j23625k68068
9386D36722M7838O5390j43169j05657J75265J16344R4780O7334R2331p2323j40721
$$ plain form
9463 258542 235741 459048 558669 362721 162438 234621 307232 383647 328427 301918 374469
9452 374469 426652 564413 708009 637211 310934 191153 292948 485560 449650 395989
9442 395989 327414 153559 130374 226730 517731 565596 527918 580804 647509 598635 403932
9431 403932 167128 238194 347678 351037 359379 410709 497443 429190 426761 414095 459232 543007
9419 543007 344942 353772 359252 267092 317256 325229 286203 433394 708738 868729 865618 662595
9407 662595 480146 392387 488663 758926 913823 813291 778310 628432 417668 421210 624567
9396 624567 464778 321902 243350 333927 400887 418833 618387 828415 704790 436722
9386 436722 484560 549950 406781 301124 476389 592733 687513 754847 847178 774855 634134
9375F34134k22156Q7152O0369l3147R4720M1648n0859L0615n7522k6913N9280
9364F17321N8399J20118Q8966P8613m248K4947J22460m4104j95972j86416k2475
9353F57609L1923K4419J17408K2516M337j13186k15141J2640J59781L9031O2732
9342H04069j95246j81771j10891o386M4798M7022p478j55650J2126J01181N8187
9331D09961j84010J2913k092j0398K37923O6452m1289q9376l8222m5496j7478
9320B98888J05621R3526l8785n5840J13678J33533m8781j27840P3486j6931o7878
9309D62677j71455R8077k5445p3151o2599K85065M4164p1618j96051j66469K2372
9298A45567M8802P5254j3115M2870P4083k4239j06084K2832P0704Q5826j583j81764
$$ plain form
9375 634134 411978 499130 559499 526352 621072 662720 611861 642476 584954 558041 617321
9364 617321 675720 795838 884804 963417 959169 984116 1106576 1062472 866500 680084 657609
9353 657609 689532 713951 831359 853875 858212 745026 529885 542525 702306 741337 804069
9342 804069 608823 427052 316161 309775 354573 401595 394117 238467 250593 351774 409961
9331 409961 225951 238864 236772 226374 464297 530749 489460 400084 361862 316366 298888
9320 298888 404509 498035 459250 403410 517088 650621 601840 474000 547486 530555 462677
9309 462677 291222 389299 363854 290703 228104 513169 557333 485715 289664 123195 145567
9298 145567 194369 269623 256508 299378 373461 349222 243138 265970 336674 422500 420917 239153
9286B39153j39027M4090J48715l8575o0205K5543j950L0271r9177j07775M240
9275D5303J02277K94802P7758j76872n9359L6337K692n8052K9234J1594j63155
9264A42559N5625J56418j11798j31394J1038J21820m393L7842J1648o780L626
9253B86211P4045p7998k7540K4846j68365o3181N3495K91199J59680j41917R159
9242D19634m0480J1521p4271J62347K7743m2838j63650k81135k58439J24504J28915
9231A3851J45663R5583K92667K3856k50978J16424O5760l23843J34914L07674
9221F21571j66248j00547n7709j9314m6175K6165N9222M1550j01204k67598n9484
9210f9771o6860j769J01054J21515P8206N5531j53333o5693j4863O7984j0526
$$ plain form
9286 239153 100126 144216 292931 254356 194151 219694 217744 248015 148838 41063 45303
9275 45303 147580 442382 520140 343268 283909 320246 322938 264886 294120 305714 142559
9264 142559 198184 354602 242804 111410 122448 244268 239875 277717 289365 282585 286211
9253 286211 360256 282258 254718 279564 111199 48018 101513 392712 552392 410475 419634
9242 419634 379154 390675 316404 478751 506494 463656 300006 18871 -239568 -115064 13851
9231 13851 159514 255097 547764 571620 320642 437066 502826 178983 313897 621571
9221 621571 455323 354776 297067 277753 231578 257743 316965 358515 257311 -10287 -69771
9210 -69771 -136631 -138400 -37346 84169 162375 217906 64573 -1120 -15983 52001 41475
9199D1475P7405j65753j10502P8090K401K825M8557K7512J18764K5370j11236
9188C4908j13517J219K3083J87000j5549j05332r7233P1259P6873J02493J44298
9177C09502Q6430N8794k02069k91600l8553l589j9626P7441J78454r7240j13974
9166e6030J96996K59469K6264m7478j49663n9226j66926k9517j23189J05928J15423
9155G2051m9030L5575O7921R6884Q4662J58638J05246q4369k23685j06091j91168
9144c3366j1995J93161K24247Q5337k26273j75893R1924o0831o6737k2035l242
9133e703M1286l2342n9709K0560K38635j21840j77813O9045j128j6843K2943O3554
9121D0645J22703J3022k15988P8831j2505L3249R5288O7572K8496J1030j98010
$$ plain form
9199 41475 118880 -46873 -157375 -79285 -76884 -74059 -25502 2010 120774 146144 34908
9188 34908 -78609 -77390 -54307 132693 117144 11812 -85421 -14162 62711 165204 309502
9177 309502 395932 454726 252657 -38943 -77496 -81085 -100711 -23270 155184 57944 -56030
9166 -56030 140966 400435 426699 379221 229558 170332 3406 -26111 -149300 -43372 72051
9155 72051 23021 58596 126517 223401 308063 466701 571947 487578 263893 157802 -33366
9144 -33366 -45361 147800 372047 457384 231111 55218 147142 86311 19574 -2461 -5703
9133 -5703 35583 3241 -56468 -35908 202727 80887 -96926 -27881 -29009 -45852 -22909 40645
9121 40645 163348 176370 -39618 39213 26708 59957 155245 222817 251313 262343 64333
9110F4333o7401J86189M7989j53651M7970J60947M342L0513J7808q2704j27186
9099A29149k24786j34338P0575R3208j08289M9017O2005J91709J03277J18086
9089C49613p9510j276P3741Q4099p4869j02204j9740P2050r1252P0482r2580j60882
9077B7672o914j64774J61344P2618n1381p1739j19307R5203q2340l5031n606J8715
9065a61540J07387J63066J46492O603M1532j0479J00487N9836j88282o7608Q1451
9054B78945j03313o7688m7978l3312L4142L6155j11519J6873J51811j9682r1235
9043D3199l0642j65878j40585q3823k4606K22130K49865J12726j22027J28078
9033A88437m112l7660l9165j04669R8014M5495l5875j50632j01396p3792m0519
$$ plain form
9110 64333 -3068 183121 231110 77459 125429 286376 290718 321231 339039 256335 129149
9099 129149 -95637 -229975 -159400 -66192 -174481 -125464 -63459 128250 231527 349613
9089 349613 270103 268827 342568 426667 351798 249594 229854 301904 210652 281134 188554 27672
9077 27672 20758 -144016 17328 89946 38565 -33174 -152481 -57278 -139618 -174649 -180255 -161540
9065 -161540 -54153 108913 255405 262008 303540 293061 393548 453384 265102 197494 278945
9054 278945 175632 107944 59966 26654 60796 96951 -14568 2305 154116 134434 43199
9043 43199 12557 -153321 -293906 -377729 -402335 -180205 69660 182386 60359 188437
9033 188437 184325 146665 107500 2831 100845 146340 110465 -40167 -141563 -215355 -255874
9022b55874M0212K53282J45429J9656k5024p8944O692J77139M8453k16989q6030
9011B8002O996k8755p65J53457q4193J68131l3388k25537j82286l6440K79372
9000D4594K26251K8733j61409O5899l060J08069k4725Q6124o1828J26132J45199
8989E79979r3921j28764j56667j11522k3701r432p6332j18829j980M3776n973
8978a03366L9775j6989P2905m6584J24077r6718o6875Q0224J47923j30657j05613
8967a01898J53963j7870n271l1006p394J26917N7092j20768j17151n9151L5247
8956h7290m2760j2532J10927J21842K2084j45902p3007J47694P0911M0750j3421
8945A39296K4024K19963o0836j16770j17192J31336n1499j23461o5897J11123
$$ plain form
9022 -255874 -215662 37620 183049 202705 177681 98737 105429 282568 331021 114032 28002
9011 28002 34998 6243 5478 158935 74742 242873 209485 -16052 -198338 -234778 44594
9000 44594 270845 299578 138169 204068 201008 309077 284352 370476 308648 434780 579979
8989 579979 486058 357294 200627 89105 65404 55972 -20360 -139189 -141169 -97393 -103366
8978 -103366 -63591 -80580 -7675 -54259 69818 -26900 -93775 -13551 134372 3715 -101898
8967 -101898 52065 34195 28924 -2082 -9476 117441 174533 53765 -63386 -122537 -87290
8956 -87290 -130050 -142582 -31655 90187 112271 -33631 -106638 41056 111967 152717 139296
8945 139296 163320 383283 322447 205677 88485 219821 168322 44861 -21036 90087
8935I0087J93485R4533r2808j80975j44260j26658j90694Q2341N5097J18605J59418
8924E8171m647m8413j6980J36085l7265N2339J36664n6553j51357k09664m7909
8913a89529O4374N4883j07941J22797M340j09145P8687K0108r0260J12549J95663
8902A56526O9612m7695j6145q3872j23682J27738Q7435m914p3155J63149J46600
8891D01597l3763L6334k36311k77507J4662J92587j18706q4747N6553N9917J3713
8880B4329R3779q1061j03189K7236J90873L3061j27387J86452J33084j8049n7004
8869C02124j00434n6512J77321J34867P4936k45628r7934K9523k15919r9500M6696
8858e0460R4331P215p4508o6881j52766m6097J13425L28241J40361k40418k51429
$$ plain form
8935 90087 283572 378105 285297 104322 -39938 -166596 -357290 -274949 -219852 -101247 58171
8924 58171 53524 5111 -11869 124216 86951 139290 275954 219401 68044 -141620 -189529
8913 -189529 -125155 -70272 -178213 -55416 -51076 -160221 -81534 -61426 -151686 -39137 156526
8902 156526 226138 178443 162298 78426 -45256 82482 169917 165003 91848 254997 401597
8891 401597 367834 404168 167857 -109650 -94988 97599 -21107 -105854 -49301 10616 24329
8880 24329 118108 37047 -66142 -38906 151967 185028 57641 244093 377177 359128 302124
8869 302124 201690 145178 322499 457366 532302 286674 188740 218263 2344 -97156 -50460
8858 -50460 43871 51086 -23422 -90303 -243069 -289166 -175741 152500 292861 52443 -198986
8847a98986J69858J46070K1028L8961j64445r33j3696J00495l1868j83629R4288
8836b2857J4223J2718m0001q6524J08361K29673r5001q1253l2627J4218L012K9576
8824E3518J39771l7935o8214j43235n0952P5753j2622q2133p2204K891o8968O1768
8812b02562K0382j04568J9338j00814O5197N7572j41287p9089R1699J41416m5592
8801b78308J602J08957J16990n8225J44479J89566M8335j03047r387m0098k655
8790A18209P6942M1516j21576q1878j23538o7099N0139o0520j75221J23361L4118
8779a85547K38037R9076o4979K9167J4598l2621j04068o3106J59666J76885n1270
8768B15838l4067N6532L4332j43680p4630r6275k35158j45089J26101K05727K8404
$$ plain form
8847 -198986 -29128 116942 137970 176931 12486 11553 -2143 98352 66484 -117145 -22857
8836 -22857 -8634 4084 -35917 -122441 -14080 215593 120592 39339 6712 20930 23942 53518
8824 53518 193289 155354 87140 -56095 -107047 -31294 -43916 -126049 -198253 -195362 -264330 -202562
8812 -202562 -182180 -286748 -267410 -368224 -303027 -245455 -386742 -465831 -374132 -232716 -278308
8801 -278308 -276706 -167749 -50759 -108984 35495 225061 273396 170349 160962 120864 118209
8790 118209 195151 236667 115091 33213 -90325 -157424 -107285 -167805 -343026 -219665 -185547
8779 -185547 52490 151566 86587 115754 130352 97731 -6337 -69443 90223 267108 215838
8768 215838 181771 238303 272635 128955 54325 -41950 -277108 -422197 -296096 -90369 -61965
8757f1965r8497M9713N4793R2564N3947o648r8859m1121q3537N774J42057K18450
8745B26671O2180o7991r2457R187j6162n6913R616M0373j13652j0911k268J6469
8733D142P8378N8632Q182j8750j97331j43508M0601j9073n4898J85403J62061
8722A03839K7786K707R2868j38034r3089N347m1837j17295m2705j36990J4136
8711c23267p2198M4461R4344o0656j40593J19892J21476P2044J4949K3798K70165
8700A64415l1749q1643o9723J06525P113L725J22244p5550o5825P2611J60770
8689C12913j2689j55249j18400L8245o4764j49317O4305j28962j90535J14712
8679b89741K6991R7648J87949O4328j9132l0589q3530j18880r3641k774J0444
$$ plain form
8757 -61965 -160462 -110749 -55956 36608 90555 83907 -14952 -56073 -139610 -133836 8221 226671
8745 226671 288851 220860 128403 137590 121428 64515 74131 114504 852 -10059 -12327 4142
8733 4142 82520 141152 149334 130584 -66747 -210255 -169654 -188727 -243625 -58222 103839
8722 103839 131625 134332 227200 89166 -3923 1424 -40413 -157708 -200413 -337403 -323267
8711 -323267 -395465 -351004 -256660 -317316 -457909 -338017 -216541 -144497 -129548 -105750 164415
8700 164415 132666 51023 -18700 87825 94938 98663 220907 145357 79532 152143 312913
8689 312913 300224 144975 26575 64820 56 -149261 -84956 -213918 -404453 -289741
8679 -289741 -262750 -165102 22847 87175 68043 37454 -46076 -164956 -258597 -261371 -250927
8668b50927J8042L1066R3928O0087K3744L0421N3120P5639l6042O4899O1451r3509
8656A31919j93836R4090l6642J9214j14378P5630M4746Q5263k3911j20869J10040
8645G1266J53314p0299n2190L5086R39k7182J0729L3332O852j75512k96760J5543
8633b94882J18586P7487j4804j1351L6261R5774n4133k30550K25056N4163J0066
8622A1673J3774j1031m6105M3139l1149j52719k6372P7470K4923K0572M2808N9107
8610B6090j00908j60095j15381L2042J16151O8852k2143J57407J79363J03468
8600B84846m3856l1002K9783j31394Q3722Q2907j97451l04784L3533J62001J73361
8589A41666Q0111J10602j12140k3334l9254j34464n9871J67349O0957o7842j25824
$$ plain form
8668 -250927 -232885 -201819 -107891 -47804 -24060 6361 59481 135120 99078 163977 225428 131919
8656 131919 -61917 32173 -4469 14745 -99633 -24003 20743 106006 82095 -38774 71266
8645 71266 224580 154281 102091 137177 138116 110934 121663 154995 161847 -13665 -310425 -294882
8633 -294882 -176296 -98809 -113613 -124964 -88703 7071 -47062 -277612 -52556 1607 11673
8622 11673 25447 14416 -31689 11450 -19699 -172418 -198790 -121320 -96397 -75825 -33017 26090
8610 26090 -74818 -234913 -350294 -318252 -202101 -133249 -155392 2015 181378 284846
8600 284846 240990 209988 239771 108377 192099 275006 77555 -227229 -193696 -31695 141666
8589 141666 221777 332379 220239 196905 157651 23187 -36684 130665 191622 123780 -2044
8578b044J34551P0778j00415N7244K5004k36712Q120J17354J44578k8527J22042
8567C11973N21q4108P3120J00121q0923l124o9601M3112n3553N6617m7719O4624
8555C11060n2551M1214J7785j63410M5990P13j21193r9517l3727k4914J97875
8544A19325M5216q7891q283j040j38674p944l665l5699p5405k580J33561P3782
8532A0703P6661M3416p0863p421j15091R4452J38547j40283j08412j02299J58038
8521b2552J22282p2316J9504J58038J69067j50513j13312O3338K1496j34313j5749
8510D4970p4483M6097P2692K4362P2237K5523J94224J35878n6306m6749p9965
8499C58480k24903m8190l6447j7439O8298N906k0187L4292q2064n5375m9549j9134
$$ plain form
8578 -2044 132507 203285 102870 160114 185118 -51594 -43474 73880 218458 189931 311973
8567 311973 312494 228386 301506 401627 320704 317580 247979 291091 237538 294155 246436 311060
8555 311060 258509 299723 317508 154098 200088 200801 79608 -19909 -53636 -78550 119325
8544 119325 164541 76650 68367 67327 -71347 -79291 -82956 -118655 -194060 -196640 -63079 10703
8532 10703 87364 130780 59917 52496 -62595 31857 170404 30121 -78291 -180590 -22552
8521 -22552 99730 27414 46918 204956 374023 223510 110198 173536 195032 60719 44970
8510 44970 -29513 16584 89276 113638 185875 211398 405622 541500 485194 438445 358480
8499 358480 133577 85387 48940 31501 99799 105705 85518 119810 37746 -17629 -67178 -86312
8487h6312K33389J21818J22092j20639j26709L97J20479p7397N0785Q3280n5074
8476B66109m5603M9454j50769N8911J79366j17092k46111o6849O5327K28399J05736
8465C26878n3376R7756q6685k03397k9756K6985L6154n3278M7352j60584j54046
8454b05997j3917J77390R5359j23892n9851l7254K22231J92591L3036K588j92310
8443H9974K0599k16934J6361J45749R5975M6821J41605L462O682M8307j2456j90760
8431A95385l520j65363J13768K541k9864Q3094l1482r1327J6202j27148q522k1989
8419f8225J7774m3535j26308Q8090R5539P0563O4975j39019j26091L2869O5042
8408f8326O3416j26809j18655r6407n2871J75595J91247J04538j02601j46743
$$ plain form
8487 -86312 147077 268895 390987 270348 143639 144036 264515 187118 237903 321183 266109
8476 266109 220506 269960 119191 178102 357468 240376 -5735 -72584 -7257 221142 326878
8465 326878 273502 371258 284573 81176 51420 78405 114559 61281 108633 -51951 -205997
8454 -205997 -219914 -42524 52835 -71057 -130908 -168162 54069 246660 279696 282284 89974
8443 89974 110573 -106361 -90000 55749 151724 198545 340150 343612 350294 398601 386145 195385
8431 195385 191865 26502 140270 142811 112947 196041 164559 73232 89434 -37714 -46236 -68225
8419 -68225 -50451 -93986 -220294 -132204 -36665 33898 98873 -40146 -166237 -133368 -68326
8408 -68326 -4910 -131719 -250374 -346781 -399652 -224057 -32810 71728 -30873 -177616
8398a77616K379N8027k4327K14313L7535j30327l1955M0193O3614M6418r9300
8387a046j67353J68318O7961L3920r6040k5086j00462J05181n3658J74745n2071
8376E4409j2477O3416M7057j11717m234J5107j33276m3677M2312O8087J97631
8365A82638j13485N5192J7301k7519j38592r2008p1451j1493M2707J47774P2182
8354F3246N7966J54314q2312j58379p0771j8451n4273O9169o3340j53520j32853
8343c89204J29366K29936J25914j11505r116n0806P2159j76848j71852R6911O5281
8332a89764R5868P9292J6054o2929k8396j2005j1893N1432K13186N2798j08059
8321I5584L37j6327j36053p3164k7963J12469K5832j7370n9848J42836K6444q3217
$$ plain form
8398 -177616 -175237 -117210 -141537 72776 110311 -20016 -51971 -11778 51836 98254 -1046
8387 -1046 -168399 -81 67880 101800 5760 -19326 -119788 -14607 -68265 106480 54409
8376 54409 41932 105348 152405 40688 36454 51561 -81715 -125392 -83080 -14993 182638
8365 182638 69153 124345 141646 114127 -24465 -116473 -187924 -199417 -156710 -8936 63246
8354 63246 121212 275526 193214 34835 -35936 -54387 -108660 -39491 -102831 -256351 -389204
8343 -389204 -259838 -29902 96012 -15493 -24609 -75415 -3256 -180104 -351956 -255045 -189764
8332 -189764 -93896 -14604 1450 -61479 -89875 -101880 -113773 -62341 150845 203643 95584
8321 95584 95921 79594 -56459 -129623 -157586 -45117 -19285 -36655 -96503 46333 72777 -10440
8309a0440j33409k0674l1802Q6324q6995l7966J10328O5856O6187R039J13893
8298A30341O282k16786k72281P9145L62083N0470n1470j39365j00120P3186p6086
8287a54601k8309J21301K2769J4399O9574M0615o0925n9994J21241M5491N307
8276A36868j55234r8499Q1286Q4943o20j26199j1716j01686j57969J3968L1767
8265c03091Q7711j7885j9330o348J46722J40561J69343J73692m9082k68762j78659
8254a25128n5982m434N3807P5942K9061J11791n9086J5162n867r4228m0081J8406
8242h0637R4714j4413M2970R3802P198q6726j23361j5776O0802J06681n6132K8980
8230E8102M55j44774p1637m7179O555L6182J36971j00643j7859O0629J13378K4631
$$ plain form
8309 -10440 -143849 -164523 -196325 -110001 -196996 -234962 -124634 -58778 7409 16448 130341
8298 130341 136623 -80163 -352444 -273299 88784 139254 87784 -51581 -151701 -78515 -154601
8287 -154601 -182910 -61609 -38840 -24441 45133 85748 24823 -35171 86070 131561 136868
8276 136868 -18366 -116865 -35579 49364 48744 -77455 -89171 -190857 -348826 -334858 -303091
8265 -303091 -215380 -233265 -252595 -258943 -112221 28340 197683 371375 322293 53531 -125128
8254 -125128 -181110 -185544 -131737 -55795 -26734 85057 25971 41133 35266 -58962 -99043 -80637
8242 -80637 14077 -336 42634 136436 143634 56908 -66453 -82229 -21427 85254 29122 58102
8230 58102 58557 -86217 -157854 -205033 -198478 -162296 -25325 -125968 -143827 -83198 30180 54811
8218E4811k79507p8621j4607Q8522K2032J11987O1266J01801J60653o1387k83464
8207a16514j76824k0271J59270K42970J906o7549R9971O9099k8729L6187P3245
8196B72761o1575l5851O9278r0966K4063j68411j3426J39468K4638r5924M1999
8185A06054R5963p2686r3036j90873j27585J30504J02190J12607J10339M5558
8175B19035j21429n5942K634L6971M2880j05089L9334j8527n4130O4905o5625
8164a4983j14563j14415q8173K45333K13339n0213L0443l5243k4229J39900Q8449
8153B75645j6049M996j68016K0822J82676J55209j69985k28728M0454j39008m9993
8142i1977k3427P307j8146k0099J56376n9298j25728j01502k3495m7008n6337
$$ plain form
8218 54811 -224696 -303317 -317924 -229402 -207370 -95383 -34117 67684 228337 166950 -116514
8207 -116514 -293338 -313609 -154339 88631 90537 22988 122959 192058 163329 199516 272761
8196 272761 211186 175335 244613 153647 177710 9299 -4127 135341 159979 64055 106054
8185 106054 202017 129331 36295 -154578 -282163 -151659 -49469 63138 173477 219035
8175 219035 97606 41664 44298 81269 124149 19060 58394 39867 -14263 50642 -14983
8164 -14983 -129546 -243961 -332134 -86801 126538 76325 106768 71525 47296 187196 275645
8153 275645 259596 264592 96576 117398 300074 455283 285298 56570 97024 -41984 -91977
8142 -91977 -115404 -108097 -126243 -146342 10034 -49264 -174992 -276494 -299989 -346997 -403334
8131d03334J80014R9895r4100r42N5300j4014k1196j0861L3506K8444N4865k5635
8119a18058J8630J14616q0250j27924N7715L8667j31002q9006P9480n1781j58458
8108d47371j5101J21683L4533M9967j13276N395N6251J38257J94197l9741j1140
8097b6346Q6444l4357o6822N5677M6651j36568j95648o3042m7428M6157J66214
8086a69068K11879R0381N706p3732P8656N1443j49942j4673J16322N9063j42762
8075F3273j6934J31934o9545r7306N6955O5666K68335M8381m0386l46907k0240
8064D3226l557j55496j4657R187L7675K0714r157N0508R0849Q5468P8443j07523
8052A25680j0218k621L2915o3469r0869M2004k8778l1251N5419J90091K23611
$$ plain form
8131 -403334 -223320 -123425 -217525 -218467 -163167 -177181 -198377 -209238 -175732 -147288 -92423 -118058
8119 -118058 -99428 15188 -65062 -192986 -135271 -96604 -227606 -316612 -237132 -288913 -447371
8108 -447371 -462472 -340789 -306256 -256289 -369565 -364170 -307919 -169662 24535 -15206 -26346
8097 -26346 60098 25741 -41081 14596 61247 -75321 -270969 -334011 -381439 -335282 -169068
8086 -169068 42811 133192 138898 65166 143822 195265 45323 30650 146972 206035 63273
8075 63273 46339 178273 108728 11422 68377 134043 402378 450759 410373 63466 43226
8064 43226 39669 -115827 -130484 -121297 -83622 -62908 -72065 -21557 69292 154760 233203 125680
8052 125680 115462 112841 145756 82287 -8582 33422 4644 -26607 28812 218903 442514
8041D42514j30507k58524j44988r3197k3226n4656j46576p2597J12690J07153
8031b61914J40560J06859j1897k7825j1932j22773p8075L1445N3596J43865j6321
8020e4412k9532J62567J74218L1015j17103K1807O3672K948p1997O5471J7491
8009B66145P3068l5376k89753Q130Q5648l6964q0306j56015J93905K09542k39624
7998a600p6157l3803M8245J64714L3504j36169j1800J10390j32003j08720p7214
7987b20613k0120J58835M3055K5677J38825K6200j93219j28863j4621j14066M7139
7976b51771J33501J09455J91906m3809r4699j10595k25125P7969j70380r8440
7966d81988J89433K3106P5625p4676L9418L9835J15970J0360q2889q512J27888
$$ plain form
8041 442514 312007 53483 -91505 -184702 -207928 -262584 -409160 -481757 -369067 -261914
8031 -261914 -121354 -14495 -26392 -54217 -66149 -188922 -266997 -235552 -181956 -38091 -54412
8020 -54412 -83944 78623 252841 283856 166753 188560 252232 255180 183183 248654 266145
8009 266145 339213 303837 14084 22214 107862 70898 -9408 -165423 28482 238024 -1600
7998 -1600 -77757 -111560 -63315 101399 134903 -1266 -13066 97324 -34679 -143399 -220613
7987 -220613 -240733 -81898 -38843 -13166 125659 151859 -41360 -170223 -184844 -298910 -251771
7976 -251771 -118270 -8815 183091 139282 44583 -66012 -291137 -213168 -383548 -481988
7966 -481988 -292555 -269449 -193824 -268500 -229082 -189247 -73277 -62917 -145806 -154318 -26430
7955b6430L4716n6785J9126J27476L0933Q9882j49436k17378O6833j6880N1203
7944d6740J31940J49035m6598o3880J49653j85851j24415N5712j04159N4232q5449
7933a16520j5996r4287J03706J23317K20646P906k06371J4962J03965q0807j73744
7922a13223J44886Q2898q0835m5413j85482N1335L8821J53918O3230Q1850M091
7911A96076M2003L3424l00169j27652j17695P3117O7655J59466Q3728j6430p235
7900H6288r367J0833q3897j05151J75639k6954J0493n0569p7425l9624P7207J6808
7888a5719P7636Q1758M832q7730P2058l9108l2934j21352J2658J71495P5338K0785
7876B19717q6555J2142n4769j14793P3705j2007N9602j3437q8926l1697j27172
$$ plain form
7955 -26430 8286 -48499 -29373 98103 129036 218918 69482 -147896 -81063 -97943 -46740
7944 -46740 85200 234235 187637 123757 273410 87559 -36856 18856 -85303 -31071 -116520
7933 -116520 -132516 -226803 -123097 220 220866 228772 22401 37363 141328 60521 -113223
7922 -113223 31663 114561 33726 -11687 -197169 -145834 -107013 46905 110135 191985 196076
7911 196076 238079 271503 -28666 -156318 -274013 -200896 -133241 26225 109953 93523 86288
7900 86288 76921 87754 3857 -101294 74345 47391 57884 7315 -70110 -109734 -32527 -15719
7888 -15719 61917 143675 148507 60777 132835 93727 60793 -60559 -47901 123594 198932 219717
7876 219717 133162 145304 90535 -24258 49447 37440 97042 83605 -5321 -37018 -164190
7865a64190Q589J0781j5719j34074q4326k1110J64479K05215m6808r8552J06183
7854f9532j8209J4782J13104O3l0521j12342j45571R8295K1502M1033R1731k9975
7842b5640O8000O7896k66288j29158p042j11782R3347m1286o4253M0295Q1871
7831b94040J20037J23919M0432r8731M4574J37381J73770P1831J51393q6155j97183
7820A87228K7893j47816J81745J94922q9627k27940j45713R4693P7623j764o7313
7809H3931l7843k04739L7037j43276n6965K27626M8175m9334Q4065m3307n4353
7798a08983J03757K51J80916J4248k07421J300Q8131q2308J11425J03530k57824
7787e2978j92656M1164Q0156l2880k437j04069j20160J60796J42987O6305j26461
$$ plain form
7865 -164190 -155601 -144820 -160539 -294613 -378939 -400049 -235570 -30355 -77163 -175715 -69532
7854 -69532 -87741 -72959 40145 40208 9687 -102655 -248226 -149931 -128429 -87396 4335 -25640
7842 -25640 42360 110256 -156032 -285190 -292232 -404014 -310667 -351953 -416206 -375911 -294040
7831 -294040 -174003 -50084 -9652 -108383 -63809 73572 247342 319173 470566 384411 187228
7820 187228 215121 67305 249050 443972 354345 126405 -19308 75385 153008 151244 83931
7809 83931 46088 -158651 -121614 -264890 -321855 -94229 -46054 -95388 -11323 -54630 -108983
7798 -108983 -5226 -4975 175941 190189 -17232 -15932 72199 -10109 101316 204846 -52978
7787 -52978 -245634 -204470 -124314 -157194 -159631 -263700 -383860 -223064 -80077 -13772 -140233
7776a40233O5386O8482j05400l6801p8359J65664J55078P5262O714k38837j70045
7765b33089P6213P3175N0321J37115R3130j35620p0815J5676P9331j04407M4919
7754B5949p4333r3031m3675P716J47560J43626K6937L209j260j62711p715r0459
7742a18187l3606J17326J4963L7391J47490R8288j18960j89467O2263N2133n3777
7731A5857J01748O6150m6136J151j14066N554m4968o7579J13718p692r5672r2117
7719a64052n2230N8414m2807j7368q3531m2420K49571J50547k6084q1190L7872
7708a3278p1808L1164K31675r8520j51833J10527k5015J4167J3851K7865J90743
7697B59538L5548n6166m9783j4179L837q8609q4734j00460N2487l5975j82103
$$ plain form
7776 -140233 -74847 -6365 -111765 -148566 -226925 -61261 93817 169079 175793 -63044 -233089
7765 -233089 -156876 -83701 -33380 103735 196865 61245 -9570 6106 85437 -18970 25949
7754 25949 -48384 -141415 -185090 -177374 -29814 113812 140749 143958 142698 -20013 -27728 -118187
7742 -118187 -151793 -34467 -19504 17887 165377 263665 144705 -44762 17501 69634 15857
7731 15857 117605 183755 137619 138770 24704 30258 -14710 -82289 31429 23737 -71935 -164052
7719 -164052 -216282 -157868 -200675 -218043 -301574 -343994 -94423 56124 30040 -51150 -13278
7708 -13278 -85086 -53922 177753 79233 -72600 37927 12912 27079 40930 68795 259538
7697 259538 295086 238920 189137 174958 178795 90186 5452 -95008 -42521 -78496 -260599
7686b60599n8418Q8873M7486P0445P1285J79916j83144k17729J28831O7852N4871
7675a0331K04226J5487j63623j15370P9343n6673p1130j37042J43809J30715m9015
7664b9604r8670o1245P0026K80319K57099p4693j61019j70226J09486J06937l33973
7653a05563P5348K20128J15490k571k15764j04501m918J46756m1928k2089j2510
7642D7878q359l5641j40445J46720O3067l7942m3051J84657M9689j78772L9782
7631H7583O6534p6636l4875j23488K3178Q8016M6703K5242K1409k7439M4188r1483
7619D8932M1236o086j41937J24235K42925P3123M9519r1054m8146r365j17422
7608A65960P7755l1043P5650J24937j53621j13919J9827J50793r2953j49599J2408
$$ plain form
7686 -260599 -319017 -230144 -182658 -112213 -40928 138988 -44156 -261885 -133054 -65202 -10331
7675 -10331 193895 209382 45759 -69611 9732 -46941 -118071 -255113 -111304 19411 -29604
7664 -29604 -128274 -189519 -119493 160826 417925 343232 182213 11987 121473 228410 -105563
7653 -105563 -30215 189913 305403 302832 87068 -17433 -22351 124405 82477 60388 47878
7642 47878 39519 3878 -136567 10153 73220 35278 -7773 176884 226573 47801 87583
7631 87583 154117 77481 42606 -80882 -57704 30312 77015 102257 123666 96227 140415 48932
7619 48932 90168 84082 -57855 66380 309305 382428 431947 340893 292747 283382 165960
7608 165960 243715 212672 288322 413259 259638 145719 165546 316339 223386 73787 86195
7597H6195J00616J7450N300k3381l9394k89794k1862L3055K35804L4161j49712
7586a1562j1766K1111q6672Q4272p26K3871k244J71478J70300l2242m9785n071
7574B70964j28236m6519M7477p5938j22626l412o982n9349m1107M1833J39246
7563A5351m161j33857N4871p1323r5507P1746j30994J26662o4897K8447J53691
7552d9971N5649m2667n521L2665J0128j23341l0307J06551j16566J9983J13221
7541c0176j50124L1092J6304n8976J13144p1535J09504J59717J6763J2620j02979
7530D5354l686P7053M3568k9068j68034l6775p8234M5228m0652p2193K4100R7932
7518i5407J66367m9192k43272k19813J69146J19893J86088R6289L9829j74469
$$ plain form
7597 86195 186811 204261 209561 186180 146786 -143008 -164870 -131815 103989 138150 -11562
7586 -11562 -23328 -2217 -88889 -4617 -5343 18528 16284 187762 358062 325820 276035 270964
7574 270964 142728 96209 143686 67748 -54878 -58290 -65272 -124621 -165728 -123895 15351
7563 15351 11190 -122667 -67796 -139119 -234626 -162880 -293874 -167212 -232109 -203662 -49971
7552 -49971 5678 -36989 -42510 -9845 283 -123058 -153365 -46814 -163380 -143397 -30176
7541 -30176 -180300 -149208 -132904 -191880 -78736 -150271 -40767 118950 135713 148333 45354
7530 45354 41668 118721 162289 133221 -34813 -71588 -149822 -104594 -145246 -217439 -193339 -95407
7518 -95407 70960 21768 -221504 -441317 -272171 -152278 33810 130099 169928 -4541
7508d541J94760R9559j92518j25820k9456j34049j18325m1385p8161K21825J0649
7497a97462j2219P6692K09184o3362j37313M5523N7824k68525L5873J9734P0333
7486a63718J3207m3564J4178n2203m9559M3575J01284J28228n3059j83079J20152
7475a24558J80769n6229j87589j57608K29189R9748m959n3106j92421M4073l8036
7464b60727J9416o2143J82154J15870k7730P3546j34039j66554K5142p7779M6394
7453b66450P9830L4336o882O3612K01399J02267q5418j84995J67705J28128o8997
7442A64535M0908m3379L1306n9693j03969M6482K3545o5784o3086j18615m4513
7431a92263J19064P5951K455N5537O9421l6835j26715j8173j37134m8879J17754
$$ plain form
7508 -4541 190219 289778 97260 -28560 -58016 -192065 -310390 -351775 -429936 -208111 -197462
7497 -197462 -209681 -132989 76195 12833 -124480 -78957 -21133 -289658 -253785 -234051 -163718
7486 -163718 -150511 -194075 -179897 -232100 -281659 -238084 -136800 -8572 -61631 -244710 -124558
7475 -124558 56211 -18 -187607 -345215 -116026 -16278 -21237 -74343 -266764 -222691 -260727
7464 -260727 -241311 -303454 -121300 -5430 -33160 40386 -93653 -260207 -235065 -312844 -266450
7453 -266450 -186620 -152284 -159166 -95554 105845 208112 122694 -62301 105404 233532 164535
7442 164535 205443 162064 193370 133677 29708 76190 99735 33951 -29135 -147750 -192263
7431 -192263 -73199 2752 5207 60744 130165 93330 -33385 -51558 -188692 -237571 -119817
7420a19817O1485k7450k3859j50847O8214K6307N9500k9040r8160J77561J36565
7409H0459J194J06673O841j45129j8694j59060r1405J33793J32301o1106p6986
7398i1119n476R3650k7395k6022p9776L5507j73083o8091J20421J14564J27652
7387B0832M3620R7452l0810j26853J25922m1718j05700j48753r6304j36474M0465
7376c58321J47962J43484L045P0572J2592o0216n7688J6059P6736r8156P428K3059
7364g3444j20241j17754J6230J00642Q7907j9432J14884J07489K8765j44806j9339
7353c9099L770L0160K06535k9147j43679l6769k8567J05677K67179n3461k03363
7342G9236j16196n1311l401R6142M8104j2115j7228P8429M4775j26921k32990
$$ plain form
7420 -119817 -58332 -85782 -109641 -260488 -192274 -165967 -106467 -135507 -233667 -56106 80459
7409 80459 81653 188326 195167 50038 31344 -127716 -219121 -85328 46973 -14133 -91119
7398 -91119 -96595 -2945 -30340 -56362 -136138 -100631 -273714 -341805 -221384 -106820 20832
7387 20832 64452 161904 131094 4241 130163 88445 -17255 -166008 -262312 -398786 -358321
7376 -358321 -210359 -66875 -63830 6742 19334 -40882 -98570 -82511 -5775 -103931 -96503 -73444
7364 -73444 -193685 -311439 -295209 -194567 -106660 -126092 -11208 96281 125046 -19760 -39099
7353 -39099 -35329 -5169 201366 172219 28540 -8229 -36796 68881 336060 282599 79236
7342 79236 -36960 -88271 -91672 4470 52574 40459 23231 101660 146435 19514 -213476
7331b13476j9830L62p5593j16714J7935J31544J31541n3346r1292J12137K61118
7320H4386r8312j7105q1051q9626q3670q8469P7232m988q5900O9500J75078l1551
7308a74476l2078J22865J61515L3590J72826r5426j02041q4739M372K28751l093
7297B32066k55419n1257n5361K4793L1563l0889P4292P7121J26339o0366P4473
7286A87355q3690k16597j74370R0807J42108P4486p8015k99406j6495P4990M517
7275b94310O0197k3201R9257J79279m6224m7008J42353K08317n5364k94432L6509
7264c4627J41331J9656j29964L986j48299j27345J65693J2701j16534j44002N3735
7253c03669J52755K07413l861m3406J05905N8013j20959j43655L0642p369m8306
$$ plain form
7331 -213476 -233306 -232944 -308537 -425251 -407316 -275772 -144231 -197577 -288869 -176732 84386
7320 84386 -13926 -31031 -112082 -201708 -285378 -373847 -296615 -301603 -387503 -318003 -142925 -174476
7308 -174476 -206554 -83689 77826 111416 284242 188816 86775 2036 6408 235159 232066
7297 232066 -23353 -74610 -129971 -105178 -73615 -104504 -30212 46909 173248 112882 187355
7286 187355 103665 -112932 -287302 -196495 -54387 20099 -57916 -357322 -373817 -298827 -294310
7275 -294310 -234113 -257314 -158057 21222 -25002 -72010 70343 278660 223296 -71136 -34627
7264 -34627 106704 126360 -3604 382 -147917 -275262 -109569 -96868 -213402 -357404 -303669
7253 -303669 -150914 56499 52638 9232 115137 173150 52191 -91464 -60822 -68191 -116497
7242a16497J21516o4486j15519L8941J1558R852n4899J4373j8133R7568K24807
7231A49081l056j06989O1549O963j00228k420p1800r8393J24636Q1294k7293l0457
7219a7113R4374j19555m4122M0290J19780m2680O3424o7579l4241M4075j83647
7208a46994N6140J36059n0415p4430J16799L1098o4586k49347O0822J56064K111
7197b6679l1960K6169n8338n5322K33513N7654j65375q3612J84942j20014K55806
7186B16784k7814j12261r9890j48273K3814K15702K11395J43844r283j17543j20511
7175A75964n6102j3408n8031j38446J17830J10419j27911q6527J55644N351j11990
7164b7207j03812J08855O4843j29167n1828l8904j24405K3007L0231m9717m0177
$$ plain form
7242 -116497 5019 -59467 -174986 -136045 -124487 -114635 -169534 -155161 -173294 -75726 149081
7231 149081 146025 39036 100585 107548 7320 4900 -66900 -165293 -40657 40637 13344 -17113
7219 -17113 77261 -42294 -86416 -46126 73654 30974 94398 26819 -7422 36653 -146994
7208 -146994 -90854 45205 -5210 -79640 37159 68257 3671 -245676 -184854 -28790 -26679
7197 -26679 -58639 -32470 -90808 -146130 87383 145037 -20338 -103950 80992 -39022 216784
7186 216784 188970 76709 -23181 -171454 -147640 68062 279457 423301 414018 296475 175964
7175 175964 119862 106454 48423 -90023 27807 138226 10315 -76212 79432 84783 -27207
7164 -27207 -131019 -22164 42679 -86488 -138316 -177220 -301625 -278618 -248387 -298104 -338281
7153c38281J92359K19465K49735N6676k05330j29804j83383K2521K7412M019P953
7142g6658r3307p2404J71693M2124K5144L5678J41766j4354m7206j25043k975
7131a5542M6638K2890O0759J622L4126n357O1904K2866o2762l5166j13948M28
7119A8458j40011O1911j68758r1226m142O2428K31995O5176j09402j55488J33870
7108i5189j25958J13576K05465j2374p6007p659Q4190R6479j07134j48637J95784
7097A22536Q2663J6126p1716k48390m8728P9352J7559j72391R3947R8197n4377
7086h5222Q3070R933m7363Q3650J25635Q8693P8200j56557k08804k05936j04078
7075c38779l8492P3228K2686M052J06492j00964o2327J64754K46314j1238p789
$$ plain form
7153 -338281 -145922 73543 323278 379954 174624 44820 -138563 -116042 -88630 -84611 -76658
7142 -76658 -169965 -242369 -70676 -28552 -3408 32270 174036 159682 112476 -12567 -15542
7131 -15542 31096 53986 114745 116367 150493 145136 207040 229906 167144 131978 18030 18458
7119 18458 -121553 -59642 -228400 -319626 -323768 -261340 -29345 35831 -73571 -229059 -95189
7108 -95189 -221147 -107571 97894 85520 9513 1854 86044 182523 75389 -73248 122536
7097 122536 205199 221325 149609 -98781 -147509 -68157 -50598 -222989 -129042 -30845 -85222
7086 -85222 -2152 7781 -39582 44068 169703 258396 336596 180039 -28765 -234701 -338779
7075 -338779 -377271 -304043 -281357 -277305 -170813 -271777 -334104 -169350 76964 65726 57937
7064E7937L0357q0278K7559K1949j03366j14248j48103l9881R0441Q88Q3122K1273
7052a52350J34219J22212R1020p2761O1747j86339j44778R461N3900J87401J74953
7041B78685j30273k27863o4817N6690k3233N0790m6966j37233K26597l4000j2706
7030f4329j07009j07604j3618m4452K22197J69278K3011J88976M36q5619k07233
7019b5966j52971n867l632L6301J75802J17152Q0341J8234j31700j02790K0702
7008B5606J34419L7385n7596j59166n513J49357o961o1613J34465o5108p6502
6997D8773o5567j8969j84388n2607N2126N3051L0181J56282j1452L900N1011K5391
6985H7732j4618O340n078j12657M5861m6951J82433J05911j30362l7532J33907
$$ plain form
7064 57937 88294 8016 35575 57524 -45842 -160090 -308193 -348074 -257633 -256745 -173623 -152350
7052 -152350 -18131 104081 195101 122340 184087 -2252 -147030 -137569 -83669 103732 278685
7041 278685 148412 -79451 -144268 -87578 -110811 -60021 -106987 -244220 -17623 -51623 -64329
7030 -64329 -171338 -278942 -292560 -337012 -114815 54463 77474 266450 266886 181267 -25966
7019 -25966 -178937 -184804 -188436 -152135 23667 140819 221160 239394 107694 4904 25606
7008 25606 160025 197410 139814 -19352 -24865 124492 117531 55918 190383 125275 48773
6997 48773 -16794 -35763 -220151 -272758 -220632 -167581 -137400 18882 7430 11330 62341 87732
6985 87732 73114 79454 74376 -38281 7580 -39371 143062 248973 118611 81079 214986
6974B14986J9175j54020K8337J12933j18185j37897J32392K24336j71881k87114
6964a36938k29190K4902J53712J1479J02153L5490j29020L585J42028r9012r2482
6953b13293k67401j29807K38050K01910L08464j77138k85272j5319K02775P9039
6943e7992l9891P3297n8685L257O8474j9899N8364K2382K20402M3201O702k0117
6931B99495R5895p0442j90201j81140P5929J30935J6498M02p4307L4270L4555
6920A71889j8696j84049q1825r7427K46226K86451J1994J1456L6184o8644r7075
6909B16484k21682j05664J36154k705k7484K6487o4198m7051Q417M937j12374
6898a88679J31842P8489J33668J1381j80593j77619J2950L4889R0098J71826j214
$$ plain form
6974 214986 234161 80141 108478 221411 103226 -34671 97721 322057 150176 -136938
6964 -136938 -366128 -341226 -187514 -176035 -73882 -38392 -167412 -163827 -21799 -120811 -213293
6953 -213293 -480694 -610501 -372451 -170541 137923 -39215 -324487 -339806 -137031 -57992
6943 -57992 -97883 -24586 -83271 -80014 -11540 -31439 26925 49307 269709 312910 319612 299495
6931 299495 395390 324948 134747 -46393 29536 160471 176969 177371 103064 137334 171889
6920 171889 153193 -30856 -112681 -210108 36118 322569 334563 346019 382203 313559 216484
6909 216484 -5198 -110862 25292 22587 -4897 21590 -42608 -89659 -81242 -76305 -188679
6898 -188679 -56837 21652 155320 166701 -13892 -191511 -178561 -143672 -53574 118252 117038
6887A17038j15663k9746K2791j8446r9732k866r1271m8706K4903k302p2529l8243
6875c54772J94386R2908L7928k610J1267l4871k7610n5349J1019K12047p4713
6864I630o2526j25922J09880o3202o2240L1086P4977n3264k7530l1187p7857k1920
6852c00075P4994P3721J89084J56714j63686p5125n3020J11507J21602j38263
6842b547q9346J74929L0487k0196L2475J57377J08179p6963k08292j43775j09514
6831a47186N154Q3966K88094n8384J5762p8628o9792J71746P9205o2768j61822
6820F5347o4308k8111p0028m0259L4438l4736O0997J17379R5943P4703p867j94697
6808H801j87311P6492K40122J52316N2259j31283j09061j64351o3221Q6729J3444
$$ plain form
6887 117038 1375 -28371 -5580 -24026 -123758 -126624 -217895 -266601 -241698 -244000 -316529 -354772
6875 -354772 -160386 -67478 -29550 -32160 -20893 -55764 -83374 -138723 -127704 84343 9630
6864 9630 -52896 -178818 -68938 -132140 -194380 -163294 -88317 -141581 -169111 -200298 -278155 -300075
6852 -300075 -225081 -151360 37724 194438 30752 -44373 -97393 14114 135716 -2547
6842 -2547 -91893 83036 113523 93327 125802 283179 391358 314395 106103 -37672 -147186
6831 -147186 -142032 -58066 230028 171644 187406 108778 38986 210732 289937 227169 65347
6820 65347 1039 -27072 -97100 -137359 -102921 -137657 -76660 40719 136662 211365 203498 8801
6808 8801 -178510 -102018 138104 290420 342679 211396 102335 -62016 -125237 -38508 -25064
6797b5064O3929L6523K0748j57988q384Q8503K9318M3720J13165J50839R2907
6786D48216j53999k8326K3782L6591j29939Q0258K0422J07585j83040J543O0430
6775B83523J64666M717k72369j06692j36967p2233L0392m0110M8308l6385q4K41670
6763A08436L6010m8535o3690p7746J9635l6730n8773L022J29175r6704R5962p0247
6751f0185m328J58057O7663j29571j58869O3937J9245J02234q0545m0759K78117
6740B14996l2009j65270q6847P5506j0268P0150o5161j8372P1860n9818L1380
6729B6147k4577j5951m4321l8653j61712m2091R7433J65093L6055J03001j8775
6718H1649j10892j12190J22294J15N945J20626r340q6186r5500J5577J17798j74664
$$ plain form
6797 -25064 38865 75388 96136 -61852 -70236 18267 47585 91305 204470 355309 448216
6786 448216 294217 265891 289673 326264 196325 276583 297005 404590 221550 223093 283523
6775 283523 448189 452906 180537 73845 -63122 -135355 -104963 -145073 -96765 -133150 -133234 108436
6763 108436 144446 95911 32221 -45525 -25890 -62620 -121393 -118371 10804 -85900 10062 -60185
6751 -60185 -64513 93544 161207 31636 -127233 -63296 -44051 58183 -22362 -63121 214996
6740 214996 182987 17717 -69130 6376 -3892 66258 1097 -17275 54585 -5233 26147
6729 26147 1570 -14381 -58702 -97355 -259067 -301158 -203725 -38632 -2577 100424 81649
6718 81649 -29243 -141433 -19139 -19024 -13079 107547 98207 12021 -83479 -67902 49896 -124768
6706a24768J8604J37947J5338j07391q6689j44162j76880J34551J16382L8379
6696a78689q3812m894L3438J576J03779o6318R7170n741q9958j34283J4983P5558
6684b37191K66485K73237o8335l0603j6622q9748j51306j45804k02205N5649l2301
6673c78744J69482J25447j52818l4650j15011J48626R5196q795J96509M6798m7980
6662D4060j39272r8816k2281m6910N3756P2749r7580o2191n486n5792q635L14750
6650e1648J93503j02121j78011j09995O0733n8058J46855r0776K1846J88701J24835
6639A45864J01463j65751m2908n5366j52203o5345R6123j88382j93J54099J48794
6628b3805K27933j47749j70640K7774m5062j25927J22718M353N6410k6431j10731
$$ plain form
6706 -124768 -106164 31783 47121 -60270 -146959 -291121 -468001 -333450 -217068 -178689
6696 -178689 -262501 -267395 -233957 -232381 -128602 -194920 -97750 -103491 -193449 -327732 -312749 -237191
6684 -237191 29294 302531 234196 203593 186971 97223 -54083 -199887 -402092 -346443 -378744
6673 -378744 -209262 -83815 -236633 -271283 -386294 -237668 -142472 -151267 45242 92040 44060
6662 44060 -95212 -194028 -216309 -263219 -209463 -136714 -234294 -296485 -301971 -357763 -366398 -51648
6650 -51648 141855 39734 -138277 -248272 -187539 -245597 -98742 -189518 -167672 21029 145864
6639 145864 247327 81576 38668 -16698 -168901 -234246 -138123 -326505 -326698 -172599 -23805
6628 -23805 204128 56379 -114261 -86487 -131549 -257476 -134758 -130405 -73995 -100426 -211157
6617b11157q2205J01145M6887J33132K7629j73718j49813l2284J60651l6605M2786
6606a73552K74025l3246M7617N979q1112Q1911o789j65539o1976j36519m0340
6595b89541K65388K3721j02716M1911N1778l1083Q7277J87478J78291o4678k01656
6584A46170p8037O4086k81835j46400J20487N2225M9436P4272k8854P853m2123
6573f2720J57729m5337k367k3106n8614n376Q1795j6785O8835P0681L5202j3371
6561A86566j23364m9075j76262k00818m2818L3166R4791J16485J20766L2088Q7664
6550G9189N6690N803J5187m1705N2878p3484Q348O2313N3610K513j09637j7459
6538I4246q6307n9026j03896L1463N5114P5009q4362l0242Q2663O0559M4110J9864
$$ plain form
6617 -211157 -293362 -192217 -145330 -12198 15431 -158287 -308100 -340384 -179733 -216338 -173552
6606 -173552 100473 67227 114844 120823 39711 121622 114833 -50706 -112682 -249201 -289541
6595 -289541 -24153 -432 -103148 -61237 -9459 -40542 46735 234213 412504 347826 146170
6584 146170 68133 132219 -149616 -296016 -175529 -123304 -73868 404 -28450 -20597 -62720
6573 -62720 95009 49672 47305 24199 -34415 -39791 42004 25219 94054 164735 199937 186566
6561 186566 63202 14127 -162135 -362953 -405771 -372605 -277814 -161329 -40563 -8475 79189
6550 79189 135879 141682 156869 115164 168042 94558 102906 165219 218829 221342 111705 94246
6538 94246 7939 -51087 -154983 -123520 -68406 6603 -77759 -108001 -25338 35221 79331 99195
6526I9195m7975o8680L498j36442n7813L4089J87791J42805o3334l3984J08507
6515A67657O3474j9133j00236J29404k43247o4240K07677k89289j32094K8899
6505b51128Q4812M0619J7152J2509K38486k2179j11414l0640p5787M5674J77280
6494A25384L3105j36266R454P7505P1823Q5379j1691j07501j28821J2226o0298
6483b9701j57436o6058J17156J53057M9740k2182N5174o938l3607l9954j2528
6472F723K0619n1104j8576l0998m5771j01110J74418l1022L7320k7485L1150J63919
6460A28083l7753m143M4511l4854R4863J5648k31814p1640O7248k6266J30311
6449G4194P4515j12570K6653m0691M9121j68233j52632R2600j18342k6027J2832
$$ plain form
6526 99195 51220 -17460 -13962 -150404 -208217 -174128 13663 156468 93134 59150 167657
6515 167657 231131 211998 111762 241166 -2081 -66321 141356 -147933 -280027 -251128
6505 -251128 -166316 -125697 -108545 -96036 142450 120271 8857 -21783 -97570 -51896 125384
6494 125384 158489 22223 31677 109182 181005 266384 254693 147192 18371 30597 -29701
6483 -29701 -187137 -253195 -136039 17018 66758 44576 99750 92812 59205 19251 6723
6472 6723 27342 -23762 -42338 -73336 -119107 -220217 -45799 -76821 -39501 -66986 -35836 128083
6460 128083 90330 86187 130698 95844 190707 206355 -25459 -97099 -29851 -56117 74194
6449 74194 148709 36139 62792 22101 71222 -97011 -249643 -157043 -275385 -301412 -288580
6438b88580k8148R9760k8374Q6649J33222K978Q2686k4123K4021p7750K2571J9374
6426B4286j80864p4729R9620R5800J50445k05674J4449J26913m5960o7273j82812
6415b45799R958J271M1281j7969l3296O0946M7746n572O2740J26970K1651j50316
6403h0389J03649M3908q2259J91709j36804o3458l9740j51937M7661R4651o3532
6392a36541K8054M8931J10244J2725J05325p3329N206k5248n072O5859m8663p8527
6380H964K6138m4141j88804j10001k4475Q6768P5903J59795P9130m6511p8262
6369e5496J35518j28738j18860J31765L4371l8901l0167J8468J63177K1072k73045
6358a40836O6987K7492k96638l4037J69658k1653L5929J83638J65858r653j85522
$$ plain form
6438 -288580 -316728 -216968 -245342 -158693 -25471 -22493 60193 36070 60091 -17659 4912 24286
6426 24286 -156578 -231307 -131687 -35887 114558 -91116 -76667 50246 4286 -62987 -245799
6415 -245799 -235841 -234570 -193289 -211258 -244554 -183608 -135862 -141434 -78694 48276 69927 -80389
6403 -80389 23260 67168 -15091 176618 39814 -23644 -63384 -215321 -167660 -73009 -136541
6392 -136541 -108487 -59556 50688 63413 168738 95409 100615 75367 70295 136154 87491 8964
6380 8964 35102 -9039 -197843 -307844 -332319 -245551 -169648 -9853 69277 22766 -55496
6369 -55496 80022 -48716 -167576 -35811 -1440 -40341 -70508 -52040 111137 132209 -140836
6358 -140836 -73849 -46357 -342995 -377032 -207374 -229027 -193098 -9460 156398 146745 -38777
6347c8777p8582n1825J18149J44480j32742J1655j14265j30603J8742j65703n1546
6336d71017P6738k3192J1411K12010R3204r0018J0634O7327Q4556N138M1795j53135
6324a34549q7928L2666J85789J58908q9374o7984j5160J02806L8072M0995j41375
6313B2866l5238P7783P9581j76922l7773j17206J8378J73837J53156j1775r4228
6302E2459J35940j42639n2321j17377M9949K70452J1451m4798N0444j03480k22565
6291a12485q1128N3959j8880j36151J4388O6347k8470o9298o2321j52138l4184
6280e60361K19472K67836P9801q3653R0980J36823K3602j11541j11120m2297J17791
6269B7333m5386O4946P9888q9002k1741n925N4895j05659k00361P2197O1872M6165
$$ plain form
6347 -38777 -117359 -169184 -51035 93445 -39297 -27642 -141907 -272510 -253768 -419471 -471017
6336 -471017 -394279 -417471 -406060 -194050 -100846 -190864 -180230 -112903 -28347 -23209 18586 -134549
6324 -134549 -222477 -189811 -4022 154886 65512 -2472 -17632 85174 123246 164241 22866
6313 22866 -12372 65411 144992 -31930 -69703 -186909 -168531 5306 158462 146687 52459
6302 52459 188399 45760 -6561 -123938 -73989 196463 207914 163116 213560 110080 -112485
6291 -112485 -193613 -139654 -158534 -294685 -280297 -213950 -242420 -311718 -374039 -526177 -560361
6280 -560361 -340889 -73053 6748 -76905 14075 150898 174500 62959 -48161 -90458 27333
6269 27333 -18053 46893 126781 37779 16038 10113 65008 -40651 -241012 -168815 -106943 -60778
6257f0778O656K41997m631k5872l2368l33827j04875Q1938P876M1638R5674P97
6245h5775R7087n6536O7861M3542k1678K4577L0840J6358M7501m7058k7914N4732
6233A43537K16962P8131r6471j92082k19188j10221p8687J91653K80487l1338
6223A82783l543j07191j7570J40828J39644J48057o5105l03485j24723j9654m6519
6212g6478J17060K4143j20471K5119j0072N2933P1053n7514J32049j6701o7093
6201G4028r7348J19716P0507p9691p1555j3164K33475K1018j04747K4911Q7135
6190B64285q6591o4564Q2862J8837j54225j28427J65386L0387P4528P8136o3269
6179B17345q7041j09278Q8477M0208R8982r496J5893J11257j21571k53846j50585
$$ plain form
6257 -60778 -54122 187875 183244 157372 125004 -208823 -313698 -231760 -223884 -182246 -86572 -85775
6245 -85775 11312 -45224 22637 66179 44501 69078 99918 116276 163777 116719 88805 143537
6233 143537 360499 438630 342159 150077 -69111 -179332 -258019 -66366 214121 182783
6223 182783 179240 72049 54479 195307 334951 483008 417903 114418 -10305 -29959 -76478
6212 -76478 40582 64725 -55746 -30627 -40699 12234 83287 25773 157822 141121 74028
6201 74028 -23320 96396 166903 87212 15657 2493 235968 256986 152239 177150 264285
6190 264285 177694 113130 195992 214829 60604 -67823 97563 127950 202478 280614 217345
6179 217345 130304 21026 109503 149711 248693 239197 255090 366347 244776 -9070 -159655
6168a59655J77128j11517j44526J83491K17680j10335o0898L7952j7333j01923
6158h9936m7741J86196R4360l667j2115l7292j08893m7355K43907M2880j73395
6147D6949M9588J6664j43343q9291l4959O0843R6002q5930J9464l4722n5310K354
6135a51691J07258J88910L394k5176m5476n1327j80866j22795n0518R4734O8738
6124a64815j8212J48405J11627l7559P1018n8356l6327M1604p2852l7665q1795
6113a34927j48831L0601O653J35981J58004j8059M86l9126l3580O1288R753m6479
6101a8236J07208R6024R3689P1994n7359k50230j1378J61788O6933k41137l0812
6090a1516J04435o8716O6785R4396n425J9622k23677k16957J8609R132Q9603K17962
$$ plain form
6168 -159655 17473 -94044 -238570 -55079 162601 52266 -8632 29320 11987 -89936
6158 -89936 -137677 48519 142879 139212 127097 89805 -19088 -66443 177464 220344 46949
6147 46949 96537 113201 -30142 -119433 -154392 -93549 2453 -83477 -64013 -98735 -154045 -151691
6135 -151691 -44433 144477 147871 122695 77219 25892 -154974 -277769 -328287 -233553 -164815
6124 -164815 -183027 -34622 77005 39446 110464 52108 15781 57385 -15467 -53132 -134927
6113 -134927 -283758 -253157 -246504 -110523 47481 29422 29908 -9218 -42798 18490 28243 -18236
6101 -18236 88972 184996 278685 350679 293320 43090 31712 193500 260433 19296 -11516
6090 -11516 92919 24203 90988 185384 179959 199581 -24096 -241053 -222444 -213312 -123709 94253
6078I4253K28663m556j03108K1417k0027j68167l8848j11561j05637j14615L421
6067c18765J39963J82072J9838O2641k73104N3739K41222J75137j29362k59381
6057a06000P6648m6304J43821k2984j11959q0562K5070n5381j14556K12104J66151
6046H6048j15898k60862Q1516J54043L8324J5233p6424K697Q6706j41083r5870
6035b25570O6585J40938Q3584r7075j23476m0975q0951R2345J07612K3806J97543
6024A44366N6086k14088j32927j07066R76J65288K23186J6270p5760o4515j0883
6013I33l3768k0142n2581j74842q750J34241P9879J43848K9536q4536j83262p0014
6001b39458J41084K13791L6861j43806L9913J4668j5228l7805j63215l287P2192
$$ plain form
6078 94253 322916 318360 215252 236669 216642 48475 9627 -101934 -207571 -322186 -318765
6067 -318765 -178802 3270 23108 85749 -187355 -133616 107606 282743 153381 -106000
6057 -106000 -29352 -75656 68165 45181 -66778 -147340 -122270 -177651 -292207 -80103 86048
6046 86048 -29850 -290712 -209196 -55153 -16829 -1596 -78020 -75323 11383 -129700 -225570
6035 -225570 -158985 -18047 65537 -31538 -155014 -195989 -276940 -184595 -76983 -53177 144366
6024 144366 200452 -13636 -146563 -253629 -252653 -87365 135821 152091 76331 11816 933
6013 933 -32835 -52977 -105558 -280400 -289150 -154909 -75030 68818 98354 13818 -169444 -239458
6001 -239458 -98374 115417 152278 8472 48385 63053 47825 10020 -153195 -156482 -84290
5990h4290J21398K12295j68961k11812J08639R3940O2938L347m396r071p9807
5979D4220j63558P3480R1295M7123n3313k48255k28930K00558J47310R6955l063
5968C822K6575j34864K9860Q3566j71215l3153J05462J30185J03098m7766j03207
5957g637j57931J1153J45491p675K1858Q3664j6821K4370j17759j10713r681K6279
5945a15402J3793M2518k4326r2117n3688J35368J46440p5169j31937j98515P514
5934c45521J97654J81119M6845j35992k26393o6047J69150J24856O4449q1202
5924g1082j28102q1652k5664J44680J35309n9955r4464J66720R4004m4463n3759
5913a8428K7052j23170l3268j3155O7281j9187q9036l3910O2341L16897Q2701
$$ plain form
5990 -84290 37108 249403 80442 -131370 -22731 71209 134147 137494 133098 124027 44220
5979 44220 -119338 -45858 45437 92560 39247 -209008 -437938 -237380 -90070 6885 3822
5968 3822 30397 -104467 -74607 8959 -162256 -195409 -89947 40238 143336 95570 -7637
5957 -7637 -165568 -154415 -8924 -16599 5259 88923 72102 96472 -21287 -132000 -141681 -115402
5945 -115402 -101609 -59091 -83417 -175534 -229222 -93854 52586 -22583 -154520 -353035 -345521
5934 -345521 -147867 33252 80097 -55895 -282288 -348335 -179185 -54329 10120 -71082
5924 -71082 -199184 -280836 -306500 -161820 -26511 -86466 -180930 -14210 79794 35331 -18428
5913 -18428 8624 -114546 -147814 -160969 -93688 -112875 -201911 -235821 -173480 143417 226118
5902B26118j98510k61461l1647N7714R3578Q6918k6197j8594O3657M6644j17021
5891g8801r2851p9262L3311Q0050j6675Q9829O0155p1581J8010l6244p0204R5652
5879f8611J87044q1117k17776q3291M1887J29010J33303j16264j0608J02634K0704
5868C6915p7684k1238o1690K17422J16311j71074j60966q0523j9572P5884P7128
5857f9087J6212m0025r0169m6301Q5237J92734n6868p2227M2705p9937n2933K63601
5845I2942J68409o7640k58084j33979K01058N4827J60140J01699o5259n0851p3391
5834A29871k3518r452l2784O8835N0371R9066J50156l839j43816P2923K08222
5823E66035J19377j64876j80504q1904o1887j90243j56226O9310o1043O6307J8330
$$ plain form
5902 226118 27608 -233853 -265500 -207786 -114208 -27290 -53487 -72081 -8424 38220 -78801
5891 -78801 -171652 -250914 -217603 -137553 -154228 -64399 -4244 -75825 -57815 -94059 -164263 -68611
5879 -68611 118433 37316 -180460 -263751 -221864 -92854 40449 -75815 -86423 16211 36915
5868 36915 -40769 -62007 -123697 93725 210036 38962 -122004 -202527 -222099 -146215 -69087
5857 -69087 -52875 -92900 -183069 -229370 -144133 48601 -8267 -80494 -37789 -117726 -170659 92942
5845 92942 261351 193711 -64373 -198352 2706 57533 217673 319372 254113 203262 129871
5834 129871 106353 96901 64117 132952 183323 282389 432545 428706 284890 357813 566035
5823 566035 685412 520536 340032 258128 196241 5998 -150228 -80918 -141961 -75654 -57324
5812e7324J5607J06612R0703O2953J954k8627M3155M6651j94781p9702r7065J16869
5800B7005K66159O9138j11676m0809J41710q8675o7724r592J3313Q088M4163j99085
5788E2015j86884P3715k1790r1941o3173n888J2890J42098P1745N6515L2433p0604
5776A131M8156K6385j36390J5305J61025P4875m3086q4396l5921k8726l7556R3519
5764E4321m5306k09075P6591R7888K24561j10619r6346k0135k8100L9302j6488
5753c3406k7283M546M7690r1831m6562o1199j79885p7930N7341J03347J85091
5742a20081K4667k0110L6297n2193O1739J75635N4671j7775p5252K1034o6267
5731B2365l6007l9296k11518J26084P8773q2294K090J77093q9784j39854J4427
$$ plain form
5812 -57324 -41717 64895 155598 218551 220505 191878 235033 281684 86903 7201 -89864 27005
5800 27005 293164 362302 250626 209817 351527 262852 195128 185536 198849 206937 251100 52015
5788 52015 -134869 -61154 -82944 -174885 -238058 -243946 -231056 -88958 -17213 39302 71735 1131
5776 1131 49287 75672 -60718 -45413 115612 190487 147401 63005 27084 -1642 -39198 54321
5764 54321 9015 -200060 -123469 -25581 198980 88361 -7985 -28120 -56220 -16918 -33406
5753 -33406 -60689 -56143 -8453 -100284 -146846 -208045 -387930 -465860 -408519 -305172 -120081
5742 -120081 -95414 -115524 -79227 -131420 -69681 105954 160625 142850 67598 88632 22365
5731 22365 -13642 -52938 -264456 -138372 -59599 -141893 -139803 37290 -52494 -192348 -177921
5720a77921m8743R7407K00968J77998r439n6659j43855N4075k13871J37020J35227
5709A52207J09147j13584j58433K4971p1772M5856R10k24331K497l9596O6397
5698b05731J65391j56574r5956N9257J55570Q8284j03039j60133k5484J79548
5688i8867L30301n2457r7126m0415o1612O719j6987r9218j75940J06241Q4981
5677a14380L9619j44482j51841p8321M8427K66494p8305Q502N6537L7397j49985
5666b60338P6241J33735N0450l6765j72027j98576l3355J90618J26069q9230J27806
5655h5372J27182o562J5291j6491O6276J628R3633O3850n9920j30827n739K9338
5643I2287l8436q2201N6384q3931k32372J7726L2161o7864J51923J11380j75417
$$ plain form
5720 -177921 -226664 -129257 71711 249709 240270 183611 39756 93831 -120040 16980 152207
5709 152207 261354 147770 -10663 14308 -57464 -11608 -10698 -235029 -232532 -272128 -205731
5698 -205731 -40340 -196914 -292870 -233613 -78043 10241 -92798 -252931 -278415 -98867
5688 -98867 231434 178977 81851 41436 -20176 -13457 -30444 -129662 -305602 -199361 -114380
5677 -114380 -74761 -219243 -371084 -449405 -400978 -134484 -212789 -204287 -147750 -110353 -260338
5666 -260338 -184097 -50362 88 -36677 -208704 -407280 -440635 -250017 -123948 -213178 -85372
5655 -85372 41810 35248 50539 34048 100324 101952 195585 259435 199515 68688 62949 92287
5643 92287 53851 -28350 28034 -55897 -288269 -270543 -238382 -306246 -154323 -42943 -218360
5632b18360J26782K00722J7614O8670j30903k48201J13120O2215o8741K9989p1087
5621a18180q9307J49142j5537p9165j19241m730R2733k5366m2883N5945p9219
5610b75808J52973J31286K5567J2524O9686j71463j50994N3240O4993K7061j58926
5599b19861J68543J43913j82898N4934J0553j18642l5263J39763N5365J42177
5589A58584m3019m093l742k11419k74615K9974J50978K61326j19950j95346j04749
5578c56071N6661J33870K07057o0230j64880j62429k1649R4397K4431Q2618J36613
5567b9612P9621R8824j51026j55332J4321P464j17029k6917l5101L6230J70054
5556a08503J14793j22953r5482K11506L7165j09174K2627j5297N5245R2113J7661
$$ plain form
5632 -218360 -91578 109144 126758 195428 64525 -183676 -70556 -8341 -77082 -47093 -118180
5621 -118180 -207487 -58345 -73882 -153047 -272288 -277018 -184285 -209651 -252534 -196589 -275808
5610 -275808 -122835 8451 34018 46542 116228 -55235 -206229 -152989 -87996 -60935 -219861
5599 -219861 -51318 92595 -90303 -35369 -24816 -143458 -178721 -38958 16407 158584
5589 158584 115565 111472 107730 -103689 -378304 -348330 -197352 63974 -55976 -251322 -356071
5578 -356071 -299410 -165540 41517 -18713 -183593 -346022 -367671 -273274 -248843 -166225 -29612
5567 -29612 50009 148833 -2193 -157525 -143204 -135740 -252769 -279686 -314787 -278557 -108503
5556 -108503 6290 -116663 -212145 -639 36526 -72648 -50021 -65318 -10073 82040 99701
5545I9701P3851O1858j32685k6325r0603J54372P1232p3321l3510J60677k8061
5534B37186k46027l1925j50297k9282P8030M1896k0388J16980J6289J71976J58088
5523C42526j35094p6228o36J29372J86291L1165p4908q0268j81045j98553p0458
5512a27836J6860R5770n8446O2363N3985o9304o809O8895N9643l7332k7958P9383
5500A09214p9048j51983k56831j02484J64500o8116J3852P5852p9249L5042J71257
5489a67994l7782O6091J26463R3256j61192j87904P6590K1616L2779j5434J24555
5478b8956r5488j794k0978J7784R7735K1176j08131j4373N0029O1480J19635k3311
5466G4808j54611q4481l977J34434R5467K9825p9092r81k77106N5095M3328k1684
$$ plain form
5545 99701 173552 235410 102725 76400 -14203 140169 211401 138080 104570 265247 237186
5534 237186 -8841 -40766 -191063 -220345 -142315 -100419 -120807 -3827 12462 184438 342526
5523 342526 207432 131204 130568 259940 446231 477396 402488 322220 141175 -57378 -127836
5512 -127836 -110976 -15206 -73652 -11289 42696 -26608 -33417 35478 95121 57789 29831 109214
5500 109214 30166 -121817 -378648 -481132 -316632 -384748 -370896 -295044 -374293 -339251 -167994
5489 -167994 -205776 -139685 -13222 80034 -81158 -269062 -192472 -170856 -138077 -153511 -28956
5478 -28956 -124444 -126238 -147216 -129432 -31697 -10521 -118652 -133025 -82996 -21516 98119 74808
5466 74808 -79803 -164284 -168261 -33827 61640 91465 12373 11392 -265714 -210619 -167291 -188975
5454a88975J18139J87526N0882k558M5447m8728j77144k66112J29119O3991Q2525
5443e888l1122j5430k20085k6482J28784J38058P8311j66862O7983J02912k9502
5432B0677k4133m0668o0032l1128K07850j890j04688k0099o6188q087k1255j57594
5420c07235J24210K7109l5174J1936Q5666J08413p0778l0733P496N9207J24234
5409A04351p55k78672n4962J88691J04029l3421j00800l6538m0077J16290P6872
5398D5008Q5757M9649j02305j68520p248P2425K9405q6397j05180J01725K9451
5387e6230m1639J78122L1192j95080O0501J29703j2556j9298K3415m5571l5837
5376A6722p8109j60557k14439J19090J15126J49447J35816j19474Q4745J50939
$$ plain form
5454 -188975 -70836 116690 167572 165014 210461 161733 -15411 -281523 -152404 -88413 -5888
5443 -5888 -37010 -52440 -272525 -299007 -170223 -32165 46146 -120716 -52733 50179 20677
5432 20677 -3456 -44124 -104156 -135284 72566 70676 -34012 -54111 -120299 -128386 -149641 -307235
5420 -307235 -183025 -155916 -191090 -179154 -93488 14925 -55853 -86586 -79090 -19883 104351
5409 104351 103596 -175076 -230038 -41347 62682 29261 -71539 -108077 -148154 -31864 45008
5398 45008 130765 180414 78109 -90411 -97659 -25234 4171 -82226 -187406 -85681 -56230
5387 -56230 -97869 80253 111445 -83635 -23134 106569 94013 74715 98130 52559 16722
5376 16722 -61387 -221944 -436383 -317293 -202167 -52720 83096 -36378 48367 199306
5366A99306P7553J7796o5570p0795k05053Q4631Q5451j4122K8391j97469p6796
5355a36677P9663k9926l8617n149j41463j1350J7666K88773J66888J24665P910
5344C22383n3138j51277m4540k674M344p5726p4110J45644R4842q8716n9705j49814
5332a32487k492N1050O1217j17563N3824J87868J4854J56613p1291k29359J4024
5321a3742M6199l7541l1949J12095r695k3918R0500L7634q5167j2364r9802k5032
5309e2782Q6451k2746q7175m5925o5907Q6596P7082p5370j25965j41758J05326
5298b62173n1081O3963P9354J63386l0831j35456m5320m7190l3793j35590J06084
5287c28647J98100Q7044n0512J031j00855N8721J25739n9387j01427p786M4948
$$ plain form
5366 199306 276859 294655 229085 158290 -46763 37868 123319 109197 137588 -59881 -136677
5355 -136677 -57014 -86940 -125557 -130706 -272169 -283519 -265853 22920 189808 314473 322383
5344 322383 269245 117968 73428 70754 75098 -628 -74738 70906 165748 77032 17327 -132487
5332 -132487 -134979 -83929 -22712 -140275 -86451 101417 116271 272884 201593 -27766 -13742
5321 -13742 32457 -5084 -37033 75062 65367 41449 131949 169583 84416 72052 -27750 -52782
5309 -52782 33669 10923 -76252 -122177 -188084 -101488 -24406 -99776 -225741 -367499 -262173
5298 -262173 -313254 -249291 -169937 -6551 -37382 -172838 -218158 -265348 -299141 -434731 -328647
5287 -328647 -130547 -43503 -94015 -92984 -193839 -135118 -9379 -68766 -170193 -177979 -133031
5276a33031J35750J45854k4271j76328r2743N9249o3497o615J06015j14390J4288
5265a49719j46278j27997M2793J06863J18908Q7808K14553J25370k0628j19177
5255A32496n2628J10188J05929K01008Q0558r6788o5343j13028L1408m3719j64922
5244A25159N8548R8399j70723q9569J04473P5522o6605n72p659J03323q1962L9332
5232A87666Q8438L3830j10889J22224L8464j45366r8452l6228j04456l3507j07170
5221a65446M2621R4376p7365J49822K2244j23283m7884j08885P2920R7897P7569
5210C4586K5390K1712J3529j83782m8438K9372K09544J76215q6234k5954m2506
5199A23434o2882O3743J6907j16390j1397j451Q460l7481p9778R502Q326n368
$$ plain form
5276 -133031 2719 148573 124302 -52026 -144769 -85520 -149017 -155632 -49617 -164007 -149719
5265 -149719 -295997 -423994 -381201 -274338 -155430 -67622 146931 272301 251673 132496
5255 132496 79868 190056 295985 496993 577551 480763 415420 302392 333800 290081 125159
5244 125159 183707 282106 111383 21814 126287 201809 135204 134632 126973 230296 148334 187666
5232 187666 276104 309934 199045 321269 359733 214367 115915 79687 -24769 -58276 -165446
5221 -165446 -122825 -28449 -105814 44008 66252 -57031 -104915 -213800 -140880 -42983 34586
5210 34586 59976 81688 95217 -88565 -137003 -107631 101913 278128 191894 165940 123434
5199 123434 60552 124295 141202 24812 13415 11964 20424 -17057 -96835 -87333 -79007 -84375
5187h4375M2346m2209P4693p4535j54368n8543L9536K09696P3051O7117j02633
5176a0224Q3827l5051m1665k6999L062J08457K0682P6223o3660j66216R0644R4677
5164A33757J2167M8332k2906K5643j35148k50112L3836P7520M7615J15186P755
5153I3645j84888M2418P9048q685k75579p0343J36619J06185J13341J476j61965
5142a28728o295k2910M8991k7085j0616l8001R3562k8443j31277L9072J12040
$$ plain form
5187 -84375 -42029 -84238 -9545 -84080 -238448 -296991 -257455 -47759 25292 92409 -10224
5176 -10224 73603 38552 -3113 -30112 -27050 81407 102089 178312 114652 -51564 39080 133757
5164 133757 145924 194256 171350 196993 61845 -188267 -154431 -76911 -29296 85890 93645
5153 93645 -91243 -48825 30223 21538 -254041 -324384 -187765 -81580 31761 33237 -128728
5142 -128728 -135023 -157933 -108942 -136027 -146643 -184644 -91082 -119525 -250802 -211730 -99690
$$ [...]
##END NTUPLES=NMR SPECTRUM
##END=
