##TITLE=Analysis number 319143
Compound Code mo 07744
Project Code adrs
Chemist Name chemcon
##JCAMPDX= 6.0         $$ Bruker NMR JCAMP-DX V2.0
##DATA TYPE= NMR SPECTRUM
##DATA CLASS= NTUPLES
##ORIGIN= Bruker BioSpin GmbH
##OWNER= nmr
$$ XWIN-NMR		Version 3.5
$$ Wed May  3 14:38:40 2006 GMT Daylight Time (UT+1h)  MAYBRIDGE\nmr@NMR_250MHZ
##.OBSERVE FREQUENCY= 250.131544655141
##.OBSERVE NUCLEUS= ^1H
##.ACQUISITION MODE= SIMULTANEOUS (DQD)
##.ACQUISITION SCHEME= undefined
##.AVERAGES= 16
##.DIGITISER RES= 18
##SPECTROMETER/DATA SYSTEM= dpx250
##.PULSE SEQUENCE= zg30
##.SOLVENT NAME= DMSO
##.SHIFT REFERENCE= (INTERNAL, DMSO, 0, 16.522)
##AUDIT TRAIL= $$ (NUMBER, WHEN, WHO, WHERE, WHAT)
$$ ##TITLE= Audit trail, XWIN-NMR		Version 3.5
$$ ##JCAMPDX= 5.01
$$ ##ORIGIN= Bruker BioSpin GmbH
$$ ##OWNER= nmr
$$ C:\u/data/dgb/nmr/ADRS/3770/pdata/1/auditp.txt
$$ ##AUDIT TRAIL=  $$ (NUMBER, WHEN, WHO, WHERE, WHAT)
(   1,<2006-05-03 14:38:03.06 +100>,<MAYBRIDGE\nmr>,<NMR_250MHZ>,
      <created by zg, POWCHK disabled, PULCHK disabled
       configuration hash MD5:
       84 BC 41 DB A1 6E 1D 46 DA 25 12 A5 C1 ED C5 3A
       data hash MD5: 64K
       04 B0 54 4B 43 B3 1D EB A5 0F AE CA A2 B6 16 81>)
(   2,<2006-05-03 14:38:23.34 +100>,<MAYBRIDGE\nmr>,<NMR_250MHZ>,
      <Start of raw data processing
       ef LB = 0.3 FT_mod = 6 PKNL = 1 SI = 32K 
       data hash MD5: 32K
       46 73 C2 C0 BB 3E EF D7 D2 60 83 07 29 00 66 B7>)
(   3,<2006-05-03 14:38:27.74 +100>,<MAYBRIDGE\nmr>,<NMR_250MHZ>,
      <apk 
       data hash MD5: 32K
       C6 DE 3A 4B 8B D4 E2 2D EA D3 95 F1 3D 9E FB D3>)
(   4,<2006-05-03 14:38:29.42 +100>,<MAYBRIDGE\nmr>,<NMR_250MHZ>,
      <abs ABSG = 5 
       data hash MD5: 32K
       CF D2 5A 5C 1D 58 96 AA 9D 94 4D C0 5B 1F C6 4D>)
$$ ##END=
$$ 
$$ hash MD5
$$ 0B 0C 38 AC C9 3C 38 C9 63 6A 68 CF BC 0A 55 AD
##$RELAX= 
##$RELAX= 
##$RELAX= 
##$RELAX= 
##$RELAX= 
##$RELAX= 
##$RELAX= 
$$ Bruker specific parameters
$$ --------------------------
##$DU= <C:\u>
##$EXPNO= 3770
##$NAME= <ADRS>
##$PROCNO= 1
##$TYPE= <nmr>
##$USER= <dgb>
##$AMP= (0..31)
100 100 100 100 100 100 100 100 100 100 100 100 100 100 100 100 100 100 
100 100 100 100 100 100 100 100 100 100 100 100 100 100 
##$AQSEQ= 0
##$AQ_mod= 3
##$AUNM= <au_zg>
##$AUTOPOS= <39 >
##$BF1= 250.13
##$BF2= 250.13
##$BF3= 250.13
##$BF4= 250.13
##$BF5= 500.13
##$BF6= 500.13
##$BF7= 500.13
##$BF8= 500.13
##$BYTORDA= 1
##$CFDGTYP= 0
##$CFRGTYP= 5
##$CHEMSTR= <none>
##$CNST= (0..31)
1 1 145 1 1 1 1 1 1 1 1 1 1 1 1 1 1 1 1 1 1 1 1 1 1 1 1 1 1 1 1 1 
##$CPDPRG= <>
##$CPDPRG1= <>
##$CPDPRG2= <>
##$CPDPRG3= <>
##$CPDPRG4= <mlev>
##$CPDPRG5= <mlev>
##$CPDPRG6= <mlev>
##$CPDPRG7= <mlev>
##$CPDPRG8= <mlev>
##$CPDPRGB= <>
##$CPDPRGT= <>
##$D= (0..31)
0 1 0 0 0 0 0 0 0 0.06 0 0 0 0 0 0 0.0002 0 0 0 0 0 0 0 0 0 0 0 0 0 0 
0 
##$DATE= 1146663478
##$DBL= (0..7)
120 120 120 120 120 120 120 120 
##$DBP= (0..7)
150 150 150 150 150 150 150 150 
##$DBP07= 0
##$DBPNAM0= <>
##$DBPNAM1= <>
##$DBPNAM2= <>
$$ [...]
##$SUBNAM7= <"">
##$SUBNAM8= <"">
##$SUBNAM9= <"">
##$SW= 20.6930455092707
##$SWIBOX= (0..15)
0 0 3 0 0 0 0 0 0 0 0 0 0 0 0 0 
##$SW_h= 5175.983436853
##$TD= 65536
##$TD0= 1
##$TE= 296.16
##$TE2= 300
##$TE3= 300
##$TEG= 300
##$TL= (0..7)
0 120 120 120 120 120 120 120 
##$TP= (0..7)
150 150 150 150 150 150 150 150 
##$TP07= 0
##$TPNAME0= <>
##$TPNAME1= <>
##$TPNAME2= <>
##$TPNAME3= <>
##$TPNAME4= <>
##$TPNAME5= <>
##$TPNAME6= <>
##$TPNAME7= <>
##$TPOAL= (0..7)
0.5 0.5 0.5 0.5 0.5 0.5 0.5 0.5 
##$TPOFFS= (0..7)
0 0 0 0 0 0 0 0 
##$TUNHIN= 0
##$TUNHOUT= 0
##$TUNXOUT= 0
##$USERA1= <user>
##$USERA2= <user>
##$USERA3= <user>
##$USERA4= <user>
##$USERA5= <user>
##$V9= 5
##$VALIST= <valist>
##$VCLIST= <CCCCCCCCCCCCCCC>
##$VD= 0
##$VDLIST= <DDDDDDDDDDDDDDD>
##$VPLIST= <PPPPPPPPPPPPPPP>
##$VTLIST= <TTTTTTTTTTTTTTT>
##$WBST= 1024
##$WBSW= 4
##$XGAIN= (0..3)
0 0 0 0 
##$XL= 0
##$YL= 0
##$YMAX_a= 320325
##$YMIN_a= -441942
##$ZGOPTNS= <>
##$ZL1= 120
##$ZL2= 120
##$ZL3= 120
##$ZL4= 120
##$ABSF1= 16.522
##$ABSF2= -4.171173
##$ABSG= 5
##$ABSL= 3
##$ALPHA= 0
##$AQORDER= 0
##$ASSFAC= 0
##$ASSFACI= 0
##$ASSFACX= 0
##$ASSWID= 0
##$AUNMP= <proc_1d>
##$AZFE= 0.1
##$AZFW= 0.1
##$BCFW= 0
##$BC_mod= 0
##$BYTORDP= 0
##$COROFFS= 0
##$CY= 12.5
##$DATMOD= 1
##$DC= 0
##$DFILT= <>
##$DTYPP= 0
##$F1P= 14.0000005364418
##$F2P= -0.99999901652339
##$FCOR= 0.5
##$FTSIZE= 32768
##$FT_mod= 6
##$GAMMA= 0
##$GB= 0
##$INTBC= 1
##$INTSCL= 1
##$ISEN= 128
##$LB= 0.3
##$LEV0= 0
##$LPBIN= 0
##$MAXI= 10000
##$MC2= 0
##$MEAN= 0
##$ME_mod= 0
##$MI= 0
##$NCOEF= 0
##$NC_proc= -5
##$NLEV= 6
##$NOISF1= 0
##$NOISF2= 0
##$NSP= 0
##$NTH_PI= 0
##$NZP= 0
##$OFFSET= 16.522
##$PC= 1
##$PHC0= 167.7075
##$PHC1= -1.831784
##$PH_mod= 1
##$PKNL= yes
##$PPARMOD= 0
##$PSCAL= 4
##$PSIGN= 0
##$REVERSE= no
##$SF= 250.13
##$SI= 32768
##$SIGF1= 0
##$SIGF2= 0
##$SINO= 400
##$SIOLD= 32768
##$SREGLST= <1H.DMSO>
##$SSB= 0
##$STSI= 32768
##$STSR= 0
##$SW_p= 5175.98343685301
##$SYMM= 0
##$S_DEV= 0
##$TDeff= 65536
##$TDoff= 0
##$TI= <Analysis number 999999
Compound Code 99
Book Reference 9
Project Code 9>
##$TILT= no
##$TM1= 0
##$TM2= 0
##$TOPLEV= 0
##$USERP1= <user>
##$USERP2= <user>
##$USERP3= <user>
##$USERP4= <user>
##$USERP5= <user>
##$WDW= 1
##$XDIM= 32768
##$YMAX_p= 366430183
##$YMIN_p= -1641199
$$ End of Bruker specific parameters
$$ ---------------------------------
##NTUPLES= NMR SPECTRUM
##VAR_NAME=  FREQUENCY,     SPECTRUM/REAL,   SPECTRUM/IMAG
##SYMBOL=    X,             R,               I
##VAR_TYPE=  INDEPENDENT,   DEPENDENT,       DEPENDENT
##VAR_FORM=  AFFN,          ASDF,            ASDF
##VAR_DIM=   32768,         32768,           32768
##UNITS=     HZ,            ARBITRARY UNITS, ARBITRARY UNITS
##FACTOR=    0.157963299565203, 1,           1
##FIRST=     4132.6476996994, 0,             0
##LAST=      -1043.33573715361, 0,           0
##MIN=       -1043.33573715361, -1641199,    0
##MAX=       4132.6476996994, 366430183,     0
$$ Real data points
##PAGE= N=1
##DATA TABLE= (X++(R..R)), XYDATA
$$ [...]
16088b41576L60557N2006j2635j04335k30697J5669J56511n4805j47849O9282
16078a37872j16218J78307M29306j7525l62245j1753J15861K5191J89998K2614
16068C15664j54300O4082k7510q570n275N7367p653j62858p0135P3972j13303
16057c8519j87172k0650P6618J65612J26293m5649j29047r5665j28979k745K05945
16046g3958J64566J88858j19910j79577J1206J56589k022k74882j48113Q5384
16036a91859l6337k33380q8110J22999p6787q469P7842L3060L09203J27531J65252
16025B00945J4315q3591L7267q3561m0810j09922K0620n4402R4684R6840J3521
16014A05906o5920K6742j99528j19285P4715M5501m1493j8963J15067O1582o7669
$$ y = [-241576, 118981, 170987, 158352, 54017, -176680, -161011, -4500, -59305, -207154, -137872, -254090, -75783, 353523, 335998, -26247, -38000, 77861, 103052, 293050, 315664, 161364, 225446, 197936, 189366, 184091, 241458, 233805, 70947, 812, 74784, -38519, -225691, -246341, -169723, -4111, 122182, 76533, -52514, -148179, -277158, -279903, -73958, 90608, 279466, 159556, -20021, -8815, 147774, 145752, -129130, -277243, -191859, -228196, -461576, -549686, -426687, -503474, -511943, -434101, -401041, -91838, 35693, 200945, 215260, 131669, 168936, 85375, 44565, -65357, -44737, -99139, -4455, 92385, 105906, 39986, 66728, -132800, -252085, -177370, -131869, -173362, -192325, -77258, -15676, -83345]
16003h3345K8835K583K16327O1687p4034p4677M1231J96597j48295j82619j52984
15992a68694m350J13758J00558J57295l9587j31815J66961n5533m5897M60N5278
15981A48434O0621j79939o7776K0630J36262J98465m9891m2495R6754L2804j90766
15970A63103j35938m0844J46767J42136K15659r0539l23569j004m2120j2820j03808
15959h2977r92Q3370O1365k30149J73583M3497k26026j47511J40482n0740P5177
15948a60921J96414M4488K7091L7450p0331j57917R872k4185m9147n473N3586
15937i9073J78169o7859P5682R5002k62857j32672p3626J08998J99894O3455J31182
15926B16295j43289j94920p7947N8304l9646J6999p2967K5731L1395N8301Q428
$$ y = [-83345, -54510, -51927, 164400, 226087, 152053, 77376, 118607, 315204, 166909, -15710, -168694, -173044, -59286, 41272, 198567, 158980, 27165, 194126, 138593, 92696, 93156, 148434, 209055, 29116, -38660, -18030, 118232, 316697, 266806, 224311, 321065, 353869, 163103, 27165, -13679, 133088, 275224, 490883, 400344, 76775, 75771, 33651, 20831, -82977, -83969, -599, 60766, -169383, 4200, 47697, -178329, -325840, -185358, -236098, -160921, 35493, 79981, 107072, 144522, 74191, -83726, -73854, -98039, -147186, -152659, -99073, 79096, 11237, 86919, 181921, -80936, -213608, -287234, -178236, 21658, 85113, 216295, 73006, -121914, -199861, -141557, -181203, -164204, -237171, -211440, -180045, -121744, -113316]
15915a13316n7510j43030R5221J58219j38256k9683K08299R7181n5093j58189
15905a36157j93142j13795p3081j01962q1968K07786K20361J66855R1281R1235
15895G7413J97540J584p3712r7409j25509L6382R2147n3559j80869Q5051J09687
15884F8746L9609p2213j76054J85562j68098q3424J49975p22m6797J50129j3103
15873C3610k15152J38581J71944J1216j92986p6783K5547J25836N21899j10631
15863D33081l29709J3650Q3642J53443N5961k42644R9375j21424j47014j03846
15853a05485J57908J97531J92951j35347n7952o6269q2321j99985K5066L4402
15843c9501J29641l8607K15456k54755l06156Q2389p1034k723O2428p4337O5938
$$ y = [-113316, -170826, -313856, -218635, -60416, -198672, -228355, -20056, 77125, 22032, -136157, -329299, -443094, -516175, -618137, -700105, -492319, -271958, -105103, -13822, 77413, 274953, 276537, 202825, 105416, -20093, 16289, 108436, 54877, -125992, -40941, 68746, 108355, 36142, -139912, 45650, -122448, -205872, -55897, -56619, -103416, 46713, 33610, -181542, -42961, 128983, 140199, -52787, -129570, -104023, 21813, 543712, 433081, 103372, 117022, 200664, 354107, 410068, 167424, 266799, 145375, -1639, -105485, 52423, 249954, 442905, 307558, 249606, 183337, 101016, -98969, -73903, -39501, 90140, 51533, 266989, 12234, -293922, -211533, -282567, -285290, -222862, -297199, -231261]
15832b31261J62887m8303K2992j18657K275M86J15467J13470K0639K5916J43918
15821B09829k0029R853q7104j2229J14239K39174j63323o1989J05933J28866J9976
15810D83196k30557o5819j40400J66332J4215j20606J3978p5739j13408M4262
15800b4546J27832j11641j25598j04596r5452Q833J53055J67093o4436K6124o8258
15789a11590n3024R9959J18710R534Q2434j17404k70724M161N5903N3270k303
15778a31074p9245j16114o2971L1931j14008O6247L94087J93638j86968j34412
15768a38889R3905R738j03060j87525J24201n158q3556J28975J38444K60549K93627
15757E31251q1948o5720o9036j75346k52378j302N776R8501o869J09642m5288
$$ y = [-231261, -68374, -116677, -93685, -212342, -210067, -209581, -94114, 19356, 39995, 65911, 209829, 189800, 199653, 112549, 100320, 214559, 453733, 290410, 228421, 334354, 463220, 483196, 252639, 186820, 46420, 212752, 226967, 106361, 120339, 44600, -68808, -24546, 103286, -8355, -133953, -238549, -334001, -325168, -172113, -5020, -69456, -43332, -111590, -164614, -64655, 54055, 63589, 146023, 28619, -242105, -237944, -182041, -128771, -131074, -210319, -326433, -389404, -357473, -471481, -405234, -11147, 182491, -4477, -138889, -44984, -35246, -138306, -325831, -201630, -206788, -290344, -161369, -22925, 237624, 531251, 449303, 383583, 314547, 139201, -113177, -114479, -108703, -10202, -17071, 92571, 47283]
15746D7283j5142J6942l5368L2328K1759j02642q3604K38355J08957j22287j84209
15735g7628O2376O5385k23828p7591o4889k4264K464p9994m5542J40859J68611
15724a54041J54684N5225m7269j18657p1360j17442J63658m2616K5872j04466
15714b56412m8080J00847J81784K14412J13565j33657k04227k7270O0754j11628
15704a09912L5661J5618R8902J33992r8628k02422m5259j31265J577J76294q718
15693a34160j52541j52369J68134J57911J9498o5108j3907J01390j13133p479
15683a91764K39674M9646k9557j39226j81061Q2119K04219j03582q8764K8398
15673a29898J76953J37614j11470m8172j67626o1826L9357O3291j64286k8194
$$ y = [47283, 32141, 49083, 13715, 46043, 67802, -34840, -118444, 119911, 228868, 106581, -77628, -15252, 50133, -173695, -251286, -316175, -340439, -337975, -417969, -463511, -322652, -154041, 643, 55868, 8599, -110058, -181418, -298860, -135202, -177818, -151946, -256412, -304492, -203645, -21861, 192551, 306116, 172459, -31768, -59038, 1716, -109912, -74251, -58633, 40269, 174261, 75633, -126789, -172048, -303313, -301736, -125442, -134160, -286701, -439070, -270936, -113025, -93527, -158635, -172542, -71152, -184285, -191764, 47910, 97556, 67999, -71227, -252288, -170169, 34050, -69532, -158296, -129898, 47055, 184669, 73199, 25027, -142599, -204425, -165068, -101777, -266063, -294257]
15663b94257J07480M0416k44479J3831O7337R335P2306N2309O2584j09246l9000
15652b61384K1734J35951J48219j35289j42283N4861K19062K8415j24022j5621
15642g0357J55511R2062M3515k1503q9084j05113o9332O0934L1769o5908j50644
15631a88150j89810K19878J20631q5631J94119J20221N542m9447l0241o6371p9070
15620b8329q7345P0123M0982M6504K05158K573j42541L2198J49257k02480k13239
15609a27139J4546J34236K49644J32047j69754k60350m6525J13338N7837M1325
15599A39205l7053k8791J99515j2167j97492k03423J82507K54943k745j35226
15589A59273k3451O955O3195j92059j00602K30117j21420j84225J25058K62605
$$ y = [-294257, -186777, -146361, -390840, -377009, -309672, -300337, -228031, -175722, -113138, -222384, -261384, -239650, -103699, 44520, -90769, -233052, -178191, 40871, 69286, -54736, -70357, 85154, 177216, 220731, 199228, 110144, 5031, -64301, -3367, 28402, -37506, -188150, -377960, -158082, -37451, -123082, 71037, 191258, 196800, 147353, 117112, 50741, -28329, -115674, -45551, -4569, 41935, 247093, 249666, 107125, 139323, 288580, 86100, -127139, -112593, 21643, 271287, 403334, 233580, -26770, -73295, 40043, 97880, 139205, 102152, 73361, 272876, 260709, 63217, -140206, 42301, 297244, 294499, 159273, 135822, 142777, 205972, 13913, -86689, 143428, 22008, -162217, -37159, 225446]
15579B25446k10011p4549m5123o7952J12115n7375J65289K08481j80953j07239
15569c1871o7821k6301j5408m1966K236K54045J14917r5611J1212k0458l779L0927
15557A10122j43206K3878J70055N8888p2710j96497j2029p930K02340j8707l949
15546A10255l7313n8466J14400J16842j39342o6508r7712K32121o8548l2293J49679
15535B23115N1573j88366k75884l0011J06637J31999o2403o8869J63715P6899
15525A28405P8872J022p6628k02883q2463j04519L5707K47103O1996J53337r5580
15514A44369j36161r6809q7338J41899o9731j84544N9478K28822K03550J12931
15504C16466l0478r9051j39090k43576m1209L6381r5261N9714K2169P124K06526
$$ y = [225446, 15435, -59114, -104237, -172189, -60074, -117449, 47840, 256321, 75368, -31871, -99692, -125993, -141401, -183367, -181131, 72914, 187831, 92220, 103432, 82974, 79195, 110122, -33084, -9206, 160849, 219737, 147027, -49470, -61499, -69429, 132911, 114204, 110255, 72942, 14476, 128876, 245718, 106376, 39868, -57844, 174277, 105729, 73436, 223115, 274688, 86322, -189562, -219573, -112936, 19063, -43340, -112209, 51506, 128405, 207277, 208299, 131671, -71212, -153675, -258194, -222487, 24616, 86612, 239949, 144369, 8208, -88601, -175939, -34040, -103771, -288315, -228837, -15, 203535, 316466, 285988, 186937, 47847, -195729, -236938, -200557, -295818, -236104, -213935, -206811, -285]
15493b85O2177K6532p3810m8652N63j54930j57248K35799L7775J66426n1744k14430
15481a71827J17801m0057Q492L818r6876j6188K2774J97757K3817q1129j75070
15470b06688j37992j306K71365J06796j35057p3031J9818o3882J17500M0407J04552
15459D2482o5115J04734J86865j63991n1257m8050n8620j35011L0098K26716L5281
15448A04132o0141J97711P9371L8224j50121j2066m9738j36002o0667J30215J8426
15437I9344j51901n9189j1118p1664n6637o875J995K07214M3524k0186P6980m6213
15425E274r0032K8476o2313j24287K16888J53177j60965q0381K8323J09975R9528
15414A23663j40448P4675J20144K6789k84975k29184J29344O7327j33167R4426
$$ y = [-285, 61892, 88424, 14614, -34038, -33475, -188405, -345653, -109854, -72079, 94347, 42603, -171827, -54026, -94083, -85591, -81773, -178649, -194837, -172063, 25694, 49511, -31618, -206688, -344680, -345986, -74621, 32175, -102882, -175913, -156095, -219977, -102477, -62070, 42482, -22633, 82101, 268966, 104975, 53718, 5668, -52952, -187963, -157865, 68851, 104132, 43991, 241702, 321073, 359297, 209176, 197110, 147372, 11370, -49297, 80918, 99344, -52557, -111746, -122864, -194528, -251165, -258040, -256045, -48831, -5307, -25493, 51487, 5274, -84758, -56282, -118595, -242882, -25994, 127183, -33782, -114163, -85840, 24135, 123663, -16785, 57890, 178034, 204823, -80152, -309336, -179992, -112665, -245832, -151406]
15404a51406l5184M7173j04409p4901J02337K81885p0312j9096J24213q3530J9215
15393C5985K1146k3356j05898J55424K9020K21243p497k17657p9147M774k57872
15382b23835l4139K57838J04085N9031r6673m4938q1027N3141J08779l1058j3037
15371E8167o3859q097o348K10482k8860j70940k42669N2406K54548q4530j94480
15360b24180k64687J85944K89906J16561K72423M8807j808p1599o0607j66612
15350A24148J0986o0812p0125J59158J08986j19808r7955J7166j42795p5308q4803
15339b31162K8088J24346L17572M2409o1898j22004j81251j62399J72776N3164
15329b0359k35381J66981J58658R8354J83394l1067j40907k59720Q4202J84894
$$ y = [-151406, -186590, -139417, -243826, -318727, -216390, 65495, -4817, -23913, 100300, 16770, 35985, 57131, 33775, -72123, 83301, 112321, 333564, 326067, 108410, 29263, 34037, -223835, -257974, -136, 103949, 162980, 66307, 21369, -59658, -6517, 102262, 71204, 58167, -5692, -13789, -20137, 190345, 161485, -9455, -252124, -199718, 54830, -29700, -224180, -488867, -302923, -13017, 103544, 375967, 424774, 422966, 351367, 290760, 124148, 135134, 74322, 4197, 163355, 272341, 152533, 54578, 71744, -71051, -146359, -231162, -203074, -78728, 238844, 281253, 219355, 97351, -83900, -246299, -73523, -20359, -255740, -88759, 69899, 168253, 351647, 320580, 179673, -80047, 4155, 189049]
15319A89049J18110o1739k7335j93716k06033P0791J54039Q93K291k261N2609
15308I6698n4240q4646j26367M164K57999Q1423l21673j24463O9529j42742R8917
15297b45401K01300Q5619N7671n300n2134k7498O4813m7774j20145j0325R5666
15286c508n7031k52330j90981q5881L19044J88899K4951K07792Q3756k18704K5917
15275D1924J19048k009l4013j08437k49575l6056q1106k9920Q918J73687j5445
15264b12984J11083O3909l329j08793r7983J65951r9405r6185J64531J35348j402
15253B0741j05084r1457J53109J33329p116o811m40K00653J76943j25291j08729
15242B39847m5575p8371r8193j18202M0615j32954o7511k4573L78831O4251k7080
$$ y = [189049, 307159, 245420, 218085, 24369, -181664, -110873, 43166, 44059, 46350, 44089, 96698, 42458, -42188, -168555, -164391, 93608, 175031, -146642, -271105, -201576, -344318, -245401, -44101, 41518, 99189, 93889, 41755, 14257, 79070, 31296, -88849, -99174, -3508, -60539, -312869, -503850, -589731, -270687, -81788, -56837, 150955, 234711, 16007, 41924, 160972, 158963, 124950, 16513, -233062, -269118, -350224, -380144, -371226, -197539, -212984, -101901, -37992, -41321, -150114, -248097, -82146, -181551, -277736, -113205, 22143, 20741, -84343, -175800, -22691, 110638, 103522, 96711, 96271, 296924, 473867, 348576, 239847, 194272, 115901, 17708, -100494, -59879, -192833, -260344, -284917, 93914, 158165, 131085]
15231A31085Q9316P2719k28822j61174o6801n665J24654K08275P9470N1520j07671
15220A86906O7836K19334j5765j32266n6830J1704J83826j52347l9993k8599L7409
15209B81215L993l0772j08424P3184j4263j772r1428k27027p7270K5880P7409
15198h9275O1220P3446m1421q4242j47468J9690l1990O470R8899P0624o5612p3082
15186b02741M6811j25798j02618Q0758R8901m932O8628J10248j57544j74282K17616
15175a44953K21496k4739o8904j46420j66365M6940J50680k8539j53763j02170
15165d16737O5329L18113K17939r143N5634O8076j73644q7443L7184j27122J56184
15154A04370k6852r6239l3864J3352l1513n9059j03814o1171N0373N1215J11516
$$ y = [131085, 220401, 293120, 64298, -96876, -163677, -169342, -44688, 163587, 243057, 294577, 186906, 254742, 474076, 458311, 326045, 269215, 280919, 464745, 312398, 272405, 243806, 281215, 285208, 254436, 146012, 219196, 204933, 203161, 111733, -115294, -192564, -166684, -89275, -28055, 45391, 3970, -80272, -227740, -208050, -240040, -233570, -134671, -64047, -129659, -202741, -155930, -281728, -384346, -303588, -204687, -209619, -140991, -30743, -188287, -362569, -144953, 76543, 51804, -17100, -163520, -329885, -282945, -132265, -160804, -314567, -416737, -351408, -33295, 184644, 175501, 231135, 299211, 125567, 38124, 75308, -51814, 104370, 77518, -18721, -52585, -39233, -70746, -129805, -233619, -294790, -244417, -193202, -81686]
15143h1686Q2710M5835k7262J74047n7453m4004R5515K1268j6514m4433k13230
15132f5207J54005J0333P5064m6835o5199r1860L9142J3848K59018J7041k29424
15121F9926j69780r5679J57009K17014j98639j00328j60131K9097N9111R8774
15111i3626J39057j05729O1247K29936P9838k2820K7131k8946J69789J06199j77000
15100C85076j14861r0116k79371k3456J54429j27248K9049R9822P7073j80402
15090g0005j77380m586L00864P2091J51216Q0335k97657K7462n4031L1006L4862
15079I4177Q1022Q4962j19232j18004m5568m3543j08750p8898M2961M7711J861
15068a61301K2526J00658J98008K5986j63109l450o5059L0136l1169p4432L4145
$$ y = [-81686, 1024, 46859, 19597, 193644, 136191, 92187, 187702, 208970, 192456, 148023, -65207, 88798, 99131, 174195, 127360, 62161, -29699, 9443, 23291, 282309, 299350, 69926, -99854, -195533, -38524, 178490, -20149, -120477, -280608, -251511, -192400, -93626, 45431, -60298, 949, 230885, 310723, 287903, 315034, 286088, 455877, 562076, 385076, 270215, 180099, -99272, -122728, 31701, -95547, -66498, 33324, 110397, -70005, -247385, -251971, 48893, 120984, 272200, 352535, 54878, 82340, 28309, 59315, 94177, 175199, 260161, 140929, 22925, -22643, -66186, -174936, -253834, -210873, -163162, -161301, -138775, -38117, 159891, 185877, 22768, 19318, -45741, -15605, -46774, -121206, -87061]
15057h7061J35277K08793j62897j27922j15650K993l6480q5960J04895J44514
15047a9498J2877O6770J31411r5181p4378l4131j6425m2996j78321K3676q649
15036b34845J66267J86206j1771m0318k5439r391k30255R0582K18467J84112R0505
15025C84120k35602k78107j58134j75385J8358J19007J84085J26331J091l5804
15015e0040q780j8616m3198j7432J78441J54472m6207m0406j87657R0290m2634
15004c1767L4501J26080l3971m6347O0440M9235j44796J08046j55867j10204J13004
14993c1646J48341j8348k84121k62953j8220J73501J04415J85121K29113j45193
14983H0010j6972P2273P3005n7209k42845N3586Q1959J51975J82853n3771j43915
$$ y = [-87061, 48216, 257009, 94112, -33810, -149460, -146467, -182947, -268907, -164012, -19498, -6621, 60149, 191560, 96379, 22001, -12130, -28555, -71551, -249872, -226196, -234845, -68578, 117628, 105857, 65539, 40100, 30709, -199546, -108964, 109503, 293615, 384120, 148518, -129589, -287723, -463108, -444750, -325743, -141658, -15327, -14236, -50040, -58820, -77436, -120634, -138066, 40375, 194847, 148640, 108234, -79423, 10867, -31767, 2734, 128814, 94843, 48496, 108936, 158171, 13375, 121421, -34446, -144650, -31646, 116695, 98347, -185774, -448727, -466947, -293446, -189031, -3910, 225203, 80010, 63038, 135311, 208316, 151107, -91738, -38152, 43807, 195782, 378635, 324864, 180949]
14972A80949p7921J69034K22859r5800j48142j7685l4850N7802r9960M3673J6782
14961B16741j09157j93130j73459L2402l0702j6534J63835L80578J66319k34500
14951B02393Q0277J54918j1122q9112j76835J2875M9480J0202N5356k69126j1330
14940G976K54764j941j05200k2002r282k12442j39648O2158J98734P1187K4102
14929A28406p3988Q6577J19939k0608l25257j61165J03007k8476j92803p1722
14919d36090J25541J28910M7112K5724o5139K51360J90953k1720q7832K33640
14909C92459Q9304k12154j84247m356r3704l9986J23770J86396j48896j81847
14899g3261n0330m1946R4717L32452N4131l0440j05431j72825L4697l9430o9016
$$ y = [180949, 103028, 272062, 494921, 399121, 250979, 233294, 198444, 256246, 156286, 199959, 216741, 107584, -85546, -259005, -226603, -257305, -273839, -110004, 270574, 436893, 202393, 282670, 437588, 426466, 337354, 160519, 173394, 222874, 233076, 288432, 19306, 7976, 262740, 260799, 155599, 133597, 124315, -88127, -227775, -165617, 33117, 104304, 128406, 54418, 140995, 260934, 240326, -84931, -246096, -143089, -171565, -364368, -436090, -310549, -181639, -134527, -108803, -173942, 77418, 268371, 246651, 158819, 392459, 481763, 269609, 85362, 81006, -12698, -52684, 71086, 257482, 108586, -73261, -123591, -165537, -70820, 261632, 315763, 285323, 179892, 7067, 41764, 2334, -66682]
14888f6682p5545l5983j19028K6086l2085m5226J33751Q0059K7487J72004J33085
14877A97923k5955Q8586Q08J46594M798j54305j13016J28920R8368l8870k5073
14866C08778O7078P0977j595k21344J13535K07800L3338j67757j08249k39580
14856F2981j30208l3265j2883K5662J74640o8024M4973J31544j95586j39933K02159
14845F2060N0182o3892Q6159j10164p4650j57794k47849N5433K68191R6816j5503
14834e1011j86427K7948J32303J73545J0891p8879k6857L7739j5683J39075K06387
14823C69031j23314j59784k21743j60831m9090J89889K90777k15n378j08181N6773
14812G7934J503j0694K77289j868j07879J74955j31780J54635J62478Q5255j26004
$$ y = [-66682, -142227, -178210, -297238, -271152, -303237, -348463, -214712, -134653, -107166, 64838, 197923, 171968, 260554, 261362, 407956, 412754, 258449, 145433, 274353, 372721, 333851, 308778, 375856, 446833, 445238, 223894, 337429, 545229, 578567, 410810, 302561, 62981, -67227, -100492, -113375, -87713, 86927, 18903, 63876, 195420, -166, -140099, 62060, 112242, 48350, 134509, 24345, -50305, -208099, -455948, -400515, -132324, -35508, -51011, -237438, -209490, -77187, 96358, 107249, 28370, 1513, 39252, 23569, 162644, 369031, 245717, 85933, -135810, -296641, -345731, -155842, 134935, 134720, 129342, 21161, 77934, 79437, 68743, 346032, 344164, 236285, 411240, 279460, 434095, 596573, 681828, 555824]
14801E55824M5925j77758k15527m4805j19728j5357K8583M4577j22064q9806P7255
14790c2881K02293j16982k1486l6225M421n6213O544J47023R5102m0249j3017
14779A38330k21132j40107L2396J54528J27675l3544k2705N4469J17876j32081
14769G5705N3262k15624o7090J30433R2175p0537J08575m0291l6533M955j05027
14758f9997o920j8375o2645l672K01084N5102m5254q078K6203o0501J58060J92419
14746C57426J22636j68444j58587M8960j70146N1364K04036Q1011j11699r1939
14736A64618n2840j30084J65994L49539j15484j60436j12667j08693J18492P7230
14726A95669Q8973k7776j23009j18194J0580K14301J66629Q8370l32504r5573
$$ y = [555824, 601749, 423991, 208464, 163659, 43931, 28574, 57157, 101734, -20330, -110136, -32881, 169412, 52430, 30944, -5281, -860, -57073, -50529, 96494, 191596, 151347, 138330, -82802, -222909, -190513, -35985, 91690, 58146, 35441, 89910, 207786, 75705, 128967, -86657, -153747, -23314, 68861, -1676, 106899, 66608, 30075, 35030, -69997, -76917, -95292, -157937, -161609, 39475, 94577, 49323, 41245, 67448, 6947, 165007, 357426, 480062, 311618, 153031, 201991, 31845, 83209, 287245, 368256, 256557, 164618, 111778, -18306, 147688, 497227, 381743, 221307, 108640, -53, 118439, 195669, 284642, 256866, 133857, 15663, 26243, 240544, 407173, 495543, 163039, 67466]
14716F7466J83234L39613o4110j03824j31370k04574L2339J06811N3500R8227
14706C77312N3691o3277p4174O0632n8786k8516p5010j3336K1312K9783M9628
14695B79259o1578L451J2983J65579p3139k82648n6661O862J77361M971j88203
14684a1763m0830J02216P0397p3007M2777O7704K1667o3098M3219J17667R1090
14673C68039j38929k18629K7390Q6211Q4775R5787n691M847L6165j51469j61525
14662B6971m0597K4334K1097J39469j7367L55094J17842k40778j51589m9316J50399
14651C35559P6383j11219o8270k4360l0283k1351Q5845J11964J11560l51662O1694
14640A75860J9327l9433J86810P9630M6574j32652j90542j51136J25272M8171
$$ y = [67466, 250700, 590313, 526203, 422379, 291009, 86435, 118774, 225585, 279085, 377312, 431003, 367726, 293552, 354184, 295398, 266882, 191872, 178536, 199848, 229631, 279259, 217681, 221132, 234115, 399694, 326555, 43907, -12754, -5892, 171469, 176440, -11763, -52593, 49623, 120020, 47013, 89790, 157494, 179161, 116063, 159282, 276949, 368039, 229110, 10481, 37871, 124082, 208857, 304644, 298953, 303800, 339965, 188496, 26971, -13626, 10708, 31805, 171274, 153907, 509001, 626843, 386065, 234476, 185160, 335559, 411942, 300723, 232453, 208093, 177810, 156459, 242304, 354268, 465828, 114166, 175860, 195187, 155754, 342564, 422194, 468768, 336116, 145574, -5562, 119710, 167881]
14630A67881J03054o7739l5560K2254O14K369R2960J02668j31118j09690L6763
14619A84456k3734o8987Q3758n3291k08222K6012n0971m2292P7893J45966O7373
14608A37961j77208m5328j8032R5961j08793q3702K10947K30285N6030N3840p2300
14597B79661j18433k87656j49282J0029O0990J11458N6324j63971J7418J23789
14587e9673j92548L6941L65031J21395k51420j10435j461K00632J09150K22551
14577D40163m4243k34791k75034J36195J00946J09656j11495O2197O2016k7103
14567B18507j32403k27530K8116K88466j28836j48985O8752K2885O0294J00142
14557A49408j03023j2068O2858K03615Q4915j01598O6051J20681n786n4413o0920
$$ y = [167881, 270935, 203196, 167636, 189890, 190504, 192873, 285833, 388501, 257383, 147693, 184456, 160722, 91735, 175493, 122202, -86020, -60008, -110979, -153271, -75378, 70588, 137961, -39247, -84575, -102607, -6646, -115439, -199141, 11806, 242091, 298121, 351961, 279661, 161228, -126428, -275710, -265681, -204691, -93233, -36909, -200880, -183462, -59673, -252221, -215280, 149751, 271146, 19726, -90709, -92170, 108462, 217612, 440163, 395920, 161129, -113905, 22290, 123236, 232892, 121397, 183594, 245610, 218507, 86104, -141426, -113310, 175156, 46320, -102665, -33913, -11028, 49266, 149408, 46385, 34317, 97175, 300790, 385705, 284107, 350158, 470839, 465053, 410640, 349720]
14546C49720k44186j36694k5832j17879m56J87596R5862j49587L032J06345K74880
14535C42801p5520j26657N9947m9480j13880j09826o7042j25719K22506K20719
14525A77849J8819k434j3129q1957q9796P9142L12811j76663k47489K9107O3063
14514F9323n2934J98233j82988j88577L2763J17318J15189N2045k08173j97562
14504b45363j7804M05664J72069L3666L9533k3428J8401n8050J1560j62863k3171
14493A50214j25992j6456o1679l0087R1410J70201K32835o6225P5324j58127j64047
14482I7371q6512R5121K29426J06130k7004J46196n9241j49883l5328n1693p1722
14471A92861m9717j20982k86735J49637J64633J38131K5843q2867l5144K00082
$$ y = [349720, 105534, -31160, -56992, -174871, -175327, 12269, 108131, -41456, -38424, 67921, 342801, 267281, 140624, 200571, 151091, 37211, -72615, -139657, -265376, -42870, 177849, 196668, 194234, 181105, 99148, 9352, 88494, 401305, 224642, -22847, 6260, 69323, 16389, 214622, 31634, -156943, -124180, -6862, 108327, 160372, -47801, -245363, -263167, 142497, 314566, 348232, 387765, 364337, 382738, 324688, 336248, 173385, 150214, 24222, 7766, -53913, -84000, 7410, 177611, 410446, 344221, 419545, 261418, 97371, 10859, 105980, 335406, 441536, 414532, 560728, 501487, 351604, 316276, 264583, 192861, 143144, 22162, -264573, -114936, 49697, 187828, 213671, 130804, 95660, 295742]
14461B95742M633j15205j12673l8552J2083Q5601Q6946M5812O8859J5347Q7245
14450D35838O952l2187J0101n1680J24528O2294k13053m33j10583l520o9371j53755
14438E131M49J19525L4575j00736J18172J93433J05458j22894M344L5587L5404
14427D28448R7952k77304j02937R6016p9443o1170J64752N5749R4401j25015k2958
14416B68491n0881j09577j63490J40669J90151k80904k463L9122N564J58650k5500
14405A69832J6046j76635k0745J5066J53444J71769m9486p4453Q482j09423R479
14394A13376K19755Q996l8283q1671j53776j02153J06620r497j35553O2770K73679
14383B64263J56148M91k83229k18240L2829j6171r4472q1426L17014J71734K9706
$$ y = [295742, 300375, 185170, 72497, 33945, 46028, 131629, 218575, 264387, 333246, 348593, 435838, 442790, 410603, 420704, 369024, 493552, 555846, 342793, 342360, 231777, 228257, 158886, 5131, 5580, 125105, 159680, 58944, 177116, 370549, 476007, 353113, 357457, 393044, 428448, 526400, 249096, 146159, 242175, 162732, 101562, 266314, 322063, 416464, 291449, 268491, 217610, 108033, -55457, 85212, 275363, -5541, -8004, 31118, 36682, 195332, 169832, 185878, 9243, -11502, 3564, 157008, 328777, 279291, 204838, 213320, 103897, 113376, 333131, 342127, 303844, 222173, 68397, -33756, 72864, 63367, -72186, -9416, 264263, 420411, 420902, 137673, -80567, -47738, -63909, -158381, -239807, 77207, 248941, 278647]
14372B78647j05251l9100R3096j3621j2541q9374J02736o759N3478n2308o6331
14361A42672N4378o2628J5625n2713r0869J71811J11685K9510P1852J57184J05174
14350F53681k26407k12056M765L1772r0655j9259r2575P2123r8883o9779J77801
14339A30528J51327j44714j79065j2098K28870L7860J19160k04838k73925o3851
14329b10746n2745M1998Q2144K27129O0243k26185l0046j6405J89978J71732j33155
14318A03942r06K1276o4636l8764K53550J91894R8377p6258j803j49602M0570
14307C77640L4379k0289J76379J046p3028k25113k41897J59197P6668l6171j15051
14296A13760j10812J52443K78110J16200j19194r9020j14076Q9247o3947j8947
$$ y = [278647, 173396, 134296, 227392, 213771, 201230, 111856, 214592, 207833, 261311, 209003, 142672, 197050, 134422, 150047, 97334, 6465, 178276, 289961, 319471, 391323, 548507, 653681, 427274, 215218, 219983, 251755, 161100, 141841, 49266, 121389, 22506, -47273, 130528, 281855, 137141, -41924, -54022, 174848, 212708, 331868, 127030, -146895, -210746, -263491, -221493, -139349, 87780, 148023, -78162, -108208, -124613, 65365, 237097, 103942, 103036, 124312, 59676, 20912, 274462, 466356, 564733, 488475, 486672, 337070, 377640, 412019, 391730, 568109, 569155, 496127, 271014, 29117, 188314, 264982, 228811, 113760, 2948, 155391, 433501, 549701, 430507, 331487, 217411, 306658, 242711, 223764]
14286B23764j9704J07139K23021L7101q5728K0189O4185m4882O972o0875j90704
14275B80478j70677Q9951m5734P5036l0719j4031k20962Q8868K66601R7455k55676
14264A60590q2149P8138j48187P5690l7936K4396M9085p2199j3562O5865k32548
14253a32817J07301L42192R2002p2108J9138j24313k380q041Q5802n7884j0694
14242B38198L056j30769k424K4723p9738r7142J38259K52954m3346j82694R3041
14231B14118J8206r8638k6650Q1271P5639p8814N7885q6090j85546j27000J30680
14220b4939P2998J37656r7071j04757q228J15855Q3182J7908j564m69m8606j52851
14208a0886J91608M4018j0394l0293J34045J33984O2642k46789j56496N1456J09892
$$ y = [223764, 204060, 311199, 534220, 571321, 485593, 505782, 569967, 525085, 532057, 471182, 280478, 109801, 199752, 154018, 229054, 198335, 184304, -36658, 52210, 318811, 416266, 160590, 78441, 156579, 8392, 84082, 46146, 70542, 119627, 47428, 33866, 99731, -132817, -25516, 316676, 408678, 336570, 355708, 231395, 229015, 220974, 306776, 248892, 238198, 241254, 110485, 108061, 132784, 53046, -44096, 94163, 347117, 303771, 121077, 214118, 232324, 133686, 107036, 188307, 263946, 185132, 243017, 156927, -28619, -155619, -24939, 48059, 185715, 88644, -16113, -24341, 91514, 174696, 192604, 191040, 190571, 141965, -10886, 180722, 224740, 214346, 184053, 318098, 452082, 514724, 267935, 111439, 162895, 272787]
14197B72787P8967r3980O5113P004J16313Q8124j02627j55332k4107j06443J8872
14186A64691Q3289l5755j42869J31078J38111J54713M4980J59372m1795r1223
14176E64592R8772o0842j29146l2212J0886j59578q4466l5208j6043K69007J66180
14165E91942j62550k02975j63403R3161J20333p2318k66465q3275J6060J26799
14155b691J77263K88024J47500j05631K182j25423r5777n1580J1933J8623n3721
14144B10702l9532J02330O58J7255k6926m7901J1666P4711r2451K15101J45126
14133E70739r9511k20562J16462K32199Q9548j14245j20168k21896K93278K34794
14123G60638k15100k32276j3349o4425J7808L021j21417M9871P4017J1015k3114
$$ y = [272787, 351754, 257774, 322887, 329891, 446204, 534328, 431701, 276369, 252262, 145819, 164691, 247980, 212225, 69356, 200434, 338545, 493258, 538238, 697610, 655815, 564592, 663364, 602522, 473376, 441164, 452050, 292472, 208006, 172798, 156755, 425762, 591942, 429392, 226417, 63014, 156175, 276508, 204190, -62275, -145550, -129490, -2691, 174572, 462596, 610096, 504465, 506647, 381224, 285447, 233867, 245800, 264423, 210702, 171170, 273500, 274158, 291413, 264487, 216586, 228252, 302963, 210512, 425613, 570739, 471228, 250666, 367128, 599327, 688875, 574630, 454462, 232566, 525844, 760638, 545538, 313262, 299913, 235488, 253296, 256317, 134900, 184771, 258788, 269803, 246689]
14112B46689J2388k53962N5881K21235R0627K6612n2862j51001j55445m3995J42263
14101A38430L02346J66765K19888j22348m4441j47221j32325p1761j14043J35353
14091C30643q7350Q7281r124O1183J54381j4425o5526J91344L8029j29591p6655
14080D80190R4994J4889o475l2339j29354k1755K8556J16478J86185K10586N9744
14069A001699p7954j79773j9064M0923j66205k10779J2687R1152j2838L2725K9044
14058E41617M8532n9242j09620j2781O1621J52946o4667m900L5208M2117r5915
14047E34916k87175j80161L06301J68636k1687j07781J022J78091M6109k55354
14037C82917k07033J03749J10390m2497m303r0262j9313J34482K05574R0698j21115
$$ y = [246689, 259077, 5115, 60996, 282231, 372858, 399470, 346608, 195607, 40162, -3833, 138430, 440776, 607541, 827429, 705081, 660640, 513419, 381094, 309333, 195290, 330643, 243293, 330574, 321450, 382633, 537014, 522589, 457063, 648407, 686436, 556845, 480190, 575184, 590073, 583598, 551259, 421905, 400150, 428706, 545184, 731369, 941955, 1001699, 923745, 743972, 724908, 765831, 599626, 388847, 401534, 492686, 479848, 512573, 541617, 590149, 530907, 421287, 408506, 470127, 623073, 558406, 553506, 588714, 630831, 534916, 247741, 67580, 373881, 542517, 520830, 413049, 414071, 592162, 638271, 382917, 175884, 279633, 390023, 347526, 343223, 252961, 233648, 368130, 573704, 664402, 543287]
14026E43287p4953J13208o0480j88974k61060L12096M46229r7428q5307K1641
14016F68259q8079k48334r7648j1737N6897j49562K830k0605J35644N9090M2264
14005C49019J02386L5033R0512J06533L202k45811j08542J12521J5092N0709j58480
13994C52174j05196j6832j4259k71283j63247J92439L21169K95019L6537l7579
13984E88942k31862j01363j07647J21679m9018l2240N5174J01530J01480M4113
13974D90788L6123j481l8503m3746j40890Q1764o4674j30361j35477Q5263J06922
13963B45728L3089Q6658l1173j07592J37210Q7841J68728K4059l1510k17219q2595
13952C13224N7256J24605k14667R9860R2241k56918o4377K55494M3344k7373k5856
$$ y = [543287, 468334, 581542, 521062, 332088, 71028, 383124, 829353, 731925, 646618, 668259, 580180, 331846, 234198, 222461, 279358, 129796, 132626, 112021, 247665, 306755, 349019, 451405, 486438, 576950, 683483, 686685, 440874, 332332, 444853, 459945, 510654, 352174, 246978, 230146, 215887, -55396, -218643, -26204, 294965, 589984, 626521, 588942, 357080, 255717, 148070, 269749, 220731, 188491, 243665, 345195, 446675, 490788, 526911, 525430, 486927, 443181, 302291, 384055, 319381, 189020, 53543, 138806, 245728, 278817, 365475, 334302, 226710, 363920, 451761, 620489, 644548, 613038, 395819, 313224, 370480, 495085, 280418, 380278, 472519, 215601, 151224, 406718, 450062, 422689, 396833]
13941C96833J06216j07633R618J8180J7530l9625j35158Q8579J36966m8676j97716
13930B45114k16581O0261Q3472J06897J57739k8337J9099o3912Q7283N7147J1683
13919E19865j11353j80182J02182L52960P1313m39258j55346p4790J45668j83761
13909D7298m050K37921J372J14185Q2953q6576P9925J42684K6025j51912j00373
13898C89452l1055j76979K50245J29011N3915n7936O5865j47820k21799L5703
13888B88602J41926J3872J39100o4588L5389j23269n5496k15920O6894N280N0608
13877B82398Q4466r662J34028k055J37508l4809k869j59202j43770K19932m2600
13866D63365l1333Q1804M586Q5301o7064j64610p0105J18789J84635j30931L3700
$$ y = [396833, 503049, 395416, 405034, 423214, 440744, 401119, 265961, 354540, 491506, 442830, 245114, 28533, 88794, 172266, 279163, 436902, 408565, 427664, 363752, 451035, 508182, 519865, 408512, 228330, 330512, 683472, 754785, 315527, 160181, 85391, 231059, 47298, 43248, 281169, 282541, 396726, 479679, 393103, 473028, 615712, 641737, 489825, 389452, 358397, 181418, 431663, 560674, 614589, 556653, 622518, 474698, 252899, 288602, 430528, 444400, 583500, 518912, 554301, 431032, 375536, 159616, 226510, 231790, 282398, 366864, 357202, 491230, 489175, 626683, 591874, 589005, 429803, 286033, 505965, 463365, 432032, 513836, 518422, 603723, 536659, 372049, 301944, 420733, 605368, 474437, 508137]
13855E08137J30058J3524q2229k29154n2328J28641J01451q1262r4735N8609m6911
13844C53801J5266R1013L21628K25496R445q6360q8507p4998J25391m9982l83793
13833D58400l4112J14165j53201n2653n5513n9762J63628j72416L7301R9162Q1705
13822D26704O8177j48086O2098O5961j33714N2313J32782K0950j4741J81989J03235
13811H17668j90915M4800j74997q8846m7846J61723K79393n77j81031r9294j67457
13800C52621J4886M3460L13183k3644j08015j28719p0685R7146Q7925p6641M7174
13789E48691J32828J32225R1810j97226j54145P0520J41676n8770m356J77935
13779H81188N132m8398R8099J83912J70174k755J6108n7915l406j23957r1973
$$ y = [508137, 638195, 651719, 569490, 340336, 288008, 416649, 518100, 436838, 342103, 400712, 353801, 369067, 460080, 781708, 1007204, 1016649, 930289, 841782, 766784, 892175, 842193, 458400, 424288, 538453, 385252, 332599, 277086, 217324, 380952, 208536, 245837, 344999, 426704, 494881, 346795, 408893, 474854, 341140, 393453, 526235, 547185, 532444, 714433, 817668, 626753, 671553, 496556, 407710, 359864, 521587, 800980, 800403, 619372, 520078, 352621, 367507, 410967, 724150, 700506, 592491, 463772, 393087, 490233, 578158, 501517, 548691, 681519, 813744, 905554, 708328, 554183, 624703, 766379, 707609, 703253, 881188, 886320, 837922, 936021, 1119933, 1290107, 1287352, 1303460, 1245545, 1242139, 1118182, 1026209]
13768A026209L06052N8208r2141O0795j15521J08843j04503j67208p4023J51249
13758A157960J91460J2354k20970Q0966P3853l6094k012m9785M2034K6647j67033
13747A109380k3014K02946K85727K1213j05394j0170P3109j3442J4186M4337M3091
13736A641969R3427k3384p1429j10890J58155P4207J18115M3691Q9518m8550l6795
13725A928034j10113J73587P1995l2476K01003R1840m5828J71408J0622J16580
13715B576652R8167j70540J11192R8802Q5288L15057N2501R3362J8256K17813
13705C496550J91404N1151K03831K57090R7390J12506J27333j7340P2290K89075
13695D881280K86819M31888L20925K78329L96749N58414L62796M71134Q11473
$$ y = [1026209, 1332261, 1390469, 1298328, 1359123, 1243602, 1352445, 1247942, 1080734, 1006711, 1157960, 1349420, 1361774, 1140804, 1221770, 1295623, 1259529, 1257517, 1207732, 1249766, 1276413, 1109380, 1086366, 1289312, 1575039, 1596252, 1490858, 1480688, 1553797, 1540355, 1554541, 1598878, 1641969, 1735396, 1712012, 1640583, 1529693, 1687848, 1762055, 1880170, 1923861, 2013379, 1964829, 1928034, 1817921, 1991508, 2063503, 2031027, 2232030, 2323870, 2278042, 2449450, 2460072, 2576652, 2674819, 2504279, 2615471, 2714273, 2799561, 3114618, 3167119, 3260481, 3278737, 3496550, 3687954, 3739105, 3942936, 4200026, 4297416, 4409922, 4537255, 4519915, 4592205, 4881280, 5168099, 5599987, 5920912, 6199241, 6595990, 7154404, 7517200, 7988334, 8799807]
13686H799807Q03674Q04688O75773P33292R38188J293834J437753J418575J404353
13677A8309937J325149J568229J882687J985386J994114K190273K245996K109645
13669C3611416J694711J493549J058823L85233m31320j034906j336912j370101
13661C4070493j749386j543343j845503j821109j123610j332591j115290j057797
13653B2481864p66927m82077k30344j90578k25702N4883J15485P0505L67568N66885
13643B1761562N48001P04437J153711J256016J262156J684200J580227J904799
13635C1855109K251334K350353K344696K423938K845795K736526K523522K293958
13627E1625231K386427K076106J808502J496543J175436Q57600P03724M31974
$$ y = [8799807, 9603481, 10408169, 11083942, 11817234, 12755422, 14049256, 15487009, 16905584, 18309937, 19635086, 21203315, 23086002, 25071388, 27065502, 29255775, 31501771, 33611416, 35306127, 36799676, 37858499, 38243732, 37812412, 36777506, 35440594, 34070493, 32321107, 30777764, 28932261, 27111152, 25987542, 24654951, 23539661, 22481864, 21714937, 21232860, 21002516, 20811938, 20586236, 20641119, 20756604, 20827109, 21194677, 21761562, 22309563, 23014000, 24167711, 25423727, 26685883, 28370083, 29950310, 31855109, 34106443, 36456796, 38801492, 41225430, 44071225, 46807751, 49331273, 51625231, 54011658, 56087764, 57896266, 59392809, 60568245, 61425845, 62129569, 62561543]
13619F2561543K55253j42287o10984p94307j185252j387437j211182j632725j724716
13610E4127906j885593k254601k384242k311209k407863k522241k339822k270670
13602C5751665j983521j615476j527944j203219j020943j029808q74151p03494
13594B5793109n82764j96499R0860K5829Q5273L14330M82373L56964L13181P10772
13584B7393428Q29769Q90021J139640J211736J493380J571220J962182K030378
13576C8521754J598698J450758J297141Q92666K07827j26069p58378j399717j708198
13567C9976482k247403k239424k223792k241674k261482j919892j839300j880345
13559B3123170j701679j413183j202829j037333q68133p77903p68928o06055n55047
$$ y = [62561543, 62816796, 62674509, 62063525, 61269218, 60083966, 58696529, 57485347, 55852622, 54127906, 52242313, 49987712, 47603470, 45292261, 42884398, 40362157, 38022335, 35751665, 33768144, 32152668, 30624724, 29421505, 28400562, 27370754, 26496603, 25793109, 25210345, 25013846, 25104706, 25130535, 25215808, 25530138, 26012511, 26369475, 26682656, 27393428, 28223197, 29113218, 30252858, 31464594, 32957974, 34529194, 36491376, 38521754, 40120452, 41571210, 42868351, 43761017, 43968844, 43842775, 43084397, 41684680, 39976482, 37729079, 35489655, 33265863, 31024189, 28762707, 26842815, 25003515, 23123170, 21421491, 20008308, 18805479, 17768146, 16900013, 16122110, 15353182, 14747127, 14192080]
13550A4192080o13918m42983n08430p10189o36030o12523l13732j73530j82373
13541I998372k22760k09661k85242m82479l91324p4403j49479j88130r0674j18899
13531G785321j29795k82983m22999j47145k75754l95026p1714J10340r476l68285
13521E792484j49785j24892j41061J08049n1341k32860k17153j54086l2682j51658
13511D645015R9881M4006k26750j30797m0172K111j13586j09862k51707j25669
13501C792470J23282Q971j48925j53100J19437L9565j41376q3145j61283l12975
13491C082921M8331J56121j22352K148Q1042l16181q4618J10737M4013O294k7566
13480B980890r0647N2593M9009r14q9852j59370K2226j6516j03133l7625r4801
$$ y = [14192080, 13578162, 13135179, 12626749, 11916560, 11280530, 10668007, 10354275, 10180745, 9998372, 9775612, 9565951, 9280709, 8798230, 8406906, 8332503, 8183024, 7994894, 7904220, 7785321, 7655526, 7372543, 6949544, 6802399, 6526645, 6131619, 6059905, 6170245, 6160769, 5792484, 5642699, 5517807, 5376746, 5484795, 5433454, 5200594, 4983441, 4829355, 4796673, 4645015, 4744896, 4788902, 4562152, 4431355, 4391183, 4393294, 4279708, 4169846, 3918139, 3792470, 3915752, 3924723, 3775798, 3622698, 3742135, 3781700, 3640324, 3557179, 3395896, 3082921, 3131252, 3287373, 3165021, 3167169, 3248211, 2932030, 2847412, 2958149, 3002162, 3008456, 2980890, 2890243, 2942836, 2991845, 2990931, 2901079, 2741709, 2763935, 2747419, 2644286, 2606661, 2511860]
13469B511860k29335Q7994k542m5233q8206K6424J7187j88174r8146k2064P985
13458A977750N4835l0824o6743n8738j50658j40009J089j15412J71134J12486
13448A754910n1965o9649j13373n5815P7293J58610J34150m8360r9032j41304
13438A545465J9159K06717J73600j09438k77501j47559j40629k6114P3386R0131
13428A407217J01753O427J80511N8575m9482O0105J33318J3084j91753m38353
13418A281402j7159N041L214L6407J7707k5171N0790j50072k3491J15577J25420
13407A419665r2708k69131q2970k2808K3283R9976J2928M9381j3960j1472j35097
13396I77087j3442P5416L7567q3700k12537P4862k8503N444o1811J6583r6818
$$ y = [2511860, 2282525, 2370519, 2367977, 2322744, 2234538, 2260962, 2278149, 2089975, 1991829, 1969765, 1977750, 2032585, 2001761, 1935018, 1876280, 1725622, 1585613, 1586702, 1471290, 1642424, 1754910, 1702945, 1633296, 1519923, 1464108, 1541401, 1700011, 1834161, 1785801, 1686769, 1545465, 1564624, 1771341, 1944941, 1835503, 1558002, 1410443, 1269814, 1243700, 1317086, 1407217, 1508970, 1515397, 1695908, 1754483, 1705001, 1765106, 1898424, 1911508, 1719755, 1281402, 1264243, 1269284, 1272498, 1308905, 1326612, 1301441, 1352231, 1202159, 1178668, 1294245, 1419665, 1326957, 1057826, 974856, 952048, 975331, 1075307, 1088235, 1137616, 1123656, 1112184, 977087, 963645, 1039061, 1076628, 992928, 780391, 855253, 826750, 832194, 770383, 786966, 690148]
13385F90148n1375J53374n6545K006L04178j06326K7628K86873l1610q7081K12638
13374A343908n5015j2774K8361J13064J2820k5646J7143k68556j86008p4078k0602
13363H72617l4643N2239j54098Q3172k7846n9051o7476J93978L46452n0601j93250
13352I61493K2938J73635J67642j22854l2137k3440j6339l71783j18982q4232
13342E55941j4521K24592J59304j11915N2366N546p2741l6627j10048M1101o899
13331F86099L2090K46108j5641k00565J14554j08468j7784l1102k5404J21085
13321H00972N5740n8039R3200L50342l7525j05450M0892j93285j48942l7168k3328
13310G37409p0298m1989j11348j35106R4877J02913K69931J11455Q4081j83499
$$ y = [690148, 638773, 792147, 735602, 737608, 1041786, 935460, 963088, 1249961, 1218351, 1131270, 1343908, 1288893, 1276119, 1304480, 1417544, 1430364, 1404718, 1421861, 1153305, 967297, 893219, 872617, 837974, 890213, 736115, 819287, 791441, 732390, 664914, 858892, 1205344, 1154743, 961493, 984431, 1158066, 1325708, 1202854, 1170717, 1147277, 1130938, 759155, 640173, 555941, 541420, 766012, 925316, 813401, 865767, 871313, 798572, 761945, 651897, 692998, 686099, 718189, 964297, 948656, 748091, 862645, 754177, 736393, 705291, 679887, 800972, 856712, 798673, 891873, 1242215, 1204690, 1099240, 1140132, 946847, 797905, 760737, 737409, 667111, 625122, 513774, 378668, 473545, 576458, 846389, 957844, 1041925, 858426]
13300H58426P1178j43823k39172L9071j96541k51022K90380K04588J6486J55366
13290H04937P436j4290J37277P2035k2376o8237j10594N3379M0153o8200N7716
13279H89236l6024j58962K7556R8200j49842J9753J24055n5076m9008o9686N3257
13268F93459M2696J68160K810n4796p9578q9687q522L9203n1256N9257j02907
13257F18839j08599Q3426L22951N6849p5815m2428j6132j93162m3574R6483O2364
13246G61202N0558K8007j27967R5562K54101j11099j46709J08485o3834k22189
13236F26117K846J13463k8946K37499P692j6919j0888l4865N0033j15806L6105
13225H66331j48291o4861O9281q7963q130K24830q3208L9150J24094p5936K1638
$$ y = [858426, 929604, 785781, 546609, 585680, 389139, 138117, 428497, 633085, 649571, 804937, 812373, 798083, 935360, 1007395, 985019, 916782, 806188, 859567, 899720, 831520, 889236, 853212, 694250, 721806, 820006, 670164, 689917, 813972, 758896, 709888, 640202, 693459, 736155, 904315, 907125, 852329, 772751, 683064, 674542, 713745, 662489, 721746, 618839, 510240, 593666, 916617, 973466, 897651, 855223, 839091, 645929, 602355, 698838, 761202, 811760, 839767, 711800, 807362, 1061463, 950364, 803655, 912140, 848306, 626117, 628963, 742426, 713480, 950979, 958671, 941752, 930864, 895999, 946032, 830226, 866331, 718040, 653179, 722460, 634497, 626367, 851197, 767989, 807139, 931233, 855297, 876935]
13214H76935L3642R3764L4561J15550j42826j19494j91753N3617J19230J83771
13204A056997K0652m7233j08010J93831J51800j64289l8803j46776j22669p4618
13194G20882m2973j7478R8341J7928M0996r780k16708r0675p5165j16113K66553
13183E75808J77512J70736j6380J03607O7168j36693K94638K52502l54689k52967
13173H81242Q3608P5471j68931k31031J40021P5011L5605P7319J8004j91581j24872
13162F69866p6954J51871J44814P3958K8123Q910Q4759Q2216n9756k5932j05952
13151I75923k15043j64034m8825M9885k7258J06662K76400K66386j68894j10633
13141I40569q5783J02758k2808K139l7282r3680m1374R3095j231J25364J5136
$$ y = [876935, 910577, 1004341, 1038902, 1154452, 1011626, 892132, 700379, 753996, 873226, 1056997, 1077649, 1030416, 922406, 1116237, 1268037, 1103748, 1064945, 918169, 795500, 720882, 677909, 660431, 758772, 776700, 817696, 807916, 591208, 500533, 425368, 309255, 575808, 753320, 924056, 907676, 1011283, 1078451, 941758, 1236396, 1488898, 1134209, 881242, 964850, 1040321, 871390, 640359, 780380, 855391, 890996, 968315, 986319, 794738, 669866, 592912, 744783, 889597, 963555, 991678, 1000588, 1085347, 1167563, 1107807, 1081875, 975923, 760880, 596846, 548021, 597906, 570648, 677310, 953710, 1220096, 1051202, 940569, 854786, 957544, 934736, 936875, 899593, 805913, 764539, 857634, 856403, 981767, 996903]
13130I96903j53449M380l4818K450J1087p8608L5139J19177J19184J1938p9031
13119I54352J83804K57803j33205j35462j07973K9401N6653j9987k75497k2482
13109G87407J86390K72581O7327k72689k25382O3222J87681j26773j83492n9333
13099F96939j29532M3437N0441k02628r9823Q7462J86035J63867J39541l4965
13089I00774J12648J09041o1862j98909k11151k92824L8699M7311J11591J86443
13079G41761N9173j49500L49k2811K6321J37910J35328O1550j25956j36223o1656
13068F66246m5808j45211J15759K11800J64401K9966j38620k34076q411J32220
13058G48266J42550j43178j32784l1127r4186j96877n9483m330o7034K00946N7079
$$ y = [996903, 843454, 847834, 813016, 815466, 826553, 747945, 783084, 902261, 1021445, 1033383, 954352, 1138156, 1395959, 1262754, 1127292, 1019319, 1048720, 1105373, 1085386, 809889, 787407, 973797, 1246378, 1313705, 1041016, 815634, 878856, 1066537, 939764, 756272, 696939, 567407, 610844, 661285, 458657, 358834, 446296, 632331, 796198, 935739, 900774, 1013422, 1122463, 1060601, 861692, 650541, 357717, 396416, 443727, 555318, 741761, 800934, 651434, 651783, 628972, 655293, 793203, 928531, 990081, 864125, 727902, 666246, 620438, 475227, 590986, 802786, 967187, 997153, 858533, 624457, 616046, 748266, 890816, 747638, 614854, 583727, 489541, 292664, 233181, 228851, 161817, 362763, 419842]
13047D19842j01530J96488j59361j7215K94459K65490j4119k9302m1357k30950
13037E82445o306J54681L6646M0735O2044R2864J09086L7449j21194j24930j9352
13026H44168q4481J19242k5919M0215j1737J83124J26117J2628o7228o6543j57215
13015I12371k923k09080m11873J84708J33147O9523j6790r5841j4484J58664O3200
13004G70622J15439K2973q1972l9797O9276J07627K7924j9744O5249j9373P0138
12993A088362q0979Q5731J74613k2347l25953r3462L38504J32171k31156j22483
12983I43001M5805J01842R4724j16344j56777M1585O264J19707q3405k5876j06140
12972H64386Q7974q1428K72950J50833O6763m72911j94966p5170R995J9599l3589
$$ y = [419842, 318312, 514800, 355439, 338224, 632683, 898173, 884054, 854752, 813395, 582445, 576139, 730820, 767466, 808201, 870245, 963109, 1072195, 1109644, 988450, 863520, 844168, 759687, 878929, 853010, 893225, 881488, 1064612, 1190729, 1203357, 1136129, 1069586, 912371, 909448, 700368, 288495, 473203, 606350, 675873, 659083, 563242, 548758, 707422, 770622, 886061, 909034, 827062, 787265, 856541, 964168, 992092, 972348, 1037597, 1018224, 1088362, 1007383, 1093114, 1267727, 1245380, 919427, 825965, 1164469, 1296640, 1065484, 943001, 988806, 1090648, 1185372, 1069028, 912251, 953836, 960100, 1079807, 996402, 970526, 864386, 952360, 870932, 1143882, 1294715, 1361478, 888567, 693601, 618431, 628426, 648025, 614436]
12961F14436j6693J71048J43472n541J29924o6225P8939j785J16298J98102k04188
12950A157787j86984J998J7736q8583N6001N5271l3265M7595N6227O035k3147
12939A066671n8480l18491Q4662K07432j56292J9708K29788J11790q2961r70l2227
12928A070630r072J75076J35588J04701N0860P1765O181k41073j57598p1208R8501
12917A234351J62782L05706n5696p227L26048N25128M33036O12678O36816M58359
12907D631981N27160K36897K37643J27138j91806k54399l97142n17556l18132
12898D081784k98955l37635k52468j72020j91018k30302k09639j22644L701k60654
12888B010150j71775p7268M4937J02015J28733m0535j12276K08165N0096N4663
$$ y = [614436, 597743, 768791, 912263, 906722, 1036646, 970421, 1049360, 1047575, 1163873, 1361975, 1157787, 970803, 972801, 990537, 901954, 957955, 1013226, 979961, 1027556, 1083783, 1089818, 1066671, 1008191, 689700, 774362, 981794, 825502, 845210, 1074998, 1186788, 1103827, 1102857, 1070630, 1061558, 1236634, 1372222, 1476923, 1527783, 1599548, 1605729, 1364656, 1207058, 1135850, 1234351, 1397133, 1702839, 1647143, 1639916, 1965964, 2491092, 2924128, 3536806, 4173622, 4631981, 5159141, 5396038, 5633681, 5760819, 5569013, 5314614, 4917472, 4399916, 4081784, 3782829, 3445194, 3192726, 3020706, 2829688, 2599386, 2389747, 2267103, 2270804, 2010150, 1838375, 1761107, 1806044, 1908059, 2036792, 1996257, 1883981, 2092146, 2142242, 2196905]
12878B196905N9884m4882L11406K89018K41633K56394N52490P86446Q21763O60452
12868F131509P79014R18796R56960R98539O18698L69562N2800j97371o73418j157942
12858H797147j168157j027153p41127o31905n13211m62544k99356l22635k47517
12849C383542l24148j77934j07117n5061P4520q116P5816N24l69418j00781j80774
12838B211053K2739J34690J0543P4136Q7008Q7758K53806P8628J70502K60024
12828C390887M42931L52953L16423N70276O14347L16791J49043O1947J05071J41137
12818F461806m14784n54571n76755n96130m24595k14790j11919l70049n80976
12809B617237j87084j8134j21278l5173P5954j77655j90252N3816R5722p5104
$$ y = [2196905, 2256789, 2211907, 2523313, 2812331, 3053964, 3310358, 3862848, 4649294, 5471057, 6131509, 6910523, 7829319, 8786279, 9784818, 10403516, 10773078, 10825878, 10628507, 9955089, 8797147, 7628990, 6601837, 5860710, 5228805, 4715594, 4253050, 3953694, 3631059, 3383542, 3059394, 2881460, 2774343, 2719282, 2793802, 2785686, 2861502, 2862026, 2492608, 2391827, 2211053, 2233792, 2368482, 2379025, 2453161, 2540169, 2627927, 2881733, 2960361, 3130863, 3390887, 3833818, 4186771, 4503194, 5073470, 5687817, 6004608, 6153651, 6215598, 6320669, 6461806, 6047022, 5492451, 4915696, 4319566, 3894971, 3680181, 3568262, 3198213, 2617237, 2430153, 2412019, 2290741, 2255568, 2331522, 2153867, 1963615, 2017431, 2113153, 2038049]
12799B038049k36325o8151J39640Q8446j30584q2281j06671n2486J35702M314
12789A729653j85915k12287J85542j20726J42365J56870j8439K51882m748k2458
12779A901739l83471k37360o609J75492n0716K9434M4509J56707o0931R837j2122
12768A566509M568O7574O2662m8202J5084j12220R637N1535j24596J23300r5200
12757A520651n6686R9823j3679M0022j94751p0354O5045J08301P1337k6325m20353
12746A123031o6547J66410J06598K4624Q1101n7017j70876j8005M8970J48746
12736A387035L8720p1090J76814m2085r2620R2414j1423J05950k320j00898n2164
12725A428333L3202j4463j39671l1908J2093j42144O2823N0679r5693J65254K1653
$$ y = [2038049, 1801724, 1733573, 1873213, 1961659, 1831075, 1748794, 1642123, 1589637, 1725339, 1729653, 1543738, 1331451, 1516993, 1396267, 1538632, 1695502, 1677063, 1928945, 1924197, 1901739, 1518268, 1280908, 1274299, 1449791, 1399075, 1428509, 1473018, 1629725, 1568794, 1578631, 1566509, 1571077, 1638651, 1701313, 1653111, 1668195, 1555975, 1565612, 1617147, 1492551, 1615851, 1520651, 1463965, 1563788, 1550109, 1590131, 1395380, 1325026, 1390071, 1498372, 1569709, 1543384, 1123031, 1056484, 1222894, 1329492, 1354116, 1435217, 1378200, 1207324, 1189319, 1238289, 1387035, 1425755, 1354665, 1531479, 1489394, 1396774, 1489188, 1477765, 1583715, 1581395, 1480497, 1428333, 1461535, 1447072, 1307401, 1275493, 1287586, 1145442, 1208265, 1258944, 1163251, 1328505, 1350158]
12714A350158K82085L6320j06479n1366k409L2972J25009J50784O8818l9143k04100
12703A642649k6599O4798j52027k55794J10462r443K5279J68797R4176l2244Q7300
12692A717354K66412j49333k43599J29813Q1548k2702j5531j36379J49688k0630
12682A756641j3925R5862O6128r8091J02836j21883l1437M2291O4101j4128Q8953
12671A937348J7073o1445k19324j62938r0964N0412M8795j02672r7595M0821j08638
12660A250873L1076J00578k20J37012J05683N4476k25799J5440Q4942k5621p8697
12649A449743M2250n0751J5806J81316J31245j9139O3183p1331K6277K40660j74540
12638A834719j98429j15454j53527K04561J97004R6821j55128j42020J83492P8744
$$ y = [1350158, 1632243, 1668563, 1562084, 1510718, 1508309, 1541281, 1666290, 1817074, 1885892, 1846749, 1642649, 1616050, 1680848, 1528821, 1273027, 1383489, 1374046, 1399325, 1568122, 1662298, 1630054, 1717354, 1983766, 1834433, 1590834, 1720647, 1802195, 1779493, 1763962, 1627583, 1777271, 1756641, 1742716, 1838578, 1904706, 1806615, 1909451, 1787568, 1756131, 1798422, 1862523, 1848395, 1937348, 1954421, 1892976, 1673652, 1510714, 1419750, 1470162, 1518957, 1416285, 1318690, 1359511, 1250873, 1281949, 1382527, 1382307, 1519319, 1625002, 1679478, 1453679, 1469119, 1554061, 1528440, 1449743, 1491993, 1441242, 1457048, 1638364, 1769609, 1750470, 1813653, 1742322, 1768599, 2009259, 1834719, 1636290, 1520836, 1367309, 1571870, 1768874, 1865695, 1710567, 1568547, 1752039, 1830783]
12628A830783q1390J21956J07179J51582L9939j04074m4882j10147k4361o5631
12618A820954l9946j88353O5789N5214J08229P1321k4617j959j83094l0228j08088
12607A545222j40759P8756L72794J79270o5543k95268J49212K04341j77421j07922
12597A742682m2077j0635J51537L17834m1412r8466M1927m6043J17585M8708J02032
12586B283672M7604j42927j11146j67865J04987N7067O1894q9849j12030j45898
12576A785509j38975K1903K04655m4773N1167K4935n4764Q7077p8975P4733J146
12565A933638Q0039m8013k30417j37949J21539K18821K22929r5920l9663K4898
12555B049902o0460k05946r7822K10966P2404K8548p9389J56705J96995j0349
$$ y = [1830783, 1749393, 1871349, 1978528, 2130110, 2170049, 2065975, 2021093, 1910946, 1886585, 1820954, 1781008, 1592655, 1658444, 1713658, 1821887, 1893208, 1868591, 1866632, 1683538, 1653310, 1545222, 1404463, 1483219, 1856013, 2035283, 1969740, 1674472, 1823684, 2028025, 1850604, 1742682, 1700605, 1689970, 1841507, 2159341, 2117929, 2019463, 2061390, 2015347, 2132932, 2181640, 2283672, 2331276, 2188349, 2077203, 1909338, 2014325, 2071392, 2133286, 2043437, 1931407, 1785509, 1646534, 1668437, 1873092, 1828319, 1879486, 1904421, 1849657, 1936734, 1857759, 1932492, 1933638, 2013677, 1965664, 1735247, 1597298, 1718837, 1937658, 2160587, 2064667, 2025004, 2049902, 1989442, 1783496, 1685674, 1896640, 1969044, 1997592, 1918203, 2074908, 2271903, 2261554]
12545B261554J18491q7979k04599P9804j02700j32431P6225J02853M0743o9424
12535B082537Q1973Q8953J21709J72219J85920N7727j42103k57190J4412m4774
12525B361383J30923J75254J10170j69543o2481j96294k50948n452K11507P5906
12515B380425o8904J15273l1229J7266j2582j30717K17583j9824r3074j17814
12505B256403j27339K1039J66857J27193j0194j53892n231J97955M6381O311J20850
12494B646333k90682J10328J15891j4598m6968j60062r6926k1429K0201J53751
12484B415839O4902m8873N6361K50453P7300N7278K08221p6853k83124p8835j3043
12473B629626O2053J15772k9567Q91K33297Q8938R3737p0808k10369r1355k45501
$$ y = [2261554, 2380045, 2292066, 2087467, 2167271, 2064571, 1932140, 2008365, 2111218, 2151961, 2082537, 2164510, 2253463, 2375172, 2547391, 2733311, 2791038, 2648935, 2391745, 2406157, 2361383, 2492306, 2667560, 2777730, 2608187, 2545706, 2349412, 2098464, 2093012, 2304519, 2380425, 2311521, 2426794, 2395565, 2412831, 2400249, 2269532, 2487115, 2467291, 2374217, 2256403, 2129064, 2150103, 2316960, 2444153, 2433959, 2280067, 2274836, 2472791, 2519172, 2525483, 2646333, 2355651, 2465979, 2581870, 2567272, 2520304, 2360242, 2263316, 2241887, 2262088, 2415839, 2480741, 2431868, 2488229, 2738682, 2815982, 2873260, 3081481, 3004628, 2721504, 2642669, 2629626, 2691679, 2807451, 2777884, 2778775, 3012072, 3101010, 3194747, 3123939, 2913570, 2822215, 2576714]
12462B576714j7594O8887j2870J15539n17j959J8935K196K6432j6883n4476R9439
12450B803843K35662j24005M987J17666j8009j23526n7215J60801J69485Q0729
12440C250418k41028L3245L1089N9948k5685Q897O9240o5108j73825L6855J6615
12429C000661k338R1197l6238P8675P7735k65266k8034J92997K91351l7967O885
12418C369658N1063J61196J63812j82400j67945p7023r5889P0729j38812r7868
12408C056521N457Q5161J08281R7475P2723R8539N6667j67307n9050M7634K315
12397C404416J84045O6574j30763L4288k3943J12480N4660p7116K8053J10893
12387C763587J59295j10279Q2268J4813O476q411J76950j0774k37273J2893R5705
$$ y = [2576714, 2559120, 2628007, 2615137, 2730676, 2730159, 2728200, 2747135, 2749331, 2775763, 2758880, 2704404, 2803843, 3039505, 2915500, 2920487, 3038153, 3020144, 2896618, 2839403, 3000204, 3169689, 3250418, 3009390, 3042635, 3073724, 3133672, 3107987, 3116884, 3186124, 3121016, 2947191, 2984046, 3000661, 2998323, 3089520, 3053282, 3131957, 3209692, 2944426, 2916392, 3109389, 3400740, 3362773, 3369658, 3420721, 3581917, 3745729, 3563329, 3395384, 3318361, 3222472, 3293201, 3154389, 3056521, 3061978, 3147139, 3255420, 3352895, 3425618, 3524157, 3580824, 3413517, 3354467, 3402101, 3404416, 3588461, 3655035, 3524272, 3558560, 3534617, 3647097, 3701757, 3624641, 3652694, 3763587, 3922882, 3812603, 3894871, 3909684, 3916160, 3907749, 4084699, 4073925, 3836652, 3849545, 3945250]
12376C945250Q556J00756M3936k14283K9260M2015k12460J98821J29348N3770
12366D124969j26331l15387j28576Q155P5177J61779K21560q8634J32075N6403
12356D121190l08080o6399J56941J18464n2284k19007K03084J54959l6339m0632
12346D031897l5497J55828P6743K1904n7180L8939r3961k2697K85834J11538j92625
12335D320723P1938j26717J01004J62722k9852P5513o573O3106J91590k54949
12325D568505k39665k21592m5963N0322J83418p6104n018K55895l9766j07220
12315D322812P0083K23206k71170j2203K84456J0233K452n3814J2284P8881R313
12304D676533N5086K67663n4985j54600P6462j8517Q0046m6806j28364j7508K79876
$$ y = [3945250, 3953806, 4054562, 4098498, 3884215, 3913475, 3955490, 3743030, 3941851, 4071199, 4124969, 3998638, 3683251, 3554675, 3562830, 3638007, 3799786, 4021346, 3932712, 4064787, 4121190, 3813110, 3746711, 3903652, 4022116, 3969832, 3750825, 3953909, 4108868, 4072529, 4031897, 3996400, 4152228, 4228971, 4250875, 4193695, 4232634, 4138673, 4115976, 4401810, 4513348, 4320723, 4392661, 4265944, 4366948, 4529670, 4499818, 4575331, 4568758, 4631864, 4823454, 4568505, 4328840, 4107248, 4061285, 4111607, 4295025, 4218921, 4213903, 4469798, 4430032, 4322812, 4392895, 4616101, 4344931, 4332728, 4617184, 4627417, 4629869, 4576055, 4588339, 4667220, 4676533, 4731619, 4999282, 4944297, 4789697, 4866159, 4847642, 4927688, 4880882, 4752518, 4735010, 5014886]
12293E014886L80726j02930j65262j02270j10726J17733k18244j48109m9371N548
12283D621981K15608J51642N7252R6793M7921p806O188r882K15853K11873L16906
12272E924329m3355j88349Q1253J25850j18541k73484k3992K33006o4140k07356
12262E445221q8253l9063j1655r452j3868K51815J14493J8282Q4192J94330l6927
12251E909115o7977O5944J25089K53150Q8363k97997r8185J43386n4293k1207
12241F045388Q0953J60152P3018j53490J13550J76064k0521R080n818Q1921l6006
12230F524291j38463o327K05641P8208q7691R8210k2581j27648n6438K08110J33557
12219F808869Q7190J70537j52397k03977j47242n858J29154K19344N4165j48480
$$ y = [5014886, 5395612, 5292682, 5127420, 5025150, 4914424, 5032157, 4813913, 4665804, 4616433, 4621981, 4837589, 4989231, 5046483, 5143276, 5191197, 5183391, 5189579, 5179697, 5395550, 5607423, 5924329, 5880974, 5692625, 5773878, 5899728, 5781187, 5507703, 5483711, 5716717, 5652577, 5445221, 5356968, 5317905, 5306250, 5296798, 5282930, 5534745, 5649238, 5667520, 5751712, 5946042, 5909115, 5841138, 5907082, 6032171, 6285321, 6373684, 6075687, 5977502, 6120888, 6066595, 6045388, 6126341, 6286493, 6359511, 6206021, 6319571, 6495635, 6475114, 6484194, 6478376, 6560297, 6524291, 6385828, 6379501, 6585142, 6663350, 6575659, 6673869, 6651288, 6523640, 6467202, 6675312, 6808869, 6896059, 7066596, 6914199, 6710222, 6562980, 6557122, 6686276, 6905620, 6959785, 6811305]
12209F811305r3554K21794K16030J8615o3666j2559J32253P0409J42179l9524
12199G403282j09400K25k4630O2263K19717L1895J947K76278J13554p9401j16941
12188G778789O2902K0036R8448j29675j07781J22245n4877L0974K47849K3764
12178H092674q5607o9428r9959k23449Q0759K37516K15156O1053k8061R1943j06277
12167H166320J6598J94566N485j26313j96355J73152L77162M2873k1145q6414
12157H545929q7038P2231J16450j3135P8345K15186K29494k18474j4878J02024
12147I026134q2929o4747j3752P0718O8661j3224N5340R7016k92361K43991Q4631
12136I179478o9786J62607J70189Q1273J8078j00424j61796j18060J76368J24506
$$ y = [6811305, 6717751, 6939545, 7155575, 7174190, 7110524, 7097965, 7230218, 7300627, 7442806, 7403282, 7293882, 7294107, 7269477, 7331740, 7551457, 7583352, 7585299, 7861577, 7975131, 7895730, 7778789, 7841691, 7861727, 7960175, 7830500, 7722719, 7844964, 7790087, 7821061, 8068910, 8092674, 8007067, 7937639, 7837680, 7614231, 7694990, 7932506, 8147662, 8208715, 8180654, 8272597, 8166320, 8182918, 8377484, 8382969, 8256656, 8060301, 8233453, 8610615, 8653488, 8632343, 8545929, 8458891, 8531122, 8647572, 8634437, 8712782, 8927968, 9157462, 8938988, 8924110, 9026134, 8943205, 8878458, 8864706, 8935424, 9004085, 8990861, 9046201, 9143217, 8850856, 9094847, 9179478, 9109692, 9272299, 9442488, 9523761, 9541839, 9441415, 9279619, 9161559, 9337927, 9462433]
12126I462433l3354r894K61098K11369M3988j79505j881J76684K17631j19693
12116A0028876k03578J56033J23169p062r657O3738L0611m2633K06329J16606
12106A0462432r5623O6829P3324J23918J58970l2768j70808l23852n9099K29938
12096A0433261j01829j4097J07565L07444L13393Q7567M8759j48489J7820L4287
12086A1085681O9591N9638r8783k81008J32773L05748J53908o8879m6440o7020
12076A1245209k04531Q3889K27676m4408j21617M4019K169R1403J97459m0051
12066A1481217q7490J59212M4637j15455J85836M3166r8639k2153p6646J24151
12056A1637836K54379O3855k4435k2522L6649p5499n1252Q129k9519J73789J25923
$$ y = [9462433, 9429079, 9419185, 9680283, 9891652, 9935640, 9756135, 9754254, 9930938, 10148569, 10028876, 9825298, 9981331, 10104500, 10097438, 10087781, 10151519, 10182130, 10139497, 10345826, 10462432, 10366809, 10433638, 10506962, 10630880, 10789850, 10757082, 10586274, 10262422, 10203323, 10433261, 10331432, 10317335, 10424900, 10732344, 11045737, 11133304, 11182063, 11033574, 11051394, 11085681, 11155272, 11214910, 11116127, 10835119, 10967892, 11273640, 11427548, 11358669, 11312229, 11245209, 11040678, 11124567, 11352243, 11307835, 11186218, 11230237, 11232406, 11323809, 11521268, 11481217, 11393727, 11552939, 11597576, 11482121, 11667957, 11711123, 11612484, 11590331, 11513685, 11637836, 11892215, 11956070, 11931635, 11909113, 11945762, 11870263, 11819011, 11827140, 11797621, 11971410, 12097333]
12045A2097333P9924j07235K8310P0352K4906J2138J50252R5802Q2653J13823
12035A2648258J9540N3534R1351J58808L2992k20230N5186j00882j4883M3104
12025A2766778p8986m3257n7861j29546J74962L50894J7310P8540Q8219J04349
12015A3271402Q7226k00095J53744K48159N6404R171n3193J16279J8478k36399
12005A3471176j36844R999j3187k6126q7621k78223k74238J54976M77203J3860
11995A3310975j93182J15497o3821j12961K2076j74741n6948j16085P3333L17405
11985A3121548J57363k3302K32830J30963o9540j8845P9753q412n7922M3528O1961
11974A3649925K4559J40416K82499o426J04146J81499j53857n6177n5678k56481
$$ y = [12097333, 12177257, 12070022, 12098332, 12168684, 12193590, 12205728, 12355980, 12451782, 12534435, 12648258, 12667798, 12721332, 12812683, 12971491, 13004483, 12784253, 12839439, 12738557, 12723674, 12766778, 12687792, 12644535, 12586674, 12457128, 12632090, 12982984, 13000294, 13078834, 13167053, 13271402, 13358628, 13158533, 13312277, 13560436, 13616840, 13626011, 13572818, 13689097, 13707575, 13471176, 13334332, 13344331, 13331144, 13305018, 13217397, 12939174, 12664936, 12819912, 13297115, 13310975, 13117793, 13233290, 13169469, 13056508, 13078584, 12903843, 12846895, 12730810, 12804143, 13121548, 13278911, 13255609, 13488439, 13619402, 13549862, 13531017, 13610770, 13602358, 13544436, 13587964, 13649925, 13674484, 13814900, 14097399, 14090973, 14195119, 14376618, 14222761, 14166584, 14110906, 13854425]
11964A3854425l0607j01945k82310l11018j11995P2314m0183R8027k2134N8643
11954A3183217j2236N2864q8814j92684k0504K59901K39196j38285j92483j3152
11944A3077020J98691m0166j02032j71636k71535l0592M8292K79454k1296j24281
11934A2841919Q8887J84217j10599j05241q4629m6725r6900M7920P5249j0910
11924A2783188M0470p6588k23278P3090j20579k88672K2294J382J44276K4949
11914A2380532P2993r8357j84770j00733J63954Q0745j31421j84362k7665r3441
11904A1877475J96215L6939r5256o666j04050l9397P2476R6909j50907k79705
11894A1604033j14612J1562Q7395j33140k06499k6371l798K18831R5898j15039
$$ y = [13854425, 13823818, 13721873, 13439563, 13128545, 13016550, 13088864, 13048681, 13146708, 13124574, 13183217, 13170981, 13223845, 13135031, 12942347, 12921843, 13181744, 13420940, 13282655, 13090172, 13077020, 13275711, 13235545, 13133513, 12961877, 12690342, 12659750, 12708042, 12987496, 12966200, 12841919, 12930806, 13115023, 13004424, 12899183, 12814554, 12767829, 12670929, 12718849, 12794098, 12783188, 12823658, 12747070, 12523792, 12596882, 12476303, 12187631, 12209925, 12211307, 12355583, 12380532, 12453525, 12355168, 12170398, 12069665, 12233619, 12314364, 12182943, 11998581, 11970916, 11877475, 12073690, 12110629, 12015373, 12008707, 11904657, 11865260, 11937736, 12034645, 11883738, 11604033, 11489421, 11500983, 11588378, 11455238, 11248739, 11222368, 11218570, 11437401, 11533299, 11418260]
11884A1418260j77351K6784J90216j86469j76826j74853k33902L607K62965R7128
11874A1049559o7089k1243j38736J91444J49139j80521j13868j8060j50702j4332
11864A0685591j23222k0058L6473m4607j91844o482p9797L5094K2303J0407L8555
11853A0362413q5184n340O6759k68378j21311J27566m5356M3712J7432j12478
11843I979835l0996j11628j26083Q7912J5218j51200M2532j18745j02359j77670
11833I306816k52542M8109K25184K608j49841J1199j09582K11771n0074Q005J4813
11822I266466O2631k91885k80055r2243J19651M3021R6986J12697k15159j18441
11812H703669j45468k29318P1801M9514J27572q8584r0046r4128K39261q321j86024
$$ y = [11418260, 11240909, 11267693, 11457909, 11271440, 11094614, 10919761, 10685859, 10689466, 10952431, 11049559, 10982470, 10961227, 10822491, 11013935, 11163074, 10982553, 10868685, 10850625, 10699923, 10685591, 10562369, 10542311, 10578784, 10534177, 10342333, 10335851, 10256054, 10291148, 10313451, 10323858, 10362413, 10277229, 10271889, 10338648, 10070270, 9948959, 10076525, 10031169, 10074881, 10092313, 9979835, 9948839, 9837211, 9711128, 9799040, 9814258, 9663058, 9705590, 9586845, 9484486, 9306816, 9054274, 9102383, 9327567, 9330175, 9180334, 9191533, 9081951, 9293722, 9243648, 9251653, 9266466, 9329097, 9037212, 8757157, 8664914, 8784565, 8827586, 8924572, 9037269, 8822110, 8703669, 8558201, 8328883, 8400684, 8450198, 8577770, 8489186, 8399140, 8305012, 8544273, 8535952, 8349928]
11801H349928r0902k84655j13399j5728J53508J9810K49071J82791J1069L5055
11791H496548j01689L5777k09252j19551k81667j65894J83614P0869j9971k6947
11781G861837j06499J89563l0427k20020J63064O0599j542k01565K0218j5657
11771G719571j39024j18123r6382k5215k34350p4754o9911j28085j5355J84398
11761G002770Q8084J27565R0706K7186p8431M1227R6260l0156j38724o4337r6402
11750G065748r1618j61581r4818o5500R4136J84k03951p1715j85390j39742J09945
11739F255698J21266Q2136j47398m6578P2573j03062P5994M8048r1475l0037L04842
11728F542007j54364k74292j97111p2427J70819K16724k45075k37415j44723j56715
$$ y = [8349928, 8259026, 7974371, 7860972, 7845244, 7998752, 8018562, 8267633, 8450424, 8461493, 8496548, 8394859, 8430636, 8221384, 8101833, 7820166, 7654272, 7837886, 7908755, 7888784, 7861837, 7755338, 7944901, 7914474, 7694454, 7857518, 7918117, 7916575, 7715010, 7735228, 7719571, 7580547, 7462424, 7366042, 7340827, 7106477, 7031723, 6961812, 6833727, 6818372, 7002770, 7090854, 7218419, 7309125, 7336311, 7257880, 7299107, 7395367, 7365211, 7226487, 7162150, 7065748, 6974130, 6812549, 6717731, 6652231, 6746367, 6746551, 6542600, 6470885, 6285495, 6145753, 6255698, 6376964, 6459100, 6311702, 6265124, 6337697, 6234635, 6310629, 6358677, 6267202, 6237165, 6542007, 6387643, 6113351, 5916240, 5843813, 6014632, 6231356, 5986281, 5748866, 5604143, 5447428]
11718E447428K9925K21499J81917J09612M520k53961j23405Q9537K06345m6821
11708E866596l1883K6124k50381k1261j0388J81564J36390j20277q1963j73538
11698E520983j33684O344O9451Q9494k6225j33168O069k0016j80348l444k2553
11687E172903l2535J60758k289K9757l1228q8102j76596L6678N7779m1298k15579
11676D870248l7347O5622J04243J66696j16783k56290J090j40940r2293K59993
11666D824239J53636K13709k28834k50540J83105l316j4186R1112j08186k44008
11656D616731n9019k00944M3371K20683J06434k3513m1111L3585K5j77226k15048
11645D303968R785l6520J04194j51161k12855J66376K00077r094o5558J71624
$$ y = [5447428, 5477353, 5698852, 5880769, 5990381, 5994901, 5740940, 5617535, 5707072, 5913417, 5866596, 5834713, 5860837, 5610456, 5589195, 5578807, 5760371, 5896761, 5776484, 5694521, 5520983, 5387299, 5393643, 5463094, 5552588, 5526363, 5393195, 5399264, 5379248, 5198900, 5195456, 5172903, 5140368, 5301126, 5298837, 5328594, 5297366, 5209264, 5032668, 5069346, 5127125, 5085827, 4870248, 4832901, 4898523, 5002766, 5169462, 5052679, 4796389, 4797479, 4656539, 4564246, 4824239, 4977875, 5191584, 4962750, 4712210, 4895315, 4891999, 4877813, 4968925, 4860739, 4616731, 4557712, 4356768, 4400139, 4620822, 4727256, 4703743, 4662632, 4696217, 4696242, 4519016, 4303968, 4313753, 4277233, 4381427, 4230266, 4017411, 4183787, 4383864, 4374770, 4309212, 4480836]
11635D480836J5320l7630j41279K5937K72343R678j98778j74052j83031j23504
11625C945840M0586J22249M8100r4026r7097j7765N3140k33229k6912j3571K72616
11614C999931J41771m219R6508K91426N5499j85798l02109l14732j14223J8862
11604C682916O8790n0996N5861r9253K7447K29474J76918j62056j14769m3511
11594C770821j15032j37997r9007R4755K02783K5493J21914J83736p3322o7968
11584C906176j44865k48291J8740K27161j41110k18346J21505J83473m482J46814
11574C846775j2863j38542j90126k26301j16213M0300K70923q3767j80520L2795
11564C242461Q5946M8172k5172j25871M9224J79811o9530M4466q1043O3750j3076
$$ y = [4480836, 4496156, 4458526, 4317247, 4343184, 4615527, 4625205, 4426427, 4252375, 4069344, 3945840, 3986426, 4108675, 4156775, 4062749, 3965652, 3947887, 4001027, 3767798, 3740886, 3727315, 3999931, 4141702, 4137483, 4233991, 4525417, 4580916, 4395118, 4093009, 3778277, 3664054, 3682916, 3751706, 3700710, 3756571, 3657318, 3684765, 3914239, 4091157, 3929101, 3814332, 3770821, 3655789, 3517792, 3418785, 3513540, 3716323, 3741816, 3863730, 4047466, 3974144, 3906176, 3761311, 3513020, 3531760, 3758921, 3617811, 3399465, 3520970, 3704443, 3699961, 3846775, 3833912, 3695370, 3505244, 3278943, 3162730, 3203030, 3473953, 3390186, 3209666, 3242461, 3328407, 3376579, 3351407, 3225536, 3274760, 3454571, 3385041, 3429507, 3348464, 3412214, 3399138]
11553C399138k6251q7487j6231J82400r1402K3861R3883J17853j15761o6715r0713
11542C322575r5917J57338Q9904K73619J36251k425K04546J26282K34450J82693
11532D629316K14716K60934O0873r7615l36682o1810l18943l68200k15379j9508
11522C747702J81113o6314l36262k45246l7195K0989J31233M5301j07471j39122
11512C194728L8216j23073M3789j7348q2017O9218J65562J11627p4587j17405
11502C208710k09372n3467P5826K4012Q4519q4018q5376j61172j03356j25715
11492B570591K0982J67701j45572k29609J15185L12096N9725Q842m5757m8426
11482B785758O7630J0409l2883J48731j5688q9180n8969o8108l2610N0484K01253
$$ y = [3399138, 3372887, 3285400, 3269169, 3451569, 3360167, 3384028, 3477911, 3595764, 3480003, 3413288, 3322575, 3226658, 3383996, 3473900, 3747519, 3883770, 3881345, 4085891, 4212173, 4446623, 4629316, 4844032, 5104966, 5165839, 5068224, 4731542, 4669732, 4350789, 3982589, 3767210, 3747702, 3928815, 3862501, 3526239, 3280993, 3243798, 3264787, 3396020, 3441321, 3333850, 3194728, 3232944, 3109871, 3153660, 3136312, 3054295, 3123513, 3289075, 3400702, 3326115, 3208710, 2999338, 2945871, 3021697, 3045709, 3130228, 3046210, 2960834, 2799662, 2696306, 2570591, 2591573, 2759274, 2613702, 2384093, 2499278, 2811374, 2871099, 2879941, 2834184, 2785758, 2853388, 2863797, 2830914, 2979645, 2963957, 2874777, 2815808, 2747700, 2715090, 2765574, 2966827]
11471B966827k7097j35589O0769J82288P0198k92156m3181J43719k00465j51477
11461B573836j43539J27230j8802n704J48463J62715o1314j15829j76847j42113
11451B348096q2567K9153Q1419Q6855N4677O9670O7601O9926J21932l236k37510
11440B606016q7041j698q578k19055r4159K19996n9680j72035Q1859K722J38158
11429B406505r6426j68410K11182P7472k55688k1608K39538o5475O4391j1677
11419B379804p91J63354j36976n0319M8620j61118j56805j38511m8325N3091K52669
11408B204693j6104q7765j2677R5543J06301k50235q2867M1956J39257P9781N2086
11397B269969j54043K20741Q9420j80158k57051j20849Q2189l9510L2537O453
$$ y = [2966827, 2939730, 2804141, 2864910, 3047198, 3117396, 2825240, 2782059, 2925778, 2725313, 2573836, 2430297, 2557527, 2538725, 2533021, 2681484, 2844199, 2782885, 2667056, 2490209, 2348096, 2265529, 2294682, 2376101, 2462956, 2517633, 2587303, 2654904, 2724830, 2846762, 2843526, 2606016, 2518975, 2517277, 2508699, 2289644, 2195485, 2415481, 2355801, 2183766, 2265625, 2268347, 2406505, 2310079, 2141669, 2352851, 2430323, 2174635, 2153027, 2392565, 2327090, 2391481, 2379804, 2379013, 2542367, 2405391, 2355072, 2403692, 2242574, 2085769, 1947258, 1898933, 1952024, 2204693, 2188589, 2100824, 2088147, 2183690, 2289991, 2039756, 1956889, 1998845, 2138102, 2217883, 2269969, 2115926, 2336667, 2426087, 2245929, 1988878, 1868029, 1950218, 1910708, 1943245, 1949698]
11387A949698J05105j09505J33194J19919J58582j73165j20087K16013N9598J33082
11377B472434j34618L7509r2803j50647n6426Q5410J22921L8658J1611J97403
11367B531452N8676k83786k75128N8089J27356r2786l7033J81103J20528L9966
11357B428437j51491k46661k86997K9005Q9176J3135L2164K25916J16726Q1722
11347B331132J74153j39118j0561O428p5827j51690l18174k6073J49915p3116
11337A867069N3765J37220J97928j55564j12741j49350j01451L2183J700L0286
11327A801045n2124j2243r7060m8730j49942j26824L22358J42219n8297k56329
11317A464073n7965j97973J33288j01575J57613M3390p4168j5470k32804N455
$$ y = [1949698, 2054803, 1945298, 2078492, 2198411, 2356993, 2183828, 2063741, 2279754, 2339352, 2472434, 2337816, 2375325, 2282522, 2131875, 2075449, 2160859, 2283780, 2322438, 2334049, 2531452, 2590128, 2306342, 2031214, 2089303, 2216659, 2123873, 2086840, 2267943, 2388471, 2428437, 2276946, 2030285, 1743288, 1772293, 1861469, 1874604, 1906768, 2132684, 2249410, 2331132, 2505285, 2366167, 2355606, 2362034, 2286207, 2134517, 1816343, 1790270, 1940185, 1867069, 1920834, 2058054, 2255982, 2100418, 1987677, 1838327, 1736876, 1769059, 1770759, 1801045, 1748921, 1736678, 1639618, 1590888, 1440946, 1314122, 1636480, 1778699, 1720402, 1464073, 1406108, 1208135, 1341423, 1239848, 1397461, 1440851, 1366683, 1351213, 1118409, 1123864]
11307A123864j1553p4385j11926k11672J78828M61046J84024K18917K53177K73052
11297B283372M9252j6551l5284M9828r2590o1811j8221K04267J25887q5037o7115
11286B335997j01371j02159J80547P8230k33728r2836K8014j79424j12572K1288
11276A821986K54349J57898l3041P3627m0383l68815j94191J98316L78695N9519
11266B307960j57505J24537L8340M3659r7059m0739L4836N9885l4256r2594n9334
11255B127730L0591K63238K11751n5034n8125j68206J23124J10200k41562j4535
11245B329172K03903M00O225j12552L0055K43002J70357O5348Q3504p8678J91221
11234C131957j01880k04241J9352M07153L45609K19983J01575R8528j34516P7402
$$ y = [1123864, 1112311, 1037926, 926000, 714328, 893156, 1354202, 1538226, 1757143, 2010320, 2283372, 2332624, 2316073, 2280789, 2330617, 2238027, 2176216, 2157995, 2362262, 2488149, 2403112, 2335997, 2234626, 2132467, 2313014, 2391244, 2157516, 2064680, 2092694, 1913270, 1800698, 1821986, 2076335, 2234233, 2201192, 2274819, 2234436, 1865621, 1671430, 1869746, 2248441, 2307960, 2150455, 2274992, 2313332, 2356991, 2259932, 2219193, 2254029, 2313914, 2279658, 2187064, 2127730, 2158321, 2421559, 2633310, 2578276, 2520151, 2351945, 2475069, 2585269, 2343707, 2329172, 2533075, 2533475, 2539700, 2427148, 2457203, 2700205, 2870562, 2935910, 3019414, 2940736, 3131957, 3030077, 2825836, 2845188, 3252341, 3597950, 3817933, 3919508, 4018036, 3883520, 3960922]
11224C960922j15333n8019K1045j32058k8731J5013j275m9088l38624j62139j5634
11213C096079j71040o1823L42718K67090P9503j63623j0785j7683o3720j27775
11203C168941l9778K7025k0628l07381o3100K20649J03489J303L4406J50330K4059
11192C299315k42270J29704L42426K9397j22883J4651L4695Q7766K92777K8859
11182C894437k55628l9499P5689K46153K89092J70410Q8431M0985P4764K50887
11172D835721J06052J20219J03406n9721m5690m1757O3821J8307L40142L96230
11162E836730O8663K5095J45262J77234L33163J88410J67849M02317L95997K00972
11152G941692M42410M54610L80206O68030P00406K12386M07384O34682R34273
$$ y = [3960922, 3845589, 3787570, 3808615, 3676557, 3647826, 3662839, 3661564, 3612476, 3273852, 3111713, 3096079, 2925039, 2863216, 3205934, 3473024, 3552527, 3388904, 3378119, 3360436, 3296716, 3168941, 3129163, 3156188, 3135560, 2828179, 2765079, 2985728, 3089217, 3090520, 3124926, 3275256, 3299315, 3057045, 3186749, 3529175, 3558572, 3435689, 3450340, 3485035, 3572801, 3865578, 3894437, 3638809, 3599310, 3674999, 3921152, 4210244, 4380654, 4469085, 4510070, 4584834, 4835721, 4941773, 5061992, 5165398, 5105677, 5059987, 5018230, 5082051, 5100358, 5440500, 5836730, 5905393, 5930488, 6075750, 6252984, 6586147, 6774557, 6942406, 7344723, 7740720, 7941692, 8384102, 8838712, 9218918, 9886948, 10587354, 10799740, 11207124, 11841806, 12776079]
11143A2776079P10873J061518J167946J320704J228762J241352J515842J639478
11135B2662554J985567K151967K504243K899801L193725M014961M952155O253712
11127E0618685P490841R637239J2633388J6495024K1385401K7887114L5092295
11120A81239987M1169891M2201731L5257061K4979756J8097393J4659526Q824838
11113C66430183n314152k8032314m5561277m7044097l9038985l1078452k5416109
11106A44944797k0817036j6569349j3206392j0632107q386148o629221n330225
11099F3374319m535082l553683l217342k767857k294545k173665k056647j889700
11091D0885798j647872j524671j716885j548455j512425j386518j154890j154925
$$ y = [12776079, 13486952, 14548470, 15716416, 17037120, 18265882, 19507234, 21023076, 22662554, 24648121, 26800088, 29304331, 32204132, 35397857, 39412818, 44364973, 50618685, 58109526, 67746765, 80380153, 96875177, 118260578, 146147692, 181239987, 222409878, 264611609, 299868670, 324848426, 342945819, 357605345, 366430183, 361116031, 333083717, 287522440, 240478343, 201439358, 170360906, 144944797, 124127761, 107558412, 94352020, 83719913, 75333765, 68704544, 63374319, 58839237, 55285554, 52068212, 49300355, 47005810, 44832145, 42775498, 40885798, 39237926, 37713255, 35996370, 34447915, 32935490, 31548972, 30394082, 29239157]
11083B9239157j137736r07862r39040p89148q42391p75893m39376o72386p93880
11074B1941445p16030p38137l41146l88216m57769n77655o97642m85471l60007
11065A7179372l62438m44580o48555m88011k96864r6245j88564l11581l31554
11056A4010980j32718l475R3603K71709K55277K7035j38387q6693n708q5388j25016
11045A4081219m40345n93486o25115o38160l10379l84109j80337j60070j84005
11036A0565213j19615j02920k19334k3797k65365j99100Q1453k4322k61040m7239
11026I383934j64244j44753N9360j16481k98105j16142j41973k25566k70328L5577
11016H001279j2433K2883J28495L9615k40522k84857j07641j91915k35062p9559
$$ y = [29239157, 28101421, 27193559, 26254519, 25465371, 24622980, 23847087, 23407711, 22735325, 21941445, 21225415, 20487278, 20146132, 19757916, 19300147, 18722492, 18024850, 17539379, 17179372, 16816934, 16372354, 15723799, 15235788, 14938924, 14842679, 14654115, 14342534, 14010980, 13878262, 13874787, 13968390, 14240099, 14495376, 14522411, 14384024, 14297331, 14291623, 14206235, 14081219, 13640874, 13047388, 12422273, 11784113, 11473734, 11089625, 10909288, 10749218, 10565213, 10445598, 10342678, 10123344, 10099547, 9834182, 9635082, 9716535, 9692213, 9431173, 9383934, 9219690, 9074937, 9134297, 9017816, 8719711, 8603569, 8461596, 8236030, 7965702, 8001279, 7988846, 8011729, 8140224, 8179839, 7939317, 7654460, 7546819, 7354904, 7119842, 7040283]
11006G040283L4632j18532j91178k21722p4996J66091O6655j56165m43931j44089
10996E957048j83256j30828p0211k8205n6044J3001j35056O1759j9061k33408
10986E175739l61961k20877j44417j00000J2453o4409m8982k1126j23490j63044
10976C939886m65755j65975J4669J0657o1056m3510K63591J3432k17401j83660
10966C104878o9969o9190n620O1216L2830j03612j89323J14916K09937r2076k84970
10955B709017p0727p5430Q6459O7372q7338p5943r3117j16315J42660P3785j20622
10944B439801N156n2122j53844m1720n5826Q038J89657n5784K8912m6510r9441
10933B166317M8596l8421N3148J16012k0052R4380K95793J28742M0054k3720K03456
$$ y = [7040283, 7074915, 6956383, 6765205, 6543483, 6468487, 6634578, 6701233, 6545068, 6101137, 5957048, 5773792, 5642964, 5572753, 5544548, 5488504, 5501505, 5366449, 5428208, 5409147, 5175739, 4813778, 4592901, 4448484, 4348484, 4360937, 4296528, 4247546, 4226420, 4102930, 3939886, 3474131, 3308156, 3322825, 3333482, 3272426, 3228916, 3492507, 3505939, 3288538, 3104878, 3034909, 2965719, 2960099, 3021315, 3054145, 2950533, 2761210, 2876126, 3086063, 2993987, 2709017, 2638290, 2562860, 2649319, 2716691, 2629353, 2553410, 2460293, 2343978, 2486638, 2560423, 2439801, 2444957, 2392835, 2238991, 2197271, 2141445, 2149483, 2339140, 2283356, 2312268, 2265758, 2166317, 2214913, 2176492, 2229640, 2345652, 2325600, 2419980, 2715773, 2844515, 2884569, 2860849, 3064305]
10922C064305k7335k4876j57425j66131J6733O936O4133K21177N7403l24102l29824
10911B400994K451M4777k9455L5700j29097Q2963k8573j76447j52323k25103K7481
10900A853368J084j49470J36370J03747k15267O7918O3267p2990K28789N6734
10890B073550j70721j27974J2701r7414J84511K25357O6415j5607r3900k01225
10880A855693m0098P2807J17185j2435k1394k32612r6228p237n4154O7324R3170
10869A742021Q417M0733J221J19528J32999j37787j24799o3246N2904K48938R3836
10858B114765p083K72534K580N0237j78292j41716j72458q2979L8871p9404K66
10847A817321K06659J03613R1130J16749L9229j40811j1717l04484k66207L0768
$$ y = [3064305, 3036970, 3012094, 2854669, 2688538, 2705271, 2712207, 2776340, 2997517, 3054920, 2730818, 2400994, 2403445, 2448222, 2418767, 2454467, 2325370, 2408333, 2379760, 2203313, 2050990, 1825887, 1853368, 1854452, 1704982, 1841352, 1945099, 1729832, 1797750, 1861017, 1788027, 2016816, 2073550, 1902829, 1774855, 1787556, 1690142, 1874653, 2100010, 2166425, 2150818, 2056918, 1855693, 1815595, 1888402, 2005587, 1993152, 1971758, 1739146, 1642918, 1635681, 1581527, 1648851, 1742021, 1750438, 1791171, 1792392, 1911920, 2044919, 1907132, 1782333, 1719087, 1771991, 2020929, 2114765, 2107682, 2380216, 2382796, 2433033, 2254741, 2113025, 1940567, 1857588, 1896459, 1817055, 1817321, 2023980, 2127593, 2218723, 2335472, 2374701, 2233890, 2222173, 1917689, 1651482, 1682250]
10837A682250k3979J20878j18051j35166J52677m982L4496j90537j47699J36145
10827A506032j11351j6808L8474k3363M5249K14991m505N8872L9984j49300j19199
10816A479076k50665k31222n222P4427J93247K33007k4153j74006J01327Q0539
10806A476355L8655j53578j56721K2707M7830O292j2965j13187P6359n9179n6282
10795A116286j0018j01995n6310n1364o0880p9800o1376O2135R7267j7292K9865
10784H66518Q1413j55118o5544p940O3690J50606R9675r4050j01777r5080o6094
10773F76299q1079O5784j04259n437J38649L40199M25012P4591n6725J17669P4106
10762A664809k26407p5297J00501J14459J04044K70556J00623j01161j1131j23757
$$ y = [1682250, 1658271, 1779149, 1661098, 1525932, 1678609, 1673627, 1708123, 1517586, 1369887, 1506032, 1394681, 1377873, 1416347, 1392984, 1438233, 1653224, 1648719, 1707591, 1747575, 1598275, 1479076, 1228411, 997189, 991967, 1066394, 1259641, 1492648, 1468495, 1294489, 1395816, 1476355, 1515010, 1361432, 1204711, 1227418, 1275248, 1281540, 1268575, 1155388, 1231747, 1172568, 1116286, 1106268, 1004273, 947963, 896599, 835719, 755919, 694543, 756678, 853945, 836653, 866518, 947931, 792813, 727269, 719329, 783019, 933625, 1033300, 939250, 837473, 742393, 676299, 595220, 661004, 556745, 551308, 689957, 1030156, 1455168, 1529759, 1473034, 1590703, 1664809, 1438402, 1363105, 1463606, 1578065, 1682109, 1952665, 2053288, 1952127, 1940996, 1817239]
10752A817239j5240K59891J99491r4248k07888j36076M381P1780L0694j33374
10742A796650j67808J2717L42083J54131J2001m3926m8334q3986J27035j1875
10732B088688L2066J82815m6864j64619Q362J7375K2413l0443j4553k24055n4975
10721A816210O2629K0151J75102J65958J39167l24K4355J95527R5813l4943p8245
10710B581400k31628k70421Q8319L47574K08857J18129R9314J54317O529J57974
10700C260364K11050K79295K76243K53904K55398J78586O1105N5674j46823j93684
10690D491112o4032j13884k63482l59164J269P4922j25258j61308K8751p5784
10680C433142j27114Q8854R8133L43687K94655j18801j07546O4471q1770q5107
$$ y = [1817239, 1801999, 2061890, 2261381, 2167133, 1959245, 1823169, 1827550, 1899330, 1930024, 1796650, 1628842, 1641559, 1983642, 2137773, 2149774, 2105848, 2057514, 1973528, 2100563, 2088688, 2120754, 2303569, 2256705, 2092086, 2100448, 2117823, 2140236, 2109793, 2095240, 1871185, 1816210, 1878839, 1898990, 2074092, 2240050, 2379217, 2378893, 2403248, 2598775, 2694588, 2659645, 2581400, 2349772, 2079351, 2167670, 2515244, 2724101, 2842230, 2941544, 3095861, 3102390, 3260364, 3471414, 3750709, 4026952, 4280856, 4536254, 4714840, 4775945, 4831619, 4684796, 4491112, 4427080, 4313196, 4049714, 3690550, 3691819, 3766741, 3641483, 3480175, 3508926, 3433142, 3306028, 3394882, 3493015, 3836702, 4131357, 4012556, 3905010, 3969481, 3887711, 3802604]
10670C802604o9494p4370J03639K8586o4470L0633N8068K11879m4136n5913N0811
10659C977837J13714K35803K15895q530K56057Q2226j48191J52713M12531K94558
10649E584613R5692K38311L05455K30860L19540K79818M11324K40872P085J04484
10639G818054P7802K65011K80102J84413J83718J71993M61574P96847Q67334R50170
10629A2057018J105906J324794J284694J300763J198109J132415J199895J167719
10621B1771313J307117J392622J511433J870433K481591L495797M754923O130350
10613D4715579P924956R894835J0939481J1454019J1003623R836500R182308Q712273
10605A23663574P801395O212197M356231M432918P421041J2470970J6835879J8172183
$$ y = [3802604, 3733110, 3658740, 3762379, 3790965, 3726495, 3757128, 3815196, 4027075, 3982939, 3927026, 3977837, 4091551, 4327354, 4543249, 4534719, 4790776, 4873002, 4724811, 4877524, 5290055, 5584613, 5680305, 5918616, 6224071, 6454931, 6774471, 7054289, 7465613, 7706485, 7713570, 7818054, 7895856, 8160867, 8440969, 8625382, 8809100, 8981093, 9442667, 10239514, 11106848, 12057018, 13162924, 14487718, 15772412, 17073175, 18271284, 19403699, 20603594, 21771313, 23078430, 24471052, 25982485, 27852918, 30334509, 33830306, 38585229, 44715579, 52640535, 62535370, 73474851, 84928870, 95932493, 105768993, 114951301, 123663574, 131464969, 137677166, 142033397, 146466315, 153887356, 166358326, 183194205, 201366388]
10597B01366388J6588338J4254835J2834564J1736219R143858L436497l106081
10590B66254618m460069R06610R531450J6783918J9024680J6568902J2655463
10583C37265572J0140365P878157K096483q703812j9708087k3491514j8253298
10576B87223866r203536j627218J832465J559146n08968j696946k997561o613628
10568B67967620j3712487k0454115k2383252j8636604j2304772p389141m959372
10561A68127877l920877m319158m664192n618738p778881j0523809j3030128j3671759
10553A04600335j2291879r885073p671619o248465m849740l703311k967835k661770
10545E4320643k561291k167169j749753j386399j421487j015391r81534r22979
$$ y = [201366388, 217954726, 232209561, 245044125, 256780344, 265924202, 269360699, 266254618, 261794549, 262701159, 272232609, 289016527, 308041207, 324610109, 337265572, 347405937, 355284094, 357380577, 348676765, 328968678, 305477164, 287223866, 278020330, 276393112, 278225577, 279784723, 279275755, 277578809, 274581248, 267967620, 254255133, 233801018, 211417766, 192781162, 180476390, 173087249, 168127877, 164207000, 159887842, 155223650, 149604912, 141826031, 131302222, 118272094, 104600335, 92308456, 82423383, 74751764, 68503299, 63653559, 59950248, 56982413, 54320643, 51759352, 49592183, 47842430, 46456031, 45034544, 44019153, 43037619, 42114640]
10537D2114640j061326j029409p69691q50231r22907r39994q05582q14718r80094
10528C3940688r67422q47727q56675r34990j095329p52398p59621p22488m00561
10519B6603477k24785l23182n70721n11116k51877k12521k34442k60515l05807
10510B3708511j22206K30787J02334k86209n5119L66588N02052M90043N83060
10501B5519841P38713R79865J202660J442691J759559J735443K173385K298701
10493C7850858K174721K092784J896460J477609J071259N11008j95873o78360
10485D6200466j175734j744632k127141k211851j999181k135338k205410j494859
10477C1106320j379434j297138j055353q52798m99465n48176l95458m64337j81007
$$ y = [42114640, 41053314, 40023905, 39254214, 38403983, 37481076, 36541082, 35735500, 34920782, 33940688, 32973266, 32125539, 31268864, 30333874, 29238545, 28486147, 27726526, 27004038, 26603477, 26378692, 26055510, 25484789, 24973673, 24721796, 24509275, 24274833, 24014318, 23708511, 23586305, 23817092, 23919426, 23633217, 23578098, 23944686, 24446738, 24936781, 25519841, 26258554, 27238419, 28441079, 29883770, 31643329, 33378772, 35552157, 37850858, 40025579, 42118363, 44014823, 45492432, 46563691, 47074699, 46878826, 46200466, 45024732, 43280100, 41152959, 38941108, 36941927, 34806589, 32601179, 31106320, 29726886, 28429748, 27374395, 26521597, 26022132, 25473956, 25078498, 24614161, 24433154]
10468B4433154j36092M7701J37533J24293R5620M77432M79269O33797O54608Q65735
10458B7813050J066480J403191J887227K266880K708816L358651M013775M354471
10450D8872541N027002N764370O233034O550497O499688N766181M231305K983895
10442I1928513J185806p06344k646923m591702o016831p143962p438723o666453
10434E7903381n821838m986387m124404l149473k591513k254720j934444j685772
10426C1354830j356195j155156j134359q44825o31814o61634m02081q6265j62481
10417B4920020j68837n7818K13107K42404L3575N32875P51415R30494J270172
10408B8667407J635843J926641K168649K628586K775443K850568K890019K529037
$$ y = [24433154, 24297062, 24344763, 24482296, 24606589, 24702209, 25179641, 25658910, 26292707, 26947315, 27813050, 28879530, 30282721, 32169948, 34436828, 37145644, 40504295, 44518070, 48872541, 53899543, 59663913, 65896947, 72447444, 78947132, 84713313, 88944618, 91928513, 93114319, 92407975, 89761052, 85169350, 79152519, 72008557, 64569834, 57903381, 52081543, 47095156, 42970752, 39821279, 37229766, 34975046, 33040602, 31354830, 29998635, 28843479, 27709120, 26864295, 26232481, 25570847, 25168766, 25082501, 24920020, 24751183, 24693365, 24906472, 25148876, 25182451, 25715326, 26466741, 27397235, 28667407, 30303250, 32229891, 34398540, 37027126, 39802569, 42653137, 45543156, 48072193]
10400D8072193K334217J911581J059423P8359p25801j451519k241968k857692
10392D6178793l197551l385580l401686k936339k678588k418437k212565j851450
10384B4096597j316803j256483j278573j165766q85366j074815q94287m97347
10376A5727157l55779n87747o11290m77721l79139m46466m79795o73809n85381
10367A1130030l47745j99333k30202l27155k07390k83310j08476j16504k16755
10358I093160l88618l63875m07615k18629p2294j73858l43027k23637n167j98810
10348F697630N192j28725k30230j27621j64475q1550k04774k56543J10908J6627
10338E636439j30257j24033q0637l09966j57281j5733L4041j22387l09792o9835
$$ y = [48072193, 50406410, 52317991, 53377414, 53455773, 52729972, 51278453, 49036485, 46178793, 42981242, 39595662, 36193976, 33257637, 30579049, 28160612, 25948047, 24096597, 22779794, 21523311, 20244738, 19078972, 18193606, 17118791, 16224504, 15727157, 15371378, 14783631, 14172341, 13694620, 13315481, 12869015, 12389220, 11715411, 11130030, 10782285, 10582952, 10352750, 10025595, 9818205, 9534895, 9426419, 9309915, 9093160, 8704542, 8340667, 7933052, 7714423, 7642129, 7468271, 7125244, 6901607, 6896440, 6697630, 6702822, 6574097, 6343867, 6216246, 6051771, 5970221, 5765447, 5508904, 5619812, 5636439, 5506182, 5382149, 5301512, 4991546, 4834265, 4818532, 4852573, 4730186, 4420394, 4350559]
10328D350559J07194Q1809j19174o3454M4167l82980l15128p055L5535K0063j21919
10317C629617p1610O8057P8569k01213k79908k4342r6281j25868k63975n2513
10307B660533L67514J51530k44189n2237J57560n2201r2681l4893j95859l07754
10297B357323J2932N8342k22j92464L2713L3371N2384j50928q1887J50159J98519
10286B470242j08304m6862J40811p6352n3761L3736j21328l49032p0213N3278
10276A872215k10848k1821r7021K1235J41955l0403K1102n7499r9007o8004J28246
10265A600150K42357J19566k77375p3249R444M8870j50865j53518n4175J34823
10255A446028q1204j57162Q5647J44680j53896P458L6938K52698N4019K4269L2297
$$ y = [4350559, 4457753, 4539562, 4420388, 4356934, 4401101, 4018121, 3702993, 3695938, 3731473, 3751536, 3629617, 3558007, 3626064, 3704633, 3503420, 3223512, 3199170, 3102889, 2977021, 2713046, 2660533, 3028047, 3179577, 2935388, 2883151, 3040711, 2988510, 2895829, 2860936, 2665077, 2357323, 2370255, 2428597, 2428375, 2235911, 2268624, 2301995, 2354379, 2203451, 2121564, 2271723, 2470242, 2361938, 2315076, 2455887, 2379535, 2325774, 2359510, 2238182, 1889150, 1818937, 1872215, 1661367, 1639546, 1542525, 1563760, 1705715, 1675312, 1696414, 1638915, 1539908, 1471904, 1600150, 1842507, 1962073, 1684698, 1611449, 1620893, 1669763, 1518898, 1365380, 1311205, 1446028, 1364824, 1207662, 1293309, 1437989, 1284093, 1291551, 1328489, 1581187, 1635206, 1659475, 1691772]
10244A691772k08843j31647m4061j13072j29204k60935J21113J40803Q0442k8021
10234A118347o5205k4685J10406J26451n5148j55150r53J36135R7498p4241M0688
10223A254143n8009j37809o1636K9983K4102J19777j31748k08703q8028K31746
10213I73818n2798j78986L3808j93532n9451J72326J50044J69096Q2554Q576j677
10202A103778j769K9621N2269j08292k13685j98011L246J6641j2345J51725P7801
10191I00979p7033N9622j5221L0127J12879O995o3139J37345m6808j47475O3728
10180I61999p9077N4722j82607q9890K01430J45586J81894q3262k93505k4283
10170G93007K81522J36057j03413J79119M14919J20730j0202J4251j21674m6943
$$ y = [1691772, 1482929, 1351282, 1307221, 1194149, 1064945, 804010, 925123, 1065926, 1146368, 1118347, 1053142, 1028457, 1138863, 1265314, 1210166, 1055016, 1054063, 1190198, 1287696, 1213455, 1254143, 1196134, 1058325, 996689, 1026672, 1050774, 1170551, 1038803, 830100, 742072, 973818, 921020, 742034, 775842, 582310, 522859, 695185, 845229, 1014325, 1096879, 1105455, 1103778, 1102009, 1131630, 1183899, 1075607, 861922, 663911, 667157, 683798, 671453, 823178, 900979, 823946, 883568, 868347, 898474, 1011353, 1018348, 955209, 1092554, 1045746, 898271, 961999, 882922, 937644, 755037, 665147, 866577, 1012163, 1194057, 1110795, 817290, 793007, 1074529, 1210586, 1107173, 1286292, 1701211, 1821941, 1811739, 1825990, 1704316, 1657373]
10160A657373J21954J03754K6595j266N5384l2812m8456j45457J5715J06395P7587
10149A936766K99113K09604R3829j3120k24248j38603m5407J991j72239O333j10325
10138A843694J9664o3169j52774o384J20126J9079j01575o5224k5143j37652k17322
10127A233320R6926K2516k64545j51848j83660M8577K86512N6937k22628q8844
10117H33263L1315j54434P8588Q3946k4833L0016R7570k6716j29829l19123J29448
10106F29211J54019m8676M3111j50436K7972L4226j10264m5138n0297l0751R1190
10095E44167o4649k92611P485L3773n0447l6739J57260J88303Q3815n9798j03632
10084D06927j58637K21438J72350J7868m3377j40298l8263o9651P8854M0206J18380
$$ y = [1657373, 1779327, 1883081, 1909676, 1908410, 1963794, 1930982, 1882526, 1737069, 1752784, 1859179, 1936766, 2235879, 2445483, 2539312, 2526192, 2301944, 2163341, 2117934, 2119925, 1947686, 1954019, 1843694, 1863358, 1800189, 1647415, 1641031, 1761157, 1780236, 1678661, 1613437, 1588294, 1450642, 1233320, 1330246, 1352762, 1088217, 936369, 752709, 801286, 1087798, 1144735, 922107, 833263, 864578, 710144, 788732, 872678, 847845, 877861, 975431, 948715, 818886, 499763, 629211, 783230, 734554, 777665, 627229, 655201, 689427, 579163, 534025, 483728, 452977, 544167, 479518, 186907, 194392, 228165, 177718, 140979, 298239, 486542, 570357, 510559, 406927, 248290, 469728, 642078, 659946, 616569, 476271, 438008, 368357, 447211, 487417, 605797]
10073F05797P3039j283q6735j42831M5665J9376M7130j84105j37691m4676n0621
10062A43065M708K99355l5610q8454J32309J19134L0366P0546l2477p7136q1901
10051D83905O8795N5529n6306o0416J31356J6027q205J90517J70993l4835j94237
10040G63123L8296J26286k3047P8552j32063j83163N1824J56843J97938j16440
10030I58149j14237q0051M0379j02835r5280R924J7177j02434j93621k48918O1155
10019A49408K75616J55773M2619j40422K6369J45487N3993q1434J04436p8587
10009F53258j9158M300P739K8817p6349j24104m5746J60541k1574J65759K17638
9998I51121J44628J72702n00k89833k68334j68492K17798j79572p8915J18438
$$ y = [605797, 678836, 677553, 590818, 447987, 493652, 513028, 560158, 376053, 238362, 193686, 143065, 147773, 447128, 411518, 323064, 455373, 574507, 604873, 675419, 642942, 565806, 483905, 552700, 608229, 551923, 491507, 622863, 638890, 630685, 821202, 992195, 957360, 763123, 801419, 927705, 904658, 983210, 851147, 667984, 719808, 876651, 1074589, 958149, 843912, 763861, 804240, 701405, 606125, 616049, 633226, 530792, 337171, 88253, 149408, 425024, 580797, 623416, 482994, 509363, 654850, 708843, 627409, 731845, 653258, 634100, 638400, 646139, 674956, 598607, 474503, 428757, 589298, 567724, 733483, 951121, 1095749, 1268451, 1267951, 978118, 709784, 541292, 759090, 579518, 500603, 619041]
9988F19041O6314J2030L6808J04807J0594J86410m2067j8498Q1016J95319N6423
9977A308197P79m2515R0541J28379O3624Q3941Q4228k45726k75278J0419n40J55400
9965A361449K21973k01217k1406J06461j3660k22226M5249J53860J31067K21672
9955A783222p244L9605J06872O036j11209r5017j1076j32347l3356J10576J67309
9944A823371J62936J31398M7063m5928J53730r7136o6009K78095L07901j497K72337
9933B966261L20184K12008K34459K38400K64929J04653M21845M28992J83646J68366
9923E543743J87061K40355L51662N91535L63117M73484M03765M00719L06731M15410
9913I277582L06848N03422N80927N68559N24032N29918L39280L16489O2964j98914
$$ y = [619041, 685355, 697385, 734193, 839000, 849594, 1036004, 993937, 975439, 1056455, 1251774, 1308197, 1308976, 1266461, 1357002, 1485381, 1549005, 1632946, 1717174, 1471448, 1196170, 1206589, 1206049, 1361449, 1583422, 1382205, 1360799, 1467260, 1453600, 1231374, 1276623, 1430483, 1561550, 1783222, 1775978, 1815583, 1922455, 1928491, 1817282, 1722265, 1711189, 1578842, 1545486, 1656062, 1823371, 1986307, 2117705, 2164768, 2118840, 2272570, 2175434, 2109425, 2387520, 2695421, 2693924, 2966261, 3286445, 3498453, 3732912, 3971312, 4236241, 4340894, 4762739, 5191731, 5375377, 5543743, 5730804, 5971159, 6322821, 6914356, 7277473, 7750957, 8154722, 8555441, 8862172, 9277582, 9584430, 10087852, 10668779, 11237338, 11761370, 12291288, 12630568, 12947057, 13010021, 12811107]
9903A2811107j52807k07983j01791p7315m06013l19168l43467l46527j38502l31772
9893A0385762l59143j85454r843J16094L28602q0956K37561J81451j4606L05158
9883A0904626M99268N05114O66879N05499M95163P88044Q06274Q37920J183859
9874A7192646J091790J166831J351663J296981J570431J618346J626286J445073
9866B8360047J454772J462803J495985J282313J003717P78732O07246M13870j04666
9857C6754819m73340o13498n56354o05500p17946j011737j250304j101892r86770
9848B9437478j192661j141489q95651q23398p58416p46410q85332m06090l33784
9839B2254247l88360l05700k061J18478K53007M67589M41472O88405O86360R11573
$$ y = [12811107, 12658300, 12450317, 12348526, 12271211, 11865198, 11546030, 11202563, 10856036, 10717534, 10385762, 10026619, 9841165, 9831322, 9947416, 10276018, 10195062, 10432623, 10614074, 10599468, 10904626, 11403894, 11909008, 12575887, 13081386, 13576549, 14364593, 15170867, 16008787, 17192646, 18284436, 19451267, 20802930, 22099911, 23670342, 25288688, 26914974, 28360047, 29814819, 31277622, 32773607, 34055920, 35059637, 35838369, 36445615, 36859485, 36754819, 36281479, 35667981, 35111627, 34506127, 33788181, 32776444, 31526140, 30424248, 29437478, 28244817, 27103328, 26207677, 25384279, 24625863, 23879453, 22994121, 22588031, 22254247, 21865887, 21560187, 21558126, 21676604, 21929611, 22397200, 22838672, 23527077, 24213437, 25125010]
9829B5125010J252042J411986J206127J296232J578161J602752J795138J788845
9821C7056293J523739J427934J511881J488959J258016J140320R24269N96879
9813D6928290M76550M77749L01579l99052m06954p61065r74323j212293j585141
9804D2845340j865470k078311j696100j584194j613298j805466j640811j462344
9796B9099346j469559j268457j137570j105176n99211l42514n33629m92431k80430
9787B1870369k97442j50036N0416K70062Q9643K96281M42137N80506N58773O93477
9777B4404186O60684O48444P45487J024552R94685R32963J022493P92554Q13482
9768C2039530P93835M39450K30931J32587J9866n22264q35781j146385j012367
$$ y = [25125010, 26377052, 27789038, 28995165, 30291397, 31869558, 33472310, 35267448, 37056293, 38580032, 40007966, 41519847, 43008806, 44266822, 45407142, 46331411, 46928290, 47404840, 47882589, 48184168, 47785116, 47378162, 46617097, 45642774, 44430481, 42845340, 40979870, 38901559, 37205459, 35621265, 34007967, 32202501, 30561690, 29099346, 27629787, 26361330, 25223760, 24118584, 23519373, 23176859, 22643230, 22150799, 21870369, 21572927, 21422891, 21473307, 21743369, 21833012, 22129293, 22571430, 23151936, 23710709, 24404186, 25064870, 25713314, 26458801, 27483353, 28478038, 29411001, 30433494, 31226048, 32039530, 32833365, 33272815, 33503746, 33636333, 33656199, 33133935, 32298154, 31151769, 30139402]
9759C0139402j248631j580343j581434j417454j295760j331047j263231j321692
9751A9099810j239182q56765q28722j069078p72705n34325m65241n39002l21360
9742A2473430l26515l35243m46894j84220j05134k40415k41073k67293j83791
9733A0142852n932n8098O6547L128Q9391L68745J78221r0416J00884O2675O6510
9722A0924507J05374K55227J72007n7960q6910j57009k68351k57765m73715p46251
9712I409154m66153l74254l57129n30843n82313o27942m62222k00240O277J7914
9702E832249j46077k77951l86817k70071k66967j20467q5842l20159p2776j1837
9692C873285Q055j2980j14382p4663k28537k3080j2058o2340j16061j57786j58607
$$ y = [30139402, 28890771, 27310428, 25728994, 24311540, 23015780, 21684733, 20421502, 19099810, 17860628, 17003863, 16175141, 15106063, 14333358, 13799033, 13333792, 12794790, 12473430, 12146915, 11811672, 11364778, 11180558, 11075424, 10835009, 10593936, 10326643, 10142852, 10136920, 10078822, 10145369, 10148497, 10237888, 10606633, 10784854, 10694438, 10795322, 10857997, 10924507, 11029881, 11285108, 11457115, 11399155, 11312245, 11155236, 10886885, 10629120, 10155405, 9409154, 8943001, 8568747, 8211618, 7680775, 7098462, 6470520, 6008298, 5808058, 5814335, 5832249, 5686172, 5408221, 5021404, 4751333, 4484366, 4363899, 4278057, 3957898, 3885122, 3873285, 3881340, 3868360, 3753978, 3679315, 3450778, 3427698, 3415640, 3353300, 3237239, 3079453, 2920846]
9681B920846n7349J59951R443O080k9424l65458k41393l91181J9708O1390K62845
9670B355458N7055m0994j6590j1467j48943o6883k30121k37418J72811O4263j11898
9659A785273j17241j6631J45270M7613K9901k7897j57841j92602J43015L03961
9649A942821q5434J634L99148n6082j36444p6245M4374O8634M129k73832k71260
9638A561443m859q3756k68894j93834L6079K01420K237k16823j36744R5982J60111
9627A152362o1419k9918K7142M4850n4771l5582J35550n830l85863l9630l2415
9616G14476q755l4903O5412k11217k4333j5474j24333m458m2265K05872L23651
9605H43673Q9050l6990k08815K0351j66197J67857K14642j02339o4224K721P7442
$$ y = [2920846, 2863497, 3023448, 3032891, 3038971, 3009547, 2644089, 2402696, 2011515, 2031223, 2092613, 2355458, 2412513, 2371519, 2354929, 2343462, 2194519, 2127636, 1897515, 1660097, 1832908, 1897171, 1785273, 1668032, 1651401, 1796671, 1844284, 1874185, 1846288, 1688447, 1495845, 1638860, 1942821, 1857387, 1859021, 2258169, 2202087, 2065643, 1989398, 2033772, 2102406, 2106535, 1832703, 1561443, 1556584, 1472828, 1203934, 1010100, 1046179, 1247599, 1249836, 1033013, 896269, 992251, 1152362, 1090943, 1061025, 1088167, 1133017, 1078246, 1042664, 1178214, 1172384, 786521, 746891, 714476, 705721, 670818, 736230, 525013, 500680, 485206, 360873, 356415, 314150, 520022, 843673, 932723, 895733, 686918, 707269, 541072, 708929, 923571, 821232, 757008, 759729, 837171]
9594H37171L3987l6704j99486J36617m0101j01378K4310k10238k19726j47347
9584G7105J6191L15169N6301j87068M0807n2784J02667L6632k4113L9559L3738
9573D54204L4450q1970j03386j6871j92118k21380J12334O2936L18661K29406
9563E96266k18104j86260J21568K90414j7425l0749l03340j37805M2717J08660
9553B65942J68468Q3474O1506r2771k28685j38361L1311J07943l0211N3961J61052
9542D43629J34147j61723l27961k26033K13084P5382k47995K0711K97277L10600
9532E31118r2697j97810m4886J7738K2178n84n2807q5862j63342n1662K23433
9521A04817J966l7337J99582J11720o7716l5747k63991p5554K37383J22109L4754
$$ y = [837171, 871158, 834454, 634968, 771585, 731484, 630106, 654416, 444178, 224452, 77105, 93296, 408465, 464766, 277698, 318505, 265721, 368388, 405020, 380907, 420466, 454204, 488654, 406684, 303298, 286427, 94309, -127071, -14737, 48199, 366860, 596266, 378162, 191902, 313470, 603884, 586459, 555710, 252370, 114565, 157282, 265942, 434410, 517884, 579390, 486619, 257934, 119573, 150884, 258827, 228616, 282577, 443629, 577776, 416053, 88092, -137941, 75143, 150525, -97470, -76759, 220518, 531118, 438421, 240611, 195725, 213463, 235641, 235057, 182250, 96388, -66954, -118616, 104817, 106783, 69446, 269028, 380748, 313032, 277285, 13294, -62260, 175123, 297232, 331986]
9510C31986l13521o9053q0225q0167L1559K04373k4946J76024K05529j32293j90550
9499E8716O4559k8273J00714P6817j86298j50025o1070Q0090q8294l1735L5650
9488a29149J64713J40229j87938o8852j04916M7572K21051K423P6195m4610Q7541
9477B04259n8597J01259m14k15759J17250Q9486O0681k8905k38211J13647K28075
9466C72771j06183j63024j75214P9574j32071M7477J66774J30608N9888o4450
9456B16150j47685j5867J64076K70237l0604j19347J63695R0447l70113N8890
9446B79879j16605k12163o6121R3537K07728o4481K9827P8455j2648J12217N7759
9435C87384j34654l3287j19305J37812l6316p9357K18019J7824n8344P0594K0287
$$ y = [331986, 18465, -50588, -130813, -210980, -179421, 24952, 6, 176030, 381559, 249266, 58716, 123275, 95002, 195716, 272533, 86235, -63790, -124860, -44770, -133064, -164799, -129149, 35564, 175793, -12145, -80997, -185913, -138341, 82710, 85133, 161328, 116718, 204259, 145662, 246921, 246507, 30748, 147998, 237484, 298165, 269260, 31049, 144696, 372771, 266588, 103564, -71650, 7924, -124147, -76670, 90104, 220712, 280600, 216150, 68465, 52598, 216674, 486911, 456307, 336960, 500655, 591102, 220989, 279879, 163274, -48889, -115010, -21473, 186255, 121774, 151601, 230056, 217408, 329625, 387384, 252730, 219443, 100138, 237950, 201634, 122277, 340296, 358120, 299776, 370370, 390657]
9424C90657j52988r692o2866J05389j3361j28091J28197J96611K3883k18417n074
9413B54248j79078p4556J36276O8915k76629j22322m3411J06496P2433l9615j6143
9402a13386l9511Q7476K3998J59274K26163K0395k41k9123p8444J11719r6649
9391B71671j23615k0486K49897J01417m9812j0341k60713r8864R2987j45259j6690
9380i808J52825O33P4039p6296q8038k93972Q5374J84361K11613l0588Q0084n1434
9368B38793k77053K24090K77317m9531l02912j14647P7355P2359o6618q0753k06516
9357b08116K4984J07486J2768n1367k1451J29068J81604L2849J60306k6520J5268
9346C56879j59753k05407J19471J89886J31269j83390j18067O0589J58366L2838
$$ y = [390657, 237669, 227977, 165111, 270500, 257139, 129048, 257245, 453856, 477739, 259322, 254248, 75170, 614, 136890, 205805, -70824, -193146, -236557, -130061, -57628, -97243, -113386, -152897, -65421, -41423, 117851, 344014, 364409, 364168, 335045, 256601, 368320, 271671, 148056, 127570, 377467, 478884, 429072, 418731, 158018, 59154, 152141, 6882, -9808, 143017, 143650, 217689, 141393, 53355, -240617, -155243, 29118, 240731, 210143, 290227, 238793, -38260, 185830, 463147, 413616, 110704, -3943, 73412, 145771, 79153, -1600, -208116, -183132, -75646, -62878, -114245, -135696, -6628, 174976, 207825, 368131, 341611, 356879, 197126, -8281, 111190, 301076, 432345, 248955, 130888, 191477, 349843, 382681]
9336C82681k5803o6757p7628j8091k45334Q5926J10631k08492j49683J46576J49397
9325H3423K31193J6844p3675j03052L210k64502m7353J85083n9490j21020j7147
9314a66486J25704r0096j10786j1837J19068m2093J9962J65657L68842o8994m16335
9303a07394j00139Q0737J25342K02016L7125K1667j51837k22111L1391Q0291N0569
9292D7657P991M2011K5402O4358r7944j65181j03705k10531q063J35998K91609
9281B9602k1096O4819j81061j00196J76550J08070m412K00619J09542l4675j00308
9270B47454j56692j64097k5103P6506L2032j21397J24738l7148j07572m2955K2322
9259a51912R3168J99484J18407j71556Q0416p9413j38405l4840j21974R0896L9873
$$ y = [382681, 356878, 290121, 212493, 194402, -50932, 34994, 145625, -62867, -212550, -65974, 83423, 314616, 331460, 257785, 154733, 157943, -106559, -153912, 31171, -28319, -149339, -166486, -40782, -130878, -241664, -253501, -134433, -176526, -156564, 9093, 377935, 308941, -107394, -207533, -126796, -1454, 200562, 237687, 259354, 107517, -114594, -83203, -2912, 47657, 55648, 97659, 123061, 187419, 89475, -75706, -179411, -389942, -398005, -262007, 29602, 8506, 73325, -107736, -207932, -31382, 76688, 72276, 272895, 382437, 347762, 247454, 90762, -73335, -98438, -21932, 10100, -111297, 13441, -23707, -131279, -174234, -151912, -58744, 140740, 259147, 87591, 168007, 88594, -49811, -84651, -206625, -115729, -75856]
9248g5856k52333M5448J1671J41629j0719l5143Q9415J36617K1645k53254p1203
9237b52083j62722J3481K08816J86807K05656j36977q1226j10542m7063J35684
9227d0169O5481j67625k12018P0787j9204p3029L16509K71865j12264k01183l995
9216a04845J3891k8408r1819L4021Q1339m1538k09662K2206K48893r7582R1645
9205h1859R6145k6603j15703j94858L1644Q2478J08359j0921j54232P163M7594
9194b10793m4952N5175J2088P5033L4306R0271J07703J15507j06829p0793j051
9183E5665j14582m8037K850k14979M0294J48531J42060J17426k68867j66461M5368
9172b60732J61994L6465J04005O2880j5475j49692k68466j39532k0985M26787
$$ y = [-75856, -328189, -282741, -271070, -129441, -140160, -175303, -85888, 50729, 72374, -180880, -252083, -414805, -401324, -192508, -5701, 199955, 62978, -18248, -128790, -175853, -40169, 25312, -142313, -354331, -283544, -302748, -375777, -59268, 212597, 100333, -100850, -104845, -90954, -119362, -211181, -177160, -95821, -137359, -347021, -324815, -75922, -173504, -81859, 14286, -12317, -128020, -322878, -291234, -208756, -100397, -111318, -265550, -258387, -210793, -255745, -200570, -188482, -113449, -79143, 11128, 118831, 234338, 127509, 56716, 55665, -58917, -106954, -104104, -319083, -278789, -130258, 11802, 129228, -139639, -306100, -260732, -98738, -62273, 41732, 104612, 89137, -60555, -329021, -468553, -489538, -62751]
9162f2751J53074q8867j28782p5934J18144O73J39680M2638k43826k58871M6237
9151c58585K57128j7740M2211L4032j03375J53580N9148l5376m0098j8289Q902
9140a8462k548j2337j65626k0737O1044J8365j29249J33479J9738r3714q6156
9129b96203J13126L9879m0403P8642L5574J02019J6103J6262j8314p0181J48493
9118A24997K963l3233o1789j80846K257J42069P2039j8987k08697K5122J33982
9107a23O0790k06535M68J32914m3805J9797J46868m1526n4404P3798j66935m4942
9095a23635J24266j8663r1620j6545N7413J63965R820p2889k6244o5567k02859
9084b62558M5756L98581K47362j75527j74627K8708J00299M5341j2098J50023
$$ y = [-62751, 90323, 1456, -127326, -203260, -85116, -84443, 55237, 97875, -145951, -404822, -358585, -101457, -119197, -76986, -42954, -146329, 7251, 66399, 31023, -9075, -27364, -18462, -21010, -33347, -198973, -219710, -158666, -140301, -269550, -136071, -116333, -210047, -296203, -183077, -143198, -183601, -104959, -69385, 32634, 48737, 64999, 46685, -23496, 124997, 127960, 94727, 32938, -147908, -145651, -3582, 68457, 49470, -159227, -134105, -123, 60667, -145868, -145400, -12486, -56291, -36494, 110374, 68848, 14444, 88242, -78693, -123635, 631, -18032, -109652, -126197, -68784, 95181, 105001, 32112, 5868, -59699, -262558, -216802, 181779, 429141, 253614, 78987, 107695, 207994, 253335, 241237, 391260]
9074C91260q1717l2741l7621J04709M9383M2284P0546J61210J218r1510r7757
9063D79264J97578J69113M2127R3841p3749j33709j1230J31793l52J33860k8402
9052A000134l27578m03968j94352K9247r4744J94438O4955K04504M6187j70063
9042C48760j12763J58730p5754P9612O4341l9337j35923j0969j69534Q9372K9431
9031B25966Q4211J5707K11518L62027L10151K59477L65910J25629K11826J61779
9021B334201J8218j3890J46810K66257K03630k7614o0363m3462j05057k05618
9011B513112l63732k27040l31644k24438j68378J11165J10306k4575l9245P2064
9001A427595l6516K8199R4180M1528K28201J34468j60243j63382p9739k78264
$$ y = [391260, 309543, 276802, 239181, 343890, 393273, 435557, 506103, 667313, 668531, 577021, 479264, 676842, 845955, 888082, 981923, 908174, 774465, 763235, 895028, 894676, 1028536, 1000134, 672556, 268588, 74236, 103483, 8739, 203177, 268132, 472636, 518823, 348760, 235997, 394727, 318973, 398585, 462926, 423589, 287666, 276697, 107163, 196535, 225966, 310177, 325884, 537402, 899429, 1209580, 1469057, 1834967, 1960596, 2172422, 2334201, 2352419, 2338529, 2485339, 2751596, 2955226, 2927612, 2867249, 2823787, 2718730, 2513112, 2149380, 1922340, 1590696, 1366258, 1197880, 1309045, 1419351, 1394776, 1355531, 1427595, 1391079, 1419278, 1513458, 1554986, 1783187, 1917655, 1757412, 1594030, 1514291, 1236027]
8991A236027j98364m2360N899K43021J92111P1155K85473K786J07908M16422M96357
8980B816435M07682Q2691M4726K89817L5100K50763J24230j35362N1133k4664
8970C942551l26966j60684j04916o0961r8872n9505j74614l1401j7296J55846
8960C063182m9851j28787j89367N0402J13068r3310l74477k22353j72253k01722
8950A794532l2381k5642m9053j67829k22424j07422M0326J48893K36006N2853
8940A667859J16853J41383K95911K12913Q5141R1520k8670j8839L72149K55660
8930C191880R6512J46794M8125k782L64506K72892j8005k76720k86182n1226k09652
8919C276142m81158m57626j03927q1160l6183O7331j11948j87201k85171k37355
$$ y = [1236027, 1037663, 995303, 1001202, 1244223, 1436334, 1507489, 1792962, 1795748, 1903656, 2320078, 2816435, 3224117, 3306808, 3351534, 3641351, 3676451, 3927214, 4051444, 3916082, 3967215, 3942551, 3615585, 3454901, 3349985, 3289024, 3190152, 3130647, 2956033, 2924632, 2907336, 3063182, 3013331, 2884544, 2695177, 2745579, 2858647, 2765337, 2390860, 2168507, 1996254, 1794532, 1762151, 1736509, 1687456, 1519627, 1297203, 1189781, 1230107, 1379000, 1615006, 1667859, 1784712, 1926095, 2222006, 2434919, 2520060, 2611580, 2582910, 2564071, 2936220, 3191880, 3288392, 3435186, 3483311, 3480529, 3845035, 4117927, 4099922, 3823202, 3537020, 3485794, 3276142, 2794984, 2337358, 2233431, 2152271, 2116088, 2183419, 2071471, 1884270, 1599099, 1361744]
8909A361744k85321j3766j61035j96229K21600R1211r1033r6827J16331j0266
8899I36409n2916J7970O0521P1431j5581R8703K1230Q282R0523J10306O0723R4035
8887A501636l5657J67184L29138K05680l71077j85444K1786N2240J04860L8048
8877A828394k39098k24663o2729n9401p2819j63893j77574k4031k19630q3682
8867E00874R5095r4802L4018J23557j59291k64708N7465J20554k24851M6224J55954
8856C90089M6987q2904p1194J06139P8864N9606k9370j10002k6973n5364N6869
8845C62747j55549j63410k50168J33310L49433N942j46324P9860M7843J11621
8835C75305J16180J98023O6362L0105q5873j16081J19830l6932k57078j91031
$$ y = [1361744, 1076423, 1062657, 901622, 705393, 926993, 1018204, 927171, 830344, 946675, 936409, 883493, 901463, 961984, 1033415, 1017834, 1116537, 1137767, 1146049, 1236572, 1346878, 1407601, 1501636, 1465979, 1633163, 1962301, 2167981, 1796904, 1611460, 1633246, 1685486, 1790346, 1828394, 1589296, 1364633, 1301904, 1242503, 1169684, 1005791, 828217, 804186, 584556, 500874, 595969, 501167, 535185, 658742, 499451, 234743, 292208, 412762, 187911, 234135, 390089, 437076, 354172, 282978, 389117, 467981, 527587, 498217, 388215, 361242, 305878, 362747, 207198, 43788, -206380, -73070, 276363, 282305, 135981, 215841, 263684, 375305, 491485, 689508, 755870, 785975, 700102, 584021, 703851, 666919, 409841, 218810]
8825B18810J70353O775k769L8519j29330r9040P1987O0524M5454L1784k28702
8814A84365R533J97094j79284m9608k31621k33868L9992L30011O3948o1837J7743
8803H6468R9704P5268J81600j04272j76284j0683l3629O9936o392J89320R8145
8792D69181k27756J41004o8472j06154L9506J60652J09410M0414P9797M1869N0163
8781G29614J07014P0381j05143j89549j24566n128K01010k79168j09537J62505
8771D57433J16100J84280O3083O6830j11129M0098K6564k5993J28353L5531j08398
8760H72752k0134Q3026k09172k56111k39575N059k5277n9280Q2773O9342p9294
8749B24109j0312K2573j43783K10288J14905k0686n7210J1806O1871n402j55909
$$ y = [218810, 389163, 395938, 393169, 431688, 302358, 203318, 275305, 335829, 381283, 413067, 184365, 193898, 390992, 211708, 162100, -69521, -303389, -263397, 66614, 130562, 68725, 86468, 186172, 261440, 443040, 338768, 162484, 151801, 118172, 188108, 181716, 371036, 469181, 241425, 382429, 313957, 207803, 247309, 407961, 517371, 557785, 637582, 679451, 729614, 836628, 907009, 801866, 612317, 487751, 482623, 683633, 404465, 294928, 457433, 573533, 757813, 820896, 887726, 776597, 816695, 843259, 817266, 945619, 981150, 872752, 852618, 935644, 726472, 470361, 230786, 235845, 210568, 151288, 234061, 303403, 224109, 213797, 236370, 92587, 302875, 417780, 397094, 339884, 351690, 413561, 408159, 252250]
8738B52250Q878K54072l2615R7692J71517J85835l7607q7167K6299J51975J0670
8727A001799M3027j49736J65394M35753J15841J39174K72082L30059K00978K22724
8717B777095K5375N321j27018k05492p9908j65214n3186q3343q2830l3671j53883
8706A823246l51786j42178m142p7319k27400k20724J8854Q8582P5122o1126J16690
8695A037819p6989j29888L9252m6698J09207P6169J85222N5116K20383J54730
8685A624323L19507J41146K33052J1400K6979K0501J52762M13483N3906O7727
8675C064786L2702p1069J03300K85262L03499J12835r2847p7725L6114J76256
8665C873113K26470j06544n0069j59938m04937l29955J6646k73307l89330l84387
$$ y = [252250, 261128, 515200, 482585, 580277, 751794, 937629, 900022, 812855, 839154, 991129, 1001799, 1044826, 895090, 1060484, 1496237, 1612078, 1751252, 2023334, 2353393, 2554371, 2777095, 2802470, 2807791, 2680773, 2475281, 2395373, 2230159, 2176973, 2093630, 2010800, 1977129, 1823246, 1471460, 1329282, 1325140, 1247821, 1020421, 799697, 818551, 907133, 982255, 921129, 1037819, 960830, 830942, 870194, 823496, 932703, 1008872, 1194094, 1249210, 1469593, 1624323, 1943830, 2084976, 2318028, 2329428, 2356407, 2376908, 2529670, 2943153, 2997059, 3064786, 3097488, 3026419, 3129719, 3414981, 3718480, 3831315, 3738468, 3660743, 3696857, 3873113, 4099583, 3993039, 3942970, 3783032, 3378095, 3048140, 3064786, 2791479, 2402149, 2017762]
8655B017762j71725n4931l63577o0662m7053l9909j41120M5419Q7927l4401L3955
8644A271685K05907K15579n0277K80332K12903N8554K12286P0919N849K4232j34487
8633B373482P6298K65603L7924Q6307M8288L3306K23840J27516L5482j7732J44032
8622C434346K47562K04900P0197R9485O2224j43520j28768j54391k24684l75631
8612C091720k94657l23458l34696l47780j11284l6433J0069m2306k07891l50110
8602A053174j8260j25277N436J10437J79208k32011j37260J68297J75314K11260
8592A390318R4108j15650r7240J58110O6062p278N1251R9523J413K7199J77195
8581A845011n9643k1548N9964J35109L02449L36994J42906N8449Q0545r6775n99725
$$ y = [2017762, 1846037, 1791106, 1427529, 1366867, 1319814, 1279905, 1138785, 1184204, 1272131, 1237730, 1271685, 1477592, 1693171, 1642894, 1923226, 2136129, 2194683, 2406969, 2477888, 2483737, 2507969, 2373482, 2449780, 2715383, 2753307, 2839614, 2887902, 2921208, 3145048, 3272564, 3308046, 3290314, 3434346, 3681908, 3886808, 3957005, 4056490, 4118714, 3975194, 3846426, 3692035, 3467351, 3091720, 2797063, 2473605, 2138909, 1791129, 1679845, 1643412, 1653481, 1611175, 1403284, 1053174, 1034914, 909637, 915073, 1025510, 1204718, 972707, 835447, 1003744, 1179058, 1390318, 1484426, 1368776, 1271536, 1429646, 1495708, 1488430, 1539681, 1639204, 1640617, 1667816, 1845011, 1785368, 1763820, 1823784, 1958893, 2261342, 2598336, 2741242, 2799691, 2880236, 2783461, 2183736]
8570B183736m59818M9186j47440k12696k33203j20952k45819q2689J8635r5109
8560F53831k6118l6954Q171K29234K63439n4005r9768j37088k11281J6436r1469
8549E14428l45594J0406K1032J52091J73683j21562M5754p873j39253j1480J33812
8538D25444J70726N2588L01l429J28550J34102j59920k0427J14420n7736k22959
8527E61660J29252K9264j5261j8286j63976j06204j52092J24851L5048R6105L5826
8516E56187j33458k79668k13381j03763J4424k5611L2283J71383J14962O6096
8506A99454P7798o5930j18912j10074m4490l3859J30891L024r989j20343n6687
8495a49117j8331j13865M2937Q4393M6003m9299Q8596j4470P2716q5477K15931
$$ y = [2183736, 1723918, 1773104, 1625664, 1412968, 1179765, 1058813, 812994, 730305, 748940, 653831, 627713, 590759, 598930, 828164, 1091603, 1037598, 937830, 800742, 589461, 605897, 514428, 168834, 179240, 200272, 352363, 526046, 404484, 450238, 442365, 303112, 291632, 425444, 596170, 648758, 649059, 645630, 774180, 908282, 748362, 727935, 842355, 784619, 561660, 690912, 720176, 704915, 686629, 522653, 416449, 264357, 389208, 424256, 520361, 556187, 422729, 143061, -70320, -174083, -159659, -185270, -152987, 18396, 133358, 199454, 277252, 211322, 92410, -17664, -62154, -96013, 34878, 37902, 27913, -92430, -149117, -167448, -281313, -238376, -153983, -107980, -157279, -68683, -83153, -10437, -95914, 120017]
8484A20017M8281k49684k29912n6970n1766Q8637J29744J57857M0603n854O4764
8473E5717p6707j58872M836J33646R4550p5351K4044Q862M3794j013j15813K23234
8461A60927L6037N8407l4929r0479o3405k2717p0950L6647J2984K27332J06388
8450C56242O9064j20130J5746Q0770n0155o5373r0972K9764J02898j21214j2371
8439A94269j68811k15029K4865k07455O1817q2339L3469J69699O0830J34719M0575
8428D6609O2599J17576O1412J59743j2642j52349j73948J6763J61177n4952l33620
8417a01632r2502M8047k0736j00871J13849J90748k5560J3621j34522K1877n6387
8406a44068r2651p6185l891L3767J32530K3478L7253J25424j44585j33012J45072
$$ y = [120017, 168298, -81386, -311298, -368268, -420034, -331397, -201653, -43796, -3193, -9047, 55717, -20990, -179862, -175026, -41380, 53170, -22181, 1863, 10725, 54519, 53506, -62307, 160927, 196964, 255371, 220442, 129963, 66558, 43841, -27109, 9538, 22522, 249854, 356242, 425306, 305176, 320922, 401692, 351537, 286164, 195192, 224956, 327854, 206640, 194269, 25458, -189571, -164706, -372161, -310344, -392683, -359214, -189515, -128685, 6034, 46609, 109208, 226784, 288196, 447939, 435297, 282948, 109000, 125763, 286940, 231988, -101632, -194134, -146087, -166823, -267694, -153845, 36903, 11343, 24964, -109558, -87681, -144068, -236719, -312904, -316795, -283028, -150498, -127020, -89767, 35657, -108928, -241940, -96868]
8395i6868j0728r0437J70214K2877j86225P8020j39591J40860K10492J05477N6899
8384B60990P590J18134K02651j62651j53176k08798q0547J34760m2837j25708
8374d9592P8074O2240j2876J3093M6002j30777o3665L1575n6871J583K00481j12761
8362F506j88881J04031p6007J7616O1228j24682j43993q6698l7819K47192M04697
8351A83190J60226o8762k7591j39475n1993j04319k07630j12265J22352J1311
8341b34956j33653J17741K8265J50670o0024j05530K60296K77529Q0586n8683
8331C22241P8609J2620Q3929j32796k53461j38825o7291k18366q7792k8818R9683
8320c30267K15591J89135o4871j53748l3163J08476K7984K5762K5817m6257L9103
$$ y = [-96868, -107596, -198033, -27819, -4942, -191167, -113147, -252738, -111878, 98614, 204091, 260990, 268580, 386714, 589365, 426714, 273538, 64740, -15807, 118953, 76116, -49592, 28482, 90722, 77846, 90939, 136941, 6164, -57501, -25926, -82797, -81214, 119267, 6506, -182375, -78344, -154351, -136735, -75507, -200189, -344182, -430880, -468699, -221507, 183190, 343416, 274654, 247063, 107588, 55595, -48724, -256354, -368619, -246267, -234956, -368609, -250868, -222603, -71933, -131957, -237487, 22809, 300338, 380924, 322241, 400850, 413470, 497399, 364603, 111142, -27683, -94974, -313340, -401132, -429950, -330267, -114676, 74459, 9588, -144160, -177323, -68847, -40863, -15101, 10716, -35541, 3562]
8309C562J4436P3676o1654K0624R5603j22595k6912k61925q0483j9834R5763O6878
8297b02861J29496P3791R5003r6074k9538m6206j75424R8573K17481j8338j36024
8286i0121K50139N2856k4970J01282j685l603J1924j89161j78987p8828n7667
8275b08821r2137L7366P8743J8024J27304K9880j78909n4258J10605p5043j90533
8264c97779Q2531J57270J99682K9213j14307K25975m4854j48815m7427n7493M9452
8253f6552J38610m8625l27596j61104J27599P4129K9962J46146J41596J75649
8243B29814L63089k2558j14971o6863k47546K1178R3260j27939q7743j33147p837
8232a01263p2589q7587J16511J53863L1959l7189J95501K2369j58035O70L9538
$$ y = [3562, 17998, 91674, 30020, 50644, 146247, 23652, -3260, -265185, -345668, -365502, -269739, -202861, -73365, 426, 95429, -645, -30183, -76389, -251813, -153240, 64241, 45903, -90121, 160018, 212874, 187904, 289186, 287501, 283898, 295822, 106661, -72326, -151154, -208821, -300958, -263592, -184849, -166825, -39521, -9641, -188550, -242808, -132203, -207246, -397779, -315248, -157978, 41704, 70917, -43390, 182585, 137731, -11084, -58511, -116004, -66552, 72058, 23433, -304163, -465267, -337668, -263539, -233577, -87431, 54165, 229814, 592903, 570345, 455374, 388511, 140965, 162143, 255403, 127464, 39721, -93426, -101263, -173852, -261439, -144928, 8935, 40894, 3705, 199206, 221575, 63540, 64210, 103748]
8221A03748K20369K54920k13387k29257J83753k11815k23215J83787K9368o5633
8211C2638J82999n1074j35093l2858l31509n9753J69739R5835R3311j37089N5528
8200a17326j4391q6075O0848J45737j78701J75292J53372J02000j48641j33930
8190d1815J67979j00252j06863r4108j91041R2958J0259l5243J05828J36638M5774
8179i886P4050m9164j28200m0929M4260J41149j41050m3149K4084J17231K64351
8168B52747j6033k95173n5729m1677j01958Q3592Q1651l8438m9478o383J16453
8157g0426J33161j38982j19559j64111k8108k31299K55131O5684N4831K807o3081
8146c03952R1385J20993j03064J7276j10269K18247K27495J07492j00802J23767
$$ y = [103748, 324117, 579037, 365650, 136393, 320146, 108331, -114884, 68903, 98271, 32638, 215637, 164563, 29470, -3388, -334897, -394650, -224911, -129076, -35765, -172854, -117326, -131717, -217792, -156944, -11207, -189908, -14616, 138756, 240756, 92115, -41815, 126164, 25912, -80951, -175059, -366100, -273142, -262883, -298126, -192298, -55660, -9886, 64164, 15000, -113200, -154129, -109869, 31280, -109770, -152919, -128835, -11604, 252747, 236714, -58459, -114188, -155865, -257823, -174231, -92580, -131018, -180496, -186879, -70426, 62735, -76247, -195806, -359917, -388025, -619324, -364193, -298509, -243678, -240871, -303952, -212567, -91574, -194638, -177362, -287631, -69384, 158111, 265603, 164801, 288568]
8136B88568p6241k22108q431m4383J24947M0061J6176n0881l7498q3194o0791
8125a13775O5192O5773R8561j39086P9145Q7964R8850j00023j45838Q3831Q2174
8114A62768k8734j47291q7055J4017J56383j43809j026M1196l8747j01778O9919
8103a04157p731K3555J3192P0619m6316m6470K88476J73057j28726m6403R1696
8092B80792R643k52714p1507K58274J8490k28488k30886q828N0935q4081L38272
8081G9902J78879N1764Q6585J9856M809j36996K70273j20814j71530L3334j14682
8070A81380l1351q5615J03420J30684J27881k42485q9257m9445K1274n4334M6950
8059E9102J71751l4337K60373K34252J72333R4204Q6118K1806N5862J71877K02147
$$ y = [288568, 212327, -9781, -18212, -62595, 62352, 102413, 118589, 67708, 30210, -52984, -113775, -48583, 17190, 115751, -23335, 55810, 143774, 242624, 142601, -3237, 80594, 162768, 134034, -13257, -100312, -86295, 70088, -73721, -74747, -33551, -72298, -174076, -104157, -111888, -88333, -75141, -4522, -50838, -97308, 191168, 364225, 235499, 189096, 280792, 290435, 37721, -33786, 224488, 242978, 14490, -216396, -225224, -174289, -258370, 79902, 258781, 310545, 397130, 416986, 421795, 284799, 555072, 434258, 262728, 296062, 181380, 150029, 64414, 167834, 298518, 426399, 183914, 94657, 45212, 66486, 12152, 59102, 230853, 196516, 456889, 691141, 863474, 957678, 1043796, 1065602, 1121464, 1293341, 1495488]
8048A495488J25773L0997L07328M62642M09670R11919J065077R64000R30962R27861
8038G631717N73896K98012K93685J01357k56709p08072r60882r23242r01363q65908
8028D282491o88371m39510m21840l59626o0044k58282j42004j5198l6534j75296
8018A685786q9652j99980O9302J21060l500j72488o0575q149K27047L86410J07104
8007B062365r0532r2478J65703J92001P2541K32237N46250O42122P65085J278791
7997E774085J461460J418332J712071J887674J627607J276265R93623O15804J58355
7988A6925276p42069j605180j926502k029073j950667j524340j028261m70408
7980E648776m85225o26849o87101m04670j79420j03914j52543j45449j88968k26595
$$ y = [1495488, 1621261, 1652258, 1959586, 2422228, 2831898, 3743817, 4808894, 5772894, 6703856, 7631717, 8205613, 8503625, 8797310, 8898667, 8641958, 7933886, 6973004, 6049762, 5148399, 4282491, 3594120, 3154610, 2732770, 2373144, 2313100, 2054818, 1912814, 1897616, 1861082, 1685786, 1596134, 1396154, 1465456, 1586516, 1583016, 1410528, 1349953, 1341804, 1568851, 1955261, 2062365, 1971833, 1879355, 2045058, 2237059, 2309600, 2541837, 3088087, 3730209, 4495294, 5774085, 7235545, 8653877, 10365948, 12253622, 13881229, 15157494, 16151117, 16766921, 16925276, 16183207, 14578027, 12651525, 10622452, 8671785, 7147445, 6119184, 5648776, 5163551, 4536702, 3849601, 3444931, 3265511, 3161597, 3009054, 2863605, 2674637, 2448042]
7970B448042k06240j27749j03714j9776j95805q9293J98147L6239j198J4598l8622
7959A914629r9114Q4643L26767J49505J49485R4191K87305M69373O19416N51613
7949D547813M81663O32032L87296L43961N65737L48913J80324k90986q27416o62851
7939E706486o79078n94132m11844n13920n10224l78528k30649j91610n4365k16150
7929A925986l17392j19385o1700j66634j65935O9465j13689j6095j33878j52271
7919G48472j36737l7493L5889J49244j82445p3781j42908O588J36023p1797k5734
7908D05321J52952J67274J71235j19893l84037N786K39364Q8739j38910n6765
7898E31066j61221k03150O6290J52548J46804j20933n2666R2936k4251J71526
$$ y = [2448042, 2241802, 2114053, 2010339, 1990563, 1794758, 1705465, 1903612, 1939851, 1938653, 1953251, 1914629, 1815515, 1900158, 2226925, 2376430, 2525915, 2620106, 2907411, 3376784, 3996200, 4547813, 5029476, 5661508, 6048804, 6392765, 6958502, 7307415, 7487739, 7196753, 6369337, 5706486, 5027408, 4433276, 4021432, 3507512, 2997288, 2618760, 2388111, 2196501, 2142136, 1925986, 1608594, 1489209, 1427509, 1260875, 1094940, 1164405, 1050716, 1034621, 900743, 748472, 611735, 574242, 610131, 759375, 576930, 503149, 360241, 366829, 502852, 431055, 405321, 558273, 725547, 896782, 776889, 392852, 398638, 638002, 726741, 587831, 531066, 369845, 166695, 232985, 385533, 532337, 411404, 358738, 451674, 427423, 598949]
7888E98949K9751j16086k6724m1708o622j29915K6007j51969j09501N3249J7748
7877A43179J4894Q3037K4581m1844N8087q3424j48126J22150J9561j05635q8993
7866b533j1594j10662l6930J46160J34776M1850M5769J96045J01344Q7509l18176
7855B73558j72629K08289k2905l16556j86068K5047J47505O0853m284k91707j41352
7844d20249m0094Q309J86614k7423p9086P2159L16705P0964j32662l7739m0098
7833a22600J02239J37622o2451j49104j37132m5756K84065J85066j16716k00546
7823a25313K0544M8014j38288k1936K05379J61330J08038j08233j60117j36969
7813a47551O7503K08827J15413k93802k57497J05235J93311N1172j81641j12925
$$ y = [598949, 628700, 512614, 485890, 444182, 437560, 307645, 333652, 181683, 72182, 125431, 143179, 158073, 241110, 265691, 223847, 281934, 198510, 50384, 172534, 192095, 86460, -2533, -14127, -124789, -161719, -15559, 119217, 161067, 206836, 402881, 504225, 591734, 273558, 100929, 309218, 286313, -30243, -216311, -191264, -43759, 17094, 12810, -278897, -420249, -460343, -452034, -265420, -292843, -371929, -299770, 16935, 87899, -44763, -82502, -122600, -20361, 117261, 54810, -94294, -231426, -277182, 6883, 191949, 75233, -125313, -104769, -56755, -195043, -216979, -11600, 149730, 257768, 149535, -10582, -147551, -80048, 128779, 244192, -49610, -307107, -201872, -8561, 42611, -139030, -251955]
7803b51955J03508J03123L0097r310k07017M6017N3913L7513J62716o0515R6654
7792A04744J85429p257j99956j26594k46273j86182K27767q0014j43951O5921
7782d06366k2142Q0057J96939j17021k26450R5097O6474K78438L0879k15215K16149
7771b3161K47354j9059j73526j48768R0191n2693l9399M0288j19321Q7463j6067
7760a26698n1671R5755K61824k3643k78369j21424J65431J86300k89299j80108
7750c61902N4387J07762l5569J332J01610K32539N6418J5454k4720k46899k0540
7739a20128l8227M0346Q1690k26498M1327K6660M8549o0186j05390n1306n351
7728c68514L11416J09040k00603j02411P3213Q1732P3022J4611R6446k15198M0085
$$ y = [-251955, -148447, -45324, -15227, -24537, -231554, -185537, -131624, -94111, 68605, 8090, 104744, 290173, 282916, 82960, -43634, -289907, -476089, -248322, -328336, -472287, -406366, -428508, -348451, -151512, -268533, -494983, -399886, -333412, -54974, -24095, -239310, -23161, 224193, 205134, 31608, -117160, -26969, -79662, -119061, -78773, -198094, -110631, -126698, -178369, -82614, 179210, 155567, -122802, -244226, -78795, 107505, -181794, -361902, -307515, -199753, -235322, -233990, -132380, 100159, 156577, 172031, 147311, -99588, -120128, -158355, -118009, -36319, -262817, -221490, -194830, -146281, -206467, -311857, -363163, -368514, -57098, 51942, -148661, -251072, -177859, -96127, -23105, -8494, 87952, -127246, -87161]
7717h7161J05019L1948L0807k3303j75491p9278r8239K6325K99233j6174M9299
7706F2985j15874j84585r8627r69K8119R0152J30636J24185o877j10391j14932
7695a96178P4144Q2239l9562p7723M1469L55657O0592O2004R6434K487k26411
7684B35152J3622j65874k81808k976J37n5201J83965K33756j32811j82224J9632
7673a34630K18633J29095j48355k10055j19093J67440L4954O7486j28298o1250
7663a84073j57916N7599O3300r4284K3603q4186n5035O8374K02674J2129k2903
7652a70718P9137n6426j60183o2463P043J1117J48347l5217p2484J73761K66765
7641A28679j89898o3127K68945J84365k19917k56562J18949K33382q2762q38j16796
$$ y = [-87161, 17858, 49806, 80613, 57310, -118181, -197459, -295698, -269373, 29860, 13686, 62985, -52889, -237474, -336101, -337070, -308951, -218799, -88163, 36022, 29145, -81246, -196178, -122034, -39795, -79357, -157080, -115611, 240046, 300638, 362642, 459076, 461563, 235152, 248774, 82900, -198908, -201884, -201747, -256948, -72983, 160773, 27962, -154262, -134630, 84003, 213098, 64743, -145312, -264405, -96965, -62011, 5475, -122823, -184073, -341989, -284390, -221090, -315374, -291771, -375957, -430992, -362618, -159944, -147815, -170718, -91581, -148007, -308190, -370653, -363610, -352493, -204146, -239363, -311847, -138086, 128679, -61219, -124346, 144599, 328964, 109047, -147515, -28566, 204816, 122054, 121216, 4420]
7630D420m3759o7985K6993p2190Q9479J02844j07342N9941J64046N061k6811n9784
7618G4913m405n3991m1501O1117r7248j4074j54866K0591j51627P5301J74532
7607a11258J77633j9814j44540k51771j90507R7190J35020J13627m6877l4242
7597b75539J12015J15117j70982J48943O191q1727j55104O8814J96777L8504K0911
7586B3920q2769m1978j8363O8228r3597M7621J30428O0058r3607r1498N1382J76842
7574A36667n1364m1351O2380L240J18400j05029j30970K0607L625k5869j04025
7563a13689k1249l1991k3154n2871N6954J05534J17893n4100j88874k307K01632
7552f222J48954j2506o5148J52440L8007o9212j10081l3887q0627Q6570j97345
$$ y = [4420, -39339, -107324, -80331, -152521, -63042, 39802, -67540, -7599, 156447, 161508, 134697, 74913, 70508, 16517, -24984, 36133, -61115, -75189, -230055, -209464, -361091, -285790, -111258, 66375, 46561, -97979, -349750, -540257, -443067, -308047, -194420, -241297, -275539, -163524, -48407, -219389, -70446, -64255, -145982, -301086, -232272, -35495, 3009, 23920, -58849, -100827, -119190, -50962, -144559, -96938, 33490, 93548, -59, -91557, -40175, 136667, 85303, 43952, 106332, 109572, 227972, 122943, -8027, 12580, 16205, -9664, -113689, -134938, -166929, -190083, -242954, -186000, -80466, 37427, -16673, -205547, -207854, -6222, 142732, 130226, 65078, 217518, 255525, 186313, 76232, 42345, -38282, 48288, -149057]
7541a49057k6551j35046M1375J09896J31432J06965j2157O0969J8472k62379k56807
7530c72888J31592P3650N2428j56741P1441Q2484k67594l8913K94874k3715o5305
7519b18687J95530k5105j28355J2990M1989J14385J0025J08560O7743r4580q4659
7508a64J548J5896J06088r2024p3701k5327l7232L4909p1863J9878j5272l658
7496a40922o4013l7586r5015K7679j07240J07584N6705j30061J49144J92794m9601
7485i0532o3030J14525J6347j00490j3303J44099K91998k6429j84194k71543j92219
7474c74771k0755N9176r7152k1975j3931J64969J25430J16529M3276O9150Q7110
7463A37056K6613j11145m6312n8309Q7575j2852j39958P5742j71512L2159Q9163
$$ y = [-149057, -175608, -310654, -269279, -159383, -27951, 79014, 66857, 127826, 146298, -116081, -372888, -241296, -167646, -115218, -271959, -200518, -118034, -385628, -424541, -129667, -153382, -218687, -23157, -48262, -176617, -163627, -121638, -7253, 2772, 111332, 179075, 84495, -164, 1384, 17280, 123368, 31344, -42357, -67684, -104916, -70007, -141870, -121992, -137264, -140922, -204935, -242521, -337536, -309857, -417097, -309513, -252808, -382869, -233725, -40931, -90532, -153562, -39037, -22690, -123180, -136483, 7616, 299614, 273185, 88991, -182552, -374771, -395526, -336350, -433502, -455477, -469408, -304439, -179009, -62480, -19204, 49946, 137056, 163669, 52524, 6212, -52097, 35478, 22626, -117332, -41590, -213102, -180943, -91780]
7452i1780n0479N7634M4328J22717K52878l23461k9539j08056k80710l6966L0343
7441d13091J04624N2580J64110R3720L9173p0945j59019p977J31J33247o9473
7430a32920P7836j33332k46849J19694K17665J13112K6197l4552j8532j44304
7420a55985k31773r4270K30901K48698R7715k04639j21251k08501J91256Q4200
7410a63649j52446j19724J85985K58200O2375k31437j30488j2558N5649r810m2583
7399c00486R0893P5292J99200n0404j49715m9484Q780o0039J60164O8939n7796
7388f4656L1359j31398O1390J61314J10389k20236k72278J1678J27520j16050
7378c00968j48072l7164K44044J23097N9280R266R0167P7587j43684r5217N2510
$$ y = [-91780, -142259, -84625, -40297, 82420, 335298, 11837, -17702, -125758, -406468, -443434, -413091, -308467, -255887, -91777, 1943, 41116, -29829, -188848, -196825, -196694, -63447, -132920, -55084, -188416, -435265, -315571, -97906, 15206, 41403, 6851, -11681, -155985, -387758, -482028, -251127, -2429, 95286, -109353, -230604, -439105, -247849, -163649, -316095, -435819, -249834, 8366, 70741, -160696, -291184, -303742, -248093, -257903, -300486, -209593, -134301, 64899, 14495, -135220, -184704, -175924, -235963, -75799, -6860, -64656, -33297, -164695, -103305, 58009, 168398, -51838, -324116, -312438, -184918, -300968, -449040, -486204, -242160, -119063, -59783, -50517, 39650, 117237, -26447, -121664, -69154]
7367f9154J39342J15265J23918J6771J8733l4742r0942k86854j5358R6878q5777
7356g1920j01019J39867K08672j64989q1037j28857l3186K49668J45848o0871
7346A02176m7443m2304q4899R7093n8130j69525J0670Q1063J26207p4472n2893
7335a12457K72976J99128j65420l19598j12684J0388K35273J61436j61575L1343
7325C8810J73982J32743j56546k42276j68297j6145j4683k11806J0762K20090
7315b33366K20510o3752j87435n6232m7645J59235j757l4713J15037p6611O9996
7304a36733L2000j3565l888J69672q622k32319j79613K10604K46441J13024j10874
7293H6127j38263m5479q6512N6183J69770j9365m039p80n5167P75N8872o3976
$$ y = [-69154, 70188, 185453, 309371, 326142, 344875, 310133, 219191, -67663, -83021, 13857, -71920, -172939, -33072, 175600, 10611, -70426, -199283, -232469, 17199, 163047, 102176, 54733, 12429, -72470, 24623, -33507, -203032, -192362, -111299, 14908, -59564, -112457, 160519, 359647, 194227, -125371, -238055, -227667, 7606, 169042, 7467, 38810, 212792, 345535, 188989, -53287, -221584, -237729, -252412, -464218, -453456, -233366, -12856, -76608, -264043, -320275, -367920, -208685, -210442, -245155, -130118, -206729, -136733, -104733, -118298, -122186, 47486, 38864, -193455, -373068, -162464, 83977, 197001, 86127, -52136, -97615, -184127, -127944, 41826, 22461, 18422, 17642, -37525, -36750, 22122, -41854]
7281d1854l6151K228N4702K16681j62278r5299j61880L2389J97410l5461k12325
7270b41838k4936k30367n635K36295J38806k8324r9517j67699J02101J83049K30459
7259I2394j34463r6684j08841R4944L45475j08044j06501j73282k2984P2253J41005
7248d728p5985j03478K0475L1414J1661j30034L4690L6939n429k35447j27327
7237e47249J36091J97815m5060K4867J37835m1547j00412k00891j23828J34645
7227d27734R2193K05053j00707p8767J21798l0085J11612l8029N7572K02412L9186
7216A54504n342j91959j80541K30981K91761J3941O5665j476k82770k37537J6388
7205a26385J64429J32281o2561q5815J68416j54013j57684Q7339L2713j08450
$$ y = [-41854, -78005, -75777, -21075, 195606, 33328, -61971, -223851, -191462, 5948, -29513, -241838, -266774, -497141, -502776, -266481, -127675, -155999, -255516, -423215, -321114, -138065, 92394, -42069, -138753, -247594, -152650, 192825, 84781, -21720, -195002, -217986, -145733, -4728, -80713, -184191, -163716, -132302, -120641, -250675, -215985, -179046, -184475, -419922, -547249, -411158, -213343, -258403, -233536, -95701, -137248, -237660, -438551, -562379, -427734, -335541, -130488, -231195, -309962, -188164, -218249, -106637, -144666, -87094, 115318, 154504, 149162, -42797, -223338, 7643, 299404, 313345, 379010, 377534, 94764, -142773, -126385, 38044, 170325, 107764, 21949, 190365, 36352, -121332, -33993, -1280, -109730]
7195a09730J6490J2427J2748k377M6317j54752J29418m6761l6342K87604L5727
7184A90769j64742j67475l1793P3586l0664M9747j66327O052n3871M4428L29632
7173G9342q510l58991L756J88873p7703R4036J32633n7805m0246L7204L4362j27712
7161a00761o0347K75440J18665j01485P3722n2159j89238R65k5552p3703N7132
7150g7321K11600q6623k11942J77281N3397n7978R5364K472j32109j5496J43126
7139A01771l6002j28814K6481K6691O6975j79988m0903J61070J36792L6843j45404
7128B5512l1945M4306j41000j6748J80978q3126j01493P1659P1444k39818r4691
7117c14922R0870Q9707p0154l8321O6248k181j45898J47498K07459R3483J26399
$$ y = [-109730, -93240, -80813, -68065, -70442, -24125, -178877, -49459, -96220, -132562, 155042, 190769, 26027, -141448, -173241, -99655, -130319, -80572, -246899, -240847, -294718, -250290, 79342, 70832, -288159, -284403, -95530, -173233, -79197, 53436, -4369, -44615, -7411, 26951, -100761, -161108, 114332, 232997, 131512, 205234, 153075, -36163, -35198, -60750, -134453, -77321, 134279, 47656, -164286, 12995, 66392, 8414, 103778, 106250, -25859, -41355, 101771, 65769, -63045, -36564, -9873, 57102, -122886, -163789, -2719, 134073, 170916, 25512, -6433, 37873, -103127, -119875, 61103, -22023, -123516, -51857, 19587, -220231, -314922, -224052, -134345, -204499, -242820, -176572, -178753, -324651, -177153, 30306, 123789, 250188]
7106B50188R723j27303l36314j17872j60952J78962K39004K7398n8380P4123o4369
7095h5792q2272K35502L2204J41101n7460k36830k5341J96225p2276l16390k21358
7084d92687J05409J5178J48382N6960j34629R806O373l5676Q2072J05493K80794
7073A47475J77980j29127k55753p5719K63146M5737K823j15095m9796j13564J87536
7062H5643n6766k02058J3441N6008J47774J03130J137m7017J7157K209j33232
7051a2574l6638q9158j17106M5542j20483r3391J1709o9025j7254J21833R9964
7040b76581J32319R3704K23595o4000P55J94550P0773J1899j32555J50833N9129
7029D64421P3133j25079k761q8701k35366O2474J51213K9474j94908l95424j59764
$$ y = [250188, 259911, 132608, -203706, -321578, -482530, -303568, -64564, -37166, -95546, -21423, -85792, -168064, 67438, 99642, 240743, 183283, -53547, -78888, 117337, 45061, -271329, -492687, -387278, -372100, -223718, -166758, -301387, -291581, -285208, -320884, -238812, -133319, 147475, 325455, 196328, -59425, -135144, 128002, 173739, 176562, 61467, 11671, -101893, 85643, 28877, -173181, -159740, -103732, 44042, 147172, 148309, 101292, 118449, 120658, -12574, -49212, -138370, -255476, -209934, -330417, -423808, -412099, -481124, -498378, -376545, -276581, -144262, -50558, 173037, 109037, 109792, 304342, 375115, 387014, 254459, 405292, 464421, 537554, 412475, 409714, 321013, 85647, 148121, 299334, 328808, 133900, -261524, -421288]
7018d21288N4356J78261k1550j48741j29454P1671J13562K15139K00808m52j48162
7007c5850o988L7737K9402j49843l142J26169K56650o1705j41966r8460q5401
6996a33397K9322J77710j1401r0405Q2467q5679n1773j81658K02471N3503j37337
6985a46177j44043J40703M0261J51287k9419k17736j10075L7391L17807J20390
6975A60389j70842k53484j0081j1881p4676p6794J08933K08791J47556O7896j3763
6964H2044J27361J81285Q4508j89197j06130J5335K2737N6144J36014J50237L3782
6953E94120j88965j77680o4427J30325n8155o4962q4580n9639j20610N4507J6461
6942b3605r9458K0654l6551r0318j13875J16924J35252J64277j15935k37882N6519
$$ y = [-421288, -366932, -188671, -210221, -358962, -488416, -416745, -303183, -88044, 112764, 112312, -35850, -42838, -5101, 24301, -125542, -128684, -2515, 254135, 192430, 50464, -47996, -133397, -104075, 73635, 62234, -28171, 54296, -31383, -83156, -264814, -62343, -8840, -146177, -290220, -149517, -109256, 42031, 12612, -205124, -315199, -277808, 39999, 160389, -10453, -263937, -274018, -285899, -360575, -437369, -328436, -119645, 27911, 95807, 82044, 209405, 390690, 475198, 286001, 179871, 195206, 217943, 274087, 410101, 560338, 594120, 405155, 227475, 163048, 293373, 235218, 170256, 85676, 26037, -94573, -40066, -23605, -123063, -102409, -138960, -229278, -343153, -226229, -90977, 73300, -42635, -280517, -223998]
6931b23998K6008J512k977O9793M423P8195J19915j04532l6644J82170o5948l49314
6919c01397k31763K88114K58352L475J4433K18042r5031j69868J33636p9960k9976
6908H057j52481j08108J2912j44247j26726K39796L15778J12516K9382q5398M9645
6897A51126J0754k9195J7027Q304j94201Q710K62652J4880L00338p1837k60464
6886B18094j81611j97417j9803J58243J19881p0943q113j533l7252r2162k09490
6875c22106J67201M8075J7064P5504K12386n0400j46582m5716R9704O0035j01450
6864A3715j46758J25079J38374J55155J8631o9835j56566n2798l7344q9455k5200
6853a27002q1025Q3090o4178j8201J42604N7501J20498N366l6584r2838l05640
$$ y = [-223998, -197990, -196478, -199455, -129662, -125239, -47044, 72871, -31661, -68305, 113865, 47917, -301397, -533160, -245046, 13306, 16781, 31214, 249256, 154225, -15643, 117993, 38033, 8057, -144424, -252532, -239620, -383867, -510593, -270797, 44981, 157497, 186879, 101481, 151126, 161880, 132685, 149712, 158016, -36185, -27475, 235177, 250057, 550395, 478558, 218094, 36483, -160934, -180737, -22494, 97387, 26444, 18331, 16798, -20454, -112616, -322106, -154905, -106830, -89766, -14262, 198124, 147724, 1142, -44574, 55130, 115165, 13715, -133043, -7964, 130410, 285565, 304196, 234361, 77795, 24997, -12347, -101802, -127002, -208027, -124937, -189115, -207316, -64712, -7211, 113287, 118653, 82069, -10769, -316409]
6842c16409K956j28798p9133K29549k1581j4718K7898O7989J424M3643L39J35617
6830e1224k3435j51505K01420K08081m3553j4113j37100J9996J91935k08643m8599
6819e6740q2088R4987Q3165J8765p7978m6766J90191q9936l13234j6463j90220
6808d86317M1197P4735o7597k3088O3507K2827K25477J27487j35826j92890m2160
6797c92648J72840K33693M291j00714q123K6275j82003K37390J254j74354j38978
6786c21077J30774m648L8677J71250k7391q7989R884l0422p6282J83457Q9533
6775G5766j4962N4520j10380L4288O6997j5168o6625P6165n6686j25619O4082
6764a7622l1276p3902j29612J43699K5438R7091J43640j07498j50617p517K42388
$$ y = [-316409, -313453, -442251, -521384, -291835, -313416, -328134, -300236, -232247, -230823, -187180, -186841, -51224, -74659, -226164, -24744, 183337, 139784, 125671, -11429, 8567, 200502, -8141, -56740, -138828, -43841, 39324, 58089, -19889, -66655, 123536, 33600, -279634, -296097, -486317, -445120, -370385, -437982, -461070, -397563, -374736, -149259, -21772, -157598, -350488, -392648, -219808, 13885, 18176, -82538, -90661, -64386, -246389, -8999, -7745, -182099, -321077, -190303, -194951, -156274, 14976, -12415, -100404, -90520, -120942, -197224, -13767, 75766, 60804, 115324, 4944, 39232, 106229, 91061, 24436, 100601, 43915, -81704, -17622, -48898, -122800, -252412, -108713, -83275, 13816, 157456, 49958, -100659, -108176, 134212]
6753A34212k58541l90551J31457J56820J84044J0911J08564J19765j26860K6604
6743I6425q7079j33310k2022J81415K26884o0934q5492J0555m5743j09658k08076
6732b37035l6931J35747J29396Q5030L2250M6345N4712K3257o2861l8002p5146
6721E6762j7773J81458k60345k92322L1282L14692K736j77956j58987j21143q249
6710d49845Q1457M0679K5090M881K419J09758l3963N5181J31535L4938q6016o7296
6698a51182J05568M826j75076j17356J03989n4382M2458K95922N3242n6383J8499
6687G0125J44252j67338k3676j91720j62866J14180J18792J89817K4759k20386
6677a04061j12314J13727j04099j64640n4017P4852J37380J16797k3564J46704
$$ y = [134212, -124329, -514880, -383423, -226603, -42559, -31648, 76916, 196681, 69821, 96425, 9346, -123964, -145986, 35429, 262313, 201379, 115887, 126442, 80699, -28959, -237035, -273966, -138219, -8823, 76207, 108457, 154802, 209514, 232771, 169910, 131908, 56762, 38989, 220447, -39898, -332220, -300938, 13754, 16490, -161466, -320453, -441596, -449845, -368388, -327709, -302619, -297738, -295319, -185561, -219524, -164343, -32808, 2130, -83886, -151182, -45614, -40788, -215864, -333220, -229231, -283613, -241155, 54767, 108009, 51626, 70125, 214377, 47039, 23363, -168357, -331223, -217043, -98251, 91566, 116325, -104061, -216375, -102648, -206747, -371387, -425404, -350552, -213172, -96375, -119939, 26765]
6667B6765q654j94483M2667R9276j79290l0804J47341j06595j30674N3781J97879
6656h2791J65860K2769r4225j19836j38997J04599N7223o7050O158J28223q2616
6645a00683j25092j4571N0659N0218J98144K77191k61073k14589J51381P6484
6635H8069k62101R8685J85593q0589j48297O1339R7515P3826J07738k6109P4107
6624B69776M2262k35216k55900L6297J90850L0781j6318q0973j70684l491J67394
6613b5222K56456K3191j25590j56811K1871j65232j81350P7612J63381J07225
6603d469M8809k07136j23515J41004M8240O6474j89345k58087K16422K21105l768
6592d4266j02131l6261r9266j96802J7781K33495L9979n6864j86225O3643K58745
$$ y = [26765, 18111, -176372, -133705, -34429, -213719, -244523, -97182, -203777, -334451, -280670, -82791, 83069, 105838, 11613, -108223, -247220, -142621, -85398, -152448, -146290, -18067, -100683, -225775, -240346, -189687, -139469, 58675, 335866, 74793, -139796, 11585, 88069, -174032, -75347, 110246, 29657, -118640, -57301, 40214, 114040, 221778, 195669, 269776, 312038, 76822, -179078, -142781, 48069, 78850, 62532, -18441, -189125, -192616, -25222, 231234, 254425, 128835, -27976, -6105, -171337, -352687, -275075, -111694, -4469, 44340, -162796, -286311, -145307, -97067, -30593, -219938, -478025, -261603, -40498, -44266, -146397, -182658, -281924, -478726, -460945, -227450, -187471, -244335, -430560, -366917, -108172]
6581a08172O9060M7000l08139j19398J43676L47784P7642p4187j37277n892j6751
6570h4654N101L4543J14748N7872N6258n0412j50436K552j07611j52045j3182
6559b87266j34856N9377J50504m7643k18309K8373K09007R1982M7717O6363n0880
6548h5631R3135J39261J23057l6737k4084j44682K507K182k25145m041J23976
6537c6202o3553J1876P0561j3507J48309J62560Q1202l21217j13765K0780M5916
6526g040J02665k03319l1210o1955J94390R4458P1070m6877l5608l0217k31188
6515a84831Q7842Q0567p2578n3798Q7333l9298R7101j0080q3556K2266M4179k23391
6503b48244r3759N5244K56194p3436J22703n1532k9942K539p1680j5511Q5506
$$ y = [-108172, -39112, 7888, -300251, -419649, -275973, 71811, 149453, 75266, -62011, -67903, -84654, -79553, -45010, 69738, 127610, 183868, 133456, -16980, -14428, -122039, -274084, -287266, -422122, -362745, -212241, -259884, -478193, -449820, -240813, -148831, -101114, -34751, -85631, 7504, 146765, 269822, 233085, 209001, 64319, 66826, 69008, -156137, -160178, -36202, -99755, -87879, -17318, -30825, 117484, 280044, 361246, 40029, -73736, -52956, -7040, 95625, -107694, -138904, -200859, -6469, 87989, 159059, 112182, 76574, 46357, -184831, -96989, -16422, -89000, -142798, -55465, -94763, 2338, -7742, -91298, -69032, -24853, -248244, -342003, -286759, -30565, -104001, 18702, -32830, -62772, -60233, -131913, -147424, -61918]
6492f1918N4053l9437j7122J04579k9161M2296K77352k9633j73967q8713p5221
6481c6892K15012l3534l5607L5272k54562p0083m0788J49427J75080k6893l33510
6470b57078m1427J49124J75163j5106J29018p5912k78641Q1307K9579j62981o0968
6459c27922o0753m9389K06020K41222o4315j82334l3109n8173j6457l7331p839
6448c90380J96991m4458J06253k3640R199K1228j991J41629N8527P3765J25509
6437B72632J72700k80795j98004j12813n4410R6855j60398k3399N5863K2709l3827
6426b42887n2707j3820N7200K0396Q3335l2820J58557J66718k27910k72807K65004
6415i1741O8998k55668j57105Q1295l7782p5125J31305L8138J52154J07813k58888
$$ y = [-61918, -7865, -47302, -64424, 40155, 10994, 53290, 330642, 301009, 127042, 38329, -36892, 178120, 144586, 108979, 144251, -110311, -180394, -221182, -71755, 103325, 76432, -257078, -298505, -149381, 25782, 10676, 139694, 63782, -214859, -133552, -103973, -266954, -327922, -388675, -438064, -232044, 9178, -55137, -237471, -270580, -328753, -345210, -382541, -390380, -193389, -237847, -131594, -155234, -146035, -124807, -126798, 14831, 73358, 147123, 272632, 445332, 164537, -33467, -146280, -200690, -103835, -264233, -287632, -231769, -209060, -242887, -295594, -309414, -252214, -231818, -148483, -181303, -22746, 143972, -83938, -356745, -91741, -22743, -278411, -435516, -354221, -392003, -467128, -335823, -297685, -145531, -37718, -296606]
6404b96606n9702R1318J86524K65683k0030j51815j566O350j08290j69415k9069
6393b86618P798l8518J23913r2973k2139N5490l8432K37023J9682j9488J2412
6382d1850j65789J51931J85704j4621J14873o336j64613M0792O5472r4432r3798
6371b2667r445J15824P1482K7860j48977P6918K6534k26256j15325M3329M5O4495
6359i6183k4046k32259J54440P3769J5821R4439R0311k8332q8803m1293q5671
6348a67807J31741P5503j00852j20449o1253P6584M376j6847J5960M9408p218
6337a20854r1785j43106k60949k1408L87207K15428J23972K9209J1525Q4432L5082
6326B48753Q6683l7381j58417j28091j7083j47361N7410K5097j2719J15805J02083
$$ y = [-296606, -356308, -264990, -78466, 187217, 167187, 15372, 13806, 20156, -88134, -257549, -286618, -278820, -317338, -193425, -286398, -308537, -253047, -291479, -54456, -34774, -54262, -41850, -207639, -55708, 129996, 115375, 230248, 223912, 59299, 100091, 165563, 71131, -22667, -32112, 83712, 155194, 183054, 34077, 110995, 137529, -88727, -204052, -160723, -160678, -96183, -120229, -352488, -198048, -124279, -108458, -14019, 76292, 47960, -40843, -82136, -167807, -36066, 39437, -61415, -181864, -243117, -166533, -162157, -179004, -163044, -113636, -120854, -212639, -355745, -616694, -638102, -250895, -35467, 88505, 117714, 129239, 213671, 248753, 335436, 298055, 139638, 11547, -5536, -152897, -95487, -70390, -83109, 32696, 134779]
6315A34779q8297p6959j35461j30716P0978J13458J61620j40346j29770j05054
6305c25768J16543q4097M2497J8365J01219J63889R3810P9150N4132p8850m00850
6294b19960k15843J8041K83196K61662K458q5720j85259j46059r2942m8444k52
6283d29122J73672J6578P9689J23167J5834q6874r2949m9403N5268J41521j56598
6272b09217j13283P3278J19433J07299K2748k5219j75390n5956o0381r5102K3174
6261c88616M3350o5091j0784O2611J35618j44362L7691J02606Q9586J88433J54891
6250B05933Q5147M1623j07159j0188K9293k20371l2866j82009n7048J97665q775
6239e8755j65527j70163q892m7807J01426l3264J29315K62403o2068j73915j0680
$$ y = [134779, 46482, -30477, -165938, -296654, -225676, -112218, 49402, -90944, -220714, -325768, -209225, -293322, -250825, -232460, -131241, 32648, 126458, 205608, 259740, 180890, -219960, -435803, -417762, -134566, 127096, 129554, 43834, -141425, -287484, -380426, -428870, -429122, -255450, -238872, -159183, -36016, -20182, -107056, -200005, -249408, -194140, -52619, -209217, -322500, -249222, -129789, -22490, 258, -24961, -200351, -256307, -316688, -411790, -388616, -345266, -410357, -421141, -358530, -222912, -367274, -329583, -226977, -137391, 51042, 205933, 291080, 332703, 225544, 215356, 244649, 24278, -8588, -190597, -247645, -49980, -58755, -224282, -394445, -403337, -451144, -349718, -382982, -253667, 8736, -53332, -227247, -237927]
6228b37927K6158L0467L3837L9570M1320N1636n1359o1817j48032P8606K69036
6217G1495O904r1585k6667r8208j68692j3354K37861O9898J13392o3204k93335
6206b55495l01962N0800L64343K50410O4851m4070P2840m6511j25040j67091N0654
6195h6271J60325q2655l30235J8090K40355J46056j24504N9502K1155K27578J38684
6184C88080j04873k58303P6606J43047q9819j96311l0747K11272L2648k9172j14706
6173B7722j30328j32323N2709K70894J28703k12542j32304K26420L1792j7586
6163A13157N0316j97511k2402P0332J39074j49740k24925O3225R3385J25520o2696
6152b265j09141R2939L1117j39549K41661M7251j03398r4118O4872j82911Q4015
$$ y = [-237927, -211769, -181302, -147465, -107895, -66575, -14939, -66298, -128115, -276147, -197541, 71495, 78399, -13186, -39853, -138061, -306753, -320107, -82246, -12348, 101044, 37840, -255495, -557457, -506657, -142314, 108096, 172947, 128877, 201717, 155206, 30166, -136925, -86271, 74054, -8601, -338836, -320746, -80391, 65665, -58839, 663, 21818, 249396, 388080, 283207, 24904, 101510, 244557, 154738, -41573, -72320, 138952, 171600, 142428, 27722, -102606, -234929, -182220, 88674, 217377, 4835, -127469, 98951, 130743, 113157, 163473, -34038, -56440, 13892, 152966, 3226, -221699, -158474, -65089, 60431, -2265, -111406, -18467, 12650, -126899, 114762, 162013, 58615, -35503, 29369, -153542, -69527]
6141f9527O8247J49955K35676J17818r8217j81543k45938P431o6653J18398J67882
6130B03529J49380J38257j06328k97585o3963k9999N3419q2143O9899N4585O3994
$$ y = [-69527, -1280, 148675, 384351, 502169, 403952, 222409, -23529, -16098, -82751, 35647, 203529, 352909, 491166, 384838, 87253, 23290, -6709, 46710, -35433, 34466, 89051, 153045]
$$ [...]
##END NTUPLES=NMR SPECTRUM
##END=
