##TITLE=Analysis number 317526
Compound Code mo 07745
Project Code qc-cat
Chemist Name chemcon
##JCAMPDX= 6.0         $$ Bruker NMR JCAMP-DX V2.0
##DATA TYPE= NMR SPECTRUM
##DATA CLASS= NTUPLES
##ORIGIN= Bruker BioSpin GmbH
##OWNER= nmr
$$ XWIN-NMR		Version 3.5
$$ Wed Feb 22 12:37:32 2006 GMT Standard Time (UT+0h)  MAYBRIDGE\nmr@NMR_250MHZ
##.OBSERVE FREQUENCY= 250.131544655141
##.OBSERVE NUCLEUS= ^1H
##.ACQUISITION MODE= SIMULTANEOUS (DQD)
##.ACQUISITION SCHEME= undefined
##.AVERAGES= 16
##.DIGITISER RES= 18
##SPECTROMETER/DATA SYSTEM= dpx250
##.PULSE SEQUENCE= zg30
##.SOLVENT NAME= DMSO
##.SHIFT REFERENCE= (INTERNAL, DMSO, 0, 16.522)
##AUDIT TRAIL= $$ (NUMBER, WHEN, WHO, WHERE, WHAT)
$$ ##TITLE= Audit trail, XWIN-NMR		Version 3.5
$$ ##JCAMPDX= 5.01
$$ ##ORIGIN= Bruker BioSpin GmbH
$$ ##OWNER= nmr
$$ C:\u/data/dgb/nmr/ADRS/16680/pdata/1/auditp.txt
$$ ##AUDIT TRAIL=  $$ (NUMBER, WHEN, WHO, WHERE, WHAT)
(   1,<2006-02-22 12:36:58.74 +000>,<MAYBRIDGE\nmr>,<NMR_250MHZ>,
      <created by zg, POWCHK disabled, PULCHK disabled
       configuration hash MD5:
       84 BC 41 DB A1 6E 1D 46 DA 25 12 A5 C1 ED C5 3A
       data hash MD5: 64K
       31 03 A6 47 BD 15 5F AA 9A 3F 4F 2C D6 1C 7D BA>)
(   2,<2006-02-22 12:37:20.18 +000>,<MAYBRIDGE\nmr>,<NMR_250MHZ>,
      <Start of raw data processing
       ef LB = 0.3 FT_mod = 6 PKNL = 1 SI = 32K 
       data hash MD5: 32K
       AB AD 6F 20 D7 EE E5 71 F3 EC 6D 82 9C 83 74 A8>)
(   3,<2006-02-22 12:37:22.13 +000>,<MAYBRIDGE\nmr>,<NMR_250MHZ>,
      <apk 
       data hash MD5: 32K
       7A 7A 3A F8 E2 AC 35 8C 49 CF 83 EF 43 DD DF 54>)
(   4,<2006-02-22 12:37:23.40 +000>,<MAYBRIDGE\nmr>,<NMR_250MHZ>,
      <abs ABSG = 5 
       data hash MD5: 32K
       16 68 22 0E 39 6B 9C 3F 1B C6 DC 76 E7 4C 04 6F>)
$$ ##END=
$$ 
$$ hash MD5
$$ 9F BF 28 A7 C2 F9 4D F2 44 A6 99 5B 11 5D 99 B8
##$RELAX= 
##$RELAX= 
##$RELAX= 
##$RELAX= 
##$RELAX= 
##$RELAX= 
##$RELAX= 
$$ Bruker specific parameters
$$ --------------------------
##$DU= <C:\u>
##$EXPNO= 16680
##$NAME= <ADRS>
##$PROCNO= 1
##$TYPE= <nmr>
##$USER= <dgb>
##$AMP= (0..31)
100 100 100 100 100 100 100 100 100 100 100 100 100 100 100 100 100 100 
100 100 100 100 100 100 100 100 100 100 100 100 100 100 
##$AQSEQ= 0
##$AQ_mod= 3
##$AUNM= <au_zg>
##$AUTOPOS= <28 >
##$BF1= 250.13
##$BF2= 250.13
##$BF3= 250.13
##$BF4= 250.13
##$BF5= 500.13
##$BF6= 500.13
##$BF7= 500.13
##$BF8= 500.13
##$BYTORDA= 1
##$CFDGTYP= 0
##$CFRGTYP= 5
##$CHEMSTR= <none>
##$CNST= (0..31)
1 1 145 1 1 1 1 1 1 1 1 1 1 1 1 1 1 1 1 1 1 1 1 1 1 1 1 1 1 1 1 1 
##$CPDPRG= <>
##$CPDPRG1= <>
##$CPDPRG2= <>
##$CPDPRG3= <>
##$CPDPRG4= <mlev>
##$CPDPRG5= <mlev>
##$CPDPRG6= <mlev>
##$CPDPRG7= <mlev>
##$CPDPRG8= <mlev>
##$CPDPRGB= <>
##$CPDPRGT= <>
##$D= (0..31)
0 1 0 0 0 0 0 0 0 0.06 0 0 0 0 0 0 0.0002 0 0 0 0 0 0 0 0 0 0 0 0 0 0 
0 
##$DATE= 1140611816
##$DBL= (0..7)
120 120 120 120 120 120 120 120 
##$DBP= (0..7)
150 150 150 150 150 150 150 150 
##$DBP07= 0
##$DBPNAM0= <>
##$DBPNAM1= <>
##$DBPNAM2= <>
$$ [...]
##$SUBNAM7= <"">
##$SUBNAM8= <"">
##$SUBNAM9= <"">
##$SW= 20.6930455092707
##$SWIBOX= (0..15)
0 0 3 0 0 0 0 0 0 0 0 0 0 0 0 0 
##$SW_h= 5175.983436853
##$TD= 65536
##$TD0= 1
##$TE= 293.16
##$TE2= 300
##$TE3= 300
##$TEG= 300
##$TL= (0..7)
0 120 120 120 120 120 120 120 
##$TP= (0..7)
150 150 150 150 150 150 150 150 
##$TP07= 0
##$TPNAME0= <>
##$TPNAME1= <>
##$TPNAME2= <>
##$TPNAME3= <>
##$TPNAME4= <>
##$TPNAME5= <>
##$TPNAME6= <>
##$TPNAME7= <>
##$TPOAL= (0..7)
0.5 0.5 0.5 0.5 0.5 0.5 0.5 0.5 
##$TPOFFS= (0..7)
0 0 0 0 0 0 0 0 
##$TUNHIN= 0
##$TUNHOUT= 0
##$TUNXOUT= 0
##$USERA1= <user>
##$USERA2= <user>
##$USERA3= <user>
##$USERA4= <user>
##$USERA5= <user>
##$V9= 5
##$VALIST= <valist>
##$VCLIST= <CCCCCCCCCCCCCCC>
##$VD= 0
##$VDLIST= <DDDDDDDDDDDDDDD>
##$VPLIST= <PPPPPPPPPPPPPPP>
##$VTLIST= <TTTTTTTTTTTTTTT>
##$WBST= 1024
##$WBSW= 4
##$XGAIN= (0..3)
0 0 0 0 
##$XL= 0
##$YL= 0
##$YMAX_a= 447785
##$YMIN_a= -404860
##$ZGOPTNS= <>
##$ZL1= 120
##$ZL2= 120
##$ZL3= 120
##$ZL4= 120
##$ABSF1= 16.522
##$ABSF2= -4.171173
##$ABSG= 5
##$ABSL= 3
##$ALPHA= 0
##$AQORDER= 0
##$ASSFAC= 0
##$ASSFACI= 0
##$ASSFACX= 0
##$ASSWID= 0
##$AUNMP= <proc_1d>
##$AZFE= 0.1
##$AZFW= 0.1
##$BCFW= 0
##$BC_mod= 0
##$BYTORDP= 0
##$COROFFS= 0
##$CY= 12.5
##$DATMOD= 1
##$DC= 0
##$DFILT= <>
##$DTYPP= 0
##$F1P= 14.0000005364418
##$F2P= -0.99999901652339
##$FCOR= 0.5
##$FTSIZE= 32768
##$FT_mod= 6
##$GAMMA= 0
##$GB= 0
##$INTBC= 1
##$INTSCL= 1
##$ISEN= 128
##$LB= 0.3
##$LEV0= 0
##$LPBIN= 0
##$MAXI= 10000
##$MC2= 0
##$MEAN= 0
##$ME_mod= 0
##$MI= 0
##$NCOEF= 0
##$NC_proc= -6
##$NLEV= 6
##$NOISF1= 0
##$NOISF2= 0
##$NSP= 0
##$NTH_PI= 0
##$NZP= 0
##$OFFSET= 16.522
##$PC= 1
##$PHC0= 235.1826
##$PHC1= 4.562261
##$PH_mod= 1
##$PKNL= yes
##$PPARMOD= 0
##$PSCAL= 4
##$PSIGN= 0
##$REVERSE= no
##$SF= 250.13
##$SI= 32768
##$SIGF1= 0
##$SIGF2= 0
##$SINO= 400
##$SIOLD= 32768
##$SREGLST= <1H.DMSO>
##$SSB= 0
##$STSI= 32768
##$STSR= 0
##$SW_p= 5175.98343685301
##$SYMM= 0
##$S_DEV= 0
##$TDeff= 65536
##$TDoff= 0
##$TI= <Analysis number 999999
Compound Code 99
Book Reference 9
Project Code 9>
##$TILT= no
##$TM1= 0
##$TM2= 0
##$TOPLEV= 0
##$USERP1= <user>
##$USERP2= <user>
##$USERP3= <user>
##$USERP4= <user>
##$USERP5= <user>
##$WDW= 1
##$XDIM= 32768
##$YMAX_p= 456968752
##$YMIN_p= -926708
$$ End of Bruker specific parameters
$$ ---------------------------------
##NTUPLES= NMR SPECTRUM
##VAR_NAME=  FREQUENCY,     SPECTRUM/REAL,   SPECTRUM/IMAG
##SYMBOL=    X,             R,               I
##VAR_TYPE=  INDEPENDENT,   DEPENDENT,       DEPENDENT
##VAR_FORM=  AFFN,          ASDF,            ASDF
##VAR_DIM=   32768,         32768,           32768
##UNITS=     HZ,            ARBITRARY UNITS, ARBITRARY UNITS
##FACTOR=    0.157963299565203, 1,           1
##FIRST=     4132.6476996994, 0,             0
##LAST=      -1043.33573715361, 0,           0
##MIN=       -1043.33573715361, -926708,     0
##MAX=       4132.6476996994, 456968752,     0
$$ Real data points
##PAGE= N=1
##DATA TABLE= (X++(R..R)), XYDATA
$$ [...]
31228b9164j63045P9164M6420j76202J49342j06J33031J35698J50406l6223k25157
$$ -29164 -192209 -113045 -66625 -242827 -93485 -93591 39440 175138 325544 289321 64164
31217F4164n13034k50184J18664K62649L30969K00999J52261R8550j33611j01192
$$ 64164 -448870 -699054 -580390 -317741 13228 214227 366488 465038 331427 230235
31207B30235j44673q9856J2819K20275K2686j3600M4646j3702n7233Q6186m570
$$ 230235 85562 -4294 8525 228800 251486 237886 282532 268830 211597 297783 293213
31196B93213j92484k32697o1718J2098J45619P2447p0311J27786Q1430j58638
$$ 293213 100729 -131968 -193686 -181588 -35969 36478 -33833 93953 175383 16745
31186A6745j81844j90647K32892K92100P6930l07366k54696l3876L45301J00203
$$ 16745 -165099 -355746 -122854 169246 246176 -61190 -315886 -349762 -4461 95742
31176I5742P0138k3174k0047p5771p8559J7696M475M4170k12122K44414M1959
$$ 95742 165880 142706 122659 46888 -31671 -13975 -9500 34670 -177452 66962 108921
31165A08921p5219J48954p0938P6777Q1740k90015j27808K4441j2334J53839k3393
$$ 108921 33702 182656 111718 188495 270235 -19780 -147588 -123147 -135481 18358 -5035
31154e035N1656m6708j31551Q0099r3993N7302R5811K5556j50335j85973r2518
$$ -5035 46621 -87 -131638 -51539 -145532 -88230 7581 33137 -117198 -303171 -395689
31143c95689J04795m7629J71769J08165p3399m5790j4403k27414K6400K1274O1734
$$ -395689 -290894 -338523 -166754 -58589 -131988 -177778 -192181 -419595 -393195 -371921 -310187
31132c10187R1368J96162M8943j7812n1826J02362k11390K4611J16189n7968j5327
$$ -310187 -218819 -22657 26286 8474 -43352 59010 -152380 -127769 -11580 -69548 -84875
31121h4875M2819m229q6625p5374L8128J94219N0356M3040k002L0187j05079m7410
$$ -84875 -42056 -46285 -132910 -208284 -170156 24063 74419 117459 115457 145644 40565 -6845
31109f845J78064j8201J16586j6522k9716k46363J67366j01458J16874N480k84785
$$ -6845 171219 153018 269604 253082 223366 -22997 144369 42911 159785 165265 -119520
31098a19520j36339M3489M5210j31256J56337J17895k68422q0971K9679K00552
$$ -119520 -255859 -212370 -167160 -298416 -142079 -24184 -292606 -373577 -343898 -143346
31088a43346K40392N977O9866M9438j41373l9978l715n4243k57488R8695O8152
$$ -143346 97046 103023 172889 222327 80954 40976 37261 -16982 -274470 -175775 -107623
31077a07623l61676l0867K54049K30715j81403k24441J7595O5571N3367r4293
$$ -107623 -469299 -500166 -246117 -15402 -196805 -421246 -403651 -338080 -284713 -379006
31067c79006L0586Q9609J83268L5286J14496m8962k68855J4403Q4773N7257J51484
$$ -379006 -348420 -258811 -75543 -40257 74239 25277 -243578 -229175 -144402 -87145 64339
31056F4339J87968J15124k19566j23574N6207J18941j88322p0510q9442N53l8281
$$ 64339 252307 367431 147865 24291 80498 199439 11117 -59393 -148835 -148282 -186563
31045a86563j71482J59617O0311M7569P126j8755j24673j7972J08742j50951k78958
$$ -186563 -358045 -198428 -138117 -90548 -83422 -102177 -226850 -244822 -136080 -287031 -565989
31034e65989K06906J02979k07508J17154L10545K14391L6810o6301q5990l1242
$$ -565989 -359083 -256104 -463612 -346458 -35913 178478 215288 148987 62997 31755
31024C1755J00896J37018K23765R993k23346j9670j63860j19147N2634L3122J37615
$$ 31755 132651 269669 493434 503427 280081 260411 96551 -22596 30038 63160 200775
31013B00775R0102J74522k4658l4999j45178q3126K36388J1583l13148o416j08475
$$ 200775 290877 465399 440741 405742 260564 177438 413826 425409 112261 105845 -2630
31002b630j08690K07527J47499J3497k47398j79284l09442k01526n753L55992
$$ -2630 -111320 96207 243706 257203 9805 -169479 -478921 -680447 -686200 -330208
30992c30208K74801l08859l5541K12591J67229j01895l29900k17871K63819K34600
$$ -330208 -55407 -364266 -399807 -187216 -19987 -121882 -451782 -669653 -405834 -171234
30982a71234j95524M4495K41092j27381j9377J15841m9128n351J16137Q7820J12887
$$ -171234 -366758 -322263 -81171 -208552 -227929 -112088 -161216 -166567 -50430 37390 150277
30971A50277J30337J63657J8771k0117j32061p4070k81948k41689P9832J15456
$$ 150277 280614 444271 463042 442925 310864 236794 -45154 -286843 -207011 -91555
30961i1555o015N7957K21741L9372k89099N3416K16064p2843j65148M3635p4945
$$ -91555 -97570 -39613 182128 221500 -67599 -14183 201881 129038 -36110 7525 -67420
30950f7420j46845N6031K6933L2074o3036J48514O2168K1665R9620j72126j92591
$$ -67420 -214265 -158234 -131301 -99227 -162263 -13749 48419 70084 169704 -2422 -195013
30939a95013j89911J50416j860Q3854J74687j6205J03910R1297k029j32211l9803
$$ -195013 -384924 -234508 -236368 -152514 22173 5968 109878 201175 199146 66935 27132
30928B7132p0414J78475m2649j84116k2011J72111K05403O0885J16128J78396
$$ 27132 -43282 135193 92544 -91572 -113583 58528 263931 324816 440944 619340
30918F19340k27692L0660n7908k20872Q1839k22418R3847L15235N1334k64408
$$ 619340 391648 422308 364400 143528 225367 2949 96796 412031 463365 198957
30908A98957k89444J8128K26043l02542k59515K1242J949J40684K9896K02396
$$ 198957 -90487 -72359 153684 -148858 -408373 -387131 -385182 -244498 -214602 -12206
30898a2206J9469l08901K03546J00724j8654n2310O4916r7220P4091K0509n127
$$ -12206 7263 -301638 -98092 2632 -16022 -68332 -3416 -100636 -26545 -6036 -11163
30887a1163P8585P9093N8817j33640O0894N1697p6847j06420k24020k08149J50732
$$ -11163 67422 146515 205332 71692 132586 184283 107436 1016 -223004 -431153 -280421
30876b80421K0818o9339K06915K6552k15970K3244l0676J59528J81578K09570
$$ -280421 -259603 -328942 -122027 -95475 -311445 -288201 -318877 -159349 22229 231799
30866B31799K5621o7989j79275k10606q8194L34221j0204k65708K96992K96858
$$ 231799 257420 189431 10156 -200450 -288644 45577 35373 -230335 66657 363515
30856C63515j68323j21609J77658q558k42850q8079N9380K02393o4507l9503J21392
$$ 363515 195192 73583 251241 242683 -167 -88246 -28866 173527 109020 69517 190909
30845A90909j24214M6739P1542k70742j53474O9849K10725k47893k8843J65273
$$ 190909 66695 113434 184976 -85766 -239240 -169391 41334 -206559 -235402 -70129
30835g0129K78076L62654K668l07142M9000J84738q4433r8944j5483J1073l30729
$$ -70129 207947 570601 573269 266127 315127 499865 415432 316488 301005 312078 -18651
30824a8651M2357j95637M0274J78091k9399K6033J00225J13264q1951j31445J42073
$$ -18651 23706 -171931 -131657 46434 17035 43068 143293 256557 174606 43161 185234
30813A85234o7727p4320j09551p2575j14915k07716J20595J97629p652j3718k37654
$$ 185234 117507 43187 -66364 -138939 -253854 -461570 -340975 -143346 -150998 -164716 -402370
30802d02370l4746J66578J28968j66234K8954R9443J58812J606l6262m3898j83564
$$ -402370 -437116 -270538 -141570 -307804 -278850 -179407 -20595 -18989 -55251 -99149 -282713
30791b82713o1926L9459J23811L23656O3346m03900J13931J02914n0050J17201
$$ -282713 -344639 -305180 -181369 142287 205633 -198267 -84336 18578 -31472 85729
30781H5729J46352J29860j32367j44063j47409p1472n7078K18526l1411j557J7109
$$ 85729 232081 361941 229574 85511 -61898 -133370 -190448 28078 -3333 -4890 12219
30770A2219p6183n5574J24209N2351n1856R1180p4250p255K6966j39143p7381
$$ 12219 -63964 -119538 4671 57022 5166 96346 22096 14841 41807 -97336 -174717
30759a74717K98315o7320q5854N0200J02592j16075J70662j21935j28283k9689
$$ -174717 123598 56278 -29576 20624 123216 7141 177803 55868 -72415 -102104
30749a02104j70404J16042J6110P0378k2930k0029J86301j55758J8945J27715
$$ -102104 -272508 -156466 -140356 -69978 -92908 -112937 73364 -82394 -63449 64266
30739F4266o0754R5971K20506l2603j10244O0423P9696J410o0551j10307n6591
$$ 64266 3512 99483 319989 287386 177142 237565 317261 318671 258120 147813 91222
30728I1222k74462j96966L47951L158L4112j1528k19770N275K41804K01492l34681
$$ 91222 -183240 -380206 -32255 -29097 5015 -6513 -226283 -221008 20796 222288 -112393
30717a12393j64560L19524J12297J2249j62674j62756J00245K88157L1272r7521
$$ -112393 -276953 42571 154868 167117 4443 -158313 -58068 230089 261361 163840
30707A63840l77111k29390K32930K57193J8620N5220J3692j00955k16014m20467
$$ 163840 -213271 -442661 -209731 47462 66082 121302 134994 34039 -181975 -602442
30697f02442J52514K54402K35298J17128j523j38438r3137p3909r3637K66379
$$ -602442 -449928 -195526 39772 156900 155377 16939 -76198 -150107 -243744 22635
30687B2635J38751k06658n512j9764j15416O496Q7230J56377J09439l1383O0534
$$ 22635 161386 -45272 -50784 -70548 -185964 -179468 -92238 64139 173578 142195 202729
30676B02729j13684p0139k2380l7286J54869j2078O2675k05882l19518p304J69773
$$ 202729 89045 18906 -3474 -40760 114109 102031 164706 -41176 -360694 -367998 -198225
30665a98225k1618J08415Q886N9258J13276j05406J39860P0074k7902J80477k73396
$$ -198225 -219843 -111428 -102542 -43284 69992 -35414 104446 174520 146618 327095 53699
30654E3699o4543J79176l1516j17917j7965j30580j30694N5801K43609o762r3749
$$ 53699 -10844 168332 136816 18899 934 -129646 -260340 -204539 39070 32308 -61441
30643f1441j05558R6270Q8731O7531k6872p9118l65256n5666K35527K04801J351
$$ -61441 -166999 -70729 18002 85533 58661 -20457 -385713 -441379 -205852 -1051 300
30632C00P8410n0331J25977Q1037k93387j12465J48341j16270Q8912K0532o2908
$$ 300 78710 28379 154356 235393 -57994 -170459 -22118 -138388 -49476 -28944 -91852
30621i1852K93882j0543j013j30672l35826j26670l2055j50606n9923K28062p6371
$$ -91852 202030 191487 190474 59802 -276024 -402694 -434749 -585355 -645278 -417216 -493587
30610d93587M8666J73234K24652k43061j6602L10404J06451o6506j54282R441
$$ -493587 -444921 -271687 -47035 -290096 -306698 3706 110157 43651 -110631 -101190
30600a01190j36563J20080J33659j69259Q5258J24400l9640j4263j5294J63347
$$ -101190 -237753 -117673 15986 -153273 -68015 56385 16745 2482 -12812 150535
30590A50535K85103p5005n5465l6233j49223k79123N2670J32362k34395j02088
$$ 150535 435638 360633 305168 268935 119712 -159411 -106741 25621 -208774 -310862
30580c10862J53471J02292R0919p3732J0649L35099Q6998l0661J96047o4498l34573
$$ -310862 -157391 -55099 35820 -37912 -27263 307836 394834 364173 560220 495722 161149
30569A61149j84045J57499K12362j50979k18351O0932l5581J39084k18644j58320
$$ 161149 -22896 134603 346965 195986 -22365 38567 2986 142070 -76574 -234894
30559b34894R8023j7842j0539K41693L32302q927k15480l09640n298R6943J10799
$$ -234894 -136871 -154713 -165252 76441 408743 399816 184336 -125304 -130602 -33659 77140
30548G7140M6308j03841n9885L8535o6058k1637j6777j70538m8156p817Q5493
$$ 77140 123448 19607 -40278 -1743 -67801 -89438 -106215 -276753 -324909 -332726 -247233
30537b47233n6818J72431K0114J04505N3889j52171j49121l55J01122K71205j07809
$$ -247233 -304051 -131620 -111506 -7001 46888 -105283 -254404 -254759 -153637 117568 9759
30526I759p0684p8615M8049J7281n4067j17615K60047O0775j91655p2736J05936
$$ 9759 -60925 -139540 -91491 -74210 -128277 -245892 14155 74930 -116725 -189461 -83525
30515h3525j94863R6043K50658O8844j13405J50306J96358j07033q4374j49886
$$ -83525 -278388 -182345 68313 137157 23752 174058 370416 263383 179009 29123
30505B9123k4301o4306n8848K14305p0478j06992l20341j52485N396J93599O8145
$$ 29123 4822 -59484 -118332 95973 25495 -81497 -401838 -554323 -548927 -355328 -287183
30494b87183J57258m8898N2665K00068R6463k29228n9294m2653J14785K38850
$$ -287183 -129925 -178823 -126158 73910 170373 -58855 -118149 -160802 -46017 192833
30484A92833K41383N6708k59458k79267j12439Q1317J18837K26143J40871R9794
$$ 192833 434216 490924 231466 -47801 -160240 -78923 39914 266057 406928 506722
30474E06722j74746j74977P4577m392q8970m0643P2645J76361L27490k71060m50492
$$ 506722 331976 156999 231576 227184 138214 97571 170216 346577 674067 403007 -47485
30463d7485J46924K17513J407l4139j80269l24316o7460j37139j1914J57873M152
$$ -47485 99439 316952 318359 284220 103951 -220365 -287825 -424964 -436878 -279005 -274853
30452b74853J52017J21755L7946j9970j64508J2230M7632j23074m2746l2611K7139
$$ -274853 -122836 -1081 36865 16895 -147613 -135383 -87751 -210825 -253571 -286182 -259043
30441b59043l9646K7280p3644P8923p7101J60189J6823o7728J28026K22616j7903
$$ -259043 -298689 -271409 -345053 -266130 -343231 -183042 -166219 -233947 -105921 116695 98792
30430I8792J53285m7312J0029k11671j49338N8137K8354m0772q7148K05114K3748
$$ 98792 252077 204765 214794 3123 -146215 -88078 -59724 -100496 -187644 17470 41218
30419D1218k67163J7209J15942k1267J59565J47042K9419j63356m01417K6560
$$ 41218 -225945 -208736 -92794 -114061 45504 192546 221965 58609 -342808 -316248
30409c16248j0289K33734q6614L5131J20458K06520l1133k04450j01360o531J17907
$$ -316248 -326537 -92803 -179417 -144286 -23828 182692 151559 -52891 -154251 -160782 -42875
30398d2875j5990j4757K40567O3850J64951M0979L5251j34357j98209r0234j73665
$$ -42875 -58865 -73622 166945 230795 395746 436725 471976 337619 139410 49176 -124489
30387a24489l0580J27404j17744N4581J49691M4542k9971J8297l4295j77192J50116
$$ -124489 -155069 -27665 -145409 -90828 58863 103405 73434 91731 57436 -119756 30360
30376C0360j09736Q0589J11426J942R5812J05967j68719J33159M7754m7748J19593
$$ 30360 -79376 1213 112639 114581 210393 316360 147641 280800 328554 280806 400399
30365D00399q084L6070k06499q0805m5508K8451m3954j13656J17464j11584K5591
$$ 400399 392315 428385 221886 141081 95573 124024 80070 -33586 83878 -27706 -2115
30354b115Q8304r2715k77299j544r5823K4130K58279K44080O5091K0901P6511
$$ -2115 86189 -6526 -283825 -285369 -381192 -357062 -98783 145297 210388 231289 307800
30343C07800M0085k24501j80443J7118j00490j49611p8824N7445L35244K5859
$$ 307800 347885 123384 -57059 -39941 -140431 -290042 -368866 -311421 23823 49682
30333D9682J69233O5575J83728m12099K1850M9329q7653M0452j07977j79193L1279
$$ 49682 218915 284490 468218 56119 77969 127298 39645 80097 -27880 -207073 -175794
30322a75794K03686K35971J32133j31042k82748m2647J44171Q0896j62657k3752
$$ -175794 27892 263863 395996 264954 -17794 -60441 83730 164626 1969 -21783
30312b1783q9057o6500j08396o0003P5916o7397K86466K42064p4448r3089o3969
$$ -21783 -110840 -177340 -285736 -345739 -269823 -337220 -50754 191310 116862 23773 -40196
30301d0196o8718m4527O0741O6942J66408J96287k50640j66229o6927J0494N5896
$$ -40196 -108914 -153441 -92700 -25758 140650 336937 86297 -79932 -146859 -136365 -80469
30290h0469Q9500K56554l05038k32767Q4665K04246L37657q999l316J6297j64173
$$ -80469 9031 265585 -39453 -272220 -187555 16691 354348 345349 342033 358330 194157
30279A94157j1569k01660p2783r3983R1326P9508N6434J34888j58214K82256Q7066
$$ 194157 182588 -19072 -91855 -185838 -94512 -15004 41430 176318 18104 300360 387426
30268C87426q9315l13538J48251K19160k96879k11676o7969M8726r7616k11599
$$ 387426 298111 -15427 132824 351984 55105 -156571 -224540 -175814 -273430 -485029
30258d85029O2538J33627J16134k1203R127J22209j07207r1478J51969J7836j72629
$$ -485029 -422491 -288864 -172730 -193933 -184806 -62597 -169804 -261282 -109313 -91477 -264106
30247b64106R2935J81495m8646J88541J4478Q4465R5474j52992l01387j26925
$$ -264106 -171171 10324 -38322 150219 164697 249162 344636 191644 -109743 -236668
30237b36668J91322J05447J80503K99763k02425j43773K8464k4605j32078n9433
$$ -236668 -45346 60101 240604 540367 337942 194169 222633 198028 65950 6517
30227F517j8596q4368O1759K1868o3274j34832R4679K48118P5225K01112J01690
$$ 6517 -12079 -96447 -34688 -12820 -76094 -210926 -116247 131871 207096 408208 509898
30216E09898j32638l18819l5633M8159J98356O9323j8350m8814j36723J72J19959
$$ 509898 377260 58441 22808 70967 269323 338646 320296 271482 134759 134931 254890
30205B54890N589J23512k96815k67407J93008J88838r0586M4995J95811K7356
$$ 254890 260479 383991 87176 -180231 12777 201615 111029 156024 351835 379191
30195C79191j73356N0358k2036m9754r9750k84756j16767N8420n88j50116L22033
$$ 379191 205835 256193 234157 184403 84653 -200103 -316870 -258450 -259038 -409154 -87121
30184h7121L71975L3601l39628j5829M42038L3096P0225k02946j62289n7277q0022
$$ -87121 284854 318455 -21173 -37002 405036 438132 508357 305411 143122 85845 5823
30173E823J8338R0472K45083p7144J50027k29408l57650k15639K33998O6970q6127
$$ 5823 24161 114633 359716 282572 432599 203191 -154459 -370098 -136100 -69130 -155257
30162a55257j43261J46793N6004K17175J45926p2676N7208Q3565o4835j93903
$$ -155257 -298518 -151725 -95721 121454 267380 194704 251912 335477 270642 76739
30152G6739k33587O3251K27831N1367j67794j63458N3351k0432Q9338J58007K05435
$$ 76739 -156848 -93597 134234 185601 17807 -145651 -92300 -112732 -23394 134613 340048
30141C40048r9820k80479J4669m6917r4249p1685j56296Q937P0223k8692J06902
$$ 340048 240228 -40251 -25582 -72499 -166748 -238433 -394729 -385792 -315569 -344261 -237359
30130b37359M9196M74J05934j1810L4556J81825j93834j02675J30610K92497J75598
$$ -237359 -188163 -187689 -81755 -93565 -59009 122816 -71018 -173693 -43083 249414 425012
30119D25012l3367q7490j70544k01053Q8883j38179J22884l0064l46536Q5885
$$ 425012 391645 304155 133611 -67442 21441 -116738 6146 -23918 -370454 -284569
30109b84569l2201K8737k122K78510P7208j49703j60159m4497J49410L15312O2511
$$ -284569 -316770 -288033 -290155 -11645 65563 -84140 -244299 -288796 -139386 175926 238437
30098B38437O0103j95780l98977j04635J90132P7709K58795j9019q9193K48459
$$ 238437 298540 102760 -296217 -400852 -210720 -133011 125784 106765 17572 266031
30088B66031K10760j75907M1858j77806l65774r6845J90327J7993L5802k23184
$$ 266031 476791 300884 342742 164936 -200838 -297683 -107356 -89363 -53561 -276745
30078b76745k8822K8847q9384m719J48790J78427J52177n1654r3163K09562Q2934
$$ -276745 -305567 -276720 -366104 -370823 -222033 -43606 108571 56917 -36246 173316 256250
30067B56250k85268j66477L8942J22581M5419k69773K9200n6110K03308Q8902
$$ 256250 -29018 -195495 -156553 -33972 11447 -258326 -229126 -285236 -81928 6974
30057F974j65342N4714J36566J28228q1703j27909j02213o57M2687J14032J04430
$$ 6974 -158368 -103654 32912 161140 79437 -48472 -150685 -151342 -108655 5377 109807
30046A09807m0873M8823q8499N2626J2575K3320J51516Q9324k37010o8182J31507
$$ 109807 68934 117757 29258 81884 94459 117779 269295 358619 121609 53427 184934
30035A84934J4833l05139j50303J72256j10439p7484Q7479q3664j4603N1382L0909
$$ 184934 199767 -105372 -255675 -83419 -193858 -271342 -183863 -267527 -282130 -230748 -199839
30024a99839J55461J49677P2730j1429p4779P0321o7235k8090q9172j54961J23612
$$ -199839 -44378 105299 178029 166600 91821 162142 94907 66817 -22355 -177316 -53704
30013e3704n5597j41452K8615J07770J37465O9002P4994n5336O1229l3794k22819
$$ -53704 -109301 -250753 -222138 -114368 23097 92099 167093 111757 172986 139192 -83627
30002h3627n7575J16465R0840J82676Q4561Q4911k32950m88463k50481L17091
$$ -83627 -141202 -24737 66103 248779 333340 418251 185301 -303162 -553643 -236552
29992b36552J16210l9184J30994J69971J22166k30115k43419J34237J25188j97389
$$ -236552 -120342 -159526 -28532 141439 263605 33490 -209929 -75692 49496 -147893
29982a47893k3785m6771k42777O0635J45145P5740K8720j35283J11518K38154
$$ -147893 -171678 -218449 -461226 -400591 -255446 -179706 -150986 -286269 -174751 63403
29972F3403J78405Q9361k82553l11295p4693k1108O7446K92335j76719l26031
$$ 63403 241808 331169 48616 -262679 -337372 -358480 -291034 1301 -175418 -501449
29962e01449l1051L55965J69702K57031Q4552k19961N9869l0861j12269K6418
$$ -501449 -532500 -176535 -6833 250198 334750 114789 174658 143797 31528 57946
29952E7946r4372p8035L5910p6616L0352K7651J1543J81813R4685L634K1743O3573
$$ 57946 -36426 -114461 -78551 -155167 -124815 -97164 -85621 96192 190877 194511 216254 279827
29940B79827r7328m51226J2563r9167p359P5861M3714O1012m7579J81400K78444
$$ 279827 182499 -268727 -256164 -355331 -362690 -286829 -243115 -182103 -229682 -48282 230162
29929B30162K31268J04539j51474k56660J53840P7818l8316k65306N5623K82908
$$ 230162 461430 565969 414495 157835 311675 389493 351177 85871 141494 424402
29919D24402k3734p0747K9976k81006l08668k35628J8630Q2558j53657J06376
$$ 424402 400668 329921 359897 78891 -229777 -465405 -446775 -364217 -517874 -411498
29909d11498K08727O3537k21438j32847J97417j2669J79852N5888k02264O4292
$$ -411498 -202771 -139234 -360672 -493519 -296102 -308771 -128919 -73031 -275295 -211003
29899b11003J99614N9706J11128N4378k00933J27735L56131j01737j73923l8673
$$ -211003 -11389 48317 159445 213823 12890 140625 496756 395019 221096 182423
29889A82423j87715k23416K7654q2124L695P1441J18406K34413K47753J2758j86698
$$ 182423 -5292 -228708 -201054 -283178 -279483 -208042 -89636 144777 392530 405288 218590
29878B18590j39567j38126P8514J55453N3170j16706j64113k2746K17848J80404
$$ 218590 79023 -59103 19411 174864 228034 111328 -52785 -75531 142317 322721
29868C22721j18989j62477k50017K18403J63813o3948J38165l40144o6668L49137
$$ 322721 203732 41255 -208762 9641 173454 109506 247671 -92473 -159141 189996
29858A89996J20751P5596M2137k8163j48943m92845j12448n032J84534L73083
$$ 189996 310747 386343 428480 400317 251374 -241471 -353919 -358951 -174417 198666
29848A98666o3683q1948R7145q9574k02430j823P7649J50161Q8816O3999M8485
$$ 198666 134983 53035 150180 60606 -141824 -143647 -65998 84163 172979 236978 285463
29837B85463J49291j5274k5756p0390O968j14956R2311l3270j46812k30822r8481
$$ 285463 434754 419480 393724 323334 330302 215346 307657 274387 127575 -103247 -201728
29826b01728J50539K16044L2852j00416j50790m22388J80844K02289M7372J29272
$$ -201728 -51189 164855 197707 97291 -53499 -475887 -295043 -92754 -45382 83890
29816H3890k84243k75038n9274K35805O8903k37548k37500K10903K52976K07816
$$ 83890 -200353 -475391 -534665 -298860 -229957 -467505 -705005 -494102 -241126 -33310
29806c3310r0540M0106j70256k47727m1468J73456J80362q914K15132J18321o3693
$$ -33310 -123850 -83744 -254000 -501727 -543195 -369739 -189377 -198291 16841 135162 71469
29795G1469O3521R5236l62975k34762j03668q6419J41731J43044J46230J46272
$$ 71469 134990 230226 -132749 -367511 -471179 -557598 -415867 -272823 -126593 19679
29785A9679J73053m4265k19676q0945N1421j4194J48629J68660q2498j50574J58001
$$ 19679 192732 148467 -71209 -152154 -100733 -114927 33702 202362 119864 -30710 127291
29774A27291J56422j16306l24375K633K52810p8958k65355k0491J67478J31852
$$ 127291 283713 167407 -156968 -154335 98475 19517 -245838 -266329 -98851 33001
29764C3001R1297k1419O5519Q2616O5653K8186j86576l3186j07081j07961K09190
$$ 33001 124298 102879 168398 251014 316667 344853 158277 125091 18010 -89951 119239
29753A19239J19758q7386J27622n6248n27185k81197Q2232K25124l9500m4905
$$ 119239 238997 151611 279233 222985 -304200 -585397 -503165 -278041 -317541 -362446
29743c62446j85090P5277Q0007O6344k4633m7678J81319M01900J24322l4886k79551
$$ -362446 -547536 -472259 -392252 -325908 -350541 -398219 -216900 185000 309322 274436 -5115
29732e115l07438j27765J41555J61499N5136l7270j38884j37750o2666l5780N3963
$$ -5115 -312553 -440318 -298763 -137264 -82128 -119398 -258282 -396032 -458698 -494478 -440515
29721d40515K9918m1341J69181J47100J21446J91875n1912K3684j98291N6293
$$ -440515 -410597 -451938 -282757 -135657 -14211 177664 125752 149436 -48855 7438
29711G438N1744M8636J36524k57046m22304m4907J59903N10087J66647j71380
$$ 7438 59182 107818 244342 -12704 -435008 -479915 -320012 190075 356722 185342
29701A85342k69441M5129K51048J80271j18481m11512R8623Q2883O7764R3071
$$ 185342 -84099 -38970 212078 392349 273868 -137644 -39021 43862 111626 204697
29691B04697q5436j22750m810j2019R9985N0192N4125n4832O7408j27826j62336
$$ 204697 119261 -3489 -8299 -20318 79667 129859 183984 129152 196560 68734 -93602
29680i3602J67551j2652k55602n8097P4959J27723k10511M1184L7879j5604j13738
$$ -93602 73949 61297 -194305 -252402 -177443 -49720 -260231 -219047 -181168 -196772 -310510
29669c10510J53422O0691J97755p3932j94640K93429M3619k26835j51254Q5723
$$ -310510 -157088 -96397 101358 27426 -167214 126215 169834 -57001 -208255 -122532
29659a22532J08094k30977K04142J4419L4800K77384L66647k8232k97932j73269
$$ -122532 -14438 -245415 -41273 -26854 7946 285330 651977 623745 325813 152544
29649A52544o52n4363k16063J11540J16696q6954l6772k06009J62221L68294K02308
$$ 152544 151892 97529 -118534 -6994 109702 22748 -14024 -220033 -57812 310482 512790
29638E12790o4988K0983J18247l91286k63895j3391Q6785j54654j55405P2927
$$ 512790 447802 468785 587032 195746 -68149 -81540 5245 -149409 -304814 -231887
29628b31887K63908K48954K93906j17039l21893j69743j71830N8937R5917J15588
$$ -231887 32021 280975 574881 457842 135949 -33794 -205624 -146687 -50770 64818
29618F4818L4884p8690J7777l8813j19199j81991j02789R1487K45079o3055J71289
$$ 64818 99702 21012 38789 -24 -119223 -301214 -404003 -312516 -67437 -130492 40797
29607D0797M2042J33625k28002j90790N6335Q4443j52502n7158m1395K10444M9730
$$ 40797 82839 216464 -11538 -202328 -145993 -61550 -214052 -271210 -312605 -102161 -52431
29596e2431j4804p3028J863K6090o318N0788L3302J23929n212N4552J80618j54370
$$ -52431 -67235 -140263 -138400 -112310 -118628 -67840 -34538 89391 84179 138731 319349 164979
29584A64979j92303n3685N0983j59216L1937J2172j94682j01289j2865L37801
$$ 164979 -27324 -81009 -30026 -189242 -157305 -145133 -339815 -441104 -453969 -116168
29574a16168K64549k20301m5900k4933Q9599K33122q0648k49356J1712J91299
$$ -116168 148381 -71920 -117820 -142753 -53154 179968 99320 -150036 -138324 52975
29564E2975M6431q3791n9394o0161j22053M209M06516K85266K47164j44849l96472
$$ 52975 99406 15615 -43779 -103940 -225993 -221784 184732 469998 717162 572313 175841
29553A75841J04284k9226k12216j66834J253j3010m7232J6202j37388k45215J24749
$$ 175841 280125 250899 38683 -128151 -126898 -139908 -187140 -170938 -308326 -553541 -428792
29542d28792L15910j4452j1029j33383Q985O7196J30406p4446L0406K97459L6557
$$ -428792 -112882 -127334 -138363 -271746 -262761 -195565 -65159 -139605 -109199 188260 224817
29531B24817n6404J19271L5952j92962k56565n9388j22917J85493j37699J49793
$$ 224817 168413 287684 323636 130674 -125891 -185279 -308196 -122703 -260402 -110609
29521a10609O9642n0012L3641M1121p1411K2989l8543o8041q4511j72148r664
$$ -110609 -40967 -90979 -57338 -16217 -87628 -64639 -103182 -171223 -255734 -427882 -437546
29510d37546K72577L75826J77j04430j12216j48144n1865J61389J1625l4843j67115
$$ -437546 -164969 210857 211034 106604 -5612 -153756 -205621 -44232 -32607 -67450 -234565
29499b34565L7195J57913K14217m1153j09861J57164R1762k8184k53372k44593
$$ -234565 -197370 -39457 174760 133607 23746 180910 272672 244488 -8884 -253477
29489b53477L95679J90466j38950j04255k3688j89866K37290K81196j66258m55353
$$ -253477 142202 332668 193718 89463 65775 -124091 113199 394395 228137 -227216
29479b27216k4569J61165R7430k7422K09525K46816J29195l01301j82451R1442
$$ -227216 -251785 -90620 6810 -20612 188913 435729 564924 263623 81172 172614
29469A72614K23511J15863k40454j621q6632j82468j95878p2188J70565J36245
$$ 172614 396125 511988 271534 269913 183281 813 -195065 -267253 -96688 39557
29459C9557m4915n68n9781J13249p1453M2804P890L7073j27670j11861m7222j09435
$$ 39557 -5358 -5926 -65707 47542 -23911 18893 26783 63856 -63814 -175675 -222897 -332332
29447c32332j57666N9960J53679N8871m098N4343J74283L4561J83190l4352k55784
$$ -332332 -489998 -430038 -276359 -217488 -221586 -167243 7040 41601 224791 190439 -65345
29436f5345j04311n279J17820K1049o9842M4932K95323o7904J13908l5819l7848
$$ -65345 -169656 -174935 -57115 -36066 -105908 -60976 234347 166443 280351 244532 206684
29425B06684j05880k44577K2402J66956j36540l59339J20857K22472M2521j09154
$$ 206684 100804 -143773 -121371 45585 -90955 -450294 -329437 -106965 -64444 -173598
29415a73598n8669J47811n7603q686j1657j67553J92K16058R3231P2268M563L1566
$$ -173598 -232267 -84456 -142059 -150745 -162402 -329955 -329763 -113705 -20474 51794 56357 87923
29403H7923r976j11928L9468K61197J29402j16136R751l37747j63126J01468J16814
$$ 87923 77947 -33981 5487 266684 396086 279950 289701 -48046 -211172 -109704 7110
29392G110l7163k5164K05773J06510k65777L6601k22005M4264M3597M6599L10472
$$ 7110 -30053 -55217 150556 257066 -8711 27890 -194115 -149851 -106254 -59655 250817
29381B50817J99657j18032j94543k146N0825l47466k22143l14663j7250J59062
$$ 250817 450474 332442 137899 135753 186578 -160888 -383031 -697694 -714944 -555882
29371e55882J61948K79789K6164j03563J72311j12313n6641k59j92743K41542
$$ -555882 -393934 -114145 -87981 -191544 -19233 -131546 -188187 -188446 -381189 -139647
29361a39647K38017N6135r862r3272L2987J57915l00006K7435l203r5289j00907
$$ -139647 98370 154505 144643 51371 84358 242273 -57733 -30298 -33501 -128790 -229697
29350b29697l4807J68058K50838j12608j86856M9956j83789l52275K7181J19856
$$ -229697 -264504 -96446 154392 41784 -145072 -95116 -278905 -631180 -603999 -484143
29340d84143P1799K25257N9769j72879k4372J45411R5618j484J56059k938j55446
$$ -484143 -412344 -187087 -127318 -300197 -324569 -179158 -83540 -85024 71035 68097 -87349
29329h7349j4643N8356J42477l5294j17769j3853K0298M9529l0912q3178m51017
$$ -87349 -101992 -43636 98841 63547 -54222 -68075 -47777 1752 -29160 -112338 -563355
29318e63355m7512K43965L01998L27195m3397l61395M3250L8215p684K3251R6813
$$ -563355 -610867 -366902 -64904 262291 218894 -142501 -99251 -61036 -68720 -45469 51344
29307E1344K6561J88163J9263O3988k6699j21008j91016k52918J25865o911J08654
$$ 51344 77905 266068 285331 349319 322620 201612 10596 -242322 -116457 -123368 -14714
29296a4714J51322p5103J37564j42376l6096k9436P454k12950J13256K38873K29009
$$ -14714 136608 61505 199069 56693 20597 -8839 -1385 -214335 -101079 137794 366803
29285C66803k40572j76498j00907J62206K32470M6230j27556L7095P2931j2780
$$ 366803 126231 -50267 -151174 11032 243502 289732 162176 199271 272202 259422
29275B59422r7583q6170J04997M0686j09183n6673j80806l01054j14137M15027
$$ 259422 161839 75669 180666 221352 112169 55496 -125310 -426364 -540501 -125474
29265a25474M18540J03235k85927j86953J24435r2818r3828k6444J71665J19947
$$ -125474 293066 396301 110374 -76579 47856 -44962 -138790 -165234 6431 126378
29255A26378k85632J11064k20152o3489K18625K04202O9145p0903j40033j10716
$$ 126378 -159254 -48190 -268342 -331831 -113206 90996 160141 89238 -50795 -161511
29245a61511q2365j4059j3314J94613J31064k16734o6148Q8236J10887J43148
$$ -161511 -243876 -257935 -271249 -76636 54428 -162306 -228454 -140218 -29331 113817
29235A13817K6221J4084k39860j28908L48076J52604l5461j20076M6433K24351
$$ 113817 140038 154122 -85738 -214646 133430 286034 250573 130497 176930 401281
29225D01281r2388M7160o2941j43714p0011j10656j40788R3118O1768j5942j0413
$$ 401281 308893 356053 293112 149398 79387 -31269 -172057 -78939 -17171 -33113 -43526
29214d3526j33818K4710O6772j61576k34395Q0268L37050O5458K83218J38757
$$ -43526 -177344 -152634 -85862 -247438 -481833 -401565 -64515 943 284161 422918
29204D22918m5218J9889j16130k08786j16598J27617k3702l5869l3670j4791J55596
$$ 422918 377700 397589 281459 72673 -43925 83692 59990 24121 -9549 -24340 131256
29193A31256l3790k74327N0817J19979q181m0803M8716j6805J69236J75277j83732
$$ 131256 97466 -176861 -126044 -6065 -14246 -55049 -6333 -23138 146098 321375 137643
29182A37643l4193p7712j67881J32936L00448J64005j88620j37550K2705j23588
$$ 137643 103450 25738 -142143 -9207 291241 455246 266626 129076 151781 28193
29172B8193j30173p3146k34375k8902J17206j5286P6428J7155K82575j07931q7094
$$ 28193 -101980 -175126 -409501 -438403 -321197 -336483 -260055 -242900 39675 -68256 -155350
29161a55350r0500L2574j914M7309J10135J7998m3016m5332O9611L16908O6346
$$ -155350 -245850 -213276 -215190 -167881 -57746 -39748 -82764 -128096 -58485 258423 324769
29150C24769k39623k5173j28027M8878j9204N5484K5099p5882n2074l808k1568
$$ 324769 85146 59973 -68054 -19176 -38380 17104 42203 -33679 -85753 -89561 -111129
29139a11129L8581J14679K89227J73234M4168k48347j59986j06471k4619o3953
$$ -111129 -72548 42131 331358 504592 548760 300413 140427 33956 9337 -54616
29129e4616j19577J21416Q8111k30269P8508J89208N2131J67101l16092k32988
$$ -54616 -174193 -52777 35334 -194935 -116427 72781 124912 292013 -24079 -257067
29119b57067R9379m2512j8117k87841J53118L46565J10649q9035p2798j34515
$$ -257067 -157688 -200200 -218317 -506158 -353040 -6475 104174 15139 -57659 -192174
29109a92174l2565j650k49284O8750L16554M6859q3253j49322J75987K50099n0670
$$ -192174 -224739 -226389 -475673 -406923 -90369 -43510 -126763 -276085 -100098 150001 99331
29098I9331J04752m8020n3415M9059L054J55638Q5445p8111j76466l8263j57164
$$ 99331 204083 156063 102648 151707 154761 310399 395844 317733 141267 103004 -54160
29087e4160j8019J38329l7155j9723n1999k31927k3919L0645P6579j71429K9825
$$ -54160 -72179 66150 28995 9272 -42727 -274654 -298573 -267928 -191349 -362778 -332953
29076c32953L46864K25323j01375J1064K9689k38517n2037K16717j61209k17208
$$ -332953 13911 239234 137859 148923 178612 -59905 -111942 104775 -56434 -273642
29066b73642k48851K54734J05143m8834q3936k7208R5283Q7991K2519j8670J51083
$$ -273642 -522493 -267759 -162616 -211450 -295386 -322594 -227311 -139320 -116801 -135471 15612
29055A5612J58254J310j13096N8024j51689j27571L3379R2094J19644j34141r0600
$$ 15612 173866 175176 62080 120104 -31585 -159156 -125777 -33683 85961 -48180 -138780
29044a38780J93431k73597M1397m9352j28149N5592N2801O4321j01712l4017J57729
$$ -138780 54651 -218946 -177549 -226901 -355050 -299458 -246657 -182336 -284048 -318065 -160336
29033a60336K0185j05690J23603J90888N4768r6018o2679P6852P9057J458o0243
$$ -160336 -140151 -245841 -122238 68650 123418 27400 -35279 41573 120630 122088 61845
29022F1845m8534j3384J3961K25408J45385K0636n8383K19985o9540L548k56368
$$ 61845 13311 -73 13888 239296 384681 405317 346934 566919 497379 500927 244559
29011B44559k56965J88690j60100o0832j53251M6405o1893P7339J21653J33291
$$ 244559 -12406 176284 16184 -44648 -197899 -151494 -213387 -136048 -14395 118896
29001A18896M1581k93339j08167K35989N7120j5918o1227l23734m3179L33395
$$ 118896 160477 -132862 -241029 -5040 52080 36162 -25065 -348799 -391978 -58583
28991e8583K01085k28694k85321P7174M5917l26038L21197M52720J7102k97513
$$ -58583 142502 -86192 -371513 -294339 -248422 -574460 -253263 199457 216559 -80954
28981h0954k46822J56776L26675K3399m61426j4358Q1461j11867j77170L65031
$$ -80954 -327776 -171000 155675 179074 -282352 -296710 -215249 -327116 -504286 -139255
28971a39255J16635O3734j30733k29387k00112K33935K75141J31264j15498n7704
$$ -139255 -22620 41114 -89619 -319006 -519118 -285183 -10042 121222 5724 -51980
28961e1980O5670m7680J98440O5484n3453o7458J51832M4199J4452o8598K3116
$$ -51980 13690 -33990 164450 229934 176481 109023 260855 305054 319506 250908 274024
28950B74024j05694j59600O90J06424J8359J40550K7865j71231l5964j40617k413
$$ 274024 168330 8730 9420 115844 134203 274753 302618 131387 95423 -45194 -47607
28939d7607Q0792l8471n1549J70627n709j79612Q186P7082O6426p27J36746n1449
$$ -47607 33185 -5286 -56835 113792 108083 -71529 -63343 13739 80165 79438 216184 164735
28927A64735j33227J81242r5837j68288k7177M6545p1019O6686j48656j23220
$$ 164735 31508 212750 116913 -51375 -78552 -32007 -103026 -36340 -184996 -308216
28917c08216K21249L01482N343k49926O1024j3983j49670K07157R6084J03626
$$ -308216 -86967 214515 219858 -30068 30956 16973 -132697 74460 170544 274170
28907B74170J20826n6877J0816j87059k35104j3618M1345P8242n5476k53066j4532
$$ 274170 394996 338119 348935 161876 -73228 -86846 -45501 32741 -22735 -275801 -290333
28896b90333j44553M9331K87190L60162O1520O7769k0087P0080r7655k57626P5706
$$ -290333 -434886 -385555 -98365 261797 323317 391086 370999 441079 343424 85798 161504
28885A61504k2416l06874L3441L48612K2431l14963o1109K48348P8731j06063
$$ 161504 139088 -167786 -134345 214267 236698 -78265 -139374 108974 187705 81642
28875H1642n1814J8581k34460J62776o1282J00898J94295k4506m1587K1687L0074
$$ 81642 29828 48409 -186051 -23275 -84557 16341 210636 186130 144543 166230 196304
28864A96304k05567j65503J5236j15687K80305J58371k0810L7083l50151j68657
$$ 196304 -9263 -174766 -159530 -275217 5088 163459 142649 179732 -170419 -339076
28854c39076L8965O9801Q0853J58391q6602K57831J94058K949l58398l4427O3537
$$ -339076 -300111 -230310 -149457 8934 -77668 180163 374221 377170 18772 -15655 47882
28843D7882J32387k23552j48082J57590o9063J8672j73410L3984q3783j03219
$$ 47882 180269 -43283 -191365 -33775 -102838 -84166 -257576 -223592 -307375 -410594
28833d10594M4417J20721m2550p9555j8869Q2743J99676J03786l9532j66966k96892
$$ -410594 -366177 -245456 -288006 -367561 -386430 -303687 -104011 -225 -39757 -206723 -503615
28822e03615l2905K77390K95877J98880R846n3240J9666M7053L2183r4057l6627
$$ -503615 -536520 -259130 36747 235627 245473 192233 211899 258952 291135 197078 160451
28811A60451j41028N2091K23251N0183j01247j42002l9634j61142K18002m6520
$$ 160451 19423 71514 294765 344948 243701 101699 62065 -99077 118925 72405
28801G2405k9568O1756K2639k5789J65319j32858j18104J07253K85205J57627
$$ 72405 42837 104593 127232 101443 266762 133904 15800 123053 408258 565885
28791E65885j67942m24327j30134O6313o7736J07316K99250P364q9346o9640p3715
$$ 565885 397943 -26384 -156518 -90205 -157941 -50625 248625 255989 166643 97003 23288
28780B3288j97266l6038j72789J09101J51510M8154j65329l57158J07137J79498
$$ 23288 -173978 -210016 -382805 -273704 -122194 -74040 -239369 -596527 -489390 -309892
28770c09892j08172M0167K60751K0228K19419k20880o4720J07300J07560l7205
$$ -309892 -418064 -377897 -117146 -96918 122501 -98379 -163099 -55799 51761 14556
28760A4556J64325J48059j15884r6736J55065N8047n579p6912j81805j70102J1432
$$ 14556 178881 326940 211056 114320 269385 327432 321853 244941 63136 -106966 -95534
28749i5534P703N2413n4692k8349P2169j05594n3739J73J6175Q0117J9039j77444
$$ -95534 -87831 -35418 -90110 -118459 -46290 -151884 -205623 -205450 -189275 -109158 -90119 -267563
28737b67563j50732J35730J78302K2741j47246P284J58955J08244N1400L7630
$$ -267563 -418295 -282565 -104263 -81522 -228768 -221484 -62529 45715 97115 134745
28727A34745K6314r2851k6334L0055Q5579J46568J54295J7280j47368j83083j10317
$$ 134745 161059 68208 41874 71929 157508 304076 458371 475651 328283 145200 34883
28716C4883Q8386r8856j51431K3853r2913j63460N8212K98401J90100J96336J11975
$$ 34883 123269 24413 -127018 -103165 -196078 -359538 -301326 -2925 187175 383511 495486
28705D95486o8511k08960J1689J5379j57550j01978j98716M4351J24086q0254
$$ 495486 426975 218015 229704 245083 87533 -14445 -213161 -168810 -44724 -124978
28695a24978j99856J80557O8832j11513P2538L9963m7606q1246m1276j08135o5432
$$ -124978 -324834 -144277 -75445 -186958 -114420 -74457 -122063 -203309 -244585 -352720 -418152
28684d18152j82815m5006J35713J70181J79898J16730J76094J22544j24803Q0267
$$ -418152 -600967 -645973 -510260 -340079 -160181 -43451 132643 255187 130384 210651
28674B10651J20378J0456k40654j71312j02624j4337O3482p0107K531N9802K41849
$$ 210651 331029 341485 100831 -70481 -173105 -187442 -123960 -194067 -191536 -131734 110115
28663A10115L30385o4007q5177n3859l3348k32393L0013J71262j8816j75793o4518
$$ 110115 440500 376493 291316 237457 204109 -28284 1729 172991 154175 -21618 -86136
28652h6136M9925k3311j21535Q8135J98259R4632K83617R594k74695r1278p8631
$$ -86136 -36211 -59522 -181057 -92922 105337 199969 483586 493180 218485 127207 48576
28641D8576P5889J22888O5724j05283l6980j91453j31641k15639L1525J02473
$$ 48576 124465 247353 313077 207794 170814 -20639 -152280 -367919 -336394 -233921
28631b33921K02739K23262q4906k06301p9145q5075L36565O1354J42778N1110
$$ -233921 -31182 192080 107174 -99127 -178272 -263347 73218 134572 277350 328460
28621C28460L6846l6263K3740j3544n6150q1024j73646l6786m2061L5032K12250
$$ 328460 365306 329043 352783 339239 283089 202065 28419 -8367 -50428 -15396 196854
28610A96854J98233j14163k61420j14150N0502P5964m4124j33658q1960O804Q1348
$$ 196854 395087 280924 19504 -94646 -44144 31820 -12304 -145962 -227922 -221118 -139770
28599a39770J56949K3918j4016P154n1811J61618O6303l72189j84836l5747L4187
$$ -139770 17179 41097 27081 34235 -17576 144042 210345 -161844 -346680 -382427 -348240
28588c48240l827M4477J91256J08770J31919J41077j8628k34852L9868O6363L5749
$$ -348240 -352067 -307590 -116334 -7564 124355 265432 246804 11952 51820 118183 153932
28577A53932j82241R1281J8550j42665J13954p0233K5591J4314k84861j3333P8928
$$ 153932 -28309 62972 81522 -61143 52811 -17422 8169 22483 -262378 -275711 -196783
28566a96783q9061j45608K8428j10262j181L32563K91898o7308j29734P2070M32089
$$ -196783 -285844 -431452 -403024 -513286 -514467 -181904 109994 42686 -87048 -14978 417111
28555D17111J74156j61457j68107j07445n9329j0166L753O5237P596k00846j16466
$$ 417111 591267 429810 261703 154258 94929 84763 88516 153753 161349 -39497 -155963
28544a55963P7752L31645N6278Q5099m815l51408m32805P9004J46327J3916K46548
$$ -155963 -78211 253434 309712 394811 389996 38588 -394217 -315213 -168886 -154970 91578
28533I1578k74020k0870J99057L09171J64050j34442j76258j03365K76390l10548
$$ 91578 -182442 -203312 -4255 304916 468966 334524 158266 54901 331291 20743
28523B0743j15402q3498J3154K73368J09884k2233k4375r6558J25371J80714J27930
$$ 20743 -94659 -178157 -165003 108365 218249 196016 171641 75083 200454 381168 509098
28512E09098j75441k42031k51616N8086M04362J20945j21646r6666J11120q5012
$$ 509098 333657 91626 -159990 -101904 302458 423403 301757 205091 316211 231199
28502B31199j32741J50556K59697J06927P299j26673l53939k48997J5391L06830
$$ 231199 98458 249014 508711 615638 622937 496264 142325 -106672 -91281 215549
28492B15549m5762r4596j13682l7737K30721J04964k7597o8188j76540l0269p1391
$$ 215549 169787 75191 -38491 -76228 154493 259457 231860 163672 -12868 -43137 -114528
28481a14528K97640j56144m5711N1719N4823P3961p6671n5346l1183N0268J94603
$$ -114528 183112 26968 -18743 32976 87799 161760 85089 29743 -1440 48828 243431
28470B43431K36725j68993j34751j50796O4005K8270j0528q9962R358j5069j07249
$$ 243431 480156 311163 176412 25616 89621 117891 107363 17401 26759 11690 -95559
28459i5559p5468N7732R3166r3160l2192J77875J81490l41288k27619J92855K85770
$$ -95559 -171027 -113295 -20129 -113289 -145481 32394 213884 -127404 -355023 -162168 123602
28448A23602J1706j42817J28921r523j97777p8402l6484q41O1769R0541P8673
$$ 123602 135308 -7509 121412 111889 -85888 -164290 -200774 -201615 -139846 -49305 29368
28437B9368j0174M45434K2881k41884j45695O5941J13612j84429N6453n6933N102
$$ 29368 19194 464628 487509 245625 99930 165871 279483 95054 151507 94574 99676
28426I9676R2308o0043j00053k76571j75717J88060K7010K70615K45631j2100
$$ 99676 191984 131941 31888 -244683 -420400 -232340 -205330 65285 310916 298816
28416B98816k22737l02701l59540K90626M15906j9701j57247o5355J5869M9979
$$ 298816 76079 -226622 -586162 -295536 120370 100669 -56578 -121933 -106064 -56085
28406e6085m9847j40344j18420M434M8110J41021j80008j68047L9742P3498K3480
$$ -56085 -105932 -246276 -364696 -360262 -312152 -171131 -351139 -519186 -479444 -405946 -382466
28395c82466J11995J30603j5596J30773J43686j03879k60257j91906J6141J86707
$$ -382466 -270471 -139868 -155464 -24691 118995 15116 -245141 -437047 -420906 -234199
28385b34199K12274K33180m441p8018l34748l8438J72059R2857k29116j23989
$$ -234199 -21925 211255 206814 128796 -205952 -244390 -72331 20526 -208590 -332579
28375c32579q2287K32523L7632j81531l9899n6559J67136L05364p9048l14312
$$ -332579 -414866 -182343 -144711 -326242 -366141 -422700 -255564 49800 -29248 -343560
28365c43560q480Q3282J25866J4702j34053r7441L02843J45307J07634J67179
$$ -343560 -352040 -268758 -142892 -128190 -262243 -359684 -56841 88466 196100 363279
28355C63279j94040J41754N0026l18320m80J37747J86746j96300k21163n1379
$$ 363279 169239 310993 361019 42699 42219 179966 366712 170412 -50751 -102130
28345a02130J71537J05771j57072m8514r4397M2269j81055k65724J42932L0443
$$ -102130 69407 175178 18106 -30408 -124805 -82536 -263591 -529315 -386383 -355940
28335c55940o6713n2777J08103K31046K95218L0085J15481n6289p2349J44204
$$ -355940 -422653 -475430 -367327 -136281 158937 189022 304503 248214 175865 320069
28325C20069q3035n0591j12451q388N0168J81232J23896j22660n1262K3395j73918
$$ 320069 237034 186443 73992 65604 115772 297004 420900 298240 246978 270373 96455
28314I6455m3164L1682j45255k15392M9281K1088m5520P5653j54862j41866j57318
$$ 96455 53291 84973 -60282 -275674 -226393 -205305 -250825 -175172 -330034 -471900 -629218
28303f29218p944N53181J25355k19424r3657K68951K75832O0651k85725k99981
$$ -629218 -637162 -83981 41374 -178050 -271707 -2756 273076 333727 48002 -251979
28293b51979n5423K00645n7792J56211j27632p5348j2355K0027J26675M0168J4530
$$ -251979 -307402 -106757 -164549 -8338 -135970 -211318 -223673 -203646 -76971 -36803 -22273
28282b2273J33180K24198k30626l58250j13902K22542J60178M4602M7604k53239
$$ -22273 110907 335105 104479 -253771 -367673 -145131 15047 59649 107253 -145986
28272a45986P691j9474L7348J66452P2578O2517j96110q999l1044K9270J49386
$$ -145986 -138295 -157769 -120421 46031 118609 181126 -14984 -23983 -55027 -25757 123629
28261A23629N1720P0021m1148J04367r8785j33314J23809l79413o3593J59910
$$ 123629 175349 245370 204222 308589 209804 76490 200299 -179114 -242707 -82797
28251h2797j8247J471J28647K12521O867l32637J18455J16004j37967p0817N6803
$$ -82797 -101044 -99573 29074 241595 248462 -84175 34280 150284 12317 -58500 -1697
28240a697J04791k10076o7350J9941j14823J35144J27007o2223n3257K08203J6986
$$ -1697 103094 -106982 -174332 -154391 -269214 -134070 -7063 -69286 -122543 85660 102646
28229A02646l20792Q5891J58076J078j36629n4177J08413J9082J2330l0262J60607
$$ 102646 -218146 -132255 25821 26899 -109730 -163907 -55494 -36412 -24082 -54344 106263
28218A06263J50929J04957j48105j19576q8475j84023L6599J5395P9752J85628
$$ 106263 257192 362149 214044 94468 5993 -178030 -141431 -126036 -46284 139344
28208A39344k9888k6805j16329O2077J73148k54008j45259l3811J093P6576K19564
$$ 139344 109456 82651 -33678 28399 201547 -52461 -197720 -231531 -230438 -153862 65702
28197F5702m1010j12292m2486j79167j41012K24716J82210P9825j30396n6466
$$ 65702 24692 -87600 -130086 -309253 -450265 -225549 -43339 36486 -93910 -150376
28187a50376J40732N742j10945j4818K12515n9133L5585J52980R5243j00875k61302
$$ -150376 -9644 -3902 -114847 -129665 82850 23717 59302 212282 307525 206650 -54652
28176e4652Q8085j89585k67208p104K49674K90656Q5909j31198N3246j0482l9522
$$ -54652 33433 -156152 -423360 -430464 -180790 109866 195775 64577 117823 107341 67819
28165F7819m8170l9661k6348J54761m9437p5598m195J97787p7698m8027J56025
$$ 67819 19649 -20012 -46360 108401 58964 -16634 -20829 176958 99260 51233 207258
28154B07258P6855k97633l7750j25576J49640K49814l00798J58589J24057J24153
$$ 207258 284113 -13520 -51270 -176846 -27206 222608 -78190 80399 204456 328609
28144C28609k5431k7095j54816l0335n4004J22815j03490J3736j34296m28857
$$ 328609 303178 276083 121267 90932 36928 159743 56253 69989 -64307 -493164
28134d93164p7402K0402M3640J84888o6461O433r2730J09520L78814o8100J13273
$$ -493164 -570566 -550164 -506524 -321636 -388097 -381664 -474394 -364874 13940 -54160 59113
28123E9113P4011k93978r4784m9125k23978J1976p9490K58509J67067n3277j75512
$$ 59113 133124 -160854 -255638 -304763 -528741 -516765 -596255 -337746 -170679 -223956 -399468
28112c99468j7324Q9172J18308J24804K6786J26510r4218r6392J68834j88164
$$ -399468 -416792 -327620 -209312 -84508 -57722 68788 -25430 -121822 47012 -141152
28102a41152r7455K1829l0164j2427J98891K59531O4024r3887n9017r0283J25533
$$ -141152 -238607 -216778 -246942 -259369 -60478 199053 263077 169190 110173 19890 145423
28091A45423K5021r4459J06952Q751N4477j58634q3713m6432J00316R3611j69469
$$ 145423 170444 75985 182937 191688 246165 87531 3818 -42614 57702 151313 -18156
28080a8156l7999L4138K28760Q3184K0510k71396k18047L1466L8995M6920j46276
$$ -18156 -56155 -22017 206743 289927 310437 39041 -179006 -147540 -108545 -61625 -207901
28069b07901K8671N2580R2971J30647j77855n9300J04524M3392r8154J48519K4738
$$ -207901 -179230 -126650 -33679 96968 -80887 -140187 -35663 7729 -90425 58094 82832
28058H2832j76134K4994j66365j32459Q7507q5116K3650r9434K51081K07380j85224
$$ 82832 -93302 -68308 -234673 -367132 -279625 -364741 -341091 -440525 -189444 17936 -167288
28047a67288j13125l5265l1681J31455K56579n1800j55588K9774J52212J9646
$$ -167288 -280413 -315678 -347359 -215904 40675 -11125 -166713 -136939 15273 34919
28037C4919k81773O3128K53575K62018l293k53414l67806m82319K86350K36822
$$ 34919 -246854 -183726 69849 331867 328574 75160 -292646 -774965 -488615 -251793
28027b51793l8361j47669m6016K9979K65911P7561O8915j52555j8905J01317K95519
$$ -251793 -290154 -437823 -483839 -453860 -187949 -110388 -41473 -194028 -212933 -111616 183903
28016A83903k4811J4995j85010k12346N007k6495J02559j4007L9595J40183K91747
$$ 183903 159092 174087 -10923 -223269 -218262 -244757 -142198 -156205 -116610 23573 315320
28005C15320J62339j39559J32946K1420o8478k37133J0096j59060j14551J3746
$$ 315320 477659 338100 471046 492466 423988 186855 196951 37891 -76660 -62914
27995f2914J71007J77212J0650k5343l6426j66728k58776Q0359O6173m7145j4792
$$ -62914 108093 285305 295955 270612 234186 67458 -191318 -110959 -44786 -91931 -106723
27984a06723M4309L9877j69125J16634O2999J6679k82913j29324M08890J4919
$$ -106723 -62414 -22537 -191662 -75028 -12029 4650 -278263 -407587 1303 16222
27974A6222k27829j90844L04155M04956J65098p465j48958m57966k69076Q4799
$$ 16222 -211607 -402451 -98296 306660 471758 464293 315335 -142631 -411707 -326908
27964c26908l9650N5295R093M9722J08906j0312j70539k54263J44818J66937J62425
$$ -326908 -366558 -311263 -302170 -252448 -143542 -153854 -324393 -578656 -433838 -266901 -104476
27953a04476J07824L9685j59303O3893j37288p3868R4035J9083L3459J81563N3985
$$ -104476 3348 43033 -116270 -52377 -189665 -263533 -169498 -150415 -116956 64607 118592
27942A18592l8736K02042J01189m75637k17578r0584m4307k43126P8991J13101
$$ 118592 79856 281898 383087 -92550 -310128 -400712 -445019 -688145 -609154 -496053
27932d96053K29989J28350k08044j85776j41340Q9817N3361L20329K72473J80554
$$ -496053 -266064 -137714 -345758 -531534 -672874 -583057 -529696 -209367 63106 243660
27922B43660k41877j25348q3589K76445J10640k72100k87368J57022N4293k7206
$$ 243660 1783 -123565 -207154 69291 179931 -92169 -379537 -222515 -168222 -195428
27912a95428o4142K06218J01639O82j48832N7328J70797O253n6522R5966j50136
$$ -195428 -259570 -53352 48287 48969 -99863 -42535 128262 134515 77993 173959 23823
27901B3823Q0372q6054O9986P986k39913J9980K51645k9821R9300j8596j15990
$$ 23823 104195 18141 88127 96113 -143800 -123820 127825 98004 197304 178708 62718
27890F2718j16747Q1626n0227m9149K27521J24979j28410J23030j72618q1636
$$ 62718 -54029 27597 -22630 -71779 155742 280721 152311 275341 102723 21087
27880B1087Q1841L4449j62730J02529q487p3980J19135l1467j29598R9519L32
$$ 21087 102928 137377 -25353 77176 68689 -5291 113844 82377 -47221 52298 52630
27869E2630j84800k43698r7369J88231q3595P0785L8232k6596j33760r6773J37598
$$ 52630 -132170 -375868 -473237 -285006 -368601 -297816 -259584 -286180 -419940 -516713 -379115
27858c79115L2889J91137K63347J27125j30691k16737L2134Q9899N9008r8128
$$ -379115 -346226 -155089 108258 235383 104692 -112045 -79911 9988 68996 -29132
27848b9132k5713J51174J18868q2471k00695q1792k80151k17694J54586P7686
$$ -29132 -54845 96329 215197 132726 -67969 -149761 -429912 -647606 -493020 -415334
27838d15334J81820K32248k58613k87k6645O4818J36607k28064m018J84600O2467
$$ -415334 -233514 -1266 -259879 -260166 -286811 -221993 -85386 -313450 -317468 -132868 -70401
27827g0401o5574O3650k2073L1110j32691K13168L45054j02337k68362J44772
$$ -70401 -135975 -72325 -94398 -63288 -195979 17189 362243 259906 -8456 136316
27817A36316J6574n6311K5075O2231m0521j42694l03344l4639p416J76575N15586
$$ 136316 152890 96579 121654 183885 143364 670 -302674 -337313 -344729 -168154 347432
27806C47432Q5566j08807J16419j60293r3955l6904m9727j55533j10308Q1461
$$ 347432 432998 324191 440610 280317 186362 149458 99731 -55802 -166110 -84649
27796h4649R0687k3593k47422j16129J34630n6451n5655Q6762j41035J13418J69163
$$ -84649 6038 -17555 -264977 -381106 -246476 -302927 -358582 -271820 -412855 -299437 -130274
27785a30274j53404j09741O6807J36791j41943j9372K06695J55320l41549o4887
$$ -130274 -283678 -393419 -326612 -189821 -331764 -351136 -144441 10879 -330670 -395557
27775c95557K01093o0560J62639J17811J99582k92189j28359p9978J25214j00092
$$ -395557 -194464 -255024 -92385 25426 225008 -67181 -195540 -275518 -150304 -250396
27765b50396q0083O5786K14609J30213P2440J24530K22197J9023m7297Q9804Q8703
$$ -250396 -330479 -264693 -50084 80129 152569 277099 499296 518319 471022 560826 649529
27754F49529l35587l43087p3400L8164q4775j0307J32010J93255r7149j07634
$$ 649529 313942 -29145 -102545 -64381 -149156 -159463 -27453 165802 68653 -38981
27744c8981Q0644J10523o5225K4434P9207J62813Q5538j09157m1511P6214j38169
$$ -38981 41663 152186 86961 111395 190602 353415 438953 329796 288285 364499 226330
27733B26330m15945l799J27273o4949J29321O3785o781j88470j3954J03654M1734
$$ 226330 -189615 -193414 -66141 -131090 -1769 62016 55235 -133235 -147189 -43535 -1801
27722a801m3332m41997Q4243J63637J31980J52194j18094m9260K3345j34789q4420
$$ -1801 -45133 -487130 -402887 -239250 -107270 44924 -73170 -122430 -99085 -233874 -318294
27711c18294J15218j11086K01042J47584j42486j32260M1953J41595J17653r9197
$$ -318294 -203076 -314162 -113120 34464 -108022 -240282 -198329 -56734 60919 -38278
27701c8278j40222l7658j01824j33323J50900m7048j90773J20381P4018K21264
$$ -38278 -178500 -216158 -317982 -451305 -300405 -347453 -538226 -417845 -343827 -122563
27691a22563J99311K9314k9951m6399J2214J03333Q3534j28986J00402N440J97571
$$ -122563 76748 106062 76111 29712 41926 145259 228793 99807 200209 205649 403220
27680D03220J16196K3511o9051m13998O1009l2620k98380q1500Q8890l8984Q4014
$$ 403220 519416 542927 473876 59878 120887 88267 -210113 -291613 -202723 -241707 -157693
27669a57693L21198M8370j26011k75727k96676J80001N9036k8293J15220J4840
$$ -157693 163505 211875 85864 -189863 -486539 -306538 -247502 -275795 -160575 -145735
27659a45735j06621R4765K63085R2655j32258J26162l07023j73415N9810M4423
$$ -145735 -252356 -157591 105494 198149 65891 192053 -114970 -288385 -228575 -184152
27649a84152L8460K4873K52940p4203J50957Q2997k92746j90093j81292j27281
$$ -184152 -145692 -120819 132121 57918 208875 291872 -874 -190967 -372259 -499540
27639d99540J67995k2559J42595J98945J06766O2788q2569j30883l8440K05547
$$ -499540 -331545 -354104 -211509 -12564 94202 156990 74421 -56462 -94902 110645
27629A10645J95110K233J19738j76840k99785j43464n6743O4355J94199j09269
$$ 110645 305755 307988 427726 250886 -48899 -192363 -249106 -184751 9448 -99821
27619i9821O0344J94266q1399l0046q8633o8519r1642n9926k42866K50026L15356
$$ -99821 -39477 154789 73390 43344 -45289 -113808 -205450 -265376 -508242 -258216 57140
27608E7140M4910j41422p0851K65201K70809K7824k10905q3907P6020J52461j5938
$$ 57140 102050 -39372 -110223 154978 425787 453611 242706 158799 234819 387280 371342
27597C71342l4051j5444j8742j3754n5765l0540P834k01922j71476r9162L41146
$$ 371342 337291 321847 303105 289351 233586 203046 210880 8958 -162518 -261680 79466
27586G9466M8342M3510L797p886j66714l62770O5541l9845l2814o351J67732J32865
$$ 79466 127808 171318 175115 167229 515 -362255 -296714 -336559 -369373 -375724 -207992 -75127
27574g5127k73737O1947j63703L7127J88877k04354k5910L32896L37167l1407
$$ -75127 -348864 -286917 -450620 -413493 -224616 -428970 -454880 -121984 215183 183776
27564A83776l286j19606j60855m6654m5647K5723J42632p0870M7388K7680j65040
$$ 183776 180490 60884 -99971 -146625 -192272 -166549 -23917 -94787 -47399 -19719 -184759
27553a84759j69028L32860m084M4461R6851l8904M2038J120R6965j00772q2805
$$ -184759 -353787 -20927 -25011 19450 116301 77397 119435 120555 217520 116748 33943
27542C3943R4574k734K05119r9114k56945j98660J63674L36225P1280J17982O6593
$$ 33943 128517 125783 330902 231788 -25157 -223817 -60143 276082 347362 465344 531937
27531E31937j88051k08315j12j36662q3316j79923l7209m9006L6513J97266K12763
$$ 531937 343886 135571 135459 -1203 -84519 -264442 -301651 -350657 -314144 -116878 95885
27520I5885J02236J4365N7290N4931n5498o6763j39370p4871j05203l732J98944
$$ 95885 198121 212486 269776 324707 269209 202446 63076 -11795 -116998 -120730 78214
27509G8214j02822l2091K01125k364k19294k2606K91455J08981P409j328j40697
$$ 78214 -24608 -56699 144426 142062 -77232 -99838 191617 300598 308007 306679 165982
27498A65982r2386M1148J05358J21364K34434K1072k94360j00768M9521J08014
$$ 165982 73596 114744 220102 341466 575900 596972 302612 201844 251365 359379
27488C59379R3887n09451j35515J26647K07388l19535k26303J78554p4753k5279
$$ 359379 453266 -56185 -191700 -65053 142335 -177200 -403503 -224949 -299702 -324981
27478c24981P9069L36324J20751l31474r9747L37934J20639k25559J42802j407
$$ -324981 -245912 90412 211163 -120311 -220058 117876 238515 12956 155758 154351
27468A54351j08990k08916R6905J12998k49426j91336J03766J6483J26054J19956
$$ 154351 45361 -163555 -66650 46348 -203078 -394414 -290648 -274165 -148111 -28155
27458b8155O6353r2133n8754k16897O8616O4909O4546L6807J1749j06562o3452
$$ -28155 38198 -53935 -112689 -329586 -260970 -196061 -131515 -94708 -82959 -189521 -252973
27447b52973Q7787R3373M3810j9052R0565J51041R4725k25623j72826J04099j84322
$$ -252973 -165186 -71813 -28003 -47055 43510 194551 289276 63653 -109173 -5074 -189396
27436a89396o3922K67053m1632k8018o0339j78837P4387j09647j23161J3374J47858
$$ -189396 -253318 13735 -27897 -55915 -116254 -295091 -220704 -330351 -453512 -440138 -292280
27425b92280j08298J12470J79614Q5228k451J25485J17522q1848k01332J86455
$$ -292280 -400578 -288108 -108494 -23266 -25717 99768 217290 135442 -65890 120565
27415A20565O8006J1176r3531m0516p9267j74359J97635R7191P3684r6224q5858
$$ 120565 188571 199747 106216 65700 -13567 -187926 9709 106900 180584 84360 -1498
27404a498j06224j75671P779K7424J21074Q3302J20462J86698m2367o8070k65059
$$ -1498 -107722 -283393 -275614 -248190 -127116 -43814 76648 263346 220979 152909 -112150
27393a12150j1583k45357k68801O1458Q934L95708M42970j80026j56969p9768
$$ -112150 -123733 -369090 -637891 -576433 -567499 -171791 271179 91153 -65816 -145584
27383a45584j14958j3763Q7181Q8371j07663k17760P4418j33505O0365O9684L11518
$$ -145584 -260542 -274305 -187124 -98753 -206416 -424176 -349758 -483263 -422898 -353214 -41696
27372d1696J60153k41130j05015J35545j71831Q4770J08648Q3690N9842j49437
$$ -41696 118457 -122673 -227688 -92143 -263974 -179204 -70556 13134 72976 -76461
27362g6461k38192O7458J35763L205l30722n4388N739L66294R8293o3816j28854
$$ -76461 -314653 -247195 -111432 -108227 -438949 -493337 -487598 -121304 -23011 -86827 -215681
27351b15681L04903K0225j85255N3576J76791J57547k6037j9558J88645k3637
$$ -215681 89222 109447 -75808 -22232 154559 312106 286069 266511 455156 431519
27341D31519j13934r4022K30387L7096j17491j71088k07289j87328o71j3518L073
$$ 431519 317585 223563 453950 491046 373555 202467 -4822 -192150 -192821 -206339 -203266
27330b03266J65948K46031P5600j09617k86354P2515J92752p4867j78620n6799
$$ -203266 -37318 208713 284313 174696 -111658 -39143 153609 78742 -99878 -156677
27320a56677J66643J83147r570j52166J77256J35293k13024k94542J65210L5930
$$ -156677 9966 193113 183543 31377 208633 343926 130902 -163640 1570 37500
27310C7500r9962J19200J69427p7624k24508M8560P4046p3201P9654o7421O1812
$$ 37500 -62462 56738 226165 148541 -75967 -27407 46639 -26562 53092 -14329 47483
27299D7483J15295R4955l9100p6200J42794K6159M2771m3681o6313l30533k91491
$$ 47483 162778 257733 218633 142433 285227 311386 354157 310476 244163 -86370 -377861
27288c77861j87557L44254m1530l681J91264K52568K95190j40233m92307q9804
$$ -377861 -565418 -221164 -262694 -266375 -75111 177457 472647 332414 -159893 -249697
27278b49697O9782o7091k10874J310J46601J87092L78357o2985l32855N6729j05798
$$ -249697 -179915 -247006 -457880 -456570 -309969 -122877 255480 192495 -140360 -83631 -189429
27267a89429J20255J59733L3639J00678p0634L8609K0825r7734l79211j52641
$$ -189429 -69174 90559 124198 224876 154242 192851 213676 115942 -263269 -415910
27257d15910o4547J48013O7666K11008L9850M4188J82929K1958Q512j96122k80955
$$ -415910 -480457 -332444 -264778 -53770 -13920 30268 213197 235155 243667 47545 -233410
27246b33410j1795L3695O668K58960Q6903L1218q5027j12515k31839j47450J11458
$$ -233410 -245205 -211510 -204842 54118 141021 172239 87212 -25303 -257142 -404592 -293134
27235b93134J08072J40197Q2614k5601j11293j22817K12700J80788j23243K5121
$$ -293134 -185062 -44865 37749 12148 -99145 -221962 -9262 171526 48283 73404
27225G3404k01703K1745L2392n8753N0980J8517n7474K72336J74526j166j92074
$$ 73404 -128299 -106554 -74162 -132915 -81935 -63418 -120892 151444 325970 324804 132730
27214A32730r8374p6161N383k53892m0878M3022r7331q3324K2068j28764J89419
$$ 132730 34356 -41805 -36422 -290314 -331192 -288170 -385501 -468825 -446757 -575521 -386102
27203c86102m4327k16403j1237L61172J49734q0136r3241Q5096K37368N9708N1385
$$ -386102 -430429 -646832 -658069 -296897 -147163 -227299 -320540 -235444 1924 61632 113017
27192A13017j95870j66334L0222J54388L05863q1981M6691K22917p1243j89549
$$ 113017 -82853 -249187 -218965 -64577 241286 159305 205996 428913 357670 168121
27182A68121r2489J26804J2210k27674N7635K55125L4933l47072j48667Q8568
$$ 168121 75632 202436 214646 -13028 44607 299732 334665 -12407 -161074 -72506
27172g2506k3469J4286P2975N2889J2728K3725j14204j93627R1764K0373L9876
$$ -72506 -95975 -81689 -8714 44175 56903 80628 -33576 -227203 -135439 -115066 -75190
27161g5190J12750R044j34812J17707j31235q1118K02290r3078q1524j6356m6277
$$ -75190 37560 46604 -88208 29499 -101736 -182854 19436 -73642 -155166 -171522 -217799
27150b17799L93463J28964m0633m1853r3912q0911J89059J57144p903n0882j43613
$$ -217799 175664 304628 263995 222142 128230 47319 236378 393522 385619 334737 191124
27139A91124j96959j39120J26473J78845j15277r7809l812K35764J290J16690
$$ 191124 -5835 -144955 -18482 160363 45086 -52723 -56535 179229 180519 297209
27129B97209l00868j17041n0644J68052K52733j2412k40006k17870m7021J10486
$$ 297209 -3659 -120700 -171344 -3292 249441 237029 -2977 -220847 -267868 -157382
27119a57382K59854J02413j9465L5454J11984p4807k03256k7635L3571M9874J64518
$$ -157382 102472 204885 185420 220874 332858 258051 54795 27160 60731 110605 275123
27108B75123M4431m2616k0824l96119r0955L9578J82251j71211q3962J33611M44938
$$ 275123 319554 276938 256114 -140005 -230960 -191382 -9131 -180342 -264304 -130693 314245
27097C14245K0094K34585l9679k76320q7506k4448j01261r7795o6327N4673r2315
$$ 314245 334339 568924 529245 252925 165419 140971 39710 -58085 -124412 -69739 -162054
27086a62054K5070P440J29217p0483J09201j43413j01118K4377o1216P3544L18932
$$ -162054 -136984 -129544 -327 -70810 38391 -105022 -206140 -181763 -242979 -169435 149497
27075A49497L11096n9709j10928j01926M3415Q224J2018j26305r4414J57257j10908
$$ 149497 460593 400884 289956 188030 231445 239669 251687 125382 30968 188225 77317
27064G7317n6559r9978o1928l6298J10447N0095j40656l8348k19737P6358L28137
$$ 77317 20758 -79220 -141148 -177446 -66999 -16904 -157560 -195908 -415645 -339287 -11150
27053a1150j81169J07136J58220N0670k1598j09341R1983k1469j8486L2777j84759
$$ -11150 -192319 -85183 73037 123707 102109 -7232 84751 63282 44796 77573 -107186
27042a07186j80293J65639J12459O9815P5961O4515k19420k23322K14702J9996
$$ -107186 -287479 -121840 -9381 60434 136395 200910 -18510 -241832 -27130 -7134
27032g134J04892J41747j42465j83839j39403R2221r8110J41119K86789j0541
$$ -7134 97758 239505 97040 -86799 -226202 -133981 -232091 -90972 195817 185276
27022A85276k25295l8776J02012K6002o1390m3013o4049j01042R0718j16337J84571
$$ 185276 -40019 -78795 23217 49219 -12171 -55184 -119233 -220275 -129557 -245894 -61323
27011f1323J40397n9481k46743L57658J19321m2348j66247j05252J02674J42998
$$ -61323 79074 19593 -227150 130508 249829 207481 41234 -64018 38656 181654
27001A81654L9250p2660l9110P6822k76654j38560J03348l2679L82397J54348
$$ 181654 220904 148244 109134 185956 -90698 -229258 -125910 -158589 223808 378156
26991C78156j05321p6034m3591N1448j01840l59367k8011q756m8068J10421k19527
$$ 378156 272835 196801 153210 204658 102818 -256549 -284560 -293316 -341384 -230963 -450490
26980d50490j17502K73774K16691n7697j26966r8598J09305j42372J28457J08440
$$ -450490 -567992 -294218 -77527 -135224 -262190 -360788 -251483 -393855 -265398 -156958
26970a56958k1425o2734J97880k8994j50513j00568J72403J845J42896Q0179j73532
$$ -156958 -178383 -241117 -43237 -72231 -222744 -323312 -150909 -149064 -6168 74011 -99521
26959i9521k79858l9311J63029L66248J37541J7630n0950o2102p2733M5358o2292
$$ -99521 -379379 -418690 -255661 110587 248128 265758 214808 152706 79973 125331 63039
26948F3039j31829j92117q6566j12958m161J44520L8572Q5565J44147K1006j66268
$$ 63039 -68790 -260907 -347473 -460431 -464592 -320072 -281500 -195935 -51788 -30782 -197050
26937a97050j33184Q1648L03585j26071j82713j214K10250K07261J74720k80j38577
$$ -197050 -330234 -248586 54999 -71072 -253785 -254999 -44749 162512 337232 336952 198375
26926A98375m62010l7722K17447M5653k4386p3206P7514l2432J47595R5168J20632
$$ 198375 -263635 -301357 -83910 -38257 -62643 -135849 -58335 -90767 56828 151996 272628
26915B72628J15781o3976j93825l05561o2576k71648J10325K98308K6592j07468
$$ 272628 388409 324433 130608 -174953 -237529 -509177 -398852 -100544 -73952 -181420
26905a81420l2923M2626J5253L9315l8826j42494K4336J02058L50147M7197j76256
$$ -181420 -214343 -171717 -156464 -117149 -155975 -298469 -274133 -172075 178072 225269 49013
26894D9013j50898l1892J1038j58918O0975J02487j17867M6946J256r8069n6485
$$ 49013 -101885 -133777 -122739 -281657 -220682 -118195 -236062 -189116 -187860 -285929 -342414
26883c42414K2987p9883K45180K93311j23558j21153l6330R2649J62128J45581
$$ -342414 -319427 -399310 -154130 139181 15623 -105530 -141860 -49211 112917 258498
26873B58498j18769l7616j25412k04218J93790K29788L8181o9031m0716k01707
$$ 258498 139729 102113 -23299 -227517 -33727 196061 234242 165211 124495 -77212
26863g7212j08515k13224l26994O5697L03310J12887j01774P2350K08146Q0063
$$ -77212 -185727 -398951 -725945 -660248 -356938 -244051 -345825 -273475 -65329 14734
26853A4734r0271j43242K0211K63366j2255j34637k0315j1953J47945q9346p8973
$$ 14734 -75537 -218779 -198568 64798 52543 -82094 -102409 -114362 33583 -55763 -134736
26842a34736q8245l4544O2812p4417K48414k1391K5936j24027J57125J6361p1357
$$ -134736 -222981 -257525 -194713 -269130 -20716 -42107 -16171 -140198 16927 33288 -38069
26831c8069M6371J15588r2963o3216k83216M2951J33602j27925N720J57161J49718
$$ -38069 8302 123890 30927 -32289 -315505 -272554 -138952 -266877 -261157 -103996 45722
26820D5722L786J3540R3443j88177k37760J14054L59680M0685j14877k53660r3481
$$ 45722 49508 63048 156491 -31686 -269446 -155392 204288 244973 130096 -123564 -217045
26809b17045j6193k0657L055q8479J34806r0447j43331R5201J46712J53654l3354
$$ -217045 -233238 -253895 -250840 -339319 -204513 -294960 -438291 -343090 -196378 -42724 -76078
26798g6078N4756j95341n8357K1905j30070Q6561j08685j5760L22285K52713L8903
$$ -76078 -21322 -216663 -275020 -253115 -383185 -296624 -405309 -421069 -98784 153929 192832
26787A92832m4203J03521j17254o4801j08529j7252k25393m4125K630N1828N0291
$$ 192832 148629 252150 134896 70095 -38434 -55686 -281079 -325204 -322574 -270746 -220455
26776b20455J60855J37884j3628j99522p8175K14202J85334p8249j696k95802
$$ -220455 -59600 78284 64656 -134866 -213041 1161 186495 108246 106550 -189252
26766a89252j91746K67241K56110j02261M0474j4929l9118O2065l3708Q1558q2026
$$ -189252 -380998 -113757 142353 40092 80566 65637 26519 88584 54876 136434 54408
26755E4408J05297q0488m5544j71208j30377J14158L51189l3061R7533q7475j93951
$$ 54408 159705 79217 33673 -137535 -267912 -153754 197435 164374 261907 174432 -19519
26744a9519j54755l21201J6570L09936J15693k10564j38127K73557J31597J18639
$$ -19519 -174274 -495475 -478905 -168969 -53276 -263840 -401967 -128410 3187 121826
26734A21826K2042J30068j35193k38063j33586o3615K02636P5389K17455K65370
$$ 121826 143868 273936 138743 -99320 -232906 -296521 -93885 -18496 198959 464329
26724D64329j19262k32010k94665n7443m5277k76659K96866J7465P1455J75252
$$ 464329 345067 113057 -181608 -239051 -284328 -560987 -264121 -246656 -175201 51
26714E1j76379q4328M89020K32151q9150j93883j87472n9871J34138J18781j46133
$$ 51 -176328 -260656 228364 460515 371365 177482 -9990 -69861 64277 183058 36925
26703C6925J5143M158J22683L924j45505p6346l3109P2437J65184j8838J2940
$$ 36925 52068 56226 178909 182833 37328 -39018 -72127 310 165494 146656 159596
26692A59596O3916J23601m45439j59291k8182j38139J63905L66319K15978j22391
$$ 159596 223512 347113 -98326 -257617 -285799 -423938 -260033 106286 322264 199873
26682A99873k49563k40474q7233K186J31129q362K92460L2267j05291J6862l7356
$$ 199873 -49690 -290164 -377397 -375211 -244082 -252444 40016 72283 -33008 -16146 -53502
26671e3502J33108J30351L6130l14982n60380j24154J73810L02357J53882M5489
$$ -53502 79606 209957 246087 -68895 -629275 -753429 -579619 -277262 -123380 -77891
26661g7891j53937k24278P1967J96744m934M1390k0967K305r1068j25777K48392
$$ -77891 -231828 -456106 -384139 -187395 -192329 -150939 -171906 -169601 -260669 -386446 -138054
26650a38054J42281n9707j36622M8008j08515M9898J00004Q3318K28995J3254
$$ -138054 4227 -55480 -192102 -144094 -252609 -202711 -102707 -19389 209606 222860
26640B22860J0897j50888n9560l2065l5424k54898m380K26853q0509m6618K54164
$$ 222860 233757 82869 23309 -8756 -44180 -299078 -303458 -76605 -157114 -203732 50432
26629E0432n3770K23671K51949p0647m58583j30441k20819J93009J44439q9406
$$ 50432 -3338 220333 472282 401635 -56948 -187389 -408208 -215199 -70760 -160166
26619a60166l58494J54175K73216M218J21339R1221R19l9687l57235J17182R6361
$$ -160166 -518660 -364485 -91269 -87051 34288 125509 126428 86741 -270494 -153312 -56951
26608e6951J5076l8065q1319j89919K5320k1109K5764P5060J96245J01801L8082
$$ -56951 -41875 -79940 -161259 -351178 -325858 -346967 -321203 -246143 -49898 51903 89985
26597H9985O2581J12915J81262j26148j6034k32381p063j1474J47986M8224l2399
$$ 89985 152566 265481 446743 320595 304561 72180 65117 53643 201629 249853 217454
26586B17454J19750l4959n2137j87885j42134L3824K10993N5982k71678k76814
$$ 217454 337204 302245 250108 62223 -79911 -46087 164906 220888 -50790 -327604
26576c27604K03618K28495K27348n7124l2020j99200j547R0468j78585j18228
$$ -327604 -123986 104509 331857 274733 242713 43513 41966 132434 -46151 -164379
26566a64379P3878R3806m0650m512J67461N1790j62756J44946K88929j64752j50152
$$ -164379 -90501 3305 -37345 -41857 125604 177394 14638 159584 448513 283761 133609
26555A33609k9455r0154Q9339K28373R2478k1538K34134K48593j24851m38669
$$ 133609 104154 14000 103339 331712 424190 402652 636786 885379 760528 321859
26545C21859j69592R8957k5585n4691R7343J59074o2838k09601j11058J23402
$$ 321859 152267 251224 225639 170948 268291 427365 364527 154926 43868 167270
26535A67270M3875m1753R7388K00611q2374l04377j0164p108l6270j8446K08420
$$ 167270 211145 169392 266780 467391 385017 80640 70476 63368 27098 8652 217072
26524B17072L3129r2123p5302l14504J52156J67521J33899O557L5940P448n4862
$$ 217072 250201 158078 82776 -231728 -79572 87949 221848 228405 264345 271793 216931
26513B16931k7731j23033K96613J39319j87723l10386O0449M3045q7799P2665
$$ 216931 189200 66167 362780 502099 314376 3990 64439 107484 19685 92350
26503I2350K56179q4758j60661k419J807R8748J08799j94247l95550k92654J37844
$$ 92350 348529 263771 103110 100691 102498 201246 310045 115798 -279752 -572406 -434562
26492d34562J28172J40316M8176r4284J22980L83694P3487j45081k75877j69970
$$ -434562 -306390 -166074 -117898 -212182 -89202 294492 367979 222898 -52979 -222949
26482b22949P8058o078m7215K21970q976P5857L7644K11250N1089L1081J98894
$$ -222949 -144891 -150969 -198184 23786 14810 90667 128311 339561 390650 421731 620625
26471F20625j96212j05046j64303R513P8171J95168N8602j65321l6262k45016
$$ 620625 424413 319367 155064 164577 242748 437916 496518 331197 294935 49919
26461D9919k76970P2180J62807K14405o7092o4591j07435P5774M4155J54710J70965
$$ 49919 -227051 -154871 7936 222341 155249 90658 -16777 58997 103152 257862 428827
26450D28827Q6296k94297o4160j73315o7574o8985j49307j66536J85452j01714
$$ 428827 515123 220826 156666 -16649 -84223 -153208 -302515 -469051 -283599 -385313
26440c85313O0239K11253O4586L3649j78936r5175M8321M957K1435m1464J8395
$$ -385313 -325074 -113821 -49235 -15586 -194522 -289697 -241376 -236419 -214984 -256448 -238053
26429b38053K46544K36091R1015l51634j02349K10172p799Q7514M3281j46865
$$ -238053 8491 244582 335597 -16037 -118386 91786 83987 171501 214782 67917
26419F7917J20333J75044R4082J02769k89467r1241J06497J93524j78317n325
$$ 67917 188250 363294 457376 560145 270678 179437 285934 479458 301141 295816
26409B95816P0373k59094k0766p3795j4105R5455Q6491k99996o9626K35097j14666
$$ 295816 366189 107095 86329 12534 -1571 93884 180375 -119621 -189247 45850 -68816
26398f8816l79256J96652J71534k0761L86901J25895j92379m5489N9458p7710
$$ -68816 -448072 -251420 -79886 -100647 286254 412149 219770 174281 233739 156029
26388A56029j9944r1799J20848K06293j27847J60597p7193j71600j01724N2138
$$ 156029 136085 44286 165134 371427 243580 404177 326984 155384 53660 105798
26378A05798j31071k3049M59155J13952q9455q5725J73200o9209k7618J17207
$$ 105798 -25273 -48322 410833 524785 435330 349605 522805 453596 425978 543185
26368E43185Q2091O7388N7289k91838j68667K10775J40473J526j01967K981j04471
$$ 543185 625276 692664 749953 458115 289448 500223 640696 642222 540255 543236 438765
26357D38765J5740J08122p6821r6494O7877M2738N3717j32386K654L325L14850
$$ 438765 454505 562627 485806 389312 457189 499927 553644 421258 423912 427237 742087
26346G42087Q9315j291k88647K05305m7260j79766K93055j09677j93351j30509
$$ 742087 831402 830111 541464 746769 699509 519743 812798 703121 509770 379261
26336C79261K4701l47695K38510J07962J06429K2608j41460M927N7129N7369o7660
$$ 379261 403962 56267 294777 402739 509168 531776 390316 395243 452372 509741 442081
26325D42081j50537m2180J72206J42382L03512q2331j32438r3905R3160M581p7231
$$ 442081 291544 249364 421570 563952 867464 785133 652695 558790 651950 656531 579300
26314E79300k608J50940j23001k10226r8787M544K9749k28183M0675l2262j1625
$$ 579300 576692 727632 604631 394405 295618 300162 329911 101728 142403 110141 98516
26303I8516K30425J97030n5164p7549N2536K6930J58141o200j31273k30439N5689
$$ 98516 328941 525971 470807 393258 445794 472724 630865 624665 493392 262953 318642
26292C18642K35806K46643J58001r1651k37382o2598j62850l9683J19439K93606
$$ 318642 554448 801091 959092 867441 630059 567461 404611 364928 484367 777973
26282G77973J70227j46211r0723L3083J60594j57382n7878K23780L2335j65871
$$ 777973 948200 801989 711266 744349 904943 747561 689683 913463 945798 779927
26272G79927Q4067R3130j44853j71052K5922J82476K14445J6347m4713M0173J35577
$$ 779927 863994 957124 812271 641219 667141 849617 1064062 1080409 1035696 1075869 1211446
26261A211446J70193j34415k30388M3285N6695m6244k4809j16489N0799j65561
$$ 1211446 1381639 1247224 1016836 1060121 1116816 1070572 1045763 929274 980073 814512
26251H14512j06858J82863N7592J63974M48226j62143m48005k32239J06358j39450
$$ 814512 707654 890517 948109 1112083 1560309 1398166 950161 717922 824280 684830
26241F84830M408J64524J06050L653N808j18925j37366R6211K60012K36599m5101
$$ 684830 689238 853762 959812 963465 969273 850348 712982 809193 1069205 1305804 1260703
26230A260703j55138K57164l0269k24044j45596K11292K87751j35363j45506o4543
$$ 1260703 1105565 1362729 1332460 1108416 962820 1174112 1461863 1326500 1180994 1116451
26220A116451J85323K24152J11117j89346Q0843N4401o2144J6487L90958k2961
$$ 1116451 1301774 1525926 1637043 1447697 1528540 1582941 1520797 1537284 1928242 1905281
26210A905281l02068j23539N1505L28372K29802K6431j39172L8190M68378J89423
$$ 1905281 1603213 1479674 1531179 1859551 2089353 2115784 1976612 2014802 2483180 2672603
26200B672603l10569j7811L5979J16444K21915J16039J08542J57979M654K9998
$$ 2672603 2362034 2344223 2380202 2496646 2718561 2834600 2943142 3101121 3105775 3135773
26190C135773Q6395L63342M8978j89974j68182K57563K92091k3124O4771P1752
$$ 3135773 3222168 3585510 3634488 3444514 3276332 3533895 3825986 3802862 3867633 3939385
26180C939385M57956K31845Q2468J03385k13J38938K64838K18823Q7892J37719
$$ 3939385 4397341 4629186 4711654 4815039 4814826 4953764 5218602 5437425 5525317 5663036
26170E663036K28419J09350K20522M39934M07781L07148L15329L81403M57329
$$ 5663036 5891455 6000805 6221327 6661261 7069042 7376190 7691519 8072922 8530251
26161H530251L38984K68003J94108L93792K98615L03142P07331P34183O56329
$$ 8530251 8869235 9137238 9331346 9725138 10023753 10326895 11034226 11768409 12424738
26152A2424738N77109J028262P73549R30744J046453R26709J008067J302659J375339
$$ 12424738 13001847 14030109 14803658 15734402 16780855 17707564 18715631 20018290 21393629
26143B1393629J662139J612418J821545K047666K393487K847379K911614L032716
$$ 21393629 23055768 24668186 26489731 28537397 30930884 33778263 36689877 39722593
26135C9722593L533735M146048M813449N245023O169740P412767Q411712R538241
$$ 39722593 43256328 47402376 52215825 57460848 63630588 71043355 79455067 88993308
26127H8993308J1524199J3583665J6356438J9627606K3249870K7473240L2073802
$$ 88993308 100517507 114101172 130457610 150085216 173335086 200808326 232882128
26120B32882128L6537879M0347424M2049505M0286169L3707814K2654938Q502895
$$ 232882128 269420007 309767431 351816936 392103105 425810919 448465857 456968752
26113D56968752o315385j9610750k9476263l5567667l8059954l7111795l4633987
$$ 456968752 450653367 431042617 401566354 365998687 327938733 290826938 256192951
26106B56192951l1161999k7134665k3755052k0252406j7330584j5128388j2704020
$$ 256192951 225030952 197896287 174141235 153888829 136558245 121429857 108725837
26099A08725837j0991715r503609q113668p202146o404621n534055m967469m597831
$$ 108725837 97734122 88230513 80116845 72914699 66510078 60976023 56008554 51410723
26091E1410723l599985l301285l196682k934078k420265k127200k026693j718181
$$ 51410723 47810738 44509453 41312771 38378693 35958428 33831228 31804535 30086354
26083C0086354j986208j704761j487200j184263j095077j373682j443985q13389
$$ 30086354 28100146 26395385 24908185 23723922 22628845 21255163 19811178 18997789
26075A8997789q99629p71169o09256n75922o02522r29798q82363o42099m39271
$$ 18997789 18098160 17326991 16717735 16141813 15539291 14609493 13727130 13085031 12645760
26066A2645760m38170p57277n08411l97020k59051l78971m30844l93100n56265
$$ 12645760 12207590 11450313 10941902 10544882 10285831 9906860 9476016 9082916 8526651
26057H526651m42638k27229k59207m66391k50127r8653k51302j53483K383o1520
$$ 8526651 8084013 7856784 7597577 7131186 6881059 6782406 6531104 6377621 6380004 6318484
26047F318484j22599k71036l31520l33744k86720j02641J18881P7830l52068j69533
$$ 6318484 6195885 5924849 5593329 5259585 4972865 4870224 4989105 5066935 4714867 4545334
26037D545334R4399j58702m84646M2764Q1540j55115J3892k4503J12695j20074
$$ 4545334 4639733 4481031 3996385 4039149 4120689 3965574 3979466 3954963 4067658 3947584
26027C947584Q7413k64118j09751N6197p1992j29410l7640o3326l1706j84126
$$ 3947584 4034997 3770879 3661128 3717325 3645333 3515923 3478283 3414957 3383251 3199125
26017C199125j79489j65542o0304J24485j32269j89378p0923K06802q0848k74282
$$ 3199125 3019636 2854094 2793790 2918275 2786006 2596628 2525705 2732507 2651659 2377377
26007B377377k15876n308J44810J49199j97248j23116J94429K99274J8249J5233
$$ 2377377 2161501 2156193 2301003 2450202 2252954 2129838 2324267 2623541 2641790 2657023
25997B657023r3255j18889j35662r3414m2502j59189k24604j32773j93695R3200
$$ 2657023 2563768 2444879 2309217 2215803 2173301 2014112 1789508 1656735 1463040 1556240
25987A556240R0359P9579J43960J33996r8852k01413k31188L4866j42484J19060
$$ 1556240 1646599 1726178 1870138 2004134 1905282 1703869 1472681 1507547 1365063 1484123
25977A484123J78074j70506k38865p790J32847k24404j60132k12350J2008J07091
$$ 1484123 1662197 1491691 1252826 1245036 1377883 1153479 993347 780997 793005 900096
25967I00096M42127K27515j51679r6366k03343k74768K52659K56802k2630k3140
$$ 900096 1342223 1569738 1418059 1321693 1118350 843582 1096241 1353043 1330413 1307273
25957A307273q412R7681l70758j60249k6300K00135L21836K33934k21795K3708
$$ 1307273 1298861 1396542 1025784 865535 839235 1039370 1361206 1595140 1373345 1397053
25947A397053k29942j67336o4980j5019r420j22030J69918K47968J06595K0060
$$ 1397053 1167111 999775 934795 919776 910356 788326 958244 1206212 1312807 1332867
25937A332867j50323j96463j38994K30052n3921p8719K8166R0600p7984j10593
$$ 1332867 1182544 986081 847087 1077139 1023218 944499 972665 1063265 985281 874688
25927H74688j40895l1477j03997l9844k5423q7405R2128K12720L47011j40669
$$ 874688 733793 702316 598319 558475 533052 445647 537775 750495 1097506 956837
25917I56837k83989j62026R5586j61480r6450M01470J83983j27786j32061o9338
$$ 956837 672848 510822 606408 444928 348478 749948 933931 806145 674084 604746
25907F04746J37288Q6117j20137j2750J04676N1743l22004P5582K61427J75693
$$ 604746 742034 828151 708014 695264 799940 851683 529679 605261 866688 1042381
25897A042381j55m4653k412j57959j71316Q2168J37147J09363J5738L8199j73497
$$ 1042381 1042226 997573 995161 837202 665886 748054 885201 994564 1010302 1048501 875004
25886H75004m0623m571p5161p0994J31694j37530M7432l4952k27284j55990p3853
$$ 875004 834381 829810 754649 683655 815349 677819 725251 690299 463015 307025 233172
25875B33172M48736J19096j07658p7961j59355j25020K09205L1611j17054N447
$$ 233172 681908 801004 693346 615385 456030 331010 540215 571826 454772 460219
25865D60219J36366K39868l01468k88275k06555j52824J64603J91408N5659m9244
$$ 460219 596585 836453 534985 246710 40155 -112669 51934 243342 299001 249757
25855B49757K2080o4914j85721r0626L32791J64141k26663k1412J63015J96441
$$ 249757 271837 206923 21202 -69424 263367 427508 200845 179433 342448 538889
25845E38889P6371O6566N0045k36565P181Q2527R987J23335m2659r7867j20266
$$ 538889 615260 681826 731871 495306 502487 585014 595001 718336 675677 577810 457544
25834D57544k21666J47900J2823k06298j19033N5393K73644M287j3903L34225
$$ 457544 235878 383778 396601 190303 71270 126663 400307 404594 390691 724916
25824G24916j03287l28941L4643j12874J73744K59120Q0736n9288j3860k8977
$$ 724916 621629 292688 327331 214457 388201 647321 728057 668769 654909 625932
25814F25932k85568j57711J96251J39998J13597J507n0546j34792j77311j54317
$$ 625932 340364 182653 378904 518902 632499 634006 583460 448668 271357 117040
25804A17040l7499n9084j08763r8272J09308J13877o2302J61221K08345J76528
$$ 117040 79541 20457 -88306 -186578 -77270 36607 -25695 135526 343871 520399
25794E20399k59530l17212P1877O2361l6580J7740N0941J18562J14011K60359
$$ 520399 260869 -56343 15534 77895 41315 59055 109996 228558 342569 602928
25784F02928o5732k9163j11115m3426j67580r8387L1352K05754m5638J02421p4789
$$ 602928 537196 508033 396918 353492 185912 87525 118877 324631 278993 381414 306625
25773C06625k9504j36324j49288R9488Q9359j31206k55849K14371M32082Q9367
$$ 306625 277121 140797 -8491 90997 180356 49150 -206699 7672 439754 529121
25763E29121j91104j09249J7002J61235L5054k5220J4861n4250l4272q8919j04506
$$ 529121 338017 228768 245770 407005 442059 416839 431700 377450 343178 254259 149753
25752A49753K80552m723j23980j9206K018q6935J07853j69924R269L14417P8187
$$ 149753 430305 425582 301602 282396 284414 197479 305332 135408 144677 459094 537281
25741E37281l23271k06366J96821J29605j66270L5482J71930k4665r7635l1687
$$ 537281 214010 7644 204465 334070 167800 203282 375212 350547 252912 221225
25731B21225L23490K13306j9619j49831j36884k16691O4858m384Q8326J6860m3183
$$ 221225 544715 758021 738402 588571 451687 234996 299854 295470 383796 400656 357473
25720C57473R7770l504j91525q2384q7230o3427J16856N0440k8999j65045n0716
$$ 357473 455243 451739 260214 177830 90600 27173 144029 194469 165470 425 -50291
25709e0291J69159K51853j25877r7905N2799m3825j79252j3254O188J00291J47975
$$ -50291 118868 370721 244844 146939 199738 155913 -23339 -36593 -30405 69886 217861
25698B17861N3231l2420k50177j05199n0332L5531J04591O3353r4109J29226K74359
$$ 217861 271092 238672 -11505 -116704 -167036 -131505 -26914 36439 -57670 71556 345915
25687C45915J49634P8263M5823k36164K2091K17865K33257J04833r1288m28383
$$ 345915 495549 573812 619635 383471 405562 623427 856684 961517 870229 441846
25677D41846o162j1407J58795k0559j18064n1372j15086j43080K50620J56006
$$ 441846 435684 424277 583072 562513 444449 393077 277991 134911 385531 541537
25667E41537k35739j392P6435k30853K3847Q110j21114j1855m612j80342K3776
$$ 541537 305798 304406 380841 149988 173835 181945 60831 48976 44364 -135978 -112202
25656a12202p6819J87049K52744J52093n1391k19319M4646j3499j47359J31890
$$ -112202 -189021 -1972 250772 402865 351474 132155 176801 163302 15943 147833
25646A47833j04984r2271O3286k5810k6585Q5039j2745j22607M880K46339j3230
$$ 147833 42849 -49422 13864 -11946 -38531 46508 33763 -88844 -83964 162375 149145
25635A49145P9815k6275k61499k14590J06696K66884j40018L2285J61953K22249
$$ 149145 228960 202685 -58814 -273404 -166708 100176 -39842 -7557 154396 376645
25625C76645k10839j19675K27190J02757Q6384k14837j31927j08629K4745n9620
$$ 376645 165806 46131 273321 376078 462462 247625 115698 7069 31814 -27806
25615b7806J90483L3071N807K1051p7552l5016N416n6419p3426J49635O2823m0813
$$ -27806 162677 195748 201555 222606 145054 110038 115454 59035 -14391 135244 198067 157254
25603A57254r509M2784j61957K21557J48886m8608j83444k55618J46091J79624
$$ 157254 147745 190529 28572 250129 399015 350407 166963 -88655 57436 237060
25593B37060L09322K7938q4206J36484J351l36860N1698K41558L6900j31146k44795
$$ 237060 546382 574320 490114 626598 627949 291089 342787 584345 621245 490099 245304
25582B45304j101J98354P7250J92424K7236K9891j92423j09559k2514j08065j3944
$$ 245304 244203 442557 519807 712231 739467 769358 576935 467376 444862 336797 322853
25571C22853l6135N4019J15998j17867J79024j513j12104k41606n7439K17549
$$ 322853 286718 340737 456735 338868 517892 516379 404275 162669 105230 322779
25561C22779j96471k28493J78800K10282J36150K6057J46536l1466p701l2280
$$ 322779 126308 -102185 76615 286897 423047 449104 595640 564174 556473 524193
25551E24193l9566q6102l39211j88345Q8128J65918P014r1193p8224r031K86828
$$ 524193 484627 398525 59314 -129031 -40903 125015 132029 40836 -37388 -46419 240409
25540B40409L899l8052n482q7346l1371K8310j05398M3905R0049K0711p265k49141
$$ 240409 244308 206256 200774 113428 82057 110367 4969 48874 138923 159634 152369 -96772
25528i6772r6306j15334m9126K40422J37721J25543M4152k58282j61218j32005
$$ -96772 -193078 -308412 -357538 -117116 20605 146148 190300 -67982 -229200 -361205
25518c61205n0442K41464J95495J27274o5659l23314j71481j07436J51602J15631
$$ -361205 -411647 -170183 25312 152586 86927 -236387 -407868 -515304 -363702 -248071
25508b48071K14015J53132k49610m912O911L3027R5696O3238J63642J08172p8193
$$ -248071 -34056 119076 -130534 -135446 -128535 -95508 188 63426 227068 335240 257047
25497B57047j72473J33677J04443r6165J24752j04549p8429O2620j18929j78642
$$ 257047 84574 218251 322694 226529 351281 246732 168303 230923 111994 -66648
25487f6648n972j49178j3851L61280J86044P7780n8375n0284j89921K5629J30259
$$ -66648 -72620 -221798 -235649 125631 311675 389455 331080 280796 90875 116504 246763
25476B46763k09077r5176J59700j05827Q193L5357J67901J88038J23152p0721
$$ 246763 37686 -57490 102210 -3617 4576 39933 207834 395872 519024 448303
25466D48303k65634l31446J06063r7040J03471P7424j9151J36430k12965j12476
$$ 448303 182669 -148777 -42714 -139754 -36283 41141 21990 158420 -54545 -167021
25456a67021L6699J54014J14304K68785M4495p4584j35841j02603o1912j18861
$$ -167021 -130322 23692 137996 406781 451276 376692 240851 138248 76336 -42525
25446d2525m5708O3424j42766J16190J78807k04321j52099J57490J09370J95053
$$ -42525 -88233 -24809 -167575 -51385 127422 -76899 -228998 -71508 37862 232915
25436B32915p0229k80657j9122J28202K20191Q6274j26123J29882L6614q7812
$$ 232915 162686 -117971 -137093 -8891 211300 297574 171451 301333 337947 250135
25426B50135J85805j34185l2546K7366j00958k99193p6129K91526J51071k18837
$$ 250135 435940 301755 269209 296575 195617 -103576 -179705 111821 262892 44055
25416D4055j41228j03387l17642m0451K25699k5220N2309o6168Q2838K6130p6549
$$ 44055 -97173 -200560 -518202 -558653 -332954 -358174 -305865 -372033 -289195 -263065 -339614
25405c39614L15528K95086j09088j28548o4876o8268n5394J36896J82737l1411
$$ -339614 -24086 271000 161912 33364 -31512 -99780 -155174 -18278 164459 133048
25395A33048j84860K23288l1085r4791r876k40845J26305J78115j00703j51803
$$ 133048 -51812 171476 140391 45600 35724 -205121 -78816 99299 -1404 -153207
25385a53207M1483m5859M709N0501O2678p3897J30379k62893o7325K33382K22671
$$ -153207 -111724 -157583 -152874 -102373 -39695 -113592 16787 -246106 -313431 -80049 142622
25374A42622Q412j40864l00326j98257J33067m2692l4143J23681K3440m4906J62666
$$ 142622 151034 10170 -290156 -488413 -355346 -398038 -432181 -308500 -285060 -329966 -167300
25363a67300K66897O9538J60019M259k93082j17131J6447J71521Q3608o1296j04063
$$ -167300 99597 169135 329154 333413 40331 -76800 -60353 111168 194776 133480 29417
25352B9417L286R9753o6626j21392q2503L2219j63625j37015Q3692J59864K783
$$ 29417 32703 132456 65830 -55562 -138065 -105846 -269471 -406486 -322794 -162930 -160147
25341a60147j4976J27072K87958R8049k74994j73112N533m8386J63888L65077
$$ -160147 -175123 -48051 239907 337956 62962 -110150 -104617 -153003 10885 375962
25331C75962K2549l58868j72122K40171J50181j06164M2296k56439j34286J70006
$$ 375962 398511 39643 -132479 107692 257873 151709 194005 -62434 -196720 -26714
25321b6714j57531k57849J2869K83289L30605q5628j60871k9343m0875K59193
$$ -26714 -184245 -442094 -429225 -145936 184669 99041 -61830 -91173 -132048 127145
25311A27145n0742j20991q8803J07845L6846p6020j6925M0292J03643J36953p4709
$$ 127145 76403 -44588 -133391 -25546 11300 -64720 -81645 -41353 62290 199243 124534
25300A24534j72273n3107P7984k03372j20256N3230K04345L13096j0194j2525
$$ 124534 -47739 -100846 -22862 -226234 -346490 -293260 -88915 224181 213987 201462
25290B01462M3046j13078K2140j70396Q6464j27421p6792J62317k2553q7245j45586
$$ 201462 244508 131430 153570 -16826 69638 -57783 -134575 27742 5189 -82056 -227642
25279b27642k15759J41651L76552n0000k33368R563M3996K09105l4405J71950
$$ -227642 -443401 -301750 74802 24802 -208566 -199003 -155007 54098 19693 191643
25269A91643j58206J6540j1328r826l2694r6545J2596J41135k34426J9052K6943
$$ 191643 33437 49977 38649 28823 -3871 -100416 -87820 53315 -181111 -162059 -135116
25258a35116N1936L0713j54892J30630m048J44444j73325j79102K2714m780J26039
$$ -135116 -83180 -52467 -207359 -76729 -80777 63667 -109658 -288760 -266046 -270826 -144787
25247a44787K28801k0100k56863r8427J66656j3657j25435j33981K8517L18529
$$ -144787 84014 63914 -192949 -291376 -124720 -138377 -263812 -397793 -369276 -50747
25237e0747K33282J5637k21669p8070M9360J64636r88k9606j20281j7187j16045
$$ -50747 182535 198172 -23497 -101567 -52207 112429 111441 81835 -38446 -55633 -171678
25226a71678k36526k06656J43827L97102o5177l01321J47501L1458K87988L74646
$$ -171678 -408204 -614860 -471033 -73931 -139108 -440429 -292928 -261470 26518 401164
25216D01164m9212r0728J34772M1103j62290j88352l5234M6924L2728O2770J8052
$$ 401164 351952 261224 395996 437099 274809 86457 51223 98147 130875 193645 211697
25205B11697K6060J73547K8036j00961k06999j87444p2651O0590J19868P7572
$$ 211697 237757 411304 439340 338379 131380 -56064 -128715 -68125 51743 129315
25195A29315J19707j79163k19441m8629L3415J41618N3296K87389j8456j09381
$$ 129315 249022 69859 -149582 -198211 -164796 -23178 30118 317507 299051 189670
25185A89670N5719J31011J16637j1420M3327n9550L4445j39995J05957J13201
$$ 189670 245389 376400 493037 481617 524944 465394 499839 359844 465801 579002
25175E79002N753j34467q4538j6671L1383p353j38838q2292j81248j64029J04768
$$ 579002 584755 450288 365750 349079 380462 373109 234271 151979 -29269 -193298 -88530
25164h8530J94132j30822J44097L7501j63302j40599J2019p8769k04440J31534
$$ -88530 105602 -25220 118877 156378 -6924 -147523 -135504 -214273 -418713 -287179
25154b87179J48398L6619J97808J36415j00448k63022N7308K41021N0822k9350
$$ -287179 -138781 -102162 95646 232061 131613 -131409 -74101 166920 217742 188392
25144A88392J58273J29571K40808J36874j61593j61053n6732j99275m4024j63781
$$ 188392 346665 476236 717044 853918 692325 531272 474540 275265 231241 67460
25134F7460j30084J52864J2291j29045j00134j00435k6526K43830K83453j10047
$$ 67460 -62624 90240 102531 -26514 -126648 -227083 -253609 -9779 273674 163627
25124A63627l53458J06752J65291k62942j00814J739J50786L17700J94144K414
$$ 163627 -189831 -83079 82212 -180730 -281544 -279805 -129019 188681 382825 385239
25114C85239j241j9739J5146k28737j66828J3359k22377k78909J15756K24891
$$ 385239 383998 364259 379405 150668 -16160 -2801 -225178 -504087 -388331 -163440
25104a63440P2749J99278j25539m5697J14189j53227l2486J85081j55615L4101
$$ -163440 -90691 108587 -16952 -62649 51540 -101687 -134173 50908 -104707 -70606
25094g0606J09878N5198O343J70310M7101k40722k0675j48917n8378J69864J47632
$$ -70606 39272 94470 100813 271123 318224 77502 56827 -92090 -150468 19396 167028
25083A67028K5511J70450j7453j48948P3460k5028j78187K85291R6616L480k51680
$$ 167028 192539 362989 345536 196588 270048 245020 66833 352124 448740 452220 200540
25072B00540k31839q4933J35270J96264q4742o1738K5853k963j52237J26070j30836
$$ 200540 -31299 -116232 19038 215302 130560 68822 94675 91712 -60525 65545 -65291
25061f5291m0018J15287p3283j8171j10523K33675p6307o744J79189j09536k17825
$$ -65291 -105309 9978 -63305 -81476 -191999 41676 -34631 -41375 137814 28278 -189547
25050a89547r6005K86951J93475j36744k80740m48J0261L30482J01708j67614
$$ -189547 -285552 1399 194874 58130 -222610 -223058 -212797 117685 219393 51779
25040E1779j52482r9351l5136J21947j14124q2716P8937Q7976j49719R9031Q5932
$$ 51779 -100703 -200054 -235190 -113243 -227367 -310083 -231146 -143170 -292889 -193858 -107926
25029a07926j21819j63005l8516J46791J24098Q6118J70657K6045J3787K86383
$$ -107926 -229745 -392750 -431266 -284475 -160377 -74259 96398 122443 136230 422613
25019D22613n9757r2932m8647j61173k06146k60738N7300K08228J30384j84593
$$ 422613 362856 269924 221277 60104 -146042 -406780 -349480 -141252 -10868 -195461
25009a95461J09446J19471m6444j34215r3338m8083K33289K29119N9779R2092
$$ -195461 -86015 33456 -12988 -147203 -240541 -288624 -55335 173784 233563 325655
24999C25655o7043l10080j21263n4332J4588j27928j49174L24048K77080M1822
$$ 325655 258612 -51468 -172731 -227063 -212475 -340403 -489577 -165529 111551 153373
24989A53373o7594j98788j58668P880K04750R0140n0047J35073j65624j64493
$$ 153373 85779 -113009 -271677 -263797 -59047 31093 -18954 116119 -49505 -213998
24979b13998J02148Q3271O5169M4545R19q5815K798P848l17510J64J92556n1702
$$ -213998 -111850 -28579 36590 81135 82054 -3761 -963 6885 -310625 -310461 -117905 -169607
24967a69607K9618R6256j45504K5527L40118Q7523k56401k89333k6949j99764
$$ -169607 -139989 -43733 -189237 -163710 176408 263931 7530 -281803 -308752 -508516
24957e08516l3684J55539K80959J82304j63300j12882Q6377P9590q199j52926
$$ -508516 -542200 -386661 -105702 76602 -86698 -199580 -113203 -33613 -41812 -194738
24947a94738L2423P2058J02291j0311j9189j50679j66121j67274K80492K52535
$$ -194738 -162315 -90257 12034 1723 -17466 -168145 -334266 -501540 -221048 31487
24937C1487J24209K33139J35562k7173j35087k12496J31341j63950p7158r5857
$$ 31487 155696 388835 524397 497224 362137 149641 280982 117032 39874 -55983
24927e5983N528J20650L4333l829K86912K02902J83571j02459r5228j81559k14973
$$ -55983 -50455 70195 104528 100699 387611 590513 774084 671625 576397 394838 179865
24916A79865K4799M7425m6898N8436J53600O776r7953j8401p4162j78145J36203
$$ 179865 204664 252089 205191 263627 417227 424003 326050 307649 233487 55342 191545
24905A91545k4787N6856J48663L2522o551Q6773j67756k36911K1883j29703J06454
$$ 191545 166758 223614 372277 404799 398248 485021 317265 80354 102237 -27466 78988
24894G8988J66358j36737n5853J07055L17931R5766m19137l69083r2706K31737
$$ 78988 245346 108609 52756 159811 477742 573508 154371 -214712 -307418 -75681
24884g5681J69928k51037j5430J63230j28298O3131j10992M7947K56197r151L6854
$$ -75681 94247 -156790 -172220 -8990 -137288 -74157 -185149 -137202 118995 109844 146698
24873A46698j32189n966J85609n6865j29568L07141O0820l57485j15110J07806
$$ 146698 14509 8543 194152 137287 7719 314860 375680 18195 -96915 10891
24863A0891O0357M7202q0090k96285q459N776J016J89207Q6168K7802M3441j45320
$$ 10891 71248 118450 38360 -257925 -266384 -260608 -259592 -70385 15783 43585 87026 -58294
24851e8294n3301l63825j6974J63411M890M4537J19151j20823k21833L92608Q6403
$$ -58294 -111595 -475420 -492394 -328983 -324093 -279556 -160405 -281228 -503061 -110453 -24050
24840b4050L0399O3986n4393J6555r1059j27277k4875j11914j06715K9842R1509
$$ -24050 6349 70335 15942 32497 -58562 -185839 -210714 -322628 -429343 -399501 -307992
24829c07992J08930K63109j30374N6137o1884p0734l9233n4401K49629M6466o0573
$$ -307992 -199062 64047 -66327 -10190 -72074 -142808 -182041 -236442 13187 59653 -920
24818i20k06953L30265O1075j39368j07763l3418K58352Q6827j10143k3421j97843
$$ -920 -207873 122392 183467 44099 -63664 -97082 161270 248097 137954 114533 -83310
24807h3310k01201k8502O4961P3913P1474o8934K40309L9204p6276p8957K77738
$$ -83310 -284511 -313013 -248052 -174139 -102665 -171599 68710 107914 31638 -47319 230419
24796B30419K8274n8222j88692K62013j34012k36296j2425k4642j78974j92113
$$ 230419 258693 200471 11779 273792 139780 -96516 -108941 -133583 -312557 -504670
24786e04670O1628K45423J37660L5598K891k2330K12552j12807n0212K39547J8553
$$ -504670 -443042 -197619 -59959 -24361 -21470 -43800 168752 55945 5733 245280 263833
24775B63833J12709J54021L9990J56681l02510l57129L8222J18626J657m14104
$$ 263833 376542 530563 570553 727234 424724 67595 105817 224443 226100 -188004
24765a88004o6890J68997p5460k01780J3512J50664q5907L56070J34577R6170
$$ -188004 -254894 -85897 -161357 -363137 -349625 -198961 -284868 71202 205779 301949
24755C01949n4228k09761j69954J26136K29034L7608P7057n983j08936k48311
$$ 301949 247721 37960 -131994 -5858 223176 260784 337841 331858 222922 -25389
24745b5389l3668p947j28367Q5413Q1402J02969o3264j15611M1327M5963m9510
$$ -25389 -59057 -67004 -195371 -109958 -28556 74413 11149 -104462 -63135 -17172 -66682
24734f6682j47599J9491j40888J13837J08419j8052R2365J50065K30280N6290
$$ -66682 -214281 -194790 -335678 -221841 -113422 -131474 -39109 110956 341236 397526
24724C97526m17343j49140P5681J21514J00071j41680j702N5503k00112k5918
$$ 397526 -19817 -168957 -93276 28238 128309 -13371 -15073 40430 -159682 -185600
24714a85600K95488J00815k16460j61013j18854J42815J51216m3199k99009m9154
$$ -185600 109888 210703 -5757 -166770 -285624 -142809 8407 -34792 -333801 -382955
24704c82955M5681N3116O4163J77941K33146q1560n4098L195k10249l2326P7649
$$ -382955 -337274 -284158 -219995 -42054 191092 109532 55434 58629 -151620 -183946 -106297
24693a06297J3005n0774L93614L59072m4304j92429j05011n1739J32810j17933
$$ -106297 -93292 -144066 249548 608620 564316 371887 266876 215137 347947 230014
24683B30014j0572J4217k29173j26663j47482j13775J87779K18748O2963Q3591
$$ 230014 219442 233659 4486 -122177 -269659 -383434 -195655 23093 86056 169647
24673A69647j1930J76770J14432j89678j54501k53671L5405n2943J65286P3744
$$ 169647 157717 334487 448919 259241 104740 -148931 -113526 -166469 -1183 72561
24663G2561m1763j15146o4279L7353l1096m747R5034K4684M6207p4578P443Q9816
$$ 72561 30798 -84348 -148627 -111274 -142370 -147117 -52083 -27399 18808 -55770 -48327 41489
24651D1489P7131k2235k85551J12571J0047k23986L4250L39894M9991q038r5740
$$ 41489 118620 96385 -189166 -76595 -66548 -290534 -256284 83610 133601 125563 29823
24640B9823j4377l1685L29875J0623l01402j34336J9400M8709k06775k5512L82981
$$ 29823 15446 -16239 313636 324259 22857 -111479 -92079 -43370 -250145 -275657 107324
24629A07324P2676j97253L1431j50747O3648J01629J14700r4005p5801n759J69996
$$ 107324 180000 -17253 14178 -136569 -72921 28708 143408 49403 -26398 -32157 137839
24618A37839N8548p247J63016K8076j4944q5353k56737j52445R120O9991M8138
$$ 137839 196387 189140 352156 380232 365288 279935 23198 -129247 -120127 -50136 -1998
24607a998P3321M0207j42332j57111Q239j43775J261Q0057J25720m0005n5464
$$ -1998 71323 111530 -30802 -187913 -179674 -323449 -322188 -242131 -116411 -156416 -211880
24596b11880k4851P2603J45873o3714o4010K49343K88052P8946R46j01699j18110
$$ -211880 -236731 -164128 -18255 -81969 -145979 103364 391416 470362 471308 369609 251499
24585B51499l0889m6119K5908O1810q1077l6600J13032j24728J40026R3440K3002
$$ 251499 220610 174491 200399 262209 181132 144532 257564 132836 272862 366302 389304
24574C89304j21345j60502j38773K5880K72845J54974j53145r8421J33395j37069
$$ 389304 267959 107457 -31316 -5436 267409 422383 269238 170817 304212 167143
24564A67143j96772P0684N3228j1283K41514J50414j53097k51187j47695j07069
$$ 167143 -29629 41055 94283 83000 324514 474928 321831 70644 -77051 -184120
24554a84120N2817L7837j0479J43688K11041K889J07312k650j03387j90928j82605
$$ -184120 -131303 -93466 -103945 39743 250784 253673 360985 358335 254948 64020 -118585
24543a18585J53526R1745j2176j4082O5553J61846j84839j78197j04707o3910
$$ -118585 34941 126686 114510 100428 165981 327827 142988 -35209 -139916 -203826
24533b03826K31528J9018l84485r848l435N6593k5850K02849m7749O4903J95055
$$ -203826 27702 46720 -337765 -347613 -351048 -294455 -320305 -117456 -165205 -100302 94753
24522I4753o3716R9694j52194K14154K27605l647m0015l00253l03026R7937K88222
$$ 94753 31037 130731 -21463 192691 420296 416649 376634 76381 -226645 -128708 159514
24511A59514M9449j37070O2260j9870K10042j82741k29460J78503J16769K01686
$$ 159514 208963 71893 134153 114283 324325 141584 -87876 90627 207396 409082
24501D09082J66675J9412j74810l19653K09726L15874J01065J2752j24504k25485
$$ 409082 575757 595169 420359 100706 310432 626306 727371 740123 615619 390134
24491C90134j41495j75721P8619J49067J18970R0913m7950J23935n8717o2451
$$ 390134 248639 72918 151537 300604 419574 510487 462537 586472 527755 465304
24481D65304m4540j07515p3545k6558j46593q3093O8355R9815r5520n5957J84509
$$ 465304 420764 313249 239704 213146 66553 -16540 51815 151630 56110 153 184662
24470A84662O6083J31163j66141j25727m0439q4325j73140O1699M4656J40499
$$ 184662 250745 381908 215767 90040 49601 -34724 -207864 -146165 -101509 38990
24460C8990L07062O6188O9945L9228O7922k34707l57495k11105J46865K18648
$$ 38990 346052 412240 482185 521413 589335 354628 -2867 -213972 -67107 151541
24450A51541R4994K7n4856k536m9809R7084J07438K1165r5502j70841K25232M2899
$$ 151541 246535 246562 191706 189170 139361 236445 343883 365048 269546 98705 323937 366836
24438C66836j98734l7331j68086J5097J12988j23885j75636J98963R9768O4765
$$ 366836 168102 130771 -37315 -22218 90770 -33115 -208751 -9788 89980 154745
24428A54745q240K67571N9930j10415m3584P0071J1721M43103K24322P3109n1930
$$ 154745 146505 414076 474006 363591 320007 390078 401799 844902 1069224 1142333 1090403
24417A090403L4898N377L44139m000j60564J28773J97068k94615l55871l12567
$$ 1090403 1125301 1130678 1474817 1470817 1310253 1439026 1636094 1341479 985608 673041
24407F73041j41480k0773J8054R4123K71288j28330k87898J09560K5540L4062
$$ 673041 531561 510788 528842 622965 894253 765923 478025 587585 613125 647187
24397F47187k7252Q2916p6535j08065j29092k3960J5849M0191J3892j9434J87580
$$ 647187 619935 702851 626316 518251 389159 365199 381048 421239 435131 415697 603277
24386F03277k03474j36954J81871O2558q0280J4190j09655j03551Q7791N2813
$$ 603277 399803 262849 444720 507278 426998 441188 331533 227982 315773 368586
24376C68586m179q9010j00892J71455j30563n7432J20835J74190M2189Q6861Q5206
$$ 368586 364407 275397 174505 345960 215397 157965 278800 452990 495179 582040 667246
24365F67246j36140J11566J22920j67289R232Q3745K53704l1855j56719q6119
$$ 667246 531106 642672 765592 598303 607535 691280 944984 913129 756410 670291
24355F70291k1702q2975J75809p6757j00424k0320O1196k8913K61585J94428q5069
$$ 670291 648589 565614 741423 664666 564242 543922 605118 576205 837790 1032218 947149
24344I47149j98826j41854L5545K23204K23999L1810Q6828j23645j83538J63272
$$ 947149 748323 606469 642014 865218 1089217 1121027 1207855 1084210 900672 1063944
24334A063944m9161l10620k6131o0267n0368K6446M2988O0462J29211j31937k60800
$$ 1063944 1014783 704163 678032 617765 567397 593843 636831 697293 826504 694567 433767
24323D33767r0443l2378J14580L22109J30224k68470k20084J11384J61278p8200
$$ 433767 343324 310946 425526 747635 877859 609389 389305 500689 661967 583767
24313E83767k19162k8232J35094Q8688M7539P9626m9969j55019j18500L69588
$$ 583767 364605 336373 471467 560155 607694 687320 637351 482332 363832 733420
24303G33420R0599j53115J11640J06354K65236K48507j47337q3986p1340o3295
$$ 733420 824019 670904 782544 888898 1154134 1402641 1255304 1171318 1099978 1036683
24293A036683r6822J58859j36943k26855k53091J85986J24929L55066M9485k59295
$$ 1036683 939861 1098720 961777 734922 481831 667817 792746 1147812 1197297 938002
24283I38002k30898k03371J04974Q5716K14518K08968K3199P7546J93356j8822
$$ 938002 707104 503733 608707 694423 908941 1117909 1141108 1218654 1412010 1393188
24273A393188j785K63029J61211k28463N4909J54986k47419k23310J91980j92715
$$ 1393188 1391403 1654432 1815643 1587180 1642089 1797075 1549656 1326346 1518326 1325611
24263A325611Q7603K2784k55927k33739R2537N6165j30491P9558m9872J27098
$$ 1325611 1413214 1435998 1180071 946332 1038869 1095034 964543 1044101 994229 1121327
24253A121327K11987Q5578n1542J00927R3447M9963j77152p2059M2916K44211
$$ 1121327 1333314 1418892 1367350 1468277 1561724 1611687 1434535 1362476 1405392 1649603
24243A649603j3776q8302o9633J03082M52835p4869k82964m0000L8823o2627k4616
$$ 1649603 1635827 1547525 1477892 1580974 2033809 1958940 1675976 1635976 1674799 1612172 1587556
24232A587556J47805J71566n8010M7683m4710j70771L7897L55960K71683k16814
$$ 1587556 1735361 1906927 1848917 1896600 1851890 1681119 1719016 2074976 2346659 2129845
24222B129845j59136j55081O1826J93586L26204l3514j87126J08194o9260j00082
$$ 2129845 1970709 1815628 1877454 2071040 2397244 2363730 2176604 2284798 2215538 2115456
24212B115456J72356K97716J24577p6938J36051J93279O8007J40596M4692q0422
$$ 2115456 2287812 2585528 2710105 2633167 2769218 2962497 3030504 3171100 3215792 3135370
24202C135370J99942J37300j60936k59062K25431M74049J11117j41784l1861m6981
$$ 3135370 3335312 3472612 3311676 3052614 3278045 3752094 3863211 3721427 3689566 3642585
24192C642585J66526K29508Q6453J10991J02131L8010L5960N60585J27870j34153
$$ 3642585 3809111 4038619 4125072 4236063 4338194 4376204 4412164 4972749 5100619 4966466
24182D966466L39528J99395J05481M993j21643k7838L2445K42220J95106J73366
$$ 4966466 5305994 5505389 5610870 5615863 5494220 5466382 5498827 5741047 5936153 6109519
24172F109519M35797M18997L08255K71636L87383N66690L37296J95018K36933
$$ 6109519 6545316 6964313 7272568 7544204 7931587 8498277 8835573 9030591 9267524
24163I267524K83076J95708L22771L17199M91687L88232M17117O27043M72173
$$ 9267524 9550600 9746308 10069079 10386278 10877965 11266197 11683314 12310357 12782530
24154A2782530L38737N40781N07980O08147Q43925Q51439R91866Q94047Q07562
$$ 12782530 13121267 13662048 14170028 14778175 15622100 16473539 17465405 18359452 19167014
24145A9167014J038568J235334J464775J421256J354525J375654J542518J840370
$$ 19167014 20205582 21440916 22905691 24326947 25681472 27057126 28599644 30440014
24137C0440014K223253K659546K422357K651716K795628L235907L616542L904924
$$ 30440014 32663267 35322813 37745170 40396886 43192514 46428421 50044963 53949887
24129E3949887M308924M771203N248290N916189O501092O999097Q100547Q985139
$$ 53949887 58258811 63030014 68278304 74194493 80695585 87694682 95795229 104780368
24121A04780368R695616J0768314J2031304J3134047J4407180J5396989J6025286
$$ 104780368 114475984 125244298 137275602 150409649 164816829 180213818 196239104
24114A96239104J6667531J6271695J5388025J4055986J1853937Q806082N291104
$$ 196239104 212906635 229178330 244566355 258622341 270476278 279282360 284573464
24107B84573464K026854j862169n545738q724389j1443808j3326215j4657393
$$ 284573464 286600318 284738149 279192411 270468022 259024214 245697999 231040606
24100B31040606j5333930j5519156j5147826j4552393j3643247j2767307j1588310
$$ 231040606 215706676 200187520 185039694 170487301 156844054 144076747 132488437
24093A32488437j0272692r641259q799706p891228p051477o547949n984254n169057
$$ 132488437 122215745 112574486 103774780 95883552 88832075 82284126 76299872 71130815
24085G1130815m734106m668493m240234l890261l546789l103300k741971k497048
$$ 71130815 66396709 61728216 57487982 53597721 50050932 46947632 44205661 41708613
24077D1708613k439589k187077j784232j890401j851144j823686j729805j570299
$$ 41708613 39269024 37081947 35297715 33407314 31556170 29732484 28002679 26432380
24069B6432380j232555j102435j075751j068071j049035j018137q73221p67078
$$ 26432380 25199825 24097390 23021639 21953568 20904533 19886396 19013175 18246097
24061A8246097p94368p39828m07999n40515p51496o27080n21768k54382l92839
$$ 18246097 17451729 16711901 16303902 15763387 15011891 14384811 13863043 13608661 13215822
24052A3215822l05579m56366m10013m47125n55658l30338l43240m49901m56381
$$ 13215822 12910243 12453877 12043864 11596739 11041081 10710743 10367503 9917602 9461221
24043I461221m70893n50696l93284k59881J30426j00150p1557k89613k71929l81915
$$ 9461221 8990328 8439632 8046348 7786467 7916893 7816743 7745186 7455573 7183644 6801729
24033F801729k81980n5224k59366j59579R1368J4351j23424l9656k22530l77733
$$ 6801729 6519749 6464525 6205159 6045580 6136948 6151299 6027875 5988219 5765689 5387956
24023E387956l7050k652j71232k19433m6344P7854j26497k07299J86535J0217
$$ 5387956 5350906 5348254 5177022 4957589 4911245 4989099 4862602 4655303 4841838 4852055
24013D852055l47599M4759l0225m06850k96253N6237L6992l73987k11050r1148
$$ 4852055 4504456 4549215 4518990 4112140 3815887 3872124 3909116 3535129 3324079 3232931
24003C232931K35636K06396J45276n4980j36235j26378j33367j21165q4265q3294
$$ 3232931 3468567 3674963 3820239 3765259 3629024 3502646 3369279 3248114 3163849 3080555
23993C080555r1604L76740P6775j36033m61990k64103J09799N6108j30085k30836
$$ 3080555 2988951 3365691 3442466 3306433 2844443 2580340 2690139 2746247 2616162 2385326
23983B385326j66033J03278L50305o1494j99257p4131J35721Q1849J00357P2779
$$ 2385326 2219293 2322571 2672876 2611382 2412125 2337994 2473715 2555564 2655921 2728700
23973B728700j18999j48335k87092j67002r8482Q5690j19061O480J1324k25641
$$ 2728700 2609701 2461366 2174274 2007272 1908790 1994480 1875419 1881899 1893223 1667582
23963A667582j58002j53710r4227K4685J00914R2068K73142J09877k24335k25308
$$ 1667582 1509580 1355870 1261643 1286328 1387242 1479310 1752452 1862329 1637994 1412686
23953A412686J0127O0721q4761j45254k4898J54974K63897l6423j80064p3367
$$ 1412686 1422813 1483534 1398773 1253519 1228621 1383595 1647492 1611069 1431005 1357638
23943A357638O2857J98755j31172o6533r3861m2876J31257j28660k18547m0829
$$ 1357638 1420495 1619250 1488078 1421545 1327684 1284808 1416065 1287405 1068858 1028029
23933A028029J09736K39569J32887l863j68970k12346k376j23960k58015m2789
$$ 1028029 1137765 1377334 1510221 1506358 1337388 1125042 1122666 998706 740691 697902
23923F97902M5203j53666J5043K89861K48680R145k37148j77372P0040K10925
$$ 697902 743105 589439 604482 894343 1143023 1152168 915020 737648 807688 1018613
23913A018613j6046j67092K45893J84877M3433k1670j92525j48259m9046O0193
$$ 1018613 1002567 835475 1081368 1266245 1309678 1288008 1095483 947224 898178 958371
23903I58371J65895r6100O5464K91585O3168N861j0745k08043k80901j17450j14483
$$ 958371 1124266 1028166 1093630 1385215 1448383 1454244 1443499 1235456 954555 837105 722622
23892G22622j36060r1060K33871L14302L5606j3951k43719j21521P60k41478J66453
$$ 722622 586562 495502 729373 1043675 1079281 1065330 821611 700090 700850 459372 625825
23881F25825P1555r2195o7767L95606j01552j73034J01639K06779k23633O3222
$$ 625825 697380 605185 537418 933024 831472 658438 760077 966856 743223 806445
23871H06445k6395l6981J7576Q1650J21012j1887q4338P205n6588p8614m5120
$$ 806445 780050 743069 760645 842295 963307 951420 867082 874287 817699 739085 693965
23860F93965j12732q7764M2524m0085l0888l5448O7381J53465J67172j22052j82496
$$ 693965 581233 493469 535993 495908 465020 429572 496953 650418 817590 695538 513042
23849E13042J64310l0208P6069j3243k88307l5924J36279J54794m2813Q8924k01222
$$ 513042 677352 647144 723213 709970 421663 385739 522018 676812 633999 722923 521701
23838E21701j01963P3560m3434J16609K47783l4927j99208m1226p9885J15526
$$ 521701 419738 493298 449864 566473 814256 779329 580121 538895 459010 574536
23828E74536N1234r3730K01866P4832m1738k02887q5914r3678M2175J85769J33172
$$ 574536 625770 532040 733906 808738 767000 564113 478199 384521 426696 612465 745637
23817G45637K9595j62428k71328J4908P1877n6277J42518K45725J07732k1482
$$ 745637 775232 612804 341476 356384 428261 371984 514502 760227 867959 846477
23807H46477P3058J31031K5082R6172J69713J13395L959R7249N3390N4544p001
$$ 846477 919535 1050566 1075648 1171820 1341533 1454928 1458887 1556136 1609526 1664070 1657069
23796A657069q9259k04914j77615l75924k43052k15231j22392O4140J16087J77678
$$ 1657069 1567810 1362896 1185281 809357 566305 351074 228682 292822 408909 586587
23786E86587L8121n1591p2370k19199j33828L4510K1623l4521n4366L5223L45706
$$ 586587 624708 573117 500747 281548 147720 182230 203853 169332 114966 150189 495895
23775D95895l6061k04772J23202j82932N217n1528L9543l0280r8486n4334K88627
$$ 495895 459834 255062 378264 195332 200549 149021 188564 158284 59798 5464 294091
23764B94091K41606K89970Q8202j67213L0992p1730k38136k28143J58808J29880
$$ 294091 535697 825667 913869 746656 777648 705918 467782 239639 398447 528327
23754E28327j07626Q927J15283j48371j44386q5874L3262K9910Q0214J02102P2387
$$ 528327 420701 429628 544911 396540 252154 166280 199542 229452 309666 411768 484155
23743D84155J01489M7862J3408J22378J87812j82713k73024K2974j18048j3490
$$ 484155 585644 633506 646914 769292 957104 774391 501367 524341 406293 392803
23733C92803K9984K23141J9887k59102J20709R6289J85419k400m8925K5970p421
$$ 392803 422787 645928 665815 406713 527422 623711 809130 806730 757805 783775 776354
23722G76354o5472k37991j44710j09183J15659J59063l2435j39247N8644J5221
$$ 776354 710882 472891 328181 218998 334657 493720 461285 322038 380682 395903
23712C95903p4562J2998J93335N0257n4591j68823m36460k9792K5545J46250J72756
$$ 395903 321341 334339 527674 577931 523340 354517 -81943 -111735 -86190 60060 232816
23701B32816J64519J2039O512r2453j47071j85671j08820k24045O9886M02249
$$ 232816 397335 409374 415886 323433 176362 -9309 -118129 -342174 -272288 129961
23691A29961J76346l619j78669q1897J00995P8731j68404J07577K43473q2597
$$ 129961 306307 302688 124019 42122 143117 221848 53444 161021 404494 321897
23681C21897k32435q6468n6708q5157J32390P3142k2854J01907O0330K47638J97727
$$ 321897 89462 2994 -53714 -138871 -6481 66661 43807 145714 206044 453682 651409
23670F51409J21581j1216o5878J9599j33888j39337q0421k04713J74358L02683
$$ 651409 772990 761774 695896 715495 581607 442270 361849 157136 331494 634177
23660F34177J78301M1508m3697j40417l47162k32842m7945K3334l6052r9660L5989
$$ 634177 812478 853986 810289 669872 322710 89868 41923 65257 29205 -70455 -34466
23649c4466R0003p1785Q1373M1119J62775R1611k23748K03559p2889o982q7664
$$ -34466 55537 -16248 65125 106244 269019 360630 136882 340441 267552 260570 172906
23638A72906P3734Q193k54331k95897J67020K09234K20224J26417L4314K4664
$$ 172906 246640 254833 502 -295395 -128375 80859 301083 427500 461814 486478
23628D86478J49025p7461j47045k5173l27220j94515K83621o8708j15181J09916
$$ 486478 635503 558042 410997 385824 58604 -135911 147710 79002 -36179 73737
23618G3737r0501j08329K11711K13258M9739m8286k59166m9838K1234K2799j62207
$$ 73737 -16764 -125093 86618 299876 349615 301329 42163 -7675 13559 36358 -125849
23607a25849L60168K71541q1942l44105K1805n8417j15887N8788O8264n6538k20139
$$ -125849 234319 505860 423918 79813 101618 43201 -72686 -13898 54366 -2172 -222311
23596b22311j05184j51682m8937J04585R5033k2347K4123R9168J22107J31368
$$ -222311 -327495 -479177 -528114 -423529 -328496 -350843 -326720 -227552 -105445 25923
23586B5923J3573J20916L2535j15062J87528m9148j27323q397m6054J29485J56214
$$ 25923 39496 160412 192947 77885 265413 216265 88942 80545 34491 163976 320190
23575C20190j52380n2114l7485j82043j37150J38527J27274J41770P8627j37690
$$ 320190 167810 115696 78211 -103832 -240982 -102455 24819 166589 245216 107526
23565A07526J32363j28279O1327K14840j13698j38773J79514J321j08742Q7045
$$ 107526 239889 111610 172937 387777 274079 135306 314820 316141 207399 294444
23555B94444Q950J38939M9492j71554r2735k13864j02473J91986j3176j74155
$$ 294444 303394 442333 491825 320271 227536 13672 -88801 103185 90009 -84146
23545h4146R170M45J0935l3218J36621p4164N3892j36763j29810Q2721L20007
$$ -84146 -74976 -74531 -63596 -96814 39807 -34357 19535 -117228 -247038 -164317 155690
23534A55690O9373j68645P2896Q9004m8207O045j25629m27670J9696J47948J212
$$ 155690 225063 56418 129314 218318 170111 176156 50527 -377143 -357447 -209499 -208287
23523b08287J968o817K0963J16495J89405J17046j49812j82385K33323J36745
$$ -208287 -206319 -213136 -192173 -75678 113727 230773 80961 -101424 131899 268644
23513B68644L6976m2188R6083j46582j66099J56543J19989J38742N7582K3583
$$ 268644 305620 263432 359515 212933 46834 203377 323366 462108 519690 543273
23503E43273k66989j67053j13235J9413K80458M8224m155j70283j90439o0618
$$ 543273 276284 109231 -4004 15409 295867 344091 339936 169653 -20786 -81404
23493h1404J10424L87460k5779k32300Q897Q8820n5237J57568m8388k3007k1713
$$ -81404 29020 416480 390701 158401 167298 256118 200881 358449 310061 287054 265341
23482B65341J9795k33526k94418J37591l3522K7887J80006J73706O338J77726
$$ 265341 285136 51610 -242808 -105217 -138739 -110852 69154 242860 249198 426924
23472D26924m0196k5954j5484j93288j15613j9086j33131K22414K15204k67504
$$ 426924 386728 360774 345290 152002 36389 17303 -115828 106586 321790 54286
23462E4286R5778L35282k13921q7621k38189j70500j32231r7815J33231q2671
$$ 54286 150064 485346 271425 183804 -54385 -224885 -357116 -454931 -321700 -404371
23452d04371l0257L2838L48344M12102j60798k30831P3855j77238Q913R6121k3752
$$ -404371 -434628 -401790 -53446 358656 197858 -32973 40882 -136356 -127443 -31322 -55074
23441e5074m331k01375M1486K22865j9774m2148K8090q0590J56281J79512N6399
$$ -55074 -59405 -260780 -219294 3571 -16203 -58351 -30261 -110851 45430 224942 281341
23430B81341m8417J70339k16565k09597K71617n8893j23339j76876j56172R9501
$$ 281341 232924 403263 186698 -22899 248718 189825 66486 -110390 -266562 -167061
23420a67061N4801j71467j46451J77940J6950L9720k8429J68295K07197j92988
$$ -167061 -112260 -283727 -430178 -252238 -235288 -195568 -223997 -55702 151495 -41493
23410d1493l25055P7703L4822K30037N7948J17370J47728k9915l8409R5566M0138
$$ -41493 -366548 -288845 -254023 -23986 33962 151332 299060 269145 230736 326302 366440
23399C66440J71898J4245j40559q8481N5123n4185p8055J14071M2273j27973l8440
$$ 366440 538338 552583 412024 323543 378666 324481 246426 360497 402770 274797 236357
23388B36357k5543j93068j60158m6600J47072R8793P5391J32347J13903l41079
$$ 236357 210814 17746 -142412 -189012 -41940 56853 132244 264591 378494 37415
23378C7415k70400q9059J30240R7389k2136K9688o9142K21515O2320j09432q9039
$$ 37415 -232985 -322044 -191804 -94415 -116551 -86863 -156005 65510 127830 18398 -70641
23367g0641K28047j26524k10204K54669m6684j76371M823P8937n8607p0186J57671
$$ -70641 157406 30882 -179322 75347 28663 -147708 -142885 -63948 -122555 -192741 -35070
23356c5070M1656k35245J9397L4857j60892J78557K77654O5248q9677K25391p3334
$$ -35070 6586 -228659 -209262 -174405 -335297 -156740 120914 186162 96485 321876 248542
23345B48542j08588R0142J58815j10640j14573l43514k57681J71774J69520K56075
$$ 248542 139954 230096 388911 278271 163698 -179816 -437497 -265723 -96203 159872
23335A59872J30222j03399l20364k32982p1456J61150K06499n0041m0462j06839
$$ 159872 290094 186695 -133669 -366651 -438107 -276957 -70458 -120499 -160961 -267800
23325b67800r7123O6581K6759J07876J62657o5636L1992l02414N7932J05813J96835
$$ -267800 -364923 -298342 -271583 -163707 -1050 -66686 -34694 -337108 -279176 -173363 23472
23314B3472n753j20941J76850K72825l3778M066P5166J64711O6004r547l96006
$$ 23472 17719 -103222 73628 346453 312675 316741 391907 556618 622622 613075 217069
23303B17069l55655j57099K21654M49393J79155q9431p2350j20193L16347R9482
$$ 217069 -138586 -295685 -74031 375362 554517 465086 392736 272543 588890 688372
23293F88372j44928j59985k58418o5075J73636O0990M9934j85907j26073p4684
$$ 688372 543444 383459 125041 59966 233602 294592 344526 158619 32546 -42138
23283d2138j4116J63834P8984p759j86410l19299P1143q683p3628J19465K53365
$$ -42138 -56254 107580 186564 178805 -7605 -326904 -255761 -264444 -338072 -218607 34758
23272C4758J91364J39560j8121m8112J72864j85722l11612j95618M7059L368O5705
$$ 34758 226122 365682 347561 299449 472313 286591 -25021 -220639 -173580 -170212 -104507
23261a04507M6088R2909k65476j14134K05359L67362J72187j99621k15485L5026
$$ -104507 -58419 34490 -230986 -345120 -139761 227601 399788 200167 -15318 19708
23251A9708K04562R2685N3934k0003l45789j40818P3858j00385O0017J00536R095
$$ 19708 224270 316955 370889 350886 5097 -135721 -61863 -162248 -102231 -1695 7400
23240G400N2466q558L0784j84565o8968J39543O9372k3625J88960j00757l20932
$$ 7400 59866 51308 82092 -102473 -171441 -31898 37474 13849 202809 102052 -218880
23229b18880l02160K35335K82290J89241j51848p8866j645J9930q4288k3379j53228
$$ -218880 -521040 -285705 -3415 185826 33978 -44888 -46533 -26603 -110891 -134270 -287498
23218b87498j5605J61815O8494o7149m49J70058q4798k60928K2643J63428K6835
$$ -287498 -303103 -141288 -72794 -139943 -140392 29666 -55132 -316060 -293417 -129989 -103154
23207a03154n1330j21031Q1747o1605K3529M3368o0905j77122p5167J74269J68190
$$ -103154 -154484 -275515 -193768 -255373 -231844 -188476 -249381 -426503 -501670 -327401 -159211
23196a59211L25642J98841j8198k80024n6897l33789j04150J92071J51437o3008
$$ -159211 166431 365272 347074 67050 10153 -323636 -427786 -235715 -84278 -147286
23186a47286j32020J94745K19392k01803J60640j865j62040l563J5859j65600
$$ -147286 -279306 -84561 134831 -66972 93668 91803 -70237 -73800 -57941 -223541
23176b23541O6072p7328J29805L05273n9574N705m7550q2938r7572K2460K49017
$$ -223541 -157469 -234797 -104992 200281 140707 146412 98862 15924 -81648 -59188 189829
23165A89829J12149L2538l5531N4032k64403N4615L953j17842k34370j20155N9316
$$ 189829 301978 334516 298985 353017 88614 143229 147182 29340 -205030 -325185 -265869
23154b65869K35825M4504j86983j03727K03104K12698K88963J87797l46766j57221
$$ -265869 -30044 14460 -172523 -276250 -73146 139552 428515 616312 269546 112325
23144A12325J12148R3696J17790j23824j71499J04655J43M9158m7716m0197N9465
$$ 112325 224473 318169 435959 312135 140636 245291 245434 294592 246876 206679 266144
23133B66144m4514l54408j97174N1031o8764k7551J01189J14484K00076n4746
$$ 266144 221630 -132778 -329952 -278921 -347685 -375236 -274047 -159563 40513 -14233
23123a4233l1589J8423J2776n7476j6208j35890m9864O8564Q1200K3300j1664
$$ -14233 -45822 -27399 -14623 -72099 -88307 -224197 -274061 -205497 -124297 -100997 -112661
23112a12661P8214J30952K0947n473Q736Q3327j5561k47528Q7K76887n4563l1931
$$ -112661 -34447 96505 117452 111979 120715 204042 188481 -59047 -58960 217927 163364 131433
23100A31433J1087l04786r8288M7315j44837l81286l9618M9018L23345K66614
$$ 131433 142520 -162266 -260554 -213239 -358076 -739362 -778980 -729962 -406617 -140003
23090a40003l1681k76808K43956J10584K0151k64816p2133J31985K95574L50582
$$ -140003 -171684 -448492 -204536 -93952 -73801 -338617 -410750 -278765 16809 367391
23080C67391O3766k11156j86882j12404j5461k4986J14261P5664o8477r4675j40730
$$ 367391 431157 220001 33119 -79285 -94746 -119732 -5471 70193 1716 -92959 -233689
23069b33689K18408L51314K05903J42227M2899l20468k59043p8160p186Q8643
$$ -233689 -15281 336033 541936 684163 727062 406594 147551 69391 62205 150848
23059A50848K42594k84615j32461j22338l47933j36778L347J88592R6020M8189
$$ 150848 393442 108827 -23634 -145972 -493905 -630683 -627336 -438744 -342724 -294535
23049b94535k0161k3213J54015K57970O6675K18261R087l18898l9348P6838P7299
$$ -294535 -314696 -337909 -183894 74076 140751 359012 368099 49201 9853 86691 163990
23038A63990j14427j3655J25304J60392j17371Q406K23698o8513L1053J2784j90543
$$ 163990 49563 35908 161212 321604 204233 212639 436337 367824 398877 411661 221118
23027B21118k31439J79122R7296j2829l9029m3615j36180M2979R4063J20432q7568
$$ 221118 -10321 168801 266097 253268 214239 170624 34444 77423 171486 291918 204350
23016B04350n1186Q4733j35909j94229j44895J33372J99538O4565j5593j29742
$$ 204350 153164 237897 101988 -92241 -237136 -103764 95774 160339 144746 15004
23006A5004j798m9623O6922K3133K15197R1708j15589M4496L0956j22507p2622
$$ 15004 13206 -36417 30505 53638 268835 360543 244954 289450 320406 197899 125277
22995A25277J70614p4446o200K60516n5710m02131J04758K50992j03487j96362
$$ 125277 295891 221445 215245 475761 420051 17920 122678 373670 270183 73821
22985G3821j25154q7920M7193J20764J00582j34754l00378m4683M4390R8850J23479
$$ 73821 -51333 -139253 -92060 28704 129286 -5468 -305846 -350529 -306139 -207289 -83810
22974h3810K21372k3810k57211j00334L6931j77204J34034J92607N6373M9323
$$ -83810 137562 113752 -143459 -243793 -206862 -384066 -250032 -57425 -1052 48271
22964D8271p8816j08168L2710L9312j11428R7263J16302n3657k29973R8656j79816
$$ 48271 -30545 -138713 -106003 -66691 -178119 -80856 35446 -18211 -248184 -149528 -329344
22953c29344l79159J51333M4062Q2238j8721O7885l6883K25688J24956j47705
$$ -329344 -708503 -557170 -513108 -430870 -449591 -381706 -418589 -192901 -67945 -215650
22943b15650M3221R8734J86365k7456k61527O979j00198j69739Q5423K20044R6685
$$ -215650 -172429 -73695 112670 85214 -176313 -169334 -269532 -439271 -353848 -133804 -37119
22932c7119J20317J00842J21055p1269K2755q7677k21820N6881J8784L46769j2514
$$ -37119 83198 184040 305095 233826 256581 168904 -52916 3965 22749 369518 357004
22921C57004j64468j28345P9301o3759j11322J17285K65024N3053j16249j61853
$$ 357004 192536 64191 143492 79733 -31589 85696 350720 403773 287524 125671
22911A25671j03744m8662j57740j34275k5800K95236J85181p4574k51760m3972
$$ 125671 21927 -26735 -184475 -318750 -344550 -49314 135867 61293 -190467 -234439
22901b34439K3736j55559M5660Q0902J57j77729j31973R3428L15712K18519j46265
$$ -234439 -210703 -366262 -320602 -239700 -239543 -417272 -549245 -455817 -140105 78414 -67851
22890f7851j55534j4472J95763J93320N9168K6266k9609P815j62265j34604o884
$$ -67851 -223385 -237857 -42094 151226 210394 236660 207051 214866 52601 -82003 -88887
22879h8887J6864O0157o69k29521J07049K71115j13415J4612j82608k64835J14739
$$ -88887 -72023 -11866 -12535 -242056 -135007 136108 22693 37305 -145303 -410138 -295399
22868b95399J14541j62167N115j1881K79825Q8764j36336J6959m7804O4779P0384
$$ -295399 -180858 -343025 -337910 -349791 -69966 18798 -117538 -100579 -148383 -83604 -13220
22857a3220o7412J07289l0846J96732O2135k53170j94758K9552K59736j742j48979
$$ -13220 -80632 26657 -4189 192543 254678 1508 -193250 -163698 96038 94296 -54683
22846e4683N185J93470K34931j40018o5034K3769K696j32529j83845l45908J26621
$$ -54683 -49498 143972 378903 238885 173851 197620 200316 67787 -116058 -461966 -335345
22835c35345R6002q1560l0715M8830J03844J2568m4909M5315L44769p2352k98291
$$ -335345 -239343 -320903 -351618 -302788 -198944 -186376 -231285 -185970 158799 86447 -211844
22824b11844j27236J23122O7438j22786l464j03231O3107L56584K27723J5485
$$ -211844 -339080 -215958 -148520 -271306 -274770 -378001 -314894 41690 269413 284898
22814B84898j05984M3718o9797J17848K21193L50423m5722k38649l4829j6371
$$ 284898 178914 222632 152835 270683 491876 842299 796577 557928 523099 506728
22804E06728j68147j40911j04791J31537l719k44014j42540Q966m8491J91520
$$ 506728 338581 197670 92879 224416 220697 -23317 -165857 -156891 -205382 -13862
22794a3862N1625J71441r2558j23981m2990N4657M271o0280q9165l2687J49783
$$ -13862 37763 209204 116646 -7335 -50325 4332 8603 -51677 -140842 -173529 -23746
22783b3746j51316j9290K83742m7087j18115j45573l1034J86133O9199M236J34292
$$ -23746 -175062 -194352 89390 42303 -75812 -221385 -252419 -66286 2913 7149 141441
22772A41441m437k39829O31J83295k6996j67831N3946L50541P0483P2612L314
$$ 141441 137004 -102825 -102194 81101 54105 -113726 -59780 290761 361244 433856 437170
22761D37170j89098o6714J17839K24336k12014j34388p9382j62298K57120K91763
$$ 437170 248072 181358 299197 523533 311519 177131 97749 -64549 192571 484334
22751D84334M5055l35519j40901J3701J69379Q2566n1281o2214l13J19198m4503
$$ 484334 529389 193870 52969 66670 236049 318615 267334 205120 204807 324005 279502
22740B79502n602k79788K01280K99381j04105o949l3016L4854R3040m3001j5558
$$ 279502 273900 -5888 195392 494773 390668 383719 350703 385557 478597 435596 420038
22729D20038m01857K4612K20060K4692L2401J6174r5959l74221J9992l9636q9668
$$ 420038 18181 42793 262853 287545 319946 336120 240161 -134060 -114068 -153704 -243372
22718b43372n6598J66148J52039O6260o9981J16219J43491p6240l03532l20667
$$ -243372 -299970 -133822 18217 84477 14496 130715 274206 197966 -105566 -426233
22708d26233p9564j33438K77800P6440J22911m0524j48847M1589L4674O7303J27301
$$ -426233 -505797 -639235 -361435 -284995 -162084 -202608 -351455 -309866 -275192 -207889 -80588
22697h0588J57080k2384K09309K25195m16924k85466j41780J77498M2478o1749
$$ -80588 76492 54108 263417 488612 71688 -213778 -355558 -178060 -135582 -197331
22687a97331J9857M9974M5295j34535j4371J4198L4790K586L2817K21960k0730
$$ -197331 -177474 -127500 -82205 -216740 -231111 -216913 -182123 -179537 -146720 75240 54510
22676E4510j05153Q0369P6062k98246j36789q7209J46647n8160q3734p4392l2087
$$ 54510 -50643 29726 105788 -192458 -329247 -416456 -269809 -327969 -411703 -486095 -518182
22665e18182L2807K5808l1887J03524K81337J46194N3189j57306j8620j84149
$$ -518182 -485375 -459567 -491454 -387930 -106593 39601 92790 -64516 -83136 -267285
22655b67285K9332J53250j53203j55753M4314K81456o7523o1997K8941P0511K22867
$$ -267285 -237953 -84703 -237906 -393659 -349345 -67889 -135412 -197409 -168468 -97957 124910
22644A24910k15293m2407M5514k84989j60288J54512Q5998K26137j15025P7000
$$ 124910 -90383 -132790 -87276 -372265 -532553 -378041 -292043 -65906 -180931 -103931
22634a03931J18912j25567R0541K1888j66103j41421j80447J46273J22396R2527
$$ -103931 14981 -110586 -20045 1843 -164260 -305681 -486128 -339855 -217459 -124932
22624a24932R9339j09518p651o9193M8320K02137M0243j69382j75380N9667n6928
$$ -124932 -25593 -135111 -142762 -211955 -163635 38502 78745 -90637 -266017 -206350 -263278
22613b63278r2505J82196j835k57149J28398K4642j68810L5693L78298J29917
$$ -263278 -355783 -173587 -175422 -432571 -304173 -279531 -448341 -412648 -34350 95567
22603I5567j64742j91763m1933J8143r9234M044J30224Q0164O4382L1693L36782
$$ 95567 -69175 -260938 -302871 -284728 -383962 -379918 -249694 -169530 -105148 -73455 263327
22592B63327J7537k10399j52987Q9199K54451k99965j66429J20742O5265j0722
$$ 263327 280864 70465 -82522 6677 261128 -38837 -205266 -84524 -19259 -29981
22582b9981j45531K477R1140j42494j15024K0423J12095j38210Q2584J42131r407
$$ -29981 -175512 -173035 -81895 -224389 -339413 -318990 -206895 -345105 -262521 -120390 -129797
22571a29797j41161L44858j28064p5174l4067K01137P8993N3350j48856K4764
$$ -129797 -270958 73900 -54164 -129338 -163405 37732 116725 170075 21219 45983
22561D5983j3183o2125J87083J21895r3447k94309k12886J15803K65156Q7896
$$ 45983 32800 -29325 157758 279653 186206 -108103 -320989 -205186 59970 147866
22551A47866K3776j4469N1036J18484N4486k04686j15058j28343j25021M8954
$$ 147866 171642 157173 208209 326693 381179 176493 61435 -66908 -191929 -142975
22541a42975Q9607m4522K56205K48378j1830j82148k65149k53859k33826o2990
$$ -142975 -53368 -97890 158315 406693 394863 212715 -52434 -306293 -540119 -603109
22531f03109K3592j78410K75787L95993K34410l7438k50424k32058p4214k0311
$$ -603109 -579517 -757927 -482140 -86147 148263 110825 -139599 -371657 -445871 -466182
22521d66182l2165J35301k7124Q2148J20844J05866o3164J66100p9558n7504P2966
$$ -466182 -498347 -363046 -390170 -308022 -187178 -81312 -144476 21624 -57934 -115438 -42472
22510d2472l54862j50760K56336J14967J02209m5971q4019J24761J11994k5373
$$ -42472 -397334 -548094 -291758 -176791 -74582 -120553 -204572 -79811 32183 6810
22500F810j05674O4100k05k1949J68573M6036j92163L7798p8389J8902m5503P099
$$ 6810 -98864 -34764 -34969 -56918 111655 157691 -34472 3326 -75063 -56161 -101664 -94565
22488i4565j03791J4177J93216m3435r655m6599M465J09217k56862l61101k08635
$$ -94565 -198356 -184179 9037 -34398 -44053 -90652 -86187 23030 -233832 -594933 -803568
22477h03568K12647J54515R9776J78895J15549J67807Q7239k6249J02136O8724
$$ -803568 -590921 -436406 -336630 -157735 -42186 125621 212860 186611 288747 357471
22467C57471o7996j49266r5277K0315Q6224m9259J2847j27000o7546j77129J22512
$$ 357471 289475 140209 44932 65247 151471 102212 115059 -11941 -79487 -256616 -134104
22456a34104K76991o5876q7240l777j81937q4791K31461J8968p6240K57922K53612
$$ -134104 142887 77011 -10229 -14006 -195943 -280734 -49273 -30305 -106545 151377 404989
22445D04989k47317k54902q9375Q76M4080j48416J27400K57781j916k88236m00017
$$ 404989 157672 -97230 -186605 -185729 -141649 -290065 -162665 95116 93200 -195036 -595053
22434e95053j26611o7484J76941K27304p6556O0055K11541J20101m1857j81031
$$ -595053 -721664 -789148 -612207 -384903 -461459 -401404 -189863 -69762 -111619 -292650
22424b92650O7132L28897J32639K96509m7402k21469j40254j90711j89149j6931
$$ -292650 -225518 103379 236018 532527 485125 263656 123402 -67309 -256458 -273389
22414b73389r6343o7794J20250j3993k2439j18448K11058M2078J26624l1191L6094
$$ -273389 -369732 -437526 -317276 -331269 -353708 -472156 -261098 -219020 -92396 -123587 -87493
22403h7493J63860J19493k07025k43288k53958m8177K56262p6905K05990j46459
$$ -87493 76367 195860 -11165 -254453 -508411 -556588 -300326 -377231 -171241 -317700
22393c17700K0332L23143R9076j90285j24989O9027J74993J92785j47689j72595
$$ -317700 -297368 25775 124851 -65434 -190423 -121396 53597 246382 98693 -73902
22383g3902r7540l6136l79M0493l20971l3214J58612K73562K54084j20550q6525
$$ -73902 -171442 -207578 -207957 -167464 -488435 -521649 -363037 -89475 164609 44059 -42466
22372d2466L04516J23799K8253n514k13157j56786J52687J1604j5739j04971j06407
$$ -42466 262050 385849 414102 408588 195431 38645 191332 202936 187197 82226 -24181
22361b4181q1821l9714n3389j777J22299J79283k06355L3715L48785M3030k61327
$$ -24181 -106002 -145716 -199105 -200882 -78583 100700 -105655 -71940 276845 319875 58548
22350E8548j09363k3091P0843q0936Q6911j31373r979K00626J91408m7769n844
$$ 58548 -50815 -73906 -3063 -83999 2912 -128461 -138440 62186 253594 205825 199981
22339A99981J89227k93207k46849L8852Q3814k0081q5251M8515j75366p1925J25586
$$ 199981 389208 96001 -150848 -111996 -28182 -48263 -133514 -84999 -260365 -332290 -206704
22328b06704Q6673J61981k45522o7664k4949k43742j3733n2468r388K84056J98243
$$ -206704 -120031 41950 -203572 -271236 -296185 -539927 -553660 -606128 -615516 -331460 -133217
22317a33217J4324j64954j2578J28278M3293M05812J18287o8371k63927j37177
$$ -133217 -118893 -283847 -296425 -168147 -124854 280958 399245 330874 66947 -70230
22307g0230J07869l0478j82091J2326R5049J39193K009l870o3676p5027l5610
$$ -70230 37639 7161 -174930 -162604 -67555 71638 73647 69777 6101 -68926 -104536
22296a04536K80145J66420r6229j36508r766j87573J8809J00361j92725k76807
$$ -104536 175609 342029 245800 109292 99526 -88047 -69238 31123 -161602 -438409
22286d38409j83303K98130M74630N8265J29195K45673J84456k04544j63892j45252
$$ -438409 -621712 -323582 151048 209313 338508 584181 768637 564093 400201 254949
22276B54949j67518j12180j30738j76455J54649j1491l8629j33543J29039P7074
$$ 254949 87431 -24749 -155487 -331942 -177293 -188784 -227413 -360956 -231917 -154843
22266a54843m5410j50697L00648j11936j32885Q5573N7901J90205r2135J37087
$$ -154843 -200253 -350950 -50302 -162238 -295123 -209550 -151649 38556 -53579 83508
22256H3508L7844k07277j68625r3717J35931K720k08065O9258L84698L01983p5567
$$ 83508 121352 -85925 -254550 -348267 -212336 -209616 -417681 -348423 36275 338258 262691
22245B62691j85949P3926O2120o2432j82639m0527R3479r4908j19532j09299k09962
$$ 262691 76742 150668 212788 150356 -32283 -72810 20669 -74239 -193771 -303070 -513032
22234e13032j32860K4468J40119N916J38244J72519j15841k1960p6482q2489K19290
$$ -513032 -645892 -621424 -481305 -475389 -337145 -164626 -280467 -302427 -378909 -461398 -242108
22223b42108L45172m6885m9757j3755L9454j65338q8348P6468m5663M1519m687
$$ -242108 103064 56179 6422 -7333 32121 -133217 -221565 -145097 -190760 -149241 -153928
22212a53928K22232K28912j70069M2559n5490m84449P9074Q6076q448J39217J04914
$$ -153928 68304 297216 127147 169706 114216 -370233 -291159 -205083 -213531 -74314 30600
22201C0600j04698q9206Q5934K1891j20427N6644j464O6397j12053j10328j12033
$$ 30600 -74098 -163304 -77370 -55479 -175906 -119262 -120726 -54329 -166382 -276710 -388743
22190c88743k29848L53118K95500J6469k38468j29871m0122j93845J07721J77337
$$ -388743 -618591 -265473 30027 46496 -191972 -321843 -361965 -555810 -448089 -270752
22180b70752J97861k3261j55655J85545n315p8927n4635j39578K9736J42655j4314
$$ -270752 -72891 -96152 -251807 -66262 -71577 -150504 -205139 -344717 -314981 -172326 -186640
22169a86640j0194L5897L00342K63263j13306j85920O6109J26846R6903j80520
$$ -186640 -196834 -160937 139405 402668 289362 103442 169551 296397 393300 212780
22159B12780p1446j8621n6700m226p9276K4109K36210k61122L133j17615j76758
$$ 212780 141334 122713 66013 61787 -17489 6620 242830 -18292 -15159 -132774 -309532
22148c09532J16780J33624J25424P8054j53916k4046j73707N9001J11920O2023
$$ -309532 -192752 -59128 66296 144350 -9566 -33612 -207319 -148318 -36398 25625
22138B5625k8404K05984j62924n6498J20439K8255p7106n315q759k53526j15410
$$ 25625 -2779 203205 40281 -16217 104222 132477 55371 50056 41297 -212229 -327639
22127c27639j35434l1747j5611q077J18122J37602j23934q1984J59068J81464
$$ -327639 -463073 -494820 -510431 -518508 -400386 -262784 -386718 -468702 -309634 -128170
22117a28170M2337N9540r1776L829p5201k35277j98916K45126K34202m6842J07149
$$ -128170 -85833 -26293 -118069 -114240 -189441 -424718 -623634 -378508 -144306 -191148 -83999
22106h3999j8737k0787q7253j019j071M2732L38423j85426j9735l4480l49233
$$ -83999 -102736 -123523 -210776 -211795 -212866 -170134 168289 -17137 -36872 -71352 -420585
22095d20585j53726J34254J7997J4940Q0520J73462M5949k24404L6102J57121
$$ -420585 -574311 -440057 -422060 -407120 -326600 -153138 -107189 -331593 -295491 -138370
22085a38370j03965j44573J42749p0701M6282J60469L28081O610j7325J59428
$$ -138370 -242335 -386908 -244159 -314860 -268578 -108109 219972 226582 209257 368685
22075C68685K3644k73211k14152K63265m8161k28619J59711O8924l49295l68831
$$ 368685 392329 119118 -95034 168231 120070 -108549 51162 120086 -229209 -598040
22065e98040K37607M0620j39492j07841J4384M16403L13318j64894o1837j02462
$$ -598040 -360433 -319813 -459305 -567146 -552762 -136359 176959 12065 -49772 -152234
22055a52234l1369L3578K1838K03090K73644R5588k25381k39986R5371L4545n3889
$$ -152234 -183603 -150025 -128187 74903 348547 444135 218754 -21232 74139 108684 54795
22044E4795o6213P7085K85178j13825k48823m4042O932J16515J01636P637M2969
$$ 54795 -11418 65667 350845 237020 -11803 -55845 -48913 67602 169238 176875 219844
22033B19844K15430m6832p7822r1538j0975K56112L538k67989m7219j383K3506
$$ 219844 435274 388442 310620 219082 208107 464219 467757 199768 152549 151166 174672
22022A74672j88667j00225N9201Q8012l1266m1154n1941Q7230l3378k0586j34727
$$ 174672 -13995 -114220 -55019 32993 1727 -39427 -91368 -4138 -37516 -58102 -192829
22011a92829k75073O584q281n2072J13683j29292J70552P6539k5103J48668m4170
$$ -192829 -467902 -461318 -469599 -521671 -407988 -537280 -366728 -290189 -315292 -166624 -210794
22000b10794K88118K77029M1938j23399k92505r1544j07982J33986Q6193k31746
$$ -210794 77324 354353 396291 272892 -19613 -111157 -219139 -85153 1040 -230706
21990b30706N0625K13567n9389j65962j84105k09602O1499K48109K99620J24902
$$ -230706 -180081 33486 -25903 -191865 -375970 -585572 -524073 -275964 23656 148558
21980A48558j09880k19382J40301J92911j28233k49797K96768K19728N4432k10810
$$ 148558 38678 -180704 -40403 152508 24275 -225522 71246 290974 345406 134596
21970A34596j14887L84425J65415r9041j14457k65243k74327n5021k3640Q8246
$$ 134596 19709 404134 569549 470508 356051 90808 -183519 -238540 -262180 -173934
21960a73934m4147n6457k12193K25425L03358K7563j1762j07154l08327r1079
$$ -173934 -218081 -274538 -486731 -261306 42052 69615 57853 -49301 -357628 -448707
21950d48707J43694j45672P4843K51534Q004Q7133o735j3236j811J2115M7914
$$ -448707 -305013 -450685 -375842 -124308 -116304 -29171 -35906 -49142 -50953 -38838 9076
21939I076L6665O5964L0708J09781r8057p4554k02286o1521j03680j29336O2077
$$ 9076 45741 111705 142413 252194 154137 79583 -122703 -184224 -287904 -417240 -355163
21928c55163J28306R0043M9828L27401j43686Q4229m2373J57494n07j69566j72585
$$ -355163 -226857 -136814 -86986 240415 96729 180958 138585 296079 295572 126006 -46579
21917d6579j25881J16304N8859r8224N739j23577l64833J14960K67834M32705
$$ -46579 -172460 -56156 2703 -95521 -89782 -213359 -578192 -463232 -195398 237307
21907B37307n7368n8428j26439p0307J62885N1683K34172P9399q790M17j58509
$$ 237307 179939 121511 -4928 -75235 87650 139333 373505 452904 444114 444531 286022
21896B86022l4060j9262l07182l26162J70073J03901K80907K8089j06116j63252
$$ 286022 251962 232700 -74482 -400644 -230571 -126670 154237 182326 76210 -87042
21886h7042k37794n4947Q7722L4241O3016k5083p3831j20831n974L44196k40345
$$ -87042 -324836 -379783 -292061 -257820 -194804 -219887 -293718 -414549 -420523 -76327 -316672
21875c16672q0894L25213J48130j57806J11332K68386Q94Q9137J99508L2544l92493
$$ -316672 -397566 -72353 75777 -82029 29303 297689 298583 387720 587228 619772 227279
21864B27279j78609P2779j58634j22151L6373j11149O9519L56964K01642j49164
$$ 227279 48670 121449 -37185 -159336 -122963 -234112 -164593 192371 394013 244849
21854B44849j06082N8909j5127j70277q8738J6297j6993J49623l5335J87108J56214
$$ 244849 138767 197676 182549 12272 -76466 -60169 -77162 72461 37126 224234 380448
21843C80448n1399j39126K0826n2061k23127j99753m6454J22190K52167K63568
$$ 380448 329049 189923 210749 158688 -64439 -264192 -310646 -188456 63711 327279
21833C27279K0708o4134o7348j99272j63402j22636j40917K12702J2609m0841
$$ 327279 347987 283853 216505 17233 -146169 -268805 -409722 -197020 -184411 -225252
21823b25252n6182N3545j55961J99600J66622k2370q6891R5428K21492J80300
$$ -225252 -281434 -227889 -383850 -184250 -17628 -39998 -126889 -31461 190031 370331
21813C70331j66093l03312j03479J48241J11420Q7023J29897J55392k55031j53306
$$ 370331 204238 -99074 -202553 -54312 57108 144131 274028 429420 174389 21083
21803B1083j52974J05619J06249J93118K00101n7600k9152l3283k5620j12101
$$ 21083 -131891 -26272 79977 273095 473196 415596 386444 353161 327541 215440
21793B15440j97559p6687J55808k38979l79773Q4947R9577K49914j85127l633
$$ 215440 17881 -58806 97002 -141977 -521750 -436803 -337226 -87312 -272439 -276072
21783b76072K8496j13924L5930K81535N6073j6059p495j70285k30523J14046j24540
$$ -276072 -247576 -361500 -325570 -44035 12038 -4021 -11516 -181801 -412324 -298278 -422818
21772d22818Q3247J31424j3215Q0226J90248N6890j592o8991L2310n8717k47238
$$ -422818 -339571 -208147 -221362 -141136 49112 106002 104410 35419 67729 9012 -238226
21761b38226L3907Q4256N739j55825m5457m5137k0621N1737p7410J00056P3419
$$ -238226 -204319 -120063 -114324 -270149 -315606 -360743 -381364 -329627 -407037 -306981 -233562
21750b33562k444j17960J4193K50788O0101N6904K07642P1682l0222k06923r9727
$$ -233562 -236006 -353966 -339773 -88985 -28884 28020 235662 307344 277122 70199 -29528
21739b9528J068l6166j08900O5172n6898m2438P8043R6031K01830r5225j82027
$$ -29528 -28460 -64626 -173526 -108354 -165252 -207690 -129647 -33616 168214 72989 -109038
21728a09038m8786j79294k20195P5077J17858l2006p9440k04251R8550J34061
$$ -109038 -157824 -337118 -557313 -482236 -364378 -396384 -475824 -680075 -581525 -447464
21718d47464K35385R0257q7007q0226M9579J2819j600K19898m9198j88520k310
$$ -447464 -212079 -121822 -208829 -289055 -239476 -226657 -228257 -8359 -57557 -246077 -248387
21707b48387J01262M6081k16640k41090J62703O9935J99786j4416k69401K6004
$$ -248387 -147125 -101044 -317684 -558774 -396071 -326136 -126350 -140766 -410167 -384163
21697c84163J69607K107m2416j02652K24117N6534j84059M3673O3132j09479k11624
$$ -384163 -214556 -212449 -254865 -357517 -133400 -76866 -260925 -217252 -154120 -263599 -475223
21686d75223j53766o346J27442J53763O2063j2552l967n7232j17356k10438j71414
$$ -475223 -628989 -635335 -507893 -354130 -292067 -304619 -308586 -365818 -483174 -693612 -865026
21675h65026L6163N5704L15111K87198j44964l6992N0423q9451R3860Q1043p833
$$ -865026 -828863 -773159 -458048 -170850 -315814 -352806 -302383 -391834 -297974 -216931 -224764
21664b24764K52619L3848r1428p3301j10266l9644J11510K27468k7494P5979j0919
$$ -224764 27855 61703 -29725 -103026 -213292 -252936 -141426 86042 58548 134527 123608
21653A23608j78140O075n7770j46633K49163n9515k66967J03300L8587J72809
$$ 123608 -54532 -48457 -106227 -252860 -3697 -63212 -330179 -226879 -188292 -15483
21643a5483o7969j5955M6581R200p1008M0648J91558J26292K2744p4922J26718
$$ -15483 -83452 -99407 -52826 -43626 -114634 -73986 117572 243864 266608 191686 318404
21632C18404m2789j5537K0135Q4215j33028l0736l48413k02381o1424J77666O9170
$$ 318404 275615 260078 280213 364428 231400 200664 -147749 -350130 -411554 -233888 -164718
21621a64718R8528l2030l8798J44936L9535j86335j35061j10122J8406q3200K42479
$$ -164718 -66190 -98220 -137018 7918 47453 -138882 -273943 -384065 -365659 -448859 -206380
21610b06380J66361Q3726p4856l6263J9553j29380K14121k41029k53591l7495
$$ -206380 -40019 43707 -31149 -67412 -47859 -177239 36882 -204147 -457738 -495233
21600d95233J65242J04082q1870j64150Q7253K81705O444L1226J15044j57381
$$ -495233 -329991 -225909 -307779 -471929 -384676 -102971 -96527 -65301 49743 -107638
21590a07638j99721N7595l784K50603J43639l2870j54695k26613O4683K63566
$$ -107638 -307359 -249764 -253548 -2945 140694 107824 -46871 -273484 -208801 54765
21580E4765l2802k64423J95575J32395L6268k56885k66535j32836L6137N3052
$$ 54765 21963 -242460 -46885 85510 121778 -135107 -401642 -534478 -498341 -445289
21570d45289L28842J75696j22414j70165k31693J25538K58574J4203l9108K54374
$$ -445289 -116447 59249 -63165 -233330 -465023 -339485 -80911 -66708 -105816 148558
21560A48558o2057j92114q5274J65675m2607R9078j38068j37690N7320J10821
$$ 148558 86501 -105613 -190887 -25212 -67819 31259 -106809 -244499 -187179 -76358
21550g6358j2059j89084j34668R2883J01826Q8208P2620J09417k15108j42601
$$ -76358 -88417 -277501 -412169 -319286 -217460 -129252 -56632 52785 -162323 -304924
21540c04924J50623K17564q0860k39861n6672J38293k3052n102j47280R6315L15742
$$ -304924 -154301 63263 -17597 -257458 -314130 -175837 -198889 -203991 -351271 -254956 60786
21529F0786J38547j0116j9132k17830M0300M5288k03113N3056K8189M3256j83529
$$ 60786 199333 189217 170085 -47745 -7445 37843 -165270 -112214 -84025 -40769 -224298
21518b24298o6534N1713j2469j5754R0501j28003J24359M4620N2073j18657K4010
$$ -224298 -290832 -239119 -251588 -267342 -176841 -304844 -180485 -135865 -83792 -202449 -178439
21507a78439Q4596j65103j55258J90728J02422O43n4854J9768j28603n7610J29505
$$ -178439 -93843 -258946 -414204 -223476 -121054 -120411 -175265 -155497 -284100 -341710 -212205
21496b12205p282p2730n2524k64936j20171m8122J35267L42180Q3505P9448J20049
$$ -212205 -219487 -292217 -344741 -609677 -729848 -777970 -642703 -300523 -217018 -137570 -17521
21485a7521P5277J24344j52835n9849l4407j8833k13805k06211n9321J66657J17517
$$ -17521 57756 182100 29265 -30584 -64991 -83824 -297629 -503840 -563161 -396504 -278987
21474b78987J12589k8076N271K537p8232j11043m5298J45635l3220J63328k9816
$$ -278987 -166398 -194474 -189203 -186666 -264898 -375941 -421239 -275604 -308824 -145496 -175312
21463a75312J79022J2878k54741l37987k01487J67747J70130K02363q3340k11448
$$ -175312 3710 16588 -238153 -576140 -777627 -609880 -439750 -237387 -320727 -532175
21453e32175m316O0654L21287K16252j70764k10282J2512J72879J39205j32861
$$ -532175 -536491 -475837 -154550 61702 -109062 -319344 -306832 -133953 5252 -127609
21443a27609K34512L7810p5765j26531P496j52537K06335l3249q2576P1828j69958
$$ -127609 106903 144713 68948 -57583 -50087 -202624 3711 -29538 -112114 -40286 -210244
21432b10244q3900J89006J24625P4839o2057j85163M7864j11984K8030r9012k07338
$$ -210244 -294144 -105138 19487 94326 32269 -152894 -105030 -217014 -188984 -287996 -495334
21421d95334j6991J03023J4844m4445o7201L04244J48469J37522j21708l53557
$$ -495334 -512325 -409302 -394458 -438903 -506104 -201860 -53391 84131 -37577 -391134
21411c91134l6663K6116M8709j17298j42947Q659M6398l028K11627J33907m3410
$$ -391134 -427797 -401681 -352972 -470270 -613217 -604558 -558160 -561188 -349561 -215654 -259064
21400b59064K9275r333N5788J7524k7651J72994J46823M4613o2879j23542j07395
$$ -259064 -229789 -239122 -183334 -165810 -193461 -20467 126356 170969 108090 -15452 -122847
21389a22847j34039M4898l9575L7400k0960J61272n5909j96074q8253J59498J05933
$$ -122847 -256886 -211988 -251563 -214163 -235123 -73851 -129760 -325834 -414087 -254589 -148656
21378a48656p3183J3703N4363j08342J27268q8697k12604k02834K6165J13680
$$ -148656 -221839 -208136 -153773 -262115 -134847 -223544 -436148 -638982 -612817 -499137
21368d99137J85884K25611l9586k35317O1813j22389j79541J57681R4229j39337
$$ -499137 -313253 -87642 -127228 -362545 -300732 -423121 -602662 -444981 -350752 -490089
21358d90089m8257J42740K77013l8897n3060k03616l7753L19082J88690L2919
$$ -490089 -538346 -395606 -118593 -157490 -210550 -414166 -451919 -132837 55853 88772
21348H8772j13129l3254K75752n1089J3540n4189n19625j87629N0267P0254K83048
$$ 88772 -24357 -57611 218141 167052 180592 126403 -393222 -580851 -530584 -460330 -177282
21337a77282q3988J00594l7512o5685P945n686R4485P0066j10428j90287O1053
$$ -177282 -261270 -160676 -198188 -263873 -255928 -261614 -167129 -97063 -207491 -397778 -336725
21326c36725j8967J4465O1093J29860l0929R7436J26359K48914j70315j79747
$$ -336725 -355692 -341227 -280134 -150274 -181203 -83767 42592 291506 121191 -58556
21316e8556Q5506J58834J20578r6711m10532j40119J48676J66856J50472j59483
$$ -58556 26950 185784 306362 209651 -200881 -341000 -192324 -25468 125004 -34479
21306c4479k13443r4728P9655m0870J90948J56038K8864p9734k24532k7007l27192
$$ -34479 -247922 -342650 -262995 -303865 -112917 43121 71985 -7749 -232281 -259288 -586480
21295e86480N3039J98307J04298J7983K38781k02454r1715J18932L5846J47161
$$ -586480 -533441 -335134 -230836 -212853 25928 -176526 -268241 -149309 -113463 33698
21285C3698k9946Q1623j99468k01897k8718r5694J20307P1030J48168N1015p3999
$$ 33698 3752 85375 -114093 -315990 -344708 -440402 -320095 -249065 -100897 -49882 -123881
21274a23881J35250L02059M6651p5362k94633l50109k09753J71663K09860J45472
$$ -123881 11369 313428 360079 284717 -9916 -360025 -569778 -398115 -188255 -42783
21264d2783Q3989j59411j21321j18434K2348P9189J27430J86764M6609J2811j00965
$$ -42783 41206 -118205 -239526 -357960 -335612 -256423 -128993 57771 104380 117191 16226
21253A6226K7821q1298L097K72422l5311j68018j9592M0044k67670j86465j02170
$$ 16226 44047 -37251 -34154 238268 202957 34939 15347 55391 -212279 -398744 -500914
21242e00914Q5609O8094j425j97876j28357K64520Q5446J13657P7586J51964K04047
$$ -500914 -415305 -347211 -348636 -546512 -674869 -410349 -324903 -211246 -133660 18304 222351
21231B22351J60140j90627l47520K6926J34341j16431k76860k12321n8336M3309
$$ 222351 382491 191864 -155656 -128730 5611 -110820 -387680 -600001 -658337 -615028
21221f15028N71010J90155n4282j27438J9162Q9863j14357L8106J64711j35918
$$ -615028 -44018 146137 91855 -35583 -16421 73442 -40915 -2809 161902 25984
21211B5984l77639J09500q1030P4538L73340J58066p0143k10494k00214o7478
$$ 25984 -351655 -242155 -323185 -248647 124693 282759 212616 2122 -198092 -265570
21201b65570l8621Q7135O7408Q925M0360J35175k67086R8211n8913j11893Q331
$$ -265570 -304191 -217056 -149648 -140723 -100363 34812 -232274 -134063 -192976 -304869 -296538
21190b96538j67495J2842J26325j52429J30272R9197j17720K0985L803q8939J64554
$$ -296538 -464033 -451191 -324866 -477295 -347023 -247826 -365546 -344561 -340758 -429697 -265143
21179b65143J12856J18236J81354j00797j32104M0342k18150J94230J58350Q5297
$$ -265143 -152287 -34051 147303 46506 -85598 -45256 -263406 -69176 89174 174471
21169A74471P0042r4748k59616Q196j8056N3851k30018l72352J34365J18382n1323
$$ 174471 244513 149765 -109851 -101655 -119711 -65860 -295878 -668230 -533865 -415483 -466806
21158d66806k13959J17106K22907K49803K20098O3832j48015K0302l63320j17549
$$ -466806 -680765 -563659 -340752 -90949 129149 192981 44966 65268 -298052 -415601
21148d15601m1248p2098K1584J17154J44355J34932K09257p448j23123o0914j31789
$$ -415601 -456849 -528947 -507363 -390209 -245854 -110922 98335 90887 -32236 -93150 -224939
21137b24939P7073L2009l7534p1191j25241K09970K36353J71551K18430l17648
$$ -224939 -147866 -115857 -153391 -224582 -349823 -139853 96500 268051 486481 168833
21127A68833k34032k38087j85596K21358J66481m7541l3965n485k1872k43604
$$ 168833 -65199 -303286 -488882 -267524 -101043 -148584 -182549 -188034 -209906 -453510
21117d53510o8668L72768Q7993k31318p7672j06536n8373L45128K49464J93612
$$ -453510 -522178 -149410 -61417 -292735 -370407 -476943 -535316 -190188 59276 252888
21107B52888m8119k72037m49544r0786N11980L77127l04997k47877j07580k45238
$$ 252888 204769 -67268 -516812 -607598 -95618 281509 -23488 -271365 -378945 -624183
21097f24183j79146J51006J91322j52o7611j03405k966K72664K91660R4718J93413
$$ -624183 -803329 -652323 -461001 -461153 -528764 -632169 -635135 -362471 -70811 23907 217320
21086B17320O3958j73607o1888m73229l44851J66153L34392J31580o536L0870
$$ 217320 281278 107671 45783 -427446 -772297 -606144 -271752 -140172 -146708 -115838
21076a15838m5807k96511J14668J50337O4013M888k58978n2451l2863K65645L98514
$$ -115838 -161645 -458156 -343488 -193151 -129138 -124250 -383228 -435679 -468542 -202897 195617
$$ [...]
##END NTUPLES=NMR SPECTRUM
##END=
